##TITLE=Analysis number 326851
Compound Code cc 58601
Book Reference 505/31
Project Code adrs
Chemist Name robb
##JCAMPDX= 6.0         $$ Bruker NMR JCAMP-DX V2.0
##DATA TYPE= NMR SPECTRUM
##DATA CLASS= NTUPLES
##ORIGIN= Bruker BioSpin GmbH
##OWNER= nmr
$$ XWIN-NMR		Version 3.5
$$ Mon Feb 26 09:28:37 2007 GMT Standard Time (UT+0h)  MAYBRIDGE\nmr@NMR_250MHZ
##.OBSERVE FREQUENCY= 250.131544655141
##.OBSERVE NUCLEUS= ^1H
##.ACQUISITION MODE= SIMULTANEOUS (DQD)
##.ACQUISITION SCHEME= undefined
##.AVERAGES= 16
##.DIGITISER RES= 18
##SPECTROMETER/DATA SYSTEM= dpx250
##.PULSE SEQUENCE= zg30
##.SOLVENT NAME= DMSO
##.SHIFT REFERENCE= (INTERNAL, DMSO, 0, 16.522)
##AUDIT TRAIL= $$ (NUMBER, WHEN, WHO, WHERE, WHAT)
$$ ##TITLE= Audit trail, XWIN-NMR		Version 3.5
$$ ##JCAMPDX= 5.01
$$ ##ORIGIN= Bruker BioSpin GmbH
$$ ##OWNER= nmr
$$ C:\u/data/dgb/nmr/ADRS/1930/pdata/1/auditp.txt
$$ ##AUDIT TRAIL=  $$ (NUMBER, WHEN, WHO, WHERE, WHAT)
(   1,<2007-02-26 09:28:11.47 +000>,<MAYBRIDGE\nmr>,<NMR_250MHZ>,
      <created by zg, POWCHK disabled, PULCHK disabled
       configuration hash MD5:
       49 4B E0 1D 92 C2 6B 37 9F E6 65 BC 52 41 86 1D
       data hash MD5: 64K
       39 29 94 ED E2 69 08 E6 36 28 37 D9 F8 9A E0 85>)
(   2,<2007-02-26 09:28:25.28 +000>,<MAYBRIDGE\nmr>,<NMR_250MHZ>,
      <Start of raw data processing
       ef LB = 0.3 FT_mod = 6 PKNL = 1 SI = 32K 
       data hash MD5: 32K
       F9 EC 14 F0 3C 30 80 03 10 68 64 6A 5D 25 C5 C6>)
(   3,<2007-02-26 09:28:26.86 +000>,<MAYBRIDGE\nmr>,<NMR_250MHZ>,
      <apk 
       data hash MD5: 32K
       E7 66 6C 39 4F EE 73 33 D1 E3 E6 8E AB A1 66 84>)
(   4,<2007-02-26 09:28:27.56 +000>,<MAYBRIDGE\nmr>,<NMR_250MHZ>,
      <abs ABSG = 5 
       data hash MD5: 32K
       C8 EA 74 EF F6 EC F8 E7 2B 19 3A D3 7F 95 24 EE>)
$$ ##END=
$$ 
$$ hash MD5
$$ 3C 7E D1 C8 E8 DA 03 B7 3D B3 41 70 06 60 B9 03
##$RELAX= 
##$RELAX= 
##$RELAX= 
##$RELAX= 
##$RELAX= 
##$RELAX= 
##$RELAX= 
$$ Bruker specific parameters
$$ --------------------------
##$DU= <C:\u>
##$EXPNO= 1930
##$NAME= <ADRS>
##$PROCNO= 1
##$TYPE= <nmr>
##$USER= <dgb>
##$AMP= (0..31)
100 100 100 100 100 100 100 100 100 100 100 100 100 100 100 100 100 100 
100 100 100 100 100 100 100 100 100 100 100 100 100 100 
##$AQSEQ= 0
##$AQ_mod= 3
##$AUNM= <au_zg>
##$AUTOPOS= <31 >
##$BF1= 250.13
##$BF2= 250.13
##$BF3= 250.13
##$BF4= 250.13
##$BF5= 500.13
##$BF6= 500.13
##$BF7= 500.13
##$BF8= 500.13
##$BYTORDA= 1
##$CFDGTYP= 0
##$CFRGTYP= 5
##$CHEMSTR= <none>
##$CNST= (0..31)
1 1 145 1 1 1 1 1 1 1 1 1 1 1 1 1 1 1 1 1 1 1 1 1 1 1 1 1 1 1 1 1 
##$CPDPRG= <>
##$CPDPRG1= <>
##$CPDPRG2= <>
##$CPDPRG3= <>
##$CPDPRG4= <mlev>
##$CPDPRG5= <mlev>
##$CPDPRG6= <mlev>
##$CPDPRG7= <mlev>
##$CPDPRG8= <mlev>
##$CPDPRGB= <>
##$CPDPRGT= <>
##$D= (0..31)
0 1 0 0 0 0 0 0 0 0.06 0 0 0 0 0 0 0.0002 0 0 0 0 0 0 0 0 0 0 0 0 0 0 
0 
##$DATE= 1172482089
##$DBL= (0..7)
120 120 120 120 120 120 120 120 
##$DBP= (0..7)
150 150 150 150 150 150 150 150 
##$DBP07= 0
##$DBPNAM0= <>
##$DBPNAM1= <>
$$ [...]
##$SUBNAM6= <"">
##$SUBNAM7= <"">
##$SUBNAM8= <"">
##$SUBNAM9= <"">
##$SW= 20.6930455092707
##$SWIBOX= (0..15)
0 0 3 0 0 0 0 0 0 0 0 0 0 0 0 0 
##$SW_h= 5175.983436853
##$TD= 65536
##$TD0= 1
##$TE= 295.16
##$TE2= 300
##$TE3= 300
##$TEG= 300
##$TL= (0..7)
0 120 120 120 120 120 120 120 
##$TP= (0..7)
150 150 150 150 150 150 150 150 
##$TP07= 0
##$TPNAME0= <>
##$TPNAME1= <>
##$TPNAME2= <>
##$TPNAME3= <>
##$TPNAME4= <>
##$TPNAME5= <>
##$TPNAME6= <>
##$TPNAME7= <>
##$TPOAL= (0..7)
0.5 0.5 0.5 0.5 0.5 0.5 0.5 0.5 
##$TPOFFS= (0..7)
0 0 0 0 0 0 0 0 
##$TUNHIN= 0
##$TUNHOUT= 0
##$TUNXOUT= 0
##$USERA1= <user>
##$USERA2= <user>
##$USERA3= <user>
##$USERA4= <user>
##$USERA5= <user>
##$V9= 5
##$VALIST= <valist>
##$VCLIST= <CCCCCCCCCCCCCCC>
##$VD= 0
##$VDLIST= <DDDDDDDDDDDDDDD>
##$VPLIST= <PPPPPPPPPPPPPPP>
##$VTLIST= <TTTTTTTTTTTTTTT>
##$WBST= 1024
##$WBSW= 4
##$XGAIN= (0..3)
0 0 0 0 
##$XL= 0
##$YL= 0
##$YMAX_a= 287911
##$YMIN_a= -250913
##$ZGOPTNS= <>
##$ZL1= 120
##$ZL2= 120
##$ZL3= 120
##$ZL4= 120
##$ABSF1= 16.522
##$ABSF2= -4.171173
##$ABSG= 5
##$ABSL= 3
##$ALPHA= 0
##$AQORDER= 0
##$ASSFAC= 0
##$ASSFACI= 0
##$ASSFACX= 0
##$ASSWID= 0
##$AUNMP= <proc_1d>
##$AZFE= 0.1
##$AZFW= 0.1
##$BCFW= 0
##$BC_mod= 0
##$BYTORDP= 0
##$COROFFS= 0
##$CY= 12.5
##$DATMOD= 1
##$DC= 0
##$DFILT= <>
##$DTYPP= 0
##$F1P= 14.0000005364418
##$F2P= -0.99999901652339
##$FCOR= 0.5
##$FTSIZE= 32768
##$FT_mod= 6
##$GAMMA= 0
##$GB= 0
##$INTBC= 1
##$INTSCL= 1
##$ISEN= 128
##$LB= 0.3
##$LEV0= 0
##$LPBIN= 0
##$MAXI= 10000
##$MC2= 0
##$MEAN= 0
##$ME_mod= 0
##$MI= 0
##$NCOEF= 0
##$NC_proc= -3
##$NLEV= 6
##$NOISF1= 0
##$NOISF2= 0
##$NSP= 0
##$NTH_PI= 0
##$NZP= 0
##$OFFSET= 16.522
##$PC= 1
##$PHC0= 212.9444
##$PHC1= 13.5164
##$PH_mod= 1
##$PKNL= yes
##$PPARMOD= 0
##$PSCAL= 4
##$PSIGN= 0
##$REVERSE= no
##$SF= 250.13
##$SI= 32768
##$SIGF1= 0
##$SIGF2= 0
##$SINO= 400
##$SIOLD= 32768
##$SREGLST= <1H.DMSO>
##$SSB= 0
##$STSI= 32768
##$STSR= 0
##$SW_p= 5175.98343685301
##$SYMM= 0
##$S_DEV= 0
##$TDeff= 65536
##$TDoff= 0
##$TI= <Analysis number 999999
Compound Code 99
Book Reference 9
Project Code 9>
##$TILT= no
##$TM1= 0
##$TM2= 0
##$TOPLEV= 0
##$USERP1= <user>
##$USERP2= <user>
##$USERP3= <user>
##$USERP4= <user>
##$USERP5= <user>
##$WDW= 1
##$XDIM= 32768
##$YMAX_p= 306334564
##$YMIN_p= -129832
$$ End of Bruker specific parameters
$$ ---------------------------------
##NTUPLES= NMR SPECTRUM
##VAR_NAME=  FREQUENCY,     SPECTRUM/REAL,   SPECTRUM/IMAG
##SYMBOL=    X,             R,               I
##VAR_TYPE=  INDEPENDENT,   DEPENDENT,       DEPENDENT
##VAR_FORM=  AFFN,          ASDF,            ASDF
##VAR_DIM=   32768,         32768,           32768
##UNITS=     HZ,            ARBITRARY UNITS, ARBITRARY UNITS
##FACTOR=    0.157963299565203, 1,           1
##FIRST=     4132.6476996994, 0,             0
##LAST=      -1043.33573715361, 0,           0
##MIN=       -1043.33573715361, -129832,     0
##MAX=       4132.6476996994, 306334564,     0
$$ Real data points
##PAGE= N=1
##DATA TABLE= (X++(R..R)), XYDATA
$$ [...]
21186 39256 20386 -5361 -13807 -8445 -24382 -32213 22334 69296 73011 63472 34889 2648 -12807
21173 -12807 21865 32760 55565 66221 45064 16038 -1262 2237 24169 15408 1338 -2220
21161 -2220 14442 18329 -4658 1705 2481 -12147 -15678 -12408 -24236 -17878 8468 15695 28095
21148 28095 16576 4685 -155 159 16469 25327 32727 17555 -1792 12541 12796 18520 45496
21135 45496 23114 25307 52063 38375 46464 51681 40605 46117 41278 18362 -24653 -25848 -23537
21122 -23537 -28938 -19298 -18002 -24069 13023 22772 -8410 -2667 4701 39187 38256 933 -16909
21109 -16909 -31276 7284 66595 42120 34774 38047 3000 -1083 33942 32558 28286 37050 38699
21096 38699 31330 18745 -5228 -9386 25803 39986 40423 38220 20314 9389 13330 -1884 -3684
21083 -3684 36193 49665 44042 2015 -24304 -19424 -25666 -23494 527 -5634 5301 24260 18435
21070 18435 21128 49345 26918 10557 29496 44809 39062 45840 49945 56888 49592 58425 58055
21057 58055 57888 46996 34529 33852 58181 89412 109934 119574 125707 120183 134544 128773 156370
21044 156370 186680 194202 190782 187877 179946 191732 218337 199262 184009 163370 152062 160075
21032 160075 148289 130501 139500 164021 165666 140566 131804 164162 177973 150941 136347 149888
21020 149888 171577 172683 168786 172186 202931 201330 198400 204958 210895 221111 209931 191538 200472
21007 200472 230770 238398 220687 213202 208730 228235 235452 222921 204325 201956 220550 217644 191884
20994 191884 152926 131045 95570 61229 80990 85351 71639 74207 76647 84636 64717 52730
20982 52730 22118 19532 49519 58742 37386 7598 -7062 -680 38446 78829 88358 85030 62353
20969 62353 38268 58572 52707 31837 36968 22183 31689 55862 69850 57527 48202 48087 30830
20956 30830 -6502 -13862 7945 22956 26505 39102 48244 52974 34580 42754 67656 60056 45851
20943 45851 57368 75088 72823 73017 72472 56427 49970 58506 49945 56612 51588 26652 30470 30546
20929 30546 5920 29382 35144 12737 13800 21442 35380 71633 88048 74443 63851 57839
20917 57839 53241 59898 71113 61903 19533 24502 62974 108397 110723 51334 -8108 5727 8380
20904 8380 -2965 18164 5572 4057 6275 -16255 -18811 -21127 -17492 -17607 11157 35850 59634
20891 59634 67159 62905 56695 37241 35441 12582 -15550 -2672 24781 28914 28215 47872 32520
20878 32520 3488 -9439 21797 37329 49784 49432 63135 60430 13186 9136 43024 59001
20866 59001 60358 33097 42357 48064 -5325 -13038 6748 -12849 2112 17949 14365 32186 36426
20853 36426 30968 32509 52118 61771 61890 39580 5795 -29520 -19455 11322 -912 11141 23456
20840 23456 33244 54223 66214 40858 62999 77186 58809 51770 73218 65804 61712 81844
20828 81844 81109 92782 74136 46889 42121 46575 39525 41323 33126 28693 54215 65126 66195
20815 66195 68806 78208 89125 68898 50471 60913 40659 3516 9862 36912 29752 44756
20803 44756 66183 74631 67469 68967 74969 41438 13625 34849 56800 71247 34725 38939 41401
20790 41401 39463 56629 71573 100790 80421 79017 43168 -12418 -2736 6331 18434 30937
20778 30937 39734 47888 53200 70649 52568 67643 68028 59776 55092 59895 60852 64878 71259 72430
20764 72430 63306 40974 52531 53842 20781 22641 41638 50287 74130 81427 99995 101498 87143
20751 87143 54133 23526 30909 52259 27765 1327 13400 45104 36775 41532 35662 28060 38869
20738 38869 55026 62267 70361 44994 32937 47028 52606 45924 40451 42854 66281 84271 93785
20725 93785 76068 81369 83773 69122 66035 60628 82923 94412 92380 81383 83879 47321 17254
20712 17254 45181 79794 81318 70738 91424 101423 101318 112987 132383 124039 98164 122420 129269
20699 129269 117751 140458 174070 199304 186022 177904 150776 166824 195812 189917 172066 158602
20687 158602 156343 162016 169188 170943 157018 160604 151267 145382 128452 120727 141535 127213 122902
20674 122902 126657 104089 106480 148884 162374 136232 150489 170249 154624 162136 179032 192849
20662 192849 184973 162947 148003 194362 196340 207726 249188 247094 206204 195023 206771 231225
20650 231225 255709 259742 235237 192212 161897 165550 176291 166526 177491 192456 187225 210047
20638 210047 195318 165804 181010 197381 209854 241265 272748 250904 244619 248624 274516 266403
20626 266403 241858 242284 256248 271324 251496 233443 235254 255215 254706 257603 258228 265449 287937
20613 287937 313543 298241 286807 253190 233981 249401 281216 296498 296883 293088 295366 339193
20601 339193 353367 370509 377148 375282 391053 378620 355506 371022 372252 394114 406404 419362
20589 419362 407489 384603 397949 414612 433924 443772 441709 466159 471860 476038 500754 509004
20577 509004 504033 483675 475731 465641 457298 464181 458257 482675 513370 504855 483474 496202 523117
20564 523117 518452 560656 591156 571456 546756 536306 565776 634061 660727 651521 648515 663100
20552 663100 663520 706020 727164 741824 739812 752751 769498 788185 809176 818466 841491 845334
20540 845334 849870 869716 885009 896425 936500 970487 993669 1012120 1009916 1025013 1061477 1093798
20528 1093798 1127114 1165378 1209203 1266548 1307026 1384712 1451257 1515301 1585450 1643684 1676474
20517 1676474 1743411 1808645 1883231 1980383 2071040 2172861 2267977 2373628 2497752 2646286
20507 2646286 2788340 2900401 3029152 3187897 3338578 3533283 3730096 3960112 4207439
20498 4207439 4459974 4745419 5055424 5425010 5805500 6211650 6667508 7160333 7720845
20489 7720845 8365875 9103328 9979308 10958655 12069261 13372770 14886636 16654384 18720286
20480 18720286 21120121 23786898 26576379 29436058 32134112 34321290 35758153 36343468
20472 36343468 36178925 35413870 34366260 33310253 32389185 31699850 31199404 30763495 30247099
20463 30247099 29521876 28526495 27301002 25952275 24586182 23362166 22353757 21578886
20455 21578886 21132628 21037003 21298138 21904754 22838682 24039753 25473904 26982624 28450356
20446 28450356 29711102 30624180 31292731 31802808 32312149 32945222 33874577 35014845 36275110
20437 36275110 37368519 38025460 37994780 37055403 35216416 32708092 29802791 26778735 23826208
20428 23826208 21093322 18633784 16484564 14625516 13059894 11702421 10548217 9533448
20420 9533448 8672813 7925915 7266619 6721003 6228998 5781075 5448011 5114371 4780760
20411 4780760 4485974 4246036 4027069 3804811 3600732 3385915 3175526 2994656 2831475
20402 2831475 2709002 2611948 2495266 2394849 2283992 2153531 2055917 1945419 1834413 1727466
20392 1727466 1655089 1588603 1495455 1431151 1382437 1361371 1306598 1232761 1174900 1106537 1057703
20381 1057703 1019394 991343 949835 892656 860509 858742 843843 821248 800297 784162 758902
20370 758902 761776 732309 686516 640306 631960 634470 638270 643614 633439 636315 622457 585695 560650
20357 560650 551842 535305 553566 539346 500415 487343 473562 470691 425306 399992 412861 451515
20345 451515 463521 443136 403436 412334 410090 377382 356318 327578 324649 353362 382860 367537
20333 367537 372139 361871 311735 299366 289939 261961 265654 274619 287207 286140 306918 302503 256647
20320 256647 290164 325103 304866 264230 250065 261557 236830 208886 210633 242193 258683 259949
20308 259949 214448 201524 196142 194754 176916 165566 170185 177696 177788 212230 206871 191976 191825
20295 191825 155604 137685 126023 125555 122229 115075 118833 122206 129721 127295 160854 177089 157754
20282 157754 168076 169965 164511 162336 178368 143511 118713 127554 131797 129512 105122 100837 140760
20269 140760 150009 152709 158171 160080 158662 170952 160191 142896 141460 118201 115463 115519 129244
20256 129244 106835 120436 145647 149409 134977 147955 131479 96320 83845 80771 93153 103944
20244 103944 103440 92236 112995 142672 144916 133535 148110 171129 119873 108560 124267 118895
20232 118895 74169 63609 84630 90472 99318 91069 107274 110430 104075 104327 143221 128570 92723
20219 92723 98160 103992 83808 91801 90022 82117 74521 91573 83684 109965 113790 93502 64832
20206 64832 43262 81644 95846 68959 59347 57137 50952 39447 49875 53106 47949 22592 12764
20193 12764 59196 86764 105631 124992 109533 99860 84316 112863 136136 105459 73070 53393
20181 53393 44444 47523 78545 95947 57720 6560 3353 41718 74614 61148 77857 100286
20169 100286 81950 78879 68763 64930 60755 60721 74950 59540 59550 60333 78486 96839 122669 107405
20155 107405 82737 79408 100555 109090 77296 72291 81115 75790 60034 48383 38519 65876 72263
20142 72263 60666 32125 -593 3382 24615 32045 53710 57396 66980 95003 76466 42273
20130 42273 11829 5730 11859 35967 42703 44929 8193 -10100 -8103 -13103 5333 13379 24055
20117 24055 10156 -8743 9267 35066 32934 31111 16008 4026 -1654 25140 37252 18509
20105 18509 -940 2718 28739 33336 31350 14038 29282 14664 26323 26264 33979 21291 36446
20092 36446 19190 12918 35271 76690 94353 77314 64345 74037 67741 64884 63045 46507 20001
20079 20001 15966 40494 45391 19517 -2545 -3842 337 3836 20787 37226 49187 51766 37465
20066 37465 56680 66207 63521 31905 46857 75134 69147 56949 74231 68755 64800 35448 13830
20053 13830 5591 21978 22126 32724 28171 53045 70708 58588 20447 14519 22412 6348 -16085
20040 -16085 -20424 -11800 -1119 407 -15837 -9475 9824 2570 2473 16279 12875 32131 31354 12304
20026 12304 10786 15366 -1424 -667 1403 607 -7649 -4188 10073 33999 33694 -1481 -5637 -6938
20012 -6938 1331 19353 13191 -1023 12009 8045 11767 9780 -657 287 8203 19902 17750 27041
19998 27041 40597 32321 28217 34607 26371 14228 7333 -1501 -10903 -4206 -11997 -26380 -25619 -11506
19984 -11506 8552 34386 27152 -12418 -10547 -28696 -25141 -3044 9625 14084 15154 22341 -6563
19971 -6563 -4566 -7004 -41207 -44574 -39179 -24010 -1440 39257 36177 -23582 -32871 -45950 -44913
19958 -44913 -21758 -11312 -23193 -22129 -37967 -36766 -35347 -26943 13706 13300 20606 21903 36497
19945 36497 7613 -6741 -15994 -4247 -489 10669 51511 32240 -13608 -16355 5503 26540
19933 26540 9512 418 17295 17655 26003 25277 35703 63775 70561 49257 47893 22402 -10310
19920 -10310 -23395 1216 24846 32866 23184 38411 58928 52104 26987 20882 8885 49481
19908 49481 70560 87602 93629 90418 86890 107351 126478 153818 189883 197099 192220 149472 136501
19895 136501 110917 109544 142678 163626 166672 147077 149956 157434 165024 192945 198992 176901 154319
19882 154319 148494 132860 114432 124391 112974 109497 127070 150056 147636 151536 145389 157966 134481
19869 134481 131988 152634 157973 169012 167985 173773 162030 152397 159012 172013 206598 192609 158575
19856 158575 133036 120114 146521 172972 161760 115639 86478 70914 59269 22672 18996 24922
19844 24922 36036 40197 31038 18003 39868 75025 46216 24591 23173 17471 37090 30752 36082
19831 36082 38790 30917 39821 36415 20467 10794 34322 18476 21055 24292 17 -699 236 18878
19817 18878 8314 -29155 -56912 -31991 -5247 -17523 -14836 9310 17005 34080 33744 -1304
19805 -1304 -8661 -463 -21431 -33603 -37540 -49082 -14625 22379 13638 11576 32387 19890 -4062
19792 -4062 -12948 -4647 -2306 15880 27103 10402 1841 -24745 -33658 -6975 -9035 -2904 -7800
19779 -7800 -13045 -2715 6700 2517 28793 23406 13401 -12008 -10051 21746 29036 25726 18294
19766 18294 23173 24460 24370 19604 7400 -13855 5133 47911 46966 33712 28178 37145 39209 20187
19752 20187 5714 -30968 -4185 67330 72258 27189 -16114 -22234 19482 34440 40062 35387
19740 35387 -5221 -55 16853 24807 49522 20085 14320 27402 28984 25203 8812 7829 17234
19727 17234 34725 35799 25875 37970 62171 36979 15618 31172 52169 37784 37529 37523 20500
19714 20500 7583 11465 41013 37461 35512 51430 79502 76886 50997 16853 25796 39786 73781
19701 73781 113816 128938 121320 160562 179502 163267 147434 176161 186163 192305 195359 208422
19689 208422 213198 209238 212632 211919 227963 220992 189568 191532 210839 208376 189684 175196 153680
19676 153680 150324 127599 113276 97743 80432 63959 21758 39036 58575 53615 82392 94600
19664 94600 113886 145249 166055 148467 142770 128080 120697 107565 98848 126601 149734 186992
19652 186992 189967 197362 187813 154032 172454 200079 179098 155501 141176 135744 142079 104706
19640 104706 89725 102859 129749 138799 137938 133042 96012 76607 94289 113517 112617 113617 100671
19627 100671 84047 68299 51457 55088 67181 88648 101018 77987 63853 46234 43920 37671
19615 37671 28327 15325 4524 10668 31162 30010 56859 52054 41899 51826 107589 90902 75540
19602 75540 90893 93134 105231 124201 137025 132180 125671 105325 54163 17013 16763 11030 20324
19589 20324 34765 41766 15518 -17813 -34037 -29994 -3113 -5651 -23344 -18472 -4256 423 -22739
19576 -22739 -35597 -13392 3511 25309 31818 24916 36875 38189 19663 -329 15768 44992
19564 44992 38001 4315 -12474 28279 29375 7961 -3296 1732 -7917 -1833 -20897 -20523 -30817
19551 -30817 -12652 -7028 -3169 9632 29208 35940 27059 8043 -7514 4360 -21643 -8082
19539 -8082 -4204 9915 7055 5562 804 -35439 -64771 -52906 -38142 -8547 -558 -30835 -23895
19526 -23895 -1793 -34382 -40808 -6777 12839 26489 7468 36345 36371 18712 12699 25555 49984
19513 49984 59705 44842 55285 58415 36259 28062 35709 14643 19167 31872 25479 53680 43188
19500 43188 20208 3598 -32560 -25765 -11964 18756 43289 26761 11236 9933 21004 38799
19488 38799 14855 7803 24212 34654 23106 27972 41592 44589 7734 28150 18587 8086
19476 8086 1141 31341 49787 52875 54950 65564 26438 13658 -6796 -17016 -6222 5929
19464 5929 13062 35823 66119 72003 90513 108606 117691 121462 74705 32653 44705 53622 17091
19451 17091 26418 40603 62845 29920 13314 45603 50261 57400 65370 69020 66700 51610 6521
19438 6521 -13619 22891 38405 40541 42341 65175 88844 74277 76183 72308 69986 66029 54106
19425 54106 74077 59934 67858 72236 85045 113321 134723 119747 114094 86291 51566 9788
19413 9788 25882 55911 69539 62516 44981 37305 39279 25053 -2366 -22963 -12460 25345
19401 25345 27799 15335 19043 10999 10992 23773 44063 53866 49420 71431 64651 59960 28450 9824
19387 9824 483 4347 44291 43045 74539 81475 78585 65189 40864 72532 61406 69036 57987
19374 57987 22107 -466 -17024 -27783 -29678 -2695 53792 72015 58911 37439 32129 15569
19362 15569 19641 17771 11810 42523 33616 29186 27514 6436 11721 42902 42021 33665 36614 60793
19348 60793 70004 86379 76274 74918 75109 59006 71850 63452 61013 54303 43457 55334 76266
19335 76266 73904 64366 47352 47877 40182 44277 64947 89775 71741 64880 48876 30631 72162
19322 72162 91287 85954 104197 97433 90912 107276 74737 77490 83146 65968 63327 81343 79331
19309 79331 72186 83304 91353 117605 131783 102054 89866 109576 117882 151373 159398 163693 173232
19296 173232 189100 185471 146558 147629 165595 171834 188396 148771 145507 129307 120162 132026
19284 132026 160982 175957 171240 173807 170717 179325 175218 156254 179385 192828 198446 198868 208502
19271 208502 204733 199892 193686 188473 216358 211035 197023 212509 219264 217061 220430 258420 287229
19258 287229 287668 272903 273820 320822 331901 323680 303917 311725 306295 302362 303965 293875 287906
19245 287906 295077 329559 337396 338999 339347 372449 411589 413280 397739 418087 466724 483558 526540
19232 526540 555780 596753 620051 635402 649385 686153 752121 828655 910315 968176 1045976
19221 1045976 1133851 1200772 1258648 1307817 1343031 1371095 1356832 1350910 1330951 1293963 1281315
19210 1281315 1281805 1260376 1282731 1298510 1340213 1410399 1527540 1670087 1809449 2015513 2301629
19199 2301629 2583612 2806239 2932495 2906443 2845769 2790945 2818982 2940611 3111944 3350741
19189 3350741 3655018 3978717 4333886 4661526 4961957 5278660 5644522 6162963 6821360
19180 6821360 7663493 8825654 10407563 12558106 15484961 19645433 25553258 33515049
19172 33515049 43362039 53644003 61329734 63321374 59436716 52215646 44543653 38327093
19164 38327093 34404525 32947144 33829153 36569574 39819967 41315074 39729193 35619098
19156 35619098 30432044 25456541 21369435 18304063 16191852 14899559 14249608 14211927
19148 14211927 14738643 15932073 17938394 21049015 25434557 30764877 35573016 38036370
19140 38036370 37627975 35340015 32651084 30817225 30668123 32701493 37378345 44681263
19132 44681263 53074630 59057645 59766571 55108691 47062704 38068365 29893338 23265460
19124 23265460 18252411 14596990 11982561 10034587 8528807 7397832 6529182 5813307
19116 5813307 5203224 4683308 4217839 3808119 3448648 3146232 2883866 2654873 2443163
19107 2443163 2235065 2005656 1807405 1672049 1552440 1445668 1365217 1269071 1181402 1120996
19097 1120996 1057168 969498 900555 885991 866766 847442 799409 749444 707419 669362 640376
19086 640376 647798 659272 607332 574763 540114 511140 519826 518753 495164 507198 517695 525865
19074 525865 506906 519668 520239 471344 429847 419685 379842 361104 352846 331696 315684 331365
19062 331365 327246 302854 316519 331660 325287 306718 270839 249901 228490 202758 185234 192462
19050 192462 223920 272112 265009 228820 236015 271798 296218 313194 338608 345133 315104 253070
19038 253070 168868 140232 143852 177245 203437 224721 207450 217772 233595 212964 178083 168308
19026 168308 168150 177245 202955 210125 177496 149161 150238 139061 129659 118367 147359 156791 148970
19013 148970 150101 149722 145594 106663 112561 119046 132039 153695 135369 150250 184866 186986 172297
19000 172297 158217 155620 150799 136342 116582 128356 138966 109996 83047 79210 105995 113229
18988 113229 129936 126639 85158 45155 -249 13411 45382 48387 47551 66975 96246 93838
18976 93838 100930 119849 103496 106442 105045 89381 91381 82599 93039 83079 77063 70167 88394
18963 88394 97836 84057 60109 50694 54289 72242 89727 79656 74134 85863 72105 59787
18951 59787 53007 83113 106434 102460 101126 73945 58475 52213 35746 42774 51919 77055 106169
18938 106169 94957 57390 25871 4772 5958 47716 46377 40561 58638 39163 32739 39222
18926 39222 20759 37267 51779 63381 66875 48477 51585 78179 83532 74429 57879 45558
18914 45558 59085 72304 90280 70806 59760 61808 46065 46701 34433 34373 29675 37966 49584
18901 49584 70803 50498 49140 25592 24194 57366 50734 46302 42476 55144 57384 59504 54258
18888 54258 56047 69101 87719 84284 92772 78600 59733 70027 59973 47603 48818 58455 72188
18875 72188 52048 5418 -34368 -27618 -7153 -26161 -3284 43356 46679 33378 18417 12543
18863 12543 36596 41045 23538 20365 19788 52270 33031 8230 36273 39605 38048 56666 23986
18850 23986 3343 8761 7919 18633 24997 28176 48611 21944 899 16977 3691 17405 12060
18837 12060 17588 16432 11020 20225 27704 20308 26715 42416 41982 34779 28322 22613 17328 15045
18823 15045 1563 -1813 -15794 -22159 -22511 -12536 -505 -816 -4855 20382 61689 76293 96250
18810 96250 81960 24808 -798 -4530 -30233 -33561 -2538 39650 56080 30590 17736 36418
18798 36418 47334 43776 29705 44800 40227 36970 24723 11885 11859 20759 10963 13740 30003
18785 30003 29694 4599 -15562 -20709 -11759 -37986 -62753 -54894 -22867 -10145 -6201 -11876 22169
18772 22169 49504 29743 -4429 4231 13601 14795 -15922 -27864 -3990 32150 27022 16129
18760 16129 -17484 -20178 -8624 11497 7328 -8451 542 22050 10945 -28675 -39781 -38641
18748 -38641 -24428 5781 12914 16140 1793 -46400 -62849 -69247 -48152 -18270 -29377 -62884
18736 -62884 -56026 -46890 -14504 -6244 -23527 -40688 -61491 -82402 -82689 -71596 -47118 -41385 -33119
18723 -33119 -7220 25242 16439 -1779 -10364 -11704 9292 14433 28220 56830 51268 10052 -19129
18710 -19129 -31442 -12151 24427 46482 49037 38396 1977 -33578 -58637 -18468 14259 10037
18698 10037 13570 18356 19464 5022 18826 5626 -6752 -41740 -43440 -14335 -3422 -9790 7935
18685 7935 -22902 -43749 -62928 -96015 -101702 -62803 3661 44602 46342 31133 8994 -20761
18673 -20761 -42702 -20953 -8392 1971 2235 -21079 -30585 -28203 -4232 6373 2971 8509 3544
18660 3544 8666 3870 9960 42734 42716 32431 30359 86800 137157 188831 212168 183158 189482
18647 189482 215626 232708 231968 180271 169770 210524 191107 172393 190747 206857 203563 181555
18635 181555 174947 165212 147780 169661 171926 150739 134512 135998 135740 113782 87095 67770 83496
18622 83496 116057 115281 87814 97422 82363 70430 97998 140003 167494 184550 190274 177774
18610 177774 209737 199327 171575 164327 171262 164498 195036 226322 213527 245354 213197 190713
18598 190713 165041 142039 143915 116446 82894 25325 -4875 645 -6805 -10479 7432 18571
18586 18571 15165 -4276 -13340 -39461 -27438 5309 43026 45870 30553 27466 -4950 -22665
18574 -22665 -19409 -29405 -5649 27201 27454 19383 -12899 -11958 -3315 15620 42335 59162 62696
18561 62696 33941 5671 24296 -1290 -15711 -15215 -22318 -24507 -1342 14018 -8887 -22006
18549 -22006 -545 22233 68612 87468 70466 57250 51912 37314 49356 71745 80323 62967
18537 62967 63731 31809 15358 -12113 -38460 -42095 -35402 -25578 -4535 14658 11799 11045 3013
18524 3013 -12539 -36755 -29241 -26814 -33490 -42287 -7349 3683 12092 -7757 -16293 -31283 -18171
18511 -18171 -12097 -5756 -8966 -10623 -15146 -18736 -41711 -35679 5720 7763 19893 43057 10412
18498 10412 -16163 -32341 -33491 -18803 -4940 -6144 -14699 4164 -27987 -61143 -59763 -11897
18486 -11897 14769 -13647 -50179 -34967 -13135 -22755 -18965 -8651 -8771 2702 4210 9115 -4057
18473 -4057 -20425 1112 12264 4798 3660 21142 22180 -14321 -27454 -30719 -6626 11459 18180
18460 18180 10786 14072 16748 11750 10792 8038 -19054 -15859 -18044 -30182 -21431 -39209 -28728 -11245
18446 -11245 -30392 4700 13356 18492 24015 2038 -8429 17833 33089 29833 4542 -49472
18434 -49472 -35239 -5851 -33274 -45514 -30280 -10703 -25051 -13489 -13122 -6983 -14832 -17318 7272
18421 7272 23652 -14189 -38298 -17810 10290 17015 -7488 -25403 -43638 -52115 -55343 -46880 -43649
18408 -43649 -10679 7726 22808 30554 4228 -36021 -67752 -57593 -39823 -23327 -23416 -8330
18396 -8330 -1499 -10185 -26862 -35302 -25133 -29327 -43980 -47957 -31944 -38451 -30584 -21471 -11709 -26643
18382 -26643 -56027 -59562 -46008 -7252 -66 -16309 -32136 -32254 -27937 -5342 15053 8918 5850
18369 5850 -15159 -8407 -26537 -26886 -14464 -10409 -900 -22613 -11379 -11652 -15899 -32900 -33023 -35664
18355 -35664 -22911 -6561 15794 -910 -29818 -55660 -32321 -22597 -11141 -27429 -39923 -48713
18343 -48713 -47938 -49424 -51270 -14588 -14924 -1653 3682 -3534 18603 974 -11255 -15184 -19299 -4154
18329 -4154 12571 36523 41955 42993 21109 -18831 -20978 -6731 -20605 -10904 8643 -434 -20607
18316 -20607 -30381 13840 11017 -17669 -30409 -29734 -39146 -33587 -58035 -42388 -34539 -40130 -59671
18303 -59671 -56739 -44308 -32880 -36006 -53634 -55858 -39486 -22840 5880 2336 -9262 -524 27496
18290 27496 33162 10025 -11698 27573 30180 31975 28122 5342 2349 27486 21744 2186 12447
18277 12447 17541 5205 -23981 -27425 -11126 -25333 -25062 -35886 -48065 -38709 1702 2261 -9194
18264 -9194 -30109 -64036 -55507 -42509 -31341 -29771 -27516 -14134 -19183 -35085 -46791 -42153 -21240
18251 -21240 -24557 -13182 -19611 -29553 -24415 -22557 2655 14027 11115 21613 32548 40033 6679
18238 6679 -15327 -4540 -23984 -24326 -26076 -36818 -39556 -35597 -35925 -49939 -25274 4881 21141
18225 21141 13211 240 -29019 -20622 -13631 4028 2002 -13032 -42285 -30210 -22059 -33089 -15890
18212 -15890 -11134 -39324 -29626 -34351 -68983 -63727 -39387 -27866 -7490 -18002 -40480 -52669
18200 -52669 -49057 -23192 -12756 -6022 4020 -23390 -40414 -4712 -6661 -13401 3108 -12821
18188 -12821 -46431 -58495 -16182 2512 -42311 -45689 -5043 6238 24849 5560 -13624 -26572
18176 -26572 -32924 -23050 -19553 -17176 -11270 -22219 -17722 1151 2910 27890 24271 7947 -16147
18163 -16147 -14846 -26354 -27967 -53291 -18546 3782 1291 -3277 -13248 -47324 -55591 -36670 4732
18150 4732 16075 -247 12772 -1911 -37517 -61207 -53808 -24712 -9337 -5444 -15742 -25888
18138 -25888 -40488 -64506 -59823 -18918 -37406 -45683 -16067 40381 46676 39532 9949 -12265
18126 -12265 -24478 -43259 -12571 7107 -20721 -41345 -33088 -28805 -39054 25278 74948 68336
18114 68336 48470 6665 -35532 -45212 -54216 -29283 -27356 -45311 -28885 -989 23186 -8475
18102 -8475 -29989 -31903 -58266 -75257 -66323 -45167 -26250 -15802 -20823 -39817 -70339 -67199 -26195
18089 -26195 -50930 -37992 -19642 -2865 11408 -16078 -39089 -39668 -7998 16606 33025 15819
18077 15819 9647 30447 24048 18350 27169 12951 10421 -16788 -18151 -16116 -30540 -18602 -1255
18064 -1255 -82 168 -1452 -7449 11239 30010 51946 21803 10895 3111 -7370 -4042 -24406
18051 -24406 -60322 -55308 -22156 -19387 -7013 -8234 -10850 -13667 -22399 -31627 -29173 -5938 14671
18038 14671 2336 -9954 -21946 -17315 -11798 -9927 -39447 -36873 -47579 -56738 -38057 -25287 -29718
18025 -29718 -26200 -21342 -13341 -13856 9150 9403 6032 13961 -8098 -9586 -10413 6307 -17665 -28752
18011 -28752 -50710 -51733 -36803 -12774 -6563 -16155 18952 42220 33079 40438 70387 41210 19080
17998 19080 20192 1370 -8399 -12548 1868 8852 12093 8542 3063 28847 14599 -9891 -3217
17985 -3217 -10878 -10890 3280 -8316 -15281 -17109 -15387 -26990 -34236 -4943 14954 7045 -9435 -5568
17971 -5568 -6851 13084 31924 55017 48023 29673 28447 11564 35049 13960 20923 57487 57509
17958 57509 44297 24088 27643 16945 1383 -1272 -8130 -9250 -5493 -37596 -60985 -81216 -60821
17945 -60821 -34037 -27192 -43555 -20898 -3453 -5352 -12069 -15469 -10752 -12519 2416 8341 4741
17932 4741 -31574 -41583 -27521 -21358 -15308 -48558 -50823 -14444 30747 23376 25696 3077 3873
17919 3873 30726 14436 -2285 2783 -12540 -55642 -51412 -4060 -3044 -10452 -9430 4095 35273
17906 35273 12519 -12020 -13714 12761 3600 -3051 -8257 -15711 -34237 -48104 -50054 -21902 3591
17893 3591 -9941 -8069 2470 19092 11660 -14723 -39541 -50126 -19029 -27282 -28304 -6600 334
17880 334 -12232 -18086 -56427 -58301 -29165 -5969 -15793 2851 5225 -18557 -40216 -58631 -20087
17867 -20087 -18551 -32511 -25521 12912 19467 -8545 -39800 -73180 -64122 -52997 -41268 -11120
17855 -11120 -8129 -49993 -63392 -50091 -17659 376 996 20081 21547 -14033 -24840 -44704
17843 -44704 -42125 -45915 -49286 -23779 3592 -2783 -5460 -18681 -12038 8236 1383 -11034 -41535
17830 -41535 -40295 -25159 -13610 19523 31013 8720 -18791 -22461 -28459 -10525 22799 33852
17818 33852 -9234 -6685 23089 22436 -13456 -47292 -53446 -23558 -11930 15988 18237 -9405 -8616
17805 -8616 12205 17143 -7098 -35602 -37877 -29749 -14094 749 -2720 -6523 -43533 -47035 -25167
17792 -25167 -18482 -36753 -28272 -40459 -41988 -13622 24572 19753 2026 -4714 -9794 -16639 -25216
17779 -25216 -27404 -7602 178 -14577 -7964 -8451 -7460 -11283 -7467 -6092 10729 -30519 -38112 -23781
17765 -23781 10360 12303 -8194 -33815 -34596 -19226 -14973 -28234 -21929 -36355 -32673 -23527 -13320
17752 -13320 -24285 -15735 -18738 -13206 -1119 -5822 -30847 -52982 -31780 -28389 -18224 -7016 -34137
17739 -34137 -46097 -38313 -30708 -5096 -2945 -18019 -18006 -1219 -22324 -46020 -31385 -27459 -23091
17726 -23091 -1030 3926 -6238 -2817 -1036 370 11967 14342 -10670 -9219 -8425 10156 6861
17713 6861 -18741 -22933 -26088 -24436 1175 25037 22669 25760 39139 28685 -11163 -37500 -29257
17700 -29257 -7158 -299 17325 27676 21347 50553 31434 6856 -12177 9463 -12441 -33896
17688 -33896 -37935 -13211 5871 4721 -24850 -45114 -41559 -27524 -18574 -39536 -37991 -12064 -1583
17675 -1583 -9883 -7674 -1491 22969 12023 -18447 -25409 -20395 -9519 2125 13165 16239 11300
17662 11300 24250 25664 2363 7488 35555 48170 51115 23112 -18105 -16220 -22323 8100 10154
17649 10154 477 20660 12577 -18550 -14275 -7268 13762 27854 2 -27794 -21280 3104 2579
17636 2579 -1812 12265 13788 -10479 -26410 -35075 -39955 -24647 -16686 -4684 9633 -6216 -42442
17623 -42442 -73938 -50227 -27177 -38583 -34524 -54079 -47217 -36591 -19802 -37874 -44570 -22435
17611 -22435 -11235 20079 33424 36526 29364 -37254 -72382 -53028 -41107 -39973 -25263 -15601
17599 -15601 -15888 -1737 -2053 21762 20887 7918 -33564 -64715 -35692 -21053 -24929 -45301 -50069
17586 -50069 -52469 -37459 -41230 -65993 -46805 -33631 -31366 -20919 -4478 443 -19594 -26837 -36454
17573 -36454 -41061 -44360 -62586 -60016 -34560 13157 9032 18184 2423 -20079 -25340 -32022 -17905
17560 -17905 -28207 -21611 4296 15711 16568 -11970 -51293 -58103 -48082 -76167 -85258 -70440 -17016
17547 -17016 -18066 -25322 -11095 20804 21965 23518 19722 337 -5508 7014 18144 8758 -10506
17534 -10506 -39539 -47689 -25944 -21855 -10728 -11363 -22135 -22010 -11281 -11667 -27208 -14104 -19193
17521 -19193 -41756 -52158 -47845 -51118 -38057 -26570 -27264 -35393 -25086 5001 -21068 -31580 -28884
17508 -28884 -25954 3738 -1188 -20033 -10647 7587 39328 37092 43361 33979 -861 -28372 -40858
17495 -40858 -10315 5333 22021 24716 17748 6850 17931 27197 13314 -3726 -18178 -9888
17483 -9888 5429 22721 35673 6837 -39241 -42066 -26284 -11857 12982 22222 40585 27730
17471 27730 -13660 -48144 -63839 -63560 -65299 -57835 -21516 -19514 -33919 -45091 -45178 -53855 -61342 -46796
17457 -46796 -51258 -40605 -10767 -25674 -36357 -51996 -62772 -61311 -48437 -35388 -19569 22566
17445 22566 -10573 -23740 15474 12061 -31666 -56051 -19976 -24649 -35192 -11627 -18271 -7747
17433 -7747 9168 33813 54663 15938 -15380 -27737 -6687 11282 45382 33609 8906 -9188
17421 -9188 -10430 28586 45129 28052 15293 8544 -13956 -18211 -28713 -35441 -52689 -32073 -27785
17408 -27785 -9818 27967 6997 -1434 -9206 -2736 -24080 -23724 8373 32814 27214 15766 10939
17395 10939 -9956 -64843 -105160 -80849 -69898 -68247 -68185 -60265 -72852 -61007 -35278 -40541 -30174
17382 -30174 -5323 1656 -4210 -17928 -60277 -58294 -81961 -69089 -15395 -23360 14486 32266
17370 32266 15432 -18871 -52539 -35310 -34068 -46400 -17406 -9825 -24138 -44759 -39631 -40669
17358 -40669 -17681 -21291 -42282 -78534 -45581 16144 36314 -1798 -12865 15324 13067 -16276
17346 -16276 -26094 -25653 -32273 -11836 8578 21211 7495 12179 20820 46170 28747 32111 41084
17333 41084 50738 52751 42405 60630 60174 3187 -20435 -9004 -483 -6323 -24527 -48030 -62834
17320 -62834 -63719 -76762 -68887 -60564 -73044 -76033 -54046 -54775 -59252 -38046 -5434 16115 17992
17307 17992 3458 2676 9543 -10759 -43464 -48717 -31343 -20395 -32625 -51377 -68664 -39825
17295 -39825 -13686 -5437 23 -24170 -18238 -13038 -10416 -14379 -38456 -45734 -33284 -8529 -50098
17282 -50098 -55618 -37246 -28600 -6211 -27003 -25023 -40641 -31517 -3227 10804 19904 19637 -4225
17269 -4225 -35456 -52141 -29006 -35741 -32067 -15632 16021 14356 -15240 -42284 -53333 -29485
17257 -29485 6791 -6685 7031 18892 -20205 -30605 -8927 10649 27078 23084 -6838 -14044
17245 -14044 -13114 -17937 982 156 -17339 -11734 16 2612 27578 15006 -15392 -29808 -27978
17232 -27978 -10276 -5674 -18814 -38009 -38176 -18113 -11686 -44838 -73007 -64334 -51174 -30886 -8997
17219 -8997 11022 -17148 -33252 -17032 7853 -2326 6183 12251 30459 35695 3874 1481 19182
17206 19182 -4113 -46340 -28791 -1375 -7576 23794 10183 -11901 -12968 -18925 -11323 -28549
17194 -28549 -36879 -45687 -58307 -38962 -35834 -13495 17417 28213 14784 -4404 -17836 -4716
17182 -4716 -4946 -26209 9146 2143 -29282 -16339 -4599 11181 -15757 -29254 -29327 -46600 -46139
17169 -46139 -27411 -35645 -22453 -825 11074 31259 57033 55962 29009 -54 -32144 -36694
17157 -36694 -37079 9931 27440 -4533 -11541 -2522 11953 13943 4122 -21803 -7003 -14846 -10668
17144 -10668 -43980 -50672 -18954 -16708 -4747 2486 -9446 -28981 -14170 -13798 -4300 23959 26254
17131 26254 4020 -15373 -26617 -46721 -59337 -42904 -8343 11883 23889 36569 12681 -20677
17119 -20677 -22873 -14210 10980 -10794 -26561 -11259 -2166 -186 -5632 -8326 1441 8266 -7908
17106 -7908 -6155 -19658 -61592 -85161 -55921 -36066 -5652 -585 -29147 -22778 -29026 -48595 -66402
17093 -66402 -47744 -31990 1370 5496 -17368 -9436 -18157 -37672 -35314 -42368 -44728 -53711 -29536
17080 -29536 -30225 -30892 -16631 -39514 -71106 -74499 -71246 -55395 -31424 -16908 -12779 -8515 -20072
17067 -20072 -35263 -41877 -16488 10560 16030 -21232 -28545 -40941 -53906 -62716 -44440 -14454
17055 -14454 8391 8229 12101 9109 -8761 -22871 -4692 14362 -11030 -29646 -19922 -22000 -31968
17042 -31968 -44198 -70487 -59317 -65142 -53916 -41102 -40613 -38556 -38639 -26585 -10012 -27289 -36348
17029 -36348 -36682 -46220 -37781 -44627 -54943 -61492 -57776 -54006 -54077 -56899 -79254 -58685 -34315 -47978
17015 -47978 -33768 -17169 -47373 -26954 -8312 -12444 -28925 -61366 -78778 -90661 -72275 -56732
17003 -56732 -59495 -44108 -28445 -50545 -51351 -42198 -62792 -52922 -56134 -46661 -2647 30614 16013
16990 16013 -10036 -4298 -2467 5232 -2888 -26690 -36570 -60275 -58773 -38180 -26282 -16096 -6737
16977 -6737 16806 29822 33147 15742 -26811 -45135 -29394 -34922 -11249 -7907 -8931 -16079 -3327
16964 -3327 9338 -10329 -31416 -8386 5024 7631 7636 23719 22851 645 -23235 -35908 -48151
16951 -48151 -31402 -11705 -18008 -50165 -65140 -44791 -39103 -31299 -19545 -13834 -27536 -39630
16939 -39630 -24447 -12746 5356 7854 -7631 -17366 8348 22074 6348 -27006 -47019 -48068
16927 -48068 -52670 -55484 -34948 -10017 -41025 -49794 -17660 -15001 -14596 -8732 -21531 -7035 8971
16914 8971 16110 -24300 -56729 -34008 -24397 -34463 -29375 11460 19780 10476 5067 -6122 -9127
16901 -9127 -25184 -33122 -42764 -15393 -14820 4883 13321 34455 20831 9807 9337 -372 30031
16888 30031 21853 10286 6969 8263 -10985 -37275 -44511 -36379 -28426 -47851 -37626 -22368 -1034
16875 -1034 23119 32362 28576 -7359 -28017 -60584 -74158 -48231 -13217 -6131 -7580 -14235 14136
16862 14136 33979 25072 -18898 -50816 -57481 -47824 -54559 -32529 -58885 -71441 -62168 -71232 -37110
16849 -37110 -20805 -20893 -23137 -28348 -62870 -46851 -34311 -45700 -55564 -42466 -37423 -22717 -14888
16836 -14888 -7418 -23145 -31927 -8559 20018 19990 14379 -12772 -6561 1714 13653 11696 -4074
16823 -4074 -12937 287 -30238 -21062 7125 25173 15972 -31829 -45834 -36128 -45925 -54594 -53813
16810 -53813 -35706 986 -13206 -10042 2744 11181 20778 26222 16435 -12373 -8017 8941 16653
16797 16653 -5513 -38019 -54926 -55913 -36256 -52682 -61080 -38044 -9158 1899 -15753 -37505
16785 -37505 -38315 -55963 -57407 -47608 -37316 -42231 -44210 -45365 -58084 -52643 -34858 -27360 -42371
16772 -42371 -54763 -45750 -70946 -84425 -71695 -45596 -15286 -23688 -31275 -16587 3490 4432 26400
16759 26400 29700 -3610 -36982 -71050 -73849 -61006 -43214 -6440 44798 46738 14397 -1653
16747 -1653 11452 -3649 -979 18401 12372 -26626 -44443 -27977 622 22265 -11422 -5474
16735 -5474 -9768 -6981 -30804 -28711 -9409 -484 -10446 -7443 10620 7754 15252 20404 2739 7244
16721 7244 1672 5571 5104 -27770 -31259 -20912 -5769 15775 -5294 -604 -37146 -65535 -50872
16708 -50872 -44587 -13188 2804 12554 5280 -15584 -7429 33093 41194 17897 -17284 -29856 -53449
16695 -53449 -42987 -47516 -51346 -60670 -83046 -71724 -54370 -43712 -34914 -7975 337 -35904 -32152
16682 -32152 -46152 -40299 -39074 -11017 -11925 -24427 -31973 -30248 -38240 -46322 -27251 -9537 -23131
16669 -23131 -26331 -28652 10737 17076 -1994 -22577 -13850 6492 -4770 -14834 -18450 -16161 -6878
16656 -6878 11742 5097 -8541 -9192 -11586 -7682 -9991 -17962 -20099 -5666 2730 -33210 -51392 -60752
16642 -60752 -60925 -36334 -44863 -14749 26478 674 -48993 -44881 -28234 -15038 3385 -9219
16630 -9219 -3172 -4013 -7737 -22652 -31118 -4710 6644 1668 1402 -7757 2209 19501 -5957 -5726
16616 -5726 43730 41277 9255 -31251 -28711 -6644 -8447 -22545 -50904 -49868 -46012 -46615 -23621
16603 -23621 -1866 4216 -27516 -39304 -39665 -59341 -29028 -12728 -19049 -14009 -15477 -3648 -28063
16590 -28063 -42400 -33801 -49151 -28802 -13499 3515 -1500 -9850 -20191 -24502 -27708 -18474 -2930
16577 -2930 -9473 5795 -6944 -10852 -8636 -10130 -32159 -28808 -28266 -41333 -46551 -54341 -56349 -55579
16563 -55579 -31949 -23993 -31968 -30387 -13045 -33582 -59323 -80069 -64097 -42600 -30728 -31516 -36637
16550 -36637 -42715 -16044 13953 1132 -9396 1040 -28658 -39039 -43062 -6619 -8861 -21922
16538 -21922 -31362 -18577 -19377 -13796 -21662 -16763 -19410 -786 20150 27433 18091 7331 2476 -1048
16524 -1048 13788 15844 1002 -15186 -32300 -27273 -26747 -46924 -31449 -46410 -62295 -38870 -11964
16511 -11964 -26379 -50153 -50814 -49888 -50468 -54661 -62187 -62830 -62872 -22413 3493 -18111 -2360 3947
16497 3947 -4806 -4467 -32525 -40812 -54954 -50021 -49806 -50630 -50200 -67053 -62282 -34539 -9738 -8720
16483 -8720 -16423 -4806 -1195 -31989 -61840 -74525 -42167 -23666 -26141 -38328 -46885 -39980 -39718
16470 -39718 -47768 -23714 -30467 -36265 -44543 -32651 -36730 -46161 -20471 -369 6850 3221 -12701
16457 -12701 -31754 -48889 -78172 -73176 -40670 -6039 -5714 18418 25727 20914 19171 3941 -30651
16444 -30651 -33402 -9950 19886 31867 13217 -16784 -30687 -26101 -39981 -18685 -11011 -7517
16432 -7517 -522 -12869 -25960 3099 21422 27766 19036 17234 31185 32118 22227 43342 34392
16419 34392 23794 11063 6231 -19187 -24149 -25829 7879 9957 8764 -361 -33259 230 37355
16406 37355 12778 -8361 -15233 -37339 -15106 24600 41405 51797 32157 14976 17926 35065
16394 35065 49792 54766 49635 42621 46575 29322 16236 9801 24302 41730 22644 4680 14224
16381 14224 13040 -5846 -15757 -40189 -41299 -17842 -31361 -15809 -7218 -11362 443 -7738 -19157
16368 -19157 -21324 -15301 -37381 -6464 7730 8952 -21279 -24519 -16514 2744 -7543 -44337 -38164
16355 -38164 -26815 -25707 -15883 8854 18935 5271 -13822 -15005 -17995 -10958 -2858 -2723 31273
16342 31273 36435 18106 -4442 6828 11364 -703 -19735 -33174 -29070 -17423 -17741 -25338 -23060
16329 -23060 -23865 -36883 -55114 -45426 -32166 -40063 -28230 -29822 -31072 -21533 -21084 -33564 -39617 -46792
16315 -46792 -41792 -50342 -37146 -23255 1576 -136 3235 -10801 -8841 -16975 -42883 -27475 -24416
16302 -24416 -25792 -24455 -16403 -29372 -46526 -34740 -12666 -12915 -12604 -29192 -29443 -26218 -36279 -33066
16288 -33066 -48863 -57304 -64353 -50270 -29548 -14574 -20153 -24243 -41216 -39325 -43464 -60780 -78070
16275 -78070 -42687 3316 -128 -18756 -35754 -37451 -24765 -29510 -49114 -63429 -57036 -39163
16263 -39163 -62508 -59081 -50757 -48837 -36332 -26374 -22200 1548 28605 22453 -2187 11235 19035
16250 19035 33703 44671 32293 33713 35196 52366 10198 -36384 -27713 -47536 -40849 -4529
16238 -4529 -9584 -17788 -28924 -20513 -30768 -45167 -31521 -37436 -67136 -75272 -92528 -84070 -77242
16225 -77242 -40932 7729 10885 15335 34035 56015 45603 29598 32378 42636 46015 10768
16213 10768 -10190 18442 29319 25722 8325 -11451 -17670 -23441 7659 32912 29182 22428 14730
16200 14730 6828 -12936 -22392 -56243 -48358 -38393 -18753 -17668 -40592 -49910 -61312 -59874 -58184
16187 -58184 -46922 -23688 -34413 -39862 -38148 -54548 -39401 -16650 -16581 -9672 1881 7345 -3500
16174 -3500 5943 -1574 3836 -19936 -20560 -1407 -1481 6390 16458 21991 32118 28310 24896 34744
16160 34744 36309 39694 17868 -13444 -54153 -35052 15387 41521 78526 35506 -15995 -35627
16148 -35627 -31647 -48828 -74250 -71867 -49471 -15604 -10106 -14046 -8396 -12767 -22897 -8571 -6025
16135 -6025 10758 28142 7722 -19768 -37954 -41748 -32773 -35541 -15402 -17667 -9172 -6324 15303
16122 15303 9005 -32483 -13655 -46804 -54633 -9987 13234 9368 -35910 -74137 -49227 -18803
16110 -18803 6129 -15440 -2843 14885 20191 16990 -12991 -18110 -10425 6830 43285 43952 25114
16097 25114 11662 27097 23634 39311 45165 22699 8152 -7127 -26628 -25774 -4999 8850
16085 8850 11109 11763 -9649 -3281 14135 -1409 2128 17864 31048 36035 16339 -10205 -2531
16072 -2531 4826 10051 17718 -967 -13581 -3762 -2537 -16147 -19523 8484 50335 60467 45353
16059 45353 -6653 -14309 -12264 -23927 -26031 -32257 -35048 -12039 -13087 -39462 -24891 -16046 -17441
16046 -17441 -34030 -20379 -2760 -3893 -17300 -40533 -23239 -8279 -3756 5611 8023 -2213
16034 -2213 -33216 -41927 -43354 -59418 -51012 -37991 -33833 -30710 -10120 16120 -218 -4918 -7631
16021 -7631 -21091 -21882 -769 -22221 -39807 -16313 -11389 -11352 -34323 -56870 -39864 -25826 -27951
16008 -27951 -22511 18608 -14879 -16370 -22905 -26399 -9850 -17996 -32607 -21534 6394 4955 -19565
15995 -19565 -9766 24542 35462 43072 56124 16876 -16125 -27528 -41590 -54554 -30233 -34948
15983 -34948 -68137 -79668 -47875 -50657 -42371 -32421 -34613 -60950 -44521 -16827 -14037 -29594 -61907
15970 -61907 -44902 -19942 -38931 -73607 -78960 -61574 -42100 -10970 -17293 -23370 206 3386
15958 3386 15726 28084 24533 20621 -225 -26543 -33988 -52998 -34803 -44655 -58114 -51623 -46798
15945 -46798 -37917 -42726 -49944 -37603 1425 -6940 -8070 -932 -18405 -58260 -44098 -27153 -25376
15932 -25376 -21630 -24570 -25204 -26942 -42704 -52518 -55291 -56855 -74806 -88886 -39255 -14461 -12272
15919 -12272 -31100 -37822 -42518 -11861 6223 9347 -2594 -7336 -32184 -61770 -52002 -25626 -1844
15906 -1844 -6445 -20737 -38040 -34699 -27509 -27786 -30119 -29347 -5190 32947 47326 32948 24881 394
15892 394 -22026 -25515 -9415 11523 2062 -1223 -898 15842 -88 -25197 -30302 -4529 -21172
15879 -21172 -20351 6245 34459 19276 -13397 -12189 19568 -8822 -29228 -18708 -34305 -49193
15867 -49193 -62339 -45451 -36013 -48774 -63036 -81524 -61987 -55472 -50911 -48090 -32432 -525
15855 -525 23837 2727 -9682 -18231 -5556 -19048 156 15744 -10138 -31092 5039 7672
15843 7672 8429 30400 7928 -13719 -27469 -18679 -11702 9998 7073 -10022 -6484 -1833 -4051
15830 -4051 -3162 -14688 -20246 -18123 -51296 -61114 -49575 -24375 -11248 -12519 -8480 24615 35771
15817 35771 51467 51528 32438 346 -14161 -18697 -40739 -28674 8693 19307 7842 -5926
15805 -5926 -1361 24189 -3989 11485 25521 27911 1100 -5158 -36328 -57453 -46860 -24560
15793 -24560 -17681 -20026 -25786 -53808 -25371 10476 39523 25753 33116 28090 16938 -5850 -13340
15780 -13340 -11553 3772 38702 22617 7481 264 -24500 -4606 23509 737 -10795 22532
15768 22532 30127 30150 25396 24697 6489 -2367 12603 -9857 -7775 8618 34099 30397 5080 -4694
15754 -4694 -7311 5558 -2719 -23687 -25902 -24558 -45680 -35837 -3496 1381 8925 19034 21168
15741 21168 4110 -14296 -6484 30069 7938 -20467 -33713 -12187 -6862 -30689 -44130 -30301
15729 -30301 -6270 -21545 -15937 3115 -6939 -1682 -7997 -307 12667 -8555 -19271 -29212 -49852
15716 -49852 -34956 -6829 9215 4639 -6746 -11305 -5331 -4023 -17002 -6419 -1882 -2412 7502
15703 7502 -17625 -34286 -12921 15674 25695 23759 13868 21867 36314 51419 36334 7398
15691 7398 4595 6937 12869 -19882 -31201 -43905 -80535 -82586 -31894 22264 14760 -1554 -28051
15678 -28051 -17164 -19639 -48368 -36106 -14830 -6460 798 13901 9077 8568 -10925 -10132 7325
15665 7325 -8237 -23606 -25393 -21626 -13423 -12094 -26738 -8738 4276 -719 10909 15257 -5712
15652 -5712 20567 4561 -17593 -15431 -8496 13526 17180 -7449 -21308 -30445 -38947 -31559 -18074
15639 -18074 -22033 -40271 -32985 -42689 -58085 -28238 -9158 19458 22101 792 -56733 -55074 -43251
15626 -43251 -40646 -24122 -38584 -32277 7721 4082 20092 31278 18369 7817 -16213 10979
15614 10979 10848 271 -11009 -26367 -8984 447 17878 14631 -20253 -34760 -32613 -22299 -22929
15601 -22929 -18209 -15460 -24224 -23099 -5055 -12629 -25334 -24278 -23729 -46555 -30328 -10468 -22642
15588 -22642 -17430 -13105 3617 28171 44794 44562 60214 50749 4205 -17315 13911 17272 8693
15575 8693 14679 24235 27990 16583 -5138 -43402 -65049 -45052 -24429 -22526 -37799 -35606 -9976
15562 -9976 -1197 -4089 7770 -10837 2426 4505 -4237 11400 16528 -147 9036 19390 9287
15549 9287 13767 22917 34063 47153 52960 56197 54929 46682 2566 -8561 9993 27412 26401
15536 26401 24485 35288 36243 26526 23506 22177 25642 15271 -22947 -29496 7403 5032 -18990
15523 -18990 -13262 18503 10084 36356 54828 34972 14212 19697 13874 42029 64716 39657
15511 39657 19659 22485 24502 25294 27321 17777 -32086 -31816 -11469 -20759 -3785 22332 29355 15979
15497 15979 27884 19593 -8297 -18493 -5687 31375 38118 8593 -48578 -53988 -31535 -39611
15485 -39611 -24058 -30106 -49514 -50984 -712 29946 23141 38993 41063 39953 31989 29690 32833
15472 32833 46998 50654 41900 57979 44962 -17207 -22480 -30614 -57189 -44659 667 3587 11698
15459 11698 4133 -143 -18567 -52986 -45427 -21897 22886 11354 -16053 -9025 5557 14090 42086
15446 42086 41538 41270 46591 36990 11540 -6020 -3858 30043 51471 36743 23293 34281 51026
15433 51026 9549 -11121 -17592 -24027 7734 28648 14147 1072 -18695 -48533 -27003 -14702
15421 -14702 15100 40335 7449 4050 6728 -2549 -16753 1968 45663 46611 -84 -32109 -37316
15408 -37316 -12321 -4176 -21100 -13418 23243 54198 15669 -33617 -59046 -70984 -37662 -3606
15396 -3606 2392 19 26660 36945 45920 34644 7486 15502 -25 -13218 -4854 7372 16786
15383 16786 27082 44719 52983 59916 34318 30797 32633 41114 25607 37178 38642 19199 19173
15370 19173 -7026 4437 -20935 -46679 -17828 30657 23800 23009 12818 -8323 -2820 5468 8756
15357 8756 5989 -6533 -21657 -12146 10170 -3615 -3478 -17193 -19291 3587 17502 -736 -12850
15344 -12850 -7773 4054 -9311 -41147 -47126 -31367 -25001 -9012 -14666 -34785 -29636 -23659 -10473
15331 -10473 -5850 -7902 5938 22847 -2383 -30925 -7223 5235 -6237 -51083 -42217 -23306
15319 -23306 -22105 -13358 -16218 -40279 -31049 13121 19819 -271 24423 62159 51294 37317 27399
15306 27399 -5850 -28329 -9315 27095 65007 62173 23509 26196 29664 16933 -17655 -50963
15294 -50963 -24703 -20831 -30671 -21236 -3017 -6057 -14143 -5236 -53428 -71748 -35995 -44498 -39920
15281 -39920 -42297 -30061 -4891 -5042 -13617 -19305 -20325 -10899 8102 35423 49303 34981 18244
15268 18244 300 -18890 17449 41729 20403 -182 15260 12348 21039 1507 -17004 -24725
15256 -24725 -11829 -10474 -10395 -9581 2013 15863 19264 11866 7816 12666 -11361 -8438 -10105 9242
15242 9242 31611 82 16529 31266 32952 44127 27723 -13512 7545 18372 4013 -17677
15230 -17677 8239 7347 -43942 -53214 -47072 -30725 -15696 -24113 -23859 -11484 -7837 -39821 -48705
15217 -48705 -55369 -16878 -3146 -5286 -8835 -16922 483 -17871 -18172 -6859 10715 -11777 -20135
15204 -20135 23419 4818 6655 43136 55915 37454 31332 22077 25645 -14222 -51482 -2848
15192 -2848 13951 10235 10940 11070 7026 3422 10993 -9660 -6761 -15869 -37814 -29896 -6017 7708
15178 7708 15888 -24368 -41341 -12652 -13301 -33858 -43346 -30672 -33673 -44530 -39338 -20422 -5862
15165 -5862 -7295 -16185 1182 3341 -23209 -36015 -25941 -7434 4847 22178 29690 8884 -8544
15152 -8544 -24621 -47998 -54632 -44572 -30871 -25956 -25202 -26757 -19759 -30669 -30591 -4098 -3473 -14463
15138 -14463 8822 52346 42389 12172 28482 11594 -2033 -30767 -31303 -28342 -34882 -35896 -10318
15125 -10318 11971 19529 -2522 -9936 -1200 15475 30964 6931 -1464 -25009 -29351 1684 18917
15112 18917 10026 -8469 -17740 -13346 3239 15012 25596 39321 35295 -4011 -23304 -8210
15100 -8210 -24279 -38875 -1764 -4610 2578 9394 -1919 -2918 -19047 -19935 -8564 -4688 -33871
15087 -33871 -49773 -26690 -42892 -44427 -30338 -44865 -36654 -39742 -22207 -13481 -31932 -44366
15075 -44366 -50626 -40730 -16433 19719 34718 25847 69045 90308 28441 1113 5852 -19509
15063 -19509 -7485 -8580 -664 11365 8268 -23827 -7525 -13935 -35483 -27783 -24860 -22474 -25674
15050 -25674 -42323 -66399 -63351 -45423 -1309 31958 23625 29417 11284 22030 -269 -17460
15038 -17460 2046 20804 27842 40156 43908 38221 45683 4266 -7090 2556 36093 44581 41666
15025 41666 43865 35347 32109 3984 -5816 -23387 -21626 1836 1513 34126 16459 4113 -1767
15012 -1767 -12122 -16692 -12026 -2165 -10415 5997 7786 -8497 -21319 -30026 -6557 5475 24124
14999 24124 23625 15985 -22320 -47667 -41077 -23218 -13487 7932 18921 10585 16973 -5031 -4450
14986 -4450 7095 -13776 -21652 10535 33447 24816 -16614 -17416 -51370 -36416 -16884 5533 8311
14973 8311 -4609 -2162 10354 33600 41209 24347 28566 21057 17939 -6326 -6954 4315 5804
14960 5804 23034 27256 34815 18805 5617 19727 -918 -8451 -16553 -4577 16426 37890 25176
14947 25176 -14035 -35988 -21552 3962 -239 -27672 -37184 -28690 -47194 -46385 -42359 -44749 -31549
14934 -31549 -2172 646 -37590 -28852 14072 14788 16211 -731 -8231 15561 51355 44491 33329
14921 33329 53366 44018 11844 -18484 -30545 -41928 -31799 -7787 10396 4024 -1299 11293
14909 11293 7439 -2207 -29103 -35242 -26609 -6021 12005 11534 15794 21414 23955 20852 40653 69240
14895 69240 64712 38247 44201 20889 -12649 -34725 -44534 -34686 -5098 1264 -7772 14363 45266
14882 45266 41899 19913 17842 17004 15612 14666 36028 49045 52691 4709 -22706 -2756 7059
14869 7059 2521 -24675 -15213 6509 25383 12287 11946 30907 4133 -13261 -9036 -34360 -48124
14856 -48124 -39178 -28966 1346 -13688 -20343 555 10631 -17139 -30582 -9771 -9510 -15342 -20847
14843 -20847 -1651 17336 19017 7104 6363 -13785 -12934 8666 21211 30545 37526 31396 27715
14830 27715 6002 -4243 -6438 -18274 -49733 -65345 -48781 -53698 -34768 -20329 2027 11814
14818 11814 -11329 -36076 -69554 -52389 -43924 -29065 -5528 7367 7607 -3593 21575 16848
14806 16848 -9835 -10838 -17136 5000 8093 38823 33163 43522 52198 39412 25831 25362 25825
14793 25825 33275 16157 17029 -1906 -22869 -5524 19890 -4560 -3599 8188 25385 32452 22615
14780 22615 -9591 -39535 -18838 -39140 -42479 -20406 -52051 -73680 -74119 -60031 -23829 -4065
14768 -4065 2257 23423 24474 32990 47314 45514 25400 14155 10918 18544 -4792 1903 15379
14755 15379 13600 15857 7073 2103 -17606 -14672 -6998 -19791 -38966 -24627 -20232 -33816 -7178
14742 -7178 1275 -5655 -28938 -60057 -37925 -31913 -44974 -53211 -52865 -29679 -40310 -49857 -51093
14729 -51093 -43727 -59010 -23601 2798 14235 -2146 -16240 -10019 -10246 12274 1179 -10700
14717 -10700 2243 4501 -27598 -44687 -14564 8217 27049 10287 9675 -22776 -24590 -42091
14705 -42091 -50129 -23484 -22872 -10056 24067 15961 29500 40184 2394 -16903 -18033 1422 25109
14692 25109 25574 -5168 -11401 -2266 359 -3344 4040 20191 12854 22576 -2830 -26384 -34723 -36205
14678 -36205 -43101 -59050 -62172 -55046 -41880 -26583 14853 14124 -14572 -11447 6840 5906 15017
14665 15017 2308 -46632 -48162 -12305 -24696 -27409 -50302 -55814 -49818 -64449 -62695 -54719 -32875
14652 -32875 -15987 6931 13081 15967 20691 9294 -10918 -16897 -18252 -11221 -17021 -8184 -20388
14639 -20388 -6506 -3101 -17582 -20836 10994 233 -7096 17015 46872 61473 19725 25434
14627 25434 11052 14369 -14631 -41209 -5426 11507 -19340 -12857 -23427 -2237 -741 -2804
14615 -2804 -20402 -17644 -11663 516 -14694 -11994 -34837 -53746 -40339 -42626 -22515 -25877 -26572
14602 -26572 -64041 -53631 -28556 -15773 -28134 -26126 -7465 17437 52815 20342 6966 29390
14590 29390 22254 -3666 3662 4738 14070 10384 9200 -5276 8764 4731 31046 83750 131341
14577 131341 91794 25050 7116 -19856 -16109 -17038 -9451 -10109 -6715 -33197 -44554 -42080 -23176
14564 -23176 -7749 -16600 293 19222 31284 26176 30363 30199 -2375 -15988 -19012 5074 7705
14551 7705 19611 24376 35768 25714 22656 18282 5101 37526 33433 17690 32476 40198 33462
14538 33462 20373 23827 1800 -12359 -702 27342 10331 -6883 -24850 -32471 -40471 -33860
14526 -33860 -43062 -55897 -72696 -59865 -34693 2732 3170 13916 27132 -2381 -40630 -20104
14514 -20104 4845 22094 20777 -5547 -24038 -11243 5665 -17220 -33885 -27949 -34738 -24235
14502 -24235 -9746 13873 -1997 2652 -4655 -19625 -33684 -16565 -20458 -40176 -31807 -3378
14490 -3378 -2646 15001 11760 2438 3113 24811 36552 44900 24569 16621 6765 -797 -12812 -4840
14476 -4840 -3785 -398 16268 28306 9601 5780 5337 16838 25639 39607 19917 3067 4336
14463 4336 28249 34815 30815 39008 54778 48212 22246 -3 -46139 -49628 -30820 -6723 8244
14450 8244 27328 28812 30430 22173 11570 9325 28454 13409 -16158 -42276 -43940 -32015 2787
14437 2787 38598 21645 -420 22843 48072 53706 64407 38758 34801 46350 38604 32260 30208
14424 30208 22465 12578 8974 -7966 4068 11969 7886 9474 25518 12798 5626 22871 18370
14411 18370 17773 941 22323 52939 58229 61715 74243 84493 62916 22522 27719 76685 84030
14398 84030 78378 67406 54073 36830 14959 -1410 7380 -17109 -14739 -4008 -6506 -3475 9946
14385 9946 -7306 -5219 4657 -24636 -53527 -57279 -45556 -41865 -39717 -35303 -30821 -40148 -16433
14372 -16433 -18347 -11367 -22164 -19610 1083 45602 41765 11331 37422 86811 96401 57607 30363
14359 30363 35341 13716 -1986 -3982 -7253 -13287 -16698 -5816 -19410 -24022 24296 49381 57951
14346 57951 50684 52717 64059 57223 69501 73378 57910 32067 30162 32786 29444 25467 22633
14333 22633 13913 16779 29932 27306 24517 20002 29189 21756 41620 77290 90320 69220 74461
14320 74461 80531 83228 33304 21195 41046 53410 40945 27811 33333 33454 28148 41794 38054
14307 38054 43815 41423 50964 35042 28888 11620 -16876 8223 41959 25056 20314 27072 43028
14294 43028 43514 35174 41822 37968 30056 5202 -8140 -26018 14164 41310 59695 62916 76544
14281 76544 59299 47347 59013 48719 28370 19219 42763 31234 26953 15224 -12279 -25721
14269 -25721 -3672 25296 28832 9038 -13203 -27113 -18405 7377 35981 34948 28627 17031
14257 17031 241 7336 33875 8097 5116 -27218 -14412 -40468 -46320 -21781 -5999 11599
14245 11599 18066 25710 17849 -3072 -18215 -9886 -11780 -26413 -20978 10606 37222 10372 12426
14232 12426 25422 48253 44919 17291 17239 49210 40450 39606 63377 50011 61291 41650 33658
14219 33658 33596 13301 10355 6963 -6639 -10785 -18582 591 10988 -8216 4014 35603 19530
14206 19530 -11946 -22179 8160 7306 14866 31555 20059 26009 8351 24775 43710 41402 31447
14193 31447 35894 50867 51429 58778 48745 32848 33711 20737 -1080 -7611 17614 34355 31943
14180 31943 2696 14451 34070 8519 -17664 -484 19955 57707 48984 51561 54314 56244
14168 56244 34628 30112 15905 -5568 -15 7579 -11862 4156 24112 16471 21054 32919 31116
14155 31116 32068 62530 31855 14068 23582 31485 32346 25500 23835 32026 42297 13631 13251 35730
14141 35730 37221 14152 20857 36712 41920 17734 6693 17188 31417 40083 44012 25724 36458
14128 36458 52793 29104 614 785 -2072 510 -4886 -12613 -47538 -46511 -17104 -15512 -20304
14115 -20304 -14171 5315 26380 39474 29793 7539 -2457 125 18214 21196 -9876 -14652 9110
14102 9110 25991 21459 -7199 -5429 26624 36351 23683 -6148 2860 12231 20281 -11118 -23240
14089 -23240 -3482 11999 -1050 -28953 -41204 7527 28920 45436 13665 -4885 -2287 30165
14077 30165 23695 22639 36036 35850 55288 43244 17997 29729 22217 13427 30229 49741 36119
14064 36119 20491 30219 15665 699 -6864 -1864 10000 21442 62149 64807 55822 63083 42090
14051 42090 -5273 -16721 -18668 -33504 -15907 -1315 -3394 -9091 12622 36290 49702 57963
14039 57963 69883 93689 87158 68435 70347 64612 56164 68671 66231 52841 53585 38311 42694
14026 42694 55119 64574 83385 73559 36961 48665 71005 49761 31781 33369 17677 32921
14014 32921 56835 91279 93822 64111 38932 58537 58434 40274 45754 38165 42290 36632 39669
14001 39669 41851 27139 -3913 -24257 -38025 -27559 -3661 -9707 2404 14113 -7512 -38096
13989 -38096 -9540 -6035 9844 18682 13490 -13195 -21024 18917 21048 -9830 9411 28085 44199
13976 44199 80399 75576 41224 14257 7427 13082 19057 26030 55044 67082 63770 72497 58160
13963 58160 55960 71144 59201 79296 110111 102150 84343 57753 49759 70417 74377 71085 89712
13950 89712 86535 66388 43028 24536 33927 21301 8823 38341 65385 90789 92932 69295
13938 69295 64710 78147 52144 40912 26584 15203 14339 32395 58066 55123 50406 42577 32002
13925 32002 25954 27378 44114 51664 41216 54456 41293 25995 60369 82891 32371 1840
13913 1840 8021 10834 42040 55684 44317 9636 -37162 -20299 16423 40657 33983 40457 65866
13900 65866 70713 75612 92823 89403 63346 44505 25504 25768 13331 -11347 -51767 -21100 22604
13887 22604 20110 30331 46782 43314 36959 31075 29619 39917 34189 27778 26341 556 2326
13874 2326 -6695 5266 1071 12162 30968 23767 8994 -11009 -38547 -19291 18031 56098
13862 56098 66011 44821 47766 63283 34266 12468 24668 43363 40110 24134 22292 26827 50499
13849 50499 43100 29810 42695 72378 50575 41340 54758 48162 42559 27776 18563 60196 81339
13836 81339 54974 48684 72082 78632 84952 94360 80695 93833 83233 31973 25421 57869 62887
13823 62887 46182 30401 22796 43468 55374 67519 91256 67534 50337 36062 25565 34494
13811 34494 16445 10110 12388 25445 11658 18635 -4804 739 24295 29080 19028 22740 33742
13798 33742 16054 26300 27623 36256 58530 61120 62223 54564 33709 21814 43527 46863 39966
13785 39966 58731 37511 22000 22260 24260 50601 46206 47346 60810 39102 52316 2400 -20904
13772 -20904 -2270 15341 39841 26924 24643 41096 20434 9306 2320 -10221 -3827 -12128
13760 -12128 7490 -2901 15588 22204 46670 60401 43149 14301 24145 44717 37011 11080
13748 11080 20506 25485 32906 66872 79610 83368 66686 58783 73768 61412 55634 58994 29081
13735 29081 15692 43363 48019 53672 74407 68838 77491 75370 65796 81605 81008 72911 37163
13722 37163 50300 55148 57789 60554 59446 56004 55046 27262 24325 55384 69205 50839 51107 82696
13708 82696 79540 53269 47174 55502 61974 64381 61155 51224 46878 32602 40840 30213 15096
13695 15096 10690 3985 -4580 31382 62336 35311 36642 72757 65519 73092 56728 46726 31125
13682 31125 40136 43788 67519 71600 52414 35618 49845 23917 5136 10947 26357 50471
13670 50471 68628 89913 85398 66879 32609 53076 65062 23063 30401 45631 48677 59824
13658 59824 37735 42771 51392 76995 81982 48812 19832 29619 30058 25404 48725 51604 56306
13645 56306 40925 29450 41115 42796 49567 59922 59143 49239 43207 14113 5928 33984 57000
13632 57000 81700 95923 86115 81624 63987 40684 42055 21696 27298 75682 82716 77828 43794
13619 43794 56125 66033 65555 75165 89991 55054 65782 72829 72464 46783 51299 56348 36866
13606 36866 13247 18257 19503 13022 29685 68114 103699 107947 77925 70732 79373 86375 92093
13593 92093 109660 91082 82741 41791 46392 81698 69120 48731 57703 54944 85809 90777 97153
13580 97153 78838 74245 85786 92211 84146 57927 58730 54986 68939 61417 62004 70995 73484 57800
13566 57800 38918 46821 43365 53031 54456 61409 67760 37344 34533 44497 33035 65245 91880
13553 91880 86290 89729 88629 114761 138178 126616 85572 73755 72822 58281 84438 124983 162180
13540 162180 160623 154922 181955 194800 239377 302281 391729 489573 550354 546378 494643 453894
13528 453894 391709 334906 299207 291396 249984 256302 241936 227337 228154 216294 221754 195006
13516 195006 186913 201918 201830 165270 143317 148188 189220 231555 203655 164688 157606 174080 202925
13503 202925 212759 180816 156014 166170 179566 189177 172006 213506 271410 314911 405452 489028
13491 489028 615340 815782 1076015 1352756 1528634 1512507 1340707 1105417 889067 711508
13481 711508 561341 450339 352253 294955 287050 235697 203919 204135 204006 205534 179015 159302
13469 159302 139594 154314 140490 132927 112912 128914 130680 134012 150196 162781 174142 193582
13457 193582 154710 173665 206188 200238 208034 228874 256882 274290 298333 362654 449455 580855
13445 580855 787749 1059666 1368671 1575215 1565810 1369819 1118211 863959 647296 525193
13435 525193 431674 363389 326793 304123 270953 222810 225858 227392 223138 220519 212913 169252
13423 169252 170310 170653 155738 119088 112823 124238 116436 121037 110076 110805 127432 151710 123702
13410 123702 93373 100754 122033 148629 172033 200394 220355 239411 220122 228114 305497 409581
13398 409581 467543 515966 509067 466429 406212 337319 270696 200212 168528 191614 172679 144063
13386 144063 150331 177472 190630 182018 142276 141344 123500 93602 91549 65423 43966 62933
13374 62933 75085 94063 126248 134451 119053 116977 119660 95826 88354 77820 63787 67928 66291
13361 66291 91535 105007 111963 125416 114786 118240 116816 78348 112920 137819 118792 106483
13349 106483 99268 78984 83706 102497 111740 88418 100393 89212 70083 73945 79441 72809 66291
13336 66291 59284 68767 71084 86637 85874 73042 71770 71213 53231 50943 63762 103018 101125 90327
13322 90327 81737 69511 92306 125923 128667 100535 84741 76278 41371 49274 53475 42723 41118
13309 41118 45107 53402 71188 62178 39982 61094 81613 92170 81706 82887 94317 96131 119004
13296 119004 104775 90729 97991 92860 73473 61446 53130 45320 34326 52325 62174 47275
13284 47275 52272 71716 84565 71996 73441 78557 85181 83553 88350 88462 74635 66546 62049 67790
13270 67790 71712 52910 64654 101706 130416 122227 77384 65117 98908 109017 108151 67169
13258 67169 54159 79061 79817 75425 86799 89970 97805 95981 91883 79265 58062 85844 80131
13245 80131 75009 85728 97181 125851 131658 103428 94591 108968 94050 113918 115739 87876
13233 87876 85691 78159 76619 90792 103493 102551 83157 83239 81481 100076 114284 124954 95933
13220 95933 76066 74479 86624 111184 123023 96679 115774 140416 133453 127764 146535 130500
13208 130500 98212 73601 87774 109489 97684 85671 59265 65556 83354 107671 124264 147211
13196 147211 162411 154863 153671 135265 89502 73045 63533 74211 91961 102969 120836 86521
13184 86521 89518 121691 126902 99781 91856 111526 126165 110048 112411 129136 105802 79337
13172 79337 76587 103423 124097 119848 111068 122515 146854 128277 98719 77880 62580 79032
13160 79032 63211 72210 86955 96081 81693 99881 139664 132273 125486 105091 102398 87168 84010
13147 84010 108646 115570 109779 85431 84308 104400 106894 122931 141467 140609 142791 130422 123979
13134 123979 106918 85391 86887 97945 108749 89286 81535 106037 100548 72174 41529 72019
13122 72019 120630 145765 146982 128072 110361 119638 123706 91365 97422 100025 95632 87067 79566
13109 79566 133236 179477 198096 192281 199783 179320 171265 149588 99908 76759 87691 100435
13097 100435 103480 98585 93199 121072 150265 156752 171323 155112 132241 138413 139360 126169 143370
13084 143370 142747 125436 102656 115757 129722 129623 127520 114608 105506 98730 109249 115000 121077
13071 121077 150709 190995 157886 143860 141214 147529 180886 188946 153378 142128 111935 89717
13059 89717 104510 113261 110452 124477 141533 138963 140496 149203 149720 184984 174493 131904 147087
13046 147087 142790 124423 131635 126093 125205 124368 135674 108595 89423 80664 87005 114717 152102
13033 152102 147085 150878 143416 133688 120204 106717 124402 146873 142931 148087 165027 174409 149036
13020 149036 121454 129184 175155 187676 177329 151184 137075 131195 163476 168144 152184 176822
13008 176822 197876 205418 203042 171322 160384 172253 185449 186892 172663 155010 168605 169123
12996 169123 158462 174104 178826 173530 145274 151072 126826 102368 117104 147641 158573 150683
12984 150683 150624 171273 206254 194441 163539 149526 141600 149257 161570 152685 119817 117853 124916
12971 124916 133798 151870 153857 163074 174555 154015 117459 115903 126192 147129 142385 159105
12959 159105 158765 168408 169656 148452 133411 123691 163444 183872 195020 185355 220496 205541 231172
12946 231172 247816 226640 201735 193262 187553 157373 142786 156245 171447 178501 179961 167423
12934 167423 154184 151902 146071 139384 172683 160012 157225 145062 143107 158916 180544 194215
12922 194215 196752 220821 221781 196089 182338 144854 155949 150644 146089 191093 202654 179382
12910 179382 183322 183395 163434 187206 210403 178473 179071 204007 202005 148827 146238 174142 193826
12897 193826 167003 159485 187359 169448 160509 146710 163721 196191 191208 168457 183018 169514
12885 169514 143835 166670 204323 208955 198674 203976 200212 195488 199511 203504 187203 195765 201312
12872 201312 180892 181324 183193 192226 192920 162323 133451 157279 181495 196294 214613 206087 214563
12859 214563 223416 218174 214521 227134 244591 248739 221866 212770 225094 242259 215787 226640
12847 226640 218043 219582 197133 194725 188230 185338 179958 159031 165684 205745 228545 266270 270628
12834 270628 244943 235238 233840 234120 245217 200824 191778 192499 183762 174776 163051 201933 227533
12821 227533 233692 232044 198313 215361 220192 234002 247119 242468 238850 221866 240290 246066 229869
12808 229869 258173 248251 232746 247609 249029 266840 254280 247717 218878 179398 192538 208718
12796 208718 199824 210358 228670 241580 256890 219737 212708 231018 245228 248371 214502 197053
12784 197053 188231 187500 199860 201025 202567 205853 202101 185031 193498 162311 182744 214555 215110
12771 215110 196936 205315 214248 218595 212296 226938 229526 258769 270234 248272 236334 252497
12759 252497 238313 222780 223403 235246 225755 221799 231175 232880 238236 220818 199903 205726 205425
12746 205425 231151 269633 255063 258264 295035 305015 294013 303189 308637 335945 427946 487325
12734 487325 583361 672514 692199 644317 574009 499591 417974 337663 354521 353398 342244 316524
12722 316524 287594 269260 240180 207546 192560 217028 230891 223803 227564 219538 201834 235294
12710 235294 274091 299917 314855 285936 253356 246424 266089 263912 243927 230300 243791 270280
12698 270280 300163 291277 259912 239268 235924 227899 213660 231432 262022 286723 291523 271114
12686 271114 258236 241237 236066 236614 255818 242621 255159 249829 240732 227979 208625 235000
12674 235000 236004 214379 219739 225958 221238 228540 224771 229070 245121 250382 261199 230333 236676
12661 236676 267133 312102 285703 254957 229192 230429 247413 258131 280935 294825 288909 264194
12649 264194 243729 246504 254536 277099 281712 276377 246912 244329 242304 235311 218496 219301 227832
12636 227832 227825 227757 230559 223154 228952 263388 275260 280496 256624 244869 256804 256910 270967 285339
12622 285339 308708 314632 324517 348116 347048 327324 305296 308011 315651 341134 339066 328037 326166
12609 326166 312302 310253 285116 287769 288177 267622 259248 274972 273498 286450 324048 326953 342877
12596 342877 326912 319912 320190 358097 355574 354270 357470 329980 339823 336477 333409 305447 327382
12583 327382 345237 317891 295765 315569 321720 328041 338319 339126 337681 336832 328690 327587 345974
12570 345974 335398 350661 369106 368769 394421 411471 400056 364784 336119 334104 338851 365286
12558 365286 363488 346539 328021 350841 362299 364814 381464 371327 325155 318174 328232 328702
12546 328702 332551 350716 341012 335533 338035 331690 346110 354431 371307 376073 355111 373479 375208
12533 375208 366257 359510 336329 351886 334925 329635 349906 351770 362999 352226 340735 334485
12521 334485 333086 353807 357996 378965 349669 347818 369343 366791 348326 339349 318225 313625 320176
12508 320176 356143 410589 436086 438367 415918 421950 441801 423724 396542 374264 411908 418378
12496 418378 413422 439528 420283 438508 437807 382566 366408 393494 408764 398179 389306 419672
12484 419672 402353 407823 395466 390113 389846 395039 382497 386970 384708 396753 402221 409122 405751
12471 405751 413956 399992 405760 411971 436510 449042 452787 479183 472694 446981 405264 398072 431848
12458 431848 432212 423233 393276 398572 398312 379501 386981 421264 418059 393357 370274 377837 408168
12445 408168 423525 437403 429055 423023 437009 441953 445267 437622 449379 436123 441714 459733 457438
12432 457438 449353 475433 464819 455341 460631 482213 483469 465456 475014 468005 453477 436285 445392
12419 445392 458569 493024 507695 480418 489794 497350 503055 485489 474756 475624 452522 413034
12407 413034 411497 416264 435532 450265 461866 465359 494264 505732 488800 462542 443535 440895
12395 440895 472037 466966 461122 458806 468830 478905 486952 499571 483347 488925 494596 510230 521117
12382 521117 537877 522475 499674 500926 504327 512372 517461 505028 485234 486681 454135 458316 451564
12369 451564 460408 488825 511582 525057 539111 547039 542083 511105 500708 506608 487165 469713
12357 469713 487025 497803 465308 456835 466677 506833 547732 542213 537280 527804 515263 538392
12345 538392 526352 536995 545099 552907 544338 520834 491343 500173 517027 521502 538042 548072
12333 548072 558498 557587 556810 565595 579513 599233 572796 563494 556920 547375 548899 545047 545069 555271
12319 555271 547777 542518 554807 563913 570325 525055 526915 537713 552150 538943 532243 561466 563441
12306 563441 575303 610025 611942 593325 579813 572931 576484 549775 546897 529603 570787 579128
12294 579128 610444 605595 563730 559955 560012 553481 555450 564897 574197 631470 636148 617756 596937
12281 596937 597057 606906 620471 620151 593973 623006 642343 648161 651538 665252 652871 650229 624606
12268 624606 627964 641477 673546 652580 625728 621938 637312 662160 672869 678148 683850 679537
12256 679537 651753 621558 603173 626544 634358 601491 624072 666854 696904 684876 681369 668807
12244 668807 638368 652496 642305 624272 655638 667923 675467 687122 686146 707561 713319 704116
12232 704116 711798 715048 734529 695915 677261 690855 679083 693649 707680 735950 731151 672055
12220 672055 652750 698798 740499 710600 705551 723236 721114 720971 710225 701265 691883 677750 664189
12207 664189 691270 714559 706365 725733 726818 707785 719599 735615 724700 696450 696660 709249
12195 709249 723345 722598 704576 728526 751150 737642 765783 769097 743647 733334 700009 726539
12183 726539 747776 739064 687551 668177 670078 670517 729401 755018 775675 768798 739855 722582
12171 722582 719909 726402 730975 735607 756973 759947 747047 756793 757597 773743 766834 748094 749263
12158 749263 748694 746786 765433 777691 785471 783114 771050 790113 790788 759193 750299 783801 777602
12145 777602 780728 801565 826759 839985 852931 835909 870705 902051 904454 882244 840476 800207
12133 800207 792021 834043 865620 873897 847686 821075 802209 782830 792545 812607 820652 827032
12121 827032 815118 829274 836702 830073 826108 796958 803069 821671 822589 811654 797159 803935 830269
12108 830269 833473 813477 808082 830174 835919 843344 830755 830482 872475 924100 959642 1009841 1084112
12095 1084112 1179166 1240554 1245209 1182465 1085377 1013948 992210 951714 915379 885866 865526
12084 865526 867161 863540 853606 849273 848437 856754 906189 927349 919588 912479 913078 903535 894649 891609
12070 891609 902855 902739 909802 929709 918894 919839 915852 911784 927590 940761 926869 919629 924559
12057 924559 924146 918177 960225 1013438 1063297 1137813 1230691 1288107 1298807 1258258 1163299 1081469
12045 1081469 1024039 983163 941410 932508 918540 876463 879219 903824 913217 902870 896377 904273
12033 904273 883814 877642 899018 914864 916830 911075 903153 864080 863755 867334 861616 872738 910941
12020 910941 891498 893906 900533 889626 899102 903009 917168 925992 924928 924590 929544 929437 953995 982096
12006 982096 997311 1013485 1010965 985748 988524 973657 962824 945827 970638 960811 947024 926029
11994 926029 921669 913631 926434 931359 919225 913679 891368 859151 840451 848095 855733 844205 843608
11981 843608 870226 879562 918551 924190 906449 917016 921449 918473 897926 897046 917824 955167 956459
11968 956459 933674 897605 899313 922863 928755 926134 898510 892104 881747 901964 926644 899103
11956 899103 867641 864253 874334 887008 903153 914538 901656 903546 900888 883705 896711 894432
11944 894432 879859 914942 910757 886911 882833 892489 919810 934004 936042 930291 917055 895548
11932 895548 861053 857392 876832 901328 866907 860829 893023 930834 927289 919230 909727 886761
11920 886761 852554 879966 882878 841058 832769 847021 861276 880910 875594 853276 875081 880759
11908 880759 872499 899193 917373 924689 918802 890279 908149 911163 905484 906674 874587 865225 881542
11895 881542 889978 884921 873118 866600 897172 895673 872028 840938 846200 849201 885179 894485 886802
11882 886802 867796 896063 943558 908737 863357 860672 902160 921361 885455 883844 858705 839780
11870 839780 851271 889439 901914 896275 844271 837468 864976 910127 895342 848000 821974 793321
11858 793321 826224 862402 855613 856524 875691 894554 888565 874109 851923 827805 846437 867278
11846 867278 845765 822444 821447 846766 877384 886727 876179 864625 849757 851244 854563 859799 838998
11833 838998 869041 865267 856527 839593 803864 796555 793427 811287 832634 834053 856610 835122
11821 835122 826543 793519 799179 807425 810171 812047 816237 821866 810934 819817 808117 805698 837555
11808 837555 841374 811971 813190 829824 815344 789957 793855 813848 809812 803875 801675 796886 808079
11795 808079 817424 815464 805686 804684 781335 773256 775265 789381 804217 793445 786385 807435 831194
11782 831194 834899 818914 828252 773573 758635 736625 749147 766899 757250 782165 790277 773588
11770 773588 775939 771012 749202 737341 736557 724978 738663 761352 776587 755181 748056 723128
11758 723128 717666 722366 749084 747281 728297 730895 744802 726670 705701 729976 714500 699800
11746 699800 723498 747259 759674 745615 750472 737878 723521 732544 717874 714638 741725 760912
11734 760912 759368 728327 737936 756580 737685 728597 704836 725138 721524 721704 721527 721495 707892 694947
11720 694947 686201 674186 653422 648152 686011 707794 674503 671052 704099 715232 710294 697581
11708 697581 683642 680297 694981 685384 675441 686459 690049 692126 684487 679138 650049 644919 652993
11695 652993 670854 679207 682858 633790 610226 651097 647925 643681 622993 627523 641208 642736 664730
11682 664730 651597 620950 606464 623134 653172 669839 649331 639986 626591 624242 607947 576838
11670 576838 581797 603898 627826 639007 661259 642644 620013 619021 607089 627530 643305 620074
11658 620074 598727 598680 603752 582845 598178 613891 621946 635220 652718 640446 632026 621414 600577
11645 600577 604761 624469 622814 605795 594184 566581 541537 535655 561301 593477 620340 592508
11633 592508 582721 578308 542534 520790 545197 584653 587148 591269 607865 600560 602601 581458 536596
11620 536596 543851 560135 583006 569807 562840 570785 581747 569198 563679 543655 527826 537396
11608 537396 551815 567721 568910 546929 533950 539524 518851 500144 517781 512778 497318 497004
11596 497004 506195 531726 548299 529698 513130 512542 541787 542663 539962 519229 546246 537023 516735
11583 516735 532711 556061 553406 542276 535683 510669 504163 491961 492274 512654 511172 522329 487631
11570 487631 470786 467671 479874 489854 457466 443039 463852 463039 475387 467409 473024 511968 541570
11557 541570 511776 500348 459134 438958 440170 461139 495248 503010 481280 488826 460106 464069
11545 464069 461314 462837 458625 472260 430715 421294 432513 436809 437693 445108 449863 437863 435562
11532 435562 419121 401737 407786 411954 415318 432227 458485 448539 455480 462335 424454 400884 422492
11519 422492 437305 454929 462970 442596 426485 423051 389799 378025 406217 413078 396764 395862
11507 395862 417360 414377 400052 423541 423097 406846 384616 400888 435264 442979 409916 381348
11495 381348 357931 361565 381124 373835 387182 391926 446845 436920 431769 427764 402015 379740 408538
11482 408538 433083 389508 383248 404837 413517 403726 407887 416667 412654 406629 418816 442075 435401
11469 435401 425808 397599 403383 369508 342078 336446 348106 357258 369034 386789 382616 350605
11457 350605 354942 372842 383018 385750 405164 406992 358928 328867 333054 347041 350200 343083 327645
11444 327645 337410 330165 323665 334291 355449 340024 353359 366577 348762 358513 352572 371996
11432 371996 363215 364766 352829 360887 370637 366828 350726 351767 366559 376236 373953 387968 370362
11419 370362 361080 352654 357036 355457 368675 388224 378177 352037 349703 350491 378162 389306 372046
11406 372046 333079 315163 330852 335555 324742 299306 292302 306371 333939 340944 320291 316330
11394 316330 334934 339350 345713 342775 338109 343047 348615 333208 327070 338075 334403 331424 371996
11381 371996 380224 363085 353345 346853 365699 352945 340866 343651 322730 303504 313077 332377
11369 332377 327451 330638 330437 346392 342055 328813 312384 326242 340840 361783 339702 308193
11357 308193 285803 257093 283025 315370 301228 296432 297666 255567 274436 297236 294431 274898
11345 274898 275482 287795 289506 277456 272158 281961 290811 295858 274224 279763 302664 309072 310445
11332 310445 326266 319867 323587 317475 313687 346881 326540 298098 269465 286789 311592 348559
11320 348559 358397 349465 347058 370242 450390 541051 629717 726840 881800 1102795 1384535
11309 1384535 1656218 1752366 1643295 1396407 1122363 894015 731804 641193 562551 471554
11299 471554 400819 378745 372548 337979 327901 305460 305063 302828 276112 284406 264270 259670 252855
11286 252855 259449 261636 264186 294355 301713 270074 234587 243050 252405 266995 262660 245158 230740
11273 230740 234118 254676 257907 253952 224633 220240 229254 230763 193692 170536 194333 220156 202717
11260 202717 171583 173080 162459 169389 197809 189730 204114 212616 187496 156178 157995 165887 184929
11247 184929 194707 190039 179270 176363 165208 151232 120841 160644 193101 201816 210655 192834
11235 192834 187453 177789 169992 182237 186737 185445 164800 166841 195613 185529 192359 198946 217735
11222 217735 196569 176913 152001 170885 200829 208774 231332 294791 364952 395063 384725 406149
11210 406149 450869 520809 591358 713471 945854 1368836 2086924 3095257 3995067 4496856
11200 4496856 4722340 4594035 3957858 3051393 2217635 1590165 1171658 898170 746450
11191 746450 658661 563095 489968 453225 418699 415827 379617 316085 297709 285278 282786 267860
11179 267860 234728 213528 224897 206995 187515 183126 172763 170212 185296 190707 176808 175583
11167 175583 157922 138168 142469 180623 201820 228530 228568 205453 222751 248213 284054 329629
11155 329629 358089 307636 290457 276806 248284 236827 229632 202822 183278 189783 198408 186842
11143 186842 154704 166644 157037 171382 133058 94572 104468 111280 124620 154672 161052 114462
11131 114462 77868 87588 103618 103278 102256 124138 124595 129565 177800 165620 132906 125918 136778
11118 136778 156572 142698 108469 127864 149945 143273 120563 99607 91641 82940 99384 100597
11106 100597 102417 109101 127172 93723 66950 46041 25113 51332 50320 32243 52474 73502
11094 73502 95661 106714 115168 97953 82220 83998 60758 74344 84719 102128 109069 104996
11082 104996 117123 115396 98222 82843 65077 91023 110382 121808 105664 104734 105843 123524
11070 123524 121657 120486 122470 122247 138782 137684 110760 88389 114239 159569 160749 147583 142583
11057 142583 121712 120351 99297 97981 104317 95990 134954 159347 166777 171587 195001 190180 170867
11044 170867 163092 172707 196595 176879 198741 216175 225367 253511 318358 341630 372914 428703
11032 428703 455623 456404 439904 442935 504132 562011 566394 537103 531045 532717 544855 563227 545494
11019 545494 506026 453587 405826 360562 317336 299805 328297 387915 429332 415347 417422 427411
11007 427411 410270 401869 338744 298233 295642 331092 330523 301561 302736 298921 308561 328848 305132
10994 305132 288934 274196 251610 246156 251184 261442 249945 224075 234480 256111 252741 273641
10982 273641 279438 289302 296299 292393 317474 355059 366590 371679 382521 405480 413429 443148 505859
10969 505859 582776 650671 687840 667734 649198 679099 732297 716894 712856 773942 837038 905903
10957 905903 997095 1136824 1346144 1676741 2275246 3178995 4067206 4507378 4636480 4842979
10947 4842979 5113768 4963617 4349181 3645944 3087490 2755927 2586807 2519778 2557379 2664874
10937 2664874 2798077 3002466 3243095 3542746 4056815 4871877 6024148 7610509 9431665
10928 9431665 10684815 10938497 10491836 9937617 9568839 9226626 9014281 9021037 9265556 9796619
10918 9796619 10629173 11772220 13288205 15288644 17734530 20565005 23973777 28343893
10910 28343893 34221796 42464412 54400585 72236645 99612687 141469391 201224049
10903 201224049 269129300 306334564 290796653 244820454 190677344 142833459 106477241
10896 106477241 80874759 63211043 50953408 42303096 35968560 31143530 27161253
10889 27161253 23685366 20684110 18166841 16117276 14479103 13174796 12196472 11442243
10881 11442243 10907090 10499411 9978955 9225218 8376359 7588726 6873638 6269688 5784574
10872 5784574 5343489 4945857 4603317 4311852 4053131 3792982 3531610 3368564 3217697
10863 3217697 3079107 2936592 2823730 2725581 2617774 2538469 2458556 2387232 2323362 2291204
10853 2291204 2306915 2335648 2304405 2271888 2234621 2171648 2115092 2023291 1937766 1864529 1795721
10842 1795721 1743966 1673890 1601181 1543537 1506072 1455360 1400297 1367424 1319090 1266104 1245611
10831 1245611 1233315 1206168 1178107 1161433 1126536 1071597 1055592 1033720 989198 964453 982802
10820 982802 973304 924879 905953 936205 910529 864278 834564 815267 810901 808399 798119 775531
10808 775531 753153 705422 715291 717456 710550 732358 733819 732270 714500 674347 668750 634627 633470
10795 633470 638891 620635 616980 613850 610961 595094 542978 491961 499182 522227 525893 554617 565936
10782 565936 550308 531492 504600 464491 469610 517998 580130 610750 629735 601937 603116 594133
10770 594133 597800 603019 554077 525055 517087 529535 530059 523063 502639 524618 518578 501372 516596
10757 516596 515981 521768 535345 547135 536944 553962 588793 589817 588607 580947 561864 502760 466437
10744 466437 448755 425020 424563 455557 450281 427180 437003 460897 459285 411810 338960 292046
10732 292046 312248 362465 398797 390922 372425 384756 398256 408128 417447 425363 428343 421029 401013
10719 401013 383188 400922 385446 372137 405184 388861 368363 371964 410686 374116 339912 375536
10707 375536 409272 432261 456949 422161 384289 363198 362284 364031 371415 391152 382467 363917
10695 363917 357805 334953 330461 338255 326702 328690 298638 264691 268049 310103 344732 344990 333192
10682 333192 343908 336747 324610 338430 361401 353701 303800 299976 307570 317907 320979 352791
10670 352791 351899 347043 352788 356641 358589 355474 352961 354624 374896 380148 380632 378251 374273 422414
10656 422414 446126 461500 504363 534795 533659 524228 517610 535148 547078 532655 522855 513667
10644 513667 539802 563865 577783 619952 658480 668014 728259 806819 885419 1000976 1139730
10633 1139730 1306907 1530688 1716365 1843648 1901715 1939517 2010589 2159892 2351708 2660685
10623 2660685 3127318 3754542 4597474 5752003 7187507 8999649 11306804 13962537 16435438
10614 16435438 18056863 18563634 18205012 17551885 17099697 17197096 18098260 20060627 23293000
10605 23293000 27874926 33308015 38096898 40445293 39842964 37295709 34202079 31630184
10597 31630184 30316578 30592431 32725472 36854363 42883106 49801210 55237125 56619287
10589 56619287 53634606 48127244 42069452 36854129 33229174 31407766 31363798 33026957
10581 33026957 36104939 39619511 41842862 41223126 37859377 33041256 28145561 24022644
10573 24022644 21073879 19311980 18582305 18669993 19339823 20108654 20227847 19257452 17240848
10564 17240848 14689395 12112271 9848107 8045155 6652650 5631556 4843869 4253414
10556 4253414 3747715 3357461 3075433 2854661 2655015 2472053 2287915 2108915 1965748
10547 1965748 1859825 1752613 1647427 1522209 1422613 1358251 1316077 1275458 1216723 1178794
10537 1178794 1153087 1091048 1039324 1005523 1011614 978665 980048 970707 951049 934031 913072 905294
10525 905294 904005 900006 915154 913354 898924 851164 859288 913165 945349 934257 892320 843641
10513 843641 798838 789166 777796 721595 690634 711271 726300 695147 671412 678750 670794 656472
10501 656472 659664 706873 739544 767944 783402 843361 947501 1080087 1282325 1572851 1851372
10490 1851372 2006887 1948265 1728090 1474778 1238162 1051734 903514 803578 745544 706279
10480 706279 660352 597478 595780 587467 556679 544273 540514 521460 505055 502449 463013 423473
10468 423473 436030 448471 439640 415074 452901 465420 465497 486036 456858 439592 416188 400080
10456 400080 378154 382155 397361 422235 410305 404200 402848 410557 418310 399516 387353 364653
10444 364653 351181 331048 324358 338243 320345 316615 328752 293767 302945 291234 305125 312038
10432 312038 308572 325445 334003 311498 274447 271966 283342 313028 322790 317590 329805 316725
10420 316725 308942 303027 292930 309962 300923 265749 265369 286245 280968 281389 301473 302590 312078
10407 312078 326432 327187 329781 303515 295687 275877 274166 288444 315815 328774 323208 304745 297649
10394 297649 284030 284202 274283 265233 261471 260973 250691 238494 228542 229894 226135 244527 290380
10381 290380 301571 276108 268268 275595 277684 282079 270375 274781 283361 299216 290415 272205 248929
10368 248929 223067 231131 238647 268930 260421 244435 213553 198313 207664 198220 218739 203832
10356 203832 215336 240165 249315 226087 219148 200337 195056 187542 208636 220135 209769 210676 220057
10343 220057 232582 208072 206115 206575 196522 197445 223508 246087 239965 239895 235359 229814 235120 222522
10329 222522 224237 211975 194462 200417 225990 215819 159806 155500 179809 182398 209106 225765
10317 225765 214779 210137 221981 224546 220246 211970 188989 189697 239151 245408 234195 198716 176751
10304 176751 168876 181857 199275 203161 213977 220578 214604 183222 188077 164794 159364 158371 143082
10291 143082 158208 212665 220618 207945 191662 219455 226215 207972 214559 228680 242852 231899
10279 231899 211398 218346 231489 206926 206068 203106 211507 212100 228129 245932 225629 219768 170251
10266 170251 160984 187112 195354 176379 172653 144818 123741 119848 106418 128759 160039 172847
10254 172847 171435 165026 150543 156169 200489 192798 169907 144023 131574 107617 94064 85838
10242 85838 104015 124029 124411 134671 160821 213231 230477 208904 190857 166071 184352 205773
10230 205773 192617 155203 127849 157050 162754 152647 150569 168125 182388 150012 144933 145899
10218 145899 147080 153913 128869 137930 162208 139211 121242 126889 124076 124308 114805 112003 115718
10205 115718 115162 116573 146484 152763 148277 134260 117342 106140 120674 111250 115133 133621 129962
10192 129962 114941 127388 134892 130352 121440 128237 138917 159029 183469 206486 208920 202429 175957
10179 175957 203904 252258 251177 206143 201133 233375 232159 205499 192837 214321 252511 289405
10167 289405 293780 320270 338463 345334 326867 322959 330481 308615 285289 290720 313682 362233
10155 362233 413803 436891 446273 443290 420168 379980 345046 298415 314443 308811 294295 296863
10143 296863 326560 355917 328001 288916 295904 297319 281744 262671 228691 230600 255667 237515
10131 237515 231286 230373 217111 190618 184762 184554 191691 168469 145066 151812 136175 139974 143213
10118 143213 152597 154682 142347 140147 129022 124175 112496 103815 105967 121194 111132 109957 89931
10105 89931 91687 118902 139987 150958 155476 146713 140092 137411 121939 96406 92055 83140 78774
10092 78774 56544 69865 75407 70670 54428 32525 45104 64535 86761 108332 118603 113366
10080 113366 96979 126652 133538 119404 128348 115191 121090 143338 148383 137724 144001 157256
10068 157256 118478 99396 98217 123833 129743 121566 113398 110653 113250 105292 105581 102597 83020
10055 83020 89715 118509 129352 124510 116100 107094 109211 110837 116814 107365 73713 76396 87084
10042 87084 139759 157225 180970 188564 129984 92015 100246 100274 102464 97252 95930 87690 96416 103021
10028 103021 97900 98833 96435 73381 103045 119838 140822 156566 157680 143679 122341 120830 109546
10015 109546 89092 99622 90119 89010 104667 91329 92657 115263 118593 110084 63198 51089
10003 51089 96885 100764 99184 116695 100786 83962 57584 38972 57575 80243 80379 82962 85727
9990 85727 83781 105730 77250 41614 63850 89004 79777 78177 88346 57852 33524 44213
9978 44213 74149 107561 115207 97914 107758 113974 111712 108592 87930 82141 63493 54110 70345
9965 70345 83550 78246 71251 91086 101191 94385 100470 103985 77563 47671 46588 57119 46002
9952 46002 37777 81465 120421 121961 90231 84194 86056 85830 91975 91795 79573 107778 103768 118549
9938 118549 130553 110790 81778 66848 74186 38921 36040 54382 38015 23432 13908 37527
9926 37527 57750 60681 60834 62844 49931 74440 83845 92957 92470 67952 44333 33684 57858
9913 57858 86647 78951 56028 72785 89862 98222 72487 80339 65379 54576 54788 71717 85492
9900 85492 114306 140681 113345 92332 109859 113352 121496 77808 68139 76474 66575 67980 70066
9887 70066 86880 109457 102123 78531 62701 85693 109687 84537 65023 42944 46212 63995
9875 63995 56569 60998 94720 98283 59471 55617 66003 79975 102525 91912 76860 65938 55841
9862 55841 69863 61510 31529 28479 37723 74143 89993 96101 93407 105152 117906 108831 93378
9849 93378 71790 80051 112029 125852 109793 83616 61925 54829 68902 98041 95706 112786
9837 112786 94121 74716 51679 51777 43356 42834 39856 57657 63933 27449 18174 13355 317 31638
9823 31638 56022 73835 68875 101278 133395 111147 93485 108105 115638 68539 51021 31262
9811 31262 27584 33534 57223 64114 50868 39960 53222 59368 64806 46262 47015 60376 87461
9798 87461 59418 48669 43091 70800 82424 78122 64477 66620 83512 52430 35276 52049
9786 52049 81411 66060 56279 68678 77625 69111 41904 51608 74238 61208 70854 78193 72873
9773 72873 49752 58798 99218 81320 68825 77100 71326 59715 67775 55912 49344 48989 50961
9760 50961 52349 44527 47645 48911 46854 49511 75031 70053 34828 21582 17224 15574 18792 23337
9746 23337 41797 73460 77806 60651 43102 27120 71287 83686 92053 56545 13459 37479
9734 37479 23180 28441 45382 39980 38271 69159 64538 97354 123769 133470 123374 112805 95031
9721 95031 89061 84673 63221 37169 31717 42130 50123 39583 47810 53645 22770 20034 31217
9708 31217 36805 45682 14716 6812 14901 25091 19656 8435 14734 55033 100159 119758 130183
9695 130183 127969 108488 85809 92840 80045 94821 60581 62528 92025 95541 98206 112335 111501
9682 111501 91416 68290 61481 74683 68804 63135 35475 39934 60316 55156 70046 82090 75143
9669 75143 82224 75133 74238 77387 79917 79009 75243 57985 52436 69053 113430 134785 131488 142219
9655 142219 157421 193375 285932 440878 641574 725926 660708 513175 373902 266643 192265
9644 192265 138236 138046 142425 141861 124257 111578 101547 65817 55177 55944 70787 73296 77586
9631 77586 55984 39732 48419 50360 61682 76535 70457 53333 67246 56181 39359 49143 58915
9618 58915 68926 51889 40168 28554 37318 64422 78481 104821 114112 119298 131819 100810
9606 100810 103659 91736 72648 74255 51872 68337 65653 49519 27206 1613 26597 12372
9594 12372 16622 23307 12581 55538 55440 51626 59897 73346 77942 56301 29478 40251 61240
9581 61240 56870 71943 106244 88793 74308 61454 41026 34862 17449 4873 36432 42002
9569 42002 27931 22607 31907 35671 28907 37184 62666 54107 53457 56444 64028 61068 25106 43264
9555 43264 60253 25816 10189 26318 52281 64119 55091 59172 54880 43011 38230 42045 25095
9542 25095 19873 18375 54977 92039 86871 92817 98313 96547 94025 112464 98861 71342 50656
9529 50656 36252 45120 71487 66299 55548 34877 42493 41519 11157 -5998 5929 25907 48645
9516 48645 14137 11604 9035 37070 58715 61345 83314 68587 27746 20121 24361 45148 66896
9503 66896 77660 57314 61391 73383 66773 50832 68098 77168 91986 110869 112698 101382 69814
9490 69814 51401 54909 65375 63103 71281 62411 46917 55249 17264 -635 44961 50519 56067
9477 56067 38633 39605 35028 12411 12700 36066 41924 38161 61296 57512 11951 1692 53826
9464 53826 59025 54461 35800 40320 31108 29526 61970 83647 100935 95543 63072 52942 58975
9451 58975 61033 49965 21112 26666 32293 23402 34706 55508 38329 8801 9733 44051 67606
9438 67606 65729 72193 77526 73013 78221 69602 64097 62703 35995 16996 11157 3633 18381 11945
9424 11945 14349 31104 29261 19660 45703 70359 84381 98968 113958 129243 88658 70013
9412 70013 76504 62469 58560 39673 3206 -32589 -15066 26917 42810 43901 20833 38780
9400 38780 44662 28040 105 -8263 11978 20980 30815 44012 31030 14400 13593 30781 31098
9387 31098 25481 36963 46481 49274 34084 32714 12255 29258 44034 53374 59816 50951 39912
9374 39912 49276 63305 87011 88530 64909 53799 68875 55112 53386 37872 46303 52920 37157
9361 37157 35161 39636 47183 57031 42000 18449 13855 23540 74086 105212 118136 105098 86303
9348 86303 70573 36527 20196 17350 36007 51733 48196 21622 14878 50009 76009 44243
9336 44243 21959 29642 49828 45051 4292 -6316 21474 22744 3330 -7476 4318 19834
9324 19834 15071 29103 20790 10234 4863 -21335 3450 48927 50857 57114 52160 71259 41622
9311 41622 -7903 -7053 20162 57275 60408 35016 40492 53411 56497 56812 39604 27530 36771
9298 36771 53554 62018 66948 74832 78139 61468 32052 19480 32250 -894 30814 38291 48529
9285 48529 66529 76287 68533 66794 75570 83113 41864 1941 -4824 18839 23552 38046 68632
9272 68632 52098 42021 36758 40708 37947 38751 30895 27384 13941 31084 23498 20212 36977 52116
9258 52116 58327 58641 61210 67431 69554 54203 60687 48149 26570 27652 16669 990 28747
9245 28747 57057 80850 84000 53841 21612 6630 26041 36141 34719 -4940 -2679 46757
9233 46757 60772 47510 16659 7578 20360 4719 24710 34911 48994 44430 18615 24492
9221 24492 10525 15269 10213 -4914 -22234 -16819 10717 22500 37249 19197 15402 37969 55218
9208 55218 60398 60229 44484 23203 -7116 15053 32381 37245 53433 62542 36274 15727 22763
9195 22763 24320 -1091 -31688 -5544 10376 16741 16687 32104 11431 6144 28889 28814 33431 45716
9181 45716 61436 29242 1694 -24384 -29514 12423 42747 53225 59461 54924 40184 9159
9169 9159 14766 22761 22910 24917 10945 19227 683 -30 25102 32825 7399 25195 66549 54853
9155 54853 45394 25452 10655 5408 -127 -4629 8069 23034 32021 41781 40828 12435 793
9142 793 6347 11781 9658 11062 30791 47168 17163 -14575 -22142 1680 29918 37268 12024
9129 12024 3385 6984 31106 20178 -3394 13570 11841 33472 34976 43058 59394 36894 -7268
9116 -7268 -645 32567 45610 51403 45463 34034 25021 25929 47138 61063 56415 43123 61078
9103 61078 50308 45505 60436 51546 43791 35681 21861 18140 17083 -8448 -33577 -51415 9199
9090 9199 38095 21026 8327 -38275 -31191 -1640 -4056 11309 44898 39011 28695 24764 39591
9077 39591 56247 62404 26348 21194 51429 83325 76983 62887 38475 4477 -12119 -16333 -954
9064 -954 5121 5819 2063 -2756 30283 43128 52920 47828 51544 48689 33961 27293 5158 19407
9050 19407 27681 15037 8857 16758 15243 7978 -2576 -17516 -5036 11246 144 -5260 -8079
9037 -8079 -18732 -20935 -12559 6515 20800 39852 44923 45097 37597 10696 -16092 2384 19920
9024 19920 36508 11518 30573 56474 55196 56139 58413 49152 75304 80477 27912 26529 45079
9011 45079 28675 1867 8613 -2023 8590 21198 5358 2590 8661 -1159 15409 30614 31705
8998 31705 37423 53792 54933 22890 5208 -879 6295 -2958 -9291 -35280 -44928 -40849 -37384 -50274
8984 -50274 -20538 9395 42079 45462 31423 47279 37414 12271 20299 -7649 -26092 -6282
8972 -6282 423 -7505 -42635 -21550 13634 20850 31683 2939 -13757 -3161 -2211 -13745 3996
8959 3996 7126 22272 12285 16845 12091 22456 22915 5242 -1 -24198 -52475 -36572 -34186 -13766
8945 -13766 19735 52721 60394 59884 50048 51342 11096 9964 13287 6262 30232 36749 51729 60358
8931 60358 48979 50623 35166 59926 43332 16088 7214 20336 2373 -14283 -119 11204
8919 11204 18669 37526 53493 57909 14439 3879 5383 7869 33606 27289 9112 -1043 2897
8906 2897 34413 12658 7731 -2920 11533 18713 18155 26517 24698 2991 21617 41061 28550
8893 28550 11764 -6663 2208 3373 -15575 -40529 -6736 24083 3609 -5957 -4329 16463 877
8880 877 -10494 10213 2938 22930 40066 9885 -14369 -11004 5169 25509 45810 33929 41004
8867 41004 46713 26035 35181 31169 25584 -6248 -24292 -977 4691 10599 -4284 -19014 2235
8854 2235 -132 -6247 8312 35302 5429 -38161 -19502 -7877 -17314 -14181 940 -3308 -6885
8841 -6885 -8606 13340 1698 2954 -18362 -6568 -3720 -7979 -3796 -5724 -21597 -11264 9493
8828 9493 8567 27829 1038 9635 23798 10824 12103 21638 17896 -250 10677 31531 51471
8815 51471 36617 23627 13514 -719 2061 6779 11774 40951 69892 58875 39086 53323
8803 53323 51782 46361 21886 26328 29630 7936 2109 34563 16770 -11259 -28716 -20792 -16743
8790 -16743 -14567 -1291 -12148 -33352 -6906 26112 53064 70092 77823 51681 40816 41204 60762
8777 60762 66543 74877 101903 113628 97238 66576 53920 46094 43994 51822 60701 87371 119966
8764 119966 124589 140922 149418 176439 210535 252674 344113 474231 656218 929204 1255920
8753 1255920 1495329 1509023 1353366 1123389 866046 662031 527506 418781 330405 283411
8743 283411 243565 233807 221076 165509 180517 221687 246270 246910 216449 190044 149899 142312
8731 142312 123750 107353 79268 83478 109304 125235 136759 157608 164140 199673 186238 196284
8719 196284 217009 247984 277379 337100 413305 512089 662139 888387 1285209 1935802 2757231
8708 2757231 3327136 3240445 2743959 2124372 1574702 1158272 879560 711516 578005 480622
8698 480622 422463 390480 365754 311509 303362 291517 269077 248519 218786 198374 178987 180644
8686 180644 173454 185420 181255 187363 200736 180690 143569 151552 159966 183790 167021 169218 181840
8673 181840 234907 271551 271743 287463 324687 375542 497084 703189 995810 1274777 1497574
8662 1497574 1509073 1320683 1069149 840028 656027 512561 399845 340652 304247 262731
8652 262731 241421 219700 199317 159076 158088 153044 107343 87772 75397 66005 68577 38737 35235
8639 35235 56228 78688 73652 19137 18215 28055 26071 66872 75825 91143 86230 47783 35531
8626 35531 29566 15621 33808 39806 40781 35715 2358 4831 27007 43450 41946 40190 61496
8613 61496 44068 24433 19178 31469 35506 61890 62835 67288 62686 57074 53858 54392 51482 17836
8599 17836 45193 65111 77174 81068 83334 88944 74279 34605 39082 49223 34521 25139 8814
8586 8814 8467 17408 22737 28603 60278 77284 90924 91227 41525 -5728 10361 27654 11808
8573 11808 -5175 1929 31159 34919 31796 52058 37339 37612 42692 58877 80342 80537 54728
8560 54728 68379 61970 49830 36832 43920 87551 89280 61118 49543 47408 33544 17125 9711
8547 9711 -7431 276 -437 2545 5613 12982 33821 33821 33652 34688 26843 5965 -4680 10519 4701
8532 4701 20099 19120 8309 5446 21575 51567 55225 38927 11141 -4400 -7277 -12341 -14243
8519 -14243 -12099 -12178 -2628 -8752 9731 -1150 46663 53355 41556 4788 -6952 -11356 31603
8506 31603 51737 57661 45187 41438 38351 25252 50 5001 27603 15419 14137 17254 29261
8493 29261 32801 34919 42987 15207 7362 5916 1861 -6505 -2692 2388 -14769 -21744 -9898 -21055
8479 -21055 -17261 -24283 -48190 -27483 -24511 -34206 -35228 -35488 -22479 -19281 11885 44918 34719
8466 34719 18085 11332 1603 -6502 -11699 3923 4506 11105 19343 41898 29127 -11558 -13511 -3859
8452 -3859 -2077 10216 29349 38277 56063 58975 49616 52468 32395 21307 32915 39783 1295
8439 1295 -15884 -7135 845 -3410 8898 7479 -771 14811 25895 34530 60388 92336 93568
8426 93568 82229 49767 23142 2413 -3576 22108 54018 63826 57201 38651 12923 -30401
8414 -30401 -29895 -16369 -22005 -12381 -2847 20421 24062 -20437 -42866 -39907 -45544 -68333 -67384 -40162
8400 -40162 -32034 -23804 20856 55932 41909 42936 27534 17612 -1128 -13915 -28145 -37783 -22121
8387 -22121 -9641 -29355 -8580 10293 17472 25548 31372 28284 422 15834 26243 16818 -11677
8374 -11677 -12266 -2879 19996 57862 49540 52360 8246 -18762 5769 -9431 -31938 -23435 -8701
8361 -8701 6331 23442 41458 43784 43821 26642 46112 52909 22451 11504 11413 709 869 13263
8347 13263 31957 30676 33486 36772 83714 128338 173256 288964 468956 529182 458116 335991
8335 335991 224343 140483 81138 54778 45819 61110 54302 24191 33148 48131 38637 42654
8323 42654 20795 6015 -1911 11824 3527 21863 33401 11991 3257 -1144 29370 9686 -13676
8310 -13676 2218 12283 26772 42008 53425 59096 93423 96687 68893 93299 121892 151738
8298 151738 212627 331413 564952 877015 1013715 876657 678789 493054 316302 203091
8288 203091 169745 147588 137340 98411 53411 47787 55768 40125 5552 6805 36805 55888
8276 55888 63203 52751 75159 73768 50864 35820 17261 11546 -5171 -2550 9741 21843 48074
8263 48074 91497 87938 79349 52993 50966 58326 58088 46803 45751 68351 125755 237399 370784
8250 370784 451483 431298 332402 238224 191704 147316 113290 95298 66608 52485 51376 41440
8238 41440 36113 31947 37336 42653 32576 3829 -7254 1851 -50 7515 -5276 -7748 5357
8225 5357 10881 47815 64793 61996 55044 33915 4387 -5424 10872 -2548 314 -2756 23991
8212 23991 26440 -23304 -30381 -23768 -9254 2774 3912 2212 25442 22026 26903 20450 -4490
8199 -4490 -26019 -42785 -46933 -24497 8873 26422 4165 -25455 -29948 -30407 -26653 -20681 -10499
8186 -10499 -4139 4285 7598 2856 16036 39582 42211 26004 5613 -35124 -19638 -22467 -14855
8173 -14855 27037 21864 11194 -622 -11821 -612 -28072 -72221 -88376 -33336 37892 45845
8161 45845 53158 48742 29429 38258 36256 33572 -4632 -25636 5755 24802 41282 43423 39879
8148 39879 32479 19521 3503 7910 9882 28068 10772 2122 -6218 -18500 -28621 -18322 326
8135 326 1237 31684 54516 47817 38493 55400 63817 42721 17662 -7032 -42057 -5591 -6313 8689
8121 8689 49655 85741 73749 69571 58080 43931 13058 -1410 16453 18616 33809 30445 32481
8108 32481 43288 31866 -7055 16304 23562 20795 13181 -340 -4838 4431 41851 54276 46306
8095 46306 31195 38133 21831 -5867 -21288 -17604 -16744 -6643 17598 28899 27933 32252 24728
8082 24728 29485 18516 47295 47582 22257 12639 20685 32973 71309 105162 104719 103893 95751 83596
8068 83596 68872 26089 -4637 -17770 -25957 2760 7563 134 -20659 -22504 -5865 -12913 -18857
8055 -18857 17793 40634 41804 10887 -3536 -35444 -34590 3918 183 10695 17473 29847 38508
8042 38508 25680 3859 22000 -576 -27658 -26793 -22350 -29662 -18607 19512 48660 32277 2472
8029 2472 1114 11354 6070 24277 38124 32777 15452 -22094 9883 50485 59089 32273 5726
8016 5726 5209 25536 32589 17233 3490 -12260 -2789 44360 21749 16352 24514 27302 -317
8003 -317 -18750 -9346 21994 41735 31725 18774 -9162 -26577 -23132 -8129 -22941 -27251 -26635
7990 -26635 2068 25497 27831 26611 9293 -9618 -6273 22241 -743 -13418 7391 20240
7978 20240 27536 11400 -8368 -31941 -17997 -36848 -40592 -36089 -15914 9259 -8376 -15096 7074
7965 7074 18806 -9412 -21851 4018 -3461 -803 17341 18347 9381 19088 24681 14137 -2493
7952 -2493 -31300 -24321 -10441 4412 7052 -6114 -35548 -24022 -5508 21031 6777 -30441
7940 -30441 -33279 -35934 -32177 -49434 -46411 -8243 -3890 -15990 -12034 -5999 2304 4074 3956 21493
7926 21493 5934 -35023 -48846 -39008 -38659 -41492 -24967 -25624 -23870 10182 36110 23440 -550
7913 -550 -5584 7337 -20986 -31487 -20006 -14373 -34693 9827 46069 33208 17391 27434 12838
7900 12838 8413 43618 54967 42271 48988 25108 -4636 -18400 9189 20026 16637 6306
7888 6306 27333 59224 38743 13192 11462 -14182 -21159 148 -7512 -19199 -10229 -24448 -38583
7875 -38583 -12614 4907 -5369 -25130 -14918 21100 32717 13628 -7222 -35794 -31850 258
7863 258 31470 31069 2536 -6121 21546 27105 31339 60539 86056 53200 72935 77568 46352
7850 46352 39518 27571 18280 6028 2600 32569 52135 46398 27514 5285 -12988 -20822 -22356
7837 -22356 -10226 -38535 -60480 -37702 -439 -3450 -9943 6530 21139 35768 1806 4829
7825 4829 -4345 -19712 -16069 -5718 -26022 -20831 1766 4376 7886 7100 201 -509 208 2402 32315
7810 32315 41787 32245 15962 460 -3199 5070 2727 23818 -2127 -6965 7603 12778 19212
7797 19212 14986 -3848 -10539 -8823 -24185 -16425 -15900 -27246 -56945 -46000 -24388 -9593 -14695
7784 -14695 -5465 4578 -9080 -17585 -16335 -10051 -20869 -37305 -15310 -1274 20174 25047 8643
7771 8643 23141 31586 31073 8305 3612 -6020 -6877 -6653 -11045 9266 15536 18377 -5606 -7125 -5959
7756 -5959 -1415 -46054 -73416 -56630 -14221 -5313 -16833 -18023 -12819 1127 -8036 10827 35514
7743 35514 22674 21599 43282 58827 29812 6884 -5831 -12859 -9520 3824 17482 14429 9222
7730 9222 7463 6623 29767 20298 -3831 -12536 -3896 -1258 2435 20018 20161 -1227 -2077 28639
7716 28639 45965 35728 8106 -2247 10749 15476 8 -12196 14413 29753 22259 8113
7704 8113 -8988 -1199 -6439 -11434 -23226 -6854 11094 21424 36813 -10289 -44656 -24412 -7266
7691 -7266 1853 1709 -3641 -9926 -33464 -21482 -11531 -3364 -27581 -23003 -4253 13009 28855 20070
7677 20070 6290 -35946 -38103 4168 31266 45589 29031 25108 34350 31746 45353 47940 29526
7664 29526 -8554 -35718 -55918 -47620 -10909 14577 35407 26505 11520 6598 33926 31046 8344
7651 8344 -12127 -23762 -41500 -27776 -20428 -11313 258 4264 -25949 -61922 -47814 -19147 -9384
7638 -9384 -3075 -19267 -6259 6823 1131 7682 41045 27930 14358 23554 42474 37147 19216
7625 19216 10437 -18064 -63533 -51802 -14397 21289 23178 9429 37913 34611 16862 -35606
7613 -35606 -35931 -33048 -29652 -36102 -74564 -64441 -62365 -78781 -51464 -3947 30250 39946 35476
7600 35476 23021 18285 13992 10979 -1712 -5033 -27145 -44973 -50915 -39609 -15586 -2925 -12280
7587 -12280 -48927 -40267 -15212 -3894 -3620 -28018 -1427 38005 23012 -11507 -15273 -16302 -19813
7574 -19813 -7599 3078 -18590 -11932 7390 16976 -2647 -3974 16895 15232 37971 36592 15973
7561 15973 32123 44452 36610 -194 -8083 -14440 -15498 -40495 -49552 -12738 19554 20994 9372
7548 9372 -20680 -30108 -32132 -37583 -47380 -39961 -13312 10052 7795 -16287 -33503 -49968 -46282
7535 -46282 -45737 -38012 -27813 -14824 -21000 -29335 -10195 613 876 -25954 -27906 14552 17717 18769
7521 18769 26374 30144 39613 11165 -1375 17404 30581 29861 39795 -2005 -47845 -26236 13045
7508 13045 42712 14669 4449 15744 10037 14839 -1177 -16090 -6835 -14056 -33025 -10427 25514
7495 25514 25276 13611 -24257 -16194 -4164 -46326 -47267 -30160 -9603 -26314 -19287 -5344 -7434
7482 -7434 -14103 -21996 -34321 -42913 -55736 -62718 -73335 -65952 -41404 -5965 -18787 -25872 -30842
7469 -30842 -15134 -8782 -2560 -798 -10746 -36337 -59117 -58511 -76385 -72878 -87172 -55755 -12704
7456 -12704 -17383 -38100 -23956 -32565 -33201 -13428 -10273 -38437 -30736 -24100 7669 -8839 -17225
7443 -17225 -18589 -30031 -41338 -38353 -20088 -31856 -26725 -26097 -14280 -8788 -15607 -11814 -23971
7430 -23971 -26189 -32651 -35724 -17971 -38804 -28059 3674 -8969 6674 25650 12164 1219
7418 1219 -13659 -28114 -55439 -79157 -50247 1312 26929 28961 9435 19975 36251 27564
7406 27564 5443 -23058 -17747 -2750 -7284 -12431 2253 42337 42130 28761 13328 21885 31945
7393 31945 15786 10893 5489 -4260 -9229 -44524 -44855 -22589 -14731 -16247 -22870 -23680 -11063 -1088
7379 -1088 9501 -11050 -49768 -71181 -22547 4761 11625 -342 -8863 -8093 -25428 -47165 -34398
7366 -34398 -17948 674 -5978 -3419 23264 21242 28344 47382 38500 9656 -24930 -36492 -14850
7353 -14850 -11824 -40688 -23283 8063 43312 72501 46199 3270 -13129 2876 -19556 -19212
7341 -19212 -19032 -49147 -52129 -13623 10766 13779 8705 18506 -15959 -31363 -18886 -23512 -4688
7328 -4688 11285 16272 -5683 -7267 22937 58104 69459 55338 54293 47419 35896 20840 -11276
7315 -11276 -26050 -359 6696 15150 32336 15039 -9452 -7534 6526 -17528 -25670 -27445 -24295
7302 -24295 6416 -10517 -23511 -2410 -9216 -17329 -35882 -17628 -3162 12292 -7032 -16982
7290 -16982 -25300 -40989 -29935 -27935 -6005 6341 22974 24684 35625 29074 5781 -1901 -23475
7277 -23475 -61143 -57073 -41838 -36648 -53623 -57226 -26548 -19772 -47356 -39504 -14812 -37336 -45325
7264 -45325 -32213 -15558 -11602 -26341 -29479 -41049 -49886 -45677 -15119 -14835 278 -10235 -39013
7251 -39013 -28282 500 7005 16089 -13520 -6396 16512 -490 5241 -8495 -26292 -16714 -23619
7238 -23619 -25150 -15556 11290 38573 5188 -15686 -17998 12556 -2958 -54368 -48101 -19519 1651
7225 1651 19365 51397 56697 -4430 10305 22321 4133 -28582 -38459 -14136 -2720 9394
7213 9394 -10441 -19393 -17024 -19060 -25141 -48020 -47229 -3530 25713 27164 30077 31720 15050 23132
7199 23132 53001 66653 46162 34389 32565 34053 20816 23055 32088 17997 173 -3331 8943
7186 8943 -221 -12753 3970 -8251 -5844 4237 -24767 -13511 -2927 -9735 -4452 -8106 -11871
7173 -11871 13608 25986 19229 7256 281 16042 12621 5129 19529 17655 25832 40848 62623
7160 62623 62252 65741 47027 26880 17659 18295 24379 20987 14671 20554 16407 8153 22747 17217
7146 17217 -9202 -20548 -19331 -28565 -10598 -3830 -23552 -8029 -19987 -26347 903 5452 12450
7133 12450 7701 14897 -1189 -26973 -53694 -40997 -18776 -11354 -6334 -16969 -16376 9915 11290
7120 11290 -8985 -15912 15762 27898 12817 -22421 -58789 -47744 -31562 -36965 -18813 14580
7108 14580 21086 9839 5980 9018 19628 19026 28872 28945 17888 -15348 -37269 -50901 -36899 5825
7094 5825 30235 28767 37191 5847 -16108 -26761 10242 6338 -38347 -24060 3474 -7717 -49858
7081 -49858 -60879 -43809 -30594 4176 31335 36719 13186 17720 24105 45089 48155 23605 10583
7068 10583 13629 26580 16985 2595 -15406 -17263 -29858 -4338 -12949 -12431 3916 10636 -7608
7055 -7608 -16889 -20889 -4110 -754 11265 -22416 -45814 -14460 10314 25904 -10573 -31667 -27676
7042 -27676 -2266 7661 2081 16168 27273 2509 -5552 -16554 -50936 -29074 -24244 -52938 -33765
7029 -33765 -15898 8397 31277 21194 10782 10707 5096 -9912 -2158 -21236 -20957 -7701 -12064
7016 -12064 -35133 -63019 -60009 -36252 -35586 -37442 -23181 9392 10194 2932 -18064 -18300 -23056 -22708
7002 -22708 -6110 -24278 -5528 9918 -36614 -70543 -47759 -5267 8945 -8290 9344 54169
6990 54169 71172 46573 28486 433 -191 -4688 -1425 24416 26018 8522 -21122 -32872 -11322
6977 -11322 -12065 -49359 -78775 -45197 -6390 -12893 -36003 -43848 -36129 -26231 -441 10149 51987
6964 51987 18333 -12871 -20686 -24531 -11496 2009 -4612 -36027 -65966 -65405 -53427 -42987 -41484
6951 -41484 -11780 -14360 34455 59537 35762 24497 -3305 10029 2905 18080 16615 10772 13797
6938 13797 27966 40462 45815 26908 26281 34212 27875 26251 10734 37792 48248 27440 27362 33180
6924 33180 10211 1766 -16571 -18035 3634 -14386 -15902 -4401 7519 -3218 -25902 -18969 -11430
6911 -11430 -9559 -15786 -27924 -14730 21360 22964 35027 24361 3123 -16613 -30785 -19476
6899 -19476 -26494 -36906 -22633 800 1388 811 8475 -10161 25467 14582 23362 25895 -15342
6886 -15342 -47679 -41145 -34079 -32703 -38634 -28136 -5092 -34686 -50701 -22031 -3989 28246 29148
6873 29148 -17440 -42724 -25063 -4437 -6690 -6983 -5715 -10371 -21116 -41012 -46767 -59270 -55269
6860 -55269 -38026 -973 10569 4136 -290 1733 -6265 -5029 13185 23340 17591 4451 3288
6847 3288 -15911 -44504 -41735 -23928 5575 60766 79183 78917 49172 38875 8427 -25366 -19427
6834 -19427 18175 27558 20875 9280 17029 -3131 -23784 950 20663 19405 -40994 -84343 -56538
6821 -56538 -15451 2449 -15 11496 -8890 -24055 -47682 -56420 -69461 -86544 -50084 -24008
6809 -24008 -6815 -135 -16967 -6182 8292 17997 -11664 -36910 -15499 -8843 -21426 -25410 -4462
6796 -4462 8745 13463 7184 -1180 6447 15805 4674 5643 -16034 -25601 -4142 30041 55326 35106
6782 35106 18753 -8334 -15484 2956 8800 19106 24243 -1549 4015 27786 32665 17414 -9805
6769 -9805 -2783 -7461 -3905 13620 9972 13707 21453 6852 -13753 -13165 -23040 -32952 -36110 -36753 -46981
6754 -46981 -54798 -48839 -20944 -1983 4642 7140 -42467 -65650 -73418 -44661 -16967 -27922 -33082
6741 -33082 -40792 -22502 -788 19294 -7094 -31830 6757 29878 48442 14756 -32630 -72431
6729 -72431 -62607 -25365 -50807 -69390 -29022 28329 37789 32328 17007 19200 12598 -6409 -41050
6716 -41050 -37928 -51828 -38183 -9173 4245 -7703 -17494 -7623 -2473 -11841 -3896 -2069 2744
6703 2744 -947 -6294 2283 -15556 -2450 -23458 -23746 -7881 -7137 3621 6690 -10093 2414 15899
6689 15899 21586 -11679 -22140 -28404 -27770 -38112 -28587 -30138 -40787 -21665 -32616 -50873 -42223
6676 -42223 -43064 -21922 -6960 -11715 -7436 -9753 -6060 23769 30224 29863 -9597 -33890 -30073 -13062
6662 -13062 -25115 -34150 -42981 -20864 4873 5114 4104 17031 -1780 -27173 -55110 -67478 -75879
6649 -75879 -67692 -31769 -12863 -19729 -7673 -7129 -38990 -55646 -63143 -61188 -64815 -46508 -26665
6636 -26665 -11806 -45053 -64440 -43389 -17289 -4721 22724 209 -35766 -42420 -46823 -46664 -31701
6623 -31701 -21433 -32707 -17089 -8577 -22920 2540 7719 -15254 -19570 9909 23376 15230 15265
6610 15265 1871 -4688 -12184 -6113 6164 -8723 -6182 -35247 -32959 326 13242 -882 -30413
6597 -30413 -61855 -92346 -66947 -22548 -13299 -9373 -3720 8507 8187 -20822 -24318 -31910 -41100
6584 -41100 -23990 -23216 -13699 -4433 -5276 -26001 -41657 -43528 -43206 -18358 -22842 -12889 -10318 -4443
6570 -4443 -6672 -12555 2500 -14693 -24496 -25338 -13673 -26857 -40379 -42665 -52429 -32947 -17636
6557 -17636 757 -6947 -13589 -2213 -22 4853 -44902 -32033 22299 20503 12795 -16014 2844
6544 2844 10979 -13908 -4047 -4897 -21599 -39805 -9352 16456 19306 11994 -8233 14176 25508
6531 25508 15039 19703 761 -11968 -20087 -34575 -23704 -21748 301 -6824 2483 33866 34398
6518 34398 1511 12141 -14018 -10485 3481 2214 13498 32584 24080 12040 12870 -7736 -28895
6505 -28895 -22777 -41379 -75759 -44491 -7226 18545 36347 23173 -12666 -28439 -16450 -14732
6493 -14732 -39252 -30265 -19952 4442 -26949 -44795 -24556 -11415 -12793 -10604 -23749 -7872
6481 -7872 -14416 -8514 -9008 -16236 -13541 -147 14275 18268 -2295 -7830 -4386 -5297 -19786 -32247
6467 -32247 -18217 -26616 -31474 -16858 -2594 -11775 -16655 -2056 14414 27735 21053 15044 31758
6454 31758 33722 25573 -508 -17269 -8997 -3475 18975 27273 -32871 -30892 -43819 -32778 -22704
6441 -22704 -25201 -19986 -22696 -8786 -10468 -9590 -21524 -12516 19719 37858 37842 33122 34093 11826
6427 11826 1752 -25652 -42576 -22230 495 -8637 -35612 -35885 -32430 -41368 -33460 -27224 -23102
6414 -23102 -22759 -41957 -40421 -31164 -34521 -5755 24733 28142 27433 14989 30415 38964 32705 29720
6400 29720 17078 28158 30686 17572 25366 21414 29502 40527 28450 4503 -20907 -7436 10031
6387 10031 15299 14014 5811 -424 23172 8372 -24237 -53968 -69086 -50788 -37244 -47087 -54668
6374 -54668 -67516 -71609 -63707 -38628 -42452 -63874 -79664 -95864 -65658 -34850 -29919 -33468 -20503
6361 -20503 -22832 -34420 -38218 -26214 -39383 -24339 -7390 -8931 12649 31134 28666 3990 11045
6348 11045 17642 17148 9320 -12795 -22982 -14167 3829 461 2351 4303 -3502 -21593 -15305 668
6334 668 16532 -2195 -44038 -41349 -13835 -1368 16667 10158 27570 19626 29214 14277 20721
6321 20721 4837 -35425 -34825 -2653 -1309 -14731 -19424 -26655 -3158 -9521 -4611 -15002 3620
6308 3620 10924 -12767 -28345 -20866 -27543 -43518 -75708 -92899 -70612 -57203 -21371 17126 32977
6295 32977 13510 7493 26456 9189 -21551 -35261 -40344 -43144 3067 33265 21963 -9508
6283 -9508 -12358 7563 24539 -7728 -12021 -8896 -42402 -40502 -28032 -34996 -38272 -49354 -24601
6270 -24601 34451 58075 17011 -38417 -38166 -28375 -38459 -25118 -4377 15569 13665 -13308 -31986
6257 -31986 -31168 -28777 -41024 -47103 -33275 -10248 17329 17319 20974 37853 37360 8933 5432 -13717
6243 -13717 -23786 -45757 -55811 -64087 -66433 -34816 1426 3617 -7346 -20991 -27356 -6593 -16389
6230 -16389 -28986 -42925 -22060 -29406 -20487 -27543 15929 33601 23434 25131 17197 -14248 -13535
6217 -13535 -2105 11865 -29921 -66667 -78552 -51889 -3141 32919 46721 27406 6593 14411
6205 14411 10299 12726 20212 21510 -3978 -15581 -5521 3613 -27325 -56888 -81874 -73590 -36035
6192 -36035 -11862 -37724 -50756 -47045 -83452 -73685 -51362 -28270 -2213 -3083 -13053 -40141 -56686
6179 -56686 -51865 -47267 -60635 -53193 -11546 21978 27084 31128 12485 2052 -27278 -49928 -27642
6166 -27642 -16830 -17475 -10990 -10954 -20302 -7581 -7938 -3410 36203 54526 49718 25976 5107 1754
6152 1754 -1231 -354 -33614 -34155 -6211 -865 1007 7609 1635 -2433 -22609 -17372 -41315 -37239
6138 -37239 -27240 -20744 -18962 -17319 727 -12631 -16524 18531 24278 -2981 18395 22440 2962
6125 2962 13135 24081 25447 18948 12870 27631 1882 -3085 -26671 -22533 -5162 -22559 -15360
6112 -15360 -119 -2308 -4484 18648 34716 2813 21979 26918 10750 -5628 -12842 -42236 -35103
6099 -35103 -21161 -5531 3226 246 -16044 -1488 -16363 -81217 -80758 -64390 -17827 24241 18350
6086 18350 -6721 -24203 -18468 -35104 -34404 -27170 -10777 -6395 -4376 14063 28661 32040 -9206
6073 -9206 -41422 -30140 -15956 -26226 -8734 98 -34026 -47059 -45086 -22306 -17780 -23536 -23972
6060 -23972 -14536 1073 -1054 -30152 -59313 -50834 -31023 -33989 -43562 -37041 -48171 -46175 -40680
6047 -40680 -47351 -32230 -33068 -41141 -22091 -23711 -32430 -9021 9429 -16301 -32442 -25353 -7583
6034 -7583 -4260 -302 -7873 4429 1890 12444 -1941 983 -7410 11527 14462 -16682 -36173
6021 -36173 -11330 19307 20910 16418 12187 -19748 -46087 -38045 3296 55600 73435 45036 22486
6008 22486 -17165 -46353 -37968 -31383 -18101 9024 -1593 -250 14315 -3101 1092 16193 35197
5995 35197 18539 6671 -35399 -55316 -41711 -26093 -37699 -63839 -61797 -54283 -29968 -17966
5983 -17966 -6210 4265 16325 -2100 -12423 -4272 10891 62196 50091 40673 15619 -17054
5971 -17054 -15969 -34109 -51891 -69659 -52884 -16428 -6555 5874 -4117 -29895 -27931 -21008 -44235
5958 -44235 -57439 -26616 -18752 -50892 -60188 -61631 -29826 -25039 -30403 -39113 -30478 -51334 -77441
5945 -77441 -52833 -24448 -12747 -15821 -11890 -2574 -18823 -19270 1937 -15958 -19417 -28108 -46359
5932 -46359 -30394 -29528 -56173 -70315 -72814 -72679 -16967 1316 -28137 -15695 4910 8031 -11297
5919 -11297 -17207 -1333 -4785 -22140 -7302 -3782 17584 -4366 -22898 -1030 -12473 -36408
5907 -36408 -43626 -44924 -45865 -56398 -46653 -44528 -58171 -64850 -74656 -58356 -39144 -35546 -19675 -4556
5893 -4556 -12800 -15720 7455 42984 26948 10530 -24203 -22170 -12333 -17118 -16251 -1944 9184
5880 9184 -6853 -5169 -12277 -14227 33 -12520 -37916 -14833 2711 -3451 -14433 -293 34322
5867 34322 26009 30471 19525 -24822 -29174 -25748 6149 -2021 3838 53693 53428 50482 47619 56308
5853 56308 56185 38061 11304 1919 -8517 -1749 18603 11628 3151 -12159 -35530 -51065 -28931
5840 -28931 -12440 -20836 1796 -8269 -3174 2233 -39130 -27151 144 11017 15966 -13413 -27191
5827 -27191 -8921 -8409 -29056 -47270 -62199 -70804 -62482 -31548 -33748 -45835 -44774 -28561 -23149
5814 -23149 -57437 -69992 -70043 -33216 -18489 -24887 -19339 -23899 -52400 -46616 -29924 -17203 10409
5801 10409 11985 24113 26051 22468 7874 21038 13589 4790 -20103 -51625 -57986 -41819 -385
5788 -385 21627 16384 -3947 -23203 -29782 -20860 -22265 -64931 -58468 -61350 -45761 -18869 10729
5775 10729 11470 -16478 -7793 -8815 411 -2293 -8648 -21146 -26030 -14652 2153 -9101 -15032 11606
5761 11606 39973 21571 -23605 -43913 -45677 -52818 -36239 -47189 -50638 -20312 12741 17898 -15070
5748 -15070 -36462 -27333 -7749 -1590 -3189 -11277 7603 2867 10388 -20066 -36219 -31499 -24492
5735 -24492 -22022 -35524 -52661 -59967 -63578 -29458 -20818 -17548 -8756 -21762 -38869 -30437 -29317
5722 -29317 -3994 25161 22232 -44751 -76763 -81224 -82466 -63471 -43251 -20899 -16120 -39012 -51918
5709 -51918 -57457 -34220 -14002 4146 5493 15012 -4811 -20577 -33745 -6313 22301 21300 -3021
5696 -3021 -33483 -26892 16897 19544 -23911 -27255 -21660 -17196 -15925 -22842 -53551 -49734 -38469 -19911
5682 -19911 -13155 -5938 -16593 -40381 -39925 -19369 -34063 -48258 -38428 -41136 -45419 -21093 22014
5669 22014 22628 -1179 8081 14882 -3029 -32872 -43569 -25039 20410 35239 39668 13480 -19851
5656 -19851 -43289 -30561 -11997 -28365 -59653 -62188 -46089 -31529 -26891 -36508 -39354 -54284 -61435
5643 -61435 -42389 -8724 29693 7035 -31355 -25136 -20452 -4048 -347 -304 -8673 -16806 3061
5630 3061 14480 29513 12184 -15638 -15622 -18473 -7918 4065 1195 -5362 -6910 -21609 6011
5617 6011 21731 24776 44277 41299 -726 -23943 -69984 -55359 -30578 -25927 -24024 -2972 -6567
5604 -6567 -15726 -19232 -48299 -48601 -9244 -874 4947 4782 32074 37659 31274 25234 -2763 -22231
5590 -22231 -29797 4590 35301 50977 27819 -32243 -37357 -30827 -21820 -13824 -13820 -21914 -28389 -45665
5576 -45665 -25679 12988 5368 10763 10095 5571 20315 7428 11187 1258 5411 2032 -11088 -21016
5562 -21016 -16204 2857 7429 5773 -7381 -16009 -12883 -13967 10132 7712 -20463 -45387 -46220 -10728
5548 -10728 -25479 -18750 -43010 -58785 -47222 -7594 -17515 -26716 -29495 -3943 400 -11554 -14155
5535 -14155 -7311 11380 18838 5935 -16256 -14282 -33028 -48688 -51670 -70351 -59686 -63348 -62363
5522 -62363 -74874 -94079 -86825 -79369 -30573 -18996 -41200 -41976 -25376 -15767 -19863 -981 20000
5509 20000 40425 17128 5754 -65 -38521 -31068 -16666 -18628 18784 42258 23015 -26024
5497 -26024 -37268 -46809 -38983 -22249 -13235 -11239 2081 -16418 -42708 -34307 -24719 -23282 -36945
5484 -36945 -32018 -23140 -1537 -8416 -36287 -39099 -37206 -29689 -27136 -33668 -15953 4419 35709
5471 35709 43383 31794 20625 11387 15798 9606 -13280 -574 8444 -23163 -29716 3858 21775
5458 21775 -12584 -15868 -419 -9033 -15212 -31414 -8838 -12968 -29000 -28903 -16751 -17570 2450 -3305
5444 -3305 -6874 -5775 -32917 -36555 -12884 -17778 -14527 -16319 -35031 -60964 -89993 -60829 -10697
5431 -10697 -6108 -30867 -45425 -31133 -30558 -44532 -67995 -48088 -58311 -65061 -44236 -27793 -35033
5418 -35033 -35804 -31640 2931 -11427 -29053 -27158 -9838 -8601 4713 -2736 46 -9331 -31688
5405 -31688 -29392 -14981 -5987 -40563 -38470 -27701 -17857 -4491 -7929 -11746 -32233 -19507 3800
5392 3800 9252 -1376 -17369 -8970 -18533 -12795 -2739 -38417 -47204 -15574 9313 9524 476 1512
5378 1512 10078 13591 -881 14102 23003 28670 19917 15978 -12567 -12750 -46283 -36444 -36395 -15815
5364 -15815 -8325 -18542 -32402 9024 20303 7158 9492 28999 30973 37677 10638 -13555 -36610
5351 -36610 -43598 -31979 -27900 -40355 -39402 -45383 -25957 -2787 14136 29979 38423 52918 41507
5338 41507 18406 7037 -6231 -33335 -54542 -25910 240 5 -3175 -9107 -4978 -3922 -27423
5325 -27423 -33217 -8294 4989 -9536 -34161 -32126 -22758 -7970 -2200 12403 21530 19826 -7020
5312 -7020 -25193 -33456 8353 20631 23561 -5557 -14050 -63631 -62885 -35658 7668 -13207 -30957
5299 -30957 -85312 -99806 -68267 -43446 -34 13765 8654 -24202 -19590 27632 15883 5107
5287 5107 8823 12720 23580 -6468 6351 13374 -7764 -42286 -46220 -28626 -21360 -21730 -28878 -6040
5273 -6040 -12379 -41780 -27822 12639 8767 -16019 -5356 -21076 -35300 -9295 8565 -16952
5261 -16952 -26978 -39591 -12253 -14851 -27585 -22655 2126 1829 9938 -29162 -24269 -7449 -13458
5248 -13458 -22326 -2376 7490 32215 33875 18496 -8737 -24316 -27817 -20889 -19597 -4017 -9313
5235 -9313 17636 17764 34178 35327 47291 40594 25659 -667 -53246 -61514 -27444 -11845 -18278
5222 -18278 -11660 17382 49275 50322 9638 -26967 -67150 -53781 -30928 -28592 -60748 -56953 -13580
5209 -13580 -26571 -44629 -47121 -30052 -36361 -27267 17840 22742 292 -3082 9280 10264 -21759
5196 -21759 -35753 -42473 -23854 -3946 -176 -27291 -32329 -20464 -1461 5543 -26797 -30395 -22808
5183 -22808 -5112 -15023 7069 9919 -2920 18533 23367 17266 -10546 -29059 -31838 -22886 -20040
5170 -20040 -8275 6120 7465 -25006 -61603 -72243 -43215 -40217 -27829 -34541 -50683 -27745
5158 -27745 9061 21272 24209 4917 -2525 -7557 4801 15625 4620 -15458 -40728 -54539
5146 -54539 -3293 13773 5341 -1697 -12546 -17428 6094 27666 41339 27856 2587 1724 22933
5133 22933 18471 4881 24436 15580 -2234 12007 19018 15236 17118 1353 -10024 -11009 -5708
5120 -5708 1016 -15706 -16799 -34027 -19739 -12371 -19076 -27040 -46770 -59186 -49625 5596 24075
5107 24075 12832 12060 8510 -12057 -32533 -31597 -23809 -32627 -59647 -62653 -50487 -21856 -12815 -15496
5093 -15496 -58332 -47854 -32237 -36802 -25901 -24775 -45689 -40001 -20095 -26773 -53798 -42075 -21209
5080 -21209 -16313 -12432 10349 32894 13189 -22598 -25061 -33451 -23652 -34943 -53698 -25819 -27807
5067 -27807 -23875 -13673 -24500 -28685 -57755 -70537 -53581 -47459 -56460 -20383 22997 -9177 -45141
5054 -45141 -28100 -13026 9308 13479 3108 1742 -20813 -36156 -18617 -17454 -11850 -13177 -16387
5041 -16387 -643 -15493 -14155 18239 31290 38329 32655 9283 -7910 -13261 -2311 -1338 9936
5028 9936 12072 -9931 -48276 -52068 -29079 17948 27288 11884 -11479 -20063 -39146 -78204 -72708
5015 -72708 -51800 -36440 -26339 -35137 -31709 -36669 -30328 -27225 5415 -19726 -32864 -18508 -1309
5002 -1309 -26712 -45715 -58576 -44373 -14165 -19021 -25618 -12248 -1885 -9230 -24669 -29224 -72008
4989 -72008 -58935 -49823 -43808 -58760 -37198 -14131 -6813 -9455 -5628 -7495 -25836 -22498 -22932 -30400
4975 -30400 -28044 -17441 446 20352 48374 41465 28211 11728 -15218 -14742 3785 -2573 -9389
4962 -9389 -32216 -41606 -39041 -17852 -29095 -42451 -44271 -30543 -8766 -15899 -1106 2835 32376
4949 32376 31390 12422 25695 39822 9159 -14672 -18452 -7273 18346 29758 29993 11336 26180
4936 26180 27188 21707 22555 -19413 -48824 -12273 -2250 -23698 -34174 -15259 -26080 -43575 -51773
4923 -51773 -45122 -31794 -46966 -45131 -64616 -73322 -63473 -48136 -57809 -91380 -98652 -95636 -89476
4910 -89476 -65539 -30541 8528 20524 13085 -16097 -32625 -30739 -18801 -18434 -20994 -32774 -26048
4897 -26048 -57590 -36654 -12448 -6491 4372 7104 -7037 -18689 -28737 -24892 -30195 -27076 -35273
4884 -35273 -34618 -5905 -1693 -11506 13701 30038 24387 16247 809 -31161 -45128 -13142 -15565
4871 -15565 -12009 10058 715 -1603 4386 167 -13138 -4276 -9226 -14693 -5438 2797 6341 -9241
4857 -9241 493 -20264 -55842 -14330 12774 1533 -1735 8912 30000 1715 -20900 -25323 -11499
4844 -11499 15300 -7572 2804 -10715 -3499 13665 12580 -18381 -15861 2065 30499 17938
4832 17938 41785 25516 8556 14943 50127 35378 43809 61082 35408 523 14111 30239
4820 30239 21554 21916 18449 -23071 -66886 -61507 -6065 20499 -26672 -67024 -60659 -85027 -90903
4807 -90903 -61204 -59201 -56544 -20580 396 1324 2710 3975 23 4909 30767 27261 15211 -3465
4793 -3465 6939 6678 -936 -2440 -24152 -39717 -65994 -84007 -55841 -36389 -20083 13061 25445
4780 25445 3646 -9896 -17863 -12290 -11815 -31596 -44149 -41573 -47312 -51090 -19481 -14628 -12457 -2570
4766 -2570 -12303 -15161 19892 26792 -3744 20722 35446 24040 9999 2944 -12511 -27149 -30457
4753 -30457 -3283 13476 29538 39242 26959 -3157 -37644 -6757 23356 17051 -5667 -45243
4741 -45243 -59527 -66765 -62837 -44000 -2743 3904 -28648 -44363 -35618 -22769 -29273 -61407 -56133
4728 -56133 -34623 -38554 -38568 -23228 8462 11176 13909 13739 10926 -20568 -30455 -44372 -34150 7177
4714 7177 -6694 -22416 -11400 -4704 -8742 -15578 -11877 -25928 -20908 1119 -5833 -377 -7615 -35517
4700 -35517 -33181 11197 30057 27187 24654 31253 15232 17291 -6395 -12730 -24601 -20026 -24841
4687 -24841 -11368 -21009 -4102 29176 13464 -7883 -25670 -16960 -10360 -8411 -43947 -82174 -87887
4674 -87887 -74536 -55984 -55400 -55488 -69999 -88080 -74435 -50551 -33041 -20191 -11971 -12713 6546
4661 6546 10210 -4476 369 -514 -382 -553 7948 6803 -25655 -51361 -50751 -33368 -22949 -28916 -22293
4646 -22293 13737 27408 40065 24066 -9515 -24916 -27627 -29295 -41601 -39341 -34485 -53606 -35814
4633 -35814 -29610 -32661 -33766 -48509 -38106 -32785 -53578 -51703 -34452 -466 -29805 -47204 -51450
4620 -51450 -63124 -59273 -30470 -36032 -43879 -54794 -70096 -25035 -19607 -19630 -27240 -39893 -20310
4607 -20310 -28479 -58375 -28191 -675 12489 6502 -19205 -16713 3742 14714 10430 22854 29495
4594 29495 17317 21497 26518 14960 6923 -5180 -33022 -14579 -23027 -14639 -18874 -19760 -48635
4581 -48635 -57515 -64156 -69932 -46570 -16131 -2604 14782 15247 23642 32684 21298 8699 -11703
4568 -11703 4378 -1394 -20341 -25289 395 15920 25818 9866 -39684 -60767 -43445 -42600 -43985
4555 -43985 -41933 -35983 -36774 -34832 -40330 -41729 -55992 -31740 12249 3163 -4242 -3333 -14097 -27502
4541 -27502 -50451 -10690 -12692 -46544 -57548 -42601 -23870 -13251 -26776 -16581 -21993 -17325
4529 -17325 -1381 -26583 -26661 -20396 -21083 -1957 10128 10584 -1737 848 -32397 -44935 -20086 -20480
4515 -20480 -8163 -16174 7495 17765 13118 10556 -1269 -10831 -898 28667 39376 14333 -28201
4502 -28201 -40864 -30043 -22499 -27889 -25883 -49404 -86130 -60745 -30073 -39693 -85368 -51094 9549
4489 9549 24949 19054 3731 -22229 -17061 -31557 -57442 -63004 -37188 -40491 -61201 -86361 -92988
4476 -92988 -80866 -78534 -54496 -35189 -53090 -41416 -18812 -9096 -12112 9024 4669 -31041 -44303
4463 -44303 -45530 -34449 -35215 -18290 10127 1735 -24836 -32440 -43969 -28150 -34448 -17921 -15022
4450 -15022 -18064 -37574 -49484 -52768 -37057 -23170 -44793 -50266 -30036 -39403 -39437 -21825 9992
4437 9992 7276 -1539 -22796 -22337 -34885 -22806 -19979 5172 5243 5682 -5391 19346 6350 38043
4423 38043 4611 -8779 1302 -1566 14828 6077 -8210 3397 13511 2507 18472 8929
4411 8929 -34 6681 -7859 -37817 -44490 -32038 -28831 -7648 4717 -10054 -15856 -4048 -11546
4398 -11546 -1985 369 1507 3096 15710 -11279 -29444 -37032 -41313 -30514 -15694 -32490 -37743
4385 -37743 -69057 -74919 -51530 -30732 -10346 -11140 -10350 -2805 -4215 -45320 -40795 -53768 -57849 -19331
4371 -19331 4918 4247 28235 34993 23370 -6654 -47846 -18306 -3600 -35986 -17275 1888
4359 1888 1355 1377 16824 21901 29935 16170 12732 12521 -12378 -12227 -12981 -1308 -1178 -24168 -36140
4344 -36140 -4776 10880 -32064 -55257 -27323 -28685 -39617 -27054 -17927 -11757 9407 29881
4332 29881 30991 15149 -10833 -26676 -30733 -22349 -23907 -17444 -18692 -12413 -18698 -50046 -57763 -21055
4318 -21055 3806 8852 11877 1191 1543 2875 -9836 -25891 -31528 -28388 -25017 -17554 -33459 -35801
4304 -35801 4736 29080 351 -41729 -29092 -47393 -54120 -56089 -53550 -48190 -47473 -35982 -39615
4291 -39615 7266 29577 19672 -5602 -11737 -4856 -18529 4930 9166 23506 24245 10944 -5761
4278 -5761 -26376 -16442 9975 4128 -3111 11114 35763 31784 -590 -9129 -18992 -43429 -44152 -12948
4264 -12948 16908 -12055 -5148 32117 58612 42928 36110 54788 39898 -866 -10697 -23541
4252 -23541 -12534 112 -38600 -26572 -4354 -21940 -34162 -35447 -46240 -34873 -3673 11376
4240 11376 -1191 1287 -10810 -23302 -32314 -57564 -52108 -35353 -33168 -40797 -28381 -13173 -10338
4227 -10338 -34255 -43331 -18240 23594 12901 -6851 1325 2347 -1308 9099 10804 19461 23573
4214 23573 -6856 -24121 -47340 -61126 -29345 -13259 -13154 -16411 -19082 -32470 -50902 -21512 -50324
4201 -50324 -63249 -56236 -23705 -11426 -455 3067 4636 21071 24309 10399 -3806 -9209 -14153
4188 -14153 -21793 -57368 -32394 13624 7798 -7185 -11045 -18814 -11659 -1420 -1097 2991 -27505
4175 -27505 -30507 -26314 -24426 -6270 5961 -9159 -44827 -33502 -5146 -10344 -17901 -30137 -45110
4162 -45110 -33318 -13332 -10827 10106 19476 41206 26036 -3160 3669 5379 -15820 -22475 -6429
4149 -6429 -4126 16 25327 28764 4055 19369 17382 -12063 -6633 -10916 9170 4814 8411 16234
4135 16234 25768 4957 -31007 -28787 1152 9505 16093 49203 53294 7303 8660 12181 1949
4122 1949 11453 3204 16185 -8745 -28970 -40317 -31684 -33983 -22906 -15933 -8846 17094 -6235
4109 -6235 -15068 -32195 -11380 7770 15514 -5281 -30342 -51214 -53321 -27840 -3484 18514 9433
4096 9433 6929 40677 46165 22530 -860 -18893 -8041 -8505 -21699 -50871 -64134 -40297 -19481
4083 -19481 -20192 7283 -10476 -27713 21792 13957 -74 -15210 -14397 -34798 -32180 -6430 20729
4070 20729 19633 10742 24664 9600 -21553 -25068 -33123 -28603 -8595 26252 20409 10321 -682
4057 -682 6318 13973 2557 24130 32463 -5884 -34242 -39049 -28789 -9005 -23408 -16722 3451
4044 3451 14743 -6683 -8418 3175 -17356 -22698 -10180 7663 -19974 -37127 -28817 -6842 -10066
4031 -10066 12688 32621 48997 39669 12212 13690 20692 15688 -24519 -39013 -33105 -43933 -59668
4018 -59668 -39164 -7345 7736 21508 22804 -9411 -13576 -68 -104 -9691 3975 45454 59815
4005 59815 30841 11171 11160 19579 17193 13541 -12259 2454 3449 -10130 5139 10190 -2005 -969
3991 -969 -4455 -14700 -6796 -2501 -3254 -5134 -11289 11597 13161 -16240 -15685 -13101 12429 41533
3977 41533 17132 -12357 -1463 -32357 -32937 -30884 -44595 -46969 -78078 -57012 -14820 -317 -473
3964 -473 -12984 3117 34348 65884 42070 45408 38218 9495 -4725 -3696 25842 30989 24699
3951 24699 -9775 -6052 -34090 -58311 -62676 -24849 -23160 -80727 -89952 -23979 -19540 -30991 -28464
3938 -28464 -35549 -27596 -31800 -8009 -3352 -33121 -32218 -11882 -15632 -43495 -56230 -24944 7844
3925 7844 17858 19452 17249 36476 49141 45064 33506 15218 -18319 -64357 -73882 -31361 -28409
3912 -28409 -11389 26302 30926 6952 -32976 -34375 -22629 -32244 -35185 -17486 539 -12376 -31805
3899 -31805 -28945 -20657 -36590 -31377 -28248 -15193 -13625 -19684 -19057 4533 274 -23675 -21460 -11272
3885 -11272 -8409 -24571 -15580 16183 29934 32627 44569 38302 29563 18016 -25727 -42184 -21076
3872 -21076 32379 49367 42725 55211 44097 7360 604 10416 7439 -16446 -645 42659 30385
3859 30385 9966 2255 -36396 -7771 17266 32377 790 -16709 7678 -343 -5982 -1044 -2077
3846 -2077 -12840 -22255 -16280 -3929 9194 30265 43416 24204 13703 10044 -3373 27092 38849
3833 38849 28380 46019 26006 11181 20477 29276 25364 26349 14205 11700 -10674 -34940 -30259
3820 -30259 -9417 5107 18289 33605 39990 21486 -5480 -274 -29672 -37269 -47494 -72955
3808 -72955 -61146 -60507 -61628 -33122 2442 13986 -12441 -19823 -5888 -11675 -41022 -33135 1495
3795 1495 3303 -36777 -75240 -82012 -71967 -48982 -27545 -41468 2959 44776 9110 -22111
3783 -22111 -17420 -8057 -8678 -34030 -32764 -45027 -52109 -43604 -55015 -21553 -16832 -29710 -20427 32344
3769 32344 35541 17447 35939 41178 18199 26967 15201 1346 -13959 -574 30938 39604 3607
3756 3607 -2769 6251 19822 7094 8029 28113 29266 14651 6107 -20876 -25940 -21388 -6312 10692
3742 10692 13814 -20437 -28934 -4933 -36521 -46160 -22777 -34211 -19063 2480 26270 43203
3730 43203 41214 19717 17803 34453 -5460 -3701 -3013 -8942 -15676 -23113 -25575 -45984 -50064 -50417
3716 -50417 -40484 -26856 -59289 -63675 -82297 -74775 -45753 -20444 -7956 14767 9104 6845 -8200
3703 -8200 -45030 -25709 -2106 22737 17914 7609 11895 29301 15970 10530 7719 3499 21079
3690 21079 -15114 -4232 -23406 -38829 -48720 -48907 -50920 -42128 -33998 -30721 10686 18148 -5865
3677 -5865 -14279 -18013 -7152 4364 12234 7375 21068 14274 -9710 -1968 -1572 -8839 -14471 23546
3663 23546 15082 1928 -782 -9419 -37943 -51094 -58259 -47618 -34364 -52463 -42269 -20377 46358
3650 46358 47036 27994 16936 -3760 -14126 -7784 5033 19658 -14833 -25567 171 2217 -12635
3637 -12635 -19012 -30072 -25099 -16818 -2451 6828 22582 28096 25659 26088 -741 -8617 14867 -19195
3623 -19195 -44420 -42919 -16896 9468 20532 -8680 -23103 -13845 -22926 -32143 -6375 6134 -4779
3610 -4779 -3974 12248 45286 57486 30516 22651 37028 30021 23312 4017 -4252 -1282 14045
3597 14045 11557 4420 8362 1175 17859 44535 26387 26343 6204 14873 39014 23956 8908
3584 8908 16924 -3968 7312 29777 28285 13974 -23909 -17966 -12158 -19051 -17752 -24983 -12676
3571 -12676 -13365 -16078 -34879 -52890 -68173 -48050 -11984 -5920 6124 7090 27319 -1564 5649
3558 5649 14407 10110 10535 -2745 -2612 11254 26689 39132 26866 4874 -23800 -31860 -13386
3545 -13386 4501 -5908 -7047 2796 26534 -6759 -10287 9345 53681 31014 10018 10735 -13423
3532 -13423 2068 17693 8494 -13339 -20518 -41347 -17022 -4695 -16905 -20256 -20927 -37515 -35291
3519 -35291 -31691 -30986 -34431 -39913 -22447 -2852 26797 53283 60388 51444 58494 53703 47211 48600
3505 48600 27942 -8845 -49211 -52994 -26185 -18 5871 5161 14394 20985 23063 18055 22367 37590
3491 37590 14095 19959 26771 28352 31968 29970 27372 -2595 1364 -964 -8171 15255 42235 61232
3477 61232 51664 43145 57701 68507 60463 45456 38800 48300 33293 -2928 -3999 21537 9119
3464 9119 8126 -1591 20514 45372 46988 34044 29321 7902 9269 14683 -7710 -8053 -27645 -17725
3450 -17725 1366 8966 -1470 -6391 -13715 -31283 -54305 -44056 -32497 -34254 -48654 -64512 -69476
3437 -69476 -84858 -99395 -75834 -65507 -44635 -10875 1129 -6277 12169 6072 20758 37798
3425 37798 40524 27859 26640 16442 4269 20527 2318 -13735 8646 15122 -16672 -43051
3413 -43051 -33322 -26100 -41878 -29081 -28637 -29628 -28731 -37095 -12779 24056 15864 6845 -7768 -4235
3399 -4235 -4449 11203 13993 8155 3770 8686 8593 -11243 8683 -3555 3890 7066 -27745 -42253
3385 -42253 -42856 -60445 -62995 -43014 -54596 -29903 6373 8875 12015 -15262 -43763 -16103 18391
3372 18391 9667 777 -1661 -2928 -6330 -18879 -22637 -3060 13632 -9358 -27352 -25777 -43077
3359 -43077 -28350 -6171 -16866 -13656 -1672 -41074 -15876 23801 15734 10622 3470 10434 21546
3346 21546 21953 5477 -6553 -9112 -27109 -20347 -3288 -9950 -21765 -14001 -25790 -24321 5213
3333 5213 21579 8421 25792 23570 -21337 -17492 -18142 7674 4968 21270 35307 16507 -12263
3320 -12263 -16321 -13492 -7908 38915 47848 1264 -22680 -12718 -3127 8354 16601 7650 -13906
3307 -13906 -34655 -35297 -19320 -18743 -51357 -35236 -16637 -9875 4745 -6378 -11822 -22657 -37472
3294 -37472 -34070 -24453 -32468 -59404 -57480 -63423 -49809 -45906 -34675 -11751 -17721 -34531 -345
3281 -345 21312 762 -15756 -4350 -14247 -43552 -29814 -16203 -3129 -4065 1483 -29513 -51548
3268 -51548 -69050 -63333 -38894 -40966 -50334 -45472 -18218 -22981 -25841 1145 -9769 4220 23047
3255 23047 4006 -13165 -17460 -13332 -15894 -18482 -11475 9651 8400 5005 -22406 -34165 11839
3242 11839 42381 36384 13057 9790 20570 39763 34726 13620 -16265 -33892 -36640 -35825 -22490
3229 -22490 -15182 -31676 -40612 634 -4940 -44023 -64301 -56772 -42521 -10590 -12453 -25024 -9461
3216 -9461 2472 18043 18106 2541 -11804 -33643 -49253 -33149 -22058 -10405 19145 21549 17576
3203 17576 16700 16921 15185 20695 8682 25108 -8813 -54914 -18401 -13065 -37443 -50719 -19052
3190 -19052 -9215 -6197 4653 28459 -1754 -11563 39852 51694 34746 -1676 5610 18585 6356
3177 6356 17583 39330 31612 -6884 -32989 -61401 -42821 4159 17294 750 -13677 13166
3165 13166 21848 731 -7518 12759 9896 -10648 -13345 -3164 -2238 -12096 -18498 7102 -17624
3152 -17624 119 16641 -27437 -48225 -62050 -48986 -32119 -23113 7739 8840 5292 -13096
3140 -13096 -12914 -2025 -17121 -6709 -11653 1797 21464 34558 15877 -27980 -25372 404 18036
3127 18036 9503 4879 2115 -17869 -11921 -3 -9473 -19514 -20600 -18585 -4202 4355 -14708
3114 -14708 -12217 -12544 9338 11492 385 25567 30466 33707 -4753 -29499 -40678 -32937 -22668
3101 -22668 -10563 7695 5708 9648 -4523 -12227 -19998 -18332 -31794 -29881 -29873 -45736 -34587 -32796
3087 -32796 -15917 -23063 -18501 -29673 -1073 22132 7300 25168 15358 10767 3957 13841 39206
3074 39206 35183 26750 13278 -597 -1760 -6860 -23642 -32268 -18891 -13715 -11846 -28292 -51993
3061 -51993 -29399 8984 -4906 -15330 -30996 -41884 -42097 -35011 -30996 -40242 -46358 -29430 -31669
3048 -31669 -18864 -1461 10549 19273 20885 20391 23349 15236 -11885 -25592 -31020 -17286 -17597 -12802
3034 -12802 -10547 9176 2391 -24399 -36474 -22699 4319 -5010 -11719 31707 59964 52899 14258
3021 14258 -23534 -37575 -27258 -36955 -39544 -22511 -17982 -13781 19936 34893 32109 27601 23507
3008 23507 36420 34726 7319 -5495 1973 19562 47821 77873 38371 -27654 -31553 -24975 10303
2995 10303 33275 35356 22470 30879 37987 40152 40763 33283 12760 -7177 -12678 -4145 4527 35294
2981 35294 31375 -468 6221 -2509 -7911 -22983 -12562 -18667 -33757 -75296 -57058 -15742 2637
2968 2637 -5851 -11438 9076 27705 20608 26980 16596 -16687 -17130 -18690 160 13793 21887 29378
2954 29378 18018 52073 99873 99668 75768 55231 37551 22639 -7393 -19270 1407 -3710
2942 -3710 -11247 -11075 -13847 -20795 -21310 -36218 -25680 -30566 -52789 -61228 -47102 -48585 -49189 -7721
2928 -7721 25287 59360 29494 130 -39004 -43758 -29039 -13128 10888 48431 52049 1809
2916 1809 -9617 -30063 3959 -6109 -31720 -49877 -33251 -9428 -11284 -33033 -34961 -25228 -21031
2903 -21031 -12454 -11910 -26660 11714 25101 29722 22617 10383 30870 20129 -427 -11539 -9238
2890 -9238 -24494 -9032 1374 -2177 -16439 -10726 -7615 -4222 4969 7334 -15658 -43884 -32504
2877 -32504 23849 53488 70188 59279 50274 58018 14155 4747 7702 13138 4543 -6849 -9021
2864 -9021 -30005 -32267 -8410 -3130 -21660 -30854 -13071 10455 9351 -7576 23737 35682 15650
2851 15650 29170 49581 27179 16622 40421 29987 -1572 6074 25391 33382 20001 3538
2839 3538 534 21939 36206 24222 6227 5408 -9366 -32975 -42586 -20887 -31249 -48376 -35840
2826 -35840 -22704 -28330 -19071 -6676 19215 14453 -4374 -5801 10729 10473 -2952 -15391 -17068
2813 -17068 20206 24548 1829 -14640 -8865 37354 42254 34713 22987 25012 33726 29943 23000
2800 23000 30138 -272 -25607 -21364 3883 39156 30926 -14612 -51002 -53185 -39503 -16167 -37255
2787 -37255 -54849 -55775 -41219 13798 24769 33129 4678 -15751 -5524 19906 4032 5348 27748
2774 27748 -2079 26765 45615 28933 31146 16564 18098 16680 91 6627 17822 2856 -8455
2761 -8455 -2122 26779 45855 30119 4083 7882 9213 4974 20180 11672 15585 25116 5217
2748 5217 -14516 2548 42665 31260 7913 12046 15680 30219 19716 -407 27433 40658
2736 40658 19233 3861 -34 21740 26968 26656 4652 -18204 -44680 -63261 -30543 -2426 -20758
2723 -20758 -26072 -30882 -54455 -52602 -39772 -21980 -29439 -60695 -53177 -13315 -1609 3797 -5104
2710 -5104 -15133 -15864 -24908 -11761 -18567 -35910 -62188 -56429 -60861 -58866 -40739 -5129 5041
2697 5041 -21113 -18771 -12814 -25323 -22761 8982 7226 -2912 -24663 -22629 324 14546 22965
2684 22965 4092 -2321 5764 17234 27614 29160 14980 30571 26961 37875 39643 21366 22988
2671 22988 1875 -12220 -13607 -1852 4988 -3729 1983 13901 27755 29424 30310 28999 38140 77608
2657 77608 74415 40773 41207 41777 25932 -2691 -11520 -8423 -23201 -23590 7950 37084 54066 62507
2643 62507 3072 -30030 -45640 -49573 -28184 -16972 -12772 -9205 50764 69607 50431 49044 21660
2630 21660 -8172 -36839 -46368 -26114 -46028 -53405 -41166 -57367 -45854 -22062 -36975 -45313
2618 -45313 -78998 -54883 -15282 -27450 -41811 -53503 -62014 -51018 -38590 -39058 -33290 -37572 -27991
2605 -27991 -35587 -43575 -53985 -68292 -60264 -35421 -16230 -19043 -7866 3111 19615 27560 -6266
2592 -6266 -51201 -51346 -42858 -48184 -44070 -32051 7054 11879 -8211 -35364 -23638 -7246 3650
2579 3650 18877 -7455 -8258 4742 12474 -2874 13741 51660 40526 50706 48359 49425 34565
2566 34565 -1294 -24486 -5915 15498 -9765 -37687 -34230 -26473 -53423 -56540 -52720 -26058 -14146
2553 -14146 -49534 -64391 -68144 -55097 -28338 8458 -7028 -24521 -31817 2963 -548 4434 1097
2540 1097 -28813 -52129 -39389 -20641 -13729 -3586 17267 -9594 -31258 -52759 -66565 -50768
2528 -50768 -9107 15261 -4227 -6323 18738 22144 22312 6950 15453 -4324 21487 32794 17289
2515 17289 15038 -2363 -16841 -5753 -20967 -48982 -13466 1237 -11684 11285 4197 -17408
2503 -17408 -28969 -25779 -32884 -9030 14939 33320 20844 -16374 -17757 -11599 2790 -15630 -18557
2490 -18557 -1419 38260 60624 67712 54731 14506 -2723 11874 18177 19369 13589 11523 26751
2477 26751 26717 41597 65468 42628 21795 5324 542 32881 28072 -848 -24557 7059 19641
2464 19641 -25525 -30480 -16300 -8700 -19007 -16532 -25120 -21349 33068 47540 38301 20192 -6796
2451 -6796 -24555 -35991 -28905 -1529 19122 -331 -9098 -19063 -32145 -44469 -15375 34313 26023
2438 26023 23604 22051 15155 -7006 16811 21085 15645 6698 16455 23440 11826 10318 7959 5153
2424 5153 12885 3857 2261 13359 18993 -13595 -26984 -18253 -8404 15016 34114 17467 746
2411 746 -13346 -34891 -6217 8245 -3968 -22653 7980 11019 -1510 -1773 4017 -7703 -7973
2398 -7973 22442 31782 12275 16214 4020 -15396 -23618 -22371 -17090 -28548 -17828 -22045 -38413
2385 -38413 -44893 -32977 -26135 -19741 -5000 -31544 -32898 -37777 -3988 3778 -10698 -49785 -46145
2372 -46145 -24930 -4477 -4422 22836 -585 -12871 -31333 -48620 -23813 -7278 745 -4322 -9068
2359 -9068 -414 -423 -7587 -25661 -41448 -35442 -30348 -39018 -13446 23017 27097 26258 18948 14045 18850
2344 18850 62320 67529 64210 39296 22807 12853 4778 -11777 -3846 7518 8354 27663 42458
2331 42458 61833 62787 43303 4849 -9828 -12794 -16110 7867 21635 10098 -5652 -24772 -15720
2318 -15720 14393 10783 -393 3281 -2120 25557 43265 27509 -742 -6 18058 29328 13005
2305 13005 14870 27202 26210 17186 -8267 11801 31687 11643 5567 9165 41847 30249 9496
2292 9496 -11230 -20272 752 1033 279 16740 35005 41577 41421 54891 24888 -19117 -43509 -56515
2278 -56515 -51117 -17333 1869 -23012 9157 17196 11148 15242 2496 23251 19689 -8744 -26103
2265 -26103 -27304 -26372 -44687 -40530 -2482 1266 -12980 5869 -7165 -27951 -37072 -39848 -14920
2252 -14920 2169 -6677 8442 3263 7754 16709 3642 -5409 4957 3012 7634 1444 14581
2239 14581 67509 94853 82567 60661 34061 49146 32996 24081 -3318 -28650 -10715 -19895
2227 -19895 -30376 -28790 -28541 439 -7602 3059 21635 31029 50448 63768 60513 31801 7814
2214 7814 8012 664 722 -16651 14980 33522 -11702 -38854 -20421 14032 -14853 -55140 -48895
2201 -48895 -14480 21588 20541 -11905 -29263 -15980 -5848 2950 -24666 -24987 -16427 -9191 16489
2188 16489 41718 31782 25411 14306 3552 33870 40726 8121 1529 20602 22635 22276 10308
2175 10308 1259 11766 -6229 -4419 858 -6980 15866 17684 26393 11382 40210 49681 37262
2162 37262 28848 26332 37843 587 -2876 -23929 -34498 3799 34350 23198 44227 79483
2150 79483 72482 34262 20045 218 -23405 -34205 -27017 -18984 -23618 1593 31383 29982 -6910
2137 -6910 -10835 -6965 17313 28654 880 15830 24001 3404 -15332 -44501 -67321 -38702 -1776
2124 -1776 13535 7722 5468 7753 15858 -12345 6914 27673 31930 8320 -6295 -9238 14580
2111 14580 22430 14677 24748 27747 10966 43436 46796 3837 19337 25719 14339 -10036 -27704
2098 -27704 -25207 -22902 -34573 -19952 -27846 -15784 23823 59695 41626 36333 49701 51554 48811
2085 48811 57461 80668 89237 67518 27446 15869 46291 43300 36626 19161 -7443 -25456 -8595
2072 -8595 23328 -11847 -39164 -38473 -21301 737 7561 5729 19415 13933 -1320 2316 36315
2059 36315 32543 -56 -135 6318 36766 25849 8677 -27027 -49326 4530 28390 67208 94914
2046 94914 74090 64386 53423 47369 59538 50423 37075 17069 -15154 4545 6815 14298 18276
2033 18276 30653 41295 34820 44148 35511 36262 50531 48540 30512 10180 -10893 -39360 -16571
2020 -16571 34245 19013 15698 -4373 1366 -5825 -14462 -2682 16682 19613 1201 -17282 -6653
2007 -6653 7296 6994 -4171 -14648 -37600 -57720 -33054 -11593 -3809 179 15848 17792 14247
1994 14247 15484 19077 16402 357 -4096 16699 11591 4081 -9494 -22097 -14803 -17360 -23597 -25127
1980 -25127 -14443 5050 -3412 3075 -2934 -2219 16827 -19601 12632 23076 4920 21979 24561
1967 24561 37864 49128 16811 12784 36387 9784 -31296 -30926 -29771 -48127 -37322 -12417 28072
1954 28072 34880 13793 -13175 -21742 -12834 -6763 -8019 -5094 6569 21103 -11724 -24679 -35846
1941 -35846 -33590 -21671 8636 19532 48948 68546 27184 17241 41053 64439 44762 18577
1929 18577 15164 23011 9280 -43986 -12844 -6745 -7705 13077 23034 4748 12312 58119 58342 44682
1915 44682 40461 19067 -33748 -47643 -21618 2942 -14737 -38682 -27649 -24973 -14706 -9533
1903 -9533 7305 -1427 -11746 -8050 -10836 -4431 29537 45490 21818 11809 41255 38787 24464
1890 24464 4272 29038 40891 47452 45969 29260 13366 2822 7511 25656 15462 2497
1878 2497 9207 16458 29794 39303 64351 71404 50419 16409 -15879 -42452 -15305 -891 -21361
1865 -21361 -22626 -34761 -14047 -6080 13772 16239 41447 49274 40797 23163 33879 10077 -30816
1852 -30816 -20553 -7121 9294 15399 9540 7828 9162 8384 4413 -818 14244 9468 12343 1792
1838 1792 -3908 -24644 -2881 37102 21895 -3450 -20641 -14014 -6333 7701 -2683 9362 13643
1825 13643 10449 25226 47363 21659 -22772 -6472 -17825 -6600 -8641 -20684 -15601 -3941
1813 -3941 -3136 -5342 18885 6106 -13606 -27578 6440 25274 -6017 -39817 -55321 -6115 9199
1800 9199 -4194 -9239 -4955 6381 20323 34609 47658 36597 55220 27318 21455 -2831 -1890
1787 -1890 -14891 -3340 11463 6750 31623 40102 30212 564 -6054 -7810 16008 18230 12049
1774 12049 31960 54867 48061 47466 54017 49055 56650 64772 48858 3745 -11123 -23896 -19498
1761 -19498 2297 23047 53992 66564 38814 500 6558 30109 51545 37016 -37889 -40921
1749 -40921 -14240 3650 -23243 -49319 -41185 -27334 24598 33421 21631 18462 -7084 -6414 42358
1736 42358 72485 37876 8480 -28735 -16535 -11204 -29598 -38803 -16496 -5369 9225 -5211
1724 -5211 -12050 24967 35714 4098 -3026 7823 27338 19367 -9780 -30212 -11656 -19499 4007
1711 4007 42832 51774 30879 17681 18315 4471 4512 13630 1025 -29846 -38416 -38352 -38926 -3000 17422
1696 17422 3007 4382 15393 -11425 -7293 9484 -1762 -21518 -36645 -44623 -44284 -46702 -29258
1683 -29258 -1264 9596 32404 46949 19640 11022 7202 -3227 -7440 -2780 14199 21668 33159
1670 33159 39720 17989 23333 21615 25095 28377 29057 37247 15034 9962 20576 27881 14049 13027
1656 13027 -5626 1711 34990 40512 6462 4964 12216 14225 33150 28977 12103 26119 41107
1643 41107 25079 20006 30021 44443 59670 70613 30522 53641 87044 55159 26987 4521
1631 4521 3550 35859 21569 16708 32373 29677 55487 39877 64247 67016 39784 -2203 -24377
1618 -24377 -29737 -18298 -28039 -28113 4542 5507 -3778 -19958 -32204 -27791 -10983 4481 14210 5316
1604 5316 20481 20760 2043 -18786 -1666 8384 7342 10258 -7923 2095 2793 -57173 -54487
1591 -54487 -18579 -11847 -26197 -4469 -11961 -46067 -28264 -8692 -3173 -3592 3917 -5465 -29376
1578 -29376 11252 23199 -7528 -10038 -5134 2922 -6396 -11564 -17350 -2995 26761 30619 27055
1565 27055 29239 20933 26917 43870 42021 25164 5256 6310 -2677 -22394 -25924 -24495 -24302 -9324
1551 -9324 -22650 -29906 -13513 -2821 -7187 25632 16600 -24406 -34180 -25774 -13505 -2422 9501
1538 9501 16050 29682 32386 78689 105605 84676 41163 31705 32266 16223 -4661 27397 27492 27759
1524 27759 21877 20583 964 -25474 -14858 -3538 -11138 -14582 -14460 11 -2868 4967 -3967 -16418
1510 -16418 -21179 -6421 21302 49644 39185 9703 920 5703 574 -15826 -31335 3614 36136
1497 36136 16433 -21143 -32950 873 37316 53581 45120 17589 -10421 15376 28623 33213
1485 33213 26187 49811 49269 10514 -5081 24027 56988 33738 27609 42646 35663 39795 13878
1472 13878 -1725 7240 18179 51699 41461 18916 22672 29559 47612 37126 27921 31861 26496
1459 26496 14524 31751 14839 1927 -26312 -11926 11113 22264 4076 -12238 -17396 -3255
1447 -3255 15726 20018 39649 25727 -5175 12261 18898 13946 11643 6008 14671 -2169 -3290
1434 -3290 6340 -29501 3134 18045 17665 -283 4483 39990 53790 37039 20774 31619 29017
1421 29017 29723 38621 28732 26139 25453 38459 38805 15910 -7912 -5850 14195 29147 22371 21692
1407 21692 17556 2604 26789 33298 8879 -21709 -30884 -43132 -18199 9800 4722 -20724 -5514
1394 -5514 53884 81220 90263 82428 68229 28135 -243 453 -22943 -29253 -19858 10116 28644
1381 28644 17277 27283 24952 30612 4461 23813 19364 -3573 -5998 15423 30943 31750 10995
1368 10995 9640 33556 42202 17875 -11779 -9478 11300 12307 14624 11903 2781 -27698 -40577
1355 -40577 -73264 -45323 -14617 26609 21009 19334 27477 43503 39137 9760 -5047 -7707 1811
1342 1811 -5755 -34103 -15515 29101 24887 1830 10259 15637 -14982 -16668 28430 50492 34268
1329 34268 13248 -1161 -24415 -21222 -38382 -40735 -29686 2932 15828 29942 15496 -3071
1317 -3071 -3415 10087 26598 37567 39026 32878 24464 17887 21142 10664 -12455 -52110 -55263 -27736
1303 -27736 -6059 17779 63556 110375 81891 6479 -37227 -56403 -42603 -34522 -15664 21098
1291 21098 46396 28663 -25126 -17041 480 23701 36632 36028 16336 10141 -2 2849 -1346
1278 -1346 23106 27841 -4878 -15072 -15970 -9403 -335 20077 13116 -16674 -42120 -19525 12173
1265 12173 23341 18749 -17444 -17848 -24019 -25736 -39498 -8610 9490 24608 32262 21934 10467
1252 10467 7150 758 -13896 -27314 -29765 -35149 -35373 -12376 13936 767 15247 37055 44142
1239 44142 47629 50748 59933 48659 41924 48224 42215 23090 -305 -1283 -11638 -14298 -15410 -11949
1225 -11949 -26808 -4126 12400 19526 34777 38522 40758 39656 50941 43318 27019 -3219 26144
1212 26144 40925 25760 29191 40513 5453 -24144 -45332 -45334 -48340 -43109 -37461 -17464 -12357 7061
1198 7061 21362 8754 9218 36001 41339 391 -13774 -5388 -24078 -43912 -27775 2946 -6397
1185 -6397 -32152 -4888 32509 30334 28983 6493 1766 7636 17989 18289 25927 40288 56736
1172 56736 38200 6858 -22911 -14222 11277 13319 7637 11646 -17394 -28015 -18965 -15489 -21027
1159 -21027 -14882 -10539 7970 -4709 -24131 -18296 -12838 -11031 -39250 -72344 -15809 33543 40041
1146 40041 29855 14871 4901 24539 44120 13741 25591 35408 330 -1503 34710 22224
1134 22224 21869 17498 19548 44597 66375 65014 81207 78331 34441 -1712 13977 22533 28632
1121 28632 22900 22975 26551 11717 24138 54361 36096 25806 15081 9132 -5446 8070 -8263
1108 -8263 7218 11786 8107 6984 2371 -18944 -26625 -9332 -13996 13082 35220 41549 27825
1095 27825 6964 14000 15305 19202 3510 -29760 10741 9761 3917 7114 -12400 -25672 -41985
1082 -41985 -43457 -18764 -9816 -7248 -7645 -9349 6956 35818 36133 29501 34843 41348 36527 44824
1068 44824 29697 27591 23377 26616 48835 84755 78124 56587 48637 38181 50279 65925 45520
1055 45520 20777 1140 -9811 -8441 18630 31805 26796 10680 40674 15277 -14918 -14509 18871
1042 18871 70317 73841 90348 87107 66075 59726 37938 29576 33861 52956 46833 38104 27629
1029 27629 13980 15915 12686 17832 41210 48527 53444 59810 61617 32028 33452 36520 28202 -9378
1015 -9378 3141 23256 19083 -13823 -20097 4632 17698 13777 6104 43258 47028 45209 28957
1002 28957 12176 5808 4902 17483 14362 -22177 -15120 29466 54626 52940 24556 -2915 -1666
989 -1666 1161 16596 31242 37656 37802 19644 42780 31153 23825 24795 8022 12670 33064 44031
975 44031 26917 -9085 -4138 30849 34805 20217 3563 -707 -3684 -13389 3915 13937 -4645
962 -4645 20119 47751 20536 -6716 -10243 32632 38031 21483 -1268 -14649 -16903 -607 1668
949 1668 -7929 2681 22200 19179 28088 35123 17985 25793 51985 64441 61462 46920 11113
936 11113 5754 -3799 12173 43186 48174 23851 448 -5761 -17987 -13544 3449 27462 33707
923 33707 50707 55953 40052 47382 54282 14587 10426 21139 19601 5534 -5544 6082 17672
910 17672 32116 37871 40286 39233 15234 3036 21595 9076 7907 37247 45310 -7154 -18911
897 -18911 -14823 -36875 -49110 -42791 -32752 -3166 15042 19976 22134 19719 5318 -4357 -8275
884 -8275 -9066 -1096 -1802 -1629 -16237 -17895 -20704 -13640 2245 8126 4872 6271 11621 27362 15589
869 15589 51403 64577 78427 33670 23876 32377 34303 24321 26493 11217 2617 -10631 -16872
856 -16872 9101 26298 24762 40195 20319 13190 25298 5357 4307 25462 16620 28005 66400
843 66400 60144 45133 35841 -1003 -13658 -13662 5358 36392 39040 46644 50705 46809 34049 35015
829 35015 42531 43896 25772 -1802 -23953 -21437 -4361 6980 3501 -10146 -14339 2613 14929
816 14929 10999 3770 747 12789 12411 8121 18251 29762 10130 12153 14940 18398 2310 15568
802 15568 12323 -8881 -10885 16731 15083 -22831 -25649 -40858 -45991 3271 24698 27632 45666
789 45666 39685 24084 59999 51689 62241 105458 86557 63491 53432 21561 27481 27917 11432
776 11432 -5170 -18978 -22122 -19510 13543 33245 40665 26874 10183 -15188 -18119 -14116 -28618
763 -28618 -33503 -55083 -41119 -5785 1783 -798 -12081 -24955 3232 16252 9161 -2405 -2407 8349
749 8349 -478 -18595 -23718 -37121 -16314 -15667 -11630 4169 25579 -12797 -16559 -8378 -13539 -13627
735 -13627 -3698 37936 45912 27932 19758 -1283 8658 19990 24250 30116 29736 12660 -3160 16697
721 16697 -2960 -16217 -15451 -2982 -10266 3001 28097 7794 -32076 -40227 2431 -1098 -3114
708 -3114 3879 17364 6489 19216 45896 30346 20118 30811 24028 38506 57412 38358 53216
695 53216 68430 63051 67879 33741 21617 52142 58254 72607 66308 57070 64344 47859 30657
682 30657 18969 23872 30935 -1314 -17214 -18697 -16120 -14487 -36418 -10037 47702 35461 -1139
669 -1139 -28851 -35001 -40978 -9695 -7929 1978 15760 17188 41266 23601 -12458 -12731 -1257 19231
655 19231 -4405 -31676 -1481 13448 32951 67925 86164 69309 49294 31791 29364 58822
643 58822 45495 35019 65062 71833 82435 67276 26855 13118 39981 41805 76632 79601 50120
630 50120 36299 4452 18897 33127 25374 26917 7827 -15612 1028 4163 -16873 -26889 -17082
617 -17082 -18721 -52052 -53071 -60226 -37880 -24713 -11263 -10049 -42918 -44166 -27299 -19088 14553
604 14553 12532 -18987 -539 28306 37002 35310 30875 15233 28792 52257 40807 27473 11930
591 11930 5938 6030 10982 7602 -7802 2839 17173 14777 -29966 -30612 -29007 -3504 27817 62107
577 62107 61831 37370 33656 40823 32322 28017 24013 34980 26619 20039 32836 50375 76252 43777
563 43777 25365 10531 -1726 -14102 -18086 -44779 -44949 -30119 -37004 -29759 -23295 -8431 15019
550 15019 8480 18052 6796 -7023 -10340 -23311 -16431 20251 35554 45607 23245 6800 28736
537 28736 35092 53423 48281 25970 12124 28510 32744 6713 3755 20484 35588 37811 15335
524 15335 31018 25043 -1077 8971 -2376 -17556 -22752 -33031 -25718 -28205 -6564 -1414 -34685
511 -34685 1303 49540 49840 19375 16357 42471 31938 22185 -6659 -34452 -26939 -22655 -11065
498 -11065 12798 19171 9811 15490 308 -14001 -6114 -4575 603 -7881 -26125 -23685 5845 17001
484 17001 30227 41420 27609 9005 35056 45456 46194 38973 -685 -8649 8639 16964 28683
471 28683 21343 17160 7941 -1806 -12590 10420 -2036 7524 6317 5839 14513 25824 -5723 -21018
457 -21018 12058 26066 9984 -4994 7879 17289 -11724 -21621 1736 16354 18040 14359 13324
444 13324 34868 45475 60748 73082 66541 56158 41092 31786 26032 24283 7292 14408 9535
431 9535 -1514 -21100 -48790 -55950 -28478 13679 -13935 -9220 6671 -17187 -20025 10241 29808
418 29808 36629 20493 11137 -3696 -26506 -51953 -46714 -6141 13945 -20492 -14971 1723 28175
405 28175 60140 60100 49309 46557 48703 35455 20028 6979 762 -5821 1231 -15136 -1396 5109
391 5109 -15099 -13075 -1805 -19466 -1465 1181 -488 30009 32710 17894 13181 18997 3560
378 3560 12084 25402 43441 53315 44590 15588 23854 26348 24714 27867 22529 19043 40871 58902
364 58902 56909 54516 45475 73835 62508 49240 40717 26406 18301 14767 13830 21779 22823 32988
350 32988 59435 54004 33656 39582 33337 38708 34036 30684 38626 19500 10560 5797 -600 19875
336 19875 23161 17505 37447 14403 4269 12423 29046 27059 44104 30302 23297 34574 32719
323 32719 17847 28763 34478 31526 52548 38025 33004 25043 6198 20388 39042 22668 2561
310 2561 7245 26813 45696 43566 31374 17882 -5489 -4794 29008 24133 34786 37171 25897
297 25897 18664 21143 17620 20503 23191 -8313 -6641 297 -18450 8830 24710 -134 9122 -9473
$$ [...]
##END NTUPLES=NMR SPECTRUM
##END=
