##TITLE=Analysis number 327959
Compound Code cc 58801
Book Reference 508/84
Project Code adrs
Chemist Name antons
##JCAMPDX= 6.0         $$ Bruker NMR JCAMP-DX V2.0
##DATA TYPE= NMR SPECTRUM
##DATA CLASS= NTUPLES
##ORIGIN= Bruker BioSpin GmbH
##OWNER= nmr
$$ XWIN-NMR		Version 3.5
$$ Mon Apr 23 10:50:26 2007 GMT Daylight Time (UT+1h)  MAYBRIDGE\nmr@NMR_250MHZ
##.OBSERVE FREQUENCY= 250.131544655141
##.OBSERVE NUCLEUS= ^1H
##.ACQUISITION MODE= SIMULTANEOUS (DQD)
##.ACQUISITION SCHEME= undefined
##.AVERAGES= 16
##.DIGITISER RES= 18
##SPECTROMETER/DATA SYSTEM= dpx250
##.PULSE SEQUENCE= zg30
##.SOLVENT NAME= DMSO
##.SHIFT REFERENCE= (INTERNAL, DMSO, 0, 16.522)
##AUDIT TRAIL= $$ (NUMBER, WHEN, WHO, WHERE, WHAT)
$$ ##TITLE= Audit trail, XWIN-NMR		Version 3.5
$$ ##JCAMPDX= 5.01
$$ ##ORIGIN= Bruker BioSpin GmbH
$$ ##OWNER= nmr
$$ C:\u/data/dgb/nmr/ADRS/1810/pdata/1/auditp.txt
$$ ##AUDIT TRAIL=  $$ (NUMBER, WHEN, WHO, WHERE, WHAT)
(   1,<2007-04-23 10:50:02.56 +100>,<MAYBRIDGE\nmr>,<NMR_250MHZ>,
      <created by zg, POWCHK disabled, PULCHK disabled
       configuration hash MD5:
       49 4B E0 1D 92 C2 6B 37 9F E6 65 BC 52 41 86 1D
       data hash MD5: 64K
       65 2A CC 26 B3 2D CE E9 04 92 5A D6 67 2D 11 46>)
(   2,<2007-04-23 10:50:16.51 +100>,<MAYBRIDGE\nmr>,<NMR_250MHZ>,
      <Start of raw data processing
       ef LB = 0.3 FT_mod = 6 PKNL = 1 SI = 32K 
       data hash MD5: 32K
       15 6C CE 0C A7 21 01 CF B7 13 FF 6D 89 30 BD 08>)
(   3,<2007-04-23 10:50:18.15 +100>,<MAYBRIDGE\nmr>,<NMR_250MHZ>,
      <apk 
       data hash MD5: 32K
       86 56 5D 18 69 55 AA 27 BC 1F 88 60 D7 4F 86 68>)
(   4,<2007-04-23 10:50:18.84 +100>,<MAYBRIDGE\nmr>,<NMR_250MHZ>,
      <abs ABSG = 5 
       data hash MD5: 32K
       6D D5 74 E0 BB CD 12 A1 93 F0 9A 6C 4F AC B2 9F>)
$$ ##END=
$$ 
$$ hash MD5
$$ 9B D2 30 DA 75 9C 04 62 6E A9 CB 66 C2 E8 30 2C
##$RELAX= 
##$RELAX= 
##$RELAX= 
##$RELAX= 
##$RELAX= 
##$RELAX= 
##$RELAX= 
$$ Bruker specific parameters
$$ --------------------------
##$DU= <C:\u>
##$EXPNO= 1810
##$NAME= <ADRS>
##$PROCNO= 1
##$TYPE= <nmr>
##$USER= <dgb>
##$AMP= (0..31)
100 100 100 100 100 100 100 100 100 100 100 100 100 100 100 100 100 100 
100 100 100 100 100 100 100 100 100 100 100 100 100 100 
##$AQSEQ= 0
##$AQ_mod= 3
##$AUNM= <au_zg>
##$AUTOPOS= <10 >
##$BF1= 250.13
##$BF2= 250.13
##$BF3= 250.13
##$BF4= 250.13
##$BF5= 500.13
##$BF6= 500.13
##$BF7= 500.13
##$BF8= 500.13
##$BYTORDA= 1
##$CFDGTYP= 0
##$CFRGTYP= 5
##$CHEMSTR= <none>
##$CNST= (0..31)
1 1 145 1 1 1 1 1 1 1 1 1 1 1 1 1 1 1 1 1 1 1 1 1 1 1 1 1 1 1 1 1 
##$CPDPRG= <>
##$CPDPRG1= <>
##$CPDPRG2= <>
##$CPDPRG3= <>
##$CPDPRG4= <mlev>
##$CPDPRG5= <mlev>
##$CPDPRG6= <mlev>
##$CPDPRG7= <mlev>
##$CPDPRG8= <mlev>
##$CPDPRGB= <>
##$CPDPRGT= <>
##$D= (0..31)
0 1 0 0 0 0 0 0 0 0.06 0 0 0 0 0 0 0.0002 0 0 0 0 0 0 0 0 0 0 0 0 0 0 
0 
##$DATE= 1177321801
##$DBL= (0..7)
120 120 120 120 120 120 120 120 
##$DBP= (0..7)
150 150 150 150 150 150 150 150 
##$DBP07= 0
##$DBPNAM0= <>
##$DBPNAM1= <>
$$ [...]
##$SUBNAM7= <"">
##$SUBNAM8= <"">
##$SUBNAM9= <"">
##$SW= 20.6930455092707
##$SWIBOX= (0..15)
0 0 3 0 0 0 0 0 0 0 0 0 0 0 0 0 
##$SW_h= 5175.983436853
##$TD= 65536
##$TD0= 1
##$TE= 683.16
##$TE2= 300
##$TE3= 300
##$TEG= 300
##$TL= (0..7)
0 120 120 120 120 120 120 120 
##$TP= (0..7)
150 150 150 150 150 150 150 150 
##$TP07= 0
##$TPNAME0= <>
##$TPNAME1= <>
##$TPNAME2= <>
##$TPNAME3= <>
##$TPNAME4= <>
##$TPNAME5= <>
##$TPNAME6= <>
##$TPNAME7= <>
##$TPOAL= (0..7)
0.5 0.5 0.5 0.5 0.5 0.5 0.5 0.5 
##$TPOFFS= (0..7)
0 0 0 0 0 0 0 0 
##$TUNHIN= 0
##$TUNHOUT= 0
##$TUNXOUT= 0
##$USERA1= <user>
##$USERA2= <user>
##$USERA3= <user>
##$USERA4= <user>
##$USERA5= <user>
##$V9= 5
##$VALIST= <valist>
##$VCLIST= <CCCCCCCCCCCCCCC>
##$VD= 0
##$VDLIST= <DDDDDDDDDDDDDDD>
##$VPLIST= <PPPPPPPPPPPPPPP>
##$VTLIST= <TTTTTTTTTTTTTTT>
##$WBST= 1024
##$WBSW= 4
##$XGAIN= (0..3)
0 0 0 0 
##$XL= 0
##$YL= 0
##$YMAX_a= 225149
##$YMIN_a= -242210
##$ZGOPTNS= <>
##$ZL1= 120
##$ZL2= 120
##$ZL3= 120
##$ZL4= 120
##$ABSF1= 16.522
##$ABSF2= -4.171173
##$ABSG= 5
##$ABSL= 3
##$ALPHA= 0
##$AQORDER= 0
##$ASSFAC= 0
##$ASSFACI= 0
##$ASSFACX= 0
##$ASSWID= 0
##$AUNMP= <proc_1d>
##$AZFE= 0.1
##$AZFW= 0.1
##$BCFW= 0
##$BC_mod= 0
##$BYTORDP= 0
##$COROFFS= 0
##$CY= 12.5
##$DATMOD= 1
##$DC= 0
##$DFILT= <>
##$DTYPP= 0
##$F1P= 14.0000005364418
##$F2P= -0.99999901652339
##$FCOR= 0.5
##$FTSIZE= 32768
##$FT_mod= 6
##$GAMMA= 0
##$GB= 0
##$INTBC= 1
##$INTSCL= 1
##$ISEN= 128
##$LB= 0.3
##$LEV0= 0
##$LPBIN= 0
##$MAXI= 10000
##$MC2= 0
##$MEAN= 0
##$ME_mod= 0
##$MI= 0
##$NCOEF= 0
##$NC_proc= -6
##$NLEV= 6
##$NOISF1= 0
##$NOISF2= 0
##$NSP= 0
##$NTH_PI= 0
##$NZP= 0
##$OFFSET= 16.522
##$PC= 1
##$PHC0= 220.434
##$PHC1= 11.79232
##$PH_mod= 1
##$PKNL= yes
##$PPARMOD= 0
##$PSCAL= 4
##$PSIGN= 0
##$REVERSE= no
##$SF= 250.13
##$SI= 32768
##$SIGF1= 0
##$SIGF2= 0
##$SINO= 400
##$SIOLD= 32768
##$SREGLST= <1H.DMSO>
##$SSB= 0
##$STSI= 32768
##$STSR= 0
##$SW_p= 5175.98343685301
##$SYMM= 0
##$S_DEV= 0
##$TDeff= 65536
##$TDoff= 0
##$TI= <Analysis number 999999
Compound Code 99
Book Reference 9
Project Code 9>
##$TILT= no
##$TM1= 0
##$TM2= 0
##$TOPLEV= 0
##$USERP1= <user>
##$USERP2= <user>
##$USERP3= <user>
##$USERP4= <user>
##$USERP5= <user>
##$WDW= 1
##$XDIM= 32768
##$YMAX_p= 603822876
##$YMIN_p= -1304175
$$ End of Bruker specific parameters
$$ ---------------------------------
##NTUPLES= NMR SPECTRUM
##VAR_NAME=  FREQUENCY,     SPECTRUM/REAL,   SPECTRUM/IMAG
##SYMBOL=    X,             R,               I
##VAR_TYPE=  INDEPENDENT,   DEPENDENT,       DEPENDENT
##VAR_FORM=  AFFN,          ASDF,            ASDF
##VAR_DIM=   32768,         32768,           32768
##UNITS=     HZ,            ARBITRARY UNITS, ARBITRARY UNITS
##FACTOR=    0.157963299565203, 1,           1
##FIRST=     4132.6476996994, 0,             0
##LAST=      -1043.33573715361, 0,           0
##MIN=       -1043.33573715361, -1304175,    0
##MAX=       4132.6476996994, 603822876,     0
$$ Real data points
##PAGE= N=1
##DATA TABLE= (X++(R..R)), XYDATA
$$ [...]
21757a56162K21982J84647K45844J02927j09544l09766j00994j55759K72278m906
$$ -156162 65820 250467 496311 599238 489694 179928 78934 -76825 195453 190547
21747A90547J214J03680k77996m2399M2862r7458q8640L36826K25214j53858R1300
$$ 190547 191761 295441 17445 -24954 17908 -79550 -168190 168636 393850 239992 331292
21736C31292j01725j77802k2809O1965l8372k58596j59099j01635L74909M698
$$ 331292 229567 51765 28956 90921 52549 -206047 -365146 -466781 -91872 -87174
21726h7174J9968Q7657k43387J36513q8449o9229K16910K01036m95366j62093
$$ -87174 -67206 20451 -222936 -86423 -174872 -244101 -27191 173845 -321521 -483614
21716d83614K37506l5581M19203L58676J0813J06974m06180j43766L58817r4590
$$ -483614 -246108 -281689 137514 496190 507003 613977 207797 64031 422848 328258
21706C28258p0646j51632k59937r9918J01745J95230O9334L3366j50943l40166
$$ 328258 257612 105980 -153957 -253875 -152130 43100 112434 145800 -5143 -345309
21696c45309l56822J91951N30316K96238J53784m16883k52165J30098K13853J33473
$$ -345309 -702131 -510180 20136 316374 470158 53275 -198890 -68792 145061 278534
21686B78534J70642p0387m22422j43025K48815r5685K6196J6710j11683L41799
$$ 278534 449176 378789 -43633 -186658 62157 -33528 -7332 9378 -102305 239494
21676B39494K29511j73022j81415L2692k29744j57968L7377J59735j46463q4805
$$ 239494 469005 295983 114568 147260 -82484 -240452 -203075 -43340 -189803 -274608
21666b74608J23715q8960n2034m13912P9820J63166m2757J93602J69630j7767
$$ -274608 -150893 -239853 -291887 -705799 -625979 -462813 -505570 -311968 -142338 -160105
21656a60105r114R9670k83722O4215J69908k92666r3003J60828P5060M4449K01586
$$ -160105 -169219 -69549 -353271 -289056 -119148 -411814 -504817 -343989 -268929 -224480 -22894
21645b2894J11767M19034k43393p9507k06493j16441L21235L21952o6198k19598
$$ -22894 88873 507907 264514 185007 -21486 -137927 183308 505260 439062 219464
21635B19464k75535R3949K66303K09129j50351q0494k87173k03157K45682J24007
$$ 219464 -56071 37878 304181 513310 362959 282465 -4708 -207865 37817 161824
21625A61824o7696l1046O9613O5931j17607R0548k24047m517l73283j22456P6837
$$ 161824 94128 63082 132695 198626 81019 171567 -52480 -56997 -430280 -552736 -475899
21614d75899o8786J19625p9833J07479r4571L0798J52882N3107R0578j69690R6291
$$ -475899 -544685 -425060 -504893 -397414 -491985 -461187 -308305 -255198 -164620 -334310 -238019
21603b38019M70987J07757k10329r1871K0637j5747r1947J34450j79072J30334
$$ -238019 232968 340725 130396 38525 59162 43415 -48532 85918 -93154 37180
21593C7180j03003l1631K11672k21157K0719q5522j27660j2900L57111j17782
$$ 37180 -65823 -97454 114218 -106939 -86220 -171742 -299402 -312302 44809 -72973
21583g2973k08132l32788L93190L30221k6341l4800k1647l25972J08275J32224
$$ -72973 -281105 -613893 -220703 109518 83177 48377 26730 -299242 -190967 -58743
21573e8743l29974L68628Q6204L34502j86542j68064r4445J90683N7956l52542
$$ -58743 -388717 -20089 66115 400617 214075 46011 -48434 142249 200205 -152337
21563a52337p2115J45894J7063M7459M1617J26413m62509K33729K14839o4993
$$ -152337 -224452 -78558 -61495 -14036 27581 153994 -308515 -74786 140053 75060
21553G5060m49448m52186L57292N4331O4649R4300J57226L30339j64490l12909
$$ 75060 -374388 -826574 -469282 -414951 -350302 -256002 -98776 231563 67073 -245836
21543b45836O2212j1192j02306J84911Q2600q5667j59585j29993O4397L72119
$$ -245836 -183624 -194816 -297122 -112211 -29611 -115278 -274863 -404856 -340459 31660
21533C1660o7j08779M2167j33073J80539K54074k03185K2716m4714o10p2985M1628
$$ 31660 31593 -77186 -35019 -168092 12447 266521 63336 86052 41338 40728 -32257 9371
21521I371K06674J89923j63781k18002k59453L79054M64799J2837J57865k56741
$$ 9371 216045 405968 242187 24185 -235268 143786 608585 621422 779287 522546
21511E22546n80160o7024K43883r5980l40758J08280M36186J83167k8052L709
$$ 522546 -57614 -124638 119245 23265 -317493 -209213 226973 410140 382088 385797
21501C85797J2400q6627k46103k2293o703m7617K5681r5966l40294j99095M07650
$$ 385797 398197 311570 65467 43174 36471 -11146 14535 -81431 -421725 -620820 -213170
21490b13170J51238J71782m5494k32927o8866Q844k0911k758K6072J75200J22208
$$ -213170 -61932 109850 64356 -168571 -237437 -228593 -249504 -252262 -226190 -50990 71218
21479G1218K18629K76755j09055K5374J92062j55157P2811j06617k17325m15409
$$ 71218 289847 566602 457547 482921 674983 519826 592637 486020 268695 -146714
21469a46714M6766k56025k9369j7877K65988K64165j65453k41634N0525R1678
$$ -146714 -99948 -355973 -385342 -403219 -137231 126934 -38519 -280153 -229628 -137950
21459a37950j0516Q8586j30762k56293K20220J58150P2068j95J7604k64165k42275
$$ -137950 -148466 -59880 -190642 -446935 -226715 -68565 3503 3308 20912 -243253 -485528
21448d85528j70485J73376K59239K16086j9748J08004k3674k5870j11362J14655
$$ -485528 -656013 -482637 -223398 -7312 -27060 80944 57270 31400 -79962 34693
21438C4693J99471j81547j86394j6885J87224J8763n2543j56069p0371K30656
$$ 34693 234164 52617 -133777 -150662 36562 55325 2782 -153287 -223658 6998
21428F998m2381j53472K18646j71660R9012J63378K20064r7901K03839l42868
$$ 6998 -35383 -188855 29791 -141869 -42857 120521 340585 242684 446523 103655
21418A03655j48758K22019J68774K2490j9977m08969j0981N0226j9267l08037
$$ 103655 -45103 176916 345690 368180 348203 -60766 -71747 -21521 -40788 -348825
21408c48825l9881M10470P4941j34662K06632r8234k5395M5221j45668r609k10952
$$ -348825 -388706 21764 96705 -37957 168675 70441 45046 90267 -55401 -65010 -275962
21397b75962J85381j74215l5546N50409J75249K9351Q0569j80790k15863r1304
$$ -275962 -90581 -264796 -300342 250067 425316 454667 535236 354446 138583 47279
21387D7279j7904j42407k30733n0392l2855k0508J67588J15805J87472O8429k4451
$$ 47279 29375 -113032 -343765 -394157 -427012 -447520 -279932 -164127 23345 91774 67323
21376F7323O4253M8001r7754l66910r7155L56515J74804j97258j07724Q2546J12946
$$ 67323 131576 179577 81823 -285087 -382242 -25727 149077 -48181 -155905 -73359 39587
21365C9587K2918j05449j55070J01441J46645J59831p7210J29542l39258k3807
$$ 39587 62505 -42944 -198014 -96573 50072 209903 132693 262235 -77023 -100830
21355a00830K81554j73501P1770J12764l9730j05776k71463L22459L15444r2260
$$ -100830 180724 7223 78993 191757 152027 46251 -225212 97247 412691 320431
21345C20431o35604n18863J34369L65911N2012l04355P957J66825M7604n5950
$$ 320431 -315173 -834036 -699667 -333756 -281744 -586099 -578142 -411317 -363713 -419663
21335d19663n7705J97541K605L11296J03741K50504l2941K7340j57952j49023
$$ -419663 -477368 -279827 -277222 34074 137815 388319 355378 382718 224766 75743
21325G5743j47370N5297L68607j4989r1491M4355j04284j55156k77276l25715
$$ 75743 -71627 -16330 352277 337288 245797 290152 185868 30712 -246564 -572279
21315e72279M20330L54354K4146k99052K00223P3676R1316o17473l17008P5210
$$ -572279 -151949 202405 226551 -72501 127722 201398 292714 -324759 -641767 -566557
21305e66557K20049J85488L34424M806N8413k5175l32080m3439j80893m4291O4969
$$ -566557 -346508 -161020 173404 178210 236623 211448 -120632 -164071 -344964 -389255 -324286
21294c24286k78974J664M09932k40916l84619o1328K76994N47816J97417j1941
$$ -324286 -603260 -601596 -191664 -432580 -817199 -878527 -601533 -53717 143700 131759
21284A31759j30940K9951m5083m01152n07689J22573P11828N9672K05052K35570
$$ 131759 819 30770 -14313 -415465 -923154 -800581 -88753 -29081 175971 411541
21274D11541N0325p6060K8464l31592l42557J36442L49130j87550j77397l7800
$$ 411541 461866 385806 414270 82678 -259879 -123437 225693 38143 -139254 -177054
21264a77054J00619J77877n4997l670K17605O2354k4470j77390l75945N2759Q6956
$$ -177054 -76435 101442 46445 42775 260380 322734 298264 120874 -255071 -202312 -115356
21253a15356l52266k77518L59590M56308p5155j03107j4259l6917j8755M2127
$$ -115356 -467622 -745140 -385550 70758 -4397 -107504 -121763 -158680 -177435 -135308
21243a35308o1178p1884M7023k20498O2299K27952J82791M6945O9128k01382n0091
$$ -135308 -196486 -268370 -221347 -441845 -379546 -151594 31197 78142 147270 -54112 -104203
21232a04203k99013r1267L83158k32674P5048O1503J75403J06819j44087o7869
$$ -104203 -403216 -494483 -111325 -343999 -268951 -207448 -32045 74774 -69313 -137182
21222a37182m25246M086L86833l7618J03132M26953j15154R0921J8936j91421
$$ -137182 -562428 -558342 -171509 -209127 -105995 320958 205804 296725 315661 124240
21212A24240j7727J48121k9683j1886L4156j37781k79354l23069l57696K15243
$$ 124240 106513 254634 224951 213065 247221 109440 -169914 -492983 -850679 -635436
21202f35436K470L64636Q9856n2684R7029p6499K79229J39033L3978q2982j43606
$$ -635436 -632966 -268330 -178474 -231158 -134129 -210628 68601 207634 241612 158630 15024
21191A5024Q9215o0797K79238l37682j66464K85263j08313l20870j73705n4680
$$ 15024 104239 43442 322680 -15002 -181466 103797 -4516 -325386 -499091 -553771
21181e53771k3063l12855O9766L69550K92607J46371K52490K0242M7367L95687
$$ -553771 -576834 -889689 -819923 -450373 -157766 -11395 241095 261337 308704 704391
21171G04391r188o54437l70495J20491r9226J05071j40942J60568J27342r5076
$$ 704391 695203 40766 -329729 -209238 -308464 -203393 -344335 -183767 -56425 -151501
21161a51501j09416K23961L6142O7498j06047k0542k2948j52565j69042L5295
$$ -151501 -260917 -36956 -814 66684 -39363 -59905 -82853 -235418 -404460 -369165
21151c69165K23881M07191j90546l38513K75900K05436k35064l05417O98082K78203
$$ -369165 -145284 261907 71361 -267152 8748 214184 -20880 -326297 371785 649988
21141F49988m51885k53724r9700l659r7870k43231j599o7824K72320k1625k15864
$$ 649988 198103 -55621 -155321 -158980 -256850 -500081 -501680 -569504 -297184 -318809 -534673
21130e34673K81128K48952n9310j22521R2832k09734l17030M8269M06890j581
$$ -534673 -253545 -4593 -63903 -186424 -93592 -303326 -620356 -572087 -165197 -166778
21120a66778r2375q9419K56421M50868q9481j27313j12965J13021L4519r3647
$$ -166778 -259153 -348572 -92151 358717 269236 141923 28958 141979 176498 82851
21110H2851J57278J95250k93212n6861K72181m26623j17113j03281l15096J00988
$$ 82851 240129 435379 142167 85306 357487 -69136 -186249 -289530 -604626 -503638
21100e03638J57238J34718O3834K66857o9125j12666p6172o5796j01439l12921
$$ -503638 -346400 -211682 -147848 119009 49884 -62782 -138954 -204750 -306189 -619110
21090f19110k70248K00865K20366N3454K51191L16926m60356l92479o2685K60521
$$ -619110 -889358 -688493 -468127 -414673 -163482 153444 -306912 -699391 -762076 -501555
21080e01555K2788p0122l5281j43839J5482L32976J21659o8429k20893k90454
$$ -501555 -478767 -548889 -584170 -728009 -712527 -379551 -257892 -326321 -547214 -837668
21070h37668J30328K66587K4231Q5333j56393K69901J23771l1649j79157j70861
$$ -837668 -707340 -440753 -416522 -331189 -487582 -217681 -93910 -125559 -304716 -475577
21060d75577K35333L19788J91995l75072J7939M10985L26280l23320j60937j52855
$$ -475577 -240244 79544 271539 -103533 -85594 325391 651671 328351 167414 14559
21050A4559j02853j83205k1366o1881K5755j51368j30421K72168K09858j41593
$$ 14559 -88294 -271499 -292865 -354746 -328991 -480359 -610780 -338612 -128754 -270347
21040b70347n23696q3862l32687l1062L05316L75190L5757L42809J64828R2248
$$ -270347 -794043 -877905 -1210592 -1241654 -936338 -561148 -525391 -182582 -17754 74494
21030G4494j47746n0427j73055K3310J78091j1784L0427J69425J440j49356J18593
$$ 74494 -73252 -123679 -296734 -273424 -95333 -107117 -76690 92735 94175 -55181 63412
21019F3412J3308j62273o5102r7068L09456Q8124k95803j76478J45614R0165K45445
$$ 63412 76720 -85553 -150655 -247723 61733 149857 -145946 -322424 -176810 -86645 158800
21008A58800J9270k45315j73346j38802K43631L11480J38371L8831j90373k68187
$$ 158800 178070 -67245 -240591 -379393 -135762 175718 314089 352920 162547 -105640
20998a05640p0025J26839k6390m63116j5637L61309j44502J36444p1080n1234
$$ -105640 -175665 -48826 -75216 -538332 -553969 -192660 -337162 -200718 -271798 -323032
20988c23032l1865J21010L58792o4605k68160M21582l35971n78203J14371k75309
$$ -323032 -354897 -233887 124905 60300 -207860 213722 -122249 -700452 -586081 -861390
20978h61390j05463J75003L94471K67989M42170L08741l44006j06509L1989L5859
$$ -861390 -966853 -791850 -397379 -129390 312780 621521 277515 171006 202995 238854
20968B38854j73226k24685M0480O1790k33247N27K56818j47006J18807J39688
$$ 238854 65628 -159057 -118577 -56787 -290034 -289507 -32689 -179695 -60888 78800
20958G8800m1843p7706J42234K90730k38573l38385k85075J44184j23857J33660
$$ 78800 36957 -40749 101485 392215 153642 -184743 -469818 -325634 -449491 -315831
20948c15831O3318j49285Q7492K28556P8695j6024J33900q9679N9222Q2885J75861
$$ -315831 -252513 -401798 -314306 -85750 -7055 -23079 110821 21142 80364 163249 339110
20937C39110L9637j87539J38316R537k75603j53430k33041K9321K51513m5455
$$ 339110 378747 191208 329524 339061 63458 -89972 -323013 -293692 -42179 -87634
20927h7634N942K32138L43047j37920r6065k36102o87555o5421M17572J43366
$$ -87634 -81692 150446 493493 355573 259508 23406 -664149 -729570 -311998 -168632
20917a68632J17049L7999k43203R5472J0490q4881l57911O5891J98555K35928
$$ -168632 -51583 -13584 -256787 -161315 -150825 -235706 -593617 -527726 -329171 -93243
20907i3243n6135j7373k19586k47085k9887L19694j05149l18517J43063J15537
$$ -93243 -149378 -166751 -386337 -633422 -663309 -343615 -448764 -767281 -624218 -508681
20897e08681K06625P9152j04438j28462k36809J26823K49412M75303K05113J20461
$$ -508681 -302056 -222904 -327342 -455804 -692613 -565790 -316378 158925 364038 484499
20887D84499M7973k90097j23622L77077k03557r4496n2922O243K0055l4380K71965
$$ 484499 532472 242375 118753 495830 292273 197777 144855 151098 171153 136773 408738
20876D08738r7200l41164j07946j2557j28499p4027J49353K08453j56978J12901
$$ 408738 311538 -29626 -137572 -150129 -278628 -352655 -203302 5151 -151827 -38926
20866c8926K03321m0234k58233j44718L76736j06615L11367L40080j67126j79798
$$ -38926 164395 124161 -134072 -278790 97946 -8669 302698 642778 475652 295854
20856B95854q7023L919k12351k00445K28398j65606l81152O6796N43286J90392
$$ 295854 208831 212750 399 -200046 28352 -137254 -518406 -451610 91676 282068
20846B82068j8857q3900o4644r8339j33942J11432n857L227p3128J11317o4119
$$ 282068 263211 179311 114667 16328 -117614 -6182 -12039 -8812 -81940 29377 -34742
20835c4742p5667J52568J94203k08101m39191J10248p1543l06538m43788K11370
$$ -34742 -110409 42159 236362 28261 -410930 -300682 -372225 -678763 -1122551 -911181
20825i11181K08101J94654j27651k23548K42498K24530k7378j31851o6792L18453
$$ -911181 -703080 -508426 -636077 -859625 -617127 -392597 -419975 -551826 -618618 -300165
20815c00165N28712J30254k56249p9293J54342l33143n57814j3146J56993J87844
$$ -300165 228547 358801 102552 23259 177601 -155542 -713356 -726502 -569509 -381665
20805c81665Q5642k20562k04471J1942j09929L4688M65446K42048J20958k48188
$$ -381665 -296023 -516585 -721056 -709114 -819043 -784355 -318909 -76861 44097 -204091
20795b04091k10868m3903K67125N17462l14664K0479J28560k84952K64114L86187
$$ -204091 -414959 -458862 -191737 325725 11061 31540 160100 -124852 139262 525449
20785E25449M8896k25654p0509j38376N171M8655R5641n0521j98058J53890J78130
$$ 525449 574345 348691 278182 139806 144977 193632 289273 238752 40694 194584 372714
20774C72714j77562j75462O2043L5202J21597k36160j44640j68069j55306J13579
$$ 372714 195152 19690 81733 116935 238532 2372 -142268 -310337 -465643 -352064
20764c52064J64598L09649j67698m90229k49865K77397L41751r7994K6554o2422
$$ -352064 -187466 122183 -45515 -535744 -785609 -508212 -166461 -264455 -237901 -300323
20754c00323L51745n472q2840J52867J31316k62509k80852O2017J43035P6715
$$ -300323 51422 45950 -36890 115977 247293 -15216 -296068 -234051 -91016 -14301
20744a4301M2594m17617k12654J74101O4298j34139j35181J35413J84538K59893
$$ -14301 28293 -389324 -601978 -427877 -363579 -497718 -632899 -497486 -312948 -53055
20734e3055m4996j37281K76181k2489k45071k13370K66912J23660J02305o8909
$$ -53055 -98051 -235332 40849 18360 -226711 -440081 -173169 -49509 52796 -16113
20724a6113j85807k3682J40711o4803m4204j6420k50732k92005k08157o2164j43404
$$ -16113 -201920 -225602 -84891 -149694 -193898 -210318 -461050 -753055 -961212 -1023376 -1166780
20713a166780R2456M62387K66600k61024r893j06284J32976L59644m8484J3001
$$ -1166780 -1074324 -611937 -345337 -606361 -616254 -722538 -589562 -229918 -278402 -265401
20703b65401L0342r4451j17457K23843k5246j74163j98258j8994K00565K73061
$$ -265401 -235059 -329510 -446967 -223124 -248370 -422533 -620791 -639785 -439220 -166159
20693a66159j30452M6790M9727N4615J03407O7562k25298k03995K32319K99858
$$ -166159 -296611 -249821 -200094 -145479 -42072 25490 -199808 -403803 -171484 128374
20683A28374l11089K92124P7973q5485j67162l9094j29734Q3252J45317M5314
$$ 128374 -182715 109409 187382 101897 -65265 -104359 -234093 -150841 -5524 39790
20673C9790k30952Q9373J0875o8092j466J95910M58255k94330j75316j75806k04141
$$ 39790 -191162 -101789 -90914 -159006 -160472 35438 493693 199363 24047 -151759 -355900
20662c55900K57091q206l43458k92579M47219K6217q8878L75486K62739J87197
$$ -355900 -98809 -107015 -450473 -743052 -295833 -269616 -358494 16992 279731 466928
20652D66928m14074q3242J19911J26756J22336J32676l09545p9550K19038Q2194
$$ 466928 52854 -30388 89523 216279 338615 471291 161746 82196 301234 383428
20642C83428j13184j14401K36396R77j62817K2586n3518l27016j35049q5597J31889
$$ 383428 270244 155843 392239 393216 230399 252985 199467 -127549 -262598 -348195 -216306
20631b16306J73134L36522j92888m511j53699L024K7865l91461q0189J03652J81915
$$ -216306 -43172 293350 100462 95951 -57748 -54724 -26859 -418320 -498509 -394857 -212942
20620b12942K06025J08631P8269p096o5641k01714o7613J39609K91145L7485j10509
$$ -212942 -6917 101714 179983 172887 107246 -94468 -162081 -22472 268673 306158 195649
20609A95649J63515J35305q0811n9994o6840m03223O9772O0426M1230o5479j97077
$$ 195649 359164 494469 413658 353664 286824 -116399 -46627 13799 55029 -10450 -207527
20598b07527k17794m4385L31644J91187l3727m3035J20520m9799l98657j53974
$$ -207527 -425321 -469706 -138062 53125 19398 -23637 96883 47084 -351573 -505547
20588e05547R3676M02195K31122l8222q8946J09794K84681L7491j22175m29259
$$ -505547 -411871 -9676 221446 183224 94278 204072 488753 526244 404069 -25190
20578b5190l24186J88434K086n1343L50765J91873k26574k74440Q6196q7224K57205
$$ -25190 -349376 -160942 -158856 -210199 140566 332439 105865 -168575 -82379 -169603 87602
20567H7602L6815R5406K0642l365j79371J69707K81142k59327m10386J03846j34633
$$ 87602 124417 219823 240465 237100 57729 227436 508578 249251 -161135 -57289 -191922
20556a91922J42412J00582m6616K04092K80539l5050o49122n25537K8570K70525
$$ -191922 -49510 51072 4456 208548 489087 454037 -195085 -720622 -692052 -421527
20546d21527J8978K93975p9768J23840K41450K39159q6856n67715m21449j37867
$$ -421527 -402549 -108574 -188342 -64502 176948 416107 329251 -238464 -659913 -797780
20536g97780J56520M81706O6690k05267j75236k61039l7383R5296P54138M51930
$$ -797780 -641260 -159554 -92864 -298131 -473367 -734406 -771789 -676493 77645 529575
20526E29575j82731m97383l14048p0081J39915J88189K74151j98011m25013J1251
$$ 529575 346844 -150539 -464587 -534668 -394753 -206564 67587 -130424 -555437 -544186
20516e44186l5612K13799L30736K15502K36053n1672j76127k17728R0760O1371
$$ -544186 -579798 -365999 -35263 180239 416292 364620 188493 -29235 61525 122896
20506A22896j42372p5693q5437M32151j9724m39992j63761m53095L575N77626
$$ 122896 -19476 -95169 -180606 251545 231821 -208171 -371932 -825027 -821452 -243826
20496b43826L07281N5497p829K73047k4343l70999j97372j47404j85915k7977
$$ -243826 63455 118952 111123 384170 359827 -11172 -208544 -355948 -541863 -569840
20486e69840J24622J56828l72444R9508N73936K35249O1976k937o0221k83366
$$ -569840 -445218 -288390 -660834 -561326 12610 247859 309835 306898 246677 -36689
20476c6689J2142Q2168j17053j60312K03097l23183k32449K79743K1125j33553
$$ -36689 -24547 57621 -59432 -219744 -16647 -339830 -572279 -292536 -271411 -404964
20466d04964R5725J2473j43073j68198J64831M42526O39862j93534m68917L52659
$$ -404964 -309239 -296766 -439839 -608037 -443206 -680 639182 445648 -23269 329390
20456C29390O8512j98352j11278Q2709o5348l20481Q9987J57583j32475M46039
$$ 329390 397902 199550 88272 170981 105633 -214848 -124861 32722 -99753 346286
20446C46286P0394k26859k11423r6673J25874K12829Q1819j49992k26435j82163
$$ 346286 416680 189821 -21602 -118275 7599 220428 302247 152255 -74180 -256343
20436b56343J30985K66072K43730j91343k41903J71825J43816l98740j37009J39691
$$ -256343 -125358 140714 384444 193101 -48802 123023 266839 -131901 -268910 -129219
20426a29219o3665l36876J21176K88572l21478l85286M33688o8057J20978M85154
$$ -129219 -192884 -529760 -408584 -120012 -441490 -826776 -393088 -461145 -340167 144987
20416A44987K81269n6274j25644k61289m43462o5176J77210j2053k42947L20696
$$ 144987 426256 369982 244338 -16951 -460413 -525589 -348379 -360432 -603379 -282683
20406b82683N9190k5331q3343J86173L19001o1628k10870N6963J7950N5286j41671
$$ -282683 -223493 -248824 -332167 -145994 173007 111379 -99491 -42528 -24578 30708 -110963
20395a10963R71L61274J91180K48177j45028j73903l70506K3912J49713J10548
$$ -110963 -109992 251282 442462 690639 545611 371708 1202 25114 174827 285375
20385B85375j203l10091j60413m7051j79971n3195O12787K45838j97082j35789
$$ 285375 284172 -25919 -186332 -233383 -413354 -466549 146238 392076 194994 59205
20375E9205P7721K88620j37811j45499K2270K20315p9864p7220j4279m37968j55241
$$ 59205 136926 425546 287735 142236 164506 384821 304957 227737 213458 -224510 -379751
20364c79751L39136L16522k3067r1576L84608k12924j03634O0617K53547R8726
$$ -379751 -40615 275907 252840 161264 545872 332948 229314 289931 543478 642204
20354F42204l16496n67205l23602K35398N91571K22893l53071p1270q2421k30660
$$ 642204 325708 -241497 -565099 -329701 261870 484763 131692 60422 -21999 -252659
20344b52659k67712Q0033Q1937J15263J2953L84256J10917l021r5455k48257l0881
$$ -252659 -520371 -440338 -358401 -243138 -230185 154071 264988 261967 166512 -81745 -112626
20333a12626J43983m19876M23816M49326l25188l75284l14637M3527K40932K64498
$$ -112626 31357 -388519 35297 484623 159435 -215849 -530486 -486959 -246027 18471
20323A8471R4968p4072J6071p1050J97189J3454j89101l25694k58535k02942R337
$$ 18471 113439 39367 55438 -15612 181577 195031 5930 -319764 -578299 -781241 -771904
20312g71904K47919L00768m0371m9287L78730k69423J13469m3551q901J36962
$$ -771904 -523985 -223217 -263588 -312875 65855 -203568 -90099 -133650 -142551 -5589
20302e589L84770L5902r4191j30913j14590k0012M17409P209J02910L629m82353
$$ -5589 379181 415083 320892 189979 75389 55377 472786 479995 582905 586534 104181
20291A04181l43959K0451j80290l51816L40698Q7940p1232J86052J97321k86657
$$ 104181 -239778 -219327 -399617 -751433 -410735 -322795 -394027 -207975 -10654 -297311
20281b97311o7652J82659Q3295j42491M224M8590o2518J17250R8797o5051j66335
$$ -297311 -364963 -182304 -99009 -241500 -237276 -188686 -251204 -133954 -35157 -100208 -266543
20270b66543J35062l13012m14508R262J46473R5620L71483R6412L19467k06522
$$ -266543 -131481 -444493 -859001 -849739 -703266 -607646 -236163 -139751 179716 -26806
20260b6806j94408k20641J45428J05522j55926O0308N3859l22240m8523O6897
$$ -26806 -221214 -441855 -296427 -190905 -346831 -286523 -232664 -554904 -603427 -536530
20250e36530J93696J47276K2661J35129j15628M9692J10927J1750R2009j76456
$$ -536530 -342834 -195558 -172897 -37768 -153396 -103704 7223 18973 110982 -65474
20240f5474j30447k80144J93648J84491K43068R1245j52034o1166R0700n8050
$$ -65474 -195921 -476065 -282417 -97926 145142 236387 84353 23187 113887 55837
20230E5837o6930J75408j1848j44655J01420j89704j02253L25447J3381j91879
$$ 55837 -11093 164315 152467 7812 109232 -80472 -182725 142722 156103 -35776
20220c5776q0j84538J81598J28524J14415j01758J04357J26512K52214p0832j75475
$$ -35776 -35856 -220394 -38796 89728 204143 102385 206742 333254 585468 514636 339161
20209C39161m98437M227N05496J59655k24726J69453k61755k61145Q9917k8836
$$ 339161 -159276 -155049 350447 510102 285376 454829 193074 -68071 21846 -6990
20199f990k26229J00750J73680J3696j27427j92283l15039K33301K91969L94584
$$ -6990 -233219 -132469 41211 54907 -72520 -264803 -579842 -346541 -54572 340012
20189C40012L79460k13043m61129O265K16173l21979j08012M51164K29230J880
$$ 340012 719472 506429 45300 51565 267738 -54241 -162253 288911 518141 520021
20179E20021k00599k85931j24846j84469p176k02583J88532K11508K57571k3876
$$ 520021 319422 33491 -91355 -275824 -283000 -485583 -297051 -85543 172028 148152
20169A48152k38846j24651k23335l37282J58737J46565Q2809J5275J32570K20672
$$ 148152 -90694 -215345 -438680 -775962 -617225 -470660 -387851 -372576 -240006 -19334
20159a9334K02327O5870n4811k53670q4937r7038q9742L07316L4236J09149J4679
$$ -19334 182993 248863 194052 -59618 -144555 -241593 -331335 -24019 10217 119366 134045
20148A34045k41984O3694J90690j54085j57304j36586j35089N6751K65658j7695
$$ 134045 -107939 -44245 146445 -7640 -164944 -301530 -436619 -379868 -114210 -131905
20138a31905o6464L826K4057J1147Q6763M1611O8063r4235j42659m94044k18182
$$ -131905 -198369 -194543 -170486 -159339 -72576 -30965 37098 -57137 -199796 -693840 -912022
20127i12022L78333K14150O6850K30423J73742L97679M3666r7915j95058j25205
$$ -912022 -533689 -319539 -252689 -22266 151476 549155 592821 494906 299848 174643
20117A74643l0109J09284j23521k93137L80584L80730O4447m11888m27660k20870
$$ 174643 144534 253818 130297 -162840 217744 598474 662921 251033 -176627 -397497
20107c97497R4424J22962J39099k2497O2988L1956j95081j54208k6894L13992
$$ -397497 -303073 -180111 -41012 -63509 -521 31435 -163646 -317854 -344748 -30756
20097c0756K35748o9808j13223l8326Q0949k10292l1858n7815m8325r6665j00900
$$ -30756 204992 135184 21961 -16365 64584 -145708 -177566 -235381 -283706 -380371 -481271
20086d81271Q2872M28327j44586k33492J7828J93494P264J32072J45659K57581
$$ -481271 -398399 29928 -114658 -348150 -330322 -136828 -129564 2508 148167 405748
20076D05748J56962o3178l62026L2053j76388k54343j31615M66027K08546M6343
$$ 405748 562710 499532 137506 169559 -6829 -261172 -392787 73240 281786 328129
20066C28129k04969p1029L90827j62273j57122K6961m1163o2883M4569k48552
$$ 328129 123160 52131 442958 280685 123563 150524 109361 46478 91047 -157505
20056a57505j64323K0780j12611R1876k2868J1254L8998N0427j91905L80095J75429
$$ -157505 -321828 -301048 -413659 -321783 -344651 -333397 -294399 -243972 -435877 -55782 119647
20045A19647J40576J72408j95510l51843P3290K28521J97805L2795L30650k35769
$$ 119647 260223 432631 237121 -114722 -41432 187089 384894 417689 748339 512570
20035E12570o22306k42678j33191O1786j9333P6037L55644l38063l7897K59032
$$ 512570 -109736 -352414 -485605 -423819 -443152 -367115 -11471 -349534 -387431 -128399
20025a28399L31750J40884M303j93952k33300j41208R6223N2830q4799L39439
$$ -128399 203351 344235 348538 154586 -78714 -219922 -123699 -70869 -155668 183771
20015A83771Q0782J4907k26890j21325j76031K37403L9517M6429j7882M5116l77834
$$ 183771 264553 279460 52570 -68755 -244786 -7383 32134 78563 60681 105797 -272037
20004b72037j08831n0501j3646K53006M92598J32888o8906J018O212K1306K01724
$$ -272037 -380868 -431369 -445015 -192009 300589 433477 364571 365589 371801 393107 594831
19993E94831j62859J4123l58343l07684J25690L13305O6439K7127l23095L8525
$$ 594831 431972 446095 87752 -219932 -94242 219063 285502 312629 -10466 28059
19983B8059J48117R2323j94849j41256o4515L65852j44518j25699P2073L59863
$$ 28059 176176 268499 73650 -67606 -132121 233731 89213 -36486 35587 395450
19973C95450m9133j91589l35357k67353j17008K85487L48469J62738R4076j14387
$$ 395450 346317 154728 -180629 -447982 -564990 -279503 68966 231704 325780 211393
19963B11393L5405o4969k51447l8953L19681j4321Q2816l63847k20350j57689
$$ 211393 246798 181829 -69618 -108571 211110 196789 279605 -84242 -304592 -462281
19953d62281K31282P1664L67899K58699j98915j71888r8273j69896P8233J47403
$$ -462281 -230999 -159335 208564 467263 268348 96460 -1813 -171709 -93476 53927
19943E3927l4372j79720R3647M4445k74139k18951q0896k45765K9321L91260K01044
$$ 53927 19555 -160165 -66518 -22073 -296212 -515163 -596059 -841824 -812503 -421243 -220199
19932b20199l1611r6003k2126l01213J24462P13808K97365n1442l14650l88357
$$ -220199 -251810 -347813 -369939 -671152 -546690 167118 464483 413041 98391 -289966
19922b89966P9078M2198O8554J7711M05034J86570n7395k64506m74277l12940
$$ -289966 -210888 -168690 -100136 -82425 322609 509179 451784 187278 -286999 -599939
19912e99939J40363j2141l9481l8921j12748K60387M08579J69818j20869n700
$$ -599939 -459576 -471717 -511198 -550119 -662867 -402480 6099 175917 55048 49348
19902D9348n4365K62669j69546K9881j41457J58043j24097j7337n23863K1144
$$ 49348 -5017 257652 88106 117987 -23470 134573 10476 -6861 -530724 -509580
19892e09580M6579K06966j28887K58485K75203k66722J02859N02572k26378l21268
$$ -509580 -463001 -256035 -384922 -126437 148766 -117956 -15097 487475 261097 -60171
19882f0171k75719L47096M5975k18453J67999K57964J75521k4188q5373n541k30802
$$ -60171 -335890 11206 57181 -161272 6727 264691 440212 416024 330651 325110 94308
19871I4308K5614p162N1383O0900j02264L11659j8474k34527m7379m166n24912
$$ 94308 119922 112760 164143 225043 122779 434438 415964 181437 134058 129892 -395020
19860c95020N4542K88160M0068k9880n4711l02656k06188M8771J21050K58830
$$ -395020 -340478 -52318 -12250 -42130 -96841 -399497 -605685 -556914 -435864 -177034
19850a77034k19412n9639j54094j51637R6711O13733O0313m99703Q5643o3417
$$ -177034 -396446 -456085 -610179 -761816 -665105 -51372 8941 -490762 -405119 -468536
19840d68536Q269M32421J09543l71850j22880L1738J99097K06939L4002R5982
$$ -468536 -460267 -27846 81697 -290153 -413033 -381295 -182198 24741 58743 154725
19830A54725k7369l02120k48680j03573P5523J66748K58443k78421M1534J05222
$$ 154725 127356 -174764 -423444 -527017 -451494 -284746 -26303 -304724 -263190 -157968
19820a57968k1759n52879k4863L30342N29418K07989J97670k06097j27272m9220
$$ -157968 -179727 -732606 -757469 -427127 102291 310280 507950 301853 174581 125361
19810A25361j13471n0525L3815N1269n4038L2674k01471j59758J32475R2518j65480
$$ 125361 11890 -38635 -4820 46449 -7589 25085 -176386 -336144 -203669 -111151 -276631
19799b76631o7114l51739l53289N7627J44709L53679K76434K92853r7078J54468
$$ -276631 -343745 -695484 -1048773 -991146 -846437 -492758 -216324 76529 -20549 133919
19789A33919P3835M4346k07521k79910M60443K62997l38840m6475K33069j53176
$$ 133919 207754 252100 44579 -235331 225112 488109 149269 102794 335863 182687
19779A82687k704N3968j10485k60638K7015J64505J64570K53044m0776j16115
$$ 182687 179983 233951 123466 -137172 -110157 54348 218918 471962 431186 315071
19769C15071p8450j38534j74669J12258K496j01641L2195l09180L08122N5721
$$ 315071 236621 98087 -76582 35676 38172 -63469 -31274 -340454 -32332 23389
19759B3389k99397K18420J39361k31572j65063L1535q4222j05744K47649N62460
$$ 23389 -276008 -57588 81773 -149799 -314862 -283327 -367549 -473293 -225644 336816
19749C36816J0842l57636j12946j37569L5875J88912j91217K50442L76771K43978
$$ 336816 347658 -9978 -122924 -260493 -224618 -35706 -226923 23519 400290 644268
19739F44268l71921m40412J51088k63276j17051j9030O9771K37525K31933N1l99145
$$ 644268 272347 -168065 -16977 -280253 -397304 -416334 -346563 -109038 122895 122946 -276199
19728b76199j11115L99172J26117j81512J34829j51121k3236K47855L18761J90155
$$ -276199 -387314 11858 137975 -43537 91292 -59829 -83065 164790 483551 673706
19718F73706m00990R2867p3196P0684j32408l3016J52535J03697m03304l58528
$$ 673706 272716 365583 292387 363071 230663 197647 350182 453879 50575 -307953
19708c07953l0878K69095M06392p1095l05131l22208K5117q6567K3036Q8175k38276
$$ -307953 -338831 -69736 336656 265561 -39570 -361778 -336661 -423228 -400192 -312017 -550293
19697e50293k76570j35887K66907L17707L8751O3157J03564j97139Q1189K68376
$$ -550293 -826863 -962750 -695843 -378136 -339385 -276228 -172664 -369803 -288614 -20238
19687b0238j98913k69754J16621J31163J32695J77863J43807k54852j52729L5491
$$ -20238 -219151 -488905 -372284 -241121 -108426 69437 213244 -41608 -194337 -158846
19677a58846o415j7549j24171j84494J73718m5382o5573J37557k64244K28418
$$ -158846 -165261 -182810 -306981 -491475 -317757 -363139 -428712 -291155 -555399 -326981
19667c26981K45224J68845K10119K79462J31668l35457k11352n6719k62634Q4517
$$ -326981 -81757 87088 297207 576669 708337 372880 161528 104809 -157825 -73308
19657g3308L1025m5902r0551Q5977R2893J52363M3423n7201M64122K9117l32046
$$ -73308 -42283 -88185 -178736 -92759 134 152497 195920 138719 602841 631958 299912
19646B99912K02558J25586j34081n61457o9115J76801K2527J19279j51699J59119
$$ 299912 502470 628056 493975 -67482 -136597 40204 62731 182010 30311 189430
19636A89430j6208o8018l40234j81721O3959L08295K67144J26926j75140j79011
$$ 189430 173222 105204 -235030 -416751 -352792 -44497 222647 349573 174433 -4578
19626d578l8401j24594k73125O0268R3545j10310j4285O89235J99358l66916r1616
$$ -4578 -42979 -167573 -440698 -380430 -286885 -397195 -411480 277755 477113 110197 18581
19615A8581M63620N41233l99481j55420m365k6628l45696L3572l8078j01242J69052
$$ 18581 482201 1023434 623953 468533 464168 437540 91844 125416 87338 -13904 155148
19604A55148L00541J01497k25170j45416N4798K08588M1498L36113K85984J85030
$$ 155148 455689 557186 332016 186600 241398 449986 491484 827597 1113581 1298611
19594A298611k37959m92225j22961k16556j59860O4736J94922n1560j33861k21990
$$ 1298611 1060652 568427 445466 228910 69050 133786 328708 277148 143287 -78703
19584g8703K17193J95112N7709l18904J7389J0636L35654q5324Q5905j31988R9924
$$ -78703 138490 333602 391311 72407 89796 100432 436086 350762 436667 304679 404603
19573D04603J62749K18975L54166K36207Q8445O598J90273q4214j54432l29427
$$ 404603 567352 786327 1140493 1376700 1465145 1471743 1662016 1577802 1423370 1093943
19563A093943n08937j60094P3980K11662k26325m09306K69070J90753P3422n59493
$$ 1093943 585006 424912 498892 710554 484229 74923 343993 534746 608168 48675
19553D8675j08257n763J49225L08681m3084k0496o4305K38354J17687k54972J14478
$$ 48675 -59582 -65345 83880 392561 349477 328981 264676 503030 620717 365745 480223
19542D80223J38075Q1218K07726r1k33154J11121J7329K20581q0033o0334p228
$$ 480223 618298 699516 907242 907151 673997 785118 802447 1023028 942995 882661 875433
19531H75433m38684m00250q3291j96940j16050j5566M70599L01133m72828O2121
$$ 875433 436749 36499 -46792 -243732 -359782 -375348 95251 396384 -76444 -14323
19521a4323n9570J58177J5461j62042k03513L43585L72621J44513k1351m74559
$$ -14323 -73893 84284 99745 -62297 -265810 77775 450396 594909 573558 98999
19511I8999l06703p7984K59453K90204J27036l38546n5466L313K21732k81334
$$ 98999 -207704 -285688 -26235 263969 391005 52459 -3007 306 222038 -59296
19501e9296j90168K50193L1123N95O7221j88992J67963R1165K7601l06124j83779
$$ -59296 -249464 729 31852 32447 99668 -89324 78639 169804 197405 -108719 -292498
19490b92498J92176K00565j51132K22756J45685m08633k17349m1700L88755K23712
$$ -292498 -100322 100243 -50889 171867 317552 -91081 -308430 -350130 38625 262337
19480B62337j48550n2010N2471m34j40263k07864k51868j8072N2709J92623L20999
$$ 262337 113787 61777 114248 113814 -26449 -234313 -486181 -504253 -451544 -258921 62078
19469F2078J58198K2102l44638p4305J17633M6162j85951j69833J36143N033j27447
$$ 62078 220276 242378 -102260 -176565 -58932 -12770 -198721 -368554 -232411 -227378 -354825
19458c54825L97931K13969j85500m94243L9905L29728p0556m79804K68052K60175
$$ -354825 43106 257075 71575 -422668 -382763 -53035 -123591 -603395 -335343 -75168
19448g5168j29926j00733j31683L15704j77568J36317Q4954l99073J36362L78441
$$ -75168 -205094 -305827 -437510 -121806 -299374 -163057 -78103 -477176 -340814 37627
19438C7627j48444k19633K35153J49182J17930J8625Q8895J5024j43816j08227
$$ 37627 -110817 -330450 -95297 53885 171815 190440 279335 294359 150543 42316
19428D2316K00000L746m40399j57573j44903J69525K94980J09967m20331q9208
$$ 42316 242316 246062 -194337 -351910 -496813 -327288 -32308 77659 -342672 -431880
19418d31880J67619J92487J4845k28852o666J06511J34388J74113P4777P726K76354
$$ -431880 -264261 -71774 -56929 -285781 -292447 -185936 -51548 122565 197342 205068 481422
19407D81422N8659P1917k74m23468r6123j37931J1647Q5985J39044l6051Q4564
$$ 481422 540081 611998 611724 188256 92133 -45798 -34151 51834 190878 154827 239391
19396B39391L7120k30551l15402J22427m9336L334k4582K75268J34100l39338
$$ 239391 276511 45960 -269442 -147015 -196351 -193017 -217599 57669 191769 -147569
19386a47569K4845L5852K77056L01067k42099k57747j66203J50833N4575J76339
$$ -147569 -122724 -86872 190184 491251 249152 -8595 -174798 -23965 30610 206949
19376B06949P6713j06889O120m216l17907j58505J60294J6115j20774k85759j78793
$$ 206949 283662 176773 182893 178677 -139230 -297735 -137441 -121326 -242100 -527859 -706652
19365g06652N47161K04731l58622O1988j8538L01855K62491j0037j6647k23923
$$ -706652 -159491 45240 -313382 -251394 -269932 31923 294414 284377 267730 43807
19355D3807J25887Q2924n0792q411K29786j27576j41024j60119J33921R5670M5069
$$ 43807 169694 252618 201826 193415 423201 295625 154601 -5518 128403 224073 269142
19344B69142k65855J98626k09664J99560L19892J58715J10845k08753k97830K2671
$$ 269142 3287 201913 -7751 191809 511701 670416 781261 572508 274678 297349
19334B97349J27063k98529j20122J24655J94781j7025k64239K49636L69254O4075
$$ 297349 424412 125883 5761 130416 325197 308172 43933 293569 662823 726898
19324G26898O9442R8856k97799j22294L32454o0868m05538m53095O2889M12987
$$ 726898 796340 895196 597397 475103 807557 746689 341151 -111944 -49055 363932
19314C63932L15294k82306j59492L3828M1338j63928J99903K88619l8749k81370
$$ 363932 679226 396920 237428 271256 312594 148666 348569 637188 598439 317069
19304C17069j01830Q7919J17787R1953L1636j24922k88288K04647J63306K108
$$ 317069 215239 303158 420945 512898 544534 419612 131324 335971 499277 501385
19294E01385j80361j47375K46028O20482J50063n53047J32443K22464k23302l2057
$$ 501385 321024 173649 419677 1040159 1190222 637175 769618 992082 768780 736723
19284G36723K97613L50663j75363j92817m14384l43162Q8917J65042K18330j01938
$$ 736723 1034336 1384999 1209636 1016819 602435 259273 348190 513232 731562 629624
19274F29624k39593j02301l21121J82408K37186o4848q1293j7842J67921R926
$$ 629624 390031 287730 -33391 149017 386203 321355 240062 222220 390141 400067
19264D00067j39657M3213k14254l30661j3439K45955K56868J78595K26163k7699
$$ 400067 260410 303623 89369 -241292 -254731 -8776 248092 426687 652850 625151
19254F25151o1996l19867M964k48750j8528N9662O2399K29217L21045K52362J21240
$$ 625151 563155 243288 248252 -498 -19026 40636 103035 332252 653297 905659 1026899
19243A026899j70985m20622r1411m4318l59984o6029L60043L6560K10903j80583
$$ 1026899 855914 435292 343881 299563 -60421 -126450 233593 270153 481056 300473
19233C00473j35362J18484O2232r498L32235R3534J56164L1388p136j38365j27692
$$ 300473 165111 283595 345827 336329 668564 762098 918262 949650 942514 804149 676457
19222F76457K19385j72034l59520n08373k25982L45507J93130n3767K08666K28399
$$ 676457 895842 723808 364288 -144085 -370067 -24560 168570 114803 323469 551868
19212E51868O595K89504k629K28297L7416l47982j38447j12529j23035L5769R5955
$$ 551868 558463 847967 845338 1073635 1111051 763069 624622 512093 389058 424827 520782
19201E20782R1636q9753m9815j90086R5025K95989k76L07349l5859k07103r3187
$$ 520782 612418 522665 472850 282764 377789 673778 673502 980851 944992 737889 644702
19190F44702q9728l06843j79978P4840J85080j46533J4346q9537Q3107L16522
$$ 644702 554974 248131 68153 142993 328073 181540 195886 106349 189456 505978
19180E05978J35885J79197r1315o8393K4671M2247j44499j14096r125l81165l92865
$$ 505978 641863 821060 729745 661352 686023 728270 583771 469675 460550 79385 -313480
19169c13480J9481K94779M35089J91808l37346j81348m4159J86478j50898J25534
$$ -313480 -293999 780 435869 627677 290331 108983 64824 251302 100404 225938
19159B25938K72837K09275j09670q1092N4447r3260j18964j06081j47233o1737
$$ 225938 498775 708050 598380 517288 571735 478475 359511 253430 106197 44460
19149D4460L4130K17160K06189N5963j37106k47859J82100J14237O9946K71821
$$ 44460 78590 295750 501939 557902 420796 172937 355037 469274 539220 811041
19139H11041R2019o0512r0030K1539J3487J45273r630m86878j92697L93475L26103
$$ 811041 903060 842548 752518 774057 787544 932817 923187 436309 243612 637087 963190
19128I63190M76067L58979L44575j18843L23565N75381N29899K43137l57439j69508
$$ 963190 1439257 1798236 2142811 2023968 2347533 2922914 3452813 3695950 3338511 3169003
19118C169003K79987L10412l03028m02358n93585o28358j28785n6903P5325j44482
$$ 3169003 3448990 3759402 3456374 3054016 2460431 1832073 1703288 1646385 1721710 1577228
19108A577228k94189k79509k78729m3571J18487K46925J58899k01127l9839M1817
$$ 1577228 1283039 1003530 724801 681230 799717 1046642 1205541 1004414 964575 1006392
19098A006392k73497j16284K64827L08310K97486J86118J07671O99280Q08663
$$ 1006392 732895 616611 881438 1189748 1487234 1673352 1781023 2480303 3288966
19089C288966L34139k8717L0623M14729K28923K0276j631m94770n93434m77345
$$ 3288966 3623105 3594388 3625011 4039740 4268663 4288939 4287308 3792538 3199104 2721759
19079B721759q21688m08806K08410j87468K03205J36338L7375r3842m3274o0894
$$ 2721759 1900071 1491265 1699675 1512207 1715412 1851750 1889125 1795283 1752009 1691115
19069A691115M0975l11272m1327P474j86046R2595j23939j01402N1984p729j08496
$$ 1691115 1732090 1420818 1379491 1386965 1200919 1293514 1169575 1068173 1120157 1112428 1003932
19058A003932M88999R467j98212j16398k8256m5463k5313J5288J4660j99979J46503
$$ 1003932 1492931 1502398 1304186 1187788 1159532 1114069 1088756 1104044 1118704 918725 1065228
19047A065228j3074j60500n1520O2639n260k9705J93345L15379J28344P049R0888
$$ 1065228 1052154 891654 840134 902773 897513 867808 1061153 1376532 1504876 1511925 1602813
19036A602813k78633J75235O5270N7309J5067K41965K33861j85479j47489K8135
$$ 1602813 1324180 1499415 1564685 1621994 1637061 1879026 2112887 1927408 1779919 1808054
19026A808054J26931J75406M5186j58569J15756K47068j99010Q6973O4854N2309
$$ 1808054 1934985 2110391 2155577 1997008 2112764 2359832 2160822 2247795 2312649 2364958
19016B364958n6376J58500j27384k1102L33808q3326L26806L71181K29199N18810
$$ 2364958 2308582 2467082 2339698 2318596 2652404 2569078 2895884 3267065 3496264 4015074
19006D015074O11531M76522J78134M23393M5458j36592k25256j78618K0977J94912
$$ 4015074 4626605 5103127 5281261 5704654 5750112 5613520 5388264 5209646 5230623 5425535
18996E425535L32700M86702J277845J222523P83423Q04524J163955Q07104J284327
$$ 5425535 5758235 6244937 7522782 8745305 9528728 10333252 11497207 12304311 13588638
18987A3588638J770397J934942K867553M195230O552042J0120453J6222898K7686530
$$ 13588638 15359035 17293977 20161530 24356760 30908802 41029255 57252153 84938683
18979H4938683M9485601Q2999628P9137442J38619q508675K6650812k6885690
$$ 84938683 134424284 217423912 296561354 296699973 288191298 314842110 287956420
18972B87956420q7930820o9856416m2143250k5598593j6349265j1148557p541562
$$ 287956420 200025600 130169184 88025934 62427341 46078076 34929519 27387957
18965B7387957n103474l307564j385106o0514K59480J75012P5305M54856P31946
$$ 27387957 22284483 18976919 17591813 17531299 17790779 17965791 18041096 18495952 19227898
18956A9227898O3501K711N41481J688652K283587M678458P500725J2044740J9341499
$$ 19227898 19291399 19294110 19835591 21524243 23807830 28486288 35987013 48031753 67373252
18947F7373252L3063642N8856388R4920860P2564149j1999867m028966K5395012
$$ 67373252 100436894 159293282 254214142 326778291 314778424 310749458 336144470
18940C36144470m5828420r4972887o9695441m2127435k5448848j6136283j1189017
$$ 336144470 290316050 195343163 125647722 83520287 58071439 41935156 30746139
18933C0746139p834500m945365l400099k197618j460892p98580q87466p66456
$$ 30746139 22911639 17966274 14566175 12368557 10907665 10109085 9221619 8455163
18925H455163p02162p71441r30399r06553o25160l78277n60706n43935j12058
$$ 8455163 7753001 6981560 6051161 5144608 4519448 4141171 3580465 3036530 2924472
18916B924472L99457K98227l58842J42432K14472j002519o39355j56378k21819
$$ 2924472 3323929 3622156 3263314 3405746 3620218 2617699 1978344 1821966 1600147
18907A600147k43266o3227j66396l69400k21253J03301K19932j07449r1707J31826
$$ 1600147 1356881 1293654 1127258 757858 536605 639906 859838 752389 660682 792508
18897G92508J75441k13795k44179K34343L2011l75062k20110L5839K38266K71185
$$ 792508 967949 754154 509975 744318 776329 401267 181157 216996 455262 726447
18887G26447r7322k75818k82082j14010N9411p264P9800k31143K1675K92026M7693
$$ 726447 629125 353307 71225 -42785 16626 9362 89162 -141981 -120306 171720 219413
18876B19413N7113k43304n7956J49235j46222J27982o8422j82446m2578L09327
$$ 219413 276526 33222 -24734 124501 -21721 106261 37839 -144607 -187185 122142
18866A22142l4063l97542l73041J44604q8621j865j03981L68724N64454J51613
$$ 122142 88079 -309463 -682504 -537900 -626521 -628386 -732367 -363643 200811 352424
18856C52424l0567O8503j65408o2986M10954J52911j55731J72589M32032Q34350
$$ 352424 321857 390360 224952 161966 572920 725831 570100 742689 1174721 2009071
18846B009071L74222m1863l91612m54856j91162p2372k96472l80520k19776k47143
$$ 2009071 2383293 2341430 1949818 1494962 1303800 1231428 934956 554436 334660 87517
18836H7517o1716l6077j42276Q2410K40632K722K71500J56494l00321K18673J52859
$$ 87517 25801 -10276 -152552 -70142 170490 173212 444712 601206 300885 519558 672417
18825F72417m9305q1016j47201m7298J8667j27252P1192M04541Q19720O64201
$$ 672417 623112 542096 394895 347597 366264 239012 310204 714745 1534465 2198666
18815B198666K24569J37910J60526k16359m89226n84191l33908l19310k8081l2426
$$ 2198666 2423235 2561145 2721671 2505312 2016086 1431895 1097987 778677 750596 718170
18805G18170q2545j46355j50150P8162K19718J31702K28493q6249k52045j95377
$$ 718170 635625 489270 339120 417282 637000 768702 997195 910946 658901 463524
18795D63524k11769l37833M1736j4450j2305J37083J5650K36390J24348j11907
$$ 463524 251755 -86078 -44342 -58792 -71097 65986 81636 318026 442374 330467
18785C30467k58030j21617J01205J61416n7409j88665o5603j18135k31211q9341
$$ 330467 72437 -49180 52025 213441 156032 -32633 -98236 -216371 -447582 -536923
18775e36923Q7645L68248J9078N8553J77860J32394P0652K93138l82628r4405
$$ -536923 -449278 -81030 -61952 -3399 174461 306855 377507 670645 288017 193612
18765A93612j43136l5275K88250j74258k03176l91606o9451K35232J75185J75368
$$ 193612 50476 15201 303451 129193 -73983 -465589 -535040 -299808 -124623 50745
18755E0745J69253K86370j51843p837J79513k18345k45750M3528j58296p4010
$$ 50745 219998 506368 354525 346688 526201 307856 62106 105634 -52662 -126672
18745a26672j69073j0445J80258J16942j4773k53940j14226k80121M7263L32271
$$ -126672 -295745 -306190 -125932 -8990 -23763 -277703 -391929 -672050 -624787 -292516
18735b92516M216J05981J90082j54683j26794o3363J29460L57218l2384J60599
$$ -292516 -288300 -182319 7763 -146920 -273714 -337077 -207617 149601 117217 277816
18725B77816j2686l67933j06701p1715k64551j00390K24553J83633m6380O1775
$$ 277816 265130 -102803 -209504 -281219 -545770 -646160 -421607 -237974 -284354 -222579
18715b22579L32885k1239q7737L1360J3305j61150j25809m2193r3690Q4552J14284
$$ -222579 110306 89067 1330 32690 45995 -115155 -240964 -283157 -376847 -292295 -178011
18704a78011J95771k11226L61892L82464m27840l94053K34027K71401K14961k45611
$$ -178011 17760 -193466 168426 550890 123050 -271003 -36976 234425 449386 203775
18694B03775m42889O6128J78873K25116K4717M9335m9299k95994K35788J36018
$$ 203775 -239114 -172986 5887 231003 255720 305055 255756 -40238 195550 331568
18684C31568j56869k12458j23606J61664J50735j09518j28517j06407K35889M27350
$$ 331568 174699 -37759 -161365 299 151034 41516 -87001 -193408 42481 469831
18674D69831n59994k5798J85579p8732k31642L82614J37470K5132k98195P6392
$$ 469831 -90163 -115961 69618 -9114 -240756 141858 279328 304460 6265 82657
18664H2657k2168j29463p6248j50230n6297K29249L15688J60646j8199K3994l8234
$$ 82657 60489 -68974 -145222 -295452 -351749 -122500 193188 353834 335635 359629 321395
18653C21395k91881K8451n7670P8507l15329k72226K17503M56182L78686M37852
$$ 321395 29514 57965 295 78802 -236527 -508753 -291250 164932 543618 981470
18643I81470K39052J50100j04378k90098k65135K49841K08227j11795r9430l87067
$$ 981470 1220522 1370622 1266244 976146 711011 960852 1169079 1057284 957854 570787
18633E70787k27550k0212j8009J15473p6390o0614k75m56275K75615L64828P3107
$$ 570787 343237 323025 305016 420489 344099 283485 283210 -173065 102550 467378 540485
18622E40485J78202j69889k04432O2117K66554k62999P2978M59348O36649J78454
$$ 540485 718687 548798 344366 406483 673037 410038 483016 942364 1579013 1757467
18612A757467j48727R845J36122j56529j43179m67231k24935J48305l9754l06332
$$ 1757467 1608740 1618585 1754707 1598178 1454999 987768 762833 911138 871384 565052
18602E65052m26555k11276R4350j31414N9461j55969p3606M11101N11084N0683
$$ 565052 138497 -72779 21571 -109843 -50382 -206351 -279957 131144 642228 692911
18592F92911l6294r9861l522q0461k29092r0816K31837L68355p2500k53067q7726
$$ 692911 656617 556756 553234 472773 243681 152865 384702 753057 680557 427490 339764
18581C39764q4869k88299k43546M2218P4679J31100O9343r4127K16053N96757
$$ 339764 254895 -33404 -276950 -234732 -160053 -28953 40390 -53737 162316 759073
18571G59073m1497l46013l56560j43233O5621J62738J2003J23570k81379l79585
$$ 759073 717576 371563 15003 -128230 -62609 100129 112132 235702 -45677 -425262
18561d25262K11548N57829J37992j15704k98665k25725R9339J53675j6608J68971
$$ -425262 -213714 344115 482107 366403 67738 -157987 -58648 95027 78419 247390
18551B47390O724M0542n8530m870l4263J09481k35677j82402K01669K439J12409
$$ 247390 254114 294656 236126 231256 196993 306474 70797 -111605 90064 92503 204912
18540B04912l08415J61477L01629K19942l8271J80944J68168j48687K42050M88851
$$ 204912 -103503 57974 359603 579545 541274 722218 890386 741699 983749 1472600
18530A472600P19822J077237J408573J127621J57741j9312r21568j628367j182613
$$ 1472600 2192422 3269659 4678232 5805853 5963594 5944282 5022714 3394347 2211734
18521B211734p14003m56391n5138o09550j60721K69807j0433K12556k98407J2945
$$ 2211734 1497731 1041340 986202 376652 215931 485738 475305 687861 389454 402399
18511D02399J34256k60313J11532J65259J88507j6521m20481k2644N39784K58711
$$ 402399 536655 276342 387874 553133 741640 725119 304638 281994 821778 1080489
18501A080489J08966L6425J47277J63924K36027J256841J538815M42393k59171
$$ 1080489 1189455 1225880 1373157 1537081 1773108 3029949 4568764 5011157 4751986
18492D751986K12980n23140j146500o70214m72869m30065l89829k63664j88903
$$ 4751986 4964966 4441826 3295326 2625112 2152243 1722178 1332349 1068685 879782
18483H79782m18376q6020k5611K6882J08502l79219J19370K29577k61286j96040
$$ 879782 461406 375386 349775 376657 485159 105940 225310 454887 193601 -2439
18473b439j70992m7491K47560M1675n6242K39912J10106r7888K41898J02587M6018
$$ -2439 -173431 -220922 26638 68313 12071 251983 362089 264201 506099 608686 654704
18462F54704j06235P6222p5640l33943j67694m40133k20765J14950K52261L22810
$$ 654704 548469 624691 549051 215108 47414 -392719 -613484 -498534 -246273 76537
18452G6537p9428k05815J88886K19551K87131J3251j45736n8493m7028J05661
$$ 76537 -2891 -208706 -19820 199731 486862 500113 354377 295884 248856 354517
18442C54517n7771p8144O4646M02341q981k23786j92635j30281l61935k35711
$$ 354517 296746 218602 283248 685589 676608 452822 260187 129906 -232029 -467740
18432d67740K00516J22614K51047j5018k10280r0909K06217Q2046j34239j21596
$$ -467740 -267224 -144610 106437 91419 -118861 -209770 -3553 78493 -55746 -177342
18422a77342l5603J17559K75659K19624o9060J12535J43811k04298j08985Q1828
$$ -177342 -212945 -95386 180273 399897 330837 443372 587183 382885 273900 355728
18412C55728l01395l43848J45024K16496J13016r407J6509K16239j14998j05840
$$ 355728 54333 -289515 -144491 72005 185021 175614 192123 408362 293364 187524
18402A87524k68323J52291M3349L59110L31552m9946k13568m44780j79354K04484
$$ 187524 -80799 71492 114841 473951 805503 755557 541989 97209 -82145 122339
18392A22339L73820J38749o1429j30229J33724K64324M18104k93344l50408m00010
$$ 122339 496159 634908 573479 443250 576974 841298 1259402 966058 615650 215640
18382B15640j5162J86841M82667k65725J54407M60143M76507j1531q0356j69876
$$ 215640 200478 387319 869986 604261 758668 1218811 1695318 1683787 1603431 1433555
18372A433555j64424p1567j95041j44598j10099k32736L1111J16362J29238k6012
$$ 1433555 1269131 1197564 1002523 857925 747826 515090 546201 662563 791801 765789
18362G65789J66711K67052M1912o5778J48249K33131l12727l96546m5203j47687
$$ 765789 932500 1199552 1241464 1175686 1323935 1557066 1244339 847793 802590 654903
18352F54903M8057J14071M71379m8395J64216l12584l17513L66196P51745K71709
$$ 654903 702960 817031 1288410 1240015 1404231 1091647 774134 1140330 1892075 2163784
18342B163784r9363L4830l34653l36352k68650k37055j36460K5808k19059R9841
$$ 2163784 2064421 2099251 1764598 1428246 1159596 922541 786081 811889 592830 692671
18332F92671n2791J80868Q2859j85676k75156J78294K61558p2204j22409J59498
$$ 692671 639880 820748 903607 717931 442775 621069 882627 810423 688014 847512
18322H47512j13113m2575l09733j8627R7598J38201P9477k21390J38632J77966
$$ 847512 734399 691824 382091 363464 461062 599263 678740 457350 595982 773948
18312G73948k8080k44154j43827K70115J19919Q012m09936m22294L27780K06365
$$ 773948 745868 501714 357887 628002 747921 755933 345997 -76297 251483 457848
18302D57848J75774m2432J71650j2475J4662j42468n0031j57956k30408n2210
$$ 457848 633622 591190 762840 750365 765027 622559 572528 414572 184164 131954
18292A31954J80735M86173O4802k44444m20714R0776N6771l89518J75041K77336
$$ 131954 312689 798862 863664 619220 198506 289282 346053 -43465 131576 408912
18282D08912O4910j72267o1962J51401K14381q4875j29570j17243J29691p7353
$$ 408912 473822 301555 239593 390994 605375 520500 390930 273687 403378 326025
18272C26025n29504J47659N54944L14362N1844J25700J37924P7869j19703k45237
$$ 326025 -203479 -55820 499124 813486 865330 991030 1128954 1206823 1087120 841883
18262H41883r1735m5872K11129m09455l50350M5636J06411J1242R8417j80894
$$ 841883 750148 704276 915405 505950 155600 201236 307647 318889 417306 236412
18252B36412J10572J70265l1609K6168K25857J1453k87856J41316L02912J55432
$$ 236412 346984 517249 485640 511808 737665 749118 461262 602578 905490 1060922
18242A060922o9241j65482j05628M8242J55050k7572j02733N3639k44390j93172
$$ 1060922 991681 826199 720571 768813 923863 896291 793558 847197 602807 409635
18232D09635L50801K02656l144j17414j14136l9808k01669K32175M35838J38273
$$ 409635 760436 963092 959948 842534 728398 688590 486921 719096 1154934 1293207
18222A293207l0454j9672m2423j29124J41155o3328m01193k22909j41705K45618
$$ 1293207 1262753 1243081 1200658 1071534 1212689 1149361 748168 525259 383554 629172
18212F29172r6769J91794j00103J2691K15407j59080n6026j36587M1160m7071
$$ 629172 532403 724197 624094 636785 852192 693112 637086 500499 541659 494588
18202D94588j95742K8846R2433n9745o078N30674K39272j43065q9275m0356L07253
$$ 494588 298846 327692 420125 360380 354302 884976 1124248 981183 891908 851552 1158805
18191A158805K50510j0547J34638O5254k20110k56736J75455k32426K01932Q3685
$$ 1158805 1409315 1398768 1533406 1598660 1378550 1121814 1297269 1064843 1266775 1350460
18181A350460j8454k21468J80325J6975j81828o1991r7088N4242O8676k22602
$$ 1350460 1332006 1110538 1290863 1307838 1126010 1064019 966931 1021173 1089849 867247
18171H67247k70225O7212N27124L95170J54435K8347o4110M4266l45637K8261
$$ 867247 597022 664234 1191358 1586528 1740963 1769310 1705200 1749466 1403829 1432090
18161A432090J08691j04293J23365K2692P2228O2278Q5505p8249L51455K55219
$$ 1432090 1540781 1436488 1559853 1582545 1654773 1717051 1802556 1724307 2075762 2330981
18151B330981J24598J06040l78217k15178P9899K60145J85590k27259L88272j61539
$$ 2330981 2455579 2561619 2183402 1968224 2048123 2308268 2493858 2266599 2654871 2493332
18141B493332k61119K6859L92154M32019k6805j5917M28753M33047O99349P57727
$$ 2493332 2232213 2259072 2651226 3083245 3056440 3040523 3469276 3902323 4601672 5359399
18131E359399K33397N53520O67878J75221n169K50309L82733O6096L50750M49942
$$ 5359399 5592796 6146316 6814194 6989415 6984246 7234555 7617288 7683384 8034134 8484076
18121H484076O52799O70984J331496J733676J948045K078003K185299K877869
$$ 8484076 9136875 9807859 11139355 12873031 14821076 16899079 19084378 21962247
18113B1962247M051638N266544P751930J1798279J8916819L2505113N7641954
$$ 21962247 26013885 31280429 39032359 50830638 69747457 102252570 159894524
18106A59894524R6435840R6164479K2966000Q253764l5218912j02165150q5487632
$$ 159894524 256330364 352494843 375460843 383714607 348495695 246330545 160842913
18099A60842913n1864345l1773482k0815262j3485326r398794o512905m237678
$$ 160842913 108978568 77205086 56389824 42904498 33505704 26992799 22755121
18092B2755121k461662j763063j293409p91826j107248p82862N1657J146705J655340
$$ 22755121 20293459 18530396 17236987 16445161 15337913 14555051 14606708 15753413 17408753
18083A7408753K016290K161395L314687M202431N273152P168922J1118805J8722960
$$ 17408753 19425043 21586438 24901125 29103556 34376708 41545630 52664435 71387395
18075G1387395L2198766N8244075R6247768Q2133405J0821855L266449m7818771
$$ 71387395 103586161 161830236 258078004 340211409 351033264 354299713 306480942
18068C06480942r6981849p3854550m4643068k7830858j8242707j2260256q320288
$$ 306480942 209499093 135644543 91001475 63170617 44927910 32667654 24347366
18061B4347366n243460l478135j970344j875731j799986j490621j425733r09687
$$ 24347366 19103906 15625771 13655427 11779696 9979710 8489089 7063356 6153669
18053F153669n07439o63959o66067q4033K71149L05576P4615O4027m2198j26896
$$ 6153669 5646230 4982271 4316204 4232171 4503320 4808896 4883511 4947538 4905340 4778444
18043D778444l92936q80286o63315o05411j99425n12117m26629J87945Q3169l48186
$$ 4778444 4385508 3505222 2841907 2236496 2037071 1524954 1098325 1286270 1369439 1021253
18033A021253j20019l8276j0164k67621l96270J04073K67475P5424l09976R2923
$$ 1021253 901234 862958 852794 585173 188903 292976 560451 635875 325899 418822
18023D18822K20932K818k73087j97119r7354j32237N1177j137m9853q4399k83678
$$ 418822 639754 642572 369485 172366 75012 -57225 -6048 -7185 -57038 -141437 -425115
18012d25115j40462K20003J60279R9508n1985o7655r084K97399J08475j89640
$$ -425115 -565577 -345574 -185295 -85787 -137772 -205427 -214511 82888 191363 1723
18002A723k757K04079r3411n5710K03883k29121n16255j29236m7602J2839j52348
$$ 1723 -1034 203045 109634 53924 257807 28686 -487569 -616805 -664407 -651568 -803916
17991h03916J21943J05632O1429O6739R4725J31522r7650l01289J43324M14975
$$ -803916 -681973 -576341 -514912 -448173 -353448 -221926 -319576 -620865 -477541 -62566
17981f2566Q0845j6399p184Q1721j31638L3521J52536J24435j44482j84773k84708
$$ -62566 18279 1880 -5304 76417 -55221 -21700 130836 255271 110789 -73984 -358692
17970c58692l3787N31233J59010l26868m47875j36464M47597J86358j70007k00748
$$ -358692 -392479 138754 297764 -29104 -476979 -613443 -165846 20512 -149495 -350243
17960c50243o1210M06472O8518l84282j6608L69776j36112m35650J97195k49705
$$ -350243 -411453 -4981 63537 -320745 -337353 32423 -103689 -539339 -342144 -591849
17950e91849j13519K03329J62951O3049K1283o0687J89011K8478q164J03041n8794
$$ -591849 -705368 -502039 -339088 -276039 -254756 -315443 -126432 -97954 -106118 -3077 -61871
17939f1871k68305q3072Q145N26499J6451j31036k88488k00332L11263Q8304k06809
$$ -61871 -330176 -413248 -405103 121396 137847 6811 -281677 -482009 -170746 -82442 -289251
17928b89251P988P0262q4072K10870J88467J89212J6776r2662Q1567l20005J1652
$$ -289251 -281263 -211001 -295073 -84203 104264 293476 310252 217590 299157 -20848 -9196
17917i196o8879p0217P7132j49113n3396j11806J01588J44472J8957K41751N0073
$$ -9196 -78075 -148292 -71160 -220273 -273669 -385475 -283887 -139415 -120458 121293 171366
17906A71366k1777l21499R9497M9235J4502j84989r4903Q0417K9010M60467L24467
$$ 171366 149589 -171910 -72413 -23178 -8676 -193665 -288568 -208151 -179141 281326 605793
17895F05793j66280k76812j42050O3983k8333Q4321L05711r6584n2252l24660
$$ 605793 439513 162701 20651 84634 56301 140622 446333 349749 297497 -27163
17885b7163J21127j1962k00907M8289r6993m827J53702l7599r890O0066o3640
$$ -27163 93964 82002 -118905 -70616 -167609 -172436 -18734 -56333 -66223 -6157 -69797
17874f9797j05235K868Q5061r0240k2366K26461J86633M5321k45815j12118N1938
$$ -69797 -175032 -172164 -87103 -177343 -199709 26752 213385 258706 12891 -99227 -47289
17863d7289j09200k57624J5027M77272K47096k39727j38365k93342j89315M98013
$$ -47289 -156489 -414113 -399086 78186 325282 85555 -52810 -346152 -535467 -37454
17853c7454j67660m50555J51758L42467L9045P3337j77778o5978k5887J69701
$$ -37454 -205114 -655669 -503911 -161444 -122399 -49062 -226840 -292818 -318705 -149004
17843a49004K46086P1517j15596l67788R1967L16638Q9978k29622k75169j64198
$$ -149004 97082 168599 53003 -314785 -222818 93820 183798 -45824 -320993 -485191
17833d85191J3984j40125m5406O7541J57310J62000J92566j09010j58751k84803
$$ -485191 -471207 -611332 -656738 -589197 -431887 -269887 -77321 -186331 -345082 -629885
17823f29885R1157K35578K1070L26722J36602l3679k62220j16934Q0238K35863
$$ -629885 -538728 -303150 -282080 44642 181244 147565 -114655 -231589 -151351 84512
17813H4512K20002K07064n6336N827l62910k92665J16240L20320k8625j15801
$$ 84512 304514 511578 455242 461069 98159 -194506 -78266 242054 213429 97628
17803I7628j59153k73991k84825p0299N5325J46143K5582J39873j89021m887L6894
$$ 97628 -61525 -335516 -620341 -690640 -635315 -489172 -463590 -323717 -512738 -517625 -480731
17792d80731M56537O9484k02154k6907K1659J46438K37944K10252L46601J54908
$$ -480731 -24194 45290 -156864 -183771 -162112 -15674 222270 432522 779123 934031
17782I34031k31723J05976k05420m81016O567M79063K84089j88623j80338l31525
$$ 934031 702308 808284 602864 121848 128415 607478 891567 702944 522606 191081
17772A91081n43280j28613N7208Q0655L72268J22964J25739J24037q2739k9354
$$ 191081 -352199 -480812 -423604 -342949 29319 152283 278022 402059 319320 289966
17762B89966P3767j23606Q9445J12884o7942j78221k30561j22134R228j09237
$$ 289966 363733 240127 329572 442456 374514 196293 -34268 -156402 -147174 -256411
17752b56411J8551L21211n2835l0300p1585j92199J98595P677q022n1498K4201
$$ -256411 -237860 83351 30516 216 -71369 -263568 -64973 -57296 -65318 -116816 -92615
17741i2615J84458k54474J84121J32998J80977j85744l5321o611j85768r4885
$$ -92615 91843 -162631 21490 154488 335465 149721 114400 107789 -77979 -172864
17731a72864N8291p858k9424j63923L257K13632L8816R8873M4406K2883k16672
$$ -172864 -114573 -122431 -151855 -315778 -312521 -98889 -60073 38800 83206 106089 -110583
17720a10583K92087q3278l06161P5976p1276k05183K3081O16248K80069j74340
$$ -110583 181504 98226 -207935 -131959 -203235 -408418 -385337 230911 510980 336640
17710C36640j21902k25147j14501J63777k4193J45041p190Q8515P8955j43961
$$ 336640 214738 -10409 -124910 38867 14674 159715 152525 241040 319995 176034
17700A76034k03399p8460o5632J02314P3005L89249L96063k55429j09582O0278
$$ 176034 -27365 -105825 -171457 -69143 3862 393111 789174 533745 424163 484441
17690D84441K04064r8342k64830j49501l9585J94703L01852j23792l9775j74025
$$ 484441 688505 590163 325333 175832 136247 330950 632802 509010 469235 295210
17680B95210k50005m00920Q6415K23656K3337j78301k94476k97824J22767L71572
$$ 295210 45205 -355715 -269300 -45644 -22307 -200608 -495084 -792908 -670141 -298569
17670b98569N22279N6920k20084m7420m1765J2531k255K24313M031k31018k58488
$$ -298569 223710 280630 60546 13126 -28639 -16108 -18363 205950 209981 -21037 -279525
17659b79525J93364O8012Q2040J81688K95042l07633j83349K91234K95194J6096
$$ -279525 -86161 -18149 63891 245579 540621 232988 49639 340873 636067 652163
17649F52163K00191j92035j37267n6106m3361j25383P2405j17279j28974J7272
$$ 652163 852354 660319 523052 466946 423585 298202 370607 253328 124354 141626
17639A41626J5005q1469R6634j4095R4476k13716j71320j34769K266J08271M56872
$$ 141626 156631 75162 171796 157701 252177 38461 -132859 -267628 -265362 -157091 299781
17628B99781O4114l09574k72768j6597J72564L21841K53308k2738m23315m09114
$$ 299781 363895 54321 -218447 -235044 -62480 259361 512669 489931 66616 -342498
17618c42498J75900L5613R1756J99578l30842P5035Q1092l46895J03482j30870
$$ -342498 -166598 -130985 -39229 160349 -170493 -95458 -14366 -361261 -257779 -388649
17608c88649p7594n7367J70463L35466M46453L47311p2068l40353m6313k2801
$$ -388649 -466243 -523610 -353147 -17681 428772 776083 704015 363662 317349 294548
17598B94548k33685j75747K79928J00909j39151j86798k18897R6916J77430r2007
$$ 294548 60863 -114884 165044 265953 126802 -59996 -278893 -181977 -4547 -96554
17588i6554K21391K65070j16235j36177j31181J03164j78354j11898j10255J41281
$$ -96554 124837 389907 273672 137495 6314 109478 -68876 -180774 -291029 -149748
17578a49748L49318m8129J00144n4619l71802k11154K50172P2913r4477L06742
$$ -149748 199570 151441 251585 196966 -174836 -385990 -135818 -62905 -157382 149360
17568A49360o0362q4711p8827K58004O57493J2156o859O6017R0037k7874j13465
$$ 149360 88998 4287 -74540 183464 840957 853113 846254 912271 1002308 974434 860969
17557H60969J78174L0573r0204n1581k12392l10179k56750r1920q8817K25111
$$ 860969 1039143 1069716 979512 927931 715539 405360 148610 56690 -32127 192984
17547A92984l9810J0266j0167k61403O4063L27285J91298n69707m79541J17481
$$ 192984 153174 163440 153273 -108130 -44067 283218 474516 -95191 -574732 -457251
17537d57251R0504L7302O9288K87906K00703K38210M5460M12558K07008K0348
$$ -457251 -366747 -329445 -260157 27749 228452 466662 512122 924680 1131688 1152036
17527A152036J07573q4528n0018k82948P418Q2817J66456m07038j51279l74209
$$ 1152036 1259609 1175081 1125063 842115 849533 932350 1098806 691768 540489 166280
17517A66280K3948k40435j13231R7156q4886K8200K7947n6540m7936P9620n8823
$$ 166280 190228 -50207 -163438 -66282 -151168 -122968 -95021 -151561 -199497 -119877 -178700
17506a78700j14458Q4720J51711K76938L5503M08162j27488j29776j02771J88200
$$ -178700 -293158 -208438 -56727 220211 255714 663876 536388 406612 303841 492041
17496D92041j07325r7670L9371k29498j25166R4561R766j49154R256J20673M2088
$$ 492041 384716 287046 326417 96919 -28247 66314 76080 -73074 -63818 56855 98943
17485I8943O8796n0975P0604m4684R4406r0939L8181J54572j28669K7929K14757
$$ 98943 167739 116764 187368 142684 237090 146151 184332 338904 210235 238164 452921
17474D52921J6791K20955N6840m62480q455k49773K30235J52200l4374m6961k79137
$$ 452921 469712 690667 747507 285027 276572 26799 257034 409234 374860 327899 48762
17463D8762j80495j21314M37712K09576j92880k53653j55998K581J4661j10296
$$ 48762 -131733 -253047 184665 394241 201361 -52292 -208290 -205709 -191048 -301344
17453c01344M3549l6345Q5930J18380J29414j99820j94615l8459K02949J95094
$$ -301344 -257795 -294140 -208210 -89830 39584 -160236 -354851 -393310 -190361 4733
17443D733Q5025n9307k29590L3961m5609j8787p4592O1698L81034l75577j49875
$$ 4733 89758 30451 -199139 -165178 -210787 -229574 -304166 -242468 138566 -237011 -386886
17432c86886K06289J95748n9206J60110q6294l17641K46896p8008J01897J69431
$$ -386886 -180597 15151 -44055 116055 29761 -287880 -40984 -118992 -17095 152336
17422A52336k46198K53920J23341P995J11179k42078k11335R7690J67557k7855
$$ 152336 -93862 160058 283399 291394 402573 160495 -50840 46850 214407 186552
17412A86552J09285P2044N757k69381J5789J81446K13341J07032J84374q8346
$$ 186552 295837 367881 373638 104257 120046 301492 514833 621865 806239 717893
17402G17893l36324p8924J26201M3030m34629J53649k7482l58790Q4240K81125
$$ 717893 381569 302645 428846 471876 37247 190896 163414 -195376 -111136 169989
17392A69989j04225k01953j18215k94317r3649J86726L20605K12381j76708k88714
$$ 169989 65764 -136189 -254404 -548721 -642370 -455644 -135039 77342 -99366 -388080
17382c88080J48877J39124L41093k45628k85853j20661M7533L95556L0648M56271
$$ -388080 -239203 -100079 241014 -4614 -290467 -411128 -363595 31961 62609 518880
17372E18880N1354k42300m28228o3409J46333J6329J85399J77531M48947O6789
$$ 518880 570234 327934 -100294 -163703 -17370 -1041 184358 361889 810836 877625
17362H77625K78938L46559K81788L17917M59535m9681l77267r1401j21099l52294
$$ 877625 1156563 1503122 1784910 2102827 2562362 2512681 2135414 2044013 1922914 1570620
17352A570620m31821j39775j5460o3344o60346n40420r285N37892M04382k55378
$$ 1570620 1138799 999024 983564 920220 259874 -280546 -289831 248061 652443 397065
17342C97065k48318K84579P0388l45967J56826K14411j71379k51586n480j91520
$$ 397065 148747 433326 503714 157747 314573 528984 357605 106019 100539 -90981
17332i0981m3549L9752J40993j95369o2755J98181l2146k2566L86339J05282k4106
$$ -90981 -134530 -94778 46215 -149154 -211909 -13728 -45874 -68440 317899 423181 399075
17321C99075j72481l60647n9896J01562l14033k8126L29791K3221l99377J94683
$$ 399075 226594 -134053 -193949 -92387 -406420 -434546 -104755 -81534 -480911 -286228
17311b86228q071k70266O2190K38202N1991K4990K25092k7985q5299m7301j13493
$$ -286228 -294299 -564565 -502375 -264173 -212182 -187192 37900 9915 -75384 -122685 -236178
17300b36178k20201k44473K65608J53021K48296J01633k21321o7652N4365L63371
$$ -236178 -456379 -700852 -435244 -282223 -33927 67706 -153615 -221267 -166902 196469
17290A96469j89100j76307J74755j36208J49617J0840J29574J24233m041l18421
$$ 196469 7369 -168938 5817 -130391 19226 30066 159640 283873 279832 -38589
17280c8589j33786j29646k83404N115Q9168M1665k0223k59032L00197L53754L35168
$$ -38589 -172375 -302021 -585425 -580310 -491142 -449477 -469700 -728732 -428535 -74781 260387
17269B60387R9377L1921m72472l00900K47365J34831J91738q9287k50832K11845
$$ 260387 359764 391685 -80787 -381687 -134322 509 192247 102960 -147872 63973
17259F3973j17948q4943r7367P3235k13668O2362K36285L99095m28977j42963
$$ 63973 -53975 -138918 -236285 -163050 -376718 -314356 -78071 321024 -107953 -250916
17249b50916n4204N7483j62040K38933L38177J65582L8693l10895n8112j42972
$$ -250916 -305120 -247637 -409677 -170744 167433 333015 371708 60813 2701 -140271
17239a40271J79020L5515j80017k6232j33188k5886L82464Q0472j2752M1660J60857
$$ -140271 38749 74264 -105753 -131985 -265173 -291059 91405 171877 159125 200785 361642
17228C61642j1356j46876j04417P9562k99855k63197O0923l7851k6947N0477M23388
$$ 361642 350286 203410 98993 178555 -121300 -384497 -323574 -361425 -388372 -337895 85493
17217H5493o406j87615R7720j14967K85197k14029p3124J23399r0670k13236K50869
$$ 85493 79087 -108528 -10808 -125775 159422 -54607 -127731 -4332 -95002 -308238 -57369
17206e7369K89096q0092O4869k66676j24264L40758J76066J63517k9343k94524
$$ -57369 231727 151635 216504 -50172 -174436 166322 342388 505905 476562 182038
17196A82038n72831l695m6775L90704N07665k83237k11874j81408K60661K3088
$$ 182038 -390793 -394488 -441263 -50559 457106 173869 -38005 -219413 41248 64336
17186F4336J30326n7163o6540o2897l53495l89569j06837J44319J61540M37635
$$ 64336 194662 137499 70959 8062 -345433 -735002 -841839 -697520 -535980 -98345
17176i8345J47469l29798r2684K51999J77170k30923l18249J47700J72231j38841
$$ -98345 49124 -280674 -373358 -121359 55811 -175112 -493361 -345661 -173430 -312271
17166c12271k04022K25544K47142K438l45067Q7230p7L43941j23836j4047O0401
$$ -312271 -516293 -290749 -43607 -41169 -386236 -299006 -299083 44858 -78978 -93025 -32624
17155c2624r3043R0347k71343j18275J77545J02198J45031j22986j54568J13319
$$ -32624 -125667 -35320 -306663 -424938 -247393 -145195 -164 -123150 -277718 -164399
17145a64399J0621L06315R7347k09769m28177p6376J88333M9665J09576j47860
$$ -164399 -153778 152537 249884 40115 -388062 -464438 -276105 -226440 -116864 -264724
17135b64724l43610k81531q762J82621J47161J43735J11273O9763Q531r4186K36209
$$ -264724 -608334 -889865 -898627 -716006 -568845 -425110 -313837 -244074 -235543 -329729 -93520
17124i3520K12459l79204j35016j08502l7289n2456j12453L1956J08890P9769
$$ -93520 118939 -260265 -395281 -503783 -541072 -593528 -705981 -674025 -565135 -485366
17114d85366L47992J9334M7060l8296J80883J49277n7371N2454R3426J23929L83142
$$ -485366 -137374 -118040 -70980 -109276 71607 220884 163513 215967 309393 433322 816464
17103H16464l30643k51780k3451j4766O502k21090j87453J72137L71661j88529
$$ 816464 485821 234041 210590 195824 202326 -18764 -206217 -34080 337581 149052
17093A49052M1390j18250j26943O6368k8177L33437R1283j05015L01086P3080
$$ 149052 190442 72192 -54751 11617 -16560 316877 408160 303145 604231 677311
17083F77311k86222J26566m57213m700J30877K30717m8091j7403k9716J23816
$$ 677311 391089 517655 60442 55742 186619 417336 369245 351842 322126 445942
17073D45942j79309j69244M8792n2458l17474Q515K95384J63108K5438j12703
$$ 445942 266633 97389 146181 93723 -223751 -215236 80148 243256 268694 155991
17063A55991k05609o2956L8740l7359j6937k2373l5652L12766L89111r1468m9983
$$ 155991 -49618 -112574 -73834 -111193 -128130 -150503 -186155 126611 515722 424254 374271
17052C74271l5723K94847P0873m69969J604O4794K62468J00821p141m4959j74398
$$ 374271 338548 633395 704268 234299 235903 300697 563165 663986 656845 611886 437488
17041D37488j29236j14280l02224N0248K99211r3380L7746K83147M573j73989
$$ 437488 308252 193972 -108252 -58004 241207 147827 185573 468720 473293 299304
17031B99304l83764l52351j3726L43177J93918J9161k460K00884p8855j7421k50524
$$ 299304 -84460 -436811 -450537 -107360 86558 105719 103259 304143 225288 207867 -42657
17020d2657k06268j84904J20945K62362k53719K24411k5544j38791L82058j17270
$$ -42657 -248925 -433829 -312884 -50522 -304241 -79830 -105374 -244165 137893 20623
17010B0623j04714M47457J84581l33963l7173p1006K22671k54059j3864p9703
$$ 20623 -84091 363366 547947 213984 176811 105805 328476 74417 60553 -19150
17000a9150j40187k60175j03433J05858J84479l6731q4147K11072J91424J46210
$$ -19150 -159337 -419512 -522945 -417087 -232608 -269339 -353486 -142414 49010 195220
16990A95220Q1677k06228k78189k11879J42262L02999q3453k36923K0927J59332
$$ 195220 276897 70669 -207520 -419399 -277137 25862 -57591 -294514 -273587 -114255
16980a14255J65970j5630J46235m93520K70023O5859k45560J79900n8736l3774
$$ -114255 51715 36085 182320 -311200 -41177 24682 -220878 -40978 -99714 -133488
16970a33488o650K26111J74459l2525j70483m00477L17382K58668j06856q4199
$$ -133488 -140138 85973 260432 227907 57424 -343053 -25671 232997 126141 41942
16960D1942J19569K54643N7758J64658R5524l06923k30059J31457r0114j23036
$$ 41942 161511 416154 473912 638570 734094 427171 197112 328569 238455 115419
16950A15419j97777j22331K8905L39243N73351j05809l28691L6430K83745l3946
$$ 115419 -82358 -204689 -175784 163459 736810 631001 302310 338740 622485 588539
16940E88539Q3937K67327l9140N2181j77832m07899l69579l29016J00119K64229
$$ 588539 672476 939803 900663 952844 775012 367113 -2466 -331482 -231363 32866
16930C2866M4992K38784K09603K319j58718k869N4679K38465j09557j30108K52781
$$ 32866 77858 316642 526245 528564 369846 366977 421656 660121 550564 420456 673237
16919F73237p7588r9324k60133J50965J7580k47632J79349p8615M6674K51415
$$ 673237 595649 496325 236192 387157 404737 157105 336454 257839 304513 555928
16909E55928M685m19701J7787j37347K90011K73335P3171j8098l6374J04115n3029
$$ 555928 560613 140912 158699 21352 311363 584698 657869 639771 603397 707512 654483
16898F54483L63259J59288k09600j78485j14670k82225k98511j61275L29435N22443
$$ 654483 1017742 1177030 967430 788945 674275 392050 93539 -67736 261699 784142
16888G84142K10650q6091k07369l858J85905J20604j16172J23567o0332K40693
$$ 784142 994792 908701 701332 697474 883379 1003983 887811 1011378 951046 1191739
16878A191739j441j71820J0671P0413M5715j46081P0482q1597j73116L427K60375
$$ 1191739 1190298 1018478 1029149 1099562 1145277 999196 1069678 988081 814965 818392 1078767
16867A078767o3884k15367k34919M70079J28119J27977J40132K86191k95682j19892
$$ 1078767 1014883 799516 564597 1034676 1162795 1290772 1430904 1717095 1421413 1301521
16857A301521j73184O5190K18463J56618J10879L09384J45742j84035L39961O36500
$$ 1301521 1128337 1193527 1411990 1568608 1679487 1988871 2134613 1950578 2290539 2927039
16847B927039j28315k80820J70989R0832Q035L72843K22743M403m7071l0771J38990
$$ 2927039 2798724 2517904 2688893 2779725 2787760 3160603 3383346 3387749 3340678 3309907 3448897
16836C448897J94385N39648N61403P8942M23008M29466O50986P18599K13047M42812
$$ 3448897 3643282 4182930 4744333 4823275 5246283 5675749 6326735 7045334 7258381 7701193
16826G701193O12717J169036J514307J849149J922034J940511K620311L171004
$$ 7701193 8313910 9482946 10997253 12846402 14768436 16708947 19329258 22500262
16818B2500262L545815L978578N420350O843681R880653J5730869K5493366M2681597
$$ 22500262 26046077 30024655 35445005 42288686 52169339 67900208 93393574 136075171
16810A36075171O9565414R6912235J00490324Q3815317P4760499M2203916k3460482
$$ 136075171 205640585 302552820 403043144 486858461 561618960 603822876 580362394
16803E80362394o2720797p4897273r5773049j00193697p8234594n1663512l3396850
$$ 580362394 517641597 442744324 346971275 246777578 168542984 116879472 83482622
16796H3482622k1701772j4088544r811450o619157m847559m282009l399133k652259
$$ 83482622 61780850 47692306 37880856 31261699 26414140 22132131 18732998 16080739
16788A6080739k442810k360626j866959j789146j048729p40437p14848r83587
$$ 16080739 13637929 11277303 9410344 7621198 6572469 5832032 5117184 4133597
16780D133597r55127k60555k13434j46474n8619k86850j06465p3007k16182l51026
$$ 4133597 3178470 2917915 2704481 2558007 2499388 2212538 2106073 2033066 1816884 1465858
16770A465858m6422M18668K40038l46827l07921k39866k9096K9814k73872l35295
$$ 1465858 1419436 1838104 2078142 1731315 1423394 1183528 1154432 1184246 910374 575079
16760E75079l7320j94894J07691K24650K61162j27874k73963j54723J14150M6502
$$ 575079 537759 342865 450556 675206 936368 808494 534531 379808 493958 540460
16750E40460J65782k09925k59340M4686L26603J03437j937Q8941K2974k82459
$$ 540460 706242 496317 236977 281663 608266 711703 709766 798707 821681 539222
16740E39222j97211L19971j06253n53365l88580L0414J18151L4284J91864q3176
$$ 539222 342011 661982 555729 2364 -386216 -355802 -237651 -203367 -11503 -94679
16730i4679j4335J19651o8117K49805o3572O7106l87005l4411n7832j30450r8146
$$ -94679 -109014 10637 -57480 192325 128753 195859 -191146 -225557 -283389 -413839 -511985
16719e11985J51197r2030K18787J21613j53512K56399K75844j44177j15258P87
$$ -511985 -360788 -452818 -234031 -112418 -265930 -9531 266313 122136 6878 7665
16709G665o2983k25234j38001q6445J01574R9717K41727P0697k25181p9672q5237
$$ 7665 -55318 -280552 -418553 -504998 -403424 -303707 -61980 8717 -216464 -296136 -381373
16698c81373n3692k2845Q5634L0860l6003P3412k707L7527K60518K6572M4270
$$ -381373 -435065 -457910 -372276 -341416 -377419 -304007 -306714 -269187 -8669 17903 62173
16687F2173l40N798K40867k70043J98792n6183j67127j1422L8706j34673l27277
$$ 62173 61833 67631 308498 38455 237247 181064 13937 2515 41221 -93452 -420729
16676d20729o5871J42780n3701J40833L19368j57293k35523j59275k09126p0177
$$ -420729 -486600 -343820 -397521 -256688 62680 -94613 -330136 -489411 -698537 -768714
16666g68714L157K81816L12485J03009m6081J24196m580n3739M466n987k05694
$$ -768714 -765557 -483741 -171256 -68247 -114328 9868 5288 -48451 -43985 -49972 -255666
16655b55666K36518J49095J56618j18489l93439j36329L75943J50086l47259k7177
$$ -255666 -19148 129947 286565 168076 -225363 -361692 14251 164337 -182922 -210099
16645b10099L38610N7764l90797j55886j84865j91342j44690J81078K33799J16475
$$ -210099 128511 186275 -204522 -360408 -545273 -736615 -881305 -700227 -466428 -349953
16635c49953J71498N0507k32809J62372P1665K48963L27348K25739k90369k34186
$$ -349953 -178455 -127948 -360757 -198385 -126720 122243 449591 675330 384961 150775
16625A50775L7791K83897J8465k93584l61203K5271J76536J25497K17705J122
$$ 150775 188566 472463 490928 197344 -163859 -138588 37948 163445 381150 382272
16615C82272j41031n6888k22493m056j94832o614o707J47580L15574p8591k74206
$$ 382272 241241 184353 -38140 -42196 -237028 -243642 -250349 -102769 212805 134214 -139992
16604a39992k10817j6498m34946o0705O60141O8325P8536J84668m702j62109j80819
$$ -139992 -350809 -367307 -802253 -862958 -202817 -134492 -55956 128712 124010 -38099 -218918
16593b18918O7987J17636K03407j49456k04218p5722K30355R1278j56606l6190
$$ -218918 -150931 -33295 170112 20656 -183562 -259284 -28929 62349 -94257 -130447
16583a30447J8915o1194M1915L42047j41184j64553m0682Q0736L20379O984l69577
$$ -130447 -111532 -172726 -130811 211236 70052 -94501 -135183 -54447 265932 272916 -96661
16572i6661q0161J113L15625J82075k12558p3966k10241m77963M9668J72327n7384
$$ -96661 -176822 -175709 139916 321991 109433 35467 -174774 -652737 -603069 -430742 -488126
16561d88126J12070n2199o8649n4293j33119k20278J35255J69762K91952L6828
$$ -488126 -376056 -428255 -496904 -551197 -684316 -904594 -769339 -599577 -307625 -270797
16551b70797N9648k37514m01004k36711K84079K84186R6148M38846j45964l08346
$$ -270797 -211149 -448663 -849667 -1086378 -802299 -518113 -421965 16881 -129083 -437429
16541d37429m0499K88091R4882k20320q1205M56267K00012j99235k29440k96152
$$ -437429 -477928 -189837 -94955 -315275 -396480 59787 259799 60564 -168876 -465028
16531d65028O4858K60208L80964Q3258m85825o11150P4501K56261o7744o4107
$$ -465028 -400170 -139962 241002 324260 -161565 -772715 -698214 -441953 -509697 -573804
16521e73804m5278J32592K03860n4002j52022P4115Q4169r0456p1238q8855J53022
$$ -573804 -619082 -486490 -282630 -336632 -488654 -414539 -330370 -420826 -492064 -580919 -427897
16510d27897n73K10075M2547m03963l3497K27761K03644O6514m702K35543j03722
$$ -427897 -428470 -218395 -175848 -579811 -613308 -385547 -181903 -115389 -120091 115452 11730
16499A1730j07117K51701J96567j64347j19956j71185j79854K35459l7876n4385
$$ 11730 -95387 156314 352881 188534 68578 -102607 -282461 -47002 -84878 -139263
16489a39263k77792n6234J3887k52979J17106J67676K32416K27748k75513k19716
$$ -139263 -417055 -473289 -459402 -712381 -595275 -427599 -195183 32565 -242948 -462664
16479d62664P5898J21521j31789j87880J86840J63872J930M38829l0792q9569
$$ -462664 -386766 -265245 -397034 -584914 -398074 -234202 -232272 206557 175765 86196
16469H6196J66262J54963j50533m4733p2877l9211p2099q4985O0661K2778m36539
$$ 86196 252458 407421 256888 212155 139278 100067 27968 -57017 3644 26422 -410117
16458d10117n12499j20036L15487M88316Q1051j86382P9235k9262q2087j564L91133
$$ -410117 -922616 -1042652 -727165 -238849 -157798 -344180 -264945 -294207 -376294 -377858 13275
16447A3275L50275m27909l29998o3788P9586K15658K34215j32698k61788J37315
$$ 13275 363550 -64359 -394357 -458145 -378559 -162901 71314 -61384 -323172 -185857
16437a85857k21716k54972L40901J34008P6481j04934j70889l19837l34977j43087
$$ -185857 -407573 -662545 -321644 -187636 -111155 -216089 -386978 -706815 -1041792 -1184879
16427a184879L16114M31629L77889N76992N06660k17760n42863n0980j01728K97919
$$ -1184879 -868765 -437136 -59247 517745 1024405 806645 263782 212802 111074 408993
16417D08993k4162n6978K5087j54831k20369k68785j86567k9016J88387k3514
$$ 408993 384831 327853 352940 198109 -22260 -291045 -477612 -506628 -318241 -341755
16407c41755L43516q6143j37771j4388j42943j72596J30544j6809j73029K36861
$$ -341755 1761 -84382 -222153 -236541 -379484 -552080 -421536 -438345 -611374 -374513
16397c74513L45447j46424j80564K30858J05028K61408n58270l31813K9365Q1030
$$ -374513 -29066 -175490 -356054 -125196 -20168 241240 -317030 -648843 -619478 -538448
16387e38448K31535J16467Q989k52212K14889p8269p1355l59709k16147L50791
$$ -538448 -306913 -190446 -181457 -433669 -218780 -297049 -368404 -728113 -944260 -593469
16377e93469J21841m779J6772p9481K59559l1859K6086n8500l10872m9471o7822
$$ -593469 -471628 -476407 -459635 -539116 -279557 -311416 -285330 -343830 -654702 -704173 -771995
16366g71995P1843O80145n6487j2488k14350m83221J64557J19376J11640J14067
$$ -771995 -700152 -20007 -76494 -88982 -303332 -786553 -621996 -502620 -390980 -276913
16356b76913R041m9179k39388k329k2195o3196Q5818N4856J61611j75067q9410
$$ -276913 -267872 -317051 -556439 -558768 -580963 -644159 -558341 -503485 -341874 -516941 -606351
16345f06351M6760M4085J56163J08951q9546N1519K02471J90163q0792j52782
$$ -606351 -559591 -515506 -359343 -250392 -339938 -288419 -85948 104215 23423 -129359
16335a29359l33819j78680m3660k24163K22994J32157J27008o1344J04811N29829
$$ -129359 -463178 -641858 -685518 -909681 -686687 -554530 -427522 -488866 -384055 145774
16325A45774L30946j86379J4679K2881k95679P5633K99838j21157j21962l53283
$$ 145774 476720 290341 305020 327901 32222 107855 407693 286536 164574 -188709
16315a88709J7175p2086R3389l21280j77357L07110K79961l7595j16920J16903
$$ -188709 -171534 -243620 -150231 -471511 -648868 -341758 -61797 -99392 -216312 -99409
16305i9409J26334j36182J2766K22165J22773N8681k32562m89117l44204Q9337
$$ -99409 26925 -109257 -96491 125674 248447 307128 74566 -414551 -758755 -669418
16295f69418J30611l7326L43507K30205r3979m3745j41161K3368J39223j74466
$$ -669418 -538807 -576133 -232626 -2421 -96400 -140145 -281306 -257938 -118715 -293181
16285b93181j0913M31456k1125l84995l67508j6629J22564r1745q7376J18756
$$ -293181 -304094 127362 106237 -278758 -646266 -662895 -540331 -632076 -719452 -600696
16275f00696J93967M09410j3786l41110k16886K03538K10310J75579j29298P0951
$$ -600696 -406729 2681 -11105 -352215 -569101 -365563 -155253 20326 -108972 -38021
16265c8021m8824j07049l37559j03348M16874J67540n4509l20052K86641K29375
$$ -38021 -86845 -193894 -531453 -634801 -217927 -50387 -104896 -424948 -138307 91068
16255I1068J36966L54940L5930J60502J94557K11397K20506J12055K75262M55221
$$ 91068 228034 582974 618904 779406 973963 1185360 1405866 1517921 1793183 2248404
16245B248404N47862j20357l77273k30386n38820l82791l32993l55992P3063k26706
$$ 2248404 2796266 2675909 2298636 2068250 1529430 1146639 813646 457654 530717 304011
16235C04011P2765q0548k10658m08256j89753k57063J46251L56335L13058k65489
$$ 304011 376776 296228 85570 -322686 -512439 -769502 -623251 -266916 46142 -219347
16225b19347J30989m30046n36960k44269N90734K44471k87085j46331K60682M36846
$$ -219347 -88358 -518404 -1055364 -1299633 -708899 -464428 -751513 -897844 -637162 -200316
16215b00316n1351n6607J52587K28135m3373Q8683M4175n6879n9549l45522m3534
$$ -200316 -251667 -308274 -155687 72448 29075 117758 161933 105054 45505 -300017 -343551
16204c43551L89887j00440l42665M864M2037J66145j48298j4876K60738p8290
$$ -343551 46336 -54104 -396769 -391905 -349868 -183723 -332021 -346897 -86159 -164449
16194a64449j47184J53818K30653J5398R7653r5149m47858K77966j98341j24506
$$ -164449 -311633 -157815 72838 88236 185889 90740 -357118 -79152 -277493 -401999
16184d01999p912n5978k05968j70731K18373K22225j48649o4819N13906K13722
$$ -401999 -409911 -465889 -671857 -842588 -624215 -401990 -550639 -615458 -101552 112170
16174A12170k76022Q7514R6832j6449j47188J25439Q4025Q526m6272j19838j21735
$$ 112170 -163852 -76338 20494 4045 -143143 -17704 66321 74847 28575 -91263 -212998
16163b12998j44156L2200j09255M1880Q0500k24220O8342K22195J70120k54218
$$ -212998 -357154 -324954 -434209 -392329 -311829 -536049 -467707 -245512 -75392 -329610
16153c29610l833J24775J39038K98994k9114j87369p9396R5038j37697K5009J56317
$$ -329610 -333443 -208668 -69630 229364 200250 12881 -66515 28523 -109174 -84165 72152
16142G2152N3238j84650K9877K3203J5204J7778j33200j14907j98679K03216J40202
$$ 72152 125390 -59260 -29383 -6180 9024 26802 -106398 -221305 -419984 -216768 -76566
16131g6566j48557P2148m6888m1494M7946q6473n4770K8081K1148l35287P9692
$$ -76566 -225123 -152975 -199863 -241357 -193411 -279884 -334654 -306573 -285425 -620712 -541020
16120e41020M44094L4345j8496J07395J8726L2392j38657J12303J32143K69649
$$ -541020 -96926 -62581 -81077 26318 45044 77436 -61221 51082 183225 452874
16110D52874j07324j32712k65806m7502k21522j79778J04413n55o0597M53152
$$ 452874 345550 212838 -52968 -100470 -321992 -501770 -397357 -397912 -458509 -5357
16100e357J56261K03826r0099J09205k6493j71821m68452l07099J40170J19702
$$ -5357 150904 354730 264631 373836 347343 175522 -292930 -600029 -459859 -340157
16090c40157N1199l4318L08827K46358l8284j80455j54002l03801m7456k34751
$$ -340157 -288958 -323276 -14449 231909 193625 13170 -140832 -444633 -492089 -726840
16080g26840r661K77337J62649m10640K68655k14249J34656J79809l675J12603
$$ -726840 -736501 -459164 -296515 -707155 -438500 -652749 -518093 -338284 -341959 -229356
16070b29356J31624K70612p5976k35439k12142k2325R115j43190j69641K12696
$$ -229356 -97732 172880 96904 -138535 -350677 -373002 -363887 -507077 -676718 -464022
16060d64022K83716J47297j43132j24838J19909J79958k37189L78961L40779k04072
$$ -464022 -180306 -33009 -176141 -300979 -181070 -1112 -238301 140660 481439 277367
16050B77367j0226l04149k78651O2409L94606Q7669j7982l29612l32236J77643
$$ 277367 267141 -37008 -315659 -253250 141356 229025 211043 -118569 -450805 -273162
16040b73162J35750K498J2916L880k04516j72071L8306J97869N51058J13536k28598
$$ -273162 -137412 -134914 -121998 -118118 -322634 -494705 -456399 -258530 292528 406064 177466
16029A77466j15146m44983K89824J74224l43828q3641J94666p7049j8343j83233
$$ 177466 62320 -382663 -92839 81385 -262443 -346084 -151418 -228467 -246810 -430043
16019d30043M01038j54557k56752J54783J59328k9064r7303R718J96780k4370
$$ -430043 -29005 -183562 -440314 -285531 -126203 -155267 -252570 -242852 -46072 -70442
16009g0442k6953L23828o21818m56709J23791K71430K28498M94302k19088o0143
$$ -70442 -97395 226433 -395385 -852094 -728303 -456873 -228375 265927 46839 -13304
15999a3304J8281k85658j7868L14947j83032o5567J79884K34830j95863j75878
$$ -13304 4977 -280681 -298549 16398 -166634 -232201 -52317 182513 -13350 -189228
15989a89228L0157N451l43835K4236L649R4588R2259r96K24244o41693k04434
$$ -189228 -159071 -153620 -497455 -473219 -469570 -374982 -282723 -283719 -59475 -701168 -905602
15978i05602M11703M15738n2745j39124j62877j74884L6210l5295R6757K62654
$$ -905602 -493899 -78161 -130906 -270030 -432907 -607791 -571581 -606876 -510119 -247465
15968b47465K85613l11770J50266J51667M9772J08687M5614k80309j22129p6369
$$ -247465 38148 -273622 -123356 28311 78083 186770 232384 -47925 -170054 -246423
15958b46423j68805k28495K69693K2108k48512J67971K9166M4840J92503L9635
$$ -246423 -415228 -643723 -374030 -351922 -600434 -432463 -403297 -358457 -165954 -126319
15948a26319n8826j17457N3152P5688J68393J37037j69484p6701O6426j17231
$$ -126319 -185145 -302602 -249450 -173762 -5369 131668 -37816 -114517 -48091 -165322
15938a65322j81620N2715j13850J1451l5111q9744K29195o7346j77105j62342
$$ -165322 -346942 -294227 -408077 -396626 -431737 -521481 -292286 -359632 -536737 -699079
15928f99079r3183N7216L13370n7284N0307R6878q8182j22349k12395J59366K04923
$$ -699079 -792262 -735046 -421676 -478960 -428653 -331775 -419957 -542306 -754701 -595335 -390412
15917c90412K77778P071j27374n7869J89828k93680j08217j39844p9531K66870
$$ -390412 -112634 -105563 -232937 -290806 -100978 -394658 -502875 -642719 -722250 -455380
15907d55380L16293J86367k74637j06427J82515n0837l05670j55760J98956J15908
$$ -455380 -139087 47280 -227357 -333784 -151269 -202106 -507776 -663536 -464580 -348672
15897c48672j20931L83357k9612k06233k69858j73265L15821K64630J14358J23933
$$ -348672 -469603 -86246 -115858 -322091 -591949 -765214 -449393 -184763 -70405 53528
15887E3528J4352r3694Q312J32257j50172l43791j64485L24049N21731M4332k27708
$$ 53528 67880 -25814 -17502 114755 -35417 -379208 -543693 -219644 302087 346419 118711
15876A18711K4908J81359l6651m7283j8923J9884j51606j71811k24373j06433
$$ 118711 143619 324978 288327 241044 222121 242005 90399 -81412 -305785 -412218
15866d12218L99172L68432j37673l79538k70682J20058K81911j85252j91130K0418
$$ -412218 -13046 355386 217713 -161825 -432507 -312449 -30538 -215790 -406920 -386502
15856c86502l33593j64643L48761P3369l9068L28334J58868Q5078K3397l72681
$$ -386502 -720095 -884738 -535977 -462608 -501676 -173342 -14474 70604 94001 -278680
15846b78680n02749M03313J56663l01019J07707K97180j50279J56190j44247J20739
$$ -278680 -781429 -378116 -221453 -522472 -414765 -117585 -267864 -111674 -255921 -135182
15836a35182L54721l01395k30610l54107L13606J14094K60934J38670K16164L8506
$$ -135182 219539 -81856 -312466 -666573 -352967 -238873 22061 160731 376895 415401
15826D15401M3203M1749K0519q4580k29369l24766l73769j71303p6571j14975
$$ 415401 458604 500353 520872 436292 206923 -117843 -491612 -662915 -739486 -854461
15816h54461q2830L8875J54143q1713j98907K35865L43906K67125K43464K16934
$$ -854461 -937291 -898416 -744273 -825986 -1024893 -789028 -445122 -177997 65467 282401
15806B82401j00828M9444K92496k04716k61913K2756M8127J66443J22369O8424
$$ 282401 181573 231017 523513 318797 56884 79640 127767 294210 416579 485003
15796D85003k30982j89804q40366j37791O31605M0055J3644P4011j63756J32295
$$ 485003 254021 64217 -776149 -913940 -282335 -242280 -228636 -154625 -318381 -186086
15786a86086l8067K99818J09762J34270n3784j11656J51894k80152K7443J07824
$$ -186086 -224153 75665 185427 319697 265913 154257 306151 25999 53442 161266
15776A61266l26793P6993M5195J55637j357j41557j81648p5477q141o5027J4254
$$ 161266 -165527 -88534 -43339 112298 110941 -30616 -212264 -287741 -295882 -360909 -346655
15765c46655j40837K04225M12642j63849m54582K49456K69295j22503p2419o7424
$$ -346655 -487492 -283267 129375 -34474 -489056 -239600 29695 -92808 -165227 -232651
15755b32651m49631o5401J09006K6424K06946L58325j1147j80690M7368K70181
$$ -232651 -682282 -747683 -638677 -612253 -405307 -46982 -58129 -238819 -191451 78730
15745G8730j49437k72989p823M5834m3153m4324K57106R6201m75103k76277J93261
$$ 78730 -70707 -343696 -351519 -305685 -348838 -393162 -136056 -39855 -514958 -791235 -597974
15734e97974K56990j21427N0768K02978P0713N9263J06481j01710l18463K36916
$$ -597974 -340984 -462411 -411643 -208665 -137952 -78689 27792 -73918 -392381 -155465
15724a55465J84674k62411m23886J55157J7876n5109L08669K01240Q8310q12n81968
$$ -155465 29209 -233202 -657088 -501931 -484055 -539164 -230495 -29255 59055 58243 -523725
15713e23725k98800N9319J7893Q9672P0537Q8744L70028J54661n3041M103P3214
$$ -523725 -822525 -763206 -745313 -655641 -585104 -496360 -126332 28329 -24712 -20609 52605
15702E2605M505J15298J83268J52519p8501j71185J17646l96742m6012M44838
$$ 52605 57110 172408 355676 508195 429694 258509 376155 -20587 -66599 378239
15692C78239k78495j2345J46067j43618k27646l6806J27780J51232j41204j80835
$$ 378239 99744 87399 233466 89848 -137798 -174604 -46824 104408 -36796 -217631
15682b17631n661k43491k843K48219J70799j09316J34819Q7066R871k02310M4840
$$ -217631 -223292 -466783 -469626 -221407 -50608 -159924 -25105 61961 71832 -130478 -85638
15671h5638m3721O6859L62582R9933k29835m91589k61862J66579M03052K24088
$$ -85638 -129359 -62500 300082 400015 170180 -321409 -583271 -416692 -13640 210448
15661B10448k7704K133P7873j4278N295k10509k74415m20989Q8577r9616K23880
$$ 210448 182744 184877 262750 248472 253767 43258 -231157 -652146 -563569 -663185 -439305
15650d39305L73137J28949N068L4729k57704r4989l5500j87729j00145j64391
$$ -439305 -66168 62781 67849 102578 -155126 -250115 -285615 -473344 -573489 -737880
15640g37880K44083M13875L7229M42L59061r3201R295K11765l0250k89726J859
$$ -737880 -493797 -79922 -42693 -42251 316810 223609 232904 444669 414419 124693 126552
15629A26552p1745j43137j16291k8824J56294R2917q5093M40215L55040O2641
$$ 126552 54807 -88330 -204621 -233445 -77151 15766 -69327 370888 725928 788569
15619G88569j53603l15422k663m2700l93531J76617k7846J6377K89084M44614
$$ 788569 634966 319544 316881 274181 -119350 57267 29421 45798 334882 779496
15609G79496k35370k47404k31156J30737o8799l41184j56360L14940Q6062N5899
$$ 779496 544126 296722 65566 196303 127504 -213680 -370040 -55100 30962 86861
15599H6861L967j5017l90205m3791p0468R510O7562J59137J22530J24044N9136
$$ 86861 90828 75811 -314394 -358185 -428653 -419143 -351581 -192444 -69914 54130 113266
15588A13266k56406Q2717K8252k25849L7712J18642j62648J21142k24758J57273
$$ 113266 -143140 -60423 -32171 -258020 -220308 -101666 -264314 -143172 -367930 -210657
15578b10657J87943J43233r8555k22829Q3918Q678j10674l4020j4888j89840j86206
$$ -210657 -22714 120519 21964 -200865 -116947 -108269 -218943 -252963 -267851 -457691 -643897
15567f43897J99933J37250J10599k9379j60502J03340r016K14211j35793n9764
$$ -643897 -443964 -306714 -196115 -225494 -385996 -282656 -291672 -77461 -213254 -273018
15557b73018J59673J08552K7020K56405K00625r6153j16273m00578j23800J5075
$$ -273018 -113345 -4793 22227 278632 479257 383104 266831 -133747 -257547 -242472
15547b42472k40113p1920J41971L9648m8306j3011k46661K70591M35328j91022
$$ -242472 -482585 -554505 -412534 -372886 -421192 -434203 -680864 -410273 25055 -165967
15537a65967k71381J31414P7468J18117J37883J33132p1921k37838J08122q4965
$$ -165967 -437348 -305934 -228466 -110349 27534 160666 88745 -149093 -40971 -125936
15527a25936l92334L15278j61711j93120J08425J6482k32209j16836P3492O2120
$$ -125936 -518270 -202992 -364703 -557823 -449398 -432916 -665125 -781961 -708469 -646349
15517f46349j35960J19433M99200K55137j19790q4165q8127L58349M06592J41370
$$ -646349 -782309 -662876 -163676 91461 -28329 -112494 -200621 157728 564320 705690
15507G05690J4600j09292o5943k73520j56122j98025j20055K43195p416k88512
$$ 705690 720290 610998 545055 271535 115413 -82612 -202667 40528 33112 -255400
15497b55400k06742r720K95204K23960l3825R4604n7801j45746J21107J44714
$$ -255400 -462142 -471862 -176658 47302 13477 108081 50280 -95466 25641 170355
15487A70355P9844k27604j80716k60842L43880N0480j04923L34634J01122j45311
$$ 170355 250199 22595 -158121 -418963 -75083 -24603 -129526 205108 306230 160919
15477A60919j19551N7764J23822k5392K1548q3777j79261L69058N6501J48558
$$ 160919 41368 99132 222954 197562 219110 135333 -43928 325130 381631 530189
15467E30189j37418j79552k99442l32093j99978j22016K68326Q6075L59025K29303
$$ 530189 392771 213219 -86223 -418316 -618294 -740310 -471984 -385909 -26884 202419
15457B02419k65429m3258R5919j33558R557k38200J8314P6708k38034j36955j05197
$$ 202419 -63010 -106268 -10349 -143907 -134350 -372550 -354236 -277528 -515562 -652517 -757714
15446g57714l2447K35283L45552J78372k43657j21557J30847K67063M3015l23879
$$ -757714 -790161 -554878 -209326 -30954 -274611 -396168 -265321 1742 44757 -279122
15436b79122j43568J48957q3992L373K69510k28691j3095k647K56605o0238Q9570
$$ -279122 -422690 -273733 -357725 -354352 -84842 -313533 -326628 -329275 -72670 -132908 -43338
15425d3338L80575K23422j03200r8973l57793k79777J97738K18069j36605M5926
$$ -43338 337237 560659 457459 358486 693 -279084 -81346 136723 118 46044
15415D6044l52927k00933p4524l65805l4410o3735K21251J56866o9362P296K04505
$$ 46044 -306883 -507816 -582340 -948145 -982555 -1046290 -825039 -668173 -737535 -730239 -525734
15404e25734M67404K58045J75975m77317m21924L7918k22395q0238J08935M58582
$$ -525734 -58330 199715 375690 -101627 -523551 -485633 -708028 -788266 -679331 -220749
15394b20749J09062L14020K28879k40953l70568l29730K49103L62882J4779l23032
$$ -220749 -111687 202333 431212 190259 -180309 -510039 -260936 101946 116725 -206307
15384b06307k64726j57607M5444Q9032k99310K14497K77049J3612O4905L07560
$$ -206307 -471033 -628640 -583196 -494164 -793474 -578977 -301928 -288316 -223411 84149
15374H4149j61669k79451J75791M00748J05697m56298r0062L0078O5633K06920
$$ 84149 -77520 -356971 -181180 219568 325265 -131033 -221095 -191017 -125384 81536
15364H1536O1254r0258k35685J4886k45641n56495J96568L55712j2658M21637
$$ 81536 142790 52532 -183153 -168267 -413908 -970403 -773835 -418123 -430781 -9144
15354i144N28990m01599l30759K64801J04859q3370j80977j92383k4061o2205
$$ -9144 519846 118247 -212512 52289 157148 73778 -107199 -299582 -323643 -385848
15344c85848q3397J74611J06789Q0827m71765r467N68425R0135L0994O4519Q1276
$$ -385848 -469245 -294634 -187845 -107018 -578783 -588250 -19825 70310 101304 165823 247099
15333B47099j48228r9042j57963J73093l51425k73737J76692J98708L37298j6397
$$ 247099 98871 -171 -158134 14959 -336466 -610203 -433511 -234803 102495 86098
15323H6098q5160k48354J22932J39292m56325M0778Q7851Q6236J42833K07798
$$ 86098 938 -247416 -124484 14808 -441517 -400739 -312888 -226652 -83819 123979
15313A23979j22471l21228O2211J76828j76336J01849J14039m2361J62225J6329
$$ 123979 1508 -319720 -257509 -80681 -257017 -155168 -41129 -83490 78735 95064
15303I5064J02996j15084l09082k19507R4566K93122J63642O6684J13110j62311
$$ 95064 198060 82976 -226106 -445613 -351047 -57925 105717 172401 285511 123200
15293A23200l61461L8842J33573k21912N2870L3169j58477k9741L36191K70397
$$ 123200 -238261 -199419 -65846 -287758 -234888 -201719 -360196 -389937 -53746 216651
15283B16651l87506k50941j6555M7193J52698o5279m15373q8238L11814L11135
$$ 216651 -170855 -421796 -438351 -391158 -238460 -303739 -719112 -807350 -495536 -184401
15273a84401J36202k57609J4577L3191k5130k45482J83146j67768j82900K35208
$$ -184401 -48199 -305808 -291231 -258040 -283170 -528652 -345506 -513274 -696174 -460966
15263d60966P9971L57331K40948J51968k22559r7707O4614J68443J63434n5451
$$ -460966 -380995 -23664 217284 369252 146693 48986 113600 282043 445477 390026
15253C90026q5681l13067K6668l15502l22917K5041K91832r1540K1571L33187
$$ 390026 304345 -8722 17946 -297556 -620473 -595432 -303600 -395140 -373569 -40382
15243d0382k13254M3286K93154J65660J2930j15011k39973J62170J65568j3035
$$ -40382 -253636 -210350 82804 248464 261394 146383 -93590 68580 234148 221113
15233B21113k05181K57667P6871k19270l15146q4030j37560P22580J57417j75208
$$ 221113 15932 273599 350470 131200 -183946 -267976 -405536 317044 474461 299253
15223B99253N0399m14670l19264J55024M04890R1929j05544q3036O4378k3568
$$ 299253 349652 -65018 -384282 -229258 175632 267561 162017 78981 143359 119791
15213A19791j8117j16700j60864o4703J6876j88934M872L2113L5900k42369Q6285
$$ 119791 101674 -15026 -175890 -240593 -223717 -412651 -407779 -375666 -339766 -582135 -495850
15202d95850J17721J98964j94730M2964j33148L5896L96826M25599Q1335k29957
$$ -495850 -378129 -179165 -373895 -330931 -464079 -428183 -31357 394242 475577 245620
15192B45620k61696m71650j02464l9934J88604k12915m9047M24257M63528J99602
$$ 245620 -16076 -487726 -590190 -630124 -441520 -654435 -703482 -279225 184303 383905
15182C83905l57604k70414n3501j83301J22710K34265J58645m01213k5697J9854
$$ 383905 26301 -244113 -297614 -480915 -358205 -123940 34705 -366508 -392205 -372351
15172c72351j44423j24426K14260J26053J21272O064M3560J01283J47671j68906
$$ -372351 -516774 -641200 -426940 -300887 -179615 -173551 -129991 -28708 118963 -49943
15162d9943o0122J67876l71118o5406J87119l01641k86836K60680K47407k14779
$$ -49943 -110065 57811 -313307 -378713 -191594 -493235 -780071 -519391 -271984 -486763
15152d86763j73173j4469J77232J15678L40669l34097l61348L05942N27720L32340
$$ -486763 -659936 -674405 -497173 -381495 -40826 -374923 -736271 -430329 97391 429731
15142D29731p4795j80572J43590k16683j15438K321n6139J2501J19747q5705j35569
$$ 429731 354936 174364 317954 101271 -14167 -11846 -67985 -55484 64263 -21442 -157011
15131a57011J73657J00015r0289k64894P4662J12668J90257L37767j10169o719
$$ -157011 16646 116661 26372 -238522 -163860 -51192 139065 476832 366663 359944
15121C59944L04307R0951J09280l55884k41990k1277k30277L80675L45146k02005
$$ 359944 664251 755202 864482 508598 266608 245331 15054 395729 740875 538870
15111E38870j71006j90419k9048j34913L30671K31149l01968N4828K10474K37850
$$ 538870 367864 177445 148397 13484 344155 575304 273336 328164 538638 776488
15101G76488j49806l18774P8755j63275n30935O8922J22962J3381r644K29706
$$ 776488 626682 307908 386663 223388 -307547 -238625 -115663 -102282 -111926 117780
15091A17780K87227N1516O6181j13347m9933K11318J51270j46851R2303m7017
$$ 117780 405007 456523 522704 409357 359424 570742 722012 575161 667464 620447
15081F20447r302L58443J82314l55252n4907K42424o8904l5018j1708k74071q9276
$$ 620447 611145 969588 1151902 796650 741743 984167 915263 880245 868537 594466 505190
15070E05190p6250J7126J56601q8430k88820k46283l2139J28954J69711J824j93074
$$ 505190 428940 446066 602667 514237 225417 -20866 -53005 75949 245660 247484 54410
15059E4410j72866L21045K03431K68451j1968J05487K42609l3517l79198J82756
$$ 54410 -118456 202589 406020 674471 662503 767990 1010599 977082 597884 780640
15049G80640q1163l0892k57774k30938O8856K10093J29068M40127O5738J7380
$$ 780640 699477 668585 410811 179873 248729 458822 587890 1028017 1093755 1111135
15039A111135l88977m25020n4178J78518J17309L159l83478K19898M30562r4102
$$ 1111135 722158 297138 242960 421478 538787 541946 158468 378366 808928 714826
15029G14826l12680k78431l2621M43261L52781K93262l83696l69212K64114J54324
$$ 714826 402146 123715 91094 534355 887136 1180398 796702 427490 691604 845928
15019H45928j56675k83238k77908k1479L0873l6024K23977J71264k99242K19415
$$ 845928 689253 406015 128107 106628 137501 101477 325454 496718 197476 416891
15009D16891J75495K25711p0677n03644j12693K18557k60788j26452k75798J7465
$$ 416891 592386 818097 747420 243776 131083 349640 88852 -37600 -313398 -295933
14999b95933J36969N5504K0694N6189K034j01446K76571L7548k9236k81458k65566
$$ -295933 -158964 -103460 -82766 -26577 -24543 -125989 150582 188130 158894 -122564 -388130
14988c88130K72048Q8600k43989j37136P5362M32204J4253K65667j42112l39342
$$ -388130 -116082 -27482 -271471 -408607 -333245 98959 113212 378879 236767 -102575
14978a02575j22551R7625q7332J22668M50186K35247k62417l82049m08187Q5851
$$ -102575 -225126 -127501 -214833 -92165 358021 593268 330851 -51198 -459385 -373534
14968c73534J45092M6737n3569k35195J74960K86790R5194K6203j66886j34870
$$ -373534 -228442 -181705 -235274 -470469 -295509 -8719 86475 112678 -54208 -189078
14958a89078L81496K15896J7034j11585O9560j23512p2942q0734k33970l7909
$$ -189078 192418 408314 425348 313763 383323 259811 186869 106135 -127835 -165744
14948a65744R9432J80175J35164o5660K79357J67123k11468m46196l75347J20207
$$ -165744 -66312 113863 249027 183367 462724 629847 418379 -27817 -403164 -282957
14938b82957K84457j33195l0465q1572Q7629K91593K36667j92413m91989m7870
$$ -282957 1500 -131695 -162160 -243732 -156103 135490 372157 179744 -312245 -360115
14928c60115L36451K21826j52781m16176O9333L50284L27239k47313n83n1788
$$ -360115 -23664 198162 45381 -370795 -301462 48822 376061 128748 128165 76377
14918G6377r5765M542j87890j386k1424J62318J21672k18941j88142J35885k02458
$$ 76377 -19388 -14846 -202736 -204122 -225546 -63228 58444 -160497 -348639 -212754 -415212
14907d15212j83980K38232L38353K62967J94037J23609j78546m00901j86535l14000
$$ -415212 -599192 -360960 -22607 240360 434397 558006 379460 -21441 -207976 -521976
14897e21976J57178J28703J21465j24824J42857J74713L7373k31430m66650o91
$$ -521976 -364798 -236095 -114630 -239454 -96597 78116 115489 -115941 -582591 -583282
14887e83282j21691J67404n9479j6171P6655L53545J54340O0163j10697l34339
$$ -583282 -704973 -537569 -597048 -613219 -536564 -183019 -28679 31484 -79213 -413552
14877d13552n164j54503k88017q7100P1423k0669N7428M19918K68733N2151K9595
$$ -413552 -418716 -573219 -861236 -948336 -876913 -897582 -840154 -420236 -151503 -99352 -69757
14866f9757L8529J54677p142O91q3291K11815k25365n6232k9738j51524K08676
$$ -69757 -31228 123449 116307 116998 33707 245522 20157 -36075 -65813 -217337 -8661
14855h661K44506K32687m506m75882j43015p4936J44423K40933k11165J50437
$$ -8661 235845 468532 464026 -11856 -154871 -229807 -85384 155549 -55616 94821
14845I4821L73259k53400m7474J15603o8256l20348j71538J58541j75461j89730
$$ 94821 468080 214680 167206 282809 214553 -105795 -277333 -118792 -294253 -483983
14835d83983L23151J70741J64896L39052O0688l54955l60637Q8275L32159O7084
$$ -483983 -160832 9909 174805 513857 574545 219590 -141047 -52772 279387 346471
14825C46471j72503k53473K3043n1664j63478O070k8294n2434L30775J62682L23280
$$ 346471 173968 -79505 -56462 -108126 -271604 -265534 -293828 -346262 -15487 147195 470475
14814D70475J68017k04526k19978p2688k44351K28308K94014n7706m9139j85684
$$ 470475 638492 433966 213988 141300 -103051 125257 419271 361565 312426 126742
14804A26742k14003j28515J77374l8629j14312o9674J14790K34798M5623k37892
$$ 126742 -87261 -215776 -38402 -77031 -191343 -261017 -146227 88571 134194 -103698
14794a03698m5825l02775q7648K12063J14380L24670J606l96339r9093j05931
$$ -103698 -149523 -452298 -539946 -327883 -213503 111167 112773 -283566 -382659 -488590
14784d88590P5045J42593O2597k86718k30498L0095J4428M42388j58132K9842
$$ -488590 -413545 -270952 -208355 -495073 -725571 -695476 -681048 -238660 -396792 -366950
14774c66950M35723K40018j75391K3509Q9222n3367q0606n05280J8334K21031
$$ -366950 68773 308791 133400 156909 246131 192764 112158 -393122 -374788 -153757
14764a53757J01902j17367k58750K61018K28305j56568M7686l63642k28181K30513
$$ -153757 -51855 -169222 -427972 -166954 61351 -95217 -47531 -411173 -639354 -408841
14754d08841J51300K79556j56136j37028q4417l4336n4887L74395L61885l6437
$$ -408841 -257541 22015 -134121 -271149 -355566 -389902 -444789 -70394 291491 255054
14744B55054P4871k32349k63460r3193J62581J17613j50455p0088J47300N7019
$$ 255054 329925 97576 -165884 -259077 -96496 21117 -129338 -199426 -52126 4893
14734D893j93349J18956M2497k60554m2219k1940Q065N3083J68952K14269J08562
$$ 4893 -188456 -69500 -27003 -287557 -329776 -351716 -343651 -290568 -121616 92653 201215
14723B01215j41744K98937K6684k49584l2932J39646l4780N2862K3065k04838
$$ 201215 59471 358408 385092 135508 102576 242222 207442 260304 283369 78531
14713G8531k06559N0688M39057J36788m49171m41840p397K45178J85128L6451
$$ 78531 -128028 -77340 361717 498505 49334 -392506 -399903 -154725 30403 66854
14703F6854Q9323j30871K47515n7667k59547k55734k1198j2509K33144q4413k05193
$$ 66854 156177 25306 272821 215154 -44393 -300127 -321325 -333834 -100690 -185103 -390296
14692c90296J86282J99095N11465k40604k27574Q192L23730k5343k07177M624
$$ -390296 -204014 -4919 506546 265942 38368 46560 370290 344947 137770 142394
14682A42394k20415m4179j05993k8812L66821k13777J49601K1279r7008o2900
$$ 142394 -78021 -122200 -228193 -257005 109816 -103961 45640 66919 -30089 -92989
14672i2989K74613l462j47453j74780j29250M41021J40104j15339q2368k77053
$$ -92989 181624 178162 30709 -144071 -273321 167700 307804 192465 110097 -166956
14662a66956K02758M555J07684J88465J52163l13737k42437j297j644q3865k11649
$$ -166956 35802 40357 148041 336506 488669 174932 -67505 -68802 -70446 -154311 -365960
14651c65960k21767O796q8909J05285L82519K55995p442l5106K16225K79086j63791
$$ -365960 -587727 -580931 -669840 -564555 -182036 73959 66517 31411 247636 526722 362931
14640C62931j66334k16358j95345J14169L50511l491j40919J83703Q1469k0673
$$ 362931 196597 -19761 -215106 -100937 249574 246083 105164 288867 370336 349663
14630C49663l49165l13879J46294K37911J63381l02426k50847n5580J89107K06504
$$ 349663 498 -313381 -167087 70824 234205 -68221 -319068 -374648 -185541 20963
14620B0963j52177K5981M5376j17012l04057k60602l5897J64880M40015j95131
$$ 20963 -131214 -105233 -59857 -176869 -480926 -741528 -777425 -612545 -172530 -367661
14610c67661k54905J35539J07712N7380r9639K69165K2838j91758L5150P4890
$$ -367661 -622566 -487027 -379315 -321935 -421574 -152409 -129571 -321329 -286179 -211289
14600b11289N2087n54668j02407J50627n2552N88169J83899j72545k62411Q2523
$$ -211289 -159202 -713870 -816277 -665650 -718202 -130033 53866 -118679 -381090 -298567
14590b98567o3727k5950L50481J78790j43033j16957k75261k22364J07415K75235
$$ -298567 -362294 -388244 -37763 141027 -2006 -118963 -394224 -616588 -509173 -233938
14580b33938Q1189l7503O841N6381L11594r4120l25595K17099J74542l6872m42780
$$ -233938 -152749 -190252 -183411 -127030 184564 90444 -235151 -18052 156490 119618 -323162
14569c23162P2674J34739K47741J61930K8395l301j67500p1201o8602J57998J39199
$$ -323162 -250488 -115749 131992 293922 322317 319016 151516 80315 11713 169711 308910
14558C08910o3562N0539J65512j51968l64764k87116k60791J78094j9068j46908
$$ 308910 245348 295887 461399 309431 -55333 -342449 -603240 -425146 -444214 -591122
14548e91122j71682J5819M68460J35538K96750J83461k3493j4753k00235k90852
$$ -591122 -762804 -746985 -278525 -142987 153763 337224 313731 298978 98743 -192109
14538a92109K11014j23622k93358K25164M59715k75284k86324j27525Q8653q6456
$$ -192109 18905 -104717 -398075 -172911 286804 11520 -274804 -402329 -313676 -400132
14528d00132L7824K75277K11434P2610j45831j74110q6881r8863k89356J35163
$$ -400132 -362308 -87031 124403 197013 51182 -122928 -209809 -308672 -598028 -462865
14518d62865M35833n5072l17238j40949j20217L42460J31849L36019j55971r3005
$$ -462865 -27032 -82104 -399342 -540291 -660508 -318048 -186199 149820 -6151 -99156
14508i9156O1628J07741k42455k9826J05997j84209O6414j06945q6720m8217J21734
$$ -99156 -37528 70213 -172242 -202068 -96071 -280280 -213866 -320811 -407531 -455748 -334014
14497c34014M29360R9240k47790k1756J80626k14478j28648K00163J09460r2614
$$ -334014 95346 194586 -53204 -74960 105666 -108812 -237460 -37297 72163 -20451
14487b0451j44876j15332Q068L5034K22838J72432R4910o58J33490J52804j09764
$$ -20451 -165327 -280659 -272591 -237557 -14719 157713 252623 251965 385455 538259 428495
14476D28495k03822l53788o38145J64722K47868M13945j74760K2635M5128K03684
$$ 428495 224673 -129115 -767260 -602538 -354670 59275 -115485 -92850 -47722 155962
14466A55962J49926P7638j62273n1239j4521L5149l229j66252o9805k76501j41446
$$ 155962 305888 383526 221253 170014 155493 190642 187413 21161 -48644 -325145 -466591
14455d66591L0342R3515O7957J32042k67112k86909n2830k3947L38524J09019
$$ -466591 -436249 -342734 -274777 -142735 -409847 -696756 -749586 -773533 -435009 -325990
14445c25990j65129Q1036L62646J88687O9085r0342j208m83955l25854j81921
$$ -325990 -491119 -410083 -47437 141250 210335 119993 118785 -365170 -691024 -872945
14435h72945K09156n0010M8213J72726k40347k06469L87148N83209l4033k35415
$$ -872945 -663789 -713799 -665586 -492860 -733207 -939676 -552528 30681 -3352 -238767
14425b38767J7551N8330J11234J53185j15537j47721M280Q8775j32873j50870
$$ -238767 -221216 -162886 -51652 101533 -14004 -161725 -157445 -68670 -201543 -352413
14415c52413J29113n8861m7482K8568n5859K50667J75692j43207j57904q0147
$$ -352413 -223300 -282161 -329643 -301075 -356934 -106267 69425 -73782 -231686 -311833
14405c11833k9155K18165J12120r834j148J24536r2599j500M9686L15806P466
$$ -311833 -340988 -122823 -10703 -20537 -21685 102851 10252 8752 58438 374244 381710
14394C81710p03K33624R5312j45862q0129l11940P8323P835m22691N4923J91234
$$ 381710 381007 614631 709943 564081 483952 172012 250335 258170 -164521 -109598 81636
14383H1636j40483J37548J8628m19155J63388J46690J84792J30644k98551m43849
$$ 81636 -58847 78701 97329 -321826 -158438 -11748 173044 303688 5137 -438712
14373d38712k50361q8502J80070J6260k08307K70157N31600J26452p1774q8478
$$ -438712 -689073 -777575 -597505 -581245 -789552 -519395 12205 138657 66883 -21595
14363b1595r4648P1837K568L79353J65956n77215J2423J63579k08634k01884N7643
$$ -21595 -116243 -44406 -41838 337515 503471 -73744 -61321 102258 -106376 -308260 -250617
14352b50617p0581m8735R3802K20710M0378K55589J65094R8955k14657l05775
$$ -250617 -321198 -369933 -276131 -55421 -15043 240546 405640 504595 289938 -15837
14342a5837J18118Q2247K29935j88706J02053k6330l03597j09196j3906j10455
$$ -15837 102281 184528 414463 225757 327810 301480 -2117 -111313 -125219 -235674
14332b35674l32630J14647M51675K33874k57667k19848r8153n7794J35625K76370
$$ -235674 -568304 -453657 -1982 231892 -25775 -245623 -343776 -401570 -265945 10425
14322A0425j5319j02694K6381j84148J02340K895k68100N719m0767M9304J90115
$$ 10425 -4894 -107588 -81207 -265355 -163015 -160120 -428220 -422501 -463268 -413964 -223849
14311b23849M5514j89829o8133L23021N16210J7599j52245j93981j60115K61668
$$ -223849 -178335 -368164 -436297 -113276 402934 420533 268288 74307 -85808 175860
14301A75860j949k66933k30156Q7669j43260m65348J91537K5979K23186j3147
$$ 175860 173911 -93022 -323178 -235509 -378769 -844117 -652580 -626601 -403415 -416562
14291d16562k77231M28372j17386j09463j3555M6707o562p4284M37146j42532
$$ -416562 -693793 -265421 -382807 -492270 -505825 -459118 -465680 -539964 -102818 -245350
14281b45350j90486K47789R4412j79814M620j76618K36687N08599k60612L7707
$$ -245350 -435836 -188047 -93635 -273449 -268829 -445447 -208760 299839 39227 76934
14271G6934K26603j26254j78453q5553J50005o6794j40177l64481J53116K93725
$$ 76934 303537 177283 -1170 -86723 63282 -3512 -143689 -508170 -355054 -61329
14261f1329j50068K1345l4840L86344M57976J82988J6911n0265l67265r5784K4762
$$ -61329 -211397 -190052 -224892 161452 619428 802416 819327 769062 401797 306013 330775
14250C30775m59557l60449L4919K28375K70935K20944k46819k08952j44360J81819
$$ 330775 -128782 -489231 -454312 -225937 44998 265942 19123 -189829 -334189 -152370
14240a52370J37726J66188k76275L443n7322J08255O81399j91639p71612L03725
$$ -152370 -14644 151544 -124731 -121288 -178610 -70355 611044 419405 -352207 -48482
14230d8482L4010j2201J64308k56713l6142J5801j41994j14873L32370K02501
$$ -48482 -14472 -26673 137635 -119078 -155220 -139419 -281413 -396286 -63916 138585
14220A38585j58069j31091J83436J44936O0606r7658k973j22715K15438L23491
$$ 138585 -19484 -150575 32861 177797 238403 140745 137772 15057 230495 553986
14210E53986k22845k29397k37717k05867k86726j64749J67636L00055J56783j5355
$$ 553986 331141 101744 -135973 -341840 -628566 -793315 -625679 -325624 -168841 -184196
14200a84196K42866N7497J31451k51392j43466J27794p646k15335P4088n4029
$$ -184196 58670 116167 247618 -3774 -147240 -19446 -27092 -242427 -168339 -222368
14190b22368J75773J52814Q8039J03843q9317L8582j09637M9592o8710k06685
$$ -222368 -46595 106219 194258 298101 208784 247366 137729 187321 118611 -88074
14180h8074l73101J16749P2120J18855K33897J85652j87190j78237J64407L58896
$$ -88074 -461175 -344426 -272306 -153451 80446 266098 78908 -99329 65078 423974
14170D23974o7376l11159k90022J10800K71072N7494K13215J5177l23976Q2336
$$ 423974 356598 45439 -244583 -133783 137289 194783 407998 423175 99199 181535
14160A81535K40050K5204j23791k45456Q1872k15062j75469K65432q9927L39519
$$ 181535 421585 446789 322998 77542 159414 -55648 -231117 34315 -55612 283907
14150B83907J38095q2454l7134N80117O5830o45973m46591o0412K79140l975J01606
$$ 283907 422002 339548 302414 882531 948361 302388 -144203 -204615 74525 70550 172156
14139A72156k68356k43913K31484K22949k5178r591q4220j29949K6702k52174
$$ 172156 -96200 -340113 -108629 114320 89142 79551 -4669 -134618 -107916 -360090
14129c60090o8772M2366p3857M9619K8194J44470k94106K57611L34304j26249
$$ -360090 -428862 -386496 -460353 -410734 -382540 -238070 -532176 -274565 59739 -66510
14119f6510J9527K12106R6070J10900j11471j83612K47221l3328j6711L84350
$$ -66510 -46983 165123 261193 372093 260622 77010 324231 290903 274192 658542
14109F58542J89326o1408m12198M5205l03276j15507P1535r2637K33053J24870
$$ 658542 847868 786460 374262 419467 116191 684 72219 -20418 212635 337505
14099C37505j31273r9042n23850j6686R5796J10090K30207j5977m0928L13849
$$ 337505 206232 107190 -416660 -433346 -337550 -227460 2747 -13230 -54158 259691
14089B59691k0205K1563O5015l72419K2381J34966K01429J03039J0138l0575j54008
$$ 259691 239486 261049 326064 -46355 -23974 110992 312421 415460 425598 395023 241015
14078B41015j04961j13303j32547j42367p3543O12408l7085o19485J74852J39703
$$ 241015 136054 22751 -109796 -252163 -325706 286702 249617 -369868 -195016 -55313
14068e5313J27727P6944K7401M3407m51674j65076j43778K13667L95425L03402
$$ -55313 72414 149358 176759 220166 -231508 -396584 -540362 -326695 68730 372132
14058C72132J73351j34000j4342k80350m2082R5249K94900k7272O0161j274K48190
$$ 372132 545483 411483 397141 116791 74709 169958 464858 437586 497747 496473 744663
14047G44663r969l46024l87407k11920L07469J66656J44810p6078k94865k06504
$$ 744663 734694 388670 1263 -210657 96812 263468 408278 332200 37335 -169169
14037a69169k3568N3122J48228j6235k04755J95293K10311J72068L2418j09768
$$ -169169 -192737 -139615 8613 -7622 -212377 -17084 193227 365295 397713 287945
14027B87945R1385m17207k97532R5754J20733K04246K70058m7890k38903l59533
$$ 287945 379330 -37877 -335409 -239655 -118922 85324 355382 307492 68589 -290944
14017b90944k8160M5724J02761l282k72683N8544K06618J81179j54073O8778J56861
$$ -290944 -319104 -273380 -170619 -173901 -446584 -388040 -181422 -243 -154316 -85538 71323
14006G1323j19864j82249J23375P4235K6202M1435O5857j58978J2684L15387J84338
$$ 71323 -48541 -230790 -107415 -33180 -6978 34457 100314 -58664 -45980 269407 453745
13995D53745K72194j54866j60502k69722j73593J56641p8703m05535l05640L81105
$$ 453745 725939 571073 410571 140849 -32744 123897 45194 -360341 -665981 -284876
13985b84876J54364P6347O1749J13792K7476k90183n1465J51130J89180k70912
$$ -284876 -130512 -54165 7584 121376 148852 -141331 -192796 -41666 147514 -123398
13975a23398k49636M00053K39817k0583j62526L17300j32548K54064K16943n1917
$$ -123398 -373034 27019 266836 246253 83727 401027 268479 522543 739486 687569
13965F87569k28591M7155j42932j85036m00176j89077M2649j16679k12114K11721
$$ 687569 458978 506133 363201 178165 -222011 -411088 -368439 -485118 -697232 -485511
13955d85511m3241J73333L49669n775k6259K04642L4767j04160q4686R8862L67059
$$ -485511 -528752 -355419 -5750 -11525 -37784 166858 201625 97465 12779 111641 478700
13944D78700r7660k61796l60202l16926J28827J12598J33310q9786j00331K14689
$$ 478700 381040 119244 -240958 -557884 -429057 -316459 -183149 -272935 -373266 -158577
13934a58577K31357q3631j89384N6248K78918K75347q3568j60017j03643L8774
$$ -158577 72780 -10851 -200235 -143987 134931 410278 326710 166693 63050 101824
13924A01824K3473M5657k55472q4404K67494L96307J44692j75967j82741J16645
$$ 101824 125297 170954 -84518 -168922 98572 494879 639571 463604 280863 397508
13914C97508K9169k69737q008K57828R4410m7k92508M2432L57781M52741L9236
$$ 397508 426677 156940 148932 406760 501170 501123 208615 251047 608828 1061569 1100805
13903A100805m62759l4555J08824j07232k69126l90010k85048K1884L35768J46824
$$ 1100805 638046 603491 712315 605083 335957 -54053 -339101 -317217 18551 165375
13893A65375j54110p5979K63840M4879k40122k13473P6596M00507M96938O1040
$$ 165375 11265 -64714 199126 244005 3883 -209590 -132994 267513 764451 825491
13883H25491J52125k76533j28475p3820l97788p4844m51971l5396L54094O69538
$$ 825491 977616 701083 572608 498788 101000 26156 -425815 -461211 -107117 562421
13873E62421K77991j31110k46830k63934k90746L5066j46572o8028M17830j02221
$$ 562421 840412 709302 462472 198538 -92208 -57142 -203714 -271742 146088 43867
13863D3867l03397o0556N18293J74055j80863l28404K1042K24495N0839j9180
$$ 43867 -259530 -320086 198207 372262 191399 -137005 -115963 108532 159371 140191
13853A40191J29224K1792o6639q3130j9285l01240l41415k83477J64834m107K64062
$$ 140191 269415 291207 224568 141438 122153 -179087 -520502 -803979 -639145 -643252 -379190
13842c79190K1619J91782M1455K89756K2866p2950k84912K00497j94616K1473
$$ -379190 -357571 -165789 -124334 165422 188288 115338 -169574 30923 -163693 -142220
13832a42220K52618j16923M3661j04252k51634p545L80K33240J2750M14298K49373
$$ -142220 110398 -6525 37136 -67116 -318750 -326295 -325915 -92675 -79925 334373 583746
13821E83746M9983j97495j35478k34019N4949N9453L8041p6453k14206J33935
$$ 583746 633729 436234 300756 66737 121686 181139 219180 142727 -71479 62456
13811F2456K09351j83035j84494K19142K21375k18810m25825n050L45556N02656
$$ 62456 271807 88772 -95722 123420 344795 125985 -299840 -304890 40666 543322
13801E43322Q5881r1753k76616J35758j9572j16863J56437j69531M0123L11043
$$ 543322 629203 537450 260834 396592 377020 260157 416594 247063 287186 598229
13791E98229J654K3523J19426l06638k71970K59965J83009L4092m33698r0963
$$ 598229 599883 623406 742832 436194 164224 424189 607198 641290 207592 116629
13781A16629P9885j83919q7112k21825N6967L00614k31832n53943K76712J72434
$$ 116629 196514 12595 -74517 -296342 -239375 61239 -170593 -724536 -447824 -275390
13771b75390j03904K02195K09043K71755J76096m4810Q0315j024l14976q4616
$$ -275390 -379294 -177099 31944 303699 479795 434985 515300 514276 199300 114684
13761A14684J01413J27141k86091L8426J57119j41987O9312K34603K69522j32817
$$ 114684 216097 343238 57147 95573 252692 110705 180017 414620 684142 551325
13751E51325n08361j29111j69326R5813K29090k4932m6170K1044L74691P3964
$$ 551325 42964 -86147 -255473 -159660 69430 44498 -1672 19372 394063 468027
13741D68027k3913j54512k627J45193L80412k79837J50371n9430k1751o4702l54849
$$ 468027 444114 289602 286975 432168 812580 532743 683114 623684 601933 537231 182382
13730A82382K67558K42829Q4278N2346k0151j04569k43301j34650K98618K01204
$$ 182382 449940 692769 777047 829393 809242 704673 461372 326722 625340 826544
13720H26544m6324m76599k4034j0913m1046m1655J89894N31431k2547j17478m70623
$$ 826544 780220 303621 279587 268674 227628 185973 375867 907298 884751 767273 296650
13709B96650n5551J25920R3974K6151j29708Q4244M2536o1025k87328k22137L9938
$$ 296650 241099 367019 460993 487144 357436 441680 484216 423191 135863 -86274 -46336
13698d6336M31128M94199L1776k25483k42079k05832j90109p7268R9947K37414
$$ -46336 384792 878991 910767 685284 443205 237373 47264 -30004 69943 307357
13688C07357K94685K23258L5000k66953l22463l03360J37747N40734J73372l56477
$$ 307357 602042 825300 860300 593347 270884 -32476 105271 646005 819377 462900
13678D62900j92125J0413j32230k54084K6328J24036J81116L1611R6137J89089
$$ 462900 270775 281188 148958 -105126 -78798 45238 226354 257965 354102 543191
13668E43191P0817j62659L4466l9641k13770k72839k54834k61K28256L97297O36076
$$ 543191 614008 451349 485815 446174 232404 -40435 -295269 -295530 -67274 330023 966099
13657I66099J65791l68307J61529J8180k05885m51862n31372L38061M13874p1879
$$ 966099 1131890 763583 925112 943292 737407 285545 -245827 92234 506108 434229
13647D34229N2033M28425k38448k35022M8103J821R9730J27923K6091l46235j8461
$$ 434229 486262 914687 676239 441217 489320 491141 590871 718794 744885 398650 380189
13636C80189L1111j78495l822K47466L720Q7275o0341k62279k32888L5891j5327
$$ 380189 411300 232805 228983 476449 480169 567444 507103 244824 11936 47827 32500
13625C2500J08704J34191p678J63940P9134l6536Q3778K53891K02039l82023j53182
$$ 32500 141204 275395 267717 431657 510791 474255 558033 811924 1013963 631940 478758
13614D78758j9539l06328J16300O5895P6241j82852J12538q9145K66920L84044
$$ 478758 459219 152891 269191 335086 411327 228475 341013 251868 518788 902832
13604I02832p0992k76792J20998j28387l04806k3335o3086P2486M79586J18587
$$ 902832 831840 555048 676046 547659 242853 219518 156432 228918 708504 827091
13594H27091j79870l25987k35123K43732K98425p3556n1875l8789j69910n8057
$$ 827091 647221 321234 86111 329843 628268 554712 502837 464048 294138 236081
13584B36081J05792j78624j27684L71277P2989M9956Q047k56213o0589p77K7483
$$ 236081 341873 163249 35565 406842 479831 529787 537834 281621 221032 220255 247738
13573B47738J23236J91932p0364j48825k39062O4860J50811J67992K42498J76492
$$ 247738 370974 562906 492542 343717 104655 169515 320326 488318 730816 907308
13563I07308J6790j25290j97010k3779M7769q2826j64837j02749m0994k40634
$$ 907308 924098 798808 601798 578019 625788 542962 378125 275376 234382 -6252
13553f252k72248L88528M74763N66532O08690P1808q1851j84611j56329j79669
$$ -6252 -278500 110028 584791 1151323 1760013 1831821 1749970 1565359 1409030 1229361
13543A229361L34274J88074N8376k52464l25780k01171J28991n1487Q2708j6356
$$ 1229361 1563635 1751709 1810085 1557621 1231841 1030670 1159661 1108174 1190882 1174526
13533A174526n05029k90926L1994n3083j11162L0041q3426j52013J50449J36550
$$ 1174526 669497 378571 410565 357482 246320 276361 192935 40922 191371 327921
13523C27921k41638R2473q8394P9536p6523k29842P2996K73276M38256K35687
$$ 327921 86283 178756 90362 169898 93375 -136467 -63471 209805 648061 883748
13513H83748j49783k4713m4448M3830k70957K63988K17841M5674M42104J79480
$$ 883748 733965 709252 664804 708634 437677 701665 919506 965180 1407284 1586764
13503A586764j83463N0755K32575q6619l3372j20674J24959q573m49077k07042
$$ 1586764 1403301 1454056 1686631 1600012 1566640 1445966 1570925 1562352 1113275 906233
13493I06233l43176j43470n11933k91716M13010N59096M12569o8121k14375m9042
$$ 906233 563057 419587 -92346 -384062 28948 588044 1000613 932492 718117 669075
13483F69075k36418m12075k842K52458K84126j07584K07335R0758l44689j6153
$$ 669075 432657 20582 17740 270198 554324 446740 654075 744833 400144 383991
13473C83991K66201J97456q3015k65854J53945J88198J26281l80179k52412M19549
$$ 383991 650192 847648 764633 498779 652724 840922 967203 587024 334612 754161
13463G54161L53836J56349k06626K47257L93433L9553l70825j09138k34351n5995
$$ 754161 1107997 1264346 1057720 1304977 1698410 1737963 1367138 1258000 1023649 967654
13453I67654k53869l27954l47617J41883o8597n9664M56254j72845k01691q2484
$$ 967654 713785 385831 38214 180097 111500 51836 508090 335245 133554 51070
13443E1070K50807o8156k20915R9486J08311J13148j72902j48255K64453L8868
$$ 51070 301877 233721 12806 112292 220603 333751 160849 12594 277047 315915
13433C15915k41634J55528J98203N2487j02726Q7044j32268l4903l42444P0823
$$ 315915 74281 229809 428012 480499 377773 464817 332549 297646 -44798 26025
13423B6025p306k40858O7695K16479O229J24202j19437k7877j24204m207n461
$$ 26025 18719 -222139 -154444 62035 68264 192466 73029 45152 -79052 -83259 -88720
13412h8720Q1958J50237L85583l5525l21385r9789q8644j39526L4526J64352J25874
$$ -88720 -6762 143475 529058 493533 172148 72359 -16285 -155811 -121285 43067 168941
13401A68941J22170K09378J14135K25340M47226l851j96661p5494m10429l78772
$$ 168941 291111 500489 614624 839964 1287190 1283339 1086678 1011184 600755 221983
13391B21983l92214K78860L51506L16667K1833R3797j6476k02475n8764J678J04457
$$ 221983 -170231 108629 460135 776802 798635 892432 875956 673481 614717 616395 720852
13380G20852m1474J49937O5382J35322K24688P5891k62442o77650j97065j54020
$$ 720852 679378 829315 894697 1030019 1254707 1330598 1068156 390506 193441 39421
13370C9421j05364L30353J69606l13688p6558K13781P3357k95853k73695k18504
$$ 39421 -65943 264410 434016 120328 43770 257551 330908 35055 -238640 -457144
13360d57144L21785O61393J36319l27679j00486J46290j34260K41385K69930r3257
$$ -457144 -135359 526034 662353 334674 234188 380478 246218 487603 757533 664276
13350F64276l18706j48434J97879J64345L38981K02631k91516n42668K59771N93243
$$ 664276 345570 197136 395015 559360 898341 1100972 809456 266788 526559 1119802
13340A119802J41872j23720K82157J54871k01299j59236j87170M07253M48611
$$ 1119802 1261674 1137954 1420111 1574982 1373683 1214447 1027277 1434530 1883141
13331A883141P7522n6217l65280l74064j21669j05127j82024Q7066j69245k08743
$$ 1883141 1960663 1904446 1539166 1165102 1043433 938306 756282 843348 674103 465360
13321D65360R6538K2403J04336K63461J03046j78517l49522k0461M26904k59089
$$ 465360 561898 584301 688637 952098 1055144 876627 527105 506644 933548 674459
13311F74459m09860J03814L01329O3311P9737J86904j4624M7828l532m1794K17512
$$ 674459 264599 368413 669742 733053 812790 999694 985070 1032898 1029366 987572 1205084
13300A205084K96479J98664l84816K28785J71396L09292L09295k16328J29351
$$ 1205084 1501563 1700227 1315411 1544196 1715592 2024884 2334179 2117851 2247202
13291B247202O1026l11733m71325j69495j98502L26643M63766k57725n94840o73901
$$ 2247202 2308228 1996495 1525170 1355675 1157173 1483816 1947582 1689857 1095017 421116
13281D21116J75410J51313p1513J94577j4579o64572K32881L70107l55280m25226
$$ 421116 596526 747839 676326 870903 856324 191752 424633 794740 439460 14234
13271A4234K60874L48807r7796J26733j15863l40884Q1840J40207j59301J28680
$$ 14234 275108 623915 526119 652852 536989 196105 277945 418152 258851 387531
13261C87531L18384M91636j72952j47296k15787j06699J53622L26991m7766k37247
$$ 387531 705915 1197551 1024599 877303 661516 554817 708439 1035430 987664 750417
13251G50417K83628K76382J35156Q7421J27299k26362j93355K1663j18003j09392
$$ 750417 1034045 1310427 1445583 1533004 1660303 1433941 1240586 1262249 1144246 1034854
13241A034854j7336K02626J8855k24771m43090k02333J53666q8821J91665j06675
$$ 1034854 1017518 1220144 1238999 1014228 571138 368805 522471 433650 625315 518640
13231E18640J22149N1571j53302J55373m2525k512k46364Q513J06024K74546J58387
$$ 518640 640789 692360 539058 694431 651906 649394 403030 411543 517567 792113 950500
13220I50500P1588j3273j24282j0701p7808K8375J78654l20116j47236J66382
$$ 950500 1022088 1008815 884533 873832 796024 824399 1003053 682937 535701 702083
13210G02083M74465J38394J9752k65363j78661K34907l6040P2524K7411j67038
$$ 702083 1176548 1314942 1334694 1069331 890670 1125577 1089537 1162061 1189472 1022434
13200A022434j9009L98111K53695j89619k31841R2756J24428J52561o8386j17209
$$ 1022434 1003425 1401536 1655231 1465612 1233771 1326527 1450955 1603516 1535130 1417921
13190A417921J16268J2347j40170l25469p9126N28254J63545j57585j95099r4052
$$ 1417921 1534189 1546536 1406366 1080897 1001771 1530025 1693570 1535985 1340886 1246834
13180A246834M8630k159M3605k89156k45437K78504J26465l6126M1393l46761
$$ 1246834 1295464 1293305 1336910 1047754 802317 1080821 1207286 1171160 1212553 865792
13170H65792o5848n336K81774K7486j34926L0556j00978J39612L54121J40781
$$ 865792 799944 794608 1076382 1103868 968942 999498 898520 1038132 1392253 1533034
13160A533034p8430K87053J17037m685Q3156K66856L24215K91955J12385K74325
$$ 1533034 1454604 1741657 1858694 1854009 1937165 2204021 2528236 2820191 2932576 3206901
13150C206901L38298J69507J65311P81906J441626K031394K495718K107513L26554
$$ 3206901 3545199 3714706 3880017 4661923 6103549 8134943 10630661 12738174 13064728
13141A3064728j671873k313173k027435j316365r88508p11876l54101m12772j84914
$$ 13064728 11392855 9079682 7052247 5735882 4747374 4035498 3681397 3268625 3083711
13132C083711P2383k5351l77098k80635L56055O3152L72324L29848p7616K28271
$$ 3083711 3156094 3130743 2753645 2473010 2829065 2892217 3264541 3594389 3516773 3745044
13122C745044L39722Q7151q064p049k9494L54394R4697J68626O58781P16665K96032
$$ 3745044 4084766 4171917 4163853 4156804 4127310 4481704 4576401 4745027 5403808 6120473 6416505
13111F416505M84083Q45235J534881J808007K299596L035661M866801Q593233
$$ 6416505 6900588 7745823 9280704 11088711 13388307 16423968 21290769 29884002
13103B9884002J4180828K1547283K3881379J5724307M250455o892063j8391438
$$ 29884002 44064830 65612113 89493492 105217799 109468254 102576191 84184753
13096H4184753k2358992j7889600j1847485p278253n356731l456178k358250j484087
$$ 84184753 61825761 43936161 32088676 24810423 19453692 15997514 13639264 12155177
13088A2155177n57266k37616j72470J54654L23392K57082M12988Q62575P26666
$$ 12155177 11597911 11360295 11187825 11342479 11665871 11922953 12335941 13198516 13925182
13079A3925182Q98864J654263J157858J595143K293999K732313L343896L808795
$$ 13925182 14824046 16478309 17636167 19231310 21525309 24257622 27601518 31410313
13071C1410313N332908P925096J1662658J7159297K5811417L5711718L5321660
$$ 31410313 36743221 44668317 56330975 73490272 99301689 135013407 170335067
13064A70335067J9682096N103162P900178K7994779N0592218N3638880K2355991
$$ 170335067 190017163 195120325 203020503 231015282 281607500 335246380 357602371
13057C57602371k1989314m1755292l1942578j0876441L532644l304454k5451586
$$ 357602371 335613057 293857765 261915187 251038746 254571390 251266936 225815350
13050B25815350l9123418l5428744k4468921j2564822p01201J1076760K3278607
$$ 225815350 186691932 151263188 126794267 114229445 113528244 124605004 147883611
13043A47883611L2640982K7447567K314679k5932541l5902149k9977325k1016400
$$ 147883611 180524593 207972160 210286839 184354298 148452149 118474824 97458424
13036I7458424j2236264m790364K633415J0839858K1659858L3091855L7846810
$$ 97458424 85222160 80431796 83065211 93905069 115564927 148656782 186503592
13029A86503592K1379753j2649146l7721558l9159046k8842685j9382993j2411070
$$ 186503592 207883345 195234199 157512641 118353595 89510910 70127917 57716847
13022E7716847p673204l736524m05438K985116Q028597J4802361K5255327L9680070
$$ 57716847 50043643 46307119 45901681 48886797 56915394 71717755 96973082 136653152
13014A36653152M8060828L8765757J9284433k556466k9843386n0541604m7535363
$$ 136653152 184713980 223479737 242764170 240207704 210364318 159822714 112287351
13007A12287351l3263115k1597485j4425078r457900o667207m729931l038526
$$ 112287351 79024236 57426751 43001673 33543773 26876566 22146635 19108109
13000A9108109k519655k354715j504098j104863j044091o53693k91942o09476
$$ 19108109 16588454 14233739 12729641 11624778 10580687 9926994 9635052 9025576
12992I025576p48770k93767k00214J38936K5384L69858Q48460O87758r8765q88845
$$ 9025576 8276806 7983039 7782825 7921761 7947145 8317003 9165463 9853221 9754456 8865611
12982H865611j270321r46018l39387L16878K15444m70680m30351J5719K8374j8160
$$ 8865611 7595290 6649272 6309885 6626763 6842207 6371527 5941176 5956895 5985269 5967109
12972E967109l26547j41378J09317L78678L47387K37172M25693P34038J096455
$$ 5967109 5640562 5499184 5608501 5987179 6334566 6571738 6997431 7731469 8827924
12963H827924N07574M71146R61219J436100K058493K766967L834309N711042Q674102
$$ 8827924 9335498 9806644 10767863 12203963 14262456 17029423 20863732 26574774 35248876
12954C5248876J3537106J9200237K1945716J4678325j991622j4362149j5728069
$$ 35248876 48785982 67986219 89931935 104610260 102618638 88256489 72528420
12947G2528420j0198035l893868K368529J0010517J7243655J7669370L445649
$$ 72528420 62330385 58436517 60805046 70815563 88059218 105728588 109174237
12940A09174237j4058027k0896083j8582519j3808829r793602o888288n110154
$$ 109174237 95116210 74220127 55637608 41828779 32035177 25146889 20036735
12933B0036735l610947k147326j805229j340215j255330j188023q65900o82252
$$ 20036735 16425788 14278462 12473233 11133018 9877688 8689665 7823765 7141513
12925G141513m97477l08259m12712l88900n40268j98748N8568L8950Q2591J22539
$$ 7141513 6644036 6335777 5923065 5534165 4993897 4795149 4853717 4892667 4975258 5097797
12915E097797J63598L3083J70795j37906K7194L581j76114M90023L95079J91479
$$ 5097797 5261395 5294478 5465273 5327367 5354561 5358142 5182028 5672051 6067130 6258609
12905F258609J73800J14200O45310P22215j1351k96781K2700O79723Q44882L84999
$$ 6258609 6432409 6546609 7191919 7914134 7902783 7606002 7628702 8308425 9153307 9538306
12895I538306N25506J107754J509849J674270K430818K819272L766063N216429
$$ 9538306 10063812 11171566 12681415 14355685 16786503 19605775 23371838 28588267
12887B8588267P833364J1931399J8156735K9574246M5158033N3023592L4680867
$$ 28588267 36421631 48353030 66509765 96084011 141242044 194265636 228946503
12880B28946503J5615138o45342l8088642n4483886m2049877k7050568j6977435
$$ 228946503 244561641 243916299 205827657 151343771 109293894 82243326 65265891
12873F5265891j0394792n987057k254465J190700M790273R436550J6273693K6744416
$$ 65265891 54871099 48884042 46629577 47820277 52610550 62047100 78320793 105065209
12865A05065209L9872351M4258796J9411632k1343421l7432125l1117052k0992366
$$ 105065209 144937560 189196356 208607988 187264567 149832442 118715390 97723024
12858I7723024j2380746n183816J402764Q636562J7947940K9769403L9822328
$$ 97723024 85342278 80158462 81561226 90197788 108145728 137915131 177737459
12851A77737459L2706465L77233k8240526l2334654k3411396j2368459k261931
$$ 177737459 210443924 210821157 182580631 150245977 126834581 114466122 112204191
12844A12204191Q749472K1541005L5122832M2569937K7752269n6208o939043J0118997
$$ 112204191 120953663 142494668 177617500 220187437 247939706 247883498 240944455 251063452
12836B51063452L4545781M7620479K9576641j7451380n4517965n1225757k7153863
$$ 251063452 285609233 333229712 362806353 345354973 290837008 239611251 212457388
12829B12457388n304691j513513k1466205l8740064l6894543k7502487j9203585
$$ 212457388 207152697 205639184 184172979 145432915 108538372 81035885 61832300
12822F1832300j2882758q994994o255480m763861m125245l457282k259032k320041
$$ 61832300 48949542 39954548 33699068 28935207 24809962 21352680 19093648 16773607
12814A6773607j666670j067994p92314r39917q26366o02335n37133l75236J3201
$$ 16773607 15106937 14038943 13246629 12306712 11480346 10878011 10340878 9965642 9978843
12805I978843j86719M16291J057309J427968J627384K153495L419607O180489
$$ 9978843 9792124 10208415 11265724 12693692 14321076 16474571 19894178 26074667
12797B6074667J0894820J8140021K5583241K1770489N906280k578919j3172241
$$ 26074667 36969487 55109508 80692749 102463238 108369518 105790599 92618358
12790I2618358k3472265k0846932j3959364r049593o187460l737337k638776k362121
$$ 92618358 69146093 48299161 34339797 25290204 19102744 15365407 12726631 10364510
12782A0364510j691558j146609q56659p40261p77498m27134m45747m86750l31701
$$ 10364510 8672952 7526343 6669684 5929423 5151925 4724791 4279044 3792294 3460593
12773C460593j26888p446Q5669n5632k87028j35864j00101k8479k3580q4718j31755
$$ 3460593 3333705 3326259 3411928 3356296 3069268 2933404 2833303 2804824 2781244 2696526 2564771
12762B564771l23502J32439K35339J22537K63291M89898K32934M44265P07129
$$ 2564771 2241269 2373708 2609047 2731584 2994875 3484773 3717707 4161972 4869101
12753D869101J615281K494220K697424J766126k9324k064671k622259k203894
$$ 4869101 6484382 8978602 11676026 13442152 13412828 11348157 8725898 6522004
12745F522004j585673j406083o74217n39932k60478j28147k75559l65196M1559
$$ 6522004 4936331 3530248 2856031 2316099 2055621 1927474 1651915 1286719 1328278
12736A328278P3596r6112k65478l39716j10432J35893K97879K20952j71862k69994
$$ 1328278 1401874 1305762 1040284 700568 590136 726029 1023908 1244860 1072998 803004
12726H03004l71211R4273O2076L33357J89298j59702k19370l02492k61694r8732
$$ 803004 431793 526066 588142 921499 1110797 951095 731725 429233 167539 68807
12716F8807L70621J00977J87163L81708k37944n20196o9290M22526n5554q8505
$$ 68807 439428 540405 727568 1109276 871332 351136 281846 704372 648818 560313
12706E60313J36317Q5631q7797O5942J39470j80419l8967k91843j06450Q0685
$$ 560313 696630 782261 694464 760406 899876 719457 680490 388647 282197 362882
12696C62882N7718n11389p690J83808N15850J54258j68570O9487n26793k03475
$$ 362882 420600 -90789 -98479 85329 601179 755437 586867 656354 129561 -73914
12686g3914N5499k66309Q2789J22509N111N04195n3801n10046J19087K79052J38095
$$ -73914 -18415 -284724 -201935 -79426 -74315 429880 376079 -133967 -14880 264172 402267
12675D02267J96477J02189k80592p206N8010J33400k74826J47002K02145p1583
$$ 402267 598744 700933 420341 413135 471145 604545 329719 476721 678866 607283
12665F07283M9682o0402m9630r7499j66653j34668m6112O6575j25304j18831J74730
$$ 607283 656965 596563 546933 449434 282781 148113 102001 168576 43272 -75559 99171
12654I9171o9300j03503L22088K94800L9865j90545q8001J11197J85849R2467
$$ 99171 29871 -73632 248456 543256 583121 392576 304575 415772 601621 694088
12644F94088R8892o6930K48124k5136l38194M1055J43599j58489j68150J63170
$$ 694088 792980 726050 974174 949038 610844 651899 795498 637009 468859 632029
12634F32029L79728J71669K2639L14312k23871o18412o1909J30752k51926l97188
$$ 632029 1011757 1183426 1206065 1520377 1296506 678094 616185 746937 495011 97823
12624I7823j77579J86113K6861K63524J71475r1027K1530J21113L05503k15657
$$ 97823 -79756 106357 133218 396742 568217 477190 498720 619833 925336 709679
12614G09679k06345k81991j70344J73993K43251P5539j73996k0719J69964j8416
$$ 709679 503334 221343 50999 224992 468243 543782 369786 349067 519031 500615
12604E00615l5520P6014J6003q1016l63676P3403K53880K65855K5249k0778J99394
$$ 500615 465095 541109 557112 476096 112420 185823 439703 705558 730807 710029 909423
12593I09423k41524o1254L43429M17014R1440k52860Q6800J89387R8643J00864
$$ 909423 667899 606645 950074 1367088 1458528 1205668 1292468 1481855 1580498 1681362
12583A681362j14200j74175J610j33423k54133Q3789k55601l21619j76214J12248
$$ 1681362 1567162 1392987 1394597 1261174 1007041 1090830 835229 513610 337396 449644
12573D49644M5763M8311J66360l68092q5005K90279M08835k48974m58563J20698
$$ 449644 495407 543718 710078 341986 256981 547260 956095 707121 248558 369256
12563C69256O3094J9535k2467j67422k46927k5857R8546L69798L66273p4100j87180
$$ 369256 432350 451885 429418 261996 15069 -10788 87758 457556 823829 749729 562549
12552E62549J25340J06318J82835K65400L5059M46169K67250k09452J03999J63427
$$ 562549 687889 794207 977042 1242442 1277501 1723670 1990920 1781468 1885467 2048894
12542B048894j44604j54289o6452p0592k68093n41884j63267j82599k20863J13298
$$ 2048894 1904290 1750001 1683549 1612957 1344864 802980 639713 457114 236251 349549
12532C49549R4596k35283l39391J85570J81448j14389L7055K93157O630k27724
$$ 349549 444145 208862 -130529 55041 236489 122100 159155 452312 458942 231218
12522B31218j13797k53554L25631K09699L65029J80878k33232j04059J60175o8805
$$ 231218 117421 -136133 189498 399197 764226 945104 711872 607813 767988 699183
12512F99183R9396p9122k76376k42123J9571P1955K81045K96739K44560K09932
$$ 699183 798579 719457 443081 200958 220529 292484 573529 870268 1114828 1324760
12502A324760K73487l92968n24449l21406j94576l5305K38337P9222l48398R7032
$$ 1324760 1598247 1205279 680830 359424 164848 129543 367880 447102 98704 195736
12492A95736M67720J71381k9611k63625L1944J74648j79716k64832k66499K28638
$$ 195736 663456 834837 805226 541601 573545 748193 568477 303645 37146 265784
12482B65784L0810j85827J89734L28293Q9455j57363r2395K17898j5259m6861
$$ 265784 296594 110767 300501 628794 718249 560886 468491 686389 671130 624269
12472F24269R0439J37480K47281j62379k80847M7038k3849m10561o47816O3654
$$ 624269 714708 852188 1099469 937090 656243 703281 679432 268871 -378945 -315291
12462c15291M58040m4917P9102r7484n5831J07340N0787j967M3260R9477j44119
$$ -315291 142749 97832 176934 79450 23619 130959 181746 179779 223039 322516 178397
12451A78397k80228q970K18083r7863j40776K57241M46279M273l5766j29079r8139
$$ 178397 -101831 -110801 107282 9419 -131357 125884 572163 576436 540670 411591 313452
12440C13452R2064l2526j44180K56079J82791K13107L04794j12092k65060l9039
$$ 313452 405516 372990 228810 484889 667680 880787 1185581 1073489 808429 769390
12430G69390j56719l42841j89373k843K49098J07308k38820l6381N0695j95969
$$ 769390 612671 269830 80457 77614 326712 434020 195200 158819 209514 13545
12420A3545K06918L3657j30994l8919K08034L02160J03798J80714n07989k22143
$$ 13545 220463 254120 123126 84207 292241 594401 698199 878913 370924 148781
12410A48781P4581l7497J48819J9236j33993j04371K27741r6595P2444k14354
$$ 148781 223362 185865 334684 353920 219927 115556 343297 246702 319146 104792
12400A04792J95725K49579j30840K98307J31648q8755M05948J44839O8203L84956
$$ 104792 300517 550096 419256 717563 849211 760456 1166404 1311243 1379446 1764402
12390A764402J35940k56974K41084J84776j31518k55985j10872n83925j47680
$$ 1764402 1900342 1643368 1884452 2069228 1937710 1681725 1570853 986928 839248
12381H39248J25750Q4517p7550k07044o179K921j11422k11853L03116L36186j36658
$$ 839248 964998 1049515 971965 764921 758742 761663 650241 438388 741504 1077690 941032
12370I41032j03790J13450k46707j96714K12386J9696k56315J9009N2367j82676
$$ 941032 837242 950692 703985 507271 719657 739353 483038 502047 554414 371738
12360C71738J00499K41628o5205o4399j18095J58812j01216k41396L36116L29493
$$ 371738 472237 713865 648660 584261 466166 624978 523762 282366 618482 947975
12350I47975L81645L10589J11771K88041K7386j76279j59003L5986m97200l08683
$$ 947975 1329620 1640209 1751980 2040021 2067407 1891128 1732125 1768111 1270911 962228
12340I62228o2376j89731k01387K56192J90049o2744k97129J44313K2487J22951
$$ 962228 899852 710121 508734 764926 954975 892231 595102 739415 761902 884853
12330H84853N6172j17497k74983k66907n9446k16845j70852L96006N3215n2145
$$ 884853 941025 823528 548545 281638 222192 5347 -165505 230501 283716 231571
12320B31571j53789r7775o4968J03589k84382j63160J80454J97318n7055O4708
$$ 231571 77782 -19993 -84961 18628 -265754 -428914 -248460 -51142 -108197 -43489
12310d3489K71451m9566l9124J1824J4068j94346j2204R3497N21193N05989O7209
$$ -43489 227962 178396 139272 151096 165164 -29182 -41386 52111 573304 1079293 1146502
12299A146502n5760k29136j73621K3341k3602K10708m007j11898o053j65572k2357
$$ 1146502 1090742 861606 687985 711326 687724 898432 894425 782527 776474 610902 588545
12288E88545J1776L46593M07142J718k45883l01876m4887J70667k48832M1539
$$ 588545 600321 946914 1354056 1355774 1109891 808015 763128 933795 684963 726502
12278G26502M84125j59796J06494q567k90182J40111q5032l20006O9108J51425
$$ 726502 1210627 1050831 1157325 1148758 858576 998687 913655 593649 662757 814182
12268H14182o4049R2047K40224J92328j2402J94941k49963m31473J81431Q3948
$$ 814182 750133 842180 1082404 1274732 1262330 1457271 1207308 775835 957266 1041214
12258A041214k37451K50916K43297q9190l36310J1574j26197p9395J58218L39569
$$ 1041214 803763 1054679 1297976 1208786 872476 884050 757853 678458 836676 1176245
12248A176245p0520q8921j23368K2812l0361j897j25443k28759j13550K7336K38294
$$ 1176245 1105725 1016804 893436 916248 885887 883990 758547 529788 416238 443574 681868
12237F81868K54037L8021l6589k77023R6337J52245m5458k16538N8069J23244
$$ 681868 935905 973926 937337 660314 756651 908896 863438 646900 704969 828213
12227H28213K37243L00343k19764l80137l74862R0155K94471L17347q0695r0002
$$ 828213 1065456 1365799 1146035 765898 391036 481191 775662 1093009 1012314 922312
12217I22312L52187m22374O0875M79816J52887k66150n02905m04613J80277n0339
$$ 922312 1274499 852125 913000 1392816 1545703 1279553 776648 372035 552312 501973
12207E01973n3877L26715j3128R5876J53339j70615J8184M02944L35646J30854
$$ 501973 448096 774811 761683 857559 1010898 840283 858467 1261411 1597057 1727911
12197A727911k25674j04703j2604k51965M0976K11389J06291K9409K14872k26377
$$ 1727911 1502237 1397534 1384930 1132965 1173941 1385330 1491621 1521030 1735902 1509525
12187A509525J0980J6997j62081K03911M4733j78133l40740J55652J54344j4529
$$ 1509525 1520505 1537502 1375421 1579332 1624065 1445932 1105192 1260844 1415188 1400659
12177A400659M3881l7150J95947K18705O9581k58493n43543M7579O6393L23127
$$ 1400659 1444540 1407390 1603337 1822042 1891623 1633130 1089587 1137166 1203559 1526686
12167A526686K69770J12246j3964R1561K52386m99949J8291M38669J58509j28110
$$ 1526686 1796456 1908702 1894738 1986299 2238685 1738736 1757027 2195696 2354205 2226095
12157B226095l12759J19261J96288j48128k38836m0521j64109p8059n7183j67576
$$ 2226095 1913336 2032597 2228885 2080757 1841921 1801400 1637291 1559232 1502049 1334473
12147A334473J2917r4818L5216K90322J25199j47713O3443M34219J45731J59789
$$ 1334473 1347390 1252572 1287788 1578110 1703309 1555596 1619039 2053258 2198989 2358778
12137B358778o4518n54567q1849l09973k45829O7587L48834N9268k1131K87551
$$ 2358778 2294260 1739693 1657844 1347871 1102042 1169629 1518463 1577731 1556600 1844151
12127A844151P4469K25862j58588M0760J10163L02049J38777Q7782n6816j14236
$$ 1844151 1918620 2144482 1985894 2026654 2136817 2438866 2577643 2665425 2608609 2494373
12117B494373l8321j83127l37311p8671J39245J12062L6194j85868J13110K28926
$$ 2494373 2456052 2272925 1935614 1856943 1996188 2108250 2144444 1958576 2071686 2300612
12107B300612J33517L16560k2525m69386K35280J6131k12029N8830q1448K4145
$$ 2300612 2434129 2750689 2728164 2258778 2494058 2510189 2298160 2356990 2275542 2299687
12097B299687k22775J18941K86120l06069m10038O4105O9503K1881K48765M00489
$$ 2299687 2076912 2195853 2481973 2175904 1765866 1829971 1899474 1921355 2170120 2570609
12087B570609N64583Q9716m68455m18272k66006l391L02907J96117O15414m407
$$ 2570609 3135192 3224908 2756453 2338181 2072175 2068784 2371691 2567808 3183222 3178815
12077C178815j77105j28278k84806j4876L73706L54642J20970L54080p5578o1839
$$ 3178815 3001710 2873432 2588626 2573750 2947456 3302098 3423068 3777148 3701570 3639731
12067C639731J91858O4319R5307k27017j70836J90707q4330j019k4209M81602
$$ 3639731 3831589 3895908 3991215 3764198 3593362 3784069 3699739 3698720 3674511 4156113
12057D156113j56429j19967O68P3211M34987M85543o8836l66217k06645l0647
$$ 4156113 3999684 3879717 3880385 3953596 4388583 4874126 4805290 4439073 4232428 4201781
12047D201781r9440R1132L14711K40513K74042P6050j69558J44666J52318L3563
$$ 4201781 4102341 4193473 4508184 4748697 5022739 5098789 4929231 5073897 5226215 5259778
12037E259778M15870J98407j91819p966K70070r6390k18578L8600O2884J24399
$$ 5259778 5675648 5874055 5682236 5674270 5944340 5847950 5629372 5667972 5730856 5855255
12027E855255m1669L7855K23400l4434L42662L6844k8328O4238k20415L79420
$$ 5855255 5813586 5851441 6074841 6040407 6383069 6419913 6391585 6455823 6235408 6614828
12017F614828L77726N05477J63311m37755K344N83242M23404L11352J80175K27334
$$ 6614828 6992554 7498031 7661342 7223587 7225931 7809173 8232577 8543929 8724104 8951438
12007H951438N09726M72753K62848O95807O53470P16571M57340J029651R52018
$$ 8951438 9461164 9933917 10196765 10892572 11546042 12262613 12719953 13749604 14701622
11998A4701622P60269O60385Q80075R03466L62441j61318l44573k21546k95148
$$ 14701622 15461891 16122276 17002351 17905817 18268258 18106940 17762367 17540821 17245673
11989A7245673m83826m04421n10320k90280j06626j95779l06689M3878R7463N54456
$$ 17245673 16761847 16357426 15847106 15556826 15450200 15254421 14947732 14991610 15089073 15643529
11979A5643529K24309j89103K21389M42629L99559N90627N5747k51289M15710
$$ 15643529 15867838 15678735 15900124 16342753 16742312 17332939 17388686 17137397 17553107
11970A7553107R10485Q50653L85305P29807O28685P45234N77003K70067L35974
$$ 17553107 18463592 19314245 19699550 20429357 21058042 21803276 22380279 22650346 22986320
11961B2986320L46265N10757P71410J234518P96589L98974P99436R48735J012767
$$ 22986320 23332585 23843342 24614752 25849270 26645859 27044833 27844269 28793004 29805771
11952B9805771J250296J166162J091935J075202J377084J595398J520785J559804
$$ 29805771 31056067 32222229 33314164 34389366 35766450 37361848 38882633 40442437
11944D0442437J373949J242788J364274J974036J507809J796043K034216K354902
$$ 40442437 41816386 43059174 44423448 46397484 47905293 49701336 51735552 54090454
11936E4090454K118414K243699K162654K820250L241408K709885K378260K698728
$$ 54090454 56208868 58452567 60615221 63435471 66676879 69386764 71765024 74463752
11928G4463752L120119L366310L013461L258716L885416L821127L607241L388908
$$ 74463752 77583871 80950181 83963642 87222358 91107774 94928901 98536142 101925050
$$ [...]
##END NTUPLES=NMR SPECTRUM
##END=
