##TITLE=Analysis number 327165
Compound Code cc 59574
Book Reference 508/62/2
Project Code adrs
Chemist Name antons
##JCAMPDX= 6.0         $$ Bruker NMR JCAMP-DX V2.0
##DATA TYPE= NMR SPECTRUM
##DATA CLASS= NTUPLES
##ORIGIN= Bruker BioSpin GmbH
##OWNER= nmr
$$ XWIN-NMR		Version 3.5
$$ Thu Mar 15 09:15:42 2007 GMT Standard Time (UT+0h)  MAYBRIDGE\nmr@NMR_250MHZ
##.OBSERVE FREQUENCY= 250.131544655141
##.OBSERVE NUCLEUS= ^1H
##.ACQUISITION MODE= SIMULTANEOUS (DQD)
##.ACQUISITION SCHEME= undefined
##.AVERAGES= 16
##.DIGITISER RES= 18
##SPECTROMETER/DATA SYSTEM= dpx250
##.PULSE SEQUENCE= zg30
##.SOLVENT NAME= DMSO
##.SHIFT REFERENCE= (INTERNAL, DMSO, 0, 16.522)
##AUDIT TRAIL= $$ (NUMBER, WHEN, WHO, WHERE, WHAT)
$$ ##TITLE= Audit trail, XWIN-NMR		Version 3.5
$$ ##JCAMPDX= 5.01
$$ ##ORIGIN= Bruker BioSpin GmbH
$$ ##OWNER= nmr
$$ C:\u/data/dgb/nmr/ADRS/920/pdata/1/auditp.txt
$$ ##AUDIT TRAIL=  $$ (NUMBER, WHEN, WHO, WHERE, WHAT)
(   1,<2007-03-15 09:15:20.83 +000>,<MAYBRIDGE\nmr>,<NMR_250MHZ>,
      <created by zg, POWCHK disabled, PULCHK disabled
       configuration hash MD5:
       49 4B E0 1D 92 C2 6B 37 9F E6 65 BC 52 41 86 1D
       data hash MD5: 64K
       EF B9 5C BC 0E 78 34 1F C0 77 E5 C3 50 AB F6 C7>)
(   2,<2007-03-15 09:15:33.72 +000>,<MAYBRIDGE\nmr>,<NMR_250MHZ>,
      <Start of raw data processing
       ef LB = 0.3 FT_mod = 6 PKNL = 1 SI = 32K 
       data hash MD5: 32K
       F2 D6 F1 91 6F DA CE 7A 55 BE 07 06 E1 62 B1 B2>)
(   3,<2007-03-15 09:15:35.49 +000>,<MAYBRIDGE\nmr>,<NMR_250MHZ>,
      <apk 
       data hash MD5: 32K
       5F 9B EE 35 F1 9F 26 BC F6 97 B1 D3 6A 1E B9 3F>)
(   4,<2007-03-15 09:15:36.20 +000>,<MAYBRIDGE\nmr>,<NMR_250MHZ>,
      <abs ABSG = 5 
       data hash MD5: 32K
       91 8B 2C B2 3E D0 47 03 C0 B2 19 17 16 65 CB 15>)
$$ ##END=
$$ 
$$ hash MD5
$$ 1E 23 0C 26 9A 04 DA F5 8A 20 EA 1D BD 6C 9F D5
##$RELAX= 
##$RELAX= 
##$RELAX= 
##$RELAX= 
##$RELAX= 
##$RELAX= 
##$RELAX= 
$$ Bruker specific parameters
$$ --------------------------
##$DU= <C:\u>
##$EXPNO= 920
##$NAME= <ADRS>
##$PROCNO= 1
##$TYPE= <nmr>
##$USER= <dgb>
##$AMP= (0..31)
100 100 100 100 100 100 100 100 100 100 100 100 100 100 100 100 100 100 
100 100 100 100 100 100 100 100 100 100 100 100 100 100 
##$AQSEQ= 0
##$AQ_mod= 3
##$AUNM= <au_zg>
##$AUTOPOS= <5 >
##$BF1= 250.13
##$BF2= 250.13
##$BF3= 250.13
##$BF4= 250.13
##$BF5= 500.13
##$BF6= 500.13
##$BF7= 500.13
##$BF8= 500.13
##$BYTORDA= 1
##$CFDGTYP= 0
##$CFRGTYP= 5
##$CHEMSTR= <none>
##$CNST= (0..31)
1 1 145 1 1 1 1 1 1 1 1 1 1 1 1 1 1 1 1 1 1 1 1 1 1 1 1 1 1 1 1 1 
##$CPDPRG= <>
##$CPDPRG1= <>
##$CPDPRG2= <>
##$CPDPRG3= <>
##$CPDPRG4= <mlev>
##$CPDPRG5= <mlev>
##$CPDPRG6= <mlev>
##$CPDPRG7= <mlev>
##$CPDPRG8= <mlev>
##$CPDPRGB= <>
##$CPDPRGT= <>
##$D= (0..31)
0 1 0 0 0 0 0 0 0 0.06 0 0 0 0 0 0 0.0002 0 0 0 0 0 0 0 0 0 0 0 0 0 0 
0 
##$DATE= 1173950120
##$DBL= (0..7)
120 120 120 120 120 120 120 120 
##$DBP= (0..7)
150 150 150 150 150 150 150 150 
##$DBP07= 0
##$DBPNAM0= <>
##$DBPNAM1= <>
$$ [...]
##$SUBNAM6= <"">
##$SUBNAM7= <"">
##$SUBNAM8= <"">
##$SUBNAM9= <"">
##$SW= 20.6930455092707
##$SWIBOX= (0..15)
0 0 3 0 0 0 0 0 0 0 0 0 0 0 0 0 
##$SW_h= 5175.983436853
##$TD= 65536
##$TD0= 1
##$TE= 683.16
##$TE2= 300
##$TE3= 300
##$TEG= 300
##$TL= (0..7)
0 120 120 120 120 120 120 120 
##$TP= (0..7)
150 150 150 150 150 150 150 150 
##$TP07= 0
##$TPNAME0= <>
##$TPNAME1= <>
##$TPNAME2= <>
##$TPNAME3= <>
##$TPNAME4= <>
##$TPNAME5= <>
##$TPNAME6= <>
##$TPNAME7= <>
##$TPOAL= (0..7)
0.5 0.5 0.5 0.5 0.5 0.5 0.5 0.5 
##$TPOFFS= (0..7)
0 0 0 0 0 0 0 0 
##$TUNHIN= 0
##$TUNHOUT= 0
##$TUNXOUT= 0
##$USERA1= <user>
##$USERA2= <user>
##$USERA3= <user>
##$USERA4= <user>
##$USERA5= <user>
##$V9= 5
##$VALIST= <valist>
##$VCLIST= <CCCCCCCCCCCCCCC>
##$VD= 0
##$VDLIST= <DDDDDDDDDDDDDDD>
##$VPLIST= <PPPPPPPPPPPPPPP>
##$VTLIST= <TTTTTTTTTTTTTTT>
##$WBST= 1024
##$WBSW= 4
##$XGAIN= (0..3)
0 0 0 0 
##$XL= 0
##$YL= 0
##$YMAX_a= 324582
##$YMIN_a= -371522
##$ZGOPTNS= <>
##$ZL1= 120
##$ZL2= 120
##$ZL3= 120
##$ZL4= 120
##$ABSF1= 16.522
##$ABSF2= -4.171173
##$ABSG= 5
##$ABSL= 3
##$ALPHA= 0
##$AQORDER= 0
##$ASSFAC= 0
##$ASSFACI= 0
##$ASSFACX= 0
##$ASSWID= 0
##$AUNMP= <proc_1d>
##$AZFE= 0.1
##$AZFW= 0.1
##$BCFW= 0
##$BC_mod= 0
##$BYTORDP= 0
##$COROFFS= 0
##$CY= 12.5
##$DATMOD= 1
##$DC= 0
##$DFILT= <>
##$DTYPP= 0
##$F1P= 14.0000005364418
##$F2P= -0.99999901652339
##$FCOR= 0.5
##$FTSIZE= 32768
##$FT_mod= 6
##$GAMMA= 0
##$GB= 0
##$INTBC= 1
##$INTSCL= 1
##$ISEN= 128
##$LB= 0.3
##$LEV0= 0
##$LPBIN= 0
##$MAXI= 10000
##$MC2= 0
##$MEAN= 0
##$ME_mod= 0
##$MI= 0
##$NCOEF= 0
##$NC_proc= -4
##$NLEV= 6
##$NOISF1= 0
##$NOISF2= 0
##$NSP= 0
##$NTH_PI= 0
##$NZP= 0
##$OFFSET= 16.522
##$PC= 1
##$PHC0= 219.7531
##$PHC1= 3.48035
##$PH_mod= 1
##$PKNL= yes
##$PPARMOD= 0
##$PSCAL= 4
##$PSIGN= 0
##$REVERSE= no
##$SF= 250.13
##$SI= 32768
##$SIGF1= 0
##$SIGF2= 0
##$SINO= 400
##$SIOLD= 32768
##$SREGLST= <1H.DMSO>
##$SSB= 0
##$STSI= 32768
##$STSR= 0
##$SW_p= 5175.98343685301
##$SYMM= 0
##$S_DEV= 0
##$TDeff= 65536
##$TDoff= 0
##$TI= <Analysis number 999999
Compound Code 99
Book Reference 9
Project Code 9>
##$TILT= no
##$TM1= 0
##$TM2= 0
##$TOPLEV= 0
##$USERP1= <user>
##$USERP2= <user>
##$USERP3= <user>
##$USERP4= <user>
##$USERP5= <user>
##$WDW= 1
##$XDIM= 32768
##$YMAX_p= 304355181
##$YMIN_p= -104027
$$ End of Bruker specific parameters
$$ ---------------------------------
##NTUPLES= NMR SPECTRUM
##VAR_NAME=  FREQUENCY,     SPECTRUM/REAL,   SPECTRUM/IMAG
##SYMBOL=    X,             R,               I
##VAR_TYPE=  INDEPENDENT,   DEPENDENT,       DEPENDENT
##VAR_FORM=  AFFN,          ASDF,            ASDF
##VAR_DIM=   32768,         32768,           32768
##UNITS=     HZ,            ARBITRARY UNITS, ARBITRARY UNITS
##FACTOR=    0.157963299565203, 1,           1
##FIRST=     4132.6476996994, 0,             0
##LAST=      -1043.33573715361, 0,           0
##MIN=       -1043.33573715361, -104027,     0
##MAX=       4132.6476996994, 304355181,     0
$$ Real data points
##PAGE= N=1
##DATA TABLE= (X++(R..R)), XYDATA
$$ [...]
20722 -32346 -58980 -46042 -31348 -18984 -5870 -10165 -23136 -17298 -5862 8769 9797 47641
20710 47641 34174 6519 -31355 -28352 -24321 -43208 -55446 -63068 -64880 -52989 -43378 -23168 -4101
20697 -4101 -14320 -11591 -15176 -8445 -19807 -34327 -42959 -44833 -53579 -55069 -58902 -30086 -23105 -50175
20683 -50175 -57062 -63424 -70235 -60930 -48664 -23019 -10990 -35741 -58580 -46746 -32839 -5951
20671 -5951 2271 -17592 -56740 -59958 -46550 -28003 -6772 -17552 -3446 -4269 -11690 -7435 -15312
20658 -15312 -14213 -20894 -9900 -2544 6443 14276 -11674 -29353 -61391 -61824 -63996 -59665 -27530
20645 -27530 -10759 -37145 -34445 -32664 -24122 -22501 -26101 -25591 -11939 21047 -1334 -52246 -57810
20632 -57810 -49571 -28668 -29153 -35373 -30825 -16983 8517 13494 25821 38097 30705 22022 27329
20619 27329 32402 28571 3496 -17480 -21418 -11648 -2905 -5788 6899 31138 15701 6154 -7939
20606 -7939 5486 -15319 -43267 -68509 -69311 -42463 -39917 -49850 -44498 10658 29974 18356 -1303
20593 -1303 -4759 -31380 -41877 -58164 -37870 -21641 -20310 -19235 -27460 -72215 -67945 -43416 -40195
20580 -40195 -24433 -27864 -5589 7728 14360 14126 201 -7764 10429 9524 22119 1297 -9047
20567 -9047 -18298 -61233 -63617 -60084 -23111 -13638 -32938 -22283 -27153 -41043 -11996 -5927 -6756
20554 -6756 5376 -12953 -15638 196 -1709 -7652 -27405 -60480 -80177 -52832 -28927 -19950 -24594
20541 -24594 -19283 -24091 -59159 -42795 -20051 -23914 -20866 -18822 -35995 -35118 -19700 -21449 -36371
20528 -36371 -28558 -5154 -2924 -24579 -7348 -4276 1110 4817 7018 -37256 -41587 -32501 -5857
20515 -5857 17332 31365 34089 24600 -6540 -6002 10667 -26737 -44420 -28266 -37022 -35076 -24859
20502 -24859 -27308 -36420 -25263 -715 -3879 -39547 -50846 -36270 -18120 10962 -275 -12234
20490 -12234 -15061 -8288 -3017 731 -8993 -39051 -53962 -13977 -4802 -6628 -1080 -8256 -5122 6624
20476 6624 15956 -8042 -50511 -62866 -53060 -41373 -38476 -8396 -22633 -41915 -14629 -6563 -24062
20463 -24062 -59390 -67476 -42637 -61654 -58917 -49554 -24451 -5765 -20546 -24622 -35257 -49496
20451 -49496 -52928 -36998 -27550 -33265 -35312 -35087 -21302 -192 -32597 -69318 -48005 -20514 -15345
20438 -15345 -30761 -38400 -40321 -27619 -34724 -27445 10708 14803 -1512 -16323 -15870 -27207 -12429
20425 -12429 -7974 -9725 -12614 -14782 -3715 -16145 -27906 -32582 -19567 -9781 -4617 -4783 1206 -11621
20411 -11621 4570 -9348 -47451 -63218 -40679 -33232 -31075 -42399 -57262 -48892 -61748 -67570
20399 -67570 -42127 -5017 -18083 -36363 -31263 -14424 -2756 -12751 -23797 -40929 -45770 -15967
20387 -15967 -4114 14596 26871 2670 -24304 -37999 -21637 -25617 -52412 -70737 -45435 -18667
20375 -18667 -24151 -30660 -62294 -79822 -94182 -78011 -61162 -77068 -45854 -41327 -36993 -22893
20363 -22893 -35960 -40935 -34157 -18494 -18250 -35634 -41518 -35632 -21128 -19116 -19846 -43826 -72749
20350 -72749 -59874 -27553 -29370 -29876 -17948 -13910 5912 28408 7895 -5132 -10953 -18158 -32599
20337 -32599 -38760 -18034 3688 3887 -4588 -55306 -42550 -15177 -10159 -19137 -20996 -29090 -51830
20324 -51830 -59479 -48858 -23330 -16515 -2056 1662 -28004 -31837 -53013 -53417 -30173 -18551 -13356
20311 -13356 -3417 2374 25158 7820 -8454 -3374 5383 14530 -1228 -32783 -49246 -49118 -32178
20298 -32178 -12580 -30763 -33484 -55853 -71352 -50854 -31639 -74096 -79971 -83218 -79044 -59643
20286 -59643 -30259 -48308 -57998 -43569 -39315 -4817 -4729 -20399 -4222 12515 45458 37867 13045
20273 13045 9513 -7242 -15797 1547 -15233 -23187 -10445 -2410 7724 7041 9807 7152 -15680
20260 -15680 -22794 -12431 -21413 -18221 -3873 21381 39586 16002 -632 -4497 5500 23587 36077
20247 36077 30452 7565 19641 37818 6796 5925 -11297 -21697 -37304 -50892 -53698 -26014
20235 -26014 -8070 -10452 -8472 33204 20701 6032 -19681 -31352 -14859 3167 20575 13788
20223 13788 4096 3030 -12716 -18443 -30671 -36777 -14160 11642 6118 -40332 -70810 -47522 -21376
20210 -21376 -24004 -14603 7802 16561 742 6211 37516 47182 48065 14370 15208 12044 1349 10750
20196 10750 28607 16159 -18397 -2863 -22690 -15544 -4842 303 7237 11019 -13480 -27388
20184 -27388 -26136 -39878 -39365 -17181 -18394 -56908 -60039 -32639 -8213 -2124 -10651 16283 24293
20171 24293 3562 -22000 -32751 -19216 -1727 19292 7590 -14455 -12478 7264 19239 666
20159 666 11560 20850 -1220 -1329 2798 -35143 -55817 -13898 -8170 -20664 -24747 -40725 -21984
20146 -21984 -15453 -25254 -21101 8998 22590 6447 -13630 -28137 -25397 -31014 -48554 -24227 -20889
20133 -20889 -15582 -6574 -26337 -56881 -52617 -28650 -46000 -32854 -31228 -28173 -5360 -35890 -38055
20120 -38055 -22599 -36333 -28693 -17596 -29537 -43091 -42005 -37132 -37724 -15403 -2397 2737 4220
20107 4220 -1770 6017 -18173 -29985 -14187 -14957 -8789 2249 -6066 1685 -14875 -27590 -37550
20094 -37550 -41258 -47536 -36328 -24588 -30043 -22569 -23944 -36039 -57512 -44885 -31562 -29073 49
20081 49 30976 9558 -23339 -17836 12600 -18973 -55365 -62032 -41446 -42378 -52770 -34486 -30225
20068 -30225 -22218 -16987 -32315 -23009 -22737 -22524 -19080 -18698 -2310 7935 8864 7547 29702 32988
20054 32988 4130 -48555 -43135 -14964 -14687 -63171 -55574 -10078 -6557 -24317 -25265 -17911 -9214
20041 -9214 -16548 -7721 6935 -23303 -43465 -38709 -36405 -43965 -37975 -68937 -77969 -37704 -21518
20028 -21518 -28907 -12576 6855 11175 1686 7795 -7053 -14801 -10089 -4068 59 9641 660 -20889
20014 -20889 -11422 -3000 898 4896 -13077 -25980 -38059 -28231 -32212 -31724 -15117 -17611 -30544
20001 -30544 -10665 2949 17788 10657 -11448 -2174 3185 -16789 -11213 -17760 495 25175 22573
19988 22573 2288 -3100 -16565 -44968 -31644 7957 -3768 -16552 -25821 -19608 -23353 -43470
19976 -43470 -51472 -69889 -75748 -64183 -39448 -56397 -68803 -44372 -30613 -39574 -30396 -19901
19964 -19901 -46051 -29212 -43083 -47278 -33645 -3992 1443 6201 9987 -26012 -53575 -41702
19952 -41702 -34277 -49623 -30945 -33072 -60509 -52617 -44568 -48195 -41863 -61288 -74614 -56933 -27737
19939 -27737 -28125 -15790 -7575 -21222 -9493 -13559 -27437 -39652 -45893 -45991 -35464 -3038 -2038
19926 -2038 4534 2040 15309 22635 26556 22660 -9190 -18693 -2251 23811 20540 14976 46144
19913 46144 60782 20726 3465 -14360 -27077 -31785 -32879 -14719 17093 16892 -15144 -14453 -24201
19900 -24201 -26232 -22516 -16396 -10886 -15685 -21857 -25550 -3899 163 -4026 5254 14998 982 -4935
19886 -4935 496 -22875 -38743 -16697 7057 -6319 -15093 -15041 -12043 -3418 18797 42478 42603 12404
19872 12404 -347 26105 75223 45346 14059 7643 9004 -37373 -44832 -49800 -39251 -31342 -18870
19859 -18870 5003 -19362 -47939 -25488 -38670 -58444 -58779 -46462 -37228 -38392 -45446 -41562 -18673
19846 -18673 -17593 -1892 -11806 -26620 -20931 -39696 -38486 -24342 2532 22572 30808 39005 30844
19833 30844 1146 -4083 -7803 -7306 -32826 -45951 -33881 -34630 -35455 -43564 -54987 -33576 -14796
19820 -14796 -6832 -2326 2409 -20114 -31850 -20941 -25905 -17944 -36283 -39122 -48487 -34150 -15214
19807 -15214 -9817 -5219 -17319 -18130 5596 20408 24384 8159 -22451 -14108 7243 35298 50853
19794 50853 26555 22907 -421 -3390 -8292 -13622 -23316 -10075 -16386 -12850 -9185 -30698 -25026
19781 -25026 -32365 -43450 -20307 2090 -18044 -15733 -17993 -11041 -12899 -48553 -40538 -8778 -2167
19768 -2167 -35528 -38311 -19171 16325 43462 32562 683 -23648 -9138 565 1452 4056 -7895
19755 -7895 -24941 -31536 -34620 -59862 -61068 -40984 -29512 -51848 -57162 -48550 -52797 -52678 -41392
19742 -41392 -17486 -10324 -21076 -25140 -36821 -48006 -28603 -25642 -30382 -17638 -6044 -22270
19730 -22270 -41411 -73569 -82894 -50776 -14558 -18944 -16159 -14400 -20584 -14078 -14144 3128 -3785 -22444
19716 -22444 -15787 896 -14089 -33404 -59816 -68001 -43136 -39300 -37767 -26042 -6074 4195
19704 4195 2352 -4986 -13485 -29137 -63749 -60141 -27252 -9549 -7052 21289 19321 10747 16077
19691 16077 15096 -3178 -26289 -43027 -24435 -30660 -24746 9114 3286 -19746 -7145 -11304 -734
19678 -734 -8651 -26958 -25874 -52217 -67396 -42700 -21503 -25435 -42191 -48826 -20719 -25986 -3539
19665 -3539 10344 37779 31251 33743 5983 -24972 -15510 4612 -2439 -7216 -34025 -38909 -24581
19652 -24581 -10708 -4125 -7036 -10836 -9911 13423 16139 -6583 -24782 -24382 -48937 -30345 3450
19639 3450 -5250 -17473 -6064 -17473 -60384 -65811 -61699 -64798 -41917 -39997 -38477 -50405 -54511
19626 -54511 -40188 -19746 -5605 -6577 -18183 -30031 -18250 -29911 -23992 -34298 -45665 -41136
19614 -41136 -64667 -30103 -11313 -15940 -28181 -23582 -13556 8803 12878 2107 -8822 -13044
19602 -13044 -13849 -24349 -12837 12025 -4381 -42091 -53273 -55748 -65964 -65253 -40858 -19589 -16523
19589 -16523 -473 17241 28921 10532 -12731 -25300 -9899 -5688 8740 -7017 -24857 -26762
19577 -26762 -43149 -61783 -45380 -33238 -9995 -6699 3899 -16226 -31353 -26088 -21795 -18557
19565 -18557 -17730 -19156 -32610 -45463 -49192 -43524 -32550 -14361 6526 22052 33515 20230 16631
19552 16631 25172 -6522 -8250 3880 13683 77 -11730 7072 19460 -2965 -20116 -20813 -18777
19539 -18777 -36013 -48899 -16589 -3161 -5334 -29923 -42159 -23968 -30896 -30613 -13370 -17829 -10507
19526 -10507 7438 -926 -6191 7178 20147 21454 24486 -56 -29650 -57594 -66060 -43036 -26972
19513 -26972 -13442 -4812 -3551 -32865 -41634 -38157 -59261 -47132 -28680 -30795 -46673 -69414 -46534
19500 -46534 -32650 -22319 -21252 -36662 -33176 -25833 -15341 -17834 -22694 -24736 -29849 -25100 -25946 -39924
19486 -39924 -39116 -21232 -33352 -21781 -9454 11011 27820 40302 17949 10642 12337 23726
19474 23726 32812 12563 12209 8997 15889 3105 -9920 -10661 -16129 -32651 -53747 -37567 -42787
19461 -42787 -57326 -65303 -40153 -27419 -34332 -36049 -42012 -56249 -26588 -10684 -17847 -34630 -41111
19448 -41111 -14236 -37887 -64723 -45566 -26252 -15836 -12831 -13119 -40590 -54911 -32972 -25374
19436 -25374 -20335 -33431 -21837 -39262 -43735 -16535 -13797 -1167 -12489 -25440 -21292 -29486 -15350
19423 -15350 -11158 -2431 15728 966 -38879 -50009 -27260 -12317 -26966 -29953 -24071 -33407 -49980
19410 -49980 -57181 -50901 -31088 -33091 -45403 -42048 -43951 -41952 -48953 -23801 3014 6404 12734
19397 12734 22597 13159 8260 -11812 -37822 -25402 -13865 -20566 -58646 -49958 -35794 -32435 -66331
19384 -66331 -68949 -69450 -59025 -46138 -65370 -70547 -49806 -24790 -21683 3701 -15595 -40342 -41162
19371 -41162 -32806 -26419 -14680 -10782 -8728 5308 4396 5747 -18010 7978 6129 -5356 -10554
19358 -10554 2413 -12696 -30104 -14649 -24626 -30366 -21701 -25039 -38979 -42083 -26893 -21187 -42060
19345 -42060 -47116 -68288 -47564 -24369 -10350 -17279 -16645 -3069 13743 26695 15126 1025
19333 1025 13534 18609 24208 24060 -11010 -25715 26269 50846 18339 -27527 -38221 -17457 121
19320 121 -18442 -9235 13981 40108 38289 22351 11582 31463 40793 10821 -31632 -54491 -54238
19307 -54238 -70643 -47496 -8499 -14530 -2364 -2777 -34821 -28420 13524 31041 14557 -7209
19295 -7209 -21585 -26875 -37266 -53508 -41345 -7070 24792 49800 31804 6508 3924 3032 27711
19282 27711 26088 5868 -9355 -9857 6482 -18333 -3209 14466 7836 -10613 -36168 -28304 1807
19269 1807 31075 31201 28188 21058 -5650 20130 23963 -8850 7854 43002 39002 7596 16408
19256 16408 17887 12148 2778 4262 1366 -18183 13646 26881 12715 11781 16524 -5248 -21800
19243 -21800 -24142 -31359 -11937 1545 -36446 -19632 7241 28970 23008 11678 7355 5486 11062
19230 11062 15738 -3483 5101 -2299 -10403 -1186 11099 -7333 -18813 -19262 -26385 -10942 -285
19217 -285 3094 -7961 -16599 -29088 -39363 -18612 -20093 -41483 -45865 -28690 -37587 -30972 -4978
19204 -4978 16044 17888 18468 24257 22892 15034 37599 30087 19423 1922 -3225 -37677 -41469 -13914
19190 -13914 -17652 -2309 -14631 -35923 -41376 -32582 -1807 -16270 -18350 3230 16022 12114 31436
19177 31436 18497 6375 4801 -2493 10262 21343 -25013 -55811 -25616 -2229 -7489 12832
19165 12832 18899 1163 -5401 -22410 -28033 3694 24453 56114 65416 88071 91777 114141 113969
19152 113969 107949 82098 91608 83469 54917 52170 46270 44386 53181 56199 41764 30581 28898
19139 28898 57603 76099 79415 76265 63865 97369 91315 72788 60940 47707 20068 13729
19127 13729 11315 8444 3025 23485 47071 69925 50585 14260 25903 31616 24812 46084 73847
19114 73847 59147 33912 15499 5050 16864 13384 28400 56448 55369 54853 67726 104103
19102 104103 148362 148932 155060 137460 113773 83883 77198 53866 36348 46733 38047 44393 57002
19089 57002 46770 58619 66847 75274 60399 58838 86124 118394 124314 90640 83528 58538 29498
19076 29498 15630 4980 13282 28581 21243 17319 17195 17341 6828 -16043 14215 30903 40541
19063 40541 48631 51334 29314 -1290 4936 34591 31617 39800 33409 13790 -2633 -11552 -22723
19050 -22723 -1492 26598 26448 19274 16094 29159 26486 37347 58473 56080 70319 81499 46672
19037 46672 -7390 -11951 5906 3344 -12091 -13346 -7391 -8078 -4504 -24200 -1242 -732 1999 27701
19023 27701 17023 17770 9114 -3409 -7670 -19259 11148 2722 -15500 10564 14816 16649 31484
19010 31484 22508 -6030 -26612 -17759 5716 18702 24856 13269 31329 37607 54754 55134 55512
18997 55512 21578 -7532 14897 16022 7112 -13347 978 37047 71167 76757 77551 62360 51893
18984 51893 53673 60755 51711 47412 28292 47843 46779 24648 16658 5247 -9701 -19259 -20008
18971 -20008 -25996 -23038 15578 31003 49548 58798 46632 36061 45824 48164 50424 46273 41585
18958 41585 34186 29425 -1311 10957 41159 52366 56171 51543 69113 96573 91974 45411 32115
18945 32115 45677 55581 26652 10791 -2219 16534 27281 39210 44836 38747 47138 50627 39006
18932 39006 50696 73642 65445 22598 -3709 -14666 -15430 -23293 -42955 -40290 -30559 -6419 19984
18919 19984 57061 75104 49944 47174 55021 54456 30535 26940 34872 6651 -2168 15326 35935
18906 35935 27264 41509 34354 17431 23728 28429 9418 17307 1365 659 -12732 -21839 -7840
18893 -7840 23621 31190 46690 46198 51206 39396 24041 9731 5701 34739 39316 44861 66351
18880 66351 79973 102912 109058 84986 70600 77766 76354 66340 46335 26219 37768 28349
18868 28349 20524 5748 -209 27460 44599 30503 18704 8006 -14797 -12049 15898 26384
18856 26384 43727 57454 38613 33024 68446 51420 31442 36330 48028 53131 23304 20618
18844 20618 16429 19682 46486 55464 79693 96738 100129 102042 95916 86425 83118 99325 122480
18831 122480 167925 184596 193785 193599 222457 199223 178832 182907 189499 194587 207140 215745 227297
18818 227297 241002 254388 253344 242101 255553 248480 211381 186822 178429 185655 181480 197544
18806 197544 197374 195346 179381 165270 137474 101030 82585 79465 68602 73633 58246 28703
18794 28703 26746 23103 27567 44912 70306 73583 50180 53891 50894 58797 119482 162200 185508
18781 185508 170461 163789 173663 183272 185532 215711 237881 217403 220218 227998 209293 208140 200229
18768 200229 212018 212453 217471 209798 223283 211568 203727 222166 227113 217256 199133 190671 205931
18755 205931 225047 208680 169550 138658 130213 113526 113436 95230 71423 74870 87819 104251
18743 104251 85278 77118 75736 69364 40062 23578 36554 43230 42533 62156 44786 25317 16450
18730 16450 16052 5967 10434 14693 36816 51435 33705 38566 27067 29760 22604 39421 15505
18717 15505 5396 50182 75109 55921 30880 20790 47760 57606 53810 77159 79953 85225
18705 85225 64184 68302 79027 71076 91929 123920 111498 83885 49879 42624 3705 -28606
18693 -28606 -14495 -6915 11199 42321 46969 66951 45231 19088 12808 9242 34323 69733
18681 69733 73530 85271 115250 116604 87490 72156 61559 58487 66130 59579 56343 28744 26085
18668 26085 36088 53147 23883 -11296 -10082 -6626 -4011 30579 43941 32684 16634 -236
18656 -236 -7616 -2342 27292 63547 86454 80666 69886 91186 98195 88045 96829 115839 136970
18643 136970 142773 132669 123569 131239 119456 118565 103211 87572 79470 93894 85551 70161 86355
18630 86355 116559 112751 122506 139467 143677 130429 109403 138789 143881 153471 164271 150064 136041
18617 136041 155225 171578 185278 162482 176762 169313 154454 154254 140199 136168 144447 168040
18605 168040 178880 196566 218042 223481 216313 242870 289484 320724 354644 361228 339072 344333
18593 344333 355315 389320 424157 499191 550256 646893 752020 820672 864269 880799 895737
18582 895737 913109 994457 1132216 1337245 1673849 2121410 2603981 3019547 3213592 3122668
18572 3122668 2817016 2438007 2072469 1787751 1655306 1646812 1745682 1989195 2368995 2883554
18562 2883554 3406180 3785341 3893249 3710268 3306223 2858043 2511954 2285124 2154857
18553 2154857 2155368 2180646 2208590 2210261 2176062 2106326 2032250 1884679 1720040 1608404 1526124
18542 1526124 1435762 1364011 1308977 1232807 1195101 1176830 1180368 1166109 1162703 1125761 1094942 1037375
18530 1037375 975428 919434 838511 788750 757732 737895 734243 729217 740499 713033 694386 689155
18518 689155 680623 690031 713430 742217 750958 772092 809623 823141 872695 942378 1005253 1044386
18506 1044386 1080122 1148698 1199834 1287286 1375869 1470181 1575363 1689744 1824836 1968443
18496 1968443 2081904 2128467 2119739 2041017 1906538 1742368 1556348 1348634 1161434 1009392
18486 1009392 882919 799687 738883 697539 652612 612648 595066 574201 566612 579239 537867
18475 537867 517250 492852 475816 433846 427584 423289 419998 391636 370585 350524 345901 348021
18463 348021 329944 314999 297705 288220 277076 260727 258257 287449 300229 312618 305942 276931
18451 276931 255148 258182 249202 240209 251426 265195 258554 240522 280649 349978 378367 394187
18439 394187 375264 383374 390381 373946 359651 336227 298816 271063 286727 302880 303294 289419
18427 289419 258554 229961 228144 260375 270111 269050 273192 283397 277837 257401 258716 271812 262327
18414 262327 269227 263865 271601 264202 237131 247145 256743 297499 317991 313480 325555 351437 353515
18401 353515 331037 326896 305113 298279 332021 354581 327867 315265 330613 347780 360111 383558
18389 383558 386858 393682 434158 470490 471327 463359 464505 502769 544596 573482 628639 650064 692808
18376 692808 716001 744102 785823 813484 829659 821549 897716 1013257 1154518 1349646 1594848
18365 1594848 1886770 2248671 2630420 2961152 3283463 3552299 3737179 3804921 3809962 3752000
18355 3752000 3676086 3611796 3627589 3716869 3855849 4059776 4267899 4438906 4669976 5024441
18345 5024441 5504717 6159767 6965993 7829863 8517995 8887784 8906091 8637820 8264650 7919537
18335 7919537 7697951 7707726 7996144 8653893 9750391 11460235 14079956 18060462 23945230
18326 23945230 32303943 43175541 55826979 68445648 77759647 81576555 79856121 73559025
18318 73559025 64710363 55289201 46572159 39317911 34044685 30852134 29458755 29431528
18310 29431528 30234152 31083265 31143421 30016595 27754637 24768074 21641109 18787514 16336123
18301 16336123 14321730 12703286 11502121 10673369 10173896 9887617 9670609 9467327 9225479
18292 9225479 8955352 8754666 8691446 8872451 9328118 10184402 11539753 13454680 15952260
18283 15952260 19047528 22453500 25699380 28090362 29225850 29248906 28629183 28140848 28507982
18274 28507982 30354346 34082389 40173581 48898320 59799484 71801693 83682856 93295611
18266 93295611 97341705 94148072 84721136 71128453 56707283 43976711 33844122
18259 33844122 26375848 21099226 17453398 14934854 13216431 12126518 11540786 11361503
18251 11361503 11481014 11811541 12236616 12463975 12241360 11492631 10344767 8992259 7670025
18242 7670025 6546999 5688752 5051630 4575772 4186650 3877326 3643801 3400404 3146895
18233 3146895 2896897 2662491 2471235 2279599 2097290 1971391 1878744 1786447 1714924 1686421
18223 1686421 1671566 1635079 1608377 1552187 1477784 1445537 1412433 1348143 1279441 1186124 1113246
18212 1113246 1045075 1004490 957850 904100 845534 816511 792499 746933 730885 723902 738649
18201 738649 720371 684012 654327 628957 601784 576874 587593 598835 613491 600864 578170
18190 578170 567328 587683 584099 561575 542119 517129 502247 485626 460868 431175 441496 459072
18178 459072 461914 462385 464712 467323 473652 465744 494924 502913 515720 493625 440622 399675 423987
18165 423987 450403 489167 530692 578541 594928 630444 717296 799046 844021 854301 847119 835982
18153 835982 808010 759097 725557 687561 673665 684994 647355 643998 681804 741371 805192 877641
18141 877641 936611 961516 955752 961691 978091 973264 938134 930269 949639 952700 942467 924478
18129 924478 921569 931642 934885 928024 919964 889079 844595 836527 805463 774400 762271 743243
18117 743243 727468 719425 724964 701730 661190 612776 620567 662133 678262 683609 721661 767971
18105 767971 791454 822948 829637 879301 884422 871107 853817 835778 819153 787358 783048 779789
18093 779789 791764 822130 855469 871450 895635 901817 885685 886607 858822 845620 819323 771926
18081 771926 739179 709472 643297 562723 476457 438677 408869 382331 380927 394039 377761 369973
18069 369973 326514 295177 353014 397683 410873 405177 400867 414267 463901 476993 505444 529589
18057 529589 582253 643680 688851 780621 872291 952993 1032478 1067023 1081711 1069365 1006454
18046 1006454 945300 873904 818195 752771 684857 664929 653908 629677 629609 630100 613187 604955
18034 604955 587030 552364 531367 507564 449239 414478 391460 365440 319481 308265 303636 306637
18022 306637 323344 347628 371778 396275 420828 428242 461623 527589 610925 765861 930298
18011 930298 1139287 1425101 1780019 2198495 2613848 2915705 2995814 2848682 2510330 2128351
18001 2128351 1784796 1466397 1241306 1032564 880823 797916 727343 654004 614309 570972
17991 570972 522901 495094 484854 447127 409778 390778 372037 374382 392586 387203 388876 404464
17979 404464 405658 428281 438754 418661 416719 378201 355629 379155 380543 360233 366467 387783
17967 387783 422471 467978 484351 530278 547448 585056 608097 701899 807707 937284 1089186
17956 1089186 1285557 1567143 1918514 2213870 2380978 2442536 2333166 2150674 1899434 1646181
17946 1646181 1454216 1357470 1275803 1185305 1115653 1053130 1010066 963673 933995 917822 876537
17935 876537 841395 791847 768222 765520 762579 758980 774686 735943 688937 660727 643220 642531
17923 642531 625345 600760 564773 553436 539935 531620 561415 573481 546493 525348 526658 534833
17911 534833 536305 531253 528887 549123 584608 631911 646718 670366 718151 753704 809148 868731
17899 868731 963208 1034988 1115352 1175552 1205449 1253871 1290208 1298439 1328109 1378413 1418781 1421773
17887 1421773 1405768 1401441 1365238 1324502 1251829 1236967 1229774 1188839 1101456 979742 902872
17876 902872 848057 807343 841140 862386 828437 828962 869790 895747 881265 898710 883131 853045
17864 853045 864825 860740 871372 926090 969382 1034155 1107306 1164864 1225380 1288644 1389931
17853 1389931 1528154 1710661 1905109 2122768 2327900 2474663 2541307 2536015 2446304 2309902
17843 2309902 2140917 1942318 1794828 1705147 1613395 1522583 1461667 1422035 1389745 1307746 1247977
17832 1247977 1171086 1139830 1098292 1060854 1039158 1063334 1097615 1147544 1226376 1298638 1322491
17821 1322491 1279102 1178100 1097369 1033824 991236 949040 941177 983550 1007895 1028173 1062342
17810 1062342 1075842 1102682 1128836 1158588 1188768 1229868 1284566 1320262 1340464 1380961 1429496
17799 1429496 1501790 1609046 1712352 1802038 1936806 2081168 2178499 2188247 2115454 1990207
17789 1990207 1810054 1604606 1431944 1294249 1196597 1095953 1029634 1019643 1005700 971061
17779 971061 941807 938434 920667 919721 934892 947837 919429 947915 995407 998112 961960 935741
17767 935741 880768 811732 754990 713982 697889 699559 677533 666474 690161 712373 742738 761525
17755 761525 764693 746387 737773 704158 661759 616729 560514 522633 501693 495993 485692 449015
17743 449015 427523 405893 382783 376277 397738 400238 380685 389796 399795 397390 371990 361462
17731 361462 378707 416295 399328 396653 426197 467105 489354 527673 512975 481769 496271 503119
17719 503119 492899 498147 473495 476418 459787 434713 425669 450285 440655 412045 412800 452999 464784
17706 464784 475000 454571 483380 515937 543896 574799 612055 654771 679461 660951 654638 670666
17694 670666 715071 758108 801715 866277 926280 954558 1019622 1078472 1126752 1164999 1219605
17683 1219605 1284711 1359833 1464922 1590843 1724804 1906768 2137341 2415853 2743265 3131332
17673 3131332 3664327 4341403 5102116 5906918 6651169 7377840 8226446 9226438 10373486
17664 10373486 11412410 12014395 12000956 11486429 10761784 10132773 9777675 9780180 10182536 11017954
17654 11017954 12327375 14240664 17061841 21159037 27221381 36140923 48672159 64572904
17646 64572904 81412147 94588481 100174301 97335498 87884860 75232725 62517134
17639 62517134 51433082 42635675 36326956 32359074 30415194 30124475 30907015 31905708
17631 31905708 32208069 31135379 28610834 25098879 21313103 17934334 15242703 13200169
17623 13200169 11748837 10754709 10057895 9568878 9260092 9103311 9072370 9161550 9318648
17614 9318648 9447335 9539248 9620119 9776136 10114005 10895648 12185900 14116509 16740567
17605 16740567 19997691 23446621 26235155 27741134 27855702 27045941 26092598 25850283 26910496
17596 26910496 29690969 34478926 41431807 50481913 61189600 72638111 82446435 87166252
17588 87166252 84501649 75183380 61931680 48327231 36933026 28440785 22500196 18365736
17580 18365736 15454507 13398000 11871005 10709586 9901617 9455191 9342609 9527437 9934767
17571 9934767 10321799 10363222 9944493 9112217 8071938 7043973 6165086 5493360 4910551
17562 4910551 4381844 3918771 3518044 3209657 2948752 2727327 2549546 2399970 2278510
17553 2278510 2173306 2056193 1970720 1911248 1856155 1812307 1779375 1736768 1696287 1658849 1589437
17542 1589437 1498554 1418772 1341668 1280803 1258150 1209724 1176080 1165592 1181455 1208314 1235309
17531 1235309 1281857 1336213 1414041 1485789 1554674 1583871 1536174 1478265 1405152 1306527 1222881
17520 1222881 1153892 1095083 1050829 992863 979310 976192 982817 1001170 992514 989402 1006703 1001274
17508 1001274 989908 940915 883777 817609 741934 676335 624126 592423 596084 557019 500417
17497 500417 478811 507575 544293 577352 584052 581441 589455 572250 564100 582602 570096 552902
17485 552902 534667 547602 560149 556951 543134 543546 549656 556807 571778 599516 650022 677948
17473 677948 727975 774883 813783 820675 770099 692375 595634 518644 489971 457811 422810 384774
17461 384774 350097 325427 344194 389306 389069 346119 339262 350258 321891 312091 290173 281694
17449 281694 263110 216324 195004 197263 203785 208292 215698 201761 197157 209589 227325 219161 210010
17436 210010 206194 204646 227231 202165 192252 205031 203752 196411 204750 172855 162797 137006 132828
17423 132828 128493 91641 89208 90073 95991 107456 105841 105938 106144 104271 121193 118602 89252 109464
17409 109464 120276 109584 124254 124771 98624 73331 46663 59521 107873 124482 90183 79914
17397 79914 92883 79949 70692 84409 119761 112430 70092 62543 79490 84615 85644 99793 70463
17384 70463 45937 70818 85520 71283 49966 60342 67918 72488 66900 51925 62251 80527
17372 80527 76453 68790 75529 97900 123285 132025 103653 95793 111298 110132 112118 129689 124552
17359 124552 92344 96643 97752 88498 88893 110640 101121 85393 95728 104654 56482 25207 35246
17346 35246 38153 32504 41424 73514 72801 51419 45793 68853 102874 131390 125018 102834 93116
17333 93116 80044 73867 53166 73775 50842 16211 34226 85860 115734 125269 85177 57539
17321 57539 55127 54999 52719 67462 89793 95539 33442 9795 6179 20061 55271 30909 17190
17308 17190 9271 4630 2431 32793 28579 28332 36417 32028 32972 21590 14200 205 -10143 10930
17294 10930 29514 12944 19505 14492 1603 -3825 -8026 -21514 -13122 8325 29710 33451 44065
17281 44065 52122 50182 26215 24435 57030 38830 25146 46715 43194 29187 -16388 -27353
17269 -27353 6092 32975 36779 12997 11879 36390 57411 67057 57049 39128 37792 61728
17257 61728 58499 49217 45222 49069 63305 52491 23859 17975 23355 38037 42340 39279 18927
17244 18927 32895 52405 51440 51606 46351 62258 53986 42600 58479 52968 54852 60450 32892
17231 32892 31270 37453 36086 28479 18067 23430 38664 7293 -20529 -10389 21535 45045 38172
17218 38172 27616 21267 6131 3723 -3154 5451 35294 50374 58978 40793 47348 50351 33372
17205 33372 7131 10060 31996 14379 2834 -17216 -15750 -11084 -19621 -23380 -14032 -32334 -51530
17192 -51530 -13310 27073 39722 34672 20077 5376 -17422 -7216 3493 12898 4684 331
17180 331 17761 22245 13799 4034 -10097 -3212 -16894 -10738 5108 13584 34742 51886 54291
17167 54291 62427 38619 13233 -17709 -50730 -25434 17365 53169 64625 74797 51733 53952
17155 53952 58126 51864 50865 66132 65571 89198 120058 155841 161207 157119 170371 195853 236136
17142 236136 261911 255190 229223 242798 242781 227428 236871 226718 226370 225062 226701 205510 203137
17129 203137 230889 218409 248932 262644 258087 268007 231086 199220 178938 178182 153326 145290
17117 145290 136489 137177 134088 125655 109028 120420 126359 99575 107681 96758 97868 89401 96220
17104 96220 91286 78783 88591 86830 81974 88582 125891 162344 189514 168345 165033 198231 235671
17091 235671 237693 227284 234081 268240 298480 296881 263742 221148 196676 181325 133531 111866
17079 111866 89046 77353 95052 102689 99228 102448 132618 178701 209115 218668 244253 240937
17067 240937 206455 181560 157544 140094 129872 109187 95072 52114 28731 27517 19754 29730
17055 29730 45870 10540 608 1456 15499 25791 5589 3774 27042 37767 30084 21366 -556
17042 -556 -17404 -9458 -8427 -3806 9318 22731 27983 12848 -25806 -37022 -25482 -2584 -19013
17029 -19013 -7443 -10593 -14290 1669 14989 26822 36336 42653 55706 55363 29520 192 -43084
17016 -43084 -37855 -29121 -8093 11049 17308 -17780 -43426 -40421 -19928 -3023 33445 34742 44072
17003 44072 42861 52736 33737 7911 -2247 -426 41383 41663 38158 35149 26358 28096 39230
16990 39230 16132 13235 17846 -14803 -22984 16459 41483 15623 14921 18653 10748 -13530 8244
16977 8244 26390 10663 23052 22958 41710 45055 26456 15250 -2502 -35859 -34926 -12835 10560
16964 10560 9479 11786 16463 -10625 -27405 -17621 -15366 1317 -182 -9361 -3745 -859 -2205 -24552
16950 -24552 -28181 -24343 -8723 11588 26462 29094 34268 21228 21748 11790 26229 29799 9821
16937 9821 -13675 -27684 6441 31987 11160 -5025 4669 -23322 -21340 -16818 -26365 -13266 -1671
16924 -1671 -89 19900 -9011 -35705 -40756 -21796 -21668 -12586 -28739 -10405 -7489 -34840 -40303
16911 -40303 -38323 -11106 10307 -205 16111 5020 -6005 14630 29864 7550 11949 9164
16899 9164 -5195 -13040 -2662 6364 -17949 -45031 -55442 -8375 15245 9870 8485 -2098 -26033
16886 -26033 -45202 -52899 -11339 14368 1887 -3020 13749 4657 -19868 -14435 -26879 -47756
16874 -47756 -10740 5316 852 -668 -33326 -65402 -56007 -46770 -29824 -14402 -7042 -22597 -10592
16861 -10592 -5153 8565 28917 24905 -471 9372 2509 -7003 -3101 869 -15069 -16010 -11453 -16287
16847 -16287 -27053 -21328 -19221 -30400 -38615 -21878 -1978 -12256 -21687 -37329 -38435 -43358 -46898
16834 -46898 -6428 -12483 -12370 5481 -1770 -13935 -18845 -3080 7125 27185 17950 23488 30324
16821 30324 25483 21090 5141 -14202 -11225 -8617 -28854 -18949 -1388 10206 24424 -5886 -11126
16808 -11126 -10305 -5236 17202 26272 10570 -676 -6041 -2431 -3247 2391 8581 18739 9709 -23923
16794 -23923 -24687 -3059 30102 41919 15509 410 -11489 -26459 -34978 -36143 -24753 -34963
16782 -34963 -57200 -29196 2816 -5965 -30961 -62443 -68864 -47813 -41581 -23679 -2499 7283
16770 7283 -9317 -16024 -28322 -42112 -52608 -54089 -30082 -39736 -46498 -38674 -62763 -84502 -74992
16757 -74992 -23249 17671 12755 7268 -2972 -1747 -11379 -19143 -11794 12835 -4868 -17914 -4704
16744 -4704 17108 19201 22886 -4206 -4804 -9592 -18683 -15800 2058 10009 19042 19064 18450 -5828 -24699
16729 -24699 3296 -3789 -35998 -34364 -36919 -52708 -52080 -41951 -32252 -49610 -45813 -27272 -30342
16716 -30342 -34236 -31020 -57210 -42430 -2981 -10122 -26863 -33547 -848 18576 -2748 -12280 -3696
16703 -3696 2315 -11396 -22833 -42181 -20722 4753 5233 -5407 14693 12391 -17262 3127 11829
16690 11829 894 -27810 -33404 -34084 -20021 -21772 -39412 -20455 26877 2076 -12713 -23857
16678 -23857 -24558 -35322 -53855 -39299 -23055 -15987 -27593 -46919 -55765 -55531 -58799 -36950 -19093
16665 -19093 7065 28141 46835 25051 -1013 -21077 10038 29471 26918 21495 -1308 7608
16653 7608 28096 33642 40348 26744 13204 -2004 -2266 -17437 -23396 -14533 -19889 -44024 -55161
16640 -55161 -35505 -19727 -1178 -7554 16203 -6268 -6646 12682 -2853 -27350 -29074 -24562 -23790
16627 -23790 -33015 -30531 -16400 -29160 -42773 -30756 -5754 -7026 -18946 -16508 -17187 -38987 -32172
16614 -32172 -14740 -18412 -24562 -48111 -21544 -28699 -60434 -70470 -59104 -63717 -29475 -4331
16602 -4331 11897 8004 -3127 -11088 6294 -4281 22752 49373 50775 38415 11015 -1772
16590 -1772 -1928 11832 11412 5314 15370 7662 -15561 -33204 -30953 -23858 -38552 -44104 -40663 -6953
16576 -6953 -1885 9189 10518 2560 -3345 -4262 -38269 -26808 -44091 -34213 -38556 -13663 -16548 -20577
16562 -20577 -12656 -12321 4499 17376 1876 -25948 -20463 -27413 -41005 -15446 -10460 -8321 -10926
16549 -10926 -9877 -10755 -12580 -23496 -11911 -13400 -9037 -17730 10856 -1594 -26690 -29824 -22765
16536 -22765 -3364 -597 5856 15108 12603 -2254 -8532 -23253 -32749 -21685 -14128 -40595 -54478
16523 -54478 -59390 -38738 -30562 -10005 21000 50960 51782 38219 32263 12259 10731 14480 31379
16510 31379 10229 -10282 4773 5053 2541 -4602 -7848 -34460 -47907 -20493 -7641 -47365 -82819
16497 -82819 -67854 -43561 -29667 -23286 -31975 -37670 -10879 20933 10141 -10205 -29198 -50484
16485 -50484 -46357 -12360 -22229 -22129 -21302 -8939 -6237 -8156 15747 -1010 -10696 8711 6318 -8090
16471 -8090 -9402 -11064 -29817 -6327 4748 -21236 -22486 -19490 -29126 -24758 -21889 -42302 -32063
16458 -32063 -26684 -20111 -11550 -5232 -20495 -17318 -30634 -33898 -19372 -12547 -14202 -33167 -41163
16445 -41163 -24362 -19022 -15588 -1049 4387 1597 4944 -4661 5148 -633 -12291 -7737 1212 15672
16431 15672 20461 22680 -5637 -39223 -31766 -15397 26161 28504 33355 56665 39928 -23308 -73052
16418 -73052 -76256 -41836 -7672 4092 10079 31911 25626 14239 23230 23233 28120 237 -24093
16405 -24093 -36973 -26746 -22076 -65789 -102571 -81576 -56917 -24598 -7190 -6952 3370 -18283
16393 -18283 -43721 -20326 8071 10600 5640 32120 45146 27593 17491 37134 42622 23047
16381 23047 4529 -4095 -19235 -4096 6342 32197 21546 -428 -26334 -21436 -2040 8365
16369 8365 -21095 -41177 -50184 -51452 -36881 -43852 -30999 -38762 -56302 -40685 -21493 -2432 9117
16356 9117 7067 1998 -23075 -31093 3050 25666 26571 3670 -12500 -24943 -19549 -18090 -26197
16343 -26197 -10504 11795 6019 6079 25245 6154 -4226 10607 11937 8861 5658 -9895 -16232
16330 -16232 -13939 -7140 -1306 3695 3218 9238 11130 -4711 -12076 -37720 -18514 -3929 -19103
16317 -19103 -37060 -23421 27 11901 -8395 -12646 -7377 -23046 -45200 -64533 -58328 -42598
16305 -42598 -34094 -28591 -24821 -45682 -33022 -4853 27607 31292 14145 -5651 -13649 13192 8613
16292 8613 -19733 -24978 -13040 -21121 -26701 -211 18520 -1852 -23566 -33356 -25598 -42797 -36878
16279 -36878 -1312 -1068 -4525 11274 -10830 -19499 -11007 -21227 -20738 -26527 -22068 -12549 -2537 -14799
16265 -14799 -9279 -2686 15130 14506 -753 -7477 -172 9375 21435 24925 7275 -37355 -59309
16252 -59309 -29302 10895 -5957 -12750 9403 11127 -3866 -23618 -55099 -40960 -1902 1810
16240 1810 -4224 -19307 -32780 -55156 -46067 -31934 -7520 -2011 750 -25765 -17467 -23423 -28469
16227 -28469 12397 19461 14341 26822 2158 3645 42297 87075 95172 73637 40081 12796
16215 12796 29566 33160 26332 17458 33757 25632 14309 4428 71 -6121 -5743 24840 22545 17231
16201 17231 16239 17479 3733 -11224 -21879 -38276 -45512 -9841 28985 20649 18849 -18525 -7108
16188 -7108 13937 12951 4275 2214 602 3114 -4630 1238 -5724 -13280 -42735 -38341 -13403 9368
16174 9368 -6661 -38245 -33135 -44803 -53248 -25706 17795 20548 2662 19707 57060 52146 25832
16161 25832 -11093 -15771 15443 14356 15726 -3426 -8276 -12661 -12752 -33491 -30689 -6368 4848
16148 4848 4212 1404 5671 -1952 -5368 -24964 -41610 -38567 -6866 11632 23743 35482 43097
16135 43097 44376 20852 -6825 -8279 -14777 -18042 -24162 27912 22526 17180 28635 18206 13876
16122 13876 2587 -4705 27056 61480 48516 13173 -15450 -7728 -16319 -14411 -32526 -40335 -31710
16109 -31710 -52110 -64584 -55145 -40743 -16758 19802 -6086 -41484 -23151 -20980 -47130 -80341
16097 -80341 -62771 -37988 -52235 -47328 -45460 -21552 -13123 -18132 -58709 -39296 -16201 -30717
16085 -30717 -14093 19822 17081 18888 5358 -5582 -12148 -5890 17445 -8774 -10578 2263 16017
16072 16017 4115 -14113 -15567 -30611 -52223 -38443 -4005 14057 37146 44240 46778 47480 45668
16059 45668 17155 3998 115 -12403 965 19363 38484 28103 36547 28118 13661 -2432
16047 -2432 919 7845 -4391 -47356 -48352 -18877 -24143 -10998 -1337 -12478 5559 6495 4461 15693
16033 15693 -5416 -27788 -4189 -15151 -1193 2031 8136 -5869 -2293 3200 -4289 -10909 -37389
16020 -37389 -35646 -37431 -16510 11664 14564 -11689 -12989 -92 -5524 3681 45619 50870 25716
16007 25716 22535 14771 21412 5336 683 12773 -7573 -9097 24577 19157 1716 18851 17628
15994 17628 18299 22111 4335 -11338 -15975 -6844 -9974 -14817 -67 52 -9601 -17908 -7466 27154
15980 27154 29557 14149 1358 4110 -8170 -7897 8791 5922 16197 21172 -3175 -303 -10832
15967 -10832 -13998 7582 -6691 -14030 19476 24285 26429 22894 19981 33926 -1234 -40986 -27790
15954 -27790 -23736 -20028 -2892 12696 41039 46756 43001 44911 18231 -8385 -18047 11011 6239
15941 6239 -7083 -7186 27706 18228 13912 22448 47763 47986 60753 43105 28007 24128 19602 17277
15927 17277 16444 16924 14044 43736 61432 28094 29168 35832 22471 20697 -19863 -1009 5009
15914 5009 554 -12400 -19398 -14851 -12821 -6549 -9846 -4879 2411 -3182 25587 32813 22801 -14443
15900 -14443 -38230 -40505 -41169 -31692 -26194 -17269 -32556 -59392 -37029 -7152 54 -1871 -7189
15887 -7189 -10964 -13047 -30424 9527 43077 49081 59991 33894 19384 23738 34984 37202 20014
15874 20014 -20181 -35785 -17026 -15912 -27546 -40383 -49226 -49908 -11474 12724 33804 21234
15862 21234 -2511 -6135 1467 17551 10461 6902 1158 -5703 -30257 -41077 -28592 1285 28426
15849 28426 15737 3813 -1355 1462 16879 2497 -21716 -19749 -1445 9367 23066 41288
15837 41288 31900 44239 37303 24054 17870 27784 42856 37554 34678 12003 3002 11541 -1593
15824 -1593 3545 17192 25839 22930 29523 64 8784 18849 13521 19560 28989 12252 16743 6025
15810 6025 13591 3769 -27846 -23419 -1755 15566 -19578 -29306 -40133 -42195 -1875 21274 14386
15797 14386 4434 12627 30280 19732 19348 27958 58682 55716 46828 33508 -5364 -18519 -18774
15784 -18774 -241 15165 18930 31497 43381 30580 34639 17144 13860 37874 66855 93995
15772 93995 86897 89229 118180 122620 157890 202807 246824 324412 475205 742421 1162618 1975960
15760 1975960 3583268 5913219 6878417 6424981 5211596 3272907 1933753 1251041 880768
15751 880768 656123 521121 433218 381322 315243 260830 231026 200736 168351 147434 109726
15740 109726 87642 103373 89924 72957 67353 87528 81752 70938 43097 37955 44020 59439
15728 59439 64728 66906 45115 27811 13789 2810 19784 52155 25106 8504 29502 28071
15716 28071 21571 26444 28272 33586 18580 24663 16126 3678 12985 -4582 -21058 -34067 -39007
15703 -39007 -41623 -34404 -17943 13609 8772 -3006 18165 27932 9589 -1305 -3183 -3037 -14584
15690 -14584 1292 20123 17223 29040 31833 22289 12951 17888 7942 -5103 1132 -22148 -46948
15677 -46948 -38617 1694 -10138 -37808 -38996 -42565 -57104 -58116 -30714 10 -1179 -26306 -26475
15664 -26475 -11771 3085 11233 10211 -5962 765 5499 -11890 -1511 7737 -415 -849 -9146
15651 -9146 -6562 -26000 -39622 -27287 4257 9974 -17888 -27976 -18238 -29494 -11179 -9368 12918
15638 12918 -5750 -8416 1197 1805 -2960 -16997 -7733 -14962 -12057 -18383 -16365 -28909 -16862 -30137
15624 -30137 -27500 29128 48826 14800 -1154 -3241 -32288 -48033 -35375 -22490 -22545 -23320 -2789
15611 -2789 21904 35220 44478 41045 13162 7138 22751 11296 -27826 -19385 -23025 -42105 -38659
15598 -38659 -14435 10220 -11318 -36909 -3733 31200 20422 13873 27119 42359 27052 -3851
15586 -3851 11138 22072 8806 13313 12529 7072 1635 22879 52021 49801 29914 8226 9056
15573 9056 13921 29450 45875 74601 90957 72093 59490 47478 66786 62799 52695 39261
15561 39261 23919 25872 23427 3187 -6932 -10216 11543 44124 25818 9212 8039 14969 18391
15548 18391 12679 10351 -19595 -47227 -38439 10730 37832 36377 22452 17311 12860 6810 -21349
15535 -21349 -26167 -21919 -26401 -23818 -18505 -9902 5751 21473 11996 32913 36540 -4698 -23099
15522 -23099 -17001 9948 25151 20651 22084 16809 28671 38159 24822 7142 -11401 -13070 4787
15509 4787 -2665 11481 25404 39036 33368 18046 22906 8415 5111 -12207 -13704 7390 15586
15496 15586 12163 1886 -3916 -28509 -36733 -47130 -45781 -28093 -22757 -3353 -18538 -34118 -20547
15483 -20547 -6503 14865 18869 14696 24141 9060 -5140 24912 24069 21864 22201 -3094 4150
15470 4150 19547 -8008 -14326 -27730 -11704 -8481 8547 13587 18646 37008 37366 56407 51479
15457 51479 7083 -9704 -1321 -1759 8258 45515 28992 377 -20889 -15649 -9489 -1977 11759
15444 11759 53385 48293 -6168 -22164 -15633 -37404 -39880 -24656 -35326 -41142 -20324 2625
15432 2625 5306 1963 4584 -8155 -12606 -4928 -5721 29544 67189 57771 37230 -11985 -22995
15419 -22995 -5733 -8360 -10966 -8786 13737 28028 31987 21231 -4610 15837 14737 11830 8591
15406 8591 12187 4465 7772 -11696 -7914 12808 35439 51357 61958 58716 55285 27632 35860
15393 35860 28124 902 -7855 3389 -9143 -487 18256 -8323 -20913 -6271 -2577 9627
15381 9627 26892 17558 -4691 4091 13836 25660 38675 34286 -20100 -15333 -12681 6133 15189
15368 15189 -1273 -1455 9523 -1591 -17611 -20512 -8270 -46906 -49813 -15710 -18038 -19377 -752
15355 -752 -2482 -16084 -11789 -786 -39673 -65459 -51622 -30350 -31571 -40895 -38358 -30698 -11243
15342 -11243 13523 21084 -8431 11267 31280 27697 -3348 -46998 -61035 -38337 -26589 -173
15330 -173 27973 41965 8289 -12561 -25858 -25180 8229 41534 31864 -9866 -55516 -66840 -30614
15317 -30614 -3877 20357 11603 -20011 -36265 -41261 1460 16597 -17324 -35745 -5703 -20192
15305 -20192 -17304 2568 11744 7981 23051 31598 18614 -2357 -26347 -31114 -31657 -18585 -14144
15292 -14144 -37804 -51517 -35765 -35628 -39071 -26864 -15266 -17554 -12505 -26147 -4423 1812 -13844
15279 -13844 -24540 -24125 -18524 -38539 -18901 -6472 -24208 -44517 -8213 6942 11056 -3208
15267 -3208 -8699 6237 27900 3379 -29801 -14732 -16194 -8928 -22482 -41760 -27041 -16943
15255 -16943 -6728 -6710 -10388 21766 24945 19513 19178 7215 -3133 -1136 14074 50897 47977 20869
15241 20869 7381 -13541 -21656 -9952 -21368 -2307 -6711 -18229 -42832 -43784 -40377 -50417 -37004
15228 -37004 -50749 -50746 -30287 27160 79065 94536 67931 23643 536 -31 -10383 -41469 -18240
15215 -18240 17740 15107 9447 19561 401 18413 36618 36244 -398 -2319 12434 38425 41949
15202 41949 16809 6368 32802 53707 51123 51026 54018 55242 49738 39318 9093 -1451 -11758
15189 -11758 -18979 -1430 -268 -25953 -43450 -27799 -10640 -81 12240 28948 40945 38882
15177 38882 31600 44544 29655 22064 23756 36309 26185 11112 -4824 -13928 -10256 -7764 -18141
15164 -18141 -18316 -3694 -110 11301 28154 49447 45634 25135 21235 -13137 -6643 -6190 -9091
15151 -9091 -18669 -8915 20336 43767 20689 2745 3729 -20261 -17777 11247 32995 26688 -10836
15138 -10836 -916 4294 5617 -10614 -28623 -25068 -2461 5994 -3793 -1557 -9185 -14339 13674
15125 13674 28040 16692 12219 3977 28135 49334 29360 12995 25984 28899 48005 58946
15113 58946 61802 40761 10613 -17338 -28292 -6341 15458 34392 16736 2680 -26895 -34343
15101 -34343 -19631 -13990 -23948 -13039 -8121 -5977 -5049 4661 25020 18038 -527 -21871 -18671
15088 -18671 -9146 -24774 -6601 -13236 -23819 -25944 -31522 -14016 520 11117 3583 -7516 -21239
15075 -21239 -33271 -51250 -21297 -8033 -14872 -16345 17885 19590 -13196 -25293 8750 7651
15063 7651 2587 -5254 28214 30498 32150 43325 44437 6472 15057 716 -5358 -18815 -42192
15050 -42192 -44965 -38146 -50820 -34321 -1513 -9416 -12566 7509 5463 1961 -16125 -10962 -32735
15037 -32735 -19752 -1314 2024 15085 12674 -13338 -9640 -16681 -9140 -269 -2028 -11433 1240
15024 1240 5509 -22866 -32633 -13642 -26052 -48314 -28488 14579 32838 9612 -3160 -1769
15012 -1769 9251 4673 -4404 -8551 83 -16657 20741 27059 -5757 -21753 -11398 12506 33590
14999 33590 47084 44566 19347 22915 22883 7124 -16500 -22375 -44969 -41797 -43454 -47763 -39290 -17766
14985 -17766 -10258 -17385 -1380 8380 -17575 -35532 -15968 -2554 12097 16938 23280 34337 55607
14972 55607 76521 63483 42707 27331 27117 16612 26060 49193 40779 15175 -5622 17699
14960 17699 36723 38829 14622 29496 32283 42336 31907 31176 36533 -1927 -5746 28087 26774
14947 26774 14965 14344 32330 10883 -26782 -53750 -48013 -35423 -28012 -29674 -29894 -17245 -17090
14934 -17090 -31061 2082 -16382 93 31451 28845 -11111 -47721 -39380 -15950 18978 22918
14922 22918 -779 -19411 -11936 -7421 -102 -16665 -1005 22821 13868 228 6854 -17518 -46125
14909 -46125 -21413 -32647 -33884 -20705 2002 13357 17227 4700 687 -6574 -9625 2165 11884
14896 11884 34097 45167 4994 1199 10038 -10682 -27566 8596 738 -5627 -7435 1170 19750
14883 19750 25445 -10486 -40928 -19509 9010 8770 -15556 -13570 17471 38220 44391 32497 16839
14870 16839 8325 25059 5753 -28473 -29969 7721 19467 40168 60157 28237 -5459 -9564
14858 -9564 15735 12548 7122 5011 -9807 -15855 1280 23248 25379 20429 18320 37213 22328
14845 22328 -4516 12031 22251 13115 1406 20805 32310 12896 -5728 971 -15766 -15980
14833 -15980 8965 31057 31263 63755 40980 21101 28228 21107 -8159 -30889 -12834 6916
14821 6916 21686 36936 48832 46478 48038 39940 16343 375 8227 15815 38723 32414 7682
14808 7682 25029 24356 12542 40844 29821 21791 29607 19013 -9755 -15657 -11512 -661 27051
14795 27051 53618 64642 31060 24614 52031 60561 46119 39624 26592 17115 -4217 -4910 1386
14782 1386 18314 17297 -10329 22287 21982 30574 52553 50656 25468 13575 19257 9879 965
14769 965 9051 1742 3412 31327 72403 67948 35535 35516 26453 13260 12241 19542 21852 25426
14755 25426 8647 -7770 -13125 -40676 -55094 -4868 27585 19718 -13433 -44290 -32053 -4962
14743 -4962 -1358 -14771 -10042 -57 2708 41915 57017 47541 20652 -11289 5277 44797 53680
14730 53680 64658 56938 24103 20272 11008 5634 31365 46671 50511 37203 -2154 -23240 -13060
14717 -13060 -2875 9285 -6370 -8379 -119 7926 25594 48189 49809 47845 35365 33745 35200
14704 35200 15465 -7498 -5434 -21727 -17032 -2160 30030 48287 24504 18414 31854 41403
14692 41403 60581 65973 47641 28550 18238 32175 23490 20563 19077 6018 38779 28818 47599
14679 47599 42359 45325 34611 11156 13883 28365 26656 38607 53115 45208 47907 59606 47122
14666 47122 63344 60192 64494 32296 17860 29773 38132 52757 51341 26421 14735 21076 44800
14653 44800 71156 74685 67974 62189 35297 20179 38220 26241 -6946 5305 15542 28019
14641 28019 30206 49979 45174 18250 -1278 -3586 17798 36696 35468 29439 22138 3018 -7460
14628 -7460 16217 59431 67917 39467 20797 25044 31332 24607 53967 86955 91294 64014 55401
14615 55401 104578 136066 133159 131067 123660 139896 178208 201543 202561 180723 171810 188067 203756
14602 203756 221763 258690 284061 299854 336363 446741 566191 657739 789855 883372 967988
14591 967988 1012309 986770 910150 811303 694489 592903 515355 438880 387135 339749 308336
14580 308336 275841 226306 199024 182254 177180 141378 115215 119078 108755 89703 103908 117673
14568 117673 105877 76504 57479 74151 57531 26913 30670 35494 28258 25289 43014 37995
14556 37995 51695 41563 38082 39623 30728 15228 26748 50840 68285 49526 35530 5155
14544 5155 -165 29527 77662 73484 55064 49384 60737 37925 9402 22474 26766 7944 6036
14531 6036 40151 50833 78197 96492 73413 47551 20705 13046 36779 57022 68582 57527
14519 57527 44484 15517 16855 28884 39785 60390 84830 104439 101232 104464 89715 46449
14507 46449 31476 24258 4089 -37323 -13420 33639 62528 48642 29595 50885 86573 92568
14495 92568 87429 78892 39196 23709 48040 59690 54229 43453 48930 53480 58622 57119 59492
14482 59492 54449 9793 8566 17386 15305 5829 37624 63470 68668 68128 46336 48114 43354 25899
14468 25899 23920 13882 10613 5725 -19033 -29907 -24288 -2282 -1481 10749 24103 42295 48861
14455 48861 56182 43422 49534 75897 59435 36838 -8281 -6405 17411 11048 33535 51004
14443 51004 58477 60350 46503 40650 61061 64684 69011 50591 42653 31638 30324 29387 41729
14430 41729 51717 63717 67378 55207 60435 47942 24385 13480 7148 2906 19328 40850 36646
14417 36646 38961 35908 37109 38073 42413 26547 35411 42360 71054 74578 57594 59109 51204 48835
14403 48835 43777 69049 94592 87949 78505 63976 62155 60009 55208 50659 59124 59429 55355 44311
14389 44311 55547 54307 48169 71215 82543 93777 107123 97366 69162 45802 49662 73760
14377 73760 89281 91583 110806 115987 124744 135713 158804 162064 161598 172498 186691 206362 233964
14364 233964 228998 212033 207274 175831 144675 155931 140556 117655 98210 99430 104882 134773
14352 134773 139732 135261 129819 116581 88040 81591 99346 118608 128340 102896 80782 53991
14340 53991 52015 40505 38649 57586 80881 103828 111062 73904 102075 123281 122611 117149 107882
14327 107882 97324 89235 93631 124296 156673 148328 142009 139738 161450 164305 157147 175657 172365
14314 172365 183775 188804 168243 135939 99899 84924 111024 135032 143115 153355 134724 135054
14302 135054 136615 133475 140748 111649 107328 119836 147700 162859 158231 162326 198222 201335 219644
14289 219644 229045 216304 180850 176233 184505 183318 175653 167890 158206 153606 156119 154959 146924 160425
14275 160425 181943 179315 164298 168685 170987 174915 187600 201408 200585 180891 166988 168894 210044
14262 210044 220458 224023 208061 220884 232255 229852 235341 209061 185500 224047 249418 244501
14250 244501 256449 266452 264181 262595 268321 293029 313314 334107 365381 374360 380223 386606 400963
14237 400963 394373 374315 358627 361533 377967 392931 389107 376623 381182 386962 376455 397447
14225 397447 414295 416253 423187 437520 482974 510885 500972 521560 572270 656135 748515 850481
14213 850481 999747 1175239 1284433 1348486 1293421 1177820 1049545 948704 843012 729989
14203 729989 666705 646892 627923 600263 584304 573441 560889 557215 563394 574365 574050 597458
14191 597458 611712 617793 604888 621708 640475 656679 636960 622173 656462 682955 699388 725514
14179 725514 744884 755166 760300 761480 792392 825943 852881 878963 914761 966508 1016752 1045492
14167 1045492 1077624 1098100 1157082 1185739 1222048 1262255 1288083 1377548 1462128 1550400 1621731
14156 1621731 1674149 1751317 1855813 1946421 2076711 2226961 2386014 2551699 2718189 2905041
14146 2905041 3093409 3324114 3600862 3897642 4270300 4737287 5286514 5944510 6692704
14137 6692704 7541988 8515995 9605673 10780537 11962637 13110348 14234516 15308278
14129 15308278 16373239 17540982 18988870 20816548 23158876 26074130 29614371 33797150
14121 33797150 38845958 45278899 53996094 66197413 83138382 105380815 131981115
14114 131981115 160088735 185328612 202933384 209201612 202911459 185541868 160724994
14107 160724994 133008076 106516103 83870631 66015420 52645222 42920754 35838628
14100 35838628 30610756 26702548 23641666 21157781 19074508 17273881 15638155 14123958
14092 14123958 12729721 11489187 10411943 9475563 8697138 8060951 7508350 7043920 6637736
14083 6637736 6252016 5932812 5608371 5296794 5022751 4792297 4589989 4447056 4308130
14074 4308130 4189878 4083215 4002495 3916588 3815548 3723488 3619639 3503534 3368626 3209911
14064 3209911 3074148 2960442 2836921 2703227 2624218 2548653 2494015 2456975 2428179 2459488
14054 2459488 2499087 2564764 2645764 2723171 2780318 2786898 2761815 2680155 2574883 2391887 2187818
14043 2187818 2006484 1850283 1713863 1580303 1467997 1330513 1240939 1187922 1143455 1104713
14033 1104713 1061231 994789 948178 931324 894548 862105 829818 792762 789592 762036 717154
14022 717154 703181 699729 705391 655255 635103 644648 639479 616287 603291 577498 536570 492463
14010 492463 472428 473424 485290 491808 489532 499673 482028 486230 463708 427018 401529 391213
13998 391213 380437 383110 390942 373704 378678 395520 418335 408915 407807 423636 443927 463468
13986 463468 443987 428064 372268 327933 330559 327973 325611 307799 293942 293394 324812 331653 338288
13973 338288 324273 303502 263307 243164 264878 273417 261271 258765 256530 255901 263642 249318 244189
13960 244189 257530 270902 275508 259413 260258 280899 293994 286245 277084 298725 315439 313053 295467
13947 295467 250821 229709 212525 185378 198950 237193 258270 254351 229830 222152 212230 241252
13935 241252 250403 230958 249394 257625 267898 272276 237094 202228 221977 260836 279266 294169
13923 294169 315228 309828 319779 329575 355085 364362 379841 383786 396333 432048 449867 446588 455613
13910 455613 454597 449880 443768 453830 463271 479750 489507 471903 453470 475357 512650 518013 508794
13897 508794 509139 512108 535694 545970 555797 549981 566159 598967 614686 634070 664444 696579
13885 696579 737251 757447 784579 840544 879603 913201 942118 1006989 1065127 1081604 1121688
13874 1121688 1173339 1229237 1274903 1379982 1476151 1569227 1668727 1767889 1914411 2067653 2182833
13863 2182833 2263370 2343025 2393132 2423985 2454918 2457101 2419718 2346643 2278055 2185083 2073200
13852 2073200 1947207 1830045 1723406 1586114 1459217 1364121 1263613 1184510 1104308 1041376
13842 1041376 967843 888236 822933 813622 752949 687018 673131 639942 612927 590047 540326
13831 540326 499746 467441 441247 407496 380713 368148 359456 352030 364314 344304 340193 303388
13819 303388 269337 260324 253106 248220 248599 245206 252136 238864 231100 234077 237389 244830 226202 221916
13805 221916 196192 212491 223445 223778 252853 239328 232144 235794 197363 177763 158505 156281
13793 156281 170921 158936 138212 162832 179467 160737 140512 140081 143759 114364 108122 117613
13781 117613 137807 133046 147684 156185 152444 144238 138132 130972 126314 118066 130210 139426 142516
13768 142516 153000 170522 191380 207100 181398 159947 138427 146095 145523 122400 137189 171387
13756 171387 150849 137772 132671 143775 154666 160866 163588 141851 90248 57810 57265 86726
13744 86726 86530 92865 98916 90583 101889 110023 122548 85080 70800 103373 116542 117238 120665
13731 120665 123047 152353 176965 163617 148363 159370 143065 146295 135511 111109 105340 93301
13719 93301 75768 73869 72718 87559 128195 118479 106731 91307 87341 129244 160414 131046
13707 131046 106881 85184 96146 111022 106826 106753 102696 70584 68362 68319 90831 92005 108725
13694 108725 95640 72027 72574 88430 109879 116196 121078 99107 90530 89130 96350 84834 88955
13681 88955 105259 126126 123137 136065 129160 121902 124625 96257 74057 73190 82516 106138 116283
13668 116283 119703 154680 137634 118926 132723 151783 133037 125384 142718 122077 107248 108693
13656 108693 118858 114411 106716 105684 144729 153342 154427 134340 114458 134760 178943 230503
13644 230503 257581 260673 251860 251424 260637 294457 337877 357670 368472 396620 433111 512562
13632 512562 606580 707209 818821 941730 1089046 1227761 1374705 1485981 1556239 1560160
13622 1560160 1510976 1430458 1322513 1183716 1049751 941245 848941 797852 808860 827375
13612 827375 861029 923744 970449 970697 974374 941767 915594 882961 821006 752488 652461 555148
13600 555148 481368 435330 390053 321471 277081 273093 269975 249690 256528 247190 227860 244657
13588 244657 255687 238081 234944 249869 263045 252554 244314 257916 239226 221862 233702 248921
13576 248921 255054 275635 266850 244869 251707 278747 309357 307878 308499 317258 304258 313223 317896
13563 317896 324279 361720 349775 328737 329350 327792 328507 317784 329845 351047 340634 311219 307962
13550 307962 319645 323426 296650 290743 291517 276511 258677 252941 268927 226758 190389 191811 225162
13537 225162 225586 227390 225506 227703 234122 250727 237067 218076 225799 278043 309710 342548 367998
13524 367998 389306 404745 434642 466803 466421 461517 435180 405738 371950 329954 320806 347721
13512 347721 328118 286305 270308 257917 257339 246839 234958 230107 207785 203837 204110 195146 171587
13499 171587 179083 145874 151541 180477 201645 214759 182571 144872 153203 182811 195682 232422
13487 232422 264067 249944 258007 272675 273373 282621 304573 304337 291886 281326 288606 293376 256753
13474 256753 213606 196888 159167 133246 125133 138861 158862 153380 149020 155497 171148 180624
13462 180624 182459 160343 148313 127121 125855 130790 137186 136827 143190 126118 132930 124006 119443
13449 119443 120067 105028 110652 92403 84804 97756 120486 123011 142005 154201 142730 119982
13437 119982 118689 128903 122968 100359 80002 87792 109619 150129 167735 156836 132980 122336
13425 122336 133865 117302 93087 97215 92398 101107 88647 62144 87563 76165 71881 102176
13413 102176 123603 78583 78965 142146 157058 130784 129298 140595 153619 176088 172684 176237
13401 176237 185542 145032 124601 141028 141793 158005 177798 162663 140876 137953 149655 150083 152129
13388 152129 139320 143630 143133 161227 188106 193569 187378 179593 184992 182030 175995 196465 203165
13375 203165 217474 179588 170387 201852 217091 196900 180386 206973 230043 221079 188361 189999
13363 189999 200653 215081 234628 229238 219411 246174 252644 238898 235987 213586 206349 215584 210774
13350 210774 223808 237741 223519 191161 196769 170081 159073 155433 163119 142313 159804 168806
13338 168806 168735 199417 240174 248981 239619 222083 237577 238236 246122 258338 249525 258523 251268 243925
13324 243925 277816 324267 335226 321276 308470 303461 301845 297745 300094 306184 313642 323879 328030
13311 328030 359871 342243 328167 322880 346972 354090 333417 327342 348520 341001 311352 290941
13299 290941 264202 265847 298287 317926 311136 343810 362701 361447 352719 380161 393976 383071
13287 383071 404600 449352 477385 497148 552448 606499 648419 673397 681514 722096 792004 866405
13275 866405 1000244 1148516 1281858 1446416 1602027 1738982 1843832 1891886 1866252 1808316
13265 1808316 1709408 1613842 1489078 1348405 1249227 1165018 1077197 996600 956471 914689 888500
13254 888500 881992 887029 870374 864893 846201 856180 882837 898773 958313 1012729 1071568 1106597
13242 1106597 1148501 1216738 1305087 1408327 1535527 1695095 1899900 2160138 2429622 2741629
13232 2741629 3097453 3434441 3680215 3840038 3848273 3729388 3529135 3213495 2891968 2593276
13222 2593276 2289297 2029082 1857535 1707906 1591583 1477553 1400202 1351683 1300879 1256062
13212 1256062 1210107 1198766 1204072 1219332 1209939 1214020 1226571 1241406 1268253 1320752 1375515 1465563
13200 1465563 1559369 1646517 1746122 1847616 1976754 2167891 2387149 2604746 2778919 2937135
13190 2937135 3064103 3115241 3107837 3016869 2907549 2768309 2640233 2513350 2403588 2300285
13180 2300285 2205649 2127842 2060915 1991076 1950085 1909107 1845354 1773324 1744922 1712044 1692129
13169 1692129 1691677 1675325 1654466 1651166 1679957 1708089 1723724 1774714 1848861 1901384 1980651 2056455
13157 2056455 2117453 2209391 2365938 2492530 2629514 2752401 2851556 2970983 3078574 3142833
13147 3142833 3184087 3204101 3228325 3204359 3174967 3191324 3206273 3199507 3205114 3250466 3270347 3295166
13135 3295166 3307275 3339311 3400841 3422711 3465145 3571239 3649963 3697241 3771348 3878642 4014472
13124 4014472 4152710 4335118 4569657 4839672 5110169 5455076 5875122 6336162 6893030
13115 6893030 7546733 8335547 9268161 10451174 11892365 13624094 15794807 18441074 21588770
13106 21588770 25217196 29225922 33204346 36663198 39019877 39890655 39159282 37080493
13098 37080493 34117539 30785377 27541333 24606928 22085612 19997445 18259700 16851463
13090 16851463 15703355 14782189 14072704 13507836 13054843 12780048 12634060 12575061 12666045
13081 12666045 12867279 13158947 13565282 14164233 14983751 16027779 17425311 19248662 21569907
13072 21569907 24469196 28140208 32725723 38321635 45049171 52874675 61389267 69701673
13064 69701673 76652694 80986154 81928077 79313950 73744689 66372103 58336268 50526155
13056 50526155 43543295 37580636 32610104 28523193 25204969 22506048 20322705 18530321
13048 18530321 17118137 15995573 15074421 14320384 13738791 13331833 13042845 12869192 12807499
13039 12807499 12855887 13049472 13364922 13877394 14568036 15522843 16811009 18443172 20479143
13030 20479143 22999888 26043108 29560908 33320322 36960546 39921973 41642784 41663344
13022 41663344 39952009 36952440 33157582 29130236 25297299 21880285 18964790 16538518
13014 16538518 14523401 12876394 11505049 10372972 9401787 8527635 7777832 7143428 6602376
13005 6602376 6088513 5647375 5224920 4858313 4527072 4238376 4012829 3765391 3560353
12996 3560353 3375904 3225680 3067038 2923319 2806520 2678482 2580368 2487335 2441132 2339065
12986 2339065 2267375 2249131 2241643 2224845 2182121 2158533 2156953 2127677 2134264 2200073 2191557 2181088
12974 2181088 2166970 2149128 2136649 2107438 2027513 1941372 1854124 1762786 1679541 1601093 1501262
12963 1501262 1420408 1369554 1327324 1263612 1186053 1137331 1091963 1082783 1070074 1034344 1002103
12952 1002103 964610 935076 921553 886063 871051 878281 899591 892300 856232 834715 813727 803304
12940 803304 841954 860802 868971 866639 874426 872792 854273 828515 794218 770594 764665 706338
12928 706338 653741 613456 568582 548360 547801 561739 581949 567459 544354 521826 494631 506557
12916 506557 534442 504925 510113 500353 475191 447193 455483 470606 472918 479274 447857 410881
12904 410881 347789 336296 328281 316003 334921 332210 354344 330470 321035 357590 322429 290081
12892 290081 296971 319070 326109 311861 288334 279256 260310 260627 260087 253850 281278 297884 294869
12879 294869 267578 273224 299025 309182 298494 288209 272381 246337 263196 279340 282030 314157
12867 314157 333947 316910 294745 281256 284662 281843 284515 279769 269588 263911 263883 247062 219826
12854 219826 219586 215421 233374 260808 265046 243153 230889 202815 207018 237805 249150 249464 266821
12841 266821 254825 232582 247497 250434 223869 217434 237217 223634 210520 195965 210101 210748
12829 210748 221159 232385 235846 234901 246578 241842 242400 245043 227354 215909 250043 276343 264506
12816 264506 233892 204802 209139 195640 203454 219653 210030 209732 221601 247044 275332 264793
12804 264793 270084 266458 251318 246607 227088 210990 201058 219830 248561 259432 288193 279900
12792 279900 265372 252245 262761 258794 255719 257544 258777 269227 252788 232188 224177 211397
12780 211397 240183 263818 271237 254597 248314 238109 227879 241317 241660 242521 244865 260656 287441
12767 287441 277580 242621 238142 259707 279129 278163 311584 341170 352567 339473 345268 345905 327582
12754 327582 322159 312800 278138 266474 281866 285388 294170 287411 290785 265296 260936 278921 290636
12741 290636 294189 307049 313534 330063 360838 395228 388780 417135 445637 443324 451044 476925
12729 476925 523705 551490 585720 624669 637688 654335 651449 641969 667996 689727 675214 671482
12717 671482 691841 695754 714713 709453 727089 744322 797479 845066 902866 935447 965271 1014385
12705 1014385 1048550 1078092 1123660 1133587 1103232 1082111 1056808 1025528 1004606 970641 925011
12694 925011 868928 846664 785781 734540 687354 655117 612839 589972 577666 548270 532059
12683 532059 525642 525562 489119 469433 454967 474876 479541 465418 475238 446981 422664 400263 400697
12670 400697 427330 441558 415709 405306 423035 420333 432796 459188 468631 466503 466236 466495 475857
12657 475857 490408 510158 493210 504124 494947 473394 473934 485312 477095 457691 415298 397439
12645 397439 425007 443163 422161 402010 416109 443724 446926 448755 456983 463318 464839 472564 456560
12632 456560 439668 421492 425758 395457 373785 353303 359677 361170 368249 347346 331045 320064
12620 320064 327160 346296 371981 358033 367386 394142 360103 321745 325069 361027 395951 438648
12608 438648 476120 497366 536357 600085 668011 723741 795333 858146 864582 841107 790888 755872
12596 755872 742386 716792 681598 650694 606740 555127 515782 485347 485543 499039 486084 467047
12584 467047 450032 421607 411917 420200 425795 420036 409179 417862 434576 429921 421125 438707 425996
12571 425996 429229 461172 518193 551236 597184 670158 740901 810347 888593 973668 1038851 1065386
12559 1065386 1048190 979223 910110 823677 730919 673042 608752 579927 552032 516546 520717
12548 520717 512973 498312 474890 487153 488093 472445 476790 445486 422770 443584 458777 433607
12536 433607 417218 424610 443366 457789 478500 476852 479761 481242 506529 554760 555489 568257 608977
12523 608977 642799 691833 738987 770014 779006 773566 712307 682311 638880 586702 554764 525025
12511 525025 527546 549749 566516 563920 545813 549881 541983 538796 553771 535927 561658 571368 565071
12498 565071 572591 548711 533830 563576 588739 622933 645502 633873 610293 605371 598564 580489
12486 580489 584300 609895 641160 647185 611975 617707 648464 654941 655949 646531 668840 694629 682230
12473 682230 691094 709673 745778 758967 768578 749925 737306 731739 741729 760414 777679 768915
12461 768915 774165 777149 789553 790178 836426 891200 890913 895754 943702 960194 957350 969853 992547
12448 992547 1024332 1040849 1068805 1064167 1053367 1081403 1126018 1123876 1107554 1110999 1149560 1177631
12436 1177631 1205311 1232521 1277733 1297331 1331254 1349690 1335040 1358735 1397287 1442350 1473104
12425 1473104 1500776 1496630 1507283 1530383 1559709 1584548 1609961 1668032 1699072 1743747 1785053
12414 1785053 1834372 1879973 1926053 1965557 1983884 1986631 2024150 2085018 2120816 2179515 2260167
12403 2260167 2323816 2410565 2490887 2556921 2597881 2663027 2744033 2828197 2924438 2984218 3048057
12392 3048057 3106289 3218144 3334626 3439640 3554960 3660174 3784756 3888545 3978883 4072736
12382 4072736 4203149 4345071 4479806 4621376 4782732 4934398 5093578 5271263 5444323
12373 5444323 5587987 5759375 5936580 6129882 6322177 6530245 6758852 6979937 7176958
12364 7176958 7366067 7556388 7795885 8054464 8289847 8506769 8725846 8957558 9165638
12355 9165638 9383087 9603868 9873456 10112034 10289990 10465060 10626358 10798009 10966059
12346 10966059 11130216 11294430 11437057 11539394 11612378 11656982 11711871 11772746 11793615 11785319
12336 11785319 11759054 11734344 11692598 11652214 11583079 11483386 11373438 11268568 11169848 11033993
12326 11033993 10901185 10749052 10610924 10478551 10288735 10077038 9875895 9697160 9521749
12317 9521749 9328317 9146442 8929852 8698359 8504356 8302310 8107159 7899146 7664481
12308 7664481 7467978 7246345 7064748 6897393 6696591 6497477 6299754 6111488 5910528
12299 5910528 5749034 5570923 5424272 5267116 5124811 4973689 4803837 4648339 4511730
12290 4511730 4366835 4248109 4123607 3996869 3886218 3768458 3662280 3573949 3467027 3352062
12280 3352062 3243902 3162933 3097275 3027403 2928013 2841924 2764225 2710830 2631952 2577288 2506368
12269 2506368 2429775 2362526 2292812 2244443 2174363 2131778 2088409 2032211 2001198 1937741 1891769
12258 1891769 1847211 1819020 1803643 1758748 1731147 1677183 1603714 1564305 1568782 1519466 1477038
12247 1477038 1473257 1436322 1411144 1368928 1346928 1331713 1300181 1274151 1262844 1282450 1288158 1269597
12235 1269597 1240438 1207246 1174299 1134630 1134823 1125215 1096965 1090276 1066175 1029441 1030324 994669
12223 994669 954456 955249 962091 945226 928229 918157 910763 891147 885723 883685 877098 845551 841034
12210 841034 846330 835939 838018 817378 776328 752583 747790 734018 744439 736034 732453 725719 730547
12197 730547 717336 706855 729517 733354 709104 699079 714176 732559 742821 743132 716368 695299
12185 695299 674433 668624 696307 711020 694544 681722 673397 691139 715937 704785 700096 705262
12173 705262 695672 682981 647420 620818 636688 661495 658368 656753 649420 606118 592758 594381
12161 594381 578806 589642 612062 634736 683202 675872 653252 652658 643036 637827 670846 675508 660776
12148 660776 688655 709956 704580 704174 732346 745241 735629 726233 733893 709187 701074 718248 747836
12135 747836 752987 787106 825715 831010 807176 823708 850420 895129 914586 920566 949071 990169
12123 990169 1015284 1030993 1027423 1028839 1047173 1045842 1042358 1070424 1073881 1076457 1088153 1099451 1065874
12110 1065874 1040438 1034550 1022835 985510 962854 981281 984956 960867 957539 979805 1000571 971906
12098 971906 957761 966830 979794 979365 982718 1017989 1056874 1059182 1036728 1022653 1039233 1065013
12086 1065013 1092122 1079898 1058287 1059340 1086155 1079093 1096212 1111436 1098365 1098254 1109495 1114098
12074 1114098 1116498 1130851 1107142 1080544 1074291 1071424 1060199 1056658 1070028 1061572 1062516 1065612 1062332
12061 1062332 1066687 1034640 1000440 978725 963501 986360 1007226 1010212 1006606 984396 990474 985193
12049 985193 972484 983309 1003087 996308 983454 979684 972668 974893 981259 987939 969613 940427 929747
12036 929747 909428 868918 831706 816982 799358 785668 788059 784068 804152 784780 764374 779472
12024 779472 797478 816714 834243 864391 899914 877015 858040 877348 867712 855568 862699 838119
12012 838119 842169 866868 899397 857900 815160 795165 785297 746357 705041 701838 673098 634389
12000 634389 614892 584869 572679 564850 533137 512309 489042 471863 441731 438341 438537 412721
11988 412721 408695 425514 394977 380109 374990 378002 378752 363008 355989 359797 359986 349103 340592
11975 340592 339950 340582 338262 329011 339256 325400 312619 327069 334236 314726 309682 329722 314917
11962 314917 296040 290052 292266 305891 305972 288319 284290 290495 285708 272999 277601 267184 291266
11949 291266 305211 297065 300091 274196 250686 253607 245120 268305 300814 313960 303326 271698
11937 271698 262541 283387 289700 273664 254224 244569 241043 203310 220151 234309 253236 266345
11925 266345 258784 266573 266787 302367 312659 291822 299976 291229 288021 291396 280957 269056 289210
11912 289210 301589 306543 302213 288612 274192 271816 267678 265499 258948 281673 297962 307067 327696
11899 327696 336735 312409 288528 277478 283160 291293 314190 316259 328063 335413 324903 333311 348109
11886 348109 337813 347774 352695 349730 358887 357489 357616 364486 355219 343548 338860 344905 346100 344123
11872 344123 363235 367955 371406 379797 381222 376499 385945 390609 375585 390145 395059 396951 381386
11859 381386 396189 403131 372213 375296 411010 432123 426226 430678 461337 482454 479924 481076 480739
11846 480739 476147 463919 453247 461116 456314 460906 473283 445770 432709 449653 471254 480189
11834 480189 493379 513166 520801 517682 506685 480468 475495 506457 503503 484171 502816 544851
11822 544851 540619 519254 518858 519648 549225 574598 603267 621485 624671 613687 577068 554233 571513
11809 571513 570562 550308 559953 563257 561726 569810 575265 555334 522677 546132 545094 553771 562853
11796 562853 576952 592842 586246 565993 569725 592722 616135 638469 656441 649285 688781 699175
11784 699175 711031 710343 735531 761732 778678 809435 819514 842134 852971 883946 904135 939163
11772 939163 984240 1011108 1049228 1082366 1124759 1192136 1259948 1297595 1354101 1440194 1520200
11761 1520200 1620685 1745353 1864321 2002838 2154212 2303329 2428742 2575899 2732716
11752 2732716 2882725 3021883 3175842 3347420 3569439 3809079 4066373 4359468 4727395
11743 4727395 5127671 5614650 6205643 6913983 7761670 8780317 9960489 11289791 12782615
11734 12782615 14357871 15836642 17084783 17944710 18332383 18196118 17591727 16712577 15697284
11725 15697284 14654943 13673528 12793329 12049541 11460422 10982309 10598466 10336472 10179122
11716 10179122 10067466 10042428 10108522 10264631 10514910 10876040 11353317 11957750 12723418 13664599
11706 13664599 14802370 16132839 17700608 19435866 21259897 23162789 24961616 26509343
11698 26509343 27704002 28442066 28722023 28587308 28072766 27264744 26309951 25320714 24421674
11689 24421674 23744397 23321589 23228608 23420845 23792934 24221158 24682834 25064095 25263578
11680 25263578 25262268 25043776 24642381 24114808 23532188 22928156 22421357 22089204 21981869 22133908
11670 22133908 22539614 23152799 23898961 24733510 25531797 26195706 26703038 27056660 27255413
11661 27255413 27310191 27226951 26971935 26538113 25992776 25413194 24906645 24528104 24361994 24386307
11651 24386307 24526177 24715044 24851283 24877924 24771692 24525309 24132910 23655942 23097737
11642 23097737 22572019 22088034 21770596 21706611 21933351 22521390 23423273 24635274 26065123
11633 26065123 27594460 29037597 30192577 30893482 31028404 30582532 29625069 28260227 26582454
11624 26582454 24691448 22735300 20814231 19034010 17428361 16010056 14812715 13792005
11616 13792005 12911506 12209878 11647711 11198186 10872694 10658129 10568328 10580570 10699733 10921600
11606 10921600 11277589 11763604 12355201 13109692 14023789 15042806 16148087 17269272 18274611
11597 18274611 18979445 19198368 18898087 18102771 16909464 15461326 13925261 12415509 11027061
11588 11027061 9787245 8722701 7777838 6949071 6252985 5654156 5164730 4744262 4365322
11579 4365322 4038053 3740662 3496860 3256708 3084883 2944770 2784550 2649534 2549899 2432348
11569 2432348 2319956 2202120 2109162 2021674 1918019 1836384 1773626 1721566 1689894 1647627 1564425
11558 1564425 1504827 1450371 1418405 1383561 1346585 1304554 1280327 1230008 1236320 1233755 1211099 1213515
11546 1213515 1201089 1176293 1174930 1169755 1172568 1179406 1130840 1079922 1076455 1053485 1040612 1026873
11534 1026873 980689 935662 920692 902320 888738 884142 884800 905643 906038 880023 855978 865331
11522 865331 877073 871960 888226 898045 887867 890853 913353 912665 927110 944731 976533 999599
11510 999599 1031389 1029303 1008688 989459 984586 960904 954235 937990 916443 893111 871726 855708
11498 855708 857601 853219 817270 803075 815142 808320 811372 815765 823856 834711 847739 817148 801075
11485 801075 810512 804643 821934 859176 878777 898449 915869 879119 828661 818183 830596 830779
11473 830779 826226 821425 808498 804528 789070 783742 803841 819006 832233 850367 852633 849975 850386
11460 850386 891669 919028 920197 908693 903430 917080 952321 981486 1034442 1078342 1085043 1123517
11448 1123517 1183942 1269120 1362024 1462910 1575856 1720887 1895889 2069938 2142909 2173589
11438 2173589 2163833 2122917 2022017 1867305 1755135 1665238 1600558 1543991 1484406 1440694 1410584
11427 1410584 1382593 1365629 1342791 1331912 1350063 1387309 1418900 1454028 1509364 1590150 1662268
11416 1662268 1722449 1812182 1943710 2084512 2245467 2383209 2504020 2636530 2736088 2770970
11406 2770970 2739605 2670196 2604682 2533165 2511244 2521867 2487381 2509391 2546413 2607936 2641627
11395 2641627 2670195 2705594 2727615 2740236 2767188 2843588 2941747 3054333 3120049 3206720 3296003
11384 3296003 3398574 3533311 3700111 3865864 4066570 4301161 4557543 4819636 5123402
11375 5123402 5428626 5737473 6050004 6408207 6730098 6985704 7189582 7355755 7447063 7414542
11365 7414542 7292059 7132464 6927293 6641674 6328559 5983429 5648907 5283712 4930348
11356 4930348 4594869 4298386 3976224 3709637 3477231 3229503 3041841 2870578 2692380
11347 2692380 2551306 2414454 2257175 2114111 2010634 1921251 1820807 1730302 1652198 1572931
11337 1572931 1487872 1446806 1432404 1391167 1332896 1295344 1264572 1230000 1192534 1141728 1077867
11326 1077867 1010594 985149 987018 999600 994459 970309 935418 894125 882260 872402 860756 817047
11314 817047 796354 774439 769618 750465 737891 726301 696285 672782 659668 636721 621884 610632
11302 610632 621220 613260 595492 598728 568317 563726 581011 572029 561353 570660 568700 573469 564178
11289 564178 564232 552251 556518 597068 589113 565893 551757 531313 540050 548186 577920 587473 578910
11276 578910 576627 584418 561839 566252 555785 527037 523132 537543 526258 533031 546709 561322
11264 561322 567442 569166 557710 563031 569798 570645 550853 523631 527959 549047 557370 569003 597452
11251 597452 631821 651433 670823 681739 710742 719287 726930 752744 763755 733356 713402 700043
11239 700043 683083 683579 655722 642298 636510 636371 619838 608800 620280 607842 580714 580808 566363
11226 566363 585204 599257 587932 583114 591084 583241 600762 604821 630381 671837 713005 706461
11214 706461 710071 725070 721894 701259 670247 665314 689293 703838 703187 671535 647110 647143 632214
11201 632214 645753 666810 666562 660228 667311 648335 611330 632715 644783 628394 606372 584235
11189 584235 567451 577640 590667 606791 573203 570039 599176 637702 634349 640840 654147 653168
11177 653168 669795 701468 706255 709289 718704 746377 793059 812663 795407 783869 763947 760981
11165 760981 728565 719077 704705 674601 669027 642003 632452 654529 676504 642608 624884 635306
11153 635306 619630 633933 640579 631466 641299 661711 673438 675929 691228 690988 674884 697491 742600
11140 742600 775523 792049 792963 785279 774815 761270 738759 760993 799004 827892 822357 816373
11128 816373 810809 815385 814093 831935 853720 900074 935984 937707 941146 934934 928136 907866 912571
11115 912571 914721 902187 903343 893526 900140 944957 961061 956198 951127 960991 985427 996566 1002610
11102 1002610 1020250 1010264 1007383 1024703 1023263 1053200 1086063 1114672 1154283 1233618 1256477 1249492
11090 1249492 1240349 1291664 1326372 1308242 1297830 1277807 1277362 1297951 1305360 1320918 1339025 1351518
11078 1351518 1387120 1432108 1436776 1436475 1434039 1467733 1512604 1551066 1601338 1640206 1668515 1682866
11066 1682866 1715912 1748024 1774736 1807179 1866803 1909549 1938602 1981733 2038700 2110900 2186324
11055 2186324 2239237 2305452 2387374 2479008 2571878 2686111 2815566 2929490 3036722 3154304
11045 3154304 3277719 3389807 3498381 3605710 3734699 3867250 4018607 4196961 4386307
11036 4386307 4589004 4831550 5091870 5361377 5615393 5858617 6172352 6480158 6822869
11027 6822869 7244323 7699957 8230942 8810819 9467859 10241686 11122598 12086490 13180597
11018 13180597 14508541 16082229 18018254 20283119 22931757 25863588 28839133 31549667
11010 31549667 33796018 35665348 37433744 39480018 42110020 45645695 50397243 56625595
11002 56625595 64712024 75250381 89033084 106947754 129967903 158907016 193656089
10995 193656089 231958763 268334418 294765360 304355181 295322303 271465755 239860367
10988 239860367 207431581 178523531 154737019 136061736 121842829 111295792 103661654
10981 103661654 98154054 94020774 90642130 87714839 85266824 83438164 82490900 82682666
10973 82682666 84169526 87198288 92026191 98983680 108625596 121579854 138531807 160183062
10965 160183062 186756741 217156311 247792315 272141012 282967917 276444337 254294592
10958 254294592 222474257 188113643 156525686 130097866 109047823 92630857 79887958
10951 79887958 69856219 61828853 55309378 49928058 45394874 41464641 37943509 34724283
10943 34724283 31745053 28995948 26531238 24351291 22406186 20687256 19165181 17811641
10935 17811641 16598389 15532384 14559573 13693253 12912614 12265428 11702557 11201637 10741191
10926 10741191 10378550 10146385 10009536 9919567 9917591 9978205 9977047 9870969 9666192 9422264
10916 9422264 9156045 8863603 8496853 8096276 7642453 7160812 6677424 6194377 5758946
10907 5758946 5386637 5065193 4747829 4499001 4255620 4067065 3909390 3785458 3648992
10898 3648992 3527293 3385175 3265108 3122951 3027686 2941580 2817659 2695796 2612430 2523306
10888 2523306 2461961 2389830 2309239 2242409 2173421 2086666 2021359 1938506 1906694 1872753 1820871
10877 1820871 1790368 1771977 1725909 1716658 1686562 1671603 1649926 1653920 1645462 1625708 1596489 1577287
10865 1577287 1554891 1519608 1473111 1433280 1415832 1375199 1332515 1319282 1289689 1247025 1236028
10854 1236028 1209632 1171558 1155514 1146490 1141172 1120412 1119307 1128620 1161296 1169580 1181915 1217659
10842 1217659 1273808 1321356 1362229 1417417 1468188 1472508 1452438 1400983 1344159 1254686 1174786
10831 1174786 1111512 1057571 1022512 999797 943431 896832 878827 841283 819083 786606 765421
10820 765421 749945 744810 768809 768434 775210 787504 793936 832479 830396 847715 912299 981978 997257
10807 997257 980268 961356 943776 913616 875763 816597 780270 756366 732736 717388 702263
10796 702263 668385 640542 609788 593758 568013 521719 500299 469687 453627 437303 403153
10785 403153 420394 414882 420557 418617 432719 462212 455906 446678 473800 466091 428131 422874 424648
10772 424648 439404 426244 396170 398067 394933 409812 432116 449192 462209 455819 448341 433844
10760 433844 415209 412417 397609 378919 364472 362736 350699 321557 329999 336230 342114 305630
10748 305630 302716 349267 365579 368934 385102 387825 384648 374243 381848 371053 381164 377182 379216
10735 379216 370975 359142 348266 347610 347523 375819 365692 336595 319505 335881 320690 307998 335718
10722 335718 378345 380477 358581 334881 350203 358534 378718 371231 372205 359438 361228 365674 332162
10709 332162 317225 317005 321086 301987 292273 324112 350715 320834 286226 263297 250163 279040
10697 279040 309105 312575 305207 289694 306872 310794 308687 295556 275394 271443 280595 280747 302514
10684 302514 301442 295833 280477 254275 257666 273849 291753 298852 267592 272049 288591 293211 278796
10671 278796 265169 292822 293136 319569 349911 372194 360103 320274 316652 335811 334146 315485
10659 315485 344573 370681 365112 353001 337010 370653 382634 421034 437206 474779 498828 498969
10647 498969 519910 531036 559336 560288 597047 633972 657106 682163 731369 783453 860126 926045
10635 926045 1038814 1137917 1257554 1377937 1498522 1624587 1762046 1888728 2032579 2233629
10625 2233629 2502665 2900725 3422252 4133284 5113618 6506529 8366033 10817764 13868083
10616 13868083 17186484 20054818 21783639 22181981 21547787 20557816 19905701 20084434 21429475
10607 21429475 24198956 28645948 34720450 41437808 46760976 48940345 47755520 44251808
10599 44251808 40148919 37084326 35850191 36755048 40056471 45863431 53786732 62093074
10591 62093074 67670754 68279257 64023802 56670745 48808943 42499840 38505991 36891723
10583 36891723 37493953 40157044 44265048 48387493 50400121 48976029 44454726 38188716
10575 38188716 31993236 27100264 23846073 22104600 21598961 22042840 23005204 23830795 23691952
10566 23691952 22227559 19639388 16429406 13294251 10669875 8674004 7171157 6061375
10558 6061375 5240633 4583732 4097877 3727745 3439960 3164915 2928039 2728968 2580869
10549 2580869 2476824 2369684 2305178 2304397 2312831 2335807 2389951 2437338 2468120 2531036 2574973
10538 2574973 2569533 2510596 2458585 2368150 2214452 2029692 1863779 1743693 1620141 1513225
10528 1513225 1432877 1347138 1263927 1180022 1150322 1158007 1152572 1148942 1108603 1058706 1022719 1042748
10516 1042748 1068241 1111087 1183051 1238310 1296121 1380523 1468373 1563889 1649135 1707442 1729178
10505 1729178 1673556 1590070 1470247 1345605 1247821 1137739 1016025 875289 790402 747177
10495 747177 701972 676025 648117 600238 573118 547142 508202 487969 471036 455562 419560
10484 419560 410629 384282 376186 385379 370608 331113 341285 334775 365257 381117 358783 328383
10472 328383 319895 331099 332030 375953 396191 410679 405727 374852 330909 313369 318991 328339 363772
10459 363772 379756 362043 363977 365830 328017 309312 329208 309762 284130 258096 265499 292195
10447 292195 287191 298959 321725 312167 293602 292495 297595 318942 293307 265979 259624 247349
10435 247349 242128 261055 252725 239893 264436 259452 242404 236171 224697 238111 254894 262212
10423 262212 280448 257740 230926 232237 205663 211617 215072 220425 229994 215871 197006 186837
10411 186837 168997 172958 218368 256983 235897 210517 190470 197093 219706 249981 255924 255093
10399 255093 238155 247186 259209 252941 227937 188943 199882 222371 216775 216432 238441 221704
10387 221704 181132 176859 181343 196195 202539 207425 205937 223453 216501 200186 220854 234500 233428
10374 233428 222689 200325 230511 267038 259784 261237 250595 271995 315926 321994 304403 302270
10362 302270 321876 338641 346549 336948 327109 336598 332301 331817 335578 362393 373044 353753 370682
10349 370682 387866 398479 420673 410083 388083 391343 396639 421509 427775 387685 378176 375915
10337 375915 399159 418923 463014 478151 504239 498437 475253 498831 513851 523883 525940 506219
10325 506219 518846 535023 538392 562947 572819 562634 559974 583767 604976 645488 650953 638506
10313 638506 618081 608036 635088 662568 672506 660565 666929 708718 739987 708895 670501 689289
10301 689289 724434 724658 730603 731245 721488 746212 745507 729205 715810 732733 764615 771053 757068
10288 757068 750332 777145 781239 786451 791888 810359 810858 826298 851707 850365 840668 865060 882271
10275 882271 878262 870966 877740 911413 944926 972021 999445 1016381 1051455 1125574 1181172 1233265
10263 1233265 1262268 1262172 1273250 1253128 1214184 1161141 1137249 1127504 1091154 1041550 990146 975023
10251 975023 985682 1009715 1021993 1027382 1032351 1044108 1046869 1049041 1037610 1043739 1043454 1016596 1002472
10238 1002472 993246 990454 974453 947661 933695 952817 938207 939123 933478 937394 958663 952843 968228
10225 968228 977033 958838 943714 952416 960178 956769 955349 979498 980644 975963 1010671 1078068 1130312
10212 1130312 1174440 1192718 1236258 1266179 1276319 1298259 1324331 1298008 1294521 1326808 1357515
10201 1357515 1361206 1344441 1345062 1290634 1258780 1255374 1234041 1227084 1211038 1173637 1159897 1172043
10189 1172043 1202478 1206699 1205008 1217323 1247804 1300945 1368087 1428663 1509690 1554097 1554835 1623931
10177 1623931 1709341 1781978 1869081 1959715 2016774 2109829 2232005 2324454 2400834 2490396 2587154
10166 2587154 2645569 2686083 2686575 2666429 2622723 2592933 2587449 2595962 2629313 2709203 2803867 2890755
10154 2890755 2950608 3049464 3154492 3239119 3291832 3362438 3471543 3639836 3863509 4084028
10144 4084028 4372355 4712304 5097302 5505058 5987205 6545912 7199825 7951227 8772708
10135 8772708 9598146 10367489 10997370 11459802 11630328 11508810 11160856 10616643 9983855
10126 9983855 9364098 8778737 8266980 7849881 7511619 7258548 7082959 6950401 6885417 6903842
10116 6903842 6977743 7051439 7182113 7345678 7569922 7860326 8228271 8642901 9092110 9649605
10106 9649605 10342146 11107781 11966777 12945668 14004295 15220975 16594555 18164868 19908485
10097 19908485 21743764 23509624 25032361 26124972 26559885 26340006 25587140 24483626
10089 24483626 23234251 22009342 20968271 20125282 19506742 19049500 18715829 18474844 18285914
10080 18285914 18028217 17680904 17335479 16997021 16646623 16415833 16300769 16326525 16480482
10071 16480482 16787356 17218944 17768376 18425163 19200918 20051686 20948754 21844274 22706602
10062 22706602 23489370 24178806 24771688 25261820 25560167 25620731 25507083 25217870 24788087
10053 24788087 24339133 23900871 23544728 23298215 23204700 23325493 23588579 23912758 24226116
10044 24226116 24470888 24665701 24778825 24867008 24951883 24974487 24915315 24787598 24678617 24643778
10034 24643778 24680375 24886147 25238250 25659432 26019726 26189659 26124275 25767433 25167564 24447573
10024 24447573 23613402 22696444 21669917 20655833 19627883 18611736 17682582 16821837 15985962
10015 15985962 15250349 14635152 14168898 13847637 13700204 13696538 13836530 14085231 14424207 14802994
10005 14802994 15211706 15683592 16150459 16616451 17060001 17530356 18110860 18763896 19518728
9996 19518728 20451875 21472807 22465290 23280823 23734382 23702426 23152543 22116551 20731992
9987 20731992 19111971 17448203 15847153 14357331 13001366 11802070 10725893 9775477
9979 9775477 8947051 8213359 7582937 7052225 6614762 6255143 5962282 5704033 5492868 5340009
9969 5340009 5259625 5199748 5163224 5164142 5202074 5253836 5371813 5553639 5796090 6113273 6498071
9958 6498071 6931050 7434995 7951062 8414175 8777499 8969681 8919559 8656625 8164914 7536556
9948 7536556 6843811 6125435 5483170 4899546 4376496 3902219 3505375 3149216 2856244 2636987
9938 2636987 2477789 2322957 2151050 1980621 1849896 1742410 1636439 1571677 1528602 1459529
9928 1459529 1389639 1334313 1275858 1217231 1137824 1062955 1005848 960892 927194 890534 883371 891951
9916 891951 867922 852663 820760 783272 743460 719912 702240 703715 683426 679885 655218 611892
9904 611892 606392 588976 565333 552726 534222 481110 454931 430942 438340 442712 444428 413191
9892 413191 403312 394999 377924 351412 348648 355857 344713 335843 332248 312733 306978 305752 315112
9879 315112 345818 339837 345301 368956 405426 429087 440530 414231 374614 346105 299176 267532
9867 267532 255441 259249 269594 289608 274555 248110 229630 215701 238921 257494 246705 225240
9855 225240 190335 180469 185413 191462 216389 223237 202691 185702 154023 140153 144735 196245 196325
9842 196325 188676 189026 191585 192964 185888 189615 179086 179534 185912 203219 194658 141455 119977 131386
9828 131386 144909 131211 117704 123994 111159 106567 99942 80846 87614 107537 91999 64049
9816 64049 36500 42029 101905 129711 93522 106034 119419 95064 70120 86252 126319 120996
9804 120996 111563 115225 115695 108483 98282 104715 114753 83528 56288 63696 74467 67494 60053
9791 60053 74312 100517 105359 98917 99500 87519 94332 88917 53059 54199 69693 68309 66761 74632
9777 74632 44690 18083 19782 33000 71361 70584 32556 47320 70333 79726 65892 49116 42297
9764 42297 51221 72173 71381 84350 88312 90457 82820 94050 110376 115673 116416 94313 50550 28557
9750 28557 61195 58707 51914 33290 50122 79689 75110 61729 37394 39800 58223 53987 82051
9737 82051 79846 47187 62941 83154 75834 52642 41664 20080 30004 49287 42848 36193 57890
9724 57890 66425 85983 90093 108756 114584 129519 135233 147389 130134 123530 136429 107586 94116
9711 94116 99346 96974 118277 125730 109289 93575 96760 89917 67129 84734 58402 31201 44282
9698 44282 75704 77904 69071 77809 82112 92129 98260 82895 66722 72738 106570 129442 128238
9685 128238 138759 160489 150990 156365 184142 183399 160540 141909 141775 130075 138853 140779 126517
9672 126517 135186 136181 149616 158907 154547 138405 133258 122263 96481 84588 88475 129473 156405
9659 156405 178506 183556 174484 208766 280326 353986 416004 433315 430830 343756 236227 213327
9647 213327 182974 150466 135404 135044 122532 123773 136806 138668 157117 143922 157693 183365
9635 183365 178825 189866 196933 189256 201330 208545 204470 211682 241668 233152 173320 185795 213166
9622 213166 196587 174794 156864 116945 117805 133923 148508 147123 142141 144874 145635 159491 181723
9609 181723 194065 155144 155647 150040 144398 122896 121765 124200 118604 111838 129417 150832 176584
9596 176584 209915 226540 208963 194507 168904 171817 168484 201726 224927 198404 197258 187498
9584 187498 176031 154779 163787 161414 164232 158553 161332 140025 128474 122439 119074 133302 150487
9571 150487 164357 148212 110459 81106 70710 88936 95338 75184 82607 63601 73257 75993
9559 75993 92886 83846 67888 37729 49439 63925 43128 19791 10398 26760 38169 42589
9547 42589 67165 77110 75156 81160 97047 85120 92703 118824 123801 80094 43736 65141 50191
9534 50191 73574 48915 41764 54231 80130 74999 75255 71762 57257 38823 24589 16616 29275
9521 29275 17851 6511 20361 17642 21485 21838 40473 64165 59290 81715 88848 63975 59972
9508 59972 63027 44804 40914 33858 30364 30225 5878 -5802 2888 12606 7295 15510 57761 76235
9494 76235 99401 118962 92894 84854 86726 77338 94737 86799 70101 56122 41758 53872 43695
9481 43695 74855 74624 47824 37261 24534 20476 7468 2300 -8783 15475 17500 2809 -4137
9468 -4137 -6566 -31104 -38290 -6656 11564 31851 28400 -5994 -20601 19371 -255 -7522 4704
9455 4704 13390 9518 21638 5866 -6001 3457 15475 -4910 -17756 -16847 -26637 -19346 16143
9442 16143 14512 -3729 -26669 -25916 -5940 -6312 -18895 -6779 -21367 -42597 -61776 -60657 -41847
9429 -41847 -41278 -24205 25821 24694 7303 -11410 -16125 1529 -15034 -45281 -30159 12353 21527
9416 21527 16573 -7287 -24628 -33032 -30433 -21977 -9015 2679 -20308 -6488 -17331 -18013 -8336
9403 -8336 23399 47525 61412 67971 47784 26955 14175 3737 14441 11841 4686 24514 54878
9390 54878 87539 59885 33316 33777 12545 10621 5277 -21765 -26421 -20833 -34621 -41538 -31962
9377 -31962 -10842 8724 17147 2019 -17319 -30895 -6467 32831 60521 46980 3746 3383
9365 3383 15920 27552 53627 33431 3468 -5965 9078 18987 38664 22665 28314 45696 91873
9352 91873 78169 76359 69729 81028 71686 36849 24021 55538 56341 60258 60164 64402 46326 33176
9338 33176 44032 43998 30347 11461 5147 -2107 -131 21104 13258 7966 33545 66490 53931
9325 53931 29757 -4904 7712 19242 51414 54777 29034 18584 15422 15650 28579 65323 84672
9312 84672 76555 63523 47784 43329 51677 44569 57484 75097 68929 59919 57174 37754 19045
9299 19045 25848 34393 56072 58690 14283 -18222 21162 61246 33503 1502 -1350 2043 34180
9286 34180 70916 63143 52541 56428 63437 48396 51213 46897 12616 -3006 -6975 -9943 -1108
9273 -1108 -11347 8604 38705 29116 18079 -10464 10072 21408 -7349 -20541 24072 37531
9261 37531 43214 53994 65716 32348 14971 -1890 14405 32603 45914 41027 20751 -291
9249 -291 5179 14463 29222 23885 14765 9069 -7937 -14163 -20026 -8688 -3226 -1883 -1186 -2941 -4185
9234 -4185 -20132 -13956 -1981 16296 2759 -11768 -28157 -51315 -57385 -23309 10461 17035 -15571
9221 -15571 -7219 8702 -5666 -12294 -4840 -1655 1994 8812 13691 17951 -819 -18389 -29782
9208 -29782 -23620 -16278 -4029 -4372 -7537 -10989 -2592 2574 1510 -688 6396 7859 13413 -7385
9194 -7385 -10964 -10240 7503 2108 -19350 -16374 -27541 -993 9287 -5117 -18884 15985 29902
9181 29902 36420 54754 21258 4115 7231 35661 29514 12527 32042 26806 7859 6490 25637
9168 25637 38780 18208 -21063 -40234 -15746 9393 12190 8603 32210 46676 43911 31309
9156 31309 20149 36977 63560 34228 18808 31541 32275 35123 20569 9586 24969 45072
9144 45072 53486 55399 48373 36672 39498 15663 5001 9238 19291 11104 18497 14051 2409
9131 2409 17189 303 -12178 19154 15293 22609 36752 54527 36412 14889 32271 38081 25088
9118 25088 26831 48666 44728 62484 56874 45512 34784 8018 22564 38285 24085 29465 6841
9105 6841 -4486 6325 31805 44649 41745 42904 37170 43136 20455 9311 1477 3698 26215
9092 26215 33034 21575 22238 18822 27526 24814 26136 28054 30235 42648 56088 53147 61476 46695
9078 46695 56656 52717 50377 45791 31948 20272 52799 106196 104408 93898 79998 58030 15521
9065 15521 -13007 3018 13401 34490 50330 59442 45143 36132 36882 41397 20480 -6939 11841
9052 11841 15394 -27381 -29475 -259 36298 37108 23120 9531 11119 16226 3472 -21544 -9690
9039 -9690 -19258 -24379 -28790 -4761 2511 10927 25661 19980 23212 14142 5522 21121 23959 20140
9025 20140 19463 24665 31797 17096 25278 17589 44425 42325 20286 16897 27111 47592 72239
9012 72239 73912 64843 56194 43749 28572 19402 26117 43467 20423 26687 41705 27197 34475
8999 34475 26720 29191 16518 32120 -710 -19643 -20880 -1780 -5003 15807 38668 45056 45313
8986 45313 78984 65754 62875 51105 30608 28697 9374 -4833 -10597 -18025 -37248 -14380 -3228
8973 -3228 -7574 -6389 -16709 -28958 -33288 -18397 8941 3712 164 7655 25000 36402 55767
8960 55767 72184 69634 59405 41218 26517 -3403 -5220 -7188 16753 33371 40065 45352 25776
8947 25776 28803 47429 30096 50866 43031 23015 25065 5530 -31184 -47765 -19193 -2375
8935 -2375 2151 23694 44734 40123 43911 46741 53938 17877 -2399 14434 58017 64845 36095
8922 36095 17323 4592 -2794 5504 6134 -1775 6705 -1794 15325 19603 5936 15290 20021 1469
8908 1469 13040 10963 2009 5241 36495 35050 16013 7078 5400 22696 42367 39781 54925
8895 54925 64023 52751 23695 -13953 -25895 -24966 -2588 6601 23405 27476 13939 134 5444
8882 5444 21536 34719 31384 23960 7094 9352 450 -34974 -53342 -44528 -4233 39910 53149
8869 53149 25008 5354 32985 61805 65149 54082 40715 48857 11431 -12378 -761 6511
8857 6511 33236 42509 41412 49582 90369 110553 95753 73619 74080 64513 72342 82876 62252
8844 62252 52753 64115 45165 42002 36895 52051 58647 77169 91974 98087 130321 220404 347786
8831 347786 454641 498995 461709 346834 264381 184760 117328 79682 66891 48384 82864
8820 82864 96296 78927 64304 54758 79034 92947 87706 49241 40391 24280 27405 28490 24651
8807 24651 28730 29990 7167 17933 40503 54725 51972 44870 36520 61199 70169 61863 44014
8794 44014 50629 40627 30042 29065 21154 -1034 -28365 -18621 -15945 -6204 16242 23959 24091 4776
8780 4776 -9938 -6545 -9175 10232 19826 10783 21276 21953 19953 28241 36331 51930 27539 3880
8766 3880 23765 14339 -14986 -38132 -26218 -11034 -5644 -2645 19896 34934 31466 37957 41742
8753 41742 57341 15432 -5153 15225 28115 54382 43475 8712 18917 54826 63137 68504
8741 68504 64747 40081 19052 27857 40638 19906 -6928 9 1920 38928 68667 64440 41841
8728 41841 54511 67338 67916 56704 6832 5661 41788 78133 70987 40826 20432 7413 -4947
8715 -4947 9217 12569 41106 65767 65481 40544 30263 47291 53315 75550 80508 81307 64676
8702 64676 83427 99698 111139 56475 63517 100090 136095 157066 149432 161928 141229 100771
8690 100771 100200 116818 102945 107405 74015 56509 70156 98208 111013 107953 107830 111574 99284
8677 99284 79034 65618 59955 83757 99399 109366 108230 111932 139390 140102 147931 152050 133983
8664 133983 119940 152403 190048 186216 168523 152786 149358 155952 159872 186416 201769 215006
8652 215006 209881 214676 241808 228954 229841 239716 231062 202099 207786 208162 188678 186703 182382 183275
8638 183275 197516 203424 207011 238306 232359 218940 224515 247182 253735 249305 267449 282231 304657
8625 304657 333260 338069 347735 343340 337768 342863 373576 377200 374140 392967 368390 368009 402151
8612 402151 423526 460068 459907 484327 501649 519363 540586 576650 613200 660300 738743 805751
8600 805751 844246 885721 956177 1031862 1074998 1130737 1162609 1175764 1169834 1159741 1153571 1134477
8588 1134477 1106865 1049740 981496 930076 909530 858216 812518 790976 753989 736434 702112
8577 702112 700295 683295 634204 608256 589279 583522 580622 586789 546059 486446 452063 417900
8565 417900 412392 409805 370237 328788 297094 275124 268452 275092 266769 257304 265785 224371 202555
8552 202555 188595 176027 181666 197418 186928 122976 97256 132924 149390 163487 183228 180833
8540 180833 170307 181201 179094 152600 137284 134333 162763 165346 166042 156096 152234 142835 110831
8527 110831 92301 78982 93384 58197 29874 43836 27033 14772 41217 50495 61848 78811
8515 78811 66778 72455 69265 40141 35977 36754 23826 41257 65823 49939 20939 15934 17173
8502 17173 16637 52705 59373 73178 60220 53507 57929 54185 54734 59394 56987 55528 85255 92887
8488 92887 62213 18970 4381 -28260 -36471 469 12448 17099 25794 48207 56043 42954 46651
8475 46651 57560 40285 9160 20733 38644 44823 63859 35068 9137 -286 33915 50374
8463 50374 58854 39095 22991 29747 23343 29213 39203 48567 54897 69722 57978 58656 32420 -9985
8449 -9985 18151 31578 27421 31132 69788 56765 51165 70340 97434 109957 79631 87904 105523
8436 105523 87381 83910 99289 99678 66871 51005 72248 42029 35840 35384 45922 51707 45396
8423 45396 44027 25762 33279 40604 64333 79576 66400 44821 28942 21784 17472 32190 54046
8410 54046 63937 63834 47629 21978 22600 68650 97295 68281 25130 26491 41544 77899 83638
8397 83638 99677 130038 126533 95606 80275 72021 71397 58415 33160 28265 52963 60408 22181
8384 22181 8030 7710 27787 18264 -11994 -4819 19115 16368 41851 63801 56873 33272 6958
8371 6958 7434 27914 13477 19755 53340 88252 77618 69019 67552 66344 53608 39998 16723
8358 16723 -2190 23414 39339 26544 31732 36008 21902 17130 8327 5242 13706 21951 23575
8345 23575 27994 43378 28524 41608 56075 54172 17265 7450 29665 45525 66248 83679
8333 83679 78194 71963 39723 38112 69677 52813 35755 34841 20001 27200 30857 39727 51701
8320 51701 63844 83225 79665 67295 46293 40204 51140 17806 21492 15424 16061 30624 29887
8307 29887 26085 24855 23064 -12177 -154 10790 23154 39605 58748 52019 29713 12571 27598
8294 27598 39920 45110 22124 -9739 9066 12271 -5931 -8543 18237 67117 90000 67093
8282 67093 46138 11399 -689 22617 41976 65877 71689 80198 66707 46101 30344 12666
8270 12666 -9931 -4555 7628 15637 1379 -7918 -2167 8119 2625 -10484 -11134 -1051 -15638
8257 -15638 -10897 13593 31198 4798 13476 40580 58217 55112 32285 29346 31199 38147 61304
8244 61304 76139 50227 17187 -14131 -32265 -8430 -8430 3495 17578 42857 58337 50562 16434
8231 16434 15510 10636 4808 17387 -26 -11086 -4424 4886 -11771 -1209 8631 15293 7421 487
8217 487 -4218 -17279 -34411 -20753 6067 -2661 10502 12261 29784 12627 7377 17859 28043
8204 28043 14601 18915 11580 -29904 -42172 -25144 -9173 -23600 -8343 -4666 14693 11774 -2635
8191 -2635 5100 -12249 -5894 17144 40585 19701 13438 26724 20148 27750 68347 73654 76867
8178 76867 58730 30048 -30499 -33131 -17426 -8456 1809 -10231 -17122 27052 48283 35678
8166 35678 5271 -12224 520 43685 64669 53526 26101 -4465 -4638 3992 6551 -14168 -16448
8153 -16448 -9447 -20339 -10584 -8577 9699 25807 50563 63481 45075 10002 2573 36928 123542
8140 123542 223874 308372 346187 314102 243190 158531 103415 69472 40278 20533 18971 39342
8128 39342 61939 50654 33493 -1787 -17502 -5819 10354 -16690 -31669 -26415 -3093 -5737
8116 -5737 17681 44601 49365 56272 7291 12370 15940 19672 17553 16258 -6692 -12198 9554 42104
8102 42104 74956 104357 130762 152657 220516 232775 242000 202820 128974 61883 9986 -26945
8090 -26945 -20695 -11047 13381 44469 39361 24152 7008 -6276 21178 40097 53563 47353 43713
8077 43713 19010 -14932 -12372 3209 -12165 -10197 -15560 25338 20123 -7986 16232 2793 -24968
8064 -24968 19441 50520 45479 42076 33634 9059 -6149 -10437 8718 28969 37434 35898 26237
8051 26237 40428 61269 71056 69484 51487 53346 51217 33560 22996 38614 47436 38141 32489
8038 32489 50154 90903 123869 132641 125229 136161 127031 145528 196098 219325 228240 234596 265586
8025 265586 334061 388238 409157 423791 410348 400527 415896 433470 406714 417774 438748 444656
8013 444656 445254 435805 412493 400176 360364 350872 352144 340144 328902 315272 288920 274513 292261
8000 292261 299035 318715 352951 334759 333237 342979 346754 364567 380627 429024 452135 478093
7988 478093 549455 646199 771843 966019 1259742 1641935 2010661 2220334 2169802 1894286
7978 1894286 1525143 1200043 970563 827603 721896 648716 643809 632731 614650 610286 576348
7967 576348 497898 440206 397276 378152 352499 319145 284154 282367 293592 301465 311563 313686
7955 313686 311846 305474 300621 299547 298246 334296 364407 399854 484665 537171 597203 662889 766024
7942 766024 931219 1138103 1366233 1528243 1594208 1541901 1365521 1129094 898503 743102
7932 743102 623146 546576 506694 468701 441143 421870 398427 372993 338635 322035 311445
7921 311445 295404 292181 259895 224195 213396 178822 175586 174693 166309 126235 110417 135453 146938
7908 146938 162298 206553 235464 274946 283395 245850 208978 167923 133735 124725 119480 141761
7896 141761 149028 161163 216448 240493 243270 248090 270492 253017 240889 226746 198059 136482
7884 136482 113742 92009 68063 60497 35519 42051 58691 50974 41294 41269 40852 62428 55417 47166
7870 47166 6571 -7715 719 10246 9211 -10804 -6468 13658 41249 27570 -2572 4718 -4068
7857 -4068 54 -11099 -11745 -24508 -15214 -22093 -19761 -6630 10371 23326 38692 59683 61264
7844 61264 43484 46089 57983 60956 64370 51988 33568 17645 -5741 -20426 -32934 -83297
7832 -83297 -104027 -45651 -11009 -1016 3155 -22844 -28531 -15013 -36899 -33837 -46844 -42961 -32898
7819 -32898 -28279 -10847 -10862 -21138 -735 22455 9263 -4520 617 -12370 -8024 -15200 -19100
7806 -19100 -7525 -20650 -44699 -47530 -41078 -13391 4212 7337 12435 10160 -22093 -45291 -29566
7793 -29566 -10333 -6761 7182 -10255 -31233 -40798 -42128 -45864 -37623 -14313 -3838 -20604 7382
7780 7382 19017 3335 -9387 -8399 284 -5034 -20114 -47013 -35212 -3421 18962 7028 -8582
7767 -8582 -27496 -10163 -24515 -25787 -37559 -31124 -12221 10132 1122 -11786 -8212 -5157 -24299
7754 -24299 -42450 -31736 -18334 -45022 -40399 -30555 2179 18998 4201 26660 14499 -20639
7742 -20639 -6029 22835 31413 22213 2314 -6469 12604 22222 845 -50161 -45414 -13834 -31322
7729 -31322 1606 25208 21880 14540 -223 7954 8222 -21759 -8812 -2958 20127 30739 34277
7716 34277 49478 45152 38758 48321 29191 28724 8753 2211 3445 11309 1742 -8674 12451 -14166
7702 -14166 -46652 -56465 -82381 -69819 -55534 -32492 -28635 -43064 -54369 -22353 -3275 12790
7690 12790 -1249 5632 6714 -14940 -22756 -26579 -37012 -39763 -31341 -10242 2864 -3072 -34735
7677 -34735 -35794 -21923 -15978 -32752 -17483 -13022 -8843 -1321 -892 30788 30805 9410 -1062 3060
7663 3060 -12404 -21792 1895 25890 -10467 938 -9317 -8249 6380 7120 -22990 -29419 -38219
7650 -38219 -58925 -57035 -32364 -37692 -55164 -41888 -15871 11965 24094 11665 -8891 3292
7638 3292 10661 7706 4806 3540 125 -24376 -41637 -29352 -25392 -30080 -29936 -64491 -50665 -49343
7624 -49343 -38850 -10499 5585 -9516 -31642 -14215 7277 -6065 -27813 -27493 -16681 -44843
7612 -44843 -38860 -42778 -57687 -45347 -35900 -29937 -16439 -38091 -34934 -38117 -32843 -21245 -4072
7599 -4072 1776 -14405 3024 -5726 -20890 -31659 -11063 -8367 -12345 -5854 -8203 -6105 11208
7586 11208 10714 936 -34189 -36768 -21986 -24069 -3623 -1870 -1640 -37804 -53958 -55175 -47542 -22984
7572 -22984 -10023 -16665 -32560 -17356 -11885 -1878 32915 25709 125 -11500 -472 -2581 7853
7559 7853 9894 -360 12394 16793 11851 5548 1301 -27235 -34555 -42380 -52753 -46752 -45963 -12389
7545 -12389 13627 9224 25026 33306 40892 54423 56899 29722 13184 8358 23805 17953 17544
7532 17544 16071 46485 61544 56250 51405 44481 16675 22460 24101 37196 20900 1913 10463
7519 10463 16943 31809 31126 10117 -188 4407 -24208 -47445 -30285 -36919 -30649 -48411 -9781
7506 -9781 14334 3546 -27322 -27847 9538 53634 67978 21035 2931 12732 -329 -27222 -17457
7493 -17457 -3886 -32385 -38048 -17450 7268 6736 8100 6675 4799 453 19134 36789 23892
7480 23892 7456 1561 -19172 -35800 -40494 -30847 -4432 3777 -14550 -16810 1955 11177 -26330
7467 -26330 -31605 -17059 -15909 8050 26560 20984 22312 43007 48848 20370 30023 25642 16780
7454 16780 -12833 -14457 -23313 -15928 6629 32970 38678 28330 6738 -7341 -17948 -27823 -1898
7441 -1898 11423 4743 3216 22543 -12626 -49957 -71961 -52652 -13249 -10573 -14026 -12646 -12364
7428 -12364 -6027 17800 -9704 -53343 -59355 -38201 -31343 -38655 -4956 23388 15849 11994 -4432
7415 -4432 495 20762 17043 -11095 -49042 -45193 -33232 -10763 -12006 3972 -7626 -37901 -56457
7402 -56457 -58294 -37704 -38027 -30564 -50805 -56021 -47986 -41763 -49291 -64062 -48808 -42827 -33731 -8067
7388 -8067 2039 8448 14496 13895 2533 -4004 -20091 -3550 26072 40421 35729 -4571 -23014
7375 -23014 -27052 -26919 -40160 -10864 29351 11870 -6898 2503 1943 -10122 -15885 -11097 -3028 8575
7361 8575 10466 -15252 -21226 -12257 3807 6167 9266 -11657 -980 -12726 -18347 4596 18451
7348 18451 11919 -24888 -35867 -14932 1763 2530 12682 -8922 -19944 14312 16272 26501 29404
7335 29404 3549 -7406 -16428 -32051 -26807 -6906 -8731 -28193 -36719 650 7706 -24304 -31542
7322 -31542 -20189 -13602 9941 21547 21878 13647 24920 21201 17530 13775 -26 586 -4235 -13142
7308 -13142 -11934 -13743 -7051 10347 21195 15193 -166 -58580 -66854 -37234 -19247 -45748 -35906
7295 -35906 -2749 -9513 -11157 3273 31460 28424 2226 -13251 -5593 8453 15047 21707 2261
7282 2261 -6276 -5097 5355 9652 2821 -10772 -1276 -3853 9193 22957 11631 34181 31817
7269 31817 -2665 -35527 -31017 -16592 -30731 -37039 -43484 -53580 -68320 -53565 -37526 -33024 -23039
7256 -23039 -36567 -25544 6599 2188 -19273 -28698 -19952 273 2365 -7409 -31407 -17431 -22380
7243 -22380 -37564 -38142 -50434 -54031 -50840 -28263 -14890 -4612 16630 19404 5737 -26703 -34546
7230 -34546 -46601 -59740 -47395 -47075 -54094 -63052 -47471 -50997 -47680 -33095 -37110 -60826 -48202
7217 -48202 -29820 -14647 -2136 -28173 -29874 -47923 -62180 -36198 -44646 -35315 -28154 -23879 -25181
7204 -25181 -46107 -54049 -47430 -39889 -20345 -21223 -30678 -40261 -38428 -23194 -20845 -16410 -16781 -24414
7190 -24414 -23711 -8476 -16437 -8157 787 -9195 -32373 -35086 -10686 18558 31477 12124 -17424
7177 -17424 -21737 -23212 -4954 8069 13367 7699 2936 1964 -6062 -11574 -8356 -9724 -11691 -32174
7163 -32174 -33911 -40973 -64979 -47397 -41898 -46534 -25841 -12288 -39950 -61813 -57057 -38032 -20926
7150 -20926 12181 10888 -9860 -32903 -15176 8858 -8586 -13947 -18722 -3745 -9970 -17613 -49695
7137 -49695 -46917 -25134 -21851 -29038 -48888 -46451 -14729 -2140 -30396 -38252 -12839 -13521 -20995
7124 -20995 -18049 -22445 -18555 5198 8920 359 -9098 -15536 -26493 -20175 -10911 13703 126 -3604
7110 -3604 18076 16649 6162 12990 19130 14721 -9660 -19611 -12549 -18131 -11802 -4004 2101 3350
7096 3350 -16651 -3270 -14971 -24552 -44888 -58577 -32465 -33610 -37041 -33354 -30009 -36750 -49028
7083 -49028 -42497 -15937 -1036 -17320 -42953 -24289 -5324 2867 -21371 -34526 -24600 -17264 -27712
7070 -27712 -16854 -8013 -27637 -32853 -20761 -33662 -21318 -108 -20155 -22207 -26343 3967 327
7057 327 16865 -4096 -11504 -21237 -9698 -396 16130 58251 71673 34075 15367 -992 -8601
7044 -8601 -10431 -16267 -21001 -17962 -9530 -5633 -2673 10991 15274 39485 33927 10340 -14036 -32220
7030 -32220 -18121 -2306 2513 3454 21979 10916 3575 16270 -15006 -29736 4265 -10317 -30372
7017 -30372 -42341 -42212 -50149 -33812 -19171 -21667 -1849 -3187 -15538 -16076 -28143 -17586 -6326
7004 -6326 19869 15152 11017 14636 12192 -11192 1842 23353 7820 14999 22180 10227 -17299
6991 -17299 -32565 -9573 -5550 -13294 -30243 -50105 -40780 -22012 -15292 -26848 -19556 14497 -1054
6978 -1054 4987 18655 14482 23418 -2362 -22035 -21753 -4351 9777 17511 12810 -3823 -5891 -7346
6964 -7346 -1598 27769 48005 32740 18277 41738 32794 28535 2709 2237 36891 42698 51413
6951 51413 45587 24134 23209 27599 57289 35177 1234 1311 -261 -15746 -26767 -3640 753 28645
6937 28645 25134 7250 21567 13312 -20596 -23501 -29527 -1811 28026 15478 16667 9023 1790
6924 1790 -12290 -33660 -7405 19583 42750 30179 20037 33189 28835 28729 9875 -3770 10107
6911 10107 14229 5244 4562 7733 -3869 -18500 -4742 -9926 -1805 -9074 -5372 -1835 5243 -2228
6897 -2228 3768 15088 25313 13203 -6703 9228 37000 15265 -20134 -27546 -32240 -18506 -6405
6884 -6405 -21876 -20104 -11549 -1362 -13871 6378 4559 13134 -11217 -27180 -29719 -11522 -19562
6871 -19562 -29088 -37949 -38784 -22728 -17843 -37605 -33170 -37523 -51996 -37630 -48931 -57330 -27298
6858 -27298 -26589 -16519 8276 -12587 -17332 -4646 7450 16958 7430 -21403 -40770 -39159 -33403
6845 -33403 -43371 -22370 -1945 2669 -9772 9107 27702 3836 -18081 7068 10276 -9023
6833 -9023 -5659 -27090 -50986 -71661 -57886 -40268 -18498 -2777 -2139 -10388 -39114 -47463 -39880
6820 -39880 -44071 -39689 -47774 -26122 -31475 -61375 -58832 -48279 -36036 -32339 -36878 -26108 -29045
6807 -29045 -31267 5259 -13150 -21547 -20832 -33352 -44228 -37052 -22172 -20450 -38645 -25197 14977
6794 14977 17552 7643 9419 -16595 -13581 -5510 2344 27826 34531 26696 30922 22058 3187 -23046
6780 -23046 -8654 5224 19248 18984 26658 19378 6080 26356 25086 -5420 -14100 -18466 -9644
6767 -9644 -18906 -10044 6988 9525 -7506 -48875 -62246 -47850 -7865 4212 -14833 -20701 -16063
6754 -16063 -10476 5339 11393 -16181 -28807 -39353 -38672 -22931 -21542 -25045 -28368 -24605 -7871
6741 -7871 -2875 -20795 -3795 14521 16043 -7104 -12136 -37223 -46116 -26610 -16377 -7093 306
6728 306 10060 13642 -12598 -23542 -37285 -44778 -36338 -20682 8126 5258 -14033 -1329 -5754
6715 -5754 -13737 -25515 -17374 -12401 -8260 -14485 -1923 19244 8188 -2939 -20613 -11172 15348
6702 15348 19255 34287 21619 19055 30939 30127 38399 20926 18236 39307 42958 31849 -1141
6689 -1141 -5752 -8328 -22607 -33703 -43540 -31815 -2309 32086 22712 18817 28949 32404 41547
6676 41547 24926 -16663 -39164 -25600 12959 44141 24059 21347 -3256 -37162 -36738 -19494
6664 -19494 -16413 -12660 -5720 -35493 -43818 -37699 -30288 -27649 -2146 8975 -7755 -5899 -9643 -13080
6650 -13080 -13466 -10071 -2363 -24044 -28893 -47561 -53852 -46145 -53450 -43512 -26762 -2042 23958 26642
6636 26642 6356 -5624 -15565 -19425 -15324 -18360 -2668 18145 21983 24004 12073 12008 13715 14129
6622 14129 11624 9128 -8141 -30827 -13152 11704 32137 51583 57048 67274 36246 36606 17524
6609 17524 16616 28356 40545 10591 -16437 5354 23512 37076 35137 44092 36785 34109 27324
6596 27324 21347 26235 10164 -7643 -19267 2343 33896 23058 13067 10462 -140 11615 37676
6583 37676 25246 -14549 -19042 -34624 -52951 -18813 5851 -12670 -21927 -18952 -13741 3386 4411
6570 4411 915 6538 13064 13242 -11966 -18961 -4701 17202 30719 23344 22687 5560 10406 19941
6556 19941 29922 16767 10486 21202 31985 30010 23135 -11945 -10364 6714 6517 15823 5823
6543 5823 5701 -3319 12854 2527 -22002 -44937 -54832 -25579 -3374 -4032 -13719 -32834 -31226 -10843
6529 -10843 -12046 39554 33564 12257 3418 16117 31660 30582 -298 -9132 -18835 -21171 -29697
6516 -29697 -24824 -21343 -7927 11697 25970 25627 -18234 -46784 -39374 -7834 834 -6891 -10930
6503 -10930 -8605 -7092 15249 38234 25132 5093 17131 14776 34794 29005 10908 7110 1099
6490 1099 -13360 -18104 -13179 -8544 6028 7151 -13157 -33634 -46265 -34988 -47025 -65286 -86208
6477 -86208 -50416 4883 31684 25165 22193 22961 24790 20430 1044 -31854 -54165 -51519 -49592
6464 -49592 -55452 -26804 6036 -1575 1964 1670 1771 1640 -14683 -4665 949 -23743 -20081 7798
6450 7798 11320 13180 16533 6803 25533 27540 5322 -27919 -30991 -49567 -65317 -58338 -38894
6437 -38894 -37747 -18576 11908 30887 35964 33190 18571 -17366 -38506 -52550 -39678 -39591 -20100
6424 -20100 -783 19134 17216 25798 17258 15992 10403 35818 39777 17322 7702 23930 53768
6411 53768 24708 -8825 -29538 -15869 3337 -8038 -24971 -17644 -15671 -3401 -1138 1679 -2101
6398 -2101 21609 32316 26133 4192 -21832 -45512 -41210 -20128 -8138 -8129 -37938 -33094 -15692
6385 -15692 -12129 12254 13877 -1589 -9973 -31269 -32645 -22771 -30336 -32164 -24048 -43303 -39626 475
6371 475 -3415 -6551 -27491 1011 32149 -9591 -4027 7563 -24241 -27787 -14937 -15751 18379
6358 18379 33669 38431 11019 11812 -12815 -34501 -35810 -9295 1959 -1467 1579 -13616 -19596
6345 -19596 3557 -482 -9190 -15404 -13290 -1 -6410 15402 -6227 -28636 -9527 16445 891
6332 891 -18342 -6385 -6131 1195 12684 -4200 -20303 -25084 -30825 -45255 -30482 -11875 -9401
6319 -9401 -2968 18182 32645 30932 3529 4054 12783 22246 1233 -8796 4554 20345 43260
6306 43260 38946 7504 -23808 -42064 -47419 -39620 -45182 -37682 -20429 -10871 -1822 29831 36005
6293 36005 11629 -667 6827 24186 46436 39514 17026 12583 35775 35591 8228 5022 17108
6280 17108 22108 24501 19561 -8932 1978 18630 1114 7002 8869 -4081 -7903 -1345 -3286
6267 -3286 -14384 1737 37630 34360 20826 21801 1281 35027 49566 50998 34144 29181 8421
6254 8421 1854 5663 115 -21339 -19758 -3004 10045 26237 1503 -12108 4385 -11466 -26420
6241 -26420 -5830 6534 10961 29924 11861 11571 5906 -1078 11881 37502 10865 -22640 -19278
6228 -19278 -15875 -30523 -31971 -8439 -373 -19331 -38288 -26244 -12930 11140 15938 -417 2908
6215 2908 12599 9 -49 32415 30693 21804 9355 12498 17296 4372 -4530 -7287 -9026 10514
6201 10514 13759 -16264 -30751 -6531 -536 13565 23143 27781 34137 29131 27566 19201 2147
6188 2147 3764 2098 -14501 -22962 -17817 -28085 -17290 -19071 -14874 -17775 9838 6734 5388 -161
6174 -161 -5184 -26419 -27869 -19349 -13679 -8547 4837 18242 13706 19335 29842 15669 8622 -3447
6160 -3447 -13311 -27209 -21624 -33394 -30937 -51010 -52750 -31163 -16246 -3033 19241 14775 4571
6147 4571 1065 -22223 -33743 -28020 -29404 -37509 -39791 -2725 1129 10835 7884 16264 19461 21764
6133 21764 28947 44088 29957 13335 189 -4376 -16073 -25350 -9601 -18026 -47214 -49218 -18202
6120 -18202 -17757 -34081 -47195 -49730 -33083 1127 4794 3114 -7662 -19106 -13419 -9706 -10738
6107 -10738 -22685 -9767 12888 5119 7152 -18697 -49530 -52823 -52012 -29707 -24678 -22669 -26614
6094 -26614 -14572 5055 -5949 -24382 -30636 -35050 -41215 -38813 -32142 -32769 -16851 17055 10100
6081 10100 -3337 4183 12671 334 13233 4840 11215 17048 3220 -5023 -8635 -6806 591 1959
6067 1959 -8325 -29113 -40622 -66020 -54351 -30586 -25097 -34383 -35681 -52271 -26687 7186 13607
6054 13607 10859 9003 44646 11946 -20166 -12593 14658 5901 -9053 -5976 -17763 -28350 -26239
6041 -26239 -25608 5419 20871 27310 15634 -6264 -33475 -30077 -10960 7444 4111 7291 40884
6028 40884 20853 332 3132 -6351 5062 -5828 5395 -3619 2450 19314 34253 12374 -24544
6015 -24544 -36521 -33915 -59477 -41291 -34744 -54980 -7988 11712 -21006 -37974 -36174 -25153
6003 -25153 -39308 -22573 -6502 8614 13277 -25247 -37310 -40931 -36799 -16053 -29744 -31352 -18255
5990 -18255 -24215 -14101 -5267 -5586 -1883 -12427 9135 43017 16729 -23572 -14362 689 8590
5977 8590 21919 26089 14756 3979 -24866 -17135 16343 11907 31530 33776 -2745 -21274 -23285
5964 -23285 -20441 -9563 -9021 -13763 -35806 -57109 -54091 -18398 3931 -18677 -7902 4054 -7993
5951 -7993 -16421 13156 32991 20209 16023 13121 17130 -12078 -51917 -26201 -11734 -21280 -22111
5938 -22111 -39009 -55621 -55801 -5556 19313 19540 39629 25453 8699 14231 13063 4920 11735
5925 11735 21780 39700 30608 12633 13594 16039 3681 -22003 106 12796 -14638 -31268 -22917
5912 -22917 -30777 8187 26017 25047 -1955 -12271 -9556 -9777 -1028 -3473 -9740 -19666 -2318 -6273
5898 -6273 -31875 -49857 -33073 -28085 13375 32061 16600 26568 21505 18769 -12703 -13831 -5909
5885 -5909 -870 -508 10676 21839 7006 -1033 9030 20549 27289 19270 24910 50413 27878
5872 27878 6453 -4117 1617 9155 9870 -15509 -33967 -43581 -27922 -33786 -37350 -23923 -17902
5859 -17902 -10543 -13023 -16722 -9005 -26898 -22460 -11984 -8990 -24954 -19915 6868 10797 15910 4957
5845 4957 2932 16300 17088 17055 -1982 -30698 -29347 -11587 -7828 -17670 -40191 -52923 -58748 -72421
5831 -72421 -64721 -31501 -38627 -30315 -11331 -6141 -25079 -40321 -43967 -38685 -26270 -55946 -63400
5818 -63400 -53068 -50689 -50520 -44004 -45400 -43783 -31818 -18131 -26298 -18301 2963 20037 26247 16822
5804 16822 -10877 -8167 -15585 -17283 -32416 -41340 -25765 -32722 -54856 -34686 -13746 -8189 -20812
5791 -20812 -15256 10284 -1261 3593 4790 13707 7515 -8864 -6263 5033 8331 -542 9698
5778 9698 -2531 -17653 -17061 -21941 -26149 -31094 -21353 -12386 4964 -12029 7532 3822 7936 6933
5764 6933 20675 28894 38311 17828 2204 -7893 -19164 -7340 30921 41034 26914 27719 -1491
5751 -1491 -37095 -33125 -37940 -32471 -36552 -66635 -81180 -83787 -44221 -35284 -24977 -4611 5253
5738 5253 8400 16049 14672 2251 -21400 2973 -1584 -24847 -11533 -27818 -30745 -28575 323
5725 323 952 -22642 -23852 -1002 515 -14466 -20660 -38003 -42892 -47337 -14197 14143 19590 -1017
5711 -1017 -13177 -10599 -17055 -27951 -33168 -37884 -57527 -58030 -35594 -16994 -22333 -25096 -19441 -3198
5697 -3198 -25292 -31151 -31572 -37508 -26926 -23415 -2972 29346 37733 32218 23092 26730 15138 6037
5683 6037 -11857 -24813 -7526 -17151 -7540 -8067 421 13983 14867 -8423 -44049 -32873 -21500
5670 -21500 -10965 -13169 -28357 -22980 -8514 -17829 -15541 -8491 -21492 -33373 -42959 -17006 1844
5657 1844 12830 29418 6162 -7044 -689 9557 34703 49705 58422 31976 5377 39321
5645 39321 45805 22298 3931 -1343 -29724 -48529 -64792 -52707 -41896 -39126 -36366 -29581 -14784
5632 -14784 1455 6836 -16012 9673 44020 28011 22464 -12990 -28021 -31645 1124 5710 24381
5619 24381 15411 -5462 -3207 13973 19617 25898 -1580 -26545 -19644 -28048 -25498 -24134 -4350
5606 -4350 12510 17351 19720 40019 40382 29328 35573 23789 -410 -11952 -16095 -16393 -9241 7987
5592 7987 -8328 12113 12904 -13659 -26317 -6172 81 -30440 -60893 -57615 -34319 -23877 -24764
5579 -24764 6688 13636 14832 44426 53950 50946 44059 46082 43909 44998 57033 54992 8584 -13258
5565 -13258 -27125 -22111 -17968 -6794 11154 7672 40060 42687 27706 24515 12973 3301 -36550
5552 -36550 -60044 -49146 -39483 -20961 -25741 -21767 10535 9929 8217 15531 10844 13890 10574 -9132
5538 -9132 791 -4298 -16791 -26404 -7476 17487 15712 10773 -7591 -17760 6169 -14914 -20986
5525 -20986 -31626 -24742 -15735 -31963 -48584 -11372 -10240 -832 7319 2753 -23387 -24647 -29435
5512 -29435 -47307 -37021 -3837 599 -25515 -33556 -30614 -6962 1477 3075 20639 33539 7203
5499 7203 -24184 -27459 10413 28285 29873 29959 33992 38686 42690 10418 -27442 -20052 -7546 -8232
5485 -8232 -9408 -2515 -4045 10365 13425 9409 -7324 -9730 -1455 1945 5755 -562 -11638 19698
5471 19698 49731 37141 35122 -2545 5205 6585 -15297 -9925 12412 39682 31539 6792 -10440
5458 -10440 -14642 -9399 -24193 -37503 -30075 -3489 5493 3511 9233 -9593 -21496 -26106 -29895
5445 -29895 -10922 11649 6391 27493 402 -15170 -13739 -14450 -25157 -12398 13288 280 -745
5432 -745 -18248 17904 -18352 -33651 -31022 83 -1724 10901 18200 8890 -13404 -12094 -22879
5419 -22879 -41337 -7679 11344 4402 -9829 -41647 -40449 -5070 -3032 -35 1301 -5526 -6166
5406 -6166 -2231 -17801 -14619 6603 -16380 -18170 -34812 -29588 -23376 -3707 9979 16624 26386
5393 26386 32065 10765 10629 960 24131 23792 -4877 -8205 7780 -18840 -44727 -44612 -22048 22345
5379 22345 29423 18680 25819 -8372 -6907 -8810 -4045 -7355 -13956 -25913 -22031 -3930 24902
5366 24902 26001 2523 -9771 -5515 -13211 -13112 -4343 2554 -23399 -34775 -36628 -59564 -32345 -9672
5352 -9672 -4247 -27164 -34013 -26352 -5445 -4730 20968 49479 52225 75024 60931 25502 -1319
5339 -1319 -276 -5354 -1871 1763 5034 22131 9586 -30340 -39085 1435 32960 10208 -17696
5326 -17696 -28239 -24469 -7118 -176 -3040 -21517 -26070 -5898 -18689 -14813 -5065 -866 -33240
5313 -33240 -46494 -52078 -45393 -34432 -14686 -11391 9408 21048 7183 -19500 -20563 -3658 -10909
5300 -10909 -8086 -6723 12935 8566 -17103 -32423 -27339 -9253 5554 1387 5358 -1610 -2181 -186
5286 -186 -16669 -28332 -34062 -35303 -7994 13871 34341 22062 7352 -12522 -23125 -343 -12899
5273 -12899 -7617 -5347 -28415 -52205 -50538 -34813 -35061 -41928 -46059 -46496 -33740 -13761 -9403 6434
5259 6434 24151 7088 -20860 3436 -591 -35371 -20968 -12807 -869 -19102 -38968 -45983 -32314
5246 -32314 -21772 -2748 17816 9411 8512 7330 13659 17982 2016 -9454 -18361 -7570 28340
5233 28340 44189 38280 14956 -14484 -17886 -16529 -24288 -10569 1529 -896 29228 35984 33768
5220 33768 27238 -10265 -14443 9389 14303 6247 -19486 -33430 -44804 -37888 -32558 -6362 12317
5207 12317 5712 -14571 6942 -6807 -16042 9657 31879 5111 17933 27730 43354 35579 42437
5194 42437 55017 55247 50905 41112 17528 4801 -949 -6507 9827 29533 18013 7524 16332
5181 16332 22327 -1963 -8895 -12859 -19300 -28121 -9885 9647 15833 8616 25854 21109 1390
5168 1390 -17604 -11933 7659 5052 33205 28487 23115 14196 9815 -13550 -18305 -15874 -11382 -6142
5154 -6142 -6417 -10882 -12076 -8264 -3529 -4004 -23606 -47197 -34310 -39277 -35743 -15497 -31276 -50810
5140 -50810 -53519 -54432 -33533 -23744 -20333 -7940 -23564 -36210 -44353 -41738 -46554 -40878 -5242 10410
5126 10410 -12906 -37333 -41732 -47675 -33693 -25193 -6781 3147 2339 3818 -5850 -4204 -3077 2559
5112 2559 4798 12419 20947 1112 -37609 -22631 -26323 -10485 -3817 3736 14274 8736 5452 -14104
5098 -14104 -37139 -46485 -43915 -25838 -13263 -21981 -22231 -39762 -42955 -24483 -61586 -53250 -21887
5085 -21887 7404 6157 17375 -14193 -13949 -22783 -26622 -20951 18266 16527 -3005 -8821 -10550 -3718
5071 -3718 -5609 -5986 11637 41904 30751 26602 26953 26536 1841 -16561 -5979 11234 17810 1174
5057 1174 -31422 -28295 -15106 -6308 -14167 -24037 -14059 4434 13788 31237 6257 4752 7735 -16898
5043 -16898 -39812 -24326 -27360 -31436 -35351 -24596 2720 36924 39649 36937 39914 17941 -14205
5030 -14205 -30158 -46109 -48285 -49723 -50306 -39823 -48619 -46186 -55030 -35523 -56134 -64505 -57355 -38369
5016 -38369 -24672 -13677 -17585 5889 16495 11718 1234 -321 -11900 -15249 5588 14019 -6958
5003 -6958 -8625 -7825 1811 2377 -8238 -7686 -11738 524 -19415 -23615 -34081 -46693 -34220 -22289
4989 -22289 -29954 -4687 -3495 -8663 -26319 -14754 19775 14656 -12955 -21736 -13627 17953 33003
4976 33003 31919 28035 24817 7066 -26343 -22459 -17738 -10852 -3613 7976 15866 92 -7312 4915
4962 4915 10771 12563 9002 -8818 -24465 -41136 -41145 -37595 -37989 -17239 5988 -1512 -32867 -16767
4948 -16767 6236 10670 -2214 -26763 4422 40765 58863 41935 39650 39374 6596 -27577 -34326
4935 -34326 -23970 -14618 171 25088 21592 29069 38911 38135 19360 -588 -1819 2301 -8595
4922 -8595 -8563 -29208 -22346 3967 27097 36438 1371 -18915 -14326 6567 24499 31965 -9666
4909 -9666 -14072 -512 12573 294 -8992 -11756 -30599 -9807 14073 18589 -495 5678 -15735
4896 -15735 -33490 -10929 -15752 7070 25004 14846 17349 17223 1053 -20067 -38424 -35718 -39082
4883 -39082 -53319 -57694 -61254 -76745 -71974 -49155 -3175 22645 1224 -21791 -19868 -22794 -14644
4870 -14644 3108 -3627 -15814 -60245 -79228 -37944 10879 21846 6522 7251 3631 -18309 -45319
4857 -45319 -19867 -13634 -23311 -14558 -33941 -45849 -41065 -49270 -35409 -26303 -8239 1287 4017
4844 4017 -16578 -37476 -53624 -22311 9374 20193 6254 -11269 -20769 -43243 -51975 -38667
4832 -38667 -41613 -62225 -87410 -101722 -67487 -41489 -21074 -1897 -16187 -43792 -39615 -41303
4820 -41303 -42683 -57916 -41671 -20968 9017 -5285 -8548 7217 32430 31669 28452 22602 -24705
4807 -24705 -52574 -36344 -22589 -23794 1299 10147 -5553 -9914 -20211 -698 33551 31117 28476
4794 28476 18339 -121 -3281 -11958 8420 10046 15615 10331 -8854 -40633 -27837 -13860 -20478
4781 -20478 -15298 -26299 -19113 -6627 -11321 -20882 3743 -631 -22517 13963 35310 7336 -20143
4768 -20143 -31334 -40993 -47471 -38583 -10022 7379 21526 33720 28306 20101 8792 -26572 -21167
4755 -21167 -15051 7892 21664 5246 -617 -11152 -19738 -965 32697 50598 43898 28736 15098
4742 15098 10118 5709 -13363 1569 -2510 -15631 -681 -10701 -12493 -8698 6446 6946 -10303
4729 -10303 -29347 -52387 -18369 3966 -8504 -35113 -28835 -16582 12042 -4860 -26128 -44736
4717 -44736 -38369 6223 17291 13278 18791 5971 8397 -180 -2982 -19240 -25296 -23431 -22296 -21712
4703 -21712 -40161 -24004 -10863 -18140 -3242 81 4057 -8373 -14842 -30560 -40891 -18069 3690
4690 3690 12805 10079 -12882 -28678 -36836 -45941 -19752 24821 18976 -8813 -33572 -24641 -4213
4677 -4213 17610 17282 22730 54118 52401 30227 17456 3550 -8497 -12411 -6859 7138 16137
4664 16137 32246 29458 29780 5975 -205 -20028 -46427 -14400 -11702 -21040 -22527 24535 35606
4651 35606 22622 6457 -5151 2694 27851 38845 20643 -1790 -10982 2247 -2589 -7952 -2184
4638 -2184 23478 54214 47569 15465 -7582 -11371 -5822 -3536 32420 44771 5621 -19615 -1340
4625 -1340 3699 -3357 4556 -16874 -8096 13381 891 658 -15664 4698 30595 6916 20829
4612 20829 17065 2015 5048 24369 -5366 -12133 -11728 -17230 -27080 -14831 -7389 -6739 -11601 -15788
4598 -15788 21784 21609 38477 42397 45322 55800 39591 29425 -9665 -25539 -21602 -38834 -55743
4585 -55743 -64061 -30989 -25260 -17546 -7720 -10164 -27538 -13727 6051 11833 -9032 -29164 -9598
4572 -9598 -120 -1422 -7418 4380 5466 87 -17372 -36309 -33423 -27820 -29563 -33563 -22247 -35457
4558 -35457 -42418 -48231 -40371 -12548 18276 -491 -1667 5374 -7767 -22929 -6353 -7610 -5898
4545 -5898 7993 15521 -1913 -7497 10088 19196 33965 37955 19790 -103 -28503 -32915 -28306
4532 -28306 -27447 -20006 -10819 7897 17511 5218 -1425 -15767 -22522 -19510 -14489 -13932 -13649 -5602 6523
4517 6523 8544 23055 40893 26658 6281 12046 -4061 -38436 -53018 -36960 -15523 23725
4505 23725 41103 8189 -6415 7857 25899 39309 15649 -15304 -26096 -7517 -20609 -43234
4493 -43234 -48030 -54622 -24359 31354 21825 -24424 -8504 15837 29345 22557 20576 32600 20159
4480 20159 26614 12359 15013 13686 -2114 -31624 -48803 -46806 -28438 -9369 16744 -13795 -54934
4467 -54934 -39545 -38814 -13042 -508 19012 4680 -9185 -10928 -8298 -5038 -11386 -9151 -2042
4454 -2042 3277 5136 9982 -1775 -21896 -21907 -18550 -35247 -17381 -34776 -41538 -45799 -43342 -27492
4440 -27492 -3007 15823 7024 -16493 -21199 -35917 -8744 29577 37990 42064 14762 5592 11695
4427 11695 7659 27537 22356 35618 20357 10190 38199 50876 55309 43529 5349 -31468
4415 -31468 -35562 -23080 -13553 -22538 -21911 -25015 -16983 -5482 8858 10380 -7242 -27746 -34620 -45887
4401 -45887 -67310 -63771 -19961 5301 -27794 -30705 -19514 -34820 -34055 -22919 -41739 -22200 -2152
4388 -2152 -23322 -52186 -50180 -31617 -17095 -25680 -18971 12961 -3478 -15928 -18537 -13499 -25426
4375 -25426 -20653 -40048 -37827 -17071 15045 27568 32425 45122 10016 4761 3244 30709 42497
4362 42497 28180 27843 15865 20586 9847 -12941 -38156 -17834 -10460 -23771 -20511 -11001 -6800
4349 -6800 -16358 -20511 -6793 -3868 8014 -16179 -29063 -19394 -42823 -44349 -33516 -39850 -21270
4336 -21270 -4799 2494 20104 17750 14234 21496 -726 -225 17883 -612 -7323 1037 3594 4718
4322 4718 22148 3975 -5914 17539 843 -20973 -32664 -2484 32025 16784 19420 22496 15204
4309 15204 11877 32241 15967 -23252 -11699 -1838 8567 -6562 -7386 78 -5390 -9097 5514
4296 5514 -8857 -29073 -18196 -6782 -29 -878 4991 7311 -1743 -1265 5121 -793 -29874 -32397
4282 -32397 -7961 -15348 -6333 -779 -14728 -37723 -25996 -552 -11575 -15292 -13988 -19527 -19644
4269 -19644 -3449 -3193 2470 15334 34949 30246 14086 34998 46137 17174 899 -5828 4731
4256 4731 7328 7495 -351 -1129 -7049 -4168 -13305 -5104 -2107 -20528 -27847 -12663 -17806 -27460 -2275
4241 -2275 18741 -16032 -53096 -34309 -11024 15451 5512 1525 -8979 14176 7203 7510 15094
4228 15094 126 -3144 11 663 10805 15166 20234 30268 27717 32462 23118 -14554 -18403 -16794
4214 -16794 10426 24786 13198 -2754 -19685 -23688 -32134 -22598 -5994 -5285 -15644 519 22624
4201 22624 16672 1916 -22796 -29012 -19133 -16206 -3154 -20964 -31482 -45943 -54899 -49813 -29553
4188 -29553 184 -12703 -31409 -12191 4410 1906 8643 32416 14613 -26564 -32412 -19354
4176 -19354 33038 57382 50356 35411 26109 28961 32319 34049 41005 48539 39927 37807 14329 294
4162 294 -5559 -6909 13210 10794 3604 3276 -4055 -6942 -42114 -33151 -12958 -12746 26321 25218 19710
4147 19710 -3947 -827 19664 5241 4058 28656 47253 35656 30251 35740 29966 19574 -5358
4134 -5358 11823 7458 -8531 -11555 12495 20771 7605 -30873 -35222 -30523 -31086 -15972 -3044
4121 -3044 112 -1353 18554 38632 19159 17597 16564 1861 -7805 -10632 -27312 -22735 -21976 2833
4107 2833 20900 3993 -5868 -8007 3110 -203 -12344 -45619 -49377 -23095 -23668 -9558 -169
4094 -169 8792 17513 -17953 -43734 -36241 -25636 -18733 -13934 -2427 6866 -12827 -1657 5292 -23268
4080 -23268 -8560 -5955 -9142 -966 10207 47001 63861 32312 32103 34006 7579 26968 15615
4067 15615 6963 14404 6797 10036 21755 -2164 -23514 -8628 3323 -5023 3055 20840 17480
4054 17480 2944 12717 14929 8507 -18578 -51275 -65945 -38372 3570 14728 8109 9695 16226
4041 16226 9616 14707 12457 24236 30442 23533 -9281 -14483 -14306 -11206 8714 20829 26698 -617
4027 -617 5162 2839 3056 4091 -1455 3727 13147 24642 5412 7862 -8635 -36049 -46980 -41748
4013 -41748 -20344 -14219 -16229 -19101 17580 15206 -7632 -17633 -29465 -13021 1042 -11839 -10017
4000 -10017 -23381 -30771 -23717 -14651 -24909 -35415 -4201 22474 17636 -5092 -9700 -12103 -7672
3987 -7672 3038 -3198 10392 -7148 -4955 24369 -2104 -13204 -7088 -11763 22292 25361 -10029
3974 -10029 -15723 21320 38791 15326 8033 -7614 -40427 -23238 23132 50827 36498 -1141
3962 -1141 -13691 6882 12670 5551 13851 -264 5504 3103 6933 930 1975 2781 11659 24437
3948 24437 -11800 -38892 -19558 -6855 -6930 15971 43397 57890 73368 63994 11978 -18829 -37691
3935 -37691 -27880 -16044 -20048 -18948 10485 1952 -28389 -60949 -62938 -37566 -15143 -9414 -19773
3922 -19773 330 37332 34336 38402 38252 -19203 -53707 -34454 -4466 -8676 -6450 -3619 25165
3909 25165 33060 27358 27899 12918 6518 -1941 -9891 -17421 -17749 -2810 26795 41292 27845 30118
3895 30118 36355 28266 21786 17292 -14857 -20642 -2619 -13600 -27980 -21151 -11426 33826 38134
3882 38134 39452 34734 10683 13185 26741 39569 48846 47361 56503 13454 -17766 -26332 -24084
3869 -24084 -21237 -2480 26165 45309 32514 960 -1879 -2855 11627 37124 40634 32854 21766
3856 21766 20642 21760 2076 -2569 7019 16843 8345 -7080 -22368 -9194 13694 35149 31836
3843 31836 18430 -5904 12574 15004 -988 4254 11452 3142 9794 4936 1144 16537 17209 28257
3829 28257 46339 53095 53056 45829 30578 13726 13074 -5571 -19577 1821 28206 28420 13609 3866
3815 3866 9258 11657 11143 8008 5276 44518 48270 49762 51892 55363 42090 20784 3278 -20251
3801 -20251 -30390 -17391 10060 12491 18140 34231 29263 25054 8905 232 -27874 -25926 -12906
3788 -12906 29634 24234 264 23348 34725 27255 41051 35557 10775 -11343 -3942 8217 26993
3775 26993 36380 27126 6084 -10772 -26085 -40398 -31128 -11879 8053 20345 -8043 -6746 7637
3762 7637 5754 -17778 -30580 -33208 -27107 -2793 -3743 3212 6692 -251 -12157 -150 3806 11592
3748 11592 -14290 -49147 -58290 -38220 -9319 10459 20149 24062 31664 9450 -17125 -13419 -24121
3735 -24121 -36082 -32328 -32605 -24950 -5720 1355 -11269 -14683 -22442 -30823 -25092 10949 16871 8416
3721 8416 9318 46019 11850 -1719 -8514 22031 33528 12029 11556 8123 16186 21452 22596 20117
3707 20117 11041 25594 33252 20560 24047 11085 10614 25318 5234 -19308 -36766 -26716 -25646
3694 -25646 -30433 -29425 -39389 -31198 -17812 11241 17846 11033 21650 7770 -13130 -25407 -13947
3681 -13947 -8155 4378 9959 45407 48379 -11412 -36710 -40705 -11612 2314 15799 10119 16005
3668 16005 19478 24897 21779 28867 30892 54156 67642 67544 36961 42588 54528 31810 -8396 -10510
3654 -10510 -12721 -16609 5522 23278 21474 27794 19953 -7346 -8407 9268 21873 28502 232
3641 232 -12820 -8801 8453 45799 45277 31370 53717 55391 66206 31405 15710 18020 12206
3628 12206 33239 20311 -5430 9111 20328 21306 35694 36075 36870 22598 7776 -944 1667
3615 1667 8248 58 -21596 -31016 -2505 26610 16827 -13909 -18509 -35431 -36223 -24604 -23858 -34962
3601 -34962 -26922 -23409 -32964 -17397 17964 15966 -5874 -16281 -26948 -13547 -19463 -20732 11095
3588 11095 20237 4647 6040 -4774 -17275 -9204 21154 43715 29828 -1051 -20837 -18690 -14758
3575 -14758 -21989 -14744 -22040 -26070 -23506 -7079 -20932 -37821 -29776 -15990 2750 8462 22011
3562 22011 9848 -6538 -26568 -20227 17953 19570 26695 20419 3536 2683 -7922 -842 10030
3549 10030 -1950 -31336 -47545 -24815 2156 -24188 -45513 -32246 -15714 7641 16430 25199
3537 25199 28414 11988 -21999 -27224 -18167 -15511 -42171 -26380 14059 28605 14076 13213 -13915
3524 -13915 -15477 -471 9775 28857 20751 16702 2530 -9321 -34622 -31306 -30598 -26451 -16635
3511 -16635 -13039 -21733 -11523 -16013 5375 33243 33894 -10472 -22929 -26052 -36033 -2375 -9425
3498 -9425 -31299 -55847 -48404 -41638 -16436 9323 -1730 -14705 -4300 -2746 -35846 -58548 -28762
3485 -28762 12526 18770 23088 23871 20086 -453 -19015 -27738 -35683 -49948 -30379 -34700 -64409
3472 -64409 -35323 -25713 3504 25325 8862 -1719 13995 30395 34064 26797 10539 9934 26631
3459 26631 34648 16594 -22141 -15279 8956 15331 16905 52170 58829 12675 3920 21027 2297
3446 2297 -5325 3922 -5581 -16981 15145 19490 -7988 -1750 3026 16893 16179 -63 504 -3565
3432 -3565 -27366 -7742 4157 14840 -2632 -32393 -36559 -24383 -34082 -41172 -10443 10151 -12673
3419 -12673 -11817 -20657 -15064 -8220 -1523 -21280 -38759 -24948 -5446 3672 24763 20925 17228 12440
3405 12440 25215 6795 -29099 -20003 -4135 13067 -16195 -24481 -20446 -13881 -17452 -4269 -23868
3392 -23868 -6255 22175 25798 8712 -14375 -16962 3588 8866 7751 9190 10192 -6499 -5070
3379 -5070 37245 36055 38565 7722 -10819 -16280 -21281 5294 8125 12006 -1680 -6835 5681
3366 5681 -3680 -19493 -10675 -6121 3254 -3508 -5105 -8661 17017 13319 -12692 -16696 -16321 250
3352 250 -12194 -21366 -9349 7049 28287 43645 42229 17057 4569 34050 25143 11169 39501
3339 39501 42514 32160 3063 4660 40723 19806 -17509 -7118 11380 -10872 -31525 -38220
3327 -38220 -35844 -23837 -3832 3363 15819 23778 34463 33713 48421 29707 -2049 9445 -3948
3314 -3948 14667 -9365 -35489 -55743 -61319 -65768 -40290 1215 5094 -22766 -39500 -49362 -49473
3301 -49473 -27697 -21553 -33448 4480 14820 -18933 -13117 -24944 -21889 -21118 -12797 -29945 -18989
3288 -18989 24159 28992 21248 -5122 -34178 -39450 -10522 -8983 -9627 637 -1698 6306 6671 10748
3274 10748 7230 8664 12216 13748 -5001 -17591 -27472 -24379 -23989 -3133 11517 -1131 598 7185
3260 7185 -3229 -15891 -7082 9248 -9531 -23785 -27480 -5622 -7061 5935 -13133 -4643 23371
3247 23371 12352 -3962 -4479 -7175 -1067 13384 -1499 -4685 -10186 8807 20475 13448 -1201
3234 -1201 17915 10703 -4039 10715 28753 26765 8087 -30969 -44273 -34052 13027 28958
3222 28958 13819 -21102 -36221 -28378 -830 -3804 11020 12378 12833 21391 801 -15910 -11041
3209 -11041 -17870 -39150 -28131 -35751 -29477 -11347 -11140 -2430 -21432 -13092 -17410 -18919 -37591 -23523
3195 -23523 -12655 -4189 13024 -1604 17493 15629 12750 7329 11483 30952 12993 -8092 -8376
3182 -8376 -237 -3566 -2492 -47710 -66696 -42792 -20390 -8210 4717 8196 12531 30065 16125
3169 16125 -22198 2656 30760 30620 40694 49618 46894 39225 25721 5262 -4770 -2320 1779
3156 1779 -36313 -18872 -3648 -2869 -27007 -14792 3393 34345 40409 60075 63543 23107 -7745
3143 -7745 18589 7956 1070 -14669 -22670 -13790 -21442 -12992 4404 37786 52609 39962 -503
3130 -503 -18839 -28216 -12116 -8752 -3819 -3468 17703 23140 2384 -17735 -28045 -23367 -2684 7515
3116 7515 17083 -6758 -49794 -37685 -4288 2988 5985 9314 -6217 28465 29632 2487 -6471
3103 -6471 -11967 -28261 -15177 11429 1041 -6184 -11016 -8909 -852 -4733 -11839 -4892 10738 8607
3089 8607 15051 19214 33741 43942 33736 12322 -336 -4741 -8250 -17433 2432 -3910 -29552
3076 -29552 -3975 12549 16453 30650 34357 55507 43498 30150 43701 59078 36847 31907
3064 31907 29033 523 -30837 -42352 -39873 -24826 -29448 12513 55014 69439 47778 50699 33726
3051 33726 3180 -1631 -14653 -14595 11733 19753 19351 35422 39622 38252 27128 7827 -10792 -5453
3037 -5453 -16604 -35632 -20805 -6417 9899 21154 -6091 -16227 -12870 -21497 -30979 -17902 -30463
3024 -30463 -5781 17957 17368 21113 12351 -27580 -39408 -32513 -16627 25473 27386 11671 -1376
3011 -1376 6795 -1641 -19264 -27432 -17747 -43694 -23021 8979 2838 -15818 12598 30150 30463
2998 30463 14652 168 -1497 23520 48849 8823 -6980 -9195 -27070 -17163 -20875 -23403 -30373
2985 -30373 -24939 -18274 -2135 3819 12200 21206 28174 28162 1456 -13057 -36633 -24980 4868 7946
2971 7946 -18183 -11345 9362 10283 -669 -13998 -14681 -11263 2359 21189 11992 4469 6222 -956
2957 -956 25906 35650 4961 6913 10384 15510 -10147 -25999 -22994 -18775 66 25730 23528 8001
2943 8001 -7136 -33897 -30728 -20654 -37618 -31211 -9296 -10506 -19395 -572 17905 7225 -15259
2930 -15259 -27520 -7135 3320 13348 25715 10138 17015 27849 7835 -3826 -3815 596 -3742
2917 -3742 -34004 -33990 -37723 -55409 -67599 -37621 -6781 -8791 9262 27116 23123 6315 20072
2904 20072 38141 15601 15655 15978 5351 1961 -19386 -16579 -10957 18962 32920 23841 29244 7151
2890 7151 3962 20726 24209 884 -709 5408 -16360 -21041 -30755 -67126 -92290 -55294 -14153
2877 -14153 -1270 14381 29920 13104 -7170 -8730 16447 39061 26126 -5197 -28859 -30793
2865 -30793 -17629 -11781 -15404 -22851 -2370 1728 -4003 -19522 -30950 -17758 -9449 -8646 -13210 -37376
2851 -37376 -49221 -24457 -4109 -15262 -22315 -44611 -37659 -24610 -18079 -16409 -6210 -8110 -1763
2838 -1763 -2323 -12544 2024 -3719 -49012 -37807 -8343 20400 17576 6777 6220 -7607 -1835
2825 -1835 8554 22529 17060 18040 -10426 9960 28132 12537 666 -32142 -39344 -35022 -44988
2812 -44988 -18041 -3546 269 -5650 1916 22581 9374 -15898 -14082 -4655 7097 12727 13128
2799 13128 23248 40 -34439 -31805 -24458 4713 -9150 8212 4133 442 20619 14564 -13183
2786 -13183 7757 22398 28981 29920 44872 32100 25162 34567 24190 19044 12595 36733 43270
2773 43270 28954 25345 -5000 -16204 -14302 3771 24944 30041 12470 -4576 -35865 -21168
2761 -21168 7064 11610 5600 11841 9441 23604 31174 40209 47463 43756 47974 37671 41801 35171
2747 35171 23858 32866 34602 14518 17304 -7036 -10989 -29809 -46413 -41168 -32350 -28177 -5346
2734 -5346 -18772 -32164 -29278 -34808 -34462 -10364 -1875 11117 16373 5122 7770 15338 14479 15132
2720 15132 -22826 -14785 -6627 -14159 -2119 -5838 -15318 -4143 16022 2101 -3512 -1208 12174
2707 12174 13261 8039 -10423 -65095 -67381 -51298 -50437 -35844 -14183 3450 -4011 4881 26362
2694 26362 15007 5089 6061 -3985 6006 25289 51962 61967 51658 23515 -20686 -30116 -12174
2681 -12174 -23263 -17941 -17174 -26841 -13553 9251 30246 22109 15603 16680 683 5272 -581 -1618
2667 -1618 -8466 -4433 -17656 7412 25736 46785 17989 1073 -14505 -28737 -8840 -5694 19363
2654 19363 7579 -19126 5107 32177 60185 37328 15342 8892 -15812 -21455 -26064 -18782 -26945
2641 -26945 -50390 -67386 -44610 -20939 -2437 477 20080 26997 37387 37265 28912 -13693 -24810
2628 -24810 -14134 -17716 -13789 -10173 -15625 -12177 -13265 -8564 -1753 -3378 5298 36024 12265 -20704
2614 -20704 -22527 -6286 21287 -4970 -39331 -18793 2819 3880 7445 5712 9138 -14929 -23013
2601 -23013 -36676 -66459 -57606 -13954 10351 15910 11060 22496 15295 15608 33095 27319 2225
2588 2225 -12644 1125 45693 30442 12800 20137 13636 987 -357 11142 -3710 -19585 3012
2575 3012 20507 22498 28530 3037 4896 48867 29386 21122 40175 27503 -9216 -34197 -6858
2562 -6858 25889 24150 15654 19005 17324 -769 -20487 -11638 -8114 10602 13520 -539 7227 11107
2548 11107 3657 -20027 -37321 -32821 -16103 15585 2899 -5338 -10243 7721 44677 46342 55468
2535 55468 34636 29376 32942 15968 -25746 -23058 -9508 -17392 -16027 -4242 15782 8590 -27098
2522 -27098 -35580 -33960 -27404 -23569 -8445 -8224 -31529 -20660 11392 6658 -24033 -38658 -17893
2509 -17893 -20395 -16400 280 -10705 -13981 4074 8215 33120 19921 19013 17536 40393 24534
2496 24534 -1341 -4009 6 8557 2365 -6608 -2469 -618 -2591 2244 33927 42269 35339 24157
2482 24157 3986 -9816 -14059 -33066 -8850 13161 -1904 -13004 -16552 -12111 10079 17273 24986
2469 24986 30371 23564 44577 29516 44794 18102 12326 25740 9448 -1100 13442 21456 40749
2456 40749 27455 18193 -612 11975 9865 -7697 -4595 -6548 6485 22306 32311 26761 22091
2443 22091 -357 -38781 -39545 -300 17133 16874 18352 25158 12652 -11680 -6818 2091 12464
2430 12464 -636 -1723 19017 50797 48933 33827 30470 9430 -10021 11243 36712 36794 28564
2417 28564 14959 -3184 -21692 -13617 1010 10725 -10997 -19812 -7474 -8706 -8920 25244 21607
2404 21607 -425 -3964 17288 21751 24773 16194 8498 13963 3558 -16489 -12378 -8255 10497
2391 10497 15921 16469 -12888 -35009 -26031 -4050 5514 30417 47752 39291 47383 30416 3653
2378 3653 -16961 -14612 -8872 -18811 -26837 -37508 -48653 -42754 -35139 -15276 16974 34131 7045
2365 7045 -7385 -13212 -20343 -19449 -29727 -51538 -44413 -21134 -11852 -3876 -30149 -41315 -18833
2352 -18833 -7616 -4640 7769 -6160 -3194 33096 47002 17299 -11244 -25233 -30715 -25708 -7266
2339 -7266 -20161 -16829 10988 19319 26484 31384 16396 -9780 -32960 -44331 -28383 -20638 -18976
2326 -18976 -441 37444 57041 53011 47887 53397 70289 68956 41637 3536 -14815 -7139 7360
2313 7360 20897 19287 7449 24883 -10353 -5588 7434 6558 -17347 -39122 -48690 -37225 -28389
2300 -28389 14302 23292 -23021 -30153 -4521 -5518 -14255 -31669 -21443 34156 54484 22510 9236
2287 9236 36485 36987 26508 -11691 -37723 -41592 -38989 -35744 -6633 16847 25003 35322 26263
2274 26263 9788 7678 -3801 -28816 -59194 -36440 -13196 -24042 -10148 9442 24042 14345
2262 14345 22683 29757 42493 30667 1119 20596 52953 46259 20153 601 -12425 -12044 -15556
2249 -15556 17076 31093 36524 29038 4576 17721 34084 37810 26149 24865 44658 64747 64831
2236 64831 52695 32487 21697 25275 20444 11221 8191 24585 6078 -14095 -22955 -673 -16939
2223 -16939 -32513 -52245 -24127 11889 27833 24037 32809 25343 10226 -21566 -35078 -41091 -41146
2210 -41146 -27506 -27348 5253 41001 18324 -8789 4226 -725 -1983 -19769 -39348 -46711 -43897
2197 -43897 -29794 -38580 -12578 -1624 -25516 -4848 20002 20847 18912 11748 10830 24038 35090
2184 35090 21472 -2624 -17681 -36180 -12402 -17033 -34326 -31020 -22792 3144 9846 -426 -7344
2171 -7344 -9792 4318 12024 50226 48551 7272 4909 -5945 3625 15985 23241 29394 48078
2158 48078 29698 18099 5328 -10885 -17829 -22877 -28225 -19513 9840 -11327 17824 45080 22056
2145 22056 31847 29714 18884 24688 20943 19065 30366 28364 -3616 -26536 -20178 495 -6945
2132 -6945 -25340 -3338 18483 17708 12771 -5783 -33452 -27822 7207 11442 10149 20446 6710
2119 6710 11277 1324 -8285 -26672 -20902 -24340 -16396 -24763 -20383 -24274 -22958 -4473 -13564 -16039
2105 -16039 -22271 -21187 5583 42685 58385 36928 12737 14116 43195 38007 19325 5182 -13253
2092 -13253 -18605 -43751 -24235 6419 4850 6519 -3600 -11831 -30421 -39427 -24774 -733 -1074
2079 -1074 -33486 -39776 -11305 -11835 -10907 -1709 -17394 -33149 -38444 -34602 -23249 -12792 -25429 -17468
2065 -17468 -643 -14730 -23006 8763 25508 15086 14502 -1292 -19787 -13846 -23275 -11039 -7574
2052 -7574 -3503 6791 44780 53008 31342 12764 9725 20575 18972 18943 18419 36574 38102 40515
2038 40515 13517 -6285 -137 37442 32184 -4198 -3303 -12276 -12144 6649 -5703 1474 11620
2025 11620 34664 42914 10041 18724 31814 37396 20346 -2164 -24442 -17407 -7649 -12889 -32119
2012 -32119 -2969 39282 28336 17653 24513 34819 39796 22519 4504 -10029 -16270 -26433
2000 -26433 -37682 -45121 -20152 -7748 -4019 6599 17081 21984 15420 -11808 -28111 -4388 -18027
1987 -18027 -45918 -37158 -15358 -20633 -16802 -7802 21982 14820 6251 19666 20566 30062 13661 2192
1973 2192 -20735 -10903 13946 21729 24344 22495 7954 5007 -11728 -39398 -10349 17290 27993
1960 27993 34516 32648 4297 -6987 -7659 4251 680 -2841 -17444 -10443 -28534 -28883 -510 5202
1946 5202 4774 -19836 -41945 -7299 5563 -4792 -5729 566 2725 21872 28081 25140 -9181 -4460
1932 -4460 8374 14837 14448 -5908 -19856 1037 29907 32964 10020 -15690 -15037 -732 17107
1919 17107 12519 7776 14435 19519 -4195 -14839 -23502 -63645 -57574 -54416 -46131 -29067 -12036
1906 -12036 -25790 -26706 -9837 20767 44028 51741 39512 44736 1531 -42376 -25086 -29477 -20840
1893 -20840 15568 5000 -5682 5792 7269 3737 -8766 2953 18741 26930 33581 40173 28238
1880 28238 19851 11409 9736 9605 17159 24838 40965 29006 11245 17047 43804 29211 2359
1867 2359 -21965 -24345 -10887 3086 13630 14916 21816 -9093 -24218 -18120 1935 -10728 -9685
1854 -9685 -14291 -6605 27413 19445 5852 -13509 -8452 7784 16940 12803 21171 16906 31089 35634
1840 35634 35701 13600 15871 47627 35869 8097 -26858 -40284 -21206 -25127 -32050 -20186 17660
1827 17660 17961 37311 61812 46636 49318 42825 9239 31212 52902 48770 25779 12047 -12120
1814 -12120 -4554 17583 32162 29608 24753 41391 40075 41043 30365 45532 45745 48501 32398 44948
1800 44948 21117 15791 21798 22712 15237 20410 26588 13335 -5489 -18070 -6505 -630 -1713 -7452
1786 -7452 -23897 -22605 -17198 -18645 -4411 -4490 -2837 -13397 -3723 61 -14347 -33141 -21232 -13088
1772 -13088 -8737 2437 43042 44203 45930 56170 54726 43843 20399 -2910 5628 -10959 -22345
1759 -22345 16345 23227 12597 12962 26584 32059 12422 20075 39295 22067 -4988 -15132 5281
1746 5281 18308 11729 33847 39739 22631 3740 12335 43391 52605 71902 67471 56978 46026
1733 46026 21803 13270 -2546 -4255 -13311 3481 7916 -19905 -35029 -27489 -20836 -13354 19881
1720 19881 53563 57920 42770 22845 33147 35678 36624 7119 -5536 -19752 -27096 -22914 -29020
1707 -29020 5224 20480 35900 33688 22176 20945 10822 16571 29969 18047 8302 13980 6993
1694 6993 -2756 -22336 -16612 -11292 -4070 17553 14319 -23600 -22207 -12813 -1555 7468 3453 9588
1680 9588 5593 -38213 -43599 -9415 -5792 -8044 -24041 -25227 -36561 -54754 -44248 -32401 -4163
1667 -4163 31953 11664 -9887 10342 36165 17909 -5945 -13803 -31007 -26419 -6260 4958
1655 4958 2018 4328 6938 22524 -956 -635 -16046 -31361 -21710 -7648 5302 12541 35430
1642 35430 25933 1223 5023 7482 3553 6393 -10879 -38897 -48402 -56965 -32749 -33755 -25537 -7237
1628 -7237 -16712 -11295 1816 28861 26585 20985 33320 28603 -13868 -49537 -74727 -49508 -2978
1615 -2978 -1991 -12468 -26409 -12185 -16463 -11710 -17971 -11298 -11902 -11211 1984 -5877 -38351 -53684
1601 -53684 -31654 -17141 -27177 -19037 -4907 2089 214 7890 -9817 -29503 -30922 -41092 -19680
1588 -19680 -19116 -10195 4609 -4742 -27280 -60097 -20468 -17485 -19192 -1737 -3072 -19238 -35528
1575 -35528 -37063 -35391 -19921 -11778 7100 27733 33442 19504 -7878 -9151 6455 15881 20738
1562 20738 27269 -7952 -42084 -31477 -19002 20487 13754 9822 22708 47793 42061 36770 12439
1549 12439 6000 -1911 -18227 -19813 -19747 -18663 -13067 -22633 -2675 7171 17682 17457 -728 -22684
1535 -22684 16241 38882 9292 -15440 -46877 -38519 2151 6816 10118 -6284 -1575 13593 47975
1522 47975 13589 -942 3137 -3684 11096 27161 29827 34983 -2969 -27355 -34516 -10227 17190
1509 17190 18665 7066 14733 46308 11750 -14659 -17829 -12595 -21756 -36491 -29886 -16082 12300
1496 12300 28504 25513 12394 -15051 -26659 -11228 -3513 -3848 2539 -21204 -31584 321 45949
1483 45949 42414 30816 3807 -15352 -199 -29782 -26284 20400 29128 25663 16965 18590 18826
1470 18826 15932 334 -18902 -13352 -10213 -8852 17362 39965 45284 51795 43391 7534 16362
1457 16362 -5432 -19059 -27507 -24668 -13518 -4986 14178 39443 6130 27260 43381 30215
1445 30215 19022 15325 40502 12093 -2964 11004 11783 13624 24068 5376 1645 6594 15659
1432 15659 45734 51706 39466 43041 31487 28137 15415 -8968 -10577 -7764 17032 63958 39024
1419 39024 4562 5197 268 1079 16210 12303 17879 25543 5897 10780 33620 46547 41054 29739
1405 29739 15462 -13745 -31471 -17487 -20774 -26486 -21008 -15049 -9678 -12662 -8299 16244 30551
1392 30551 29333 16864 -35809 -43922 -18140 8986 -2711 12663 8758 12419 -13721 -33561 -8010
1379 -8010 14602 4789 23821 15338 -6538 -20446 -16856 -11047 10925 -15902 -19932 -8194 30750
1366 30750 50382 33324 16396 -3272 -12660 2408 20603 24797 8722 -18922 -14090 -18892 -16601
1353 -16601 -2300 -5924 -14294 -28053 -38596 -8876 -20160 -25056 26135 37948 8298 -12381
1341 -12381 -40079 -37629 -25131 -44219 -63314 -52319 -35462 -23216 -12 -5942 -31678 -20496
1329 -20496 -907 -23187 -39257 -10364 -11299 -30653 -13502 3917 -14171 12602 38884 35077
1317 35077 33127 44111 50279 37346 2688 -17515 -39242 -25018 -20779 -13992 -8058 19977 3915
1304 3915 -16661 -17245 6822 42593 37689 -337 -23066 -17521 -8422 5890 9229 8502 2495 12330
1290 12330 43030 40673 26303 30931 29858 16853 13632 17995 8413 -19913 -30747 -41702 -33575
1277 -33575 -30666 -33092 -15564 -27275 -23912 -8048 -948 -2442 -7225 -3121 12696 846 12451
1264 12451 27942 10434 -33991 -61342 -56071 -66359 -56481 -24134 -7700 -9046 -3077 41693 28120
1251 28120 -12986 3318 3835 -13477 -16073 -10285 -18233 -38673 -19704 -6452 -18001 -9905 -16431
1238 -16431 -21171 -21856 -25386 5353 6817 -5032 -28762 -71800 -81999 -41653 173 -11668 -31443
1225 -31443 -39704 -12228 10393 13554 -15064 -20997 -13764 -17626 -10711 -6484 -26731 -22359 5700
1212 5700 26767 13417 872 17920 27538 23937 21525 8543 -9363 -5769 1596 17598 11761
1199 11761 -2197 -50 -7788 -9951 -23937 -30726 -15864 -19065 9 11488 -21555 -26175 -20841
1186 -20841 8975 29343 2923 -18438 -5260 10675 -9817 -20656 6746 13434 25827 11475
1174 11475 -8332 -4039 -18126 -32224 -41419 -54470 -32882 -36269 -15336 -3431 22130 1832
1162 1832 20133 34098 19409 12678 23447 32105 25263 16835 3961 -9143 1616 12425 217
1149 217 -3511 -10265 -8615 10764 30709 21481 20670 14244 -842 -25500 -20016 13049 43623 53161
1135 53161 22783 1359 17720 20533 -27 1133 16273 9602 13138 4201 6353 39617 65970
1122 65970 50033 30636 4288 -10012 -5412 22181 18288 39282 37184 39637 53887 46549 24085
1109 24085 27360 -8528 -22920 -15452 22045 51925 7577 -23708 -21860 -32744 -44496 -45506 -45797
1096 -45797 -43215 -30178 -46350 -52875 -7855 9225 12909 36 15443 14519 8717 6803 22296
1083 22296 25396 -2344 18988 28689 20528 6099 23076 28422 25254 18069 5152 -5732 10900
1070 10900 20160 41050 58187 14000 -39214 -43425 -1573 21743 26607 43135 51785 54556 23618
1057 23618 -6212 -773 10092 34442 41461 27468 27208 21158 11702 -23058 -12535 6252 25231
1044 25231 18284 14763 -18 1802 -3004 -7599 -1175 4709 -16402 -44920 -22401 -15757 -5058
1031 -5058 -6742 -16815 -9831 9517 17448 9734 11073 25711 28472 18272 12797 5094 -20069 -7498
1017 -7498 5912 -6823 12048 5811 5739 -79 -19934 -619 16797 27534 -7652 -9979 -18829
1004 -18829 -31833 -60215 -47608 5400 3827 -20900 -45684 -25297 -9010 -7403 -26190 -22267
992 -22267 -17030 -653 26366 30346 40061 23203 14564 18237 7451 3108 7312 24867 35385
979 35385 56539 37514 16853 21792 21825 8211 16003 28776 74550 47745 7449 551 3932
966 3932 25222 27006 -781 -3165 13216 17265 33790 60253 55640 23826 9252 8688 13788 -2315
952 -2315 -14857 -8759 -3000 -12902 -10102 -6871 -24088 -16565 -17935 -14798 2019 22139 21518 24393
938 24393 28641 55665 77889 59458 56718 41537 40632 50248 59268 66672 43280 18488 36567
925 36567 70644 55851 46645 46837 50751 41707 32218 26416 11427 13651 6515 -28408 -50004 -43191
911 -43191 -16424 22888 24276 20017 39008 11567 10169 23977 21058 14166 15271 -16458 -6633
898 -6633 -24648 -24299 -21544 -43583 -56808 -67843 -60534 -31280 1010 -14495 -29660 -39012 -34388
885 -34388 -48459 -57885 -77685 -64778 -36705 -22403 -19342 -7914 7267 14988 4395 -17816 -8421
872 -8421 13173 4851 -10895 3565 6119 -35524 -66510 -32970 -17201 -9746 -15012 2802 26746
859 26746 33357 27936 10346 -2913 15080 16595 15705 15044 14073 32106 26589 18057 -1196 -14429
845 -14429 3262 -21661 -33241 -32197 -28627 -14447 5340 -4548 -22454 -15953 -4881 -18049 -427
832 -427 -10563 -35194 -40297 -43953 -52562 -44937 -39865 -29473 -22588 -24790 -32890 -26351 -8591 -20280
818 -20280 -26222 -569 16715 3789 -6604 -6164 -4183 3700 -5968 6977 23220 30512 798
805 798 8836 11670 6979 -9160 -8076 -2870 10032 16614 -10613 -33517 -38016 -24107 13466 12155
791 12155 -9172 -9987 14604 12555 14281 -9509 -21312 -23362 -12833 -13270 -10671 -10753 -16662 -34374
777 -34374 -16193 -7468 -17860 2240 22045 -1005 -21455 -36301 -48655 -52683 -36049 -21823
765 -21823 -21939 -38763 -41830 -16400 1081 -5482 -451 219 3747 -4257 -9579 -20630 -43856 -21940
751 -21940 17050 26316 16447 3243 -31560 -44266 -33178 -32624 -13975 1771 -210 20237 7435
738 7435 16849 18897 7433 -9966 -2280 3648 11933 3462 -39823 -56659 -38656 -12308 -20912 -25053
724 -25053 -27302 -28559 -19613 -24738 -27797 351 22396 40669 38249 29154 25210 20720 -5442 -1599
710 -1599 11846 -9231 -36619 -31386 -53751 -56756 -50408 -17036 6650 -15055 -7371 -19397 -46335
697 -46335 -38565 -20519 -12403 -5941 -177 11752 -10067 -20502 -9741 11327 -13242 -23001 -9787
684 -9787 -18223 20075 28566 28972 18596 7980 17547 15511 -8598 3052 4961 -2318 5194 15592
670 15592 13466 21388 19664 36563 45963 29657 16341 24683 19407 11254 14505 15320 26764 13051
656 13051 14186 2935 -6362 -10048 -10876 31185 52658 26036 11317 -20612 -16651 -23107 -33532
643 -33532 -4123 35559 31869 21636 -937 5915 -12279 -45887 -67011 -84470 -82865 -56820 -6217
630 -6217 12669 9098 -20892 -51924 -29129 -4498 12864 5145 -13916 -27466 -29605 -30107 2643
617 2643 33112 23807 -11483 -15281 -1543 888 3531 10689 22359 26442 13393 -21556 -30446 -51753
603 -51753 -27431 4775 -16992 -41161 -45081 -26938 5965 13459 10144 -5519 5222 -17404 -22248
590 -22248 -35304 -50498 -25529 -14507 -37237 -19592 -31669 -22502 8996 22099 -7318 -27182
578 -27182 -12641 -17330 -12195 10615 -16737 -28724 -1455 -4334 -6307 -14355 4262 -1471 -866 2953
564 2953 -36917 -36831 -19985 -17771 -12043 -16831 -9456 16093 26345 26368 20558 37497 29122 12904 873
549 873 -11010 14775 20821 -9155 -34895 -21163 -671 -1754 -16997 -12489 -6295 -18025 -8450
536 -8450 -29165 -36273 -36604 -37566 -611 16534 10018 21661 23902 31552 17318 -4459 -21489 -19128
522 -19128 -4416 16224 10145 -3354 808 -4460 -29445 -43470 -50570 -47412 -25720 4438 12581
509 12581 4103 3438 -4817 -9888 -9691 924 -4469 5399 -14995 -47922 -34986 2667 4374 19852
495 19852 17991 11571 -16163 -36914 -39846 -27934 -34313 -24719 12958 7225 -18504 -17086 -23728 -34793
481 -34793 -28753 -31632 -30512 -28191 -18408 -17041 -22762 -25041 -24299 -23083 -14298 -14304 6205 16032 38897
$$ [...]
##END NTUPLES=NMR SPECTRUM
##END=
