##TITLE=Analysis number 326827
Compound Code cc 59674
Book Reference 521/29
Project Code adrs
Chemist Name evam
##JCAMPDX= 6.0         $$ Bruker NMR JCAMP-DX V2.0
##DATA TYPE= NMR SPECTRUM
##DATA CLASS= NTUPLES
##ORIGIN= Bruker BioSpin GmbH
##OWNER= nmr
$$ XWIN-NMR		Version 3.5
$$ Tue Feb 27 12:31:54 2007 GMT Standard Time (UT+0h)  MAYBRIDGE\nmr@NMR_250MHZ
##.OBSERVE FREQUENCY= 250.131544655141
##.OBSERVE NUCLEUS= ^1H
##.ACQUISITION MODE= SIMULTANEOUS (DQD)
##.ACQUISITION SCHEME= undefined
##.AVERAGES= 16
##.DIGITISER RES= 18
##SPECTROMETER/DATA SYSTEM= dpx250
##.PULSE SEQUENCE= zg30
##.SOLVENT NAME= CDCl3
##.SHIFT REFERENCE= (INTERNAL, CDCl3, 0, 16.522)
##AUDIT TRAIL= $$ (NUMBER, WHEN, WHO, WHERE, WHAT)
$$ ##TITLE= Audit trail, XWIN-NMR		Version 3.5
$$ ##JCAMPDX= 5.01
$$ ##ORIGIN= Bruker BioSpin GmbH
$$ ##OWNER= nmr
$$ C:\u/data/dgb/nmr/ADRS/2480/pdata/1/auditp.txt
$$ ##AUDIT TRAIL=  $$ (NUMBER, WHEN, WHO, WHERE, WHAT)
(   1,<2007-02-27 12:31:26.20 +000>,<MAYBRIDGE\nmr>,<NMR_250MHZ>,
      <created by zg, POWCHK disabled, PULCHK disabled
       configuration hash MD5:
       49 4B E0 1D 92 C2 6B 37 9F E6 65 BC 52 41 86 1D
       data hash MD5: 64K
       43 FA 37 4B AE DD 24 79 CC 4C 56 E3 DA 18 7C D2>)
(   2,<2007-02-27 12:31:44.17 +000>,<MAYBRIDGE\nmr>,<NMR_250MHZ>,
      <Start of raw data processing
       ef LB = 0.3 FT_mod = 6 PKNL = 1 SI = 32K 
       data hash MD5: 32K
       1F 51 69 8B 27 3B 78 65 D0 64 A7 0C D1 0F 24 41>)
(   3,<2007-02-27 12:31:46.09 +000>,<MAYBRIDGE\nmr>,<NMR_250MHZ>,
      <apk 
       data hash MD5: 32K
       4A D3 7E BC A6 C5 78 C5 B4 18 7B 40 91 9F E0 5E>)
(   4,<2007-02-27 12:31:46.79 +000>,<MAYBRIDGE\nmr>,<NMR_250MHZ>,
      <abs ABSG = 5 
       data hash MD5: 32K
       52 2C 25 BE CF C0 D2 BD A8 B5 87 D6 3F B4 93 84>)
$$ ##END=
$$ 
$$ hash MD5
$$ 05 2E 15 D8 F3 2B A5 BC AF 71 81 A5 F1 F8 16 03
##$RELAX= 
##$RELAX= 
##$RELAX= 
##$RELAX= 
##$RELAX= 
##$RELAX= 
##$RELAX= 
$$ Bruker specific parameters
$$ --------------------------
##$DU= <C:\u>
##$EXPNO= 2480
##$NAME= <ADRS>
##$PROCNO= 1
##$TYPE= <nmr>
##$USER= <dgb>
##$AMP= (0..31)
100 100 100 100 100 100 100 100 100 100 100 100 100 100 100 100 100 100 
100 100 100 100 100 100 100 100 100 100 100 100 100 100 
##$AQSEQ= 0
##$AQ_mod= 3
##$AUNM= <au_zg>
##$AUTOPOS= <48 >
##$BF1= 250.13
##$BF2= 250.13
##$BF3= 250.13
##$BF4= 250.13
##$BF5= 500.13
##$BF6= 500.13
##$BF7= 500.13
##$BF8= 500.13
##$BYTORDA= 1
##$CFDGTYP= 0
##$CFRGTYP= 5
##$CHEMSTR= <none>
##$CNST= (0..31)
1 1 145 1 1 1 1 1 1 1 1 1 1 1 1 1 1 1 1 1 1 1 1 1 1 1 1 1 1 1 1 1 
##$CPDPRG= <>
##$CPDPRG1= <>
##$CPDPRG2= <>
##$CPDPRG3= <>
##$CPDPRG4= <mlev>
##$CPDPRG5= <mlev>
##$CPDPRG6= <mlev>
##$CPDPRG7= <mlev>
##$CPDPRG8= <mlev>
##$CPDPRGB= <>
##$CPDPRGT= <>
##$D= (0..31)
0 1 0 0 0 0 0 0 0 0.06 0 0 0 0 0 0 0.0002 0 0 0 0 0 0 0 0 0 0 0 0 0 0 
0 
##$DATE= 1172579484
##$DBL= (0..7)
120 120 120 120 120 120 120 120 
##$DBP= (0..7)
150 150 150 150 150 150 150 150 
##$DBP07= 0
##$DBPNAM0= <>
##$DBPNAM1= <>
$$ [...]
##$SUBNAM7= <"">
##$SUBNAM8= <"">
##$SUBNAM9= <"">
##$SW= 20.6930455092707
##$SWIBOX= (0..15)
0 0 3 0 0 0 0 0 0 0 0 0 0 0 0 0 
##$SW_h= 5175.983436853
##$TD= 65536
##$TD0= 1
##$TE= 295.16
##$TE2= 300
##$TE3= 300
##$TEG= 300
##$TL= (0..7)
0 120 120 120 120 120 120 120 
##$TP= (0..7)
150 150 150 150 150 150 150 150 
##$TP07= 0
##$TPNAME0= <>
##$TPNAME1= <>
##$TPNAME2= <>
##$TPNAME3= <>
##$TPNAME4= <>
##$TPNAME5= <>
##$TPNAME6= <>
##$TPNAME7= <>
##$TPOAL= (0..7)
0.5 0.5 0.5 0.5 0.5 0.5 0.5 0.5 
##$TPOFFS= (0..7)
0 0 0 0 0 0 0 0 
##$TUNHIN= 0
##$TUNHOUT= 0
##$TUNXOUT= 0
##$USERA1= <user>
##$USERA2= <user>
##$USERA3= <user>
##$USERA4= <user>
##$USERA5= <user>
##$V9= 5
##$VALIST= <valist>
##$VCLIST= <CCCCCCCCCCCCCCC>
##$VD= 0
##$VDLIST= <DDDDDDDDDDDDDDD>
##$VPLIST= <PPPPPPPPPPPPPPP>
##$VTLIST= <TTTTTTTTTTTTTTT>
##$WBST= 1024
##$WBSW= 4
##$XGAIN= (0..3)
0 0 0 0 
##$XL= 0
##$YL= 0
##$YMAX_a= 333853
##$YMIN_a= -318316
##$ZGOPTNS= <>
##$ZL1= 120
##$ZL2= 120
##$ZL3= 120
##$ZL4= 120
##$ABSF1= 16.522
##$ABSF2= -4.171173
##$ABSG= 5
##$ABSL= 3
##$ALPHA= 0
##$AQORDER= 0
##$ASSFAC= 0
##$ASSFACI= 0
##$ASSFACX= 0
##$ASSWID= 0
##$AUNMP= <proc_1d>
##$AZFE= 0.1
##$AZFW= 0.1
##$BCFW= 0
##$BC_mod= 0
##$BYTORDP= 0
##$COROFFS= 0
##$CY= 12.5
##$DATMOD= 1
##$DC= 0
##$DFILT= <>
##$DTYPP= 0
##$F1P= 14.0000005364418
##$F2P= -0.99999901652339
##$FCOR= 0.5
##$FTSIZE= 32768
##$FT_mod= 6
##$GAMMA= 0
##$GB= 0
##$INTBC= 1
##$INTSCL= 1
##$ISEN= 128
##$LB= 0.3
##$LEV0= 0
##$LPBIN= 0
##$MAXI= 10000
##$MC2= 0
##$MEAN= 0
##$ME_mod= 0
##$MI= 0
##$NCOEF= 0
##$NC_proc= -5
##$NLEV= 6
##$NOISF1= 0
##$NOISF2= 0
##$NSP= 0
##$NTH_PI= 0
##$NZP= 0
##$OFFSET= 16.522
##$PC= 1
##$PHC0= 223.389
##$PHC1= 7.190845
##$PH_mod= 1
##$PKNL= yes
##$PPARMOD= 0
##$PSCAL= 4
##$PSIGN= 0
##$REVERSE= no
##$SF= 250.13
##$SI= 32768
##$SIGF1= 0
##$SIGF2= 0
##$SINO= 400
##$SIOLD= 32768
##$SREGLST= <1H.CDCl3>
##$SSB= 0
##$STSI= 32768
##$STSR= 0
##$SW_p= 5175.98343685301
##$SYMM= 0
##$S_DEV= 0
##$TDeff= 65536
##$TDoff= 0
##$TI= <Analysis number 999999
Compound Code 99
Book Reference 9
Project Code 9>
##$TILT= no
##$TM1= 0
##$TM2= 0
##$TOPLEV= 0
##$USERP1= <user>
##$USERP2= <user>
##$USERP3= <user>
##$USERP4= <user>
##$USERP5= <user>
##$WDW= 1
##$XDIM= 32768
##$YMAX_p= 521264766
##$YMIN_p= -215048
$$ End of Bruker specific parameters
$$ ---------------------------------
##NTUPLES= NMR SPECTRUM
##VAR_NAME=  FREQUENCY,     SPECTRUM/REAL,   SPECTRUM/IMAG
##SYMBOL=    X,             R,               I
##VAR_TYPE=  INDEPENDENT,   DEPENDENT,       DEPENDENT
##VAR_FORM=  AFFN,          ASDF,            ASDF
##VAR_DIM=   32768,         32768,           32768
##UNITS=     HZ,            ARBITRARY UNITS, ARBITRARY UNITS
##FACTOR=    0.157963299565203, 1,           1
##FIRST=     4132.6476996994, 0,             0
##LAST=      -1043.33573715361, 0,           0
##MIN=       -1043.33573715361, -215048,     0
##MAX=       4132.6476996994, 521264766,     0
$$ Real data points
##PAGE= N=1
##DATA TABLE= (X++(R..R)), XYDATA
$$ [...]
16533c4323N391O0514J9424m6855m1322j1601J6488k6386K094L2045R789N288
$$ -34323 -28932 31582 51006 4151 -37171 -48772 -32284 -58670 -56576 -24531 -14742 -9454
16521i454J3670J7638j6281p914L2959J5124j5360k3473m40n244p97J5466l273
$$ -9454 4216 21854 5573 -2341 30618 45742 30382 6909 6469 1225 428 15894 12621
16508A2621j0417K9719j1866m9390J0373J7603l9159k0441P0499J5733l342N265
$$ 12621 2204 31923 20057 -29333 -18960 -1357 -40516 -60957 9542 25275 21933 27198
16496B7198m1527j9965M1504m083N886J7910m2611o2232K4955L9487j9169J8776
$$ 27198 -14329 -34294 7210 3127 9013 26923 -15688 -77920 -52965 -13478 -32647 -13871
16484a3871O3603O4081l418m3533M3816M2325m6231k4525K738J0409k1669o1786
$$ -13871 49732 113813 110395 66862 110678 153003 106772 82247 84985 95394 73725 11939
16472A1939P108K8577r48O583N655K3221k9910m2588K3805K6680j9404K4257M113
$$ 11939 19047 47624 46676 53259 58914 82135 52225 9637 33442 60122 40718 64975 69088
16459F9088k8132m7956k6717l1358k243K2565j9784m805K4896M5629K0971l3843
$$ 69088 40956 -7000 -33717 -65075 -67318 -44753 -64537 -69342 -44446 1183 22154 -11689
16447a1689l25L2459J9888O355k0973q1262R230J8494J6028L1398K4666j4259
$$ -11689 -12014 20445 40333 46688 25715 -55547 -46317 -27823 -11795 19603 44269 30010
16435C0010l555o3769j8896K1102M1749k001m4709j1485k893n09N5503L7587M2470
$$ 30010 26455 -37314 -56210 -35108 6641 4640 -40069 -51554 -54447 -54956 547 38134 80604
16422H0604p636m9840r6103L396N2090J2168l9l8557l7685J9615K9187L250o140
$$ 80604 72968 23128 -72975 -69579 -17489 -5321 -5360 -43917 -81602 -61987 -32800 -29550 -35690
16409c5690p143m0923n9743M3541L1297j9565m5367M6603Q2276J0901k9710j8444
$$ -35690 -42833 -83756 -143499 -99958 -68661 -88226 -133593 -86990 -4714 6187 -23523 -41967
16397d1967M5789K8142R419J3838m0214j5138l1320k5863J3003K7635k4792K4542
$$ -41967 3822 31964 41383 55221 15007 -131 -31451 -57314 -44311 -16676 -41468 -16926
16385a6926R049K0610N6701k1713l0560l6700j0084J1497M842k1769J4704K2161
$$ -16926 -7877 12733 69434 47721 17161 -19539 -29623 -18126 -13284 -35053 -20349 1812
16373A812J7263l1646l4708K9406J9944o3577l7756L9053J8570k6549K5966L4691
$$ 1812 19075 -12571 -47279 -17873 2071 -61506 -99262 -60209 -41639 -68188 -42222 -7531
16361g531J083n804o0076l9278n0347K4415K6166J08j1757J08036M5941m2563
$$ -7531 -6448 -12252 -72328 -111606 -161953 -137538 -111372 -111264 -123021 -14985 30956 -11607
16349a1607k2846N0771K2911k5234n9860n0370l000N521k1063m053K4217R321
$$ -11607 -34453 16318 39229 13995 -45865 -96235 -99235 -93714 -114777 -118830 -94613 -85292
16337h5292J1454O6339n275k1191Q192l7440L524M1972m4830M390K6224L2235
$$ -85292 -73838 -7499 -12774 -33965 -25773 -63213 -59689 -17717 -62547 -58157 -31933 302
16325C02K114K5969L4058r356k4674n822j2537P426j7628K455O550j9057J0834
$$ 302 2416 28385 62443 53087 28413 22591 10054 17480 -148 2307 8857 -10200 634
16312F34L8143K8348o565o7964q8218P101M6287L3698k8527k8966j8103j771K7994
$$ 634 38777 67125 60560 -7404 -95622 -88521 -42234 -8536 -37063 -66029 -84132 -85903 -57909
16299e7909M0951M8341j4594k1826q672l7325K2047J696k9803M0651R055r308
$$ -57909 -16958 31383 16789 -5037 -13709 -51034 -28987 -27291 -57094 -16443 -7388 -16696
16287a6696j179J8809K6861k9682n1524l6638k6499M7370N1719K9037p3141m2062
$$ -16696 -17875 934 27795 -1887 -53411 -90049 -116548 -69178 -17459 11578 -61563 -103625
16275a03625M1672Q3858J6530k8930o2383n5581M9583M5993o124k258k3503p7557
$$ -103625 -61953 21905 38435 9505 -52878 -108459 -58876 -12883 -19007 -21265 -44768 -122325
16263a22325o6334O8685K5572K0145m43j5366j6284j4065K1051L7763L9024l8994
$$ -122325 -188659 -119974 -94402 -74257 -74700 -90066 -106350 -120415 -99364 -61601 -22577 -61571
16251f1571r990O6301M4409q3479K2406j785o5632o3753j6633L2006N7976M4600
$$ -61571 -71561 -5260 39149 -44330 -21924 -23709 -89341 -153094 -169727 -137721 -79745 -35145
16239c5145p985j9348n685Q1495N3183J5561k3715m2793k8894m763O7245q842
$$ -35145 -43130 -62478 -68163 13332 66515 82076 58361 15568 -13326 -18089 49156 40314
16227D0314o6416N075l2928K9044O055L9454K4537k9280l2806j8331O866J1146
$$ 40314 -26102 -21027 -53955 -24911 -18856 20598 45135 15855 -16951 -35282 -28416 -17270
16215a7270P619M066L892K8991l7305k0200K2276k5110k9003O3752N2482L5612
$$ -17270 -9651 -5585 -1693 27298 -10007 -30207 -7931 -33041 -62044 1708 54190 89802
16203H9802k6244R324L6464j8395l8581k2604j5301k4467J7700Q769O989P668
$$ 89802 63558 72882 109346 90951 52370 29766 14465 -10002 7698 16467 23456 31124
16191C1124K8819K2446o6604k062L1746l9604J0005j4869n3190l7484J0104N3128
$$ 31124 59943 82389 15785 13723 45469 5865 15870 1001 -52189 -89673 -79569 -26441
16179b6441J9875L5018l8458o569k552K2881K5754J7284j6488j5068n034j9368
$$ -26441 -6566 28452 -10006 -16575 -19127 3754 29508 46792 30304 15236 10202 -9166
16167i166P326K1333J8563j1855l5911k5521j7750K9485K0660m5402k4840M852
$$ -9166 -1840 19493 38056 26201 -9710 -35231 -52981 -23496 -2836 -48238 -73078 -68226
16155f8226L385l123l4782q937L1324M5102M1555l7493k2057n473L1225J5897
$$ -68226 -64841 -67964 -102746 -111683 -80359 -35257 6298 -31195 -53252 -58725 -27500 -11603
16143a1603J1919O615n596Q981M9630k5335n420l5848j6879L645J5388j074L647
$$ -11603 316 6931 1335 10316 59946 34611 29191 -6657 -23536 -19891 -4503 -5577 -1930
16130a930j6930k028k6971K6983K3693O1214k9051l2251O0142R254n980n6573
$$ -1930 -18860 -20888 -47859 -20876 2817 64031 34980 2729 62871 72125 66145 9572
16118I572J5448k2717k1735m999j1068J4106L9747m429n0965k9500k1853R948
$$ 9572 25020 2303 -19432 -24431 -35499 -21393 18354 13925 -37040 -66540 -88393 -78445
16106g8445L0314M3946K2388J15J722j3138J1436m6199j0940L8538K030K6984
$$ -78445 -48131 -4185 18203 18318 20040 6902 18338 -27861 -38801 -263 1767 28751
16094B8751l5966q775k1970J3467J9680J9072j1551m7947L492J4470M9285O505
$$ 28751 -7215 -15990 -37960 -24493 -4813 14259 2708 -45239 -41747 -27277 22008 28513
16082B8513j3584j4375j2673P26K2063n4039j847k2892n9729N6936N6472K7452
$$ 28513 14929 554 -12119 -11393 10670 -43369 -45216 -68108 -127837 -70901 -14429 13023
16070A3023M5758K6845o7904p1512L57L7389k0438j1440N155L3695l5211p831
$$ 13023 58781 85626 17722 -53790 -53433 -16044 -36482 -47922 -42767 -9072 -44283 -52114
16058e2114o057K3446J2877J6647j6904j596j8063K7811L2112O388l392l2212
$$ -52114 -58171 -34725 -21848 -5201 -22105 -23701 -41764 -13953 18159 24547 21155 -11057
16046a1057k877j7965Q7149L1972k4428n627L5357J9685k2805k9092j4850M6569
$$ -11057 -13934 -31899 55250 87222 62794 57167 92524 112209 89404 60312 45462 92031
16034I2031j0881k5239J8992r297o1188q0636m7837J5686K9449k2674J328M5092
$$ 92031 81150 55911 74903 65606 4418 -76218 -124055 -108369 -78920 -101594 -100266 -55174
16022e5174L070p072l2410O5863K5949n6996q207O8682J0931n610o489j6933j4328
$$ -55174 -52104 -59176 -91586 -25723 226 -56770 -64977 3705 14636 9026 2537 -14396 -28724
16009b8724N5075n374N548M6294N3556l6557q4168m2312k2061M06M5899o260K7215
$$ -28724 26351 20977 26525 72819 126375 89818 5650 -36662 -58723 -58317 -12418 -18678 8537
15996H537J5537p879o6115l6801K1627L0860l3127K4032r128M1786N5704n2406
$$ 8537 24074 16195 -49920 -86721 -65094 -34234 -67361 -43329 -52457 -10671 45033 -7373
15984g373m400J071l0359j3806j2836L995K9404J741M3173K3977O0449L6778p0958
$$ -7373 -11773 -10702 -41061 -54867 -67703 -63708 -34304 -32563 10610 34587 95036 131814 60856
15971F0856o7634J7925J156k9933J937J1860L4492N8668O067k9672o2466r539
$$ 60856 -6778 11147 12303 -17630 -15693 -3833 30659 89327 95394 65722 3256 -6283
15959f283J0098q83l2987l4889K1178N6211J9219k0295m9555N3837J5336J3025
$$ -6283 3815 2932 -30055 -64944 -43766 12445 31664 11369 -38186 15651 30987 44012
15947D4012K2204K3938p949m2617j5383n604k1422K2191Q282J0300p623o4929
$$ 44012 66216 90154 82205 39588 24205 18601 -2821 19370 27652 37952 30329 -34600
15935c4600J1186N6728O153O466o765j0347m2388m2206K4925M6108j4685K4810
$$ -34600 -23414 33314 39467 45933 39168 28821 -13567 -55773 -30848 15260 575 25385
15923B5385p740m044J5835o9986m186Q8827N7110n1127Q531k3672k4253J1702
$$ 25385 17645 13601 29436 -40550 -44736 44091 101201 50074 58605 34933 10680 22382
15911B2382L0140m3645J6097P903l5657j9508J0614O4408L383Q2J0752K2451O776
$$ 22382 52522 8877 24974 32877 -2780 -22288 -11674 52734 56117 56199 66951 89402 96178
15898I6178m3965k0389j5334l9937j4071K9677M0374q469m6138l6335k8001J3036
$$ 96178 52213 31824 16490 -23447 -37518 -7841 32533 24064 -22074 -58409 -86410 -73374
15886g3374N1515P0489k8793p2906j7419L4701j8645K798L0217m0929n940J3422
$$ -73374 -21859 48630 19837 -53069 -70488 -35787 -54432 -51634 -21417 -62346 -68286 -54864
15874e4864L4862n738K2508l0282m5411J6388o076l1079k7035O2069R0501L4700
$$ -54864 -20002 -25740 -3232 -33514 -78925 -62537 -68613 -99692 -126727 -64658 25843 60543
15862F0543L6576P357l6199o7403j7323j3670j6708L2555K2110j1608O463L252
$$ 60543 97119 104476 68277 874 -16449 -30119 -46827 -14272 7838 -3770 2693 5945
15850E945k0346k6817J2647J9062K1806k4282Q532l1606n9387K4804L3361K1483
$$ 5945 -14401 -41218 -28571 -9509 12297 -11985 -3453 -35059 -94446 -69642 -36281 -14798
15838a4798L4040o5875k6833L9636O357j2078k4120K0549Q944J2512M0813L4675
$$ -14798 19242 -46633 -73466 -33830 -27473 -39551 -63671 -43122 -34178 -21666 19147 53822
15826E3822k0078n0472L053J7885k2295m50L1298N954k916K3074k5899j3058j5661
$$ 53822 33744 -16728 -13675 4210 -18085 -18535 12763 18717 15801 38875 12976 -82 -15743
15813a5743n6287Q1208P9680K3190n6580o1393k5132l8651L2789L9002m736j5239
$$ -15743 -72030 9178 88858 112048 55468 -5925 -31057 -69708 -36919 2083 -2653 -17892
15801a7892l619N3466r237q302M272J902p0844m5008N611K1334N0329J7864k7042
$$ -17892 -21511 31955 22718 14416 18688 20590 -50254 -95262 -89651 -68317 -17988 -124 -27166
15788b7166J9610K8352k4148K0046J197k2170L3996K6133j6673k3358l5616l4900
$$ -27166 -7556 20796 -3352 16694 17891 -4279 29717 55850 39177 15819 -19797 -54697
15776e4697K7170L8423m5143m5159n1226M4003K7811K3123J03107M2455k6176
$$ -54697 -27527 10896 -34247 -79406 -130632 -86629 -58818 -35695 67412 109867 83691
15765H3691m5116j0333N1932J6470j582q6281Q94q05l054J2134j1036P0O027J435
$$ 83691 38575 28242 80174 96644 95062 8781 9675 8870 5816 17950 6914 6984 13011 14446
15751A4446j0242J0187k807o10k2749K3735K0342l4887m3818M0124L9627l8755
$$ 14446 4204 14391 11584 10974 -11775 11960 32302 -2585 -46403 -6279 33348 -5407
15739e407m3086L0063J3148K7385j0921j5154O9826N0436l547K9677Q557k5122
$$ -5407 -48493 -18430 -5282 22103 11182 -3972 65854 116290 112743 142420 150977 125855
15727A25855M8843l83o5096l8890o768l5387j0168R770p383j304Q006j7632L470
$$ 125855 174698 174315 109219 70329 63561 28174 18006 27776 20393 19089 27095 9463 12933
15714A2933L1316q402K2877P560p2038n278L8446J0688J1880j885J7139J8772
$$ 12933 44249 35847 58724 66284 -5754 -11032 27414 38102 49982 48097 65236 84008
15702H4008l105j3027p4463m8746j9828k1666J8054J9364J2200n37K8311J6260
$$ 84008 80903 67876 -6587 -55333 -75161 -96827 -78773 -59409 -47209 -47746 -19435 -3175
15690c175M334M9358L6214k009o1945m1512n1506k0907N9751J218k2597p2833
$$ -3175 1159 50517 86731 84722 22777 -18735 -70241 -91148 -31397 -30179 -52776 -125609
15678a25609P0605K3205k1041O719L4854J7171l2683j351L2339n506n5152j053
$$ -125609 -55004 -31799 -52840 -46121 -11267 5904 -26779 -28130 4209 -1297 -56449 -57502
15666e7502J1216J5880L7045K1330M2156J3456n9979J9336L9991m1970l5246j5817
$$ -57502 -46286 -30406 6639 27969 70125 83581 23602 42938 82929 40959 5713 -10104
15654a0104j02646M6838P6521o5945n4711N7795m3207L4875P2444M1053j8803
$$ -10104 -112750 -65912 10609 -55336 -110047 -52252 -95459 -60584 11860 52913 34110
15643C4110m3306O18m098K0703K372K8312L0189j0986J2588l3818k9437j3202
$$ 34110 -9196 -8578 -12676 8027 10399 38711 68900 57914 70502 36684 7247 -5955
15631e955K4312K148K757n6966P027J0968L362k2996N994m357r259M1197J482
$$ -5955 18357 20505 23262 -33704 -26677 -15709 -12347 -35343 -29349 -33706 -42965 -1768 -286
15618b86m1008K4524J9854J5503M6068L5498K8691n3081N99P1126q0408m1086
$$ -286 -41294 -16770 3084 18587 64655 100153 128844 75763 76362 147488 67080 25994
15606B5994l408m3693l3902N1194j8973j3322L0055k962J8128K3927l8637o1558
$$ 25994 22586 -21107 -55009 -3815 -22788 -36110 -6055 -9017 9111 33038 -5599 -67157
15594f7157K999K9105J7236n9736J6343O3823J7899O673l4447j3020O506k735
$$ -67157 -64158 -35053 -17817 -77553 -61210 2613 20512 27185 -7262 -20282 -13776 -16511
15582a6511L0999J7027k3926J2428k4567K768K1342N3165k5171q0322m802N1075
$$ -16511 14488 31515 7589 20017 -4550 -1782 19560 72725 47554 -32768 -37570 13505
15570A3505M0549m2479m340R241K92J4507j1279k6678l9040k0853J2223J9269
$$ 13505 54054 11575 7235 16476 16768 31275 19996 -6682 -45722 -66575 -54352 -35083
15558c5083o543Q259j8352M4319M664K3775L62k1673O369K456p583k3826j9303
$$ -35083 -41626 -33367 -51719 -7400 -2736 21039 21401 -272 6097 8553 970 -22856 -42159
15545d2159j1054R653K0972M5380R647q500j7243r163Q148J998K0659K370o9375
$$ -42159 -53213 -43560 -22588 22792 32439 23939 6696 -2467 5681 7679 28338 30708 -38667
15532c8667K531j3804m2441m7137N9649Q2183J1830l0143k928N171j2615p01K8914
$$ -38667 -36136 -49940 -92381 -139518 -79869 2314 14144 -15999 -18927 -13756 -26371 -27072 1842
15519A842o986k2352m0850M0944L7250p9K0455k0941l1485J2057Q98l1980O20
$$ 1842 -5144 -27496 -68346 -27402 9848 9769 30224 9283 -22202 -10145 -9247 -41227 -40607
15506d0607M878M4368J0450j1441K893k3559P984K3475l8080P581L8393j951K2666
$$ -40607 -35729 8639 19089 7648 10541 -13018 -5034 18441 -19639 -12058 26335 24384 47050
15493D7050j434l313p105j1959m060l6890l1253K0195K4272M818J99k4462J764
$$ 47050 45616 42303 35198 23239 19179 -17711 -48964 -28769 -4497 321 520 -23942 -22178
15480b2178J0131L6080J2116n595m0649J6223Q299K4078k4702K2510K333j4558
$$ -22178 -12047 24033 36149 30554 -10095 6128 14427 38505 13803 36313 38646 24088
15468B4088M5391k5365k1136L2995l795l4998p010J4094N6665j1358k1297M4086
$$ 24088 69479 44114 22978 55973 52178 17180 10170 24264 80929 69571 48274 92360
15456I2360n9330r1952k5046L0449K1637j7145L8669J2038l8572J7402P2134J5268
$$ 92360 33030 -58922 -83968 -53519 -31882 -49027 -10358 1680 -36892 -19490 52644 67912
15444F7912J4318Q785N881l547l835j7879j6950o3722L1515L7628j8186l7135
$$ 67912 82230 91015 96896 93349 89514 71635 54685 -9037 22478 60106 41920 4785
15432D785l4716m4401j0286L6467p868K1711N9891p957M712l3595n3450K037J3541
$$ 4785 -29931 -74332 -84618 -48151 -56019 -34308 25583 17626 22338 -11257 -64707 -62670 -49129
15419d9129L6945Q6379J0987k5355k548k5412r231j4998k5844q420O313O5055
$$ -49129 -12184 74195 85182 59827 57279 31867 22636 7638 -18206 -26626 -20313 44742
15407D4742L3051l1498K8605l9676J8279K1992K0004o8629m4089L3540l728J6363
$$ 44742 77793 46295 74900 35224 53503 75495 95499 26870 -17219 16321 12593 28956
15395B8956K2119j0493k0945r386L6175l8199j7589j7700Q450L9052j6164j10493
$$ 28956 51075 40582 19637 10251 46426 8227 -9362 -27062 -18612 20440 4276 -106217
15383a06217J4854L3783p077J1821k7923l7513m1105L1435P0850P8463P3845l8791
$$ -106217 -91363 -57580 -64657 -52836 -80759 -118272 -159377 -127942 -57092 21371 95216 56425
15371E6425k4618J82K2057L9832k750m5102k1097l6029n8821L7901j0587j4769
$$ 56425 31807 31989 54046 93878 91128 46026 24929 -11100 -69921 -32020 -42607 -57376
15359e7376j5427N3896J6327j5474m749j673n6781j7718M3062O135M4372L6083
$$ -57376 -72803 -18907 -2580 -18054 -22803 -24476 -81257 -98975 -55913 -49778 -5406 30677
15347C0677k8385K3103M8015l8211o9682n2465M5478K0438r3000N4833Q7610R710
$$ 30677 2292 25395 73410 35199 -34483 -86948 -41470 -21032 -114032 -59199 28411 38121
15335C8121n495M3220p9022q9864N3097P2067J5611m3266j5682K4929J450O282
$$ 38121 32626 75846 -3176 -93040 -39943 32124 47735 4469 -11213 13716 15166 21448
15323B1448M3489M9922j4997n7366l3379q238m7044K9068K0837o576k4453J7865
$$ 21448 64937 114859 99862 42496 9117 879 -46165 -17097 3740 -2836 -27289 -9424
15311i424l344k14L6308k192K5832L4297o007k8183p183J0472J3345n982R066
$$ -9424 -12768 -12982 23326 21134 46966 81263 75256 47073 39890 50362 63707 57725 66791
15298F6791N82n3014l3966R119Q37j4571M9391L5341j2794q387N503j550q148
$$ 66791 67373 14359 -19607 -10488 -9651 -24222 25169 60510 47716 39329 44832 43282 35134
15285C5134l7180K1232r482m4470k5900o96M6161N727j6174j1162k4325k4449
$$ 35134 -2046 19186 9704 -34766 -60666 -61362 -15201 -9474 -25648 -36810 -61135 -85584
15273h5584M4724K1605O668J1369l0596R214K6323J1915N4708K7010l9120j1567
$$ -85584 -40860 -19255 -12587 -1218 -31814 -22600 3723 15638 70346 97356 58236 46669
15261D6669l6953N1156L4527o1126o7888j5481k5288K8779M0482M1483J2915r919
$$ 46669 9716 60872 95399 34273 -33615 -49096 -74384 -45605 -5123 36360 49275 39356
15249C9356n6972K8103L8293L54M352l1520l7932k6236J4573m26N812k8646M125
$$ 39356 -17616 10487 48780 49134 53486 21966 -15966 -42202 -27629 -28055 -22243 -50889 -46764
15236d6764K8574q279K7013L7690L2180p1889l2533J6773J3415l1381m4117O1481
$$ -46764 -18190 -26469 544 38234 70414 -1475 -34008 -17235 -3820 -35201 -79318 -17837
15224a7837J4790L4724N311l8719k2729r987j4929N3127j4471k0184Q319P1998
$$ -17837 -3047 31677 36988 -1731 -24460 -34447 -49376 3751 -10720 -30904 -22585 49413
15212D9413R544O626o2935o20j792k0725N028K7744j4721J3655J468o3164r9676
$$ 49413 58957 65583 2648 2028 236 -20489 -15461 12283 -2438 11217 12685 -50479 -150155
15199a50155o567O5637Q6689J0535j3717N928q869k5007k6692m5360O6816M8983
$$ -150155 -156722 -91085 -4396 6139 -7578 -1650 -10519 -35526 -62218 -107578 -40762 8221
15187H221R009p284o739j0092l5908K423M171K0021K5540r838K003O0876M0885
$$ 8221 17230 9946 3207 -6885 -42793 -40370 -36199 -16178 9362 -476 1527 62403 103288
15174A03288o5466n6488J8816J363j5060j2488L6710L9237m1913l8167r065J0015
$$ 103288 37822 -18666 150 1513 -13547 -26035 10675 49912 7999 -30168 -39233 -29218
15162b9218N3314L2216m4481n877k9886L1191l797L3192j5117k1452J2039k3960
$$ -29218 24096 56312 11831 5954 -23932 7259 3462 36654 21537 85 12124 -11836
15150a1836l2673k9409M7106R6993L4411q7122n3117K2360j1867K1702P5700k6755
$$ -11836 -44509 -73918 -26812 70181 104592 17470 -35647 -13287 -25154 -3452 72248 45493
15138D5493P260L0040l8711l8109j3562M8893N8842m675k9719k3256n3524k0221
$$ 45493 52753 82793 44082 5973 -7589 41304 100146 95471 65752 42496 -11028 -31249
15126c1249J3544K8222O5671M8751j7261k8115k3116j8004k4935k779N8618K7037
$$ -31249 -17705 10517 76188 124939 107678 79563 56447 38443 13508 10729 69347 96384
15114I6384J2063M0331m9202r6401j4856K9923l8637k1897j2781k9281O8704M4453
$$ 96384 108447 148778 99576 3175 -11681 18242 -20395 -42292 -55073 -84354 -15650 28803
15102B8803J5486k7565L1k1961l568K0553M887j9848k4667Q276M4273n3244N81
$$ 28803 44289 16724 16755 -5206 -8774 11779 16666 -3182 -27849 -19573 24700 -28544 -27963
15089b7963k557m80l8854l976O0174l301j2906L9225J4440j7763k7026L2729M2261
$$ -27963 -30520 -31000 -69854 -73830 -13656 -16957 -29863 9362 23802 6039 -20987 11742 54003
15076E4003j167j0733j573n968n2154J9008k0170J1719k8596j7887K1036J2086
$$ 54003 52836 42103 40530 34562 -17592 1416 -18754 -7035 -35631 -53518 -32482 -20396
15064b0396j4704L1936J2014j1226l8118L3310n842L9512J2694Q621n0667m8273
$$ -20396 -35100 -3164 8850 -2376 -40494 -7184 -13026 26486 39180 47801 -2866 -51139
15052e1139M3189L7394L0411M237l1136M594l4462k8943K129j4760J7384L8928
$$ -51139 -7950 29444 59855 64092 32956 37550 3088 -25855 -23726 -38486 -21102 17826
15040A7826n810q38r81J6311l751k4412k2590j5613L2476L6143L9150j9399j8180
$$ 17826 12016 11178 10197 26508 22757 -1655 -24245 -39858 -7382 28761 67911 48512 30332
15027C0332M217J2818j7713N9652l3901m9548k0981L0482j7454k3283L2863L8721
$$ 30332 34549 47367 29654 89306 55405 5857 -15124 15358 -2096 -25379 7484 46205
15015D6205n4571J5648M1969O269J8980k2293l5105m4017O048M5620j5578J3527
$$ 46205 -8366 7282 49251 55520 74500 52207 17102 -26915 -20867 24753 9175 22702
15003B2702N9231o8983l3466J7602L2609L4990l0589l4296J6954n4761m3798L4898
$$ 22702 81933 12950 -20516 -2914 29695 64685 34096 -200 16754 -38007 -81805 -46907
14991d6907M3638O459J9771k7333n543K1955N56J9754j3905p7n997l352j6901
$$ -46907 -3269 3190 22961 -4372 -9915 12040 12596 32350 18445 18368 12371 9019 -7882
14978g882K3837L401L5730K9868l5333l660m007q1255j7156R0821J2634p907l5074
$$ -7882 15955 19356 55086 84954 49621 45961 41954 -39301 -56457 34364 46998 39091 4017
14965D017k7518O171p332K0839L5906M163J2201k9884l9208j4252m256n1694M0739
$$ 4017 -23501 -17330 -24662 -3823 32083 36246 48447 18563 -20645 -34897 -39153 -90847 -50108
14952e0108J4510J9394L6001k892P4144O1143l2152n9331r281L3876J820K229
$$ -50108 -35598 -16204 19797 16905 91049 152192 120040 60709 51428 85304 87124 89353
14940H9353k1311K1463K7450p325n4280k2973j3588O10k469J6182O3322N4790
$$ 89353 68042 89505 116955 109630 55350 32377 18789 19399 16930 33112 96434 151224
14928A51224K6920k6020n7454o77j6189l97m0912m4725j761j1631J1618K6992
$$ 151224 178144 152124 94670 93993 77804 77407 36495 -8230 -9991 -21622 -10004 16988
14916A6988n72j9699q127n971k9222M1521P1257k3648j1738J1855K1397k7118
$$ 16988 16416 -3283 -11410 -17381 -46603 -5082 66175 42527 30789 42644 64041 36923
14904C6923L133K2968j6075Q1136K2058p2783n1971L703Q164r871j8163k234o346
$$ 36923 40056 63024 46949 128085 150143 77360 25389 29092 37256 27385 9222 6988 642
14891F42J6025K1915q293J9972k2810k5510o893K1257J8342n9128q779P151J2868
$$ 642 16667 38582 30289 50261 27451 1941 -4952 16305 34647 -24481 -33260 -26109 -13241
14878a3241L7782q209k9974M7988J4814M1884q887n3145K7340J8150j7639P1704
$$ -13241 24541 16332 -13642 34346 49160 91044 82157 29012 56352 74502 56863 128567
14866A28567n3171n6950l1371n7751j8200N2034K8075j8405K8598J5771J3037
$$ 128567 75396 18446 -12925 -70676 -88876 -36842 -8767 -27172 1426 17197 30234
14855C0234j9914m1676K3386M1730J9482m4802k2857M3503K2370j4871k8910J6501
$$ 30234 10320 -31356 -7970 33760 53242 8440 -14417 29086 51456 36585 7675 24176
14843B4176n406N280L2287P2198Q0043J5928o9064n9974k8064J6490p2141o781
$$ 24176 18770 24050 56337 128535 208578 224506 155442 95468 67404 83894 11753 4972
14831D972r579L2591j4548k9948J9444O5552M3404k5118L1880M2077j8106n1046
$$ 4972 -4607 27984 13436 -16512 2932 68484 111888 86770 118650 160727 142621 91575
14819I1575o0739Q552K7004q3743r220M0094j6692Q460j6981K5277j9330k153
$$ 91575 30836 39388 66392 -17351 -26571 13523 -3169 5291 -11690 13587 -5743 -7896
14807g896J5269K8510K9605k9843o9758m274J1889M7932M7329J3491K1404J1923
$$ -7896 7373 35883 65488 35645 -34113 -38387 -26498 21434 68763 82254 103658 115581
14795A15581n8073j6581J2806m345L4587j0057q035l1278k0343M722Q296n636
$$ 115581 57508 40927 53733 49388 83975 73918 65883 34605 14262 18984 27280 21644
14783B1644l2267J2823K3988J2299L8487l1183n3028j651M4306L1199K6672j5696
$$ 21644 -10623 2200 26188 38487 76974 45791 -7237 -8888 35418 66617 93289 77593
14771G7593o4475J6500j1082R181K6135J6262o1531O679K6335o070l7775N0438
$$ 77593 13118 29618 18536 27717 53852 70114 8583 15262 41597 35527 -2248 48190
14759D8190M7600o6056k7695L264N1934M8724M0380K2142N523k4779o1062n9226
$$ 48190 95790 29734 2039 5303 57237 105961 146341 168483 174006 149227 88165 28939
14747B8939j5881l5370o2111L2194J08845L8596n1151m9673o6857j6696N1429
$$ 28939 13058 -22312 -84423 -52229 56616 95212 44061 -5612 -72469 -89165 -37736
14736c7736N2463M1857m3104l361k239k9694r867R739P2171N0277P831q77k4216
$$ -37736 14727 56584 13480 10119 7880 -21814 -31681 -21942 50229 100506 108337 107460 83244
14723H3244l7619k0737K9619k0424K6015l0634Q172j5381N325J6252j9268L9547
$$ 83244 45625 24888 54507 34083 60098 29464 37636 22255 27580 43832 24564 64111
14711F4111P107m3456n2618L0106M1500j8461q5879q07O9812j6909J4589K0729
$$ 64111 71218 27762 -24856 5250 46750 28289 -57590 -58397 11415 -5494 9095 29824
14699B9824J7648o0287J661J4237j391j3645j9260K7603l5573k7072L7589M8923
$$ 29824 47472 -12815 -11154 3083 1692 -11953 -31213 -3610 -39183 -66255 -28666 20257
14687B0257J7286j3356N556Q205j385j2658p94j0164N988J2922J961N556J8302
$$ 20257 37543 24187 29743 37948 36563 23905 23111 12947 18935 31857 33818 39374 57676
14674E7676n9332p930O9498r984m8973o373K1613J2663M1824K7761Q127j8285
$$ 57676 -1656 -9586 59912 49928 955 -5418 16195 28858 70682 98443 106570 88285
14662H8285j3279n0840K46R845N1484K2006o435J972m8401K3611J2867k7082j8198
$$ 88285 75006 24166 24412 34257 85741 107747 101312 103284 54883 78494 91361 64279 46081
14649D6081M2204J4192Q004l0278k1718p3106j5581K0029K7453N0636n328n016
$$ 46081 88285 102477 110481 80203 58485 -14621 -30202 -10173 17280 67916 62588 57572
14637E7572M3084j991J4549N1018n755J97j8009k9938l6915J7193L9069o582j0507
$$ 57572 100656 98665 113214 164232 158477 158674 140665 110727 73812 91005 130074 123492 112985
14624A12985p608r444M2644k1190l3523R26J2944m4397o4204j7971K8789n708
$$ 112985 105377 95933 138577 117387 83864 84790 97734 53337 -10867 -28838 -49 -5757
14612e757k8344J9229M1079O7674j9332m1091o932J4447M5082m462m833O083l777
$$ -5757 -34101 -14872 26207 93881 74549 33458 26526 40973 86055 81593 76760 82843 79066
14599G9066k264m546K1480k3835m8067L1655L7851L4646K3511n4973n4925l427
$$ 79066 76802 72256 93736 69901 21834 53489 91340 125986 149497 94524 39599 36172
14587C6172J4119l425K8814r956r3874l7109M551M3830N0396N531k6805K3596
$$ 36172 50291 46866 75680 65724 -28150 -65259 -60708 -16878 33518 39049 12244 35840
14575C5840P0694k6283k3966M8411M1737k3046l3287k2640N6372K7868n7587n043
$$ 35840 106534 80251 56285 104696 146433 123387 90100 67460 123832 151700 94113 89070
14563H9070J9493q878J0551q721J4560k7046l1565n9239K3907O9305j6800L0589
$$ 89070 108563 99685 110236 101515 116075 89029 57464 -1775 22132 91437 74637 105226
14551A05226K0002l0433N9514J8432j9615j7587l4353l3411Q658J530L565l386
$$ 105226 125228 94795 154309 172741 153126 135539 101186 67775 76433 77963 81528 78142
14539G8142L8343M5260L44n9008l7531K4112M0202J2447q3269n169r570N3029
$$ 78142 116485 161745 162089 103081 65550 89662 129864 142311 59042 53873 44303 97332
14527I7332N7633k2548n0805L8744J7774J620l6700j9189n3972L4836Q3137L9623
$$ 97332 154965 132417 81612 120356 138130 139750 103050 83861 29889 64725 147862 187485
14515A87485m3831m906O777m5395m5173N2979N217l0509j6628J715O4786P5452
$$ 187485 143654 138748 145525 100130 54957 107936 113153 82644 66016 67731 132517 207969
14503B07969J5232p209k5537k8300k5315k5013J302P4148m0719m7553M217K5907
$$ 207969 223201 215992 190455 162155 136840 111827 113129 187277 146558 99005 103222 129129
14491A29129J0343k50J592P2527M7259J5868k591K6521J9297n327m7233j9822
$$ 129129 139472 139222 140814 213341 260600 276468 273877 300398 319695 314368 267135 247313
14479B47313m4304m0368m1314L9718M9779O439l6368k7315R194q535m1332J6241
$$ 247313 203009 162641 121327 161045 210824 217263 180895 153580 162774 154239 112907 129148
14467A29148R3833P1446o0070m5084M131L1622O0688r508l4998o9005l0292k9861
$$ 129148 222981 294427 234357 189273 193404 225026 285714 276206 241208 172203 141911 112050
14455A12050m457L9265P1526P99J4580m7766K4253O6004m2393r907l5311J0199
$$ 112050 107593 146858 218384 219183 233763 185997 210250 276254 233861 223954 188643 198842
14443A98842K3623L0369j4292J9851O5176K081j000m556N1128N483r8114n176
$$ 198842 222465 252834 238542 258393 323569 325650 324650 320094 371222 376705 278591 273415
14431B73415M0071k1709J1868L1917O7055L1120j3695L162J4039O183p0071n6899
$$ 273415 313486 291777 303645 335562 402617 433737 420042 423204 437243 443426 373355 316456
14419C16456J2902o536J087r635J7128O5738N0264j2507j3395o244L9877P9326
$$ 316456 329358 322822 323909 314274 331402 397140 447404 434897 421502 415258 455135 534461
14407E34461J4861j9930J8437j4001j5252M1947M9580L433K5191M2644J04514
$$ 534461 549322 529392 547829 533828 518576 560523 610103 613536 638727 681371 785885
14396G85885J34874K14408K42206K95371K81209K86295J70178J20211o5779j78827
$$ 785885 920759 1135167 1377373 1672744 1953953 2240248 2410426 2530637 2464858 2286031
14386B286031k58864l12071k88282j94741j62068j45659j07967r0939m7921j11705
$$ 2286031 2027167 1715096 1426814 1232073 1070005 924346 816379 725440 677519 565814
14376E65814j6705j258k9936L3735O1250L6738o2481p2915k5332j5457k0839k8422
$$ 565814 549109 547851 517915 551650 612900 649638 587157 514242 488910 473453 452614 424192
14364D24192M4299l7061n2166J2751R183R845L6122L0695k743m6567j069r088
$$ 424192 468491 431430 379264 392015 401198 411043 447165 477860 475117 428550 427481 418393
14352D18393j1478L497J0992q4575j0712J8435K6240r3283j9291O6037J0010m5091
$$ 418393 406915 410412 421404 336829 326117 344552 370792 277509 258218 324255 334265 289174
14340B89174o752K1093j1224j1227N6668L0144l1856m4934L0078k0486K8314K4748
$$ 289174 282422 303515 292291 281064 337732 367876 336020 291086 321164 300678 328992 353740
14328C53740k4289j3420M1358m0328l2665l2096j4295J950L4345L6691K1494j8493
$$ 353740 329451 316031 357389 317061 284396 252300 238005 239955 274300 310991 332485 313992
14316C13992K7977r458k3970k2003j9095m0632L077k8611o5398O1037O3480K9278
$$ 313992 341969 332511 308541 286538 267443 226811 229888 201277 135879 196916 260396 289674
14304B89674k8787k9338q625m1535l6208O0242K4475j5938L2713L0864k2476m4235
$$ 289674 260887 231549 222924 181389 145181 205423 229898 213960 246673 277537 255061 210826
14292B10826p1043J0631K6707J345k3920m9353N1366R8376K6578q0158j26178
$$ 210826 139783 150414 177121 178466 154546 105193 156559 254935 281513 201355 75177
14281G5177k6612Q2734K5156k5246r171j011P506k0229K5181j1381j1154K1254
$$ 75177 48565 131299 156455 131209 122038 121027 128533 108304 133485 122104 110950 132204
14269A32204K7694Q520l8750L9395O1120J8335m3374J7788m184m6511J507j1052
$$ 132204 159898 168418 129668 169063 230183 248518 205144 222932 218748 172237 173744 162692
14257A62692l1655k68J6726M102J5658n7954j4832j0251M5339R7898P956o5815
$$ 162692 131037 130769 147495 151597 167255 109301 94469 84218 129557 227455 235411 169596
14245A69596m8369J524N2944J7871n0404q5L5434j625K7926n782l5216m2574J4903
$$ 169596 121227 122751 175695 193566 143162 143077 178511 176886 204812 199030 163814 121240 136143
14232A36143L2206j6693R284J8730k5845q913J6278j8249K1567j700k6933J4861
$$ 136143 168349 151656 160940 179670 153825 144912 161190 142941 164508 162808 135875 150736
14220A50736k620m5115j6653O5146K4952Q383k7712n2724J1114L9362J0132J314
$$ 150736 148116 103001 86348 151494 176446 184829 157117 104393 115507 154869 165001 166315
14208A66315p3434o4045N4600Q2307K5382k0283K6772o1462n7537N1572L5269
$$ 166315 92881 28836 83436 165743 191125 170842 197614 136152 78615 130187 165456
14197A65456j7859n5951j3453J9795L0754j154j4134K0684l006L4650J3626m087
$$ 165456 147597 91646 78193 97988 128742 127588 113454 134138 131132 165782 179408 175321
14185A75321R89Q091P4415j6484l7440J2099l1104o5162l8542l3075L6167L2435
$$ 175321 176310 184401 258816 242332 204892 216991 185887 120725 82183 49108 85275 117710
14173A17710L0897j470M4907L8348K1205o52J11383P5272k5409J5117M9899K7745
$$ 117710 148607 147137 192044 230392 251597 250945 362328 437600 412191 427308 477207 504952
14161E04952k8932o3304k0860K557p3039q0931m6362J7336K6240J6040o0567n515
$$ 504952 476020 412716 391856 394413 321374 240443 194081 211417 237657 253697 193130 187615
14149A87615O8328N5306k071r928m3539m1247o9704j8371L4157p033O4464P316
$$ 187615 255943 311249 309178 299250 255711 214464 144760 126389 160546 153513 217977 225293
14137B25293k6775L0326J7809n857j7962L770J6677j8712j3487l0048L2282j4595
$$ 225293 198518 228844 246653 240796 222834 226604 243281 224569 211082 181034 213316 198721
14125A98721k1541l2291M0953j1234K8331Q1281K4443m6288r7777j2740J5079
$$ 198721 177180 144889 185842 174608 202939 284220 308663 262375 164598 151858 166937
14114A66937l2921J6260K4380K5177o879m4085k8100K1848K7985L8962O1192K2293
$$ 166937 134016 150276 174656 199833 192954 148869 120769 142617 170602 209564 270756 293049
14102B93049J6621K7008k2736K6788l5046p7830m72L6038k4355l3050P11P4207
$$ 293049 309670 336678 313942 340730 305684 227854 227382 263420 239065 206015 206726 280933
14090B80933K6740n5553l3468J58j3508q415J5707L2199Q838L532K1042k180J9972
$$ 280933 307673 252120 218652 218810 205302 196887 212594 244793 253631 257163 278205 276025 295997
14077B95997q973n923o867J7668K869L9056q553k8539J1029N5541m9714p2062
$$ 295997 287024 281101 274234 291902 294771 333827 325274 296735 307764 363305 313591 241529
14065B41529L1533M1281L0625m1040m3604K679L083l7988l6079J2895P0856N2026
$$ 241529 273062 314343 344968 303928 260324 263003 266086 228098 192019 204914 275770 327796
14053C27796N8464M4140l4531l5034J336n2783j4389L6894M4866R827M4591j2867
$$ 327796 386260 430400 395869 360835 362171 309388 294999 331893 376759 386586 431177 418310
14041D18310K4704O8144J01124O6822K494M9718j4811m9468n9878j19917n7037
$$ 418310 443014 511158 612282 679104 681598 731316 716505 667037 607159 487242 430205
14030D30205j3351K4765m161K1072K7366K2546n6564k3902j2767j5778Q4008J2366
$$ 430205 416854 441619 437458 458530 485896 508442 451878 427976 415209 399431 483439 495805
14018D95805p220N6188K4635n2826j4369q946J7991R1035J31011M2746m058K922
$$ 495805 488585 544773 569408 516582 502213 493267 511258 602293 733304 776050 771992 774914
14006G74914p031R3484J05889J39589Q4552J52352K26965K64169K49082K87420
$$ 774914 767883 861367 967256 1106845 1191397 1343749 1570714 1834883 2083965 2371385
13996B371385K10019J96340J66169M0055o5205k14072k67256k71994k12297j81260
$$ 2371385 2581404 2777744 2943913 2983968 2918763 2704691 2437435 2165441 1953144 1771884
13986A771884j62730q7510n1945j7954J5683l1990n7602o5631q0149l9614J712
$$ 1771884 1609154 1521644 1469699 1451745 1467428 1435438 1377836 1312205 1232056 1192442 1194154
13975A194154j4721k1099j8683J332M7442J63856R3972J4978N150K1105M8543
$$ 1194154 1179433 1158334 1139651 1140983 1188425 1352281 1446253 1461231 1466381 1487486 1536029
13964A536029R408R723R154j0800M1132O9339K2421L7479R4681Q0172O7844J08377
$$ 1536029 1545437 1555160 1564314 1553514 1594646 1663985 1686406 1723885 1818566 1898738 1966582 2074959
13952B074959J802P5774J15817J08977J76053K41089K57936K88104L52075K12706
$$ 2074959 2076761 2152535 2268352 2377329 2553382 2794471 3052407 3340511 3692586 3905292
13942C905292J91961K56207K46906K14818K48515L11445L44841M15916M99428
$$ 3905292 4097253 4353460 4600366 4815184 5063699 5375144 5719985 6135901 6635329
13933F635329O39389Q75501J159019J319623J575407J792950K089215K458214
$$ 6635329 7274718 8150219 9309238 10628861 12204268 13997218 16086433 18544647
13925A8544647K691501L029030L531926M015134M735921N994159Q184163J1660761
$$ 18544647 21236148 24265178 27797104 31812238 36548159 42542318 50726481 62387242
13917F2387242J7206336K5683505L7642292N2005031O5397639P1718524O4972146
$$ 62387242 79593578 105277083 142919375 194924406 260322045 332040569 397012715
13910C97012715M2630438Q499705k8309190n6972567p0235588o8096946n6446953
$$ 397012715 439643153 448142858 419833668 362861101 292625513 224528567 168081614
13903A68081614m2149340k9682934k0563304j4267641j0060661p259192n542549
$$ 168081614 125932274 96249340 75686036 61418395 51357734 44098542 38555993
13896C8555993m375055l678721l165657k786648k632109k483106k227752j988407
$$ 38555993 34180938 30502217 27336560 24549912 21917803 19434697 17206945 15218538
13888A5218538j659845j344508j133682r20551p87856p24491o73660n91077m78202
$$ 15218538 13558693 12214185 11080503 10159952 9372096 8647605 7973945 7382868 6904666
13879F904666m27327l96145l70246k89575k28857j11133r5281o9530j5607k3869
$$ 6904666 6477339 6081194 5710948 5421373 5192516 5081383 4986102 4916572 4900965 4877096
13869D877096J1484Q4383J23901J08462M6268k4917q3693j32127k65319k98747
$$ 4877096 4888580 4972963 5096864 5205326 5251594 5226677 5142984 5010857 4745538 4446791
13859D446791k98385k57650k79136l35515l10600k57848j49117j75304j61549
$$ 4446791 4148406 3890756 3611620 3276105 2965505 2707657 2558540 2383236 2221687
13850B221687n2407n193p2530j00792L8409m8825j14234j48301n2244k8226r3312
$$ 2221687 2169280 2164087 2091557 1990765 2029174 1980349 1866115 1717814 1665570 1637344 1544032
13839A544032j29567q9824m3283k3246l1009k4790K5498r08J1546j3902k6202
$$ 1544032 1414465 1324641 1281358 1258112 1227103 1202313 1227811 1226903 1238449 1224547 1198345
13828A198345o4020o4024m7125n9092n8215M5416K8968o441r667l5399k8077j7284
$$ 1198345 1134325 1070301 1023176 964084 905869 951285 980253 973812 964145 928746 900669 883385
13816H83385L1840P6846j4744K2685N4507j4819O68N6470J6977M4676l3047J5152
$$ 883385 915225 992071 977327 1000012 1054519 1039700 1040368 1096838 1113815 1158491 1125444 1140596
13804A140596J26381P6015P8141N6346k5127N7818J35080J15959P6692P9519J35787
$$ 1140596 1266977 1342992 1421133 1477479 1452352 1510170 1645250 1761209 1837901 1917420 2053207
13793B053207J36397J02306J41551J35972R7936J01764O96k5940n517k8019r7394
$$ 2053207 2189604 2291910 2433461 2569433 2667369 2769133 2769829 2743889 2738372 2710353 2612959
13782B612959j90002j57615j30990j51669j05289n5095n1274j38743j00321j31464
$$ 2612959 2422957 2265342 2134352 1982683 1877394 1822299 1771025 1632282 1531961 1400497
13772A400497p7624j40369p1751j10518l8415l5676p6793m1083m1809J06J4537
$$ 1400497 1322873 1182504 1110753 1000235 961820 926144 849351 808268 766459 766565 781102
13761G81102q2362k4144k4982j6382m439r3632j8470J9452K4531M58m799j5283
$$ 781102 698740 674596 649614 633232 628793 535161 516691 536143 560674 561132 556333 541050
13749E41050l8251j07961J484K4428o8156l1200j3614J9744M7673K3008j1229
$$ 541050 502799 394838 396322 420750 352594 321394 307780 327524 375197 398205 386976
13738C86976j0731O3191L3229l4596m2342o9313j4507N8485j9019l794N6198k2622
$$ 386976 376245 439436 472665 438069 395727 326414 311907 370392 351373 347579 403777 381155
13726C81155n1608j8715l8103l4487o5023l9475M8405L6733Q519J4363L3830K3393
$$ 381155 329547 310832 272729 238242 173219 133744 182149 218882 227401 241764 275594 298987
13714B98987K1118J8135J1832p358N0625N3244L5300n565l9354n5152J2388J8152
$$ 298987 320105 338240 350072 342714 393339 446583 481883 476318 436964 381812 394200 412352
13702D12352l7970M734k5099J6812L3989O2007O9695M7468o820k088K4804l2136
$$ 412352 374382 379116 354017 370829 404818 466825 536520 583988 577168 575080 599884 567748
13690E67748l8100L4866O9000L1903l7823k9592m389n6332k9520J5696n3626l3736
$$ 567748 529648 564514 633514 665417 627594 598002 593613 537281 507761 523457 469831 436095
13678D36095n0903j611J6360m581K3254M4882m2802j5316K9576p31n1646J2103
$$ 436095 385192 383581 399941 395360 418614 463496 420694 405378 434954 434223 382577 394680
13666C94680R2063M4615q17l9683m2549m286L6578P3141J2841R2936J7621M4083
$$ 394680 486743 531358 530541 490858 448309 444023 480601 553742 566583 659519 677140 721223
13654G21223J5426N2009K3547K5576o9155k6762l1665j5355q8328r6701k4527
$$ 721223 736649 788658 812205 837781 768626 741864 710199 694844 606516 509815 485288
13643D85288k2851l0156J1764k3877O323m3403m0387k2169j7203M9055L6273j9802
$$ 485288 462437 432281 444045 420168 426491 383088 342701 320532 303329 352384 388657 368855
13631C68855k3382n5302j1945N0375J11640M2109M9007k4963o0841j1760N9648
$$ 368855 345473 290171 278226 328601 440241 482350 531357 506394 445553 433793 493441
13620D93441K7749K2343n397J171m2607l8137m0015Q784r191k6914m7094k1061
$$ 493441 521190 543533 538136 539307 496700 458563 418548 427332 418141 391227 344133 323072
13608C23072l7499l2974J7608j0439N902K3874k5786L892n030L690L4413j3785
$$ 323072 285573 252599 270207 259768 265670 289544 263758 267650 262620 266310 300723 286938
13596B86938J4917n1629m8181J5451m483j6706J2553k0759Q105k824m0015J267
$$ 286938 301855 250226 202045 217496 213013 196307 208860 188101 196206 193382 153367 154634
13584A54634j6205M8374J143k8847m1912K6709o578o3581L3767j8167M8800N8436
$$ 154634 138429 186803 187946 159099 117187 143896 137318 73737 107504 89337 138137 196573
13572A96573M679l7280j0900J27K3134j8278J193k0418K308j2750K6430P9242
$$ 196573 201252 163972 153072 153199 176333 158055 159248 138830 141138 128388 154818 234060
13560B34060m3921L6732J0727K2132j0948n7973o007L1859Q851m3464l2022l5610
$$ 234060 190139 226871 237598 259730 248782 190809 184802 216661 225512 182048 150026 114416
13548A14416L098K5531m3203q182L0127K7442J4366K5848l5937j2967K367K3373
$$ 114416 117514 143045 99842 91660 121787 149229 163595 189443 153506 140539 142906 166279
13536A66279K1693k9261l1409k1715j6013O5291L028P749n720l349j5007O300
$$ 166279 187972 158711 127302 105587 89574 154865 157893 165642 159922 156573 141566 147866
13524A47866l5321L0566L7800L9244K8544L9137M1070l7625m1630p669P571k7629
$$ 147866 112545 143111 180911 220155 248699 287836 328906 291281 249651 241982 249553 221924
13512B21924j01204K8639J0854n917M4677l045j5055R3O3433K8156M8372n1055
$$ 221924 120720 149359 160213 154296 198973 195928 180873 180966 244399 272555 320927 269872
13500B69872J6327M7499p82n8194k6787n1745r243k6749k6739K8743k852J8730
$$ 269872 286199 333698 332916 274722 247935 196190 186947 160198 133459 162202 159350 178080
13488A78080j5112k7059J9461L8823R654L0721M5649J050N0210j1505n5516n35
$$ 178080 162968 135909 155370 194193 203847 234568 280217 281267 331477 319972 264456 263921
13476B63921K9674J1416m2079m710j9924O288j9274k2376L6399Kl5673j7742l5304
$$ 263921 293595 305011 262932 258222 238298 244586 225312 202936 239335 239337 203664 185922 150618
13463A50618L3652L2112N1929J5038K579p398R053K0801m7750j2487K2968N88
$$ 150618 184270 216382 268311 283349 285928 278530 287583 308384 260634 248147 271115 271703
13451B71703L0439L9985J9189o571q683J8739k3491J4806J5126j7969P3853J1331
$$ 271703 302142 342127 361316 354745 346062 364801 341310 356116 371242 353273 427126 438457
13439D38457j3029J9843L96l2227L6822L3213J0352O8643Q5282Q5112J18679K23820
$$ 438457 425428 445271 445667 413440 450262 483475 493827 562470 647752 732864 851543 1075363
13427A075363K66479K78220K99839K67209K33693N6128j09849k18091l06974l42354
$$ 1075363 1341842 1620062 1919901 2187110 2420803 2476931 2367082 2148991 1842017 1499663
13417A499663k62053k14919j68694o3718k0793o1569l5083l7854m7678m9209n0641
$$ 1499663 1237610 1022691 853997 790279 769486 707917 672834 634980 587302 538093 487452
13406D87452k9374j2655l7421L2673k9994K0735R253n5906k2279P8753M3516k8373
$$ 487452 458078 445423 408002 440675 410681 431416 440669 384763 362484 441237 484753 456380
13394D56380k0668l3831J2456j4680L6194n517O4934M6362j492o5931L853K252
$$ 456380 435712 401881 414337 399657 435851 430334 495268 541630 540138 474207 478060 480312
13382D80312Q804L7368J7887n269K8212j3351L1831O7429m090J0223L9243L3172
$$ 480312 489116 526484 544371 539102 567314 553963 585794 653223 649133 659356 698599 731771
13370G31771k7993o259L3498L3780o439k5863K1423K0388k772n499l5924J0542
$$ 731771 703778 697519 731017 764797 758358 732495 753918 774306 771534 766035 730111 740653
13358G40653M0162P6317k6615q6875J1707P9376M6007N1791k0854k7561O1843
$$ 740653 780815 857132 830517 743642 755349 834725 880732 932523 911669 884108 945951
13347I45951l4004k9791K1859N5625K5226j9744k0799M5557l698L9160M1818K8276
$$ 945951 911947 882156 904015 959640 984866 965122 944323 989880 986182 1025342 1067160 1095436
13335A095436J6647j232j3014K659J9719O7629L2618J0664K4180N9307k2141J4226
$$ 1095436 1112083 1110851 1097837 1100496 1120215 1187844 1220462 1231126 1255306 1314613 1292472 1306698
13323A306698N1821K5259j7605K4578J2332p589K6089J8213O132k5503k8364K7663
$$ 1306698 1358519 1383778 1366173 1390751 1403083 1395494 1421583 1439796 1445928 1420425 1392061 1419724
13311A419724M1364j8457j4939J6863J6241K3228M9288j3713q927J4958K6582
$$ 1419724 1461088 1442631 1427692 1444555 1460796 1484024 1533312 1519599 1510672 1525630 1552212
13300A552212M038k6082l8655L2845M195J1902P707L8317Q5243J7730K9738L2478
$$ 1552212 1556250 1530168 1491513 1524358 1528553 1540455 1548162 1586479 1671722 1689452 1719190 1751668
13288A751668K3024L3980J8228O3156k1555K5456K3086k6351N9096J55753M6866
$$ 1751668 1774692 1808672 1826900 1890056 1868501 1893957 1917043 1890692 1949788 2105541 2152407
13277B152407P55L2870K1599n800M8541Q0327M8800Q4654J27426J02500R1224
$$ 2152407 2153162 2186032 2207631 2201831 2250372 2330699 2379499 2464153 2591579 2694079 2785303
13266B785303J20363J48416R1910J58361J83576J59789J43842J14648J88101K81225
$$ 2785303 2905666 3054082 3145992 3304353 3487929 3647718 3791560 3906208 4094309 4375534
13256D375534K70854K62722K59972L71601M10035M80731M52594N55968O51656
$$ 4375534 4646388 4909110 5169082 5540683 5950718 6431449 6884043 7440011 8091667
13247H091667P75856R11076J032502J241841J525594J819396K236075K756285
$$ 8091667 8867523 9778599 10811101 12052942 13578536 15397932 17634007 20390292
13239B0390292L300045M091009M998976O028809P050461P735188P813164O837520
$$ 20390292 23690337 27781346 32780322 38809131 45859592 53594780 61407944 68245464
13231F8245464M807882K049705r94933l641178n372525o063254o010113n441711
$$ 68245464 73053346 75103051 74108118 70466940 65094415 59031161 53021048 47579337
13223D7579337m679180l873583l175052k580631j960483j477589j036304n12936
$$ 47579337 42900157 39026574 35851522 33270891 31310408 29832819 28796515 28283579
13215B8283579j15644K66870N95701R78644J431909J977896K546877L182292L907871
$$ 28283579 28167935 28434805 29030506 30009150 31441059 33418955 35965832 39148124 43055995
13206D3055995M788129N727560O614049P410577Q104168Q495700Q458332P971755
$$ 43055995 47844124 53571684 60185733 67596310 75700478 84196178 92654510 100626265
13198A00626265O982218N255502L051356N62297j886039m059053n787546o899359
$$ 100626265 107608483 112863985 115915341 116477638 114591599 110532546 104745000 97845641
13190I7845641p581640p848158p858230p534243o899406o249995n471869m653223
$$ 97845641 90264001 82415843 74557613 67023370 60123964 53873969 48402100 43748877
13182D3748877l854594l126182k520818k018934j473832r65168n80532k23036
$$ 43748877 39894283 36768101 34247283 32228349 30754517 29789349 29208817 28985781
13174B8985781J63099O38384J121290J632491K216680K907015L706575M525428
$$ 28985781 29148880 29787264 30908554 32541045 34757725 37664740 41371315 45896743
13166D5896743N438359O103887O540952O444016N295038L161716J46521l081094
$$ 45896743 51335102 57438989 63979941 70423957 75718995 78880711 79027232 75946138
13158G5946138n762093p448337p959586p691173o867314n888633m955440m112933
$$ 75946138 70184045 62735708 54776122 47084949 40217635 34329002 29373562 25260629
13150B5260629l337089k760738k281710j885789j556645j318655j115275r49089
$$ 25260629 21923540 19162802 16881092 14995303 13438658 12120003 11004728 10055639
13142A0055639p69511p16312o41800n39655m94054m32589l65427l82222l71564
$$ 10055639 9286128 8569816 7928016 7388361 6894307 6461718 6096291 5714069 5342505
13133E342505l39726l48263k52194k02036j98726k14122k05253q6511j56194j23730
$$ 5342505 5002779 4654516 4402322 4200286 4001560 3787438 3582185 3495674 3339480 3215750
13123C215750j34890j57521n9467o9213r1415L024o4248j27568j00370o2335j4825
$$ 3215750 3080860 2923339 2863872 2794659 2703244 2706268 2642020 2514452 2414082 2351747 2336922
13112B336922l1542m4162n5309q6339o4355j8372k0398l4505o7570q6024n2958
$$ 2336922 2305380 2261218 2205909 2119570 2055215 2036843 2016445 1981940 1914370 1828346 1775388
13101A775388m2591j0949J0289m6751n5425J1853k3044j7570K0195m8937j09113
$$ 1775388 1732797 1721848 1732137 1685386 1629961 1641814 1618770 1601200 1621395 1572458 1463345
13090A463345m7489N065K8925o0110J0632L2202k6107m7411o593n295J1091j7132
$$ 1463345 1415856 1420921 1449846 1389736 1400368 1432570 1406463 1359052 1352459 1347164 1358255 1341123
13078A341123p260J160m8773o3124M677K1258p497J7088L404m3790j7252O114
$$ 1341123 1333863 1335023 1286250 1223126 1227803 1249061 1241564 1258652 1262056 1218266 1201014 1207128
13066A207128Q760j1510n1970k7750L3822m7320q334o1725p1376j1053K0259k0392
$$ 1207128 1215888 1204378 1152408 1124658 1158480 1111160 1102826 1041101 969725 958672 978931 958539
13054I58539k0392L8115N7310l1594m5068m6620l7J2063M326J7973p504N7992
$$ 958539 938147 976262 1033572 1001978 956910 910290 910253 922316 926642 944615 937111 995103
13042I95103J097k1080k266M2676m4867r5124o189K1980j0967r921N389J3861
$$ 995103 996200 975120 972854 1015530 970663 875539 869350 891330 880363 870442 875831 889692
13030H89692Q689L1894n5189o5131j7827M2701p1852j2064N3310P822J7213Q380
$$ 889692 898381 930275 875086 809955 792128 834829 762977 750913 804223 812045 829258 837638
13018H37638o553J8809n934n095J2560m3030k4736K9430Q42o0932k2568M0413
$$ 837638 831085 849894 843960 838865 851425 808395 783659 813089 813931 752999 730431 770844
13006G70844M1826J9155M2155O059k941l2811l4571M4207M483j7387N5703k9300
$$ 770844 812670 831825 873980 880039 877098 844287 809716 853923 858406 841019 896722 867422
12994H67422N763L1857L4624l5748J1951N7401l2736K5223M5663N55K7413J02099
$$ 867422 873185 905042 939666 903918 915869 973270 940534 965757 1011420 1011975 1039388 1141487
12982A141487J4176K668q489J9972P1945J1541k9179j5666J2268J3977j0891J3189
$$ 1141487 1155663 1158331 1149842 1169814 1241759 1253300 1224121 1208455 1220723 1234700 1223809 1236998
12970A236998q42k0031K7209K5348k447q3281j8004j618L823K6467O947L868m301
$$ 1236998 1236156 1216125 1243334 1268682 1266235 1182954 1164950 1163332 1167155 1193622 1200569 1204437 1200136
12957A200136M793j397N0853M0836J7564M5523O0051O5205L6794J0103j8505L7672
$$ 1200136 1204929 1203532 1254385 1295221 1312785 1358308 1418359 1483564 1520358 1530461 1511956 1549628
12945A549628K2951N7091O7397J0980J1018n3297j8112M1191k3350o277j9214
$$ 1549628 1572579 1629670 1697067 1708047 1719065 1665768 1647656 1688847 1665497 1659220 1640006
12934A640006q3040q0985l7036m8441k9516n6664j9535J3919L35m3491l7642o2381
$$ 1640006 1556966 1475981 1438945 1390504 1360988 1304324 1284789 1298708 1299043 1255552 1217910 1155529
12922A155529R122o520k436K4349K0725L9590J1264K0543N6299k9876M6161j3082
$$ 1155529 1164651 1158131 1155695 1180044 1200769 1240359 1251623 1272166 1328465 1298589 1344750 1331668
12910A331668l0530N639p377l3241k4480n4057l8040N544l4624j7734K5296j4102
$$ 1331668 1301138 1306777 1299400 1266159 1241679 1187622 1149582 1155126 1120502 1102768 1128064 1113962
12898A113962p2488k5329k6998l2848k9306k5054n9456k4565j7749K0880R336
$$ 1113962 1041474 1016145 989147 956299 926993 901939 842483 817918 800169 821049 830385
12887H30385j3298o6669J7034J2402Q952J2576n8178r852j4030J0073j1196K1972
$$ 830385 817087 750418 767452 779854 788806 801382 743204 733352 719322 729395 718199 740171
12875G40171J5197M6268j8460n0959n4095l1443Q194K2122K1832m2636j1238l8740
$$ 740171 755368 801636 783176 732217 678122 646679 654873 676995 698827 656191 644953 606213
12863F06213j1008J8226k610j9291k7471K5749j7556m2582L137l6771M639M8266
$$ 606213 595205 613431 610821 591530 564059 589808 572252 529670 532807 496036 500675 548941
12851E48941k3296l6628r060k460j7099K0515m3677P272j3912L2955M3997p401
$$ 548941 525645 489017 479957 477497 460398 480913 437236 444508 430596 463551 507548 500147
12839E00147j6963l6590o646L5700P4067k8612n6290L452J1823m0081k0034l4063
$$ 500147 483184 446594 439948 475648 549715 521103 464813 468265 480088 440007 419973 385910
12827C85910o7316K6930L1955j4341M5747K2354q453P095J1301K6093l0100m7566
$$ 385910 318594 345524 377479 363138 408885 431239 422786 429881 441182 467275 437175 389609
12815C89609r978L2226o492l8552j2717K4672L3606j2675k0151K0870P273M4549
$$ 389609 379631 411857 405365 366813 354096 378768 412374 399699 379548 400418 407691 452240
12803D52240K8813k1212J9389P1909N9139M7885M4419p587j5235o871l7469M3939
$$ 452240 481053 459841 479230 551139 610278 658163 702582 694995 679760 672889 635420 679359
12791F79359R479p1660p0391k6727L4400J6780M536k8286R047J2746m6945l3779
$$ 679359 688838 617178 546787 520060 554460 571240 575776 547490 556537 569283 522338 488559
12779D88559k9112N5161O7877L877L9092J3048n861L5597M0113K0994M1552R884
$$ 488559 459447 514608 582485 586362 625454 638502 632641 668238 708351 729345 770897 780781
12767G80781N5619O5676N8126J5662L6042j5207P8055M5145M273P971Q3715R1349
$$ 780781 836400 902076 960202 975864 1011906 996699 1074754 1119899 1124172 1132143 1215858 1307207
12755A307207J72430J38299J73406K31931J85519J35769J19497J34052J09301
$$ 1307207 1479637 1617936 1791342 2023273 2208792 2344561 2464058 2598110 2707411
12746B707411N8908O1887R111l6998l1924n5653j40863j32484j50289j43856j34398
$$ 2707411 2766319 2828206 2837317 2800319 2768395 2712742 2571879 2439395 2289106 2145250 2010852
12735B010852j52857j32716p6292o4993l8495p6106r5734l3824q8819j37090j10785
$$ 2010852 1857995 1725279 1648987 1583994 1545499 1469393 1373659 1339835 1251016 1113926 1003141
12724A003141o5507o8723l8099j7872L4279l7309j18996o4898K9539j5707m2942
$$ 1003141 937634 868911 830812 812940 847219 809910 690914 626016 655555 639848 596906
12713E96906m7822m1309m5643K4320L0522l0339l283j4075L1112r195J857k5726
$$ 596906 549084 507775 462132 486452 516974 486635 483352 469277 500389 491194 493051 467325
12701D67325q89J6015O4924J07503N0998l4902j2490p650j3087l3017l8293l4409
$$ 467325 466436 482451 547375 654878 705876 670974 658484 650834 637747 604730 566437 532028
12689E32028o4847m9884n7466L3745L4870m615Q453j6908q8431j4401k2102J2444
$$ 532028 467181 417297 359831 393576 428446 423831 432284 415376 326945 312544 290442 302886
12677C02886K0548n7030K8199N3053j6946m5664M5778l332m834O29m8279k6864
$$ 302886 323434 266404 294603 347656 330710 285046 330824 327492 322658 323287 275008 248144
12665B48144P0998j1930J4375M0740K4373o4709r5227l0391K4161J9273l9289
$$ 248144 319142 307212 321587 362327 386700 321991 226764 196373 220534 239807 200518
12654B00518j6496M3323P6246K313l6397o5665m1240K3518j2706J9495K6676J0262
$$ 200518 184022 227345 303591 305904 269507 203842 162602 186120 173414 192909 219585 229847
12642B29847N7311n426j8372R263j9453o6237l9056J1105L4020M3949j7781m411
$$ 229847 287158 281732 263360 272623 253170 186933 147877 158982 193002 236951 219170 214759
12630B14759k0761m8705j6737N450M3108K4139K3663k3384m6443j5728L5402L4130
$$ 214759 193998 145293 128556 134006 177114 201253 224916 201532 155089 139361 174763 208893
12618B08893J6146l5041J052k2159Q328O520m9897P615L5325O9799K216q80j2077
$$ 208893 225039 189998 191050 168891 177219 183739 133842 141457 176782 246581 248797 247917 235840
12605B35840K0369J6615l7192l7394J8741O2069N706n3909L9297L4157l8598l9862
$$ 235840 256209 272824 235632 198238 216979 279048 284754 230845 270142 304299 265701 225839
12593B25839k8319j9572R71R937j162K1826P0618k4681k5414o580l09L6993j0839
$$ 225839 197520 177948 178919 188856 187694 209520 280138 255457 230043 223463 223154 260147 249308
12580B49308j532K8151K9974l3632j8703r426k5644n9649L776J6335K383L4113
$$ 249308 247776 275927 305901 272269 253566 244140 218496 158847 162623 178958 181341 215454
12568B15454q20j5144m8710M48J1525J823L3667O483l1074j9787k2885K3242M5735
$$ 215454 214634 199490 150780 151228 162753 164576 198243 204726 173652 153865 130980 154222 199957
12555A99957n3691k220N3939J5326k3423j8499j280n8843r970O0789m260k0617
$$ 199957 146266 144046 197985 213311 189888 171389 170109 111266 101296 162085 157825 137208
12543A37208K2014K9720O8330K2950k8414K669j9709j7993k0280l5154m4875K7307
$$ 137208 159222 188942 257272 280222 251808 254477 234768 216775 196495 161341 116466 143773
12531A43773N0973K8378m321r070k8826L6097j2067K4213k6883n3567K2163M3982
$$ 143773 194746 223124 218803 209733 180907 217004 204937 229150 202267 148700 170863 214845
12519B14845J218N1332K2480l9470j0535l6075k4305j1343L2273l4024j2183L3563
$$ 214845 216063 267395 289875 250405 239870 203795 179490 168147 200420 166396 154213 187776
12507A87776L2855j557M7129K517j8395J3174j3558K3029m5122n3319K0509j7678
$$ 187776 220631 219074 266203 268720 250325 263499 249941 272970 227848 174529 195038 177360
12495A77360Q312L837j3065p926O4670J655l0753J425j9233M7843J1388Q651L6029
$$ 177360 185672 189509 176444 168518 233188 234843 204090 205515 186282 234125 245513 254164 290193
12482B90193n7544k493M756m2616m76M9684O3807Q426j8484J6444m9816K8795
$$ 290193 232649 230156 234912 192296 191820 241504 305311 313737 295253 311697 261881 290676
12470B90676K3301L8048j9093o3844Q638O388j0935k3143n340p887K2578L0073
$$ 290676 313977 352025 332932 269088 277726 284114 273179 250036 244696 236809 259387 289460
12458B89460M9317l6536m2493K780j4699j3562L2331L030K7170K8849K1094K850
$$ 289460 338777 302241 259748 262528 247829 234267 266598 269628 296798 325647 346741 349591
12446C49591l1788m9644J4707k60P15L0265k1158n7983J1377J5526P826j7250
$$ 349591 317803 268159 282866 282606 283321 313586 292428 234445 245822 261348 269174 251924
12434B51924K7717R161n9004P914M5851N0869J460n154k530k1392j5406r975p834
$$ 251924 279641 288802 229798 237712 283563 334432 335892 330738 328208 306816 291410 281435 273601
12421B73601j3344o4052m0052L0494M4057K2871J9739N2186J8865r512L2839q537
$$ 273601 260257 196205 156153 186647 230704 253575 273314 325500 344365 334853 367692 359155
12409C59155l0649n4042j335P1272L8579j1051k6793k1816P3139l2024o032N4602
$$ 359155 328506 274464 273129 344401 382980 371929 345136 323320 396459 364435 358403 413005
12397D13005q085p4309k729N412J05L8833L9121J6570l4791L7461O6964M4414
$$ 413005 404920 330611 327882 333294 333399 372232 411353 427923 393132 430593 497557 541971
12385E41971K7899k624l6061M507O1942j8763l4110j8475L013L2180Q9k3375n2935
$$ 541971 569870 567246 531185 535692 597634 578871 544761 526286 529299 561479 561568 538193 485258
12372D85258k1010m4056K6521K0504K3939K0721K2991K3044j5137M7262O5815
$$ 485258 464248 420192 446713 467217 491156 511877 534868 557912 542775 590037 655852
12361F55852M5387r0527p0195j3517N436j2130k5285J9147K3022K5816Q4876l124
$$ 655852 701239 610712 540517 527000 532436 520306 495021 514168 537190 563006 647882 644758
12349F44758l4662M2483K6447j1476J7069q083M8397N1736R421o3493m1630j6125
$$ 644758 610096 652579 679026 667550 684619 676536 724933 776669 786090 722597 680967 664842
12337F64842K1208j7392p473j9321k4139l2687N5701L0756L8878k1916j9224m6531
$$ 664842 686050 668658 661185 641864 617725 585038 640739 671495 710373 688457 669233 622702
12325F22702l4466r859K5584J7767o5781m1502N2005K9194l4565j5443N6684j1649
$$ 622702 588236 578377 603961 621728 555947 514445 566450 595644 561079 545636 602320 590671
12313E90671k0051M8848j1472K1431J0053q542l3674p781K1258k6106j6235L9159
$$ 590671 570620 619468 607996 629427 639480 630938 597264 589483 610741 584635 568400 607559
12301F07559j5L619l8455L1999L5686M1400j3777k2063l5529M7907L9604n035
$$ 607559 607544 611163 572708 604707 640393 681793 668016 645953 610424 658331 697935 692900
12289F92900m7829o4011l87P852L9359r523p499k3478j3051L2313l303K6837K7433
$$ 692900 645071 581060 580673 588525 627884 618361 610862 587384 574333 606646 603343 630180 657613
12276F57613J875Q396K2068Q4551N9564o6415o6323n2392k5965k4567N262R527
$$ 657613 659488 667884 689952 774503 834067 767652 701329 648937 622972 598405 603667 613194
12264F13194J3554n195j2934n254L896O123J4036j0982m186l965q430o376k9697
$$ 613194 626748 621553 608619 603365 607261 613384 627420 616438 612252 608287 599857 593481 563784
12251E63784l9805N9280P177l2023K6786M2265J2818K2482K9644o7459L1337L0616
$$ 563784 523979 583259 590436 558413 585199 627464 640282 662764 692408 624949 656286 686902
12239F86902k6327p449P0550O0947m1953l0647p4224o3959l1325L870L4929m6694
$$ 686902 660575 653126 723676 784623 742670 712023 637799 573840 542515 546385 581314 534620
12227E34620l4579K0661l880Q0491o189L0345J6080M1225m8549j01536l7917j1979
$$ 534620 500041 520702 516822 597313 591124 621469 637549 678774 630225 528689 490772 478793
12215D78793k5531l8481j800M3232L3811L4916K6543j1114L609j9369n0039J1922
$$ 478793 453262 414781 412981 456213 490024 524940 551483 540369 543978 524609 474570 486492
12203D86492R964l0727l9610k1761J13010M4943l4641j04862k1517K6106K2922
$$ 486492 496456 465729 426119 404358 517368 562311 527670 422808 401291 427397 450319
12192D50319O5320k7520l8137m5237o2370Q106P724L7987N2171J3859J9772k932
$$ 450319 515639 488119 449982 404745 342375 350481 358205 396192 448363 462222 481994 479062
12180D79062k5590k402m693O604p1685q105L8627r355o430K09j9931m8395j6981
$$ 479062 453472 451070 446377 452981 381296 373191 411818 402463 396033 396242 376311 327916 310935
12167C10935L7600M7764M5588k0536j0646k2458N6894M900l1966k5435J2091l385
$$ 310935 348535 396299 441887 421351 410705 388247 445141 450041 418075 392640 404731 401346
12155D01346m2266l000J0025J5983k814J0762n2404j3294R774j0193j6792N4442
$$ 401346 359080 356080 366105 382088 379274 390036 337632 324338 334112 323919 307127 361569
12143C61569N3143l9138l5590K1258m182p861J7241K7930j1313j4195L9841J1213
$$ 361569 414712 375574 339984 361242 357060 349199 366440 394370 383057 368862 408703 419916
12131D19916k9330j8020m4779m696K6179k5409K9424k0813q046P666N669J5376
$$ 419916 390586 372566 327787 323091 349270 323861 353285 332472 324426 332092 337761 353137
12119C53137k8123j190M0309O4519q77R089K7860l7716j1505n4008j4703N3144
$$ 353137 325014 323824 364133 428652 427775 436864 464724 427008 415503 361495 346792 399936
12107C99936L5119j5328m1371q179M5899P513l3256J714K6585q7530j9530K5112
$$ 399936 435055 419727 378356 370177 416076 423589 390333 392047 418632 331102 311572 336684
12095C36684J8281J0820L2697M173l0863l730M43k3828k6278N5651O7348M8514
$$ 336684 354965 365785 398482 402655 371792 368062 368505 344677 318399 374050 441398 489912
12083D89912J2583R932p811O031K040l3076R048K046m9088p9782n407L0025M4192
$$ 489912 502495 512427 504616 510647 512687 479611 488659 490705 441617 361835 356428 386453 430645
12070D30645K1492Q226R123Q3976O3889o322m837m2851L3129L2756p974k1825
$$ 430645 452137 460363 469486 553462 617351 611029 606192 563341 596470 629226 621252 599427
12058E99427n126l2734M029r25L5902P5123Q4601J233O569l2032o6031n5186M1755
$$ 599427 594301 561567 565596 564671 600573 675696 760297 761530 768099 736067 670036 614850 656605
12045F56605K8085N1782N366o2753m3636K2950J0474k3110k1921j1621M4180k762
$$ 656605 684690 736472 741838 679085 635449 658399 668873 645763 623842 612221 656401 653639
12033F53639k4097l7200M0847K3013N2419P9171j06P08N7360K8495j5647O2402
$$ 653639 629542 592342 633189 656202 708621 787792 787686 788394 845754 874249 858602 921004
12021I21004P0023P7137O0518j4441l6330n8718j4873P625k3396n2943k81O7869
$$ 921004 991027 1068164 1128682 1114241 1077911 1019193 1004320 1011945 988549 935606 935325 1003194
12009A003194O4543k6967k0339L4721R284k1428j4587m0837K8342J7096k4947
$$ 1003194 1067737 1040770 1020431 1055152 1064436 1043008 1028421 987584 1015926 1033022 1008075
11998A008075O607L1198q808J5098K8906j8196j7035J0258Q2448P9765L8245n816
$$ 1008075 1014682 1045880 1037072 1052170 1081076 1062880 1045845 1056103 1138551 1218316 1256561 1250745
11986A250745o8212J7613L4640Q3941Q7295K6567M8429P7310M032j1704M3445
$$ 1250745 1182533 1200146 1234786 1318727 1406022 1432589 1481018 1558328 1562360 1550656 1594101
11975A594101P1491M0255N0930J18837J16864L8936Q709R573M4132O3466J15218
$$ 1594101 1665592 1705847 1756777 1875614 1992478 2031414 2040123 2049696 2093828 2157294 2272512
11964B272512J09516M6727K3441P6236N0437P7246R1768J10044R4081R4486J48522
$$ 2272512 2382028 2428755 2452196 2528432 2578869 2656115 2747883 2857927 2952008 3046494 3195016
11953C195016J70793K24873K93209K59475L09815L29780L18181L85435M35104
$$ 3195016 3365809 3590682 3883891 4143366 4453181 4782961 5101142 5486577 5921681
11944E921681N59342O54096P32067Q58194J023620J272694J429489J665074J947383
$$ 5921681 6481023 7135119 7867186 8725380 9749000 11021694 12451183 14116257 16063640
11935A6063640K208716K429422K477731K405046K190042J668304R19406N9484
$$ 16063640 18272356 20701778 23179509 25584555 27774597 29442901 30362307 30421791
11927C0421791q14499j399248j739850j885660j795564j605175j428646j261944
$$ 30421791 29607292 28208044 26468194 24582534 22786970 21181795 19753149 18491205
11919A8491205j017534q05366n56210l79450j43236L8265J60535K81324N21122
$$ 18491205 17473671 16668305 16112095 15732645 15589409 15627674 15788209 16069533 16590655
11910A6590655P05134Q78392J141136J421671J731021K003455K235852K549496
$$ 16590655 17295789 18174181 19315317 20736988 22468009 24471464 26707316 29256812
11902B9256812K778938K937903L093833L037693K804123K320250J593578P83136
$$ 29256812 32035750 34973653 38067486 41105179 43909302 46229552 47823130 48606266
11894D8606266j2600p62819j231150j484611j483200j365637j201917r32378o11180
$$ 48606266 48593666 47830847 46599697 45115086 43631886 42266249 41064332 40131954 39520774
11885C9520774k98364q4559P7212J56692J58099J06594n8951j50296k52077l62845
$$ 39520774 39222410 39137851 39215063 39371755 39529854 39636448 39577497 39427201 39175124 38812279
11875C8812279m23196m29092k93437j20717L5715K21397M51958N74045N67121
$$ 38812279 38389083 37959991 37666554 37545837 37581552 37802949 38254907 38828952 39396073
11866C9396073N62786N91794N99030N30906M17008L85888K59484J52087Q5510
$$ 39396073 39958859 40550653 41149683 41680589 42097597 42483485 42742969 42895056 42980566
11857D2980566J837m7979r6804j42340j24813j47464j28322j33362j25883j48040
$$ 42980566 42982403 42934424 42837620 42695280 42570467 42423003 42294681 42161319 42035436 41887396
11847D1887396r1039j08688k88307m34357n02063n68634n96970m27791k25631
$$ 41887396 41796357 41687669 41399362 40965005 40462942 39894308 39297338 38869547 38643916
11838C8643916P3560M15601Q03200J224982J617799J978603K199762K198457K001430
$$ 38643916 38717476 39133077 39936277 41161259 42779058 44757661 46957423 49155880 51157310
11829E1157310J544172Q02001j90594j129057j979557k586473k969596l071496
$$ 51157310 52701482 53503483 53312889 52183832 50204275 47617802 44648206 41576710
11821D1576710k973510k946757k745672k461988k234697k071525j828293j549964
$$ 41576710 38603200 35656443 32910771 30448783 28214086 26142561 24314268 22764304
11813B2764304j288379r98455o90020n48398l99751j63798Q7127K99899N42120
$$ 22764304 21475925 20477470 19787450 19239052 18839301 18675503 18762630 19062529 19604649
11804A9604649P64300J039264J290598J513050J877303K054544K097115K004336
$$ 19604649 20368949 21408213 22698811 24211861 26089164 28143708 30240823 32245159
11796C2245159J735389J131306K93225o19751j568789k304259k665819k813102
$$ 32245159 33980548 35111854 35405079 34785328 33216539 30912280 28246461 25433359
11788B5433359k705849k545707k301242j991541j699127j484104j270100j120393
$$ 25433359 22727510 20181803 17880561 15889020 14189893 12705789 11435689 10315296
11780A0315296r12321q11860o96184o32437n37097m51084m20531l84443l42199
$$ 10315296 9402975 8591115 7894931 7262494 6725397 6274313 5853782 5469339 5127140
11771E127140l05867k34949k11444j85597j82239j87536k34486j75401j22325
$$ 5127140 4821273 4586324 4374880 4189283 4007044 3819508 3585022 3409621 3287296
11762C287296j43383q5020p8796j90657j68838j28890l0248M8478m8984r3349
$$ 3287296 3143913 3058893 2980097 2789440 2620602 2491712 2461464 2509942 2460958 2367609
11752B367609m6538q4296o4528n7141j3256o5261n6018q6410k9275K0060k0767
$$ 2367609 2321071 2236775 2172247 2115106 2101850 2036589 1980571 1894161 1864886 1884946 1864179
11741A864179j02451R717J8895p3318o9668l5418p507K3620k5505o9052p5649
$$ 1864179 1761728 1771445 1790340 1717022 1647354 1611936 1604429 1628049 1602544 1533492 1457843
11730A457843j9510m6364L9910L1006N930k0334k4339j8369p2466o5866n6169
$$ 1457843 1438333 1391969 1431879 1462885 1468815 1448481 1424142 1405773 1333307 1267441 1211272
11719A211272K558L9444J7768j3843M0072J6962J8842j0273r019M8587J4649j5280
$$ 1211272 1213830 1253274 1271042 1257199 1297271 1314233 1333075 1322802 1313783 1362370 1377019 1361739
11707A361739k1200j0294j4027o6777J1274l1111o9564m971O068K307j4327o573
$$ 1361739 1340539 1330245 1316218 1249441 1260715 1229604 1160040 1155069 1161137 1163444 1149117 1142544
11695A142544R932K9742k8102j37122j3259K3675k7880l7409k3508j4488M1530
$$ 1142544 1152476 1182218 1154116 1016994 1003735 1027410 999530 962121 938613 924125 965655
11684I65655M589k0514j9376L6516N4138k9489l2404j2550p600K7882O1147N9939
$$ 965655 970244 949730 930354 966870 1021008 991519 959115 946565 938965 966847 1027994 1087933
11672A087933k2691m0831l864m7366k4086k8914Q485j4667l8254l0521p0144n8788
$$ 1087933 1065242 1024411 1020547 973181 949095 920181 928666 913999 875745 845224 775080 716292
11660G16292k7630l2193J5999P7980J8285K8167J2688l8042j07120j2866M8625
$$ 716292 688662 656469 672468 750448 768733 796900 809588 771546 664426 651560 700185
11649G00185j2211r532k0390l31J1511J6679k8200o7967K1006l3859k6327J5004
$$ 700185 687974 678442 658052 657721 669232 685911 657711 589744 610750 576891 550564 565568
11637E65568J2049n475L0396l258L6798l2978J3827P2865l4357o1494j1713O263
$$ 565568 577617 572142 602538 599280 636078 603100 616927 689792 655435 593941 582228 588491
11625E88491j6698J9956k0805n4076L0422j0675k561J7164N6172P803q203m6081
$$ 588491 571793 591749 570944 516868 547290 536615 534054 551218 607390 615193 606990 560909
11613E60909k5347Q153k8435L5854M5952k4779l5533N9283P1824L7363k1558K6717
$$ 560909 535562 543715 515280 551134 597086 572307 536774 596057 667881 705244 683686 710403
11601G10403J3315j2947P773j4180O6977O334J2556P1956L2783Q6051J42918Q6657
$$ 710403 723718 710771 718544 704364 771341 777675 790231 862187 894970 981021 1123939 1210596
11589A210596J19511J73336J65933K01311K35802K33422K44813K06738J19469
$$ 1210596 1330107 1503443 1669376 1870687 2106489 2339911 2584724 2791462 2910931
11580B910931J5092n5367k09685k81510k70747k58839j80182j00592p7606q3955
$$ 2910931 2926023 2870656 2660971 2379461 2108714 1849875 1669693 1569101 1491495 1407540
11570A407540j45307j08898m9907Q048p417k2454N9031k0359l3223K5123R1751
$$ 1407540 1262233 1153335 1103428 1111476 1104059 1081605 1140636 1120277 1087054 1112177 1203928
11559A203928J24788Q0230J15938K03298J94420K33724K46971K29387K01878J09921
$$ 1203928 1328716 1408946 1524884 1728182 1922602 2156326 2403297 2632684 2834562 2944483
11549B944483o5164j72345k15490k45966k81119j86498j61938j91400j79400r7165
$$ 2944483 2879319 2706974 2491484 2245518 1964399 1777901 1615963 1424563 1245163 1147998
11539A147998j01613p6666l0366m3471o2274l0042m6861P511m2756j16223r381
$$ 1147998 1046385 969719 939353 895882 833608 803566 756705 764216 721460 605237 595856
11528E95856J8333p189r621m235P133k4684m0547J4206k0832j6741M1221l0592
$$ 595856 614189 607000 597379 593144 600277 575593 535046 549252 528420 511679 552900 522308
11516E22308j877Q5831J1415k6135K8171k3211k3036l7980o3893k4304j0939J6760
$$ 522308 520431 606262 617677 591542 619713 596502 573466 535486 471593 447289 436350 453110
11504D53110J04968O266j2714m2081J0787M3049P175K8715J3389p4078l8486K8792
$$ 453110 558078 564344 551630 509549 520336 563385 570560 599275 612664 538586 500100 528892
11492E28892N3703O14k0884L600K6788r471k845N5214L2319j4148L3129j9504
$$ 528892 582595 583209 562325 565925 592713 583242 580397 635611 667930 653782 686911 667407
11480F67407l0582k777J1391J2496J5709K6765m5922m3428J175l0937K7733j3149
$$ 667407 636825 634048 645439 657935 673644 700409 654487 611059 612234 581297 609030 595881
11468E95881K0487L896J9292n649Q788k0604L3047k2912L6758j2882j942l3342
$$ 595881 616368 620264 639556 633907 642695 622091 655138 632226 668984 656102 654160 620818
11456F20818j5284O1787K5356J7048l1555j7216P9809j8042L236R360J0979N8550
$$ 620818 605534 667321 692677 709725 678170 660954 740763 722721 725957 735317 746296 804846
11444H04846j1925k8780j7439N209R578L6554l2974o2892n1094J0685M7182O8187
$$ 804846 792921 764141 746702 751911 761489 798043 765069 702177 651083 661768 708950 777137
11432G77137J8462j0509K0393M2562l4911J7486K2221l0928J4199N6278L4417
$$ 777137 795599 785090 805483 848045 813134 830620 852841 821913 836112 892390 926807
11421I26807j0001p2584J5803M3812J4000m1795J9600L6993J0043l6163l9541
$$ 926807 916806 844222 860025 903837 917837 876042 895642 932635 942678 906515 866974
11410H66974J2780K4371K3687J0677L7750L3784m6862m130N6898K5304K4311Q208
$$ 866974 879754 904125 927812 938489 976239 1010023 963161 959031 1015929 1041233 1065544 1073752
11398A073752K4986n511R554K5331K3009N9833O0115N4532N7784K4109M0078M1576
$$ 1073752 1098738 1093227 1102781 1128112 1151121 1210954 1271069 1325601 1383385 1407494 1447572 1489148
11386A489148J3324k596p6535l1328L7302J2750k7627n9871r3778l43L3945P0282
$$ 1489148 1502472 1499876 1423341 1392013 1429315 1442065 1414438 1354567 1260789 1260446 1294391 1364673
11374A364673j7233l978K4644L0822o5956K4218O4700M9080l3260l8889N0837
$$ 1364673 1347440 1343462 1368106 1398928 1332972 1357190 1421890 1470970 1437710 1398821 1449658
11363A449658L6655O4175K8334j1008O9604O6905N3867r754J6395L8565J7826
$$ 1449658 1486313 1550488 1578822 1567814 1637418 1704323 1758190 1748436 1764831 1803396 1821222
11352A821222k0433q8417o8581q720L3253k2532K8098j6565o476o265M3832L345
$$ 1821222 1800789 1712372 1643791 1635071 1668324 1645792 1673890 1657325 1650849 1644584 1688416 1691761
11340A691761j49J832J5568M1864L1325P7394K9793l1010K7704R1880P8943J07005
$$ 1691761 1691612 1693444 1709012 1750876 1782201 1859595 1889388 1858378 1886082 1977962 2056905 2163910
11328B163910R635o2849N601J9336O1117L2914J4863N1479j3590O732m4230l7251
$$ 2163910 2173545 2110696 2116297 2135633 2196750 2229664 2244527 2296006 2282416 2289148 2244918 2207667
11316B207667K9455J0059J3262L6015q111J6059L2039m7656m112P8563M9865o9537
$$ 2207667 2237122 2247181 2260443 2296458 2288347 2304406 2336445 2288789 2284677 2363240 2413105 2343568
11304B343568n3374Q7348L5735R1657K0171m280l7269k3106j8840O5177Q4461
$$ 2343568 2290194 2377542 2413277 2504934 2525105 2520825 2483556 2460450 2441610 2506787 2591248
11293B591248M8657k90J7061M7596L7417K5611k5459j7331N291O854J6156P1720
$$ 2591248 2639905 2639615 2656676 2704272 2741689 2767300 2741841 2724510 2729801 2736655 2752811 2824531
11281B824531K6885Q3040O9719R9141J29512K8201J00524J22279J62858P6790
$$ 2824531 2851416 2934456 3004175 3103316 3232828 3261029 3361553 3483832 3646690 3723480
11271C723480J08577J45743J66582J72021R5633J33693R5252O4841R5896n550
$$ 3723480 3832057 3977800 4144382 4316403 4412036 4545729 4640981 4705822 4801718 4796168
11261D796168j77403j52277r5100j19606j61201j55465o7674o9650j01142m8240
$$ 4796168 4618765 4466488 4371388 4251782 4090581 3935116 3867442 3797792 3696650 3648410
11251C648410n167N7396j6933K4669J4802j8796L7830Q1181Q1068Q4600O2956
$$ 3648410 3643243 3700639 3683706 3708375 3723177 3704381 3742211 3823392 3904460 3989060 4052016
11240D052016N6972J23326J10125J20498J60202Q7505O6802M0299J6357l9333
$$ 4052016 4108988 4232314 4342439 4462937 4623139 4710644 4777446 4817745 4834102 4794769
11230D794769j22118j21892j70074j78831j94366j36361p8817r1846o5462q8393
$$ 4794769 4672651 4550759 4380685 4201854 4007488 3871127 3792310 3700464 3635002 3546609
11220C546609o0161j8680R307k5270n8867L5456J0820M8701q882J3853o592l990
$$ 3546609 3486448 3467768 3477075 3451805 3392938 3428394 3439214 3487915 3479033 3492886 3486294 3482304
11208C482304N3872M4009Q0699J13872o161J7571J5674Q2589L2312P1836O6783
$$ 3482304 3536176 3580185 3660884 3774756 3768595 3786166 3801840 3884429 3916741 3988577 4055360
11197D055360J47905J75508P9004R2318J19236J35162J34230J28377P9357J54807
$$ 4055360 4203265 4378773 4457777 4550095 4669331 4804493 4938723 5067100 5146457 5301264
11187E301264J95733J42641J56547J59205J79026J58054K17668K31517J73318
$$ 5301264 5496997 5639638 5796185 5955390 6134416 6292470 6510138 6741655 6914973
11178F914973K68986L58863L56089K81135K68807L93120M11436M20293N43490
$$ 6914973 7183959 7542822 7898911 8180046 8448853 8841973 9253409 9673702 10217192
11169A0217192N91397O07338O25674O06080O10907P15464Q19433R23101R80065
$$ 10217192 10808589 11415927 12041601 12647681 13258588 13974052 14793485 15716586 16696651
11160A6696651J049615J207031J469162J637473J856941K189738K603933K913979
$$ 16696651 17746266 18953297 20422459 22059932 23916873 26106611 28710544 31624523
11152C1624523L475712M056330M838904N690752O690379P707841R028409J0804248
$$ 31624523 35100235 39156565 43995469 49686221 56376600 64084441 73112850 83917098
11144H3917098J3020931J6142701K0529250K6591315L4335427M3896580N4662572
$$ 83917098 96938029 113080730 133609980 160201295 194536722 238433302 293095874
11137B93095874O4435134O8247630N9676482L5025769r05562l4763881n5161215
$$ 293095874 357531008 425778638 485455120 520480889 519575327 484811446 429650231
11130D29650231o0483544n5887212m7212263l8005224k9909123k3205577j7718052
$$ 429650231 369166687 313279475 266067212 228061988 198152865 174947288 157229236
11123A57229236j3352626r915970p204065n023656k988372j008501Q18357K688350
$$ 157229236 143876610 133960640 126756575 121732919 118744547 117736046 118554403 121242753
11115A21242753M635046O808184R436844J2683627J6987685K2599315K9682522
$$ 121242753 125877799 132685983 142122827 154806454 171794139 194393454 224075976
11108B24075976L8343689M8170542N7399766O1998783N6021972L4732326N21712
$$ 224075976 262419665 310590207 367989973 429988756 486010728 520743054 521264766
11101E21264766l4981145n8716817o6308116o2192494n2871886m2799206l3879469
$$ 521264766 486283621 427566804 361258688 299066194 246194308 203395102 169515633
11094A69515633k6653420k1014519j6614864j3368532j0995368r236596p788820
$$ 169515633 142862213 121847694 105232830 91864298 80868930 71632334 63843514
11087F3843514o681797n798082n040649m327402l720399l306083k847230k458921
$$ 63843514 57161717 51363635 46322986 41995584 38275185 34969102 32121872 29662951
11079B9662951k228971j997486j762700j569315j424734j289544j142588j019381
$$ 29662951 27433980 25436494 23673794 22104479 20679745 19390201 18247613 17228232
11071A7228232r20363q01746p99227p40458o56104n94466n88305n27341n20497
$$ 17228232 16307869 15506123 14706896 13966438 13310334 12715868 12127563 11600222 11079725
11062A1079725m63012m18681l92509l83384l30653l51434l24939k97439l04897
$$ 11079725 10616713 10198032 9805523 9422139 9091486 8740052 8415113 8117674 7812777
11053G812777k51913l19698k95386k20498k16957k25458k14402j54224q9867j04196
$$ 7812777 7560864 7241166 6945780 6725282 6508325 6282867 6068465 5914241 5824374 5720178
11043E720178j44535j34547p1873j17924j65272j46202r3321q2526j38756j76219
$$ 5720178 5575643 5441096 5369223 5251299 5086027 4939825 4846504 4763978 4625222 4449003
11033D449003j53535r6853o4207k9959n3876q8776j03883r8258q0636r1876n8205
$$ 4449003 4295468 4198615 4134408 4104449 4050573 3961797 3857914 3759656 3679020 3587144 3528939
11022C528939m3767q4510p3715k3993o6344j04288L5617N4268L6192j3412R16
$$ 3528939 3485172 3400662 3326947 3302954 3236610 3132322 3167939 3222207 3258399 3244987 3245903
11011C245903o752p5326o5264p9195j19640o0541m9553O971j5891J9627N497j6819
$$ 3245903 3239151 3163825 3098561 3019366 2899726 2839185 2789632 2796603 2780712 2800339 2805836 2789017
10999B789017m4613j8795j7612n0653n3907p8662l7498j1676j4697o2465j6094
$$ 2789017 2744404 2725609 2707997 2657344 2603437 2524775 2487277 2475601 2460904 2398439 2382345
10988B382345M4324N9288n9728N355j3767N162k2604L0458J5832K0346R187j4235
$$ 2382345 2426669 2485957 2426229 2431584 2417817 2422979 2400375 2430833 2446665 2467011 2476198 2461963
10976B461963k1144r1121l37J5509n9824o8630j5059K0468J389l7940m4193o2487
$$ 2461963 2440819 2349698 2349361 2364870 2305046 2236416 2221357 2241825 2243214 2205274 2161081 2098594
10964B098594k2641N283n4976n1991l1767j4365j1945J8443L8907j500L996n6561
$$ 2098594 2075953 2081236 2026260 1974269 1942502 1928137 1916192 1934635 1973542 1972042 1976038 1919477
10952A919477k1511M0002L6290J6147p9314o9907k0867o731P201L0473J2669j8189
$$ 1919477 1897966 1937968 1974258 1990405 1911091 1841184 1820317 1813586 1820787 1851260 1863929 1845740
10940A845740k7973R77O7321m2735n9831M293L9387l904j4958p678q377Q200k0608
$$ 1845740 1817767 1818744 1886065 1843330 1783499 1787792 1827179 1823275 1808317 1800639 1792262 1800462 1779854
10927A779854m5739o8335L4894J8049K5737J7719O828L6548J6891L3459k8074
$$ 1779854 1734115 1665780 1700674 1718723 1744460 1762179 1769007 1805555 1822446 1855905 1827831
10916A827831n054J3204j011L0138Q821P6363R0078L0058L516L9577P7590R6295
$$ 1827831 1822777 1835981 1834970 1865108 1873929 1950292 2040370 2070428 2073944 2113521 2191111 2287406
10904B287406L7567Q7523P7547J16645J10622P1533P0454J26208J09482J08646
$$ 2287406 2324973 2412496 2490043 2606688 2717310 2788843 2859297 2985505 3094987 3203633
10894C203633J49225J39676J48969J13812Q7848J15261M358k4769l7348o0744
$$ 3203633 3352858 3492534 3641503 3755315 3843163 3958424 3962782 3938013 3900665 3839921
10884C839921k7689r3512q5450q0797q0453o2684r8005q6029k0763m7617o7713
$$ 3839921 3812232 3718720 3633270 3552473 3472020 3409336 3311331 3225302 3204539 3156922 3089209
10873C089209M6632N0163l061k0134r418M8245M2715P2486R3329J7024j7364K6367
$$ 3089209 3135841 3186004 3182943 3162809 3153391 3201636 3244351 3316837 3410166 3427190 3409826 3436193
10861C436193L9906M7406M9156Q7835J2542j52307j81210q6636j25276r0340p8746
$$ 3436193 3476099 3523505 3572661 3660496 3673038 3520731 3339521 3252885 3127609 3037269 2958523
10850B958523j14802j45426j63105j54338q3405k7309p7796j22797p8359p6855
$$ 2958523 2843721 2698295 2535190 2380852 2297447 2270138 2192342 2069545 1991186 1914331
10840A914331o6093p0135p5559q4192j02755j60977n8322K0183j9477l7546j9570
$$ 1914331 1848238 1778103 1702544 1618352 1515597 1354620 1296298 1316481 1297004 1259458 1239888
10829A239888P086P075K2197k8612m3206m9041p6269j2313L6527j72m2269l1481
$$ 1239888 1246974 1254049 1276246 1247634 1204428 1155387 1079118 1066805 1103332 1103160 1060891 1029410
10817A029410j1615p59k2648o368k9022k3738k4101k6873N7637J2355o6581k2538
$$ 1029410 1017795 1017036 994388 988020 958998 935260 911159 884286 941923 954278 887697 865159
10805H65159k6232K4489p104L8670Q640k5981q3575m1980k2606O6515J1818m516
$$ 865159 838927 863416 856312 894982 903622 877641 794066 752086 729480 795995 807813 803297
10793H03297j1486m457J1894n771o3278L0921P6279k6583p176K2151k6512l5356
$$ 803297 791811 787354 799248 793477 730199 761120 837399 810816 803640 825791 799279 763923
10781G63923l635O03k3098r321J3079l795j1459O434M000j0563k3234L7918M3330
$$ 763923 760288 760891 737793 728472 741551 737756 726297 732731 736731 726168 702934 740852 784182
10768G84182j9858j8877K6082L082k065J3809k8527j4025K2926M5567P8016k2999
$$ 784182 764324 745447 771529 774611 772546 786355 757828 743803 766729 812296 890312 867313
10756H67313p0300J9127P6392N6534J55777J19257N8963k912k7156J9086l7875
$$ 867313 797013 816140 892532 949066 1104843 1224100 1283063 1280151 1252995 1272081 1234206
10745A234206r1299j09432j3820j7789k5293m4544q7461k6670J2339L8556M9510
$$ 1234206 1142907 1033475 1019655 1001866 976573 932029 844568 817898 830237 868793 918303
10734I18303m0662l0855K5268L5116l1657m4670K6753L0889J8997N0881M4242
$$ 918303 877641 846786 872054 907170 875513 830843 857596 888485 907482 958363 1002605
10723A002605K4265R3415R2508Q6179M0260N4222K837n5800p5152n6610o5335
$$ 1002605 1026870 1120285 1212793 1298972 1339232 1393454 1396291 1340491 1265339 1208729 1143394
10712A143394k2955n1746p600l4329l912K4262J4716K7638K9892L6652L3734N6818
$$ 1143394 1120439 1068693 1061093 1026764 1022852 1047114 1061830 1089468 1119360 1156012 1189746 1246564
10700A246564N2335K0404j4318L5813J3270j4519j6805r580J3679P1427N5701
$$ 1246564 1298899 1319303 1304985 1340798 1354068 1339549 1322744 1313164 1326843 1398270 1453971
10689A453971J01072J78959J30081J43371K10348J41774K57656L02199K66193
$$ 1453971 1555043 1734002 1864083 2007454 2217802 2359576 2617232 2919431 3185624
10680C185624K14344Q5322J1201j30518j91072j99564k23044k60901j22278m1864
$$ 3185624 3399968 3485290 3496491 3365973 3174901 2975337 2752293 2491392 2369114 2327250
10670B327250o5416n8013q2040o9496l7029K2040Q470K6179J0458j5596j9483
$$ 2327250 2261834 2203821 2121781 2052285 2015256 2037296 2045766 2071945 2082403 2066807 2047324
10659B047324o683J4428J31396J46222J31697J59384J93142K63079K99018K22120
$$ 2047324 2040641 2055069 2186465 2332687 2464384 2623768 2816910 3079989 3379007 3601127
10649C601127K17369J38370o1154k20322k65852k49639k39738j75060j71333j60607
$$ 3601127 3818496 3956866 3895712 3675390 3409538 3159899 2920161 2745101 2573768 2413161
10639B413161j26222j17637p0411o6585k0519O0080M4469k5618l2654O910K9098
$$ 2413161 2286939 2169302 2098891 2032306 2011787 2071867 2116336 2090718 2058064 2064974 2094072
10628B094072O2061N2319l9471M2961M7498j6688K6951N0653K9045J5909N3120
$$ 2094072 2156133 2208452 2168981 2211942 2259440 2242752 2269703 2320356 2349401 2365310 2418430
10617B418430O6319Q2464O3867O5906J26572J10126J38567P7215M5199J03970
$$ 2418430 2484749 2567213 2631080 2696986 2823558 2933684 3072251 3149466 3194665 3298635
10607C298635J31296Q9787J49487J66191J67896J55078K03440K89539K59166K42597
$$ 3298635 3429931 3519718 3669205 3835396 4003292 4158370 4361810 4651349 4910515 5153112
10597E153112K89242L28566L93700L94932M40766N54742O34374O67252O77442
$$ 5153112 5442354 5770920 6164620 6559552 7000318 7555060 8189434 8856686 9534128
10588I534128P79565R64997J125871J228733J409781J541270J639575J716122
$$ 9534128 10313693 11278690 12404561 13633294 15043075 16584345 18223920 19940042
10580A9940042J645057J515616J292076R16777N25803J35760j44753l01719m56360
$$ 19940042 21585099 23100715 24392791 25309568 25835371 25971131 25826378 25524659 25068299
10571B5068299n37583o26619n35122m57139m94347l92393l39015l15225k55893
$$ 25068299 24530716 23904097 23368975 22911836 22417489 22025096 21686081 21370856 21114963
10562B1114963j89312j13310L4388J33472K78369L72196N03195P94000J051301
$$ 21114963 20925651 20812341 20846729 20980201 21258570 21630766 22133961 22927961 23979262
10553B3979262J194714J388171J600682J868262K062132K129553K185279K111365
$$ 23979262 25173976 26562147 28162829 30031091 32093223 34222776 36408055 38519420
10545C8519420J817616J410410Q82967K56009l13455q90589j307316j535598j638042
$$ 38519420 40337036 41747446 42630413 42886422 42572967 41682378 40375062 38839464 37201422
10536C7201422j547671j346524j116839q15913n13036k59519j1858J86278K93290
$$ 37201422 35653751 34307227 33190388 32374475 31861439 31601920 31590062 31776340 32069630
10527C2069630K92973J44160k4486r606P8751N1851J15718K32383M08551O63626
$$ 32069630 32362603 32506763 32482277 32472671 32551422 32603273 32718991 32951374 33359925 34023551
10517C4023551R86608J286442J545777J726091J960844K073724J889804J524374
$$ 34023551 35010159 36296601 37842378 39568469 41529313 43603037 45492841 47017215
10509D7017215J056985N13673m4202n52882q53439j104230j296398j283079j302954
$$ 47017215 48074200 48587873 48543671 47990789 47137350 46033120 44736722 43453643 42150689
10500D2150689j225637j126905r92893q16943p21308n76396m24695l48588j71920
$$ 42150689 40925052 39798147 38805254 37988311 37267003 36690607 36265912 35917324 35745404
10491C5745404N5126K30223M01392N42368P32273R29799R85016J141856J230853
$$ 35745404 35800530 36030753 36432145 36974513 37706786 38636585 39621601 40763457 41994310
10482D1994310J282770J294085J213237J064415R58395N65212R3492n33930j227847
$$ 41994310 43277080 44571165 45784402 46848817 47807212 48372424 48465916 47931986 46704139
10473D6704139j745495k101318k172694k172193k039000j832968j587487j299252
$$ 46704139 44958644 42857326 40684632 38512439 36473439 34640471 33052984 31753732
10465C1753732r46929p24529m61603k54935j12900Q096J20025Q9517M3554K999
$$ 31753732 30806803 30082274 29620671 29365736 29252836 29260932 29380957 29470474 29514028 29517027
10455B9517027m1354o476J7896Q2826K04634L79926N92645P39976Q87879R60696
$$ 29517027 29475673 29469197 29487093 29569919 29774553 30154479 30747124 31487100 32374979 33335675
10445C3335675R16737Q21622O14001L55954o871l17011o64290j087758j391730
$$ 33335675 34252412 35074034 35688035 36043989 36037118 35720107 35055817 33968059 32576329
10436C2576329j673704j973982k058121k093714k028730j883017j732814j488174
$$ 32576329 30902625 28928643 26870522 24776808 22748078 20865061 19132247 17644073
10428A7644073j299390j127252r35084q58293n98177m22720l38303k80205j71085
$$ 17644073 16344683 15217431 14282347 13424054 12825877 12403157 12064854 11784649 11613564
10419A1613564j36023j2080J29484K59120K94189M46924N80094O13170O83641
$$ 11613564 11477541 11465461 11594945 11854065 12148254 12595178 13175272 13788442 14472083
10410A4472083P41413O19984M92875K57948j0134k98539n22997q18885j044846
$$ 14472083 15213496 15833480 16326355 16584303 16574169 16275630 15752633 14933748 13888902
10401A3888902j147349j157905j018442r43284q60506p91127o86606n56309m50287
$$ 13888902 12741553 11583648 10565206 9621922 8761416 7970289 7283683 6727374 6277087
10392F277087m25469l92088k78290l35581k71435k15202k31244j92915j43767
$$ 6277087 5851618 5459530 5181240 4845659 4574224 4359022 4127778 3934863 3791096
10383C791096j91716k08725j39722j268m9632q2739q2670j05650o0718m6010m2364
$$ 3791096 3599380 3390655 3250933 3249665 3200033 3117294 3034624 2928974 2868256 2822246 2779882
10372B779882n3285q8389p0574m7569M539k0056k8380k4240l4442l7203m2771
$$ 2779882 2726597 2638208 2567634 2520065 2524604 2504548 2476168 2451928 2417486 2380283 2337512
10361B337512L9884P133q9238l5354m9868o1358k234n0014k3325q4628o1594k5310
$$ 2337512 2377396 2384529 2295291 2259937 2210069 2148711 2146477 2096463 2073138 1988510 1926916 1901606
10349A901606o8P115L0228j3470J9984j8568j03655j25619L3397j2585R280j6783
$$ 1901606 1901538 1908653 1938881 1925411 1945395 1926827 1823172 1697553 1730950 1718365 1727645 1710862
10337A710862o5535q0033k154q396k9046m4279L6455k6921j4729m9883k7048K2355
$$ 1710862 1645327 1565294 1563140 1554744 1525698 1481419 1517874 1490953 1476224 1426341 1399293 1421648
10325A421648M647K6982L7243j9689k2147l864J6590j2700l2145o442p2682q1989
$$ 1421648 1426295 1453277 1490520 1470831 1448684 1444820 1461410 1448710 1416565 1410123 1337441 1255452
10313A255452Q348m258J9076L8160K792j0489N0843J22087J33077R8010L5138
$$ 1255452 1263800 1259542 1278618 1316778 1319570 1309081 1359924 1482011 1615088 1713098 1748236
10302A748236j721k649k0885n0208o8496o6654j57720j26459m4743j06229m9570
$$ 1748236 1746515 1743866 1722981 1672773 1604277 1537623 1379903 1253444 1208701 1102472 1052902
10291A052902L3939l4436o5197J5796L0444K5897l6258Q749m166L1794K5713k7955
$$ 1052902 1086841 1052405 987208 1003004 1033448 1059345 1023087 1031836 1027670 1059464 1085177 1057222
10279A057222M8835K0510q1933r2869p5582o3877M105o95l5388j8814j941p2410
$$ 1057222 1106057 1126567 1044634 951765 876183 812306 816411 815716 780328 761514 759573 687163
10267F87163K8719k1654m0347m2494l0626n2596l2824J9405O3018N9789m3017
$$ 687163 715882 694228 653881 611387 580761 528165 495341 514746 577764 637553 594536
10256E94536l5791K2118M8318K740l9521q9571k3633L3070l703J115J1397M2383
$$ 594536 558745 580863 629181 631921 592400 502829 479196 512266 508563 509678 521075 563458
10244E63458O747N689n11k4924L9092M2720K1382k5729o0270m4193J2372P0671
$$ 563458 570205 575894 575383 550459 589551 632271 653653 627924 567654 523461 535833 606504
10232F06504J2627n1692j3259K6371L9682L8745J2469K3267k9941k6994k7241
$$ 606504 619131 567439 554180 580551 620233 658978 671447 694714 664773 637779 610538
10221F10538q559k1405K4206N6426O2143K4552M5016K0326R3720K05834P1634
$$ 610538 601979 580574 604780 661206 723349 747901 792917 813243 906963 1112797 1184431
10210A184431K2451M3935p002M88P088o3472m4741n9784r3807m9522r0791j18501
$$ 1184431 1206882 1250817 1243815 1244303 1251391 1187919 1143178 1083394 989587 940065 849274 730773
10198G30773k5518J6025J7076l1534j7962J0435J7713k5155J3580J2325k4164
$$ 730773 705255 721280 738356 706822 688860 699295 717008 691853 705433 717758 693594
10187F93594n301N8814M6496j8783j8890n59p9349M711N2251K6025j6282j5728
$$ 693594 688293 747107 793603 774820 755930 755371 676022 680733 732984 759009 742727 726999
10175G26999J9363j5245O0322O6631m4275r157m638j1929l8580j9266O7432M5188
$$ 726999 746362 731117 791439 858070 813795 804638 800000 788071 749491 730225 797657 842845
10163H42845R025m3472M8009M0049m4289j1793j5285M8808N6659j5731n8893n8804
$$ 842845 851870 808398 856407 896456 852167 840374 825089 873897 930556 914825 855932 797128
10151G97128m4312l9280J4553K1118j0314L7227L9333P0354O7314R780n3170m7906
$$ 797128 752816 713536 728089 749207 738893 776120 815453 885807 953121 962901 909731 861825
10139H61825k8447J8556K7383M1310k4645j8868K8514K3530K1210n478j6657j2286
$$ 861825 833378 851934 879317 920627 895982 877114 905628 929158 950368 944890 928233 915947
10127I15947k1151l3821J6331K5153j4056m8968r098N6405L8164l4301j5038K7579
$$ 915947 894796 860975 877306 902459 888403 839435 830337 886742 924906 890605 875567 903146
10115I03146J9653l5089K1295l949K3295K436j3396k8674K1840m9842L069K0894
$$ 903146 922799 887710 909005 905056 928351 930787 917391 888717 910557 860715 863784 884678
10103H84678j7178j6179m4244j6616K0775M1013M4756m8975j0621j2775j9458
$$ 884678 867500 851321 807077 790461 811236 852249 897005 848030 837409 824634 805176
10092H05176K715k5508J0684l4504j1167K150l2065n3114J5237M6778K0809M0442
$$ 805176 807891 782383 793067 758563 747396 749546 717481 664367 679604 726382 747191 787633
10080G87633L6740J6470l0935l2857j1834k0318l265J3624J3858p8j3383k1580
$$ 787633 824373 840843 809908 777051 765217 744899 741634 755258 769116 769038 755655 734075
10068G34075J033o773l3588J7118q1184o4554k660Q695K0983k810L3462Q710j0353
$$ 734075 735108 728335 694747 711865 630681 566127 563467 572162 593145 590335 623797 632507 622154
10055F22154m5942m5992l7122j5574K8353M311m1844P2814L6781k1013m2880O1445
$$ 622154 576212 530220 493098 477524 505877 510188 468344 541158 577939 556926 514046 575491
10043E75491K3548K8786P767l4340j1833m6344j12673q817P1603L3940L616l4481
$$ 575491 599039 627825 635592 601252 589419 543075 430402 421585 493188 527128 530744 496263
10031D96263k5718m520j8565K493J5189k1933l5354M3956N2747j7478o2568j0080
$$ 496263 470545 466025 447460 449953 465142 443209 407855 451811 504558 487080 424512 414432
10019D14432n3289k9131l9939l1222m742J9579M4425L3247M5902m8090q1139n0176
$$ 414432 361143 332012 292073 260851 256109 275688 320113 353360 399262 351172 270033 219857
10007B19857l5521J2834m560k0493L2042K3709k3483j1024L7226J3812J9141J6573
$$ 219857 184336 197170 192610 172117 204159 227868 204385 193361 230587 244399 263540 280113
9995B80113N413J1105K2924l033j3800j1707J7603j4626l1745j9653J8357Q154
$$ 280113 285526 296631 319555 316522 302722 291015 308618 293992 262247 242594 260951 269105
9983B69105l7748k8570O915O6302M5040L1027m3212j07976k2956N723m1738M9138
$$ 269105 231357 202787 209702 276004 321044 352071 308859 200883 177927 183650 141912 191050
9971A91050N313j0956m821L7049l1964m6026j0509L569q825n3939n39N0874M2275
$$ 191050 196363 185407 180586 217635 185671 139645 129136 132705 123880 69941 69402 120276 162551
9958A62551P0306j4350m5230l5297O0498J138n509j9396Q1160J6795n2265j5676
$$ 162551 232857 218507 173277 137980 198478 199616 194107 174711 255871 272666 220401 204725
9946B04725J0534j2790q1237K7862P8236m885o7483l1396J3168J7397M9871j7368
$$ 204725 215259 202469 121232 149094 227330 222445 154962 123566 136734 154131 204002 186634
9934A86634l5491K2747L1496j9956L6285Q871j00M0321Q830k6136l5492l9083
$$ 186634 151143 173890 205386 185430 221715 230586 230486 270807 279637 253501 218009 178926
9922A78926K0446j7937K3016l8299l0081l1187k3711j9346K8487J7420l6076J4344
$$ 178926 199372 181435 204451 166152 136071 104884 81173 61827 90314 107734 71658 86002
9910H6002J328Q983L2736k4266p4757K0322J0359M7989O6706J1166l6695R209
$$ 86002 87330 96313 129049 104783 30026 50348 60707 108696 175402 186568 149873 159082
9898A59082J2634k5301l180j2550N3309J4164p980N4135K7030L1197K8795p478
$$ 159082 171716 146415 143235 130685 183994 198158 190178 244313 271343 302540 331335 323857
9886C23857m3031m4605l0938K1349Q98j1832K2418J9356j8299k7936n6232J7716
$$ 323857 280826 236221 205283 226632 227530 215698 238116 257472 239173 211237 155005 172721
9874A72721M092K410m5870J5398M4751o5886n3346J5339K0582M6955l0343m7224
$$ 172721 176813 179223 133353 148751 193502 127616 74270 89609 110191 157146 126803 79579
9862G9579n4895o170J8865j6917q936K9228K2282N1485L308k9430L1013j2145
$$ 79579 24684 18514 37379 20462 11526 40754 63036 114521 117829 88399 119412 107267
9850A07267m5525L5723M6556L3794m467n14K7641n0201J0484K4132l2717J8417
$$ 107267 61742 97465 144021 177815 173348 172834 200475 150274 160758 184890 152173 170590
9838A70590L4052j7747n0750n6524j4964J4284J2116l1395K9944J4397M504p504
$$ 170590 204642 186895 136145 79621 64657 78941 91057 59662 89606 104003 108507 101003
9826A01003K7890P1991n283j0048K0940p782o173k3880m2094j6489M404J36581
$$ 101003 128893 200884 195601 185553 206493 198711 192538 168658 126564 110075 114479 251060
9814B51060J5414m7250p408m280p0591l9536p872J1142O5311r601m5641K7861
$$ 251060 266474 219224 211816 207536 136945 97409 89537 100679 165990 156389 110748 138609
9802A38609L8459l5018j3226m2692j9760N8232K8453Q0716j213l949O0091J16571
$$ 138609 177068 142050 128824 86132 66372 124604 153057 233773 232560 228611 288702 405273
9790D05273J13805J3644j15020j19281j00121l8867k9875N4331L1717k2783k6271
$$ 405273 519078 532722 417702 298421 198300 159433 129558 183889 215606 192823 166552
9779A66552k1218M8258O2851n43k4312q099K9310r698l1751j5011J2442P549k1364
$$ 166552 145334 193592 256443 255900 231588 223489 252799 243101 211350 196339 208781 216330 194966
9766A94966l5296l8824j0112K865P016n283L2588K5037j9589p599M7543P688K182
$$ 194966 159670 120846 110734 113599 120615 115332 147920 172957 153368 145769 193312 201000 203182
9753B03182l5306M226O679l5997q1491l1409K897o382N5485N7780K0574l9710
$$ 203182 167876 172102 178781 142784 61293 29884 32781 26399 81884 139664 160238 120528
9741A20528J7248K7546k4111m4235n4208k6340K0032M3007K0143K6154N855K1378
$$ 120528 137776 165322 141211 96976 42768 16428 36460 79467 99610 125764 131619 152997
9729A52997l4030m1012n2491j5377L8564j0798j0771K5558M6803o267J0047J7385
$$ 152997 118967 77955 25464 10087 48651 37853 27082 52640 99443 93176 103223 120608
9717A20608j8006m4642O2645Q1403m7286o8072m7956K3076K5574M5473O130n4646
$$ 120608 102602 57960 120605 202008 154722 86650 38694 61770 87344 132817 138947 84301
9705H4301k0382Q428Q0555N0685O817k7768n7524j9345k4080k4094o164k238M3959
$$ 84301 63919 72347 152902 203587 210404 182636 125112 105767 81687 57593 51429 49191 93150
9692I3150j3672l892j096k8451L7594J7950N1254l3346q6744m7755l159n444N9131
$$ 93150 79478 75586 74490 46039 83633 101583 152837 119491 32747 -15008 -18167 -23611 35520
9679C5520Q8078J6395J3183m4661o475J2243j8411l3380n003j2934q6Q567J1226
$$ 35520 123598 139993 153176 108515 102040 114283 95872 62492 57489 44555 44469 53036 64262
9666F4262L8069L0553k0600m1313q4993q362N7357l4804j8258L9568L7505L195
$$ 64262 102331 132884 112284 70971 -14022 -22384 34973 169 -18089 21479 58984 62179
9654F2179j8134M638P511j4105J6588J1054J443j9140K7805K4858l6523k8906
$$ 62179 44045 48683 56194 42089 58677 69731 71174 52034 79839 104697 68174 39268
9642C9268p77J6065j9472M8703R611P795m6044m1520j4807N1542O3397N911J1305
$$ 39268 38491 54556 35084 83787 93398 101193 55149 13629 -1178 50364 113761 119672 130977
9629A30977L5191l7309o3467k1485k5147J5524P710M5383m462L3603K8912m5791
$$ 130977 166168 128859 65392 43907 18760 34284 41994 87377 82915 116518 145430 99639
9617I9639J021J2723J3625j6268m0571k2654j3194j4240j0350J3826R2314n5976
$$ 99639 100660 113383 127008 110740 70169 47515 34321 20081 9731 23557 115871 59895
9605E9895k9819J411m8068L2441Q3075J242j0258o2315q9912k5431Q900M6476
$$ 59895 30076 31487 -16581 15860 98935 100177 89919 27604 -62308 -87739 -78839 -32363
9593c2363M6505k5460j7744K4816L2235o842N0435N0764N849l0653n2732r528
$$ -32363 14142 -11318 -29062 -4246 27989 21147 71582 122346 128195 97542 44810 35282
9581C5282L9626J1639l9835K9352J1300l9119k847j0157P4924q0327p7364L3724
$$ 35282 74908 86547 46712 76064 87364 48245 45398 35241 110165 29838 -47526 -13802
9569a3802M5479L6211J670n4374k3756P2359M1564l8761R366N1142Q417k9435
$$ -13802 31677 67888 69558 15184 -8572 63787 105351 66590 75956 127098 135515 106080
9557A06080j06190k7094J6027L0532J5867m83l3476l817k0745L3949L8210k9368
$$ 106080 -110 -27204 -11177 19355 35222 34739 1263 -2554 -23299 10650 48860 19492
9545A9492p9617K7321N4694k7712M805K735o279Q9457N5368k571r067q293r0926
$$ 19492 -60125 -32804 21890 -5822 -1017 1718 -4561 84896 140264 137693 128626 120333 29407
9532B9407p4482j7154O2389O334J5140O726k0418J9395M6303N1637j6492K0987
$$ 29407 -45075 -62229 160 6494 21634 28360 7942 27337 73640 125277 108785 129772
9520A29772k3825l1894n3005O043o368l3392O6271K4846J8114M1752l807l2061
$$ 129772 105947 74053 21048 27091 20723 -12669 53602 78448 96562 138314 134507 102446
9508A02446J9702M9709n9194k6881n8789k8094L3186J9761Q053O1325m4891m8425
$$ 102446 122148 171857 112663 85782 26993 -1101 32085 51846 59899 121224 76333 27908
9496B7908n2876M558J9197k3003J3810M6482N9141R547o9227l5718m7581q585
$$ 27908 -24968 -20410 -1213 -24216 -10406 36076 95217 104764 35537 -181 -47762 -56347
9484e6347M7422M5508J6771k3504m1509o704L8486M9802K585o3695p298L155J9436
$$ -56347 -8925 36583 53354 29850 -11659 -18363 20123 69925 72510 8815 1517 4672 24108
9471B4108o338j69J811l0006j5246L343O8345k4130o7191k9468K2079M7701M88
$$ 24108 17770 17601 19412 -10594 -25840 -22497 45848 21718 -45473 -74941 -52862 -5161 -4673
9458d673k4476K3911K4285K2680N0377l6777n7208N7629K9027k2053j0414k6155
$$ -4673 -29149 -5238 19047 41727 92104 55327 -1881 55748 84775 62722 52308 26153
9446B6153K5152R454k9870Q20J111j6052j7745N3801O7485q622l1431o0571p114
$$ 26153 51305 60759 30889 31709 32820 16768 -977 52824 120309 111687 80256 19685 12571
9433A2571L1577J3504j2083J1753M859j1682J6442l505l4910k8767K8709L3316
$$ 12571 44148 57652 45569 57322 62181 50499 66941 63436 28526 -241 28468 61784
9421F1784j2952m083K944J2961m3528p468M991K3812m842K6025l5399Q36N6794
$$ 61784 48832 44749 47693 60654 17126 9658 14649 38461 33619 59644 24245 25081 81875
9408H1875k212L5083J3440o120n8682m8053K9808k0773l7871l1435L4360J925
$$ 81875 79663 114746 128186 122066 63384 15331 45139 24366 -13505 -44940 -10580 -8655
9396h655n634o0141O2986N1889O534l4001J3953K3903M4870j0288N667j3143L9809
$$ -8655 -14289 -74430 -11444 40445 46979 12978 26931 50834 95704 85416 91083 77940 117749
9383A17749K1567j9956j4036J2498L444p4628k2472L9248k1431N743J320o35q729
$$ 117749 139316 119360 105324 117822 121266 46638 24166 63414 41983 47726 49046 48411 39682
9370C9682k8620K6270J4504n9800k4061J0580M3146K1184j9391K3546O9569M342
$$ 39682 11062 37332 51836 -7964 -32025 -21445 21701 42885 23494 47040 116609 120951
9358A20951j5787j1432M108K5867n0671m2381P712L7166m2354o14L2610l4172
$$ 120951 105164 93732 97840 123707 73036 30655 38367 75533 33179 32565 65175 31003
9346C1003j1120P537n800m2386K2492k906M405K0233M6280R548l0083K7162L2921
$$ 31003 19883 27420 21620 -20766 1726 -1180 3225 23458 69738 79286 49203 76365 109286
9333A09286l5084n2438j2177K8766L3811j7943L890m1213o477J5805j2035n1356
$$ 109286 74202 21764 9587 38353 72164 54221 58111 16898 10421 26226 14191 -37165
9321c7165k5160k8687L5012P6765J6838J2512k4109J5870L3579n6444r294N940
$$ -37165 -62325 -91012 -56000 20765 37603 50115 26006 41876 75455 19011 9717 15657
9309A5657J4176K9215K2524l365k7509R253q3317l5843L4174L4569j2467n6075
$$ 15657 29833 59048 81572 78207 50698 59951 -23366 -59209 -25035 9534 -2933 -59008
9297e9008m5921P2965L0180k8270J2553M6137M1150J4104M3438n0657l6350l1492
$$ -59008 -104929 -31964 -1784 -30054 -17501 28636 69786 83890 127328 76671 40321 8829
9285H829n950j4789j3945L6206M3531l522K9317l9118J991j7410N891m0969o8197
$$ 8829 2879 -11910 -25855 10351 53882 50360 79677 40559 42550 25140 31031 -9938 -78135
9272g8135N4500K0853L6181j5520M1678J8572L4748l2146k2088j8927l0070N290
$$ -78135 -23635 -2782 33399 17879 59557 78129 112877 80731 58643 39716 9646 14936
9260A4936J4761P3183j3719n5009j7127m5372m717o674j2444J5220L312N513K1990
$$ 14936 29697 102880 89161 34152 17025 -28347 -33064 -39738 -52182 -36962 -33650 -28137 -6147
9247f147M0031K5659k4039n0606m3036k0259J3615Q5545K5886J5245K0186r58
$$ -6147 33884 59543 35504 -15102 -58138 -78397 -64782 20763 46649 61894 82080 81122
9235H1122M070M5020J6130j6001r0083k6002n238j4557j3255j6690k2575M1131
$$ 81122 85192 130212 146342 130341 40258 14256 9018 -5539 -18794 -35484 -58059 -16928
9223a6928N2158q930J04871K2622p1258l2775L9339o4251O936m3289j4721J7229
$$ -16928 35230 26300 131171 153793 82535 49760 89099 24848 31784 -11505 -26226 -8997
9211h997k2212K278M1637L8055j7837J1022n878L607J6543j4738n1235k4029m515
$$ -8997 -31209 -28931 12706 50761 32924 43946 38068 41675 58218 43480 -7755 -31784 -36299
9198c6299q806N822l7990L5126k0163Q484L0533J2515k022l9634M0328M1557M985
$$ -36299 -45105 -39283 -77273 -42147 -62310 -53826 -23293 -10778 -12800 -52434 -12106 29451 34436
9185C4436M9155M0168n456N490K9954j3352q6027k6639k5627J3075J4398L6927
$$ 34436 83591 123759 118303 123793 153747 140395 54368 27729 2102 15177 29575 66502
9173F6502J5782l9319K1443m8063j7771O0871K7113q833N38p2637l1774l2365
$$ 66502 82284 42965 64408 16345 -1426 59445 86558 77725 78263 5626 -26148 -58513
9161e8513J3126K9762Q487k3781M3011J3005K3024J1230j0679m6775k221J6200
$$ -58513 -45387 -15625 -7138 -30919 12092 25097 48121 59351 48672 1897 -324 15876
9149A5876K6765M3888J9705q0848n8212L5391M0316Q225l8739l1584J2008j2891
$$ 15876 42641 86529 106234 25386 -32826 2565 42881 51106 12367 -19217 -7209 -20100
9137b0100m440M434K4951J6296J3365L4145K2925q1503k894R571R187L6433o380
$$ -20100 -24540 -20106 4845 21141 34506 68651 91576 10073 7179 16750 25937 62370 55990
9124E5990o124m9054k8700L5979J3659O2362k7603n6405m7962j739j0405j0427
$$ 55990 49866 812 -27888 8091 21750 84112 56509 104 -47858 -49597 -60002 -70429
9112g0429M1953K4281N6793N5309o950p569k4220j4935M1842p9927m2709m422
$$ -70429 -28476 -4195 52598 107907 100957 93388 69168 54233 96075 16148 -26561 -30983
9100c0983k1061M662J720k929L6816M7362p0093J666M0560O6136J9674l2750K2439
$$ -30983 -52044 -47382 -45662 -48591 -11775 35587 -34506 -32840 7720 73856 93530 60780 83219
9087H3219k7986j8891j8704l1699O1044N7906m580O450o330m7285q753L0386n0352
$$ 83219 55233 36342 17638 -14061 46983 104889 100309 106759 100429 53144 44391 74777 24425
9074B4425L3887L4012M1059o0770m2486P191m9690k1950M5696L859j12M7768m314
$$ 24425 58312 92324 133383 72613 30127 37318 -12372 -34322 11374 15233 15121 62889 58575
9061E8575l2666q546K6416n591k3999J6115l4698K2135J1006K2715R1064k579
$$ 58575 25909 17363 43779 38188 14189 30304 -4394 17741 28747 51462 142526 139947
9049A39947m0630j472m7699l6196k6423m7614M5464o711M1785M9424o248L3049
$$ 139947 99317 97845 50146 13950 -12473 -60087 -14623 -21334 20451 69875 63627 96676
9037I6676J2853J0401k3920k2260m5252m0699n0009K4176L163M7790N3541K9787
$$ 96676 109529 119930 96010 73750 28498 -12201 -62210 -38034 -34871 12919 66460 96247
9025I6247R04K1582k9421k3415K2129j8719o518M7161k3662n1834o079M0523k2702
$$ 96247 97151 118733 89312 65897 88026 69307 62789 109950 86288 34454 28375 68898 46196
9012D6196L9141K6616M544n718m9313p035L9412Q417p3310n0967K9497M7968J8442
$$ 46196 85337 111953 116497 110779 61466 54431 93843 102260 28950 -22017 7480 55448 73890
8999G3890j3456P868M2253O1648N6142n5309l7928p0109o1935M5823k2903l1001
$$ 73890 60434 68302 110555 172203 228345 173036 135108 64999 3064 48887 25984 -5017
8987e017K8863J2233K774K1639j7197r237j7412j0026m0008O6186K1936k301l6179
$$ -5017 23846 36079 38853 60492 43295 34058 16646 6620 -33388 32798 54734 52433 16254
8974A6254J0398j1525m2111J62j0353J7467L3085L0327k7933j8807N703l0261
$$ 16254 26652 15127 -26984 -26822 -37175 -19708 13377 43704 15771 -3036 2667 -27594
8962b7594r612K1722q550K4194R4930M7349l5834r2531m2326K0909P32K7288K9865
$$ -27594 -37206 -15484 -24034 160 95090 142439 106605 14074 -28252 -7343 -6611 20677 50542
8949E0542J5514n7073N1401L4062l971P252m3569l7806N374q067k32M4948K4895
$$ 50542 66056 8983 60384 94446 90475 97727 54158 16352 21726 13659 13427 58375 83270
8936H3270k6528p814o0669j3743K9128J7136J6693o8904K1210M4598j5254k8854
$$ 83270 56742 48928 -11741 -25484 3644 20780 37473 -31431 -10221 34377 19123 -9731
8924i731k5300o162m568L8128K8480m4085K4553M7470k4804l6997K5759L4344
$$ -9731 -35031 -41193 -45761 -7633 20847 -23238 1315 48785 23981 -13016 12743 47087
8912D7087J0478n1156l3442J7849L2054L3751O0454K5873q8540m9744m766L5683
$$ 47087 57565 6409 -27033 -9184 22870 56621 117075 142948 54408 4664 -102 35581
8900C5581R7574j59m0958l787m3415k3075P606L7212K3196k8385o8747j898O5165
$$ 35581 133155 132996 92038 88251 44836 21761 29367 66579 89775 61390 -7357 -9255 55910
8887E5910m6635J2219L900j8135j3326J4878L788l775K1481M1632L023q0715n387
$$ 55910 9275 21494 25394 7259 -6067 8811 12599 8824 30305 71937 74960 -5755 -11142
8874a1142J7382K0555k684L5089j7332O210K2731m659k6936L0853N2073k4277
$$ -11142 6240 26795 24111 59200 41868 48078 70809 66150 39214 70067 122140 97863
8862I7863J4830l0554k6354l576n5040l0472M6928M2118j0457j6675J1726Q035
$$ 97863 112693 82139 55785 52209 -2831 -33303 13625 55743 45286 28611 40337 48372
8850D8372M7184l659k471M81q26J6598K8905q000l0819m6729j942k611K3025J8114
$$ 48372 95556 91897 89426 89907 89081 105679 134584 126584 95765 49036 47094 44483 67508 85622
8836H5622k1865m4754l2006k43L33M8169J0362k3874L8624L0388K36j714j5190
$$ 85622 63757 19003 -13003 -13246 -12913 35256 45618 21744 60368 90756 90992 89278 74088
8823G4088j7747o4489J1393K5248J5300N6014N5039j9360p2068k9797K7689k6032
$$ 74088 56341 -8148 3245 28493 43793 99807 154846 135486 63418 33621 61310 35278
8811C5278l6717J0021K6055r9m0374k5523K6959K0838N207j6252l232J6793J9540
$$ 35278 -1439 8582 34637 34538 -5836 -31359 -4400 16438 21645 5393 2161 18954 38494
8798C8494Q08R477l3955O061J4534q092N508k8023m1624j4957P3273J2325o1354
$$ 38494 39302 48779 14824 20885 35419 27327 32835 4812 -36812 -51769 21504 33829 -27525
8785b7525j7453k8602k7785L0769K1656M3324J1522m997q522k7392M5854M3557
$$ -27525 -44978 -73580 -101365 -70596 -48940 -5616 5906 909 -7613 -35005 10849 54406
8773E4406l6609k6514n311K0496M5761J5261m770M1569M909m8657m137J14133
$$ 54406 17797 -8717 -14028 6468 52229 67490 62720 104289 109198 60541 56404 170537
8761A70537J7030n7216n2200p7103j2346J06764k3998m0500k2391M8600r419j065
$$ 170537 187567 130351 78151 1048 -11298 95466 71468 30968 8577 57177 47758 46693
8749D6693J9213j0182j03857l913N4380L9380K1466j1390k0634k5430O122K7919
$$ 46693 65906 55724 -48133 -52046 2334 41714 63180 51790 31156 5726 11848 39767
8737C9767J7194K3995N9276M0901q6223l8678n8260j0980K1607k4614m1044j4167
$$ 39767 56961 80956 140232 181133 94910 56232 -2028 -13008 8599 -16015 -57059 -71226
8725g1226j476J6741J6270K9113L1825m6653P571J4418J2595J1819l50l2699K7529
$$ -71226 -72702 -55961 -39691 -10578 21247 -25406 -17835 -3417 9178 20997 20647 -12052 15477
8712A5477L530r839m013R568K7676n0407J6831j523L0134j6374M546m9292L6123
$$ 15477 19007 9168 5155 14723 42399 -8008 8823 7300 37434 21060 25606 -23686 12437
8699A2437O1784n1618J6786r604j5577N511k2717k1155j2816P043N1604K9804
$$ 12437 74221 22603 39389 29785 14208 19719 -2998 -24153 -36969 -29926 21678 51482
8687E1482j8218j9075j2216K3341N3977M7444L1954j6727j1807l5341J1723m453
$$ 51482 33264 14189 1973 25314 79291 126735 158689 141962 130155 94814 106537 102084
8675A02084k4903k2249q4488l7457J344J3957J7233J266M1102n155J9688N171
$$ 102084 77181 54932 -29556 -67013 -65669 -51712 -34479 -33213 7889 2734 22422 27593
8663B7593J4701K0178n9745J4702K8401J1222P295j0867n0529m9214L6467N4900
$$ 27593 42294 62472 2727 17429 45830 57052 64347 53480 2951 -46263 -9796 45104
8651D5104K2857P113l0365k4745J9573O0762k8440k8652Q196j1242P399l7391
$$ 45104 67961 75074 44709 19964 39537 100299 71859 43207 51403 40161 47560 10169
8639A0169l4114l9383L3405M4993M4193O1956N1311J7470l25k9810m3289l7815
$$ 10169 -23945 -63328 -29923 15070 59263 121219 172530 190000 189675 159865 116576 78761
8627G8761k3467L0726r0801k9866Q2064L3605n5168m3301k3936L2949k385K2106
$$ 78761 55294 86020 -4781 -34647 47417 81022 25854 -17447 -41383 -8434 -10819 11287
8615A1287M107J9596l652j501L0923O029J1924m269k1441K0382j5305l2659N3134
$$ 11287 15394 34990 31338 29837 60760 66789 78713 74444 53003 73385 58080 25421 78555
8602G8555L0851n5660q6404J9143J6685L6449J4516J6837k5355N148j5215P89
$$ 78555 109406 53746 -32658 -13515 3170 39619 54135 70972 45617 50765 35550 36339
8590C6339M2688j5152o9353L2037J8383r430r208J0443O6709K7480m728j9360
$$ 36339 79027 63875 -5478 26559 44942 35512 26304 36747 103456 130936 126208 106848
8578A06848J5940K4722L988q982n5379l8266R44J0453j4049k1164p46L7778R048
$$ 106848 122788 147510 151498 142516 87137 48871 49815 60268 46219 25055 24309 62087 71135
8565G1135k7278k7018j7943J5391M7514l557j4284J5037j1111k5863N5043J2213
$$ 71135 43857 16839 -1104 14287 61801 58244 43960 58997 47886 22023 77066 89279
8553H9279k5295P104o922K5512M6917J061l8524n3649J4142J2813J4577l5151
$$ 89279 63984 71088 64166 89678 136595 137656 99132 45483 59625 72438 87015 51864
8541E1864N578o2379j9666K6052K9395r080L4708K1657j3207m8576M5769K2567
$$ 51864 57442 -4937 -24603 1449 30844 21764 56472 78129 64922 16346 62115 84682
8529H4682k9928j0886N3647J7186k2277j7218p0525Q768K1835K0583j9713j0786
$$ 84682 54754 43868 97515 114701 92424 75206 4681 13449 35284 55867 36154 25368
8517B5368J164K8286O1730K2846l0216o1264J6058J7858l3096k2085N2871j0282
$$ 25368 26532 54818 116548 139394 109178 47914 63972 81830 48734 26649 79520 69238
8505F9238o1875l1055Q501Q7790N7895J2894n9451k8454J6794n6911k5769n020
$$ 69238 7363 -23692 -15191 72599 130494 143388 83937 55483 72277 15366 -10403 -15423
8493a5423m193p99J2949M7421j777p461j5956M1177K8728L4808K277l5629j8319
$$ -15423 -19616 -20415 -7466 39955 38178 30717 14761 55938 84666 119474 121751 86122 67803
8480F7803K656K6149r358j2696j1995j5764J2805k1397p792j2058j0799K2312
$$ 67803 70459 96608 87250 74554 62559 46795 59600 38203 30411 18353 7554 29866
8468B9866k8620J0911J5829J4151J6048j2349M3562K5618j8748p8627O214J2092
$$ 29866 1246 12157 27986 42137 58185 45836 89398 115016 96268 17641 23855 35947
8456C5947L2548L7379n0001l5429l4006L9364P2685P2073j1372m8158p0198j9091
$$ 35947 68495 105874 55873 20444 -13562 25802 98487 170560 159188 111030 40832 21741
8444B1741l7552n0175K9220N5911M8461r441o7264p040L8251M0475j7103n5747
$$ 21741 -15811 -65986 -36766 19145 67606 58165 -9099 -16139 22112 62587 45484 -10263
8432a0263m4852M859L5986j9181J0984Q651j8549M9772N8050J5176L0639M7303
$$ -10263 -55115 -50256 -14270 -33451 -22467 -13816 -32365 17407 75457 90633 121272 168575
8420A68575K7350P7265J22337J62583R9009m9142j33483j13788r5784l5855l1499
$$ 168575 195925 273190 395527 558110 657119 607977 474494 360706 264922 229067 197568
8409A97568m3222k5004n0440J3482K5513k4423n501n0174J9990Q6824R715m1993
$$ 197568 154346 129342 78902 92384 117897 93474 87973 37799 57789 144613 154328 112335
8397A12335m3923K4447l238l2230l7704l190j1294J407L14k117J9412k841J1599
$$ 112335 68412 92859 89621 57391 19687 16497 5203 6610 6924 4807 24219 21378 32977
8384C2977k9087j1588P5214N6270L5996J05567R9541J04589J19725P317j54519
$$ 32977 3890 -7698 67516 123786 159782 265349 364890 469479 589204 596521 442002
8373D42002j52546j10512p3253k7383j241J9707j6684J9569N398K2630j2695Q932
$$ 442002 289456 178944 105691 78308 77067 96774 80090 99659 105057 127687 114992 123924
8361A23924r54j8073l1234P156K2388j7268j6927L555L1835l9776l5641m1597
$$ 123924 122970 104897 73663 80819 103207 85939 69012 72567 104402 64626 28985 -12612
8349a2612o500N207P7344n69m2793j6662m3785J0134J3294K5374P48j1138j8165
$$ -12612 -19112 -13905 63439 62870 20077 3415 -40370 -30236 -16942 8432 9180 -1958 -20123
8336b0123N13J6341O6148K0722p638q789K5505O4881P8768M4644k032J271p7037
$$ -20123 -19610 -3269 62879 83601 75963 67174 92679 157560 236328 280972 278940 280211 203174
8323B03174j03503l0965o3573p04j2784L0293m3835n315O1231Q817K3180r708
$$ 203174 99671 68706 5133 4429 -8355 21938 -21897 -27212 34019 42836 66016 56308
8311E6308p981k6878K0948P329r664m7936j0853K0138J3942l3402n803j7062L127
$$ 56308 48327 21449 42397 49726 40062 -7874 -18727 1411 15353 -18049 -23852 -40914 -37787
8298c7787Q0132j4752m5144q41K1080j6347Q884k0680p743l819J7389j8465n920
$$ -37787 42345 27593 -17551 -18392 2688 -13659 -4775 -25455 -33198 -37017 -19628 -38093 -44013
8285d4013j9731L1521O0735l0818l8114M2241K5186n908p1353j1484O5864Q145
$$ -44013 -63744 -32223 28512 -2306 -40420 1821 27007 21099 -50254 -61738 4126 12271
8273A2271k0763q9764j8472L2191M2417L8856N3552r917n4954q2043N0224J5069
$$ 12271 -8492 -98256 -116728 -84537 -42120 -3264 50288 40371 -14583 -96626 -46402 -31333
8261c1333K3298M5243M5317L9883p969j2622k7801n338j1589L8428p615l2012
$$ -31333 -8035 37208 82525 122408 114439 101817 74016 68678 57089 95517 87902 55890
8249E5890l1575L0982J0850k8538K6520L6083J4401j2176o6991j3578M8073M3759
$$ 55890 24315 55297 66147 37609 64129 100212 114613 102437 35446 21868 69941 113700
8237A13700k4818l0336k7285J4185L893J6545o0712j4837j8443j6116K9066L8764
$$ 113700 88882 58546 31261 45446 49339 65884 5172 -9665 -28108 -44224 -15158 23606
8225B3606j8320j1516L2446K2708j00236K4988M4470M1231M055K1637K154j6636
$$ 23606 5286 -6230 26216 48924 -51312 -26324 18146 59377 63432 85069 87223 70587
8213G0587j0399m1136r104L406M706J5502O1749o0566p7680k9317N294O8025R508
$$ 70587 60188 19052 9948 13354 18060 33562 95311 34745 -42935 -72252 -66958 1067 10575
8200A0575j377J5731N364K7508k2216l8960j04846P8379K3866k613m5188M350
$$ 10575 9198 24929 30293 57801 35585 -3375 -108221 -29842 -5976 -8589 -53777 -49427
8188d9427O0012M7223M1416n0233l0329O708j4157m2192K7589l0073j8477L3369
$$ -49427 10585 57808 99224 48991 18662 25370 11213 -30979 -3390 -33463 -51940 -18571
8176a8571O301n1482L5518K4087k0973J5863R9139l7881r5535M997L472M5432
$$ -18571 -12270 -63752 -28234 -4147 -25120 -9257 89882 52001 -43534 -38537 -35065 10367
8164A0367L9462K6419Q832l6159j3782J5499J7178L811j4181R34L324k8450j5312
$$ 10367 49829 76248 85080 48921 35139 50638 67816 71627 57446 58380 61704 33254 17942
8151A7942n6533j3640J7870L1374K494O5137K0723m0324k6213N8020l8376k4516
$$ 17942 -38591 -52231 -34361 -2987 -493 64644 85367 45043 18830 76850 38474 13958
8139A3958J4232o3659K8219P5817k2132o5642j6159L1705L8738K4107K1738q17
$$ 13958 28190 -35469 -7250 68567 46435 -19207 -35366 -3661 35077 59184 80922 80105
8127H0105j4080j3636l3781l8252k3384J0410L0455L2696P471j1636m9083L1181
$$ 80105 66025 52389 18608 -19644 -43028 -32618 -2163 30533 38004 26368 -22715 8466
8115H466K2856O0524K8330l5448k2710k2108Q365M6812j088j7987m9282l9650
$$ 8466 31322 91846 120176 84728 62018 39910 48275 95087 93999 76012 26730 -12920
8103a2920K0946l924m6437J290K0731L0677j21N453K4978K116L5406M7932l2142
$$ -12920 8026 4102 -42335 -41045 -20314 10363 10242 15695 40673 42789 78195 126127 93985
8090I3985k2365M511j4253k4780l5820k5927N403M964J1200M0712M2235k518L885
$$ 93985 71620 76131 61878 37098 1278 -24649 -19246 -14282 -3082 37630 79865 77347 81232
8077H1232k2330j0014l1287J3002k284K197R626j9259j0819j4370k3281l2077
$$ 81232 58902 48888 17601 30603 28319 30516 40142 20883 10064 -4306 -27587 -59664
8065e9664r653J1182M0931J3657Q042k0656k579K3743L4874j011P3926p2108j15008
$$ -59664 -69317 -58135 -17204 -3547 4495 -16161 -18740 5003 39877 38866 112792 40684 -74324
8052g4324L5O0744l9661m9184N5524N8036N0869J2746r870l447j9176O5084J7396
$$ -74324 -74289 -13545 -53206 -102390 -46866 11170 62039 74785 64915 61468 42292 107376 124772
8039A24772l2588j1830n3797k9489k7229N9876M374n633k3564k3494m173N6383
$$ 124772 92184 80354 26557 -2932 -30161 29715 34089 28456 4892 -18602 -22775 33608
8027C3608J8617k3295j4096n611j2238O859n267r085k7533j1361N9521M9245k0057
$$ 33608 52225 28930 14834 9223 -3015 3844 -1423 -10508 -38041 -49402 10119 59364 39307
8014C9307J653l0799j4948J570K7684L5160l4581J0326Q907J9365J6636n6269
$$ 39307 40960 10161 -4787 -3217 24467 59627 25046 35372 44279 63644 80280 24011
8002B4011o2308J0485k6142J4671K1817R1678L3956l3380l3984j2109P638K198
$$ 24011 -38297 -27812 -53954 -39283 -17466 74212 108168 74788 40804 28695 36333 38531
7990C8531k8594M8478K8450n0628l6839J9875m446l1021K6817J3284n253L1643
$$ 38531 9937 58415 86865 36237 -602 19273 14827 -16194 10623 23907 18654 50297
7978E0297P194n0750k5506m957K9880j0472L184j5111j164N3080K1513j3614k9564
$$ 50297 57491 6741 -18765 -23722 6158 -4314 -1130 -16241 -17405 35675 57188 43574 14010
7965A4010M0762k3438n3580J6657K3106R882J1032Q581k5771j2304J2474o1232
$$ 14010 54772 31334 -22246 -5589 17517 27399 38431 47012 21241 8937 21411 -39821
7953c9821j5060j2982q97k8225K6085N4836L8180K6007j0760l8912k2747L0904
$$ -39821 -54881 -67863 -68760 -96985 -70900 -16064 22116 48123 37363 -1549 -24296 6608
7941F608M1105k3504m3251k3211J886J1552J9054j3233J1730k3554r136L0256
$$ 6608 47713 24209 -19042 -42253 -40367 -28815 -9761 -22994 -11264 -34818 -43954 -13698
7929a3698k5234J8854N0136p887n6644J5117J4135J6861J7511K601J36l5251N2681
$$ -13698 -38932 -20078 30058 22171 -34473 -19356 -5221 11640 29151 31752 31888 -3363 49318
7916D9318o304O990L2860k1002K169m2862l6839L8200M1396m4053K0180r509j16991
$$ 49318 43014 50004 82864 61862 64031 21169 -15670 22530 63926 19873 40053 30544 -86447
7903h6447J1809L9197L7178K1021n0201j458K2483J0101Q1K680k8848J6656O9468
$$ -86447 -74638 -35441 1737 22758 -27443 -28901 -6418 3683 3764 6444 -22404 -5748 63720
7890F3720L8743o185k2469K598k2368j3141J7021M6436j6733j2955q1498m5897
$$ 63720 102463 96278 73809 76407 54039 40898 57919 104355 87622 74667 -6831 -52728
7878e2728J0877M8384l070K709J32m929N6985l0041k7661n2264O2937R453K3177
$$ -52728 -41851 6533 3463 6172 6304 1375 58360 28319 658 -51606 11331 20784 43961
7865D3961K7519l7139k6818j8790L2932k9161m1784n0248J9229M4462N2305L9696
$$ 43961 71480 34341 7523 -11267 21665 -7496 -49280 -99528 -80299 -35837 16468 56164
7853E6164j6688l6391o7362j8833O8275n31j9701k8579j4454n0464L0332M2134
$$ 56164 39476 3085 -64277 -83110 -14835 -15366 -35067 -63646 -78100 -128564 -98232 -56098
7841e6098J9675k3465J3718L3795O9515N9132j9132r9590n910M6326l6390l3936
$$ -56098 -36423 -59888 -46170 -12375 57140 116272 97140 -2450 -8360 37966 1576 -32360
7829c2360L0552k7944k6038M9773M145q974j0199p593M931o0777K4220J5180L839
$$ -32360 -1808 -29752 -55790 -6017 -1872 -10846 -21045 -28638 -23707 -84484 -60264 -45084 -41245
7816d1245L7746j2641J4984J8469l1978l7651l6834j2651m2859J0213R9637P2182
$$ -41245 -3499 -16140 -1156 17313 -14665 -52316 -89150 -101801 -144660 -134447 -34810 37372
7804C7372R922o932k0895k9437n1862j0339r999N1106M5398Q570K834K5098J1175
$$ 37372 47294 40362 19467 -9970 -61832 -72171 -82170 -31064 14334 22904 25738 50836 62011
7791F2011j9011n5898j9172M4355k4062l9894m2838M1713K0535M9816k406L230
$$ 62011 43000 -12898 -32070 12285 -11777 -51671 -94509 -52796 -32261 17555 15149 18379
7779A8379L0787n598p7133k9308L3300M2301R740K9539m5207O81O646n7221K0992
$$ 18379 49166 43568 -33565 -62873 -29573 12728 22468 52007 6800 7481 14127 -43094 -22102
7766b2102P2557K7754K236K5735k5909n1453j2394o2621k692j3787o65K1658k866
$$ -22102 50455 78209 80445 106180 80271 28818 16424 -46197 -48889 -62676 -63341 -41683 -44549
7753d4549N8491O5219K0594o92n3725m6003O498l3747J0442K8745J2267M996J0840
$$ -44549 13942 79161 99755 99063 45338 -665 5833 -27914 -17472 11273 23540 28536 39376
7740C9376J6157K04K1987J8800R048o2622l4651m0944L0988K107n7458l7306K2964
$$ 39376 55533 55737 77724 96524 105572 42950 8299 -32645 -1657 450 -57008 -94314 -71350
7727g1350J7799P8730M5995K5362l2021j8069q741n354j5266k941j8470J3491
$$ -71350 -53551 25179 71174 96536 64515 46446 37705 32351 17085 14144 -4326 9165
7715I165j201l172o851N484k4559L678o812R171l882K5k2764j4961l2527l0408
$$ 9165 7964 4792 -2059 3425 -21134 -17456 -24268 -15097 -18979 -18954 -41718 -56679 -89206 -119614
7701a19614O6167K7231m408m861K3171L7857M8367l1883l0846M784k4117j9444
$$ -119614 -53447 -26216 -30624 -35485 -12314 25543 73910 42027 11181 15965 -8152 -27596
7689b7596M3450j81n9416Q644m3O6656M5141k1522M401l683o3512p0008q043K0098
$$ -27596 15854 15673 -43743 -35099 -35142 31514 76655 55133 59534 55851 -7661 -77669 -85712 -65614
7675f5614r219J5443k1479N49M1346O4592R866j7925l7497N354K6582k1425J0597
$$ -65614 -74833 -59390 -80869 -80320 -38974 25618 35484 17559 -19938 -14584 11998 -9427 1170
7662A170k4377k269M661O7970M5822J278l5763j03595Q329M1141r745L665n490
$$ 1170 -23207 -25476 -20815 47155 92977 94255 58492 -45103 -36774 4367 -5378 -1713 -7203
7649g203o598l4265K3828L7068j067k8984J9917L4100k223K1576m5760l0801K9922
$$ -7203 -13801 -48066 -24238 12830 11763 -17221 2696 36796 34573 56149 10389 -20412 9510
7636I510j0964k9925m506k088k0253J0036R3401M5371N0316m2010m1208p146J7130
$$ 9510 -1454 -31379 -35885 -37973 -58226 -48190 45211 90582 140898 98888 57680 50534 67664
7623F7664M7894J8746j8019n4292m908m1805m2214j9254L8139N396m5113N329
$$ 67664 115558 134304 116285 61993 57085 15280 -26934 -46188 -8049 -2653 -47766 -42437
7611d2437K0225J4466j2791M0072O50J575l681m1878l1068l106m315k6804J3442
$$ -42437 -22212 -7746 -20537 19535 20185 21760 18079 -23799 -54867 -57973 -62288 -89092 -75650
7598g5650L5846M0484K9667J908j5550l1953k4056M3076L0615j1961J5979M3896
$$ -75650 -39804 680 30347 32255 16705 -15248 -39304 3772 34387 22426 38405 82301
7586H2301K4680k6464m2441k6870l0694l1350K5413k078K4976k3314J3300O5908
$$ 82301 106981 80517 38076 11206 -19488 -50838 -25425 -27503 -2527 -25841 -12541 53367
7574E3367K4324o7534o1566J1826L9196l7269J939K5285J580j5867J9826n3423
$$ 53367 77691 10157 -51409 -39583 -387 -37656 -35717 -10432 -8852 -24719 -4893 -58316
7562e8316j2522n112m3613j0512P0017K5480n3828M45q101J6511N2683N164j6560
$$ -58316 -70838 -75950 -119563 -130075 -60058 -34578 -88406 -87961 -96062 -79551 -26868 -21704 -38264
7549c8264J8615k9127p686l0121P82L3373J3986J05411M5465j6826j6957m2637
$$ -38264 -19649 -48776 -56462 -86583 -85801 -52428 -38442 66969 112434 95608 78651 36014
7537C6014m730M9151o251n4701q781N450L2851m0093j0883L3744J1907o0821l3850
$$ 36014 31284 80435 74184 19483 10702 16152 49003 8910 -1973 31771 43678 -17143 -50993
7524e0993K5933m7259j3217M164j5835k3891K4136L9175j8055l2K0579L8116L1582
$$ -50993 -25060 -72319 -85536 -81372 -97207 -121098 -96962 -57787 -75842 -75874 -55295 -17179 14403
7511A4403L9904J0105m0995m7529p385L061L0443m6029K2119K5560j3969L5521
$$ 14403 54307 64412 23417 -24112 -31497 -28436 2007 -44022 -21903 3657 -10312 25209
7499B5209r356l925J2508n0178r355J6000P389n575K9584J7933n4000m0053K8990
$$ 25209 15853 11928 24436 -25742 -35097 -19097 -11708 -17283 12301 30234 -23766 -63819 -34829
7486c4829L9341m1704m5495J7315O005M8374J5844j8740P082m8349P7293J4136
$$ -34829 4512 -37192 -82687 -65372 -59367 -10993 4851 -13889 -6807 -55156 22137 36273
7474C6273m7462j4652k3141l903Q1608K1264l5607k6656L4149N5768J5444k5434
$$ 36273 -11189 -25841 -48982 -52885 28723 49987 14380 -12276 21873 77641 93085 67651
7462F7651N4538l6557n8084K635l8296k8702L302j3779J715R805L7740j6642k0306
$$ 67651 122189 85632 27548 30183 -8113 -36815 -33513 -47292 -45577 -35772 1968 -14674 -34980
7449c4980k540K7499P0820L8604M4966k6168n8537l7323j9796L2513R01k6407
$$ -34980 -37520 -10021 60799 99403 144369 118201 59664 22341 2545 35058 35959 9552
7437I552p8329l528j8677K1368P1622J7853l8782J251M3544q224m3910k0691j3207
$$ 9552 -68777 -72305 -90982 -69614 2008 19861 -18921 -17670 25874 17650 -26260 -46951 -60158
7424f0158N2546L13k1572M5691J6111j2776l089p9051j8043N3741J05938K2157
$$ -60158 -7612 -7299 -28871 16820 32931 20155 17066 -61985 -80028 -26287 79651 101808
7412A01808k3389l7771o3416p0385K7438M5721L0143k550J4716K0115j5035j7275
$$ 101808 78419 40648 -22768 -93153 -65715 -19994 10149 7599 22315 42430 27395 10120
7400A0120J3960J3214K4179k5505J1926K0439j0811l4992K747L5036k7438K2100
$$ 10120 24080 37294 61473 35968 47894 68333 57522 22530 25277 60313 32875 54975
7388E4975j980O654j0411r6567K0502J9901l0680L2736K2697l7751J0470L0694
$$ 54975 52995 59649 49238 -47329 -26827 -6926 -37606 -4870 17827 -19924 -9454 21240
7376B1240J5146l4528K669P68J0519J0230r169J3136k6541m188J7232N306N88
$$ 21240 36386 1858 4527 5295 15814 26044 16875 30011 3470 -718 16514 21820 22408
7363B2408K8197J5604R223L2304k5072n6638o2780j4410j161K8511J2543J3695
$$ 22408 50605 66209 75432 107736 82664 26026 -36754 -51164 -52325 -23814 -11271 2424
7351B424N0579Q77j4132N907J5936k0573J6091J6348m3664m1681l4402R2865M7453
$$ 2424 53003 53880 39748 45655 61591 41018 57109 73457 29793 -11888 -46290 46575 94028
7338I4028m3280n1245k737K5979l8480N868l6830k0383l194K6081P614N772n107
$$ 94028 50748 -497 -3234 22745 -15735 -9867 -46697 -67080 -70274 -44193 -36579 -30807 -35914
7325c5914R59j9719n939K7323O5394m4773j4593N1939K7710j4679j5374n7934
$$ -35914 -34955 -54674 -60613 -33290 32104 -12669 -27262 24677 52387 37708 22334 -35600
7313c5600l6162M0889j0559Q720K3871m3046j1403J1483Q020j2952N919j7754
$$ -35600 -71762 -30873 -41432 -32712 -8841 -51887 -63290 -51807 -43787 -56739 -50820 -68574
7301f8574p776N3608N3855r711m8912k3826k5885L3151K7922k134K6000M0771
$$ -68574 -76350 -22742 31113 21402 -27510 -51336 -77221 -44070 -16148 -18282 7718 48489
7289D8489J4326q260J1102l9839p1056J9010M6374r797P326l2054J6804O909o638
$$ 48489 62815 54555 65657 25818 -45238 -26228 20146 10349 17675 -14379 2425 9334 2696
7276B696K8557K4645m7112j7712P191O254m507N9186N220R920m0856o1736K8570
$$ 2696 31253 55898 8786 -8926 -1735 4519 12 59198 64418 74338 33482 -28254 316
7263C16K7491k138q81J8136J782n1896l5604k8485J6512M7231L285N244j6945
$$ 316 27807 25669 24788 42924 44706 -7190 -42794 -71279 -54767 -7536 -4251 993 -15952
7250a5952m5166r876L416L252J2588J4156P0823K3110k0343k7199r2943K1630
$$ -15952 -61118 -70994 -67578 -64326 -51738 -37582 33241 56351 36008 8809 -84134 -62504
7238f2504M1165j927m9780L0774j0339O878J9791k2849k164L8012N590M2454n818
$$ -62504 -21339 -23266 -73046 -42272 -52611 -45733 -25942 -48791 -50955 -12943 -7353 35101 29283
7225B9283l0840j4860n597L3405m036k6012p2211J5174Q222l1122M8193L4544
$$ 29283 -1557 -16417 -22014 11391 7355 -18657 -90868 -75694 -67472 -98594 -50401 -15857
7213a5857K2292K2266l27k3251Q427L0489J7114L0245K2764m0292r7386p4400
$$ -15857 6435 28701 28374 5123 13550 44039 61153 91398 114162 73870 -23516 -97916
7201i7916M969L1114J9030K4703K6421N992n0234m5165L6525J9506N460O938o049
$$ -97916 -92947 -61833 -42803 -18100 8321 14313 -35921 -81086 -44561 -25055 -19595 -12657 -18706
7188a8706L420Q036k1558k6003L8539j5841j2690N2921K7754k2011L997k8803
$$ -18706 -15286 -7250 -28808 -54811 -16272 -32113 -44803 8118 35872 13861 17858 -10945
7176a0945n3477j7413J5639M216L8324M6830p2591R006j6858M0787O3334k4730
$$ -10945 -64422 -81835 -66196 -61980 -23656 23174 -49417 -40411 -57269 -16482 46852 22122
7164B2122p7632m2377L0974K2363M3309O8916m9176q9189J3076m774J9938L2996
$$ 22122 -55510 -97887 -66913 -44550 -1241 67675 18499 -70690 -57614 -62388 -42450 -9454
7152i454J1928r322m501k6551n0516k6969L4085K7630K4541N1395L9462M0020
$$ -9454 2474 -6848 -11349 -37900 -88416 -115385 -81300 -53670 -29129 22266 61728 101748
7140A01748n6206m8531P814k6017J8576k7597l550J6097L040n853j1485J7350
$$ 101748 45542 -2989 4825 -21192 -2616 -30213 -33763 -17666 -14626 -20479 -31964 -14614
7128a4614M9264R802m594m7921k6041o380n1290J5697k4394J6431L0254K9260
$$ -14614 34650 44452 39858 -8063 -34104 -40484 -91774 -76077 -100471 -84040 -53786 -24526
7116b4526N060M9416R809K3730n1723j4723n160K6572M060o4803m7014L7888N9725
$$ -24526 -19466 29950 39759 63489 11766 -2957 -8117 18455 22515 -42288 -89302 -51414 8311
7103H311J6240l2244j3170l2547m5856K3144L7015K5325k2603p986L0601L8540
$$ 8311 24551 -7693 -20863 -53410 -99266 -76122 -39107 -13782 -36385 -44371 -13770 24770
7091B4770K5292r233k0770J3294J9611K5434l2267n2962m9626N780m366j7737
$$ 24770 50062 40829 20059 33353 52964 78398 46131 -6831 -56457 -50677 -55043 -72780
7079g2780J7097P2244J4254j0024L0386q48n933n8653l0000K5632M0818L3169
$$ -72780 -55683 16561 30815 20791 51177 50329 44396 -14257 -44257 -18625 22193 55362
7067E5362K8484K3549l7871k8010r093m2932K707j63N002k2065l1854j7418k5463
$$ 55362 83846 107395 69524 41514 32421 -10511 -7804 -7967 -2965 -25030 -56884 -74302 -99765
7054i9765L2300K8136K581l3730j3800Q367j0664J2265l1067j2943M6381J2758
$$ -99765 -67465 -39329 -36748 -70478 -84278 -75911 -86575 -74310 -105377 -118320 -71939 -59181
7042e9181L8716L7422k7779q0333m0994L1089R1196K6089R896L0098K2891j12797
$$ -59181 -20465 16957 -10822 -91155 -132149 -101060 -9864 16225 26121 56219 79110 -33687
7030c3687n1719M1450j6440J2434j3716M1793k3063L4129N5577l7405j1198M8704
$$ -33687 -85406 -43956 -60396 -47962 -61678 -19885 -42948 -8819 46758 9353 -1845 46859
7018D6859l0787n5482l950J2187k5084m2189L5562K4650M376N4397m155l8541
$$ 46859 16072 -39410 -43360 -31173 -56257 -98446 -62884 -38234 -33858 20539 16384 -22157
7006b2157m3780Q353k0195m759K739k6543J4127L5327k7141J167K8323K2036O350
$$ -22157 -65937 -57584 -77779 -82538 -79799 -106342 -92215 -56888 -84029 -82862 -54539 -32503 -26153
6993b6153K1640l0995n779J5151M961N2904J3814j1956L8502L7985j6797p8247
$$ -26153 -4513 -35508 -41287 -26136 -21175 31729 45543 33587 72089 110074 93277 15030
6981A5030k452P7357j1761n0807o527k9880O98L6342K784K2430J2905n0980q5815
$$ 15030 12578 89935 78174 27367 20840 -9040 -8342 28000 30784 53214 66119 15139 -70676
6968g0676k4847j5806Q015M4345J3526L5438P980N1799l7488l7710p884J4483
$$ -70676 -95523 -111329 -103314 -58969 -45443 -10005 -2025 49774 12286 -25424 -33308 -18825
6956a8825M2509J5822m9332k6940j242J9120j5169O96j8252m1552J6495P3523
$$ -18825 23684 39506 -9826 -36766 -38008 -18888 -34057 -33361 -51613 -93165 -76670 -3147
6944c147L1290l9233m5745n8312j7887m7O0973J13095L1082m8316k5517L6107
$$ -3147 28143 -11090 -56835 -115147 -133034 -133081 -72108 40987 72069 23753 -1764 34343
6932C4343N808n8327n4519N2006L6937r219j6245j57N0633Q134j9931O9176O9369
$$ 34343 40151 -18176 -72695 -20689 16248 7029 -9216 -9373 41260 49394 29463 98639 168008
6919A68008l9087l859k8260m4114N696j2505n8757k3578n3102n8081L7863J21217
$$ 168008 128921 125062 96802 52688 58384 45879 -12878 -36456 -89558 -147639 -109776 11441
6907A1441M7446m2707K3726j697k6118j3492J4309k7970j4817k4062o4058j1080
$$ 11441 58887 16180 39906 38209 12091 -1401 12908 -15062 -29879 -53941 -117999 -129079
6895a29079R3390L4545j0521J8066j9538r896J2626M9007M6328j4157n1715m6101
$$ -129079 -35689 -1144 -11665 6401 -13137 -23033 -10407 38600 84928 70771 19056 -27045
6883b7045K0206K3040n9411P017J5780J7748l7059J7950K3309j7756q607m6316
$$ -27045 -6839 16201 -43210 -36193 -20413 -2665 -39724 -21774 1535 -16221 -24828 -71144
6871g1144J0412J6390k6686j0533M9832q001N334n239J4452P244k254R329l165
$$ -71144 -60732 -44342 -71028 -81561 -31729 -39730 -34396 -39635 -25183 -17939 -20193 -10864 -14029
6858a4029K014q060J4468o8620k4477K0988O9672K5540L0669K290o5526k8927
$$ -14029 -12015 -20075 -5607 -74227 -98704 -77716 -8044 17496 48165 50455 -15071 -43998
6846d3998q054l699M9843O121L0552M3256R196J9464m5655j5932l738j3342k9666
$$ -43998 -52052 -55751 -5908 213 30765 74021 83217 102681 57026 41094 37356 24014 -5652
6833e652R390Q07j7218J861K6765k6175Q211L7164n8333o1389k486P584L6542
$$ -5652 3738 4545 -12673 -10812 15953 -10222 -2011 35153 -23180 -84569 -87055 -79471 -42929
6820d2929R949J6162l0767J1602L6873J1324n0651o1272l3423o354L8264L0753
$$ -42929 -32980 -16818 -47585 -35983 890 12214 -38437 -99709 -133132 -139486 -101222 -70469
6808g0469J8224j0371m7253P50N4131L4027K0909J1886p830m0362M2872J4561
$$ -70469 -52245 -62616 -109869 -109119 -54988 -20961 -52 11834 4004 -36358 6514 21075
6796B1075M3401L3027j4524o7607j5669j8907m6536L4156L2581L3935L9148j0986
$$ 21075 64476 97503 82979 15372 -297 -19204 -65740 -31584 997 34932 74080 63094
6784F3094K6869L3446q5082m2972k7702P383J8571k3296n42j9196n842k2183l8300
$$ 63094 89963 123409 38327 -4645 -32347 -24964 -6393 -29689 -30231 -49427 -55269 -77452 -115752
6771a15752J4660J9095k2275Q152O7700J4208k0023K1785M1375n4070n3192J2963
$$ -115752 -101092 -81997 -104272 -96120 -28420 -14212 -34235 -12450 28925 -25145 -78337 -65374
6759f5374K8326M5331M5720j8211k2594k6834j1575O659k644K7070K1766j160
$$ -65374 -37048 8283 54003 35792 13198 -13636 -25211 -18552 -21196 5874 27640 26480
6747B6480m5390l3438L335N8060M1242j0831o9842j1917K6350l5532N9035L4050
$$ 26480 -18910 -52348 -49013 9047 50289 39458 -30384 -42301 -15951 -51483 7552 41602
6735D1602j9344Q551L9583k0267K339J1770p8081k7279J8804N0531J3099l8818
$$ 41602 22258 30809 70392 50125 52464 64234 -13847 -41126 -22322 28209 41308 2490
6723B490q154K0167L3998N7205m9584J330l9835j3110j4716K2258N1968j4306
$$ 2490 -5664 14503 48501 105706 56122 57452 17617 4507 -10209 12049 64017 49711
6711D9711j0032j6928m036L2101j0701J3587n759p5894n7264O74J6306J3932k906
$$ 49711 39679 22751 18715 50816 40115 53702 47943 -27951 -85215 -84541 -68235 -54303 -57209
6698e7209P6560J4636J6321N9866m165J87l3244k8089r885J4161l6235K6295M2530
$$ -57209 19351 33987 50308 110174 106009 106196 72952 44863 34978 49139 12904 39199 81729
6685H1729K8218j3608q737N672m3429j1954O363j40n7753m6377R501J0719l6950
$$ 81729 109947 96339 87602 93274 49845 37891 44254 44114 -13639 -60016 -50515 -39796 -76746
6672g6746j6693M2235m900O181q072K1854O904l875m0003k8266L7741J7593m142
$$ -76746 -93439 -51204 -56104 -49923 -57995 -36141 -29237 -33112 -73115 -101381 -63640 -46047 -50189
6659e0189k3445J1732q0K6096L8068r131n4151j5713K0908N2685l644k3052l8747
$$ -50189 -73634 -61902 -61982 -35886 2182 -6949 -61100 -76813 -55905 -3220 -6864 -29916 -68663
6646f8663K404j1860N388K0578J6795Q050J2J6319j4715m1662L1577k3098K1840
$$ -68663 -66259 -78119 -72731 -52153 -35358 -27308 -27296 -10977 -25692 -67354 -35777 -58875 -37035
6633c7035J3957l3252l793M9996J2556j843P910k8723r153k6710K2428K0389m4956
$$ -37035 -23078 -56330 -60123 -10127 2429 586 8496 -20227 -29380 -56090 -33662 -13273 -58229
6620e8229O1085R4852M7922k4190k7843j6019k7557o945l3779J7716O602k7433
$$ -58229 2856 97708 145630 121440 93597 77578 50021 43076 9297 27013 33615 6182
6608F182m0320p881R093l9869L6324k7288l9981J150M7012L9229M6719L6988j979
$$ 6182 -34138 -42019 -32926 -72795 -36471 -63759 -103740 -102590 -55578 -16349 30370 67358 65379
6595F5379q087r0798l0460J2536k9857o6550l936L6072K1432N031L2696n984L027
$$ 65379 57292 -33506 -63966 -51430 -81287 -147837 -151773 -115701 -94269 -89238 -56542 -62526 -59499
6582e9499Q608j6553J3813l0238N679L5176M4772k1248l4512K9405k7953k19l121
$$ -59499 -50891 -67444 -53631 -83869 -78190 -43014 1758 -19490 -54002 -24597 -52550 -52769 -55890
6569e5890J9214n877j2983j0432n244l5757k2323L3985M5756j3928L0850P7112
$$ -55890 -36676 -42553 -55536 -65968 -71212 -106969 -129292 -95307 -49551 -63479 -32629 44483
6557D4483R092l4237l1423l2090j3265N036P454k1891J9231j7131k4859M8436
$$ 44483 53575 19338 -12085 -44175 -57440 -52404 -44950 -66841 -47610 -64741 -89600 -41164
6545d1164Q358K9158q9k857M5922L1665J5396l7438l1409k4106k2012J7310K0287
$$ -41164 -32806 -3648 -3737 -6594 39328 70993 86389 48951 17542 -6564 -28576 -11266 9021
6532I021L085k5068j7430k483m99O194J6249Q310m5973k94N1713O3493k1551l5554
$$ 9021 12106 -12962 -30392 -32875 -33374 -27180 -10931 -2621 -48594 -48888 2825 66318 44767 9213
6518I213k4534l2860k5847J9706K0157M178n1663K2660N0003M738m2387J4724
$$ 9213 -15321 -48181 -74028 -54322 -34165 -29987 -81650 -58990 -8987 -4249 -46636 -31912
6506c1912M5029K6230r523R170N718k9113K866O3909K4708k6816p7422k8780k2489
$$ -31912 13117 39347 29824 38994 44712 15599 18465 82374 107082 80266 2844 -25936 -48425
6493d8425J1018q504J5530N6047K0973k8951p5971J2669M4709L2187l7755l3434
$$ -48425 -37407 -45911 -30381 25666 46639 17688 -58283 -45614 -905 31282 -6473 -39907
6481c9907k5822K3350O6459L8961L7271N1571O532n3207m5850O049K2422k295
$$ -39907 -65729 -42379 24080 63041 100312 151883 158415 105208 59358 65407 87829 85534
6469H5534n5777m0635O690L0244o4489l8346J7920k8919N6P8207L7938l6316p2544
$$ 85534 29757 -10878 -4188 26056 -38433 -76779 -58859 -87778 -87722 -9515 28423 -7893 -80437
6456h0437r057K4085K315m515K1290L3689K8677M1902O262p4263L677L4807n2020
$$ -80437 -89494 -65409 -63094 -67609 -46319 -12630 16047 57949 64211 -10052 -6375 28432 -23588
6443b3588p3192L451l150L2472Q0981K8793L3095k7417o1682N431K4635K3289
$$ -23588 -96780 -93329 -96479 -64007 16974 45767 78862 51445 -10237 -4806 19829 43118
6431D3118J4532J4436m2642M4269J9933m0756k0691l713k2906J7784M9172j458
$$ 43118 57650 72086 29444 73713 93646 52890 32199 28486 5580 23364 72536 71078
6419G1078m901K019N396O082k4473J0474j8515J6914p482m592m4416p6978j592
$$ 71078 66177 68196 73592 79674 55201 65675 47160 64074 56592 52000 7584 -69394 -70986
6406g0986k1781L8131O8322O7333o058l2251o397K245k2852l0928j6732o702P924
$$ -70986 -92767 -54636 13686 81019 74961 42710 36313 38558 15706 -15222 -31954 -38656 -30732
6393c0732J8718N1712M2532K7377j773m5149m5455r642q157m8412j2785q947J7989
$$ -30732 -12014 39698 82230 109607 107834 62685 17230 7588 -569 -48981 -61766 -70713 -52724
6380e2724J3075K3087J3918l8277j902m9506J3832L7421q634j4432o824N9546
$$ -52724 -39649 -16562 -2644 -40921 -42823 -92329 -78497 -41076 -49710 -64142 -70966 -11420
6368a1420j3418n6029l2832k858M9664O5382M9368m5814p0570m4048J0267K6548
$$ -11420 -24838 -80867 -113699 -116557 -66893 -1511 47857 2043 -68527 -112575 -102308 -75760
6356g5760J1209K6313J12292L4016k1723L583j1506l8482p7119M6454p422l1482
$$ -75760 -64551 -38238 74054 108070 86347 89930 78424 39942 -37177 9277 1855 -29627
6344b9627l0799l7055Q2851Q5222l9893m9610l6395k6227O1560J8852j2600L597
$$ -29627 -60426 -97481 -14630 70592 30699 -18911 -55306 -81533 -19973 -1121 -13721 -10124
6332a0124K7666N9206j6724l6193n2910K15K4349L5096O6218m6763o3719j253
$$ -10124 17542 76748 60024 23831 -29079 -28864 -4515 30581 96799 50036 -13683 -14936
6320a4936l7227J3329M3386K1853K6687J6152o458L9974J5299R576l9189m3174
$$ -14936 -52163 -38834 4552 26405 53092 69244 62786 102760 118059 127635 88446 45272
6308D5272m5970n253J1081K5392n9881p1635O443Q562o7383m912M3066M6876K5601
$$ 45272 -698 -5951 5130 30522 -29359 -100994 -94551 -85989 -153372 -158284 -115218 -68342 -42741
6295d2741M797J6763k024l3097N912L78Q733N282R12n1891L660o3296k224L4060
$$ -42741 -37944 -21181 -23205 -56302 -50390 -50012 -41279 -35997 -35085 -86976 -83316 -146612 -148836 -114776
6281a14776J4228M911M5463J978K8043n2549p7746j8561K3369L3010q991M144
$$ -114776 -100548 -95637 -50174 -48196 -20153 -72702 -150448 -169009 -145640 -112630 -121621 -117477
6269a17477j5449L3190N2193N4500L0404R727N31j4320k7662M7298L375o7209
$$ -117477 -132926 -99736 -47543 6957 37361 47088 47619 33299 5637 52935 56310 -10899
6257a0899l6696M5526J9900k2421M595m6268r870M6543O7103q565n0342l2398
$$ -10899 -47595 -2069 17831 -4590 5 -46263 -56133 -9590 57513 48948 -1394 -33792
6245c3792j777J2360K240l6815j5520j272J7491J214K6264P0776j4754l7689o552
$$ -33792 -35569 -23209 -20969 -57784 -73304 -74576 -57085 -55871 -29607 41169 26415 -11274 -17826
6232a7826m1650J7184k243K0086L5214j8168p1771j1571O935k928J3193M9106
$$ -17826 -59476 -42292 -44535 -24449 10765 -7403 -79174 -90745 -83810 -86738 -73545 -24439
6220b4439Q817M373K3541J7591l3062k1590n3639n875M3345L8896k8469q789J7331
$$ -24439 -15622 -11249 12292 29883 -3179 -24769 -78408 -84283 -40938 -2042 -30511 -39300 -21969
6207b1969L4464L6255n5091Q188K443N110L0180N3196j7934n9359k0776k3956
$$ -21969 12495 48750 -6341 1847 4290 9400 39580 92776 74842 15483 -5293 -29249
6195b9249n014L6223j0736n1725K9204j7034K0140K3272J4657l0048r578M703
$$ -29249 -34263 1960 -8776 -60501 -31297 -48331 -28191 -4919 9738 -20310 -29888 -25185
6183b5185L3969J2124k353L4820K2164m819L9526m4177l1245J3039K6891j5743
$$ -25185 8784 20908 18555 53375 75539 70720 110246 66069 34824 47863 74754 59011
6171E9011J6604N1406J8104m4521o1822l7009K2038L2762l5147J9837K3048N3878
$$ 59011 75615 127021 145125 100604 38782 1773 23811 56573 21426 41263 64311 118189
6159A18189j0672K3541q6351p2630L395j0390J4950l630m0379n0675P3345J5167
$$ 118189 107517 131058 44707 -27923 -24528 -34918 -19968 -23598 -63977 -114652 -41307 -26140
6147b6140m4393M44J9849J6437M0068K0185k1142j8194k9515N791J8416m8883
$$ -26140 -70533 -70089 -50240 -33803 6265 26450 5308 -12886 -42401 -36610 -18194 -67077
6135f7077L3171J0906K9762L3843n673L8044O406J289l0674m3226l7610O95q166
$$ -67077 -33906 -23000 6762 40605 34932 72976 79382 80671 49997 6771 -30839 -30144 -38310
6122c8310J0747R609J3151k2935n6123K4349M9952J4080n037K4950q210j3581
$$ -38310 -27563 -17954 -4803 -27738 -83861 -59512 -9560 4520 -517 24433 16223 2642
6110B642m17j2254j5854n8260L338P5487O5673m7608l012P1363j8313m274o3140
$$ 2642 2225 -10029 -25883 -84143 -80805 -5318 60355 12747 9735 81098 62785 58511 -4629
6097d629l4577k146K9676o8066j3521L7308M4387k0961k3296k2904n210l8938
$$ -4629 -39206 -41352 -11676 -79742 -93263 -55955 -11568 -32529 -55825 -78729 -83939 -122877
6085a22877p630K8432k799K2549N1199k936j0283O7352L3452l5371Q006J8331
$$ -122877 -130507 -102075 -104874 -82325 -31126 -34062 -44345 23007 56459 21088 29094 47425
6073D7425q815j7535J867m8869p2215N47J0950j4148J0632k545L212O020L4155
$$ 47425 38610 21075 22942 -25927 -98142 -97595 -86645 -100793 -90161 -92706 -89494 -83474 -49319
6060d9319L1671m2464j9746j5533n6790L8733O7258M5649Q499n0374k6661N196
$$ -49319 -17648 -60112 -79858 -95391 -152181 -113448 -46190 -541 7958 -42416 -69077 -63881
6048f3881l5754k3608L4695j5082L3154J1536j2922k3734J2518K2211K0202q324
$$ -63881 -99635 -123243 -88548 -103630 -70476 -58940 -71862 -95596 -83078 -60867 -40665 -48989
6036d8989l61P515M0686j219j1806n1787j0317k5484k8225j7814R0504r170p4079
$$ -48989 -49350 -41835 -1149 -2368 -14174 -65961 -76278 -101762 -129987 -147801 -57297 -66467 -140546
6023a40546L6436K6028L0426K005j1035K433L691O4433M2648l4391q0048m2136
$$ -140546 -104110 -78082 -47656 -45651 -56686 -54253 -50562 13871 56519 22128 -57920 -100056
6011a00056Q881M027k4446J3181R943N0447J8677j9980j1024J709M856L874J0310
$$ -100056 -91175 -87148 -111594 -98413 -88470 -38023 -19346 -39326 -50350 -48641 -43785 -39911 -29601
5998b9601m7537o553L1809J1374K7558l5618k6386j472o16N9350J4276j0558J9446
$$ -29601 -77138 -83691 -51882 -40508 -12950 -48568 -74954 -76426 -77042 -17692 -3416 -13974 5472
5985E472k9487p2316J1695J0687M5848R578J5707K5595L8583L021j7631k7293
$$ 5472 -24015 -96331 -84636 -73949 -28101 -18523 -2816 22779 61362 64383 46752 19459
5973A9459K085L0755n134O616n0868m22J0918k7880K6281M3533j891k8944q09
$$ 19459 21544 52299 47165 53781 2913 2491 13409 -14471 11810 55343 53452 24508 23699
5960B3699m4397m1380K9640M1382N0000m0116K0740k3735r092j4266N3789J3833
$$ 23699 -20698 -62078 -32438 8944 58944 18828 39568 15833 6741 -7525 46264 60097
5948F0097m7797l3148j0844m820N387P114R566n5640m2555J0430L0544o345m9116
$$ 60097 12300 -20848 -31692 -36512 -31125 -24011 -14445 -70085 -112640 -102210 -71666 -78011 -127127
5935a27127l652O0191J9212O064L326K5989L8877j8679k1349K5866j6280J832
$$ -127127 -130779 -70588 -51376 -45312 -41986 -15997 22880 4201 -17148 8718 -7562 -5730
5923e730Jl1682k8650J6935J2901J438J1449J1530J5222m2308k2873l0965J0524
$$ -5730 -5729 -37411 -66061 -49126 -36225 -34787 -23338 -11808 3414 -38894 -61767 -92732 -82208
5910h2208O3857M1849J1457m3366l1045M3081j3090o389K147q0066l8395P236
$$ -82208 -18351 23498 34955 -8411 -39456 3625 -9465 -15854 -13707 -93773 -132168 -124932
5898a24932K8444M5667L1974l990J0481N625k9731p0264o5954M7727L946n5946
$$ -124932 -96488 -50821 -18847 -22837 -12356 -6731 -36462 -106726 -172680 -124953 -121007 -176953
5886a76953l539K8686l0802M3521R6795L9695K0208J1004j8100J3130J316k8125
$$ -176953 -180492 -151806 -182608 -139087 -42292 -2597 17611 28615 10515 23645 24961 -3164
5874c164m4006k8300J7428p362L3820j3756M6420L7780j5508o9650N012j021q242
$$ -3164 -47170 -75470 -58042 -65404 -31584 -45340 1080 38860 23352 -46298 -41286 -42307 -50549
5861e0549O718L738L60L995Q0095K6653j7806K3149k1752n2726P673J3936J8929
$$ -50549 -43831 -40093 -39733 -35738 44357 71010 53204 76353 54601 1875 9548 23484 42413
5848D2413L6404j22n9239p7794j2497k3321K5458R3993N7192K8532m8308m6700
$$ 42413 78817 78695 19456 -58338 -70835 -94156 -68698 25295 82487 111019 62711 16011
5836A6011l1450J5202M0625J4262K2375k7872m0533q608O1911J2770j6973k552
$$ 16011 -15439 -237 40388 54650 77025 49153 8620 12 61923 74693 57720 55168
5824E5168k1908n3620m3650N532L9130j8445O2830M5525J9780L903l3231j4985
$$ 55168 33260 -20360 -64010 -58478 -19348 -37793 25037 70562 90342 94245 61014 46029
5812D6029k6817m1162k9973k9122O56O2685J5382l4480k8811l4838m3466L2390
$$ 46029 19212 -21950 -51923 -81045 -80389 -17704 -2322 -36802 -65613 -100451 -143917 -111527
5800a11527K2616Q062L1093M9169J011l1259K716J5037j1769k5515O1628J9767
$$ -111527 -88911 -80849 -49756 -587 424 -30835 -28119 -13082 -24851 -50366 11262 31029
5788C1029m1491L2249J3040l7927p746j0688p150j7274k5511M3657J3449M555
$$ 31029 -10462 21787 34827 -3100 -10846 -21534 -28684 -45958 -71469 -27812 -14363 -9808
5776i808K4113o826l4653J7494N6135J2020o472m4327n868n6909r212k2430L0727
$$ -9808 14305 7479 -27174 -9680 46455 58475 52003 7676 1808 -55101 -64313 -86743 -56016
5763e6016M8815J2870q77N40Q014L849l5278l4221r405J910N1178K1871j9822
$$ -56016 -7201 5669 4792 5332 13346 17195 -18083 -52304 -61709 -59799 -8621 13250 -6572
5750f572J311J3747K5318J9305m6912l9328O0374L5509n9604l9853J5712J2364
$$ -6572 -5261 8486 33804 53109 6197 -33131 27243 62752 3148 -36705 -20993 -8629
5738h629q066P781K6556N892l2157k1698J3371n4522n07P264j3144n0877O7333
$$ -8629 -16695 -8914 17642 23534 -8623 -30321 -16950 -71472 -71979 -64715 -77859 -128736 -61403
5725f1403P2086N0040j749p2678k9208J8852L9611q948m4902m7194M1719O1622
$$ -61403 10683 60723 58974 -13704 -42912 -24060 15551 6603 -38299 -85493 -43774 17848
5713A7848Q075O255M8616K0805o6434n3457n2820p684J6686L4570J4202N0705
$$ 17848 25923 32178 80794 101599 35165 -18292 -71112 -78796 -62110 -27540 -13338 37367
5701C7367q1071o1475k6282n6580L4816L0168P0145J2448j0810M4182O849m6915
$$ 37367 -43704 -105179 -131461 -188041 -153225 -123057 -52912 -40464 -51274 -7092 -243 -47158
5689d7158j4631L2950K0193k6153k649R666K8792K3731l9835m175j8093J5836
$$ -47158 -61789 -28839 -8646 -34799 -37448 -27782 1010 24741 -15094 -19269 -37362 -21526
5677b1526l211M0063k5291m5558O061M5901L9534J967q553j347M7978J491j6745
$$ -21526 -24737 15326 -9965 -55523 -49462 -3561 35973 37940 29387 28040 76018 77509 60764
5664F0764J756n3273p4006J6315J4708p829J9036O493m7108Q668N211k395J8206
$$ 60764 62520 9247 -64759 -48444 -33736 -41565 -22529 -16036 -63144 -54476 -49265 -51660 -33454
5651c3454J920j2387j3427L5867n377P712J4564M8148m010j2461l2610M3419O5802
$$ -33454 -31534 -43921 -57348 -21481 -26858 -19146 -4582 43566 39556 27095 -5515 37904 103706
5638A03706j2124k8501q1346K118J1112k0179k6114P7698M9241j6202l6944R673
$$ 103706 91582 63081 -18265 -16147 -5035 -25214 -51328 26370 75611 59409 22465 32138
5626C2138o047o3144l692N6913K40j0357k5398L1785M0365p217J5211L8100j8977
$$ 32138 26091 -37053 -40745 16168 16408 6051 -19347 12438 52803 45586 60797 98897 79920
5613G9920o1919l9912j04666j4177M8075L6016j5933L4341L3553J233M945n53
$$ 79920 18001 -21911 -126577 -140754 -92679 -56663 -72596 -38255 -4702 -3469 1476 923
5601I23K7090J2096k2077j5247L584l1698L0037N4739J3443q2966m8993N760K6936
$$ 923 28013 40109 18032 2785 6369 -25329 4708 59447 72890 -10076 -59069 -53309 -26373
5588b6373K8087J8614m7408o071J6626k366o817l4613J3771l7783Q219O1876M362
$$ -26373 1714 20328 -27080 -33151 -16525 -18891 -25708 -60321 -46550 -84333 -76114 -14238 -9876
5575i876k054Q271K6674k7582q17o5214N1449P4234p9302l8177L2647L7243Q451
$$ -9876 -11930 -3659 23015 -4567 -5384 -70598 -19149 55085 -24217 -62394 -29747 7496 15947
5562A5947k2747K4041L297j0806j3782l8589q5525o0922M4385N0972K1960L2156
$$ 15947 -6800 17241 20538 9732 -4050 -42639 -128164 -189086 -144701 -93729 -71769 -39613
5550c9613m7550J24N9343Q5385k0622p0269k4014J3087K0951P593J1534J9912
$$ -39613 -87163 -87039 -27696 57689 37067 -33202 -57216 -44129 -23178 -15585 -4051 15861
5538A5861L8436p3929j7546K3796r434j7050N360o4738l3867J353Q449N7485o543
$$ 15861 54297 -19632 -37178 -13382 -22816 -39866 -34506 -99244 -133111 -131758 -123309 -65824 -72367
5525g2367k256j4100n487J4445K2306J611j077j4507K7589j076O5498P026k4446
$$ -72367 -74623 -88723 -94210 -79765 -57459 -55848 -56925 -71432 -43843 -44919 20579 27605 3159
5512C159K6245J7188O364K8109o7504n9784K8481K7829r069K850Q487J0657O115
$$ 3159 29404 46592 52956 81065 13561 -46223 -17742 10087 1018 3868 12355 23012 29127
5499B9127J6900p555J274K5646M1291J9243p8407n4993L5171q008r591l6128o6572
$$ 29127 46027 38472 39746 65392 106683 125926 47519 -7474 27697 19689 10098 -26030 -92602
5486i2602j2416M9520Q419O2510L7540j0203j3229q898O3790K6302m917p4386
$$ -92602 -105018 -55498 -47079 15431 52971 42768 29539 20641 84431 110733 105816 31430
5474C1430j7109m7093O921L3579m7105M4337M5584L5178n1615k5689k2609J4714
$$ 31430 14321 -32772 -25851 7728 -39377 4960 50544 85722 34107 8418 -14191 523
5462E23J5130k792k4098N988L4690J9396m2563J4222j9715j7467N7989K0167j7599
$$ 523 15653 12861 -11237 -5249 29441 48837 6274 20496 781 -16686 41303 61470 43871
5449D3871r389j6460J6232m5017j2782P1344N1002n95l7741n5691p637K4284J5811
$$ 43871 34482 18022 34254 -10763 -23545 47799 98801 98206 60465 4774 -2863 21421 37232
5436C7232o0351j1871K9519K919j8667k8449K1960j3902m0830K2944O4823L1629
$$ 37232 -23119 -34990 -5471 -2552 -21219 -49668 -27708 -41610 -82440 -59496 5327 36956
5424C6956l2264n8727K799K3407r831K7135j6479o758k175L8353l6686K3539K1339
$$ 36956 4692 -54035 -51236 -27829 -37660 -10525 -27004 -33762 -35937 2416 -34270 -10731 10608
5411A0608m4479n7653M364K0474k4737J3216N6693m745K1543L0793o7l0999L0205
$$ 10608 -33871 -91524 -87160 -66686 -91423 -78207 -21514 -26259 -4716 26077 26010 -4989 25216
$$ [...]
##END NTUPLES=NMR SPECTRUM
##END=
