##TITLE=Analysis number 327679
Compound Code cc 60501
Book Reference 494/146
Project Code adrs
Chemist Name craigr
##JCAMPDX= 6.0         $$ Bruker NMR JCAMP-DX V2.0
##DATA TYPE= NMR SPECTRUM
##DATA CLASS= NTUPLES
##ORIGIN= Bruker BioSpin GmbH
##OWNER= nmr
$$ XWIN-NMR		Version 3.5
$$ Fri Mar 30 11:56:30 2007 GMT Daylight Time (UT+1h)  MAYBRIDGE\nmr@NMR_250MHZ
##.OBSERVE FREQUENCY= 250.131544655141
##.OBSERVE NUCLEUS= ^1H
##.ACQUISITION MODE= SIMULTANEOUS (DQD)
##.ACQUISITION SCHEME= undefined
##.AVERAGES= 16
##.DIGITISER RES= 18
##SPECTROMETER/DATA SYSTEM= dpx250
##.PULSE SEQUENCE= zg30
##.SOLVENT NAME= DMSO
##.SHIFT REFERENCE= (INTERNAL, DMSO, 0, 16.522)
##AUDIT TRAIL= $$ (NUMBER, WHEN, WHO, WHERE, WHAT)
$$ ##TITLE= Audit trail, XWIN-NMR		Version 3.5
$$ ##JCAMPDX= 5.01
$$ ##ORIGIN= Bruker BioSpin GmbH
$$ ##OWNER= nmr
$$ C:\u/data/dgb/nmr/ADRS/2750/pdata/1/auditp.txt
$$ ##AUDIT TRAIL=  $$ (NUMBER, WHEN, WHO, WHERE, WHAT)
(   1,<2007-03-30 11:56:00.07 +100>,<MAYBRIDGE\nmr>,<NMR_250MHZ>,
      <created by zg, POWCHK disabled, PULCHK disabled
       configuration hash MD5:
       49 4B E0 1D 92 C2 6B 37 9F E6 65 BC 52 41 86 1D
       data hash MD5: 64K
       C9 50 E8 6F 4B 2C 81 E3 0A E6 50 FA 91 A9 DF 2A>)
(   2,<2007-03-30 11:56:18.48 +100>,<MAYBRIDGE\nmr>,<NMR_250MHZ>,
      <Start of raw data processing
       ef LB = 0.3 FT_mod = 6 PKNL = 1 SI = 32K 
       data hash MD5: 32K
       F1 D0 A2 9E EE 94 BD 89 41 54 F8 F2 A0 99 BF 45>)
(   3,<2007-03-30 11:56:20.36 +100>,<MAYBRIDGE\nmr>,<NMR_250MHZ>,
      <apk 
       data hash MD5: 32K
       7B 21 1B AE B7 B7 83 C4 DD 3B 2B 71 FC 72 FB 7E>)
(   4,<2007-03-30 11:56:21.11 +100>,<MAYBRIDGE\nmr>,<NMR_250MHZ>,
      <abs ABSG = 5 
       data hash MD5: 32K
       E8 F9 D6 11 94 F9 16 2B F0 B5 0E 87 CD FF 75 D2>)
$$ ##END=
$$ 
$$ hash MD5
$$ 29 32 9D 5F 93 E8 63 13 FB D2 E9 2D 86 20 91 4A
##$RELAX= 
##$RELAX= 
##$RELAX= 
##$RELAX= 
##$RELAX= 
##$RELAX= 
##$RELAX= 
$$ Bruker specific parameters
$$ --------------------------
##$DU= <C:\u>
##$EXPNO= 2750
##$NAME= <ADRS>
##$PROCNO= 1
##$TYPE= <nmr>
##$USER= <dgb>
##$AMP= (0..31)
100 100 100 100 100 100 100 100 100 100 100 100 100 100 100 100 100 100 
100 100 100 100 100 100 100 100 100 100 100 100 100 100 
##$AQSEQ= 0
##$AQ_mod= 3
##$AUNM= <au_zg>
##$AUTOPOS= <6 >
##$BF1= 250.13
##$BF2= 250.13
##$BF3= 250.13
##$BF4= 250.13
##$BF5= 500.13
##$BF6= 500.13
##$BF7= 500.13
##$BF8= 500.13
##$BYTORDA= 1
##$CFDGTYP= 0
##$CFRGTYP= 5
##$CHEMSTR= <none>
##$CNST= (0..31)
1 1 145 1 1 1 1 1 1 1 1 1 1 1 1 1 1 1 1 1 1 1 1 1 1 1 1 1 1 1 1 1 
##$CPDPRG= <>
##$CPDPRG1= <>
##$CPDPRG2= <>
##$CPDPRG3= <>
##$CPDPRG4= <mlev>
##$CPDPRG5= <mlev>
##$CPDPRG6= <mlev>
##$CPDPRG7= <mlev>
##$CPDPRG8= <mlev>
##$CPDPRGB= <>
##$CPDPRGT= <>
##$D= (0..31)
0 1 0 0 0 0 0 0 0 0.06 0 0 0 0 0 0 0.0002 0 0 0 0 0 0 0 0 0 0 0 0 0 0 
0 
##$DATE= 1175252159
##$DBL= (0..7)
120 120 120 120 120 120 120 120 
##$DBP= (0..7)
150 150 150 150 150 150 150 150 
##$DBP07= 0
##$DBPNAM0= <>
##$DBPNAM1= <>
$$ [...]
##$SUBNAM6= <"">
##$SUBNAM7= <"">
##$SUBNAM8= <"">
##$SUBNAM9= <"">
##$SW= 20.6930455092707
##$SWIBOX= (0..15)
0 0 3 0 0 0 0 0 0 0 0 0 0 0 0 0 
##$SW_h= 5175.983436853
##$TD= 65536
##$TD0= 1
##$TE= 683.16
##$TE2= 300
##$TE3= 300
##$TEG= 300
##$TL= (0..7)
0 120 120 120 120 120 120 120 
##$TP= (0..7)
150 150 150 150 150 150 150 150 
##$TP07= 0
##$TPNAME0= <>
##$TPNAME1= <>
##$TPNAME2= <>
##$TPNAME3= <>
##$TPNAME4= <>
##$TPNAME5= <>
##$TPNAME6= <>
##$TPNAME7= <>
##$TPOAL= (0..7)
0.5 0.5 0.5 0.5 0.5 0.5 0.5 0.5 
##$TPOFFS= (0..7)
0 0 0 0 0 0 0 0 
##$TUNHIN= 0
##$TUNHOUT= 0
##$TUNXOUT= 0
##$USERA1= <user>
##$USERA2= <user>
##$USERA3= <user>
##$USERA4= <user>
##$USERA5= <user>
##$V9= 5
##$VALIST= <valist>
##$VCLIST= <CCCCCCCCCCCCCCC>
##$VD= 0
##$VDLIST= <DDDDDDDDDDDDDDD>
##$VPLIST= <PPPPPPPPPPPPPPP>
##$VTLIST= <TTTTTTTTTTTTTTT>
##$WBST= 1024
##$WBSW= 4
##$XGAIN= (0..3)
0 0 0 0 
##$XL= 0
##$YL= 0
##$YMAX_a= 281322
##$YMIN_a= -384163
##$ZGOPTNS= <>
##$ZL1= 120
##$ZL2= 120
##$ZL3= 120
##$ZL4= 120
##$ABSF1= 16.522
##$ABSF2= -4.171173
##$ABSG= 5
##$ABSL= 3
##$ALPHA= 0
##$AQORDER= 0
##$ASSFAC= 0
##$ASSFACI= 0
##$ASSFACX= 0
##$ASSWID= 0
##$AUNMP= <proc_1d>
##$AZFE= 0.1
##$AZFW= 0.1
##$BCFW= 0
##$BC_mod= 0
##$BYTORDP= 0
##$COROFFS= 0
##$CY= 12.5
##$DATMOD= 1
##$DC= 0
##$DFILT= <>
##$DTYPP= 0
##$F1P= 14.0000005364418
##$F2P= -0.99999901652339
##$FCOR= 0.5
##$FTSIZE= 32768
##$FT_mod= 6
##$GAMMA= 0
##$GB= 0
##$INTBC= 1
##$INTSCL= 1
##$ISEN= 128
##$LB= 0.3
##$LEV0= 0
##$LPBIN= 0
##$MAXI= 10000
##$MC2= 0
##$MEAN= 0
##$ME_mod= 0
##$MI= 0
##$NCOEF= 0
##$NC_proc= -3
##$NLEV= 6
##$NOISF1= 0
##$NOISF2= 0
##$NSP= 0
##$NTH_PI= 0
##$NZP= 0
##$OFFSET= 16.522
##$PC= 1
##$PHC0= 222.7549
##$PHC1= 0
##$PH_mod= 1
##$PKNL= yes
##$PPARMOD= 0
##$PSCAL= 4
##$PSIGN= 0
##$REVERSE= no
##$SF= 250.13
##$SI= 32768
##$SIGF1= 0
##$SIGF2= 0
##$SINO= 400
##$SIOLD= 32768
##$SREGLST= <1H.DMSO>
##$SSB= 0
##$STSI= 32768
##$STSR= 0
##$SW_p= 5175.98343685301
##$SYMM= 0
##$S_DEV= 0
##$TDeff= 65536
##$TDoff= 0
##$TI= <Analysis number 999999
Compound Code 99
Book Reference 9
Project Code 9>
##$TILT= no
##$TM1= 0
##$TM2= 0
##$TOPLEV= 0
##$USERP1= <user>
##$USERP2= <user>
##$USERP3= <user>
##$USERP4= <user>
##$USERP5= <user>
##$WDW= 1
##$XDIM= 32768
##$YMAX_p= 336357449
##$YMIN_p= -108786
$$ End of Bruker specific parameters
$$ ---------------------------------
##NTUPLES= NMR SPECTRUM
##VAR_NAME=  FREQUENCY,     SPECTRUM/REAL,   SPECTRUM/IMAG
##SYMBOL=    X,             R,               I
##VAR_TYPE=  INDEPENDENT,   DEPENDENT,       DEPENDENT
##VAR_FORM=  AFFN,          ASDF,            ASDF
##VAR_DIM=   32768,         32768,           32768
##UNITS=     HZ,            ARBITRARY UNITS, ARBITRARY UNITS
##FACTOR=    0.157963299565203, 1,           1
##FIRST=     4132.6476996994, 0,             0
##LAST=      -1043.33573715361, 0,           0
##MIN=       -1043.33573715361, -108786,     0
##MAX=       4132.6476996994, 336357449,     0
$$ Real data points
##PAGE= N=1
##DATA TABLE= (X++(R..R)), XYDATA
$$ [...]
$$ plain form
18585 172263 168703 172339 177087 214527 240528 244065 263351 262037 267897 280978 241445 228738 229886
18572 229886 228377 228967 205360 200292 194181 212009 225724 240577 249520 240769 238653 262844 267701
18559 267701 265555 274241 268984 303979 313619 293403 308701 318232 308147 326245 343463 349444 394506
18546 394506 428480 475061 513922 526513 519784 552944 601579 662270 698123 705910 719330 744060
18534 744060 788021 849071 965052 1053767 1108644 1147446 1246071 1370936 1434589 1498434 1539335
18523 1539335 1628048 1788955 1966305 2126370 2248659 2396746 2612333 2965813 3497378 4239322
18513 4239322 5329278 6943326 9442019 13499125 20413840 31702317 47195714 61240254
18505 61240254 62131365 47599841 31546422 21759258 16957277 15083656 15322531 17764580
$$ packed form
18585A72263l560L636M748L7440K6001L537J9286j314N860J3081l9533j2707J148
18572B29886j509N90k3607n068o111J7828J3715J4853Q943q751k116K4191M857
18559B67701k146Q686n257L4995R640k0216J5298R531j0085J8098J7218N981M5062
18546C94506L3974M6581L8861J2591o729L3160M8635O0691L5853P787J3420K4730
18534G44060M3961O1050J15981Q8715N4877L8802R8625J24865O3653O3845M0901
18523A539335Q8713J60907J77350J60065J22289J48087K15587L53480N31565P41944
18513D239322J089956J614048K498693M057106O914715J1288477J5493397J4044540
18505F1240254Q91111j4531524j6053419r787164m801981j873621K38875K442049
$$ plain form
18497 17764580 23398925 33708218 48575697 62522617 63741047 48628637 31079313
18490 31079313 19806155 13473735 9806956 7539751 6019430 4968382 4214439 3636243
18482 3636243 3240218 2946751 2780117 2618815 2410524 2148403 1893844 1729498 1605175
18473 1605175 1530732 1528261 1507701 1415971 1307280 1212943 1181568 1161385 1148051 1109138 1069028
18462 1069028 1005398 993621 1017036 1017537 1019134 1000133 951003 912840 889599 845811 821165 785003
18450 785003 720583 655742 619966 597530 601411 619687 613318 598118 574854 546245 494100 439819
18438 439819 406039 364347 331078 334249 325807 302993 288890 274917 246819 237009 219262 199616
18426 199616 195251 188791 177763 176801 157661 141630 108065 107506 118371 128518 125681 95068 71023
$$ packed form
18497A7764580N634345J0309293J4867479J3946920J218430j5112410j7549324
18490C1079313j1273158o332420l666779k267205j520321j051048p53943n78196
18482C636243l96025k93467j66634j61302k08291k62121k54559j64346j24323
18473A605175p4443k471k0560r1730j08691r4337l1375k0183j3334l8913m0110
18462A069028o3630j1777K3415N01J597j9001m9130l8163k3241m3788k4646l6162
18450G85003o4420o4841l5776k2436L881J8276o369j5200k3264k8609n2145n4281
18438D39819l3780m1692l3269L171q442k2814j4103j3973k8098r810j7747j9646
18426A99616m365o460j1028r62j9140j6031l3565n59J0865J0147k837l0613k4045
$$ plain form
18413 71023 61066 86196 94836 93779 121355 122429 104930 88232 111782 86192 44752 10029
18401 10029 28481 42173 68679 82307 65897 35247 38490 47171 26790 12951 27867 11991
18389 11991 359 12657 20590 23691 2602 -15521 -19295 9566 5201 383 17219 35053 33224
18376 33224 13766 9298 28702 37646 57598 63533 30060 -290 -6329 40850 88994 121266
18364 121266 107819 90031 89506 56491 46776 45255 73349 116256 101254 59385 39391 47688
18352 47688 62973 54385 65239 43077 29162 20186 37605 72518 50741 35369 13740 1579
18340 1579 -6274 -15392 -17972 20185 21977 26230 24542 20616 -1701 -19555 12130 18588 21195 12030
18326 12030 -5639 -12206 -25969 -32250 -27055 -7507 -3203 -9028 -12376 -33741 -41614 -51191 -63687
$$ packed form
18413G1023r957K5130Q640j057K7576J074j7499j6698K3550k5590m1440l4723
18401A0029J8452J3692K6506J3628j6410l0650L243Q681k0381j3839J4916j5876
18389A1991j1632J2298P933L101k1089j8123l774K8861m365m818J6836J7834j829
18376C3224j9458m468J9404Q944J9952N935l3473l0350o039M7179M8144L2272
18364A21266j3447j7788n25l3015r715j521K8094M2907j5002m1869j9994Q297
18352D7688J5285q588J0854k2162j3915q976J7419L4913k1777j5372k1629j2161
18340A579p853r118k580L8157J792M253j688l926k2317j7854L1685O458K607r165
18326A2030j7669o567j3763o281N195J9548M304n825l348k1365p873r577j2496
$$ plain form
18313 -63687 -66597 -35858 -18069 -15074 -10902 -6588 -6251 -15794 -21157 -11030 16190 19242 -15663
18300 -15663 -46209 -67691 -59788 -7208 41124 40842 17026 6339 -5352 -28403 -19124 -24103 -23472
18287 -23472 -35478 -8891 23674 15467 12405 9961 17929 43050 52243 53910 47491 45156 38488
18274 38488 22600 11723 -14785 -1807 4277 -16183 -15491 12426 3169 16645 32383 31235 42455
18261 42455 21476 11736 13152 21164 27287 38349 20287 43917 83317 80601 82585 63988 50394
18248 50394 33605 48963 62322 24773 23258 22943 30845 44572 44582 32531 16454 10752 4095
18235 4095 1899 1294 22696 45480 46737 10117 -14791 -12609 -3635 4802 -10623 -11012 15076 28986
18221 28986 8337 -1602 2076 -2347 -2692 4848 1620 14746 621 -20907 -10232 -21243 9660
$$ packed form
18313f3687k910L0739J7789K995M172M314L37r543n363J0127K7220L052l4905
18300a5663l0546k1482P903N2580M8332k82k3816j0687j1691k3051R279m979O31
18287b3472j2006K6587L2565q207l062k444P968K5121R193J667o419k335o668
18274C8488j5888j0877k6508J2978O084k0460O92K7917r257J3476J5738j148J1220
18261D2455k0979r740J416Q012O123J1062j8062K3630L9400k716J984j8597j3594
18248E0394j6789J5358J3359l7549j515l15P902J3727J0j2051j6077n702o657
18235D095k196o05K1402K2784J257l6620k4908K182Q974Q437j5425l89K6088J3910
18221B8986k0649r939L678m423l45P540l228J3126j4125k1528J0675j1011L0903
$$ plain form
18208 9660 22541 25056 25308 7259 28937 48639 60233 86353 112100 111885 132053 138903 157662
18195 157662 162870 134350 103722 67753 34314 23720 47533 35864 38928 45899 38884 44546
18183 44546 25047 10888 12491 2262 -4288 5904 17754 53452 67782 42612 31872 24068
18171 24068 10024 4643 9572 -6696 -1872 17298 52499 47112 23023 -12757 -28105 -12255
18159 -12255 -7384 19780 54751 50552 61379 70478 74540 63944 41159 70990 78745 42408 16899
18146 16899 10331 27372 34817 43915 53244 39037 19965 23218 17583 -2456 -25633 -49868 -47497
18133 -47497 -41484 -40082 -38849 -17977 3362 -3254 -7226 8794 24781 7420 -7337 10310 23348
18120 23348 23149 30152 23109 20569 18144 375 -8792 -26085 -41208 -34358 -24436 -6067 9470
$$ packed form
18208I660J2881K515K52j8049K1678J9702J1594K6120K5747k15K0168O850J8759
18195A57662N208k8520l0628l5969l3439j0594K3813j1669L064O971p015N662
18183D4546j9499j4159J603j0229o550J0192J1850L5698J4330k5170j0740p804
18171B4068j4044n381M929j6268M824J9170L5201n387k4089l5780j5348J5850
18159a2255M871K7164L4971m199J0827R099M062j0596k2785K9831P755l6337k5509
18146A6899o568J7041P445R098R329j4207j9072L253n635k0039k3177k4235K371
18133d7497O013J402J233K0872K1339o616l972J6020J5987j7361j4757J7647J3038
18120B3348j99P003p043k540k425j7769r167j7293j5123O850R922J8369J5537
$$ plain form
18107 9470 -24322 -9013 9542 24455 4719 -8098 -13710 -18422 -2578 12134 -18908 -35594
18095 -35594 -10431 -19985 -41849 -29058 -5399 494 -18136 -29637 -31173 -11852 -9863 -27537
18083 -27537 -31812 -17196 -22546 -17491 -10552 -15855 -34173 -40791 -24672 -12750 23177 44653 53302
18070 53302 9237 -16443 -4138 25662 38693 15245 19648 31278 27722 30000 28256 17603
18058 17603 -12735 -3551 656 -9447 -7535 35544 48834 45487 49335 17997 -2482 -15983 -7804
18045 -7804 -5007 -1256 14509 13811 14859 2237 -25167 -45628 -20359 -2903 -5952 -10348 -15791
18032 -15791 -24949 -37727 -23183 -10668 2114 12065 2592 -38356 -43229 -54437 -79520 -87043 -61372
18019 -61372 -33659 -18384 -13547 -22155 -15867 -10136 -2771 -3117 43 -9036 -3015 8201 9150 -1843
$$ packed form
18107I470l3792J5309J8555J4913j9736j2817n612m712J5844J4712l1042j6686
18095c5594K5163r554k1864J2791K3659N893j8630j1501j536J9321J989j7674
18083b7537m275J4616n350N055O939n303j8318o618J6119J1922L5927K1476Q649
18070E3302m4065k5680J2305K9800J3031k3448M403J1630l556K278j744j0653
18058A7603l0338R184M207j0103J912M3079J3290l347L848l1338k0479j3501Q179
18045g804K797L751J5765o98J048j2622k7404k0461K5269J7456l049m396n443
18032a5791r158j2778J4544J2515J2782R951r473m0948m873j1208k5083p523K5671
18019f1372K7713J5275M837q608O288N731P365l46L160r079O021J1216R49j0993
$$ plain form
18005 -1843 12979 10617 17674 5786 -5740 26166 32789 33891 19571 -12924 -17971 -11387 -2821
17992 -2821 -26731 -49015 -21855 9016 33735 19325 12627 -7520 8638 17169 -3351 -27466
17980 -27466 -24491 -6006 -14074 -14485 9935 21593 -9584 -47812 -48163 -28680 -20221 -11146 -22054
17967 -22054 -29844 -44361 -31120 -40696 -31888 9540 25913 21537 9441 2942 -4054 2665 11023
17954 11023 -4825 -9951 -6418 -2417 -21778 -18177 -14404 2018 9783 -15674 7331 18495 13130
17941 13130 9976 4402 5422 155 -18760 -14585 8973 26915 26314 -2694 -24628 6366 34399
17928 34399 49877 58019 54988 54461 74645 62120 43615 61215 93688 152042 171384 197044
17916 197044 233253 247934 186447 113474 82407 91438 81566 92709 117933 159746 185919 209989
$$ packed form
18005a843J4822k362P057j1888j1526L1906O623J102j4320l2495n047O584Q566
17992b821k3910k2284K7160L0871K4719j4410o698k0147J6158Q531k0520k4115
17980b7466K975J8485q068m11K4420J1658l1177l8228l51J9483Q459R075j0908
17967b2054p790j4517J3241r576Q808M1428J6373m376j2096o499o996O719Q358
17954A1023j5848n126L533M001j9361L601L773J6422P765k5457K3005J1164n365
17941A3130l154n574J020n267j8915M175K3558J7942o01k9008k1934L0994K8033
17928C4399J5478Q142l031n27K0184j2525j8505J7600L2473N8354J9342K5660
17916A97044L6209J4681o1487p2973l1067R031r872J1143K5224M1813K6173K4070
$$ plain form
17904 209989 221924 190209 144521 143946 129788 105669 74915 41663 58007 57165 14913 4255
17892 4255 18249 45350 34591 3317 -6673 15656 8536 -871 16874 8711 -15677 7394 11595
17879 11595 6270 10380 3425 -891 -7075 6452 -9262 -27346 -12003 -21249 -21612 4047 19812
17866 19812 4065 -17113 -17016 -19196 -47194 -41999 -4573 2049 4137 -20165 -47746 -45780 -48017
17853 -48017 -26390 -15820 -15541 -594 16555 -5804 -19597 -15916 -987 -20919 -22156 -15042 -11708
17840 -11708 14075 32352 25562 6891 5213 2683 -5304 -11021 -13090 -2793 2929 18230 5823
17827 5823 5704 13232 7671 19240 25719 15668 35671 55059 47511 29303 23603 24998 9934
17814 9934 -4815 -7841 -2094 -8803 -30282 -33813 -20723 -12281 -31492 -27431 -10272 3320 -1709
$$ packed form
17904B09989J1935l1715m5688n75j4158k4119l0754l3252J6344q42m2252j0658
17892D255J3994K7101j0759l1274r990K2329p120r407J7745q163k4388K3071M201
17879A1595n325M110o955m316o184J3527j5714j8084J5343r246l63K5659J5765
17866A9812j5747k1178R7k180k7998N195L7426O622K088k4302k7581J966k237
17853d8017K1627J0570K79J4947J7149k2359j3793L681J4929j9932j237P114L334
17840a1708K5783J8277o790j8671j678k530p987n717k069J0297N722J5301j2407
17827E823j19P528n561J1569O479j0051K0003J9388p548j8208n700J395j5064
17814I934j4749l026N747o709k1479l531J3090Q442j9211M061J7159J3592n029
$$ plain form
17801 -1709 19619 6452 -29465 -43112 -19340 -7573 -26947 -24962 2907 12433 31674 28238
17789 28238 5455 -21720 -20650 3175 20319 20258 -2665 -10333 -14297 -26792 -37366 -12606 4470
17776 4470 -12393 -26153 -31218 -34947 -40499 -28174 -4591 8850 -495 -21485 -14566 22272 26341
17763 26341 12509 -5423 930 4076 14789 25965 8964 -10657 -3065 18631 27413 5836
17751 5836 1208 -3698 -17672 -2841 4431 9375 -9660 -11198 -24089 4867 40622 49699 68169
17738 68169 69251 50664 -3941 -24655 -4698 8502 -22084 -40178 -39207 -34987 -6656 3847
17726 3847 19276 39140 45027 40905 42529 19880 -7003 -17306 -25945 -48492 -59073 -48532 -24683
17713 -24683 -14179 -13750 12816 29276 18528 15400 25742 4477 -12615 -6711 6915 -11706
$$ packed form
17801a709K1328j3167l5917j3647K3772J1767j9374J985K7869R526J9241l436
17789B8238k2783k7175J070K3825J7144o1k2923p668l964j2495j0574K4760J7076
17776D470j6863j3760n065l729n552J2325K3583J3441r345k0990O919L6838M069
17763B6341j3832j7932O353L146J0713J1176j7001j9621P592K1696Q782k1577
17751E836m628m906j3974J4831P272M944j9035j538j2891K8956L5755R077J8470
17738F8169J082j8587n4605k0714J9957J3200l0586j8094R71M220K8331J0503
17726C847J5429J9864N887m122J624k2649k6883j0303q639k2547j0581J0541K3849
17713b4683J0504M29K6566J6460j0748l128J0342k1265j7092N904J3626j8621
$$ plain form
17701 -11706 -16860 -6230 -13744 -14420 -20589 -26978 -20894 -7993 -15117 -20824 -15208 1518 25114 37290
17687 37290 15559 -6784 1205 17776 51750 51236 36057 718 -16848 -23568 -3652 -9323 -2819
17674 -2819 20415 19528 11290 -5627 -20278 -9154 -25465 -22818 4665 15204 13957 32718 22910
17661 22910 6618 5891 28450 47512 48621 15372 2654 22079 36103 33017 2177 6472 9892
17648 9892 18272 23496 23541 3050 -7357 -19456 -14900 -26663 -36691 -45018 -34550 15149 20815
17635 20815 9148 15105 32507 23404 29851 42299 31348 56828 79597 32602 23959 16773 7723
17622 7723 1259 -2836 31725 23723 -4478 -6534 -7118 -16185 -10105 -4267 -4365 -824 13262 9335 1003
17607 1003 -9549 -433 6951 -7637 -19434 -29669 -17218 2794 -18778 -28275 -3746 2140 10215
$$ packed form
17701a1706n154J0630p514o76o169o389O084J2901p124n707N616J6726K3596J2176
17687C7290k1731k2343P989J6571L3974n14j5179l5339j7566o720J9916n671O504
17674b819K3234q87q238j6917j4651J1124j6311K647K7483J0539j247J8761r808
17661B2910j6292p27K2559J9062J109l3249j2718J9425J4024l086l0840M295L420
17648I892Q380N224M5k0491j0407j2099M556j1763j0028q327J0468M9699N666
17635B0815j1667N957J7402r103O447J2448j0951K5480K2769m6995q643p186r050
17622G723o464m095L4561q002k8201k056n84r067O080N838r8L541J4086l927q332
17607A003j0552R116P384j4588j1797j0235J2451K0012k1572r497K4529N886Q075
$$ plain form
17594 10215 14052 -20990 -45563 -25845 12646 12203 -4643 -15765 -15405 -16205 -17523 -2504 12296
17581 12296 -7918 3870 28620 17845 8307 23189 12004 -20512 -40214 2805 35526 25973
17569 25973 28489 27105 5969 -19429 -35160 -13362 3207 16945 27579 22440 8130 6981
17557 6981 11593 -929 -14734 -50608 -46690 -12469 -16060 -19357 -10072 32524 68545 42621 33861
17544 33861 29585 14217 35451 31311 1911 4569 19537 21777 2487 -12873 -6898 -9243 12475
17531 12475 4859 -4247 7866 35597 58325 57236 49065 12164 -15466 21375 37984 22100
17519 22100 34430 53725 55871 44124 13484 16747 16547 20847 28099 27715 32546 32826 23783 22291
17505 22291 17431 45308 41754 26221 16384 -18526 -15307 -3415 14831 31087 32603 38736 15047
$$ packed form
17594A0215L837l5042k4573J9718L8491m43j6846j1122L60q00j318J5019J4800
17581A2296k0214J1788K4750j0775r538J4882j1185l2516j9702M3019L2721r553
17569B5973K516j384k1136k5398j5731K1798J6569J3738J0634n139j4310j149
17557F981M612j2522j3805l5874L918L4221l591l297R285M2596L6021k5924q760
17544C3861m276j5368K1234m140k9400K658J4968K240j9290j5360N975k345K1718
17531A2475p616r106J2113K7731K2728j089q171l6901k7630L6841J6609j5884
17519B2100J2330J9295K146j1747l0640L263k00M300P252l84M831K80r043j492
17505B2291m860K7877l554j5533r837l4910L219J1892J8246J6256J516O133k3689
$$ plain form
17492 15047 16806 19891 13837 19304 17485 -22474 -46935 -44001 -37945 -12069 -13740 -9107 23114
17479 23114 28129 28281 26450 27489 22618 23856 17423 18604 14242 19619 18310 -9117 9488 53446
17465 53446 49346 47168 30771 8956 27247 55394 88036 135377 182379 253383 304442 314249
17453 314249 258021 192593 140333 104845 84346 63294 76519 110331 137744 178870 219083
17442 219083 242942 213262 150318 120643 96751 76808 66925 62197 52919 47906 46613 37525 23066
17429 23066 15259 -1033 -3464 1514 -3770 -591 19851 -10266 -18460 17469 46013 28729 25573
17416 25573 46226 43791 38435 15339 18850 33836 19293 10391 28527 44854 47161 21564 13228
17403 13228 -10493 -14254 1096 10487 50158 55300 29548 22276 29469 23506 27733 33583 37738
$$ packed form
17492A5047J759L085o054N467j819l9959k4461K934O056K5876j671M633L2221
17479B3114N015J52j831J039m871J238o433J181m362N377j309k7427J8605M3958
17465E3446m100k178j6397k1815J8291K8147L2642M7341M7002P1004N1059R807
17453C14249n6228o5428n2260l5488k0499k1052J3225L3812K7413M1126M0213
17442B19083K3859k9680o2944k9675k3892j9943r883m728r278n013j293r088j4459
17429B3066p807j6292k431M978n284L179K0442l0117q194L5929K8544j7284l156
17416B5573K0653k435n356k3096L511J4986j4543q902J8136J6327K307k5597q336
17403A3228k3721l761J5350R391L9671N142k5752p272P193n963M227N850M155
$$ plain form
17390 37738 46516 38204 60398 76529 61792 48264 30842 60326 74192 58723 40433 28910
17378 28910 16483 7351 19045 20907 35426 41612 20667 1085 18502 43863 47075 17969
17366 17969 9869 27543 20253 23588 4131 -28218 -29904 -3821 2186 -22978 -3852 22701 65578
17353 65578 78390 46282 27324 19005 -10418 -31867 -16602 -10252 -5999 18941 35924 53053
17341 53053 107866 169215 195304 168243 121401 74593 39685 22787 41756 59707 43831 53122
17329 53122 67220 71409 102092 167157 210185 203558 145795 127911 103429 41110 12351 26078
17317 26078 39083 53393 48766 55094 44160 29633 11852 27032 14229 6099 18181 30962
17305 30962 36032 30919 50375 7844 -1212 3755 27340 25060 3126 -6591 8427 16132 4677
$$ packed form
17390C7738Q778q312K2194J6131j4737j3528j7422K9484J3866j5469j8290j1523
17378B8910j2427r132J1694J862J4519O186k0945j9582J7417K5361L212k9106
17366A7969q100J7674p290L335j9457l2349j686K6083O007k5164J9126K6553M2877
17353F5578J2812l2108j8958q319k9423k1449J5265O350M253K4940J6983J7129
17341E3053N4813O1349K6089k7061m6842m6808l4908j6898J8969J7951j5876R291
17329E3122J4098M189L0683O5065M3028o627n7763j7884k4482o2319k8759J3727
17317B6078J3005J4310m627O328j0934j4527j7781J5180j2803q130J2082J2781
17305C0962N070n113J9456m2531r056M967K3585k280k1934r717J5018P705j1455
$$ plain form
17292 4677 -469 -2930 12930 19409 12081 4782 20370 30720 33695 32297 23930 34958 35533 35184
17278 35184 31484 27684 34529 9605 -13785 -11441 -22584 -38651 -21568 4395 21171 30969 35632
17265 35632 33234 27360 9979 -26859 -38330 -24034 -22369 -7244 -40629 -55646 -672 18717
17253 18717 22889 9568 1311 23547 25073 30189 51573 61578 42699 50456 61281 46838 45440
17240 45440 9174 -29425 -22073 13052 26275 19861 27481 49825 22696 37531 35223 27637 25373
17227 25373 8978 38848 31384 14755 7668 14975 -1343 18591 19967 14866 -5785 -4258 -23087
17214 -23087 9411 30596 19516 168 8706 7574 -4016 -8369 -3945 -14421 2 17027
17202 17027 5409 935 8367 34892 45125 27271 31755 33237 47612 58755 42023 30328
$$ packed form
17292D677n146k461J5860O479p328p299J5588J0350K975j398q367J1028N75l49
17278C5184l700l800O845k4924k3390K344j1143j6067J7083K5963J6776R798M663
17265C5632k398n874j7381l6838j1471J4296J665J5125l3385j5017N4974J9389
17253A8717M172j3321q257K2236J526N116K1384J0005j8879P757J0825j4443j398
17240D5440l6266l8599P352L5125J3223o414P620K2344k7129J4835k308p586k264
17227B5373j6395K9870p464j6629p087P307j6318J9934J376n101k0651J527j8829
17214b3087L2498K1185j1080j9348Q538j132j1590m353M424j0476J4423J7025
17202A7027j1618m474P432K6525J0233j7854M484J482J4375J1143j6732j1695
$$ plain form
17190 30328 20664 14247 21504 25175 25888 32271 56767 43422 18559 28303 45701 44856 44439 37855
17176 37855 27461 34415 38775 43876 41428 36865 42467 39615 45400 40129 24835 11963 24182
17163 24182 45483 57689 43450 48720 69101 34660 21322 7282 8558 27439 59349 68374
17151 68374 29744 24163 13745 24020 35181 31336 21136 32821 48632 26905 28493 38832
17139 38832 30121 20311 22540 38108 54226 67795 75756 48441 26257 28593 11933 -3303 -705
17126 -705 11611 4718 1396 4705 6610 20058 11992 7689 9053 32584 56304 82987 84985 76478
17112 76478 61355 59355 51186 14222 10503 27086 -710 14854 39883 55785 92855 91236
17100 91236 74926 30846 15602 20551 17453 23918 39621 50285 37569 16657 26894 48928
$$ packed form
17190C0328r664o417P257L671P13O383K4496j3345k4863R744J7398q45m17o584
17176C7855j0394O954M360N101k448m563N602k852N785n271j5294j2872J2219
17163B4182K1301J2206j4239N270K0381l4441j3338j4040J276J8881L1910R025
17151F8374l8630n581j0418J0275J1161l845j0200J1685J5811k1727J588J0339
17139C8832q711r810K229J5568J6118J3569P961k7315k2184K336j6660j5236K598
17126g05J2316o893l322L309J905J3448q066m303J364K3531K3720K6683J998q507
17112G6478j5123k000q169l6964l719J6583k7796J5564K5029J5902L7070j619
17100I1236j6310m4080j5244M949l098O465J5703J0664j2716k0912J0237K2034
$$ plain form
17088 48928 39020 -4427 4874 18880 6762 380 11118 11101 39470 29156 25433 31776 79316
17075 79316 93812 66031 64414 60594 47159 31776 35185 20344 8842 22948 57542 71513
17063 71513 73811 44591 33223 58223 68721 72890 70681 71513 76117 68576 53882 54184 44460 51994
17049 51994 20844 5995 40931 57102 66411 62071 67189 37029 -6786 -23607 3483 32238
17037 32238 37763 33269 38533 36559 67594 86832 68013 27535 48726 77770 95991 119429
17025 119429 130598 132265 137595 120627 115209 105812 92790 90156 83339 76776 113264 138515 117797
17012 117797 111879 132916 126713 145998 141206 126921 111185 104587 100669 108662 101410 93102 102188
16999 102188 110715 122079 119443 113626 93979 98768 97327 117843 126507 111094 94880 119413 122925
$$ packed form
17088D8928r908m3447R301J4006j2118o382J0738j7K8369j0314l723O343M7540
17075G9316J4496k7781j617l820j3435j5383L409j4841j1502J4106L4594J3971
17063G1513K298k9220j1368K5000J0498M169k209Q32M604p541j4694L02r724P534
17049E1994l1150j4849L4936J6171R309m340N118l0160m3815j6821K7090K8755
17037C2238N525m494N264j974L1035J9238j8819m0478K1191K9044J8221K3438
17025A19429J1169J667N330j6968n418r397j3022k634o817o563L6488K5251k0718
17012A17797n918K1037o203J9285m792j4285j5736o598l918P993p252q308R086
16999A02188Q527J1364k636n817j9647M789j441K0516Q664j5413j6214K4533L512
$$ plain form
16986 122925 115492 107707 84527 73730 80080 108961 136733 149037 106265 117517 155691 148844
16974 148844 154020 178184 204813 190982 174438 187366 190272 179059 176423 190341 237272 250141
16962 250141 243236 232156 246574 239337 203690 208155 224003 224584 217610 223305 246832 240023 242272
16949 242272 252306 293433 326652 324380 311445 300224 275273 277374 284572 299004 325464 348613
16937 348613 385863 418934 439774 453490 435906 467074 496158 523531 584431 661493 736882
16926 736882 876817 1025144 1101473 1119953 1102941 1120258 1184110 1297207 1481386 1690560
16916 1690560 1847836 2001955 2213584 2495635 2808226 3114091 3520346 4128098 5004717
16907 5004717 6365342 8484558 11840565 17476937 26984176 41593825 58584344 67746607
$$ packed form
16986A22925p433p785k3180j0797O350K8881K7772J2304m2772J1252L8174o847
16974A48844N176K4164K6629j3831j6544J2928K906j1213k636J3918M6931J2869
16962B50141o905j1080J4418p237l5647M465J5848N81o974N695K3527o809K249
16949B42272J0034M1127L3219k272j2935j1221k4951K101P198J4432K6460K3149
16937C48613L7250L3071K0840J3716j7584L1168K9084K7373O0900P7062P5389
16926G36882J39935J48327P6329J8480j7012J7317O3852J13097J84179K09174
16916A690560J57276J54119K11629K82051L12591L05865M06255O07752Q76619
16907E004717J360625K119216L356007N636372R507239J4609649J6990519R162263
$$ plain form
16899 67746607 58631150 39976572 26078671 18785890 15447356 14601973 15950214 20012909
16891 20012909 28119995 41476012 57685734 67055666 58528322 39465616 24495135
16884 24495135 16044288 11361545 8521370 6703247 5416518 4513148 3823723 3276032
16876 3276032 2909474 2675139 2516251 2401760 2254396 2031851 1814770 1660867 1504015
16867 1504015 1357837 1273539 1183694 1144662 1125419 1153986 1191564 1146430 1025920 931846 857516
16856 857516 813683 764877 749563 765311 748300 719066 727067 722408 666750 620416 576228 550278
16844 550278 525525 521208 536100 535446 517450 502544 509727 508592 493491 438085 360461 326856
16832 326856 352535 349361 296635 278950 261877 262198 250933 214376 178281 152349 137858 120351
$$ packed form
16899F7746607r115457j8654578j3897901p292781l338534q45383J348241M062695
16891B0012909Q107086J3356017J6209722R369932q527344j9062706j4970481
16884B4495135q450847m682743k840175j818123j286729r03370o89425n47691
16876C276032l66558k34335j58888j14491j47364k22545k17081j53903j56852
16867A504015j46178q4298q9845l9032j9243K8567L7578m5134j20510r4074p4330
16856H57516m3833m8806j5314J5748j7011k9234Q001m659n5658m6334m4188k5950
16844E50278k4753m317J4892o54j7996j4906P183j135j5101n5406p7624l3605
16832C26856K5679l174n2726j7685j7073L21j1265l6557l6095k5932j4491j7507
$$ plain form
16820 120351 125659 120885 127241 109927 113055 123867 131833 144409 140975 118865 119644 103828 87485
16807 87485 100840 96016 65978 31783 31899 20824 95 6529 31027 55162 63427 29987 19626
16794 19626 41425 37636 33742 29141 14432 24041 44226 55404 45041 27455 10385 -7701
16782 -7701 -7124 -20860 -21925 -22703 -10444 -17677 -9733 -14054 -1970 -8444 33896 29817 9978 8213
16768 8213 11857 26583 35495 13311 -21210 -10622 6358 41065 96876 102145 83750 76761 55497
16755 55497 13707 8838 18829 25532 40944 29490 16996 15789 11020 -15078 -35067 -8632 5524
16742 5524 3210 9771 6010 -6039 -10233 2592 6290 6315 14067 23349 13061 24801 27685 24314
16728 24314 36745 4919 -16108 -8059 6647 -21576 -26949 -20651 -24413 526 21939 1196
$$ packed form
16820A20351N308m774O356j7314L128J0812P966J2576l434k2110P79j5816j6343
16807H7485J3355m824l0038l4195J16j1075k0729O434K4498K4135Q265l3440j0361
16794A9626K1799l789l894m601j4709R609K0185J1178j0363j7586j7070j8086
16782g701N77j3736j065p78J2259p233P944m321J2084o474M2340m079j9839j765
16768H213L644J4726Q912k2184l4521J0588J6980L4707N5811N269j8395o989k1264
16755E5497m1790m869R991O703J5412j1454j2494j207m769k6098j9989K6435J4156
16742E524k314O561l761j2049m194J2825L698K5P752R282j0288J1740K884l371
16728B4314J2431l1826k1027Q049J4706k8223n373O298l762K4939K1413k0743
$$ plain form
16716 1196 1197 5821 12666 -3413 -27195 -11890 18356 45160 16066 3185 9954 24421 47058
16703 47058 35206 24561 16420 21194 22497 19869 23156 24762 27545 14677 2548 14515 6325
16690 6325 -6321 -545 9812 -2781 -7529 -22876 -52746 -43688 -48292 -23878 -23062 -23756 -36801
16677 -36801 -25018 -9516 5912 19998 -3313 -9668 -33565 -28174 17049 50168 47133 17682
16665 17682 -3889 -16511 -14935 18737 17174 -2922 4900 -21396 -26981 -23115 -21414 -7041 7551
16652 7551 4022 6218 28762 59196 39792 29780 2172 5156 11048 11453 12917 12087 17938 14686
16638 14686 -2835 -1400 -2939 -17301 -12705 13270 42442 36571 27245 23684 26978 17017 18020
16625 18020 10976 -5200 -36343 -28409 -2741 3340 -10620 -20639 -18572 -5421 32882 39892 39805
$$ packed form
16716A196JM624O845j6079k3782J5305L0246K6804k9094j2881O769J4467K2637
16703D7058j1852j0645q141M774J303k628L287J606K783j2868j2129J1967q190
16690F325j2646N776J0357j2593m748j5347k9870R058m604K4414Q16o94j3045
16677c6801J1783J5502J5428J4086k3311o355k3897N391M5223L3119l035k9451
16665A7682k1571j2622J576L3672j563k0096P822k6296n585L866J701J4373J4592
16652G551l529K196K2544L0434j9404j0012k7608K984N892M05J464q30N851l252
16638A4686j7521J435j539j4362M596K5975K9172n871r326l561L294r961J003
16625A8020p044j6176l1143P934K5668O081j3960j0019K067J3151L8303P010q7
$$ plain form
16612 39805 41987 23396 15383 20639 7553 7125 30705 30261 30138 39862 33102 15810 7706 1658
16598 1658 11503 31419 23285 7818 28612 38155 61588 62267 30581 6117 15863 26280 28586
16585 28586 59762 86819 90054 73818 52054 34633 46385 46190 9595 -9913 -11307 6303
16573 6303 10659 5113 5960 -6573 -8078 10796 -2525 4166 1995 17122 19908 1313 -17508
16560 -17508 -45199 -39661 -21073 -32105 -42782 -51173 -1525 13305 11897 31231 20606 -12426
16548 -12426 -17132 -43628 -67362 -40676 -26551 -29238 -30912 -22277 -9177 -13964 -42524 -53269 -56651
16535 -56651 -41293 -55142 -49207 -48357 -58272 -36279 -7206 12172 13530 37020 36681 3015 -8829
16522 -8829 -4298 9830 43054 46689 -6946 -16902 -33988 -10425 14714 4334 5629 29522 18999
$$ packed form
16612C9805K182j8591q013N256j3086m28K3580m44j23R724o760j7292q104o048
16598A658R845J9916q134j5467K0794R543K3433O79l1686k4464R746J0417K306
16585B8586L1176K7057L235j6236k1764j7421J1752j95l6595j9508j394J7610
16573F303M356n546Q47j2533j505J8874j3321O691k171J5127K786j8595j8821
16560a7508k7691N538J8588j1032j0677q391M9648J4830j408J9334j0625l3032
16548a2426m706k6496k3734K6686J4125k687j674Q635J3100m787k8560j0745l382
16535e6651J5358j3849N935Q50r915K1993K9073J9378J358K3490l39l3666j1844
16522h829M531J4128L3224L635n3635r956j7086K3563K5139j0380J295K3893j0523
$$ plain form
16509 18999 15487 1094 -10696 -11930 2456 14380 31684 24046 28073 12351 -7529 -37315
16497 -37315 -29913 9403 22337 11381 10713 5549 16128 7319 6115 19779 20023 18533 15155 -3646
16483 -3646 13427 21802 30343 51027 50584 23213 37522 54630 43722 34300 44420 42755 27751
16470 27751 14193 24617 43904 30438 18663 10222 17451 2895 7872 37956 20001 -13505
16458 -13505 2346 35407 36165 39929 30132 41942 42806 39015 21409 1649 6856 26150 40939
16445 40939 9300 11448 28224 20828 26790 13667 5650 -334 7416 -5716 -3165 20763 56400
16432 56400 53179 41644 38043 15009 -11270 -10519 -19092 2300 31228 26266 8765 353 10263
16419 10263 6187 11546 32627 25328 21778 24098 12288 8586 27115 37828 41971 39194 20431
$$ packed form
16509A8999l512j4393j1790j234J4386J1924J7304p638M027j5722j9880k9786
16497c7315P402L9316J2934j0956o68n164J0579q809j204J3664K44j490l378j8801
16483c646J7073Q375Q541K0684m43k7371J4309J7108j0908r422J0120j665j5004
16470B7751j3558J0424J9287j3466j1775q441P229j4556M977L0084j7955l3506
16458a3505J5851L3061P58L764r797J1810Q64l791j7606j9760N207J9294J4789
16445D0939l1639K148J6776p396N962j3123q017n984P750j3132K551K3928L5637
16432E6400l221j1535l601k3034k6279P51q573K1392K8928m962j7501q412R910
16419A0263m076N359K1081p299l550K320j1810l702J8529J0713M143k777j8763
$$ plain form
16406 20431 -6425 -8168 4076 19433 29199 10767 10178 19642 31051 33906 39807 76683 68100
16393 68100 42187 12787 5803 4763 -14056 -15357 -8180 -12440 9774 22887 21482 40096 49705
16380 49705 49317 18357 114 6917 1700 27278 43173 50412 15786 2943 26842 31454 30152
16367 30152 20393 17289 15870 29507 41411 24576 40765 52041 50171 25183 32853 53198 58192
16354 58192 64803 80250 59361 42031 51272 47582 49845 70914 61967 82042 107902 162940 232597
16341 232597 264677 297276 284240 260521 190106 128065 101077 94468 105245 141061 163586 197088
16329 197088 275646 282320 277679 247132 191669 156277 132516 101354 81645 78317 80590 89007
16317 89007 75300 56659 58500 37961 23054 16307 7583 -9117 -462 27999 50130 40157 30415
$$ packed form
16406B0431k6856j743J2244J5357R766j8432n89R464J1409K855N901L6876q583
16393F8100k5913k9400o984j040j8819j301P177m260K2214J3113j405J8614R609
16380D9705l88l0960j8243O803n217K5578J5895P239l4626j2843K3899M612j302
16367C0152r759l104j419J3637J1904j6835J6189J1276j870k4988P670K0345M994
16354E8192O611J5447k0889j7330R241l690K263K1069q947K0075K5860N5038O9657
16341B32597L2080L2599j3036k3719p0415o2041k6988o609J0777L5816K2525L3502
16329A97088P8558O674m641l0547n5463l5392k3761l1162j9709l328K273Q417
16317H9007j3707j8641J841k0539j4907o747q724j6700Q655K8461K2131r973r742
$$ plain form
16304 30415 13138 -1567 12408 7598 5848 4540 23117 36809 23801 19782 6888 -12544
16292 -12544 -11742 6384 18879 -4739 -12146 -9132 233 2232 -7564 6810 21080 8730 28898
16279 28898 44509 23243 31500 29390 23301 25990 16695 32850 23240 25548 22211 -7516 -17461
16266 -17461 3500 29375 40946 53136 40257 47879 44419 31897 38833 30163 10588 -453
16254 -453 12617 38617 41032 47772 60453 68883 52936 25716 14998 24737 36137 34845 63207
16241 63207 77177 65380 45160 32659 29796 49114 28794 30508 45074 54974 44033 18200
16229 18200 8781 4719 -3470 26675 30199 -11688 4736 23244 18746 25248 4297 8783 -2350
16216 -2350 3915 26928 25251 7818 45339 62424 34473 19498 29357 34986 47280 45626 29091
$$ packed form
16304C0415j7277j4705J3975m810j750j308J8577J3692j3008m019j2894j9432
16292a2544Q02J8126J2495k3618p407L014R365J999r796J4374J4270j2350K0168
16279B8898J5611k1266Q257k110o089K689r295J6155r610K308l337k9727r945
16266a7461K0961K5875J1571J2190j2879P622l460j2522O936q670j9575j1041
16254d53J3070K6000K415O740J2681Q430j5947k7220j0718R739J1400j292K8362
16241F3207J3970j1797k0220j2501k863J9318k0320J714J4566R900j0941k5833
16229A8200r419m062q189L0145L524m1887J6424J8508m498O502k0951M486j1133
16216b350O265K3013j677j7433L7521J7085k7951j4975R859N629J2294j654j6535
$$ plain form
16203 29091 12577 31723 44219 49466 34592 35719 32668 27625 13338 11628 7395 241 14870
16190 14870 20117 9876 -6416 -21132 -23569 -18137 -1159 12625 27591 8625 32197 23051
16178 23051 3593 6843 -1372 -4777 -12802 -28861 -20458 15060 36433 37479 43341 27811 20832
16165 20832 1979 -5558 9596 16069 -4462 12038 22849 28214 33999 23102 10391 724 1092
16152 1092 -1557 -20663 -16541 -12460 7033 21396 36130 61941 87349 55568 37651 12221
16140 12221 37627 39128 35120 44931 53250 67869 36443 -81 3413 14784 -5842 -12982 7136
16127 7136 28734 39335 52454 61332 48114 40266 35284 39450 30333 29887 38369 9529 31565
16114 31565 55738 74218 77509 46488 31669 63775 84851 79854 55475 46909 55810 53766 45568
$$ packed form
16203B9091j6514J9146J2496N247j4874J127l051n043j4287j710m233p154J4629
16190A4870N247j0241j6292j4716k437N432J6978J3784J4966j8966K3572r146
16178B3051j9458L250q215l405q025j6059Q403L5518K1373J046N862j5530o979
16165B0832j8853p537J5154O473k0531J6500J0811N365N785j0897j2711r667L68
16152A092k649j9106M122M081J9493J4363J4734K5811K5408l1781j7917k5430
16140A2221K5406J501m008R811Q319J4619l1426l6524L494J1371k0626p140K0118
16127G136K1598J0601J3119Q878j3218p848m982M166r117m46Q482k8840K2036
16114C1565K4173J8480L291l1021j4819L2106K1076m997k4379q566Q901k044q198
$$ plain form
16101 45568 30143 19428 47972 40118 22767 29928 30471 7169 23579 40424 40415 20446 7908
16088 7908 296 3596 36187 54087 48940 63404 73017 48672 21370 15811 32082 41213 34344
16075 34344 25541 70952 83385 56797 47255 41690 17486 10185 20775 36293 48629 50020 56399
16062 56399 76268 56611 23232 12562 16027 8586 9420 23559 17639 31308 39066 45791 39927
16049 39927 35696 37110 48429 56025 45117 50621 37613 31104 29612 22595 31410 18342 -6026
16036 -6026 24766 36862 36461 38464 34222 24746 54537 58657 36902 3705 44 33140 41583
16023 41583 47819 37976 24527 25179 11507 16435 20715 10816 23929 21617 11738 27406 32365 32321
16009 32321 24857 21904 27551 20809 20062 17105 18480 28714 32522 32455 19732 19964 32788 23417 6163
$$ packed form
16101D5568j5425j0715K8544p854j7351P161N43k3302J6410J6845rj9969j2538
16088G908p612L300L2591J7900n147J4464R613k4345k7302n559J6271R131o869
16075C4344q803M5411J2433k6588r542n565k4204p301J0590J5518J2336J391O379
16062E6399J9869j9657l3379j0670L465p441Q34J4139n920J3669P758O725n864
16049C9927m231J414J1319P596j0908N504j3008o509j492p017Q815j3068k4368
16036f026L0792J2096m01K003m242r476K9791M120k1755l3197l661L3096Q443
16023D1583O236r843j3449O52j3672M928M280r899J3113k312r879J5668M959m4
16009C2321p464k953N647o742p47k957J375J0234L808o7j2723K32J2824r371j7254
$$ plain form
15994 6163 -7140 -5261 18933 33695 38792 38278 34976 27885 27744 38014 54648 54054 23048 -5839
15980 -5839 11310 34969 37080 38185 43119 29956 21977 18179 40624 73221 92403 103980 63099
15967 63099 55203 80275 92530 99959 100033 59317 19414 -1951 -640 16282 31676 30377 29896
15954 29896 21173 25659 -3439 -1625 -17548 -17626 790 7309 6084 21345 30080 35361 22718 29006
15940 29006 21104 28952 -3966 -19 47293 65751 53434 65369 83065 75410 50338 36595
15928 36595 45502 44451 56307 64422 29471 679 -326 12486 36783 46433 19639 13786 -19297
15915 -19297 1623 24352 24252 14284 26719 16670 -12441 10837 31352 55037 43870 7855
15903 7855 6213 37330 30291 31251 30464 35917 27037 17581 15735 38700 61565 52862 20145 22341
$$ packed form
15994F163j3303J879K4194J4762N097n14l302p091j41J0270J6634n94l1006k8887
15980e839J7149K3659K111J105M934j3163p979l798K2445L2597J9182J1577m0881
15967F3099p896K5072J2255P429P4m0716l9903k1365J311J6922J5394j299m81
15954B9896q723M486k9098J814j5923p8J8416O519j225J5261Q735N281j2643O288
15940B9006p902P848l2918L947M7312J8458j2317J1935J7696p655k5072j3743
15928C6595Q907j051J1856Q115l4951k8792j005J2812K4297R650k6794n853l3083
15915a9297K0920K2729j00r968J2435j0049k9111K3278K0515K3685j1167l6015
15903G855j642L1117p039R60p87N453q880r456j846K2965K2865q703l2717K196
$$ plain form
15889 22341 15894 38981 62568 80332 44619 29205 34109 28224 14073 9198 14138 25743 60360
15876 60360 69203 29968 15530 36649 31440 4653 -4536 -6470 -10539 -4324 -9011 -2253 28693
15863 28693 21917 -6821 9034 45568 68619 67705 48065 8961 858 -7830 -22316 -24818 7139
15850 7139 21313 20355 30432 35769 40938 23126 12721 32563 63775 70349 62843 46319 23944
15837 23944 1759 -4804 2616 9799 6333 5916 19030 29579 21832 34349 43990 68839 87261
15824 87261 93236 86619 90061 81038 66601 56251 46179 33176 16926 42041 76300 88787
15812 88787 105091 100421 62407 21087 15572 36001 33434 22577 9051 10008 12428 11461 30514
15799 30514 42643 50584 39197 20575 9427 -4641 6671 30578 20333 -6287 -33062 -23898
$$ packed form
15889B2341o447K3087K3587J7764l5713j5414M904n885j4151m875M940J1605L4617
15876F0360Q843l9235j4438K1119n209k6787r189j934m069O215m687O758L0946
15863B8693o776k8738J5855L6534K3051r14j9640l9104q103q688j4486k502L1957
15850G139J4174r58J0077N337N169j7812j0405J9842L1212O574p506j6524k2375
15837B3944k2185o563P420P183l466m17J3114J0549p747J2517R641K4849J8422
15824H7261N975o617L442r023j4437j0350j0072j3003j6250K5115L4259J2487
15812H8787J6304m670l8014m1320n515K0429k567j0857j3526R57K420r67J9053
15799C0514J2129P941j1387j8622j1148j4068J1312K3907j0245k6620k6775R164
$$ plain form
15787 -23898 9104 33991 22175 19027 51571 33931 16509 18196 46525 65030 40148 36380
15775 36380 31250 5682 -2061 4641 15604 33090 23515 6489 -7079 -22284 6282 26914
15763 26914 15791 17467 12154 24531 41281 42433 14256 -7807 6448 12804 16658 14353 14453
15750 14453 22131 21877 17282 16319 -5273 -15670 14713 31657 11059 -1778 1973 9085 27959
15737 27959 37523 37562 43561 67227 74500 26857 7419 17218 31647 32535 33533 31672 14736 5654
15723 5654 21939 35009 38152 32480 20104 3153 -8669 6417 -7791 3226 30058 23516
15711 23516 32284 50875 49223 24474 10017 20280 36068 43079 41159 36720 9288 4555 5765
15698 5765 -2102 22495 37045 25939 39265 52377 46532 27605 38337 65493 41162 9028
$$ packed form
15787b3898L3002K4887j1816l148L2544j7640j7422J687K8329J8505k4882l768
15775C6380n130k5568p743O702J0963J7486r575j7026j3568j5205K8566K0632
15763B6914j1123J676n313J2377J6750J152k8177k2063J4255O356L854k305J00
15750A4453P678k54m595r63k1592j0397L0383J6944k0598j2837L751P112J8874
15737B7959R564L9N999K3666P273m7643j9438R799J4429Q88R98j861j6936r082
15723E654J6285J3070L143n672j2376j6951j1822J5086j4208J1017K6832o542
15711B3516Q768J8591j652k4749j4457J0263J5788P011j920m439k7432m733J210
15698E765p867K4597J4550j1106J3326J3112n845j8927J0732K7156k4331l2134
$$ plain form
15686 9028 9329 27290 42795 47901 26466 49013 36327 45554 38564 45811 31027 12345 22025
15673 22025 51363 43071 26651 47862 56841 50899 60034 54358 77703 92809 87480 78782 81549
15660 81549 75818 48463 52184 49878 58691 59625 46512 48781 60874 53390 46330 39534 36595 50443
15646 50443 52658 21997 5648 3761 3594 9262 46733 57053 40648 34937 48541 67588 58419
15633 58419 66444 50586 75832 84952 85911 98399 103743 99996 85896 80510 73258 86581 70355
15620 70355 43702 28211 20288 17385 32727 62041 71098 75553 71400 75105 54188 28334 21575
15607 21575 32634 44759 53044 52394 64103 45197 -11571 -28218 10651 34910 61862 71614
15595 71614 54768 46515 81291 92651 121938 95895 73017 55017 63218 60166 45470 35508
$$ packed form
15686I028L01J7961J5505N106k1435K2547j2686R227o990P247j4784j8682R680
15673B2025K9338q292j6420K1211Q979n942R135n676K3345J5106n329q698K767
15660H1549n731k7355L721k306Q813R34j3113K269J2093p484p060o796k939J3848
15646E0443K215l0661j6349j887j67N668L7471J0320j6405n711J3604J9047r169
15633E8419Q025j5858K5246R120R59J2488N344l747j4100n386p252J3323j6226
15620G0355k6653j5491p923k903J5342K9314R057M455m153L705k0917k5854o759
15607B1575J1059J2125Q285o50J1709j8906n6768j6647L8869K4259K6952R752
15595G1614j6846q253L4776J1360K9287k6043k2878j8000Q201l052j4696r962
$$ plain form
15583 35508 72645 103446 89302 70475 95516 94106 123404 125460 124802 115173 58960 36372 29424
15570 29424 5554 10749 19035 43720 40948 51474 75951 67163 43435 21076 9576 38145
15558 38145 43798 32043 54418 61443 61392 55790 53072 92026 115197 99638 92979 78892 90187
15545 90187 109515 114705 73226 57182 50621 43159 33965 14450 21327 18500 10689 5181 19061
15532 19061 33774 32844 28633 26742 22358 31488 49536 56005 42690 19065 23501 17739 10666 54841
15518 54841 70861 70807 84509 46108 36067 39071 65616 36404 18485 30937 20839 39864
15506 39864 58462 91801 126395 113694 89618 43669 28330 17439 2020 16024 23947 24174
15494 24174 19437 33838 54838 59269 53022 37358 29604 18350 14287 24882 37296 74148 109227
$$ packed form
15583C5508L7137L0801j4144j8827K5041j410K9298K056o58r629n6213k2588o948
15570B9424k3870N195Q286K4685k772J0526K4477q788k3728k2359j1500K8569
15558C8145N653j1755K2375P025n1n602k718L8954K3171j5559o659j4087J1295
15545I0187J9328N190m1479j6044o561p462r194j9515O877k827p811n508J3880
15532A9061J4713r30m211j891m384R130J8048O469j3315k3625M436n762p073M4175
15518E4841J6020n4J3702l8401j0041L004K6545k9212j7919J2452j0098J9025
15506C9864J8598L3339L4594j2701k4076m5949j5339j0891j5419J4004P923K27
15494B4174m737J4401K1000M431o247j5664p754j1254m063J0595J2414L6852L5079
$$ plain form
15481 109227 94411 67519 62533 42282 41122 63858 53205 45064 54668 49382 38511 39091 25880
15468 25880 8036 6579 15009 18439 25157 40845 74107 84380 66187 41638 52289 60706 63351
15455 63351 50372 39769 55293 74451 70908 51441 61204 69590 64965 62917 52470 71265 72898
15442 72898 69604 59388 61796 65093 79191 74728 54701 55376 63853 46102 56010 59971 61596 92991
15428 92991 106055 98352 92291 88623 84411 80233 70747 79729 101725 95687 69160 35439 28801
15415 28801 46072 49080 59340 49245 45167 35995 46038 53935 37789 50254 51713 43523 27411
15402 27411 41494 44404 55847 61951 92597 85149 61653 74731 75470 87565 62375 68321 63753
15389 63753 44726 46109 59024 84877 103717 82095 49589 8466 1479 11848 36642 21409
$$ packed form
15481A09227j4816k6892m986k0251j160K2736j0653q141R604n286j0871N80j3211
15468B5880j7844j457Q430L430O718J5688L3262J0273j8193k4549J0651Q417K645
15455F3351j2979j0603J5524J9158l543j9467R763Q386m625k048j0447J8795J633
15442G2898l294j0216K408L297J4098m463k0027O75Q477j7751R908L961J625L1395
15428I2991J3064p703o061l668m212m178r486Q982K1996o038k6527l3721o638
15415B8801J7271L008J0260j0095m078r172J0043P897j6146J2465J459q190j6112
15402B7411J4083K910J1443O104L0646p448k3496J3078P39J2095k5190N946m568
15389F3753j9027J383J2915K5853J8840k1622l2506m1123o987J0369K4794j5233
$$ plain form
15377 21409 23133 52487 61076 64900 43094 31459 42664 65325 42909 32974 50952 48860 65722
15364 65722 51389 19022 15053 27004 19660 32573 52674 91009 92049 61775 54176 57545 63738
15351 63738 44190 55921 103267 112986 87145 85023 77538 24314 6592 46555 69666 68039
15339 68039 68546 67214 60991 67001 50385 36676 36260 60981 76538 69590 78374 98067 92850 100112
15325 100112 97421 84489 77207 81970 57687 34564 49168 66829 52789 30569 31530 37191 37518
15312 37518 42022 28949 60461 91681 88084 91209 79954 70966 59203 57491 52726 63042 56351
15299 56351 56516 61792 56968 61879 64067 62656 43242 45743 47116 53023 63912 54332 67093 64169
15285 64169 68900 72072 68071 72665 62483 20045 -6094 20664 40609 41229 58949 53629 37084
$$ packed form
15377B1409J724K9354Q589L824k1806j1635J1205K2661k2416r935J7978k092J6862
15364F5722j4333l2367l969J1951p344J2913K0101L8335J040l0274p599L369O193
15351F3738j9548J1731M7346R719k5841k122p485n3224j7722L9963K3111j627
15339F8039N07j332o223O010j6616j3709m16K4721J5557o948Q784J9693n217P262
15325A00112k691j2932p282M763k4283k3123J4604J7661j4040k2220R61N661L27
15312C7518M504j3073L1512L1220l597L125j1255q988j1763j712m765J0316o691
15299E6351J65N276m824M911K188j411j9414K501J373N907J0889r580J2761k924
15285F4169M731L172m001M594j0182m2438k6139K6758J9945O20J7720n320j6545
$$ plain form
15272 37084 63159 71107 89895 90177 68037 39918 27258 55864 77143 75092 90529 79893
15260 79893 56570 58045 73615 51106 38109 37919 56964 60061 44045 33747 52239 58151 58951
15247 58951 77381 81437 85338 76940 80607 98229 105762 101061 93698 99293 102308 107436 94742 96928
15233 96928 93835 80633 79572 68470 83362 95274 103104 85150 113551 105299 78516 77440 52112
15220 52112 35434 37737 71375 96229 89337 108322 109195 75048 54794 58915 68971 72044 73036
15207 73036 74599 56292 29851 56180 98491 104671 76909 47483 77296 95445 110903 127181
15195 127181 128872 120233 100859 78140 71612 77173 65912 78085 69937 57069 56551 61824 64850
15182 64850 89447 105324 97600 39644 26789 40489 74068 79142 48507 64257 91788 101673
$$ packed form
15272C7084K6075P948J8788K82k2140k8119j2660K8606K1279k051J5437j0636
15260G9893k3323J475J5570k2509j2997j90J9045L097j6016j0298J8492N912Q00
15247E8951J8430M056L901q398L667J7622P533m701p363N595L015N128j2694K186
15233I6928l093j3202j061j1102J4892J1912P830j7954K8401q252k6783j076k5328
15220E2112j6678K303L3638K4854o892J8985Q73l4147k0254M121J0056L073R92
15207G3036J563j8307k6441K6329M2311O180k7762k9426K9813J8149J5458J6278
15195A27181J691q639j9374k2719o528N561j1261J2173q148j2868n18N273L026
15182F4850K4597J5877p724n7956j2855J3700L3579N074l0635J5750K7531R885
$$ plain form
15170 101673 119184 136408 127852 108566 114667 91752 61262 55432 78665 106880 97209 108327
15158 108327 103482 95392 82757 69672 81102 57856 52575 75736 61016 52847 88727 105482
15146 105482 79974 85319 115500 104055 96392 103615 101108 85177 88996 116089 110340 71484 68604
15133 68604 39231 37126 50228 48956 64231 87321 74519 46729 83300 95408 88802 73307
15121 73307 76189 94300 116192 99243 95175 96349 86685 68032 58775 72455 61570 46745 71065
15108 71065 81709 94144 92514 64650 40028 55799 63620 80934 99257 90781 108627 84524
15096 84524 62530 95007 119095 118676 129355 127542 119498 97722 85879 90056 93231 91126 92606
15083 92606 80381 89285 70368 72928 76084 73413 52407 65934 86904 117813 107813 92831
$$ packed form
15170A01673J7511J7224q556j9286O101k2915l0490n830K3233K8215r671J1118
15158A08327m845q090j2635j3085J1430k3246n281K3161j4720q169L5880J6755
15146A05482k5508N345L0181j1445p663P223k507j5931L819K7093n749l8856k880
15133F8604k9373k105J3102j272J5275K3090j2802k7790L6571J2108o606j5495
15121G3307K882J8111K1892j6949m068J174r664j8653r257J3680j0885j4825K4320
15108G1065J0644J2435j630k7864k4622J5771P821J7314J8323q476J7846k4103
15096H4524k1994L2477K4088m19J0679j813q044k1776j1843M177L175k105J480
15083I2606j2225Q904j8917K560L156k671k1006J3527K0970L0909j0000j4982
$$ plain form
15071 92831 113982 111473 108947 106816 86346 79814 72377 79015 71694 82406 80502 55619 67051
15058 67051 91569 90355 92839 119869 102503 75991 91828 95081 92825 71742 58661 69713
15046 69713 65998 65687 79038 53532 48275 67593 62579 62709 68632 68121 66474 70231 78150 87685
15032 87685 90211 81825 105376 106937 86517 95710 108880 121808 134383 108857 87922 79322 70479
15019 70479 69352 67625 56794 73082 87814 89470 69442 62046 67857 57207 53362 72010 87858
15006 87858 91261 69441 69838 104343 120147 116538 108517 85349 85078 105431 86195 72233 60611
14993 60611 61263 44746 8879 16130 53483 69579 85989 79975 81322 87846 77826 66180 63140
14980 63140 55965 34944 57786 73866 59478 95445 101160 90577 69856 96181 120107 128132
$$ packed form
15071I2831K1151k509k526k131k0470o532p437O638p321J0712j904k4883J1432
15058F7051K4518j214K484K7030j7366k6512J5837L253k256k1083j3081J1052
15046F9713l715l11J3351k5506n257J9318n014J30N923n11j647L757P919R535
15032H7685K526q386K3551J561k0420R193J3170J2928J2575k5526k0935q600q843
15019G0479j127j727j0831J6288J4732J656k0028p396N811j0650l845J8648J5848
15006H7858L403k1820L97L4505J5804l609q021k3168k71K0353j9236j3962j1622
14993F0611O52j6517l5867P251L7353J6096J6410o014J347O524j0020j1646l040
14980F3140p175k1021K2842J6080j4388L5967N715j0583k0721K6325K3926Q025
$$ plain form
14968 128132 112061 121138 125349 109976 103157 85111 51904 62660 95383 123261 151949 138884
14956 138884 107819 78860 79565 66569 58107 48041 61405 69082 80983 67185 57636 38028
14944 38028 55567 98654 121397 123594 137850 133334 99964 81961 73393 79113 76848 74916 91544
14931 91544 89995 108272 128728 116299 103105 97554 102260 92396 79211 81802 80317 86900 75681
14918 75681 77907 68435 56954 61305 75976 81430 82576 79068 76264 98277 106747 109778 78940
14905 78940 76257 97349 110065 103023 94381 124410 136715 126614 96223 72626 68808 78731 87171
14892 87171 96960 122076 125267 119065 120240 110288 115099 123390 122652 114626 133240 114450 135887 130322
14878 130322 127889 132509 110488 107693 116666 126612 120666 101683 105294 118931 145033 132583 82594
$$ packed form
14968A28132j6071R077M211j5373o819j8046l3207J0756L2723K7878K8688j3065
14956A38884l1065k8959P05j2996q462j0066J3364P677J1901j3798r549j9608
14944C8028J7539M3087K2743K197J4256m516l3370j8003q568N720k265j932J6628
14931I1544j549J8277K0456j2429j3194n551M706r864j3185K591j485O583j1219
14918G5681K226r472j1481M351J4671N454J146l508k804K2013Q470L031l0838
14905G8940k683K1092J2716p042q642L0029J2305j0101l0391k3597l818R923Q440
14892H7171R789K5116L191o202J175r952M811Q291p38q026J8614j8790K1437n565
14878A30322k433M620k2021k795Q973R946n946j8983L611J3637K6102j2450m9989
$$ plain form
14865 82594 78870 110275 119412 120842 115272 109386 82877 101896 114345 109785 111819 149450 138913
14852 138913 130927 136394 142131 119238 110596 100691 81950 86691 103559 117547 121101 136727 135750
14839 135750 118390 106259 96850 64409 62255 92761 100795 97863 78563 92341 118477 113546
14827 113546 132965 160742 161354 142922 135637 116289 87620 89523 89854 64445 57350 70211 82313
14814 82313 105434 129973 136664 124623 124492 117727 119118 129217 128324 151317 169742 154362 124887
14801 124887 98669 119149 136872 145874 153756 126023 113426 99743 95117 106284 107476 111366
14789 111366 114497 123234 149373 125201 112282 130817 135054 127444 131325 133464 116525 117205 96513
14776 96513 82908 96665 112306 98221 108849 132018 127245 139194 125499 112107 98149 89111
$$ packed form
14865H2594l724L1405R137J430n570n886k6509J9019J2449m560K034L7631j0537
14852A38913p986N467N737k2893q642r905j8741M741J6868J3988L554J5626r77
14839A35750j7360j2131r409l2441k154L0506Q034k932j9300J3778K6136m931
14827A13546J9419K7777O12j8432p285j9348k8669J903L31k5409p095J2861J2102
14814H2313K3121K4539O691j2041j31o765J391J0099q93K2993J8425j5380k9475
14801A24887k6218K0480J7723R002P882k7733j2597j3683m626J1167J192L890
14789A11366L131Q737K6139k4172j2919J8535M237p610L881K139j6939O80k0692
14776I6513j3605J3757J5641j4085J0628K3169m773J1949j3695j3392j3958r038
$$ plain form
14764 89111 101188 106797 105392 99460 99979 123322 145286 141135 141423 128383 127140 137761 135554 137955
14750 137955 128749 138280 141930 158894 151191 139414 131679 106546 97633 113864 116591 79898 82410
14737 82410 104803 127805 121578 96151 73878 89816 62298 89543 121332 103636 95680 111597
14725 111597 113013 91934 61348 55930 68003 68104 81347 80621 90078 83125 96816 81097 75459
14712 75459 68611 89415 109535 128058 137700 152011 117127 102475 103535 99565 91955 79868 38743
14699 38743 30649 51841 72637 80985 64760 67812 81707 63086 59523 82555 100114 132030
14687 132030 169218 166258 141234 117651 96781 94663 106390 103879 113494 117737 126928 121776 107633
14674 107633 100396 118759 122957 102826 91310 83610 111880 132580 121000 119306 111651 120483 125592
$$ packed form
14764H9111J2077N609j405n932N19K3343K1964m151K88j3040j243J0621k207K401
14750A37955r206R531L650J6964p703j1777p735k5133q913J6231K727l6693K512
14737H2410K2393K3002o227k5427k2273J5938k7518K7245L1789j7696p956J5917
14725A11597J416k1079l0586n418J2073J01J3243p26R457o953J3691j5719n638
14712G5459o848K0804K0120J8523R642J4311l4884j4652J060l970p610j2087m1125
14699C8743q094K1192K0796Q348j6225L052J3895j8621l563K3032J7559L1916
14687A32030L7188k960k5024k3583k0870k118J1727k511R615M243R191n152j4143
14674A07633p237J8363M198k0131j1516p700K8270K0700j1580j694p655Q832N109
$$ plain form
14661 125592 115033 95276 93099 121505 118678 99057 110608 131936 134940 132855 139019 118496
14649 118496 102326 107095 113369 109803 120920 119784 111952 119066 131293 117514 108386 104481 111428
14636 111428 130957 145552 128149 111603 102541 88877 92785 120660 125667 119096 104242 109218
14624 109218 121175 102696 87250 104581 109335 120527 125702 111020 114499 125497 108930 101820
14612 101820 113165 128667 107175 95263 124083 142110 158151 159005 134751 120773 111919 112249
14600 112249 115893 128209 130142 99685 98918 83103 72061 101105 105637 107418 113586 89096 106933
14587 106933 114326 135298 155832 148417 153898 149091 140170 142429 163313 174293 178471 193340 181080
14574 181080 152992 142254 138889 121810 117413 118852 124352 120034 110527 120710 122179 111018 128050
$$ packed form
14661A25592j0559j9757k177K8406k827j9621J1551K1328L004k085O164k0523
14649A18496j6170M769O274l566J1117j136p832P114J2227j3779r128l905O947
14636A11428J9529J4595j7403j6546r062j3664L908K7875N007o571j4854M976
14624A09218J1957j8479j5446J7331M754J1192N175j4682L479J0998j6567p110
14612A01820J1345J5502k1492j1912K8820J8027J6041Q54k4254j3978q854L30
14600A12249L644J2316J933l0457p67j5815j1042K9044M532J781O168k4490J7837
14587A06933P393K0972K0534p415N481m807q921K259K0884J0980M178J4869j2260
14574A81080k8088j0738l365j7079m397J439N500m318r507J0183J469j1161J7032
$$ plain form
14561 128050 154571 155797 137348 121398 147078 150289 151423 147737 141220 142004 135770 130208 131084 139627
14547 139627 147076 154539 133312 161087 170762 149862 155722 150410 146347 144275 130858 119014 117548
14534 117548 117556 119682 115046 116072 140350 131839 111489 132518 142891 152155 165579 164711 162506 179300
14520 179300 170528 134232 131125 134080 147689 135577 124397 138126 138231 124745 109019 100134 105451
14507 105451 101146 84055 82325 100371 138511 138817 136970 122164 130602 128026 141506 152302 159104
14494 159104 154910 155762 154612 147618 133515 99877 86082 93458 89787 88179 89549 108638 105449
14481 105449 68724 91883 131878 151769 154071 152276 148957 133698 124442 109986 89047 105898
14469 105898 112796 121233 112303 92794 80410 67017 71131 89439 109675 131869 165480 166375 158512
$$ packed form
14561A28050K6521J226j8449j5950K5680L211J134l686o517P84o234n562Q76Q543
14547A39627P449P463k1227K7775R675k0900N860n312m063k072j3417j1844j466
14534A17548QK126m636J026K4278q511k0350K1029J0373R264J3424q68k205J6794
14520A79300q772l6296l107K955J3609j2112j1180J3729J05j3486j5726q885N317
14507A05451m305j7091j730J8046L8140L06j847j4806Q438k576J3480J0796O802
14494A59104m194Q52j150o994j4103l3638j3795P376l671j608J370J9089l189
14481A05449l6725K3159L9995J9891K302j795l319j5259r256j4456k0939J6851
14469A05898O898Q437q930j9509j2384j3393M114J8308K0236K2194L3611Q95p863
$$ plain form
14456 158512 135886 134485 137176 119653 96977 114384 131740 130397 133149 113092 101785 99626
14444 99626 109032 125465 142378 134975 147027 136145 106047 109592 108005 106634 133401 135929 106083
14431 106083 80344 100587 103509 122480 144133 148845 139803 145154 145419 156682 168555 191316 165310
14418 165310 149543 151760 154235 151716 154404 148506 148483 161124 151193 131012 122895 126065 119855 125910
14404 125910 133390 148241 171633 166365 153610 163879 174123 178105 171538 151261 160051 148505
14392 148505 133167 103809 116588 143204 139882 126320 129076 134399 133978 155104 156728 186671 180875
14379 180875 171506 133322 136342 150795 166408 139631 137272 162089 163966 161650 174996 163057
14367 163057 144974 138271 146950 157198 167222 180712 139096 144235 168138 179859 175298 193130
$$ packed form
14456A58512k2626j401K691j7523k2676J7407J7356j343K752k0057j1307k159
14444I9626R406J6433J6913p403J2052j0882l0098L545j587j371K6767K528k9846
14431A06083k5739K0243K922J8971K1653M712r042N351K65J1263J1873K2761k6006
14418A65310j5767K217K475k519K688n898k3J2641r931k0181q117L170o210O055
14404A25910P480J4851K3392n268j2755J0269J0244L982o567k0277Q790j1546
14392A48505j5338k9358J2779K6616l322j3562K756N323m21K1126J624K9943n796
14379A80875r369l8184L020J4453J5613k6777k359K4817J877k316J3346j1939
14367A63057j8083o703Q679J0248J0024J3490m1616N139K3903J1721m561J7832
$$ plain form
14355 193130 207924 224458 196115 170453 162815 164617 159945 153256 147630 150397 147181 148008 117838
14342 117838 104776 136925 157489 153988 138388 148026 146270 144080 142218 139662 141098 140760 122241
14329 122241 123560 130371 106899 96595 115550 115548 141654 150107 117834 108711 104795 118357 120030
14316 120030 108041 112794 149966 169737 158278 145006 157194 157891 163085 144627 147453 155648 173154
14303 173154 191913 177910 159613 156266 160527 165408 167918 144468 128857 134064 152702 172797
14291 172797 174374 167416 161359 149875 156227 171995 164503 152659 146580 164257 182751 193158 184596
14278 184596 155612 127048 137416 139214 144890 162480 162567 152621 153731 170106 170980 187650 163440
14265 163440 140687 150685 171592 178680 160100 174207 182383 173697 162481 179406 183301 183380 157229
$$ packed form
14355A93130J4794J6534k8343k5662p638J802m672o689n626K767l216Q27l0170
14342A17838j3062L2149K0564l501j5600R638j756k190j862k556J436l38j8519
14329A22241J319O811k3472j0304J8955kK6106Q453l2273r123l916J3562J673
14316A20030j1989M753L7172J9771j1459j3272J2188O97N194j8458K826Q195J7506
14303A73154J8759j4003j8297l347M261M881K510k3450j5611N207J8638K0095
14291A72797J577o958o057j1484O352J5768p492j1844o079J7677J8494J0407q562
14278A84596k8984k8564J0368J798N676J7590Q7r946J110J6375Q74J6670k4210
14265A63440k2753R998K0907P088j8580J4107Q176q686j1216J6925L895P9k6151
$$ plain form
14252 157229 132096 133490 131790 151904 166155 136036 143406 139967 151473 145118 159371 178207
14240 178207 197465 211036 212666 195091 194815 161828 126567 113568 138881 146587 132174 139366
14228 139366 152264 161043 142887 129534 152749 144698 148601 145128 146081 141657 146436 154932 171025
14215 171025 193135 199215 168893 166134 169224 196126 190055 167608 146205 121647 110443 149246
14203 149246 167691 168342 186775 194370 195369 213233 200140 173929 162096 161285 159919 151541 153196
14190 153196 149281 167628 179329 173713 187151 190587 194221 180701 163008 160709 190883 202889
14178 202889 216823 184457 165262 162568 153894 164517 168234 181005 174228 162718 159797 156095 175300
14165 175300 162712 172082 164219 146648 126156 157988 191991 226316 209515 197771 189595 186563
$$ packed form
14252A57229k5133J394j700K0114J4251l0119P370l439J1506o355J4253J8836
14240A78207J9258J3571J630j7575k76l2987l5261j2999K5313P706j4413P192
14228A39366J2898Q779j8156j3353K3215q051L903l473R53m424M779Q496J6093
14215A71025K2110O080l0322k759L090K6902o071k2447k1403k4558j1204L8803
14203A49246J8445O51J8433P595R99J7864j3093k6211j1833q11j366q378J655
14190A53196l915J8347J1701n616J3438L436L634j3520j7693k299L0174J2006
14178B02889J3934l2366j9195k694q674J0623L717J2771o777j1510k921l702J9205
14165A75300j2588R370p863j7571k0492L1832L4003L4325j6801j1744q176l032
$$ plain form
14153 186563 202345 200343 176146 175121 176472 184914 190553 192022 187551 182482 179042 175607 182615 177499
14139 177499 168296 181088 175067 154689 126201 151437 150265 141148 160517 201343 174938 163344
14127 163344 164446 167370 162052 163670 164974 174409 171353 161157 168061 177365 198114 210411 206910
14114 206910 206134 211636 195797 168534 165120 160873 164669 174081 168452 150765 147539 182083 191481
14101 191481 181039 166369 184403 190907 183094 170963 180217 189400 186851 186996 202476 210482 197929
14088 197929 185513 167596 167405 175518 171834 171335 158859 160524 171908 174436 154678 163730 181074
14075 181074 190699 201052 230591 239342 188638 162474 171710 193701 211334 201865 206366 176176
14063 176176 160858 159631 164388 171450 191591 210735 207579 200855 205179 203245 218943 200286 207795
$$ packed form
14153A86563J5782k002k4197j025J351Q442N639J469m471n069l440l435P008n116
14139A77499r203J2792o021k0378k8488K5236j172r117J9369M0826k6405j1594
14127A63344J102K924n318J618J304R435l056j0196O904R304K0749J2297l501
14114B06910p76N502j5839k7263l414m247L796R412n629j7687l226L4544R398
14101A91481j0442j4670J8034O504p813j2131R254R183k549J45J5480Q006j2553
14088A97929j2416j7917j91Q113l684m99j2476J665J1384K528j9758R052J7344
14075A81074R625J0353K9539Q751n0704k6164R236K1991J7633r469M501l0190
14063A76176j5318j227M757P062K0141J9144l156o724M324j934J5698j8657P509
$$ plain form
14050 207795 204383 194716 207110 211052 214089 209774 232830 244312 254707 246396 220300 188127 195411
14037 195411 225889 237848 226843 197041 203806 224257 247860 242138 209178 222103 238793 239869
14025 239869 226286 221705 238067 250759 224879 188907 178740 177650 195558 177887 129702 121233
14013 121233 144462 147865 162955 181477 185650 189647 203317 212765 213470 208536 220993 218345 211038
14000 211038 202513 220865 231930 246592 230712 208862 228529 231299 231001 238841 218818 218944 237967
13987 237967 233402 205001 198784 200070 203106 222827 225180 240276 270823 245053 224057 226364 215667
13974 215667 189122 146638 126064 149702 190722 178832 183301 201451 197863 192904 178654 190765
13962 190765 197123 208877 229380 225588 230866 217890 205795 213936 242133 247877 243685 240165 238711
$$ packed form
14050B07795l412r667J2394L942L037m315K3056J1482J0395q311k6096l2173P284
14037A95411L0478J1959j1005k9802O765K0451K3603n722l2960J2925J6690J076
14025B39869j3583m581J6362J2692k5880l5972j0167j090J7908j7671m8185q469
14013A21233K3229L403J5090J8522M173L997J3670R448P05m934J2457k648p307
14000B11038q525J8352J1065J4662j5880k1850J9667K770k98P840k0023J26J9023
13987B37967m565k8401o217J286L036J9721K353J5096L0547k5770k0996K307j0697
13974B15667k6545m2484k0574K3638M1020j1890M469J8150l588m959j4250J2111
13962A90765O358J1754K0503l792N278j2976j2095Q141K8197N744m192l520j454
$$ plain form
13949 238711 220868 199157 206361 206104 188964 188693 207127 186258 188565 203020 214240 220586 195308
13936 195308 179941 201307 226540 228754 230502 220798 195084 186724 207531 227278 217249 221605
13924 221605 215954 186787 183304 190345 189796 223764 261550 251598 237511 252178 248659 225723 202316
13911 202316 220729 223964 206321 200115 192352 199400 197411 204086 206604 196906 201750 214330 237998
13898 237998 247743 233324 217276 242003 255355 227158 208799 215532 242717 257163 236285 226813
13886 226813 235420 249433 231553 242319 239549 225133 232098 239957 238274 253601 256034 239272 223756
13873 223756 219646 236522 215478 192031 220792 244337 244495 229836 218631 236580 268423 272880
13861 272880 250298 217654 196390 195438 233161 217143 241808 235113 210926 222505 228122 230263
$$ packed form
13949B38711j7843k1711P204k57j7140k71J8434k0869K307J4455J1220O346k5278
13936A95308j5367K1366K5233K214J748r704k5714q360K0807J9747j0029M356
13924B21605n651k9167l483P041n49L3968L7786r952j4087J4667l519k2936k3407
13911B02316J8413L235j7643o206p763P048j989O675K518r698M844J2580K3668
13898B37998R745j4419j6048K4727J3352k8197j8359O733K7185J4446k0878r472
13886B26813Q607J4013j7880J0766k770j4416O965P859j683J5327K433j6762j5516
13873B23756m110J6876k1044k3447K8761K3545J58j4659j1205J7949L1843M457
13861B72880k2582l2644k1264r52L7723j6018K4665o695k4187J1579N617K141
$$ plain form
13849 230263 224923 228432 231068 258015 268061 264310 267477 276917 263832 252836 238296 226400 233751
13836 233751 228087 221172 228197 255579 248338 225206 210673 213911 231700 249729 253732 279400 266580
13823 266580 261999 253728 253180 265001 271808 289006 299267 284631 256201 256843 264195 274196 260949
13810 260949 236898 210008 220379 232136 242059 262133 262186 233840 232748 218608 205322 245763
13798 245763 253816 251037 250770 244956 235810 248150 257527 262480 239822 247133 241785 231637 242145
13785 242145 255817 276133 279547 283940 285593 266662 276911 277948 275481 261873 259136 265331 273827
13772 273827 265660 270884 254225 275056 291393 268057 271743 292584 280115 270003 256016 278098
13760 278098 274620 291323 302152 293086 271468 270313 287405 316278 314073 286632 264517 285299
$$ packed form
13849B30263n340L509K636K6947J0046l751L167R440j3085j0996j4540j1896P351
13836B33751n664o915P025K7382p241k3132j4533L238J7789J8029M003K5668j2820
13823B66580m581q271n48J1821O807J7198J0261j4636k8430O42P352J0001j3247
13810B60949k4051k6890J0371J1757R923K0074N3k8346j092j4140j3286M0441
13798B45763Q053k779k67n814r146J2340R377M953k2658P311n348j0148J0508
13785B42145J3672K0316L414M393J653j8931J0249J037k467j3608k737O195Q496
13772B73827q167N224j6659K0831J6337k3336L686K0841j2469j0112j3987K2082
13760B78098l478J6703J0829r066k1618j155J7092K8873k205k7441k2115K0782
$$ plain form
13748 285299 276339 253540 234765 217270 209689 258303 268303 288106 271615 279784 258561 268631
13736 268631 291981 303092 304660 276190 276206 275270 273227 269745 271929 276514 293092 299154 300259 302606
13722 302606 298002 305010 317906 311623 318077 286412 250194 246094 249036 249560 261759 271974 253887
13709 253887 249972 239421 242138 290426 286061 257812 254228 252273 241457 235035 234365 257517 295992
13696 295992 303490 292225 285180 282208 277717 284917 262409 239856 245767 271968 288434 316689 318613
13683 318613 326994 317843 295084 289741 271460 281721 278197 284436 301283 295823 307286 296259 319696
13670 319696 315233 302246 309318 333479 313993 303842 322609 310338 295431 278454 280339 302532
13658 302532 302880 295148 298808 316693 318846 314234 311912 290402 272117 288087 310105 320969 322541
$$ packed form
13748B85299q960k2799j8775j7495p581M8614J0000J9803j6491Q169k1223J0070
13736B68631K3350J1111J568k8470J6r36k043l482K184M585J6578O062J105K347
13722C02606m604P008J2896o283O454l1665l6218m100K942N24J2199J0215j8087
13709B53887l915j0551K717M8288m365k8249l584j955j0816o422o70K3152L8475
13696B95992P498j1265p045k972m491P200k2508k2553N911K6201J6466K8255J924
13683C18613Q381r151k2759n343j8281J0261l524O239J6847n460J1463j1027K3437
13670C19696m463j2987P072K4161j9486j0151J8767j2271j4907j6977J885K2193
13658C02532L48p732L660J7885K153m612k322k1510j8285J5970K2018J0864J572
$$ plain form
13645 322541 340275 334043 322723 336956 324827 307168 309444 325825 314084 306163 303820 321728
13633 321728 312003 296302 303673 315282 345268 325256 294437 282705 283154 294324 316649 303430
13621 303430 292824 313439 329102 329336 318817 304331 298344 295891 301575 293502 291098 303109 303717
13608 303717 298605 332194 331624 320363 311311 283853 275881 279831 282941 297509 311541 321969 323003
13595 323003 309518 296777 311746 337299 342387 346578 347937 326013 330023 358577 364574 350258
13583 350258 334106 335772 333510 326422 330208 330005 336847 341029 318532 306909 319222 340114 364489
13570 364489 332252 323766 321193 328438 334827 354155 358899 353030 351342 350257 359910 333408 319684
13557 319684 326665 354734 351765 352434 351287 347683 337544 315931 328018 336153 352866 366068 358446
$$ packed form
13645C22541J7734o232j1320J4233j2129j7659K276J6381j1741p921k343J7908
13633C21728r725j5701P371J1609K9986k0012l0819j1732M49J1170K2325j3219
13621C03430j0606K0615J5663K34j0519j4486n987k453N684q073k404J2011O08
13608C03717n112L3589n70j1261r052k7458p972L950L110J4568J4032J0428J034
13595C23003j3485j2741J4969K5553N088M191J359k1924M010K8554N997j4316
13583C50258j6152J666k262p088L786k03O842M182k2497j1623J2313K0892K4375
13570C64489l2237q486k573P245O389J9328M744n869j688j085R653k6502j3724
13557C19684O981K8069k969O69j147l604j0139k1613J2087Q135J6713J3202p622
$$ plain form
13544 358446 351775 333600 313070 318743 335587 337751 345303 344682 359293 368464 358592 367693 367353 338561
13530 338561 324811 331880 352566 353600 342488 339476 323724 348018 376145 396531 399819 370157
13518 370157 351865 339392 336319 320983 344349 341778 357770 374136 387951 380410 402368 402938
13506 402938 371078 346158 322619 354312 362708 361847 362974 337525 303200 319459 343011 360928
13494 360928 387097 375263 357419 333859 332166 334906 355234 372969 397887 389830 361283 326787
13482 326787 296628 309101 328464 371372 378676 389022 387017 366770 353261 359186 359927 349165
13470 349165 343693 345407 322295 316889 354979 387882 373886 369314 351646 337851 340134 336319 341145
13457 341145 350362 368370 374890 381318 398268 383317 377362 399920 396811 378866 363989 370432 362401
$$ packed form
13544C58446o671j8175k0530N673J6844K164P552o21J4611R171r872R101l40k8792
13530C38561j3750P069K0686J034j1112l012j5752K4294K8127K0386L288k9662
13518C70157j8292j2473l073j5336K3366k571J5992J6366J3815p541K1958N70
13506D02938l1860k4920k3539L1693Q396q61J127k5449l4325J6259K3552J7917
13494C60928K6169j1834j7844k3560j693K740K0328J7735K4918q057k8547l4496
13482C26787l0159J2473J9363M2908P304J0346k005k0247j3509N925P41j0762
13470C49165n472J714k3112n406L8090L2903j3996m572j7668j3795K283l815M826
13457C41145R217J8008O520O428J6950j4951n955K2558l109j7945j4877O443q031
$$ plain form
13444 362401 351088 371775 400447 424542 432987 438102 408154 405240 409619 394956 389364 388141 395833
13431 395833 428668 432743 405169 413844 433308 431187 398057 379392 389065 402638 417692 419163
13419 419163 431256 415971 396983 366390 346381 371360 403080 398674 393195 401130 396382 383507
13407 383507 388209 403193 429785 421948 402847 398175 386097 365895 373429 402661 396585 403596 410259
13394 410259 413945 416164 421027 400414 411226 424358 418786 405947 385630 387608 361522 382329
13382 382329 409258 395721 393767 424056 447326 430805 411347 424272 436016 447548 465376 466060
13370 466060 451543 457659 462140 429345 404015 417751 414060 442793 456706 462705 456535 418835
13358 418835 424453 436194 456578 450225 457057 455823 460370 457562 440696 439971 455382 454728 454824 435393
$$ packed form
13444C62401j1313K0687K8672K4095Q445N115k9948k914M379j4663n592j223P692
13431C95833L2835M075k7574Q675J9464k121l3130j8665R673J3573J5054J471
13419D19163J2093j5285j8988l0593k0009K4979L1720m406n479P935m748j2875
13407C83507M702J4984K6592p837j9101m672j2078k0202P534K9232o076P011O663
13394D10259L686K219M863k0613J0812J3132n572j2839k0317J978k6086K0807
13382C82329K6929j3537j954L0289K3270j6521j9458J2925J1744J1532J7828O84
13370D66060j4517O116M481l2795k5330J3736l691K8733J3913N999o170l7700
13358D18835N618J1741K0384o353O832j234M547k808j6866p25J5411o54R6j9431
$$ plain form
13344 435393 430234 427145 429462 446920 452829 448214 464105 471312 425112 438638 458294 438474 404230
13331 404230 415941 434331 446974 467877 458879 475764 475838 473736 464526 465021 454697 432855 457424
13318 457424 478225 462460 470590 492713 495353 487823 512374 526634 499970 466525 464340 489627
13306 489627 478400 489223 518781 517034 512731 506033 485840 497113 478812 461458 448296 470887
13294 470887 465563 454393 430188 439971 466408 463368 455606 447168 458926 470724 471772 476188 484854
13281 484854 482722 497770 496350 502678 510357 504187 492789 508215 490847 475100 499517 509526
13269 509526 509110 508661 496060 492256 493218 501569 498534 514995 516700 512977 498327 494598 494205 518573
13255 518573 542710 553229 569049 588126 554710 535929 542468 526420 535896 521806 520049 541829
$$ packed form
13344D35393n159l089K317J7458N909m615J5891P207m6200J3526J9656j9820l4244
13331D04230J1711J8390J2643K0903q998J6885P4k102r210M95j0324k1842K4569
13318D57424K0801j5765Q130K2123K640p530K4551J4260k6664l3445k185K5287
13306D89627j1227J0823K9558j747m303o698k0193J1273j8301j7354j3162K2591
13294D70887n324j1170k4205R783K6437l040p762q438J1758J1798J048M416Q666
13281D84854k132J5048j420O328P679o170j1398J5426j7368j5747K4417J0009
13269E09526m16m49j2601l804R62Q351l035J6461J705l723j4650l729l93K4368
13255E18573K4137J0519J5820J9077l3416j8781O539j6048R476j4090j757K1780
$$ plain form
13243 541829 540228 540063 523721 503630 487512 500672 501189 498543 483802 512804 531815 514755 510644
13230 510644 555601 585892 559867 560656 566159 560478 567572 556239 548798 542654 523854 519614 544200
13217 544200 560901 589551 588638 580116 604719 617201 619699 620617 626888 594961 534919 488026 484817
13204 484817 491703 504477 546840 596023 612843 611865 617840 621877 639252 682687 723059 751288
13192 751288 810464 920070 1063662 1297872 1636254 2000708 2225488 2101637 1723931 1333920
13182 1333920 1082234 953205 850221 765347 719214 694592 693158 674894 688981 685912 672271
13171 672271 660254 640471 631556 643527 622629 603736 601545 585557 571173 577988 573063 581824
13159 581824 600569 600020 582035 551723 567374 575097 568999 601848 582833 575608 594817 607054
$$ packed form
13243E41829j601j65j6342k0091j6118J3160N17k646j4741K9002J9011j7060m111
13230E10644M4957L0291k6025P89N503n681P094j1333p441o144j8800m240K4586
13217E44200J6701K8650r13q522K4603J2482K498R18O271l1927o0042m6893l209
13204D84817O886J2774M2363M9183J6820r78N975M037J7375M3435M0372K8229
13192G51288N9176J09606J43592K34210L38382L64454K24780j23851l77706l90011
13182A333920k51686j29029j02984q4874m6133k4622j434j8264J4087l069j3641
13171F72271j2017j9783q915J1971k0898j8893k191j5988j4384O815m925Q761
13159E81824J8745n49j7985l0312J5651P723o098L2849j9015p225J9209J2237
$$ plain form
13147 607054 573008 583203 562181 544390 533030 538602 545609 555994 572766 602385 624662 622195
13135 622195 598440 597370 589597 610645 626877 622579 648778 660048 659524 647272 641785 651977 681201
13122 681201 667948 628362 599305 601634 623759 623194 641708 633224 637537 645805 645937 632733 621841
13109 621841 642538 642951 659175 646767 630104 644301 664625 679296 665409 633727 643036 642106
13097 642106 640422 657284 691454 712401 704290 699452 681362 663852 646279 627378 615644 607924
13085 607924 617733 630044 649698 651761 672764 652688 614431 608212 590056 597872 618729 620877
13073 620877 635655 649772 677911 703740 718886 679086 682240 692661 688172 676159 669541 650242
13061 650242 635542 627498 634517 611340 601460 561602 502984 472016 492089 532072 594555 650176
$$ packed form
13147F07054l4046J0195k1022j7791j1360N572P007J0385J6772K9619K2277k467
13135F22195k3755j070p773K1048J6232m298K6199J1270n24j2252n487J0192K9224
13122F81201j3253l9586k9057K329K2125n65J8514q484M313Q268J32j3204j0892
13109F21841K0697M13J6224j2408j6663J4197K0324J4671j3887l1682R309r30
13097F42106j684J6862L4170K0947q111m838j8090j7510j7573j8901j1734p720
13085F07924R809J2311J9654K063K1003k0076l8257o219j8156P816K0857K148
13073F20877J4778J4117K8139K5829J5146l9800L154J0421m489j2013o618j9299
13061F50242j4700q044P019k3177r880l9858n8618l0968K0073L9983O2483N5621
$$ plain form
13049 650176 671161 658475 661115 706088 726127 726823 724678 717055 723421 740679 730672 723630 742027
13036 742027 757959 739444 739308 730173 714335 694906 695878 712329 717271 734369 730915 717838 742024
13023 742024 755437 749107 752137 766186 808499 835937 826920 823244 818407 813695 800196 812409 805323
13010 805323 790179 771760 774631 765405 796969 808965 824566 834218 839103 883256 964275 1007123
12998 1007123 1005354 932111 859150 806646 806595 813475 827715 815563 808846 816132 832326 827845 821268
12985 821268 851664 843238 843973 836935 807630 803114 806430 801723 790598 767354 774104 807132 815662
12972 815662 791141 790160 820333 842315 828363 805275 835724 880849 894252 900316 884327 858476
12960 858476 855241 862124 864513 872564 871111 857785 827171 870402 908169 908290 909982 892651 877646
$$ packed form
13049F50176K0985j2686K640M4973K0039O96k145p623O366J7258j0007p042J8397
13036G42027J5932j8515j36r135j5838j9429R72J6451M942J7098l454j3077K4186
13023G42024J3413o330L030J4049M2313K7438r017l676m837m712j3499J2213p086
13010H05323j5144j8419K871r226L1564J1996J5601R652M885M4153Q1019M2848
12998A007123j769p3243p2961n2504n1O880J4240j2152o717P286J6194m481o577
12985H21268L0396q426P35p038k9305m516L316m707j1125k3244O750L3028Q530
12972H15662k4521r81L0173K1982j3952k3088L0449M5125J3403O064j5989k5851
12960H58476l235O883K389Q051j453j3326l0614M3231L7767J21J692j7331j5005
$$ plain form
12947 877646 857253 893432 910464 917762 924045 933867 896010 903397 892935 878490 885356 892508 897562
12934 897562 910681 919932 957726 957961 948403 964964 966714 967979 967994 959176 948656 940093 928005 933135
12920 933135 921205 939226 957433 975381 974859 961220 952324 946152 936997 971775 1020455 1027930 1010803
12907 1010803 1000296 1039249 1064371 1077909 1117334 1130896 1123516 1084728 1011929 923359 869509
12896 869509 839995 844579 875959 880814 897412 908723 907057 917769 953777 992142 995960 965283
12884 965283 961303 999177 996201 977252 947038 940659 930759 955266 997612 1018382 1097417 1234283
12872 1234283 1370992 1445152 1460740 1442582 1431286 1395334 1346609 1314083 1298849 1280603 1268166
12861 1268166 1223684 1195705 1197436 1187892 1170375 1194570 1215973 1229591 1259267 1273104 1259149 1233064
$$ packed form
12947H77646k0393L6179J7032P298O283R822l7857P387j0462j4445O866P152N054
12934H97562J3119R251L7794K35r558J6561J750J265J5q818j0520q563j2088N130
12920I33135j1930J8021J8207J7948n22j3639q896o172r155L4778M8680P475j7127
12907A010803j0507L8953K5122J3538L9425J3562p380l8788p2799q8570n3850
12896H69509k9514M584L1380M855J6598J1311j666J0712L6008L8365L818l0677
12884I65283l980L7874k976j8949l0214o379r900K4507M2346K0770P9035J36866
12872A234283J36709P4160J5588j8158j1296l5952m8725l2526j5234j8246j2437
12861A268166m4482k7979J731r544j7517K4195K1403J3618K9676J3837j3955k6085
$$ plain form
12849 1233064 1234300 1264133 1298666 1299384 1293431 1273655 1287369 1311127 1323984 1331529 1346537 1339960
12837 1339960 1335955 1331812 1356764 1388692 1420544 1412619 1404639 1425346 1450406 1491177 1519211 1528318
12825 1528318 1528212 1549625 1581871 1617652 1626332 1610764 1626789 1631364 1638419 1684187 1706254 1733732
12813 1733732 1762404 1810917 1859346 1910206 1983303 2047274 2097265 2165258 2276617 2451190 2638696
12802 2638696 2736791 2775275 2720632 2619392 2497268 2418484 2368072 2324044 2293826 2329057 2354551
12791 2354551 2369512 2381423 2427263 2513006 2598705 2667452 2699455 2749781 2837285 2945698 3077222
12780 3077222 3180486 3260422 3367327 3501865 3639083 3826821 4029421 4278853 4521638 4733516
12770 4733516 4996307 5351639 5742988 6150266 6628656 7184506 7821456 8554164 9360017
$$ packed form
12849A233064J236K9833L4533P18n953j9776J3714K3758J2857P545J5008o577
12837A339960m005m143K4952L1928L1852p925p980K0707K5060M0771K8034R107
12825A528318j06K1413L2246L5781Q680j5568J6025M575P055M5768K2067K7478
12813A733732K8672M8513M8429N0860P3097O3971M9991O7993J11359J74573J87506
12802B638696R8095L8484n4643j01240j22124p8784n0412m4028l0218L5231K5494
12791B354551J4961J1911M5840Q5743Q5699O8747L2003N0326Q7504J08413J31524
12780C077222J03264P9936J06905J34538J37218J87738K02600K49432K42785K11878
12770D733516K62791L55332L91349M07278M78390N55850O36950P32708Q05853
$$ plain form
12761 9360017 10304729 11450424 12890700 14723884 17122563 20262188 24517638 30384133
12753 30384133 38438999 49580492 65631491 90610610 131134730 193616620 272934166
12746 272934166 336357449 330715142 252884589 167875159 111132461 77836285 57932986
12739 57932986 45156187 35996111 28913220 23560287 19650572 16707831 14399572 12522463
12731 12522463 10978168 9722859 8691101 7839600 7144993 6545402 6065600 5647427 5275278
12722 5275278 4975108 4708042 4442925 4195947 4027810 3878183 3733544 3635662 3510668 3383307
12712 3383307 3286491 3166979 3073167 3041289 3034442 3001712 2957612 2894577 2881798 2935524 2982827
12701 2982827 3030278 3084524 3108842 3154677 3213295 3234034 3190340 3025992 2796429 2599641 2436643
$$ packed form
12761I360017R44712J145695J440276J833184K398679L139625M255450N866495
12753C0384133Q054866J1141493J6050999K4979119M0524120O2481890P9317546
12746B72934166O3423283n642307p7830553q5009430n6742698l3296176j9903299
12739E7932986j2776799r160076p082891n352933l909715k942741k308259j877109
12731A2522463j544295j255309j031758q51501o94607n99591m79802m18173l72149
12722E275278l00170k67066k65117k46978j68137j49627j44639r7882j24994j27361
12712C383307r6816j19512r3812l1878o847l2730m4100o3035j2779N3726M7303
12701B982827M7451N4246K4318M5835N8618K0739m3694j64348k29563j96788j62998
$$ plain form
12690 2436643 2296120 2199848 2115719 2041053 1983833 1939274 1876039 1810182 1737846 1670728 1626177
12679 1626177 1589708 1540202 1515177 1502868 1485543 1469586 1457112 1405634 1336807 1319527 1340685
12668 1340685 1339186 1290324 1276239 1285806 1281508 1277130 1241269 1215934 1234569 1247708 1249108 1274923
12656 1274923 1289872 1260980 1248180 1253828 1244955 1214062 1211008 1245543 1241554 1233978 1227877 1273501
12644 1273501 1292291 1263896 1246974 1235707 1203062 1176685 1184025 1198112 1167639 1150581 1133857
12633 1133857 1139209 1115448 1125329 1133440 1135282 1138579 1152871 1136544 1116149 1116856 1101470 1082116 1063580
12620 1063580 1114286 1245753 1401771 1448263 1423691 1412476 1398232 1383609 1383997 1360233 1317937
12609 1317937 1317836 1336342 1324569 1334514 1342749 1310756 1312002 1358416 1382018 1397195 1409407 1435132
$$ packed form
12690B436643j40523r6272q4129p4666n7220m4559o3235o5857p2336o7118m4551
12679A626177l6469m9506k5025j2309j7325j5957j2474n1478o8827j7280K1158
12668A340685j499m8862j4085R567m298m378l5861k5335J8635J3139J400K5815
12656A274923J4949k8892j2800N648q873l0893l054L4535l989p576o101M5624
12644A273501J8790k8395j6922j1267l2645k6377P340J4087l0473j7058j6724
12633A133857N352k3761R881Q111J842L297J4292j6327k0395P07j5386j9354j8536
12620A063580N0706J31467J56018M6492k4572j1215j4244j4623L88k3764m2296
12609A317937j01J8506j1773R945Q235l1993J246M6414K3602J5177J2212K5725
$$ plain form
12597 1435132 1455085 1434168 1436376 1394201 1320178 1231842 1158963 1128584 1152243 1173364 1228808
12586 1228808 1258969 1255297 1254069 1254361 1276879 1288810 1285351 1272193 1283477 1327560 1330336 1335656 1322784
12573 1322784 1331109 1350333 1319013 1318522 1333253 1361270 1355491 1349456 1349555 1324054 1321022 1343648 1337202
12560 1337202 1328794 1327723 1324425 1339056 1385562 1420454 1453223 1478455 1486624 1443659 1387812 1369755
12548 1369755 1372995 1390158 1400961 1427375 1427175 1410246 1392477 1385229 1399515 1404691 1420977 1416093
12536 1416093 1394621 1383758 1368656 1357293 1357310 1384147 1387812 1386097 1420110 1454618 1486909 1473106
12524 1473106 1461365 1481122 1500998 1509073 1523855 1536612 1538005 1519462 1493188 1487545 1486881 1484192
12512 1484192 1508874 1522509 1546995 1533983 1503412 1505961 1509206 1521747 1565088 1582500 1564083 1571166
$$ packed form
12597A435132J9953k0917K208m2175p4023q8336p2879l0379K3659K1121N5444
12586A228808L0161l672j228K92K2518J1931l459j3158J1284M4083K776N320j2872
12573A322784Q325J9224l1320m91J4731K8017n779o035R9k5501l032K2626o446
12560A337202q408j071l298J4631M6506L4892L2769K5232Q169m2965n5847j8057
12548A369755L240J7163J0803K6414k00j6929j7769p248J4286N176J6286m884
12536A416093k1472j0863j5102j1363J7K6837L665j715L4013L4508L2291j3803
12524A473106j1741J9757J9876Q075J4782J2757J393j8543k6274n643o64k689
12512A484192K4682J3635K4486j3012l0571K549L245J2541M3341J7412j8417P083
$$ plain form
12500 1571166 1587015 1585186 1580351 1606138 1597316 1582610 1589976 1590687 1594126 1605923 1612729 1624881 1638414
12487 1638414 1629869 1611801 1618393 1647921 1619793 1612592 1618292 1608384 1624617 1648441 1651900 1673908
12475 1673908 1677029 1663711 1640283 1615930 1631409 1630305 1649711 1678039 1696335 1692112 1676625 1685602
12463 1685602 1713531 1719983 1697139 1690902 1714314 1726274 1708120 1691167 1689661 1720170 1733360 1727060
12451 1727060 1689711 1701621 1717226 1729043 1737499 1773709 1781933 1786623 1806971 1830219 1873419 1907152
12439 1907152 1931095 1941731 1981223 1985706 1963367 1948167 1910825 1882471 1879829 1876735 1867496 1890595
12427 1890595 1930036 1953332 1957895 1911072 1865415 1855226 1865240 1873510 1878865 1894763 1901168 1877980
12415 1877980 1879906 1896986 1922231 1944623 1957629 1972863 1984531 1974442 1962270 1970386 1977254 1973713
$$ packed form
12500A571166J5849j829m835K5787q822j4706P366P11L439J1797O806J2152J3533
12487A638414q545j8068O592K9528k8128p201N700r908J6233K3824L459K2008
12475A673908L121j3318k3428k4353J5479j104J9406K8328J8296m223j5487Q977
12463A685602K7929O452k2844o237K3412J1960j8154j6953j506L0509J3190o300
12451A727060l7349J1910J5605J1817Q456L6210Q224M690K0348K3248M3200L3733
12439A907152K3943J0636L9492M483k2339j5200l7342k8354k642l094r239K3099
12427A890595L9441K3296M563m6823m5657j0189J0014Q270N355J5898O405k3188
12415A877980J926J7080K5245K2392J3006J5234J1668j0089j2172Q116O868l541
$$ plain form
12403 1973713 1960402 1946077 1954203 1987147 1987652 1981366 1977205 1979375 1985719 2011754 2012288 2014445 2037783
12390 2037783 2034254 2010722 2015415 2057899 2073288 2044321 2041872 2063253 2083581 2065136 2047374 2071499
12378 2071499 2081022 2064273 2080602 2086191 2051233 2020784 2020859 2036926 2079601 2102982 2117459 2112735
12366 2112735 2113490 2135941 2140867 2153102 2126442 2129431 2155191 2178042 2191775 2211294 2212429 2208267
12354 2208267 2205457 2209452 2193517 2197015 2234410 2250019 2233122 2251004 2262795 2286180 2323916 2297990
12342 2297990 2309224 2322593 2313438 2300375 2289535 2283868 2253091 2258666 2282222 2290482 2297842 2320679
12330 2320679 2329907 2334906 2335681 2322359 2329563 2345017 2371170 2372576 2360627 2357756 2354898 2364971 2347936
12317 2347936 2372709 2397124 2398264 2409028 2414698 2447419 2488879 2482249 2514003 2569923 2577176 2637363
$$ packed form
12403A973713j3311j4325Q126L2944N05o286m161K170O344K6035N34K157K3338
12390B037783l529k3532M693M2484J5389k8967k449K1381K0328j8445j7762K4125
12378B071499R523j6749J6329N589l4958l0449P5J6067M2675K3381J4477m724
12366B112735P55K2451M926J2235k6660K989K5760K2851J3733J9519J135m162
12354B208267k810L995j5935L498L7395J5609j6897J7882J1791K3385L7736k5926
12342B297990J1234J3369r155j3063j0840n667l0777N575K3556Q260P360K2837
12330B320679R228M999P75j3322P204J5454K6153J406j1949k871k858J0073j7035
12317B347936K4773K4415J140J0764N670L2721M1460o630L1754N5920P253O0187
$$ plain form
12305 2637363 2708791 2799401 2933248 3138846 3421649 3765460 4067022 4109430 3796042 3390089
12295 3390089 3094548 2954161 2841930 2744632 2728041 2724058 2702037 2692664 2689003 2664821 2657303
12284 2657303 2604409 2527510 2520436 2525682 2519729 2529310 2549166 2546004 2533890 2531343 2546763 2559198
12272 2559198 2564769 2595834 2608363 2634384 2634532 2652144 2677552 2643839 2632978 2650040 2659814 2643872
12260 2643872 2639106 2655652 2655121 2639942 2644286 2671912 2676384 2688653 2716444 2728109 2727215 2725414 2752623
12247 2752623 2774128 2771873 2787416 2778174 2745261 2746006 2759736 2780891 2757503 2775921 2807645 2829993
12235 2829993 2853554 2864963 2844824 2828729 2803502 2809448 2833665 2868324 2874749 2881682 2891101 2887602
12223 2887602 2861531 2878553 2886960 2907146 2926887 2900096 2891264 2882773 2896152 2913157 2934012 2936474
$$ packed form
12305B637363P1428R0610J33847K05598K82803L43811L01562M2408l13388m05953
12295C390089k95541j40387j12231r7298j6591l983k2021r373l661k4182p518
12284B657303n2894p6899p074N246n953R581J9856l162j2114k547J5420J2435
12272B559198N571L1065J2529K6021J48J7612K5408l3713j0861J7062R774j5942
12260B643872m766J6546n31j5179M344K7626M472J2269K7791J1665q94j801K7209
12247B752623K1505k255J5543r242l2913P45J3730K1155k3388J8418L1724K2348
12235B829993K3561J1409k0139j6095k5227N946K4217L4659O425O933R419l499
12223B887602k6071J7022Q407K0186J9741k6791q832q491J3379J7005K0855K462
$$ plain form
12211 2936474 2957071 2981891 2997688 3002003 2989685 2992099 2975080 2991954 3027599 3012046 2986120 2980098
12199 2980098 2957317 2950634 2961207 2979177 3010897 3025282 3018789 3022297 3036873 3053133 3059860 3077217
12187 3077217 3071429 3070361 3061126 3055185 3058070 3093983 3106545 3113023 3107164 3131685 3155721 3165391 3155313
12174 3155313 3146880 3151656 3141517 3142902 3159690 3175024 3157128 3141372 3160304 3164369 3143107 3148197
12162 3148197 3156236 3163982 3187400 3184018 3157751 3160751 3172562 3187025 3186944 3188022 3199883 3226527 3263476
12149 3263476 3265667 3262806 3279255 3277038 3269190 3254319 3257153 3255989 3262940 3255389 3249950 3265365 3285863
12136 3285863 3291942 3267212 3269399 3280736 3283219 3287791 3295617 3302293 3309093 3307726 3296937 3300263 3323834
12123 3323834 3337318 3355264 3357094 3353573 3371398 3362167 3336419 3316958 3307343 3309701 3312537 3324792
$$ packed form
12211B936474K0597K4820J5797M315j2318K414j7019J6874L5645j5553k5926o022
12199B980098k2781o683J0573J7970L1720J4385o493L508J4576J6260O727J7357
12187C077217n788j068r235n941K885L5913J2562O478n859K4521K4036R670j0078
12174C155313q433M776j0139J385J6788J5334j7896j5756J8932M065k1262N090
12162C148197Q039P746K3418l382k6267L000J1811J4463q1J078J1861K6644L6949
12149C263476K191k861J6449k217p848j4871K834j164O951p551n439J5415K0498
12136C285863O079k4730K187J1337K483M572P826O676O800j367j0789L326K3571
12123C323834J3484J7946J830l521J7825r231k5748j9461r615K358K836J2255
$$ plain form
12111 3324792 3349746 3346175 3331450 3378100 3391631 3381895 3382949 3407222 3413194 3398673 3420400 3429833
12099 3429833 3411742 3396815 3414976 3448546 3460796 3452346 3455239 3465734 3483609 3474964 3462741 3453022
12087 3453022 3433708 3437671 3446208 3472687 3474119 3478059 3472149 3447642 3457814 3452206 3462595 3460119 3465069
12074 3465069 3480551 3478398 3482647 3486184 3499808 3517979 3537839 3549564 3534582 3534717 3546623 3544220
12062 3544220 3544353 3527205 3528216 3513692 3503227 3501882 3515511 3525081 3508191 3469986 3475107 3497936
12050 3497936 3520874 3529876 3514055 3493533 3484250 3491276 3504153 3505613 3551705 3585461 3578550 3524657
12038 3524657 3513500 3544455 3558502 3546363 3522283 3519748 3509354 3506451 3517996 3536192 3528889 3554903
12026 3554903 3565882 3571920 3552439 3560991 3560860 3556946 3581052 3588337 3577160 3541442 3511140 3524230
$$ packed form
12111C324792K4954l571j4725M6650J3531r736J054K4273N972j4521K1727R433
12099C429833j8091j4927J8161L3570J2250q450K893J0495J7875q645j2223r719
12087C453022j9314L963Q537K6479J432L940n910k4507J0172n608J0389k476M950
12074C465069J5482k153M249L537J3624J8171J9860J1725j4982J35J1906k403
12062C544220J33j7148J011j4524j0465j345J3629R570j6890l8205N121K2829
12050C497936K2938R002j5821k0522r283P026J2877J460M6092L3756o911n3893
12038C524657j1157L0955J4047j2139k4080k535j0394k903J1545J8196p303K6014
12026C554903J0979O038j9481Q552j31l914K4106P285j1177l5718l0302J3090
$$ plain form
12014 3524230 3523812 3544335 3546228 3518679 3549000 3573332 3567784 3539619 3512970 3479692 3472882 3496116
12002 3496116 3523487 3545220 3570568 3573695 3561468 3544434 3567758 3583428 3583166 3540955 3538975 3570405
11990 3570405 3589628 3574531 3551936 3505164 3493756 3504287 3535358 3551119 3595653 3598967 3589582 3567230
11978 3567230 3546109 3538470 3538835 3537312 3534790 3533543 3520140 3509183 3509523 3493249 3471660 3476781 3492065
11965 3492065 3503473 3506737 3512654 3528076 3531853 3544671 3551176 3542690 3492856 3476986 3489851 3491653
11953 3491653 3475955 3468445 3477751 3457437 3451807 3454230 3457287 3462114 3454503 3439112 3424025 3416247 3425600
11940 3425600 3413873 3402161 3417577 3424600 3421685 3410776 3419771 3414715 3389794 3386362 3395322 3389789 3383189
11927 3383189 3383773 3376719 3375822 3385533 3390661 3403096 3399548 3393513 3364898 3370841 3401300 3391570 3351818
$$ packed form
12014C524230m18K0523J893k7549L0321K4332n548k8165k6649l3278o810K3234
12002C496116K7371K1733K5348L127j2227j7034K3324J5670k62m2211j980L1430
11990C570405J9223j5097k2595m6772j1408J0531L1071J5761M4534L314r385k2352
11978C567230k1121p639L65j523k522j247j3403j0957L40j6274k1589N121J5284
11965C492065J1408L264N917J5422L777J2818O505q486m9834j5870J2865J802
11953C491653j5698p510R306k0314n630K423L057M827p611j5391j5087p778R353
11940C425600j1727j1712J5416P023k915j0909Q995n056k4921l432Q960n533o600
11927C383189N84p054q97R711N128J2435l548o035k8615N943L0459r730l9752
$$ plain form
11914 3351818 3335984 3368856 3366512 3357598 3379884 3390856 3380871 3349489 3323376 3336820 3336005 3324300
11902 3324300 3296602 3301056 3298218 3292018 3286849 3274283 3267446 3296078 3296145 3299427 3286193 3258350 3226885
11889 3226885 3218144 3236097 3256898 3258068 3239285 3233724 3240793 3214001 3193973 3195880 3202925 3210843 3212987
11876 3212987 3209819 3206133 3212403 3225092 3230467 3207561 3185801 3181663 3186782 3171302 3150341 3132235
11864 3132235 3129226 3117087 3111467 3077383 3083273 3069615 3041334 3041032 3049892 3056211 3069238 3078908 3078092
11851 3078092 3089020 3094259 3064663 3059033 3071412 3054739 3055604 3059658 3036893 3042936 3046953 3034828 3019584
11838 3019584 3004025 3011208 3011573 3005362 2984178 2970223 2932052 2917721 2911742 2914412 2939350 2920686
11826 2920686 2896493 2895063 2886529 2896022 2916668 2918376 2915797 2921573 2888661 2852691 2853381 2852119 2845545
$$ packed form
11914C351818j5834L2872k344q914K2286J0972r985l1382k6113J3444q15j1705
11902C324300k7698M454k838o200n169j2566o837K8632O7L282j3234k7843l1465
11889C226885q741J7953K0801J170j8783n561P069k6792k0028J907P045P918K144
11876C212987l168l686O270J2689N375k2906k1760m138N119j5480k0961j8106
11864C132235l009j2139n620l4084N890j3658k8281l02Q860O319J3027R670q16
11851C078092J0928N239k9596n630J2379j6673Q65M054k2765O043M017j2125j5244
11838C019584j5559P183L65o211k1184j3955l8171j4331n979K670K4938j8664
11826B920686k4193j430q534R493K0646J708k579N776l2912l5970O90j262o574
$$ plain form
11813 2845545 2836652 2840442 2863311 2854020 2861136 2891838 2875322 2864794 2847217 2827200 2831535 2838737
11801 2838737 2832047 2825780 2810515 2794867 2770529 2751468 2727992 2720618 2772964 2786439 2765455 2748988
11789 2748988 2710691 2685064 2717164 2735728 2737464 2724328 2710365 2690065 2706646 2702603 2712683 2705054
11777 2705054 2668137 2622255 2591377 2613066 2627655 2614865 2594801 2606370 2574412 2578817 2599700
11766 2599700 2564523 2546961 2535832 2516659 2523667 2540146 2566537 2574342 2579482 2566707 2533591 2523596
11754 2523596 2536732 2545759 2523703 2479664 2463305 2445770 2459840 2477280 2475652 2465837 2454207 2432659
11742 2432659 2437836 2451498 2481501 2469531 2436860 2427521 2438070 2450669 2433521 2407586 2397518 2407218
11730 2407218 2389465 2372047 2360719 2347943 2337434 2335639 2333424 2344461 2344774 2325412 2339002 2354763
$$ packed form
11813B845545q893L790K2869r291P116L0702j6516j0528j7577k0017M335P202
11801B838737o690o267j5265j5648k4338j9061k3476p374N2346J3475k0984j6467
11789B748988l8297k5627L2100J8564J736j3136j3963k0300J6581m043J0080p629
11777B705054l6917m5882l0878K1689J4589j2790k0064J1569l1958M405K0883
11766B599700l5177j7562j1129j9173P008J6479K6391P805N140j2775l3116r995
11754B523596J3136R027k2056m4039j6359j7535J4070J7440j628r815j1630k1548
11742B432659N177J3662L0003j1970l2671r339J0549J2599j7148k5935j0068R700
11730B407218j7753j7418j1328j2776j0509j795k215J1037L13j9362J3590J5761
$$ plain form
11718 2354763 2376209 2386358 2361601 2342403 2333441 2317470 2319490 2306748 2311127 2260483 2256981 2279098
11706 2279098 2258259 2206805 2197988 2194956 2212975 2206646 2208142 2206119 2179066 2174062 2188705 2189179 2218749
11693 2218749 2223057 2209904 2214060 2214546 2218217 2180072 2153996 2137480 2137351 2112266 2084156 2102978 2121496
11680 2121496 2109344 2095068 2090437 2087982 2064321 2050447 2044090 2068150 2049008 2047637 2052151 2042197
11668 2042197 2036223 2023463 2033343 2037657 2057832 2042829 2022039 2008626 2025822 2050800 2077590 2074028
11656 2074028 2054992 2045664 2051522 2077966 2077548 2101596 2127115 2169456 2272741 2408754 2683399
11645 2683399 3092885 3679928 4178136 4106946 3442737 2811142 2477495 2324995 2207513 2131456
11635 2131456 2064931 2027537 1966293 1929776 1894015 1889460 1884520 1892849 1861005 1849102 1836278 1831564
$$ packed form
11718B354763K1446J0149k4757j9198q962j5971K020j2742M379n0644l502K2117
11706B279098k0839n1454q817l032J8019o329J496k023k7053n004J4643M74K9570
11693B218749M308j3153M156M86L671l8145k6076j6516j29k5085k8110J8822J8518
11680B121496j2152j4276m631k455k3661j3874o357K4060j9142j371M514r954
11668B042197n974j2760R880M314K0175j5003k0790j3413J7196K4978K6790l562
11656B074028j9036r328N858K6444m18K4048K5519M2341J03285J36013K74645
11645B683399M09486N87043M98208p1190o64209o31595l33647j52500j17482p6057
11635B131456o6525l7394o1244l6517l5761m555m940Q329l1844j1903j2824m714
$$ plain form
11623 1831564 1826621 1846684 1839688 1826060 1824241 1829230 1813691 1801562 1801363 1825115 1821157 1792316 1771192
11610 1771192 1768129 1769701 1784696 1789337 1755788 1703074 1716091 1759637 1750491 1740619 1741836 1755202
11598 1755202 1741664 1718037 1704974 1702710 1713093 1702280 1689219 1684764 1687789 1683745 1698950 1696192
11586 1696192 1656544 1630003 1614953 1600891 1592560 1627048 1637475 1634794 1607446 1604616 1622849 1644643
11574 1644643 1621266 1607238 1626002 1638666 1576855 1597370 1598276 1565351 1564951 1565455 1571742 1591047 1580388
11561 1580388 1584115 1579475 1568303 1581003 1571272 1549314 1559107 1549241 1511924 1509133 1509043 1484226 1473305
11548 1473305 1496366 1506288 1507410 1504163 1483048 1439117 1415618 1418472 1420685 1420980 1439920 1437617 1418713
11535 1418713 1423860 1431603 1442989 1437904 1431038 1430702 1414333 1410431 1422382 1411078 1369070 1339786 1331333
$$ packed form
11623A831564m943K0063o996j3628j819M989j5539j2129j99K3752l958k8841k1124
11610A771192l063J572J4995M641l3549n2714J3017M3546r146r872J217J3366
11598A755202j3538k3627j3063k264J0383j0813j3061m455L025m044J5205k758
11586A696192l9648k6541j5050j4062q331L4488J0427k681k7348k830J8233K1794
11574A644643k3377j4028J8764J2664o1811K0515R06l2925m00N04O287J9305j0659
11561A580388L727m640j1172J2700r731k1958R793r866l7317k791r0k4817j0921
11548A473305K3061R922J122l247k1115m3931k3499K854K213K95J8940k303j8904
11535A418713N147P743J1386n085o866l36j6369l902J1951j1304m2008k9284q453
$$ plain form
11522 1331333 1326666 1337125 1366517 1370543 1369318 1337269 1324711 1315042 1336989 1353291 1358437 1365224
11510 1365224 1385537 1371886 1356857 1352271 1351137 1358072 1344777 1335357 1327508 1311103 1314466 1302962
11498 1302962 1305936 1308975 1299183 1284152 1304311 1343806 1355757 1340937 1332353 1330455 1321613 1297847
11486 1297847 1287845 1269446 1268304 1252526 1259358 1281923 1286819 1260069 1239336 1243731 1241647 1255311
11474 1255311 1264303 1253095 1254630 1241504 1230967 1226764 1223474 1211607 1180242 1184265 1190243 1176462
11462 1176462 1201440 1240874 1236294 1211632 1180622 1172761 1173460 1178206 1169418 1168507 1160983 1172745 1176149
11449 1176149 1189283 1196188 1154809 1117869 1107153 1102878 1090951 1107945 1113359 1115755 1129931 1124947
11437 1124947 1112064 1105013 1107411 1116374 1094045 1082194 1087257 1086971 1067865 1091670 1123201 1127753 1121671
$$ packed form
11522A331333m667J0459K9392M026j225l2049j2558r669K1947J6302N146O787
11510A365224K0313j3651j5029m586j134O935j3295r420p849j6405L363j1504
11498A302962K974L039r792j5031K0159L9495J1951j4820q584j898q842k3766
11486A297847j0002j8399j142j5778O832K2565M896k6750k0733M395k084J3664
11474A255311Q992j1208J535j3126j0537m203l290j1867l1365M023N978j3781
11462A176462K4978L9434m580k4662l1010p861O99M746q788r11p524J1762L404
11449A176149J3134O905m1379l6940j0716m275j1927J6994N414K396J4176m984
11437A124947j2883p051K398Q963k2329j1851N063k86j9106K3805L1531M552o082
$$ plain form
11424 1121671 1106352 1088699 1098101 1080862 1058179 1072418 1089471 1112317 1143902 1134753 1123179 1115087
11412 1115087 1120515 1122414 1086129 1064481 1083058 1094205 1086739 1063412 1057940 1042129 1029778 1035575
11400 1035575 1008704 1022660 1021711 1013632 1010471 1005394 1022372 1002335 1002693 1025593 1039818 1006141 985301
11387 985301 997697 1010148 984170 981674 967837 940553 923601 892572 899545 931310 940686 949884
11375 949884 946859 946355 946603 931635 926841 920157 907135 892061 925303 966408 945715 934825 934959
11362 934959 964342 988738 959408 942934 931614 925970 937852 932748 923485 897279 889726 881314
11350 881314 870011 863122 881799 919890 907644 874769 869744 894107 869875 840487 854923 896862
11338 896862 927069 898954 873704 859273 866856 849828 857250 884947 898514 908711 907686 877968
$$ packed form
11424A121671j5319j7653R402j7239k2683J4239J7053K2846L1585r149j1574q092
11412A115087N428J899l6285k1648J8577J1147p466k3327n472j5811j2351N797
11400A035575k6871J3956r49q079l161n077J6978k0037L58K2900J4225l3677k0840
11387I85301J2396J2451k5978k496j3837k7284j6952l1029O973L1765R376R198
11375I49884l025n04K48j4968m794o684j3022j5074L3242M1105k0693j0890J34
11362I34959K9383K4396k9330j6474j1320n644J1882n104r263k6206p553q412
11350H81314j1303o889J8677L8091j2246l2875n025K4363k4232k9388J4436M1939
11338H96862L0207k8115k5250j4431P583j7028P422K7697J3567J0197j025k9718
$$ plain form
11326 877968 830903 813632 813180 827320 833367 810761 829313 845719 882067 902298 887745 868126
11314 868126 827323 816185 790713 782658 809393 836159 820536 806733 815233 825568 812842 811722
11302 811722 805465 787469 778806 743271 728607 752927 766535 743947 766756 798547 793190 770273
11290 770273 753266 758627 765314 798124 806062 782649 767195 759598 780536 777018 764260 765987 766028
11277 766028 773622 772135 768309 768677 777484 783479 777964 778438 779455 773869 760846 761866 772435 770780
11263 770780 754776 731396 718434 715993 715153 744143 757416 766073 749074 725637 721789 728404 703119
11250 703119 683612 700880 735615 714155 719257 712264 695655 700497 698879 686935 706661 708987
11238 708987 692637 679193 669800 677634 670747 666313 656132 657339 678763 667033 640147 654852
$$ packed form
11326H77968m7065j7271m52J4140O047k2606J8552J6406L6348K0231j4553j9619
11314H68126m0803j1138k5472q055K6735K6766j5623j3803Q500J0335j2726j120
11302H11722o257j7996q663l5535j4664K4320J3608k2588K2809L1791n357k2917
11290G70273j7007N361O687L2810P938k3413j5454p597K0938l518j2758J727M1
11277G66028P594j487l826L68Q807N995n515M74J017n586j3023J020J0569j655
11263G70780j6004k3380j2962k441q40K8990J3273Q657j6999k3437l848O615k5285
11250G03119j9507J7268L4735k1460N102o993j6609M842j618j1944J9726K326
11238G08987j6350j3444r393P834o887m434j0181J207K1424j1730k6886J4705
$$ plain form
11226 654852 678748 670933 651197 653662 672973 663116 680983 683630 680323 697018 690341 656574 646798
11213 646798 663186 672892 683859 677444 648971 626265 639935 654995 660107 644288 642932 615855
11201 615855 620194 644572 621446 595866 616266 598431 593222 598740 626870 629702 653374 658632
11189 658632 661541 660151 649432 647765 650969 644546 641603 651263 642301 625746 627639 626286 608336
11176 608336 599288 598479 619834 627624 629457 614868 622307 609674 596912 593641 582990 604063 590610
11163 590610 595437 623873 613606 613402 613735 612437 594558 592988 567699 575798 604075 608573 620335
11150 620335 623255 613528 599724 591341 559513 558566 544701 528386 553854 600934 605894 595858 559140
11137 559140 562296 553785 552626 565603 575431 578481 566195 558547 556549 529917 548100 580617 576180
$$ packed form
11226F54852K3896p815j9736K465J9311r857J7867K647l307J6695o677l3767r776
11213F46798J6388R706J0967o415k8473k2706J3670J5060N112j5819j356k7077
11201F15855M339K4378k3126k5580K0400j7835n209N518K8130K832K3672N258
11189F58632K909j390j0719j667L204o423k943R660q962j6555J893j353j7950
11176F08336r048q09K1355P790J833j4589P439j2633j2762l271j0651K1073j3453
11163E90610M827K8436j0267k04L33j298j7879j570k5289Q099K8277M498J1762
11150F20335K920r727j3804q383l1828r47j3865j6315K5468M7080M960j0036l6718
11137E59140L156q511j159J2977R828L050j2286p648j998k6632J8183L2517m437
$$ plain form
11124 576180 569762 541598 566694 574970 563175 591326 604862 569623 529223 501785 495474 532400
11112 532400 571025 585328 567129 549305 545040 558016 552653 543690 537313 558182 560757 545168
11100 545168 547182 523387 538187 530225 533584 538217 524903 528008 538628 546639 542918 536575 536794
11087 536794 559090 538886 539819 551532 546706 534036 547484 560206 559073 565262 590718 563545
11075 563545 533675 499259 471000 470098 471095 463212 450888 467919 481779 472285 480912 483613 508380
11062 508380 500300 489711 498321 508348 536069 549692 507786 492328 497731 512997 483174 479989
11050 479989 476932 505614 528095 551536 569762 587842 600141 580289 569571 565497 577078 594877
11038 594877 584212 548045 558097 596834 643032 661098 640209 621335 629656 623131 615934 605213
$$ packed form
11124E76180o418k8164K5096Q276j1795K8151J3536l5239m0400k7438o311L6926
11112E32400L8625J4303j8199j7824m265J2976n363q963o377K0869K575j5589
11100E45168K014k3795J4800p962L359M633j3314L105J0620Q011l721o343K19
11087E36794K2296k0204R33J1713m826j2670J3448J2722j133O189K5456k7173
11075E63545k9870l4416k8259r02R97p883j2324J7031J3860r494Q627K701K4767
11062E08380q080j0589Q610J0027K7721J3623m1906j5458N403J5266k9823l185
11050D79989l057K8682K2481K3441J8226J8080J2299j9852j0718m074J1581J7799
11038E94877j0665l6167J0052L8737M6198J8066k0889j8874Q321o525p197j0721
$$ plain form
11026 605213 585012 581595 605121 649007 691754 741274 754869 717286 679552 667437 641733 600276
11014 600276 604260 604640 603151 597861 616416 622789 585561 562921 560608 539178 499708 461038 450290
11001 450290 453550 478442 509733 511941 526611 508290 482709 484365 452784 444811 427771 394514
10989 394514 384431 407487 425604 408612 415354 426086 440481 443127 430270 407325 429470 422409
10977 422409 422777 416185 420031 427290 437330 425851 403601 405786 395493 401028 413160 418658 403655
10964 403655 378189 380575 410216 412358 419859 433198 414734 413774 418625 423891 403860 410930 415945
10951 415945 447315 416995 396218 400970 427527 447380 433310 431523 407107 396091 397714 393605
10939 393605 389509 395753 392748 398562 398037 392393 406903 381212 368409 375539 382558 397154 381779
$$ packed form
11026F05213k0201l417K3526M3886M2747M9520J3595l7583l7734j2115k5704m1457
11014F00276L984L80j489n290J8555O373l7228k2640k313k1430l9470l8670j0748
11001D50290L260K4892L1291K208J4670j8321k5581J656l1581p973j7040l3257
10989C94514j0083K3056J8117j6992O742J0732J4395K646j2857k2945K2145p061
10977D22409L68o592L846P259J0040j1479k2250K185j0293N535J2132N498j5003
10964D03655k5466K386K9641K142P501J3339j8464r60M851N266k0031P070N015
10951D15945L1370l0320k0777M752K6557J9853j4070j787k4416j1016J623m109
10939C93605m096O244l005N814n25n644J4510k5691j2803P130P019J4596j5375
$$ plain form
10926 381779 371038 377374 390822 403657 411363 378770 367637 360744 347900 374503 381268 383792
10914 383792 374806 385374 394564 393494 399654 418522 399507 386907 382532 353934 329139 326534 324018
10901 324018 341577 354308 346221 329913 305072 326854 317433 324394 336012 340560 371145 387243
10889 387243 401947 401487 400639 389265 355306 367306 355843 337157 338309 365326 379937 379431 368499
10876 368499 351611 352651 340983 350023 366000 344005 372890 405427 401538 393816 368055 392741
10864 392741 381616 367049 378762 390625 411432 399684 376475 379398 426057 405430 409893 398528
10852 398528 392754 368198 363865 377809 403756 430489 423249 412046 420195 425325 402160 353530
10840 353530 335806 328297 349046 358022 361690 368133 334522 327910 349132 367690 390561 402548
$$ packed form
10926C81779j0741O336J3448J2835P706l2593j1133o893j2844K6603O765K524
10914C83792q986J0568R190j070O160J8868j9015j2600m375k8598k4795k605k516
10901C24018J7559J2731q087j6308k4841K1782r421O961J1618M548L0585J6098
10889C87243J4704m60q48j1374l3959J2000j1463j8686J152K7017J4611n06j0932
10876C68499j6888J040j1668R040J5977k1995K8885L2537l889p722k5761K4686
10864C92741j1125j4567J1713J1863K0807j1748k3209K923M6659k0627M463j1365
10852C98528n774k4556m333J3944K5947K6733p240j1203Q149N130k3165m8630
10840C53530j7724p509K0749Q976L668O443l3611o612K1222J8558K2871J1987
$$ plain form
10828 402548 417200 417377 393118 380556 381518 376145 350253 357964 336951 346441 366430 383298 357863
10815 357863 363734 354927 360187 352386 356650 378110 393581 390245 376930 380272 359580 321203 353730
10802 353730 382415 379795 367910 350641 340574 384054 388152 379229 378235 383177 389687 408249 406433
10789 406433 397182 388877 361835 376968 393100 381101 362683 358511 380362 386552 378438 373608 360031
10776 360031 369759 397538 397599 430240 443382 424879 398807 376854 360839 367327 367634 365782 365397
10763 365397 374357 369158 389270 374584 362585 372339 369558 351212 338098 354661 375485 362090
10751 362090 355468 362478 389948 399775 404073 393951 389027 385868 374820 387595 383412 373163 381468
10738 381468 377201 377494 385620 384982 371178 359560 346301 336526 339061 339979 333566 353190 378114 402604
$$ packed form
10828D02548J4652J77k4259j2562R62n373k5892P711k1013R490J9989J6868k5435
10815C57863N871q807N260p801M264K1460J5471l336j3315L342k0692l8377L2527
10802C53730K8685k620j1885j7269j0067M3480M098q923r94M942O510J8562j816
10789D06433r251q305k7042J5133J6132j1999j8418m172K1851O190q114m830j3577
10776C60031R728K7779O1L2641J3142j8503k6072k1953j6015O488L07j852l85
10763C65397Q960n199K0112j4686j1999R754k781j8346j3114J6563K0824j3395
10751C62090o622P010K7470R827M298j0122m924l159j1048J2775m183j0249Q305
10738C81468m267K93Q126o38j3804j1618j3259r775K535R18o413J9624K4924K4490
$$ plain form
10724 402604 452860 441316 406483 411155 424125 434916 452138 448132 460324 477075 461385 429154
10712 429154 413694 402089 391727 380302 399531 442917 461451 460890 458403 456677 475356 456873
10700 456873 441164 445169 444670 430790 458841 483070 475638 467186 477425 482412 478877 483807 508893
10687 508893 545217 552389 548216 543688 505979 507687 506104 505745 499465 496055 479006 489728 508732
10674 508732 513954 518013 509432 507680 534516 544804 545466 556752 580876 594850 584632 604333 620762
10661 620762 662598 671919 655525 653495 670137 714165 776419 867571 976558 1056504 1117295 1132422
10649 1132422 1108699 1081700 1049720 973280 924980 907555 919429 931578 942017 964191 999015
10638 999015 1036347 1094551 1142284 1191554 1274517 1406073 1537471 1664804 1762933 1832228 1907918
$$ packed form
10724D02604N0256j1544l4833M672J2970J0791J7222m006J2192J6751j5690l2231
10712D29154j5460j1605j0362j1425J9229M3386J8534n61k487j726J8679j8483
10700D56873j5709M005m99j3880K8051K4229p432q452J0239M987l535M930K5086
10687E08893L6324P172m173m528l7709J708j583l59o280l410j7049J0722J9004
10674E08732N222M059q581j752K6836J0288O62J1286K4124J3974j0218J9701J6429
10661F20762M1836R321j6394k030J6642M4028O2254R1152J08987P9946O0791J5127
10649A132422k3723k6999l1980p6440m8300j7425J1874J2149J0439K2174L4824
10638I99015L7332N8204M7733M9270Q2963J31556J31398J27333R8129O9295P5690
$$ plain form
10627 1907918 2031655 2193650 2418367 2693185 3042953 3542434 4230316 5186793 6442471
10618 6442471 8084993 10146597 12565551 14902576 16456504 16793702 16127238 15164428 14515629
10609 14515629 14501613 15286009 17040562 19915981 23999966 28972606 33603415 36039839
10601 36039839 35179895 31965327 28388539 25783697 24654131 25060754 27079560 30868264
10593 30868264 36316151 42651553 47978442 49663282 46456566 40163871 33729744 28819513
10585 28819513 25793062 24499659 24747488 26445722 29414666 32850940 35281703 35058040
10577 35058040 31647835 26492722 21525012 17794253 15418366 14182137 13827073 14172110
10569 14172110 14978967 15833538 16149302 15403486 13508644 10980283 8575975 6652566 5250894
$$ packed form
10627A907918J23737J61995K24717K74818L49768M99481O87882R56477J255678
10618F442471J642522K061604K418954K337025J553928L37198o66464r62810o48799
10609A4515629j4016P84396J754553K875419M083985M972640M630809K436424
10601C6039839q59944l214568l576788k604842j129566M06623K018806L788704
10593C0868264N447887O335402N326889J684840l206716o292695o434127m910231
10585B8819513l026451j293403K47829J698234K968944L436274K430763k23663
10577C5058040l410205n155113m967710l730759k375887j236229l55064L45037
10569A4172110Q06857Q54571L15764p45816j894842k528361k404308j923409j401672
$$ plain form
10560 5250894 4255347 3506335 2970266 2554348 2247588 2027071 1840444 1679266 1566983
10551 1566983 1442864 1314609 1214783 1155271 1072553 1001941 967436 935092 903756 906832 869533
10540 869533 827366 802111 782251 758427 729109 672137 647835 624577 636760 605508 570250
10529 570250 557527 534198 505134 457846 424593 411425 398865 379504 350730 341761 354315 352940
10517 352940 339849 318675 311385 264812 242307 239975 249397 229972 184890 154254 151865 170996
10505 170996 191975 167883 120721 97494 85883 96700 122573 124877 114793 112516 123454 93684
10493 93684 48390 32139 30949 30783 26420 28595 15269 38939 68144 101137 85602 68927 55244
10480 55244 50225 46783 65605 119914 116827 101506 85090 84850 107281 94291 89066 92587 94951
$$ packed form
10560E250894r95547p49012n36069m15918l06760k20517j86627j61178j12283
10551A566983j24119j28255r9826n9512q2718p0612l4505l2344l1336L076l7299
10540H69533m2167k5255j9860k3824k9318n6972k4302k3258J2183l1252l5258
10529E70250j2723k3329k9064m7288l3253j3168j2560j9361k8774q969J2554j375
10517C52940j3091k1174p290m6573k2505k332R422j9425m5082l0636k389J9131
10505A70996K0979k4092m7162k3227j1611J0817K5873K304j0084k277J0938k9770
10493I3684m5294j6251j190j66m363K175j3326K3670K9205L2993j5535j6675j3683
10480E5244n019l442J8822N4309l087j5321j6416k40K2431j2990n225L521K364
$$ plain form
10467 94951 97774 78750 74610 73312 92453 90486 92959 92284 105797 120123 132658 117355 111877
10454 111877 100951 92091 113190 111710 68298 44225 29056 46979 45960 61784 82520 115404
10442 115404 105198 77613 79455 77712 90196 93038 81574 72770 86076 89864 88815 91226 90356
10429 90356 83261 101065 103461 81457 67929 60094 62363 68231 77681 77323 71229 62280 30417 4942
10415 4942 -6889 9211 48524 56698 50169 44114 43075 43285 50954 31716 36343 46723 62485
10402 62485 87433 94412 76906 53083 15331 8640 45702 86982 82879 66794 55876 67572
10390 67572 93163 86600 60830 79589 93892 72008 68249 66166 53788 41277 51105 47227 51739
10377 51739 60442 61695 64863 64094 89730 88044 100946 114553 85051 67948 42925 35873 37381
$$ packed form
10467I4951K823j9024m140j298J9141j967K473o75J3513J4326J2535j5303n478
10454A11877j0926q860K1099j480m3412k4073j5169J7923j019J5824K0736L2884
10442A15404j0206k7585J842j743J2484K842j1464q804J3306L788j049K411q70
10429I0356p095J7804K396k2004j3528p835K269N868R450l58o094q949l1863k5475
10415D942j1831J6100L9313Q174o529o055j039K10P669j9238M627J0380J5762
10402F2485K4948O979j7506k3823l7752o691L7062M1280m103j6085j0918J1696
10390F7572K5591o563k5770J8759J4303k1884l759k083j2378j2511R828l878M512
10377E1739Q703J253L168p69K5636j686J2902J3607k9502j7103k5023p052J508
$$ plain form
10364 37381 66456 72910 66145 63197 58422 52965 38392 62795 96533 123408 111088 86030 75898
10351 75898 81700 72692 78032 69166 80627 93213 98843 87341 109264 102017 53063 56305 82345
10338 82345 66809 53456 36217 28556 35885 40517 25749 27913 2664 -21925 -4684 32429
10326 32429 59897 58817 80815 87479 83134 72762 69816 53725 47950 62110 55935 37240 63021
10313 63021 88164 83147 73629 81640 84124 84744 62870 61693 56621 63290 53495 71037 67402 50400
10299 50400 36758 -577 10887 30110 50694 59456 69656 74702 60631 52949 49446 26777
10287 26777 33902 58137 58435 68828 82393 105157 100834 67208 68280 78019 81529 80904 72947 55996
10273 55996 62860 91399 112761 141492 167394 146071 100963 101899 106409 96326 117200 128712
$$ packed form
10364C7381K9075O454o765k948m775n457j4573K4403L3738K6875j2320k5058j0132
10351G5898N802r008N340q866J1461J2586N630j1502K1923p247m8954L242K6040
10338H2345j5536j3353j7239p661P329M632j4768K164k5249k4589J7241L7113
10326C2429K7468j080K1998O664m345j0372k946j6091n775J4160o175j8695K5781
10313F3021K5143n017r518Q011K484O20k1874j177n072O669r795J7542l635j7002
10299E0400j3642l7335J1464J9223K0584Q762J0200N046j4071p682l503k2669
10287B6777P125K4235K98J0393J3565K2764m323l3626J072R739L510o25p957j6951
10273E5996O864K8539K1362K8731K5902k1323m5108R36M510j0083K0874J1512
$$ plain form
10261 128712 151343 145069 127578 113456 84821 56321 63193 83084 96201 84938 75392 75765
10249 75765 55369 66483 85667 79241 98682 104215 87044 94979 99332 71054 44963 37172 38804
10236 38804 24016 6352 15010 17432 2707 5550 38192 42315 33453 35812 41295 41874 59997
10223 59997 81320 91532 60037 71195 125957 101718 91814 87724 86485 80094 58986 61275 109244
10210 109244 131562 124793 85983 68484 78987 62158 58484 49892 52764 72016 62475 31608
10198 31608 27486 34208 13785 26655 59910 77900 51956 65852 78248 60932 86739 84189
10186 84189 95876 122108 96959 42725 59813 95873 107804 117018 117474 101756 113581 145230
10174 145230 141911 134583 127381 115551 124070 172210 212122 235969 266952 275317 259943 242648
$$ packed form
10261A28712K2631o274j7491j4122k8635k8500O872J9891J3117j1263r546L73
10249G5765k0396J1114J9184o426J9441N533j7171P935M353k8278k6091p791J632
10236C8804j4788j7664Q658K422j4725K843L2642M123q862K359N483N79J8123
10223E9997K1323J0212l1495J1158N4762k4239r904m090j239o391k1108K289M7969
10210A09244K2318o769l8810j7499J0503j6829l674q592K872J9252r541l0867
10198C1608m122O722k0423J2870L3255J7990k5944J3896J2396j7316K5807k550
10186H4189J1687K6232k5149n4234J7088L6060J1931R214M56j5718J1825L1649
10174A45230l319p328p202j1830Q519M8140L9912K3847L0983Q365j5374j7295
$$ plain form
10162 242648 220012 220506 200867 200553 201821 238515 302715 323616 344236 352270 326640 299147 272546
10149 272546 244372 210087 197634 191536 210817 237373 237767 223239 231880 204584 152569 113085
10137 113085 131109 122833 119137 130366 162625 161768 125382 119450 141820 138641 114727 84986 48522
10124 48522 32106 62802 70797 78469 78521 72906 71668 45488 34185 54226 47478 30535 54077
10111 54077 88061 100108 99674 90031 83081 67603 59260 39238 25388 33843 46761 42810 6146
10098 6146 -18104 34981 44236 25067 57651 83017 79875 60182 39816 46694 44798 42462 61101
10085 61101 80067 92016 76403 62562 52180 67011 70074 68800 54170 70229 81546 67043
10073 67043 43861 49322 39217 35715 48544 44248 78843 86022 89301 75188 60967 49745 49986
$$ packed form
10162B42648k2636M94j9639l14J268L6694O4200K0901K0620Q034k5630k7493k6601
10149B72546k8174l4285j2453o098J9281K6556L94j4528Q641k7296n2015l9484
10137A13085J8024q276l696J1229L2259q57l6386n932K2370l179k3914k9741l6464
10124D8522j6416L0696P995P672N2n615j238k6180j1303K0041o748j6943K3542
10111E4077L3984J2047m34r643o950j5478q343k0022j3850Q455J2918l951l6664
10098F146k4250N3085R255j9169L2584K5366l142j9693k0366O878j896k336J8639
10085F1101J8966J1949j5613j3841j0382J4831L063j274j4630J6059J1317j4503
10073F7043k3182N461j0105l502J2829m296L4595P179L279j4113j4221j1222K41
$$ plain form
10060 49986 39043 35249 48248 54802 66011 44870 54033 60681 32893 33016 40736 44583 32011
10047 32011 34343 39253 34956 46132 36701 50027 41430 23480 29320 8358 2286 11631 24822
10034 24822 30793 49875 69549 85322 76656 58591 53109 53576 43313 48879 39374 35333 42968
10021 42968 39554 20031 -8856 -5844 23863 36976 62783 52804 56285 31442 30866 44973 43573
10008 43573 43787 44689 66036 59632 46523 7478 22028 30696 35941 49106 46946 51071 31262
9995 31262 23673 53563 73595 54647 33584 22740 17600 31251 41018 28949 42130 63314
9983 63314 58203 41309 8394 13674 28477 27561 49636 58814 21998 29843 34219 24326 59406
9970 59406 67021 42783 49313 47155 53934 54013 28572 -754 18122 22818 -1028 -9912 14181 23511
$$ packed form
10060D9986j0943l794J2999O554J1209k1141R163O648k7788J23P720L847j2572
10047C2011K332M910m297J1176r431J3326q597j7950N840k0962o072R345J3191
10034B4822N971J9082J9674J5773q666j8065n482M67j0263N566r505m041P635
10021D2968l414j9523k8887L012K9707J3113K5807r979L481k4843n76J4107j400
10008D3573K14R02K1347o404j3109l9045J4550Q668N245J3165k160M125j9809
9995C1262p589K9890K0032j8948k1063j0844n140J3651R767j2069J3181K1184
9983F3314n111j6894l2915N280J4803r16K2075R178l6816P845M376r893L5080
9970E9406P615k4238O530k158O779P9k5441k9326J8876M696k3846q884K4093R330
$$ plain form
9956 23511 3930 17465 59635 54815 31418 32420 57327 58817 28341 34227 33408 22111 51604
9943 51604 56577 40637 49122 39888 7362 34653 97319 91509 105131 102306 70989 41747 47875
9930 47875 103100 147829 172584 200895 166450 109655 97269 86710 105124 81644 66595 66902
9918 66902 41391 27660 30463 50427 47132 46675 60680 67821 56459 50416 53219 65188 47850
9905 47850 41816 44695 47687 26079 14982 31702 47682 59387 59281 29278 8494 8443 37048
9892 37048 26536 24409 16239 553 -6274 -25080 -22763 19838 42855 35509 43071 36605 30755
9879 30755 21794 35590 36983 46156 19055 21469 38140 31642 29041 43529 52572 33938 14739
9866 14739 11222 -5922 13503 7272 -5833 -1083 11890 9424 22425 44295 64485 50769 32146
$$ packed form
9956B3511j9581J3535M2170m820k3397J002K4907J490l0476N886q19j1297K9493
9943E1604M973j5940Q485r234l2526K7291O2666n810J3622k825l1317k9242O128
9930D7875N5225M4729K4755K8311l4445n6795j2386j0559J8414k3480j5049L07
9918F6902k5511j3731K803J9964l295m57J4005P141j1362o043K803J1969j7338
9905D7850o034K879K992k1608j1097J6720J5980J1705j06l0003k0784n1K8605
9892C7048j0512k127q170j5686o827j8806K317M2601K3017p346P562o466n850
9879C0755q961J3796J393R173k7101K414J6671o498k601J4488R043j8634j9199
9866A4739l517j7144J9425o231j3105M750J2973k466J3001K1870K0190j3716j8623
$$ plain form
9853 32146 13815 -2743 -7255 -20542 -23912 -2577 18702 43158 66108 72487 72296 69870 53780
9840 53780 56709 62854 45076 47035 32598 15952 19517 20236 20373 13112 17760 22182 15342 15841 23785
9825 23785 29234 47386 64299 32848 13869 13050 12377 21344 30523 -1279 -25738 -25767 -20876 -8817
9811 -8817 -1953 -3136 -4669 1073 15721 7512 -15288 -1512 -2557 9772 22746 -295 16730
9798 16730 41786 53163 38973 24846 19473 27993 46443 27189 18668 43799 67501 59734 52599
9785 52599 35913 26831 21326 5805 17700 41366 62050 72688 64736 45785 34944 11463
9773 11463 30161 77889 77497 32391 29172 45264 48686 44063 37864 52255 35671 -8287 -5999
9760 -5999 -12660 -9624 6847 32090 41581 24123 14359 14330 14265 1970 -602 8651 25785 26493 2295
$$ packed form
9853C2146j8331j6558m512j3287l370K1335K1279K4456K2950O379j91k426j6090
9840E3780K929O145j7778J959j4437j6646L565P19J37p261M648M422o840M99P944
9825B3785N449J8152J6913l1451j8979q19o73Q967R179l1802k4459k9M891J2059
9811h817O864j183j533N742J4648q209k2800J3776j045J2329J2974k3041J7025
9798A6730K5056J1377j4190j4127n373Q520J8450j9254q521K5131K3702p767p135
9785E2599j6686r082n505j5521J1895K3666K0684J0638p952j8951j0841k3481
9773A1463J8698M7728l92m5106l219J6092L422m623o199J4391j6584m3958K288
9760e999o661L036J6471K5243R491j7458r764k9o5j2295k572R253J7134P08k4198
$$ plain form
9745 2295 -27290 -25399 -3518 22616 15522 17239 33041 26967 651 -11789 398 19864 10900
9732 10900 13999 10419 -2235 -7582 261 21317 48677 27897 -23366 -6026 43163 49013 32710
9719 32710 30701 22049 15682 28358 18689 -626 -12973 -10025 -5438 -15165 -12424 -10711 -11734 -16791
9705 -16791 -22466 -24440 -3763 3702 3701 14004 -2080 -22570 -36447 -26296 -31000 -11553 12721
9692 12721 3441 16735 19206 21183 26824 26382 -6149 -21145 -10665 25688 40896 43440 27060
9679 27060 34996 47610 27066 20670 6040 19305 44083 45598 54207 71339 80175 101501 121916
9666 121916 125447 140948 123933 93442 106740 108613 129768 188762 239036 295003 357173 500759
9654 500759 743414 1149238 1803848 2567462 2851866 2201409 1326903 775696 513705 375758
$$ packed form
9745B295k9585J891K1881K6134p094J717J5802o074k6316j2440J2187J9466q964
9732A0900L099l580j2654n347P843K1056K7360k0780n1263J7340M9189N850j6303
9719C2710k009q652o367J2676r669j9315j2347K948M587r727K741J713j023n057
9705a6791n675j974K0677P465jJ0303j6084k0490j3877J0151m704J9447K4274
9692A2721r280J3294K471J977N641m42l2531j4996J0480L6353J5208K544j6380
9679B7060P936J2614k0544o396j4630J3265K4778J515Q609J7132Q836K1326K0415
9666A21916L531J5501j7015l0491J3298J873K1155N8994N0274N5967O2170J43586
9654E00759K42655M05824O54610P63614K84404o50457q74506n51207k61991j37947
$$ plain form
9644 375758 260458 176467 128107 122999 114644 120540 108902 97425 71835 70083 76983 54186
9632 54186 74926 91985 106966 107015 104050 87465 60762 47254 30935 38961 39262 32278 60837
9619 60837 66808 33624 17192 7765 42954 57600 35051 36033 54858 83378 60048 66526 64523
9606 64523 40584 20937 -2423 5163 7634 8457 20870 -2936 -23417 -1923 19173 25468 8270
9593 8270 5928 16061 35483 46728 20666 2204 -23910 -21135 -39 2975 4974 -2973 12446
9580 12446 36747 42216 37247 11189 12971 16313 35696 41925 37472 30775 30651 34582 44625 27023
9566 27023 -5767 17074 -4250 4536 -1092 -15708 1404 3040 -6376 -9896 15591 9920 1508
9553 1508 5507 -12598 -11551 -4668 13849 11057 4485 -2939 -8263 30114 32180 26336 42691 21656
$$ packed form
9644C75758j15300q3991m8360n108q355N896j1638j1477k5590j752O900k2797
9632E4186K0740J7059J4981M9k965j6585k6703j3508j6319Q026L01o984K8559
9619F0837N971l3184j6432r427L5189J4646k2549R82J8825K8520k3330O478k003
9606F4523k3939j9647k3360P586K471Q23J2413k3806k0481K1494K1096O295j7198
9593H270k342J0133J9422J1245k6062j8462k6114K775K1096L014J999p947J5419
9580A2446K4301N469m969k6058J782L342J9383O229m453o697j24L931J0043j7602
9566B7023l2790K2841k1324Q786n628j4616J7112J636r416l520K5487n671q412
9553A508L999j8105J047O883J8517k792o572p424n324L8377K066n844J6355k1035
$$ plain form
9539 21656 7816 -7883 -22674 -18411 -15399 -37544 -18668 -25418 -27337 8744 25623 14044 -16552
9526 -16552 -20584 -7725 6421 17873 12491 12812 -1793 -13019 -14079 -9523 -9595 1010 31019 32811
9512 32811 36510 30536 17656 10774 1125 7995 352 2167 17767 -136 -6372 -12256 -27923 -16689
9498 -16689 10493 -6674 -1074 10735 -12384 15268 9719 7512 25946 42915 36826 22239 19727
9485 19727 8613 11616 1177 -2536 4515 -1448 26583 58447 76921 49985 41787 44216 41823
9472 41823 19122 35473 35153 34882 13649 2191 7378 5852 7859 8584 23855 27216 32252 32854
9458 32854 5168 20018 37930 33739 22964 2979 -21606 -28563 730 6321 9651 -125 -8561
9445 -8561 5188 24025 17451 2814 -8002 1254 13793 32857 22292 16662 20131 32053 31724
$$ packed form
9539B1656j3840j5699j4791M263L012k2145J8876o750j919L6081J6879j1579l0596
9526a6552m032J2859J4146J1452n382L21j4605j1226j060M556p2J0605L0009J792
9512C2811L699n974j2880o882r649O870p643J815J5600j7903o236n884j5667J1234
9498a6689K7182j7167N600J1809k3119K7652n549k207J8434J6969o089j4587k512
9485A9727j1114L003j0439l713P051n963K8031L1864J8474k6936q198K429k393
9472D1823k2701J6351l20k71k1233j1458N187j526K007P25J5271L361N036O02
9458C2854k7686J4850J7912m191j0775j9985k4585o957K9293N591L330r776q436
9445h561J3749J8837o574j4637j0816R256J2539J9064j0565n630L469J1922l29
$$ plain form
9432 31724 34792 36792 19746 -184 -20033 -23932 9144 14570 8604 1870 7400 24413 16401
9419 16401 -159 -22946 -19294 -17047 -14509 -25287 -23484 -28319 -18501 -6195 13616 26996 33214
9406 33214 33263 60060 63078 25956 31794 19197 30895 28324 -8427 -22791 -21091 -3249 -16787
9393 -16787 -33936 -12792 15359 -4653 -11824 -19107 -27567 -14835 -29139 -12842 13679 -2635
9381 -2635 -6354 8320 -8275 11811 5535 -3870 -17769 -16348 -15428 -21409 -25842 -32051 -26702 -7120
9367 -7120 -2789 -6597 -18131 -18573 -13768 -1676 6183 8342 15636 17436 11414 -11355 -7203 -14467
9353 -14467 -37315 -24307 -15211 -19455 -8315 5594 25182 14237 -4452 3023 -4413 3417 -4285
9340 -4285 -18050 13139 14028 -4989 1659 -1842 -832 -9767 -43334 -43048 -34749 -35531 -25268 -5324
$$ packed form
9432C1724L068K000j7046j9930j9849l899L3076N426n966o734N530J7013q012
9419A6401j6560k2787L652K247K538j0778J803m835R818J2306J9811J3380O218
9406C3214M9K6797L018l7122N838j2597J1698k571l6751j4364J700J7842j3538
9393a6787j7149K1144K8151k0012p171p283q460J2732j4304J6297K6521j6314
9381b635l719J4674j6595K0086o276r405j3899J421R20n981m433o209N349J9582
9367g120M331l808j1534m42M805J2092P859K159P294J800o022k2769M152p264
9353a4467k2848J3008R096m244J1140J3909J9588j0945j8689P475p436P830p702
9340d285j3765L1189Q89j9017O648l501J010q935l3567K86Q299p82J0263J9944
$$ plain form
9326 -5324 7239 25228 27369 41311 11780 1554 1616 21712 29014 29020 31744 26619 13848 23108
9312 23108 22935 5931 9443 21920 42666 19330 2835 7077 20 31406 24440 -4480 -5531
9299 -5531 10351 15836 -6100 -27674 -14392 -2624 -10236 -1084 12663 20791 42566 36667 10873
9286 10873 12001 -3925 -1164 5094 32504 30308 23591 33272 47207 40967 33941 6493 -4349
9273 -4349 141 -30825 -40969 -13372 16609 16277 11675 9869 9710 -2048 -28502 -37530 -36316 -12559
9259 -12559 18789 30136 35887 39613 15164 11449 10573 6805 -2236 -3272 15510 7111 17825 24664
9245 24664 31713 -10683 -40049 -34695 -28378 -20156 -11676 -22144 -13348 10321 16841 14983 25886
9232 25886 31470 44298 52485 42853 8664 17306 8720 -9077 -22224 -5861 -17230 -15499 -1797
$$ packed form
9326e324J2563J7989K141J3942k9531j0226O2K0096P302OK724n125j2771R260
9312B3108j73j7004L512J2477K0746k3336j6495M242p057L1386o966k8920j051
9299e531J5882N485k1936k1574J3282J1768p612R152J3747Q128K1775n899k5794
9286A0873J128j5926K761O258K7410k196o717R681J3935o240p026k7448j0842
9273d349M490l0966j0144K7597K9981l32m602j806j59j1758k6454r028J214K3757
9259a2559L1348J1347N751L726k4449l715q76l768r041j036J8782q399J0714O839
9245B4664P049m2396k9366N354O317Q222Q480j0468Q796K3669O520j858J0903
9232B5886N584J2828Q187r632l4189Q642q586j7797j3147J6363j1369J731J3702
$$ plain form
9219 -1797 -4127 -3480 3425 3987 7077 -12589 2770 19221 14709 24134 42847 31575 37611 42305
9205 42305 31688 6822 -21747 -50488 -26734 -11649 -8305 -15485 -17226 -23468 -11469 -26202 -20461
9192 -20461 -12549 -12962 -1527 -577 -6790 -20129 -18180 1232 -6251 12312 46311 31094 5265
9179 5265 -6463 15662 21448 17008 19652 3097 -4255 -14856 1398 1992 -24715 -61731 -64889
9166 -64889 -38152 -47252 -24878 -1499 18996 31530 23091 2636 -35 6041 15410 -9793 -19662
9153 -19662 5958 43947 38951 33365 27214 1992 -7412 -8344 -8885 15728 19242 -9926 -25205 -30074
9139 -30074 -17329 3111 6995 11219 34720 30458 5045 -22012 -40670 -38499 -39142 -50194 -5856
9126 -5856 3748 -2919 -20932 -20405 -2163 2476 17308 23037 28458 36289 22968 18314 -3027 -19620
$$ packed form
9219a797k330O47O905N62L090j9666J5359J6451m512R425J8713j1272O036M694
9205D2305j0617k4866k8569k8741K3754J5085L344p180j741o242J1999j4733N741
9192b0461P912m13J1435R50o213j3339J949J9412p483J8563L3999j5217k5829
9179E265j1728K2125N786m440K644j6555p352j0601J6254N94k6707l7016l158
9166f4889K6737r100K2374K3379K0495J2534q439k0455k671O076R369k5203r869
9153a9662K5620L7989m996n586o151k5222r404r32n41K4613L514k9168j5279m869
9139c0074J2745K0440L884M224K3501m262k5413k7057j8658K171o43j1052M4338
9126e856R604o667j8013N27J8242M639J4832N729N421P831j3321m654k1341j6593
$$ plain form
9112 -19620 -43682 -28802 -20195 -14613 -8044 -15779 -37540 -62585 -69837 -43265 22 8099 -12552
9099 -12552 -20492 -2534 14919 -3953 -8446 30933 31068 15243 43663 31208 8390 18824 17907
9086 17907 25711 31771 32927 47663 25714 -19505 -18993 -6061 20013 18411 -3644 -7288 16603
9073 16603 7256 -1851 12264 4942 -24622 -12715 -827 7711 5155 5032 -4684 -387 -28301 -49837
9059 -49837 -36299 -11962 -17399 -8860 -9883 7791 27473 53074 41083 18079 6662 4411 -10068
9046 -10068 -14959 -14500 -36163 -28129 -28159 684 33291 20612 -7751 4653 20343 26558 32806 30487
9032 30487 4924 1730 -8509 -9436 -7535 5566 18403 4086 -8082 10525 25164 18553 2443
9019 2443 -7705 2333 -4081 -4626 33994 77835 71708 35546 4166 -6159 -18193 -5167 7799
$$ packed form
9112a9620k4062J4880Q607N582O569p735k1761k5045p252K6572M3287Q077k0651
9099a2552p940J7958J7453j8872m493L9379J35j5825K8420j2455k2818J0434r17
9086A7907P804O060J156J4736k1949m5219N12J2932K6074j602k2055l644K3891
9073A6603r347r107J4115p322k9564J1907J1888Q538k556j23r716M297k7914k1536
9059d9837J3538K4337n437Q539j023J7674J9682K5601j1991k3004j1417k251j4479
9046a0068m891M59k1663Q034l0K8843L2607j2679k8363J2404J5690O215O248k319
9032C0487k5563l194j0239r27J901J3101J2837j4317j2168J8607J4639o611j6110
9019B443j0148J0038o414n45L8620M3841o127l6162l1380j0325j2034J3026J2966
$$ plain form
9006 7799 5756 -12905 -4872 -12371 -15106 -14547 -23216 -29514 -29396 -22058 6330 -805 -24821 -32023 -3740
8991 -3740 21981 29933 25156 18033 5104 -1641 -3227 -85 3319 -6013 -12026 -15922 -13126 -6503
8977 -6503 2994 -3161 -3373 2901 -11056 -42466 -52287 -19088 -17197 -32264 -32387 -18931 -17390 -4508
8963 -4508 -34467 -37538 -33458 -32633 -28978 -19819 -19238 -15493 -15111 -36597 -47536 -22656 -15861 -10524 18126
8948 18126 49756 23580 7880 15877 -394 1347 -13212 -29107 -46965 -51133 -45379 -15558 7310
8935 7310 2075 -724 -15885 -31754 -45852 -56268 -67874 -51110 -5458 426 -29717 -41032 -11813
8922 -11813 19885 8852 15365 -7074 2498 -3502 3402 -1297 -5972 -18722 -19703 -54626 -33180
8909 -33180 -31869 -61665 -67396 -43616 -35370 -56173 -25979 -19065 157 15720 15235 181 7192
$$ packed form
9006G799k043j8661Q033p499k735N59q669o298J18P338K8388p135k4016p202K8283
8991c740K5721P952m777p123j2929o745j586L142L404r332o013l896K796O623
8977f503R497o155k12O274j3957l1410r821L3199J891j5067j23J3456J541J2882
8963d508k9959l071M080Q25L655R159N81L745L82k1486j0939K4880O795N337K8650
8948A8126L1630k6176j5700P997j6271J741j4559j5895j7858m168N754K9821K2868
8935G310n235k799j5161j5869j4098j0416j1606J6764M5652N884l0143j1315K9219
8922a1813L1698j1033O513k2439R572o000O904m699m675j2750r81l4923K1446
8909c3180J311k9796n731K3780Q246k0803L0194O914J9222J5563m85j5054P011
$$ plain form
8896 7192 2801 -3579 8271 13313 -1382 16966 -2588 -59857 -55135 -29857 -14290 -17924 6946
8883 6946 5680 11343 -194 -7705 -12127 -8314 9405 22820 43005 17651 4800 -658 -1150 -12295
8869 -12295 -20228 -1676 -18143 -33078 -27776 -2979 -3245 -39102 -28017 9018 2731 -40895 -70048
8856 -70048 -45307 -8668 -24800 -31118 -23916 -19166 -6389 22452 25946 17167 48164 71338 75836
8843 75836 38850 40573 8363 -16918 -12783 3285 21900 22144 16263 5316 -3794 16921 23167
8830 23167 27695 56560 46694 14849 14257 1562 -18928 -6142 -14951 -38665 -64526 -62876 -35889
8817 -35889 -17901 -1341 13066 12510 5399 13912 10352 8265 15605 18409 22541 16321 -8891 4906
8803 4906 16619 16281 16861 3611 -605 5698 -9282 -49922 -59835 -38641 -7001 -14195 -17321 -15065
$$ packed form
8896G192m391o380J1850N042j4695J8348j9554n7269M722K5278J5567l634K4870
8883F946j266N663j1537p511m422L813J7719J3415K0185k5354j2851n458m92j1145
8869a2295p933J8552j6467j4935N302K4797k66l5857J1085L7035o287m3626k9153
8856g0048K4741L6639j6132o318P202M750J2777K8841L494q779L0997K3174M498
8843G5836l6986J723l2210k5281M135J6068J8615K44n881j0947r110K0715O246
8830B3167M528K8865r866l1845n92j2695k0490J2786q809k3714k5861J650K6987
8817c5889J7988J6560J4407n56p111Q513l560k087P340K804M132o220k5212J3797
8803D906J1713l38N80j3250m216O303j4980m0640r913K1194L1640p194l126K256
$$ plain form
8789 -15065 -40680 -47942 -8127 2506 -2113 3393 -18225 -17067 2229 19489 8957 2303 -4628
8776 -4628 -4446 12889 -3539 -25616 -25952 -12446 -26715 -40811 -56177 -38832 -28256 -9154 8903
8763 8903 -7796 -10407 -18813 -8447 -26313 -6650 4733 -23251 -33849 -20605 -21556 -12885 5609
8750 5609 19862 20042 11072 -1851 -907 -6630 -3014 -19494 -16747 -15193 -488 51187 65221 5160
8736 5160 -41766 -55021 -29733 8124 26904 50167 51609 46460 12240 4825 9574 181 -9373
8723 -9373 -34205 -14289 38768 36341 34469 18506 -17211 -27063 -12111 2298 -9594 -13744 4446
8710 4446 10342 36469 18418 15140 25993 -9959 -10993 -1152 1562 2599 283 -2586 13348 21433
8696 21433 2014 -11807 -17503 -9049 -16104 -44585 -51313 -32690 -31539 -27743 -41592 -52922 -43919
$$ packed form
8789a5065k5615p262L9815J0633m619N506k1618J158J9296J7260j0532o654o931
8776d628J82J7335j6428k2077l36J3506j4269j4096j5366J7345J0576J9102J8057
8763H903j6699k611q406J0366j7866J9663J1383k7984j0598J3244r51Q671J8494
8750E609J4253J80q970j2923R44n723L616j6480K747J554J4705N1675J4034o0061
8736E160m6926j3255K5288L7857J8780K3263J442n149l4220p415M749r393r554
8723i373k4832J9916N3057k427j872j5963l5717r852J4952J4409j1892m150J8190
8710D446N896K6127j8051l278J0853l5952j034R841K714J037k316k869J5934Q085
8696B1433j9419j3821n696Q454p055k8481o728J8623J151L796j3849j1330R003
$$ plain form
8683 -43919 -10338 -11706 3990 -10015 -18451 -27230 -30482 -27211 -19505 2316 6499 24323 31883
8670 31883 27082 13837 12032 15839 8162 -14221 -45864 -47902 -46988 -65689 -48860 1671 9649
8657 9649 -23915 -27309 -12302 -13139 -22319 -22243 -9480 -11990 -23218 -27996 -14024 -16308 -31145 -20718
8643 -20718 -8382 -24985 -18496 -14423 -16026 -28723 -27760 -8949 10051 18090 17421 8070 -1012 -24102
8629 -24102 -27742 8436 15663 22236 57370 49921 33140 31170 17968 -7817 -28017 -31631 -35617
8616 -35617 -39119 -41770 -23449 -19216 -11025 -17849 -4369 23676 25178 16055 19514 59304 65094 58151
8602 58151 37091 2044 -12964 -7707 808 10083 -3857 10425 23681 44927 59361 49830 49231
8589 49231 29887 28655 48447 46751 34883 17717 16015 55810 64562 72534 77110 68359 48237
$$ packed form
8683d3919L3581j368J5696j4005q436q779l252L271P706K1821M183J7824P560
8670C1883m801j3245j805L807p677k2383l1643k038R14j8701J6829N0531P978
8657I649l3564l394J5007q37r180P6J2763k510j1228m778J3972k284j4837J0427
8643b0718J2336j6603O489M073j603j2697R63J8811J9000Q039o69r351r082k3090
8629b4102l640L6178P227O573L5134p449j6781j970j3202k5785k0200l614l986
8616c5617l502k651J8321M233Q191o824J3480K8045J502r123L459L9790N790o943
8602E8151k1060l5047j5008N257Q515R275j3940J4282J3256K1246J4434r531n99
8589D9231j9344j232J9792j696j1868j7166j702L9795Q752P972M576q751k0122
$$ plain form
8576 48237 66769 77974 71672 77363 90683 71617 49887 29667 37689 45103 35021 43697 62694
8563 62694 37829 21174 26408 40511 21127 -5080 -19205 -32694 -29837 15667 36550 26076
8551 26076 18563 1220 -8205 6021 6348 8650 6910 -6334 -20244 -463 6518 -15527 -27325
8538 -27325 -18079 -10422 13270 8285 -6675 -23249 -27259 -39571 -49335 -24629 10887 20880 17957
8525 17957 8 -16415 -21750 -12303 9990 6337 -19058 -50147 -37899 -30271 -7727 4959 -12433
8512 -12433 -32150 -22352 -25368 -69555 -74347 -37595 -26514 -27983 -43319 -43143 -43137 -66431 -42087 -29866
8498 -29866 -25316 -21591 -13002 3951 29929 30098 26538 21955 3408 -8982 -15214 462 -13029
8485 -13029 -25094 -30715 -24311 -5733 -13514 -34933 -30874 -16142 -13553 -19801 -9551 -12368 -12841 -21549
$$ packed form
8576D8237J8532J1205o302N691J3320j9066k1730k0220Q022P414j0082Q676J8997
8563F2694k4865j6655N234J4103j9384k6207j4125j3489K857M5504K0883j0474
8551B6076p513j7343r425J4226L27K302j740j3244j3910J9781O981k2045j1798
8538b7325R246P657K3692m985j4960j6574m010j2312r764K4706L5516R993k923
8525A7957j7949j6423n335R447K2293l653k5395l1089J2248P628K2544J2686j7392
8512a2433j9717R798l016m4187m792L6752J1081j469j5336J76Ok3294K4344J2221
8498b9866M550L725Q589J6953K5978J69l560m583j8547j2390o232J5676j3491
8485a3029j2065n621O404J8578p781k1419M059J4732K589o248J0250k817m73q708
$$ plain form
8471 -21549 -14274 -27406 -18267 -42195 -60173 -42342 -17613 -24444 -30366 -52687 -38229 -20588 -2254
8458 -2254 -1050 -2561 -9748 7877 33813 41150 51325 31436 -2376 -11112 -11782 5510 -10145
8445 -10145 15905 42085 44782 53632 18462 2130 25251 29728 29452 28831 30124 21448 44023 55499
8431 55499 72069 42766 -11713 -15345 -859 12088 3766 -17241 -10363 -23852 -48305 -27707
8419 -27707 6475 17139 9076 14441 21232 18989 19574 -11872 -10033 6708 13616 -12187 -18391 -33765
8405 -33765 -43826 -30377 -18993 -15325 -1613 -2534 -11091 -27431 1877 41091 42658 15325 9615
8392 9615 14215 8302 41712 65245 56996 19590 15053 13407 22140 19933 7059 23686 26992 16017
8378 16017 -25631 -57779 -34891 -22270 -27171 -14678 16978 26230 21283 5192 -9479 -19416 223
$$ packed form
8471b1549P275j3132R139k3928j7978J7831K4729o831n922k2321J4458J7641J8334
8458b254J204j511p187J7625K5936P337J0175j9889l3812q736o70J7292j5655
8445a0145K6050K6180K697Q850l5170j6332K3121M477k76o21J293q676K2575J1476
8431E5499J6570k9303n4479l632J4486J2947q322k1007O878j3489k4453K0598
8419b7707L4182J0664q063N365O791k243N85l1446J839J6741O908k5803o204j5374
8405c3765j0061J3449J1384L668J3712r21q557j6340K9308L9214J567k7333n710
8392I615M600n913L3410K3533q249l7406m537j646Q733k207j2874J6627L306j0975
8378A6017m1648l2148K2888J2621m901J2493L1656R252m947j6091j4671r937J9639
$$ plain form
8365 223 25632 14267 -7721 -11314 -7193 5810 24303 7454 12406 17341 30068 37420 -1836
8352 -1836 -31454 -24573 -34722 -43849 -37920 -29480 -25934 -38591 -29507 -33146 -16280 -3840 6406
8339 6406 -28983 -37038 -29410 -20168 -14249 -9490 -25839 -16503 -31429 -20442 -20186 -12488 -29826 -21450
8325 -21450 1099 -8879 -28012 -23830 15481 1509 -10638 -37870 -12566 -2863 4202 -3272 -11416
8312 -11416 -2638 -11111 -7 16008 6814 -8013 -12262 -1833 18545 914 -18900 -31162 -30199
8299 -30199 -19434 6435 23488 46718 50921 10525 -24874 -474 -21231 -51677 -32413 -4902
8287 -4902 7343 22252 11491 2006 -1370 -2462 -20670 -41779 -39261 -56893 -47447 -15778 -6300
8274 -6300 -48775 -51927 3901 42297 17996 -11878 -62052 -70537 -56308 -49897 -35452 -41575 -30897
$$ packed form
8365B23K5409j1365k1988l593M121J3003J8493j6849M952M935J2727P352l9256
8352a836k9618O881j0149r127N929Q440L546j2657R084l639J6866J2440J0246
8339F406l5389q055P628R242N919M759j6349R336j4926J0987K56P698j7338Q376
8325b1450K2549r978j9133M182L9311j3972j2147k7232K5304R703P065p474q144
8312a1416Q778q473J1104J6015r194j4827m249J0429K0378j7631j9814j2262R63
8299c0199J0765K5869J7053K3230M203m0396l5399K4400k0757l0446J9264K7511
8287d902J2245J4909j0761r485l376j092j8208k1109K518j7632R446L1669R478
8274f300m2475l152N5828L8396k4301k9874n0174q485J4229O411J4445o123J0678
$$ plain form
8261 -30897 -27519 -35591 -30842 -16753 -8372 -3882 -7356 -1275 -25534 -12222 2008 10466 6366 4015
8247 4015 -4401 22266 30237 11487 -18256 -17951 -6335 35715 49870 39649 10847 -16174 -5589
8234 -5589 -12522 -27634 -34684 -42263 -64544 -85175 -46289 -19765 -33724 -52842 -53925 -44828 -33974
8221 -33974 -42178 -9592 -7609 -7845 -9268 -5533 9102 17953 17504 5589 -4769 -3378 6640 17789
8207 17789 40268 -10491 -39406 -13026 2068 -9756 -8769 17842 30441 26539 12467 -18577
8195 -18577 -42187 -36715 -25525 1058 -17704 -24325 -17313 7167 22670 46325 77193 33497
8183 33497 17104 7889 13974 -13253 13191 7208 -1860 -16726 -36756 -36125 -33527 -7363 14930
8170 14930 -3886 -1038 -14322 -18850 -11077 -18438 -8925 -7612 -13260 -10736 -16561 -22667 -24049 -27737
$$ packed form
8261c0897L378q072M749J4089Q381M490l474O081k4259J3312J4230Q458m100k351
8247D015q416K6667P971j8750k9743L05J1616M2050J4155j0221k8802k7021J0585
8234e589o933j5112p050p579k2281k0631L8886K6524j3959j9118j083R097J0854
8221c3974q204L2586J983k36j423L735J4635Q851m49j1915j0358J391J0018J1149
8207A7789K2479n0759k8915K6380J5094j1824R87K6611J2599l902j4072l1044
8195a8577k3610N472J1190K6583j8762o621P012K4480J5503K3655L0868m3696
8183C3497j6393r215O085k7227K6444n983r068j4866k0030O31K598K6164K2293
8170A4930j8816K848j3284m528P773p361R513J313n648K524n825o106j382l688
$$ plain form
8156 -27737 -33719 -23864 -14829 1375 -858 -3678 -16845 -28543 -3606 10160 14324 -10203 -28595
8143 -28595 -9302 -2221 -1220 -18730 -26989 3202 10991 -22611 -47908 -36427 -23971 -19153 -28784
8130 -28784 -21070 -28477 -49677 -47973 -4940 9645 4524 11224 -10 -15913 -38627 -31916 -30817
8117 -30817 -31189 -44805 -39575 -5490 17982 4125 -17206 -8682 4584 22014 25433 35195 21072
8104 21072 -6960 -20077 -21566 -21792 -27278 -32350 -36961 -3175 -4643 -31859 -18606 1878 14714
8091 14714 9984 -10340 -9618 15457 16938 6133 13053 32148 17991 13158 43095 31671 56830
8078 56830 50004 53092 41513 8103 -11198 -17348 -5789 -1419 -10699 -13673 -6582 21022 14009
8065 14009 -19118 -15973 -24044 -42716 -34878 -10609 6263 13208 14393 -12214 -8455 3728 17059
$$ packed form
8156b7737n982R855R035J6204k233k820j3167j1698K4937J3766M164k4527j8392
8143b8595J9293P081J001j7510q259L0191P789l3602k5297J1481J2456M818r631
8130b8784P714p407k1200J704M3033J4585n121O700j1234j5903k2714O711J099
8117c0817l72j3616N230L4085K3472j3857k1331Q524J3266J7430L419R762j4123
8104B1072k8032j3117j489k26n486n072m611L3786j468k7216J3253K0484J2836
8091A4714m730k0324P22K5075J481j0805O920J9095j4157m833K9937j1424K5159
8078E6830o826L088j1579l3410j9301o150J1559M370r280k974P091K7604p013
8065A4009l3127L145q071j8672P838K4269J6872O945J185k6607L759J2183J3331
$$ plain form
8052 17059 29130 20289 11390 25837 543 2975 -836 -11416 -786 -590 5888 -6071 -16486
8039 -16486 -14651 -7808 -13357 -13837 -16931 -46112 -56879 -39848 -27098 -28865 -28709 -28493 -31064 -27472
8025 -27472 -42452 -68156 -68496 -46671 -25240 -16312 -7844 2540 -11556 -21966 -13209 -4435 434
8012 434 -3014 197 -2936 -5319 -12983 327 13074 28951 14674 -19453 -1218 -4197 -28463
7999 -28463 -19195 12146 4998 12421 34109 30460 -7528 7840 19896 40272 26532 6496 7262
7986 7262 14071 24603 23412 22319 19525 -9236 15657 36103 41806 38211 45588 52153 39031 38228
7972 38228 50894 19051 -24563 -33860 -20718 -29493 -14509 -4506 -17376 -6689 -27002 -31792
7960 -31792 -9811 200 20485 -17741 -35158 -27583 -31106 -49226 -43703 -13823 15661 11374 7487
$$ packed form
8052A7059J2071q841q899J4447k5294K432l811j0580J0630J96O478j1959j0415
8039a6486J835O843n549m80l094k9181j0767J7031J2750j767J56K16k571L592
8025b7472j4980k5704l40K1825K1431Q928Q468J0384j4096j0410Q757Q774M869
8012D34l448L211l133k383p664J3310J2747J5877j4277l4127J8235k979k4266
7999b8463R268L1341p148P423K1688l649l7988J5368J2056K0376j3740k0036P66
7986G262O809J0532j191j093k794k8761K4893K0446N703l595P377O565j3122q03
7972C8228J2666l1843m3614r297J3142q775J4984J0003j2870J0687k0313m790
7960c1792K1981J0011K0285l8226j7417P575l523j8120N523K9880K9484m287l887
$$ plain form
7947 7487 -10802 -45882 -53507 -22609 2363 -2313 -5878 -645 -21404 7552 34871 47263 25821
7934 25821 32830 19050 -7239 -10627 -15066 -30997 -35500 -49452 -37223 -19666 -22606 -47336 -36425
7921 -36425 -23142 -27512 -30516 -21211 -13174 -10986 -19052 -25929 -18523 -10387 -7103 1224 -14835 -13345
7907 -13345 -5804 967 2472 8575 25922 12967 -47413 -85016 -92242 -76142 -48814 -23054 -13981
7894 -13981 -4962 -27555 -41261 -52930 -25035 -5809 -2530 6956 -1775 -16958 -33354 -41431 -24830
7881 -24830 -27676 -50589 -40689 -26464 -16993 -38193 -16069 -12265 3454 23915 29742 37537 39401
7868 39401 23918 8011 36717 61014 27839 -7411 -39975 -24839 -2906 -23335 -25655 -10119
7856 -10119 -5798 28077 35658 20024 -2277 -30327 6131 49466 39153 -2406 -595 11577
$$ packed form
7947G487j8289l5080p625L0898K4972m676l565N233k0759K8956K7319J2392k1442
7934B5821P009j3780k6289l388m439j5931m503j3952J2229J7557k940k4730J0911
7921c6425J3283m370l004R305Q037K188q066o877P406Q136L284Q327j6059J490
7907a3345P541O771J505O103J7347j2955o0380l7603p226J6100K7328K5760R073
7894a3981R019k2593j3706j1669K7895J9226L279R486q731j5183j6396q077J6601
7881b4830k846k2913R900J4225R471k1200K2124L804J5719K0461N827P795J864
7868C9401j5483j5907K8706K4297l3175l5250l2564J5136K1933k0429k320J5536
7856a0119M321L3875P581j5634k2301k8050L6458M3335j0313m1559J811J2172
$$ plain form
7844 11577 -9132 -39544 -30036 -7961 -5280 -16500 -38396 -46043 -29740 -206 -8389 -4247 -226
7831 -226 -2320 -18228 -19947 -32793 -44101 -45545 -71272 -56121 -45247 -41128 -25895 941 -5652
7818 -5652 -4339 6835 6512 -8769 -9860 -7198 6479 16839 -9475 -9645 -22466 -24570 -9752 20192
7804 20192 36117 35075 18093 11630 25723 -12796 -40282 -32689 -10753 -7977 -1253 6437 9632
7791 9632 -18100 -12528 -6618 -16323 -21187 -31838 -45671 -32293 -9141 -21606 -10185 73 19139
7778 19139 41389 41561 42566 47270 27573 -734 4092 17022 35047 39970 13706 -18179 -13766
7765 -13766 9295 2279 -16314 2398 14037 7192 -1334 -5951 13159 19620 18139 24545 18457
7752 18457 8045 2908 -10749 -19533 -19225 -24808 -424 -2732 -653 -5163 -43223 -55281 -45787 -60710
$$ packed form
7844A1577k0709l0412R508K2075K681j1220k1896p647J6303K9534q183M142M021
7831b26k094j5908j719j2846j1308j444k5727J5151J0874M119J5233K6836o593
7818e652J313J1174l23j5281j091K662J3677J0360k6314j70j2821k104J4818K9944
7804B0192J5925j042j6982o463J4093l8519k7486P593K1936K776O724P690L195
7791I632k7732N572N910r705m864j0651j3833J3378K3152j2465J1421J0258J9066
7778A9139K2250J72J005M704j9697k8307M826J2930J8025M923k6264l1885M413
7765a3766K3061p016j8593J8712J1639o845q526m617J9110O461j481O406o088
7752A8457j0412n137j3657q784L08n583K4384k308K079m510l8060j2058R494j4923
$$ plain form
7738 -60710 -42031 -60060 -64613 -59573 -49817 -38295 -41255 -63606 -52827 -16356 -358 -7220 -19052
7725 -19052 -40199 -63372 -51217 -13402 19755 -4787 -18584 -29692 -40277 -21769 -22643 -14827
7713 -14827 21406 37263 21653 -14333 -14274 -19296 -34517 -33881 -16541 -30317 -43838 -37453 -33445
7700 -33445 -40038 -61978 -58859 -66097 -66209 -58102 -39433 -3185 -1341 -15328 -4403 8184 3677
7687 3677 -12785 -17831 1648 3967 -11100 -18408 4436 -1614 -18763 -15675 -30708 -16673 -31754
7674 -31754 -26514 -36484 -30949 -19756 -26338 -19478 -23296 -43390 -18914 -25430 -37760 -53139 -58253
7661 -58253 -48662 -36355 -23529 -41167 -42336 -21229 -1000 6459 4777 -4354 -30281 -24672 -8287
7648 -8287 -85 -22264 -25026 -13353 -47353 -39705 -422 12018 -11815 -24039 -26992 -24729 -34311
$$ packed form
7738f0710J8679j8029m553N040R756J1522k960k2351J0779L6471J5998o862j1832
7725a9052k1147k3173J2155L7815L3157k4542j3797j1108j0585J8508q74P816
7713a4827L6233J5857j5610l5986N9n022j5221O36J7340j3776j3521O385M008
7700c3445o593k1940L119p238j12Q107J8669L6248J844j3987J0925J2587m507
7687C677j6462n046J9479K319j5067p308K2844o050j7149L088j5033J4035j5081
7674c1754N240r970N535J1193o582O860l818k0094K4476o516j2330j5379n114
7661e8253R591J2307J2826j7638j169K1107K0229P459j682r131k5927N609J6385
7648h287Q202k2179k762J1673l4000P648L9283J2440k3833j2224k953K263r582
$$ plain form
7635 -34311 -29551 -38587 -51972 -36625 -8907 -36037 -52049 -41250 -45304 -41843 -28853 -25127 -28608
7622 -28608 -39204 -22459 -32732 -34607 -37306 -24718 3308 8497 4324 486 6884 41284 22002
7609 22002 -13210 -7372 26242 39543 20092 16867 -5101 -4104 10592 24932 19057 18473 -8869
7596 -8869 -10430 2573 -3859 -37536 -34315 -2528 -8635 -13158 9179 -18997 -47380 -19068 -8221
7583 -8221 -23417 -34822 -29841 -15002 -30034 -36580 -45631 -58271 -40898 -21582 -9351 -13870 -23124
7570 -23124 -21457 -33092 -29123 3516 25346 14989 9376 -18766 -30938 -39563 -14371 -9421 -24417
7557 -24417 -29162 -39197 -66580 -46958 -18720 11401 19595 -4265 -2811 7671 20042 -13746
7545 -13746 -51330 -37651 -15763 -9785 -12294 -16111 -29722 -31194 5410 23312 -4962 7006 -8300
$$ packed form
7635c4311M760r036j3385J5347K7718k7130j6012J0799m054L461J2990L726l481
7622b8608j0596J6745j0273j875k699J2588K8026N189m173l838O398L4400j9282
7609B2002l5212N838L3614J3301j9451l225k1968R97J4696J4340n875n84k7342
7596h869j561J3003o432l3677L221L1787o107m523K2337k8176k8383K8312J0847
7583h221j5196j1405M981J4839j5032o546r051j2640J7373J9316J2231m519r254
7570b3124J667j1635L969L2639K1830j0357n613k8142j2172q625K5192M950j4996
7557b4417m745j0035k7383J9622K8238L0121Q194k3860J454J0482J2371l3788
7545a3746l7584J3679K1888N978k509l817j3611j472L6604J7902k8274J1968j5306
$$ plain form
7532 -8300 -31203 -22624 -30228 -69757 -53792 -21062 -5133 -36757 -39573 -42492 -37135 -37803 196
7519 196 -6000 -24046 -26055 -10282 -11104 -16895 2822 30311 35183 25817 3227 -20907 -29156 -35016
7505 -35016 -30041 -41699 -50677 -47690 -33470 -37402 -23337 -23375 -31245 -26062 -21161 -31341 -4124 2628
7491 2628 -14856 -17704 -11937 -36559 -32395 -27078 -32133 -71159 -70684 -55688 -46575 -41960 -41392 -41606 -42802
7476 -42802 -43774 -36185 -1866 22432 6679 12502 10648 17775 -2285 -15369 -4578 -4134 -51284
7463 -51284 -56629 -12417 -17081 -10775 -16801 -45537 -48167 -20085 -42123 -59699 -38200 -27742 -21352
7450 -21352 -31903 -51558 -40590 -30638 -16787 -16065 -42714 -17826 2244 -4330 -29907 -28448 1500
7437 1500 -5557 -28131 -42785 -35671 -25986 -3148 3282 20823 -9839 -8827 18192 -9945 -29620
$$ packed form
7532h300k2903Q579p604l9529J5965L2730J5929l1624k816k919N357o68L7999
7519A96o196j8046k009J5773q22n791J9717K7489M872r366k2590k4134q249n860
7505c5016M975j1658q978K987J4220l932J4065l8p870N183M901j0180K7217O752
7491B628j7484k848N767k4622M164N317n055l9026M75J4996R113M615N68k14j196
7476d2802r72P589L4319K4298j5753N823j854P127k0060j3084J0791M44m7150
7463e1284n345M4212m664O306o026k8736k630K8082k2038j7576K1499J0458O390
7450b1352j0551j9655J0968R952J3851P22k6649K4888K0070o574k5577J459K9948
7437A500p057k2574j4654P114R685K2838O430J7541l0662J012K7019k8137j9675
$$ plain form
7424 -29620 -23321 -37646 -32047 -39752 -47349 -43552 -16836 -4366 7340 -11520 -23978 -25879 -16229
7411 -16229 -3246 6181 7296 -1058 -33100 -41236 -35739 -42714 -32245 -20782 -4199 -16749 -36416
7398 -36416 -49450 -39485 -22481 -17817 -19336 -25604 -23358 -22879 -12529 -11749 -8238 5484 14213 3349
7384 3349 -808 4841 9546 -11225 -10473 20217 15046 17619 10589 -5283 -23195 -1377 -10279 -25679
7370 -25679 -47605 -48661 -52442 -36802 -11209 -30925 -46302 -16263 7662 -9237 -3560 -8523 -6424
7357 -6424 -9838 -4768 -17881 -6607 15300 26071 -14992 -52441 -55059 -48709 -13506 20024 8375
7344 8375 -4070 -8912 -7203 -15304 -19888 -26437 -29967 -1454 22985 51233 47063 4935 -15655
7331 -15655 -2888 11450 -11516 -26308 -16836 -12132 5151 1772 -5834 7163 2491 15067 4688
$$ packed form
7424b9620O299j4325N599p705p597L797K6716J2470J1706j8860j2458j901R650
7411a6229J2983R427J115q354l2042q136N497o975J0469J1463J6583j2550j9667
7398c6416j3034R965J7004M664j519o268K246M79J0350P80L511J3722Q729j0864
7384C349m157N649M705k0771P52L0690n171K573p030j5872j7912K1818q902j5400
7370b5679k1926j056l781J5640K5593j9716j5377L0039K3925j6899N677m963K099
7357f424l414N070j3113J1274K1907J0771m1063l7449k618O350L5203L3530j1649
7344H375j2445m842J709q101m584o549l530K8513K4439K8248m170m2128k0590
7331a5655J2767J4338k2966j4792R472M704J7283l379p606J2997m672J2576j0379
$$ plain form
7318 4688 -3562 -3002 -3546 -4387 -26328 -7601 -4298 -4309 -29245 -38776 -56149 -25409 -5407 -31949
7304 -31949 -47894 -41580 -31309 -3958 -4079 -3387 -10941 -19620 -14711 -23049 -21177 -26887 -33947 -18130
7290 -18130 -23888 -34420 -25574 -9477 -11609 -6947 -6602 -22932 -5449 32489 -429 -23622 -39188
7277 -39188 -71284 -40226 -1749 -10906 13473 8946 -12209 11926 26395 18092 23956 27784 8395
7264 8395 -34123 -34970 -14024 -3358 4552 3152 -18267 -32118 -17268 5252 -14469 -27530 -38719
7251 -38719 -34904 -10453 7958 24170 19301 8742 16793 11110 12139 15732 403 -22062 -47835
7238 -47835 -76815 -50816 -17507 13268 22529 -3619 -2409 654 -5732 -4577 7269 -4384 -48358
7225 -48358 -40880 -39937 -38124 -30307 -28867 -22201 -14004 3716 -2372 -6967 4706 23179 27273 7639
$$ packed form
7318D688q250N60n44q41k1941J8727L303j1k4936r531j7373L0740K0002k6542
7304c1949j5945O314J0271K7351j21O92p554q679M909q338J872n710p060J5817
7290a8130n758j0532Q846J6097k132M662L45j6330J7483L7938l2918k3193j5566
7277c9188l2096L1058L8477r157K4379m527k1155K4135J4469q303N864L828j9389
7264H395m2518q47K0946J0666P910j400k1419j3851J4850K2520j9721j3061j1189
7251c8719L815K4451J8411J6212m869j0559Q051n683J029L593j5329k2465k5773
7238d7835k8980K5999L3309L0775R261k6148J210L063o386J155J1846j1653m3974
7225d8358P478R43J813P817J440O666Q197J7720o088m595J1673J8473M094j9634
$$ plain form
7211 7639 -20142 -8744 17025 17389 -7904 272 -11456 11170 -15218 -25336 -17910 13974 23626
7198 23626 33489 16254 3278 14554 36658 35952 19232 5123 -30004 -46086 -18374 17176
7186 17176 36619 42306 32276 4096 -24032 -36358 -40542 -39287 -31950 -18584 -15457 -27096 -56978
7173 -56978 -66527 -32240 -5265 16435 11869 715 14796 15973 10455 -3349 -33062 -28918 -29759
7160 -29759 -24303 -17290 -14041 -15509 -15046 -13252 -1091 -14017 -15378 -27406 -24439 -21762 -44052 -70557
7146 -70557 -77195 -31848 -5383 -30346 -34263 -18158 -8106 -13066 -12021 -26322 -36691 -10456 -8464
7133 -8464 -23569 -20515 -32984 -34160 -45231 -44239 -26426 1322 4436 12551 17493 13899 5923 5590
7119 5590 32007 46072 44656 45233 24907 -5642 -6772 -334 -6243 -4577 23116 27223 25702 4642
$$ packed form
7211G639k7781J1398K5769L64k5293Q176j1728K2626k6388j0118P426L1884R652
7198B3626R863j7235j2976J1276K2104p06j6720j4109l5127j6082K7712L5550
7186A7176J9443N687j0030k8180k8128j2326m184J255P337J3366L127j1639k9882
7173e6978r549L4287K6975K1700m566j1154J4081J177n518j3804k9713M144q41
7160b9759N456P013L249j468M63J794J2161j2926j361j2028K967K677k2290k6505
7146g0557o638M5347K6465k4963l917J6105J0052m960J045j4301j0369K6235J992
7133h464j5105L054j2469j176j1071R92J7813K7748L114Q115M942l594p976l33
7119E590K6417J4065j416N77k0326l0549j130O438n909J666K7693M107j521k1060
$$ plain form
7105 4642 -19552 -26792 -58681 -54723 -49130 -45642 -61157 -13949 8413 12046 3311 -8515 5164
7092 5164 -3729 7101 22926 27948 46959 34391 38420 38999 33697 8767 -9050 -17541 -29404
7079 -29404 -22175 -16800 -21999 -23284 1016 -2748 -42965 -44832 -27166 -38933 -56636 -38094 3177
7066 3177 9328 -31487 -43105 -35526 -34455 -24696 -44933 -47710 -9803 -10281 -15624 -15718 -27677 -48797
7052 -48797 -29909 -12819 -12843 -21124 -19997 -21353 -26995 -24584 -28925 176 36047 6949 -11970 -30413
7038 -30413 -19569 -623 -6048 6053 -1564 -30622 -52979 -50843 -44967 -2905 26637 23873 -10240
7025 -10240 -18462 -34009 -40449 -48735 -40602 -3414 13038 -92 8106 16467 17057 10070 7029 27176
7011 27176 6319 -28659 -26617 -12033 -30668 -42219 -45389 -72864 -79579 -71510 -40610 -29470 -21357
$$ packed form
7105D642k4194p240l1889L958N593L488j5515M7208K2362L633q735j1826J3679
7092E164q893J0830J5825N022J9011j2568M029N79n302k4930j7817q491j1863
7079b9404P229N375n199j285K4300l764m0217j867J7666j1767j7703J8542M1271
7066C177O151m0815j1618P579J071R759k0237k777L7907m78n343r4j1959k1120
7052d8797J8888J7090k4q281J127j356n642K411m341K9101L5871k9098j8919j8443
7038c0413J0844J8946n425J2101p617k9058k2357K136N876M2062K9542k764l4113
7025a0240q222j5547o440q286Q133L7188J6452j3130Q198Q361N90o987l041K0147
7011B7176k0857l4978K042J4584j8635j1551l170k7475o715Q069L0900J1140Q113
$$ plain form
6998 -21357 9587 41369 22110 -1135 -6321 -17863 9488 1113 -16576 -10667 4633 14690
6986 14690 33900 63226 69282 56764 32895 2796 5709 17791 -8798 -43685 -56885 -37751
6974 -37751 -16972 -1026 3814 17416 26057 -3444 7418 13959 1208 -12493 -9801 -17451 -27166
6961 -27166 -36477 -32434 -29430 -23085 -37297 -42039 -52897 -48524 -51831 -9868 -12302 -11306 -17865 -21989
6947 -21989 -23367 -16365 -37391 -31071 -26622 -9700 -7083 27636 19109 -13053 -10654 -16885 -25912 -33036
6933 -33036 -27163 -28190 -9453 -15503 13188 7423 -1818 -35338 -27423 -16388 -6459 -64744 -79061
6920 -79061 -51277 -41223 -56284 -39395 -8701 -13538 -47111 -37387 -16640 6384 11306 10139 7442
6907 7442 538 21361 12466 -84 6700 11490 49753 74516 68807 46434 15815 9241 -13849
$$ packed form
6998b1357L0944L1782j9259k3245n186j1542K7351q375j7689N909J5300J0057
6986A4690J9210K9326O056j2518k3869l0099K913J2082k6589l4887j3200J9134
6974c7751K0779J5946M840J3602Q641k9501J0862O541j2751j3701K692p650r715
6961b7166r311M043L004O345j4212m742j0858M373l307M1963k434R96o559m124
6947b1989j378P002k1026O320M449J6922K617L4719q527l2162K399o231r027p124
6933c3036N873j027J8737o050K8691n765r241l3520P915J1035R929n8285j4317
6920g9061K7784J0054j5061J6889L0694m837l3573R724K0747K3024M922j167k697
6907G442o904K0823q895j2550O784M790L8263K4763n709k2373l0619o574k3090
$$ plain form
6894 -13849 -48955 -40906 -34442 -29934 -28677 -9167 -14688 -18445 -16489 7210 18116 18852 3744 21338
6880 21338 31862 19219 -1572 -21387 -19615 -9543 8854 -2337 -4569 -8062 10719 27922
6868 27922 15563 4551 13521 -16449 -60240 -64975 -56320 -4785 7588 9391 19014 5431 -10273
6855 -10273 -35750 -40778 -27233 -8455 -13096 -20967 -39977 -37694 -25394 -24427 453 -12178 -16599
6842 -16599 -3454 -18677 -17262 -49729 -62499 -83844 -66619 -44389 -41804 -34563 -11312 27885
6830 27885 21275 30295 14588 -17713 -38265 -47927 -41171 -26341 -6190 8835 -4152 -39960 -27066
$$ packed form
6894a3849l5106Q049O464M508J257J9510n521l757J956K3699J0906P36j5108J7594
6880B1338J0524j2643k0791j9815J772J0072J8397j1191k232l493J8781J7203
6868B7922j2359j1012Q970k9970m3791m735Q655N1535J2373J803R623j3583j5704
6855a0273k5477n028J3545J8778m641p871j9010K283J2300R67K4880j2631m421
6842a6599J3145j5223J415l2467j2770k1345J7225K2230K585P241K3251L9197
6830B7885o610R020j5707l2301k0552r662O756J4830K0151J5025j2987l5808J2894
$$ [...]
##END NTUPLES=NMR SPECTRUM
##END=
