##TITLE=Analysis number 327918
Compound Code cc 60513
Book Reference 494/152
Project Code adrs
Chemist Name craigr
##JCAMPDX= 6.0         $$ Bruker NMR JCAMP-DX V2.0
##DATA TYPE= NMR SPECTRUM
##DATA CLASS= NTUPLES
##ORIGIN= Bruker BioSpin GmbH
##OWNER= nmr
$$ XWIN-NMR		Version 3.5
$$ Wed Apr 18 12:19:11 2007 GMT Daylight Time (UT+1h)  MAYBRIDGE\nmr@NMR_250MHZ
##.OBSERVE FREQUENCY= 250.131544655141
##.OBSERVE NUCLEUS= ^1H
##.ACQUISITION MODE= SIMULTANEOUS (DQD)
##.ACQUISITION SCHEME= undefined
##.AVERAGES= 16
##.DIGITISER RES= 18
##SPECTROMETER/DATA SYSTEM= dpx250
##.PULSE SEQUENCE= zg30
##.SOLVENT NAME= CDCl3
##.SHIFT REFERENCE= (INTERNAL, CDCl3, 0, 16.522)
##AUDIT TRAIL= $$ (NUMBER, WHEN, WHO, WHERE, WHAT)
$$ ##TITLE= Audit trail, XWIN-NMR		Version 3.5
$$ ##JCAMPDX= 5.01
$$ ##ORIGIN= Bruker BioSpin GmbH
$$ ##OWNER= nmr
$$ C:\u/data/dgb/nmr/ADRS/1660/pdata/1/auditp.txt
$$ ##AUDIT TRAIL=  $$ (NUMBER, WHEN, WHO, WHERE, WHAT)
(   1,<2007-04-18 12:18:47.27 +100>,<MAYBRIDGE\nmr>,<NMR_250MHZ>,
      <created by zg, POWCHK disabled, PULCHK disabled
       configuration hash MD5:
       49 4B E0 1D 92 C2 6B 37 9F E6 65 BC 52 41 86 1D
       data hash MD5: 64K
       44 37 EE FA EA 87 15 19 C5 25 88 75 35 07 84 7F>)
(   2,<2007-04-18 12:19:00.86 +100>,<MAYBRIDGE\nmr>,<NMR_250MHZ>,
      <Start of raw data processing
       ef LB = 0.3 FT_mod = 6 PKNL = 1 SI = 32K 
       data hash MD5: 32K
       5B B6 BC 70 58 86 13 11 97 CD 75 61 53 1F 61 FA>)
(   3,<2007-04-18 12:19:02.58 +100>,<MAYBRIDGE\nmr>,<NMR_250MHZ>,
      <apk 
       data hash MD5: 32K
       BC B0 43 58 41 0E 47 EF 5C 38 82 D1 11 46 AD 05>)
(   4,<2007-04-18 12:19:03.36 +100>,<MAYBRIDGE\nmr>,<NMR_250MHZ>,
      <abs ABSG = 5 
       data hash MD5: 32K
       F2 A6 37 88 8E 95 7E DF E5 50 89 FA 0F 9E 8B 4A>)
$$ ##END=
$$ 
$$ hash MD5
$$ 49 FB 0D 28 00 56 29 20 F0 EA B6 6B 09 ED 7E 00
##$RELAX= 
##$RELAX= 
##$RELAX= 
##$RELAX= 
##$RELAX= 
##$RELAX= 
##$RELAX= 
$$ Bruker specific parameters
$$ --------------------------
##$DU= <C:\u>
##$EXPNO= 1660
##$NAME= <ADRS>
##$PROCNO= 1
##$TYPE= <nmr>
##$USER= <dgb>
##$AMP= (0..31)
100 100 100 100 100 100 100 100 100 100 100 100 100 100 100 100 100 100 
100 100 100 100 100 100 100 100 100 100 100 100 100 100 
##$AQSEQ= 0
##$AQ_mod= 3
##$AUNM= <au_zg>
##$AUTOPOS= <14 >
##$BF1= 250.13
##$BF2= 250.13
##$BF3= 250.13
##$BF4= 250.13
##$BF5= 500.13
##$BF6= 500.13
##$BF7= 500.13
##$BF8= 500.13
##$BYTORDA= 1
##$CFDGTYP= 0
##$CFRGTYP= 5
##$CHEMSTR= <none>
##$CNST= (0..31)
1 1 145 1 1 1 1 1 1 1 1 1 1 1 1 1 1 1 1 1 1 1 1 1 1 1 1 1 1 1 1 1 
##$CPDPRG= <>
##$CPDPRG1= <>
##$CPDPRG2= <>
##$CPDPRG3= <>
##$CPDPRG4= <mlev>
##$CPDPRG5= <mlev>
##$CPDPRG6= <mlev>
##$CPDPRG7= <mlev>
##$CPDPRG8= <mlev>
##$CPDPRGB= <>
##$CPDPRGT= <>
##$D= (0..31)
0 1 0 0 0 0 0 0 0 0.06 0 0 0 0 0 0 0.0002 0 0 0 0 0 0 0 0 0 0 0 0 0 0 
0 
##$DATE= 1176895126
##$DBL= (0..7)
120 120 120 120 120 120 120 120 
##$DBP= (0..7)
150 150 150 150 150 150 150 150 
##$DBP07= 0
##$DBPNAM0= <>
##$DBPNAM1= <>
$$ [...]
##$SUBNAM7= <"">
##$SUBNAM8= <"">
##$SUBNAM9= <"">
##$SW= 20.6930455092707
##$SWIBOX= (0..15)
0 0 3 0 0 0 0 0 0 0 0 0 0 0 0 0 
##$SW_h= 5175.983436853
##$TD= 65536
##$TD0= 1
##$TE= 683.16
##$TE2= 300
##$TE3= 300
##$TEG= 300
##$TL= (0..7)
0 120 120 120 120 120 120 120 
##$TP= (0..7)
150 150 150 150 150 150 150 150 
##$TP07= 0
##$TPNAME0= <>
##$TPNAME1= <>
##$TPNAME2= <>
##$TPNAME3= <>
##$TPNAME4= <>
##$TPNAME5= <>
##$TPNAME6= <>
##$TPNAME7= <>
##$TPOAL= (0..7)
0.5 0.5 0.5 0.5 0.5 0.5 0.5 0.5 
##$TPOFFS= (0..7)
0 0 0 0 0 0 0 0 
##$TUNHIN= 0
##$TUNHOUT= 0
##$TUNXOUT= 0
##$USERA1= <user>
##$USERA2= <user>
##$USERA3= <user>
##$USERA4= <user>
##$USERA5= <user>
##$V9= 5
##$VALIST= <valist>
##$VCLIST= <CCCCCCCCCCCCCCC>
##$VD= 0
##$VDLIST= <DDDDDDDDDDDDDDD>
##$VPLIST= <PPPPPPPPPPPPPPP>
##$VTLIST= <TTTTTTTTTTTTTTT>
##$WBST= 1024
##$WBSW= 4
##$XGAIN= (0..3)
0 0 0 0 
##$XL= 0
##$YL= 0
##$YMAX_a= 397295
##$YMIN_a= -500394
##$ZGOPTNS= <>
##$ZL1= 120
##$ZL2= 120
##$ZL3= 120
##$ZL4= 120
##$ABSF1= 16.522
##$ABSF2= -4.171173
##$ABSG= 5
##$ABSL= 3
##$ALPHA= 0
##$AQORDER= 0
##$ASSFAC= 0
##$ASSFACI= 0
##$ASSFACX= 0
##$ASSWID= 0
##$AUNMP= <proc_1d>
##$AZFE= 0.1
##$AZFW= 0.1
##$BCFW= 0
##$BC_mod= 0
##$BYTORDP= 0
##$COROFFS= 0
##$CY= 12.5
##$DATMOD= 1
##$DC= 0
##$DFILT= <>
##$DTYPP= 0
##$F1P= 14.0000005364418
##$F2P= -0.99999901652339
##$FCOR= 0.5
##$FTSIZE= 32768
##$FT_mod= 6
##$GAMMA= 0
##$GB= 0
##$INTBC= 1
##$INTSCL= 1
##$ISEN= 128
##$LB= 0.3
##$LEV0= 0
##$LPBIN= 0
##$MAXI= 10000
##$MC2= 0
##$MEAN= 0
##$ME_mod= 0
##$MI= 0
##$NCOEF= 0
##$NC_proc= -3
##$NLEV= 6
##$NOISF1= 0
##$NOISF2= 0
##$NSP= 0
##$NTH_PI= 0
##$NZP= 0
##$OFFSET= 16.522
##$PC= 1
##$PHC0= 231.2965
##$PHC1= 6.431486
##$PH_mod= 1
##$PKNL= yes
##$PPARMOD= 0
##$PSCAL= 4
##$PSIGN= 0
##$REVERSE= no
##$SF= 250.13
##$SI= 32768
##$SIGF1= 0
##$SIGF2= 0
##$SINO= 400
##$SIOLD= 32768
##$SREGLST= <1H.CDCl3>
##$SSB= 0
##$STSI= 32768
##$STSR= 0
##$SW_p= 5175.98343685301
##$SYMM= 0
##$S_DEV= 0
##$TDeff= 65536
##$TDoff= 0
##$TI= <Analysis number 999999
Compound Code 99
Book Reference 9
Project Code 9>
##$TILT= no
##$TM1= 0
##$TM2= 0
##$TOPLEV= 0
##$USERP1= <user>
##$USERP2= <user>
##$USERP3= <user>
##$USERP4= <user>
##$USERP5= <user>
##$WDW= 1
##$XDIM= 32768
##$YMAX_p= 459743186
##$YMIN_p= -572640
$$ End of Bruker specific parameters
$$ ---------------------------------
##NTUPLES= NMR SPECTRUM
##VAR_NAME=  FREQUENCY,     SPECTRUM/REAL,   SPECTRUM/IMAG
##SYMBOL=    X,             R,               I
##VAR_TYPE=  INDEPENDENT,   DEPENDENT,       DEPENDENT
##VAR_FORM=  AFFN,          ASDF,            ASDF
##VAR_DIM=   32768,         32768,           32768
##UNITS=     HZ,            ARBITRARY UNITS, ARBITRARY UNITS
##FACTOR=    0.157963299565203, 1,           1
##FIRST=     4132.6476996994, 0,             0
##LAST=      -1043.33573715361, 0,           0
##MIN=       -1043.33573715361, -572640,     0
##MAX=       4132.6476996994, 459743186,     0
$$ Real data points
##PAGE= N=1
##DATA TABLE= (X++(R..R)), XYDATA
$$ [...]
23304 -4850 -12305 -16744 -9804 4655 6381 -396 1530 -12048 -15013 -18959 -19874 -16948 -16426 -19395 -47598
23289 -47598 -69247 -60888 -32970 -9853 -19403 -33881 -36151 -30035 -19387 -11634 6870 19420 32917
23276 32917 15405 -7007 -8054 5132 -11542 -24687 -24218 -27751 -36868 -25629 -24082 -13768 710
23263 710 -1730 -16040 -5657 17913 20727 30929 18741 10783 -4018 -17475 3019 -4973 -23140
23250 -23140 -24098 -26659 -23415 -21630 -30146 -37277 -36419 -14983 -13158 -9110 -18678 -23435 -13032 -15442
23236 -15442 -9656 2622 8994 2155 -8339 -9635 -407 -2313 8241 21028 26786 23898 26160
23223 26160 29601 25575 10234 10614 -10224 -12876 -4381 -16975 -18465 -14427 -8375 -17439 -14997 -14533
23209 -14533 -9891 11813 14751 9731 -8766 -19186 -6845 3065 7043 1120 15587 5624 -9569
23196 -9569 -486 8093 18356 16477 -1500 -17938 -25341 -25118 -5907 -3065 6627 11822 3704 10945
23182 10945 -2211 -14580 3564 27445 43782 33115 14585 -9584 -17994 -11508 -18061 -22836
23170 -22836 -31531 -29500 -31063 -9088 12554 9762 12483 -6113 -22091 -8917 15923 6286 5238
23157 5238 4204 2337 16514 2373 -13342 -12054 -4739 9120 16980 16620 30727 19456 35
23144 35 -1642 -10282 1596 10494 9615 21961 31470 -6356 -31555 -35065 -19355 -22535 -33970 -30562
23130 -30562 -22838 -18691 -25328 -4646 8109 -18945 -12365 4454 13325 4049 13043 -9505 -29520
23117 -29520 -13272 -12607 -16497 -2789 2145 -3800 1813 6282 -1832 -10608 -20466 -19424 -17400 -18456
23103 -18456 -11826 -3242 -10 21115 32369 21959 15098 14984 4167 -16035 -26724 -20865 -19465
23090 -19465 -24397 -8279 7555 3766 -4482 6077 -1474 -28158 -27459 -9149 -16598 -32295 -30504
23077 -30504 -12753 -1176 -1431 -6338 3706 18686 14786 3362 16394 7549 -4200 -13893 -2622
23064 -2622 -10218 -28993 -41144 -38778 -17217 -5995 -12659 2415 21223 15435 5659 -20840 -11538
23051 -11538 -6246 -1114 -6313 -15324 -1189 13495 10337 9558 2025 -15171 -20124 -9393 -6359 -9630
23037 -9630 -7819 -6962 -2707 5364 14567 5228 -9304 -2034 -6145 -21278 -18388 -15787 -6923 -12948
23023 -12948 -10285 1963 10609 4607 5036 7511 9884 -3165 -7710 -16290 -26426 -22720 -36190 -39353
23009 -39353 -24648 1825 8192 1175 4555 -7551 -12127 -2854 1533 8331 -1579 -1475 -7894 -10869
22995 -10869 2054 14132 -195 -10778 -11036 -17124 -17698 -148 5328 -2554 -7684 -3277 -8100 -14603
22981 -14603 -9303 -9702 -12798 -17202 -18809 -15222 -26991 -22041 -10384 -1005 8390 13489 2788 16
22967 16 8424 21596 27476 19062 7865 7547 8718 3060 -5623 -11035 -14733 -16316 -17149 -12709 -2849
22952 -2849 6603 11637 16843 12258 10438 -16876 -26977 -19382 -13991 12869 18058 21583 15998 7303
22938 7303 -6351 -3778 1990 13857 24325 12226 15340 4813 -814 7794 17209 14180 6284
22925 6284 1942 -10026 -22348 -12396 6063 12015 -729 3538 2455 -10113 -14139 -24894 -22706
22912 -22706 -9120 577 -15798 -10401 -9765 -10551 -2997 2986 -1314 2519 9394 2641 -6973 -480
22898 -480 12577 14100 14688 16159 7412 -12105 -22202 -12367 -11000 -27573 -21961 -25189 -29556 -28167
22884 -28167 -15674 -2814 2219 4781 1735 11044 20438 18696 -4815 -8681 -13137 -3069 -1172
22871 -1172 -18335 -27354 -13089 -9746 -7742 -17839 -7909 17917 23165 13592 4689 -8028 -18744
22858 -18744 -44433 -35278 -2453 18672 12542 6862 16579 32785 35680 20854 17518 29550 25666
22845 25666 19605 -951 6940 16195 19301 22656 11026 4802 17109 31706 29766 9890 -1623
22832 -1623 423 1432 -23635 -7540 5368 19691 33899 45432 47037 44451 28457 13974 14277
22819 14277 16751 8276 -6440 -7204 5736 24441 33226 22103 8703 4569 -9633 -11233 4490
22806 4490 1104 543 -14175 -21410 -29987 -40942 -34836 -21705 -15371 -11217 -26677 -21090 -12973 -17912
22792 -17912 -23011 -20906 -11463 3696 8719 -3172 -10565 -6436 24753 41418 22989 6063 4199
22779 4199 -8069 -10317 4209 18306 22882 23949 27481 13395 7795 1596 3211 3391 -8825 -16683
22765 -16683 -7219 10619 38107 40754 10288 4427 7336 5042 20222 34153 19718 8238 22565
22752 22565 21503 30443 27302 17674 10561 -14282 -24269 -11705 -10417 -13556 -17750 -15964 -6607 -3518
22738 -3518 3980 19728 11029 -1034 -13308 -3401 13682 8922 15963 16211 19926 5561 1568 -6490
22724 -6490 -7612 2517 2566 -13626 -24454 -22720 -26709 -30862 -20425 -5004 -7496 726 15670 18347
22710 18347 5511 -641 -21739 -13817 -5890 -999 4088 10456 5551 -4 -143 7153 16968 13520
22696 13520 -8969 -25854 -19400 11482 28776 24936 14064 -4372 6260 -1572 -19439 -21030
22684 -21030 -4550 -353 -1450 9943 14449 14822 4397 -1394 -7047 6745 10892 23475 18429
22671 18429 8097 961 20354 15697 -17460 -21193 -11310 1451 6849 8147 -4192 -6262 -15107
22658 -15107 -10031 5195 21877 24932 19985 -1709 -15102 5332 24960 28525 31817 25794 12015
22645 12015 5475 1242 -11132 -7994 8734 2758 -4666 -513 4742 -17928 -35217 -44231 -49669
22632 -49669 -38520 -16344 -14708 -7660 -16412 -34225 -13600 -4561 -12640 -15138 -10002 -19352 -22920
22619 -22920 -14102 -2941 3920 -5685 -11361 -17676 -6017 -189 -9713 -17970 -33663 -35151 -13858
22606 -13858 -14248 -24844 -14236 -15870 -5308 -4972 -8746 -10991 9924 9192 -8313 -15025 -26553 -29451
22592 -29451 -27516 -28409 -19552 -7717 -10923 -1605 769 -4626 -15045 -24188 -24108 -16976 -18937 -21701 -20751
22577 -20751 -10789 -22761 -21655 -15786 -15800 -7774 -4654 -26843 -35953 -22112 -8651 -3235 -4887 -13406
22563 -13406 -26626 -47654 -36508 -22352 -12635 3956 -1616 -5801 -2675 -6451 -28766 -36563 -11148
22550 -11148 4672 10317 21117 37726 21192 2155 -17485 -24677 -37313 -26564 -32599 -28553
22538 -28553 -14111 -18186 -3674 12690 15649 10789 -2099 1527 -2529 -6016 1973 -18549 -12117
22525 -12117 -13215 -17030 -6008 6112 -3418 6929 12368 5513 -575 6377 9396 3969 -5993 -23768
22511 -23768 -30998 -11114 13382 8372 -11956 -40760 -48870 -38999 -31950 -10119 12016 18306 23490
22498 23490 18534 24336 18268 13849 14166 6587 935 16291 24786 9938 4401 3479 8958 21000
22484 21000 1861 -5879 9420 -2643 -10603 -5768 -20123 -31729 -16470 10033 9813 -7466 -1159
22471 -1159 7465 186 -2251 -8522 -11970 -8932 -17658 -1494 3482 5466 12413 -553 -9858 -11214
22457 -11214 -21002 -16462 -3126 -11311 -29452 -25422 -24976 -26539 -299 9937 -6727 -32038 -53766
22444 -53766 -42758 -27849 -13513 -12519 -18193 -8314 -15758 -27662 -16718 -3876 1918 25749 31882
22431 31882 12573 12726 19714 4897 -8899 6341 9137 -2548 -20662 -12717 1046 4602 -12556
22418 -12556 -19232 -18090 -15553 -7280 562 -13882 -14092 -7368 416 3151 -10045 6411 4445 6388
22404 6388 -13394 -19370 1627 1789 -3913 10810 18767 19604 16428 3396 418 22192 21237 19237
22390 19237 -1437 -7880 -3739 -6239 -4980 697 -10271 -17610 -2964 -11587 -22130 -9690 12532
22377 12532 2654 -15940 -30422 -39017 -25879 -8703 -259 2032 -6186 3732 7123 12357 25080
22364 25080 19993 4721 -17904 -18426 -14837 -31541 -27802 -20248 -1596 1683 -81 10044 18572
22351 18572 5851 -8105 8388 6681 2286 -3147 16119 27152 4807 -7643 -7651 -9642 -17094
22338 -17094 -10609 9558 14793 11480 2959 -24898 -26334 1580 6594 9691 13181 -9236 -27362
22325 -27362 -42075 -30503 -20508 -20186 -31523 -34322 -39837 -40779 -59343 -58109 -46172 -20015 20812
22312 20812 26046 7284 21153 26041 18208 13086 15481 8869 -11860 -6665 -10939 1668 -2488
22299 -2488 -13499 -21058 -27174 -32683 -42206 -23713 -15313 -17692 -10724 -2385 4720 -5673 -17886 -22237
22285 -22237 -31192 -27608 -31563 -13881 -638 10963 7018 -6911 -22700 -13684 295 5336 -5692
22272 -5692 -13540 -20409 -19189 -20227 -27929 -33535 -22516 -10594 -10671 19554 5354 -19739 -29077 -19648
22258 -19648 -3347 10570 24478 18808 8069 540 4903 2955 6097 14546 18661 11788 18713
22245 18713 15771 2311 -1038 7424 4218 -13555 -8577 -10207 -2519 -13982 -35674 -45125 -35948
22232 -35948 2693 9242 290 -6385 8773 10467 -4659 7724 14491 -1576 35 8839 9189
22219 9189 -6793 -19284 -30442 -27615 -15084 1570 911 6886 10561 1469 -3340 -11019 -12551 -27137
22205 -27137 -39231 -12496 -26984 -34770 -46977 -43296 -17232 -983 9880 14215 7989 1701 -12219
22192 -12219 -11688 3406 9323 5905 19146 25446 20965 -10506 -17999 -16250 -11935 -6101 -10165 -1131
22178 -1131 -10173 -321 20409 20539 9187 3594 8595 303 -15303 -29305 -19915 -25064 -8903 -3718
22164 -3718 -23708 -26091 -18117 -23994 -26908 17143 37423 24758 -545 2737 4248 12780 35745
22151 35745 16397 7090 -3149 -9878 -1075 4848 -6272 -30822 -34551 -26707 -9403 15623 24817
22138 24817 14860 -6770 -16142 -12665 -22116 -2701 -7555 -19134 -30627 -24677 -27753 -17147 -9310
22125 -9310 -5312 2068 1740 8103 -5401 -12948 -3194 18161 22944 -1692 -20722 -3332 -1804 -9351
22111 -9351 2032 -16490 -33108 -35654 -30607 -10786 -332 -4277 -17176 -22446 -18556 1159 -6310
22098 -6310 -22819 -19318 -12102 -9310 6769 4788 2072 13141 22648 17272 16805 6218 -4372 -9666
22084 -9666 -4845 13123 7059 -13432 -11387 -3474 -5455 1597 4404 3680 4783 -2452 -21743 -28216
22070 -28216 -19523 -11526 -24150 -16378 -9428 -16880 -20422 -12422 -6863 8763 2151 852 16317 3792
22056 3792 -270 18913 20659 1913 -4901 6930 18717 21039 19464 13215 2991 3928 2604 12185
22042 12185 7556 4760 4990 -16526 -20349 -22997 -25633 -30512 -9020 -33 -8105 -33041 -38994 -22126
22028 -22126 5369 6494 -15623 -20221 -16804 -2744 -1820 7175 10598 13136 8760 -15202 -37945
22015 -37945 -33949 -21645 -18278 -15073 -9854 10390 34188 19105 -15178 -28233 -27113 -8039 18396
22002 18396 7834 -6561 5265 15457 16511 -3313 -5764 -7825 -14675 -20076 -18257 -9818 15111
21989 15111 24184 11899 9317 24100 23662 31991 38037 14471 1241 11514 -570 -697 -1549 3262
21975 3262 3370 -14286 -29340 -32364 -27369 -24012 -7550 6710 14671 17423 -1285 -12967 -11546
21962 -11546 -20438 -9963 -10314 -5427 2391 15908 27635 31446 18671 1122 9500 13141 10079
21949 10079 -1216 5081 -6274 -24531 -12596 4060 -7560 802 2051 -12466 -5389 18967
21937 18967 7930 5024 1883 -4571 -21616 -17246 -23063 -18814 -8495 -5089 -9194 -13842 -14152 -17873
21923 -17873 -17250 -8231 6596 9826 -1818 2522 -10596 -20580 -28255 -30253 -24997 -15205 -22893 -31592
21909 -31592 -33636 -31264 -27726 -14092 -6477 938 2752 -10523 -24987 -39705 -30796 -26063 -12878
21896 -12878 -12018 -20604 -16250 -9116 8138 3541 -10552 -21051 -34407 -21648 -9384 -9757 -22621
21883 -22621 -4710 -5368 -6789 -187 -6128 -4538 6287 6529 4237 -715 17446 6012 -3557 -4607
21869 -4607 -3344 5681 16248 16336 3776 1172 -3556 -2475 5156 6818 4253 13554 20728 19999 18871
21854 18871 14391 6869 1095 -4171 10890 26429 23959 7493 16747 18178 20425 23505 33799
21841 33799 8516 -1066 -20096 -2351 6428 -4548 -3790 -3868 6814 4113 14732 4950 10103 3531
21827 3531 16824 17253 2461 -13736 -8772 23273 26021 16450 10769 -8156 -25819 -19401 -3944
21814 -3944 -23174 -19474 -19055 -18878 -19969 -14571 -12814 -22254 -12587 9468 5515 -4047 -5052 -4198 -4308
21799 -4308 -1091 24836 31822 31328 32935 27855 17144 15456 9031 -8258 -20935 -17737 -4035 -11668
21785 -11668 -10958 -441 4425 -659 -9151 -24630 -27323 -6614 22298 22828 6767 6617 -2821 -9606
21771 -9606 13582 6016 -21026 -22058 1164 -4274 -7600 7682 6053 223 -1040 -2273 9679
21758 9679 -6852 -37242 -26445 -11952 6773 12631 4596 -6584 -5854 14995 4200 -23429 -28162
21745 -28162 -20467 -32137 -38566 -24784 -22724 -20677 -5018 -9455 -19944 -22102 -5275 4657 15157
21732 15157 21941 53 -6658 -2553 -5439 11291 10891 21827 28707 18131 14259 6722 17831
21719 17831 14368 -1370 -2379 6487 -13510 -24342 -12963 -1164 -6954 -11511 -5485 4931 1517
21706 1517 -6086 -21199 -9605 14140 27091 24623 19577 3756 12128 2658 -7234 -1743 -11455
21693 -11455 -6117 -58 -5051 -14300 553 -2762 -33840 -22119 -7329 -4906 -6419 -6536 -9075 -6542
21679 -6542 -13402 -2353 9169 -14932 -27623 -42670 -29771 -8598 -4165 -20 -9481 -2590 -288
21666 -288 8007 16771 -1105 -24298 -25538 -13946 -3997 10028 2936 -18073 -7416 -6695 3434
21653 3434 -2534 -27019 -30137 -23467 -14249 -3417 -11215 -14178 -10605 -1209 -13964 -17204 -1904 255
21639 255 -21804 -28058 -7686 -4539 -16737 -7674 12246 9827 1208 -8011 -10867 -15661 -33342 -17464
21625 -17464 4466 1588 -4809 4448 8058 6806 16384 24063 14089 -5125 -15791 -24982 -15113 -16415
21611 -16415 -11541 3492 10678 4694 3135 654 1179 -5444 -2478 -5881 -4359 -8921 14098 30754
21597 30754 38064 37843 14947 -17388 -16420 -17378 -29894 -16571 -10105 -6957 -5032 9280 -2821 -379
21583 -379 3930 18196 24098 36474 22240 26117 23031 12381 9953 17565 33615 13936 5830
21570 5830 4735 4311 7120 -16384 -42320 -48981 -31652 -7692 -6659 -20602 -27615 -18115 -1123
21557 -1123 9008 10302 12034 14919 5984 -18525 -6408 11744 17374 17636 5191 -2482 -5052 -28205
21543 -28205 -40842 -29665 -24435 -22170 -20640 -12807 -12875 -17753 -10827 -2032 6455 13333 -938 -16299
21529 -16299 -13284 -2463 13245 9849 9003 -4160 -3429 -1065 -164 871 15511 9004 832 14475
21515 14475 6810 165 1024 -1574 -11746 -22005 -37980 -47749 -40286 -24889 -24050 -10478 2356
21502 2356 7874 12278 7743 3943 4454 14466 21630 19091 -4190 -20580 -8079 5381 -1445 -13632
21488 -13632 -20494 -25769 -15825 -6457 4468 540 -2532 -6115 -3430 -7880 -14493 -16018 -26396 -17073
21474 -17073 7774 27191 29417 14476 14089 16856 13812 8268 815 6814 -344 -12833 -34
21461 -34 17330 14844 21327 11028 18922 18704 12555 13480 27521 22951 10847 -2140 -6488 -10684
21447 -10684 -21640 -19677 4059 9251 17421 12637 712 9187 14031 6092 -4100 -6268 -1274
21434 -1274 6465 6588 -14338 -15224 -18729 -14910 -23417 -32568 -25051 -5023 3549 -1907 -5877 -11594 -8923
21419 -8923 -12891 -18956 -26614 -17248 -16850 -6719 5910 10059 185 -10216 -22260 -12199 4130
21406 4130 1804 6547 -6077 -13606 7252 25225 20532 16320 26845 21366 5482 5842 14211 3936
21392 3936 19607 27132 6883 2519 9083 16575 18833 18908 11980 19274 32998 23178 30058 38698
21378 38698 35211 18680 28258 28497 -2844 -1969 -2186 1337 -9240 -17474 -20570 -18515 -20434 -12230
21364 -12230 6816 7628 -2281 -419 8351 12381 22940 3708 -17284 -18490 -2395 25239 20775
21351 20775 7131 -14851 -23421 -29426 -26365 -15423 10398 17296 2589 -2087 17340 10985 -4673
21338 -4673 -13229 -20083 -18047 -16966 -22933 -19750 -23151 -28453 -32052 -12114 -6063 -11893 -16437 -20352
21324 -20352 -17715 -1132 -4375 8811 10423 2513 -1253 -4347 -18253 -14964 -2214 -11247 -21490
21311 -21490 -17105 -5721 6459 -9434 -9277 6443 17121 21239 21991 16245 9891 -563 6875
21298 6875 23692 41001 20473 -1308 -19671 -16937 -3466 17183 16684 20906 42343 25213 1309
21285 1309 -9007 590 -91 -26270 -29532 -31006 -17488 -10728 439 19385 15460 13108 -75
21272 -75 -7215 -986 2828 7042 -4960 5846 861 -10629 -4113 2828 -2644 -9174 -2605 -8895
21258 -8895 432 28471 31648 20889 17804 24761 17066 18189 6639 -14742 -2833 -17367 -27349
21245 -27349 -13386 74 -8741 1293 10506 16189 24569 27301 14126 -3516 -13517 21111 40542
21232 40542 24926 13323 14716 22800 39470 50308 30368 2117 2641 -1033 -2134 15078 1610
21219 1610 -17374 -25239 -13493 -4286 3411 3706 -5569 -14107 -14262 -14536 -17488 -9107 -3257 -5212 -7104
21204 -7104 -1671 2767 -505 -3290 5940 12712 31885 31565 27709 8707 7054 11635 5797 -8569
21190 -8569 -44473 -37079 -33481 -20498 -22247 -18259 -11873 -13152 -17144 -1448 10478 21055 21442 5106
21176 5106 -15438 -29610 -18217 -17177 -5250 -7124 -6146 -16933 6725 18351 9179 17343 20392
21163 20392 -10258 -37519 -41002 -27712 -20141 -18853 -16341 -24120 -46230 -48474 -34203 -23145 -44005
21150 -44005 -51916 -33498 -10356 4056 6427 -5330 -31672 -34835 -35726 -37539 -37459 -43427 -29957 2567
21136 2567 3646 -19784 -40348 -42872 -39454 -16660 -1562 -7537 6594 21864 16804 5358 -6920
21123 -6920 -14461 -21214 -17891 2418 11682 -5368 -22003 -17316 1300 15916 1858 -17909 -33245
21110 -33245 -17999 2023 2802 -21915 -24370 -17437 -20506 -6255 15249 13294 2074 -8142 -17713
21097 -17713 -22233 -17109 -29720 -32139 -36596 -36155 -22044 -19901 -14564 -30340 -39650 -32027 -11862 -1653
21083 -1653 -1472 -7708 -9385 -611 8684 -2293 -23572 -29103 -17909 -21645 -33188 -12538 -5376 -11152
21069 -11152 -9708 928 6108 30818 21253 -8795 -21328 -162 3944 19063 -5435 -36697
21057 -36697 -28112 6550 31774 14758 1887 588 -12681 -21584 -30305 -15207 -28367 -42474
21045 -42474 -37290 -24793 -17339 -8206 -5248 -16475 -25484 -36868 -45868 -32289 -26651 -18510 -21698
21032 -21698 -18069 -4237 2039 -8669 -17035 -20652 -31820 -39740 -29943 -24418 -27671 -11689 -11754 -5460
21018 -5460 8229 5279 2318 11331 17301 32821 36395 25336 12469 21836 8880 -17993 -26132
21005 -26132 -6672 5364 -9708 -11986 -15076 -26373 -30975 -11012 -9028 -16764 -14724 -11270 3421
20992 3421 15085 6410 7181 12659 11206 -5727 -20414 -33658 -40730 -32046 -16336 -24613 -15375 -7776
20978 -7776 -7774 -2748 18276 12623 -14122 -14671 -9539 -6380 -1618 11419 15181 10093 5793 -7509 1929
20963 1929 10381 -1134 -8920 -20916 -36838 -24661 -1618 23043 23698 -4819 -13057 -26747 -36501
20950 -36501 -18865 -13250 -7535 -15250 -22049 -37006 -50432 -28463 -26836 -37655 -33969 -24693 -3703
20937 -3703 3442 -6062 651 2000 2090 -7638 -9015 6049 22423 17404 11909 9414 1496 5224 11026
20922 11026 12440 -2755 -11875 -30800 -34271 -26734 -38751 -38782 -31575 -17546 -6889 -13294 -11153 -9437
20908 -9437 4144 4077 6377 13931 31541 45317 53010 45799 32722 37342 33114 28923 19270 12043
20894 12043 12765 6557 -1621 -7658 -2084 -3816 -7301 -14012 -17092 -11834 -14251 -16365 -7110 -12209 -13602
20879 -13602 -12644 -12554 -17858 -20669 -10779 1323 -1297 -12812 -29001 -18131 4767 1978 -6686 -16471
20865 -16471 -23323 -22894 -25032 -8749 2420 -237 3428 5918 -14104 -35503 -17991 6782 12900
20852 12900 3247 -12645 -18114 -6610 -5565 -10648 -21804 -18554 -22352 -19794 -9863 -8675 -18488 -14205
20838 -14205 -5374 6994 9162 -13214 -17006 -3155 -1135 -2263 2435 -7454 -13742 -30616 -29859 -32864
20824 -32864 -19385 -22531 -21421 -30155 -31144 -3433 1376 -611 5429 -6816 -18840 -28285 -41905
20811 -41905 -42747 -42248 -33553 -12236 -1335 12634 9561 6358 -176 -16866 -18423 -16128 -12765 -3810
20797 -3810 3715 5273 -1114 -11084 -16302 -30866 -34925 -33832 -33089 -33625 -27152 -29350 -36429 -44645 -3810
20782 -3810 10862 7127 24296 10573 -3977 -23731 -23308 -24487 -33482 -28331 -29469 -29238 -28197 -16822
20768 -16822 -5434 12022 14614 9892 2874 8897 -3142 -7417 -18781 -20774 -6332 -6068 -7766
20755 -7766 10289 3401 -7926 -9321 3179 8155 4184 -24 18398 14418 -909 -4995 3043
20742 3043 7900 -5203 -13320 -12455 2991 10839 5125 -5382 -11275 -12615 7569 17341 11223 16009
20728 16009 10934 11332 3829 7710 -2749 13721 24523 12818 -14137 -12855 -13871 -1354 2072
20715 2072 -4531 5206 3545 12406 12149 -3650 -5518 -2100 972 -326 4539 -10556 -15660 -13459
20701 -13459 1731 1363 1189 -1638 -15156 -25136 -29235 -15929 -16040 -15455 -5383 4458 -5203 -16248
20687 -16248 -9596 -1611 10657 17744 35728 35095 18044 11965 -421 -19131 -22863 -6379 11500
20674 11500 5840 -21230 -31597 -25078 -11423 -884 2847 8873 27168 10149 9753 15155 10101
20661 10101 10720 7738 -11700 -9103 -13636 -24367 -33817 -39582 -46947 -38049 -14863 1784 -7196 -4013
20647 -4013 26308 14136 -3580 -31648 -41782 -20333 -12525 -11934 -15907 10517 15789 -11596 -16347
20634 -16347 -10457 -5973 -7808 -19351 -23181 -21651 -10137 -9484 -17688 -20588 -36663 -42814 -27569 -15017
20620 -15017 4973 8218 -16277 -28801 -17216 -11853 -7072 4570 21312 19320 16212 33229 47858
20607 47858 27492 16838 4025 -21974 -26307 -10072 -3079 -7670 -5701 -5440 -2907 -10825 -4834
20594 -4834 -8033 -18780 -16682 -11297 -6112 -15222 -9149 -20616 -10255 5714 9649 -19310 -13678
20581 -13678 4451 -13011 -19111 -14301 -5353 13944 18822 16045 5608 2294 1262 -1451 -14997
20568 -14997 -20422 -17433 269 6227 -15006 -23183 -28832 -9981 15915 22890 5186 -10359 -10024
20555 -10024 -32071 -33395 -54200 -50333 -25931 -8302 1606 -1823 193 14766 22340 3868 6833
20542 6833 23942 27690 26466 16340 29564 33523 4553 -2831 -11985 -3133 408 -7663 -7369 4806
20528 4806 12227 8200 8657 -5346 1420 5539 739 -10612 -21616 -20109 -20256 -17934 -21031 -25372
20514 -25372 -25946 -30137 -25634 -9535 4607 565 -25330 -18201 -428 16269 12179 -2439 -25689
20501 -25689 -14945 -7655 -11241 -18731 -24869 -36439 -30568 3788 20550 -8926 -20250 -7789 -992
20488 -992 -26170 -37911 -34977 -28003 -18020 -3464 5102 -1476 -7555 5429 6762 26862 21479 11238
20474 11238 15136 -2189 -5639 13364 16279 -11509 -21181 -11185 -2219 -10451 -9793 5441 10221 9919
20460 9919 3279 7623 -62 15906 8573 1311 12219 10809 5960 -11005 -13817 1921 14560
20447 14560 13739 11365 5036 -16542 -35309 -32130 -5290 12033 -2462 -12011 7593 8454 11687
20434 11687 4780 -6606 -18687 -26082 -14398 -2577 -10052 -23827 -31467 -6089 8067 -6781
20422 -6781 -18647 -13417 -14655 -27463 -35624 -34437 -21928 -6433 1664 11294 11840 -5597 -1245 -7661
20408 -7661 -28707 -28475 -29748 -34086 -24871 -16872 -14627 -15832 -19152 1638 10704 3501 5269 24346
20394 24346 39240 39005 1772 -15586 -5700 80 -6801 -10094 -1364 9970 12599 16416 15611 13948
20380 13948 7502 7134 4454 8734 4423 -1684 -8242 -14926 -11962 -4956 -10594 -20596 4935 11207
20366 11207 12226 5138 9101 14484 5754 -5500 -762 12470 12540 16807 -8963 -13729 -14172 -15908
20352 -15908 -13754 -13817 -24160 -32136 -41892 -28181 -1683 7941 1544 -18830 -24256 -23394 -16560 -24450
20338 -24450 -51280 -38584 -26399 -29223 -22004 -15585 -32562 -25437 -15279 -15649 -6398 19325 18596
20325 18596 -1605 443 2156 17186 20836 2649 -24194 -19481 -1907 9367 934 -5820 -8499
20312 -8499 -3475 -9824 -1699 15405 -897 -13497 -2486 13386 20362 7517 16830 10275 822
20299 822 5906 16368 6328 2043 2885 4692 9798 -12207 -23192 -25992 -11348 -2654 15705 14933
20285 14933 17072 18244 36903 25868 3815 10854 18047 26591 26603 36176 36172 25288 3220 11352
20271 11352 2075 -18768 -19696 -18316 -9966 -30 -21606 -39789 -20090 -8555 -3074 -17971 -23738
20258 -23738 -21822 -4656 -15560 -26026 -32309 -13693 3776 8121 12085 14463 5486 -1623 11029
20245 11029 3114 -5781 18194 36099 19969 19592 30011 41933 21234 -11395 -26575 -9323
20233 -9323 -6987 -3231 17190 8811 -11457 -30276 -24576 -14668 1970 298 -9740 -34262 -29531
20220 -29531 -17450 -22079 -33729 -26534 -13920 -8176 -25673 -23818 -17557 -34280 -17905 -3584 998
20207 998 5820 -4232 7169 12283 7748 -10048 -24598 -28089 -33485 -23866 -7808 8737 20222
20194 20222 -1567 -6143 -18571 -30902 -42059 -39694 -30296 -14240 -29327 -39066 -42631 -34010 -15836
20181 -15836 -11423 -24423 -34285 -31479 -25080 -22481 8752 10784 -3980 8471 10536 13727 22713
20168 22713 6175 -14182 -19312 3307 22299 31248 19895 -21834 -43738 -31523 -15920 -6658
20156 -6658 -7191 -7714 -2746 -19439 -34397 -35079 -12682 1100 6750 1506 -4747 400 -8033 -28887
20142 -28887 -39485 -32851 -39328 -37582 -43059 -39532 -20653 -6805 -5007 -6533 361 2797 -877 -6504
20128 -6504 -12288 -1564 19063 8104 -12349 -20442 -16854 692 10261 454 -7840 -14944 -9190
20115 -9190 -15469 -37568 -50213 -34792 -26065 -11931 -14731 -25044 -53164 -44604 -14958 -5835 -6522
20102 -6522 -9726 -4334 -557 -25527 -27597 -16503 3797 -7439 -18237 -7775 -2314 -17782 -21430
20089 -21430 -18359 -3651 3219 11627 15806 -6954 -22150 -17756 -8492 -24711 -25235 -11525 -10446
20076 -10446 -12566 -19449 -10325 4654 -6414 -28788 -28290 -24853 -20686 -16188 -10188 -16757 2781 -12593
20062 -12593 -24870 -17237 -11105 -6882 -14023 -22202 -13011 -21531 -23852 -4203 -10381 -15509 -7802 5124
20048 5124 1797 -5710 -22101 -31519 -8269 -1437 -3380 -14636 -28325 -42730 -42300 -22889 -16401
20035 -16401 137 6513 6506 -18829 -8498 10162 -9240 -20166 -15810 -16958 -18210 -8423 -18444
20022 -18444 -18167 8210 -11737 -28758 -34869 -39613 -50078 -37587 -14169 -9319 -2931 1999 7966
20009 7966 -5150 -7831 -10859 -5765 -3132 19057 36562 25380 2400 85 -15389 -26704 -19737
19996 -19737 -13250 -19403 -25268 -19594 -17948 -4149 -13980 -24505 -16695 -15275 -23447 -15101 4865 5699
19982 5699 -18247 -23588 -24081 -28197 -22938 -27610 -45126 -12982 -1117 -26980 -25946 -17657 2908
19969 2908 15191 10490 23804 28972 11272 -3013 -22476 -12947 -4828 -1853 -10653 -8051 13164
19956 13164 7 -10656 -2652 -11936 -14593 -12848 -10024 -17305 -29039 -15151 2568 -9469 -34985
19943 -34985 -25612 -21168 -33307 -22474 6907 5415 -4273 2416 -2439 11548 18114 21151 12133
19930 12133 910 -23150 -36272 -23311 4555 5678 -5869 -28070 -35101 -33003 -10771 4454
19918 4454 6834 -9712 -3275 -9068 -21486 -20942 -23996 -8095 -7714 -18439 -40767 -61192 -48892
19905 -48892 -55798 -29154 -3663 -12660 -20919 -24578 -15539 -10996 -8108 -13753 -21278 -7918 -5868 8164
19891 8164 3701 -13440 -21183 -13158 -14136 -23927 -46527 -33216 -19469 -3972 -11562 -25034 -29618
19878 -29618 -5042 14107 9088 -10580 2507 476 -12744 -39071 -49497 -59090 -48546 -42838
19866 -42838 -26899 -3128 -4094 -9057 -13583 -9170 11344 25717 20536 9380 8528 7950 7924 -27633
19852 -27633 -40079 -7503 29379 44350 39390 15133 -11404 -5775 -11027 19598 32082 22497
19840 22497 15698 3034 -16951 -19514 -37537 -38688 -18800 4247 12571 25446 25730 13702 -1042
19827 -1042 -4545 -14112 -27022 -43076 -33368 -33971 -28969 -13327 -10249 -1806 1940 6544 -526 -10931
19813 -10931 2236 11216 -16184 -27424 -18366 -8134 -24067 -24667 -13180 -2922 2105 6330 3402
19800 3402 7089 2947 -11323 -10856 -1415 -1831 7864 3918 -7880 -7619 -20736 -28569 -32749 -19983
19786 -19983 -6530 -8769 -15915 -11971 -20029 -34313 -25223 -22358 -14091 -16887 -15944 -11229 -12185 -16367
19772 -16367 -7531 -4965 -16145 -14409 5170 2753 -1000 6139 1673 6718 6939 -2979 -7470 -7166
19758 -7166 -27740 -34886 -22265 -18391 -17812 765 9773 5627 -2550 -2510 20414 25704 13707 3401
19744 3401 3462 4607 1401 -4033 -7627 -7360 -501 -8424 -17689 -8493 -18248 -20774 -14375 -7276 287
19729 287 -8702 2260 -1829 -3877 -4601 4670 4456 -6793 4565 1779 2715 18627 40194 32732
19715 32732 21379 6453 -5405 -4640 7183 16598 16259 -5289 15483 6246 -7396 -15901 -29929
19702 -29929 -43476 -36881 -31137 -31522 -21470 -3540 -13518 -7901 2436 -9801 -44669 -45918 -24923
19689 -24923 -14628 -10264 -19449 -9196 -3366 -847 1194 -3962 9088 35972 36842 13490 -6347
19676 -6347 -6369 12356 32316 17655 -5070 -20059 -31822 -39352 -17347 3569 -13146 -4123 4550
19663 4550 -4940 -13595 -21046 -23528 -17842 5172 -7067 -9180 -10720 -869 5431 14531 6698 15562
19649 15562 1786 -14978 146 14193 9191 8911 22132 26325 12901 3009 -883 -10276 -12163
19636 -12163 -5105 -3632 -5147 -1973 -19002 -9583 2285 -272 -4607 -8713 -20257 -35099 -29964
19623 -29964 -26411 -14005 3486 12559 7615 -10974 -11950 -5188 -13949 -14806 3608 -729 -13061 -5483
19609 -5483 6412 759 4736 -1698 -15072 1220 4137 3256 13492 -2150 -4468 22066 23113
19596 23113 18519 25005 16537 13870 4289 25661 26499 35542 38269 17974 5464 3059 21292 19993
19582 19993 16665 17754 14279 16771 3327 -4280 -9812 -8959 3489 6706 5355 8983 6802 -12583
19568 -12583 -5772 387 -1074 -3491 429 10343 -3356 -18389 -11787 -948 -8562 -11417 -4897 4259
19554 4259 10194 10241 23953 20816 10981 -2233 -23022 -11530 -10906 4736 -950 -11401 -8913 -5248
19540 -5248 -24948 -24830 -15313 4343 15129 9124 13230 1437 5495 -40 13955 33774 19774
19527 19774 2600 22278 17396 -4154 -24843 -25240 -22084 -4412 23407 24891 16051 16150 26443
19514 26443 18178 -598 12843 17457 9684 -8974 -20012 -17650 -15675 -9492 -15805 -24841 -26261
19501 -26261 -16291 -5330 -16541 -20036 -23548 -25968 -19048 -25602 -31692 -25960 -3440 9439 10598
19488 10598 13128 18473 5242 5649 23782 28680 11704 -291 -7630 -15574 -5477 12875 16496
19475 16496 38651 50212 41085 36581 28828 22641 8068 10774 -2010 -7411 -1385 -11942 -15523
19462 -15523 -17200 -5768 19684 10639 -9241 -6373 -10632 -10498 5154 25806 18723 12659 -3862
19449 -3862 -17260 -20625 -34462 -35350 -37018 -41330 -36745 -35268 -37839 -31780 -21044 -24749 -23081 -30880
19435 -30880 -19651 -739 23612 24345 4609 -9011 -2159 -3349 6645 7405 6904 5357 9053 -1168
19421 -1168 -2233 -15273 -24375 -34387 -53347 -51027 -26971 7583 -262 -1640 -1964 -6860 -6989 -34680
19407 -34680 -30673 12 14625 2167 7292 6547 18487 27778 21098 27699 42651 35848 10644
19394 10644 2358 -11418 -13166 -18816 -24810 -29705 -24002 -11257 -862 1290 -4209 4152 -6468
19381 -6468 -6288 -14069 -1090 -16076 -20445 -13059 -11683 -5982 -18157 -29199 -20485 -8325 -13338 -23599
19367 -23599 -43663 -26744 -15265 -15668 -3418 10446 21629 6290 5123 7577 10766 8797 -1635
19354 -1635 -7612 -11002 -16905 -32237 -39758 -48089 -46559 -38699 -36139 -22631 -8575 -11530 -19619 -15690
19340 -15690 -26045 -43701 -37953 -19200 -1679 -3942 -4067 -4884 13643 20625 5059 -4006 6330
19327 6330 16756 13177 15360 6983 -26214 -26703 -46107 -13034 10829 20816 10990 -6266 7656
19314 7656 11950 9621 9427 3286 471 -412 6567 -8306 -28361 -21104 -2234 -11192 -16366 -3188
19300 -3188 14556 6381 16570 17695 11526 20430 25280 21139 4828 9009 11287 12240 8534 4189
19286 4189 8069 10606 21768 31498 38879 54688 45368 14896 7365 6226 23111 30117 16214
19273 16214 13914 5852 -6286 -20667 -26818 -12710 -3271 -3488 -8600 -19896 -28369 -19526 -13034 -7194
19259 -7194 1660 10666 11772 7169 15988 16227 2141 1724 -4198 -5512 7200 23603 18046 4682
19245 4682 -16183 -22028 -15067 -24313 -12846 592 17130 31517 25686 23548 17509 1429 -14931
19232 -14931 -15820 -17235 -25452 -42188 -35143 -27350 -39378 -23302 -3794 13926 4542 -12221 -11102
19219 -11102 -6615 5112 7519 -2365 7874 5980 2399 3687 -9733 -26652 -22710 -26812 -32319
19206 -32319 -24622 -4011 -14914 -18712 4341 8872 -9094 -29157 -22284 -10790 -19236 -18317 -2356
19193 -2356 -12044 -41246 -30946 -24095 -26923 -22723 -19275 -11325 -533 3477 -11497 -5528 3657 7927
19179 7927 15993 24955 21819 9144 5309 11516 10027 12655 15411 3481 -11757 -12525 5422 9981
19165 9981 24465 29925 17152 23455 30219 14720 7457 1603 8751 10257 12902 10507 27214 23916
19151 23916 8004 -21605 -15206 -7123 -3932 2309 14141 10915 4596 14144 16158 15985 3676 -14965
19137 -14965 -3775 -14959 -20344 -9203 -5924 5059 -5067 4514 -5859 -25269 -14975 -72
19125 -72 -1217 11583 26191 33290 29468 26884 23769 9991 -22664 -27307 -25116 -36306 -38807 -24484
19111 -24484 -9328 11293 18095 -1180 -18306 -11140 -10637 -3450 30336 39508 43801 44938 35621
19098 35621 28877 54163 49664 45942 45578 48717 48588 48705 49682 65631 86342 120934 168750 227239
19084 227239 276464 296434 300243 299955 247184 196006 176607 160258 147734 159255 184947 261563
19072 261563 330244 348889 326093 269378 221549 168302 122749 87968 54326 45047 40246 45945
19060 45945 36558 22971 16257 15891 24910 23268 26687 11434 -194 -11745 -24599 -34392 -15872
19047 -15872 7676 15854 2410 -20623 -24336 -17169 12134 24927 -2353 -7790 -3785 475 10046
19034 10046 24358 18981 11033 3077 1370 9785 23255 -4318 -10536 -11883 -9332 8020 -6892
19021 -6892 -14770 -4166 -8607 -15713 -7665 8231 15359 14217 14403 -1352 -8029 8769 23700 12920
19007 12920 -12650 -26578 -35054 -39613 -8786 15251 27328 28244 25729 33516 30077 7884 -3584
18994 -3584 -4537 -1113 7158 -1686 -9725 2484 20289 21981 -1314 -7169 -19101 -10101 13023 23010
18980 23010 29693 19133 3619 -17928 -38033 -26439 -17719 -24655 5832 15117 16679 8966 13831
18967 13831 16704 -10356 -5362 5578 -2081 -2875 3143 9661 -3723 -19285 -20203 -16459 2892 6804
18953 6804 15463 25226 19227 11041 -3261 -4785 6642 1115 -9754 -10592 7027 2242 2535 1846
18939 1846 -7989 -16450 623 25659 27366 7537 2575 1673 -421 -4414 -11737 -11255 -7852 -6781
18925 -6781 -3711 -12468 -5598 -428 -178 -2584 6560 24902 58780 93196 110539 124998 132970 122814
18911 122814 102528 83030 58046 42291 38304 28304 27018 43835 69495 94969 85556 84146
18899 84146 88238 68226 49686 55088 56197 62823 57957 54131 65570 96073 96434 98677 104510 95782
18885 95782 90109 100478 97950 91201 68397 59771 78424 85919 81807 78282 87931 96562 102736 110634
18871 110634 118085 142649 152872 181716 193596 203760 215663 205744 192993 185395 181565 156731
18859 156731 131443 106059 82860 59620 52880 54994 48707 40071 35720 38549 36453 29872 18604
18846 18604 32024 65420 66310 51751 46404 36563 36014 44362 35109 39912 41945 48032 53268 40193
18832 40193 28607 36311 50638 53517 50125 59858 39078 19884 33170 37051 20728 24774 40854
18819 40854 65597 90168 107749 138519 165258 171415 145111 119582 87347 29215 3280 -11040
18807 -11040 -3192 16020 36576 68240 86422 104320 100425 103712 119770 132999 174066 215978
18795 215978 255536 274050 292673 311243 311978 315255 326286 331612 324491 348878 380612 384913 391968
18782 391968 412061 429698 422920 393177 375001 352156 327996 297781 278070 281857 278261 264567
18770 264567 281272 292198 328761 369757 361394 332997 297452 241810 207836 195218 176288 169507
18758 169507 197045 211136 219669 209127 223538 229578 226356 226914 235428 239814 241957 233761 238739
18745 238739 233290 242744 240501 231279 234735 217888 184192 181597 169817 161209 150788 128957 125152
18732 125152 116356 111124 97898 70967 58086 52668 38047 47521 49522 31268 13718 29800
18720 29800 38578 21834 17330 18996 10521 6683 25416 42287 36489 40535 48123 55120 57467 59802
18706 59802 82154 102593 114531 131481 147044 134957 133789 143908 143466 158516 154944 152128 153781
18693 153781 148172 136044 157112 177459 193493 191248 177331 174395 173675 140676 117104 92438
18681 92438 100948 100770 90362 88039 86104 73477 53508 36009 37008 30178 32671 38773 24794 36658
18667 36658 40606 44881 56724 67026 55663 56616 83985 83582 76298 83248 81041 77647 87440 108868
18653 108868 136509 126030 127462 133933 140016 147402 147623 161374 173310 188517 200176 186224 184933
18640 184933 178861 165081 153867 168999 199674 205283 213165 219741 203898 160760 117513 94640
18628 94640 91117 99498 91197 97586 117405 135366 136763 136235 129600 110965 102369 113499 120871 100930
18614 100930 79296 62863 81370 85344 91569 89259 90276 83130 62424 22179 -10146 -18217 -23505
18601 -23505 -15164 -7606 -1902 -7904 -13315 -19747 -31235 -28512 -7558 -10476 -32591 -28154 -17190
18588 -17190 4790 48388 83044 109072 120878 142512 154690 172523 164312 166845 181608 199863
18576 199863 221159 232686 242032 258597 263673 253835 243754 247494 270360 292108 294541 286620 284948
18563 284948 280983 290032 301273 311318 308296 310021 307288 318141 338031 362495 374715 391457
18551 391457 404185 414150 448172 477326 512402 521241 536804 571120 622989 679798 738458 794609
18539 794609 846900 891160 946079 1024022 1095684 1139858 1168694 1227116 1279917 1343284 1420818
18528 1420818 1479944 1527960 1612195 1727467 1862564 2008020 2166614 2323120 2512705 2737919
18518 2737919 2967474 3211345 3452495 3774502 4192421 4747556 5492258 6549148 8082864
18509 8082864 10295736 13623017 18835551 27050940 39263786 53989677 65272824 67344059
18501 67344059 63033827 56773551 47518961 37709507 31141674 28534249 29709819 35093723
18493 35093723 45232390 58430501 68620376 69640493 63977339 56288580 45421550
18486 45421550 33471812 24224619 18020048 13893954 11094714 9131507 7709615 6666628
18478 6666628 5865853 5212667 4651921 4160061 3706040 3320573 3016574 2758071 2564861
18469 2564861 2424042 2296081 2171219 2039949 1915983 1797577 1703386 1608583 1519559 1433158
18459 1433158 1380003 1358690 1333489 1281978 1239989 1188319 1120102 1054659 1014215 974750 929755
18448 929755 865458 823563 803986 800879 763550 753664 753533 747311 716540 685575 673358 676379 696474
18435 696474 709714 732201 772172 837984 885776 918442 971730 1066059 1203611 1400347 1675357
18424 1675357 2127976 2890799 4061909 5669631 7569941 9355858 10525835 10701839 9973015
18415 9973015 8839857 7608799 6570470 6121869 6388864 7018032 7395308 7139884 6443656
18406 6443656 5579828 4536543 3522111 2770829 2272846 1985011 1816568 1697291 1622639
18397 1622639 1615859 1611904 1599239 1579125 1556299 1550757 1580210 1626303 1706849 1803480 1891952 1982386
18385 1982386 2071370 2216411 2433563 2763961 3232941 3945882 5084474 6909122 9751390
18376 9751390 13671851 18056642 21892829 24180088 24253139 22815041 21191062 20170232
18368 20170232 20691211 23419352 27550196 31420176 33673138 33941933 31629139 27030197
18360 27030197 21967465 17156122 12919480 9730054 7610257 6208610 5263217 4594244
18352 4594244 4075125 3677531 3372598 3114680 2914785 2764982 2725825 2776293 2867058 2976084
18342 2976084 3126182 3244822 3356228 3464834 3598645 3873911 4380019 5250457 6680509
18333 6680509 8851484 11672701 14453453 16219365 16598221 16215150 15561075 14987747 15389136
18324 15389136 17666962 22584316 30435363 39778097 47011034 49665358 48849567 45208990
18316 45208990 38460933 30898162 24417305 19377071 15742286 13356050 11948444 11192452
18308 11192452 10897154 11011029 11591037 12731297 14727837 17984796 22826363 29359779
18300 29359779 37311640 45388187 52947043 61283966 69435091 73879265 73724236 74693568
18292 74693568 76847322 77645157 79101603 83103345 89474588 96931353 103970767 108531419
18284 108531419 109669976 107130625 100507211 91413442 80593131 68612481 57353900
18277 57353900 48162016 41124022 35361081 30423554 26626571 23936136 21201085 18333943
18269 18333943 15807344 13741383 11889764 10241050 8937213 7971772 7273370 6807488
18261 6807488 6514488 6422871 6617721 7111473 7940957 8997568 9978667 10977595 12352639
18252 12352639 13647641 14003625 13629013 13592982 13403389 12781875 12501373 12802344 13214552
18243 13214552 13714527 14793833 15812696 15748346 15061105 14519490 13425998 11721971 10211697
18234 10211697 9116461 8157795 7429280 7053549 6808015 6354901 5892477 5527552 4935909
18225 4935909 4216371 3613356 3131581 2681868 2330649 2087835 1926339 1823560 1773906 1774951
18215 1774951 1785339 1779620 1780818 1779537 1779790 1776746 1798197 1833663 1865250 1918981 1995386 2106319
18203 2106319 2247689 2397131 2596468 2870092 3280257 3863646 4735126 6098644 8191166
18194 8191166 11056075 14432416 17971428 21488734 24016518 24537167 24195852 23290378 21510593
18185 21510593 20453601 20972195 22895280 26167521 30384096 34356784 36665399 37213222
18177 37213222 35627647 32106408 27979441 23756715 20374339 18441247 17822977 18190708
18169 18190708 19013438 19546157 18947125 17575491 15591722 12961606 10476589 8419156
18161 8419156 6783752 5642360 4901694 4427383 4115976 3932388 3834112 3836661 3983665 4364473
18151 4364473 5097505 6280054 7875756 9607831 11459808 13465110 14787580 14871819 14745230
18142 14745230 14453671 13497166 12969955 13550676 14999390 17092603 19623147 22275102 24091084
18133 24091084 24255294 23203243 21389335 18764313 15964460 13916237 12759805 12311505
18125 12311505 12485046 13100662 13611687 13251919 12454287 11428111 9814364 8240966 7066318
18116 7066318 6232398 5905342 6191476 7304835 9914768 15348275 24792780 34596105 35999107
18107 35999107 30145316 27977854 22385059 14200401 9359800 6722990 5139025 4130474
18099 4130474 3425761 2896591 2491563 2170378 1905678 1679663 1502536 1339544 1197737
18090 1197737 1102374 1035238 960281 893744 830468 765258 715463 673694 624489 572615 541000
18079 541000 520108 500018 484219 472081 459246 470932 471744 449698 426655 426241 422673 422986 418503
18066 418503 401746 385687 385010 387667 395328 388750 389927 393386 399650 394883 404151 379605 369883 375503
18052 375503 377019 369185 357033 342829 334299 333623 318447 315215 305157 281833 275847 251909 247579
18039 247579 257240 262108 268097 251486 225103 204605 195027 182619 184247 190368 191655 174820 172107
18026 172107 178129 183862 202193 207572 197676 186547 188555 185898 185262 216384 223237 224116 217970 228095
18012 228095 242992 241096 241609 231774 206321 188906 182964 178546 183503 167258 147853 132766 125292
17999 125292 125866 123930 114094 112142 120234 143396 150059 147892 155620 163436 187808 193250 210710 242868
17985 242868 262482 269080 267043 251771 273036 291249 293921 272054 273142 257207 241547 231652
17973 231652 234537 239099 234205 231384 217298 199129 176766 171427 156988 163315 161325 123404 103434
17960 103434 100980 98506 114171 128367 119775 108515 113665 108508 97349 103761 123347 139562 134907
17947 134907 105571 112702 116169 106111 103158 111564 117159 129897 119282 111138 110577 114852 106618
17934 106618 122922 137142 130133 113057 129184 123383 121915 126968 115157 110447 106033 125598 136718
17921 136718 136333 152146 172979 196166 247880 299319 358483 396223 400150 378183 334025 303748
17909 303748 273283 249686 248441 270903 307066 348911 387455 408183 419824 415460 406837 387743
17897 387743 352381 316562 288791 253142 213464 171161 166495 181700 183140 165643 157138 155643
17885 155643 142076 105187 106113 116404 96710 96717 106714 107776 120215 109144 121129 128321 126926
17872 126926 143142 146082 145911 124602 111745 113689 105547 102835 112152 101814 96453 104500 99558
17859 99558 108291 123236 130532 118172 129423 146548 166698 204857 230298 240939 251798 260864
17847 260864 287049 294671 285411 266631 240604 217300 208853 196362 186079 175632 171469 150357
17835 150357 156926 161827 141872 122305 118348 117742 121583 115748 113639 103561 94200 69306 73129
17822 73129 84357 96278 109317 114784 105905 84525 84339 78316 57019 45163 56370 92443 121928
17809 121928 146938 168886 200306 213362 219597 231899 262732 298652 311893 341140 393894 432520
17797 432520 457732 462356 464019 483467 466279 461846 442169 436835 443243 444198 455398 465144 464894
17784 464894 455103 430469 403271 372603 354280 334485 301258 276444 256820 245864 225599 208394
17772 208394 190832 168724 133369 128876 132882 107124 87413 57307 52964 73482 65882 54053
17760 54053 62282 84062 95194 108478 119774 126777 135871 130783 122818 107980 91280 108717 130379
17747 130379 151113 162461 161025 173476 161964 163826 160113 150138 148091 154945 142179 139022 129201
17734 129201 110109 104284 96210 86993 63737 60060 81805 97932 81889 77722 68524 62246 57447
17721 57447 42528 46388 55556 51250 45904 36191 31737 26980 20548 43890 57229 36661 31129
17708 31129 24798 13574 26284 42569 30491 37398 59838 55912 43629 41694 42012 36987 30030
17695 30030 33126 25629 15465 35626 51557 69285 82699 88938 88533 90950 95007 98463 107432
17682 107432 113770 98935 106372 117340 139268 144579 138920 153252 169733 186555 204962 197721
17670 197721 181602 175242 149176 138927 113200 95573 99003 102754 113817 125280 118146 113176
17658 113176 95208 98410 89836 66559 52604 52797 55538 40475 36158 36015 55632 44944 28257
17645 28257 57920 79931 74038 67818 70363 55569 59230 93259 107007 86372 86115 91338 92996
17632 92996 111926 118365 124754 144065 156318 168391 171972 153635 135681 144088 143713 146466 137257
17619 137257 118774 92009 84660 93542 93906 98794 88553 67739 56000 35991 22300 32249 46552
17606 46552 31350 32993 43066 59793 54533 47798 29117 31506 32086 37149 26753 12895 -4709
17593 -4709 -3319 -9901 5367 24555 15796 -9724 -20456 434 21711 23040 38524 50543 60390
17580 60390 49327 27478 15471 7861 12295 24418 26465 26628 18906 17083 25785 31319 11123
17567 11123 -11037 1780 1396 18450 12553 1120 3934 -1563 -9609 8639 15081 3685 -6468
17554 -6468 -14188 3313 20606 21452 8981 8270 1076 5420 16885 1351 -18160 -10863 -17103 542
17540 542 23321 23479 6690 -3719 118 -5212 -9500 -31311 -13454 30819 29771 22012 4230
17527 4230 -27156 -29062 -20931 -7634 -9180 -5951 -13450 5612 -2463 -614 13746 10782 21990
17514 21990 17835 29860 22106 1782 1991 15973 34274 34179 30552 26537 13104 24317 45077
17501 45077 46584 45396 32892 18381 -5483 -11001 3210 25071 16223 19176 10818 13342 18136
17488 18136 15496 14429 33632 19721 -645 -535 12298 16512 22612 20173 32480 30135 14685
17475 14685 8835 27834 29550 15203 12029 13529 8731 16102 24848 22171 30682 29020 7182 -5604
17461 -5604 -5083 -19982 -25049 -2677 16050 19217 12725 17480 42559 55218 68570 62532 27238
17448 27238 14837 38282 55719 75048 125234 184477 216628 180453 134847 114404 56275 36793
17436 36793 30364 31462 32046 21123 23501 27015 14626 -6073 -5177 16477 -737 -3673 1708 2505
17422 2505 4650 4051 9209 15783 11274 14319 285 -6385 2186 21633 17132 3688 11875 27385
17408 27385 24052 24756 39033 31987 13490 17858 33601 36716 29348 13350 -5550 -19300 -16904
17395 -16904 -696 12790 17182 14709 10348 11948 10845 16290 16874 6776 10427 19872 27160 22514
17381 22514 18798 2256 5907 20368 13897 2278 -9718 -9498 -11895 6695 27392 24136 -2147
17368 -2147 -12426 -14701 -13713 -7473 10485 -2617 -5028 602 8322 24676 32855 39105 35466 38285
17354 38285 27051 10328 19123 29735 5642 6781 15075 16665 15596 4585 -15438 -28550 -30619
17341 -30619 -26359 -28488 -4896 3757 6554 1729 -11659 -12816 -11768 -4731 3977 7451 11441 23113
17327 23113 34772 27644 21218 8308 -19019 -36322 -29948 -6309 12597 17880 21534 20175 3475
17314 3475 13330 14590 -1637 -10667 -3359 8096 1428 -10351 -11918 -22215 -12927 -24317 -11361
17301 -11361 -13228 -18760 -10634 -23775 -18784 -6324 -3231 9129 6215 7326 13516 10219 5660 -2390
17287 -2390 -7801 386 6193 7368 11614 23154 30994 23902 4605 -10050 -13192 2858 5376 4337
17273 4337 9972 12403 14018 7797 18187 29094 12551 13962 10170 18035 24361 1243 -11916
17260 -11916 592 10314 -556 2138 15825 13832 6224 -13625 10211 39242 25800 21934 2152
17247 2152 -20723 -19223 -9558 -1581 4843 38013 37160 7446 -4665 -31051 -43740 -46549 -31879
17234 -31879 -16332 -13276 469 4412 -16932 -2864 16802 28748 40878 33015 25227 40514
17222 40514 22952 -5311 -18529 -21134 -7115 9811 10229 3111 -15653 -27640 -24652 -15590 -384
17209 -384 13116 5887 819 10237 -3227 -28699 -16243 17678 12919 -16780 -16029 -34276 -44018
17196 -44018 -25217 -4878 3425 7464 9111 9567 10074 19952 15523 9447 9479 13900 14647 12083 -4178
17181 -4178 -14592 -11674 -5124 4732 21955 31719 28640 26822 20258 12344 12704 24519 6374 -7890
17167 -7890 -16713 -19085 -7597 -2505 -24438 -34090 -19029 -3287 15829 38249 44115 70013 87840
17154 87840 109143 143354 200323 300512 398607 431630 401892 364509 305977 236842 186066
17143 186066 159838 157790 172920 220170 307376 369479 392920 377434 346206 291924 217697 157095
17131 157095 123590 96441 74155 61504 35547 43507 27348 23546 8917 12282 25418 14437
17119 14437 17777 30429 35929 30060 17601 4704 6329 -11701 -14610 -19460 -19437 -24453 -6170 10467
17105 10467 10606 7999 12091 13143 12150 15580 5578 -3825 11968 32521 29819 22842 15362 15728
17091 15728 13249 -3882 -710 -1429 11986 23428 14889 25949 8725 9059 36230 30458 16213
17078 16213 12358 -5075 -10700 -2128 7007 11482 13289 19540 -1127 -22401 -41368 -41716 -25855
17065 -25855 -22171 -17799 -10311 -13705 -5472 9930 30818 19198 20775 10814 -504 6213 10374
17052 10374 6456 1934 3060 -5258 3094 5232 16453 23514 16694 4111 2939 2639 -425 -11503
17038 -11503 1300 7847 -7222 -21881 -18621 3339 11819 9930 9497 8281 19773 13975 25083
17025 25083 21226 20367 3150 -3439 361 -13982 -22028 -12928 -7734 -2143 15871 7980 264 14053
17011 14053 14037 13921 5778 1005 3373 20266 8445 10912 8915 13616 8738 18103 18020 20009 12854
16996 12854 -3313 -11745 -5177 304 15648 22495 28579 27815 11232 7748 36288 46514 26160
16983 26160 8264 29697 69549 110785 126699 121933 96733 63433 43494 32020 32398 16793
16971 16793 -79 7751 20337 36216 57709 102371 128448 123276 110912 75269 35414 43516
16959 43516 40607 18747 -8541 -12330 1471 2955 -5440 -8651 -3411 1196 361 -18632 -24266 -15590
16945 -15590 -21140 -35269 -37635 -43949 -40074 -13046 17316 24026 22486 22426 13335 2114 3085 -8020
16931 -8020 5156 19791 8357 -14600 -17627 -11820 5917 2243 -17720 -41080 -28397 -6398
16919 -6398 6282 -4145 2805 13207 11646 12621 8626 -1575 -24893 -40314 -45068 -37520 -46580
16906 -46580 -68471 -98463 -98134 -96910 -111808 -122106 -106563 -75114 -62918 -45475 -27705 -24922
16894 -24922 -33427 -32218 -49421 -68761 -54660 -56332 -39866 -15868 -7466 20368 46346 46921 43818
16881 43818 32615 7205 12091 9645 2963 21093 23175 16064 13857 16180 18109 2207 5709
16868 5709 12911 9893 5666 11437 4654 -8389 -22595 -15079 6922 11688 2226 -7157 6206 29001
16854 29001 42144 41986 56102 66882 72439 89563 81718 66969 59754 68039 75637 59320 67034
16841 67034 75859 76536 76933 63658 62617 46514 49037 45560 50620 58813 51296 29064 32703 24485
16827 24485 19532 18381 2376 7699 11275 -3471 -1251 18626 14464 15678 12336 1418 9098
16814 9098 3675 -12218 -25581 2549 18887 23169 17012 24129 20283 21292 14521 13792 27976 19518
16800 19518 16133 26715 20580 3277 -8081 4998 30224 43711 49073 48132 22442 -5620 -9414
16787 -9414 10540 33035 35059 37817 57991 48922 36550 14244 -1014 774 8481 13321 -6482
16774 -6482 -29515 -14214 7674 3187 -3019 -14313 -14186 -12605 5171 22988 18965 8149 5709
16761 5709 25851 21005 15539 8709 16632 15841 -5214 -11539 -12408 -24284 -29330 -24600 -20345 -14202
16747 -14202 -21602 -26200 -9187 -7092 -2882 -13065 -12479 -10721 -20503 -11678 24543 3792 -14526
16734 -14526 -13747 -13675 4492 30509 54885 61183 73484 68494 64517 38116 25150 25917 36712 65412
16720 65412 76616 108649 104637 100982 117748 120385 111390 95161 82684 80862 77780 84643 80600
16707 80600 64750 48000 51853 64474 72211 54278 55035 65318 61296 60884 58767 62279 70154 60576
16693 60576 58729 70023 77945 89732 96372 100909 88071 68305 74983 72012 71329 77268 95815
16680 95815 92105 86570 84053 58535 61568 97466 102127 82941 54309 92897 128526 131632 126224
16667 126224 136175 136932 147110 158437 164951 166418 169648 170801 175141 183727 173166 156867 130418
16654 130418 121531 154399 168332 194912 231116 254759 255314 241525 243984 236749 224135 205992
16642 205992 238495 254728 264850 284651 279504 283045 299684 312408 342235 350020 359739 383722
16630 383722 431196 460716 499044 565782 624541 694009 771205 864278 981164 1132745 1274355
16619 1274355 1326273 1369009 1449882 1531314 1680167 1906412 2141022 2339105 2539306 2769094
16609 2769094 3039579 3387905 3791241 4325650 5055236 6124740 7755012 10306031 14405318
16600 14405318 21344927 33213399 51173897 69938786 77775702 72402610 65425605 55915986
16592 55915986 42034746 31386089 26206711 25442593 29103994 38532320 54467750 71753531
16584 71753531 78791954 72491528 64310626 53925221 38851810 26390127 18700799 13972768
16576 13972768 10875910 8779180 7263538 6142933 5309334 4677318 4188912 3792309 3453166
16567 3453166 3167286 2902134 2634408 2373621 2140632 1974135 1854550 1740038 1659060 1605236
16557 1605236 1524298 1397365 1261011 1127066 1004052 905597 861516 834918 811570 755901
16547 755901 709775 654213 603796 569868 528979 503019 462378 427304 378112 366548 380429
16536 380429 378208 347251 323806 312483 305498 299158 300674 300204 280529 253637 246855 239214 227754
16523 227754 220756 222928 220884 214545 204644 187073 170064 163835 165595 168342 186595 172729 163048
16510 163048 157372 166069 147766 137904 131689 143427 152707 144139 146687 141620 134207 131658 134343 132579
16496 132579 123609 107340 103427 97275 99550 107689 85159 62449 73643 97967 100310 101327 114618
16483 114618 116911 102253 108678 105610 96233 96169 105230 106963 93956 71383 70563 94748 116409 116129
16469 116129 100299 118617 129359 118724 109872 80370 77380 79344 52818 41569 51977 94392
16457 94392 94680 88350 110124 112178 71475 18006 9996 8239 22864 38486 47379 44512 40124
16444 40124 38138 37545 67514 67459 53384 39994 44084 52709 56121 62523 65495 84088 85601 87498
16430 87498 91748 83313 72964 67916 75049 77942 73907 90121 102974 108729 107934 88976 66589
16417 66589 55267 79834 89792 52117 18953 20119 31239 52765 60721 68581 63858 57082 49147
16404 49147 51723 63304 70302 81062 73012 68073 58233 63846 58230 58705 29037 2196 8613 25892
16390 25892 14636 4274 2217 -5802 -11285 -9346 -18040 1935 3526 -647 2945 7065 -983 -15180
16376 -15180 -5602 25708 55427 53829 30525 21277 20671 2511 -665 5169 31200 37708 40373
16363 40373 24009 24339 24972 24471 35090 25564 2255 -5950 -5110 5255 5481 13032 7306 1201 14660
16348 14660 14359 21349 17074 30567 37272 26341 -958 -1209 9368 21195 26230 18326 16458 4625
16334 4625 12988 32384 35445 22913 5059 4466 -6607 -11892 -8898 8948 10426 -4915 9027
16321 9027 27214 39432 19696 -1180 -8046 -9768 7172 28823 11877 17678 25362 32121 38821
16308 38821 35584 42887 29592 31202 11694 -8051 -8832 4985 -9727 -22719 -20624 -17607 -7632
16295 -7632 12974 11304 25760 33313 47003 84284 107595 108326 99512 84597 76524 73253 59864
16282 59864 52212 69047 60743 80983 128252 137858 123205 106793 87630 73467 64716 79729
16270 79729 71636 38510 21843 13244 2204 24075 38306 41502 25130 4677 4800 15999 3700
16257 3700 -3307 -1975 6882 24942 12712 -1898 2071 26085 37333 32888 47225 50958 40144
16244 40144 24284 40933 45844 39928 45658 53662 33007 13554 1287 12409 23952 11062
16232 11062 19982 31036 13111 8587 4165 9686 21606 21421 15902 -1806 9316 7392 -3855
16219 -3855 -28226 -8670 13518 22337 36576 35983 32608 9374 15865 11031 21605 10380 1223
16206 1223 283 -6152 -20660 -16475 2130 22714 21572 16119 13389 32548 40829 30998 15702 -1076
16192 -1076 -9644 24232 29979 26131 40401 39440 24122 32084 21631 10663 -3724 6398 29456
16179 29456 51736 52864 41028 38094 13404 5583 -2732 -6150 12579 22015 9620 -10374 3942
16166 3942 588 -21284 -6347 11244 13316 5398 -4690 2626 295 19629 24841 8596 3153
16153 3153 32625 44138 40419 45286 33694 24087 9438 10293 13266 30178 39018 41761 36788 -1024
16139 -1024 -9112 -1915 5391 -1405 -531 5257 8951 10111 20387 -85 -784 8753 3444 3987 16314
16124 16314 17899 1572 -806 18003 6883 -3328 7953 28052 44013 43294 38219 37121 50418
16111 50418 44333 36956 22418 27994 38572 36877 26593 16635 22573 14489 25766 19370 5316
16098 5316 3140 -7689 -22110 -20267 -18488 -14532 -4380 -8864 -7943 -25074 -40314 -51680 -41991
16085 -41991 -16663 -1663 -5406 -7346 -24897 -31166 -21142 -1867 13327 13013 28322 59231 63874
16072 63874 50925 33435 5160 3283 23453 30608 18598 16602 10772 8287 7940 700 365 5776
16058 5776 -2277 1903 5164 81 11092 11853 20699 5843 -3125 25584 32115 27204 30532 27920
16044 27920 38944 49947 68973 105673 145565 231897 327914 383816 387933 363161 328768 268811
16032 268811 207634 154806 126225 145645 193695 248118 326852 427059 443297 407758 353641
16021 353641 286730 222735 147239 104292 81258 59884 67526 79912 74087 61130 41059 30020
16009 30020 15802 16721 9870 17629 22409 22467 9441 -8249 -469 -7176 -22160 -18446 -14108 -22474
15995 -22474 -13818 -3454 -2093 9871 9686 9249 13669 16683 10690 -9018 -23006 -44027 -39135 -24736
15981 -24736 -11916 305 2742 8691 27188 25994 8599 9379 10753 11602 11405 8501 8979 2083
15967 2083 22477 39779 25369 17153 -4986 2814 17374 24599 20987 11331 -14467 -10715 -24826
15954 -24826 -24629 -1029 -1585 -15636 -31374 -19131 -2515 21342 22451 11567 9356 -830 7885
15941 7885 -10123 -26127 -24863 -23338 -9226 -10015 -22348 -26165 -26929 -11767 16535 11080 -14211
15928 -14211 -17601 -7161 -878 -16888 -15424 -13507 -9734 10750 2807 64 -13920 -12277 -7842
15915 -7842 -20538 -6911 -3403 -8873 -25327 -24808 -10137 1535 -2310 317 1881 13830 21307
15902 21307 32925 17153 -3329 4587 2454 16289 32279 25090 27501 25682 16008 17187 16588
15889 16588 5585 11960 3104 -17387 -25201 -26760 -10867 13408 21449 5147 1756 -8194 -4614
15876 -4614 -1584 -12143 -25051 -27958 -13732 -16988 -18755 -20506 -17312 -7656 -1374 7617 4330 -9303
15862 -9303 -20664 -26760 -13850 -18702 -23663 -17066 -3255 -3920 -17663 -14314 -19021 -36483 -30985 -17131
15848 -17131 -8412 -8491 -9341 -5294 -3954 -14611 -13659 -5733 -1918 -4523 -4760 7841 11107 1454 -1952
15833 -1952 11847 5693 2400 5851 7549 10932 11014 9787 19614 3557 -7990 -12308 -9433 13000
15819 13000 28319 6474 -320 -126 143 -6348 1290 -12075 -23376 -17389 -17345 -22245 -10971 -9077
15805 -9077 2759 10078 8678 307 -10775 -3198 -6831 -16693 -25314 -25529 -11117 5225 -12061 -3103
15791 -3103 19250 6175 -7536 -20348 -14163 8042 18813 22096 18566 6169 -23278 -36986
15779 -36986 -51521 -45191 -29945 -21837 -16845 -14619 224 -4160 851 -3262 -11467 -21106 -5000
15766 -5000 21283 2522 -15270 -12342 3511 3494 4694 13517 23631 12149 11190 20789 13307 -2899
15752 -2899 17161 20025 3265 -3239 1924 -14762 -4919 3024 5523 3873 14575 5416 -4790
15739 -4790 -6674 -5558 -4356 -6699 -15705 -23647 -392 20089 14349 10492 15316 12864 -870 11679
15725 11679 17362 9169 -1350 8156 19797 46609 45127 14794 10360 21249 12932 -4512 -4075
15712 -4075 -14125 -24617 -32682 -24873 -30191 -21772 -11662 -3133 8851 15690 15334 9330 4166 6918
15698 6918 3890 15345 25432 11403 -1581 14916 33854 33755 6101 -6004 6573 19722 20435
15685 20435 32850 43638 22652 17416 11673 8165 20002 8828 -20135 -29827 -19618 -27900 -28259
15672 -28259 -27137 -21882 -4339 -6369 -1584 3253 8683 51 -285 -8187 -4645 -15086 -30936 -33443
15658 -33443 -18491 -14646 -4623 8901 -2862 5408 17289 37473 38084 27854 24207 22502 9317
15645 9317 -5068 1902 7775 -615 -5466 13121 20088 23719 378 -23692 -21157 -21624 -8900 6877
15631 6877 -4011 -21898 -30616 -28120 -23518 -10075 -19935 -7322 -641 -24499 -44258 -26455 -9996
15618 -9996 -7956 1207 -9124 -10756 -13668 -17145 -23140 -8830 -12929 -24415 -15470 -9498 6193 16962
15604 16962 14959 12214 6511 7264 14136 6757 6149 24503 45637 13623 -16523 -8206 -655 11417
15590 11417 -2709 -8103 23209 32932 36289 36851 29012 25725 12707 19450 38605 27302 31483
15577 31483 14138 -4218 -20315 -15890 -27483 -29441 -26404 -15209 3909 13252 14294 9729 -1538
15564 -1538 2134 15011 13593 10416 -1004 -7270 -4079 8690 8061 -5276 -1478 13483 15276 1475
15550 1475 -19575 -17233 -8354 -26262 -27491 -25447 -19297 -25617 -12296 -16708 -27754 -31530 -18452
15537 -18452 -1577 7739 14287 23925 17308 4304 -7994 -7664 -6087 -7511 -7154 -6722 -13974 -8744
15523 -8744 -4848 1821 -17735 -8616 -5354 -18702 -21391 -23640 -8068 9379 2329 -13860 -22986
15510 -22986 -25005 -37778 -32031 -19781 9606 8499 -4304 3379 4746 2463 7560 1186 13594
15497 13594 11010 18433 779 -5664 3544 15275 12758 72 1004 17005 15055 -2576 -5277
15484 -5277 10891 19534 9562 6414 14 4244 7677 19100 13030 -5829 -2832 -7522 -29237 -35676
15470 -35676 -33532 -21178 -1508 1908 6733 12761 6421 27012 23281 19757 24063 20206 22140 11426
15456 11426 -6071 -23124 -31094 -24419 -19145 -22609 -17635 -6168 -6023 -17546 -23691 -17101 -14724 -23077
15442 -23077 -27955 -8338 19002 21286 12366 13619 12951 32180 43295 31256 7683 -5732 -15468
15429 -15468 -7761 4946 9776 -2276 -11724 -25596 -26244 -23807 -21080 -26220 -23111 -21988 -29590 -21225
15415 -21225 8531 22902 7691 -7353 -1149 16895 5461 -14743 -12118 -5576 -4602 5023 -640
15402 -640 -22524 -16820 4625 -749 8766 24530 5150 -1674 -14768 -24155 -27412 -15875 520
15389 520 -2228 -5423 -7865 -15363 -18067 -17510 -16957 -10915 -7747 -21403 -39745 -21859 -14149 -39734
15375 -39734 -37270 -26023 -25271 -9190 -14874 -32972 -47897 -24945 -16269 -20846 -17520 -26249 -32232
15362 -32232 -26483 494 -1178 -25468 -21324 -3290 12233 2331 2923 15450 -15716 -24366 -3923
15349 -3923 -9156 -22494 -26977 -37166 -26310 -31470 -20419 -12368 -20329 -6492 -16641 -12633 -12080
15336 -12080 -22084 -18321 -19549 -11142 -3929 -21797 -38014 -45404 -39206 -24093 -7582 616 -18489
15323 -18489 -12270 588 -2106 14064 24369 35885 21389 1619 140 4520 7267 -6384 -20858
15310 -20858 -16818 -7057 6901 1245 -2661 8053 16892 11674 14477 14195 6102 25534 18129 -13961
15296 -13961 -19324 -3487 -9438 -8760 -25130 -18243 3924 -10435 -19500 -21067 -21500 -18498 -37704 -36633
15282 -36633 -8827 -4935 -11470 -6248 -18885 -20641 -12637 -24415 -26796 -6448 -4354 -810 2506
15269 2506 8933 1889 3107 -1670 5957 -7792 -13859 4927 3302 -4788 4523 3371 -11735 -18740
15255 -18740 -14951 -11086 -12322 -18930 -20054 -29686 -44771 -39000 -36424 -25214 -19073 -4928 14418
15242 14418 23477 13839 4584 -1353 -20352 -17652 8702 19634 -11623 -38376 -34160 -29864 -31428
15229 -31428 -22607 -17811 -11264 -954 5205 -15060 801 22089 19511 23934 18605 14268 7488
15216 7488 3080 10926 23393 34605 27237 19826 3057 7769 12884 18666 15714 10962 3600 -1382
15202 -1382 -13531 -5428 6843 16090 8220 12847 16618 4352 7098 -6160 -7758 601 21304
15189 21304 31070 -1581 -30491 -19518 520 2049 7995 530 -10863 -13845 -13176 -7978 -8215 -20742
15175 -20742 -17136 -354 -7784 -16949 -4347 7358 22431 21626 27743 23942 -1500 -33446 -55215
15162 -55215 -32900 -1049 3439 -8630 -8448 -9087 -8874 -4843 -1301 285 -3156 -7028 -3208 -20220
15148 -20220 -19266 -13089 5470 8205 -5942 -5915 -3785 -11268 -6582 -1205 2722 -24481 -24215 -19117 -9130
15133 -9130 -8814 -16108 -39017 -44075 -33306 -25859 -14455 -16900 -805 5112 -20488 -33947 -13529
15120 -13529 6077 8063 10822 5955 -13776 4652 29239 26701 3005 -4466 3830 14754 20319
15107 20319 22077 12643 -4875 -2718 5550 12781 13216 4787 13893 15240 -13645 1918 5893 -358
15093 -358 -376 -24429 -11835 -4353 -13651 -10391 -8049 4595 14637 -1832 -21057 -14295 -13991 -19187
15079 -19187 -5700 -1737 -28235 -26973 -27792 -21464 -6390 11187 25232 39761 40806 27125 -4301
15066 -4301 1678 11768 14118 10050 1512 8425 14806 15914 9226 15438 15607 -14135 -12704 277
15052 277 -4816 -19561 -35159 -42276 -41185 -28117 -2843 14049 10136 50 -8201 510 5027
15039 5027 4094 -3808 -19364 -15988 -20681 -4436 2709 -2797 -25072 -25052 -11664 -6039 -3656 -13509
15025 -13509 -15808 -7801 8034 -7507 -18701 -15870 -22547 -42081 -53876 -37620 -20226 -3887
15013 -3887 -7162 -20045 -22938 -27178 -23460 -27906 -17176 -4505 -10398 -14622 -31229 -45895 -34393
15000 -34393 -18967 -10776 -14509 -23425 -29135 -16506 -9081 -8761 -11780 -27108 -24766 -6368 -7845 -14164
14986 -14164 -20198 -23956 -15967 -22146 -23980 -14596 1614 8218 15701 41116 44040 26154 -543
14973 -543 -7390 -22354 -14790 -6783 -1271 2996 9870 -5405 -21635 -15840 -3365 -13489 -18131 -41592
14959 -41592 -32069 16496 34922 34322 23358 9605 1645 2421 5946 -9096 -14050 -12682 -8144 -6598
14945 -6598 -6865 -4618 11786 10680 4196 13973 9710 -2785 -2071 969 -3011 -19466 -23667 -34327
14931 -34327 -19224 -7639 -11087 -5937 -17318 -27182 -29550 -6453 -6835 -18890 -11043 -1545 -12399
14918 -12399 -18102 -5623 -3162 -9496 -2046 -5162 -11808 -969 3097 7217 20971 20615 7926 -4671
14904 -4671 -9836 -8145 -1116 -1528 4113 16026 6984 2083 -17147 -23543 -3445 3064 3739 -896
14890 -896 10377 1338 147 -14446 -13436 -7848 2482 -4240 -8588 -12046 -20628 -13139 4198 4559
14876 4559 -3409 5244 6936 -176 6660 11191 18085 29937 34806 16386 10629 2900 -14291 -10424
14862 -10424 5663 17031 3677 -7632 -5010 746 12537 12380 9047 11848 12667 1662 -6083
14849 -6083 -4306 -11546 -19628 -9111 -10163 -9687 -7584 -1042 -6504 -12530 -25123 -31272 -30721 -41558
14835 -41558 -37078 -16889 -5890 -6381 -12182 -29383 -13999 -9488 -16178 -16882 -16489 14663 27668 10464
14821 10464 10050 581 -6518 -19509 -4937 15922 10123 2414 -5028 -21032 -14238 3516 15827
14808 15827 11749 12250 14708 5924 213 -7704 -22059 -20357 1210 11472 15857 -2487 -22261
14795 -22261 -22184 -20978 -5882 3044 -1972 12184 30618 24709 16457 -1485 -22531 -22510 3427 16072
14781 16072 16897 14268 14510 20916 7661 -15506 -5040 18831 13652 1529 -6259 -4843 11600
14768 11600 9871 12491 8385 15338 8934 -6920 -3485 9118 1743 -2381 -9597 -12190 -6331 -9164
14754 -9164 2284 17432 8347 -962 -4667 -17748 -26120 -17883 10828 29310 32487 11223 6051
14741 6051 -11987 -18779 -21837 -28624 -28695 -11998 -5142 -3521 -9021 -6159 -12516 -15739 -15315 -1860 -29023
14726 -29023 -40309 -27879 -26951 -36995 -38298 -46569 -32765 -4502 16970 4080 -3279 5040 -6573
14713 -6573 -12844 8833 7839 1681 -8225 4633 13772 21636 16582 33801 33277 39783 57133 31264
14699 31264 4349 -958 3613 -11016 -11648 -30685 -43937 -25735 -14147 -9940 6369 8063 -832
14686 -832 14529 26686 20905 -851 -14826 -31844 -36103 -32065 -31317 -8778 2061 -352 -18057
14673 -18057 -8398 -4749 -23274 -16488 -992 3603 4850 -2141 -6630 13118 783 4696 -8861
14660 -8861 -16346 -15722 -2926 -1000 856 12473 23484 24279 27713 19339 2354 -15774 -21199 -5436
14646 -5436 9673 -2587 -10246 -3833 8769 4450 6760 803 -6025 -12280 -17420 -15406 -10794 -7991
14632 -7991 -16979 -783 20150 27993 16547 16044 8275 10896 12918 -5591 -11365 1581 22294
14619 22294 23325 15519 17176 -4126 -22120 -24281 -15294 -9317 -16326 -18100 -11777 -12142 -5605 1941
14605 1941 -18308 -15746 -9150 -2472 -5716 -8526 7952 8019 14591 -3048 -12132 -36764 -32469 -26471
14591 -26471 -10435 11121 22794 24871 9170 -12389 -10540 -21132 -33342 -21008 -1221 10196
14579 10196 -7568 -12856 -37567 -40539 -19222 -2466 -7846 -12650 -20063 -19676 -17647 -21276 -16914 -24177
14565 -24177 -25265 -30461 -44392 -26420 -24094 -34763 -26802 4587 23455 14383 -462 -7342 -3260
14552 -3260 -5032 -1779 1810 2447 -15315 -22036 -26837 -29961 -18600 -3020 14324 21525 22157 2100
14538 2100 -16188 2252 7998 2108 239 -3611 -1327 1245 -3426 -2191 3584 -9596 -20721 -29193
14524 -29193 -40395 -25847 -14354 -17699 -20220 -20187 -25132 -8570 -10362 -28481 -45320 -49005 -28113
14511 -28113 -24542 -26515 -40782 -43585 -28797 -10028 714 2970 -11055 -14855 -15403 -7502 -5240
14498 -5240 1159 -2554 -6094 -7046 1867 -2421 -1799 7926 1560 7136 -702 -4608 -21591 -27438 -13844
14483 -13844 -23118 -30465 -20618 -7658 -11019 -13400 -12773 733 8438 5486 -3398 -3764 -10273 12192
14469 12192 13321 11279 11334 6366 -4641 -28885 -18151 -10045 -19357 -22418 -21416 -21693 -23142 -16677
14455 -16677 7213 2229 -6077 -2755 -1113 314 22098 25124 16774 6561 4046 -8125 -10212
14442 -10212 3398 693 -6819 -19233 -25975 -24999 -546 9949 -1483 -3743 12110 26401 24989
14429 24989 19178 16633 17862 7696 -4336 -8396 -2743 8690 18066 17805 -669 2355 -3412 4871
14415 4871 5454 -13687 -26564 -37689 -30268 -13838 -24664 -30776 -29554 -38486 -34383 -25066 -35298
14402 -35298 -13351 -1716 -19806 -21076 -9107 7224 19824 2994 -18581 -22210 -21056 -21828 -26319
14389 -26319 -35825 -25722 -15358 -15790 -8696 31 11974 9089 -4558 -13084 -10948 -10073 5245 25768
14375 25768 7631 -11243 -9154 -9049 -25327 -23457 -3735 15300 22387 9143 -3740 -10540 -13789
14362 -13789 -3673 -13988 -22144 -38248 -41305 -12882 19961 34217 43230 29820 22952 50604
14350 50604 36999 17790 8060 -13357 -31217 -17965 -26387 -11730 -16929 -26517 -4364 -5110 -5491
14337 -5491 -6691 -21820 -18389 -4875 5808 -6794 -21128 -12595 -4438 7814 16126 29068 1465
14324 1465 -3659 -7298 -14026 4434 10872 -10429 -17026 -27059 -23413 -2377 2821 -12523 14734
14311 14734 21204 9142 4472 21114 26874 33527 33953 35618 23172 1808 4088 18686 17865 -1331
14297 -1331 -10354 445 10138 4199 -838 -7048 -10002 2002 15915 852 -22115 -27193 -10837
14284 -10837 -22159 -31108 -29783 -18415 -10673 -1864 9758 14310 3941 -17473 -22024 -12683 -3459
14271 -3459 9022 4251 -5941 -17969 -12863 -6277 -20035 -19277 -32075 -25823 -10382 2032 -1908
14258 -1908 -7154 -5937 4750 -24686 -36608 -24425 -24948 -21246 -23702 -7754 12330 28882 40118
14245 40118 46295 33238 23770 16934 18924 14157 5362 -4831 6992 9287 6618 8370 1345 -8056
14231 -8056 6062 11256 5516 -9373 -22429 -2501 213 -7608 -14193 -12173 -6648 -16645 -20512 -11324
14217 -11324 -4767 -3717 -18493 -41568 -32521 -11601 -20052 -10444 -1446 3766 -4032 -12259 -12653 -4158
14203 -4158 -1016 -7032 -6122 -16199 -19415 -22140 -39547 -36116 -19943 -5769 7823 20644 17182
14190 17182 -10190 -30412 -35420 -29053 -28581 -35035 -31783 -25873 -16618 -11907 -12866 -31341 -18726 -3280
14176 -3280 27117 26282 8288 -15202 -28916 -38125 -36868 -31317 -17846 -15100 -30241 -29581 -26892 -7162
14162 -7162 -6428 -19497 -20715 -18477 -20976 -11172 7133 22215 4475 -19199 -28077 -24837 -14114
14149 -14114 -8763 -20801 -31715 -22950 -24463 -45228 -35782 -27112 -17049 -12298 -3280 10846 20142
14136 20142 28667 23755 13877 16490 21705 20775 24925 9593 -6941 7522 3246 -10718 -13274 -22886
14122 -22886 -34990 -40192 -29958 -36589 -37788 -24177 -12977 -10822 -22208 -15514 -1615 -14300 -19772
14109 -19772 -7708 11889 26422 12797 -10239 -2728 -12739 -6947 11109 20718 19312 3314
14097 3314 -11136 -5173 -20518 -24053 -3414 16282 19273 15766 7493 -9121 -21863 -22435 -20906
14084 -20906 -17884 -9229 -19034 -23064 -28356 -20459 5991 5582 -1722 -16390 -11727 -1738 4517 -8210
14070 -8210 -1544 -6221 -3467 -11710 -15543 8072 17824 15785 18470 15435 16445 16811 7466 -17687
14056 -17687 -15632 -20143 -1751 16593 13685 11124 10081 16917 4984 10774 11533 -44 3059 1722
14042 1722 -13643 -25698 -34844 -26503 -29153 -28898 -44156 -63624 -39547 -29493 -28986 -8459 1194
14029 1194 2433 7881 5935 11318 8334 -12447 -19621 -33629 -34865 -21051 -16383 -6940 -10482 -6416
14015 -6416 6586 6013 4364 -714 -17231 -15754 -4954 1720 6509 18887 19897 18206 7383 7397
14001 7397 8618 19498 15322 15932 12160 14781 2868 16397 13546 -4618 -185 -8477 -12458 -11068
13987 -11068 5286 7896 -6525 2230 -3410 -11404 -18070 -20808 -3010 12684 16552 23875 27034
13974 27034 10069 -110 -1534 10479 11214 24593 18883 11773 1699 8260 30522 22572 34449
13961 34449 37882 19840 11570 5321 -5848 -16089 -31110 -38186 -8375 4253 18184 8358 7814
13948 7814 -1891 -12504 -8181 2366 14554 21667 20471 1146 651 12790 22938 31981 21042
13935 21042 17032 3126 -4000 -12550 -18652 -6215 11917 23431 12147 -8327 -7381 -20097 -26362
13922 -26362 -10902 -5171 -3813 -16464 -13437 4781 16469 -4099 -11468 -9134 1349 -13107 -26196
13909 -26196 -21297 -4379 -2240 -2524 -12207 -6082 -6463 361 8916 7868 7848 22701 29955 18220 1952
13894 1952 4519 4931 5639 16753 17480 14944 18628 38035 32703 17291 16794 28166 31042 25939 21532
13879 21532 26779 26863 38664 35481 22625 26163 33076 9424 -494 6305 -4402 -27820 -10147
13866 -10147 -11205 -17674 -34444 -44671 -44059 -38004 -13194 -1268 17455 20859 3627 -1598 -9470
13853 -9470 -18869 -15719 -5907 -9997 -29230 -12063 13084 8576 -3666 6726 -206 -18911 -9751
13840 -9751 6371 14255 4407 -7617 -13127 -11249 -3351 -13901 -17547 -11415 -5628 -4677 -10264 -11869
13826 -11869 -1062 -1607 12293 25678 12497 7860 -8382 -22782 -25505 -9295 6466 -4499
13814 -4499 -1820 -7518 -36621 -37211 -29344 -24181 -43307 -63184 -50637 -19032 -1269 3601 -10439
13801 -10439 -8849 2429 19400 23231 16945 8484 -10057 -5274 -2370 669 6923 3658 12008 14047
13787 14047 2333 13095 16093 14989 -819 -1039 9142 5710 8235 -925 -12307 -12938 -22740 -7046
13773 -7046 -2386 -8341 -11374 -6594 -6109 -15101 -2645 17919 14896 -5169 -17008 -16573 -3337 -3134
13759 -3134 1560 -5433 -5518 -5742 2395 13982 4331 2763 11840 6357 7313 14484 3574 -18320 -36108
13744 -36108 -20487 -11137 -5867 9023 36666 53521 46070 33767 18561 9536 -8407 -9880 -512
13731 -512 -8729 -18333 -7731 -533 13697 -4679 -9217 9000 18003 12603 8569 -4904 -16560
13718 -16560 -25321 -6484 -1869 -5169 -7752 402 -1246 5791 14310 17243 6058 794 22663 33543
13704 33543 25323 21437 12221 13013 11758 17125 19128 13184 31927 35886 29432 16034 1587 -8102
13690 -8102 11620 8031 4181 5138 -12279 -13722 -14441 -13605 -22906 -7529 -18587 -11726 -20320 -31197
13676 -31197 -26245 -13815 -5357 -11280 -13201 -8070 -4971 1049 4313 8327 -6967 -16105 -15853 1131
13662 1131 -4979 -17930 -21636 -21907 -13854 -13205 -13860 -257 2075 1362 -1089 2247 2652 2273 -1178 -3842
13646 -3842 2122 6491 27972 31831 23223 -2225 -21298 -25508 -29731 -16789 -18019 -11395 5123
13633 5123 24772 17416 544 3702 -522 1825 14631 19983 12196 12887 12369 6984 -4810 -12471
13619 -12471 -5968 -20183 -35099 -29285 -14614 149 -7237 -12749 -10658 -8055 -23634 -17808 -26590
13606 -26590 -26377 -14912 -18793 -12918 -8613 6939 15147 5551 9075 6300 11715 24137 37308 54147
13592 54147 39882 12400 -19047 -11601 1701 8635 21158 6087 -6578 6647 20542 9846
13580 9846 14373 20871 20394 22942 20443 28470 19796 2913 -6535 -1727 3920 -2495 -452 -1291 13477
13565 13477 28590 29230 13661 -3570 -2732 6798 12759 7141 8947 13128 314 4257 8439 -4597
13551 -4597 -15071 -21975 -22161 -20406 2123 3746 -8749 -20402 -28367 -20073 -7746 -5937 -10542 -10056
13537 -10056 -22071 -26157 -13539 -16666 -12335 -26942 -35514 -21803 -25273 -8407 -11523 -22530 -37054
13524 -37054 -27882 -26270 -11933 -1992 -432 9380 -5001 -16828 -24631 -39611 -14379 1685 -9766
13511 -9766 10538 19312 16256 4627 -21660 -30457 -28922 -14196 1285 4516 -5963 1270 3439
13498 3439 -15825 -18989 -18925 -8062 -119 2624 517 -6336 -9966 -9899 -26477 -27012 -16096 11875 11240
13483 11240 8673 -4725 -14520 -19377 -24546 1502 16342 11537 2271 -6087 -4587 -580 -8607 5419
13469 5419 16342 6718 -1239 3380 14565 9870 -4909 -6214 6032 7987 -6698 -19087 -12085
13456 -12085 4399 -356 -13434 -19993 -12660 -15377 -3070 1617 4885 13194 39195 35110 17037
13443 17037 7298 14212 30950 28229 17036 22028 7113 3955 7910 4211 -12669 -1310 24376
13430 24376 29776 23634 2950 -3844 -7978 -350 -3155 -15453 -23420 -22834 -17293 -1134 9540 6396
13416 6396 -16348 -24380 -7037 2825 -6719 14462 8930 7881 11453 -9192 -22894 -22557 -3917
13403 -3917 4001 1185 6152 1521 -10307 -5828 784 -9532 -13847 1339 -8159 2552 27894
13390 27894 13039 4334 -12435 -16796 -14326 -19712 -11275 -3944 -1220 7964 12299 25381 25747 20410
13376 20410 16084 9621 21763 14775 -12540 -13490 -6864 -5969 814 8868 11027 19645 18929 -5606
13362 -5606 -14383 14932 22455 8733 -7360 -15620 -9667 7269 2849 6186 17248 10690 -10136
13349 -10136 -3195 14564 17326 15088 1885 5513 9878 -886 -2892 10884 6979 7583 2581 -11924
13335 -11924 1137 15719 22114 20988 35861 25866 8202 -1782 -8436 5051 9512 -5310 -14237
13322 -14237 -12799 -2890 9381 14848 18549 24401 3269 2589 22600 38940 33219 21858 14600
13309 14600 9382 16838 12998 -7430 -5303 2263 22435 11283 -6733 -2826 -2695 14263 19762
13296 19762 6775 5410 -3074 -15970 -18209 -2107 22465 25478 15928 -2661 15766 57393 65740
13283 65740 53970 53056 77674 91886 101833 120485 132832 138262 144116 178270 225297 289813 381997
13270 381997 491213 624674 783552 904215 953201 963479 957962 937495 868919 775809 708251
13259 708251 635495 522757 413856 316581 251367 206803 179579 131798 91589 85670 73186
13248 73186 50268 49186 65167 71526 72129 70736 66393 53494 51906 56960 60920 55239 70943 75265
13234 75265 67424 54151 44926 49373 51918 34020 29064 24599 14053 19959 25309 30601 36730 50354
13220 50354 65432 79020 104056 118042 170559 231237 314795 513763 836174 1352457 2001129
13209 2001129 2441437 2340139 2056910 1817191 1367864 931754 638160 464956 346224
13200 346224 276278 244143 188987 141511 108940 93937 71297 74000 74565 67254 63437 55469 39682
13187 39682 16359 2251 17343 10823 11021 20060 24508 35968 31829 21205 26594 11941 13505
13174 13505 20098 25559 20696 29162 21617 1827 5280 2332 -31187 -32652 -23072 -37612 -36713 -21822
13160 -21822 -6692 -39863 -65795 -98853 -122161 -141263 -151541 -151905 -158452 -165162 -200952 -229793
13148 -229793 -251503 -244748 -217213 -180462 -151168 -112767 -94707 -81304 -71715 -58157 -31368 2497
13136 2497 38033 32542 40462 63980 74092 58891 66566 74823 72693 58049 42953 39258 48308
13123 48308 48577 53249 33615 29725 40288 54971 56464 39857 34928 45613 23951 13561 21117
13110 21117 43489 55518 51473 71176 102803 116313 119467 113283 111985 117203 116839 111578 123320
13097 123320 126857 127558 150262 176034 163009 151280 143543 148277 125247 71499 15113 -9545
13085 -9545 -37338 -92486 -130878 -159017 -189747 -254223 -342916 -478506 -570077 -572640 -528325 -479009
13073 -479009 -360009 -219183 -123113 -63761 -20342 3694 4287 -10015 -7393 2586 26796 31016
13061 31016 21235 40357 59012 63349 82143 87480 84826 95476 117751 125113 125121 114846 107335 107394
13047 107394 116853 121338 96700 77422 75030 87241 111525 108260 92547 75226 76935 91762
13035 91762 126077 185764 217874 215940 183814 162438 178344 187022 207120 210731 206677 193568
13023 193568 193946 184479 174396 173336 166202 195033 214886 200820 169131 136256 113169 109280 95981
13010 95981 73528 77814 73432 75432 70264 65342 53746 70420 61558 33914 17498 22731 26072
12997 26072 28030 52231 59585 63626 69668 89823 93562 97762 110787 110094 86319 82172 91338 73527
12983 73527 92586 94386 100562 121473 150522 181372 211592 244426 280431 309330 316516 300607
12971 300607 282366 281047 275244 257011 257375 239101 199411 179685 169710 163635 163894 166976 158427
12958 158427 166765 144242 125867 130252 132649 125884 125987 161761 181743 173739 157333 185586 175711
12945 175711 150149 157823 180816 190170 198641 184735 186103 204024 196619 179984 210117 220049 230660
12932 230660 235930 223036 206219 199240 205707 213733 195250 182278 184319 212043 255636 294207
12920 294207 312765 323307 325175 345869 362249 374844 371675 389383 394935 406846 424815 425213
12908 425213 446826 488807 585139 719828 894365 1050308 1104348 1101005 1068160 995666 889267
12897 889267 740312 685933 770782 826095 798851 759015 742949 756407 807764 861226 904961
12886 904961 927765 953903 1018986 1087142 1138690 1208343 1276790 1348955 1420317 1513191 1612622
12875 1612622 1716622 1832569 1943225 2078094 2243248 2438049 2654640 2905428 3241572
12866 3241572 3647987 4063471 4467956 4939084 5477950 6067724 6769167 7583776 8571174
12857 8571174 9726584 11008645 12508052 14349406 16684656 19805497 24306549 31102598
12849 31102598 41221098 55220106 72465475 91755002 112883015 135008231 154479801
12842 154479801 168005332 176396690 179917560 175594536 163184400 146583164 128642546
12835 128642546 108978218 88875805 70990244 56479628 44707673 35432878 28731992
12828 28731992 23965016 20429361 17714179 15532167 13706579 12116487 10728598 9525656
12820 9525656 8443932 7497785 6708808 6053842 5547641 5156925 4831817 4553409 4318400
12811 4318400 4122449 3941146 3786307 3672407 3587645 3543142 3533690 3534671 3546946 3563519 3609611
12800 3609611 3752164 3914499 4061732 4231570 4371646 4522405 4733845 4969363 5272333
12791 5272333 5643392 6097787 6650993 7258257 7925180 8666957 9558429 10591315 11860643
12782 11860643 13623581 15990997 19084039 23353197 29408832 37916587 49645893 66941235
12774 66941235 96245756 148987609 240792272 365352281 459743186 450457298 396458296
12767 396458296 355518559 272013340 180839635 123241167 89533972 68029773 53538438
12760 53538438 43498537 35723371 29534666 24736593 20957104 17979142 15529509 13421923
12752 13421923 11724249 10437781 9390342 8494545 7767279 7166564 6611213 6073294 5547938
12743 5547938 5054103 4608610 4221045 3934045 3736701 3567172 3434708 3330489 3242148 3181882
12733 3181882 3164513 3114047 2975466 2800724 2610327 2364614 2157062 2007440 1928534 1900766
12723 1900766 1862097 1827434 1778813 1713046 1636108 1572701 1491481 1400223 1335661 1291160 1225938
12712 1225938 1148225 1071455 996705 939778 910679 897566 871480 859143 853268 864916 876611
12701 876611 900733 920791 923635 939438 952110 905427 849215 806396 755205 730146 714165 700670
12689 700670 677129 670746 665813 658761 665394 653993 652804 665890 665611 665318 650656 651221 648630 624968
12675 624968 587749 565994 537390 513759 503201 496975 503148 491841 457154 434527 434670 450881
12663 450881 437452 433660 440686 453871 470173 479034 462097 443507 415477 416132 429885 452459
12651 452459 472457 483087 500246 517604 543727 543180 514936 471330 454094 490599 557255 582026
12639 582026 506183 328080 159126 82279 78860 140008 231575 313094 353572 370342 367958
12628 367958 346722 332869 333283 346996 337294 336818 337357 336189 339163 339696 345836 355398 358296 363475
12614 363475 382306 388653 374352 364847 345910 314643 304382 318681 314894 284758 277018 273714
12602 273714 256087 248194 256815 250070 254089 254586 266445 271009 271851 266415 255350 265314 283335 307622
12588 307622 317325 308774 304187 294589 315607 316537 328315 331099 320110 286396 260895 249880 237874
12575 237874 220181 196846 177368 170180 148973 124822 116307 132190 148509 160908 161301 144836
12563 144836 146549 147241 158273 162314 165774 175994 161600 135132 151079 148862 144468 137996 146476
12550 146476 136280 142007 152576 144277 124750 138953 163817 155897 168199 199144 231455 252631
12538 252631 284600 326486 344044 349162 377478 391376 388434 363458 350242 327470 293185 243953
12526 243953 231094 238548 241388 225100 209063 214766 201500 178092 146774 142749 135880 116836
12514 116836 119586 128944 122886 119986 125175 108111 108688 109458 99574 101532 119634 126899 126886 124792 103926
12499 103926 98566 87339 84046 99471 111117 118948 121381 121202 130158 127642 121382 116953 109984 101582
12485 101582 103958 114573 114120 89249 79510 82271 87399 96191 92211 98132 100367 119210 137058
12472 137058 154122 141978 143669 192765 223887 241213 314572 468016 679280 866937 900068
12461 900068 864814 824083 738700 623712 531448 488659 433504 388495 362362 339735 311483
12450 311483 301353 289938 284347 276125 261628 242426 233258 245209 258305 262165 242553 246801
12438 246801 270768 273204 278325 253236 226945 244373 272328 269588 300366 367457 432813 508845
12426 508845 580379 638773 692711 723170 695753 643634 603692 572965 595226 661648 745439
12415 745439 869286 1008639 1138785 1221328 1279163 1302857 1253168 1180072 1082237 967917 846174
12404 846174 738860 646555 564396 497877 430933 391677 349041 322892 319367 306914 295257
12393 295257 288133 298914 307920 313209 340885 372787 375004 353832 322461 270337 235675 198023
12381 198023 177859 158202 142517 124934 118313 119636 108570 97367 83821 79340 84991 93647
12369 93647 79179 59022 71204 85127 98014 89614 84766 88578 101282 102787 92753 98725 116926
12356 116926 120364 134316 149104 142289 137558 115667 90097 81440 76925 71489 61201 70763 79854
12343 79854 66730 67454 71502 98945 132128 126436 127199 141958 152562 176811 214372 245807 289373
12330 289373 361131 473781 630527 927167 1443598 2105147 2547170 2425532 2159214 1896765
12320 1896765 1409809 947112 667143 506418 416688 364981 319628 271680 233661 209564
12310 209564 195261 172069 150492 125503 107417 125950 119472 94734 77923 78496 85791 80282
12298 80282 56537 48006 43268 41230 54980 57988 65158 63536 59288 45123 51184 55226 59424 69041
12284 69041 82365 78641 75068 55902 60477 54760 56033 66947 58893 61549 49343 45875 42492
12271 42492 30966 12949 8270 24860 39441 50344 48583 30194 31387 28744 42608 55729
12259 55729 56729 38775 32306 22000 13611 16824 21385 37528 40802 44515 43186 32784 36493
12246 36493 45276 59418 63516 42232 62147 63055 49444 35030 28682 33585 48289 43392 40412
12233 40412 32320 47847 68516 66471 51046 48043 33114 30430 20797 15299 39434 53403 49890
12220 49890 54245 70037 81108 66115 68643 64458 50780 45867 28301 12223 8215 19451 17773
12207 17773 56655 71395 63456 50229 46097 19667 15332 29029 31297 29539 19901 31287 23230
12194 23230 19234 1948 -10332 21156 41009 40362 33968 17863 19793 48466 58384 44275 37148
12181 37148 27544 25611 34035 36611 19346 8873 7313 9670 30651 43591 41645 42453 26691
12168 26691 22922 40623 42846 39968 27598 21189 26721 19194 6255 9193 6976 2416 2358 9248
12154 9248 20281 28805 20692 12829 12143 23076 34370 42680 58554 64819 64470 64777 72389 46734
12140 46734 12860 21098 28006 35996 47021 47369 44259 31899 33341 40867 43398 42628 46136 39669
12126 39669 56763 69845 58536 35623 17719 30894 52995 32767 16992 38915 47392 42605
12114 42605 41361 23755 2950 4904 -8631 -8005 -4856 -6321 1464 18994 34860 347 -11684
12101 -11684 5850 12197 15058 30949 18440 16440 32613 45962 66075 77425 78491 79102 81546
12088 81546 74976 77095 57870 45662 43278 30787 11113 16391 14404 434 14741 20128 23845
12075 23845 18614 18802 29394 14840 29762 22976 29319 38417 40457 30895 22533 13444 20617 35474
12061 35474 40667 36146 25651 24410 38531 33334 26093 13623 3738 6282 20078 11335 8419
12048 8419 -2693 -1780 -17673 -4941 18851 25133 26356 25444 35518 25168 24056 24857 43451 39849
12034 39849 29479 18271 24976 25303 33256 31998 22250 19647 10841 6612 6201 2538 5490 -7408
12020 -7408 -156 -4744 1640 18763 23217 39904 27576 22901 25357 13422 -8291 -13582 -25686
12007 -25686 -17132 6382 15424 8651 -12277 -22619 -23817 -15752 13404 24479 37932 41428 23409
11994 23409 -4938 -5278 16164 41777 41643 26868 19239 7812 3546 19682 9054 2398 1762
11981 1762 -3078 6244 23716 29668 28267 28895 7482 8189 14935 5013 -5096 17987 15631 5106
11967 5106 -3142 -5912 -14762 -8724 -5435 13874 21620 2880 -19000 -12336 4060 3672 -3335 556
11953 556 6553 2778 12491 17096 7963 -8793 -11652 3366 24542 30596 24814 31925 31825 31464 35232
11938 35232 27231 13277 14084 24452 36022 35792 27155 27496 16992 28643 37753 29385 17750 36992
11924 36992 44900 32370 12634 6384 4706 2121 8109 9968 5207 30925 25585 11839 9279
11911 9279 24499 19138 8907 3423 -235 -27152 -44699 -34651 2092 15946 -16413 -14203 8474
11898 8474 30432 51038 39251 8201 17043 6263 -9008 -6723 -17667 -26834 -21804 -12294 3283
11885 3283 2557 12951 38857 15689 9021 6638 -5886 -1034 8544 6785 -2963 -1230 4573 -16184
11871 -16184 -16508 -13750 -13480 372 11166 239 -2124 -1266 -3088 -5815 -2043 -2589 6708 4008 16297
11856 16297 16022 13563 15205 2016 1329 6552 3316 8823 11344 13749 3367 -8325 10401 -245
11842 -245 -16452 10525 12769 12985 20562 35205 23607 16315 36343 47828 53548 39319 37753
11829 37753 43207 43591 32316 29813 22821 10121 28913 27742 11002 -3185 -1596 -20373 -36693
11816 -36693 -15152 13787 -996 -18787 -20319 -2491 18098 37241 34931 13865 -1033 11632
11804 11632 7913 -4095 465 17790 36524 48440 46831 43795 31759 780 5704 24726 33850
11791 33850 4894 -9273 -10526 625 4795 21535 22057 5031 8005 15514 3560 -23100 -30145
11778 -30145 -17199 6835 -6716 -9948 2845 9488 18390 -1132 -12019 3457 3387 -3627 142
11765 142 12396 623 3765 5013 10269 3844 -14387 -18920 -21333 3098 -2080 962 5152 4385
11751 4385 11485 8911 13327 11408 15162 -12251 5070 13474 8212 -1845 -13885 2624 16389
11738 16389 13590 25084 24163 7730 -2293 -4382 -13267 -24502 -27072 -21576 -6905 5893 11123
11725 11123 10320 -3144 3427 21915 29943 38386 41755 29608 17826 21880 23398 21534 31457 29006
11711 29006 28828 30843 34804 37424 34605 38986 37767 37059 24287 10373 15582 16080 -5050 19292
11697 19292 15265 -3015 -3728 -11560 -752 -634 -8437 12211 11498 4358 -9122 -5097 -4507 -13818
11683 -13818 3830 4594 5058 48 -16185 -8580 -3813 -4940 110 -3562 -4146 -4122 -9528 -4859 -115
11668 -115 8566 21781 30006 28455 14390 12141 26988 38943 29716 29758 30218 41955 25961 4855
11654 4855 -11795 -2684 -10669 -26261 -10436 -7164 -10624 -3750 323 -6079 1186 15717 18643 16881
11640 16881 -1194 -11308 -5386 18852 10375 6415 28302 51036 51341 32135 18438 2174 2232
11627 2232 -3913 1593 -9892 -22562 -28670 -20625 -8404 13309 40538 26298 4902 -9996 -33479
11614 -33479 -38030 -39560 -20316 -11207 4235 1505 6550 3459 3545 -1352 13143 24767 17804 15999
11600 15999 8140 7949 -13531 -18854 -21364 -25912 -9819 20046 16860 5773 8891 9837 9122 8842
11586 8842 31655 38785 35898 24636 -12882 -24877 -5439 -9834 -23096 -6515 13830 23126 17645
11573 17645 19625 13399 3543 19181 27928 23475 -5947 -4257 11364 11084 -3411 -11589 1506
11560 1506 -192 -10683 -4108 1324 2360 3351 5695 17900 17800 3312 24229 21737 1849 -15456
11546 -15456 -28021 -26717 -17421 -17635 -28664 -21069 -4818 4004 -5733 -12553 -12460 6125 -1340 -5949
11532 -5949 -8091 -2399 3584 8787 -7647 -12189 -709 22313 22818 19023 5846 5810 6790 22202
11518 22202 29611 16051 11053 7931 -2334 -2495 966 -13286 -5028 11982 -1434 -4181 -8712
11505 -8712 -9802 10527 22126 18636 -4705 1180 15380 14075 22102 23397 -8298 -5849 19169
11492 19169 16045 -5232 -29895 -37552 -26807 -10751 9791 10076 2867 -3965 -11801 -20414 -12004
11479 -12004 16434 21447 2608 6504 2701 6642 9753 25598 20436 16475 -3305 -10828 3896
11466 3896 -14335 -34917 -26413 -15277 -10411 1921 22613 21927 1541 -3415 7833 234 3455
11453 3455 29124 32806 22957 28914 22246 13453 8475 -5304 -990 10619 21229 20207 25704 14200
11439 14200 3688 -16292 -3665 -9694 -28448 -24661 -1539 9930 9695 11818 13333 4682 -3382
11426 -3382 -12912 -11905 -13881 -6015 14637 21261 7578 9468 11990 13612 -875 8333 8950 18988
11412 18988 17010 28955 40599 21117 18513 35278 33017 22613 1254 -3641 12353 26730
11400 26730 7838 -2836 -21516 -27162 -10895 3551 20008 30867 41009 41661 42181 19846 -5720
11387 -5720 -8746 -7360 1119 19192 16787 19931 33907 8259 -4189 -2683 -9399 -216 -14020
11374 -14020 -14588 -6133 -1199 28845 43559 17439 890 5920 7492 8125 -6749 -25374 -5387
11361 -5387 4138 9143 8311 12315 1537 5889 -5269 -12520 -33066 -33149 -27826 -12589 6699 21300
11347 21300 34673 27698 -1640 -15635 -1454 5109 13305 12344 4181 5365 -3561 -482 -1198 -4971
11333 -4971 -9576 11282 8558 4426 3184 -6780 -5185 -12346 -84 17556 4576 -33022 -44759
11320 -44759 -41946 -32365 -29684 -16661 5999 13514 11222 27689 33876 15999 3361 1418 4431
11307 4431 9184 18775 5897 1765 20402 20481 14481 19306 37202 40735 22980 14916 5974 -10012
11293 -10012 -3771 -9293 -14783 -5370 -3497 -3419 24300 54524 59227 37352 18764 13581 11389 1907
11279 1907 -7300 4143 17251 25719 17140 -1097 11220 852 -8539 -8178 -2715 -26588 -17123
11266 -17123 9129 27290 29395 17771 324 13100 37246 26152 22484 13702 8940 8310 8941
11253 8941 13241 24709 4135 -5111 4565 22178 23588 6813 216 7604 1586 2268 -1506 -10329
11239 -10329 -23891 -17550 -5500 -4892 -1239 -15838 -3076 12420 8979 -6068 -19043 -26351 -12529
11226 -12529 -14390 -8072 -2058 -10340 -15095 -2439 1461 22117 27721 12855 11897 11010 -16101 -31344
11212 -31344 -16633 -8923 -7966 -11106 944 8758 4240 2920 7800 5215 -4397 -10763 -9457 -19151
11198 -19151 -35306 -35215 -17495 -3522 8084 30905 37911 34774 7101 1400 6965 -22737 -21460
11185 -21460 -22889 -24199 -27945 -32751 -23866 -13856 13884 40100 20451 7422 51 6991 10839
11172 10839 -15545 -32420 -27466 -4733 421 -16139 -11784 -7279 -4353 -9516 1997 6620 12036
11159 12036 6379 11387 7428 -17948 -988 6717 -3471 -7976 530 -3253 12074 26480 20424
11146 20424 24304 26311 17167 -3416 -21804 -26963 -9013 -12617 -25485 -29039 -32131 -23763 -2140
11133 -2140 3225 17525 26605 36230 30179 19845 -326 -13245 -7031 -7287 -7359 -8843 1295 607
11119 607 10230 23954 18918 -10313 -9607 3285 -12360 -33017 -29921 -4080 4763 -4484 -16411
11106 -16411 -10300 -4807 -11460 2850 30762 33891 41509 38118 20587 13814 -591 -13209 -16991
11093 -16991 -13867 -3050 -2794 -1990 -4734 -7181 -17063 -8613 -17569 -12857 -4490 6473 8756 8138 6712
11078 6712 12656 -4048 -11193 -12298 -1875 4759 -3797 -3084 12436 14625 2618 2788 -5554 -13575
11064 -13575 -5400 7347 3177 -18119 -15954 -20432 -16158 -4791 -8976 -20486 -23475 -4771 6586
11051 6586 2812 -734 657 -14352 -28966 -25360 4788 21440 2152 -6709 -11709 -17811 -25799
11038 -25799 -19601 7882 24376 23709 17055 15677 21957 9636 -3653 -3001 3583 -8182 -20143
11025 -20143 17009 18869 12142 -18692 -6466 2253 7373 12898 5886 -9170 -28890 -33759 -8611
11012 -8611 1955 2017 -16121 -30931 -30246 -33167 -42580 -52583 -40688 -17309 -6145 -20628 -35985
10999 -35985 -16027 2511 158 9057 -5881 9081 27747 17085 502 -7262 -776 -12785
10987 -12785 -32419 -44618 -18074 2486 -15451 -18162 -4269 569 -4667 12189 15891 35803
10975 35803 35370 25969 23033 22698 28700 8970 -3378 -11356 -23791 -25694 -17869 2804 -363 -5766
10961 -5766 -1907 9538 26129 5756 4469 3314 -2194 -3197 14235 29202 4255 3864 17658
10948 17658 23303 10320 4527 2409 156 -3955 -19187 -17157 -17776 -32680 -18618 -10182 -19506 -9174
10934 -9174 -1369 7020 6477 -9224 -10690 -10980 -3999 -315 -600 -8815 -14206 -8022 -1796 2246 -1427
10919 -1427 4027 12602 22840 20961 24490 16747 -1840 -10617 -21076 -31754 -26857 -13719 -22336
10906 -22336 -24546 -30466 -33007 -43015 -30217 -2952 -5742 -5452 -11255 -17316 -11859 -11324 -10679 -14246
10892 -14246 -18740 -6805 -8968 -33092 -26580 -8753 -7345 -13454 -3062 6842 9723 9912 8342 32985
10878 32985 44672 22237 20102 20432 4416 -3496 -8266 -13253 -6176 -8118 -17843 -17871 -21985 -32477
10864 -32477 -16846 -9915 -11762 -225 -4992 -9773 -36050 -27977 -22952 -11733 -6712 2434 35181
10851 35181 44699 39719 36435 27860 3231 -1986 6127 -2648 -9949 1581 7732 4877 10704 -1003
10837 -1003 7613 8648 5600 -7872 -3355 9259 5118 16174 38619 48417 57950 55025 36020
10824 36020 11141 19413 8975 -8612 -22234 -13884 -4634 7392 15511 15529 18989 19124 19241 23265
10810 23265 22805 8821 1307 -4994 7915 3362 -9425 -14339 428 15175 7561 5843 1388
10797 1388 5519 19789 16530 15369 22422 16717 4638 12278 10274 -10209 12173 19899 -5487
10784 -5487 -22250 -26594 -12748 2443 15027 20464 15819 2312 6332 16059 14546 -875 -28770
10771 -28770 -54733 -52355 -26576 -18270 -20194 243 12133 8232 14378 9955 -14059 -17454 -6027
10758 -6027 9315 5730 -6402 -20028 1890 8777 30782 49365 37405 18986 -1366 6008
10746 6008 13191 -1292 -14708 -5658 13665 7432 6710 -1723 6427 -2179 -2633 -25989 -48365 -45319
10732 -45319 -31122 -18089 -14294 -7035 8354 11229 11983 930 -8906 5261 4756 -9745 -8626
10719 -8626 -9734 4541 9976 14647 18110 18186 -9611 -8508 -39 -1812 -22073 -22120 -9500 -4172 -13431
10704 -13431 -21342 -11434 -22681 -19895 -13207 -7327 -13223 -16271 -11454 -22812 -42441 -40741 -39574 -15468
10690 -15468 12665 5655 -11431 -11687 -6999 11023 -3674 1691 27628 8782 -19784 -10048 -5266
10677 -5266 -16377 -34358 -32107 -11957 -3950 -5404 -13030 -22755 -14909 -19457 -26623 -22496 -7341 857
10663 857 1113 9002 17462 21456 9631 -11056 -14597 -18640 -14059 -4465 -2873 6425 3262 16435
10649 16435 22024 6363 -18561 -23254 -17743 -4720 11285 21997 27148 3760 -14440 -15157 -18879
10636 -18879 -11834 -18606 -28064 -15548 -7152 -23467 -15064 12957 7734 -19302 -13644 -18604 -3473
10623 -3473 19399 19022 10768 -16136 -8173 5559 22094 23509 5231 18914 19882 26184 24145 13876
10609 13876 8216 -1623 -18275 -17321 -10460 -6491 3762 -5517 -14675 -5481 -8123 1472 2755 -3890
10595 -3890 7214 3699 -8806 9222 20623 -1936 6655 22856 15641 15937 21314 27082 28577
10582 28577 19910 -1557 -5728 -2770 -2072 5990 -3526 -2617 -15005 -19334 -26301 -33089 -6578 8459
10568 8459 -5952 -20105 -16292 -24913 -37084 -26586 -8869 -9955 7323 28795 32781 41767 21364
10555 21364 13330 15688 10777 21890 12394 1821 14733 7115 -2085 -6003 -6505 -15837 -25033 -30633
10541 -30633 -20683 2967 5391 15695 34393 48587 61370 61189 46965 38923 34189 36372 33843
10528 33843 21905 19286 21495 12545 -19739 -26581 -21120 -18866 -19384 3185 4429 2640 8052 11511
10514 11511 -4160 -21028 -5334 -4455 -14532 -15090 351 15923 13350 -2560 4636 -3830 2528
10501 2528 21441 23700 13146 8847 18065 22677 12807 -7724 -84 -1448 1051 -14126 -26835
10488 -26835 -17117 3006 20270 29274 7015 12907 11443 13477 17395 22211 1498 -12059 -16659
10475 -16659 7764 9824 17439 11394 13027 8243 -7018 -6100 18903 15297 8877 2211 8339 12339
10461 12339 -2258 -8894 -25774 -25433 -5596 4881 11415 18925 23711 23061 36078 27289 32523 53809
10447 53809 33270 9949 25983 14678 -11273 -5259 9714 14039 9938 5602 8894 -2791 -17001
10434 -17001 -13067 10389 6896 1406 161 5900 17071 29428 34128 35897 45392 49516 52088 54668
10420 54668 59791 61564 57976 53833 56141 48118 34789 17720 -12747 -9707 1069 12001 26886
10407 26886 21253 773 -14259 -15946 -5392 -6705 -7678 -5332 -8381 1682 19673 13703 8191
10394 8191 12541 10524 17334 -5120 -16924 -19541 -22421 -16027 -6817 -11484 -11102 -6256 12149 29854
10380 29854 41191 36097 21427 31271 65568 51125 26699 26561 23929 11920 2908 -7415 -7630
10367 -7630 2494 9797 16107 16504 14565 1519 12547 24634 22321 31598 38422 24632 -2488
10354 -2488 -11631 -14345 -10664 -12146 -19309 -16431 -21191 4252 22951 21655 25386 21547 32596 28808
10340 28808 21332 18119 16277 34947 34863 19037 2320 6068 14180 9597 13869 20690 11882 7304
10326 7304 1392 -7447 -1937 11546 3350 3742 11297 32932 40670 28242 24968 28997 4873 10180
10312 10180 13280 20003 15220 -3831 -12920 -22215 -15420 -9478 5118 21515 25645 22316 23088 20092
10298 20092 20827 3761 7040 -1422 12493 26026 39063 43066 42330 30390 31870 23707 14653 35888
10284 35888 38080 21194 15434 7479 1558 -1210 -328 5346 32633 45340 31776 5612 12817
10271 12817 15974 -22 -15799 -10005 831 8040 18039 15870 15271 17115 10784 18201 38821 45097
10257 45097 39626 36503 41084 43485 28363 38102 53207 52739 39316 13513 -2986 -12239 -28508
10244 -28508 -18034 5316 8036 -2523 3765 2723 20740 55944 50978 46997 35301 16503 17953
10231 17953 2893 -4227 5595 10608 -10515 -4930 -14792 -15848 2245 4866 18929 24942 1907
10218 1907 -444 -7247 -10059 -11955 1590 27235 38036 26714 32775 32188 55862 43191 37493
10205 37493 24969 5392 -3005 -10503 6295 16833 -8300 6928 26556 34480 26393 32049 38744
10192 38744 30751 9326 7282 9518 19023 40682 46381 31580 23845 -7636 -11873 5604 18963
10179 18963 40221 24513 26467 28767 24997 6718 -5084 -8594 -10752 3318 8747 733 7400
10166 7400 20461 24066 26821 29429 22265 22075 13055 21169 6888 -9336 -7163 -14746 -15258 -20313
10152 -20313 3150 15860 6651 7245 12875 12510 18322 21318 15540 2749 -6429 14922 14325 -2127
10138 -2127 4272 9504 19182 25902 32992 34745 36791 42196 52365 47274 28236 8358 1005 -5021
10124 -5021 -6870 3804 16680 10660 6436 -1216 9370 21294 37562 35918 45358 58270 31447
10111 31447 13994 1230 8322 23638 20079 6193 21212 42465 40440 24543 -1007 4556
10099 4556 -2826 -13850 -14608 966 15049 25362 14391 -5716 -12475 4817 3482 13895 16728
10086 16728 16811 21434 23562 17573 2975 -1587 -13622 -19587 -8350 -2902 10650 4494 9120 16692
10072 16692 18249 29118 25889 33800 26298 10776 5445 15818 27670 24221 19656 5145 -5455
10059 -5455 -6171 -20931 -16125 -1723 15799 10318 -4734 9086 19659 20526 19129 27816 24644 26191
10045 26191 30241 40774 31045 42391 51309 67177 78298 147398 267716 430181 540083 463050
10033 463050 399444 383825 262909 161284 112971 82308 48608 42267 51734 45668 29772 21039
10021 21039 24999 39771 43300 45638 31052 9066 21048 29763 22279 34702 45601 34653 41342
10008 41342 48368 32988 32624 22532 19121 20604 28154 19258 22420 29689 38173 33602 22138 28153
9994 28153 34914 46703 27513 -762 6254 18182 20671 -737 -15707 -13379 -8488 -20577 -10370
9981 -10370 303 -4863 -156 9855 5989 9325 9412 12898 -6885 -11812 11146 1719 -6547 -11223
9967 -11223 10282 5707 -587 7023 21102 39538 34209 48205 55095 35265 12116 17474 2208
9954 2208 3191 25568 18143 1707 -7049 -11365 -11401 682 12723 20390 34130 57332 57025 31785
9940 31785 -4205 18349 25811 17619 29347 43771 34579 7794 -11165 -19751 3340 12172 240
9927 240 -29279 -12263 8632 -11833 -11254 11068 42879 53336 61953 38701 24550 22222 23159
9914 23159 31325 31099 22398 18576 26352 35780 39586 14872 21262 24711 25711 39270 45425 43073
9900 43073 43314 43356 30713 30948 28245 22884 26464 38836 38476 26903 31341 42132 49931 50897 53226
9885 53226 53199 58039 50757 49569 54526 65005 68331 49916 49291 58141 65408 63188 51539 48887 46406
9870 46406 51041 63430 52985 60808 69753 62711 37261 22264 11257 25503 33628 32461 37616
9857 37616 39970 46629 57173 55378 46192 60594 108922 129923 158023 197548 241733 295543 366855
9844 366855 413457 395172 368263 365237 312699 235593 164414 113724 101751 99190 83049 84123
9832 84123 70156 40349 45136 41764 54453 60651 68029 73595 60363 38310 30852 24875 19000
9819 19000 4130 5516 29579 59790 65079 43263 49650 74066 109011 90605 82717 70395 51772
9806 51772 51631 42253 30210 47012 35858 32116 32306 17952 9995 -4177 -776 8562 32460 51034
9792 51034 39081 33053 47817 41835 24087 34102 48787 47440 33940 28299 36906 53258 34558
9779 34558 8154 16179 55572 57144 42400 41240 28390 22537 40544 55446 50409 40892 36418
9766 36418 33185 15790 19313 28132 31416 34472 35892 12857 21284 46907 34458 38628 49062
9753 49062 47971 30890 20068 23181 32317 44979 38035 27264 37697 56417 50515 41183 57878
9740 57878 68050 61069 53365 59242 67505 66855 66729 63021 37625 27621 46852 52332 45091 39359
9726 39359 49500 43127 31606 40577 38900 33061 22202 13161 14808 34615 50722 51274 40451
9713 40451 28770 23183 29402 33034 25049 40155 45729 47474 51859 62311 53503 48094 39479 45297
9699 45297 43413 39008 35187 23044 8493 -6359 10697 48095 56024 46780 35148 29585 35460
9686 35460 30938 38430 55988 70952 53254 40147 40179 31247 38749 51834 56957 50260 54953 48338
9672 48338 49520 39662 34157 47445 54926 34729 49693 57008 45639 43222 57485 48140 43275
9659 43275 43914 43084 42599 52170 59818 69210 58162 59053 68419 76161 72495 57974 51663 57054 60978
9644 60978 43801 46353 69164 54514 57763 55129 51997 54700 43258 34950 35498 48352 51030 60317
9630 60317 63767 50410 57437 61599 55616 50322 37851 27871 48616 75022 77264 83214 71105
9617 71105 64385 46879 63301 67112 56032 55054 57078 65633 79757 70038 58866 59531 53435 57763
9603 57763 57207 38526 16134 8979 21200 40957 44848 38024 36752 40006 48279 51720 58951 64822
9589 64822 68233 48775 27700 35856 39493 44735 31858 33715 44640 53052 54225 48582 36881
9576 36881 47458 49361 56186 58970 51008 46409 41391 34656 54548 68332 94557 79866 68687
9563 68687 60059 75583 93642 82044 66338 66213 63879 52898 50132 42568 35522 39469 57652
9550 57652 38817 31981 52870 63455 60876 60175 82045 88988 65742 44970 47093 74935 73262
9537 73262 69243 73335 70096 67630 76237 85571 79372 92694 100979 89656 75149 74095 83924 87267
9523 87267 85766 77141 70884 95246 80299 58467 57633 71796 80610 96600 115150 95749 75458
9510 75458 53844 50452 68412 73415 81488 92181 101053 96606 78392 78268 82089 90300 89004 92804
9496 92804 89876 81439 78575 85296 78041 62297 48238 58915 78031 68488 73699 91833 103290
9483 103290 105485 84537 71232 73285 71769 78660 87111 82702 76038 90279 98567 98714 105759 84023
9469 84023 85019 97921 93998 77582 84908 88025 96806 97065 104704 120778 104201 81652 77602 94358
9455 94358 118409 111961 74971 80825 102476 103574 93657 76818 72784 77692 84071 90952 98619 114598
9441 114598 126766 142826 147095 144369 134879 118169 95615 73918 70699 59619 64259 86405 94056
9428 94056 82162 104130 109730 112454 103558 89501 94100 82320 91455 94785 94403 108596 137359
9415 137359 142478 147252 172123 161989 132226 127722 136002 131508 143783 140858 124314 118293 125004
9402 125004 131718 134761 138588 137272 132431 132195 130970 140891 132353 128497 138957 142705 133363 133237 120632
9387 120632 124875 127867 130659 136855 157048 153102 145078 142125 139814 132503 135995 129791 117273 123991
9373 123991 139844 149928 134512 131269 134899 138191 149082 149061 148398 146912 142549 158782 150862 140180
9359 140180 139835 131783 130303 134151 137175 156145 174624 167650 145337 160383 160443 149604 157633 174821
9345 174821 175943 185446 191844 178888 164692 164538 185121 184206 195728 191486 186918 195750 195018 200508
9331 200508 189765 198407 183936 167901 174602 186116 188958 188353 198582 210343 197634 200577 189981
9318 189981 180210 174328 172226 167975 174361 172418 173539 185524 210907 234918 238368 255395 287220
9305 287220 333238 387009 414111 419024 424998 411676 393229 365588 329911 309247 313378 306342
9293 306342 287139 282480 303222 338645 346834 356785 366459 374920 410165 415335 404480 404361 402966
9280 402966 402208 395921 392730 390838 372108 349756 342475 341692 359641 405979 450308 513078 603342
9267 603342 676720 743799 761747 739695 698417 623915 548080 491676 453240 431480 426883 418540
9255 418540 393808 395525 383246 379992 385859 397565 405436 417380 425590 435782 436246 422164 408135
9242 408135 390197 377134 364389 360693 364971 354073 335623 327345 350643 386588 401125 421581
9230 421581 460764 471119 465230 464954 447431 439261 418645 402826 368580 349184 356641 339676 332186
9217 332186 337988 321383 314051 318967 323692 332348 326487 318473 340917 359601 335346 332771 352300
9204 352300 361181 368450 381991 390616 392508 383938 372625 374853 387218 376752 363667 368695 372533
9191 372533 387675 401902 418263 437335 436382 454283 467187 486249 486359 490482 479332 483261 491611
9178 491611 489667 477237 463373 462135 455239 454047 458282 467134 468579 471252 479111 484633 489717 509701
9164 509701 508878 502205 498574 504620 511675 526975 528868 519146 530105 532062 547051 559425 544526
9151 544526 543841 551378 566742 583302 579581 571955 569508 576302 570878 581741 597776 600522 606947 600704
9137 600704 584963 593612 627022 628342 644649 657626 664795 654443 669062 681308 673846 663031
9125 663031 674945 704214 707041 698725 704901 692826 693507 701701 685130 683529 684863 693881 718770
9112 718770 756042 772686 769590 764788 764419 778358 792193 817894 812391 825862 845325 855686 871571
9099 871571 859307 862792 877542 892994 885506 886904 905716 922637 926751 928882 945851 954519 981428
9086 981428 992083 997067 1017117 1030124 1055536 1058648 1060232 1061118 1077979 1090946 1111301 1132148 1141781
9073 1141781 1164857 1180428 1178968 1182908 1190227 1193923 1207784 1218451 1250611 1294889 1323341 1345981
9061 1345981 1372261 1390746 1404071 1425109 1456772 1472678 1482409 1493054 1508631 1541448 1566783 1574930
9049 1574930 1588202 1597908 1611362 1635098 1649054 1672364 1697228 1718935 1755984 1804880 1845728 1866835
9037 1866835 1875556 1902183 1927438 1956855 1982639 2015415 2042827 2085306 2132293 2170392 2200505 2233868
9025 2233868 2252634 2287546 2338867 2377079 2437088 2469553 2514399 2557911 2589838 2619571 2676914
9014 2676914 2713642 2771329 2808657 2844570 2903051 2964334 3031778 3086219 3136198 3206662 3267227
9003 3267227 3328701 3403195 3475800 3555207 3646275 3737371 3796305 3846182 3913038 4001514 4099763
8992 4099763 4189891 4275524 4360171 4441680 4560517 4668169 4794176 4917667 5031337 5130661
8982 5130661 5245774 5381349 5516783 5637948 5779969 5934508 6092378 6254009 6406588 6572021
8972 6572021 6762584 6914782 7099192 7302643 7517387 7735711 7969342 8172980 8387863 8625232
8962 8625232 8868261 9114244 9382426 9650684 9959781 10282332 10606591 10920878 11262570 11609484
8952 11609484 11945346 12304649 12668971 13069006 13473113 13900173 14355527 14805616 15258820
8943 15258820 15738449 16234913 16733836 17229633 17726918 18267371 18817688 19374848 19948514
8934 19948514 20514099 21062392 21609698 22162314 22718774 23270445 23809125 24332617 24842936
8925 24842936 25336929 25798846 26234565 26647152 27002795 27326215 27604281 27846161 28053336
8916 28053336 28195553 28295015 28322510 28286346 28219145 28089462 27920851 27718735 27463988 27180097
8906 27180097 26823670 26418368 26002227 25572306 25106471 24604617 24100660 23578232 23040025
8897 23040025 22485012 21920677 21364141 20802896 20261941 19702419 19128424 18590113 18073661
8888 18073661 17556595 17045477 16554717 16086348 15603972 15143332 14691800 14251167 13811199
8879 13811199 13381398 12977050 12598657 12219415 11865224 11519845 11172282 10840417 10510913
8870 10510913 10196010 9906772 9654962 9379627 9109068 8869658 8637807 8417109 8194514
8861 8194514 7965509 7757057 7542235 7318763 7102309 6906451 6741944 6567648 6395771 6243233
8851 6243233 6094412 5953242 5793974 5650038 5524517 5396911 5263135 5134621 5016119 4891863
8841 4891863 4770880 4665354 4574490 4461236 4370177 4270555 4195287 4134985 4073950 4019030 3936665
8830 3936665 3833685 3740007 3661825 3596547 3519656 3432795 3368424 3287635 3241508 3181490 3108914
8819 3108914 3044836 2987403 2945488 2876257 2824874 2791294 2732570 2676574 2626779 2587458 2546803
8808 2546803 2492829 2436381 2396039 2379742 2346071 2308130 2255754 2233599 2214117 2180700 2169139
8797 2169139 2141407 2094494 2042564 1991596 1974427 1958217 1932076 1918180 1889557 1850925 1816872
8786 1816872 1779917 1752746 1728662 1720665 1719246 1687537 1651026 1624457 1624351 1605358 1583909 1554674
8774 1554674 1531659 1513989 1493740 1463280 1437256 1412750 1383429 1373599 1360588 1336589 1311780 1286351
8762 1286351 1273850 1292600 1296748 1285538 1277908 1241035 1202372 1183318 1171644 1154239 1144967 1130722
8750 1130722 1105226 1080202 1077331 1090012 1087016 1080933 1080872 1070123 1044315 1022594 992644 974078 973709
8737 973709 953962 951036 950538 929689 926738 927684 926600 902624 904560 880263 854716 850331 841155 828667
8723 828667 830444 830302 828861 837833 828463 804000 771708 769895 775676 770694 768986 760923 767772 769596
8709 769596 748832 718973 704616 719327 720977 710631 698939 692149 686857 699467 694021 697699 697470
8696 697470 683573 676574 663610 644360 631351 607884 597489 593884 590046 584780 579301 586181 596931
8683 596931 595897 578198 582817 599084 583143 570258 577746 565816 567432 551124 552047 564717 579258
8670 579258 619140 654804 654072 656179 658111 645427 612114 575522 564076 562437 548378 544050 525954
8657 525954 513757 510997 506199 496345 471458 450760 442714 441807 449854 457950 462767 468362 456234 440243
8643 440243 445161 431832 413979 404943 403474 415325 418178 406883 398766 405351 416113 432011 442212
8630 442212 444000 441493 431570 413354 394712 402837 412899 426822 420052 402491 409378 401281 389992
8617 389992 396846 419741 409632 399745 398553 386673 371592 374993 400607 400434 382887 364254 351364
8604 351364 367614 385995 400787 410230 408009 405064 381356 375130 381801 382049 379396 373500 391727
8591 391727 391495 410390 422898 413330 415968 400192 382372 383962 392460 386321 362544 335924 312773
8578 312773 313930 319456 321475 322017 311020 287755 297634 309565 309574 307017 303271 291217 281945 269940
8564 269940 255578 260531 259511 267245 276608 282955 281993 282825 267604 271713 264516 230565 224557 222937
8550 222937 230856 241832 221231 232536 242255 240365 227135 218157 236486 223246 214505 216887 225003
8537 225003 220198 213264 211937 218769 230855 222389 216914 213449 181353 162227 173525 196337 202828
8524 202828 197867 206649 211954 212220 191057 209138 220884 194327 178845 169850 172211 200391 212186
8511 212186 228121 209798 179920 186413 199239 219124 215387 202818 204526 195999 190306 186507 201510
8498 201510 204019 196241 178462 183244 194560 171614 168942 172336 184807 195776 181320 148080 120850
8485 120850 98079 114902 141206 180603 180905 175494 176328 162290 168928 177413 174902 173499 170055 153884
8471 153884 145556 160018 155198 154546 156258 152889 152199 154022 169703 185876 170024 161274 150388 152283
8457 152283 145834 130594 127673 133474 139136 161913 167295 173456 176322 160626 137886 134168 151399
8444 151399 173175 172354 161040 140693 143703 157069 147117 145581 131813 106796 117059 132656 150862
8431 150862 174411 172702 144962 116327 110979 124774 155342 150271 151429 144122 138022 127155 120416
8418 120416 117943 121906 119778 129028 125533 111642 107819 136755 150781 130199 122848 121253 123703
8405 123703 128540 128278 119712 122268 122925 114083 114713 109123 104949 104346 107975 106872 87267 88566 98387
8390 98387 84980 82413 95786 86661 96288 111927 114902 91107 99270 100954 98977 129408 124096
8377 124096 91879 68971 79765 120179 136134 134908 138715 127974 99140 99981 94352 120820 138764
8364 138764 136237 133597 124512 126272 115164 101816 90304 96164 87195 78213 94450 101613 88440
8351 88440 109359 107306 85513 70092 58512 77585 81052 98303 108256 106189 99976 101383 91723
8338 91723 71914 61224 62974 74769 74172 81347 82787 74903 77666 91363 88339 69472 73649 102005
8324 102005 111527 93928 73249 77522 79377 69108 71216 76704 65709 45624 54345 71404 73955
8311 73955 53134 47723 62195 85115 87425 67618 69811 96346 108333 106861 120041 100954 81956
8298 81956 52555 48313 53467 57626 69795 78408 61450 53631 78910 78217 66315 58114 76492
8285 76492 85331 77046 78309 96267 110239 82319 63099 63609 78050 84962 91395 84194 89224 83221
8271 83221 52549 45964 53573 64201 61372 45406 57132 72084 65586 58817 71619 69919 88047
8258 88047 106425 109119 95026 70515 58239 69456 80917 66057 46357 44526 53866 48588 45096
8245 45096 57421 55876 34453 42223 58595 52593 41177 50463 66719 69830 55705 40162 32921
8232 32921 15998 15691 18114 34894 74653 75639 62508 47865 37406 50460 52415 34822 47471
8219 47471 48854 39643 48957 30137 33272 44191 52075 58889 39462 35495 32591 19290 27482 37705
8205 37705 32816 16051 27079 40989 52231 57492 56576 67877 66554 59238 64353 52915 80783
8192 80783 63858 41223 42781 45876 37107 36191 45624 59000 76710 63866 52104 41355 37528
8179 37528 43888 53857 52665 35953 49115 51480 54645 49561 46809 54105 50096 59136 63011 42838
8165 42838 28817 47110 60315 61846 52291 43313 45272 45929 57745 67795 67578 61337 67687 60497
8151 60497 61834 45653 34599 38273 43622 56539 39031 63275 80420 82115 83470 73565 62218
8138 62218 58261 62541 49940 45190 38181 34788 39958 38854 30477 21605 32131 29773 8204 44928
8124 44928 51797 37461 42636 56255 39967 33974 32846 27362 20294 21460 31916 31417 38707 46606
8110 46606 52007 57481 55409 53675 30534 13071 2601 12241 34750 22201 20488 40840 44080
8097 44080 36762 34945 52087 58955 46323 43257 63463 69163 65506 55388 40206 53102 60284
8084 60284 62265 67462 58040 72277 87055 93355 79086 55365 51494 47291 50692 44589 11180
8071 11180 11696 33304 43202 51965 56495 57790 50908 54029 40797 27351 33684 49027 74422 91005
8057 91005 83848 69181 45810 21408 44599 80275 104477 107178 100440 100950 88365 63492 67895
8044 67895 90835 85330 69426 66352 70324 78336 69840 77668 85377 74709 56794 49498 34008
8031 34008 42483 51221 42723 64920 68558 45653 49429 57090 43831 46824 31901 10673 10874 19589
8017 19589 6624 762 -3639 5719 37801 52572 50603 58227 74310 67930 49386 50595 31146
8004 31146 37340 55162 65257 65016 54668 43097 45195 57672 60019 32546 20856 18768 22545
7991 22545 26098 47012 50440 48449 48440 53421 44345 41891 43615 41349 46280 52968 56023 49024 22934
7976 22934 19257 33480 36062 45033 64122 62536 59911 32865 11648 3510 11003 14745 25002
7963 25002 27801 52404 70650 74423 72093 59420 60267 69178 67611 73665 58900 55254 57206 49682
7949 49682 23209 28434 45715 51000 32929 42984 73271 73544 46416 32639 45421 58162 69095
7936 69095 54927 40814 52225 57743 48852 56031 51231 51391 39394 27362 25359 8229 3960
7923 3960 4474 12612 31456 20573 23506 29820 27490 29354 39618 31232 17065 8513 442 5979
7909 5979 6775 17072 25346 13431 17171 25510 30492 18358 29082 36790 21080 21547 37544 39052
7895 39052 45672 43815 45690 34959 6307 13755 7510 -437 19631 50099 56035 20402 -1495
7882 -1495 -3640 16377 11430 33305 31998 23232 39066 46907 28783 29807 41924 32827 30398 32009
7868 32009 28668 36454 36463 15850 11711 10295 877 4873 22652 37903 35402 46800 59353 61841
7854 61841 50982 52025 23512 5316 8932 22247 21892 26715 31114 26598 27446 22674 27833 38945
7840 38945 38317 38878 24780 25039 27380 31647 29622 29938 36436 36842 30386 25223 50325 46937 31119
7825 31119 37970 40602 37302 35566 29864 15226 12512 7703 10114 24420 19809 12481 12092 -8797
7811 -8797 -19128 -7569 16163 11632 4135 -2776 -13394 -572 -7474 -8259 -9178 -9441 -11201 -13122
7797 -13122 1179 11936 24424 38431 23599 -880 5760 16716 19030 16756 34271 39028 33107
7784 33107 38156 32541 32114 21743 1634 -3722 -22404 -20889 -13247 3593 -4323 -11671 -466 4608
7770 4608 9698 8896 655 -7403 2294 13847 15330 25423 32523 45404 49931 43695 20387 -1603
7756 -1603 3651 14143 15653 19503 25977 22191 16926 11954 13679 14375 8000 15192 27803 15884
7742 15884 11685 7605 -3121 19470 24692 10505 -7424 -18542 -7832 -5147 -1605 6867 18291
7729 18291 15806 9139 23601 30667 32756 9167 6375 5281 17363 33626 24311 16569 35083
7716 35083 43305 17995 3270 7445 -963 -13768 -8942 -12321 -10890 -4336 6823 9129 9577 1948
7702 1948 2906 30579 30658 8524 4361 1103 -7843 -10595 2013 6713 -11190 -7218 25406 16673
7688 16673 -5486 -19493 -20679 3915 27758 32143 35293 12834 -14066 -12233 29498 26841 20344
7675 20344 3917 -25062 -11062 7870 27432 30363 29443 28657 22702 20079 6932 10257 3739 14404
7661 14404 23300 14872 21135 10392 14761 3694 8958 15870 22124 12949 6471 -5655 -25992 -25656
7647 -25656 4775 18759 18673 -5227 -12041 6931 22879 14337 -397 2072 -13351 -10533 -7368
7634 -7368 -18727 -9438 9239 11967 2108 27986 29950 11839 6017 11766 28493 19735 19099 1688
7620 1688 -1884 6560 5760 -3436 -14185 -11938 -9176 -9047 4518 -2403 -15071 -7028 -3178 7574
7606 7574 4032 -16202 -24680 -14238 1717 17666 14231 17409 14862 17463 3069 -11357 -19609
7593 -19609 -4137 -1310 -9922 3334 25863 34743 28020 10934 7640 6399 10027 -1670 4224
7580 4224 1173 2830 12265 17189 14262 3413 15113 34388 20563 -9172 -1678 23919 27938
7567 27938 29197 30620 37259 19729 19177 16451 6873 19563 30444 43294 41081 15956 1912
7554 1912 639 16204 6433 2352 -44 5282 4080 -17459 -20480 -23428 -29112 -19638 -3784 18490
7540 18490 40194 37059 28646 14340 7216 12702 1024 -9948 -18132 -24607 -14082 2542 17077
7527 17077 21972 -485 -14281 -17651 -2701 1431 9029 10822 3823 13898 12815 1366 -633
7514 -633 -1680 2 19007 15945 -2588 -621 7921 9432 10832 -2629 9286 5486 16711 22742
7500 22742 20007 13374 2331 6241 9087 9634 2483 7349 4026 2771 11106 13274 29957 35861
7486 35861 8617 2379 6350 -10886 5238 -1426 -21190 -13093 -6210 11320 15061 -4079 -3924
7473 -3924 -2373 -8326 1794 6649 12822 15464 11332 5545 -2400 -2984 -1293 -545 8521 12993 12327
7458 12327 4842 -21399 -19295 4070 6632 -18693 -25399 5925 26536 20085 23371 16879 1130
7445 1130 10851 19254 654 -6440 10930 4493 4874 -8094 -14139 -23199 -39517 -35776 -8126 19262
7431 19262 18605 20916 -1157 1178 7329 8000 21613 2321 -7421 -17634 -16243 -20598 -14295 8572
7417 8572 20254 -9504 -14834 4300 18099 2562 -4726 -1581 -4837 6599 16732 19167 40055
7404 40055 30508 4199 -915 1592 -7772 -11570 -140 20077 25386 13369 10442 7822 18392
7391 18392 26376 22078 11415 5439 7539 1172 8667 19716 2510 3281 24528 22367 28305 24489
7377 24489 25130 24238 13684 18101 13250 18782 15944 9725 -10233 -15989 -15389 -15037 -955 10305 2469
7362 2469 -2058 -3961 -5565 -5237 -1755 3037 23072 27487 18805 18947 32713 24092 21146 21707 9200
7347 9200 -10240 -23381 -24061 -2217 -7254 -6551 -6110 -4048 3464 3497 4998 4125 -3826 3409 2480 17020
7331 17020 43409 30892 12658 -1737 -4574 18401 10207 6769 7595 -3840 -25775 -13169 8570
7318 8570 25656 33253 17582 19097 13224 -4483 -21366 -17121 -13777 -4958 -15082 4396 12131
7305 12131 -6801 6316 9470 1986 -10332 -26292 -37821 -36230 -39144 -38451 -31964 -11084 -15011
7292 -15011 -27701 -13541 8082 8002 -4644 -19862 -23598 -23466 -12003 -14217 -4351 2368 11319 -3883
7278 -3883 -7974 9228 -9341 -4302 13017 9676 -8392 -30223 -16579 5925 15917 12790 10461
7265 10461 2395 -2923 -8164 -9234 -3810 6692 8448 11353 20904 34050 40605 24103 10420 10297
7251 10297 -9213 -15107 9024 20697 8334 -15516 -17475 -16198 -1992 4302 25480 35522 22222
7238 22222 9294 17194 12557 3654 -6303 -24827 -31525 -21523 -24752 -20489 -26966 -26885 -13222 14756
7224 14756 14680 7933 15778 4040 -7563 2284 2041 -11236 -22640 -13141 -13754 -2619 34284 47517
7210 47517 20408 -5913 -16063 -506 -9947 -23671 -31752 -18979 -7192 -13087 9246 29810
7198 29810 30309 16190 956 -5857 -3788 3074 -5683 -8996 -9444 4203 -288 -15687 -33154 -31297
7184 -31297 -24497 -18875 2254 27041 29090 25151 24255 23934 9773 -4673 -8809 -15794 -30563 -34835
7170 -34835 -31764 -11457 15904 20927 -21059 -37007 -11456 7003 829 3661 19744 24623 17332
7157 17332 8534 6072 13849 9173 6335 452 6457 14059 6670 -22546 -30256 -23050 -11127 -15330
7143 -15330 -13724 -7321 -5206 2289 17336 6226 -6020 -4995 -8091 -7389 9447 8140 12786 9376
7129 9376 -13223 -25563 -32679 -24717 -24156 -6494 -18021 -10663 -2144 7 506 -10605 1677 4362
7115 4362 -18137 -17750 4878 24019 24030 1209 -6999 -17126 -23391 -20331 -16732 3627 -6650 -13727
7101 -13727 -9838 13015 14748 6596 10156 20929 10844 -3207 -16364 -39198 -35154 -17973 -8807
7088 -8807 -9309 -9676 6421 20361 11621 -3181 -630 7311 9227 17825 17035 13525 8634 -3669 -9353
7073 -9353 -4653 11714 14863 25265 2851 -13376 -23588 -25945 -14804 -6269 4016 -6515 -7059
7060 -7059 -5930 803 19397 37682 35539 25870 6409 9453 15176 28045 31519 29226 14156 -2477
7046 -2477 -1316 -2983 -12994 -16822 -30588 -27763 1235 28809 36693 29353 39809 37481 31161 4247
7032 4247 -2523 -4225 8674 35933 32242 18876 -9651 -24240 -10962 -4656 -25605 -36023 -28727
7019 -28727 -26598 57 27111 23675 532 5415 3242 1473 -10045 -21770 -5011 -1062 4428
7006 4428 18771 12500 11553 16080 16892 15892 21425 25948 25686 25338 12782 3645 -10663 -17427 -31711
6991 -31711 -35574 -21157 8159 7610 5557 13059 -6258 -11690 -16586 -10765 -5485 -8784 -23689 -21064
6977 -21064 -19811 -29846 -5110 2261 -4986 -9563 -19108 -20744 -23258 -21541 -13614 -23497 -24231 -13435
6963 -13435 -9718 -3151 -15848 -16275 -6105 -12168 -1709 12672 13497 153 -4452 -3099 -355 -3771
6949 -3771 -2977 3588 -7926 -16878 -20177 -17297 -22233 -30637 -34254 -30020 -1623 -3856 -14354 -27609
6935 -27609 -13450 3153 -622 -8308 -22395 -4021 -16556 -3915 18437 4390 -26608 -19772
6923 -19772 -10466 -5741 -4113 4258 -8957 -17838 -17991 -5801 132 -14452 -37136 -34122 -37642 -29433
6909 -29433 -15643 -24800 -33887 -19628 3012 20195 36666 15901 -2703 -6667 -16890 -8406 12380
6896 12380 12869 -17298 -29682 -25086 -30386 -43273 -24361 -28572 -41094 -46270 -55475 -41009 -16556
6883 -16556 -8783 -3447 12145 13769 12981 17274 15224 12113 -6011 1989 -21304 -22737 -5007 4383
6869 4383 19000 17391 17168 20362 21939 36918 28494 18526 26637 20134 10428 4902 -2957 9716
6855 9716 16634 -15174 -39885 -34349 -27094 -22663 -24878 -14940 -8480 -23679 -21247 -11090 -11047 -6623
6841 -6623 -6903 376 7502 19703 10318 8817 -5085 -20066 -14321 3967 23577 9643 12556 4827
6827 4827 4871 25752 21197 -7947 -36809 -41706 -31303 -15972 -2174 4459 -239 -7315 -24131 -46492
6813 -46492 -37512 -25832 -19311 -14317 -12243 2053 -12831 -31162 -42978 -46403 -18094 -2864 11986
6800 11986 21730 7438 -2349 -229 9804 12655 2225 -10246 -3569 -2366 -27762 -42967 -28444
6787 -28444 -15968 -1225 2386 -22976 -19417 -3613 -18906 -31652 -12985 3600 -106 9028 4505
6774 4505 -8795 20366 25971 9431 10118 21960 12032 -9433 -26728 -18495 -7514 -2835 -2807 -25463
6760 -25463 -44525 -36361 -22039 -11499 -11913 -21663 -10521 -22737 -27490 -32821 -43060 -38971 -36539
6747 -36539 -27060 -16067 -15244 -15691 -12988 -27344 -18561 -28673 -33099 -33250 -19510 -26037 -19458 6863
6733 6863 15138 14478 15660 559 -4301 -3655 -564 8813 30967 40891 16261 5250 5658 2428 -6673
6718 -6673 -10150 6244 18332 7095 -4680 -10379 -18237 -20959 -27045 -38684 -17220 -3653 1773
6705 1773 -26054 -29753 -44175 -49851 -55823 -42792 -41765 -28492 -21712 420 141 3539 -2805 -7004
6691 -7004 -6895 -18074 -32761 -33277 -25936 -18559 -22187 -6741 -10874 -16452 -11090 734 30051 24604
6677 24604 5736 -8303 -14032 -1342 -7213 -31259 -39418 -41934 -29714 -20317 -7997 -4626 -12634
6664 -12634 -3321 690 -15789 -13892 -3986 -590 1476 -3465 -8474 9283 16091 13106 18058 6013
6650 6013 1039 2993 929 -1449 -1576 12904 -2090 -24073 -20148 -4971 -7902 -9971 8998 36177
6636 36177 29608 2894 7767 23947 32189 27769 21746 12036 -5919 -2815 -4956 438 -10640 -20082
6622 -20082 -8747 -20518 -29172 -11255 -1747 -7330 -6995 -9129 -5903 -6806 5733 9527 690 117
6608 117 -5727 -7490 6762 5485 2523 -4124 -7206 3783 -1428 2641 9224 7672 12243 15065 11336
6593 11336 -2422 -15947 -10004 3539 4734 437 5928 21680 33246 21248 -4778 -7245 5953
6580 5953 11267 -13299 -16291 -21526 -15702 -7925 -31206 -38782 -29534 -19318 -17706 -10425 2782 -24861
6566 -24861 -16140 -27363 -40622 -31940 -11571 1718 -5896 -19376 4734 5084 -5821 -1398 4483
6553 4483 -418 -16590 1001 -1678 -14051 -5199 9837 1458 -12090 -19415 -6367 -2529 -5773
6540 -5773 -1866 -10710 -8298 -3753 -4674 4934 2318 9692 18517 2623 15217 3795 -2147 -10615
6526 -10615 -17219 -11875 -7524 -15591 -16218 -13083 -20732 -29730 -26559 -34185 -29902 -15231 -16734 -30094
6512 -30094 -23566 -12335 -2431 3284 -14261 -16032 3906 8770 -5735 -13258 -18485 -27610 -44608
6499 -44608 -52413 -35786 -33411 -23139 -23760 -24846 -27014 -28502 -18863 -1914 -16237 -19704 -17449 -26092
6485 -26092 -33248 -31278 -22803 -17316 -13875 -16229 -29605 -33044 -11782 -1590 1764 -25563 -15343
6472 -15343 -4881 10019 30418 29173 21655 169 -11256 -15737 -5902 -1587 3814 8617 438
6459 438 714 -1845 -10428 -10590 -7352 -15737 -3828 1272 -1218 1020 2721 411 7691 7565 6853 16177
6443 16177 8791 1468 -8363 -22461 -11784 -16846 -2850 11460 2076 -2578 2443 -3439 -556 -652
6429 -652 -81 -7451 1173 -16520 -24392 -24087 -12282 -1822 10209 21179 30475 13098 -1515 -3572
6415 -3572 -18063 1562 24972 38843 10194 -3268 16950 34856 30369 11475 5410 11823 12069
6402 12069 4742 -687 -11997 -11928 -15036 -14446 -20733 -21740 -19421 -24721 -21586 -25499 -37261 -40252 -40314
6387 -40314 -19030 -17939 -30653 -33731 -25332 -26409 -24092 4547 26532 8789 -1554 10427 15988
6374 15988 27006 19351 29202 8090 -19910 -22911 -16110 -12834 -19534 -9999 1523 16295 35411
6361 35411 30088 30874 20687 -19217 -30301 -16501 -9712 -11297 -12647 -9654 8902 20231 3710
6348 3710 4410 8315 7637 14447 18918 32831 22949 18440 19430 16633 7251 -11110 -33980 -24949 -3538
6333 -3538 2969 11728 8112 -5979 -16184 -18484 -13161 -28255 -23282 -23219 -13358 -5501 9007 -13593
6319 -13593 -18997 -13554 -30868 -42154 -59325 -42301 -34411 -38782 -31264 -40252 -37816 -13438 -3175
6306 -3175 -22623 -29632 -12159 -16309 -9927 3689 -6961 -12112 -40 12376 4298 4868 -4083 -12521
6292 -12521 -26805 -7721 -5065 -30944 -44561 -35716 -8306 -19556 -14545 -16923 -20272 -31803 -34944
6279 -34944 -20906 -2596 -12833 -17331 -16487 -7872 -9408 -16107 -2185 -2845 -12158 -7325 4255 14127
6265 14127 12324 2425 6909 -4814 -1881 1101 14952 3443 -7182 -7776 -8495 -10846 -1244 -4256
6251 -4256 -19460 -4009 -440 -12091 -14627 -3461 -15702 -25365 -6660 17143 11055 -9533 -13166
6238 -13166 -31752 -21191 -20156 -34368 -20916 -25026 -23423 -13356 -6191 -10069 -2216 2707 7289
6225 7289 211 -9726 -14142 -20154 -24456 -21286 -23623 -22348 -12214 462 814 -4208 -1020 20529
6211 20529 16416 9105 16156 4776 -4031 -1797 15593 25697 26600 18749 1964 11734 24801 23704
6197 23704 7682 15882 17047 9715 -4069 -1519 7716 14554 -7749 -42118 -44613 -23578 -13333
6184 -13333 -15341 8587 25707 -2608 -27910 -27060 -25985 -16768 10152 18801 21413 1121 -4213
6171 -4213 4408 26273 -539 -24639 -18933 -25489 -27510 -21050 -19991 -29508 -13598 13253 5138 5966
6157 5966 4561 -8233 -7208 -10043 -23617 -19375 -31639 -22129 -13560 -21835 -28153 -18697 14683 37842
6143 37842 43497 40241 20881 3729 -11326 -9175 -7901 -23567 -21502 -18723 -25351 -28913 -31445 -31498
6129 -31498 -19785 -7183 -1695 7847 12770 19583 6035 -12480 -8598 -10231 -3133 -6160 -16804
6116 -16804 -24642 -22643 -12828 -24674 -20967 -18633 -43817 -45273 -25745 -17976 -15815 -3000 8489
6103 8489 -1836 -2973 -18002 -22079 -24613 -22710 -22571 -19744 -15063 -5183 14046 11411 12935 -2174
6089 -2174 -6170 -2626 620 -1743 -10809 -7555 8172 -2913 -14272 -18458 -27992 -38370 -19235 2098
6075 2098 15664 6190 13048 6140 -16615 -19244 -17276 -12651 3996 33503 20927 8684 23575
6062 23575 -1452 -302 5396 9572 -10865 -26686 -5628 9789 8161 2610 8832 5093 -9011
6049 -9011 -16456 17909 36900 17550 -4975 -23190 -22278 4831 14163 6478 -27237 -25417 -19247
6036 -19247 -20064 -19871 -16380 -3908 1163 7551 8325 1907 -10897 -99 19603 25933 25881 16144 -4764
6021 -4764 -13821 -4012 -33823 -46699 -23073 -15981 -27962 -17152 10 -267 -11156 -19833 -25034
6008 -25034 -11429 -15392 -32999 -44563 -53114 -35415 -8763 -8849 -5152 5937 6963 4355 1898 9118
5994 9118 5900 -1994 -15885 -23021 -32306 -30202 -28942 -22948 -7504 -9828 -6234 -2794 -4147 -9646
5980 -9646 -19268 -15816 -6000 -14316 -25527 -27931 -25616 -23849 -18296 -16128 -14552 -2361 2093 -24860
5966 -24860 -25048 -36391 -42038 -38541 -37174 -29115 -22993 -19132 7589 26728 22467 4190 -17692 -15983
5952 -15983 -34278 -35974 -12294 8795 2592 -6872 -8078 11869 23179 13074 13110 7430 10837 4928
5938 4928 -1466 -12929 -13899 -16276 -14014 -16872 -27192 -21292 -15875 1586 5212 7162 -229 908
5924 908 -11838 -20404 -22028 -15507 -16252 -12641 3509 -692 265 2606 12876 27477 18088 1977
5910 1977 5191 -8020 -9189 -619 15797 8319 -6874 -8447 -12149 -1935 -5138 9336 23084
5897 23084 12214 5419 -1983 -6454 -5972 -4268 11270 11931 6053 2328 -80 3844 4101 -16821 -13187
5882 -13187 9432 27269 25629 11057 8351 1641 787 7067 19418 20108 29484 8731 12548 23563
5868 23563 22399 22808 24629 22559 33729 36175 40481 21172 10485 3365 -8219 -18901 -12639 -14130
5854 -14130 -13197 -4996 -8180 168 10218 4582 -4859 -18092 -29483 -12225 9069 32705 35812
5841 35812 22383 -1964 -12217 -29802 -22894 -31395 -28935 -16976 -14092 -3417 -15875 -22696 -13824
5828 -13824 -16699 -7011 -8320 -20165 -8869 -1084 -10895 -8248 -15841 -18097 -1008 -11026 -22821
5815 -22821 -12539 -13133 -21733 -24527 -23320 -23934 -24292 -45705 -48930 -10523 25018 25968 9112 4520
5801 4520 5840 13490 3247 -20692 -17058 -7630 -8914 -17395 -19601 -32411 -13314 -7330 1801 6951
5787 6951 2108 5393 -9900 -19227 -6606 -1010 20560 8404 -21028 -19699 -9360 -15688 -12584
5774 -12584 17511 12040 4474 -6532 -26513 -19795 -27473 -26632 -12000 -19645 -22225 -25967 -18727 -1733
5760 -1733 -10589 -6928 -5594 -11549 -2748 -14173 -12396 -14580 -22774 -17560 8589 -1233 -3590 -8349
5746 -8349 -11843 -2748 -4865 -9465 -1144 -7489 -19870 -23853 -20648 -13007 -9197 4268 10531 -3289
5732 -3289 -4317 -7465 4036 20828 13375 16427 10613 -10186 -28457 -28949 -25510 -14632 -21396 -34586
5718 -34586 -51646 -42448 -5249 4044 -10712 -25435 -21795 -25006 -21090 -9472 -5326 -8671 -1635
5705 -1635 -5507 -2402 -7146 -19779 -6392 3217 24076 25205 -6717 -15692 -10505 -6759 6426 13012
5691 13012 10131 -2107 -3439 14470 25847 12204 -1070 -31589 -22878 -23083 -26860 -3608 -5722
5678 -5722 -11041 -10429 -37925 -39745 -44959 -47175 -40425 -30793 -14201 -6717 -6970 4595 12837 22823 7302
5663 7302 -3018 -12706 -20692 3150 -3795 -6750 2709 4654 -2632 -5316 2987 -3611 -13318 -17477
5649 -17477 -19221 -14019 -9347 -14634 -11639 8049 23304 12605 -7047 4461 8521 12059 7669
5636 7669 -58 11205 6544 -10551 -22057 -8748 -396 4880 -190 -3290 -5282 -5198 -10573 -7166
5622 -7166 -4258 765 -8281 -4333 4634 3718 12405 33587 52503 42467 23070 7558 5137 33283
5608 33283 59449 57031 27598 14887 6543 -7276 -477 -4536 -1193 28151 56084 47946 13562
5595 13562 -11541 2130 7032 -7994 -24991 -17932 -15071 -25082 -14543 6044 16934 27803
5583 27803 8314 -8731 -26922 -18657 -31078 -37938 -21868 -1250 13876 22531 24372 25620 29721
5570 29721 13647 -20796 -26384 -39275 -34612 -32536 -18530 -9324 2631 -674 -11499 -9567 -5398
5557 -5398 13070 34172 38878 11455 15145 15720 3876 6700 5778 -13959 -18310 -8251 -11261 -21337
5543 -21337 -46056 -38542 -28822 -24203 -33300 -41436 -34018 -29417 -29626 -23528 -21917 -24715 -35697 -26680
5529 -26680 -24439 -15218 -7479 -6479 -23709 -34358 -17416 -852 13037 23065 33940 27193 8334
5516 8334 -829 -7992 -14580 4038 11446 -1723 -9853 -1959 -8097 -20358 -13148 -15790 10176 46762
5502 46762 38311 31650 34017 6108 2843 20634 25866 12341 333 -2939 -1117 -4123 -3605 -7017
5488 -7017 -5875 228 16115 24990 9227 -3140 -8360 -1035 13273 23788 16392 964 -9048
5475 -9048 -4599 -4126 -12824 -27436 -27302 -13239 12523 13901 -2713 -5311 109 -720 12420 14191
5461 14191 -14334 -18329 -11549 -20363 -37119 -30063 -9034 -11724 -5712 12424 13661 8995 9497 7645
5447 7645 14596 18154 19149 368 -16669 -16143 -1516 -376 -21406 -19906 -15666 -14350 -12897 -32253
5433 -32253 -28526 -12538 -6905 13285 21122 30410 23626 14380 8309 -2191 -8636 -12734 -9620 -14151
5419 -14151 -12548 -11247 -19654 -16421 -19453 -28265 -22896 -14362 -16011 -15522 -6839 -8333 -28508 -45965
5405 -45965 -41873 -28169 -6733 -13604 -10092 -3558 667 -6592 -15338 -27166 -25093 -12988 -9539 -4347
5391 -4347 14201 8146 -20360 -39325 -36312 -22930 -14492 11183 19107 12936 33876 20960 11082
5378 11082 16306 43980 39728 6558 21421 29532 15469 -7413 -20201 8056 28445 18927 7609
5365 7609 15925 40291 54367 32465 19047 20563 554 -24655 -37549 -54842 -58211 -37176 -16756
5352 -16756 -19365 -16616 -805 3597 -23390 -39922 -42714 -17678 -13970 -20740 -29936 -17125 -6670
5339 -6670 -1166 6342 -17064 -17413 -3305 4046 10311 1720 -25478 -20281 -32550 -29892 -15995 -15223
5325 -15223 -4709 3202 8834 4200 3123 6163 -23532 -45335 -38941 -23239 -2085 -4031 4636
5312 4636 -10772 -36455 -46633 -55580 -29818 -12175 -13092 -16539 -26005 -28542 -27715 -36670 -41946 -33103
5298 -33103 -24544 -32414 -34694 -36976 -40732 -65010 -60017 -50341 -48549 -19216 -17914 -6925 -1915 -8303
5284 -8303 -9121 3237 1201 4779 19572 21905 2088 35 -4072 -13165 -9571 -4617 6815 2482
5270 2482 3831 -3763 -19999 -26775 -18241 5862 -6083 -329 -18440 -24802 -9006 -5261 -7985 -7037
5256 -7037 -20701 -5878 7671 6796 -3458 -2570 18610 14350 6539 2281 4616 -12936 -7332 -23331
5242 -23331 -22250 -18346 -11603 -12276 -18516 -19627 -38348 -40386 -34253 -21471 -13057 -17654 -17978 -20106 -16188
5227 -16188 -8450 -25173 -28004 -28958 -28920 -10469 2262 5855 9552 -5959 -8207 -2011 2563 4728
5213 4728 12318 12989 9349 -3540 -12664 -3187 -11430 -26542 -33771 -33117 -33806 -7686 16659 14991 11599
5198 11599 -1184 4169 7102 1872 5406 1237 5100 9606 9812 8186 -5916 871 4304 -6273
5184 -6273 -4318 -6988 4147 11580 -2601 2285 11722 -11313 -9705 -16254 -9193 -4270 -13705 -6919
5170 -6919 2427 12958 13457 5387 -2476 -16748 -35404 -39644 -22852 -32249 -24534 5138 -5046 -5608
5156 -5608 16565 19731 -14394 -37783 -37729 -49859 -27287 11197 21426 28962 24853 9433 6592
5143 6592 1019 1707 15396 31766 25825 1818 -20334 -22971 -10882 -10695 -12185 -42474 -26817 -9944
5129 -9944 -22573 -34067 -34904 -4314 6926 15808 16957 14570 -3170 -671 11624 28807 14399
5116 14399 -228 -1702 -4893 3340 8080 -3948 -2955 7462 1561 -16378 -23052 -10682 1453
5103 1453 6328 11982 9030 -1773 -18493 -34153 -39294 -26342 -6639 -2385 -8309 -8047 95 18411
5089 18411 30097 20294 12230 -3868 -12267 10169 4460 -10876 -11662 -3143 4812 13968 9351 -898
5075 -898 6100 7726 7795 11573 5376 -3818 -26475 -39846 -44393 -39955 -21259 -17150 -25806 -11157 -9401
5060 -9401 -16829 -17005 -5312 7464 11972 -7156 -14515 -13984 -15715 -14154 6693 -11973 -29755 -19351
5046 -19351 -35112 -21453 -9781 -12163 -20533 -26840 -34900 -37195 -18380 6280 7413 12735 11182
5033 11182 5989 7109 6012 11945 26034 44268 46604 21340 13435 13353 774 16109 14586 5283
5019 5283 9793 13813 4169 10566 9189 17396 6971 -6812 -11662 -13608 -11303 6098 18435 13118
5005 13118 -8602 -3055 13295 22246 29266 36455 41683 25591 6073 4162 -8236 -4604 20456
4992 20456 25296 14590 4085 -11744 -13800 1786 24427 35159 14655 -1979 1207 4146 -2014
4979 -2014 15523 22356 23935 4154 -10772 -28793 -32924 -19713 8990 21230 25445 17206 12523
4966 12523 8267 -2756 1028 22137 11652 -2893 -6968 -21681 -29112 -34731 -30070 -17428 2950
4953 2950 5769 6237 -5148 11956 13606 5914 -1751 -5611 -10891 -20901 -13717 1459 -5764 -5141
4939 -5141 1693 -7082 -25333 -13420 -17625 -12075 -11180 -32478 -38756 -20550 -10468 -13162 -9025 6295
4925 6295 17232 6221 -4564 3284 -2400 -3394 -3020 -223 4890 11720 -9993 -37086 -37700 -29978
4911 -29978 -17932 -13347 -4670 2417 4250 -3111 -25786 -13006 -5683 -8875 -31968 -32583 -28441 -35225
4897 -35225 -43119 -35850 -22744 -26409 -18420 -9439 -12559 -2240 6144 7338 1966 -8661 -18391 -6924
4883 -6924 -2923 -20537 -24467 -22635 -20660 -19207 5653 10059 27194 36959 13964 4131 -1490 9863
4869 9863 14634 9509 5366 6792 -10541 -8984 -16524 -22644 -11204 -20030 -13572 -15843 -28173 -32833
4855 -32833 -18786 -3597 2974 1409 6342 -2420 -13611 -18130 -14765 -1998 14240 11984 7868
4842 7868 1544 4459 5774 1359 3745 8910 4064 471 -14685 -15071 -6446 -7509 3490 6183 4710
4827 4710 -8328 -22407 -16243 -28893 -33863 -22607 -9015 -6667 -14292 598 12039 -8571 -14256
4814 -14256 -13996 -9944 -14035 -30322 -21946 -4959 -7132 -2161 14673 6289 8150 4723 829 4812
4800 4812 -5470 -4897 15988 38908 34282 920 -19224 -16398 -5083 -1231 -8039 -22462 -20923
4787 -20923 -4176 26622 15157 -16780 -24653 -508 8023 10998 18398 3649 -9801 -12997 -4705
4774 -4705 -3999 10013 28066 20581 21135 20098 9309 18608 29322 39747 24595 25971 18808 679
4760 679 9229 20526 -6114 -19871 -40429 -29827 -9587 4551 3153 -6410 -10125 -132 -11657
4747 -11657 -8933 20633 18877 4297 9030 21855 17702 37079 53859 43048 16207 -1891 -14986
4734 -14986 -28573 -24638 -3470 -546 -13148 -11390 -25253 -31842 -19102 -5285 4319 10888 1758
4721 1758 -4577 643 14818 16501 14510 13321 -1164 7995 13932 21341 12876 12660 13089 6547 3909
4706 3909 11627 9647 -11604 -10119 -11944 -29529 -18539 -1154 154 11488 9624 10241 6081 -7209
4692 -7209 -2793 -16224 -18101 -4253 -10503 -12102 -15459 -24704 -21023 -7123 12020 10140 14491 8924
4678 8924 1545 -10890 -18642 -26203 -34546 -25222 -17779 -17522 -30015 -18396 4763 24145 14981 13514
4664 13514 14125 11136 -2588 5247 10133 5785 -11898 -6000 6675 7699 1439 12963 9646 -8361
4650 -8361 -18450 -3203 -10957 -14041 -5910 1068 -5797 4143 4115 587 -4481 -23597 -18866 -16876 -902
4635 -902 11340 298 -23163 -40006 -43378 -40189 -14959 12951 11074 -5166 -43353 -50844 -36350
4622 -36350 -13965 2621 3896 -7035 -12385 -13371 13168 34012 22547 8403 -2934 -22197 -27540
4609 -27540 -29119 -38715 -32259 -27786 -21501 -40263 -54500 -54249 -38196 -25015 -39812 -31684 -12268
4596 -12268 18610 32832 9754 1331 21787 9189 -6465 -18086 -27656 -4308 19448 11100
4584 11100 -3894 -13087 -1132 8048 2042 440 -5802 993 23 1513 -12129 -4948 2299 -6253
4570 -6253 -26886 -16939 -2702 -828 -17494 -36150 -34780 -13433 7790 -3739 -20625 -5465 7745
4557 7745 17602 24109 12366 -7357 -13778 -12450 -5741 -2195 10642 -2458 -2484 -20197 -15337 -3945
4543 -3945 490 3792 8927 -1902 -9976 -17837 -30286 -28574 -33730 -12237 -2368 1842 -1037 -12872
4529 -12872 -9861 -4158 -1672 9002 16067 2229 14679 23652 6567 -4126 -3084 9936 9171
4516 9171 2032 -10172 -19779 -16803 -7992 -5963 -15854 -11447 7788 23246 27386 17819 -7278 -10557
4502 -10557 -11074 -11214 -17830 5560 4920 -11138 -8944 -5584 933 6134 -8209 -29885 -18654 -8994
4488 -8994 -10809 -5830 -7990 -15348 -34683 -38894 -37952 -42993 -29451 -19350 459 756 -1971 -25885
4474 -25885 -35156 -43159 -11229 -12449 -21589 -23946 -34805 -32793 -53760 -53198 -31262 -34063 -36539 -47966
4460 -47966 -42889 -34613 -28073 -22118 -1740 11360 12957 8384 13180 16696 15423 4170 -1047 -16570
4446 -16570 -30426 -28970 -23291 -21952 -2527 27761 45088 38141 29760 11641 2885 -9649 -16548
4433 -16548 -25709 -21725 -11708 -10052 -9879 -1002 7291 1706 -19918 -29433 -28044 5732 18986 19066
4419 19066 20623 -2097 14461 31417 39532 36563 50244 43396 23999 3751 9982 14531 739
4406 739 -5967 10181 -472 -9832 -4875 -6248 2607 955 -1696 -4099 -13501 4593 11589 19105
4392 19105 16364 17370 14548 12362 34685 49799 11228 -3939 22181 29830 50815 51617 44101
4379 44101 32855 23140 26622 15592 3323 -10697 -19058 -4027 596 -13725 -12673 -6664 -14700
4366 -14700 -19954 -22371 -22986 -19290 -16545 -8343 -2354 -22323 -38269 -37522 -24048 -1146 -43 11115
4352 11115 6453 25273 38944 53698 42693 39336 4069 -14280 -15250 -7575 -4430 -19452 -36436
4339 -36436 -24895 -17765 -22180 -19097 4057 833 -4759 8844 19477 11362 12143 6722 2004 5085
4325 5085 -6743 -9064 -10827 -17011 -15669 -12423 7754 20784 15259 16420 15388 4152 -7191 -10932
4311 -10932 -29554 -44924 -41775 -38248 -9856 468 -13333 -21421 -21733 -15709 -141 -757 -24931
4298 -24931 -22539 -24680 -25678 -33858 -35327 -28174 -35760 -31865 -16909 -17001 -24212 -18152 -21420 2518 18095
4283 18095 2375 -8555 -13827 -36178 -39914 -20964 -2910 2346 -2172 3190 7293 180 4025
4270 4025 5119 4666 -11245 -28865 -41611 -37682 -24098 -590 -14245 -16433 -1339 -1722 -10480 -17147
4256 -17147 -29708 -23693 -23317 -30863 -20658 -7983 -3126 19875 23939 11161 -18396 -39401 -39185
4243 -39185 -17941 -31978 -18478 -9423 -8642 -4486 -2166 515 -8900 -8771 1990 13343 18019 18343
4229 18343 6825 336 -23991 -45746 -28540 -14595 4004 11999 17739 5986 16902 17506 -5072
4216 -5072 6579 27753 22402 25449 12467 7331 9903 13861 15655 17086 1545 -17182 -14252 -4572
4202 -4572 2232 -4138 -26994 -24862 -30233 -24501 179 7266 -3808 11933 6743 -14263 -1758
4189 -1758 19426 28014 8540 5930 21693 33327 10936 -13596 -1440 -17423 -39378 -37751 -18213
4176 -18213 10611 10471 17426 17854 -11464 -6928 -8230 -519 5072 12103 -1608 -19877 -26696 -25333
4162 -25333 -170 -7319 -9485 -13456 -18112 -28340 -32211 -35043 -32865 -38052 -26938 -16623 3471
4149 3471 4228 -8303 -9371 -2551 3527 -7385 2469 4380 15924 20903 17231 25446 18281 21938
4135 21938 35204 26444 12838 22557 15938 3204 21 11860 23291 25852 22234 2628 -13602
4122 -13602 -2305 7434 966 -2640 4672 9871 1304 -11945 -14160 -13663 -4358 -14105 -15765 -13425
4108 -13425 8970 36900 22712 -3071 8015 16627 16087 7968 15546 -5910 -23318 -4555 14584
4095 14584 2596 -3511 3542 5761 -5105 9326 20461 15529 8218 -320 -25088 -16146 10090
4082 10090 10487 -4579 -3204 4971 1934 230 -5096 -5749 -11081 -36869 -40338 -25234 -41358 -35670
4068 -35670 -33912 -48326 -57504 -55839 -40224 -13216 -5386 13202 9824 9672 -4586 -17090 -24182
4055 -24182 -30496 -14239 2119 9436 -2093 10192 3849 -3717 -9424 -3316 6982 20360 8449
4042 8449 11834 27401 12370 -1414 -28517 -24441 -3193 4705 11951 11125 20289 21823 6999 15668
4028 15668 1417 -15453 -3839 -3241 -11320 -5055 -5707 -803 -2478 18796 29276 33388 29220 2343
4014 2343 -8835 3298 -2196 -10307 -2895 -9802 2665 -5665 -32101 -16760 10291 4293 19115
4001 19115 38005 22755 16374 10888 7102 15958 22215 22789 16629 11747 6363 11916 27920 29123
3987 29123 13509 10379 5017 -12920 -20935 -32610 -34958 -30628 -24580 -23990 -12100 -3101 -529 -12854
3973 -12854 -4358 6009 22196 37596 30759 7713 -5558 4307 -10675 -28732 -28428 -35302 -37773
3960 -37773 -24762 -12210 -15082 -18718 -31493 -21170 -9527 8498 15883 13066 7731 -8776 -30672
3947 -30672 -22768 -16755 -3564 12197 4461 -5523 -981 17540 25985 21166 18246 10432 10990 12648
3933 12648 13844 23062 28663 19163 2136 -13017 -15942 -19796 -32224 -33522 -11053 -69 -7447
3920 -7447 -10127 -3793 -5320 -24858 -34716 -26796 -21337 -3905 -6514 -2061 -7495 -12124 -10998 -22280
3906 -22280 -36241 -30559 -11446 3745 -6427 -12933 12043 16768 140 -16308 -15005 -5199 -4139
3893 -4139 -3887 2907 11332 14967 24130 27000 19806 22212 9743 4906 -3265 -16342 -21337 -19173 -19177
3878 -19177 -11210 421 -1234 -10804 -15450 -13049 11068 -7304 -8276 2717 19008 9293 4610 12416
3864 12416 19795 11607 909 -16587 -24633 -33397 -33697 -5151 12832 19191 21086 16523 -1377 -11794
3850 -11794 3880 -6638 -15784 -19749 -3692 -4247 8639 25327 12231 3521 5945 1172 7480
3837 7480 -536 6118 12589 12448 -2742 -2025 16058 32353 30862 21795 32039 15360 -1136 -6931
3823 -6931 -17527 -13509 -19381 -28196 -27534 -22757 -24450 -28299 -14182 -22973 -31876 -29217 -29221 -39244 -8744
3808 -8744 -11862 -22973 -3875 4150 4685 -4754 -10114 -4977 2380 8637 13266 24020 21093 22178
3794 22178 13465 11109 22940 10793 -14370 -9061 4355 14385 21572 19208 -6155 -21825 -25482
3781 -25482 -10596 544 10513 21025 18889 12120 9806 2313 23125 16999 15600 -11049 -29914
3768 -29914 -36081 -42789 -28944 -7850 11120 3072 -13950 -7246 8161 -5258 -21005 -7002 4246
3755 4246 -2088 12447 12324 -19649 -26619 -17715 -20268 -23344 -13131 -3368 -8248 -5055 -13772 -12424
3741 -12424 -11072 -2958 1842 -6760 -20310 -11679 2275 7733 -1994 6057 4692 -8008 -24309 -17563
3727 -17563 3091 2143 -5226 -24217 -27772 -28607 -34236 -34374 -34825 -19740 -3821 13389 9873 -11785
3713 -11785 -24541 -19435 -11107 4719 -1561 18660 23812 17321 6343 -10812 -3346 -10165 -18988
3700 -18988 -18579 -1943 -402 -2223 7818 7199 5901 -1306 -529 -4731 -11456 1170 -5446 3939 -7620
3685 -7620 -1071 -7434 -2532 9430 11090 12494 -2483 -7161 -13826 -2806 -168 -3618 3207 1409
3671 1409 -11907 -8779 11253 18325 -8212 -11259 -13044 -2242 1378 -8768 8238 32465 35787
3658 35787 16132 9955 -1622 -20282 -5510 4645 -7825 120 10973 -1660 248 12345
3646 12345 9731 -12679 -16513 -3401 1513 4300 -1413 -3814 -9669 -2639 -18353 -24737 -26932 -21049
3632 -21049 -13765 -18010 -30200 -26737 -17632 -15838 -12346 -9428 -1408 -17905 -15026 -2255 -5962 -15270
3618 -15270 -18245 -17569 -25303 -36302 -17619 3589 2832 1812 32 -12171 -15103 -4262 -5837 -9956
3604 -9956 -977 -3020 1213 1946 4274 5097 -8136 3078 -6954 -29373 -9968 4360 12126 10440
3590 10440 13662 18566 19015 14545 -804 121 6188 17421 18396 12341 18880 -1972 3047 15418
3576 15418 -2043 -12014 -10750 -8655 -2663 1261 -1448 -12289 906 11052 16261 8212 -5064
3563 -5064 -5094 -5888 3372 -24065 -18634 -3786 82 82 8061 17324 15302 27002 19505 18742 10642 3945
3547 3945 7934 -10363 -35090 -40393 -25535 -6916 11372 5358 -3741 7918 7107 2299 12594
3534 12594 32757 30604 21095 18113 -1108 -6155 -8081 -10983 4027 -2022 -21982 -32311 -34540
3521 -34540 -22148 -17128 -16234 -12639 4262 -4595 -25430 -25104 -19482 -359 11448 -4293 -104 19427
3507 19427 23135 14051 15929 -12329 -17432 2181 7472 -5577 -18786 -22405 -23810 -28353 -12762
3494 -12762 1674 15930 4803 -7477 2216 7230 24010 30514 9802 -5599 -17839 -14904 -10013
3481 -10013 -3778 -19155 -13855 -14445 -9223 14277 10552 1649 -974 8179 11320 6539 4822 -9921
3467 -9921 -2418 9999 18945 10464 -15600 -22662 -23071 -21293 -3755 -566 11156 18662 22679 19016
3453 19016 -1446 -1411 -492 13929 -5122 5836 25186 12304 -2538 -6534 -8183 1683 9085 5600
3439 5600 -22884 -41224 -35993 -28817 -29266 -36448 -29101 -13319 -4147 4106 -4808 -13411 -20523 -12222
3425 -12222 2857 10623 9223 -8884 -15774 -13942 560 3108 13414 5824 4405 4594 -5169 3214
3411 3214 11217 10965 20365 16127 18333 17651 11955 -5720 -5169 -11187 -1807 7669 -10132 -10653 -8107
3396 -8107 -2869 5980 -4109 -6073 -1167 8990 3838 13054 25613 5819 5128 18199 14548 6277
3382 6277 -5772 -12615 3648 23464 19920 1633 -9134 -27301 -24936 -13163 -6290 -27593 -27881
3369 -27881 -20401 7275 6701 -10167 5577 19521 18426 9028 -11524 -20007 1222 19234 26039
3356 26039 41444 22631 10598 8043 11380 7605 -2359 2810 5401 6255 3130 -836 -2485 2845
3342 2845 640 5421 18920 24379 24668 8700 2301 -154 -6057 -18796 -18095 -7922 6636 4249
3328 4249 -5844 -21699 -42423 -30092 -11295 -1115 -35 -8873 -13563 1891 -12152 -22158 -5763
3315 -5763 -15458 -33248 -39104 -29994 -11809 10415 12583 3610 13729 20349 26617 20862 21641 21493
3301 21493 8439 -1092 -14917 -24546 -36848 -43904 -31467 -27919 -21004 -6608 12632 -5013 -23008
3288 -23008 -21832 -21100 -14708 18672 22326 10602 -10248 -12925 -7961 -871 7441 -957 806 15532
3274 15532 23370 30910 18908 -5960 -17231 2534 13426 6759 -10654 -15096 -28376 -12793 -5610
3261 -5610 -16181 -21269 -11706 -20684 -25820 -38603 -15838 10932 5473 -5291 -23702 -22029 -13663
3248 -13663 -8959 -7891 5450 17169 554 160 5482 -22100 -42942 -34440 -33408 -49377 -36323
3235 -36323 -24599 -10009 8619 7205 12498 19898 10010 13461 16051 12389 13637 24034 10884
3222 10884 9552 10448 -1642 16087 21956 30572 28065 15254 -1336 -4006 6479 -659 7674 2721
3208 2721 2374 -1881 15310 5759 5078 15903 3306 4001 1580 5575 17028 15153 969 -335
3194 -335 19322 22837 4433 -10018 -11406 -19311 -22073 -7627 2409 -17 -11883 -11408 -20822 -29428
3180 -29428 -21522 -8817 -21749 -22047 -19628 -714 2903 9293 2460 6352 15213 2800 2395 8123
3166 8123 23129 29948 34217 21648 -3452 -17367 -14409 1425 6087 -5233 -2888 1340 594 -12392
3152 -12392 -14203 -3913 -497 4095 11505 -5545 -18776 -273 15406 14261 5956 -12493 -30093
3139 -30093 -39035 -25246 -7094 9275 1548 1768 481 -11989 -11697 -5568 -8877 -21991 -31325 -34702
3125 -34702 -23701 -5672 -716 2411 -2869 -10278 -17778 -17063 -21867 -4621 -12585 -16562 5794 13647
3111 13647 23762 14380 8785 -10215 -10995 -5132 -18270 -1687 6786 20164 26899 8587 -645
3098 -645 -8119 -21102 -24645 -25605 -23527 -23712 -5842 18766 36093 38145 42548 27590 -4534 -13409
3084 -13409 -17202 -287 10217 9439 8141 7500 -18019 -25606 -14438 -13844 -21168 -21512 -2505 14495
3070 14495 10886 6193 12615 7344 -8976 -5846 -11154 -26192 -24379 -11464 18914 30079 19382
3057 19382 3261 -19427 -25616 -19356 -8676 -23896 -10899 10673 23299 19861 13144 4436 -17473
3044 -17473 -25329 -1895 17809 17682 13456 -5410 -5524 -23970 -19253 -10684 11390 -6687 -11892 -3275
3030 -3275 -15900 -3266 -2908 -9181 7478 13621 5966 10717 3036 -171 -7999 -10084 -4784 -4152 7944
3015 7944 29839 21189 840 -7394 2090 3114 -2957 -18666 -35412 -26862 -3410 1329 -14989
3002 -14989 -2699 -9349 -20266 -26394 -12592 7147 37873 47176 39079 33838 22556 32310 42792
2989 42792 47169 47423 25646 13528 5564 -3392 -2702 -2244 1339 11954 19811 14317 25753 38767
2975 38767 32926 25493 22816 23459 25732 13829 15496 27408 24313 29206 19008 -1106 -11936 -10114
2961 -10114 4126 -2396 -9541 15287 19669 -5370 -26703 -32380 -21771 -27720 -23744 -17065 -4866
2948 -4866 -3126 -2755 8590 4147 10229 7023 1676 12919 32592 27121 26830 20623 9272 14012
2934 14012 18414 5305 470 15458 4834 -19278 -20312 -12914 -1982 6776 5788 5487 -291 -7016
2920 -7016 -12141 -19245 -2057 1770 -20399 -33033 -25515 -8267 -10219 -2040 -11263 -21755 -2579
2907 -2579 18132 16054 2442 -10757 -15936 -9073 11960 31365 28574 18031 5705 -10188 619
2894 619 3205 15577 14507 17594 17763 1689 13168 16754 -10276 -10447 4415 9551 7018 240
2880 240 -5343 -7461 -10791 -5034 6848 23241 18354 -10412 -22908 -13784 5814 7473 639 -5058
2866 -5058 -14706 14874 18195 -1343 -1169 -656 25889 21800 16871 21035 16027 14538 1700 -1029
2852 -1029 -15787 -11220 -1335 2335 4486 16804 13631 9010 -10728 -6706 961 -2791 11905 -574
2838 -574 1943 11329 2618 -4273 3674 4973 26727 32403 6938 4076 -13494 -15718 -2257 12037
2824 12037 15072 -4703 -4156 -16287 -7753 9387 4703 -9803 -10152 -4067 -16868 -18782 -5373 6025
2810 6025 -7926 -13592 -4409 -7400 805 2913 11844 25031 16142 19568 5670 218 -31268 -37824
2796 -37824 -15283 -14948 -17002 -6579 6781 -15018 -4228 9401 28745 45855 19587 19495 38433
2783 38433 20707 13347 4485 204 -9794 1255 -676 4320 10259 1660 -18992 -31689 -31386 -4831
2769 -4831 -7141 -14224 -20299 -15103 5211 1171 -12472 -14511 2248 19618 8451 8370 8238 -6610
2755 -6610 -12039 16 -1797 -2602 12349 23124 9320 -10488 -29563 -31120 -31077 -40215 -26185 -40465
2741 -40465 -22550 -3842 -14562 -34313 -35713 -25433 -10432 -4269 -5726 2713 19094 16106 12786
2728 12786 -9018 -7071 11957 2595 -10025 14730 21489 15929 23120 18778 25293 15692 2183
2715 2183 4926 15060 9106 -3926 -12866 -7174 -1535 5830 394 13671 8244 -12208 -16588 -24671
2701 -24671 -10798 -4802 -752 -868 -4460 -15480 -13236 -12076 -23430 -22438 -7581 -12500 -41015 -45012
2687 -45012 -23122 -2804 -5744 817 1399 3675 -296 21098 19459 21280 29650 24705 17556 -7746
2673 -7746 -22236 -6920 2394 -8837 -4820 15554 22435 21376 14167 18747 -5778 -13067 3832
2660 3832 21815 23019 29572 20583 8750 19241 22754 25293 5187 -8482 -19952 -20609 -9757
2647 -9757 5578 7579 10600 -6242 -19345 -1380 29629 37355 8576 -18450 -17395 -6520 -9596
2634 -9596 -32161 -34680 -11896 -1258 -19363 -29782 -24084 -3978 -4611 -12598 -10732 -4878 4454 891
2620 891 14633 2964 3168 -21751 -27042 -17686 -20280 -15575 -25283 -12041 -6466 -5119 21423 17462
2606 17462 16397 32821 30463 23504 12863 8723 14609 -3751 -8747 -5999 -9950 1780 14006
2593 14006 10539 4821 -446 -7999 -12058 -17647 -2541 2241 -8389 -16793 -28898 -31675 -27663 -18609
2579 -18609 -16122 -22158 -24477 -21976 -2280 15229 18352 14073 5708 13313 20565 16046 5110 -4491
2565 -4491 1767 758 3678 -7867 57 27529 10878 -12905 -32579 -37493 -33429 -14553 6408
2552 6408 2897 -17284 -7582 3011 5934 -1266 -18896 -23997 -20330 -31319 -29592 -10560 -4632 -5534
2538 -5534 5147 -15312 -16333 2626 -507 -6694 -10188 -3699 17708 27923 17859 -7023 3422
2525 3422 14179 10850 19277 33706 30059 9851 -5772 12941 -1706 -16534 -9068 -4995 -20166
2512 -20166 -10292 17839 12639 -1285 -13368 711 17495 13228 10090 140 -4886 -13827 -18694
2499 -18694 -11665 -2498 -3185 -7696 -9130 17031 22518 2229 -6320 -11286 -3814 16237 20890 26575
2485 26575 497 -15781 -7551 21307 4696 3676 -7978 20771 15064 -8521 -22652 -28323 -25623
2472 -25623 -16805 -16473 -13716 -14033 8997 26529 12873 -14806 -18377 -735 -9570 -19441 -14651 -5573
2458 -5573 5052 -4608 -9025 -20171 -27825 -20951 -19114 -9541 -4024 -11932 -17619 1463 21355 -694
2444 -694 -13444 266 489 485 6798 11457 16567 33426 49797 32280 1797 -6079 -6323 6272 -3412
2429 -3412 -15939 -6157 1509 -1600 -10410 2166 4572 863 4854 -9052 -18674 -25377 -23810 -7528
2415 -7528 -6318 -556 7420 17236 16395 4092 -4468 30466 40496 38998 30777 33199 21714 8580
2401 8580 10085 322 11549 34449 30047 15885 23400 23564 -2776 -13227 -12749 10516 8882 12814
2387 12814 22474 18360 20845 31853 24451 25591 24837 20693 6923 11419 -3743 -5787 10247 15053
2373 15053 6337 7067 20253 31793 30144 25991 22219 4357 -9850 -23572 -1872 3112 4422
2360 4422 21420 8051 -4770 3771 -3146 -8324 -16926 -12663 -844 20628 36502 35184 36936
2347 36936 14300 -8161 -5041 19152 33130 8156 -2748 -4104 3411 15435 23930 26027 13449
2334 13449 16892 14291 2060 14494 17595 -7595 -17358 -5459 -4099 1960 19482 23692 35394
2321 35394 38700 39989 29238 -2669 -24263 -26777 -9119 46 10538 9947 -2503 -3725 -9697
2308 -9697 -19595 -21107 -20018 -15005 -13110 -15994 -39628 -46314 -37672 -45460 -36523 -18734 -24368 -8328
2294 -8328 -4895 -14086 -28603 -22302 -18265 -13560 17096 24498 7749 1763 3634 -20541 -19217 -9206
2280 -9206 8103 6741 -12302 -10224 -6834 12360 24726 17215 13424 9721 -10515 -4828 17339
2267 17339 25516 8415 -22254 -20625 622 19904 8818 -3135 -1368 -8774 -7372 -3170 -9966
2254 -9966 -8107 -3698 -11663 -11589 -29515 -42292 -35962 -19037 -1191 8322 11634 11109 27918 40246
2240 40246 10433 -8297 15884 27358 13260 -2453 -12662 -13591 -21628 -32567 -25267 -8039 13541
2227 13541 22946 20310 18679 29245 26709 18494 17807 6634 2590 9467 19596 24221 -227 -12586
2213 -12586 -22199 -29048 -10428 -14218 827 17733 3936 -12152 -4099 18080 9610 9958 11320
2200 11320 4722 -14047 -16000 -408 13649 8163 21242 22126 29132 38718 42375 33026 29336 453
2186 453 -26171 -12361 -6712 -18264 -18027 -5641 10821 -1261 1144 5148 8930 10959 2064 -6964
2172 -6964 -12077 -28500 -14741 5444 -861 -8309 -14953 -5063 12500 14842 -11719 -22578 -5869
2159 -5869 22227 29620 27989 39735 32454 9091 16492 17203 11277 16142 23801 12233 11406 8093
2145 8093 3422 8635 3125 -3204 7307 3074 -6490 -19219 -21891 -299 -4763 -2870 5396 11359
2131 11359 -7686 -29683 -15217 -11516 -11000 8166 25592 13473 355 -1105 13536 1721 -3260
2118 -3260 -13858 -16578 -1881 15676 3940 -4592 7051 22446 27997 18576 20141 14682 16745
2105 16745 4184 -4121 -25032 -41626 -44629 -32884 -27223 -10754 -5871 10605 32556 32886 36198
2092 36198 17897 20597 31601 29848 8179 -9307 -11103 -12006 -13287 -4623 16904 13319 10329 19750
2078 19750 40742 40367 30980 22723 27711 29830 3105 -6501 3022 2343 -2723 -2788 3183 -3914 -20751
2063 -20751 -14527 27 6068 13580 12891 22392 29311 24326 27906 26372 26002 19160 -2116 -14230
2049 -14230 -7185 4368 -4352 -2400 12447 18072 27776 10759 13860 22631 15269 13934 -2988 -20281
2035 -20281 -10808 -8095 -8183 3171 8785 7579 17632 35751 23867 16117 6479 3592 2144 3831
2021 3831 -3080 -6171 1273 14516 15158 -717 -2313 -7844 -10598 -10720 -405 5579 -616 9404
2007 9404 8023 9271 5810 -9600 -4171 -9928 -20392 -18025 5209 21313 16711 9062 19673 14486
1993 14486 14975 15168 10680 927 -13794 -22221 -9804 -2802 -6043 715 19386 26415 16368 9614
1979 9614 7239 -3883 -10950 -4950 1788 17068 31355 40128 36430 31296 25730 14387 -5458 -18853
1965 -18853 -15842 5177 25283 21749 14368 17096 19606 10441 2532 -12143 2078 17466 22972
1952 22972 1466 1117 16466 2699 6776 5345 8113 -6243 -12206 -23293 -13282 -11608 -10225
1939 -10225 -8896 10746 8490 -338 -411 8899 11760 10446 14015 -173 6999 9977 22525 29671
1925 29671 30934 17253 1875 -21777 -45671 -47308 -51820 -49108 -35894 -13674 -4209 -15538 -6578
1912 -6578 -10918 -12091 -18981 -20661 -30567 -32035 -16132 -6639 -4869 -11492 -19751 -7963 1082 9575
1898 9575 9071 21044 16062 4176 -1641 -1957 22018 19716 17520 16450 17198 28260 19028 12411 3287
1883 3287 -17304 -23198 -24410 -26158 -25985 -28860 -29055 -15349 -2545 9475 4757 -3189 6199 10044
$$ [...]
##END NTUPLES=NMR SPECTRUM
##END=
