##TITLE=Analysis number 328276
Compound Code cc 60514
Book Reference 494/168
Project Code adrs
Chemist Name craigr
##JCAMPDX= 6.0         $$ Bruker NMR JCAMP-DX V2.0
##DATA TYPE= NMR SPECTRUM
##DATA CLASS= NTUPLES
##ORIGIN= Bruker BioSpin GmbH
##OWNER= nmr
$$ XWIN-NMR		Version 3.5
$$ Mon May 21 09:24:00 2007 GMT Daylight Time (UT+1h)  MAYBRIDGE\nmr@NMR_250MHZ
##.OBSERVE FREQUENCY= 250.131544655141
##.OBSERVE NUCLEUS= ^1H
##.ACQUISITION MODE= SIMULTANEOUS (DQD)
##.ACQUISITION SCHEME= undefined
##.AVERAGES= 16
##.DIGITISER RES= 18
##SPECTROMETER/DATA SYSTEM= dpx250
##.PULSE SEQUENCE= zg30
##.SOLVENT NAME= CDCl3
##.SHIFT REFERENCE= (INTERNAL, CDCl3, 0, 16.522)
##AUDIT TRAIL= $$ (NUMBER, WHEN, WHO, WHERE, WHAT)
$$ ##TITLE= Audit trail, XWIN-NMR		Version 3.5
$$ ##JCAMPDX= 5.01
$$ ##ORIGIN= Bruker BioSpin GmbH
$$ ##OWNER= nmr
$$ C:\u/data/dgb/nmr/ADRS/1270/pdata/1/auditp.txt
$$ ##AUDIT TRAIL=  $$ (NUMBER, WHEN, WHO, WHERE, WHAT)
(   1,<2007-05-21 09:23:33.92 +100>,<MAYBRIDGE\nmr>,<NMR_250MHZ>,
      <created by zg, POWCHK disabled, PULCHK disabled
       configuration hash MD5:
       76 6E 9A 78 1E 09 19 81 EC 84 63 8F B0 6A 59 2D
       data hash MD5: 64K
       A5 75 64 D6 92 78 25 16 65 AC C1 F0 00 B4 E1 CA>)
(   2,<2007-05-21 09:23:50.04 +100>,<MAYBRIDGE\nmr>,<NMR_250MHZ>,
      <Start of raw data processing
       ef LB = 0.3 FT_mod = 6 PKNL = 1 SI = 32K 
       data hash MD5: 32K
       95 82 04 0A 61 90 86 31 D3 C9 0B 0F 13 6F 94 57>)
(   3,<2007-05-21 09:23:51.72 +100>,<MAYBRIDGE\nmr>,<NMR_250MHZ>,
      <apk 
       data hash MD5: 32K
       EF 29 A7 3B 4C 15 64 DF 39 50 71 53 9E AB 0A 0E>)
(   4,<2007-05-21 09:23:52.39 +100>,<MAYBRIDGE\nmr>,<NMR_250MHZ>,
      <abs ABSG = 5 
       data hash MD5: 32K
       29 F6 0A D5 C8 D3 61 E2 2C 6C AF 71 16 BE 9E BA>)
$$ ##END=
$$ 
$$ hash MD5
$$ 51 37 A4 DD 7B 49 C0 B8 B1 20 3E F6 F7 AB D6 93
##$RELAX= 
##$RELAX= 
##$RELAX= 
##$RELAX= 
##$RELAX= 
##$RELAX= 
##$RELAX= 
$$ Bruker specific parameters
$$ --------------------------
##$DU= <C:\u>
##$EXPNO= 1270
##$NAME= <ADRS>
##$PROCNO= 1
##$TYPE= <nmr>
##$USER= <dgb>
##$AMP= (0..31)
100 100 100 100 100 100 100 100 100 100 100 100 100 100 100 100 100 100 
100 100 100 100 100 100 100 100 100 100 100 100 100 100 
##$AQSEQ= 0
##$AQ_mod= 3
##$AUNM= <au_zg>
##$AUTOPOS= <4 >
##$BF1= 250.13
##$BF2= 250.13
##$BF3= 250.13
##$BF4= 250.13
##$BF5= 500.13
##$BF6= 500.13
##$BF7= 500.13
##$BF8= 500.13
##$BYTORDA= 1
##$CFDGTYP= 0
##$CFRGTYP= 5
##$CHEMSTR= <none>
##$CNST= (0..31)
1 1 145 1 1 1 1 1 1 1 1 1 1 1 1 1 1 1 1 1 1 1 1 1 1 1 1 1 1 1 1 1 
##$CPDPRG= <>
##$CPDPRG1= <>
##$CPDPRG2= <>
##$CPDPRG3= <>
##$CPDPRG4= <mlev>
##$CPDPRG5= <mlev>
##$CPDPRG6= <mlev>
##$CPDPRG7= <mlev>
##$CPDPRG8= <mlev>
##$CPDPRGB= <>
##$CPDPRGT= <>
##$D= (0..31)
0 1 0 0 0 0 0 0 0 0.06 0 0 0 0 0 0 0.0002 0 0 0 0 0 0 0 0 0 0 0 0 0 0 
0 
##$DATE= 1179735812
##$DBL= (0..7)
120 120 120 120 120 120 120 120 
##$DBP= (0..7)
150 150 150 150 150 150 150 150 
##$DBP07= 0
##$DBPNAM0= <>
##$DBPNAM1= <>
$$ [...]
##$SUBNAM7= <"">
##$SUBNAM8= <"">
##$SUBNAM9= <"">
##$SW= 20.6930455092707
##$SWIBOX= (0..15)
0 0 3 0 0 0 0 0 0 0 0 0 0 0 0 0 
##$SW_h= 5175.983436853
##$TD= 65536
##$TD0= 1
##$TE= 683.16
##$TE2= 300
##$TE3= 300
##$TEG= 300
##$TL= (0..7)
0 120 120 120 120 120 120 120 
##$TP= (0..7)
150 150 150 150 150 150 150 150 
##$TP07= 0
##$TPNAME0= <>
##$TPNAME1= <>
##$TPNAME2= <>
##$TPNAME3= <>
##$TPNAME4= <>
##$TPNAME5= <>
##$TPNAME6= <>
##$TPNAME7= <>
##$TPOAL= (0..7)
0.5 0.5 0.5 0.5 0.5 0.5 0.5 0.5 
##$TPOFFS= (0..7)
0 0 0 0 0 0 0 0 
##$TUNHIN= 0
##$TUNHOUT= 0
##$TUNXOUT= 0
##$USERA1= <user>
##$USERA2= <user>
##$USERA3= <user>
##$USERA4= <user>
##$USERA5= <user>
##$V9= 5
##$VALIST= <valist>
##$VCLIST= <CCCCCCCCCCCCCCC>
##$VD= 0
##$VDLIST= <DDDDDDDDDDDDDDD>
##$VPLIST= <PPPPPPPPPPPPPPP>
##$VTLIST= <TTTTTTTTTTTTTTT>
##$WBST= 1024
##$WBSW= 4
##$XGAIN= (0..3)
0 0 0 0 
##$XL= 0
##$YL= 0
##$YMAX_a= 407220
##$YMIN_a= -274149
##$ZGOPTNS= <>
##$ZL1= 120
##$ZL2= 120
##$ZL3= 120
##$ZL4= 120
##$ABSF1= 16.522
##$ABSF2= -4.171173
##$ABSG= 5
##$ABSL= 3
##$ALPHA= 0
##$AQORDER= 0
##$ASSFAC= 0
##$ASSFACI= 0
##$ASSFACX= 0
##$ASSWID= 0
##$AUNMP= <proc_1d>
##$AZFE= 0.1
##$AZFW= 0.1
##$BCFW= 0
##$BC_mod= 0
##$BYTORDP= 0
##$COROFFS= 0
##$CY= 12.5
##$DATMOD= 1
##$DC= 0
##$DFILT= <>
##$DTYPP= 0
##$F1P= 14.0000005364418
##$F2P= -0.99999901652339
##$FCOR= 0.5
##$FTSIZE= 32768
##$FT_mod= 6
##$GAMMA= 0
##$GB= 0
##$INTBC= 1
##$INTSCL= 1
##$ISEN= 128
##$LB= 0.3
##$LEV0= 0
##$LPBIN= 0
##$MAXI= 10000
##$MC2= 0
##$MEAN= 0
##$ME_mod= 0
##$MI= 0
##$NCOEF= 0
##$NC_proc= -3
##$NLEV= 6
##$NOISF1= 0
##$NOISF2= 0
##$NSP= 0
##$NTH_PI= 0
##$NZP= 0
##$OFFSET= 16.522
##$PC= 1
##$PHC0= -52.5299
##$PHC1= -1.01448
##$PH_mod= 1
##$PKNL= yes
##$PPARMOD= 0
##$PSCAL= 4
##$PSIGN= 0
##$REVERSE= no
##$SF= 250.13
##$SI= 32768
##$SIGF1= 0
##$SIGF2= 0
##$SINO= 400
##$SIOLD= 32768
##$SREGLST= <1H.CDCl3>
##$SSB= 0
##$STSI= 32768
##$STSR= 0
##$SW_p= 5175.98343685301
##$SYMM= 0
##$S_DEV= 0
##$TDeff= 65536
##$TDoff= 0
##$TI= <Analysis number 999999
Compound Code 99
Book Reference 9
Project Code 9>
##$TILT= no
##$TM1= 0
##$TM2= 0
##$TOPLEV= 0
##$USERP1= <user>
##$USERP2= <user>
##$USERP3= <user>
##$USERP4= <user>
##$USERP5= <user>
##$WDW= 1
##$XDIM= 32768
##$YMAX_p= 474266781
##$YMIN_p= -66194
$$ End of Bruker specific parameters
$$ ---------------------------------
##NTUPLES= NMR SPECTRUM
##VAR_NAME=  FREQUENCY,     SPECTRUM/REAL,   SPECTRUM/IMAG
##SYMBOL=    X,             R,               I
##VAR_TYPE=  INDEPENDENT,   DEPENDENT,       DEPENDENT
##VAR_FORM=  AFFN,          ASDF,            ASDF
##VAR_DIM=   32768,         32768,           32768
##UNITS=     HZ,            ARBITRARY UNITS, ARBITRARY UNITS
##FACTOR=    0.157963299565203, 1,           1
##FIRST=     4132.6476996994, 0,             0
##LAST=      -1043.33573715361, 0,           0
##MIN=       -1043.33573715361, -66194,      0
##MAX=       4132.6476996994, 474266781,     0
$$ Real data points
##PAGE= N=1
##DATA TABLE= (X++(R..R)), XYDATA
$$ [...]
18595E85521n1572o9249n1925k9728j8373J354L4492N3486M6423L2029N7761P8100
18583F68319P9137p006o0542q3415q3814n9329p521P866J7058L8452O0453P8675
18571F48333O9015Q373p9057q6371o3183l8743j4436k755k1056K335K866J5402
18559D40723Q021k092M951j2495j5775O072J9860L5773L9630K8340L4980J7745
18547F05733J9891l0246m3328k3626n241J2796J8237N771m751k6272k2546k2180
18535D84238k3684k367n867r969j2256O623m384J6867J9209P541J8417O202m765
18522D95805j777K7285L5697M3836M5089O1613O1246N4180M2148L9306O3314P9225
18510A046967Q8278R6680R6215Q7221J09862J20596J05762P1930K5589J0121M3489
$$ plain form
18595 585521 533949 464700 412775 383047 364674 366028 400520 454006 500429 532458 590219 668319
18583 668319 747456 740450 679908 596493 512679 453350 445829 453695 470753 509205 569658 648333
18571 648333 717348 725721 646664 560293 497110 458367 443931 441176 420120 422455 425321 440723
18559 440723 448744 446652 451603 439108 423333 429405 449265 485038 524668 553008 587988 605733
18547 605733 625624 595378 552050 528424 523183 535979 554216 559987 555236 528964 506418 484238
18535 484238 460554 458187 452320 442351 430095 436718 432334 449201 468410 475951 494368 500570 495805
18522 495805 494028 521313 557010 600846 645935 707548 768794 822974 865122 904428 967742 1046967
18510 1046967 1135245 1231925 1328140 1415361 1525223 1645819 1751581 1823511 1849100 1859221 1902710
18499A902710R7918J70450K10318K19867K40094K92342L44901L39439K78118K51526
18489D347683L10346M39438O94826J033036J446439K010155K809249L995325N723432
18480B2809929Q294414J1747340J3727269Q980719j918681j0638824j1949803
18473D1052363q424969m550600j523885J014834L592643O735035J0611975J2755448
18465F1262844P991697l122873j2140531j3699455j0454853p003678m667252l158863
18457A5007036k150702j468076r87249p10266o49812o82650p09238o90154o89393
18448F269496o42717n29302l91910k66711j48963q0740j48148l02463m04883l62309
18438B991350k95071k16585j64170j47681j26323q8798o8442q5326j03110j34307
$$ plain form
18499 1902710 2000628 2171078 2381396 2601263 2841357 3133699 3478600 3818039 4096157 4347683
18489 4347683 4658029 5097467 5792293 6825329 8271768 10281923 13091172 17086497 22809929
18480 22809929 31104343 42851683 56578952 65559671 63640990 53002166 41052363
18473 41052363 32627394 28076794 26552909 27567743 31160386 37895421 48507396 61262844
18465 61262844 69254541 66131668 53991137 40291682 29836829 22833151 18165899 15007036
18457 15007036 12856334 11388258 10401009 9690743 9040931 8358281 7649043 6958889 6269496
18448 6269496 5626779 5097477 4705567 4438856 4289893 4209153 4061005 3758542 3353659 2991350
18438 2991350 2696279 2479694 2315524 2167843 2041520 1952722 1884280 1798954 1695844 1561537
18428A561537j36234j08755p6374o5388m9390n2711p4769o6445n4929n3921o0422
18417G62199p1250n0653k7854l2444k6393j8856j0786j8998k9425k5296j5744
18406D34500j6647k0201k6898q126j1719l0420l2668m930m577j4181j1969N229
18394B57393j4547p761k611r417q463j294J6060k087j0033P3M594j4999p367J0919
18380B10460J4027P768r978j6297j3635j5980q343M775o20m94j0307r238o67p341
18366A44130j500J349n915p50m056N352R01p27p563n353m262J5303J4396O585
18352A57890j2940o029j1415R006M196J8846J2935l559n71N211J6300K680m740
18339A87810q677J5350J2911J3245J3199J5178k0785j3154K6238K2628j808O51
$$ plain form
18428 1561537 1425303 1316548 1240174 1174786 1125396 1072685 997916 931471 876542 822621 762199
18417 762199 690949 640296 612442 579998 553605 534749 523963 504965 475540 450244 434500
18406 434500 417853 397652 370754 362628 350909 320489 287821 282891 278314 264133 252164 257393
18394 257393 242846 235085 232474 223057 214594 213300 229360 227273 217240 217313 221907 206908 199541 210460
18380 210460 224487 232255 222277 205980 192345 176365 168022 172797 172177 171683 161376 152138 151471 144130
18366 144130 142630 143979 138064 137314 133258 138610 139511 138784 131221 125868 121606 136909 151305 157890
18352 157890 144950 138921 127506 136512 140708 159554 172489 168930 168359 173570 189870 192550 187810
18339 187810 179133 194483 207394 220639 233838 249016 228231 215077 241315 263943 262135 262786
18327B62786m733k0974l1981j4584j386K171K911k434l05o51j0339j1837k523
18314A66121K529R449n09J656J4120l454n265J338j2332K387k3756p497k233n554
18300A37000Q865r81k016n432l61o616j959l369j898J1249J1357j1399Q959K2394
18286A65793j1831q078O394k768j2584N701j0435l706J0250K021J107K373j0916
18273A33321k416j938p383K11P859k978j0103l503O398J3694K4048J1922P054
18260A76186K9843K3997K9634L6499N3721N6447M3233K1670j7260m9443m9304
18249C55223m5406k2989k8738l429K1442K0014M4217N2880O7174N8133K5207j6127
18237E27601n9346p7492m7640m5665l4676k7840j0670k332J904m211M852k076
$$ plain form
18327 262786 258053 237079 205098 190514 189128 191299 194210 191776 191471 190820 180481 168644 166121
18314 166121 168650 178099 177590 179246 193366 189912 184647 185985 173653 176040 152284 144787 142554 137000
18300 137000 145865 144884 142868 137436 137075 130459 128500 125131 123233 134482 145839 134440 143399 165793
18286 165793 153962 145884 152278 149510 136926 142627 132192 128486 138736 140757 141864 144237 133321
18273 133321 130905 128967 121584 121795 129654 126676 116573 113070 119468 133162 157210 169132 176186
18260 176186 206029 230026 259660 296159 349880 406327 449560 471230 453970 404527 355223
18249 355223 309817 286828 258090 254661 276103 296117 340334 393214 460388 518521 543728 527601
18237 527601 468255 390763 343123 297458 262782 234942 224272 221940 223844 219633 224485 222409
18225B22409j7082j3288j194J458P853J3932K1274L8120K5716J6017J1207K1403
18213C47825K373k3190k7700k1354j6886j1134K3349P717J0224J2015m522m529
18201B94188P37k188j286l167L011J4564J2012k097o203l1937j9482J154Q98N437
18187B65641Q726J3113K3298J7890J5508J0683p596q430k827j4842J183q575j6165
18174B97607K017R227J3285J9129K8727J8991L340l149j7039j0139L0081L9342
18162D31419N7714O4187O0459O0468M3921r337m3573m1554k7796k8800j5073k0470
18150E31565j6205q057k771K071K0633K6398K066J7537K2602K7548L0719J7785
18138F71891J6417J1222P419K7866K3951J3623J2169J6110J7818L2647N9882O7977
$$ plain form
18225 222409 205327 192039 190845 192303 200156 214088 235362 273482 299198 315215 326422 347825
18213 347825 350198 327008 299308 277954 261068 249934 273283 281000 291224 303239 298717 294188
18201 294188 294925 292737 291451 288284 291295 305859 317871 315774 309571 277634 258152 259306 260204 265641
18187 265641 274367 287480 310778 328668 344176 354859 347263 338833 336006 321164 322347 313772 297607
18174 297607 299624 308851 322136 341265 369992 388983 392323 389174 372135 361996 392077 431419
18162 431419 489133 553320 613779 674247 718168 708831 665258 623704 595908 567108 552035 531565
18150 531565 515360 507303 504532 506603 527236 553634 555700 573237 595839 623387 654106 671891
18138 671891 688308 699530 706949 734815 758766 772389 784558 800668 818486 851133 911015 978992
18126I78992Q7531O8641L2930R398J8358L4845P9500J28947J97282K74987L84826
18115B296237N28010P67569J130548J676768K583482M476589P623238O718819
18107B7801260j061267o925911o565564l100789j038376K47501J454483K951327
18099A3762664M293286M091127K985909J48372l584820n528275m542315k746395
18091H879553j643612j056848p06674m60209l07326j85416n0507R2668K90787
18082D852416N75237J015751J279332N53676p52730j478009j283493q24100n20086
18073C417994l28306j63102n7301l411K6729J3338J9601O9594J38410K86274M97775
18062C917595P93066J310458J944020J618486J13802r62669p34646K37124J259493
$$ plain form
18126 978992 1066523 1135164 1168094 1177492 1195850 1230695 1310195 1439142 1636424 1911411 2296237
18115 2296237 2824247 3591816 4722364 6399132 8982614 13459203 21082441 27801260
18107 27801260 26739993 19814082 13248518 10147729 9109353 9356854 10811337 13762664
18099 13762664 18055950 22147077 25132986 25281358 21696538 16168263 11625948 8879553
18091 8879553 7235941 6179093 5472419 5012210 4704884 4519468 4468961 4561629 4852416
18082 4852416 5427653 6443404 7722736 8276412 7523682 6045673 4762180 3938080 3417994
18073 3417994 3089688 2926586 2869285 2865874 2892603 2905941 2925542 2995136 3133546 3419820 3917595
18062 3917595 4710661 6021119 7965139 9583625 9697427 8734758 8000112 8237236 9496729
18053I496729K503861M031131M655374L880654L437832J665812j981602m008293
18045B3681498k270807J425231M544024M041576O68792k610056m604371m961857
18037A9914030l680636j482010L3213j69176j607858k541789k233949j445325
18029F786500r32779o45433m99549m25490l25923k34442j22782p3862o4735r7786
18019C363719j50096j52843j13102j5450J31165K46176L95322O27856R97979J624845
18009F955571K336229J656235n62251k111279j931817j067270m10920K6730L38631
18000E229859P07420J168081J768385K742046M581107O688229N259074P09583
17992B8853784k370363l753757m839470n040531l662389k246647j399604q96823
$$ plain form
18053 9496729 12000590 16031721 20687095 24567749 28005581 29671393 27689791 23681498
18045 23681498 21410691 22835922 27379946 31421522 32090314 29480258 24875887 19914030
18037 19914030 16233394 14751384 14784597 14615421 13007563 10465774 8231825 6786500
18029 6786500 5853721 5208288 4708739 4283249 3957326 3722884 3600102 3526240 3461505 3363719
18019 3363719 3213623 3060780 2947678 2932228 3063393 3309569 3704891 4332747 5330726 6955571
18009 6955571 9291800 10948035 10385784 8274505 6342688 5275418 4864498 4891228 5229859
18000 5229859 5937279 7105360 8873745 11615791 16196898 22885127 28144201 28853784
17992 28853784 26483421 22729664 17890194 12849663 9187274 6940627 5541023 4644200
17984D644200o05987m05559k73820k06849j85426j94666j88801j42980r0393j36753
17974B212966j74463j42542p1582m2855j13243j33773o5973J2175N7666L7966
17964A576342l7356j07262j38597j38962j00411n5260m1000l4460m8689l3635
17954H40710p167J1424l7160q0694p0151l4083j6755R793O3225J13754J44861
17943I37757Q4185o6616j52193j19805l2344k595j5473n1023q5706o9131n0688
17932C76368l4277k8587j5904p172M132j2631p400P001Q790q12j4108m433J6668
17919B87635P058J2896p594k6776j4960j0242q346J5222N248j0184J1895K7896
17907B89748N080j8159k435J4168R548J1856K1999q688l668O224Q357O141K8689
$$ plain form
17984 4644200 4038213 3632654 3358834 3151985 2966559 2771893 2583092 2440112 2349719 2212966
17974 2212966 2038503 1895961 1824379 1781524 1668281 1534508 1468535 1480710 1538376 1576342
17964 1576342 1538986 1431724 1293127 1154165 1053754 998494 957494 923034 874345 840710
17954 840710 833543 844967 807807 727113 656962 622879 606124 615917 679142 792896 937757
17943 937757 1021942 955326 803133 683328 650984 648389 632916 581893 496187 427056 376368
17932 376368 342091 313504 297600 290428 294560 281929 274529 281530 290320 289508 275400 270967 287635
17919 287635 294693 307589 299995 273219 258259 248017 239671 254893 260141 249957 261852 289748
17907 289748 294828 276669 274234 288402 297950 309806 331805 323117 319449 325673 334030 340171 368860
17894C68860M5001O1504O1224N0759L8665K9440J1230r445k1343j238j6615j5236
17882F02806q621l4164j8126J1946M4774P2563M0030l2613q2664p3719o9196n0950
17870D02066l6744l6982j7504j8523j3675k9189k9439p375Q123l374j7640j5825
17858A83919J561N427J4734N780o698K44J4035m136o53P122m067k548J7296P950
17844B39966J5988J0986n381J592J283K868Q184L1862L0561K311k8013l4820k8538
17831B48849j0678N596J0841j5288n217j2183k4369k4658r787r658N351L37p758
17818A51378j9361j0121l340j417j0754n434Q198J3781J396k0059j1033K597j0642
17805H5189j2677O150J0743j0661K2751L592j5003j8461l067K2253m468J529K197
$$ plain form
17894 368860 413861 475365 536589 587348 626013 655453 666683 657238 635895 634657 618042 602806
17882 602806 594185 560021 541895 553841 598615 671178 711208 678595 595931 522212 453016 402066
17870 402066 365322 328340 310836 292313 278638 249449 220010 212635 220758 217384 199744 183919
17858 183919 185480 190907 205641 211421 204723 204967 219002 214866 214213 221335 217268 214720 232016 239966
17844 239966 255954 266940 261559 263151 264434 267302 275486 307348 337909 340220 312207 277387 248849
17831 248849 238171 243767 254608 239320 234103 221920 197551 172893 163106 153448 158799 159136 151378
17818 151378 132017 121896 118556 117139 106385 100951 109149 122930 124326 104267 93234 95831 85189
17805 85189 72512 78662 89405 78744 101495 105087 90084 71623 68556 90809 86341 87870 90067
17792I0067J81l597q835l175O427M687r204p767l043P825k692N99p261L419O830
17777G4461j15k0472M119J531N480R305K5649R714m071L4885K9736p6j292o978
17763A61876Q436L025J4694L6813M341J949k0591k4229m302r962J3749J9010J6142
17750B20951K631q787o792J0127J3370R804l805j9907k4891j7554r361k2481p440
17737A35865n623m406J6278R39j2193L062J2413K3649L8493K3623K0755J2603
17725B65458n768j6217j3798q464m147K8163L9962M3298M2826K4508K7045K1686
17713D44552k1846k4584o384o82j0057l9376m0142l2935k385K4698K8785J8164
17701C37808J0213K3038j0679m5956m1681l7762m411j1454j8709k6238p934j0542
$$ plain form
17792 90067 90248 86651 77816 74641 81068 85755 76551 68784 65741 73566 70874 71473 64212 67631 74461
17777 74461 74346 53874 57993 59524 65004 74309 99958 109672 105601 140486 170222 170146 168854 161876
17763 161876 170312 173337 188031 224844 229185 231134 210543 186314 182012 172050 185799 204809 220951
17750 220951 223582 214795 208003 218130 231500 241304 237499 217592 192701 175147 165786 143305 135865
17737 135865 130242 125836 142114 143053 130860 133922 146335 169984 208477 232100 252855 265458
17725 265458 259690 243473 229675 221211 217064 245227 285189 328487 371313 395821 422866 444552
17713 444552 422706 398122 391738 391056 380999 341623 301481 268546 266161 290859 319644 337808
17701 337808 348021 371059 360380 314424 272743 234981 230570 219116 200407 174169 166235 155693
17689A55693j9240k3291k85o768n893m219J76m683q083J1686J4176j272j91M988
17675A12794o779k2036j5897q125P731L095Q918M225q742l936N300j332m456o739
17661F4021J6473O32j0747n845k193P934P184J666R479R894j124P622J1316q794
17647A07518j0909p791r836j0711m932j49R588J3300J9968k650J514n068O599
17634A06441J3938n144k471R959J03j8317j2651k271j962Q823M151M261Q749N635
17620A19244n271k665P678j125o611Q556O071l289o855j189n956L560N078J356
17606A18582l293K973O330M981J2370J473j2770R575q37J0759K3663L1879K9414
17593B35099M330j1365j9037k6453k1789j2529j5572n459K914J110L817n107l714
$$ plain form
17689 155693 136453 113162 112877 106109 100216 95997 96173 91490 83407 95093 109269 107997 107806 112794
17675 112794 106015 83979 68082 59957 67688 70783 79701 83926 75184 71248 76548 75216 70760 64021
17661 64021 80494 81126 70379 64534 62341 70275 77459 79125 88604 98498 97374 104996 116312 107518
17647 107518 96609 88818 78982 68271 63339 63190 72778 86078 106046 103396 104910 99842 106441
17634 106441 120379 115235 112764 122723 122826 104509 91858 89587 87625 96448 100599 104860 113609 119244
17620 119244 113973 111308 118986 117861 111250 119806 125877 122588 115733 114544 108588 112148 117226 118582
17606 118582 115289 118262 124592 129573 141943 143416 130646 140221 139384 150143 173806 205685 235099
17593 235099 239429 228064 209027 182574 160785 148256 132684 127225 130139 131249 135066 129959 126245
17580A26245L498L106m344L800J8762J3269N746R3J144j6496j3964N701J1412
17567A57972J532L643R805j6785o449J313K0252M485J4861J8537J6004K5480O869
17554B57519m358k526J6212K7313L8665M5787P6299O9472L7274L2542K304j9729
17542E76774j5536J1032M5268O8214R2810R0860Q0683M0937R541j0432j1665l6824
17530I41662q6531r4857n7491k5764r451J8134M2414L4097m971l6995n5029l5148
17518F30070k5306j1823j4385k7696J0250N1163N9161N1236K6058j4043l8593
17507F96092m2512l7245p712K6191P5188Q6353K8617k9093l5635k4109J8288O9716
17495H24139J36619J90221J87900N5347j02339j76065j73385j36905p9345j9183
$$ plain form
17580 126245 129743 132849 128505 132305 151067 164336 170082 170175 171319 154823 140859 146560 157972
17567 157972 159504 163147 172952 156167 149718 151031 171283 175768 190629 209166 225170 250650 257519
17554 257519 253161 250635 266847 294160 332825 378612 454911 524383 561657 594199 596503 576774
17542 576774 561238 572270 617538 685752 778562 869422 950105 991042 1000583 990151 978486 941662
17530 941662 855131 760274 702783 677019 667568 685702 728116 762213 757242 720247 665218 630070
17518 630070 604764 592941 578556 550860 561110 612273 671434 722670 748728 734685 696092
17507 696092 653580 616335 608623 634814 710002 796355 824972 795879 760244 736135 754423 824139
17495 824139 960758 1150979 1338879 1394226 1291887 1115822 942437 805532 726187 707004
17485G07004J9513O31m4828n3996m2133j1646J462k741j7789k8383j3113k6241
17473D87740l3387j9776q342J2356o621k3819k8000k38J3293R686l330O795J2499
17460D18856O017j9831j0340M155r34l313M983K938o857j7999q926j1851j797
17447C55101J1038K5787L5695K5627K1925J9316P273k0209m0122j5455O776r587
17435D23165o444J4024j3773j6516k515J6006K9196J478N27P140P450k747P366
17422D64357N141J7815J9167J7080K3280K1627K1193K7684K6041K1549L9448M2976
17410G47358O9946N1706K7550N1579M9302N7263P8433R3796Q5586P2444J05983
17399A490946J16882J12244J28936J50003K02558K89047L85496N13592P32833
$$ plain form
17485 707004 726517 727148 682320 628324 586191 574545 576007 573266 555477 527094 513981 487740
17473 487740 454353 434577 426235 438591 431970 408151 380151 379913 393206 402892 399562 406357 418856
17460 418856 424873 405042 394702 398857 397923 394610 399593 402531 395674 377675 368749 356898 355101
17447 355101 366139 391926 427621 453248 475173 494489 501762 481553 441431 425976 432752 423165
17435 423165 416721 430745 416972 400456 397941 413947 443143 444621 445148 452288 459738 456991 464357
17422 464357 469498 487313 506480 523560 546840 568467 589660 617344 643385 664934 704382 747358
17410 747358 817304 869010 896560 948139 997441 1054704 1133137 1226933 1312519 1384963 1490946
17399 1490946 1607828 1720072 1849008 1999011 2201569 2490616 2876112 3389704 4122537
17390D122537J051109J525127K252498L605297N122870L948063L8469k469963
17382A9196007j533334J160794M144962N893737L503206L16090n9580k99782k996882
17373B9325218m665211l106334m1718L017095M144427K09865m839976o442442
17365A7600924m549483k678460j692951j166316q43679o35171m94483l66324k62897
17356D911160j99757j85475k07877k20492j84234j39490q3452k9814K1934O5806
17346C748309J04989J81091L13950M94864P73335J187655J852871L027221M444550
17337A6128835L539358m3141k463909j771453M14706K705505M964673N400276
17329B8874850L451405Q82420k607158n079610m948764k463723J34127K621194
$$ plain form
17390 4122537 5173646 6698773 8951271 12556568 17679438 21627501 21665970 19196007
17382 19196007 17662673 18823467 22968429 28862166 32365372 32681462 32621882 32322100 29325218
17373 29325218 24660007 21553673 21511955 24529050 28673477 28883342 24043366 17600924
17365 17600924 13051441 10372981 8680030 7513714 6670035 6034864 5540381 5174057 4911160
17356 4911160 4711403 4525928 4318051 4097559 3913325 3773835 3690383 3660569 3682503 3748309
17346 3748309 3853298 4034389 4348339 4843203 5616538 6804193 8657064 11684285 16128835
17337 16128835 19668193 19625052 17161143 15389690 15804396 18509901 23474574 28874850
17329 28874850 32326255 33208675 30601517 25521907 20573143 18109420 18243547 20864741
17321B0864741L729798N12808l998268n601199m007950k354442j515298j104648
17313F525542p84858n53258m01205l34910l06325k51552k48237k51846k64135
17304C129216k39464j85636j25259j27804j04096q3232q2066r7870r1278o8274
17294A924237l8940l7959l0282J5367N0518L3976J4533J3686M9169Q4784J32713
17283B211802J77788J83789K13117L14840N15050P55847J125585J717411K774848
17274I990077L785543K589718m18979k210062j518054K45494K077297K839835
17266A7380869P86040j803138k364366q52124Q73801K553154M885513P476382
17258B8936131O181174k10695n099221m643884j129192K487399M593279J381006
$$ plain form
17321 20864741 24594539 25107347 21109079 15507880 11499930 9145488 7630190 6525542
17313 6525542 5740684 5187426 4786221 4451311 4144986 3893434 3645197 3393351 3129216
17304 3129216 2889752 2704116 2578857 2451053 2346957 2263725 2181659 2083789 1992511 1924237
17294 1924237 1885297 1847338 1817056 1832423 1882941 1916917 1931450 1945136 1994305 2079089 2211802
17283 2211802 2389590 2573379 2786496 3101336 3616386 4372233 5497818 7215229 9990077
17274 9990077 13775620 16365338 15946359 13736297 12218243 12463737 14541034 17380869
17266 17380869 18166909 16363771 13999405 13147281 14021082 16574236 21459749 28936131
17258 28936131 35117305 34906610 29807389 25163505 24034313 26521712 31114991 32495997
17250C2495997m273457o861701n230719l086595j864485j112585n79838j73507
17242I313110J81149N33542R82561J647626K611474L976381N405611O661079N725816
17233C7038349J05472n405144o414296l683015r53750J193518L180999N330609
17225C0392742Q133399R435904P381693O702788O787396L288929P7114M31522
17217G2631487k25993n827167q556689m589336L537731J0681982J1071827L230114
17209H1953956q309026j5180407j5105981j0910962o698855l909757k215807j440698
17201A8182463j634531j979763j818024j295684q59711n40022m14141o86951j018743
17192G934893j048039q26540o11636m91898m55049m23430m13083l65761k97337
$$ plain form
17250 32495997 28222540 21360839 16130120 13043525 11179040 10066455 9486617 9313110
17242 9313110 9494259 10027801 11010362 12657988 15269462 19245843 24651454 31312533 37038349
17233 37038349 37143821 31738677 25324381 21641366 20687616 21881134 25062133 30392742
17225 30392742 38526141 47962045 55343738 62046526 68833922 72122851 72199965 72631487
17217 72631487 72405494 66578327 58021638 53432302 56970033 67652015 78723842 81953956
17209 81953956 73644930 58464523 43358542 32447580 25748725 21838968 19623161 18182463
17201 18182463 16547932 14568169 12750145 11454461 10594750 10054728 9640587 8953636 7934893
17192 7934893 6886854 6060314 5448678 4956780 4501731 4078301 3665218 3299457 3002120
17183C002120k11040j85219j91037j74424j61147j39979j41132j36917j06893
17174A554332q1403p1426o3855p5486q4344o7894o1097l7670l8645n7385n3537
17163H61590m4052m3724l1433j6704k3227l4466n3167n9536n0994k0842m5935
17152D37510m1659k4898k0142k6092j2729k3754k5221r32k2404N393o746k1800
17140B16526j5349K75M958L694J9446K6530K9136L5374o439l6541l6512k5707
17128B15391j6312k2061o830N936P023o742j179J5038K9688J0675K9227K1035
17116B80889m719j8535l5152j7569K2289L0824O478k7122j5959k1329j6881r616
17104A73598J3667R277J3462M9390L9264J8680r86j9741q99m855J8304L0286M6245
$$ plain form
17183 3002120 2791080 2605861 2414824 2240400 2079253 1939274 1798142 1661225 1554332
17174 1554332 1472929 1401503 1337648 1262162 1177818 1109924 1048827 1011157 972512 915127 861590
17163 861590 817538 773814 742381 725677 702450 667984 614817 555281 504287 483445 437510
17152 437510 395851 370953 350811 324719 311990 288236 263015 262083 239679 245072 238326 216526
17140 216526 201177 201452 206410 210104 229550 256080 285216 320590 314151 277610 241098 215391
17128 215391 199079 177018 170188 176124 183147 176405 175226 190264 219952 230627 259854 280889
17116 280889 276170 257635 222483 204914 227203 258027 264505 237383 221424 200095 183214 173598
17104 173598 187265 196542 210004 259394 298658 317338 316352 296611 295712 290857 309161 339447 385692
17091C85692O4489R3377M1228j6580p1872p2832l0692k1573P295K3203L2995M2580
17079D77310N1973O0567L7151k9086p0922q2785n2950m8594m2653l2115j7310
17068B50586k2346j61L985j0310K96J4117K6672J4328j2777k6528k0656o136p019
17055B04051j1991p584N535L419j0449J7883J1920K0109M0927L4839L0922K1476
17043C61057j1170n0730l3804k5508j5966M649K1551L0156J4799J1979o415l1122
17031B69476l5579l5023m1918l0728j886j2683j6412O955L956M54k934j0562m792
17018H8324r432j4672O024R238K014m378J1985J0917K8325M1744K7567m987k9616
17005A63053m2281k0202p351j0169O69q017L109P974L678K1950L4102K0830j9974
$$ plain form
17091 385692 450181 543558 584786 568206 496334 423502 392810 371237 378532 401735 434730 477310
17079 477310 529283 589850 627001 597915 526993 444208 391258 342664 300011 267896 250586
17068 250586 228240 228079 232064 221754 222050 236167 262839 277167 264390 237862 217206 211070 204051
17055 204051 192060 184476 190011 193430 182981 200864 212784 232893 273820 308659 339581 361057
17043 361057 349887 299157 265353 239845 223879 228528 250079 280235 295034 307013 300598 269476
17031 269476 233897 198874 156956 126228 124342 111659 95247 102202 106158 106612 103678 93116 88324
17018 88324 78892 64220 70244 79482 81496 77118 89103 100020 128345 170089 197656 192669 163053
17005 163053 120772 100570 93219 83050 83719 75702 78811 86785 90463 112413 146515 167345 147371
16992A47371k8957k8892l1614l13r987N063M140k853p058p21J1535m978j3226
16979C9510j5677k280P60K323R223r653K227J5836J6779K364o420j534j842j5781
16965C5835k209K0997J384p944j048K800Q727j0952p459N864J5151K1533K8149
16952A10828L4473J6398o881j1820k1315j6421j0732q446J4798J6705J5605J7589
16940A50781J4296j0531k6525j5969o911k4499l3866r017O587N38R39j6915n076
16927B3832L210J9402P264J20r071j2290J058m242m364J5021P422j817O5N772
16913E1382q46M955J6769J0806Q752l830j7687j4341J5569L3148M1723M8733O8016
16900B63149J11405J26405L4142p7297j29883r5285n6996l6114j3857Q94J4435
$$ plain form
16992 147371 118414 89522 57908 57595 47608 52671 56811 53958 46900 46179 57714 52736 39510
16979 39510 23833 21553 22313 24636 33859 24206 26433 42269 59048 61412 54992 53458 51616 35835
16965 35835 33626 54623 56007 48063 47015 49815 58542 47590 40131 45995 61146 82679 110828
16952 110828 145301 161699 154818 142998 121683 105262 94530 86084 100882 117587 133192 150781
16940 150781 165077 154546 128021 112052 105141 80642 46776 37759 44346 44884 45823 28908 23832
16927 23832 27042 46444 53708 53828 44757 32467 33525 29283 24919 39940 47362 45545 45610 51382
16913 51382 50536 55491 72260 83066 91818 87988 70301 55960 71529 104677 146400 195133 263149
16900 263149 374554 500959 535101 457804 327921 232636 175640 139526 125669 126563 140998
16889A40998J4176K3909N2781R3624J11990O9535l1378j16228j07447n8011l6760
16878A57189j4251k3563r278J1755J3658O26P555K0576J7909N625k2874k1277
16866A43650K158J8062J4768J2369J9595j088K877k490j8627l1774m500R942P36
16853A65678p003j9280j3365j6765p582j6453k5602p214k441n122Q56m571n708
16840C5428l784P68L397m310L905K618r01p414p246J357Q678j224J381J7007J7525
16825F7185J2078J5726K8807J9155l120j7292m599m628J7283K6089K3887J0972
16813A91543R781o351j9544j9682j6553j2293J3194K3276j629j3821j9902j4365
16801A13654j0032M027j1433r560N294k622J436Q694o828j5818L945J6381r09
$$ plain form
16889 140998 155174 179083 231864 325488 437478 507013 475635 359407 251960 193949 157189
16878 157189 142938 119375 110097 121852 135510 136136 143691 164267 182176 187801 164927 143650
16866 143650 145808 163870 178638 191007 210602 209514 212391 209901 191274 159500 155000 164942 165678
16853 165678 158675 139395 126030 109265 101683 85230 59628 52414 49973 44851 45707 41136 35428
16840 35428 31644 32412 35809 31499 35404 38022 37121 29707 22461 23818 32496 31272 32653 49660 67185
16825 67185 79263 94989 123796 142951 139831 122539 117940 113312 130595 156684 180571 191543
16813 191543 201324 194973 175429 155747 139194 126901 140095 163371 161742 147921 128019 113654
16801 113654 103622 107649 96216 86656 91950 89328 90764 99458 92630 76812 80757 97138 96229
16788I6229j4304J1455J0058j8260n638R462J1275J1657O253K3810O599J2557
16776A61153K3074K5592M2166O6804J25025J36529M6817p6843j07177p9017l6569
16765C27554j2518J243j2844k878M1923Q3817J09250M9404m0029q6557p1372p4589
16753C12404m2413k8284n737l461m314p596k1656k7017k3181P810J4665j8643
16741A52577j666J7234K5775L7803J9485J7108L937j8791k8313k1829l237J1578
16729B11661Q937K1350L6744J8861J3242L2532Q875J2287P636K124k2202l2854
16717C19193l8466j5841M681J5699L1000J7047r236m750j9940k5803k9095k9635
16705B14854O181J3798j0275k9170k0491J1237J7489k072j7288k8723k1051k2324
$$ plain form
16788 96229 81925 93380 103438 85178 79540 89002 100277 111934 118187 141997 148596 161153
16776 161153 184227 209819 251985 318789 443814 580343 627160 550317 443140 364123 327554
16765 327554 315036 316279 303435 300557 342480 426297 535547 584951 544922 458365 386993 312404
16753 312404 269991 241707 235970 232509 228195 220599 198943 171926 148745 156555 171220 152577
16741 152577 150911 168145 193920 231723 251208 268316 272253 253462 225149 203320 200083 211661
16729 211661 220598 241948 278692 297553 310795 343327 352202 364489 372125 374249 352047 319193
16717 319193 280727 264886 269567 285266 316266 333313 324077 319327 299387 273584 244489 214854
16705 214854 221035 234833 224558 195388 174897 186134 203623 201551 184263 155540 134489 112165
16693A12165j3088n51R192n104m398p237J135J346L566o670j378M22l251K880
16679H9029N779q961p239J0306p201k6192P23P114N679j0033K815J447N691n286
16665F3671j795R77O002j621l97q227M97J4311J2206m271j269Q013J9366J3395
16651A20858m121J2561J5311o2M911J6126J6517r84R13p884L448N925r677J6913
16637A90755J1018L856J2514J4821R451L029j4276k2122m223J389k513N66N584
16624B09849L444O56O190K566O461R631J411j3868q340n286K3147K0242J3158
16611B69261O051n912k0449r372O727J3272K8O662J3335J3299O101J6208J6286
16598C31497M1562N7296P7633M7213j7108n4033n1850k7092k438O373O243L6478
$$ plain form
16693 112165 99077 98526 107718 102614 98216 90979 92114 93460 97026 90356 88978 89400 86149 89029
16679 89029 94808 85847 78608 88914 81713 55521 56244 63358 69037 59004 61819 63266 68957 63671
16665 63671 61876 62853 68855 67234 66837 58610 59107 73418 85624 81353 80084 88097 107463 120858
16651 120858 116737 129298 144609 144547 149458 165584 182101 181117 182030 174146 177594 183519 173842 190755
16637 190755 201773 205629 218143 232964 242415 245444 231168 209046 204823 206212 203699 204265 209849
16624 209849 213293 213949 220139 222705 229166 238797 240208 226340 218000 212714 235861 256103 269261
16611 269261 275312 269400 248951 239579 246306 259578 259606 266268 279603 292902 299003 315211 331497
16598 331497 373059 430355 507988 555201 538093 484060 432210 405118 402680 409053 415296 451774
16586D51774O1269P0991Q1961L1360m8538p3734l9076M061K8257M1066O2894M7178
16574G19463k86l8679k9071p799R781J2136K2017M9004Q3552J19211J39062J18293
16562A196684J08804J11907J28494P1871j698j2796Q2415J47882K35493K97579
16552B366635K63234K06571K11333K94659L94019M88117O01941Q35128J216063
16543F877700J741249K535981L722174N416309Q128049J3024651J8728043J5799099
16535G5973255o7919j4844407j7520388j1563091n911926k231555N51611L291422
16527B7677002O682168J1866800J7615768J4750728r44917j5661372j8494473
16520D3491704j3000352p957177n044536l294818k233130j583315j120756p74098
$$ plain form
16586 451774 513043 584034 665995 697355 648817 575083 536007 540068 568325 609391 672285 719463
16574 719463 719177 680498 651427 643628 653409 665545 687562 736566 820118 939329 1078391 1196684
16562 1196684 1305488 1417395 1545889 1617760 1616062 1603266 1685681 1833563 2069056 2366635
16552 2366635 2629869 2836440 3047773 3342432 3736451 4224568 4826509 5661637 6877700
16543 6877700 8618949 11154930 14877104 20293413 28421462 41446113 60174156 75973255
16535 75973255 75905336 61060929 43540541 31977450 26065524 23833969 24385580 27677002
16527 27677002 34359170 46225970 63841738 78592466 77647549 61986177 43491704
16520 43491704 30491352 22534175 17489639 14194821 11961691 10378376 9257620 8483522
16512H483522n08047l12292k00176k46400n05476p31382p40003n76218m47699
16503D215829l94006l91454l64723l07374k22480j38699j12906j71077k15598
16494A897512j77308j40059q1328o7763j01544j22961j18557r7893q1571p6203
16484H32325n9483n8665m1524k0430j6459l4425m7512n0968l4751m1518m6281
16473C80309l4045r311o567k196j0895l0720l1298r268j8100k6890q377p278l370
16460A81994j3134j4227j3976p978j6920j214j0491r861j2174j0877k3100p508
16448D0534n425l878J1275J5272J7568Q585k2630j4746j8142q145p172j0279j899
16435I18l963J5239K6881R67J720q057r911j608r527q381j1012q987J1889J1318
$$ plain form
16512 8483522 7975475 7663183 7463007 7216607 6711131 5979749 5239746 4663528 4215829
16503 4215829 3821823 3430369 3065646 2758272 2535792 2397093 2284187 2113110 1897512
16494 1897512 1720204 1580145 1498817 1431054 1329510 1206549 1087992 990099 908528 832325
16484 832325 772842 714177 672653 652223 635764 601339 553827 502859 468108 426590 380309
16473 380309 346264 336953 330386 328190 317295 286575 255277 246009 227909 201019 192642 185364 181994
16460 181994 168860 154633 140657 132679 115759 114545 104054 94193 82019 71142 48042 40534
16448 40534 35109 31231 42506 57778 75346 83931 61301 46555 28413 20268 13096 2817 918
16435 918 -3045 12194 39075 40042 41762 33705 23794 22186 12659 4278 -6734 -15721 -3832 7486
16421G486o705k928J1594J5785j0031p657N308L840J1070l054j2462l794K3225
16408C1677P110p497p960n997L553K311J8459J2902P548j2062r111j1296j0428
16395A9209M18Q627R322q60N529p455o518j3237l141O294L053P547Q367j729J0450
16380D5876J1257K298o649l202j2367r293J468M534m029j0219o714J455P749k941
16366A9223P82Q911J3609J066j8638p492m402R060O335l308j4907q932j0389o648
16352a5730Q635l455j895Q37O849l64Q3L983j3593J0601J86o960j331L356K804
16337e994J055K58q691o422L496J0226P068m585j2475m416j1891m215M260L940
16323b8386o267q79J43O832M41j6316o209K984M295j384J1774M176P367Q625O51
$$ plain form
16421 7486 781 -2147 9447 25232 15201 7544 12852 16692 27762 24708 12246 8452 31677
16408 31677 38787 31290 23330 17333 20886 23197 41656 54558 62106 50044 40933 29637 19209
16395 19209 19627 28254 37576 36716 42245 34790 28272 15035 11894 18188 21241 28788 37155 35426 45876
16380 45876 57133 59431 52782 49580 37213 27920 29388 33922 29893 19674 12960 14415 22164 19223
16366 19223 20005 28916 42525 43591 24953 17461 13059 22119 28454 25146 10239 1307 -9082 -15730
16352 -15730 -7095 -10550 -12445 -11608 -4759 -5123 -5040 -1057 -14650 -4049 -3863 -10823 -12154 -8798 -5994
16337 -5994 -4939 -4681 -13372 -19794 -16298 -6072 996 -3589 -16064 -20480 -32371 -36586 -32326 -28386
16323 -28386 -34653 -35532 -35389 -28557 -28116 -44432 -50641 -47657 -43362 -44746 -32972 -28796 -21429 -12804 -12153
16308a2153p042J358P240n658r375J803P959L575j237o421l244l560j311N603
16294b2463N971r630j0344r594Q599L227O009r641j3236P364K1212K3071p614
16281g069j5340o448P719L320k828n162j237O33k879k509Q929J1072K06L091R133
16266F31o898j0837L94j1112p192l04p242o318O055M60O192j66j862J0211J2860
16251a5128m550R873j1161j425j812j5027j225P89M435n752P550J5306m131j0379
16237c2637J8590k80j3157J3000Q747j0726j3757j3539J403J6098R571Q537J77
16224g973M072r57m632m2o621k056j5195j592K860Q667J0144M971l854j992r828
16209b4028j379L427N813j1048L738j878J0652j025o25L696l785M407J2100o897
$$ plain form
16308 -12153 -19195 -17837 -10597 -16255 -25630 -23827 -15868 -12293 -13530 -19951 -23195 -26755 -28066 -22463
16294 -22463 -16492 -26122 -36466 -46060 -37461 -34234 -28225 -37866 -51102 -43738 -22526 545 -7069
16281 -7069 -22409 -28857 -21138 -17818 -20646 -25808 -27045 -26412 -29291 -31800 -22871 -11799 -11593 -8502 631
16266 631 -6267 -17104 -16710 -27822 -35014 -35318 -42560 -48878 -42823 -42363 -36171 -36337 -38199 -27988 -15128
16251 -15128 -19678 -9805 -20966 -22391 -24203 -39230 -40455 -39666 -35231 -40983 -33433 -18127 -22258 -32637
16237 -32637 -14047 -14327 -27484 -14484 -5737 -16463 -30220 -43759 -42356 -26258 -16687 -8150 -7973
16224 -7973 -3901 -4858 -9490 -9532 -16153 -18209 -33404 -34996 -32136 -23469 -13325 -8354 -12208 -14200 -24028
16209 -24028 -25407 -21980 -16167 -27215 -23477 -25355 -14703 -15728 -16353 -12657 -16442 -12035 65 -6832
16195f832j2827L185k317P176K688m959r619p229R07l417l044J809N675K196j1123
16180c7731o352l125Q96K423J4490J308J2683N177O506l889k153j1099n084J2997
16166a2953M897q092n183j330j516q953o526l916K860k906o49O751J0459P935
16152a9122q872J450J1978K054k4295k029L436j3144m343O953J7651J4741p196
16139b0738L256r54q588L509L003l322J3062K2473j750m225j0732j619m428j1499
16125b2552J867J2183R488j7444l938J13q033l523R203J0267o724m204J946Q448
16111a2903O808J665k1028m575K0328J1256L82m896q809p544l30N848J0860L639
16097G01q375j6942N148J0776n816j4793R009J2879N093o808k963k628M649P739
$$ plain form
16195 -6832 -19659 -16474 -18791 -11615 -8927 -13886 -23505 -30734 -29827 -33244 -36288 -34479 -28804 -26608 -37731
16180 -37731 -44083 -47208 -46312 -43889 -29399 -28091 -15408 -10231 -3725 -7614 -9767 -20866 -25950 -12953
16166 -12953 -8056 -16148 -21331 -22661 -24177 -33130 -39656 -43572 -40712 -43618 -44267 -37516 -27057 -19122
16152 -19122 -27994 -26544 -14566 -12512 -36807 -38836 -35400 -48544 -52887 -45934 -28283 -13542 -20738
16139 -20738 -17482 -18436 -27024 -23515 -20512 -23834 -10772 11701 9951 5726 -5006 -6625 -11053 -22552
16125 -22552 -20685 -8502 986 -16458 -20396 -20283 -28316 -31839 -22636 -12369 -19093 -23297 -21351 -12903
16111 -12903 -6095 -4430 -25458 -30033 -9705 1551 1933 -2963 -11772 -19316 -19646 -13798 -2938 701
16097 701 -7674 -24616 -19468 -8692 -14508 -29301 -20292 -7413 -2320 -9128 -12091 -14719 -10070 -2331
16083b331K315k439q990j4295j3339J0300J4154J0857L968m274q868n662J1477
16070g127N57j4759n136N565l579L071O953l250r320m245J8982Q498q249K039
16056a0000l499J2963k191o992L844L788K022n671Q775q742j9866j3385Q199P450
16042b3305J8895j28j687O629P34p901j2284n119m437J8178Q725l068N337P418
16028G987n73k71R114L093P920j2060l689J569j2048P935Q967K502o608j3567
16014B71j0887k460J648l456L25N399n551L539O500J0521P349j474L43p577n523
15999a033P972Q99p190j57k566M222J28R317N25M922j393m893j889Q970K873m070
15983A6637J7727L1892K2030K2558M4758P8360P5144O2767J666n6745o4211n9271
$$ plain form
16083 -2331 -16 -2455 -11445 -25740 -39079 -28779 -14625 -3768 200 -4074 -12942 -18604 -7127
16070 -7127 -6570 -21329 -26465 -20900 -24479 -21408 -14455 -17705 -27025 -31270 -12288 -3790 -12039 -10000
16056 -10000 -13499 -536 -2727 -9719 -5875 -2087 -65 -5736 3039 -5703 -25569 -38954 -30755 -23305
16042 -23305 -4410 -4538 -6225 404 1138 -6763 -19047 -24166 -28603 -10425 -1700 -4768 569 7987
16028 7987 7414 7143 16257 19350 27270 15210 11521 13090 1042 8977 17944 20446 13838 271
16014 271 -10616 -13076 -11428 -14884 -14559 -9160 -14711 -11172 -4672 5849 13198 11724 12067 4490 -1033
15999 -1033 6939 7838 648 491 -2075 2147 2275 11592 12117 17039 15646 10753 8864 17834 20707 16637
15983 16637 34364 66256 88286 110844 155602 233962 309106 371873 373539 316794 252583 193312
15971A93312l0775j0586R300K5764N5003P3296P6714M1445r760p2549o6716m6856
15959B37592l4765k5322j4419Q358K3648M989J4859L7518L5655K1740M0950N4044
15947D04847N6871N5958L2575K0106J5389j0567m7004l6733m8001n8701n4548
15936C30192l8644m0440k7775l517k2796l2082k6370j8197j8474l572n812j3612
15924G8901M017l350O416q989j7628j5305j7677r958K600J3722P425J1215n412
15911D5977p943j4682j2671L299J174j794o364o119o008P64m959l688n489Q478
15897a0025j059J649n289n184P968J920J3522N68m385k298l793q088M164p426
15883a7756p291Q444L191K182M770j4426n751J8155J2457m960l445J578J1899
$$ plain form
15971 193312 162537 151951 161251 187015 242018 315314 392028 433473 423713 351164 284448 237592
15959 237592 202827 177505 163086 171444 195092 200081 214940 252458 288113 309853 350803 404847
15947 404847 461718 517676 550251 570357 585746 575179 528175 491442 443441 384740 330192
15936 330192 291548 251108 223333 219816 197020 164938 138568 120371 101897 98325 92513 78901
15924 78901 82918 79568 85984 76995 59367 44062 26385 16427 19027 32749 40174 51389 45977
15911 45977 38034 23352 10681 13980 15154 13360 6996 877 -5131 -4367 -9326 -13014 -18503 -10025
15897 -10025 -11084 -9435 -14724 -19908 -11940 -10020 3502 4070 -315 -2613 -6406 -14494 -10330 -17756
15883 -17756 -25047 -16603 -13412 -11230 -6460 -20886 -26637 -8482 3975 -985 -4430 -2852 9047
15870I047j1507j5845J547M052j297l481R514J0655M30o046k280r94o003o158
15856a8366m646o077j25p989N623O747j1668o904J4042m360l255J541P29R993
15842b4715R730m569n983L732k040L51K778K204J2062q85m652N420J4892p425
15828I00k280J3103j0952j1358k627o93P513L812k1174j3771J1725J2153P055
15815f594J1569n196j4306o906O280O18j0177k786M825J0884l206r73l249o76
15801a9893J2195L544L16j0363O27P77j2136L483O882L646M268k81L930o875m893
15786a4773J478N015L23q606l808J918Q315P08m356k359l033k895r379N683J2184
15771a3585J890j02R450K091r593l79l245n475J1521J3915n335j638j2573j0253
$$ plain form
15870 9047 -2460 -18305 -16758 -12706 -14003 -17484 -7970 2685 3115 -2931 -5211 -6205 -12208 -18366
15856 -18366 -23012 -29089 -29214 -37203 -31580 -24833 -36501 -43405 -29363 -33723 -36978 -35437 -34708 -24715
15842 -24715 -14985 -19554 -25537 -21805 -23845 -23494 -20716 -18512 -6450 -7335 -11987 -6567 8325 900
15828 900 -1380 11723 771 -10587 -13214 -13907 -6394 -2582 -23756 -37527 -25802 -13649 -6594
15815 -6594 4975 -221 -14527 -21433 -15153 -14535 -24712 -27498 -22673 -11789 -14995 -15968 -19217 -19893
15801 -19893 -7698 -4154 -3838 -14201 -13574 -12797 -24933 -21450 -14568 -10922 -6654 -6935 -3005 -9880 -14773
15786 -14773 -13295 -8280 -7957 -16563 -20371 -18453 -10138 -9430 -13786 -16145 -19178 -22073 -31452 -25769 -13585
15771 -13585 -11695 -11797 -2347 -256 -9849 -10228 -13473 -18948 -7427 6488 1153 -485 -13058 -23311
15757b3311L50l53R534R008l254j9099P403J6994q761j8297k004O977o858o558
15743c8229J4212l636Q121j3261J4199J9756Q601j1246l863l192N969j5759o113
15730b4441k525j0735Q547j463O378K172mp340J3221Q752m722N629P924k565j41
15715a313l392l204N000J2168q380q004j855j367K314n245L20l8P778j0647r287
15700b5152N439m209J0615o008K798O600J3273J7915O378q531o984l499K936l056
15686H515r108M252N135p291l197j786J654O415p677k713k557p106N491N143m668
15671i498j56J078k919K036L748K758r88n976O656J2969k872J737q625J416R398
15656A0762n107j1350L872K280m103J1754q014l847J556J2293j930j2097Q202
$$ plain form
15757 -23311 -22961 -23314 -13780 -4772 -8026 -27125 -19722 -2728 -11489 -29786 -31790 -24813 -31671 -38229
15743 -38229 -24017 -27653 -19532 -32793 -18594 1162 9763 -1483 -5346 -8538 -2569 -18328 -24441
15730 -24441 -26966 -37701 -29154 -30617 -24239 -22067 -22071 -29411 -16190 -7438 -12160 -6531 1393 -1172 -1313
15715 -1313 -4705 -7909 -2909 9259 879 -7125 -8980 -10347 -8033 -13278 -12958 -12996 -5218 -15865 -25152
15700 -25152 -19713 -23922 -13307 -19315 -16517 -9917 3356 21271 27649 19118 12134 8635 11571 8515
15686 8515 -593 3659 8794 1503 -1694 -3480 -1826 4589 -3088 -5801 -8358 -15464 -9973 -4830 -9498
15671 -9498 -9654 -8576 -11495 -9459 -5711 -2953 -3941 -9917 -3261 9708 6836 8573 -52 1364 10762
15656 10762 5655 -5695 -1823 457 -3646 8108 94 -3753 -2197 10096 8166 -3931 4271
15643D271N450m001n118n790J843n663K622O502j303m244M558M067O824L929O041
15628A9988o306j0818j3791J5241k985j4058l916J2444J0681l787J2237j3221
15616A709n852P891K759n117j154o103j4814M112M263N587R487p350P219J4840
15602A7477n248o968o249M189k913R945m296J061o164P709M261r328j380r382
15588g286o660k55Q162p101l912k026K986Q047L2o05K267l024J675R903j275j3211
15572a2283l538r944Q448J1251j115Q259j6797q948m393k207J1875J3305M570
15559a517K073P49K178l347j080P39m19n69k475j2204N156L126P015J0410J0093
15544A9928K642P67m45K939j1340j696j1575k145L811l008n338J2403J2395M418
$$ plain form
15643 4271 9721 5720 602 -5188 -3345 -9008 -6386 116 -1187 -5431 -873 3194 10018 13947 19988
15628 19988 13682 2864 -10927 4314 1329 -12729 -16645 -4201 6480 2693 14930 1709
15616 1709 -4143 3748 6507 1390 236 -5867 -20681 -16569 -12306 -6719 2768 -4582 2637 17477
15602 17477 12229 5261 -988 3201 288 10233 5937 6998 834 8543 12804 3476 2096 -7286
15588 -7286 -13946 -14201 -6039 -13140 -17052 -19078 -16092 -8045 -8013 -8618 -6351 -9375 -7700 2203 928 -12283
15572 -12283 -15821 -25765 -17317 -6066 -7181 1078 -15719 -24667 -29060 -31267 -19392 -6087 -1517
15559 -1517 556 1305 3483 136 -944 -205 -624 -1193 -3668 -15872 -10716 -7590 -575 9835 19928
15544 19928 22570 23337 22892 25831 14491 12795 1220 -925 2886 -122 -5460 6943 19338 23756
15530B3756j2959j1340P697P842n632q977P75j6171n963M045P921J2950J551p886
15516b391n757J1381q247O881K4444m803j2604o979p528J2233N190N21M189j6970
15502d40j2746p265P045J221n601O210J2253l286L818J2893q130l872R682p016
15488D766k228o002j5902p687R914J3094j2800m565O933J5158O454m323n126m648
15474f962R76J1145r993j1909R23j3579l84J1489J4063J80P803L407j1312j5240
15460a9393J9309J1078r010k342k298N470O570J133m113j0938K275O930j0306
15447e635l947j1237k2425J2125K4691J3476O290k1631j0970Q374J6670J0644
15435A6425M955J574k190o308m913k473p504p82K12j435p011j2502q925J4102
$$ plain form
15530 23756 10797 -543 7154 14996 9364 387 1162 -15009 -20972 -16927 -9006 3944 5495 -2391
15516 -2391 -8148 3233 -5014 1867 26311 21508 8904 1925 -5603 6630 11820 12341 16530 -440
15502 -440 -13186 -20451 -13406 -12185 -17786 -11576 677 -2609 1209 14102 5972 2100 11782 4766
15488 4766 2538 -3464 -19366 -27053 -17139 -4045 -16845 -21410 -14477 681 7135 2812 -2314 -6962
15474 -6962 -5986 5159 -4834 -16743 -15820 -29399 -29783 -18294 -4231 -4051 3752 7159 -4153 -19393
15460 -19393 -84 10994 1984 -358 -2656 2814 9384 10517 6404 -4534 -2259 4671 -5635
15447 -5635 -9582 -20819 -43244 -31119 -6428 7048 13338 -8293 -19263 -10889 5781 16425
15435 16425 21380 22954 20764 14456 9543 7070 -434 -1216 -1004 -2439 -9450 -21952 -30877 -16775
15421a6775J1414p219K527M485O352J374R899k55q088p36n792j9354m927J0633
15407a6462q941J4240J5628J4460q734q27R80j0328p420J1702l021R964O720M189
15393B2150J0241q342n273j3595l657J3560k525m616R142M296J4392L590k2206
15380A7157j2615K441j4351k04J3566L353k785k785m521L642Q539O213n956j908
15366I786R418m52o69p585j644L694o565k353J4666r75l0373n926J3237M201n11
15351b051j886K326j5947m221k389q448J5539L168L570j744o033N133M633n227
15337a3577j3025O582R339J3497J16l397K250J1270O576K955q810K652j6198j3946
15323a3716K269J1508N055k25R798j631m395j8380k85R689p445j6612O346Q272
$$ plain form
15421 -16775 -5361 -12580 -10053 -5568 784 2158 12057 11802 3714 2978 -2814 -22168 -27095 -16462
15407 -16462 -25403 -11163 4465 18925 10191 9364 10344 16 -7404 4298 1277 11241 17961 22150
15393 22150 32391 24049 18776 5181 1524 15084 12559 7943 17085 21381 35773 39363 17157
15380 17157 4542 6983 -7368 -7572 5994 9347 6562 3777 -744 2898 11437 17650 11694 9786
15366 9786 19204 18752 18083 10498 8854 12548 5983 3630 18296 17321 -13052 -18978 -5741 -1540 -2051
15351 -2051 -3937 -1611 -17558 -21779 -24168 -32616 -17077 -13909 -10339 -12083 -18116 -12983 -8350 -13577
15337 -13577 -26602 -20020 -10681 2816 2932 -465 1785 13055 19631 22586 13776 16428 230 -13716
15323 -13716 -11447 61 5116 4891 14689 13058 8663 -9717 -10002 -313 -7758 -24370 -18024 -9752
15309i752P184N853J4911J6496m040m528j1213j2863l189K231l930j724L061R096
15295G593J3852O336q229j4538j161m579n772j4108j888K634J0230J3310N121
15282H801n640o083j509k901Q662l586J244n110k998p413O745J0937R649J288
15268A2086J962p44n208J121Q917P188j3936j3630m877L689M251P30J7134N435
15254B4118k4948j3250O774Q178J0610k926j1156o671Q32j622m057m431K504J0030
15240f015J2602l954m312j2539M314j027J934p512r983J2953J2413l315o644Q472
15226b613p137o406J5960J5419o21J260j0927j5104o763j742M309M713J504M102
15212d046j014L132J325N934k727J0642k503j5761r830m046J1365J7647j3161
$$ plain form
15309 -9752 -2568 3285 18196 34692 30652 26124 14911 2048 -1141 1090 -2840 -4564 -1503 7593
15295 7593 21445 27781 19552 5014 3853 -726 -6498 -20606 -22494 -19860 -9630 3680 8801
15282 8801 3161 -2922 -4431 -7332 1330 -2256 -1012 -6122 -9120 -16533 -9788 1149 10798 12086
15268 12086 14048 13304 8096 9217 18134 25322 11386 -2244 -7121 -3432 819 1549 18683 24118
15254 24118 -830 -14080 -7306 872 11482 8556 -2600 -9271 -8439 -10061 -14118 -18549 -16045 -6015
15240 -6015 6587 2633 -1679 -14218 -9904 -10931 -8997 -16509 -26492 -13539 -1126 -4441 -11085 -2613
15226 -2613 -9750 -16156 -196 15223 14602 15862 4935 -10169 -16932 -18674 -14365 -9652 -8148 -4046
15212 -4046 -5060 -1928 -603 5331 2604 13246 10743 -5018 -14848 -18894 -7529 10118 -3043
15199c043n631O3K674O960p552M149Q124M896j4708O126J5995K430l22Q172k389
15184B5944l045P947J1546n963k1268j8529r769M919K204k398Q574l148M469J984
15170C467R872K967J085N175o651j9891j3790p36R254J162M654K05r292j984L49
15155a4154J060L068J3564J40o03Q665n393P697J4890r146q178j0312k023P790
15141G065J2620M864m977K274j6623l893j988J2201j211j0476j0566K56r944j0217
15127c0615M59J8187K0727j2214m559J1257Q51k07M024r63k990J703O64M069m331
15112F062J182K885o412j985j0759k01L322J387J1591l124j31l226R10K944J1166
15097A5611j745o562j0005p627R866R993J4009J0632J1377j4356k0199l305l528
$$ plain form
15199 -3043 -8674 -8611 -5937 1023 -6529 -2380 5744 10640 -4068 2058 18053 20483 20161 28333 25944
15184 25944 22899 30846 42392 36429 15161 -3368 -13137 -8218 -6014 -8412 162 -2986 1483 3467
15170 3467 13339 16306 17391 22566 15915 -3976 -17766 -18502 -9248 -8086 -3432 -3227 -12519 -14503 -14154
15155 -14154 -13094 -10026 3538 3678 3075 11740 6347 14044 28934 19788 11610 1298 -725 7065
15141 7065 19685 24549 19572 21846 5223 1330 -658 11543 10332 -144 -10710 -10454 -20398 -30615
15127 -30615 -30156 -11969 8758 -3456 -8015 3242 4093 3886 7910 6947 3957 5660 6324 10393 6062
15112 6062 7244 10129 3717 1732 -9027 -9228 -5906 -4519 7072 3948 3817 591 1501 4445 15611
15097 15611 13866 7304 -2701 -10328 -462 9531 23540 34172 45549 31193 10994 7689 4161
15084D161J0010M736K65j2005O735J743q109L376N868R876J1650j447l7P750j4116
15069C0456j6261O814K413k834o328n623J1510L418Q03j891q977K458L868N690
15055B5516J125n312k891j192J1400K946l065k541j74j213q591m614m397K3254
15041C0251j784p992M816J395k886N030L70k731k29o140j4912q885J0220J4561
15027B1084J731N926j1752R445L317l419m808J647R205k615J603O297o659j0047
15013B0955M710N653N64p927m83J4993J2883O20R686K003n710P023J4675p944
14999G1701Q022K3684K3996K9839M1763N8499Q0553J33998J78625K69427N12791
14988A432898R23881P50004k30480r12181p78218m17510k24281j36827r2067n4841
$$ plain form
15084 4161 14171 18907 19172 7167 13902 15645 7536 10912 16780 26656 38306 36859 36822 44572 30456
15069 30456 14195 21009 23422 20588 14260 8637 20147 23565 24368 22477 13500 15958 19826 25516
15055 25516 26641 21329 18438 17246 28646 31592 28527 25986 25812 24599 16008 11394 6997 30251
15041 30251 28467 20475 25291 26686 23800 28830 29200 26469 26240 20100 5188 -3697 6523 21084
15027 21084 22815 28741 16989 26434 29751 26332 21524 23171 32376 29761 31364 37661 31002 20955
15013 20955 25665 31318 31882 23955 23472 38465 51348 51968 61654 63657 57947 64970 79645 71701
14999 71701 79723 103407 127403 157242 199005 257504 338057 472055 650680 920107 1432898
14988 1432898 2356779 3106783 2876303 1964122 1185904 768394 544113 407286 315219 260378
14978B60378m1934l0372q658J688K134j4007l1140r645j2326j0218m315K665j848
14965A02402o825j2354k0707R332k751n73j2991n955j220p868l183R113M144j3981
14951C6583j7027J094J256k38J1849k972Q285N943L163p131j4672j7066q840Q080
14937H307K3443k66j1289J852l501J990j2263n74r897j03J9791J1433O06j2700
14923A6829j2284p53P263R013N155j1473m99N362j109j4733J0592J5226K830j24
14909C1295l649j2349r506n537N249J1978j051L392o110q308p254m071l42j34
14895f397l187O021P000M860m570l4M469P610l773o180M250N86N963J3303r633
14880B0288r663L155n981m391N642j341M758J078j8154N296J3174Q830L554k463
$$ plain form
14978 260378 218444 188072 179414 181102 183236 169229 138089 128444 116118 105900 101585 104250 102402
14965 102402 95577 83223 62516 71848 69097 68524 55533 49578 48358 40490 37307 46420 50564 36583
14951 36583 19556 20650 21906 21668 33517 30545 38830 44773 47936 40805 26133 9067 227 8307
14937 8307 31750 31484 20195 22047 18546 20536 8273 7699 -2198 -2301 17490 28923 29529 16829
14923 16829 4545 3792 11055 20068 25223 13750 13251 18613 17504 2771 13363 28589 31419 31295
14909 31295 27646 15297 5791 254 5503 17481 16430 19822 13712 5404 -1850 -5921 -6263 -6397
14895 -6397 -9584 -3563 3437 8297 3727 3693 8162 15772 11999 5819 10069 10655 16618 29921 20288
14880 20288 10625 13780 7799 3408 9050 7709 12467 13545 -4609 687 13861 22691 26245 23782
14866B3782k544R771O95k957K361K316l839J200n845K479N212J1389n573k0288
14852A8159j3535k89K956m386L680O183R714L690L480J1918j7943q819j1171Q535
14838A2172L825O056r807j7412J1473P953K603n263r122j936L113l435q438K903
14824e315J1026J0922o56m786m593O862j0152j5815N361J7373M679m736p111M665
14810G724J7519l095l481j2338k468L83R167o321k2370K263Q615J4241J806M70
14796A2115J2688O970K622j2174j1003l811P814M017j0498q169R094j408j1905
14783c648J091R183R424O392J055N105q777j928m996l518p46q38K245J1747o53
14768B1138p709M319O590N078j5458p48R453m954K602N264n541o610J070L918
$$ plain form
14866 23782 21238 31009 31704 28747 31108 33424 29585 30785 24940 27419 32631 44020 38447 18159
14852 18159 4624 4335 7291 2905 6585 12768 22482 26172 29652 41570 23627 14808 3637 12172
14838 12172 15997 22053 12246 -5166 6307 14260 16863 11600 2478 542 3655 220 -8218 -5315
14824 -5315 5711 16633 15977 11191 6598 13460 3308 -12507 -7146 10227 14906 10170 3059 7724
14810 7724 25243 22148 18667 6329 3861 4244 13411 7090 -15280 -13017 -4402 9839 11645 12115
14796 12115 24803 31773 34395 22221 11218 7407 15221 19238 8740 571 9665 8257 -3648
14783 -3648 -2557 6626 16050 22442 23497 28602 19825 17897 12901 9383 8637 7799 10044 21791 21138
14768 21138 13429 17748 24338 29416 13958 13210 22663 17709 20311 25575 20034 13424 14494 18412
14754A8412q714j0266p615O12P485J0055l32n770l621L821M486J0458J158j0182
14740I987m996R900N906l698p197N449N522M075O317l711L357n48m009j0225J2342
14725B8471n561j3473r14N269j1005j579K0413P519n605j400j4288J303J3980
14712B3130R920l814p672k560j0859o505j871J0547N53n573j1142K939J6963J6608
14698C0664P079j2626K543P783k923j8788l839r577l676J1114j615Q991k792K368
14684A4706J1536q373m364J1305P53J3888r363n104r734M944O124j147m429L840
14670B4582j2586n595m327R608R179J0374m147k69p738J178R497M994j3627m038
14656A7085j1280M2J1049J1071P973J071r205N003M411L680p034p976j0168J4004
$$ plain form
14754 18412 9698 -568 -8183 -7571 -86 9969 9637 3867 246 4067 8553 19011 20169 9987
14740 9987 4991 14891 20797 17099 9902 15351 20873 24948 31265 27554 30911 30363 26354 16129 28471
14725 28471 22910 9437 8523 13792 2787 1208 21621 29140 23535 22135 7847 9150 23130
14712 23130 33050 29236 21564 19004 8145 1640 -231 10316 10869 5296 -5846 -2907 14056 30664
14698 30664 37743 25117 27660 35443 32520 13732 9893 316 -3360 7754 6139 15130 12338 14706
14684 14706 26242 17869 13505 24810 25563 39451 30088 24984 15250 20194 26318 25171 20742 24582
14670 24582 11996 6401 2074 11682 20861 31235 27088 26819 19081 20259 29756 34750 21123 17085
14656 17085 5805 5847 16896 27967 35940 37011 27806 32809 37220 40900 33866 25890 15722 29726
14642B9726J0954J990J726M501p120j7832J847O960j0262r997m274P555m7j731
14628A3996K3J256p676O78J9868L068N672m976o373j723J6454n805q395q258q88
14613A6921M12j5222J983R528R674n053o958P703O68j992k884n639l879k659M628
14598G231R172Q887N5r427J1767Q604N558o343j0224j3481K199J2008N799j2701
14584A9104N20p415J334o757J845J8360J4671k56m502P04N093Q485n296j4627
14570C1263L272r127j6320Q836r114J2286P988j4074p953l748k018O143J5840
14557B3274J2067K791o529k303L546M867n867q535Jm66J261P387Q124O816L80
14542D6814p870p847l258P68J1871K843l27O194l420k6595r267J1009N659P38
$$ plain form
14642 29726 40680 42670 44396 48897 41777 23945 25792 32752 22490 12493 8219 15774 15727 13996
14628 13996 14019 15275 7599 8277 28145 31213 36885 31909 25536 23813 40267 34462 26067 17809 16921
14613 16921 17333 2111 4094 13622 23296 18243 11285 18988 19656 17664 14780 9141 5262 2603 7231
14598 7231 16403 25290 25345 15918 27685 36289 41847 35504 25280 11799 13998 26006 31805 19104
14584 19104 19624 12209 13543 6786 8631 26991 41662 41406 36904 37608 42701 51186 45890 31263
14570 31263 34535 25408 9088 17924 8810 21096 29084 15010 7057 3309 1291 7434 23274
14557 23274 35341 38132 31603 29300 32846 37713 31846 23311 23312 22846 24107 31494 39618 46434 46814
14542 46814 38944 31097 27839 28607 40478 43321 42994 49188 45768 19173 9906 20915 26574 27312
14528B7312N886P185j5589p449l852J5818m910P04k293n814j7194n619J3019J229
14514H433o256R435K895P50J416K692K3594J0463m68K08j8486j2636r58n206L426
14499A9302m081k043j3708J3016J0418O117J5449q528j5762J702J4937L933K558
14486D3310j401k385L606l744o355P98j2254k189J847J4374J872O495J323n424
14472C9873O707j623p152o208L185k310k971M967p34j456o47N588j233J0918O831
14457E3735L314k224L065n091n88L242m952j5043L79k744m874J980P333O819q8
14442D4263Q600P160l370j4093k073J279J452j0045m50r964n480M804N218o389
14428B0912m8K0P40K684O962M927M199M291J136j0525j3049j289L827O0J990j892
$$ plain form
14528 27312 33198 40383 24794 17345 13493 29311 24401 25105 22812 16998 -196 -5815 7204 8433
14514 8433 2177 11612 14507 15257 16673 19365 42959 53422 52954 53162 34676 22040 21082 15876 19302
14499 19302 15221 13178 -530 12486 22904 29021 44470 35942 20180 21882 36819 40752 43310
14486 43310 41909 39524 43130 39386 33031 33829 21575 19386 21233 35607 37479 43974 45297 39873
14472 39873 46580 44957 37805 31597 34782 32472 29501 34468 33734 32278 31631 37219 35986 46904 53735
14457 53735 57049 54825 57890 52799 52211 55453 50501 35458 35837 33093 28219 30199 37532 44351 44263
14442 44263 52863 60023 56653 42560 40487 41766 43218 33173 32723 22759 17279 22083 27301 20912
14428 20912 20864 20884 21624 24308 31270 36197 40396 44687 45823 35298 22249 20960 24787 24847 26837 24945
14412B4945K811Q652p658p93L645q207K390J343J0413O19l345q758N824k784K629
14397C1726p805K41n212J3340Q249r021J236J2034j2449L935R908q962j4654r41
14383B1625Q376K679K0943M759K935l120j2491j8389k665L74P263K777P063k804
14369C9325L756j314J1267l704j0727M860r47j6699q166M66J082N511J1165L902
14355C9777M013O127l481n676m277l811O815N076j988M732Q825J859J615K826
14341F2432r819N15K0379p617K079j5458p082P320m393j4791l153K998J4757P682
14327E5849R096r241q492n041K367K250j270p638L682r70Q599j328M584m137K251
14312E0561k181l66m50l470Q45O212K685Q50r075P038J6198J3715n432j5147K134
$$ plain form
14412 24945 27756 36408 28750 27957 31602 23395 25785 27128 37541 38160 34815 26057 31881 29097 31726
14397 31726 23921 24162 18950 32290 40539 31518 32754 44788 32339 36274 46182 37220 22566 21625
14383 21625 30001 32680 53623 58382 61317 58197 45706 27317 24652 25026 32289 35066 42129 39325
14369 39325 43081 41767 53034 49330 38603 43463 42516 25817 17651 18117 19199 24710 35875 39777
14355 39777 43790 49917 46436 40760 36483 32672 39487 44563 42575 47307 56132 57991 59606 62432
14341 62432 52613 53128 73507 65890 67969 52511 45429 52749 48356 33565 30412 33410 48167 55849
14327 55849 64945 55704 47212 42171 44538 46788 45518 37880 41562 40592 49191 47863 52447 48310 50561
14312 50561 48380 48014 47564 44094 44939 51151 53836 54686 45611 52649 68847 82562 77130 61983 64117
14297F4117n802j463j961m841o452p373j80M632j1138J4648J0420J1115M010q165
14283F1567p174o749k939L127R237O124j017r096k074M426M889n28j430m487L365
14268E7241L076N253j422p168o902j012j0390J2162L84j1040P040K5395J6427
14255H9044p730j2951m222J014q826k325M367l303J1006J2980j1563M128q642
14242F2977m921Q256J5353n59n244l239J616j828q141q890m352j37L600L18P815
14227F2624l037l709o9p79j1306O194L206k056n240L793R043P167K805n84n442
14212F2610k002j2085k519K593Q493P783n404j2954k466k08j9153k813J9632j994
14198C9513o613k687Q519l732K831J7891m963J940O069l928J756j249l078O657
$$ plain form
14297 64117 58315 56852 54891 50050 43598 36225 36045 40677 29539 44187 54607 65722 69732 61567
14283 61567 54393 47644 44705 47832 57069 63193 62176 53080 51006 55432 60321 59793 58363 53876 57241
14268 57241 60317 65570 64148 56980 50078 49066 38676 50838 51222 40182 47222 72617 89044
14255 89044 81314 68363 64141 65155 56329 54004 58371 55068 66074 79054 67491 71619 62977
14242 62977 58056 66312 81665 81106 75862 72623 74239 72411 64270 55380 51028 50891 54491 54809 62624
14227 62624 59587 55878 55809 55030 43724 49918 53124 51068 45828 49621 58664 65831 68636 68052 62610
14212 62610 60608 48523 46004 48597 57090 64873 59469 46515 44049 43841 24688 21875 41507 39513
14198 39513 32900 30213 38732 35000 37831 55722 50759 52699 58768 54840 56596 55347 52269 58926
14184E8926n378n65K649j3092J734L207K632j6774p415M30J5194N826J7365l903
14170F0836k4309j9275q82p656J3418J3910J0570m46j5773p618j562M317J1186
14157C6716l233P187K1420n514j4081K108O01J428l263J930M540m336J303o160
14143D0646j2319p231j0739Q297L654K566J808J013M541K056Q98K790M444O033
14129D8457K728l049j759j184K322k045L921J0761L044j1271j7979k5546L159
14116A1559J4507J3679O492R432L992n813Q79j490J847J0247O044j966j6643J363
14102E4129m129j239R796L774O362j4268r553j2588m458J3892l639j922J0877
14089D7034Q543n990n518O088O596j612L061l566l708o039J0772p307j2462N393
$$ plain form
14184 58926 53548 52983 55632 42540 44274 47481 50113 33339 25924 26354 41548 47374 64739 60836
14170 60836 36527 17252 16370 8714 22132 36042 46612 46166 30393 22775 21213 25530 36716
14157 36716 33483 40670 62090 56576 42495 44603 45204 46632 43369 45299 49839 45503 46806 40646
14143 40646 28327 21096 10357 18654 22308 24874 26682 27695 32236 34292 35190 37980 42424 48457
14129 48457 51185 48136 46377 45193 47515 45470 49391 60152 63196 51925 33946 8400 11559
14116 11559 26066 39745 46237 55669 59661 53848 54727 53237 55084 65331 71375 69409 52766 54129
14102 54129 50000 48761 58557 62331 68693 54425 44872 32284 27826 41718 38079 36157 47034
14089 47034 55577 49587 44069 50157 56753 55141 58202 54636 50928 44889 55661 48354 35892 41285
14075D1285J2267O685J78K992q796j1791J3448J3476Q618l973j1081n099o410
14062E1799q401M558J2905k261L53j7710j70Q624M649J0110J222q595n88p098
14048D9397K307M069J1101J2M811j2818j4994L394J5836J1971R060r221j9731
14035E5194o913P281O221J774Q63q445r391m122L290n688k91M666P204R243R826
14020G0712m13j1752j8755n305Q017J0840Q512K762N436m542M90O74m728j436
14006F0512J523n263L802M487m271M806J9162J1649l881l623r916j3897M060J0373
13992G9523j288p339r012l17O089J1663n870m530M843J80n226O943l434J802J3451
13977H7478K54l569o543m510K957m12L702M236o509J84R835l767j2972n790m336
$$ plain form
14075 41285 53552 60237 60415 63407 54611 42820 56268 69744 78362 74389 63308 58209 51799
14062 51799 43398 47956 60861 58600 58953 41243 41073 49697 54346 64456 65678 57083 56495 49397
14048 49397 51704 55773 66874 66886 71697 58879 43885 47279 63115 75086 84146 74925 55194
14035 55194 48281 55562 61783 63557 64420 55975 46584 42462 45752 40064 39773 44439 51643 60886 70712
14020 70712 70299 58547 39792 34487 42504 53344 61856 64618 70054 65512 66002 66676 61948 60512
14006 60512 62035 56772 60574 65061 60790 65596 84758 96407 92526 88903 78987 65090 69150 79523
13992 79523 78235 70896 61884 61567 67656 79319 73449 68919 73762 73942 68716 75659 72225 74027 87478
13977 87478 87732 84163 77620 73110 76067 75655 79357 83593 77084 77268 87103 83336 70364 64574 60238
13962F0238p706R600P931J2681o305j2703L917K0776M813Q05o706q31j424M936
13948I0022J1582Q464J528j152j9938k50n123p316o680K820O308L828O396L2706
13934A23195J890j2353l945J1309j1438K552J4642J343n949o569R333q64p539
13921A15607k459J0150L433p071J3815J7837j1353n034m0K80j2249o742j1478
13908A04696J169J2254m777l985J3763J7080L295J0317L260j0643o531J1907q180
13895A43625j4778J3237J350j1620r406j080O61J2925j7597j0933Q170K750J1066
13882A28370L676m525j0410p65j4397J814l932o080K82J0438l540n771N450o215
13868I4395l760J1924L98p924l055N118j2891k504J0906q18K649K0874n345j7682
$$ plain form
13962 60238 52532 62132 70063 82744 76439 63736 67653 88429 93242 94047 87341 86510 85086 90022
13948 90022 101604 110068 111596 110444 90506 90256 85133 77817 71137 73957 80265 84093 90489 123195
13934 123195 125085 112732 108787 120096 108658 111210 125852 127195 121246 114677 124010 123146 115607
13921 115607 113148 123298 126731 119660 133475 151312 139959 134925 134885 135165 122916 116174 104696
13908 104696 105865 118119 113342 109357 123120 140200 143495 153812 157072 146429 139898 151805 143625
13895 143625 128847 142084 143434 131814 122408 121328 121989 134914 117317 106384 114554 117304 128370
13882 128370 132046 127521 117111 116346 101949 103763 99831 93751 94033 104471 100931 95160 100610 94395
13868 94395 90635 102559 102957 95033 91978 97096 84205 81701 92607 91789 94438 115312 109967 92285
13854I2285j9400l212L870R538L606q256r907k030K0293J5746j4544o022Q214
13841I0181p937k319j872j0208n009J5911R564l592N082N535r985o279l587o265
13827F9220N817J509n48m851J511L468k054p320m707R761o547j2080J835L532
13813E8546J0383j735j959K511J0802l829k128j7767k242j624K729L051R272m007
13799F2003L628J7841N503p959L700P396j5607Q640J5607K652j5871j8785r245
13786E9503O845k38J0034N472J770R461q08n566n373N60l609P285j1382l133j4401
13771E6420q868K2095K97n01p787l186J2206K885j1715M485J0771J74J4910Q31
13757I3017k1793j0400j190J9605J1883m439J402O273j0910j3682K511n902q634
$$ plain form
13854 92285 72885 69673 73543 83081 86687 78431 68524 66494 86787 102533 87989 81967 90181
13841 90181 82244 79925 78053 67845 62836 78747 88311 84719 89801 95336 85351 79072 75485 69220
13827 69220 75037 76546 75998 71147 72658 76126 74072 66752 62045 71806 65259 53179 55014 58546
13813 58546 68929 67194 65235 67746 78548 74719 72591 54824 52582 50958 53687 56738 66010 62003
13799 62003 65631 83472 88975 81016 84716 92112 76505 85145 100752 103404 87533 68748 59503
13786 59503 66348 66110 76144 81616 83386 92847 92039 86473 81100 81660 78051 85336 73954 70821 56420
13771 56420 47552 69647 69944 69443 61656 58470 70676 73561 61846 66331 77102 77276 92186 93017
13757 93017 71224 60824 59634 79239 91122 86683 88085 94358 83448 69766 72277 66375 57741
13744E7741p65P925Q199j041l42j0196n242Q29p219J785R331o06R017J6153j871
13729H3698L166j055J2230J468j0890o290q433O888r332J891M194R50o172P415
13715G9728R28J256j543q253O615J4188Q993K527J3544k963n572k554n205q716
13701I2973j1739J834J6113O450m443j8674n207N934m878j2724k246Q077M813
13688G6283J7577M289l505Q390m244k284l146j2872r177j745N993N049j044q225
13674G1339K260L556J3456J3897n405j0601l153m512r494J0215J79N638J051j6047
13660G2379P862Q825k093O070m619r298K586K0179K081k653j4658j1558N106K658
13646H2867J3657m909n213K824K9477J3799k241j2590r036O955k63k720J2940
$$ plain form
13744 57741 56976 64901 73100 72059 71717 61521 56279 57108 49889 51674 61005 60399 69416 85569 83698
13729 83698 86864 85809 98039 99507 88617 82327 73894 80782 71450 73341 77535 78485 72313 79728
13715 79728 80656 81912 80369 72116 78731 92919 101912 104439 117983 115020 109448 106894 101689 92973
13701 92973 81234 83068 99181 105631 101188 82514 77307 83241 78363 65639 63393 71470 76283
13688 76283 93860 98149 94644 103034 98790 96506 93360 80488 71311 69566 75559 80608 79564 71339
13674 71339 73599 77155 90611 104508 99103 88502 85349 80837 71343 81558 81737 87375 88426 72379
13660 72379 80241 89066 86973 93043 88424 79126 81712 101891 103972 101319 86661 75103 80209 82867
13646 82867 96524 91615 86402 89226 118703 132502 130261 117671 108635 115590 115327 112607 125547
13633A25547m169q822n217j003M741N669J77N302r770o741J6710q050j2523N084
13619A06935K721m579l344j3972j3400O646J8899J5695m678l383o88k710J1469
13606A15611m168j9509m634R376M088l752Q82J3199N76j0343J0068M469r778m531
13592A01554J2908J5233R052n468k496K363j3346j7995r259Q139J1369P902L805
13579A23761J576p687j0608j166j679n032m012J5457M986J3785N634O52m090o599
13565A24978j0990q480p928m635k322J6280o551o500N139o501m322J263K0033
13552A09464L657P826J7892k509k30j056j1285m82j2942l341j504N813O627J1449
13538A29379J1796j2238J553M503J646j277k39j615O21j0284q210L103N447J0424
$$ plain form
13633 125547 121378 112556 107339 106336 111077 116746 116923 122225 112455 105714 122424 114374 101851 106935
13619 106935 109656 105077 101733 87761 74361 81007 99906 115601 110923 107540 106852 104142 115611
13606 115611 111443 91934 87300 96676 100764 97012 97894 111093 111669 101326 111394 115863 106085 101554
13592 101554 114462 129695 138747 133279 130783 133146 119800 101805 92546 100685 112054 119956 123761
13579 123761 125337 117650 107042 105876 104197 99165 95153 110610 115596 129381 135015 135667 131577 124978
13565 124978 113988 105508 97580 92945 90623 106903 100352 93852 98991 92490 88168 89431 109464
13552 109464 113121 120947 138839 136330 136100 135044 123759 123277 110335 106994 105490 111303 117930 129379
13538 129379 141175 128937 130490 134993 136639 135362 135123 133508 134129 123845 115635 118738 124185 134609
13524A34609O074L618K790j871o178n329k458n830p858n310K650N448J308L375
13510A25038j595j5154j057J5420L402m378k330p271J3196n251K288J1854j653
13497A32509M46j766m548n359J515O978Q076K2666N621j3190j0507l394l545M668
13483A40170p340j0488o287r307q575l765K0785Q956J4020J1369M621l644K219
13470A52734j4898o515n905M260J2082J1264O387j0878j0604j3190j817K018O225
13457A31163J4686N104O06M470O137o842r426n371j137J0220R482p707o195M717
13443A49907m313P989L060r673j020O405M449n467l503j205m107J882N410J5040
13429A64854P921p24P689J1795r319l1522j2782r18J519J400Q750J1377j750J477
$$ plain form
13524 134609 140683 144301 147091 145220 139042 133713 131255 125425 117567 112257 114907 120355 121663 125038
13510 125038 123443 108289 107232 122652 126054 121676 119346 112075 125271 120020 122308 134162 132509
13497 132509 132955 131189 126641 121282 122797 129775 137851 160517 166138 152948 142441 139047 135502 140170
13483 140170 132830 122342 116055 106748 98173 94408 115193 124149 138169 149538 154159 150515 152734
13470 152734 137836 131321 125416 129676 141758 153022 159409 148531 137927 124737 122920 124938 131163
13457 131163 145849 150953 151559 156029 162166 155324 145898 140527 139390 149610 159092 151385 145190 149907
13443 149907 145594 153583 156643 146970 145950 152355 156804 151337 147834 146629 142522 144404 149814 164854
13429 164854 172775 172051 179740 191535 182216 150694 137912 136994 138513 139913 148663 160040 158290 159767
13415A59767j618P07r76m266J1438R172R62o381n035L719N813q12j5810k447k276
13400A51957k377O485R848j3225N157L40k0140q597M950J7914P284Q20O187j2298
13386A54305K268K1758P796Q090j0552j9545m341Q715J2686l130M613j2042l92
13373A70229Q874l210J619m158j2849l993m83Q228Q883J2047l386q424Q697N566
13359A87640n765j4331n107n647l065q370N603J1828K4862J7031p323j1031J1748
13346A98073K508r81j1644J0046O645m006k573R790P24j9247R4O070k990L086
13332A95595K738m108j704r387j565L912J599l470O688K0990K711n693k839n634
13318A99833m423J0087J0480J0091O787j913m80l47O686P613p711r027j2523k678
$$ plain form
13415 159767 158149 158856 157880 153614 165052 174224 175186 168805 163770 167489 173302 172490 156680 154233 151957
13400 151957 149580 156065 165913 152688 157845 158185 138045 129448 134398 152312 159596 160416 166603 154305
13386 154305 156573 178331 186127 194217 183665 164120 159779 168494 181180 178050 182663 170621 170229
13373 170229 179103 175893 177512 173354 160505 156512 156029 164257 173140 185187 181801 173377 182074 187640
13359 187640 181875 167544 162437 156790 153725 145355 150958 162786 187648 204679 197356 186325 198073
13346 198073 200581 199600 187956 198002 204647 200641 198068 207858 208582 189335 189429 195499 192509 195595
13332 195595 198333 194225 192521 183134 181569 185481 187080 183610 190298 211288 213999 208306 205467 199833
13318 199833 195410 205497 215977 226068 232855 230942 230462 230115 236801 244414 236703 227676 215153 212475
13304B12475K302R369L725j8862l21J1504M05r124k792J0365r009j0960j42L716
13290B02651jM06o683j556N910R206l214l773N023P871L304J0530L847K329P979
13275B43829k261j0547K944N673n599j3641j3898O174J4451M405L115P350J0696
13262B52691n461j0529L228N295l7k974j53M220P620Q00J023n097j3156q805o577
13247B22088Q464R154K936l918r656P021l858J2323J0412j3098j13J1003K863
13234B55621n656q196M613M779J246J0765O48M050m705J750l653L77J009K93N388
13219B68329l042k34P184K643j597Q047m219m192O075J1684L5688J3273n06l47
13205C38786j2398J3770K0384K9271O0608P9105R7754J54076K31446L45599N59853
$$ plain form
13304 212475 214777 224146 227871 209009 208688 220192 220597 211473 208681 219046 210037 199077 198935 202651
13290 202651 202650 203056 196373 194817 200727 209933 206719 202946 207969 215840 219144 229674 233521 235850 243829
13275 243829 241568 231021 233965 239638 234039 220398 206500 212674 227125 231530 234645 241995 252691
13262 252691 247230 236701 239929 245224 245187 242213 242060 246280 253900 254700 255723 250626 237470 228665 222088
13247 222088 230552 239706 242642 238724 229068 236089 232231 244554 254966 241868 241755 252758 255621
13234 255621 249965 241769 246382 251161 252407 263172 263820 267870 263165 264915 261262 261639 262648 262941 268329
13219 268329 265287 265053 272237 274880 273283 281330 277111 272919 278994 290678 326366 339639 339133 338786
13205 338786 326388 340158 360542 389813 450421 529526 627280 781356 1012802 1358401 1918254
13194A918254O34166K00229m09692o55543m77149k84944j72894j05367o0925n6636
13184E29499m2824k6381j0209j4948j4315j3981k0621k4853j7381o370N23P333
13172C45472J2351k020j0232r519o90j0210j4208j2990k345J9188P815j7808n746
13159B99058L301O221R795J9107J438o230J1669r958p937k614J026J2355J2677
13146C49908j0447o283q403j630R643J0896J7143k208j3644j2959R335Q943k215
13133C48079O930J0694J1178j2115j2211j845R39J3028K147k211J1873J9265J1533
13120D07284n745j854l943l320Q799j1662n268K546K752N734J3145j0152j8151
13107C80165r505m227j203J7195J0061Q135J3624M908O699L385o33L348R751j173
$$ plain form
13194 1918254 2552420 2752649 2342957 1687414 1210265 925321 752427 647060 586135 529499
13184 529499 486675 460294 450085 435137 420822 406841 386220 361367 343986 337616 338139 345472
13172 345472 357823 355803 345571 336052 335362 325152 310944 297954 295609 314797 322612 304804 299058
13159 299058 302359 308580 318375 337482 338920 332690 344359 334401 326464 323850 324876 337231 349908
13146 349908 339461 333178 324775 323145 332788 343684 360827 358619 344975 332016 341351 350294 348079
13133 348079 355009 365703 376881 364766 352555 350710 351649 364677 366824 364613 376486 395751 407284
13120 407284 401539 399685 395742 392422 401221 389559 384291 386837 389589 395323 408468 398316 380165
13107 380165 370660 366433 365230 382425 392486 400621 414245 419153 425852 429237 428604 431952 441703 440530
13093D40530j122L234n755n055J4475J1323K145Q250O18R902P593k76k463j8370
13079D65029j2173k213j6J4446J1933l292n365N157Q141k762Q410j840k67r880
13065D75308q113m9p012O03J0758k180K72j4898O668J3485j581K5593P172m307
13051E01719n143P722P623j0421O932k845j4633m486p555M630J109J3284J422
13038D99358l259m44L9J3508n51j0854Q479J6512K160R516R007K587K797p061
13024E41794J0408J5038J1608J9860L7927L7491J3474M568q652n89J5382j4545
13012F83764j8066l558n332K0569K5079J2383j2739l7100o4383l3602j3947K8588
13000E81656M5364L9902J5073o147j6174j6751k7049j8868j604J805k677J1259
$$ plain form
13093 440530 439408 442642 436887 431832 446307 457630 459775 468025 468643 478545 486138 485862 483399 465029
13079 465029 452856 450643 450627 465073 477006 473714 468349 473506 481647 478885 487295 485455 485188 475308
13065 475308 467195 467146 460134 460737 471495 469315 469587 454689 461357 474842 473261 498854 506026 501719
13051 501719 496576 504298 511921 501500 508432 505587 490954 486468 478913 483543 484652 497936 499358
13038 499358 496099 495655 495694 509202 508651 497797 506276 522788 524948 534464 543471 546058 548855 541794
13024 541794 552202 567240 578848 598708 636635 674126 687600 692168 683516 682927 698309 683764
13012 683764 665698 662140 656808 677377 702456 714839 702100 665000 600617 567015 553068 581656
13000 581656 627020 666922 681995 675848 659674 642923 615874 597006 595402 597207 594530 605789
12988F05789n454k313P896L905l840J8972J8191j248q946L117o543N155J5805
12975F50486J8988J8083Q533J1978o240l4058l0013M543K0205K2157J4125l342
12963F95445o15j174Q66o544q204m88p877J468j0380L547p74j2427M190J9626
12949F76659J0581N588N524J6j3315p087k645R093J7208K4179K4986J2602k838
12936G60551R68K922J0496M496N678j0823L296Q570K6993L8052K0009J1832j1160
12923H71880p997l718K508j886R753L2978K5956q037j9107n695k1968m573K87
12910H70381m7Q14K9564L3976K1924J1420N132P041Q917J2342qm962O090L966
12896A006550J9165L7485M4880M0953O3743Q6063R9409J10373J38495K01788L17083
$$ plain form
12988 605789 600335 598022 605918 609823 605983 624955 643146 641898 632952 636069 629526 634681 650486
12975 650486 669474 687557 696090 708068 701828 667770 637757 642300 662505 684662 698787 695445
12963 695445 694830 693656 694522 687978 679774 679286 671409 672877 662497 666044 665270 652843 657033 676659
12949 676659 687240 692828 698352 698368 685053 677966 675321 684414 701622 725801 750787 763389 760551
12936 760551 761519 764441 774937 779433 785111 774288 777584 786154 813147 851199 871208 883040 871880
12923 871880 863883 860165 862673 860787 870540 903518 929474 921437 902330 896635 874667 870094 870381
12910 870381 870334 871148 900712 934688 956612 968032 973164 980205 989122 1001464 1001456 996494 1002584 1006550
12896 1006550 1025715 1063200 1108080 1149033 1212776 1298839 1398248 1508621 1647116 1848904 2165987
12885B165987M96964O90873N13309j18828o08837o32959l92938j78120k127J64726
12875B098050K30439J50976L9487l3486j21493j91330j81472j16761m6672k4046
12865A803692j5372j0363J0294N376O151j0336k0874O663P532n42j2117q907J4963
12852A776160J7099K8034M5178K7889L5530L2685N0318Q3270J23357J84963K43290
12841B647773L45077N51230O14294L95954O3544l65351n87352n47104l20979j86347
12831B610739j14680r0118o7003n1613k9208r577N594L6992M7695M7201J2399
12820B398421r025K4860P3634J51177K01219K63851L82138M15317J29597k25440
12810C805749l74625k82475j48805o5692k519M2875M9387L3744K9714K9699J6512
$$ plain form
12885 2165987 2662951 3353824 3867133 3748305 3139468 2506509 2113571 1935451 1933324 2098050
12875 2098050 2328489 2479465 2518952 2485466 2363973 2172643 1991171 1874410 1827738 1803692
12865 1803692 1788320 1777957 1788251 1793627 1799778 1789442 1768568 1775231 1782763 1782221 1770104 1761197 1776160
12852 1776160 1793259 1821293 1866471 1894360 1929890 1962575 2012893 2096163 2219520 2404483 2647773
12841 2647773 2992850 3544080 4158374 4554328 4617872 4252521 3665169 3118065 2797086 2610739
12831 2610739 2496059 2405941 2338938 2287325 2258117 2248540 2254134 2291126 2338821 2386022 2398421
12820 2398421 2389396 2414256 2487890 2639067 2840286 3104137 3486275 3901592 4031189 3805749
12810 3805749 3431124 3148649 2999844 2934152 2931633 2974508 3023895 3057639 3087353 3117052 3133564
12799C133564J6462P1344J26760J30598J08659R1740P8609Q7956J11545R7443
12789D054680R3403R5767J51549K06815K50390K73689L05641L59216M06329M24861
12779F622340M28835M41418M70043O70467R30198J007096Q13069O05089N88033
12770A2576588P52246J090562J576958K154207K832809L823029N275696P212252
12762C7294347R837773J3132805J7716856K5296658L8164304O1867760J02655913
12755C05966416J23192438M5107927p0158968j24990849r7043918n5568224l1594849
12748I4909973j9176691j2980462r690741p178723m925565l304362k443574k442886
12740C2766969k842884l057485k954864k591535k117371j695651j447188j287297
$$ plain form
12799 3133564 3150026 3221370 3348130 3478728 3587387 3679127 3757736 3845692 3957237 4054680
12789 4054680 4148083 4243850 4395399 4602214 4852604 5126293 5431934 5791150 6197479 6622340
12779 6622340 7051175 7492593 7962636 8633103 9563301 10570397 11383466 11988555 12576588
12770 12576588 13328834 14419396 15996354 18150561 20983370 24806399 30082095 37294347
12762 37294347 47132120 60264925 77981781 103278439 141442743 203310503 305966416
12755 305966416 429158854 474266781 404107813 279116964 182073046 126504822 94909973
12748 94909973 75733282 62752820 53062079 45883356 40957791 37653429 35209855 32766969
12740 32766969 29924085 26866600 23911736 21320201 19202830 17507179 16059991 14772694
12732A4772694j178185j141748j035093q93385p23520n47131m45316l72661l35928
12723H099727l01623k65118k37498k58238k72924k88200k61787j97533j73501
12714E843305j47550r9181o1006j8379j9795m0029o8226n6977l1458j6924n033
12703E278747j5491k1265M472J4164J1361K3094K8741K4768k04q795J8203N2524
12691E410319P8296Q1613O0376M0782N0695P7831J12755J16614J14194J00999
12681F244474Q2941Q8269R4484J00916J21408J47351J60615J60667J32218J54875
12671G488218J67348J75888J70938J75156J89399J93537J97812K33703K31437
12662I223436K29719K18991K31142K46767K27149K47345K65515K73022K65558
$$ plain form
12732 14772694 13594509 12452761 11417668 10524283 9800763 9253632 8808316 8435655 8099727
12723 8099727 7798104 7532986 7295488 7037250 6764326 6476126 6214339 6016806 5843305
12714 5843305 5695755 5596574 5535568 5517189 5497394 5457365 5389139 5332162 5300704 5283780 5278747
12703 5278747 5263256 5241991 5246463 5260627 5271988 5295082 5323823 5348591 5348387 5339592 5357795 5410319
12691 5410319 5488615 5570228 5630604 5671386 5722081 5799912 5912667 6029281 6143475 6244474
12681 6244474 6327415 6415684 6510168 6611084 6732492 6879843 7040458 7201125 7333343 7488218
12671 7488218 7655566 7831454 8002392 8177548 8366947 8560484 8758296 8991999 9223436
12662 9223436 9453155 9672146 9903288 10150055 10377204 10624549 10890064 11163086 11428644
12653A1428644K66603K82555L08726L16191K95177L07218L28949L62972L85653
12644A4282688M16794M80258N59601O02250P29983J008048J368158J297955L80037
12635B1125772n76951p83866m10108o6915Q7321J20163J16030J35437J56549J58839
12625B0062271J30641J07779J06005R8169R0637O6623L4841J2838K2892J2468
12615B0745164k0446l6653o6017q8396j13477j35975j50162j64191j81388k00190
12605A9588269j86790j98341k12787k32054k49727k70230k94892l09194l24306
12596A7309948l46921l38143l26502l33720l33673l20529l23446l19555l02760
12587A4364699l26874l07446l20180l09820k88397l00298k91796k87144k62611
$$ plain form
12653 11428644 11695247 11977802 12286528 12602719 12897896 13205114 13534063 13897035 14282688
12644 14282688 14699482 15179740 15739341 16341591 17071574 18079622 19447780 20745735 21125772
12635 21125772 20548821 19764955 19354847 19287932 19375253 19495416 19611446 19746883 19903432 20062271
12625 20062271 20192912 20300691 20406696 20504865 20595502 20662125 20696966 20709804 20732696 20745164
12615 20745164 20724718 20688065 20622048 20533652 20420175 20284200 20134038 19969847 19788459 19588269
12605 19588269 19401479 19203138 18990351 18758297 18508570 18238340 17943448 17634254 17309948
12596 17309948 16963027 16624884 16298382 15964662 15630989 15310460 14987014 14667459 14364699
12587 14364699 14037825 13730379 13410199 13100379 12811982 12511684 12219888 11932744 11670133
12578A1670133k51733k67367k77873k50582k61257k52636k61262k62317k30366
12569I354740k16487k04407j94736j78217j95731k17211k08230k01178j93668
12560G544875j57525j63337j64641j68572j75260j62618j40743j47144j55831
12551F109204j57142j44805j27594j37104j29627j19150j02615j12679j08741
12542D969747r9586j02897j06406j18721j17188j03972r3892q2488p1939p8479
12532C994179o8388p0014p7665p9520p2505n7597n4753o5055q4374o0658n5587
12521C248063n4379n7979n3834o2656p9743o3847m5509l8927m9233n1089m3063
12510B647804m1996l2162l4940j5794l1461m6209m4521l6533l8513l8409l6193
$$ plain form
12578 11670133 11418400 11151033 10873160 10622578 10361321 10108685 9847423 9585106 9354740
12569 9354740 9138253 8933846 8739110 8560893 8365162 8147951 7939721 7738543 7544875
12560 7544875 7387350 7224013 7059372 6890800 6715540 6552922 6412179 6265035 6109204
12551 6109204 5952062 5807257 5679663 5542559 5412932 5293782 5191167 5078488 4969747
12542 4969747 4870161 4767264 4660858 4542137 4424949 4320977 4227085 4144597 4072658 3994179
12532 3994179 3925791 3855777 3778112 3698592 3626087 3568490 3513737 3448682 3364308 3303650 3248063
12521 3248063 3193684 3135705 3081871 3019215 2939472 2875625 2830116 2791189 2741956 2690867 2647804
12510 2647804 2605808 2573646 2538706 2522912 2491451 2445242 2400721 2364188 2325675 2287266 2251073
12499B251073l8098m0208k7745l2142k4171l0077m2630m2921k8645l3069k6199
12488A885168j7690j8749j9433o882k7788l7350l9772k6476j9176k6290k7784
12477A617778k4498j1361j6100k3486j2031j8321j5886k3360m1425k2516m188
12466A404606j3061j1539k1932j1304j0323o573q564k9023k8000j7385k877l888
12454A240137r757k2897p806j4902j8797j4914k0533j1014j8808j3185j7734k8715
12442A041075k7638j2025o29O339o940k713j0127n436l0386k0619q124j7945j4532
12429H90300j1952j3227j2397j3426j6596j8433o812l949j0764K821j6451N73
12417G69687j1044j9822r85N18q980k3462n784p024j2139N253l830j4267j8346
$$ plain form
12499 2251073 2212975 2172767 2145022 2112880 2088709 2058632 2016002 1973081 1944436 1911367 1885168
12488 1885168 1867478 1848729 1829296 1822414 1794626 1757276 1717504 1691028 1671852 1645562 1617778
12477 1617778 1593280 1581919 1565819 1542333 1530302 1511981 1496095 1472735 1431310 1408794 1404606
12466 1404606 1391545 1380006 1358074 1346770 1336447 1329874 1321310 1292287 1264287 1246902 1244025 1240137
12454 1240137 1230380 1207483 1199677 1184775 1165978 1151064 1130531 1119517 1100709 1087524 1069790 1041075
12442 1041075 1013437 1001412 1000783 1007122 1000182 997469 987342 981906 951520 930901 922777 904832 890300
12429 890300 878348 865121 852724 839298 822702 804269 797457 793508 782744 785565 769114 769687
12417 769687 758643 738821 737836 738354 729374 705912 700128 693104 680965 686218 682388 668121 649775
12404F49775J775n210m057l746l376j572J0708M093q808K97j4117k2666l017R306
12390F09385O34M717k697L137K5478K8538K7611K1456k0558l6150l6539l1218
12378E93794l2581j1274K299K939j0306P608J0931j279k2582j5409j2955j3936
12366D97249j7915j6341j7186r187q44J0278j3182l275J444k116K714j064j7201
12353D13374q360R37k155n502q861K674j22J3216o46p545j8009j1409N156Q743
12339C81491J86j5397j5015o090R490l456m405J448O620J4474J5594O025J2534
12326D03499K6290q731p452n428j825r948m27K4665L1288L1808L8700O2282J00324
12313F85045J54910K31517L63180N82786O14708J19656m47868o61704m73493k68555
$$ plain form
12404 649775 651550 646340 642283 638537 635161 633589 644297 648390 639582 639879 625762 603096 600079 609385
12390 609385 610019 614736 612039 615176 640654 669192 696803 718259 697701 661551 625012 593794
12378 593794 561213 549939 552238 555177 544871 552479 563410 562131 539549 524140 511185 497249
12366 497249 479334 462993 445807 436620 435776 446054 432872 429597 431041 428925 431639 430575 413374
12353 413374 405014 405951 403796 398294 389433 392107 391985 405201 404555 397010 379001 367592 372748 381491
12339 381491 381677 366280 351265 345175 354665 351209 346804 348252 354872 369346 384940 390965 403499
12326 403499 429789 421058 413606 408178 406353 396405 395978 420643 451931 483739 522439 584721 685045
12313 685045 839955 1071472 1434652 2017438 2632146 2751802 2303934 1642230 1168737 900182
12303I00182j56695r4096p1251n3927m6351k2661j5638l0412j1859k2991q470
12292C65831k1570j4361j8959q026p627r442j8054r932L295j7529j4798q638N970
12279B26160K838L029R066N260L492K313p410j5586o610p856j64J4681p99r340
12265B19074l642r925j4392j5538M17N154O171j0828L484o497j6539j1425J032
12252A46546M295N756J89k722j1743O472O885J8747q023o075L201J755J6298K586
12238A84167m545k658O1o135K779L940k2350j4414m923O811J239J900O532K63
12224A52667q560p152J5168M407o091K964k600j6083M436m738J769J365k466M190
12210A39276N08q89n056L657O553n779J5431q20p376o887q128o814R578J9379
$$ plain form
12303 900182 743487 649391 578140 524213 477862 455201 439563 409151 397292 374301 365831
12292 365831 344261 329900 310941 302915 295288 285846 267792 257860 261155 243626 228828 220190 226160
12279 226160 228998 232027 241093 246353 249845 252158 244748 229162 222552 214696 214532 229213 228414 219074
12265 219074 215432 205507 191115 175577 175994 181148 187319 176491 179975 173478 156939 145514 146546
12252 146546 150841 156597 156786 154064 142321 148793 155678 174425 166402 160327 163528 165283 181581 184167
12238 184167 179622 176964 177025 170890 173669 177609 155259 140845 135922 142733 143972 145872 152404 152667
12224 152667 144107 136955 152123 156530 150439 153403 150803 134720 139156 134418 136187 137552 135086 139276
12210 139276 139784 138895 133839 137496 144049 138270 153701 152881 145505 138618 130490 123676 133254 152633
12196A52633L738n919M899K296l139q19q304m113m644j0942M109M144q591m165
12182A21183Q436M908q973m699J1667Q780n359j4300q896j878m70j3650j688L591
12168I8652R918m140P475J3999j2727p520J132n835K738R129P521r484J2280m56
12154A22682k8830l735J8276Q599q022n545k875L868m463k588Q845k985l725j3402
12140H6100j8326j3622N061K429P772K6754N42l553m321n525P329Q462q294L612
12126I4420J1476J316k858N987K180M003J1936M801r86j7429o472j4938p548Q416
12112I4304J04m952q490n058l963k409j841J3519J062j830R139o578j1454j792
12098F9761r587N437P714o405k032K590L749M978p940j731N926J403R15k295j1471
$$ plain form
12196 152633 156371 150452 155351 157647 154508 153689 145385 141272 136628 125686 129795 133939 125348 121183
12182 121183 129619 134527 125554 120855 132522 141302 135943 121643 112747 110869 110399 96749 95061 98652
12168 98652 108570 104430 111905 125904 113177 105657 106789 100954 103692 112821 120342 110858 123138 122682
12154 122682 93852 90117 108393 116992 108970 103425 100550 104418 99955 97367 106212 103227 99502 86100
12140 86100 67774 54152 59213 61642 69414 96168 96710 93157 88836 83311 90640 99102 90808 94420
12126 94420 105896 107212 104354 110341 112521 116524 128460 133261 132275 114846 108374 93436 85888 94304
12112 94304 94408 89456 80966 75908 71945 69536 67695 81214 82276 80446 89585 83007 71553 69761
12098 69761 60174 65611 73325 66920 64888 67478 71227 76205 68265 66534 72460 73863 74778 72483 61012
12083F1012j3092q987O903m835O502K463k850K78k407J5420R307j4721m286k317
12069D8390O314j70j8699J2569l196p784j2283J0893m521O726O896r562q811k893
12055B3869k530M688M528n012L327K483M123K0129N214m253o873Q776J039j5436
12041D4072r685J871J525O633Q68p120k245O558j5169j5665J179O036Q740N38
12027B8136r952o189j0969O766O183N910J334q823m269Q5k951n261j300J9153
12013A7853M337Q14J2313L748j0302r26N855o55K506J621o010j3681N107P634
11999C0214j1036j2546o600j2415N254N086J1400J1057o483j0241j4566J6850
11987E974J7934j982j6475p584j1797J797J0987P43n827r568J2601K247k747M60
$$ plain form
12083 61012 47920 38933 45836 41001 47503 49966 47116 47394 44987 60407 69714 54993 50707 48390
12069 48390 54704 54534 35835 48404 45208 37424 25141 36034 31513 38239 45135 35573 26762 23869
12055 23869 21339 26027 30555 25543 28870 31353 35476 55605 60819 56566 49693 58469 59508 44072
12041 44072 34387 36258 37783 44416 45284 38164 35919 42477 27308 11643 12822 18858 27598 28136
12027 28136 18184 11995 1026 7792 13975 19885 21219 12396 8127 8212 5261 0 -1300 17853
12013 17853 22190 23004 35317 39065 28763 27837 33692 33037 35543 37164 31154 17473 22580 30214
11999 30214 19178 6632 32 -12383 -7129 -2043 9357 20414 13931 3690 -10876 5974
11987 5974 23908 21926 5451 -2133 -13930 -12133 -1146 -403 -6230 -15798 -3197 -950 -3697 -3237
11973c237r090J5913J3494j247o928L414k250o069L09L86j0741L688R949j118
11959F473N404K050N968k237q458M723P7j074p323k32J6430m924p570j041J0481
11944A8747o948Q905Q776l759j419k128j2585O817j676j4979M512K5650j2819
11931A7094j3044p483q71q925O448J3798O536N45k242O432n796j1140o80j686
11917a014o185r336j0552J1050J211P084N372K5202J4061j1828j9251N742P189
11904A8745J191O345l599j4228j0790m625m66R171R77q793m153p49m763Q084q499
11889a6152n60J4373n167p428P738Q627K757r321n772Q666N48K341k98K329j093
11874A588o250k630N473O376O479k20m380K14l855r815l010j252K577J3485r38
$$ plain form
11973 -3237 -12327 3586 17080 15833 8905 12319 10069 4000 4309 4695 -6046 -2358 7591 6473
11959 6473 11877 13927 19895 17658 9200 13923 14000 12926 5603 5371 21801 16877 9307 8266 18747
11944 18747 11799 20704 29480 25721 24302 22174 9589 16406 14730 -249 4263 29913 17094
11931 17094 4050 -3433 -4304 -13229 -6781 7017 13553 14098 11856 18288 12492 1352 672 -1014
11917 -1014 -7199 -16535 -27087 -16037 -14826 -7742 -2370 22832 36893 25065 5814 11556 18745
11904 18745 19936 26281 22682 8454 -2336 -6961 -7427 1744 2721 -6072 -10225 -10974 -15737 -7653 -16152
11889 -16152 -16712 -2339 -7506 -14934 -7196 1431 4188 -5133 -10905 -2239 -1691 650 352 2681 1588
11874 1588 -4662 -7292 -1819 4557 11036 10816 6436 6650 2795 -7020 -10030 -11282 -8705 4780 3842
11859C842j1814p778O208j588J45j1151J0301M050j2118N172P651q665J8339Q824
11845A1418j4741J738k022P917N233n04J1703K1567J9965J5164p163O271K7217
11832A03763J6232j8881m3393j5018r648r474k0332j3016J2261k258j583N412
11820D065N540m927j987j4405n666j830J2629M844K627N09o760j7062p380R2P958
11805b1753J5300o367n697L768r218M310O325K1654M587j1738m243k572J9P88
11791d837n84R602j5102K014K853j2507K787j642m815j201L998M327M830n043
11777a5320j4830o76P865L23m593N489K3871P556M666q439j2122j4232K916k19
11763a7745m192j2594mr626j76L367J893M771J6357K6080J0822j7243j086K731
$$ plain form
11859 3842 -7972 -15750 -9542 -11130 -10985 -22136 -11835 -7785 -19903 -14731 -7080 -15745 2594 11418
11845 11418 -3323 -1585 -3607 4310 9543 9039 20742 42309 62274 77438 70275 76546 103763
11832 103763 119995 101114 57721 42703 33055 23581 3249 -9767 2494 236 -1347 4065
11820 4065 9605 4678 2691 -11714 -17380 -19210 -6581 -1737 890 1399 -5361 -22423 -29803 -29711 -21753
11805 -21753 -6453 -12820 -18517 -14749 -23967 -19657 -13332 8322 12909 1171 -3072 -5644 -5625 -4837
11791 -4837 -5421 4181 -10921 -8907 -6054 -18561 -15774 -17416 -22231 -23432 -19434 -15107 -10277 -15320
11777 -15320 -30150 -30826 -22961 -22638 -27231 -21742 2129 9685 14351 5912 -6210 -20442 -17526 -17745
11763 -17745 -21937 -34531 -34535 -44161 -44337 -40970 -39077 -34306 -17949 8131 18953 1710 624 3355
11749C355k327o122j2195r929L569M033M588J3709J7337o861j8262j7356Q944
11736a7517M823l853j771p472M102K0233J5904q094j3936J133R173j0465j1288
11723a9028q623o394j2207P870M379p478m854m83J4291J1439K19r903n472K1319
11709a4925J2695j9980r848R509K0579J641n614j96m734j181L226o219P692J1004
11695C649k648m658o808k57j636o400J0305L762K681k259j1591j4209p292L401
11681c3960j017k631K910K928J1587p79n44k389J3972q555l150J3965R66j3233
11667a9930j0632M385K793l886J1312M711J0326J1415q425r326N493k945n288
11654i997j3544m166k875R582L12J2477l856k540O066L674K259q642m062o690
$$ plain form
11749 3355 1028 -5094 -17289 -27218 -23649 -19616 -15028 -1319 16018 9157 -9105 -26461 -17517
11736 -17517 -12694 -16547 -18318 -25790 -21688 -1455 14449 6355 -7581 -6448 2725 -7740 -19028
11723 -19028 -27651 -34045 -46252 -38382 -34003 -41481 -46335 -46818 -32527 -21088 -20869 -30772 -36244 -14925
11709 -14925 -2230 -22210 -32058 -22549 -1970 -329 -5943 -6139 -10873 -12054 -8828 -15047 -7355 3649
11695 3649 1001 -3657 -10465 -10722 -12358 -18758 -8453 -4691 -2010 -4269 -15860 -30069 -37361 -33960
11681 -33960 -34977 -37608 -34698 -31770 -20183 -20962 -21506 -23895 -9923 -18478 -21628 -7663 -6697 -19930
11667 -19930 -30562 -26177 -23384 -27270 -15958 -11247 -921 10494 2069 -7257 -1764 -4709 -9997
11654 -9997 -23541 -27707 -30582 -21000 -20688 -8211 -12067 -14607 -8541 -4867 -2608 -11250 -15312 -22002
11640b2002L632R638l026j5198o090P953r91N262N107Q10O181J510L104k2144
11626b6254j7660J3076Q190j201q105j2869J0107J2281l985n390O447P119R213
11613i031J650o237j0372p547j3098q451L696l22J448R197J2610J2837k997l869
11599b0486j8075M312J615j996m001K255m31p705Q266K4777M821n517p552r237
11585b8954O278N116m945m662R438Q320M79L494j5394l827N407p519j2897L600
11571c6066J2700k2411J015K0679j775j2924k139L889J2165j554J3202L245j9628
11558b9602o884K861R402J315j8261K432J2086J7217P302k7602k6435J5879K0763
11545a9527J404R021L833p917q154k861m859m322m390N98N882P309k466L842K080
$$ plain form
11640 -22002 -18370 -8732 -11758 -26956 -33046 -25093 -26084 -20822 -15715 -14905 -8724 -7214 -4110 -26254
11626 -26254 -43914 -30838 -22648 -23849 -31954 -44823 -34716 -22435 -26420 -31810 -25363 -18244 -9031
11613 -9031 -7381 -13618 -23990 -31537 -44635 -53086 -49390 -49712 -48264 -39067 -26457 -13620 -16617 -20486
11599 -20486 -38561 -34249 -32634 -34630 -38631 -36376 -36807 -44512 -36246 -11469 -6648 -12165 -19717 -28954
11585 -28954 -22676 -17560 -22505 -27167 -17729 -9409 -8930 -5436 -20830 -24657 -19250 -26769 -39666 -36066
11571 -36066 -23366 -45777 -44762 -24083 -25858 -38782 -40921 -37032 -24867 -26421 -13219 -9974 -29602
11558 -29602 -36486 -33625 -24223 -22908 -41169 -38737 -26651 -9434 -2132 -29734 -56169 -40290 -19527
11545 -19527 -18123 -9102 -5269 -13186 -21340 -24201 -29060 -33382 -37772 -37174 -31292 -23983 -26449 -22607 -20527
11530b0527K208j339J821O660l788P337o525Q131M072n606o889j2965j0197L218
11516c4389m083j5101P774k017N693J6985j496L069M913J3284j1806l604J0903
11503i875K99j4897N560R389M75m540J647Q05K073J2866k492r137M929q138k4332
11488c5368l868Q859N529P546r576r416k245Q74J3321L56m231r394N188pO68K871
11472b8893j3838r37J1700J905m864k949k988N098l832N473R229J379M41m507
11458b7583j7815P718J7103N557q049P969p279r681M86M457J0300M919J141N751
11444e006M283j1192j1401j4648J3723J4787m020m463N705j0238N829Q08j7320
11431c3153Q71J626l438o561j481N465J2523O738J2137j172j8426J627J1276M703
$$ plain form
11530 -20527 -18319 -19658 -17837 -11177 -14965 -7628 -14153 -6022 -1950 -7556 -14445 -27410 -37607 -34389
11516 -34389 -38472 -53573 -45799 -47816 -42123 -25138 -26634 -23565 -18652 -5368 -17174 -20778 -9875
11503 -9875 -9576 -24473 -18913 -9524 -9049 -13589 -11942 -11137 -9064 3802 1310 -7827 -2898 -11036 -35368
11488 -35368 -39236 -30377 -24848 -17302 -26878 -36294 -38539 -37665 -24344 -23988 -28219 -37613 -32425 -32432 -31764 -28893
11472 -28893 -42731 -43668 -31968 -30063 -34927 -37876 -40864 -35766 -39598 -34125 -24896 -23517 -23076 -27583
11458 -27583 -45398 -37680 -20577 -15020 -23069 -15100 -22379 -32060 -31574 -27117 -16817 -11898 -10757 -5006
11444 -5006 -723 -11915 -23316 -37964 -24241 -9454 -13474 -17937 -12232 -22470 -16641 -15833 -33153
11431 -33153 -32282 -30656 -34094 -40655 -42136 -36671 -24148 -17410 -5273 -6445 -24871 -23244 -11968 -7265
11417g265j2740l881K762j556k570J0581K852J526j0560P495J617k501K668j2502
11403b4074p764L439L404j399J126O58L178Q63l460o592O957m37j494p680p555
11388d0830m54n797Q670N534J0286J9477N858m437m615Q711j6818j2135K55j320
11374b7615j2123N167M259Q781P837N518m141j565l299J3293R246j2280j4566
11361b1488j1314k200J0398J0426o486k841n950Q78K555K38k011k769r799n363
11347d5726P334j347j4593k905P420J049j7426J733J2802J3719Rp435P791l97
11333c7972N82N486M911J0653M275j0536n576j291J3917L806K537P056l489j3636
11319a9277j4173J619O701j053j7835N256J9605K130j1878K984P797M207J101
$$ plain form
11417 -7265 -20005 -23886 -21124 -22680 -25250 -14669 -11817 -10291 -20851 -13356 -11739 -14240 -11572 -24074
11403 -24074 -31838 -28399 -24995 -26394 -25268 -24610 -21432 -20569 -24029 -30621 -23664 -24101 -25595 -33275 -40830
11388 -40830 -41284 -47081 -38411 -32877 -22591 -3114 2744 -1693 -6308 2403 -14415 -26550 -26295 -27615
11374 -27615 -39738 -34571 -30312 -21531 -13694 -8176 -12317 -13882 -17181 -3888 5358 -6922 -21488
11361 -21488 -32802 -35002 -24604 -14178 -20664 -23505 -29455 -28577 -26022 -25784 -27795 -30564 -40363 -45726
11347 -45726 -38392 -39739 -54332 -57237 -49817 -48768 -66194 -64461 -51659 -37940 -37931 -45366 -37575 -37972
11333 -37972 -37390 -31904 -26993 -16340 -12065 -22601 -28177 -29468 -15551 -11745 -9208 -2152 -5641 -19277
11319 -19277 -33450 -31831 -25130 -26183 -44018 -38762 -19157 -17027 -28905 -25921 -18124 -13917 -12816
11306a2816K29j113m661l943j95M000j6093J115J2390N260k836O002q489o534
11292b7684K211K794q99N650r145p934q206J1067K4439P126o502m621K515J3539
11278D350J6916r547n933n933j26J0130r269n715j0378q119N842r866n159p66
11264c3573J0322P867N290N450K782k639O636j2194L675M593N445J451r343n800
11250a0038O024k235M551J834r383j0182J918o13l697j2461j6262O510J6143j4137
11236d2028j3984M070P790J1354R870L051p853L701P599l581J212J480p406O773
11222a7952M013L509Q7L850J1049N6j9224j1095J0392R71n529J983p971o773r1
11207c2725j861o495M821Q630m706r915P136J4954J4612J4949o332J653j0488
$$ plain form
11306 -12816 -12587 -13700 -18361 -22304 -22499 -18499 -34592 -33477 -21087 -15827 -18663 -12661 -21150 -27684
11292 -27684 -25473 -22679 -23578 -17928 -27073 -35007 -43213 -32146 -7707 -581 -7083 -11704 -9189 4350
11278 4350 21266 11719 5786 -147 -273 9857 588 -5127 -15505 -23624 -17782 -27648 -32807 -33573
11264 -33573 -23251 -15384 -10094 -4644 -1862 -4501 2135 -10059 -6384 -1791 3654 5105 -4238 -10038
11250 -10038 -4014 -6249 -1698 136 -9247 -19429 -17511 -18124 -21821 -34282 -50544 -44034 -27891 -42028
11236 -42028 -56012 -51942 -44152 -32798 -22928 -19877 -27730 -24029 -16430 -20011 -18799 -17319 -24725 -17952
11222 -17952 -13939 -10430 -10343 -6493 4556 4612 -14612 -25707 -15315 -14344 -19873 -17890 -25861 -32634 -32725
11207 -32725 -34586 -41081 -36260 -27630 -32336 -42251 -35115 -20161 -5549 9400 3068 4721 -5767
11194e767k542o612l463k743j1331J698q684m775K546L23O315K0002k936j0269
11180b8238r722L759K2278K677j5496P842M007q240K830K3385K6085j265m905
11167B4997J432q374M53l288O831N4j3408J612j1542J464j6153R980Q199L154
11153E411j3767n037l370p759N117J5383j318p307J692Q049Q659m998q155q506
11139a5906J2180k661m325r881l125J2579M353j775m818n100P794j713o734R334
11125i798M335j1547j548k276M39o4k94k931k665n004q278O557N781M500L236
11110a9557K24n091k623m268p87J6112O518K142J217k396P684J8906N62p686r778
11095A179o620q153q650M33K637O331O755J958r856p033o388j984K160Q811l552
$$ plain form
11194 -5767 -8309 -14921 -18384 -21127 -32458 -30760 -39444 -44219 -41673 -41350 -35035 -15033 -17969 -28238
11180 -28238 -37960 -34201 -11923 -9246 -24742 -16900 -12893 -21133 -18303 5082 31167 29902 24997
11167 24997 26429 18055 18508 15220 22051 22105 8697 10309 -1233 231 -15922 -5942 2257 5411
11153 5411 -8356 -13393 -16763 -24522 -19405 -4022 -5340 -12647 -10955 -2906 5753 755 -7400 -15906
11139 -15906 -3726 -6387 -10712 -20593 -23718 -11139 -6786 -8561 -13379 -18479 -10685 -12398 -19132 -9798
11125 -9798 -5463 -17010 -18558 -20834 -20395 -20459 -20753 -23684 -26349 -31353 -39631 -33074 -27293 -22793 -19557
11110 -19557 -19333 -24424 -27047 -31315 -32102 -15990 -9472 -7330 -6113 -8509 -825 18081 18643 10957 1179
11095 1179 -5441 -13594 -22244 -21811 -19174 -12843 -6088 -4130 -13986 -21019 -27407 -29391 -27231 -18420 -21972
11080b1972o791j0253m181j916k890N018P569k391M494J0163J5780R098L23m540
11066b489N767o196J1211q381j0319K607m509r068J776P717J5496j029j9951m739
11052b2107j472j3283L340M834m390J627M458n864k962J6249Q454J3652L876m201
11038B211j4416O559q004k0556M155Q747p96L496j0593m35p84j3353K6049N937
11024a1783J036j7160O676K3089M25J159O993L803P053L913j2690o639o415q194
11010h734J100J633K32p100j3536j851J7278N956q44N01J3495l960k1996J698
10996a6128R104M822p424p741q279k831n401m061J6627J0231l311j1307J184N256
10982a9259o238m969L65N217o546O994N555k261J657J0691M379l3j5418Q126J1185
$$ plain form
11080 -21972 -28763 -39016 -43197 -45113 -48003 -42985 -35416 -37807 -33313 -23150 -7370 1728 2051 -2489
11066 -2489 3278 -2918 8293 -88 -10407 -7800 -12309 -21377 -19601 -11884 3612 2583 -17368 -22107
11052 -22107 -23579 -36862 -33522 -28688 -33078 -31451 -26993 -32857 -35819 -19570 -11116 2536 6412 2211
11038 2211 -12205 -5646 -13650 -34206 -30051 -21304 -22100 -18604 -29197 -29632 -30416 -43769 -17720 -11783
11024 -11783 -10747 -27907 -21231 1858 2283 3442 10435 14238 21291 25204 12514 5875 -540 -8734
11010 -8734 -7634 -6001 -5769 -12869 -26405 -28256 -10978 -5022 -5866 -5365 8130 4170 -17826 -16128
10996 -16128 -7024 -2202 -9626 -17367 -25646 -28477 -33878 -37939 -21312 -11081 -14392 -25699 -24515 -19259
10982 -19259 -25497 -30466 -30101 -24884 -31430 -24436 -18881 -21142 -19485 -8794 -4415 -4448 -19866 -11740 -555
10967e55N375n347m564j1418p23m002j0153j595l454J0195J5010l190L579K456
10953h386r183P602R474M021O068j2456j4923O302m249J158K176R123N607N086
10939G420k303q919j1892p160O666J963P312l823n822J494n702o290l803J2486
10925a8373J6693n331r8o26j1565L744P588L419j5189j5727j955L431J1204O5
10911b2720k030n064r13r22M540J4270Kq959n607K2955N060J0629k420j3736j9658
10896b4573j5297J153k675p415J7001M535o054O30J8529J2600q274n75n111K019
10882a3507l712K439K522M169R63N469L526r677J418K31k50J866m689n257j533
10867a6022m458L147o002M144j980R342J0j5752q909p554j366J1232Q062q26j408
$$ plain form
10967 -555 4820 -527 -5091 -16509 -17232 -21234 -31387 -32982 -36436 -26241 -11231 -14421 -10842 -8386
10953 -8386 -17569 -9967 -493 3528 9596 -2860 -17783 -11481 -15730 -14572 -12396 -3273 2334 7420
10939 7420 5117 -3802 -15694 -22854 -16188 -14225 -6913 -10736 -16558 -15064 -20766 -27056 -30859 -18373
10925 -18373 -1680 -7011 -7109 -7735 -19300 -15556 -7968 -4549 -19738 -35465 -37420 -33989 -22785 -22720
10911 -22720 -24750 -29814 -30727 -31649 -27109 -12839 -12837 -21796 -27403 -4448 612 11241 8821 -4915 -24573
10896 -24573 -39870 -38717 -41392 -48807 -31806 -27271 -33325 -32695 -14166 -1566 -9840 -10415 -15526 -13507
10882 -13507 -17219 -14780 -12258 -8089 -7126 -1657 1869 -7808 -6390 -6159 -6409 -4543 -9232 -14489 -16022
10867 -16022 -20480 -17333 -23335 -19191 -21171 -11829 -11819 -27571 -36480 -44034 -45400 -34168 -26106 -26932 -28340
10852b8340M717j252P310Q48j778J497k610l577p39M339J803l287o035N669J4631
10837f804N752o456j1726r201R536K664n943r067n654J912P667m046O414L200
10823b1752O283J1870j569j1242q978l663J6068K3405J5981j1370o484n174j4114
10810a0739n950M972L544m209J135l796o154P095J3068p934m814q409M433R603
10796h155J958j7793o321m647Q303L770l037N162m236r306L614P292R342P024
10782g030R175J114m434l017J0328k656p831M61l370l392p124j0323L260Q873
10768a5966M403j9940o04O559p798l574J1835l895O4J9874O168Q35L253k792Q134
10753F556P65j0705l308K313R893j2435m047m739r030k637p100K816J1902p022
$$ plain form
10852 -28340 -23623 -24875 -17565 -16717 -18495 -16998 -19608 -23185 -23924 -19585 -17782 -21069 -27104 -21435 -6804
10837 -6804 -1052 -7508 -19234 -28435 -18899 -16235 -22178 -31245 -36899 -34987 -27320 -31366 -24952 -21752
10823 -21752 -15469 -3599 -5168 -16410 -25388 -29051 -12983 10422 26403 15033 8549 3375 -10739
10810 -10739 -16689 -11717 -8173 -12382 -11247 -15043 -21197 -14102 -1034 -8968 -13782 -22191 -17758 -8155
10796 -8155 -6197 -23990 -30311 -34958 -26655 -22885 -25922 -20760 -24996 -34302 -30688 -23396 -14054 -7030
10782 -7030 2145 3259 -1175 -4192 6136 3480 -4351 -3890 -7260 -10652 -17776 -28099 -24839 -15966
10768 -15966 -11563 -31503 -32107 -25548 -33346 -36920 -25085 -28980 -28916 -9042 -2874 -2039 1214 -1578 6556
10753 6556 7321 -3384 -6692 -4379 5514 -6921 -10968 -15707 -24737 -27374 -34474 -31658 -19756 -26778
10739b6778o522K844L692n254J331P66l832k185J1120Q001Q500m871j230M706
10725i712o538q502J549J6549J686n953M765P250R86q655j4831n940o1j868J4067
10710a5208J1514Q856o952m745j79m175K1148j961j6605l573j1491l319L819J683
10696b1188n253O569J3345M463p738j0697o221k489l383P359Q497K455L161j0022
10682b1142n388K319J1110K270L993o107j1375m926P64j171N622K167R594J292
10668a0978N620O682J435j5817k2504R122R685J4323P566m797n167J3358m787
10655C741K307j3738q696Q365k58m345P166J1349j1828q722j0736j404J1510q252
10641b3541K179k762o133N305P322Q422P092J463R36j5904j4794j697O203J0944
$$ plain form
10739 -26778 -33300 -30456 -26764 -32018 -30687 -29921 -33753 -35938 -24818 -16817 -8317 -13188 -14418 -9712
10725 -9712 -16250 -24752 -23203 -6654 -4968 -10921 -6156 1094 2080 -6575 -21406 -27346 -27407 -29275 -15208
10710 -15208 -3694 5162 -1790 -6535 -6714 -10889 10259 8298 -8307 -11880 -23371 -26690 -22871 -21188
10696 -21188 -26441 -19872 -6527 -2064 -9802 -20499 -26720 -29209 -32592 -25233 -16736 -14281 -11120 -21142
10682 -21142 -26530 -24211 -13101 -10831 -6838 -12945 -24320 -29246 -28482 -29653 -24031 -21864 -12270 -10978
10668 -10978 -5358 1324 2759 -13058 -35562 -26440 -16755 -2432 5134 337 -4830 8528 3741
10655 3741 6048 -7690 -16386 -8021 -8279 -12624 -5458 5891 -5937 -14659 -25395 -26799 -15289 -23541
10641 -23541 -21362 -24124 -30257 -24952 -17630 -9208 -2116 -653 283 -15621 -30415 -32112 -25909 -14965
10627a4965J1891j366r521n594K756K972p245J0117O397R404K455M710r811q64
10613A336k486j151R168m609p759r603R870P417q995q424j5723J6158J5477K857
10599C533j1206j0489o117N586M554R78k082l907O75m340P568q5L111K1345j963
10584G161j5985m313L963j2838j7285J280N932J543P155J0933Q923J4823M202
10571A5494k916j0606j0411O015j938m323m157J764J8437R615m096j2639m213
10558c974o615r553o388J20j0682L818J1955O182N194J6368m75q589r595p171
10544a9405r057m603L251J4190J8441J568j519P32n377o717L820L841J6331J702
10530A7198r945l91p31j2234q670q760N587m777P891K557O280Q107m291R00R931
$$ plain form
10627 -14965 -3074 -4440 -13961 -19555 -16799 -13827 -21072 -10955 -4558 4846 7301 12011 2200 1336
10613 1336 -1150 -2301 6867 2258 -5501 -15104 -5234 2183 -6812 -15236 -30959 -14801 676 3533
10599 3533 -7673 -18162 -24279 -18693 -14139 -13161 -15243 -19150 -18475 -22815 -15247 -15332 -12221 9124 7161
10584 7161 -8824 -13137 -9174 -22012 -39297 -38017 -32085 -30542 -23387 -12454 -3531 11292 15494
10571 15494 12578 1972 -8439 -2424 -4362 -8685 -12842 -11078 7359 16974 12878 239 -3974
10558 -3974 -10589 -20142 -26530 -26410 -37092 -33274 -21319 -15137 -9943 6425 5950 -2639 -12234 -19405
10544 -19405 -28462 -33065 -29814 -15624 2817 4385 2866 3598 -1779 -8496 -4676 -835 15496 17198
10530 17198 7253 6862 6131 -6103 -14773 -23533 -17946 -22723 -14832 -12275 -5995 2112 -2179 -1279 8652
10515H652j9202K058R080P887N911j2566j5721m07J0634R994j63j0718p683O944
10501e300O848m62L951L111M99j0010n414j0154o654O753J8302N474l504L293
10487F733P33P887K35j8099K01M966J175j6191n964K1282L080o847q703n227K903
10472a1836l123l365P608o743o088J6567N529k0150j3187o007J0923J6826k418
10459a5464P539P764N82K422Q773J1685j5742l061N015p22O104K40M309r867j2145
10444b568L907O997Q325O883J2109j4491q719J454N664Q069j85O577q739j5117
10430A0166p118m05M579N522j966j379J3796Q681l183q094N331J436K884m887
10416B5363l966N536Q505q741l197L59m250j4196j5088J4128J5915o147j5097
$$ plain form
10515 8652 -10550 -8492 588 8475 14386 1820 -13901 -14308 -3674 6320 6157 -4561 -12244 -5300
10501 -5300 1548 1086 5037 8148 8647 -1363 -6777 -16931 -23585 -16832 1470 6944 3440 6733
10487 6733 7466 15353 15588 -2511 -2310 2656 3831 -12360 -18324 2958 6038 -809 -9512 -14739 -11836
10472 -11836 -14959 -18324 -10716 -17459 -23547 -6980 -1451 -21601 -34788 -40795 -29872 -13046 -15464
10459 -15464 -7925 -161 421 2843 11616 23301 7559 4498 9513 8791 14895 15135 19444 9577 -2568
10444 -2568 1339 8336 16661 23544 35653 21162 12443 13897 19561 27630 27445 34022 25283 10166
10430 10166 3048 2643 7222 12744 10778 9399 23195 31876 28693 20599 25930 27366 30250 25363
10416 25363 21397 26933 35438 26697 23500 23859 19609 5413 -9675 4453 20368 14221 -876
10403h76K070J1138K719Q907l064k7442k623N759L995k17K727J2659J237m193
10389A2796J3829P034j2740n387Q776R408J152J027r181q236j328n997o851J777
10375F079J6114J4528r770o236K249O501K654p282J648j2823n406J915Q759o116
10361A2814j6669J8039J1938M459J504M767N4L923j0101k7m450p876m451M29Q40
10346A5193P73K526K480j0487m741r16P2J4997J3011n011m209J204K737l411J2009
10331C6227p96j3738j4937M020P884M696J1925R096j6995m569n253j050P614J1942
10317C6066l45q774n163J7333J2894J49j8508k0032m42l522J2913J4304O161p272
10303C5762n978L347j198q925m078o80N440J049k017j543M138l868j5415j0553
$$ plain form
10403 -876 1194 12332 15051 23958 20894 -6548 -9171 -3412 583 366 3093 15752 16989 12796
10389 12796 26625 33659 20919 15532 24308 33716 34868 35895 26714 18478 17150 11153 4302 6079
10375 6079 22193 36721 26951 20715 22964 29465 32119 24837 26485 13662 8256 10171 18930 12814
10361 12814 -3855 14184 26122 30581 32085 36852 36906 40829 30728 30701 26251 18375 13924 14353 15193
10346 15193 15966 18492 20972 10485 5744 4828 4900 19897 32908 27897 23688 24892 27629 24218 36227
10331 36227 35431 21693 6756 10776 18660 23356 35281 44377 27382 22813 17560 16510 24124 36066
10317 36066 35721 26947 21784 39117 52011 52160 33652 13620 13178 9656 22569 36873 43034 35762
10303 35762 29784 33131 31933 23008 18930 18250 23690 24739 22722 21179 25317 21449 6034 -4519
10289d519r805J2988J1923M778J0603J943m65j5570J09J5348O034J536j1347k3154
10275D02l43l543l789J759k202r487n454P936J6358N498m337m764j2306N611R462
10260H01P554j6429j688J4037K398l926p99N27o40k2068k639r583K785J3973R208
10245f489O301K007L4J0171j0808k714R237j586K838K0529J5693k34k198q373
10231C4408r248j7008j5159q301J3916J628k905N715o583k4j931o465n258J6650
10217e65K4105J6705p953j3680o68p547J1094K442j251J766J090N769J1737m883
10203C8161j3037k304J043q79k512p31N807J2593l732j0650l779L528P123L042
10189C3673J1570l226k925P787P80o206j3252M53N263N727L779N830J8982j0953
$$ plain form
10289 -4519 -14324 -1336 10587 15365 25968 27911 27446 11876 11985 27333 33367 34903 23556 402
10275 402 59 -3484 -7273 -5514 -7716 -17203 -22657 -14721 1637 7135 2798 -1966 -14272 -8661 801
10260 801 8355 -8074 -9762 4275 6673 2747 1948 2475 1835 -20233 -22872 -32455 -29670 -15697 -6489
10245 -6489 -188 1819 1853 12024 1216 -1498 7739 6153 8991 29520 45213 44979 42781 34408
10231 34408 25160 8152 -7007 -15308 -1392 236 -2669 3046 -3537 -3561 -5492 -11957 -17215 -565
10217 -565 23540 40245 32292 18612 17944 10397 21491 23933 22682 24448 25538 31307 43044 38161
10203 38161 25124 22820 23863 22984 20472 19741 25548 38141 34409 23759 19980 23508 30631 33673
10189 33673 45243 42017 39092 46879 47659 41453 28201 28654 33917 39644 43423 49253 68235 57282
10175E7282k0934k532j485K7246J3518J4584o906q899Q556n270m75q0o036L126
10161G1695N100p994K559O75k495q553L077k121o997o04j1559O005J3879J0379
10147G3046J2953j2900q038L717q489j3791j0917P25j1611j2724K669k228J3858
10134B6270K7568R039R00j4371J030q948j9597n242L85J4787K557R338J56j5098
10120B8774j120l545q357m380p37Q435P211l62J9932J0953o235p92k541J766J9553
10105F8555K4927L288M962l718q011k4924j1570m735m46L935O175q45k865n269
10091D9459j207O683L087L25K410O579m626l468P201q958J1319J1217K912J3811
10077I6744k022L784O279N040p938j7409k2699L734P669J0160l898j652P473O718
$$ plain form
10175 57282 36348 33816 32331 59577 73095 87679 80773 71874 80430 75160 74685 74605 68569 71695
10161 71695 76795 68801 71360 72035 69540 60987 64064 61943 54946 54342 42783 48788 62667 73046
10147 73046 85999 73099 65061 68778 60289 46498 35581 36306 24695 11971 14640 12412 26270
10134 26270 53838 62877 63777 49406 50436 41488 21891 16649 17034 31821 34378 43716 43872 28774
10120 28774 27654 24109 15752 11372 10635 19070 26281 25919 45851 56804 50569 49777 47236 49002 68555
10105 68555 93482 96770 101732 98014 90003 65079 53509 48774 48328 52263 58438 57593 54728 49459
10091 49459 48252 54935 58022 58347 60757 67336 62710 59242 66443 57485 68804 80021 82933 96744
10077 96744 94722 98506 104785 109825 101887 84478 61779 65513 73182 83342 79444 77792 85265 91983
10063I1983m153j2683p796j7612J132k610o346J123k750m266J0643J1110J1924
10050F9699J6699J7777J8569O400J3366M3291Q1254J33398K30363J47955r1544
10039F87227k32220j63756r0820n0041k8631k3461j2021j0138k342P049p873l016
10027F9957P750j2784r730n61k205q957o144k220K625O320o82j2524J726l132
10013B9439n517l352J451M680k01q526M000k4J906r031R279L427K568k906j2152
9998A5041O541J1003j6332j1503R656P106N334O077o135n49K69o835j1405J3806
9984B2074P526j5616M913R209j0058j2196q879Q721J0883o211m754R477m572j4616
9970d099J2128J2735O663R364M89n156N441j548k158J1525l105j0781l296J0276
$$ plain form
10063 91983 87830 75147 67351 49739 50871 48261 41915 43038 40288 36022 46665 57775 69699
10050 69699 86398 104175 122744 129144 142510 185801 267055 400453 630816 778771 687227
10039 687227 455007 291251 200431 150390 121759 98298 86277 76139 73797 80846 72973 69957
10027 69957 77707 64923 55193 54632 52427 43470 37326 35106 37731 44051 43369 30845 32571 29439
10013 29439 23922 20570 22021 26701 26500 17974 21974 21950 23856 14825 24104 27531 30099 27193 15041
9998 15041 21582 32585 16253 4750 14406 21512 26846 32923 26788 26239 26508 19673 8268 22074
9984 22074 29600 13984 18897 28106 18048 5852 -3027 5694 16577 10366 5612 15089 10517 -4099
9970 -4099 8029 20764 27427 36791 37280 32124 37565 36017 33859 45384 42279 31498 28202 38478
9956C8478L462j1178K703R59q953J543R502m447Q312n786L145K161j0976J2542
9942D1467P814J113m563j247Q085J172j426O660o589n093m944n188p402o522j251
9927B2086l32j255Q214J4888K996l385n800j0030n289o372L130m022L446Q249
9913B6524J9659k481p027j5837J554J2653J891L636k93r937O027j1151r035K838
9899A9021R727K452R836J4801n798n325J725j4620N997P822q812j3108R625J3036
9885D6379K4184k257j0949O219n695j4906P409J0960p014p480J249k566m236M318
9871D5615R88l281r860M153N419j2062o630k088j660L310J1364J5307J1944l247
9857E9272j1309p055p404N240k444P047k889l481J0474L943K62n628m993m760
$$ plain form
9956 38478 41940 30762 33465 34424 25471 27014 36516 32069 40381 34595 37740 39901 28925 41467
9942 41467 49281 50394 45831 44584 52669 53841 52415 59075 52486 47393 42449 37261 29859 23337 22086
9927 22086 21754 20499 28713 43601 46597 43212 37412 27382 22093 15721 18851 14829 18275 26524
9913 26524 46183 43702 36675 20838 22392 35045 36936 40572 40279 30342 36369 25218 16183 19021
9899 19021 28748 31200 41036 55837 50039 44714 46439 31819 37816 45638 36826 23718 33343 46379
9885 46379 70563 68306 57357 63576 57881 42975 50384 61344 54330 46850 48099 45533 41297 45615
9871 45615 46603 43322 33462 37615 43034 30972 24342 22254 20594 23904 35268 50575 62519 59272
9857 59272 47963 40908 33504 38744 36300 43347 40458 36977 47451 51394 51656 46028 41035 36275
9843C6275p064k80L726m01Q45J036l299o191o335J535p753l723J2462Q104K903
9828C1840N089j0394j192j658j1121J402r86j6377J3053R235l846J0440J5497
9815D0982K682n721n784j187L245n928J83J347K599o272m049K378p685J4105N572
9800C6467j4121J549K858R024J6740J7897j3944O628J96j8413J562n392o557L953
9786C8447o36r50n53M207J7551N122o137j4540j7537n317J3455L898l941q265
9772B4804j430j0235n780N84J1529P343J9314K0729m102j8068j4665n655J934
9759B6302o466M404k300R858K822j0181j676N133l209j1978P58J5277J6318l217
9745D1845k2600m093P608Q807O636L28j4050r77J5386m762j5930p024J2376J2782
$$ plain form
9843 36275 29211 28931 32657 32256 33101 34137 30838 24647 18312 19847 12094 8371 20833 28937 31840
9828 31840 36929 26535 25343 23685 12564 13966 12980 -3397 9656 18891 15045 25485 40982
9815 40982 43664 37943 32159 30972 34217 28289 28472 29819 32418 26146 22097 24475 16790 30895 36467
9800 36467 22346 23895 26753 35777 52517 70414 56470 63098 63294 44881 46443 41051 34494 38447
9786 38447 37811 36861 36308 40515 58066 63188 57051 42511 24974 19657 33112 37010 33069 24804
9772 24804 23374 13139 7359 7943 19472 26815 46129 66858 62756 44688 30023 24368 26302
9759 26302 19836 24240 21940 31798 34620 24439 22763 27896 24687 12709 13467 28744 45062 41845
9745 41845 19245 15152 22760 31567 38203 38531 24481 23504 38890 34128 18198 11174 23550 36332
9731C6332N789N161N145R497j777j6965j2087O682K306o588o050q506j755j406
9717A5778n93N199J2213l659J6657j028m014J2845n411j4524m054J1617N510p373
9703C9163o089j413N747M969o264J583k240o915k653R290l210r062k53L059m830
9688B0882J0608K800n694K081J9528l744n975j0675k279j0510N87Q476J712j0241
9674A7556n349K197J1955K28k165Q477j029o739q15k879M068R305j2322q948M045
9659A7585K150n755N478J027J0025Q71M646J5051k01j0150K042J641k000p501
9645C4909J367M056l859L890l069j2341n861k9L528r01J9118J3816j0059o796
9631C7769N434L771p976j7021j822R399L523M192M059j2804K190n423r807j6323
$$ plain form
9731 36332 42121 47282 52427 61924 60147 43182 31095 37777 40083 33495 27445 18939 17184 15778
9717 15778 15185 20384 32597 28938 45595 44567 40553 53398 47987 33463 29409 41026 46536 39163
9703 39163 33074 31661 37408 42377 36113 37696 35456 28541 25888 35178 31968 22906 22653 25712 20882
9688 20882 31490 34290 28596 30677 50205 46461 40486 29811 27532 17022 17609 26085 27797 17556
9674 17556 12207 14404 26359 26587 24422 32899 31870 25131 24316 21437 25505 34810 22488 13540 17585
9659 17585 19735 13980 19458 20485 30510 31381 36027 51078 50877 40727 42769 44410 42410 34909
9645 34909 36276 40332 36473 40363 37294 24953 19092 19063 22591 21690 40808 54624 44565 37769
9631 37769 43203 46974 38998 21977 20155 29554 33077 37269 41328 28524 30714 25291 15484 -839
9617h39Q151J9408K728P607J1008r412j0258o371J712K277J426J3994j336l824
9603C6271j0165m506O078J576J296R454p510j7129m81l069J4556K2187J1526j4955
9589D5129j2168N209N374j1623j1159L012Q301p88L736N360j2892O777J537j279
9575C4526m080j3654M621P17R920P208J144N109o508l703J9952l00P074p079j2616
9560D2331L273J369j1460q821j772J59j1926j478J6236O02O56j319J0098J6393
9546E4341k422j7304l041J7846j0043j4676n548P607K3613J3223j384J0784K2605
9533I5601L5971K0238k0063l7360l997j9128k4637j4093O054p755k567J1568j254
9520C8578K864k56J84j0826p714R668K332L8P142j1207r796Q837j3427j2774N903
$$ plain form
9617 -839 7312 26720 29448 37055 48063 38651 28393 22022 23734 26011 27437 41431 40095 36271
9603 36271 26106 21600 27678 29254 30550 40004 32494 15365 14884 11815 26371 48558 60084 45129
9589 45129 32961 38170 43544 31921 20762 23774 32075 31287 35023 40383 27491 34268 35805 34526
9575 34526 30446 16792 21413 22130 32050 39258 40402 45511 39003 35300 55252 54952 62026 54947 42331
9560 42331 45604 46973 35513 26692 24920 25079 13153 11675 27911 28513 29169 27850 37948 54341
9546 54341 51919 34615 31574 49420 39377 24701 19153 26760 50373 63596 62212 72996 95601
9533 95601 131572 151810 131747 94387 90390 71262 46625 32532 38586 30831 28264 39832 38578
9520 38578 41442 41186 41370 30544 22830 32498 34830 34868 42010 30803 21007 29844 16417 3643 9546
9505I546O976l501N8M623n100j1760J3267K0973q300k07O568q441K98l39k546
9490B2115l137J199p383J11o306P025P827N398M089J1095J362m811K481p752r313
9475B4000m810N240r524L302J3696K432k654j2521j4931M471J7376j136o328q510
9461A0103o576N746J065k340J702J5987L523L231k55J740m509j8699O254Q686
9447B5658j3424N99o884L223j187O286O827P44j192O786L207O625k80q693j0183
9432A8112J621N478k743O051N908j606L404n401j3803m425j3207K348Q729o434
9418D032O852P737k882j2648o096M754M571J174o699O78Q984P065L365R826J0270
9403D0983q95p310q984m689j171l08J2603K287p928q869K711r844j683j184k064
$$ plain form
9505 9546 16522 13021 13079 17702 12602 842 14109 35082 26782 26575 33143 24702 25000 24661 22115
9490 22115 18978 20177 12794 12905 6599 13624 21451 26849 30938 42033 43395 38584 41065 33313 24000
9475 24000 19190 24430 14906 18208 31904 34336 31682 19161 4230 8701 26077 24941 18613 10103
9461 10103 3527 9273 10338 7998 9700 25687 29210 32441 32186 33926 29417 10718 16972 25658
9447 25658 12234 12833 5949 9172 7985 14271 21098 21842 20650 27436 30643 37268 36988 28295 18112
9432 18112 19733 25211 22468 28519 34427 32821 36225 30824 17021 12596 -611 1737 10466 4032
9418 4032 10884 18621 15739 3091 -3005 1749 6320 7494 795 1473 10457 17522 20887 30713 40983
9403 40983 40088 32778 23794 19105 17934 17626 30229 32516 24588 15719 18430 8586 6903 5719 3655
9388C655R406k169n988J0565J105O232o427l46R488M865Q863N20o265o041j2832
9373A4631L964P711k00j0730j0122Q434J2008o691m241M760J2375M693M43N82
9359C7617r199j464K0917j5983j8113J561K367j2462o678L734K052J0431J2998
9346B7778q199J074Q709K801k685M124L322J4991j5248j0876K827j554L257m351
9332B5970l844J2775M960r088m884M777L578J0642o096J536k197J0437N324k4022
9318B9868j3703J3399p35j0557p577K905J1616k590k581J2958l620j8059j1136
9305A88M799J6303P279l091k62m337j2182q83Q19Q416J3374j3584p590L114J8449
9290C0812P840r677J0901n462o045l778o844L528m844K652j207M672N280M855
$$ plain form
9388 3655 13061 10892 4904 15469 16574 22806 16379 16033 25521 30386 39249 39769 33504 27463 14631
9373 14631 18595 26306 26106 15376 5254 13688 25696 19005 14764 19524 31899 36592 37035 37617
9359 37617 28418 26954 47871 31888 13775 15336 17703 5241 -1437 2297 4349 14780 27778
9346 27778 19579 20653 29362 32163 29478 33602 36924 51915 36667 25791 28618 27064 30321 25970
9332 25970 22126 34901 39861 30773 25889 30666 34244 44886 38790 40326 38129 48566 53890 29868
9318 29868 16165 29564 28829 18272 10695 13600 25216 22626 20045 33003 29383 11324 188
9305 188 4987 21290 28569 25478 25216 20879 8697 7814 8633 17049 30423 16839 9249 12363 30812
9290 30812 38652 28975 39876 34414 28369 24591 17747 21275 16431 19083 17876 22548 27828 32683
9276C2683l560R215m215L322J975R330p798o655L001M436l452P426J6801l501
9262E9008m157q472O473J1538N456N460R543r177K306m555P381j2232j2628L190
9248E9134j2042L481M966M549N426o966l762M421N721j671M7r494r36R21O919
9233F0714J4171J2817N802o439n979k227j5745k6556l954O839n577O482l305m4
9219C6999O781k467K574L758Q564j1324n648k438L959j101n889j268L558k439
9205C3619K207K801j3829j2564o242J9368J4614J770j7965k331R920J3272J1427
9192E6067N586k277O861J0401J361R885r29P604l88P646O625L907r242j3045m372
9177H5690j5424r155J3362J3119m50j028j7232J1642O062l388k692k266m299k288
$$ plain form
9276 32683 29123 38338 34123 37445 39420 48750 40952 34297 37298 41734 38282 45708 62509 59008
9262 59008 54851 46379 52852 64390 69846 75306 84849 75672 77978 73423 80804 68572 55944 59134
9248 59134 47092 50573 55539 60088 65514 58548 54786 59207 64928 63257 63304 53810 52874 53795 60714
9233 60714 74885 87702 93504 87065 81086 78859 63114 36558 32604 39443 33866 40348 37043 36999
9219 36999 43780 41313 43887 47645 56209 44885 39237 36799 40758 39657 33768 32500 36058 33619
9205 33619 35826 38627 24798 12234 5992 25360 39974 41744 23779 21448 31368 44640 56067
9192 56067 61653 59376 66237 76638 77999 87884 86955 94559 94171 101817 108442 112349 103107 90062 85690
9177 85690 70266 61111 74473 87592 87142 86114 68882 80524 86586 83198 80506 78240 73941 71653
9163G1653l921Q261R147o699J1367l636k4904q967J7607K1078p309k1751n981
9150E5945K493P376K355r526j3092m353l904o088O212P54l86O187O311K504K682
9135E5470P026k237k6853j7256o288L506j07j369L04l225J2193J1593K697K805
9121C8259P577M709n569j4736L726J6061O236L503j6501N297L647N988j470K03
9107E6930k86j1512J281J1580K0518R332j333j903j6350j8654m225l040j4203
9094B8135m920J102k677J3265N711r51N037k92j1566j130J6158L988k495o235
9080D3130O696j0182j0348j162j060R395J2673l904l820k5235J24J2787l876K273
9066B7491j1036j550J8243Q594R841o495j4262n936j4620p821O393p647m388j775
$$ plain form
9163 71653 67732 75993 85140 78441 89808 86172 61268 52301 69908 90986 83677 61926 55945
9150 55945 58438 65814 68169 58643 45551 41198 37294 31206 37418 38172 37786 43973 50284 52788 55470
9135 55470 62496 60259 33406 16150 9862 13368 13261 11892 12196 8971 21164 32757 35454 38259
9121 38259 45836 50545 44976 30240 33966 50027 56263 59766 43265 48562 52209 58197 56727 56930
9107 56930 56644 45132 46413 57993 78511 87843 86510 84607 68257 49603 45378 42338 28135
9094 28135 23215 24317 21640 34905 40616 39665 44702 44410 32844 31714 47872 51860 49365 43130
9080 43130 49826 39644 29296 28134 27074 36469 49142 45238 41418 16183 16307 29094 25218 27491
9066 27491 16455 14905 33148 41742 51583 45088 30826 24890 10270 2449 8842 1195 -3193 -4968
9052d968J417O595L696k061J0089K599k829O208O526j067j900o956o654J0587
9038B1282K683r20M721r18J518K575o802J201m116j8946K038P206q83L615j017
9023A3237M433N787P63m266j6329j7957J610M774L712N568k236J4333o551q634
9009a756O884J0865L528J083l405n265J45o333l426k1696Q017J1566M199j0285
8995e879R494k077k587p38N846m49j556L273K0132K3445J565q535k5407j5250
8981A277p842o147P432m521O581o130J1839K3621J1998j4529k4451j2192o193
8968a9257j763l694n108Q030J3771P461N060l062j709n592O883N224o202j409
8954a367Q50J598K004K170o024j096P492j1787N26N212o652O127K324k168Q884
$$ plain form
9052 -4968 -3551 3044 6740 4679 14768 17367 14538 20746 27272 26205 24305 17349 10695 21282
9038 21282 23965 23045 27766 26848 28366 30941 24139 25340 21224 2278 4316 11522 10639 14254 13237
9023 13237 17670 23457 24220 19954 3625 -14332 -12722 -7948 -4236 1332 -904 13429 6878 -1756
9009 -1756 5128 15993 19521 20604 17199 11934 12079 5746 2320 -19376 -11359 207 4406 -5879
8995 -5879 3615 1538 -1049 -1787 4059 3610 2054 5327 25459 48904 50469 41934 16527 1277
8981 1277 -6565 -12712 -5280 -9801 -3220 -9350 2489 26110 38108 23579 -872 -13064 -19257
8968 -19257 -21020 -24714 -29822 -21792 -8021 -560 4500 1438 -271 -5863 1020 6244 42 -1367
8954 -1367 -517 1081 3085 5255 -769 -1865 5627 -6160 -5634 -422 -7074 -947 1377 -791 8093
8939H093K718r062M248M08L464q350n129k098J4299M821j840L219M872L485n580
8924A7568j0889j0399N870K386q180o93m30M700R562L884k804K441o771k420P138
8909A0963R135n635o058k766m475O083K1528n814q612J1559j425j2477p669m928
8895e91P547l98J658j647j2037j5657J8155P973L298j497j2267J151J8213Q119
8881B2020K926p607o581R242l288q801k045j4671r9Q573J0896L114O559k2374
8867b136j9342J1703J2140J752J3516j2645K400J6239J6105N442k1449k0997Q831
8854A1559J1672P55o14p862j372k033k924Q854J172o533P62o808L614j5093j0201
8839a5052J5136J1977o06P403M520K0674m943j2373l109j6028j6327n460N108
$$ plain form
8939 8093 10811 1749 5997 6405 9869 1519 -3610 -5708 8591 13412 11572 14791 19663 23148 17568
8924 17568 6679 -3720 2150 4536 -3644 -4337 -4767 -67 9495 13379 10575 13016 6245 3825 10963
8909 10963 20098 14463 8405 5639 1164 7247 28775 22961 14349 25908 24483 12006 4337 -591
8895 -591 6956 6558 8216 6569 -5468 -21125 -2970 5003 8301 6804 -5463 -4312 13901 22020
8881 22020 24946 17339 10758 20000 16712 7911 5866 -8805 -8904 -331 10565 13679 20238 -2136
8867 -2136 -21478 -9775 2365 4117 17633 4988 7388 23627 39732 45174 23725 2728 11559
8854 11559 23231 23986 23372 15510 14138 12105 9181 18035 19207 12674 13436 6628 10242 -4851 -15052
8839 -15052 84 12061 11455 18858 23378 44052 39109 26736 23627 7599 -8728 -14188 -9080
8826i080K1526r41j975L864Q482k1382j4267n850Q353J5015R002n58n685o229
8812B75R418M134o40j1214Q45M937n65J1628J5450L476j2653k0178j794L354q514
8797b041K777l616J1976J3107R48j1067N299J9521M926K182j5274o957K294J1299
8783C5374q058l114o719O041O738j9959r917q88K247R692N66p80m781J4912n22
8768B0832m715m650J2958p557k784J9630l122j2239q430o286J0469p879r857J0689
8754G059R827N560k627j3365l908J3700K351j2040j561J387r746j4085K0057J5491
8740A8100K0820o700l047P77n204q932n138m088j3602N668P635K0922N401m523
8726B8089Q72J2783k324j976R633N007l674j8399j5753j801J0170K529J1663J4677
$$ plain form
8826 -9080 12446 11505 9530 13394 21876 494 -13773 -19623 -11270 3745 12747 12189 6504 275
8812 275 9693 13827 13187 1973 2818 7755 7190 18818 34268 37744 25091 4913 3119 6473 -2041
8797 -2041 736 -2880 9096 22203 23151 12084 17383 36904 41830 44012 28738 21781 24075 35374
8783 35374 27316 24202 17483 23524 30262 10303 386 -502 1745 11437 12003 11223 6442 21354 20832
8768 20832 16117 11467 24425 16868 14084 33714 30592 18353 9923 3637 14106 6227 -3630 7059
8754 7059 16886 22446 19819 6454 2546 16246 18597 6557 4996 6383 -3363 -17448 2609 18100
8740 18100 38920 32220 29173 29950 24746 15814 10676 6588 -7014 -1346 6289 27211 32612 28089
8726 28089 28961 41744 39420 37444 47077 52084 48410 30011 14258 12457 22627 25156 36819 51496
8712E1496r045j6355j0056J015R328Q355P116l510M36n765j2136O268J8928q75
8698D5200K687q626N521k847n684m003K67k785q641Q434j2577k045M531P478J0654
8683C7564R419k775R986r481j4248L433J4021m224j1751N45r527m848K2701P284
8669D8099j1390l594O434J5616j5688j6213R364P34P580L457L079J1143J55j2986
8655D5790j990J7559j259n594J2463Q676R305N918R818J4867Q453O976R828J6028
8641A56838K1757K4809L0122L3888L9677M8671M5608O7774O5991O1976L7181K5310
8629F59602p884k2664k1172k1392l4752m4648n4164m7838n3113l8177k9512k4067
8617B60219j4222j7305p743m549l528r323j1008N393J5787J1343Q581J0160J291
$$ plain form
8712 51496 42451 26096 16040 17055 26383 34738 41854 38344 38780 33015 20879 27147 46075 45200
8698 45200 47887 39261 44782 41935 36251 32248 32515 29730 21089 29523 16946 14901 19432 26910 37564
8683 37564 46983 44208 54194 44713 30465 33898 47919 43695 31944 32489 22962 18114 40815 48099
8669 48099 36709 33115 39549 55165 39477 23264 32628 33362 40942 44399 47478 58621 58776 45790
8655 45790 43800 61359 60100 54506 66969 75645 84950 90868 100686 115553 124006 130982 140810 156838
8641 156838 178595 203404 233526 267414 307091 355762 401370 469144 535135 597111 634292 659602
8629 659602 651718 629054 607882 586490 551738 507090 452926 405088 351975 313798 284286 260219
8617 260219 245997 228692 220949 216400 212872 203549 192541 197934 213721 225064 233645 243805 245096
8604B45096Q871K0655K6473J8908L1891N1548M9255N0508L5829N5810O6413L8340
8592F99597M9096R709l837j6882l8097m2921n1975n0511n5883n1402n6384l7454
8580C53056l2166k7596j9465m1044j5063j0356k9255k6820j6584p735j1980j9883
8568I5109n989M269J378M623l739J135o765p164P554O613J459J1318M52O866k0054
8553I7065o322k372n385j0244r998j1909j7742l484P433J6901K910Q583Nj1749
8539E3692n98q137j4180q059J1623N066k282m805L821p85o496n167r275k252P485
8524A9651n868L838j4812k433O806K161o171J4735J4780l970o422m182Q104m760
8510B1457p631P80j69n454k890P043J1671P447o958j3507K519Q951j464k225l500
$$ plain form
8604 245096 253967 274622 301095 320003 351894 403442 452697 503205 539034 594844 661257 699597
8592 699597 748693 758402 754565 737683 699586 656665 604690 554179 498296 446894 390510 353056
8580 353056 320890 293294 273829 232785 217722 207366 178111 151291 134707 126972 114992 95109
8568 95109 89120 93389 94767 99390 95651 96786 90021 82857 90411 97024 98483 109801 110253 117119 97065
8553 97065 90743 88371 82986 72742 62744 50835 33093 29609 37042 53943 56853 65436 65441 53692
8539 53692 53094 44957 30777 22718 34341 39407 37125 32320 36141 35356 28860 23693 14418 12166 19651
8524 19651 13783 17621 2809 376 7182 9343 3172 17907 32687 28717 22295 18113 26217 21457
8510 21457 13826 14606 14437 8983 6093 13136 24807 32254 25296 11789 14308 23259 21795 19570 16070
8495A6070j568N551J6450m062j6493j1653l629J2620J0133L539j5670j0569k739
8482b020o803j369J717o437K289L907k172l844m747m36N654L272o822j6403O576
8467b7638K2002M721j1523L569M787m480k239k309Q183l481R458k860o280J383
8453f707N291j1126N509J5286O237j7568o487R152J2657j0113j9290r145R057
8440a7247M625J130J7740n69j9465J1767L379P113J5132L427k1609j1870j019
8427g466j1501j729p119J0548J30L24N902j0496q793M270J0168L709M149M082
8413c822M733j525l816j0627m46q35R907K7527J7067o504q657j9438m284q176
8399h896n798r423m10J3353L375m66J5993o672j8156l19P811j569q398J8k273
$$ plain form
8495 16070 14502 20053 36503 32441 15948 4295 666 13286 23419 26958 11288 719 -2020
8482 -2020 -8823 -10192 -8475 -14912 -12623 -8716 -10888 -14732 -19479 -19915 -14261 -10989 -17811 -34214 -27638
8467 -27638 -5636 -915 -12438 -8869 -4082 -8562 -10801 -13110 -4927 -8408 1050 -1810 -8090 -6707
8453 -6707 -1416 -12542 -7033 8253 14490 -3078 -9565 -413 12244 2131 -17159 -26304 -17247
8440 -17247 -12622 -11492 6248 5679 -13786 -2019 1360 8473 23605 27032 5423 -6447 -7466
8427 -7466 -18967 -20696 -27815 -17267 -17137 -16813 -10911 -21407 -30200 -25930 -15762 -12053 -7904 -3822
8413 -3822 911 -614 -4430 -15057 -15503 -16338 -6431 21096 38163 31659 23002 3564 -720 -8896
8399 -8896 -14694 -24117 -24527 -11174 -7799 -8265 7728 1056 -17100 -17419 -9608 -11177 -19575 -19557 -21830
8384b1830n450j482Q848J5716m809K998O88R93J5917r07j6793J175o00M351o630
8369g815j2277p802o287k347l191N704Q517N640O004r368j6551J0233N82j261
8355c0219K832L595m155r248J2450K3503K181Q1j342l114R625j622j3206l92J660
8340g371k3383q326o672L081J6320K4756J5735O196q29k664j6088j3313K2509
8327I951J6097o935j3579o092j445J5760l184q55M452j4679k498K242J5896p211
8313G920j8254M473J455l241Q512Q816p092j4166L272J3999l970m475l716Q048
8299A581J7032P040p630j2875p900J0294Q678M720k470n923j2090L355R753o325
8285G240o634k240K552N374j2626j1086m150N135J1432Q526R161M06j2275j4336
$$ plain form
8384 -21830 -27280 -28762 -19914 -4198 -9007 -6009 -5321 -4328 11589 10682 -6111 -4936 -5536 -1185 -7815
8369 -7815 -20092 -27894 -34181 -36528 -39719 -34015 -25498 -19858 -13854 -23222 -39773 -29540 -28958 -30219
8355 -30219 -27387 -23792 -27947 -37195 -24745 -1242 939 1020 -322 -3436 6189 4567 -8639 -9031 -7371
8340 -7371 -30754 -39080 -45752 -42671 -26351 -1595 14140 20336 19507 16843 755 -12558 9951
8327 9951 26048 19113 5534 -558 -2003 13757 10573 9718 14170 -509 -3007 -765 15131 7920
8313 7920 -10334 -5861 -4406 -7647 865 9681 2589 -11577 -8305 5694 1724 -2751 -6467 1581
8299 1581 18613 25653 18023 5148 -2752 7542 16220 20940 18470 12547 457 3812 13565 7240
8285 7240 606 -1634 918 6292 -6334 -17420 -21570 -16435 -5003 3523 12684 13090 815 -13521
8271a3521j5477l65O140j5041J310J4795J7298l435r019J2084M229l667q929l498
8257a7096L750J0722l929J620J1616J2858p4j5014j1393r090p703M593J5686Q488
8243E034q281N188P937r925l932l182P04R382K28j5550r491K552j924k985P475
8228a6770J4774J087L464K982m040P803k973k661m838N275j0297j1848O690O044
8214e308L065N500n3j632r610p190r866o467Q419N115K077Q726K40j6041p651
8199c0676J2407R756J140l705M276N483N283q351P233L616P462k2j6162o267k134
8184a0661P47R81Q041P494O841j4188j0550J230K4142L785j309n55j5313l552
8170b867n421J862J479j5397j511J9304M329q834K111K590k376M649N740J1025
$$ plain form
8271 -13521 -28998 -29363 -23223 -38264 -36954 -22159 -4861 -8296 -17315 -5231 -1002 -4669 -13598 -17096
8257 -17096 -13346 -2624 -6553 -4933 6683 19541 19467 4453 -6940 -16030 -23733 -19140 -3454 5034
8243 5034 -3247 1941 9878 -47 -3979 -7161 -6457 2925 3153 -12397 -21888 -19336 -21260 -24245 -16770
8228 -16770 -1996 -909 2555 5537 1497 9300 6327 3666 -1172 4103 -6194 -18042 -11352 -5308
8214 -5308 -2243 3257 3204 1572 -8038 -15228 -25094 -31561 -23142 -18027 -15950 -7224 -6984 -23025 -30676
8199 -30676 -18269 -8513 -7373 -11078 -6802 -1319 3964 -4387 2846 6462 13924 13902 -2260 -8527 -10661
8184 -10661 -9914 -8933 -892 6602 13443 -745 -11295 -10065 14077 17862 16553 15998 685 -2867
8170 -2867 -8288 -6426 -4947 -20344 -21855 -2551 1778 -7056 -4945 -2355 -4731 -82 5658 16683
8156A6683j1140j6427m779r835O768r00k00J0756m300j2112k67j297J0818N612
8142a0620Q076J253R339p491o608m489l540K0299J0136n499L560J1713M58p911
8128A8676m443J2159j9512p587L484l550J6375P460p797k0232m683l642Q149J2513
8114G370J9718J1631j9570q754O497j46O764j3n807r02Q992O395j4875r611j615
8099F074n818J2249P095k476o223q641j1575j0277J1124n058m365J2377l76q875
8085a4765l751R610K0089J323j0064j1402j425O290j580Q727P444q121J4674Q231
8071B5280L903L791J116n09m116k920K572j96j901q202j6716Q059K2933M293q559
8056B8828r255j4709L231m839j1674J315P916R890M938M751P823j9163p542Q405
$$ plain form
8156 16683 5543 -10884 -15663 -25498 -18730 -19630 -19830 -9074 -13374 -25486 -25753 -27050 -16232 -10620
8142 -10620 -2544 -1291 8048 557 -6051 -10540 -14080 6219 16355 10856 14416 26129 26587 18676
8128 18676 14233 26392 6880 -707 2777 -773 15602 23062 15265 -4967 -9650 -13292 -5143 7370
8114 7370 27088 38719 19149 10395 16892 16746 23510 23497 17690 16788 25780 32175 17300 7689 6074
8099 6074 256 12505 19600 17124 10901 2260 -9315 -19592 -8468 -13526 -17891 -5514 -5890 -14765
8085 -14765 -18516 -8906 11183 12506 2442 -8960 -10385 -4095 -5675 3052 10496 2375 17049 25280
8071 25280 29183 32974 34090 33581 29465 26545 29117 28921 27020 18818 2102 10161 33094 37387 28828
8056 28828 19573 4864 8095 3256 -8418 -7103 813 10703 15641 20392 28215 9052 1510 9915
8042I915O08r45r275l22P367J517J526o251M350K410l864m423K493N446K491m214
8026H829O701K564n874R455K685O291k120J5709Q808m745q785N707j029K71j0237
8011C4230o555j0797Q740N823J4370J0433O060k456n579j434m436j6864k1153
7998A0382Q305o10o295m521o216K317N945j3213P465R551m260j4684P518J6270
7984A7954L104J1237p594j4976o416l115L153J7440N607L657p37j10P504O064
7970D2772l378O56N518n579r744J32M653M559k073j6223k21R214N183J3409J3260
7955F2138j4725r205j2557n658K081r746n008o050L648j084j285j511J1438P809
7941B0285p578o538k165p438k016Q966q798q3m113L662N441l944o53k376o030
$$ plain form
8042 9915 10523 9578 303 -19 7348 8865 10391 4140 8490 10900 7036 2613 5106 10552 13043 8829
8026 8829 15530 18094 12220 21675 24360 30651 28531 44240 53048 48303 39518 45225 44196 44467 34230
8011 34230 27675 16878 25618 31441 45811 56244 62304 59848 54269 52835 48399 31535 10382
7998 10382 18687 18077 11782 7261 1045 3362 9307 -3906 3559 13110 8850 -5834 1684 17954
7984 17954 21058 32295 24701 9725 3309 194 3347 20787 26394 30051 29314 29204 36708 42772
7970 42772 39394 40050 45568 39989 30245 30377 35030 39589 37516 21293 21072 30286 35469 48878 62138
7955 62138 47413 38208 25651 19993 22074 12328 7320 1270 4918 3834 2549 1038 12476 20285
7941 20285 12707 6169 4004 -3434 -5450 3516 -5282 -5365 -9478 -5816 -375 -4319 -4972 -7348 -13378
7926a3378R5J4664N092R09l491k468N785O704J1488j562j2644R892P950J626j3571
7911A7091j6372Q546Q857o117p444N007n998m833K461L964j560j937J832J1556
7897A5053j1097m581Q734l468q740k831n031n325O626J0058j1725Q176J4287N248
7883A5384l558k451o909j1674J93J888N359J0630Q58j4714J4124K4254j0764k3687
7869a067j9336K399N592J2346J7700J991q052q784j5816k205j159P629M178J4811
7855A0227k267P214k40j0398o643O624N713j7816k761L255J68K16j2572j8879
7841c8159n964P951O831Q218L79J2575Q399n28k783L205M138r869p189L211q429
7826a8014p498P571o90j6393O215J8637j969K106Q615l359j4326j6291M856J5463
$$ plain form
7926 -13378 -13283 1381 6473 7382 3891 1423 7208 13912 25400 23838 11194 21086 29036 30662 17091
7911 17091 719 9265 18122 12005 4561 9568 3570 -1263 1198 5162 3602 1665 3497 15053
7897 15053 3956 -625 8109 4641 -4099 -6930 -11961 -17286 -10660 -602 -12327 -4151 10136 15384
7883 15384 11826 9375 2466 -9208 -9015 -7127 -1768 8862 9720 -4994 9130 33384 22620 -1067
7869 -1067 -20403 -18004 -12412 -66 17634 19625 11573 2789 -13027 -15232 -16391 -8762 -4584 10227
7855 10227 7960 15174 14934 4536 -2107 4517 10230 -7586 -10347 -7092 -6924 -6708 -19280 -38159
7841 -38159 -44123 -36172 -29341 -21123 -20744 -8169 230 -298 -3081 124 4262 -5607 -12796 -9585 -18014
7826 -18014 -25512 -17941 -18631 -35024 -28809 -10172 -12141 -10035 -1420 -4779 -19105 -35396 -30540 -15077
7812a5077P691l350K81k552L298q68J289j8352J4907N564l751l004P350r206l072
7797a8852k498n756l84L989k445R211l211l992Q238j282Q713J0417J442o756k631
7782e797O259k89l654j890M81o84j0948J693J5999P735j1676P816O762j2066j2751
7767a3010J326o452q075Q229N265j1410K915J0160M990P537Q797J756r905q071
7753e948M662O26o337j0821j7690O235J9620L03l552L125l349q671L529J192m090
7738b1166O304J0039M775K248J0346R254o470j1436l861p097L714j174Q855M516
7724H847K314j0630j0356j3763n689m508k656M591N937J990J0634P512M767K999
7710A989r558r344K418j1144R133J2250J166Q368M41n78O016K44O075j7692k8673
$$ plain form
7812 -15077 -7386 -10736 -10455 -13007 -9709 -10577 -9288 -27640 -12733 -7169 -10920 -13924 -6574 -15780 -18852
7797 -18852 -21350 -27106 -27490 -23501 -25946 -16735 -19946 -23938 -15700 -16982 -8269 2148 3590 -3166 -5797
7782 -5797 462 173 -3481 -5371 -4890 -5574 -16522 -14829 1170 8905 -2771 5045 11807 -259 -13010
7767 -13010 -11684 -18136 -26211 -17982 -12717 -24127 -21212 -11052 -6062 1475 10272 12028 2123 -5948
7753 -5948 -1286 -660 -6997 -17818 -35508 -29273 -9653 -9350 -12902 -9777 -13126 -21797 -18268 -17076 -21166
7738 -21166 -14862 -4823 -48 2200 12546 21800 15330 3894 33 -7064 -3350 -4524 4331 8847
7724 8847 11161 531 -9825 -23588 -29277 -33785 -36441 -31850 -25913 -23923 -13289 -5777 -1010 1989
7710 1989 -7569 -16913 -14495 -25639 -16506 -4256 -3090 5278 5719 5141 11157 11401 17476 -216 -28889
7695b8889k1081r395Q100J5301P817M576O449j0720M028J1157J6714J0361j0112
7682D306P906j200j8178m036N537k0983r599M146J9401K1486k102j8651m776M7
7668a6696n199M655j055n78P38P057L082m187j1974q562j864J342R869J0500N908
7653f964J3734j4500p872J1779l211K593n703j4692l991Q234J000j391o43P717
7639a3910P362J091l76J2639n281k859L835k259j3278m430Q248k929k2083k715
7625c6945O037J8363O411M916r656j0795k15J2109p485m126J0402k390k994J2858
7611c510K3928m038j0236K307J0467m247j6790j795q49R750M428j6070j8243R092
7597a5806N853k768p048M344k0086q966J2569J7362J1365L531K298P662j1390
$$ plain form
7695 -28889 -49970 -59365 -51265 -35964 -28147 -23571 -17122 -27842 -23814 -12657 4057 14418 4306
7682 4306 12212 11012 -7166 -11202 -5665 -26648 -36247 -32101 -12700 8786 6684 -11967 -16743 -16696
7668 -16696 -21895 -17240 -18295 -18873 -18135 -11078 -7996 -12183 -24157 -32719 -34583 -33241 -23372 -12872 -6964
7653 -6964 6770 -7730 -15602 -3823 -7034 -4441 -10144 -24836 -28827 -20593 -19593 -20984 -21627 -13910
7639 -13910 -6548 -5457 -5833 6806 1525 -1334 2501 242 -13036 -17466 -9218 -12147 -34230 -36945
7625 -36945 -30908 -12545 -6134 -1218 -10874 -21669 -21884 -9775 -17260 -21386 -10984 -13374 -16368 -3510
7611 -3510 20418 16380 6144 8451 18918 14671 -2119 -3914 -4763 4987 9415 -6655 -24898 -15806
7597 -15806 -9953 -12721 -19769 -15425 -35511 -44477 -31908 -14546 -3181 350 2648 10310 -1080
7584a080k8464q802K740J4276L324J2287J5275Q408k1022j2894j3738m854Q194
7571b6350O934l753O498j0434q267J25J0221N813m88j3507O738m443p2J662J1378
7556a7945M719n787m581J2455P388P820n645l25O073m989J6589l393j0391n144
7542c156R91p998Q367m70N716L401o328j1848Q451R578P34l579J1689N142j8520
7527B170j0771p247q900P044k867l791N50P386J3565P116N939j253r831k43N345
7512D212m912l581p17q976r866M539m483P049L140m543K315J876M051k543K341
7497a0098j4287p071J7107k431j2664L292K336k831J6014J1128M591n839p595
7484h348k778k886n297M150J1531R798j0905j0335M624J0686k029j0792o416J2120
$$ plain form
7584 -1080 -29544 -38346 -35606 -21330 -18006 -5719 9556 17964 -3058 -15952 -29690 -34544 -26350
7571 -26350 -19416 -23169 -16671 -27105 -35372 -35247 -25026 -19213 -19701 -33208 -26470 -30913 -30985 -29323 -17945
7556 -17945 -13226 -19013 -23594 -11139 -3751 4069 -1576 -1901 4172 -817 15772 12379 1988 -3156
7542 -3156 -2165 -10163 -1796 -2266 3450 6851 523 -11325 -2874 6704 7438 3859 15548 20690 2170
7527 2170 -8601 -15848 -24748 -17704 -20571 -24362 -23812 -16426 -2861 4255 10194 8941 -890 -1133 4212
7512 4212 -700 -4281 -4998 -13974 -23840 -19301 -23784 -16735 -13595 -18138 -15823 -13947 -9896 -12439 -10098
7497 -10098 -24385 -31456 -14349 -16780 -29444 -26152 -23816 -26647 -10633 495 5086 -753 -8348
7484 -8348 -11126 -14012 -19309 -15159 -3628 6170 -4735 -15070 -10446 240 -1789 -12581 -18997 -6877
7470f877J0571kQ577M441j911o954o785j5310R962j494L892o68n254k859J582
7455i089j534j9357l427L202R029J4471P990M52n947m032J633Q684K110j0804
7441f619j5032j0182N197N372j835J8171o66l826j61K373K518k935P342o105l434
7426i822Q781J0536l879r951l525K847o285l317n980k012N928J3437r577Q315
7412d504J5758k067r97q422o986k788K341r408j511M890J4234l162j0526k365
7398a5513j5256q907K91n414P790J2395J1606l771L354M580q49l602r591o884
7384b9771K280k714J177K4929R357k598n385J28q435k047O155j2978n467o526
7370c1895n498K3353J5116j8333N59p313j0982M255J0291K0167K306j1727j3017
$$ plain form
7470 -6877 3694 3692 12269 16710 14799 7845 1060 -14250 -4288 -5782 -1890 -2558 -7812 -10671 -9089
7455 -9089 -10623 -29980 -33407 -30205 -21176 -6705 1285 1737 -4210 -8242 -6609 2075 4185 -6619
7441 -6619 -21651 -31833 -26636 -21264 -23099 -4928 -5594 -9420 -9581 -7208 -4690 -7625 -283 -6388 -9822
7426 -9822 -1041 9495 5616 -4335 -7860 -5013 -11298 -14615 -20595 -22607 -16679 -3242 -12819 -4504
7412 -4504 11254 9187 8190 -232 -7218 -10006 -7665 -17073 -18584 -13694 540 -2622 -13148 -15513
7398 -15513 -30769 -39676 -39385 -44799 -37009 -24614 -13008 -16779 -13425 -8845 -9694 -13296 -22887 -29771
7384 -29771 -27491 -30205 -29028 -4099 5258 2660 -2725 -2597 -11032 -13079 -6924 -19902 -25369 -31895
7370 -31895 -37393 -14040 1076 -17257 -16698 -24011 -34993 -30738 -20447 -280 2026 -9701 -22718
7357b2718j9531M359J1257K0660m036n993P201M870k92n939J523J4994L36l897
7343B794K224k337o280n469j0186J59P179N463q511l048k632o447n535L962J9665
7328h999J3605l292k697M34n899J365L683m793k903N831j880j2400q207N706Q038
7313a2408P269P480L023j1754j329m231Q079J141L883J571j8137n474J1378J83
7299i326J5248l329p101q87n470J719O473o403M096k20K805k577k784n95p322
7284a5673N259R204J2425P383l860k983L448m151j760O964J2580m585k1097q488
7270e334J447N949J621P87q234q240o98J773p42j5594R099Q979m316P880j40k529
7254h292P278m360j6880n392J4454J0621N124j2874q205K760N713O550P713L273
$$ plain form
7357 -22718 -42249 -37890 -26633 -5973 -10009 -16002 -8801 -3931 -4223 -10162 -8639 6355 6691 2794
7343 2794 5018 2681 -3599 -9068 -19254 -19095 -11916 -6453 -14964 -18012 -20644 -27091 -32626 -28664 -8999
7328 -8999 4606 1314 -1383 -949 -6848 -5483 -1800 -6593 -9496 -3665 -5545 -17945 -26152 -20446 -12408
7313 -12408 -5139 2341 5364 -6390 -7719 -11950 -3871 -2730 1153 2724 -15413 -20887 -9509 -9326
7299 -9326 5922 2593 -4508 -5395 -10865 -9146 -2673 -9076 -4980 -5200 -2395 -4972 -7756 -8351 -15673
7284 -15673 -10414 -1210 11215 18598 14738 11755 15203 11052 9292 16256 28836 24251 3154 -5334
7270 -5334 -3887 2062 3683 4470 -3764 -12004 -12702 -10929 -11671 -27265 -18166 -9187 -13503 -5623 -5763 -8292
7254 -8292 -1014 -5374 -22254 -27646 -13192 -2571 2553 -10321 -18526 -15766 -10053 -3503 4210 7483
7240G483j5127q212M460P785L043O426o250k0682o834N373J2290N648k250k605
7226i452k091M407J0217P311L579j7740j5090L599N573r966n344J971n671l538
7212c2235J2200O194o247L185R074P09r313O765L312j0444J132J8536n628J155
7198a605j05j100o267j9710k7J7760j1843J69l472J8892J150j2867m275j321o528
7183c1149J696K461N526J3817J2949k603l772J0185N487k011k64j6539p92m557
7169i566m882K962J247P82r122O004R307k23Q579j0426n06k524L816J7827o280
7154F995j0657k445K0015J4189j7841j6136N168N117k522q811l725O707O203P86
7140C043N822K341o651k27o910j616k86J696o883o993q848q893P635M791R079
$$ plain form
7240 7483 -7644 -15856 -11396 -3611 -568 5858 -392 -21074 -27908 -22535 -10245 -4597 -6847 -9452
7226 -9452 -11543 -7136 3081 10392 13971 -3769 -18859 -15260 -9687 -19653 -24997 -23026 -28697 -32235
7212 -32235 -20035 -13841 -20088 -16903 -7829 -7120 -16433 -9668 -6356 -16800 -15668 2868 -2760 -1605
7198 -1605 -1710 -2810 -9077 -28787 -28814 -11054 -22897 -22728 -26200 -7308 -6158 -19025 -23300 -24621 -31149
7183 -31149 -29453 -26992 -21466 -7649 5300 2697 -1075 9110 14597 12586 12322 -4217 -5009 -9566
7169 -9566 -14448 -11486 -10239 -9457 -18579 -12575 -3268 -3491 5088 -5338 -5844 -8368 -4552 13275 6995
7154 6995 -3662 -6107 13908 28097 10256 -5880 -712 4405 1883 -6928 -10653 -3946 2257 3043
7140 3043 8865 11206 4555 4328 -2582 -4198 -4484 -2788 -9671 -16664 -25512 -34405 -26770 -21979 -12900
7125a2900l563o659o296O827n258R588M396N601j31J0410J3965k854j3082q988
7111h944q061o801J2720P286j1017n24L899j351j071J0563l376r022K0683Q990
7097A3974m965j4239r094J2726K204n540j0405k336j2170N037J4J1692m68N60
7083a3010m084j2034J2377J0878r548m896K62p673J627R300M331N034Q157L852
7069D573n975j4126k840M328R936o989P304L9R073j640J340n498m435L305j0815
7054a2420j4796k615O784K1144o17l296J407L515K0360N180j3866j3352q063O824
7040c811L192J1j5012n716J965N468J6651J9648q491q130l977p565o650k1890
7026c4307p31P99J858J3834R350P349n62Q508R75K543o726q427j4602k163K5086
$$ plain form
7125 -12900 -16463 -23122 -29418 -22591 -27849 -18261 -13865 -8264 -8395 2015 15980 13126 44 -8944
7111 -8944 -17005 -23806 -11086 -3800 -14817 -15341 -11442 -12793 -13864 -3301 -6677 -15699 4984 13974
7097 13974 9009 -5230 -14324 -1598 606 -4934 -15339 -17675 -29845 -24808 -24794 -13102 -13570 -13010
7083 -13010 -17094 -29128 -16751 -5873 -15421 -20317 -20055 -27728 -26101 -16801 -12470 -7436 721 4573
7069 4573 -1402 -15528 -18368 -14040 -4104 -11093 -3789 -3750 5323 3683 5023 -475 -4910 -1605 -12420
7054 -12420 -27216 -29831 -23047 -1903 -2520 -5816 -4409 -894 19466 24646 10780 -2572 -10635 -3811
7040 -3811 -619 -608 -15620 -21336 -19371 -13903 2748 22396 13905 5775 1798 -5767 -12417 -34307
7026 -34307 -35038 -34239 -32381 -18547 -9197 -1848 -2410 6098 7073 9616 2890 -5537 -20139 -22302 2784
7011B784J1484p948l986M181P459j2155l998j960n459l565n129j1641l81Q101
6997b2213o906m244j0175J3902N059p038N030L938j117K995J7147J0983J210j6804
6983h233j4585M304N033j673J838K247n038j244N18J1210M124j714N97N61M912
6968B857N945O365l393m009q048j6440m448n602N353p74K858J0504J0317j231
6954B54p314K574L487n750j1444J400r630j4403J918K0799o060j4254q88P789
6940c1522J4632K829J1681L24M266j127l041j5764L767r74J1800M185n636j091
6926e671j1781j032M783J0716L76k761k621p854J4555M775K539p131o711n754
6912a3572r951K949M892N082o111j415J46M659J2560j2576m273P982L89J3854
$$ plain form
7011 2784 14268 6320 2334 6515 13974 1819 -2179 -4139 -9598 -13163 -18292 -29933 -30314 -22213
6997 -22213 -29119 -33363 -43538 -29636 -24577 -31615 -26585 -22647 -23764 -20769 -3622 7361 8571 -8233
6983 -8233 -22818 -18514 -13481 -15154 -13316 -11069 -16107 -17351 -16833 -5623 -1499 -3213 -2616 -2055 2857
6968 2857 8802 15167 11774 7765 -283 -16723 -21171 -26773 -21420 -22194 -19336 -8832 1485 254
6954 254 -7060 -4486 -999 -6749 -18193 -16793 -26423 -40826 -38908 -18109 -24169 -38423 -39311 -31522
6940 -31522 -16890 -14061 -2380 -2056 2210 1083 -1958 -17722 -13955 -14929 -3129 1056 -4580 -5671
6926 -5671 -17452 -18484 -13701 -2985 -2609 -5370 -7991 -15845 -1290 3485 6024 -1107 -7818 -13572
6912 -13572 -23523 -20574 -15682 -10600 -16711 -18126 -17980 -13321 -761 -13337 -17610 -9628 -9239 4615
6898D615m293j4742R58K412j0376J209q380r806N039J4147j964L29m46K1321N593
6883E616p452p506j6666N30Q442l865O501j617m808J660L922J264J0675K460L485
6868B641k051P379j5091N692J8290K204j787j0659l268K47R095p220M50K232o04
6853G550p301o063j2336P865P931p611j1989J0816O64j781q83N981Q160J74J670
6838B847M133K715r632k354k686q472j2025J7242O402l806K455o070n535J1352
6824c434J4694n704j9514j2958J6886M066J0268K517j1516J2165L21m864k849
6811G8k895J0758p613L059Q012j5652j1486Q378L233O801J591j023k703m68k500
6796b430N552K527R01j490M750K371N258j4051j7999m521o975r496Q873M253J2645
$$ plain form
6898 4615 322 -14420 -13462 -11050 -21426 -20217 -28597 -38403 -33364 -19217 -21181 -20852 -21298 23 5616
6883 5616 -1836 -9342 -26008 -25478 -17036 -20901 -14400 -16017 -20825 -19165 -15243 -13979 -3304 -844 2641
6868 2641 590 7969 -7122 -1430 16860 19064 17277 6618 3350 3597 12692 5472 5922 8154 7550
6853 7550 249 -5814 -18150 -10285 -2354 -9965 -21954 -11138 -10474 -12255 -13138 -7157 1003 1177 2847
6838 2847 6980 9695 63 -2291 -4977 -13449 -25474 -8232 -1830 -5636 -3181 -9251 -14786 -3434
6824 -3434 11260 5556 -13958 -26916 -10030 -5964 4304 6821 -4695 7470 7791 2927 78
6811 78 -2817 7941 328 3387 11399 -4253 -15739 -7361 -4128 2673 4264 3241 538 70 -2430
6796 -2430 3122 5649 6550 5060 9810 12181 17439 3388 -14611 -19132 -26107 -35603 -26730 -22477 -9832
6781i832P818l293o048m206Q624J0990r16N03L883m272q465p935p506J0703J7209
6766G257M631K046J932L337p185j0297N107R857M387n444q941k192j263P059J520
6751A1811l162n070K973J1307K294o875k0980l745R452m350J1471Q697K829J386
6737A8038R323Q650p241l042l18j182K8300K5414K8516K2831j679j9885l1292
6724G6433j9279k1796j8775j0429l38p393j6840K005M1O819N975O06M927J163
6710C119l598j618P085J3733J35j2547l364q906p589j688N799M594m858q149l58
6695a8210n144j857N286J1498m929L00L527j663p545J906N873P497R598j941j3562
6680i366q160J1044K4224q378j3212j4054J423j0742j1207N870P483R538J2387
$$ plain form
6781 -9832 -2014 -5307 -11355 -15561 -6937 4053 3137 3640 7523 3251 -5214 -13149 -20655 -9952 7257
6766 7257 11888 13934 15866 19203 12018 1721 6828 16685 21072 15628 6687 4495 3232 10291 11811
6751 11811 8649 3579 6552 17859 20153 13278 -7702 -11447 -1995 -6345 5126 13823 16652 18038
6737 18038 27361 36011 28770 25728 25410 24228 52528 77942 106458 129289 127610 107725 76433
6724 76433 57154 35358 16583 6154 5816 -1577 -18417 -16412 -16371 -9552 -3577 -2971 1956 3119
6710 3119 -479 -2097 4988 18721 18856 6309 2945 -5961 -13550 -15238 -9439 -4845 -9703 -17852 -18210
6695 -18210 -23354 -25211 -19925 -8427 -13356 -13056 -9529 -11192 -18737 -16831 -10958 -3461 6137 4196 -9366
6680 -9366 -17526 -6482 17742 9364 -3848 -17902 -16479 -27221 -38428 -32558 -25075 -15537 -3150
6667c150p06j3104k157K0117R01k279R704j524r823J6204J1069j0697j2585o063
6653d093M142n898k1773j814j474M649Q796m884J987J676Q356K492j81N695J043
6638a281M440q4J1251O903l55p940k911k589K246J1609P706P23m293l928k2864
6623a367q728Q859l833J7l147n857P52K802Q057J509q303r231P132k013k807l15
6607a6473P25O822M739O979J1737K944n222j8871j2356m103j4084l435K2610J2841
6593e147o219R938r300j4026m654K362Q922J0952o036m310o319k047J0304J1124
6579d456J2997l568j8537J306J0798J865p686o076q94M976l199n535O76k126R322
6564a0137M990p671R528J4618j0036l703m328o605R660J2216j0013j3986n373
$$ plain form
6667 -3150 -3856 -16960 -19117 1000 1901 -378 9326 7802 -2021 14183 25252 14555 1970 -4093
6653 -4093 49 -5849 -27622 -29436 -30910 -26261 -17465 -22349 -20362 -18686 -10330 -7838 -8019 -2324 -1281
6638 -1281 3159 3075 14326 21229 20874 12934 10023 7434 9680 21289 28995 29718 25425 21497 -1367
6623 -1367 -10095 -1236 -5069 -5052 -8199 -14056 -13304 -10502 -2445 -936 -9239 -18470 -11338 -13351 -16158 -16473
6607 -16473 -15748 -8926 -4187 2792 14529 17473 12251 -6620 -18976 -23079 -37163 -40598 -17988 -5147
6593 -5147 -11366 -1428 -10728 -24754 -29408 -27046 -18124 -7172 -13208 -17518 -23837 -25884 -15580 -4456
6579 -4456 8541 4973 -13564 -12258 -1460 405 -7281 -13357 -14251 -9275 -12474 -18009 -17333 -19459 -10137
6564 -10137 -5147 -12818 -3290 11328 1292 -2411 -6739 -13344 -3684 8532 -1481 -15467 -20840
6551b0840L136Q546L545n934J373N809J304o701p909J857M297J4398o875r48j808
6536f750L213J579L47j4442k006P753p374P68J0813M823O762m888k2052q892L836
6521b6510J9222J0844J168j5351L252N036Q817Q197j1398r453o704l081K458l897
6507a7400N606J397j1467k761J6060K358J2411J20j4229l676m078K100o195n110
6493b4864O620j394L231P956L25J2129k521p611Q401K973j1921l111r096k993
6479b1876j3695J7944J4286q300j8070J7050Q271n525l312p982n61J760R21P426
6465a1663k612m428K060K1838R460n283r837p201J5090N736j593j6005K538j168
6451c068N283k810P43M466k963o870j8652j0825J4396J1592L094r765n239r012
$$ plain form
6551 -20840 -17704 -9158 -5613 -11547 -10174 -4365 -3061 -9762 -17671 -15814 -11517 2881 -3994 -4942 -6750
6536 -6750 -3537 -1958 -1611 -16053 -18059 -10306 -17680 -16912 -6099 -1276 5486 598 -21454 -30346 -26510
6521 -26510 -7288 3556 4724 -10627 -7375 -2339 6478 14675 3277 -6176 -12880 -15961 -13503 -17400
6507 -17400 -11794 -10397 -21864 -24625 -8565 -6207 6204 6324 -7905 -11581 -15659 -13559 -19754 -24864
6493 -24864 -18244 -19638 -16407 -8451 -8126 4003 1482 -6129 2272 5245 -6676 -9787 -18883 -21876
6479 -21876 -35571 -17627 -3341 -11641 -29711 -12661 -4390 -9915 -13227 -21209 -21770 -20010 -19089 -11663
6465 -11663 -14275 -18703 -16643 5195 14655 9372 -465 -7666 7424 13160 11567 -4438 -1900 -3068
6451 -3068 2215 -595 148 4614 1651 -5219 -23871 -34696 -20300 -8708 -5614 -15379 -20618 -29630
6437b9630K053J1202L825J6904N496L042r80p742n234r130r429M103l033P901
6423a0652Q639p688p864m174O236J2047J9072P87q017l752m268J513l229p727
6409i077Q3J4610n321p464O8o667J4129r45m455l331J8447n233j3785P876J343
$$ plain form
6437 -29630 -27577 -16375 -12550 4354 9850 12892 11912 4170 -1064 -10194 -19623 -15520 -18553 -10652
6423 -10652 -2013 -9701 -17565 -21739 -15503 -3456 15616 16403 8386 4634 366 1879 -1350 -9077
6409 -9077 -8994 5616 295 -7169 -7101 -13768 361 -584 -5039 -8370 10077 4844 -8941 -1065 278
$$ [...]
##END NTUPLES=NMR SPECTRUM
##END=
