##TITLE=Analysis number 328548
Compound Code cc 60606
Book Reference 494/180
Project Code adrs
Chemist Name craigr
##JCAMPDX= 6.0         $$ Bruker NMR JCAMP-DX V2.0
##DATA TYPE= NMR SPECTRUM
##DATA CLASS= NTUPLES
##ORIGIN= Bruker BioSpin GmbH
##OWNER= nmr
$$ XWIN-NMR		Version 3.5
$$ Thu Jun 14 13:03:14 2007 GMT Daylight Time (UT+1h)  MAYBRIDGE\nmr@NMR_250MHZ
##.OBSERVE FREQUENCY= 250.131544655141
##.OBSERVE NUCLEUS= ^1H
##.ACQUISITION MODE= SIMULTANEOUS (DQD)
##.ACQUISITION SCHEME= undefined
##.AVERAGES= 16
##.DIGITISER RES= 18
##SPECTROMETER/DATA SYSTEM= dpx250
##.PULSE SEQUENCE= zg30
##.SOLVENT NAME= CDCl3
##.SHIFT REFERENCE= (INTERNAL, CDCl3, 0, 16.522)
##AUDIT TRAIL= $$ (NUMBER, WHEN, WHO, WHERE, WHAT)
$$ ##TITLE= Audit trail, XWIN-NMR		Version 3.5
$$ ##JCAMPDX= 5.01
$$ ##ORIGIN= Bruker BioSpin GmbH
$$ ##OWNER= nmr
$$ C:\u/data/dgb/nmr/ADRS/910/pdata/1/auditp.txt
$$ ##AUDIT TRAIL=  $$ (NUMBER, WHEN, WHO, WHERE, WHAT)
(   1,<2007-06-14 13:02:49.49 +100>,<MAYBRIDGE\nmr>,<NMR_250MHZ>,
      <created by zg, POWCHK disabled, PULCHK disabled
       configuration hash MD5:
       76 6E 9A 78 1E 09 19 81 EC 84 63 8F B0 6A 59 2D
       data hash MD5: 64K
       00 42 4C 2B 52 FA 0D 5B 5B 0E 15 05 16 9E 80 F6>)
(   2,<2007-06-14 13:03:03.81 +100>,<MAYBRIDGE\nmr>,<NMR_250MHZ>,
      <Start of raw data processing
       ef LB = 0.3 FT_mod = 6 PKNL = 1 SI = 32K 
       data hash MD5: 32K
       5F 2D E8 52 06 FC 40 CF 51 51 46 82 9F BE 35 6E>)
(   3,<2007-06-14 13:03:05.74 +100>,<MAYBRIDGE\nmr>,<NMR_250MHZ>,
      <apk 
       data hash MD5: 32K
       24 67 67 E5 D2 A2 87 E3 4E E9 C9 2D 7B CA 78 72>)
(   4,<2007-06-14 13:03:06.89 +100>,<MAYBRIDGE\nmr>,<NMR_250MHZ>,
      <abs ABSG = 5 
       data hash MD5: 32K
       C9 B1 ED D2 29 F7 E7 E1 9F D0 22 08 06 72 25 B2>)
$$ ##END=
$$ 
$$ hash MD5
$$ F4 69 89 F6 3C A4 CD CF 62 F1 D8 8B EF 46 B5 14
##$RELAX= 
##$RELAX= 
##$RELAX= 
##$RELAX= 
##$RELAX= 
##$RELAX= 
##$RELAX= 
$$ Bruker specific parameters
$$ --------------------------
##$DU= <C:\u>
##$EXPNO= 910
##$NAME= <ADRS>
##$PROCNO= 1
##$TYPE= <nmr>
##$USER= <dgb>
##$AMP= (0..31)
100 100 100 100 100 100 100 100 100 100 100 100 100 100 100 100 100 100 
100 100 100 100 100 100 100 100 100 100 100 100 100 100 
##$AQSEQ= 0
##$AQ_mod= 3
##$AUNM= <au_zg>
##$AUTOPOS= <24 >
##$BF1= 250.13
##$BF2= 250.13
##$BF3= 250.13
##$BF4= 250.13
##$BF5= 500.13
##$BF6= 500.13
##$BF7= 500.13
##$BF8= 500.13
##$BYTORDA= 1
##$CFDGTYP= 0
##$CFRGTYP= 5
##$CHEMSTR= <none>
##$CNST= (0..31)
1 1 145 1 1 1 1 1 1 1 1 1 1 1 1 1 1 1 1 1 1 1 1 1 1 1 1 1 1 1 1 1 
##$CPDPRG= <>
##$CPDPRG1= <>
##$CPDPRG2= <>
##$CPDPRG3= <>
##$CPDPRG4= <mlev>
##$CPDPRG5= <mlev>
##$CPDPRG6= <mlev>
##$CPDPRG7= <mlev>
##$CPDPRG8= <mlev>
##$CPDPRGB= <>
##$CPDPRGT= <>
##$D= (0..31)
0 1 0 0 0 0 0 0 0 0.06 0 0 0 0 0 0 0.0002 0 0 0 0 0 0 0 0 0 0 0 0 0 0 
0 
##$DATE= 1181822568
##$DBL= (0..7)
120 120 120 120 120 120 120 120 
##$DBP= (0..7)
150 150 150 150 150 150 150 150 
##$DBP07= 0
##$DBPNAM0= <>
##$DBPNAM1= <>
$$ [...]
##$SUBNAM7= <"">
##$SUBNAM8= <"">
##$SUBNAM9= <"">
##$SW= 20.6930455092707
##$SWIBOX= (0..15)
0 0 3 0 0 0 0 0 0 0 0 0 0 0 0 0 
##$SW_h= 5175.983436853
##$TD= 65536
##$TD0= 1
##$TE= 297.16
##$TE2= 300
##$TE3= 300
##$TEG= 300
##$TL= (0..7)
0 120 120 120 120 120 120 120 
##$TP= (0..7)
150 150 150 150 150 150 150 150 
##$TP07= 0
##$TPNAME0= <>
##$TPNAME1= <>
##$TPNAME2= <>
##$TPNAME3= <>
##$TPNAME4= <>
##$TPNAME5= <>
##$TPNAME6= <>
##$TPNAME7= <>
##$TPOAL= (0..7)
0.5 0.5 0.5 0.5 0.5 0.5 0.5 0.5 
##$TPOFFS= (0..7)
0 0 0 0 0 0 0 0 
##$TUNHIN= 0
##$TUNHOUT= 0
##$TUNXOUT= 0
##$USERA1= <user>
##$USERA2= <user>
##$USERA3= <user>
##$USERA4= <user>
##$USERA5= <user>
##$V9= 5
##$VALIST= <valist>
##$VCLIST= <CCCCCCCCCCCCCCC>
##$VD= 0
##$VDLIST= <DDDDDDDDDDDDDDD>
##$VPLIST= <PPPPPPPPPPPPPPP>
##$VTLIST= <TTTTTTTTTTTTTTT>
##$WBST= 1024
##$WBSW= 4
##$XGAIN= (0..3)
0 0 0 0 
##$XL= 0
##$YL= 0
##$YMAX_a= 690001
##$YMIN_a= -509499
##$ZGOPTNS= <>
##$ZL1= 120
##$ZL2= 120
##$ZL3= 120
##$ZL4= 120
##$ABSF1= 16.522
##$ABSF2= -4.171173
##$ABSG= 5
##$ABSL= 3
##$ALPHA= 0
##$AQORDER= 0
##$ASSFAC= 0
##$ASSFACI= 0
##$ASSFACX= 0
##$ASSWID= 0
##$AUNMP= <proc_1d>
##$AZFE= 0.1
##$AZFW= 0.1
##$BCFW= 0
##$BC_mod= 0
##$BYTORDP= 0
##$COROFFS= 0
##$CY= 12.5
##$DATMOD= 1
##$DC= 0
##$DFILT= <>
##$DTYPP= 0
##$F1P= 14.0000005364418
##$F2P= -0.99999901652339
##$FCOR= 0.5
##$FTSIZE= 32768
##$FT_mod= 6
##$GAMMA= 0
##$GB= 0
##$INTBC= 1
##$INTSCL= 1
##$ISEN= 128
##$LB= 0.3
##$LEV0= 0
##$LPBIN= 0
##$MAXI= 10000
##$MC2= 0
##$MEAN= 0
##$ME_mod= 0
##$MI= 0
##$NCOEF= 0
##$NC_proc= -2
##$NLEV= 6
##$NOISF1= 0
##$NOISF2= 0
##$NSP= 0
##$NTH_PI= 0
##$NZP= 0
##$OFFSET= 16.522
##$PC= 1
##$PHC0= -56.14579
##$PHC1= 6.060737
##$PH_mod= 1
##$PKNL= yes
##$PPARMOD= 0
##$PSCAL= 4
##$PSIGN= 0
##$REVERSE= no
##$SF= 250.13
##$SI= 32768
##$SIGF1= 0
##$SIGF2= 0
##$SINO= 400
##$SIOLD= 32768
##$SREGLST= <1H.CDCl3>
##$SSB= 0
##$STSI= 32768
##$STSR= 0
##$SW_p= 5175.98343685301
##$SYMM= 0
##$S_DEV= 0
##$TDeff= 65536
##$TDoff= 0
##$TI= <Analysis number 999999
Compound Code 99
Book Reference 9
Project Code 9>
##$TILT= no
##$TM1= 0
##$TM2= 0
##$TOPLEV= 0
##$USERP1= <user>
##$USERP2= <user>
##$USERP3= <user>
##$USERP4= <user>
##$USERP5= <user>
##$WDW= 1
##$XDIM= 32768
##$YMAX_p= 466206328
##$YMIN_p= -26524
$$ End of Bruker specific parameters
$$ ---------------------------------
##NTUPLES= NMR SPECTRUM
##VAR_NAME=  FREQUENCY,     SPECTRUM/REAL,   SPECTRUM/IMAG
##SYMBOL=    X,             R,               I
##VAR_TYPE=  INDEPENDENT,   DEPENDENT,       DEPENDENT
##VAR_FORM=  AFFN,          ASDF,            ASDF
##VAR_DIM=   32768,         32768,           32768
##UNITS=     HZ,            ARBITRARY UNITS, ARBITRARY UNITS
##FACTOR=    0.157963299565203, 1,           1
##FIRST=     4132.6476996994, 0,             0
##LAST=      -1043.33573715361, 0,           0
##MIN=       -1043.33573715361, -26524,      0
##MAX=       4132.6476996994, 466206328,     0
$$ Real data points
##PAGE= N=1
##DATA TABLE= (X++(R..R)), XYDATA
$$ [...]
19164A48501j4008J008N555J0380j367j7258k8664j8636j6436q240k211m397j956
19151E2271l605m645K478m01l518n339m856o7n339k412O116R900p39L583L298
19136D6725o164q9J2338J2524J7183J7200K6306L1439J7699o576j7177j0521L5
19123A40922J9827L3282K3915l062J515Q119j3510l6944l1340j240J4955J8774
19111A75213J0498j2236l0710l4622j7312j3588p581R450R156Q627J2550K2720
19099A32165L2773L3502K4620J9066O334j9407k9110k8273l779J4547K2923M4361
19087B49722M7891L5885L5933J1725k7442k8038k2846m2866m2337l2312r078P468
19075A83705K4183K6056J1816K680q475j8922l7092m0739l1353k8013j0355n506
$$ y = [148501, 134493, 135501, 141056, 151436, 150069, 132811, 104147, 85511, 69075, 60835, 58624, 54227, 52271, 48666, 44021, 46499, 46098, 42580, 37241, 32385, 32318, 26979, 24567, 30683, 40583, 39844, 43427, 46725, 40561, 40472, 52810, 65334, 82517, 99717, 126023, 157462, 175161, 168585, 151408, 140887, 140922, 160749, 194031, 217946, 214884, 216399, 224518, 211008, 174064, 142724, 141484, 156439, 175213, 185711, 173475, 142765, 108143, 90831, 77243, 69662, 79112, 88268, 96895, 109445, 132165, 164938, 198440, 223060, 242126, 248460, 229053, 199943, 171670, 167891, 182438, 205361, 249722, 297613, 333498, 369431, 381156, 353714, 325676, 302830, 259964, 217627, 185315, 176237, 183705, 207888, 233944, 245760, 248440, 239965, 221043, 183951, 143212, 111859, 83846, 73491, 67985]
19063F7985j0843n603j318k850j144r47J210o034q528J282Q784L489k242L092
19049D6333K050l406N131M408l47L313M65l745k690N823J075P84p084n008p07
19034D6395m71M34k97K559J485M658J8158J188p369o997j2861j756N160R860Q312
19019F8458l79k855k792k215j804K764l893o811o70q121n347P67O412J647K726
19004D7887P74J135Q33l27n606p523j97J0281O486Q27j17k904k301j788j935m481
18988D1044L373k010M779J387k309L529j463k462l225K605K216P073J370L010
18974E8917l965j80N805k902m922l615k341L407k435n047r31P071M444k561K215
18959E2960j645k126n038o911O391P521j349n482J402L356J1083L420m88m552
$$ y = [67985, 57142, 51539, 50221, 47371, 46227, 45280, 46490, 40456, 31928, 33210, 41994, 45483, 43241, 46333, 48383, 44977, 50108, 54516, 54169, 57482, 57947, 54202, 51512, 57335, 58410, 59194, 52110, 47102, 46395, 45924, 46358, 46061, 48620, 50105, 54763, 72921, 74109, 66740, 59743, 46882, 45126, 50286, 60146, 68458, 68079, 65224, 62432, 60217, 58413, 61177, 57284, 50473, 49803, 41682, 36335, 37102, 43514, 45161, 47887, 48661, 49796, 50629, 50302, 44696, 37173, 36976, 47257, 53743, 54570, 54453, 51549, 49248, 47460, 45525, 41044, 44417, 42407, 47186, 48573, 46264, 49793, 48330, 45868, 42643, 45248, 47464, 54537, 55907, 58917, 54952, 54772, 60577, 57675, 52753, 49138, 46797, 50204, 47769, 42722, 41791, 48862, 53306, 50745, 52960, 51315, 49189, 44151, 37240, 43631, 51152, 49803, 44321, 45723, 49079, 60162, 63582, 63094, 58542]
18945E8542m358P55J988L12O56M790l059l434M694J0066l823j472J69l505J0447
18930G2768Q388k208J023N36P194J0219J4573J2587K546J2325J2689J1072R833
18917A73545O478K214R23j426m910k791N263J1915J3811J9091K0432Q557R289
18904B62391l533j6677j4212k0957j9242r448K486M036Q533J1003O362l50m213
18891B06179p850k4041k3989j1548k97l105p703K323R446J1582K1976L0409M5362
18878B48744O2120O2161M0888J1928j3170l6007m9895n6179l2806k1058j3459
18867B03267Q930J4783L2911M7413N9594N2070K5883J366l3246n4049n2896n6055
18855B49971n3911k7889j7252k1428k0584o720o02l043K337M573J6N894M359Q677
$$ y = [58542, 54184, 54939, 56927, 57239, 57895, 62685, 59626, 56192, 60886, 70952, 67129, 65657, 65826, 62321, 72768, 81156, 78948, 79971, 80507, 87701, 97920, 112493, 125080, 127626, 139951, 152640, 163712, 173545, 180023, 182237, 183160, 181734, 176824, 174033, 179296, 191211, 205022, 224113, 244545, 253102, 262391, 258858, 242181, 227969, 207012, 187770, 178322, 180808, 184844, 193377, 204380, 210742, 210392, 206179, 198329, 174288, 150299, 138751, 138454, 135349, 127646, 129969, 139415, 150997, 172973, 203382, 248744, 310864, 373025, 413913, 425841, 412671, 376664, 326769, 270590, 237784, 216726, 203267, 212197, 226980, 259891, 307304, 366898, 418968, 444851, 446217, 412971, 358922, 306026, 249971, 196060, 168171, 150919, 129491, 108907, 102187, 101585, 98542, 100879, 105452, 105468, 111362, 115721, 124398]
18841A24398M690k443j213m664k325n56k337k150L440P152K991L33O565j555K823
18826A35149Q436j235o290q966r772l094o74k707p80M369O271k619r869k268p51
18811A05200m477J173L919K996j558m947K943M918k584K88N67O833Q824P072R89
18796A32156j5373m670P990O821O765K706Q73L316Q276L88j1000p474N687M232
18782A40693K110L758o271j4970r853Q629R785O912M646J076l429p741k338O153
18768A39160J3554K5600K6427N183j0457p273L246J297R849N894k72M393Q338
18755B24939r59n142o516j1989o349O405P60o341m665m349O42O951M604O194N210
18740B09395L229O474M034l713m227L312j278R251J1602J1859j1627j0822P982
$$ y = [124398, 129088, 126645, 125432, 120768, 118443, 117887, 115550, 113400, 116840, 123992, 126983, 127316, 133881, 132326, 135149, 143585, 142350, 136060, 127094, 117322, 114228, 113554, 110847, 110067, 114436, 120707, 118088, 108219, 105951, 105200, 100723, 101896, 105815, 108811, 107253, 102306, 105249, 110167, 107583, 107871, 108438, 115271, 124095, 131167, 132156, 116783, 112113, 120103, 126924, 133689, 136395, 137268, 140584, 148860, 149248, 138248, 130774, 136461, 140693, 142803, 146561, 140290, 125320, 115467, 124096, 133881, 140793, 145439, 146515, 143086, 135345, 133007, 139160, 152714, 178314, 204741, 209924, 199467, 192194, 195440, 196737, 206586, 212480, 212208, 216601, 224939, 223980, 218838, 212322, 200333, 193984, 200389, 201149, 194808, 190143, 185794, 186436, 193387, 197991, 204185, 209395, 212624, 219098, 223132, 219419, 215192, 218504, 217226, 226477, 238079, 249938, 238311, 227489, 235471]
18727B35471N280J7169J8697N731j542k716K616Q783P101J2239K2358L4063L7628
18714D02878L4463J9830M2975O1858O0245K8255O898N247K3493J0282l0872l8606
18702F26946j5324J2427M855J4327M2010M0060J6226K8105L9480L1982K2073J3100
18690H76267J9801L7400R0483J16624J11906Q2881N6758P2907R2670J20620J84774
18679A863091K95707M43371O19280Q90583J437912K522774M415709N767218K906215
18670B1161860j948172l660649j776442J094668M209467O076836L596429N40709
18662B9294706J492463J775896k747035o270418n018181j529911K182034N283620
18654B4463174L515805k909206o932345o008051l680055k190591j354263q67725
$$ y = [235471, 240751, 257920, 276617, 282348, 280806, 278090, 280706, 289489, 296590, 308829, 331187, 365250, 402878, 437341, 457171, 500146, 562004, 622249, 650504, 657402, 662649, 686142, 696424, 665552, 626946, 611622, 624049, 628904, 643231, 685241, 725301, 741527, 769632, 809112, 841094, 863167, 876267, 896068, 933468, 1023951, 1140575, 1252481, 1335362, 1392120, 1465027, 1557697, 1678317, 1863091, 2158798, 2602169, 3221449, 4112032, 5549944, 8072718, 12488427, 18255645, 21161860, 19213688, 15553039, 13776597, 14871265, 19080732, 25157568, 28753997, 29294706, 30787169, 32563065, 29816030, 23545612, 18527431, 16997520, 19179554, 24463174, 27978979, 25069773, 18137428, 12129377, 8449322, 6258731, 4904468, 4036743]
18646D036743n52993l36764j91135j15514j05918r8653r9255j02725o6325r251
18636B358210M2883N7634O6341J10425J58533K14044L15082M33374N65172Q26576
18626E148274J394140K500814M445649O130532L530706j726693l960234k116462
18618A5346726R03333M176711O795783N455280K732666L963238M231157k562113
18610D1042781q483656p438228k731278K215574O732730N970369k045917q538308
18602B6724067q346008n218715k905929j639441r60296n08761j20245K41173P03261
18593G969106J393955K477344M402694P378373Q609570N030495J727408K761120
18585D1750065J659227m462174q099435n887218j508381K837082O395968O121254
$$ y = [4036743, 3483750, 3146986, 2955851, 2840337, 2734419, 2635766, 2536511, 2433786, 2367461, 2358210, 2401093, 2458727, 2525068, 2635493, 2794026, 3008070, 3323152, 3756526, 4321698, 5148274, 6542414, 9043228, 13488877, 19619409, 23150115, 21423422, 17463188, 15346726, 16250059, 20426770, 27222553, 32677833, 35410499, 39373737, 43604894, 41042781, 32559125, 25120897, 22389619, 24605193, 31337923, 37308292, 35262375, 26724067, 18378059, 13159344, 10253415, 8613974, 7653678, 7144917, 7024672, 7265845, 7969106, 9363061, 11840405, 16243099, 23621472, 32231042, 37261537, 38988945, 41750065, 43409292, 38947118, 30847683, 24960465, 23452084, 26289166, 32685134, 38806388]
18577C8806388M348261O406132P834002J654070l935867l139878l949295q405740
18569C9618073r672488o272120j869164K340154N078554K870659j076024j628063
18561B9389581j290376l951445o215327n482024l548277k168295j376466r56871
18553D400500p09933m99337l51576k99891k62589k21099j80571j63232j46181
18544A566091j38477j31158j02727q4101r4318r6308p2219n7311m2970k4600j0292
18533G11610n204P393K1141L4557L1228o569m3363o4362n9888m4619l2791k2939
18521E26194j4174q542J1497M0219M9101J8772k8981o2188o3920n7667m4094l7125
18509C29092l3273k0855p096r483q674j1395m471p840k267L97q86l937M021K522
$$ y = [38806388, 43154649, 49560781, 57394783, 59048853, 55112986, 51973108, 48023813, 39618073, 29945585, 23673465, 21804301, 24144455, 29223009, 32093668, 31017644, 29389581, 28099205, 24147760, 17932433, 12450409, 8902132, 6733837, 5357371, 4400500, 3690567, 3191230, 2839654, 2539763, 2277174, 2056075, 1875504, 1712272, 1566091, 1427614, 1296456, 1193729, 1109628, 1015310, 919002, 846783, 789472, 746502, 721902, 711610, 706406, 713799, 734940, 769497, 800725, 794156, 750793, 686431, 626543, 581924, 549133, 526194, 512020, 503478, 514975, 555194, 604295, 623067, 594086, 531898, 467978, 410311, 366217, 329092, 295819, 274964, 267868, 258385, 249711, 238316, 233845, 226005, 223738, 224135, 223249, 219312, 223333, 225855]
18495B25855j517j4616q91N152j141L160K38M696Q307P716K1716P250k123L133
18481B66935l311J641j273J3391J1320N213o560j2160j6634j8822j5487n793k458
18468B16002M919J0788J1334K67n403p049m866j482K510l705Q099j0301o720j2956
18454B01437K898P611J4139K5495J4430k801j272j375p540P68R28j5979j7478
18441B21261j3966j4218K09O173M822j1740j2265j7523j1999q499j809M274L912
18428A48632J481J31l337o478n984J780J1512J9783J4942K457K112j521o857j1791
18414A66862j859M836J0818J7287J6567J6001K2172R296O251Q978k137j1597r496
18401B53979n711p374N97O85l092R32J4595J8002J0808p989k5021j9901j3480
$$ y = [225855, 224338, 209722, 208831, 213983, 212842, 216002, 216240, 220936, 229243, 236959, 258675, 265925, 263802, 266935, 263624, 265265, 263992, 277383, 288703, 293916, 287356, 275196, 258562, 239740, 224253, 218460, 216002, 220921, 231709, 243043, 243310, 237907, 230858, 225992, 224510, 227020, 223315, 231414, 221113, 214393, 201437, 204335, 211946, 226085, 251580, 266010, 263209, 261937, 260562, 253022, 253790, 254718, 238739, 221261, 207295, 193077, 193286, 199459, 204281, 192541, 180276, 162753, 150754, 142255, 140446, 144720, 148632, 150113, 150244, 146907, 140429, 134445, 136225, 147737, 167520, 182462, 184919, 187031, 185510, 178653, 166862, 165003, 169839, 180657, 197944, 214511, 230512, 252684, 261980, 268231, 277209, 275072, 263475, 253979, 248268, 240894, 241491, 242176, 239084, 240016, 254611, 272613, 283421, 275432, 250411, 230510, 217030]
18388B17030q162J552k37k253p159J106M289Q74q43p47P188J6799K0975R330j6028
18373B43714k7992q594J1400J0831L657K925J0465k442l570M443N848j236R183
18360B58632P416J657L826Q501J345p70m865l456N250m407k834Q390R831M470
18346B92986N293J2017J1838J7635Q120R360J8419J2087K549M809J2293K0155
18334D27561J3598J5961J5726K5911L1995M4520O2107P5662O3211L3288L8644
18323H48184Q3677J24586J44626J33836J29005J21336P0417K67n3621n9508l7453
18312A505352K188N0966R9239J45378K16087K80141L51397M17043M56915M78954
18302D003660N39437O67315R22452J416859K310132L846237O362829R565287J2411827
$$ y = [217030, 208868, 210420, 210183, 207930, 200771, 201877, 206166, 207040, 206197, 205450, 212638, 229437, 250412, 259742, 243714, 215722, 207128, 218528, 229359, 233016, 235941, 246406, 243964, 240394, 244837, 250685, 249449, 258632, 266048, 267705, 271531, 280032, 281377, 280607, 275742, 272286, 277536, 273129, 270295, 278685, 288516, 292986, 298279, 310296, 322134, 339769, 347889, 357249, 375668, 387755, 390304, 395113, 407406, 427561, 441159, 457120, 472846, 498757, 530752, 575272, 637379, 713041, 776252, 809540, 848184, 931861, 1056447, 1201073, 1334909, 1463914, 1585250, 1655667, 1655934, 1602313, 1542805, 1505352, 1507540, 1558506, 1657745, 1803123, 2019210, 2299351, 2650748, 3067791, 3524706, 4003660, 4543097, 5210412, 6132864, 7549723, 9859855, 13706092, 20068921, 29634208, 42046035]
18293D2046035J3602154R937896L869721k735008r195945j2305756j1324118q521467
18285B5373512n181199k197218M10232L256212O763439J0259517J2864235J2198320
18277F3747050O694471K79956o688246j2082980j3205710j1239738q296792n470356
18269A3737655l432905k168792j413741r72927o70492m90065m02968l57070l30209
18260C498486l02562k57410j95034j13157k7761P4395J84145L10357M51826O27045
18250D250330Q83154J304387K071155L546079O194063Q551208N493964N7555l44916
18241C2006979R64727l244888p696181p272098m672348k808652j750245j161557
18233D365737q28786o12703m26015k67181j61363r0061p8258q8450m0899j0836
$$ y = [42046035, 55648189, 65586085, 69455806, 66720798, 57524853, 45219097, 33894979, 25373512, 20192313, 17995095, 18405327, 21661539, 28424978, 38684495, 51548730, 63747050, 70441521, 70721477, 64033231, 51950251, 38744541, 27504803, 19208011, 13737655, 10304750, 8135958, 6722217, 5749290, 5078798, 4588733, 4185765, 3828695, 3498486, 3195924, 2938514, 2743480, 2630323, 2602562, 2676957, 2861102, 3171459, 3623285, 4250330, 5133484, 6437871, 8509026, 12055105, 18249168, 26800376, 32294340, 32351895, 32006979, 32971706, 29726818, 22030637, 14758539, 10086191, 7277539, 5527294, 4365737, 3536951, 2924248, 2498233, 2231052, 2069689, 1979628, 1901370, 1812920, 1772021, 1761185]
18223A761185j2161j4310j8431j1751L2856P5788M9500M1020O5400P1103M2866
18212B083065J1154L011N2049J37356J61735J44999J75894K91140M48302O48018
18202D156723Q94000J268799J919423L083990N130009Q791378J3785748J4850314
18194E3880384P737457N90146O41630j010903r518513j4878975j2553381p965938
18186A6921907m866993l084293k010907j364232r64972p13582n09849l59182k66265
18177B781632k47746k17752j90203j86952j48622j03985p5841l3248K9997L5514
18167A642794j5425m3606o814K2543K5958M078j1987J5571O4242P3737L8629N5337
18155A865057J55849K71048L77123N13148P51361J141411J802953K987364N217920
$$ y = [1761185, 1749024, 1734714, 1716283, 1704532, 1737388, 1813176, 1862676, 1903696, 1969096, 2040199, 2083065, 2094219, 2097230, 2149279, 2286635, 2448370, 2593369, 2769263, 3060403, 3508705, 4156723, 5050723, 6319522, 8238945, 11322935, 16452944, 25244322, 39030070, 53880384, 61617841, 62207987, 62849617, 61838714, 52320201, 37441226, 24887845, 16921907, 12054914, 8970621, 6959714, 5595482, 4630510, 3916928, 3407079, 3047897, 2781632, 2533886, 2316134, 2125931, 1938979, 1790357, 1686372, 1610531, 1577283, 1607280, 1642794, 1627369, 1583763, 1576949, 1599492, 1625450, 1629528, 1617541, 1633112, 1697354, 1771091, 1809720, 1865057, 2020906, 2291954, 2669077, 3182225, 3933586, 5074997, 6877950, 9865314, 15083234]
18146A5083234Q112724P012624J500887n94876J052604k009514p048313p625769
18138A5483601n107467l085026j973105j304202q72616o06798m28476k98521k04897
18129A602493j40760j35527j40203j31760j06604p1987l6895j7965J1924L0410
18119H63126N4966O0774N2750Q1071J44081K07683K85852M54630Q45484J691714
18109D742131L390657M995328K108725k842859m603825l095302j643325q95752
18101B155778n11787l35952k39489j77497j21854p6548p6736p7691o1732l1350
18091D45142K1J5098J8011O642j1971l4451n0526n1354m3905j9391O039K3011
18079C02366K7728J6347q766n983N570R173R465P470K756k3924k8839j4369q172
$$ y = [15083234, 23195958, 30208582, 31709469, 31114593, 32167197, 30157683, 23109370, 15483601, 10376134, 7291108, 5318003, 4013801, 3141185, 2534387, 2105911, 1807390, 1602493, 1461733, 1326206, 1186003, 1054243, 947639, 875652, 838757, 820792, 832716, 863126, 918092, 978866, 1031616, 1112687, 1256768, 1464451, 1750303, 2204933, 3050417, 4742131, 8132788, 13128116, 15236841, 12393982, 7790157, 4694855, 3051530, 2155778, 1643991, 1308039, 1068550, 891053, 769199, 692651, 615915, 538224, 476492, 445142, 445163, 460261, 478272, 484914, 472943, 438492, 387966, 336612, 292707, 273316, 279355, 302366, 330094, 346441, 337675, 331692, 337262, 346435, 355900, 363370, 366126, 342202, 313363, 298994, 290822]
18066B90822N695K8437L9622J4483K8293M2202K744l2999l7992l3774m5581m5068
18054B56884k1098p284M213L1124L0665K0641K2943M381k8653n5099n3473k8472
18042A76772j6558N216K0802J0559o516q457k544j7447l2264j3057n707O117J6642
18029A33558N723j1824k1517k0891j0149n198o438L76R672J0024M12P780N296
18016I6824o930p657q097o802p562r180K789L292q550o366Q55N139n123q870j534
18001C2228L556j121n806K632M573n362J530M452N173N696j043n809m096j177
17987C5426m903k417L18N800Q286N085j277L791k836j601L101o69l073j204k62
17972D3565q65l0n107J352N62L805Q239M783n209r88J191l310p389K869M44J694
$$ y = [290822, 296517, 324954, 364576, 379059, 407352, 449554, 452298, 419299, 381307, 347533, 301952, 256884, 235786, 228502, 232715, 263839, 294504, 315145, 338088, 342469, 313816, 258717, 205244, 176772, 160214, 165430, 186232, 196791, 190275, 181818, 179274, 161827, 129563, 116506, 110799, 116916, 133558, 139281, 127457, 105940, 85049, 74900, 69702, 63264, 63640, 73312, 83336, 83748, 91528, 96824, 89894, 82237, 74140, 67338, 59776, 50596, 53385, 56677, 48127, 41761, 42616, 47755, 42632, 33762, 32228, 35784, 34663, 28857, 31489, 36062, 30700, 32230, 36682, 41855, 47551, 46508, 40699, 36603, 35426, 30523, 28106, 28424, 34224, 42510, 47595, 46318, 50109, 47273, 45672, 48773, 48104, 45031, 43827, 43565, 42700, 42670, 37563, 38915, 39477, 43282, 51521, 56304, 51095, 50107, 51298, 47988, 40599, 43468, 43912, 45606]
17956D5606q43p8l278p239K118P848J3223L699l474o241j264M332J954K073k345
17941E6091m561m317L718N406R709J837n00n558p391l569J921q00N856J3636J1782
17926H3260J4883M251N646K7803M7591N0450J7151j4239O889L7186L8087R591
17914C28549r452j6874m0641m5050l0755r992K0732M2839M1376J5358j1980j6048
17902B68062k7805m5071l8574k7746j4853l40M366P743J9638L2261J4106j9313
17890A72474l9975k9709k0704j2648p123J22j034K638J1682L0004L5164M196k6141
17877A18946k3763r508J247J6593K7704J3608j5240j9449q257r767j04J2518J141
17864A05669j4104q911n254K169K215M533l978j1047j1541j1089m881J60k923
$$ y = [45606, 44763, 44685, 41407, 34168, 36286, 44134, 57357, 61056, 57582, 51341, 50077, 54409, 56363, 58436, 56091, 51530, 47213, 50931, 56337, 66046, 67883, 67383, 61825, 54434, 50865, 52786, 51986, 57842, 71478, 83260, 98143, 102394, 108040, 135843, 183434, 233884, 251035, 236796, 243685, 280871, 318958, 328549, 319097, 302223, 261582, 216532, 185777, 175785, 196517, 239356, 280732, 296090, 284110, 268062, 240257, 195186, 156612, 128866, 114013, 113673, 118039, 125782, 145420, 177681, 191787, 172474, 132499, 102790, 82086, 69438, 62315, 62437, 61403, 64041, 75723, 105727, 140891, 145087, 118946, 95183, 85675, 86922, 103515, 131219, 144827, 129587, 110138, 101881, 92114, 92010, 104528, 105669, 91565, 82654, 77400, 79569, 81784, 86317, 82339, 71292, 59751, 48662, 43781, 43941, 41018]
17851D1018o239K774N535Q606M503L714P373m727o901n365J041L921J3812P367
17837G6432j1659j1657N914J3758M913j249L225L100q086j606P421J39j517K476
17823H1604j0288r902m932K82l879L702J1277l658r753j946N490K236j222k119
17809E6892j320L270P37k622R167L228j110k970k309N969P626J1423J5847L17
17795A04145l425o425j850M863M845Q619J0335N458l711j493k002N061N984O649
17781A37053M269L557q142m663M803K956N950K005J208j613n78Q572o407m737
17767A44233Q074J0500R467K549L767N002J714q16J0081J3824P927R831O595J5941
17753B48689J3314J7031J4984Q935J7940K8138L3660L5071M1020N3991N3246L4166
$$ y = [41018, 34779, 37553, 43088, 51694, 56197, 59911, 67284, 62557, 55656, 50291, 51332, 55253, 69065, 76432, 64773, 53116, 59030, 72788, 77701, 76452, 79677, 82777, 74691, 73085, 80506, 80645, 79128, 81604, 71316, 61414, 56482, 56764, 52885, 56587, 67864, 64206, 54453, 52507, 57997, 60233, 59011, 56892, 55572, 58842, 59579, 56957, 66124, 69352, 68242, 65272, 62963, 68932, 76558, 87981, 103828, 104145, 100720, 94295, 92445, 97308, 102153, 110772, 121107, 126565, 122854, 121361, 119359, 124420, 130404, 137053, 141322, 144879, 136737, 132074, 136877, 139833, 145783, 147788, 148996, 147383, 146805, 155377, 148970, 144233, 152307, 162807, 172274, 174823, 178590, 183592, 185306, 184490, 194571, 208395, 216322, 226153, 232748, 248689, 262003, 279034, 294018, 302953, 320893, 349031, 382691, 417762, 458782, 512773, 566019, 600185]
17741F00185J6157J9707L6219O3625J02814J09223Q0539M6372L4139N9037J21208
17730A289225J86450K49898K75058L09033M07751N85356Q46899J348971K262328
17721G760969L909658O489056P597785K941703l590426n287632k593725J107786
17713A8335174M964836O316381J230125n026022n878134k694621J097536M787538
17705B3132813N801352R83405m609234n265350k339987J264844M800945N044471
17697B8813259p43847o413601o833787m540688k750314j747518j121482o91670
17689C970352m24004k91370k28800j70550j35883j17015r9916o6786m2262j3868
17679B379898M5863J17233J82023K55244L98973O16942R95631J703421K983928
$$ y = [600185, 616342, 636049, 672268, 735893, 838707, 947930, 1028469, 1074841, 1108980, 1168017, 1289225, 1475675, 1725573, 2000631, 2309664, 2717415, 3302771, 4149670, 5498641, 7760969, 11670627, 18159683, 25757468, 28699171, 25108745, 19821113, 17227388, 18335174, 23300010, 29616391, 30846516, 25820494, 19942360, 17247739, 18345275, 23132813, 28934165, 29917570, 25308336, 20042986, 17702999, 18967843, 23768788, 28813259, 28069412, 21655811, 14822024, 10281336, 7531022, 5783504, 4662022, 3970352, 3546348, 3254978, 3026178, 2855628, 2719745, 2602730, 2502814, 2436028, 2393766, 2379898, 2425761, 2542994, 2725017, 2980261, 3379234, 3996176, 4991807, 6695228, 9679156]
17670I679156N084898O434892L106567k557562m537775k530840M16871L438521
17662A8534728N186487K079917l252643m937281k734224M73397L721473M832362
17654B3904216Q86865l947657m650814k253442O76728L588124M262490J3077m854391
17645A7625196n709616l974314k404045j467399r00163n53970l71665l01481k67202
17636A675341k19306j69589j37314j21498j09009j03241r7270p3613n3234m7138
17626E44129l1918k1664q439j6941l6857m2764m3191k7059k1150j9279k1538j4301
17614B39028q329j4941j4286n470j1728j6869o135q132p430j0829o106j278k372
17601A25123q543k164J110m357j913l747J993L609k52P622l78j175N19o262q823
$$ y = [9679156, 14764054, 21198946, 24305513, 21747951, 17210176, 14679336, 15096207, 18534728, 23721215, 25801132, 22548489, 17611208, 14876984, 15350381, 19071854, 23904216, 24791081, 20843424, 16192610, 13939168, 14615896, 18204020, 22466510, 22479587, 17625196, 11915580, 7941266, 5537221, 4069822, 3169659, 2615689, 2244024, 1942543, 1675341, 1456035, 1286446, 1149132, 1027634, 918625, 815384, 718114, 644501, 591267, 544129, 512211, 490547, 482108, 465167, 428310, 385546, 342355, 315296, 294146, 274867, 253329, 239028, 230699, 215758, 201472, 196002, 184274, 167405, 161270, 153138, 145708, 134879, 128773, 127495, 125123, 116580, 114416, 115526, 111169, 109256, 105509, 107502, 111111, 110859, 118481, 118103, 116928, 117447, 111185, 102362]
17586A02362m724l658p482k869l836M430J711L472Q572J55o096q80m12K023n573
17571H7195l854p598n928k583n785j463R57p889K285J4m520N255l892k858qq31
17555D8497j832N487m554j3887j362L951J357r220K449M123l258L899R003J755
17541D6408k468Q18l191M776K072o686K023P19n854k035l059j424j301L212o27
17526C3383k30M586O814R692k835r421p534r396l685r11r68L074K358l05N961
17511C0583J475n435L350M668R09o34l120J136K473L657O172L529P735M110J485
17496F2093K921J3771K2994L2820N1955R5552J29922Q2269l4151j01332r9435
17485B59379p7194m8101l0974j2626o075J3831J9423L7504O5771J10109J18597
$$ y = [102362, 97638, 93980, 86498, 83629, 79793, 84223, 85934, 89406, 97978, 98133, 92037, 91157, 90745, 92768, 87195, 83341, 75743, 69815, 67232, 61447, 59984, 60941, 53052, 55337, 55351, 50831, 56086, 52194, 49336, 49328, 48497, 46665, 52152, 47598, 33711, 32349, 36300, 37657, 28437, 30886, 35009, 31751, 35650, 44653, 46408, 43940, 44758, 41567, 46343, 48415, 41729, 43752, 44471, 38617, 36582, 33523, 32099, 30798, 34010, 33383, 33153, 37739, 44553, 54245, 51410, 41989, 34455, 25059, 21374, 20463, 19495, 22569, 24927, 24622, 30583, 32058, 26623, 29973, 34641, 35550, 34916, 31796, 32932, 35405, 39062, 45234, 48763, 56498, 60608, 62093, 65014, 78785, 101779, 134599, 186554, 282106, 412028, 494297, 460146, 358814, 259379, 182185, 134084, 103110, 90484, 84409, 98240, 117663, 155167, 220938, 331047, 449644]
17474D49644L3753p9067j16877r8613o0341k7938j8133j7248q118l272q064q943
17462C6783q368m491O96P82l470R410J318m610m9k062m437K192J551j156l074
17447B1015K057L396L507M060Q103J2540K1367Q88j9159k1173j1318J657K215
17434B9155n140q323p764j489J309L203l373L566K208k263M239K223p054J112
17420A1609l549j983m193k544L333M648N061K488K606p148o082J262K256l176
17406D588l687j181L845k053j738O839J0629n495q843j261r03J587m321l841n87
17391f422J648K079L763N544N189m644k510l731Q59j048n595k492L434L535K885
17376B494O96q37j935k54j170O183R431K489l924J83o746p635L476J0357P621
$$ y = [449644, 483397, 404330, 287453, 188840, 128499, 100561, 82428, 65180, 57062, 53790, 45726, 36783, 28415, 23924, 24620, 25402, 21932, 31342, 32660, 28050, 28001, 25939, 21502, 23694, 25245, 24089, 21015, 23072, 26468, 29975, 34035, 42138, 54678, 76045, 76933, 57774, 36601, 25283, 26940, 29155, 24015, 15692, 7928, 6439, 7748, 10951, 7578, 11144, 13352, 11089, 15328, 17551, 10497, 11609, 8060, 6077, 1884, -660, 2673, 7321, 12382, 14870, 17476, 10328, 4246, 5508, 7764, 4588, 901, -280, 3565, 1512, -226, 6613, 17242, 11747, 2904, 1643, 740, 2327, -1994, -5835, -6422, -4774, -2695, 1068, 6612, 11801, 7157, 4647, 916, 1775, 727, -4868, -7360, -3926, -391, 2494, 3190, 2353, 418, 164, -1006, 5177, 14608, 17097, 13173, 13356, 6610, -1025, 2451, 12808, 20429]
17361B0429p103r573r59k746r86K801O119J828P207m470o599k82k514O016L810
17346A2978M130o280n675M350P03K586j117J049L629k876m301n359J533L567K959
17331A1876M284l516j991l422k21j210j698L901M009L73l580m962K303R61m617
17316B490q040l325j57L461q22R806K790o056k155L113p54J300L559m922n985
17301e697K114k563N837J202K326n42Q72l520N13M694n56k15J72k479j769l783
17285c394j303j607O456O656J1045k751n698m290p325n684K557Q056J365L19K210
17270F612n370l814L944M283k874l700m696J576P646M887L860m930k488M882O248
17255A6066R8N85k333n060m348n142N40M314K644j608j260L318J345K088k500
$$ y = [20429, 13326, 3753, 2794, 48, -938, 1863, 7982, 9810, 17017, 12547, 5948, 5666, 3152, 9168, 12978, 17108, 10828, 5153, 9503, 10206, 12792, 11675, 12724, 16353, 13477, 9176, 3817, 5350, 8917, 11876, 16160, 12644, 10653, 7231, 7010, 5800, 4102, 8003, 12012, 12385, 8805, 3843, 6146, 7107, 2490, -5550, -8875, -9032, -5571, -6393, 3413, 6203, 147, -2008, 1105, 351, 1651, 5210, 288, -5697, -3583, -6146, -309, 893, 3219, 2677, 3549, 29, 542, 5236, 4680, 4465, 4637, 2158, 389, -3394, -4697, -6304, 152, 6808, 17853, 15102, 9404, 5114, -2211, -7895, -5338, 2718, 4083, 4402, 6612, 1242, -2572, 1372, 5655, 2781, -919, -5615, -4039, 3607, 8494, 12354, 7424, 4936, 9818, 16066, 16164, 16749, 14416, 9356, 5008, -134, 406, 4720, 7364, 5756, 4496, 7814, 9159, 11247, 8747]
17240H747l88K729l626k118l92J170R33N899L064j088j219L001j45j025n377O79
17224A0844o75k441j947p77o868L400J4065N801m233m72M884J287j699j923J479
17209B0725J434J899j688M820N929J2390K4442L4048L8208J3326j5125k0340q072
17196A11996R102J9393L8897J5344r191j4623o103M504J4490J7518M166k0045
17184A85448k9858j5524p140P496J9403J056j1927j7275q658r854j2214q181j2346
17171H0426j4351j4643l355j533p05j114l504J17n687j856n984k191M62Q44j686
17156B5240L610J1497J0106J2700K5918L2940K5609K401j0363q348j1086L792
17144A24016J9027J1418p751j8074j0485n48P778K4465J0602j0511k1790j1566
$$ y = [8747, 8359, 11088, 7462, 5344, 4952, 6122, 7055, 12954, 16018, 14930, 13711, 16712, 16567, 15542, 10165, 10844, 10169, 7728, 5781, 5004, -1864, 1536, 15601, 21402, 17169, 16697, 21581, 22868, 21169, 19246, 20725, 22159, 24058, 22370, 27190, 33119, 45509, 69951, 103999, 142207, 155533, 140408, 120068, 111996, 121098, 140491, 179388, 194732, 185541, 170918, 164815, 169319, 183809, 201327, 205493, 185448, 155590, 140066, 132926, 140422, 159825, 160881, 148954, 131679, 123021, 113167, 100953, 92772, 80426, 66075, 51432, 48077, 46544, 45839, 44725, 41221, 41338, 35651, 33795, 27811, 25620, 26082, 26926, 25240, 28850, 40347, 50453, 63153, 89071, 122011, 147620, 150021, 139658, 131310, 120224, 124016, 143043, 154461, 146710, 128636, 118151, 117603, 125381, 149846, 160448, 149937, 128147, 116581]
17132A16581l697J4927J4857p2k4019k0062j8652j6444q447P90l226l609o015
17119D2912j0361J957Q874K153n743N367k602j0809K704J0917k45J108p226K431
17105D1437j614n791O42l75k859l507Q97O859p39k94k434n740k527l196J505O510
17089B8774J0206J2960o12q96o792m033n633m697p55J532J516L419J368J2726
17075D9083K927P606M196j035k055m045p403q47Q993J4648K4004J8985j376l5158
17061G8523j8817J0383J5129l060J427K249J285l562J659J7764J5710J9135J1345
17048A49170k2414l3735j3988P951N810j950m970l516k388K62j611n98J077L030
17034H2130J42j062j0810m383N471M262M630N676N426j323j850J725M42J789K189
$$ y = [116581, 112884, 127811, 142668, 142596, 118577, 98515, 79863, 63419, 54972, 55762, 52536, 48927, 42912, 32551, 34508, 43382, 45535, 39792, 45159, 42557, 31748, 34452, 45369, 45124, 46232, 39006, 41437, 39823, 34032, 34674, 34299, 31440, 27933, 28830, 35689, 34950, 34656, 32222, 26482, 23955, 20759, 22264, 28774, 38980, 51940, 51328, 50432, 43640, 39607, 33974, 29277, 28522, 30054, 31570, 34989, 36357, 49083, 52010, 59616, 63812, 62777, 60722, 56677, 49274, 48427, 57420, 72068, 96072, 115057, 113681, 78523, 59706, 70089, 85218, 82158, 83585, 85834, 87119, 83557, 85216, 102980, 118690, 137825, 149170, 126756, 93021, 79033, 86984, 92794, 90844, 85874, 82358, 79970, 80232, 78621, 78023, 79100, 82130, 82272, 81210, 70400, 66017, 71488, 75750, 80380, 86056, 91482, 90159, 88309, 90034, 90476, 92265, 94454]
17019I4454l451k885l063R464Q573Q638L349J736O226Q261N087P355k251P94R189
17004A51476O157J2873Q730j946o085L626R907J0067L106m140J740J2798J2579
16991B20888K255M715J7546K3286J1401N356J0121Q834J7775J9828Q016L331P579
16978C60931J2407J6742J9409K1888K5528L7737M7786M7157O5049J15419J41261
16967I11314R3022K6601j267M5028J04347J23138O9922P463J6582P6057J26009
16956A598216J35130J50743K09129K91773L27452L24551K85975K91818M09100
16947D023887N44647O71595R39706J439229K214800L446010N672834R889574J7307765
16938D6150047K5785433K1237777j945367k1503451k2854037j5160148q776028
$$ y = [94454, 91003, 88118, 85055, 94519, 103092, 111730, 115079, 116815, 123041, 131302, 136389, 143744, 141493, 142287, 151476, 157633, 170506, 179236, 177290, 171205, 174831, 184738, 194805, 197911, 193771, 195511, 208309, 220888, 223143, 227858, 245404, 268690, 280091, 285447, 295568, 304402, 322177, 342005, 350021, 353352, 360931, 373338, 390080, 409489, 431377, 456905, 494642, 542428, 589585, 654634, 770053, 911314, 1004336, 1030937, 1029670, 1074698, 1179045, 1302183, 1372105, 1379568, 1396150, 1472207, 1598216, 1733346, 1884089, 2093218, 2384991, 2712443, 3036994, 3322969, 3614787, 4023887, 4568534, 5240129, 6179835, 7619064, 9833864, 13279874, 18952708, 28842282, 46150047, 71935480, 93173257, 91227890, 69724439, 46870402, 31710254, 22934226]
16931B2934226m879347k398614o36211R51721K956349O195538J1790110K0411098
16923E7324870K5265565J1218489j2988861k4273526j9802828j2323994p432236
16916A6987479m628883k981485k011708j419399j006538o86607m36993k90529
16908C525337k60376k66956k83688l11181k97927k21057k03903j97636j61683
16899A320930j14152p6954l7591P559K4233j4577r5900j49793j27570q1310n4319
16888F00556m7761m4386l4856k8755k6137k2209l1334k1331j7886k1060k6323
16877B78518j5725ok339n586j4613r336j2854p388l479k84m106n029o226j4696
16863A76851j4403p283K332k182j0157o529L823o360k0091k447m86j3446L49N003
$$ y = [22934226, 18054879, 15656265, 15020054, 15971775, 18928124, 25123662, 36913772, 57324870, 82590435, 93808924, 80820063, 56546537, 36743709, 24419715, 16987479, 12358596, 9377111, 7365403, 5946004, 4939466, 4252859, 3815866, 3525337, 3264961, 2998005, 2714317, 2403136, 2105209, 1884152, 1680249, 1482613, 1320930, 1206778, 1129824, 1092233, 1099792, 1124025, 1109448, 1013548, 863755, 736185, 654875, 600556, 552795, 508409, 473553, 444798, 418661, 396452, 365118, 343787, 325901, 304841, 278518, 262793, 262787, 260448, 254862, 240249, 230913, 218059, 210671, 207192, 206908, 202802, 197773, 191547, 176851, 162448, 155165, 157497, 155315, 145158, 138629, 142452, 136092, 116001, 113554, 113068, 99622, 99971, 104974]
16849A04974K861m360m744q491m08J0846K963j494k160p921j2215n469P18k996
16835G2104k453l349J146J009M530j008J626J293O080j1158j3761M139M573L859
16821F8630m841k301m837k160O63k013L98J1651J6658J6255J4330Q083j6490k3943
16807H0083k1698j1409m523r657o786J0814J6661J1683P520J8532J7239P302p976
16794A07785k2549j8236j5406o254k719j0467l963j689j243r017J688J3131P360
16781C8421l65q175l795q45l149P37l88J086M061k850l889m554n20K305j001K185
16765A9264L594K276m265q137m833P43M872K928r36n63j888N1q651j799k111k682
16749b137j841j490j498m450m518N521J0163J1185P235L481j3825p059O049M002
$$ y = [104974, 107835, 103475, 98731, 90240, 89832, 100678, 103641, 102147, 99987, 92066, 79851, 74382, 75100, 72104, 69651, 66302, 67448, 68457, 72987, 71979, 73605, 74898, 80978, 69820, 56059, 60198, 64771, 68630, 63789, 61488, 56651, 54491, 55154, 53141, 53539, 65190, 81848, 98103, 112433, 120516, 104026, 80083, 58385, 46976, 42453, 32796, 26010, 36824, 53485, 65168, 72688, 91220, 108459, 115761, 107785, 85236, 67000, 51594, 45340, 42621, 32154, 28191, 26502, 25259, 16242, 17930, 31061, 38421, 38056, 29881, 26086, 25241, 22092, 22829, 22441, 23527, 27588, 24738, 20849, 16295, 15775, 18080, 17079, 19264, 22858, 25134, 20869, 12732, 7899, 8642, 13514, 16442, 15506, 14943, 13055, 13106, 4455, 2656, 545, -2137, -3978, -5468, -6966, -11416, -15934, -10413, -250, 10935, 18170, 21651, 7826, 767, 6816, 10818]
16735A0818n166o430n556K139K428M635M592J151n95j235k582l742K188Q074K746
16720A3465M546j184j25o419j0898r199M557J2132M863l553n404N849O512j86
16706A4956J976j240l559n072j340L386J79p322n380Q66P402M578j007M97l081
16691E839m650K397J237p360j907K432P048O28j408N81k527o783m613K696J424
16676d966j62J417K527n866K355M299n14P4N418M411J236k785k630N670l83L61
16660A0462l170O39p743j0707J635N082M044M598l51L488l294K194r290n666j588
16645i667M77K828Q495J643J777j458N134L262l464k685q64k030n086k347L586
16630c99r251p035L234J1137Q679o66L701J230M101P35K351j511p697j004R789
$$ y = [10818, 5652, -778, -6334, -4195, -1767, 2868, 7460, 8611, 8016, 6781, 4199, 457, 2645, 10719, 13465, 18011, 16827, 16702, 10283, -615, -9814, -5257, 6875, 11738, 8185, 2781, 8630, 15142, 14956, 16932, 15692, 12133, 7061, 5721, 9107, 9286, 1964, -3416, -2550, 4852, 9430, 8423, 8920, 5839, 1189, 3586, 4823, -2537, -4444, -2012, 5036, 5664, 4256, 4837, 2310, -4473, -9086, -6390, -4966, -5128, -3711, -1184, -7050, -4695, -396, -910, -836, 4582, 8993, 10229, 7444, 4814, 10484, 10101, 10462, 7292, 7931, 188, -10519, -8884, -3802, 242, 4840, 4489, 7977, 4683, 6877, -2413, -8079, -9667, -9190, -6362, 2133, 3776, 5553, 4095, 9229, 12491, 9027, 6342, 5478, 3448, -1638, -3985, -399, -9650, -16685, -13451, -2314, 6365, 5699, 9400, 10630, 14731, 15466, 17817, 16306, 8609, 7605, 17394]
16615A7394J5178K3261L9995N4065Q3276P1643k422o7009p2918m8104l2671j5301
16603F6387j90M963J7075M5977P9753O9318R519o2742p8078n8148l3092j9475
16591D1267o842q207j0121j0385p776n47P429K158k256l853l739j830j160N111
16577g51K753P28n698l05p404j148J187j372L779L32m683p270o452K054N520N788
16561a2942K548m533M67J281K762J285l2Q491R0j841k854k742O87k958Q22j410
16545a0879q49L824P365N040o978l511L592N446o591j000R20n344k925j810P494
16530f206M101j698k047L367k834r563m119K054K608Q67J469j908KM909K180J157
16514e661J591K198n861n460R26O93l829m949O016R008p70k246m557m786m804
$$ y = [17394, 32572, 55833, 95828, 149893, 233169, 304812, 302390, 235381, 162463, 114359, 81688, 66387, 66197, 71160, 88235, 134212, 213965, 283283, 292802, 230060, 151982, 93834, 60742, 41267, 34425, 26218, 16097, 5712, -2064, -2611, 4818, 6976, 4720, 867, -2872, -4702, -5862, -751, 2002, 2730, -2968, -3273, -10677, -11825, -10638, -12010, -8231, -7899, -12582, -19852, -26304, -24250, -18730, -12942, -10394, -14927, -14460, -13179, -10417, -9132, -9164, -673, -583, -2424, -5278, -8020, -7333, -10291, -9469, -10879, -11728, -7904, -539, 4501, -2477, -5988, -2396, 3050, -3541, -4541, -3621, -8965, -11890, -13700, -6206, -2105, -3803, -5850, -2483, -5317, -14880, -18999, -16945, -14337, -13470, -12001, -13909, -13907, -8998, -6818, -5661, -4070, -1872, -7733, -13193, -12267, -11574, -15403, -20352, -14336, -5328, -6098, -8344, -12901, -17687, -22491]
16499b2491L115l78j340M074K918L198M103K146n025j033P383P033q452q195K898
16484a0046L192L727j393m374K345J896L80N375q06L586m574m199l754j97j320
16469a0162N56K720m078J096P66Q33K736K694M925o580l219P349k173m115n070
16454a1722p300j214O629j004K072L387K344Q81L183K336k148l389J255J465k315
16439e540k823j599M831q04Q415O155M64l679m440o246l545j996k57J1600K922
16424C458m361L362k477L939m246m693k705L086K397N72J125r518m652l219M929
16409a3003P411M153L55L367l115k056n984M724J784M281L829p17J930O589M061
16394A7609K167k373J722L667J045J553O906L238Q892Q369Q382J3546L4878N8490
$$ y = [-22491, -19376, -19754, -21094, -17020, -14102, -10904, -6801, -4655, -9680, -10713, -3330, 3703, -4749, -12944, -10046, -6854, -3127, -4520, -8894, -6549, -4653, -4273, 1102, 296, 3882, -692, -4891, -8645, -8842, -10162, -9606, -6886, -10964, -9868, -9102, -8269, -5533, -2839, 2086, -4494, -7713, -364, -2537, -6652, -11722, -19022, -20236, -13607, -14611, -12539, -9152, -6808, -5927, -2744, -408, -2556, -5945, -4690, -3225, -5540, -8363, -9962, -5131, -5935, 2480, 8635, 9099, 5420, 980, -5266, -8811, -10807, -11064, 536, 3458, -903, 2459, -18, 3921, -325, -5018, -7723, -4637, -2240, -1668, -543, -10061, -14713, -17932, -13003, -5592, -1439, -1084, 2283, -832, -2888, -8872, -4148, -2364, 1917, 5746, 5029, 6959, 13548, 17609, 19776, 17403, 19125, 22792, 23837, 25390, 32296, 35534, 44426, 52795, 61177, 74723, 109601, 168091]
16380A68091J04736J33090O8355l8166j03837j01465p3312m4239k5645p299j039
16369G9270O504K4086M3431P1002J16262J08890K1073q3148j14633r3935n7270
16358A21532l6516k7383p772j1100j1491k214l026k820o078o454L962J784r57
16345A1467r21n776L176k30k066k377l969o247Q02K331P90l647K794j18l551L278
16329d264O112J946k890n175j080J39J643P319j58p839j5279n265M074K061O849
16314a1807p286n932N157J110J244k027Q554O828M223N42n949N95j176N260j740
16299b404J412L152j123n455n024L554J26l303l302r83N563R14K992j938q830
16284a4649m147J42P70L926M605O128P518k221K600N51o426J300j419j890l602
$$ y = [168091, 272827, 405917, 474272, 436106, 332269, 230804, 157492, 113253, 87608, 80309, 79270, 85774, 109860, 153291, 224293, 340555, 449445, 470518, 387370, 272737, 178802, 121532, 85016, 57633, 49861, 38761, 27270, 25056, 22030, 19210, 13132, 6678, 10640, 12424, 11467, 10546, 4770, 7946, 7716, 5650, 3273, -696, -6943, -6141, -3810, -3020, -6667, -3873, -3991, -7542, -4264, 1848, 3794, 904, -4271, -5351, -5212, -3569, 3750, 3592, -4247, -19526, -24791, -20717, -18656, -11807, -19093, -25025, -19868, -18758, -17514, -19541, -10987, -4159, 64, 606, -5343, -4748, -5924, -664, -2404, -992, 2160, 1037, -4418, -9442, -5888, -5762, -9065, -12367, -13350, -7787, -6873, -3881, -5819, -14649, -18796, -18654, -17884, -13958, -9353, -3225, 4293, 2072, 4672, 5223, -1203, 97, -1322, -3212, -6814]
16269f814m53P411J196k929p588j289R00O119K615n510p040l71J007L986r55L981
16253e734M024o917l212j367M453O409M53q63j762q47L886J003k940M839K263
16238C688n493m460P08r98q038j031l53J447M39N21J186K732L474K568o544n324
16222a5478l685j635R020M15k649k026O707K955k926m476o53q65o55K48Q973P097
16206C67j0094r206N024O625o73m512m767J881k60N130N242L415j204q405m403
16191a5840J000K004j623M137K227M232k222K097o238k650k861K289J925P169
16177d354K548k240o866m277P26q99J683Q034O415J46l682J857l126j435l924
16162i394l626M856J321p350l855O40n05N130N253J490K438L629K382M35l311
$$ y = [-6814, -7267, 144, 1340, -1589, -9177, -10466, -9566, -3447, -832, -6342, -13382, -13753, -12746, -8760, -9715, -5734, -1710, -8627, -11839, -13206, -8753, -2344, -1891, -2754, -4516, -5363, -1477, -474, -3414, 1425, 3688, -1805, -6265, -5557, -6555, -14593, -15624, -15977, -14530, -14091, -13570, -12384, -9652, -6178, -3610, -10154, -15478, -19163, -20798, -11778, -11363, -14012, -16038, -9331, -6376, -9302, -13778, -14431, -15296, -15951, -15703, -6730, 367, -9727, -18933, -13909, -7284, -7957, -12469, -17236, -15355, -15615, -10485, -5243, -1828, -3032, -11437, -15840, -14840, -12836, -14459, -10322, -8095, -3863, -6085, -3988, -10226, -12876, -15737, -13448, -11523, -4354, -1806, -4046, -10912, -15189, -14463, -15362, -13679, -5645, 770, 916, -2766, -909, -4035, -5470, -9394, -13020, -8164, -6843, -14193, -18048, -17408, -17913, -12783, -7530, -6040, -3602, 27, 2409, 2844, -467]
16147d67m696p275J605K76J1N918Q328j789n071l603K741k675o827o134j535K590
16131a8603R169M148m606k693l972l662J333J1137K174n265Q99J904L983n828
16117i882j685q8N658M056k192J133M554k461p355j325k3n74J114K642L641L422
16101F35k428J662L867J40m899m103m221n529P380P19l185P60N974K505j420l676
16085e819j877j490l310M55K345n264m219J637N063P658M249j469o671r9j150
16070i961P627J330l344k574J39M671l344k303k16j414O565P238k271J388m009
16055d78p738k145J0171m55J677K53J149m854K275k0m670n760R21L45J911k358
16039i776K100p497O101M735L889N64q53J422j027l375j404R868Q270k699j1724
$$ y = [-467, -5163, -12438, -10833, -10557, -10546, -4628, 3700, 1911, -3160, -6763, -4022, -6697, -13524, -19658, -21193, -18603, -9434, -5286, -9892, -12585, -16557, -20219, -18886, -7749, -5575, -10840, -9941, -8037, -4054, -9882, -11567, -11655, -5997, -1941, -4133, -3000, 1554, -907, -8262, -9587, -9610, -10184, -9070, -6428, -2787, 635, -1793, -131, 3736, 3876, -1023, -5126, -9347, -14876, -7496, -6777, -9962, -9202, -3228, -723, -2143, -5819, -7696, -9186, -12496, -12041, -9696, -14960, -19179, -17542, -12479, -4821, -572, -2041, -8712, -8811, -9961, -2334, -1004, -4348, -6922, -6783, -2112, -5456, -7759, -7975, -9389, -2824, 4414, 2143, 3531, -478, -8216, -10361, -190, -645, 1032, 1285, 2434, -2420, -145, -165, -4835, -10595, -9674, -9329, -7418, -9776, -7676, -15173, -9072, -4337, -448, 116, -737, 685, -342, -3717, -5121, 4747, 13017, 10318, -1406]
16024a406l208k789O69Q142m771q381k550L402L380K880K852l311l480m041p47
16009a3359k758L620M876P209L878m337p782J011O805l477j105K708J661n286
15995f336k492K343j088k884q62N225K256k485J382L465o67L436J417L61M046
15980G117p06j1467l832k202k514O84O29N498j704j270k324K790J002L196k465
15965g568M099M900P10l366J046j962L9Q507M46p765J323l92l636k546N060j558
15949b663l102L636N328K00J191J0628O62r066o759k611R0L216L47K037n682m286
15933f834o151J438J754O065M969l543o885j867j086J042Q008M480m693Q85k642
15918e060K451K547o91o171k737L651L574o739o120M522J094J150K645L40K055
$$ y = [-1406, -4614, -7403, -6734, 1408, -3363, -11744, -14294, -10892, -7512, -4632, -1780, -5091, -8571, -12612, -13359, -16117, -12497, -7621, -412, 3466, -871, -8653, -7642, -837, -4314, -5419, -2711, -1050, -6336, -8828, -6485, -7573, -10457, -11319, -6094, -3838, -6323, -4941, -1476, -2143, 1293, 2710, 3071, 7117, 6411, -5056, -8888, -11090, -13604, -12920, -12291, -6793, -8497, -9767, -12091, -9301, -8299, -5103, -7568, -3469, 1431, 2141, -1225, -179, -2141, -2102, 6405, 6851, -914, 409, 17, -3619, -6165, -1105, -2663, -5765, -2129, 3199, 3399, 4590, 15218, 15880, 6814, 55, -2556, -2466, 750, 1097, 3134, -2548, -6834, -12985, -11547, -9793, -3728, 1241, -2302, -9187, -11054, -12140, -11098, -3090, 1390, -3303, -2418, -5060, -2609, -62, -753, -6924, -9661, -6010, -2436, -9175, -15295, -10773, -9679, -8529, -5884, -5544, -3489]
15903c489l175p82j828k859K095L953K545q9n022k470k70O491j022l70j42p591
15887a4025K751J0984N372M802m922j666k459j589J994L014k888R77r78n232k793
15872f658j188M577j304O29O844Q548q424j5233n679N08M313M589M359n240n23
15857i882M489o98o485M455N701L805o889k589m929R79P58L024j817k62P769j099
15841c670J048P51j817m726l596n109l847J227j213N885J149K39k30K22m443m33
15825a8563M633R527L595J260l319p714N22k455k835n9k903j3M693j874L907R68
15809a0630J845K192J712k660j993k445P900J002K564l847o938m608L433N12j132
15794a3093K607o232l120J614J1160N361j098l191k356L211j943L880Q787J409
$$ y = [-3489, -6664, -7446, -9274, -12133, -10038, -6085, -3540, -3629, -8651, -11121, -11391, -4900, -5922, -6292, -6434, -14025, -11274, -290, 5082, 9884, 4962, 3296, 837, -752, 1242, 4256, 1368, 2345, 1367, -3865, -6658, -7846, -3269, -4573, -3944, 2900, 11448, 3024, -12209, -17888, -17380, -13067, -8478, -4119, -9359, -9882, -5393, -6091, -12576, -8121, -2420, 1385, -5504, -8093, -13022, -12043, -11285, -8261, -10078, -10340, -2571, -3670, -2622, -1871, -3688, -8414, -12010, -17119, -20966, -19739, -20952, -15067, -13918, -13679, -13909, -13687, -18130, -18563, -13930, -4403, -808, 452, -2867, -10581, -10059, -12514, -15349, -15408, -18311, -18324, -13631, -15505, -11598, -10630, -8785, -6593, -4881, -7541, -9534, -11979, -4079, -3077, -513, -4360, -11298, -15906, -12473, -11961, -13093, -10486, -16718, -19838, -18224, -7064, -1703, -2801, -5992, -8348, -5137, -7080, -3200, 5587, 6996]
15780F996k510q668n518m856J940Q364Q297l437m574Q55l425l578j614K774N278
15765c676N159l614k000k195n126Q35K114J690K022l703K072O527o917o406N59
15750a2659L563P151L378o486m144R57N352N57j227k694l450K502m977J493k087
15735a2771J568K636N831j965J253l250J046K63k843k465l619j904j506k525k027
15720b2278P250M548J137K369P09N83O81N091N172m859J228J18J162M397mr776
15704b472m1j328l897l47K963L378L281o227k993j489N921l44n814l664P234P789
15688A950q36r002o840L130N928K35l28j421o9N193p75L232K290m067m924j448
15672g752J447j043k269l590J726K235o293p775Q001Q389j688J606J918P379M15
$$ y = [6996, 4486, -4182, -9700, -14556, -12616, -4252, 4045, 608, -3966, -3111, -6536, -10114, -11728, -8954, -3676, 1483, -2131, -4131, -6326, -11452, -10617, -8503, -6813, -4791, -8494, -6422, 105, -6812, -13218, -12659, -9096, -1945, 1433, -5053, -9197, -8240, -2888, -2331, -3558, -6252, -9702, -7200, -12177, -10684, -12771, -11203, -8567, -2736, -4701, -3448, -6698, -5652, -5389, -8232, -10697, -14316, -16220, -17726, -20251, -22278, -15028, -10480, -9343, -6974, -6265, -5682, -5001, 90, 5262, 403, 1631, 1749, 2911, 7308, 7304, -2472, -2513, -3841, -7738, -8085, -5122, -1744, 1537, -4690, -7683, -9172, -3251, -3595, -9409, -13073, -5839, 1950, 1114, -7888, -14728, -11598, -5670, -5435, -5763, -7184, -7253, -2060, -2835, 397, 2687, -1380, -6304, -7752, -6305, -7348, -9617, -13207, -11481, -9246, -15539, -23314, -15313, -6924, -8612, -7006, -5088, 2291, 2706]
15657B706n581l588M44K643q932J712j753J93K139q81L524O690N724M863o115
15642C788n554k331l69M356n494j717N74j716P330L029j2659q639M008J114K984
15627a1296L787K483k151k491l417J63J0161L605J48l462p30l269n680R26l340
15612a4563L283N050M613j662j087J65J055K34l952L354L411M947J296J988l326
15597D806q326Q54K871N634k373l428l238K213N399P827p88k713o734l268k89
15582a553K630k560l853m540n21K780M30K670L960o07K404M905J111J728j768
15567G216o943j2030N892J806j098j114o995J599J702R570K205j172Q28K556m703
15552f81J23k862J253j975k222J26J64o894m00K527M790l864n712K749J624J408
$$ y = [2706, -2875, -6463, -6019, -3376, -12308, -10596, -12349, -12156, -10017, -10898, -7374, -684, 5040, 9903, 3788, -1766, -4097, -4466, -110, -5604, -7321, -6747, -8463, -1133, 1896, -10763, -19402, -15394, -14280, -11296, -7509, -5026, -7177, -9668, -13085, -12922, -2761, 844, 992, -2470, -3200, -6469, -12149, -11223, -14563, -11280, -6230, -1617, -3279, -4366, -4201, -3146, -2912, -6864, -3510, -99, 4848, 6144, 8132, 4806, -3520, -2666, 205, 5839, 3466, 38, -3200, -987, 4412, 12239, 11451, 8738, 2004, -1264, -1553, 1077, -1483, -5336, -9876, -10397, -7617, -7187, -4517, -557, -1164, 1240, 6145, 7256, 8984, 7216, 273, -11757, -5865, -4059, -5157, -6271, -13266, -11667, -9965, -395, 1810, 638, 1466, 4022, -681, -558, -3420, -2167, -4142, -6364, -6238, -6074, -12968, -13368, -10841, -6051, -9915, -15627, -12878, -11254, -9846]
15536i846M710L402k370q361K657K406k410m46J195N336Q389O27l334k602J127
15521D80M447N431m514q577O54m033m388j158k136j333k033Q057O913K455r06
15506f41q95Q67K65Q577O485l771o348J790M78o637K250L562j284l447o812m365
15490i926m492P177L86M80k444j072M924l491n170K86r38j020J576M179L698j269
15474g116Q5O815j920l173N138N304M586j118k909l567k633K92j10j494m147J353
15458d614m057o458N156J2632M263p280k108J074N24K792R104J928L33K78j965
15443A1602j0861M041Q758j951p006J576R80R87j608j158Q34k230q299j597Q045
15428B113n98j916l028r822k375L845M82K812M075k48n27R64J808m56L207L386
$$ y = [-9846, -5136, -1734, -4104, -12465, -9808, -7402, -9812, -10258, -9063, -3727, 4662, 5289, 1955, -647, 480, 4927, 10358, 5844, -2733, -2079, -6112, -10500, -11658, -13794, -15127, -17160, -9103, -2190, 265, -641, -1536, -669, -404, 8173, 14658, 10887, 4539, 6329, 6807, 170, 2420, 5982, 4698, 1251, -5561, -9926, -14418, -7241, -6855, -6375, -8819, -9891, -4967, -8458, -13628, -13342, -14280, -15300, -13724, -9545, -5847, -7116, -7031, -216, -2136, -5309, -171, 5133, 9719, 8601, 5692, 2125, -508, -216, -326, -1820, -5967, -4614, -8671, -15129, -9973, 2659, 6922, -358, -2466, -1392, -868, 1924, 11028, 12956, 13289, 13567, 11602, 741, 4782, 13540, 11589, 4583, 6159, 7139, 8126, 6518, 5360, 6194, 3964, -4335, -5932, 2113, 1515, -401, -3429, -13251, -15626, -11781, -11299, -8487, -4412, -4660, -5187, -4223, -2415, -2871, 336, 3722]
15412C722J36n301L41k708p2p700L012Q620J868J747k402r374K308N375m222N85
15396d065P10j854k099K69K722M93o804n560K089L877N078P96l560p36K224k415
15380h835k326j631q37Q385M113r83j257o747k226K266J583M771K189k098m24
15365d057n029K663M987N585k093l667j695P125l597p954L606j14j142p74J176
15350d980O2J464k911n468N378K218P46K853P53j566p417l305K926K526J755l891
15334h857q621L1K807K554P59Q98L209M41k675R347O325l757q95O364Q990M468
15318B1388P324J2906L0021M8913P2328P9270L1691l6681p3937o8865n1244k1704
15306E1410j3433j2713m024n329l301l291r763Q261K777n044l758K284o42J32
$$ y = [3722, 3858, -1443, -1102, -3810, -3882, -11582, -8570, 50, 1918, 3665, 1263, -8111, -5803, -428, -4650, -4065, -3355, -5209, -7308, -7039, -4317, -3824, -10628, -16188, -14099, -10222, -5144, -4348, -7908, -8644, -6420, -8835, -11161, -12792, -13629, -5244, -1131, -2114, -3371, -10118, -12344, -10078, -8495, -3724, -1535, -3633, -4057, -9086, -6423, -1436, 4149, 2056, -1611, -3306, 3819, 222, -7732, -4126, -4240, -5382, -6156, -4980, -4918, -3454, -6365, -11833, -6455, -4237, -3491, -638, 115, -1451, -8868, -12173, -9247, -6721, -4966, -8857, -17478, -17447, -14640, -12086, -11327, -10429, -7220, -6779, -9454, -107, 6218, 2461, 1566, 7930, 16920, 21388, 28712, 41618, 71639, 120552, 192880, 272150, 303841, 267160, 193223, 124358, 73114, 51410, 37977, 25264, 21240, 15911, 12610, 9319, -444, 7817, 10594, 5550, 1792, 4076, 3434, 3566]
15292C566k300L076K736j143j171k162O45O073J616K235l400k185n379k568n979
15277f340J066j278O08M501Q56N53m228n89k751J086K661Q27N57k36o59L743O96
15260A073k693K36l97J158j296q924J134R298P028K59l478o269j952L862j084
15245b045J430M389k807J611J17q776l890j481K522M402J3179L603l155o713p676
15230e290l306K913o99l252n64J460K585k471j977j496k162L197L678M015k459
15215e828m925J0446j888R9N127Q87o543k437N79K332K160N55K955l091n042p97
15199e411n29k014K292R027K338J139l329k143K353l532J991N898o516o964k483
15184g883J794N537K50l446k021M811K921m757R49q07l871J961N192L945k847
$$ y = [3566, 1266, 4342, 7078, 5935, 4764, 2602, 3247, 9320, 10936, 13171, 9771, 7586, 2207, -361, -6340, -5274, -6552, -5944, -1443, -587, -34, -4262, -4851, -7602, -6516, -3855, -3028, -2471, -2707, -3366, 377, 1073, -1620, -1384, -1781, -623, -1919, -10843, -9709, -411, 6617, 6876, 3398, -2871, -4823, -961, -2045, -615, 3774, 967, 2578, 2695, -6081, -9971, -11452, -8930, -4528, 8651, 12254, 9099, 2386, -5290, -8596, -5683, -6382, -9634, -10198, -8738, -6153, -8624, -10601, -12097, -14259, -11062, -7384, -3369, -5828, -10753, -307, -2195, -2096, 3031, 3918, -2625, -5062, -4483, -2151, 9, 564, 3519, 428, -4614, -5411, -5940, -7954, -5662, 3365, 5703, 6842, 3513, 1370, 3723, 191, 2182, 8080, 1564, -5400, -7883, -6089, -552, -302, -3748, -5769, -958, 1963, -2794, -1845, -2652, -6523, -4562, 630, 4575, 1728]
15169A728l581J391m775L996N653N78n968K628M686j902m575K118p45k514J336
15154E4q094J375R1J266Q36P34N991J726n04k226j606l940k093R38J996P983L357
15137G884M76o437k630j337L406n910j31O535p693o790Q73n931l617L588O77M154
15121a2883Q481m827k805k237K463L977R727m509p589J632K263k502j226P079
15107b956N262k063L294J597K331j520q759o559O645N358L666L942j350j0532
15093a644P99K260m61o408o423J111O224L947L681O67J435M531j511j3311q942
15078a4045O80O837O152q29J707l80J676P762j473r025J115K046l6J015k126l495
15062b419n78N768N501o789k017P843K001k291J967l454o951k074J740n83K872
$$ y = [1728, -1853, -462, -5237, -1241, 4412, 4990, -978, 1650, 6336, 4434, -141, 1977, 1232, -1282, 54, -8040, -6665, -6574, -5308, -4472, -3738, 2253, 3979, 3475, 1249, -357, -4297, -6390, -5452, -3456, 4527, 7884, 8360, 1923, -707, -2044, 1362, -4548, -4679, 1856, -5837, -12627, -11754, -17685, -21302, -17714, -17037, -12883, -4402, -9229, -12034, -14271, -11808, -7831, 1896, -2613, -10202, -8570, -6307, -8809, -10035, -2956, 2306, 243, 3537, 5134, 7465, 5945, -2814, -9373, -2728, 2630, 6296, 10238, 8888, -1644, -845, 1415, 954, -5454, -11877, -10766, -4542, -595, 3086, 3753, 5188, 9719, 8208, -5103, -14045, -13365, -6528, -376, -1205, 502, 122, 1798, 9560, 8087, -938, 177, 2223, 2187, 3202, 1076, -2419, -2997, 2771, 8272, 1483, -534, 7309, 9310, 7019, 8986, 5532, -1419, -3493, -1753, -2336, 536]
15047E36L213J866O15J993k731K404k267j4015J841P524n562m487K158L530J439
15032a943O128K191l009lp69m79R14M238m410l223k65O01Q28j178n819l99O006
15015e91q29k622j088K637j577N019j239J692M004j404r753m729O4O18J844M317
14999c637m101K939j28K902m205p58M104R087k920q77K962L356q1k928l752n604
14983c641j63n75P694n548k766K227m51M795M669n831l259J58j337l823j381K362
14967f870J145n690R799J084N4m998J261K710p17k936n086j430k146K916J069
14952i835k985M238j191J592P814j455o60M625n060m040L6r46n823k33O114j288
14936i097j557K751j136Q17O17N415p485p295M652P206R45M902M227l841n222
$$ y = [536, 3749, 5615, 6230, 8223, 5492, 7896, 5629, -8386, -6545, 979, -4583, -9070, -6912, -3382, -1943, 4185, 6376, 3367, 3364, 2595, 2116, 3030, 7268, 2858, -365, -630, -29, 799, -379, -6198, -6597, -591, -1420, -4042, -5130, -2493, -4070, 949, -290, 1402, 5406, 4002, -5751, -10480, -10416, -9798, -7954, -3637, -7738, -4799, -4927, -2025, -6230, -6988, -2884, 6203, 3283, 2406, 5368, 8724, 8643, 5715, 1963, -3641, -3804, -4379, 3315, -2233, -4999, -2772, -3223, 1572, 6241, 410, -2849, -2691, -4028, -7851, -9232, -6870, -5725, -11415, -1616, -532, -478, -5476, -4215, -1505, -2222, -5158, -10244, -11674, -13820, -10904, -9835, -12820, -8582, -9773, -8181, -367, -1822, -2482, 2143, -2917, -6957, -6921, -7867, -13690, -13923, -7809, -9097, -10654, -7903, -9039, -8222, -7605, -2190, -9675, -16970, -12318, -5112, -4167, 735, 4962, 1121, -4101]
14921d101M192O839j975L3l094j140M632K990m683o779k533N021q46k786K4J3297
14905I091L314n303L813K151N291j264l211k907p524K756j827n749n250j119J272
14890f466K607o22L579N202N3k675j388N74J04m967p20M213j49P95j508k717m998
14873i083l759j081m376K627O417M885Q291M305M06p659n547Q26M303M518m485
14858E88N9M810j974J229k829K008L059O046l003j0162K164O080j462k462k070
14843B081j078k549J545N575P60j489L406l621m938m7L510k301N95m990k204K505
14827c240l424n24j335M570R35n178l471M2P313l67J452L267K405o52n07O72M28
14810B386N338k599r181R97J911j693r54m343m265j604J0254R116K513j658L943
$$ y = [-4101, 91, 6930, 4955, 4988, 1894, 754, 5386, 8376, 3693, -3086, -5619, -598, -1444, -4230, -4206, 9091, 12405, 7102, 10915, 13066, 18357, 17093, 13882, 10975, 3451, 6207, 4380, -1369, -6619, -7738, -6466, -3859, -4481, -902, 4300, 4353, 1678, 290, 864, 968, -3999, -4719, -506, -655, 140, -1368, -4085, -9083, -12842, -13923, -18299, -15672, -9255, -4370, 3921, 8226, 8632, 973, -4574, -3748, 555, 5073, 588, 647, 5457, 3483, 4712, 1883, 3891, 6950, 12996, 9993, -169, 1995, 8075, 6613, 4151, 2081, 1003, -1546, -1, 5574, 6334, 4845, 8251, 4630, -308, -355, 3155, 854, 1449, -3541, -5745, -3240, -6664, -7188, -8523, -3953, -3018, -8196, -11667, -11625, -4312, -4679, -3227, 40, 2445, 1793, 1286, 1958, 2386, 7724, 5125, -4056, -3059, -1148, -2841, -3795, -8138, -12403, -14007, -3753, 5363, 7876, 6218, 10161]
14795A0161l534k292R03k278p508j55K304O637J955L556J058n580j097l126N6
14780A060K472o030M533j788o524L531L346L151M67j653n499O655O548l731J77
14765F715N519N31p441L032n67k360J597j562m916l550Q083O344k349K895n437
14750F534p695j915L180P085K723J980N405K892m425j479o854l040j010O64P41
14735D786J726K800j5j595o790p698J039J831J272n5P80l443q65K86k946j105
14719i992K51M395j541j06k19K605k862n454R020o21l657L399j81O128K964n411
14703a282k977P78O678q9L767N213j632k451J141L964j5n096p830o769l58L006
14687c952l194Q89M788L164l082P27K810J783j259r56l196O552l007r615K26P111
$$ y = [10161, 6627, 4335, 5238, 2960, -4548, -4703, -2399, 4238, 6193, 9749, 10807, 5227, 4130, 1004, 1060, 3532, -2498, 2035, 247, -6277, -2746, 600, 3751, 4218, 2565, -2934, 3721, 10269, 6538, 6715, 12234, 12765, 5324, 8356, 7789, 5429, 7026, 5464, 548, -3002, 5081, 11425, 9076, 11971, 6534, -1161, -3076, 104, 7189, 9912, 11892, 17297, 20189, 15764, 14285, 7431, 4391, 3381, 4045, 4786, 6512, 9312, 9297, 7702, 912, -6786, -5747, -3916, -2644, -2699, -1919, -5362, -6227, -5941, -8887, -9992, -9741, -5346, -6887, -6993, -7212, -4607, -7469, -12923, -3903, -4524, -8181, -4782, -4963, 1165, 4129, -1282, -4259, -3481, 3197, 3108, 6875, 12088, 10456, 8005, 9146, 13110, 13095, 7999, 169, -6600, -6958, -3952, -7146, -6257, -1469, 1695, -1387, -660, 2150, 3933, 2674, 1718, -1478, 5074, 2067, -7548, -7322, -211]
14671b11l800j789M384M417m808m657l84l616m27J199K488K741J761j89k481Q171
14655B799k761l307J070j507P06M961M549J684q325p69K389K3j078l362m165J826
14639e267l93L47o90J476M358K015j055l505r99p02J000j109l0O028P733m932
14623D275l291J597m337k136m652k301o8J437N731N537k176j162N430M354J093
14608I331J046n652j452J678K441K712J091K499J286n685n299k116o04P917O730
14593A5923m477k873J929L159m31n469p38J116k436n127J094j36j64m338j700
14578d668M403K126K439M131O985M68L893j2834p513j018j913l128m669j26K732
14563h692J0002R247p47p34M900k807k800L066R80l47j628n769l487o799n420
$$ y = [-211, -4011, -5800, -1416, 3001, -1807, -6464, -6848, -10464, -10891, -9692, -7204, -4463, -2702, -2891, -5372, 2799, 38, -3269, -2199, -3706, -3000, 1961, 6510, 8194, -131, -900, 1489, 1512, 434, -2928, -7093, -5267, -5660, -5313, -6003, -4527, -169, 1846, 791, -2714, -3713, -4415, -3415, -4524, -4554, 1474, 9207, 4275, 984, 2581, -1756, -3892, -8544, -10845, -10913, -9476, -3745, 1792, -384, -1546, 3884, 8238, 9331, 10377, 4725, 3273, 4951, 7392, 10104, 11195, 13694, 14980, 9295, 3996, 1880, 1276, 9193, 15923, 11446, 8573, 10502, 13661, 13230, 7761, 7023, 8139, 5703, 576, 1670, 1534, 1370, -2968, -4668, -265, 1861, 4300, 8431, 15416, 15884, 19777, 6943, -570, -1588, -3501, -6629, -11298, -11424, -8692, 1310, 10557, 9810, 9076, 13976, 11169, 8369, 11435, 12415, 12068, 10440, 4671, 1184, -5615, -11035]
14548a1035N058L837R751R68o686k102K720M414l459j097l582N193N680J955l584
14533H031k264r260J272o77l648r5K119M463P458M610n97m326k398M673o544m253
14517a436J552r19P672J139m000q16K771k730M939k298j975Q46M00M077J947k167
14501I002p357k141K506L78j703n341k698Q397M959k018m100l917R61K778J532
14486A238J7K104m823n37N360j161J246k451L313N70K115N779M933k584r600o435
14470i16n564J546K768p48J676K386K522q60o161o320p1J0663J7667O353n182
14455A9759m668q563j0051l792q18P036k124j156K644j998J596l966N549J744
14441A192J130K159k5M694L896k220j0526n547k74N268n38K196K332K06m303K579
$$ y = [-11035, -5977, -2140, 7611, 8579, 1893, -209, 2511, 6925, 3466, 2369, -1213, 3980, 9660, 11615, 8031, 5767, -3493, -2221, -2898, -6546, -6641, -4522, -59, 7399, 12009, 11412, 7086, 4688, 9361, 2817, -1436, 116, -803, 6869, 8008, 4008, 3192, 5963, 3233, 8172, 5874, 3899, 4745, 5145, 9222, 11169, 9002, 1645, -496, 2010, 2388, 685, -4656, -7354, 1043, 6002, 3984, -116, -4033, -3072, -294, 1238, 1255, 3359, -1464, -2001, 3359, 2198, 3444, 993, 4306, 4876, 6991, 12770, 17703, 15119, 5519, -916, -6480, -4934, -2166, -2914, -1238, 1148, 3670, 2810, -3351, -9671, -9742, 921, 18588, 24941, 19759, 15091, 6528, -3523, -7315, -8133, -1097, -3221, -4377, -1733, -3731, -2135, -6101, -552, 1192, 2322, 4481, 4456, 9150, 13046, 10826, 300, -5247, -5521, -253, -791, 1405, 3737, 3943, -360, 2219]
14425B219N22m271k140k745j355r18M2L024n4R812N834j0953p732N497K690M693
14409D165k344J965j69J700L34n542K098L094P114p55o714j40J869o069n022L183
14393a233N314N053j664J832j906k807q056R96N942K773l287K271L915n168n048
14378a073r27J349M19l166Q48N367N758k964m298j346j642r14J869J616m77K739
14362C158N906l321p716R38q76o70R10k376L656j38k752l05K968L495O056R824
14346A8757q95n286j2476l543J559o499P495J392m73n49j799k165q506l683K423
14331a4248k981K371R375P773N87P15M288J031p77l326n600j495J280N963k498
14316B458m951k922L714j57j461o076L479L111N502J216J490l431J233m554k801
$$ y = [2219, 2741, -1530, -3670, -6415, -7770, -8688, -8646, -5622, -5676, 4136, 9970, -983, -8715, -3218, -528, 4165, 1821, 3786, 3617, 5317, 5651, 109, 2207, 5301, 12415, 11660, 4946, 4806, 6675, 606, -4416, -1233, 4081, 9134, 7470, 9302, 7396, 4589, -3467, -2471, 3471, 6244, 2957, 5228, 9143, 3975, -1073, -2000, -651, -232, -3398, -2550, 2817, 8575, 5611, 1313, -33, -1675, -2589, -720, 896, 419, 3158, 9064, 5743, -1973, -1035, -1911, -2581, -1671, -4047, -391, -529, -3281, -3586, -618, 2877, 8933, 18757, 17862, 12576, 100, -3443, -1884, -8383, -888, 504, 31, -518, -2317, -4482, -12988, -16671, -14248, -17229, -14858, -5483, 2290, 2877, 3592, 7880, 8911, 8134, 4808, -792, -2287, -1007, 4956, 2458, -2493, -5415, -1701, -1858, -3319, -9395, -5916, -2805, 2697, 3913, 5403, 1972, 3205, -1349, -4150]
14301d150q931J511O375L202K051K514k153O400J0762p736n810j315j907p39Q4
14286A58l874L513N371l912P98J559O4j844r943L200L969l750l227J001O634Q825
14270H542L455l660m859K951Q874m633m107K32K518J433o765l295j242K369j131
14255F82Q48R52K669k580o9L134r38L82q0K705K331n147p41L456k866n68K634
14238F804j539L13m730p45L222J850l922J422Q72L87j905l744j354O686K613j349
14222D881p53K752N189k530m097m67j359M587Q255m728j652j060l253K789N792
14207A4346J413R75q889o945k975N817Q198P589J797j575j470o802p350n32L683
14192G280J002k84j0818K771N222J54M173k481p447Q1L626N409J143J579k415
$$ y = [-4150, -13081, -11570, -5195, -1993, 58, 2572, 419, 6819, 17581, 9845, 4035, 2720, 813, 74, 158, -3716, -203, 5168, 1256, 2054, 3613, 3677, 1833, -8110, -4910, -941, -4691, -7918, -6917, -283, 8542, 11997, 8337, 3478, 6429, 15303, 10670, 6563, 6795, 9313, 10746, 3981, 686, -556, 1813, 682, 1530, 2482, 5151, 2571, 2502, 5636, 4698, 5080, 5000, 7705, 10036, 4889, 4148, 7604, 4738, 4170, 6804, 5265, 5578, 848, 103, 3325, 5175, 1253, 2675, 3547, 3934, 2029, -1715, -3069, 3617, 6230, 4881, 4128, 6880, 12069, 9539, 5442, 4975, 3616, 8203, 16458, 11730, 10078, 9018, 5765, 8554, 14346, 15759, 16734, 7845, 900, -2075, 3742, 11940, 19529, 21326, 19751, 18281, 11479, 4129, 3597, 7280, 8282, 7998, -2820, -49, 5173, 5327, 9500, 7019, -428, -347, 3279, 8688, 9831, 11410, 8995]
14177H995r02M36L337l960k24J398M617j114n514j354m319P72o028l55M896M915
14161E596R037j433L932K94p544o577m51K54r98N266J1432Q505K998l473o079
14146B0759q928r528L633Q260N853K372j0627o212j176n39j259Q71n11K421K139
14131G528j032M067J433o469l22O110k645j564J360l930k01J208O711K15k848
14116I621j166J673L922K367n155k484o586N222P88m708o68M608N231k85l980
14101H400l351k486O525J1285m363o111k923n227k319N507J388J46K272l235M628
14086A0136K744O81m364m094K926R542J39k659R98q458k381R37J023k09J50P14
14070G825l9K756k908p299n169L135P144J404p023k780M195l302q26K196J595
$$ y = [8995, 8093, 8529, 11866, 7906, 7682, 9080, 13697, 12583, 7069, 5715, 1396, 2168, -3860, -4215, 681, 5596, 14633, 13200, 17132, 17426, 9882, 3305, 2854, 3108, 2110, 7376, 18808, 27313, 30311, 26838, 20759, 11831, 2303, 5936, 14196, 20049, 22421, 11794, 5582, 4406, 3867, 2608, 3479, 2968, 5389, 7528, 6496, 10563, 11996, 5527, 5205, 11315, 8670, 7106, 8466, 4536, 4335, 5543, 12254, 12469, 9621, 8455, 10128, 14050, 16417, 11262, 8778, 2192, 7414, 8202, 3494, 2826, 7434, 12665, 12380, 8400, 5049, 2563, 9088, 20373, 16010, 9899, 6976, 1749, -570, 4937, 6325, 6471, 8743, 5508, 10136, 12880, 13561, 9197, 5103, 8029, 17571, 17710, 15051, 16049, 7591, 5210, 6147, 7170, 6961, 7111, 7825, 7786, 10542, 7634, 335, -4834, -1699, 5445, 6849, -174, -2954, 1241, -2061, -2887, -691, 904]
14055I04J693O972j619m237J47J0298m61q654l537k15O567K221m013k826k424
14040H16j884j732M617J872m97K192K702J234M463O9m904L925L110K795o54J515
14024A9639m961p274L400K289p6K569m039n382K620o414j473N538N013J225M214
14009A6888J811K542L170k017k998J314p553p592K139K967M653K601J472m618
13995A4779m840o51j844k564j9M600J572n344N086o30Q14l961l139P484M33l118
13979H658Q91k211K106O694l895n899M953k427N53K417m111j273J445J039N187
13964A4127M673J806Q002j661n771m176o502m127q12n622j015K514M116N789L469
13949A4810k169o946m106K293K419m68O81N776j87P73M379J283k883L72M479N395
$$ y = [904, 2597, 9569, 7950, 3713, 3860, 14158, 13697, 5043, 1506, 1291, 7858, 10079, 6066, 3240, 816, -1068, -2800, 1817, 3689, 3192, 5384, 8086, 9320, 13783, 13852, 8948, 12873, 15983, 18778, 18124, 19639, 14678, 7404, 10804, 13093, 13017, 15586, 11547, 6165, 8785, 2371, 898, 6436, 11449, 12674, 16888, 18699, 21241, 24411, 22394, 19396, 20710, 13157, 5565, 7704, 10671, 15324, 17925, 19397, 14779, 9939, 9288, 7444, 4880, 4861, 9461, 11033, 5689, 10775, 10145, 10959, 6998, 3859, 11343, 11776, 8658, 9549, 7338, 9444, 16138, 12243, 6344, 11297, 8870, 9423, 11840, 7729, 6456, 7901, 8940, 14127, 18800, 20606, 28608, 26947, 21176, 17000, 10498, 6371, 5559, -63, -1078, 1436, 5552, 11341, 14810, 12641, 5695, 1589, 3882, 6301, 5833, 6514, 12290, 12103, 12876, 17255, 18538, 15655, 16027, 20506, 25901]
13933B5901o378o080k118l405k317m254M778N193j537l61J30p590l551R117K850
13918A0378k475K082J303k240k772K13L479l5k459m431M804K129K78l533n2m516
13902B153M877P684o726o375P621J0586Q98n239o321m342J064n29N098J697L530
13887A5676J993O28R00j121k94K219J1N664p898o930L015k88L114N393k939m075
13871A5068l533p582o571K731N234J645m13M177R208n568n343O20P223k884L334
13856A7346m659n763M446Q061K809m395p418J403n97K803j806k956M249P207l55
13841B0375q659l90R0M460M747L85n859l580j550m539K957K099N108R87r9J771
13825A8303K289K127J410J587j968j0353l741j063J119m164K29M637m358M393
$$ y = [25901, 19523, 13443, 11325, 7920, 5603, 1349, 6127, 11320, 9783, 9422, 9552, 1962, -1589, 7528, 10378, 7903, 9985, 11288, 9048, 6276, 6489, 9968, 9933, 7474, 3043, 7847, 9976, 10254, 6721, 6669, 2153, 7030, 14714, 7988, 1613, 9234, 19820, 20718, 15479, 9158, 4816, 5880, 5351, 10449, 12146, 15676, 17669, 18297, 19197, 18076, 17782, 20001, 20012, 25676, 17778, 10848, 13863, 13575, 16689, 22082, 19143, 15068, 11535, 3953, -2618, 113, 5347, 6992, 6579, 10756, 19964, 14396, 9053, 9673, 16896, 14012, 17346, 12687, 6924, 11370, 19431, 22240, 17845, 10427, 11830, 11233, 14036, 12230, 9274, 13523, 20730, 20375, 11716, 11326, 11416, 15876, 20623, 21008, 15149, 11569, 10019, 5480, 8437, 10536, 15644, 16631, 16532, 18303, 20592, 22719, 24129, 25716, 23748, 13395, 9654, 8591, 9710, 5546, 5775, 10412, 6054, 10447]
13811A0447K329M644j853q176m08L769J676K801l40J180k15k156j042j88k664
13796I804n324P51K579Q036L135k73k273M419j660m875K637P619l873n569j12
13781A5021n371m585P177N225k558k068M58p558m531J167J126K731P599N557k180
13766A7210n162l945L364M081J432K489P777k757p974n957m094K851N870J837
13752A7022j138K778o831o108J834O862k07k729j19n46K975N41Q419P290p415
13737B2628q615j260j183m29O722p5J726K979J762L19K219J852N19K295L145k10
13721C4394N93L363J3916L0236L4487K5213l078k7960k3422k0771j7169j1476
13709C8326l226N003m823r932q814K564O764P357R186R963j134r17K05O142O825
$$ y = [10447, 12776, 17420, 15567, 7391, 6983, 10752, 12428, 15229, 14889, 16069, 15854, 13698, 12656, 12468, 9804, 4480, 5231, 7810, 15846, 18981, 18708, 16435, 20854, 19194, 14319, 16956, 24575, 20702, 15133, 15021, 9650, 5065, 12242, 17467, 14909, 12841, 13299, 5741, 1210, 2377, 3503, 6234, 13833, 19390, 17210, 12048, 8103, 11467, 15548, 16980, 19469, 27246, 24489, 16515, 10558, 6464, 9315, 15185, 17022, 15884, 18662, 11831, 5723, 7557, 14419, 14212, 11483, 11364, 10818, 13793, 14334, 22753, 30043, 22628, 14013, 12753, 11570, 11141, 17863, 17788, 19514, 22493, 24255, 24574, 26793, 28645, 29164, 31459, 34604, 34394, 34987, 38350, 52266, 82502, 116989, 142202, 139124, 111164, 87742, 66971, 49802, 38326, 35100, 40103, 35280, 25348, 16534, 19098, 25862, 33219, 42405, 52368, 51234, 50317, 50522, 56664, 63489]
13694F3489Q773K0254J6295J1787M1269N1976J3755p389j2181l3814l6924l3294
13682A03996j8467o218r79J864k604r676j0262j5798o126M033P243L699L136k058
13668E1783o877l700n999J705K046Q10K734J307J4450K4922L0194L9205J8123
13655A70703j3071l7041k8948k0680j4871n565o373l21q814l858O603j151k180
13642C4433o924n612N764N077j59K042N070M087k277j1866m347j672k726k879
13628A8011N52J695K528j428l526l617L873L460J502P95MN103L262m209K980j64
13612C0821k129k405K477O187K291J000n002p139j3855q58R102L627m917J1667
13598C0867N800l891k350k23k725l47M066n582n778K226l836M887Q89m455L03
$$ y = [63489, 72262, 92516, 108811, 120598, 161867, 213843, 227598, 220209, 208028, 174214, 137290, 103996, 85529, 79311, 78332, 80196, 77592, 67916, 57654, 41856, 35730, 39763, 47006, 50705, 53841, 51783, 44906, 41206, 35207, 36912, 38958, 39768, 42502, 43809, 58259, 83181, 113375, 152580, 170703, 157632, 120591, 91643, 70963, 56092, 50527, 44154, 43833, 35019, 31161, 37764, 36613, 34433, 27509, 21897, 27661, 32738, 32579, 34621, 39691, 43778, 41501, 29635, 25288, 23616, 20890, 18011, 18563, 20258, 22786, 21358, 17832, 14215, 18088, 21548, 23050, 23845, 23849, 28952, 32214, 28005, 30985, 30821, 28692, 26287, 28764, 34951, 37242, 38242, 33240, 26101, 12246, 11388, 20490, 24117, 19200, 30867, 36667, 32776, 30426, 30203, 27478, 27131, 31197, 25615, 19837, 22063, 18227, 23114, 24003, 19548, 19851]
13583A9851N129R474K22j192r00N97P438M789M259N967p808j0788n947J399J923
13568C4413j966n256m130J679O054J736o20L289O900K621m282l132N582J4370
13554E7258J7945M127m146o811j4489N989J4729J0544m353j7705r960o27j034
13541E1467j527K75L92J549J1779N178O74J684n91L130M97j822J415M490J1731
13526I0321K1340K1370Q894J4841L0385O2243J23116J72241J20994k2483j40812
13515E02450j53458j09654o8195m1830k2908j1555m889o022j0623r599l945j39
13503E9633M57L104k504p055k764o72J1352R314R798P632M176j6032j0733M944
13489G0650M192M674n149q328j0085j0224p206o393L331n236k414N398q10l678
$$ y = [19851, 24980, 34454, 34676, 33484, 32584, 33181, 40619, 45408, 49667, 55634, 47826, 37038, 31091, 32490, 34413, 32447, 27191, 23061, 24740, 30794, 32530, 31910, 35199, 42099, 44720, 40438, 37306, 42888, 57258, 75203, 79330, 75184, 68373, 53884, 59873, 74602, 85146, 80793, 63088, 53128, 52501, 51467, 49940, 50215, 50607, 52156, 63935, 69113, 69787, 71471, 70880, 74010, 74507, 72685, 74100, 78590, 90321, 111661, 133031, 141925, 156766, 187151, 249394, 372510, 544751, 665745, 643262, 502450, 348992, 239338, 171143, 129313, 106405, 94850, 89961, 83939, 73316, 63717, 59772, 59633, 60090, 63194, 60690, 53635, 50871, 50199, 61551, 70865, 80663, 88295, 92471, 76439, 65706, 70650, 74842, 79516, 74367, 66039, 55954, 45730, 38524, 32131, 35462, 30226, 27812, 33210, 32400, 28722]
13475B8722j966R269J136o0M088J35K118k201m124m370j537L203J041o002J448
13460C0900R302M596k289J1124L980p948o766K172J583j4n75l998j669k558l711
13445C4129k331L401M495O68l506J392M602r056k596L185M294J120J899m386l164
13430C4146on69l702K352Q243J0588l34r47m173p192n384l005O179K507k570l931
13414C2202J69M401M736k527K45l471l70L807l939q94N28j712p53m589M811r36
13398C1708l059P356k288k495K075N522n76k034j241L451P127L449M923n503j701
13383D6714m496n448N86L364k500N753M00j6203j991J5547M951M461M08k294l453
13368D5799n474m514J0589Q586P571J2645R041K865k401r569m671o554m325q719
$$ y = [28722, 26756, 36025, 37161, 37101, 41189, 41324, 43442, 41241, 37117, 32747, 31210, 34413, 35454, 29452, 30900, 40202, 44798, 42509, 53633, 57613, 49665, 42899, 45071, 46654, 46640, 46065, 42067, 40398, 37840, 34129, 31798, 35199, 39694, 40362, 36856, 38248, 42850, 33794, 31198, 34383, 38677, 39797, 41696, 37310, 34146, 34140, 33571, 29869, 32221, 40464, 51052, 50718, 49771, 45598, 38406, 33022, 30017, 36196, 38703, 36133, 32202, 32371, 36772, 41508, 38981, 39226, 35755, 35385, 39192, 35253, 34359, 34887, 33175, 32422, 27833, 32644, 31708, 28649, 36005, 33717, 31222, 33297, 38819, 38243, 36209, 34968, 38419, 45546, 48995, 53918, 48415, 46714, 42218, 36770, 37356, 40720, 38220, 43973, 44373, 28170, 26179, 41726, 46677, 51138, 51546, 49252, 45799, 40325, 35811, 46400, 54986, 62557, 75202, 84243, 87108, 84707, 75138, 70467, 63913, 59588, 50869]
13354E0869K363Q954N28n627m240J636O267M842L691K318O476k561q706o296R210
13339F9724J0810K616k99P83J476J1226J7232N957j1845j3712j6216o541N791
13326G7002l501M817J3534P104j4217q760m147j537K493M197K876k248r573n234
13312F2806k659L480M334N36K419K791O469L80k327K1148K6316J7691K114j3694
13298A31804j2899p051L114J8523K8630L4146M8244O5651J03874J84105L06981
13287I05122M98053O40061M87348J50437k48768n54521n83622m16259k47327j55151
13277D75373j06671o5876m7563l7768k9601k4234j4878j5203j3721q692k385m252
13265A04529n209Mp353o04j377j2140p745J74L921k348k916K429j361J881K197
$$ y = [50869, 53232, 62186, 62714, 57087, 52847, 54483, 60750, 65592, 69283, 71601, 78077, 75516, 66810, 60514, 69724, 80534, 83150, 82851, 83634, 85110, 96336, 113568, 119525, 107680, 93968, 77752, 71211, 77002, 73501, 78318, 91852, 98956, 84739, 75979, 71832, 70295, 72788, 76985, 79861, 77613, 68040, 62806, 60147, 63627, 67961, 68497, 70916, 73707, 80176, 80556, 78229, 99377, 125693, 143384, 145498, 131804, 118905, 111854, 114968, 133491, 162121, 196267, 244511, 310162, 414036, 598141, 905122, 1403175, 2043236, 2530584, 2681021, 2432253, 1877732, 1294110, 877851, 630524, 475373, 368702, 302826, 255263, 217495, 187894, 163660, 148782, 133579, 119858, 111166, 108781, 104529, 99320, 99324, 91971, 91367, 89990, 77850, 70105, 70279, 74200, 71852, 68936, 71365, 70004, 71885, 74082]
13250G4082k583K469j65J525p289n242M949N655p379p06l249n638Q19j13k072
13235E5063J44K897N866L059q95L172J0264L335K533r06m605J239J715o083m544
13220G2254m18m221n709r618M287Q354j16q767Q85q92m039k460rO705J1017N374
13204G2627j206m318k876M639K819r51K408k640p553J438Q23l051m769j883m352
13189E1155k136M856J1680J2857N203Q789N16j1036o483Kk660L140j0471n043
13175F0369O597k223l368m61P77J371P761R838J2431M676m582p80n600j4406J825
13160G4225N160R504R596M577M014k839j31L997j373l338o398j4918j6159q807
13146E7110l015r395K513l94l370N760R600J6991J5451J1996J323n467p226k048
$$ y = [74082, 71499, 73968, 73803, 75328, 68039, 62797, 67746, 73401, 66022, 65316, 62067, 56429, 57248, 57135, 55063, 55207, 58104, 63970, 67029, 66134, 69306, 79570, 82905, 85438, 84532, 79927, 81166, 82881, 76798, 72254, 71836, 67615, 61906, 52288, 56575, 64929, 64813, 56046, 56931, 56039, 52000, 49540, 49531, 56236, 67253, 72627, 71421, 67103, 64227, 68866, 71685, 70734, 73142, 70502, 62949, 64387, 65210, 62159, 57390, 55507, 51155, 49019, 53875, 65555, 78412, 83615, 92404, 92920, 81884, 75401, 75403, 72743, 75883, 65412, 60369, 66966, 64743, 61375, 60914, 61691, 63062, 70823, 80661, 93092, 97768, 93186, 92406, 86806, 72400, 74225, 79385, 88889, 98485, 103062, 107076, 104237, 104106, 108103, 106730, 103392, 96994, 82076, 65917, 57110, 54095, 44700, 47213, 46819, 43449, 49209, 58809, 75800, 91251, 103247, 104570, 99103, 91877, 89829]
13132H9829k511l138L089N351N665k28l9j596m821p89q00m129q586j264O695l750
13116G8978o799L542J4312Q774O315N284M103m95L034R218K667M347J5533K7418
13102A76231M4358M9531N0818M0061K4714O416j6200m1118n1849n0589l6936k1037
13090A74400j9904j3029m15k063k256p817k607L198J995R661K527j2821n569L17
13076A25617k132m500l91J2549M41q341N57k511j0221r24j6443j5115o396O823
13062G9013R973R518J2646J0070R065P410o483r267q962k686n26N552P162O554
13048A29039M762O657Q285N776n394o757N911M12L620M651J4407P394K987L71
13034A82121L037N534k225j4004j3427j9065j2108m561k984P617J5516K2668J4407
$$ y = [89829, 87318, 84180, 87269, 92620, 98285, 98057, 98018, 96422, 91601, 90812, 90012, 85883, 77297, 76033, 82728, 78978, 72179, 75721, 90033, 98807, 105122, 110406, 114509, 114014, 117048, 126266, 128933, 133280, 148813, 176231, 220589, 270120, 320938, 360999, 385713, 392129, 375929, 334811, 282962, 232373, 195437, 174400, 154496, 141467, 141052, 138989, 136733, 128916, 126309, 129507, 131502, 141163, 143690, 130869, 125300, 125617, 123485, 118985, 118594, 131143, 131584, 123243, 123800, 121289, 111068, 110144, 93701, 78586, 72190, 79013, 88986, 98504, 111150, 121220, 130285, 137695, 131212, 121945, 112983, 110297, 109771, 115323, 122485, 129039, 133801, 140458, 148743, 154519, 149125, 142368, 148279, 148691, 152311, 156962, 171369, 178763, 181750, 182121, 185158, 190692, 188467, 174463, 161036, 141971, 129863, 125302, 122318, 129935, 145451, 168119, 182526]
13021A82526m92N532J239o996r16P491O653N768j738J913J952j3054j3913p440
13007A68525r153o862j759J562j492p878o621O856J9628J2615K1058J8877L367
12994B18723r665p223q743j713l062J425M118P409Q062M839P630J0642J1868J2898
12980B57208J1777J1905K64J7475M1163N9203R6127R4895R621n7561o3952r8856
12968C79269l3956J4745O062n699k037l607k782k3m055p506q850p563l084o152
12954C14762j0680n749j227j376j719M439p30k378k382m86J340J743m829N86N179
12939B96493Q686J5049J9128K1698K6666K1173K4277K0136J7850J3080j752l615
12927D78869n375n1K931J0778J7922K2130J3191J2504N539P619R021O880J3434
$$ y = [182526, 182034, 187566, 188805, 181809, 180893, 188384, 195037, 200805, 199067, 200980, 202932, 189878, 175965, 168525, 159372, 152510, 150751, 152313, 150821, 142943, 136322, 143178, 162806, 175421, 196479, 215356, 218723, 209058, 201835, 193092, 191379, 188317, 189742, 193860, 201269, 209331, 214170, 221800, 232442, 244310, 257208, 268985, 280890, 281154, 298629, 339792, 398995, 495122, 590017, 599638, 542077, 478125, 379269, 345313, 360058, 366120, 360421, 358384, 354777, 351995, 351972, 347917, 340411, 331561, 323998, 320914, 314762, 304082, 298333, 297106, 295730, 294011, 298450, 297720, 295342, 292960, 292474, 293814, 295557, 290728, 291314, 296493, 305179, 320228, 339356, 361054, 387720, 408893, 433170, 453306, 471156, 484236, 482484, 478869, 473494, 473443, 476374, 487152, 505074, 527204, 540395, 552899, 558438, 566057, 575078, 581958, 595392]
12914E95392K1445K5588L3825L3953J6747O42P421J4840J1488O699J378J1239
12902G80657L2068M3921M1823M1217L1462K6620M7414O1239O4333O5438N8474
12891A294666O1097O4122L6508J6240K3001M1418N4183O6563P0156P6304Q8596
12880A892854J11250J25912J52191J71164J85916J72787J76838J75617J88650
12871C353179K20247K75742L28301L85444M46386N27142O09749O79658P83327
12862G609175R10009J061642J288652J591501K039271K699470L629039M853718
12854B5682477O379169Q463640J1792164J7775100K9103228N0279595Q4742548
12847B34217921J11991061Q7643697L2353649k8375062q5468928j05858782q2290744
$$ y = [595392, 616837, 642425, 676250, 710203, 726950, 727592, 735013, 749853, 761341, 768040, 769418, 780657, 812725, 856646, 898469, 939686, 971148, 997768, 1045182, 1106421, 1170754, 1236192, 1294666, 1355763, 1419885, 1456393, 1472633, 1495634, 1537052, 1591235, 1657798, 1727954, 1804258, 1892854, 2004104, 2130016, 2282207, 2453371, 2639287, 2812074, 2988912, 3164529, 3353179, 3573426, 3849168, 4177469, 4562913, 5009299, 5536441, 6146190, 6825848, 7609175, 8519184, 9580826, 10869478, 12460979, 14500250, 17199720, 20828759, 25682477, 32061646, 40525286, 52317450, 70092550, 99195778, 149475373, 234217921, 346208982, 433852679, 466206328, 437831266, 352362338, 246503556, 164212812]
12840A64212812n1377165l1237417j9734209j3317430r710398p548517n986470
12833B5301206m567206l443066k640855k084285j678910j348009j102308r12350
12825G524217p51743o24498n38574m56691m11242l81539l50814l29866l00758
12816C378492k56826k20615j58590r4698l7428j8830p6366j76740k00854j63194
12806A974351j39599j33259j22062j09525j04327r1970p6158n9270l7278k5474
12796A075429j4177j9964j4473j4743k4404l1509k4363j0613j6936l5440m4110
12785H24697l6938l4084l6748l7971l9106l1387j2981j0190M054J2152o372p941
12773E87185l596Q62R471K6120M0138N4747Q7968J46412K59085M55127N51623
$$ y = [164212812, 112835647, 81598230, 61864021, 48546591, 38836193, 31287676, 25301206, 20734000, 17290934, 14650079, 12565794, 10886884, 9538875, 8436567, 7524217, 6772474, 6147976, 5609402, 5152711, 4741469, 4359930, 4009116, 3679250, 3378492, 3121666, 2901051, 2742461, 2647763, 2610335, 2591505, 2515139, 2338399, 2137545, 1974351, 1834752, 1701493, 1579431, 1469906, 1365579, 1273609, 1197451, 1138181, 1100903, 1075429, 1061252, 1041288, 1026815, 1012072, 987668, 956159, 931796, 921183, 904247, 868807, 824697, 787759, 753675, 716927, 678956, 639850, 608463, 595482, 585292, 589346, 601498, 595126, 587185, 583589, 584451, 593922, 620042, 660180, 714927, 802895, 949307, 1208392, 1663519, 2215142]
12762B215142J75550l85177n64068m07548k39503j35208o9885m7612l3890k4885
12752D82916o800N590j4566j6170k4527k1636k2944j4591m616j1148j1553j1146
12740C28809j1326q650j1974j4382q578o545m892p259j1502j0047j854O842J8645
12727B57287L7342N4079O3725M6660L1610M0980M0928N5519J299m3970o3904r7643
12715D23912o2918m4713l1512j7295j3749q114r25j4720j3964O609N840l48J2514
12702B40617J5659Q56j7012j0855N553R579R874J8744J3883j0436m068p621p32
12689B64041O179m681l0824k8343k0862r073m436j863j3657q159j2636k4543j4570
12676I6573k595K702P816L272o716n015K486R576K5373M1115N5351N1365J3263
$$ y = [2215142, 2390692, 2005515, 1441447, 1033899, 794396, 659188, 589303, 541691, 507801, 482916, 476116, 481706, 467140, 450970, 426443, 404807, 381863, 367272, 362656, 351508, 339955, 328809, 317483, 308833, 296859, 282477, 273899, 267354, 262462, 255203, 243701, 233654, 231800, 238642, 257287, 294629, 348708, 412433, 459093, 490703, 531683, 572611, 628130, 629429, 585459, 521555, 423912, 360994, 316281, 284769, 267474, 253725, 245611, 244686, 229966, 216002, 222611, 228451, 228103, 240617, 256276, 257132, 240120, 229265, 234818, 244397, 254271, 273015, 286898, 276462, 272394, 264773, 264041, 270220, 265539, 234715, 206372, 185510, 176437, 172001, 170138, 156481, 148322, 135686, 111143, 96573, 93978, 96680, 104496, 107768, 101052, 96037, 98523, 108099, 133472, 174587, 229938, 281303, 294566]
12663B94566k8481m8081m4748l8270l2657k9916j3776J59M880J3036N282j461
12651H0533M773K837k816l894m67L607L098M857n290m154M590O600N062Q28J345
12636A01509n001j2874j3987o7L913J2113J3102Q223R147J383l518L3j0575j3084
12622I0317l375j268j689o213r85P386L473P022L807j464j2736p938q36k604L68
12607G3265j350R28J561Q547j836j943N842P78k870l190J259J3363L936O366N300
12592A09956R44k42o948o87R982J0784N045l425n403L258J1113J809l390k83r940
12577A22573j688N044j185j3253p639l604m515j0392j4716j105j035p576l665
12564E7244n70j631J1167L378K958J503J609j292p19l723N402J2026J4474K2765
$$ y = [294566, 266085, 218004, 173256, 134986, 102329, 72413, 58637, 58796, 63676, 76712, 81994, 80533, 85306, 88143, 85327, 81433, 80966, 84573, 87671, 92528, 87238, 83084, 87674, 94274, 99336, 100164, 101509, 96508, 83634, 69647, 69580, 73493, 85606, 98708, 106931, 116078, 117461, 113943, 113976, 103401, 90317, 86942, 85674, 83985, 77772, 76787, 84173, 87646, 94668, 98475, 97011, 84275, 76337, 75501, 72897, 73265, 71915, 72843, 74404, 82951, 81115, 79172, 85014, 85792, 82922, 79732, 80991, 94354, 98290, 104656, 109956, 110900, 110658, 103710, 103023, 113005, 123789, 128834, 125409, 120006, 123264, 134377, 136186, 132796, 132513, 122573, 120885, 125929, 124744, 111491, 103852, 100248, 95733, 85341, 70625, 69520, 68485, 60909, 57244, 56674, 55043, 66210, 69588, 72546, 74049, 75658, 74366, 73647, 69924, 75326, 87352, 101826, 124591]
12550A24591K1349K3429J5918J3718M452p715j6257j2645o469k4498k6689k0394
12538H8790q112j0149j1308M55P719K1881J9756J8618R20k0496k2996j6339j1708
12525E7031p633O325M523P21M773n03k363L153N731Q458J1418J5857K4191J0723
12511A42405p833k458O559Q61j9718k5562j1630o907N428P670J4634R502O452
12498A19403j4615j5448o596j2039m755R98p48r385o043m977m061n392L476K459
12484D2277l0K945N059N097l421k838n616J294R089J2446M716M238K878M573O745
12469H9452p126j6268j2970j988n083p732n02o464P51J821J789P000P554j067
12455D9167L85N440O165l149j3468p433j150k040o564m550n952j34j653K69M403
$$ y = [124591, 145940, 169369, 185287, 199005, 203457, 195742, 179485, 166840, 160371, 135873, 109184, 88790, 80678, 70529, 59221, 59676, 67395, 89276, 109032, 127650, 128570, 108074, 85078, 68739, 57031, 49398, 55723, 60246, 60967, 65740, 65237, 62874, 66027, 71758, 80216, 91634, 107491, 131682, 142405, 134572, 132114, 138673, 139534, 119816, 94254, 82624, 75717, 81145, 88815, 103449, 112951, 119403, 104788, 89340, 82744, 70705, 65950, 66948, 66200, 56815, 50772, 45795, 41734, 36342, 39818, 42277, 42247, 45192, 50251, 55348, 51927, 49089, 43473, 44767, 53856, 66302, 71018, 75256, 78134, 82707, 89452, 82326, 66058, 53088, 51100, 46017, 38285, 37783, 31319, 32070, 33891, 35680, 42680, 50234, 49167, 49552, 54992, 61157, 58008, 44540, 37107, 35957, 33917, 27353, 22803, 16851, 16717, 15064, 15333, 19736]
12440A9736Q889P356L737K299m199l720J999J584l998K842J475L00P228J1813
12426E7341L579n413l505j138k152K351J783P25k209n643N159L353O416N349Q111
12411G4107N520J5032K5691L3500M0925N6679R4740J58286K69474M65820O37334
12400A877108N40357K32915j48621m96243n91647m53322k77502j63378j08435
12391D11232p5350o5442n0641l1174k0381k5013k4476j2618j1756j0689n359J2497
12379I0830J7126R9k709L84j0705K260N273j454o888j0313q892j2058n983l5K602
12364E9537R673R475l887p660J863K805L050q70n173k366K113k644r217j5899
12350D0800l74R638K458O616J516N014J0996J0780K655J046L098k955m351k400
$$ y = [19736, 28625, 35981, 39718, 42017, 37818, 34098, 36097, 37681, 33683, 36525, 38000, 38300, 45528, 57341, 60920, 55507, 52002, 50864, 48712, 51063, 52846, 53571, 51362, 45719, 50878, 54231, 60647, 65996, 74107, 79627, 94659, 120350, 153850, 194775, 251454, 346194, 504480, 773954, 1239774, 1877108, 2417465, 2650380, 2501759, 2005516, 1413869, 960547, 683045, 519667, 411232, 335882, 270440, 219799, 188625, 168244, 143231, 118755, 106137, 94381, 83692, 78333, 90830, 107956, 108055, 105346, 105730, 95025, 97285, 102558, 101104, 94216, 83903, 75011, 62953, 56970, 56935, 59537, 69210, 78685, 74798, 67138, 69001, 71806, 74856, 73986, 68813, 66447, 68560, 65916, 56699, 40800, 40426, 50064, 52522, 59138, 60654, 65668, 76664, 87444, 90099, 91145, 94243, 91288, 86937, 84537]
12336H4537k109p753j681Q39r419j7700r433j1215K670l2K837m79k101J198k555
12321B7604l578O346O86N096K309o076j0395l66n302J985N765O63l93Q358Q940
12306D1642N959l659o555j700o84m076O280J008n267q486m504j0216j141M320
12292A2921M091l69p251J552J839r51K671n21m527m511K071R935M880Q431l881
12277B6380p314k065J1212K189K288p055p707k303m801j327K56q34L204r3L844
12262A5874J921J54o382j354Q7m256o304j158j982P99K608Q860Q840J227k430
12247A6504J272m93J018k379l149m81J109j051n390N867l228l72O089K931j0296
12232G951j06M407j998L7l866n286K33l774K962J234j778Q3R62J297K983m47M503
$$ y = [84537, 82428, 74675, 72994, 73833, 64414, 46714, 37281, 26066, 28736, 28704, 31541, 31062, 28961, 30159, 27604, 24026, 30372, 31058, 36154, 38463, 32387, 21992, 21626, 16324, 18309, 24074, 24737, 24344, 32702, 41642, 47601, 43942, 37387, 35687, 35003, 30927, 37207, 38215, 32948, 24462, 19958, 9742, 8601, 12921, 17012, 16643, 9392, 10944, 12783, 11832, 14503, 13982, 9455, 4944, 7015, 16950, 21830, 30261, 26380, 19066, 17001, 28213, 30402, 32690, 25635, 17928, 15625, 10824, 9497, 9753, 8919, 12123, 12030, 15874, 17795, 17949, 11567, 10213, 10300, 6044, -260, -1418, -3400, -2601, 7, 8867, 17707, 18934, 16504, 17776, 17283, 18301, 15922, 12773, 12292, 13401, 12350, 6960, 12827, 9599, 9227, 15316, 18247, 7951, 7845, 12252, 10254, 10291, 6425, 1139, 1372, -2402, 560, 1794, 16, 99, 1061, 2358, 5341, 4894, 9397]
12215I397N242J850q206m549J0830M701J286L5l850o32P11J959j01k343J123p643
12199I810j0961K137J227K416R002M768k423k285j031k533l642M670q04P65r350
12184A766o726q565L287R448M285k971l98P448R54j786J135L993M519l423l983
12169H983k005k019R89l227N52l063K927P185K728j222M625k285m054l528p234
12154f48j601l088K323p17M488K664J617m204Q48k471L136O839k338R55j589J919
12138H133k408p777l229M690J047k526N880k053l595p284l332K710O177J0706
12124G139l645p121K006l00J85K176k801j679R077J667r056k499l961j592k54
12109a0658N210N417j629k440p47r74o047P78O967L6O192K41j783r65j016K055
$$ y = [9397, 14639, 16489, 8283, 3734, 14564, 19265, 20551, 20586, 16736, 16104, 16815, 18774, 18673, 16330, 17453, 9810, -1151, 986, 2213, 4629, 13631, 18399, 15976, 13691, 12660, 10127, 6485, 11155, 10351, 11116, 1766, -4960, -13525, -10238, -790, 3495, 524, 126, 7574, 8528, 6742, 7877, 11870, 16389, 12966, 8983, 6978, 4959, 5948, 2721, 3273, 210, 3137, 10322, 13050, 11828, 16453, 14168, 10114, 6586, -648, -2249, -5337, -3014, -3731, 757, 3421, 5038, 834, 1682, -789, 2347, 9186, 6848, 7803, 6214, 8133, 5725, -2052, -5281, -591, 456, -2070, 3810, 1757, -1838, -9122, -12454, -9744, -3567, 7139, 3494, -3627, -1621, -1921, -1736, 440, -2361, -4040, 5037, 6704, -2352, -4851, -8812, -10404, -10658, -5448, -31, -1660, -4100, -4847, -5821, -11868, -11090, -4123, -4087, 2105, 2346, 563, -402, -1418, 637]
12093F37j262K55N852L394l169O9o658L839O423n100K995j674l536n99k465N97
12077d02M81Q75n431j760J407K945K226J732j855m300j758O936P150K815P231
12062A8292o673j1222k987L870K741j052P67j870L75j431P02J089N26n072m991
12047f936K807J602J856r8r18K995o511J014K605j107P689M903l716K277j906
12032F556n038L84M584n43L265k809J366J153J453j111n585m403p29q4j791l602
12016f934J464J735Q995O740o748k958j759q93n671k60Q755N290J450m263l677
12001A266O193K536K239o31K659m558K95k813m225K120J188O735j03k683k854
11986G364k96O92k733q003K377M914r43n494L294k983n444J576O913J158K505
$$ y = [637, -625, -370, 5482, 8876, 5707, 5776, -882, 2957, 9380, 4280, 7275, 5601, 2065, 1466, -999, -402, 79, 954, -4477, -6237, -4830, -1885, 341, 2073, 218, -4082, -5840, 1096, 8246, 11061, 18292, 11619, 397, -2590, 1280, 4021, 2969, 3736, 1866, 2241, 810, 1512, 2601, 3127, -1945, -6936, -4129, -2527, -671, -769, -1687, 1308, -5203, -4189, -1584, -2691, 4998, 9901, 6185, 8462, 6556, 1518, 1902, 6486, 5943, 9208, 6399, 7765, 8918, 10371, 9260, 3675, -728, -1457, -1541, -3332, -6934, -5470, -3735, 5260, 12000, 5252, 2294, 535, -358, -6029, -6289, 2466, 7756, 9206, 4943, 1266, 7459, 9995, 12234, 11603, 14262, 9704, 9999, 7186, 2961, 5081, 6269, 13004, 12901, 10218, 7364, 7068, 7760, 5027, -2976, -599, 4315, 3372, -2122, 1172, -1811, -7255, -5679, 1234, 2392, 4897]
11971D897l079Q108M949q544n940k840N114j34Q26m352O763K093j626l704l108
11956e77M212P365J375M72q240k078K165L900k883L875p277j063K692m82M336
11941G792J856M077j31j1060l950p87O589m811n798N441O507L819q77o63o899
11926A105m847M488l500n298p63O487L519l16m53o116L379N998J609l790K112
11911C614N966K522j394K91j3650m400M425M974L179k396q993j124J0777J0085
11897A3876q03q03Q864j584o937N737J468m095J533O416m164j487J446k122L016
11882B0361l82k641L634k506L590J0774L494j2323j563j110p342O757K403k985
11868B0161N651M505k239l588j220k545N387p16Q96k9J35r05r617m15M361K025
$$ y = [4897, 1818, 9926, 14875, 6331, 391, -2449, 2665, 2531, 3357, -995, 5768, 7861, 6235, 2531, -577, 3635, 11000, 12375, 12847, 4607, 2529, 4694, 8594, 5711, 9586, 2309, 1246, 3938, 3456, 7792, 9648, 13725, 13594, 2534, -1416, -2203, 4386, -425, -6223, -782, 5725, 9544, 8667, 8004, 1105, -3742, 746, -2754, -8052, -8815, -2328, 1191, 875, 422, -5694, -2315, 3683, 5292, 1502, 3614, 9580, 12102, 10708, 10999, -2651, -7051, -2626, 2348, 5527, 3131, -5862, -6986, 3791, 13876, 13073, 12270, 21134, 19550, 12613, 18350, 19818, 15723, 17256, 23672, 19508, 18021, 19467, 17345, 20361, 19979, 17338, 20972, 18466, 22056, 32830, 36324, 24001, 22438, 21328, 13986, 20743, 23146, 20161, 25812, 30317, 28078, 24490, 23270, 20725, 26112, 25396, 26292, 26263, 26398, 25493, 15876, 15461, 19822, 21847]
11852B1847L610L03L214J0467N016l142n750j891j553L00N524O684r345j247M090
11837C8127k116q69O440K389l735n852r054M306Q567K667J834Q305l21l607K51
11822D7332l817K748K28n642n201j28P55M090p917p917k07J911l009Q98M149P228
11806C5501J838J271m273J298P680q64p693J599J020L318K693L936m175n101J430
11791C9478n04L511J391N133K916m360k986n03J973l5N56j705L504l331o014j92
11775C8832k314Q2l008M352J349j492k605l935j804m261L993K09n754J282j117
11760B3809n857L053K571o59M608L463j434p144p038o157K872M179Q947L553l774
11745B4992R48m377l579o38k952J545n960p717N626O521m258j089P287O44L61
$$ y = [21847, 25457, 25760, 28974, 39441, 44457, 41315, 35565, 33674, 32121, 32421, 37945, 44629, 35284, 34037, 38127, 36011, 35142, 41582, 43971, 40236, 34384, 25330, 29636, 38203, 40870, 42704, 51009, 50688, 47081, 47332, 43515, 46263, 46491, 40849, 35648, 35520, 36275, 40365, 32448, 24531, 24324, 26235, 23226, 24124, 28273, 35501, 37339, 38610, 34337, 35635, 43315, 42451, 34758, 36357, 37377, 40695, 43388, 47324, 43149, 38048, 39478, 38974, 42485, 43876, 49009, 51925, 47565, 44579, 44076, 46049, 46014, 46570, 44865, 48369, 45038, 39024, 38832, 36518, 36600, 33592, 37944, 39293, 37801, 35196, 31261, 29457, 25196, 29189, 29398, 23644, 24926, 23809, 17952, 21005, 23576, 22917, 27525, 30988, 29554, 22410, 15372, 9215, 12087, 16266, 25213, 28766, 24992, 25940, 21563, 17984, 17346, 14394, 15939, 9979, 2262, 7888, 14409, 10151, 9062, 16349, 16993, 17354]
11730A7354N37K116j022K235p110l312L481k12J510k23k275m398l84j664j250
11715E383q72K327N529k502q561r274J610L228N184O890k089q133r918N563K057
11700c578j666o78K499K490k580j67K933M912l734l539P806N079r125l032M260
11685A880k91l441K770o61K429l452k331J799L364J930m802K040K679J187j724
11670C376K465q50k457R02N803k63k372n105l049Q67P55m387N18L023p45o806
11654h325l415K234M912j491M746M333n3k729J017L042N379N056k180m592K51
11639H185m67r31j348q2l087o609l317N747J722J273J947J190J0171P653j0096
11624A1951p759N838M46O80K99j510k231N631r16N704J2191P702M813p163j0400
$$ y = [17354, 17891, 20007, 18985, 21220, 14110, 10798, 14279, 14067, 15577, 15354, 13079, 8681, 8297, 6633, 5383, 4511, 6838, 12367, 9865, 1304, -7970, -6360, -3132, 2052, 8942, 6853, -1280, -11198, -5635, -3578, -5244, -5922, -3423, -933, -3513, -3680, -747, 4165, 431, -3108, 4698, 9777, 652, -2380, 1880, 1589, -1852, 918, 257, 2686, -766, -3097, -1298, 2066, 3996, -806, 1234, 3913, 5100, 3376, 5841, 4991, 2534, 3436, 9239, 8976, 6604, 1499, -1550, -683, 72, -4315, -3797, -774, -1519, -8325, -11740, -9506, -4594, -6085, -1339, 2994, 2941, 212, 1229, 4271, 9650, 14706, 12526, 7934, 8185, 7718, 6787, 5439, 5357, 2270, -4339, -7656, -1909, -187, 1086, 3033, 4223, 14394, 22047, 11951, 4192, 10030, 10476, 11156, 11455, 9945, 7714, 13345, 12429, 18133, 30324, 38026, 42839, 35676, 25276]
11609B5276K405J23j0034j5565q716n32J910O414L001K888o497j352L612m428
11595a495q84N009L854m584M380p689L326O619k370l406k204J03j435j732j94
11580b702k902j358j206J230N427l841m10J285O692O538J814L440o10k28M216
11565A7385k722o020m024l628L154P40P762O554l34R12L022J6090J3632M622K1558
11550G8703K8775M1740N0013N7410M5097K4563j9614n3710m9480m6140l7365k2931
11538I7061j5781j3746r160q483o760j558p33N51J1307p670J367R172L643K784
11524F1994R440J597Q660J0958J9542L9610N0705N3929N3300L7239M271k4476
11512C26769m4243m4793k8362j7397j253R013J5352M3249O1270R0141J39734J87007
$$ y = [25276, 27681, 27804, 17770, 2205, -6511, -7043, -5133, 1281, 4282, 7170, 673, -679, 2933, -1495, -2379, 2630, 6484, 1900, 6280, -1409, 1917, 8536, 6166, 2760, 556, 659, -776, -2508, -2702, -5604, -6962, -8168, -6938, -1511, -5352, -5762, -4477, 2215, 8753, 10567, 14007, 13397, 13169, 17385, 14663, 8643, 4619, 991, 4145, 4885, 12647, 19201, 18867, 19779, 22801, 38891, 52523, 57145, 78703, 107478, 149218, 199231, 256641, 301738, 326301, 306687, 252977, 203497, 157357, 119992, 97061, 81280, 67534, 58374, 49891, 43131, 41573, 40840, 41391, 52698, 45028, 46395, 55567, 59210, 61994, 71434, 73031, 81691, 92649, 112191, 151801, 202506, 256435, 309735, 346974, 351245, 326769, 282526, 237733, 209371, 191974, 190721, 199734, 215086, 258335, 319605, 409746, 549480, 736487]
11500G36487K00356J45583R476j41550k11594j87065j37054r3190p0072m3334
11490B08043k7270k0152j5354j2275r219n40j107O32k086l126P819J0570J2105
11477A48040K0519K4215L5680N7736P1387J15091J70083K04889J89244R0045o4661
11466A062268j90432j95371j52612j03198o8342l1781o774J4243L6368O6252J09165
11455E39786J55219J92280J85703P3681p9570j89257k09326j67964j21686q5464
11445B93402m8380l4397k2954j3594j7308j5717q873j1172r949k569J0080J7261
11433A35830R895J3761J1982J3899K6472M8561O5236R8706J51961J93832K11563
11422I81698J56275M306j54367k26246j94715j37062r7384o1014m1381k3156q069
$$ y = [736487, 936843, 1082426, 1091902, 950352, 738758, 551693, 414639, 321449, 251377, 208043, 180773, 160621, 145267, 132992, 123773, 123233, 122126, 122758, 120672, 117546, 125365, 135935, 148040, 168559, 192774, 228454, 286190, 357577, 472668, 642751, 847640, 1036884, 1126929, 1062268, 871836, 676465, 523853, 420655, 352313, 320532, 313758, 328001, 364369, 430621, 539786, 695005, 887285, 1072988, 1146669, 1067099, 877842, 668516, 500552, 378866, 293402, 245022, 210625, 187671, 174077, 156769, 141052, 132179, 121007, 111058, 108489, 118569, 135830, 145725, 159486, 171468, 185367, 211839, 260400, 325636, 424342, 576303, 770135, 981698, 1137973, 1142279, 987912, 761666, 566951, 429889, 332505, 271491, 230110, 206954, 198885]
11411A98885J0038K6898M2094M9599N0339K5085j2165n4875o1954n9617n1024
11400A63303l5041l0919j7243r504q647p364m231p43M93J762j444M115l124O272
11386E7685L368K922N265M897J8330J8388K9108M0615M8319O1613N6814J2026
11374C59350l7854o4066o4340m6575l5375l1095j8676q318j2243q439K76q630
11362B4015n466K615k565p842l382N729K873p205l317K300J048M360L462l497
11348A3128l929q679k978l438O92L071L455P380r15l483m59O78n183k214l568
11333f442k455K070j429j0027O81Q781N072L075R01K934N595k197o923P05M813
11318E154n731K607J0255J202m512n75j350L020K181n757j1678J875O334m662
$$ y = [198885, 208923, 235821, 277915, 327514, 377853, 402938, 390773, 335898, 273944, 214327, 163303, 128262, 97343, 80100, 70596, 61949, 54585, 50354, 49611, 50104, 51866, 50422, 54537, 51413, 57685, 61053, 63975, 69240, 74137, 92467, 110855, 139963, 180578, 228897, 290510, 347324, 359350, 321496, 257430, 193090, 146515, 111140, 80045, 61369, 53051, 40808, 32369, 32645, 24015, 18549, 21164, 18599, 10757, 7375, 13104, 15977, 8772, 5455, 7755, 8803, 13163, 16625, 13128, 9199, 520, -2458, -5896, -5204, -2133, 1322, 8702, 7787, 4304, 3845, 4523, -660, -2874, -6442, -8897, -6827, -8256, -18283, -17602, -8821, -3749, -674, 227, 3161, 8756, 6559, -364, 341, 5154, -577, 2030, 12285, 13487, 8975, 8400, 7050, 10070, 12251, 6494, -5184, -3309, 3025, -1637]
11304a637k091L675l368l415P147K229l011J517q06p588m789J179K027k333o07
11289a1871R247L544j610k640l201K239O15R982K178n294q068k253Q344P002r
11274H205m460j642j186l070k989L114K266k624Q39N07m841n970J732K597Q31
11259f691K969L34p06J410K776M509k717o275j1223K798P647O59l764J616j814
11244h472P38J701K352O578K916J059r026M314N676l78k552o288k888q65n932
11229a1067q79k660L229j72j308R722M491o600P55K056K431o856j381K471m35
11214f203N343n862o293L593R452K266K15k082m53L703j961l977m3M722R52l274
11198I8m830k183K39J490l148r356L323L388j269R30L488L68N785N195J836j252
$$ y = [-1637, -3728, -53, -3421, -6836, 311, 2540, -471, 1046, 240, -7348, -12137, -10958, -8931, -11264, -11871, -2624, 920, -690, -3330, -6531, -4292, -3677, 6305, 8483, 3189, -4879, -7132, 1212, 8214, 8205, 3745, 2103, 917, -2153, -5142, -2028, 238, -2386, -1547, -1040, -5881, -11851, -10119, -7522, -6691, -3722, -3388, -4094, -2684, 92, 4601, 1884, -4391, -15614, -12816, -5169, -4510, -8274, -6658, -8472, -7734, -6033, -3681, 2897, 5813, 6872, -2154, 2160, 7836, 7458, 4906, -1382, -4270, -5135, -11067, -11946, -14606, -11377, -11549, -12857, -3135, 1356, -5244, -4489, -2433, -2, -6858, -8239, -5768, -6203, -860, -6722, -13015, -9422, 30, 2296, 2511, 429, -24, 3679, 1718, -2259, -2302, 2420, 3372, 98, -4732, -6915, -6676, -5186, -8334, -17690, -14367, -10979, -12248, -11318, -7830, -7462, -1677, 3518, 5354, 4102]
11182D102m834r976l29O440J905P09L279K041k584k26K051m68k074N282j34j0493
11166e309o206Q39P918M105N484j722r547L103j085k214L110k548J271k284k104
11151g189L419r65o71k2J901R91k895J4k535L816L95k042r02N14k787m322L917
11134i363J1027J1115M057l184j100l335m827m402m705r021J338L994J932K309
11120d165m576l430j033N407J886J844j837K576Q023M447l077o435j115l468J323
11105c630M250k929Q20k493j0925l505M606Q412N758n531P93Q783n714q263R911
11090C43M644k060l033J412N648k226m270k145k437n315l02L762L808J418m259
11075e012l606m48k170M145n27k136P466k919M388l160L003N128r753J969P634
$$ y = [4102, -732, -10708, -11037, -4597, -2692, -1983, 1296, 3337, 753, 527, 2578, 2110, 36, 5318, 5184, -5309, -11515, -10676, -2758, 1347, 6831, 5109, -4438, -1335, -2420, -4634, -1524, -4072, -2801, -5085, -7189, -3770, -4735, -5406, -5428, -3527, -2536, -5431, -5417, -7952, -4136, -3741, -5783, -6685, -6171, -8958, -13280, -9363, 1664, 12779, 16836, 13652, 12552, 9217, 4390, -12, -4717, -13738, -12400, -8406, -6474, -4165, -8741, -12171, -13204, -7797, -5911, -4067, -5904, -3328, 4695, 9142, 6065, -370, -1485, -4953, -3630, 620, -2309, -1489, -3982, -14907, -18412, -13806, -5394, 364, -5167, -4374, 4409, -1305, -9568, 343, 4987, 2927, -106, 1306, 6954, 4728, 458, -1687, -4124, -9439, -9741, -5979, -2171, -753, -5012, -8618, -9066, -11236, -7091, -7618, -9754, -2288, -5207, -819, -3979, -976, 4152, -5601, -3632, 4002]
11060D002j033j173k309K209M76p297j807j042J308N512K887O31k347j66O560
11045F411M806q296p842j805k592N892J2693l844p724j866j600L893m189l02l018
11030i383J18M418n167l40n93k263O91O414o34k518M353N228K0L277l778n375
11014e532M43O072O829K902m094o300n913j451J358J452L99M797K274J227M073
10999H536R97o01l052l945l207J039j111k144L705l145q794p91L527Q78P64L059
10983d285O90K71j869J312N062o183L90N929L687o690m617J2113K561k428q131
10968b188J208J164k782O091K105j691M64m575n596k94K35q270k318Q583L536
10953d328k46J463k225L8l91k180m798M634m743J408O120l75K258N143k804n403
$$ y = [4002, 2969, 1796, -513, 1696, 2172, -5125, -6932, -7974, -6666, -1154, 1733, 2364, 17, -149, 6411, 11217, 2921, -4921, -6726, -9318, -3426, 9267, 5423, -2301, -4167, -5767, -1874, -6063, -6365, -9383, -9265, -4847, -10014, -10354, -10947, -13210, -12519, -6105, -6739, -9257, -4904, 324, 344, 3621, -157, -5532, -5089, 983, 7812, 10714, 6620, 320, -5593, -7044, -5686, -4234, -3835, 962, 3236, 4463, 8536, 9533, 8932, 5880, 1935, -1272, -233, -1344, -3488, 217, -2928, -11722, -12513, -8986, -8108, -7344, -4285, -3595, -3324, -5193, -3881, 1181, -5002, -4612, 1317, 5004, -1686, -6303, 5810, 8371, 5943, -2188, -980, 184, -2598, 3493, 5598, 3907, 4371, -204, -5800, -6094, -5859, -14129, -16447, -7864, -4328, -4574, -3111, -5336, -5298, -5689, -7869, -12667, -8033, -12776, -11368, -5248, -5623, -3365, 1778, -1026, -6429]
10937f429O12J458O031k866l777P014k12J873l42l180j203q090n013K123L781
10922h220k4M400K146O468K977P99q001l989L369J389K353r418p081k094L938
10907a0988M603J169J934K528m411n446k941L378l059L282N159l53J234J125l003
10892e789J90L811L017k881k549Q07m226n252K561L546j031j677K996J369J256
10877c852p247k318L520n90k532K030Q823k79p93j416J362N444l83R05l584m231
10861e141l707r09M659L857k303J290j627l843l5L377J880M774P139j724q552
10846h65k772m243n718O440M186l536K825L944p688K678Q09R08j642k702l565
10831a0941L15N881l69l325P78m765N45M750J033K110M088k732r445k161L637
$$ y = [-6429, -5817, -4359, 1672, -1194, -4971, 2043, 1831, 3704, 3362, 182, -1021, -9111, -14124, -12001, -8220, -8244, -3844, -1698, 4770, 7747, 8546, 545, -3444, -75, 1314, 3667, -5751, -12832, -14926, -10988, -6385, -5216, -3282, -754, -5165, -10611, -13552, -10174, -13233, -9951, -4792, -5145, -3911, -2786, -5789, -5599, -1788, 1229, -1652, -4201, -3394, -7620, -12872, -10311, -6765, -7796, -9473, -6477, -5108, -3852, -11099, -13417, -9897, -10487, -13019, -10989, -2166, -2445, -3238, -4654, -3292, 2152, 1769, 2674, -910, -5141, -8848, -9757, -5098, -1241, -3544, -2254, -3881, -7724, -7759, -4382, -2502, 2272, 9411, 7687, -865, -3637, -7880, -13598, -7158, -2972, -6508, -3683, 261, -7427, -4749, -3940, -3032, -4674, -7376, -10941, -10626, -4745, -5114, -8439, -7661, -12426, -11881, -7131, -6098, -3988, 100, -2632, -12077, -14238, -10601]
10816a0601J087j405J0549M295n199m254j923j194K243L578P809R43q878m313
10802g263K448N492O330r87j249j167j786q49J316Q05M094M63l333N77L212q268
10786a65n575q382o40O317j182M786k132M51n705j914Q60j699O235j01M436J901
10770b509j220o739K093M435M408p13J454M829n310l086r63K641L087l046n717
10755f356j10L88R455P371o159o983k484k912M230N958L20O63j165n397n34N247
10739A532O193K265K38J261k685j638N137r047m893q492k123L074N495J519k040
10724d204o534k121L864J988K437P86j514L863O382R28k752q173l002K468Q49
10709d735J356l612l531M776N000K207J513N246J811p029j968K65Q014J0633Q008
$$ y = [-10601, -9514, -10919, -370, 3925, -1274, -5528, -7451, -8645, -6402, -2824, 4985, 5928, -2950, -7263, -4815, 677, 7007, 6020, 4771, 3604, 1818, 969, 2285, 3090, 7184, 7647, 4314, 4891, 8103, -165, -5740, -14122, -14762, -8445, -9627, -4841, -6973, -6522, -12227, -14141, -13281, -14980, -8745, -8846, -4410, -2509, -3729, -10468, -8375, -3940, 468, -245, 1209, 6038, 728, -2358, -3321, -680, 2407, -639, -6356, -6466, -6078, 3377, 10748, 4589, -2394, -4878, -7790, -3560, 2398, 2718, 3381, 2216, -3181, -3715, 1532, 7725, 9990, 10228, 11489, 8804, 7166, 12303, 3256, -1637, -10129, -12252, -9178, -3683, -2164, -4204, -10738, -12859, -8995, -7007, -4570, -3784, -5298, -1435, 4947, 5875, 3123, -5050, -8052, -5584, -4735, -3379, -6991, -10522, -5746, -746, 1461, 2974, 8220, 10031, 3002, 1034, 1299, 9313, 19946, 27954]
10694B7954n645j1316j2275l390k480o966O877K72l400j220k655m269P483N476
10680e554l806k330K384O294K529k246K616J806j589k91p932n834q5K144j334
10665a3228O525J893l600m436L175l243k953k196l391N806R042m15K594j043l993
10650i463K935N25J474N319n840n008L378N753J565N638p298q383N410P094k906
10635A93k952l113j932Q35r06L230N521J319k209l115L929K426l914m898Q026
10620B440J212K867P70k414k43q537q636L324J1830P72L322L014j4082j3488M105
10605a3744P16j875L774J4045O259j301p495l774R7k441m931l929M557J832O240
10590a970Q153j200l953J077Q789M900q955m602p008k730N125M449j305l9o484
$$ y = [27954, 22309, 10993, -1282, -4672, -7152, -14118, -7241, -6969, -10369, -11589, -14244, -18513, -11030, -5554, -9360, -11690, -9306, -3012, -483, -2729, -113, 1693, 104, -187, -8119, -13953, -14038, -11894, -13228, -6703, -4810, -8410, -12846, -9671, -12914, -15867, -18063, -21454, -15648, -6606, -7021, -4427, -5470, -9463, -6528, -6003, -4529, 790, -5050, -10058, -6680, -927, 638, 6276, -1022, -9405, -3995, 3099, 193, -2759, -5872, -7804, -6969, -7875, -4645, 876, 2195, -14, -3129, 800, 3226, -688, -5586, 2440, 3652, 6519, 7289, 4875, 4632, -3905, -12541, -9217, 2613, 3385, 6707, 9721, -4361, -17849, -13744, -13028, -14903, -11129, 2916, 9175, 7874, 379, -3395, -3298, -5739, -10670, -14599, -10042, -8210, -1970, 6183, 4983, 1030, 2107, 10896, 15796, 6841, 2239, -4769, -7499, -2374, 2075, 770, 731, -5753]
10575e753l291L393K494K814J973K11j852L163Q9k351m665K358J06J940M019k118
10559B530j193m510j081J659R88J93l713j584j952m95k571P127l846k040K922
10544g566l02m062M579L352o59k682n686L714P173O575K050O58l701k806P79n123
10528c707p722l013Q091j704L42L276j63K163M30j822n367l2J610R74q74M086
10512c432J1352L317o682p751m355k525q26K878J272N30O220K327n47k107J554
10497A225n240n172l48L107O823J0507m010l484J176j160m44m910j041J010m242
10482f203k611j385P64n605q43J777J854J2816J642n369l965q99J262K050K895
10467a820m717o460N001J0140j991p281M381O343j90j0104p462k170R219j259
$$ y = [-5753, -9044, -5651, -3157, -343, 1630, 1841, -11, 3152, 3241, 890, -3775, -1417, -1311, 629, 4648, 2530, 1337, -3173, -4254, -2595, -1607, -1414, -5127, -6711, -8663, -9158, -11729, -4602, -8448, -10488, -7566, -7868, -11930, -7351, -3999, -4658, -7340, -13026, -9312, -2139, 4436, 6486, 7144, 3443, 637, 1416, -3707, -11429, -14442, -6351, -8055, -7713, -4437, -4600, -2437, -2007, -3829, -9196, -9228, -7618, -6644, -7518, -3432, 7920, 11237, 4555, -3196, -7551, -10076, -10902, -8024, -6752, -6222, -2, 2325, 1778, -329, 1225, -4015, -9187, -9535, -6428, 395, 10902, 6892, 3408, 4584, 3424, 2980, -1930, -2971, -1961, -6203, -8814, -10199, -9435, -15040, -15883, -14106, -12252, 564, 2206, -3163, -7128, -8027, -6765, -4715, -1820, -6537, -12997, -7996, 2144, 153, -7128, -2747, 3596, 3406, -6698, -14160, -16330, -7111, -8370]
10453h370n330j355L180L562J133L409k83j333m590l992L884l007K692M635n32
10438f297L378K250m74K260m86n632p597N608L511r301k938L372K243O341J139
10423b623J047J409j636M439O660J729q783j349K455j794n418r64k851k87J828
10408f138j381O72P827O66j488Q35k485l949k929L389m5j849K31J720k091O981
10392c4j919N07j797L419k656l990m432m45Q38J895Q90P54n211m073j103O978
10376a0379R196N455L277l077j863j567J945N360k124k056N0n297j19k888k726
10361f813L65N941q028l063J26K249L06m987n473K7N733P114J251J447J932l545
10345e418R03J105k955l018j551K538m310j408j630M556k404M720L719k893K75
$$ y = [-8370, -13700, -15055, -11875, -8313, -7180, -3771, -4054, -5387, -9977, -13969, -10085, -13092, -10400, -5765, -6297, -2919, -669, -1143, 1117, 631, -5001, -12598, -6990, -3479, -12780, -15718, -12346, -10103, -3762, -2623, -1576, -167, -1803, 2636, 9296, 11025, 2242, 893, 3348, 1554, -3864, -4828, -7679, -7966, -6138, -7519, -6847, 980, 1646, 158, 993, -1492, -5441, -8370, -4981, -5026, -6875, -6644, -4924, -7015, -34, -1953, -1446, -3243, 176, -2480, -6470, -10902, -11347, -10509, -8614, -7724, -6970, -12181, -16254, -17357, -10379, -1183, 4272, 7549, 4472, 2609, 1042, 2987, 8347, 6223, 4167, 4217, -1080, -1199, -4087, -6813, -6448, -507, -8535, -11598, -11472, -9223, -8917, -13904, -19377, -19350, -13617, -6503, -5252, -3805, -1873, -5418, -4515, -3410, -6365, -9383, -10934, -8396, -12706, -14114, -15744, -11188, -13592, -8872, -5153, -8046, -7771]
10330g771l610n549N585N812j959j268N475k783m422J413J700K263P472l25q886
10315f853p273O59N238J411J154q52l004J53O407M926k958n151l367k773L956
10300h327Q514L70J191j180j441j763o155K152L870K467n03k327l980N772J646
10285C06O60O186M552m482q636k001J384N455j0n646m458j992J922K369O43N854
10269B106N438j876K22N24J33M4R88n678p659L736Q78L32O229M672r469o870n79
10252f829l486K537j489L346R538j441n532j2354o302j524K072n29m47P689m396
10237a9147J957O598P792l09p04J526K755j250J258N747K314o825k544J599o927
10222f160p379k859J84j717J13M839N788j0970k794l08M982J1239q57q274K504
$$ y = [-7771, -11381, -16930, -11345, -5533, -7492, -8760, -3285, -6068, -10490, -9077, -7377, -5114, 2358, 2033, -6853, -14126, -13467, -8229, -6818, -5664, -6516, -9520, -9367, -2960, 1966, -992, -6143, -9510, -12283, -8327, 187, 557, 1748, 568, -873, -2636, -8791, -6639, -2769, -302, -805, -3132, -7112, -1340, 306, 966, 7152, 11704, 7222, -1414, -3415, -2031, 3424, 3414, -2232, -6690, -8682, -6760, -4391, -3748, 2106, 7544, 5668, 5890, 6414, 6547, 6591, 7579, 1901, -5758, -2022, -1144, -812, 5417, 10089, 620, -6250, -6829, -10315, -7778, -9267, -5921, 3617, 2176, -3356, -15710, -22012, -23536, -21464, -21993, -22440, -14751, -19147, -17190, -10592, -2800, -3109, -3813, -2287, 468, -782, 476, 6223, 8537, 1712, -832, 767, -6160, -13539, -16398, -16214, -17931, -17818, -12979, -7191, -18161, -20955, -21263, -16281, -5042, -5899, -14173, -11669]
10207a1669P256p00m620k768L910O29o333L74K800m984J629N948O210J5l763M028
10191b038k39n368j101N427O041J32j085M342J261l71P47J997l981o279n469m277
10175a0261R76K080K653Q870O6j969k470J467M768m697m956j873Q6m99n295o611
10159a7665O285P661k45L34J355M097K672m024n718K152j642M035m638j17j853
10144g311L05J393K527k754o021N461K341O748N239l517m315l327K430L409k725
10129a17N450M623n31N0q035p954o557N417P136r11m822m784J782Q302L570Q14
10113C433m819L041o056l627R69P035R01m092k391j294j108J895N647K937j0428
10098g957l075k733j225J45O504O458M997j0288r48k354J038Q239M093q08m044
$$ y = [-11669, -4413, -5113, -9733, -12501, -8591, -7962, -14295, -13921, -11121, -16105, -14476, -8528, -2318, -2303, -6066, -2038, -2277, -7645, -8746, -3319, 2722, 2854, 1769, 6111, 7372, 7001, 7748, 9745, 5764, -515, -5984, -10261, -9285, -7205, -4552, 4318, 4384, 2415, -55, 1412, 6180, 1483, -3473, -5346, -5260, -5759, -11054, -17665, -11380, -3719, -3964, -3630, -2275, 1822, 4494, 470, -5248, -3096, -4738, -703, -5341, -5458, -7311, -7006, -5613, -3086, -5840, -11861, -6400, -4059, 2689, 7928, 4411, 96, -3231, -801, 2608, -117, 5333, 9956, 9425, 9475, 1440, -6514, -13071, -7654, -518, -1429, -6251, -11035, -9253, -951, 2619, 3433, -1386, 1655, -4401, -8028, -7059, -24, 877, -3215, -5606, -6900, -8008, -6113, -466, 2471, -7957, -11032, -13765, -14990, -14845, -8341, -1883, 3114, -7174, -8122, -10476, -9438, -1199, 2894, 2086, -1958]
10083a958j978O797l545r754M471J355M49L676K401p184P243j08p361j998J591
10068e903R09O558P814q938j1039N297O146P26r929o695l195L534K264O50J463
10053a0338j467m044p63M822J753O69m824J776J754k092J825J0273O249Nn848
10038b50p974r54k726p77K780J328n86J019l16j349k693K688K563l880j263q69
10022a3259R4O025M253N719%K828j02l697l801m784l325k577K261O242J1754k924
10006D707p045p05L529m78K263K303j033q578r224K69l10L102P341O564p212n739
9990a0246J2511O61n381k288J122k190n972N458Q256q7K394n27k546n932l273
9975h040n110L496N262j19o903N088L626j276j132m974l38J254J959P60J9M726
$$ y = [-1958, -3936, 2861, -684, -10438, -5967, -4612, -4163, -487, 1914, -5270, 1973, 1865, -5496, -7494, -5903, -4994, 1564, 9378, 440, -10599, -5302, 844, 1570, -8359, -15054, -18249, -14715, -12451, -11801, -10338, -11805, -15849, -16612, -11790, -10037, -9368, -14192, -12416, -10662, -12754, -10929, -656, 5593, 5598, -250, -8224, -9178, -11904, -12681, -9901, -8573, -9159, -8140, -8456, -9805, -12498, -9810, -7247, -11127, -12390, -13259, -13165, -7140, -2887, 2832, 2832, 5660, 5558, 1861, -1940, -6724, -10049, -12626, -10365, -4123, 7631, 4707, -2338, -3043, 486, 8, 2271, 4574, 3541, -5037, -14261, -13992, -14302, -11200, -3859, 2705, -4507, -10246, 2265, 2926, -2455, -4743, -3621, -5811, -11783, -6325, 1931, 1844, 4238, 3711, 1165, -4767, -8040, -13150, -9654, -4392, -4511, -11414, -6326, -2700, -3976, -5108, -10082, -10420, -9166, -7207, -6447, -6428, -1702]
9959a702N180L001l510O40j754J032k65m713p208l726M150M181j184O407l062
9944b533l867O691l41q56m027M518M181K820m379P40M358m994j013m635n066M965
9928c438O74j980j017J22N365J002n04m006l134K329L121L392J654L101m911k211
9912d41n008l108K735L783P110O039m700n58R88n853r056Q755K203j015O97J973
9896D544O362l050n850J591K461k948j54j422r20O501J104J137J05n991l42l85
9880B743L980K371j382k108l723J481K308K818M289L848P03p003q548N76k12J296
9864C437N136n755k452P333o37r091j535O649K355n135k712K933k772K478o01
9849c69O3O387k405r43J745n143k691J048K156P81N89j169J127K878K001N256
$$ y = [-1702, 3478, 6479, 2969, 3609, 1855, 2887, 2622, -2091, -9299, -13025, -8875, -4694, -5878, 529, -2533, -6400, 291, -50, -906, -4933, -415, 3766, 6586, 2207, 2947, 7305, 2311, 1298, -3337, -8403, -3438, -2764, -4744, -5761, -5639, -274, 728, 224, -3782, -6916, -4587, -1466, 1926, 3580, 6681, 1770, -441, -5449, -8557, -5822, -2039, 5071, 11110, 6410, 5852, 6840, 987, -8069, 686, 2889, 1874, 2571, 4544, 10906, 7856, 2006, 3597, 6058, 3110, 2956, 1534, 614, 7115, 8219, 9356, 9461, 3470, 3128, 2743, 6723, 9094, 7712, 5604, 1881, 3362, 5670, 8488, 12777, 16625, 17328, 10325, 1777, 2353, 2141, 3437, 8573, 2818, 366, 7699, 7062, -2029, -3564, 3085, 5440, 305, -2407, 526, -2246, 232, -369, -306, 6081, 3676, 2733, 4478, -665, -3356, -2308, -152, 629, 1218, 49, 1176, 4054, 6055, 11311]
9833A1311O31n434q902k442N034j002L299k256q552n60O457J386J601k5r97j376
9817a827N83q8J976L343l197j2124n149J1598M818k375l959M501P898M352k216
9802H134k297k830O75j870k342k280n02M18K774J663o42J113j082q082j75J858
9786e467J044k747J530k439l015R469L010m324l865Q68M183O743r000l892N180
9771b722j623j09J356l607n237n138Q195R761K590j072q28k179r95J45j388J146
9755a705K99L661l642p80O035J968l838J434q1K070j148r555p05J2635M200n892
9739D956l382m056m023K509k818m678J301L132K480M714l255M67l304j958k159
9724a0074K059O924J570K823M666l099k919n747n266L817n596p012l084L115N419
$$ y = [11311, 11942, 6508, -2394, -4836, 198, -804, 2495, 239, -8313, -8873, -2416, -1030, 571, 546, -451, -1827, -1244, -1332, 644, 3987, 790, -11334, -16483, -4885, -67, -2442, -6401, -1900, 5998, 10350, 8134, 5837, 3007, 3682, 1812, -530, -2810, -3312, -2894, -120, 1543, 901, 2014, 932, -7150, -7325, -5467, -4423, -7170, -5640, -8079, -11094, -1625, 1385, -2939, -6804, -5936, -1753, 4990, -4010, -7902, -2722, -4345, -4454, -3098, -6705, -11942, -17080, -8885, 876, 3466, 2394, 1566, -613, -1608, -1463, -2851, -1705, -1406, 2255, -1387, -2167, 3868, 5836, 1998, 3432, 3351, 5421, 4273, -5282, -5987, 6648, 10848, 4956, 1574, -2482, -6505, -3996, -6814, -11492, -10191, -7059, -4579, 135, -3120, -2653, -5957, -7915, -10074, -8015, -1091, 479, 3302, 7968, 4869, 1950, -3797, -9063, -5246, -10842, -17854, -20938, -17823, -12404]
9709a2404N009j837o537L961P297l455q364m67O640N635O339M469K122M757J1904
9694B5069o23r637j523m331q595k618k92K363k626L70K931l380k374k262K59m61
9678g730L8l368r63O105M186m286l966J197r169J346N350N264r26m181M73N086
9662e544K532k946K653k45j1711n838Q561J524N506Q191n771o86j588j0784K744
9647a3402J0855K137l199K187P5k566l471k244J99N323M081L078j42L47k907j064
9631g13K790L995l571p974M82L842k923n250K692L080N781L486K668o815L223
9616D793M040m425q590m09L214l67k393J201n52L415J391k696J938L359l092j435
9600f08l302L181N782L949j669n364j315q72o777j765L678p4J50j292M018O247
$$ y = [-12404, -7395, -9232, -15769, -11808, -4511, -7966, -16330, -16797, -10157, -4522, 1817, 6286, 8408, 13165, 25069, 24446, 14809, 13286, 8955, 360, -2258, -2550, -187, -2813, -2443, 488, -2892, -5266, -7528, -7269, -7730, -7692, -11060, -12023, -5918, -1732, -6018, -9984, -8787, -17956, -16610, -11260, -5996, -6922, -11103, -10630, -5544, -3012, -5958, -3305, -3550, -15261, -21099, -12538, -11014, -5508, 2683, -3088, -3774, -5362, -16146, -13402, -2547, -410, -3609, -1422, -1347, -3913, -7384, -9628, -9429, -4106, -25, 3053, 2911, 3258, 351, -713, 2077, 6072, 2501, -5473, -4991, -1149, -4072, -9322, -6630, -3550, 2231, 5717, 8385, 1570, 4793, 8833, 4408, -4182, -4591, -1377, -1744, -4137, -2936, -3488, -73, 1318, -1378, 560, 3919, 827, -608, -3910, -729, 5053, 9002, 7333, 1969, 654, -218, -6995, -8760, -5082, -5156, -5006, -6298, -2280, 3967]
9584C967j948r082J177J1259j02p633K888k069j937j198L370k029k240r63J93
9569f347l783J712J161J237L872J049j508K170Q045P684l93l406L09j590n36l339
9553F337j561K051K042L645k46k604m172p159M2J088m572m046l274N853K102l674
9537h148O255N201R37o033q841J666P659N64p029O991O643j281m070m074l697
9522g257k0M586l09P119L065Q129P489J121n550q780K022j409j0836p032l799
9507a1461m48O690N782l009k478l95p373M760N706L426p007n372k073J537J313
9492a0402M011J863J943l151L455J0505M093j18M90k48m106J273p790p036j945
9477g163O982L460l791L741o849J50J00J226k802k178J0858j52l714l557J294
$$ y = [3967, 2019, -7063, -5886, 5373, 5271, -2362, 526, -1543, -3480, -4678, -1308, -3337, -5577, -6540, -6347, -10130, -8418, -7257, -6020, -2148, -1099, -2607, -437, 7608, 15292, 14899, 11493, 11802, 10212, 9676, 6337, 4776, 6827, 8869, 12514, 12268, 9664, 5492, -1667, -1625, -537, -5109, -9155, -12429, -6576, -4474, -8148, -1893, 3308, 4245, -1788, -10629, -8963, -1304, -740, -7769, -778, 5865, 4584, 514, -3560, -7257, -7277, -2691, -3000, 4119, 7184, 15313, 22802, 23923, 18373, 9593, 11615, 10206, -630, -7662, -11461, -11909, -5219, 563, -2446, -4924, -5319, -12692, -7932, -2226, 1200, -5807, -11179, -13252, -11715, -10402, -6391, -4528, -2585, -5736, -2281, 8224, 12317, 12199, 12689, 12441, 8335, 9608, 1818, -5218, -7163, -181, 3279, -512, 3229, -3620, -3470, -3370, -2144, -4946, -7124, 3734, 3582, -132, -3689, -2395]
9462b395m129M198K570l248O85q18J609N210l963k618j388j709J936R593K361
9447G894l350p743p163L326R564k796m18n391m698K929M689K203m126k983J31
9432g932J964K870j241j555M286O700J787j536m497k145M911J30p709L492m580
9417e055m691P986Q305m648j326K176m63k393n979L033P686K880l02R0n019o333
9401d053M503Q399o60m221q318o3j624J411R284P179L143k708L61K397j841j943
9385A1246l138P53k17k326j293L218r33j894N413j266l313o608j195j34M937Q349
9369A1599l749p153m102J88K594J974M666J742l723j55K460k039l935M188k367
9354B188q705m693K653l25p9k837k862M706M506m165Q28J934K122M826N665j253
$$ y = [-2395, -6524, -2326, 244, -3004, -2319, -3137, -1528, 3682, -281, -2899, -4287, -5996, -4060, 5533, 7894, 4544, -3199, -10362, -7036, 2528, -268, -686, -6077, -10775, -7846, -3157, -954, -5080, -8063, -7932, -5968, -3098, -4339, -5894, -1608, 5092, 6879, 5343, 846, -1299, 3612, 3742, -3967, -475, -5055, -9746, -1760, 6545, 1897, 571, 2747, 2284, -109, -6088, -3055, 4631, 7511, 7209, 7299, 2280, -4053, 450, 8849, 8189, 3968, -4350, -4413, -6037, -4626, 4658, 11837, 14980, 12272, 12633, 15030, 13189, 11246, 8108, 8861, 8644, 6318, 5025, 8243, 7310, 5416, 10829, 9563, 6250, -358, -1553, -1687, 3250, 11599, 7850, 697, -3405, -3217, -623, 1351, 6017, 7759, 4036, 3881, 6341, 4302, 367, 4555, 2188, -6517, -11210, -8557, -8882, -8961, -11798, -14660, -9954, -5448, -9613, -8785, -6851, -4729, 97, 5762, 4509]
9338D509o332l801j706L900K501m76j056M24K200J686k684K656N992j855l162
9323B796q361m242J604O485K658O968l095j641k111L201k177M164Q207r859p170
9308b573o035l577j294m249l079q7m541j089P119J0089N664R16O135K293l707
9293A985j099J269k770L413J767J367L445O24q97r26l348k483M183O99k408m051
9277G70m116K782j121L148j256n06m142K513J718k244M046P733j1051m847P756
9262A183j346o620J657R073K616J737m48L989L418k499k948q33m265r10M104l060
9246D848n739N481Q311M417N570j706n438l087m066J615j313n734m263N13K30
9231c61R06j700L825P579K719l261p991l111K751K716M45n183l441k486N602J696
$$ y = [4509, -1823, -5624, -7330, -3430, -929, -1405, -2461, -2037, 163, 1849, -835, 1821, 7813, 5958, 2796, -5565, -9807, -8203, -1718, 940, 7908, 4813, 3172, 1061, 4262, 2085, 6249, 14456, 4597, -2573, -8608, -12185, -13479, -17728, -20807, -20894, -25435, -26524, -19405, -9316, -3652, -2736, 3399, 5692, 1985, 886, 2155, -615, 2798, 4565, 5932, 9377, 10001, 9104, 8178, 4830, 2347, 6530, 7229, 4821, 770, -3346, -564, -1685, 1463, 207, -299, -4441, -1928, -210, -2454, 1592, 9325, -1726, -6573, 1183, -163, -6783, -5126, 3947, 6563, 8300, 7852, 11841, 15259, 12760, 9812, 8979, 4714, 3804, 7908, 4848, -891, 4590, 12901, 17318, 22888, 21182, 15744, 12657, 8591, 10206, 8893, 3159, -1104, -591, -361, 545, -1155, 2670, 10249, 12968, 9707, 1716, -1395, 1356, 4072, 4517, -666, -4107, -6593, -991, 705]
9215G05k827J162R401J4442M565j051k500j910m169J660m351j1666p683K557M678
9200C013K337m488n825K62k869m094P428N138k38O70K396L01m823J591j63j822
9184a186j10j971k254q09L390r43n61J00M168j787j330P250r13n735N795K073
9168E177k194l481N761N15Q66J461J265j029l349p516l995K331o46N570l340m06
9152c010L9K414k17m10l029LN025K825L167K789l445J40J052l373j490j0610n898
9135a4028Q130P034l921p856J364m377K286M497L255l48L889k891K366n568j076
9120g244R76l87R72K936j816K597J0391L113k981k969K146J130j217L265l859
9105G053n450P284N420K980M000r910o887j511m230p21L90o572n84L91J632L426
$$ y = [705, -2122, -960, 8441, 22883, 27448, 26397, 23897, 21987, 17818, 19478, 15127, 3461, -4222, -1665, 3013, 5350, 862, -4963, -4701, -7570, -11664, -4236, 902, 664, 1334, 3730, 4031, -792, 799, 636, -1186, -1296, -3267, -5521, -6330, -2940, -3883, -4444, -4344, -176, -1963, -3293, 3957, 3044, -2691, 3104, 5177, 2983, -498, 5263, 5778, 6644, 8105, 9370, 8341, 4992, -2524, -6519, -4188, -4834, 736, -2604, -3010, -2971, -557, -774, -1184, -4213, -4210, 815, 3640, 6807, 9596, 6151, 6291, 7343, 3970, 2480, -8130, -14028, -5898, 1136, -2785, -10641, -9277, -13654, -11368, -6871, -3616, -3964, -75, -2966, -600, -6168, -7244, -6268, -6655, -5683, -2747, -4563, -1966, 8425, 11538, 8557, 5588, 7734, 8864, 7647, 10912, 7053, 1603, 8887, 14307, 17287, 21287, 11377, 4490, 2979, -1251, -1972, -1582, -8154, -8738, -8347, -6715, -3289]
9089c289l275M327j863q703k814J214M609K466n687K897P508J695M084l813j903
9074b547k72P722k265K624j988j175m925m588n779M702M985n02K141M569M057
9059F759p37k07R202N386m178q962J896l42o279j373N972J433M06j089k896q036
9043c045M342K171o886l309Q424N740m215O084j620K1O819J473k709n233M230
9028A2287N232l81q982n807K373k392p118n13R708j554k172J328n7l296j348k843
9012e535l340L903R051P601r22M589L34l301l607k904k324l158M002n30n72k282
8996A005m02K044l348O548N034j090l625j545J540k131o871j661J103L358M416
8981D375J971N19o72m362j605K435M160L09r144o348L380N573N355N447n678q81
$$ y = [-3289, -6564, -2237, -4100, -12803, -15617, -14403, -9794, -7328, -13015, -10118, -2610, -915, 3169, -644, -2547, -2819, 4903, 2638, 5262, 3274, 2099, -2826, -7414, -13193, -8491, -3506, -4008, -1867, 2702, 6759, 6022, 5815, 15017, 20403, 16225, 7263, 9159, 8817, 2538, 1165, 7137, 8570, 8976, 7887, 4991, -3045, 1297, 3468, -3418, -6727, 1697, 7437, 3222, 9306, 7686, 7707, 14526, 15999, 13290, 8057, 12287, 17519, 17138, 8156, 2349, 4722, 2330, -4788, -5301, 4407, 2853, 681, 2009, 1952, -1344, -2692, -5535, -8875, -4972, 4079, 11680, 10758, 15347, 15681, 12380, 8773, 5869, 3545, 387, 4389, 3859, 3287, 1005, 603, 2647, -701, 5847, 10881, 9791, 6166, 4621, 6161, 4030, -2841, -4502, -3399, -41, 4375, 6346, 6865, 6193, 1831, 226, 2661, 6821, 7130, -2014, -8362, -4982, 591, 5946, 11393, 5715, 4834]
8965D834r69k84o87N154k083o633k622O343K647L329l132n943j488N430Q179m279
8949G796n313Q446l89r03p826J782K453O051q79n595p96N370K844j421l146K217
8933A0691Q92L041L059p929l669j524J064K77K05M089k896R64K896M89m262P315
8917A4702M559k22J232k724j865L001K550n263J708m456k685R030L246m624n943
8902A2246n113M729n056m525R004J734k445l989N749N870L318P1N036M652N39
8887C1820k761j472K855J640j604j442n047j460J1564L297j316l569m817P697
8873C5385L675P466J3424P358j312P031J0716J0269J2296J9133K1960J8768K6379
8860A92548L5169N3950R5891J38037J94069K81380L98499M51613L59138J17317
$$ y = [4834, 3865, 3581, 2894, 8048, 5965, -668, -3290, 3053, 5700, 9029, 5897, -46, -1534, 3896, 12075, 7796, 2483, 10929, 10540, 9637, 1811, 3593, 6046, 12097, 11218, 5623, 4827, 10197, 13041, 11620, 8474, 10691, 11583, 14624, 17683, 9754, 6085, 4561, 5625, 5902, 6107, 10196, 7300, 8264, 11160, 11649, 7387, 14702, 19261, 19039, 20271, 17547, 15682, 18683, 21233, 15970, 17678, 13222, 10537, 19567, 22813, 18189, 12246, 7133, 11862, 6806, 2281, 11285, 13019, 10574, 6585, 12334, 18204, 21522, 21593, 26629, 31281, 31820, 29059, 27587, 30442, 32082, 30478, 29036, 23989, 22529, 34093, 37390, 36074, 32505, 27688, 35385, 39060, 46526, 59950, 67308, 65996, 73027, 83743, 94012, 106308, 125441, 147401, 166169, 192548, 227717, 281667, 377558, 515595, 709664, 991044, 1389543, 1841156, 2200294, 2317611]
8850B317611j94207l96876m21307l45603k44190j67405j16772q9947o0105m0645
8840B40554l1380k2032j2973j2929k455j3711l566r254j5724n442j019m191J991
8827A07869P993O610M715J90J1983J5238J5781J7361J8494K9043K7370L5354N3735
8814C51736O9292R1633J27859J93865K98105M80039P25777R61305R49396M84249
8804D733256k31064p77444r21470p74848n60424l89266k60442j73694j26717q4266
8794D33621o7820n3573l5986k8403j6524k0737j9212j7746j7471k1405j1673p142
8782A15929o153n76N97j115J217j186N868L036Q807M995P544J7413K2461K4438
8768B03275L3819L3697M4497Q2538J23550J88881K77312L63804M10510L11067
$$ y = [2317611, 2123404, 1726528, 1305221, 959618, 715428, 548023, 431251, 341304, 281199, 240554, 209174, 187142, 174169, 161240, 158785, 145074, 141508, 132254, 116530, 111088, 110069, 105878, 107869, 115862, 122472, 127187, 127377, 139360, 154598, 170379, 187740, 206234, 235277, 262647, 298001, 351736, 421028, 512661, 640520, 834385, 1132490, 1612529, 2338306, 3299611, 4249007, 4733256, 4502192, 3724748, 2803278, 2028430, 1468006, 1078740, 818298, 644604, 517887, 433621, 365801, 312228, 276242, 247839, 231315, 210578, 191366, 173620, 156149, 134744, 123071, 115929, 109776, 109200, 109797, 108682, 109899, 108713, 114581, 117617, 126424, 131419, 138963, 156376, 178837, 203275, 237094, 270791, 315288, 397826, 521376, 710257, 987569, 1351373, 1761883, 2072950]
8758B072950P0886k05700l77229l89014l08340k18956j61072j15626q2240n1561
8748B34098l2182l4903k8753j9701o200j1125n905m057j1547j0377j590k355o245
8735E9158j609r984j740n264o345n15J089M429j53j237k870k69O93l584l066j507
8719B7226J066j423j900Q191K697J152k652m384J475Q679M865m037k898j781o998
8704B9278q213K180O012R85m340o158r231p30N128N382P168m515o276P44Q862
8689B6276j224l516j505M44M48P28j02j0M435j428N424m478j457K778Q26K049
8673B9688O204m410j0989l821l087N893M834R59r67o812n964m27M655J281R88
8658A8025J665K288O289M73j335J734m556N51M057N121N887J419m227m050k066
$$ y = [2072950, 2143836, 1938136, 1560907, 1171893, 863553, 644597, 483525, 367899, 285659, 234098, 201916, 167013, 138260, 118559, 112359, 101234, 95329, 91272, 79725, 69348, 67758, 65403, 59158, 57549, 47565, 45825, 40561, 34216, 33701, 34790, 39219, 39066, 37829, 34959, 34690, 35383, 31799, 28733, 27226, 28292, 26869, 24969, 33160, 35857, 37009, 34357, 29973, 31448, 40127, 44992, 40955, 38057, 36276, 29278, 21065, 23245, 29257, 30242, 25902, 19744, 10513, 9783, 14911, 20293, 27461, 22946, 16670, 17414, 26276, 25052, 21536, 20031, 20475, 20923, 21651, 21549, 21539, 25974, 24546, 29970, 25492, 24035, 26813, 27639, 29688, 35892, 31482, 20493, 16672, 13585, 19478, 24312, 25271, 24304, 17492, 11528, 11101, 15756, 17037, 18025, 19690, 21978, 28267, 28740, 27405, 29139, 24583, 25134, 29191, 34312, 40199, 41618, 37391, 33341, 31275]
8643C1275J519P788k168j0095L516P026M30K211o289n289N033P323j179j501N203
8628D4803P307k657o43J995K816M564O982l78q003P08J331N634M123P55O101J4197
8612H9635J2962J0639J3698R932J2476J2610J2798K5017K1232L1942L7108J7002
8600C07051j4527l7218m1809l8354l1286k2849j2645k0585p231q905j0485o939
8588E4218L467o378j0790o436N366M15O28k446q864j462N006j088Q63J957j488
8573C2968j732j795k239N606l296m041l081J884O313j234r38o734l223l917O27
8558A5168O578k202m051K865Q698J217j258j659l627l123k869j296K900J757N71
8543A9669J482J974l353j857N817k131q438k274K495K363o527N175K605k531j56
$$ y = [31275, 32794, 40582, 38414, 28319, 31835, 38861, 39291, 41502, 35213, 29924, 34957, 42280, 41101, 39600, 44803, 52110, 49453, 48810, 50805, 53621, 58185, 65167, 64789, 56786, 57494, 58825, 64459, 68582, 69337, 75438, 89635, 102597, 113236, 126934, 136866, 149342, 161952, 174750, 199767, 220999, 252941, 290049, 307051, 292524, 255306, 213497, 175143, 143857, 121008, 108363, 87778, 80547, 71642, 61157, 54218, 57685, 51307, 40517, 34081, 39447, 39862, 40490, 38044, 29180, 27718, 32724, 31636, 32499, 34456, 32968, 31236, 29441, 27202, 32808, 29512, 25471, 22390, 24274, 30587, 29353, 28415, 21681, 18458, 14541, 15168, 21746, 19544, 15493, 18358, 27056, 28273, 27015, 25356, 21729, 18606, 15737, 14441, 17341, 19098, 19669, 21151, 23125, 19772, 17915, 23732, 21601, 13163, 10889, 13384, 15747, 9220, 14395, 17000, 14469, 14313]
8528A4313j01J898K588P975N5J015l493n267L93l615j2225o44P601L120o01l814
8512I198m267l555m522p81Q89R470Q840J162m870k340K916Q269k27K032n920j0212
8496F082O148J8104j1905o881L682O097L069m442r859p028N550L926j426P91l398
8481H510N009m935l264Q98J972Q07J584p538l109J616j2j03M47j521J893M993
8465G247K577J096J710P510Q57l284l468k878o389Q101J1189L758n412m198M888
8450B3304J2051j365m298M884M149m548k873K887Q303M925P650K5423K0114J5816
8436A16422K9529L9045J7553j7930m2266k8987k4034k1294n688j4675j6364n639
8424B5672j195P4j442K104j666k365o36N947K477q972j630M673P799L313j315
$$ y = [14313, 14212, 16110, 18698, 26673, 26728, 27743, 24250, 18983, 19376, 15761, 3536, 2892, 10493, 13613, 13012, 9198, 4931, 1376, -3146, -3927, -3038, 6432, 15272, 16434, 11564, 9224, 12140, 20409, 20182, 22214, 16294, 6082, 12230, 30334, 18429, 11548, 15230, 21327, 24396, 19954, 10095, 3067, 8617, 12543, 11117, 11908, 8510, 13519, 8584, 5320, 6218, 8190, 8997, 10581, 3043, -66, 1550, 1538, 1435, 1882, 361, 2254, 7247, 9824, 10920, 12630, 20140, 20997, 17713, 14245, 11367, 4978, 13079, 24268, 28026, 22614, 18416, 23304, 35355, 33990, 29692, 34576, 38725, 34177, 31304, 34191, 42494, 47419, 55069, 80492, 100606, 116422, 145951, 184996, 202549, 184619, 142353, 113366, 89332, 68038, 62350, 47675, 31311, 25672, 24477, 24551, 23109, 25213, 23547, 21182, 20546, 26493, 28970, 19998, 18368, 23041, 30840, 34153, 32838]
8409C2838N951L538k058K714O64n330l413k23j43P024J2823J3016J0799J7201
8395I5401J6444J5520L2600N1854Q1255Q4084K8490m5824p7446o7155n1094l1476
8383A32653k5944j9464j6896l680j1231r181l551M97j845J363l501k131l968r506
8369B3615K273J634j54o7o50l580k834q10Q269J282o41P75k052M44l029J631N693
8352C1799J0900J1309P751O061J2052K2358L2557L5625J4748j7124l2015l6497
8340I9524k6733j6225q106m344j0530l935Q16m679n355L220J585p511k517J903
8326A7113m604o72l41n358j0086N662Q208j484J463j138m838M150N24j680j901
8311E018M358K979J0152J072l922j716p245J938P300j807r720q610L898N821M766
$$ y = [32838, 38789, 42327, 40269, 42983, 43647, 38317, 34904, 34681, 34538, 41562, 54385, 67401, 78200, 95401, 111845, 127365, 159965, 211819, 293074, 377158, 405648, 359824, 282378, 215223, 164129, 132653, 106709, 87245, 70349, 66669, 55438, 46257, 42706, 43203, 41358, 42721, 39220, 37089, 33121, 23615, 25888, 27522, 27368, 27301, 26651, 23071, 20237, 19427, 27696, 28978, 28337, 29112, 27060, 27504, 24475, 26106, 31799, 42699, 54008, 61759, 67820, 79872, 102230, 134787, 170412, 185160, 168036, 136021, 99524, 72791, 56566, 48460, 44116, 33586, 29651, 30467, 25788, 20433, 23653, 25238, 17727, 15210, 17113, 12509, 11837, 11496, 6138, -3948, 1714, 9922, 8438, 9901, 8763, 3925, 8075, 8599, 6919, 5018, 9376, 12355, 22507, 23579, 19657, 17941, 10696, 12634, 19934, 18127, 8407, -203, 3695, 9516, 14282]
8296A4282k547n349j00p610k602o23j469k751J813K915P618l745j0563N51O831
8281c349p30j072l536M127N361k229l151Q479o98n540l465J058K436k798J766
8266c341M678j368Q610J0318j0756j0651j76J566j280k732O242L732j431l309
8252A02M976l733j1966K74J3738l380k573l901K73j601L524N070K403J880L506
8237H592M228l264n652l628L83R253J625o069l683N98j25j924M029k749j624r71
8221i81L731J909p072N495r34q298M771Q233L157o79k897R7k07J253L750q121
8205C207m695P280K814m399l912m724N249P649J567j590r456l033K93L364N742
8190E356O707m636l820m115j024j429M794k02K132K089N812j02J549K28n1q973
$$ y = [14282, 11735, 6386, 6286, -1324, -3926, -4549, -6018, -8769, -6956, -4041, 3577, -168, -10731, -10180, -3349, -4079, -5151, -8687, -4560, 801, -1428, -4579, 3900, 3202, -2338, -5803, -4745, -2309, -5107, -3341, 1337, -31, 8579, 18897, 8141, -2510, -2686, -1120, -2400, -5132, 1110, 4842, 3411, 102, 5078, 1345, -10621, -10347, 3391, 11, -2562, -6463, -6190, -7791, -4267, 803, 3206, 5086, 8592, 12820, 9556, 3904, 276, 659, 9912, 11537, 5468, 1785, 2383, 2258, 334, 4363, 1614, -10, -981, 2750, 4659, -2413, 3082, 2148, -6150, -1379, 6854, 10011, 9332, 6435, 6532, 6325, 7578, 11328, 3207, -1488, 5792, 8606, 4207, 295, -4429, 820, 8469, 10036, 8446, -1010, -4043, -3750, -386, 5356, 12063, 7427, 3607, -508, -1532, -2961, 1833, 1631, 3763, 5852, 11664, 11562, 13111, 13339, 13288, 4315]
8174D315m47M9J283j01K929k574K497K802o848l44k167J99k814R44L125k927J434
8157A355M546L892o53r97M221l883o005P98j797M630P110l558k830p837k952O934
8141B974J089m569O472P424p733m056L360O799O471L492M060q850n758k27K396
8126A3344R04L76j027P97j558O37j610r175o548j435M375J670J723L571k126j532
8110B386p56k593Q92O265N384n786n115J380O327Q59J142N66Q53K63n100l61J182
8093G788l580j568P128L500m720j651N631j531O02L040M133m68n398m416m770
8078C720j646J350K747J568m55j057L776M630M808r98p081M86L112j416l056n107
8062E381j429M181l559j191Q146N064o76O921M53Q52m43P5m80p14K152p116n159
$$ y = [4315, 3868, 3917, 5200, 5099, 8028, 5454, 7951, 10753, 3905, 3561, 1394, 1593, -1221, -277, 2848, -79, 1355, 5901, 9793, 9140, 8143, 12364, 8481, 2476, 3274, 1477, 6107, 13217, 9659, 6829, -1008, -3960, 2974, 4063, -506, 5966, 13390, 5657, 1601, 4961, 11760, 18231, 21723, 25783, 16933, 11175, 10948, 13344, 14248, 14624, 13597, 14394, 12836, 13473, 11863, 2688, -3860, -5295, -920, 750, 2473, 6044, 3918, 2386, 1630, -963, -71, 6194, 11578, 5792, 677, 2057, 8384, 9243, 10385, 10951, 11804, 12067, 6967, 6606, 7788, 4208, 2640, 9768, 13268, 8548, 6897, 12528, 10997, 11599, 14639, 18772, 18304, 12906, 8490, 3720, 2074, 3424, 6171, 7739, 7284, 6227, 10003, 14633, 19441, 18443, 11362, 11848, 14960, 13544, 10488, 5381, 3952, 8133, 4574, 3383, 11529, 16593, 15917, 22838, 23291, 24143, 23700, 23775, 23295, 22581, 24733, 17617, 12458]
8045A2458K642J312J2657k436n797J822j765j764K719L938l985l580R317R647
8031C7185j262K563k883j3342l354K450R217P111j284K822j726o057M241J055
8017C6736k442J216j03l187K549M28K12J268K775o058K001l177p171K106K350
8002B9503n422k187J248J320l9L451K614m368l959J417J956k286o117O80L033
7987B0844K084L93n976j909K260M668p80l689K175O598K328L512K540j707J825
7972C5166N402K105j166m227l174J577J92n207m171L112o05m867m641l210n08
7957A5778q0L585k67m275p099m50O268K564J796j178m802j612N278R709J751o493
7941B0473N43k121k823J441M510o70j287L961k346q833l187N30M219o396J490
$$ y = [12458, 15100, 16412, 29069, 26633, 20836, 22658, 20893, 19129, 21848, 25786, 21801, 18221, 27538, 37185, 35923, 38486, 35603, 22261, 18907, 21357, 30574, 37685, 36401, 39223, 37497, 31440, 35681, 36736, 34294, 35510, 35407, 32220, 34769, 35197, 35409, 36677, 39452, 33394, 35395, 32218, 25047, 27153, 29503, 24081, 21894, 23142, 24462, 24423, 27874, 30488, 26120, 22161, 23578, 25534, 23248, 17131, 17811, 20844, 22928, 23321, 17345, 15436, 17696, 22364, 21584, 17895, 20070, 26668, 28996, 32508, 35048, 33341, 35166, 40568, 42673, 41507, 37280, 34106, 35683, 35875, 30668, 26497, 29609, 29004, 24137, 19496, 16286, 15778, 15698, 19283, 19016, 14741, 7642, 7192, 13460, 16024, 17820, 16642, 11840, 10228, 15506, 25215, 26966, 20473, 21016, 18895, 16072, 17513, 22023, 21353, 20066, 24027, 21681, 12848, 9661, 10191, 14410, 8014, 9504]
7926I504O954J905J696p221L420K289k575J689K114k769m78M781K875n139m143
7911A4902p333o486O539o1o375l666J2230L588p406o731L07J199L078O167q41
7896I111N683p89l570k809J859K026M994N306n618q461m826L427N102l340l973
7881D122l016L719N021m456K573L333J338o523k993J72j080k107m560O74K469
7866a314J329J090O616n261k435k934o115N309L161K781K322m618J279n97L386
7851C999P251O172j37j1336n754K648M873K415N05n698K168J494r52K138m118
7836E668p470p111r08J947M079O218J948J407n99l607l122l377m05l833m491O228
7820g428J0380R43P55j487k703q586p096k069J0845K689n338j105K758M58M095
$$ y = [9504, 16458, 18363, 20059, 12838, 16258, 18547, 15972, 17661, 19775, 17006, 16528, 21309, 24184, 19045, 14902, 7569, 1083, 7622, 7561, 1186, -2480, 9750, 13338, 5932, -799, -492, 707, 3785, 9952, 9111, 14794, 14005, 10435, 7626, 9485, 11511, 16505, 21811, 16193, 7732, 2906, 6333, 11435, 8095, 4122, 1106, 4825, 9846, 5390, 7963, 11296, 12634, 6111, 3118, 3290, 2210, 103, -4457, -3783, -1314, 15, 1105, 7721, 2460, 25, -2909, -9024, -3715, -554, 2227, 4549, -69, 1210, 613, 3999, 11250, 17422, 17285, 5949, 195, 2843, 7716, 10131, 10636, 4938, 7106, 8600, 7648, 9786, 5668, -1802, -8913, -9821, -7874, -3795, 2423, 4371, 5778, 5179, 1572, -1550, -4927, -5332, -9165, -13656, -7428, 2952, 3895, 4650, 3163, 460, -8126, -15222, -17291, -6446, -3757, -9095, -10200, -7442, -6984, -2889]
7805b889L382p82O601O109k196m758M014m3m256p55n738n496L087L570l79l641
7789d170j457j16M132m662k083O904L961n831K052J0096m48m196L28K604M144
7774A1258L415M698O6j1490r283p94K915k291n181m992K12N927L920J450L048
7759B878K579m419j775l559k057O947m071p802l804M253J3088K952k563J760K180
7744F587J210o171n18K592L29L582n657o626K734L59o630k943K523L427L640j638
7728c200r05q48J401l852L294L115M09M289M597k713K594m325J341K667j374M334
7712A0824p084k182K172l229o420J895O313m50j384Q2J604j657n978M42R146L295
7696G389o149m912n870j103J290K887K969O442J097N77R60k149L494k311jk236
$$ y = [-2889, 493, -289, 6312, 12421, 10225, 5467, 9481, 9438, 5182, 4427, -1311, -6807, -3720, -150, -529, -4170, -5627, -5743, -1611, -6273, -8356, -1452, 2509, -3322, -1270, 8826, 8378, 4182, 4510, 7114, 11258, 14673, 19371, 19437, 7947, -1336, -2130, 785, -1506, -6687, -11679, -11467, -5540, -1620, -170, 2878, 5457, 1038, -737, -4296, -6353, 594, -3477, -11279, -15083, -10830, 2258, 5210, 2647, 4407, 6587, 7797, 1626, 1108, 3700, 4029, 7611, 1954, -4672, -1938, -1579, -8209, -11152, -8629, -5202, -1562, -3200, -4105, -4953, -3552, -7404, -4110, -995, -586, 3703, 8300, 5587, 8181, 3856, 5197, 7864, 6490, 10824, 3740, 1558, 3730, 501, -5919, -4024, 2289, 1839, 455, 537, 2141, 484, -5494, -5052, 4094, 7389, 1240, -3672, -9542, -10645, -9355, -6468, -3499, 2943, 4040, 4617, 5577, 3428, 6922, 4611, 4610, 2374]
7680B374k296Q32P272j358j6662m394J840N774r26k930r25p54L539M515K719l223
7664d603j35M564K42J706m042l408K338L903j085M89P943j833n812L414P420R46
7648A2047m703l446m821l170J15K113j278o96k652j283M429k04j60Q415O627j392
7632I941n751r322l468j857j550N435Q011N904k218m02K852J863n336n471j659
7617c028k431n371K18P936O428Q735M944q692k976p61R46L171l643n640k245R9
7601b310p190o747M552M38L572k521L559L273O157M75k866j024j243j902j470
7586e247P091M138j976p05k268l24K114K575K706M077n826o305J303N30k464n577
7570f158m591k565P652j173l853l004L020P487n499J271J917N085L409R346n071
$$ y = [2374, 78, 910, 8182, 6824, -9838, -14232, -12392, -6618, -7544, -10474, -11399, -12153, -8614, -4099, -1380, -4603, -4738, -174, 68, 1774, -2268, -5676, -3338, 565, -520, -31, 7912, 6079, 267, 3681, 11101, 12047, 7344, 3898, -923, -4093, -3978, -1865, -3143, -3839, -6491, -7774, -3345, -3549, -3709, 4706, 11333, 9941, 4190, -5132, -8600, -10457, -12007, -6572, 1439, 7343, 5125, 4723, 7575, 9438, 4102, -1369, -3028, -5459, -10830, -10612, -2676, 3752, 12487, 17431, 8739, 5763, 5002, 5948, 9119, 5476, -164, -2409, -2310, -9500, -16247, -11695, -11257, -7685, -10206, -6647, -3374, 2783, 3258, 392, -632, -1875, -3777, -5247, 1844, 5982, 4006, 3301, 1033, 709, 2823, 5398, 8104, 12181, 6355, 50, 1353, 1883, -581, -6158, -10749, -13314, -5662, -6835, -10688, -13692, -10672, -3185, -8684, -7413, -5496, -411, 2998, 12344, 7273]
7555G273q630n681j843K003P874L462l472j221L514K784j915n053J036l565l426
7540f860N405P495P889P98k410N13K659o864r276k297j50j240l301J815L133r9
7524b790j215m503M778M520L651j121l160l249m060k157L268Q141L7p139J638
7509c361J106m072L964k682k967M37N265Q901N063j560o107J475j520r61k401
7494E80P97n67m346p262l690O339M025M827J996n004o74L386N504J81n107p452
7478f467N04j280o98l50O565L061M321N758k323m720L17k693l694n189L33M674
7462a881N542j233m711m710J396M624l760l600M979L511o478L858K001P72J244
7447A554M49k061k946n871k236N664O716N823l73j183n035l374K944J794M568
$$ y = [7273, -1357, -7038, -8881, -6878, 996, 4458, 986, -235, 3279, 6063, 4148, -905, 131, -3434, -6860, -1455, 6040, 13929, 14727, 12317, 12830, 15489, 8625, -651, -2948, -3098, -4338, -7639, -5824, -2691, -2790, -4005, -8508, -3730, 790, 4441, 3320, 160, -3089, -7149, -9306, -6038, 2103, 2140, -4999, -3361, -2255, -6327, -2363, -5045, -8012, -7575, -2310, 6591, 11654, 10094, 3987, 5462, 3942, 2981, 580, 1377, 810, -3536, -10798, -14488, -8149, -4124, 703, 2699, -2305, -2979, 407, 5911, 6092, 985, -6467, -5963, -7243, -7941, -8291, -1726, 1335, 5656, 11414, 9091, 4371, 4688, 1995, -1699, -6888, -6555, -1881, 3661, 2428, -2283, -6993, -5597, -973, -4733, -8333, -3354, 157, -6321, -2463, -462, 310, 1554, 2003, -58, -3004, -8875, -11111, -5447, 1269, 7092, 6719, 5536, 501, -2873, 71, 1865, 6433]
7432F433q68J646k225o149l041l998k383J362J844L384K139k922J922j445l4K503
7416a832O905L633R125M680l609q688o974o775o086k642P059N570K782M052M630
7401A1830Q600M527j39j4552q624K134p93k460r22K537L170m132q195L51Q206
7386A538O634l514n482J106P087K625r445p105M66Q710j412l319j753Q4J904O133
7370D257l39k260k075J975O646j1118j5189k634L2J800Q066L388L669o99k030
7355f511r120J133J2558J1525o177j810n717m514N384j031L515Q643N384r052
7341D210m489l332m042l026L259p98M21O69j710N316J32o39l799k593O10J884
7325g927K602K39M002M295r211j472N364R5J22M840K9m434o09K236K344m359m675
$$ y = [6433, 5565, 7211, 4986, -1163, -4204, -8202, -10585, -9223, -7379, -3995, -1856, -4778, -2856, -4301, -4335, -1832, 5073, 8706, 17831, 22511, 18902, 10214, 3240, -3535, -9621, -12263, -5204, 366, 3148, 7200, 11830, 20430, 24957, 24818, 10266, 1642, 3776, 2983, 523, -399, 2138, 5308, 1176, -7019, -6668, 1538, 8172, 4658, -824, 282, 7369, 9994, 549, -6556, -6090, 2620, 1208, -2111, -3864, -3780, -1876, 4257, 3918, 1658, -417, 1558, 8204, -2914, -18103, -20737, -20705, -18905, -10839, -7451, -3782, -4481, -6511, -15631, -14498, -1940, 9585, 3408, 1598, -4119, -8633, -3249, -4280, -765, 7878, 13262, 4210, -279, -3611, -7653, -10679, -7420, -8218, -7797, -7128, -8838, -3522, -3390, -4029, -7828, -10421, -9811, -7927, -5325, -5086, -1084, 3211, -6000, -7472, -2108, -2013, -1891, 2949, 2978, -1456, -2065, 171, 2515, -1844, -6519]
7308f519R72Q511k698n598K5K94K997K819m993j0507K213L917L465k795R76L078
7292c843J122k244l735m628m547M892O703J93J107J883K965k65J54L446l305M274
7276D172O937K32o892N854k702n712o28k162r492J899M033J377J800j81O026L735
7260H296p054k000j947j485k326k797J062K829k021J759l160j632l58N701k922
7245h055O01m068k378O278j162l62N761O307o758j670M794J637l444j325K178
7230a666L142l389N182L949k515J488m87k590n133k535k30k793l797l447M681
7215a0140P553j525k221M060P457J244Q83K576rm016l326Q08p87q87n44L853j411
7198C568l619Q99P70m097j809O644K881j858M49q63o207R13L269k027J803J253
$$ y = [-6519, -5547, 2964, 266, -5332, -5307, -5013, -2016, 803, -4190, -14697, -12484, -8567, -5102, -7897, -6921, -3843, -2721, -4965, -8700, -13328, -17875, -12983, -6280, -6087, -4980, -3097, -132, -397, -243, 3203, -102, 4172, 11109, 11341, 4449, 10303, 7601, 1889, 1261, -901, -10393, -8494, -4461, -3084, -1284, -1465, 4561, 8296, 1242, -758, -2705, -4190, -6516, -9313, -8251, -5422, -7443, -5684, -8844, -10476, -10834, -5133, -8055, -7454, -11522, -13900, -7622, -8784, -9146, -3385, 2922, -3836, -5506, -712, 925, -2519, -3844, -1666, 1476, -1913, 3269, 7218, 4703, 6191, 5704, 3114, -2019, -4554, -4784, -7577, -11374, -14821, -10140, -2587, -4112, -6333, -2273, 5184, 6428, 7311, 9887, 9878, 5862, 2536, 3344, 2557, 1670, 1126, 4979, 3568, -51, 848, 1618, -2479, -4288, 2356, 5237, 3379, 3828, 2965, -3242, -2329, 940, -1087, 716, 1969]
7182A969m848m234M844J837K335N341m37m592r43j783J786M723K161m723n11k104
7166H21l069K039M789n85k837n936o740P78k706N710P578N830o34l44m025q556
7150g887L328R934J219n312k067m930j900P587m607m848J178P060Q817K846j118
7135I300q404n807L18O468M356M240k969p879N497P287k518n195j549n134N619
7120C630O762j797j438m146K137J801M025R31o384R36l646m281K603L082J450
7105E665k486j323l776l841J475k28M472n005n532Jl856O681Q97k270R729j085
7089d82m827l563M076J5160K48p054n759l203N168M159K968l902o41l293K617
7074A672n973l289N410M686J776L968L711o683m421j899N69J347K045l81l581
$$ y = [1969, -2879, -7113, -2269, -432, 1903, 7244, 6807, 2215, 1272, -511, 1275, 5998, 8159, 3436, 2925, 821, -2248, -209, 4580, 3995, 1158, -4778, -11518, -10740, -13446, -7736, -158, 5672, 5038, 4694, 669, -7887, -4559, 5375, 6594, 1282, -785, -5715, -7615, -28, -4635, -9483, -8305, -1245, 7572, 10418, 9300, 896, -4911, -4593, 1875, 6231, 10471, 7502, -377, 5120, 12407, 9889, 4694, 3145, -1989, 3630, 10392, 8595, 7157, 3011, 5148, 6949, 10974, 11905, 5521, 6457, 2811, -1470, 1133, 4215, 5665, 3179, 1856, -1920, -5761, -4286, -4514, -42, -5047, -10579, -10578, -14434, -7753, -6856, -9126, 603, -482, -5309, -8872, -4796, 10364, 10612, 3558, -2201, -5404, -236, 3923, 6891, 2989, 2348, -945, 1672, -4301, -7590, -2180, 2506, 4282, 8250, 11961, 5278, 857, -1042, -473, 874, 2919, 2538, -1043]
7059a043j618M82K332j540K424j016l241k089n3M028J391o444j03M1J889k206
7043f766k165n296L351N266l460j329N046P173K342j188j800j516L492J69k52
7028C067n196r24L37m181k315M537M583q863j502N75k299j877O568n821N791j389
7012h909K637L981J538m660l455M12n38j215J721K424J197J044L43l24r145L193
6996i756N974J966j477m051l901L32j560K974j523M505J101m795J466L959k076
6981f862L912M876j968J008L841o609o500L521L192m932k636k601j798k400k4
6966a5980M463L146J0444L264j766O87L084k188k237K44k460J677M55r00K77K608
6950D818n878m725J206K240J398K284m818o75N316j173o865J422m156k557N715
$$ y = [-1043, -2661, -2179, 153, -1387, 1037, 21, -3220, -5309, -5362, -1334, 57, -6387, -6490, -6449, -4560, -6766, -8931, -14227, -10876, -5610, -9070, -10399, -5353, 1820, 4162, 2974, 1174, -342, 3150, 3319, 3067, -2129, -3053, -2716, -6897, -9212, -4675, -92, -8955, -10457, -9882, -12181, -14058, -7490, -13311, -7520, -8909, -6272, -2291, -753, -5413, -8868, -8456, -8994, -10209, -8488, -6064, -4867, -3823, -3480, -3804, -12949, -9756, -3782, -1816, -3293, -7344, -11245, -10913, -12473, -9499, -11022, -6517, -5416, -10211, -8745, -4786, -6862, -2950, 1926, -42, 966, 4807, -1802, -8302, -4781, -1589, -6521, -9157, -11758, -13556, -15956, -15980, -11517, -8371, 2073, 5337, 3571, 4258, 7342, 5154, 2917, 3161, 701, 2378, 2833, 1933, 2210, 4818, -1060, -5785, -4579, -2339, -941, 1343, -3475, -4150, 1166, -7, -6872, -5450, -9606, -12163, -6448]
6935f448j178M964K317k628l633M948N809k815l929p390n069K534N176Q44k9M306
6919b221N091n283n90N824m83K88j0729J439K876M343J831l473k80N1L5k57J94
6902a344N673N89j343m661k64O600M59l509n590k541M694K217l673l76m480m392
6886a1941K657J460O036N187L11R94j147P571l242o592k065O485R98qK780M457
6870A3941n245p915k329m296K398L63j87Q644J384m605l5m532j985M888j620l226
6854d357m960Q605N519m869k330O601J108J927m31p333m2Q235P795O689R05k752
6838B0310k557n419n486q718o383J047J624N009K314M790k398Q64M893J681J161
6823A2732M812L019q161p292o01K880k323l459q583o767Q44r56J405Q191L524
$$ y = [-6448, -7626, -2662, -345, -2973, -6606, -1658, 4151, 1336, -2593, -9983, -15052, -12518, -7342, -6498, -6527, -2221, 2870, -2413, -3003, 2821, 2338, 2626, -8103, -6664, -3788, 555, 2386, -1087, -1367, -1316, -1281, -1538, -1344, 4329, 4918, 3575, -1086, -1350, 5250, 5709, 2200, -3390, -5931, -1237, 980, -2693, -3069, -7549, -11941, -9284, -7824, -1788, 3399, 3710, 4704, 3557, 11128, 7886, 1294, -771, 5714, 6712, 6704, 9484, 13941, 8696, 781, -1548, -5844, -3446, -3083, -3270, 5374, 6758, 2153, 2118, -2414, -4399, 489, -1131, -4357, -9317, -712, 4807, -62, -2392, 4209, 5317, 7244, 6813, -520, -562, 7673, 15468, 22157, 23062, 20310, 17753, 12334, 6848, -1870, -8253, -7206, -5582, -573, 1741, 6531, 4133, 4997, 9890, 11571, 12732, 17544, 20563, 12402, 5110, 4509, 7389, 5066, 1607, -6976, -13743, -12899, -13855, -12450, -4259, -735]
6808g35j336M607n182m023M321K424L669K776k381p75J126O89n462j490k74O204
6792D158N048P746L216m986q344n752J823N49J670N72L592n126l827r34O231K191
6776G827R05N870N004J632M380o920m285p472k898O06K434L494J7533K222j8J6730
6760D7044Q156o2O687R749L796J912N984K687M419o402k464O602j574j4018k4818
6745D7698j7549j5014k448l444q072q152M598R500R78o357J498P95J398l27P49
6730E851K339p990j245n901P433M196l860J82j101J104J864k428K480j750O49
6715A823k197k318k974j296K788m195q93J0274K396J983J927n776j44n354k177
6700f133J078M03J74m622L852N404K62J921n159l98l908J95N53m624m855K014
$$ y = [-735, -2071, 2536, -2646, -6669, -2348, 76, 3745, 6521, 4140, 3365, 4491, 5180, -282, -1772, -2046, 4158, 9206, 16952, 20168, 15182, 6838, 1086, 2909, 3458, 5128, 5700, 9292, 4166, 339, -595, 5636, 7827, 8732, 14602, 19606, 21238, 25618, 18698, 14413, 6941, 4043, 4649, 7083, 10577, 28110, 30332, 30314, 47044, 55200, 55138, 61825, 71574, 75370, 77282, 83266, 85953, 90372, 83970, 81506, 88108, 86534, 72516, 47698, 30149, 15135, 12687, 9243, 1171, -6981, -2383, 7117, 8095, 1738, 3236, 4031, 5429, 5102, 5851, 8190, 200, -1045, -6946, 487, 4683, 823, 1005, -96, 1008, 2872, 444, 2924, 1174, 1823, -374, -2692, -5666, -6962, -4174, -8369, -9262, 1012, 3408, 5391, 7318, 1542, 1398, -3956, -6133, -5055, -4652, -4478, -9100, -5248, 156, 418, 2339, -2820, -3218, -7126, -6931, -6378, -11002, -15857, -13843]
6684a3843L455M402O773K434m694K984L459j521K143L951J542P791k111q858n467
6669B440k262J23k10m826k84R64l621p061o673P929J1842j294l946J583n89P37
6653e148j169l357P87O80L424m703J065M591K603M439J000j12k110K459m620k638
6637b809P39M931m4J599J29k448j0551K445P033J397n17j848J26m96L95J638k0
6620A699L229M65j043N336K886n816q476K393R210l863l753j016q432N61n550
6605a2170k101Q783J0011N257L84j2138q21M97M785M494K172k493j1654o602j575
6590a3171Q966L499m88k50l486R62M254L835P601k96L605n57m364k782p115j060
6574h47M24j595M182m530n270n090j965R116J1214O63k772j956q326R73k373j104
$$ y = [-13843, -10388, -5986, 787, 3221, -1473, 1511, 4970, 3449, 5592, 9543, 11085, 18876, 16765, 7907, 2440, 178, 301, 91, -4735, -5019, -4055, -7676, -14737, -21410, -13481, -1639, -2933, -6879, -5296, -5885, -5148, -6317, -9674, -8887, -8207, -4783, -9486, -8421, -3830, -1227, 3212, 4212, 4100, 1990, 4449, -171, -2809, -2070, 2861, 2817, 4416, 4545, 2097, -8454, -6009, 1024, 2421, 1904, 56, 182, -314, 81, 1719, 1699, 4928, 5393, 4350, 9686, 12572, 6756, -1720, 673, 9883, 6020, 2267, 1251, -7181, -6620, -12170, -14271, -5488, 4523, 9780, 10164, -1974, -2795, -2298, 2487, 6981, 9153, 6660, -4994, -11596, -13171, -4205, -706, -1194, -1444, -4930, -3968, 286, 4121, 11722, 11426, 15031, 14474, 10110, 7328, 213, -847, -423, -2018, 2164, -2366, -7636, -12726, -14691, -5575, 5639, 6302, 3530, 1574, -6752, -5779, -8152, -9256]
6558i256L686P383l627k948O398l1J661m24k315p445o953J671P185J23R79K020
6542a893P859l9m360p3J517K066j04p321j550l419n462K738L570j948J893N7l776
6525a0245J70J945J237j944j974J962m172O437K186k961L519J722l552l660j902
6510a1232R734R206M247J941p941n307k612L929K755r389q695O807M07m109q41
6495a1100L268K10K45N279L125n130m808j265R9M45k522P081N134r78q78r55K259
6478d91J865j633M975J1948J209o688o462q56K853p64q965K421K269n875K83P082
6462C171q667l524L764O274L611m916k618j678o096n090J502M062M094J1954J589
6447G432l254o063j839L291o321j685P885N997l83k524k748N580m118O13q019
$$ y = [-9256, -5570, 1813, -1814, -4762, 1636, 1605, 3266, 2842, 527, -6918, -13871, -12200, -5015, -4892, -3913, -1893, 5966, 5927, 1567, 1494, 3011, 5077, 4973, -2348, -3898, -7317, -12779, -10041, -6471, -8419, -6526, -6469, -10245, -10075, -8130, -6893, -8837, -10811, -8849, -13021, -6584, -4398, -7359, -3840, -2118, -5670, -9330, -11232, -1498, 7708, 11955, 13896, 5955, 648, -1964, 1965, 4720, -4669, -13364, -6557, -6150, -10259, -11100, -7832, -7622, -7377, -2098, 1027, -4103, -8911, -10176, -10077, -9632, -12154, -5073, 61, -917, -1795, -2750, -491, 1374, -259, 4716, 16664, 17873, 11185, 4723, 3867, 6720, 5956, -3009, -588, 1681, -4194, -3911, 3171, -5496, -9020, -5256, 1018, 4629, -287, -2905, -4583, -10679, -15769, -14267, -10205, -6111, 5843, 7432, 4178, -1885, -3724, -433, -6754, -8439, -554, 5443, 5060, 2536, -212, 5368, 1250, 1863, -6156]
6432f156l550r57l868K170j287R13O920m519K5l560j14P609J239m098J199J06
6416g928O055J904O173J20m078m968o329K906O850O447J89k595l177m138m134
6401f703R37M400m05J517n260O88K336m296k83K877n485K146j636l362M822J383
6385f324k223l08K109M799n180j964K171J181o863j139R61l826L545Q927M326
6370A92n004J570m540m824K996N791N682K594n616j794l88J0520k025l623o843
6355e312O04J387L751j153K723K655j402o862j162N76N572L952n83J271j410p841
6339c234k398j501m583l165K797J804K000J060L561n69l969j419K014K229P708
6324B335L171r086p923L975M904k21p182j250J3517O299j316j229L49J026K136
$$ y = [-6156, -9706, -10663, -14531, -12361, -13648, -12735, -5815, -10334, -10309, -13869, -13983, -6374, -5135, -9233, -8034, -7928, -1873, 31, 6204, 6324, 2246, -2722, -9051, -6145, 705, 7152, 7341, 4746, 1569, -2569, -6703, -5766, -1366, -1771, -254, -5514, -4826, -2490, -6786, -7069, -4192, -9677, -7531, -9167, -12529, -7707, -6324, -8547, -8855, -6746, -1947, -7127, -9091, -6920, -5739, -12602, -13741, -12780, -16606, -13061, -4134, 192, -4812, -3242, -7782, -12606, -9610, -3819, 1863, 4457, -1159, -2953, -3341, 7179, 5154, 1531, -5312, -4708, -3321, 430, -723, 2000, 4655, 3253, -3609, -4771, -4195, 1377, 5329, 4746, 6017, 4607, -3234, -5632, -7133, -11716, -14881, -12084, -10280, -8280, -7220, -3659, -4228, -8197, -9616, -7602, -5373, 2335, 5506, -3580, -11503, -7528, -2624, -2845, -10027, -11277, 2240, 8539, 7223, 5994, 6343, 7369, 9505]
6309I505l137q425j269j280o394p366k052J1378N783k016K470J124Q176n846n297
6294d646n019O092L498M409N506k512p468j19O266k781O91j907k889k145R185
6279F161N569q803K204J212L796r106m910P619J730j616N17J654K694J63l380
6264E504J064K342Mm78j975o457K459l92j282J070l682K737K45J649O786l46k220
6247G028M8k098n064n38J172j638j361J0108j476p718l278o439N070Q295k38O01
6231B474O396m860n148N796p412k240Q850K469p839o195k953P538N344J025k683
6216E62j966l579l315m179P61O260L309j284N521m789j685O929K708j622j114
6201B517k4l105N5J155l227o736l28M72Q0L517K201n835K004N914J846N44R395
$$ y = [9505, 6368, -2057, -3326, -4606, -11000, -18366, -20418, -9040, -3257, -5273, -2803, -1679, 6497, 651, -4646, -9665, -3573, -75, 4334, 9840, 7328, -140, -259, 6007, 3226, 3917, 2010, -879, -3024, 6161, 11730, 2927, 5131, 6343, 10139, 1033, -3877, 3742, 5472, 3856, 4373, 6027, 8721, 8884, 5504, 6568, 8910, 8914, 8436, 6461, 4, 2463, 2071, 789, 1859, -1823, 914, 1159, 2808, 9594, 9248, 7028, 7076, 4978, -86, -624, 548, -1090, -2451, 7657, 6181, -1537, -4815, -11254, -6184, 2111, 1873, 2474, 8870, 4010, -1138, 4658, -2754, -4994, 3856, 6325, -1514, -7709, -10662, -3124, 2220, 3245, 562, -1404, -4983, -8298, -12477, -11716, -5456, -2147, -3431, 2090, -2699, -4384, 2545, 5253, 3631, 2517, 2493, -612, -557, 598, -2629, -9365, -9693, -9221, -9141, -5624, -3423, -9258, -7254, -1340, 506, 1050, 10445]
6184A0445l52j0686k175J079O870j151n71l423q311j1042N960N885J364l964K178
6169g894K192j52K281k90Q24l595k592L90L250P167J819R27k75m498j18k443J236
6152a771M83K444K091j631J146n63o041J225J4051l748q685N558j340p66j766
6137F87k356j17r712l607J0293O880K622o087k994O338o719l577K604L825K214
6122B94j17n055K634J934k239m741O887p96j628j258l40k902J797l874P026l942
6106f320l83o24L153n97o091N476P2m02n164k507Q059J053j452m617K3J623N641
6089c057M842l814k640R11m107j102l507o471N673O240J635L487R74q822M102
6074e656J0107M095O90l484m116q58L702P53l616p810m572o82q80K140Q086J768
$$ y = [10445, 10093, -593, -2768, -1689, 5181, 4030, 3459, 36, -8275, -19317, -13357, -7472, -6108, -10072, -7894, -5702, -5854, -3573, -3863, -3039, -6634, -9226, -8836, -5586, 1581, 3400, 4327, 4052, -446, -564, -3007, -1771, -1288, 1156, 3247, 1616, 2762, 2199, -3842, -2617, 11434, 7686, -999, 4559, 3219, 2453, 687, -1669, -1786, -11498, -15105, -4812, 2068, 4690, -1397, -4391, 1947, -4772, -8349, -5745, -1920, 294, 177, -4878, -2244, -310, -2549, -7290, -403, -1199, -2827, -4085, -4425, -7327, -5530, -9404, -2378, -6320, -6703, -7327, -4174, -4771, -10862, -5386, -5314, -5716, -10880, -13387, -5328, -4275, -5727, -10344, -10321, -8698, -3057, 1785, -2029, -4669, -3758, -7865, -8967, -12474, -18945, -13272, -7032, -5397, -1910, -936, -9758, -5656, 4451, 8546, 9236, 5752, 1636, 778, 4480, 5233, 1617, -6193, -10765, -11447, -12327, -10187, -2101, -333]
6058c33l806L083R324K044q842J003N997L423l782o389j354K116K026k632k929
6043a051j680k282L429o97m90L77K510j292m566o153n925k493M510J2945K267
6028e91j265J898M218P25l697j135K144k811m877M826N998L180p396P4L307m448
6012A50J244K962p69o350o874j660Q73M292O281l505l872P939O054r052n490m127
5996a1904m976k383R665N146j865k208L531K433J345P491j197O042K502o187R74
5981H409p19n923M261M575j778q470l615m856O979J086o424k743K937J529M534
5966b18r29k526k905j884O436j76k783r41K191l98n461J244K473j384K033j954
$$ y = [-333, -4139, -1056, 8268, 10312, 1470, 2473, 8470, 11893, 8111, 1722, 368, 2484, 4510, 1878, -1051, -2731, -5013, -1584, -2281, -2771, -2394, 116, -1176, -5742, -11895, -17820, -20313, -15803, -2858, -591, -1856, 42, 4260, 4985, 1288, 153, 2297, -514, -5391, -565, 5433, 8613, 1217, 1291, 4598, 150, 1394, 4356, 3587, -2763, -9637, -11297, -10424, -6132, 149, -3356, -7228, 711, 6765, -2287, -7777, -11904, -16880, -19263, -9598, -4452, -6317, -8525, -4994, -2561, -1216, 6275, 5078, 11120, 13622, 7435, 8409, 7690, 1767, 6028, 10603, 8825, 355, -3260, -8116, -1137, -51, -6475, -9218, -6281, -4752, -218, -1147, -3673, -6578, -8462, -2026, -2202, -4985, -5926, -3735, -4133, -9594, -8350, -5877, -7261, -5228, -7182]
$$ [...]
##END NTUPLES=NMR SPECTRUM
##END=
