##TITLE=Analysis number 327999
Compound Code cc 61809
Book Reference 467/146
Project Code adrs
Chemist Name benw
##JCAMPDX= 6.0         $$ Bruker NMR JCAMP-DX V2.0
##DATA TYPE= NMR SPECTRUM
##DATA CLASS= NTUPLES
##ORIGIN= Bruker BioSpin GmbH
##OWNER= nmr
$$ XWIN-NMR		Version 3.5
$$ Tue Apr 24 15:07:18 2007 GMT Daylight Time (UT+1h)  MAYBRIDGE\nmr@NMR_250MHZ
##.OBSERVE FREQUENCY= 250.131544655141
##.OBSERVE NUCLEUS= ^1H
##.ACQUISITION MODE= SIMULTANEOUS (DQD)
##.ACQUISITION SCHEME= undefined
##.AVERAGES= 16
##.DIGITISER RES= 18
##SPECTROMETER/DATA SYSTEM= dpx250
##.PULSE SEQUENCE= zg30
##.SOLVENT NAME= CDCl3
##.SHIFT REFERENCE= (INTERNAL, CDCl3, 0, 16.522)
##AUDIT TRAIL= $$ (NUMBER, WHEN, WHO, WHERE, WHAT)
$$ ##TITLE= Audit trail, XWIN-NMR		Version 3.5
$$ ##JCAMPDX= 5.01
$$ ##ORIGIN= Bruker BioSpin GmbH
$$ ##OWNER= nmr
$$ C:\u/data/dgb/nmr/ADRS/2990/pdata/1/auditp.txt
$$ ##AUDIT TRAIL=  $$ (NUMBER, WHEN, WHO, WHERE, WHAT)
(   1,<2007-04-24 15:07:00.08 +100>,<MAYBRIDGE\nmr>,<NMR_250MHZ>,
      <created by zg, POWCHK disabled, PULCHK disabled
       configuration hash MD5:
       76 6E 9A 78 1E 09 19 81 EC 84 63 8F B0 6A 59 2D
       data hash MD5: 64K
       EA C3 44 FB 19 11 7F 09 60 2C 39 A7 8A E1 C2 5E>)
(   2,<2007-04-24 15:07:11.25 +100>,<MAYBRIDGE\nmr>,<NMR_250MHZ>,
      <Start of raw data processing
       ef LB = 0.3 FT_mod = 6 PKNL = 1 SI = 32K 
       data hash MD5: 32K
       8F 01 99 9F 3A 39 9F 97 56 32 18 6B 5D E0 CA 7C>)
(   3,<2007-04-24 15:07:12.96 +100>,<MAYBRIDGE\nmr>,<NMR_250MHZ>,
      <apk 
       data hash MD5: 32K
       51 05 77 7A 45 E3 25 A1 B2 B7 F4 34 24 BA 93 AB>)
(   4,<2007-04-24 15:07:13.72 +100>,<MAYBRIDGE\nmr>,<NMR_250MHZ>,
      <abs ABSG = 5 
       data hash MD5: 32K
       1C B6 22 A7 88 E8 D3 E1 09 E8 F8 B7 DE DB D7 E5>)
$$ ##END=
$$ 
$$ hash MD5
$$ CB E0 0F 84 C8 C1 50 70 0A 63 5D 4B BC 53 13 80
##$RELAX= 
##$RELAX= 
##$RELAX= 
##$RELAX= 
##$RELAX= 
##$RELAX= 
##$RELAX= 
$$ Bruker specific parameters
$$ --------------------------
##$DU= <C:\u>
##$EXPNO= 2990
##$NAME= <ADRS>
##$PROCNO= 1
##$TYPE= <nmr>
##$USER= <dgb>
##$AMP= (0..31)
100 100 100 100 100 100 100 100 100 100 100 100 100 100 100 100 100 100 
100 100 100 100 100 100 100 100 100 100 100 100 100 100 
##$AQSEQ= 0
##$AQ_mod= 3
##$AUNM= <au_zg>
##$AUTOPOS= <33 >
##$BF1= 250.13
##$BF2= 250.13
##$BF3= 250.13
##$BF4= 250.13
##$BF5= 500.13
##$BF6= 500.13
##$BF7= 500.13
##$BF8= 500.13
##$BYTORDA= 1
##$CFDGTYP= 0
##$CFRGTYP= 5
##$CHEMSTR= <none>
##$CNST= (0..31)
1 1 145 1 1 1 1 1 1 1 1 1 1 1 1 1 1 1 1 1 1 1 1 1 1 1 1 1 1 1 1 1 
##$CPDPRG= <>
##$CPDPRG1= <>
##$CPDPRG2= <>
##$CPDPRG3= <>
##$CPDPRG4= <mlev>
##$CPDPRG5= <mlev>
##$CPDPRG6= <mlev>
##$CPDPRG7= <mlev>
##$CPDPRG8= <mlev>
##$CPDPRGB= <>
##$CPDPRGT= <>
##$D= (0..31)
0 1 0 0 0 0 0 0 0 0.06 0 0 0 0 0 0 0.0002 0 0 0 0 0 0 0 0 0 0 0 0 0 0 
0 
##$DATE= 1177423619
##$DBL= (0..7)
120 120 120 120 120 120 120 120 
##$DBP= (0..7)
150 150 150 150 150 150 150 150 
##$DBP07= 0
##$DBPNAM0= <>
##$DBPNAM1= <>
$$ [...]
##$SUBNAM7= <"">
##$SUBNAM8= <"">
##$SUBNAM9= <"">
##$SW= 20.6930455092707
##$SWIBOX= (0..15)
0 0 3 0 0 0 0 0 0 0 0 0 0 0 0 0 
##$SW_h= 5175.983436853
##$TD= 65536
##$TD0= 1
##$TE= 683.16
##$TE2= 300
##$TE3= 300
##$TEG= 300
##$TL= (0..7)
0 120 120 120 120 120 120 120 
##$TP= (0..7)
150 150 150 150 150 150 150 150 
##$TP07= 0
##$TPNAME0= <>
##$TPNAME1= <>
##$TPNAME2= <>
##$TPNAME3= <>
##$TPNAME4= <>
##$TPNAME5= <>
##$TPNAME6= <>
##$TPNAME7= <>
##$TPOAL= (0..7)
0.5 0.5 0.5 0.5 0.5 0.5 0.5 0.5 
##$TPOFFS= (0..7)
0 0 0 0 0 0 0 0 
##$TUNHIN= 0
##$TUNHOUT= 0
##$TUNXOUT= 0
##$USERA1= <user>
##$USERA2= <user>
##$USERA3= <user>
##$USERA4= <user>
##$USERA5= <user>
##$V9= 5
##$VALIST= <valist>
##$VCLIST= <CCCCCCCCCCCCCCC>
##$VD= 0
##$VDLIST= <DDDDDDDDDDDDDDD>
##$VPLIST= <PPPPPPPPPPPPPPP>
##$VTLIST= <TTTTTTTTTTTTTTT>
##$WBST= 1024
##$WBSW= 4
##$XGAIN= (0..3)
0 0 0 0 
##$XL= 0
##$YL= 0
##$YMAX_a= 259787
##$YMIN_a= -430104
##$ZGOPTNS= <>
##$ZL1= 120
##$ZL2= 120
##$ZL3= 120
##$ZL4= 120
##$ABSF1= 16.522
##$ABSF2= -4.171173
##$ABSG= 5
##$ABSL= 3
##$ALPHA= 0
##$AQORDER= 0
##$ASSFAC= 0
##$ASSFACI= 0
##$ASSFACX= 0
##$ASSWID= 0
##$AUNMP= <proc_1d>
##$AZFE= 0.1
##$AZFW= 0.1
##$BCFW= 0
##$BC_mod= 0
##$BYTORDP= 0
##$COROFFS= 0
##$CY= 12.5
##$DATMOD= 1
##$DC= 0
##$DFILT= <>
##$DTYPP= 0
##$F1P= 14.0000005364418
##$F2P= -0.99999901652339
##$FCOR= 0.5
##$FTSIZE= 32768
##$FT_mod= 6
##$GAMMA= 0
##$GB= 0
##$INTBC= 1
##$INTSCL= 1
##$ISEN= 128
##$LB= 0.3
##$LEV0= 0
##$LPBIN= 0
##$MAXI= 10000
##$MC2= 0
##$MEAN= 0
##$ME_mod= 0
##$MI= 0
##$NCOEF= 0
##$NC_proc= -3
##$NLEV= 6
##$NOISF1= 0
##$NOISF2= 0
##$NSP= 0
##$NTH_PI= 0
##$NZP= 0
##$OFFSET= 16.522
##$PC= 1
##$PHC0= -56.42696
##$PHC1= 8.836281
##$PH_mod= 1
##$PKNL= yes
##$PPARMOD= 0
##$PSCAL= 4
##$PSIGN= 0
##$REVERSE= no
##$SF= 250.13
##$SI= 32768
##$SIGF1= 0
##$SIGF2= 0
##$SINO= 400
##$SIOLD= 32768
##$SREGLST= <1H.CDCl3>
##$SSB= 0
##$STSI= 32768
##$STSR= 0
##$SW_p= 5175.98343685301
##$SYMM= 0
##$S_DEV= 0
##$TDeff= 65536
##$TDoff= 0
##$TI= <Analysis number 999999
Compound Code 99
Book Reference 9
Project Code 9>
##$TILT= no
##$TM1= 0
##$TM2= 0
##$TOPLEV= 0
##$USERP1= <user>
##$USERP2= <user>
##$USERP3= <user>
##$USERP4= <user>
##$USERP5= <user>
##$WDW= 1
##$XDIM= 32768
##$YMAX_p= 380395324
##$YMIN_p= -77584
$$ End of Bruker specific parameters
$$ ---------------------------------
##NTUPLES= NMR SPECTRUM
##VAR_NAME=  FREQUENCY,     SPECTRUM/REAL,   SPECTRUM/IMAG
##SYMBOL=    X,             R,               I
##VAR_TYPE=  INDEPENDENT,   DEPENDENT,       DEPENDENT
##VAR_FORM=  AFFN,          ASDF,            ASDF
##VAR_DIM=   32768,         32768,           32768
##UNITS=     HZ,            ARBITRARY UNITS, ARBITRARY UNITS
##FACTOR=    0.157963299565203, 1,           1
##FIRST=     4132.6476996994, 0,             0
##LAST=      -1043.33573715361, 0,           0
##MIN=       -1043.33573715361, -77584,      0
##MAX=       4132.6476996994, 380395324,     0
$$ Real data points
##PAGE= N=1
##DATA TABLE= (X++(R..R)), XYDATA
$$ [...]
18908 31256 19302 -1703 -21406 -17700 -2510 -6497 3481 6868 22129 19292 27927 9032 30517
18895 30517 52979 33459 18120 4501 12582 8550 4121 2442 4029 13595 1306 -4656 12780
18882 12780 16048 11308 4092 -12149 -19798 -19125 -11933 -3283 -14622 -11301 -12000 -1828 12925 11394
18868 11394 -6033 -11622 -21456 -4181 21274 15704 14465 18369 3190 -10477 10037 14609 -16472
18855 -16472 -18578 -5404 -3224 -6387 -5442 -3661 -15540 -22417 -18443 -21832 -13302 -2906 16622 26286
18841 26286 15237 7774 -5515 6757 -545 -12817 -17316 -15988 -11828 -18303 -8875 473 16427
18828 16427 7231 12753 7263 -10349 8829 13494 7162 11339 15483 21704 24115 10956 -2142
18815 -2142 -16651 -16237 -22358 -38527 -44236 -19760 -4070 9218 20994 15514 9298 2947 -3883
18802 -3883 5054 -4301 -11517 -13296 -6771 -19465 -20132 -11676 -24361 -13135 1599 -1877 4618 24836
18788 24836 30825 17868 7561 22794 7818 -8922 -7858 -18208 -13280 -9347 -7648 -10785 -11665
18775 -11665 -6751 6496 14395 17555 25742 32834 47110 82695 140144 195914 197295 138412 87037
18762 87037 37237 18169 10929 2919 15127 22275 11436 22993 17054 7345 6011 -1750 15287
18749 15287 25304 27353 19865 37013 40231 43973 55501 47243 32903 22878 34971 21069 21521
18736 21521 12555 6329 -686 -2717 -942 15169 1070 -14267 -10832 -15002 -20714 -27458 -27227 -16435
18722 -16435 -17942 -13872 -7934 -2578 -1420 6687 -4042 -8099 -2552 11958 10000 -3891 -23163
18709 -23163 -12675 7382 7417 13624 5779 2560 -10044 -674 2592 -8236 -6993 1411 1548 9103
18695 9103 -5459 -24443 -11987 10252 9935 22211 21051 13581 7276 2683 -4414 -4122 -2348 11584
18681 11584 27794 8468 -11877 -19295 -5920 10440 15564 7015 -14541 -15323 -11918 -8909 -17253
18668 -17253 -37197 -22235 4664 -4965 -12690 -8443 -16232 -13910 -5327 8691 -162 1127 13650
18655 13650 15820 24127 33850 15669 8246 14963 20214 15063 15955 11337 -4331 7666 747 -28839
18641 -28839 -21888 -19211 -29047 -6459 4378 4426 14075 19857 26449 39454 16648 4851 -6679
18628 -6679 11350 14241 21073 32191 24580 1882 -28884 -46898 -39382 -18524 -372 5598 10111
18615 10111 21714 26199 19081 14230 3065 3521 -4742 -15270 4435 21912 22551 15033 21783 24487
18601 24487 31600 36465 23943 17295 5123 -12381 -21061 -12932 -25165 -27636 -23892 -16207 1288
18588 1288 23664 26293 17352 3358 -1913 2601 30419 26213 13118 18762 27139 14773 15701 38469
18574 38469 27249 -7385 -15775 -7212 14644 16629 15710 6183 2848 20726 24661 26548 17798 -130
18560 -130 2785 -1989 -3579 2873 10693 426 235 16904 12562 19355 30490 39900 40154 20228
18546 20228 11608 10340 14023 16578 20904 27106 19439 -1416 -5032 -2305 3834 -12922 -14268 -1514
18532 -1514 5212 -5757 -19847 -10358 -17888 -7293 6791 10677 11953 9598 -5697 -4929 4337 9949
18518 9949 29971 42319 31454 10010 13396 8629 -8198 -4320 6342 15578 13834 -2038 -21715
18505 -21715 -14371 -613 -4560 -582 -5679 -2195 -2444 -19131 -17759 -16476 928 12278 12788 17508
18491 17508 27551 32803 33227 27186 16237 42457 42373 21789 13473 15352 20448 26585 21168 15029
18477 15029 17353 18204 -4610 -2253 14571 20097 7759 7393 29185 52337 37848 17469 11562
18464 11562 19245 26186 37411 46274 69890 103257 132212 147460 171982 192098 223593 235123
18452 235123 227300 238205 220197 179346 166810 143602 109844 84951 55980 29078 22841 38131
18440 38131 45291 43225 24144 23013 49004 53104 47300 51665 43105 30443 39362 28228 26052
18427 26052 45834 65839 98477 137487 163375 188918 192889 198727 208159 200558 203652 192391 166148
18414 166148 129572 103001 76619 57238 35472 20795 14462 2788 -2407 9346 6688 1007
18402 1007 4700 5799 4090 5777 16099 39096 19237 -4969 -6117 18906 32344 20835 1999
18389 1999 12114 3509 11761 14061 17612 16340 17320 23064 6075 10616 25641 41149 33008 18108
18375 18108 12695 4325 6138 20735 20105 15752 6086 233 1382 5672 13802 13693 41900 40965 44202
18360 44202 45608 51881 43838 38414 20623 -3525 -12506 -1528 8140 10634 16324 27338 7324
18347 7324 -503 -843 -7939 -11910 -2455 20782 12818 6191 3893 -996 4799 18211 12705 10717
18333 10717 -2828 -8615 -3451 9413 15711 -4212 13354 30244 36457 29440 21304 37585 21433
18320 21433 -691 8447 22662 1627 1309 6739 1503 10654 26977 27284 33174 26186 19255 6589
18306 6589 7512 11975 7845 15629 32641 18336 10695 15388 9373 -7023 2406 6330 -86 -7710
18292 -7710 2636 -2410 25591 34645 22949 26542 29749 32599 26507 38823 40789 46188 53996 54853
18278 54853 63013 74659 81669 53019 44153 46520 46292 40968 36285 22443 11968 19016 38765
18265 38765 55258 55100 52922 57438 48021 26442 6841 16209 26089 41489 53359 57400 45377
18252 45377 40437 46289 42450 16440 530 25088 49878 53566 39810 51137 68015 73377 72494
18239 72494 64454 69669 67572 77651 71836 37985 13120 15511 25202 22413 6555 18420 33232
18226 33232 40068 56608 51569 29226 32046 26970 43177 31779 30939 44365 51393 26684 19131
18213 19131 4060 17009 40160 49251 56751 50853 48625 62569 63518 58054 63681 56517 62360 61878
18199 61878 31933 24083 14311 17768 26873 29461 39058 36070 30488 22525 31104 28636 47433 60959
18185 60959 68194 61784 66659 54243 53011 54371 63746 68917 62061 62413 62734 59551 60142 60731 46304
18170 46304 48622 48179 59580 72781 77661 55073 61691 72422 57387 42512 47456 69506 79690
18157 79690 71289 73790 79264 90972 94107 93470 96985 95160 102774 125333 137705 139541 136927 124071
18143 124071 100327 119177 152999 164294 159256 173513 185898 197506 201829 222097 252283 258874
18131 258874 261603 297737 335719 365569 406579 424192 450055 496789 550571 620263 719252 834549
18119 834549 983225 1161685 1425069 1776298 2272606 3016521 4222001 6301474 10066283
18110 10066283 17066837 28598648 38831324 40981202 32072710 18693312 10970086 6991695
18102 6991695 4776558 3399185 2517639 1943894 1538448 1239481 1030722 877724 743581
18093 743581 632491 551359 499325 462100 403562 360574 345936 328237 312420 282661 246085
18082 246085 225971 209527 182178 177649 177520 157746 158431 160658 164963 161133 145414 130192 110960
18069 110960 114678 118524 109229 104878 101255 89026 78432 73977 91398 80759 56228 58657 59278
18056 59278 56301 76336 92953 84724 78677 83939 89180 96928 78338 53571 57731 54935 46743
18043 46743 40880 38773 56172 43161 14188 22738 13133 33251 66214 63597 53353 60052 68866
18030 68866 45525 47642 51541 68798 91139 99290 97297 77859 60911 64033 88119 87705 69772
18017 69772 61120 77889 93891 85025 77393 75313 91606 104412 114624 107809 112456 123610 132577
18004 132577 129521 135847 149136 151671 165417 174468 192022 217659 245088 257964 286554 339328
17992 339328 410790 551291 820015 1171261 1439566 1432178 1141126 848743 746658 813839
17982 813839 1046457 1339931 1465217 1314343 928520 604580 424636 321216 268165 237987
17972 237987 234941 221040 210339 236744 249633 260159 285701 302630 307093 319532 332862 374836
17960 374836 456940 592517 839497 1229377 1624128 1757126 1534341 1131426 895133 901379
17950 901379 1088210 1425739 1730603 1733836 1369156 902607 611483 442875 349974 299139
17940 299139 259536 243883 236108 225761 205340 226726 232346 222928 225609 220154 207997 187945
17928 187945 176006 167429 164813 159381 147305 133428 126687 155938 173098 176512 175906 186723 210019
17915 210019 212863 201696 212970 223338 244264 262523 286587 300708 322519 333149 368033 385702
17903 385702 414806 475352 523394 547173 567894 589631 616679 621136 635193 663943 698846 722243
17891 722243 752192 791580 843309 926529 1043159 1157571 1290195 1447149 1612176 1783632
17881 1783632 2022628 2329196 2760536 3350046 4235345 5633420 7918034 11621462 17053358
17872 17053358 23082277 28181576 31614160 33624745 35105435 35866581 35654379 34973769
17864 34973769 32836474 29264354 24985621 19295386 13406306 9310713 6845164 5344635
17856 5344635 4400699 3837766 3496600 3297005 3182652 3173701 3203208 3291329 3440590 3683484
17846 3683484 4054950 4596657 5452398 6895544 9333747 13348601 19287732 25843166 31332642
17837 31332642 34996317 37051273 38582620 39350996 39032716 38192886 35754542 31707491
17829 31707491 26875500 20551194 14041997 9497949 6750585 5056290 3984724 3332669
17821 3332669 2944410 2719371 2649494 2619668 2551837 2489787 2550339 2656867 2645570 2426629
17811 2426629 2085985 1856863 1719070 1547267 1296020 1049636 893993 789263 715955 660868
17801 660868 591623 545652 487205 436475 393283 348183 330561 343050 342093 347094 355739 379469
17789 379469 449214 569790 716068 910700 1083864 1187912 1276085 1483165 1728339 1804562
17779 1804562 1619592 1328971 1198113 1113191 970536 731268 490605 349219 270463 233940
17769 233940 210031 173192 145344 148350 134964 131099 119606 119521 123942 101327 82628 64697 48421
17756 48421 48680 52901 68707 84501 80061 50965 44556 74188 77857 67164 74882 77764 106445
17743 106445 105819 96184 81929 82259 77778 61701 39876 40079 43483 31679 18320 8650 16639 30411
17729 30411 31651 31815 37183 26221 28512 27927 27335 31467 44459 52257 37944 37276 41179 60253
17715 60253 50778 37574 27992 30052 29413 32851 43077 34054 20764 33536 47507 54905 66483
17702 66483 75961 83326 118623 173032 217115 263046 308830 336530 336084 309301 271044 213055
17690 213055 156152 133189 131490 115096 85306 52597 50298 45472 37967 31575 10267 21453
17678 21453 31606 22236 31576 58329 64534 54346 65325 85627 107143 107655 118426 132035 175883
17665 175883 259742 335787 392457 472382 583321 736924 937675 1121703 1232885 1212089
17655 1212089 1063757 836032 617018 430232 312762 231036 198073 172556 160787 157626
17645 157626 147492 143671 159872 186704 243558 340018 496468 746657 1074155 1402367 1574322
17634 1574322 1534821 1276033 965586 686884 509963 438230 468120 587354 754701 924162
17624 924162 969250 921310 752757 547167 383925 267115 205861 184391 160268 141513 138045
17613 138045 148858 147871 151411 175765 203587 266655 373021 534427 768035 1065295 1292225
17602 1292225 1353197 1203353 920006 653684 431027 287811 195963 131364 99077 93490
17592 93490 91237 93579 104049 79873 67573 77142 72966 61024 63695 79570 72336 71177 69603
17579 69603 61204 48181 40985 26246 14100 44010 58616 45433 41085 49796 49175 37520 25524
17566 25524 4342 7071 26378 26413 17692 24485 49197 48655 34941 22620 14489 21492 25923 18056
17552 18056 21139 11976 21165 48250 54871 43743 47894 50233 59182 58690 54141 47836 38531 36107
17538 36107 56490 61934 74184 72318 72628 88457 112109 120703 121558 128587 139770 148991 173923
17525 173923 221285 292208 395601 512802 596080 620929 607760 700533 929581 1166813 1311700
17514 1311700 1297150 1183764 1101001 1108953 1197560 1294062 1288703 1172309 933773 743088 703132
17503 703132 741506 781650 783031 731879 674315 621079 591007 657522 788273 935097 1008764
17492 1008764 941399 857158 812986 820325 881107 943322 900763 789306 594459 485347 441311
17481 441311 447363 427406 345282 258239 200456 142538 104171 89866 73789 59798 61992 75829
17469 75829 63455 42074 27540 55290 79784 106779 74127 58699 44230 52257 33197 21070
17457 21070 30689 22696 22798 37102 22305 14514 19051 14762 18238 42250 48611 60490 93008
17444 93008 127184 172208 233149 265625 254527 182259 126559 81435 65138 70625 64748 68397
17432 68397 83236 77935 65516 55123 47915 48589 45974 43105 35005 19563 -2700 592 -1042
17419 -1042 4025 4176 22965 31715 26133 10387 14933 17807 21922 45747 60386 62113 78897 75740
17405 75740 59099 39871 41415 43383 54117 44824 40670 46994 55041 53775 34676 22469 20617
17392 20617 34077 24720 9990 27079 44765 48139 40167 24999 848 -1465 19672 35312
17380 35312 39455 35879 32103 33602 32883 19605 26357 33884 35674 27234 21989 23962 25792 26141 14938
17365 14938 36806 47837 33427 34270 44208 52881 65750 67663 71137 56860 51496 47298 35506
17352 35506 44291 36533 27117 25456 43606 70452 56033 69134 74473 71838 64561 59247 59040 48924
17338 48924 58476 69962 63381 76411 83120 92996 107661 112058 118648 117290 123943 128469 128160 134777
17324 134777 154414 173839 188667 218166 289407 399280 569726 836925 1138700 1453983
17314 1453983 1784449 2051657 2122949 1973596 1654806 1359083 1069627 789150 546841 382240
17304 382240 304630 274338 242710 224127 203559 171872 143774 154157 170435 159142 170453
17293 170453 185822 187064 201996 208350 248146 293220 357965 458703 612064 850157 1161151
17282 1161151 1488201 1793100 1991878 2034621 1881015 1592767 1313296 1042902 755015 568878
17272 568878 452422 361688 301741 238541 190383 148620 123515 107590 104461 120201 125764 133353
17260 133353 145786 164422 154287 134713 137187 131828 131016 151032 175035 212410 217655 242388
17248 242388 289454 342975 371591 393867 399419 393776 378297 369528 364494 331647 304000 269961
17236 269961 217180 181163 160674 152791 152454 148404 135262 145784 163704 160814 166309 185345 182119
17223 182119 191900 207232 235371 235260 252502 265172 291780 318682 316788 343615 373551 389762
17211 389762 415185 455999 528648 582188 660514 733132 778461 821804 842483 845668 857471 884201
17199 884201 946230 1049296 1171187 1331033 1468570 1569744 1698847 1844580 2014595 2200393
17189 2200393 2457434 2852839 3432818 4298835 5655907 7837433 11417721 17178371 25266406
17180 25266406 34402666 43451023 50808000 54995329 54381327 48528803 39891068 31142014
17172 31142014 22340653 15138953 10475352 7617503 5840413 4689540 3938546 3476952
17164 3476952 3225077 3089227 3016677 2972066 2952470 2957931 2995273 3105440 3285205 3611599
17154 3611599 4139593 4946174 6144868 8051544 11201217 16309980 23530259 31718621
17146 31718621 39849052 46483674 50189876 49493340 44056089 36070366 28018385 19904802
17138 19904802 13200544 8899407 6276790 4654753 3587847 2865604 2365015 2025271
17130 2025271 1771313 1573803 1438344 1306400 1213953 1107143 1020094 982607 956239 950709
17120 950709 954767 934859 887062 835129 773585 677660 569818 488286 432644 370251 292864
17109 292864 218712 195596 187396 180722 177201 162579 150230 170063 184005 174932 161509 145353
17097 145353 130307 114408 102568 99442 104568 121491 125350 124244 122661 119775 99508 75679 64372
17084 64372 67831 60801 39073 34977 56111 39518 13305 18271 25750 43211 65546 63415 79402
17071 79402 76333 66967 55059 56659 70201 77605 70861 78264 94930 92979 85052 79082 53683
17058 53683 28045 11311 37497 58898 77759 91888 78024 54019 35381 17808 17160 9665
17046 9665 32159 11736 311 17882 16466 -2076 -10514 -30663 -29729 -10098 2340 -15064 5697
17033 5697 33145 11775 -299 4264 7452 4629 -2723 -30657 -31331 -9447 13176 28580 47113
17020 47113 35895 24125 17918 25694 13541 -10783 -26859 -21951 -5611 -6410 -10061 -25085 -32103
17007 -32103 -12393 -13143 -18573 -10144 -9619 3553 8385 303 -21177 -41569 -34377 -5523 -1661 -42
16993 -42 5652 20474 24119 -12938 -28743 -3775 12469 31485 37409 36461 59493 57801 43247
16980 43247 27145 21720 32573 40437 37974 50630 43436 25155 -2914 -13086 1279 2262 -1669
16967 -1669 -2247 -3131 -803 12277 27381 32958 9468 -10306 -11547 -197 5662 1343 1069 9191
16953 9191 -1865 -15368 -11306 -17356 -13249 -22441 -21948 -12884 -20614 767 32923 27559 752 -8086
16939 -8086 -15211 -15584 -14912 -31283 -39006 -23954 -8299 -1454 -15157 -13732 -11006 -22803 -12741 10574
16925 10574 -7832 -26457 -17686 -18448 -17777 -14498 -27150 -36452 -35034 -32431 -27262 -24083 -19717 -23029
16911 -23029 -21252 -16624 -6265 -12276 -19735 -12739 -32689 -46398 -19722 -13541 -10303 -17474 -21737
16898 -21737 -11763 -6800 2850 3135 8451 9282 -457 -8389 -2741 -1145 10495 17094 11348 7419 16864
16883 16864 31813 39783 30231 21833 19879 3200 -4971 -16417 -23020 -19710 6063 12713 -5368
16870 -5368 -3798 18171 23288 37202 38437 5117 -29237 -48329 -28273 -7743 2058 4407 -9573
16857 -9573 -6957 -7567 -5459 -1704 -1089 1540 -17524 -15211 -1351 -925 -3814 -15106 -19912 -10235 -4207
16842 -4207 1361 -12748 6622 9967 16298 29195 21470 -6885 -2466 -5287 -14598 -13909 -18199 -15416
16828 -15416 -13189 -14060 -7128 -13727 -26496 -23126 -14448 -17139 -13584 -8118 -12411 -22474 -19950 -21069
16814 -21069 -41188 -32373 -3256 4217 1091 -12050 -13520 -15496 -1898 -9613 -15133 -21882 -19076
16801 -19076 -17412 -12641 -6929 17050 21045 23277 21087 6822 1192 6654 3073 585 -7658 -15877
16787 -15877 -17843 -9906 2924 -741 1403 -4445 -20698 -41974 -20657 -27209 -39306 -33559 -17792
16774 -17792 1116 14278 21144 27354 20315 2812 -19155 -22594 -38121 -36656 -59299 -76070 -77584
16761 -77584 -62211 -50297 -50669 -43503 -15241 -9567 -11488 -8135 12612 16263 8053 9774 2258 -12778
16747 -12778 -14117 -15327 7059 12806 7788 -4305 -23540 -38031 -41470 -59224 -44538 -30600 -23393
16734 -23393 -17415 -12559 -15879 -12373 -19142 -32607 -26559 -25481 -20071 -11694 -25953 -17468 2876 4369
16720 4369 5621 -6450 -194 15492 11369 3197 -13900 -13965 -12252 -35124 -26666 -26461 -13678 -2471
16706 -2471 -3433 11449 22768 -1646 -16193 -18778 -29882 -47508 -46880 -30704 -34387 -35949 -39809
16693 -39809 -47123 -29994 -18103 -14554 1756 -24 -6320 -19016 -14158 -12216 -11985 -18878 -13070 -23756
16679 -23756 -17420 -23364 -24805 -23646 -4538 9087 12599 6618 786 3388 2134 -9283 -507 13243
16665 13243 11530 8249 16927 15086 22191 22959 -7986 5438 47539 95194 143611 202495 252884
16652 252884 273786 256131 247631 238449 196218 146158 97896 52439 25637 5296 -6263 -20305
16640 -20305 -8893 -1923 -10780 -15126 -562 9646 13201 4752 -6533 12901 45709 44039 24359
16627 24359 22228 14022 34493 44198 82383 132367 163914 180281 211082 230920 224385 219380 188184
16614 188184 141942 101360 52852 17512 13773 26558 26115 20966 13125 -15753 -33747 -39838 -31533
16601 -31533 -19147 10292 15970 3875 -12727 -440 -9114 -25982 -45381 -43094 -37080 -25248
16589 -25248 -4233 -6906 -11757 -14464 -8444 -478 1492 2219 -10000 -27015 -31992 -5045 -16276
16576 -16276 -30974 -28567 -36487 -34532 -21302 -16088 3569 11248 3847 -4367 -15831 -30409 -24345
16563 -24345 -15011 -26788 -38925 -23773 -25016 -16309 -21065 -27785 -38408 -56455 -48987 -36579 -45828
16550 -45828 -53126 -63885 -45895 -35923 -30185 -21534 -25434 -30369 -14711 -16000 -14066 -16797 -12787 -5555
16536 -5555 5507 3416 -4449 -27229 -29846 -30350 -27001 -9414 9429 15709 -829 -16965 -24771
16523 -24771 -32607 -20863 -7203 -7852 -15331 -17365 -13777 1761 -18632 -29255 -24393 -25687 -15712
16510 -15712 -1 7546 -2033 -20195 -33201 -44101 -35847 -28106 -34672 -43953 -48750 -45672 -26590
16497 -26590 -20610 -26461 -24501 -21186 -43404 -28293 -18651 -9246 -17966 -27773 -49839 -54887 -46657 -45950
16483 -45950 -35237 -25231 -2638 14168 18971 17368 8948 1598 -22815 -38393 -26664 -13395
16471 -13395 -6126 5278 4458 -10586 -12524 -15455 -14220 -9570 932 -10300 -24698 -26009 -21723
16458 -21723 3085 -5284 -16058 -35608 -28280 -1070 9855 9441 2041 5968 -2434 4088 3132 -695
16444 -695 -11484 -1570 -2625 -10575 -193 15 6653 -15066 -36899 -40896 -35238 -18843 -39400 -52214
16430 -52214 -24957 -12705 -14783 -4229 -8861 -20593 -34470 -27884 -8718 2238 -97 -1701 -16989
16417 -16989 -23450 -16774 -3253 -12773 -24356 -18742 -6796 -1030 21090 26732 9624 -8851 -2674
16404 -2674 -4749 -22947 -16189 -708 -16039 -2471 -5896 -15730 -18153 -14229 -29737 -39159 -21191
16391 -21191 -15026 -9035 -13691 -12327 -9970 -19379 -20798 -30107 -27186 -8006 -14413 -23821 -10701 -16129
16377 -16129 -18425 -16687 -22295 -36691 -24059 12633 4956 1317 15257 -266 -18789 -13490 -30344
16364 -30344 -41544 -28527 -17860 -8332 -8056 -1452 3328 -4502 -11293 -9370 -11925 -18565 -14049 -24433
16350 -24433 -34352 -47201 -39408 -40126 -35353 -20907 -20648 -28308 -29398 -24264 -20941 -36002 -47666 -27149
16336 -27149 -19482 -21161 -9248 8904 12874 -10486 -20146 -14993 -20818 -8411 1948 -4296 -16096
16323 -16096 -17404 -18909 -28548 -26856 -37053 -24677 -14399 -30109 -53685 -42644 -40633 -46143 -49877
16310 -49877 -61610 -45042 -43811 -41053 -43173 -29408 -9032 -3430 -13142 -11831 -2143 -566 1603
16297 1603 -1986 -3294 -18521 -25387 -19644 -5216 19385 5715 -1685 -11145 -30487 -34892 -17465
16284 -17465 -21301 -38800 -49014 -37063 -27712 -22671 -19257 -25618 -17581 -191 -1292 -9754 -15013
16271 -15013 -15360 -34501 -44780 -47484 -36286 -40821 -46577 -17160 -11711 -22435 -19048 -12812 -8620
16258 -8620 -12581 -19607 -23818 -14964 3144 -7961 -7393 1885 17607 27744 2435 -10064 -22682
16245 -22682 -44003 -45518 -28902 -33024 -26991 -30250 -17402 907 3448 7393 -6773 -18349 -33625
16232 -33625 -36167 -20433 -28939 -15487 -384 -5465 -15961 -21324 -38984 -39101 -37638 -20152 -10812
16219 -10812 -11587 -28233 -44667 -32212 -13488 -11100 -23436 -37498 -32100 -15733 -15155 -8482 -2212
16206 -2212 -10257 -5231 -9039 1179 5669 4260 5540 245 3155 -690 -24188 -47641 -49186 -37199
16192 -37199 -18474 -14446 -11390 -6432 -2876 -6382 -17407 -9293 -13895 -28146 -15874 -11112 3964
16179 3964 5946 -27575 -30482 4764 -1014 -6816 -22333 -16949 -13959 -164 8846 11421 14597 13154
16165 13154 5218 14140 9682 -4523 -10048 -8177 -10156 -21028 -21906 -6009 -8027 -15686 -14882 -10128
16151 -10128 227 -1294 9221 13721 7335 -2897 -7431 4126 -3669 -20577 -26384 -21981 -4569
16138 -4569 4726 5494 -15283 -22707 -15399 -6419 -17410 -31007 -20227 -9472 -20426 -10991 -2965
16125 -2965 -16882 -32151 -25916 -22670 -9656 24426 9912 -9607 -17579 -793 12065 10580 12300
16112 12300 -9130 -21790 -11520 -13329 -35606 -16734 -4197 2482 -5398 -26294 -24832 -21955 -19121
16099 -19121 -199 25315 -2001 -21733 -26312 -11309 -13720 -617 14140 25477 20371 3880
16087 3880 -10799 -12381 -685 -10457 -8495 1059 8289 -3760 -18504 -19575 -19776 -21480 5857 20939
16073 20939 13336 8269 11064 -8034 -16915 -17242 -5478 -17258 -14078 -8897 13344 20644 3622
16060 3622 -14611 -9708 -8711 -13061 -18786 -17856 -10579 1001 10883 13058 5570 -6012 -4931 -10031
16046 -10031 -17217 -5072 13459 12864 -48 1284 -402 -9514 3721 8058 -6289 -4509 -3905 -5665
16032 -5665 15077 25987 25630 16847 23835 28215 31550 41883 43086 13141 10480 13112 4875 9157
16018 9157 16964 -9947 -28542 -30266 -22198 -26547 -33737 -28258 -46858 -55647 -32436 -38369 -50582
16005 -50582 -45324 -33591 -36999 -17706 -3710 -7980 -3494 9895 3198 -20461 -26421 -38284 -48620
15992 -48620 -29670 -21889 -21009 -9348 293 2384 6661 16506 7326 -6725 -10606 -12186 -23987 -27818
15978 -27818 -30925 -36716 -36403 -23543 -28328 -8313 -15585 -31891 -25152 -27192 -41983 -25390 -15294
15965 -15294 -22197 -20502 -36169 -18097 -15995 -37192 -36380 -42923 -55831 -38602 -30293 -29361 -36685 -37965
15951 -37965 -16269 -15291 -6466 7008 8795 22284 27863 7643 -16928 -35342 -44413 -35803 -25145
15938 -25145 -9068 9947 19699 8491 15904 1405 -11537 -8520 -16957 -33067 -44201 -27399
15926 -27399 -15353 5878 13318 14270 12884 15305 12936 -510 -6919 5259 -4058 -23084 -17831
15913 -17831 -7239 16778 25361 35218 17229 9858 9359 16544 38447 42214 42337 50300 40218 23184
15899 23184 7490 -7043 -16244 -15024 -18506 -18750 -6807 16764 21435 16843 4774 -3949 -10158
15886 -10158 -20457 -18838 -12390 -14457 844 7479 -560 664 7954 11281 8324 5068 -7959 -9321
15872 -9321 -16876 -33282 -36299 -38475 -27223 -17469 -15554 -14803 -1598 -10497 -9394 -8299 -7445 1097
15858 1097 -16297 -12723 -13487 -14456 -12751 -11904 -4686 -12634 -24983 -11074 -3010 13642 15365 10707
15844 10707 9595 -12060 -19891 -25398 -15965 -10798 -16602 -19354 -36250 -27930 -23056 -33918 -36722 -16589
15830 -16589 -7163 -5000 -463 -2899 -15987 -10585 -3658 6641 24460 19827 -18860 -29949 -15219
15817 -15219 -3462 7134 -1115 -2343 -6953 -23829 -19155 4426 2948 5911 1526 3836 -2347
15804 -2347 3285 996 2013 11140 23777 21887 14732 -5159 -7322 9027 25113 27107 2807
15791 2807 -3965 -11396 -8576 -10903 -11721 -803 11490 7672 6602 14881 -384 -5824 8448 10893
15777 10893 12852 29435 23196 17128 24935 -7790 -18021 -3376 -3174 15300 39188 27145 3231
15764 3231 -19113 -21894 -302 9893 6480 5497 -7973 -3196 2258 8747 -2762 -5422 -718 1414
15750 1414 -15100 -20529 -20400 -30162 -19869 5271 -9943 -28084 -24570 -1442 7936 3888 3436 -13676
15736 -13676 -25275 -6997 -14328 -20442 -12405 -10336 -28134 -33355 -45556 -42275 -33481 -32188 -33091 -46402
15722 -46402 -36945 -33769 -39631 -35463 -19353 833 7138 6370 -4011 -5798 -23960 -25845 -12429
15709 -12429 -10156 -15204 -17616 -36153 -32406 -14149 5637 18837 -1668 -4452 -19192 -11847 3232
15696 3232 -327 -1474 7811 -435 -15257 -13556 -19747 -25292 -27743 -16453 -4932 -7568 -3108 6360
15682 6360 2668 2120 9398 10513 -10277 -8208 70 10940 11141 22127 18091 7882 14055 5677
15668 5677 6653 14848 7820 -1083 -11421 1141 12062 17888 5641 -12313 -23895 -16878 -14393
15655 -14393 -5610 -11056 30 15531 9584 1523 8775 1383 6489 10957 13590 11389 -8432 -6838
15641 -6838 2539 3350 -3731 7179 18807 28011 30783 27518 25579 26935 23062 21264 24161 21852
15627 21852 25926 25728 -3600 -20923 -22047 -22348 -26199 -21732 -5027 4184 -1745 1353 -13922 -19743
15613 -19743 -12689 -27699 -21438 -8641 -5035 -8131 -11432 1016 8549 7270 16616 16789 11165 6741
15599 6741 -2760 -19584 -22609 -17070 -35069 -41274 -40699 -28063 -12996 -5579 -4332 -17634 -10591 6899
15585 6899 -3853 -12011 657 -5937 -14027 -19973 -4881 -5616 -1003 11849 -3904 -6726 272 5428
15571 5428 13167 2255 2641 -3782 -3625 10503 25982 5836 -16359 -13886 8655 5669 2338 15380
15557 15380 -7026 -23824 -3845 -23885 -29412 -15576 -8611 -16152 -26940 -36940 -20846 -19445
15545 -19445 -20772 -28272 -15617 -1279 -17331 -26971 -20548 -36295 -17665 -5324 -2890 2862 8955
15532 8955 23283 6701 -9364 -18102 -12614 -545 1563 8459 23157 5274 13405 17412 1612
15519 1612 -1645 15921 8111 7007 18691 15074 -1273 -14665 -14503 -7772 -2038 -3989 1870 7836
15505 7836 9932 18743 17746 12037 -10572 -10584 -9950 -21670 -12647 -14617 -11354 -5637 -15826 -8603 -11622
15490 -11622 -3917 -7560 6572 1511 -23221 -23924 -15389 -4990 -9783 -15710 -13477 2107 7024 15077
15476 15077 27163 29133 26420 12272 6920 -5939 10066 25216 31764 42720 49904 42261 23943
15463 23943 15518 -1389 2056 13201 24736 16787 1055 22912 30198 4320 -1650 -11925 -22701
15450 -22701 -1227 -2919 9101 21743 13774 -11106 -1642 6523 14641 7183 745 -15503 -14188
15437 -14188 2909 2393 -1955 -11449 -14187 -6809 16702 9340 3553 9594 11834 -1812 -8699 -14156
15423 -14156 2723 3330 4202 17544 12523 -546 -7321 -1338 -6237 -24495 -25029 -3981 1452 -2794
15409 -2794 12068 25577 17724 17128 20962 21618 27907 10527 9031 20956 28682 26878 9186 10577
15395 10577 25106 36950 31854 20456 20609 -3595 6814 13800 16711 14796 15870 2928 16848
15382 16848 29982 19631 18164 9676 -29970 -40729 -15540 1313 19088 8851 -9864 -23730
15370 -23730 -14871 6827 16893 4727 -10250 -20895 -30459 -25578 9109 24815 16943 5064
15358 5064 13482 25002 17512 9745 17796 25262 -1387 -12976 5516 26892 24105 13093 -3288
15345 -3288 -15294 -16506 -15826 -13190 -22189 -39449 -36259 -28661 -14099 -11991 -4444 9576 7891 2441
15331 2441 -12777 -7516 -16356 -15408 -8816 10858 6995 18894 24120 34574 10208 -8323 -10078
15318 -10078 -1448 6412 9685 3448 719 -820 -4251 -21632 -22758 -6497 9126 11715 18688 7748
15304 7748 889 -11994 -15022 -19048 -17921 -19848 -6857 -11147 -24106 -35196 -22881 -11002 -5066
15291 -5066 -3601 -12551 -5582 -6824 6009 4774 16462 13578 7796 11981 12900 9593 11806 4752
15277 4752 -150 12208 4627 3602 9156 6608 2722 4217 11608 -1590 13849 8551 3680 13698
15263 13698 8945 2514 -5990 3380 611 13312 7667 5206 4561 -8279 4441 4885 26280 23393
15249 23393 16589 19198 10785 1855 17943 25284 14709 24069 26242 21669 16669 -3617 -12438 -18002
15235 -18002 -16481 -3404 3689 -2825 -7622 6640 1343 -454 -4361 1145 -21965 -25363 -5209
15222 -5209 340 14213 22054 25754 38122 37444 31753 15466 32981 35605 18015 1704 8950
15209 8950 11781 -8887 -10011 -11085 12065 15190 3503 10383 4501 16721 16074 1373 -1369 1232
15195 1232 -10399 -10530 -17156 -4935 3633 5473 1151 7594 -4064 -17514 -28595 -28021 1156 7589
15181 7589 13645 -4586 -11401 9376 14314 20767 19335 16062 21882 23153 25328 22339 17811 23338
15167 23338 32621 28267 -26 5899 14448 6809 11828 16153 21319 10510 -1252 -5050 -13495 -23535
15153 -23535 -32130 -28890 -18652 -28442 -12526 232 -6259 -9848 315 9056 22630 24531 39605
15140 39605 35161 33506 35962 31404 14842 1772 774 -181 9062 7824 10020 12097 26231 21204
15126 21204 29872 33717 21013 3928 -3034 5652 20012 11052 -928 10066 -4845 -16648 -24631
15113 -24631 -11336 -17926 -25945 -26396 -21165 -14850 -16124 -13255 -15567 -992 23740 25875 20997 22588
15099 22588 11107 -4549 -13056 -250 -1732 3595 2515 -9047 -7116 5277 -184 6911 36227
15086 36227 38350 49551 43925 40337 29319 15312 2074 7392 7762 2178 81 5737 1623 -11212
15072 -11212 -8778 -15097 -2277 9138 13003 9348 -12855 -27313 -22505 -3784 14041 19257 18669
15059 18669 26661 13846 -4651 6425 22484 39104 47677 34221 3745 -16613 -23403 -22465 -6903
15046 -6903 3010 796 -12041 1416 5471 3610 11884 15369 20549 8799 -6263 -5290 -4008 9029
15032 9029 11467 -104 16096 18261 -4013 -12591 3852 19787 14861 10815 17340 17156 -6172
15019 -6172 -5280 -11031 -14766 -15066 -31035 -29337 -13236 -9937 -14022 -14444 5332 13542 10812 5481 492
15004 492 -11735 -15519 2938 -4222 -20755 -10640 -9468 12877 15114 17836 -2329 2462 15834
14991 15834 22352 42136 47067 50909 66506 75829 69461 51294 48223 44610 45207 42567 26470 21827
14977 21827 19710 30666 34203 24880 26361 24840 27611 26527 3677 964 4446 10757 23417 29688
14963 29688 23440 1017 -14304 -17764 -30031 -46928 -48449 -26692 -19469 -14729 -15966 -20158 -27781
14950 -27781 -29992 -30510 -30918 -34317 -19458 -16182 -19353 -41350 -30289 -10756 -447 5506 -1649 -7667
14936 -7667 -1237 5331 22259 19320 1113 -1539 -5796 14899 36013 49880 52183 43601 33316
14923 33316 33031 19796 7138 1084 -6318 -19128 -19038 -25925 -35258 -18667 -1798 6943 3247 -19784
14909 -19784 -20203 -11116 -1862 -12702 -4968 16923 39798 41982 23028 23717 8052 -3561 -4107 4490
14895 4490 10773 4801 9559 5044 -4904 -3334 -2951 2970 -485 -2785 -16754 -28617 -5930 15910
14881 15910 11065 -2042 -4374 11464 26761 15370 16566 25546 9471 5782 -11 89 2742
14868 2742 -7460 5474 19376 30695 35603 26688 18487 9480 1549 -1419 -4226 3433 -324 805
14854 805 -7982 8402 22039 12004 7510 -7675 -14741 1133 2373 -13325 -25373 -22514 -18695
14841 -18695 -10315 -14053 -13000 10933 20250 16609 -12240 -19545 -16323 -8623 -12555 -29253 -11962
14828 -11962 8786 5609 -9660 -28120 -27430 -2569 29147 21499 7646 -7817 -36268 -48797
14816 -48797 -37822 -21026 -12173 -2167 -2632 -21104 -6939 9502 11629 7467 -3972 -20665 -19669
14803 -19669 -3563 -13255 -14872 -3889 3589 22488 24975 27703 16514 9657 23452 31476 8673
14790 8673 -4679 5402 32195 41756 26335 22356 14531 2536 8608 11031 19881 18599 24498
14777 24498 28326 22125 8996 3511 8862 17456 25419 14737 -12704 -28529 -34054 -10366 13004
14764 13004 27898 19153 29523 26223 4508 -4148 2653 9816 16419 6573 -26399 -18700 -8470
14751 -8470 1035 11910 9080 -3243 5318 -5120 -6204 1110 5020 14155 16955 6930 -364 17134
14737 17134 32641 32586 27379 27473 40783 33195 28002 23107 29883 32299 17709 25790 27760 19026 -6200
14722 -6200 -26248 -12198 4327 6675 -1507 -7953 -12442 -7263 -5893 -13675 -10218 -3462 10352 14909
14708 14909 9900 -671 -15106 -14088 -8768 -26213 -35932 -20786 -4906 -2003 5364 11916 3376
14695 3376 -6903 1551 1395 -69 4532 19077 14754 16371 8383 9632 7155 -3113 2056 14118
14681 14118 9959 304 6957 22876 17529 8370 -2036 1439 -6180 -5839 -6785 10813 17668 21813
14667 21813 7385 7209 28924 21365 1569 -4478 -8902 -3948 1048 4942 -116 -18875 -24233 -14569
14653 -14569 -4080 -12345 -15082 -16622 -15524 -33727 -27431 -1946 23553 14277 -1481 -4621 2389
14640 2389 3379 10103 11167 -3362 2617 7980 10378 -2997 16136 20367 22266 39317 56080 54071
14626 54071 29159 13989 -5430 1152 1189 9469 6005 -3911 -6126 1099 22361 20165 30399 23143
14612 23143 9233 1205 16778 17640 -27 -859 -1918 8619 18412 5195 959 11785 7842
14599 7842 -68 -6685 -14361 -20625 -25739 -18284 9098 23010 7171 -5568 -1919 4456 15641
14586 15641 20766 6244 11596 34307 14291 -633 19217 6825 -8066 -9847 269 -7446
14574 -7446 -12392 -9267 21166 21970 -133 -5659 2335 -6114 -3096 195 -6017 -1097 11942 18474
14560 18474 28665 21504 5950 10155 18010 36822 66048 63041 41367 28661 15353 8161 12152
14547 12152 5768 -18375 -25142 -11118 -18105 -15044 3486 8526 20298 35431 34837 19039 2076
14534 2076 -8231 -18532 -10079 1973 -44 -13850 -20334 -1049 22683 25327 27454 8614 -10229
14521 -10229 10540 10133 -5861 -22250 -22150 -8491 3449 7780 15038 27096 28022 17205 9407
14508 9407 4537 2178 -17173 -31599 -4590 15807 13865 8286 13097 19397 8331 -3406 6478
14495 6478 25583 35457 39838 41715 32913 20757 1233 -13980 -6078 9828 25735 20602 8698
14482 8698 10363 4428 -2127 147 18586 7419 -12061 -32182 -19573 -13828 12709 20427 12573
14469 12573 4549 -4146 -3903 11219 28889 38635 26881 18329 13679 16807 27966 30064 33301 12453
14455 12453 -5376 3462 10676 16497 25103 22223 7616 -4950 9808 30260 35255 38201 4386
14442 4386 -14881 -14240 -526 -1135 7044 22544 30379 17612 -7785 -16034 -14024 -4482 19601 32619
14428 32619 12189 19854 41314 27501 18032 273 385 1767 -15476 -23234 -11342 -10363 -10519 -14150
14414 -14150 -16099 -18750 -5198 10578 27608 19699 10915 8435 14507 19918 10936 -6567 -1986
14401 -1986 31570 51083 36362 22499 -2551 7910 11344 2128 2709 16412 24704 11101 3394
14388 3394 10578 12116 11385 12350 18248 35794 38267 32714 29113 40853 40271 9056 -7921 -18477
14374 -18477 -22807 -1553 12356 20522 5528 5992 22193 31875 31356 31894 22256 5970 3667 2175
14360 2175 23915 38397 30511 13225 -4254 -9302 -6566 -6892 -12884 -13415 -5249 -8669 -22694 -34111
14346 -34111 -29374 -28787 -24545 -13888 -21271 -29575 -10811 -5508 -14382 -5998 13517 7014 -800 6483
14332 6483 16679 12528 4980 -6308 -4868 23063 24210 12417 7477 -2851 -18604 -25154 7763
14319 7763 25885 28176 46972 42038 17729 1783 -2534 -3111 8958 17176 33006 24849 12248
14306 12248 17008 20524 17165 -622 -6284 -8151 -13614 -12945 -7876 -7738 -2984 -173 9057 -7995
14292 -7995 -9672 -5020 -1915 -4615 4890 18085 14726 19470 5267 12039 37313 47058 42129 3861
14278 3861 9531 18513 2589 -4204 -17154 -19044 -19423 -25521 -41378 -44272 -32533 -17842 -5863
14265 -5863 6189 27421 3489 7283 21549 18193 -293 -11229 -25980 -45822 -39287 -20103
14253 -20103 7664 24016 16021 1520 -7216 5498 25435 21060 11260 15367 13661 3726 26101
14240 26101 34219 14722 -25628 -19946 -13154 5257 24842 16384 7201 22629 31292 30923 27687
14227 27687 16597 13739 5429 2828 15721 23721 13318 14780 15573 10676 3670 5069 -1440 20900
14213 20900 36595 33253 18436 10093 20624 30434 19171 14479 17522 10860 29507 42910 34123
14200 34123 22213 14178 11278 19149 31786 23950 14656 -3004 -4456 -14021 -33751 -30287 -14559
14187 -14559 -991 3255 4556 8506 19391 12228 1951 10808 19746 -11871 9351 24069 13814
14174 13814 -7403 1154 23546 24926 7750 9478 8322 -7186 -22774 -12024 -463 16003
14162 16003 30444 12851 3460 6978 33187 43005 49556 53595 49441 39318 19878 12839 22299
14149 22299 31905 31812 9773 5670 11464 6120 7597 7910 3679 13870 2980 -15328 -21051 -13545
14135 -13545 -11198 -16889 -22503 -11461 17884 14820 11311 24132 28392 32322 30275 12891 2662
14122 2662 1003 -8374 -11666 -1026 4455 -1632 -11166 -13773 -15366 -13474 -11334 -6398 -8525 -16021
14108 -16021 -27501 -5852 -204 1320 7510 15483 25688 10559 1594 11634 6625 6098 5920 6253
14094 6253 -4650 12112 21553 28783 12221 7279 13759 4719 17269 30769 44799 42222 28403
14081 28403 17612 24454 23595 16511 17196 13778 23420 30644 31816 54178 42230 29830 37160 29966
14067 29966 28159 7575 17093 23921 14822 800 -16696 -12905 -2979 21365 35270 21627 -254
14054 -254 -1242 -1030 -1284 -422 -1064 9244 12265 12875 21458 17285 11345 6599 -4629 -8950 -11561 -8883
14038 -8883 -7415 -1965 -8990 -15782 -19276 -18185 -8478 -14076 -30746 -36769 -19852 -8868 -29457 -40023
14024 -40023 -41383 -38205 -32928 -19514 -114 28187 28202 7627 4943 30275 23293 2934 3812 3731
14010 3731 96 -3165 -20611 -32427 -13546 235 2788 79 -6974 -1693 3395 -11948 7924
13997 7924 25397 24335 1685 -12833 -3143 20695 30337 18925 1608 -2504 15965 1038 -10162
13984 -10162 -5148 -17481 -37099 -18427 -11192 3264 14202 5116 1206 -13055 -23860 -5343
13972 -5343 13600 22249 18647 10759 15859 24556 32407 35527 31482 42130 44610 38164 38082 34522 43212
13957 43212 50602 45142 34638 21376 17435 41720 36101 27264 16562 25403 25995 29964 27553 11053
13943 11053 -3713 -6601 8609 23177 20780 30163 27594 16819 6794 16197 15285 7183 28184
13930 28184 36183 28642 28241 32763 27117 20594 5167 -12515 11542 37065 11054 3809 1258
13917 1258 -16211 -22523 -16022 -8576 6384 16647 18889 10499 1850 14932 25231 22992 21835
13904 21835 25583 30710 14184 11337 16142 8418 12119 30629 40614 32100 20645 10581 -4656
13891 -4656 5117 14247 18891 17944 13979 16334 17462 11511 10064 3545 12989 27535 31922 20207
13877 20207 12958 14290 29334 54107 41068 39037 30570 16887 -3642 -5095 -6422 -12689 2152
13864 2152 19916 29801 27016 15819 8873 -6299 -8615 -16716 -26479 -34786 -25829 -21964 -13231 -10095
13850 -10095 7401 21018 31536 39247 36882 18563 7926 -12307 -12991 -8237 -2646 4343 -4578
13837 -4578 -5816 1546 14075 17596 6004 24636 48924 51033 45223 27109 24944 21979 -3766
13824 -3766 10129 19747 22162 29676 13635 14733 1778 -17335 -32281 -20314 9251 38216 25155
13811 25155 12037 13240 11373 -1912 2116 4493 21904 13623 9369 -6313 -12505 10919 17043
13798 17043 20433 33637 42695 41487 28089 24866 22938 -5820 14656 38302 32981 4761 6334
13785 6334 -6709 -7830 4384 602 17710 22146 18246 -3390 -1309 -7676 -20433 -9303 36435
13772 36435 51322 39855 51553 39218 27253 26588 19770 9266 -3933 -11205 13561 11503 -2893
13759 -2893 12406 10874 -9035 -22204 -397 15976 12497 529 -14283 -18237 -33866 -12072
13747 -12072 -2593 -627 -7654 -1999 4216 28320 26124 27996 28224 15671 7150 7593 13564 -9668
13733 -9668 -33425 -44032 -21905 18706 23607 25294 14743 1204 -8590 9306 25021 24437 33441
13720 33441 31426 30513 52869 46028 40185 21612 13868 35704 22189 6020 17437 15845 9274
13707 9274 6083 15947 47893 51698 58956 55368 46743 23585 8297 -11629 -21568 -23724 -19618 -871
13693 -871 12310 -1864 7305 8978 2834 -69 28190 39861 28907 29965 25845 21538 19285 7307
13679 7307 -3580 2736 -5963 7469 19443 8272 16734 -1002 -16104 -33780 -16415 14741
13667 14741 18645 23914 18591 -822 -20297 -21110 -5726 6404 6083 9384 2933 5089 22580 37147
13653 37147 32274 33343 26136 16300 6769 -117 11980 11511 20158 15376 441 8305 7449 22183
13639 22183 26448 11559 6666 15818 21558 22686 12977 15103 8187 11118 17174 2988 -4358 1825
13625 1825 673 -1965 2783 2093 6799 3319 13968 7691 -4271 -10415 2931 18734 22519 22910
13611 22910 27345 29794 17475 1896 -4159 2131 9338 20278 21676 15289 24063 37844 50123
13598 50123 57785 22708 2132 12951 29649 17204 13424 7332 5094 4636 9048 10334 -396
13585 -396 -1797 5794 4758 15297 11880 11541 26085 17719 19991 29930 36603 20291 28538 45723
13571 45723 50033 36703 33657 31381 24928 7371 26383 52748 48822 40657 45056 44533 33564
13558 33564 48646 65446 70604 84796 76755 89895 88909 66971 58743 42082 39705 49980 55453
13545 55453 62143 51330 57023 66855 59897 81536 68432 72798 82885 86675 86803 79059 73320 81347
13531 81347 81623 76143 56496 35147 36857 30126 8019 3090 24891 43386 56479 77612 107690
13518 107690 101489 82794 52597 36162 41727 44150 56170 61910 61263 59198 37578 48478 54287
13505 54287 48260 53861 59307 46674 80104 109955 117794 122412 120296 111413 107533 97302 75944
13492 75944 47291 53145 66905 71287 68474 59426 58432 71276 84156 102865 127292 131043 117984
13479 117984 108431 84397 64995 53741 33470 41899 55862 31691 32389 55814 59304 77859
13467 77859 84866 105353 99309 87463 87706 83490 86936 90176 73900 62164 61792 54308 55851 68938
13453 68938 63263 61599 67099 84127 114643 133908 144763 140136 118569 109804 87513 73702 66416
13440 66416 59684 63809 53522 27887 14619 18198 34727 38892 31562 47334 59026 39877 31974
13427 31974 27562 5478 -3901 -8877 5210 15152 19587 41588 48147 51030 54320 35470 27464
13414 27464 46050 45940 34158 46275 44162 23326 9616 13493 21134 34320 19193 13908 20902
13401 20902 23155 27911 37292 36178 28556 28138 33492 19649 10214 17889 25515 12775 29356 40451
13387 40451 43748 32972 34762 25907 37891 44019 34713 32200 27862 18642 28025 23001 33756 35587
13373 35587 44922 47595 44307 30375 28003 35447 19421 6965 22993 29444 19441 14775 47542
13360 47542 57067 53263 34025 38601 37452 50752 43136 32285 50402 57155 61724 65922 73922
13347 73922 54752 34411 12592 11724 24041 38845 59736 70140 64385 65486 59400 71238 63697
13334 63697 53303 68230 63077 56661 48424 57338 62924 65879 72302 70843 53707 37693 31176
13321 31176 48627 86722 126789 157316 169276 165810 142582 108504 71968 53170 50979 29412
13309 29412 36016 36333 49752 73829 76862 77277 83252 57937 61447 77757 90681 76168 88518
13296 88518 112309 143929 169152 171053 154363 143038 147803 139972 121829 104145 97364 86542
13284 86542 84901 77367 66806 74698 81011 90469 105564 97216 102531 99816 80671 68387 64780
13271 64780 57237 70075 54406 38942 47601 65794 85454 92130 68595 71540 88845 103019
13259 103019 130134 156729 163537 171062 170140 131314 122018 115026 105070 101540 98644 121931 165255
13246 165255 186516 207918 206762 180862 171986 155966 166943 173468 161704 152757 149660 153501 179645
13233 179645 187651 181501 175242 164450 138943 106590 74867 94728 127522 145523 134414 119879
13221 119879 113887 113141 121303 109855 95921 74865 85711 95693 90769 84172 88138 90800 86273
13208 86273 64255 73531 90396 112920 114199 101888 92326 107716 132971 145056 136072 118638
13196 118638 130565 130918 134928 132816 134960 124256 110653 117718 127015 116308 100118 131173 148956
13183 148956 134405 132245 122835 97058 89384 99416 105450 85965 72667 72002 68519 86660 115533
13170 115533 127267 135282 135334 138642 137727 137509 152344 179546 202650 201548 194726 174248 169608 159377
13156 159377 166047 178402 188638 196311 168241 158621 174804 184275 189540 188250 170380 156605 163891
13143 163891 165907 184210 188811 187322 197927 218132 240214 271088 295260 312176 309383 333302
13131 333302 362008 383867 397104 398809 405202 420821 435783 473987 538699 612337 712406 838037
13119 838037 1009893 1245614 1543473 1984924 2696521 3772221 5424012 7647017 9813542
13110 9813542 10909158 10254426 8201924 6003160 4379841 3348382 2703099 2313483 2081048
13101 2081048 1998469 2060520 2264470 2620341 3237194 4307786 6058728 8525637 11025453
13092 11025453 12259385 11418780 8954499 6399698 4622946 3555822 2947089 2602074
13084 2602074 2449819 2492085 2712012 3192594 4044273 5479821 7692615 10383247 12442939
13075 12442939 12640148 10722435 7935632 5680362 4212721 3315508 2802051 2520205 2399739
13066 2399739 2409470 2536325 2851913 3430054 4368488 5867917 8083694 10681201 12585267
13057 12585267 12652359 10734154 8001414 5748119 4272601 3356790 2822861 2501121 2331472
13048 2331472 2302681 2393767 2641937 3046530 3668660 4665861 6260602 8775197 12430442
13039 12430442 16695863 19859562 20152692 17277514 13019101 9414166 7024841 5546205
13031 5546205 4613854 4066923 3805354 3778425 4002931 4499387 5413505 7002673 9624007
13022 9624007 13610871 18371625 21794452 21817943 18177231 13237849 9388318 6987740
13014 6987740 5577489 4784430 4399770 4306415 4522223 5096712 6198699 8066582 11040801
13005 11040801 15113129 19145917 21137960 19795611 15838890 11604786 8505642 6506579
12997 6506579 5271786 4529229 4108438 3956739 4030398 4355878 5042659 6252815 8246258
12988 8246258 11284177 15198692 18818852 20264758 18544028 14532774 10384491 7342356
12980 7342356 5359845 4041543 3129894 2488223 2028357 1678973 1427142 1245298 1089930
12971 1089930 971227 859016 760567 686117 645440 632464 640015 630703 600720 583611 590748
12960 590748 567483 513979 471198 432731 405782 393316 380320 371906 352227 353374 371436 357789
12948 357789 344784 332875 330745 334230 337864 367874 372879 383447 436471 536615 695439 913067
12936 913067 1240255 1752597 2284325 2550896 2390108 1886692 1371961 1003324 768794 655961
12926 655961 548626 482389 454353 448594 418124 396815 390840 392628 391827 412224 449696 476742
12914 476742 488830 497618 484369 472040 481296 504654 547663 621206 709653 849005 1089370
12903 1089370 1473049 2079628 3017909 4072283 4811074 4816275 4041235 3036657 2156878
12894 2156878 1563460 1198405 986806 863462 790123 761387 755693 756751 793829 854705 927300
12883 927300 1017690 1132497 1274214 1420183 1611279 1831822 2109428 2492516 3072434 3963615
12873 3963615 5378176 7614621 10928660 15074140 18656427 19927348 18233384 14840614
12865 14840614 11679291 9285099 7289929 5592740 4355098 3554615 3056404 2758104
12857 2758104 2592868 2522136 2554245 2644062 2830045 3179017 3801503 4876673 6649286 9529601
12847 9529601 13764568 18496884 21384261 20594968 16345126 11423926 7849523 5569482
12839 5569482 4126897 3197387 2589328 2202984 1950030 1748078 1534841 1327927 1176520
12830 1176520 1071119 1014776 1018574 1013661 996778 1014423 1044631 1095826 1162329 1232661 1349173
12819 1349173 1526763 1747410 1981365 2262818 2619644 3131961 3950949 5242353 7327229
12810 7327229 10506840 14802757 19108900 21350555 20184989 16266267 12056932 9088477
12802 9088477 7380794 6643322 6768354 7793038 9654610 11800738 13050084 12572066 10588357
12793 10588357 8387548 6879159 6167344 6137317 6741978 8169607 10662810 14388787 18864533
12784 18864533 22268994 22669052 19614131 14920733 10954895 8415771 7077693 6704513
12776 6704513 7261619 8771263 11000897 12824567 12997750 11095462 8160917 5738202
12768 5738202 4151961 3158731 2526283 2078646 1790152 1634852 1507299 1389599 1275478
12759 1275478 1191984 1147646 1115168 1109522 1138155 1225032 1324274 1446504 1636402 1917529 2300873
12748 2300873 2755185 3190724 3531717 3656320 3558278 3334061 3132574 3128686 3429237 4155770
12738 4155770 5496124 7669929 10444605 12659193 13007842 11110763 8150615 5704584
12730 5704584 4134798 3178228 2570873 2204743 1985264 1849653 1788750 1781673 1802191 1862848
12720 1862848 1961818 2156995 2465973 2964645 3766605 5062964 7040044 9682333 12343586
12711 12343586 13790073 13235818 11112965 8822799 7149630 5923666 4866927 3916468
12703 3916468 3123210 2514801 2049816 1704225 1431206 1215603 1043287 912358 804160
12694 804160 729682 667250 593685 567646 538594 515592 515707 489352 463987 443823 426773 426616
12682 426616 426008 442144 460960 470532 487163 498369 500639 534636 576262 618090 682424 763806
12670 763806 934937 1107457 1211036 1209442 1121142 955881 779584 637516 512297 436284
12660 436284 396035 347533 295620 268751 236719 202882 196459 189883 181680 178083 190527 219418
12648 219418 233376 231139 218633 217373 250597 270027 240616 243320 261870 252151 224502 223849 226959
12635 226959 224243 201148 184224 200584 192253 155224 145192 156290 174098 189637 198132 206559
12623 206559 214053 214700 197082 163550 155454 155677 154965 167851 163343 144936 137153 131884 155627 185522
12609 185522 191259 203732 203400 194511 196213 179538 180235 168053 137279 126811 115641 128701 137274
12596 137274 149829 148867 166702 169563 160234 179067 211428 215060 211719 220826 237563 259476 257641
12583 257641 238655 223333 211079 200170 192283 222639 235767 221915 220617 228288 247448 254490
12571 254490 270110 297796 304837 275742 247230 211342 181137 156533 155574 169652 183531 186138
12559 186138 185814 177105 171833 185525 214183 245184 290106 346038 357725 353313 329788 297256
12547 297256 251717 219717 202923 187776 168811 169835 184073 186047 210667 229634 244259 272763
12535 272763 284709 286784 283857 280282 273934 271823 279348 274026 254883 265280 282254 292435 298491
12522 298491 312123 346514 376434 430625 499903 554283 617795 686305 792085 929771 1126974
12511 1126974 1449538 1926529 2568998 3327053 3985113 4219617 3910727 3249637 2545551
12502 2545551 1981454 1582243 1321078 1139676 1026297 942809 865645 839538 827264 805855
12492 805855 794599 791999 808977 847837 909131 962329 1008871 1055962 1150818 1291959 1480429
12481 1480429 1736479 2108778 2664621 3508551 4714006 6244795 7794596 8868267 9024144
12472 9024144 8279588 7136387 6075141 5402175 5190644 5395915 5752733 5915410 5612988
12463 5612988 4870428 4000639 3249557 2683342 2302855 2048455 1904509 1823747 1772280 1759254
12453 1759254 1783087 1837423 1908295 1996794 2135957 2312197 2546877 2898709 3419227 4159567
12443 4159567 5181747 6408701 7587069 8499819 9186350 10056580 11500601 13386303 15129106
12434 15129106 16119966 15996924 14846990 12924383 10642558 8445057 6629389 5267776
12426 5267776 4318158 3645835 3171814 2842003 2609596 2438331 2310239 2232420 2207179 2242297
12416 2242297 2314678 2447293 2600066 2823218 3129548 3524014 4049366 4801828 5891588
12407 5891588 7450720 9562749 12135569 14787326 17157994 18940447 19855549 19631362
12399 19631362 18212971 16222373 14529413 13628745 13476443 13429294 12757045 11212089 9192568
12390 9192568 7343847 5942973 4949424 4242941 3750456 3388112 3107475 2898688 2781369
12381 2781369 2755357 2788658 2850939 2981231 3203416 3535044 4039446 4802431 5874581 7318836
12371 7318836 9037412 10614294 11521013 11581090 11179586 11053982 11671346 13083730 14919771
12362 14919771 16639876 17731922 17721473 16389202 13881054 10872457 8268167 6373725
12354 6373725 5089350 4224206 3589726 3077349 2680429 2360000 2095297 1901476 1762581
12345 1762581 1648529 1576175 1561520 1561159 1577782 1614732 1670194 1757398 1902631 2112639 2421007
12334 2421007 2854623 3463236 4313026 5512715 7046710 8598210 9573049 9453186 8257817
12325 8257817 6557972 5007016 3825054 2968446 2358165 1936233 1641245 1424585 1269967
12316 1269967 1161022 1061900 965356 913760 901236 895475 905726 921575 939199 979975 988737
12305 988737 1020085 1092627 1238005 1435987 1698125 2094925 2673031 3513543 4696739 6160391
12295 6160391 7568204 8362481 8147878 7058414 5674428 4471475 3589478 2951033 2500981
12286 2500981 2194025 1976392 1836832 1751681 1705705 1696280 1704759 1744669 1809114 1912135 2063809
12275 2063809 2274601 2560566 2928613 3441159 4179545 5225786 6636243 8336370 9951639
12266 9951639 10926097 10945428 10347159 9891429 10243634 11585393 13678217 15793139 17027373
12257 17027373 16816348 15227406 12833746 10336075 8207222 6586063 5432924 4608518
12249 4608518 4024381 3599070 3314470 3117705 2985495 2912936 2895318 2951322 3099234 3318626
12239 3318626 3650202 4091248 4722081 5625204 6935719 8822222 11399277 14456971 17260794
12230 17260794 18916320 18830310 17322365 15323050 13758030 13250520 13761224 14736151 15296867
12221 15296867 14677799 12852645 10453204 8234012 6531175 5300717 4427590 3818895
12213 3818895 3365723 3029878 2800367 2639640 2524063 2448041 2431306 2455176 2527887 2707194
12203 2707194 2951388 3283466 3754130 4431982 5435228 6853593 8772212 11092878 13319773
12194 13319773 14621786 14446197 13034739 11298733 10120260 9721550 9843208 10065899 9984978
12185 9984978 9365052 8183946 6660880 5233630 4158280 3413992 2863269 2457386 2156333
12176 2156333 1947920 1799064 1711780 1663081 1633059 1633990 1667322 1750857 1871927 2052023 2331647
12165 2331647 2754762 3341889 4124603 5144314 6337100 7515264 8415362 8765027 8466525
12156 8466525 7618658 6517776 5658935 5304446 5414045 5702108 5759446 5317743 4475116
12147 4475116 3559115 2786889 2246475 1877066 1592824 1400494 1262863 1165742 1098661 1059327
12137 1059327 1043891 1043571 1061967 1068086 1072168 1075421 1116661 1205240 1357149 1569114 1901198 2383270
12125 2383270 3032198 3817832 4488537 4703974 4325784 3514415 2665619 1980578 1481029
12116 1481029 1146766 927290 751024 623545 539576 468493 412331 378289 349592 316270
12106 316270 286496 267706 258495 231088 223577 216909 200991 192413 211222 219006 245009 272550
12094 272550 275536 273088 286156 278162 257575 200464 160116 160471 148415 121129 91440 67731
12082 67731 70793 80251 98080 116155 113307 105343 105902 109142 117591 141762 148468 156484 174425 216240
12068 216240 276935 317530 350034 358477 346854 330658 294153 241677 185181 140711 108576 92326
12056 92326 81002 76800 68101 90787 94909 96802 88757 83795 88795 93779 89019 68875 71963 87391
12042 87391 63936 59322 66222 47159 35832 59531 67933 65174 63175 59011 70387 45571 33863
12029 33863 42499 45566 36314 35401 48285 66565 80818 93708 103926 102219 85334 83093 83689
12016 83689 63505 59879 62436 71599 77754 92075 74053 39074 27658 21547 20549 21404 29977 37562
12002 37562 41381 20007 757 16699 31310 36547 27136 35137 34806 40618 48641 68782 91515
11989 91515 86108 76113 83044 81019 75489 89697 107689 125896 132810 123240 118827 113267 95180
11976 95180 88849 68910 40482 29296 53958 67552 56451 49795 38271 25619 30465 40736
11964 40736 50205 62929 52362 31302 30789 37626 56023 45921 45253 45043 17723 19697 33187
11951 33187 58879 72773 78464 93959 108545 119050 109848 113654 111734 87508 81046 79206 83971
11938 83971 71398 63808 67666 55119 46091 35708 35148 31153 39155 50122 42351 41922 38143 20681
11924 20681 9483 18092 42669 52691 57039 46452 38265 39556 61647 77319 75262 77700 61112
11911 61112 69563 65530 74171 91481 88443 80253 83612 94387 94044 93103 74881 69920 67206 46084
11897 46084 30404 20466 28792 35682 31999 38297 13789 13340 29524 32903 30736 29631 15886 13415
11883 13415 16695 24889 30487 26328 46461 63155 66906 63965 44340 48366 75872 89668 75933
11870 75933 66353 68788 59961 42583 18065 20749 42643 54004 54594 70035 76793 76542 55963
11857 55963 46990 23180 9381 16176 26659 44618 58341 30718 7366 11548 28644 38529
11845 38529 44389 26833 39944 50590 56522 66584 43803 24074 20635 28091 36095 43200 43208 40962
11831 40962 37240 33582 57069 77540 72207 75616 70792 72904 70063 61130 60392 60958 52585 44739
11817 44739 50424 62481 72549 83812 79835 87719 96916 109273 95159 62568 49908 38599
11805 38599 76117 108896 93034 72695 80462 90960 59293 46630 53714 51232 75958 75717 70878
11792 70878 57242 51206 55035 47050 23378 31112 44209 42420 46784 47709 40083 46131 59652 81984
11778 81984 79924 103049 116455 112162 121730 129137 125826 117502 113527 111161 117213 113192 113605 117845
11764 117845 112215 121417 119207 115639 91126 80491 88838 86410 53824 41192 62483 62324 39855
11751 39855 49477 75841 73362 69035 48073 26631 31493 54641 75886 89940 92695 97027 91618
11738 91618 104887 109035 123964 130514 142894 135212 127670 143513 142426 136666 133784 127126 120708
11725 120708 98759 84935 80744 80123 64491 52533 49818 54956 61612 54565 53848 69710 56282
11712 56282 49660 53813 48159 41309 47319 64677 74470 75525 90130 102389 89084 76503 76067
11699 76067 70767 66241 71339 91311 106816 108091 114821 105904 102850 95490 69340 62946 75765
11686 75765 74181 85367 88190 65872 62756 51861 35660 43343 60272 62377 46527 31087 27330
11673 27330 10492 26718 45237 69063 94190 104551 121527 119309 82587 52731 42922 57033
11661 57033 72422 75879 75735 67122 68612 84499 71649 70625 78120 84294 71594 59002 57779
11648 57779 56253 55443 56083 63633 82549 60036 39553 35925 38282 38097 34011 43205 36926 60011
11634 60011 79629 67683 70508 77641 72365 82337 94572 90993 89461 78306 75605 82754 83113 77733
11620 77733 43459 7643 5095 17450 19178 28926 43299 47702 57079 54856 38607 30340 34593
11607 34593 42338 42423 39788 25466 14521 31977 23022 6216 -2569 4412 7656 10628 17617 13524
11593 13524 1401 -4474 -2714 -2456 23034 56659 44356 50318 45364 55016 59762 34425 19480
11580 19480 24099 38707 32636 30956 23597 29079 45973 54865 65438 78360 86147 87906 79400
11567 79400 91563 87813 87937 84034 71131 77959 72338 69729 75115 81838 85324 92077 75248 86791
11553 86791 85083 82158 96351 109444 110761 121740 161585 186160 213197 253346 306215 393494
11541 393494 558427 790568 1059403 1331313 1535391 1598103 1564365 1531899 1562817 1621093
11531 1621093 1574362 1381501 1072454 783921 589255 455556 356513 294590 266730 247508
11521 247508 232331 236879 237569 236103 235335 222174 215401 219390 226067 220020 231730 258696 270075
11508 270075 279844 310207 332387 377921 442598 543966 715532 1011819 1450344 2029941 2567255
11497 2567255 2868995 2927740 2838614 2805237 2905331 2989724 2853707 2445948 1864657 1354471
11487 1354471 985197 729723 563138 475525 433375 385558 345020 332675 339101 344632 338379
11476 338379 315027 287977 280649 278886 266397 263075 262790 277974 303180 297847 288975 310083 347855
11463 347855 409948 495891 642231 848912 1098984 1334853 1469301 1461076 1401344 1402976 1476901
11452 1476901 1525837 1427343 1221094 970227 726035 565328 467711 411227 394933 358519
11442 358519 331917 333999 343281 339423 334865 345101 367408 373007 364863 381006 411389 433176 469232
11429 469232 509076 532016 570615 651858 728784 819715 962685 1157982 1448439 1881119 2505085
11418 2505085 3395469 4501781 5573331 6430495 6912281 7066293 7067475 7063417 7132898 7105140
11408 7105140 6734192 5987636 4976090 3915513 3017869 2365033 1942561 1671704 1478437
11399 1478437 1324873 1234155 1179704 1160595 1166128 1159480 1180257 1217410 1284890 1366061 1471346
11388 1471346 1640945 1887706 2225230 2738248 3484362 4504762 5641874 6673617 7374469
11379 7374469 7702841 7801240 7854769 8005788 8201788 8229596 7920444 7350254 6649755 6140970
11369 6140970 6101160 6502456 7368078 8783372 10800246 13417847 16425243 19423736 21931580
11360 21931580 23399902 23508917 22399076 20652992 18802403 17089382 15627827 14358056
11352 14358056 13188355 12199878 11434340 10956000 10652421 10221673 9536170 8658800 7714909
11343 7714909 6988074 6665448 6761608 7242986 8150052 9556573 11542701 14133790 17117000
11334 17117000 20098050 22585761 24053449 24158716 22919981 20883340 18658336 16752040
11326 16752040 15536301 15269479 16030944 17862734 20620764 23923813 27166183 29630555
11318 29630555 30814397 30812985 30100351 29152967 28099696 26715181 24867728 22796379 20781471
11309 20781471 19087375 17868292 16781777 15397988 13641007 11661758 9826185 8492104
11301 8492104 7695293 7369144 7433251 7875034 8774428 10133784 11971963 14189812 16567514
11292 16567514 18699248 20142872 20519573 19663769 17787123 15459711 13145728 11206432
11284 11206432 9884920 9281793 9438948 10239092 11359505 12339676 12874276 12917289 12709947
11275 12709947 12493131 12408520 12292058 11761922 10645341 9081485 7293321 5690771 4525665
11266 4525665 3736782 3210865 2865782 2650681 2522068 2491457 2549981 2700000 2986987 3509382
11256 3509382 4367850 5640929 7338151 9107475 10485255 11232852 11422511 11375028 11322088
11247 11322088 11429355 11436254 10891215 9701482 8036130 6180963 4622382 3545666 2840911
11238 2840911 2388385 2075874 1862482 1721202 1615978 1545830 1497056 1475250 1491279 1535495
11228 1535495 1593586 1688108 1812995 2024095 2339733 2805084 3501347 4504376 5884629
11219 5884629 7448075 8869221 9877374 10343310 10455267 10423640 10424247 10409683 10118054 9287998
11209 9287998 7992247 6390179 4841895 3626012 2770654 2185110 1772151 1473803 1253458
11200 1253458 1092780 973360 866899 816559 756946 707887 658197 605493 574928 546604 505776
11189 505776 473583 441797 406525 356873 324436 310772 301212 276901 259813 227036 217904 223576
11177 223576 218132 233272 237284 222453 225733 211836 196418 205680 229688 227601 214714 204636
11165 204636 202798 195323 205641 209721 181488 172149 176993 175621 174933 171845 168334 161824 158364 151648
11151 151648 160127 139048 133250 140012 131028 129517 116872 137687 144836 137296 153121 143555 145832
11138 145832 153125 128561 117522 133009 144560 152622 158172 171081 193233 190432 168533 173856
11126 173856 180603 187381 189859 199655 188506 181031 195233 206096 213989 225499 240599 241707 257833
11113 257833 291759 365068 462228 623762 830602 1046384 1248430 1420092 1550081 1649313
11103 1649313 1675774 1607206 1477993 1309123 1150915 962506 750057 591565 479495 405707
11093 405707 370474 326668 291726 283952 274772 262404 256463 265010 281470 293707 306243 331579
11081 331579 377203 434593 489871 576357 730861 960372 1284027 1666337 2061217 2403072
11071 2403072 2677118 2865605 2955234 2909723 2704628 2436237 2105806 1747052 1369715 1023966
11061 1023966 783813 621658 524196 461008 390974 351540 327812 312100 291740 281852 282991
11050 282991 274022 278836 273511 290534 339110 399692 440361 487760 584721 738462 923015 1103116
11038 1103116 1268916 1392796 1495976 1564413 1553024 1485731 1370984 1214486 1059625 877738
11028 877738 700714 606332 550699 518619 492845 470134 458378 459060 475141 507208 511000 532258
11016 532258 579311 594315 623730 676140 744765 820772 916974 1046331 1213860 1410486 1692608
11005 1692608 2078137 2618763 3419198 4580570 6212075 8204697 10240599 12105815 13670001
10996 13670001 14675764 14759136 13829113 12367490 10735499 8951213 7278441 6068061
10988 6068061 5359906 5087482 5235783 5826659 6955964 8647734 10761903 13056386 15411127
10979 15411127 17765599 19995353 21754597 22684878 23035313 22976631 22340823 20932981 18763161
10970 18763161 16184592 13748614 11373652 8994202 7068801 5838947 5164972 4940096
10962 4940096 5138783 5768920 6933877 8580385 10412392 12149890 13631002 14679529
10954 14679529 14946068 14135287 12539522 10720068 8755708 6707682 4989483 3777993
10946 3777993 2960378 2384018 1960694 1658847 1419603 1234970 1077313 956307 862534 765967
10936 765967 693802 662540 628284 617837 600702 598065 590413 574753 564726 543180 522204 503926
10924 503926 475593 467330 449056 442885 451084 453847 451394 442816 429258 437973 467475 479713 482451
10911 482451 505037 524130 577502 661802 729763 811168 938094 1109826 1354287 1709366 2235352
10900 2235352 3034713 4139940 5435356 6727894 7903979 8839367 9358106 9221453 8444418
10891 8444418 7450853 6383196 5203786 4157206 3452685 3076955 2956548 3087408 3480125
10882 3480125 4227105 5345594 6724063 8158776 9591861 11038763 12368904 13285687
10874 13285687 13656339 13725012 13535751 12959837 11952407 10547562 9029051 7633802 6226935
10865 6226935 4887658 3887370 3276099 2953145 2878995 3056020 3467180 4172852 5142955
10856 5142955 6193351 7140881 7927586 8447426 8465989 7853592 6889511 5842205 4700212
10847 4700212 3544054 2625276 1982574 1570550 1286783 1069775 898568 754704 656282
10838 656282 572679 490718 437712 403078 365423 346253 352058 359357 354619 352976 373407 378878
10826 378878 360847 348088 310791 262221 236164 199256 179174 185423 183496 159138 130690 117644
10814 117644 123114 134108 133514 118794 107394 90861 92761 114207 118737 121078 106585 106712 108598
10801 108598 120542 133549 135616 123313 114242 101882 82241 85061 94902 121788 131320 126939 126426
10788 126426 124131 109339 108086 122017 132209 119477 98184 81858 92240 95330 76759 74456
10776 74456 68495 61226 54852 61659 80550 63298 35666 48677 57751 46417 46325 46737 43158 51812
10762 51812 55188 52324 62208 48121 46252 65109 71154 71049 72668 80063 59705 55746 58929 51113
10748 51113 55528 54543 58748 50277 48134 54217 88742 72322 47959 39884 53331 38609 13968
10735 13968 20751 26225 20255 33703 54016 39439 35767 34417 47156 43510 53460 51710 42591
10722 42591 38145 36658 34587 33144 47888 43866 51299 59148 62023 41509 37964 36789 38558 26951
10708 26951 8126 -2157 9064 8546 -7179 -8370 11698 46753 48456 48061 51734 47872 27423
10695 27423 41342 42569 38019 48305 42344 37607 40584 35136 40411 34626 41371 45650 28186 27913
10681 27913 45197 26753 12365 24440 30455 24469 20854 30181 41412 40321 45404 46064 55857
10668 55857 46753 45701 48910 35996 29679 51900 53388 39124 31696 37277 24525 18844 38531
10655 38531 34483 30894 11169 9962 9818 13859 15710 1269 1094 13491 10122 7445 17157 14121
10641 14121 6152 12413 6947 17088 21790 13994 7888 23641 31855 25973 40067 22496 -1747
10628 -1747 3726 16556 20836 25701 32409 26258 8531 -2935 -14654 -5911 22284 31456 39028
10615 39028 47838 34726 17611 15459 27698 29154 18748 10252 10768 29653 21663 -2546 -6940
10602 -6940 -6185 -10273 -13283 11679 5790 -1776 5636 8808 3052 3927 -5239 -12144 -17011 5250 28270
10587 28270 50624 79563 93549 104329 85082 66547 66146 50433 39444 45007 50062 46471 34207
10574 34207 25418 15813 14980 16735 52758 99088 113122 115254 107382 106383 115952 117393 107405 107092
10560 107092 107562 109562 100633 120851 107414 70777 45783 55224 57947 53298 38905 15977 31165
10547 31165 37205 28611 24418 31718 72369 88698 82944 78209 79064 76003 65375 58216 43678 12921
10533 12921 6085 -1942 -8184 -16875 -11356 1893 8081 821 3159 18213 42455 48490 55925 64186
10519 64186 57839 64098 35558 32317 53614 66201 63945 44675 30902 10437 21101 48135
10507 48135 63944 72970 43790 30978 30565 23375 22286 13325 19875 26867 25079 27888 43950 31745
10493 31745 18153 17131 7570 11184 5018 13534 46851 59121 55983 50498 57059 76952 96863
10480 96863 105362 83185 65002 67699 84216 94658 111460 124382 108414 108480 108471 102103 120214 131354
10466 131354 130380 122024 112391 133036 133581 134527 135320 126608 112731 105003 107109 115625 116056 102564 106525
10451 106525 114758 123160 128521 131704 106452 73695 70301 73289 90909 106699 112305 112601 95345
10438 95345 79707 73638 79673 70789 62942 45176 53862 61213 62714 43537 35906 37300 57609
10425 57609 60053 59860 52610 71334 76136 80162 80798 67736 56599 33887 35967 45734 41865 41286
10411 41286 49135 46611 31946 25331 26446 27212 43086 33473 43947 51262 48396 39390 18558 11402
10397 11402 2790 5358 25338 61109 66441 49370 47088 44285 42235 29002 32842 44890 58779
10384 58779 65030 74309 61251 49981 50689 41787 24558 15790 23929 43560 49080 77302 77687 63032
10370 63032 51550 41906 40533 23638 31232 43080 27360 22490 42432 58988 48581 52760 67693
10357 67693 70825 69603 59651 47232 54021 51329 49180 71028 49990 20009 23334 41922 39855
10344 39855 40553 50347 37829 43572 31465 32405 42254 52149 57431 62705 58366 42163 48321 41708
10330 41708 22845 38945 47031 63845 84688 103542 112201 121531 121148 135247 149675 196604 267813
10317 267813 314623 321707 284594 221546 166766 132362 102389 93891 95817 89932 81726 63187
10305 63187 55060 69849 73000 76391 81252 87683 67000 52659 62432 67942 36452 49580 72498
10292 72498 86146 103533 130926 144173 174236 209539 249613 293151 335577 390521 430734 442289
10280 442289 443672 413769 361479 302836 241777 180651 141063 122168 87378 74900 81079 87816
10268 87816 96254 101664 65266 61931 75536 82500 95791 91087 72971 73533 78059 78534 82499 83152
10254 83152 89535 102063 115168 144657 184180 227407 264731 268155 258109 230898 204531 178986
10242 178986 143938 114223 98239 86554 66366 43301 38663 30495 37817 48385 48814 32028
10230 32028 13293 27632 52411 50894 44160 21156 1152 -1613 -4160 2187 18634 44106 52352
10217 52352 53401 58841 58072 76367 118914 183649 235820 272067 320016 379323 398759 349703
10205 349703 297593 260430 203839 176639 146636 99571 89065 97887 92894 75675 58664 56464
10193 56464 52520 41613 48097 60215 68490 76240 84543 77444 80516 68221 69784 67568 65467 50411
10179 50411 48186 63282 73183 80956 93807 112302 115499 95319 90269 118309 117522 100254 92545
10166 92545 70335 60586 68840 52335 25512 16095 24467 39935 42593 41384 49153 53358 54229 67148
10152 67148 81120 95756 117828 124337 116644 123431 130518 120619 122636 120398 125356 126560 143890
10139 143890 138130 114427 107763 115998 127821 123772 114306 96282 82971 82671 78884 81668 74066
10126 74066 98949 105941 79565 62056 51597 36544 55132 63323 74035 65688 58229 72663
10114 72663 86945 88922 77955 95498 120185 124745 116435 104469 98217 94724 107024 132918 121546
10101 121546 98814 87734 97502 81374 76511 77582 80242 97479 109560 110736 97920 100635 77551
10088 77551 68513 73118 80964 81734 96964 113111 106688 90980 83834 93822 100016 71386 63990 81048
10074 81048 92615 90113 84933 84074 84812 91654 82748 90706 87885 74225 73092 59502 63842 49444
10060 49444 27306 23883 56928 74035 84796 91208 108488 131721 145914 155046 147551 126311
10048 126311 133901 141722 167281 169777 175255 154755 137531 137196 133723 145267 138268 121475 104509
10035 104509 94082 69841 82196 96882 93641 95482 99470 106639 109516 122976 126998 132616 148686
10022 148686 145001 153381 151544 167551 167305 179697 193470 216029 219062 217135 228031 231499 212066
10009 212066 184646 169578 161563 158361 150516 153348 163829 179467 175222 155917 167050 167532 170268
9996 170268 154344 158570 166837 164591 194724 195341 217240 251737 306289 350760 413726 476297 565042
9983 565042 675006 804727 916301 961465 931679 846697 738714 603683 486897 412269
9973 412269 359594 323595 299265 302471 297343 298008 302069 290344 297021 318953 342584 362359 395801
9960 395801 406081 397055 393572 422721 447468 458853 482903 523448 552593 601516 638429 669520
9948 669520 692526 732981 777302 814372 855254 887524 956727 1029055 1137815 1274861 1443981
9937 1443981 1633286 1858964 2162712 2546250 3012596 3598785 4280812 5091352 6091884
9928 6091884 7428075 9380906 12355608 16884708 23475398 32195426 41977241 50354336
9920 50354336 54414403 52505269 45468486 36019482 27019338 19987889 15067178 11783020
9912 11783020 9619151 8188528 7203942 6473583 5906653 5482196 5149838 4918640 4835260
9903 4835260 4877496 5060975 5397136 5889475 6557939 7442813 8616285 10185265 12337422
9894 12337422 15349270 19706575 25957787 34498909 45066129 56593077 67562327 76568986
9886 76568986 82638832 84965702 82832403 75944910 65090930 52289100 39959409 29823530
9878 29823530 22425940 17361109 13942789 11555750 9838465 8544758 7535337 6704128
9870 6704128 6055154 5555037 5181431 4958936 4856242 4881895 5073334 5419992 5891618 6484584
9860 6484584 7287096 8397191 10022369 12524607 16394288 22115433 29826804 38713425
9852 38713425 46721419 51135432 50108876 44013675 35146108 26276322 19121007 14027369
9844 14027369 10603177 8328566 6785434 5719371 4918615 4274053 3704157 3213296 2785964
9835 2785964 2428537 2136015 1891636 1704258 1541833 1404429 1294283 1213837 1134088 1059213
9825 1059213 964542 906045 860070 800795 734417 689398 629558 587235 554869 512987 499507
9814 499507 468258 440140 436088 428585 416948 428819 444884 441441 410619 407967 413316 420180 408914
9801 408914 412640 406438 446285 500243 547495 614947 685423 752125 814833 876283 904407 876800
9789 876800 799999 695456 593066 497121 420280 377615 342377 333196 339431 334800 319011 295750
9777 295750 299365 290448 262330 257790 239320 212083 200490 196730 203534 223363 249212 248528 246715
9764 246715 249928 260039 252062 253385 255254 238351 227735 224863 205268 181224 161756 166278 174123
9751 174123 155905 148304 179646 200029 200542 189163 199369 212262 201642 188935 191887 205976
9739 205976 208684 222509 217788 196890 174011 175485 181321 176349 171138 183699 180441 182754 169423
9726 169423 170880 178774 176566 169803 147617 130142 145185 125748 116201 124582 142345 160258 157584
9713 157584 158930 141451 120596 136436 132112 107097 86975 82561 92487 88236 80173 73502 78185
9700 78185 72803 64193 67882 73422 94014 110033 101697 84191 88909 101478 85725 89565 126587
9687 126587 182867 225567 295590 376915 391780 357919 286192 208578 149300 113826 88419 78896
9675 78896 77657 82272 90274 87187 81699 79688 67151 50706 43013 53965 48557 58873 43626
9662 43626 38002 69771 64669 60394 76791 72732 52415 51286 37142 32602 48490 59100 69629
9649 69629 63061 51343 43396 37880 21505 9045 18003 20882 31053 24546 30033 21219 25133 40831
9635 40831 68255 65155 67036 65851 51587 50761 65236 61239 45300 43307 48438 38433 51155
9622 51155 59259 70207 58175 55405 52002 59078 88298 88948 82275 81690 76099 80337 80712 78992 73250
9607 73250 67488 75156 67836 55375 53221 53088 65514 67431 53380 38623 46830 56325 61964 60338
9593 60338 61048 67028 67982 71466 88328 84763 81239 69348 65004 57828 50066 71841 83066 69846
9579 69846 73520 81310 83859 89948 102351 101281 87489 64337 58702 56820 41012 32258 49462
9566 49462 56963 55285 25621 24541 26226 22177 30767 43046 38977 34536 39234 27133 28826 49940
9552 49940 51441 25378 25821 15154 33502 50968 54905 65366 60565 64126 63412 64337 76626 89804
9538 89804 68572 45784 59779 84178 90126 95913 104399 95905 102089 94695 78574 90364 115979
9525 115979 118281 139203 175041 228433 254275 279810 315709 331618 317673 266492 219352 172116
9513 172116 145663 121414 98965 76179 66999 53162 49746 61481 60678 66042 75776 73696 61795
9500 61795 65260 69220 74492 93234 117974 132399 121626 123923 138214 165066 195664 225250 264082
9487 264082 331683 418306 464410 469069 457438 434680 391348 339201 290739 246416 192002 146740
9475 146740 102575 75195 64885 78497 79506 76066 56511 59703 61850 54036 50474 49681 39659
9462 39659 42303 57588 66559 62164 67368 82874 82697 106596 140278 179761 209986 249677 305052
9449 305052 334140 329657 282835 222028 179685 141284 107774 92771 72097 69187 71027 84652
9437 84652 117039 121177 114734 116804 106465 76163 67306 71040 75835 101551 127459 140738 143447
9424 143447 122510 108482 103342 86153 67308 64608 76278 92873 87558 81148 73071 90781 102795
9411 102795 100255 65101 56612 66732 78629 98846 109727 106160 127769 118743 103629 98673 98660
9398 98660 111433 126460 129643 133253 160029 165501 187113 219886 258698 298482 347662 388319
9386 388319 464455 592372 752309 1008002 1376713 1858379 2303662 2544197 2490431 2190494
9376 2190494 1833744 1496996 1221100 992943 782570 651304 576211 511019 451587 393438
9366 393438 348268 331200 283244 252555 246671 248077 229809 218826 218398 217670 237343 258037 267163
9353 267163 280244 312235 360948 387831 423933 455399 472665 491491 545949 655099 768737
9342 768737 909802 1095708 1307108 1478540 1590189 1588819 1453309 1276884 1103164 947192
9332 947192 800859 691941 606204 538983 478242 431982 381813 332206 335966 333659 333825 353453
9320 353453 359511 340730 326727 328748 356088 413502 490520 572879 640599 667742 643783 589852
9308 589852 552528 543541 534261 551949 614646 707516 824742 919136 993872 1040403 1024464 985745
9296 985745 943201 859283 810041 782671 740055 717169 707214 687973 683860 704173 757371 865963
9284 865963 1013384 1199659 1422926 1726816 2137674 2694372 3427992 4450087 5932341
9275 5932341 8137332 11279907 15102291 18336906 19262410 17146538 13205542 9532260
9267 9532260 6875001 5074266 3862217 3030209 2429399 1987667 1653635 1434709 1272214
9258 1272214 1146647 1035152 956843 895323 831095 758528 691716 613257 535706 488771 472873
9247 472873 443707 441526 439336 416376 405006 394609 398919 457927 537370 572546 584302 582532
9235 582532 565936 527721 497290 463767 400838 348860 319905 289403 264098 234875 219426 198751
9223 198751 190320 174664 166101 182740 210878 210230 213486 210476 185570 160928 147958 144485 151654
9210 151654 159187 143107 138688 148802 166005 171358 168517 177157 177118 174306 169494 161625 150068 148702
9196 148702 135401 105604 94710 99114 83625 85642 92524 107023 123229 125580 125163 115638 124275
9183 124275 105005 89414 82846 69113 53434 40692 46464 59691 65365 59811 69791 73191 101580
9170 101580 124138 138152 155708 156890 152750 142501 125353 115526 102994 98636 106079 118661 130287
9157 130287 143185 140972 141259 128158 116726 102993 110828 114145 109548 102876 103248 118869 115959 120064
9143 120064 111963 114165 126891 141920 154461 168016 167159 167854 153414 136427 142646 138087 119419
9130 119419 113072 106748 132002 168144 199259 206909 206163 209015 210317 184903 184557 189496 210998 239408
9116 239408 251618 279436 314730 371197 412366 473003 533807 586975 605507 548591 428070
9105 428070 275329 168331 122978 116431 129223 159551 174751 193699 180237 151476 140997
9094 140997 127612 111150 97594 102662 102796 97092 113040 114728 124909 125169 118119 128193 150133
9081 150133 170364 159666 161998 163654 155291 165495 182506 184340 190791 213524 225614 227956 235056
9068 235056 247901 267803 277894 299512 311466 317899 319504 329567 308303 309819 312850 296898
9056 296898 301765 308847 320437 351700 391044 416677 432158 459583 473364 509210 525028 521262
9044 521262 506633 513921 513497 504106 507705 498215 492290 489569 486324 523566 585589 621941 674877
9031 674877 714684 756742 772812 776725 795340 843714 877777 939650 1017225 1093441 1160348 1237735
9019 1237735 1327258 1406366 1469736 1527858 1625133 1743219 1856086 1962907 2060748 2161488 2309479
9008 2309479 2485234 2660449 2839130 3060051 3343651 3686763 4099964 4593162 5184651 5893350
8998 5893350 6784961 7900540 9367541 11307012 13773593 16581797 19412248 22062587
8990 22062587 24922002 28901613 35191397 45261860 61342728 87354849 129472147 194025679
8982 194025679 277249202 352025652 380395324 344054217 263072523 181570967 123049169
8975 123049169 85763692 62216417 47061237 37205789 30756271 26546361 23656324 21309292
8967 21309292 19005648 16579460 14153494 11918105 10110792 8708166 7606852 6772656
8959 6772656 6127091 5618639 5213260 4874501 4552760 4232653 3961724 3778079 3670794 3616113
8949 3616113 3611728 3624160 3629137 3657263 3750796 3997905 4451742 5255904 6593613 8917317
8939 8917317 12959807 19387026 27055586 31607784 30160052 22809685 15199391 10260934
8931 10260934 7328390 5542241 4409463 3662773 3190763 2887448 2703862 2565783 2435822
8922 2435822 2288069 2124632 1952056 1768637 1576538 1396328 1228005 1088686 1013410 959123
8912 959123 924746 895185 856763 824127 801498 773970 740374 719477 708145 681431 677953 672666
8900 672666 629229 597429 581562 570292 575527 590070 582529 564016 557501 549726 535657 531801 541229
8887 541229 536804 539212 543909 529515 522726 518941 531312 541668 578467 637737 718458 825043
8875 825043 969453 1104789 1156620 1070537 897079 746462 643500 587501 557348 523551 520209
8864 520209 507695 490897 490672 491254 515978 557624 597110 644759 659095 628618 566258 468434
8852 468434 358506 288916 260855 245588 226336 225410 214421 219446 227793 232479 247902 240218 238582
8839 238582 234577 233503 220302 208385 199437 210197 221378 217370 195130 192032 191725 194808 173198
8826 173198 162518 160640 139845 128915 132344 145218 159117 187158 217761 233599 263287 286475
8814 286475 304197 289140 258499 241101 224463 194426 160825 168983 203450 215552 208762 185596
8802 185596 160423 151486 150355 140705 129376 114130 118204 141387 149534 153908 149123 138681 154363
8789 154363 178692 192096 203547 204944 202722 217264 222427 214397 218283 215376 219242 186352 161120
8776 161120 175429 188527 181206 167126 172759 167001 145130 156845 178812 177200 186805 176109 156321
8763 156321 143072 127161 105019 91191 95897 101628 93395 92292 89556 77748 84723 96695 99286
8750 99286 91677 110418 105315 93502 101269 104846 108630 117113 125418 154012 179083 177127 156516
8737 156516 143016 136637 138498 147954 154187 138981 144791 145275 161376 160987 156814 167742 163276 172039
8723 172039 165603 160467 155686 147267 142589 136548 142203 141445 144702 152242 143338 132344 146812 150505
8709 150505 157339 152222 124235 104783 92838 84072 87243 95469 106463 120959 134162 141709 136335
8696 136335 133695 136674 133275 128036 139820 180216 233973 273089 275525 236831 180808 158111 154075
8683 154075 138321 132718 145430 147862 153656 194087 242018 273421 299717 310670 303255 281778
8671 281778 269728 264349 258150 245088 240162 232205 219659 216669 221989 221299 208580 221677 237924
8658 237924 223495 202038 211688 225990 232395 243443 234123 221589 239476 244348 250963 276366 314257
8645 314257 350081 391185 415502 362585 317667 303966 282627 244658 214456 213840 211095 205965
8633 205965 222392 221661 199508 187671 193700 202107 209575 202692 202093 204822 201403 224781 231341 212839
8619 212839 200669 192032 178147 187655 212669 227716 224379 215079 206892 194147 193958 200282 202886
8606 202886 199348 203244 217934 241346 238787 267053 308677 317864 334492 357284 342541 338133 362862
8593 362862 372513 414874 467080 571096 740954 872822 885741 743941 589318 523075 491844
8582 491844 506670 591971 741207 975584 1312172 1713040 2016457 2054209 1799783 1420455
8572 1420455 1070868 809830 642929 541007 458051 384726 345662 315432 317022 317537 307204
8561 307204 276154 244020 223992 208888 206981 203789 215555 243793 271024 321172 427014 576969
8549 576969 700695 738881 628237 459885 336544 246514 210094 210884 197041 200230 170237
8538 170237 176110 181448 191072 180471 190460 196756 198309 208415 218718 212702 192433 156375 141043
8525 141043 131258 116983 122770 126940 140827 158921 166013 153874 132464 123294 101196 72654 74524
8512 74524 81616 103991 138594 149163 137254 139972 139615 131218 111423 110043 116036 122855 133501
8499 133501 133818 131746 131438 111290 106673 104883 107769 98485 110174 113561 97716 83530 80273 83623
8485 83623 77238 78926 88087 88083 92315 94304 100237 85033 65995 65434 71111 72893 59190 48627 69965
8470 69965 58266 58014 55631 50789 66039 75727 67353 57566 50775 66148 71048 76904 83840 81083
8456 81083 65708 47280 36688 45642 59629 69689 81063 80165 87053 77476 73799 60626 42133
8443 42133 53653 64976 76969 72972 63132 73684 76160 76481 66915 53856 67918 76415 104917
8430 104917 124446 112750 116501 116808 110753 113827 99664 86687 78786 54976 48352 63370 78302
8417 78302 93397 94739 73558 70898 73513 57893 38276 29716 35122 35616 25656 32386 29097 36098
8403 36098 37343 42225 47094 40023 43027 53069 41454 47554 47744 56319 67869 70501 94058 98659
8389 98659 76453 87942 82302 70405 51420 42317 49181 68981 70160 63180 67766 59128 41694
8376 41694 46066 47380 41195 49017 53046 32237 20570 23643 29282 32606 38586 35677 24525 23483
8362 23483 23752 16948 14726 11555 27066 30972 19702 25584 30621 30351 13044 15175 14899 30111
8348 30111 34830 33939 32006 21007 14955 16103 20200 18574 18241 13640 15008 11320 25729 45765
8334 45765 40448 20977 41344 43258 39042 46335 51477 53330 60954 66148 64600 54838 59955 72865
8320 72865 88765 76909 52675 42228 43997 45491 36587 34296 38641 28718 19832 22296 36634
8307 36634 47773 42925 31070 44419 30381 6114 38152 37140 22015 15810 10201 22149 29596
8294 29596 26511 16997 24732 25492 20024 42941 71108 45654 36669 22026 6461 31008 46416
8281 46416 32536 20900 17142 25142 27290 40655 39012 45204 57797 68252 52872 36792 50121
8268 50121 38309 22514 30488 46063 58802 52860 47124 44911 40236 28289 24839 16294 9502
8255 9502 34159 38592 30207 30759 28722 38048 39871 37895 42922 43625 18762 -6045 -10764 8692
8241 8692 43504 51002 27757 18933 22244 38782 23848 26225 53441 45549 30300 16881 16349
8228 16349 21571 24676 25846 25501 12343 12130 6298 29223 43930 50477 51074 44789 55464 54704 51029
8213 51029 39981 23317 27309 25383 25825 26337 15213 224 9516 23619 40171 44660 44055 28636
8199 28636 -4228 9317 35420 34432 41981 38058 34795 42791 43037 53807 58867 48654 34123 41402
8185 41402 51644 51296 24177 15266 20210 12459 26376 42960 35439 32435 29942 22178 29945 31419
8171 31419 59765 73971 74657 80340 74977 63934 54383 31444 25898 46932 35866 12124 15641
8158 15641 5756 7910 8498 28494 43269 49865 54863 51586 52624 49930 42630 30017 9785 6015
8144 6015 20061 16564 25231 29367 17975 17748 42165 50246 41039 44025 40046 17938 14393 19552
8130 19552 24569 32898 14111 28343 33097 39866 54951 57547 59469 65950 49002 41007 38158 39512
8116 39512 55634 56217 60453 68745 74280 68590 55133 38911 35806 41686 27493 15959 40843
8103 40843 45705 54890 69678 67213 41662 28721 42082 48501 56714 55725 76073 69374 64489 57273
8089 57273 55713 54291 59003 72699 57360 43060 42746 58749 68037 79427 99410 109466 99903
8076 99903 113967 114216 100552 97909 84316 90865 100525 96820 91511 99352 101126 110924 105941 93776
8062 93776 90636 104933 116367 111303 110350 100639 95781 99597 97664 117849 125238 139136 139798 132776
8048 132776 110741 117920 132345 118937 111172 105974 111575 114477 145270 158628 151696 141460 131698
8035 131698 112572 119664 134530 138205 155806 159816 168485 166824 175929 159561 169492 169746 169006 180781
8021 180781 194870 197531 182001 171608 172757 184376 181148 169372 163148 148768 151622 154710 149529
8008 149529 138511 130659 135808 157641 169284 171838 185487 162801 115221 121700 123526 139738 144261
7995 144261 155954 163476 173683 178446 167159 142795 130068 130926 123653 118128 125590 128773 132184
7982 132184 116967 93317 101884 96015 111436 118099 121727 134457 133408 130861 121748 133311 132841
7969 132841 122211 107958 98808 90825 100093 112692 118411 108152 81458 68787 85176 94556 91959
7956 91959 75247 73031 80220 106621 119061 104607 95467 104126 84853 91405 89486 89345 84645 92118
7942 92118 84892 70615 33760 29345 48021 59708 64019 54024 39614 47805 46424 64960 60980
7929 60980 65623 85203 85898 89153 76088 58014 43572 58364 78190 74386 80446 97299 116035
7916 116035 105450 75914 82544 94964 80403 59839 62835 39942 42620 68649 77112 60048
7904 60048 51390 63774 75033 59611 40063 25420 28697 28264 20803 32334 46937 36362 33863
7891 33863 53497 49840 50717 35009 12118 5201 -4763 -5210 -2061 12208 49354 59492 49884 52788
7877 52788 60540 56959 35275 18249 31153 62131 64326 47809 54189 55294 57612 42241 29752
7864 29752 29063 31404 44453 65612 64556 62348 57984 50980 44312 34466 28689 25033 24719 22193 576
7849 576 -189 21212 11141 -6609 -343 14158 17966 22214 28723 27080 28449 26332 22861 7229
7835 7229 9752 8051 19386 24173 16290 3454 12576 16083 10242 11490 491 2235 14666 8367
7821 8367 19172 19525 28277 32516 34551 44031 46618 31189 33365 23482 13975 3658 665 -3047
7807 -3047 -13554 -8737 15395 12561 25532 25221 42227 46792 32851 38553 51733 45498 37861 23425
7793 23425 18093 22137 24219 28395 39377 56484 43512 39757 30434 41727 30001 17158 16480
7780 16480 24072 22729 18465 4126 -997 -9000 -10854 8891 12570 9744 1732 -9110 -5412 16301
7766 16301 20342 26928 13856 6669 16667 25482 9606 24242 25330 31664 58084 52035 29725
7753 29725 31286 29802 11871 -175 16724 19765 -12985 -20944 -28 17811 35580 25239 13529
7740 13529 7790 -9670 -11440 5482 15076 4028 -1356 -6490 -13264 -12062 25134 31752 16472
7727 16472 12752 30427 45433 36076 6912 1985 10586 13828 10564 2150 9718 12283 21440 1195
7713 1195 -2946 2985 10306 6623 10081 3957 843 -16952 -23865 -9545 -640 4015 8508 22030
7699 22030 18969 8304 -13814 -26889 -13740 5312 14068 6302 -6366 9483 15084 5324 -5231
7686 -5231 9547 15308 4247 -5648 -6231 -13917 -31931 -28794 -28980 -13974 3602 1544 -1270 -9249
7672 -9249 -21918 -15150 -13996 6082 2808 -1545 10680 11751 5694 15319 34202 30290 12453 2674
7658 2674 15332 16844 9166 -9021 -18226 -5311 5756 4524 5519 11008 20700 16981 -3735 -9941
7644 -9941 4307 14037 -8412 -8355 6951 12167 24997 20295 9508 3553 3797 8859 11806 16121
7630 16121 34710 35385 14302 7473 -3983 -2288 -1753 5883 24676 24058 18273 24197 18463 -7934
7616 -7934 9094 23269 28690 19968 18364 33523 43272 30450 21448 24700 22746 19091 22368 13962
7602 13962 18447 2475 1589 9581 6711 -16088 -31098 -16905 -18151 -7110 -7794 -3711 -8949 -6705
7588 -6705 -27805 -30763 -9763 31683 55619 47697 27028 19373 23503 25961 22461 -666 -18043
7575 -18043 -14576 4526 7887 45 -18454 -16410 -8296 -15063 -3984 6425 6919 -3594 6158 13076
7561 13076 7601 10418 11129 5312 1066 -21339 -33133 -34377 -28188 -24447 -10734 1678 9869 12358
7547 12358 7748 -3079 -24613 -33723 -16984 -18127 -20698 -12764 6941 -1950 -495 -4786 -2418 816
7533 816 -17511 -532 2812 -18203 -17541 -17954 -11412 -4222 9332 12148 3391 783 -8263 -5948 -11520
7518 -11520 -31710 -44864 -45775 -49323 -49979 -28223 -28392 -21240 -16213 6109 13602 23393 16530 13233
7504 13233 2771 15227 6154 -17220 -18643 -101 -7723 -18834 -6950 -265 11791 24648 18117
7491 18117 26483 23167 13420 6535 15154 13640 -11438 -11275 10395 18119 1309 -3997 5835 15060
7477 15060 17971 2149 -11963 -11738 -16614 -4072 -7036 -10440 -22062 -31121 -30704 -25276 -982 1100
7463 1100 3615 25765 32201 32212 28599 20632 -7521 -20558 -5982 12346 10921 -2301 39 -5048
7449 -5048 565 12631 12425 21897 3219 -6766 -12249 -12132 -14797 3021 19366 24635 16050 -790
7435 -790 9454 4674 1785 20739 5416 -2820 -7141 -13760 -9179 -2639 2661 15843 -833 -6233
7421 -6233 6946 17993 8476 -157 -7885 -18060 -26009 -41564 -33976 -13110 -8098 -18856 -24358
7408 -24358 -4704 3999 -1700 -2514 896 12893 449 -1089 2364 1298 -17334 -13695 -17697 -22927
7394 -22927 -16167 -6690 -4883 -4185 4139 10978 3702 121 8121 3337 14461 17325 18404 16137 3413
7379 3413 -3514 1150 9938 25118 17050 8257 33366 49287 30366 -828 -14603 -4735 9312
7366 9312 1563 -9115 -9488 -11303 -10209 -14311 -22203 -29260 -9430 -4387 -10340 -1160 -4330 -5595 -1676
7351 -1676 9029 -2932 -13128 -12715 -12460 -15818 -9269 -1819 -8718 -14981 -10239 -6408 3433 6621 14489
7336 14489 16686 12577 21073 28127 16063 -11546 -3935 -6415 -5434 -16200 -19527 3732 12537 3055
7322 3055 -13044 -5980 -8298 -20940 -11435 -16711 -8859 -24161 -27648 -13916 2581 2596 711 -8331
7308 -8331 -13814 -17538 -12183 -4220 -1648 -6058 -8716 -8561 -13815 -24126 -1411 15769 3510 3426 13723
7293 13723 -26077 -30240 -26166 -13767 -11730 -18738 -17661 -18483 -26428 -27200 -16779 -20161 -8022 3189
7279 3189 -916 -30017 -28247 -13529 -9729 -1383 -6247 7201 2733 -4056 -10049 -15096 -23785 -14925
7265 -14925 13208 18601 25244 40101 18410 19420 33081 37436 40440 47413 32192 22666 18527
7252 18527 18426 9862 4790 -2299 -11134 3845 -3380 -25923 -8455 1954 15468 14041 12767 18966
7238 18966 25364 20466 23491 13637 1375 -5442 2612 3105 7619 20045 16627 -8201 -15172 -19185
7224 -19185 -15552 -5651 16835 7116 -7602 -9960 -7661 -22748 8298 33460 35861 37390 20927
7211 20927 4837 5844 24704 32974 20417 11417 -2241 -9708 -7256 617 2751 -1664 -8804 4858
7197 4858 -4710 -11170 -16563 -14466 -13014 -26625 -40167 -54847 -53459 -34930 -5718 9909 18506
7184 18506 15924 21851 10855 1412 11180 19423 20030 17970 8322 -1529 -9012 -25893 -15332 -1207
7170 -1207 -5875 -130 17251 13760 14546 5645 6393 22865 22072 4741 -2685 13514 32091 53444
7156 53444 47584 41730 55047 52600 53676 43712 40328 35649 20760 7153 -3207 -3342 8860 -3462
7142 -3462 7383 17197 26166 14171 660 -8593 -6379 -11481 -16482 2183 22385 44291 32971
7129 32971 21024 10483 16330 3200 -14063 -5114 -10038 -6706 3551 -6946 8370 17773 9000
7116 9000 758 17394 21873 4489 -3960 3302 4976 2949 720 3489 5484 -14689 -28230 -25544
7102 -25544 -5029 -950 -10368 4768 19879 4329 -1204 -11314 -3500 14966 32134 38048 23759
7089 23759 20580 23893 21592 15164 20672 13298 -12509 -8028 1603 -4771 8434 26141 29137 18594
7075 18594 11102 7268 28054 13405 1064 4447 -6294 -16904 -14706 1641 11973 8972 3016
7062 3016 20112 18446 16817 24190 11421 9484 20786 29575 21382 12287 -8853 4041 12851 16305
7048 16305 34255 41253 30532 18696 13680 11510 16037 -11199 -10224 1796 2814 11109 25985
7035 25985 23518 670 1941 17475 25709 24097 16743 7615 7310 12107 8741 2855 18162 37369
7021 37369 36184 25135 18979 22830 -12460 -19566 -25792 -23806 -23831 -4578 7736 7554 11238 5936
7007 5936 -9332 -5863 17714 25245 26408 1777 -4703 -12227 -34567 -45130 -39192 -16567 -2315
6994 -2315 1075 3399 -9419 -14096 -3156 11622 14621 20319 2213 6203 35058 25329 16375 32420
6980 32420 9067 -22188 -9072 11161 -1589 536 3844 -26924 -31908 -23785 -22210 -25671 -7278
6967 -7278 4765 5565 10907 14828 25805 34442 22294 26068 18273 1455 -15957 -18967 -18821 -13333
6953 -13333 7784 19426 5331 5503 -5157 727 14366 5901 2579 -328 -83 -3631 -6951 10195
6939 10195 -619 1785 1386 20050 13272 3955 -2714 -2886 11336 10576 -2820 -9978 1954 3898
6925 3898 4156 -20491 -27476 -23717 -32978 -17178 -22484 -28818 -13636 3324 -1930 15857 7147 -17762
6911 -17762 -10800 -13461 -3299 -15227 -4785 11070 8048 25546 26011 12285 907 -11717 -16676
6898 -16676 -11345 -8973 5935 13826 -5220 -20871 -6880 7258 8551 35109 21010 -365 -5309
6885 -5309 -11801 -4149 9127 28766 19311 2009 7291 -335 5049 7055 -10711 -14171 -4254 1127
6871 1127 7667 8006 -2558 -5107 -2236 5419 4235 4841 -3702 -6628 26131 37946 19228 -10324
6857 -10324 -10312 4474 15998 13936 2701 3319 2092 -6416 -16034 -30183 -24733 -10826 -12670 418
6843 418 23895 -2769 -20997 -18069 -11553 -9900 -21435 -31527 -12338 9909 9579 -10994 -17659
6830 -17659 -4696 -6258 -26665 -16230 5290 2900 2017 -4616 -26750 -35141 -30505 -21984 -50663
6817 -50663 -46452 -27060 -8783 -3506 9156 6681 -9673 -26509 -15454 -15989 -9917 -1177 -912 40
6803 40 -285 10612 22126 12598 2714 -10717 -21111 -24007 -14575 -13999 -11376 -14545 -34212 -33451 -16923
6788 -16923 -3555 12468 24440 30218 32590 26095 4000 1253 10699 22527 33956 41017 21583
6775 21583 25531 13159 8638 1858 -11109 -19413 -30923 -13574 2252 -2191 -19017 -22508 -17066
6762 -17066 -32216 -43264 -24617 -5094 2454 10286 -8860 -38017 -30519 -29459 -28105 -24255 -18417
6749 -18417 -2669 9001 6802 487 7040 -650 8087 10464 -11904 -16577 -21818 -22647 -31408 -9334
6735 -9334 11614 18769 36840 66553 82201 81667 99040 107220 113769 78164 46506 30970 3956
6722 3956 -7852 352 -2017 1503 3934 6927 -20593 -31578 -30047 -17027 -14322 -17339 -7140 10103
6708 10103 31035 19802 -4408 -23775 -33914 -23988 -13344 -21315 -30261 -28275 -6478 17526 -490
6695 -490 -22045 -26212 -12212 -23884 -16798 -6625 8441 14436 21822 17964 -12539 -10981 -4613 14021
6681 14021 24227 22977 33325 10440 7361 -3466 -1731 3820 -461 4246 -4917 -4285 14074 -785
6667 -785 -12807 -68 3982 -5843 -21611 -12425 -6302 -9101 -3354 -4770 -17833 -41019 -26096 -9422
6653 -9422 -20757 -28536 -6583 14455 13209 10041 5332 -5083 -2606 22247 32692 19584 13946
6640 13946 10914 647 14777 25547 14460 5293 8031 8930 17818 27181 26503 37156 33300 35030
6626 35030 14784 -8962 -15142 2064 30374 19517 10856 -2144 1221 9023 10932 13367 24986
6613 24986 35038 30600 28311 14967 -1012 -13838 -19635 -24035 -16008 -5979 20736 14460 12726
6600 12726 6684 -6033 -17113 -11354 -9661 -19698 -10050 -18990 -24536 -27003 -17063 -4642 -4829 -27681
6586 -27681 -39827 -26123 -6423 9294 -6509 -11838 -14647 2993 -361 3585 14136 11832 3074
6573 3074 8417 -191 -5530 -11015 -24266 -27883 -24435 -21970 -27556 -31924 -31768 -30379 -17599 -8430 -3026
6558 -3026 4973 5036 -5466 -20642 -36144 -21093 3406 13810 17175 16535 30953 21000 2874 -6888
6544 -6888 -25339 -7086 18686 44461 14562 1969 6275 -2882 -777 -11507 -20777 -9292 473
6531 473 14432 8392 1665 -2721 -16437 -14632 10529 17688 -4299 -16515 -5814 5732 2292
6518 2292 6746 -2146 -7962 -14028 -8450 9768 14945 5334 -8427 -18015 -30270 -25452 -9592 5761
6504 5761 15898 15748 21550 32809 25285 21028 14416 11561 18555 22699 10532 -7456 -15844 -11979
6490 -11979 -18918 -13972 -19124 -23285 -7345 5344 14025 1514 2954 -639 -8711 14836 26011
6477 26011 24515 8974 -10373 -5578 -12305 -8881 -10976 4108 5791 6113 -18335 -30806 -31891 -15794
6463 -15794 -2213 12229 7761 170 -14525 -28913 2398 9990 7759 1990 -5984 -15439 -22389
6450 -22389 -16876 12714 755 -33398 -45390 -41925 -11794 5615 15433 23880 10688 -18638 -25253
6437 -25253 -17635 -19455 -11247 -18675 -19087 -670 -4814 14760 29394 19524 9578 15430 37005 24964
6423 24964 9709 16589 21988 7648 -1786 -5510 -12946 -19481 -20560 -10292 185 4243 3317 22993
6409 22993 20518 -1249 -4331 -14326 -10002 -4614 38 -694 -6873 -3161 6068 9012 -4190 -15874
6395 -15874 16138 26313 3898 -21369 -18008 -15571 -15256 -17013 -26547 -23963 -21956 -28409 -24505 -27312
6381 -27312 -27206 -18000 -18324 -1528 -3604 2611 9838 -1058 555 11438 17552 2660 -19451 -8394
6367 -8394 -8071 -16474 -15258 -21062 -30364 -53032 -38673 -25222 -5600 6250 -22240 -20873 3383
6354 3383 4364 -26515 -19860 -10611 -8883 -9101 -9139 -24615 -32864 -21404 -10953 -11330 -6580 -11628 -8894
6339 -8894 -3349 10266 22829 10242 -4252 -1883 7413 1089 3125 23148 38200 49390 38368
6326 38368 28739 13026 -10638 -19203 -12375 -2311 -3433 14993 34262 23965 20783 8086 -17
6313 -17 15026 15293 8328 -6614 1124 31922 20321 -7993 -32483 -26699 -16200 -20922 -25384 -24381
6299 -24381 -8489 -7562 -7099 74 -2213 -17088 -29414 -31864 -17015 -638 8620 2945 949 10251
6285 10251 23578 25803 14128 -4037 -4457 -9179 -2307 -12718 -11801 -6623 -16010 -22682 -8880 24292
6271 24292 18156 12234 -4825 -8370 8860 32846 34362 15503 20003 11489 -2041 -3675 -10
6258 -10 -1367 5397 -2537 -9819 -6354 -2170 -14457 -15424 -10643 -2365 -11890 -1573 3396 2893 -4021
6243 -4021 -1419 -2765 -12748 -3114 -2657 -16042 -11048 -9873 -17568 -20595 -7661 -19244 -38752 -26087
6229 -26087 -19644 -20797 -23449 -23209 -11330 -3182 -9850 10090 12626 31392 29006 8844 -5748 -15775
6215 -15775 14053 31285 23680 26217 22610 2106 5494 32508 29631 5533 -5601 5672 47986
6202 47986 44170 28610 17833 22821 25328 27238 15386 15984 20828 -2765 -22390 -17739 -7291
6189 -7291 837 9094 13657 8492 -9830 -5323 -8389 -26696 -27714 1236 4498 -2739 6052 -1396
6175 -1396 8969 14434 15374 8310 12508 8875 14174 14077 -2094 -16133 -4706 -5829 -11747 14698
6161 14698 31384 16162 -1276 -16572 -3114 -16229 -18577 -24441 -22790 -17451 7812 5146 8618
6148 8618 31296 42764 28240 14948 3316 7337 -4027 4787 8936 6826 19319 25249 12815
6135 12815 9752 8085 6001 11514 9279 14120 5182 3215 -9002 -13745 -14372 -21128 -14570 -3428
6121 -3428 11867 11396 3549 -3377 -14547 286 5441 21105 34156 30853 34579 35644 14134 -13523
6107 -13523 -15125 -8307 -10440 -933 -8997 -19518 -19716 -20384 -19307 -9406 -4722 8770 24960 16279
6093 16279 -5795 -14575 -11740 -3456 -920 14019 25250 16417 1188 -7794 -27755 -25548 2418
6080 2418 15484 21571 368 -7155 -17591 -17841 -16684 -25779 -30261 -36357 -42675 -47824 -20672 -1444
6066 -1444 4087 -4127 -15168 -31613 -27170 -16671 -3033 7356 163 -5659 9984 14098 14005 -3212
6052 -3212 -23167 -14466 -22245 -16341 -9614 -12721 16653 18882 -4357 -21868 -13099 7304 29756
6039 29756 10113 1755 399 22214 29456 29573 23332 -3943 -21794 -18955 11183 4868 -7552
6026 -7552 -10290 -15749 -32616 -46744 -36984 -34957 -29514 -9846 -11388 -10515 -8080 -6099 -3124 -3707 -21230
6011 -21230 -20214 -4987 -2135 -9006 -9900 437 -2028 -465 7870 12159 23129 1186 -6527 3223
5997 3223 -1662 -7797 -10462 -17741 -8987 -7427 -6296 -2611 4747 -9704 -22102 -26372 -18076 -9180
5983 -9180 -20753 -37908 -49052 -47753 -21073 -3062 -364 -5818 -18567 -6566 1792 13819 -114
5970 -114 -12645 -14585 8355 9511 -893 -8700 -9487 -14879 -18327 -15223 -15200 -26853 -47799 -35948
5956 -35948 -17725 -13382 -9079 -19138 -28951 -13565 -8603 -5750 5095 17197 -71 -2254 18350
5943 18350 10174 -2531 -9070 -16901 -21200 -24445 -16484 -12138 -7391 -7073 -6478 -3654 -19775 -13375 -25081
5928 -25081 -31236 -24764 -20014 -10939 -10975 -236 -2360 -18606 -22616 -22880 -17498 -20115 -26673 -26261 -29094
5913 -29094 -11476 -13030 -34411 -23098 2122 25715 14961 19241 21916 9268 12138 22801 34319
5900 34319 26009 4752 -4156 15749 588 -16703 4185 18876 19356 15448 27959 24264 8935
5887 8935 -8601 -11061 -2043 -10622 -21743 -11205 8546 12097 13309 28972 5814 2335 -7992
5874 -7992 -26816 -28930 -31829 -26371 -28621 -30721 -14484 -15315 -21319 -17597 -22673 -22230 -12024 1911
5860 1911 -1495 8188 -1295 -27125 -35855 -24935 -17190 -15972 -13759 -11966 -9488 1008 -18125 -44701
5846 -44701 -24924 -9490 10563 6063 29673 31776 29713 41252 35595 33236 10131 2580 -2885
5833 -2885 -126 -2546 15389 24198 11316 4066 -751 -6501 -2348 10673 4880 -16313 -14520 -10146
5819 -10146 -859 -5667 5989 10740 -1055 -6085 -4256 14348 16686 15639 -728 -9547 31 3236
5805 3236 -16657 -28818 -26119 -13655 -10928 -8022 -3829 -2144 3520 -1620 1422 14551 15243 8470
5791 8470 1497 9915 -4232 -353 19287 14536 4101 4063 4722 -3790 -12822 -29578 -34593 -15332
5777 -15332 -2076 -12632 -31240 -26821 -22908 -25789 -17278 -19812 -28158 -9717 -2038 -260 6015 308
5763 308 8469 8313 5715 -7586 -11630 -6248 3756 9709 2737 -12080 -12296 3230 11330 -7614
5749 -7614 -5399 -5340 -1883 -8670 3124 3572 6926 7090 -18811 -10990 915 -1208 6873 6202 12688
5734 12688 1471 -17484 -17776 -20503 -45043 -42365 -46793 -40495 -37724 -33062 -38681 -11796 16808 27945
5720 27945 28508 19109 3498 -7917 -26544 -31044 -17175 -14497 -1278 1556 17655 20903 5014
5707 5014 -15287 -13184 -6642 -8800 -4335 2191 14583 9029 1048 -4151 5074 12269 15464 -14349
5693 -14349 -31965 -24739 -2821 15801 23039 -2678 -29310 -24246 -15068 -31208 -28200 -4702 -1661
5680 -1661 -16314 -3062 1633 -7485 -26674 -32775 -36387 -28802 -6768 -13691 -5881 -7560 -8464 -1710
5666 -1710 6670 23994 26839 7869 -15477 964 16734 -3459 -13390 -30746 -37335 -34417 -31265
5653 -31265 -30614 -26319 -20046 -5267 8087 14842 -296 -13990 -9887 -11046 -15567 -10535 -17631 -36810
5639 -36810 -23732 2758 13440 13468 2949 5786 18666 12116 8724 27219 32686 17853 5567
5626 5567 -11456 -20358 -21417 -15675 -10072 -13551 -19981 10821 44788 45375 24989 13165 11421 11822
5612 11822 -8307 -26826 -28870 -19565 -18253 -13191 594 18151 15653 16854 11841 7352 -6359
5599 -6359 -1584 671 -18041 -3180 21426 22887 3408 -43 -8954 -11267 -19640 -19965 -5437 -3104
5585 -3104 -1185 -3526 -7991 -5818 -12358 -11720 -4573 -8983 -25453 -34210 -7346 613 -7317 9425
5571 9425 28053 18808 3612 -5239 5392 10604 -1959 -10976 -13974 -17815 -10350 10321 18274 8225
5557 8225 5408 6894 3022 -2384 2860 9033 10118 15175 -1075 -9148 -3943 -4617 -8329 -20634 -13107
5542 -13107 -10193 -20630 -20563 -19384 669 16955 12391 10153 4679 -5240 -4266 5394 -14082 -28696
5528 -28696 -19229 -14706 -19876 -5206 3755 -10969 -12131 -13198 -24331 -34281 -26441 -14141 -3935
5515 -3935 -19536 -33918 -26070 -20284 -10650 -18853 -18488 -6996 -24536 -34298 -21689 -13380 199 8658
5501 8658 13751 9414 15011 8849 2562 7999 11606 22536 28691 16676 6462 -24946 -24336 -13358
5487 -13358 -15583 -32292 -35758 -26818 4591 12178 -719 593 -13518 -2121 7526 -3038 -55
5474 -55 54 3718 14185 31325 24883 5125 3090 5313 951 12414 -1686 -27236 -25609 -33374
5460 -33374 -22084 -1129 17217 17195 16479 3810 10135 21366 24864 18220 9301 7497 12437 5938
5446 5938 3804 -13339 -9741 -6925 -18239 -16553 -10744 -5962 -4104 -10488 1356 -11864 -32876 -41265
5432 -41265 -16683 6197 -5104 2470 45557 44910 18701 7059 18652 31534 7811 -15034
5420 -15034 -30756 -32661 -32321 -18845 -12562 -13292 -19323 -31660 -26336 -1767 18467 8006 15769 8186
5406 8186 -14556 -4832 6485 9283 8753 5091 -11991 -27071 -16710 -3862 -15141 -17098 -12324
5393 -12324 3983 -13685 -26025 -27571 -12911 -7511 15356 4748 -16831 -16074 -14838 -18108 -5332
5380 -5332 14462 12972 4959 7489 14934 -98 -16231 -13579 -8113 -16853 -3574 3711 8275 3100
5366 3100 3442 -8485 -11144 -1649 -9273 -17567 -15441 -5556 6935 3537 14994 20270 -11189 -35221
5352 -35221 -32742 -41157 -38063 -34906 -43039 -37601 -24639 -21643 -9786 -2312 5832 139 3767 6074
5338 6074 4534 -5366 -23372 -19195 -9691 -3450 13021 2085 6803 -1987 -1633 -862 -14168 -5391
5324 -5391 21443 33242 34634 31878 21018 21139 9258 -2464 -4981 1458 -3118 -9421 -3792 -6156
5310 -6156 -16504 -15363 -23804 -18921 -28326 -45211 -24603 -8854 3704 3691 1840 -1493 721 5405
5296 5405 -6545 -10712 2072 10809 -1270 -6148 -11045 -20 22524 14909 11462 16045 25049 30923
5282 30923 35692 25520 1613 -13840 -19131 -16604 -5080 -9354 -16591 -12142 -9064 -3783 -4375 -3624
5268 -3624 -8526 730 13146 2866 6260 15183 4896 2501 -6055 -5452 -18146 -3518 812 -4062
5254 -4062 4991 3075 13158 10418 5724 -5771 2634 9910 11385 19659 -8961 -14054 11430 18815
5240 18815 12968 6592 4511 11653 5507 16948 17620 7556 -5092 -4143 17192 23290 18524 33795
5226 33795 38227 32079 851 -5658 -2422 -19056 -11599 14665 11053 6918 6215 -10590 -8107 -10329
5212 -10329 -9370 -21528 -42571 -32547 2809 3625 9076 23915 6266 1860 4185 -26309 -27673
5199 -27673 -14276 -18537 -28389 -21446 -8440 1401 8659 -4398 -7846 10138 11906 -1397 -20520
5186 -20520 -41911 -36067 -15313 -7048 -17392 -16686 17603 35995 40058 39101 45113 43250 37541 24415
5172 24415 8853 -7238 -6113 -6250 -12113 -9719 17893 18236 5494 13769 14002 -3490 -10348 1947
5158 1947 -8824 -3306 23018 36174 30024 17473 6157 -4335 -6343 3699 18902 712 -16363
5145 -16363 -15028 -19317 -4652 6171 15487 8081 -11600 -21429 -16134 -13664 -15650 -32185 -27417 -18445
5131 -18445 -15109 -14255 -5939 -22201 -34925 -35327 -30760 -11029 -3599 -9316 -2257 3686 9903 25334
5117 25334 30260 37252 2922 -16304 -7429 5663 19191 103 -11883 -8756 -14634 -31169 -28603
5104 -28603 -38732 -27464 -14495 -3088 1860 10064 19882 20482 37354 29416 21910 28875 16670
5091 16670 -6835 -5555 -11272 -25573 -18991 -20756 -22102 -8801 -10192 -6456 9169 5939 3167 3853
5077 3853 -2847 -6459 -5854 -18450 -3946 16428 29438 17924 7073 1335 -10292 -22665 -9812
5064 -9812 -18981 -35670 -34434 -29058 -17714 -9730 -10398 -15237 -9904 -7096 -13501 -3617 7579 11214
5050 11214 16693 16598 -441 -16690 -3435 15519 9821 -8368 -10921 6835 18080 7927 13249
5037 13249 3696 -6889 11700 26047 3444 -2634 -2043 3436 5762 2951 -535 -11790 -30882
5024 -30882 -35198 -37944 -27806 -3480 -6392 -24736 -30399 -16976 -8428 -2872 6154 -6330 -20167
5011 -20167 -1637 2104 -7108 -15276 -28361 -23146 -9329 -5016 -4910 6847 9038 -2787 -17682
4998 -17682 -22607 -26001 -25699 -28775 -13753 -375 9994 -8034 -8300 6555 16585 21927 20695 24292
4984 24292 23652 -3618 -23713 -32932 -36701 -39131 -4459 15521 13798 -1333 7078 10180 8400 13135
4970 13135 -695 16403 26812 13185 22572 4587 -9271 -8390 -10433 -11772 -479 7881 -12854
4957 -12854 -29748 -24152 -18993 -6171 11748 1671 4951 14003 31216 11219 -8542 -3265 5297
4944 5297 4155 27948 37061 21664 22432 -8585 -23047 -21625 -32110 -21845 -8881 9084 27975
4931 27975 47316 40070 25905 19998 4862 9371 36085 45372 31671 16182 6179 2100 3675
4918 3675 1815 -5290 -2163 -23201 -30792 -9489 7397 13278 21583 32567 12975 3308 6195 -348
4904 -348 12341 7326 -14118 -22458 -19200 -12171 -14241 -10689 -27826 -31291 -25581 -19335 -36109 -35650
4890 -35650 -23980 -24472 -34941 -28755 -28886 -25878 -8760 5028 8030 3635 -8637 -10635 -276 -4273
4876 -4273 -12197 -10975 -20350 -26870 -9472 -13160 -10943 -3922 15120 3334 -11333 -19454 -5352 -11520
4862 -11520 -20659 -13934 6438 -6173 -23350 -21746 -12555 5149 8630 11140 -5910 -13174 -11758
4849 -11758 -27128 -19405 3430 19075 16319 3831 -14584 10791 19480 18360 4784 -16091 -23573
4836 -23573 -24475 -32082 -9864 8342 16071 17042 -6479 -12266 3020 15295 14090 25552 39406
4823 39406 43966 12280 -11905 -28543 -5131 7169 3300 12129 -605 -15809 -12862 -22917 -25213
4810 -25213 -22085 -22881 -19446 -12111 -1232 5710 -102 13312 -1697 -7182 15351 14418 -4304 10373
4796 10373 3198 -9559 -6606 -1707 -6347 -17595 -26522 -20013 -2262 -4794 4614 12392 23858 7626
4782 7626 -10401 -3781 -5032 -9608 -19187 -17203 3318 -1005 -21905 -30446 -20328 -518 3261 -7804
4768 -7804 -32600 -49865 -34621 -23235 -24877 -25857 -12608 5902 5176 -737 -254 -14054 -13239 -11691
4754 -11691 -21418 -21507 -9243 -2897 -7905 -9758 -5535 4307 8956 5002 -19717 -28118 -28814 -19398 -2596
4739 -2596 -14220 3781 4671 -9887 3373 7321 4175 10544 24174 6303 -22485 -30660 -31949
4726 -31949 -22177 -17506 -11192 -2386 -1983 2470 4613 -8025 -30328 -42286 -48849 -22240 -10756 -14412
4712 -14412 -19229 -12726 -8211 -12824 -3310 -1185 4114 6517 -4500 -25713 -36334 -29574 -19143 -17152
4698 -17152 -18837 5021 15347 18098 2131 -23772 -38939 -37163 -41322 -29496 -18980 -3512 26357
4685 26357 23346 8425 21229 39875 32897 24613 -10269 -24253 -18397 -40791 -50155 -22307 538
4672 538 468 452 -4821 -13767 -15421 -15639 -14914 -13948 -22365 -22255 -17676 -10120 -436 -1655 -851 -22799 -24960
4655 -24960 -17290 2625 -3392 -6977 3478 13161 11968 15313 12392 5116 7890 9831 8404 16428
4641 16428 14914 15105 -4674 -4081 544 2072 -5313 6440 7500 4394 11118 -775 3016 11001
4627 11001 19344 4286 6128 1689 -14736 -1314 2040 -20717 -20061 -20869 -12880 -1939 1253 -6809
4613 -6809 -10413 -4941 8637 3449 -18673 -14575 -4441 -15262 -10448 -23033 -7232 -6727 -8466 -17410
4599 -17410 -11422 8895 5381 -12502 -1509 19147 34104 42456 41283 30413 3351 -6067 -12403
4586 -12403 -9770 2793 15083 20826 13870 -15024 -8026 -5651 -9590 -28471 -39708 -43330 -33982
4573 -33982 -22440 -14867 -13487 -20394 -4740 -4223 -9879 -19310 -26290 -17649 982 3355 -6718 -18595
4559 -18595 -27057 -3539 1973 2626 9536 -3694 4888 6312 -19980 -18100 -7127 -8203 -15275 -2363
4545 -2363 -8446 -10019 -26503 -24295 -12755 -6349 310 -2987 -1455 -5697 -6661 -9261 -19007 -25469 -12305
4530 -12305 2203 -1710 -29956 -42158 -26181 -16366 -21075 -20483 -28118 -31592 -14668 -2834 8077
4517 8077 10625 4800 4495 -8348 3395 22429 20566 1069 1338 21176 31249 32573 23457 23228
4503 23228 19434 28572 29932 35415 38191 28106 2401 3400 16688 26058 33775 27187 12671 -25407
4489 -25407 -50206 -53557 -44891 -45492 -27306 -9641 -9816 5190 -4692 -1399 10192 6033 7371 15983
4475 15983 29426 33578 21747 7399 10111 2100 -21823 -31794 -19153 459 1500 -5483 459
4462 459 938 11088 20371 22937 4732 -10166 -5860 -2332 3632 3283 7315 15342 -266 -22868
4448 -22868 -16974 5052 65 1264 -3992 -16833 -26248 -28242 -13261 -11971 -24873 -10770 -5454
4435 -5454 -12589 -6322 3955 -9592 -29224 -31726 -39606 -23528 -10533 -7634 -3344 11659 7632
4422 7632 4870 -4909 -25230 -6927 -11527 -7458 7461 14637 -4962 2217 2717 3723 -11974 -13677
4408 -13677 1305 32607 37449 29351 20840 25330 10140 -4219 -7288 -3021 -14815 -13041 -23407
4395 -23407 -31300 -20034 -18478 -16838 2736 41237 32771 14574 10877 7516 18621 13179 7884
4382 7884 6787 10354 12666 18490 1293 -15976 -11701 -7846 -12695 -36 1356 5379 11806 19224
4368 19224 8152 602 8354 13456 21877 36156 20912 7435 9897 11857 23751 18943 21489
4355 21489 23852 23370 25209 16387 -5522 -10357 -14968 -11912 -15021 -17470 -4193 -1701 -17936 -17595
4341 -17595 -19290 -17208 -21301 -28000 -31757 -16373 -28840 -15739 -283 -2249 -13029 -18557 -23026
4328 -23026 -10593 17543 21255 10658 -576 1132 -9595 -6552 4742 6551 -14199 -19415 -21173
4315 -21173 -15390 -11360 -10858 -19478 -26231 -24851 360 17654 10567 -5403 -21537 -22096 -13565 -11062
4301 -11062 6063 12716 10562 -9915 3649 -1345 -9867 -11751 8645 387 -15383 -19169 3573
4288 3573 24765 21653 8606 -5324 -6752 454 -4900 -12168 -20368 -41300 -35153 -19578 -19303 -3434
4274 -3434 -10334 -36995 -30979 -3055 6711 4083 2104 -6229 -6401 -14462 -15375 -1760 11341 21855
4260 21855 15685 7178 11361 3489 -1645 3333 5632 13544 -10706 -29355 1035 22446 -2989
4247 -2989 -21533 -14632 -6618 -4129 33 779 -5886 -29820 -32556 -7865 -18787 -15242 -973 -9424
4233 -9424 -18860 -6463 6647 1879 1609 -4447 -25431 -22705 -21998 -30108 -24231 -5551 13431 -64
4219 -64 -6251 9772 -5425 -5041 4684 8773 10687 27723 23818 -5112 -1483 13762 9504 8361
4205 8361 -9311 -16785 -18372 -13481 4809 27061 18114 19845 13404 12658 6053 5308 -7861 -12442
4191 -12442 -11690 -2958 10883 14143 11765 4715 2521 10794 13958 20168 15852 9582 7471 -17322
4177 -17322 -24580 -6797 -9276 -1840 8860 16048 4779 -3537 -15451 -17920 -10170 -3701 -11921 -1531
4163 -1531 7681 7781 10776 12514 14659 8645 21293 32680 19640 17354 19132 18336 16802 13706 33611
4148 33611 36261 26487 -1022 -1635 10846 -4857 -20948 -20896 -17666 -17209 -13264 -21071 -10184 -11220
4134 -11220 -7134 -26895 -39381 -51486 -42043 -21394 -4724 3635 4294 58 -4229 -24511 -44419
4121 -44419 -38810 -42219 -32375 -22452 -25837 -12700 -18451 -41753 -22195 3062 10847 6754 6806 -3430
4107 -3430 -16043 5573 31839 36706 29139 24023 12205 13219 18806 12139 1408 -8959 3616
4094 3616 -1506 3390 23100 27831 6453 -16742 -10712 2416 8748 7575 13509 17352 20422 13062
4080 13062 -11727 -1241 -9302 -8342 -1267 757 9837 28195 4886 6515 22824 19902 -331
4067 -331 2313 7107 7213 939 -6148 -21660 -14319 -14656 741 3359 -5451 -7119 8228 20212 11100
4052 11100 3186 -13846 -22071 -22002 -8211 12590 8597 -5401 -11004 -7479 2203 24385 18738 12290
4038 12290 -634 -7827 7060 16377 18698 11191 -2756 -7129 -33921 -45686 -24640 -20012 -24322
4025 -24322 -19904 -27015 -38094 -28882 -35501 -33773 -20370 1468 10038 8027 -4750 -12591 -15483 -27716
4011 -27716 -49877 -48660 -19652 -10079 -2939 -2654 -8802 4355 1235 -12742 -12731 -12436 -17200 -11851 -6716
3996 -6716 -283 -13803 -4849 14066 3227 -1598 7549 -10529 -17823 -21316 -24112 -18287 -16427 -9204
3982 -9204 -2084 4434 9393 12960 1070 -5123 1511 4581 9271 -5150 -272 -8346 -6223 11920
3968 11920 -4092 -8794 6215 21729 4614 14937 978 -26115 -28433 -13564 -16453 -11257 3833
3955 3833 9005 17959 -1673 -879 1884 -13921 -12499 -14756 -12017 -10011 -2639 -2893 -12824 -7410 -3102
3940 -3102 -15805 -7801 5117 -4525 -5842 13295 15067 2182 3055 -30643 -18603 -7527 -9406
3927 -9406 -19096 -12545 -4346 7516 16885 15706 4332 -4519 -3790 1334 5256 -14239 -32358 -6227
3913 -6227 9793 4643 10152 15960 4876 2327 8784 -587 10339 8247 15625 23542 16326 16892
3899 16892 -1247 -9821 5269 -8412 -315 23899 2945 -1915 -7195 -13942 -28098 -5527 -9568
3886 -9568 -8267 5586 8889 2674 9059 -5540 -28852 -18493 -2323 4727 102 1805 -2918 -3802
3872 -3802 9328 7846 8759 -7835 -17649 -8379 -244 9492 11563 14233 -12032 -12587 12008 19286
3858 19286 11287 5513 -8355 -4865 7135 16456 7048 -6151 17362 27836 5374 -18926 -26672
3845 -26672 -37232 -33613 -2185 5157 1040 -845 -3538 -2652 -9711 -18165 -24165 -8519 5763 -1767
3831 -1767 -357 1000 29754 25714 23837 22501 10634 -26065 -31543 245 13506 22337 7062
3818 7062 5520 -4983 -15496 -13760 10997 -3109 -3598 -11409 -17652 -19856 -35109 -39533 -48890 -29910
3804 -29910 -18661 -17626 -2327 5052 12741 -8719 -21672 -27312 -13875 -8731 -10606 -3501 -8392
3791 -8392 -10720 11304 18846 26003 36507 18322 615 6449 14964 -1276 2820 13116 -8595
3778 -8595 -14979 -24100 -14568 1703 17057 18469 2478 5243 18462 13482 17154 17588 1328 11449
3764 11449 26179 31431 39085 29974 15579 8921 12576 23270 21136 24938 25931 12472 -6809 -9904
3750 -9904 -14749 -15284 -24705 -31962 -30174 -9139 15301 24139 28293 16515 21351 5355 -13761 -6087
3736 -6087 -17514 -25820 -20200 -12152 -10758 -15882 -23468 -36783 -47660 -22134 -2036 -4315 7728
3723 7728 13893 -3492 -8886 -1888 -1282 -7121 -10709 -13388 -23059 -19918 -14902 -22481 -17869 -16091 6651
3708 6651 8476 -4537 7682 8686 -821 1703 -4464 -5669 9477 18694 21393 24517 25930 23441
3694 23441 13184 15587 12223 7972 1040 3752 26422 33669 26387 8119 -8819 -6816 -11919 -9360
3680 -9360 -4678 2152 2489 -1700 -7710 -13332 -9305 57 1517 -3664 -4335 -16805 -9636 -16820 -1165
3665 -1165 -1317 -10500 -6077 13472 19224 11040 18305 17069 -2354 -25770 -22579 -27421 -34893 -48985
3651 -48985 -33588 -15163 -14894 -17917 -8682 -23535 -3500 -5416 -20956 -9655 16773 37077 45091
3638 45091 28676 9651 10225 7097 5810 -8669 3850 22960 20873 121 3724 5137 1703
3625 1703 -6152 -5480 3593 5752 2145 -3931 -20598 -2208 4477 14529 8090 18899 10801 -11583
3611 -11583 -26659 -29240 -17924 -16482 -32808 -16849 83 -12216 -10117 -12272 -3111 20439 22103
3598 22103 21110 6415 7391 -1117 -8516 -10974 -10910 -29603 -20498 -16181 7845 9354 7190 8034 10025
3583 10025 16837 -3525 -19767 -7313 5364 7670 10738 13743 20956 23832 21741 21816 8852 1671
3569 1671 -4824 -10267 5403 19131 28678 26777 16254 3049 22842 27975 17874 24943 27458
3556 27458 38191 35718 30069 28622 26082 12897 -7817 -9107 -5011 -14662 -21389 -15889 -14762 -1047
3542 -1047 -5532 -16090 -18655 -5353 -1883 -12410 -21134 -6947 10459 14550 11223 20353 24021 19221
3528 19221 16868 20068 1338 -11200 -10887 368 9602 6406 14435 10278 11130 13294 3064 -14483
3514 -14483 -16165 -21356 -26827 -14971 8215 -1252 -2681 6481 7108 5097 11276 4048 -6508 19734
3500 19734 17139 -3876 -12203 -14606 -10897 -12332 -9397 804 -3066 -12475 -17474 -25164 -29559 -35243
3486 -35243 -14776 4684 4884 -10239 -8182 -8654 -13870 687 4283 20319 11608 9648 15764 17447
3472 17447 2765 5974 14194 12374 2152 370 3099 -1914 -3014 -1427 -6145 -1999 -14385 -13692
3458 -13692 -19605 -24551 -10192 11417 12778 12166 -4806 -10969 -3811 2639 2945 13428 -4253 -5571
3444 -5571 -3947 -10342 -14429 -15368 -216 -3575 -2524 1856 3830 -6479 -9404 5569 8135 12784
3430 12784 15286 25444 36678 23490 12279 2573 -317 -3964 816 13951 15768 -651 3362
3417 3362 -1981 -23829 -16258 -15167 -4803 4050 11159 21476 17397 673 -4085 -13522 -15961 -2371
3403 -2371 -3774 252 10562 17651 16749 14152 5298 1293 7410 1417 -21878 -19773 -8174 -15052
3389 -15052 -168 4076 -9845 -11807 -9373 -8027 1748 20878 6696 -7277 -5719 11869 21774
3376 21774 16952 27964 23850 14100 15065 17265 613 -974 21239 34426 25344 13691 2369
3363 2369 -3124 -7011 -6212 -9853 -5713 -7303 4753 13464 15207 21520 16476 8297 -3215 -22348
3349 -22348 -25409 -21667 -16308 -10255 -16287 -19319 -9175 10079 19492 21789 28563 16183 1097 -3209
3335 -3209 -1005 -9240 1600 16115 19728 6793 -3564 -25960 -29615 -21040 -25173 -18264 -4260
3322 -4260 -5224 -3637 3825 -2550 -10449 -21760 -33727 -40110 -46152 -41213 -34855 -31374 -12922 -5663
3308 -5663 -19995 -15631 -14461 -13402 1162 -6615 -18140 -5016 7493 -17543 -20300 -2625 10280
3295 10280 -1159 -24649 -28611 -29496 -13505 6414 23497 6305 16462 16834 6498 -4169 123
3282 123 8887 -1112 -7876 -13640 -5775 8631 -4823 -20298 -27871 -20130 2404 9052 -22539 -28450
3268 -28450 -15273 -18413 2084 -6628 -4406 -14873 -38138 -29498 -40310 -49095 -38029 -24466 -18916
3255 -18916 -15524 -3424 3 7692 25066 16846 9734 863 -11862 -17257 2875 16218 4462
3242 4462 4512 2970 -2050 -569 6976 14399 -1513 -20013 -14034 -6475 -3319 -13939 -560 5655
3228 5655 11887 8338 -15907 -11320 9121 296 5295 26599 29658 18144 3879 -9122 -35577
3215 -35577 -38948 -16325 -18929 -9608 4340 11920 37980 40234 28637 10667 10580 17551 26456 3096
3201 3096 -58 -1570 -6989 -13263 -15744 7451 9897 -742 -6931 -11814 -12192 -3432 -10619 -3347 -332
3186 -332 -8410 -22814 -8524 763 -19307 -23951 -25343 -26803 -15299 8065 20117 26432 22227 9124
3172 9124 18686 25656 8074 12843 21190 5970 -21821 -33090 -17684 -10649 -3184 -1290 -1038 4225
3158 4225 5937 4395 11794 -4698 -30643 -22300 -9634 -11800 -22093 -23551 -3307 -4475 -4356 6999
3144 6999 24023 36171 39186 26082 11410 -3947 -36113 -43519 -30657 -13721 -12417 -26145 -23674
3131 -23674 -12305 -2142 -2332 8107 12086 1389 85 11176 18274 7041 2212 24164 25923
3118 25923 29430 29044 11334 -756 -19549 -18034 -14520 -12171 -23283 -22398 -20751 -11892 -19711 -10443
3104 -10443 15033 20348 6469 -2221 -12591 -8049 14176 20516 25849 37196 26616 36529 33279
3091 33279 16036 19269 17972 26875 43563 36386 23676 17093 25366 40012 47666 24568 18774
3078 18774 29924 19316 6207 -3174 -4817 -13842 -1311 8498 19029 -6490 -11486 -10593 -10092 1395
3064 1395 -4093 -10228 6744 9221 6756 11650 27729 23101 2026 -100 -13299 -13952 -31799 -39828
3050 -39828 -26862 -30117 -23847 -13754 7 -10910 -19180 -7831 4892 15857 14424 3794 21816
3037 21816 15637 389 7114 -1409 -7177 -10906 -11573 -11501 -11049 -6653 -5816 -18049 -11035 -24728 -20286
3022 -20286 -24872 -41970 -25942 -34606 -19538 -3676 -2316 -14991 -10935 -1909 -8465 -4887 470
3009 470 6077 23708 10786 -7384 5076 9205 6064 4883 2571 -5138 -21764 -24085 -18243 -10753
2995 -10753 -16240 -22394 -11296 -13235 -11081 -19315 -20898 -11880 2657 7921 -12979 -10515 4813 11964
2981 11964 18700 21472 -13330 -39493 -31217 -8322 15258 2974 3184 -10689 22560 40621 36162
2968 36162 31119 23200 426 -3391 691 1857 10007 3340 -9953 -13690 -12111 -2178 12002 27986
2954 27986 25005 11704 6698 12471 10457 -9752 -19576 -21642 -18336 -20745 -15917 -26166 -47469 -40245
2940 -40245 -21599 -15190 4103 6065 -6303 -5722 845 -6898 -13209 -22902 -17449 35 -4690 -11723
2926 -11723 -888 8739 2685 -6259 -6213 10933 15567 695 -20594 -9936 -10866 -11072 -22745 -27599
2912 -27599 -15024 1704 -323 -16086 -929 5930 -6671 -16817 -26597 -48317 -38345 -27596 -11720
2899 -11720 14826 13019 3073 9010 9446 -165 -11396 -14119 -7493 3820 -4267 -21395 -2303 8156
2885 8156 12108 -7390 -21171 -5386 8414 8032 -11937 -25133 -9718 -5188 -14153 -10881 -21248
2872 -21248 -34986 -36687 -30547 -12161 -2954 -25 10899 11121 -4173 441 -4969 5000 7236 10772
2858 10772 121 -5324 -21690 -16650 -15863 -28256 -27766 -12394 -4563 -7574 -3779 3002 17186 17942
2844 17942 45826 62669 47349 19415 -1775 -9076 -1449 1514 8014 22718 28769 24863 17291
2831 17291 26841 36093 32287 20902 7842 945 -4774 5840 17678 6557 2894 -10626 -3400
2818 -3400 8273 12059 24301 20402 9986 -3832 10997 12651 -1205 -18304 -35949 -24973 -9886
2805 -9886 -10466 -17566 -11506 -9548 -883 -2089 -11954 -1437 4021 -1516 -5491 7108 12059 2412 -24382
2790 -24382 -20243 -28360 -35943 -22271 -17301 -34375 -19815 -2479 7541 14132 -3151 -13106 -7766
2777 -7766 4661 9655 1924 -22622 -19404 -1160 -8720 -21403 -30845 -21784 -28013 -39582 -26067
2764 -26067 -24266 -14023 10510 20827 12094 -8605 -20860 -19967 -24794 -25971 -9257 952 -283
2751 -283 13416 22274 38808 37221 6943 -3862 -5148 2587 -2884 3323 7899 11209 -49 -31634
2737 -31634 -33986 -1972 17264 19530 16679 23776 30637 21959 19379 5050 -2761 7223 15261 18654
2723 18654 14419 4507 14490 16548 14297 18658 4334 -5124 -4455 -567 1288 -4784 -3389 -8560 447
2708 447 2082 -19342 -22156 -15840 -1865 10757 1609 -22750 -16109 -1315 4817 -721 15820 18477
2694 18477 7736 -1149 8399 22808 10364 -14877 -10375 -6507 -18951 -15860 -19531 -5551 10187
2681 10187 3480 428 1156 -9363 -7476 16010 31579 26789 6339 13190 15777 8471 -1125 3130
2667 3130 5001 -6732 -17081 -9512 -14127 -25853 -32095 -20609 -3593 -14895 -15163 -19418 -16746 -24097
2653 -24097 -18148 -9915 -11687 -9478 -478 26233 28838 15320 12944 17773 15960 13382 6947 1784
2639 1784 -16723 -18897 -12868 -13198 -15507 -30659 -31598 -28542 -18535 -13309 -17681 -15817 -26393 -42854
2625 -42854 -24030 -23168 -19575 -3284 2959 9510 -1732 10822 34273 26361 26333 35343 32880 18225
2611 18225 17728 23167 16312 12117 11397 -3691 2063 -5342 -13251 3502 9124 235 78 5225 9597
2596 9597 8078 9338 7046 11312 3355 -24814 -21663 -26601 -16648 -12437 -5986 -4973 25217 32427
2582 32427 37950 38739 40389 40945 19508 11243 4308 10393 321 -6949 -7571 -3306 8680 -2731
2568 -2731 -11568 -5099 -9286 -993 640 645 10028 -4265 5429 12024 6730 19366 24820 10462 -14367
2553 -14367 -27893 -14849 614 -9411 -24504 -26869 -12818 -10200 -3659 23611 35032 19302
2541 19302 3515 -13030 -10827 14752 14849 -511 -12333 -11260 4076 11581 13108 14610 5563 -1236
2527 -1236 13227 28989 33273 12128 -12201 -19809 -11657 -9239 -12355 -20919 -38160 -23467 -15387
2514 -15387 -12530 -14828 -5913 -15406 -9859 14960 20956 19698 15086 3292 1691 -8834 -14868 -12510
2500 -12510 7461 20348 27428 21504 14637 23728 23502 27915 32669 17995 21843 28043 23145 11234
2486 11234 8026 20012 17172 -2012 1437 13288 7192 2947 16013 12979 -141 2942 16753
2473 16753 21363 3831 1579 -14983 -5038 11631 13121 984 4567 -9121 -4101 18395 28150
2460 28150 20205 25489 18505 7958 21491 13175 -2824 -9028 -27552 -28043 -17571 -17431 -8704 -2230
2446 -2230 13200 20373 13564 14648 3151 -9347 -9938 -13917 -2671 4014 -1718 -9599 9179 -658
2432 -658 -7885 20796 27743 16174 -12275 9696 21471 11096 13489 19765 37644 44000 19510
2419 19510 6602 5596 -7556 8662 15410 34966 41238 43660 49841 43209 6693 -2804 -10924
2406 -10924 -20846 -35621 -32264 -1890 19491 36248 41124 48061 38148 9869 -11318 3299 32373
2393 32373 34943 17472 31121 22901 14217 19238 30548 26618 21182 14724 20539 11922 11714 18457
2379 18457 19988 12627 7228 3188 -20714 -7250 -9721 -11447 -15689 -26957 -39806 -38758 -14774
2366 -14774 8800 -1406 8510 26595 33419 17888 22588 28647 27977 17574 27556 26010 24344 14048
2352 14048 -818 -3032 -3843 2992 20522 8768 -1454 2642 -3938 -24637 -45332 -33846 -21998
2339 -21998 -23146 -30988 -19409 -5063 -3474 -1451 -12015 -7831 15979 8394 305 -4655 -3456 8759
2325 8759 22901 26641 21130 17529 26693 18699 10806 15323 18169 12739 13076 21288 40109 24528
2311 24528 5582 5714 19240 20988 55 -8836 -12469 -23080 -22741 -5644 -13830 -2454 8074
2298 8074 61 10183 11960 -2987 -1009 3600 3313 -10517 -9620 -16756 -19146 -7031 -22551 -34248
2284 -34248 -19145 -14551 -710 11597 -78 -26928 -18506 -10005 -7282 9237 24944 17370 2503
2271 2503 -2092 -9680 -11541 -4588 2986 -12482 -17338 -14508 -5451 -13213 -15364 -7393 23574 36798
2257 36798 36052 25765 -1261 -10852 9221 12044 14453 19263 8781 1414 -10402 -24872 -9754
2244 -9754 6680 -5309 12467 3743 -6817 -1269 2054 -13010 -16160 -29572 -20469 -12405 -13674
2231 -13674 3278 10240 9673 7143 -2598 -13732 -11706 5343 8926 3048 1007 9688 2247 -21358
2217 -21358 -14877 6947 4874 2844 -1461 -1160 8575 15890 28541 10515 -8413 -8147 -4377 18381
2203 18381 25895 33553 28437 4198 -6458 8369 5178 11683 5078 -8300 -16362 -34642 -23016
2190 -23016 2610 945 -7609 -10063 -568 -2607 559 7606 14261 10725 -11456 -12566 -20669 -3840
2176 -3840 15139 2814 1930 13120 34821 37288 31918 40080 12011 -8091 -10964 -69 -20273
2163 -20273 -23972 -10687 -1146 2533 -3806 -7406 -38373 -56234 -39322 -28992 -32764 -24326 -19820
2150 -19820 1228 -966 11261 15339 1258 15176 18728 7819 1085 14416 10405 6876 20851
2137 20851 11721 -3018 -8558 8230 1479 -3253 -1712 -8902 -7543 -4033 18292 29985 15399
2124 15399 2610 -13333 -7554 24473 11231 -14576 -14732 -12306 15746 7673 -1836 -741 11584
2111 11584 31684 40311 44404 41049 20433 24471 15478 16955 4730 -17287 -41894 -48073 -28446
2098 -28446 -32237 -28548 -3863 20172 23313 18373 11161 1363 3804 -5246 -8412 12546 8113 -367
2084 -367 16925 27012 20715 17206 5896 -2843 -8215 -9855 -14483 -5597 -18382 -18176 -10129 -6168
2070 -6168 22769 26022 11254 -10405 -6406 -4910 3395 -9322 -23467 -12978 -3366 -7907 -879
2057 -879 -5135 5025 -2503 1899 14551 22509 9377 -9310 -4754 -107 235 3455 -5994 -8185
2043 -8185 -16128 -10983 -18062 -43279 -38886 -26121 -5947 -12562 -17705 -10519 -15026 -25505 -15413 4343
2029 4343 28555 32314 23074 9271 -3067 -873 4742 3458 -15808 -8677 4483 10048 2010 -8337
2015 -8337 3025 -3236 3538 9695 -245 -7219 -6600 -17498 -29204 -13117 4635 12292 6494 -7053
2001 -7053 -5578 -7160 -944 -14133 -12682 2558 3061 -11762 -27594 -24523 -28878 -30032 -10510 -11169
1987 -11169 -20118 -22750 -16660 641 -10805 -23313 324 12197 166 170 -14583 -20589 1539
1974 1539 15549 13640 1852 -2633 460 6653 3569 -31346 -36558 878 13334 30993 21583
1961 21583 -3581 -12947 -10386 -10371 -6632 -2104 2823 9243 -6400 -23975 -24305 -8906 244 -27729
1947 -27729 -42466 -18140 -6517 4072 -1795 -24258 -26475 -26714 -7891 15887 30465 26653 740
1934 740 -12747 -24796 -4129 4311 18457 6305 1506 -10553 -688 12545 -2291 -11848 2074
1921 2074 20078 31931 46238 36823 27932 33724 24529 22855 24931 13528 25999 30198 -4518
1908 -4518 -39286 -22705 5415 14710 12890 2753 3472 2545 -8412 19838 26239 8422 -1760
1895 -1760 -11412 -17377 -19111 -11592 -10284 -27169 -18098 -1540 16113 35711 44797 18099 11643 -12298
1881 -12298 -35067 -35264 -34467 -39518 -43802 -28179 -13963 -10076 -11782 -14871 -26559 -25881 -3923 10942
1867 10942 -3783 -3595 -6907 4852 31308 15352 21888 14609 -885 -7455 -21670 -41012 -52541
1854 -52541 -49320 -37016 -19521 -5282 -491 11030 7238 -12122 -20350 -22043 -10815 -15723 -8052
1841 -8052 -4776 -7132 -1099 -3553 -2945 9363 32400 27047 35420 30986 6364 -3626 -2005 9161
1827 9161 12933 32043 33724 24023 3664 2773 938 -7893 -26207 -19373 -11208 -9556 -15502 -7671
1813 -7671 -10810 -4361 14608 23822 41753 50814 37178 15613 19076 29511 21194 19690 32056
1800 32056 35686 29413 25627 35280 33125 -11591 -17786 -23246 -24641 -9196 -3478 6305 28235 14667
1786 14667 -15590 -11379 -9968 -14800 -23280 -14332 24362 41609 44215 19646 6696 10657 11258 -1259
1772 -1259 -8822 -4663 6083 103 -852 6044 26601 19477 16545 6021 16353 12720 898 -10066
1758 -10066 -8689 -9387 6244 7268 8943 3482 10202 8911 -15464 -11176 -1783 18862 28926 18795
1744 18795 3552 2991 -2719 -10318 -22646 -14537 -14539 -19178 -5100 7656 11339 3020 -4513 -10811 6260
1729 6260 30798 734 -12783 -8395 -13513 -1023 -481 1925 -3910 -21220 -11474 6609 20727
1716 20727 37323 34966 35964 40573 30235 17065 7410 -619 -3143 -4898 -21326 -35637 -22609
1703 -22609 -22019 -28126 -17955 10534 23148 17865 5325 5474 3998 708 -15370 -20167 -21534 -13280
1689 -13280 1440 -9591 -18265 -17855 -26881 -24638 -659 23982 42360 23109 2458 2016 10350
1676 10350 -12305 -24326 -23673 -21404 -8602 3451 17356 8897 15822 -838 -25057 -25162 -15981
1663 -15981 -25151 -44076 -48502 -37558 -29247 -18159 -14783 -22555 -28749 -12105 -12690 -6040 -20884 -38947
1649 -38947 -38420 -36200 -39784 -38342 -19137 -1217 4994 3105 -5778 -26052 -23826 -11354 6808 -8316
1635 -8316 -20649 -14293 -5320 -3884 1467 15752 17655 17948 9720 21461 23463 18824 8387 9369
1621 9369 12713 9567 5952 9005 -6619 -9476 -6391 -12612 933 3283 -29 -8651 -3110 -5103
1607 -5103 -7395 11269 14562 638 -7801 11496 21825 27523 18896 17211 2032 5317 8094 7440
1593 7440 15064 29517 25300 17034 -9122 -12162 -15794 -12249 5499 14270 8539 -9964 -27963 -10465
1579 -10465 -8102 -26011 -37961 -29715 -10600 -9694 3542 12497 11430 21232 31781 38671 22461
1566 22461 14110 15221 19360 22123 7168 4230 -358 -5210 -9265 -9531 757 6058 3230 9269
1552 9269 -319 -14468 -31160 -20297 -9592 -14715 -4357 8049 -16285 -31379 -28393 -24375 -4050
1539 -4050 22387 42015 33116 20632 16052 6962 3027 1798 -16864 -22566 -13702 3197 29012
1526 29012 9915 3227 22393 22323 20796 -3207 -11468 -18943 -28885 -22973 -29512 -19859 -13294 -16617
1512 -16617 89 1716 -1557 9610 29754 19295 -812 15397 4284 9418 19671 14853 -3314
1499 -3314 10776 25250 37840 28828 25902 26223 315 -13532 -32747 -26001 -25271 -31146 -30252 -21837
1485 -21837 -11562 -7180 -14331 -13820 -9961 5986 7015 6422 10924 2907 -6510 -9176 3722 13897
1471 13897 29462 22845 20052 29057 40353 21710 15340 18688 10027 1983 -5061 9929 32900
1458 32900 24454 28179 29167 35618 38928 34236 31200 20055 12153 19493 12264 4739 -6576 -1975
1444 -1975 -451 2330 7087 8079 12374 25882 26479 17824 8144 -2881 2147 261 -7408 -20641 -19809
1429 -19809 -12041 -8456 -595 -2020 14904 23566 23966 10750 16795 26870 13662 -5686 -15048 3595
1415 3595 23111 13188 2378 -2661 7075 11551 21674 16862 11165 4648 13173 25034 11704 15033
1401 15033 962 -18590 -22859 -12136 -9127 -11352 -1166 15608 16564 19315 20085 5127 -1184 -7279
1387 -7279 -31566 -18639 -14380 8919 -16656 -32502 -16413 -11960 -14380 3205 4350 15816 19661
1374 19661 6328 27978 47988 34222 37918 58950 62256 45350 27719 20358 20583 15479 3601
1361 3601 -2690 686 -256 -19593 -33592 -21179 -6082 -1775 5654 -1256 -9329 -8850 -11974 6727
1347 6727 27874 38876 16774 11481 9494 11880 9404 10697 4606 548 -2729 -8990 -3497 -4375
1333 -4375 119 7795 12912 18783 12013 6599 17890 5130 -11067 6773 33033 33016 23062 -14468
1319 -14468 -23721 -31174 -24974 6689 12998 1899 -3910 -4190 -16074 -25514 -6074 -1304 -14992 -15001
1305 -15001 -6928 15407 45 -4484 -5748 -6778 -12802 -26464 -24910 -3169 5244 -1398 -2829 -10181
1291 -10181 -25020 -28800 -26629 -30955 -20952 -3214 1922 5383 -12930 -21368 -38907 -31316 -24160
1278 -24160 -23569 -20113 -9820 -17976 -23565 -27436 -11152 6555 14249 17975 709 -11490 -22353
1265 -22353 -30924 -13574 -12962 -8898 -5825 -3372 -339 17688 31864 43379 53190 39521 26604
1252 26604 16113 9927 19728 7697 18602 14552 13930 10171 -2228 -5921 15393 23775 19093 20048
1238 20048 9917 688 4269 -1394 -3359 -14019 -5024 22209 46459 42301 16620 2184 -8140
1225 -8140 -5398 3969 2498 15635 33797 31556 15333 12007 15379 17679 4067 -1084 -12512 -2907
1211 -2907 -21212 -12779 -5291 894 16042 26014 29245 42371 41019 46517 42909 43042 24423 15357
1197 15357 8680 -764 8367 14093 23253 28036 38983 36281 25982 26517 16428 7823 8376 11920
1183 11920 26171 24905 12994 -4420 5333 7596 -8253 -19159 -13775 1848 3106 -7275 1664
1170 1664 -9374 -16231 -11226 -16095 -17678 -17138 -6166 10661 21700 36182 2554 10221 17542 12240
1156 12240 2061 -6635 -3161 -3346 -13266 -33333 -36553 -41270 -41447 -24980 -15478 1388 2760 1542
1142 1542 645 1038 11628 12724 4799 1148 -9847 -10988 -28261 -29950 -25482 -30750 -10056 -3234
1128 -3234 -3838 -11070 -9024 -15487 -11666 10836 5576 3176 -1279 -8774 -6525 -6201 9607 13633 6120
1113 6120 8605 -2452 -11603 -17895 -18627 -25780 -27832 -8712 -9315 -12968 3265 12519 5700 4746 21389
1098 21389 29792 35603 34934 20957 16398 22786 9612 2493 -1660 -3970 586 -6367 850 -3076
1084 -3076 -5127 -4239 3915 -3545 -22541 -31360 -23534 343 7950 13610 8090 9468 13689 -4398
1070 -4398 -8174 223 45 8265 8016 10876 20099 46699 22825 12460 13705 -3352 -12087 -4411
1056 -4411 -7973 -6392 -9124 -21354 -36400 -32775 -21940 -15840 -5248 3243 9326 1181 7327 21521
1042 21521 38553 37777 16295 -7753 -22143 -16254 -725 14887 16882 11979 10464 18328 30030
1029 30030 29285 28296 38843 36989 15931 6319 -3591 -16368 9125 19214 24971 25319 19139 -4129
1015 -4129 -11889 -12481 961 7564 44 -9905 -16430 -3448 11276 29174 29679 18422 44402 60720
1001 60720 45960 39846 47565 27634 4898 12311 15046 25879 32606 44418 23758 15161 16845
988 16845 29431 28271 23041 24190 18863 33951 34278 25759 43109 52962 37629 10953 6284 29401
974 29401 20310 12113 27976 31875 37398 34105 26286 36169 35461 32961 21250 3148 -3307 10996
960 10996 8510 4711 -4516 -5691 -9625 -10836 9465 24816 28106 21891 10924 6766 1414 11100
946 11100 16452 2348 14381 27101 30373 6100 11618 10593 24782 12830 8215 15747 11627
933 11627 21555 35804 14185 8096 13470 14891 13153 -19224 -15710 -6185 108 -7993 -14284 5058
919 5058 2935 -16670 -26929 -19807 -8622 4239 13338 -4769 -9401 -16938 5539 20721 18368
906 18368 4676 15298 25123 19421 7457 9687 15049 20805 17938 14494 6928 -6893 -2672 -807
892 -807 7152 11663 13714 7166 2120 -19723 -36509 -36457 -12723 -27908 -42166 -48745 -40832 -34982 -22447
877 -22447 -946 10335 1147 -5771 -8660 -718 -2420 3672 -19542 -45552 -41519 -29678 -30052 -22447
863 -22447 -17114 -13600 -32259 -26731 -4672 -5993 -15950 -17171 -11196 649 971 8994 14267 10255
849 10255 47 794 2811 2539 224 -7324 -3956 11318 5536 3802 9140 4884 5969 13244 26881
834 26881 18416 -6168 -17992 -28895 -19090 -19359 -16063 -13078 -21046 4305 5850 -13686 -25756 -16769
820 -16769 6441 3365 -1999 -8402 -6024 -4293 24194 36656 44328 52772 39707 32318 27181 18740
806 18740 594 -8856 -9140 5027 13689 -262 4263 24669 41797 35365 33851 24981 11556 -4526
792 -4526 -19876 -11266 4537 3093 16106 21075 29707 52698 52162 37097 34972 30818 25115 17993
778 17993 30210 44111 41005 34498 49251 63474 54870 46707 40200 30212 14589 12238 10171 7542
764 7542 20069 41799 48157 36699 38821 15484 30466 27992 22027 7849 4924 30372 34776
751 34776 17016 -1885 -5183 -708 15486 16217 9108 1375 -6746 -10819 -18412 -1464 -10424 -18939
737 -18939 -5426 6828 15487 -12287 -24037 -2238 15210 22586 23289 31600 35760 33299 26248 18524
723 18524 8544 13904 24402 28556 9840 -5490 20137 55470 40243 14354 32520 49447 19662
710 19662 21144 25364 28397 27017 18054 5399 6987 19512 22879 20610 9370 17116 20694 -4842
696 -4842 -7994 4384 3392 16653 5472 7057 18 6844 15590 12191 22537 4915 -1346 10686
682 10686 21712 18169 7388 9525 12938 2690 1299 16813 11165 26013 21715 13984 21445 24540
668 24540 25639 21450 21525 24362 35422 47617 48035 50721 31346 31271 36871 43516 35356 17972 19824
653 19824 14119 11581 192 -4103 10823 12970 21482 -7846 -27569 -19481 -10530 -3584 4745 5732
639 5732 -5726 -5553 -11525 4164 11481 17011 33615 24316 20658 19399 10930 16415 33031 38259
625 38259 29102 17488 6723 20101 23698 25524 30426 22743 21118 27766 23838 35520 33335 23335
611 23335 7174 9048 -7972 -7499 5852 6462 19828 19534 12889 37776 34296 35539 52668 48445
597 48445 26029 14538 1046 9906 6017 -22628 -25869 -15745 -5919 -10349 -977 4792 8030 8371
583 8371 -13193 -13031 10360 15101 18734 12797 24926 50345 46146 39159 33686 31005 40602 27678
569 27678 15002 12374 15061 13681 16793 14024 8865 8460 18055 29296 42605 45356 42374 38891
555 38891 32306 16047 34212 49095 41061 30757 21318 22823 33050 36469 40220 20938 28514
542 28514 39077 50862 59768 55536 32849 24011 8816 3214 4151 1629 26515 18305 9103 23148
528 23148 24933 26346 30344 32940 15253 16389 15071 19565 33415 55584 32685 28169 23824 33382
514 33382 29334 20242 25792 6146 14105 8641 5520 22428 27422 14355 12558 13964 7270 17404
500 17404 20406 -1342 12364 22201 26743 -4572 -18979 -6441 10505 12161 16671 28856 23378
487 23378 28860 41276 41330 28098 28550 37188 47888 50492 48796 44722 26047 11882 9556 7701
473 7701 15835 6754 27359 35886 20808 26736 18019 5267 -4411 6959 7005 9110 3506 -3322 -9735
458 -9735 -9174 -5181 467 5530 -7988 -18975 -2410 14710 12744 8592 2785 -3955 17282 23305
444 23305 19746 5381 -3590 3929 10797 29881 11772 20411 11880 10516 10438 -15602 -8988 165
430 165 14148 8981 -14758 -20199 -9544 -12492 271 18155 37163 38138 25072 17020 14749 18543
416 18543 29811 43699 39599 33533 14835 -11203 2279 34088 62872 59623 43979 22992 23161
403 23161 29530 23954 45769 44109 28181 28307 24967 8465 4764 4378 7233 33125 26250 3104
389 3104 14677 33708 26695 12497 24180 38460 38591 35717 33462 23366 18698 11865 11366 27514
375 27514 32880 28811 25088 8472 1095 -8468 1467 9011 8582 8361 20615 12880 8080 -3695 14081
360 14081 24740 26369 26219 27388 35919 28221 23535 26579 21738 28435 28175 14845 20646 21317 14815
345 14815 13262 4581 -5447 -1544 -450 13672 1666 12107 30418 43444 40304 29210 23137
332 23137 29541 32549 20502 19526 4375 -13856 -17814 -7972 -18424 -14407 13217 30908 20589
319 20589 5147 6593 3409 9643 18930 26823 21639 11152 -5770 -19980 -10599 -12847 -11204 -16052
305 -16052 -5745 -4837 -14443 -1814 20765 11708 9767 30585 32556 28574 19742 16475 7781 3789
291 3789 8304 -4905 -12191 3567 13675 13732 10664 21856 28069 23471 10590 9989 18227 16431 24856
276 24856 25320 35173 25088 28483 24477 16784 18729 22815 30512 43645 35467 38736 13848 8680
262 8680 9454 12369 -835 -16839 -20989 -14225 4080 11006 16022 32449 34589 25982 32736 35612
248 35612 20740 19851 25106 23826 29054 27909 14619 1163 -376 -4893 -952 -4716 -6473 6957
234 6957 24445 32438 36541 38044 39499 34587 24946 31644 43329 21202 7326 -7068 -4533 33177
220 33177 51102 25676 9532 2026 -1605 6343 20092 27617 22863 19567 31812 36847 27515 12871
206 12871 11904 4687 22471 23827 29616 20323 23550 46392 46705 50795 38425 35603 35541 36066 42340
191 42340 40997 33378 36372 38065 23358 13631 18014 21913 17729 9222 6332 8382 -11691 -5779
177 -5779 11374 20227 10867 6478 7854 26240 32040 37283 34947 32998 30116 13562 2760 8119
163 8119 15419 18426 23115 30746 18861 7084 6071 11726 5859 12770 20180 25563 21818 18990 12329
148 12329 12427 19257 31104 29389 36696 33097 25259 17467 14789 6693 12233 18449 10754 9769 8670
133 8670 12033 17336 30989 30315 18416 21200 18652 22380 23781 14347 9746 12550 1663 -9337
119 -9337 -9109 -9220 -1520 5422 -2697 3063 10260 28167 14070 8209 2446 15086 24488 25512 11767
104 11767 8765 14073 19077 15476 19922 20726 27977 32602 38526 38107 27717 29541 26055 12906 7942
89 7942 5925 2446 14184 11217 13991 12758 7642 18750 20149 20444 21225 10114 3100 9340 42002
74 42002 44069 10437 -12583 -18325 -12838 3899 9298 9842 2068 -9783 -6104 3572 22137 23094
60 23094 21013 21534 18340 20237 16575 22750 17592 14792 -1859 -9322 2091 19114 11524 2632 1849
45 1849 8190 24273 15876 18668 24605 9623 20267 28763 24081 16271 19453 24311 33106 35466 29343
30 29343 31446 28974 29046 23039 11088 20301 31094 22064 14881 9486 3650 -3767 -6185 -15249 -7804
15 -7804 7768 15372 16934 14432 23385 27294 20879 16877 15982 18797 30258 40126 37289 26200 17194
0 17194
$$ Imaginary data points
##PAGE= N=2
##DATA TABLE= (X++(I..I)), XYDATA
32767 55583 46635 61437 71582 72292 61520 72436 73814 53194 57706 58547 59594 64024 71087 88949
32753 88949 92818 83813 79823 78209 78536 63839 71740 68812 70404 69674 78424 96525 95042 86859
32739 86859 85339 88715 85156 83918 83072 72332 82754 90940 82314 68251 77291 80690 80184 81381
32725 81381 81292 81091 76832 78804 90995 94302 90631 94350 93600 89550 90209 90852 79383 86336 85082
32710 85082 96854 115022 105326 99881 99534 111734 109803 94429 82205 81314 90796 101243 89815
32697 89815 78142 81808 90733 93207 98711 98841 104568 113776 120468 115007 109931 112786 116293 111146
32683 111146 105589 100010 92845 103727 130198 133578 122979 125939 110141 103403 99567 111427 133083
32670 133083 132899 132608 128238 122847 120324 124863 109268 110326 121478 122029 138043 142751 141353 133244
32656 133244 110418 90145 103669 117005 127316 135040 130957 149202 164533 166559 159603 169660
32644 169660 176838 151926 124997 123502 140191 140826 146551 149517 139453 142253 141779 157358 162788
32631 162788 162426 168922 162494 170564 160854 158877 165461 172948 173382 174183 178934 166716 158669 165949 164471
32616 164471 155934 155251 152030 159121 162837 162802 152292 146198 155533 152470 151750 162819 179169 184554
32602 184554 178503 167612 174761 168225 163344 171379 160386 153734 163852 174747 171394 167865 171063
32589 171063 151497 141153 139925 137953 142358 155180 166969 185105 190641 191522 193033 196669 180991
32576 180991 180536 173385 187238 196569 198725 206609 200271 199741 205030 200895 192538 171133 162378 166099
32562 166099 179063 194202 211284 221931 224530 218140 207720 209309 211652 207016 196971 204138 215125
32549 215125 208790 198686 204822 205542 198689 179288 163283 153046 164038 191544 211275 212427 223815
32536 223815 227432 221510 219447 226095 228342 240652 238912 223954 215564 203912 215630 222070 207802
32523 207802 185731 201981 204682 206185 213437 231043 238320 238822 234552 220670 208862 197698 190960
32510 190960 187530 193466 190698 207390 216536 213309 224005 219508 214032 216991 227443 229951 236132
32497 236132 226387 236798 255523 269328 256317 235010 240442 247314 242069 238029 234930 230632 225182
32484 225182 219083 222533 248749 266522 252996 246411 241176 238907 235172 233071 217475 210388 214094
32471 214094 229433 236515 233897 224002 222393 226870 229420 212309 210432 223751 240917 255071 257640
32458 257640 253820 248647 225605 216454 218208 211697 217152 233482 256032 254435 253330 272892 275862
32445 275862 270278 256361 253046 247728 251015 247159 248731 247993 252661 248863 236514 243247 245657 256061
32431 256061 256049 250906 245933 240433 266996 277259 274877 279512 281189 246674 242318 272212 279363 273080
32417 273080 278515 271867 283343 290979 284570 282365 280169 279937 285015 270784 266909 257935 245816 239426
32403 239426 240675 249203 252718 250147 253540 257783 265480 264022 254098 251318 263556 272896 281579 291453
32389 291453 293548 283250 264162 265317 282380 294840 298367 293747 292149 281798 275817 274627 260512
32376 260512 269431 269466 250011 245025 230489 245153 262863 258094 267321 288082 314211 305894 289347
32363 289347 267918 252277 252372 253802 264008 268130 270675 270656 250503 252940 272291 274585 260472 270635
32349 270635 269125 271878 277930 270465 265361 290441 301578 281425 273655 277664 280590 286889 270700
32336 270700 249564 254334 277657 281371 289308 298233 305361 299309 287101 272399 267606 262588 270890
32323 270890 267486 266449 272911 281780 281955 294567 296062 277653 264107 291515 298311 296304 289419
32310 289419 296119 310362 306784 289824 268471 273136 275451 278698 287553 300916 311581 311429 320629
32297 320629 321975 300001 287103 282001 276633 286980 276868 257701 263674 281389 316556 304505
32285 304505 303510 308992 300050 296407 279644 270957 274522 274136 281815 279276 278967 294739 287045 283034
32271 283034 284307 280418 285200 289564 290629 268209 256984 269200 280044 294408 294688 295391 299311
32258 299311 304429 298214 287673 285428 286215 301482 291956 282922 281654 281407 276538 306149 318961 315831
32244 315831 305050 291942 298172 296733 291660 292725 286104 282212 292025 311456 306721 308521 310184
32231 310184 297886 284200 291984 301846 304683 320758 325124 321920 298166 288353 279943 297954 310876
32218 310876 295481 278443 300375 325776 330117 316968 281504 281183 297887 303065 320167 329244
32206 329244 323918 294987 295348 318080 302859 274057 276486 298235 301886 306719 317638 306780 302213
32193 302213 309538 314038 319456 341055 350448 350001 341787 339092 327041 312257 299403 298541 287872
32180 287872 267209 244674 253815 270769 286505 291800 307650 314311 303090 310614 309941 309880 287367
32167 287367 271389 278738 284553 293343 283997 280416 284280 286123 284291 299479 303382 280870 259961
32154 259961 268049 294429 304926 306168 297193 295295 277600 274145 280993 284451 297076 288333 281842
32141 281842 265331 280414 315326 323241 312743 291379 288108 279216 289358 310712 305516 299836
32129 299836 309319 299223 287849 286873 280866 302110 302892 303608 300002 298389 294852 283929 274256 263696
32115 263696 262035 284116 280249 269398 276220 274732 273581 285627 280101 287415 291439 286301 300362
32102 300362 286908 270734 276408 296177 321273 298783 286748 303956 308014 323341 329640 306703
32090 306703 285201 286567 299492 299150 291410 291129 303823 301698 308583 303513 297071 289448 268961 269604
32076 269604 266708 278226 289650 293063 313806 324371 327888 320465 308404 308363 302026 284803 289699
32063 289699 287722 268601 253078 260675 261350 268820 267751 268675 276153 294129 306597 306978 280135 277228
32049 277228 272307 270967 278671 280074 289651 303824 295073 320135 312317 298180 298757 313473 336669
32036 336669 319645 303309 276317 280011 277593 280245 296729 303001 310928 315992 316265 317500 316781 314957
32022 314957 312446 317204 304570 295385 319844 310888 287777 288561 302325 285257 283446 282499 287849
32009 287849 304416 323433 322433 325386 327999 323485 311758 303248 303236 308722 304775 314078 313829 329508
31995 329508 339915 321885 329332 336992 343053 332027 336889 323176 306324 276239 283673 280142 269360
31982 269360 289436 317518 314580 297862 302870 316220 349566 358857 342737 311780 306850 304951
31970 304951 298135 316102 323082 318678 328336 325325 324887 329891 318943 326271 328382 316546 324919 317619
31956 317619 312824 307559 313027 315325 301805 299481 299275 290689 288330 302467 332991 332205 329417 325672
31942 325672 330818 336506 312921 312614 331926 340228 346389 332402 320852 309361 309013 319025 304961
31929 304961 295529 302656 304358 312553 300263 298015 310495 314527 314753 304671 290682 299015 304518
31916 304518 292464 280773 296659 309544 308008 286922 281614 306773 302209 311521 313597 303706 313610
31903 313610 321236 320674 323649 322293 316907 301240 307191 315200 326784 327121 310831 313920 310665 313919
31889 313919 308942 311070 312953 308523 317758 321406 318404 316271 305915 304955 310465 306349 299637 290454
31875 290454 306536 311786 319906 319182 314840 298468 284281 296332 315827 298666 289635 294424 282421
31862 282421 277986 293308 302981 310544 325943 327258 332109 317291 301154 299794 303144 324982 338249
31849 338249 344312 331885 317470 332986 345518 329067 312452 314635 315631 322882 336119 327173 322761
31836 322761 320673 331801 337836 329477 323682 320405 309912 303730 312537 329498 331529 316441 298462
31823 298462 306370 317134 312582 303642 314160 337736 344968 345983 336080 323033 320213 326671 326144
31810 326144 313456 311210 312221 298959 282668 278017 294801 323952 329790 329286 310059 309089 292783
31797 292783 274836 282719 302978 307159 320460 325045 328640 336994 321093 297427 274960 269078 288410
31784 288410 297147 303483 297157 294066 300918 306888 322702 315159 309649 304014 310601 307731 295684 287529
31770 287529 287975 306765 308083 295404 295997 303500 302024 307616 323801 313404 316517 319812 305105
31757 305105 292635 306630 312007 310292 305715 295759 295009 309311 303542 305676 316384 306788 280953
31744 280953 282459 289904 273541 269253 304110 323750 307136 320170 348920 360784 358508 351090
31732 351090 345838 329370 302073 291669 285041 302183 319536 309372 317918 314725 302396 304356
31720 304356 295248 273928 260422 296771 309685 303972 308141 298496 284048 287090 307216 327623
31708 327623 336258 339670 321613 317552 307542 293149 285546 299380 316593 331638 325148 315838 331895
31695 331895 335500 333753 318306 309413 315669 323087 324477 307176 290544 275241 298077 315049 323808
31682 323808 335561 342458 335305 325882 318444 328304 323253 327352 332390 332848 340869 333737 323114 316978
31668 316978 316797 293596 291599 298522 296744 314204 315667 320841 314316 314039 325170 332081 322893 325344
31654 325344 316849 312802 304286 295659 316221 307600 300175 304697 292477 292011 295219 294715 288622 286197
31640 286197 303680 323763 313122 311682 312767 304443 292932 282916 305139 311438 303231 305010 312774
31627 312774 309688 302924 308081 307994 313702 320697 318367 313876 315991 331166 331647 313704 318247 323548
31613 323548 334312 331011 309897 311648 325476 323765 313526 316310 319576 320481 326938 315254 312982
31600 312982 327910 329784 338451 346711 362456 356536 350046 326239 327685 330862 321482 306454 289453
31587 289453 289634 289200 277118 285814 292980 287760 273031 296147 311221 314412 314064 313686 301747 318312
31573 318312 327162 329527 316625 321523 332398 317550 310027 300602 318259 324494 327089 328093 321638
31560 321638 301619 303888 316495 300823 284770 279135 269100 301938 302235 298278 311088 312394 321803
31547 321803 326262 329045 321257 327447 333907 341601 342475 330079 323400 320565 312893 299029 300230 285732
31533 285732 302021 329431 337910 334375 329637 310969 295681 282023 299918 325979 319793 315888
31521 315888 309250 300561 316104 335776 325819 315401 312609 298507 303570 317062 321663 307014 294582
31508 294582 281729 297317 311028 308804 328331 328039 318836 311994 302145 308802 328041 330941 318965
31495 318965 304288 299810 298571 312557 324978 326657 300727 282511 274380 285712 290747 280681
31483 280681 275119 288487 311619 316393 316933 309314 302763 311825 329331 324572 325830 325054 314257 316451
31469 316451 319730 321247 331867 323791 298124 300707 290429 275013 283050 293043 303183 296520 311865
31456 311865 315051 329189 328538 339774 336557 321637 305616 294330 304791 329530 328231 320039 312451
31443 312451 293900 297092 318723 335954 315180 311384 320775 314512 307327 303687 287776 284163 293918
31430 293918 317201 329295 326705 316984 304441 296348 320719 317479 314705 305948 309497 303340 305350
31417 305350 312151 313657 292189 302083 313042 320960 337859 338487 322094 316590 327631 343711 345684
31404 345684 341704 363660 351630 346814 344461 336624 333163 325020 300455 298485 296534 285906 281696
31391 281696 291842 287008 303292 328793 334715 324801 327606 325817 329551 333250 333983 313220 298894
31378 298894 303665 326718 341374 323124 323234 322511 322176 339177 330327 305934 301835 292847 296834 312450
31364 312450 333888 346187 345273 352529 356108 338838 312245 307918 319828 327795 318778 293875 296765
31351 296765 292460 290223 304542 314072 317576 329530 325266 334841 327892 319252 324048 310565 303975
31338 303975 287956 290081 304215 315700 330258 334434 318172 298793 273616 276609 304015 313809
31326 313809 311720 304426 300726 316414 310929 325052 333235 334855 345014 340466 334572 364699 358746
31313 358746 328789 327597 322428 323364 324977 323791 312311 322643 334740 337483 343338 331927 329670
31300 329670 325627 326538 344958 355221 358579 356030 342516 335608 330068 331104 333442 330821 312872
31287 312872 311804 303711 308321 291060 305532 327501 317893 306869 288196 297262 291943 278152 290608
31274 290608 295151 290908 308710 318088 311502 295411 301268 308533 311900 335025 354578 341991 344782
31261 344782 356954 363486 354299 342799 334644 347116 326818 319999 335579 338586 328646 331580 330729
31248 330729 320028 320389 299879 278394 289246 294264 289414 280388 286691 303426 309189 322968 331987
31235 331987 325435 316943 312787 303182 307167 316636 329396 330094 339328 323395 316440 319704 317862 327001
31221 327001 322113 326942 343841 351981 328258 326483 323561 325936 344088 334343 310898 303396 301076
31208 301076 306416 303344 307019 321398 307428 300712 301623 320354 327757 344593 346217 340404 336495
31195 336495 332174 317048 315638 325328 323063 331294 334745 324565 336926 330619 316769 317832 309747
31182 309747 316551 322448 341367 344558 329132 312453 323816 323874 327907 323078 316467 315062 311273 335655
31168 335655 325493 304543 295932 274692 272292 269201 280737 308161 307771 323659 335548 333746 339848
31155 339848 339546 349051 343463 330956 322826 326483 344963 334610 322115 311100 307718 309889 322293
31142 322293 331019 328162 338497 310164 293412 311079 300545 283706 281107 288423 295386 295228 297542
31129 297542 296070 298963 309487 314695 326531 328579 326825 329166 329347 313990 320267 322736 324393 321481
31115 321481 322401 327577 324908 306856 305063 311876 317541 321803 320048 312090 301320 309590 316213 315708
31101 315708 324080 326521 315827 310140 311300 310031 312913 318803 336138 331199 328679 349773 360342
31088 360342 356466 351175 336204 319370 310518 318954 323519 311473 301574 301654 321624 346589 338007
31075 338007 337270 350638 353603 366308 374192 346982 319795 308358 306816 325880 331577 339978 327652
31062 327652 304516 301122 309390 324400 336838 339988 334555 332645 317630 296836 314690 329822
31050 329822 343506 341679 339383 336539 313451 296720 296274 308559 323905 329861 330940 328372 310968
31037 310968 310667 307939 299041 286081 274747 297245 292145 297863 296998 304469 321230 328077 343137
31024 343137 350656 344611 346539 346730 349593 336870 310704 304586 321097 314175 286108 280057 287821
31011 287821 295440 322029 339751 342710 362205 358452 334877 312842 304440 296817 308587 308641 316494
30998 316494 309247 304256 320581 335768 330990 334526 333765 304612 302425 311818 311211 305704 309955 306482
30984 306482 308263 323035 342281 331012 317101 325248 319597 318240 325139 310179 301850 309375 322342
30971 322342 321842 328587 339890 358399 368007 354337 336187 310854 314856 319710 326750 322867 322432
30958 322432 317144 326220 318722 321154 331348 324387 306766 329358 339688 332158 316158 315892 315129
30945 315129 318001 327856 320025 318459 302692 303837 337115 333603 323504 341782 354865 337630 334695
30932 334695 339362 342410 329360 324864 315412 312211 313452 311236 323116 345598 349270 337023 337521
30919 337521 341931 337652 323908 318611 318567 326788 334116 313841 318484 334202 325452 325255 327870 329567
30905 329567 311344 313009 317168 322692 328522 331943 332529 331840 324071 329141 327423 323099 329820 339480
30891 339480 337563 331574 335668 327462 321883 303977 303242 311939 312749 316236 318656 311654 322770 327560
30877 327560 325543 326784 333200 327927 328060 309140 315274 339717 344624 350094 368464 355814 335538
30864 335538 337144 333401 321887 330713 327111 309400 318636 332463 327460 324924 332525 345608 334052
30851 334052 326759 319099 318233 316698 298933 297160 310610 313953 302526 302984 309892 319663 301911 288062
30837 288062 294981 304334 324621 340906 314004 301543 313560 313736 318457 337338 332973 336652 330717
30824 330717 305473 303683 318844 325383 334468 330723 320899 331284 340892 344947 330572 313445 321665
30811 321665 333196 337048 336342 337145 340672 357004 361408 356645 345526 343957 350815 356614 345769 316648
30797 316648 307427 319915 334447 341895 345393 347900 349746 355505 333131 315660 313583 317989 320586
30784 320586 340722 343926 345270 342861 338278 333171 335206 339770 336001 326587 312675 313139 310143 311157
30770 311157 306623 303040 298852 310377 300611 301606 292896 282407 288041 302615 330648 328869 309585
30757 309585 306493 315565 316525 326285 326873 320985 335829 351252 351225 335087 299708 276835 273445 275508
$$ [...]
##END NTUPLES=NMR SPECTRUM
##END=
