##TITLE=Analysis number 328444
Compound Code cc 62004
Book Reference 511/134
Project Code adrs
Chemist Name stevem
##JCAMPDX= 6.0         $$ Bruker NMR JCAMP-DX V2.0
##DATA TYPE= NMR SPECTRUM
##DATA CLASS= NTUPLES
##ORIGIN= Bruker BioSpin GmbH
##OWNER= nmr
$$ XWIN-NMR		Version 3.5
$$ Wed Jun  6 11:37:50 2007 GMT Daylight Time (UT+1h)  MAYBRIDGE\nmr@NMR_250MHZ
##.OBSERVE FREQUENCY= 250.131544655141
##.OBSERVE NUCLEUS= ^1H
##.ACQUISITION MODE= SIMULTANEOUS (DQD)
##.ACQUISITION SCHEME= undefined
##.AVERAGES= 16
##.DIGITISER RES= 18
##SPECTROMETER/DATA SYSTEM= dpx250
##.PULSE SEQUENCE= zg30
##.SOLVENT NAME= CDCl3
##.SHIFT REFERENCE= (INTERNAL, CDCl3, 0, 16.4558)
##AUDIT TRAIL= $$ (NUMBER, WHEN, WHO, WHERE, WHAT)
$$ ##TITLE= Audit trail, XWIN-NMR		Version 3.5
$$ ##JCAMPDX= 5.01
$$ ##ORIGIN= Bruker BioSpin GmbH
$$ ##OWNER= nmr
$$ C:\u/data/dgb/nmr/ADRS/340/pdata/1/auditp.txt
$$ ##AUDIT TRAIL=  $$ (NUMBER, WHEN, WHO, WHERE, WHAT)
(   1,<2007-06-06 11:37:27.01 +100>,<MAYBRIDGE\nmr>,<NMR_250MHZ>,
      <created by zg, POWCHK disabled, PULCHK disabled
       configuration hash MD5:
       76 6E 9A 78 1E 09 19 81 EC 84 63 8F B0 6A 59 2D
       data hash MD5: 64K
       A2 43 5C 61 80 EF 26 08 6B 48 BC D3 67 70 23 11>)
(   2,<2007-06-06 11:37:40.19 +100>,<MAYBRIDGE\nmr>,<NMR_250MHZ>,
      <Start of raw data processing
       ef LB = 0.3 FT_mod = 6 PKNL = 1 SI = 32K 
       data hash MD5: 32K
       FA C8 B7 BE A1 9A D6 D4 C8 C7 74 F7 4A 8B 60 B6>)
(   3,<2007-06-06 11:37:41.83 +100>,<MAYBRIDGE\nmr>,<NMR_250MHZ>,
      <apk 
       data hash MD5: 32K
       DD 6E 46 52 D8 EE 4F 12 F3 30 F4 CA 89 09 1F 28>)
(   4,<2007-06-06 11:37:42.57 +100>,<MAYBRIDGE\nmr>,<NMR_250MHZ>,
      <abs ABSG = 5 
       data hash MD5: 32K
       63 93 76 E7 7D B8 A1 3C 53 83 E4 39 B4 F8 90 14>)
$$ ##END=
$$ 
$$ hash MD5
$$ 5B 6A C5 9E 6A 4B 62 59 94 D3 63 11 8A 89 C2 20
##$RELAX= 
##$RELAX= 
##$RELAX= 
##$RELAX= 
##$RELAX= 
##$RELAX= 
##$RELAX= 
$$ Bruker specific parameters
$$ --------------------------
##$DU= <C:\u>
##$EXPNO= 340
##$NAME= <ADRS>
##$PROCNO= 1
##$TYPE= <nmr>
##$USER= <dgb>
##$AMP= (0..31)
100 100 100 100 100 100 100 100 100 100 100 100 100 100 100 100 100 100 
100 100 100 100 100 100 100 100 100 100 100 100 100 100 
##$AQSEQ= 0
##$AQ_mod= 3
##$AUNM= <au_zg>
##$AUTOPOS= <17 >
##$BF1= 250.13
##$BF2= 250.13
##$BF3= 250.13
##$BF4= 250.13
##$BF5= 500.13
##$BF6= 500.13
##$BF7= 500.13
##$BF8= 500.13
##$BYTORDA= 1
##$CFDGTYP= 0
##$CFRGTYP= 5
##$CHEMSTR= <none>
##$CNST= (0..31)
1 1 145 1 1 1 1 1 1 1 1 1 1 1 1 1 1 1 1 1 1 1 1 1 1 1 1 1 1 1 1 1 
##$CPDPRG= <>
##$CPDPRG1= <>
##$CPDPRG2= <>
##$CPDPRG3= <>
##$CPDPRG4= <mlev>
##$CPDPRG5= <mlev>
##$CPDPRG6= <mlev>
##$CPDPRG7= <mlev>
##$CPDPRG8= <mlev>
##$CPDPRGB= <>
##$CPDPRGT= <>
##$D= (0..31)
0 1 0 0 0 0 0 0 0 0.06 0 0 0 0 0 0 0.0002 0 0 0 0 0 0 0 0 0 0 0 0 0 0 
0 
##$DATE= 1181126245
##$DBL= (0..7)
120 120 120 120 120 120 120 120 
##$DBP= (0..7)
150 150 150 150 150 150 150 150 
##$DBP07= 0
##$DBPNAM0= <>
##$DBPNAM1= <>
$$ [...]
##$SUBNAM7= <"">
##$SUBNAM8= <"">
##$SUBNAM9= <"">
##$SW= 20.6930455092707
##$SWIBOX= (0..15)
0 0 3 0 0 0 0 0 0 0 0 0 0 0 0 0 
##$SW_h= 5175.983436853
##$TD= 65536
##$TD0= 1
##$TE= 296.16
##$TE2= 300
##$TE3= 300
##$TEG= 300
##$TL= (0..7)
0 120 120 120 120 120 120 120 
##$TP= (0..7)
150 150 150 150 150 150 150 150 
##$TP07= 0
##$TPNAME0= <>
##$TPNAME1= <>
##$TPNAME2= <>
##$TPNAME3= <>
##$TPNAME4= <>
##$TPNAME5= <>
##$TPNAME6= <>
##$TPNAME7= <>
##$TPOAL= (0..7)
0.5 0.5 0.5 0.5 0.5 0.5 0.5 0.5 
##$TPOFFS= (0..7)
0 0 0 0 0 0 0 0 
##$TUNHIN= 0
##$TUNHOUT= 0
##$TUNXOUT= 0
##$USERA1= <user>
##$USERA2= <user>
##$USERA3= <user>
##$USERA4= <user>
##$USERA5= <user>
##$V9= 5
##$VALIST= <valist>
##$VCLIST= <CCCCCCCCCCCCCCC>
##$VD= 0
##$VDLIST= <DDDDDDDDDDDDDDD>
##$VPLIST= <PPPPPPPPPPPPPPP>
##$VTLIST= <TTTTTTTTTTTTTTT>
##$WBST= 1024
##$WBSW= 4
##$XGAIN= (0..3)
0 0 0 0 
##$XL= 0
##$YL= 0
##$YMAX_a= 331010
##$YMIN_a= -340676
##$ZGOPTNS= <>
##$ZL1= 120
##$ZL2= 120
##$ZL3= 120
##$ZL4= 120
##$ABSF1= 16.4558
##$ABSF2= -4.237373
##$ABSG= 5
##$ABSL= 3
##$ALPHA= 0
##$AQORDER= 0
##$ASSFAC= 0
##$ASSFACI= 0
##$ASSFACX= 0
##$ASSWID= 0
##$AUNMP= <proc_1d>
##$AZFE= 0.1
##$AZFW= 0.1
##$BCFW= 0
##$BC_mod= 0
##$BYTORDP= 0
##$COROFFS= 0
##$CY= 12.5
##$DATMOD= 1
##$DC= 0
##$DFILT= <>
##$DTYPP= 0
##$F1P= 14.0000005364418
##$F2P= -0.99999901652339
##$FCOR= 0.5
##$FTSIZE= 32768
##$FT_mod= 6
##$GAMMA= 0
##$GB= 0
##$INTBC= 1
##$INTSCL= 1
##$ISEN= 128
##$LB= 0.3
##$LEV0= 0
##$LPBIN= 0
##$MAXI= 10000
##$MC2= 0
##$MEAN= 0
##$ME_mod= 0
##$MI= 0
##$NCOEF= 0
##$NC_proc= -3
##$NLEV= 6
##$NOISF1= 0
##$NOISF2= 0
##$NSP= 0
##$NTH_PI= 0
##$NZP= 0
##$OFFSET= 16.4558
##$PC= 1
##$PHC0= -53.71087
##$PHC1= 7.785018
##$PH_mod= 1
##$PKNL= yes
##$PPARMOD= 0
##$PSCAL= 4
##$PSIGN= 0
##$REVERSE= no
##$SF= 250.130016558532
##$SI= 32768
##$SIGF1= 0
##$SIGF2= 0
##$SINO= 400
##$SIOLD= 32768
##$SREGLST= <1H.CDCl3>
##$SSB= 0
##$STSI= 32768
##$STSR= 0
##$SW_p= 5175.98343685301
##$SYMM= 0
##$S_DEV= 0
##$TDeff= 65536
##$TDoff= 0
##$TI= <Analysis number 999999
Compound Code 99
Book Reference 9
Project Code 9>
##$TILT= no
##$TM1= 0
##$TM2= 0
##$TOPLEV= 0
##$USERP1= <user>
##$USERP2= <user>
##$USERP3= <user>
##$USERP4= <user>
##$USERP5= <user>
##$WDW= 1
##$XDIM= 32768
##$YMAX_p= 420331604
##$YMIN_p= -115817
$$ End of Bruker specific parameters
$$ ---------------------------------
##NTUPLES= NMR SPECTRUM
##VAR_NAME=  FREQUENCY,     SPECTRUM/REAL,   SPECTRUM/IMAG
##SYMBOL=    X,             R,               I
##VAR_TYPE=  INDEPENDENT,   DEPENDENT,       DEPENDENT
##VAR_FORM=  AFFN,          ASDF,            ASDF
##VAR_DIM=   32768,         32768,           32768
##UNITS=     HZ,            ARBITRARY UNITS, ARBITRARY UNITS
##FACTOR=    0.157963299565203, 1,           1
##FIRST=     4116.08930206304, 0,            0
##LAST=      -1059.89413478997, 0,           0
##MIN=       -1059.89413478997, -115817,     0
##MAX=       4116.08930206304, 420331604,    0
$$ Real data points
##PAGE= N=1
##DATA TABLE= (X++(R..R)), XYDATA
$$ [...]
17646c3296J2734o388l811L704R63K9125j4433O258N833K9275P258k1123k9329
17633a3230J4830P430j4078J382J1046J3014K9104R942m4715j9688l482n287j4164
17620b7896K6255O368K522n685l934r109j5267j3091K6335p868J524n027m324
17607b9197K4404R661m667m1859n409k024L0804J0115j6992L166O442L4476M8473
17594F7393J852m2022j5465J9232j9447k4940j2161k954K0989J1234n551K1944
17582B0104L3083L4818L5928r064j0870k2933l8882K487K2763K6296k1903q016
17570F3811j8789K168N315q295k2087O60J4308j3093m405K6850M613j6831k2262
17557A1963m799J8556k6293k5319K2070j7560J334R587p98O085K1646J3242K3312
$$ y = [-33296, -20562, -26950, -30761, -27057, -26094, 3031, -11402, -5144, 689, 29964, 37222, 16099, -13230, 1600, 9030, -5048, -3666, 7380, 20394, 49498, 59440, 14725, -4963, -8445, -13732, -27896, -1641, 4727, 7249, 1564, -2370, -11479, -26746, -39837, -13502, -21370, -19846, -24873, -29197, -4793, 4868, 201, -41658, -47067, -49091, -18287, -8172, -25164, -21998, -15556, 18920, 67393, 69245, 27223, 11758, 30990, 11543, -13397, -25558, -28512, -7523, 3711, -1840, 20104, 53187, 88005, 123933, 114869, 103999, 81066, 42184, 44671, 67434, 93730, 71827, 63811, 45022, 47190, 52505, 44210, 22123, 22783, 37091, 23998, 19593, 46443, 51056, 34225, 11963, 7164, 25720, -573, -25892, -3822, -21382, -20048, -10461, -11259, -5174, 16472, 29714, 53026]
17544E3026k4909l1247j0185q642L9362L4151m346j8550j2978l338J5656K0346
17532D8346p671k4816n865n086j3879O871J9200n899k0883m62Q41K3489j1432
17519B754k0024l1908n256K0946J7811M2139K906r501k359J5726k0220J3647J3688
17506D0349p187l4973j1744l940J3265k909J4017Q402j192J510k4514k6637J1843
17493b3710p832J7338N731M731j7654j6246o672k736R102J7221L9197r738O660
17480A5392M664k1069N32n919j1014R440K604j0342k0025k4827J7727K2710M245
17467a5882l2465j6251N162j3606R067J1358Q394K1696l651p475J9159K53k3563
17454c7804K0710K521M374J2917L0343K7464j921k5729J579K2007K5459Q0226
$$ y = [53026, 28117, -3130, -13315, -21957, 17405, 51556, 47210, 28660, 15682, 12344, 28000, 48346, 40675, 15859, 9994, 4908, -8971, -2100, 17100, 11201, -9682, -10144, -9303, 14186, 2754, -17270, -49178, -54434, -33488, -15677, 26462, 29368, 19867, 17508, 33234, 13014, 26661, 40349, 33162, -1811, -13555, -17495, -4230, -7139, 6878, 15280, 14088, 15598, -8916, -35553, -23710, -31542, -14204, -8473, -3742, -21396, -37642, -44314, -47050, -37948, -20727, 18470, 8732, 15392, 20056, -1013, -481, -6400, -17414, -7974, -5370, -15712, -35737, -60564, -42837, -20127, -15882, -48347, -64598, -59436, -73042, -63975, -52617, -44223, -22527, -26178, -33653, -14494, -14241, -37804, -17094, -14573, -10199, 2718, 33061, 60525, 58604, 32875, 34454, 56461, 81920, 162146]
17442A62146Q6170N1800n9561q2281n7117m5986l0023O912J7202j1669k3988j2908
17430F97J4699p023l2675K523J8843K4918J4836p07J2508q820k0790j6200j6206
17417a3397N457m281M093q552M635L2976K1977l2481n1410l1269p407K1069O7667
17404I077P963k2263L696N494m640j2552p19p974k1508J363J7323J3573O824N900
17390A557j9110l3464K433K9185L2029Q029k5309n663j5741o793R929J1364Q029
17377c525J5880k2320m0803j3449j2202j6451M376N1513K2803N497o346P859k0759
17364b7927j1748Q746J1614Q106J2639j8778q783J5266L4015k130p157l2605K698
17351a6044R027K2516l144j182J028J7602n212l7616K0219L0697m142k8020k6456
$$ y = [162146, 248316, 300116, 240555, 158274, 101157, 55171, 25148, 32060, 49262, 37593, 13605, 697, 15396, 8373, -24302, -21779, -2936, 21982, 36818, 36111, 48619, 39799, 19009, 2809, -13397, -7940, -12221, -8128, -16680, -12045, 20931, 42908, 10427, -40983, -72252, -79659, -58590, 9077, 17040, -5223, -1527, 3967, -673, -13225, -13944, -21918, -43426, -42063, -24740, -11167, -4343, 1557, -17553, -51017, -48584, -19399, 12630, 20659, -4650, -10313, -26054, -32847, -22918, -11554, -3525, 12355, -9965, -50768, -64217, -76419, -92870, -88494, -36981, -14178, -8681, -15027, -7168, -27927, -39675, -30929, -19315, -11209, 1430, -17348, -26131, -10865, 23150, 21020, 13863, -18742, -16044, -7017, 15499, 12355, 11173, 12201, 29803, 24591, -13025, 7194, 37891, 33749, 5729, -20727]
17338b0727j0798P955K1320K3792j253l4353N27J6528J0900L399j3576p021J6833
17325A3526J114k5223m4101k9427J2148L2794K7252M329J7798k9433k2581J1546
17313c0258l084q795N637J4996P9j9174J3135K7106K1415k0031j9533j20q563
17300b7190K3002L404J7983k195p604J0418J3224r56j5120j2875j6293L630K7964
17287A7392L423l1757j1520K585j4335k2443K8581M655l2884r58J9220L2442m566
17274a0165k2352j270j089l189j363K213K012J4257J5583J6369j5780j1798r599
17261b6171k6969j3982R579K1498Q836M017j0744j7122K8169P604K4810o691p632
17248d798k9842j5044J4726K4257L6520K973j7257l73j4105K0476R30j4463j5978
$$ y = [-20727, -31525, -23570, -2250, 21542, 20289, -14064, -13537, 2991, 13891, 17290, 3714, -3307, 13526, 14640, -10583, -54684, -84111, -71963, -39169, -11917, -7588, 10210, -19223, -41804, -30258, -33342, -42137, -36500, -21504, -21425, -40599, -27464, -358, 21057, 1026, -18507, -18627, -27190, -4188, -784, 17199, 15004, 7400, 17818, 31042, 30086, 14966, 2091, -14202, -10572, 17392, 20815, -10942, -22462, -19877, -34212, -56655, -28074, -23419, -56303, -57261, -38041, -5599, -10165, -32517, -33787, -34876, -38065, -39428, -37215, -35203, -20946, -5363, 11006, -4774, -16572, -26171, -53140, -67122, -57543, -36045, -27209, -23192, -33936, -51058, -22889, -15285, 9525, 2834, -4798, -34640, -49684, -34958, -10701, 25819, 28792, 11535, 11162, -2943, 17533, 18463, 4000, -11978]
17235a1978l7121j9231J3934J9166L9672l0837m1424p437K1745L3307P49K1369
17223A914R166J509k2680P65K5215N874j3691R936l318l8867k3843j1095J5338
17210d3777L8685J5538j3985J3539M258m3365j7815L341Q908n072j4462R377M5
17197d4785P80J0977k1178l6780q660J8223K4923N2400J9602j071m3121M058P205
17184a7427J9306J1407L1312o96k7692j3989j1408J5373j6603J40J2764j6066
17172a3579j7922J6759Q273N575J2086j373J5204j584j7969k3820l491J259J4556
17159f026O809K067K2013N565k327K0388K110l3619m8665Q206J6029J7046J5397
17146B4993J485l1923j1647j1794R64k2184l5280N01N0683N2076O407m6510o3205
$$ y = [-11978, -49099, -68330, -54396, -35230, 4442, -26395, -67819, -75256, -53511, -20204, -19455, 1914, 11080, 12589, -10091, -9326, 15889, 21763, 8072, 18008, 14690, -24177, -48020, -59115, -43777, -5092, 10446, -3539, 10000, 14258, -29107, -46922, -43581, -34673, -39745, -54207, -44830, -44785, -44005, -33028, -54206, -90986, -99646, -81423, -56500, -4100, 15502, 14431, -28690, -24632, -17427, 1879, 13286, 44598, 43902, 16210, 2221, -9187, 6186, -10417, -10277, 2487, -13579, -31501, -14742, -6469, -894, 11192, 9819, 25023, 23439, 5470, -18350, -21841, -20582, -6026, 783, 2850, 24863, 30428, 28101, 48489, 50599, 16980, -31685, -23479, -7450, 9596, 24993, 26478, -5445, -17092, -28886, -27922, -50106, -85386, -84885, -34202, 17874, 24281, -22229, -85434]
17133h5434K3919J3312j8574K7234q392J6275K0260J2968r439Q201o41j499J9093
17120A7283p861k2699l2115R563n201L602L9784J2134m1417K0816q660o959N353
17107a6377O404k1501l2647R948J1290J8618n156j4886r470K8825J3030q7j5189
17094b7198K2586L7794j5297j0830L55K5824K9963K5390k5980l9317k1581k952
17082a243j2300L931L1575k3480l9971J895N9362j929j6450l5048k7127J1788
17070d8997N1976N3582j569l9438J371n469l677J543m056o854k0229J9833O972
17057D988o107p205j285L415L0483m3498m1955n433O902Q62N549L341j0003r550
17043f9496J7914K2131r066L0117O999N160m824R690J2271m703j496k869P549
$$ y = [-85434, -61515, -48203, -66777, -39543, -47935, -31660, -11400, 1568, -7871, 330, -311, -1810, 17283, 9422, -13277, -45392, -35829, -41030, -37428, 2356, 14490, -26927, -6111, -14771, -21730, -16377, -9973, -31474, -64121, -54173, -42883, -24265, -29421, -44307, -53777, -24952, -11922, -12009, -27198, -4612, 33182, 17885, 7055, 7410, 33234, 63197, 88587, 62607, 23290, 1709, -1243, -13543, -9612, 21963, -1517, -41488, -39593, 19769, 17840, 1390, -33658, -60785, -48997, 2979, 56561, 54992, 15554, 16925, 11456, 7779, 9322, 5266, -1588, -21817, -1984, 4988, -1119, -8324, -9609, -6194, 24289, -19209, -61164, -66597, -59695, -58833, -53284, -49943, -59946, -69496, -51582, -29451, -38517, -8400, -1401, 3759, -1065, 8625, 20896, 16193, 14697, 11828, 19377]
17030A9377J7893m8097k6552k3727p76Q076J4774J3108J2691J9889l82k4436p641
17017b5803Q178o729j2409K1423K988K2732q462j0847L250k2797q533p094Q808
17004c5295k28o399K0752J0779O310L3590K627k4487k5337Q030j927o963k4906
16991d3454J1204K312j2638K2178q684l287l345j2920L529J1077j7378r272J3856
16978d6822q427K9143N4399j449K3507j1844m7839j7419R765n897j1301K1177
16966a3007j04j7507j1492k2922J751L7366o359J75m698J6779J6997j522k4101
16953b8644P069j971j5127m346K0342K2062J960k1568j6629j8779Q845J3724R362
16940b3700L478L192L3367J9075k0829j803L0587j3990m0085q276M2216J0936
$$ y = [19377, 37270, -10827, -37379, -61106, -61882, -53806, -39032, -25924, -13233, 6656, 6274, -18162, -25803, -17625, -24354, -36763, -15340, -12352, 10380, 1918, -8929, -5679, -28476, -37009, -44103, -35295, -35523, -41922, -21170, -10391, -4081, 29509, 32136, 7649, -17688, -9658, -11585, -18548, -43454, -32250, -29938, -42576, -20398, -29082, -32369, -35714, -48634, -45105, -34028, -51406, -60678, -46822, -55249, -26106, 28293, 26844, 50351, 38507, -9332, -26751, -16986, -22883, -34184, -13007, -13111, -30618, -42110, -65032, -63281, -25915, -32274, -32099, -36797, -20018, -3021, -4543, -28644, -21575, -23546, -38673, -43019, -22677, -615, 1345, -20223, -36852, -55631, -46786, -33062, -23700, -20222, -17030, 16337, 35412, 14583, 12780, 43367, 29377, -10708, -18984, 23232, 34168]
16928C4168j9104j7820J2578o825o790m4097l352L8202J6578p441K8986P997j684
16915C1396L459j017n812k5025N899j0993j2485q643r052M002J6830M2345K741
16902C3645j991j4096o5979j3907K1883K4505j736J15J0196j1509j6700J0086
16890b5488R493n456K411k5189J1163K4757K1168r957k5994R012l540j829m456
16877b3905J9514J9314o428j3100k582J7225j0255O753J875j8520m727K1995q399
16864a240j0959k773J2545o520J3330P116j1875j6484J6849k5778J6009K7505
16852A7725K2261J4682k9449P57m4880l0273J6050J9088m025K209m489J1870M927
16839c547R866j3594m4367k361J6328K8092L928o439m870n281r846K630j2557
$$ y = [34168, 15064, -2756, 9822, 2997, -3793, -47890, -51242, -13040, 3538, -3903, 25083, 33080, 31396, 34855, 33838, 28026, 3001, 8900, -2093, -14578, -23221, -32273, -28271, -11441, 30904, 33645, 31654, 17558, -48421, -62328, -40445, -15940, -17676, -17561, -7365, -18874, -35574, -25488, -15995, -21451, -19040, -44229, -33066, -8309, 12859, 2902, -23092, -14080, -17620, -19449, -23905, -4391, 14923, 8495, -4605, -7187, 10038, -217, 6536, 8411, -10109, -14836, 7159, -1240, -12199, -14972, -2427, -8947, 4383, 11499, -376, -16860, -11, -25789, -9780, 17725, 39986, 54668, 25219, 25976, -18904, -49177, -33127, -14039, -18064, -15855, -20344, -8474, -3547, 6319, -7275, -51642, -54003, -37675, -9583, -5655, -12094, -16964, -22245, -32091, -29461, -42018]
16826d2018m338j6916j1465K9507O3273L7706k9499k7070k3436j4537K7156p604
16814a9241m2639J4195L2714r793j5613J8229R383l3448j1244N460j578J4296
16802c9279N311j3675j5582j735J9824J2835J8732Q664K4495k628k0623n561j4000
16789b3222M267J4993p58j4484J0112n406o447j9098j3714J3731l057K244r672
16776e0511J2513J419n49M9158k127J3506J1794j8234K723J3542j5817o1362O387
16763c7558L1782J9659j0501j5519j7900j6091j7149j07J737K5252O209J4458
16751a5728l195k856O222Q081q76q524o896j0905O438j4709j4070K2816K7267
16738f935M2842n270k0043l9471p267J4534J611O056J0426k9170p795n053M408
$$ y = [-42018, -46356, -63272, -74737, -45230, 18043, 55749, 26250, -820, -24256, -38793, -11637, -19241, -61880, -47685, -14971, -24764, -40377, -22148, -12765, -46213, -57457, -51997, -53575, -39279, -33968, -47643, -63225, -64960, -45136, -32301, -13569, -4905, 19590, 16962, -3661, -9222, -23222, -18955, -3962, -4720, -19204, -9092, -14498, -20945, -40043, -53757, -40026, -43083, -40839, -50511, -37998, -36579, -37128, 12030, 9903, 23409, 35203, 16969, 19692, 33234, 17417, -43945, -37558, -5776, 13883, 3382, -12137, -30037, -46128, -63277, -63384, -61647, -36395, -30186, -15728, -18923, -21779, -15557, -7476, -8352, -16876, -23772, -34677, -28239, -42948, -57018, -34202, -6935, 35907, 30637, 10594, -28877, -36144, -21610, -19999, -13943, -3517, -32687, -40482, -45535, -41127]
16725d1127K6878K4387Q048k598J1742l1134k5416o063m295J7806K7587J7723
16713B3538j1993k474j0950J178J398M79N334k8139J9607j5179j4339K0094o633
16700a8079l346J7887l369k4793k238Q628J6049j5678j4170j4453J8781q16k437
16687c8034k569l5882J1329O362J356L2036j910m420j4124l9179M659M3332J6019
16674b1025J4293R332l5516k3638R112j50J9720j401K968n86k038j4590n195O586
16660d2128R870J3106J279o474k546J1389L0562j9226k3130J884J5408J856o500
16647a4650j4273M625J8902l720P205k2459K589J2379n676j471K1037L6620Q427
16634D9535N95l1548J4073q731j4816k0904k4299J9881K8260o141k386j539j4161
$$ y = [-41127, -14249, 10138, 18186, 15588, 27330, -3804, -29220, -35283, -39578, -21772, 5815, 23538, 11545, 9071, -1879, -701, 697, 1176, 6510, -21629, -2022, -17201, -31540, -11446, -18079, -21425, -3538, -6907, -31700, -33938, -25310, -9261, -24939, -39109, -53562, -34781, -35597, -38034, -40603, -76485, -65156, -58794, -57438, -25402, -27312, -31732, -45856, -85035, -80376, -37044, -21025, -6732, 2600, -32916, -56554, -47442, -47592, -27872, -29273, -26305, -26891, -28929, -43519, -48714, -42128, -32258, -19152, -17873, -24347, -26893, -15504, 15058, -4168, -27298, -25414, -10006, -8150, -14650, -28923, -24298, -5396, -9116, -1911, -24370, -21781, -9402, -15078, -16549, 4488, 41108, 49535, 50130, 18582, 32655, 23924, 9108, -11796, -36095, -16214, 12046, 5905, 3519, 1980, -12181]
16621a2181j930k5056R48L5123J9643j344j1033K857k5279R653K1338K4001k5852
16608A0888j2120l354k2224l880K7252K574m867J5156l9508j22j1061l894r150
16595e4310J0780J1724K5082K4706N025j4025q446j7034j7186j2178j8472J3059
16583e1275j837r406q210J022N673J8330K1886Q409L5360m4827k4180L1976j546
16570a8625j0182L3498Q493j1510m019J2850J3290j2223r573q069l0393J1114
16558b5349K4295O083L78J3148J0540M011j9098L75j2846J0099k9675j5094J1696
16545b1437P41n005K2141Q482k1789j2140j2859p559m782Q110K1507M067P66L110
16531a6647J7878O614j9844j4390K1117J7540j10J0168k6282M700M674k1165L163
$$ y = [-12181, -14111, -39167, -38219, -3096, 16547, 15203, 4170, 7027, -18252, -8599, 12739, 36740, 10888, -1232, -4586, -26810, -30690, -3438, -864, -5731, 9425, -30083, -30205, -41266, -45160, -54310, -43530, -31806, -6724, 17982, 23007, 8982, 536, -16498, -33684, -45862, -64334, -51275, -53112, -62518, -70728, -69706, -64033, -45703, -23817, -15408, 19952, -24875, -49055, -17079, -18625, -28807, 4691, 13184, 1674, -2345, 10505, 23795, 11572, 1999, -6070, -36463, -25349, -1054, 5029, 5407, 18555, 29095, 33106, 14008, 14383, 1537, 11636, -18039, -33133, -21437, -20696, -25701, -3560, 4922, -16867, -29007, -41866, -49425, -54207, -46097, -24590, -20523, -19757, -16647, 1231, 7845, -11999, -26389, -5272, 12268, 12158, 22326, -3956, 744, 5418, -15747, -12584]
16518a2584N171j7724J9112Q251j2855k3709j767L2914K5803k0823k248J271m5392
16505d4580k498K3868K1804o129j9424J3637Q828k3384p863K1468O109k3270r378
16492d0812K9654O673l349R884r130j4805j6295L225L5190R224J8146J122k115
16479B6612n999n065n094k3059j7025k8741J3805L2901k0126j0583K5204L4453
16467A7283J8874J1o576j3865j3476k1224k7268J5995Q932L221Q418Q994K2023
16454B1342P916j2054n961j4684M796J4240n909j0460p767p400o34k2L8028j4802
16440F629o780J9694j031k595J597j0733n322J9154J388j9293m375K1163K440
16427B1936k7884k2129J0125J8181J0974j455l596k7035P224J2340K5002P453
$$ y = [-12584, -7413, -25137, -6025, 2226, -10629, -34338, -36105, -3191, 22612, 1789, -459, 812, -44580, -47078, -23210, -1406, -7535, -26959, -13322, -4494, -27878, -35741, -14273, -8164, -31434, -40812, -11158, -4485, -7834, 2050, -7080, -21885, -38180, -34955, 235, 9459, 27605, 28727, 26612, 20613, 15548, 10454, -12605, -29630, -58371, -44566, -11665, -31791, -42374, -17170, 17283, 36157, 36168, 29592, 15727, 2251, -18973, -46241, -30246, -21314, -18093, -9675, -681, 21342, 29258, 17204, 11243, -3441, 1355, 15595, 9686, -774, -8541, -15941, -16575, -16597, 21431, 6629, -151, 19543, 18512, 15917, 17514, 6781, 1459, 20613, 22001, 2708, -1667, 19496, 21936, -5948, -28077, -17952, 229, 11203, 9748, 6152, -20883, -13659, -1319, 23683, 31136]
16415C1136j9792J5850K2287j9133l4924J8607l185l7078l642n258K529j9182
16403e1785J3691k888K4229J2818P022M252k6001k8469r482j1204K010R994K8754
16390b7059j5508J3663J9194j80j657J1265j2184j6978k7909q960K2347j7329
16378f1295K3558K8096j1238R094J3900j1735n029L2512J66j3958m0299J1663
16366b4565K4127l4143r88p25K8594j5919l1750K2169J5038K4934K3548k2693
16354G627j2093O400J2551J2344Q760J4455l6278k5755l3118J0165K2008j62k5193
16341c8289j9683O607K4949K6447J280j8307L6941K3328j2791m995j9509k0309
16329a4331n605j177k055k052R081J4147K8683L636j4478N828k9319K5734j6181
$$ y = [31136, 11344, 27194, 49481, 30348, -4576, 14031, 10846, -26232, -29874, -35132, -32603, -51785, -38094, -40982, -16753, -3935, 3087, 7339, -18662, -47131, -56613, -67817, -65807, -55813, -27059, -42567, -28904, -9710, -9890, -11547, -282, -12466, -29444, -57353, -66313, -43966, -61295, -37737, -9641, -20879, -11785, 2115, -9620, -14649, 17863, 18029, 4071, -36228, -24565, -438, -34581, -35569, -36294, -7700, -23619, -55369, -33200, -18162, 6772, 30320, 7627, -4466, 1934, 14485, 26829, 35589, 50044, 13766, -11989, -45107, -34942, -12934, -13096, -38289, -57972, -51365, -26416, 31, 1311, -16996, 19945, 43273, 30482, 25487, 5978, -14331, -19936, -21113, -23168, -25220, -16139, -1992, 26691, 30327, 15849, 21677, -7642, 18092, 1911]
16316A911m0276j4783M1514N719N459j168m578j5520k0197K6862l844n800m920
16303b9621k866j5410j2137j7635K4792R258m135J8589P283j499N842L548J3451
16290e40k0234J1228J0842J6950K959r213j0936l9713K011J9840J0730K1584J4148
16277B9656p264k8995k871J1729N57k2775k3799L2634J2870j9188k2431j0231
16265e0108K9810J8896R278k1671l636n898r23M5133K8207k4338m335L3594Q609
16252F2618l6160k9992r482k6786J8580K0952k1212j1171R368R441j2651R976
16240a6519o082J5459n27k0696Q904l3474k8620J645N258K7267K1989j9504J6048
16227b8852N514m207r121K0191P941Q661J1160j1978j782K6100J2840k7457k1717
$$ y = [1911, -38365, -53148, -11634, -5915, -456, -1624, -6202, -21722, -41919, -15057, -18901, -24701, -29621, -32487, -47897, -60034, -77669, -52877, -43619, -47754, -29165, -21882, -23381, -17539, -13991, -540, -20774, -9546, 1296, 18246, 21205, 11992, 1056, -38657, -36646, -16806, -6076, 15508, 29656, 22392, -6603, -9474, 2255, 2812, -19963, -43762, -11128, 1742, -17446, -39877, -50108, -20298, -1402, 7876, -13795, -17431, -23329, -24252, 20881, 49088, 24750, 20415, 54009, 62618, 26458, -3534, -13016, -39802, -21222, -270, -21482, -32653, -23285, -13844, -26495, -16519, -22601, -7142, -7669, -28365, -19461, -52935, -81555, -79910, -74652, -47385, -25396, -44900, -28852, -23338, -27545, -36666, -16475, -8534, 127, 11287, -691, -2473, 23627, 36467, 9010, -12707]
16214a2707j4921Q436j1844j70M4417L6511l1941j7804M4301n491l5917j5475
16202a2605n864m698p980m848J0283J7997r010q624M445J6207J1757l18J0252
16189A6994K917O715R959j7042k1959k7672j1834M990o774j3488J1151j159L7550
16176i652K7387P510O08n858k1817P625J6792j3245k3011k7461j3919K0573M511
16163b9957J7088K5482Q91j2910p205l619k759j605r354k8339J1195j3200J9348
16150c4944J4917N86r28R104j4101j4973K4349J9808j9574P855J8662k3064l1627
16137d3930O373J1048J7602N810n85n885L2372J5033k7720n3005l713J1514m268
16124c9354K4272l338n676N864l230J2749p699O76J7724J887j0218j4419N69j8131
$$ y = [-12707, -27628, -19192, -31036, -31206, 13211, 49722, 17781, -23, 44278, 38787, 2870, -12605, -18469, -23167, -31147, -35995, -25712, -7715, -16725, -25349, -20904, -4697, 7060, 6742, 16994, 19911, 26626, 36585, 19543, -2416, -30088, -41922, -36932, -43706, -57194, -46043, -47202, -9652, 17735, 25245, 25853, 19995, -1822, 5803, 22595, 9350, -13661, -41122, -55041, -34468, -29957, -12869, 12613, 13504, 594, -6611, -10230, -12989, -14594, -23948, -52287, -41092, -54292, -34944, -20027, -19441, -20369, -11265, -25366, -40339, -15990, 3818, -15756, -7901, 10761, -12303, -43930, -37557, -26509, -8907, -3097, -3682, -9567, 22805, 37838, 10118, -42887, -46600, -35086, -39354, -15082, -18420, -24096, -18232, -21462, -8713, -16412, -15736, 1988, 3875, -6343, -20762, -20193, -38324]
16110c8324J7991j1599L50k151R24J0531K2017J4966O538j7679k2141R076j940
16097a1441m1152k125J4117R864K8426J3629k4289j1241J9289j4873K89Q922j633
16084a2218J527m353J7547O605l0645k6515R780p581l680j2364J707J0400L4834
16071a4956N951k7236j7237j0285O414L014K659J2946N102p386K9711o690j3147
16058c1140q587L8538L7003j8194j4326l2769J9730L81l31k0863m9258j6007J2270
16045h3553L5993K6437L8422N951j7557R419j457o830J398J5681J5840l751q233
16032B7760k0049R719q628j201j4624o517J2503L810j4619j795M68Q750L4722
16019C0299j7262k8076j1668j016Q286R903P96J699L8849J7791o781j9598l9658
$$ y = [-38324, -20333, -31932, -31582, -33733, -32809, -22278, -261, 14705, 21243, 3564, -18577, -9501, -11441, -52593, -54718, -40601, -30737, -2311, 11318, -12971, -24212, -4923, -19796, -19507, -10585, -12218, -10691, -15044, 2503, 9108, -21537, -48052, -38272, -45853, -49533, -61897, -60190, -49790, -14956, -9005, -36241, -53478, -63763, -57349, -54335, -51676, -38730, -33628, -41014, -11303, -17993, -31140, -39727, -1189, 35814, 17620, 3294, -29475, -9745, -9364, -9695, -30558, -79816, -95823, -83553, -47560, -21123, 17299, 23250, 5693, 15112, 13655, 6825, 8223, 23904, 39744, 35993, 27760, 7711, 17430, 8802, 7601, -7023, -13540, -1037, 2773, -11846, -13641, -13173, -4423, 30299, 13037, -15039, -26707, -27723, -19437, -9534, -8738, -7039, 31810, 49601, 42820, 23222, -16436]
16006a6436j1304K6428K2102j6572o195k8541J7430K0478o11J4286J7794R94J4329
15993E4182j0868r383l1804n376n160K2879J4682j3356k2164k2587j317K358K8797
15980H83K3089k8863O01j6608j0661L7445N535o559l242n066N409j2712r799k5563
15966d6111k9459K5754L4152K3940k860j3556J910j4433k6379J3314L5866P339
15954I477l6356J229J2092k8613O396P451j38Q202J2519J7385L007M376K926P047
15940B7000O372j764p171k9047k3508k9956N242K2808R250n976L2731R678J6642
15927C2301j7844q554J1511q078J0116m8983R21J025O891j3628J9239K5539k9710
15914a9254k443J1001j3909n670n384K0124J2341j573P674j380k8724k115k0833
$$ y = [-16436, -27740, -1312, 20790, 4218, -1977, -30518, -13088, 7390, 6779, 21065, 38859, 39853, 54182, 43314, 33931, 2127, -3249, -8409, 14470, 29152, 15796, -6368, -28955, -30272, -27914, 883, 23972, -4891, -4290, -20898, -31559, 5886, 11421, 4862, 1620, -3446, 1963, -10749, -20548, -46111, -75570, -49816, -15664, 8276, 5416, -8140, -6230, -20663, -47042, -33728, 2138, 9477, -26879, -25650, -13558, -42171, -35775, -28324, -28462, -20260, -7741, 9644, 12651, 17027, 19953, 27000, 33372, 31608, 24437, -4610, -28118, -58074, -52832, -30024, -20774, -26750, 5981, 15659, 32301, 14457, 5903, 17414, 9336, 19452, -29531, -28610, -27585, -20694, -34322, -15083, 10456, -19254, -21697, -10696, -24605, -30275, -35659, -15535, -3194, -4767, 2907, 1527, -27197, -29312, -50145]
15901e0145L2417j7534J700R839k3681j0248J8834P730P394L0803j0443L145Q519
15888H330o701j9738k1843p608K2301J1725q732j4253L3831J0927j2164j0387
15876a4312l0191j2106L1096J7332p744N385N298Q938J955m1998j6035L0908L3764
15863A2290Q990r827l8527J0119J5529J3385j6144j496j0556j054K9058o731r173
15850d137l2284p776o74J0992p809j7897J2844J7874J8929K3385K5470k9570k2512
15837a3165j236J1051j6647r982j0049J3637K362J0642p896k533r42l1641R360
15824d7039L1837j2595Q534K6167o279k2698J4835L5064J229l5245k1977J332
15812b6835P60k4176l589L0197L612k8422J1734L1276l473k6372K2363J056j4162
$$ y = [-50145, -17728, -35262, -33562, -23723, -47404, -57652, -38818, -31088, -23694, 7109, -3334, -189, 8330, 1629, -18109, -39952, -47560, -25259, -13534, -22266, -36519, -2688, 8239, -3925, -14312, -44503, -56609, -25513, -8181, -15925, -10540, -5242, 3696, 5651, -36347, -52382, -21474, 12290, 21280, 11453, -27074, -16955, -1426, 11959, -4185, -5681, -16237, -17291, 11767, 5036, -4137, -36421, -44197, -44871, -33879, -41688, -59585, -46741, -28867, -9938, 13447, 38917, 9347, -13165, -14401, -3350, -19997, -29979, -40028, -26391, -24029, -13387, -21283, -23816, -24758, -56399, -47039, -15202, -27797, -19263, 6904, 625, -22073, -7238, 27826, 29055, -6190, -28167, -26835, -26075, -50251, -53840, -23643, -20031, -48453, -36719, -5443, -8916, -35288, -12925, -11869, -26031]
15799b6031l1425O884J6719J5351J8710J38J1632M796M460o544L6990P704n1379
15786H005n1391O47K9904n492k7852p982K1936k841k932j3847J1261k8843K4659
15773d4768M3420K8826J7874J1114k247m6649p347l7872o325K668K9982k489N514
15760h299R801L086J6014L0668m2835Q77Q184k8827j7680J4892r966Q978K1514
15747F407j3348J022k3629q907p977m955J3293n153K7084L4178J046j5178j0164
15734f281N631k8795n284J6191l277J4156K5342N50l1464p298l638j0690K5787
15721i070j2514o045N584M126j7152l545J7942K8477J326j5784l2816J1732P092
15708b0647M990o455j495j8058J0809Q587J1989k2316k5886J1197L3000J1137
$$ y = [-26031, -57456, -50572, -33853, -18502, 208, 346, 11978, 16774, 21234, 14690, 51680, 59384, 8005, -43386, -42739, -12835, -18327, -46179, -54161, -32225, -35066, -37998, -51845, -40584, -69427, -44768, -1348, 27478, 45352, 56466, 54219, 7570, 223, -37649, -43974, -41306, -11324, -13813, -8299, 1502, 4588, 20602, 51270, 8435, 9312, 17496, -11331, -29011, -14119, -24085, -15107, 6407, -6941, -5919, -29548, -38455, -46432, -51387, -38094, -43247, -16163, 18015, 19061, 3883, -6281, -650, -29445, -34729, -18538, -21815, -7659, 17683, 18233, -13231, -20529, -24167, -34857, -9070, -21584, -27629, -22045, -17919, -35071, -38616, -20674, 7803, 9129, -6655, -39471, -27739, -20647, -15657, -22112, -23607, -41665, -30856, -22269, -10280, -32596, -58482, -47285, -14285, -3148]
15696c148J4073r069k0645k056M707L7932R176r533l7003j7361p151P894j4034
15683d6218M705K5351L3697J6689l594p78k5405l6265j0303O036J4515J262Q650
15670a1658J1239M568j9552j4870j68j8488L571K8884O017j2682j2246k9025m746
15657f9156L3192l750N983L7220J9018K953o763j8815J9400J0572k7042m0623
15645c7811M291K5701J0730J866J1128k7520j0031o054k5848J2846J6691L5108
15633A1097L586j7913k9002j8757l3803K7801n213K309L1367l272R954J1007J4722
15620C883M967k7563l027l578J7162n86n796J0759L0343O93k4084J6014J6348
15607C5535k4059k7723O910K0256K6992j229k557L685l0555j131K5919k770m1367
$$ y = [-3148, 10925, 1856, -18789, -20845, -16138, 21794, 30970, 21437, -15566, -32927, -40078, -32184, -46218, -41513, -16162, 17535, 34224, 30630, 29852, 4447, -31818, -42121, -36085, -21570, -20308, -11658, -419, 4149, -15403, -30273, -30441, -48929, -45358, -16474, -10457, -23139, -35385, -64410, -69156, -35964, -39714, -33731, 3489, 22507, 25460, 18697, -118, 19282, 29854, 2812, -37811, -33520, -7819, 2911, 4777, 15905, -11615, -21646, -27700, -53548, -40702, -24011, 11097, 14683, -3230, -32232, -50989, -84792, -56991, -62204, -59895, -28528, -31800, -21846, -10839, 3883, 8850, -18713, -21740, -25318, -8156, -8742, -14538, -3779, 26564, 27257, 3173, 19187, 35535, 11476, -16247, -9337, 10919, 37911, 36682, 34125, 37810, 7255, 6124, 32043, 29273, -12094]
15594a2094j1956J2907M488Q267K8269J8635K635l748j6071l92o828j2414k2424
15581a0726n967J0184q340J6623K0131j7765j822j547J4060j0033j3539K5173
15569A6432K831l1016j4600K2950K989l6159l0311J9868K1839L490J2514L1140
15557B1967k7884j7657K7410L6261n950k3811O600N339K1121J9293O608J8104
15545H7401J4653J1007l4381r219k3847k767k1330j7571j1302K6132J6784k585
15533C2975R399K2317j9603m3405j6918j0310J178R056K831M781p404J4036j0509
15520a1576Q799p984P667R179J7854K0017m916k2652j9051L2899J0603m591J1769
15507D8017l108j0103k234J6716J773n521J6907k370k3973l2654Q241L1001j008
$$ y = [-12094, -24050, -11143, -6655, 1612, 29881, 48516, 51151, 47403, 31332, 30940, 24112, 11698, -10726, -16693, -6509, -14849, 1774, 21905, 4140, 2318, 771, 14831, 4798, -8741, 16432, 19263, -11753, -26353, -3403, -414, -36573, -66884, -47016, -25177, -21687, -9173, 21967, -5917, -23574, 3836, 40097, 34147, 10336, 16936, 22275, 43396, 62689, 69297, 87401, 102054, 113061, 78680, 69461, 45614, 42847, 21517, 3946, -7356, 18776, 35560, 32975, 42374, 64691, 45088, 1683, -15235, -25545, -24367, -15311, -12480, -7699, -15103, -1067, -11576, -2777, -10761, -3094, 6085, 23939, 43956, 39040, 16388, -2663, 30236, 40839, 36248, 48017, 44909, 34806, 32572, 49288, 51061, 45540, 62447, 60077, 36104, 3450, 11691, 42692, 41684]
15494D1684j3528L2444K4733J0254j7945l1293j6366k2044K095K3001R727j4055
15482B8707K1866J7092j3019J2040L1593n303j9791j3198j5469J3812J3841l9180
15470C2991j4472O952J1401J2092M282K3082Q631r172m017j1912K9025J2030k0232
15457H0681K3976m117j4530j7413j534J0214K667J2050K8737R417J2402r406k3856
15444A09288L6796Q03J1066J1683j7813j7870K4228K5382L6647o215j1754n633
15432A96608l8040J459O966j0336j1056N629J7216k0673o734Q939J6222J7069
15420A83269l0612j6220K2135P58j5545O042J0387p400J8311R921k515j8445j3230
15407A46856j9766n152K2593k5067N266M6110R987L836k1957O07k9532k0586j6837
$$ y = [41684, 28156, 60600, 85333, 95587, 77642, 46349, 29983, 7939, 10034, 33035, 42762, 28707, 50573, 67665, 54646, 66686, 98279, 92976, 73185, 59987, 44518, 58330, 72171, 32991, 18519, 25471, 36872, 48964, 53246, 76328, 84959, 75787, 71770, 59858, 88883, 100913, 80681, 104657, 100540, 86010, 68597, 67063, 77277, 79944, 91994, 120731, 130148, 142550, 133144, 109288, 146084, 146887, 157953, 169636, 151823, 133953, 158181, 183563, 220210, 213995, 202241, 196608, 158568, 160027, 166993, 156657, 145601, 151230, 168446, 147773, 141039, 149978, 166200, 183269, 152657, 136437, 158572, 159330, 143785, 149827, 160214, 152814, 171125, 181046, 178531, 160086, 146856, 127090, 121938, 144531, 119464, 124730, 170840, 180827, 184663, 162706, 163313, 133781, 113195, 96358]
15394I6358r876k796J7062J0529l2185Q134Q708M1171J3299l5041o232k3334k2833
15381F2964J7023K9128l3744m3041K4892K4451J7800n318j1729j4128k6435n591
15369C6272O80j2261j2691O225J8100R998J2818j2456j4632J5151J3760P485k7216
15356D1233k7497M005K1675K0138J6296k1800j2341m660m204J4068K5416J582
15344G3911n223k7628n957k3119r260k839p934K2184L3758m889J3589L5785l835
15331H8543m0041j2945j943J2746j152P126J3596N360J1207j2576k4769l2271
15319A2881p699L0402j9802l3403K757K2126J7857L508j2109J6944J0713O69n868
15306C8976o112j3625k5439M711J6069k639J188p930j7900M965J5039J7607j1930
$$ y = [96358, 86482, 83686, 100748, 111277, 79092, 87226, 95934, 137105, 150404, 115363, 109131, 85797, 62964, 79987, 109115, 75371, 32330, 57222, 81673, 99473, 94155, 82426, 68298, 41863, 36272, 36952, 24691, 12000, 18225, 36325, 46323, 59141, 46685, 32053, 47204, 60964, 68449, 41233, 13736, 17741, 39416, 59554, 75850, 54050, 41709, 37049, 32845, 46913, 72329, 73911, 68688, 41060, 35103, 11984, 2724, -115, -8049, 14135, 47893, 43004, 56593, 92378, 88543, 48502, 35557, 33614, 46360, 45208, 52334, 65930, 71290, 82497, 69921, 45152, 12881, 5182, 35584, 15782, -17621, -14864, 7262, 25119, 28627, 16518, 33462, 44175, 44844, 38976, 32864, 19239, -6200, -1489, 14580, 11941, 13129, 5199, -12701, -7736, 7303, 24910, 12980]
15293A2980k1381J311m879L632K474O61r91J3010K1484L1647J0360k5950m0143
15280D215j4029J4533J1490q836j022j556J7913J3357j0919o603L764j2718l5486
15267b5897O967J3116N481K4152K4354l069j138L373k1743M085k2705J6580N344
15254B8900m0512j7087O378L9195k223J440j1541j3288k0396J3297J96O249L692
15241e700k66j4355K8015M1023O940n814j5723k3149k8479P159l704K5093J3133
15228B4173k1435M528J6176o539N28j82k158n022L84k0184J613K2848R112k7580
15214c738k2856L477J081M403k7936j5923M0257k3468J8403M072k225N26k1854
15201d5781j3723J1776K2910n511J8813J020l065J2255k4843r226l3213R751L1793
$$ y = [12980, -8401, -7090, -11969, -8337, -5863, -5202, -6193, 6817, 28301, 59948, 70308, 44358, 4215, -9814, 4719, 16209, 7373, 6351, 4795, 22708, 36065, 25146, 18543, 22307, 9589, -25897, -18930, -5814, -333, 23819, 48173, 45104, 43966, 47339, 25596, 29681, 6976, 23556, 28900, -11612, -28699, -22321, 16874, 14651, 16091, 4550, -8738, -29134, -15837, -15641, -9392, -5700, -5966, -20321, 7694, 48717, 55657, 49843, 34120, 10971, -17508, -10349, -14053, 11040, 24173, 2738, 7266, 23442, 16903, 17431, 17249, 15091, 10069, 10453, -9731, -8118, 14730, 23842, -3738, -26594, -23117, -22036, -17633, -45569, -61492, -21235, -44703, -26300, -22228, -24453, -23927, -45781, -59504, -47728, -24818, -30329, -11516, -10496, -13561, -1306, -26149, -35375, -68588, -58837, -27044]
15188b7044K3761J8272k5544M430J013o735K0138M779k2263J4518K3568m0211
15176a1318j3390l2695Q564L7565K53j6867j8557J5694J4973P682J4916M207j2390
15163a363m697j0944K2128m976l0341L013J2040K7074j840l7460j4497k48M072
15150c8039j7468p59M473J9522o335J9140J2551J2238k109l5419p135M7256J5550
15137B3466n816l8992j4472l6686K6097K5199o473K9765N099q694j3371j773J6546
15124a05K5146J3332j8142j0151J4393j5322l3770k3796J7932Q379K2553j573
15112a124K220M963J0945N71j1511q214k5359L0274L756l8984j633L518J4508
15099a6070o163J256O856k6945P262J7975p001J7875J5861K0799q312k4880o144
$$ y = [-27044, -3283, 14989, -10555, -6125, -5112, -11847, 8291, 13070, -9193, 5325, 28893, -11318, -24708, -57403, -48839, -11274, -11021, -27888, -46445, -30751, -15778, -8096, 6820, 11027, -1363, -6060, -17004, 5124, 148, -30193, -27180, -15140, 11934, 10094, -27366, -41863, -42111, -38039, -55507, -56266, -51793, -32271, -38606, -19466, -6915, 5323, 3214, -32205, -39340, 7916, 23466, 17650, -21342, -35814, -72500, -46403, -21204, -27677, 2088, 7187, -1507, -14878, -16651, -105, 25041, 38373, 20231, 10080, 24473, 9151, -24619, -48415, -30483, -22104, 449, -1124, 1096, 6059, 17004, 17575, 6064, -2150, -27509, 2765, 6521, -32463, -34096, -30578, -16070, -22233, -20977, -14121, -41066, -33804, -15829, -22830, -4955, 10906, 31705, 23393, -1487, -7631]
15086g631J6865k260K813p985J4714J2421k4297k6476L6077J420m0578j3015Q283
15073b9649Q272j9772n5163K3314N9721J5876j4316J589j0533p650K1589k450
15061i172j2354J5631J8986J4175n723r120O063K3071n468n7946q341Q330L307
15048a8561j2020O692P009k7877j7519l4242j9299K2910K4867J3376J6076j1522
15036e0110N384K9460p23j7039M114J2708n089J2674j694J1982R521l975m8139
15023d0926l0847Q157K5388L9352j1535j0158J1182k630R439J6137k5519l895
15011a5855K9267j110n111O841n346j4554P256K9076q802K892k5105n993k9025
14998c5569o522K7624R442M1180K6074o467k6967j8015k5776J0407R803j3966
$$ y = [-7631, 9234, 6974, 9787, 1802, 16516, 28937, 4640, -21836, 14241, 15661, -24917, -37932, -29649, -21377, -41149, -96312, -72998, -13277, 2599, -11717, -10128, -20661, -28311, -6722, -9172, -21526, -5895, 13091, 27266, 21543, 12423, 18486, 41557, 36089, -21857, -30198, -21868, -18561, -30581, -23889, -16880, -44757, -62276, -96518, -115817, -92907, -68040, -54664, -38588, -50110, -44726, -15266, -15989, -33028, -28914, -16206, -21295, -8621, -10315, 1667, 11188, 7213, -40926, -71773, -63616, -38228, 1124, -10411, -20569, -9387, -12017, -2578, 13559, -11960, -15855, 13412, 12302, 7191, 14032, 8686, -5868, 1388, 30464, 21662, 24554, -551, -6544, -35569, -42091, -14467, -5025, 36155, 62229, 55762, 28795, 10780, -14996, -4589, 5214, -8752]
14986h752n334k30k5066j400L2890L4337L5581k9191j6621R736L7289j0789k9121
14973B3329K9208r11k7845L687n907j8069J3359r879j5455q056k4304K2725K6994
14960H876R147J3115J7184n871l6729j6826l728k5577r034N929K7812J7784J0178
14947A2260J0295j5715j5832j718j7371L1884K0443J8580J3073P337p480k7576
14935B8180j8304r108n698m467R757R384j4624K374k0604n049J5761p43q916L1376
14921I319N6835J7436K7359K5593r528N240l8943j3216J1373k016k7029k2480
14909C9943j0547J2104k0526m382j1675l1116M306L6390l79p402k251K8433m384
14896B8514r756j1370L1605K7448m4468k6172J4536n018J2622O162M2356O0236
$$ y = [-8752, -14086, -14316, -39382, -40782, -7892, 26445, 62026, 32835, 16214, 25950, 63239, 52450, 23329, 52537, 51626, 23781, 27468, 21561, 3492, 16851, 6972, -8483, -16539, -40843, -18118, 8876, 18023, 31138, 48322, 42451, 5722, -11104, -14832, -40409, -49443, -43514, -15702, 2082, 12260, 22555, 6840, -8992, -10710, -28081, 3803, 24246, 42826, 55899, 63236, 55756, 28180, 9876, 768, -4930, -9397, 360, 9744, -4880, -2506, -23110, -28159, -12398, -13141, -22057, 9319, 66154, 83590, 110949, 136542, 127014, 132254, 93311, 80095, 91468, 89452, 62423, 39943, 29396, 41500, 20974, 16592, 4917, -26199, -21893, 14497, 14118, 6716, 4465, 32898, 28514, 18758, 7388, 38993, 66441, 21973, -4199, 10337, 5319, 17941, 24103, 66459, 126695]
14884A26695N1388M9270J14165J21772J24886O9107m6984j24478j42336r4229
14874B49256p0113o9220j3027j7617k5038j4105l649J7922j4246j2838o965r454
14862A0906N320P628k9982m284J1124K623J4836N204j7151j1986J0933k6785j470
14849b3084K6488K7154K226J4481k6696l5294l7906R414K0722J8914J1205p948
14837c24J9934K3548j440q194P901j353q799p355M917O629J993l8363j2971k9502
14823d3379K7500J0889L664J4217J3140j327j8666j0156Q793j0528R386J0144
14811A3677m776M0925j903O730k296j2559k1183m67K5054q414j0376j9672k2201
14798a7461j7505o704Q551J8596q673J3581L213M232j0743l6648q865M2692m025
$$ y = [126695, 178083, 227353, 341518, 463290, 588176, 657283, 610299, 485821, 343485, 249256, 179143, 109923, 96896, 79279, 54241, 40136, 36487, 54409, 40163, 27325, 20360, 10906, 16226, 23854, -6128, -10412, 712, 3335, 18171, 23375, 6224, -5762, 5171, -21614, -23084, 3404, 30558, 32784, 47265, 20569, -14725, -52631, -43217, -22495, -3581, 7624, -324, 19610, 43158, 41718, 33524, 41425, 40072, 31273, 23918, 28835, 35464, 37457, -906, -13877, -43379, -15879, -4990, -1326, 12891, 26031, 24704, 6038, -4118, 4675, -5853, 3533, 13677, 8901, 49826, 47923, 54653, 52357, 39798, 18615, 18148, 43202, 34788, 24412, 4740, -17461, -34966, -41670, -33119, -14523, -23196, -9615, -6402, -2170, -12913, -49561, -58426, -15734, -19759]
14785a9759l3785O207M6667K7763j0727K378o975q067O198q97K7208N631k5206
14772A6636L287r570K2963J4094J2154k2392k1314k0030q594J048L774K0758r784
14759C030k0591p538j2374m337J1150K804K7116p54k7435J52m253j2069q692J6390
14745c7401L4891l20R939j3070J4478j9765j4906j579O477L318j9813J3152n355
14732b9954J1589K5117K496L487k3464j4029L664K6829P513j9579k7406p32K0480
14719a3989J8673Q043K5747J9505l024k6133J281j0079p94M249q656k4487m884
14706a4548J4920J2269J2176l3314j8817P453j0261j775p619K6293K6250L002
14694A6029m472J4119R441K0688k6093k4806O726m438J766K2910j0989o972K078
$$ y = [-19759, -53544, -47337, -670, 27093, 16366, 18744, 11769, 3702, 9900, 9003, 36211, 41842, 16636, 19923, 10353, 33316, 47410, 59564, 37172, 15858, -4172, -12766, -11718, -7944, 12814, 3030, -17561, -25099, -37473, -41810, -30660, -27856, -740, -1494, -28929, -28777, -33030, -45099, -53791, -37401, -2510, -2830, 7109, -5961, 8517, -11248, -26154, -27733, -21256, -17938, -37751, -24599, -29954, -18365, 6752, 9248, 12735, -10729, -24758, -21094, 5735, 13248, -6331, -33737, -34469, -13989, 4684, 12727, 38474, 57979, 54955, 28822, 30103, 20024, 19230, 23479, 14823, -9664, -14548, 372, 12641, 24817, -8497, -27314, -19861, -30122, -31897, -39516, -13223, 13027, 16029, 11557, 25676, 35117, 55805, 29712, 4906, 11632, 7194, 8960, 31870, 20881, 13909, 15987]
14681A5987Q875k5879k6047J2832J2932k2701K1265k7188p883J6902L6953L2669
14669D8717J2190k4495L600k5816j1903M068q89K4274m329L138J8010j5665l4671
14656c771J911k375j2079J3840O029j4262O478k4310j9618K033j0933n38J5255
14643d2340M816J7257K4023J446J5047j6917n815N047M890O397R831o017n2363
14630c4698k6356K0647p465R478J1800O591l166J2299R718j0020j8120j54J2833
14617a6613j3987m853o954r457K8042K0284K1899J4672J7804J1631J5191k3667
14605E3992k0623J667M249Q456K4930k709m1994j3889r190Q532J6924l0687J4408
14592A4066J6834P752k165R979K050J6946o149J3526j2763m0258j9872m636J89
$$ y = [15987, 24862, -1017, -27064, -14232, -1300, -24001, -2736, -29924, -37807, -20905, 16048, 48717, 60907, 36412, 40012, 14196, 2293, 6361, 5472, 29746, 25417, 28555, 46565, 30900, -3771, -1860, -4235, -16314, -2474, 3555, -10707, -4229, -28539, -48157, -46124, -57057, -57595, -42340, -37524, -20267, 3756, 5202, 20249, 3332, -2483, 2564, 7454, 13851, 23682, 17665, -34698, -61054, -40407, -47872, -38394, -26594, -20003, -23169, -10870, -1152, -11172, -29292, -29446, -16613, -30600, -35453, -42407, -51864, -23822, -3538, 18361, 33033, 50837, 62468, 77659, 53992, 33369, 35036, 39285, 47741, 72671, 69962, 27968, 14079, 4889, 13421, 30345, -342, 14066, 30900, 38652, 36487, 46466, 48516, 65462, 59313, 72839, 60076, 19818, -54, -4690, -4501]
14579d501j7271J5597J0326k8771M415J8615j0425J5961K2981j0514j4296N949
14567H066R318j1685k3518j3542Q238J3960K7953L2831j6009l6180R007k657J0529
14554A6311R448l0926J4252K6703J608l6701l4376j1914J6992L630j1598j3134
14542d9705j7574K257K7063J1989l067M314j5624J750J6475M755l5120J9326P324
14529b5837J2404Q996Q281q435k2102j595J3978K8984J353N045J5245k1268k2515
14516g466l3074Q594j0408r485J848J1897K1399M2450K7447k3083j8030o706J6349
14503B1732m742J5221P628j9018m0144J3833J9693j791N156j5689j716J3727o73
14490A3217J8586P05j4166j2761k242j8401l170J1218J2581J3361Q796Q603j6498
$$ y = [-4501, -21772, -6175, 4151, -24620, -20205, -1590, -12015, 3946, 26927, 16413, 2117, 8066, 17384, 5699, -17819, -31361, -23123, -9163, 18790, 51621, 35612, -568, 8439, 5782, 16311, 25759, -5167, 9085, 35788, 37396, 695, -33681, -45595, -28603, -24973, -36571, -49705, -67279, -65022, -37959, -25970, -29037, -24723, -40347, -38597, -22122, -17367, -52487, -33161, -25837, -13433, -4437, 3844, -4591, -26693, -28288, -14310, 14674, 16027, 21072, 36317, 15049, -7466, -40540, -31946, -42354, -51839, -49991, -38094, -16695, 25755, 53202, 30119, 12089, 5383, 21732, 16990, 32211, 39839, 20821, -19323, -5490, 14203, 12412, 17568, 1879, 163, 13890, 13217, 31803, 32508, 18342, 5581, 3339, -15062, -18232, -7014, 5567, 18928, 27724, 36327, 19829]
14477A9829L899j0948j4545q291R681K6451L048k837Q137l6218l4001J0990P839
14464a6966O217K6548M664m762K111q611J2226p719p243J2592p422j0684p301
14451f350K0716j1056k5652n250K1555J9164Q553n837M090j0727k5028K9867j9170
14438e125L237M512o79L720q38J6746J3588L4192K1253L7141M7929L8659L8567
14425B52902J086M983j7960l8763n6647n5480l604j6763k3172l6551j014K2796
14413C1813O478l803r871J4232j6354j0201q179J7666K3957M185J5657j3707k8354
14400B3519l7553j1470K6305K2526P369p703O136m360k2067p87K3691J702k3405
14387C903J282j486j370O748J1394j3866J089O756L2221j6254o509j701n840j6479
$$ y = [19829, 23728, 12780, -1765, -10056, -375, 26076, 29124, 26287, 34424, -1794, -35795, -24805, -16966, -10749, 15799, 20463, 15701, 17812, 9201, 21427, 13708, 6465, 19057, 11635, 951, -6350, 14366, 3310, -22342, -27592, -6037, 13127, 21680, 15843, 19933, 9206, -15822, 14045, -5125, -1888, 2624, 1945, 5665, 4827, 21573, 35161, 69353, 90606, 127747, 175676, 214335, 252902, 253988, 258971, 241011, 202248, 145601, 90121, 86517, 69754, 46582, 10031, 9017, 31813, 38291, 34488, 24617, 38849, 22495, 12294, 4115, 21781, 45738, 49923, 65580, 51873, 23519, -14034, -25504, 801, 23327, 30696, 22993, 29129, 24769, 2702, 1915, 25606, 27308, 3903, 5185, 3699, 2329, 9077, 20471, 6605, 7694, 14450, 46671, 30417, 23908, 22207, 16367, -112]
14373a12Q365m048j9044O288N562k7082J2107K8189Q054J3062j4300j2886j7032
14360a2877k2260r552M684L1751K3207k9487l3181k1486K405j0884P206m407o852
14347h1733O535J5951K2992J7628m376J1999K1331k2293k0303n42M098j5182M1855
14334b040J2793j6235l613k561q589N745K6123J1689o065N463j4581P41R776J7633
14320C6279k2201j7858j0802K571j9668J2840L502j7597J5006n638j8662K861
14308c9367L1097K2821K6554L92J2788P283j4335k1799k543J7444J3121R486N883
14295F8825l0028k5899o158k573r783J3460K7945j248j642q690k5037j5971J718
14282a5081k1186n2244q637Q764M4371K6657j799n254J7545J5087J3710k0514
$$ y = [-112, 8253, 4205, -14839, -8551, -2989, -30071, -17964, 10225, 18279, 31341, 17041, 4155, -12877, -35137, -44689, -40005, -8254, 14953, -14534, -47715, -69201, -66796, -77680, -70474, -74881, -81733, -75198, -59247, -36255, -18627, -23003, -11004, 10327, -11966, -32269, -32811, -28713, -43895, -2040, 10753, -5482, -9095, -11656, -20245, -14500, 11623, 23312, 17247, 22710, 8129, 8870, 18646, 36279, 14078, -3780, -14582, -12011, -31679, -18839, -15337, -32934, -17928, -23566, -42228, -39367, -8270, 14551, 41105, 41497, 54285, 61568, 47233, 25434, 22891, 40335, 53456, 62942, 68825, 38797, 12898, 6740, 4167, -5616, 7844, 35789, 34541, 32899, 24209, -828, -16799, -15081, -36267, -88511, -97148, -88384, -44013, -17356, -19155, -24409, -6864, 8223, 21933, 1419]
14270A419j5457N11k555p399j841Q10k059P367q508n566J0303K8667K1578m944
14256B2326p593J1185j0791j3674K70m201o696J6445k87q687k5332J0469L1879
14243A5313k6219l6537K7174O341J5340k90k8589j485j0741j488n093k3922J8556
14230e1640L5953Q905J5731m13j2991M214L0941J8588L2620K7022o997j8967l7628
14217D5338o043m577j8134p626N892J0955M6700R8507R0574j199n6487n3161j4090
14204A36649r393k7674k4794r369k288L0894l010m6239k3191K0186j9830p790
14192A4151k0317o249J6166l160r379J1066k3769l0390L297L5511K735j8948J8272
14179a1014j2971r996j2364J9241K5631M458j0965L833j4715j8959J7594K414
$$ y = [1419, -14038, -13527, -16082, -23481, -25322, -24512, -26571, -19204, -27712, -33278, -22975, 5692, 27270, 22326, 14733, 25918, 15127, 1453, 1723, -2478, -9174, 7271, 6984, -1703, -27035, -16566, 15313, -10906, -47443, -20269, -13928, 1412, 1122, -27467, -28952, -39693, -41181, -46274, -70196, -51640, -15687, -6782, 8949, 8536, -4455, -241, 30700, 49288, 81908, 108930, 101933, 82966, 45338, 39295, 34718, 16584, 8958, 14850, 25805, 72505, 171012, 261586, 260387, 203900, 150739, 136649, 127256, 99582, 74788, 65419, 63131, 94025, 91015, 44776, 21585, 41771, 21941, 14151, -6166, -12415, 3751, 591, -8788, 2278, -21491, -51881, -48584, -13073, -10338, -29286, -11014, -23985, -33981, -46345, -27104, -1473, 2985, -7980, -4147, -18862, -37821, -20227, -17813]
14167a7813L9942j906O348m226k4094j2044m616j6695K8394K9641l3913j0753
14155b1735j3128m799j297L0675K8609L9454K5813L1226j047L2398L9426J9671
14143B05266O4761N4484L0759N1538R4888J51998K49734L46376M26641N36084
14133B212529N66511M08257J13577J5953k6358l02554n10295m66872l96088l81961
14123A232699l08610k04880j25748m0570J3890O1626J20581J07800r5057j94003
14113E67728j29741r6098q4686n4269j6378k3795l059L590m4332m1605j2172M8340
14101A13523j8683l0733m3268k850J5424K9662l4888j4910L1727k0187M316P846
14089C6979j5134j102K408m890k7023j0230L461J2390K6744R004k2419o70P229
$$ y = [-17813, 22129, 20223, 26571, 22345, -1749, -13793, -18409, -35104, -6710, 22931, -10982, -21735, -34863, -39662, -40959, -10284, 18325, 57779, 83592, 114818, 113771, 146169, 185595, 205266, 270027, 324511, 355270, 406808, 501696, 653694, 903428, 1249804, 1676445, 2212529, 2779040, 3187297, 3300874, 3316827, 3290469, 2987915, 2477620, 2010748, 1614660, 1232699, 924089, 719209, 593461, 552891, 566781, 628407, 748988, 856788, 761731, 567728, 437987, 341889, 257203, 202934, 186556, 162761, 159702, 163292, 118960, 77355, 65183, 113523, 94840, 64107, 20839, 17989, 33413, 63075, 28187, 13277, 45004, 24817, 29133, 36979, 21845, 20743, 23151, 18261, -8762, -18992, -15531, -3141, 23603, 32607, 10188, 9518, 16747]
14076A6747P072Q541j075J6474J2505j1606k8851j1404l2934J689K7791J402K77
14063F628N811K8928k596m564k6274j3694n196J0084J3182n531R282M758r786
14050A1032m570l760j5780p443m951J1727J4951K0886p962l607J0363k4083j6428
14037a9625n633k6770M094L7673m293L643j887j2394j0960L7343j999K5626L09
14024B5127j2326n139J4778K2431j8195m9115n394J2414j063Q392J489J007mJ4879
14010I281l83j7056k9245J7579K5071K3624k2346j234L8934R701p067m651j9499
13997B2709p696p880J5030k7743k7777J5631P921j0013P419N13k1787j2895K2537
13984b4031J5097k5445n205K4789m256p395K100O227k892K047L2480j0349j0641
$$ y = [16747, 23819, 32360, 31285, 47759, 60264, 48658, 19807, 8403, -24531, -22842, 4949, 6351, 6628, 12439, 41367, 38771, 34207, 7933, -5761, -10957, -873, 12309, 6778, 16060, 20818, 11032, 6462, 2702, -13078, -20521, -25472, -13745, 1206, 22092, 14130, 10523, 20886, -3197, -19625, -25258, -52028, -47934, -10261, -14554, -10911, -12798, -25192, -36152, 1191, -808, 24818, 25127, 12801, 7662, 22440, 44871, 26676, -22439, -27833, -15419, -16482, -8090, -6601, -5594, -5598, 9281, 8898, -8158, -37403, -19824, 5247, 28871, 6525, 5291, 44225, 53926, 46859, 42208, 22709, 15013, 7133, 22163, -5580, -33357, -17726, -9805, -19818, -12399, -11886, -33673, -46568, -24031, -8934, -34379, -39584, -14795, -19051, -26446, -24346, -18119, -21011, -18964, 13516, 3167, -7474]
13971g474K238m195j7048Q345J7648J0162p695j6721Q781j5467j0618M1778M7791
13958E7525j042j3473p211j997j5005R750J2351j934k4398j4564M887L7504J1186
13945E3579K890K4696J1377l0637m9127n4785k2437K0108J9598K671J1302R906
13933h59k4812n230J0531K2331L0476j439j7543o189J6186J1360l720n02P319
13920C7909K4363j0827m3606J2078P288k2825p766J4038N752K4636m483m3131
13908f574k6239J1620l632J8610J4547M714J0112j5997m2959Q048L3974q156j4936
13895a6868j1465J975N936K6541J2052K2840o557k9387j3753j5687q841q053K1895
13882a9372L5832j1570j3832N30j4058n076r952j2198P392J7743k3256J6974J0116
$$ y = [-7474, -5236, -9431, -26479, -18134, -486, 9676, 1981, -14740, -5959, -21426, -32044, 9734, 57525, 56483, 43010, 35799, 33802, 18797, 28547, 40898, 38964, 14566, 2, 4889, 42393, 53579, 56469, 81165, 92542, 61905, 12778, -42007, -64444, -44336, -24738, -22067, -10765, -859, -25671, -30901, -20370, 1961, 32437, 30998, 13455, 7266, 23452, 34812, 31092, 30590, 37909, 62272, 51445, 7839, 19917, 27205, 4380, -3386, 10652, 16404, 41040, 36557, -6574, -32813, -21193, -24825, -6215, 8332, 13046, 23158, 7161, -35798, -27750, 6224, -1932, -16868, -28333, -26358, -20422, 6119, 18171, 41011, 34454, 5067, -8686, -24373, -33214, -41267, -19372, 16460, 4890, -8942, -8412, -22470, -27546, -37498, -49696, -42304, -24561, -47817, -30843, -20727]
13869b0727j5903K1715N1168K0046k64j6449o750j4243l1492j4039O330J2814
13857g794N637k9627L743o384j101K9370M2906K2832j3227q338k9992j3845L5088
13844B9268k2368k2474l379K3809J7227J727J2213k2898l850k365j2363K0929
13832A5476J773J1805K396j0319k6094m8920n024J280j1743J8468K5515J0349
13820a5038M664K6394K481k8221J147j3337O5K2038K4226j2912R18M173m218R662
13806B2042m0868L8299K8230J1620o524l152J3657L5568M2963N2563O0266N4261
13794C08925K3615o0673n5605l8152k0071k8895j8094l0342p587k6689m278K0659
13782F2813r060J8634N86L6489J0658j011l138J2558J5949M3281J5826L5155L0289
$$ y = [-20727, -36630, -14915, 36253, 56299, 56035, 39586, 32836, 18593, -12899, -26938, -20608, -7794, -2157, -31784, -28041, -34425, -35526, -6156, 36750, 59582, 46355, 38017, 8025, -5820, 29268, 6900, -15574, -18953, 4856, 22083, 23810, 36023, 13125, 9275, 6910, -5453, 15476, 17249, 29054, 31450, 21131, -4963, -53883, -58907, -57627, -69370, -50902, -25387, -15038, -10374, 16020, 18501, -9720, -8573, -21910, -21845, 193, 24419, 11507, 12425, 16598, 12380, 22042, -18826, 19473, 47703, 59323, 52799, 49647, 63304, 98872, 141835, 194398, 254664, 308925, 332540, 271867, 216262, 178110, 158039, 129144, 111050, 80708, 73121, 46432, 42154, 62813, 53753, 72387, 72973, 109462, 120120, 119109, 115971, 128529, 144478, 187759, 203585, 238740, 269029]
13769B69029L4266J1486M8606L1469J6587k8166m5554j4235R22J6108j1999m7271
13757B81248k0273j7058m0209p6683k4643n106k4591n371k0620J886P909Q755
13745F5244J2001J3829K094j9838J0418J7520N0124P1884P7089O0114j2972p3119
13733B74388o2811j600k8261p666j6558k6128m1202m8946l7695k8149K9496L7662
13721D2530k9366m2514o974K8682j4256O69J7151q119K4791K172J2107j3197q167
13708E509k4623n425J0648P110R1p637j4670K2425J776m088k3182k0062J7964
13695c4164P508J1320o416n4231P180L2952M704r120M3519K100l5029j0383j5572
13682e5632Q229L4653K4592k3839j2212K3951R750K6492K2046n2672m4528Q293
$$ y = [269029, 303295, 314781, 363387, 394856, 411443, 383277, 337723, 323488, 324410, 340518, 328519, 281248, 260975, 243917, 203708, 127025, 102382, 97276, 72685, 67314, 46694, 48580, 56489, 65244, 77245, 91074, 93168, 73330, 83748, 101268, 151392, 223276, 300365, 360479, 347507, 274388, 211577, 209977, 181716, 174050, 157492, 131364, 90162, 41216, 3521, -24628, 4868, 42530, 13164, -29350, -36324, -7642, -21898, -21229, -4078, -12197, 12594, 14766, 26873, 13676, 5509, -19114, -24539, -13891, -6781, -6690, -14327, -28997, -6572, -4796, -8884, -32066, -52128, -34164, -26656, -15336, -21752, -75983, -68803, -35851, -31147, -40267, 3252, 5352, -29677, -40060, -55632, -47403, -12750, 11842, -11997, -24209, -258, 9492, 35984, 58030, 5358, -39170, -30877]
13670c0877L872j4311K9570M760L246O987J9409j0126k8990k6642o270J9570K1611
13657h191r550J0724J7559J1662o291J8464K3259k6028j1801N249l4879r274J1861
13644g236J1232R402J5977K8976K8191k6726l628j4133m9056P532N754K0289Q770
13631C5344o230Q406p009n710K735j09j4475J633Q196N427j4004J619J2297j0880
13617A7240J7441J0751J1103k8659j2328M376K3928j8876j1852M806K0769P566
13605D6265j913j0875J5028J3353m872j989J086k422L2640M8542L0600J2155l744
13592A73854L810m5762k2670J0381j7346n763j4125O3J5551L7966L1639m542q258
13579A54798j1742m6351J3104k6458l1136j6453j4488k9685j4646l10L3419J6882
$$ y = [-30877, -27005, -41316, -11746, -6986, -3740, 3247, 22656, 12530, -16460, -43102, -49372, -29802, -8191, -17741, -7017, 10542, 22204, 15913, 34377, 57636, 31608, 19807, 25056, -9823, -19097, -7236, 3996, 13398, 29375, 58351, 86542, 59816, 56188, 42055, -7001, 531, 6285, 26574, 35344, 29114, 37520, 30511, 24801, 27536, 27427, 12952, 14585, 22781, 28208, 14204, 15823, 28120, 17240, 34681, 45432, 56535, 27876, 15548, 19924, 43852, 24976, 13124, 17930, 38699, 46265, 44352, 33477, 48505, 61858, 56986, 54997, 56083, 53661, 86301, 134843, 165443, 177598, 173854, 177664, 131902, 109232, 119613, 102267, 96504, 82379, 82442, 97993, 135959, 167598, 163056, 154798, 143056, 96705, 109809, 83351, 52215, 35762, 21274, -8411, -23057, -23367, 10052, 26934]
13567B6934j4632p826J7724J4669m309k1465m07l879j544J7315K2276J3204j1619
13554D6441K4847L48j6777o798O581P446j9695j3702n534J3055L656J4210l3880
13541B0198m3283Q459J8L79K2393J336J2789j5334l3086m475K057J1816L4584
13528A7851J8023k4365R1K4748J7033M2813L6559Q970K360M636j5489m9751k7098
13515E6381J1161R951J8497M1532K1250q24J628k7722j6531o703r813l6457j8512
13502D3838k2584j3638L7815J6485k3280l4162j1488j21J8562j336j4900m074
13490h883M39J6284j5956j4320j1748k1146Q440J4197J9928l983m885j9623O725
13477c4531K1737L848o177k2593K781k2239k531J9165K136J1541J0622j1287M725
$$ y = [26934, 12302, 4476, 22200, 36869, 32560, 11095, 10688, 6809, 5265, 22580, 44856, 58060, 46441, 71288, 71636, 54859, 48061, 54642, 62088, 42393, 28691, 23157, 36212, 39868, 54078, 20198, -23085, -14626, -14608, -14229, 8164, 9500, 22289, 6955, -26131, -30606, -28549, -16733, 17851, 35874, 11509, 11600, 36348, 53381, 96194, 132753, 141723, 144083, 148719, 133230, 83479, 56381, 67542, 77493, 95990, 137522, 158772, 157948, 159576, 131854, 115323, 108620, 98807, 62350, 43838, 21254, 7616, 45431, 61916, 38636, 4474, -7014, -7135, 11427, 10091, -4809, -8883, -8444, 7840, -8116, -22436, -34184, -55330, -46890, -32693, -12765, -16748, -21633, -41256, -34531, -12794, -8946, -15123, -37716, -34935, -57174, -59705, -40540, -38404, -26863, -16241, -27528, -22803]
13464b2803L6560J0445J49j0770j5851q187J7900O6130M2208J6615L9349j8397
13452A53348k7879K1025P399k9777j4063l6825N147J4164j6509l1888o0326r009
13440b5193J4140j3680J2993j2917Q757L3845L2700J5655m567O621M0195L4985
13428A43534j3190J0292R352K3295j3957k4282j5046k1438l196J3034m907j2325
13416I1166m5183j2756R517M6953j103m0405j8651M3417N662J711J9540Q707J0632
13403A19207K149J2420Q073j8069L834L0183N6229N2416K7320l6855j7369R204
13391B48742k1232m7697k6305K3112l31o089k750R908o166N747K3640J7626P789
13378B25994J6344q364J8564J0894k1939k3290N529J0727L1370L6305L6879k776
$$ y = [-22803, 13757, 24202, 24351, 13581, -2270, -10457, 7443, 73573, 115781, 132396, 171745, 153348, 125469, 146494, 153893, 124116, 110053, 73228, 78375, 92539, 76030, 44142, -16184, -25193, -11053, -24733, -11740, -24657, -15900, 17945, 50645, 66300, 61733, 68354, 108549, 143534, 130344, 140636, 149988, 173283, 159326, 135044, 119998, 98560, 95364, 108398, 103491, 91166, 45983, 33227, 42744, 89697, 88594, 48189, 29538, 72955, 78617, 80328, 99868, 108575, 119207, 121356, 133776, 141849, 123780, 127614, 157797, 214026, 266442, 293762, 256907, 239538, 248742, 227510, 179813, 153508, 176620, 176289, 170200, 167450, 177358, 171192, 176939, 200579, 218205, 225994, 242338, 233974, 252538, 263432, 241493, 218203, 223732, 234459, 265829, 302134, 339013, 336237]
13366C36237K2994K3434L7845L2147L5558K9107J0072J9197J5266M6195K8839
13355F36891L7276O5439J18298O2925M9134O2316P0024R6093J16950J46874J96682
13344A658902K60542K94211L43393M10695M51200N25040O09906P54731J073042
13335F381662J531566K089837K842674M035632O006954R117147J2326457J2486355
13327E6818284O250412l816853j0589923j1281584q825759o186794m132695k767034
13319A5468054j828369j045316l53262K84953J062443J901677K003008P69622
13311A8262810o77938j041733l62279P34738K094467L887711O284143Q768287
13303C7950206R257482O894360M977978O368957P707624M071120l423668q902207
$$ y = [336237, 359231, 382665, 420510, 452657, 488215, 517322, 527394, 546591, 561857, 608052, 636891, 674167, 739606, 857904, 920829, 969963, 1032279, 1102303, 1198396, 1315346, 1462220, 1658902, 1919444, 2213655, 2557048, 2967743, 3418943, 3943983, 4553889, 5308620, 6381662, 7913228, 10003065, 12845739, 16881371, 22888325, 32005472, 44331929, 56818284, 63068696, 59251843, 48661920, 37380336, 28554577, 22367783, 18235088, 15468054, 13639685, 12594369, 12241107, 12526060, 13588503, 15490180, 17493188, 18262810, 17584872, 16543139, 16180860, 16915598, 19010065, 22897776, 29181919, 37950206, 47207688, 54102048, 59080026, 65448983, 73156607, 77227727, 73804059, 64901852]
13295F4901852q868983m967156j211110j255670m956801p825663p357578n285334
13287B3173557l379254j883241n71157O40534J293294O18592r93966k040984j797324
13278A5060051r31731p2206O89007J501774K519131M018688O312272R740099J3342490
13269E2179575J3409002O090851n472638j2845602j3163847j0168066p151226
13262B2878049m960265l480463k598164j974059j510612j122568q82254p22318
13254E627346o04752n46195m98591m12111l61178l47347k67412k19956k06952
13245B162852j44563j13976j29136p1530k1059p1425r6599j10529r1509j03344
13235A209182p7649o0182l9054l0662j0351k9566k2178j4704j2245j3490j8207
$$ y = [64901852, 56032869, 51065713, 49854603, 48598933, 43642132, 35816469, 28458891, 23173557, 19794303, 17911062, 17339905, 17980439, 19273733, 19892325, 18898359, 16857375, 15060051, 14128320, 14056114, 14745121, 16246895, 18766026, 22784714, 29096986, 38837085, 52179575, 65588577, 71679428, 66206790, 53361188, 40197341, 30029275, 22878049, 17917784, 14437321, 11839157, 9865098, 8354486, 7231918, 6349664, 5627346, 5022594, 4476399, 3977808, 3565697, 3204519, 2857172, 2589760, 2369804, 2162852, 2018289, 1904313, 1775177, 1703647, 1682588, 1611163, 1514564, 1404035, 1312526, 1209182, 1131533, 1071351, 1032297, 1001635, 991284, 961718, 939540, 924836, 912591, 899101, 880894]
13224H80894l2680j3406j7420l4446l6387n9523m7862j5409l7942n810j1836j690
13212E66483J7857l588m8327m111K930R6l3337n0362J3486k062l9772k0985k5388
13199C72920J8509L735L5385K3636k4880m362J1171j634k7887j2998j7704k1197
13187C54694Q878k2487k5771m475L895l6419j6470R862J1799L42k3827k6159j8981
13174B14881J960n360J7549K7881k04o626M439K7128q603k1569O800K4880k4095
13161B59061j4301M310J0527m478M114j6909N804R03P651J553K7635l996Q399
13148B90273K0762J7837J5357k5840o7777l4537n3542j1899q337L9529q650j8180
13136A54996J7838n274l4721K1203M7849N40m1840p579K730k3266O528K35J4411
$$ y = [880894, 848214, 834808, 817388, 782942, 746555, 687032, 639170, 623761, 585819, 580009, 568173, 566483, 584340, 580752, 532425, 528314, 531244, 531340, 498003, 447641, 461127, 459065, 419293, 398308, 372920, 391429, 395164, 430549, 454185, 429305, 424943, 436114, 434480, 406593, 393595, 375891, 354694, 363572, 341085, 315314, 310839, 314734, 278315, 261845, 271707, 283506, 283848, 260021, 233862, 214881, 216841, 211481, 229030, 256911, 256707, 250081, 254520, 281648, 273045, 251476, 258276, 283156, 259061, 244760, 249070, 259597, 255119, 259233, 242324, 248128, 249031, 256682, 258235, 285870, 281874, 290273, 311035, 328872, 344229, 318389, 250612, 216075, 162533, 150634, 142297, 181826, 173176, 154996, 172834, 167560, 132839, 154042, 201891, 202431, 160591, 153012, 155742, 132476, 139004, 139239, 153650]
13123A53650O159L719K2791k1863n281l0796j4367Q680L2585j2606k598j9406
13111A20667k5040n482Q605L2663k185l785p978N769K0067j2082j1745l824k7201
13098H8449j9155L280l9244k9758L1076L0744j2908k2088l886J4247L6477J3317
13086I0551o391K2534n79m7368m441M238J6469P54j5136J2452K4695p399k4606
13073F5773n531M4190K9915r37j3291m072P134N428K4352k7504m4962l8821n477
13060C6197j3097L2009M5354N1074O15n6398m7572n889K4204L977j0596l879J223
13047E7222k0844k5892r080O053N0591J5224l6322j3692K6313J2767j2122j8334
13035C1884J3707J6576K0289p23l73J2604m662j5497N074R309J6794M4453J826
$$ y = [153650, 159809, 163528, 186319, 164456, 159175, 128379, 114012, 122692, 155277, 142671, 140073, 120667, 95627, 90145, 98750, 131413, 129228, 125443, 117465, 123234, 143301, 131219, 119474, 115650, 88449, 69294, 72574, 33330, 3572, 34648, 65392, 52484, 30396, 26510, 40757, 77234, 90551, 84160, 106694, 106115, 58747, 54306, 58544, 75013, 75767, 60631, 73083, 97778, 90379, 65773, 60242, 104432, 134347, 133410, 120119, 116047, 123181, 128609, 152961, 125457, 80495, 41674, 36197, 23100, 55109, 100463, 151537, 152152, 95754, 48182, 42293, 66497, 70474, 59878, 55999, 57222, 36378, 10486, 1406, 7459, 58050, 73274, 36952, 23260, 49573, 62340, 50218, 31884, 45591, 62167, 82456, 81733, 81360, 93964, 89302, 73805, 78879, 88188, 104982, 149435, 151261]
13022A51261l2003l8330j728K9694J7390j9766k4538K581J0505L4524J7004l3350
13010A13244l6978k5355O245J7102J4409j9539O400j783p993L701J1362k1546
12998E9269l5036J6715K7275j3443k6075j6118j1380J4685M3196n323j9727j5623
12986A8415j4262O225L0217p412j1568J5j613j1397L301L1059K5728K229Q076
12973G9013K4384j4722J869r641R227O147k565M992J3877o932l7046j1715L5055
12960I1943M7977K0541k9154l2275k8320P725M6680J4869J0340M7234M1224j510
12948B37274m3391m0442n6367k4258j3773O987K0279K47j4936p741p381j0397
12936D6101o367j5312j0581l501J6160k73j1791L586J8911j4258m286j6931j5770
$$ y = [151261, 119258, 80928, 79200, 108894, 126284, 106518, 81980, 84561, 95066, 129590, 146594, 113244, 76266, 50911, 57156, 74258, 88667, 69128, 75528, 73745, 65752, 69453, 80815, 59269, 24233, 40948, 68223, 54780, 28705, 12587, 1207, 15892, 59088, 53765, 34038, 18415, 4153, 10378, 40595, 33183, 21615, 21630, 20017, 8620, 11921, 42980, 68708, 70937, 79013, 103397, 88675, 90544, 80903, 90130, 96277, 93712, 98704, 112581, 105649, 68603, 56888, 91943, 139920, 160461, 131307, 99032, 70712, 78437, 125117, 139986, 150326, 197560, 238784, 237274, 193883, 153441, 97074, 72816, 59043, 66030, 86309, 86556, 71620, 63879, 56498, 46101, 39734, 24422, 13841, 10340, 26500, 26227, 14436, 18022, 36933, 22675, 18389, 1458, -14312]
12923a4312n033M636j695J9576L0951K4903K3286M781j2789j4502j7938J1357
12911E3221P398O591l1607m213R122k4680J0960Q675K0851L4026j0543k1414k5010
12898C3377J344J8637q014o792k6221J4710K5189L1215q451R999L2681J5522J785
12885A34981j2523j6644k0290q244j8663N399K6533L1717K7959J925j1822q104
12873A32224j4950j989j6832N078q10K35P709j3711k2598J0917K1054L0917L486
12860A40730j5728Q885N808M0952M5762N6309L1476J3350J4106j8653k7512o1614
12848B33871o8325l5800J9528Q741m9115J0320P227k0737R610L8621K8744k1003
12836A61682m1107m7229J3178K5688M022L4478M3089M2183M7456J1674M2925L2850
$$ y = [-14312, -19345, -14709, -16404, 3172, 34123, 59026, 82312, 87093, 74304, 59802, 41864, 53221, 60619, 67210, 35603, 31390, 40512, 15832, 26792, 35467, 56318, 90344, 79801, 58387, 33377, 34721, 53358, 45344, 38552, 12331, 27041, 52230, 83445, 74994, 84993, 117674, 133196, 134981, 122458, 105814, 85524, 77280, 58617, 64016, 90549, 122266, 150225, 152150, 140328, 132224, 117274, 115285, 98453, 103531, 102721, 102956, 110665, 96954, 74356, 85273, 106327, 137244, 140730, 125002, 133887, 139695, 180647, 226409, 282718, 314194, 327544, 341650, 322997, 295485, 233871, 165546, 129746, 149274, 158015, 108900, 119220, 126447, 105710, 115320, 153941, 182685, 161682, 120575, 73346, 86524, 112212, 116234, 150712, 193801, 235984, 283440, 295114, 338039, 370889]
12824C70889L0989M920p5490o5981j9120o756n581M422j3126m6022n6328k5064
12812I7752o951J2982p696l441L0029J6384p748k7960N189K7656m61j5714P251
12799A27272l74L0283N1253N8845P4338L1363J1050j5402j9844m9625p0258k5421
12787B03480k413R691l5607m9023m8067l129k2900k18K0502J4067J5129m571k6851
12774G0090P285n255j8446p521R113J5896J7810K322Q754k6730l1228k4594K9226
12761D6722J7879j6941n845J306k5722k2132L6726J0938q386M180k0159J4735
12749C3301J7916L5719Q426K444l5949N50J3166M4806P3617M9235N4490L8887
12737C36608K303n3337l7236m9209o2293j5274J0023j8536J2449K311l1265j7471
$$ y = [370889, 401878, 406798, 331308, 265327, 246207, 239451, 233870, 238292, 225166, 179144, 122816, 97752, 90801, 103783, 96087, 92646, 122675, 139059, 131311, 103351, 108540, 136196, 135735, 120021, 127272, 126898, 157181, 208434, 267279, 341617, 372980, 384030, 368628, 348784, 299159, 228901, 203480, 201067, 210758, 175151, 126128, 78061, 74932, 52032, 51814, 72316, 86383, 101512, 96941, 70090, 77375, 72120, 53674, 46153, 55266, 71162, 88972, 91294, 100048, 73318, 42090, 17496, 46722, 64601, 47660, 41815, 43121, 17399, -4733, 31993, 42931, 34545, 38725, 18566, 33301, 51217, 86936, 95362, 97806, 61857, 62407, 75573, 120379, 193996, 243231, 297721, 336608, 338911, 285574, 248338, 199129, 136836, 121562, 131585, 113049, 125498, 127809, 96544, 79073]
12725G9073K9396K6013l4758o858N765j5744m8675O090L9802M4855N0411O8474
12713B43844M5411q944l263K2179K1344L7947Q709J545j7117j0454L490n5193
12701B89498n6234j9696j7472k8237l1325p761l314j1288k1988k2930J5123J2001
12689I6377J162j0241p985p312L992L2805J9828J5305L2820M5576L9669L8618
12677C00614p678l8984o5498l9411n4277k9062j399R436p175j7303N179Q543j4351
12664D8634n1997J7713j798Q050K8026L1312R133j0419l9323j2093J0927p758
12652C0407J7639K0748P808J9189n694o550J742j4446m776k4616k2494j8005j1889
12639a0937J1503J8086j725J5817J5594k7904l7834L776K4041k970l300J0967
$$ y = [79073, 108469, 134482, 99724, 92866, 98631, 82887, 34212, 40302, 80104, 124959, 175370, 243844, 289255, 280311, 277048, 299227, 320571, 358518, 367227, 368772, 351655, 341201, 344691, 289498, 233264, 213568, 196096, 167859, 136534, 128773, 125459, 114171, 92183, 69253, 84376, 96377, 97539, 87298, 79313, 72001, 75993, 108798, 128626, 143931, 176751, 222327, 261996, 300614, 292936, 253952, 188454, 149043, 94766, 65704, 64305, 73741, 66566, 49263, 54442, 62985, 48634, -3363, 14350, 12552, 20602, 48628, 79940, 89073, 78654, 39331, 27238, 38165, 30407, 48046, 68794, 76602, 95791, 90097, 83547, 85289, 70843, 66067, 41451, 18957, 952, -10937, 566, 18652, 16927, 32744, 48338, 20434, -17400, -13624, 10417, 7447, 4147, 15114]
12627A5114K7687j3567k3364m1971j6795L4291J6212Q276K0298l3478O455L453
12615B611k3011j5903L878M2859L4844J7245o969k9798j2925l8453k1355o443
12603e3420K5199J8121k7782r120K9860J35Q557j9617P252K8458K8344k3501j7018
12590d532P580P511K5400K6595k3888k9716k0765J9951j5145l2231J7608K1295
12578c37j1178K1390K4297p33L5699n347j7703o706l9120k6187P710j3846j775
12565c3836K9778J3887j4040l2150j9036J175L7J697J7361j1038J8388J0639K9566
12552A2428L9298J2193q250o603L11Q27k2654j6963K7227P831j0114k7984j8751
12539a1204k8420K9060J3006J0686j3305l3343j4774J9263J7443L6312L0485M427
$$ y = [15114, 42801, 29234, 5870, -36101, -52896, -18605, -2393, 5883, 26181, -7297, -842, 2611, -20400, -36303, -32425, 10434, 45278, 62523, 55554, 25756, 12831, -25622, -46977, -53420, -28221, -10100, -37882, -47002, -17142, -17007, -8450, -28067, -20815, 7643, 35987, 12486, -4532, 3048, 10559, 35959, 62554, 38666, 8950, -11815, 8136, -7009, -39240, -21632, -337, -11515, 9875, 34172, 33439, 69138, 63791, 46088, 39382, 262, -25925, -18215, -32061, -33836, -4058, 9829, -4211, -36361, -55397, -54222, -54185, -52488, -35127, -46165, -27777, -17138, 12428, 51726, 63919, 55669, 49066, 49377, 50204, 27550, 10587, 37814, 45645, 35531, 7547, -11204, -39624, -10564, 2442, 13128, -177, -33520, -48294, -29031, -11588, 24724, 55209, 59636]
12527E9636k2570q818J2803J2240r183k053J0752J7979Q244Q530n9022l9229j0898
12514b1589K4154L6525l236K611k9146p911M895l576M3416J1788j3410p369n458
12501C1694J9438K602K0099L3691K2912q534K972K0096m219k4097L440J500k1478
12488A00116M172k5082p7246k7591J4932j5040j2243n464K5251M7286L011P13
12476C2815p277J5279p854J2965J2245r821J2524R762J1355j81N603l520l713
12463H0182j9263j7111j5080J4872j0216K0391j9313q925K0633L9788L9142L5714
12451A60814M5637M9290K9699P83j3462q251j9696l5258m8375n7968j5868K6041
12439A13386p963j7287J1408L0386J3178K4325K4808M8765P3599P6245J40465
$$ y = [59636, 37066, 28248, 41051, 53291, 44108, 42055, 52807, 70786, 79030, 87560, 28538, -10691, -21589, 2565, 39090, 35854, 38465, 9319, 1408, 6303, 2727, 46143, 57931, 44521, 37152, 31694, 51132, 53734, 73833, 107524, 130436, 121902, 124874, 144970, 140751, 116654, 120094, 121594, 100116, 104288, 79206, 1960, -25631, -10699, -25739, -37982, -43446, -18195, 29091, 32102, 32815, 25538, 40817, 32963, 45928, 58173, 48352, 60876, 70638, 81993, 81812, 87415, 83895, 80182, 60919, 43808, 28728, 43600, 33384, 53775, 34462, 25537, 46170, 85958, 125100, 160814, 206451, 255741, 285440, 286223, 272761, 264510, 244814, 209556, 161181, 103213, 87345, 113386, 105423, 88136, 99544, 129930, 143108, 167433, 192241, 241006, 314605, 390850, 531315]
12428E31315J65147J81034J32573L6943o8844j26849j35229m8857j6360k7993
12418F22880R877K657l2019J3087P1238R0423J05690J11274P5745l7810q1620
12407I51422j07586o0681n57J6643j6305K331K5468M6368P4859J18635R7841M981
12395A153419n7891o2152l3380l4666m9421k0302K8731l663j3847j4101J1455
12384I04182K9245P8852O9726J9563j2466r6422q4332o2945m8059o6829l7853
12373F92662k8261M522L8622J35230J11771O3908j2448j00739j38386j42075q4186
12362E40620l3607l6206j4032o066L2096k333L5859N5654J05242J11601O0533
12351H49361n0581j13730j18376o2254m2833m0597k2903k3087O201L2015n130
$$ y = [531315, 696462, 877496, 1010069, 1047012, 978168, 851319, 716090, 667233, 650873, 622880, 632757, 635414, 603395, 616482, 687720, 778143, 883833, 995107, 1070852, 1033042, 951422, 843836, 783155, 782598, 799241, 782936, 785267, 810735, 857103, 931962, 1050597, 1148438, 1153419, 1095528, 1033376, 999996, 965330, 915909, 895607, 924338, 920675, 906828, 892727, 904182, 933427, 1012279, 1082005, 1101568, 1089102, 992680, 908348, 845403, 797344, 730515, 692662, 664401, 668923, 707545, 842775, 954546, 1018454, 1006006, 905267, 766881, 624806, 540620, 507013, 470807, 456775, 450709, 482805, 480472, 516331, 571985, 677227, 788828, 849361, 798780, 685050, 566674, 504420, 461587, 420990, 398087, 375000, 381201, 413216, 408086]
12340D08086L3421J2247K757J2094K6238K351K5388L4834O459o116L7273N4157
12328F49189L6664L3721L5828M7227M4300M6574O8788J13126J09706J01028J24901
12317A411052J45970J84695K08462K45532L55409M02813N21595O94266Q48322
12308E018116J047079J343032J749564K460602L572792N329995P818180J0631650
12300C8971010J2027731R756407L483966m081064r326861j0601033r009783o642994
12292B4577379m595681l048558j913567j009082j25586P01981J275135J212219
12284A7074240N07488l99742q41609m91016N10957J855281L523717N250973O262636
12275C3252925N734330M043744K847445L652321O027893P661339O420702K489201
$$ y = [408086, 441507, 453754, 456511, 468605, 494843, 497194, 522582, 557416, 563875, 557759, 595032, 649189, 685853, 719574, 755402, 802629, 846929, 893503, 962291, 1075417, 1185123, 1286151, 1411052, 1557022, 1741717, 1950179, 2195711, 2551120, 2953933, 3475528, 4169794, 5018116, 6065195, 7408227, 9157791, 11618393, 15191185, 20521180, 28339360, 38971010, 50998741, 60755148, 64239114, 60158050, 50831189, 40230156, 31220373, 24577379, 19981698, 16933140, 15019573, 14010491, 13884905, 14586886, 15862021, 17074240, 17581728, 17181986, 16340377, 15849361, 16360318, 18215599, 21739316, 26990289, 33252925, 38987255, 43030999, 45878444, 49530765, 55558658, 63219997, 69640699, 72129900]
12267G2129900j998516m680331n419266n759941o754608p627755p335430n966377
12259B6587676m203669k597314j202863k17252J11071k83233j071639j650310
12251A5472467j623849j120415m63369J80212Q37435J626750K736303M365534
12243B2011068O671112R069027J0028377P819889K225646m307693q752322r733214
12235C5031890q279548o229413m423060l139274k273626j686561j332532j087371
12227F580505q62331o87278n90414n05527l58630l16277l06636k43425j78138
12218B531849j42743o4923l6041m2048j024j0315l9764m6762O1509J81972K93447
12207B685157N40862R28820J239805J155970O97873M09151K23103m29821q83036
$$ y = [72129900, 70131384, 65451053, 60031787, 54271846, 47517238, 39889483, 32554053, 26587676, 22384007, 19786693, 18583830, 18366578, 18477649, 18194416, 17122777, 15472467, 13848618, 12728203, 12264834, 12445046, 13282481, 14909231, 17645534, 22011068, 28682180, 37751207, 47779584, 55599473, 57825119, 53517426, 44765104, 35031890, 26752342, 20522929, 16099869, 12960595, 10686969, 9000408, 7667876, 6580505, 5718174, 5030896, 4440482, 3934955, 3576325, 3260048, 2953412, 2709987, 2531849, 2389106, 2324183, 2288142, 2246094, 2245070, 2234755, 2194991, 2148229, 2209738, 2391710, 2685157, 3226019, 4154839, 5394644, 6550614, 7248487, 7657638, 7880741, 7450920, 6567884]
12198F567884q37955q44705r76155q65239n93020l61547l03868k17596j43450
12189A424349j57416j22646j07605o0348l3013j9342o7481p3739n3092l8332m3832
12178F47503n8835m7850l6105M788j0581l0192k2258L2724M3291p735n796k2528
12166D86426k3703p558j5341j8029j9068k0343M197k0741o295m700L7730P021
12154C99596k754n7317k3634O383J4384p190K072l0176k1814j0222R009j4903
12142B63434M575J574J0512N456O831k8319k549L961P455m250K4189L6785R981
12129C39635n954k6996k0933l558j0644p66k571l063K3210r86l89o889k7829J2409
12115B64676p659j3999k8637J824j439J0968O548k6373J6464P544j3910K5175
$$ y = [6567884, 5729929, 4885224, 3909069, 3043830, 2450810, 2089263, 1785395, 1567799, 1424349, 1266933, 1144287, 1036682, 976334, 943321, 923979, 856498, 782759, 729667, 691335, 647503, 588668, 540818, 504713, 509501, 498920, 468728, 446470, 479194, 522485, 514750, 508954, 486426, 462723, 455165, 439824, 421795, 402727, 382384, 386581, 365840, 359545, 354845, 392575, 399596, 396842, 339525, 315891, 322274, 336658, 329468, 331540, 301364, 279550, 269328, 278337, 263434, 268009, 269583, 280095, 285551, 292382, 264063, 261514, 265475, 272930, 268680, 292869, 329654, 339635, 333681, 306685, 285752, 282194, 271550, 270784, 268213, 265150, 288360, 287374, 286985, 280096, 252267, 264676, 257017, 243018, 214381, 216205, 214766, 225734, 232282, 205909, 222373, 229917, 216007, 241182]
12103B41182N320j563k7009l6938J2793J9752J8517R209m551k1226j2037k952
12091B00497m059K1845M998J4869L7125j6208k563J7488l7927j3476J3533J0348
12079B46470j086J7205L0615j2828q02m0924m5792j0186m1385j8232j5175j631
12067A06249J7073K8439K3464R091M889M549l174n047M884J5922J8813n269l5582
12054A84301L969L13l6657j902K6222k209j3370p418l3668J205K0060O077J5846
12041A62769j4190n4521j0975N0241K3328j5374J9051M93k2628o993P397K2457
12029A61055K2251L9997N1960K9174M6478L1419M1246K8897l655l0940p9253o7593
12017B71036p7413l6731k0264j2672L697O224o819k7412Q941j1366j9190J7424
$$ y = [241182, 246502, 244939, 217930, 180992, 193785, 213537, 232054, 241263, 236712, 215486, 203449, 200497, 196438, 218283, 223281, 238150, 275275, 259067, 256504, 273992, 236065, 222589, 236122, 246470, 245384, 262589, 293204, 280376, 279574, 238650, 192858, 182672, 141287, 123055, 107880, 106249, 123322, 151761, 175225, 184316, 189205, 193754, 190580, 185533, 190417, 206339, 225152, 219883, 184301, 188270, 188583, 151926, 150024, 176246, 174037, 160667, 153249, 119581, 120786, 140846, 146923, 162769, 148579, 94058, 83083, 133324, 156652, 141278, 160329, 160822, 138194, 131201, 138598, 161055, 183306, 223303, 275263, 304437, 350915, 382334, 423580, 452477, 448822, 417882, 338629, 271036, 193623, 156892, 136628, 123956, 127653, 133877, 127058, 99646, 108587, 97221, 78031, 95455]
12005I5455P361m075J553L423M966M024m513l744N481M284L242m656j4545l4667
11991F3589r585J4015J9692P161l3186k638J8042k2084K9045J3988J2540j0700
11979I9879j4384K470K5404J4903k597k0949j8618j1638q524k5547L1563L0068
11967A02030J6882K1736J0223l1720l6579k4875o6519l9334k0565J8266P1642
11956B1187K6774M0953K8677j8585k6602L219j4626k0037l4740J2408K8097l080
11944D3645R106J3826p806j4171o513j5627l3590L54k2273j2128J4000L7721J4167
11931B0711j4038j7195m836N360j0918j758J5660L252j77J4482J4336J3610Q471
11918D6960J6792j6461j4653j440k6529l646J0676N016M4573J5371P742J0916
$$ y = [95455, 102816, 98741, 100294, 103717, 108683, 112707, 108194, 104450, 109931, 114215, 117457, 112801, 98256, 63589, 54004, 68019, 87711, 94872, 61686, 59048, 77090, 55006, 84051, 98039, 110579, 99879, 85495, 87965, 113369, 128272, 125675, 104726, 86108, 74470, 65946, 40399, 71962, 102030, 118912, 140648, 150871, 119151, 82572, 57697, -8822, -48156, -68721, -50455, 21187, 47961, 88914, 117591, 99006, 72404, 75623, 60997, 40960, 6220, 18628, 46725, 43645, 52751, 66577, 58771, 44600, 38087, 22460, -11130, -10776, -33049, -45177, -31177, 6544, 20711, 6673, -10522, -15358, -9998, -20916, -22674, -7014, -3762, -3939, 10543, 24879, 38489, 46960, 63752, 47291, 32638, 31198, 4669, 1023, 11699, 16715, 61288, 76659, 84401, 95317]
11906I5317J7128J3139O715M1261M0433M1548J41085J95590K80933L40005K65044
11895A478198J29387l037r679J08803O4491j61311l26835l31493k60143j73616
11885E14765r6741r5990m2089k8364n3907j7285k8132k4896l9271j1792k3908
11874E2390k1139L330K8303L5242L6663L9314Q936j0572k167j6252j9557k2067
11862A12424L0659M1934K3844J2019J7793K719J0614O4885J00431O3140N669j9555
11850D66576m9373n3993l9405k9869j0059n218L3843j0006j8533j7818Q822K3464
11838B98431L4028L1719K718Q838M1152L3682N7438O6914L4082K7422k08l2513
11826F03703J3013K6654P0355Q7187N1759N6328J3905j614L0179M2139Q0j127
$$ y = [95317, 112445, 125584, 132299, 173560, 213993, 255541, 396626, 592216, 873149, 1213154, 1478198, 1607585, 1604548, 1594869, 1703672, 1768163, 1606852, 1280017, 948524, 688381, 514765, 418024, 322034, 279945, 251581, 197674, 180389, 152257, 127361, 88090, 76298, 52390, 31251, 34581, 62884, 98126, 134789, 174103, 183039, 172467, 170300, 154048, 134491, 112424, 143083, 185017, 208861, 220880, 238673, 241392, 252006, 316891, 417322, 480462, 486131, 466576, 417203, 363210, 323805, 293936, 283877, 278659, 312502, 302496, 283963, 266145, 274967, 298431, 332459, 364178, 366896, 375734, 416886, 450568, 508006, 574920, 609002, 636424, 636216, 603703, 616716, 643370, 713725, 800912, 852671, 908999, 922904, 921290, 951469, 993608, 993688, 992561]
11814I92561J7546j0157K7328L8380K3903O4620R9581R6344J31443J49841J53883
11803A785273J33792J03374P4930M7788P2420J67148K22434K62235K59980K52170
11793C381544L09726K76895K89542L38755M96364O08867O50962P81103R85138
11784H118896J342752J864347K441112L072804L630275M212625N073224O619308
11776C6375343R362476J4182324K2575829L7269512O0727562Q7224165R4542932
11769C62260143N8071461j2518616p1356668q7474309p1970789m9574366l2500179
11762I4936677k1432374j4505354j0313673p847602o378847n391633m503297l692490
11754B0871407k982037k423408k016149j684794j335834j071195q51230p48397
$$ y = [992561, 1010107, 999950, 1027278, 1065658, 1089561, 1154181, 1253762, 1350106, 1481549, 1631390, 1785273, 1919065, 2022439, 2097369, 2145157, 2217577, 2384725, 2607159, 2869394, 3129374, 3381544, 3691270, 3968165, 4257707, 4596462, 5092826, 5701693, 6352655, 7133758, 8118896, 9461648, 11325995, 13767107, 16839911, 20470186, 24682811, 29756035, 36375343, 45737819, 59920143, 82495972, 119765484, 180493046, 267717211, 362260143, 420331604, 407812988, 336456320, 248982011, 177011222, 127436856, 94936677, 73504303, 58998949, 48685276, 40837674, 34458827, 29067194, 24563897, 20871407, 17889370, 15465962, 13449813, 11765019, 10429185, 9357990, 8506760, 7758363]
11746G758363p18168n94029n30241m57968l75374k96984k59867k80914k94232
11737C950586k88133k50524j97141j96017j69795j08519j29850j19094q0698q2275
11727B328540n8708n2348j34351j18521j01784p3720o0956n4345n6223m9029j6506
11716A552049l540L0874p021o2731n2577q7883q7457o4265p4304n1467M088k8992
11704A066774k7286m1133k0585p234k8306l8792K2016k3229l7676m7710k9325
11693G87514K1653L7430K5155m534m0229n5927l0561j9502j0827l1318o005J8412
11681F91261K6093k3325l2313j1509n7484l8355K7424j2490J3315L6713k6411
11670E92919l3325k292l36L6356Q920j7284j777L6471N1129Q8867O3751M1348
$$ y = [7758363, 7040195, 6446166, 5915925, 5457957, 5082583, 4785599, 4525732, 4244818, 3950586, 3662453, 3411929, 3214788, 3018771, 2848976, 2740457, 2610607, 2491513, 2410815, 2328540, 2269832, 2217484, 2083133, 1964612, 1862828, 1789108, 1728152, 1673807, 1617584, 1568555, 1552049, 1548509, 1579383, 1572362, 1509631, 1457054, 1369171, 1281714, 1217449, 1143145, 1091678, 1095766, 1066774, 1039488, 998355, 977770, 970536, 942230, 903438, 925454, 902225, 864549, 816839, 787514, 809167, 846597, 871752, 867218, 826989, 771062, 740501, 720999, 710172, 678854, 672849, 691261, 717354, 694029, 661716, 650207, 592723, 554368, 581792, 569302, 582617, 619330, 592919, 559594, 557302, 556966, 593322, 602242, 584958, 583181, 619652, 670781, 759648, 823399, 864747]
11658H64747m6628q8340p2080p5901m0685k9891j0066k9391l3161m8648k5352
11647C64604k7468N484k753k1592p5616k8477J0948J05089J04314K2589K3120
11636D80242k0644k1083m6798L71O321J226J0855m687k0598j717j3539k6052q816
11623C35081j2209j2718j2563q905k9981m808K706M6044K3248J303J4671K5065
11611C66934R769k2246m6098m8061L739L67q202J0394L84k424r916Q001J7341
11598B79982l946J8522J6109j1854l8144j3506o303j3400n028j0477n4542l1884
11586A25529J0231p944L096K4440N6869O6475O846K3027L760m6253n1199l2453
11574A82424l1616j0846M829J1276R416L2354J0201k4765k1994Q11J3643j7603
$$ y = [864747, 818119, 729779, 657699, 581798, 541113, 511222, 501156, 471765, 438604, 389956, 364604, 337136, 342620, 339867, 318275, 242659, 214182, 225130, 330219, 434533, 457122, 480242, 459598, 438515, 391717, 392088, 398409, 399635, 410490, 405803, 385205, 383488, 369949, 343897, 335081, 322872, 310154, 297591, 288686, 258705, 253897, 256603, 302647, 325895, 327198, 341869, 366934, 376703, 354457, 308359, 260298, 264037, 264404, 256202, 266596, 266980, 264556, 254640, 262641, 279982, 276036, 294558, 310667, 298813, 260669, 247163, 240860, 227460, 222432, 211955, 157413, 125529, 135760, 127816, 130912, 155352, 212221, 278696, 285542, 308569, 312329, 266076, 214877, 182424, 150808, 139962, 144791, 156067, 165483, 197837, 208038, 183273, 161279, 162090, 175733, 158130]
11562A58130N27M1555K1716k2945p97K6695r567k8399k6320J1340l871j6748K083
11549A53399O469L93l16Q752K4642L5010Q0718P7737J53675K08538J67671J3108
11537I29796j61741j70168j31814p5664m4986j9000j2828J1500k6424j1158K4866
11526C12379o062k5418k9151k6839q679j3801r01J5334l1171J6236L1755M4461
11514B78143J5995L5724J525m9980l4534l6103k0474M233J3691J5418n1536m8532
11502A23570m493n77k745L4673K7446Q112j2059l1761O789J5104j6396j5240j4930
11489A17493N623J1935M4815K6589M950l5076m4757n247o968q547N762P167J3588
11476A37327m058j8366l729M953N396q63L0835K8443J005J702k8487p2421j8586
$$ y = [158130, 158657, 200212, 221928, 198983, 198186, 224881, 215314, 186915, 160595, 171935, 168064, 151316, 153399, 159868, 160261, 159945, 168697, 193339, 228349, 309067, 386804, 540479, 749017, 916688, 929796, 768055, 597887, 466073, 390409, 345423, 326423, 313595, 325095, 298671, 287513, 312379, 306317, 280899, 251748, 224909, 216230, 202429, 201528, 216862, 185691, 201927, 233682, 278143, 294138, 329862, 331387, 281407, 246873, 210770, 190296, 194529, 208220, 223638, 172102, 123570, 119077, 118500, 115755, 150428, 177874, 185986, 173927, 142166, 148955, 164059, 147663, 132423, 117493, 123116, 135051, 179866, 206455, 211405, 176329, 131572, 126325, 119357, 110810, 116572, 123739, 137327, 133269, 114903, 111174, 116127, 121523, 120660, 151495, 179938, 180943, 182645, 154158, 81737, 63151]
11463F3151j4863k3719l9994J8848L3403Q970J2625O685K5687q394m88L2713M9604
11450A64228l368j3247k0979k7071J494L6911r755m2900j3543L669J787j5153
11438F2073J2240J5880K2662k7417J665K511k824J0925l5321k7197p974R774o937
11425C0060L877R656j729K850K9024J0240o189m792R126M061j2954j0711J0967
11412G3486L5120j0278k3259l835Q30l5110k3250L73J2068m571K9520M625J0123
11399F5842J2378k9785o682q638j5962J8178j982O98p507j180k0518j991J8962
11386B1813L0214O62L482K2451M2708j0165k7941l201M28j9040k9876j5816j5980
11373b61R153P1o857J9622K8684j0382j8374k6819K854K7093J1448J8876o037
$$ y = [63151, 48288, 24569, -15425, 3423, 36826, 45796, 58421, 65106, 90793, 82399, 81911, 114624, 164228, 160860, 147613, 126634, 99563, 101057, 137968, 128213, 85313, 71770, 75439, 77226, 62073, 74313, 90193, 112855, 85438, 87103, 89614, 86790, 97715, 62394, 35197, 27223, 36997, 30060, 33937, 43593, 41864, 44714, 73738, 83978, 77789, 72997, 82123, 86184, 73230, 62519, 73486, 108606, 98328, 75069, 71234, 72064, 36954, 13704, 14077, 26145, 21574, 51094, 55719, 65842, 78220, 48435, 41753, 33115, 17153, 35331, 33349, 34047, 26540, 25360, 4842, 2851, 21813, 52027, 52689, 56171, 78622, 121330, 111165, 83224, 80023, 80451, 61411, 31535, 15719, -261, 8892, 8963, 2106, 21728, 50412, 40030, 21656, -5163, -2309, 24784, 36232, 55108, 49071]
11360D9071p750Q59K8349J1297n163q676N178O526J0464m024o587Q619N917m751
11346H9329M998j5646k1626k4172q413L3150O3214K0431J5791L5123L2718L1013
11334B55910L0760N0647J30411K15763L52622M66088M40086J98351j38884l87313
11324A614441m12311l47908k18167j48546o2426l2969l3243j0903r136j2136k6216
11313C00480m5199m3966l6127k6278k3655k9064l7773r017R951N164J6996K6432
11301A07944j0135J040L928P048j2278k084P406l102n661M160k195k155J1796
11288A05712l7314j2561j8125m662j0932o181R480l109R969K2021p317j9779j6761
11275A0441j5193l353M2829N2003p156j4293P365L120P133N234r259N469j8317
$$ y = [49071, 41321, 42180, 70529, 81826, 76663, 67987, 73165, 79691, 90155, 86131, 79544, 88163, 94080, 89329, 94327, 78681, 57055, 32883, 24470, 57620, 120834, 141265, 157056, 192179, 224897, 255910, 286670, 337317, 467728, 683491, 1036113, 1502201, 1942287, 2140638, 2001754, 1614441, 1202130, 854222, 636055, 487509, 425083, 392114, 358871, 347968, 338832, 326696, 300480, 255281, 211315, 175188, 148910, 125255, 96191, 58418, 49401, 59352, 64516, 81512, 107944, 97809, 98849, 102777, 109825, 97547, 95463, 102869, 99767, 94106, 98266, 96071, 93916, 105712, 68398, 55837, 37712, 33050, 22118, 15937, 25417, 22308, 32277, 54298, 46981, 27202, 10441, -4752, -8105, 34724, 86727, 79571, 65278, 72643, 75763, 82896, 88130, 78871, 84340, 66023]
11262F6023r183m154j4616M251J6116J963j0505P54L862J1454N256K520l926p593
11248F2222K4834M551r075l0961J6263j2655P83L3797M209k1409m712m805K0978
11235H4020j7870p191Q051m944k4270K388m410j3254j0248J4013J2209K0483L882
11222F2859J8246j3499j5523j0583l3123L1292K7695J9304o766k0592L924K1626
11210H4860j4331q872L354P135k0627m6205J6660M7239M1212j5194l0262n0572
11198A4397l052p045j3334J5481J7262L6010j644n48M892l346R502j1966j094
11185E5515p098m383P075Q988J3114M460r205o956j5877k515L931j1428J5627
11172E1248n836l1120n521J8762r785J7043K7152k1175l8742O101k668j9729J154
$$ y = [66023, 56840, 52686, 38070, 42321, 58437, 60400, 49895, 50649, 54511, 65965, 71221, 73741, 69815, 62222, 87056, 91607, 82532, 51571, 67834, 55179, 55962, 89759, 93968, 72559, 67847, 63042, 84020, 66150, 58959, 67010, 62066, 37796, 40184, 35774, 22520, 12272, 26285, 38494, 58977, 62859, 81105, 67606, 52083, 41500, 8377, 39669, 67364, 86668, 79902, 59310, 63234, 84860, 70529, 61657, 65011, 72146, 51519, 5314, 21974, 69213, 110425, 95231, 64969, 14397, 11345, 4300, -9034, 6447, 23709, 59719, 58075, 57527, 62419, 59073, 68575, 56609, 55515, 48417, 44034, 51109, 60097, 73211, 77671, 68466, 61510, 45633, 43118, 47049, 35621, 51248, 45412, 14292, 8771, 27533, 17748, 34791, 61943, 40768, 2026, 8127, 5459, -14270, -13116]
11159a3116K3032M1351P013Q27k3612j1426r487l6539j1162R998K9289L5784L5444
11146G7396l4018l5783j7009L2817q623j3205k5258o298J5965K2361K1175L508
11134C3028K4584J3087j2001j5222k6156J5498J830k2577r501j9305J5397j3619
11122a4957n782Q686R806K8978K0698o106J4769K3009N851Q644L870M214j1170
11109I0510j4770l0358k062M844K611j3847l0524L5K0162K1920K0632j0329p742
11096E1082M475J0418j6809j4625L0990K3267k3600j0430q534J103J7487J386
11084F6210l759j7922P791J147O115k0172j3647J436j838J5144O373L041k3049
11071B6870j198j9209j6623j539J5174K159J3243k0186k6803k270N6632L2483
$$ y = [-13116, 9916, 51267, 58280, 59107, 35495, 24069, 14582, -21957, -33119, -23121, 6168, 41952, 77396, 43378, 7595, -9414, 23403, 14780, 1575, -23683, -29981, -14016, 8345, 29520, 33028, 57612, 70699, 58698, 43476, 17320, 32818, 34648, 12071, 2570, -16735, -1338, -14957, -20739, -12053, -2247, 26731, 47429, 41323, 56092, 79101, 84952, 93596, 97466, 101680, 90510, 75740, 45382, 43320, 48164, 50775, 36928, 6404, 6439, 26601, 48521, 69153, 58824, 51082, 55557, 65975, 49166, 34541, 65531, 88798, 65198, 54768, 46234, 47337, 64824, 66210, 62451, 44529, 52320, 53467, 59582, 39410, 25763, 27199, 25361, 40505, 46878, 49919, 26870, 25672, 6463, -10160, -11699, 3475, 5634, 18877, -1309, -28112, -30382, 26250, 58733]
11059E8733k029l3851k2937J4854Q127j2435l2945J3729l578l3130J5964J7293
11047a2205k3655n719K6007J1690J195K4287J6469J4547L876J0823o607l1128
11035B9580k8209k7164J2168J0805J4707j9379n950N535J8788p986j4359o681
11023a8145j312J2179K3970L4989J0783m6663j6248J8460R86k768J0895J647m885
11010B3888J7896K967j4956l029J0495o695k1856m2987j2091K729L575N3639K7859
10997D1434K5602j1882J3160J2773l0631k0063J0999l790m0352o867N681l9866
10985d3802l872M3914J5821R106L433J2029J542J7147L035o514j4222M126l620
10972C8123l1368K4306m577l6141q939K910o729J3541L4505J3761K453K5001k1233
$$ y = [58733, 56704, 22853, -84, 14770, 22897, 10462, -22483, -8754, -12332, -45462, -29498, -12205, -35860, -41579, -15572, -3882, -2687, 21600, 38069, 52616, 56492, 67315, 60708, 29580, 1371, -25793, -13625, -2820, 11887, -7492, -13442, -7907, 10881, 2895, -11464, -18145, -19457, -7278, 16692, 51681, 62464, 15801, -447, 18013, 18999, 16231, 27126, 28773, 23888, 41784, 44751, 29795, 26766, 37261, 30566, 8710, -34277, -46368, -43639, -40064, 13575, 41434, 67036, 55154, 68314, 81087, 50456, 30393, 41392, 37602, -2750, -9617, -3936, -43802, -47674, -3760, 12061, 21167, 24600, 36629, 38171, 55318, 58353, 51839, 37617, 41743, 38123, 6755, 31061, 26484, -9657, -18596, -15686, -22415, -8874, 25631, 39392, 41845, 66846, 45613]
10959D5613j9192j0604j1624L633j383L5304K9545j4386m4577J68q798J08m808
10946a001l874j5498q844K1754Q587K944k3078j5364J939J2595Q097O827K1759
10933A6843K0273k8821k7221L18K3953J1699k0905M359J5491r927J0091m901k3040
10920a1788J8688L0309Q678M196L013n932q565k6054K3190j0770m476k6453n61
10907f525q362n727J9115K8835j6145n4q840j5333L575L2069L9559N483l9125
10894B8525k0530J8878L2286j350l4771j3594k204J2573n363k3920K0415K418
10882A3363j1334J8110K1538m491r708P34P277Q15n662j7533p626R754M369K053
10868B1659J2139j0976k8641O735K6187j4977j0932J1758m900Q810j162J0688
$$ y = [45613, 26421, 15817, 4193, 7826, 6443, 41747, 71292, 56906, 12329, 12497, 3699, 3807, -1001, -4875, -20373, -29217, -7463, 1124, 4068, -19010, -34374, -32435, -19840, -11743, -4916, 16843, 37116, 8295, -18926, -18608, 5345, 17044, -3861, 498, 15989, 6062, 16153, 11252, -11788, 6900, 37209, 45887, 50083, 53096, 47164, 38599, 12545, 35735, 24965, 20489, -5964, -6525, -14887, -20614, -1499, 27336, 11191, 11137, 2297, -13036, -9461, 22608, 62167, 67650, 28525, 7995, 26873, 59159, 57809, 23038, 9444, 7240, 19813, 14450, -9470, 10945, 13363, 2029, 20139, 41677, 37186, 27478, 28212, 35489, 36304, 30642, 13109, 5483, 15237, 19606, 21659, 33798, 22822, -5819, 916, 27103, 12126, 1194, 12952, 8052, 16862, 15700, 26388]
10856B6388J3931p981j8373j3784J614J2031Q074J6118J2791l113j6925l1615
10844h44j0367P802p994J8629J327J0258J5011k3920l4177K8128N56n389J740
10831G60r796j099J0137M15k0048M560O065P258K7743P776J455j1299l5572j4771
10817b6416j1151Q078N640j0786O62L4979L9869R474k2498r49J9386o254j5258
10804B4776j8922j8082J9927j7339j1809o177O348K313j7385j6310o121J8658
10792d0123M6197J4601n456j7757O328k658R908Q556K559p38J050j0007k4605
10779a2145l325J4269r437J1229K893k0318J2796K3278N382j2386J082j5307j3557
10766a5546R318j1181J2886K7499O209k6222K1825L7269j4222l0397j0289l4916
$$ y = [26388, 40319, 32338, 13965, 181, 1795, 13826, 21900, 38018, 50809, 47696, 30771, -844, -11211, -3409, -11403, 7226, 8553, 18811, 33822, 9902, -24275, 3853, 4409, -980, 760, -9036, -10135, 2, 417, -19631, -15071, -9006, -1748, 25995, 33771, 35226, 23927, -11645, -26416, -37567, -29489, -23849, -34635, -33973, 1006, 40875, 50349, 27851, 26902, 46288, 40034, 24776, 5854, -12228, 7699, -9640, -21449, -27626, -21278, -18965, -36350, -52660, -58781, -40123, 6074, 20675, 15219, -2538, 3790, 1132, 11040, 19596, 22155, 21417, 22467, 12460, -12145, -15470, -1201, -10638, 591, 3484, -16834, -4038, 19240, 24622, 12236, 13318, -1989, -15546, -6228, -17409, -4523, 22976, 29185, 2963, 24788, 62057, 47835, 17438, 7149, -27767]
10754b7767L7488L1084r453l2758j0934P650R897J5532Q64k7312j112P303q937
10741h455l199R964L6305P115J1837k9223l2227O788L4606o14K2425n802l0012
10728A9508j7934j8626K0720K2275n938j4018M353N856K6508K6138p7p261j2247
10715D9257l5165j9883q789J8240K2857K529r147j3257j2168K921N325q540j3241
10702a9061j755k306Q981J9156J607j7063K559N817j3709l14J1854K0545J1740
10689B8051j1370k1871j2244K9521J6934k9707k7315J5624J5100j6162L0214j506
10677A5269k2039o745K5663k975J0816m378j436K995r0k755j7252M954J2985q944
10663F068r4k1247r654K0639j988j777J7331N311j3445J4056K6476k1324j7016
$$ y = [-27767, 9721, 40805, 31352, -1406, -12340, -4690, 5207, 20739, 21603, -5709, -6821, 482, -8455, -11654, -1690, 34615, 41730, 53567, 24344, -7883, -1095, 33511, 32897, 55322, 49520, 19508, 1574, -17052, 3668, 25943, 20005, 5987, 10340, 16196, 42704, 68842, 68765, 61504, 49257, 14092, -5791, -14580, 3660, 26517, 29046, 19899, 6642, -5526, -2605, 2720, -5820, -19061, -20816, -23122, -14141, 5015, 6622, -10441, -7882, -2065, -15774, -16088, -4234, 16311, 28051, 16681, -5190, -17434, 12087, 29021, -686, -28001, -12377, 2723, -13439, 16775, 15269, -6770, -13515, 12148, 9173, 19989, 15611, 14175, 17170, 17080, 14325, -2927, 2027, 15012, 6068, 5974, -15273, -24927, -4288, -6276, -8053, 9278, 14589, 1144, 15200, 41676, 20352, 3336]
10650C336o43j7337O618L443Q35K9314L995k6324K9789j1762l6936J3061j1206
10637a3817K182J6232m665J4316p681J5147J6663J3527K5754j3506n9795r625
10625e268J912m329J1004l838j6886n024K8505p303N811n894J3730K5710j1802
10612B6328j1186k4465Q117j599R208O243j2366p250j926n697k2535K253j0472
10599d5347k137J2360L655L4274J8917J0028M48l582m644J2826J5281j374p805
10586D2900j0304l357o259j826r489k405K5237K0952O183j1547j5097j7776K619
10573A9831J01k3995j7835K63M445J581m18K7901J3279P995J0501l5691j1854
10560c896j6048n476K2939o697j4173L116K3342L1476j3559J4893L0600q929J2825
$$ y = [3336, 2693, -14644, -8026, -4583, -3748, 25566, 29561, 3237, 33026, 21264, -15672, -2611, -13817, -11635, 4597, -68, 14248, 6567, 21714, 38377, 51904, 77658, 64152, 4357, -5268, -3356, -7685, 3319, -519, -17405, -22429, 6076, -1227, 4584, -1310, 12420, 38130, 26328, 15142, -9323, -1206, -2805, 6403, 12646, 280, -6970, -8896, -14593, -37128, -34875, -45347, -47484, -35124, -31469, 2805, 21722, 31750, 32198, 28616, 23972, 36798, 52079, 50705, 42900, 32596, 29239, 22980, 21154, 11665, 9260, 34497, 55449, 61632, 50085, 34988, 17212, 19831, 19932, -4063, -21898, -21635, -17190, -15609, -16027, 11874, 25153, 33148, 43649, 7958, -3896, -19944, -25420, -2481, -9178, -23351, -20235, 3107, 34583, 21024, 35917, 66517, 57588, 70413]
10547G0413J6197j8558k2311J908N888j8895k2748J8683j5887n969m3578j5797
10535e0654O234L1174L4851J7307o977L176q195l250K7543j4495j9219l424j1773
10522B298j9375R136L8859J5734o541n134O593k739R714P458n589j7463k0950
10509A2001n589J6723L6780M441j5005j8072o439o915M2514K652l6036l5159p286
10496a5390j114k0125o067J6345J4018J0387O009L3753J4362P051n819l1580j914
10483A9916K719J9403Q833N163j6443j243K1822o02l4383k7402J1444J6340n160
10470B0407j9522j8995k1210J7222L9679J855l1407j8110O559O331q839k8581
10458e4611L189J4354L6986Q409J5731l413p325j4473J2672P206K229N706l883
$$ y = [70413, 86610, 68052, 45741, 47649, 53537, 34642, 11894, 30577, 14690, 8721, -34857, -50654, -44420, -13246, 21605, 38912, 31935, 35111, 26916, 23666, 51209, 36714, 17495, 14071, 2298, -17077, -7941, 30918, 46652, 40111, 34977, 41570, 38831, 48545, 56003, 50414, 32951, 12001, 6412, 23135, 59915, 64356, 49351, 31279, 24840, 17925, 60439, 63091, 27055, -8104, -15390, -16504, -36629, -42696, -26351, -12333, -1946, 4063, 37816, 52178, 59229, 53410, 21830, 19916, 22635, 42038, 50871, 56034, 39591, 38348, 60170, 59568, 25185, -2217, 9227, 25567, 20407, 885, -18110, -39320, -22098, 17581, 19436, -11971, -30081, -23522, -17191, -26030, -54611, -51422, -37068, -82, 8327, 24058, 20645, 13320, -1153, 11519, 18725, 20954, 26660, 22777]
10445B2777R317Q974m6039p368K6100J7483n224k3686k404K767k764L0715J1429
10432D2077j1452M758J637O534P586k0356J9004R738j3724J408l2708r384j936
10419C182M792K5581m296l3666l238J3747q433J355L645k0125j95L2215K2658
10406C7222Q43k0669k6302j4232o407J5051J8237J7191p606J2520q293j8358l4510
10393c5313L023L1037J8446j3572j3277K6292K7771J5079K804k6429k9709K575
10381H727j7169l371k0442J8682J6276J64O832r296K581K9220L7327j9795k6792
10368B2944j4212m390k6161k2501k7398r254L3239J9454P496j8134J3665J6423
10356h829N2064P273n5132l5050J91K9772j0754m667J0619L106q003k872L565
$$ y = [22777, 32094, 41068, -4971, -12339, 13761, 31244, 26020, 2334, -70, 2697, -67, 30648, 42077, 30625, 35383, 37020, 43554, 51140, 30784, 49788, 59526, 45802, 47210, 14502, 5118, 3182, 7974, 33555, 29259, -4407, -7645, 6102, -2331, -976, 2669, -17456, -17651, 14564, 37222, 38065, 17396, -8906, -23138, -29545, -14494, 3743, 20934, 13328, 25848, 17555, -803, -35313, -32290, -1253, 17193, 3621, -9656, 16636, 44407, 59486, 62290, 35861, 6152, 8727, -8442, -11813, -32255, -13573, 2703, 2867, 9699, 403, 2984, 32204, 69531, 49736, 22944, 8732, 4342, -21819, -44320, -71718, -80972, -47733, -28279, -20783, -38917, -25252, -8829, 43235, 50508, -4624, -39674, -39483, -9711, -20465, -25132, -14513, -11407, -19410, -22282, -18717]
10343a8717K3826J1885Q586J9k2117j5396n40o688O293l573L4018p844m1626k5377
10329e7251p074J9227J8304L085N575j576K2787O805O072J1740p744J1497K10
10316C1657l0732k8644J0950Q77M723J3311O859l923q533J1514N184j4137m227
10303e121L2689M060k8187l2021N439L4334j7440P000J4217o356K543J0504R010
10290C0671j6920p279M517N979o308J4119k7858P194J798j7743j9948K0270J4585
10277C077J5994O1829j1648l8818q767j56J1255K4438k1286l0528k1659l0445
10265d6714J4370p943k941J9387J8776J5262O670j4429K4912l626k6883m676k2013
10252b9848o181j3197K9401K2283L3583j0266k2592P145J1527r639j4926o162
$$ y = [-18717, 5109, 16994, 25580, 25599, 3482, -11914, -12454, -19142, -12849, -16422, 17596, 9752, -31874, -57251, -64325, -45098, -26794, -23709, -18134, -19710, 3077, 9882, 15954, 27694, 19950, 31447, 31657, 925, -27719, -16769, -15892, -11169, 2142, 9001, 5078, -3455, 8059, 13243, -894, -5121, 27568, 31628, 3441, -28580, -23141, 11193, -6247, 753, 14970, 8614, 11157, 21661, 30671, 13751, 6472, 10989, 16968, 10660, 24779, -3079, 4115, 5913, -11830, -31778, -11508, 3077, 19071, 80900, 69252, 30434, 21667, 21511, 32766, 57204, 35918, 5390, -16269, -46714, -32344, -40287, -43228, -23841, -5065, 10197, 16867, 2438, 27350, 23724, -3159, -7835, -29848, -36029, -49226, -19825, 2458, 36041, 25775, 3183, 10328, 21855, 12216, -2710, -8872]
10240h872K3579J3788k6015K3510J2616k8915m3016p807J5696L184m716q193O535
10227b8626J8767o201J8128J8252j4179k4118O855K9569J309P062O105J4196r821
10214C7298j6378J608L4909L2785K6875K612p574o201l0196l4674n163j266j5588
10201A9047k1925m528M645L0669L9872L1240j3646k7427k6858j1499o727K094
10189A4957N4j06K6957J6852l4231k0386j728k2635J3633k43k1605P674L56j2178
10175c2629J7875O878Q278Q883j7517l2092n806l433J0988L0661o067j2092J944
10162b4129j929J9499L6900N120j4343j0522l4912k4209l296L7323M8705R230
10150D3437l0668m8750k3855m705K8180K5587p210L710J5376k4544J6157J3588
$$ y = [-8872, 14707, 28495, 2480, 25990, 38606, 9691, -33325, -41132, -25436, -22252, -26968, -35161, -28626, -9859, -16060, 2068, 20320, 6141, -17977, -11122, 18447, 19756, 26818, 32923, 47119, 37298, 20920, 22528, 57437, 90222, 117097, 119709, 112135, 105934, 75738, 41064, 35901, 34635, 19047, -2878, -7406, -2761, 27908, 67780, 99020, 85374, 57947, 31089, 19590, 12863, 14957, 15011, 14905, 41862, 58714, 24483, 4097, 2369, -20266, -6633, -6876, -28481, -20807, -20451, -32629, -14754, -7876, 402, 9285, -8232, -40324, -46130, -49563, -38575, -7914, -13981, -26073, -24129, -26058, -6559, 30341, 35461, 21118, 10596, -24316, -48525, -51821, -14498, 34207, 43437, 12769, -35981, -59836, -64541, -36361, -10774, -17984, -14274, 1102, -23442, -7285, 6303]
10138F303r368K09n127j6345j530K4307J7018J5142J571J795m7293k3248J8912
10125a7654J0276o118j0665k4959L435J9575j697J6150q598j9288k0742K5219
10113c5066L8595K370j9218k6994j112Q040p367O408J6880j294q423K5206L2868
10100C0893K654r84j1415j8926q45j3790j7749P854J664j4485N185k124K4136
10087g932K2517K7015M166j1853l1405l0234k073M245l326J3259Q602n903K7121
10074A4199L0904L0899l5567j1791L0499p453k4251o385J9249o160p714k3017
10062C412j8717P321K1722J0909j9343L623Q281K3059J3702k2107N248p105k0267
10049I738J1782k4263J9023P981m631l3185q232j0136P836L2468J8579j5341l114
$$ y = [6303, -3065, -2856, -7983, -24328, -25858, -1551, 15467, 30609, 32180, 33975, -13318, -36566, -17654, -7378, -13496, -24161, -49120, -45685, -26110, -27807, -11657, -20255, -39543, -60285, -35066, 3529, 5899, -13319, -40313, -41425, -33385, -40752, -34344, -17464, -18758, -27181, -1975, 30893, 33547, 32563, 21148, 2222, 1377, -12413, -30162, -22308, -20644, -35129, -29944, -32068, -7932, 14585, 41600, 45766, 33913, 2508, -27726, -29799, -25554, -28880, -15621, -7019, -12922, 14199, 45103, 76002, 40435, 28644, 59143, 51690, 27439, 21054, 40303, 34143, 26429, 3412, -15305, -7984, 13738, 24647, 5304, 8927, 17208, 40267, 53969, 31862, 37110, 30005, 9738, 21520, -2743, 16280, 24261, 19630, -13555, -21787, -31923, -24087, 8381, 26960, 11619, 8505]
10036H505l0424n530J5983O788J9368K297j0395K1551R32l5538L26L296q230j4205
10022b5276J139K904k1745J6472Q016O463J6007J2289o240N350P478k0240p695
10009e078j1539K1677K6455J6047k657j115j9299R695K5959r299k3981m0631K8461
9996A4695K162j9717M949j3832j7832Q285l362l790L3919R150k4277k1772J9463
9983a1959J4875J590j9263j3895J7807J8872j519j7365K7064K0250j6773j0015
9971I669J1988j0773p556j3316j2072K6286K8792M337j3815j7266J0120J4375
9959C0769o55J2521J1685o689J1043j5192m8891m944J3927J6909K3060q997k8921
9946E625l3447L635J5673K0630k8421K5437j5570k8748J8511P801j8015J5069
$$ y = [8505, -21919, -27449, -11466, -4678, 14690, 16987, 6592, 28143, 29075, -6463, -6137, -2841, -11071, -25276, -24137, -21233, -42978, -26506, -18490, -12027, 3980, 16269, 10029, 15379, 22857, 2617, -5078, -16617, 5060, 31515, 47562, 44905, 43790, 24491, 34186, 60145, 50846, 26865, -13766, 14695, 16857, -2860, 2089, -11743, -29575, -21290, -24652, -28442, 5477, 14627, -9650, -31422, -11959, 2916, 4506, -14757, -28652, -10845, 8027, 6508, -10857, 16207, 36457, 19684, 9669, 21657, 10884, 3328, -9988, -22060, 4226, 33018, 37355, 23540, 6274, 16394, 30769, 30114, 42635, 54320, 47631, 58674, 43482, -5409, -10353, 3574, 20483, 43543, 34546, 5625, -27822, -24187, -8514, 12116, -16305, 9132, -6438, -35186, -16675, -8874, -26889, -11820]
9934a1820K6545k9864m5990J5347J0678L0580J0763K602J6958K1374K3568J2799
9922H3540m667M041L079j3868r626j3156M402k4725j8745j9526J2878k8712k233
9909b7318l904J8161K0988J693R28J1712j2687k4932J1043L3346J0676J762k2626
9896A8842n575J730k1212k4593J9524M7199o838J6508J7360K218J8596q005j4131
9883F1623j5924L452n751j5620k4156K573m816J0470p987K1745J0492j1809O861
9870C1153r815N746K6225N290m5k0162j5816L1639L0194j5429J4023M272J5663
9857A02938O4796J39428J81228J36676m869j27718j51416j01506p0729r479r016
9846A50333j9756k1730j817N291m1690j9107o233j2973j8688J736k0151k302p23
$$ y = [-11820, 14725, -15139, -61129, -45782, -35104, -4524, 6239, 8841, 25799, 47173, 70741, 83540, 78873, 82914, 85993, 72125, 62499, 49343, 53745, 29020, 10275, -9251, 3627, -25085, -27318, -31222, -13061, 7927, 9620, 10548, 22260, 9573, -15359, -4316, 29030, 39706, 41468, 18842, 13267, 14997, -6215, -30808, -11284, 35915, 29077, 45585, 62945, 65163, 83759, 75754, 61623, 45699, 49151, 43400, 27780, 3624, 6197, 1381, 11851, 3864, 25609, 36101, 24292, 31153, 21338, 27084, 53309, 58599, 58554, 38392, 22576, 54215, 84409, 68980, 83003, 87275, 102938, 167734, 307162, 488390, 625066, 620197, 492479, 341063, 239557, 168828, 159349, 150333, 130577, 108847, 107030, 112321, 70631, 51524, 45291, 32318, 13630, 15366, -4785, -7087, -7810]
9833g810K9639K04R052L541j2845j6671K6551K2869j6232r510k683k4398l7145
9820c5438n308K3816L3747j9112l6025K259L4671L4108J0395R459J0615j5055
9808D8132j7454n711J1780R737M297l1002p064J3572j740k4106R110K860K054
9795A4465J1917J4375J1115j0262k5561j308n27q122J9305J3151k4372j2501l4696
9782c3021J851K6492q366L756j0269J19Q195J5320N4326o977l3959k8916r20J6064
9768C695J3520P383J7790l6093j7782J3762L2675J6502j8593j1496l9749k4433
9756d2819K6867p187J1878Q340J8077J3281k0461k1875k0256j0311J2784K8992
9744b690L757k7806k9833J1298J9544J8668M363j1115j9498q794n754J5041K8193
$$ y = [-7810, 21829, 22033, 31085, 34626, 21781, 5110, 31661, 54530, 38298, 28788, 26105, 1707, -35438, -40746, -16930, 16817, -2295, -38320, -36061, -1390, 32718, 43113, 52572, 63187, 48132, 30678, 24967, 36747, 46484, 50781, 19779, 12715, 26287, 24547, 441, 9551, 12411, 14465, 26382, 40757, 51872, 41610, 16049, 14741, 14214, 6092, 25397, 38548, 14176, 1675, -33021, -31170, -4678, -13044, -9288, -19557, -19438, -11243, 4077, 58403, 51426, 17467, -11449, -12369, 3695, 17215, 24598, 42388, 6295, -11487, 2275, 34950, 51452, 32859, 21363, -18386, -42819, -15952, -23139, -11261, -2921, 15156, 28437, 7976, -13899, -34155, -44466, -31682, -2690, 1067, -26739, -56572, -45274, -25730, -7062, -2699, -13814, -33312, -42106, -47860, -32819, -4626]
9731d626P701J3947k6121o422l840O001R806n783q103j5970J8076L3780N295j1971
9717A1770M972K0623Q239N284L984k5547j2681k7136j4109o881K5012k4594j0687
9704d1751R059J2045J5254J8945j4510k918P455n900J2569J773k833j1727m553
9691g092p593p260J7740j4709J4230N689Q220N170j8510j1849j1384J7033J6709
9678F394j979q180J9307N1514P404k1065j2758k1506j3933k8323j9248J3053J0901
9665a8419k4785k8463J8736K2993q587O537L9280L241o201k2546j7779L317K4768
9652g908k2708j7059J6700j3474j5985R353K2552p013k3248l653J0644L9485R972
9639b342P516L885K6518k0136l911m574l572J8295k744j4261k8961k9534P782
$$ y = [-4626, 3075, 17022, -9099, -15521, -19361, -13360, -3554, -9337, -17440, -33410, -15334, 18446, 23741, 11770, 16742, 37365, 45604, 50888, 54872, 29325, 16644, -10492, -24601, -31482, -6470, -31064, -41751, -32692, -20647, -5393, 13552, -958, -3876, 3579, -2321, 10248, 12021, 9188, -2539, -7092, -14685, -21945, -4205, -18914, -4684, 1005, 9225, 14395, -4115, -15964, -27348, -10315, 6394, 4415, -3765, 15542, 67056, 74460, 53395, 40637, 19131, 5198, -23125, -42373, -29320, -18419, -43204, -71667, -52931, -29938, -38525, -31988, 7292, 10533, 4332, -18214, -35993, -32676, -7908, -30616, -47675, -30975, -44449, -60434, -51081, -28529, -35542, -58790, -62443, -51799, -12314, -2342, 5174, 9059, 35577, 15441, 11530, 6956, 3384, 21679, 18935, 4674, -24287, -53821, -46039]
9626d6039J0838J6363N0802o338k144K718l16k303M976K8761o318l2310l1133
9613a2443o387M4379j935k8768o734J4831M1093K5244l1313m847j0826j695n471
9600A5128j531Q471n250j6832L69J0100l540N189k0652Q922J125J6701p682j8592
9586h074j2787J1681J9464k1377j2155M307J1175K733j2413l4167j7963L14O339
9573f2923K8169K9291j5593J8527J5502j5785k6195k4791n597L6538J9272j1110
9561a4695k2171k3446P478J2493J7287L3134j907m0530O086K6075M4903r07k5521
9548A8279j4501j860n470j4930L101j3296L1271k102J6530k1335J3049L2695j0002
9535C1429j6332j3776o79K623o453N305K0391k7588j943K1309l87j6673j6472
$$ y = [-46039, -35201, -18838, 31964, 25626, 23482, 26200, 25884, 23581, 28557, 57318, 51000, 18690, -12443, -18830, 25549, 23614, -5154, -11888, 2943, 44036, 69280, 37967, 33120, 22294, 20599, 15128, 13597, 22068, 16818, -14, 355, 10455, 6915, 12104, -8548, 374, 1499, 18200, 10518, -8074, -20861, -9180, 10284, -11093, -23248, -18941, -7766, -5033, -17446, -51613, -69576, -69262, -62923, -34754, -5463, -21056, -2529, 12973, -2812, -29007, -53798, -59395, -22857, -3585, -14695, -36866, -60312, -52834, -40341, -23054, 10080, 8173, -32357, -26271, -196, 44707, 43800, 18279, 3778, 1918, -3552, -18482, -15381, -28677, 2594, 492, 17022, -4313, 8736, 41431, 31429, 15097, 1321, 642, 3265, -3188, 2117, 22508, -5080, -7023, 14286, 13899, -2774, -19246]
9522a9246L233J4100j588k1125J1210O328k674k1663l408o822M1471M9749J0537
9509F0102k0010k231P361J324j0927j7369j7293j5375J5102j0810Q527R926j3907
9496e580k1843O808k598K9435J5686r283J1991r759L733o770J3783K335K8897
9483E6835J4180o2621k6646j1705q3J1970p113n973K838P292j7748M383L0268
9470d123K1485L648M00l5350j5574J4907J111j4735K4922J2609K549j0182O886
9457H553j2433J6059J8087j780l799k8784r279O328J5018K385r571Q357k7015
9444a7874k3135K4036N0909K9916p6k1825k7172Q27l585K61L516K7626m517J7929
9430E6836r80k2709L052n677k4664q034l336N941j5010k7567j3618R799k372j4753
$$ y = [-19246, -16013, -1913, -3501, -24626, -13416, -7088, -9762, -31425, -34833, -41655, -184, 49565, 60102, 40092, 37861, 45222, 46546, 35619, 18250, 957, -14418, 684, -10126, -1599, 8327, -5580, -27423, -20615, -23213, 6222, 21908, 12625, 24616, 14857, 18590, 11820, 25603, 27938, 56835, 71015, 8394, -18252, -29957, -30040, -18070, -25183, -31156, -28318, -21026, -38774, -34391, -4123, 17362, 21010, 21410, -13940, -29514, -14607, -13496, -28231, -3309, 9300, 11849, 1667, 8553, -3880, 12179, 30266, 28486, 24687, -4097, -13376, -7048, 7970, 10355, 784, 9141, -17874, -41009, -16973, 33936, 63852, 63776, 41951, 14779, 15606, 12021, 12282, 15798, 43424, 38907, 56836, 55856, 33147, 36199, 30522, 5858, -2176, -5512, 429, -14581, -42148, -55766, -45967, -48339, -63092]
9416f3092K5032L2643J7916n778k1579L7188R291m2481k9891r530j996p693J8452
9403d1518K5215K7726R576k019L087J0987P565k1410p489j0161J7379J4943L569
9390C7450L95l951m850j6802J981K8745J9860j0203j6630j6168M092J0242l1362
9377B799Q180J683J1665j0831J2646J7213m912j0020p169n833m634k1186k0934
9364c1333O214J0973N664L3856k490o129r410J3405j3237j6430l3186j038L3463
9351i678J1865R227p189k118K2099j0253l1484J3611J4211p792M348L474k4402
9338a4081k6396P240J4689K3866J4273l619k8097j1986M2496J4021k0431K206
9326A4181K380j2601J3050k6542L099K3894q514j0019J3163J0455k42N271Q313
$$ y = [-63092, -38060, -5417, 12499, 6721, -14858, 22330, 31621, -10860, -40751, -50281, -52277, -59970, -41518, -16303, 11423, 20999, 18980, 22067, 33054, 40619, 19209, 11720, 1559, 18938, 33881, 37450, 37845, 33894, 29044, 12242, 14223, 42968, 62828, 52625, 35995, 19827, 23919, 34161, 2799, 10979, 12662, 24327, 13496, 26142, 43355, 38443, 28423, 21254, 15421, 10787, -10399, -31333, -25119, -14146, -8482, 25374, 22884, 16755, 7345, 20750, 7513, -8917, -42103, -43141, -9678, 2187, 11414, 4225, 2107, 24206, 13953, -17531, -3920, 10291, 2499, 6847, 10321, -14081, -40477, -33237, -18548, 5318, 19591, 15972, -12125, -24111, 18385, 32406, 11975, 14181, 16561, 3960, 17010, -9532, -6433, 17461, 8947, -1072, 12091, 22546, 22304, 27575, 35888]
9313C5888l1328J0124K9692l6350l1626k483K3098L5793M4904K1300j3566l435
9301H2011O127J6519J2999p62j5145n210K0076K2363j8397j2123k6435l420K3914
9288A02517O235K0489o32p09K226K4431L862K7184J3772O414k5489K209L3566
9275B16075J6089j304M5107L2798m565R719M4837O8607M5511N6901N7283O8898
9263F55956P1912J14733J26695J17789J97586K14419K37520L34445M24225N75445
9253C070725P88135J027001J387527J854053K390851K550762J913462L32634j355613
9244A3959537k219882k257416j926314j531005j145103q71514o55264n24363m62976
9235B365700l53412k57144j88718j71468j55498j34288j04229j11864j02698p7501
$$ y = [35888, 4560, 14684, 44376, 8026, -23600, -26083, -2985, 32808, 77712, 99012, 85446, 82011, 88138, 104657, 117656, 116894, 101749, 96539, 116615, 138978, 120581, 108458, 82023, 78603, 102517, 108752, 129241, 128609, 127900, 130126, 154557, 158419, 185603, 199375, 205789, 180300, 182509, 216075, 232164, 230860, 275967, 308765, 304200, 313919, 358756, 427363, 472874, 529775, 587058, 655956, 727868, 842601, 969296, 1087085, 1284671, 1499090, 1736610, 2071055, 2495280, 3070725, 3858860, 4885861, 6273388, 8127441, 10518292, 13069054, 14982516, 15315150, 13959537, 11739655, 9482239, 7555925, 6024920, 4879817, 4008303, 3353039, 2828676, 2365700, 2012288, 1755144, 1566426, 1394958, 1239460, 1105172, 1000943, 889079, 786381, 708880]
9225G08880o5966l8568l8646m5900o4683j3371J3820k8652n1594m7381j9891J4855
9213C22903j8177k493l1511k7334k0197L289j2488p282l890j4262M292j3653k5278
9200A53919k6357J1733J6596l4088l0644O690M2570J7986l615j8452l4227j3143
9188H8968L1501K4292j6042j3342k9339j0449J7784K9588J778k6514n018J2431
9176A05638j8453m636k3576j3474k1631J1787K3438o088J7106J799R180r00J0083
9163I0273j5871j7928J1857K4074k6246m578L6458N208m5486l3993l3833k499
9151a2564N085p997Q266L7088M6957J2768k1489o981r830j970p306j9095J7686
9138D0618n786j4347K9464K3722L625K473l1629k1377m026l343k6286p601l451
$$ y = [708880, 642914, 604346, 565700, 519800, 455117, 441746, 455566, 426914, 375320, 327939, 308048, 322903, 304726, 302233, 270722, 243388, 223191, 226480, 213992, 206710, 202820, 188558, 192850, 179197, 153919, 127562, 139295, 155891, 121803, 91159, 97849, 140419, 158405, 154790, 136338, 102111, 88968, 120469, 144761, 128719, 115377, 86038, 75589, 93373, 122961, 124739, 98225, 93207, 105638, 87185, 82549, 58973, 45499, 23868, 35655, 59093, 53005, 70111, 71910, 81090, 80190, 90273, 74402, 56474, 68331, 92405, 66159, 61581, 98039, 103247, 57761, 23768, -10065, -12564, -7479, -15476, -7210, 29878, 76835, 89603, 68114, 61133, 51303, 49333, 42027, 22932, 40618, 34832, 20485, 49949, 73671, 77296, 79769, 48140, 26763, 22737, 19394, -6892, -14493, -17944]
9125a7944n696O168J7246j0123q446J7780K270K1611J14J5842J6415k52K239j9624
9111C7600j5243o613p197K5525K1190j5618j6946K186L673O035l7168k1717K4956
9098F63L3372J7772J3535P844M714j9484k3581J861L4025k1685j0216J1873L437
9085E4130n67l5429l2380J0617Q825P869R847O52q792k100K1816n584J3980N212
9071D8096m65j9210J6315J920l2278j1653J7029j525p00K9247k7641n353l766
9058A0016K1567R082k3887M2P676J0935P182k0063j3729m411J7794K1319Q461
9045E1984j0703r352J8439q305k211k8600L682k1427l5841J0133L3442R39j0722
9032h542p881L2196M5765K3317m701j7814j7699N424K1636k1865l3948j3508q317
$$ y = [-17944, -23640, -17472, -226, -10349, -18795, -1015, 1255, 22866, 22980, 38822, 55237, 54985, 57224, 37600, 22357, 15744, 8547, 34072, 55262, 39644, 22698, 24884, 28557, 34592, -2576, -24293, 663, 34035, 51807, 65342, 73186, 77900, 58416, 34835, 36696, 70721, 49036, 38820, 50693, 54130, 53563, 18134, -14246, -3629, 5196, 13065, 22912, 23564, 14772, 12672, 34488, 28904, 42884, 48096, 47631, 28421, 44736, 46656, 14378, 2725, 19754, 18229, 17529, 46776, 19135, 13782, 10016, 31583, 40665, 16778, 16820, 24496, 35431, 42613, 22550, 8821, 4410, 22204, 43523, 51984, 41281, 31929, 50368, 42063, 39852, 11252, 14934, -6493, -42334, -32201, 1241, 2180, -8542, -16423, 15773, 61538, 84855, 80154, 62340, 44641, 50065, 71701, 49836, 15888, 2380, -5937]
9019e937l92m318J6401J4994J328K1407J4525r778k3672n952m313L258R145Q32
9005B7528j1077j6784J8293m712l377l3277L868m526k4041m070J7626K3149k4913
8992c6313K9138j038o023k7874j0993J6522J077k0663O902M4519L076k0042J8082
8979c630o464j2227L5159J3310K095j5248k7013K7920J2351o443o278n609q085
8966a62j742j177L5308K3523j1790Q452J4011j5524k1865m2739j4402J8103l224
8953a3228k1644r009J6276L2756O859j7086Q364M8855J0209j4116r931N654K5879
8940F9838m726r003j766n719o355K553m227k4848p096M4955k573j6770j3572J7101
8926C7792j031l228J5619j7354j4484P366K6275k7947l189L423J472l3795j3223
$$ y = [-5937, -6329, -10647, 5754, 20748, 22076, 43483, 58008, 48230, 24558, 18606, 14293, 17551, 26696, 27528, 16451, -333, 17960, 13248, 9871, -23406, -19538, -24064, -48105, -52175, -34549, -11400, -36313, -7175, -8213, -14236, -42110, -53103, -36581, -35504, -56167, -49265, -4746, -1670, -21712, -3630, -10094, -22321, 12838, 26148, 28243, 12995, -14018, 13902, 26253, 19810, 13532, 7923, -162, -1904, -3081, 32227, 55750, 43960, 52412, 66423, 50899, 29034, -13705, -28107, -10004, -13228, -34872, -43881, -27605, 5151, 12010, -5076, 3288, 52143, 62352, 48236, 38305, 43959, 69838, 65112, 56109, 54343, 48624, 42269, 44822, 40595, 15747, 8651, 53606, 51033, 34263, 20691, 37792, 36761, 33533, 49152, 31798, 17314, 24680, 50955, 23008, 19819, 23242, 24714, -9081, -22304]
8913b2304k671o28p352N467K2101l0186l6004k7945L7291K5982n068J7978K9763
8900F424P836k480l8139j6978R292O275K0007M840J3159k244N12j4451l197P970
8886a174N142J212m088q667k6195J2282J896K0601O228j4294k97J6948J5241k6641
8872a806j0469J7332J223j1437r616o560L156j564r270J0936K7455k979p410j2642
8858a3651m0155K5806M7112P597K3066j0396k6663p86j8509o234L4807K688l674
8845B1008k749K755J8844k4056j5144j6347J211L497L9293j3288N646r36l2524
8832a2790J4271L0702m095l008K3736J3767j5172m0752k3063P89j810j9410p994
8819d4829L0242K2498J4993K361M131m074J2029J6700j0572k8164o256J3169K1255
$$ y = [-22304, -24975, -25603, -32955, -27488, -5387, -35573, -71577, -99522, -62231, -36249, -41317, -23339, 6424, 14260, 11780, -26359, -43337, -34045, -27770, -7763, -2923, 10236, 7992, 8504, -5947, -9144, -1174, 3968, 5180, 1092, -7575, -33770, -21488, -19592, 1009, 7237, -7057, -7354, 9594, 24835, -1806, -12275, 5057, 6280, -5157, -14773, -21333, -18177, -19741, -29011, -18075, 9380, 6401, -1009, -13651, -53806, -28000, 19112, 26709, 49775, 39379, 12716, 11930, -6579, -12813, 21994, 24682, 21008, 18259, 21014, 39858, 15802, 658, -15689, -14478, -10981, 28312, 15024, 20670, 19734, -12790, 1481, 32183, 28088, 25080, 48816, 62583, 47411, 6659, -16404, -15615, -17425, -36835, -44829, -14587, 7911, 22904, 25265, 29396, 25322, 37351, 54051, 43479, 15315, 9059, 22228, 43483]
8806D3483R797J587J8803J3616j1507n7080k2165O597j950J7827m962j2378j5890
8793a4222l0613Q353N499K602J4644J7027P303n695j5207P198O589j2340k8761
8780c7623J3739K3364q945j5500j1573J8023O906K18j9169j1976o177k1639Q085
8767f2267J7912J0233M014L080j1098n479N9220K0746J8520j1822k4966q913j3733
8754d553j3837J6553K553k1976k178k202L7716J6670l8597k3453Q557p52k5551
8741e1050K6670J1201l0547n599K2113K4857k3157K3351L3992k8227L739l041
8729D302j6194k0194j8225J9525N6103l925j3594K3821m600J858r399Q813o043
8716B2248q802r803m677j5076J2506L0847K7402q233l6766k1774R259L4077R467
$$ y = [43483, 53280, 54867, 73670, 87286, 75779, 18699, -3466, 3131, 1181, 19008, 14046, 1668, -14222, -44835, -36482, -30983, -28381, -13737, 3290, 10593, 4898, -10309, -3111, 3478, -8862, -37623, -23884, -520, -9465, -24965, -36538, -18515, -11609, -11391, -30560, -42536, -48713, -70352, -62267, -44355, -34122, -30108, -27028, -38126, -43605, 15615, 36361, 54881, 43059, 18093, 9180, -4553, -18390, -1837, 716, -21260, -23438, -25640, 12076, 28746, -9851, -33304, -24747, -25499, -51050, -24380, -13179, -43726, -49325, -27212, -2355, -25512, -2161, 31831, 3604, 7343, 4302, -11892, -32086, -50311, -30786, 25317, 21392, 7798, 31619, 27019, 28877, 19478, 28291, 22248, 13446, 3643, -1034, -16110, -3604, 27243, 54645, 46412, 9646, -12128, -2869, 31208, 40675]
8703D0675k080q028j2047j6564j0516J6781J7502N908R886N813p285m2952m9860
8690e2767j4769K0872L2220K1010j8911m060J7934K7575o949j538j7207O254L1333
8677D0997j1538k1068J9841o332m0017n362J5692j2579K0968N958j282p164o247
8664h133N1976p803j7164R098J5404O483j0469K3245J8981K03J6452M8898P1431
8651B18602J02427L2241k7054n8359o6935m2418q537R168m7516o1384J5084J5572
8639H0891K0417O941j0514j9202q17L486j2332j3233j834m46N386L8161K2228
8626A19132J2067j4831k7672J491M473k0188k911l990j0938q979K4790L6451L9255
8613A48150M5046M2619R980K4297O1513J32477J68532J22270p101j64087j42932
$$ y = [40675, 38595, 30567, 18520, 1956, -8560, 8221, 25723, 31631, 41517, 47330, 40045, -2907, -52767, -67536, -46664, -14444, 6566, -12345, -16405, 1529, 29104, 22155, 20617, 3410, 9664, 40997, 29459, 8391, 28232, 21900, -18117, -23479, -7787, -20366, 602, 6560, 5278, -1886, -8133, 43843, 36040, 18876, 27974, 43378, 49861, 39392, 62637, 81618, 81821, 98273, 147171, 218602, 321029, 353270, 326216, 267857, 200922, 158504, 149967, 159135, 111619, 50235, 65319, 80891, 101308, 108249, 97735, 78533, 77716, 81202, 68870, 55637, 53803, 53357, 58743, 96904, 119132, 131199, 116368, 88696, 90187, 94660, 74472, 71561, 67571, 56633, 47654, 72444, 108895, 148150, 193196, 235815, 245795, 270092, 331605, 464082, 632614, 754884, 747783, 583696, 440764]
8602D40764q1870p7328p2775k368k7682j8515k4094k7937J2069J1826j536j3292
8590A17262r522J1373o255J6650j4061l819L5622j1722n413o016m241k3987O652
8577A02523j6088J0682J4839M1497J4589J1858O5029Q5861M5779k5835n2635l3671
8565B64428k556M251Q6387N1947k8725n9427o0143m4890m1141m4392l0880O246
8553A01105J9762Q906m996k603R061o256l6505n225m1797o5848l0773J0553O7845
8540B3229L8383L621n251l0682p683J6358J4851P625n64L7847K0008O0624Q8085
8527B66451J55541J78503M6818j18323j43805q9288p9377o3076k0614k4837l6237
8516G1756j8149J2800n610J3376r869J1125j4768K5697K4989l7894k5257k622
$$ y = [440764, 358894, 281566, 208791, 206423, 178741, 160226, 136132, 108195, 120264, 132090, 130554, 117262, 107740, 119113, 112858, 129508, 115447, 111628, 147250, 135528, 130115, 124099, 119858, 95871, 102523, 86435, 97117, 111956, 153453, 168042, 179900, 244929, 330790, 376569, 350734, 298099, 264428, 261872, 266123, 352510, 404457, 375732, 316305, 256162, 211272, 170131, 125739, 94859, 101105, 120867, 129773, 124777, 122174, 131235, 124979, 88474, 83249, 41452, -24396, -55169, -44616, 23229, 61612, 65233, 59982, 29300, 21617, 37975, 52826, 60451, 59887, 97734, 117742, 178366, 266451, 421992, 600495, 647313, 528990, 385185, 295897, 216520, 153444, 132830, 107993, 71756, 53607, 66407, 60797, 74173, 64304, 75429, 60661, 86358, 111347, 73453, 48196, 45574]
8504D5574J1659O060j7199j5589k3401p759j2762K9061L3485l635j6858k74J8152
8491D6514j7836N468K4552M589rJ990K5585O18M5418O3090M4228J4761k8637l5517
8477A94814l8931n2024m2563k4380k9656J6974J9154J3027l3075l4583K82K2568
8465A1607K8748n717P622P619l374p470K821J8731j8388n5347j9302K0549N67
8452a1334O960M2652k0497k9998k0431j2660L1003K5025K835j4589p236j939M763
8439e446j9813k3556m55l113R499J7082K0363J3681L0730L1788j6140k6101P561
8426C6080K5691j3063l2076j3002J9419L831k0257l3139J1547k650k735K5718
8414E364J1023j350p306J0935p596O472m191j4135k942J1614J4810K3301m459
$$ y = [45574, 57233, 63293, 46094, 30505, 7104, -655, -13417, 15644, 49129, 45494, 28636, 28362, 46514, 28678, 34146, 58698, 63287, 63278, 65268, 90853, 91471, 136889, 199979, 244207, 258968, 230331, 194814, 155883, 103859, 61296, 36916, 7260, 24234, 43388, 56415, 23340, -11243, -10961, 11607, 40355, 34638, 42260, 49879, 46505, 39035, 41856, 60587, 42199, -13148, -32450, -11901, -11334, -4374, 38278, 17781, -12217, -32648, -45308, -14305, 10720, 13555, -1034, -8270, -10209, -5446, -25259, -48815, -49270, -52383, -42884, -25802, -5439, 8242, 38972, 70760, 54620, 28519, 36080, 61771, 48708, 16632, 3630, 23049, 26880, 6623, -26516, -14969, -17619, -20354, 5364, 16387, 15037, 7731, 18666, 11070, 17542, 13351, -784, -3726, 7888, 22698, 45999, 41540]
8401D1540k3493q682J5814l2873j2303r63J7943K3039N542k725l012k923p299
8388I605M124r0k1818j4172J8547q978j0697J2124J9199K5208k2208l3615Q547
8375a4224L880m259j9060q595P314J5351L9267J6570j889K3531p052j1350J0710
8362E0194J3345k5064m1793j9367K700J4225J4973J4081J2935n252N939J108R524
8349D7548j118q173J3557o00k8714l0349p721J8728J7508j7101j9449n769J2795
8336h858j1615l8969o290L3781M9679J0124j9312J370k7759o434r240K1505j7932
8323b9950j3582j4882R72J0251J6981L0411n810q477J4873k9517j3722j0298K3258
8310b9492K9182L6595q909n907K0878k8778j6542K188k5018k3578K2766J8229
$$ y = [41540, 18047, 9365, 25179, -7694, -19997, -20960, -3017, 20022, 25564, 22839, 19827, 16904, 9605, 13729, 13639, -8179, -22351, -3804, -12782, -23479, -11355, 7844, 33052, 10844, -22771, -14224, -10344, -14603, -33663, -42258, -34944, -19593, 19674, 36244, 34355, 57886, 50834, 39484, 50194, 63539, 38475, -3318, -22685, -19985, -5760, 9213, 23294, 36229, 30977, 36916, 38024, 47548, 46430, 38257, 51814, 51214, 22500, -7849, -15570, 3158, 20666, 3565, -15884, -21653, -8858, -20473, -59442, -65732, -31951, 17728, 27852, 8540, 9910, -17849, -24283, -33523, -12018, -29950, -43532, -58414, -57442, -47191, -30210, 201, -5609, -14086, 787, -28730, -42452, -52750, -29492, -310, 36285, 27376, 21469, 42347, 13569, -2973, -785, -25803, -49381, -26615, -8386]
8298h386Q437j4888m501K5843m448j176J3832j0032L507J620M055K7787K6866
8285F8516q126L471l9053m2577R538J1956J9624j2902k9434L0640L7491o699J3619
8272E6064m372k9362J8359k1342l2576k3747J1009K4782j778J3322L816r969J0627
8259A4833J429m4650q664O941L8055O309J1468K6092J4955r441j7932J0411j818
8246D7988j7259l2233l344j8438R471K5755K9467k3095r451M440n227k9626K2599
8233A047K5930j0158j7261n7643P020M5812K4636k927j145j8355r000J1277J9232
8220A8465q265n167R432p901R066J0020K2505R86l8282l5009J0364J9592Q849
8207A4655j7024n272Q104P260J3329k3013j2617J958k0900K6334J4178L1412K0610
$$ y = [-8386, 51, -14837, -19338, 6505, 2057, 881, 14713, 4681, 8188, 9808, 13863, 41650, 68516, 60390, 63861, 24808, -17769, -8231, 3725, 23349, 10447, -18987, 11653, 49144, 42445, 56064, 51692, 22330, 40689, 19347, -13229, -36976, -25967, -1185, -2963, 10359, 14175, 4206, 14833, 16262, -28388, -37052, -30111, 7944, 14253, 25721, 51813, 66768, 57327, 39395, 49806, 47988, 30729, -1504, -4848, -23286, -13815, 11940, 41407, 18312, 8861, 13301, 8074, -21552, 1047, 26977, 16819, -442, -58085, -51065, -5253, 19383, 16456, 15311, -3044, -12044, -767, 18465, 10200, 5033, 14465, 6564, 15630, 25650, 48155, 49141, 10859, -24150, -13786, 5806, 14655, -2369, -7641, 463, 7723, 21052, -1961, -14578, -12620, -33520, -7186, 6992, 38404, 59014]
8194E9014j0938j4468j5726l3404M411j0213l4082M096J9379Q841J5075k7093
8182c5108m918k9116L557K0792L4725r99j3449q629Q278M130P920J4847r377r146
8168a6493j8711J9698Q631j2856J0315J0193K3330P297j1959K315j1854j3120
8156c214q30J5698l025P806p139j3045J9763K9044n212j6115n161K467j4018j1428
8142d409L70j6757j4899J1303J3739m112l3119O807j0650L979P732N934J3545
8129b0537J3554K0908N309j2044J1552l3609j4764r436R727K1617K6831k0109
8117a001j5301J078J5039l027L165J8087l3875P894L0108j94K4516J7624j2787
8104E1326K1153k007l1614l7741l5922n797l998O323k9843R388M0627K3281J5232
$$ y = [59014, 48076, 33608, 17882, -15522, -11111, -21324, -55406, -51310, -31931, -23090, -8015, -35108, -40026, -69142, -65585, -44793, -10068, -11067, -24516, -33145, -24867, -20737, -12817, 2030, -7347, -16493, -35204, -15506, -6875, -19731, -9416, 777, 24107, 31404, 19445, 21760, 9906, -3214, -4044, 11654, 8629, 16435, 9296, -3749, 16014, 45058, 39846, 23731, 18570, 21037, 7019, -4409, -4039, -20796, -35695, -24392, -10653, -14765, -47884, -41077, -51727, -47748, -40016, -34082, -20537, -6983, 13925, 19234, 7190, 18742, -14867, -29631, -39067, -29340, -7723, 19108, -1001, -16302, -15224, -185, -3212, -47, 18040, -15835, -7941, 22167, 21973, 46489, 64113, 51326, 72479, 70472, 38858, 1117, -34805, -40602, -44600, -38277, -68120, -58732, -18105, 5176, 20408]
8091B0408Q968n274j8737n478j4154n275O777K4193j7746J4625K6273r365m1546
8078a6331k1899J3393K0164l256j9966k0889J2723Q465r255J2505r114m378L4145
8065c693L4951J281j2980L092l099k7903n0918M3534M9349Q418k7704P589k613
8052A9304j6582j042J1170j078r338r464N839q705J3881R388J2546p774j3348
8039D797j0263j1469K2584o149k667L740K0192K2548j6093j2331r67j2170j7727
8026a5975M659K7689K7804K6836m369k7176l9958K4927M167n356j5865L237J4833
8013B5453J7932J0545K270L769l498j4156K673m673N269j0562q723o463J2955
8000C2791L9327K0075l837k0917R332N8459R446n0704k2025j7799l011j2627J9530
$$ y = [20408, 29376, 24102, 5365, -113, -14267, -19542, -12765, 11428, -6318, 8307, 34580, 25215, -16331, -38230, -24837, -4673, -7929, -27895, -48784, -36061, -27596, -36851, -24346, -33460, -37838, -3693, 31258, 32539, 19559, 22651, 19552, -8351, -59269, -15735, 33614, 42032, 14328, 21917, 19304, 2722, 1680, 12850, 11772, 2434, -7030, -1191, -9896, 3985, 13373, 25919, 18145, 4797, -5466, -16935, 5649, -500, -3167, 573, 20765, 43313, 27220, 14889, 13922, 1752, -15975, -11316, 16373, 44177, 71013, 66644, 39468, -490, 24437, 28604, 23248, 7383, 10620, 25453, 43385, 53930, 56200, 59969, 56471, 42315, 44988, 40315, 45584, 35022, 26299, 19836, 32791, 72118, 92193, 88356, 67439, 76771, 135230, 144676, 93972, 71947, 54148, 51137, 38510, 58040]
7987E8040K326j4305l0029J6674M0341R799k9605k9671J3058L660j9274j2634
7975H380J4515J6793J5593k701j9082L972J1415l3726l1519p717O063m609n010
7962b7633l418O340K861P014J0428N236Q210j050M806L2090j4305J8282L1738
7949H0599p168k4072J1986N417j9019M79K1655J1037j5205j6254k076O034k307
7936E1106k6900l1766n895p296l460j8267p37J9904L2938J0605j9068J3352M4054
7923E8570j9592k0830q947J8477J7617J2269Q089n00j0405k9552l7756O395K6963
7910B0798L148l0297M947J5932Q76J4571j6535k0991J2442R406j0061Q764M8949
7897F1949N5m6242l709L368K2685J2557j2387J036L2662M607k4521k6206k7460
$$ y = [58040, 60366, 46061, 16032, 32706, 73047, 82846, 53241, 23570, 36628, 40288, 21014, 8380, 22895, 39688, 55281, 52580, 33498, 37470, 48885, 15159, -16360, -24077, -18014, -22623, -27633, -31051, -24711, -21850, -14836, -4408, 828, 9038, 7988, 12794, 44884, 30579, 48861, 80599, 73431, 49359, 61345, 66762, 47743, 48222, 69877, 80914, 65709, 49455, 47379, 53413, 51106, 24206, -7560, -13455, -20751, -24211, -42478, -43215, -23311, 9627, 20232, 1164, 14516, 58570, 38978, 18148, 9201, 27678, 45295, 57564, 65653, 65153, 54748, 25196, -12560, -6165, 20798, 23946, -6351, -1404, 14528, 15404, 29975, 13440, -7551, 4891, 14297, 4236, 13000, 61949, 62004, 15762, 12053, 15421, 38106, 50663, 38276, 39312, 71974, 76581, 52060, 25854, -1606]
7884a606L945L216K0922j5989k1052R088p325n50j9162p519J85l447L12N680q340
7869d1642J1604N78r113J6145M5369j4532O448J2188l4184l4073p337L3182Q624
7856f743r353J3938j1027j1510N654J4383M3867M477o680J067j7114j7671j0607
7843g319L5257J6077k448j6288m2016k481M352j3095K0216O495N60J6037J2243
7830B7590L98R686k1181j6722J4626J017l2429k2634n475J1020O030j8126L75
7817d5825m463K0778M3103J2188j3200J944p413j0140N1J9906P195K2038k4523
7804B1639k4674O334J1154J0380j0223m758J3007O567n29k0587k6513L8785K4608
7791D5190l1874n5371o058k6878L880K3399J0491K1254M5031J9173k7482l9149
$$ y = [-1606, 2339, 5555, 26477, 10488, -10564, -1476, -8801, -9351, -28513, -36032, -35847, -39294, -38982, -33302, -41642, -30038, -29460, -38573, -22428, 22941, 8409, 14857, 27045, -7139, -41212, -48549, -15367, -6743, -16096, -2158, -13185, -24695, -19041, -4658, 39209, 43686, 37006, 38073, 20959, 3288, -7319, 27938, 44015, 41567, 25279, -16737, -19218, -14866, -27961, -7745, -1250, -690, 15347, 27590, 27988, 37674, 16493, -229, 14397, 15414, -17015, -39649, -45124, -34104, -28074, -46200, -45825, -50288, -29510, 13593, 25781, 12581, 14525, 7112, -3028, -2977, 16929, 24124, 46162, 21639, -3035, 3299, 14453, 24833, 14610, 9852, 22859, 29426, 28897, 8310, -18203, 20582, 45190, 13316, -42055, -48113, -74991, -71111, -47712, -37221, -15967, 29064, 48237, 20755, -18394]
7779a8394k0689J7921J2606j5550j5050K8297M182J9110K408j0358k5123K1972
7767A332J4313r43J111o388J1756J4914p575k5823j2331K8606j0796p819j4661
7754a4304j7091K953K681J077K0220J8365j2218j4150n831p565o02k2292j2341
7741f1098J7719K5017p195M490r870q034j5635L0045M8203l2126r18K3329m229
7728I698j7410j5331j2630j418J435j5327K1724K9033J667j0670k3817l5276k4114
7715i2436L2314M263J2757L4353K4513j0655J4187j851l7436O125k964J1610K994
7702b226J3328L7446K7041j6176k4463k2273l045p969k1237k9552J5094J2228
7690b1804m0512Q689N1470K6334j8368o955M5003J8338k1852l651j0227j0933
$$ y = [-18394, -39083, -21162, -8556, -24106, -39156, -10859, -6677, 12433, 14841, 4483, -20640, 1332, 15645, 14702, 15813, 9425, 21181, 36095, 28520, 2697, -9634, 18972, 8176, 357, -14304, -31395, -28442, -25761, -24684, -4464, 13901, 1683, -12467, -18298, -25863, -26465, -48757, -61098, -43379, -18362, -25557, -21067, -30937, -38971, -54606, -24561, 23642, -8484, -9402, 13927, 9698, -7712, -23043, -35673, -37091, -35656, -50983, -29259, -226, 1441, -9229, -33046, -68322, -92436, -60122, -55859, -43102, -8749, 15764, 5109, 19296, 17445, -19991, -13866, -16830, -5220, -2226, 11102, 48548, 75589, 59413, 34950, 12677, 9632, 1663, -19574, -49126, -34032, -21804, -62316, -53627, -2157, 24177, 5809, -1146, 43857, 62195, 40343, 36692, 26465, 15532]
7678A5532K082m001j2985K1093K0375J151p353j7900n417K478k0892J3998j3646
7665e485p576M407j490L1479K8077k5048l3130o741P074K3633M0624o162m6427
7652C235k1284J9648L1671k651j4261K287K5171P614j3555p180M281ol2898m082
7638b010K168j7622M04j543J3425J4630Q157k0794J6724J8559N125j100p843Q730
7624C7010l5070j8070J755J2228j1347j0403o476J4769P485k506p452J6589m819
7611f307Q279k6770j0356J314j7806j109K0487Q756J717n200K0558K9218p735
7598A5046l158K5156N779m825l1099k5336J298J1575K0202K1122O342O942j308
7585D7736o247j5991k0686L826J111J0167j8716n998J4040j4827k8686J2981j5858
$$ y = [15532, 17614, 13613, 628, 21721, 42096, 43247, 35894, 17994, 12577, 15055, -5837, 8161, -5485, -13061, -8654, -10144, 21335, 49412, 24364, -8766, -15507, -8433, 15200, 55824, 49662, 3235, -18049, 1599, 33270, 30619, 16358, 18645, 43816, 51430, 37875, 30695, 34976, 34970, 2072, -2010, 158, -17464, -17060, -18603, -5178, 9452, 17609, -3185, 13539, 32098, 37223, 36123, 28280, 37010, 1940, -16130, -14375, -2147, -13494, -23897, -30373, -15604, -8119, -10625, -18077, -1488, -6307, 1972, -24798, -35154, -33840, -51646, -52755, -32268, -23512, -21795, -26995, -6437, 22781, 15046, 11888, 37044, 42823, 37998, 6899, -18437, -17139, -5564, 14638, 35760, 42102, 49044, 47736, 41489, 25498, 4812, 8638, 9749, 19916, 1200, -4798, 9242, -5585, -34271, -21290, -37148]
7572c7148q532J7017N96j6979k1179R788J8551J8806J9807k1128k1772L877K9795
7559h501J6708J2700j744j9690k6374q595K715J3423N040L41m840J2100n701j1466
7545b3884J5592q483M365K7146n916K091j4983j0788j1866K6567O620j8597J4226
7532B090K9408k672q779q630K0016K110j3437k7860l753J0949J6427J5854P510
7519C9233k5846m5874J5405K9477j1869J5268o417l5114o552M294J7223J8590
7507G818o143k268O999o23O914k517j0207J4748j8678j3208L107l9287L5419L4207
7493A6281J0344L3R662m684N834j074q910o011L4174q439l1596k6599j265k6027
7479c8277j721K1063J3543J2526j1887k1848k0605J1536M8166k567k2212j1120
$$ y = [-37148, -45680, -28663, -28067, -45046, -66225, -56437, -37886, -19080, 727, -20401, -42173, -38296, -8501, 8207, 20907, 19163, -527, -26901, -35496, -32781, -19358, -14318, -13977, -18817, -6717, -12418, -23884, -8292, -16775, -12410, 14736, 8820, 10911, -4072, -14860, -26726, -159, 6461, -12136, 2090, 31498, 28826, 20047, 11417, 31433, 33543, 20106, -7754, -11507, -558, 15869, 31723, 39233, 13387, -32487, -17082, 12395, 526, 15794, 9377, -25737, -32289, -27995, -10772, 7818, 1675, -593, 6406, 5783, 12697, 10180, -27, 14721, -3957, -17165, -14058, -53345, -17926, 16281, 26625, 26658, 36320, 31636, 37470, 36396, 27486, 21475, 55649, 47210, 15614, -10985, -12250, -38277, -39998, -18935, -5392, 7134, -4753, -26601, -47206, -35670, 12496, 9929, -12283, -23403]
7467b3403N408k0157K0686j225l627J0093K9401l0190l3432o133M4182K3645o342
7454H906k1542O707L4339P566o165k6616j8338J5356L1116J0221k5728k5490k4899
7441c4567q787o37K3829K0012K2766K8230k9619j1856J1633j5094j3277K25J3925
7428F783k3016k7559J3777L0261N301j4325j669J7852j6119j4139j9316j1915
7416e4084L6323K0210J4746J5022j8819J5p555l870K7703j0416q638j3589k893
7403e845O43J6916K445j2938p280K4635K867L411k3668k1813K4557K4088J8694
7390D6712n292k0616k0181m243J7976J1974l274k0409q568q157k0525J3661N575
7377a5367l477K9089J463j7246N604J0324k012j4965m086k5181r075o57N739J9889
$$ y = [-23403, -17995, -38152, -17466, -18691, -22318, -12225, 17176, -13014, -46446, -52579, -8397, 15248, 8906, -12636, -5929, 28410, 35976, 29811, 3195, -15143, 213, 31329, 41550, 15822, -9668, -34567, -43354, -43991, -20162, -150, 22616, 50846, 21227, 9371, 21004, 5910, -7367, -7142, 6783, -16233, -43792, -30015, 246, 5547, -8778, -10447, 7405, -8714, -22853, -42169, -54084, -17761, 2449, 17195, 32217, 13398, 13413, 5858, 1988, 29691, 19275, 10637, -2952, -5845, -5202, 11714, 14159, 1221, -6059, 18576, 21443, 24854, 1186, -20627, 3930, 28018, 46712, 41420, 20804, 623, -3620, 14356, 26330, 23056, 2647, -5921, -14078, -34603, -20942, -15367, -18844, 10245, 11708, -5538, 66, 10390, 8378, -6587, -10673, -35854, -44929, -45586, -39847, -19958]
7363a9958j1798k7428J978K2055K0118J760K16n457j2081k0960M419k2884J9933
7350e0087M892m9174j666K1751M0755K6166J7574m215K6351m211P600l012k3789
7337H935k2998k6465J5548J700q736L3676K637j969K47J0634Q345j6041l0765
7324b5252j0755q497p428K2610J2225J2804N32P287n966j0203n067J127N119o350
7310a7814j9540J3890J4769j3650J4798k8203L420K4827K0396N853j962n672k9656
7297a8544k2731J5546L6309K9536k6026k5100m572J3939J2253P130J7624J1369
7285D6733j2570j5456K7708J8869r338k1887k7236L978R862J1176m796j4111k7529
7272a4597k1266O04L1822P997O891j8167l3807K5167L2602m73K7473j755L434
$$ y = [-19958, -31756, -59184, -57206, -35151, -15033, -13273, -13057, -18514, -30595, -51555, -47136, -70020, -50087, -45195, -94369, -96035, -74284, -33529, -7363, 10211, 5996, 32347, 28136, 35736, 32724, 8935, -14063, -40528, -24980, -23280, -32016, 1660, 4297, 2328, 2575, 13209, 21554, 5513, -25252, -36007, -44504, -51932, -29322, -17097, -4293, -3761, 3526, -2440, -12643, -17710, -16583, -11464, -17814, -37354, -23464, -8695, -22345, -7547, -35750, -32330, -7503, 12893, 18746, 16784, 11112, -18544, -41275, -25729, 10580, 40116, 14090, -11010, -15582, -1643, 10610, 17740, 35364, 46733, 34163, 18707, 46415, 65284, 55946, 34059, 6823, 10801, 20663, 31839, 27043, 12932, -14597, -35863, -35259, -3437, 4560, 11451, -6716, -40523, -15356, 17246, 16773, 44246, 42491, 45925]
7259D5925J4226P268l0360m9824j6745q901j0800J5553J5116K3002N417Q928q65
7246A7940j2253j0754j9138j408Q772O031O091j3376K2835J1837l9045K2489O171
7233F192R989J5821j0161l963j6754l2219N713Q843m731J2757K4987K1183J2570
7220E0227k3619J4353j6022k0234n919P2K2731M590L9728K0216k3172j4725m3029
7207E197j6662M307M525l043J1755K911j6420j6746K2434L2309N823k2636j6523
7194b769k0330r706j5766J7022m293j2413L5610O490k6163o829l240K2027p327
7181b7687o862L028J6145k3132j3986N682L360O94L9155l2049k2661Q610P715
7168d1988J3875Q631R711k5749J9571L4144M87Q275n936j6992K3515J6686k3639
$$ y = [45925, 60151, 67419, 37059, -12765, -29510, -38411, -49211, -33658, -18542, 4460, 9877, 18805, 17940, 5687, -5067, -24205, -25613, -16841, -10810, -4719, -18095, 4740, 16577, -22468, 21, 6192, 16181, 32002, 21841, 17878, 1124, -31095, -25382, -16539, -21270, -8513, 16474, 37657, 50227, 26608, 40961, 24939, 4705, -1214, -1142, 21589, 26179, 65907, 86123, 62951, 48226, 5197, -11465, -7158, -2633, -5676, 6079, 8990, -7430, -24176, -1742, 30567, 36390, 13754, -2769, -23099, -32805, -48571, -31549, -35842, -48255, -12645, -6155, -32318, -39147, -42387, -20360, -27687, -34549, -31521, -15376, -38508, -52494, -46812, -43452, -42758, -3603, -35652, -58313, -49703, -41988, -28113, -19482, -9771, -35520, -15949, 18195, 18682, 26957, 21021, 4029, 27544, 44230, 20591]
7155B0591k4767M531l5148j2305K7022J0156M027J3979n046N28Q48N821j059l660
7141E518n730K5450j2083j3225k5646n115M779L6070K4468k5808m809k5892l3051
7128e5074j3658J2153L0600L1380j3903l1727P039M9779M0030l0110j9026k7128
7116a9645j4784j2667L04P281M843q34q918M652L3376j327J2781R454J7009p542
7102B3983m983L8486j5942k7474j9586k021R695n565O540N732k0808J3443l522
7089b022k9869R957M2103j6603j8161J7551j3096k9653k8009j644j3862J4386
7077f8922M1510K7161j4139j1474R120K2655J0758k1960j3412k8173m2918j9364
7065a09158N6134K8893L6266J2579l0751l0267R821o019N60R969R805J8672j7204
$$ y = [20591, -4176, 355, -34793, -47098, -20076, -9920, -5893, 8086, 3040, 3568, 4416, 10237, 9178, 5518, -212, 25238, 13155, -70, -25716, -30831, -26052, 10018, 34486, 8678, 3869, -22023, -55074, -68732, -56579, -25979, 5401, -8502, -40229, -33190, 16589, 56619, 26509, 7483, -19645, -34429, -47096, -46792, -39511, -34668, -35502, -44420, -39768, -6392, -7719, 5062, 14516, 31525, 23983, 19000, 57486, 41544, 14070, -5516, -7537, 2158, -3407, 3133, 8865, -11943, 1500, -2022, -31891, -21934, 20169, 3566, -14595, 2956, -10140, -39793, -67802, -69446, -83308, -68922, -27412, -251, -14390, -25864, -16744, 5911, 16669, -5291, -18703, -46876, -89794, -109158, -53024, -24131, 12135, 24714, -6037, -36304, -26483, -32502, -31942, -21973, -12168, 6504, -10700]
7052a0700q758J0167J3608J1268K004k5559K571j0992J860J449j2902j3712K1845
7039a7851j670o050K043j895k4729k1572K5653J7704j840J0624j1052R810m960
7026b5785l461k576J6553j2533m963J6649j0126k6639j0058J1987J9179J7927
7014a3846m401K0878l522j9973l875J4904K8646J2199K514j790j2256j8765j4116
7001a3403L548J3532J4770p192k2105L570o857N748M1344J1954j8395k5522r88
6988DK1485K3853k3342p535k505P00j5236J0943Q929P486p577j8364j8917J1219
6974h857Q987j1757l1441k9331L2901J1936P958j1407J2143R641j7040J0679P588
6961h000K781J5258n819k9692N629P17j611K148k3799J1775K2893R212k2643L49
$$ y = [-10700, -19458, -9291, 4317, 15585, 17589, -7970, -5399, -16391, -14531, -13082, -25984, -39696, -17851, -19521, -25571, -23528, -25423, -50152, -71724, -46071, -28367, -30207, -19583, -30635, -20825, -25785, -29246, -31822, -15269, -27802, -32765, -16116, -26242, -52881, -62939, -50952, -31773, -13846, -18247, 2631, -891, -20864, -24739, -9835, 18811, 31010, 33524, 31734, 19478, 713, -13403, -9855, 3677, 18447, 11255, -10850, -7280, -14137, -8389, 32955, 44909, 26514, 992, 4, 21489, 45342, 22000, 14465, 11960, 12660, -2576, 8367, 17296, 24782, 17205, -1159, -20076, -8857, 130, -11627, -43068, -72399, -39498, -27562, -19604, -31011, -18868, -9227, -26267, -15588, -8000, -5219, 10039, 4220, -25472, -19843, -19126, -20737, -18589, -42388, -30613, -7720, 1492, -21151, -20802]
6947b0802L3665K771K4149o548k6145O445l865k2702k0701K2021K2842l0088j0541
6934b9499J174L7891M1437J8184k8993l4431k559J3428k6346j0464m852q291J3623
6921a9698O10j0043j331o039N916L8869O999j0130j3051k8071j0905n273j133
6908e3280J5944M010k672J5393r801j8288p920J1832o922Q295O635K1864J1149
6895c761Q000J8940n583j281J834l8588j7342Q680j2874K9869J2150j5040J7822
6882B826l626j6254O104l8546j8040L576L1768J2765j1382K2654M0510k072j900
6869B8383n252l2433j5175j1502k414K3678P779j0041k8703N731K8199M3494J9958
6856E1702j8790k0767l3978l0527p946R758j3084N322J2047K8900j703j5553r333
$$ y = [-20802, 12863, 15634, 39783, 33235, 7090, 13535, 9670, -13032, -33733, -11712, 11130, -18958, -29499, -28325, 9566, 51003, 69187, 40194, 5763, 3204, 16632, -9714, -20178, -25030, -33321, -19698, -19088, -29131, -30462, -36501, -30585, 8284, 15283, 5153, -7898, -35969, -46874, -52147, -53280, -37336, -33326, -35998, -20605, -30406, -48694, -56614, -44782, -51704, -43409, -36774, -14910, -3761, 4239, 23179, 17596, 16315, 18149, -20439, -37781, -29101, -41975, -12106, 44, -14996, 2826, -800, -17054, -10950, -49496, -67536, -63960, -32192, -19427, -30809, -8155, 32355, 30283, 28383, 23131, -9302, -24477, -35979, -38393, -14715, -6936, -16977, -45680, -39949, -11750, 31744, 51702, 32912, 12145, -21833, -52360, -60306, -50548, -63632, -58310, -46263, -17363, -19066, -34619, -43952]
6843d3952K2160O322Q643n295J3826L2597k6536k19k3746j2745K3853K3925M0052
6830E8885j7009l1613l0723m994j934r027J8204L6629K3737J4037M990M753P192
6817G3127j4482l6520q356R018L4507j4051j5641J8093L567j2720J1463J4591
6805F2596J4558P70J0962k0464l2158k6579j5416L5072N432l6435l6051J2756
6793b4957J1189L415j1333K7416R104r739J5414l131R071J0838l8838j0512k4622
6780c6685P091J9007p015Q470J3068Q569k3236K390K4983K205J3827j1495J0241
6767C1420k4798m140J9185k2555k6077J7278L6891J7386Q992L838l8031q281K7994
6754C9102K1478k675r975L831P124K6999L4026l538L159k3593j9340J4657j2029
$$ y = [-43952, -21792, -15470, -6827, -12122, 1704, 34301, 7765, 7546, -16200, -28945, -5092, 18833, 58885, 41876, 10263, -20460, -25454, -27388, -36415, -18211, 18418, 42155, 56192, 61182, 65935, 73127, 58645, 22125, 13769, 22787, 57294, 43243, 27602, 45695, 49262, 36542, 48005, 62596, 77154, 77924, 88886, 68422, 36264, 9685, -5731, 29341, 34773, -1662, -37713, -24957, -13768, -10353, -21686, 5730, 14834, 5095, 20509, 17378, 26449, 37287, -1551, -12063, -36685, -29594, -10587, -17602, -9132, 3936, 12505, -10731, -8341, 16642, 18847, 32674, 21179, 31420, 6622, 2482, 21667, -888, -26965, -9687, 27204, 44590, 53582, 57420, 19389, 11108, 39102, 60580, 57905, 47930, 51761, 58885, 85884, 119910, 116372, 119531, 95938, 76598, 91255, 79226]
6741G9226J7844K0154K8442N4234j1951l9469J1348j8615n999J7846j7359l1009
6729A04692m4629l6874l514J6962M1190M3375J1888M0140J3765r885L8403K7076
6717B42589O1868J23867J83747K77517L17845L67902L66762J88524j61438m17966
6707A551217m32752l43025k14928j23501p9852o2878l1365n1973k4796m1696k7383
6696A17068l7298j0151K5448l641r376j6610q468L0721r304j1395k3914j6482
6684B6598J3482P502m491j0253k2014k041R255J5784m444j2942J8248K0932L2615
6671H8231N980l1262k2387l7099k2862M031M1241K5772q65k9140k9454n632J0803
6658b643M1697R855j8154j8846m835R882K719P682m598k6316J6338J8498r782
$$ y = [79226, 97070, 117224, 145666, 199900, 187949, 148480, 159828, 141213, 135214, 153060, 135701, 104692, 60063, 23189, 19675, 36637, 77827, 121202, 133090, 173230, 186995, 177110, 215513, 242589, 304457, 428324, 612071, 889588, 1207433, 1575335, 1942097, 2130621, 1969183, 1551217, 1118465, 775440, 560512, 437011, 357159, 294281, 262916, 210943, 186147, 144451, 117068, 79770, 69619, 95067, 91426, 82050, 65440, 56972, 87693, 78389, 66994, 43080, 26598, 40080, 47582, 43091, 32838, 10824, 8783, 18038, 33822, 29378, 16436, 34684, 55616, 88231, 94211, 62949, 40562, 3463, -19399, -15368, 25873, 51645, 50780, 21640, -7814, -13446, -2643, 39054, 48909, 30755, 11909, 7074, 16956, 19675, 27357, 22759, -3557, 12781, 31279, 21497]
6645B1497r409J3320j8225o055J161m878M72J8113K0264K07n052J732l3192j5654
6631a5699P391k1716K5764K2318o131j3988j1992K3999K958k301j1970l0436k1366
6618e3169k056J858k06L0849Q727J116L236N403J8620L3722O428o169k8853j7150
6604B356j6729j8662o394Q027J5039P770O272J6408j5963k0321P034L18j0782
6591b5627j9203Q497L441j8690J4764K4407l648k1471J990J1232L3955K7725j0746
6578B6626k8203j1980Q268K1690j0129j2393j6716N226k814K3507J851K3061r318
6565A8676m0139J2657J0907J9197k5790k6202j6178J39J6397Q745J7226K8975
6553B4610P903j5435k4326K969N859N050J0768k4112j5478q135K4754J9323K7858
$$ y = [21497, 12088, 25408, 7183, 1128, 2289, -2589, -2117, 15996, 36260, 36467, 31415, 33147, -45, -15699, -8308, -30024, -4260, 18058, 11927, -2061, -14053, 9946, 12904, 10603, -1367, -31803, -53169, -55225, -53367, -53573, -22724, -13997, -12881, -9645, -4242, 14378, 48100, 54528, 48359, 19506, 2356, -14373, -33035, -39429, -31402, -16363, -8593, -2321, 14087, -1876, -22197, -15163, -14845, -25627, -44830, -36333, -32892, -51582, -36818, -12411, -16059, -37530, -35540, -24308, 9647, 37372, 26626, -1577, -13557, -5289, 16401, 6272, -6121, -22837, -17611, -20425, 3082, 4933, 27994, 18676, -21463, -8806, 2101, 21298, -4492, -30694, -46872, -46733, -30336, -21591, -4365, 24610, 32513, 17078, -7248, -4279, 1580, 6630, 17398, -6714, -22192, -30327, -5573, 13750, 41608]
6540D1608l3054k6403P704o70j1683K3515K5067p337k0581P102L9857L953k4403
6527B4675j1374n282m942o224m631n977J6485Q463P029M514M500q985r870M943
6513A3324J17r062k6332k2273J4633J5456K0540j4794j2340k818J7882K6589P481
6500B8403l2659j4084M539j2392M502n688m731J835J3103p514M2440J0626j7332
6487A1048J53J3586J7328k6794k1949p036q644J6246L2015K3695j5864k6695j1868
6474d779L870o662l1140r073P546J5182O90n508J5046L9139J6331j0225k9637
6461G80m264O767J2268l0534m068J1913L0778L403l711J7784m591k1845m298J148
6447A1530J0513j0474R67J2959L279J2029J4049p171j4969o932j2689j3822J4812
$$ y = [41608, 8554, -17849, -10145, -10815, -22498, 1017, 26084, 18747, -1834, 5268, 45125, 49078, 24675, 13301, 8019, 3077, -3147, -7778, -13755, 2730, 11193, 18222, 22736, 27236, 18251, 8381, 13324, 13441, 4379, -21953, -44226, -29593, -14137, 6403, -8391, -20731, -23549, -5667, 20922, 28403, -4256, -18340, -13801, -26193, -21691, -27379, -32110, -30275, -17172, -24686, 17754, 28380, 11048, 11201, 24787, 42115, 15321, -6628, -13664, -22308, -6062, 25953, 49648, 33784, 7089, -4779, -909, -7571, -38711, -47784, -40238, -25056, -24366, -29874, -14828, 24311, 40642, 30417, 780, -3484, 3283, 15551, -14983, -19051, -7138, 23640, 27043, 23332, 41116, 36525, 14680, 10382, 11530, 22043, 11569, 12536, 25495, 28774, 40803, 54852, 47681, 32712, 25780, 13091, -731, 14081]
6434A4081j229p638R71q712J0684K7383n596k6695Q551o946j2386Q287k6144o220
6420c1609L6874k852k7040K2055J6188j9512k4986p796M070J66J9975Q783Q890
6407C206j4882N21M050r844R273o271J449j8257k8138K4020J8431l997j80j1622
6393c2241j5029j9259j7679N514J2918L8508N720l527K1645n03k3383O437o772
6380b7651j0467o484q664K1514N201j218j862j8320l246J5991m564K8246J0650
6367h74M068k0162k2274L222k3561j7225J2270M9239M134J3084J2023K0193m655
6354B9482k8199J2094p656J0374o143M8391k3677j6717k0230l3817J3571J6973
6342e554R658r805j0643n550K162J9469O210M250L6411R938m0526j0686j3427
$$ y = [14081, 12852, 5214, 6185, -2527, 8157, 35540, 29944, 3249, 11800, 4854, -7532, 755, -25389, -31609, 5265, 2413, -24627, -2572, 13616, -5896, -30882, -38678, -34608, -34442, -14467, -5684, 3206, -11676, -11155, -7105, -16949, -7676, -13947, -12498, -30755, -58893, -34873, -16442, -20439, -20619, -32241, -47270, -66529, -84208, -78694, -65776, -27268, -21548, -25075, -3430, -3933, -27316, -20879, -27651, -38118, -44602, -53266, -31752, -26551, -27769, -29631, -47951, -51197, -35206, -39770, -11524, -874, 3194, -16968, -39242, -36020, -59581, -76806, -64536, -15297, -11163, 1921, 13944, 34137, 29482, 1283, 13377, 5721, 16095, 9952, 58343, 34666, 17949, -2281, -36098, -22527, -5554, 4104, -5701, -16344, -21894, -19732, -263, 5947, 10197, 46608, 56546, 16020, 5334, -8093]
6329h093j6030l671j9324r761n737j3068J7109M4483L6855j3158j7206N617l910
6316e894n831M922K2965J0056m371R46q683k9619M154K54p108j5743r076j833
6302d4861k228l0424P001L7779R491r179k6997N40Q547J6139J6045K2672j749
6289B776K0715j2016k5185L357J8161k7650k3181q788J5326O261L2545N932k2392
6276a4139n989n224K1470n502K146J6230J5044j3019l8479l0927M965K5098n043
6263c3369j4627Q753J4139j974j2668L7618J6764Q118j6494j9641J5895K1130
6251B3644J5250k8222j9597K4757L656J2405k1618K540k3302R479j4674l9781
6239e5463j5796P487R558J4675J944m563J2842J987K2259l777k1453R142j5315
$$ y = [-8093, -24123, -27794, -47118, -56879, -62616, -75684, -58575, -14092, 22763, 9605, -7601, -1984, -5894, -11725, -6803, 16162, 26218, 21847, 22793, 14110, -15509, -11355, -11101, -18209, -33952, -43028, -44861, -47089, -77513, -70512, -32733, -23242, -32421, -59418, -58878, -50331, -34192, -18147, 4525, 2776, 23491, 11475, -13710, -10353, 7808, -19842, -43023, -51811, -36485, -30224, 2321, 8253, -14139, -20128, -25352, -3882, -9384, -7238, 8992, 24036, 11017, -27462, -58389, -53424, -28326, -33369, -47996, -39243, -25104, -27078, -39746, -2128, 14636, 22754, 6260, -13381, 2514, 23644, 38894, 10672, -8925, 15832, 19488, 31893, 10275, 12815, -10487, -1008, -15682, -55463, -71259, -63772, -54214, -39539, -37595, -42158, -29316, -27329, -5070, -8847, -30300, -21158, -36473]
6226c6473o686N470P221J0630K2493K1388k952j4145j3355M425j547K2775R864
6213B9108k1032o631j4332k605n298j2957J4522K9931K0984p066j4059k3610j0445
6200b3490M460j170J2728o742j6492k828L091R147J3110J5565J7991K095k0369
6187G096k3205J4273l852N017R693m029J7624J1584q388L656p117k0998R96l808
6173a458l360r083L5740Q764l126P165j3549k6812J910L251J3470J4756q189l969
6159A5510r482M080p949j2345k3423j0075L558L3277K4234j6492n168m887j7892
6146b7054j8123J1843P583r381k991K343j6122J2234j1219J7418L725L899N476
6133b0369O775K1893N9876j1496k4458p633k5729j2990l4744l1449K7136K7807
$$ y = [-36473, -43159, -37689, -30468, -19838, 2655, 24043, 21091, 6946, -6409, -1984, -3531, 19244, 29108, 8076, 1445, -12887, -15492, -20790, -33747, -19225, 10706, 31690, 24624, 10565, -13045, -23490, -19030, -20200, -7472, -14214, -30706, -33534, -30443, -21296, -8186, 7379, 25370, 27465, 7096, -16109, -1836, -5688, -671, 9022, 4993, 22617, 34201, 25813, 29469, 22352, 1354, 2350, -1458, -4818, -13901, 21839, 30603, 27477, 34642, 21093, -5719, -3809, -558, 12912, 27668, 19479, 15510, 6028, 10108, 2159, -10186, -33609, -43684, -40126, -6849, 17385, 893, -4275, -9162, -27054, -45177, -33334, -25751, -35132, -38123, -35780, -51902, -39668, -50887, -33469, -29744, -25845, -20369, -13594, 8299, 68175, 56679, 32221, 24588, -1141, -14131, -48875, -80324, -53188, -25381]
6121b5381J3493J3230r510K381J2320j0924K7461j3466j8532K624p135K7506L1086
6108D5153K290J0502l826m6460j8106j0064J8632Q514l540M9n626j1865J579r147
6094b1915k2327L070J8001J2148K5392N3455J4943l0314k3654P914j2932j3163
6082A0618j226K1451K3812j5435k0176j6546j0033j7768k4258k811n528Q803K5377
6069b3720o39K9078K0461j77j0119p983j2807P008K4243j2902l9406o399L352
6056c0010R437J1514K9090K5548k9795k5482j7582l9017K3016L0374p624q224
6044b8755r708L005j0287J6526J6738K185k407K691j2540Q171P459p968j0555
6031b5445R805j768J4827L7724L233j6454j2055l4277j3507K298J9911N211k3537
$$ y = [-25381, -11888, 1342, -8168, -5787, 6533, -4391, 23070, 9604, -8928, -6304, -13439, 14067, 45153, 47443, 57945, 54119, 7659, -10447, -20511, -1879, 6635, 3095, 3144, -2482, -14347, -12768, -21915, -44242, -41172, -23171, -11023, 14369, 67824, 82767, 52453, 28799, 36713, 23781, 10618, 9392, 30843, 54655, 39220, 19044, 2498, -7535, -25303, -49561, -52372, -57900, -49097, -23720, -24359, 4719, 25180, 25003, 14884, 6901, -5906, 1102, 25345, 12443, -26963, -33362, -30010, -20573, -9059, 20031, 45579, 15784, -9698, -27280, -66297, -43281, -12907, -20531, -28755, -38463, -35458, -45745, -29219, -12481, -10296, -12703, -10012, -22552, -14381, -6922, -14890, -25445, -15640, -17408, -2581, 35143, 38376, 21922, 9867, -24410, -37917, -35619, -15708, -10497, -34034]
6018c4034O80K550j384J6920J9676j2424l6913P839K0929k1252j0571K979M590
6005d0415K172N5J7455J7107M1679l638l4074j8989K1231R950j8435l3571k7427
5992f6900L2169J1065j2889L251L4370K0775K6n06k1107n701K160J1048k0881
5979a3120q69K2860j437j5342K436J3212j8259m74K0982p637j1278m76k4284P031
5965b6655J4663P128M004l0297k3331J5375N0970M3861O372l2778p3096l2525
5953g6309K5251J5779K992m463L944q453O793J4148M661q712j9786J454K1493
5940b1208O30M7459Q772l9143q23O566q50r231J0569k815o482J7493k524n782
5926B631p617J2195j6603q579J2049J5006L187J6378j1126l0014q005j1951k7981
$$ y = [-34034, -33354, -30804, -32188, -15268, 4408, -8016, -44929, -37090, -16161, -37413, -47984, -45005, -40415, -38243, -38188, -20733, -3626, 38053, 34415, 341, -18648, 2583, 12533, -5902, -39473, -66900, -34731, -23666, -36555, -33304, 1066, 21841, 21867, 21361, 254, -5447, -3287, 7761, -13120, -13989, 8871, 7434, -7908, -5472, 7740, -10519, -10993, 9989, 2352, -8926, -9402, -33686, -26655, -11992, -4864, -860, -31157, -54488, -39113, 11857, 55718, 62090, 29312, -43784, -76309, -51058, -35279, -32287, -36750, -32806, -41259, -34466, -20318, -15657, -24369, -44155, -42701, -21208, -20578, 26881, 35653, -3490, -4313, 2253, 1403, -7828, 2741, -74, -6556, 10937, 8413, 2631, -4986, 7209, -9394, -17973, -5924, 9082, 12269, 28647, 17521, -12493, -20498, -32449, -60430]
5913f0430j2715Q567K9368L5866j0511n919o433l974L1043K8996k5092k2832J8568
5900D502J7606j2218R292N504r534j6447k3263J124j5375J1202L3844K8138m5158
5887a0783l720j4751j7061J6723K1610J162r76p042J4393L5974k9277r228j0715
5874a3691k1772j3588L4684J0420k2281J8534q692q865J9931J8302n3l0330l805
5861b1206R759J6674J553n410J4706J912O452M60j2959l8293Q269M1246O443k1183
5847H423k1356J4832L3920j4380j0469k3307J691k425j8931K8230N0349q560l9631
5834a614R525L824m065p281j5812J627J7692N598n390J865R048R649m012k1292
5820f38J0625O128l1545k3318o575j5057o224K8381L9613J5144q19L449L5753
$$ y = [-60430, -73145, -64578, -35210, 656, -9855, -15774, -22207, -26181, 4862, 33858, 8766, -14066, 4502, 22108, 9890, 19182, 24686, 15152, -1295, -24558, -23434, -38809, -27607, 6237, 34375, -10783, -14503, -29254, -46315, -29592, -7982, -6820, -7796, -14838, -445, 35529, 6252, -2976, -13691, -35463, -49051, -14367, -3947, -26228, -7694, -16386, -25251, -5320, 12982, 12929, -17401, -21206, -11447, 5227, 6780, 1370, 16076, 17988, 24440, 24900, 11941, -26352, -18083, 23163, 29606, 8423, -12933, 1899, 35819, 21439, 10970, -12337, -10646, -13071, -32002, -3772, 46577, 38017, -1614, 7911, 11735, 7670, 389, -15423, -13796, 3896, 9494, 4104, 5969, 15017, 24666, 20654, -638, 9987, 16115, -15430, -38748, -45323, -60380, -66604, -38223, 1390, 16534, 15715, 19164, 54917]
5807E4917J872j9752k3441j5420J7426J7821k0564k1705p089l941n434N308J4038
5794e964q694l2528j1005J3748Q569J109K4715Q892j8901l263J927J5928K2511
5781A7044j9383j7022P789r153p532l1266j5952P142J9974N779L7260J3161K93
5768H134l0576P270j1920K2842M5821J1162j8046l9684J2999n96K4414J8498j4566
5755C5752q255j316k2426J8076K797R110j4927n5784k1812L5469J7199l9746j5971
5742f1834L8055P283l534Q984N008P796L0932j4434j8968k2081K61j8089J736
5729c8885R052L677J824K6647K5146J4586j7007k3228R984n257J5939k3800J4037
5716A2715J233P837L541o886k4787n133N401J0502K8298j714J6909m871j6809
$$ y = [54917, 56789, 37037, 13596, -1824, 15602, 33423, 12859, -8846, -15935, -19876, -25310, -20002, -5964, -14658, -47186, -58191, -44443, -35874, -34765, -10050, -1158, -20059, -23322, -21395, -5467, 17044, -2339, -19361, -11572, -20725, -28257, -59523, -75475, -68333, -48359, -42580, -5320, 7841, 8134, -22442, -15172, -27092, -4250, 41571, 52733, 34687, -4997, 8002, 7406, 31820, 50318, 35752, 27497, 26181, 3755, 21831, 24628, 33738, 18811, -36973, -58785, -23316, -6117, -45863, -61834, -23779, -16496, -20030, -11046, -6038, 1758, 32690, 18256, -712, -22793, -22532, -40621, -38885, -29833, -26156, -24332, 2315, 27461, 42047, 25040, 1812, 11796, 6539, 22478, -1322, 12715, 13948, 21785, 25326, 18440, -6347, -11480, -6079, 4423, 32721, 31007, 47916, 43045, 26236]
5703B6236j1895j2196J6404k988j9238L113J0728m352k9813J2620M1018J687k5159
5690F165j7637m427j5190J8943K59M342P302J5516j5177q519k859Q535J1002J787
5676A0042n890m285o958m1811J4381M4314k43L364k6639k3483L1729J2963K1940
$$ y = [26236, 14341, 2145, 18549, 15561, -3677, -564, 10164, 5812, -24001, -11381, 29637, 31324, 6165, -11472, -15899, -31089, -12146, -11887, -7545, -243, 15273, 96, -8423, -11282, -2747, 8255, 10042, 4152, -133, -7091, -48902, -34521, 9793, 9550, 12914, -13725, -37208, -5479, 7484, 29424]
$$ [...]
##END NTUPLES=NMR SPECTRUM
##END=
