##TITLE=Analysis number 328340
Compound Code cc 62009
Book Reference 511/126
Project Code adrs
Chemist Name stevem
##JCAMPDX= 6.0         $$ Bruker NMR JCAMP-DX V2.0
##DATA TYPE= NMR SPECTRUM
##DATA CLASS= NTUPLES
##ORIGIN= Bruker BioSpin GmbH
##OWNER= nmr
$$ XWIN-NMR		Version 3.5
$$ Fri May 25 13:50:08 2007 GMT Daylight Time (UT+1h)  MAYBRIDGE\nmr@NMR_250MHZ
##.OBSERVE FREQUENCY= 250.131544655141
##.OBSERVE NUCLEUS= ^1H
##.ACQUISITION MODE= SIMULTANEOUS (DQD)
##.ACQUISITION SCHEME= undefined
##.AVERAGES= 16
##.DIGITISER RES= 18
##SPECTROMETER/DATA SYSTEM= dpx250
##.PULSE SEQUENCE= zg30
##.SOLVENT NAME= CDCl3
##.SHIFT REFERENCE= (INTERNAL, CDCl3, 0, 16.4557)
##AUDIT TRAIL= $$ (NUMBER, WHEN, WHO, WHERE, WHAT)
$$ ##TITLE= Audit trail, XWIN-NMR		Version 3.5
$$ ##JCAMPDX= 5.01
$$ ##ORIGIN= Bruker BioSpin GmbH
$$ ##OWNER= nmr
$$ C:\u/data/dgb/nmr/ADRS/1500/pdata/1/auditp.txt
$$ ##AUDIT TRAIL=  $$ (NUMBER, WHEN, WHO, WHERE, WHAT)
(   1,<2007-05-25 13:49:42.39 +100>,<MAYBRIDGE\nmr>,<NMR_250MHZ>,
      <created by zg, POWCHK disabled, PULCHK disabled
       configuration hash MD5:
       76 6E 9A 78 1E 09 19 81 EC 84 63 8F B0 6A 59 2D
       data hash MD5: 64K
       CC 81 A7 A7 CA FD 47 58 69 B8 56 92 ED 3C 68 77>)
(   2,<2007-05-25 13:49:58.85 +100>,<MAYBRIDGE\nmr>,<NMR_250MHZ>,
      <Start of raw data processing
       ef LB = 0.3 FT_mod = 6 PKNL = 1 SI = 32K 
       data hash MD5: 32K
       32 58 1A B4 CB B1 CC C3 14 6F 7A 99 1D FC CC CF>)
(   3,<2007-05-25 13:50:00.54 +100>,<MAYBRIDGE\nmr>,<NMR_250MHZ>,
      <apk 
       data hash MD5: 32K
       FB 14 AB 8B 83 54 B2 EF 8B 5D 2D E2 8D A8 EA 14>)
(   4,<2007-05-25 13:50:01.21 +100>,<MAYBRIDGE\nmr>,<NMR_250MHZ>,
      <abs ABSG = 5 
       data hash MD5: 32K
       ED CC 89 FE AF BF 7C 07 37 D1 1B 7E 35 62 1F 45>)
$$ ##END=
$$ 
$$ hash MD5
$$ 51 C6 DF 3B FE D2 69 27 31 F7 79 64 A8 D2 50 B3
##$RELAX= 
##$RELAX= 
##$RELAX= 
##$RELAX= 
##$RELAX= 
##$RELAX= 
##$RELAX= 
$$ Bruker specific parameters
$$ --------------------------
##$DU= <C:\u>
##$EXPNO= 1500
##$NAME= <ADRS>
##$PROCNO= 1
##$TYPE= <nmr>
##$USER= <dgb>
##$AMP= (0..31)
100 100 100 100 100 100 100 100 100 100 100 100 100 100 100 100 100 100 
100 100 100 100 100 100 100 100 100 100 100 100 100 100 
##$AQSEQ= 0
##$AQ_mod= 3
##$AUNM= <au_zg>
##$AUTOPOS= <20 >
##$BF1= 250.13
##$BF2= 250.13
##$BF3= 250.13
##$BF4= 250.13
##$BF5= 500.13
##$BF6= 500.13
##$BF7= 500.13
##$BF8= 500.13
##$BYTORDA= 1
##$CFDGTYP= 0
##$CFRGTYP= 5
##$CHEMSTR= <none>
##$CNST= (0..31)
1 1 145 1 1 1 1 1 1 1 1 1 1 1 1 1 1 1 1 1 1 1 1 1 1 1 1 1 1 1 1 1 
##$CPDPRG= <>
##$CPDPRG1= <>
##$CPDPRG2= <>
##$CPDPRG3= <>
##$CPDPRG4= <mlev>
##$CPDPRG5= <mlev>
##$CPDPRG6= <mlev>
##$CPDPRG7= <mlev>
##$CPDPRG8= <mlev>
##$CPDPRGB= <>
##$CPDPRGT= <>
##$D= (0..31)
0 1 0 0 0 0 0 0 0 0.06 0 0 0 0 0 0 0.0002 0 0 0 0 0 0 0 0 0 0 0 0 0 0 
0 
##$DATE= 1180097381
##$DBL= (0..7)
120 120 120 120 120 120 120 120 
##$DBP= (0..7)
150 150 150 150 150 150 150 150 
##$DBP07= 0
##$DBPNAM0= <>
##$DBPNAM1= <>
$$ [...]
##$SUBNAM7= <"">
##$SUBNAM8= <"">
##$SUBNAM9= <"">
##$SW= 20.6930455092707
##$SWIBOX= (0..15)
0 0 3 0 0 0 0 0 0 0 0 0 0 0 0 0 
##$SW_h= 5175.983436853
##$TD= 65536
##$TD0= 1
##$TE= 683.16
##$TE2= 300
##$TE3= 300
##$TEG= 300
##$TL= (0..7)
0 120 120 120 120 120 120 120 
##$TP= (0..7)
150 150 150 150 150 150 150 150 
##$TP07= 0
##$TPNAME0= <>
##$TPNAME1= <>
##$TPNAME2= <>
##$TPNAME3= <>
##$TPNAME4= <>
##$TPNAME5= <>
##$TPNAME6= <>
##$TPNAME7= <>
##$TPOAL= (0..7)
0.5 0.5 0.5 0.5 0.5 0.5 0.5 0.5 
##$TPOFFS= (0..7)
0 0 0 0 0 0 0 0 
##$TUNHIN= 0
##$TUNHOUT= 0
##$TUNXOUT= 0
##$USERA1= <user>
##$USERA2= <user>
##$USERA3= <user>
##$USERA4= <user>
##$USERA5= <user>
##$V9= 5
##$VALIST= <valist>
##$VCLIST= <CCCCCCCCCCCCCCC>
##$VD= 0
##$VDLIST= <DDDDDDDDDDDDDDD>
##$VPLIST= <PPPPPPPPPPPPPPP>
##$VTLIST= <TTTTTTTTTTTTTTT>
##$WBST= 1024
##$WBSW= 4
##$XGAIN= (0..3)
0 0 0 0 
##$XL= 0
##$YL= 0
##$YMAX_a= 347242
##$YMIN_a= -420485
##$ZGOPTNS= <>
##$ZL1= 120
##$ZL2= 120
##$ZL3= 120
##$ZL4= 120
##$ABSF1= 16.45565
##$ABSF2= -4.237522
##$ABSG= 5
##$ABSL= 3
##$ALPHA= 0
##$AQORDER= 0
##$ASSFAC= 0
##$ASSFACI= 0
##$ASSFACX= 0
##$ASSWID= 0
##$AUNMP= <proc_1d>
##$AZFE= 0.1
##$AZFW= 0.1
##$BCFW= 0
##$BC_mod= 0
##$BYTORDP= 0
##$COROFFS= 0
##$CY= 12.5
##$DATMOD= 1
##$DC= 0
##$DFILT= <>
##$DTYPP= 0
##$F1P= 14.0000005364418
##$F2P= -0.99999901652339
##$FCOR= 0.5
##$FTSIZE= 32768
##$FT_mod= 6
##$GAMMA= 0
##$GB= 0
##$INTBC= 1
##$INTSCL= 1
##$ISEN= 128
##$LB= 0.3
##$LEV0= 0
##$LPBIN= 0
##$MAXI= 10000
##$MC2= 0
##$MEAN= 0
##$ME_mod= 0
##$MI= 0
##$NCOEF= 0
##$NC_proc= -3
##$NLEV= 6
##$NOISF1= 0
##$NOISF2= 0
##$NSP= 0
##$NTH_PI= 0
##$NZP= 0
##$OFFSET= 16.45565
##$PC= 1
##$PHC0= -57.20853
##$PHC1= 8.955932
##$PH_mod= 1
##$PKNL= yes
##$PPARMOD= 0
##$PSCAL= 4
##$PSIGN= 0
##$REVERSE= no
##$SF= 250.130016594011
##$SI= 32768
##$SIGF1= 0
##$SIGF2= 0
##$SINO= 400
##$SIOLD= 32768
##$SREGLST= <1H.CDCl3>
##$SSB= 0
##$STSI= 32768
##$STSR= 0
##$SW_p= 5175.98343685301
##$SYMM= 0
##$S_DEV= 0
##$TDeff= 65536
##$TDoff= 0
##$TI= <Analysis number 999999
Compound Code 99
Book Reference 9
Project Code 9>
##$TILT= no
##$TM1= 0
##$TM2= 0
##$TOPLEV= 0
##$USERP1= <user>
##$USERP2= <user>
##$USERP3= <user>
##$USERP4= <user>
##$USERP5= <user>
##$WDW= 1
##$XDIM= 32768
##$YMAX_p= 477861607
##$YMIN_p= -96649
$$ End of Bruker specific parameters
$$ ---------------------------------
##NTUPLES= NMR SPECTRUM
##VAR_NAME=  FREQUENCY,     SPECTRUM/REAL,   SPECTRUM/IMAG
##SYMBOL=    X,             R,               I
##VAR_TYPE=  INDEPENDENT,   DEPENDENT,       DEPENDENT
##VAR_FORM=  AFFN,          ASDF,            ASDF
##VAR_DIM=   32768,         32768,           32768
##UNITS=     HZ,            ARBITRARY UNITS, ARBITRARY UNITS
##FACTOR=    0.157963299565203, 1,           1
##FIRST=     4116.05209000555, 0,            0
##LAST=      -1059.93134684746, 0,           0
##MIN=       -1059.93134684746, -96649,      0
##MAX=       4116.05209000555, 477861607,    0
$$ Real data points
##PAGE= N=1
##DATA TABLE= (X++(R..R)), XYDATA
$$ [...]
##PAGE= N=2
##DATA TABLE= (X++(I..I)), XYDATA
16329F79598k3064J2881K1818Q896J8593J3923r534K020q330j7795m593R30O315
16316G01658J670o286J7756Q049j9836m494m429j7087k200J4207K1110J8356j4578
16303G13896n109j661O823o578J6232J3727k366N273J4059j1632q118J727j4778
16290G21495M864n475r60j3963K233K1126j091k324j6074M197J156k6267k819
16277F86098J7870K2928M84j735K097q045j2958Q939K0375J402k860j1106K8218
16264G51707O922k6511m7866L162J9391M0687J1188J3569N430j7764k4949j5377
16252G19589L289K8917K4547j0351N28L167m607K552q150p854K212Q778N431P001
16238G75049l016K1738K274l4598k7834m636L420K5223K2258M11j3210q358J3429
$$ plain form
16329 679598 656534 669415 691233 700129 718722 732645 723111 725131 716801 699006 694413 695343 701658
16316 701658 703328 697042 714798 722847 703011 698517 694088 677001 674801 689008 710118 728474 713896
16303 713896 708787 707126 713949 707371 723603 737330 734964 740237 754296 742664 734546 736273 721495
16290 721495 726359 720884 719924 705961 708194 729320 728229 725905 709831 714028 715184 688917 686098
16277 686098 703968 726896 727380 725645 727742 719697 706739 715678 736053 737455 734595 723489 751707
16264 751707 758629 732118 684252 687414 706805 747492 758680 772249 777679 759915 734966 719589
16252 719589 722878 751795 776342 765991 766519 769686 765079 767631 759481 751627 753839 762617 768048 775049
16238 775049 772033 793771 796045 761447 733613 728977 732397 757620 779878 780289 767079 758721 772150
16225G72150m236m923m281Q935m186N809J5626J5151R495j2388l60r634m056N941
16211G89043J4926j0582j8751J9011J8619k319l601q181Q856L813M646m673j1690
16198G99117K0860j9291K492m121q001J1632J1505q003K251Q398q781l276J5018
16185H19800J7145Q563j4160r015k4959k7998J5757k284l554J6250K4998R131
16173H29674m743k8672j4729K0193M37m152L2944J3877k0351k4572k593j8749
16161G78564J7325J6422j0572j0494J6519k326L426K4537O707k087p768K9389
16149H59642J1353R065j8209k7459p587J7091R727j8403N663J8956N511j6139
16137H49211K468J1921j3297j4057N267P737j2423m826J9246J6194q757J580O531
$$ plain form
16225 772150 767914 762991 758710 767645 763459 769268 784894 800045 809540 797152 796792 787158 783102 789043
16211 789043 803969 793387 774636 793647 812266 809947 806346 798165 807021 810834 815480 810807 799117
16198 799117 819977 800686 803178 799057 791056 802688 814193 806190 808441 816839 808058 804782 819800
16185 819800 836945 845508 831348 822333 797374 769376 785133 782849 779295 795545 820543 829674
16173 829674 824931 796259 781530 801723 802160 798008 830952 844829 824478 799906 797313 778564
16161 778564 795889 812311 801739 791245 807764 805438 808864 833401 840108 838021 830253 859642
16149 859642 870995 880060 861851 834392 826805 843896 853623 835220 840883 859839 865350 849211
16137 849211 851679 863600 850303 836246 841513 849250 836827 832001 851247 867441 858684 860264 866795
16124H66795j0196j3662l647R54q091j0967O440J0537j4923J8792M782q859J1326
16111H49281o626j955j2322j6224p466J395J1987n150k463m251J8775K263l1J6967
16097H44180K6273J4462q400K1679J0147j7370j0407j1064j0755q608L4006J331
16085H85474J0848J7297l903q384J4497l5349j4222J838j3645k7504J2366K8245
16073H67558P16L079J696m927p508o074j9616O595n68N140K3942Q111k331L820
16059H79633J5929j8238l887j1809r123P942K1301l729R013k0094J0315m935K2252
16046H94570P157K5951p186q079m007l0138j5286j8730O704J8180J8855K5638
16034I13629J3933k2837Q701J9275r87J714k1636Q47Q395O213j7144j3857J0112
$$ plain form
16124 866795 856599 842937 839290 840244 832153 821186 827626 838163 823240 842032 846814 837955 849281
16111 849281 842655 840700 828378 812154 804688 806083 818070 812920 810457 806206 824981 827244 827213 844180
16097 844180 870453 884915 876515 898194 908341 890971 880564 869500 858745 850137 884143 885474
16085 885474 896322 913619 909716 901332 915829 880480 866258 868096 854451 826947 839313 867558
16073 867558 868274 871353 873049 868122 860614 854540 834924 841519 840951 846091 870033 878144 875813 879633
16059 879633 895562 877324 873437 861628 852505 860447 881748 878019 887032 866938 877253 872318 894570
16046 894570 901727 927678 920492 912413 908406 878268 862982 844252 850956 869136 887991 913629
16034 913629 927562 904725 913426 932701 931714 933428 911792 912639 921034 927247 910103 896246 906358
16021I06358J2352O129j0845k839J8186J4033m279j1453r134k859m788J031n0
16008I11842j1650j3616L980J2191K4135m932m474j040k553q110j368j9548O25
15995H85482K3412p435K1407O856j9626k6010J0828L2109J4302J1047k033K3649
15983I73988M443m5849k8108J5315J4701K4598j6125P975J8086j1749Q438J8480
15971I84193j8280k2003Q130N352j2197j9147j1784P615Q733j1716j3952j2951
15959H91993L1093K6021J7860L789j0846j3163r615K9234L485J3981j428k8885
15947I53519q028J1822J9334J2940j4191k719J0309J1936J271j1680K334O691
15935I93538k734j8735j7345n586O417J107j976o641K9946j0187j1788J3248N533
$$ plain form
16021 906358 918710 924839 913994 911155 929341 943374 939095 927642 918508 915649 910861 911892 911842
16008 911842 900192 886576 890556 902747 926882 921950 917476 916436 913883 905773 904405 884857 885482
15995 885482 908894 901459 922866 929722 910096 884086 894914 927023 941325 952372 950339 973988
15983 973988 978431 932582 904474 919789 934490 959088 942963 950938 969024 957275 965713 984193
15971 984193 965913 943910 952040 957392 945195 926048 914264 921879 930612 918896 904944 891993
15959 891993 923086 949107 966967 970756 959910 946747 937132 966366 969851 983832 982404 953519
15947 953519 945491 957313 976647 989587 975396 972677 982986 994922 996193 984513 986847 993538
15935 993538 990804 972069 954724 949138 955555 956662 954686 948045 977991 967804 956016 969264 974797
15922I74797M257J860O858J555M210o176q374j9335l591m065J5736L1983k3837
15909I75878j4449J1164j6345K434K2271J3013J0260k9086l0969N835K0692J1516
15897I82214n176j1883K291J966k769K969K43J1521P701P087q253j2474M752L63
15883I80552K028m050j0865k426J3656J1487J315r019j7605O121J451m533J2638
15870I80750K1866r078m084K7238q777k4797J6802j2895R687J8636Q29j038K349
15857A017488j3943m319J2926Q10J2612K1526k4999j1454J9993J3283k3376j2135
15845A008412o378J7862J6470j5033j1748K325K996k5Q573n161L0626K5699j868
15832A072750J222k0337j0153K8433K5782J1229r400n370j8722j6031P563m915
$$ plain form
15922 974797 979054 980914 987772 989327 993537 987361 978987 959652 956061 951996 967732 999715 975878
15909 975878 961429 972593 956248 958682 980953 993966 1004226 975140 944171 950006 970698 982214
15897 982214 977038 965155 967446 969412 966643 969612 969855 981376 989077 996164 987911 975437 980189 980552
15883 980552 982580 978530 967665 965239 978895 990382 991697 982678 965073 971194 972645 968112 980750
15870 980750 1002616 993538 989454 1016692 1007915 983118 999920 987025 996712 1015348 1016177 1015139 1017488
15857 1017488 1003545 999226 1012152 1012962 1025574 1047100 1022101 1010647 1030640 1043923 1020547 1008412
15845 1008412 1002034 1019896 1036366 1021333 1009585 1011910 1014906 1014881 1023454 1018293 1048919 1074618 1072750
15832 1072750 1073972 1053635 1043482 1071915 1097697 1108926 1099526 1094156 1075434 1059403 1066966 1062051
15820A062051J7121M664k7455Q336J5232J3593j0234l396p652J2781k3527l3186
15808A028328k3964J6029J0513P42J5929k678j328N94j714M616J332k91K1294
15795A069402K0915J7683N61l3274l4393q222J5701J1781J5502K2844p769P91
15783A091522J0861K5389j917k2529r569p127n755M546j4710J3096J2644j4187
15771A082264j677K8984L335Q40j2203j8495q562J1805J6086j1386j3072l245
15759A074674J4870J0190j0075j8065J449j0313l478J3010n18O093j399j79P12
15746A076971J5558R498J2249k3568q864J2108M197J1860O022J0360K1839r304
15734A138926j9173n202j538n517m58J3854P877n759r131j514j5952p950r359
$$ plain form
15820 1062051 1079172 1083836 1056381 1064717 1079949 1093542 1083308 1079912 1072260 1085041 1061514 1028328
15808 1028328 1004364 1020393 1030906 1031648 1047577 1044899 1043571 1044165 1042451 1047067 1048399 1048108 1069402
15795 1069402 1090317 1108000 1108561 1075287 1040894 1032672 1048373 1060154 1075656 1098500 1090731 1091522
15783 1091522 1102383 1127772 1125855 1103326 1093757 1086630 1080875 1085421 1070711 1083807 1096451 1082264
15771 1082264 1080587 1109571 1112906 1113746 1101543 1083048 1074486 1086291 1102377 1090991 1077919 1074674
15759 1074674 1089544 1099734 1089659 1071594 1073043 1062730 1059252 1072262 1071744 1077837 1076438 1076259 1076971
15746 1076971 1092529 1102027 1114276 1090708 1081844 1093952 1098149 1110009 1116031 1126391 1148230 1138926
15734 1138926 1119753 1114551 1113013 1107496 1107038 1120892 1128769 1123010 1113879 1112365 1096413 1088463 1079104
15721A079104P01K4009M508O020q608K7050J5696J1257j2299j4841k322M892R616
15708A144783L8k4792l2278K3981K7370Q452k4142l542O264L199K7257l980k914
15695A149696J1206M204l648O706Q844r438K803K4948j9719k3069k2861j7876
15683A111796M922J185J8684m099k661L0338J9156k9558l894J6752j1185J2459
15671A163895j1810O583Q482o812p895O061M111m444J4615J1513k273j9282k9087
15658A133657K6316K8016K827l749o229n0458j2856J2896J7710N500K813K237
15646A158680P596Q139L916l190k075J2225j73N946k793j1163l177n432M517P56
15632A173772M643L151M859N593J3814r921k2822l628Q983R329J3691M680r730
$$ plain form
15721 1079104 1079805 1103814 1108322 1114342 1105734 1132784 1148480 1159737 1147438 1132597 1130275 1135167 1144783
15708 1144783 1144821 1120029 1087751 1111732 1139102 1147554 1123412 1119870 1126134 1129333 1156590 1152610 1149696
15695 1149696 1160902 1165106 1161458 1168164 1177008 1167570 1170373 1195321 1175602 1152533 1129672 1111796
15683 1111796 1116718 1117903 1136587 1132488 1129827 1160165 1179321 1149763 1145869 1162621 1151436 1163895
15671 1163895 1152085 1158668 1167150 1160338 1152443 1158504 1162615 1158171 1172786 1184299 1182026 1162744 1133657
15658 1133657 1159973 1187989 1190816 1187067 1180838 1130380 1117524 1130420 1148130 1153630 1156443 1158680
15646 1158680 1166276 1174415 1178331 1175141 1173066 1185291 1185118 1191064 1188271 1177108 1173931 1168499 1173016 1173772
15632 1173772 1178415 1181566 1186425 1192018 1205832 1195911 1173089 1169461 1178444 1187773 1201464 1206144 1196414
15619A196414J770k05j1477r395j0225J0736J7694o068j4348j3477r503N290J4201
15606A171407J0556L526n939J2848K5111j2049j153J1989j4191j5934Q192q649
15594A185714J9169J2669K0736Q608j1367K954J1968k706J9807m346k8852o637
15582A227717J2854o812O435J6949o259j6036k9799N110J100k0169K186Q200K7291
15569A228767K4234j1898j4487q474m142k2021K2314J8710l134j9812M073n316
15557A208814J019K8043m232j084J7165J5683k0789j3530J9322r261n213r09J2701
15544A247729n142l568m80R939K5413m330o622j1127k2624k272P983O585J4631
15531A256115J8605q633L1019Q786k7436k92k90J4631K2171N158j0758l0998j4369
$$ plain form
15619 1196414 1198184 1197979 1186502 1177107 1166882 1177618 1195312 1189244 1174896 1161419 1151916 1157206 1171407
15606 1171407 1181963 1185489 1179550 1192398 1217509 1205460 1204307 1216296 1202105 1186171 1194363 1185714
15594 1185714 1204883 1217552 1238288 1246896 1235529 1238483 1250451 1247745 1267552 1263206 1234354 1227717
15582 1227717 1240571 1233759 1240194 1257143 1250884 1234848 1205049 1210159 1211259 1191090 1193276 1201476 1228767
15569 1228767 1253001 1241103 1226616 1218142 1214000 1191979 1214293 1233003 1229869 1210057 1214130 1208814
15557 1208814 1209833 1237876 1233644 1232560 1249725 1265408 1244619 1231089 1250411 1241150 1235937 1235028 1247729
15544 1247729 1242587 1239019 1238539 1248478 1273891 1269561 1262939 1251812 1229188 1226916 1234899 1241484 1256115
15531 1256115 1274720 1266087 1297106 1305892 1278456 1278164 1277874 1292505 1314676 1319834 1309076 1278078 1263709
15518A263709J4693N821k2790j3665j839J028M386K2625L1553N308j8492J40k87
15505A292190R715j4873j996P737k9447N801L472O879Q447L5499P410J359j5457
15492A316736j1172k0614j0768J8909J2679l254L216J9388Q8j1421l232m673l492
15479A302390j3316K7253J5132l9982l3246k924K5925J8153J8240nk9007l0808
15467A257805J6753L1284L2978J940j0599j3510O381r983R002m997n380j934K2671
15454A332411K6610j406J2819k5547k9146K3419j745j8993j5089O513K7388J0065
15442A347299j821j4075r488k1655J6037K2355p966P003o217P305k823k0627n500
15429A309827K5174K1589J5600J2277l4257Q56J1009j8444j3960N980J4916j319
$$ plain form
15518 1263709 1278402 1284223 1261433 1247768 1245929 1246957 1251343 1273968 1305521 1310829 1292337 1292477 1292190
15505 1292190 1301905 1287032 1285036 1292773 1263326 1269127 1272599 1279478 1287925 1323424 1330834 1332193 1316736
15492 1316736 1305564 1284950 1274182 1293091 1305770 1302516 1305732 1325120 1325208 1313787 1310555 1305882 1302390
15479 1302390 1289074 1316327 1331459 1291477 1258231 1255307 1281232 1299385 1317625 1317620 1288613 1257805
15467 1257805 1274558 1305842 1338820 1340760 1330161 1316651 1323032 1313049 1322051 1317054 1311674 1309740 1332411
15454 1332411 1359021 1357615 1370434 1344887 1315741 1339160 1337415 1318422 1303333 1309846 1337234 1347299
15442 1347299 1345478 1331403 1321915 1300260 1316297 1338652 1330686 1337689 1331472 1338777 1335954 1315327 1309827
15429 1309827 1335001 1356590 1372190 1384467 1350210 1351066 1362075 1343631 1329671 1335651 1350567 1349248
15417A349248l1816J8037K0246j126J8800j8470M147K1363K107j709j4731k6257
15405A339839k405M0079j4332R171K974N42M192m444j3679M464n346j4342O872
15392A353585K3235K3859p962p956M072l961K187J1723j1038K0465k445k4630
15380A381134r082M366N110Q155J7177K0197j8518k1791j7520O145J7098J6807
15368A409278R327p254j8187l909j2202N92J8321K4237J6424j2457j6817l1766
15356A375587j5725k519K7418M1695l284j1495j5292j7446J8096K1908J7344l436
15344A432851l2144P926L2958J3612k436j3915j1073j1211o742r467J09n579J1757
15331A406646M569O498m968j0268Q46L6767K4012J8158k571m4987p970Q341j7360
$$ plain form
15417 1349248 1317432 1335469 1355715 1354589 1373389 1354919 1359066 1380429 1382536 1380827 1366096 1339839
15405 1339839 1337434 1377513 1363181 1372352 1375326 1375868 1380060 1375616 1361937 1366401 1361055 1346713 1353585
15392 1353585 1376820 1400679 1392717 1384761 1388833 1384872 1387059 1398782 1387744 1408209 1405764 1381134
15380 1381134 1372052 1376418 1381528 1389683 1406860 1427057 1408539 1386748 1369228 1375373 1392471 1409278
15368 1409278 1418605 1411351 1393164 1389255 1377053 1377645 1395966 1420203 1436627 1424170 1407353 1375587
15356 1375587 1359862 1357343 1384761 1426456 1423172 1411677 1396385 1378939 1397035 1418943 1436287 1432851
15344 1432851 1400707 1408633 1441591 1455203 1452767 1438852 1427779 1416568 1409826 1400359 1400468 1394889 1406646
15331 1406646 1411215 1417713 1412745 1402477 1403323 1440090 1464102 1482260 1479689 1434702 1426732 1435073 1417713
15318A417713O427j1505o906k292J5871K3153N489j0626j905O730j3220k1496
15306A407433L963L2530n305p302J6522O250n347P824K417M222j017Q408j039
15293A469559k5146R607m060j0010K3312K2868j2035K403K3388q0l6648j6659
15281A446499q39p982K4724M564j6237Q987Q407K5314L4914L089j1392j2784j8898
15268A488366j3705L327k190K5616r37q674j480K4347j9990j9811J6403K2588
15256A513860o836j2116O081j7193J6675K5034O081j0761J3593J0290P50p719
15244A537739K1697j0215o952j1613k0434k2926N46K2592j2880j7287J8635K448
15232A501350K477j943j411K0971k5077k0008Q931K3719J4934k786J4051l443
$$ plain form
15318 1417713 1424140 1412635 1405729 1403437 1419308 1442461 1447950 1437324 1435419 1442149 1428929 1407433
15306 1407433 1411396 1443926 1438621 1431319 1447841 1454091 1448744 1456568 1458985 1463207 1462190 1470598 1469559
15293 1469559 1444413 1454020 1449960 1439950 1463262 1486130 1474095 1476498 1499886 1499806 1463158 1446499
15281 1446499 1445660 1437678 1462402 1466966 1450729 1459716 1468123 1493437 1528351 1531440 1520048 1507264 1488366
15268 1488366 1474661 1477988 1475798 1501414 1500477 1491803 1490323 1514670 1494680 1474869 1491272 1513860
15256 1513860 1507024 1494908 1500989 1483796 1500471 1525505 1531586 1520825 1534418 1544708 1545458 1537739
15244 1537739 1559436 1549221 1542269 1530656 1510222 1487296 1487842 1510434 1497554 1480267 1498902 1501350
15232 1501350 1503827 1501884 1500473 1521444 1496367 1476359 1485290 1509009 1523943 1521157 1535208 1531765
15220A531765k6938j4822J6928J0707P241m391Q889J1532J3172J6722o756J2922
15208A576971p21n144N741m322k9827K4329J5304J1787L1851J5580o527k3884
15196A611138l1439k060J1772j5802l2510Q836K6095J061k0532p194n173K5975
15184A570167K6810l599J2010n49k1859q52R692j9030n128q230O597k269M806
15171A568566J2172n626n887m447k6296j5397K4840K5098J123J1076j1456k529
15159A571237J9767L047p922k2085K1986J4846J2371J496J5607o115k6473J4005
15147A611767q584j7559J89M1031K9397j0644m912R200j416N99k6394j0695K1383
15134A633362J6715p794l3954J810l241J1747P587n735j9475O542J0068j1171
$$ plain form
15220 1531765 1504827 1490005 1506933 1517640 1524881 1520490 1529379 1540911 1554083 1570805 1564049 1576971
15208 1576971 1576250 1571106 1576847 1572525 1542698 1567027 1582331 1594118 1625969 1641549 1635022 1611138
15196 1611138 1579699 1577639 1589411 1573609 1541099 1549935 1576030 1577091 1556559 1549365 1544192 1570167
15184 1570167 1596977 1593378 1605388 1604839 1582980 1582128 1591820 1572790 1567662 1559432 1566029 1563760 1568566
15171 1568566 1580738 1575112 1569225 1564778 1538482 1523085 1547925 1573023 1574146 1585222 1573766 1571237
15159 1571237 1591004 1594051 1586129 1564044 1586030 1600876 1613247 1614743 1630350 1624235 1597762 1611767
15147 1611767 1603183 1585624 1585813 1626844 1656241 1645597 1640685 1649885 1648469 1649068 1622674 1611979 1633362
15134 1633362 1650077 1642283 1608329 1610139 1606898 1618645 1626232 1620497 1601022 1607564 1617632 1606461
15122A606461J7193Q707r838J0839p023L2241K6976M261k2497j1373O445J7195
15110A679587J1764j5355j3577J05K663j880L0575Q799k0935K6445J1234j4567
15098A704858J740J8919o872m310p248O88k098O410K4104L8911j9764k4144o270
15085A724924M236j8019k1793j1987J7829j0854K453O126L1522R977j898P784
15073A740300j0780q97j4651K0207J6817j8754k9191j2885l828K821l350K3524
15061A709333J5790J507O233j8477K0125J5907n196j0874J3947J2634j7625k3384
15049A719920N590j2104J4996K4081J0153J1753q676p060J1759J2659l2557O21
15037A751135J6814J4386N348j040J0125N590l993m25j6292J0227l177J131P307
$$ plain form
15122 1606461 1623654 1632361 1622523 1633362 1626339 1658580 1685556 1689817 1667320 1655947 1662392 1679587
15110 1679587 1691351 1675996 1662419 1662524 1665187 1663307 1693882 1702681 1681746 1708191 1719425 1704858
15098 1704858 1706598 1725517 1718645 1714335 1707087 1707775 1705677 1712087 1736191 1775102 1755338 1731194 1724924
15085 1724924 1729160 1711141 1689348 1677361 1695190 1684336 1686789 1692915 1724437 1734414 1732516 1740300
15073 1740300 1729520 1728623 1713972 1734179 1750996 1732242 1703051 1690166 1686338 1689159 1685809 1709333
15061 1709333 1725123 1726630 1732863 1714386 1734511 1750418 1745222 1734348 1748295 1760929 1743304 1719920
15049 1719920 1725510 1713406 1728402 1752483 1762636 1774389 1765713 1758653 1770412 1783071 1750514 1751135
15037 1751135 1767949 1782335 1787683 1786643 1796768 1802358 1798365 1797940 1781648 1791875 1788698 1789829 1797136
15024A797136K2595J3646J4618n036Q638J3302J0737j6888m154J8079K4521J1868
15012A909062j8957j790R566K5791j3057j6241Q732J7613K3312K0172K6840L4842
15000B025885L6196J1676K3125M1201K4985P5603Q1853L1934l4729l62787o44840
14989A310102j90050Q9262R6306O5960N9342L9334M3842M5335L2395L870K2897
14978A618595r97p585J7905L2545k625J336J3532l155J3673J3363K7264r322l1546
14965A682983l6071J9841j334M217J069J6780J9715J0081K8526K1447J1048j9629
14953A758673j4682j2965K306J9613J0030k8176j066J7380q718J3903r614P58
14941A747442J9936J2257K051j633M153K2066m604p12k096M852j639o426m053
$$ plain form
15024 1797136 1819731 1833377 1847995 1842959 1851597 1864899 1875636 1858748 1854594 1872673 1897194 1909062
15012 1909062 1890105 1888315 1897881 1923672 1910615 1894374 1903106 1920719 1944031 1964203 1991043 2025885
15000 2025885 2062081 2073757 2096882 2138083 2163068 2238671 2320524 2352458 2317729 1954942 1310102
14989 1310102 1120052 1209314 1305620 1371580 1430922 1470256 1514098 1559433 1591828 1595698 1618595
14978 1618595 1617598 1610013 1627918 1660463 1657838 1659174 1672706 1669551 1683224 1696587 1723851 1714529 1682983
14965 1682983 1646912 1666753 1665419 1669636 1670705 1687485 1707200 1717281 1745807 1767254 1778302 1758673
14953 1758673 1743991 1731026 1733332 1752945 1762975 1734799 1733733 1751113 1742395 1756298 1746684 1747442
14941 1747442 1767378 1779635 1781686 1780053 1784206 1806272 1801668 1800956 1798860 1803712 1802073 1795647 1791594
14928A791594N222Q485j2758j7104O633J7084K8127K040j423J852J5258j1161
14916A833849n273l280J5865k883l1924J6621J7091Q109L612j4861j7528N279
14904A824677L2951K4543j4592j7655j3612K6767L626Q267J7304k1417k971n716
14892A862172M248j2146j120K7709L678k701K2770J007k3861K639L0433K0319
14880A935147q813n528p222k5019k2126K1788J9697L8609O015k0446m0890o901
14868A884311m614J254m005L772J8727J6371K4386J2184O275j7742j8031m046
14856A918842K2867Q500m020O549K2897j3493k6141q851P071j8846p060K4201
14844A932516L375K564J1633K9780K7307m667j0790j7532k265j4946R722J9346
$$ plain form
14928 1791594 1796816 1805301 1792543 1775439 1782072 1799156 1827283 1829323 1827900 1829752 1845010 1833849
14916 1833849 1828576 1825296 1841161 1838278 1806354 1822975 1840066 1848175 1851787 1836926 1819398 1824677
14904 1824677 1857628 1882171 1867579 1849924 1836312 1863079 1866705 1874972 1892276 1870859 1867888 1862172
14892 1862172 1866420 1854274 1853154 1880863 1884541 1881840 1904610 1905617 1881756 1884395 1914828 1935147
14880 1935147 1926334 1920806 1913584 1888565 1866439 1888227 1907924 1946533 1952548 1932102 1891212 1884311
14868 1884311 1879697 1880951 1876946 1880718 1899445 1915816 1940202 1952386 1958661 1940919 1922888 1918842
14856 1918842 1941709 1950209 1946189 1952738 1975635 1962142 1936001 1927150 1934221 1915375 1908315 1932516
14844 1932516 1935891 1938455 1950088 1979868 2007175 2002508 1991718 1974186 1971921 1956975 1966697 1986043
14832A986043J2075n237K800j2032j0226j615K2812m627l8020J112K4316K1939
14820A999340M593J003r606O130m691j2349R550j2200q515j6094K5697J2971J558
14807A997387K2681K7331o360l6505q341m300j8072J6230J6280l486M3521j4014
14795B032352m2068p75L211J7077K4004L6463k364l5353k0893J0303O656Q90J6821
14782B046324J8011K2682j0059o945j0801J212j2204J3353J0060j728j2836r189
14770B047880j0356K0210o079j9968k448J6279k3599j5599J2931M554Q13P288
14758B031906J9686M5235K3387r872j703j8755j9528J5571J4383j4175J4626R440
14746B110201J0541j2015n02j170m095j795J5406J5403j6710j1872L562j026L683
$$ plain form
14832 1986043 1998118 1992881 1995681 1983649 1973423 1971808 1994620 1989993 1951973 1953085 1977401 1999340
14820 1999340 2003933 2004936 1995330 2001460 1996769 1984420 1993970 1981770 1973255 1957161 1982858 1995829 1997387
14807 1997387 2020068 2047399 2041039 2004534 1996193 1991893 1973821 1990051 2006331 2002845 2046366 2032352
14795 2032352 1990284 1989509 1992720 2009797 2033801 2070264 2067900 2032547 2011654 2021957 2028613 2029503 2046324
14782 2046324 2064335 2087017 2076958 2070013 2059212 2060424 2048220 2061573 2071633 2069905 2057069 2047880
14770 2047880 2037524 2057734 2051655 2031687 2029239 2045518 2021919 2006320 2019251 2023805 2024618 2031906
14758 2031906 2051592 2096827 2120214 2110342 2108639 2089884 2070356 2085927 2100310 2086135 2100761 2110201
14746 2110201 2120742 2108727 2108225 2107055 2102960 2101165 2116571 2131974 2115264 2103392 2106954 2105928 2109611
14733B109611M020K5671K021M175J1975r540r978J0416L1711j0196j5065j67q959
14720B145695j3923k2813j1223J9085R476j557L4737J107j1091j2166j6166J9368
14708B140529O10j3216O314K3539K9581L004o959J572Q976q382l379k6262J6616
14695B172543J2820l843m864k003l725l790L1870J2628Q648J6974L328O000n187
14682B241399K07r699J7291P299o660k6267J1448P817k362m645J9521K8033j3923
14669B269459j7790j1421o739j883k338J2601J7923K1895j107m303j1175m893
14657B260229n622l708J0984p14K588Q375J2784n299j3063j089K9744j4957P206
14644B287458L0135p215L777m713j8292j5701N319q109k099k318K6715K2666P434
$$ plain form
14733 2109611 2113631 2139302 2141323 2145498 2157473 2147933 2137955 2148371 2180082 2169886 2154821 2154654 2145695
14720 2145695 2131772 2108959 2097736 2116821 2126297 2124740 2159477 2160584 2149493 2137327 2121161 2140529
14708 2140529 2141139 2127923 2134237 2157776 2187357 2190361 2183402 2184974 2193950 2185568 2182189 2155927 2172543
14695 2172543 2185363 2181520 2176656 2174653 2170928 2167138 2199008 2211636 2220284 2237258 2240586 2246586 2241399
14682 2241399 2241606 2231907 2249198 2256497 2249837 2223570 2235018 2242835 2240473 2235828 2255349 2283382 2269459
14669 2269459 2251669 2240248 2233509 2231626 2229288 2241889 2259812 2281707 2280600 2276297 2265122 2260229
14657 2260229 2254607 2250899 2261883 2261169 2263757 2272132 2284916 2279617 2266554 2265465 2295209 2280252 2287458
14644 2287458 2317593 2310378 2314155 2309442 2291150 2275449 2280768 2272659 2270560 2268242 2294957 2317623 2325057
14631B325057j9366P05o856J2074k55O9R432J3962L921L8555K0977k3877n113
14618B369285K2731%k1190K344J0808K0012Q085j0220k7722K307J9975k129j15
14605B394171P402j0249o033j0752Q22J7329J1500j7226L296j209k3914O694K0236
14592B392067K8552J3898M911p602l976p079m554Q40j046J7717K2264K2061J4573
14579B492626j0088m725L079r021J286J9373K4273j1185o765j4713K8458J5208
14567B527806q778j2902N791K434j0052k5159J6188L3204L3605N118n894q741
14555B552620J1436L2618J6270J6578J2734M097j9193m9723n3090m1855l5251
14544B447241l0073k6393k9531q775J5403R398J4996L8872j6227j9102Q316J7036
$$ plain form
14631 2325057 2305691 2306396 2299540 2311614 2311359 2311428 2320860 2334822 2338743 2377298 2398275 2374398 2369285
14618 2369285 2392016 2392016 2370826 2373170 2383978 2403990 2412075 2401855 2374133 2376440 2396415 2394286 2394171
14605 2394171 2401573 2391324 2385291 2374539 2375361 2392690 2404190 2386964 2390260 2389051 2365137 2371831 2392067
14592 2392067 2420619 2434517 2439428 2431826 2427850 2420771 2416217 2417057 2416011 2433728 2455992 2478053 2492626
14579 2492626 2482538 2477813 2480892 2471871 2473157 2492530 2516803 2505618 2498853 2484140 2512598 2527806
14567 2527806 2519028 2506126 2511917 2514351 2504299 2479140 2495328 2528532 2562137 2567255 2561361 2552620
14555 2552620 2564056 2596674 2612944 2629522 2642256 2646353 2627160 2577437 2524347 2482492 2447241
14544 2447241 2417168 2390775 2361244 2352469 2367872 2377270 2392266 2431138 2414911 2395809 2404125 2421161
14532B421161Q727J9988K2923J0377l6516k114K9018M7848k860k1381P279K5849
14520B530299J3569k8857o657J0554p975l978L273M968L931q457j1865n322n440
14507B488043L7153J8080L2044o855j3045J5588J2793L0113J3445j1791k3965
14496B591603q511M2380j454l1070q898L022j1096J298l007l91L397j4419N534
14483B568388N255J7023J5286l907J8006j6231p028J5552r18m906K6780K7567
14471B660867K3279j170k9623O598K7199K6551n190j2154q973m221k4370J7886
14459B676679L0937J5163j2460j733L644n51L7055j1675q288P522j1031m07J5727
14446B740582j3439j281l604J8610J4655J8718R353j0333J0683L5994j7940k6811
$$ plain form
14532 2421161 2429888 2449876 2472799 2483176 2446660 2444546 2473564 2521412 2518552 2497171 2504450 2530299
14520 2530299 2543868 2515011 2508354 2518908 2510933 2506955 2510228 2515196 2519127 2510670 2498805 2493483 2488043
14507 2488043 2525196 2543276 2575320 2568465 2555420 2571008 2583801 2613914 2627359 2615568 2591603
14496 2591603 2583092 2625472 2624018 2592948 2584050 2587072 2575976 2577274 2574267 2573876 2577273 2562854 2568388
14483 2568388 2573643 2590666 2605952 2602045 2620051 2603820 2596792 2612344 2611426 2606520 2633300 2660867
14471 2660867 2684146 2682976 2653353 2659951 2687150 2713701 2708511 2696357 2687384 2683163 2658793 2676679
14459 2676679 2707616 2722779 2710319 2708586 2712230 2711679 2748734 2737059 2728771 2736293 2725262 2724855 2740582
14446 2740582 2727143 2725862 2722258 2740868 2755523 2774241 2783594 2773261 2783944 2819938 2801998 2775187
14434B775187K2780J5597k3577P986L0557q679k2723O36r079J9990j4364j2788
14422B781523J0670J4165K2826L20m614J353q499m483L114K523R031j5740m903
14409B807286P194Q342N003l608Q326J8184r09k016j223j3514r318K0147L4446
14396B878340r067J3561K5174l080j0003K888J1139r1O246J9052N423L68j1422
14383B928528j2735K1391J2236L254k721R364k64J581k4017k3641k0910M049J7533
14370B913648Q296j6310J8687J1625k0087Q672L0029K1148O774r071k6246o757
14358B940408P772K810p016K6436K5132K7701j0238k0409p441J0159J536J8198
14346C015048R183j3108J1244m073l525J1181Q707K5042m541l3951j1883K1124
$$ plain form
14434 2775187 2797967 2813564 2789987 2797973 2828530 2819851 2797128 2797764 2788685 2808675 2794311 2781523
14422 2781523 2792193 2806358 2829184 2829504 2824890 2826243 2817744 2813261 2816375 2818898 2827929 2812189 2807286
14409 2807286 2814480 2822822 2827825 2824217 2832543 2850727 2849818 2847802 2846579 2833065 2823747 2843894 2878340
14396 2878340 2869273 2882834 2908008 2904928 2894925 2897813 2908952 2908861 2915107 2934159 2939582 2939950 2928528
14383 2928528 2915793 2937184 2949420 2952674 2949953 2959317 2959053 2960634 2936617 2912976 2892066 2896115 2913648
14370 2913648 2921944 2905634 2924321 2935946 2915859 2924531 2954560 2975708 2982482 2973411 2947165 2940408
14358 2940408 2948180 2950990 2943974 2970410 2995542 3023243 3013005 2992596 2985155 2995314 2996850 3015048
14346 3015048 3024231 3011123 3022367 3018294 3014769 3025950 3034657 3059699 3055158 3021207 3009324 3030448
14334C030448N193J802r190J9278Q544Q750L284N050R447J9713M122k3368j283
14321C081790J4670p137m597l158J0168J6021j1772m924l881O809P894K476K0609
14308C124968K9082L346r57J0898J8195o033q441j8603l4573L1720M8030J3091
14296C210723k776K726k9037j4813J2075Q856J7885M755J2690J1631L6559q744
14284C262530q659n257j1235O779J2712J3516J2991M426k3789J2178K6940l443
14272C299689k9232N177J6871K3312L353K3331J30k2499N591J6061J2042J8317
14260C372143Q336J2489j1040n305n47K1733J363J6791Q085k7310n607J8682J6283
14247C426096N494M000J4301P998M817j7529J9895m860j9504J5087L9184j5740
$$ plain form
14334 3030448 3035641 3037443 3028253 3047531 3056075 3064825 3068109 3073159 3082606 3102319 3106441 3083073 3081790
14321 3081790 3096460 3089323 3084726 3081568 3091736 3107757 3095985 3091061 3087180 3093989 3101883 3104359 3124968
14308 3124968 3154050 3157396 3156439 3167337 3185532 3179499 3171058 3152455 3117882 3149602 3197632 3210723
14296 3210723 3207947 3210673 3181636 3166823 3178898 3187754 3205639 3210394 3223084 3234715 3271274 3262530
14284 3262530 3253871 3248614 3237379 3244158 3256870 3270386 3283377 3287803 3264014 3276192 3303132 3299689
14272 3299689 3270457 3275634 3292505 3315817 3319170 3342501 3342631 3320132 3325723 3341784 3353826 3372143
14260 3372143 3380479 3392968 3381928 3376623 3376076 3397809 3399172 3415963 3424048 3396738 3391131 3409813 3426096
14247 3426096 3431590 3435590 3449891 3457889 3462706 3445177 3465072 3460212 3440708 3455795 3494979 3479239
14235C479239k4276J9405M684P429J5523K6083J6870j7320J9558J7240K6659K1857
14223C612951j3036j8681L318L524K4546K6539K888j3528l489L1079J2419p470
14211C661060j3458K3349Q602k657J9286J5404n075L419J2707N73L345p313J690
14198C720932M0042J6455j2135K650K6822K4477J1898Q634J4872O830J4961L2273
14186C908711J1435K4625K3761L8476K0716O173J7781L5409M1361K2681J9005
14175D170134K3152M052M2053N9247L3137l9666j05678j33677j70668j61279j22890
14164C597917j21289q6022l6209j0173J7888L6317P5731N0375L4792L3861K4005
14153C617193O547L2315J3961K4103J5598K3427Q273J1250P172p449M624j5570
$$ plain form
14235 3479239 3454963 3474368 3479052 3486481 3502004 3528087 3544957 3527637 3547195 3564435 3591094 3612951
14223 3612951 3599915 3581234 3584552 3588076 3612622 3639161 3642049 3628521 3625032 3656111 3668530 3661060
14211 3661060 3647602 3670951 3679553 3676896 3696182 3711586 3706511 3709930 3722637 3723210 3726555 3719242 3720932
14198 3720932 3760974 3777429 3765294 3767944 3794766 3819243 3831141 3839775 3854647 3861477 3876438 3908711
14186 3908711 3920146 3944771 3968532 4007008 4027724 4033897 4051678 4087087 4128448 4151129 4170134
14175 4170134 4193286 4197338 4239391 4298638 4331775 4292109 4186431 4052754 3882086 3720807 3597917
14164 3597917 3476628 3390606 3354397 3344224 3362112 3398429 3474160 3524535 3559327 3593188 3617193
14153 3617193 3623740 3656055 3670016 3694119 3709717 3733144 3741417 3752667 3759839 3752390 3757014 3741444
14141C741444J2290L7827K4224K8193L833Q443j5868j3540P662L0694K7490l910
14129C888782J4465M235L594K9563J4967K1771j0231J9766K5226J4724j8266J3225
14117D021821L1348P359q538j8592K454N3719K0890o763J3553J1737J2480J1384
14105D152852N331k205p742J6839K1777K5456J5380K268J3132J4627J4046j4573
14093D257188l873j0199J429O308J2594Q609l584J0696K0470M351J0949K8158
14081D343096L2386p013R431K481J0837K8926J841P784J4610M980P170J2404J7717
14068D486650J6027j4217j451K2527j917j435M326K8988J9774J1202N505K0076
14056D596055J8462L0253L2963m358M914n680Q448O581L0614L1292q467n735J2732
$$ plain form
14141 3741444 3753734 3791561 3815785 3843978 3847811 3856254 3840386 3826846 3834508 3865202 3892692 3888782
14129 3888782 3903247 3907482 3911076 3940639 3955606 3977377 3967146 3986912 4012138 4026862 4008596 4021821
14117 4021821 4053169 4060528 4051990 4033398 4035852 4089571 4110461 4103698 4117251 4128988 4141468 4152852
14105 4152852 4158183 4155978 4148236 4165075 4186852 4212308 4227688 4229956 4243088 4257715 4271761 4257188
14093 4257188 4253315 4243116 4244545 4250853 4263447 4272056 4268472 4279168 4299638 4303989 4314938 4343096
14081 4343096 4375482 4368469 4377900 4380381 4391218 4420144 4421985 4429769 4444379 4449359 4456529 4468933 4486650
14068 4486650 4502677 4488460 4487009 4509536 4507619 4506184 4510510 4539498 4559272 4570474 4575979 4596055
14056 4596055 4614517 4644770 4677733 4673375 4678289 4672609 4681057 4687638 4718252 4749544 4741077 4735342 4748074
14043D748074M720J1519l669j4193R025K1159K8041n861M984J1061K8810J9007
14031D862677O19j7069j8254p462J6682K2677K9382J9737O909R601M7124n190
14019D967433J073R931J5302N4431L2087P924Q566N579L679K1635L945r605J3157
14006E135137J1781K5556L1949p918J3154K5602M811L5609N3303L950j0068n791
13994E317075N2381K2728M103n292n635J6958P313K1016J9942L7848L8957k803
13982E524591K1273j088m034M523K3876J4379l169p473L148K1294J0465J5639
13970E623424L2019J719r218k715L3268J7717J057J3770J7780J5035L4337N7070
13958E835263K4579j3875q331J3143M1012K8171L0608L5542L1117K4617J1545
$$ plain form
14043 4748074 4752794 4764313 4760644 4746451 4755476 4776635 4804676 4798815 4803799 4814860 4843670 4862677
14031 4862677 4863296 4846227 4827973 4820511 4837193 4859870 4889252 4908989 4915898 4925499 4972623 4967433
14019 4967433 4968506 4978437 4993739 5048170 5080257 5088181 5096747 5102326 5106005 5127640 5131585 5121980 5135137
14006 5135137 5146918 5172474 5204423 5196505 5209659 5235261 5240072 5275681 5328984 5332934 5322866 5317075
13994 5317075 5369456 5392184 5396287 5390995 5385360 5402318 5409631 5430647 5450589 5488437 5527394 5524591
13982 5524591 5545864 5544776 5540742 5545265 5569141 5583520 5580351 5572878 5576026 5597320 5607785 5623424
13970 5623424 5655443 5657162 5647944 5645229 5678497 5696214 5697271 5711041 5728821 5743856 5778193 5835263
13958 5835263 5859842 5845967 5837636 5850779 5891791 5919962 5950570 5986112 6017229 6041846 6053391
13947F053391K476R958J4904L1227J0615J6677R543L2018K5727J6352J6581K8025
13935F267494J6082K4340J9272K235J4128L7470N5137L3696K0283K3304J4641
13924F528082L1072M5824K3003J8661K9354J9518L8413K6952M6543L0936L3511
13913F871869J9228j0543k2817m600J1829m845P914N495L8752O1900N6066J9196
13901G049444J7591K2858K3319M5936L4926M7486K8871J8951K8020L3367K6788
13890G377557L3163L1843M6878P7276N0826M8877M0359O262L6956M2477K6416
13879G818890J9827K0910K3383J4360K3887N5342J2526J6454N4415L5749M4350
13868H140093P2673L0151M1268N6604N0454N4998N4266M1979O7027L8336M6763
$$ plain form
13947 6053391 6055867 6065825 6080729 6111956 6122571 6139248 6148791 6180809 6206536 6222888 6239469 6267494
13935 6267494 6283576 6307916 6327188 6329423 6343551 6381021 6436158 6469854 6490137 6513441 6528082
13924 6528082 6559154 6604978 6627981 6646642 6675996 6695514 6733927 6760879 6807422 6838358 6871869
13913 6871869 6891097 6880554 6857737 6853137 6864966 6860121 6868035 6873530 6912282 6974182 7030248 7049444
13901 7049444 7067035 7089893 7113212 7159148 7194074 7241560 7270431 7289382 7317402 7350769 7377557
13890 7377557 7410720 7442563 7489441 7566717 7617543 7666420 7706779 7713041 7749997 7792474 7818890
13879 7818890 7838717 7859627 7883010 7897370 7921257 7976599 7989125 8005579 8059994 8095743 8140093
13868 8140093 8212766 8242917 8284185 8340789 8391243 8446241 8500507 8542486 8609513 8647849 8694612
13857H694612M5970L5956L6864P9380N5111M0302K2867M1017K7819L3090K0369
13846I133357L2542L5996N4255R8634O6594M5292O9705Q0059P4732P0858O1329
13835I823353L8399P0684Q0206Q1404R3015J00542R2274O1190O4125P3622Q3666
13824A0662480N7093P0019Q8524R4291P8636Q9070R6698Q8922O4045Q0531J11221
13813A1581530J14439R7097J23033J20695R9925J11601J15709J13078J22440J15202
13803A2714749N6301J1161K4180Q1414J24216J32330J32587J54731J21418J31941
13793A3685028J49160J74977J86537J75628J59364J49500J57731J79436J97862
13784A5215223J92712K09540J99791J85300K23869J94317J93807K32711K37944
$$ plain form
13857 8694612 8740582 8776538 8813402 8892782 8947893 8988195 9011062 9052079 9079898 9112988 9133357
13846 9133357 9165899 9201895 9256150 9354784 9421378 9466670 9536375 9616434 9691166 9762024 9823353
13835 9823353 9861752 9932436 10012642 10094046 10187061 10287603 10379877 10441067 10505192 10578814 10662480
13824 10662480 10719573 10789592 10878116 10972407 11051043 11140113 11236811 11325733 11389778 11470309 11581530
13813 11581530 11695969 11793066 11916099 12036794 12136719 12248320 12364029 12477107 12599547 12714749
13803 12714749 12771050 12782211 12806391 12887805 13012021 13144351 13276938 13431669 13553087 13685028
13793 13685028 13834188 14009165 14195702 14371330 14530694 14680194 14837925 15017361 15215223
13784 15215223 15407935 15617475 15817266 16002566 16226435 16420752 16614559 16847270 17085214
13775A7085214K33736J96328J66593J99279K44739K92046L27586L37601L30613
13766A9413735L44268L49314L78720L88905M22646M58376M64005M93603M88609
13757B3202181N06871N53681N83786O29767O54427O87297P25872P75398Q49725
13748B9169005R15495R41986J007430J087150J150756J258915J429254J572418
13740C8532409J681900J784136J864757J960718K103662K303223K525360K839981
13732E5596146L248949L751894M367557N057970N814540O594135P297146P482788
13724I9211125O260675K183411o088749j6185355k1866530k6289350l3097889
13717D127338l3475363k5383940j8776387j3833158m620072L923413P427450P649439
$$ plain form
13775 17085214 17318950 17515278 17681871 17881150 18125889 18417935 18745521 19083122 19413735
13766 19413735 19758003 20107317 20486037 20874942 21297588 21755964 22219969 22713572 23202181
13757 23202181 23709052 24262733 24846519 25476286 26130713 26818010 27543882 28319280 29169005
13748 29169005 30084500 31026486 32033916 33121066 34271822 35530737 36959991 38532409
13740 38532409 40214309 41998445 43863202 45823920 47927582 50230805 52756165 55596146
13732 55596146 58845095 62596989 66964546 72022516 77837056 84431191 91728337 99211125
13724 99211125 105471800 107655211 101566462 85381107 63514577 37225227 4127338
13717 4127338 -29348025 -54731965 -73508352 -87341510 -91961582 -88038169 -80610719 -72961280
13709g2961280O820555N817888M903774M055944L393878K911908K501561K152376
13701d0403396J918790J733340J586511J400444J259008J108630J000281Q36217
13693b9560175P06458O16521O04216N95568N67845O00932O36736O65703O63612
13684b3902584O35762O29875O12583O15378N91988N59429N43484N41146N02194
13675a8670745M79401M71446M51872M19942M10473M08231L82064L79956L55659
13666a4911701L63377L69612L44253K96794L16513L26476L14230K99778K68810
13657a2011858K75055K64748K88072K61627K19180K15500K35698K23233K07398
13648i821347K16773K01336J92615K11421J93182J96874J83287J92711J94751
$$ plain form
13709 -72961280 -66140725 -60322837 -55419063 -51363119 -47969241 -45057333 -42555772 -40403396
13701 -40403396 -38484606 -36751266 -35164755 -33764311 -32505303 -31396673 -30396392 -29560175
13693 -29560175 -28853717 -28237196 -27632980 -27037412 -26469567 -25868635 -25231899 -24566196 -23902584
13684 -23902584 -23266822 -22636947 -22024364 -21408986 -20816998 -20257569 -19714085 -19172939 -18670745
13675 -18670745 -18191344 -17719898 -17268026 -16848084 -16437611 -16029380 -15647316 -15267360 -14911701
13666 -14911701 -14548324 -14178712 -13834459 -13537665 -13221152 -12894676 -12580446 -12280668 -12011858
13657 -12011858 -11736803 -11472055 -11183983 -10922356 -10703176 -10487676 -10251978 -10028745 -9821347
13648 -9821347 -9604574 -9403238 -9210623 -8999202 -8806020 -8609146 -8425859 -8233148 -8038397
13639h038397J89987J67601J61053J51535J51615J49401J53434J30627J41593
13630f641551J36406J44679J34576J47736J37614J21447J12291J15113R6778J22392
13620e372519J37449J15030R7629J10668J17236J16140J12074J16758J06649R7980
13610d244906Q3479J02284R9905J00101Q6428Q2457Q0011R0643J09873P9876O8052
13599c261797P3417Q5502N6125O3441O8940M6249M6275M5047N6189O1811O5090
13588b593711O9368P4051O7813L7466N2967P0866N5946O4568O7829L7205M2949
13577a952683P6010N6130P6119P3129K6818O0597P6518N7409M3194M6182O2362
13566a298215P1886Q8903N6617O1980N2507K8170M5673N0299L8824M9734N5259
$$ plain form
13639 -8038397 -7848410 -7680809 -7519756 -7368221 -7216606 -7067205 -6913771 -6783144 -6641551
13630 -6641551 -6505145 -6360466 -6225890 -6078154 -5940540 -5819093 -5706802 -5591689 -5494911 -5372519
13620 -5372519 -5235070 -5120040 -5022411 -4911743 -4794507 -4678367 -4566293 -4449535 -4342886 -4244906
13610 -4244906 -4161427 -4059143 -3959238 -3859137 -3772709 -3690252 -3610241 -3519598 -3409725 -3329849 -3261797
13599 -3261797 -3188380 -3102878 -3046753 -2983312 -2914372 -2868123 -2821848 -2776801 -2720612 -2658801 -2593711
13588 -2593711 -2524343 -2450292 -2382479 -2345013 -2292046 -2221180 -2165234 -2100666 -2032837 -1995632 -1952683
13577 -1952683 -1876673 -1820543 -1744424 -1671295 -1644477 -1583880 -1507362 -1449953 -1406759 -1360577 -1298215
13566 -1298215 -1226329 -1137426 -1080809 -1018829 -966322 -938152 -892479 -842180 -803356 -753622 -698363
13555f98363M7454O8437M5073M7404N4760M5038K3125L4469M3581M6465L9245
13544b03312L0439M4032O5051N0742K6919K2933K7520N9848O1959L1748M5125
13533B63004K3602N6487L8126J0194K9541L6715N8761N7977M1291L4940L8525
13522F89163J4192M2075O7560M5202K7223L4022N4956P6398M2082N1818L2489
13511A177180K1726M8172N3630M1297L4832K8995L7428M6959K4767M8673L2844
13500A596503O2824M6068O7232O2048L9581L2696L0318M1825N2317N5954M2881
13489B130247N5517N4750O6894L5155J6561M7464Q5466M9953L0809N7444N5477
13478B685737Q0940N5618K2383L1360O4364P4719N0945M3951J2372M1908N4913
$$ plain form
13555 -698363 -650909 -582472 -537399 -489995 -435235 -390197 -367072 -332603 -289022 -242557 -203312
13544 -203312 -172873 -128841 -63790 -13048 13871 36804 64324 124172 186131 217879 263004
13533 263004 286606 343093 381219 391413 420954 457669 516430 574407 615698 650638 689163
13522 689163 703355 745430 812990 858192 885415 919437 974393 1050791 1092873 1144691 1177180
13511 1177180 1198906 1247078 1300708 1342005 1376837 1405832 1443260 1490219 1514986 1563659 1596503
13500 1596503 1659327 1705395 1772627 1834675 1874256 1906952 1937270 1979095 2031412 2087366 2130247
13489 2130247 2185764 2240514 2307408 2342563 2359124 2406588 2492054 2542007 2572816 2630260 2685737
13478 2685737 2766677 2822295 2844678 2876038 2940402 3015121 3066066 3110017 3122389 3164297 3219210
13467C219210O1285P8419K3762J9114M2865M5454O8642P8554O5282O4932O3649
13456C831168M6278K8904K405J7871N7636N9401N3656O0564M5860M8840Q1512
13445D334095Q5892N1368O5557N3739N4154O3593N5587P4839R1389N9907L2061
13434E022181M5025P3063Q0228O5690Q3132P0018Q8552Q7633M4841R1478R9390
13423E851231O8752O8768Q4569Q2070O6738Q0795Q4406Q7797Q2540J05242J02999
13412F765907J07218P0000O4901J09368J15605P9046P3134J08729J46133J56887
13402G796928J14439J18841J07035J14660J42550J24132J17723J30847J40954
13393H908109J51686J22075J34913J48465J64778J49104J51836J62492J89139
$$ plain form
13467 3219210 3280495 3358914 3382676 3401790 3444655 3490109 3558751 3637305 3702587 3767519 3831168
13456 3831168 3877446 3906350 3908755 3926626 3984262 4043663 4097319 4157883 4203743 4252583 4334095
13445 4334095 4419987 4471355 4536912 4590651 4644805 4708398 4763985 4838824 4930213 4990120 5022181
13434 5022181 5067206 5140269 5220497 5286187 5369319 5439337 5527889 5615522 5660363 5751841 5851231
13423 5851231 5919983 5988751 6073320 6155390 6222128 6302923 6387329 6475126 6557666 6662908 6765907
13412 6765907 6873125 6943125 7008026 7117394 7232999 7312045 7385179 7493908 7640041 7796928
13402 7796928 7911367 8030208 8137243 8251903 8394453 8518585 8636308 8767155 8908109
13393 8908109 9059795 9181870 9316783 9465248 9630026 9779130 9930966 10093458 10282597
13384A0282597J81360K00475K08060J84575J77678J90130K29893K33756K30496
13375A2119020K45148K54444K71609K57601K96491K98381K94095L14489L36483
13366A4687761L50212M04543M19544M26955M71796N02053N42086N63413O09751
13357A8978114O22913O72208P78155Q15570Q53798R19762J014418J094539J175844
13348B6925321J340785J552970J784145K077039K383916K649056K855601K880899
13340D4449732K411204N18299m204092j2447195j8898374j4935048n185683J143160
13332g147997L299158L622030L451153L192609K987731K877311K801236K569095
13324A7652326J919620N07225j349273j010641J398600L140960L768212L594386
$$ plain form
13384 10282597 10463957 10664432 10872492 11057067 11234745 11424875 11654768 11888524 12119020
13375 12119020 12364168 12618612 12890221 13147822 13444313 13742694 14036789 14351278 14687761
13366 14687761 15037973 15442516 15862060 16289015 16760811 17262864 17804950 18368363 18978114
13357 18978114 19601027 20273235 21051390 21866960 22720758 23640520 24654938 25749477 26925321
13348 26925321 28266106 29819076 31603221 33680260 36064176 38713232 41568833 44449732
13340 44449732 46860936 47379235 43175143 30727948 11829574 -3105474 -8291157 -7147997
13332 -7147997 -3848839 -226809 3224344 6416953 9404684 12281995 15083231 17652326
13324 17652326 19571946 20079171 18729898 17719257 19117857 22258817 26027029 29621415
13316B9621415K398279o84106n082870m872222j73250J799933q01981o891055
13308A5314143j3008405j3822129q357723j124183L090088L778026J796295k673445
13300a5007333o269910l337898J559262L534539L613806L039107J852500k72616
13292a1288543j900505o52426J660729K762301L042276L142433L235631L293148
13284C295044L304612L044937J856460j458813q432034j7972379k0633725j1753811
13276d8749709j932706K520593L515723L345195K874512K464860K137342J847386
13268c1976804J605472J331982J091614R04786Q04469P34044O21579N48823N38804
13259b3795231N14798N06349N16386M96800M57007M01784L42719L09344L37464
$$ plain form
13316 29621415 32019694 31335588 26252718 21380496 21207246 23007179 22205198 15314143
13308 15314143 2305738 -11516391 -19874114 -20998297 -17908209 -14130183 -12333888 -15007333
13300 -15007333 -21277243 -24615141 -23055879 -19521340 -15907534 -12868427 -11015927 -11288543
13292 -11288543 -13189048 -13841474 -12180745 -9418444 -6376168 -3233735 1896 3295044
13284 3295044 6599656 9644593 11501053 10042240 1610206 -16362173 -36995898 -48749709
13276 -48749709 -50682415 -48161822 -44646099 -41300904 -38426392 -35961532 -33824190 -31976804
13268 -31976804 -30371332 -29039350 -27947736 -27042950 -26238481 -25504437 -24882858 -24334035 -23795231
13259 -23795231 -23280433 -22774084 -22257698 -21760898 -21303891 -20902107 -20559388 -20250044 -19912580
13250a9912580L40515L91658L89663L85230L58576L60617L40239L35337L13998
13241a6696747K98038L10389L01220K80105K89491K76199K87919K82314K36177
13232a4134895J61076J26912J38109J59260J77480K02285K26505K12876K03393
13223a2526999J90752J74909J59848J68267J70358J72000J50910J57683J26977
13214a1055295J39750J28086J36255J52004J54521J37540J35966J41491J37465
13205i792217J16315R6919J19345J20041J04799J14709R2123Q3329J20593J30320
13195h693724J01400Q3471Q7049Q7764R8983P9242P4525P5604J04436N8732P9515
13184g763003J03500Q6313P8421P3948R0244Q1288N4439L4323M9538N8768P5784
$$ plain form
13250 -19912580 -19572065 -19180407 -18790744 -18405514 -18046938 -17686321 -17346082 -17010745 -16696747
13241 -16696747 -16398709 -16088320 -15787100 -15506995 -15217504 -14941305 -14653386 -14371072 -14134895
13232 -14134895 -13973819 -13846907 -13708798 -13549538 -13372058 -13169773 -12943268 -12730392 -12526999
13223 -12526999 -12336247 -12161338 -12001490 -11833223 -11662865 -11490865 -11339955 -11182272 -11055295
13214 -11055295 -10915545 -10787459 -10651204 -10499200 -10344679 -10207139 -10071173 -9929682 -9792217
13205 -9792217 -9675902 -9578983 -9459638 -9339597 -9234798 -9120089 -9027966 -8944637 -8824044 -8693724
13195 -8693724 -8592324 -8508853 -8421804 -8334040 -8235057 -8155815 -8081290 -8005686 -7901250 -7842518 -7763003
13184 -7763003 -7659503 -7573190 -7494769 -7420821 -7330577 -7249289 -7194850 -7160527 -7110989 -7052221 -6976437
13173f976437P5113P7955O1644Q6813Q3911N9566N9418O3329N6757O3600K1373
13162f266958L275p907n4119J0196Q3998O7946O0193O2501O9125O5936N0552M0385
13150e814877O8374M8290M6897K0378N0605P6929N7270K5443J8752K0681N0458
13139e330800M8086M8127K5532N1528L5662L6154P473Q122L2391M6107K4174K2357
13127d945087K6076M2148K5558J4736L4677O2727K7829P554K6656M4450N9995
13116d572681M2162J1581J2497K5279L5231L5108L3118K6340K7219K4798L0658
13105d268690L4269L4255L890K6063K5132K7853L0274J7181N655K4498J3211K9316
13093c997093L6602O809J6864M9418O2364K7590J0473K0048J9007L9166J4049
$$ plain form
13173 -6976437 -6901324 -6823369 -6761725 -6674912 -6591001 -6531435 -6472017 -6408688 -6351931 -6288331 -6266958
13162 -6266958 -6263683 -6271590 -6325709 -6315513 -6231515 -6163569 -6103376 -6040875 -5971750 -5905814 -5855262 -5814877
13150 -5814877 -5746503 -5698213 -5651316 -5630938 -5580333 -5503404 -5446134 -5420691 -5401939 -5381258 -5330800
13139 -5330800 -5282714 -5234587 -5209055 -5157527 -5121865 -5085711 -5078238 -5070116 -5037725 -4991618 -4967444 -4945087
13127 -4945087 -4919011 -4876863 -4851305 -4836569 -4801892 -4739165 -4711336 -4703782 -4677126 -4632676 -4572681
13116 -4572681 -4530519 -4518938 -4506441 -4481162 -4445931 -4410823 -4377705 -4351365 -4324146 -4299348 -4268690
13105 -4268690 -4234421 -4200166 -4196276 -4170213 -4145081 -4117228 -4086954 -4069773 -4064118 -4039620 -4026409 -3997093
13093 -3997093 -3960491 -3953682 -3936818 -3887400 -3825036 -3797446 -3786973 -3766925 -3747918 -3708752 -3694703
13082c694703N234K0351L5674K8640O714P661K0377J7895K6479M0128K9013j3055
13070c469592J4622K7519J2278J4744K6127N0132M3695K3402J8731M2089J9742
13059c176511J5967K4448M3214M4771K2400p470q277O957J6175K3311L5071k653
13047b962597j456K7628K4641K7486M836j4580l307K1856L0033M9661J9726J9233
13035b756840J1039K4030K7080J7331O912r026k17K3792K2616J6711j0127j472
13023b628171K5024M0716K9120K4427J2330l560L519K1666J9397J1505l817L2727
13011b415117L2680J0615K3100J3392R767J6916J3420J55L6122L2088n077m226
12999b236165n539J7997K6221J1887J8134k353j1916L4118L5331L7448K2895J7152
$$ plain form
13082 -3694703 -3689469 -3669118 -3633444 -3604804 -3598090 -3590429 -3570052 -3552157 -3525678 -3485550 -3456537 -3469592
13070 -3469592 -3454970 -3427451 -3415173 -3400429 -3374302 -3324170 -3280475 -3257073 -3238342 -3196253 -3176511
13059 -3176511 -3160544 -3136096 -3092882 -3048111 -3025711 -3033181 -3041458 -3034501 -3018326 -2995015 -2959944 -2962597
13047 -2962597 -2964053 -2936425 -2911784 -2884298 -2879462 -2894042 -2897349 -2875493 -2845460 -2795799 -2776073 -2756840
13035 -2756840 -2745801 -2721771 -2694691 -2677360 -2670448 -2679474 -2679691 -2655899 -2633283 -2616572 -2626699 -2628171
13023 -2628171 -2603147 -2562431 -2533311 -2508884 -2496554 -2500114 -2496595 -2474929 -2455532 -2444027 -2447844 -2415117
13011 -2415117 -2382437 -2371822 -2348722 -2335330 -2325563 -2308647 -2295227 -2295072 -2258950 -2226862 -2231939 -2236165
12999 -2236165 -2241704 -2223707 -2197486 -2185599 -2167465 -2169818 -2181734 -2147616 -2112285 -2074837 -2051942 -2034790
12987b034790k109J34k2512n694K5593K1999J096o43K8990L4855J7004K728m056
12974a937405Q91J8868J8064N671J0031J5781K3253K8660R043J185q991P856K4604
12961a782489M980K9477J5681k9039K82R040J0698K0178o69L7418P693o977J5081
12948a668646L0017K9754K807L765J9645K8018L491j7225J5321M610J4041K5973
12936a508429K766k162J9868J0752L0084K5926K6989l543k6068m88NJ3059J0283
12923a400958K6684L256L0082Q118J0116L725R303J0917Q735J8827N685p816Q363
12910a264963J6542J157J8286K5777J9134o845J437K0491R362l99M0337m186M486
12897a119384M174J1104K9489L6747o882N687J4058p162N114M863J0077L2689
$$ plain form
12987 -2034790 -2036899 -2036765 -2059277 -2064971 -2039378 -2017379 -2016283 -2016926 -1987936 -1953081 -1936077 -1933349 -1937405
12974 -1937405 -1936514 -1917646 -1899582 -1893911 -1883880 -1868099 -1844846 -1816186 -1807143 -1805958 -1814949 -1807093 -1782489
12961 -1782489 -1777509 -1748032 -1732351 -1761390 -1761108 -1752068 -1741370 -1721192 -1721861 -1684443 -1676750 -1683727 -1668646
12948 -1668646 -1638629 -1608875 -1606068 -1602303 -1582658 -1554640 -1551149 -1568374 -1553053 -1548443 -1534402 -1508429
12936 -1508429 -1505663 -1507825 -1487957 -1477205 -1447121 -1421195 -1394206 -1397749 -1423817 -1424305 -1424300 -1411241 -1400958
12923 -1400958 -1374274 -1371018 -1340936 -1332818 -1322702 -1318977 -1309674 -1298757 -1290022 -1271195 -1265510 -1273326 -1264963
12910 -1264963 -1248421 -1247264 -1228978 -1203201 -1184067 -1190912 -1189475 -1168984 -1159622 -1160021 -1119684 -1123870 -1119384
12897 -1119384 -1115210 -1104106 -1074617 -1037870 -1044752 -1039065 -1025007 -1032169 -1027055 -1022192 -1012115 -979426
12885i79426J6577J2706J9428Q392r787R344K4233K802K1974J3929K2977L0582
12873h06269J5426M560L7938K8215P74p188K0826n53p433p4621m7527j8544l625
12860h58021K0686L180M997L8626M0663K7181J8529L086q56Q035J4365J6305J3496
12847f49728K7727J9986O296K1815J8668k4060o191K792j3280L338j4502n2116
12835f59255o4895r330J2962J0786O242J4733O314l5298r623J3917P579L4712
12823f71156L2506m064Q772J9994N02l101J2436L5167K9654L9270M1182L165P932
12810d47741K8229J9052k3161o7867q3926p5858k3058r411J5396N5685L8379N110
12798e69171P252J2266K2852K642J412m57L2430M2446R465j0901M975J9574J1204
$$ plain form
12885 -979426 -962849 -950143 -930715 -922323 -932110 -922766 -898533 -895731 -873757 -859828 -836851 -806269
12873 -806269 -790843 -786283 -748345 -720130 -719356 -726544 -705718 -706271 -713704 -788325 -835852 -854396 -858021
12860 -858021 -837335 -834155 -829158 -790532 -749869 -722688 -704159 -701073 -701929 -693894 -679529 -663224 -649728
12847 -649728 -622001 -602015 -595719 -573904 -555236 -579296 -585487 -582695 -595975 -592637 -607139 -659255
12835 -659255 -724150 -733480 -720518 -709732 -703490 -688757 -682443 -717741 -727364 -713447 -705868 -671156
12823 -671156 -638650 -642714 -633942 -613948 -613446 -616547 -604111 -568944 -539290 -500020 -458838 -455673 -447741
12810 -447741 -419512 -400460 -423621 -491488 -575414 -651272 -674330 -683741 -668345 -612660 -574281 -569171
12798 -569171 -561919 -549653 -526801 -524159 -522747 -523204 -490774 -448328 -438863 -449764 -444789 -425215 -414011
12785d14011j882L6521K0011R643q509k731j5740k4672K0947K7230J8761k845
12773c37277n415K0496P403k6075K0416M8895J8757n589K0411J9965J1847R504
12761a96662l79P409O803K274n83J9075J0925N416O147m451j8874J2198J8459
12748a32243K9247l221n744J8317J8008K3387K3455K1905K0149q82p574K6538
12736C1342K2277L870K53k1313k7133k772J414m873M22J8977K0159L506r040j8850
12722A8239J3330N0747J4097J5640J3463M349J5056J5290L3362K4519L446j1896
12710B09642L118J954J3773K4797K9988N0906J219n350m133K4241J9282l6687
12698C32750m6600n6978n8406k0786Q30j379K1505L1559K1924L4889j923j4368
$$ plain form
12785 -414011 -415893 -379372 -359361 -349718 -358227 -360958 -376698 -401370 -380423 -353193 -334432 -337277
12773 -337277 -342692 -322196 -314793 -340868 -320452 -271557 -252800 -258389 -237978 -218013 -206166 -196662
12761 -196662 -197041 -189632 -182829 -180555 -181138 -162063 -151138 -145722 -139575 -144026 -162900 -150702 -132243
12748 -132243 -102996 -106217 -111961 -93644 -75636 -52249 -28794 -6889 13260 12378 4804 31342
12736 31342 53619 57489 57742 36429 9296 6524 7938 3065 3487 22464 42623 46129 37089 18239
12722 18239 31569 82316 96413 112053 125516 129865 144921 160211 193573 218092 221538 209642
12710 209642 212760 214714 228487 253284 283272 334178 335397 330047 325914 350155 369437 332750
12698 332750 286150 229172 170766 149980 150810 149431 170936 202495 224419 259308 257385 243017
12686B43017l481J8196J3596P287K3733L6092J7773J1770J078J0988J7626N159
12674D02834R543J2504J1659O8J870j5877P308K8098K6574K499Q794j4387k0298
12661D61189j7335j9397J551K941o672R618K712n971L1171L8138R477J0818M268
12648E22508J360K0477O911j3648P914l766J7723J777r875O078J1803o719K6815
12635E89358K4959Q177K2058r444o41J3686J2278m317j6160J3654L0895J4302
12623F98805j3931J2784L1045J1849j7139j6899j629K2788L2963L0248J2712j3254
12611G90342p049n854L0645Q827P759J5720o743m403J6171N693K1061L5437M587
12598I12193L108j4101k2964K5075K3849J7865O946N659N656J0467J6832J5472
$$ plain form
12686 243017 239536 257732 271328 278615 302348 338440 356213 367983 369061 380049 397675 402834
12674 402834 412377 424881 436540 436608 438478 422601 429909 458007 484581 487080 495874 481487 461189
12661 461189 443854 424457 426008 428949 422277 431895 434607 428636 459807 497945 507422 518240 522508
12648 522508 523868 544345 551256 537608 545522 541756 559479 561256 551381 557459 569262 562543 589358
12635 589358 614317 622494 644552 635108 634467 648153 660431 656114 639954 653608 684503 698805
12623 698805 684874 697658 728703 740552 723413 706514 704885 727673 760636 790884 803596 790342
12611 790342 783293 777439 808084 816911 824670 840390 833647 829244 845415 851108 872169 907606 912193
12598 912193 915301 901200 878236 903311 927160 945025 951971 957630 963286 973753 990585 1006057
12586A006057K6167J2294j487k3137k6161J6331J092j1848j4255P926J9252R693
12574A021924L5716K5804J8730K1261K2040o491O576J9454P591j0116q088K6669
12562A181070J4304k639J1725K0549p493k8080k267L7680J8611j4816J2516J1623
12550A252783r629o884k011N222J9590L867Q127J5179K8107M691K2550p995R278
12537A342875K0665J5531L251J967R423j982K5980J0616p7K3965J2064L185J3480
12524A480943l937l698K9169K7254K1478J8700K0792K8573K0553k0906J2174K4554
12512A655649J7364K3677M844J5064K3292J1175J586L0696J7721J8182k1807o1883
12500A735560n9796q1411j1822P206J3681Q199L2757K4317K4891K6298J7151K8908
$$ plain form
12586 1006057 1032224 1044518 1043031 1019894 993733 1010064 1011156 999308 985053 992979 1012231 1021924
12574 1021924 1057640 1083444 1102174 1123435 1145475 1138984 1145560 1165014 1172605 1162489 1154401 1181070
12562 1181070 1195374 1192735 1204460 1225009 1217516 1189436 1187169 1224849 1243460 1228644 1241160 1252783
12550 1252783 1243154 1236270 1234259 1239481 1259071 1262938 1271065 1286244 1314351 1319042 1341592 1333597 1342875
12537 1342875 1363540 1379071 1382322 1384289 1393712 1391730 1417710 1428326 1428249 1452214 1464278 1467463 1480943
12524 1480943 1477006 1473308 1502477 1529731 1551209 1569909 1590701 1619274 1639827 1618921 1631095 1655649
12512 1655649 1673013 1696690 1701534 1716598 1739890 1751065 1752651 1783347 1801068 1819250 1797443 1735560
12500 1735560 1675764 1594353 1582531 1589737 1603418 1611617 1644374 1668691 1693582 1719880 1737031 1765939
12488A765939L0397k284pJ0738J7681L8408J8190J1487L2937K3661l777o510L1735
12475A968595K4572K5460k1512m5020o711j5541j5088J2800J492m5596q6294p1120
12463A726037k9791K1367L5425N1321M4586L0861m773j307J817M7289M1823K8572
12451A993227M0188J1223K744K2356L0757M4079o796n1580o7083n8898m1769k377
12439A916071K8589N2108J4755J5112O0929Q0123N0398j9402j4906m8428j16733
12428B018616j20508p7723n1150j2980K8834O174K6746L6843K7254K3375L6214
12417A941695J3180K0790J5905j075k3378K1226K8592M158K9835L1460p779M755
12405B079364J6333L391J5072K0352J7603K183J3369K5099M8975K9100K8148R037
$$ plain form
12488 1765939 1796336 1794052 1794045 1804783 1822464 1860872 1879062 1890549 1923486 1947147 1943370 1936860 1968595
12475 1968595 1993167 2018627 1997115 1952095 1945384 1929843 1914755 1927555 1929047 1883451 1797157 1726037
12463 1726037 1696246 1717613 1753038 1804359 1848945 1879806 1875033 1873726 1875543 1922832 1964655 1993227
12451 1993227 2033415 2044638 2047382 2069738 2100495 2144574 2137778 2086198 2019115 1960217 1918448 1916071
12439 1916071 1944660 1996768 2011523 2026635 2087564 2167687 2218085 2198683 2183777 2135349 2018616
12428 2018616 1898108 1820385 1769235 1756255 1785089 1791263 1818009 1854852 1882106 1905481 1941695
12417 1941695 1954875 1975665 1991570 1990495 1967117 1988343 2016935 2021093 2050928 2082388 2074609 2079364
12405 2079364 2095697 2099088 2114160 2134512 2152115 2154298 2167667 2192766 2241741 2270841 2298989 2308026
12393B308026k6623n2456p2895m8884k2113J1871M3492N1051K9261N7K7284J3855
12381B261926J6512P031J4109M4565K2954o88J5112K4513K4063P799K5782K8108
12369B491786L9011M8731J239m1478O16J8737Q120O211J4425L4568J0234J2968
12357B645168K0369O756J2106K7720L2959Q101N035L7963K6456J1687O427N263
12345B846010J5593J5833J5851J3973n404J4869M5342K1490J080K5393J3825o508
12333C017347J9833K1553L4917K3727K1621L343N110M0549M8698L0867o411o479
12321C254675J5604J7366K9145J9151j5635K84J9931J2161P646J2378K9734N3026
12309C455466K5582K9162M662L1344J8695Q423J3516K875J451L5419O1831O5648
$$ plain form
12393 2308026 2281403 2228947 2156052 2107168 2085055 2096926 2140418 2191469 2220730 2220787 2248071 2261926
12381 2261926 2278438 2285469 2299578 2344143 2367097 2366409 2381521 2406034 2430097 2437896 2463678 2491786
12369 2491786 2530797 2579528 2580767 2539289 2539905 2558642 2566762 2572973 2587398 2621966 2632200 2645168
12357 2645168 2665537 2672293 2684399 2712119 2745078 2753179 2758214 2796177 2822633 2834320 2840747 2846010
12345 2846010 2861603 2877436 2893287 2907260 2901856 2916725 2962067 2983557 2984637 3010030 3023855 3017347
12333 3017347 3037180 3058733 3093650 3117377 3138998 3142341 3147451 3188000 3236698 3267565 3261154 3254675
12321 3254675 3270279 3287645 3316790 3335941 3320306 3320590 3340521 3352682 3360328 3372706 3402440 3455466
12309 3455466 3481048 3510210 3514872 3546216 3564911 3573334 3586850 3589725 3591176 3626595 3688426 3754074
12297C754074K7566J2039O549K6591j5326l2279m0057l2224r717K242L023K5171
12285C727652O0264L8350J6478L8731L9203L4433Q058J017K3736O92J6657L7722
12273D042993M7297M3804K6476K2334K3440J8101K3684J1643J3687L723n057k4267
12261D247858k9753j0232J3546K0375M92J2477O000K7390N5186O7031L8098L1355
12249D479823K2041M352J8001L0107L1986J7012N2804O0995M0615Q6248O2922
12238D906906J8467M0478L6875K498K2297q362k9390l3733L4314N8553M4281M4632
12226E137816M0249K4173J1808M3958M2457K3952L0522K2607K881O972J3546M925
12214E405866K4411M2774N2583M8863M1375L3707L1175K7590M8438P2174L2321
$$ plain form
12297 3754074 3781640 3793679 3800228 3826819 3811493 3779214 3739157 3706933 3697216 3699458 3702481 3727652
12285 3727652 3787916 3826266 3842744 3881475 3920678 3955111 3963169 3964186 3987922 3988614 4005271 4042993
12273 4042993 4090290 4134094 4160570 4182904 4206344 4224445 4248129 4259772 4273459 4277182 4272125 4247858
12261 4247858 4218105 4207873 4221419 4241794 4242286 4254763 4260763 4288153 4343339 4410370 4448468 4479823
12249 4479823 4501864 4506216 4524217 4554324 4586310 4603322 4656126 4717121 4757736 4843984 4906906
12238 4906906 4925373 4965851 5002726 5005224 5027521 5019159 4989769 4956036 4990350 5048903 5093184 5137816
12226 5137816 5178065 5202238 5214046 5258004 5300461 5324413 5354935 5377542 5380423 5387395 5400941 5405866
12214 5405866 5430277 5473051 5525634 5574497 5615872 5649579 5680754 5708344 5756782 5828956 5861277
12203E861277K7537M3717M3631L5669M6462N6451L7706L4735M4146J6301O768
12192F254400J7879M4921O2853M5324N0365J2087J9311K6761N214k6567k2549
12181F489999J9780M0020N2221N8665P5009Q0547Q6924N5509N2614O1816K2589
12170G095693M9178Q3374O5516N2586K3406N0018M4364L9447L8606L6362N3585
12159G632135M5383N5536O8032P7302O3255P6083P1963O5187Q9960P4234O8456
12148H387526R8785O5920P2441J23232J18308O6183N4196P9780Q2291Q5998R1247
12137I325907Q3869O1931J06874J18842J33556J20958J02944J27325J35063J12157
12127A0429426J07937J34379J42296J38099J32054J18773J39189J54818J54317
$$ plain form
12203 5861277 5888814 5932531 5976162 6011831 6058293 6114744 6152450 6187185 6231331 6247632 6254400
12192 6254400 6272279 6317200 6380053 6425377 6475742 6487829 6507140 6533901 6539115 6512548 6489999
12181 6489999 6509779 6549799 6602020 6660685 6735694 6816241 6903165 6958674 7011288 7073104 7095693
12170 7095693 7144871 7228245 7293761 7346347 7369753 7419771 7464135 7503582 7542188 7578550 7632135
12159 7632135 7677518 7733054 7801086 7878388 7941643 8017726 8089689 8154876 8244836 8319070 8387526
12148 8387526 8486311 8552231 8624672 8747904 8866212 8932395 8986591 9066371 9148662 9234660 9325907
12137 9325907 9409776 9471707 9578581 9697423 9830979 9951937 10054881 10182206 10317269 10429426
12127 10429426 10537363 10671742 10814038 10952137 11084191 11202964 11342153 11496971 11651288
12118A1651288J65385J58585J58817J57549J67243J96485J72348J72131K30333
12109A3230164K15067K12374K13348K15301K41787K52224K73162K79486K85888
12100A5418801K90985L10408L30618L52435L75793L92741L84671M14672M86669
12091A8757793N11356N43836N61902N85120O09167O73079P64622Q30736Q81024
12082B4718635R35782J049525J170563J265259J393406J572775J680946J825339
12074C5612230K145314K539791K902762L114387L032854K216682m86760o684879
12066D4392381j6092998k0808474j3672236l282413K203693L721395L827340L647405
12058C936093L426790L189307K953605K680040K135052Q68378j100939j467076
$$ plain form
12118 11651288 11816673 11975258 12134075 12291624 12458867 12655352 12827700 12999831 13230164
12109 13230164 13445231 13657605 13870953 14086254 14328041 14580265 14853427 15132913 15418801
12100 15418801 15709786 16020194 16350812 16703247 17079040 17471781 17856452 18271124 18757793
12091 18757793 19269149 19812985 20374887 20960007 21569174 22242253 23006875 23837611 24718635
12082 24718635 25654417 26703942 27874505 29139764 30533170 32105945 33786891 35612230
12074 35612230 37757544 40297335 43200097 46314484 49347338 51564020 51077260 44392381
12066 44392381 28299383 7490909 -6181327 -9463740 -7260047 -3538652 288688 3936093
12058 3936093 7362883 10552190 13505795 16185835 18320887 19189265 18088326 16621250
12050A6621250R12956K943356L591342L338574K088346p37060m617651m705023
12042A9436090k49885K954386K965152L14946n055755j1465824j4098832j0425496
12034a5625218l528913J276641J842817j128626m738407l554976P58582L162042
12026b1536058L564113L078987K025683J04430j651384o56073J536380K587396
12018a0946526K778308K791533K930527L089623L124473K984881K443755R32135
12010A0128709k781192r848665j7437080j7048894q204548m69706K621588L176959
12002c9862829K967679K568187K163348J790945J517895J294605J155715J085382
11994b5319073J063827R76667R05717Q50900P61295O93720O24707N74433M77902
$$ plain form
12050 16621250 17534206 20477562 24068904 27407478 29495824 28758764 24141113 19436090
12042 19436090 19186205 22140591 25105743 25420689 20364934 8899110 -5199722 -15625218
12034 -15625218 -19154131 -17877490 -16034673 -17163299 -21901706 -25456682 -24698100 -21536058
12026 -21536058 -17971945 -14892958 -12867275 -12762845 -14414229 -15070302 -13533922 -10946526
12018 -10946526 -8168218 -5376685 -2446158 643465 3767938 6752819 9196574 10128709
12010 10128709 7347517 -2501148 -19938228 -36987122 -45191670 -45661376 -43039788 -39862829
12002 -39862829 -36895150 -34326963 -32163615 -30372670 -28854775 -27560170 -26404455 -25319073
11994 -25319073 -24255246 -23278579 -22372862 -21521962 -20760667 -20066947 -19442240 -18867807 -18389905
11985a8389905L60755K64116K31449K75118L29703L42238L67396L54072L34048
11976a5531010L55749L47083L78393L51290L10781K93971K63202K98996K86318
11967a2645227L09880K94396K60400K95315K66286K50325K45091K53346K39488
11958a0230700K32290K19516J87057J66645K15832K78277K83988K79508K53894
11949h113693J51904q4857n58306p30810k20504J51776K68192K56058K30810J98657
11939h450773J91249J82467J55563J83268J47082J55007J44365J71165J42879
11930f977728J22062J01318L5930L5252N6650R0535J26456J22342J09731Q7082
11920f090370P5928R6111J08706R5362Q4110J13525J12116Q9610O6117O5413P8457
$$ plain form
11985 -18389905 -18029150 -17765034 -17533585 -17258467 -16928764 -16586526 -16219130 -15865058 -15531010
11976 -15531010 -15175261 -14828178 -14449785 -14098495 -13787714 -13493743 -13230541 -12931545 -12645227
11967 -12645227 -12335347 -12040951 -11780551 -11485236 -11218950 -10968625 -10723534 -10470188 -10230700
11958 -10230700 -9998410 -9778894 -9591837 -9425192 -9209360 -8931083 -8647095 -8367587 -8113693
11949 -8113693 -7961789 -8046646 -8604952 -9335762 -9556266 -9404490 -9136298 -8880240 -8649430 -8450773
11939 -8450773 -8259524 -8077057 -7921494 -7738226 -7591144 -7436137 -7291772 -7120607 -6977728
11930 -6977728 -6855666 -6754348 -6718418 -6683166 -6626516 -6535981 -6409525 -6287183 -6177452 -6090370
11920 -6090370 -6014442 -5918331 -5809625 -5714263 -5630153 -5516628 -5404512 -5314902 -5248785 -5183372 -5104915
11909e104915N9019Q8896J01817Q6417O4016R2726Q9944Q1505N5717M0349N6376
11898d288133R5919O2025M1957O2766P3083O2423N0068N5916K8263N695L0806
11887c719212P5160P1889L9361L4458P1072P7709P3876O5062M0965M6358M5488
11876c077814N3591O7168N1688M2309M6186L3459M6964M7357M5663J3492L4920
11865b595017O1675P5303O0526m374J9041N7305K9130N3329K2003K4161P7163
11854b119755N8209M6476P094N4549M7417M7357L0897M3692M9099M5955N7023
11843a631987M2615N1332J3060J8626L1794N8884N6864j0913K1421O1742M4983
11832a241579K9691M0373K2581M218K5511K3587K8834K0710N4471P3952M2603
$$ plain form
11909 -5104915 -5045896 -4957000 -4855183 -4768766 -4704750 -4612024 -4522080 -4440575 -4384858 -4344509 -4288133
11898 -4288133 -4192214 -4130189 -4088232 -4025466 -3952383 -3889960 -3839892 -3783976 -3755713 -3750018 -3719212
11887 -3719212 -3644052 -3572163 -3532802 -3498344 -3427272 -3349563 -3275687 -3210625 -3169660 -3123302 -3077814
11876 -3077814 -3024223 -2957055 -2905367 -2863058 -2816872 -2783413 -2736449 -2689092 -2643429 -2629937 -2595017
11865 -2595017 -2533342 -2458039 -2397513 -2401887 -2382846 -2325541 -2296411 -2243082 -2221079 -2196918 -2119755
11854 -2119755 -2061546 -2015070 -2007976 -1953427 -1906010 -1858653 -1827756 -1784064 -1734965 -1689010 -1631987
11843 -1631987 -1589372 -1538040 -1524980 -1506354 -1474560 -1415676 -1358812 -1369725 -1348304 -1286562 -1241579
11832 -1241579 -1211888 -1171515 -1148934 -1144716 -1119205 -1095618 -1066784 -1046074 -991603 -917651 -875048
11821h75048J4644N176J9363M6323P7576M0111N1291M2332N4349N1457J5132K465
11809d54829L8213L2124L1107N1132N1201O5657L1884L8408M3650J7512L1605
11798b2336N3371M1468O0780O9899N1469L9824J8981Q768M6286L5339P024J3982
11786D24855L9493N5010N8921P5584O7978M1980K0241K2710K4307M0504L5631
11775I07214M6510N8834N8530P5499P4855M7878K2074M7587R3830J14163J13447
11764A660421Q0272O6893m3007l01494n09310m70025k04157L5554J12906J40562
11754E68615J09737Q5655R3345J05190P8864R4580P2269M2183M0479P5976P1081
11743A437974L8157L6585N1933O8408M9233M6134M0023M6523J2709J0809L6264
$$ plain form
11821 -875048 -860404 -855228 -835865 -789542 -711966 -671855 -620564 -578232 -523883 -472426 -457294 -454829
11809 -454829 -416616 -384492 -353385 -302253 -251052 -185395 -153511 -115103 -71453 -53941 -22336
11798 -22336 31035 72503 133283 203182 254651 294475 313456 322224 368510 403849 410873 424855
11786 424855 464348 519358 578279 653863 721841 763821 784062 806772 831079 871583 907214
11775 907214 953724 1012558 1071088 1146587 1221442 1269320 1291394 1338981 1432811 1546974 1660421
11764 1660421 1740693 1807586 1764579 1463085 953775 483750 279593 315147 428053 568615
11754 568615 678352 764007 857352 962542 1041406 1135986 1208255 1250438 1290917 1366893 1437974
11743 1437974 1476131 1512716 1564649 1633057 1682290 1728424 1768447 1814970 1827679 1838488 1874752
11732A874752L5687L3008L9770J7078L7735N8685M4340L6474O7090O0374M8293
11721B353286O5844N7115N8249L0838M0879M1339L3056L5500M3670L5608M3581
11710B838965L3611M1850M5439O6250Q5037N2958J0982M6636O3580P4743O0150
11699C420201K2299M7958O6399O3885Q0692P3090L7668L7844M5719O7959R2049
11688D055763P6506O8386P4740P4517M3290K9697l254m6614m6543N351Q3394J10993
11676D526226Q5547O9336O8955L3739J7946L7050K3102J3413M8888P8311P2263
11665E074776J00319R0022R8405J02949Q9310P2304O1302O2828P3538P8310J11177
11654F015240J04525Q2927P7286Q3482O4060N7796L7023L8620L9182O1199N9767
$$ plain form
11732 1874752 1910439 1943447 1983217 2000295 2038030 2096715 2141055 2177529 2244619 2304993 2353286
11721 2353286 2419130 2476245 2534494 2565332 2606211 2647550 2680606 2716106 2759776 2795384 2838965
11710 2838965 2872576 2914426 2959865 3026115 3111152 3164110 3175092 3221728 3285308 3360051 3420201
11699 3420201 3442500 3490458 3556857 3620742 3701434 3774524 3812192 3850036 3895755 3963714 4055763
11688 4055763 4132269 4200655 4275395 4349912 4393202 4422899 4419645 4373031 4326488 4331839 4415233 4526226
11676 4526226 4611773 4681109 4750064 4783803 4801749 4838799 4861901 4875314 4924202 5002513 5074776
11665 5074776 5175095 5265117 5363522 5466471 5555781 5628085 5689387 5752215 5825753 5904063 6015240
11654 6015240 6119765 6202692 6279978 6363460 6427520 6485316 6522339 6560959 6600141 6661340 6721107
11643F721107J7004N6473J21431J49431J27064R5924R0938J01953J06665J07757
11633G695747J07594R4512J41856J60465J13907J22724J34463J15268Q2036K1219
11623H789791K4990Q3357J07430J04616J14495J41125J57268J27117J30206J06907
11613I887302J27154J58783J92769J81763J38631J02699J39581J68139J40385
11604A1237206J49495J60199J45163J64461J95795J98045J87579J60883J21343
11595A2720169P2837R2459J74710K32740J98781J72148J92528K12969K69483K80670
11585A4619494K52322K74366K83739K69250K86779K93013K99588L41450L20329
11576A7240330L26196L46697L24210L11962L32196L74569L97588M23549M25405
$$ plain form
11643 6721107 6738111 6794584 6916015 7065446 7192510 7288434 7379372 7481325 7587990 7695747
11633 7695747 7803341 7897853 8039709 8200174 8314081 8436805 8571268 8686536 8768572 8789791
11623 8789791 8814781 8898138 9005568 9110184 9224679 9365804 9523072 9650189 9780395 9887302
11613 9887302 10014456 10173239 10366008 10547771 10686402 10789101 10928682 11096821 11237206
11604 11237206 11386701 11546900 11692063 11856524 12052319 12250364 12437943 12598826 12720169
11595 12720169 12793006 12885465 13060175 13292915 13491696 13663844 13856372 14069341 14338824 14619494
11585 14619494 14871816 15146182 15429921 15699171 15985950 16278963 16578551 16920001 17240330
11576 17240330 17566526 17913223 18237433 18549395 18881591 19256160 19653748 20077297 20502702
11567B0502702M05127M42192M68042M82924N61779O07838O26946O14878N87481
11558B5299909O20226O56013P16582Q00714Q50246Q82602R10361R14018R38604
11549C2589275J006653J107824J246815J335105J378456J463939J642436J811965
11541D3582468J991045K180620K277097K470381K698464K938035L190110L520668
11533F4848888L948940M459653M991790N532161O106119O717851P527483Q678622
11525A12811507J0257373J3071566J6223466J8963105K1821472K3318967J6832496
11518B33299952r290141p9986586j84703537j61199366l7885175K2064971L0063233
11511a87636649K5577117K0418872J5892502J2276734R429692P301575O149766
$$ plain form
11567 20502702 20907829 21350021 21818063 22300987 22862766 23470604 24097550 24712428 25299909
11558 25299909 25920135 26576148 27292730 28093444 28943690 29826292 30736653 31650671 32589275
11549 32589275 33595928 34703752 35950567 37285672 38664128 40128067 41770503 43582468
11541 43582468 45573513 47754133 50031230 52501611 55200075 58138110 61328220 64848888
11533 64848888 68797828 73257481 78249271 83781432 89887551 96605402 104132885 112811507
11525 112811507 123068880 136140446 152363912 171327017 193148489 216467456 233299952
11518 233299952 224009811 144023225 -40680312 -201879678 -239764853 -217699882 -187636649
11511 -187636649 -162059532 -141640660 -125748158 -113471424 -104041732 -96740157 -90590391
11504i0590391N297658M930822M891383M540023M037607L589809L205653K807197
11496e7290239K390549K005955J409190P98777M81018L55803M26087O29130Q37688
11487d7956042R69305J001151J008178J032937J055416J080692J001335R31434
11479c9875594Q76700P89421P65244Q04801Q10349P88220P63017P31382O79907
11470c2866553O22330N91590N94969N84916N42340N19496N46617N46741N26379
11461b7791175N36976N27934M74825M78163M74544M51731M52568M44353M23201
11452b3526880M33110M06926K75315k370k86815j41492K11390L82055M01913L72383
11442b1474465L56787L18975K96712K60701K52989K91593L01999K54114K39786
$$ plain form
11504 -90590391 -85292733 -80361911 -75470528 -70930505 -66892898 -63303089 -60097436 -57290239
11496 -57290239 -54899690 -52893735 -51484545 -50685768 -50204750 -49848947 -49422860 -48793730 -47956042
11487 -47956042 -46986737 -45985586 -44977408 -43944471 -42889055 -41808363 -40807028 -39875594
11479 -39875594 -38998894 -38209473 -37444229 -36639428 -35829079 -35040859 -34277842 -33546460 -32866553
11470 -32866553 -32244223 -31652633 -31057664 -30472748 -29930408 -29410912 -28864295 -28317554 -27791175
11461 -27791175 -27254199 -26726265 -26251440 -25773277 -25298733 -24847002 -24394434 -23950081 -23526880
11452 -23526880 -23093770 -22686844 -22411529 -22413899 -22700714 -22842206 -22630816 -22248761 -21846848 -21474465
11442 -21474465 -21117678 -20798703 -20501991 -20241290 -19988301 -19696708 -19394709 -19140595 -18900809
11433a8900809K29875K15184K33018K14867J97330K46910J87741J71915J75178
11424a7028791J95173J67742J57410J76673J75778J73748J97277K07917J69671
11415a5407402J61774J64870J64755J49121J19016P9672P0599J16340J40029J12799
11405a4128427J15222J42332J19789J39286J32058J18272J25672J21258J20778
11396a2993760J31004J14788P0435M4186N0211N1390N8035Q5420Q7502Q1569Q8871
11385a2130349O8743O7864N5200Q0156J00012O1735O3400O4546P2302R5694J03892
11374a1296805O6902N8643P0053R3133O4882N1034M5100N7282O9481N9652P5551
11363a0585092J02570J24414J14440P6527N4932L1130O5525N1182O7283N6629
$$ plain form
11433 -18900809 -18670934 -18455750 -18222732 -18007865 -17810535 -17563625 -17375884 -17203969 -17028791
11424 -17028791 -16833618 -16665876 -16508466 -16331793 -16156015 -15982267 -15784990 -15577073 -15407402
11415 -15407402 -15245628 -15080758 -14916003 -14766882 -14647866 -14568194 -14497595 -14381255 -14241226 -14128427
11405 -14128427 -14013205 -13870873 -13751084 -13611798 -13479740 -13361468 -13235796 -13114538 -12993760
11396 -12993760 -12862756 -12747968 -12677533 -12633347 -12583136 -12531746 -12473711 -12388291 -12300789 -12219220 -12130349
11385 -12130349 -12061606 -11993742 -11938542 -11858386 -11758374 -11696639 -11633239 -11568693 -11496391 -11400697 -11296805
11374 -11296805 -11229903 -11171260 -11101207 -11008074 -10943192 -10892158 -10847058 -10789776 -10720295 -10660643 -10585092
11363 -10585092 -10482522 -10358108 -10243668 -10167141 -10112209 -10081079 -10015554 -9964372 -9897089 -9840460
11353i840460N8967L2600N7107P1518M1936J6354J9903J7028K6503M1504M0656
11342i416384L3289M3713O2730M6765M4988L9786L1478J7219L5662M8893L9357
11331h972504O2131M6644K5124L6345N6442L6882J1393L1081N9558L1235L1628
11320h544041k1666O931L4628P0577O4160O0073L8787L2840J7016M788J1495K9392
11308h195020M3401L4680J7467K7200L4377J7301M2010K9988L0182M7151M7723
11297g823540L0429K1173K2871M3899M4080O8979N9311K9897K0897J7559J5137
11286g449308L0879N1631M0350L2770K3784o934r068M1392L4602L3316L2767J4842
11274g128977J2850M8112K9424K970N066J6383K6935M8363K7452J0015K8979K2613
$$ plain form
11353 -9840460 -9781493 -9748893 -9691786 -9620268 -9578332 -9561978 -9542075 -9525047 -9498544 -9457040 -9416384
11342 -9416384 -9383095 -9339382 -9276652 -9229887 -9184899 -9145113 -9113635 -9096416 -9060754 -9011861 -8972504
11331 -8972504 -8910373 -8863729 -8838605 -8802260 -8745818 -8708936 -8697543 -8666462 -8606904 -8575669 -8544041
11320 -8544041 -8565707 -8558776 -8524148 -8453571 -8389411 -8329338 -8290551 -8257711 -8240695 -8235907 -8224412 -8195020
11308 -8195020 -8151619 -8116939 -8099472 -8072272 -8037895 -8020594 -7978584 -7948596 -7918414 -7871263 -7823540
11297 -7823540 -7793111 -7771938 -7749067 -7705168 -7661088 -7592109 -7532798 -7502901 -7482004 -7464445 -7449308
11286 -7449308 -7418429 -7366798 -7326448 -7293678 -7269894 -7276828 -7285896 -7244504 -7209902 -7176586 -7143819 -7128977
11274 -7128977 -7116127 -7068015 -7038591 -7035621 -7030555 -7014172 -6987237 -6938874 -6911422 -6901407 -6872428 -6849815
11262f849815K0473L3641M8710M7832J5924K1088M9766M6716m265K3797J1375
11251f534758R598J3797j5637j637K9476K1407K7151K2493K7176L4635M4520L4468
11239f287311J0282K0404L4723K9954j5367J5129M7814L1613j19o654j5144L9788
11227f094888K183m363m94Q160M0470J7025K3607K7731M6230M1647M6285M820
11215e841587k750J9621P396k971M908j3757J4600R114O687L3605N2452K3512
11203e689170J0392J7230J8820K6770J0702K8381J1891m550K1162L7534J124K1630
11191e488084J2351K2626M0229L197Q235Q669M320k0906P823L1693O049L1653
11179e332145K0667L3J0621L1631L1214k869j8817m00K1990K3125J829L1450L0990
$$ plain form
11262 -6849815 -6829342 -6795701 -6746991 -6699159 -6683235 -6662147 -6612381 -6565665 -6569930 -6546133 -6534758
11251 -6534758 -6525160 -6511363 -6527000 -6528637 -6499161 -6477754 -6450603 -6428110 -6400934 -6366299 -6321779 -6287311
11239 -6287311 -6277029 -6256625 -6221902 -6191948 -6207315 -6192186 -6144372 -6112759 -6112878 -6119532 -6134676 -6094888
11227 -6094888 -6092705 -6097068 -6097562 -6089402 -6048932 -6031907 -6008300 -5980569 -5934339 -5892692 -5846407 -5841587
11215 -5841587 -5844337 -5824716 -5817320 -5820291 -5815383 -5829140 -5814540 -5805426 -5798739 -5765134 -5712682 -5689170
11203 -5689170 -5678778 -5661548 -5642728 -5615958 -5605256 -5576875 -5564984 -5569534 -5548372 -5510838 -5509714 -5488084
11191 -5488084 -5475733 -5453107 -5412878 -5409681 -5401446 -5392777 -5388457 -5409363 -5401540 -5369847 -5363798 -5332145
11179 -5332145 -5311478 -5311445 -5300824 -5269193 -5237979 -5240848 -5259665 -5260065 -5238075 -5214950 -5213121 -5181671 -5150681
11166e150681K7814J3031J8921l668n082R284K6371L7107J0539N300Q189M325
11154d998550O033J0035J8263J4780M0685M7596K2426M096J80j3804Q242L689
11142d836329k5538Q160L8950M3718J7664l527j4245J4300J0223J4807K6956q21
11130d705682k2179K1228M5552M347m547K5402J3977J6388Q694Q103R337O410
11118d572970J7347M5027K6566K4157J3257J3811L0553M0504j2783R656L215p481
11106d369141K2417M4960Q600R757K4540Q833L4887L1832K0947J8623J3304K3128
11094d107313N1213P3745M3492K8733M4943N0682O5543P8867N7227J06439J08767
11083c397662J23824J08569J7361j72682o20508r32387n01514j8864J33339J58320
$$ plain form
11166 -5150681 -5122867 -5109836 -5090915 -5094583 -5099665 -5090381 -5064010 -5026903 -5016364 -5011064 -5002875 -4998550
11154 -4998550 -4992517 -4982482 -4964219 -4949439 -4908754 -4861158 -4838732 -4834636 -4834456 -4848260 -4840018 -4836329
11142 -4836329 -4861867 -4853707 -4814757 -4771039 -4753375 -4756902 -4771147 -4756847 -4746624 -4731817 -4704861 -4705682
11130 -4705682 -4727861 -4706633 -4661081 -4656734 -4661281 -4635879 -4621902 -4605514 -4596820 -4588717 -4579380 -4572970
11118 -4572970 -4555623 -4510596 -4484030 -4459873 -4446616 -4432805 -4402252 -4361748 -4374531 -4364875 -4361660 -4369141
11106 -4369141 -4346724 -4301764 -4293164 -4283407 -4258867 -4250034 -4215147 -4183315 -4162368 -4143745 -4130441 -4107313
11094 -4107313 -4056100 -3982355 -3938863 -3910130 -3865187 -3814505 -3748962 -3670095 -3612868 -3506429 -3397662
11083 -3397662 -3273838 -3165269 -3147908 -3320590 -3941098 -4873485 -5374999 -5393863 -5260524 -5102204
11073e102204J17126J13169Q7179N3384L9346L0787K2306K6698J263K1684K7715
11062d561547K0310K2141K5330P381L377K0242O8914L2974Q374P466K4316M857
11050d315865N369J6572L7944m19K222J6527M832q87K2288L4790K5466n181K814
11037d153528K6324N50l174J6721J3735K5312J8816P443J5152J4935K7842j846
11025c991718J4071N951r614m279j450N885J1749K6453J0117j883K6646L8229
11013c869843k4515j217J2809J0940O519o275J0293K1938L6634K2800J9989o688
11001c766616j2571q371J0300k377K593J272L9j0165k238K8735K9784L4598j3285
10988c708302j0157K6858J1129j8935m863M723j3143J0513K7033J5806Q055k290
$$ plain form
11073 -5102204 -4985078 -4871909 -4784730 -4731346 -4692000 -4661213 -4638907 -4612209 -4610946 -4589262 -4561547
11062 -4561547 -4541237 -4519096 -4493766 -4486385 -4483008 -4462766 -4393852 -4360878 -4352504 -4345038 -4320722 -4315865
11050 -4315865 -4310496 -4293924 -4255980 -4256399 -4254177 -4237650 -4232818 -4233705 -4211417 -4176627 -4151161 -4156342 -4153528
11037 -4153528 -4127204 -4126654 -4129828 -4113107 -4099372 -4074060 -4055244 -4047801 -4032649 -4017714 -3989872 -3991718
11025 -3991718 -3977647 -3971696 -3981310 -3985589 -3987039 -3981154 -3969405 -3942952 -3932835 -3934718 -3908072 -3869843
11013 -3869843 -3894358 -3895575 -3882766 -3871826 -3865307 -3871582 -3861289 -3839351 -3802717 -3779917 -3759928 -3766616
11001 -3766616 -3779187 -3787558 -3777258 -3779635 -3777042 -3775770 -3775731 -3785896 -3788134 -3759399 -3729615 -3695017 -3708302
10988 -3708302 -3718459 -3691601 -3680472 -3699407 -3704270 -3699547 -3712690 -3702177 -3675144 -3659338 -3651283 -3653573
10976c653573q620j167K1143M2421K6110K4798k7811l7039J1895J9144O148k1701
10964c598252J7716O995J4416P086L2660M0075K5871j1616j4459J13o278K0802
10952c464871R413Q535o748k0941k670K1925O563o581l824L0598L6837J1019J7218
10939c363527J4300j7070o595k0094J0808J4399k5429J036j1209L1981J2168j345
10927c360577J6410J3281K0222j2142O9J600j4718q475K7381K4377K811J2469
10915c277292J5049L1107L5174k6958k6713r13J3049P638L4223K1605J4910J3036
10903c146085J2816p722m965N425J875l0341j5361K2010O257J4263J258r450k63
10890c150283j284M559J3636k30J3473J6925M512J0331K6447J4400k7842O807
$$ plain form
10976 -3653573 -3662193 -3663360 -3642217 -3599796 -3573686 -3548888 -3576699 -3613738 -3601843 -3582699 -3576551 -3598252
10964 -3598252 -3580536 -3573541 -3559125 -3552039 -3519379 -3479304 -3453433 -3465049 -3479508 -3479395 -3485673 -3464871
10952 -3464871 -3455458 -3446923 -3453671 -3474612 -3477282 -3455357 -3448794 -3455375 -3459199 -3428601 -3391764 -3380745 -3363527
10939 -3363527 -3349227 -3366297 -3372892 -3392986 -3382178 -3367779 -3393208 -3392172 -3403381 -3371400 -3359232 -3360577
10927 -3360577 -3344167 -3330886 -3310664 -3322806 -3322737 -3321137 -3335855 -3344330 -3316949 -3292572 -3289761 -3277292
10915 -3277292 -3262243 -3231136 -3195962 -3222920 -3249633 -3250546 -3237497 -3229859 -3195636 -3174031 -3159121 -3146085
10903 -3146085 -3133269 -3140991 -3145956 -3140531 -3138656 -3168997 -3184358 -3162348 -3156091 -3141828 -3140570 -3150020 -3150283
10890 -3150283 -3151567 -3147008 -3133372 -3133602 -3120129 -3103204 -3098692 -3088361 -3061914 -3047514 -3075356 -3068549
10878c068549k8688J1058L270q506J5328J364J7844m609j2282L6167J7335j0874
10866c031142r931j3843J6578J9077K3669J4173J0979J113j032L99R967j3117
10854b973110K136o258k6080L3220K1007O219J365P558J1445R168q753j2705Q1
10841b934707O830j835M0136J4440K0533k920k323j7559k267Q531j4800J6971
10829b868970J6597r151j8334m612k739J3445J6799J2014J4594M56M310L2658
10817b792933j596K229J07J8050J0766r699k2407k687P121j758J054P413K7753
10804b756587Q466J5738k070k3571j8270j3453r843J6174J3039l382K01N7K4277
10791b749224K1586k05l821J0805L100K1783R517O256J5636j0516j1189J7261
$$ plain form
10878 -3068549 -3097237 -3086179 -3082909 -3091415 -3076087 -3074723 -3056879 -3061488 -3073770 -3037603 -3020268 -3031142
10866 -3031142 -3041073 -3054916 -3038338 -3019261 -2995592 -2981419 -2970440 -2969327 -2970359 -2969960 -2959993 -2973110
10854 -2973110 -2970974 -2977232 -3003312 -2970092 -2949085 -2942866 -2941501 -2933943 -2922498 -2913330 -2922083 -2934788 -2934707
10841 -2934707 -2927877 -2929712 -2889576 -2875136 -2854603 -2857523 -2859846 -2877405 -2879672 -2871141 -2885941 -2868970
10829 -2868970 -2852373 -2861524 -2879858 -2884470 -2887209 -2873764 -2856965 -2844951 -2830357 -2829901 -2825591 -2792933
10817 -2792933 -2794529 -2792300 -2792193 -2774143 -2763377 -2773076 -2795483 -2798170 -2791049 -2792807 -2791753 -2784340 -2756587
10804 -2756587 -2748121 -2732383 -2734453 -2758024 -2776294 -2789747 -2799590 -2783416 -2770377 -2773759 -2773558 -2773501 -2749224
10791 -2749224 -2727638 -2727843 -2731664 -2720859 -2717759 -2695976 -2686459 -2680203 -2664567 -2675083 -2686272 -2669011
10779b669011M677l254K1591j819J3300P117O215l986r606k0048O332R716l020
10766b641796m679L5070J9291P92m446p779j012J2772J1057J6479J0063j0447
10754b564635J5066J5423k52O712M122n143n021K2655K6308J0302k1018k701j5408
10741b513590R366J5744n992o321J4145J0742J2389k3622J342m444P11K2431N037
10728b462062O855o752J0822J5212L10m257K1535K470j5688p347Q988k783n249
10715b437946K7941K748l6693j2722J8244J3355l51k148J913J2241L4570L328
10703b375520J4793J5842j1391o537R592n509q478M69q929l388J9818J9776J0589
10690b328873K018j0928j3237J821m396r156K3033L2600K44n535N196M095j6390
$$ plain form
10779 -2669011 -2664334 -2667588 -2645997 -2647816 -2634516 -2627399 -2621184 -2625170 -2634776 -2654824 -2648492 -2638776 -2641796
10766 -2641796 -2646475 -2611405 -2592114 -2591322 -2595768 -2603547 -2604559 -2591787 -2580730 -2564251 -2554188 -2564635
10754 -2564635 -2549569 -2534146 -2534398 -2527686 -2523564 -2528707 -2533728 -2511073 -2484765 -2474463 -2495481 -2498182 -2513590
10741 -2513590 -2504224 -2488480 -2494472 -2500793 -2486648 -2475906 -2463517 -2487139 -2485797 -2490241 -2489530 -2467099 -2462062
10728 -2462062 -2455207 -2461959 -2451137 -2435925 -2435615 -2439872 -2418337 -2415867 -2431555 -2438902 -2429914 -2432697 -2437946
10715 -2437946 -2410005 -2407257 -2443950 -2456672 -2438428 -2425073 -2425424 -2427572 -2425659 -2413418 -2378848 -2375520
10703 -2375520 -2360727 -2344885 -2356276 -2362813 -2353221 -2358730 -2367208 -2366739 -2375668 -2379056 -2359238 -2339462 -2328873
10690 -2328873 -2326855 -2337783 -2351020 -2349199 -2353595 -2362751 -2339718 -2307118 -2306874 -2312409 -2307213 -2303118 -2319508
10677b319508o841o527q777L1149K7129K5054J0610q002N227J0503M325J6501
10665b219157j6462l8307K3509P481K0715J2794p499r491M981k853p933R886N327
10652b217009l922k922K1198O573P088o509O690M605j0243J8783m438J0481k3732
10639b193357L201K3637J903P066J7216J1527R731r445M426l459R917K4298J4506
10626b078833j5618l3281L555P369j9908j9733J5248J9334J8857K386j2723m896
10614b118243L503K4445J0507j517Q13J8588K5740o010k4243j082K7668o556o400
10601b052787p659J0229q702j8329K167K9306K6874L3010N712p434k1794K595
10589b006812J7862j160K280k5216l3211M1406K0928R242R439J1177O837N62k1127
$$ plain form
10677 -2319508 -2326349 -2332876 -2341653 -2310504 -2283375 -2258321 -2247711 -2255713 -2250486 -2239983 -2235658 -2219157
10665 -2219157 -2235619 -2273926 -2250417 -2242936 -2222221 -2209427 -2216926 -2226417 -2221436 -2224289 -2232222 -2222336 -2217009
10652 -2217009 -2220931 -2223853 -2202655 -2196082 -2188994 -2195503 -2188813 -2184208 -2194451 -2175668 -2180106 -2169625 -2193357
10639 -2193357 -2190156 -2166519 -2164616 -2157550 -2140334 -2128807 -2119076 -2128521 -2124095 -2127554 -2117637 -2093339 -2078833
10626 -2078833 -2094451 -2127732 -2124177 -2116808 -2136716 -2156449 -2141201 -2121867 -2103010 -2100624 -2113347 -2118243
10614 -2118243 -2114740 -2090295 -2079788 -2081305 -2080492 -2061904 -2036164 -2042174 -2066417 -2067499 -2039831 -2046387 -2052787
10601 -2052787 -2060446 -2050217 -2058919 -2077248 -2075081 -2045775 -2018901 -1985891 -1980179 -1987613 -2009407 -2006812
10589 -2006812 -1988950 -1990110 -1987830 -2013046 -2046257 -2004851 -1983923 -1974681 -1965242 -1954065 -1947228 -1946666 -1967793
10576a967793m3049l8051J6967M0439J8419K1911J2893j7871M88K348j4125J4423
10564a953001J0887M376j3852p884P061N013J7435M309J5545J4857p419J3702
10552a888971j0360l5924J2663K4495J5238J6452R279K723r631J7283o63j1934
10540a859350J1986M385l074q670j2966j974K0087m809Q777q109M078K7474J3485
10527a808680J2701j7719r043j4690K3530J6573p095r177Q079m212J3787N776
10515a790170J0765m179j3529O692j1108l463M457K0469l53M296K0604l413j1079
10502a770011j311J2109L886M194l121k8378J4981K4343o4l433L999K1970K9191
10489a691645K999j1507J00o145N469J2173m485J1793p083l892J0392p02o363
$$ plain form
10576 -1967793 -2010842 -2048893 -2031926 -1991487 -1973068 -1951157 -1938264 -1956135 -1955647 -1953299 -1967424 -1953001
10564 -1953001 -1942114 -1937738 -1951590 -1959474 -1952413 -1947400 -1929965 -1925656 -1910111 -1895254 -1902673 -1888971
10552 -1888971 -1899331 -1935255 -1922592 -1898097 -1882859 -1866407 -1857128 -1854405 -1864036 -1846753 -1847416 -1859350
10540 -1859350 -1847364 -1842979 -1846053 -1854723 -1867689 -1869663 -1849576 -1854385 -1845608 -1853717 -1849639 -1822165 -1808680
10527 -1808680 -1795979 -1813698 -1822741 -1837431 -1813901 -1797328 -1804423 -1813600 -1805521 -1809733 -1795946 -1790170
10515 -1790170 -1779405 -1783584 -1797113 -1790421 -1801529 -1804992 -1800535 -1780066 -1780419 -1776123 -1755519 -1758932 -1770011
10502 -1770011 -1771322 -1759213 -1755327 -1751133 -1754254 -1782632 -1767651 -1743308 -1743372 -1746805 -1742806 -1720836 -1691645
10489 -1691645 -1688646 -1700153 -1700053 -1706198 -1700729 -1688556 -1693041 -1681248 -1688331 -1692223 -1681831 -1682533 -1688896
10476a688896l187K012J3764L8595Q118j3489j6055P908j2846j9041K17J7268
10464a665632P991K1966K5890J8905k7189r271L0909q295R969O731k604l708j0111
10451a604449q87K992N600r912j0183K552P49R101J6671J4088r05j3330m922p361
10437a600196J0623j1391K692J2917M375j611j1496k076J4636K7768R086j2577
10425a557250j2863O488r818J2384J831J2019L4078K5198k0387m855P666L571
10413a501938p480p513J579K1775Q563k717j2366J8413N374p178n553K3342O991
10400a458708o043j0507m125J3901K6852j8892j613K1153J755P546O027j0215
10388a432869p744M356J2315j476K5191J9304j3066J1663K433M502r247k54J9200
$$ plain form
10476 -1688896 -1692083 -1690071 -1676307 -1637712 -1629594 -1643083 -1659138 -1651230 -1664076 -1683117 -1682900 -1665632
10464 -1665632 -1657641 -1635675 -1609785 -1590880 -1618069 -1627340 -1596431 -1604726 -1594757 -1588026 -1590630 -1594338 -1604449
10451 -1604449 -1605336 -1602344 -1596744 -1606656 -1616839 -1614287 -1613538 -1604437 -1587766 -1573678 -1574583 -1587913 -1592835 -1600196
10437 -1600196 -1589573 -1600964 -1598272 -1585355 -1580980 -1582591 -1594087 -1596163 -1581527 -1553759 -1544673 -1557250
10425 -1557250 -1570113 -1563625 -1573443 -1561059 -1559228 -1547209 -1513131 -1487933 -1508320 -1513175 -1505509 -1501938
10413 -1501938 -1509418 -1516931 -1515352 -1493577 -1485014 -1487731 -1500097 -1481684 -1476310 -1483488 -1489041 -1465699 -1458708
10400 -1458708 -1464751 -1475258 -1479383 -1465482 -1438630 -1457522 -1459135 -1437982 -1436227 -1428681 -1422654 -1432869
10388 -1432869 -1440613 -1436257 -1423942 -1425418 -1400227 -1380923 -1393989 -1382326 -1379893 -1375391 -1384638 -1384892 -1365692
10375a365692J2617o178J5129m452l512q546j4713j7524J1219K818k075L000J779
10362a376130J4084K1629K7646K486m573m483p876J8102K4957L1942M963k0584
10350a267837j2896j539L739k175Q199o226j2631J33J4180r421J0198q190m2062
10337a326528M234M3700R961K2595o206k0102J1017J6644m049m255J4453J4690
10325a223846Q173J4060K183J1114j1108k095L2832J0848l463j9444K0360j2660
10313a173046N083n72j4485J1236K3900j0376p505o155j6309J1968R014J5490
10301a151757J0311k429O478o015N703J3596J4112K6275j0117l959r895R998J2757
10288a084942p502K5135J509l893l339j688J7383J7971r048j7809M247K0240l116
$$ plain form
10375 -1365692 -1353075 -1359253 -1344124 -1348576 -1352088 -1360634 -1375347 -1392871 -1381652 -1378834 -1380909 -1377909 -1376130
10362 -1376130 -1362046 -1340417 -1312771 -1310285 -1314858 -1319341 -1327217 -1309115 -1284158 -1252216 -1247253 -1267837
10350 -1267837 -1280733 -1282272 -1278533 -1280708 -1272509 -1278735 -1291366 -1291233 -1277053 -1286474 -1276276 -1284466 -1326528
10337 -1326528 -1322294 -1278594 -1268633 -1246038 -1252244 -1272346 -1261329 -1244685 -1248734 -1252989 -1238536 -1223846
10325 -1223846 -1215673 -1201613 -1199430 -1188316 -1199424 -1201519 -1168687 -1157839 -1161302 -1180746 -1160386 -1173046
10313 -1173046 -1167963 -1168535 -1183020 -1171784 -1147884 -1158260 -1165765 -1171920 -1188229 -1176261 -1167247 -1151757
10301 -1151757 -1141446 -1143875 -1137397 -1143412 -1137709 -1124113 -1110001 -1083726 -1093843 -1097802 -1107697 -1097699 -1084942
10288 -1084942 -1092444 -1067309 -1065800 -1069693 -1073032 -1074720 -1057337 -1039366 -1048414 -1066223 -1061976 -1041736 -1044852
10275a044852p251jR987k3400N581K3921L090j0602J224K9446M9149M496k0823
10262i80035K931N65j6811j3230K225n348K5566J6364o383Q611P348j261J1952
10249i47506L9591n163l1974J7567J0835K2053J620K0465K0001m3m674o903J0249
10236h53882J7380J7483j7420o323J013j8930K4960L0220K5355J1408l582J9675
10224g52643K1170j0597J6810q874k8937o765K9536L9586K2754M8N84K7622L9089
10211f10617J7837N308J5730J7436J0927o4L6375M0643P0515P0992M3049j2135
10199b94004n6069r1962n5345o1465j52633k43435j26941j8092m8802j09644m8610
10188a307002M2993N3879L0103L6693L2110K2863K6693L2539J4404L3847j599
$$ plain form
10275 -1044852 -1052103 -1052104 -1042117 -1065517 -1059936 -1036015 -1032925 -1043527 -1042303 -1012857 -963708 -959212 -980035
10262 -980035 -977104 -976539 -993350 -1006580 -1004355 -1009703 -984137 -967773 -974156 -965545 -958197 -959458 -947506
10249 -947506 -907915 -913078 -945052 -927485 -916650 -894597 -892977 -872512 -852511 -852554 -857228 -864131 -853882
10236 -853882 -836502 -819019 -836439 -842762 -841749 -860679 -835719 -805499 -780144 -768736 -772318 -752643
10224 -752643 -731473 -742070 -725260 -734134 -763071 -769836 -740300 -700714 -677960 -677912 -677328 -649706 -610617
10211 -610617 -592780 -587472 -571742 -554306 -543379 -543443 -507068 -466425 -395910 -324918 -281869 -294004
10199 -294004 -350073 -442035 -497380 -558845 -711478 -954913 -1081854 -1099946 -1148748 -1258392 -1307002
10188 -1307002 -1264009 -1210130 -1180027 -1143334 -1111224 -1088361 -1061668 -1029129 -1014725 -980878 -982477
10177i82477L336J5161L1252K3543j32o884J8443L1742K4803M179R829j9132q166
10164h54503K4695P200m443Q126M2430N548O133K0731L2759J909P342N181j8743
10151g15635j095J2025J4376K1374O39q391r623j175L393M401J4524K5005J6616
10138f23566m435n19m537R934J414J0354Q566J2510q407o062Q003l818J8010J8174
10124e64379L925K0141M444p722K0492K6493M18k5123l5543K5001M8810K0911
10112d62132N7j3855O23J6656J8757K2594K0711j892m740j8762q654J0497J9020
10099d01120K735q690P913M1560L5903j0602j0376J9814K914k104j1038J6605
10087c16486O509k2614j0954P762Q314Q890K0946N656m293K3473K6016Q506J0146
$$ plain form
10177 -982477 -979141 -963980 -932728 -909185 -909317 -916201 -897758 -866016 -841213 -837034 -827205 -846337 -854503
10164 -854503 -829808 -822608 -827051 -818925 -776495 -770947 -764814 -744083 -711324 -709415 -702073 -696892 -715635
10151 -715635 -716730 -704705 -690329 -668955 -668316 -676707 -686330 -687505 -684112 -679711 -665187 -640182 -623566
10138 -623566 -628001 -628520 -633057 -623123 -621709 -611355 -602789 -590279 -598686 -604748 -596745 -600563 -582553 -564379
10124 -564379 -560454 -540313 -535869 -543591 -523099 -496606 -496188 -521311 -556854 -531853 -483043 -462132
10112 -462132 -462075 -475930 -475307 -458651 -439894 -417300 -396589 -398481 -403221 -421983 -430637 -420140 -401120
10099 -401120 -398385 -407075 -399162 -357602 -321699 -332301 -342677 -322863 -319949 -322053 -333091 -316486
10087 -316486 -309977 -332591 -343545 -335783 -327469 -318579 -297633 -291977 -296270 -272797 -246781 -238275 -228129
10074b28129J7973j6662K292j5814j592J290J8099K5025J7406L4921J7803j1063
10062a38451k2964K6255J0050K4465J6833L885L5328J7439j6572l294J6840J0973
10050a9213J687J9452L0879K8035J3706L233n375K338j023J0541K3668O550N455
10037A19933N483J7319K0824J313J2211M1683L6786Q059K7039M1070L4718J0612
10025C77050K4108M8344M6167M1373K0657J8374l1437m1514k539j1934j2015n5511
10013D21123l9485J3010R983j4252l4749n6970k9618j5931j9939q6603j31131
10002A5438j24240m7373k9425o7836n8443j1531M0144N1350M7754M9873K6560
9991a07729K6517M9925K7715K9112K1925O422O583K2740J0892K9013M1546J3357
$$ plain form
10074 -228129 -210156 -226818 -224526 -240340 -241932 -240642 -222543 -197518 -180112 -145191 -127388 -138451
10062 -138451 -161415 -135160 -125110 -100645 -83812 -79927 -44599 -27160 -43732 -47026 -30186 -19213
10050 -19213 -17526 1926 32805 60840 74546 77779 72404 74742 73719 84260 107928 114478 119933
10037 119933 125416 142735 163559 164872 177083 218766 255552 263611 290650 331720 366438 377050
10025 377050 401158 449502 495669 537042 557699 576073 544636 503122 500583 488649 476634 421123
10013 421123 381638 394648 404631 390379 355630 298660 269042 253111 233172 146569 15438
10002 15438 -108802 -156175 -185600 -253436 -311879 -323410 -283266 -231916 -184162 -134289 -107729
9991 -107729 -81212 -31287 -3572 25540 47465 53887 60470 83210 94102 123115 164661 178018
9979A78018j9028j1186K3760L3191L4308K3417j856L6587J8544l736J3288J6728
9967C42035K1056K7005K9915Q683K3209O33k3409L4776K6750K5702K7227J2562
9955E56144J5894J2339J8592J7031K4340l799P118J5246J7152L8017J7975r02
9943G35147k1140J7322K7940K3731n598J3408L0464J0367K1282J3218R121J9443
9931H94705K8072K3903J0157J268j5995P001K1780L0713K7372K0081J1182J4811
9919A075050J5755L0936P532J0068J7247Q462K4532L0606K3123N686J0578L2216
9907A291791L0257K4441M235L4780N6667K9565K2177L2338J0679m068k158J2233
9895A542937J8280K7315M0409N4911L3757k3673m26L4394J6112k641K4422M2588
$$ plain form
9979 178018 158990 147804 171564 204755 239063 262480 260624 297211 315755 312019 325307 342035
9967 342035 363091 390096 420011 428694 451903 452536 429127 463903 490653 516355 543582 556144
9955 556144 572038 584377 602969 620000 644340 640541 647659 662905 680057 718074 736049 735147
9943 735147 714007 731329 759269 783000 777402 790810 821274 831641 852923 866141 875262 894705
9931 894705 922777 946680 956837 958105 942110 949111 970891 1001604 1028976 1049057 1060239 1075050
9919 1075050 1090805 1121741 1129273 1139341 1156588 1165050 1189582 1220188 1243311 1248997 1259575 1291791
9907 1291791 1322048 1346489 1350724 1385504 1442171 1471736 1493913 1526251 1536930 1532862 1530704 1542937
9895 1542937 1561217 1588532 1628941 1683852 1717609 1693936 1693510 1727904 1744016 1741375 1765797 1808385
9883A808385K4874M55K0348K8767L8182K5206R969L4480M3004K9350J7507L7359
9871B117886K3308N000K3803L8304L0545L8902M7566R5J2243L8134L7128M4572
9859B457486K5485J0536L1545L2297L4649M4837M9684O5353K6493K2236O440N9292
9847B866333P1209J8290J6868M071J3534L0476O8973P3736K7086J6793J7103K8983
9835C253455M7506N2799J4683L9484M0294M1348N9828M6994O0180Q2326M1998
9824C780895K7920L9015N8583O4696N0895L8261L7194M2012O7552O3374J8987
9813D289384M1718O2423O7169P5177L8360L9254M7701N6933M9117P9713N8156
9802D905105L8069L1141M4845O0365O9212M7284L0314N4953Q1560O4143K4778
$$ plain form
9883 1808385 1833259 1833714 1854062 1882829 1921011 1946217 1956186 1990666 2033670 2063020 2080527 2117886
9871 2117886 2141194 2146194 2169997 2208301 2238846 2277748 2325314 2325409 2337652 2375786 2412914 2457486
9859 2457486 2482971 2493507 2525052 2557349 2591998 2636835 2686519 2751872 2778365 2800601 2807041 2866333
9847 2866333 2937542 2955832 2972700 2976771 2990305 3020781 3089754 3163490 3190576 3207369 3224472 3253455
9835 3253455 3300961 3353760 3368443 3407927 3448221 3489569 3549397 3596391 3656571 3738897 3780895
9824 3780895 3808815 3847830 3906413 3971109 4022004 4060265 4097459 4139471 4207023 4270397 4289384
9813 4289384 4331102 4393525 4460694 4535871 4574231 4613485 4661186 4718119 4767236 4846949 4905105
9802 4905105 4943174 4974315 5019160 5079525 5148737 5196021 5226335 5281288 5362848 5426991 5451769
9791E451769K6450K7774L9198M1188J3749L7589M0100K2266K5365J3765N287R645
9779E754145j8212k3111j6848P796k1788m0477o9018n5108n0882o6453o9107p5463
9767E255474j29976j09257j26326j42662j68928k06497j94534k02160k22059k40026
9757C513049k42124k59246k80749k88197l18308l30194l33334l28964l55722l54196
9747D22015l88083l51952l67044l92977l89051l61140l39856l51199l60631l58165
9737c238083l46207l05284l05120l22996l03225k93688k81879k44047k20162k43694
9727f104385k42222j93603j82023k09350j90602j45586j49135j28284j22101j14440
9717g781731r7794p9083q7956o7033n7720k6060n3193n3993m2879k9280k2195
$$ plain form
9791 5451769 5478219 5505993 5545191 5586379 5600128 5637717 5677817 5700083 5725448 5739213 5744500 5754145
9779 5754145 5735933 5712822 5695974 5703770 5681982 5641505 5572487 5517379 5466497 5400044 5330937 5255474
9767 5255474 5125498 5016241 4889915 4747253 4578325 4371828 4177294 3975134 3753075 3513049
9757 3513049 3270925 3011679 2730930 2442733 2124425 1794231 1460897 1131933 776211 422015
9747 422015 33932 -318020 -685064 -1078041 -1467092 -1828232 -2168088 -2519287 -2879918 -3238083
9737 -3238083 -3584290 -3889574 -4194694 -4517690 -4820915 -5114603 -5396482 -5640529 -5860691 -6104385
9727 -6104385 -6346607 -6540210 -6722233 -6931583 -7122185 -7267771 -7416906 -7545190 -7667291 -7781731
9717 -7781731 -7879525 -7958608 -8046564 -8113597 -8171317 -8197377 -8250570 -8304563 -8347442 -8376722 -8398917
9706h398917k4336k1937j3374l1486N060N987R735J4971J0661M7336K4437K0030
9694h351833J2090M0627j422J361K9269N5126M3056M2738M7319L9570L8098J6574
9682g987427M017M3551P5102P1886L3638K2526M6093L8479O5549P5202K7347J5080
9670g468957N2439M3465L4337M0659L6801N8189M9923M4150M9762M1503N8134
9659f959595N1662N0531M8798K0132J8953J9255P2649M4118L6884M2759M5041
9648f508813M6566N1820M1374K6991K7061K3608L0607M9978K3014J4389M3292
9637f130113L9936J1240K5555N3571M2364L0011M6107L1032K1035J6237J9120
9626e793905M0246N7662K5971J9054M7187J1082L1114N2094K8874K6928J2086
$$ plain form
9706 -8398917 -8423253 -8445190 -8458564 -8490050 -8484990 -8479003 -8469268 -8454297 -8443636 -8396300 -8371863 -8351833
9694 -8351833 -8339743 -8299116 -8300538 -8299177 -8269908 -8214782 -8171726 -8128988 -8081669 -8042099 -8004001 -7987427
9682 -7987427 -7983410 -7939859 -7864757 -7792871 -7759233 -7736707 -7690614 -7652135 -7586586 -7511384 -7484037 -7468957
9670 -7468957 -7416518 -7373053 -7338716 -7298057 -7261256 -7203067 -7153144 -7108994 -7059232 -7017729 -6959595
9659 -6959595 -6907933 -6857402 -6808604 -6788472 -6769519 -6750264 -6677615 -6633497 -6596613 -6553854 -6508813
9648 -6508813 -6462247 -6410427 -6369053 -6342062 -6315001 -6291393 -6260786 -6210808 -6187794 -6173405 -6130113
9637 -6130113 -6090177 -6078937 -6053382 -5999811 -5957447 -5927436 -5881329 -5850297 -5829262 -5813025 -5793905
9626 -5793905 -5753659 -5695997 -5670026 -5650972 -5603785 -5592703 -5561589 -5509495 -5480621 -5453693 -5441607
9615e441607K8239L0061K5429K9788L8737L3856J5024J1793K6172N8881K4948
9604e118679n125L060K7928K6708K4285N855O55K4425L7383K3648L2503J8311
9592d899043J4814K1405J7119K3469K6170K1769K7012R242J5408K7053L6824J8233
9580d640525j1098K8000L0346K3159K1692K6547r550q369R647J9481J6540J9105
9568d475025J8685L2551J8527K0848J3039j774Q639J4145L1854N4230M048R673
9556d250560J5384r073j0455O085K2434J6002k724P953K2771L1555J7818J5001
9544d117809o598J4007J2177J4773K8135L7418j3809r088L0983L5138J1247K006
9532c961420J9263p031j3685k546O859J5465q485p845M6436M3870J0122K1418
$$ plain form
9615 -5441607 -5413368 -5383307 -5357878 -5328090 -5289353 -5255497 -5240473 -5228680 -5202508 -5143627 -5118679
9604 -5118679 -5123804 -5120744 -5092816 -5066108 -5041823 -5035968 -5035313 -5010888 -4973505 -4949857 -4917354 -4899043
9592 -4899043 -4884229 -4862824 -4845705 -4822236 -4796066 -4774297 -4747285 -4738043 -4722635 -4695582 -4658758 -4640525
9580 -4640525 -4651623 -4623623 -4593277 -4570118 -4548426 -4521879 -4531429 -4539798 -4530151 -4510670 -4494130 -4475025
9568 -4475025 -4456340 -4423789 -4405262 -4384414 -4371375 -4373149 -4364510 -4350365 -4318511 -4264281 -4260233 -4250560
9556 -4250560 -4235176 -4244249 -4254704 -4248619 -4226185 -4210183 -4212907 -4204954 -4182183 -4150628 -4132810 -4117809
9544 -4117809 -4124407 -4110400 -4098223 -4083450 -4055315 -4017897 -4031706 -4040794 -4009811 -3974673 -3963426 -3961420
9532 -3961420 -3942157 -3949188 -3962873 -3965419 -3958560 -3943095 -3951580 -3959425 -3912989 -3869119 -3858997 -3837579
9520c837579K5833K0287K3494J0487r760j5651j0494K4885J7562L9135K4468k0619
9508c707952r08L3570r998J981L1956J6260m5987J2530K2563p345m996q194J0667
9495c655853L1781N0571K2064Q952O823J0673L2330J219k1385Q312Q535K2636
9483c473342K4472k441K5263K3277O332k2691Q416L5481K5074j559n083L1674
9471c325127J7419k8243k5631N831K8338L408J71l3257k2441J4984M8482K5872
9459c290194J9430K171J5959j8449R8J0775K2344K0548J8299m304O326q515j3232
9446c218744n485l300J9573K2292J3882K1822M7721K0312j6769J1513Q265r905
9434c088823o282j611n678j4419k6772m716L2043K3527K2733K7653j4054j7568
$$ plain form
9520 -3837579 -3811746 -3791459 -3767965 -3757478 -3767238 -3782889 -3793383 -3768498 -3750936 -3711801 -3687333 -3707952
9508 -3707952 -3708860 -3675290 -3685288 -3683307 -3651351 -3635091 -3681078 -3668548 -3645985 -3653330 -3658326 -3666520 -3655853
9495 -3655853 -3624072 -3573501 -3551437 -3542485 -3535662 -3524989 -3492659 -3491440 -3512825 -3504513 -3495978 -3473342
9483 -3473342 -3448870 -3451311 -3426048 -3402771 -3396439 -3419130 -3410714 -3375233 -3350159 -3351718 -3356801 -3325127
9471 -3325127 -3307708 -3335951 -3361582 -3355751 -3327413 -3324005 -3323834 -3357091 -3379532 -3364548 -3316066 -3290194
9459 -3290194 -3270764 -3268593 -3252634 -3271083 -3270985 -3260210 -3237866 -3217318 -3199019 -3203323 -3196997 -3205512 -3218744
9446 -3218744 -3224229 -3227529 -3207956 -3185664 -3171782 -3149960 -3102239 -3081927 -3098696 -3087183 -3078918 -3088823
9434 -3088823 -3095105 -3096716 -3102394 -3116813 -3143585 -3148301 -3116258 -3092731 -3069998 -3042345 -3056399 -3073967
9422c073967l093r65J7605K2879K7096N736N446J0489L667p685R110J7458N165
9409b961059j8307J5266R034K7417J6861J9607r248M614K4332j3815j7101J5004
9397b887395K1462m17O071n411r311j0105J5135P628J6501j3373o683J5377N625
9384b844896J7256R209p267N740J7433J541K541J2334n120p426j749J5871K7941
9371b756592J6768Q617J5634J6508K1615p184o899J0071p903J539K4467K2744
9359b640615J5754J888n909j1685n360R794j2714j4668M15K3491J4660r016k534
9346b636499o420J4251P165K1587J5931J8670L9176K0297J2109j2370p934j2350
9334b526387j7932k1152K2868O779M021K5590K6765r688r822P115P246N851J7506
$$ plain form
9422 -3073967 -3077060 -3078025 -3060420 -3037541 -3010445 -3004709 -2999263 -2988774 -2985107 -2992792 -2983682 -2966224 -2961059
9409 -2961059 -2979366 -2964100 -2955066 -2927649 -2910788 -2891181 -2900429 -2895815 -2871483 -2885298 -2902399 -2887395
9397 -2887395 -2865933 -2866350 -2860279 -2865690 -2875001 -2885106 -2869971 -2862343 -2845842 -2859215 -2865898 -2850521 -2844896
9384 -2844896 -2827640 -2818431 -2825698 -2819958 -2802525 -2800984 -2798443 -2786109 -2791229 -2798655 -2800404 -2784533 -2756592
9371 -2756592 -2739824 -2731207 -2715573 -2699065 -2677450 -2684634 -2691533 -2681462 -2689365 -2687826 -2663359 -2640615
9359 -2640615 -2624861 -2622973 -2628882 -2640567 -2645927 -2636133 -2648847 -2663515 -2663100 -2639609 -2624949 -2633965 -2636499
9346 -2636499 -2642919 -2628668 -2621503 -2599916 -2583985 -2565315 -2526139 -2505842 -2493733 -2506103 -2514037 -2526387
9334 -2526387 -2544319 -2565471 -2542603 -2535824 -2531803 -2506213 -2479448 -2489136 -2498958 -2491843 -2484597 -2478746 -2461240
9321b461240M1123O216j0100J366k3087j1708J1716J0397o21k196j7774R483K5563
9308b420862J3724K05K047J6953n687J2672L4273L2989n506k759M2169K5588K7825
9295b226369J8577Q176O72l0214o2225m4956l6569j4094M863J2273J4703K3638
9283b331525L2458J3894J2291P738K2905L8803k0331j9210j6475l6030j5998j550
9271b313030K5420K2688o445r438J6463J2691J2274K3390K1270N888J6783M8256
9259b123790M6496J9706o492o3835p3515j42638j53030j22812o6596N185L4869
9248b646452K8637N2558N4337L1916k7589j837J2417J7539L7968Q764J0033L593
9236b418116R326l5070m5367k7861L338k7739j0063K6519K2757M3807J9388J9628
$$ plain form
9321 -2461240 -2420117 -2413901 -2424001 -2422635 -2445722 -2457430 -2445714 -2435317 -2435938 -2438134 -2455908 -2446425 -2420862
9308 -2420862 -2407138 -2406933 -2404886 -2387933 -2393620 -2380948 -2346675 -2313686 -2319192 -2321951 -2279782 -2254194 -2226369
9295 -2226369 -2207792 -2199616 -2198944 -2229158 -2291383 -2336339 -2372908 -2387002 -2382139 -2369866 -2355163 -2331525
9283 -2331525 -2299067 -2285173 -2272882 -2265144 -2242239 -2203436 -2223767 -2242977 -2259452 -2295482 -2311480 -2313030
9271 -2313030 -2287610 -2264922 -2271367 -2280805 -2264342 -2251651 -2239377 -2215987 -2194717 -2188829 -2172046 -2123790
9259 -2123790 -2077294 -2057588 -2064080 -2127915 -2201430 -2344068 -2497098 -2619910 -2686506 -2681321 -2646452
9248 -2646452 -2617815 -2565257 -2510920 -2479004 -2506593 -2508430 -2496013 -2478474 -2440506 -2431742 -2421709 -2418116
9236 -2418116 -2408790 -2443860 -2489227 -2517088 -2513750 -2541489 -2551552 -2525033 -2502276 -2458469 -2439081 -2419453
9224b419453K5260R774J022J2048R987j3167m1934n8440p3128m3541j6350R966
9212b597956J9822J8533P147n045K1272K2489J1479K7499K0309K0574J6815J0662
9200b406400J4338O216p863J8750M890j6298J217M645J3021K7677J6598Q59L1413
9187b290937j7571R943Q664j6019n286k235j1012j690J3590k281p814K9423k85
9174b293510k912j7945j3564K1098L8545J6257j1953M366J8069J9272o478k081
9162b230836J402J5375j405m568J2406J0471K62L891n845k6042m855K3222K2272
9149b184250m695L352L908M641J5204j0330R770O885J2058j1872j1480J3399L440
9136b149970J9090J4606m045k1875j1483J0436P795o083K424M199K8260J9998
$$ plain form
9224 -2419453 -2394193 -2384419 -2383397 -2371349 -2361362 -2374529 -2416463 -2474903 -2548031 -2591572 -2607922 -2597956
9212 -2597956 -2578134 -2559601 -2552454 -2557499 -2536227 -2513738 -2502259 -2474760 -2454451 -2433877 -2417062 -2406400
9200 -2406400 -2392062 -2385846 -2393709 -2374959 -2370069 -2386367 -2385150 -2380505 -2367484 -2339807 -2323209 -2322350 -2290937
9187 -2290937 -2308508 -2298565 -2289901 -2305920 -2311206 -2313441 -2324453 -2326143 -2312553 -2314834 -2322648 -2293225 -2293510
9174 -2293510 -2296422 -2314367 -2327931 -2306833 -2268288 -2252031 -2263984 -2259618 -2241549 -2222277 -2228755 -2230836
9162 -2230836 -2229434 -2214059 -2215464 -2220032 -2207626 -2197155 -2196893 -2193002 -2198847 -2224889 -2229744 -2206522 -2184250
9149 -2184250 -2188945 -2185593 -2181685 -2177044 -2161840 -2172170 -2162400 -2155515 -2143457 -2155329 -2166809 -2153410 -2149970
9136 -2149970 -2130880 -2116274 -2120319 -2142194 -2153677 -2143241 -2135446 -2141529 -2139105 -2134906 -2106646 -2086648
9124b086648j6835j3472k3226K3635J4568M618j1822j3231p566J4027K5666m309
9112b094595J087m649m872J9830J6354j75n783J27J8274R670j6748K912K2303
9099b036265L0696L022k1294l351O51N919J4689N594L3382J9361r800j7051k3711
9086a998158j797j4180L9525O490k8308q066K0114K5182n747J0519L711Q121j3363
9073a955957o592R54L68j4699k531l789L406J1679P645K156p469l196J4541j5654
9059a969138L4775K6888J429k6488m9403M785J7074p46j1447K4200L4873l064
9047a916262j754j647L090l669j0012R461N594J0759K5318j1513j7074J2156L2474
9034a863079J5045j6336J3545J8435Q80r073k7127J2240J4558r036o259l433J3984
$$ plain form
9124 -2086648 -2103483 -2116955 -2140181 -2116546 -2101978 -2097360 -2109182 -2122413 -2129979 -2115952 -2090286 -2094595
9112 -2094595 -2093508 -2098157 -2103029 -2083199 -2066845 -2067020 -2072803 -2072676 -2054402 -2044732 -2061480 -2058568 -2036265
9099 -2036265 -2005569 -2002547 -2023841 -2027192 -2026541 -2020622 -2005933 -2000339 -1966957 -1947596 -1957396 -1974447 -1998158
9086 -1998158 -1999955 -2014135 -1974610 -1968120 -1996428 -2004494 -1984380 -1959198 -1964945 -1954426 -1950715 -1942594 -1955957
9073 -1955957 -1962549 -1961595 -1961227 -1975926 -1978457 -1982246 -1978840 -1967161 -1959516 -1957360 -1964829 -1968025 -1953484 -1969138
9059 -1969138 -1934363 -1907475 -1906046 -1932534 -1981937 -1977152 -1960078 -1960824 -1972271 -1948071 -1913198 -1916262
9047 -1916262 -1918016 -1919663 -1916573 -1920242 -1930254 -1920793 -1915199 -1904440 -1879122 -1890635 -1907709 -1895553 -1863079
9034 -1863079 -1848034 -1864370 -1850825 -1832390 -1831510 -1840583 -1867710 -1855470 -1840912 -1849948 -1856207 -1859640 -1845656
9021a845656J9336N495j2509J6354L0264J4401p857j1771l2304k7024K3932L1788
9009a795551J6166k7345R757J7898R21r455k087m659J1983J7085K3213K264R46
8996a738864m396j0456k6867J3758J391J0328K8764J9023j4686k5247j0018N189
8984a752081L2833M568j4994J8666J4972l908j4138M259J579K9248J6622j541
8972a663915p918n944J4131R964k3884j2805K2818O562K620L3760J0787k1890
8960a635714j1810n041K955K1962L3695j9125N156K6372K1576N701l463k3043
8948a580779J720q662L84K3293k574k106O240r697L347K5524L967l590j0332K5972
8934a527293J2338K273K2741L824l719Q48k2337n712J3068Q013J2559J0087R974
$$ plain form
9021 -1845656 -1826320 -1820825 -1833334 -1816980 -1786716 -1772315 -1780172 -1791943 -1824247 -1851271 -1827339 -1795551
9009 -1795551 -1779385 -1806730 -1796973 -1779075 -1778154 -1787609 -1789696 -1794355 -1782372 -1765287 -1742074 -1739810 -1738864
8996 -1738864 -1743260 -1753716 -1780583 -1766825 -1765434 -1755106 -1726342 -1707319 -1722005 -1747252 -1757270 -1752081
8984 -1752081 -1719248 -1714680 -1729674 -1711008 -1696036 -1699944 -1714082 -1709823 -1708244 -1678996 -1662374 -1663915
8972 -1663915 -1671833 -1677777 -1663646 -1653682 -1677566 -1690371 -1667553 -1660991 -1658371 -1624611 -1613824 -1635714
8960 -1635714 -1647524 -1652565 -1649610 -1627648 -1593953 -1613078 -1607922 -1581550 -1559974 -1554273 -1557736 -1580779
8948 -1580779 -1579059 -1587721 -1587337 -1564044 -1566618 -1568724 -1562484 -1572181 -1568834 -1543310 -1539343 -1542933 -1553265 -1527293
8934 -1527293 -1514955 -1512682 -1489941 -1486117 -1489836 -1488988 -1511325 -1517037 -1503969 -1495956 -1483397 -1473310 -1463336
8921a463336L2629L8070R402L425r075j6374R615O202J6211J5303L712K6824K5469
8908a301923J2959J8098K9086K0948R665J7941K6415J6650J935J2167L6982J3727
8896a085350J2225K6986K6575K3215L4081K8340M0326L5871N2113O6476N1118
8885f88024M4359N0334O3297N1280M0912P8702Q8368O7116Q9602J40114J57527
8874A83587J52776J76715K45072L09283L15027L29751L29679K64831r2516r41781
8864A272424k527232l054495j340218J1510L97484M03823L49844L01102K35773
8855c949985K02937J72667J14466R0471N5556P7140R2071P8123N1909N1098O1901
8844b901646O3950M9523M2040L331m775K7518N3651L2540p083J1047L5136L48
$$ plain form
8921 -1463336 -1430707 -1392637 -1383235 -1379810 -1388885 -1405259 -1395644 -1389442 -1373231 -1357928 -1354216 -1327392 -1301923
8908 -1301923 -1288964 -1270866 -1241780 -1220832 -1211167 -1193226 -1166811 -1150161 -1148226 -1136059 -1099077 -1085350
8896 -1085350 -1073125 -1046139 -1019564 -996349 -962268 -933928 -893602 -857731 -805618 -739142 -688024
8885 -688024 -643665 -593331 -530034 -478754 -437842 -359140 -270772 -203656 -114054 26060 183587
8874 183587 336363 513078 758150 1067433 1382460 1712211 2041890 2306721 2214205 1272424
8864 1272424 -1254808 -4309303 -5649521 -5638011 -5240527 -4836704 -4486860 -4185758 -3949985
8855 -3949985 -3747048 -3574381 -3459915 -3369444 -3313888 -3236748 -3144677 -3066554 -3014645 -2963547 -2901646
8844 -2901646 -2837696 -2788173 -2746133 -2742802 -2747577 -2720059 -2666408 -2633868 -2640951 -2629904 -2594768 -2594420
8832b594420K9232M2953J9645K7301K283J0611N329j0910m270J0925L6152M8643
8820b376526K4700K7812J6071J0799J8818n982Q77J8695J3050K3448J9898J2147
8808b196193J205m364Q007k216n510j6523j5939K9717K6460K0106J9180K3501
8796b112569N774M272J0489k0296J3017L0652K8187o264q621N261J8662O420J472
8783b023544l3016k7801J3543K447J8894K5849J0235J6817L8187K0819j509k5530
8771a964609j3732J2501J1677J8206J7022J6846K973k0694r616j289R875O482
8759a914358J3436M160r024K482j535J3130L443q176K2812M418K35J4856O561
8746a847560m001q186J5696J7971j6086J2900L273q41q19j0259N420R630K0862
$$ plain form
8832 -2594420 -2565188 -2522235 -2502590 -2475289 -2473006 -2462395 -2457066 -2467976 -2472246 -2461321 -2425169 -2376526
8820 -2376526 -2351826 -2324014 -2307943 -2297144 -2278326 -2284308 -2283431 -2264736 -2251686 -2228238 -2208340 -2196193
8808 -2196193 -2194988 -2199352 -2191345 -2193561 -2199071 -2215594 -2231533 -2201816 -2175356 -2155250 -2136070 -2112569
8796 -2112569 -2106795 -2102523 -2092034 -2112330 -2099313 -2068661 -2040474 -2046738 -2055359 -2050098 -2031436 -2025016 -2023544
8783 -2023544 -2056560 -2084361 -2070818 -2068371 -2049477 -2023628 -2013393 -1996576 -1958389 -1937570 -1939079 -1964609
8771 -1964609 -1978341 -1965840 -1954163 -1935957 -1918935 -1902089 -1899116 -1919810 -1929426 -1930715 -1920840 -1914358
8759 -1914358 -1900922 -1896762 -1905786 -1903304 -1904839 -1891709 -1888266 -1896442 -1873630 -1869212 -1868977 -1854121 -1847560
8746 -1847560 -1851561 -1859747 -1844051 -1826080 -1842166 -1829266 -1825993 -1826834 -1827653 -1837912 -1832492 -1822862 -1802000
8733a802000J6057j2919N892R469j0666J771p811J5889N092k9054k5948m979K2984
8720a816223J6562K3108J606M276q48K952J3142j1553r660K017l6931k3663k608
8707a837823L7013K2357K73K5719K3944J558n011J329j0299o996K3693j7640l2692
8694a774575N21J9234R594L3916R978k7539n81O655k951m845J0100j9711J2044
8681a728160l117j5030K086P905L674K8645K2181n655M153M750j1118L74M406
8668a684906J3183n803J2161r534l6087R799q525L457P674r582j5416J5128P592
8655a700859r571J0697J9342j0158l59P06p950j1909N984J8977J0100O336P453
8642a661211P892O333l571j5004M627n18j2902R824K8902J9374j2049j1006k6376
$$ plain form
8733 -1802000 -1785943 -1798862 -1792970 -1783501 -1794167 -1792396 -1800207 -1784318 -1779226 -1808280 -1834228 -1839207 -1816223
8720 -1816223 -1799661 -1776553 -1774947 -1770671 -1771519 -1768567 -1755425 -1766978 -1776638 -1774621 -1811552 -1835215 -1837823
8707 -1837823 -1800810 -1778453 -1778180 -1752461 -1728517 -1726959 -1731970 -1730641 -1740940 -1747936 -1724243 -1741883 -1774575
8694 -1774575 -1774054 -1754820 -1745226 -1711310 -1701332 -1728871 -1729452 -1722797 -1725748 -1730593 -1720493 -1740204 -1728160
8681 -1728160 -1731277 -1746307 -1744221 -1736316 -1732642 -1703997 -1681816 -1687471 -1683318 -1678568 -1689686 -1689312 -1684906
8668 -1684906 -1671723 -1677526 -1665365 -1674899 -1710986 -1701187 -1709712 -1706255 -1698581 -1708163 -1723579 -1708451 -1700859
8655 -1700859 -1710430 -1699733 -1680391 -1690549 -1690908 -1690202 -1698152 -1710061 -1704077 -1685100 -1675000 -1668664 -1661211
8642 -1661211 -1653319 -1646986 -1650557 -1665561 -1660934 -1661452 -1674354 -1664530 -1635628 -1616254 -1628303 -1639309 -1665685
8629a665685j4757q449K5836J9161J376j624L4259J2918k2201l1008q324J2073
8617a646425J8780k176r327J0405J4230k1512k5144K0962J1567J4313J776M3685
8605a568866N096p421j785j7082N262q9J562Q19p769p935j1714J3239J5211o191
8591a587663Q57n442R436K2026p405K35p820m4310n254j1654n254j7510k3337
8578a683095J9310K5919j0780Q69K0053J6017j4524j2789Q64J6611j3470q994
8566a644009J4512Q885K0202J717l123k1529j4796l536K5470n930O10J1437R182
8553a600908J3066j8578J7521J1677k422k759P321m729K6068j647p132q918j5830
8540a587270J2363J2226K0047K0162R109l343j0161k7300n139M618J091k622j9773
$$ plain form
8629 -1665685 -1680442 -1688891 -1663055 -1643894 -1642518 -1644142 -1609883 -1596965 -1619166 -1650174 -1658498 -1646425
8617 -1646425 -1627645 -1629821 -1639148 -1628743 -1614513 -1636025 -1661169 -1640207 -1628640 -1614327 -1612551 -1568866
8605 -1568866 -1563770 -1571191 -1572976 -1590058 -1584796 -1584885 -1583323 -1582504 -1590273 -1598208 -1609922 -1596683 -1581472 -1587663
8591 -1587663 -1586806 -1592248 -1582812 -1560786 -1568191 -1567956 -1575776 -1620086 -1625340 -1636994 -1642248 -1659758 -1683095
8578 -1683095 -1663785 -1637866 -1648646 -1647777 -1627724 -1611707 -1626231 -1639020 -1638156 -1621545 -1635015 -1644009
8566 -1644009 -1629497 -1620612 -1600410 -1598693 -1601816 -1623345 -1638141 -1641677 -1616207 -1622137 -1621527 -1610090 -1600908
8553 -1600908 -1587842 -1606420 -1588899 -1577222 -1579644 -1582403 -1575082 -1579811 -1553743 -1555390 -1562522 -1571440 -1587270
8540 -1587270 -1574907 -1562681 -1542634 -1522472 -1513363 -1516706 -1526867 -1554167 -1559306 -1554688 -1553597 -1556219 -1575992
8527a575992O829j8325o88K1378J9838k606O987j9271j5639J2869J0793O465o863
8514a554225j9549J0224K3976m303r1K1451q372m170K668k5087j4614J4347J9716
8501a538029L03J5628P784J545j2023r045J012q855m19j3852K6846q866M789L7161
8487a496021k512r380m299k304L2378k5338r578M55M206p135n835L48O36K5020
8473a499359J6169p202O537P465M635k387l254k600p32J2354J9083O371j4383
8460a457303k2632K1027j2204j1486L577j2306k2j0338J1847L910J1555o588j1484
8447a492447L0560K4314j9776j2196l858j4389J844J5654n198j2036K4426J5312
8435a447790K1976k721K394n59j4423j6054K1275M2585J8208l4452j3417m087
$$ plain form
8527 -1575992 -1569163 -1587488 -1588176 -1566798 -1546960 -1549566 -1542579 -1561850 -1577489 -1564620 -1553827 -1547362 -1554225
8514 -1554225 -1573774 -1563550 -1539574 -1543877 -1543968 -1522517 -1530889 -1535059 -1532391 -1557478 -1572092 -1557745 -1538029
8501 -1538029 -1537726 -1522098 -1514314 -1512769 -1524792 -1533837 -1532825 -1541680 -1542099 -1555951 -1529105 -1537971 -1533182 -1496021
8487 -1496021 -1498533 -1507913 -1512212 -1514516 -1482138 -1507476 -1517054 -1516599 -1512393 -1519528 -1525363 -1525015 -1524379 -1499359
8473 -1499359 -1483190 -1490392 -1483855 -1476390 -1471755 -1474142 -1477396 -1479996 -1480728 -1468374 -1449291 -1442920 -1457303
8460 -1457303 -1479935 -1458908 -1471112 -1482598 -1479021 -1491327 -1491349 -1501687 -1489840 -1485930 -1474375 -1480963 -1492447
8447 -1492447 -1461887 -1437573 -1457349 -1469545 -1473403 -1487792 -1485948 -1470294 -1475492 -1487528 -1463102 -1447790
8435 -1447790 -1425814 -1428535 -1426141 -1426700 -1441123 -1457177 -1435902 -1393317 -1375109 -1409561 -1422978 -1427065
8423a427065M820J949j352R893J786p710k1871N568M478k3443o728q483k614J2863
8409a457909j2103j1085Q012M853M0432K6100j0908j1078j9249n665j7174N826
8397a459948K6915p454J3423k157N196j7027m251O948j2554M017k51J2017K3332
8384a411794J3677l9621l9988J9310K9413l751P785K38k1412P322j0577M339P287
8371a437772J9729K289j1870j6270J94K8620j7076j2009l406l92J0803J6070J4056
8358a407034k099J3208k3494j1710J3479J8460p7J218m17j463L2r421R356K5033
8344a374929J4856l5932o041K3070N552m416O59j7366j2162K0011J0934k0217
8332a395981o373J000J2471K211J4017J1751j2277j3751m845K1580J2642m631
$$ plain form
8423 -1427065 -1422245 -1420296 -1421648 -1411755 -1409969 -1417679 -1439550 -1433982 -1429504 -1452947 -1459675 -1468158 -1470772 -1457909
8409 -1457909 -1470012 -1481097 -1473085 -1468232 -1427800 -1401700 -1412608 -1423686 -1442935 -1448600 -1465774 -1459948
8397 -1459948 -1433033 -1440487 -1427064 -1429221 -1424025 -1441052 -1445303 -1438355 -1450909 -1446892 -1447143 -1435126 -1411794
8384 -1411794 -1398117 -1437738 -1477726 -1458416 -1429003 -1432754 -1424969 -1424731 -1446143 -1438821 -1449398 -1445059 -1437772
8371 -1437772 -1418043 -1415754 -1427624 -1443894 -1443700 -1415080 -1432156 -1444165 -1447571 -1447963 -1437160 -1421090 -1407034
8358 -1407034 -1409133 -1395925 -1419419 -1431129 -1417650 -1399190 -1399267 -1398049 -1398466 -1399929 -1399897 -1409318 -1399962 -1374929
8344 -1374929 -1360073 -1396005 -1402046 -1378976 -1373424 -1377840 -1377181 -1394547 -1406709 -1386698 -1375764 -1395981
8332 -1395981 -1402354 -1401354 -1388883 -1386672 -1372655 -1360904 -1373181 -1386932 -1391777 -1370197 -1357555 -1362186
8320a362186k2070k1742j2107r906J3832K5977P906J193R546J5206j1512J4909
8308a350954J1514J1996l770k214l3395L160M979K545p710J3850j7951M862l265
8295a366353n742l881j246J8386K2262J240J249j2553j8770q581O255n675j67
8282a373576P277j4852O970J427J5677J2322M430j2569R271n131k029j3218j0277
8269a374278J5236j027O61J8646P183J633K036j6529R945o179j9477P611J8316
8256a336223R722K395L52J7323L756j5380J2613L0945j727j6562K3820N06N688
8243a262772P326k0750l7340m1776o863L1285J9917J7041j2449k2469n339L1886
8231a302303J2527k0274j1174r420L508L0036J4942P790M303j3704j2224O56J5439
$$ plain form
8320 -1362186 -1384256 -1405998 -1418105 -1428011 -1414179 -1388202 -1380296 -1379103 -1369557 -1354351 -1365863 -1350954
8308 -1350954 -1339440 -1327444 -1331214 -1333428 -1366823 -1363663 -1358684 -1356139 -1363849 -1349999 -1367950 -1363088 -1366353
8295 -1366353 -1372095 -1375976 -1377222 -1358836 -1336574 -1335334 -1334085 -1346638 -1365408 -1373989 -1367734 -1373409 -1373576
8282 -1373576 -1366299 -1381151 -1374181 -1372754 -1357077 -1344755 -1340325 -1352894 -1343623 -1348754 -1350783 -1364001 -1374278
8269 -1374278 -1359042 -1360069 -1359408 -1340762 -1333579 -1331946 -1329910 -1346439 -1336494 -1342673 -1362150 -1354539 -1336223
8256 -1336223 -1326501 -1324106 -1323754 -1306431 -1302675 -1318055 -1305442 -1274497 -1276224 -1292786 -1268966 -1268460 -1262772
8243 -1262772 -1255446 -1276196 -1313536 -1355312 -1362175 -1330890 -1310973 -1293932 -1306381 -1328850 -1334189 -1302303
8231 -1302303 -1289776 -1310050 -1321224 -1330644 -1327136 -1297100 -1282158 -1274368 -1270065 -1283769 -1295993 -1295337 -1279898
8218a279898L037j0275j3213r958K8349J3036j7299J1448L846J3811M019k4067
8206a277164q040K6028k3541l7265J1892L4139M152k3431M520J6398p509q081
8194a287902p259K7484k1541k487J1276j0431O520K1351j5581j7594Q380J1146
8182a276638M480o988j8131L2419O901j3118j5995j3551l536R566J2855j195K8970
8169a253961o005k9890m180K411k270r326k057j1180m042o371J5088K0789L698
8156a287296j7365J4232K7157n231l613j7174r386L588K2335J5221J5614K590
8144a239328k3447j6149p535Q247O451R743J7154k465k2818j5707o065J5201J0725
8131a265993K0692K581o639j3194k8879J6623L7373J3525N190l9439m0423P310
$$ plain form
8218 -1279898 -1276861 -1287136 -1300349 -1310307 -1281958 -1268922 -1286221 -1274773 -1270927 -1257116 -1253097 -1277164
8206 -1277164 -1285204 -1259176 -1282717 -1319982 -1308090 -1273951 -1269799 -1293230 -1288710 -1272312 -1279821 -1287902
8194 -1287902 -1295161 -1267677 -1289218 -1291705 -1280429 -1290860 -1284340 -1262989 -1278570 -1296164 -1287784 -1276638
8182 -1276638 -1272158 -1279146 -1297277 -1264858 -1257957 -1271075 -1287070 -1300621 -1304157 -1294591 -1281736 -1282931 -1253961
8169 -1253961 -1259966 -1289856 -1294036 -1291625 -1293895 -1303221 -1305278 -1316458 -1320500 -1326871 -1311783 -1290994 -1287296
8156 -1287296 -1304661 -1290429 -1263272 -1268503 -1272116 -1289290 -1298676 -1295088 -1272753 -1257532 -1241918 -1239328
8144 -1239328 -1262775 -1278924 -1286459 -1278212 -1271761 -1262018 -1244864 -1247329 -1270147 -1285854 -1291919 -1276718 -1265993
8131 -1265993 -1245301 -1242720 -1249359 -1262553 -1291432 -1274809 -1237436 -1223911 -1218721 -1258160 -1298583 -1291273
8119a291273K0681q035J1214j235P924J7341j7177j4554j769P123J9561O500P26
8106a242973r093m647j761K1582J4468l4631j4230j1088q684J3981J9233K2571
8094a235272J4389M336J165J196j2720j4051J398l2108K0609J4934j3042J1626
8082a237540R605R941k3644j4366J9412J4458K227n129L803K067J0329r730k4
8069a218591J8372J4969j5544K493Q177R695p839j9706J632L304O617K1995J2987
8056a161439l3714k6189p529M780K2719L0339l963k4411j1193j3305J320K4226
8044a198359O897J4895N129r911p227J9056n272n178m510k5713j936R066Q216
8031a194847j6855j5575J1106K8147J9672p780Q307J4198j3177j43o06m307J9292
$$ plain form
8119 -1291273 -1270592 -1278627 -1267413 -1268648 -1260724 -1243383 -1260560 -1275114 -1276883 -1269760 -1250199 -1243699 -1242973
8106 -1242973 -1252066 -1256713 -1258474 -1236892 -1222424 -1257055 -1271285 -1282373 -1291057 -1277076 -1257843 -1235272
8094 -1235272 -1220883 -1216547 -1215382 -1214186 -1226906 -1240957 -1239559 -1271667 -1251058 -1236124 -1249166 -1237540
8082 -1237540 -1227935 -1217994 -1241638 -1256004 -1236592 -1222134 -1219907 -1225036 -1221233 -1219166 -1208837 -1218567 -1218591
8069 -1218591 -1200219 -1185250 -1200794 -1198301 -1190124 -1180429 -1188268 -1207974 -1206342 -1203038 -1196421 -1174426 -1161439
8056 -1161439 -1195153 -1221342 -1228871 -1224091 -1201372 -1171033 -1174996 -1199407 -1210600 -1223905 -1222585 -1198359
8044 -1198359 -1191462 -1176567 -1171438 -1181349 -1188576 -1169520 -1174792 -1179970 -1184480 -1210193 -1212129 -1203063 -1194847
8031 -1194847 -1211702 -1227277 -1216171 -1188024 -1168352 -1176132 -1167825 -1153627 -1166804 -1166947 -1167553 -1171860 -1152568
8018a152568j2065j9409n187J2475J3797J0134K2725m627l0414j6405O516k240
8006a177268q650J4205J438r644J0669M796L838m982j5192K2449K8634J1902O7
7993a117738m9278l3185l169j1775M670K9186Q751j240k0743j1441J4713J4079
7981a177170J9448J2838R627j7254l2666o243J0857R42K481L0055o541j2597J8337
7968a147886J1473q809p058j5861L836O222j1885r995K4896K8130K9524l927j0967
7955a112307l469K402p171K086j031o898j0682L292J416N14j3571N421M973J216
7941a133809j3374l242j894j493J0900j1612n601N994K047j2436r614j5048q70
7928a190052K7076j0912j4118m276K2501J2505M554j811J1473J860J3319L06o46
$$ plain form
8018 -1152568 -1164633 -1184042 -1189229 -1176754 -1162957 -1152823 -1130098 -1134725 -1165139 -1181544 -1175028 -1177268
8006 -1177268 -1185918 -1171713 -1170275 -1179919 -1169250 -1164454 -1160616 -1165598 -1180790 -1158341 -1129707 -1117805 -1117738
7993 -1117738 -1167016 -1200201 -1203370 -1215145 -1210475 -1181289 -1172538 -1173778 -1194521 -1205962 -1191249 -1177170
7981 -1177170 -1157722 -1144884 -1135257 -1152511 -1185177 -1191420 -1180563 -1179621 -1177140 -1147085 -1153626 -1166223 -1147886
7968 -1147886 -1136413 -1145222 -1152280 -1168141 -1164305 -1158083 -1169968 -1179963 -1155067 -1126937 -1097413 -1101340 -1112307
7955 -1112307 -1115776 -1113374 -1120545 -1118459 -1119490 -1126388 -1137070 -1133778 -1132362 -1131848 -1145419 -1139998 -1135025 -1133809
7941 -1133809 -1147183 -1150425 -1152319 -1153812 -1142912 -1154524 -1160125 -1154131 -1152084 -1164520 -1174134 -1189182 -1190052
7928 -1190052 -1162976 -1173888 -1188006 -1192282 -1169781 -1157276 -1152722 -1154533 -1143060 -1141200 -1127881 -1127575 -1128221
7915a128221m200J3258Q394j250k089k1212j3434j1101q840K0710K9055J1707
7903a107223N938j3968j1256K5086J2828l0691k9424j537J4410J8124n98J5853
7891a102458k9524j6080m461K2005k96M178K408Q179Q455o502J1355p694J0117
7878a100318q407m1115j4894J7161K0597j0390k4951K1361J9076o660J3228J9400
7866a095912J6957O469J078j0376k4838j5098J5439l559R635j5526j9504j5354
7854a150589R49l70K0157m972j6657J3781l771o983J8563J2561P802K5036K952
7841a081541j3771q458o832J7189L3725o966l4920O482O97k748l277k1071o282
7828a127773R454J5448P603J2399J0250l022N121m368n066j399J0720J1653J5561
$$ plain form
7915 -1128221 -1132421 -1119163 -1110769 -1112019 -1114108 -1135320 -1148754 -1159855 -1168695 -1147985 -1118930 -1107223
7903 -1107223 -1101285 -1115253 -1126509 -1101423 -1088595 -1119286 -1148710 -1150247 -1135837 -1117713 -1118311 -1102458
7891 -1102458 -1131982 -1148062 -1152523 -1130518 -1130814 -1126636 -1124228 -1116049 -1107594 -1114096 -1102741 -1110435 -1100318
7878 -1100318 -1108725 -1149840 -1164734 -1147573 -1126976 -1137366 -1162317 -1140956 -1121880 -1128540 -1115312 -1095912
7866 -1095912 -1078955 -1072486 -1071408 -1081784 -1106622 -1121720 -1106281 -1109840 -1100205 -1115731 -1135235 -1150589
7854 -1150589 -1149640 -1150010 -1129853 -1134825 -1151482 -1137701 -1141472 -1148455 -1129892 -1117331 -1109529 -1084493 -1081541
7841 -1081541 -1095312 -1103770 -1110602 -1093413 -1059688 -1066654 -1101574 -1095092 -1094395 -1097143 -1100420 -1121491 -1127773
7828 -1127773 -1118319 -1102871 -1095268 -1082869 -1072619 -1075641 -1070520 -1074888 -1079954 -1081353 -1070633 -1058980 -1043419
7815a043419j406J99R788L234n058k4594M516J9159j0049j3476j7986r571K4225
7802a064438K0109j9854m554J7110j0159Q673l0595J1562n020J0297N269r09J314
7789a061195K3956R867K2728k0834j1746j067L584J6493M655k8977l2006P454
7777a067088J2033o635m649o632J5794J900J4090j1466r762j1806K5344L0607
7765a018270l811m004n469R339M821R1n072r679n175K872o90K731j9133k0749
7751a072198O756K030J052Q051j485j7079K5220L0652k12r805m725j5073O140
7738a040676P786j5007j8142n761R383n074J0530J6478p067L437J2213j5671K229
7725a045342K8405K0173L85j8010j4476l283J9874J0070j0831j8084J3082J6823
$$ plain form
7815 -1043419 -1044825 -1044626 -1034838 -1031604 -1036662 -1061256 -1056740 -1037581 -1047630 -1061106 -1079092 -1088663 -1064438
7802 -1064438 -1044329 -1064183 -1068737 -1051627 -1061786 -1053113 -1083708 -1072146 -1077166 -1066869 -1061600 -1062509 -1061195
7789 -1061195 -1037239 -1027372 -1004644 -1025478 -1037224 -1038291 -1034707 -1018214 -1013559 -1042536 -1074542 -1067088
7777 -1067088 -1055055 -1061690 -1066339 -1072971 -1057177 -1055277 -1041187 -1052653 -1062415 -1074221 -1048877 -1018270
7765 -1018270 -1022081 -1026085 -1031554 -1022215 -1017394 -1017303 -1022375 -1032054 -1037229 -1034357 -1035047 -1032316 -1051449 -1072198
7751 -1072198 -1065442 -1063412 -1062360 -1054309 -1055794 -1072873 -1047653 -1017001 -1017213 -1027018 -1031743 -1046816 -1040676
7738 -1040676 -1032890 -1047897 -1066039 -1071800 -1062417 -1067491 -1056961 -1040483 -1047550 -1044113 -1031900 -1047571 -1045342
7725 -1045342 -1016937 -996764 -996379 -1014389 -1028865 -1032148 -1012274 -1002204 -1013035 -1031119 -1018037 -1001214
7713a001214j2082j0596P047K2809q575l830j2576K567J0034J1624Q404k379j3690
7700a002457N147n358n291j5027o909J9912J1710P031j5129r867J5748o906K759
7687a004637J7975K9800M571j4501p877K56l551j7082n487J2267q559p263P242
7674i96846J2814J6586K4178j2010j4586J3091l564j3923j4449j7715P265K2032
7662i77127L0550K7890j1962o30k187j5054j0480R882j7699p655L529K86J2008
7649i58649m482R956P460M788O243n404K94M620K2709o638J518k173j7689l3537
7635i70984j3092J2104K7532J6067K4q369j8460n929j6801Q664K3504K424j9687
7622i63003K2368J8114q076P275j6170m61K051J1035N75l195J1426J1970N739
$$ plain form
7713 -1001214 -1013296 -1023892 -1016845 -994036 -1002611 -1006441 -1019017 -1016450 -1006416 -994792 -986388 -988767 -1002457
7700 -1002457 -997310 -1002668 -1007959 -1022986 -1029895 -1009983 -998273 -991242 -1006371 -1016238 -1000490 -1007396 -1004637
7687 -1004637 -986662 -956862 -952291 -966792 -974669 -974413 -977964 -995046 -1000533 -988266 -996825 -1004088 -996846
7674 -996846 -984032 -967446 -943268 -955278 -969864 -956773 -960337 -974260 -988709 -1006424 -999159 -977127
7662 -977127 -946577 -918687 -930649 -931279 -933466 -948520 -959000 -949118 -966817 -974472 -970943 -970657 -958649
7649 -958649 -963131 -953175 -945715 -940927 -934684 -940088 -939794 -935174 -912465 -919103 -917585 -919758 -937447 -970984
7635 -970984 -984076 -971972 -944440 -928373 -928349 -936718 -955178 -961107 -977908 -969244 -945740 -943316 -963003
7622 -963003 -940635 -922521 -930597 -923322 -939492 -939953 -937902 -926867 -926292 -929487 -918061 -906091 -900352
7609i00352k7474j9562j0048K896N950j23J5720r949j8354l218J8100N540R973
7596i30901j2119j0964p468n293K641O366K1576P486k526R199Q623J3302l3049
7583i33127j5043l33n088J6495m438O962J3948P986P542j8285j3394m050M1664
7570h99161j3561k6271J9174R663m142l084L1875p257k1609k018P192J8802K7360
7557h63037l915j8750O825R690l227L71Q34M18j6154j306j0356M26K3213J6706
7543h58262j0928o310j9279j8238O32K3338r749J731r450J3120K8306J0013k8462
7530h83538j1810K4721q591n0449k6626P008K9312K7537J8251R854K11j4032j0397
7517h88549j5226J5069J1744p583L201Q086Q094j403J3853J4450J7081j4528O340
$$ plain form
7609 -900352 -927826 -947388 -957436 -954540 -948590 -948713 -932993 -942942 -961296 -964514 -946414 -940874 -930901
7596 -930901 -943020 -953984 -961452 -966745 -964104 -957738 -936162 -928676 -931202 -922003 -913380 -900078 -933127
7583 -933127 -948170 -948503 -953591 -937096 -941534 -934572 -920624 -912638 -905096 -923381 -936775 -940825 -899161
7570 -899161 -912722 -938993 -919819 -910156 -914298 -917382 -885507 -892764 -914373 -916391 -909199 -890397 -863037
7557 -863037 -866952 -885702 -878877 -869187 -872414 -872043 -871209 -870791 -886945 -888251 -898607 -898181 -874968 -858262
7543 -858262 -869190 -875500 -894779 -913017 -912385 -889047 -898796 -897065 -906515 -893395 -865089 -855076 -883538
7530 -883538 -895348 -870627 -879218 -929667 -956293 -949285 -919973 -892436 -874185 -864331 -864120 -878152 -888549
7517 -888549 -903775 -888706 -876962 -884545 -881344 -873258 -865164 -866567 -852714 -838264 -821183 -835711 -829371
7504h29371p845j6778j2277L076l0659p63L0782Q817J828J2745m563M036N272
7491h35700J692J1266j5173j5423J3885j2792K4128J5534l3663k2967J1288k6411
7479h84336k0923J8041L1377N494j3394j193K4940l672p223J6682N128K354o636
7466h33361K2825K305j58q921j0322K8707K4931j2079j6729N872j5845m7563j2749
7453h73087J5326K6689J3501J0122l386j3917r703M219J0054K0853L150o853k7701
7440h30733L241n347r568j8136P980J1413K5520J0532k803M535n505J9315K8367
7427g61189l1478P911k77R556j2215k0181M334J6722K5970O651j5080J0027l0148
7414g89397n788j1412o334J4941m165J2248K2082j6133k8941J6605O083J6077
$$ plain form
7504 -829371 -837216 -853994 -866271 -863195 -893854 -894617 -863835 -855018 -853190 -840445 -845008 -840972 -835700
7491 -835700 -834008 -822742 -837915 -853338 -839453 -852245 -828117 -812583 -846246 -869213 -857925 -884336
7479 -884336 -905259 -887218 -855841 -850347 -863741 -864934 -839994 -843666 -850889 -834207 -829079 -826725 -833361
7466 -833361 -810536 -808231 -808389 -817310 -827632 -798925 -773994 -786073 -802802 -796930 -812775 -860338 -873087
7453 -873087 -857761 -831072 -817571 -807449 -810835 -824752 -834455 -830236 -820182 -799329 -796179 -803032 -830733
7440 -830733 -827492 -832839 -842407 -860543 -852563 -841150 -815630 -805098 -807901 -803366 -808871 -789556 -761189
7427 -761189 -792667 -784756 -785033 -775477 -787692 -807873 -803539 -786817 -760847 -754196 -769276 -759249 -789397
7414 -789397 -795185 -806597 -812931 -797990 -802155 -789907 -767825 -783958 -812899 -796294 -790211 -774134
7402g74134j233k5317p754L6533K1065j628J7210J7789q843j6213J9264J7375
7390g05886j8998j4038O336j3812n202n535r743j6967K5521J2429r350O552N43
7377g48150N79p668j0984o461J3833r370q92J8372L3788j4389k4801k420J3851
7364g44712R917l0734m851J6697J6845J2196j2741Q974O651P93j805p261k73q148
7350g38452M469J0280o552M577q43M431K0634J4446m0593j9538K1087J4695Q282
7337g03077N805K220k8922k1587R714o305M097J2999J4122L567q714K702r875
7324g23254j2722j3427L001K2712K866J1981K1890P472l803n458M470p210j8446
7311g09928l746N249M1541l495k6278J884m128L3099k0698j0530K7093J7405j963
$$ plain form
7402 -774134 -775367 -800684 -808438 -771905 -750840 -752468 -735258 -717469 -726312 -742525 -723261 -705886
7390 -705886 -724884 -738922 -732586 -746398 -751600 -757135 -766878 -783845 -758324 -745895 -755245 -748693 -748150
7377 -748150 -747571 -755239 -766223 -772684 -758851 -768221 -769113 -750741 -716953 -731342 -756143 -758563 -744712
7364 -744712 -734795 -765529 -770380 -753683 -736838 -724642 -737383 -728409 -721758 -720965 -722770 -730031 -730304 -738452
7350 -738452 -733983 -723703 -730255 -725678 -726521 -722090 -701456 -687010 -727603 -747141 -726054 -711359 -703077
7337 -703077 -697272 -695052 -723974 -745561 -735847 -742152 -738055 -725056 -710934 -707367 -716081 -713379 -723254
7324 -723254 -735976 -749403 -746402 -723690 -720824 -708843 -686953 -679481 -683284 -688742 -684272 -691482 -709928
7311 -709928 -713674 -708425 -666884 -670379 -696657 -694773 -698901 -665802 -686500 -697030 -669937 -652532 -654495
7298f54495k8810k3443o697K2612K0345o686r854j961K803O481J401J9919m197
7285f62582J3930m093P30J9626j5638k5667M445L582l769R639K3770j299k2430
7272f59756j7991N374K5368m624q382K067J7675R651j1850l45p068K289J1054
7259f36538k703P476J8945J7128k1754j6916J604M738r497J561K1084K658j8143
7246f30357O162P272J2763J30k0257l385L623n188m342P435J1811M800J7082J1248
7232e81203n53k8746o610J5169J30R182r905o211N74O779L0101J7254m539K888
7218e55690m320j3265J3530n388k0305J4365J5824l995j8763K139J1022j0579
7206e75425j1441K0298N373N661j1218J2753r431J1115Q664j5890j109m854J741
$$ plain form
7298 -654495 -683305 -706748 -713445 -690833 -670488 -677174 -687028 -688989 -686186 -679705 -678304 -658385 -662582
7285 -662582 -648652 -652745 -652015 -632389 -648027 -673694 -669249 -665667 -669436 -659797 -636027 -637326 -659756
7272 -659756 -677747 -672373 -647005 -651629 -660011 -657944 -640269 -630618 -642468 -642813 -649881 -647592 -636538
7259 -636538 -639241 -631765 -612820 -595692 -617446 -634362 -632758 -628020 -637517 -635956 -614872 -612214 -630357
7246 -630357 -624195 -616923 -604160 -604030 -624287 -627672 -624049 -629237 -633579 -626144 -614333 -609533 -592451 -581203
7232 -581203 -581756 -610502 -617112 -601943 -601813 -592631 -602536 -608747 -608173 -601394 -571293 -554039 -558578 -555690
7218 -555690 -560010 -573275 -559745 -565133 -585438 -571073 -555249 -559244 -578007 -575868 -564846 -575425
7206 -575425 -586866 -566568 -561195 -555534 -566752 -553999 -563430 -552315 -543651 -559541 -560650 -565504 -563763
7193e63763J6070n255n51P51j3297l7075j7911J9557L1004K5403j4248j8088J7426
7180e59977J8506m058O693K3473k924K848K613k2352m435j382o258K868j0770
7167e55155J0268o254N092K3654m110p378J1500M626M756R617R46p843l249J6199
7153d97331J2702j1685J3780J4680K1097j411j1384j5563J5896m063J8989L1621
7141d12672o323l9802l8418k784K2861N205P782J8771n975J1605p224j8611n053
7128d70638m143O097R520J1426Q609J0063J7000r808K2851J7931p851K013j3709
7115d00639J3497N73J1229j593m973o883m82K819m439j6868j414J9749K1679N673
7101c62072J3718J1429Q997O641j0759l1174o172K035J2189L6449K8285J897K9885
$$ plain form
7193 -563763 -547693 -552948 -553499 -552748 -566045 -603120 -621031 -601474 -570470 -545067 -559315 -577403 -559977
7180 -559977 -541471 -545529 -538836 -515363 -518287 -515439 -512826 -535178 -539613 -540995 -547253 -544385 -555155
7167 -555155 -544887 -551141 -546049 -522395 -526505 -533883 -522383 -517757 -513001 -503384 -502438 -510281 -513530 -497331
7153 -497331 -484629 -496314 -482534 -467854 -446757 -448168 -459552 -475115 -459219 -463282 -444293 -412672
7141 -412672 -418995 -458797 -497215 -499999 -477138 -471933 -464151 -445380 -451355 -439750 -446974 -465585 -470638
7128 -470638 -474781 -468684 -459164 -447738 -439129 -429066 -412066 -421874 -399023 -381092 -388943 -386930 -400639
7115 -400639 -387142 -386569 -375340 -376933 -381906 -388789 -389271 -386452 -390891 -407759 -409173 -389424 -367745 -362072
7101 -362072 -348354 -336925 -327928 -321287 -332046 -363220 -369392 -367357 -355168 -318719 -290434 -288537 -258652
7088b58652K3489J455j0905l4160p69k5931m9058m4256o824n862k3714k0778j7759
7075d73724N917N778j1653J5422L3533J0140n922p171K1552L0246K7454N837K7597
7062c14994N19j6343o640K482K0433j0112k5718k0974l832M721K509J9996J1018
7049c36935R178J4823K1976J8275j0805j5155j1184N544Q521L376Q677M378J9195
7036b60136K416l5732j2501K2118N092k628M927Q877L038j2235K0725K4228K2427
7023b09384l0267k9844M189J6026K4069J0110K7839k61O975r4j8941m885K3401
7010a81067O229j5514Q33J4692m351o165J923J9775J7122K414m21n817P594O756
6996a35997Q771K9248j9021P040J5515J0582J3902Q313j0758J2144m592j6068
$$ plain form
7088 -258652 -235163 -233708 -244613 -278773 -279542 -305473 -354531 -398787 -405611 -411473 -435187 -455965 -473724
7075 -473724 -467807 -462029 -473682 -458260 -424727 -414587 -420509 -427680 -406128 -375882 -348428 -342591 -314994
7062 -314994 -314475 -330818 -337458 -334976 -314543 -324655 -350373 -371347 -375179 -370458 -367949 -347953 -336935
7049 -336935 -327757 -312934 -290958 -272683 -283488 -298643 -309827 -304283 -295762 -292386 -283709 -279331 -260136
7036 -260136 -257720 -293452 -305953 -283835 -278743 -281371 -276444 -267567 -264529 -276764 -256039 -231811 -209384
7023 -209384 -239651 -269495 -265306 -249280 -225211 -215101 -187262 -187523 -180548 -180642 -199583 -204468 -181067
7010 -181067 -174838 -190352 -189519 -174827 -179178 -185343 -183420 -163645 -146523 -144109 -144530 -150347 -142753 -135997
6996 -135997 -127226 -97978 -116999 -109959 -94444 -83862 -69960 -61647 -72405 -60261 -64853 -80921
6984h0921O221O471l1003P388K6596J6524m29k615j9116L289J1096J8998Q116
6971b9385J4875j2414O448P011r323J3281J9706l132r823o945K3531J0547k6745
6958b368M436K0782M766P231l873J2243Q641J243q687J5310J7551p557R557K6836
6944A06111J3744j71j9025q246l191K2276J8042J4038J7420J5352K799J3809J6059
6931B09017k393j2281K1993M055J0971K8868j460m667J2064K1311L501K7335J4649
6918C32963j2778M68N978R063O006J8213J6712r398L298K1270L0422J8576Q604
6905D49397J1732J1948J2763l870j1456J2723K7862K1152O4718K8699j3494L3071
6893F45245J824L3577L8874J1232K395l7204o9829J788O3031O8985K2674k800
$$ plain form
6984 -80921 -74700 -68229 -99232 -91844 -65248 -48724 -49153 -51768 -70884 -67595 -56499 -37501 -29385
6971 -29385 -14510 -26924 -20476 -13465 -22788 -9507 10199 7067 -2756 -9701 13830 24377 -2368
6958 -2368 2068 22850 27616 34847 30974 43217 51858 53101 44414 59724 77275 69718 79275 106111
6944 106111 119855 119684 100659 92413 89222 111498 129540 143578 160998 176350 179149 192958 209017
6931 209017 206624 194343 216336 220391 231362 260230 258770 254103 266167 287478 290979 318314 332963
6918 332963 320185 320653 326631 335694 341700 359913 376625 367227 370525 391795 422217 440793 449397
6905 449397 461129 473077 485840 481970 470514 483237 511099 532251 596969 625668 612174 645245
6893 645245 647069 680646 719520 730752 733147 695943 626114 627902 690933 759918 782592 779792
6881G79792L3397O8737R0419N0513M3741P8754L7461M8022L6270j14044m48094
6870G04968m30013q6928O7109P6474Q5938O8567M4976M9325M2693L3146M2516
6859F98771K9119K3545M0104N1808M4528M5083M0067J549J3313L6423L8324L0254
6847A092888L0587K3132Q148K5474M0905L8923M1186K2090R194N7999P5498M5235
6835A511259K9720P8496O8875P2536P0578J12200J36732J44603J34082J67057
6825B526138J83400J89950J68044R3305k57122m95993j42899k16921o68271l83996
6815I95635K9708j76129k68044k23991k94788k32037K9697J68964K16899J95606
6805D41520J29647J5573M7803M1436n2670m6988P6105Q4940J05673R9519R1300
$$ plain form
6881 779792 813189 881926 972345 1022858 1066599 1145353 1182814 1230836 1267106 1153062 704968
6870 704968 274955 188027 255136 331610 417548 486115 531091 580416 623109 656255 698771
6859 698771 727890 751435 791539 843347 887875 932958 973025 974574 987887 1024310 1062634 1092888
6847 1092888 1123475 1146607 1154755 1180229 1221134 1260057 1301243 1323333 1332527 1390526 1466024 1511259
6835 1511259 1540979 1619475 1688350 1760886 1831464 1943664 2080396 2224999 2359081 2526138
6825 2526138 2709538 2899488 3067532 3160837 2903715 2407722 2264823 2047902 1379631 995635
6815 995635 1025343 849214 581170 357179 62391 -169646 -139949 29015 245914 441520
6805 441520 571167 586740 634543 675979 623309 576321 652426 737366 843039 942558 1033858
6794A033858M1837L2739O4570M6323L1080L9747N9893O4761Q6515Q4080P3260
6783A658663R8320Q4767M3307n479J6401N5092O3631P7375Q9787J27668J45454
6772B454986J61076J47675J50623J39147J16526O6057j24776m44586k92521M9000
6762B423207K24330K46517K54844K10691J46850J48349J21123j41349k32604Q2053
6752C484011K61402L17974L14621K91183K69529K38205J88663J15697o2324j36794
6742E282167J74258M74493N29336L82169M5510m82820q54371m96488J0882J0267
6732E075403j18981J8016M24736P10734Q00547Q30684Q84396R57385R82864R99945
6722A1565729R97572J037504J113973J515195K038523K228950K039202J520958
$$ plain form
6794 1033858 1075695 1108434 1173004 1219327 1250407 1290154 1350047 1414808 1501323 1585403 1658663
6783 1658663 1756983 1841750 1885057 1879578 1895979 1951071 2014702 2092077 2181864 2309532 2454986
6772 2454986 2616062 2763737 2914360 3053507 3170033 3236090 3111314 2666728 2374207 2423207
6762 2423207 2647537 2894054 3148898 3359589 3506439 3654788 3775911 3634562 3401958 3484011
6752 3484011 3745413 4063387 4378008 4669191 4938720 5176925 5365588 5481285 5418961 5282167
6742 5282167 5456425 5930918 6460254 6842423 6887933 6405113 5550742 5054254 5065136 5075403
6732 5075403 4956422 4974438 5399174 6109908 6910455 7741139 8625535 9582920 10565784 11565729
6722 11565729 12563301 13600805 14714778 16229973 18268496 20497446 22536648 24057606
6714B4057606O76492q66672m213415j0241878j6674745j6666568p126194R37017
6706c0118357L177840L085514K562841K085296J702128J427600J195420J028470
6698a3853248Q84075P92403P17564O55142N99911N36367M63871L85925L13979
6689h504011K25420O7468j65157l01508k26160N3375K03754K45387K11617K05927
6679g983888K48757K65125K58580K12676K32212J85613R2003q5690l12242k91024
6669g177878M449J62730K03560J94328J75769J21557J06581J00132J10564Q2166
6659e916042P3899R5032R8293R9553J15611J12612P4699P8667R5887O5533P0195
6648d936061M4896N6540P0212O7265K3397M5320M7440P4512L3853L0729N1272
$$ plain form
6714 24057606 24734098 23867426 19654011 9412133 -7262612 -23929180 -31055374 -30118357
6706 -30118357 -26940517 -23855003 -21292162 -19206866 -17504738 -16077138 -14881718 -13853248
6698 -13853248 -12969173 -12176770 -11459206 -10804064 -10204153 -9667786 -9203915 -8817990 -8504011
6689 -8504011 -8278591 -8211123 -8376280 -8677788 -8903948 -8850573 -8646819 -8401432 -8189815 -7983888
6679 -7983888 -7735131 -7470006 -7211426 -6998750 -6766538 -6580925 -6488922 -6574612 -6886854 -7177878
6669 -7177878 -7173429 -7010699 -6807139 -6612811 -6437042 -6315485 -6208904 -6108772 -5998208 -5916042
6659 -5916042 -5842143 -5747111 -5648818 -5549265 -5433654 -5321042 -5246343 -5167676 -5071789 -5006256 -4936061
6648 -4936061 -4891165 -4834625 -4764413 -4697148 -4673751 -4628431 -4580991 -4506479 -4472626 -4441897 -4390625
6637d390625O6908N5297P6662O3318L5711M7052L1768L2248M8790N1091K7800
6626c853980M6355L9678N6735J0730K6123L8801J1362L1325L4028J7817K7455
6615c513571K3929K6848J4831L6394N5914K5589J4551J8596Q60L9536N2008M5929
6603c158586J8044K5770o472j3162J2474K9214J5249N1675K5913P855M78K1034
6591b970514L6994K8026r342j728J0621J9308M8232K5623J9350P661p457J192
6579b792034O031J7365L5839J3722k757N257L5404K4390J2721J7007J6384j5573
6567b626244k8369j8249K4642L5304K1079J477j2737k7564J7056J3217J6979K0365
6555b563044j3049J3981L7102K8613l59J4159J7493K7483O661J4523l945J1160
$$ plain form
6637 -4390625 -4323717 -4268420 -4191758 -4128440 -4092729 -4045677 -4013909 -3981661 -3932871 -3881780 -3853980
6626 -3853980 -3807625 -3767947 -3711212 -3700482 -3674359 -3635558 -3624196 -3592871 -3558843 -3541026 -3513571
6615 -3513571 -3489642 -3462794 -3447963 -3411569 -3355655 -3330066 -3315515 -3296919 -3296059 -3256523 -3204515 -3158586
6603 -3158586 -3140542 -3114772 -3121244 -3134406 -3121932 -3092718 -3077469 -3025794 -2999881 -2992026 -2991548 -2970514
6591 -2970514 -2933520 -2905494 -2914836 -2916564 -2905943 -2886635 -2838403 -2812780 -2793430 -2785769 -2793226 -2792034
6579 -2792034 -2786003 -2768638 -2732799 -2719077 -2721834 -2716577 -2681173 -2656783 -2644062 -2627055 -2610671 -2626244
6567 -2626244 -2654613 -2672862 -2648220 -2612916 -2591837 -2590360 -2603097 -2630661 -2613605 -2600388 -2583409 -2563044
6555 -2563044 -2576093 -2562112 -2525010 -2496397 -2496756 -2482597 -2465104 -2437621 -2430960 -2416437 -2420382 -2409222
6543b409222J0477K608M708n8q48R30N180Q039K8900J5395l4m602N1J8510N235
6528b314731J9232L1532k711n111k938q935J7802j3639n414J2086J2147J5960
6516b244720l307J4345K9222J6141J973J018J4899L3780k8799k9612Q185m772
6504b191647J9382J7994K0025K5815L334M579L67K4J5083j5520L858J9626j8661
6491b095741l6136M2440M5469Q323J6126K376L30K0185j9429N497j0629J6584
6479b004605p602J5360J1610J0659K8030k225k1163m569l378L751q429j6446M858
6466a994149Q646J1472J9973J1576K4258O863j6646J9567N242O712J3211M029
6454a879246K3921L94J5395K4886o159l4773J232J926Q16M1135J1718l7986l1987
$$ plain form
6543 -2409222 -2398745 -2396137 -2391429 -2391487 -2392335 -2391405 -2386225 -2378186 -2349286 -2333891 -2333925 -2338527 -2338476 -2319966 -2314731
6528 -2314731 -2295499 -2263967 -2266678 -2271789 -2274727 -2283662 -2265860 -2279499 -2284913 -2272827 -2260680 -2244720
6516 -2244720 -2248027 -2233682 -2204460 -2188319 -2186346 -2185328 -2170429 -2136649 -2165448 -2195060 -2186875 -2191647
6504 -2191647 -2172265 -2154271 -2134246 -2108431 -2105097 -2100518 -2100151 -2100127 -2085044 -2100564 -2096706 -2077080 -2095741
6491 -2095741 -2131877 -2089437 -2043968 -2035645 -2019519 -2017143 -2016813 -1996628 -2016057 -2010560 -2021189 -2004605
6479 -2004605 -2012207 -1996847 -1985237 -1974578 -1946548 -1948773 -1969936 -1974505 -1977883 -1974132 -1982561 -1999007 -1994149
6466 -1994149 -1985503 -1974031 -1954058 -1942482 -1918224 -1911361 -1928007 -1908440 -1903198 -1896486 -1883275 -1879246
6454 -1879246 -1855325 -1854931 -1839536 -1814650 -1820809 -1855582 -1854350 -1852424 -1851608 -1810473 -1798755 -1836741 -1868728
6441a868728m671J3339j514N690J2837J0265J8610L599Q133m00J815R899r533
6428a800659m159R53M4199L754j4512J580J1012q457j5004J1616r982j3595N063
6415a788191J2920J5237l113O710J1779q698j360j6314J8906K5815J3076N302
6403a707931j5451k2620O49J2256J4241k822p3L371J6100N581j691K5051R387
6390a663952j5942j5652N857J5793K9555l329n042o394l778J0564O483K0869J3437
6377a611531R836O132j2141l11j6252K125L10j0659q950Q135N163K5840K9739
$$ plain form
6441 -1868728 -1873399 -1860060 -1861574 -1855884 -1843047 -1832782 -1814172 -1810573 -1802440 -1802840 -1801025 -1791126 -1800659
6428 -1800659 -1804818 -1803865 -1759666 -1755912 -1770424 -1768844 -1757832 -1766289 -1781293 -1769677 -1779659 -1793254 -1788191
6415 -1788191 -1775271 -1760034 -1763147 -1756437 -1744658 -1753356 -1754716 -1771030 -1752124 -1726309 -1713233 -1707931
6403 -1707931 -1723382 -1746002 -1745353 -1733097 -1718856 -1721678 -1721751 -1718380 -1702280 -1696699 -1698390 -1673339 -1663952
6390 -1663952 -1679894 -1695546 -1689689 -1673896 -1644341 -1647670 -1652712 -1659106 -1662884 -1652320 -1645837 -1624968 -1611531
6377 -1611531 -1601695 -1595563 -1607704 -1608015 -1624267 -1622142 -1621832 -1632491 -1641441 -1633306 -1628143 -1602303 -1572564
$$ [...]
##END NTUPLES=NMR SPECTRUM
##END=
