##TITLE=Analysis number 328328
Compound Code cc 62026
Book Reference 511/130
Project Code adrs
Chemist Name stevem
##JCAMPDX= 6.0         $$ Bruker NMR JCAMP-DX V2.0
##DATA TYPE= NMR SPECTRUM
##DATA CLASS= NTUPLES
##ORIGIN= Bruker BioSpin GmbH
##OWNER= nmr
$$ XWIN-NMR		Version 3.5
$$ Thu May 24 13:41:56 2007 GMT Daylight Time (UT+1h)  MAYBRIDGE\nmr@NMR_250MHZ
##.OBSERVE FREQUENCY= 250.131544655141
##.OBSERVE NUCLEUS= ^1H
##.ACQUISITION MODE= SIMULTANEOUS (DQD)
##.ACQUISITION SCHEME= undefined
##.AVERAGES= 16
##.DIGITISER RES= 18
##SPECTROMETER/DATA SYSTEM= dpx250
##.PULSE SEQUENCE= zg30
##.SOLVENT NAME= CDCl3
##.SHIFT REFERENCE= (INTERNAL, CDCl3, 0, 16.4498)
##AUDIT TRAIL= $$ (NUMBER, WHEN, WHO, WHERE, WHAT)
$$ ##TITLE= Audit trail, XWIN-NMR		Version 3.5
$$ ##JCAMPDX= 5.01
$$ ##ORIGIN= Bruker BioSpin GmbH
$$ ##OWNER= nmr
$$ C:\u/data/dgb/nmr/ADRS/1460/pdata/1/auditp.txt
$$ ##AUDIT TRAIL=  $$ (NUMBER, WHEN, WHO, WHERE, WHAT)
(   1,<2007-05-24 13:41:21.45 +100>,<MAYBRIDGE\nmr>,<NMR_250MHZ>,
      <created by zg, POWCHK disabled, PULCHK disabled
       configuration hash MD5:
       76 6E 9A 78 1E 09 19 81 EC 84 63 8F B0 6A 59 2D
       data hash MD5: 64K
       B2 89 F9 30 BF DE AE FA 1F D4 70 7C 45 D5 C1 F6>)
(   2,<2007-05-24 13:41:36.92 +100>,<MAYBRIDGE\nmr>,<NMR_250MHZ>,
      <Start of raw data processing
       ef LB = 0.3 FT_mod = 6 PKNL = 1 SI = 32K 
       data hash MD5: 32K
       DD 90 6D B9 89 E0 49 69 FB 8E 6C 8E C9 F4 34 70>)
(   3,<2007-05-24 13:41:41.90 +100>,<MAYBRIDGE\nmr>,<NMR_250MHZ>,
      <apk 
       data hash MD5: 32K
       5F C9 7F 87 3D 9D 2B 6F 50 E8 E5 32 C3 29 70 72>)
(   4,<2007-05-24 13:41:43.56 +100>,<MAYBRIDGE\nmr>,<NMR_250MHZ>,
      <abs ABSG = 5 
       data hash MD5: 32K
       1F 35 19 95 59 A6 B2 82 4E 6B EC AD 24 5A 92 71>)
$$ ##END=
$$ 
$$ hash MD5
$$ DF B8 9B B1 49 B8 34 53 C3 64 FB A9 56 ED 0C A2
##$RELAX= 
##$RELAX= 
##$RELAX= 
##$RELAX= 
##$RELAX= 
##$RELAX= 
##$RELAX= 
$$ Bruker specific parameters
$$ --------------------------
##$DU= <C:\u>
##$EXPNO= 1460
##$NAME= <ADRS>
##$PROCNO= 1
##$TYPE= <nmr>
##$USER= <dgb>
##$AMP= (0..31)
100 100 100 100 100 100 100 100 100 100 100 100 100 100 100 100 100 100 
100 100 100 100 100 100 100 100 100 100 100 100 100 100 
##$AQSEQ= 0
##$AQ_mod= 3
##$AUNM= <au_zg>
##$AUTOPOS= <30 >
##$BF1= 250.13
##$BF2= 250.13
##$BF3= 250.13
##$BF4= 250.13
##$BF5= 500.13
##$BF6= 500.13
##$BF7= 500.13
##$BF8= 500.13
##$BYTORDA= 1
##$CFDGTYP= 0
##$CFRGTYP= 5
##$CHEMSTR= <none>
##$CNST= (0..31)
1 1 145 1 1 1 1 1 1 1 1 1 1 1 1 1 1 1 1 1 1 1 1 1 1 1 1 1 1 1 1 1 
##$CPDPRG= <>
##$CPDPRG1= <>
##$CPDPRG2= <>
##$CPDPRG3= <>
##$CPDPRG4= <mlev>
##$CPDPRG5= <mlev>
##$CPDPRG6= <mlev>
##$CPDPRG7= <mlev>
##$CPDPRG8= <mlev>
##$CPDPRGB= <>
##$CPDPRGT= <>
##$D= (0..31)
0 1 0 0 0 0 0 0 0 0.06 0 0 0 0 0 0 0.0002 0 0 0 0 0 0 0 0 0 0 0 0 0 0 
0 
##$DATE= 1180010479
##$DBL= (0..7)
120 120 120 120 120 120 120 120 
##$DBP= (0..7)
150 150 150 150 150 150 150 150 
##$DBP07= 0
##$DBPNAM0= <>
##$DBPNAM1= <>
$$ [...]
##$SUBNAM7= <"">
##$SUBNAM8= <"">
##$SUBNAM9= <"">
##$SW= 20.6930455092707
##$SWIBOX= (0..15)
0 0 3 0 0 0 0 0 0 0 0 0 0 0 0 0 
##$SW_h= 5175.983436853
##$TD= 65536
##$TD0= 1
##$TE= 683.16
##$TE2= 300
##$TE3= 300
##$TEG= 300
##$TL= (0..7)
0 120 120 120 120 120 120 120 
##$TP= (0..7)
150 150 150 150 150 150 150 150 
##$TP07= 0
##$TPNAME0= <>
##$TPNAME1= <>
##$TPNAME2= <>
##$TPNAME3= <>
##$TPNAME4= <>
##$TPNAME5= <>
##$TPNAME6= <>
##$TPNAME7= <>
##$TPOAL= (0..7)
0.5 0.5 0.5 0.5 0.5 0.5 0.5 0.5 
##$TPOFFS= (0..7)
0 0 0 0 0 0 0 0 
##$TUNHIN= 0
##$TUNHOUT= 0
##$TUNXOUT= 0
##$USERA1= <user>
##$USERA2= <user>
##$USERA3= <user>
##$USERA4= <user>
##$USERA5= <user>
##$V9= 5
##$VALIST= <valist>
##$VCLIST= <CCCCCCCCCCCCCCC>
##$VD= 0
##$VDLIST= <DDDDDDDDDDDDDDD>
##$VPLIST= <PPPPPPPPPPPPPPP>
##$VTLIST= <TTTTTTTTTTTTTTT>
##$WBST= 1024
##$WBSW= 4
##$XGAIN= (0..3)
0 0 0 0 
##$XL= 0
##$YL= 0
##$YMAX_a= 215943
##$YMIN_a= -172080
##$ZGOPTNS= <>
##$ZL1= 120
##$ZL2= 120
##$ZL3= 120
##$ZL4= 120
##$ABSF1= 16.44981
##$ABSF2= -4.243362
##$ABSG= 5
##$ABSL= 3
##$ALPHA= 0
##$AQORDER= 0
##$ASSFAC= 0
##$ASSFACI= 0
##$ASSFACX= 0
##$ASSWID= 0
##$AUNMP= <proc_1d>
##$AZFE= 0.1
##$AZFW= 0.1
##$BCFW= 0
##$BC_mod= 0
##$BYTORDP= 0
##$COROFFS= 0
##$CY= 12.5
##$DATMOD= 1
##$DC= 0
##$DFILT= <>
##$DTYPP= 0
##$F1P= 14.0000005364418
##$F2P= -0.99999901652339
##$FCOR= 0.5
##$FTSIZE= 32768
##$FT_mod= 6
##$GAMMA= 0
##$GB= 0
##$INTBC= 1
##$INTSCL= 1
##$ISEN= 128
##$LB= 0.3
##$LEV0= 0
##$LPBIN= 0
##$MAXI= 10000
##$MC2= 0
##$MEAN= 0
##$ME_mod= 0
##$MI= 0
##$NCOEF= 0
##$NC_proc= -4
##$NLEV= 6
##$NOISF1= 0
##$NOISF2= 0
##$NSP= 0
##$NTH_PI= 0
##$NZP= 0
##$OFFSET= 16.44981
##$PC= 1
##$PHC0= -55.5562
##$PHC1= 13.68128
##$PH_mod= 1
##$PKNL= yes
##$PPARMOD= 0
##$PSCAL= 4
##$PSIGN= 0
##$REVERSE= no
##$SF= 250.130018055744
##$SI= 32768
##$SIGF1= 0
##$SIGF2= 0
##$SINO= 400
##$SIOLD= 32768
##$SREGLST= <1H.CDCl3>
##$SSB= 0
##$STSI= 32768
##$STSR= 0
##$SW_p= 5175.98343685301
##$SYMM= 0
##$S_DEV= 0
##$TDeff= 65536
##$TDoff= 0
##$TI= <Analysis number 999999
Compound Code 99
Book Reference 9
Project Code 9>
##$TILT= no
##$TM1= 0
##$TM2= 0
##$TOPLEV= 0
##$USERP1= <user>
##$USERP2= <user>
##$USERP3= <user>
##$USERP4= <user>
##$USERP5= <user>
##$WDW= 1
##$XDIM= 32768
##$YMAX_p= 550210845
##$YMIN_p= -391670
$$ End of Bruker specific parameters
$$ ---------------------------------
##NTUPLES= NMR SPECTRUM
##VAR_NAME=  FREQUENCY,     SPECTRUM/REAL,   SPECTRUM/IMAG
##SYMBOL=    X,             R,               I
##VAR_TYPE=  INDEPENDENT,   DEPENDENT,       DEPENDENT
##VAR_FORM=  AFFN,          ASDF,            ASDF
##VAR_DIM=   32768,         32768,           32768
##UNITS=     HZ,            ARBITRARY UNITS, ARBITRARY UNITS
##FACTOR=    0.157963299565203, 1,           1
##FIRST=     4114.59127933625, 0,            0
##LAST=      -1061.39215751676, 0,           0
##MIN=       -1061.39215751676, -391670,     0
##MAX=       4114.59127933625, 550210845,    0
$$ Real data points
##PAGE= N=1
##DATA TABLE= (X++(R..R)), XYDATA
$$ [...]
21322 -25788 -22782 14792 -11142 -29060 -92625 -52599 72343 115270 67171 31848 -14095 -19536
21310 -19536 -53 -19220 1039 -31945 -44679 11590 95906 123149 95331 12150 20464 -30324
21298 -30324 -32660 -71880 48620 64629 -44413 -107214 -11011 -9286 -38967 -30474 11190 42475
21286 42475 88511 52359 -39205 -69135 -37243 67645 105825 155605 151167 74279 46139 12427
21274 12427 55795 117409 98871 43070 124369 107812 103731 40872 18646 22475 30468 -60115
21262 -60115 -95458 -112355 -71646 -29042 -45082 8780 -9938 -38712 45416 37787 16719 -12086
21250 -12086 4314 82399 80 -48653 -87410 -136150 -112702 -14215 86415 1354 -11147
21239 -11147 -26720 -103974 -157550 -61920 -41304 -39649 -110675 -103189 10109 2095 -17432 -14603
21227 -14603 25359 84001 28474 50982 -11510 -141289 -143420 -153468 -115637 -17137 11273 -8096
21215 -8096 -11924 77030 89672 68940 58897 77570 112776 116553 78139 -81583 -83564 16886
21203 16886 19338 53959 37665 -49615 -80273 -12513 -32099 -49011 7321 61454 85525 137812
21191 137812 101944 91663 118328 44166 40260 189070 141954 42293 27363 115471 173332
21180 173332 109128 10837 -50862 -37863 -45561 -32724 -32591 -18881 42571 57661 102190 120860
21168 120860 53164 -27815 -67379 20070 159199 119578 48106 88600 71524 -51744 -156561
21157 -156561 -186229 -203489 -156317 -71408 -7773 -35840 35988 -12189 -93554 -80504 11132
21146 11132 45948 109405 -38545 -160530 -182659 -164059 -50197 -39546 -10623 -50602 -128509
21135 -128509 -139071 -116950 -76377 -2333 -34214 -21244 21519 46818 122108 56165 14741
21124 14741 -47872 -60523 -78120 -153181 -211092 -184967 -97660 18848 5488 5303 3643 -98893
21112 -98893 -89747 -33108 -1761 100770 27632 55822 -8508 -62110 -5386 -1192 -48236 -47910
21100 -47910 -67948 -95575 -99736 75760 166432 63614 -51436 -57780 -10864 15143 14103 -8922
21088 -8922 6546 6014 -137819 -221495 -195351 -92748 76574 65634 -17067 -66022 -35938 -52300
21076 -52300 -50522 18975 23428 -5160 2188 22069 45350 9480 50020 99957 107025 84304
21064 84304 92579 37128 4739 -6418 -17084 32124 166722 92611 24455 -22453 7162 -42300
21052 -42300 -22415 -8335 930 10099 7487 37104 62195 73724 88611 113851 14541 -143530
21040 -143530 -195065 -104284 48 159964 179528 67232 19031 -74304 -123979 -54182 78371
21029 78371 72985 -43759 -69739 36023 82494 4592 -120955 -171662 -144848 -59061 -13200
21018 -13200 48795 26173 19161 72870 70286 94192 195249 289627 200963 51357 -8989 28038
21006 28038 22051 69093 67073 95160 136133 176769 104107 74236 24969 -68105 -182518 -188179
20994 -188179 -124315 -43411 36597 9690 25206 56987 49977 77058 65712 -32860 -60094 41749
20982 41749 -14228 -1320 114368 98805 49240 26113 45743 17648 -31960 -124255 -164469
20971 -164469 -154838 -152780 -37398 -28917 26045 93026 49456 -27505 -108471 -102273 -92242 -24273
20959 -24273 24181 7628 12155 -42356 -12133 37835 111563 129996 -2297 -100002 -126044 -149619
20947 -149619 -15724 -47507 30354 136464 104474 -122265 -184020 -54987 -9046 43081 -38060
20936 -38060 -65914 -27666 -3326 45113 93177 155267 75763 -23254 -53061 -50512 -20734 -41788
20924 -41788 -103210 -79483 -60024 -65112 -45305 1580 -36805 -2898 67520 66233 88824 -33116
20912 -33116 -131368 -167841 -174175 -76849 -15747 50506 156924 204943 85262 64965 47350
20901 47350 -2549 -108971 -160685 -127716 -108951 -89612 -169941 -175920 -136468 -62032 18803 111994
20889 111994 79457 31327 -52663 -105409 -95681 -28044 -87868 -197038 -162976 -855 28375
20878 28375 17063 52533 109815 11944 -61740 -10030 -11608 -35524 -61610 -63081 -16767 52477
20866 52477 3289 -107241 -135035 -6006 91248 69606 55135 -36786 -22506 -16319 -84352
20855 -84352 -128860 -190185 -188919 -93933 -42008 -34383 -97898 -214514 -119532 -125109 -47391 -38301
20843 -38301 -67647 -7203 28020 103789 168028 147331 168049 115459 3438 35878 77270
20832 77270 101334 155809 262107 500606 561035 409725 395053 322486 154985 63810 8938
20821 8938 104736 110914 121987 218499 258709 423468 594955 525750 348762 177762 3811
20810 3811 -42512 29513 -40437 -104484 -60864 -29971 -10959 -85574 15077 52374 60464 -69597
20798 -69597 -35592 25415 45537 57019 164387 263572 222820 127283 54394 106587 17145
20787 17145 -26553 40113 -5508 -23613 -15770 -76728 -78325 -144953 -225328 -149359 -90968 -99015
20775 -99015 -130662 -111986 -113554 -86148 -2963 78762 83317 -25809 -224556 -210713 -110955 29481
20763 29481 100770 34149 -45592 -75893 -39795 36144 -11375 -18117 48884 106483 124478 185438
20751 185438 241831 214927 134035 34174 -66006 -99827 -39887 -44093 29574 134812 143812
20740 143812 121723 28722 -10704 -13903 -25067 -6105 72479 55913 76546 173840 177181 94135
20728 94135 17324 4263 -27847 33167 29632 21973 -60940 -113441 -59360 38262 111677 95441
20716 95441 150812 214595 91125 36473 35944 -22286 -30194 71960 156361 59247 49654 127803
20704 127803 176015 152663 154145 130046 22302 -14846 34595 6877 -150353 -108141 5713
20693 5713 42992 83044 77954 -38879 17863 104146 -69956 -136995 -220459 -115113 -14763
20682 -14763 -7094 -63249 -60248 -18989 -20361 12008 112858 114764 -11395 -39972 -97701 -96245
20670 -96245 -15240 81033 119299 148450 172816 71985 -18385 24404 80867 156600 153184 126052
20658 126052 114928 62602 9589 20929 62155 71711 53147 57528 88148 63378 161071 204032
20646 204032 216080 184773 117896 26945 26473 57525 50605 21038 39734 -19697 -13230 57725
20634 57725 75052 21438 23518 44686 74616 85168 115154 167701 176097 84153 122529 112785
20622 112785 205958 182312 129644 112591 108109 121634 24705 -61967 -44031 24833 82682 99377
20610 99377 158417 169582 158669 47605 50075 180145 240870 276113 254006 183152 177680 82831
20598 82831 -25052 35918 82390 26413 64739 52989 56178 72873 43562 98011 87886 -32486
20586 -32486 -46139 28238 108514 44016 4896 30564 -82945 -17354 157227 207815 244067
20575 244067 243284 136625 44587 -13286 -121386 -88678 -106419 -52701 -30123 -34840 41478 40095
20563 40095 63237 37434 -4483 -72553 -101828 -97705 -184311 -266013 -229005 -74107 -11754 70999
20551 70999 46714 72873 119364 144657 126395 56693 -5126 76733 138769 183671 117593 49065
20539 49065 -5377 -12578 19252 47074 123962 7058 -79687 -20666 19091 51561 32251 10312
20527 10312 -60058 -60974 68682 57587 17933 117898 68323 25874 132790 210256 110266 76847
20515 76847 98258 94278 -1387 41984 56169 16411 56679 129988 199562 161021 79136 62067
20503 62067 4932 1266 42200 64709 165425 225040 282307 268583 124088 33194 78294
20492 78294 17033 20403 50752 69909 42668 32649 85957 161652 174219 88732 163629 195227
20480 195227 241001 150145 60420 94521 77061 20233 49524 112042 209042 199149 220979 222018
20468 222018 207134 93433 79389 102989 121723 149509 132712 112944 74535 2990 68412
20457 68412 86320 52645 139027 89240 25776 153607 231720 173977 155396 139282 82857
20446 82857 109194 177237 209827 160416 110772 170333 158708 63113 34028 16522 31497 18107
20434 18107 29619 -279 151374 124903 208595 219747 99396 -17906 -31421 28883 43201
20423 43201 -52092 37477 46150 -49857 -118894 -13384 130906 153565 171033 40770 -3300
20412 -3300 37136 84495 86436 74634 106663 167524 155451 83737 111005 134308 60187 25438
20400 25438 47752 151381 186040 217057 240456 262315 235571 213562 103524 129611 155432
20389 155432 163264 222187 148472 88049 116847 123519 215179 349268 382359 301403 248952 240929
20377 240929 340504 282507 192853 248037 232814 279091 278144 343693 343903 311118 230876 228933
20365 228933 205388 205493 343809 367548 186389 134566 142969 35328 54712 -16083 105986
20354 105986 262770 278635 239721 266334 258587 282347 138814 152189 330395 387024 299959
20343 299959 244544 251267 312488 307904 295456 395128 501405 465851 354325 285529 297881
20332 297881 287186 283517 274362 237902 317862 309587 331927 471631 501501 343208 322176 432182
20320 432182 403471 307327 293245 440611 505130 587840 594768 625480 590235 483406 347037
20309 347037 349106 433593 461161 520643 569644 660448 729912 678162 683008 785889 781183 672551
20297 672551 666983 770554 977125 1112577 1285501 1392549 1449592 1454641 1373680 1243073 1188857
20286 1188857 1241131 1319638 1419627 1545769 1770567 1981358 2098938 2181716 2261756 2355986
20276 2355986 2485400 2716890 3028225 3291448 3455012 3380192 3246472 3285079 3435255 3758113
20266 3758113 4311065 5042897 5992834 7252560 8820119 10825330 13444946 17025015 22223012
20257 22223012 30841831 44882393 65127930 86333494 95475778 85981619 64449744
20250 64449744 44449610 32430682 26757843 25115122 26368816 30901841 40071243 55557960
20242 55557960 76385378 93593022 94226154 77016514 52777880 33858130 22561834
20235 22561834 16226779 12386212 9833297 7960260 6451646 5275862 4488508 3877484
20227 3877484 3406456 2896979 2561269 2443911 2403944 2347041 2219612 2137694 2047062 1915333
20217 1915333 1780685 1592261 1607098 1706217 1583615 1380225 1097189 895342 782570 692730
20207 692730 651832 615096 671663 774195 886161 1002903 1070772 967531 756447 595791
20197 595791 586263 578233 460096 361084 271582 148983 122017 10907 681 74413 119987
20186 119987 62061 82199 167484 269548 249196 138147 68946 74421 107354 129823 71227
20175 71227 78067 149373 117460 104118 112196 114209 104588 168087 175804 206981 177732 242160 150429
20162 150429 125211 153072 288876 245856 139105 92046 47808 72146 89523 94925 72968
20151 72968 25507 -38417 -39881 133712 183238 74720 11449 -11636 13813 34071 121758
20140 121758 214828 104828 14434 9330 95134 84534 62137 32825 23874 50527 67281 114096
20128 114096 152210 147326 137691 143994 246272 210585 163385 100870 -36266 -145036 -109458
20117 -109458 14752 117261 3196 -73465 -35489 -26669 32675 39313 -39261 76394 145274
20106 145274 62780 78709 158006 171043 174624 268190 223911 122333 185967 223263 228380 238706
20094 238706 304924 312075 440425 402143 264274 220411 267244 184817 72533 145170 252801
20083 252801 187525 188577 200460 158023 218876 191108 166768 165132 131939 174084 225025 275148
20071 275148 178060 132335 122615 140874 252567 274947 200512 192552 166107 166590 246492 361547
20059 361547 353394 234831 154030 117936 85769 157946 223232 159914 120562 82439 157119
20048 157119 215887 221275 170142 201315 246547 312311 213396 150684 115879 62043 48502 39021
20036 39021 -74116 -129686 -111815 -85177 -64162 -29439 31553 46077 4224 11149 -25450 -103602
20024 -103602 -67311 38947 88328 49177 -29290 -111893 -101735 -156855 -239808 -230245 -184686
20013 -184686 -163616 -135792 -99712 -47539 -89161 -166044 -146892 -55145 -91278 -75515 -103749
20002 -103749 -73048 20323 63642 102673 132708 143490 145058 112518 54930 22552 96353 209875
19990 209875 198882 130784 77568 67307 66990 72400 125289 120391 109813 110324 131536 87682 127734
19977 127734 186789 153779 169679 160604 74147 68878 189224 121741 63681 80097 33721 40954
19965 40954 78343 19695 6999 33007 -26368 -119813 -163865 -154327 -177285 -201067 -171757 -137192
19953 -137192 -122143 -49592 -111815 -234831 -149606 -179376 -150343 -92959 -9622 -29159 -78998
19942 -78998 -39366 -16886 -5577 33119 -51778 -126984 -101188 -74898 -84758 -85716 -44834 -54570
19930 -54570 -151816 -140840 -31971 -68486 -29485 -11008 -41336 -5959 31850 64432 50224
19919 50224 -35600 -19927 63579 95918 64364 138455 114266 -52932 -44911 -111286 -166054 -127481
19907 -127481 -46962 58125 107959 117637 51216 125418 91909 -15919 -92258 -79182 -62688
19896 -62688 -15376 -16887 14593 -30512 -43697 -11728 46944 1096 -59435 -50075 36200 35887
19884 35887 49880 55384 18713 -8739 -82412 -9895 126081 4524 -169181 -105233 -11858
19873 -11858 -34247 41145 87167 -5249 3209 25783 51992 67622 130942 -11296 -130666
19862 -130666 -219603 -142057 -63215 -63989 -45212 -57566 -57450 -21745 90535 89271 4399 -31811
19850 -31811 -52720 -24752 4202 -40628 -131406 -120386 -61278 -106829 -59464 -8408 -60758 -179747
19838 -179747 -236514 -207524 -122199 20284 67693 30458 -15231 -40842 -107334 -6112 145271
19827 145271 55940 -2079 47232 58391 31551 60522 5140 27644 -20213 -37990 -4459
19816 -4459 -20221 12682 -72120 -104802 -49856 -103973 -57541 65071 47620 -68973 -135678
19805 -135678 -141140 -73221 47832 107605 77140 15074 -75389 -95940 -127025 -91287 -49912
19794 -49912 -15289 108331 96213 25871 -13291 -66106 -127195 -7923 9273 -48933 -118450
19783 -118450 -25139 -5179 -2355 3861 -47040 -85575 -33301 125888 52066 6395 74824 64295
19771 64295 45647 -349 45222 9486 -72408 -3133 -37995 3647 44046 -76801 -140463
19760 -140463 -170891 -146323 -122460 -102171 -155748 -103765 -31247 89906 160135 97549 11133
19749 11133 -28751 -52319 37813 10963 -32949 4081 136725 149313 191197 134523 40958
19738 40958 8795 46273 -16283 -37532 -47734 -61100 -23663 22373 94053 112594 103984 149854
19726 149854 180775 147306 94366 92791 103121 10436 141257 170604 82844 75275 51829 12266
19714 12266 -25774 -42433 -62464 -55316 -135420 -83464 54329 85277 38905 35060 33374 58349
19702 58349 72377 50614 37216 10142 51919 -54739 -114171 -115456 -100705 -95829 -77954 -42054
19690 -42054 -111403 -23840 36616 81832 110713 -1615 52147 165643 65373 11333 32942
19679 32942 68147 177165 90632 100267 64529 85057 269298 365129 288273 244043 228747
19668 228747 181849 194886 102677 110674 204130 212103 277006 355516 410789 519472 530349 510019
19656 510019 367329 212283 189416 204844 158948 59777 43178 58773 -51072 -50439 -11220
19645 -11220 -64640 -118765 -58508 -53807 -141320 -190797 -86312 -60232 -90447 -91222 18722 14465
19633 14465 -21059 -69038 -113997 -113811 31462 134754 123910 126714 50230 814 -67113 -97908
19621 -97908 15793 17939 -31146 -80827 -34310 -78515 -222688 -327209 -264083 -174664 -72515
19610 -72515 -34194 -62843 -67836 -102078 -201646 -72884 -17500 -29448 -41138 -42192 -46155 -17343
19598 -17343 11951 34695 -40641 -49842 80839 140693 36718 -53696 -37297 -37294 -57346 2084
19586 2084 42893 28826 79508 33631 -10351 -23530 -122858 -112768 -59718 -84311 -29468 34679
19574 34679 -82052 -68260 -71376 -115148 -131011 -62686 -64014 -135746 -71849 -9877 -32965 -134771
19562 -134771 -114502 -68218 24210 -3107 -17195 -41360 -34049 73 53692 77318 103434 79121
19550 79121 74569 -11622 97 72182 112667 197635 168687 9217 8800 65696 -35660 -26377
19538 -26377 12621 12390 61163 -24429 -102424 -85356 -100957 -3269 77543 66752 1728 45787
19526 45787 131630 210717 152495 85171 93285 67969 1489 27950 -30325 -39582 16191 73762
19514 73762 35040 -93568 -134127 -139703 -101686 -59552 -95678 -144559 -49293 23754 35083 22818
19502 22818 27331 20625 -50224 -61957 -75887 -51871 -66637 45739 41217 145025 185404 107461
19490 107461 71077 24153 -26745 -26146 -51165 -3940 -40214 -160059 -90242 -8888 -68198 -90553
19478 -90553 -75549 -110333 -181518 -158967 -173903 -159765 -115768 -99770 -37311 -56358 -83435 -743
19466 -743 86687 193024 95434 -34653 -101100 -127890 -123980 -135702 4288 103647 68015 44143
19454 44143 62143 9237 -16733 40981 26133 -44126 -80563 -2564 40607 34614 25261 68689
19442 68689 24768 -16888 67489 -31349 -142563 -53007 109993 127277 44405 -9622 -90637
19431 -90637 -104913 -141781 -107691 -17216 -59886 -5302 -62071 -81409 -106965 -162013 -158645 -74042
19419 -74042 -91839 -68220 -19431 46052 24870 -44199 -56490 -34267 -59873 -1455 -26855 -149868
19407 -149868 -120879 -7986 39961 135515 218018 239297 89034 -25737 -85987 -136496 -210555
19396 -210555 -144104 -111958 -138482 -175796 -264661 -265342 -75916 50889 39929 -136612 -184425
19385 -184425 -149714 -118286 -7035 44763 137322 142287 79041 -34957 -75944 -35062 -35632 39608
19373 39608 43851 45600 123392 95906 43761 15261 71828 39976 -97195 -142223 -62103 -35613
19361 -35613 -38819 -18051 66780 135694 113581 109068 73226 86098 23310 -5837 -1211 32401
19349 32401 82045 29119 28214 50849 84525 23852 12606 34014 59852 22805 15315 -20226
19337 -20226 -37730 -83348 -106887 -134794 -41380 34216 -24687 -73803 -143787 -115119 -69280 -40784
19325 -40784 -14227 21747 35775 20411 43790 211539 203380 150664 140185 6910 -152704
19314 -152704 -151435 -146148 -103357 -114359 -161966 -206197 -127133 21851 -11853 -65750 -86027 -93806
19302 -93806 -151867 -142843 -108793 -90172 -97087 -84182 -93439 -58277 -35686 -151307 -162834 -104907
19290 -104907 -47147 -33188 -37828 -18703 105001 97921 98706 -55053 -176310 -258413 -156858
19279 -156858 -51291 -56326 -81049 -13044 -40357 -4315 -34610 -9731 -111542 -179938 -272461
19268 -272461 -235514 -97271 -86680 83264 103142 67474 137900 159302 32491 -95619 -124450
19257 -124450 -171920 -122824 -22500 -15684 -70692 79833 60084 17074 37911 34800 31545 72766
19245 72766 36 -22859 13258 23371 10080 -15063 -6196 -39199 -28976 -57111 -44026 16935
19233 16935 8400 49306 9363 -38972 -72370 -83945 32039 114700 91179 101503 87316 22175
19221 22175 -54350 8125 80332 29219 -1301 33973 -4200 -19741 -18672 -55825 -31 33135
19209 33135 23221 33957 -39621 -88 120305 167688 130249 -62640 -156809 -135162 -106813
19198 -106813 -96006 -108843 -70238 29541 30068 2917 25538 48192 44986 44792 149645 174067
19186 174067 225825 154166 56264 89516 104008 -33796 -49472 29152 13893 -98484 15292
19175 15292 72879 -45853 -84596 115890 134835 101638 25637 -18874 -105611 -106089 -50661 17994
19163 17994 -6475 -88186 -48109 66561 100153 -38954 -139813 -120318 -73927 -92700 -43327
19152 -43327 2055 83488 6915 -102141 -116163 -42565 87715 129057 68257 33634 -25468
19141 -25468 -33640 -13768 -14579 58284 101741 144124 148979 108681 203926 177681 77851 -2408
19129 -2408 17227 29688 -32799 -53791 6347 79312 61710 59448 75595 49277 15021 51089
19117 51089 103728 66715 -9776 70797 75888 -24872 -61124 -71802 -87252 -133713 -148590 -111335
19105 -111335 -149110 -132448 -114769 -92838 -143929 -87315 51618 -16267 -80018 -87782 14269
19094 14269 15331 -35777 -53878 25808 -33999 -69790 -189245 -293148 -247980 -171719 -132949
19083 -132949 -29576 14463 -70789 -115193 -170112 -233799 -231467 -249532 -133991 34183 54131
19072 54131 3187 -66290 -128188 -139708 -14527 38681 -83849 -207943 -144833 -96746 -152418
19061 -152418 -206476 -103978 -55041 -64494 -4053 50960 -69170 9339 95187 72157 129875
19050 129875 112349 -20420 -73551 -45007 -95987 -139510 -50182 -51486 -77057 48984 117942
19039 117942 111623 106079 43219 -11616 21060 148994 274914 357918 466250 550152 485098
19028 485098 359963 169084 104784 176489 187546 88291 131597 323850 412574 465436 516970
19017 516970 425637 387885 385739 426269 338377 163064 88617 -23683 -49979 -32744 -109683
19006 -109683 -39273 12027 151066 202191 202881 171363 57890 46600 158256 126898 126384 182502
18994 182502 209578 177067 166399 123710 65722 18675 -11219 -86243 -59344 -96056 -122479
18983 -122479 -103966 -49217 16257 115932 91484 86161 55474 75154 158669 184456 96277 162348
18971 162348 150485 158068 191616 131011 -26261 -62369 -114289 -142256 -140600 -30381 14737
18960 14737 51995 98378 -38887 -83414 -46168 -3067 49032 -16619 -19375 98172 143139
18949 143139 106390 63216 36240 122744 84870 58548 37682 20552 -26911 -40592 24012
18938 24012 -9699 22723 120847 160193 83558 17019 12242 51154 126216 205479 146256 201634
18926 201634 95713 51997 24777 91872 114238 148258 246804 299108 200367 128019 112350
18915 112350 41074 -65878 -4677 66697 64462 69142 43615 86832 146987 122647 90029 47751
18903 47751 1794 14345 134234 216891 274451 323926 310458 240686 206922 300082 278321
18892 278321 262412 373766 361596 198892 77294 5201 8665 -6732 51419 76977 5008
18881 5008 -37379 -23812 -20767 -82801 -11862 55964 135076 63418 168671 245103 177382 14521
18869 14521 -146741 -193675 -136810 -79051 -28413 -13783 -2333 1012 38917 128999 67862 53171
18857 53171 165605 200143 212315 248058 285574 230963 121337 146519 103712 86550 97225
18846 97225 64064 80742 128989 -22805 24697 75949 99774 35916 -121386 -167720 -106827
18835 -106827 15324 138911 25597 -20993 9371 19451 123650 49601 -56525 -149361
18825 -149361 -86218 -4430 40934 153701 112635 70311 44016 -60000 -21987 -88299 -101071
18814 -101071 -45161 94228 69979 6901 -9721 -50724 -82971 -78286 -115143 -170093 -144833
18803 -144833 5599 -30548 -144463 -138429 -136687 -61344 13901 -35275 -98958 -110116 -42940
18792 -42940 -24413 4245 39956 86995 137340 87525 -54329 -122947 -211254 -85970 52096
18781 52096 11106 -7644 56390 123078 54871 26469 138142 227191 241400 203076 216319
18770 216319 428501 591438 733907 962227 1167111 1036252 723140 440664 333188 289826
18760 289826 231512 195815 255042 267404 206384 189106 143295 87570 104610 229297 265332
18749 265332 169771 91425 96411 45171 76171 161296 139588 153990 206615 148171 116961 227895
18737 227895 262535 353295 290538 282875 334339 353925 342337 336985 366423 378171 534028 663736
18725 663736 622705 642331 643364 533369 451934 430845 558546 707738 765107 673820 553657
18714 553657 533673 540830 608321 507859 398616 372357 280225 351154 254218 132314 61449
18703 61449 -20271 -12850 72184 124857 228048 192363 118054 111369 154440 239453 361237 289818
18691 289818 102952 86736 46058 -9641 -8312 -25904 115351 84000 -25783 32037 96166
18680 96166 89335 69503 -9567 52442 35341 67147 115643 116772 72719 33488 1083 -38726
18668 -38726 -14027 67937 88965 67697 -13212 68099 33112 26655 -9878 -74103 -41373 96364
18656 96364 196764 232690 189055 49972 -22320 58642 198161 181390 139545 209837 244852
18645 244852 253079 199360 227824 231447 199931 161177 77223 23902 85288 152597 188166 231428
18633 231428 221576 211379 151619 119879 138243 207356 189209 78899 140587 145451 87419 30402
18621 30402 -26355 20618 167062 193139 117236 61039 110926 192399 150688 174887 234451
18610 234451 160288 127181 221287 256127 307653 382064 408014 359435 211480 123765 121129
18599 121129 206530 220218 125156 -47241 55440 193920 357075 281277 266591 288527 326742
18588 326742 226979 248285 246376 196494 187859 271788 374429 338475 308595 227902 268924 246321
18576 246321 318140 306975 335699 481285 469334 434548 391177 432733 496946 437429 390185
18565 390185 343964 378551 434955 467065 462943 349881 409431 493861 503453 615453 672951
18554 672951 619333 601002 651567 730835 813639 798176 733960 780978 888531 979612 1017346
18543 1017346 1096656 1120782 1294629 1488603 1419990 1399070 1472719 1669407 1900456 2222781
18533 2222781 2693879 3094337 3294575 3360692 3365951 3596198 3989820 4402206 5040742 5646357
18523 5646357 6113011 6830519 8051127 10276969 13447018 18053848 25528889 38105342
18515 38105342 58987667 87196388 107336508 103112595 78131203 50071765 33123119
18508 33123119 25096757 21940503 22089656 25548785 33323398 47616781 70495445 96572241
18500 96572241 106660653 92261233 62884013 37834387 23901610 16576203 12279342
18493 12279342 9383125 7297384 5848475 4920106 4511096 4364171 4159737 3780082 3427325
18484 3427325 3089575 2851687 2767892 2481956 2096681 1661995 1318671 1164214 983211 895001
18474 895001 825073 680061 629648 657036 589156 587057 600700 553960 472800 415832 430887
18463 430887 353213 338458 380377 425482 325649 223234 296737 384988 333211 293023 154811
18452 154811 104647 166255 158961 180632 194761 169971 215419 269551 230414 213408 199104 253236
18440 253236 282107 271423 185299 169007 156490 143828 176544 188046 277808 311189 169598
18429 169598 3748 28151 116469 242485 224077 147678 166613 253515 210320 176635 109584
18418 109584 111114 169335 210340 130411 136491 228208 340382 315474 319429 244071 100002 56171
18406 56171 -39373 -45774 -47838 -8893 -30278 -53443 35220 143710 152035 134762 157155 213720
18394 213720 186707 126312 158486 133863 171079 223143 201284 89889 75290 77277 92703
18383 92703 33472 69815 88095 45916 3529 -21827 -70048 -48835 -106977 -43571 35954 34740
18371 34740 46704 95736 139685 162948 121250 140739 33341 -6673 36531 110224 231130
18360 231130 202029 200588 136846 77023 103203 156578 306300 344389 290964 156328 -27040
18349 -27040 -78277 17649 107733 166226 188425 117782 63109 42167 62071 20256 -146030
18338 -146030 -187796 -159869 -107227 -5156 81387 104832 66143 148147 281925 257496 145637
18327 145637 57836 -47189 -49540 -12589 -21443 -61459 -62898 -65353 -70582 -44757 73901 103023
18315 103023 41712 56927 -107955 -75102 53371 127439 218564 163311 128743 194378 128788
18304 128788 48161 28517 19922 -58198 -42530 64944 235084 273718 293566 305344 289752
18293 289752 186767 164639 122566 63916 50778 95225 149627 197463 151870 126764 158564
18282 158564 136799 37788 -68473 -93014 4646 48470 165376 250928 139196 81608 50292
18271 50292 -46111 22260 91370 72108 83173 95668 14510 -29558 -53089 -36852 9054 84667
18259 84667 73528 135242 92071 -17101 31868 129419 143791 111762 1580 48105 137325
18248 137325 235641 293771 194252 189925 331420 389787 272512 236099 345851 405624 344922
18237 344922 347291 305617 292323 233730 103144 87208 87236 135609 117735 88728 46603 72083
18225 72083 75699 42039 55200 82826 37922 85507 186687 83001 14461 127753 165919
18214 165919 128356 59179 41402 89132 114425 84220 23272 23757 -11159 -54419 -44388 -11716
18202 -11716 89540 109631 144283 185226 303654 274571 285380 222821 184217 209758 200879
18191 200879 120394 92442 118036 156625 208900 244261 167419 183268 238292 278593 305163
18180 305163 198601 93042 118831 175424 238015 256466 387639 413978 289694 222207 300503
18169 300503 237116 140410 178364 354978 471434 473992 388859 453474 603047 635356 677257
18158 677257 634929 521580 561236 614124 644550 792062 775394 653818 539446 485804 419121
18147 419121 429950 530627 549071 479364 496504 535771 545229 750775 804133 841582 923379
18136 923379 1005576 1160441 1253082 1342590 1427245 1516189 1715951 1914986 1986879 2137079 2359270
18125 2359270 2614627 2861305 3234687 3715616 4336064 5122409 6024080 7263610 8880718
18116 8880718 11101991 14289898 19179945 26818437 39537147 61682605 100238910 159784061
18108 159784061 215572777 217377980 166531957 98126546 55266358 34026890 22772646
18101 22772646 16356235 12351321 9745236 7882734 6364587 5378256 4764582 4122283
18093 4122283 3619955 3249287 2833910 2442883 2280583 1954481 1672566 1525365 1321346
18084 1321346 1184111 972849 940146 929181 797325 683759 618702 729259 710528 604166
18074 604166 514146 492016 514312 600352 490265 503113 601335 535739 375287 372211 450534
18063 450534 339692 214145 150396 107505 49987 49116 125118 155715 220180 193760 71490
18052 71490 64514 105514 94853 53106 60356 161437 213936 183380 103758 63891 -108953 -131150
18040 -131150 -125688 -141326 -25426 103048 90701 -33890 -73402 -23697 -13794 -74992 -87784
18029 -87784 19354 68394 40320 84 -17656 -68973 -133361 -165321 -136222 -64484 33640
18018 33640 -64780 -159336 -98360 67988 95097 117480 11472 -81145 -44063 8794 -35851
18007 -35851 39320 43006 -18771 37316 141984 68176 -7878 -25109 29763 55546 19951 45003
17995 45003 28216 165476 238080 384122 482039 631030 612451 453462 312567 188446
17985 188446 146878 257361 212215 148469 91633 136274 214512 323903 370715 355262 211757
17974 211757 91395 47801 -17877 -11673 -17635 -21542 -6683 -72955 -67491 -34800 41789 72337
17962 72337 92882 101388 -47394 -32536 -7746 -83404 -67191 22224 36316 -27862 5199 60283
17950 60283 83256 57211 12595 76853 94017 -35293 -134783 -80322 -61378 1253 -78941
17939 -78941 -162745 -106277 -30331 98087 131080 55154 -47285 -70469 -54414 -5832 -78134
17928 -78134 -134381 -52898 44469 103145 115019 13705 -77170 -95041 17749 59537 17179
17917 17179 -26043 -38140 -20163 24581 -1031 49080 -6101 -28448 -77428 -43236 82751
17906 82751 84987 -69046 -139791 -187811 -137587 -66643 -72382 -17124 -20218 -117138 -97082 -159544
17894 -159544 -180636 -143036 -124115 -85896 1716 -52165 -124029 -156284 -140658 -22351 -83637
17883 -83637 -163390 -196327 -197177 -116180 21360 41521 -4445 -105602 -123226 -157742 -255415 -244570
17871 -244570 -123044 -36134 -176467 -136404 -108073 -178943 -191417 -168964 -151200 -45587 8565
17860 8565 -10933 -100672 -27386 15535 31569 128047 159983 187043 182981 137822 65946 4646
17848 4646 -2231 -22419 -2471 -23286 -90735 -134276 -134591 -119994 -53765 -20242 -17343 -95875 -146252
17835 -146252 -140488 -190552 -215971 -222824 -27023 139500 192332 106383 130780 163703 33908
17824 33908 -63258 -70069 -25342 -17598 -52401 -22729 -5117 52241 76409 -5145 -111398 -43444
17812 -43444 12115 -93566 -230365 -209985 -71015 62676 13005 28964 3754 34196 66154
17801 66154 94865 82418 -28255 -44786 -29816 -93387 -149735 -133079 -151611 -220980 -223740 -111322
17789 -111322 -124713 -216552 -91502 -62933 -127345 -74947 -4637 133443 122730 104298 53008
17778 53008 -40588 -18672 24197 27974 -57086 4505 -140649 -108795 -82678 -51401 -72745 -111250
17766 -111250 -148035 -118228 -99912 -124024 -104084 -67629 -109352 -160894 -201910 -147659 -128389
17755 -128389 50335 49140 62723 133280 151614 168895 128587 89908 130027 205986 130673
17744 130673 5110 -96267 -28701 46495 36648 -17075 2274 6451 -15675 -73923 -96229
17733 -96229 -40873 34888 20805 17714 -16240 12350 108192 36872 -41777 -37818 -12716 -24988
17721 -24988 -38525 27458 7688 103693 118963 58488 5691 17601 47917 133604 135814 21201
17709 21201 19338 42698 88472 -26725 -40540 1755 -69401 10243 -2364 -51832 -110647 -129127
17697 -129127 -145587 -74645 38962 -55853 -201261 -154024 -36149 33782 25416 74984 44962
17686 44962 66945 23948 -11633 -150700 -302549 -278121 -177970 -94633 -13327 43701 40694
17675 40694 72983 -24103 -117738 -113008 -177236 -130092 -142631 -186710 -124881 -93397 -66651 -29047
17663 -29047 119238 158337 94075 46770 -58121 -78406 -53750 -60537 -107407 -90345 -27534
17652 -27534 -107483 -181677 -189615 -132613 -94082 -27744 -82249 -101939 -61702 -2500 66098 161642
17640 161642 210937 181316 120498 17389 -68934 -88685 -19199 18636 65022 16153 15158 13932
17628 13932 32819 56072 75160 70692 316 -15058 -58445 29563 62374 129162 67806 83455
17616 83455 155661 125454 118125 25021 -108128 -237652 -247392 -118935 -50548 -21915 -36234
17605 -36234 -30886 31681 55275 83856 85058 79491 154191 210175 178012 168770 126268 143366
17593 143366 88261 -28708 -99860 -116303 -67697 -10528 -19897 -60178 -120543 -219671 -237150
17582 -237150 -240737 -249610 -197407 -130180 -107545 -187583 -278323 -267970 -221932 -171640 -137123 -99430
17570 -99430 -104788 -50484 -66553 -169734 -104778 -1041 -18410 18145 -38761 -82012 -52058
17559 -52058 59151 39504 -12662 109196 135351 132168 113383 -22538 -164206 -130630 -104040
17548 -104040 -100366 -139388 -148255 -116874 -83250 -46664 -108521 -168529 -126199 -41089 4982 37558
17536 37558 156433 88138 -52844 -107262 -169625 -179790 -75008 -6321 -29259 -20834 -83884
17525 -83884 -108177 -56067 -88814 -37927 -47193 -198617 -274839 -352570 -347200 -335883 -281289 -193656
17513 -193656 -146871 -144952 -129546 -130362 -102961 -130393 -88153 -55894 -32872 96852 141675 57847
17501 57847 -3876 14436 -30958 -81163 -99785 -148832 -120684 -103636 21235 172900 94998
17490 94998 89234 71321 57552 30618 -38245 25335 -44278 -26398 9044 78647 92588 1737
17478 1737 -87241 -113722 -73664 41207 61474 -63238 -85817 -38713 -48811 -103609 -63499
17467 -63499 -150876 -224215 -279829 -180407 -129447 6751 160393 174680 128186 44732 -26544
17456 -26544 19759 56532 103974 66578 54802 -2885 -10527 170350 176983 123479 162959 208895
17444 208895 404756 716201 1047186 1118692 889709 560266 300637 189650 182171 83994
17434 83994 -7650 -3175 -21367 -77591 -110395 -142671 -67694 -53446 -64925 -111339 -173281 -232211
17422 -232211 -143444 -22058 -41545 -96238 -64535 -12414 1057 -35764 -112773 -186127 -138554
17411 -138554 12452 105854 154527 169889 100594 -33619 -164881 -189019 -96420 -75668 -80823
17400 -80823 -33254 55022 80381 3809 -40752 -89087 -155824 -61485 37318 148289 118130
17389 118130 58859 -35211 -96631 -52096 -7803 34619 17493 36430 74389 80609 4976 -40227
17377 -40227 -34538 -81341 -70481 -15752 13537 85485 149141 83662 32783 -93087 -44454 74081
17365 74081 127837 97066 68491 32185 41549 -29427 -139090 -229088 -213497 -100192 -36873
17354 -36873 -110351 -105912 -170505 -152560 7156 75477 46749 -28436 -90655 -139691 -91021 -127072
17342 -127072 -93918 -16577 -28731 -64495 -77718 -20650 -36719 -156750 -72317 28766 -34628
17331 -34628 -156332 -172637 -119409 46608 51682 46862 45444 -75931 -136616 -161454 -106171 -64686
17319 -64686 -19940 8328 -8670 -62517 -116807 -30361 97353 114686 149430 171773 80669
17308 80669 -26628 -103437 -147139 -69511 -119565 -123209 -109392 -119789 -83450 -71877 -135191 -122984
17296 -122984 -117654 -106317 -88011 -50468 -87456 -161337 -119433 -16408 54470 84587 61729
17285 61729 -38011 -35388 87638 87258 -16104 -112810 -82565 -73375 -53232 -54888 -51814 -28402
17273 -28402 968 80978 103216 117119 174630 212801 270464 275118 190445 4426 -174077
17262 -174077 -212168 -202814 -215632 -149252 -74578 11286 39734 48803 70305 12608 55386 -40827
17250 -40827 -158282 -99079 -1660 75077 73608 30380 -17458 -99890 -155005 -139421 -109970 -45637
17238 -45637 63745 153562 80860 -78136 -44669 9697 61303 54491 154773 150415 17101
17227 17101 -26427 48765 47117 136258 189780 75969 -778 -10663 -28428 -94873 -155450 -71456
17215 -71456 -28908 -13231 25640 -16747 -27023 41181 27544 74480 -10441 -19664 -2729 -111713
17203 -111713 -85640 -78345 12342 176580 108877 12485 -23190 -82984 -81624 -98338 -96429 -31548
17191 -31548 -76126 -8573 127822 224545 130696 93529 99018 137640 256795 214697 190631
17180 190631 154345 74780 185080 181348 56786 -88840 -180519 -195401 -271285 -172037 -52786
17169 -52786 -12419 -19069 -91836 -108095 -79424 -90436 -18411 -14196 -14685 -31954 -148013 -68746
17157 -68746 36172 2356 53069 66306 -24675 -136197 -111069 -143416 -196298 -120529 -206478
17146 -206478 -201175 -161719 -94507 4294 -29056 -9042 71283 57961 66156 84870 13594 -58753
17134 -58753 -37691 65517 99678 -131163 -261245 -206876 -110344 -92490 -105538 -158275 -237262
17123 -237262 -110043 10956 36036 14531 -26603 4219 8664 -63708 -35222 44939 169056
17112 169056 149353 62373 -4677 8385 -11261 -189855 -150271 -64845 -22024 -30550 -82516
17101 -82516 -79751 -48000 -15098 4027 -39568 -31233 -15023 16676 -29400 -75839 -19937 5665
17089 5665 74480 73612 6248 -181 7566 -46587 -72311 58521 87121 45688 133609 69522
17077 69522 -37910 -137306 -171181 -60046 -91264 -104019 -102007 -146647 -177087 -193613 -74129
17066 -74129 -25982 20484 44316 -60774 -161142 -101131 13635 -81716 -180660 -164404 -234051
17055 -234051 -105694 -12733 -72416 -10070 -26943 -19140 37444 73477 80042 70807 30393 42134
17043 42134 -84147 -172682 -228293 -115138 -107925 -110368 -69111 -30750 -62778 -86569 -51431 -35066
17031 -35066 -47506 -62617 -113504 -173661 -131833 1185 27947 -100292 -130669 -91898 3692
17020 3692 -9787 -118505 -176234 -105397 18620 54611 27068 2294 -46826 -118812 -92052
17009 -92052 -29854 -74353 -84267 -91545 -117793 -122988 -71525 -52451 -36807 731 -62060 -16133
16997 -16133 37496 36707 5202 114896 113597 184286 123396 128799 71766 -48175 -35446 -4961
16985 -4961 -35678 -83344 -117276 -191627 -116904 -22351 -35859 -93862 -41196 -17273 -129694 -183661
16973 -183661 -235143 -261272 -260935 -193456 -110775 -86708 -32778 -76100 -172020 -110610 -18257 -42103
16961 -42103 -59117 -88602 -149806 -163849 -186846 -148939 -119615 -134304 -120058 -16491 34324
16950 34324 -26752 -178616 -172261 -45486 12369 -13498 -81573 -62793 -74275 -46659 -6575
16939 -6575 -8701 -76456 -8517 27082 -11042 47853 153058 119508 -75913 -118932 -94902 -94473
16927 -94473 -172496 -109827 25194 27623 -40124 -66444 -146850 -160464 -92291 84752 81071 -38114
16915 -38114 -95493 -43789 -44256 -100270 -173069 -124313 -94150 18865 34335 -34537 -64168 -8314
16903 -8314 -75905 -38783 91008 92744 13926 -41694 -11314 -23431 -59746 -109634 -52706 -22399
16891 -22399 -66677 -118063 -80850 -100681 -124496 -65001 -66627 -144769 -150977 -73403 80993 65931
16879 65931 15790 99527 70618 25831 6398 -5209 -58547 31241 19005 -116933 -98419
16868 -98419 -60296 -105985 -69635 -47383 -58246 -94388 -152382 -207284 -176966 -212028 -239582 -184032
16856 -184032 -84667 14980 -94403 -221398 -126441 -133675 -99548 -94229 -86833 -5541 -18946 56909
16844 56909 75718 16343 -71300 -2212 -9789 -30737 49914 30007 -2675 -60756 -51899 55397
16832 55397 66206 10443 74943 172808 183303 113013 -46812 -75219 -53203 -92662 -28588
16821 -28588 -14238 18511 120205 95001 14621 -59727 -38521 -65534 -26245 -85551 -193594
16810 -193594 -125634 7098 2524 -27179 64315 68201 -52572 -35165 38543 61534 -8897
16799 -8897 -19615 -44080 25612 33006 89199 181303 138656 6197 -71181 32603 120650 88717
16787 88717 59039 -23689 -36291 -76583 -165101 -171007 -104128 -2824 -58910 -165269 -105637
16776 -105637 -50941 -98008 -170144 -1656 -9910 -27217 -5967 -58147 -70911 -81965 -149141
16765 -149141 -222798 -211499 -106287 -67189 -2860 -43656 -149536 -82093 -51677 -88487 -21361
16754 -21361 -95060 -172746 -97615 -115740 -161078 -212227 -146096 -32397 -14392 121970 204704
16743 204704 141884 89828 90594 -7519 -128981 -170751 -222368 -155526 -153066 -238538 -240413 -165994
16731 -165994 -102222 -50119 17179 23414 -32679 -37974 15237 -51642 -75767 -55756 3691 61600
16719 61600 3963 -97402 -120303 -94031 -53016 -43225 -118913 -108013 -141723 -143326 -195059 -191086
16707 -191086 -105218 -146276 -176059 -139748 -111743 -54016 -19577 -79887 -132448 -92943 -14870
16696 -14870 -97108 -147570 -111873 -103006 -174124 -190456 -182747 -191739 -144494 -149860 -136636 -126034
16684 -126034 -107315 -127257 -216545 -159963 -113114 -27050 -137513 -261039 -196215 -91697 -144767
16673 -144767 -201274 -88536 -23792 -45587 -106418 -197124 -116191 -36780 -13485 34671 36143
16662 36143 41498 -83314 -186237 -173723 -133109 -227384 -306564 -221229 -221277 -293029 -218911 -204283
16650 -204283 -229830 -118145 -68091 -43519 -7371 629 -63597 -31220 -39586 -148112 -160934
16639 -160934 -156262 -204631 -200468 -77805 47076 102150 15156 33816 6126 -81769 -167433
16628 -167433 -230294 -246860 -200437 -184567 -37659 -33427 -126481 -141344 -107181 -4412 -56677
16617 -56677 -23935 41237 37394 -52534 -110814 -74588 5629 85320 72186 17398 -61960 13785
16605 13785 161842 213964 116950 11890 -16475 -67901 6999 57120 105544 86747 81134
16594 81134 -4342 -2527 -33665 -186807 -145533 -89424 -112151 -8128 -73823 -155310 -159004 -149977
16582 -149977 -94565 -161263 -247265 -176952 -96810 -127115 -205364 -303981 -312805 -310549 -272946 -279080
16570 -279080 -241806 -177962 -119781 -70546 14904 -26910 -16732 -13439 13447 -6844 -73404 -82569
16558 -82569 -36994 16443 -19188 -24765 -127244 -148398 -117593 -134962 -201350 -131403 -72989 -36581
16546 -36581 -59276 -130503 -127987 -74126 6008 -32673 -146348 -235485 -167239 -144983 -174284 -150183
16534 -150183 -257197 -375729 -388271 -217529 -141779 -115284 -34600 15858 -43119 -159104 -170011
16523 -170011 -233836 -204621 -113847 -24899 -20727 9763 86039 50675 -136317 -100248 -73553
16512 -73553 -105651 -104129 -71314 26858 71017 109616 87167 145074 137934 97239 84963 2359
16500 2359 -69550 26000 -842 -23656 49290 135614 108643 65985 -34361 -74732 -73507 -29164
16488 -29164 -42359 -104632 -49842 95901 125028 52012 -10645 -47506 -35821 38745 -40590
16477 -40590 -61211 -67795 23640 -25306 -6077 -19875 -94732 -37180 15552 -17888 -129492 -98328
16465 -98328 -122508 -148725 -196803 -158774 -90491 -1271 16386 -53013 -90277 1529 19723 -13347
16453 -13347 3127 61684 -5369 -21833 29701 129632 166423 85597 95380 78512 6215 39861
16441 39861 310 -32379 -104908 -107599 -28247 16259 72597 78925 99258 81644 -47849 -265354
16429 -265354 -317056 -269761 -236011 -183165 -59450 41083 92534 179516 208941 113665 43937
16418 43937 54103 16292 83119 108470 160889 106566 55909 28977 59759 90978 9703 -156837
16406 -156837 -130853 -119707 -69632 16433 -12779 28184 48930 57625 80048 70202 -35940 -114304
16394 -114304 -62977 10244 -40489 -47845 32677 134246 130710 86159 49717 -52812 -9862
16383 -9862 5965 13762 59742 7522 -185984 -134930 -108293 -41617 14043 -80560 -81175 -126666
16371 -126666 -213303 -188488 -154592 -206393 -165435 -221366 -178500 -131258 -187479 -111156 -169923
16360 -169923 -303085 -382795 -347375 -173394 -56773 2409 45536 91186 78717 73134 86869
16349 86869 55754 22916 -14855 -28958 -40105 6935 12573 -16727 -72978 -102805 -118169 -108740
16337 -108740 -19540 -43930 -23768 -95787 -162251 -165528 55066 3988 -45606 109162 115301
16326 115301 43589 -124086 -126882 -123186 -172163 -241252 -169764 -134916 -67625 -38793 -29357 -15403
16314 -15403 -36779 -25006 -133242 -292911 -340318 -198688 -23539 -21321 -136324 -139202 -173715
16303 -173715 -60215 -23729 -97513 -44087 -52956 -40112 -11879 123803 256471 62911 -82519
16292 -82519 -115065 -142397 -65375 55554 120647 49261 -5533 12686 -10865 -101565 -70272
16281 -70272 17143 -20603 -51338 5924 37628 38286 185067 143642 92690 24678 -35630 -2244
16269 -2244 -12536 -64128 13814 52103 -15723 -22980 29033 35346 29429 -35767 28111 103570
16257 103570 92319 96597 17064 76316 100435 63414 -35127 -69269 -79318 -33947 -33249 -40620
16245 -40620 39365 96897 97561 79312 18839 27667 32669 53643 48305 -64390 -113416 -119442 -86301
16232 -86301 -47998 -98743 -98838 -130947 -72045 -67865 -35202 -37100 -90799 -85934 15755 64416 79031
16219 79031 64678 75852 -13823 -25196 -87808 -107860 -53013 10690 48419 -1729 -129812
16208 -129812 -164754 -173926 -157257 -102123 -89175 -86703 -79515 -151941 -152050 -78321 -13833 39711
16196 39711 19657 -33041 -34172 -33894 -22113 26739 34596 43559 44884 -69518 -123835 -80511 -79624
16183 -79624 -143107 -156595 -103712 -80633 -58795 32503 -28236 -68450 -46455 27729 3184 2076
16171 2076 4767 11717 17850 -7407 -85007 -110711 -103028 -80974 -47588 -13765 -45465 -48676 -65764
16158 -65764 -54677 -29533 20337 -25584 -12639 111557 41325 -94422 -132487 -110740 -158874
16147 -158874 -94336 11345 42751 3340 -10075 4884 74955 -1431 -6798 18455 47311
16136 47311 56605 74673 62895 -17582 -102468 -152500 -37585 -78487 -49677 -90317 -120786 -23446
16124 -23446 -10243 -65823 -73044 48101 107998 183783 176801 211347 101811 92259 22739 -75397
16112 -75397 -150345 -93584 30632 48226 61049 39027 8529 -96013 -195207 -180764 -163602
16101 -163602 -133044 -118003 -6338 30649 42168 15297 -138688 -16743 47141 28433 26438
16090 26438 -24426 -974 -1787 -93934 -225939 -270774 -265863 -225002 -177499 -186963 -256974 -216193
16078 -216193 -184032 -182905 -82527 -109580 -52774 -56191 -41562 -121102 -165383 -85224 -113120 -187103
16066 -187103 -150979 -106979 -24081 -38764 27509 35757 42783 -25678 -106570 -89451 -40082 11273
16054 11273 -72775 -153652 -227866 -219437 -143915 -100116 -147617 -110531 -14283 -59213 -53015 12088
16042 12088 76311 61866 -40579 -132807 -85029 -53761 -118516 -152177 -168541 -98594 -7385
16031 -7385 -91073 -58365 -7789 -16685 -110267 -162832 -160727 -117402 100956 243103 207100 164870
16019 164870 91681 54212 28650 -154311 -163105 -57774 11960 -23598 -148734 -287974 -370673
16008 -370673 -355200 -246750 -139788 -128008 -124983 -164933 -110100 -100723 -272967 -217929 -22684
15997 -22684 85866 -67830 -131147 -143524 -84187 -4474 33175 54709 -112565 -171761 -180115
15986 -180115 -194245 -145836 -76046 -122554 -90971 71569 181513 165234 120782 56382 48131
15975 48131 -25745 18501 132748 128709 75789 120013 187430 241919 241552 130095 61426 -13043
15963 -13043 -53458 12385 109054 52486 61844 64264 96130 62779 21602 -50936 -7517 66159
15951 66159 53311 1022 25053 36609 -54879 -83436 -22895 68746 84835 53909 -24263 -28593
15939 -28593 -62573 -116276 -56092 56305 124587 64150 20364 -42789 206 -23313 -29347 -12667
15927 -12667 -125324 -145214 -112885 -125270 -35914 4633 139493 90805 -8610 -2325 40281
15916 40281 -6376 31530 41320 49780 84391 -1856 -53101 -11307 139088 188927 168019 135560
15904 135560 71471 -68207 -112188 -87997 -14620 46049 -16329 -131020 -196584 -119561 -67853
15893 -67853 2532 17272 -2411 15859 136683 126976 48213 -69988 -179515 -234042 -200604
15882 -200604 -21980 45635 34942 -50005 -38547 -123704 -120392 -119285 -44559 65606 7864
15871 7864 -122309 -135405 -88413 -72926 -110887 -59437 -9327 -28053 -45104 -117746 -134527 -20013
15859 -20013 -26550 -111765 -135510 -122291 24020 68794 -2804 830 38518 61489 140157 162106
15847 162106 96120 12700 -47912 -51869 -14857 61646 6793 21255 16557 -54306 -43307 -28283
15835 -28283 -13384 -10794 -22277 -86 -51636 -87108 -28502 64843 90017 24826 -53207 -120595
15823 -120595 -96656 -36321 53031 196333 107625 21881 -11660 -43311 -89447 -164211 -184427
15812 -184427 -230072 -152663 -71223 -86380 -60975 -38184 28494 79810 140627 98468 15523
15801 15523 -93571 -73242 70114 123829 54802 68499 -16943 -115745 -50506 -42683 20638
15790 20638 85188 117810 68615 96972 166053 145109 -86811 -186176 -226612 -159552 -79057
15779 -79057 -157790 -134449 -46705 -94632 -134096 -113605 -65048 -99768 -102556 -77037 -148801 -176592
15767 -176592 -114525 -104047 -113508 -75299 -4473 72413 114350 26717 79770 133099 63790 3459
15755 3459 -46890 -2208 37882 81397 -7568 -96851 -134626 -164734 -164437 -185183 -111169 -32830
15743 -32830 -11931 29060 -72569 -96359 -53817 -10114 -85824 -146580 -135487 -23468 131656
15732 131656 117176 -10834 -76301 -36769 -11579 47672 48801 27905 -54128 -35628 -89050
15721 -89050 -202357 -203184 -205157 -171235 -116475 -99489 -63092 23734 18752 46419 51820 -96813
15709 -96813 -136314 -89140 -8281 39689 -24175 -27530 5435 86345 91280 65688 7428 -28983
15697 -28983 16574 -34156 -64217 -3114 65623 52648 8569 -17889 116886 82391 550
15686 550 -70363 -52135 -92008 -75131 -56747 -9921 -71924 -141346 -169298 -102294 -64267 -58096
15674 -58096 1248 2502 -73946 -73551 -21685 129424 222231 140634 49396 -10174 -8477 -54559
15662 -54559 -161142 -207467 -175401 -77003 9422 -3423 -39775 14574 -4623 -52122 -145036
15651 -145036 -138388 -136760 -107623 -103846 -97212 2105 86737 88633 -60835 -70748 -65406 -123083 -204938
15638 -204938 -168153 -105355 -53832 187622 194862 162513 99481 -79598 -128117 -60578 -110993
15627 -110993 -83468 -31566 -6727 27451 20750 19242 16597 35326 40339 35742 54574 38864
15615 38864 58949 -30434 -75582 -48119 -10099 -68473 -194088 -226747 -82415 15531 49809
15604 49809 10226 67693 41668 45915 80510 4317 -28372 -77847 -87569 -102062 -11787 74723
15592 74723 -83877 -130102 218 54887 18439 41087 7917 -26051 -108866 -207109 -230017
15581 -230017 -139536 -43085 78789 42297 215 -13314 51580 105634 22045 12767 -35465
15570 -35465 18135 -62626 -132861 -159941 -168889 -147920 -46284 7014 -69929 -147583 -104959 -34829
15558 -34829 -49972 -74624 -111193 -119617 -193799 -84745 9195 20326 -41703 -30225 73750
15547 73750 136630 119319 62398 -108769 -103846 -37416 19366 11103 -117911 -182244 -127209 -41968
15535 -41968 -2377 -64564 -163951 -112919 -35436 -62658 7298 123846 166105 113230 144268
15524 144268 144622 122871 138985 147685 120786 76679 75615 143816 82462 -32766 -143297 -183845
15512 -183845 -192526 -203302 -153795 -160645 -198725 -162943 3319 58070 -76256 -49226 5770
15501 5770 60391 69965 -6593 -32128 36823 127902 202532 272784 216468 63100 -31447 -46380
15489 -46380 -15202 -9186 -39412 -40078 22753 37522 18092 70180 18875 -58264 -48855 -17562
15477 -17562 19258 -94901 -175677 -226980 -192076 -175212 -130173 -131455 -79469 -21934 8218 105085
15465 105085 34920 -95173 -106051 -233809 -212883 -130866 -94465 -146148 -97333 -34610 -26872
15454 -26872 -2315 12886 -31274 -46513 -29533 -10267 -11229 3091 -15222 -49467 -132540 -175553
15442 -175553 -262448 -205715 -131708 -117705 -52616 1244 -6277 -86217 -101057 29849 57254
15431 57254 76990 101110 148811 148500 150395 136068 53455 77868 67568 11503 18595 49191
15419 49191 15662 -10967 -44044 -44113 -82598 -82035 -51738 -132315 -92796 255 27024 -4857 -49655
15406 -49655 -61935 -71181 -114187 41968 131846 57231 -68145 -55388 -71856 28348 47482
15395 47482 -30766 1230 -44006 19067 64871 17164 -5132 30455 105326 116052 65175 14453
15383 14453 181698 175909 95538 10187 -34359 53095 75890 -7749 -49507 -87533 -72043 -40595
15371 -40595 78164 113194 13503 -79004 -77144 -47786 -21498 -25956 -26552 -117214 -110475 -70052
15359 -70052 -56639 9683 47762 95688 72061 91827 -44092 -97479 -109517 -131971 -114839
15348 -114839 -81667 -63897 -22292 -77422 -40029 19035 17068 -3354 -36802 -63594 688 35360
15336 35360 -17486 -39918 -31360 -69130 -1847 -70291 -223187 -228652 -191165 -123697 -88584 -101132
15324 -101132 -107588 -156992 -218846 -148291 -32322 -50658 -79227 5153 45374 -14694 17766
15313 17766 -6102 -52760 -175290 -200957 -136929 -12926 24129 -1722 -33823 -47849 -97678
15302 -97678 -60877 -113630 -169741 -152812 -139262 -161234 -130990 -48016 -9654 62505 107114 174496
15290 174496 223560 133582 -31782 449 60205 94271 -22211 -92976 -95216 -136297 -132216
15279 -132216 -63375 -34613 -95969 -184333 -125852 -8325 18242 -31041 -7085 -10377 -63300
15268 -63300 -20609 67664 -12406 30450 84413 -95819 -137106 -52249 -78719 -47730 37892
15257 37892 51518 -33159 -21550 24220 -63513 -131088 -167880 -183200 -268733 -326878 -318406 -259175
15245 -259175 -171796 -35760 -37844 -62863 -46259 -47081 -76395 -138583 -141025 -139108 -55871 46469
15233 46469 72363 32931 -63531 -69906 2931 46102 87459 137220 37059 -27500 -45091 -75339
15221 -75339 -94998 -214607 -52600 -11911 -31516 -179260 -282645 -174170 -79538 -45999 -28223
15210 -28223 -11569 20506 75471 25221 -64134 -160114 -81307 -3145 -3438 -3016 -71817 -102113
15198 -102113 -75957 11988 42464 90406 116531 49542 -14238 -49882 61888 143269 24692
15187 24692 -28420 -57889 -54697 7971 62506 94913 129985 41051 -40196 -96149 -97909 -242402
15175 -242402 -186498 -72319 -89848 -45599 717 9129 42744 -28562 -81089 -116916 -114086 -146124
15163 -146124 -120265 -42177 -25550 52372 44911 18582 10597 -46565 -56655 -40491 76745 113585
15151 113585 95052 76183 123271 -18266 -158998 -143462 -96147 -96553 -26943 -128520 -161189
15140 -161189 -112290 -140317 -159944 -103424 -26857 -61302 -63353 36285 56180 10758 -20404 -8372
15128 -8372 -57011 -159398 -158383 -141643 -8308 85125 27676 -71753 -81942 74673 112387
15117 112387 72929 64637 48269 38695 25670 132880 146481 136524 56618 -23646 -17833 13653
15105 13653 151627 110387 -50558 -92788 23411 57709 124762 1625 30411 82012 70889
15094 70889 25229 71488 68681 198684 279712 172088 62084 -86655 -90027 -34574 -288
15083 -288 -3143 33647 24825 -64394 -71096 -23700 7417 493 39829 82852 30507 -245 -1649
15070 -1649 -37824 -67915 -53616 -3984 110774 154829 165350 131274 44031 71737 108008 133278
15058 133278 112025 67270 38830 26941 -33056 -80149 -5166 3648 3781 -4256 48503 28202
15046 28202 -82807 -33257 40434 98397 128683 124176 106142 7335 -81998 -109967 -10271 -39902
15034 -39902 -52802 -5846 -6170 2944 62791 -19934 -92861 -5531 -30094 -44406 -59821 -34114
15022 -34114 11116 -44291 -141160 10332 178560 97543 -28248 -49350 -30888 -14191 28391
15011 28391 27365 -47547 23366 50951 -38173 -64222 10144 199846 371777 406799 427008
15000 427008 291625 225788 61392 -110271 -71023 -119456 -50558 7579 16601 2642 -2561
14989 -2561 -64037 -34366 -54525 -43508 -22870 -18224 -42150 -81578 -98754 -99938 -194432 -198413
14977 -198413 -162105 -126075 -83385 -44805 -6038 -90522 -47527 75116 47048 -40163 -12623
14966 -12623 -45647 -110792 -86204 -97803 -155602 -118690 -8074 31057 -30982 -68177 -131879
14955 -131879 -118675 -48411 -50154 -77849 -64898 6255 40601 3421 -59734 -162536 -134351
14944 -134351 11864 50714 60513 42495 78479 89353 3633 -11579 -33606 20360 -41686
14933 -41686 -84311 -125263 -85009 25254 51566 94843 -15197 -61441 -60901 -73281 -40088 -74385
14921 -74385 -131156 -43980 54009 102535 190779 253971 214701 136747 7093 33225 98367
14910 98367 58934 11000 -116014 -67756 -64548 45744 91657 82114 39258 -52050 -36737 -47759
14898 -47759 -64940 -54581 -18175 65336 120853 22053 -107118 -129111 -156707 -113827 -72658
14887 -72658 -110062 -37119 9166 19061 -6480 15000 78151 128790 143757 182225 39443 79598
14875 79598 104715 62242 44201 112364 121076 70690 998 55791 33518 5977 -103915 -174608
14863 -174608 -168689 -72444 -35570 13636 -11190 -69207 -15305 112571 141401 22154 -25041
14852 -25041 -30778 -25918 -52146 -85116 -124582 -117428 -21452 132794 209701 255259 144839 68857
14840 68857 73512 96765 3508 -148771 -74184 -64766 -158983 -114330 -45585 -31814 -51385 -24083
14828 -24083 -19709 -44157 -70698 -104064 -71155 -6178 60513 39687 110925 95469 44282 -12033
14816 -12033 -38305 -40748 -99267 -67723 9319 14402 -86161 -89671 -11730 7553 -20778 58470
14804 58470 -7892 -23453 -120555 -107435 -43957 47534 -38112 -90338 -111405 -168209 -91061 32174
14792 32174 32089 -54739 26223 2461 17566 -46435 15400 36357 28304 -17746 -63492 -19814
14780 -19814 8435 -36987 -33039 47053 -49783 -55998 -107334 -98007 -28610 148873 208559 126783
14768 126783 152351 -18155 -106428 -55955 -64034 29033 77224 181032 244147 73531 27873
14757 27873 17748 10149 4285 91676 187434 139804 8062 -12819 23352 30848 -24782 -38789
14745 -38789 -3420 30602 14982 -8967 60251 46486 25583 141123 197581 149918 91332
14734 91332 104503 143980 126971 54712 43872 -31098 -156188 -192181 -186382 -62338 43546
14723 43546 19787 -6328 91561 77605 50586 28224 60619 85667 86985 -25787 -71043 4576
14711 4576 107657 90658 -3126 11517 -46438 25945 66214 110391 21276 43947 122181 142915
14699 142915 55670 6023 -43644 -87126 -91272 -116626 -110247 -63681 -1227 32162 -14176 -30054
14687 -30054 5343 33726 16670 7990 -83567 -36162 -37868 -41754 29409 70448 56202 68914
14675 68914 72764 41887 3903 2903 32300 68983 -82562 -145221 -153332 -53578 -37846 -117798
14663 -117798 -116520 -76979 -29801 61734 50800 10478 -145116 -134686 -154180 -44853 14817
14652 14817 -914 19560 -18621 -36923 -10533 -33011 -59687 -8003 32389 1562 -9570 -34273
14640 -34273 -84691 -181964 -163973 -149121 -64339 -13208 -42768 -67676 -120884 -68856 -21837 20685
14628 20685 -2175 54034 77034 -2759 30997 1288 13309 67766 4953 -60160 -124582 -143796
14616 -143796 -194697 -164467 -111366 -52166 -79024 -103975 -41642 63821 60002 8898 27954
14605 27954 24413 8905 -4443 -48687 -92747 -23640 -26702 18739 43591 98523 86508 77030
14593 77030 126123 90360 -71741 -171453 -52211 9223 -52425 -74273 -3422 2033 -58369
14582 -58369 -54381 5079 -48113 -121798 -114698 -70773 17301 65491 -12753 -87971 -123072 -195159
14570 -195159 -174145 -194790 -127252 -7343 14873 -44112 18727 -42294 -154026 -90769 53002
14559 53002 119959 131146 109282 14211 -26540 12931 -47975 -37215 57399 121740 122087 95245
14547 95245 93249 92926 -11432 -79205 35389 53521 104441 216952 159043 129072 89783 123694
14535 123694 155858 41155 -85488 -167049 -199462 -149393 -42374 -24202 -134684 -185781 -194286
14524 -194286 -129644 -110285 -162608 -143404 -14774 -5118 49966 98243 75598 21408 -64295
14513 -64295 -69920 -2862 -49817 -44556 -78019 -68016 18566 31577 23280 -98452 -81333 -26582
14501 -26582 34558 -35942 -112303 -6922 -32078 13724 52993 40076 28142 19982 -61190 -49514
14489 -49514 11270 -49182 -155589 -180957 -116599 -48389 -81509 -129611 -110839 -117318 -148895 -137892
14477 -137892 -221724 -184135 -110721 -74133 46983 42287 -18481 -13054 -62289 -54161 -69704 18988
14465 18988 57329 49347 52459 -43408 -85603 -99907 -24532 -31662 -79331 -58536 -79682 -83777
14453 -83777 -41538 27154 65774 32303 8361 -58915 -6164 -34363 -71393 -42787 3273 -54480
14441 -54480 -25808 -70749 -73613 -111519 -122410 -220278 -233463 -223621 -184487 -110111 -165510 -147531
14429 -147531 -106424 -119762 -85831 -76284 -152044 -178577 -159245 -168942 -88197 37837 105533 110053
14417 110053 83112 71375 7011 -81067 -106703 -46095 21286 -22043 1735 109201 75052
14406 75052 1793 11381 -12804 1794 77298 96898 43195 -8627 -26663 35879 19308 -81733
14394 -81733 -66835 -29052 65609 44849 168726 142303 156555 138604 145557 66877 52427 191375
14382 191375 51269 6060 -35060 -60116 -40254 -132885 -151757 -15785 23116 -34122 -76110
14371 -76110 -155926 -157095 -157690 -123974 -108520 1931 113037 92100 67445 54083 25193 -17771
14359 -17771 61876 49136 138876 250055 257982 171614 52819 9483 -62756 -7233 -25150
14348 -25150 -60306 -54882 32387 67939 -17968 -110834 -78020 -77881 93329 112008 105990 81422
14336 81422 -82238 3069 59326 -7707 14192 -27545 -162941 -260685 -219785 -188198 -179646
14325 -179646 -119001 -78214 -116523 -24181 -13698 -51124 -118617 -57685 -110474 -184450 -179389 -174895
14313 -174895 -124045 -95449 -23874 -18377 -86235 45076 104513 12055 -1701 -22998 -45492
14302 -45492 -99447 893 23648 -12923 25794 33463 75307 28892 -33351 21323 123431
14291 123431 92465 -47761 -64336 -145444 -184793 -183398 -180367 -129072 -127141 -85968 2351 91259
14279 91259 98040 47114 -113592 -188407 -85241 -12938 -3344 38106 56548 110099 130153 64301
14267 64301 39840 -37522 -81191 60698 65973 55663 55286 73428 59046 8855 15219 67623
14255 67623 30005 36234 36244 -16127 24734 52916 -8852 -47075 -43678 -2839 -13845 -26116 -53671
14242 -53671 -107935 -172006 -174436 -156908 -99633 -29098 -8977 114140 158414 60757 -20011 -13349
14230 -13349 17103 -80645 -33988 31534 60671 328 -38447 18970 8213 -109264 -131026
14219 -131026 -155578 -119136 -15076 -5406 36061 91663 104046 63708 -13460 44295 101589
14208 101589 63333 -1204 -102394 -79510 27811 25793 46603 14711 -26226 -42688 -15833
14197 -15833 -114308 -184865 -121417 -129695 -87470 -72457 -59486 -23305 -63454 -29257 101940 103761
14185 103761 -38672 -145150 -172942 -76293 -102100 -88928 -40150 -47001 -23275 51945 43155
14174 43155 438 34651 31581 -55376 -42043 -33889 -62886 -86013 -37796 -75494 -47507 -20552
14162 -20552 3977 -37341 -101096 -43716 -77176 -125310 -173781 -131698 -168763 -214345 -184124 -113632
14150 -113632 -154736 -126752 -89304 -61246 -141736 -108587 -53101 -50616 -37834 -93724 -83780 -61427
14138 -61427 -138734 -173475 -61726 -38055 -33039 -152805 -188818 -84584 -19165 -49359 -75543
14127 -75543 -125920 -112810 -17034 53392 36533 77854 83510 -5111 -60179 -60826 -110453 -51349
14115 -51349 -61628 -24344 -86063 -51188 -15389 61936 78831 52514 87451 209067 229798
14104 229798 117938 119539 42310 16716 -72439 -81310 -44392 -61206 -20677 -41214 -101309 -95843
14092 -95843 -101030 -38590 -6259 -53103 -58993 27633 95969 70535 93177 122752 66805 -68223
14080 -68223 -78677 -39944 -99759 -119946 -10822 66397 94509 208566 281221 219423 108393
14069 108393 127248 99858 77675 -59252 -140098 -113766 -48715 -91064 -83185 -110348 -135619
14058 -135619 -70936 -58049 15861 126500 260993 220328 63957 -43146 -46796 -18040 -41223
14047 -41223 -90447 -26580 -41594 -108596 -146558 -69423 -53202 -26971 -16467 -61504 -70633 -49394
14035 -49394 32381 41376 27797 -17614 -38322 -88740 -149496 -184384 -79145 -1504 -47869 -192745
14023 -192745 -135362 -34399 -88338 -84176 16471 6275 -34597 -66297 -97534 -17230 13701
14012 13701 -44096 -207897 -194184 -157188 -108025 -131858 -161605 -164902 -91541 -89366 -194694 -137440
14000 -137440 -114994 -141721 -108888 -24273 23894 72600 32906 -30812 -16386 33498 -47828
13989 -47828 -85902 -16923 -21799 -60614 -18741 71872 83160 3364 -70797 4398 -38272 -53950
13977 -53950 27849 177303 215938 178554 114353 31611 1451 6167 61317 95650 144052 53104
13965 53104 95921 22846 28516 29615 73374 171595 167811 112405 90353 35138 44547 56286
13953 56286 78882 38184 65535 64222 7714 -5938 -4339 -42276 -134087 -87973 -77787 -31242
13941 -31242 -24825 -21844 -60180 -27005 -12409 7331 -42170 -94496 -133649 -105455 9597 11074
13929 11074 -7433 11912 19330 -40495 -33156 -30728 7097 -64803 -106370 32510 120882 101451
13917 101451 17947 -36999 -58098 -91063 -63285 -91635 -85372 -70718 -133122 -165699 -215369 -173240
13905 -173240 35021 130742 137322 120506 145153 93854 -28969 -132805 -120293 -91094 -57352
13894 -57352 -8178 -26326 -74399 -88505 -67717 -79250 -116628 -73426 -135344 -231343 -173078 -117876
13882 -117876 -53310 -17343 -57730 -86620 -122906 -142649 -84835 -68853 -65919 17782 -45237 -157167
13870 -157167 -160849 -77372 -57490 -48709 -100441 -118647 -106732 -182013 -119324 36926 169359
13859 169359 87752 -100927 -218323 -116438 37971 33265 24953 93599 95951 118926 53242
13848 53242 88578 108082 108998 126796 122521 67833 1491 42698 169701 232414 165425 271773
13836 271773 368162 400042 346715 243866 321263 324379 253234 195379 131179 66318 88667
13825 88667 102060 188320 286102 297607 284911 315367 220018 101985 110085 25115 -45867 -39351
13813 -39351 84795 233948 348730 319946 310407 195221 151092 181794 186653 247000 349796
13802 349796 566061 615621 513732 453132 460083 398206 324557 178526 156275 188298 287797
13791 287797 330925 258204 179735 76392 50573 31900 94948 110959 102334 25317 -14612
13780 -14612 -30707 113058 206787 280288 408674 474372 497475 442201 349191 186720 51624
13769 51624 60526 104418 55537 99322 89750 45401 -27150 -76002 -18889 -4680 19702 -39633
13757 -39633 8713 41389 -11968 -163 -27853 2430 94246 40125 -31333 -68472 -72801 -19018
13745 -19018 76870 15818 62650 70963 82533 25003 -49718 -65580 -26503 -1261 22352 41032
13733 41032 74961 103694 41906 -67460 -6428 64701 158212 145801 165460 153243 90639
13722 90639 18398 51037 14206 -91234 -190774 -104167 -19234 -26128 96867 182121 158341
13711 158341 30578 879 107504 76755 42364 31020 49805 75027 105939 38622 1967
13700 1967 48071 36400 8841 23408 -21951 -14754 57867 84418 18023 30872 3085 -23175
13688 -23175 -15510 25887 -35651 -132184 -170712 -100471 -72845 28313 87024 90215 116633 154810
13676 154810 164343 66130 -41358 -69419 -9033 53419 -44512 37336 35319 22578 7992 42123
13664 42123 112915 80902 38408 23808 -93114 -189325 -209708 -222186 -78352 -16041 -9194
13653 -9194 -16767 -9672 -25079 -33035 -26754 -30210 -20454 -15163 67177 -34888 -71622 -80029 -77228
13640 -77228 13209 139137 152216 207456 126642 21601 186734 274167 186433 196946 188003
13629 188003 186646 243799 260205 136315 -25178 8847 -37179 -161199 -110593 48438 165903
13618 165903 214257 185626 62476 -5904 -64982 -95415 -132065 -124406 -92715 -67016 -150970
13607 -150970 -145649 -80607 -14996 53776 138272 65930 -20593 22575 -21898 7932 4648 -72453
13595 -72453 -34977 68910 177677 108064 21907 49505 22361 -15332 57020 79268 54338
13584 54338 -1517 -53803 -71280 82590 196191 199235 107651 131621 86942 36118 -31795
13573 -31795 -112266 -152366 -153761 -213489 -160774 -98432 -45044 -89851 -123539 -110962 -86885 -48063
13561 -48063 -40898 -71204 16143 63799 -17400 -30018 -25596 -42351 -31211 53465 148829 125228
13549 125228 63293 67621 23445 55960 81135 18541 -51307 -74136 -12955 -56900 -27835 94700
13537 94700 92641 111527 51735 -27136 33898 22289 29971 -67334 -113138 -84451 -39108 -96597
13525 -96597 -101497 -148441 -44718 8631 37400 -4276 -90829 -100255 -97210 -80713 36142 14302
13513 14302 11450 61038 -5081 -47440 6994 -7680 16938 6539 82832 114019 43460 -76067
13501 -76067 29184 209752 221073 179436 218516 262439 154489 187014 214231 170020 144689
13490 144689 258086 380826 343239 224696 172917 76629 -18218 -20150 38754 135841 117327
13479 117327 34688 65200 170594 222796 245354 279109 340598 293150 269223 288686 247118
13468 247118 196247 176775 126165 238763 163663 264915 276725 278608 240461 241400 209067 134823
13456 134823 125230 227946 240155 176891 173156 226047 241013 226914 224614 278726 203306 86861
13444 86861 93368 15625 -15054 23514 186771 349555 374205 274564 298727 380337 411513
13433 411513 331583 253425 211336 238768 349773 312507 326000 326014 320793 299965 297096 297741 364874
13420 364874 493611 481012 370088 356180 370367 407199 538956 614671 600397 608917 537116
13409 537116 500708 476676 489552 545602 548890 591855 620454 720134 977207 1124098 1216555
13398 1216555 1276753 1295343 1421781 1570109 1629244 1742409 1810862 1761743 1792022 1870108 1791653
13387 1791653 1891586 2122064 2383338 2529826 2707488 3000171 3410582 3897086 4269058 4796417
13377 4796417 5512194 6365001 7465540 8977917 10872053 13542856 17495211 22999334
13369 22999334 30639193 40900342 53093615 64431448 70459224 68231193 58800720 46773138
13361 46773138 36093355 27958808 22505563 19105009 16985365 15851697 15580248 16340628
13353 16340628 17910084 20097160 22108029 22853563 22281526 21208793 20798248 21931118
13345 21931118 25067402 30549339 38856564 49567484 60678302 69471678 75728248 81046359
13337 81046359 85883170 87662217 83998289 75885608 67413886 62122999 59848026 57085299
13329 57085299 50960839 42064574 33238020 26780939 22813375 20926552 20731090 21631238
13321 21631238 23011496 23724323 22861143 20812417 18861034 17822005 17995184 19221272
13313 19221272 21617478 25715269 32027954 41083555 52889125 65889966 76160447 78642015
13305 78642015 71527414 58215171 44083735 32649155 24525784 18897810 15035710 12175053
13297 12175053 10083135 8622591 7508708 6600598 5857166 5352086 4952441 4536646 4016838
13288 4016838 3568548 3133561 2819973 2617657 2371826 2200328 2098630 2034728 1988601 1980786
13278 1980786 1811000 1636441 1590743 1524555 1461692 1385565 1315111 1158145 1080073 1119466 1096841
13267 1096841 1047641 1043755 1063614 1096680 985688 778932 731747 792294 785622 855579 899386
13256 899386 856148 813676 768099 744637 710897 620456 628170 534573 480619 536269 521695 560459
13244 560459 523118 481036 513925 516588 487570 544766 533783 491747 553398 589790 537546 481300
13232 481300 400742 392195 434323 435261 348295 262513 304565 330118 333681 371703 248363 142098
13220 142098 52592 62374 115231 162719 302009 454017 393177 283649 278219 241849 251181
13209 251181 364171 384679 402935 406725 408285 409325 304543 281088 244549 146394 190879 232255
13197 232255 264652 184789 180508 290279 293798 310130 344453 279779 312466 333124 345698 401165
13185 401165 476372 468155 430848 294580 207850 224062 123525 61101 93722 109556 76298
13174 76298 91846 95734 98844 40963 -5828 41415 136738 163487 191091 147680 150193 225990
13162 225990 199611 121097 157612 166760 207703 194279 209763 235241 202697 208249 177591 30874
13150 30874 3185 127850 242380 308719 279571 221270 141220 84077 124632 153491 79568
13139 79568 63844 63643 17849 1395 29016 -21291 -9752 12402 76795 187885 74030 18122
13127 18122 21680 121788 260754 315002 242520 110035 111495 173662 265154 275100 239206 275509
13115 275509 194196 95548 142551 173548 127491 86784 -3224 40788 34097 83036 136161 239676
13103 239676 234287 294030 273065 249793 232827 83930 14585 -6722 29768 73721 47365
13092 47365 28710 56546 85444 95973 126959 104246 73492 12751 26009 90182 97406 122203
13080 122203 117712 95257 66655 110907 139973 103833 83483 78268 97571 21816 -64267 -113682
13068 -113682 -5193 59485 206529 190718 6644 -74292 -17678 -59015 -39534 49276 8876
13057 8876 -25199 -65430 -90696 58536 120993 161868 152218 178797 112928 30331 -1883 107563
13045 107563 186234 166777 131838 116736 44489 84621 113645 29205 -234 -95544 -139921
13034 -139921 -114507 -150393 -66779 45603 21600 90830 137960 37575 -76291 63203 151990
13023 151990 128697 135982 75219 131207 202992 165140 40781 -41533 -23362 15820 114027
13012 114027 193397 155452 132789 227406 205936 207559 228264 137015 -1741 7141 81937 113897
13000 113897 81388 -13604 -190269 -67776 -12331 58727 164250 206941 135407 82644 42989
12989 42989 -9432 4194 81863 -6696 -71139 -122512 -38668 -7802 -80782 -80364 -7736 -44371
12977 -44371 46319 120373 106497 57469 53050 55075 -143 -3100 150835 193276 123627 -11612
12965 -11612 77752 91766 -142421 -221674 -133317 -59486 -39857 -47064 -80678 -98057 23850
12954 23850 -42127 7095 86337 132985 -334 -75903 -18845 -40853 -9755 -88806 -125023
12943 -125023 -128766 -70954 25515 84194 44337 55983 142485 131148 40052 13837 43607 31318
12931 31318 9444 -46955 -53011 -24580 -39319 -26146 -11107 33719 156667 -1637 -32558
12920 -32558 -52650 -90917 -49913 -18096 -12439 26106 51330 17751 7932 22510 7227 -42083
12908 -42083 -156553 -196546 -119397 -32378 136228 103022 11226 24751 23038 74727 55135
12897 55135 97897 71659 86668 228628 364812 307494 163435 151594 161930 184646 263239
12886 263239 259805 201161 187503 162963 121167 127966 255775 151240 103507 127187 144994
12875 144994 183066 142871 103055 51765 88959 84362 112703 196696 285310 466601 548201
12864 548201 474905 465370 428180 448071 442345 390972 301850 337059 448632 344739 232201
12853 232201 160319 112304 170597 221619 204238 228451 306410 332600 250453 164683 137219
12842 137219 45840 47988 122805 112971 80751 73690 211991 369034 460044 357201 382698
12831 382698 386135 428655 381152 320326 201769 157972 144491 109357 67429 58352 128795 15895
12819 15895 -2657 3807 6806 65561 103097 77090 137351 51541 29339 129090 186143 188715
12807 188715 171800 157420 156427 156703 101604 154347 176235 188770 140015 43613 45492 81467
12795 81467 12579 43206 124944 193629 204904 123292 124492 125668 92142 32254 -8294 -28041
12783 -28041 -21275 39676 126163 111742 178617 151693 90320 167397 225273 203167 226793 266113
12771 266113 346193 417721 386873 355498 329355 325850 349196 277301 218343 167200 102454 17395
12759 17395 46066 121850 100403 97802 206258 217346 134730 157345 157383 164957 248782 247961 292973
12746 292973 376551 337794 370048 427229 357568 258252 300606 234059 247190 292506 440996
12735 440996 475938 417279 357520 270278 177838 144826 144543 159983 104735 127965 183175 309580
12723 309580 304952 129787 -32821 6641 17579 8539 135658 198352 195832 353020 259011
12712 259011 195647 233611 338780 397597 339524 257917 207636 185591 193453 74620 -106061
12701 -106061 -299014 -133518 10480 -20937 -51591 -121706 -111518 -77814 -100169 -67817 -1593
12690 -1593 62849 153549 182055 71573 32475 35858 92738 109050 57778 107488 46195 26826
12678 26826 124745 199123 179205 78924 -62869 -126281 -92916 -73788 -99787 7181 79387
12667 79387 160294 44821 -53434 -18565 -17335 27114 144008 210771 100651 10068 -86795
12656 -86795 -98067 -91682 -114729 -80362 3465 54321 151072 165948 65772 52476 -91243
12645 -91243 -127104 -98632 -69485 -35853 42639 48632 60675 111384 101634 -14508 783 112414
12633 112414 99992 52881 51396 36160 -56101 -10661 3105 46176 71144 -47644 -1367
12622 -1367 113572 -21790 -154823 -79701 39743 108267 88754 -266 -44084 -53606 -103326
12611 -103326 -147064 -177522 -177379 -68920 46001 -54058 -140363 -114591 -71653 -53246 57128
12600 57128 149213 48732 -29904 -69421 -95211 -98900 33598 32023 -36190 -45450 -59315 -105503
12588 -105503 -58756 -31502 34319 53739 47815 161040 89648 31468 48451 18152 24846 51029
12576 51029 30097 -43837 -13175 -3315 -34141 25037 -28252 -64922 -36218 -29438 24402 -21276
12564 -21276 -24760 -24638 -66451 -31250 42962 140437 278692 210639 124644 57502 75566 83387
12552 83387 141766 132012 90985 118281 218955 207389 189959 130519 111135 62239 79816 55549
12540 55549 104197 70805 -47255 -32249 17232 -6418 19731 58728 -18394 -71948 -59509
12529 -59509 -77014 -23826 80217 114768 133901 42278 -30618 -182089 -143142 14944 8479
12518 8479 -111911 -100409 -31718 -45028 -79827 -83401 -111565 -69586 50523 29704 56777 166326
12506 166326 223136 246421 179679 85029 87495 200972 316734 173735 168436 200932 246988
12495 246988 252373 276028 292366 277653 359319 356311 312185 271600 134352 111628 165532 289031
12483 289031 403042 309894 269569 268264 287415 257777 241385 208433 230886 324716 346658
12472 346658 450942 548393 576268 575727 573127 556943 586279 523451 509248 569221 620827 704865
12460 704865 802043 796016 705049 602179 528812 503303 456040 431953 447633 523940 431752
12449 431752 347107 327883 354932 387561 486414 462931 356472 286946 297880 344373 359945
12438 359945 369738 412042 406496 401162 474816 510191 639670 694293 623462 523044 479913 415257
12426 415257 389159 313296 276521 269029 296740 224837 170371 87284 5476 89368 85539 110749
12414 110749 93878 97347 142425 199839 262067 307547 275714 157705 84494 129112 45746
12403 45746 167073 328650 288527 315733 282188 278791 169656 135533 290576 267340 305050
12392 305050 388758 375692 341231 342043 319547 243036 244526 363576 282286 268893 385765 450964
12380 450964 351157 448040 533589 534133 403216 436859 566627 552977 440602 367217 438038
12369 438038 623186 666847 641163 654558 634548 632170 657174 779016 874498 1021888 1128993
12358 1128993 1114670 1090423 1148436 1343721 1522078 1579911 1593783 1775140 1936712 2019922
12348 2019922 2307898 2710680 3072590 3433066 3917811 4479703 5240050 6290402 7588352
12339 7588352 9245445 11271092 13884193 17501195 22664888 30131642 40053254 52122782
12331 52122782 64153854 72336176 73602476 67620447 56752151 45081347 35119573 27892001
12323 27892001 23062226 19957489 18266491 17719847 18106310 19277798 21003830 22481536
12315 22481536 22764939 22101807 21189755 21085177 22568477 25852445 31250339 38317816 46061183
12306 46061183 52790747 57634459 61364855 66031360 72620953 79799877 84707931 85204081
12298 85204081 81616081 75789183 69086420 61568283 52775885 43375674 35005449 28683318
12290 28683318 24595042 22476853 21936773 22250731 22574515 22142741 20498416 18563674 16902141
12281 16902141 16105198 16172212 17191411 19183125 22489352 27282751 34113153 43146884
12273 43146884 53328941 62072152 66359957 64273788 56265230 45276612 34673745 26154037
12265 26154037 20009081 15799238 12681081 10497028 8887726 7625326 6569611 5748645
12257 5748645 5167441 4556802 4031991 3704663 3476168 3191395 2941311 2868601 2602368 2359844
12247 2359844 2262743 2089695 1905300 1639141 1503141 1370820 1314501 1354365 1379827 1377814
12237 1377814 1340336 1464457 1561616 1581223 1546313 1498592 1511265 1514075 1466911 1489935 1531256
12226 1531256 1780246 2165098 2642149 3168537 3445531 3389187 3019712 2324413 1710357 1401274
12216 1401274 1253522 1136773 908329 762951 701627 649316 652389 668245 722357 723757 734448
12205 734448 712992 604381 605685 638947 714474 680911 592981 557014 612186 605115 525386 503701
12193 503701 593993 641670 546396 391491 310362 344171 268210 261321 346689 491842 460381
12182 460381 492930 499840 474315 386605 463411 447717 304384 280473 312819 309530 309003 289254
12170 289254 203382 194949 213665 214259 253878 275789 184205 174178 187316 93041 73247 -42291
12158 -42291 -9189 153168 210077 154658 170787 175262 204243 268531 341375 358843 254751
12147 254751 117248 159861 149944 140500 242914 248703 180513 168993 247674 317262 308623 181838
12135 181838 150363 195241 217403 206862 132526 141224 50214 26196 -107198 -63695 50504
12124 50504 159314 314527 192650 86705 68418 128609 114738 90365 99770 131358 115744
12113 115744 159281 154323 197622 133084 87288 115620 127612 208469 117691 192499 231615 186906
12101 186906 216822 320496 307603 252877 230882 178127 210405 274243 317558 254427 160041
12090 160041 156271 250345 277130 323061 392832 325873 198577 166900 246846 205800 133526
12079 133526 172506 88990 70565 112254 200430 235960 169559 174491 222928 160672 3337
12068 3337 -36728 -14650 70344 97121 92105 57097 30629 49646 14574 104168 213307 188921
12056 188921 161077 131139 165175 187928 167260 263771 327449 339660 305902 189871 127293
12045 127293 184741 246549 232127 182282 315386 306366 214462 238964 263629 153337 105210
12034 105210 116741 148724 183088 173159 94126 58607 79719 89147 69379 28580 65449 86162
12022 86162 37231 21487 53867 157813 236407 175414 92725 98585 170954 284973 322534
12011 322534 265844 208072 176789 239351 258908 254583 256187 174766 138694 144631 151384 98771
11999 98771 80552 79251 78010 95585 151275 190474 171051 256137 269732 252281 232290 181150
11987 181150 159421 116194 97786 63332 21770 72888 27245 45695 129505 162085 182830
11976 182830 190337 177824 143542 209985 100737 116516 105324 50004 89882 120720 76676
11965 76676 130942 187315 143781 134298 45677 -107608 -38721 -15571 83390 97171 72977 45481
11953 45481 60331 66086 -13373 -66246 -73161 -73315 -16059 45746 -5082 -73764 -10252 54581
11941 54581 35807 30490 109207 97324 52572 88503 103414 119284 106281 161121 126447 114407
11929 114407 92886 22772 9659 128622 280111 373493 440141 500047 517140 554243 593557
11918 593557 519869 616200 646858 596334 449214 303646 114144 40138 21217 -8279 -105597
11907 -105597 -91631 -18889 81020 125607 132910 153735 118838 135340 182093 157873 185892 218348
11895 218348 247401 271490 162580 203098 223260 197327 181067 263463 379253 471572 505518
11884 505518 554293 561691 461396 468787 436770 330313 320476 350998 298340 344024 424148 386301
11872 386301 340120 385511 437457 521360 487369 406000 469516 480346 476151 504346 622328
11861 622328 758481 734211 730336 729823 741544 809089 964583 990161 965242 1028178 1014007 976709
11849 976709 986780 1013747 1061959 975537 933643 926349 979381 1095022 1045631 1014484 958198
11838 958198 851742 845069 931871 1024154 1146606 1198996 1273522 1366956 1436901 1483832 1554147
11827 1554147 1700055 1811711 1925062 1906125 1985430 2106492 2263700 2408459 2611527 2795027
11817 2795027 2930685 3093616 3271620 3532085 3738212 4073279 4542050 4959104 5474319
11808 5474319 6023460 6625653 7377010 8128742 9163407 10589463 12473037 15006602 18328086
11799 18328086 22496075 27406826 33209126 40394284 50127970 64394163 86783373 122982601
11791 122982601 181345288 270051356 386343171 498667565 550210845 507942640 396457476
11784 396457476 274364391 181855868 123372498 88325948 66953931 53519892 44469750
11777 44469750 37769321 32199606 27550216 23529228 20235587 17625671 15355863 13424273
11769 13424273 11865123 10655810 9561233 8654432 7984901 7413510 6812389 6346598 6004915
11760 6004915 5522472 4999826 4653701 4423467 4277508 4154289 4016811 3829607 3616561
11751 3616561 3475275 3348693 3156345 3086664 2939740 2792808 2693864 2508625 2346978 2162578
11741 2162578 2032155 1912562 1944873 1928445 1852639 1702708 1534141 1496014 1545998 1478406
11731 1478406 1472984 1424262 1412329 1437132 1399095 1416596 1518953 1565233 1651855 1758428 1759096
11720 1759096 1695780 1621265 1490137 1285272 1181394 1098488 1070160 1017654 1145750 1207551
11710 1207551 1198405 1118724 1124741 1079552 962770 932178 925743 962328 876923 791843 871439 939290
11698 939290 984605 984637 995216 943363 813631 708581 671427 721171 663414 642638 645022 755600
11686 755600 767184 690472 778209 751094 675699 741522 759135 742316 745295 679338 690047 741257
11674 741257 843548 771479 655297 733547 733141 659840 636252 708991 719597 727378 776708 839707
11662 839707 708857 465618 430135 476727 466607 335986 318871 282396 271729 252680 208857
11651 208857 278299 419649 455046 475380 505487 538789 498847 502597 474999 411910 379012
11640 379012 357880 396255 418277 366453 328400 356061 414981 444579 394701 254219 245988
11629 245988 353453 367904 412572 473518 339383 365947 440928 496051 547482 564245 515299
11618 515299 528382 458485 366805 426519 413498 415608 388720 366552 354464 428908 409165 406604
11606 406604 396865 479293 581720 465929 444246 419502 379468 337155 414211 384512 336782
11595 336782 433731 439046 445344 510282 513246 471446 418750 379414 426647 361993 293472 309012
11583 309012 350497 333820 344447 245975 192845 143709 249983 267649 258786 211070 162620
11572 162620 159110 138895 139557 159985 123295 184080 270961 253336 139185 64526 173678 241729
11560 241729 230206 270933 294980 156358 145222 221361 212849 257314 325463 303665 208026
11549 208026 52855 -3274 -25057 -63949 -7576 174738 239593 221596 166248 142809 152282
11538 152282 148135 219969 297482 368007 365143 351466 303757 240796 90309 36430 104703 150714
11526 150714 168084 295531 379714 364544 349356 376790 325311 296286 164101 167076 128360
11515 128360 69375 36183 -7907 -88640 -9233 14939 72874 140293 231447 305103 166409
11504 166409 93877 171694 112491 -62 70710 181470 126794 119979 148614 167934 109072
11493 109072 113436 116687 -59582 -31671 67370 54235 -10025 -62768 -9811 -39579 -51550 11788
11481 11788 114235 125854 156233 73060 -18704 44611 31322 39370 99616 88798 -39793
11470 -39793 39823 42949 42740 30788 72664 46780 617 2128 -13535 -51778 -1625 21363
11458 21363 -18655 7851 64168 135656 106320 165916 110659 27249 14218 -40534 -28257 8712
11446 8712 88961 150923 178853 205978 232124 138960 162271 222610 202444 285874 275532 174090
11434 174090 71006 79054 73975 87310 161535 133151 157077 169534 227029 175832 -15803
11423 -15803 -52881 -126960 -77887 18051 49393 37950 46772 22154 -68448 -117548 -136322 -137825
11411 -137825 -135603 -132076 -65072 -11244 2198 78414 89063 75961 42916 23712 61371 88073
11399 88073 76397 34398 93378 115893 62090 157028 149448 117202 153968 152040 185585 152234
11387 152234 138518 158533 107679 107476 61705 20231 40040 -45036 -99453 -86852 88854 161553
11375 161553 77536 2323 92877 101405 84878 83312 138199 161164 149791 121536 217225 281398
11363 281398 295763 146788 120456 97883 27737 3691 26953 12548 2475 91519 171225
11352 171225 306705 587193 895491 1146272 1555904 2147771 2569482 2642563 2493857 1993046
11342 1993046 1380923 940913 708247 580822 383449 428309 484855 501107 426082 343595
11332 343595 224107 188305 194582 93124 142620 252442 305446 154391 85361 104848 124525
11321 124525 20863 -72817 -120257 -33327 58392 143205 160865 148397 207092 244400 291563
11310 291563 205291 54368 -47437 -33129 -7483 43255 105380 48234 -12999 -51665 -21313
11299 -21313 87871 166931 137492 89221 71681 50271 20094 43577 53990 82916 162941
11288 162941 96357 3795 69009 108280 -33344 -34498 99558 127474 54950 28604 80158
11277 80158 38037 49610 60667 96137 143708 77253 61521 24150 26629 -57259 -52765 1697
11265 1697 4515 67426 139283 166512 142587 89359 43114 85935 96417 127594 74135 136410
11253 136410 203361 136310 139340 180638 84304 -28062 40810 120006 176838 88665 71946
11242 71946 63129 -7349 -79018 -91892 -88237 -99853 -181171 -62390 -8031 17813 66808 14280
11230 14280 -26773 -97163 -100293 -112592 -118029 -71294 -22591 -5450 11176 -30371 -26464 -21385
11218 -21385 -46208 -36822 -10419 40657 67673 143812 139067 60077 98817 57228 68633 25084
11206 25084 -24137 44116 99855 117725 127875 109225 100863 -18887 -42504 19600 116744 135471
11194 135471 106009 102370 108771 214281 235301 160446 102562 47893 -84075 -13617 12025
11183 12025 -77465 -110087 -92607 -42817 -68320 -86782 -25436 116157 188852 64264 -77129
11172 -77129 -60536 7090 -55238 -64591 -34079 -71821 -112218 -111587 -27000 -125164 -123352 -86178
11160 -86178 -99309 -2555 22350 64367 52763 71887 127557 202148 85831 30381 102662
11149 102662 106175 115432 72812 39439 -5600 -99548 -24544 -30291 -12357 56964 2979 -58385
11137 -58385 -22654 -23881 7471 100028 115859 48644 -27146 -82412 -108541 9336 22597 -21600
11125 -21600 -37274 -6081 54394 80267 -8724 46853 -466 -82909 -112502 -70044 53458
11114 53458 115714 73960 -48201 -88216 -67709 17619 176259 230393 219666 200350 90136
11103 90136 -2442 22083 152393 143642 196296 207556 192778 208559 184484 99730 112346 89315
11091 89315 98353 49434 176240 147149 67464 92082 17562 6851 -47002 27527 93378 123646
11079 123646 131801 32980 -91446 -13627 76380 100469 89339 35878 46097 8859 60038
11068 60038 27223 7589 -9225 59195 93628 126785 111127 161907 231225 184625 102829 93275
11056 93275 115902 28952 -41561 72512 117779 74364 48732 43561 70380 33608 -9847 56060
11044 56060 62152 66241 19070 51066 -5659 -11303 50674 114281 204373 159520 11296 25603
11032 25603 106401 56524 27299 75223 105899 167465 147852 100143 -43082 -5451 51371
11021 51371 78600 -3346 -42253 -56670 -71 83410 110626 160575 45920 10016 27311
11010 27311 69432 119227 151208 122863 112580 139823 148485 40095 -92321 -135789 -85512
10999 -85512 -28256 -27565 -18632 19785 -46590 17278 126002 42993 -91669 -49903 88127 153219
10987 153219 139274 182883 156755 240425 151696 24539 814 33110 64002 25593 -34551
10976 -34551 -55666 -48663 -44800 -38327 -21245 85103 171575 48603 7068 24177 -41420 -70750
10964 -70750 -91550 -70253 -55760 -76744 -27350 -5864 26765 14444 48669 72487 78043 65178
10952 65178 118933 174860 55606 57482 136219 178119 33561 -9907 -88649 3641 176407
10941 176407 140208 11071 58207 126778 29263 -77290 -129127 -110012 -147411 -165811 -86301
10930 -86301 -65055 -115090 -99882 -34777 -110609 -57804 -20218 -82666 -23208 6498 9235 -88098
10918 -88098 -120513 -155884 -34898 -55553 -22320 -53069 -14266 4545 92155 74840 44270
10907 44270 66178 7564 -24603 -37933 68680 27219 8789 63790 84988 113329 88264
10896 88264 33366 -79768 -173768 -158024 -58808 21717 112027 49903 -34632 -90059 -75609
10885 -75609 -37104 -103073 -81352 20172 1639 -49689 -98831 -80034 -133470 -108206 -72818
10874 -72818 -48434 4593 57774 -21157 -19358 -68194 -49828 -13555 -76976 7158 15962 -22028
10862 -22028 -22197 -13160 -65397 -169690 -76806 -55482 -160085 -101417 -10453 -63237 -191113 -157793
10850 -157793 -60609 31567 142547 126846 26091 -14794 -15702 -4901 -32314 -57924 -108914
10839 -108914 -51461 17047 106523 81973 54781 93773 53113 35325 73445 -35986 -92916
10828 -92916 -22490 -57716 -31966 32118 69264 126772 80979 -536 -69708 -158261 -58981 -16375
10816 -16375 -58174 77926 137307 50346 18152 -47982 -42189 -3830 -31071 -111523 -172596 -179659
10804 -179659 -148190 -155372 -135166 -194624 -169739 -260188 -320705 -188977 -78608 -66555 -17219
10793 -17219 26008 60420 21860 -30883 -51594 -61915 -36196 -102072 -123534 -45374 -14936 -78712
10781 -78712 -28023 -81128 -66541 -120023 -189187 -121687 -86641 -5089 -22748 -40135 -58509 86408
10769 86408 239430 203735 55351 -72750 22940 1406 44939 -16666 -190593 -211088 -185967
10758 -185967 -169998 -91358 -95445 -155528 -200802 -172556 -106151 -74550 -81112 -127251 -102584 12768
10746 12768 19179 -8368 117555 135421 58172 -13565 -84928 -38039 28341 -14920 -100595 -68749
10734 -68749 7162 -46995 -146253 -143644 -54934 22779 32636 32536 -35368 -62868 21518 53170
10722 53170 41027 84208 63658 94199 114935 109148 79524 96357 76333 160758 91681 -3560
10710 -3560 -59983 -10698 95736 95237 90053 94805 81510 44661 -25318 -30515 -49075 -10502 -48288
10697 -48288 -50317 -47344 52966 61087 41507 95742 34836 8787 42663 -6628 70981 75794
10685 75794 51568 50514 36625 -15644 -108507 -56725 34135 75411 -23938 -73290 -4740 142234
10673 142234 191861 7011 -87237 21042 77980 -44684 -158382 -94333 48829 53387 69205
10662 69205 50949 39574 284 -12970 33687 2417 4997 72365 72502 50962 27526 -39340
10650 -39340 -15855 12548 -63130 -203566 -192525 -105737 -81181 -149298 -209600 -98649 -90427
10639 -90427 -213055 -315412 -199443 -95054 -43456 1684 9698 -30803 -44199 -79386 -149411
10628 -149411 -148335 -125006 -118269 -79578 23970 82862 32447 -86396 -70684 -79485 -83549 -18513
10616 -18513 -10262 -3512 -16755 -40801 -144828 -221617 -216387 -186636 -180000 -161888 797 106174
10604 106174 158331 165224 101359 -48690 -226728 -280175 -167812 -22263 38773 -18659 -75851
10593 -75851 -65585 40666 185002 132843 52796 83383 83983 29117 2369 24704 83385 152268
10581 152268 14649 -118760 -45067 -135946 -263134 -256878 -180196 -122848 -91921 53424 133344
10570 133344 171687 204317 165928 47742 5926 28277 51556 8280 51603 91536 85978
10559 85978 145090 32312 -4088 52899 8485 -19681 12300 79808 160018 74294 92444
10548 92444 -2163 10072 -45256 36403 207027 208729 232851 232774 212326 136362 85943 175929
10536 175929 228030 197895 56895 -103620 -66679 14012 11482 22055 97141 104478 131633
10525 131633 140075 96859 99016 80266 103719 122013 101736 88813 46188 33515 -37260 -41088
10513 -41088 -111020 -48353 -16084 21277 -25271 29683 -10807 -50955 -26028 56621 50166 -10925
10501 -10925 -60167 163 23540 -48173 -82365 -144420 -217734 -154934 61980 5982 40696
10490 40696 76691 -33449 -5863 61242 68393 91827 78363 38999 -67643 -47739 -84806
10479 -84806 -120268 -61799 -84060 -206872 -207422 -124366 -46355 -4994 74447 10096 -131842 -131818
10467 -131818 -96361 -61407 -37670 16347 37730 62916 43801 -59048 -145026 -187572 -147760
10456 -147760 -47102 -5424 -59589 -163992 -132040 21992 54706 -67860 -79211 -84932 -83684
10445 -83684 -79937 18573 142449 111575 37667 25289 5429 22011 36054 24917 48070 30260
10433 30260 23631 -56692 -72719 -59162 -46423 -9352 -61491 -168463 -86848 -83151 -70427 -137826
10421 -137826 -160489 -73909 -115871 -163722 -107170 55305 128479 13748 -8716 63419 30601
10410 30601 256 33629 66410 38313 62654 139464 19409 41349 -9795 -82337 -1082
10399 -1082 -37441 -22777 -39511 -120353 -30940 -16665 -94484 -46254 46683 18928 -7528 -69896
10387 -69896 -6139 114276 167804 11945 -50973 -12071 15882 -4268 -64833 -37099 6850
10376 6850 -53453 -165845 -140660 -59903 -77343 -99188 -74281 -30781 -16115 -100181 -167090 -71282
10364 -71282 -50781 -21317 -37295 -122847 -84154 -13593 -9155 -22635 13880 72298 75907 65663
10352 65663 150488 101421 61362 25713 -8457 -38646 -27814 -55935 -65777 -41097 -48549 7883
10340 7883 132519 172004 88824 -8048 -75363 -168107 -202875 -170085 -95635 -97249 -79996 -68321
10328 -68321 10474 110184 146004 173202 92022 -29817 -81698 51535 142951 49493 -1116
10317 -1116 -39314 -21914 -110344 -133518 -116897 -83923 63588 167761 60271 60732 206276
10306 206276 222630 147994 51303 -31266 -73727 -53907 -9170 73081 35439 18712 37014
10295 37014 43038 56360 43375 66937 49496 9188 37594 162155 144755 31483 -78851
10284 -78851 -120763 -77340 -93308 -112490 53620 149953 103580 75670 38605 -40241 48940
10273 48940 151130 115475 71808 67724 41927 115701 155728 124517 60281 -49981 -106484
10262 -106484 -89765 -28216 -11085 2262 84846 151214 41388 -80093 -55097 -21195 -105389
10251 -105389 -142335 20978 -21080 -24863 82410 6605 27834 68830 22743 -49562 76469
10240 76469 171191 159629 157635 107746 94192 185673 250410 180293 146348 29585 -45858 -49239
10228 -49239 -83993 -11057 232456 218919 27473 -15359 2953 -48608 -64651 -36000 -31518
10217 -31518 -35694 -17240 93244 117670 70799 83334 72281 25674 14788 -58798 -93058 -130923
10205 -130923 -30498 57636 16953 46758 18078 -70316 -58482 -92112 -40854 -39452 14102
10194 14102 102982 87285 137594 111584 56013 165534 157161 38073 14717 15046 32833 58015
10182 58015 15177 -32299 -25877 -77788 -162982 -111031 -84804 -11777 2376 -62901 -165899 -159145
10170 -159145 -165503 -151818 -103000 -72853 -192191 -230855 -254866 -207892 -70346 -91369 -37590
10159 -37590 -8035 74057 92534 68542 -5335 -30871 -24096 -77686 -92154 -11226 4512 370
10147 370 1250 5239 86468 48416 46589 67116 122005 133737 104818 126354 60118 55542 77361
10134 77361 66593 -49218 20284 114451 114085 145657 210623 137361 73282 156403 136289 26317
10122 26317 -90024 -94754 48550 108399 71478 85533 28069 55627 87413 27924 12616
10111 12616 -64801 -179505 -120257 -91443 4508 54549 184086 103541 56615 147075 161139
10100 161139 76332 56182 136852 188566 128793 57035 -91514 -134330 -41381 -41729 -46602 -90168
10088 -90168 -91535 -65799 -9944 39640 53709 63654 51321 -11567 -91406 -152439 -55492 38386
10076 38386 -26736 -1359 -35742 66693 144322 141996 126475 148522 87721 74813 40044 24339
10064 24339 21832 86774 81065 122035 161699 122678 87065 80665 200813 160731 147135 172424
10052 172424 170475 193603 159885 106108 117130 38341 -78489 -44633 -21012 -9049 -54190
10041 -54190 -108111 -108302 -75303 -55874 -35733 27828 159736 151429 -15304 -160402 -202179 -180500
10029 -180500 -47193 36389 15604 36246 -6568 13154 88391 158587 224507 171678 149620
10018 149620 172860 125291 94204 90575 104130 21336 -26528 118429 130012 55600 102506
10007 102506 54734 96610 30704 -13598 67898 104693 118728 89235 6884 37757 72747
9996 72747 49293 -30532 -2091 109876 140325 146659 144215 61401 16251 -27462 -52010 -132265
9984 -132265 -81261 65790 158302 158160 160319 107366 39975 26518 57252 -35206 -34936 -29585 -29128
9971 -29128 -55840 -57295 27218 35104 88468 128729 112741 129797 92960 124706 159188 -2349
9959 -2349 35712 29068 32188 35765 91483 107078 76666 57979 104107 101627 188919 206012 101584
9946 101584 40752 118515 164405 159375 120416 132784 153635 82551 22400 97607 62970 42553
9934 42553 70530 59701 102388 131870 132143 130356 118466 119312 104294 128932 203727 232152 224006
9921 224006 180942 146339 116251 72663 131293 204860 88119 64235 76080 4084 -16892
9910 -16892 27933 76946 210908 248943 266753 156637 152442 251870 260445 213608 293096 296925
9898 296925 248172 171636 286229 370470 262149 144830 114295 164764 218414 110012 34892
9887 34892 -37617 -25716 35033 155286 146588 108353 -46490 -33118 -17212 111011 158712
9876 158712 62837 -43716 -18782 132814 260832 313535 320399 160660 76521 78931 47391
9865 47391 -5492 -77999 -136263 -99215 -599 173628 182546 287156 343421 223611 63826
9854 63826 46875 40146 57055 106708 168132 224406 221905 197771 139279 107826 246836 347420
9842 347420 346772 302178 216213 233483 269900 307681 246543 262504 218311 109541 86651 141692
9830 141692 70845 66168 152156 172225 146379 140207 77724 79116 110043 159561 177596 88715
9818 88715 -37917 -82231 27149 183452 147942 123636 115639 140389 258236 67736 -65858
9807 -65858 -77074 -22879 18323 27189 71862 139465 148342 170183 200392 96404 34294 15087
9795 15087 43290 -27382 3089 68138 94011 83233 80525 65378 13495 -32452 -3992 -29824
9783 -29824 6239 2390 92193 178338 233299 234879 174310 -1429 -140648 -43675 22488 87152
9771 87152 73967 197162 174731 58097 66817 42248 99453 141501 135493 95899 43942 88229
9759 88229 93213 179542 236422 209549 141531 140264 285154 338235 237341 202542 105173 106304
9747 106304 7866 -3168 136182 89668 13131 77800 91721 115378 22454 7600 4117 2723
9735 2723 13258 24431 -54731 -41343 40366 171043 191785 124025 -21994 -33123 -32536 5077
9723 5077 -16672 83166 166716 181560 184436 180395 30106 -5183 90716 57905 25043 -7616
9711 -7616 -52497 -116579 -124782 -61733 42905 97173 133943 160072 138562 129563 66743 121531
9699 121531 77347 -43614 -9509 116114 208224 232966 270106 233919 209066 253334 255734
9688 255734 254561 159477 240412 303951 349044 244247 204292 199814 207042 267520 253449 263381
9676 263381 197769 168648 272131 342184 299438 202390 158111 151860 173557 99667 58879 85995
9664 85995 132780 93042 137694 227833 205998 217686 199450 183036 281520 377313 407217 377427
9652 377427 340018 327587 376433 324565 143828 175237 242834 213439 208307 307953 415182
9641 415182 420811 436628 403747 416452 367226 413018 350558 346932 323141 259828 202074 240144
9629 240144 244778 245549 275121 234624 224099 190409 274225 241367 201125 147246 146661 152412 184807
9616 184807 125656 124468 143268 215650 276625 302976 203581 161710 242133 315685 366952 295945
9604 295945 367914 420415 360266 353698 356592 333194 365412 356730 358978 380446 443860 443846 393560
9591 393560 353059 368446 498104 517242 502743 550521 596370 492998 416693 429607 444490
9580 444490 354911 311109 352317 414227 519902 565593 503948 453867 372783 406438 411120 376827
9568 376827 261614 293889 332215 363491 422328 457282 417936 382008 445299 473477 534519
9557 534519 518892 492290 527507 411734 449248 498747 592203 572763 427428 391876 411173
9546 411173 402843 340167 378043 397221 349091 385921 448790 518055 532627 500635 514830 629708
9534 629708 644384 516348 387279 431164 575130 693964 682894 670577 572858 551406 624352
9523 624352 621812 612609 669207 664222 608320 510876 510150 619923 683279 686851 668921 642254 639943
9510 639943 763996 753220 762431 760105 752913 711189 685231 731819 824682 825749 706875 601342
9498 601342 618276 668377 650366 662768 715393 662690 585514 580284 658386 621805 520524 542402
9486 542402 665491 728555 809141 841369 857874 874964 915718 985625 964300 1057808 1067875
9475 1067875 897824 804876 742782 694703 694640 689470 688947 754482 814616 893819 975301 951935
9463 951935 948325 990967 1071753 1097531 1014395 993148 876531 873582 905424 935306 1023988 1022614
9451 1022614 1011409 1071855 1078429 1137287 1169053 1189260 1137527 1136000 1097801 1053976 1150266 1201546
9439 1201546 1204042 1301150 1316802 1300130 1237161 1239166 1218599 1244463 1209500 1231249 1246359 1191870
9427 1191870 1057385 1020074 1036627 1058189 1157131 1282150 1315334 1380854 1355197 1321985 1430993
9416 1430993 1534470 1539111 1396871 1381200 1513986 1540483 1534891 1506743 1556456 1584196 1607565
9405 1607565 1501351 1386377 1384219 1546736 1518756 1457875 1438820 1469509 1453648 1520752 1538838
9394 1538838 1409728 1408311 1553567 1651695 1603624 1590569 1598671 1635008 1638941 1695687 1774901 1714907
9382 1714907 1655499 1671000 1718982 1752912 1676369 1565279 1528352 1546978 1611445 1743973 1810702
9371 1810702 1880874 1839496 1764679 1756004 1694257 1756554 1764303 1764567 1782022 1913664 1896377 1879249
9359 1879249 1910140 1927459 1872490 1919096 1979477 1958877 1961826 1911620 1984438 1970316 1953355 1858897
9347 1858897 1827400 1823177 1856671 1824447 1825345 1895550 1904642 1798062 1781501 1830707 1852021 1801133
9335 1801133 1805210 1748007 1678707 1641452 1731817 1819082 1860018 1869907 1892061 1967101 1930299 1841906
9323 1841906 1915424 1866348 1862172 1851934 1723904 1727816 1844871 1820992 1755516 1732986 1787429
9312 1787429 1794556 1753885 1653103 1660871 1826988 1944547 1892985 1862397 1784671 1745395 1832013
9301 1832013 1876390 1856963 1855080 1787468 1793374 1828482 1881938 1866631 1862193 1828961 1784887 1661210
9289 1661210 1639897 1695325 1731807 1659468 1604421 1604252 1543544 1548908 1424628 1439073 1403684 1475848
9277 1475848 1657285 1691583 1672396 1554920 1525878 1457613 1373720 1313919 1433822 1495756 1390109
9266 1390109 1230836 1225037 1296427 1436739 1457459 1377259 1291785 1336305 1453923 1457709 1305713
9255 1305713 1208359 1191347 1222854 1282863 1233961 1121241 1038033 1088329 1192712 1156889 1112405
9244 1112405 1038783 1150068 1158443 1164809 1123342 1084802 1178477 1221914 1181408 1074378 1075131 1105214
9232 1105214 1060179 1047387 976864 997247 1051645 1024882 997818 1027790 994480 929407 900864
9221 900864 900038 918553 885989 903223 884720 851356 935283 1005646 959179 984496 980001 1011439
9209 1011439 977176 985290 922923 870577 855918 737752 658244 647332 666537 678144 691180
9198 691180 788143 851012 859279 820146 709263 695224 752064 775410 780200 794881 751464 722202
9186 722202 763672 835330 918922 783662 694989 655870 597558 582071 625257 689682 749421
9175 749421 758329 724397 634510 557793 529339 506060 495645 584964 614037 656954 697087 683933
9163 683933 650187 582564 583894 515073 506518 610826 741849 765035 556530 469525 443788
9152 443788 447435 469600 507282 597639 545305 499208 587307 587977 516865 478855 456154 384153
9140 384153 327121 406499 465307 466653 418203 355987 399595 486800 497797 555899 546573 479664
9128 479664 416327 410894 378815 305241 400769 495623 509752 475678 497554 514072 530011 553053
9116 553053 547973 500971 443882 443781 490392 506905 399571 321309 282467 416846 612093 605093
9104 605093 558659 518866 489903 382635 444661 419171 350739 340722 391084 394343 325012 262233
9092 262233 235295 292874 310459 289178 348443 409540 321683 218929 336564 345800 375002
9081 375002 385152 316857 347648 325351 428789 419570 394989 368833 329182 253987 244045 217968
9069 217968 184840 304708 342108 307500 267604 282022 271288 370642 429732 315452 302450
9058 302450 339068 311968 249637 283610 233767 197445 216613 244733 279982 285800 193676 139974
9046 139974 96829 158800 227750 272250 325529 329570 300325 345903 414955 319622 271208 296215
9034 296215 249971 251627 251247 248603 286530 255443 236734 237475 265446 307890 283398 283981 261362
9021 261362 239948 234297 178909 146077 262816 360134 240087 248182 310999 307655 320002 314477
9009 314477 340291 339448 355753 279131 168582 162883 132030 105124 -70004 -10179 81572 57073
8997 57073 114745 169075 194570 171405 181036 144441 188322 131168 161817 133699 148683 136498
8985 136498 87678 137947 334020 380864 222853 144548 316841 327912 246817 273589 195419
8974 195419 177445 228672 322331 238426 162513 69770 16575 81430 181284 272537 306462 250916
8962 250916 82984 -67404 -135149 -142600 -83120 60878 172799 234117 270036 291279 270491
8951 270491 355270 404801 289038 265944 194817 180169 161456 107515 88527 84308 126977 101432
8939 101432 7914 121406 183259 277724 332603 332985 172406 138107 246549 293986 286198 250976
8927 250976 155239 123346 69066 82229 210169 293512 310749 263638 155870 94855 122801
8916 122801 122778 88601 76682 32453 -52814 -128104 -88664 10932 53013 -57498 -152492 -5130
8904 -5130 -308 32244 174264 196788 112882 96231 103105 10532 19419 55631 120568 92677
8892 92677 139722 185569 117724 119153 34173 52633 159559 221836 222439 241394 308444 247697
8880 247697 185579 203004 199912 212816 150086 75826 75132 73498 150182 186529 201165 166807
8868 166807 135533 109517 196215 251736 159097 68940 85823 38451 -99615 -51700 -32699
8857 -32699 -30428 12672 32840 -14258 -65138 54864 116551 -19323 -69467 36095 51447
8846 51447 72427 179422 177489 138413 -18512 32317 133927 200129 270939 315925 353348
8835 353348 267145 163218 193837 173107 99075 113093 110891 146301 175184 162790 153917 293646
8823 293646 332185 248408 110446 156458 171510 93290 97021 169671 255347 145779 101232
8812 101232 13149 -26086 60493 130639 89605 30816 4206 32682 58751 84229 85943 40809
8800 40809 28045 -40368 -104132 -31835 -7163 51009 175983 257334 185641 75484 75422 25953
8788 25953 -54399 21242 75624 90339 163766 188647 225761 156535 144999 185963 197737 212577
8776 212577 194498 184316 223934 247786 159871 193641 246911 249857 173943 119129 155280 171267
8764 171267 168323 156087 141583 16473 43538 70481 117318 52919 -29368 -26366 -26472 -68240
8752 -68240 -114457 -72463 -17306 -5710 59688 50277 17347 43377 65867 98747 103243 80018
8740 80018 146885 183808 92353 40171 35816 31865 13371 -38656 -40956 16719 45290 103252
8728 103252 173568 170000 150944 135318 147456 139746 119991 141726 88570 53857 70851 127554
8716 127554 117216 136081 140706 216508 262268 243456 217212 207569 114781 72412 -19987 17853
8704 17853 74581 117346 108087 134443 107046 133039 84187 82028 44576 4544 67499 156681
8692 156681 122427 142872 52319 75978 193380 251616 96833 40208 27652 20510 35165
8681 35165 56477 123170 61219 69281 110155 176180 255445 300647 265341 239146 180039 105064
8669 105064 124903 153041 263855 270212 115365 14744 4955 -32966 11208 119453 61644
8658 61644 -8191 3306 59036 54230 35836 -46357 -77056 -20239 83468 224069 222182 227854
8646 227854 194803 296026 190246 168957 102471 76097 95751 74163 125938 100607 134389
8635 134389 91334 10616 -24945 34493 137317 173555 156591 84350 101830 202896 222816
8624 222816 225369 218681 213401 68991 40622 3440 62183 192793 236456 222187 261791 255684
8612 255684 251088 261007 253593 237063 132250 149612 138389 193780 181805 132588 60810 82206
8600 82206 113094 231834 265626 156414 116082 150044 88085 67161 72652 111413 71955 6574
8588 6574 -87637 -120362 -101414 -44371 1781 -42184 17034 42006 12104 -143146 -96919 -10666
8576 -10666 -90158 -129937 -102844 30289 118942 101713 61909 61323 68604 55438 420 -25115
8564 -25115 21961 46135 80255 88694 55961 52269 15297 11442 -4357 -68950 -109982 32734
8552 32734 101764 138714 137215 155344 134462 80550 -524 -90159 -92216 -36240 -64209 -18724
8540 -18724 112682 235664 212336 122426 26074 30221 -37358 -16569 95058 146383 76842
8529 76842 -10696 -112674 -31536 43284 101189 160210 163638 187139 108353 56006 48634 61723
8517 61723 119093 61021 135417 173324 151254 202650 143917 38013 131548 221314 253001 221869
8505 221869 112575 65671 75747 -2372 -10012 -74229 -129078 -112436 -90673 31705 -60287
8494 -60287 -98018 14286 29599 -7061 59419 121753 88212 71271 3534 88790 203047
8483 203047 204204 184363 129411 41160 -13835 -41767 -65481 5953 26156 13267 51082 2608
8471 2608 -21811 32952 43538 1004 20720 -28613 -115398 -143300 -169558 -116752 44145 178253
8459 178253 150186 86154 169497 239891 204232 231729 271427 222051 128109 34021 26371 54892
8447 54892 107933 93254 73529 92711 140827 78948 68202 163954 177901 115940 49234 64920
8435 64920 78464 99317 93408 44450 -2337 19542 34850 87352 -4107 12796 95200 97533
8423 97533 94771 102520 225171 173690 64519 84393 132196 128300 154859 257621 244946 207777
8411 207777 217095 179867 146811 96689 -79286 -191871 -117881 -89499 -94958 -103645 -110804 -83575
8399 -83575 -77648 -10120 -31959 -30350 -36508 -61316 -94539 -123062 -117345 -114431 -66049 -77163 -114448
8386 -114448 -67457 -55603 -61848 -5936 4455 66489 32746 19360 -12256 -110262 -102464 -107178
8374 -107178 -87275 -53192 10086 38756 29405 9086 -101 41545 44632 28283 21672 49231
8362 49231 231557 148934 61003 -51652 -103871 -47475 -32675 -81901 -101662 -123714 -145964
8351 -145964 -162865 -180810 -9419 29359 -58728 -101103 -54908 16091 18338 -13508 -56850 -81811
8339 -81811 -155390 -74987 -39874 -90801 -84678 -70222 -128435 -73208 -108531 -93955 -67534 -43342
8327 -43342 33463 35832 -45130 -104274 -89515 -44021 58859 -52034 -59910 17511 140237 226601
8315 226601 156742 117137 107531 110570 51317 20105 21622 18754 38041 134702 98836 54308
8303 54308 10700 4781 103129 176283 176606 66740 -20664 -86053 11716 37516 -21330 44342
8291 44342 69568 7509 32861 -31770 53963 50121 10339 55453 122870 177372 207789 42419
8279 42419 -53920 -60451 34934 17715 -71124 -122681 -13469 112514 109051 124652 45397 -35070
8267 -35070 34048 106986 204654 71351 -36517 -111484 -29962 5313 8823 -10318 -24468 -105887
8255 -105887 -77135 -153107 -203094 -215470 -185762 -68066 -62186 -127498 -181923 -189970 -160274 -75381
8243 -75381 -58575 -95102 -74347 -46430 -33379 -56468 -32491 11740 37811 66886 12115 -30136
8231 -30136 -31201 86276 122825 59011 4450 -140352 -203518 -170441 -113405 -24080 77476
8220 77476 94472 59119 106396 104071 54210 56293 94376 153990 159589 157838 180213 24042
8208 24042 -44577 11339 91796 55830 114862 126929 59751 47318 35117 66355 170276 153045
8196 153045 158930 224729 168183 86841 35940 -37669 -43466 -37331 100487 112807 74413 20472
8184 20472 57087 41292 137691 20560 -139938 -115232 -44433 -75373 -33135 -49921 -15850
8173 -15850 49729 -63315 -76690 -60499 76226 -69196 -101282 -110559 -25437 32377 35516 -22294
8161 -22294 -1203 -83803 -106751 -74787 3579 128392 156554 91098 75221 -15504 -35571 -2384
8149 -2384 10253 64499 34155 66079 18470 3018 17823 -20512 51745 19691 -41447 -57618
8137 -57618 -123795 -169449 -115448 -68968 -88210 -187186 -89717 891 -31824 -16346 -27703 11369
8125 11369 4976 21009 -18769 50561 -5599 -14284 -53642 -1376 3298 -101130 -46583 76925
8113 76925 113167 28901 -39853 -87715 -76938 -77331 -126194 -140463 -21640 -36860 -96389 -37659
8101 -37659 77449 144968 114719 -8442 -75573 -86323 -120044 -127941 -160933 -125444 -100515 -22161
8089 -22161 -33442 8473 77008 165341 119608 95560 -1230 1322 14736 758 -32225 -28848
8077 -28848 67015 207851 164957 62080 -7873 22197 51558 -20213 -29293 -24758 -68230 -23541
8065 -23541 55650 156743 109982 -43092 -166381 -239121 -254017 -141937 -73908 -41658 31319
8054 31319 77717 57620 62959 70784 101950 219475 183591 60320 -8889 -81031 -112549 -34927
8042 -34927 39462 23658 34923 79797 70781 35560 14011 24002 8800 -43674 -9420 -17886
8030 -17886 72531 117066 115998 229866 145241 75402 28094 -23208 -225 -8908 -75720 -49629
8018 -49629 -46766 -60992 -28580 -28475 24934 12877 22980 24946 71517 12824 -70440 -170966
8006 -170966 -149292 -106808 -84641 -49568 97323 217962 133107 34097 -85374 -72901 -99078
7995 -99078 -50067 88365 58317 65356 80037 74970 23088 -55972 -106127 -97753 -31595 -26622
7983 -26622 1714 5133 37741 38902 -80063 -68633 -5823 76947 85355 69870 49600 36164
7971 36164 -1691 2754 135890 241473 207824 173508 189566 129504 60327 50636 6969 22245
7959 22245 22582 57163 207241 267381 162731 51096 20061 1520 -53214 -137007 -262483
7948 -262483 -262524 -105137 -45765 -23022 45049 57396 41476 54915 87927 82474 23262 70082
7936 70082 96592 13163 -8137 3413 48144 111476 -34744 -229564 -260835 -163533 -55266
7925 -55266 -44852 5086 64633 109850 97663 122762 16865 -6363 -87321 -21098 116094
7914 116094 212954 191322 124506 56736 129067 160301 149621 15801 -4566 51361 -11228
7903 -11228 -88515 -152819 -251539 -197130 -44610 -13547 -25411 -3991 -78888 -83663 -20670 -25485
7891 -25485 -10533 35175 -47633 -226300 -137252 -6299 132907 209176 141922 34666 -44213
7880 -44213 -42294 -76910 -77778 33643 28750 -47851 2585 3726 -44675 -96054 -85880 -65704 20877
7867 20877 66493 179484 148571 162949 190932 172258 130511 45195 40236 13001 42585 29640
7855 29640 32568 23485 104517 184971 144474 133280 127031 108784 70986 157385 145107 27486
7843 27486 36782 42350 3768 -26668 20030 95620 20454 -59053 -5816 14582 52795 15270
7831 15270 -25894 -15161 63594 -7622 -73547 38769 84301 63487 -3237 -12177 -67864 -15655
7819 -15655 40013 131044 119136 91489 92860 101734 107329 15254 20518 24032 14377 46059 34045
7806 34045 38150 -12982 -93684 -143418 -109114 -95639 -59892 -44925 -76477 -109527 -115187 -109110
7794 -109110 -98882 -109313 -42398 -65950 -132146 -146713 -120499 -20171 105316 151304 62556
7783 62556 20563 114599 144109 148748 107174 53325 91815 21377 38330 54269 133571 198305
7771 198305 108604 -91596 -176118 -135929 -56719 54387 77949 34987 -32246 -51372 -25751
7760 -25751 -32161 -40576 -101116 -122590 -52801 83962 53683 95088 48537 8761 47317 -24251
7748 -24251 -45259 -23007 -106444 -32434 7355 -15724 -90786 -49076 4441 98936 162922 92796
7736 92796 125019 220664 145028 96395 178145 219931 167468 85640 168373 210972 30518 -63971
7724 -63971 -83929 -98553 -120283 -24189 70335 50380 -31506 22528 -5626 -92980 -115704 -66067
7712 -66067 -73525 -57208 -108352 -29354 -25210 -80525 -110589 -48211 15343 20885 48894 230023
7700 230023 296518 205357 141951 89998 76939 75929 6430 -85805 -32455 -36043 -15063 2224
7688 2224 24950 96615 5510 -46161 -36161 5994 -74667 -83303 -104640 -145449 -165154 -91937
7676 -91937 -1331 46097 77707 121634 88278 75713 21998 4556 -67871 -119205 -30586 25819
7664 25819 93390 71264 -58613 -32102 55733 155851 62143 -59082 -88307 -55654 -6649
7653 -6649 27983 -23122 -162777 -233350 -184588 -99685 -22280 -15494 -32495 -41977 -121555 -162898
7641 -162898 -209031 -308514 -316889 -227072 -40255 5664 -83485 -72371 89607 223323 107653
7630 107653 12783 39819 137457 72648 63115 -22778 -84818 -109478 -4908 51995 -13223 -57904
7618 -57904 -171088 -156197 -120585 -105765 -112913 -121240 -136878 -126993 -44825 -60685 -116268 -97404
7606 -97404 -66489 8191 98933 141606 34815 -63832 -166121 -182299 -122078 -138606 -47642
7595 -47642 -69084 -58573 -46800 -29031 -20207 -56307 -118660 -88699 -101052 -125631 -165876 -151765
7583 -151765 -148856 -73838 53749 83767 38590 28229 37722 141577 312305 312116 178366 72775
7571 72775 53384 61921 119552 243946 197148 179882 127870 90028 74359 70710 -11607 -58979
7559 -58979 -100685 -7720 -48210 -112670 -156757 -133278 -102298 -75397 -5041 -24302 -11665 -39513
7547 -39513 -61626 -42714 -71795 -80639 -93293 -41265 -24395 -11605 28533 58943 -5369 -95261
7535 -95261 -46005 -96549 -223413 -138143 -2085 31345 42675 63422 -17820 -199566 -271465
7524 -271465 -74294 85733 192741 99270 29298 -76384 -101074 -71509 -58276 -45097 -36992
7513 -36992 -113616 -97568 -141445 -221345 -131570 -84588 -77350 -146393 -77050 -1908 -109761 -203610
7501 -203610 -96603 -119018 -126011 -109062 -127068 -48956 -2687 -10487 -44175 4629 31218 9845
7489 9845 -2608 13744 -7514 6432 46415 34822 -153477 -210700 -85433 18600 -1216
7478 -1216 58594 191161 155568 57776 16683 16142 20483 132747 108308 109797 17580 -130145
7466 -130145 -73811 -106713 -70311 -1529 -5815 4984 -33244 -85683 -65313 -37418 12468 141227
7454 141227 95157 26335 -32875 -50115 -27434 -69252 31693 171639 135141 95420 63922
7443 63922 -464 -42606 -117905 -53930 42422 35901 41281 47830 27565 -6511 37568 77647
7431 77647 163797 117224 -3362 34652 -10311 -170301 -155764 -131050 -163914 -148726 -147708 -90329
7419 -90329 -61749 -99921 -124024 -135435 -177427 -154910 -157015 -103494 -90067 -21148 -43819 -70444
7407 -70444 -21297 -40600 -69555 -119764 -73340 -70168 -29643 108915 89558 23673 35068 91132
7395 91132 47984 25 -51249 -36062 -34862 6632 111120 139789 59072 3180 -10177 -54707
7383 -54707 -48189 14678 17013 -19031 -30147 -13518 -60241 -112030 -80172 -48839 -79586 -101526
7371 -101526 -572 -76462 -159554 -154338 -195156 -181080 -22647 5094 -39929 -26133 -68707
7360 -68707 -62287 -43128 -6581 -14826 53102 63280 39555 -4023 27209 8681 -107566 -196087
7348 -196087 -47145 -4286 -68548 -116996 -158491 -171020 -91176 1243 -32404 -65109 -14353
7337 -14353 325 146018 192789 63232 21399 42992 110735 92607 33050 13470 29265
7326 29265 59181 128983 104009 185912 124655 135676 92645 58393 134011 277001 260774 197678
7314 197678 88249 -16320 -76690 -21312 8759 -36336 -13672 -112647 -175593 -270299 -312718
7303 -312718 -278432 -106912 -6612 -37339 -67441 -88357 -132866 -145354 -88446 -145987 -158761
7292 -158761 -192554 -194652 -87593 -125395 -180226 -195930 -208335 -156980 -166516 -142184 -72837 95730
7280 95730 152994 -8268 -134244 -154556 -174199 -142234 -7997 29603 17780 76625 105683
7269 105683 96182 53258 8015 -84509 -79356 -62971 -134523 -88835 -87819 -101896 -252812 -258303
7257 -258303 -241038 -217133 -139788 -113236 -107739 -192536 -218152 -80596 6812 50136 -14013 -67408
7245 -67408 -83524 -59036 -74789 -66478 -141996 -132900 -37101 -44495 -80329 -26545 125106 97199
7233 97199 53147 22358 27153 5507 -64934 -10237 49942 77044 15756 -55602 -108242 -119231
7221 -119231 -161271 -58559 67881 158690 209574 2074 -46830 60855 59803 -6280 -70889
7210 -70889 -76064 -99892 -15484 55402 4105 92290 72997 13762 -70164 -60489 -4202 -84980
7198 -84980 -35699 -61541 -41066 43918 76469 48580 183320 194340 31764 -6336 -7676 -18276
7186 -18276 -40974 35480 -26273 27737 14657 -28416 -64229 -20920 81275 -36909 -85075
7175 -85075 -23811 -8628 38799 37030 -8335 66630 10307 -37419 16915 -3982 -874 609
7163 609 49960 89664 -20765 -67728 51349 95243 54316 -30840 -16281 -34414 -95585 -45403
7151 -45403 -37969 37200 9577 -100716 -124259 -114098 -134029 -95529 -9525 601 5838 -50485
7139 -50485 -123230 -24527 -70603 -134133 -158815 -147999 -139753 -200247 -253445 -157964 -156611 -201241
7127 -201241 -171508 -6106 54808 -26983 -67642 -65364 -82567 -59649 52308 69270 66682 -94280
7115 -94280 -178285 -219035 -121221 -114504 -165352 -179044 -127594 -149811 -53120 21930 51058 -66754
7103 -66754 -112146 -58107 -154317 -129611 -16374 -20137 25632 9588 24070 -23890 -83734 -56635
7091 -56635 -78276 -18853 57603 24907 62195 -1936 -133908 -185162 -74000 -45067 -46053 -66060
7079 -66060 -28127 4135 4775 -69806 -75770 -53187 -17390 -16387 -68046 16771 29823 -68937 -15903
7066 -15903 68716 96097 78245 55492 12182 -43772 43243 35581 -95679 -97196 -19626 31642
7054 31642 68848 114593 110128 -4720 18724 -10042 -36048 26967 101696 109034 30418 -35289
7042 -35289 -15023 -75861 -42950 -3438 -44569 -88246 -3077 101417 136720 44582 -76227
7031 -76227 -199721 -227967 -169214 -156293 -90884 5766 95889 92787 102174 159721 80315 82227
7019 82227 54627 -35255 -62141 -33600 -651 17146 21399 10094 -67434 -17642 74087 217144
7007 217144 326000 208218 113844 90372 186755 250859 196169 70976 -21162 -10891 116257
6996 116257 144205 86509 165975 138887 51456 34008 46918 30792 44197 -8966 -64931 -75140
6984 -75140 -83668 -43235 -100278 -155625 -165536 -106012 -102877 -103441 -74759 -32477 74422 25541 -14902
6971 -14902 -31511 -54641 -87114 -109322 -94796 -123327 -111100 -87610 -50697 48773 115397 71547
6959 71547 -3625 -23414 -78812 -118263 -130016 -36396 -37367 43664 58837 30736 42412 31747
6947 31747 36969 40766 17250 61851 100224 20870 -57204 56387 141668 58119 43143 74214
6935 74214 44583 -46670 -101519 -114752 -36000 27015 -37993 13587 71384 -118667 -124893 -21586
6923 -21586 -5364 33422 99881 49934 -12294 2615 42537 9435 2034 99959 91333 80472
6911 80472 133610 237389 327819 236841 92194 44015 96777 58472 47035 75049 88687
6900 88687 134496 20111 -130778 -162992 -115282 -77940 -42913 11305 -2294 -91120 -15753
6889 -15753 -34058 -118222 -133741 -101704 -26595 45903 57154 -31859 -5603 -7368 73286 108247
6877 108247 -18515 -94095 -44213 -10151 -77714 -107188 -107817 -115786 -61273 -4743 -102658 -121830
6865 -121830 20708 76696 57437 65105 79701 98486 185682 260264 206943 106555 91877
6854 91877 231990 276984 171834 -35048 -173299 -209517 -203155 -101938 -96013 -81144 31835
6843 31835 -22900 -39045 -36112 10302 121635 123965 141492 50603 85159 70629 60026 71674
6831 71674 -31534 -40497 -24165 -21154 -91852 -231919 -202213 -126529 -117136 -89004 -3941 26189
6819 26189 29888 25450 69477 37872 -22525 -85005 -78808 -48422 -10234 -11423 -48933 -18446 -48880
6806 -48880 -102860 -167164 -146003 -178917 -217024 -209642 -117118 21187 67127 -18975 -24768 13438
6794 13438 40683 -2811 -127457 -100044 -50206 4032 27083 -63631 -58107 -27404 71319 165329
6782 165329 83137 1888 29396 35701 42824 112606 125206 146699 214355 174053 77806 43971
6770 43971 36596 51440 60366 -6469 -47859 -110760 -127456 -93820 -68807 19289 80170 12910
6758 12910 -91449 3968 57322 25877 -2055 -23948 -66748 -46876 40461 -79217 -82665 -103182
6746 -103182 -57670 61589 65882 -6782 -72255 -92710 -79064 4297 76539 142721 113521 19648
6734 19648 -61984 -70639 -39205 86256 153448 132360 128442 131724 103037 108454 277155 546324
6722 546324 625988 680332 773796 782382 649785 372778 174034 141127 113927 179222 240485
6711 240485 237147 67590 61321 130517 134619 100256 39362 145957 189831 74565 49024 113327
6699 113327 171597 114192 2022 1063 12729 -6813 80906 109025 121685 145893 105070 51733
6687 51733 -15634 -107271 -72138 -40088 -57249 -40240 -238 -5179 14644 -58554 35412 146531
6675 146531 26858 -20078 -73683 -43705 -85485 -76164 -30665 56131 91372 -25441 -31463 -101262
6663 -101262 -29445 -636 -34115 83979 77307 36756 48936 20866 -62165 -59292 -59290 -56546 -124695
6650 -124695 -114926 -53364 21555 -45848 -77102 -69782 -109539 -61095 34506 17308 35859 -77975
6638 -77975 -166680 -209122 -53243 67203 12825 -111335 -138038 -45898 -11384 85417 87009
6627 87009 103919 109475 117535 12771 382 68115 132056 98141 4036 -71988 -54141 621
6615 621 98285 74253 33491 12185 -106717 -109303 -78964 -139943 -175804 -286686 -332640 -209524
6603 -209524 -123297 -82428 -75663 -44123 -95782 -62758 -75909 -84809 -84013 -9016 18597 28212 45290
6590 45290 -44463 -38167 48027 82272 48321 -31913 10101 -12227 -27512 13572 77039 35980
6578 35980 -41031 -79573 -79506 53872 133482 117851 26206 37921 -95585 -214468 -126331 -33735
6566 -33735 50979 55498 28964 8141 -50249 -32892 -28967 59940 66808 49776 121207 164957
6554 164957 82947 -28389 2019 -28396 -31337 -19628 -129273 -116935 -118254 -136828 -103407 -48052
6542 -48052 -26214 22124 -58821 -171479 -339556 -356560 -305577 -223203 -207372 -202750 -206981 -56543
6530 -56543 65202 72607 -11561 31450 49252 33509 31384 102491 104686 59544 123793 170502
6518 170502 124780 85664 26752 36112 -42811 -59548 -18059 116760 157295 153226 167279 130556
6506 130556 88910 -35180 -63230 -26671 -41771 40425 75304 92277 4655 -62636 13660
6495 13660 14824 48896 40989 91380 -31181 -133732 -197743 -160595 -130178 -77793 53004 79821
6483 79821 -55618 -147051 -73504 -101258 -130157 -100551 -35621 -41227 -68208 -128100 -191791 -172434
6471 -172434 -112513 -73331 -136334 -113763 -66105 -194179 -213411 -288590 -296828 -216560 -192859 -207362
6459 -207362 -138569 -14745 -10819 14844 -12148 -28074 -59547 -12246 23109 142980 163399
6448 163399 89262 60670 68158 -3099 42258 3608 -58097 -42268 -77969 -111542 -125795 -138216
6436 -138216 -131940 -50470 -88089 -140064 -149095 -89099 -27767 37505 -22849 -72010 -47222 8813
6424 8813 48696 24250 -74108 -9362 72260 49723 17935 -33801 -63448 -63874 -49035 59182
6412 59182 -36640 -56456 -62172 -63111 -131797 -201203 -152417 -186480 -150939 -82603 -108005 -108812 -105081
6399 -105081 -94755 -76457 -101115 -179212 -147726 -156307 -203585 -139113 -120968 -44567 -133540 -208045
6387 -208045 -126093 -45953 -59390 -101029 -129270 -86464 -15337 -88450 -170180 -105263 -18146 20209
6375 20209 115703 163040 195012 222824 157071 31903 -81405 -69966 -147680 -179981 -187116 -173819
6363 -173819 -197576 -176221 -26078 63741 117540 51469 92954 63958 -37859 -59728 42727
6352 42727 17067 28301 75696 96805 -36286 -93383 -148325 -107378 -48170 -61122 -232512
6341 -232512 -235909 -150101 -146943 -82358 -66056 -50902 -109914 -100279 -101576 -45294 -42479 -25006 -53029
6328 -53029 -52395 -39065 -74151 -160041 -215139 -183048 -131372 -48652 965 -94147 -91498 -57308
6316 -57308 43088 96104 83264 48847 67858 143493 127206 189545 191738 86269 -136341
6305 -136341 -236435 -188515 -89637 -119356 -40708 12146 2555 -50395 -35621 -30434 -84856 -75473
6293 -75473 -23405 4538 110554 133546 153191 71059 -23669 5135 -59730 -106453 -55462 16221
6281 16221 89047 142180 160797 120118 52534 60743 112727 24698 -95891 15221 57515 30309
6269 30309 175488 45479 -141133 -166747 -174744 -120735 -159968 -171717 -259000 -300918 -184187
6258 -184187 -110210 -40991 -112822 -188752 -215303 -199349 -94933 -20900 7884 93047 100704 84866
6246 84866 96972 11404 -65584 -165388 -264984 -241556 -105568 -36846 -114914 -195219 -244746 -145536
6234 -145536 -138900 -104280 -198900 -145640 -50648 67952 95436 34706 30650 58315 110704 -13743
6222 -13743 -101904 -102044 -176352 -199837 -133152 -42084 1423 45965 7283 27226 -51515 -41134
6210 -41134 5980 79294 138035 171330 144792 115941 61614 -91247 -100533 -90687 -101369 -34504
6198 -34504 -48401 -46789 -2221 9767 -71528 -40449 -68568 -110634 -109492 -180893 -238354 -180179
6186 -180179 -212246 -226456 -180380 -90610 -99614 26956 61630 -9979 9692 -71932 -125229 -79595
6174 -79595 -25687 -74906 -179541 -71509 -81413 -104940 -27479 -30817 -16561 -45516 -82266 -39315
6162 -39315 -8412 -9294 -39769 -10624 79156 95404 52504 -4909 11113 49247 128834 172504
6150 172504 93011 -40495 -78766 -63246 -83971 -128623 -82451 39764 108104 32764 -11508
6139 -11508 11955 -58375 -102880 -63461 -100535 -141089 -149585 -85175 -49563 -56249 -13744 41130
6127 41130 2840 -32188 1442 -23747 66491 142482 146743 92631 95601 40818 -12538 -54344
6115 -54344 -96732 -66273 13413 -17002 -78350 -167646 -322444 -280516 -173509 -30573 -58901
6104 -58901 -152026 -163375 -161523 -258098 -332786 -302092 -215651 -143013 -96179 -134723 -50383 -56787
6092 -56787 -44263 33877 45078 7043 24873 -71889 -78837 -66273 -123044 -123956 -46396 28600
6080 28600 94246 123569 13827 28818 81605 79136 57366 65811 116601 53107 -27514 22525
6068 22525 -39954 2028 50569 69180 85368 2232 22959 -1575 64861 85929 221417 255969
6056 255969 116570 -1855 -12512 -41376 -69460 -60892 -73296 -63998 -59979 -28102 -33973 -6540
6044 -6540 10819 -7849 31101 13691 43176 56106 96767 104203 106165 84216 84640 91731 29371
6031 29371 53493 78865 43697 -23767 -123723 -191177 -150095 -83827 -56741 -18224 -11990 -26685
6019 -26685 56278 139301 167715 117159 46015 37976 52088 118667 106533 -62523 -136493 -216142
6007 -216142 -178933 -61753 15111 -3023 97905 163031 68328 39813 226 -6441 -55376
5996 -55376 23230 31896 26378 -34731 -66582 -131660 -169121 -165901 -29920 42611 7844 -9593
5984 -9593 -95811 -159218 -230136 -282586 -207643 -34262 -1526 -16523 47331 78419 -64740 -173121
5972 -173121 -140394 -22189 90168 16856 69186 40290 1465 34197 99319 154477 135114
5961 135114 61203 109347 101433 46617 -10802 -29699 -71025 -794 96885 28398 -191339 -173809
5949 -173809 -9098 4804 -48915 -138244 -83969 18616 63 -35293 -53604 -47867 -65756
5938 -65756 -46747 -62002 -110435 -205646 -116797 -73609 -68584 -27743 -41739 -60468 74119 69543
5926 69543 94450 74213 41956 -13351 -82972 -128381 -110436 -53417 -10454 -33903 -28728 -62526
5914 -62526 -34929 -51016 -101226 -30490 95735 62546 70197 44048 66518 160595 122593 78078
5902 78078 17346 65320 160831 120839 17112 -59795 -43955 86695 119522 57446 35392
5891 35392 -29548 -31185 -37286 -64018 -148552 -101418 -125269 -146578 9730 21598 39177 68557
5879 68557 -1904 -72361 -57658 26169 164090 171544 128754 79648 2919 9815 7550 12530
5867 12530 4726 -36894 33996 40556 25725 30326 -39786 -6968 5542 49382 55080 52921 64808
5854 64808 1028 -26829 -91351 -137507 -146938 -97100 -114713 -120371 -94385 -10586 15783 -51213
5842 -51213 -135122 -137381 -80852 -37054 -32988 -129693 -229813 -174897 -70280 20996 -11176 -91880
5830 -91880 -111323 -102995 -123383 -162368 -189981 -157277 -53071 96305 140011 135438 56420 28664
5818 28664 -5667 -93369 -86019 -121751 -34975 110700 112662 115278 7016 -61664 -28581 18880
5806 18880 -38322 -28092 -49467 -83313 -128813 -165656 -127967 -245367 -177387 -102157 -71952 44145
5794 44145 86075 24722 -89436 -93090 -95266 -158545 -132308 -98906 -63017 -29954 -48268 -134922
5782 -134922 -98494 -42865 -32636 -53515 24939 60102 57576 58294 75359 13898 7254 12138 -55733
5769 -55733 -138162 -38181 48982 60737 112869 125726 67690 10908 -9921 -117198 -157161 -120394
5757 -120394 -50572 42537 53750 -27682 -116949 -148397 36008 131231 107377 18203 4131
5746 4131 64299 45854 -73238 -71805 -145108 -147649 -111184 -133419 -118664 -86293 32046 127996
5734 127996 191680 169661 174115 181300 67787 -36257 -96885 -64686 -83534 -95183 -99515 563
5722 563 -60104 -186254 -190054 -126297 -142738 -79059 -105280 -60688 7376 -75046 -100474 -4337
5710 -4337 82847 4408 -68171 -69017 -94481 5328 -24302 -24391 45738 159950 157598 33537 13681
5697 13681 38422 8061 -22845 -53829 -34102 -34235 16616 139397 148057 92832 176829 211930
5685 211930 117699 28927 74266 129179 70973 20696 77037 149971 79380 -41255 -48614 -18554
5673 -18554 -65721 -78568 -109589 1634 148027 133584 200525 257646 148861 52715 8053
5662 8053 -79889 -4481 53926 9134 -1089 33511 110889 142110 117051 58321 47115 37016
5650 37016 31839 34141 -62965 -78534 -98773 -131643 -185293 -55102 102170 36183 29775 79201
5638 79201 102185 74228 853 -44335 -143730 -149595 -52316 -19624 -59861 -114289 -55066 -123378
5626 -123378 -77247 35591 32160 -11790 -76670 -18578 90540 210165 200499 100041 39314
5615 39314 47176 -13881 -39883 -72165 -38016 91869 114591 84854 82856 -26637 -109644 -162486
5603 -162486 -67741 67314 -9923 -54049 52637 106373 65456 56175 89050 135383 213370
5592 213370 145027 70207 63562 88753 45198 -40894 -48933 -58847 -112370 -97304 -116574 -107080
5580 -107080 -89138 -43494 -185190 -174286 -86375 -60959 -6332 122403 94989 20056 29719
5569 29719 -81235 -103080 19070 37012 -43915 -204581 -201637 -169611 -132666 -58539 -22264
5558 -22264 5899 11375 65222 37555 73852 -24901 -19323 -47018 -102644 -64741 -64199 -83225 -114143
5545 -114143 -69932 -63586 -63259 14767 -31111 -113995 -127186 -132494 -71754 14576 -9343 -2454 48648
5532 48648 -55363 -112493 -113622 -28635 21940 -42659 -45309 -61264 -55854 -77751 -550 35336
5520 35336 78708 -7843 -23042 4667 -36561 -79970 -42702 -111962 -136872 -132940 -101913 -90825
5508 -90825 -88689 -105337 -102850 -33088 -65882 -121018 -100098 -21485 78913 141106 -17049 -108366
5496 -108366 -2088 57641 -9791 -60985 -78274 -59687 -115043 -69746 -24932 13049 -43435
5485 -43435 -80642 -88905 -106243 -68928 -77865 -177019 -54937 109447 29358 -41202 -2670 -7052
5473 -7052 -15529 -63516 -23145 -70240 -77628 26608 24178 -98405 -127929 -72673 -100876 -103287
5461 -103287 -81723 70331 49433 -64983 -56872 -75249 18640 81753 137903 99190 34411
5450 34411 26446 32329 26342 220 -42149 -51904 -53716 -111626 -141523 -216491 -285759 -185516 -196823
5437 -196823 -197561 -101280 60734 122066 83793 55332 63676 -9956 53467 33768 4106 -70596
5425 -70596 -45530 22244 60254 57003 3460 -52578 -130382 -137597 -71411 -7118 37750 47038
5413 47038 67635 70127 46289 43303 17419 -35159 9001 47585 107360 146351 206414 154925
5401 154925 87000 5063 -26585 -13602 -33401 49000 149034 94224 15477 -152400 -140684
5390 -140684 -1151 -9288 -12521 -1006 -64482 -74526 -134512 -222870 -113496 -32845 -48886 -116381
5378 -116381 -116579 -83767 -97332 -48297 21078 683 25834 31708 -65583 -154131 -86438 -75931
5366 -75931 -148129 -265527 -256841 -163594 -149869 -110356 -8045 74924 53932 129921 168479 99565
5354 99565 48619 52125 76075 28023 25395 35863 -76190 -108173 -7161 66227 -59637 -75574
5342 -75574 -38237 -3624 -16324 -26526 -125786 -213578 -140798 -4705 -9189 -68066 -122480 -24504
5330 -24504 30924 12955 -29203 -28760 23142 -6684 -79609 -114028 10325 -53366 -57027 -14114
5318 -14114 -16296 89188 160370 207411 234981 167950 13423 -23985 -4554 112658 113547 51269
5306 51269 -24550 -127139 -182660 -229059 -167318 -133164 -169222 -195415 -188139 -191117 -198819 -146466
5294 -146466 -173257 -183324 -102300 -36872 -70123 -130259 -186125 -269325 -327513 -184410 -59337
5283 -59337 -41467 -77632 -84178 -91072 -90240 -73455 -115060 -61217 16688 33245 -28430 800 1357
5270 1357 39017 17888 1874 38061 56257 50601 -42087 3849 125229 147648 89194 24719
5258 24719 -67779 -148980 -184124 -141409 36803 141633 92057 44783 -9930 -61863 -129999
5247 -129999 -48624 -48384 -5910 -54021 -161778 -250053 -208501 -125467 -93016 -115862 -57665 -1261
5235 -1261 -10891 45235 89070 20840 -72638 -157267 -221415 -107705 -28121 6015 -36768 -96885
5223 -96885 -205164 -153765 -87089 -99982 -37327 -168887 -258009 -272410 -207399 -85990 -14682
5212 -14682 -5414 -6503 36478 32508 18144 17972 27261 29848 -37008 -70321 -152551 -210342 -135625
5199 -135625 -53097 -54987 8715 74877 44409 58091 -22652 -41224 -75531 -182419 -151498 -43149
5187 -43149 26355 -22408 -110646 -95923 -148353 -118061 -36473 122312 180193 70123 64284 51982
5175 51982 25140 6556 32476 19435 -48622 -38115 -66139 -100597 -82975 -119916 -199146 -216293
5163 -216293 -167970 -107018 -70728 -50390 -25050 3414 -66453 -39159 -65008 -102113 -113031 -66542
5151 -66542 -21181 -22915 -13899 63071 102229 112320 -12493 -44246 -57549 -4269 24688 123146
5139 123146 75604 10399 12934 -7248 3949 59219 178723 199556 103348 -60262 -101908
5128 -101908 -97616 -112244 -66171 -85799 -118310 -90183 -22625 -17092 -34775 -28161 121086 192794
5116 192794 147508 39056 -23063 -14815 -22514 20240 19160 6395 -54755 -172929 -190897 -56576
5104 -56576 52373 26333 -22519 7098 -62508 -57801 42406 66602 62540 159261 137363 29336
5092 29336 69125 45525 -11231 16795 44031 38137 14812 -12933 -54751 -55219 -139485 -117372
5080 -117372 -55331 -47082 -6298 33556 -59450 -63080 -24374 -31704 -34334 -76088 -115622 -117714 -88654
5067 -88654 -49812 64073 64560 74903 79106 102379 1139 -53011 37441 122829 113092 103675
5055 103675 61942 76922 118155 119675 29607 76030 91352 73545 111400 66428 1575 -58310
5043 -58310 -12969 -85212 -111512 -34555 -32380 -42811 -25799 -51688 -120396 -87830 -58847 -68963
5031 -68963 -124055 -199216 -211346 -187808 -171832 -127258 -100317 -115423 -160902 -223194 -136652 -29764
5019 -29764 34968 49618 -26074 -33988 38983 -18770 -118773 -137665 -135086 -69900 -5665 43758
5007 43758 27612 -64525 -33616 -7290 -32077 -69428 -154576 -112293 -88698 -20638 158144 194065
4995 194065 78816 -34807 -83587 -122605 -200859 -122006 -98715 -62660 76027 153324 59245
4984 59245 -42287 -64687 90796 81278 49512 34904 -46164 -26379 3700 113060 164202
4973 164202 177705 209835 240098 286338 256279 125317 76589 96820 -35220 -75432 -76430 -38157
4961 -38157 -105347 -103094 -38558 -109773 -104455 -127421 -67851 12531 -46427 -53788 44802 145659
4949 145659 131015 156409 48205 -671 -24153 -95984 -70707 13228 44841 115692 66367
4938 66367 37461 11444 -35362 5378 27276 57025 27171 -25113 8332 -3258 -150125 -181331
4926 -181331 -55424 -15990 27783 -42422 2910 46407 69976 57117 -31731 -46778 -16392
4915 -16392 8588 -70442 -105745 -96902 7906 100938 134506 146833 84099 130679 143530 89210
4903 89210 83210 111206 79217 87891 127882 54854 -56330 -5944 50817 62345 17503 -69596
4891 -69596 -76711 -100271 -85363 -26627 -30274 -31675 -28075 -22693 24535 -10953 -27393 -25577 -59566
4878 -59566 -81417 -127904 -56820 56682 -28605 -71773 -84482 -83020 74084 177584 89392
4867 89392 1740 28884 -7108 -41908 -80522 -52867 -51517 -46246 33413 84696 163525 134255
4855 134255 103908 -4703 -65379 -6672 48320 125255 191187 141131 -15701 -69448 -60556
4844 -60556 -61673 -105454 -133413 -70809 -49698 -83128 -65621 -59709 -140508 -112461 -93507 -78289
4832 -78289 -114560 -118321 -105270 -116344 -17194 32414 78766 -39524 -39311 -148072 -173382 -103534
4820 -103534 -44889 -19235 -65446 16042 164127 178745 137429 66192 51088 172516 190876
4809 190876 138820 134277 86484 1031 31417 118474 126335 94579 9560 -60305 -86714 -154140
4797 -154140 -61628 -30682 73413 131358 47035 25076 77084 51077 -7584 -66872 -60699 -72270
4785 -72270 6014 139719 227681 183532 132502 75388 46955 4640 -15135 -47565 -34273 -27922
4773 -27922 -18598 -107918 -64736 7386 131237 166085 196161 141604 -61143 -185900 -121317
4762 -121317 -164183 -271274 -143449 -112102 -137081 -85163 6084 93542 94986 101116 140324 59976
4750 59976 -11005 -101880 -127191 -78573 -19368 -26399 -35497 10670 49646 146942 114345 63104
4738 63104 -8208 -34166 41976 99916 78299 79416 44377 68050 51172 83985 67222 -13774
4726 -13774 -124795 -154027 -112895 -159269 -188120 -123245 -118127 -111108 -139083 -114600 -49914 -20511
4714 -20511 -6889 -35491 38842 -6712 -42186 28122 31213 -35125 -66733 915 43890 -66681
4702 -66681 -192549 -181758 -62641 -48219 -161480 -120102 -84039 -33194 40286 53554 57311
4691 57311 18268 34274 7548 -82314 -77762 -30590 -126087 -104195 26719 97815 32541 23202
4679 23202 -163250 -332914 -240555 -177372 -104816 -70909 -146963 -232035 -127989 240 19482
4668 19482 -84427 -21355 99797 126527 60040 -2248 -44255 -83240 -114839 -45758 -44907 73629
4656 73629 96097 124143 159209 141225 71310 -4381 -83818 -41549 -12000 -13224 91 -8213
4644 -8213 -39526 -67793 -12501 50790 -22585 25163 24813 61704 99635 134885 27298 -13157
4632 -13157 -54090 -160061 -222215 -177383 -159618 -39097 66111 22690 -45013 -57861 -88512
4621 -88512 -12818 49102 74412 26933 71951 119007 118229 61233 -93481 -182954 -96683 31860
4609 31860 3236 -8688 -48235 -144020 -43114 45902 19123 -70405 -46704 -8170 -70554 -68846
4597 -68846 -13859 7112 -37066 -34917 710 -83930 -215551 -220305 -100679 43996 114743 48630
4585 48630 -9653 43104 28891 -30804 -63484 -153328 -112984 -45700 -24114 -67096 -48517 -83365
4573 -83365 -58438 30737 3556 -71133 -138351 -149549 -145413 -89252 -103905 -91323 -90034 -5171
4561 -5171 93317 191401 136900 97422 43560 -14754 -23301 -30018 -120909 -143365 -139682 -106611 -72472
4548 -72472 -105622 -119650 -104762 -99590 19793 114501 95810 -37187 -90597 -194117 -166509
4537 -166509 -47667 35820 39301 28358 -58831 -34643 -38910 -127717 -172653 -150272 -117798 -37032
4525 -37032 -680 67169 -27393 -59512 -85861 -30796 27057 -28063 9396 -43664 -126102 -81641
4513 -81641 -5011 16 -109725 -94216 14011 23044 109338 181787 187926 81089 83036 93246
4501 93246 74297 115958 157118 135660 93010 88636 48585 -9444 -83419 -66579 -6111 -8436
4489 -8436 -33063 23649 -76518 -107454 -4698 -15069 -165322 -198560 -168222 -85023 -54188
4478 -54188 -66628 -64387 -90656 -67637 19046 95734 110132 -5548 -32792 -27671 105663 187810
4466 187810 217957 265475 296828 205808 137576 -46223 -207205 -146154 -85649 74912 106850
4455 106850 124140 76658 45913 62301 91448 132460 186745 193260 171429 199533 147252 148908
4443 148908 92525 23455 13336 49974 37686 45372 -10168 -20140 21483 12122 50447 89120
4431 89120 162407 229257 195947 115689 30002 24773 -34153 -140140 -107302 -115951 -159538 -173997
4419 -173997 -172932 -82691 -12936 -43308 -63214 -15849 -18021 5882 23031 28456 110992 214650
4407 214650 173579 92419 9630 45291 163422 89299 74181 94700 39633 21270 -2106
4396 -2106 -9206 25233 -48413 -91863 -95669 -74196 -9703 -14830 -95491 -169180 -159170 -42023
4384 -42023 11963 19849 70776 101897 28936 -97153 -219699 -240962 -153357 -133510 -51382 -6456
4372 -6456 10130 -24593 -58529 -71054 -6190 44533 4369 -90530 -137857 -105849 -143953 -132745
4360 -132745 -169377 -150742 -91797 47221 67549 27601 -23926 -39087 -84027 -117641 -16881
4349 -16881 41496 64941 -37153 -140150 -146910 -48843 -14074 -37457 -93420 -50551 -91193 -153287
4337 -153287 -134444 -109075 -173356 -190151 -89270 -46497 -135024 -204087 -81658 41664 80166
4326 80166 92422 -42841 11456 1954 -53599 -30265 -89078 -88681 19282 154772 133280 116082
4314 116082 82549 35786 -51859 -92453 -107116 -71851 14436 -18543 -71252 -112104 -94937 -26225
4302 -26225 16675 86941 14603 40207 111173 -3310 -21202 -35667 -79310 -51849 19194 133625
4290 133625 114661 -65295 -6971 67690 117987 229479 257763 113295 -32061 -112889 -173725
4279 -173725 -112531 -111775 -87053 -73100 -51323 -69644 -153535 -132427 -126471 -53826 1783 -329
4267 -329 -1887 -17944 3258 49927 76559 82909 4116 -69171 5034 51571 81505 71386 93529
4254 93529 93176 -9266 -100766 -103788 -59120 -63717 -92294 -111640 22244 129736 29095 -94376
4242 -94376 -108176 -149430 -200322 -215925 -118435 -11636 50318 86041 185657 152097 109871 3931
4230 3931 -15368 -40873 -73749 -33206 13984 -38165 -36719 -32399 29228 -26318 -13707 89734
4218 89734 109901 -18777 -39950 -31732 16471 62169 148773 170037 65107 -59274 -91467
4207 -91467 -47703 86793 238455 220663 193543 179127 108401 92792 87733 93340 62534 -47639
4195 -47639 -2312 -84491 -136355 -111693 -8488 53421 70826 28358 19394 64420 37251 82908
4183 82908 88984 37972 -27171 -17336 -73310 -15704 -40043 -97769 -30260 1035 -70958 -80736
4171 -80736 -45743 -82107 -66118 -107 15603 19242 -41076 -134047 -110455 8678 77327 65265
4159 65265 62974 98351 35517 -55065 -40551 35846 50658 86886 123946 93933 16762 -1416
4147 -1416 63589 46408 -44756 -121980 -191168 -227094 -82548 -44503 -150538 -151746 -77775 -89350
4135 -89350 -92835 -35883 -47545 -8777 -26485 37391 180719 194842 -8330 -89653 -40260 102906
4123 102906 133936 102823 4552 -19274 -45532 -145358 -236089 -143577 -74689 -78393 32054 48536
4111 48536 115005 12475 -40953 -16989 -80782 -43930 8191 -109710 -161925 -85356 -9280
4100 -9280 44623 -40142 15740 78702 101157 19832 78226 177754 176687 41073 13895 36981
4088 36981 140245 101492 85631 84873 30935 83743 164297 188010 229520 189525 124995 51510
4076 51510 136543 159092 124579 75320 14525 24567 101545 71401 9207 -42061 -58134 1466
4064 1466 35949 3545 -52181 36114 72104 35561 25584 4790 33042 24803 -22877 -41850
4052 -41850 -9958 -157868 -228369 -170083 -126761 -58005 20601 54068 106658 89188 -57525
4041 -57525 -142394 -103927 -74506 -50496 -20095 37591 75661 66862 -38927 -86223 -124691 -89602
4029 -89602 -100782 -29226 -90074 -183119 -209482 -194068 -231714 -174948 -124666 -168926 -168479 -50306
4017 -50306 117206 163604 79988 59131 47284 66454 108018 73799 -39469 -33065 -68081 -67285
4005 -67285 22005 115345 48596 48134 125313 24191 -62750 -151760 -102777 -87188 -112550 -136510
3993 -136510 -287895 -268334 -35032 13452 -18336 -41797 -12916 74061 155092 151507 76836
3982 76836 24114 -32595 -25140 -12779 -17334 -28035 8184 47335 23313 -65120 -83572 -28402
3970 -28402 20028 17420 91558 115137 77076 93901 40458 67571 71840 10723 -62772 -109116
3958 -109116 -77702 -44783 -7908 -63628 -77019 -176418 -157383 -56784 11980 -34806 -207851
3947 -207851 -251148 -171177 -94802 3408 177492 98952 -62488 -13061 95432 2461 14737
3936 14737 121367 119074 17391 -50988 -55410 -37633 -31751 -109754 -155030 -99034 -62209 -32311
3924 -32311 -40200 -75155 -101782 -54595 -62537 -100479 -135822 -116126 -36635 85243 79859 127734
3912 127734 117214 96879 32017 61408 97104 2226 -67849 -1433 -7879 29992 115363 172004
3900 172004 68735 -27525 -9124 -6275 -40742 -19548 25935 20117 -19810 17578 51102 97315
3888 97315 126314 75104 110399 92901 5944 -26405 -67235 -18228 30626 -3388 -35909 52567
3876 52567 46112 -16282 29670 103700 109599 24243 -16993 -5384 -36843 18098 115051 136337
3864 136337 12898 -21161 9611 -25477 -75980 -64296 11383 -698 80387 79204 36268 -81985
3852 -81985 -142068 -92827 -19762 -34394 -22851 96214 115053 130413 139389 45410 -26108 -11989
3840 -11989 -64146 -38045 -40040 -90768 -37590 -16199 -1698 -13692 -77535 -69911 13369 129301
3828 129301 76098 -12758 -1470 28736 10252 28486 19357 15990 109000 98683 -2575 -19846
3816 -19846 103651 107409 128248 89679 63314 144526 106938 84710 43917 17218 -39620 -28109
3804 -28109 18386 -33453 -31856 -73682 -60957 23261 157113 157460 138422 206315 127824 -13554
3792 -13554 -101156 -139301 -105511 -86247 -51676 -7727 -23291 -28091 -100448 -191390 -207986 -151895
3780 -151895 -130762 -139076 -120170 -73683 -40319 -57669 -30832 -24117 -68908 -170272 -192902 -104622
3768 -104622 15295 67142 45306 34303 11194 37075 24593 -32062 -102430 -130341 -153919
3757 -153919 16235 50301 -50699 -104349 -173152 -179471 -189244 -98580 -30331 26786 92777 47265
3745 47265 2738 -7790 -90810 -44386 -44742 -24405 21392 15672 -103760 -117869 -146616 -97182
3733 -97182 -38898 -56430 -171637 -217334 -206124 -36262 41065 58155 31173 87510 137543
3722 137543 181604 179540 49063 83051 84622 20595 -53851 -8928 4059 18872 21915 102889
3710 102889 180505 115052 88417 -10922 -103131 -13028 -15394 -83666 -114456 -229258 -196045 -57135
3698 -57135 -37089 -21393 71335 178557 117200 51802 14212 -88258 65710 187511 110874
3687 110874 10504 -2787 -36443 31034 49370 -26082 -82416 -48483 -102604 -107669 -33177 15971
3675 15971 25540 -33903 -113200 -102289 12134 34031 -3508 -1245 -36271 57094 94904 127576
3663 127576 131347 114436 107434 218230 165191 131536 27087 16203 62546 83166 123021 46753
3651 46753 -106876 -108942 -65900 2315 130416 116505 68763 106837 107310 -33464 -20068 65522
3639 65522 82382 37467 90609 76873 160449 94964 107058 102452 55182 39038 57735 58433
3627 58433 89167 90246 -21302 -78803 -119992 -114119 -104796 -44406 53439 130358 52478 -59256
3615 -59256 -127448 -94359 -148478 -136057 -107987 -69143 -174478 -209009 -237752 -251374 -215609 -208895
3603 -208895 -136715 -156968 -212638 -255418 -183457 -168155 -166083 -156523 -61949 101517 162265 96275
3591 96275 6217 2908 58978 -20563 -27836 -26667 -6354 36419 86671 -57744 -128792 -44360
3579 -44360 -5382 37617 50217 112362 97592 21226 -43527 -117430 -170888 -210634 -178677 -124631
3567 -124631 -78304 43024 18976 14134 147641 163583 63903 -48503 -80216 -5812 -41748
3556 -41748 -15538 34552 20769 -38210 -64061 -100915 -95821 -97630 -54058 10575 -84287 -104531
3544 -104531 -84981 -96164 -98312 -3738 131879 149167 98180 61314 41237 74323 8670 -26399
3532 -26399 23764 -53819 -25617 -65007 -129994 -150494 -154627 -95829 -145180 -186824 -66810 -22228
3520 -22228 33911 3155 34254 68799 16843 44929 45012 18253 -25936 -101470 -151332 -218239
3508 -218239 -204853 -83777 1272 51983 44362 14411 42904 94582 101382 83281 8226 -144472
3496 -144472 -83046 84409 57570 9443 -59707 -132022 -118880 -95657 -46667 17835 41534
3485 41534 80570 108606 127898 107941 82171 52787 112171 171812 126815 26525 -31195 22815
3473 22815 36707 -22511 -93066 -108211 -23569 5941 -71337 -79064 -412 -13781 -19263 -58881
3461 -58881 -5212 104278 22154 -20676 -56921 -98120 -38298 70966 103393 79918 29759
3450 29759 61002 24463 62574 -7980 -55260 -158641 -186036 -39119 31534 -32263 -112319
3439 -112319 -31447 -8998 25869 55367 76911 -1741 -17807 -27432 -61688 -2495 119476 124660
3427 124660 84123 27319 62774 113354 111724 97861 44757 23079 -17930 -6766 104337 9390
3415 9390 -97545 -121722 -90346 -102368 -58588 -50146 -14295 2645 34415 30287 -10265 -10998 -40188
3402 -40188 -206952 -168850 -77260 -24006 -62087 -48682 -64379 -37235 -41466 -60140 -62578 -175217
3390 -175217 -322446 -280686 -194662 -113172 -117320 -93489 -79729 -76938 -5133 -16080 -111393 -182037
3378 -182037 -61268 47271 -64310 -150989 -173626 -127073 -75339 -90120 -101338 -115650 -131328
3367 -131328 -80266 51905 59327 -14729 -68492 -140160 -165373 -165688 -1875 67382 1580 -92774
3355 -92774 -81331 -1128 21034 -22128 -45300 -31786 4926 -64391 -60186 47419 99403 107509
3343 107509 125178 151596 81323 -67522 -65657 -75385 -21578 75689 102979 82786 19459 -62694
3331 -62694 -22390 -77418 -141330 -103991 -80355 15590 94846 127032 174712 119205 26629 16543
3319 16543 161259 104540 66697 44884 -17698 -20666 79623 125940 119816 92851 115993 -26096
3307 -26096 -37797 103480 169243 207651 246129 120973 35589 -42735 -143082 -96748 -31246
3296 -31246 -47344 -62633 60396 67150 50692 4343 23231 69959 96519 146629 162380 90135
3284 90135 -10204 -57560 -11304 -13500 32890 60200 84905 135075 148729 104572 -13454 -66116
3272 -66116 -29934 -90117 -86161 -27345 2806 48579 23119 -20249 -68922 -42186 -1555 -19418
3260 -19418 -5048 48219 35725 46561 53679 35385 28606 -47536 -156058 -144792 -113299 22353
3248 22353 106336 76136 117674 166348 143236 78483 -5536 -8556 -33678 -40130 -40341 -6671 6173
3235 6173 -32618 -91776 -115445 -54533 23047 78649 28046 8870 -67989 -102505 -63857 -105602
3223 -105602 -127131 -120277 -133426 -91016 1007 82991 -1317 -35633 -15235 23974 1870 -111276
3211 -111276 -230154 -213448 -118390 24151 72209 71276 153402 96429 86644 11556 -27767 -27968
3199 -27968 55970 57258 125789 159091 40450 -10552 -80002 -79299 -18866 71449 174540 161974
3187 161974 111745 82888 6704 -156147 -168960 -192773 -147189 -39722 57111 45292 23577
3176 23577 91924 131864 159167 140139 42167 -51702 -82068 -149300 -152451 -85043 -47901 -44758
3164 -44758 -68125 -178048 -220890 -239038 -227152 -122373 -69529 -37836 -29605 12973 133764
3153 133764 57146 -44912 -83316 -147915 -102487 -39679 -62181 -63385 28036 -3984 37906 87204
3141 87204 78341 -6181 17192 64933 117017 148723 121624 131572 93414 45185 74376 147706
3129 147706 88142 -27801 -46784 38994 67693 39876 49025 -43643 -91636 -4499 -10518 -13928
3117 -13928 -62130 -96547 -141572 -115743 -59803 24709 -21169 -90910 -118214 -172882 -53929 -22799
3105 -22799 -14753 19751 37743 -18013 -59080 27543 29149 80309 97562 7553 -41630 -42997
3093 -42997 -154723 -167491 -44421 -5491 -10047 6029 -12910 48837 30753 56497 43827 -25099
3081 -25099 -85700 -48908 -120726 -110746 -1839 88018 148453 -45623 -82080 -14474 -92114 -175806
3069 -175806 -85322 -31780 -4745 41836 3561 1709 63599 79604 142761 124868 34685 51732
3057 51732 24794 40097 4054 -90728 -114289 7621 -239 -51344 66335 128426 152003 208419
3045 208419 245758 194737 200533 183796 120311 -40152 -72721 -16227 -7840 -32601 -119801 -234502
3033 -234502 -231463 -167839 -149541 -135667 -201246 -193273 -154832 -215366 -202802 -109099 -52815 27521
3021 27521 3333 -28897 -104985 -235448 -174730 -33974 -18678 -2318 -87017 -55799 25699
3010 25699 61804 105404 140228 107840 -61624 -51713 -69523 46405 160264 135581 87363
2999 87363 80849 8202 -50551 -89688 26072 63615 128353 77951 24813 -14594 8774 11307
2987 11307 20263 79287 49920 -108420 -96278 -11062 69253 -25017 -60948 -130914 -141615 -72914
2975 -72914 -57173 -83610 -76882 -61922 -153254 -257071 -227971 -176667 -111487 -111316 4607 9951
2963 9951 6518 -79497 -21194 94476 36952 29846 12779 -82550 -48483 -76672 -71893 -111192
2951 -111192 -165515 -216064 -96003 33985 24032 -33556 -157548 -118572 -94382 -17259 -15120
2940 -15120 -94714 26748 62432 -18628 -63536 -42879 -20967 6929 31209 91920 91223 65805
2928 65805 31037 -94454 -43845 44417 135455 177146 -20363 -42651 -100317 -106308 -20910 25671
2916 25671 36569 79187 26684 9311 37306 66110 67103 126234 72925 -13892 54621 145488
2904 145488 172208 180583 171991 80140 77504 -58331 -43783 -32633 -8894 95936 108347 38098
2892 38098 -12115 22171 9714 29057 69616 -32099 -155209 -56320 41 -35299 -17390
2881 -17390 55124 71734 163737 205554 97147 -57528 -78540 -94506 -124126 -120284 -108538 -155899
2869 -155899 -182363 -127437 -94256 -108022 -34784 4081 46771 71213 48357 19076 -43332 -2328
2857 -2328 80629 54470 -14654 -23499 -110310 -133035 1428 -5460 -43423 20200 91189 1013
2845 1013 -56643 -94325 -180442 -139129 -116348 -84050 -100953 -10527 63925 90566 124388 91102
2833 91102 68352 -73486 -111935 -76853 -49679 -30936 -31495 -14473 -74216 -102343 -60469 -121275
2821 -121275 -150441 -27408 27082 -27539 -1367 22438 -11517 8211 52855 63349 32656
2810 32656 -6191 -67491 -25968 -31792 -2220 -26982 -110294 -53365 7088 16984 -30325 -84940
2798 -84940 -76057 24236 -16373 -44533 45050 92135 50179 -23098 -35302 -44920 -2411 140948
2786 140948 158648 208027 242649 146055 18904 -62810 -81048 -37199 -93361 -47543 -57553
2775 -57553 -94412 -129151 -108443 16637 24468 40833 15344 -66965 -30249 14235 -69537 -115559
2763 -115559 -145401 -27115 -52618 -81759 -103251 5369 730 29595 116480 112354 102320 72621
2751 72621 -14225 2499 -3568 -64858 -90327 -123993 -122121 -84786 -49935 -39388 -12812 122144
2739 122144 133071 138887 175434 116565 23547 18168 132255 166509 190630 148263 147012 245813
2727 245813 285173 238406 158552 -53409 -155211 -95755 -17011 -83550 39267 41718 -3338
2716 -3338 -8121 23439 -40089 -59506 -41166 23983 39953 76854 13596 -25467 -59525 52565
2704 52565 114903 150771 195130 152925 71616 156578 132161 40780 -114826 -143828 -66261 29226
2692 29226 79634 35220 -10881 64131 58434 82168 101402 38181 -11756 65517 57058 -92796
2680 -92796 -141837 -163032 -139227 -166950 -145326 -147195 -196733 -171905 -49648 53304 83710 9657
2668 9657 1526 56247 -46941 -106529 26146 117574 53936 3572 26881 24260 61075 119321
2656 119321 77073 67147 80797 69965 31924 -3517 -41277 -88545 -141860 -138690 2409 58120
2644 58120 69534 37343 -108399 -89301 -3885 47260 42132 17913 33533 28972 105679 158260
2632 158260 159986 -30094 -101761 -113109 -47611 65362 30326 -52997 -97528 -99795 -66249 39904
2620 39904 49001 -6110 52696 137157 167964 70624 26172 121923 152503 80531 -49040 -126528
2608 -126528 -125699 -120717 -80804 -127389 -186034 -53712 58524 104902 76650 89936 145272 136959
2596 136959 58113 3156 -40228 -4833 -7673 -21370 44322 -27190 -34160 -29878 -46462 37574
2584 37574 -38918 -91024 -41423 86906 135524 142725 174669 132980 64798 24301 -55521 -88842
2572 -88842 -127152 -104378 -69465 -47824 -13144 -22785 -19231 -37494 -25243 -10651 -45788 -18141
2560 -18141 -39078 -39336 -134824 -188100 -128776 -80156 -30065 -33175 -44825 -112103 -187680 -143876
2548 -143876 -58654 754 11126 51468 32605 31248 -46305 -21865 71039 108397 65728 49050
2536 49050 16216 -38466 6533 78154 97749 165114 147763 74856 112776 123461 81026 145255
2524 145255 92470 -31382 -56503 -115897 -90936 -51275 -117391 -188023 -83364 -46734 -206039
2513 -206039 -213543 -183159 -79706 -52553 -4744 -26056 -119458 -69012 -44755 -5575 101625
2502 101625 -10319 -28849 1675 -90077 -84956 -70403 88124 159854 110466 27678 -18317
2491 -18317 41091 95739 25441 -10656 -63198 -61739 18980 53333 35897 57643 66673 70956
2479 70956 71095 20939 -27994 -34827 30861 762 -41182 -23552 -71117 -96840 -62876 -51432
2467 -51432 -49223 -41168 -80432 -61779 -32199 29930 -24362 1607 -20344 9221 -25859 -112020
2455 -112020 -128372 -93152 3985 38504 48113 138875 96613 68853 68369 101760 115738 42471
2443 42471 30291 53413 97513 72861 -27200 -95663 -101472 43409 24841 26467 40571 37696
2431 37696 117008 96327 130733 127266 104644 48915 50185 139962 103055 33016 64727 17221
2419 17221 16091 9711 8744 -22834 -4582 -103325 -160776 -116586 -84329 -104817 831 54346
2407 54346 41897 44789 29763 -18674 -84502 -68337 -49700 -70485 -46542 -36901 -4420 -62855
2395 -62855 -35831 51135 -53819 -192860 -241423 -180698 -87119 -2441 52500 65471 16539
2384 16539 -127169 -163257 -120227 -39134 90662 43828 -12951 -37172 -86759 -34168 12243
2373 12243 66195 61707 72276 88504 161053 189423 130630 -11090 -71170 20430 37022 6475
2361 6475 47878 -1627 -76272 -69758 -45571 -12731 -115676 -153410 -26908 35077 35512 -44475
2349 -44475 -121139 -93241 -46807 39400 65458 97831 92894 67213 39700 141450 89774 -48823
2337 -48823 -78960 -80809 -36988 -1800 50068 27369 -96409 -126078 -71975 81136 76188 21843
2325 21843 40528 -2068 -27631 -32845 41571 30252 16330 60067 94592 37310 -3645 -165949
2313 -165949 -270608 -207327 -88377 -80334 -27609 75427 79941 -17786 -44927 101612 139610
2302 139610 52316 68370 66831 62198 129239 95658 88357 14442 -17166 12593 71917 -14605
2290 -14605 9800 1521 -51183 -38979 -20628 -73138 -1175 79591 84918 46152 1379 8915
2278 8915 23970 41043 20600 -73942 -58063 -129089 -199079 -135179 -63727 -17027 -105063 -101762
2266 -101762 11814 23711 43710 41035 -28490 -17427 37853 73633 -1123 -72068 -78331 -70144
2254 -70144 -123206 -184354 -222225 -249594 -187643 -42556 57098 56130 26056 -20415 -7416 -20075
2242 -20075 -66071 -39048 21046 52273 39938 88191 40114 -87811 -169834 -139270 -92167 14146
2230 14146 48476 113706 121229 120743 62389 120464 145414 108647 79790 19833 11583 66628 3157
2217 3157 34048 30139 -30522 -68666 -4390 15513 106670 127841 214820 238074 131524 84927
2205 84927 36959 23319 58952 178086 141851 35362 -101721 -94336 -83921 -26832 1315
2194 1315 -24707 -119211 -144847 -46780 -100524 -124872 -100814 -47999 -117249 -162478 -149813 59724
2182 59724 54642 -84355 -95196 -123373 -145055 -58002 13487 -1993 67268 180243 172430 122604
2170 122604 60129 86019 116118 86838 22222 53082 118387 33958 60464 30970 101143 133288
2158 133288 22004 -49461 50598 142132 194798 94628 15567 46249 -25725 -9510 44142
2147 44142 -18886 -60450 -24733 -3561 -34119 19640 2973 -68801 -88193 -101909 -72046 -5073
2135 -5073 8002 11825 62325 117404 67769 68280 70292 50973 -2852 -67308 -41288 -6196 -2276
2122 -2276 63288 65591 -74384 -92522 26804 153650 105042 -36392 -414 -47744 38218
2111 38218 94104 100474 213240 115231 -103759 -145287 -130325 -145305 -218864 -149713 -16741
2100 -16741 -119149 -92597 -81722 -81079 3980 99459 56446 21628 -37676 12121 -31926 -8310
2088 -8310 14531 -49028 -85745 -26279 -39431 -55889 -42577 -134166 -187782 -81394 -121948 -153148
2076 -153148 -212862 -176030 -157017 -130240 -54676 29287 14825 49363 79876 17694 37689 18191
2064 18191 157523 187944 266867 267060 257762 255098 206766 90141 6280 -88423 -78607 -30837
2052 -30837 81517 79761 -25457 4655 43021 31757 17441 -87515 -137919 -201459 -197930 -121295
2040 -121295 -102430 -84659 -81564 -130233 -208960 -133436 -6431 -13763 -99884 1737 -7370 -135732
2028 -135732 -85780 -75963 -42987 29473 -6977 -64131 -207273 -178178 -77573 27132 83114
2017 83114 39120 -47145 -159975 -78928 39560 119846 144809 36814 -75142 -11638 2254
2006 2254 -15749 -47643 -31018 -3736 -82414 -183648 -36988 40549 28362 -23317 -101408 -42294
1994 -42294 -30351 -4948 -9442 -15184 -5017 17726 44074 122788 65487 51009 -41282 -12110
1982 -12110 26107 -20301 17092 62806 4238 -52603 -99819 -89976 36536 103139 46006 -35041
1970 -35041 -81804 4464 92154 52296 21707 3922 -60268 -88936 -48167 1822 -18163 -1346
1958 -1346 96630 123217 80962 54622 -11061 -106824 -122026 -117928 -87020 -30676 -21955 -57412
1946 -57412 -27898 93426 99236 39554 -10029 39626 104829 121255 130543 161432 167668 143878
1934 143878 73737 48650 -40651 -74924 42747 75263 44200 -5714 -56113 -86970 -13821
1923 -13821 27512 -65656 21301 95003 65064 22785 -11756 -81289 -105064 -53887 96737 152504
1911 152504 77353 -1337 -58475 -73910 23285 66730 -26323 -14159 -51222 -126715 -83670 -43569
1899 -43569 -108230 -86362 -68013 44407 -41508 -204951 -172945 -84835 -89244 -161525 -201694 -97481
$$ [...]
##END NTUPLES=NMR SPECTRUM
##END=
