##TITLE=Analysis number 328540
Compound Code cc 62046
Book Reference 511/138
Project Code adrs
Chemist Name stevem
##JCAMPDX= 6.0         $$ Bruker NMR JCAMP-DX V2.0
##DATA TYPE= NMR SPECTRUM
##DATA CLASS= NTUPLES
##ORIGIN= Bruker BioSpin GmbH
##OWNER= nmr
$$ XWIN-NMR		Version 3.5
$$ Thu Jun 14 09:40:33 2007 GMT Daylight Time (UT+1h)  MAYBRIDGE\nmr@NMR_250MHZ
##.OBSERVE FREQUENCY= 250.131544655141
##.OBSERVE NUCLEUS= ^1H
##.ACQUISITION MODE= SIMULTANEOUS (DQD)
##.ACQUISITION SCHEME= undefined
##.AVERAGES= 16
##.DIGITISER RES= 18
##SPECTROMETER/DATA SYSTEM= dpx250
##.PULSE SEQUENCE= zg30
##.SOLVENT NAME= CDCl3
##.SHIFT REFERENCE= (INTERNAL, CDCl3, 0, 16.3928)
##AUDIT TRAIL= $$ (NUMBER, WHEN, WHO, WHERE, WHAT)
$$ ##TITLE= Audit trail, XWIN-NMR		Version 3.5
$$ ##JCAMPDX= 5.01
$$ ##ORIGIN= Bruker BioSpin GmbH
$$ ##OWNER= nmr
$$ C:\u/data/dgb/nmr/ADRS/860/pdata/1/auditp.txt
$$ ##AUDIT TRAIL=  $$ (NUMBER, WHEN, WHO, WHERE, WHAT)
(   1,<2007-06-14 09:39:56.12 +100>,<MAYBRIDGE\nmr>,<NMR_250MHZ>,
      <created by zg, POWCHK disabled, PULCHK disabled
       configuration hash MD5:
       76 6E 9A 78 1E 09 19 81 EC 84 63 8F B0 6A 59 2D
       data hash MD5: 64K
       39 20 D3 EC 23 D9 0F 5E BA 79 9C 5C 13 11 74 0D>)
(   2,<2007-06-14 09:40:12.06 +100>,<MAYBRIDGE\nmr>,<NMR_250MHZ>,
      <Start of raw data processing
       ef LB = 0.3 FT_mod = 6 PKNL = 1 SI = 32K 
       data hash MD5: 32K
       90 CD 27 E5 0C B6 A5 CD 25 65 D4 4B 8D 1B 8C A4>)
(   3,<2007-06-14 09:40:16.79 +100>,<MAYBRIDGE\nmr>,<NMR_250MHZ>,
      <apk 
       data hash MD5: 32K
       8A 7F 5B 2B 5A F0 46 D0 34 BD 75 F9 7B 59 BB F9>)
(   4,<2007-06-14 09:40:18.42 +100>,<MAYBRIDGE\nmr>,<NMR_250MHZ>,
      <abs ABSG = 5 
       data hash MD5: 32K
       F8 97 97 07 94 76 F5 23 F6 42 76 A5 A5 EB ED 50>)
$$ ##END=
$$ 
$$ hash MD5
$$ F0 5E 2B BB FC D3 72 73 54 88 CA 5C B3 66 6E 40
##$RELAX= 
##$RELAX= 
##$RELAX= 
##$RELAX= 
##$RELAX= 
##$RELAX= 
##$RELAX= 
$$ Bruker specific parameters
$$ --------------------------
##$DU= <C:\u>
##$EXPNO= 860
##$NAME= <ADRS>
##$PROCNO= 1
##$TYPE= <nmr>
##$USER= <dgb>
##$AMP= (0..31)
100 100 100 100 100 100 100 100 100 100 100 100 100 100 100 100 100 100 
100 100 100 100 100 100 100 100 100 100 100 100 100 100 
##$AQSEQ= 0
##$AQ_mod= 3
##$AUNM= <au_zg>
##$AUTOPOS= <4 >
##$BF1= 250.13
##$BF2= 250.13
##$BF3= 250.13
##$BF4= 250.13
##$BF5= 500.13
##$BF6= 500.13
##$BF7= 500.13
##$BF8= 500.13
##$BYTORDA= 1
##$CFDGTYP= 0
##$CFRGTYP= 5
##$CHEMSTR= <none>
##$CNST= (0..31)
1 1 145 1 1 1 1 1 1 1 1 1 1 1 1 1 1 1 1 1 1 1 1 1 1 1 1 1 1 1 1 1 
##$CPDPRG= <>
##$CPDPRG1= <>
##$CPDPRG2= <>
##$CPDPRG3= <>
##$CPDPRG4= <mlev>
##$CPDPRG5= <mlev>
##$CPDPRG6= <mlev>
##$CPDPRG7= <mlev>
##$CPDPRG8= <mlev>
##$CPDPRGB= <>
##$CPDPRGT= <>
##$D= (0..31)
0 1 0 0 0 0 0 0 0 0.06 0 0 0 0 0 0 0.0002 0 0 0 0 0 0 0 0 0 0 0 0 0 0 
0 
##$DATE= 1181810394
##$DBL= (0..7)
120 120 120 120 120 120 120 120 
##$DBP= (0..7)
150 150 150 150 150 150 150 150 
##$DBP07= 0
##$DBPNAM0= <>
##$DBPNAM1= <>
$$ [...]
##$SUBNAM7= <"">
##$SUBNAM8= <"">
##$SUBNAM9= <"">
##$SW= 20.6930455092707
##$SWIBOX= (0..15)
0 0 3 0 0 0 0 0 0 0 0 0 0 0 0 0 
##$SW_h= 5175.983436853
##$TD= 65536
##$TD0= 1
##$TE= 297.16
##$TE2= 300
##$TE3= 300
##$TEG= 300
##$TL= (0..7)
0 120 120 120 120 120 120 120 
##$TP= (0..7)
150 150 150 150 150 150 150 150 
##$TP07= 0
##$TPNAME0= <>
##$TPNAME1= <>
##$TPNAME2= <>
##$TPNAME3= <>
##$TPNAME4= <>
##$TPNAME5= <>
##$TPNAME6= <>
##$TPNAME7= <>
##$TPOAL= (0..7)
0.5 0.5 0.5 0.5 0.5 0.5 0.5 0.5 
##$TPOFFS= (0..7)
0 0 0 0 0 0 0 0 
##$TUNHIN= 0
##$TUNHOUT= 0
##$TUNXOUT= 0
##$USERA1= <user>
##$USERA2= <user>
##$USERA3= <user>
##$USERA4= <user>
##$USERA5= <user>
##$V9= 5
##$VALIST= <valist>
##$VCLIST= <CCCCCCCCCCCCCCC>
##$VD= 0
##$VDLIST= <DDDDDDDDDDDDDDD>
##$VPLIST= <PPPPPPPPPPPPPPP>
##$VTLIST= <TTTTTTTTTTTTTTT>
##$WBST= 1024
##$WBSW= 4
##$XGAIN= (0..3)
0 0 0 0 
##$XL= 0
##$YL= 0
##$YMAX_a= 295625
##$YMIN_a= -375667
##$ZGOPTNS= <>
##$ZL1= 120
##$ZL2= 120
##$ZL3= 120
##$ZL4= 120
##$ABSF1= 16.39282
##$ABSF2= -4.30035
##$ABSG= 5
##$ABSL= 3
##$ALPHA= 0
##$AQORDER= 0
##$ASSFAC= 0
##$ASSFACI= 0
##$ASSFACX= 0
##$ASSWID= 0
##$AUNMP= <proc_1d>
##$AZFE= 0.1
##$AZFW= 0.1
##$BCFW= 0
##$BC_mod= 0
##$BYTORDP= 0
##$COROFFS= 0
##$CY= 12.5
##$DATMOD= 1
##$DC= 0
##$DFILT= <>
##$DTYPP= 0
##$F1P= 14.0000005364418
##$F2P= -0.99999901652339
##$FCOR= 0.5
##$FTSIZE= 32768
##$FT_mod= 6
##$GAMMA= 0
##$GB= 0
##$INTBC= 1
##$INTSCL= 1
##$ISEN= 128
##$LB= 0.3
##$LEV0= 0
##$LPBIN= 0
##$MAXI= 10000
##$MC2= 0
##$MEAN= 0
##$ME_mod= 0
##$MI= 0
##$NCOEF= 0
##$NC_proc= -3
##$NLEV= 6
##$NOISF1= 0
##$NOISF2= 0
##$NSP= 0
##$NTH_PI= 0
##$NZP= 0
##$OFFSET= 16.39282
##$PC= 1
##$PHC0= -55.67855
##$PHC1= 5.695929
##$PH_mod= 1
##$PKNL= yes
##$PPARMOD= 0
##$PSCAL= 4
##$PSIGN= 0
##$REVERSE= no
##$SF= 250.130032309028
##$SI= 32768
##$SIGF1= 0
##$SIGF2= 0
##$SINO= 400
##$SIOLD= 32768
##$SREGLST= <1H.CDCl3>
##$SSB= 0
##$STSI= 32768
##$STSR= 0
##$SW_p= 5175.98343685301
##$SYMM= 0
##$S_DEV= 0
##$TDeff= 65536
##$TDoff= 0
##$TI= <Analysis number 999999
Compound Code 99
Book Reference 9
Project Code 9>
##$TILT= no
##$TM1= 0
##$TM2= 0
##$TOPLEV= 0
##$USERP1= <user>
##$USERP2= <user>
##$USERP3= <user>
##$USERP4= <user>
##$USERP5= <user>
##$WDW= 1
##$XDIM= 32768
##$YMAX_p= 347957479
##$YMIN_p= -50245
$$ End of Bruker specific parameters
$$ ---------------------------------
##NTUPLES= NMR SPECTRUM
##VAR_NAME=  FREQUENCY,     SPECTRUM/REAL,   SPECTRUM/IMAG
##SYMBOL=    X,             R,               I
##VAR_TYPE=  INDEPENDENT,   DEPENDENT,       DEPENDENT
##VAR_FORM=  AFFN,          ASDF,            ASDF
##VAR_DIM=   32768,         32768,           32768
##UNITS=     HZ,            ARBITRARY UNITS, ARBITRARY UNITS
##FACTOR=    0.157963299565203, 1,           1
##FIRST=     4100.33668585176, 0,            0
##LAST=      -1075.64675100125, 0,           0
##MIN=       -1075.64675100125, -50245,      0
##MAX=       4100.33668585176, 347957479,    0
$$ Real data points
##PAGE= N=1
##DATA TABLE= (X++(R..R)), XYDATA
$$ [...]
16369f425j5332j4773K011L869p913j309J0105Q938K698Q310J1196K165p013m08
16355c881P588k492p308l342M759Q565k754n999p187K212N440k942k763k287p868
16340b0259J1233J0185M713K554j1071k148J860m563j790J793n951N248J3065
16327D869L027N482o715j7917o625R172p573j4792k802O819J9400J1644l382l451
16313b844J2338m851k2553n504Q526R055J857K191r134K976L745j0587r323M459
16299a9649J6579Q127p704n312O42j743P88K337M02J1588O046m030l264m56l610
16284G41j82K759j4796j0768n010L453J6645R604p284k4475L215J4589J0112j0938
16270a2335J945J0302K664L05J2577j94P488k693j622j0024l853O436m765l958
$$ plain form
16369 -6425 -21757 -36530 -34519 -30650 -38563 -39872 -29767 -20829 -18131 -9821 1375 3540 -3473 -3881
16355 -3881 3707 1215 -6093 -9435 -4676 3889 1135 -4864 -12051 -9839 -4399 -7341 -10104 -12391 -20259
16340 -20259 -9026 1159 5872 8426 -2645 -4793 -2933 -7496 -9286 -7493 -13444 -8196 4869
16327 4869 7896 13378 6663 -11254 -17879 -8707 -16280 -31072 -33874 -27055 -7655 3989 607 -2844
16313 -2844 9494 4643 -17910 -23414 -14888 -5833 -3976 -1785 -10919 -7943 -4198 -14785 -24108 -19649
16299 -19649 -3070 5057 -2647 -7959 -7317 -9060 -8272 -5935 -5533 6055 12101 8071 4807 4351 741
16284 741 559 3318 -11478 -22246 -27256 -23803 -7158 2446 -4838 -29313 -26098 -11509 -1397 -12335
16270 -12335 -10390 -88 2576 2881 15458 15264 22752 20059 18437 8413 4560 10996 6231 2273
16256B273N19J3600R807o218j8405M059L715M430R768O110j0213j5495r838j2055
16242a7943M19J2980J2738j2192k418R657j346n409q850n826N377J891J0162L577
16228B817N779J5360j7303j1281k923m310o561k2K040M228J0065P561l750j603
16214I7M451j1133j4949m244J3429J3401N204k442o499k106j106j2197k552m477
16200b5123o97J1715K145J788l653N408O569j1864j238L384R810q407J1050J5187
16186A6074j8618k3850r977k519J1136J6049J1655m892M89j5071j616r08n136
16173b7184m266K249L071O878n71K577L592J9925R62L064j3277P20j1353j5615
16159b9228r173o141J8492R152k571R166j731J164Q3n993M38J7241N831o119k802
$$ plain form
16256 2273 2792 16392 26199 19981 1576 5635 9350 13780 23548 29658 19445 3950 -5888 -17943
16242 -17943 -17524 -4544 8194 -3998 -6416 3241 1895 -3514 -12364 -18190 -12813 -10922 -760 2817
16228 2817 8596 23956 6653 -4628 -7551 -11861 -18422 -18444 -16404 -12176 -2111 5450 1700 97
16214 97 4548 -6585 -21534 -25778 -12349 1052 6256 3814 -2685 -4791 -5897 -18094 -20646 -25123
16200 -25123 -25820 -14105 -11960 -10172 -13825 -8417 -1848 -13712 -14950 -11566 -1756 -10163 887 16074
16186 16074 -2544 -26394 -36371 -38890 -27754 -11705 -50 -4942 -4453 -19524 -21140 -22048 -27184
16173 -27184 -31450 -29201 -26130 -19252 -19823 -17246 -13654 6271 7233 10297 -2980 -2260 -13613 -29228
16159 -29228 -38401 -44542 -26050 -16898 -19469 -10303 -12034 -10870 -10787 -16780 -16342 899 6730 611 -2191
16144b191O174j0717j7901K97J735P59l219L22k918M961n948N92J3254l879Q381
16129a0298p801P4J609q47q70j3310L16Q892K569l519P931j582Q361P100L985
16114B610M130m906j2333p743P282l083j7212J1876R168j4404J4193O378Q933
16101D889M868j5317q493J3622p439N461N561J5630L680j3299L314j2038k490
16088b051P353q333O773R950l608J125o99l897L981J1691j948j5349r425O351
16074A914p216j5102M593J3855P977q133N067R338k42k481m116M296Q873M024
16060B2647k1760j3967N691J9803J092L20o946m186j1460p828j945o339J2529
16047a2349J7426P603N272p937r505J971n298k6476k342J165J0684P644j1554
$$ plain form
16144 -2191 3983 -6734 -24635 -24338 -22603 -21844 -25063 -24741 -27659 -22698 -28646 -28054 -14800 -18679 -10298
16129 -10298 -18099 -18025 -16416 -17263 -18133 -31443 -31127 -22235 -19666 -23185 -15254 -16836 -8475 -1375 2610
16114 2610 6740 1834 -10499 -18242 -10960 -14043 -31255 -19379 -10211 -24615 -10422 -4044 4889
16101 4889 9757 -5560 -14053 -431 -7870 -2409 3152 18782 22462 9163 12477 439 -2051
16088 -2051 5302 -3031 3742 13692 10084 11209 10510 6613 10594 22285 20337 4988 -4437 1914
16074 1914 -5302 -20404 -15811 -1956 6021 -2112 2955 12293 12051 9570 5454 9750 18623 22647
16060 22647 887 -13080 -7389 12414 13506 13826 6880 2694 -8766 -16594 -18539 -24878 -12349
16047 -12349 5077 12680 17952 10015 510 2481 -2817 -29293 -31635 -30470 -19786 -12142 -23696
16034b3696P956J426n646L909J1079N102P892j5476J0597J677L188N329j0378
16021B959j2048n042jn756m646L526L178Q21J3865K0195o708k977o0r455N77o826
16005h398j1205J341J5553L744j0914j659P60O250k349L319R01J2457M022l203
15991A0619j9388N869K494j1843J360j099l92J0754j2835O31L047K680p461o480
15977b2044j0078n242Q512J8349n797j3621Q612Q464q749j940J1115J1266r730
15964a0883L401M178j2339n096O507Q719N032j909l528r709m031Q333J5028M778
15950H481J0906m877j2996j3454J004J0102j327k522j0007j965O375Q925j74r886
15936a1415M526k019M878J9882M308j8220n661o645M527J4503l167j46P162J1940
$$ plain form
16034 -23696 -15740 -14314 -19960 -16051 -4972 130 8022 -7454 3143 4820 8008 13337 2959
16021 2959 -9089 -14131 -14132 -19888 -24534 -21008 -17830 -17009 -3144 17051 10343 7366 7306 -2149 -1572 -8398
16005 -8398 -19603 -18262 -2709 1035 -9879 -11538 -10778 -4528 -6877 -3558 -2657 9800 13822 10619
15991 10619 -8769 -2900 -406 -12249 -10889 -11988 -12380 -1626 -14461 -13830 -10783 -8103 -15564 -22044
15977 -22044 -32122 -37364 -28852 -10503 -16300 -29921 -21309 -12845 -21594 -23534 -12419 -1153 -10883
15964 -10883 -7482 -3304 -15643 -20739 -14232 -5513 -481 -2390 -5918 -15627 -19658 -11325 3703 8481
15950 8481 19387 14510 1514 -11940 -10936 -834 -2161 -4683 -14690 -16655 -10280 -1355 -1529 -11415
15936 -11415 -6889 -8908 -4030 15852 20160 1940 -3721 -10366 -5839 8664 5497 5351 12513 24453
15922B4453M904k363r436o661J3123N588k1160r7J4421l587n011j2250k366Q800
15908H358M015q113o724Q938L506j0555k418r555M093O999l195m51l573M491L253
15893i31k596P58j132j0805j6036L345k341R610J555r05Q980O433L373l21J382
15878C69P498N012J1209J282j0714j3100P326j7211r116M199J8893O863m731j1564
15864c785J0073K2542P70l635j2454j0865l32o217J1346P581l196j427p766j6949
15850a4314m003L434j5285o317J2913l506O420N23L41m535O281J776M602J5081
15836C411J3065j443R955q66j0077k3535O04J0344J3055P303m625l246m269j2565
15822b889N193j2207P600P531R398q142o167M801k558M229J767k660r519k271
$$ plain form
15922 24453 29357 26994 17558 10897 24020 29608 8448 8351 22772 19185 14174 1924 -442 8358
15908 8358 12373 4260 -2464 6474 9980 -575 -2993 -12548 -8455 -1456 -4651 -5102 -8675 -4184 -931
15893 -931 -3527 -2769 -3901 -14706 -30742 -27397 -29738 -20128 -18573 -19478 -10498 -4065 -692 -1013 369
15878 369 7867 12879 24088 25370 14656 1556 8882 -8329 -17445 -13246 5647 12510 7779 -3785
15864 -3785 6288 28830 29600 25965 13511 2646 2314 -3903 7443 15024 11828 10401 2635 -14314
15850 -14314 -18317 -14883 -30168 -36485 -23572 -27078 -20658 -20135 -19794 -24329 -18048 -16272 -11670 3411
15836 3411 16476 15033 24988 24122 14045 -9490 -8886 1458 14513 21816 17191 13945 9676 -2889
15822 -2889 2304 -9903 -2303 5228 14626 6484 317 5118 2560 6789 8556 5896 -3623 -5894
15808e894Q875k97N783j716j258O380j1626j2450O291J1005M27n719n204L231
15794b172n399n347O642J726M112j1699j1475n711P547O441q55K526j125q87O183
15779i493P577O380Q507n13n683P521M608j2957j3358O151k744m308n027P134
15765f205K2358K5261L928j7474j5788j6330m418l213n951L842L214J0213K002
15752A439j0194m39j3877n080J1560R943m917n968O913k013p430K7J285l111P271
15737a4591R86J0169N318r455j3122L57K852O247J0089L558p84r586p238P264
15723g936J9683J1565j2951q680p810O41M414K723r66J6817k474q90J566O875
15709B2577N173j3596P68Q658m680q862p50q17m024j537R00O409O89j5294j3343
$$ plain form
15808 -5894 2981 2684 8467 6751 5493 11873 247 -12203 -5912 5093 5520 -199 -5403 -2172
15794 -2172 -7571 -12918 -6276 -4550 -438 -12137 -23612 -29323 -21776 -15335 -16190 -13664 -14789 -15676 -9493
15779 -9493 -1916 4464 12971 12458 6775 14296 18904 5947 -7411 -1260 -4004 -8312 -13339 -6205
15765 -6205 16153 41414 45342 27868 12080 -4250 -8668 -11881 -17832 -13990 -10776 -563 1439
15752 1439 -8755 -9194 -23071 -28151 -16591 -6648 -11565 -17533 -10620 -12633 -20063 -20036 -18751 -21862 -14591
15737 -14591 -13605 -3436 1882 -7573 -20695 -20338 -17486 -11239 -1150 2408 1624 -7962 -15200 -7936
15723 -7936 11747 23312 10361 1681 -6129 -5488 -1074 1649 683 17500 15026 14136 15702 22577
15709 22577 27750 14154 14922 23580 18900 10038 9288 8471 4447 2910 3810 10219 10908 -4386 -17729
15694a7729N019J534J1927J8466J63q184N951k615k018J3440k78j6425k437J73
15680F987l235j4302n141R70Q718M451l633J288q5P574Q874k839K617q92p955
15665C397j220O600M043j4903j0778L728q899K847J2778P572J0741l724l544O36
15651I274J2093j388k721l762r66K838N937J5430k723K79r214p813q497R80P370
15636A7117k732j1256p795P451j019k300O65O815O082o275l825O16M793k589j872
15621C876Q221J0598M807o365k1444j1344Q70L631P777j935K378J1428M831p553
15607I776n857j6782j0706J0537J1628l079j679j1831J0275J9805J181j969j0701
15594E98l904k093m661j5035N870O650k806o906J7440N181J3809M229j8543o162
$$ plain form
15694 -17729 -12710 -11176 751 19217 19380 11196 17147 14532 12514 25954 25676 9251 6814 6987
15680 6987 3752 -10550 -15691 -14721 -6003 -1552 -5185 -3897 -3982 3592 12466 9627 12244 11352 3397
15665 3397 2177 8777 12820 -2083 -12861 -9133 -18032 -15185 -2407 5165 15906 12182 8638 9274
15651 9274 21367 19979 17258 13496 12530 15368 21305 36735 34012 34291 25077 17264 8767 9747 17117
15636 17117 14385 3129 -4666 2785 1766 -534 131 6946 13028 6753 2928 3544 8337 5748 3876
15621 3876 12097 22695 27502 21137 -307 -11651 -10781 -7150 627 -1308 1070 12498 17329 9776
15607 9776 3919 -12863 -23569 -13032 -1404 -4483 -6162 -17993 -7718 12087 13268 11299 598
15594 598 -3306 -5399 -10060 -25095 -19225 -12575 -15381 -22287 -4847 334 14143 18372 -171 -6333
15580f333N328J430j990K81j8181m867O076k224n759R634J3209J1931j52m081
15566D302K693Q035m445k3144j2095J1822p88M575K0000l075n640p345K009J421
15552a675J4938M084o363l580P520N847m157n829n924M14M5M251j181o542P288
15537I136o683K162j1393p674J1871J3677m455j3018p874L698O258k802J790m88
15523e795P907L644J1023J5751J0967k1343r926J968j435q71m344p853j0216N492
15509e031j514J0315j709j554n967l382K899M019Q69J0867Q785j0961j7289m375
15495a4028J0989L349o802o986N594P616J0r174Q948K608n852Q058p825l616J2539
15480E428P958J2396m117j0619M701j0698o736r462R33m482J1060J6270j3808
$$ plain form
15580 -6333 -1005 425 -1565 -1284 -19465 -24332 -18256 -20480 -26239 -16605 -3396 8535 8383 4302
15566 4302 6995 15030 10585 -12559 -24654 -12832 -13620 -9045 10955 7880 2240 -5105 -3096 -1675
15552 -1675 13263 17347 10984 7404 14924 20771 16614 10785 4861 5275 5320 9571 8390 1848 9136
15537 9136 2453 4615 -6778 -14452 -2581 11096 6641 -6377 -14251 -10553 -4295 -7097 -5307 -5795
15523 -5795 2112 5756 16779 32530 43497 22154 12228 14196 12761 11890 7546 -307 -10523 -5031
15509 -5031 -6545 3770 2061 507 -5460 -8842 -5943 -1924 -1055 9812 18597 7636 -9653 -14028
15495 -14028 -3039 310 -6492 -13478 -7884 -268 -258 -9432 -484 2124 -3728 4330 -3495 -7111 5428
15480 5428 13386 25782 21665 11046 15747 5049 -1687 -11149 -10216 -14698 -3638 12632 -1176
15467a176r061O025j609n118k693J1098N554J660j0919M086k521j014o33j978
15453h299M355j268n067J2125P122n930j0585j5350j5639R23Q012L247j7140M714
15439c8780R038Q837k613J2910Q369J127k209Q732P296l384j1559j8306R163J6153
15425D774K189O430q734k068J4181J246j5063j4526O573L47J4171K608j2284j2730
15411a2886p373N374l974l589Q057J7064K513N146k824J662N398p766K523j0370
15397a045L840M167r772J161O952J1068N986j3865j0139Q884o483N27m629M655
15383A307J398M035k874J905P181J0054P963J5321p155j5601n933J3986Q522K356
15369D2465J062o754j1792l368r575m679k0214j3237J4316R096m52k024J2852
$$ plain form
15467 -1176 -10237 -4212 -5821 -10939 -13632 -2534 3020 4680 -6239 -2153 -4674 -5688 -6321 -8299
15453 -8299 -3944 -5212 -10279 1846 8968 3038 -7547 -22897 -38536 -37613 -29601 -26354 -43494 -38780
15439 -38780 -29742 -20905 -23518 -10608 -2239 -1112 -3321 5411 12707 9323 -2236 -20542 -11379 4774
15425 4774 6963 13393 4659 2591 16772 18018 2955 -11571 -4998 -4651 9520 12128 -156 -12886
15411 -12886 -20259 -14885 -18859 -22448 -14391 2673 5186 10332 7508 9170 14568 6802 9325 -1045
15397 -1045 2795 6962 -2810 -1649 5303 16371 22357 8492 -1647 7237 754 1281 -3348 1307
15383 1307 2705 6740 3866 5771 12952 23006 30969 46290 39135 23534 17601 31587 40109 42465
15369 42465 43527 36773 24981 21613 12038 7359 -12855 -26092 -11776 -2680 -3132 -5156 7696
15356G696M65J2829M836j2428p480o068l472q387J6199O192m649n608k421R37
15342a359J339O560K6k841p569J3912R592m728j1030j3785j223o819O154Q105
15328c666K594L331o882K278M067J6271p657l713O916k024J99j8769j0947P953
15314a0049J6172K584j1518l2n907P89J5949P092L747j0199N145q436P39N626
15300A1702M26L864m716j409j4571L382P611j410q868J1568P369o877m130M598
15286H539L347r55j5293n172L873J0551K78j3236L791J146n786q30Q470Q358m227
15271B854j583j7558R32J0909R750N299j3103k2215j645J4653P575n58J1128K189
15257H627j2672n647J0191m580o08K34L392P814L889m251j1994L232n562O562
$$ plain form
15356 7696 8161 20990 25826 13398 5918 -150 -3622 -12009 4190 10382 5733 125 -2296 -1359
15342 -1359 -20 6540 6566 3725 -3844 10068 19660 14932 3902 -9883 -11106 -17925 -11771 -3666
15328 -3666 -1072 2259 -4623 -2345 1722 17993 10336 6623 13539 11515 11714 -7055 -18002 -10049
15314 -10049 6123 8707 -2811 -2843 -8750 -7961 7988 15080 18827 8628 13773 5337 6076 11702
15300 11702 12128 15992 11276 9867 -4704 -1322 6289 4879 -3989 7579 14948 8071 3941 8539
15286 8539 11886 10931 -4362 -9534 -5661 4890 5168 -8068 -4277 -3131 -8917 -9747 -1277 7081 2854
15271 2854 1271 -16287 -15355 -4446 5304 10603 -2500 -24715 -26360 -11707 -4132 -4690 6438 8627
15257 8627 -4045 -9692 499 -4081 -4689 -4455 -1063 6751 10640 6389 -5605 -2373 -7935 -1373
15243a373k327J0385m988n593L238j964M66Q691P475M645R164l901p675M642n16
15228B0369k0133j2489k082K702k127n446j1900J3502J8386k088k6604P814J0056
15215a0040m517P170Q418J030k045P982P513J8597K14j0376j3535j2081l304J1008
15201F034k000l903k235L302k913K138N231O978j4420r627P707M169J38N0j0751
15186a0102m399M86M067j107j295L070j4658j5038J0675J7377J348J0613k843
15173a806l46j179O38J5255J4963K091l811m088q8O775j4113o701o586l791m466
15158g253n137l671q49O073J4399q17J814P826j0638j3410Q100J486J8474J667
15144A8064o316j502k309Q996j19k0957j4338J6246K909Q222P271j077j162o28
$$ plain form
15243 -1373 -3700 6685 1697 -3896 -658 -2622 -2156 6535 14010 18655 27819 23918 16243 20885 20369
15228 20369 236 -12253 -14335 -11633 -13760 -19206 -31106 -17604 782 -1306 -27910 -20096 -10040
15215 -10040 -14557 -7387 1031 2061 16 7998 15511 34108 34322 23946 10411 -1670 -4974 6034
15201 6034 4034 131 -2104 1198 -1715 423 5654 12632 -1788 -11415 -3708 461 599 649 -10102
15186 -10102 -14501 -14015 -9948 -11055 -12350 -9280 -23938 -38976 -28301 -10924 -9576 1037 -1806
15173 -1806 -2152 -3331 -2693 12562 27525 29616 25805 21717 21629 28404 14291 7590 1004 -2787 -7253
15158 -7253 -12390 -16061 -16910 -10837 3562 2745 4559 12385 1747 -11663 -3563 -2077 16397 18064
15144 18064 11748 10246 7937 16933 16814 -4143 -18481 -2235 674 8896 16167 15090 13928 13300
15130A3300k9R549J24j7358j3072K90R2N271J0042j570k283j444K454L219K80
15115H865o346p914l957K959J6734R298l970O509q580j4727l094K898L568m659
15101b416j439j566k105J2881O869L50j0592J064j806p536J0825J4587J3046K360
15087C4522j1233o47Q342J794j7948k4896l019K5573Q904k1770j6895q78O23M442
15073a3086O642M726K391N219O40P62K19J546K040r476j1832N918P093m74R920
15058A2248M926q338j0466J2902N469j1546p266q469j3034m518J0766K1565L824
15045H063r875J4409N557l951Q59q423j7800K067N230M842J5667Q921n285j3661
15031F620k613l714l378J264O711N651N394q984n627q827o095J3175J2695n61
$$ plain form
15130 13300 13271 22820 22944 5586 -7486 -7196 -7104 -1833 8209 6639 4356 2912 5366 8585 8865
15115 8865 2519 -5395 -9352 -6393 10341 19639 15669 22178 13598 -1129 -4223 -1325 2243 -2416
15101 -2416 -3855 -5421 -7526 5355 12224 12574 1982 3046 1240 -6296 4529 19116 32162 34522
15087 34522 23289 22642 30984 32778 14830 -10066 -13085 12488 21392 -378 -17273 -18151 -17528 -13086
15073 -13086 -6444 -1718 673 5892 6532 7294 7513 9059 11099 1623 -10209 -4291 2802 2328 12248
15058 12248 17174 8836 -1630 11272 16741 5195 -2071 -10540 -23574 -28092 -17326 4239 8063
15045 8063 -1812 12597 18154 14203 15062 6639 -11161 -9094 -3864 978 16645 25566 20281 6620
15031 6620 4007 293 -3085 -1821 4890 10541 15935 6951 1324 -7503 -13598 -423 12272 11711
15017A1711J604N02p558P174K070k858N812j2532l402p143j056J3867r130j8798
15003a9737J540J3815K1720J6876k312j0023j6412n317J0676L80j2562o258j270
14990h884J8476J4502o083L652j0614L46m15N277K252j29J1080j311L650k1975
14976I824j1390m737k753K665R273n014N915L066L326K542J759j0640O20o151
14962a695n681r486J159R613M199O23l8O771m525j3300n892P286J1460o385j1325
14947a7216L965R261R005k379Q958R908J995Q90q989j3722M438J3488J1647j055
14933C0194p957j2250p923j00o740R303L341J1187n799j5831j5539J3143J8735
14920A3764n764l58K0297p77q883j1488r416l075P122L530N04p211M420K241L127
$$ plain form
15017 11711 13315 13817 6259 13433 15503 12645 18457 5925 2523 -4620 -5676 8191 -939 -19737
15003 -19737 -18197 -4382 17338 34214 31902 21879 5467 150 10826 11206 -1356 -7614 -8884
14990 -8884 9592 24094 18011 21663 11049 11395 10980 16257 18509 18380 29460 28149 31799 9824
14976 9824 -1566 -6303 -9056 -6391 2882 -2132 3783 6849 10175 12717 14476 3836 4456 -1695
14962 -1695 -7376 -16862 -15703 -6090 -1891 -1268 -1306 5465 940 -12360 -18252 -10966 494 -5891 -17216
14947 -17216 -13251 -3990 5015 2636 11594 21502 23497 24387 15398 1676 6114 19602 31249 30194
14933 30194 22237 9987 2064 1964 -4776 4527 7868 19055 13256 -2575 -18114 -4971 13764
14920 13764 8000 7642 27939 27162 18279 6791 -2625 -5700 1422 4952 5456 -1755 2665 4906 8033
14905H033O278l610j347K091m198L364o636j589p40M518p887j112M270j1471n082
14890a5118J7375J4300J0037P450k2414j5139Q8m324k945J7015L659L795J057
14877A4836O331j212r010j439l231k175J1715J6061l616j1422j177k154K023L879
14863A9409j1038Q421K512N48j1594o408P624l826j0742o669J2296o84o813J3075
14849F111M116r818Q274j732l091J673Q670J2737m054P778j0264j0511l147q923
14835b181M478l1l850J6061O331j7961p484J2872j794J863L146m001N344j872
14821A0921K131L551l73j7368j7906P379R680R583j1960J2277J7088N20K567O455
14807C4545j1163j188m262r340O338N75q563n511J6042O806j9406j3704M99Q123
$$ plain form
14905 8033 14311 10701 9354 11445 7247 10611 3975 2386 1646 6164 -1723 -2835 1435 -10036 -15118
14890 -15118 2257 16557 26594 34044 11630 -3509 -3421 -7745 -10690 6325 9984 13779 14836
14877 14836 21167 19955 10945 9506 6275 4100 15815 31876 28260 16838 15661 13507 15530 19409
14863 19409 8371 16792 19304 19852 8258 1850 9474 5648 -5094 -11763 533 -151 -6964 6111
14849 6111 10227 409 8683 6951 3860 5533 14203 26940 22886 30664 20400 9889 6742 -2181
14835 -2181 2297 2266 -1584 14477 20808 2847 -4637 8235 6441 8304 11450 7449 12793 10921
14821 10921 13052 16603 16230 -1138 -19044 -11665 -1985 7598 -4362 7915 25003 25523 28090 34545
14807 34545 23382 22194 17932 8592 14930 15505 6942 1431 17473 24279 4873 -8831 -8332 -209
14793b09O037Q842J3280q33m077R153k446j953o485j6100M663O340J2744Q203
14779C7159M13n617j0010K022N136N581R512j2382r336k4563l547K4449P594P200
14765C3611n47j9689j4267k128k025Q138N463o19K267j3307Q570Q66m469J2167
14751A4031J444N803J0148M780J292m166j0251m791L873P720q419Q767J0703r76
14737C9958n96j311m873n4M953k655j4330j3513J532J8560P083L438l481r194
14723B5517R285Q758j400P281P991j0124j2802L945Q967O111l935J0371J2256
14710G2221K4395M1949M7058Q1810J04136J25259J42513P5975n0109j43008j62597
14699C59602j16367o8066m8376k9321r307j4077j5295j4002q648p658k75J066
$$ plain form
14793 -209 5828 14670 27950 27117 23040 32193 29747 27794 21309 5209 9872 16212 28956 37159
14779 37159 37572 31955 21945 23967 29103 34684 44196 31814 22478 -2085 -5632 18817 26411 33611
14765 33611 33064 13375 -892 -3020 -5045 3093 8556 7937 10204 -3103 5467 6333 1864 14031
14751 14031 15475 21278 31426 36206 37498 33332 23081 18290 22163 29883 21464 30231 40934 39958
14737 39958 39362 38051 33178 33124 38077 35422 21092 7579 9111 27671 34754 38192 34711 25517
14723 25517 34802 43560 42160 49441 57432 47308 34506 38451 47418 53529 49594 59965 72221
14710 72221 96616 138565 185623 267433 371569 496828 639341 715316 665207 522199 359602
14699 359602 243235 175169 126793 97472 88165 74088 58793 44791 36143 28485 28210 29276
14687B9276j831j6115q839l8M739K0421J5445j1952r449k1175l156L428n313M922
14673C63J4489j1153o132J8736p758l976K539j1255j553J3151j34m974J0465K385
14659A5193l538J1693R830m003j1721O392R350O682j860j2727l359l318j0834
14646G780k883O401m052k566P289M713p316q472j707P306J5025j857j0478j483
14632G700J029k497J867k953K535J574l142p736k284J1690J7000k775k966o987
14618A2055O250Q447k699j887o363k988l870J1993M625p713Q967J7849l937j2748
14604B7981r491n818k574r019o222k034j0807j0031J4552K6174Q156j9782N036
14591F121J6641j664N430L545k474j1596P313K667N684J3469p531m825J89p665
$$ plain form
14687 29276 27445 11330 2491 2453 7192 27613 43058 31106 21657 482 -2674 754 -4559 363
14673 363 14852 3699 -2433 16303 8545 4569 7108 -4147 -5700 7451 7317 2343 12808 15193
14659 15193 11655 23348 33178 29175 17454 23846 33196 39878 38018 25291 21932 18614 7780
14646 7780 4897 11298 7246 4680 11969 16682 9366 894 -813 6493 21518 19661 9183 7700
14632 7700 8729 6232 8099 5146 7681 9255 6113 -1623 -3907 7783 24783 22008 19042 12055
14618 12055 18305 26752 24053 22166 15803 12815 8945 20938 25563 17850 26817 44666 40729 27981
14604 27981 18490 12672 10098 1079 -5143 -7177 -17984 -28015 -13463 12711 20867 1085 6121
14591 6121 22762 21098 26528 30073 27599 16003 23316 25983 31667 45136 37605 32780 32969 25304
14577B5304j24N832j512o872j9130j0625k251O139J4786N639L239N881K038q127
14563B0217r991m05M927N801J4348j6913n578J1692P588Q925j1218M446J0583
14550D4422Q84o80j3293k8018p048m284j403L076J997J6249J6870J7803l212o877
14536C6486j2617o344J0460R17q621O846M45l681P739J2742j4358j0763M779J9824
14522D3854J0771j6200j9379j2120J595O608M601R530J2360j0385P836k167K874
14509C9778k372j9097M652J5201k788n013O765R10R65N09K526r770O724J4247
14495E3237P910j3449j4318O072J3305O032o354L036R905j941o55L625N836m606
14481F7635m201J4065J8584l928j3093J1519J0390p665m622N709K5394J8479R477
$$ plain form
14577 25304 25180 31012 29500 22628 3498 -7127 -9378 -3239 11547 17186 20425 26306 28344 20217
14563 20217 10226 9821 14748 20549 34897 17984 12406 24098 31686 40611 29393 33839 44422
14550 44422 45306 44626 31333 3315 -3733 -8017 -9420 -6344 -4347 11902 28772 46575 43363 36486
14536 36486 23869 17525 27985 28902 20281 27127 27572 23891 31630 44372 30014 19251 24030 43854
14522 43854 54625 38425 19046 6926 8521 15129 19730 29260 41620 31235 39071 36904 39778
14509 39778 37406 18309 22961 38162 35374 30361 37126 38036 39001 39510 42036 32266 38990 53237
14495 53237 61147 47698 33380 39452 52757 58789 52435 55471 65376 63435 62780 66405 72241 67635
14481 67635 63434 77499 96083 92155 79062 90581 100971 93306 88684 94393 119787 138266 147743
14468A47743m887j3219J700K147j2601j5981j2165j1452j5P482J3084p48L72N282
14454A06742m802j1624j2789r141o78j0643N659K3455Q143j042q941j7729p338
14441E9272Q73J2071Q980l953o914q624R6j866k799J91r379O148n803M102J1557
14426F3952J3724P624l381P326J1648M779l436k0288J800j116J2858J471r063
14413H7898l761k876K587j1061j1434j2210M123K633n532k00J308Q427K483n641
14399E6744K90L797O471K239p69O414j7531j0373P010N560j1501m832K830o325
14385D0024j3462k771Q551N342k077m107P361j840N447q372j1041J4397J4885
14372E2337L683o33j1005m738m552J4265J7800M533q994m543j3265j522l642J2024
$$ plain form
14468 147743 142856 129637 131337 133484 120883 104902 92737 81285 81270 88752 101836 101088 101460 106742
14454 106742 101940 90316 77527 68386 67708 57065 62724 86179 94322 93280 84339 66610 59272
14441 59272 60145 72216 81196 77243 70329 61705 61801 59935 57136 57327 47948 54096 48293 52395 63952
14426 63952 77676 85300 81919 89245 100893 105672 102236 81948 83748 82632 95490 96961 87898
14413 87898 84137 81261 83848 72787 61353 49143 53266 55899 50367 50167 51475 59902 62385 56744
14399 56744 57034 60831 67302 69541 68772 75186 57655 47282 54292 59852 48351 43519 46349 40024
14385 40024 26562 23791 32342 37684 35607 31500 38861 37021 42468 34096 23055 37452 52337
14372 52337 56020 55387 44382 39644 35092 49357 67157 71690 62696 58153 44888 43366 39724 51748
14358E1748Q696K346L120r767n547n309p492L945J0533r531o837k526m629j589
14344B7161J2786q41k362j749l519p78J24l600p686N079N971J4635o22m134m808
14329C5657j656l599j0135l000P223M358J387L745J3601j6R90L674m459j5661
14315C2109p06J2900M443n1P459j411R47k331J3350L68j4640k678M047L5q226
14300D5615M302J0564J146q411j835k487k3871L797o70R747l904n679J113J618
14286C1045r601l3k240M64M844K198L981O771q254j1590k403J7048J6545R658
14272E8433J0131j1756o158p099j0329j142L936n391Q02j367P243P031j212m023
14258C9099N724j134p285n754j1394j632N976P3Q94L877j34j3637m473O815J3039
$$ plain form
14358 51748 60444 62790 65910 56143 50596 45287 37795 41740 52273 42742 35905 33379 28750 27161
14344 27161 39947 39106 36744 34995 31476 30698 30822 27222 19536 24615 30586 45221 44599 40465 35657
14329 35657 34001 30402 20267 17267 24490 28848 30235 33980 47581 47565 48555 52229 47770 32109
14315 32109 31403 44303 48746 48695 56154 54743 55690 53359 66709 67077 52437 49759 53806 53841 45615
14300 45615 49917 60481 61627 53216 51381 48894 25023 28820 28150 37897 33993 28314 29427 31045
14286 31045 21444 21411 19171 19635 24479 26677 30658 37429 29175 17585 15182 32230 48775 58433
14272 58433 68564 56808 50650 43551 33222 32080 36016 30625 31427 30060 37303 44334 43122 39099
14258 39099 44823 43689 36404 30650 19256 17624 23600 23673 24567 28444 28310 14673 10200 17015 30054
14243C0054R349l76L882j19j2649m109K542j79L489o533j296K481o962m062J2988
14228B8500J7089O305k645j1224q742k537K871O4M784m626j2030M268P609Q300
14214C7986M949N173J4070j383l2030k6719J5186P503O91p991l523K1422J1846
14201D7180j6586N546J443M223P86q521j5643k436L033N927o626o947j0296K619
14187C702K636K107J3267R493j1715L859J1833p493M223J330m782R281N738j343
14173D2136J1996l017m464R922k274j7405R36P968l993j1038L200m827J795L437
14159C4372R070J3276k966j5320k313r87R273M546j4449j594P827N309L035p798
14145D1281J6308K764O673J2534n474r746R21J907l093J1568M826QJ038r15R415
$$ plain form
14243 30054 39403 39027 42909 42790 30141 26032 28574 28395 31884 25351 24055 26536 19574 15512 28500
14228 28500 45589 51894 49249 38025 29283 26746 29617 29681 34465 29839 17809 22077 29686 37986
14214 37986 42935 48108 62178 60795 28765 2046 17232 24735 25426 17435 13912 35334 47180
14201 47180 30594 36140 37583 41806 42592 34071 18428 15992 19025 24952 18326 11379 1083 3702
14187 3702 6338 8445 21712 31205 19490 23349 35182 27689 31912 33242 28460 37741 43479 42136
14173 42136 54132 51115 46651 56573 54299 36894 37830 45798 41805 30767 33967 29140 30935 34372
14159 34372 43442 56718 53752 38432 36119 35132 44405 48951 34502 32908 40735 46044 49079 41281
14145 41281 57589 60353 67026 79560 74086 64340 65261 67168 64075 75643 80469 80477 81515 80600 90015
14130I0015J0629O253K0741L1614L0665M7200M0566J5658j7905m0864k6723j3963
14118A93886O15K7775L9224P3493Q6242R0550J3884n5865q1914p9817n4485k0489
14106B33099L074O470K3226L3222J2604j6009m1215k5888k9667l3853j4310r016
14094A41737j1923k059j1546o424M195K565J0381R18j6910m714M495p938r958
14081I2819M317m410R142q560r427L174J275M081k289P11k38n963q662M969J0146
14066I1085j551j158J0006l013j6157m81O43n011L774J2416k852j4863r008R85
14052F4815p427J5702r311k6707j1969Q008P370m758q544P846J0398P505m783
14039D8145r570j3509j0326L961J7914R606J859j848j536p389j566R1p083l25
$$ plain form
14130 90015 100644 106897 127638 159252 189917 237117 277683 293341 275436 234572 207849 193886
14118 193886 194501 222276 261500 334993 421235 511785 525669 469804 387890 308073 253588 233099
14106 233099 236173 242643 265869 299091 311695 295686 254471 228583 198916 165063 150753 141737
14094 141737 129814 127755 116209 109785 113980 116545 126926 127844 110934 106220 110715 102777 92819
14081 92819 97136 92726 101868 93308 83881 87055 88330 92411 90122 90833 90595 84632 75970 80939 91085
14066 91085 89534 88376 98382 95369 79212 78731 79374 74363 78137 90553 87701 72838 63830 64815
14052 64815 57388 73090 63779 37072 25103 33111 40481 35723 27179 35025 45423 52928 48145
14039 48145 38575 25066 14740 18701 36615 46221 48080 46232 44696 37307 35741 35832 28749 28424
14025B8424M671l542L311N295m707j0514Q304R157N841Q74j982q072J0557k858
14011D4759j0679j711n861n070o072N62j156J8581Q255M048K835o273j936K23
13997D0505R062k475j2240l30J815j950J0471K3746k754j4433p888m351L844K499
13983D5521J107o26N002J4583l93n510j0531k6399M518J0499l17J0570k702k1660
13969B3662O007P255j858M60J861k089k930Q251k072k121l677O758O705r814M460
13954D0858J3903o654p078j0465J1640J250K662J9607j0262j3653m536J8192K024
13941E7488q830M220Q560j461M428l793j1204O786N383K830j262o988r6o559N195
13926E4697J0396q104q398j0735n51o671o862n32l462O306r277j4830L941J9358
$$ plain form
14025 28424 33095 29553 32864 38159 33452 22938 31242 40399 46240 47114 45132 37060 47617 44759
14011 44759 34080 32369 26508 21438 15366 15928 14772 33353 41608 45656 48491 42218 40282 40505
13997 40505 49567 47092 34852 34522 36337 34387 44858 68604 65850 51417 43529 39178 43022 45521
13983 45521 46628 46002 51004 65587 65194 59684 49153 22754 27272 37771 37454 48024 45322 23662
13969 23662 29669 36924 35066 35526 37387 35298 32368 40619 38547 36426 32749 39507 46212 36398 40858
13954 40858 54761 48107 41029 30564 42204 43454 46116 65723 55461 41808 37272 55464 57488
13941 57488 48658 52878 61438 59977 64405 60612 49408 56194 61577 64407 63145 56157 56061 49502 54697
13926 54697 65093 56989 48591 37856 37305 30634 23772 23240 19778 26084 16807 1977 5918 25276
13912B5276M591n922m806J5294R689j0734j5834p459J3765q742m357J2300P199
13899C0260J7304J4553m826j4165N610J0699O033q425j3468j1951j1928o225Q539
13886B2010L427j1759j2113J0026J7841j639o111K613J0695P835N311l21j390
13873D6425m43O728j0265o140j0981J0445O325k074p84p692k277n639L545M290
13859C1463J404J215Q438L290k800q069P883R323p19k81Q440j536l783n225j5067
13844C3976k163l916J4127J1661l009o906j8663M104j072k2768o96M228J2149
13831B1052J6375J0502q927Q879O522o146j2586k40N966l412P945l332m34J1044
13817E3208N740l00n000P022q505o488K086J7726J9538n222o921j856O484K1012
$$ plain form
13912 25276 29867 23945 19139 34433 44122 33388 17554 10095 23860 15118 10761 23061 30260
13899 30260 47564 62117 57291 43126 48736 59435 65468 57043 43575 31624 19696 13471 22010
13886 22010 25437 13678 1565 11591 29432 27793 21682 24295 34990 42825 48136 47815 46425
13873 46425 45982 52710 42445 36305 25324 35769 42094 40020 39236 31544 29267 23628 27173 31463
13859 31463 32867 34082 42520 45810 43010 34941 42824 52147 51428 51147 59587 58051 54268 49043 33976
13844 33976 31813 27897 42024 53685 50676 43770 25107 29211 28139 5371 4675 8903 21052
13831 21052 37427 47929 39002 47881 54403 48257 35671 35431 41397 37985 45930 42598 42164 53208
13817 53208 58948 58648 53648 60670 52165 45677 47763 65489 85027 79805 72884 71028 77512 98524
13803I8524K4210O709L2752M7267L5538M2312K4205j6216m4473k5489k3087j5772
13791A86480r053L387Q623K1907K0384K9488K2009K9894K4253J0309k4358l2096
13779B91227p037J229p794k270j564k1697m835Q390R409K8097J4723L90j4436
13766B93832l3294k5607k7157j3109R47K396j3834q178k145P365N923K703L077
13753A92919n504l289q71L944R309n682J966k103J2565K1990J6425K8924K4904
13740B95497K3411J0761k9898l8126k6773j4339j7870k4837m860N449K0460K571
13728B01446o83Q618J9232N0837P5543Q1178Q8022Q6236Q2147O9671L6089j3267
13716G85069n9990q6156r7001j10903j08153p4297n6424l3120l5889k1349m050
$$ plain form
13803 98524 122734 129443 162195 209462 245000 287312 311517 295301 250828 225339 202252 186480
13791 186480 177427 180814 189437 211344 231728 261216 283225 313119 337372 347681 323323 291227
13779 291227 284190 285419 277625 275355 273791 252094 247259 255649 265058 293155 307878 308268 293832
13766 293832 260538 234931 207774 194665 195612 198008 184174 175996 173851 181216 187139 189842 192919
13753 192919 187415 184126 183255 187199 196508 190826 192792 190689 203254 225244 241669 270593 295497
13740 295497 318908 329669 299771 261645 234872 220533 202663 177826 172966 178415 198875 201446
13728 201446 200763 209381 228613 279450 354993 436171 524193 610429 692576 762247 798336 785069
13716 785069 725079 638923 541922 431019 322866 248569 192145 159025 123136 101787 97737
13705I7737J0943J998q984j2588j3568k809j1881N53l17p524j432j437N021O124
13691F1836n512l374q504j728j438N251j125o735m302J9170J2122q709k8406j3957
13677A4589J9107L380R261K5029L608j1613l250r072l342K483N809J179M60K83
13663E7911J1342m353k455O08P236P863q21O350R32k6158L899M788j51K485q098
13648F1378j288M449k217j158l683n929J056O018N609p247L927J6830p59n323
13634G1663N964J208o363r068j1574M60k818l102N434J2330J136p711Q739L160
13620F9458J83n846Q290K370o391o472n977l724m982l37J7487R494J82P026q837
13605G1924j174J7747J3401j0937j6397k981n369L28J2485m781k086Q691m424
$$ plain form
13705 97737 108680 110678 101694 89106 75538 72729 60848 61401 61084 53560 52128 50691 55712 61836
13691 61836 56324 52950 44446 42718 41280 46531 45406 38671 34369 53539 65661 56952 28546 14589
13677 14589 33696 37076 46337 71366 74974 63361 60111 51039 47697 50180 55989 57168 57628 57911
13663 57911 69253 64900 62445 63053 70289 78152 77331 83681 84613 58455 62354 67142 66991 69476 61378
13648 61378 60090 64539 62322 61164 57481 51552 52608 58626 64235 56988 60915 77745 76986 71663
13634 71663 77627 78835 72472 63404 51830 52290 49472 46370 51804 64134 65270 57559 66298 69458
13620 69458 69641 63795 72085 74455 68064 61592 55615 51891 46909 46572 64059 73553 73735 80761 71924
13605 71924 70750 88497 101898 90961 74564 71583 66214 66542 79027 74246 72160 80851 76427
13592G6427J737K321R440J0144j1065k315J3578Q972J4870j0121n789l086J633
13579A06746L590J2094M014J9526K0319J4776P279M06n765k9215k9582j5204o189
13566A02795L195P856J857M656L199J017m718m154l226k799R592o11j5719M439
13552A07379J7506J3849K915M633n085k3674q242j384N083m378j2917l210j010
13539I1465L213k127O450P437j0829M862l287q063m882J3404n776O098J0736R427
13525A18128N194j4514l311J647j295M653K705J830r772J106J142L562K532J271
13511A14878j2066K476J2950j6313j7035P557K3393J8996M650L684J6022K1095
13499A80287K1462L2989L3965Q489k5961m1667l0981j7009n311P707J2073K9761
$$ plain form
13592 76427 78164 80485 89925 100069 89004 86689 100267 109239 124109 113988 108199 105113 106746
13579 106746 110336 122430 126444 145970 166289 181065 188344 188750 182985 153770 124188 108984 102795
13566 102795 105990 113846 115703 120359 123558 124575 119857 115703 112477 109678 119270 118659 102940 107379
13552 107379 124885 138734 141649 146282 141197 117523 109281 107897 112980 108602 95685 92475 91465
13539 91465 94678 92551 99001 106438 95609 100471 97184 89121 84239 97643 91867 97965 108701 118128
13525 118128 123322 108808 105497 107144 105849 110502 113207 115037 105265 106371 107513 111075 113607 114878
13511 114878 102812 105288 118238 101925 84890 92447 115840 134836 139486 143170 159192 180287
13499 180287 201749 234738 268703 277192 251231 209564 178583 161574 156263 163970 176043 205804
13487B05804L1425K6676J1394j5552l1776m5233l2460n108r26j7172K181m070
13475A25183Q58m109m364j461J3980J5599J6558J3525Q311j7156k8898o788J6818
13462A48056J683J8516J4829N134J1042L1498J7092L397J3460R273L440N480q094
13449B74806r006j5878j0862k0451j2979r40l037j2691q386J6023K846O111K3133
13436B28689K895j0403j528R647J7384K0839K7957M7193L8847L2439K7459J1573
13424D52991k1355m6064m0186j9389q920R180J8891J2236L8921K6913N841j4709
13412D14350n2842n1003k6744j2017N018Q558K003P90J0904K0826J6690r53N139
13399C40719K735J153j737p229K658J4847p380k318P154M380J0447N576q019p419
$$ plain form
13487 205804 237229 263905 275299 259747 227971 182738 150278 145170 144244 127072 129253 125183
13475 125183 126041 121932 117568 116107 130087 145686 162244 175769 184080 166924 138026 131238 148056
13462 148056 149739 168255 183084 188218 199260 230758 247850 251247 264707 273980 277420 282900 274806
13449 274806 265800 249922 239060 218609 205630 204690 201653 188962 180576 196599 199445 205556 228689
13436 228689 231584 221181 219653 229300 246684 267523 295480 342673 381520 413959 441418 452991
13424 452991 431636 385572 345386 325997 317077 326257 345148 357384 396305 423218 429059 414350
13412 414350 361508 310505 283761 271744 276762 285320 287323 288113 299017 319843 336533 335580 340719
13399 340719 343454 344607 342870 335641 338299 353146 345766 343448 350602 354982 365429 371005 362986 355567
13385C55567J2150K3155K2050J0007J3664J4514K1413K827r639J3070K1595K4853
13373E25226K4761O581L233K5773K8693J2734K3347K5199P276K2699K9084M5623
13361G80229M2842M6893N4001L8838N7596P3346P4449Q0350Q8075J08640J32645
13350A577904J57072J97429K26666K81046L37501L91020M25973M85731O48418
13341D728760Q88627J261238J848986K672852L824173N360264P157445Q663844
13333C6406189Q224646L233131m782571r508456r027228o453667m118604k517240
13325A1456200j459892p24534j41545M29961R99821J590699J999213J544789P3543
13316A5768255q08304j97962J212352K749135M212478N074472L784356Q85059
$$ plain form
13385 355567 367717 390872 412922 422929 436593 451107 472520 475347 465708 478778 500373 525226
13373 525226 549987 556568 559801 585574 614267 627001 650348 675547 682823 705522 734606 780229
13361 780229 823071 869964 923965 962803 1020399 1093745 1168194 1248544 1336619 1445259 1577904
13350 1577904 1734976 1932405 2159071 2440117 2777618 3168638 3594611 4080342 4728760
13341 4728760 5617387 6878625 8727611 11400463 15224636 20584900 27742345 36406189
13333 36406189 44630835 47863966 43081395 33572939 24545711 18092044 13973440 11456200
13325 11456200 9996308 9271774 9130229 9560190 10560011 12150710 14149923 15694712 15768255
13316 15768255 14959951 14761989 15974341 18723476 22935954 28010426 31794782 32679841
13308C2679841K57553K580158N345839O324619L897021j423460o337457p754620
13300C5569494n826170k756412j4890J462620J53097l348590n002102l790231
13292A6446816j895873l75524O69370R45302q8654j699838k114981j407603m91176
13283I987839L43289J128736K028432L234281M802812O667402Q512156R191555
13275D5896502N987302k136991r594598j1089401q622888n736261l689264k452877
13267H561524j692846j204794q83142o52019n06483m07841l63576l29479k91129
13258B230215k58045k16452j72635j44908j04601o9425o7753o5196o0164l7091
13248A033945l7889k9991j8039k3733l0283k5805k092K3821L1961j1489l5908
$$ plain form
13308 32679841 32937394 35517552 40863391 47188010 51085031 49661571 43324114 35569494
13300 35569494 29743324 26986912 26972022 28434642 28587739 25239149 20237047 16446816
13292 16446816 14550943 14175419 14844789 15790091 15701437 14001599 11886618 10479015 9987839
13283 9987839 10331128 11459864 13488296 16722577 21525389 28192791 36704947 45896502
13275 45896502 51883804 49746813 40152215 29062814 20439926 14703665 11014401 8561524
13267 8561524 6868678 5663884 4780742 4128723 3622240 3214399 2850823 2521344 2230215
13258 2230215 1972170 1755718 1583083 1438175 1333574 1264149 1196396 1131200 1071036 1033945
13248 1033945 996056 966065 948026 924293 894010 868205 866113 889934 921895 910406 874498
13237H74498l6046p1735r1786p9974n7540l0420l0752k5218k3982j7992j5241
13226C93812k1952l3340j4363j0574m638J0414K4516K4054K7213k173k9194m1292
13214C22483l0092l2908j7623r139r757j5670j4713j0553l065J0404K367r099
13202A82635j1829j1343n222M095O64j6814m569r974j6238J3488J8705J501J3614
13189A58713J2270J1530K7944K5249K7023P1336R0326P3966N1070k5589q5637
13178D38201r2915o2705m4611l1986k1181j5920p507j5103j3989k0060l015K637
13166A11846K2548N683j2578N486K4113K5934J9498L8159M2790K059k1458m6882
13154B17198l3546k4936O977K628o358K623N064J7515P64J6015L9521L5076O6265
$$ plain form
13237 874498 838452 766717 674931 594957 537417 506997 476245 451027 427045 409053 393812
13226 393812 371860 338520 324157 313583 308945 319359 343875 367929 395142 392969 363775 322483
13214 322483 292391 259483 241860 232721 222964 207294 192581 182028 178963 189367 191734 182635
13202 182635 170806 159463 154241 158336 159000 142186 137617 127643 111405 124893 143598 145099 158713
13189 158713 170983 182513 210457 235706 262729 334065 424391 498357 549427 523838 438201
13178 438201 345286 282581 237970 205984 184803 168883 161376 146273 132284 112224 109209 111846
13166 111846 134394 140077 127499 132985 157098 183032 202530 240689 283479 285538 264080 217198
13154 217198 183652 158716 165693 168321 161963 164586 169650 187165 187929 203944 243465 278541 344806
13141C44806Q6054J28739J96153K46260K56030J51460m8204k53813l13586k57269
13131E36630j54368p3548k6438j3510j3882j1372p289K364M262J4690K7673J9243
13119C04455j0964j5380K185o846j4298j7795j1678l589Q219L686l528j745O358
13106B39080J582J3280J4233J0550J0017K5207L9766M5220M6009P9578J06351
13095F30873J34714K09460K61857K85697K09516j1843k40660l46438l07482j84050
13085F41644r9991o6344m7736l7613l0891m7929m4475j6248j3562l484J778j3355
13073B21794j0632R416K1018Q465j200J1728R384K6395K4385K7334K5685K218
13061C75990K912k0765k0952k5920l8961l5348j6975n802q159Q417K7429K9605
$$ plain form
13141 344806 430860 559599 755752 1002012 1258042 1409502 1361298 1107485 793899 536630
13131 536630 382262 308714 282276 268766 254884 243512 236223 238587 242849 257539 285212 304455
13119 304455 293491 278111 280296 273450 259152 241357 229679 226090 234309 237995 234467 232722 239080
13106 239080 240662 253942 268175 278725 288742 313949 353715 398935 444944 524522 630873
13095 630873 765587 975047 1236904 1522601 1732117 1720274 1479614 1133176 825694 641644
13085 641644 541653 475309 427573 389960 359069 311140 266665 250417 236855 233371 235149 221794
13073 221794 211162 220578 241596 250061 248861 260589 269973 296368 320753 348087 373772 375990
13061 375990 378902 358137 337185 311265 272304 236956 219981 214179 206020 214437 241866 271471
13049B71471L9013M8608Q3465P5828J1460n6588j09705j00785n7178l8009m1436
13038A26144k9354o956N974r381k823N059K950n101p66k916o869L498K170n315
13024G6314p196J3918J044r188l160J0386O814n579k515k51L790J5141o550r231
13010H3737q959j6306J01P093J1768L5204J2168p822J0724M677R060j5319j3888
12997A12238j3381n245q510l27J0053J5102O672l517j1744k2327j0556n393O406
12984F9471J145P601p384j7126l250j2372J102J0406J3824P534j4507j4974J463
12971D2933m951q060l11J5865M971o687m176N060Q563J827Q094o649j6408J851
12957D1922Q742J312p86l426l56L387N059J0042J173k1858j7947R145J068J639
$$ plain form
13049 271471 310484 359092 442557 518385 529845 473257 363552 262767 205589 167580 126144
13038 126144 96790 89834 95808 86427 83604 88663 91613 86512 85746 82830 75961 79459 81629 76314
13024 76314 69118 83036 84080 74892 71732 82118 88932 83353 80838 80587 84377 99518 92968 83737
13010 83737 74778 58472 58573 65666 77434 112638 124806 116984 127708 132385 141445 126126 112238
12997 112238 98857 93612 85102 84775 94828 109930 116602 113085 101341 79014 68458 63065 69471
12984 69471 70616 78217 70833 53707 50457 38085 39187 49593 63417 70951 56444 41470 42933
12971 42933 37982 29922 29611 45476 50447 43760 39584 44644 53207 55034 63128 56479 40071 41922
12957 41922 50664 51976 51190 47764 47408 50795 55854 65896 67069 45211 27264 36409 37477 39116
12943C9116L317p450n546J3344R838j1596j3625L971K6718J5999M938L107J2090
12930I4221J7078l623n838j7857j1590J1377K1838Q533m584j653M211p532j5441
12917H9140j3808N725K873J4385J7360J5412J7315L7254N9470L0628J3152j7789
12905B71117k0964k2864k3163J60K6544K8588M1522M2849K4544l1964m9189k2732
12893B64448k227q33N793J9613L5737L3201K4594N688m889l45p119k1846k8200
12880C23615l6520k2499n854j0520k2514K969o305o900J181N819J0394m125N177
12867B33918J8150M5418N7796L4542L6837M5700M9237J6233j2619k1545k9239
12856D74428j5716j2696j1510j2610k3668j9372j8720j4833k5150k0835m849q200
$$ plain form
12943 39116 42433 34983 29437 42781 52619 41023 27398 31369 58087 74086 79024 82131 94221
12930 94221 111299 107676 101838 83981 72391 83768 105606 114139 109555 107902 112113 104581 89140
12917 89140 75332 81057 83930 98315 115675 131087 148402 185656 245126 275754 288906 271117
12905 271117 250153 227289 204126 204286 230830 259418 300940 343789 368333 336369 287180 264448
12893 264448 262221 261388 267181 286794 322531 355732 380326 386014 381125 380780 373661 351815 323615
12880 323615 287095 264596 258742 248222 225708 228677 222372 215472 216653 222472 232866 228741 233918
12867 233918 252068 297486 355282 389824 426661 472361 521598 537831 525212 503667 474428
12856 474428 458712 446016 434506 421896 398228 378856 360136 345303 320153 299318 294469 286269
12844B86269l170n500J5436L4184M4915N0499M8447L9624J0108q180M199J0364
12832E27195Q433j4780j9798p46N766J9879p592k4168l8409o6262p4532n8379
12820B56607l2038j8063j0901o217n066j3129p238k0720j1593K447J5044J5500
12808A64633j497J4997L5906M6850L9316J6588o571l6680m4752n3613k7463j1793
12796A35921q327j5914j1853o346j0427n765m217Q62m387Q723O037L223j1683
12783G5847J980l18j0177J0225R050j225j6722l240n826O309K3153j1372k3300
12770E4384k160Q620J690n98r788J91R10l18K531K938R100l280M907J1653M948
12755H5728m142j6036J67N441r775Q78p968j6879j3070L73J9626J5234O169j635
$$ plain form
12844 286269 283099 277599 293035 327219 372134 422633 471080 510704 520812 512632 516831 527195
12832 527195 535628 520848 501050 500304 506070 525949 518357 494189 455780 389518 314986 256607
12820 256607 224569 206506 195605 189388 184322 171193 163955 143235 131642 134089 149133 164633
12808 164633 163136 178133 214039 260889 300205 316793 310222 273542 228790 175177 147714 135921
12796 135921 127594 111680 99827 93481 83054 77289 73072 73934 69547 78270 84307 87530 75847
12783 75847 77827 77509 67332 77557 86607 85382 68660 65420 59594 65903 89056 77684 54384
12770 54384 52224 60844 62534 61936 52148 52339 53249 52931 55462 58400 67500 64220 69127 80780 85728
12755 85728 81586 65550 65717 71158 61383 62261 54293 37414 24344 24717 44343 59577 65746 64111
12741F4111j0988l429Q610L639K705J4308l68k588p983l730J3984O643k61j1281
12727G3372q35j1818q370J733m615N856K228n948j9702j136P624O272J5753J1556
12713G1970L248m511j0131P813J6899N999n276q860k7108k414J9415J91P194L601
12699G8030r90n672l574j029J67K585Q360M178k228L370J257J1319J2936J1756
12685A20465O168J3678J7859J4435K0427J8660M9037Q9981R0201R1328Q6425O7308
12673F85972N2605M713k0916n7365q8438j00497r9026p4259n8460l9618l0482
12662A74229j6830k6354j7645j8243r844K760K895m210L853n653k83j771M285
12649H7189M148j429j2684p435k617O783J7378L965j5574j4266l01J348O347j820
$$ plain form
12741 64111 53123 49694 58304 61943 64648 78956 78588 76000 68017 64287 78271 84914 84653 73372
12727 73372 72537 60719 52349 54082 49467 55323 57551 51603 31901 30765 38389 44661 60414 71970
12713 71970 75218 70707 60576 68389 85288 91287 86011 77151 50043 47629 67044 67235 74429 78030
12699 78030 77040 71368 67794 66765 66932 69517 77877 82055 79827 83197 84454 95773 108709 120465
12685 120465 126633 140311 158170 172605 193032 211692 260729 350710 440911 532239 618664 685972
12673 685972 738577 743290 722374 665009 576571 476074 377048 302789 244329 204711 174229
12662 174229 157399 131045 113400 95157 85313 88073 90968 86758 90611 84958 84675 82904 87189
12649 87189 91337 89908 77224 69789 67172 73955 91333 95298 79724 65458 65157 66505 72852 71032
12635G1032N768p888L771R900m543n375o040j236O013j0752J2120J3865l540l660
12621G9435M430k195j2584n328J1130j354j261j0398J908L306j7803M80P206J12
12607E7084Q280r870j1007r683j919J569J8437R954P927Q590m826o012o605Q123
12593G0042l299j1037K7577N7170M0173n150m8635o3918l1326J5812K1924P508
12581G6841L017q164j2900Q173Q93j901M347p680R014N453J2649o174Q0K188L143
12566H8979L690K315N333j010j7858r940j637m86m888m38J7936l398P6K3767L318
12551A05759l641J0094O545j1573k0119j1295j1791M319L79J2301J0373m832K1729
12538A08248J1205p917j9023r505l329J166J1032J0215J221M879K3211N915k883
$$ plain form
12635 71032 76800 68912 72683 82583 78040 72665 66625 65389 71402 60650 72770 86635 83095 79435
12621 79435 83865 81670 69086 63758 74888 73534 72273 61875 63783 67089 49286 49766 56972 57084
12607 57084 65364 55494 44487 34804 32885 34454 52891 62845 70772 79362 74536 68524 61919 70042
12593 70042 66743 55706 83283 140453 180626 175476 126841 62923 31597 47409 69333 76841
12581 76841 79858 71694 58794 66967 67860 65959 70306 62626 71640 77093 89742 83568 83648 85836 88979
12566 88979 92669 94984 100317 99307 81449 71509 69872 69386 64498 64060 81996 78598 78674 102441 105759
12551 105759 102118 112212 118757 107184 87065 75770 63979 68298 68677 80978 91351 86519 108248
12538 108248 119453 111536 92513 83008 79679 80845 91877 102092 103313 108192 131403 137318 134435
12525A34435j239L318m017O125j1377q611p521j9003m342K1652J3758J73P020
12512A30371L301m437J5592K0933K2899K2345J2972j329K408M088j4270M989l093
12499B16769l0685j5773m550O200m216j9651q512j0165J0505M837n624L260J2268
12486A54663j1671Q561J1841Q809K962L0398R557l0358k8032j3753n812K066J5986
12473A55217J6731J7505J7942J2442L416K5597M3423M1416J5476j1093l5580n0502
12461B51990k4143j4046j3490j6156O746K695o361P49L3649K7220q416j347N384
12448B44474L193J0448J3841k510K3137L7631L1539K0464J8073K9269K6548K0861
12436D76968N464j4845l8943m5463k1672l931j027j5807l7224l1454j5272j4188
$$ plain form
12525 134435 133196 136514 132497 138622 127245 118634 111113 92110 87768 109420 123178 123351 130371
12512 130371 133672 129235 144827 165760 188659 211004 223976 222647 225055 229143 214873 219862 216769
12499 216769 186084 170311 165761 171961 167745 148094 139582 129417 139922 144759 139135 142395 154663
12486 154663 142992 151553 163394 172203 175165 205563 215120 184762 156730 142977 137165 139231 155217
12473 155217 171948 189453 207395 219837 223253 248850 292273 333689 349165 338072 302492 251990
12461 251990 227847 213801 200311 184155 190901 193596 187235 187984 221633 248853 240437 239090 244474
12448 244474 247667 258115 271956 269446 292583 330214 361753 382217 400290 429559 456107 476968
12436 476968 482432 467587 428644 383181 361509 357578 356551 340744 303520 272066 256794 242606
12424B42606K402Q757q783L171J1098J1820J4878j3134j2948n203P147K7150L1499
12411C20460L2892M3658K6867J1588o922l1762m2546k0768j3177j1811Q602R726
12399C26807L2655L4271L9646M5191K4526l3048m4898n3160l8824k2561k4402
12388B86203L375R180n755J3236K1684P688J7128K3818L5990L1620M2547N0604
12376E37318N9593L0917Q170n4667q0731n3897k9467l1483k0701j3732q079j697
12364C41544P096J1332k327R414J7970K881l958n751J7534K8432K1763M2420M6988
12351E35338L1130q545m3277n9799m7616j8896j6222j8879l486p572L625J5576
12339C61377J2068O069Q066L1249L5041M4830N3692N2014N1148L3882p470l9284
$$ plain form
12424 242606 245008 253765 244982 248153 259251 271071 285949 272815 259867 254664 261811 288961 320460
12411 320460 353352 397010 423877 435465 428543 396781 354235 333467 320290 308479 317081 326807
12399 326807 359462 393733 433379 478570 503096 470048 425150 371990 333166 310605 286203
12388 286203 289578 298758 293003 306239 327923 335611 352739 376557 412547 444167 486714 537318
12376 537318 596911 627828 635998 581331 500600 446703 417236 385753 365052 351320 343241 341544
12364 341544 348640 359972 357645 367059 385029 387910 383952 378201 395735 424167 445930 488350 535338
12351 535338 566468 557923 514646 454847 407231 388335 372113 353234 349748 342176 345801 361377
12339 361377 373445 379514 387580 418829 453870 498700 552392 604406 655554 689436 681966 642682
12327F42682m3075k3338k3081j5159J6709K0482L1039K1920J2660K6242K7427
12316F94508J0779k629p180J4862K1529K0430K9925L3488K4947M8919M4763K1121
12304I55462K4863L8495M2886M3544N5708N5947N5612P3703J02255J22953J33601
12293A705029J67956K11289K71266L31280L45154L36548L15064K61666J48210
12284D093462M8794r004m2626o4738n0901j0135P1613J70296K54246L47947M76482
12273E285436N98840P16306Q13855Q98219R43204R53654R54352J011937J096120
12264A3271923J311845J795568K622958L907807N910142Q711580J2318422J6348059
12256F6198304J9340285J8952598J5365879J1473048O717324j480211j0133700
$$ plain form
12327 642682 599607 576269 553188 538029 554738 575220 606259 628179 640839 667081 694508
12316 694508 705287 702658 695478 710340 731869 752299 782224 815712 840659 889578 934341 955462
12304 955462 980325 1018820 1061706 1105250 1160958 1216905 1272517 1346220 1448475 1571428 1705029
12293 1705029 1872985 2084274 2355540 2686820 3031974 3368522 3683586 3945252 4093462
12284 4093462 4142256 4133252 4090626 4025888 3974987 3964852 4036465 4206761 4461007 4808954 5285436
12273 5285436 5884276 6600582 7414437 8312656 9255860 10209514 11163866 12175803 13271923
12264 13271923 14583768 16379336 19002294 22910101 28820243 37531823 49850245 66198304
12256 66198304 85538589 104491187 119857066 131330114 138047438 136567227 126433527
12249A26433527j4789755j7039697j9222178j9085142j5564724j0963532p211155
12242B2557344m706984l089441k063257j456208j080244q63871p99661p78499
12234G719179p87842p61274p53517o95234o02198n08554l90620l09746k75737
12225B634457k46378j89647j61154j55345j31121j29813j07051q3484n3123l8649
12215A338692j6528k396J0466K2016r744q3843j06025j04848r7532p0060n1723
12204H28475l7532j5943k198j4858j3091O12r443O83l757k1120k0571j6304j4769
12191F60184o267r325r267M849m990j6910k5318k1477j0000m623j1586M518k506
12178E47282k8696j0743j2552j1375J986O323J0645K4032M1941P2761R0913N5054
$$ plain form
12249 126433527 111643772 94604075 75381897 56296755 40732031 29768499 22557344
12242 22557344 17850360 14760919 12697662 11241454 10161210 9297339 8497678 7719179
12234 7719179 6931337 6170063 5416546 4721312 4119114 3610560 3219940 2910194 2634457
12225 2634457 2388079 2198432 2037278 1881933 1750812 1620999 1513948 1430464 1377341 1338692
12215 1338692 1322164 1319768 1330234 1352250 1342506 1258663 1152638 1047790 950258 880198 828475
12204 828475 790943 775000 772802 757944 744853 745465 736022 736705 732948 711828 691257 674953 660184
12191 660184 653917 644592 635325 640174 635184 618274 592956 571479 561479 556856 545270 549788 547282
12178 547282 518586 507843 495291 483916 485902 492225 502870 526902 568843 641604 732517 787571
12166G87571k0357r1626r1762o5884l5624j2190J020J1037l478J5639J7341J8097
12154E29784j2370j7518o578j3583L882K898k3888n0284n8798m2714j8752P97
12142B92876j4681J320J3685N584J633j6373M040J1190J0241k679Q426L1645J5812
12129C62719K3665R466Q272M135J4043P466K1773o214k5014j2525l0008k8436
12117C49342k9412j4300J3496J3282K330O551L043R03J2755M30k023j712j631
12104C53054j6820q714j6450R568K2936J8562J9727R287J7580n183J0082J1657
12092D25286J3767R86L970r136j9814N834J8047J0153K095J2273K1999J6298K1857
12079E23615L0955K9797M5099K7481J97j1693j1006K329J1658J0800J1496J8702
$$ plain form
12166 787571 767214 675588 583826 517942 482318 470128 471148 482185 478707 494346 511687 529784
12154 529784 517414 499896 493318 479735 483617 486515 462627 412343 353545 310831 292079 292876
12142 292876 278195 279515 293200 298784 300417 284044 288084 299274 309515 306836 315262 346907 362719
12129 362719 386384 395850 404122 408257 422300 429766 451539 445325 420311 407786 377778 349342
12117 349342 319930 305630 319126 332408 334738 341289 344332 345235 357990 358420 356397 354685 353054
12104 353054 336234 327520 311070 320638 343574 362136 381863 391150 408730 403547 413629 425286
12092 425286 439053 440039 444009 434873 415059 420893 438940 449093 451188 463461 485460 501758 523615
12079 523615 554570 584367 629466 656947 657144 645451 634445 636774 648432 659232 670728 689430
12067F89430L3772K8268K9954L7976L8232M2430M7299N9957N6444N7529R3777
12056A215068J11451J10896Q3271M8577N8794Q4097J00422J31597J67263K04828
12046B316264K66465L39194M26286N33499O58253Q13838R87323J274555J821939
12037I437616K714318L972442N623028P543965R211063R100965M376910m274784
12029D7705523j0095677r988203p239839m671499k895260j712400q33985j03591
12021A0165069N56007J186440J730569J881466R27993o32306r03414K19904J724018
12012A6855746L116453M145056L767224J172632j072702l23478K306146N037579
12004C5004656O836100O397503K709743k690991o446489o536157m048220j272034
$$ plain form
12067 689430 723202 751470 781424 819400 857632 900062 947361 1007318 1063762 1121291 1215068
12056 1215068 1326519 1437415 1520686 1569263 1628057 1712154 1812576 1944173 2111436 2316264
12046 2316264 2582729 2921923 3348209 3881708 4539961 5353799 6341122 7615677 9437616
12037 9437616 12151934 16124376 21747404 29291369 38502432 47603397 51980307 47705523
12029 47705523 37609846 27621643 20381804 15710305 12815045 11102645 10268660 10165069
12021 10165069 10721076 11907516 13638085 15519551 16447544 15815238 14911824 15131728 16855746
12012 16855746 19972199 24117255 27884479 29057111 27984409 27660931 29967077 35004656
12004 35004656 41840756 48238259 50948002 48257011 41810522 35274365 31226145 29954111
11996B9954111j80884j920639m448643m661657l067747j371541r5771O90209M12136
11987A5309574j086156k157573j818346r76212k66440L31098R29176J724357K816111
11978A4805589M182620N805236P412595Q146959N830711r12455p933012j0029723
11970B7308520q137636n527090l567075k356011j589737j077416p72496o03010
11962C678049n27951m71085l82669k85826k47402k07054j74512j42069j14013
11953A125468p9741p8889o3747n5291m7786m7511n1438l8926m4682m2186l2279
11942E42992j9076k4888k9568n268J2758J6487N0210R1286J36280K06670K88175
11931A266058L79041L40948j3397m27514m66452l07731j80451j13309p7826m4694
$$ plain form
11996 29954111 29773227 27852588 23403945 18742288 15674541 14303000 14207229 14897438 15309574
11987 15309574 14223418 12065845 10247499 9271287 9004847 9335945 10265121 11989478 14805589
11978 14805589 18988209 24793445 32206040 40352999 46183710 45271255 37338243 27308520
11970 27308520 19170884 13643794 10076719 7720708 6130971 5053555 4281059 3678049
11962 3678049 3150098 2679013 2296344 2010518 1763116 1556062 1381550 1239481 1125468
11953 1125468 1045727 966838 903091 847800 800014 752503 701065 662139 617457 575271 542992
11942 542992 523916 499028 469460 464192 476950 493437 543647 634933 771213 977883 1266058
11931 1266058 1645099 1986047 1972650 1545136 1078684 770953 590502 477193 399367 354673
11921C54673j7262j5241k6070k4160j3475q988k2335k1410l501N953l072m047
11909B01065n376l001J0294p391M585p39j1127q716L181J430k5025j0120K242
11896A51302J359o238J1690O923M202m327R708O841j5071n163m086j2931J6769
11883A60978R886J10J522k686K473o51k2461j6464L219J4607N279j2515j1173
11870A32124j6423k2051l922P85K234J3402J0886K161J865K0262J1884K1469J8626
11857A93302J8103J4584l844l1127k2387p020n151l755N654J768O033J79j87J2995
11843A79147Q201k765J282j0436q468R55j4K3484J3596J8091J8397K0129O7167
11830C28766J01568J07589Q8132Q7332M8664K7445r419m9419p8375q8228p7346
$$ plain form
11921 354673 337411 322170 296100 271940 258465 249477 227142 205732 202231 208184 205112 201065
11909 201065 195689 192688 202982 195591 200176 199437 188310 179594 182775 184205 159180 149060 151302
11896 151302 152661 146423 158113 165036 169238 164911 174619 181460 166389 161226 157140 144209 160978
11883 160978 170864 170974 172496 169810 172283 171632 149171 132707 135926 150533 155812 143297 132124
11870 132124 115701 93650 89728 90513 92747 106149 117035 119196 121061 141323 153207 174676 193302
11857 193302 211405 225989 222145 191018 168631 161611 156460 152705 158359 160127 166160 166339 166152 179147
11843 179147 187348 184583 185865 175429 166961 167916 167902 191386 204982 223073 241470 261599 328766
11830 328766 430334 537923 626055 713387 762051 789496 780077 730658 652283 564055 486709
11819D86709q7813p2448n4215l7882j5545j0613j8073j9439j3392r134j4489j1254
11807A22412j812J0861k067O723j2230r157j1664j0102p464r237o324K704l293
11794F9350p84J278N897J0763n453l334r81O80r933Q706L961j8059j645J6431
11780G6877J4143R600j4711l503Q932n551r077L574p484O684J2627Q437j7315
11767H3233L809K0822J2915M66r024m049M449J4570J2399J0531J2695L1881O0340
11754B55037P6223P7676J2525m1187m0519k5528k9996j2333j6777j1844k814l5137
11742B05326k2119j3961J487j7554j1194k0883n295j138J2364Q791L321J108o596
11729A33657J208J9712M978K80M172J1728J6126L3198M0730M4904M3713N5101
$$ plain form
11819 486709 398896 326448 272233 234351 218806 208193 190120 170681 157289 148155 133666 122412
11807 122412 120600 131461 129394 136117 123887 114730 103066 92964 85500 76263 69939 72643 69350
11794 69350 68566 69844 75741 86504 81051 77717 76736 77416 67483 76189 80150 62091 60446 76877
11780 76877 91020 100620 85909 82406 91338 85787 76710 80284 72800 79484 92111 100548 83233
11767 83233 87042 107864 120779 121245 112221 108172 112621 127191 139590 150121 162816 194697 255037
11754 255037 331260 408936 421461 380274 339755 314227 284231 271898 255121 243277 240463 205326
11742 205326 183207 169246 170733 153179 141985 121102 115807 114669 127033 135824 139145 140253 133657
11729 133657 134865 154577 159555 159835 164007 175735 191861 225059 265789 310693 354406 409507
11717D09507Q3938J09669J91414K92751M03790N21731N11597Q9548n02225o70962
11707A440758n01886k93798j75110j08516n1224m5697l0960l2711k7546k5803
11697A47507j0149n641O351q02J1329J2554K267Q581L331k906l2035k5892P42
11684A15237j2530R48R828r8R3J4774M050k336q391J709J5373Q155j5399j0812
11670A20601J0534o57j2750N964J8745J0104N908N092Q780P63L390O275J5454
11657A98203K3617J4066J2478K3928M3412P9120J19147J52296J22404O1610n1555
11646G98726j43853j62808r9054m9767l8207m2940k9778k3737Q390J5472M766
11635B37210l209L221k206q85J9663L9259N0479M1492K6265J8831Q1334K4381
$$ plain form
11717 409507 493445 603114 794528 1087279 1491069 2012800 2524397 2613945 2111720 1440758
11707 1440758 938872 645074 469964 361448 310224 264527 233567 200856 173310 147507
11697 147507 137358 131717 138068 137266 148595 161149 163416 171997 175328 172422 140387 114495 115237
11684 115237 102707 103655 113483 113385 113478 128252 132302 129966 121575 123284 138657 146812 131413 120601
11670 120601 131135 130478 117728 123692 142437 152541 158449 163541 172321 173084 176474 182749 198203
11657 198203 221820 235886 248364 272292 315704 394824 513971 666267 788671 850281 798726
11646 798726 654873 492065 393011 343244 305037 262097 232319 208582 216972 232444 237210
11635 237210 234001 237222 235016 234131 253794 293053 343532 385024 411289 430120 511454 535835
11623E35835n2175o9570m1579j9171j1570k2710j2072j0415q345m488j3572R421
11611B79589J4933J6605K1369P063M919Q001k955K888p526j9650k108K832J982
11598C27942M401o975K3197M5027L8981M7685N2350M4432J2876l9741n1792k0196
11586D78187k627j7837j6737N950J1692P101J3717K5340J5124O969J3458L457
11574E43794J2944L0197K0161L7881L2810L3323K0574K1770R139K5116N5061N5342
11562H98112M2582L0583J436k0915k3053j4739K196K0588J3772j897K0473M2836
11550A011974O7294P3183Q3367J10033R3084L857m2855l1730K4407K4006L6907
11539A453527N3167R8606J15968J14039J08724J10599J10913R3643O1282Q7533
$$ plain form
11623 535835 483660 414090 372511 353340 341770 319060 306988 296573 288228 283740 270168 279589
11611 279589 294522 311127 332496 339559 344478 352479 349524 352412 344886 325236 323128 325960 327942
11598 327942 332343 325368 348565 393592 432573 480258 532608 577040 589916 550175 498383 478187
11586 478187 475560 457723 440986 446936 458628 465729 479446 504786 519910 526879 540337 543794
11574 543794 556738 586935 607096 644977 677787 711110 731684 753454 762593 787709 842770 898112
11562 898112 940694 971277 972713 951798 928745 914006 916202 936790 950562 948665 969138 1011974
11550 1011974 1079268 1152451 1235818 1345851 1438935 1442792 1399937 1368207 1392614 1416620 1453527
11539 1453527 1506694 1605300 1721268 1835307 1944031 2054630 2165543 2259186 2320468 2408001
11529B408001J42326J68491J63994J78198K37657K83146L41620L59008L72926
11520D655367N15355P12173Q53500J033024J276449J397312J242200J348345J930488
11511A4964213K440790K875082L634523M804466P092694J1409626J8310014K8757807
11503I4289215M3085448N9912316P7156854P2220577J293069q3345800r4011948
11496A70599731o3099685l6776190k1334087j2865831p992676n095638l557667
11489A9877957k992674k604645k168219j910706j649443j356707j075560q30243
11481E289760o45692m78298l64838l15773l20306k92639k45586k34080k20217
11472B172331k02640j90323j50351q8176q9396q8592r4496j09216q9090q7122
$$ plain form
11529 2408001 2550327 2718818 2882812 3061010 3298667 3581813 3923433 4282441 4655367
11520 4655367 5170722 5882895 6736395 7769419 9045868 10443180 11685380 13033725 14964213
11511 14964213 17405003 20280085 23914608 28719074 35811768 47221394 65531408 94289215
11503 94289215 137374663 197286979 274443833 346664410 347957479 264611679 170599731
11496 170599731 107500046 70723856 49389769 36523938 28531262 23435624 19877957
11489 19877957 16885283 14280638 12112419 10201713 8552270 7195563 6120003 5289760
11481 5289760 4644068 4165770 3800932 3485159 3164853 2872214 2626628 2392548 2172331
11472 2172331 1969691 1779368 1629017 1540841 1451445 1362853 1268357 1159141 1070051 982929
11462I82929n7669l1609l5676n5100o1277m6940l3272k1851j3661l6887l3578
11451E55409k8907l4442k0925j2751o309j1146k3946k7460j4213j5843j9504j8119
11439C21844k0587j1153R518l535j4374k1820l0275q756j3329n784K5907J6798
11427B44454J870p138j2492j8754j4148j1368j6705P743J4479q52m185j7413p735
11414A57756l863m894K651R70j979N345J0976K386j0144m340n496p418k4120j7693
11400A00137J1303K0003n03k701N139M385j2868k3504J259L897Q867L0115K4823
11387A70352O103K4072L048N050Q763k212l99L7637L9644K1182K1161O434k7215
11374C13620l0632J5703k625j8865o542o385k1144k5595j6005J1126K0574O22
$$ plain form
11462 982929 925260 893651 857975 802875 741598 694658 661386 639535 625874 588987 555409
11451 555409 526502 492060 471135 458384 452075 440929 416983 389523 375310 359467 339963 321844
11439 321844 301257 290104 299622 296087 281713 259893 229618 220862 207533 201749 227656 244454
11427 244454 246324 239186 226694 207940 193792 182424 165719 173462 187941 187089 182904 165491 157756
11414 157756 153893 148999 151650 152620 150641 155986 166962 169348 159204 154864 149368 141950 117830 100137
11400 100137 111440 131443 130940 128239 133378 137763 124895 101391 102650 106547 115414 145529 170352
11387 170352 176455 200527 203575 208625 217388 215176 214777 252414 292058 313240 334401 340835 313620
11374 313620 282988 298691 296066 277201 270659 264274 243130 217535 201530 212656 233230 233852
11362B33852j037N377J6535L0727O440K983Q111K9925J810q213M450K6985L9864
11349C97809M1709N0048M3126K4601K7385J5216o831o331M639N3p647j5382p055
11336E61340k254p491O50k0029l8867q835J818P95q55J5404O769l233Q397J6467
11322E30076o406K333q318j0167O537P827Q336J4782j0168k9074m2728n5542m6403
11309C61085k3547j1213l957l1294l6211p583m457j4705k6334q018k3318l6903
11297A33545k009n515j5669o649Q20O476r177k2305j876N751j1921o980o120o378
11283E1993J5576O826o580q47O792p586j4920j2505r62O320J1504k377j5251k1250
11269A6733j3555R954n071j5715K50R328l074L271j5710o691p607l089J691J2261
$$ plain form
11362 233852 232815 238192 254727 285454 291894 294877 302988 332913 334723 326510 330960 357945 397809
11349 397809 439518 489566 532692 557293 584678 599894 593063 586732 591371 591424 583777 568395 561340
11336 561340 559086 551595 552245 532216 493349 484514 486332 487127 486272 501676 508445 505212 513609 530076
11322 530076 523670 526003 517685 507518 514055 521882 530218 545000 534832 505758 463030 407488 361085
11309 361085 337538 326325 322368 291074 254863 247280 242823 228118 201784 193766 170448 133545
11297 133545 131536 126021 110352 103703 104523 110999 101822 79517 77641 83392 71471 64491 58371 51993
11283 51993 67569 74395 67815 66968 73760 66174 51254 38749 37787 44107 55611 53234 37983 16733
11269 16733 3178 13132 8061 -7654 -7404 1924 -1150 2121 -13589 -20280 -27887 -30976 -29285 -17024
11255a7024K2370Q073K038k691k714M614J7733M315j5300j3731j133j1043l2N363
11241H38J2568J4288Q76k5096j6626M560P366M932J236j802N692J2398R65j766
11227B0429M412o315j4794r816n551J3942J3193K884j6180l046M154K467P942
11214A3721j768J408J700o685l903J7229K885J4223J010r553l620K843j0241o009
11200A3240m300j7677O95Q098J5110O189n842Q68j1288l804K056o312j7587O028
11186a4526J1178M482p02O283O395n809j5830R073J8013O548J08k0177p37N335
11172I634Q351l817K885J3952J2503J0855Q947Q205Q248J9348K0379J7461K0854
11159A57805L6298K5939K3203L0981K8232J7851J095k543j440j3843l9190n2862
$$ plain form
11255 -17024 5346 13419 15457 12766 10052 14666 32399 36714 21414 7683 6550 -4493 -4525 838
11241 838 13406 27694 28570 3474 -13152 -8592 -1226 3706 4942 3140 8832 21230 22195 20429
11227 20429 24841 18526 3732 -6084 -11635 2307 15500 18384 2204 -842 3312 5779 13721
11214 13721 11953 13361 15061 8376 4473 21702 24587 38810 39820 30267 26647 29490 19249 13240
11200 13240 8940 -8737 -8042 56 15166 21355 15513 16381 5093 1289 3345 -2967 -20554 -14526
11186 -14526 -3348 1134 432 6715 13110 7301 -8529 544 18557 25105 25213 5036 4299 9634
11172 9634 17985 14168 17053 31005 43508 54363 63310 71515 79763 99111 119490 136951 157805
11159 157805 194103 220042 243245 274226 302458 320309 321404 318861 317421 303578 264388 211526
11147B11526m3806l5858m1583j9120k2102k5497K062r59M561J1203K0337N884
11135F6648m49j5257n154J0102J3527J2072J2159O234R487L1129J7105K0340J106
11122A79049n070l3809k2756k8100j5184n901Q40l245j7315n696q850o597o053
11109B1313l032l397J890j120k590q247l038M027q426p882P697q665J4861J2422
11095A5813o50J4520J4926l455o165k354J759l032J638l544m357p30M205K0399
11081D8973J5222J0112M329j1814n615P150K5030P770P312J7506K7767L3721O2666
11068B50129R5370J50940K19794L09861M07045L41891m0085m16708m30492k96035
11058E91710j92312j04584o6154n0831k5218k3376k2268k7284k2724l371j6160
$$ plain form
11147 211526 167720 131862 90279 71159 49057 23560 25622 24663 29224 40427 60764 66648
11135 66648 66199 50942 45788 55890 69417 81489 93648 99882 109369 140498 157603 177943 179049
11122 179049 173979 140170 117414 89314 74130 68229 69069 65824 48509 42813 33963 27366 21313
11109 21313 18281 14884 16774 15654 13064 4817 1779 5806 -2620 -10502 -2805 -11470 3391 15813
11095 15813 15163 29683 44609 41154 34989 32635 34394 31362 33000 29456 25099 24369 28574 48973
11081 48973 64195 74307 78636 66822 61207 68357 93387 101157 108469 125975 153742 187463 250129
11068 250129 345499 496439 716233 1026094 1433139 1775030 1734945 1318237 887745 591710
11058 591710 399398 294814 228660 177829 152611 129235 106967 79683 56959 53588 37428
11047C7428q304N216M839O958J2043Q079p181J4602K0564J7508K6825P496J4154
11034A60227M750o047k3225k9677j8754j6287j3405j4998j1875K775P366L180
11022D4030k4378o923Q587N467j526o905p662l656J7101O937L474J2880J8107
11009F5533J7193J4617J9619J7736K2921J5593P240k402l8456m3273l4072k2350
10997C9899q969l853P867n541k009j3287L152L424j5563r044O67M660Q309j492
10983H220j5487J0188M969N479k837M574Q67N559j2895j1691J717P265J6433m615
10969A7746L641n592j5243k2411l513J3447Q148k667N955J7939K4014l920j5269
10956B2275p662P60k433n187m08j041q892J6688N235j9766q180K078J4964J0725
$$ plain form
11047 37428 29124 34340 39179 46137 58180 66259 59078 73680 94244 111752 138577 146073 160227
11034 160227 164977 158930 135705 106028 87274 70987 57582 42584 30709 33484 40850 44030
11022 44030 19652 12729 21316 26783 25257 18352 10690 7034 24135 31072 34546 47426 65533
11009 65533 82726 97343 116962 134698 157619 173212 180452 178050 139594 96321 62249 39899
10997 39899 30930 27077 34944 29403 27394 14107 17259 20683 5120 -3924 -3257 1403 9712 8220
10983 8220 -7267 2921 7890 13369 10532 15106 15973 21532 8637 -3054 -1337 5928 22361 17746
10969 17746 21387 15795 552 -21859 -25372 -11925 -3777 -6444 -489 17450 41464 37544 22275
10956 22275 14613 15373 12940 7753 7345 6304 -2588 14100 19335 -431 -8611 -6533 8431 19156
10942A9156l07m856K504Q18j2585O095p01l493p72R038R264r230o347k670j0248
10927d334N718M195p655L638P267J2811Q479j2714n525P304M28n99p80J9239J449
10912C8921j1653k2848L761j681J11J31p316J112j811O399K986L187q425L639
10898F513k088j2591J384J4976J2675P331N647R683P586l725p205J0657J5962
10885F6805p233j4128j8151q532N133L716j2070q510m933J9029Q039p556k410
10872A9199J8265L620j9754n47O19n544m829J390K2172J6928J5963k28j7194q887
10858D1173o541j1248j5788m92l523j679M420J596k649L111J9426K5079L275K428
10844E8588J4252J713o63J1468K717L6595K2767K9305O6940J01671J48031J81007
$$ plain form
10942 19156 18849 13993 16497 17315 4730 10825 10124 6631 5859 14897 24161 14931 8584 5914 -4334
10927 -4334 1384 5579 -2076 1562 8829 21640 30119 17405 11880 19184 19612 19013 18233 37472 38921
10912 38921 27268 4420 8181 6500 6611 6742 -574 538 -1273 5126 8112 11299 2874 6513
10898 6513 4425 -8166 -6782 8194 20869 28200 33847 43530 51116 47391 40186 50843 66805
10885 66805 59572 45444 27293 18761 23894 27610 15540 7030 2097 21126 29165 21609 19199
10872 19199 37464 41084 21330 20783 21402 15858 11029 12419 34591 51519 67482 67254 50060 41173
10858 41173 34632 23384 7596 7104 3581 1902 6322 7918 5269 8380 27806 52885 56160 58588
10844 58588 72840 74553 73890 85358 88075 124670 147437 176742 243682 345353 493384 674391
10832F74391K53487L23135L08873J15440j99214l65292l46734k36036j59017j03144
10822B65889p5385n0381l7535m631j5117p585K698j2329j1386j0864O046K8767
10810G8187J6551m984r154n712l614O567K587j1417j3201j1318o326l355O030
10797D0841j328o31j1851j7321k610L394J6371M374m394j274J3440l796j5192
10784B0023r245j101O066M532J0579j392o506K99j0582r471J0623N069L641O036
10770B8571k424Q349N219n366J163K952l365l164N965j461j6026k2347j676J3431
10756I821J3241J751P252K952M84q245L1k328q68K723J8940J9844k861j8801j3963
10741B9973j063J428P861J03q073j67R44Q270l298Q34l220r783j5103j1841N039
$$ plain form
10832 674391 927878 1251013 1559886 1675326 1476112 1110820 764086 528050 369033 265889
10822 265889 190504 140123 102588 97957 82840 75255 77953 65624 54238 43374 49420 78187
10810 78187 94738 89754 80600 74888 71274 77841 80428 69011 55810 44492 38166 34811 40841
10797 40841 39513 38882 27031 9710 7100 10494 26865 31239 26845 25571 39011 35215 20023
10784 20023 10778 9677 15743 20275 30854 29462 22956 23255 12673 3202 13825 18894 22535 28571
10770 28571 26147 34496 39715 34349 35512 38464 35099 31935 37900 36439 20413 -1934 -3610 9821
10756 9821 23062 24813 32065 35017 35501 27256 27287 24959 24091 26814 45754 65598 62737 43936 29973
10741 29973 28910 30338 38199 38302 30229 30062 31006 39276 35978 36812 33592 23809 8706 -3135 1904
10726A904O756R672K3943N716j0531J3538R850r820n330k812J5393M8L848n288
10712E6887K163N845j1648j4174P193p45J1816p201k903K569j7286Q098J4312
10699E4926J897q262n983Q93J7194L738M711n62p290Q106j082l305J6461J0533
10685I1975O166L558J333J521j7942j5133J5425J2935l082J0865L870j0372J153
10672A02272P8K387J1745J4661J1876L9553L8665N3741M9131P278m0962m0663
10660B49762m0881l9020k2634k823j7457m162L419j6836j1631j161J6661o750
10648A06487O314J5078k791k925J1993l831J2920K8291p394p450k520P736o012
10635A55896j715J191l722k594m058j4682j0378j4932k122p114j4188J5163Q594
$$ plain form
10726 1904 8660 18332 42275 47991 37460 50998 60848 51028 45698 42886 58279 58327 62175 56887
10712 56887 59050 64895 53247 39073 46266 45521 57337 50136 47233 49802 32516 40614 54926
10699 54926 56823 48561 42578 43471 60665 64403 69114 68552 61262 69368 68286 64981 81442 91975
10685 91975 98141 101699 103032 104553 86611 71478 86903 99838 96756 107621 111491 101119 102272
10672 102272 102350 104737 116482 131143 143019 182572 221237 274978 324109 331387 290425 249762
10660 249762 208881 169861 147227 144404 126947 122785 126204 109368 97737 96576 113237 106487
10648 106487 112801 127879 125088 122163 134156 130325 143245 171536 164142 156692 154172 161908 155896
10635 155896 154181 155372 151650 149056 144998 130316 119938 105006 102884 95770 81582 96745 105339
10622A05339r336j3506L643Q527p172r942k0245j948J0760m766R311K06P766K730
10608H1367J689J4982J0386p66J0270J4098J0606K145j8548j2402j175L99j593
10595A11458o437J2871J9087K1766j247q130r553q622j2939j2821J122j4790L988
10582I5753Q418J145N860J3672O642R37r916k840K839N397K928j2835R602J1854
10568A39456l927j0861m119J0621L515J0998L0208K9634J5292k462j468L542j4886
10555B05543k134L240k611r478q990J5905N16k374O50J3614K3683J1925P215J3058
10541B69762K0394N9337M2961J9918L7305N2088P684m8675m2437k9298l3420j8462
10529C37157j1645O674o532k5075k8687p946J5874J8324J3039J6441K0956J5193
$$ plain form
10622 105339 96003 82497 86140 94667 87495 77553 57308 55360 66120 61354 70665 70871 78637 81367
10608 81367 83056 98038 108424 107658 117928 132026 142632 144777 126229 113827 112652 113051 111458
10595 111458 105021 117892 136979 158745 157498 149368 139815 131193 118254 105433 106555 91765 95753
10582 95753 104171 105316 111176 124848 131490 132427 122511 119671 122510 127907 130835 118000 127602 139456
10568 139456 135529 124668 120549 131170 134685 145683 175891 205525 220817 218355 216887 220429 205543
10555 205543 203409 206649 204038 194560 185570 201475 201991 199617 200267 213881 237564 249489 256704 269762
10541 269762 290156 349493 392454 412372 449677 501765 509449 460774 418337 389039 355619 337157
10529 337157 325512 332186 325654 300579 271892 263946 279820 298144 311183 327624 348580 363773
10517C63773J7563q215j1815l793j0069J033K119j3741j8278l147J2146J2304
10505C39880J0603O873N563R125J3953J8608J1463j4766l309K1936J1236M247
10493D35412K6061K3885K0206J8541O418R196R372K3641L1894M9304M4365L1365
10481G29660M8329M7551J8813j6407k3968m894J0943J8017K5216M0110L3991Q145
10469I35506L599K1270L3296L3014L0115K3922K9263M7628P1135P9327O5859N6286
10457A430220O1176O9750L8293N2996P7686Q9898R2949J15485J45542J88185K00997
10446B563177K24749K82339L37938L75380M02375M00599L45401K17062N1004j8816
10436E181208J7409J00442K39646L97976N82571Q61946J119577J287616J299332
$$ plain form
10517 363773 381336 373121 361306 357513 347444 348477 350596 336855 318577 315430 327576 339880
10505 339880 350483 357356 362919 372044 385997 404605 416068 401302 397993 419929 431165 435412
10493 435412 461473 485358 505564 524105 530523 539719 549091 572732 604626 653930 698295 729660
10481 729660 777989 825540 844353 827946 803978 799084 810027 828044 853260 893370 927361 935506
10469 935506 939105 960375 993671 1026685 1056800 1080722 1109985 1157613 1228748 1308075 1373934 1430220
10457 1430220 1491396 1561146 1599439 1652435 1730121 1820019 1912968 2028453 2173995 2362180 2563177
10446 2563177 2787926 3070265 3408203 3783583 4185958 4586557 4931958 5149020 5200024 5181208
10436 5181208 5198617 5299059 5538705 5936681 6519252 7381198 8500775 9788391 11087723
10427A1087723J269501J460447J626213J376215J172652J645755K741622M268091
10419B6648219O334126R367008J3992638K0933027L0880679M3586187N7204264
10412B08946148O5889354M7469354j4323452p0616055p5659675n3915198l3870103
10405G3920373k1104537j3541375r010264o247015m510394l368375k548380j864087
10397A1725946j364122j018372p91100o02665n36169o84842q31357p63642o01904
10388D531773n14399m39334l52977k99434k71471k43582k12673j68156j32383
10379A897364j25167j35464j36107j12133q2858q1022p2814n7693n0586o5065
10369I78455p1776m8696m5817l8127m1182j8931k2500m2961m1422l0257r234l477
$$ plain form
10427 11087723 12357224 13817671 15443884 16820099 17992751 19638506 22380128 26648219
10419 26648219 32982345 42349353 56341991 77275018 108155697 151741884 208946148
10412 208946148 274835502 322304856 307981404 237365349 161705674 107790476 73920373
10405 73920373 52815836 39274461 30264197 24017182 19506788 16138413 13590033 11725946
10397 11725946 10361824 9343452 8552352 7949687 7413518 6728676 5897319 5133677 4531773
10388 4531773 4017374 3578040 3225063 2925629 2654158 2410576 2197903 2029747 1897364
10379 1897364 1772197 1636733 1500626 1388493 1305635 1224613 1151799 1094106 1043520 978455
10369 978455 906679 857983 812166 774039 732857 713926 691426 648465 607043 576786 567552 564075
10357E64075k5959j9196j8885l3959k8270j9229l0205j6567q890R22j0905j6768
10345C36164j2841k1079j5623j2630J909p768J604Q178M560j1883j5873q632j7633
10332B28453j3297m977l854j4380J0330R469j0610l8201j4315N037K119N43N671
10319A61988l740k596N40m631k267m177k0649j1799r404m114P72j417k1646q170
10305F8690j0886n319J0152k042J2949J6914J1194P154J427n064l818j3904n555
10292H1892K0282J1782K4196L1452R359n72m543q958P621Q239o040L655j0772
10279A67593k3436j2222k0711k4990k4450j891J690n157k638Q730N757m031q010
10266E6234j1978j3629k7076r359L05O691J2973K6599K8146J4038j455j0971j2190
$$ plain form
10357 564075 538116 518920 500035 466076 437806 418577 388372 371805 362915 363837 352932 336164
10345 336164 323323 302244 286621 273991 275900 268132 269736 277914 282474 270591 254718 246086 228453
10332 228453 215156 210179 206325 191945 202275 211744 201134 162933 148618 153655 155774 156317 161988
10319 161988 158248 155652 156192 151561 149294 145117 124468 112669 103265 99151 99923 98506 76860 68690
10305 68690 57804 52485 62637 60595 73544 90458 101652 108806 110233 105169 101351 87447 81892
10292 81892 102174 113956 138152 169604 178963 178391 173848 164890 172511 180750 174710 178365 167593
10279 167593 144157 131935 111224 86234 61784 59893 61583 56426 53788 62518 68275 64244 56234
10266 56234 44256 30627 3551 -5808 -5503 1188 14161 40760 68906 82944 81489 70518 58328
10253E8328O650O963p852j3524N794K887Q889L159j1710j7134L643M198k897q906
10239C8488J0051K3318M830r656k772K744Q727q016k7695k1294P587J3378K2887
10226F2577K074j1759j9301p230o87j493l122o92r863m414J1548J7017J4848j595
10212D7908k133l621j4853p542J0828J402M203L78M744o506J85J0346j1858k5705
10198G776o238k312J4662M214K08J230k746m110L307n954n837r270J3261J1222
10184A9413J163k2937j1143m232l237K412j471R669J6857l275J801j1881j0890
10171a7751j3945J5674N635j805m407N647R105J8358K4469O666j3934R11l800
10158C0823j6119o752n14O895l604j0113j028P912m650j284r233j2443j1449L183
$$ plain form
10253 58328 64978 71941 64089 50565 56359 59246 68135 71294 59584 42450 46093 50291 47394 38488
10239 38488 48539 71857 76687 67031 64259 67003 75730 67714 40019 18725 26312 39690 62577
10226 62577 64651 52892 33591 26361 25674 24181 21059 20367 10504 6090 17638 34655 49503 47908
10212 47908 45775 42154 27301 19759 30587 31989 36192 36570 41314 34808 34993 45339 33481 7776
10198 7776 1538 -774 13888 18102 18310 19540 16794 12684 15991 10037 4200 -5070 8191 19413
10184 19413 20576 -2361 -13504 -17736 -20973 -18561 -20032 -10363 6494 3219 5020 -6861 -17751
10171 -17751 -31696 -16022 -10387 -12192 -16599 -10952 -1847 16511 40980 47646 33712 34623 30823
10158 30823 14704 7952 7438 14333 10729 616 -412 7500 2850 1566 -7667 -20110 -31559 -28376
10144b8376K1570Q603O913j543p57k14M98J4676j3209j3227K820J1417J1875j0075
10130A0971p074J2102m285K526J538r11o400j2973l149p68m980M897k630J400
10116i736J2377M064J15o875q353r447K650j340q849R426Q160M534L699j123n358
10101f056N386J4025J661L241L886N489R75o52Q140M571L829J3323J6204K7802
10087A01824L2664O0850M6729N2202J4783m8287n6129m5530n4188m6514k4772
10076C3632j6310o713N23J947N40J7286P15q97j19J2544J0977m804n051n466j197
10061C7607j4981k355l176j294R510K103L165P271r552j4129O853J6186J0715
10048D7923J859j0303J7213J4632M060Q529m1Q264j1006m636n326k522o522n941
$$ plain form
10144 -28376 -6806 1797 8710 7167 6410 6196 6694 21370 8161 -5066 -2246 9171 21046 10971
10130 10971 3897 15999 11714 14240 15778 14867 8467 -4506 -7655 -8423 -13403 -8506 -11136 -9736
10116 -9736 2641 6705 6820 -55 -8408 -17855 -15205 -16545 -25394 -15968 -7808 -3274 425 -698 -6056
10101 -6056 -670 13355 15016 18257 22143 27632 28607 27955 36095 40666 44495 57818 74022 101824
10087 101824 134488 195338 242067 294269 309052 260765 204636 159106 104918 58404 33632
10076 33632 17322 10609 11132 13079 13619 30905 31620 30723 30604 43148 54125 49321 44270 38804 37607
10061 37607 22626 20271 17095 15801 25311 27414 30579 37850 28298 14169 21022 37208 47923
10048 47923 49782 39479 56692 71324 75384 83913 83872 92136 81130 76494 71168 68646 62124 56183
10034E6183k832r353R088L262J2530Q848k155r20o843j0366j6295j4230j465J2151
10020C7603P165J125j3203q617M497O496o787p771J160J0568K568l779n444q241
10006A7340R174J1715O442J1836K5685K027J925P918J5417J8196J0043Q025M5566
9993A91309N5632P5667J27588J71332K41876L16442L13284J62943j49770l67543
9983A138760l53303k46547j73146r3360n2301m6240m0602j7382j3986j475J42
9972A00560m732l863j4085q60Q69p421r069j2101k4684j2025n696N58L318p976
9958B793J53r296J76M219r462M993J8237Q999N989J1274K161n681j407J932J0182
9943D5262j485j6524j9881n577r82J2080Q708J1203Q076J7611K2826K2848K7273
$$ plain form
10034 56183 53351 43998 53086 56348 68878 77726 75571 74651 67808 57442 41147 26917 25452 37603
10020 37603 44768 45893 32690 24073 28570 35066 28279 20508 21668 32236 34804 31025 25581 17340
10006 17340 26514 38229 44671 56507 82192 84219 86144 94062 109479 127675 137718 145743 191309
9993 191309 246941 322608 450196 621528 863404 1179846 1493130 1656073 1506303 1138760
9983 1138760 785457 538910 365764 272404 220103 173863 133261 115879 101893 100418 100560
9972 100560 95828 91965 77880 77020 77889 70468 61399 49298 24614 12589 6893 7451 10769 2793
9958 2793 2946 -6350 -6174 -1955 -11417 -6424 11813 20812 26801 38075 40236 34555 33148 35080 45262
9943 45262 43777 27253 7372 1795 813 12893 21601 32804 40880 58491 81317 104165 131438
9930A31438K0235K43r548j4559l5825k6289n183j3305j2288J0924J7636J3685
9918G7164k758l3538j1640p235j0162j8528j7759L716J9083K113k298M677J332
9905D167j48J4639J1357N33o505j8388j5533q292N388M250m149l904O136K704
9891g745p078Q608J6667J6837r882j1255Q045q655n524J250l209n020J309K645
9877c007Q056J5400O963J4487J4147r277j7962k0087m126j4797k890K515l516
9864a4094J53J4371N263N138n26Q202O64l255J0874N69Q918M335r719l656K2968
9849E0205L5384J2682J2504P439l532J2631J7401J2410n142r59J5889L5571M4161
9836B46644N6833Q2134J22617J74048K75772M61398P36079J056413J402429J269872
$$ plain form
9930 131438 151673 151916 142368 127809 91984 65695 60512 47207 34919 45843 63479 77164
9918 77164 74406 40868 29228 21993 11831 -6697 -24456 -20740 -1657 456 -1842 2835 4167
9905 4167 4019 18658 30015 30548 24043 5655 -9878 -18170 -12782 -8532 -12681 -16585 -10449 -7745
9891 -7745 -14823 -6215 10452 27289 17407 6152 14197 5542 18 1268 -1941 -6961 -5652 -3007
9877 -3007 5049 20449 27412 41899 56046 46769 28807 8720 4594 -10203 -13093 -10578 -14094
9864 -14094 -13941 430 5693 10831 10305 18507 19171 15916 26790 27359 36277 40612 30893 27237 50205
9849 50205 85589 98271 110775 118214 114682 127313 144714 157124 151982 151023 166912 202483 246644
9836 246644 303477 385611 508228 682276 958048 1419446 2155525 3211938 4614367 5884239
9826E884239J95385j204872j706123j276241p30731l99440k32521j32145r0173
9817C07378n2135m9068m5783k6029o738k2682j0566p467l864q542o955J827k018
9804F7358P201k82j1705n284o188q817k2503p064K377N67q326k609J4134J184
9790B0043r363o81M901q475j2422M472p799Q903J4378M967m494m673L386k782
9776A0361K512R325J2878J1956K2747L2019J2511J2197K3302K0941L425j6708
9764A57466k5453j6473k2872r049j49k0839k2697k0681j880P573P504l021j8442
9751A0987j2092j0328R140K4261q313k571n23n330J4759P840n751j2785j2670
9738c376P44L698k308J424R768j6475j4829M500M457Q753M051p81J4644n727k618
$$ plain form
9826 5884239 6079624 4874752 3168629 1892388 1161657 762217 529696 397551 307378
9817 307378 255243 206175 160392 134363 127625 104943 94377 86910 83046 74504 67549 69376 67358
9804 67358 74559 74277 62572 57288 51100 42283 19780 12716 15093 15660 7334 4725 18859 20043
9790 20043 10680 9999 14900 6425 -5997 -1525 -9324 -421 13957 18924 14430 9757 13143 10361
9776 10361 12873 22198 35076 47032 69779 101798 114309 126506 149808 170749 174174 157466
9764 157466 132013 115540 92668 83619 83470 62631 39934 19253 17373 24946 32450 29429 10987
9751 10987 -1105 -11433 -2293 21968 13655 11084 10561 5231 19990 27830 22079 9294 -3376
9738 -3376 -2632 1066 -1242 182 9950 -6525 -21354 -16854 -12397 -3644 407 -374 14270 8543 5925
9723E925M196J5774R5J079K5930J7696L4815N2981L9391M4491M6970J9475r164
9710B99654k7368n3103m9605m4601l4948k6985j3587j0524n932j3167j2277N147
9698A2704J339l44q90j3297n402p279P734O873j491O169P477Q241J265n027j849
9683A6223N872J17k167l941m066j1787o665L636Q160K1372L462L970o336j7694
9669A0156j963J2154O863k2320o776J4442J3694Q842L675R864o517j0907j1230
9656A9977q104M507q526k1469O169p662Q054j1543j55O405o45K1898J3295o666
9642A5535o884j3351q064P789M736L396j670j0240P613P763k009J948J0126J1110
9628B7798P369r530m489L621q99j3481j57K714O637p041P308R521J3210j936j6996
$$ plain form
9723 5925 10121 25895 25990 27069 52999 70695 105510 158491 197882 242373 289343 308818 299654
9710 299654 272286 219183 169578 124977 90029 63044 49457 38933 33001 19834 7557 12704
9698 12704 14043 13699 12809 -488 -5890 -13169 -5435 1438 -53 6116 13593 21834 23099 18072 16223
9683 16223 22095 22212 20045 16104 12038 251 -6414 -2778 5382 26754 30216 34186 27850 10156
9669 10156 8193 20347 27210 4890 -1886 12556 26250 35092 38767 48631 42114 31207 19977
9656 19977 11873 16380 7854 -13615 -7446 -15108 -7054 -18597 -18752 -12347 -12992 8906 22201 15535
9642 15535 8651 -4700 -12764 -4975 -239 3157 1487 -8753 -1140 6623 4614 6562 16688 27798
9628 27798 35167 25637 21148 24769 23870 10389 10232 12946 19583 12542 19850 29371 42581 40645 23649
9613B3649m391K317j01J1431m412q427p977j3688K896m769p333n718R673k779
9599i629j418o799j56J0699K3956K0249P926n293r343j572n462J1580q828j3099
9585A2811j042N387m623n832l600k24l782k79k908n153J9034J3652p007j475n781
9570I178J0644O598K04M38r609r638j7938K080Q488J1359M18o928K648J3119q37
9555B0224P762J385j2092j0307j292r633j2650N830O657O786N870J4580j2391
9542A0729j7853n70L338R184K585M272J0008o700o475m417J449O529J5361q198
9528A9242j1960j493O121L637o990j1382m322n666j480o492J3233J7057m190p622
9514b307l363L548J4011l216k0070P542J8846J8366l980j709R75q569j1196k461
$$ plain form
9613 23649 19258 21575 21474 32905 28493 20066 12089 -1599 1297 -3472 -10805 -16523 -6850 -9629
9599 -9629 -11047 -17846 -18002 -7303 16653 36902 44828 39535 30192 28620 23158 34738 25910 12811
9585 12811 11769 17156 12533 6701 3101 2877 -905 -1184 -4092 -9245 9789 23441 16434 14959 9178
9570 9178 19822 26420 26624 27062 17453 7815 -10123 -8043 445 11804 12222 5294 7942 21061 20224
9555 20224 27986 29371 17279 6972 5680 -3953 -16603 -10773 -4116 2670 8540 23120 10729
9542 10729 -7124 -7694 -4356 4828 7413 11685 21693 14993 8518 4101 5550 12079 27440 19242
9528 19242 7282 5789 11910 15547 8557 -2825 -7147 -12813 -14293 -20785 -7552 9505 5315 -2307
9514 -2307 -5670 -2122 11889 8673 -11397 -3855 14991 33357 29377 27668 28643 20074 8878 6417
9500F417M769M183K561M764q981l402J1445j048j4021o435n158j1291P60J5157
9486b80m81j5361q272Q755J049R463L609l573P437J7557j0058r607Q753Q577O12
9471A8180k038q596L874J6459P814n323o031j535Q854L898m803o934j0552p980
9457E287k1989j703O480J3007P180R386O343j4273J882J1129M461j57N495j7188
9443A5340K927J2234j4069p726M110r59N706K808j688j2567j437J68j035M811
9429H623K312m115j0248P226K0870J685j7290M746l81j1825K447K8193J7894P754
9415E7891M972o946j8629q783j0233J3049M506l288l068P926o898n025J377j1533
9401A5318k04M29P717J4450k866j3029J091j4552r115J1129K0628J1801j1398
$$ plain form
9500 6417 11186 15369 17930 22694 13713 10311 21756 20708 6687 252 -4906 -16197 -15437 -280
9486 -280 -761 -16122 -24394 -15639 -14590 -5127 -1518 -5091 2346 19903 9845 238 8991 17568 18180
9471 18180 16142 7546 11420 27879 35693 30370 24339 22804 31658 35556 30753 23819 13267 5287
9457 5287 -16702 -18405 -11925 1082 8262 17648 23991 9718 11600 22729 27190 27033 32528 15340
9443 15340 18267 30501 16432 8706 12816 11857 17563 20371 18683 6116 4679 4847 3812 8623
9429 8623 10935 6820 -3428 3798 24668 26353 9063 13809 13428 1603 4050 32243 50137 57891
9415 57891 62863 55917 37288 28505 18272 31321 35827 32539 29471 37397 30499 25474 26851 15318
9401 15318 15114 15543 23260 37710 34844 21815 22906 8354 -761 10368 30996 42797 31399
9388C1399k3581M10K363O370J1957P616p929j2147M841N944l047m296j3214o367
9374C19J1313Q865R507r560n56O644r946J421Q82J509J0081P871M9j4912o056
9359A7431r143j3747l170L153Q461Q022l312j478k318o341N025J2997k124p325
9345F131M870k754l691J2303R044J1907m050q461j0818p48J1845N693O843n790
9331C2324j054j2235Q867J1910J768J965J0546J9107L0225K2941j7517n0907l3795
9318B4145J0941N479k0205K923M575P303n26L78n220n743m696r997M383R224N315
9303B8279P636M47J0822J66j484q310j1052o655k693O653L236P324J4561L515
9289E2445L425R60j221j5119q806J7k80q158o342J6012R93r99N621J5850j278
$$ plain form
9388 31399 7818 8228 10591 16961 28918 36534 28605 16458 21299 27243 24196 19900 6686 319
9374 319 11632 20497 30004 20444 19888 26532 16586 18007 18889 20398 30479 38350 38399 23487 17431
9359 17431 8288 -5459 -8629 -5476 2985 11007 7695 6217 3899 -2442 2583 15580 13456 6131
9345 6131 11001 8247 4556 16859 25903 37810 33760 25299 14481 13733 25578 31271 38114 32324
9331 32324 31270 19035 27902 39812 41580 43545 54091 73198 103423 126364 108847 57940 24145
9318 24145 35086 40565 20360 23283 27858 35161 34635 35013 29793 24050 19354 9357 13740 22964 28279
9303 28279 35915 36362 47184 47350 45866 37556 26504 19849 17156 23809 27045 34369 48930 52445
9289 52445 55870 56830 55609 40490 31684 31701 31421 23263 16921 32933 33926 32927 38548 54398 53120
9274E3120p872j752k095n047n213N503L801n597N706N050L59J036J129p12N029
9259E2445N602J2326J667J798o189j3129O040K408m192m323J826L438j9623j9853
9245B0241J4246K4044O349L921n185j6590j0990J7532J0743k5086j7027P817K20
9232C0235K70P811m342K871P293J6292K043j745q489o107q200l592O118K746J3407
9217E6611J1145P65p298q351m437J5783J843j1007n530q618k612J4148P574l753
9203E6263p529m654J370r592N520J0498k111J4593J048p497m738J4439J1707k42
9189G9075j1019j6893j523P320R316o172o889J1737n81k3055l16k08J3999J129
9175E5920q56J2401j954Q994K551o959J865m688K762k775m484p390K974L700m918
$$ plain form
9274 53120 45248 43496 41401 36354 31141 36644 40445 34848 40554 45604 45963 46999 48128 47416 52445
9259 52445 58047 70373 72040 73838 67649 54520 60560 62968 58776 54453 56279 59717 40094 20241
9245 20241 34487 58531 64880 68801 63616 47026 36036 53568 64311 39225 22198 30015 30235
9232 30235 30505 38316 33974 36845 44138 60430 62473 60728 52239 46132 37932 34340 40458 43204 56611
9217 56611 67756 68521 61223 52872 48435 64218 66061 55054 49524 40906 38294 52442 60016 56263
9203 56263 48734 44080 45450 35858 41378 51876 49765 64358 65406 57909 53171 67610 79317 79075
9189 79075 68056 51163 49640 56960 66276 60104 53215 64952 64371 41316 41000 40792 54791 55920
9175 55920 55064 67465 65511 74505 77056 70097 71962 67274 70036 67261 62777 55387 58361 62061 57143
9160E7143j1189m338R985J1648L610Q066L784p081j733m768n145l109j2868J092
9146D5097K2166J6190l17l998p402l033j997M864J0910R238j2954M554j988j6982
9132F4348j2233j425J5100J3707o117p993j2067j0058J1977J8578J2573O175L626
9119I6191r045o468P779J517n406N091O832j1279j6698q861J4842j661j5914J4485
9105G1405k358p338J1701R805J0544N439l619j2729M726m765j6784l923P695J0018
9091G9817L061m592J769P140J1417n67M00r857o464j769n565M618P306K683k981
9076H6416j971L726O014L928J1969j4895j507J3005j328k915k514l514K091K3292
9062A21797K631j4442O07P146Q71J238j77n914n323J126k325l123m926J059o538
$$ plain form
9160 57143 45954 41616 51601 63249 66859 74925 78709 71628 69895 65127 59982 56873 44005 45097
9146 45097 67263 83453 83136 79138 71736 68703 66706 71570 82480 91718 78764 83318 81330 64348
9132 64348 52115 50690 65790 79497 73380 65387 53320 43262 55239 73817 86390 92565 96191
9119 96191 87146 80678 88457 89974 84568 89659 96491 85212 68514 59653 74495 72834 56920 71405
9105 71405 69047 61709 73410 83215 93759 99198 95579 82850 87576 82811 66027 62104 69799 79817
9091 79817 82878 78286 80055 87195 98612 98045 98445 88588 82124 80355 74790 79408 86714 89397 86416
9076 86416 84445 88171 94185 98113 110082 95187 93680 106685 105357 102442 99928 96414 98505 121797
9062 121797 124428 109986 110593 117739 118610 119848 119671 113757 108434 109560 107235 104112 99186 100245 93707
9047I3707k9P632J2100O476q547L910P535O772k070j1845r755N413Q125m150K0837
9032A36111O993o830k433j5459n898O89K2549J3645K923L325j2956j6146r740
9019A16773R59K339Q214J080L03l609O490p948J572L701J460K192J766Q14K67
9004A36373K657L922j4773O091J9115J8712j0990j0550l543R440J132j1736J7067
8991A62917J2235j0112m908L195J2682r806j1435Q844m412q93M291m589R97j5080
8977A43926p889L1661J0477R6m11j210J3372Q338q450k489n724j3726P231O282
8963A81484J371k075K300R557P139O666O897L899k892j2778Q43j4509M501l805
8949A88598N93J0560M479J4549L611j0518l133K630N541o486P003J2283Q951L484
$$ plain form
9047 93707 93678 101310 113410 119886 111339 115249 122784 129556 127486 115641 105886 111299 119424 115274 136111
9032 136111 143104 136274 133841 118382 112484 113173 135722 149367 152290 155615 142659 126513 116773
9019 116773 117732 120071 128285 129365 129668 126059 132549 124601 126173 129874 131334 133526 135292 136106 136373
9004 136373 139030 142952 128179 134270 153385 172097 161107 150557 147014 156454 157586 145850 162917
8991 162917 175152 165040 160132 163327 176009 166203 154768 163612 159200 158307 162598 158009 159006 143926
8977 143926 136037 167698 178175 178271 177860 176650 190022 198360 189910 187421 181697 167971 175202 181484
8963 181484 182855 180780 183080 192637 199776 206442 213339 217238 214346 201568 202411 187902 192403 188598
8949 188598 189191 199751 204230 218779 222390 211872 208739 211369 216910 210424 217427 229710 238661 242145
8935B42145M845j362M361j1993j9405r2Q538N495kQ647L695N404m320R50P262
8920B54168L909J1826r315l650L289o525K884K284j1119J0121Q763l634J1052
8907B74053Q640k090K457P11L464r90j212Q071O233Q35O809q453J162j379J1142
8892C09453k88M377J4133N747L20J265J0799Q449l878n452J649P243O992L341
8878C64150Q774l518j640N139k741L623l33K545J2312O452L203o273l064J1563
8864D00192Q7n116J0832P658J918o266J215N355k18O605q28N413N584K254J766
8849D36451J1158J4197J5038R841N624O28N093L684M374p659j81J8616J1075k095
8835E25844J603J3799J0552J1912P355m627K742Q134O662J4339L128j2160j283
$$ plain form
8935 242145 246990 245628 249989 237996 218591 218499 227037 232532 232530 241177 244872 250276 245956 246906 254168
8920 254168 258077 269903 260588 256938 260227 253702 256586 258870 247751 257872 266635 263001 274053
8907 274053 282693 280603 283060 283771 287235 286245 285033 293104 299337 300172 306981 298528 299690 298311 309453
8892 309453 309165 313542 327675 333422 333742 335007 345806 354255 350377 344925 346574 353817 360809 364150
8878 364150 372924 369406 367766 372905 370164 373787 373454 375999 388311 394763 397966 391693 388629 400192
8864 400192 400279 395163 405995 413653 415571 409305 410520 415875 415657 422262 421434 426847 432431 434685 436451
8849 436451 447609 461806 476844 486685 492309 492937 498030 501714 506088 498429 498248 516864 527939 525844
8835 525844 527447 541246 551798 563710 571065 566438 569180 577314 583976 598315 601443 589283 588000
8822E88000J3121N730J0080K340J572J3022J9065J761q698K597Q100L4721K0975
8809G12386j2663l719J3609J8304K078P354J9346K3527J5847J1654M202M713P278
8796H23916N060R53J5598J8510J2388K4670K1322J9276R016K871K0671J8088J4695
8783A007034Q383J3277J6046J4614P434J2106K1829K0287J7651m937O833K0846
8771A161403L2209L4212R860P341L1301L2725K3665L1005K3161J1951K7489K4966
8759A451288K1011J3274R088J9689L5667M0690L2370M2250K1998K0116K9409L3167
8747A770017K3408L0450M8260L6384M1684M1975L8742M4290M6363M1552L5256
8736B198381L8480L9053L8330N7138M1338N5093O0223M7457L7982M4036P7457
$$ plain form
8822 588000 601121 606851 616931 619271 620843 633865 652930 654691 645993 648590 656690 691411 712386
8809 712386 699723 696004 709613 727917 729995 737349 756695 780222 796069 807723 811925 816638 823916
8796 823916 828976 829929 845527 864037 876425 901095 922417 941693 950709 953580 974251 992339 1007034
8783 1007034 1015417 1028694 1044740 1059354 1066788 1078894 1100723 1121010 1138661 1133724 1140557 1161403
8771 1161403 1193612 1227824 1237684 1245025 1276326 1309051 1332716 1363721 1386882 1398833 1426322 1451288
8759 1451288 1472299 1485573 1494661 1514350 1550017 1590707 1623077 1665327 1687325 1707441 1736850 1770017
8747 1770017 1793425 1823875 1872135 1908519 1950203 1992178 2030920 2075210 2121573 2163125 2198381
8736 2198381 2236861 2275914 2314244 2371382 2412720 2467813 2528036 2575493 2613475 2657511 2734968
8725B734968O7931P0886P0649N8653O4600O0043O6657Q2064O6377P3174P8268
8714C494270R2283R4332Q1379Q2124R5556R7470J13528Q8068P8355R3923R8539
8703D509827J05783J01425J13735J30555J23067J04519J05835J19690J33611J33809
8693E681856J13181J07972J38450J36062J27658J26018J30507J34642J44915J20441
8683F961702J26602J40462J24519J25372J05747J12124J08671Q9470J11922J12126
8673H118717R8127Q5194O4179O8185N7357N3262M2409L3667L7580J2794J002M240
8661H676713M487j4555l5696n0432m3392n8922p2776p7285p5748q5206r2262r1544
8649G983382q9391j07047j18934j17981j28675j23273j18818j23725j24757j29258
$$ plain form
8725 2734968 2802899 2873785 2944434 3003087 3067687 3127730 3194387 3276451 3342828 3416002 3494270
8714 3494270 3586553 3680885 3762264 3844388 3939944 4037414 4150942 4239010 4317365 4411288 4509827
8703 4509827 4615610 4717035 4830770 4961325 5084392 5188911 5294746 5414436 5548047 5681856
8693 5681856 5795037 5903009 6041459 6177521 6305179 6431197 6561704 6696346 6841261 6961702
8683 6961702 7088304 7228766 7353285 7478657 7584404 7696528 7805199 7894669 8006591 8118717
8673 8118717 8216844 8302038 8366217 8434402 8491759 8545021 8587430 8621097 8658677 8671471 8672473 8676713
8661 8676713 8681200 8666645 8630949 8580517 8537125 8478203 8405427 8328142 8252394 8167188 8074926 7983382
8649 7983382 7893991 7786944 7668010 7550029 7421354 7298081 7179263 7055538 6930781 6801523
8639F801523j36571j19172j09511r6592j19734j15076q3961m3893j395N4773J62801
8628F193192K63448K39517j65224n66357n24557l60451k53134j92721j60406j36093
8618D337214j06912j13293r6593j04255r6959r1441q5369p3078o2267m9775l7088
8607C420184j2416L267K5422M9440N8203j5201j54717k15958j76609j27229r3937
8596B760449o4034o0798o1515m9122m9832j6258Q571L1972O4950R7322J70566
8585B832271K85476M59712O45635P68000R2542q93547r42706n89374l36464k14195
8575B107350j31161j03984p7736n4866m7336l2976m2094j4687q472j2501m126
8564A577411J0395N3887J10628J54637K28618K76564J63195j62167l55053k96510
$$ plain form
8639 6801523 6664952 6545780 6436269 6339677 6219943 6104867 6020906 5977013 5975618 6030391 6193192
8628 6193192 6456640 6696157 6530933 5964576 5440019 5079568 4826434 4633713 4473307 4337214
8618 4337214 4230302 4117009 4020416 3916161 3819202 3727761 3642392 3569314 3507047 3457272 3420184
8607 3420184 3407768 3411035 3436457 3485897 3544100 3528899 3374182 3158224 2981615 2854386 2760449
8596 2760449 2696415 2635617 2574102 2524980 2475148 2458890 2467461 2499433 2564383 2661705 2832271
8585 2832271 3117747 3577459 4223094 4991094 5083636 4190089 3247383 2658009 2321545 2107350
8575 2107350 1976189 1872205 1794469 1739603 1692267 1659291 1617197 1602510 1594038 1581537 1577411
8564 1577411 1587806 1641693 1752321 1906958 2135576 2412140 2575335 2413168 2058115 1761605
8554A761605k02228j12864p8759o3828n6214l2148j158O92K2826L4687M5841O3616
8542A382068N1397K4976P8507J72374K75098L57234J62935l24875m93023l20013
8532A366678j73959j18093q7548l3688m3849k6599j0581j1481M091K0801L4735
8521I20507N3670N4402P6060O8526K8665J3347N3976N8999k7197j47818j58901
8510I94236j18698q2774n7191m3404k8647j8116j2901k0650p314J0277K5188R620
8498F49626J495j7666l6147l7932j6277q592k3190q690j1730n14J0280n850j5056
8485D79757M102Q847J9163J4915k769J9873K8206M0555N3876Q0875J28857J15641
8473I91898j9268j71467j55052r7519n1348l0068j1196j7293j1090j5232j1102
$$ plain form
8554 1761605 1559377 1446513 1367754 1303926 1247712 1215564 1214406 1215098 1237924 1272611 1318452 1382068
8542 1382068 1433465 1458441 1536948 1709322 1984420 2341654 2504589 2179714 1686691 1366678
8532 1366678 1192719 1074626 987078 953390 909541 882942 872361 860880 864971 885772 920507
8521 920507 974177 1028579 1104639 1173165 1201830 1215177 1269153 1328152 1300955 1153137 994236
8510 994236 875538 792764 735573 692169 663522 645406 632505 611855 604541 614818 640006 649626
8498 649626 651121 633455 597308 559376 543099 534507 511317 502627 490897 490383 500663 494813 479757
8485 479757 483859 492706 511869 526784 524015 543888 572094 612649 666525 747400 876257 991898
8473 991898 972630 801163 646111 548592 497244 467176 455980 438687 427597 412365 401263
8462D01263j3276n323k012K320r178j1088j2928j2050N753J742p791j1826j5243
8449C10363r114N431L663Q795M662L590k66k2438j5599J3752R360r287J902Q308
8435C13122J8030J3080J0178M5197M8861N9972L6232m3735q3074p3900l5395j7009
8423B91559o825r063j3056n711q424k226J699l903k0346m219N835N752O497M416
8409B41985m790N021O561l231r582j6899k0115j3613L933O155M766J887j0393
8396A91685j2263l956K942j236q6P869J0016q741k986l801r028R27L432J948N375
8381A82097k537l362n894M168j460j3927o152P141M741l271n466q066j5778j0414
8367A21820J3254J1679Q062K688n220j3409L679L026K225N435q785N51M515q146
$$ plain form
8462 401263 387987 382664 380652 382972 373794 362706 349778 337728 343481 345223 337432 325606 310363
8449 310363 301249 306680 310343 319138 323800 327390 327124 304686 289087 302839 312199 302912 304814 313122
8435 313122 331152 344232 354410 399607 448468 508440 544672 500937 417863 343963 308568 291559
8423 291559 284734 275671 262615 256904 248480 246254 247953 244050 223704 219485 225320 231072 237569 241985
8409 241985 237195 242216 248777 245546 235964 219065 198950 185337 189270 195425 200191 202078 191685
8396 191685 179422 175466 178408 177172 177086 184955 194971 186230 183244 179443 170415 171342 174774 176722 182097
8381 182097 179560 176198 170304 174472 173012 159085 152933 160074 164815 161544 156078 148012 132234 121820
8367 121820 135074 146753 154815 157503 152283 138874 142553 145579 147804 153239 144454 145005 149520 141374
8353A41374k09n62o961L78J635l946Q817n299K58N028J148p093K963K680j662
8338A38549j0393O318O624j3515j5530n548o50M597J1589j0066J758O494J17P97
8324A21141k339k601Q426j280l510j3190m333k325K569o60R023N43p68l813L544
8309A10427l281J67J5288p88m82L932m198k1283r167n663Q640J343m557J4778
8295A05156P828N201j279L699N658p549j6562j657j5836o464J1425L042J465J3005
8281A07132K711p56k2540j0013L271J7191Q918p123j036k348j2821o857K536Q077
8267H6342P857j625p315k498J274o072m867n534r6J7721K1943m211q907j3001
8253H1011J112J2131K680j369j7184k857J759l928N282J1731J441k6672K313Q746
$$ plain form
8353 141374 141165 140603 133642 134020 135655 131709 140526 135227 135485 140513 141661 134568 137531 140211 138549
8338 138549 128156 134474 141098 127583 112053 106505 105855 110452 122041 111975 113733 120227 120344 121141
8324 121141 118802 116201 124627 123347 119837 106647 102314 99989 102558 101898 110921 111464 110696 106883 110427
8309 110427 107146 107313 122601 121813 121331 125263 121065 99782 90615 84952 93592 94935 90378 105156
8295 105156 112984 118185 116906 120605 126263 118714 102152 100495 84659 78195 89620 92662 94127 107132
8281 107132 109843 109087 86547 76534 79805 96996 105914 98791 97755 95407 82586 75729 78265 86342
8267 86342 94199 92574 85259 82761 84035 77963 73096 67562 67466 85187 107130 102919 94012 81011
8253 81011 82123 94254 96934 95565 78381 75524 77283 73355 78637 90368 91809 65137 67450 76196
8239G6196N675K1624k283l1131k1584q796l879Q62N867K0766J9353k478j7406
8226F2786n080j124k0922J860J8775M859K623Q661j47n148k341m748q820P168
8212E8402p022j0514K938k669N635R98J3083j078l114m838j515Q8J1984k487r143
8197E0748k920Q433J7766J3056L176j966q573j6127q179R231L729j3462q194J022
8183D7740R71p498P689J2998L31O652J4227j0705p633k0717l337k983K875J1318
8169E1928P550J411p387n259n427n80M310J738J0398m427M848J5682L49j4443
8155F0691p734N682l557j784m016m120J215q75P197q726o842k364j586r769J967
8140B5379K55J9923J0807j0568j1970o267j3275K157N200j56K96J706J1524Q345
$$ plain form
8239 76196 81871 103495 101212 70081 48497 39701 35822 36684 42551 63317 82670 80192 62786
8226 62786 57706 56582 35660 37520 56295 61154 63777 72438 72291 67143 64802 60054 51234 58402
8212 58402 51380 40866 43804 41135 46770 47768 60851 59773 56659 51821 50306 50394 62378 59891 50748
8197 50748 47828 56261 74027 87083 90259 88293 79720 63593 55414 64645 68374 54912 46718 47740
8183 47740 48711 41213 48902 61900 62231 68883 83110 72405 64772 44055 40718 37735 40610 51928
8169 51928 59478 60889 53502 48243 42816 42236 46546 48284 58682 54255 59103 74785 75134 60691
8155 60691 52957 58639 55082 53298 49282 45162 46377 45502 52699 43973 37131 34767 33181 23412 25379
8140 25379 25634 45557 56364 45796 33826 27559 14284 16441 21641 21485 21781 23487 35011 43356
8126D3356l198j0452j579k925J0576R164P7j5425m55L247K05n144R01J038k411
8111B6975j1991m725N506R763M595N333j0241l927r249Q376J5265j474p908j5478
8097A0820p339K153N001Q304J3001L336m805k869J569o09r421j1317P99j847K18
8082F994j460j322n46L643J6954P393O546Q436j3279K390m05q096p129m453J0329
8067B5995M389J81n232n541k747J194q000j0654r943L587P895K63J8969O35j651
8052A9340j159J4194o627k2109n596J7071l9k451O288J3703L287j1724K590j476
8038B5292J2718N35k493l856o793q056j438K37L260k237R74K813j769J8500Q904
8023D6591L157j1096p730R485L741j4963K512J2420J325j1440j5784n464q627
$$ plain form
8126 43356 40158 29706 28127 25202 35778 44942 45019 29594 29139 32386 32591 27447 28348 29386 26975
8111 26975 14984 10259 15765 25528 30123 35456 25215 21288 12039 20415 35680 34206 26298 10820
8097 10820 3481 5634 10635 18939 31940 35276 30471 27602 29171 28562 19141 7824 8623 6776 6994
8082 6994 5534 4212 3666 7309 24263 31656 38202 46638 33359 35749 35344 27248 20119 15666 25995
8067 25995 30384 30565 25333 19792 17045 18239 10239 -415 -10358 -6771 1124 1387 20356 20991 19340
8052 19340 18181 32375 25748 3639 -1957 15114 15075 12624 18912 32615 35902 24178 26768 25292
8038 25292 38010 38545 36052 32196 25403 17347 15909 16146 19406 17169 18143 20956 19187 37687 46591
8023 46591 49748 38652 30922 40407 44148 29185 31697 44117 45442 34002 18218 12754 4127
8010D127P358J228K2560J2646K486m776j5602o955R856m035o223l490l375j002
7996A4803j1104L371l278J0417J159n366N931L917o901K252O355o333L392K6261
7982D4876M966j3906j0925N095L023O705l398o527p495K052M231J2574k9Q09j805
7967D0246j011m355M646j457Q16K530n079m413m089J000N711K483q539O767J0197
7952D5453j4579J000J896J190j6262j4806M7K667J406k788m272l215K154M101
7938C992n159J5180J1259n008k228m221L74j1733o326J2289Q833j802K054p152
7924A0352K972p476N662R515p382N19l44K048J5150M5q803l224k330j917q889
7909E898r371Q807J1315J3511N589j0234r904j7025n874K3769J4591j061J504
$$ plain form
8010 4127 11485 12713 35273 47919 50405 45629 30027 23072 32928 28893 22670 19180 15805 14803
7996 14803 3699 7070 3792 14209 15368 10002 15933 19850 12949 15201 21556 15223 18615 44876
7982 44876 49842 35936 25011 30106 33129 39834 36436 29909 22414 24466 28697 41271 41242 42051 40246
7967 40246 39235 34880 39526 38069 38885 41415 36336 31923 27834 28834 34545 37028 28489 35256 45453
7952 45453 30874 31874 33770 34960 18698 3892 3939 6606 8012 5224 952 -2263 -109 3992
7938 3992 -1167 14013 25272 20264 18036 13815 14189 2456 -3870 8419 17252 15450 17504 10352
7924 10352 13324 5848 11510 21025 13643 14162 13818 15866 31016 31061 22258 19034 16704 14787 5898
7909 5898 -3473 5334 16649 30160 35749 25515 15611 -1414 -7288 16481 31072 30011 31515
7896C1515j465j242j0079r318O324l288r268J1433r75o004L190M872P783M850
7882B8328p517o883r458n166M5j356R834J7535P753K146L07P624j707k861j4426
7867B4198R33O582p348p241k161o093j3147l063K167J0404J6397j467j3545P813
7853A4429J6487m526p868q818k13L443J5880O974j998k924o616k0918r006L751
7839a923M186R44k143m879p813P388Q200n975j642k189k012J629O07j3155J4120
7824d657K4500r49m849l730r412r322N568Q468O150m229o261o079p954m75J8340
7809E109J5283j5483k1034l063M21j083R417k951P067J871p112O110K0401Q898
7795B3851M886j1403l476L288L879k229k6068r857J0998L389J3864J0736M414
$$ plain form
7896 31515 30050 28808 18729 9411 15735 12447 3179 14612 13637 7633 10823 15695 23478 28328
7882 28328 20811 13928 4470 -696 -651 -2007 7827 25362 33115 35261 35568 43192 41485 38624 24198
7867 24198 25131 31713 24365 17124 14963 8870 -4277 -7340 -5173 5231 21628 20161 6616 14429
7853 14429 30916 26390 18522 9704 9491 12934 28814 35788 33790 30866 24250 3332 -5674 -1923
7839 -1923 2263 3207 1064 -3815 -11628 -4240 3960 -2015 -3657 -5846 -7858 -6229 -5622 -18777 -4657
7824 -4657 19843 18894 14045 10315 903 -8419 -2851 5617 11767 7538 1277 -4802 -12756 -13231 5109
7809 5109 20392 4909 -16125 -19188 -18767 -19850 -10433 -13384 -6317 -4446 -11558 -5448 14953 23851
7795 23851 28737 17334 13858 17146 21025 18796 -7272 -17129 -6131 -2742 11122 21858 26272
7782B6272P472P377n57l279j5126r025K508J5203j185j1594j0712M470J1059q418
7768A4465j9254O649J7792N480n983j5549j5075j7014J0732J3262j448j269P372
7755A60R853j92l08J0702m814r447o670Q021Q875J671o050L275J489p938q133
7740D94n501l323M082J792P854J0940l328n78l86R93N837o604q177j5201O222
7725d884O50J9735J286j4404j2225L129m076N846O105P606O763m800P41J725m583
7710H614M400r318O375O755L282o344o596j2763k885o757l608K3831j0396q312
7696a3722p805o292K590P228J635M522J443R076K211M630q182r674n288J0844
7682f784J8740L075m971j617N593J0818l333n038p665K263k277j048J942L63n592
$$ plain form
7782 26272 33744 41121 40564 37285 22159 13134 15642 30845 29660 18066 7354 11824 22883 14465
7768 14465 -4789 1860 19652 25132 19149 3600 -11475 -28489 -17757 -4495 -5943 -7212 160
7755 160 10013 9821 9513 20215 15401 5954 -716 7305 16180 17851 11801 15076 16565 8627 494
7740 494 -5007 -8330 -4248 -2456 5398 16338 13010 12432 12046 13039 18876 12272 4095 -11106 -4884
7725 -4884 -4234 15501 16787 2383 -9842 -6713 -10789 -4943 1162 8768 15531 10731 11472 13197 8614
7710 8614 13014 3696 10071 16826 20108 13764 7168 -5595 -8480 -15237 -18845 4986 -5410 -13722
7696 -13722 -21527 -27819 -25229 -18001 -16366 -11844 -10401 -1325 886 5516 -2666 -12340 -17628 -6784
7682 -6784 11956 15031 10060 8443 14036 24854 21521 16483 8818 11081 8804 7756 9698 10061 4469
7667D469m110j1859L313q534n27J4418O215n040m453K879l769N20k680J1135J6095
7652A8072p337J8665K2310j9613j0250l137O767o664j4697o066j0113o866M320
7639a4609J3042R316l40j3143L243O54k292j0453P161K933M975R476J0992M203
7625B5158j0071K595p874j0777j7410n695L088J7643M39j1195R74K686j459O580
7611e318P670N643m078j1798o409m230O59L734K475q630R869L235j299o016P30
7596a3763J5785j6297j3048o844L432J553K24J1043J1957pk923K032L709Q930
7582E783O32L325M845p528r144R229j711m791K760J0024M103l121J6862j0886
7568B0382k0376J614K807j0967j383m781n445n70J7095K945K810J488P387L699
$$ plain form
7667 4469 359 -11500 -8187 -16721 -17248 -2830 3385 -1655 -6108 -3229 -6998 -6478 -9158 1977 18072
7652 18072 10735 29400 51710 32097 21847 18710 25477 18813 4116 -1950 -12063 -18929 -14609
7639 -14609 -1567 7749 7409 -5734 -2491 -1837 -4129 -14582 -7421 -4488 487 9963 20955 25158
7625 25158 15087 17682 9808 -969 -18379 -24074 -20986 -3343 -2904 -14099 -13125 -10439 -11898 -5318
7611 -5318 2352 7995 3917 -7881 -14290 -18520 -17861 -14127 -11652 -20282 -10413 -7178 -8477 -14493 -13763
7596 -13763 2022 -14275 -27323 -34167 -30735 -29182 -28958 -17915 -5958 -5965 -8888 -6856 -3147 5783
7582 5783 6415 9740 14585 7057 -2087 7142 5431 640 3400 13424 17527 14406 31268 20382
7568 20382 6 1620 4427 -6540 -7923 -12704 -18149 -18719 -1624 1321 4131 5619 13006 16705
7554A6705L125j6270P100J5733N589Q100r800j6505J30j3386n160J2326l915K1583
7540B5355J349j2906p333r297j295J0795J1957j0920j4995j893l20k952M491M934
7526c030N017K374L979n470p097N826J0328m433p401Q064p96Q571r219n669j66
7511H78r077O94O276N575N646k330l819L218n648j656K649n481j711k190j7388
7496b4364p573L636L594L734J2188M730m551Q152J027L248J0639J047k0972p996
7482a3461R837K5659N838j9027k4121L807J003R719l283p422m47J1351L025o680
7468d202O588q55j2716j2699o257J0123K3194J2041j1028l685O762K2272J4062
7455D3600J248m75j3427j0599j8398p556K76j0503L351L67q112M380K120j0491
$$ plain form
7554 16705 19830 3560 10660 26393 31982 40082 30282 13777 13907 521 -4639 7687 3772 25355
7540 25355 26704 13798 6465 -2832 -4127 6668 18625 7705 -7290 -9183 -9503 -12455 -7964 -3030
7526 -3030 1987 4361 8340 2870 -4227 1599 11927 7494 93 8157 7361 15932 6713 1044 878
7511 878 -8199 -7505 -1229 4346 9992 7662 3843 7061 1413 -243 2406 -3075 -4786 -6976 -24364
7496 -24364 -31937 -28301 -24707 -20973 -8785 -4055 -8606 -454 573 3821 14460 15507 -5465 -13461
7482 -13461 -3624 22035 27873 8846 -15275 -11468 -10465 -746 -4029 -11451 -11898 -547 2478 -4202
7468 -4202 2386 1531 -11185 -23884 -30141 -20018 3176 15217 4189 504 7266 29538 43600
7455 43600 44848 44373 30946 20347 1949 -5607 -5331 -15834 -12483 -12116 -20228 -15848 -13728 -24219
7441b4219j0356m39K173Q430J7158N714N521j678K107o192j1041j785P468J3010
7427E871N651l268q928n293O508P716N144m532o083q25j1702K194n59J1829R648
7412A3371k260q560j1791Q255m922o579m406N48J0590J2428j644O226o83O366
7398A6939m838j2043K51J7381J0551j2274j7573k698q268p370J0327P508j620
7385c727J889M767P154P277P073N141j5200j6799p863M559J9190L891q614j9634
7371a0896r55k109K150J728M690p635j0663P300J664o471m862R271N511l308q900
7356b3485l358K682Q236P358O011P76j4059o634J3998J540L210J1410Q006j337
7342A4354j547j912j2304n43o109j1336J026R513m834k598P701L884p491j421
$$ plain form
7441 -24219 -34575 -35014 -32841 -24411 -7253 -1539 3982 2304 4411 -1781 -12822 -14607 -7139 5871
7427 5871 11522 8254 -674 -5967 541 8257 13401 8869 2786 1961 -9741 -7547 -8106 3723 13371
7412 13371 11111 2551 -9240 -985 -5907 -12486 -16892 -16344 -5754 6674 5030 11256 10573 16939
7398 16939 12101 58 309 17690 28241 15967 -1606 -4304 -12572 -19942 -9615 -2107 -3727
7385 -3727 -1838 2929 10083 17360 24433 29574 14374 -2425 -10288 -5729 13461 17352 8738 -10896
7371 -10896 -11851 -13960 -11810 -10082 -5392 -13027 -23690 -16390 -14726 -21197 -26059 -16788 -11277 -14585 -23485
7356 -23485 -26843 -24161 -15925 -8567 -2556 -1780 -15839 -22473 -8475 -6935 -3725 7685 15691 14354
7342 14354 12807 10895 -1409 -1952 -8061 -19397 -18371 -8858 -13692 -16290 -8589 -4705 -12196 -13617
7328a3617N485P664Q302O67K296n978P170r986k0139L158J8738P67M211r792k0617
7313b1671O776J1665m574q016N329L642J107k607K83k084J1210k832o382o234
7299a4388q015N493J0365J5772k561j280o487q735R216O418Rj3611p339J1155
7285c988J0387R806J2364n858j3443m985q078J0335m138j0146j0742J236j693
7272a8943J3974K74Q270l831M849n315j9035j0946Q298J0659N910P197R280r516
7258A125j4984kL843k793p492N982K322m177r972r808P254J3271L972K155M519
7243d785M541N563O254J1690K134q453j3306p891p974J12L900N016K085k371Q92
7228b593o19j7434j0796L665J5446J8088O940N818J3777n598o011m602N292j2006
$$ plain form
7328 -13617 -8132 -468 7834 8501 10797 4819 11989 2003 -18136 -14978 3760 4527 8738 -1054 -21671
7313 -21671 -14895 -3230 -7804 -15820 -10491 -6849 -5742 -8349 -8066 -10150 1060 -1772 -8154 -14388
7299 -14388 -22403 -16910 -6545 9227 6666 5386 -1101 -9836 -620 5798 5807 -7804 -15143 -3988
7285 -3988 6399 16205 28569 22711 9268 4283 -3795 6540 2402 -7744 -18486 -17250 -18943
7272 -18943 -4969 -4695 3575 -256 4593 -722 -19757 -30703 -22405 -11746 -5836 1361 10641 1125
7258 1125 -13859 -13861 -10018 -12811 -20303 -14321 -11999 -16176 -26148 -35956 -28702 -15431 -11459 -9304 -4785
7243 -4785 -244 5319 11573 23263 25397 16944 3638 -4253 -12227 -12115 -8215 -3199 -1114 -3485 -2593
7228 -2593 -3212 -20646 -31442 -27777 -12331 5757 12697 18515 32292 26694 20683 16081 21373 9367
7214I367p829N797q75j766Q2K743P23j3260j3399M867O964l460k399P196Kl596
7198h843P667J8856m80n763n887o649J0345N480j607K966k3411o64J089l654J4707
7183D152J0893J482R28j1140r400j2723M16J6033M063j4735n660p450r17J0469
7169a3589J4755R792p891o17k490J3014m599p486j800M683L742J375j3065j5297
7155a9473k854J0214M343j7181N223J5157J2834L992K183l813O350J210j3430
7142D755k8577O98R797n198r762Q222J0261k630j008J1167P693m280j1206J4106
7128D038J3541J229r741j2545n846n490l515M762L454M973K976P850Q912L466
7114A8064n69R253J747j4833j2896p999l64J1957K905j067o816J062J121j6279
$$ plain form
7214 9367 1538 7335 6460 4694 4776 7519 8242 -5018 -18417 -13550 -6586 -10046 -12445 -5249 -5247 -8843
7198 -8843 -1176 17680 17200 11437 5550 -1099 9246 14726 13119 16085 -7326 -7990 -6901 -10555 4152
7183 4152 15045 16527 17455 6315 -3085 -15808 -15392 641 4704 -10031 -15691 -23141 -24058 -13589
7169 -13589 1166 10958 3067 2450 -40 12974 8375 889 -911 3772 7514 8889 -4176 -19473
7155 -19473 -22327 -12113 -7770 -24951 -19728 -4571 8263 12255 14438 10625 16975 18185 4755
7142 4755 -23822 -23124 -13327 -18525 -28287 -20065 -9804 -12434 -13442 -2275 5418 1138 -10068 4038
7128 4038 17579 18808 9067 -3478 -9324 -14814 -18329 -13567 -10113 -5140 -2164 5686 14598 18064
7114 18064 17495 26748 28495 13662 766 -7233 -7597 4360 7265 6198 -618 444 1565 -14714
7100a4714L634M637R956K139R141J0454q342l657N460l553o251r313j3957k4K402
7085a1988R296L710K980r800K372o686l193P400j617p677J1036j2947R5J4145
7071b874J7926j0260p891R632Q082m865j7421l675Q400L380r99j5043j960J5182
7057b386O210P96N228k407j0258j578l211k860q47n700j05J1909R894l256P130
7042H559N579j0783O814Q8L436O296J1472n739j2539r385j329R457l204p811K213
7027C124k584l415j7266o362J2118L066L766O002J654j1767l318o723p803J369
7013b8139L695j51L608M372L623p371O811J5612J288p555O174j682j139P446J064
6998G656K64j1851j0845l945R022Q624M774j5976l409Q764K212j527J0266J7654
$$ plain form
7100 -14714 -11080 -6443 3513 5652 14793 25247 16905 13248 18708 15155 8904 -409 -14366 -14390 -11988
7085 -11988 -2692 1018 3998 -5802 -3430 -10116 -13309 -5909 -7526 -15203 -4167 -17114 -17019 -2874
7071 -2874 15052 4792 -3099 6533 14615 9750 -7671 -11346 -2946 434 -565 -15608 -17568 -2386
7057 -2386 3824 4620 9848 7441 -2817 -4395 -7606 -10466 -11313 -17013 -17118 -5209 4685 1429 8559
7042 8559 14138 3355 10169 10257 13693 19989 31461 25722 13183 3798 2469 11926 8722 911 3124
7027 3124 540 -2875 -20141 -26503 -14385 -11319 -7553 -1551 103 -11664 -14982 -21705 -29508 -28139
7013 -28139 -24444 -24595 -20987 -16615 -12992 -20363 -13552 2060 3348 -4207 1967 285 -854 6592 7656
6998 7656 7920 -3931 -14776 -18721 -9699 -1075 3699 -12277 -15686 -6922 -4710 -6237 4029 21683
6984B1683J214L219r038q182l405j3489M356L015N468J2852O782L409j0563o341
6970A0980l78L45N751j1991p115O382P833j5048o32j33J1367J692p165k928n201
6955f241j0835M464N909j312N062o61M6q267O382J537k113N918O945N95K335J7969
6939B7733r759j7568K293J0779L323j2150j7417R168J3716L368M512j740j77K2075
6925C8156J6738K0206R725k896J3683K776l855M501m372j5889L500J073j2502
6912G0844J013r152l5557k0657M374J5037L564p482m446K264j1185j575J472Q679
6898A7193n24k003J545N950m935j1139L66l123K513l382k2448j0338J3950J5078
6884a297J4598j1257L975J855l213m252J0596J4276P047p006o457o087p874J0482
$$ plain form
6984 21683 22897 26116 17078 8896 5491 -7998 -3642 -627 4841 17693 24475 27884 17321 10980
6970 10980 10602 10947 16698 4707 -2408 3974 11807 -3241 -3873 -4006 7361 9053 1888 -1040 -6241
6955 -6241 -17076 -12612 -6703 -8015 -2953 -3614 -3568 -11835 -5453 -3916 -6029 -111 6834 7429 9764 27733
6939 27733 17974 406 2699 13478 16801 4651 -12766 -3598 10118 13486 17998 16258 16081 38156
6925 38156 54894 75100 84825 81929 95612 98388 94533 99034 94662 78773 82273 83346 70844
6912 70844 71857 62705 27148 6491 10865 25902 29466 21984 17538 19802 8617 7042 8514 17193
6898 17193 16669 14666 16211 22161 17226 6087 6453 3330 5843 2461 -19987 -30325 -16375 -1297
6884 -1297 13301 2044 6019 7874 4661 409 11005 25281 32328 25322 18865 12778 4904 15386
6870A5386J1217M67l98r898k64L26O017N494l408m813j0876k966m225q495M537
6855a899K382p482p424P330P055J302j3085J8103J3558QL749J3139k593k709p289
6840B4145n608K243J8511J514m442P546M288k050J9348k684l329k349L05k549
6826E4889J912n734J1654K8192J1812R50K301J6788N430r634K54J8402J3093R214
6812A59523J234J2339J4410l044k579j8043j5411l4566l2081r15J9703m725q717
6799H7128j0099j3944k768l44p718j5615q394p26q623j182l598J875J0911J1045
6785C7948n220q404o87Q724R48K992j2900m330J7149K852J0461l640Q994J909
6771E6796J176j1000L956J1650R469l480j40j4358J99K0134r870k8264o587L959
$$ plain form
6870 15386 26603 27070 26672 16774 16510 16836 22853 28347 24939 20126 9250 6284 2059 -6436 -1899
6855 -1899 483 -6999 -14423 -7093 -38 1264 -11821 6282 19840 19848 23597 36736 34143 31434 24145
6840 24145 18537 20780 39291 40805 36363 43909 48197 46147 65495 62811 59482 57133 57438 54889
6826 54889 56801 51067 62721 90913 102725 103675 105976 122764 128194 118560 118814 137216 150309 159523
6812 159523 160757 173096 187506 184462 181883 163840 148429 113863 81782 80867 100570 95845 87128
6799 87128 77029 63085 60317 59973 52255 36640 28246 27520 18897 17715 14117 15992 26903 37948
6785 37948 32728 24324 23637 32361 33309 36301 23401 19071 36220 39072 49533 45893 54887 56796
6771 56796 57972 46972 50928 62578 72047 68567 68427 54069 54268 74402 64532 36268 29681 33640
6757C3640m328k1194L08L324n67P43J796J508n717j2865j2233L561J0899m2r707
6742a0874N272j011r614J665m26p766j141P187J223n91J2728J2719R943R42n520
6727A4736m08p28n808k292m574m306m64J043N011r368n621J1083K853L52M743
6712F252R699L135j3894o747m063p153j0156L040N716J0391J736P661Q95l673
6698B839j6917m681J5169O193j7437J270J5517K100J173r476J637N604p2l272
6684c53j179L166n456m825n772K778P399j3046P27O929k695M013J1317L724j8338
6669a1611p076K0614J0100o256m879n205p123k980j862M186K4577K2090j215q157
6655B5203k1404j434k56J3814K834j7898q827J788Q708j388K055O355J5338r063
$$ plain form
6757 33640 29312 8118 8426 11750 11183 11926 13722 15230 9513 -3352 -15585 -12024 -1125 -1167 -10874
6742 -10874 -5602 -6613 -16227 -14562 -14988 -22754 -23895 -16708 -15485 -16076 -3348 9371 19314 20256 14736
6727 14736 14328 13600 7792 5500 926 -3380 -3844 -2801 2210 -7158 -12779 -1696 1157 1509 6252
6712 6252 15951 19086 5192 -1555 -5618 -12771 -22927 -19887 -14171 -3780 -2044 5617 6512 2839
6698 2839 -14078 -18759 -3590 2603 -14834 -13564 1953 4053 5226 -4250 -2613 2991 2919 -353
6684 -353 -1532 1634 -3822 -8647 -14419 -11641 -4242 -17288 -16561 -9632 -12327 -8314 3003 6727 -11611
6669 -11611 -18687 1927 12027 5771 892 -4313 -11436 -14416 -16278 -12092 12485 34575 33360 25203
6655 25203 3799 2365 2109 15923 18757 859 -7968 -6180 2528 1140 3195 9550 24888 15825
6641A5825j6783j2653q88O063M948K363k964j300m13j038k582k300K354O649k814
6626e533O102j0812M5m844o185J782J4069q76m765j1250k571R241J819L28J758
6611a1692N333n909j1244l009k498N815R007M182L946n64j014L364M548m706j3184
6596a7625J0406M733j3641j1483J5649k86K628J0129j4930J8531J6457j849n215
6583A3504p974m341J0160K076j58J4486q844j8525j3296J1991J2820k564J488
6570A0823m117q986n893r615o770M825j0720L54J4355M9o126P917J086K771J4209
6555D162J230o564n680p712Q995r87o702p969R069Q231N958O382Q328R285m606
6540B1420K086p787j4254j780j0878j27J2528k629j5926j4496N678J5434O785
$$ plain form
6641 15825 -958 -13611 -14499 -8436 -3488 -1125 -4089 -5389 -5802 -6840 -9422 -11722 -9368 -2719 -5533
6626 -5533 569 -10243 -10198 -15042 -21227 -19445 -5376 -6252 -11017 -22267 -24838 -15597 -13778 -13450 -11692
6611 -11692 -6359 -12268 -23512 -26521 -29019 -23204 -14197 -10015 -6069 -6633 -7647 -4283 265 -4441 -17625
6596 -17625 -7219 -2486 -16127 -27610 -11961 -12247 -9619 510 -14420 4111 20568 18719 13504
6583 13504 5530 1189 11349 13425 13267 27753 18909 384 -12912 -921 11899 9335 10823
6570 10823 6706 -2280 -8173 -17788 -24558 -19733 -30453 -30099 -15744 -15695 -21821 -13904 -12818 -10047 4162
6555 4162 5392 -1172 -6852 -14564 -5569 -6556 -13258 -21227 -12158 -3927 2031 8413 16741 26026 21420
6540 21420 23506 15719 1465 -315 -11193 -11320 1208 -1421 -17347 -31843 -26165 -10731 -3946
6527c946M3o278n440J242J2814R528J497M601J6129L233j8367j6595L765R193
6513A1419n915Q262k278r336j7056j5726l851J1254O11L648j391R553K0847k047
6499G994K213j021k235L216k536m834r384j1283n006l6M418M668L283R502J1596
6484A0555p786j6413j2222J3481J7459J3997n061j3378L87R153R810j11j1667
6471H204j8776r046J6306J9309j4831j0545J578K034O208J401L059P524j912j5196
6457d683j743J1809o232r522m109k98J1152R585L664k354J658J6901O460q562
6443B3726q166p673p010J208m847O045r69k249P240r214j0087m618Q283m444l328
6428a6103J5113L671J169M267j4079k309m688J0732J1672p673j1434o945J2958
$$ plain form
6527 -3946 -3903 -10181 -15621 -14379 -1565 7963 9460 14061 30190 33423 15056 -1539 2226 11419
6513 11419 5504 13766 11488 2152 -14904 -30630 -34481 -23227 -22616 -18968 -20359 -10806 10041 7994
6499 7994 10207 9186 6951 10167 7631 2797 -6587 -17870 -22876 -22912 -18494 -13826 -10543 -1041 10555
6484 10555 2769 -13644 -25866 -12385 5074 19071 14010 632 1019 10172 19982 19871 8204
6471 8204 -10572 -19618 -3312 15997 1166 -9379 -7801 -5767 441 1842 4901 12425 10513 -4683
6457 -4683 -6426 5383 -849 -10371 -14480 -14778 -3626 5959 9623 7269 8927 25828 32288 23726
6443 23726 15560 7887 877 2085 -2762 3283 2314 65 7305 -1909 -11996 -16614 -8331 -12775 -16103
6428 -16103 -990 2681 3850 8117 -5962 -8271 -12959 -2227 9445 1772 -9662 -16607 -3649
6415c649Q31p077o512K875L142q186n871J2367K2848P765M164r181r118j1589
6401g191q50M113r551M46P552p814m198J0691J2868N093o295p854O088M781j93
6386G686o108l027L138J0475J0928j7658j3188k2539n194R619L905P728Q6M826
6372i323N113n312j763J0721n251O141k24R286m120m829k243m3J2670l345k1628
6357a4150j0312L603Q928J3688j768r621o449r05J8001N251O215j2454j0742j0411
6343b1126R391N322j3922L205J5936R356O603j460J1919o415p976L855P422k034
6329B0076k3264j6838l742J3749K2525P537m070j0798k0339j0167O686P610K458
6316h577M161J3760P992j0483r483o368p355L809p766J0045L798M915p559n817
$$ plain form
6415 -3649 -2818 -9895 -16407 -13532 -10390 -18576 -24447 -12080 10768 18533 22697 13516 4398 -7191
6401 -7191 -8041 -3928 -13479 -13033 -5481 -13295 -17493 -6802 6066 11159 4864 -2990 3098 7879 7686
6386 7686 1578 -1449 1689 12164 23092 5434 -7754 -30293 -35487 -25868 -21963 -14235 -14149 -9323
6372 -9323 -4210 -9522 -11285 -564 -5815 326 102 9388 5268 439 -1804 -1847 10823 7478 -14150
6357 -14150 -24462 -20859 -11931 1757 -11 -9632 -16081 -16986 1015 6266 12481 27 -10715 -21126
6343 -21126 -11735 -6413 -20335 -17130 -1194 8162 14765 13305 25224 18809 10833 14688 22110 20076
6329 20076 -3188 -20026 -23768 -10019 12506 20043 15973 5175 -15164 -25331 -18645 -11035 -8577
6316 -8577 -4416 9344 17336 6853 -2630 -8998 -16353 -12544 -20310 -10265 -6467 -1552 -9111 -14928
6302a4928Q26J3509N537J06k852k761R112K977O21m57j7739j118R925K639J334
6287F731p751r093J0130j69p663P420R24o118J953P64k76j572Q561N516o577j2156
6271i376K836n348j3431J7158Q628J438o064J2525P910j7244j4924J8706N203
6258H017q984L452l021j3172r560M384O881j041J0857J3209R267r183n486k739
6244B881p042O347J4375m028j4996O512N69K157Q747J6888q274L914n972j9646
6230B432j996l129q896P665O558l780l992k153q10q250L330J4937J579n827j2922
6215a5254L271J1409N201k022m671J199l79q587R2N622j1966J1442O731k570j1066
6200a1548R846M048J78r39n013K156K2291o158j0672J0067J83o286l436j3322
$$ plain form
6302 -14928 -14102 -593 4944 5050 2198 -563 8549 11526 12147 11690 -6049 -7167 2758 5397 6731
6287 6731 -1020 -10113 17 -152 -7815 -395 529 -5589 -3636 -2872 -3148 -4720 3841 9357 2780 -9376
6271 -9376 -6540 -11888 -25319 -8161 467 1905 -4159 8366 16276 -968 -15892 2814 8017
6258 8017 -967 2485 -536 -13708 -23268 -18884 -12003 -13044 -2187 11022 20289 11106 5620 2881
6244 2881 -4161 2186 16561 12533 -2463 4049 4618 6775 15522 32410 24136 28050 22078 2432
6230 2432 436 -2693 -11589 -3924 2634 -1146 -5138 -7291 -8101 -16351 -13021 1916 3495 -2332 -15254
6215 -15254 -11983 -574 4627 2605 -2066 -867 -1246 -9833 -9741 -4119 -16085 -4643 2088 -482 -11548
6200 -11548 -1702 2346 2524 1585 -3428 -1272 21019 14861 4189 14256 14439 8153 4717 -8605
6186h605j1258m727J1703K890r290N02O529Q310J6404J2480m410j6339k959o533
6172e303n621k24j779j1766P027L094m312n174o969j2741K2304J8787J0195j1648
6158d130n407K801L783j1173M401J4375k704j0767P365o993M922J1429o041j703
6144A58J225q559L317j2934M484J1210n798k599k886j2049m276P973J1655J7902
6130H823k756n400k696N452l963m520J9056L939n644r833k6953j687l841p03m501
6115c5227R802J6577J0417P311j427j5843O002J1596k722k38n664p574q960k2418
6101c8368J9507J1357q124j03N127N588J468J1990m596l486P703j8736n411r389
6087b5473J0242N683Q864m183p449P075q193M84P811P599P964m896p429o994O274
$$ plain form
6186 -8605 -19863 -24590 -12887 -9997 -19287 -18785 -12256 -3946 12458 24938 20528 4189 1230 -5303
6172 -5303 -10924 -11148 -12927 -24693 -17666 -14572 -18884 -24058 -31027 -43768 -21464 -2677 7518 -4130
6158 -4130 -9537 -6736 -2953 -14126 -9725 4650 1946 -8821 -1456 -8449 -3527 7902 1861 158
6144 158 1383 -7176 -3859 -16793 -12309 -1099 -6897 -9496 -12382 -24431 -28707 -20734 -9079 8823
6130 8823 6067 667 -2029 3423 -540 -5060 13996 17935 12291 2458 -24495 -26182 -30023 -30726 -35227
6115 -35227 -25425 -8848 1569 8880 7453 -8390 -2388 9208 6486 6248 584 -6990 -15950 -38368
6101 -38368 -18861 -7504 -15628 -15731 -10604 -5016 -3548 8442 3846 360 8063 -10673 -16084 -25473
6087 -25473 -15231 -9548 -684 -4867 -12316 -5241 -13434 -12950 -5139 2460 10424 5528 -1901 -8895 -2621
6072b621N415j0761R19J054R361p458J51n635k767j2672j1162N441J1827O105
6058a2803k015P007R033j082n476J833k042Q684M504j4792j1707j763J2761q826
6044a6684l777K415J0632O353m385o072K093J6611J2808P845L940k583j3032j0442
6030E722j0780q762P645k08N839j0357j130k905O960O544K196J0693k075n718
6016C664o833n399Q539J4270r345K718m852m734M434p942O158J1762j1080j2756
6002a1396L945N395k892p510j109Q316j183r428l331M912k64R298J1873r81o686
5987a041n549Q42L486k676m292o722J0039K842j4550J7910Q225O24Q135K949n165
5972A5057R25n065o564J682K333j1027J739L331j4874j160j489n204r396N23J1171
$$ plain form
6072 -2621 2794 -7967 -7048 -5994 3367 -4091 -3940 -9575 -12342 -25014 -36176 -30735 -18908 -12803
6058 -12803 -14818 -7811 1222 140 -5336 -3503 -5545 3139 7643 -7149 -18856 -20619 -7858 -16684
6044 -16684 -20461 -18046 -7414 -1061 -5446 -11518 -9425 7186 19994 27839 31779 29196 16164 5722
6030 5722 -5058 -13820 -6175 -6383 -544 -10901 -12031 -14936 -7976 -1432 764 11457 9382 3664
6016 3664 -3169 -8568 -29 14241 4896 7614 2762 -1972 2462 -5480 678 12440 1360 -11396
6002 -11396 -7451 -2056 -4948 -12458 -13567 -5251 -6434 -15862 -19193 -14281 -14545 -5247 6626 5645 -1041
5987 -1041 -6590 -5748 -2262 -4938 -9230 -15952 -5913 -3071 -17621 289 8514 9138 17273 20222 15057
5972 15057 15982 10917 4353 6035 8368 -2659 -920 2411 -12463 -13623 -15112 -20316 -29712 -29189 -18018
5957a8018j1558j001J0868J2176O491K429m924o684M91j624J859L47J839P135
5943a74J1591N416r714j3920K114J3894O393K700n463l891j7981p991j0284p695
5929c5005O423J1329J4478J3222K218K715R129l151j9457j9729r162k490J6830
5916a2650R462K516O551k65q605l60o355P531r859o502n714p357J9324J2450K21
5901C88K161n270j9299m339J0844N370j3678N292J1539J034J477k487L411J0077
5887F520Q137q261m716R57J3062j0486j5769j0879j0370P534J3623J0582L859
5874C793m486k277m386j2746M594O469N676j185k466l068N170M491J0158N496
5860A5233j0164r753Q622P821o274j0336o879P796P630J0893o879r332p343N650
$$ plain form
5957 -18018 -29576 -30577 -19709 -7533 -1042 1387 -3537 -10221 -9730 -11354 -9495 -9148 -7309 -174
5943 -174 11417 16833 7119 -6801 -4687 9207 15600 18300 12837 8946 -9035 -17026 -27310 -35005
5929 -35005 -28582 -17253 -2775 10447 12665 15380 24509 21358 1901 -17828 -26990 -29480 -12650
5916 -12650 -3188 -672 5879 5614 -2991 -3351 -9706 -2175 -12034 -18536 -24250 -31607 -12283 167 388
5901 388 2549 -2721 -22020 -26359 -15515 -10145 -23823 -18531 -6992 -5958 -4481 -6968 -3557 6520
5887 6520 14657 6396 1680 2637 15699 5213 -10556 -21435 -31805 -24271 -10648 -66 3793
5874 3793 -693 -2970 -7356 -20102 -15508 -9039 -3363 -4548 -7014 -10082 -4912 -421 9737 15233
5860 15233 5069 -4684 3938 11759 5485 -4851 -11730 -3934 3696 14589 7710 -1622 -8965 -3315
5846c315O567o210L660Q002K963j2940Q757p148o32M217M243L510j0860j3736
5832a2922q025J4180Q412o995J99o533l533J0514L210N855M999L632k560j4283
5818c850P566R465j4346l95J829J0809J3428K079K670j5539j3565m628R579j4655
5804i553l780Q967J2487j0079j4828j2230L782P494m957n624M762M636K3320K038
5790F435Q555L626k867k148K172r532k1165m858L351K210Q368k138j9080L58j003
5775b7716J0436K055K420L015J7395J1382n346j3031m240m227j0040o341r15N063
5761b0090j1015p925R221O160r624R628P037k418J457J9499l125j7902L094O40
5747a5363Q849J621j2497o912J0053K454m331m969P863J1733R57j8241j461O988
$$ plain form
5846 -3315 3252 -2958 702 8704 11667 -1273 7484 336 -296 3921 8164 11674 814 -12922
5832 -12922 -20947 -6767 1645 -5350 -5151 -11684 -15217 -4703 -1493 4362 9361 12993 10433 -3850
5818 -3850 3716 13181 -1165 -1560 269 11078 24506 26585 29255 13716 151 -4477 5102 -9553
5804 -9553 -13333 -4366 8121 -1958 -16786 -29016 -25234 -17740 -22697 -28321 -23559 -18923 4397 6435
5790 6435 14990 18616 15749 13601 15773 6241 -14924 -19782 -16431 -14221 -5853 -7991 -27071 -26713 -27716
5775 -27716 -17280 -15225 -12805 -9790 7605 18987 13641 610 -3630 -7857 -17897 -24238 -25153 -20090
5761 -20090 -31105 -39030 -29809 -23649 -33273 -23645 -16608 -19026 -17569 1930 -1195 -19097 -16003 -15363
5747 -15363 -6514 -4893 -17390 -24302 -14249 -11795 -16126 -21095 -13232 -1499 -542 -18783 -20244 -13256
5733a3256L15l861J5336K629o545j3895m748N154Q810m689O996R544L671o018
5719e57l546O595J37L086o129n960J653K787j749O969K407O845J0139p982j2797
5704A898j439j1008j7018J0510J3396J476k578Q475L209o23P821Q997j0912k0169
5690g965o098j2309k695K076J5814P562N018J012r074p762r618J1328R004N336
5676A629j2948J907J377J5982Q157j6693r960M666P745J805n062N061p391p202
5662a0927O035J795j470j3359r07J2723L964j1829j0223O488n157o417O364N693
5648a7227L375J8094R388j5006j4219Q036N558q155n13r598J6750j507k3560P090
5634b1494J5691J5129L479O403j2289p704j3278m270k51J792n287Q110N40n164
$$ plain form
5733 -13256 -12941 -16802 -1466 1163 -5382 -19277 -24025 -18871 -10061 -14750 -7754 1790 5461 -557
5719 -557 -4103 2492 2629 5715 -414 -6374 -4721 -1934 -3683 3286 5693 12538 22677 14695 1898
5704 1898 459 -10549 -27567 -17057 -3661 -2185 -4763 3712 6921 6298 14119 23116 12204 -7965
5690 -7965 -14063 -26372 -29067 -26991 -11177 -3615 1403 2415 -6659 -14421 -24039 -12711 -3707 1629
5676 1629 -11319 -9412 -8035 7947 16104 -589 -10549 -5883 1862 3667 -1395 3666 -3725 -10927
5662 -10927 -4892 -3097 -4567 -17926 -18833 -6110 -2146 -13975 -24198 -17710 -22867 -29284 -22920 -17227
5648 -17227 -13852 4242 13630 -1376 -15595 -7559 -2001 -10156 -10669 -20267 -3517 -5024 -28584 -21494
5634 -21494 -5803 9326 12805 19208 6919 -785 -14063 -18333 -18584 -16792 -22079 -13969 -13429 -18593
5620a8593Q24L275l673j491k98k831L941k4J031J3930K567o773l388P375J8556
5605A4428O127r382j0749Q104P165J1528l947m619p113k3854O987L143n650m669
5591a2501k105O881N463P664O205j2594J427M148q401p301O490J3798J0118k35
5577A9057j2023p336o332Q13Q938P498n361L674n524j0238R773J3262J3792j0176
5563A9817q463o519N708M905j1012j0847Q59m382q02J622J1565j679j0036j523
5549a0787L732Q243Q844m591j1573J0102J2077O324p224n606j4856j219J501K041
5535b992J1527J3322j5798j1419k352r37k795k076P825o120j8080l148J7223N927
5521i893M781q100j118L248J2988P453p562j4470j570o795P451J2355J1116M378
$$ plain form
5620 -18593 -17769 -14494 -18167 -19658 -19956 -22787 -18846 -18870 -17839 -3909 -1342 -8115 -11503 -4128 14428
5605 14428 20555 11173 424 8528 15693 27221 23274 18655 11542 -12312 -5325 -2182 -7832 -12501
5591 -12501 -14606 -7725 -2262 5402 11607 -987 440 4588 -3813 -11114 -4624 9174 19292 19057
5577 19057 7034 -302 -6634 -5821 3117 10615 5254 8928 3404 -6834 2939 16201 29993 19817
5563 19817 11354 4835 10543 15448 4436 -6411 -5552 -9934 -10736 -9114 2451 772 -9264 -10787
5549 -10787 -7055 1188 10032 5441 -6132 3970 16047 22371 15147 9541 -5315 -6534 -5033 -2992
5535 -2992 8535 21857 6059 -5360 -7712 -8649 -11444 -13520 -5695 -11815 -29895 -33043 -15820 -9893
5521 -9893 -5112 -13212 -14330 -11082 1906 9359 1797 -12673 -14243 -21038 -13587 -1232 9884 14262
5507A4262p08K713L403p808j2337p773P758j697j9628R084K4503q367j5837n654
5493a8086P933L398k10n882L374R951q677o633J1521P491m151j126p225o342k461
5478a7125J0917l599j6184n858M756J4163P88j3127J604P020N634q60N203p652
5464a4320q068K0429J0888j140k194p914j652J1471j2437n104J4245n31j1226
5451g553K282K33k247j188K4160J508j0610n433N529p976R6L955k889j0985q687
5436a9805J7842J2638O09q193l050l69O262J0311j0711j8670L720Q361N426j668
5422B703Q808m936j3695p001N85N353j126P71L290Q81l258N61J3303J550P965
5407A5754j3288o936j895N409o729j222N275J8833J771O312j6337k1451K321N319
$$ plain form
5507 14262 13554 16267 19670 11862 -475 -8248 -490 -2187 -21815 -12731 11772 3405 -12432 -18086
5493 -18086 -10153 -6755 -6965 -12847 -9473 478 -8199 -14832 -3311 4180 29 -1097 -8322 -14664 -17125
5478 -17125 -6208 -9807 -25991 -31849 -27093 -12930 -12142 -25269 -23665 -16645 -11011 -11871 -6668 -14320
5464 -14320 -22388 -1959 8929 7789 5595 -2319 -3971 7500 -4937 -10041 4204 3673 -7553
5451 -7553 -5271 -5038 -7285 -8473 15687 17195 6585 1152 6681 -1295 -1199 2756 -133 -11118 -19805
5436 -19805 -1963 10675 11284 3091 41 -328 5934 16245 5534 -13136 -9416 -1055 4371 2703
5422 2703 11511 6575 -7120 -14121 -13536 -8183 -9309 -8538 -5248 -4367 -7625 -7064 6239 7789 15754
5407 15754 2466 -4470 -6365 -956 -7685 -8907 -3632 15201 16972 23284 6947 -14504 -12183 -6864
5393f864J4225P968L348k16l73Q47p574j2527q727l896k838J7988N935j65Q555
5378A5686j0272j4623r300l580K1283O914m349j1596M845M730n6K88j0815m05
5364a1250J1429J1968O654j5683p891O698j1425l042o229J540J3372J0173j0311
5351c997k055J0456m162j6004j0382N415J449j601k874L861J5329J0771p577o306
5337g677J208j976N158J8056P574p024o004n975l694m181j2114J6487R711j0596
5323a047J955Q034J5401l405r978q159p20N499o139R261J314j3781j1215j074
5309a4054R401J58p478Q814N820m510p3J4751O350k028j7525L09K764m033l789
5294e123k266j77R228R089q761k595N217Q836m08n063o867j5992m054J2536N51
$$ plain form
5393 -6864 7361 15329 18677 18461 18088 18935 11361 -1166 -9893 -13789 -16627 1361 7296 7131 15686
5378 15686 5414 -9209 -18509 -22089 -806 6108 1759 -9837 -4992 -262 -318 -30 -10845 -11250
5364 -11250 179 12147 18801 3118 -4773 1925 -9500 -12542 -18771 -17231 -3859 6314 -3997
5351 -3997 -6052 4404 242 -15762 -26144 -20729 -19280 -20881 -23755 -19894 -4565 6206 -1371 -7677
5337 -7677 -6469 -8445 -3287 14769 22343 15319 9315 3340 -354 -4535 -16649 -162 9549 -1047
5323 -1047 908 8942 24343 20938 10960 2801 2081 7580 1441 10702 12016 -1765 -12980 -14054
5309 -14054 -4653 -4495 -11973 -3159 2661 -1849 -1922 12829 19179 17151 -374 -65 2699 -1334 -5123
5294 -5123 -7389 -7566 1662 10751 1990 -605 4612 13448 13040 7977 1110 -14882 -18936 -6400 -5849
5279e849Q193J6602N346p420Q328q978j4497O479n120q834J7700M333q157j1200
5265c074M198J901q256j4232J1900K800l002R342J2216M612j4330j2327J1485
5252C233n745n218k984O808R88L913M534R848l897j8199n548K313K47r52K176
5237h483K465m488J343K435j924M18r984K080M342n991J59J6074J2135R334l411
5222A6504q309n255o411m375P274J2125J1817q476j8200j2829J0970L829P280
5209E944O112k974j1661n192m78o272j307p908k159Q448L105j2992m535J3266
5195a8603m810N100J1012k40o465P41Q900j270k789J613J8406K5498l326j1307
5181B2460n791m683p060L41p116Q648J6940j8k6399r13K06J1347Q758k860j2019
$$ plain form
5279 -5849 2344 18946 24292 16872 25200 16222 1725 8204 3084 -5750 11950 16283 8126 -3074
5265 -3074 1124 3025 -5231 -19463 -7563 -4763 -7765 1577 13793 18405 4075 -8252 3233
5252 3233 -2512 -7730 -10714 -3906 -2918 995 5529 15377 11480 -6719 -12267 -9954 -9707 -10659 -8483
5237 -8483 -6018 -10506 -9163 -6728 -8652 -8234 -18218 -16138 -11796 -17787 -17628 -1554 10581 19915 16504
5222 16504 8195 2940 -3471 -7846 -572 11553 23370 14894 -3306 -16135 -5165 -1336 5944
5209 5944 12056 9082 -2579 -7771 -8249 -14521 -15828 -23736 -25895 -17447 -14342 -27334 -31869 -18603
5195 -18603 -23413 -18313 -7301 -7541 -14006 -13265 -4365 -5635 -8424 -6811 11595 37093 33767 22460
5181 22460 16669 11986 4926 5267 -1849 6799 23739 23721 -2678 -3591 -3385 7962 16720 13860 1841
5166A841L086l51M693m163K388p869Q15K682n71r45L618J198J094m369k0764k894
5150b0511J6277P78K268o672j24m860j627J6125J3066P909N960J483k171l0818
5136b917k5491L545M922K0562R753n444l130j0487r649L000L805p338r330M711
5122b3488M003j221J0822O867r06j4218n424K55J1117L118M597K427N519K716
5108F184L829o968j6873q019J3436j47l688l848m434O842M788j6942J0393J133
5094a4314r392J8634J1831P655n376k0771q662J00J0208R603J5561m494o656j0706
5080f779n135J1511N182j378J1914L29j051P035R436j3275k0950j333N00n261
5066i255M583N982k874j032q869K156Q399k503l666L441P323n199J077K276M961
$$ plain form
5166 1841 4927 4576 9269 5106 7494 -375 440 3122 2551 1606 5224 6422 7516 3147 -17617 -20511
5150 -20511 -4234 -3456 -1188 -7860 -7984 -12844 -14471 1654 14720 22629 28589 30072 27901 -2917
5136 -2917 -28408 -24863 -19941 621 10374 4930 1800 -8687 -18336 -15336 -11531 -18869 -28199 -23488
5122 -23488 -19485 -20706 -9884 -3017 -3923 -18141 -23565 -23310 -12193 -9075 -4478 -2051 3468 6184
5108 6184 10013 3045 -13828 -21847 -8411 -8558 -12246 -16094 -20528 -13686 -8898 -25840 -15447 -14314
5094 -14314 -23706 -5072 6759 14414 9038 -11733 -20395 -20295 -10087 -484 15077 10583 3927 -6779
5080 -6779 -11914 -403 4779 3401 15315 15644 14593 21628 31064 17789 -3161 -4494 -3994 -9255
5066 -9255 -4672 1310 -1564 -2596 -11465 -9309 -910 -3413 -7079 -3638 3685 -1514 -437 1839 6800
5051F800J8939R144j7291k1557o98J162j827P271L544n256j741K931M092R729
5037A5242K051o959k032o185j2351j2217R69P708L290P800O770K090j1102m508
5023i434K171J442j686R301l478r784J2751M293l227j0465p684j343O425J3358
5009B640L274O187M390r010O57k931N813J2561j4971j7678p745m671P683j2167
4995b5968o56J5473l287k38J3784L178k977J687k210k663r064Q831Q091J1591
4981A5572M551j1137k2418m01J3477k131j0444J2658Q610j8824j4517R72N599
4968a8433J112o304j6225J5536O689M351M900N754j114J551L28r42k327j4645
4954a9769l148R585K369j872J668J8908J5303J3362L527k2167j0323l824k0178
$$ plain form
5051 6800 25739 34883 17592 -3965 -4663 -3501 -5328 1943 5487 231 -1510 1421 5513 15242
5037 15242 17293 10334 8302 2117 -10234 -22451 -21482 -13774 -10484 -2684 4086 6176 -4926 -9434
5023 -9434 -7263 -5821 -7507 1794 -1684 -11468 1283 5576 2349 -8116 -15800 -17143 -10718 2640
5009 2640 5914 12101 16491 7481 8138 5207 11020 23581 8610 -9068 -16813 -21484 -13801 -25968
4995 -25968 -26624 -11151 -14438 -14676 -892 2286 -691 996 -1214 -3877 -12941 -4110 3981 15572
4981 15572 20123 8986 -13432 -13833 -356 -2487 -12931 -273 8337 -10487 -25004 -24032 -18433
4968 -18433 -17321 -23625 -39850 -24314 -17625 -13274 -8374 -2620 -3734 -2183 -1855 -2797 -5124 -19769
4954 -19769 -22917 -13332 -10963 -12835 -11167 7741 23044 36406 39933 17766 7443 3619 -16559
4941a6559j9029K47K0576J4459M18Q073R942L05p958j6365j3975j658J3266K735
4927e523R647O28j2615l509k262R475l400j2655k434N464l92R453N669Q20j869
4912c503l811M796J8996L507n751P978j3681k678o39k4783o63J5927R29q750R10
4897a1216m245K697q145m687J2104P908L708j065j7641J2168O801l557N043J5895
4883A5768l864j1099O908j820j331j715p235j54j471L579j606l013J114n307K001
4868i245P862L883N348L683J366p469o165k068J0033R981M787m487r04j0644M998
4853A0959j0051k2661r347K7897J490j4663q587J454R386L548N039q656l036l025
4839b0253O996k63k318R799K919j1441j3137j334R00J3778J562M462O104J252
$$ plain form
4941 -16559 -35588 -35341 -14765 -306 112 8185 18127 18432 10474 -5891 -19866 -21524 -8258 -5523
4927 -5523 4124 4752 -7863 -11372 -13634 -4159 -7559 -20214 -22648 -17184 -17576 -8123 -2454 -1634 -3503
4912 -3503 -7314 -2518 16478 19985 14234 22212 8531 5853 5214 -19569 -20232 -4305 -3376 -12126 -11216
4897 -11216 -15461 -12764 -20909 -25596 -13492 -5584 -1876 -2941 -20582 -8414 -1613 -5170 -127 15768
4883 15768 11904 805 7713 5893 4562 2847 -4388 -4542 -6013 -2434 -4040 -7053 -5939 -11246 -9245
4868 -9245 -1383 2500 7848 11531 12897 5428 -737 -2805 7228 17209 21996 17509 16605 5961 10959
4853 10959 908 -21753 -31100 -3203 -1713 -16376 -24963 -23509 -14123 -10575 -5536 -14192 -17228 -20253
4839 -20253 -13257 -13520 -15838 -6039 -3120 -14561 -27698 -29032 -28132 -14354 -12792 -8330 -2226 -974
4825i74P763P197k462L145j2095n988O024J0748j3096J0731N187j0989m607k450
4811a866l248j2598J8599J6420m047j0638j3212j1049J2264L943l857k52J198
4798h343m032J2299R015P91k674q467L718L131M055n370j1996j65L902R424j8366
4783a3078r426j986k166P416K359L312M703P883m25q216L390M245L688J311q467
4768e457J8836j395j5662p666O704k475N113M764q756j317m628o835K1344L2316
4754C4886M895j1342j5922N278j447j0812o986M39M088J3658L540k4082M824q161
4740g144k062L832J538K283j272L203K559q772m012N923K443n320r329K012J3963
4725a55j910K768O065m256K709k420k981J1156L572j877r324j1880Q945m245k968
$$ plain form
4825 -974 6789 13986 11524 14669 2574 -3414 2610 13358 262 10993 16180 5191 584 -1866
4811 -1866 -5114 -17712 887 17307 13260 2622 -10590 -21639 -9375 -5432 -9289 -9541 -8343
4798 -8343 -12375 -76 8939 9730 7056 -1411 2307 5438 9493 4123 -7873 -8038 -4136 5288 -13078
4783 -13078 -22504 -24490 -26656 -19240 -16881 -13569 -8866 -983 -1408 -9624 -6234 -1989 1699 3010 -5457
4768 -5457 13379 11984 -3678 -11344 -4640 -7115 -2002 2762 -5994 -7311 -11939 -18774 2570 34886
4754 34886 39781 28439 12517 17795 16348 5536 -1450 -1011 3077 16735 20275 -3807 1017 -7144
4740 -7144 -9206 -5374 -3836 -1553 -2825 378 2937 -5835 -9847 -3924 -1481 -6801 -16130 -14118 -155
4725 -155 -2065 703 6768 2512 5221 2801 -180 10976 14548 12671 3347 -8533 412 -3833 -6801
4710f801J4916J551j068p834k241j0711j281J5035P161L56l70R43K432r663J518
4695C943J3247K441k356j6257j1294j513L605O623j457R658l711j4310j3806N504
4681a9683P982j5470k520J513L019J9229J7440o946j1878o790r973J4363J2137
4668B423M847r888m754J6461J558j5519l198J4127P841n976M748o711j617J104
4654E446j3397j0948N917L047N767O943o065j455L704l321K537n043k7748j246
4640c5862J8293M700N293L263j53K183J1420j684o100q385O795Jn829M566J895
4625C96j634r938o875O244J1096N667l151O914N517O045m287M147n67o523j8144
4610e093j1686j3242j982R537O450k479J6995J528j1348m552Q060J0927O121j4621
$$ plain form
4710 -6801 8115 9666 8598 764 -1477 -12188 -13469 1566 8727 9083 8713 9656 12088 2425 3943
4695 3943 17190 19631 17275 1018 -10276 -11789 -8184 -1561 -3018 6640 2929 -11381 -25187 -19683
4681 -19683 -11701 -27171 -29691 -28178 -25159 -5930 11510 4564 -7314 -14104 -24077 -9714 2423
4668 2423 7270 -2618 -7372 9089 10647 -4872 -8070 6057 13898 7922 12670 5959 4342 5446
4654 5446 -7951 -18899 -12982 -9935 -4168 2775 -3290 -4745 -1041 -4362 -1825 -6868 -34616 -35862
4640 -35862 -17569 -12869 -7576 -4313 -4466 -2283 9137 7453 1353 -7032 -237 -236 -6065 -1499 396
4625 396 -1238 -11176 -18051 -11807 -711 4956 1805 8719 14236 20281 15994 20141 19574 13051 -5093
4610 -5093 -16779 -30021 -32003 -22466 -16016 -18495 -1500 28 -11320 -15872 -7812 3115 9236 -5385
4596e385J475l64k865M610n072r279K718n056k0989q222J6291P077J2539O889
4582e633m74J089Q862n0L198l024r163M910o047r018M695P847K0813j543j1935
4567D527J124R148J76L64M155k1727M704J2385o686o605j6347p33R328k739m522
4552a3448l292O845J2372J3805Q678J757m819l810j2049o326p194K456J4698j0860
4538a187j352J1705J3697l63j0099m596N307n906k834M90M869l484k7080M43R452
4523a0938Q894J1509j1276Q426J1540r606M149o722p771J2130l397j1275l11L039
4509a609M395J4975n314K12O289m661P843r379j983K791j1640J53P54J121q085
4494d138N117j105j2818l086K206j5715J0542K9598N2m689J0228j2206r467k280
$$ plain form
4596 -5385 -3910 -4274 -7139 -2529 -7601 -16880 -14162 -19218 -40207 -48429 -32138 -25061 -12522 -5633
4582 -5633 -6107 -5018 3844 3794 6992 3968 -5195 -285 -6332 -15350 -10655 -2808 18005 16462 4527
4567 4527 5651 14799 14975 15339 19494 -2233 2471 14856 8170 1565 -14782 -15515 -6187 -8926 -13448
4552 -13448 -16740 -9895 2477 16282 24960 26717 21898 18088 6039 -287 -7481 -5025 9673 -1187
4538 -1187 -2539 9166 22863 22500 12401 7805 13112 7206 4372 4862 9731 6247 -20833 -20390 -10938
4523 -10938 -2044 9465 -1811 6615 18155 8549 12698 5976 -1795 10335 6938 -4337 -4648 -1609
4509 -1609 2786 17761 12447 12659 18948 14287 22130 12751 10768 13559 1919 2072 2826 3947 -4138
4494 -4138 979 -126 -12944 -16030 -13824 -29539 -18997 10601 10653 5964 16192 3986 -5481 -7761
4480g761q058R265k978q650n489P380Q974Q025J2505N21k63r345k2345N054J0088
4465c077J6186j4182j7730M391J78n596N573M780J2549K301J793j5310q105q469
4451b4718M942J8170Q83M015k172m900J129m305J214N824q859l232J7799Q102
4437A3892P90j4407j8505J5223N306j0934J179o883j312K748O710P088q357r854
4423a7316m618J1150J9123l486n402M60R68m266J1609N369N275l493q709o865
4409b01m091J367L03N182J2192O827J238l819q080m958j4084J924J0296P85J0326
4394A5207o02j3672l980r101O853o721J195J1657k102K514K511j4693k0600N912
4380b5622o631j4604j421J8550J7378N532l49J3181J4664l865k766q295l644r11
$$ plain form
4480 -7761 -15819 -6554 -9532 -18182 -23671 -16291 -7317 708 13213 13734 13471 4126 -18219 -13165 -3077
4465 -3077 13109 -1073 -18803 -14412 -14234 -19830 -14257 -9477 3072 5373 7166 -8144 -16249 -24718
4451 -24718 -19776 -1606 -723 3292 1120 -3780 -2651 -6956 -5742 82 -8777 -12009 5790 13892
4437 13892 14682 275 -18230 -3007 2299 -8635 -7456 -14339 -15651 -12903 -6193 895 -7462 -17316
4423 -17316 -21934 -10784 8339 4853 -549 -89 879 -3387 8222 13591 18866 15373 6664 -201
4409 -201 -4292 -2925 -2622 2560 14752 21579 22817 18998 10918 5960 -8124 -6200 4096 4881 15207
4394 15207 14605 933 -3047 -12148 -5295 -12016 -10821 836 -1266 1248 3759 -10934 -31534 -25622
4380 -25622 -32253 -46857 -48278 -29728 -12350 -6818 -7167 6014 20678 16813 14047 5752 2108 1197
4366A197j0404K430j25k623R879J2423j4747J027N746J5249p842n622j0731n257
4352i400J255L957J3362k942j1665q369K525k895M540P120K521m848j410P070
4338H21N002m2p588O454P95r00o3l873R969j977j2650o079O453R39p663J1223
4322H21J0751k444L174m169m055j67k626K085j35j6981j13L310N48l33Q23j1258
4306b0769j6803o893l915j073J7200J4674J412P249J2323n86M512j0506K765Q922
4292H512l014j739K001P337N202K049m614M865p364n625M853r592k613n083O718
4277A893J8910K915j6532j7911o804n048n453r566L142J6598J7771o986K165k335
4263g241N365q71P02n178o21M989J311P29j2642O084J0831Q786K2642p279j8360
$$ plain form
4366 1197 -9207 -6777 -6902 -9525 354 12777 -1970 -943 4803 20052 12210 6588 -4143 -9400
4352 -9400 -8145 -4188 9174 6232 -5433 -13802 -11277 -14172 -9632 -2512 9 -4839 -6249 821
4338 821 5823 5781 -1807 4647 5442 4542 4479 606 10575 8598 -4052 -10131 -3678 -2739 -10402 821
4322 821 11572 9128 12302 8133 4078 3911 1285 3370 3235 -13746 -13859 -10549 -10001 -10334 -9511 -20769
4306 -20769 -37572 -44465 -48380 -49453 -32253 -17579 -16167 -8918 3405 2819 7331 -3175 -410 8512
4292 8512 5498 3759 5760 13097 18299 20348 15734 20599 13235 7610 12463 2871 258 -4825 1893
4277 1893 20803 23718 7186 -10725 -17529 -22577 -28030 -37596 -34454 -17856 -85 -7071 -4906 -7241
4263 -7241 -1876 -2747 -2045 -7223 -7844 -2855 -1544 -815 -13457 -7373 3458 12244 34886 27607 9247
4248I247j4851j1920J954L794r13q285l21O935K4526R848q635l714k197l63m607
4233D98n38M711K296m094j3130j5840J2518J8199J879j1459q95K224n792k078
4219a1501l15Q315j501l636L588j4444L897J377k338K885M552j6046K593P169
4205a5405O190R332N8N23j3343J560j499q825L035J5068R30O838R532J768q061
4190G701l0121j9032J4021J7140l252Q758L862o440r636k09P690P288K403J3715
4176A3888j3660J281m106P100J2400J674p398j4739n157M449J235R606l303J289
4162D559m303l826M210K125K056l560q620r031j1295J2493M381r929j0784q080
4148c9604p224P708J0263J667K4423O560q296j0697N570J047j218J392r202L73
$$ plain form
4248 9247 -5604 -17524 -15570 -11776 -12689 -20974 -21295 -14360 10166 20014 11379 7665 5468 5105 498
4233 498 -40 4671 6967 2873 -10257 -26097 -13579 4620 6499 -4960 -5855 -3631 -9423 -11501
4219 -11501 -11816 -3501 -5002 -8638 -5050 -19494 -15597 -14220 -16558 -13673 -9121 -25167 -22574 -15405
4205 -15405 -9215 117 175 698 -12645 -11085 -12584 -21409 -18374 -3306 -2376 4462 13994 15762 7701
4190 7701 -22420 -41452 -27431 -10291 -13543 -4785 -923 -7363 -16999 -17208 -9518 -2230 173 13888
4176 13888 228 1509 -2597 4503 16903 18577 11179 -3560 -8717 -4268 -3033 6573 3270 4559
4162 4559 256 -3570 640 2765 4821 1261 -7359 -16390 -27685 -15192 -10811 -20740 -31524 -39604
4148 -39604 -46828 -39120 -28857 -27190 -2767 3793 -4503 -15200 -9630 -8583 -9801 -8409 -17611 -17238
4134a7238J3919j65p141J536J2504p22Q02O832O316o470j1355j1084k3686K764
4120c3188J4763N668q341M915K0368P787k304O918J066m460r903j538L213P743
4106A2707j2727j5348k797j878R78o203j016J1948Q477J5108P823j0641j2654
4093f223j8531L562Q254J014o37Q387m270N025q223k800N131r373N880k552l363
4078a8719K0329J3085k331k530j3598q651p020o501J2685K1589N687L201p691
4065I535j0120l628k701m21j0719J285N528L125J8993l844q877l812q319J003
4051a2972J5858L987l033Q644m432q762n559m402O639m001r13L579n280r018J0836
4036h829L192r436n159m899j7758K71J6232K3579R52J806K62m816Q71L957q579
$$ plain form
4134 -17238 -3319 -3484 -10625 -9089 3415 2693 3495 10327 16643 10173 -1182 -12266 -35952 -33188
4120 -33188 -18425 -12757 -21098 -16183 4185 11972 9668 16586 17652 13192 3289 1751 4964 12707
4106 12707 -20 -15368 -18165 -20043 -19065 -25268 -26284 -14336 -5859 9249 17072 6431 -6223
4093 -6223 -24754 -21192 -12938 -11924 -12561 -4174 -8444 -3419 -11642 -14442 -9311 -18684 -12804 -15356 -18719
4078 -18719 1610 14695 12364 9834 -3764 -12415 -19435 -25936 -13251 8338 14025 17226 9535
4065 9535 -585 -4213 -6914 -7335 -18054 -16769 -11241 -8116 10877 7033 -1844 -5656 -13975 -12972
4051 -12972 2886 6873 3840 12484 8052 -710 -6269 -10671 -4032 -8033 -8946 -5367 -10647 -19665 -8829
4036 -8829 -5637 -15073 -20232 -25131 -42889 -42618 -26386 -2807 -1855 -49 213 -4603 -3732 225 -8354
4021h354j7850j732N894J832j813J1755J3446J9134j2295j2971m232J339J6241
4008A0394M160l08j9822r480J1091J417k010L560J804q252p840M004M62p251O51
3993a7420l00R999M590j1399Q51o850L555J3026K006j7502j5866l859J0169o26
3979b9626R032J3091q791M0L563J160j2211P522O932m283R082Q550r756J384L877
3964d34n483j1206l188J0452K971P595P992J0087j1335o284Q2j2256j0822m364
3950b6193Q302J2954P019J1266r842p236N287J4300J012n098p084r343N184j2339
$$ plain form
4021 -8354 -26204 -27936 -22042 -20210 -22023 -10268 3178 22312 10017 -2954 -7186 -5847 10394
4008 10394 14554 14246 -5576 -15056 -3965 -2548 -4558 -998 806 -7446 -15286 -11282 -10820 -18071 -17420
3993 -17420 -17720 -7721 -3131 -14530 -13679 -20529 -16974 -3948 -1942 -19444 -35310 -39169 -29000 -29626
3979 -29626 -20594 -7503 -16294 -16254 -12691 -11531 -23742 -16220 -9288 -13571 -4489 4061 -5695 -4311 -434
3964 -434 -5917 -17123 -20311 -9859 -6888 707 8699 18786 7451 1167 1249 -11007 -21829 -26193
3950 -26193 -17891 -4937 2082 13348 3506 -3730 1557 15857 16869 11771 4687 -4656 528 -11811
$$ [...]
##END NTUPLES=NMR SPECTRUM
##END=
