##TITLE=Analysis number 328315
Compound Code cc 62104
Book Reference 470/198
Project Code adrs
Chemist Name mikem
##JCAMPDX= 6.0         $$ Bruker NMR JCAMP-DX V2.0
##DATA TYPE= NMR SPECTRUM
##DATA CLASS= NTUPLES
##ORIGIN= Bruker BioSpin GmbH
##OWNER= nmr
$$ XWIN-NMR		Version 3.5
$$ Thu May 24 08:49:50 2007 GMT Daylight Time (UT+1h)  MAYBRIDGE\nmr@NMR_250MHZ
##.OBSERVE FREQUENCY= 250.131544655141
##.OBSERVE NUCLEUS= ^1H
##.ACQUISITION MODE= SIMULTANEOUS (DQD)
##.ACQUISITION SCHEME= undefined
##.AVERAGES= 16
##.DIGITISER RES= 18
##SPECTROMETER/DATA SYSTEM= dpx250
##.PULSE SEQUENCE= zg30
##.SOLVENT NAME= CDCl3
##.SHIFT REFERENCE= (INTERNAL, CDCl3, 0, 16.522)
##AUDIT TRAIL= $$ (NUMBER, WHEN, WHO, WHERE, WHAT)
$$ ##TITLE= Audit trail, XWIN-NMR		Version 3.5
$$ ##JCAMPDX= 5.01
$$ ##ORIGIN= Bruker BioSpin GmbH
$$ ##OWNER= nmr
$$ C:\u/data/dgb/nmr/ADRS/1400/pdata/1/auditp.txt
$$ ##AUDIT TRAIL=  $$ (NUMBER, WHEN, WHO, WHERE, WHAT)
(   1,<2007-05-24 08:49:14.81 +100>,<MAYBRIDGE\nmr>,<NMR_250MHZ>,
      <created by zg, POWCHK disabled, PULCHK disabled
       configuration hash MD5:
       76 6E 9A 78 1E 09 19 81 EC 84 63 8F B0 6A 59 2D
       data hash MD5: 64K
       20 1D 7E A4 7A 1B 9F 76 3B 40 7E E7 11 D9 A1 BD>)
(   2,<2007-05-24 08:49:30.29 +100>,<MAYBRIDGE\nmr>,<NMR_250MHZ>,
      <Start of raw data processing
       ef LB = 0.3 FT_mod = 6 PKNL = 1 SI = 32K 
       data hash MD5: 32K
       89 8F 05 3A DA 68 47 68 9A BB 13 61 A5 60 9C 78>)
(   3,<2007-05-24 08:49:32.37 +100>,<MAYBRIDGE\nmr>,<NMR_250MHZ>,
      <apk 
       data hash MD5: 32K
       77 7A 35 BE 9B 4D C6 1E 91 49 04 E9 3D C0 1B E6>)
(   4,<2007-05-24 08:49:33.07 +100>,<MAYBRIDGE\nmr>,<NMR_250MHZ>,
      <abs ABSG = 5 
       data hash MD5: 32K
       76 30 F9 FF 28 5B 45 12 0E 6C A9 34 DE A4 2F C8>)
$$ ##END=
$$ 
$$ hash MD5
$$ 51 A6 8A B3 AE 2C 85 B7 51 FE A2 38 8E C2 68 AB
##$RELAX= 
##$RELAX= 
##$RELAX= 
##$RELAX= 
##$RELAX= 
##$RELAX= 
##$RELAX= 
$$ Bruker specific parameters
$$ --------------------------
##$DU= <C:\u>
##$EXPNO= 1400
##$NAME= <ADRS>
##$PROCNO= 1
##$TYPE= <nmr>
##$USER= <dgb>
##$AMP= (0..31)
100 100 100 100 100 100 100 100 100 100 100 100 100 100 100 100 100 100 
100 100 100 100 100 100 100 100 100 100 100 100 100 100 
##$AQSEQ= 0
##$AQ_mod= 3
##$AUNM= <au_zg>
##$AUTOPOS= <54 >
##$BF1= 250.13
##$BF2= 250.13
##$BF3= 250.13
##$BF4= 250.13
##$BF5= 500.13
##$BF6= 500.13
##$BF7= 500.13
##$BF8= 500.13
##$BYTORDA= 1
##$CFDGTYP= 0
##$CFRGTYP= 5
##$CHEMSTR= <none>
##$CNST= (0..31)
1 1 145 1 1 1 1 1 1 1 1 1 1 1 1 1 1 1 1 1 1 1 1 1 1 1 1 1 1 1 1 1 
##$CPDPRG= <>
##$CPDPRG1= <>
##$CPDPRG2= <>
##$CPDPRG3= <>
##$CPDPRG4= <mlev>
##$CPDPRG5= <mlev>
##$CPDPRG6= <mlev>
##$CPDPRG7= <mlev>
##$CPDPRG8= <mlev>
##$CPDPRGB= <>
##$CPDPRGT= <>
##$D= (0..31)
0 1 0 0 0 0 0 0 0 0.06 0 0 0 0 0 0 0.0002 0 0 0 0 0 0 0 0 0 0 0 0 0 0 
0 
##$DATE= 1179992953
##$DBL= (0..7)
120 120 120 120 120 120 120 120 
##$DBP= (0..7)
150 150 150 150 150 150 150 150 
##$DBP07= 0
##$DBPNAM0= <>
##$DBPNAM1= <>
$$ [...]
##$SUBNAM7= <"">
##$SUBNAM8= <"">
##$SUBNAM9= <"">
##$SW= 20.6930455092707
##$SWIBOX= (0..15)
0 0 3 0 0 0 0 0 0 0 0 0 0 0 0 0 
##$SW_h= 5175.983436853
##$TD= 65536
##$TD0= 1
##$TE= 683.16
##$TE2= 300
##$TE3= 300
##$TEG= 300
##$TL= (0..7)
0 120 120 120 120 120 120 120 
##$TP= (0..7)
150 150 150 150 150 150 150 150 
##$TP07= 0
##$TPNAME0= <>
##$TPNAME1= <>
##$TPNAME2= <>
##$TPNAME3= <>
##$TPNAME4= <>
##$TPNAME5= <>
##$TPNAME6= <>
##$TPNAME7= <>
##$TPOAL= (0..7)
0.5 0.5 0.5 0.5 0.5 0.5 0.5 0.5 
##$TPOFFS= (0..7)
0 0 0 0 0 0 0 0 
##$TUNHIN= 0
##$TUNHOUT= 0
##$TUNXOUT= 0
##$USERA1= <user>
##$USERA2= <user>
##$USERA3= <user>
##$USERA4= <user>
##$USERA5= <user>
##$V9= 5
##$VALIST= <valist>
##$VCLIST= <CCCCCCCCCCCCCCC>
##$VD= 0
##$VDLIST= <DDDDDDDDDDDDDDD>
##$VPLIST= <PPPPPPPPPPPPPPP>
##$VTLIST= <TTTTTTTTTTTTTTT>
##$WBST= 1024
##$WBSW= 4
##$XGAIN= (0..3)
0 0 0 0 
##$XL= 0
##$YL= 0
##$YMAX_a= 414056
##$YMIN_a= -282645
##$ZGOPTNS= <>
##$ZL1= 120
##$ZL2= 120
##$ZL3= 120
##$ZL4= 120
##$ABSF1= 16.522
##$ABSF2= -4.171173
##$ABSG= 5
##$ABSL= 3
##$ALPHA= 0
##$AQORDER= 0
##$ASSFAC= 0
##$ASSFACI= 0
##$ASSFACX= 0
##$ASSWID= 0
##$AUNMP= <proc_1d>
##$AZFE= 0.1
##$AZFW= 0.1
##$BCFW= 0
##$BC_mod= 0
##$BYTORDP= 0
##$COROFFS= 0
##$CY= 12.5
##$DATMOD= 1
##$DC= 0
##$DFILT= <>
##$DTYPP= 0
##$F1P= 14.0000005364418
##$F2P= -0.99999901652339
##$FCOR= 0.5
##$FTSIZE= 32768
##$FT_mod= 6
##$GAMMA= 0
##$GB= 0
##$INTBC= 1
##$INTSCL= 1
##$ISEN= 128
##$LB= 0.3
##$LEV0= 0
##$LPBIN= 0
##$MAXI= 10000
##$MC2= 0
##$MEAN= 0
##$ME_mod= 0
##$MI= 0
##$NCOEF= 0
##$NC_proc= -3
##$NLEV= 6
##$NOISF1= 0
##$NOISF2= 0
##$NSP= 0
##$NTH_PI= 0
##$NZP= 0
##$OFFSET= 16.522
##$PC= 1
##$PHC0= -56.2755
##$PHC1= 8.954035
##$PH_mod= 1
##$PKNL= yes
##$PPARMOD= 0
##$PSCAL= 4
##$PSIGN= 0
##$REVERSE= no
##$SF= 250.13
##$SI= 32768
##$SIGF1= 0
##$SIGF2= 0
##$SINO= 400
##$SIOLD= 32768
##$SREGLST= <1H.CDCl3>
##$SSB= 0
##$STSI= 32768
##$STSR= 0
##$SW_p= 5175.98343685301
##$SYMM= 0
##$S_DEV= 0
##$TDeff= 65536
##$TDoff= 0
##$TI= <Analysis number 999999
Compound Code 99
Book Reference 9
Project Code 9>
##$TILT= no
##$TM1= 0
##$TM2= 0
##$TOPLEV= 0
##$USERP1= <user>
##$USERP2= <user>
##$USERP3= <user>
##$USERP4= <user>
##$USERP5= <user>
##$WDW= 1
##$XDIM= 32768
##$YMAX_p= 325226239
##$YMIN_p= -157413
$$ End of Bruker specific parameters
$$ ---------------------------------
##NTUPLES= NMR SPECTRUM
##VAR_NAME=  FREQUENCY,     SPECTRUM/REAL,   SPECTRUM/IMAG
##SYMBOL=    X,             R,               I
##VAR_TYPE=  INDEPENDENT,   DEPENDENT,       DEPENDENT
##VAR_FORM=  AFFN,          ASDF,            ASDF
##VAR_DIM=   32768,         32768,           32768
##UNITS=     HZ,            ARBITRARY UNITS, ARBITRARY UNITS
##FACTOR=    0.157963299565203, 1,           1
##FIRST=     4132.6476996994, 0,             0
##LAST=      -1043.33573715361, 0,           0
##MIN=       -1043.33573715361, -157413,     0
##MAX=       4132.6476996994, 325226239,     0
$$ Real data points
##PAGE= N=1
##DATA TABLE= (X++(R..R)), XYDATA
$$ [...]
18424B016389n7643p757J37930K23876O9771k7864j3447N9809Q4400J20958J95036
18413B801458K88257K37163J82624J54285J28465J70265J92401K30964L69955
18404D755837O21552J004294J490472K033691K746989L746513N079182O805640
18396B8284170P196421L377021q41248l53007m92229m724510o466941l588005
18388B2391672r6926K632589M982739P168670O959259J061317o926165j0983794
18380B7189361r228340n515811l064777j821068j146125q11514n07422l36336
18372D757968j99103j24242j75021j41363j5338O144l644l8260p0807r3714M3758
18361C946378K24016M36851O05188P63300J054721J449668K054505K934047M086107
$$ y = [2016389, 1958746, 1950989, 2088919, 2312795, 2382566, 2354702, 2341255, 2401064, 2485464, 2606422, 2801458, 3089715, 3326878, 3509502, 3663787, 3792252, 3962517, 4154918, 4385882, 4755837, 5377389, 6381683, 7872155, 9905846, 12652835, 16399348, 21478530, 28284170, 35480591, 38857612, 38016364, 37663357, 37171128, 32446618, 25979677, 22391672, 22294746, 24927335, 29910074, 37078744, 44038003, 45099320, 38173155, 27189361, 17961021, 12445210, 9380433, 7559365, 6413240, 5601726, 5094304, 4757968, 4558865, 4434623, 4259602, 4118239, 4102901, 4109045, 4105401, 4067141, 3996334, 3902620, 3946378, 4170394, 4607245, 5212433, 5975733, 7030454, 8480122, 10534627, 13468674, 17554781]
18352A7554781N206259M175589K65912k561971j392870J677985L519431J252900
18344B9698016l167641l736302p51638K316254M302129L014154r36287k056650
18336B8682035j248911l746640o631627n704407l365853j973222j284083q92565
18328C834727o23098m22357l04395j94152j46315j49428j57475j65104j46941
18319A525462j07631j02842p1560l6192m6477o5703r5983r8235n7791l8306k9654
18308G75088l6159j9597n46n905k2325k1024k0232J299j6523K815j2382k1230
18296F03279J9856K9646K274Q220r652l3863j5281j7469k4924j6107J8355M4041
18284F08375N3443K2139J651k4505l6909m5594j4043j7867p4692p0728p2571K0823
$$ y = [17554781, 22761040, 26936629, 27202541, 24640570, 23247700, 24925685, 28445116, 29698016, 26530375, 22794073, 22042435, 24358689, 28660818, 31674972, 30738685, 28682035, 27433124, 23686484, 17054857, 11350450, 7984597, 6011375, 4727292, 3834727, 3211629, 2789272, 2484877, 2290725, 2144410, 1994982, 1837507, 1672403, 1525462, 1417831, 1314989, 1243429, 1207237, 1160760, 1095057, 999074, 900839, 843048, 804742, 775088, 738929, 719332, 718786, 712881, 690556, 669532, 649300, 650599, 634076, 636891, 624509, 603279, 623135, 652781, 655055, 663275, 653623, 619760, 604479, 587010, 562086, 545979, 564334, 608375, 661818, 683957, 685608, 661103, 624194, 578600, 564557, 546690, 471998, 401270, 328699, 349522]
18272C49522Q991k2059K8783L7120M9382J4718J9807K234k569L8687N962o192
18260E24386O240J1767J7361L1250P662R778k021q370K7280K4848l5278k9976
18248E84927j1241K7019M0369J2360o771j4642n273o9898m8489j5114j0932j2075
18236D70240j8398J6192Q34R514L3124M7190N640Q241J7781L2838N1583K8797
18224G03576K4990L2620N5782J06231J42712J11643P5843N8210N0459P2041L5850
18213A469957k6073m4907k9903m7098k7854L703q344n634o0061p2944o2344l3682
18201A054816m2449o7266l4250k4848m4893q5950n5198j9178o2029m8722k6506
18190E43527k7429l4088l3835l008K8637J2459k2693m728o171N607J5177j24J4555
$$ y = [349522, 358513, 336454, 365237, 402357, 451739, 466457, 486264, 488498, 485929, 524616, 530578, 524386, 530626, 542393, 559754, 591004, 598666, 608444, 606423, 598053, 625333, 650181, 614903, 584927, 573686, 600705, 641074, 653434, 646663, 632021, 626748, 556850, 508361, 493247, 482315, 470240, 451842, 468034, 468868, 478382, 511506, 558696, 564336, 572577, 590358, 623196, 674779, 703576, 728566, 761186, 816968, 923199, 1065911, 1177554, 1253397, 1311607, 1362066, 1434107, 1469957, 1443884, 1398977, 1369074, 1321976, 1294122, 1297825, 1289481, 1283847, 1223786, 1150842, 1088498, 1054816, 1012367, 945101, 910851, 886003, 841110, 755160, 699962, 680784, 618755, 570033, 543527, 516098, 482010, 448175, 445167, 473804, 486263, 463570, 458842, 452671, 458278, 473455, 473331, 487886]
18177D87886j6667j7382M609j4001k8914N166L7358L6326J9745n016q139K4687
18165E25658L216k9916N17m1055j2110o845q987j70K3481j0751K4434J710j7440
18152D51742j6133M983L935L6798j1892j4848R116O0296K1493J2491K7692L079
18140E88752n294M1102J2360L160n553J5426J4132N0775L0086J5863K2716L517
18128G87042J6498P5762J13725R1031J19428J41185J75449K74556L80591M49173
18118B624440N74769P52794R44177J251911J709930K282227L337459N170801P612328
18109B6260836J0445775J5852409J4195260j0884952k3890450j4284428o760070
18102A0934380l504686k015213j294951q40093n77627m31820l40957k86070k19983
$$ y = [487886, 471219, 453837, 458446, 444445, 415531, 420697, 458055, 494381, 514126, 509110, 500971, 525658, 528874, 498958, 499475, 458420, 446310, 439465, 430478, 430308, 453789, 443038, 467472, 469182, 451742, 435609, 440592, 444527, 481325, 469433, 454585, 463701, 523997, 545490, 557981, 585673, 588752, 583458, 624560, 636920, 640080, 634527, 649953, 664085, 714860, 744946, 760809, 783525, 787042, 803540, 879302, 993027, 1084058, 1203486, 1344671, 1520120, 1794676, 2175267, 2624440, 3199209, 3952003, 4896180, 6148091, 7858021, 10140248, 13477707, 18648508, 26260836, 36706611, 52559020, 66754280, 55869328, 31978878, 17694450, 10934380, 7429694, 5414481, 4119530, 3279437, 2701810, 2269990, 1929033, 1642963, 1422980]
18093A422980j87975j22083j39076j23621p5312m1865l0734o8222n9578p1727
18083E02787m3465k0529j2601M27l9248m2313k7976K818L847n232j7062R625K6517
18070C37595n759k7031l1281k1220j8460J3170J6652p455l6701k4290J3776J2953
18058B21949j0266k1293P571O427J6628J4140J2794m926l7970m5348p46O870l783
18045A62047P718k4079j1817O169j6249m826J2682k7429j6156o228j1581K6990
18033I7241M876J595J0201K1287j0698r106k3350K777p045L469K3934K9936n993
18020A39124k2173m1759j6784L222q35q329K8019J1832j9086J0235l1287m831
18008D7348q339N541P638j3272K0256J6258q079L933O60j2127j0522K2981K0799
$$ y = [1422980, 1235005, 1112922, 973846, 850225, 774913, 733048, 702314, 634092, 574514, 502787, 459322, 438793, 426192, 426619, 387371, 345058, 317082, 319900, 323747, 318515, 301453, 311078, 337595, 331836, 304805, 273524, 252304, 233844, 247014, 263666, 256211, 219510, 195220, 208996, 221949, 211683, 190390, 197961, 204388, 221016, 235156, 247950, 243024, 205054, 159706, 158960, 165830, 162047, 169765, 145686, 133869, 140038, 123789, 118963, 131645, 104216, 88060, 81832, 70251, 97241, 102117, 103712, 113913, 135200, 124502, 115396, 92046, 94823, 87778, 91247, 115181, 145117, 139124, 116951, 75192, 58408, 61630, 60795, 52466, 80485, 92317, 73231, 83466, 52179, 47348, 39009, 44550, 52188, 38916, 59172, 75430, 67351, 71284, 71944, 59817, 49295, 72276, 93075]
17995I3075N585k1133n1977j0141Q636Q250L7310J3641k2483j16m06P767J0987
17982G8995J0456N203M5159J4636L820j9617j8831l9738m1414L820K318k1201
17970B3606j08J748k2166K6758R009j6625J2053J6232j4093j1884L0401N947k8311
17957C2567k1298J3712K5683k4108j7745J4345K2872j9070j5166p598M3880o750
17945D1324k248r615R507j6409M105j8607J7237K5598k0234j4995K4121N772p72
17932D4784O273k5605q883k4539j1213J3775J6579K1605J719j6511j227k2239
17920e482r622L6631O146O619j521j498j5956n173J2733J8535L8270J4306l5713
17907E8275j0087J7851o619k1572k8788J7175J3609j4842l900M538L1095j1053
$$ y = [93075, 98660, 77527, 25550, 15409, 24045, 32295, 69605, 83246, 60763, 60647, 60241, 68008, 78995, 89451, 94654, 139813, 154449, 158269, 138652, 119821, 80083, 38669, 42489, 44807, 23606, 23498, 25246, 3080, 29838, 38847, 22222, 34275, 50507, 36414, 24530, 54931, 60878, 32567, 11269, 24981, 50664, 26556, 8811, 23156, 46028, 26958, 11792, 4194, 48074, 41324, 39076, 29461, 38968, 22559, 26664, 8057, 25294, 50892, 30658, 15663, 39784, 45556, 44784, 51057, 25452, 16569, -7970, -19183, -5408, 11171, 32776, 34495, 17984, 16757, -5482, -15104, 21527, 27673, 34292, 32771, 31273, 15317, 10144, 22877, 41412, 79682, 93988, 58275, 48188, 66039, 59420, 37848, 9060, 26235, 39844, 25002, 21102, 25640, 56735, 45682]
17895D5682j175L134n040j7839J6097K5709Q327p551l522K292K7876K0057N856
17882A19903J1525j1131J6830J4419N7453J193r520K4808l093l4394k2103O606
17870A72496K1990O067L0628M402k0811k7449m583l6506m2368j8153k1938j7125
17858D6650J512J1440K765j435j081n6946p676L5701j2842J5445R760J832j8265
17845B6860j4104j1760O979K7238K1902j2914j2147J0423O408L6118L7648J1376
17833A34027p274O109L8511K2414k3080j161J007k0827q981l528L9186J4106k2316
17820A68193l983J164j3044j8040m2889k706N950j6094l0764j0742K7028M746
17808F8819p591K9901j6877n0865j3989o178K9632J9932L272k625j3660l0857
$$ y = [45682, 44507, 47641, 42601, 24762, 40859, 66568, 74895, 67344, 63822, 66114, 93990, 114047, 119903, 131428, 120297, 137127, 151546, 208999, 210192, 200672, 225480, 222387, 187993, 165890, 172496, 194486, 200553, 231181, 235583, 214772, 187323, 182740, 146234, 103866, 85713, 63775, 46650, 48162, 59602, 62367, 60932, 59851, 2905, -4771, 30930, 18088, 33533, 43293, 45125, 26860, 12756, 996, 7975, 35213, 57115, 44201, 32054, 42477, 48885, 85003, 122651, 134027, 126753, 132862, 171373, 193787, 170707, 169546, 170553, 149726, 140745, 137217, 176403, 190509, 168193, 164210, 165374, 152330, 134290, 91401, 88695, 94645, 78551, 47787, 37045, 64073, 68819, 61228, 91129, 74252, 23387, 9398, 3220, 32852, 52784, 56056, 53431, 39771, 8914]
17796H914j3522J4000P803M220j5574K8676j6137Q742K6640P359r826J2040k198
17783F1137k2700j429j9563j9272j9275j7773J9507K6025J4946J0002m200j8893
17771H512l3696N314L9874J990p993J1534n427k0105J3166j8434k2624j0888N355
17758c3422P448o280J0133l157n024J0733o629p331j0904j8429M280L7712J111
17745a9759K4161K1286j3735R923J5328R498j4008p078J31o013m58j8035q33p944
17731g536L297Q084j0734o567k852R748n607J2279L8433O831R430k9659l2066
17718f919j0123J3412m652L77J0448j2377K03j0954l568p105p192j6636O238J7069
17704c1779J5931J3900K6317K761k8338k2895j7140n88L201o591L2178K5900J3908
$$ y = [8914, -4608, 9392, 17195, 21415, 5841, 34517, 18380, 27122, 53762, 61121, 51295, 63335, 61137, 38437, 37008, 17445, -1827, -21102, -38875, -19368, 6657, 21603, 31605, 27405, 8512, -25184, -19870, 20004, 21994, 14001, 25535, 20108, 3, 13169, -5265, -27889, -38777, -33422, -25974, -32254, -22121, -25278, -30302, -19569, -26198, -33529, -44433, -62862, -58582, -20870, -19759, 4402, 25688, 11953, 21876, 37204, 46702, 32694, 25616, 25747, 19734, 19276, 1241, 408, -7536, -4239, 3845, -6889, -13456, -16308, -6560, -12167, 112, 38545, 45376, 54806, 25147, -6919, -17042, -3630, -8282, -7905, 2543, -9834, -9631, -20585, -24153, -31258, -38450, -55086, -48848, -31779, -15848, -1948, 24369, 27130, -1208, -24103, -41243, -41831, -38630, -45221, -13043, 12857, 26765]
17691B6765O934j9295j435J1950j4518j7499M087K5999J3842l8199p333L371M002
17678a329J7488k5753K0415j3064j6470K8296J1356j4875L867L993o218O891l275
17665A1322l24K437j394M269J9018M539o367k0818j4482j4830j8153K686J2571
17652a9526o085j3003m649k1721o028J6758M5439K5501N553l9934l6387k3601
17640g7683M6699p315l7648j928j891M5342M4665J9337K71j8898k3926k4248J7615
17627a9608L8433M9145L151m6326m8090J1744J9976k188M959J9206M3203M1506
17615A15111M9428Q6916Q2821M9928N8768K7703J1671R097j5708j5914m6203q2668
17603C30950p1859l8764o5634n0086j3997j3977k1488k2773o80L1430j1898k1390
$$ y = [26765, 33699, 14404, 12969, 24919, 10401, -7098, -3011, 22988, 36830, -1369, -8702, -5331, -1329, 16159, -9594, 10821, -2243, -18713, 9583, 20939, 6064, 9931, 13924, 7706, 14597, 11322, 10998, 13435, 12041, 16310, 35328, 39867, 33500, 12682, -1800, -16630, -34783, -32097, -19526, -25611, -38614, -43263, -64984, -71012, -54254, -8815, 16686, 22239, -17695, -54082, -77683, -30984, -38299, -75947, -77875, -79766, -34424, 10241, 29578, 29849, 10951, -12975, -37223, -19608, 18825, 67970, 71121, 24795, -23295, -11551, 8425, 6237, 11196, 30402, 73605, 115111, 164539, 251455, 334276, 384204, 442972, 470675, 482346, 491443, 475735, 459821, 413618, 330950, 259091, 220327, 154693, 104607, 90610, 76633, 55145, 32372, 31692, 63122, 51224, 29834]
17591B9834r401N629K59J0178R884j2630J821N465o115m5803j1882K3015m346
17578d092j7612j5023L7239J7199j1474j6233K599r927l713L92J2455k470r653
17565b0313n551k0897J6719J7731L4432J2555j6428k2037k7438j7394j3372J8383
17553d3610J2684O635L889j3774K6066J1424l701J1591J2736N299k1026L9446
17541D7659r654l2649R585J0678n236j3151J8498J1580k2647r427K4382j7087
17529A2531j8972R27k6457J6492J1827J3752K4020M69j6418j769j456j1156Q489
17516A2279Q667k6619q210j4625J1988J4910P910j8772j9422K2067M472Q437n758
17503b676Q339K3089m606j3533l793J2140R942q762o447l5796k8285M229j3753
$$ y = [29834, 20433, 26062, 26321, 36499, 46383, 33753, 35574, 41039, 34924, -10879, -22761, 254, -4092, -21704, -36727, 512, 17711, 6237, -9996, -7397, -17324, -21037, -20645, -8190, -10660, -20313, -25864, -46761, -30042, -12311, 22121, 34676, 18248, -3789, -31227, -48621, -61993, -43610, -30926, -24291, -20402, -34176, -8110, 3314, -387, 11204, 23940, 29239, 8213, 47659, 38005, 5356, 14941, 25619, 20383, 7232, 25730, 37310, 14663, 5236, 29618, 12531, -6441, -5514, -31971, -15479, -3652, 10100, 34120, 34589, 18171, 16402, 14946, 3790, 12279, 20946, -5673, -13883, -28508, -16520, -1610, 6300, -12472, -31894, -9827, -5355, 3082, -2676, 5663, 28752, 24146, 10613, 6820, 18960, 28902, 20140, 13693, -22103, -50388, -46159, -59912]
17490e9912N095L8175J754J0461J9983J0340J8023j5780o618J9630R174p881o765
17477C5679k3636r495L227N141P70k085k678R48q81K1811p989k4949K7832J7819
17463D1514j707n085m254j4532j1381J0784k654j1059J290K3528k737m4886K3453
17450B274J1082j4363O916J8174L4554N1247J4947J0306P1484J21773K0138j38979
17438B09553j19571l3798k5964P816J7572m120k9146l841j1198l2138J4429L3324
17426B2918q057l802l969J3345k3757P873J4300j9257l101J0119K9860j3847J924
17413B4549r618L578M293m4440l6959J6502j7372m2511l24K5119l294M7090J3423
17400a9964L252K773j5054L850J8745M78j5413j4063k3967r233K2489J9840R40
$$ y = [-59912, -54817, -16642, -14888, -4427, 15556, 25896, 43919, 28139, 21521, 41151, 50325, 42444, 35679, 12043, 2548, 5775, 10916, 11686, 9601, 6923, 7871, 6990, 28801, 20812, -4137, 23695, 41514, 39807, 34722, 30468, 15936, 4555, 15339, 12685, 1626, 2916, 26444, 23707, -21179, 2274, 13356, -1007, 5909, 24083, 58637, 109884, 124831, 135137, 206621, 328394, 348532, 209553, 89982, 56184, 30220, 38036, 55608, 51488, 22342, 18501, 7303, -24835, -10406, 22918, 14861, 11059, 7090, 20435, -3322, 4551, 18851, -406, -3507, 6612, 36472, 22625, 24549, 14931, 18509, 22802, -21638, -58597, -42095, -59467, -101978, -102302, -77183, -80477, -33387, -19964, -16712, -13939, -28993, -25143, -6398, -5920, -21333, -35396, -59363, -68596, -46107, -26267, -25327]
17387b5327L553J5485Q360k209J4536J2645J1133j6954p331j7452j0147P367N478
17374h63m1845j6491L38L2833R241m542m535K9183K0446J5383p361j5377j1138
17361E272j2290p651P377q847L8526k2328j4725J0964J2897k9736j2070o359j8203
17348e7173l32K6309J3265L2379j160k3879l3134o556L655J1530J1245j689m073
17335b9613K0678j6626J9198o332m275r260o711q885J0291j0102N858J565J5636
17322a8578K310r551j9367l718L8709J8477j6933J1485M0207j6227j0265M257
17310B0806k6291J2058L2420L2942r277j5059Q944J0645m066p985N501L172L3321
17297I7131p858l0524j574J6799L0187J2582k3123j2311o554j5785M277K5861
$$ y = [-25327, -21774, -6289, 2071, -138, 14398, 27043, 38176, 21222, 13891, -3561, -13708, -6341, -863, -42708, -59199, -58861, -26028, -16787, -21329, -25864, 3319, 23765, 39148, 31787, 16410, 5272, -7018, -14669, -7292, -16139, 22387, 59, -14666, -3702, 9195, -20541, -32611, -38970, -57173, -57505, -31196, -17931, 14448, 13288, -10591, -43725, -50281, -46626, -35096, -23851, -25540, -29613, -8935, -25561, -6363, -12695, -16970, -26230, -32941, -41826, -31535, -41637, -35779, -34214, -18578, -16268, -25819, -45186, -48904, -10195, 8282, -8651, 2834, 43041, 26814, 16549, 20806, -5485, 6573, 38993, 71935, 62658, 47599, 56543, 67188, 63122, 55137, 60638, 63810, 97131, 89273, 58749, 57175, 73974, 104161, 116743, 93620, 81309, 74755, 58970, 63247, 89108]
17285H9108j8627j1431j247p897j0908j3618r406k5470q266K9258M1568O834k287
17272E7611j9768N309J3267M588l4896l5954p624O556K4966K1821M350j3230k092
17259B4904K0906L9081k5471p352m054l959j3044j3610j270K9070l870j5372r430
17246A6529n878k4792O992M904J5629M292Q030p68o079l649N168k893k9650j1859
17232b4024j3436O23M1991M153J3772J8903o54l1237k2595r589R620q27K511J4068
17218C279J2368K0229K0840K6906r868l9340n978j0559J1599J3442K5351M0278
17206A08547J6501J2381M9350L7280O3766Q2415J03451J61757J43726J33720J49808
17195A062702J77374J09202k0779l6957n1069j34326k02150j88895j81949j26559
$$ y = [89108, 70481, 59050, 57803, 49906, 38998, 25380, 15974, -9496, -17762, 11496, 53064, 59898, 57611, 37843, 43152, 56419, 61007, 26111, -9843, -17467, -10911, 14055, 35876, 40226, 26996, 24904, 45810, 84891, 59420, 52068, 48014, 44055, 31011, 17401, 16131, 45201, 41331, 25959, 16529, 10651, -14141, -7149, -2245, 13384, 17676, 25706, 24938, 18859, 15210, 20378, 17485, -12165, -24024, -37460, -36837, 5154, 9307, 23079, 41982, 41328, 10091, -12504, -22093, -12473, -13300, -10789, 3279, 15647, 35876, 56716, 83622, 73754, 34414, 28436, 17877, 29476, 42918, 68269, 108547, 125048, 137429, 186779, 224059, 287825, 370240, 473691, 635448, 779174, 912894, 1062702, 1240076, 1349278, 1328499, 1291542, 1240473, 1106147, 903997, 715102, 533153, 406594]
17185D06594j09962p7125m2898n3724l6932P989L453K1713j7603K758j8299Q421
17173I4385K723L127J56l4449l1373J3689p363J8726R18L2010K1040P469M1433
17160A62491N2283J7298l4761l4349m1514k5557J3076j62N45J6976Q391q679K6700
17147A52738J1459J0563j1583j9925R995j2465l1480J0713j2627J330j6526j152
17135I1040O536Q854M3627j6530l8753k3581L6370M4210N665o208j825q998j7543
17122A22864j4639K4519K1963J0691R522n620J6384K2803J9362J705r133K629
17110B23050j8067j445L4761m914J3044q275j7132k8896j3016J1068O643J6951
17098B13772K1739N209J0521P108q706m215O145M2984J2563M0127N2106L4355
$$ y = [406594, 296632, 219507, 176609, 122885, 85953, 93942, 97395, 119108, 101505, 104263, 85964, 94385, 97108, 100235, 100391, 65942, 34569, 48258, 40895, 59621, 60539, 92549, 113589, 121058, 162491, 214774, 232072, 197311, 162962, 121448, 95891, 108967, 108805, 109350, 126326, 134717, 126038, 152738, 164197, 174760, 163177, 143252, 153247, 140782, 109302, 120015, 107388, 108718, 92192, 91040, 97576, 106430, 150057, 133527, 94774, 71193, 107563, 151773, 157438, 151230, 149405, 140407, 122864, 108225, 132744, 154707, 165398, 174920, 169300, 185684, 208487, 227849, 229554, 220421, 223050, 204983, 203538, 238299, 233385, 246429, 238154, 221022, 192126, 179110, 190178, 196821, 213772, 235511, 240720, 251241, 258349, 249643, 245428, 251573, 294557, 307120, 347247, 399353, 433708]
17086D33708m6623k0114K045J6858J5522M3074M6823L2945M526K8946P2900Q5168
17074G15778Q6371M8102O3219Q9509J15325J01121R7706J36485K02742K10142
17064A866500J82608J91496K06722K06973K35999K82998K96602L05137M18782
17055D193817N60754P46646R57601J231458J582566K034156K739391L749364N120196
17046B2915949O904676R117560J1054547J1282601J0792701J2169258J1950574
17039I6187866M841208k458135k710541l724398j0974670j5573436j3515284j1084321
17031D0988289j0271746q769476o237790m058751k565300j670682j200236q94030
17023E320278p18598n36625m52942m20882l66158k70606k14034j71543j54929
$$ y = [433708, 387085, 366971, 369016, 385874, 401396, 444470, 491293, 524238, 528764, 557710, 630610, 715778, 802149, 850251, 913470, 1002979, 1118304, 1219425, 1317131, 1453616, 1656358, 1866500, 2049108, 2240604, 2447326, 2654299, 2890298, 3173296, 3469898, 3775035, 4193817, 4754571, 5501217, 6458818, 7690276, 9272842, 11306998, 14046389, 17795753, 22915949, 29820625, 38938185, 49992732, 61275333, 72068034, 84237292, 96187866, 101029074, 98570939, 95860398, 92136000, 81161330, 65587894, 52072610, 40988289, 30716543, 21947067, 15709277, 11650526, 9085226, 7414544, 6214308, 5320278, 4601680, 4065055, 3612113, 3191231, 2825073, 2554467, 2340433, 2168890, 2013961]
17014B013961r9914j08784j58581j34424r7550j10853j36556j21897p6427j07152
17004H61823r1161r2366k8129l4786j0345j682m6378l4017l0788j0421k7828o8133
16992C85789q471o876k211Q334j5161j8417j2212q189l7594o789K6167l4137n2026
16979B18207q350k4576M880K6205l0060k7642k4242J3444j6636n888k0968j3238
16967I1136o680K09L7744K0572r314J0050L112j6131M009K5932n270L3852K0470
16954B09691J296j3835p607K2026J7217n365k0235n3775j7604K5416r653o145
16942A41427j436k7519j6386j9826M126K039m833K5700J9809m541M761j0518l8496
16929G4307R327J5874N8479N6658M2582L8638j8613p742p552n4559r028Ll0347
$$ y = [2013961, 1914047, 1805263, 1646682, 1512258, 1414708, 1303855, 1167299, 1045402, 968975, 861823, 770662, 678296, 650167, 615381, 605036, 603354, 556976, 522959, 492171, 481750, 453922, 385789, 377318, 370442, 368231, 376565, 361404, 342987, 330775, 322586, 284992, 278203, 304370, 270233, 218207, 209857, 185281, 190161, 216366, 186306, 158664, 134422, 147866, 131230, 125342, 104374, 91136, 84456, 84665, 122409, 142981, 133667, 143717, 146829, 130698, 134707, 160639, 155369, 189221, 209691, 210987, 197152, 189545, 211571, 228788, 223423, 203188, 149413, 131809, 157225, 147572, 141427, 139991, 112472, 96086, 76260, 80386, 82425, 77592, 103292, 123101, 118560, 123321, 112803, 74307, 83634, 99508, 157987, 214645, 257227, 295865, 277252, 269510, 261958, 207399, 198371, 198374, 168027]
16916A68027J9377J4268o25K6395Q1375N7722K9863M571N03j500k4125k2664k7638
16903C25549l0847l8896o7092m9125l8195j0611j634k2184L001R54j4197o666
16891E0057j3329J6048K7734r829j1832K1593p367k4465K8104j884J1625K1182
16879A07637R142N988M3053K3816L457Q998k4201l4172q273j1567J601k1135k0864
16866H3480N803k0344j3065o192K0729k5865k5672L6250M037o353k0712j6083
16854A6013j8284k101J0955j2888J0412j3924l9225L9148J1048J8682J0344L375
16842C3555L311j6381k8912j4789K0512L2038m7o1092p981J5913M955Q037j0797
16829b1678l462M013P369O936l243l946j6570m320J5661L611J7430J5679n304
$$ y = [168027, 187404, 201672, 201047, 227442, 308817, 366539, 396402, 400973, 401476, 399976, 375851, 353187, 325549, 294702, 255806, 188714, 139589, 101394, 90783, 89149, 66965, 69966, 70920, 56723, 50057, 36728, 52776, 80510, 70681, 58849, 80442, 73075, 48610, 76714, 74830, 86455, 107637, 116779, 122767, 165820, 189636, 193093, 202091, 177890, 143718, 135445, 123878, 125479, 104344, 83480, 89283, 68939, 55874, 49682, 70411, 44546, 18874, 55124, 59161, 52808, 32096, 16013, -2271, -4372, 6583, -6305, 4107, -9817, -49042, -9894, 1154, 19836, 30180, 33555, 36866, 20485, -8427, -23216, -2704, 29334, 29287, -31805, -39786, -23873, -18918, -10881, -21678, -25140, -21127, -13758, -6822, -10065, -14011, -30581, -34901, -19240, -15629, 1801, 17480, 12176]
16816A2176M741l306l1247m370K8478J481J8716L0662K6697O700k5626j1089K8850
16803H2863O706k6574l3365Q131M057J5824M487l6014j2447J7271J6220J6504
16791F3663q002k8616n5089k8137L7255M9985N306l0041k785o128j342M3860n662
16778C4267j8611o573k728r702J6183K9957j854k707J9314R842M0090j9529k5389
16765F2560j1465j0245k3539J3845K7162J4574l7622m3101J531J6932R568j140
16753A9060k1013j759j3073K4744L6196K4191j0342L0954j7299p014p853J4087
16741G0879J0941k1442j9711J2465N718M4739P24j658j8490l8589p814K3362J7139
16728G8263n302j5779j2836Q594j7262k7116k3734o221p351J780k4227J1730J8432
$$ y = [12176, 16917, 13611, -17636, -22006, 6472, 7953, 26669, 57331, 84028, 90728, 65102, 54013, 82863, 89569, 62995, 29630, 37761, 41818, 57642, 62129, 26115, 13668, 30939, 47159, 63663, 55661, 27045, -28044, -56181, -18926, 31059, 36365, 6324, 3539, -2589, -3931, 39929, 34267, 15656, 9083, 6355, -3347, 12836, 42793, 40939, 38232, 57546, 67388, 107478, 87949, 62560, 51095, 40850, 17311, 31156, 58318, 72892, 35270, -7831, -6300, 10632, 20200, 19060, -1953, -3712, -16785, 7959, 44155, 68346, 58004, 88958, 71659, 64645, 56792, 70879, 81820, 60378, 40667, 53132, 58850, 103589, 104313, 102655, 84165, 45576, 37762, 61124, 78263, 72961, 57182, 44346, 52940, 35678, 8562, -15172, -21393, -28744, -26964, -51191, -39461, -21029]
16715b1029j2168j5247J879J9888j5581P821K7699j380j7153J3607J6786m5R152
16702A4229j3225k6451N552J2466J8233J5464O62R158Q626q929j3960k7162n485
16689a0822m305o128j0750l951P679L188L1465J1912k4909l977n635j022j7115
16676c4370j4592M3755q93j4748j3250J0880J0341N636j9595o877K4144J0658
16664A089P094j0827k8903J2690q990J8893j7018J0723L4667j3441j7761m221
16652a6005p840K7885R399j0863N287J8952k4033j1357Q491M7020n64l8487m1553
16639c3668j5193o452P274L4736K3575j1769K003p736k8739j6520J9815J5427
16627a7247k1938k2621J2547J6418K1637J3501j450m074O306o70j3459K840N258
$$ y = [-21029, -33197, -48444, -46565, -26677, -42258, -34437, -6738, -8118, -25271, -11664, 5122, 5077, 14229, 1004, -25447, -19895, -7429, 10804, 26268, 26930, 36088, 44714, 35785, 21825, -5337, -10822, -15127, -21255, -32005, -35956, -28277, -25089, 6376, 18288, -6621, -10598, -16233, -17255, -34370, -48962, -5207, -6100, -20848, -34098, -23218, -12877, -7241, -26836, -33713, -9569, 1089, 8183, -2644, -31547, -18857, -27847, -8954, -25972, -15249, 19418, 5977, -11784, -16005, -23845, 4040, 13439, 2576, 7863, 26815, 2782, -8575, -84, 46936, 46372, 7885, -33668, -48861, -55313, -48039, -13303, 10272, -1497, 506, -7230, -35969, -52489, -32674, -17247, -39185, -61806, -49259, -32841, -11204, 2297, 847, -3227, 3079, 2409, -11050, -8210, -2952]
16614b952K3672k0737j9156P405N919M933j4457j1536K6858K3602k5606k7115
16602b9170M359J2972m287N796m201k907L4235l437l585k1416q465m411j0453
16589c4970M7215J3753k6432k3458l469O324O69Q132K6883j8983j0518r267j09
16576b4230j8338l7885J4994M8398K5627M336j8277k0053J1088O099K1536K5431
16564C8726P94P95j8809o6268k8535L2736L6161q254j0341J2702P133J5358l858
16551H340J2700M551k1886o081N890m625J2982j4448j3099R859K3277j6598j9319
16538a8457K0094M418j2666j1224j5613P972j6165L1833L83j9367o001K4500p616
16525a7909j1614k1067K87K9267J8765J8713J7956l636m286q949l7229P97o726
$$ y = [-2952, 20720, -17, -19173, -11768, -5849, -916, -15373, -26909, -51, 23551, -2055, -29170, -24811, -11839, -16126, -10330, -14531, -17438, 16797, 13360, 9775, -11641, -20106, -24517, -34970, 12245, 25998, -434, -23892, -27361, -21037, -20368, -12236, 14647, -4336, -14854, -24121, -24230, -42568, -80453, -65459, -17061, 8566, 12902, -5375, -25428, -14340, -8241, 13295, 38726, 39520, 40315, 21506, -44762, -73297, -40561, -4400, -12654, -22995, -10293, -3160, 12198, 8340, 21040, 25591, 3705, -2376, 3514, -1111, 11871, -2577, -15676, -5817, 17460, 862, -18457, 1637, 6055, -6611, -17835, -33448, -25476, -41641, -9808, -9425, -28792, -34793, -10293, -17909, -29523, -50590, -50303, -21036, -2271, 16442, 34398, 30762, 26476, 17527, -19702, -18905, -25631]
16512b5631q641L185K9032J2535l831K2659J1441K2845J302L687k6277k7283k1117
16499f094J3104K7043J748k1582k9410j881K1210J7705k0930l2705p568Q394K4450
16486f516L852j32L0735J3627p811n1869r360K1295K2396L2979L5125J2705K1272
16473A18298j3467j9131J0861M1519M6958P3544M3120N9775P6172P5565K4684
16462E37898J5745J5462k6269o6768q7420r6473o9817l7189n2259m0730l7413
16451E4767l17j8658k4833J2966K7609l3018k0623q587j3910j2090k825M0573
16439A054j3254J1072K274j7492j0470J9821J3470k526m9862k5007Q990J3889
16427d8041K3474J5112m814J0284K1907j8105l6629r780J704j4371p44K7259J8046
$$ y = [-25631, -34272, -31087, -2055, 10480, 6649, 29308, 40749, 63594, 64896, 68583, 42306, 15023, -6094, 7010, 34053, 35801, 14219, -15191, -17072, 4138, 21843, 913, -31792, -39360, -30966, -6516, -2664, -2796, 27939, 41566, 33755, -18114, -27474, -6179, 16217, 49196, 84321, 97026, 118298, 104831, 85700, 96561, 138080, 185038, 258582, 301702, 361477, 437649, 513214, 537898, 553643, 569105, 542836, 476068, 388648, 292175, 222358, 185169, 132910, 92180, 54767, 54450, 35792, 10959, 23925, 51534, 18516, -2107, -10694, -24604, -36694, -39519, 1054, -12200, -1128, 1146, -16346, -26816, -6995, 6475, 3949, -45913, -70920, -61930, -48041, -24567, -9455, -14269, -3985, 17922, -183, -36812, -46592, -44888, -59259, -60003, -32744, -14698]
16414a4698J7491L0878R83J0055n460p322j0459q748l1689o387J3599j907L6958
16401B3294j5121n834J675n042M60J2429k0264k7065m888J6970P85J4463j4876
16388b3014j276J7602r199j357L6962q447j6105m637l4164J4494L3510J660R852
16375A5881Q949k0832K0625K043q009j7161q078k1770k1169L4630J0819j4578
16363a8650J4738L12j85M023L254m436m017j3582m92n149l6740K4725J2527Q562
16349a5110J525j1606j8952k9194j329Q838K2377K8732J2047J3179K1200j9239
16337A2468k7319Q749j1409J4471N292k9612J612k841L134k251J6263P049O857
16324B463k2449J541L4089L5712j9322n0646k402K0127L1624J8391M51N373J1496
$$ y = [-14698, 2793, 33671, 34654, 44709, 39249, 31927, 21468, 12720, -18969, -25356, -11757, -13664, 23294, 8173, 2339, 4014, -1028, -568, 11861, -8403, -35468, -40356, -23386, -22601, -8138, -23014, -24290, -6688, -15887, -17244, 19718, 11271, -4834, -9471, -43635, -29141, 4369, 6029, 15881, 24830, 3998, 24623, 26666, 18657, 1496, -6582, -28352, -49521, -14891, -4072, -18650, -3912, -3600, -3785, 238, 3492, -944, -4961, -18543, -19035, -24184, -60924, -36199, -23672, -15110, -13585, -25191, -44143, -73337, -74666, -65828, -43451, -14719, -2672, 10507, 31707, 12468, -14851, -6102, -17511, -3040, 2252, -27360, -25748, -28589, -25455, -27706, -11443, -4394, 2463, -19986, -18445, 15644, 51356, 32034, -18612, -21014, -887, 30737, 49128, 49579, 54952, 66448]
16311F6448l0373k0102K1045j0838J892j3767p446o754J2238J4228j3576P361
16299B0356K8037l836k0326q392K1709K1922l0488m4401k556J2775l163j8630
16287b6993k4570J4049L3999M184M775L1603L65j1385l222J5696L060Q232J542
16274E1335k852j3160k989l4973Q516Q300N380L413k5894O060K9852j8529k8043
16261a3584k2678J9332o733j6496j038n234R493j1232o771j0562J6150K5844J9830
16248c679r16k1047m95k2712j2915L6787M7019L3571k4991k1895J8384k5372l6586
16235c4847Q580j0895O85L2434Q223j0570j0694J5491J2573r431J8497K0988o943
16222C4091l455j3313O024J5467l4287k3999k9991k0060M998K4397K130K613R235
$$ y = [66448, 36075, 15973, 37018, 26180, 28072, 14305, 6859, 105, 12343, 26571, 12995, 20356, 48393, 44557, 24231, 15839, 37548, 59470, 28982, -15419, -17975, -5200, -8363, -26993, -51563, -37514, -3515, 669, 5444, 37047, 37412, 26027, 22805, 38501, 41561, 49793, 51335, 48483, 35323, 32334, -2639, 5877, 14177, 19557, 22970, -2924, 3136, 32988, 14459, -13584, -36262, -16930, -23663, -40159, -41197, -46431, -36938, -48170, -54941, -65503, -49353, -23509, -3679, -4595, -25642, -26137, -48849, -61764, -24977, 22042, 55613, 30622, 8727, 27111, 1739, -34847, -26267, -37162, -36477, -4043, 4180, -6390, -17084, -1593, 10980, 1549, 20046, 41034, 34091, 30636, 17323, 23347, 38814, 4527, -19472, -49463, -69523, -64525, -40128, -37998, -35385, -26150]
16209b6150k2281L275P909k748j5645R649M383J9359M411k5686j0792L2520O564
16196a5232l153o901j5516J512J6608K6509N821j7595l1992j3702M0923J8149
16184E431K41j7522P162J6585J0256q162j8228r634J0242k1382k4761R907K1162
16171a8703K6733M777l537j9969N691J5314J3677l2188k5222K3990M5060P88o798
16158B9613k5040k3651J9353j6429r344L856L2727j4549m0688j6343K1073k905
16146d2327J128k1056J416j368N698P564K4559J0877K5478P162J6524K7091J185
16133F3931m7583o843j175l0225o50k7198L452N0269J4146k7727j2783k72J199
16120b1459Q054j238o503j2011J7948r904J2174L151n490j762q572j1370J4028
$$ y = [-26150, -48431, -45156, -37247, -39995, -55640, -45991, -41608, -22249, -17838, -43524, -54316, -21796, -15232, -18385, -25286, -40802, -39290, -22682, 3827, 9648, -7947, -39939, -53641, -12718, 5431, 5672, -11850, -4688, 11897, 22153, 13991, -4237, -13871, -3629, -25011, -49772, -39865, -18703, 8030, 12807, 9270, -10699, -5008, 10306, 23983, -8205, -33427, -9437, 35623, 36411, 29613, 4573, -19078, 275, -16154, -25498, -21642, 11085, -3464, -44152, -60495, -39422, -42327, -41199, -62255, -60839, -62207, -56509, -48945, -24386, -13509, 11969, 19131, 35655, 62746, 63931, 16348, 9505, 8330, -21895, -22545, -49743, -46291, 3978, 18124, -9603, -22386, -22658, -21459, -13405, -14643, -21146, -33157, -15209, -25113, -12939, -9788, -15278, -17040, -25612, -36982, -22954]
16107b2954K0092P255L578j3231l3506m307J1995p803l1841Q81J8963J9281L4033
16094B436k3260k0337K1718M3174Q510j6586k2666j7991j090P086l0914P43L0043
16081a9134K7057k4375j7633J2398L4826J6324j4565k6763j8661j6076J6616K1513
16069h473j9540Q205K7486K9161o865k0500m7522q71R789j4949P96K260j1091
16056e2114n392K7017m033p566J2985o750j287K2420K846K4502J5126q579J1010
16043C0185o058J8440m563j857J3225k8157j5993j3713P055K5590Q115j1880k5579
16030e190j3972O770j0825l7067P151L3931K5931j8179p799J6118R18o654N987
16017b880k0774j7379j7235J5627L3038J0577k3068j6219p072p188P635M2699
$$ y = [-22954, -2862, 4393, 7971, -5260, -38766, -43073, -31078, -38881, -70722, -69841, -50878, -31597, 2436, -20824, -41161, -19443, 23731, 32241, 15655, -7011, -25002, -26092, -19006, -49920, -49177, -19134, 7923, -16452, -34085, -21687, 13139, 29463, 14898, -11865, -30526, -46602, -29986, -8473, -28013, -19808, 7678, 36839, 29974, 9474, -38048, -38919, -29130, -44079, -43283, -41023, -52114, -57506, -30489, -34522, -42088, -29103, -35853, -37140, -14720, -11874, 12628, 27754, 19175, 30185, 24127, 42567, 38004, 36147, 49372, 21215, 5222, -8491, -1436, 24154, 32269, 20389, -5190, -19162, -12392, -23217, -60284, -53133, -19202, 6729, -11450, -19249, -3131, -2213, -8867, -2880, -23654, -41033, -58268, -42641, -9603, 974, -22094, -38313, -45385, -52573, -44938, -2239]
16005b239J6604j3495k3927J0116k8396j948L1920K8167P222q125k2285l97J6172
15992I389J1862J2683q107j1925j1014j3399l2145k8204r929m25K1166J6047N350
15979c8651J0981P853j972O660q218l335J3249K3193K0177O505m2241j0152K032
15966a3919O725o299M609K0713J5825j1406j5178k0915J1369M734o749k5216j570
15953c7277k844p748K0327J6733L1322R890j8169k4439k8122k501j8504k6269
15941h7601J6115j793O818J4771O534j0183k353J7539j8828j467j77l083j574
15928f5282K3616J3385k6262k1024K8662K5916p072m515j6127J0150K8086l871
15916a4338j1697l8745R822K4105P655O099o86k6381k8904K9986K2354K6566J7590
$$ y = [-2239, 14365, 870, -23057, -12941, -41337, -43285, -11365, 16802, 24024, 15899, -6386, -6783, 9389, 21251, 33934, 25827, 13902, 2888, -10511, -42656, -70860, -80789, -81214, -60048, -44001, -38651, -27670, -19817, -21789, -15129, -23347, -26682, -13433, 9760, 29937, 36442, -5799, -15951, -13919, -7194, -13493, -8884, 11829, 27654, 16248, 1070, -19845, -8476, -3742, -10491, -35707, -37277, -40121, -47869, -27542, -10809, 20513, 30403, 12234, -12205, -40327, -42828, -61332, -87601, -71486, -73279, -66461, -51690, -45156, -55339, -57692, -40153, -58981, -60448, -60625, -63708, -65282, -41666, -28281, -54543, -75567, -46905, -20989, -28061, -32576, -48703, -38553, -10467, -14338, -26035, -64780, -54958, -30853, -23198, -17099, -17785, -44166, -73070, -43084, -20730, 5836, 23426]
15903B3426l7518q627M2451k362j2845R848j0222R430l615j7235J2911k9485k0643
15890d4486Q522M2383K2510k3145p667P418k5990j5550j3774l5578K0174J2190
15878e2993l465R766J6572k4544N469P553M692O263Q275K0971r296N94m657P92
15864a4008q581R950k122j2265J9540O959j0543P776m376J755J9935J0496k7024
15851b508k7116J794J4316j7228L351J5861k663j8794o51K5840j7362r993O561
15838b8592k644L6550j4014k2610j5710L1823N160m27l574k8815K048L559J1880
15825b5366Q980K8982O058k711l4773k227J7823J6522l1095j971J6219j1471R458
15812e572Q211J7577j1637l585j6888m769j1157k0225J125m943J6092J5249L566
$$ y = [23426, -14092, -22719, 19732, 17370, 4525, 14373, 4151, 13581, 9966, -7269, 5642, -23843, -44486, -35964, 6419, 28929, 5784, -1883, 5535, -20455, -36005, -49779, -85357, -65183, -52993, -56458, -46692, -30120, -54664, -49195, -41642, -36950, -30687, -22412, -1441, -10737, -10143, -14800, -14008, -22589, -12639, -14761, -27026, -7486, -527, -11070, -3294, -7670, -5915, 14020, 24516, -2508, -29624, -27830, -13514, -30742, -27391, -11530, -14193, -32987, -33638, -7798, -25160, -35153, -28592, -31236, 5314, -8700, -31310, -47020, -15197, -10037, -10464, -14038, -42853, -40805, -37246, -25366, -16386, 12596, 18654, 15943, -18830, -21057, -3234, 13288, -17807, -19778, -3559, -15030, -5572, 2639, 20216, 8579, 4994, -11894, -16663, -27820, -48045, -46920, -51863, -35771, -20522, -16956]
15799a6956J3767j1057j1600N507P112R535M0376J1535k7189k2611q673j9300
15787b9554k0405L0238K146J1924J1645K661M333j9270m7446M2241K7964j3940
15775B537r90j283Q780j6708p053K3147J2965r009j9533P314p140r278J0326j410
15761g335j6900q001M758K1908k31J0343K9691M0214m54o851j6153n689k2401
15748B2899k3292J4805j0707j1751q691n079M103J9285K3940J1151k0163j9418
15736b918Q19j6718j373j3K7073J9473O306J1407J2520j9442j1585j2398j5772
15723b621j7781k4831k1050j5733l5272K4589J3673L9200M9825J1604q294j9842
15711f533o513L3904o005j7278j2442K209K3191O329l1139l1823k1323K0726R90
$$ y = [-16956, -3189, -14246, -25846, -20339, -13227, -3692, 36684, 48219, 21030, -1581, -10254, -29554, -49959, -19721, -17575, -5651, 5994, 8655, 12988, -6282, -53728, -11487, 16477, 2537, 1547, 264, 9044, -7664, -14717, 8430, 21395, 12386, -7147, 167, -6973, -16251, -5925, -7335, -24235, -32236, -27478, -5570, -5801, 4542, 34233, 74447, 73993, 67142, 50989, 45300, 22899, -393, 14412, 3705, -8046, -16737, -21816, -17713, 1572, 25512, 36663, 16500, -2918, -2099, -18817, -20190, -20203, 6870, 26343, 32649, 44056, 56576, 37134, 25549, 13151, -2621, -20402, -45233, -66283, -82016, -117288, -92699, -79026, -39826, 9999, 21603, 13309, -6533, -13046, 20858, 14853, -2425, -14867, -12658, 10533, 16862, -14277, -46100, -67423, -46697, -45707]
15698d5707K9068J8869j8253k527K2663K2827J7241N581Q513j1169j7716j4947
15686A4443j5643p50K4195J0220J26K724J3473Q345k3812j2448k4187q600p609
15673a9523L008l534k613L317Q04K7500K1619k1557j1840k1072j4128K0452L2053
15660A4486J2787l0141j5481J3086n460k857J9590j5991J8820j2438j1383r540
15648b4522J2174J7125j0649j2044k4382k0449R692M2917R631k4755p910m547
15636c7719J2962L4922O565R534k33j1422L507P148P000m224m722L7507K8609
15623H9434j8676l5624j7696o413o441j729L8843K6947k4211j7962j9886l1150
15611b4564N818L1454J0002m279k3160r476Q678K4037K2132N706m513m1803j4349
$$ y = [-45707, -16639, 2230, -16023, -18550, 4113, 26940, 44181, 49762, 58275, 47106, 29390, 14443, -1200, -1950, 22245, 32465, 32591, 35315, 48788, 57133, 33321, 20873, -3314, -11914, -19523, -16515, -20049, -22662, -19345, -18541, 8959, 30578, 9021, -2819, -23891, -38019, -17567, 14486, 27273, -2868, -18349, -5263, -10723, -13580, 6010, -9981, 8839, -3599, -14982, -24522, -12348, 4777, -5872, -17916, -42298, -62747, -53055, -10138, -507, -25262, -33172, -37719, -24757, 10165, 16730, 26264, 26031, 14609, 18116, 25264, 32264, 28040, 23318, 60825, 89434, 70758, 35134, 17438, 11025, 4584, 2855, 41698, 68645, 44434, 26472, 6586, -24564, -18746, 12708, 22710, 18431, -4729, -14205, -5527, 18510, 40642, 46348, 41835, 32, -14317]
15598a4317r542n15L3077K4505j0864J041q399J522j798j6987k04J9686J7831
15585C5036P196m521j0010Q613R858o906p326q747j0323J5052j5750j0968j5731
15572a4527P972J6129R185j2648O9j1085k65Q074P028j3918M188k5083J6671l443
15558a1653o476N560j3555P255j0128Q729P256k0811Q556L5560L5058J1356L80
15545E7087j9018j0136m573Q307p659k0960J1328J9051j365j1713j930Q61Q481
15532B7761J0887r711r298J0735J2093o391j475n181k0245k2632J1573K3222p223
15519A4115J818l0325N490J9123J4277j7639M103k0108k6046M090n190J253J0009
15506b5030J2239N581k204j529J0222o52J0924M2054M1522n429l2025J1412j0067
$$ y = [-14317, -23859, -24374, 8703, 33208, 22344, 23385, 14986, 16508, 14710, -2277, -2481, 17205, 35036, 42232, 37711, 27701, 36314, 46172, 39266, 31940, 23193, 12870, 27922, 12172, 1204, -14527, -6555, 9574, 18759, 6111, 6180, -4905, -5170, 2904, 9932, -3986, 202, -24881, -8210, -11653, -18129, -12569, -26124, -18869, -28997, -20268, -13012, -33823, -25267, 10293, 45351, 56707, 57087, 38069, 27933, 23360, 31667, 24008, 3048, 14376, 33427, 32062, 20349, 18419, 19280, 27761, 38648, 28937, 19639, 30374, 42467, 36076, 34601, 29420, 9175, -13457, -1884, 21338, 14115, 15933, -14392, -8902, 10221, 24498, 6859, 10962, -9146, -35192, -31102, -36292, -35039, -25030, -12791, -7210, -9414, -10943, -721, -1373, 9551, 51605, 93127, 87698, 55673, 67085, 57018]
15493E7018j3740p483j9446M601L258k2052R04L3930p633J505J4806J2999p770
15480E0897O31k3977k1543J6566o410r824K7462K4016j6654o0245P8M4417M0391
15467F5805Q838R58J4393j6780l7158k1366R959M939K468j6895j1743j6341q00
15454a3723O826Q246N980N031K9134K8701N259j1515k4134l347P740k118m944
15441C7136J2687K5511j4305l9017j7438J9083J2547K8505k0889l1586L6610K2058
15429G0902k8524k4114M338j5490p196J9603j697k8147J5542K1484O603L353k4185
15416A2472k989L3730Q735J6678k9725k4939K2609L1798j3080k6126K433J1314
15404D2910k1032N699k61N393L3430M1147N005k4951l0550J953p127k0127J0990
$$ y = [57018, 43278, 35795, 16349, 20950, 24208, 2156, 3060, 36990, 29357, 30862, 45668, 58667, 50897, 51528, 27551, 6008, 22574, 16164, 6340, 33802, 57818, 41164, -19081, -19003, 25414, 65805, 74643, 75601, 89994, 73214, 36056, 14690, 24649, 29588, 32056, 15161, 3418, -12923, -13723, -6897, 1349, 7329, 12360, 41494, 70195, 75454, 63939, 39805, 36458, 44198, 42080, 37136, 49823, 75334, 61029, 22012, 4574, 23657, 36204, 64709, 43820, 12234, 48844, 70902, 42378, 18264, 22602, 7112, -84, 19519, 17822, -10325, 5217, 26701, 33304, 36657, 12472, 9483, 43213, 51948, 68626, 38901, 13962, 36571, 68369, 55289, 29163, 31596, 42910, 21878, 27577, 27316, 32709, 66139, 107286, 112291, 87340, 56790, 58743, 51616, 31489, 42479]
15391D2479K509O214j125o0J4551j3383N62k7626j7735m931N770J0639K24J6033
15377C4121K1398O822k1673k922j1801K428j742J8748R613j0638k5214j0193J5217
15364B4164N753J7491N051k4835q28j3679l9283O098N7374L1575j5802j9400J9101
15351E2780J621j9893j357j5101J7747L800k2946K1401J6390P560J3891J8048
15339I3941j3104n2008j6531M7538K8554k2614j6459n525M8066m250l2954l614
15327E1040m598j2338k181J8576K6396J3559j1856j0521J4012Q238j2693r460
15315F8174k5047L543K5857j2010p910J0848r57p668k2500K1696J1618k3400k513
15302C9731J7856L2746j6491j4959j6334J8632P77p799l9434R602J2731J2954
$$ y = [42479, 44988, 51202, 50077, 50017, 64568, 51185, 51747, 24121, 6386, 1455, 7225, 17864, 18088, 34121, 55519, 62341, 40668, 37746, 25945, 28373, 26631, 45379, 54992, 44354, 19140, 8947, 24164, 29917, 47408, 52459, 27624, 26796, 13117, -26166, -20068, 37306, 68881, 53079, 33679, 52780, 54401, 34508, 33151, 18050, 35797, 39597, 16651, 38052, 54442, 62002, 75893, 93941, 80837, 28829, 12298, 59836, 88390, 65776, 49317, 43792, 91858, 87608, 54654, 51040, 46442, 34104, 31923, 50499, 76895, 90454, 78598, 68077, 82089, 90327, 77634, 68174, 43127, 46670, 72527, 60517, 52607, 63455, 62498, 54830, 32330, 54026, 65644, 42244, 39731, 57587, 90333, 73842, 58883, 42549, 61181, 61958, 54159, 14725, 24327, 37058, 50012]
15290E0012J5605j2419J536j2508J2042M3640K9016n72K314k286j71j3959j145
15277A11105l9183j1973j671O937K2291j7987N73R000J4059l195K2892J1660m953
15264A19555k4867J0436n743j7596K5518j6089p016J0168N782j6376n090j9810
15252E8872n352O861k6145J1061M2702J6246k5225k4903N983k000K9469L7836
15240A25405J9554j3181k3018l8418l723K0604K406j5459m538K0255J0788j8855
15228H1820o129l3854k2780J8429K4841K8159J4505j8184K3842P40j6574l18J7031
15215A11528K9690j4506j9070k640n425p266k312r173L512J1755Q481k1617l0174
15202E2783j459J205J7634j0383l8794P95K6437J5211n718k0215K791m209P107
$$ y = [50012, 65617, 53198, 54734, 42226, 54268, 97908, 126924, 126352, 128666, 126380, 126209, 112250, 111105, 71922, 59949, 58278, 65215, 87506, 69519, 70092, 79092, 93151, 89956, 112848, 124508, 119555, 94688, 105124, 99381, 81785, 107303, 91214, 84198, 94366, 100148, 83772, 78682, 58872, 53520, 60381, 34236, 45297, 87999, 104245, 79020, 54117, 60100, 58100, 87569, 125405, 144959, 131778, 108760, 70342, 66619, 87223, 89629, 74170, 69632, 89887, 100675, 81820, 75691, 41837, 19057, 37486, 62327, 90486, 104991, 86807, 110649, 111389, 94815, 94497, 111528, 141218, 126712, 107642, 105002, 99577, 92311, 89999, 80826, 84338, 96093, 104574, 82957, 52783, 51324, 52529, 70163, 59780, 20986, 21781, 48218, 63429, 57711, 37496, 40287, 36078, 43185]
15189D3185K70l047J1837j0494J7536J620k0384J4306J0120j8165N460J2879J7888
15176H3011K5906j0182R154J2363p278l5326k422R533j8158k17J0881J9048j9174
15163G7139j471J617R220K8999M3125j7520m8094n2923j1531l297L849K9154L0375
15150H8642Q714j579J9881j6978J1388L8139k6706m1314o359j200r622J626L724
15137F8356Q817R89j6884k1238k860n985k680P693J2487j7285K3655K3601k592
15124G6074k0692K5850L6347j9269Q61P247k9157l2836p070K5384K4920k1460
15112F6199j8918N792O586r917O493Q851k1160k6516J7466j6430k294L007M102
15099B3261J8279J3499r346o959K0634J0718l336k0863p704J6743J4834R204P39
$$ y = [43185, 43455, 40408, 52245, 41751, 59287, 60907, 40523, 54829, 64949, 46784, 52244, 65123, 83011, 108917, 98735, 107889, 120252, 112974, 77648, 75226, 84759, 66601, 66384, 77265, 96313, 77139, 75668, 77285, 86505, 115504, 158629, 141109, 93015, 40092, 28561, 25264, 29113, 58267, 88642, 97356, 95777, 115658, 98680, 110068, 148207, 121501, 80187, 73828, 72628, 63006, 64632, 68356, 77173, 78162, 61278, 40040, 37180, 31195, 28515, 36208, 48695, 31410, 55065, 78666, 76074, 55382, 81232, 117579, 98310, 99171, 106418, 77261, 44425, 37355, 62739, 87659, 66199, 47281, 53073, 59659, 49742, 56235, 65086, 43926, 17410, 34876, 18446, 16152, 19159, 23261, 41540, 55039, 45693, 38734, 59368, 70086, 66750, 45887, 38183, 54926, 69760, 78964, 79703]
15086G9703K591j017k8255K9652J5639j8426k6886K1445K7044J7804l6919k6200
15074E6175K5887K21l977r980R222J9994J4309K666m3084n7249O878J558J7505
15061D0125M7797O627m987j4448j8461k9711J3574J6132J9296R505r12K419k665
15048H4291M1232p813r707L2900M0208m05j1450p408r427j9691k5649Q713K554
15035A18348m0715k7394K2019L0098J4799n333j8089l3364j4346k8634K0029K077
15023C9495L1956J0359n511P598n852j6829P278j984M614J1203Ol797l3213k917
15009D2406J7550M2534K2002j4326k3186k5982J6080j050j8182k1018j3239J8449
14997D2038J7018J155M352k1626l578P531J7174K2885R055j557K7927n508j3319
$$ y = [79703, 82294, 81277, 53022, 82674, 98313, 79887, 53001, 74446, 101490, 119294, 82375, 56175, 82062, 82283, 78306, 68326, 77548, 97542, 111851, 114517, 71433, 14184, 21062, 22620, 40125, 87922, 94549, 89562, 75114, 56653, 26942, 40516, 56648, 75944, 85449, 84537, 86956, 84291, 125523, 117710, 108003, 140903, 181111, 180706, 169256, 161848, 152421, 132730, 107081, 115794, 118348, 77633, 50239, 72258, 102356, 117155, 111822, 93733, 60369, 46023, 17389, 37418, 39495, 71451, 81810, 76299, 83897, 78045, 61216, 68494, 66510, 71124, 82327, 82333, 78536, 45323, 42406, 59956, 102490, 124492, 110166, 86980, 60998, 77078, 76028, 57846, 36828, 23589, 42038, 59056, 60211, 64563, 42937, 39359, 46890, 64064, 86949, 96004, 94447, 122374, 116866, 103547]
14984A03547k2709j5696K5182j2628N305l864j4442j0657j1429M9146K8054k7244
14972I2565n386P874K7806j571k8496j5259p666j1853j017p201N315K0964J0547
14959H6622j2864k0018k70L2186K1414l3732k0318K2434L3096L15N993Q419p281
14946A15996k4954M014J4130N210Q540j8515j9860j1118J0083j4284O569N349
14934H1160j9891j1922K8079L6633K4859j2012l0021l910j6874m545j1424k5817
14922C4315J4537K3929q345K102K814J8688K6271j1400n084N079k1731j3215k2409
14909D5551l5804L5530M2224K049j2082j5409J1345n539O790O25N184l146q126
14896F9192Q959J0173j4769K295J1438J0024j0745n152L8582K8370P161j8869
$$ y = [103547, 80838, 65142, 90324, 77696, 83001, 79137, 64695, 54038, 42609, 91755, 119809, 92565, 87179, 95053, 122859, 121288, 92792, 77533, 69867, 58014, 56997, 49796, 55111, 76075, 86622, 73758, 53740, 53470, 85656, 107070, 73338, 53020, 75454, 108550, 108865, 114858, 123277, 115996, 91042, 95056, 109186, 114396, 122936, 104421, 84561, 73443, 83526, 69242, 75811, 81160, 61269, 49347, 77426, 114059, 138918, 126906, 96885, 92975, 76101, 71556, 60132, 34315, 48852, 72781, 64436, 66538, 69352, 88040, 114311, 102911, 97827, 102906, 81175, 67960, 45551, 9747, 45277, 87501, 89550, 77468, 62059, 73404, 67865, 74655, 75280, 80464, 77318, 69192, 78151, 88324, 73555, 75850, 87288, 97312, 86567, 81415, 119997, 148367, 155528, 136659]
14884A36659k6302j0092l6262k6312K8035J5553M085K0079K3149l9963l3376J2153
14872F7406M064l3513P385L1337K7348j3747l1040j5403J4664J8026q733l3228
14860C4566j2327R786J3873L27j4M8344J717l0932J3639m019j073J0736j7423
14847F7200K3573K7359l563j0768j7115N557m737J5853p134P970k4393K034j1096
14834G0740j3388O281K9351l96k5757k0955J6892Q168K5264j274j0190k2530m808
14821E7398k2500l417J5611l394J2349j3675q029J5078N718K1426j7398J1604
14809G0771N400J094k3958L435K0908M696Q409k4393k9982K5752M0599l4k6895
14796G5802r312m421J3437j368k3915n931j2749K4262R747j8309k4252Q036N886
$$ y = [136659, 110357, 100265, 64003, 37691, 65726, 81279, 85364, 105443, 128592, 88629, 55253, 67406, 71470, 37957, 45342, 76679, 104027, 90280, 59240, 43837, 58501, 76527, 67794, 34566, 22239, 32025, 45898, 46225, 46211, 94555, 96272, 65340, 78979, 74960, 73887, 84623, 67200, 90773, 118132, 114569, 103801, 86686, 92243, 87506, 103359, 96225, 104195, 79802, 81836, 70740, 57352, 63633, 92984, 92588, 66831, 45876, 62768, 70936, 96200, 94926, 84736, 62206, 57398, 34898, 31481, 47092, 43698, 56047, 42372, 34343, 49421, 55139, 76565, 59167, 70771, 76171, 77265, 53307, 56742, 77650, 82346, 90755, 66362, 36380, 62132, 102731, 102697, 75802, 66490, 62069, 75506, 74138, 50223, 44292, 31543, 55805, 65552, 47243, 22991, 31027, 36913]
14783C6913l120L125K7191L1122j8139k6115k0247j6490N668M8945j3024j8214
14771C7615j6260j022j1132r671k338m509P720L1799J4919j7073P089Q223R160
14758E4520p819K1362j5549j9340J2673J7259r191l241R422m812o139O367N703
14745F1215n822k7287j0583j8309R197Q468j5628L2130j2900k4678J8408R37J3418
14732B8566J4072j2989o339j9466R571L7093k4789k2792J0110K176m280k9745
14720a8812J0429K3258l141K1342r847J4379o852k1575j9829J358K8295k494J362
14707A7873J0108Q538l307K915k0352l0177q309J7436K0366K2223J4947J1929
14695F4190j5591J0462k7428r833o245J0015J6388N171p621j7450O529Q986M588
$$ y = [36913, 33793, 36918, 64109, 95231, 77092, 50977, 30730, 14240, 19908, 68853, 55829, 37615, 21355, 20333, 9201, -470, -2808, -7317, 403, 32202, 47121, 30048, 37137, 45360, 54520, 46701, 68063, 52514, 33174, 45847, 63106, 53915, 50674, 60096, 55284, 49145, 55512, 61215, 55393, 28106, 17523, -786, 8411, 16879, 1251, 33381, 20481, -4197, 14211, 15148, 28566, 42638, 29649, 23310, 3844, 13415, 50508, 25719, 2927, 13037, 15213, 10933, -18812, -8383, 14875, 11734, 33076, 23229, 37608, 30756, 9181, -10648, -9290, 19005, 16511, 17873, 27981, 36519, 33212, 36127, 15775, -14402, -22711, -5275, 15091, 37314, 52261, 64190, 48599, 59061, 31633, 21800, 15555, 25570, 41958, 47129, 39508, 22058, 28587, 37573, 42161]
14682D2161J408k2635l303j4474K2502J3906k7777j3256R704J1497J6985N43j404
14669C5857j2349j1667n290k7882J4499L5877p708j3959L353k27K9201K0973J8667
14656G9345J399J4778k369j0240k0788j4630P377j9064n425k2468k3000R514N551
14643b0J7801r787r461J678L833J7736l815J7636R947j000J2310j6053k4205J7594
14629C4194n25n053J1240j1531J920j2080j0137O142j8877J315P431M0064n692
14616C8411k8462j316J4362K1197j6876j5250R001J3570J8135J0624L063k3065
14604D3394J3975J967o683j1094l482J0240j1987P34N508m623j4151K7849L3003
14591H4650J1659j0819k1696l4678m2726k8522j29J7789j092J7580O59O042M644
$$ y = [42161, 43569, 20934, 17631, 3157, 25659, 39565, 11788, -1468, 8236, 19733, 36718, 37261, 35857, 23508, 11841, 6551, -21331, -6832, 29045, 21337, 7378, 10731, 10504, 39705, 60678, 79345, 80744, 95522, 93153, 82913, 62125, 47495, 54872, 35808, 30383, 7915, -15085, -5571, -20, 17781, 7994, -1467, 211, 4044, 21780, 17965, 35601, 45548, 44548, 56858, 40805, 16600, 34194, 33669, 28616, 39856, 28325, 30245, 18165, 8028, 14170, -4707, -3392, 4039, 44103, 38411, 9949, 8633, 22995, 44192, 27316, 12066, 21067, 34637, 52772, 63396, 66459, 43394, 57369, 59336, 52653, 41559, 38077, 48317, 36330, 37064, 42572, 37949, 23798, 51647, 84650, 96309, 85490, 63794, 29116, -13610, -42132, -42261, -24472, -25564, -7984, -7325, -1283, 3361]
14578C361J1064j4731k2816J9265L4093n745k6469k1391l1411L477M0631L9437
14566B8765n411L854j5843j865J3043l287m410L501L3267K1259R265j1752l7821
14553C2565j9570k346k923J0270N801j3319o4N755J1536P315Q327k0255o916J96
14539A6372O558J2129k1838m6133m445N0947R586l086P608j0742J2627j9787m7539
14526c7743K4504K7034o71J9347k851j1180Q806J4952j1074l0934j6022J0397
14514e435r361j883J3304j631J5846j9175l573K5769k83l198p739L5892J8395
14501E6928p241l2636Q222N687k5181j1109Q384l46O602q732M99j1492K919J5546
14487H050J9988N846j9976k4765j260l2199o038J2172K7517n11o404J4017k474
$$ y = [3361, 14425, -306, -23122, -3857, 30236, 24491, -1978, -23369, -54780, -51303, -10672, 28765, 23354, 27208, 11365, 9500, 22543, 19256, 14846, 18347, 51614, 72873, 82138, 70386, 32565, 12995, 10649, 7726, 17996, 23797, 10478, 10414, 16169, 27705, 35020, 43347, 23092, 16176, 16372, 22930, 35059, 13221, -32912, -37357, 13590, 23176, 20090, 27698, 16956, 29583, 9796, -37743, -13239, 13795, 13124, 32471, 29620, 18440, 27246, 42198, 31124, 190, -15832, -5435, -14796, -16679, -3375, -5006, 10840, -8335, -11908, 13861, 13578, 10380, 2641, 38533, 56928, 49687, 17051, 25273, 30960, 5779, -5330, 3054, 2708, 9310, 578, 1077, -10415, -7496, 8050, 28038, 33884, 13908, -10857, -12117, -44316, -50354, -38182, -10665, -11176, -17580, -3563, -6037]
14474f037K1080J3937K5580j870P410K4317Q780m0653k3866l5406k3093k266L864
14461b8223N5691L4262j1080k1343j740n403K8567L944m2562K991n042j6821K9536
14448B2777J6785k7042k1199K7166K5121J7379k929k8674L257j7117O77J9049
14436C5250Q929M497k4849o044m891r56k1316j5936J1327R60l990J980o277P032
14422a4284l377Q744J6348J5926l2415o027J9938o469j5808l5374M8223N1815
14410D7240q021k0761k2163q510q223k5306L551L93k897L3395J9948k851j3189
14397g394L3816J8823j9863m3966k2915j1624r90R703o689k3649K0897J2669P848
14384c3334J2810K7170K3289J3864R192K275k3969o782j1105p462j3018p48J4569
$$ y = [-6037, 15043, 28980, 54560, 52690, 60100, 84417, 93197, 52544, 28678, -6728, -29821, -32087, -28223, 27468, 61730, 50650, 29307, 27567, 22164, 50731, 54675, 12113, 15104, 10062, -6759, 22777, 39562, 12520, -8679, 18487, 43608, 60987, 58058, 29384, 32641, 15524, 16201, 35250, 44179, 48676, 23827, 17783, 12892, 11936, -9380, -25316, -13989, -13029, -17019, -15039, -21316, -14284, -17661, -8917, 7431, 23357, -9058, -15085, 4853, -1616, -17424, -52798, -4575, 47240, 39219, 18458, -3705, -12215, -20438, -45744, -42193, -41800, -44697, -11302, 8646, 5795, -7394, 26422, 45245, 25382, -18584, -41499, -53123, -54113, -44410, -51099, -74748, -53851, -41182, -33334, -20524, 6646, 29935, 43799, 52991, 55266, 31297, 24515, 13410, 5948, -7070, -7818, 6751]
14371F751j4659j6230K883J3675p373r944k0453J2885J5356J1109K4731n914J9354
14358C2171r050j7814l404j4418l4478Q305M1447J4673l0763j703J4817j0341
14346a0558Q068j0623k5707j2112K4573J3531j6992n106K1909k9740k0951j4476
14334g8184K7925k028K906K5724m072Q387j417J4593j2806J8049K3806j535j0403
14321A0945J198K0769J3196n22k9677k4359j2731N402o626p776k847J4910J3353
14308d765N230j9467r261L253j3434k725R321p809j5843L2161J9528J0096K6098
14295C2383m129K368m955m4703p385q963J289K5107P86j7199N809p149K2416Q441
14281D116l226k0108j1671J8135k822j3876K6983k395M188j5190j1922J3352k0936
$$ y = [6751, -7908, -24138, -21255, -7580, -14953, -24897, -45350, -32465, -17109, -6000, 18731, 12817, 32171, 23121, 5307, 1903, -12515, -46993, -38688, 2759, 17432, -13331, -15034, -217, -10558, -2490, -13113, -38820, -50932, -26359, -12828, -29820, -34926, -13017, -42757, -63708, -78184, -50259, -52287, -49381, -23657, -27729, -19342, -20759, -6166, -18972, -923, 22883, 21348, 10945, 12143, 32912, 46108, 45586, 15909, -8450, -21181, -15779, -22405, -30181, -33028, -18118, -4765, 465, -19002, -28263, -25010, -38444, -41169, -31848, -39657, -55500, -23339, -3811, 6285, 32383, 28254, 30622, 25667, -19036, -26421, -35384, -34095, -8988, -8202, -25401, -19592, -26741, -4325, 4116, 890, -19218, -30889, -12754, -15576, -29452, -2469, -4864, -676, -15866, -27788, -14436, -35372]
14268c5372m103J7532N898J4336J1449J1941p237k3516Q892Q349j5532m069J785
14255i647j2748r912p68k106j6721m17r911r891L7676L3058j6498q586K877j871
14241b5465j6700l234K6031J8930r491r508j7778j117Q265J3716p053k5921q690
14228e8015L8745k4506j5405K4983J230M531k171j4585R900L1650J6452Q666j5602
14215E873l5281j5545J9725J3235J1468n944k0906j4832K1636J921r132j7244
14203d5026J9201K0969k0299n95J8388j7237J0437K0860O989q154r596k5540k6196
14190e5799j9416P655J5333K2390J7158J0538l2016o353K8338K0457k5989l314
14178b1018k106j0100o078Q573j1398M005J4972o156J516j1610j920R115L6263
$$ y = [-35372, -39475, -21943, -16045, -1709, 9740, 21681, 14444, -9072, -180, 8169, -7363, -11432, -9647, -22395, -32307, -33075, -35181, -51902, -52319, -62230, -72121, -34445, -1387, -17885, -26471, -23594, -25465, -42165, -45399, -19368, -438, -9929, -19437, -37215, -38332, -30067, -16351, -23404, -49325, -58015, -19270, -43776, -59181, -34198, -32968, -28437, -30608, -45193, -35293, -3643, 12809, 21475, 5873, -29408, -44953, -25228, -11993, -525, -6469, -27375, -42207, -20571, -18650, -27782, -45026, -25825, -4856, -25155, -25750, -7362, -24599, -14162, 6698, 13687, 5533, -4063, -29603, -55799, -75215, -67560, -52227, -29837, -12679, -2141, -34157, -40510, -12172, 8285, -17704, -21018, -23124, -33224, -39302, -30729, -42127, -38122, -23150, -29306, -27790, -39400, -41320, -32205, 4058]
14165D058O634Q712K399j4047m6577p034L9926K9130p176l206L1380m4797l2209
14152c2807k535K1474J8280j3209k7168K976j078O94L5875J4712J2899j6243K010
14139A5880L1645k8019l4861k88n282J1686O117J1188j663J4264j2251k8108k5901
14126d5593Q206J580J6322m887j4022M538p76J6390K0888j9290j1085p821j5790
14113e1340O332L2840R146j1942k2070K3314o953r174M529J92j1513O935L9955
14100A0251J5470j1547n717L586q027N622J1021L0173J9007l3458k2227k4899
14088a0745L0859rl1367p794Q346Q190j8684L7668K1444k4927P48p283o943K1499
14074B1002r989l3761j3107K1480j3349J569P654r82K8010p067J4150K2362k3038
$$ y = [4058, 10692, 19404, 21803, 7756, -38821, -45855, -5929, 23201, 16025, 12819, 44199, -598, -32807, -35342, -13868, 4412, -8797, -35965, -32989, -34067, -33373, 2502, 17214, 30113, 13870, 15880, 47525, 19506, -15355, -15643, -20925, -9239, -3122, 8066, 6403, 20667, 8416, -19692, -45593, -37387, -35807, -19485, -24372, -38394, -33856, -34632, -18242, 2646, -16644, -27729, -35550, -51340, -45008, -12168, -3022, -14964, -37034, -13720, -20673, -29847, -25318, -25126, -36639, -29704, 10251, 25721, 14174, 8457, 12043, 4016, 9638, 20659, 50832, 69839, 36381, 14154, -10745, 20114, 20105, -11262, -19056, -10710, -2520, -21204, 16464, 37908, 12981, 13729, 6446, -497, 21002, 11013, -22748, -35855, -14375, -27724, -26155, -18501, -19483, 8527, 1460, 15610, 37972, 14934]
14061A4934L799K598m347j9791m886J0864j2879j3762k4883k605K4400J2310N678
14048h570O584k396L677L5619J5524K2393P848k1549k3032r691l370Q706J9316
14035E1059K2204j7226r389K3613j130l5864l909J3435N13j9981k955n0636j593
14022c1859K8250o870j1917l8996n597J1668J8567J7755J3118J7357M030k1062
14010e556m1746k9865K1076K2249j1768o871K2262K0104L267J3394j7817k1827
13998c3098L386r927k7128P285K2194K0099L6810k096l4345k0690J8732J2374
13986f404k3126k177N264J5473K7929j4316q738K669J1834Q977j2042m3343k4017
13973f2017K7237K5424j0077K5949K2454j1025O668j6235O923P283M533m3514
$$ y = [14934, 18733, 21331, 16984, -2807, -7693, 3171, -9708, -23470, -48353, -50958, -26558, -14248, -8570, -1986, -4382, -705, 34914, 50438, 72831, 80679, 59130, 36098, 26407, 23037, 31743, 51059, 73263, 56037, 46648, 70261, 69131, 33267, 29358, 42793, 43306, 23325, 20370, -30266, -31859, -3609, -10479, -22396, -61392, -66989, -55321, -36754, -18999, -5881, 11476, 15506, -5556, -47302, -77167, -56091, -33842, -45610, -52481, -30219, -10115, -6848, 6546, -11271, -33098, -29712, -39639, -66767, -59482, -37288, -17189, 19621, 17525, -16820, -37510, -18778, -6404, -29530, -31707, -26443, -10970, 16959, 2643, -6095, -3426, 8408, 17385, 5343, -38000, -62017, -34780, -9356, -19433, 6516, 28970, 17945, 24613, 8378, 15301, 22584, 27117, -16397]
13961a6397j3658J554J4514j0849n603J2499L7057N261l5446J3686N869J0134
13949A8621o570j8053J1943j7354q565N383k53J0238P132k9289j3065r535P290
13936d2077n959j7442L3142J9729j5203O414r604m682K6134O254j0224j9340p141
13923c9999J7728J7053j4208m9096K0560K895O532R296N383r096k1240l453J5136
13910d2509L497K0604J4072J4725L556j9367p558k3428j1674j71J3443J7865j550
13897a8495R677j4336K4994j1029q51K6892J5577q999p389j3125k848J5092P233
13884B2393j1901j0178j176j8250J0004K3787J2410J9162k2515q533j1191n384
13872a372N119l4346k2853n912O044K5833J4702K904J9692j4782K1719M816j0159
$$ y = [-16397, -30055, -28501, -13987, -24836, -30439, -17940, 19117, 24378, -11068, 2618, 8487, 18621, 12051, -6002, 5941, -11413, -19978, -14595, -14848, -4610, 2522, -26767, -39832, -49367, -42077, -48036, -65478, -32336, -12607, -27810, -21396, -31000, -35682, -9548, -3294, -13518, -32858, -39999, -22271, -5218, -19426, -68522, -47962, -45067, -38535, -29239, -23856, -32952, -54192, -57645, -42509, -39012, -18408, -4336, 10389, 13945, -5422, -12980, -36408, -48082, -48253, -34810, -16945, -18495, -8818, -23154, 1840, -9189, -10040, 16852, 32429, 23430, 16041, 2916, 68, 15160, 22393, 10492, 314, -862, -19112, -9108, 14679, 27089, 46251, 23736, 15203, 4012, -1372, 3747, -30599, -53452, -59364, -53320, -27487, -12785, -9881, 9811, -4971, 16748, 21564, 11405]
13859A1405k8824l58J0621j484J4687Q995k5998o967m955j520K64o895J1171K3343
13845C485K7042L2603j7860n3251R944K8868J1453m981l0153l2058k7079n734
13833e7721k711K5802J2617K0364j6360l1064j8384L3582N3726L3648l8444k5934
13821a0879P129k0897k1121Q925L5335K9852J7268J116k949j9465m3694J8478
13809i02J7230L491K7006l9l494r494k2476l5617l5200N529N4564L744k0829N496
13795a0991O449J0802K7042M2362Q267k7647j9750J2405Q641J4548r73k2221k5265
13782B3669N852J9283j6047J2041l896k6991j6437J8184j197q761J1086K3118
13770C9904j2881k7458K4982J9985J3635r372p521j6346K147R125k5129j7691
$$ y = [11405, -17419, -17777, -7156, -8640, 6047, 15042, -10956, -17923, -22878, -24398, -24134, -31029, -19858, 3485, 30527, 63130, 45270, -7981, 1963, 30831, 42284, 37303, 7150, -24908, -51987, -57721, -60432, -34630, -22013, -1649, -18009, -49073, -67457, -33875, 19851, 53499, 15055, -10879, -3750, -24647, -45768, -36843, -1508, 28344, 45612, 46728, 43779, 24314, -19380, -902, 16328, 19819, 46825, 46786, 43292, 33798, 11322, -24295, -59495, -53966, 598, 4342, -16487, -10991, -4542, 6260, 33302, 75664, 83931, 56284, 36534, 48939, 57580, 72128, 71155, 48934, 23669, 29521, 48804, 32757, 44798, 40902, 13911, -2526, 15658, 14461, 5700, 16786, 39904, 27023, -435, 24547, 44532, 58167, 48795, 41274, 24928, 27075, 36200, 11071, -6620]
13758f620L476O06J288l6K4136J0006r897q114K5510m1311k6495n12R245J3312
13744e406j5462Q739j4573J90K2215J0497J5470M0223p616k4200k1427J5320J9554
13731D3524j1604l6239l0898N960L296j6462N452j4050N397J1912K5977J3392
13719E657j2837K882J1145L3825K4003l0492m6411o319o073j576J6027j8565o67
13706b9401J2462J2182k4976o097J4310n606J7120K0071k5411m020J3778M523
13694a065M632m0428l5508j9840J106K9832J2290J6085N0190J3023j2972O56k4193
13681f192J0113L1119K419J2261j9310j7948q248k1449J0202J6175O154O107O918
13668B8321j0941l0379o927L4332k0775j0669m390L816k1071L738J5055k96L050
$$ y = [-6620, -3144, -2538, -1250, -1286, 22850, 32856, 22959, 14845, 40355, -956, -27451, -27963, -18718, -5406, -20868, -12129, -26702, -26512, -4297, 6200, 21670, 61893, 54277, 30077, 8650, 23970, 43524, 31920, -4319, -35217, -29257, -25961, -42423, -36971, -51021, -45624, -33712, -7735, 5657, -7180, -4298, 6847, 40672, 64675, 34183, -12228, -18547, -24620, -26196, -10169, -28734, -29401, -16939, -4757, -29733, -35830, -21520, -27126, -10006, 10065, -15346, -19366, -5588, -1065, 3567, -36861, -72369, -92209, -91103, -61271, -48981, -32896, 17294, 30317, 17345, 18001, -6192, 3921, 35040, 37459, 49720, 30410, 12462, 4214, -17235, -7033, 9142, 15296, 21403, 28321, 17380, -12999, -19926, 14406, -6369, -17038, -21428, -17612, -38683, -34945, -19890, -20186, -17136]
13655a7136Q611K197K641J0338k5913k5532p735M5141J983J1694j5963P661J8926
13642A6913L305j8342j4215m0788J220L3985K035J1437Q674j7848J4652J0148
13630A1176R294L6366k3668k6665j275j5260r079O047J5424L090j4081m548J8862
13617E683o314k666l4165r368K272J9262K6131j1835k5039j9370O1048J2163l1626
13604a3824j5400K1132K7779l026j2251j6979j4251J604P028n930j4602K1803
13592a6917J6898j6931n264K580O574M76k4541K2174J7911K711j7509j1467J7702
13579e603L7767K354n752r193k7072r324K4615O113j5854K323K5806j9887J3626
13566A9919J3115J2032j0378o344j5958n389K377k884p398J6001K7341j5395l703
$$ y = [-17136, -8525, -6328, -3687, 6651, -19262, -44794, -52529, -7388, -5405, 6289, -9674, -2013, 16913, 20218, 1876, -12339, -53127, -51907, -17922, -15887, -4450, 4224, -13624, 1028, 11176, 20470, 56836, 33168, 6503, 5228, -10032, -19111, -13064, 2360, 5450, -8631, -13179, 5683, -631, -3297, -37462, -46830, -44558, -25296, 835, -11000, -36039, -55409, 5639, 17802, -13824, -29224, -8092, 19687, 16661, 4410, -12569, -26820, -25216, -18188, -24118, -38720, -16917, -19, -16950, -22214, -19634, -13060, -12584, -37125, -14951, 2960, 5671, -11838, -23305, -5603, 32164, 34518, 28766, 19573, -7499, -16823, 7792, 13905, -1949, 374, 26180, 6293, 19919, 33034, 45066, 34688, 28344, 12386, 6997, 9374, 6490, -908, 15093, 42434, 27039, 23336]
13553B3336k3340P180R278k562N966J378o667l4606j1809J0046M345J1876J5254
13540I675k2184j312R142O80M695o036k9731N084K975J3502J4597k5444o106K8521
13526a942q897j3891k2875R957R810j8852k5094O886M6528M450o45K078J5697
13513C210J4469J9722n981k9676J1335K3555k5252q484N838K1138M010J0382k809
13500D1457O101j4733n0000p232K3405j4146P695p853L5498R073p184J8580J3581
13487E4242j4232K703l1066n3544j0409M6016K5125n032m47k123l0839q07j3301
13474c3714R409j459M0592N544r640n600k2307j0915O832J542Q864Q39k1200j2806
13460d4019K960j8811m851K1455o610m0N579P699M537J4253J3626L212j072J5482
$$ y = [23336, -4, 7176, 16454, 13892, 19858, 21236, 14569, -20037, -31846, -21800, -17455, -5579, 9675, -12509, -13821, -4679, -3999, 696, -5340, -35071, -29987, -27012, -13510, 1087, -24357, -30463, -1942, -10839, -24730, -47605, -37648, -27838, -46690, -71784, -64898, -18370, -13920, -14565, -12487, 3210, 17679, 37401, 31420, 1744, 13079, 36634, 11382, 2898, 8736, 29874, 33884, 44266, 41457, 47558, 32825, -17175, -24407, -1002, -15148, -7453, -15306, 20192, 29265, 22081, 40661, 54242, 40010, 42713, 11647, -41897, -52306, -6290, 18835, 13803, 13356, 11233, -19606, -20413, -33714, -24305, -25764, 14828, 20372, 10732, 5132, -17175, -28090, -21258, -19716, -10852, -10013, -31213, -44019, -41059, -59870, -64721, -43266, -49876, -49916, -44337, -36638, -32101, -17848, -4222, -1010, -2082, 13400]
13446A3400Q277p152k9058j1561K73r040Q515L6k156k4650J6276K3570m478R466
13432h282o707j4953J2674M3531L868j1081j4359k8429J4327M13k4519j6104j3837
13419f3458Q211J9014J8205j465j0717J6676n77j2514j8121R644J9936Q571k114
13406h709K0631K0971j4478k0081j667j4462J2960K0124M051q416k0032J0572
13394A464J277M81K5112m31p708n9957J2928K9334l942k1015k2187j7156J9210
13381d2590k7585R068L1653J8618p16k453j1626j1170P127K2709L447J286J1508
13368I276l1196R95K9188k860N584j0397k7077j232M5857j458k9848k8460K3067
13355a8561Q099K7309l046p055j1303N482J5100K0561j3127l209l325j4047K9154
$$ y = [13400, 21677, 14525, -14533, -26094, -25821, -34861, -26346, -26310, -28466, -53116, -36840, -13270, -17748, -8282, -14989, -29942, -17268, 26263, 30131, 19050, 4691, -23738, -9411, -8998, -33517, -49621, -63458, -55247, -36233, -18028, -19493, -30210, -13534, -14111, -26625, -44746, -35102, -15166, -6595, -8709, 11922, 32893, 18415, -1666, -3333, -17795, -4835, 15289, 19340, 10924, -9108, 1464, 2741, 3222, 28334, 27903, 20195, -39762, -26834, 2500, -1442, -22457, -44644, -61800, -42590, -70175, -61107, -29454, -10836, -11552, -14005, -25631, -36801, -29674, -6965, -3518, -2232, 9276, -21920, -20925, 8263, 5403, 10987, 590, -26487, -27719, 18138, 16680, -13168, -41628, -18561, -10462, 16847, 13801, 6746, -4557, 925, 16025, 36586, 23459, 20250, 16925, 2878, 32032]
13342C2032P926k5394k0266k0537J9711N5263m2569K362K6400j9830K8645j4072
13330B9671l2665j2357k1118K5252J3871k241r123K2430O871l388k3155q249k2140
13317c6341l254K1027J7645m0440o700J3452j3270L3996J9290j403J486l9858
13305c4370j4340J2073J1227N276J9293K3608l1484l5134L702J476j850K157J7143
13292b1223K0550o551j6339k4539j993J858j4385J2062k093J5432L3089J829j0268
13279a2571k8137j2410K1202K0633P35q263k0717R20K5704J6889K3274m678o506
13266A6075J0527J2321l6524o9355J4654O3632J7871k5487l5162J834K2779M799
13254b036l051J47k3803m2792L0949K9848R258K5991q01O180j810k6512l006k8352
$$ y = [32032, 39958, 14564, -5702, -26239, -6528, 48735, 6166, 8528, 34928, 15098, 43743, 29671, -2994, -15351, -36469, -11217, 2654, 413, -8710, 13720, 20591, 17203, -5952, -14201, -36341, -39595, -18568, -923, -41363, -48063, -34611, -47881, -13885, 5405, 4002, 5488, -34370, -48710, -36637, -25410, -20134, -841, 22767, -8717, -43851, -40149, -38673, -40523, -38366, -21223, -673, -7224, -23563, -48102, -50095, -48237, -62622, -50560, -52653, -37221, -4132, -2303, -12571, -40708, -53118, -31916, -11283, -10548, -18811, -39528, -38608, -12904, 3985, 27259, 22581, 16075, 26602, 38923, 2399, -66956, -52302, 11330, 29201, 3714, -31448, -29614, -6835, -2036, -5087, -4940, -28743, -71535, -40586, -10738, -1480, 24511, 23710, 29890, 28080, 1568, -1438, -29790]
13240b9790M3912J9652j8743r726R371j2817k6548l047J6548j930j36j3910k1680
13227d8844Q112K3037l7801l7086K7998K4323m893N33J4212j434p448R377M6745
13214A6831R024j8472J1910J4169k0080j2984j3228J5431R601j357q312J0075
13202A2608J5257J8066p183j2493j2771J6290q233k1044m43l5174Q767K190J1407
13189a2756j2455K1297L473J8075J1728N408j253J746J007l3j2940r694J647J9142
13175C4392R780K2590J2057l1121k4001k4920L3810K7671k0983j1400J6069J3031
13163E6975j4876m384K8155J3261j8677k6220K730K67J3481l775j2089Q184R26
13150D3958k2685j1267k4628J0139J4593m072K2035J0501R263p357j278J434m5907
$$ y = [-29790, 14122, 33774, 15031, 5305, 14676, 1859, -24689, -27736, -11188, -13118, -13254, -27164, -48844, -40732, -17695, -55496, -92582, -64584, -40261, -45154, -44621, -30409, -31843, -39291, -29914, 16831, 25855, 7383, 19293, 33462, 13382, 398, -12830, 2601, 12202, 10845, 2533, 12608, 27865, 45931, 38748, 26255, 13484, 29774, 21541, 497, 54, -35120, -26353, -24163, -12756, -25211, -3914, -441, 17634, 29362, 34770, 33517, 35263, 36270, 36237, 23297, 13603, 15250, 34392, 44172, 66762, 78819, 47698, 23697, -1223, 32587, 60258, 39275, 27875, 43944, 56975, 42099, 37715, 65870, 79131, 60454, 34234, 36964, 37231, 50712, 46937, 34848, 43032, 43958, 21273, 10006, -14622, -4483, 10110, 6038, 28073, 38574, 47837, 40480, 39202, 40636, -5271]
13137e271k5650J739N372J4645K1258M070k430n59n968K6691k143M62p025j8568
13123F623k6490m3015j9467K1661L524J8252K4703P883k841R55K911O667L0906
13110C2272L8887R086j8643l0160p956N049J710k3669j8864R559M419l1299o737
13097c6346J0856K1765N263l830R951K4134j0786k0568p536J5254r367j8224k339
13084b1773K961k3414K4083J9201o296M9251j3148m9040k3194Q927K6159L0563
13072B4280L40J8222J1322K4797k913l7328J3610L1172L997J2742N39j0190j22
13059I0468l995l6283j2732L914k8622j6060j3056K517J6917O807N71J770n515
13046F701l2169k5552q564K1043p651K5993M2020K0061m361k6620j6482Q649K5144
$$ y = [-5271, -30921, -29182, -23810, -9165, 12093, 16163, 13733, 13174, 7206, 33897, 31754, 32216, 25191, 6623, -19867, -62882, -82349, -60688, -57164, -38912, -14209, -6326, -9167, -8212, -5301, 1366, 32272, 71159, 80245, 61602, 31442, 23486, 28535, 30245, 6576, -12288, -2729, 1690, -29609, -36346, -25490, -3725, 1538, -2292, 7659, 31793, 21007, 439, -7097, 8157, -1210, -19434, -21773, -18812, -42226, -18143, 1058, -5238, 44013, 30865, -18175, -41369, -32442, -6283, 24280, 24620, 42842, 54164, 78961, 76048, 38720, 52330, 83502, 87499, 100241, 100780, 90590, 90468, 86473, 50190, 37458, 41372, 12750, -3310, -16366, -13849, 3068, 9875, 10446, 12216, 6701, -25468, -51020, -59584, -38541, -46192, -20199, 21821, 41882, 37521, 10901, -5581, 3068, 28212]
13033B8212l1527n765L695o228J4749L9015j001k5387r990O27o987Q790K4881
13020C3084K0102k2610m0527J0234j213L5923K854l158r109K728L7928J7507J2801
13007I6544K05l7982j9135P823j496L2687L7302p724r299m769J8667N8764M9931
12994B21518P4047J14808J29629J45256J88697J90178K02346K01995P1342l1596
12984A508220l9406m9920j60733k66721j99934j52506j45089j47975p4287n0477
12974B21172l4999n4885m1924J1458N034l3518J8380q850n8183l1016J4752K7016
12962C4437J278O04r744L212m858J4632J4442k61l7952j3376n153P113J1859Q971
12948B5204K2695J4283r594k1960k4408j2210N093J4833j5883l867j5900m892
$$ y = [28212, -3315, -9080, -5385, -11613, 3136, 42151, 41150, 15763, 5773, 6400, -587, 8203, 33084, 53186, 30576, -9951, 283, -930, 34993, 37847, 34689, 25580, 28308, 66236, 83743, 96544, 96749, 58767, 39632, 47455, 45959, 78646, 115948, 108224, 98925, 94156, 112823, 171587, 221518, 295565, 410373, 540002, 685258, 873955, 1064133, 1266479, 1468474, 1539816, 1508220, 1468814, 1418894, 1258161, 991440, 791506, 639000, 493911, 345936, 271649, 221172, 186173, 131288, 89364, 100822, 105856, 72338, 90718, 81868, 23685, -7331, 7421, 34437, 35715, 36319, 26575, 29787, 24929, 39561, 54003, 53742, 15790, 2414, -2739, 4374, 16233, 25204, 47899, 62182, 52588, 30628, 6220, -5990, -897, 13936, -1947, -5814, -21714, -26606]
12936b6606L61P91L220p74j3166P580K2825K2267j2332r301P505J7891j1604m5903
12922c7246j3484k063L2618L0366j09J2835L3506k0719j1668J9515L5403R37j4154
12909F5737J5101J6520P583L9636L0007M8501M0113M8111P2536R5798P4367O7470
12897F21480R4914J53488J79032J85035J29852J74000J19646M1112K7200l6706
12887A689053j19524j80649k30421k47436k14135j84454j32934o6746n1711m5168
12877B15875n4650k807P567k4175M608K4836K1566J8761j2987k6331l1298J2110
12865A53075N269m123o91O993l2653l8613n6107K3491K4223J75q220k2657l8250
12852A1912k2820M79l6504m5286k6760k1175j7259K2982O460J2595j1799J0705
$$ y = [-26606, -26245, -25454, -22234, -23008, -36174, -28594, -5769, 16498, 4166, -5135, 2370, 20261, 8657, -37246, -50730, -52793, -20175, 10191, 10082, 22917, 56423, 35704, 24036, 43551, 78954, 79891, 65737, 80838, 97358, 104941, 144577, 174584, 223085, 263198, 311309, 383845, 479643, 554010, 621480, 716394, 869882, 1048914, 1233949, 1363801, 1537801, 1657447, 1698559, 1725759, 1689053, 1569529, 1388880, 1158459, 911023, 696888, 512434, 379500, 312754, 261043, 215875, 161225, 158418, 165985, 141810, 146418, 171254, 192820, 211581, 198594, 172263, 140965, 153075, 158344, 154221, 153530, 160523, 127870, 89257, 33150, 56641, 80864, 81039, 72819, 50162, 11912, -10908, -10429, -46933, -92219, -118979, -140154, -157413, -134431, -127971, -115376, -127175, -116470]
12840a16470J008J3267L9932K1796J6181O791J8993l3356p825k541J7912J7028
12828g284J6676J0351M118L3788P6419N4109M1404N6378m00k3291J6235o010j7073
12815B55420l4421m3879k7620l2738n889J1218L1293J4416O867j0018J1312n076
12803A70885N138j1841j2696K580K1610L1385n650M013J2878j3908n9269l603
12791A41522M9911K4147m3106M812J9510J7688K5750o984m034L4424R460M8470
12779C21570N3366N4508Q9053J26405J15866J83527K48613L31469M82235N65950
12769B572562O07860O27703N43533K05398j30716j63168l78526p05635o63454
12760B515557n23448m98272m30200k85938j76961j28687r7636o6859o9482o3437
$$ y = [-116470, -115462, -102195, -62263, -40467, -24286, -17495, 1498, -31858, -39683, -42224, -24312, -7284, 9392, 19743, 23861, 57649, 134068, 188177, 229581, 285959, 285559, 262268, 278503, 272493, 255420, 220999, 177120, 149500, 116762, 110873, 122091, 153384, 167800, 174667, 164649, 175961, 170885, 176023, 164182, 151486, 154066, 175676, 207061, 201411, 205424, 218302, 204394, 145125, 141522, 191433, 215580, 172474, 177286, 196796, 214484, 240234, 233250, 229216, 263640, 273100, 321570, 374936, 429444, 518497, 644902, 760768, 944295, 1192908, 1524377, 2006612, 2572562, 3180422, 3808125, 4351658, 4557056, 4426340, 4263172, 3884646, 3179011, 2515557, 1992109, 1493837, 1063637, 777699, 600738, 472051, 374415, 307556, 238074, 174637]
12750A74637j0637j0014q406m0299k0354j7985j5504j1778n36M5146J5010p797
12738I1483j2342j1354N158M405J5652Q021j8750k9454l3687R363J6737r064m4806
12725h638m3294p415M0693K9265o886r189J8482R84k408j2559J0548K8352k030
12712C5905o198J2988K01o474N879n209j807R796K0665k0873l6253j0768o444
12699h592L025J8310J4881M7904K6621l0997k0385l5835J4214q331k9816M8533
12687C9532L2927q784k3441M0553L7639K4765M1995j940j7189l387l998j2647
12675A46025k0939k4219j8694J1835L904K3120M6138M8075N5201R7886J08259
12664D76591O5344L3579J75k0457l6121n6903l4474k3984j5432j5080j5850j6697
$$ y = [174637, 164000, 153986, 145580, 105281, 84927, 66942, 51438, 39660, 39124, 84270, 99280, 91483, 79141, 67787, 72945, 77350, 93002, 101023, 82273, 52819, 19132, 28495, 45232, 36168, -8638, -51932, -59347, -18654, 10611, 3725, -5464, 13018, 14002, 11594, -965, 9583, 37935, 35905, 29707, 42695, 42896, 36422, 42301, 37092, 35285, 45081, 65746, 44873, 8620, -2148, -8592, -5567, 12743, 27624, 75528, 102149, 71152, 50767, 14932, 29146, 20815, -9001, 39532, 72459, 63675, 40234, 80787, 118426, 143191, 185186, 183246, 166057, 162670, 158672, 146025, 125086, 100867, 82173, 94008, 97912, 121032, 167170, 215245, 270446, 368332, 476591, 541935, 575514, 575689, 555232, 519111, 462208, 427734, 403750, 388318, 373238, 357388, 340691]
12652C40691Q200j7317K1473m168j1380J9515k765k7589j7036m815P699j898m996
12639C05614j097M929j7021j6218O807J3035k825l9398M238r318J2880J6799O273
12626B84698M568K3070J7064j3018j3746L0162R119L4154N1524N5671J2329O629
12614E02224k7674J1938j1890k6256L0375J3007K3602M0665K5223M6215J8783
12603F46212M0011N3847L0589M2006P1721L3699J9825J0980P423K1069J9556J4437
12591A011375K4981J0505M2267K3022K0281L1977L2357K9396L7121P3546J34264
12580A471092J22375J55558J67654J55696J25613J84561K15547K57914K31919
12571C087929K25139K94740L33901L37641L61718M28529M98365N78613P09950
$$ y = [340691, 348891, 331574, 353047, 348879, 337499, 357014, 354249, 326660, 309624, 304809, 312508, 310610, 305614, 304517, 309446, 292425, 276207, 283014, 296049, 293224, 253826, 258064, 248746, 261626, 278425, 284698, 289266, 312336, 329400, 316382, 302636, 332798, 341917, 376071, 427595, 483266, 495595, 502224, 474550, 486488, 474598, 448342, 478717, 491724, 515326, 555991, 581214, 627429, 646212, 686223, 740070, 770659, 812665, 884386, 918085, 937910, 948890, 956313, 977382, 996938, 1011375, 1036356, 1046861, 1089128, 1112150, 1132431, 1164408, 1196765, 1226161, 1263282, 1336828, 1471092, 1593467, 1749025, 1916679, 2072375, 2197988, 2382549, 2598096, 2856010, 3087929, 3313068, 3607808, 3941709, 4279350, 4641068, 5069597, 5567962, 6146575, 6856525]
12562F856525Q37171J011520J266680J560899K026469K573792L305802M266184
12554B3705042N545196P242262R499481J2762363J7171867K2979461L0698340
12547A29604012L8210011M0130509L8875106M1880429L3140467L385705j0797988
12540C14428251r488266k9879385n1876758m6282995l6657601l5303262l0380463
12533G4559521k0886413j3275025q867148o267066m569386l438346k709349k150035
12525A2396753j665871j323398j102606r14949p68514o77197n64807m57518l72487
12516D549406l48667l04820k39677k07239j68009j35528j34286j03354o9919m4572
12506B793335m5945P847M3781J5687J9345m1018o6593r0282j49645j63726j95516
$$ y = [6856525, 7693696, 8705216, 9971896, 11532795, 13559264, 16133056, 19438858, 23705042, 29250238, 36492500, 45991981, 58754344, 75926211, 98905672, 129604012, 167814023, 207944532, 246819638, 288700067, 321840534, 325226239, 314428251, 304939985, 275060600, 223183842, 176900847, 140243246, 104939984, 74559521, 53673108, 40398083, 31530935, 25263869, 20694483, 17256137, 14546788, 12396753, 10730882, 9407484, 8304878, 7389929, 6621415, 5944218, 5379411, 4921893, 4549406, 4200739, 3895919, 3656242, 3449003, 3280994, 3145466, 3011180, 2907826, 2837907, 2793335, 2747390, 2755237, 2799018, 2814705, 2834050, 2793032, 2726439, 2636157, 2486512, 2322786, 2127270]
12495B127270k31106j85532j38296j47209j22820q0253o8276n5882n0955l8053
12485A008888r151k5772k7671j9299l8967l8652k5464l2112j2871j9031k9944
12474G29954n0313j3207l713l1214n0931j6134o310r803M1192J5980K7396M2192
12462F75089J8853j7049k1389j2734m6417l2757l263k3268j5531k2227j9289O359
12450D86377j1135j7708r693k5246l5535L1563P062l0792k4477J4644K0887l5491
12438C70456l2113l0010l1340l1465p221j905J2954k599k7655o050j6776o0713
12426A35563o461J0868k4563m037j3062P249L3453M7743P4892P3118M7693N7072
12414D39528O5504P3908l359j4621j2916o2402r2702p4277k4051j2007q443J5410
$$ y = [2127270, 1896164, 1710632, 1572336, 1425127, 1302307, 1222054, 1153778, 1097896, 1046941, 1008888, 999737, 973965, 946294, 926995, 888028, 849376, 823912, 791800, 778929, 759898, 729954, 679641, 666434, 662721, 631507, 580576, 564442, 558132, 548329, 589521, 605501, 632897, 675089, 693942, 676893, 655504, 642770, 596353, 563596, 560333, 537065, 521534, 499307, 480018, 486377, 475242, 457534, 447841, 422595, 387060, 418623, 425685, 394893, 370416, 385060, 405947, 370456, 338343, 308333, 276993, 245528, 238307, 236402, 249356, 246757, 219102, 213052, 196276, 135563, 129102, 139970, 115407, 111370, 98308, 105557, 139010, 186753, 261645, 334763, 382456, 439528, 505032, 578940, 575581, 560960, 548044, 485642, 392940, 318663, 294612, 282605, 274162, 289572]
12402B89572N690M958j0106O658L0481K155n285N8394K8134m201L1717K2038o555
12389D53650J924m0995l3894p853N908l6968m1325k1013j5066J132p608J0412
12377B68304j3679m0935j5268K0322j0165k1133r514O861K523R160j3994o829
12365A75653K3534n944K1754J1534k8357j5110j2624N289K3508k1078k4842p312
12353A46005J5973L2809K627m099j2234k730j51j7069j5131l0541l5174J8459
12341I8744L0277j1236O688N1328o511k3469k7589l3620m036j2847K3436Q14q808
12328H3171K8579J9549m512l3847l1266l8127q1L2262o57N663o347j1326O904
12315D9965J7192K7687K632J2115j8824k827k578k6258j1302m1043k9620L307
$$ y = [289572, 295262, 300220, 290114, 296772, 327253, 329408, 324123, 382517, 410651, 406450, 438167, 460205, 453650, 455574, 414579, 380685, 372832, 378740, 341772, 300447, 279434, 264368, 265500, 257892, 268304, 254625, 213690, 198422, 218744, 208579, 187446, 177932, 184793, 187316, 196476, 182482, 175653, 199187, 193243, 214997, 226531, 198174, 183064, 170440, 175729, 199237, 178159, 153317, 146005, 161978, 194787, 197414, 193315, 181081, 178351, 178200, 161131, 146000, 115459, 80285, 98744, 129021, 117785, 124473, 175801, 169290, 145821, 118232, 84612, 80576, 67729, 91165, 91979, 83171, 111750, 131299, 126787, 92940, 61674, 23547, 23466, 55728, 55071, 60734, 54387, 43061, 49965, 67157, 94844, 97476, 109591, 90767, 87940, 85362, 59104, 47802, 6759, -22861, -19554]
12303a9554L8890K7044k3915J3319K3663M2388j6886l4794Q253J9648J0673j3274
12291G5455J4776R140O748j782m3037k2387l234l04n051J4625R333k288j3161
12278C8833L0375L3823j0100K1025J1758L46l6097o560p050J2080J6800Q926l818
12265A10341j2458o649J5263K3313J7329J0802l2448l6578m63o697J6582J8757
12253A17094o033J4767m464J014L6268k2597l2175J02M1295J9598J2789l155M789
12240A79292M6814K2013M403M8044j932l9753l4730l144k7800k1564l519l2487
12228A35637k7408j9385j0065L270l0912j4709J5007k408j1568M6L639J6438j0410
12215D7172j7122K093K0900j0729k117L477m565K158j583J0056p164R254j6081
$$ y = [-19554, 19336, 46380, 22465, 35784, 59447, 101835, 84949, 50155, 58408, 78056, 88729, 75455, 90231, 99371, 106119, 104337, 61300, 38913, 35679, 35375, 30324, 44949, 54282, 51994, 38833, 69208, 103031, 92931, 113956, 125714, 126060, 89963, 83403, 76353, 88433, 105233, 114159, 110341, 97883, 91234, 106497, 129810, 147139, 157941, 125493, 88915, 88452, 81755, 98337, 117094, 111061, 125828, 121364, 122378, 158646, 136049, 103874, 103976, 145271, 164869, 177658, 174503, 179292, 226106, 248119, 252522, 300566, 298634, 258881, 224151, 221007, 193207, 171643, 168124, 135637, 108229, 88844, 78779, 82049, 51137, 36428, 51435, 49027, 37459, 37505, 41144, 57582, 47172, 30050, 32143, 53043, 42314, 40197, 43674, 39109, 41267, 39684, 49740, 42576, 51830, 35749]
12202C5749K529P726K6856o776j2541k3975l371K8801j012o327R866o455q420
12189D2650j6218k7946J7766J5025r034J9543J953j239m005J1762P948r318j667
12176D7220K8631Q886l162l1884j3610J1442J4211n946r108j6423j1963l273L538
12163A8559K1329K0953R747j8942r274L405k0052j5042J8748J5592J6460l649
12151E7834L81J821J3220P088R181j8520j9176k3473k7010n311J5609J8785P354
12138C7783K1580J267j4085j331J4147q933k31j5181q001j1626j8881J563L667
12125A738N657m1459k49K1845k719l010J7517J0624L0666L467j0707j3020K6154
12112D6504L722n940o445J6159j231K5873K5508K027N9508M1779N0270O3399N2146
$$ y = [35749, 38278, 46004, 72860, 66084, 53543, 29568, 26197, 54998, 53986, 47659, 57525, 51070, 42650, 26432, -1514, 16252, 31277, 22243, 41786, 43739, 42500, 38495, 50257, 58205, 48887, 47220, 75851, 84737, 81575, 49691, 36081, 47523, 61734, 55788, 46680, 30257, 18294, 15021, 18559, 39888, 60841, 70588, 51646, 42372, 45777, 25725, 10683, 29431, 45023, 61483, 57834, 58215, 60036, 73256, 80344, 89525, 71005, 51829, 28356, 1346, -3965, 11644, 30429, 37783, 59363, 60630, 46545, 45214, 59361, 50428, 50197, 35016, 27015, 15389, -3492, -1929, 1738, 7395, -34064, -34313, -12468, -15187, -18197, -680, 9944, 40610, 44077, 33370, 20350, 46504, 50226, 44286, 37841, 54000, 52769, 78642, 104150, 106177, 165685, 207464, 257734, 321133, 373279]
12099C73279J02586J37736J58362K21609K61854J86610J66270P7381k6239q4853
12089A574595j42607k43026k42414k06573j61978j65742j37846q3529r3616m9901
12079D7363O663J4380L178m932j3005r479r649J5510R763k7952j6718m6404j9863
12066e1145Q630k1630j4094N4593O2198R122j3668l9419j5526P644J5080O694
12054H479j5578j1481l711R275q234J0324L7062J3707J3049J7881l3121m3810
12042f158J6727J2441k7527k6541J0066L082j2138R177P906O34N823k5789j251
12029c3548K8350K2558j317K278j7099J9530j5421q798R481K4666k1264o326l289
12016a99j728k1510k568K5540O306N227K5865m200l3506j8287j0316M311L6078
$$ y = [373279, 475865, 613601, 771963, 993572, 1255426, 1442036, 1608306, 1685687, 1659448, 1574595, 1431988, 1188962, 946548, 739975, 577997, 412255, 274409, 190880, 97264, 47363, 54026, 68406, 71584, 66652, 53647, 44168, 34519, 50029, 59792, 31840, 15122, -31282, -51145, -42515, -64145, -78239, -23646, 38552, 47674, 34006, -5413, -20939, -13295, 1785, 8479, -7099, -18580, -22291, -13016, -21250, -10926, 26136, 39843, 52892, 70773, 37652, -6158, 10569, 23010, -4517, -31058, -20992, -17910, -30048, -20871, -12965, -12331, -6508, -32297, -33548, -5198, 17360, 16043, 18321, 1222, 20752, 5331, -3467, 6014, 30680, 9416, 3090, -199, -1927, -23437, -26005, -465, 5841, 11068, 36933, 32733, -773, -19060, -29376, -25065, 11013]
12003A1013K2997J4822l1762l2405k283j2473M536L1328J2086q026J0813l543
11991A7103P893j1962k3743J4322J6188M690p247j201n82n195k4702P162K077
11978e197k6144J066p389L3283K0595m4941m5462l230N2065L7885o586j4768j694
11965a0517j0731J2601Q50N157M2099J4070j9037l230L252J4169N419k1610n571
11952B6921L6699j1670j1610k83j4202j853L078J4555j5917j4119j7572k882J7464
11939H609k6467k8885J302K9137N233j6821J5329K02k9367Q589j0466J216J7168
11926b5221O870j136k4789O033J2100o13J5148L3108K0585l2736l6083k778J1356
11913a8156K3616j1769k406L4198J8985n154M88m4831j8632j1841J6889O759k3374
$$ y = [11013, 34010, 48832, 17070, -15335, -17618, -30091, -25555, 5773, 17859, 9833, 20646, 17103, 24996, 13034, -10709, 3613, 19801, 24491, 17244, 16043, 15461, 10266, -14436, -7274, -5197, -31341, -30275, -37664, -4381, 16214, -28727, -74189, -77419, -25354, 12531, 5945, -8823, -10517, -21248, -8647, -7797, -2640, 39459, 53529, 34492, 31262, 34514, 48683, 54102, 32492, 26921, 63620, 51950, 40340, 40057, 25855, 24002, 27080, 41635, 25718, 11599, -5973, -8855, 8609, -17858, -46743, -45441, -16304, -11071, -27892, -12563, -12361, -41728, -33139, -43605, -42389, -25221, -18351, -19487, -44276, -38243, -26143, -26756, -11608, 21500, 42085, 9349, -26734, -29512, -18156, 5460, -6309, -8715, 25483, 44468, 39314, 39802, -5029, -23661, -35502, -18613, -11854, -35228]
11900c5228j2100J6905M2113K1081j326M377k0909k3800j366R41O650o603J0689
11887A424J0039O298j2648j9664Q266o784J4949L438j958j6505L439J4954J2598
11874A7846M458R254q587P105K3619q834k9500k6445j6572r72K631k1035l409
11861e0441R121Q621J0206M675k7045k8255j7209K0005M4019J5449J3270R257
11849A1673L1412J9351m5731l0598M9199M1960l0809k1975k0754j8750K64m264
11837a9022l0365j4152K6216k212K1315j0256p963L6415J2728j0487m033j5714
11825a7530J4256J4444M479J580n337L390L511K1049j2155j4134L0106M0832r231
11812G5260K0484M8842M1108K3249r85j2971m7749m2891p584q468j1465j9232
$$ y = [-35228, -47328, -30423, 11690, 32771, 31445, 35822, 14913, -8887, -10253, -9312, -2662, -9265, 1424, 11463, 17761, 5113, -14551, -6285, -13069, 1880, 5318, 3360, -13145, -9706, 5248, 17846, 22304, 31558, 22971, 30076, 53695, 44861, 15361, -11084, -27656, -28628, -25997, -47032, -50441, -41320, -32699, -22493, -17818, -44863, -73118, -90327, -70322, -26303, -10854, 2416, 11673, 43085, 62436, 16705, -13893, 35306, 77266, 46457, 24482, 3728, -15022, -14758, -19022, -49387, -63539, -37323, -39535, -18220, -28476, -36439, -24, 12704, 2217, -1816, -17530, -3274, 11170, 15649, 17229, 11892, 15282, 18793, 39842, 27687, 13553, 43659, 84491, 75260, 95744, 144586, 185694, 208943, 207958, 194987, 147238, 104347, 96763, 88295, 76830, 57598]
11800E7598l0326r91K1388n14n371l675p972k185l2289J1598j6211j8875K1738
11787f087N519r502j0J6471Q11N46K861l9970P382K2501p64j0603k8834L4263
11773e416O612l0569J559K6434j5579n4953J082K0958J2750P435j3809jl370J265
11759d5602K2325L3062l1031O460O333n536K5083j1252J7475L439L874j242q372
11746A5016j9303j961j4442K1317p640n430j2134J2848J9794j4419m5508j1460
11734f3322L6844J1799k0380K239K9417k819R223L2903n207k1052m292k8127n294
11721b8068J0591o42K0734L021l1062o017k1618J6489M7516J5440L5278j874K241
11708F2029l6659k1242L683j378j0600L378K9008P711r717J9619J0699l8047M355
$$ y = [57598, 27272, 26281, 47669, 47155, 41784, 38109, 30137, 27952, -4337, 7261, -8950, -27825, -6087, -568, -10070, -10080, 6391, 7202, 7748, 10609, -29361, -21979, 522, -242, -10845, -39679, -5416, 1196, -29373, -27814, -1380, -16959, -71912, -70830, -49872, -37122, -29687, -43496, -43497, -46867, -45602, -23277, 9785, -21246, -14786, -8453, -13989, 11094, -158, 17317, 20756, 24630, 23388, 15016, -4287, -6248, -20690, 627, -7013, -12443, -24577, -11729, 8065, -6354, -51862, -63322, -26478, -14679, -35059, -32820, -3403, -6222, 3001, 35904, 30697, 9645, 5353, -22774, -28068, -17477, -18119, 2615, 5636, -25426, -31443, -53061, -36572, 10944, 26384, 61662, 59788, 62029, 25370, 4128, 7811, 6433, -4167, -789, 28219, 35930, 26213, 45832, 56531, 18484, 22839]
11695B2839J5145J45k0618n0059r35j159J453j1266n439K0093o986K0284M9663
11682C3160K6604k9104m6675m005J2925j9019j667K599J1025R106J34K4102j922
11669A7263n1353J3799J617p451j4375K1319K7516k0334j0459m703j2317J9201
11657b0277L7865k8752j0384J8666L774j2779j3587k436K4643J044j0301j2945
11645b5469L626L391O882J7579q081J5637j2770m4225m8186n03M3134L5294M728
11632h963j2882j5644J3905K7887k1382k6084N521K0733j0959p05L4725K5265
11620C1417o612k618k5201l7518k87K5688Q822R472j7286j7471J296K8312l128
11607e114q955j6334J7200M3948j5496k1309k514K5960R158l0680j0091K4937
$$ y = [22839, 37984, 38129, 17511, -32548, -33483, -34642, -33189, -44455, -49894, -29801, -36787, -16503, 33160, 59764, 30660, -16015, -20020, -7095, -26114, -27781, -25182, -14157, -5051, -4917, 19185, 17263, -34090, -20291, -18674, -26125, -40500, -19181, 8335, -11999, -22458, -27161, -39478, -20277, 17588, -11164, -21548, -2882, 892, -11887, -25474, -27910, -3267, -2223, -12524, -25469, -21843, -18452, -11570, 6009, -2072, 13565, 795, -43430, -91616, -92119, -48985, -13691, -8963, -21845, -37489, -23584, 4303, -17079, -43163, -37642, -16909, -27868, -28573, 6152, 31417, 24805, 22187, -3014, -40532, -40819, -15131, -6309, 3163, -14123, -31594, -30298, -1986, -5114, -14069, -30403, -13203, 30745, 15249, -6060, -8574, 17386, 26544, -4136, -14227, 10710]
11595A0710K0211P089Q334k001l1853k8653j1689j7790J9902Q520j0355j6894
11583d4469o788J2334K0721j2506Q388K2765Q013K9770l3947k3484J8254N648
11571D699l5511K2871J5611j2325N546M576K3118j7712l7044l3158M4750O968
11559g611j3208L1743J3568l6002J4348J4961j8480r301Q773l702n310o994j2534
11546b9749j4617O381Q953P156Q493N541o194K691j1214J0294K2562j5122K244
11533b581m695j7317N611J8655M141p21k537R985L653l9241j0826K7616J7668
11520I411J3410Q387p144k4525l6265J0465K7500j8078k9344j2250N2741K1206
11508A5514J4036j6633l5278L657P860N945j4647J0220R741k1810j8642r331R876
$$ y = [10710, 30921, 38010, 46344, 44343, 12490, -16163, -27852, -45642, -25740, -17220, -27575, -44469, -51257, -38923, -18202, -30708, -22320, 445, 8458, 38228, 4281, -19203, -949, 4699, -30812, -7941, 7670, -4655, 891, 5467, 28585, 10873, -26171, -59329, -14579, -7611, -20819, 10924, 24492, -11510, 2838, 17799, -681, -9982, -1209, -4911, -10221, -17215, -29749, -44366, -37985, -29032, -21876, -13383, -7842, -14036, -11345, -22559, -12265, 10297, -4825, -2581, -7276, -24593, -18982, -327, 3814, 3093, 556, 10541, 14194, -25047, -35873, -8257, 9411, 22821, 31208, 24064, -461, -36726, -26261, 1239, -16839, -46183, -58433, -5692, 15514, 29550, 12917, -22361, -18704, -10844, -4899, -19546, -9326, 415, -21395, -40037, -49368, -39492]
11495c9492J6165J2102J5169R137j4836j0956J3530j7580j7928l4689K971K9836
11483c6571L8346J6019j6108P991q756n2720j3597L1998J9362L40Q862r517Q962
11470e389j1091R556k0494l0763m426O075J7232k085J8752K7472J2402q738p337
11457A166k1354R067K1323j3712o8J1331O92J5890J2750P452r66l0345j703J2365
11443B3888k49l1470k2955k569p160N915M4004k552l266J5259J6335j7120j6801
11430A259N011l3180p257j051p632q047k1556o23K1353J0361J5319R256K5775
11417H988M0393J4597j8178p159J7457m738j8818j9336K1851R65j3219L91j6096
11404G098j6565J6344J886O874M5083l42j5896l966k2065j9593r155o77P322M554
$$ y = [-39492, -23327, -11225, 3944, 13081, -1755, -12711, 819, -16761, -34689, -69378, -66407, -36571, 1775, 17794, 1686, 9677, 921, -51799, -65396, -33398, -14036, -13696, -4834, -14351, -5389, -16480, -6924, -27418, -58181, -62607, -56532, -39300, -41385, -22633, 4839, 17241, 8503, 1166, -20188, -11121, 10202, -3510, -3578, 7753, 8445, 24335, 37085, 44537, 43571, 13226, 11523, 23888, 23639, -7831, -30786, -33355, -40515, -34600, 9404, 6852, 3586, 18845, 35180, 18060, 1259, 6270, -26910, -34167, -35218, -42850, -50897, -72453, -73076, -51723, -41362, -26043, -16787, 8988, 49381, 63978, 45800, 38641, 56098, 51360, 32542, 13206, 35057, 36022, 22803, 23194, 7098, -9467, 6877, 8763, 15637, 60720, 60378, 44482, 40516, 18451, -1142, -10297, -10974, -3652, 902]
11390I02n840R33J1997j7293k9093N909K1401Q513l496q322K6800M4020j167j4198
11376D1066j8848j8780n388J1540R427J7837J604k9947J0109K3506j6303r313
11364A6510J2958R657K025P129J0002L367n832k0230l8871j0751J2151L0729J3982
11351D2826J3652L298j0614j4397k0428l5868m599R363J3961J7876J0107j409
11339B3768q109K6377J4127k8971o907k2213p65K9964O41k0326M5811Q333j1019
11326E0711j9448m4523q854L825Q273J2361O138K5033R861l5851M199J9951m494
11313B7182k4094l9087j6243N1481M0617o916j4355k0642k9707M114K0482q990
11301a6158k4871L2428K1986o78J4475J5277l0291j3947j0888j1041k0312J548
$$ y = [902, -4938, -4005, 7992, -9301, -38394, -32485, -11084, -2571, -6067, -14389, 12411, 56431, 55264, 41066, 22218, 3438, -1950, 9590, 19017, 36854, 38458, 8511, 18620, 42126, 25823, 16510, 29468, 39125, 41150, 48279, 58281, 61648, 55816, 35586, -3285, -14036, -1885, 28844, 42826, 56478, 59776, 49162, 34765, 14337, -21531, -26130, -16767, -2806, 15070, 25177, 23768, 15659, 42036, 56163, 27192, 20285, -1928, -2693, 27271, 27912, 7586, 53397, 61730, 50711, 31263, -13260, -22114, -18289, -10016, 2345, 8483, 33516, 43377, 7526, 11725, 31676, 27182, 3088, -35999, -52242, -761, 39856, 32940, 18585, -2057, -31764, -27650, -7168, -16158, -41029, -8601, 13385, 12707, 27182, 42459, 12168, -1779, -12667, -23708, -44020, -42472]
11289d2472R601o175r385K5794K2105J3923j3517J1360R970k1395M00k5168k339
11276b7298j3952j8392L430K5350n542L079J5657J536P826M1292n186l159j0922
11263A3719L487k1728l1996j7179M425L3551p580j1038Q785L783O540j0072J3965
11250a1338Q473l6137j8680K269K348k6666J2235L0686J9116L1702L0856m8368
11238c504m7709l615m029L3782J3298j7909l054J9662l298j4172m00K5455J5113
11225I620J0120m0865r7K9855J2757q646k7163j6620J0967K2143J145J9919j5478
11212G657l0474p513L4474K823j1363p396J3790J9581j8246k6575j3867k802l604
11199d3515R768K0738k4976r043K2488Q461o906O562m745R139J6467j2396k3643
$$ y = [-42472, -32871, -39046, -48431, -22637, -532, 13391, -126, 11234, 21204, -191, 209, -24959, -27298, -41250, -59642, -56212, -30862, -36404, -33325, -17668, -16132, -8306, 32986, 27800, 24641, 13719, 17206, -4522, -36518, -53697, -49272, -15721, -23301, -34339, -25554, -21771, -15231, -25303, -11338, -2865, -39002, -57682, -55413, -53065, -79731, -67496, -36810, -17694, 14008, 44864, -3504, -51213, -54828, -58857, -25075, -11777, -29686, -32740, -13078, -16376, -30548, -30948, -5493, 9620, 19740, -21125, -21222, 8633, 21390, 12744, -14419, -31039, -20072, 2071, 3216, 23135, 7657, -22817, -30330, 4144, 6967, -4396, -11792, 1998, 21579, 3333, -23242, -37109, -39911, -43515, -33747, -13009, -37985, -47028, -24540, -16079, -22985, -16423, -21168, -12029, 4438, -7958, -31601]
11186c1601o648j5257J1733J3400J4713P519k179j5487p657O025J9148j1920R088
11173i123q04J8767j9729N377K5429J7208l5567j5890L158L271n414J7270P871
11160A1824j266j368j167m751l5003j143J669K3412J0596j2556k0342J8778J1316
11147al1456Q858K6909l265J1432j9868N146L465k351K2007j706q132j9046l8937
11133d6945J4426M0692k369j2434k4337J4428K2420M3439m469j0782l0258k0653
11121a6842j5624J0012J9051k1954o861M1748J352n2771l2344r360K0623N6204
11109f766m931m8486m406L0561L0780K0160K0043L562k7934j1466k2907j8306
11097d0096N360P569O930m3026J0232L4419j2675J243R006K866q515j6030P936
$$ y = [-31601, -38249, -53506, -41773, -28373, -13660, -6141, -8320, -23807, -31464, -25439, -6291, -18211, -9123, -9927, 8840, -10889, -5512, 19917, 37125, 1558, -14332, -11174, -7903, -13317, 3953, 11824, 10558, 9190, 8023, 3272, -31731, -32874, -31205, -7793, 2803, -9753, -30095, -11317, -1, -31457, -22599, 4310, 1045, 12477, -7391, -2245, 1220, -1131, 20876, 19170, 11038, -8008, -46945, -32519, 8173, 5804, -6630, -30967, -16539, 5881, 49320, 44851, 34069, 3811, -16842, -32466, -22454, -3403, -25357, -32218, 9530, 10882, -41889, -74233, -83593, -62970, -6766, -11697, -60183, -64589, -34028, -3248, 16912, 36955, 40517, 12583, 1117, -21790, -40096, -34736, -27167, -20237, -63263, -53031, -18612, -31287, -30044, -21038, -18172, -26687, -42717, -34781]
11084c4781J0478p177j864K879K5042J7034J0356l8594k0261j7762Q025k902L3812
11071a5715N302m953l4847j0275J8801K7390K4555J3031M098n237k6518k329K4718
11058A8021k1379n292j2382j9682J5587q103l637l68L175O745m609J4875J0912
11045f137O381k212L66K3175r85j0982o451k3849k8997J218J4589K9102n095l588
11031a3465N399K020k7815k8629q858N6202J9755j7704l2024K4476o59Q348J0455
11018b499k0299N172K0283p083j6624j138K5821K0301K4506O592j6148l6106J4949
11005A7727l4763j235N0178J7748n0934R457n839n152j1221K2299J1273q470k1140
10992a0072n784N237p158j336J968j5037q529L5029J9489N901j0357J6366k2236
$$ y = [-34781, -24303, -31480, -33344, -30465, -5423, 11611, 21967, -16627, -36888, -54650, -46625, -49527, -15715, -10413, -15366, -50213, -60488, -41687, -14297, 10258, 23289, 27387, 22150, -4368, -6697, 18021, -3358, -8650, -21032, -40714, -25127, -33230, -36867, -37235, -34060, -27315, -31924, -17049, -6137, 244, -1968, -1602, 21573, 20588, 9606, 3155, -20694, -49691, -48473, -33884, -4782, -9877, -13465, -8066, -6046, -33861, -62490, -71348, -15146, 4609, -13095, -45119, -20643, -21302, -12954, -2499, -22798, -17626, 2657, -4426, -21050, -22188, 3633, 23934, 48440, 55032, 38884, 2778, 17727, -17036, -18271, 31907, 49655, -1279, 8178, 2339, -2813, -14034, 8265, 19538, 11068, -10072, -15856, -10619, -17777, -19113, -17145, -32182, -40711, -5682, 13807, 19708, 9351, 25717, 3481]
10979C481j6660J4716K693p597K0598q680j1897q247L3445l23k2856j6911l3120
10966e1358j1526K5330K536K2780o730J4081K1385J4216N845q91l003l545L802
10953C2922j3564l7924l6876k7061j332m323M544L1021J9472P549J2051M135l048
10940a2434L57q093J2954q47k0278L573L9278nk0638J5296J5719j8189J1342M71
10926A8506J4533q068k011n428m4689k2703J2447K0465J4693M92r773k038k492
10913a6066J538J8803l0022j3577o853j2555j419n869J4787J2214M297N93J6934
10900a7195m410J1567m793j1522j5299K6436J6331j2520j6526j9831J2209K2764
10888a2789L2630l2124j8722K3179O724J7859L3462j1733k2228k8546p245R046
$$ y = [3481, -13179, 1537, 4230, -3367, 17231, 8551, -3346, -11593, 21852, 21529, -1327, -18238, -51358, -62884, -37554, -35018, -12238, -18968, -4887, 16498, 30714, 36559, 35668, 32665, 29120, 32922, 19358, -18566, -55442, -82503, -83835, -88158, -83614, -52593, -33121, -25572, -13521, -9386, -12434, -12077, -20170, -7216, -8063, -28341, -24768, 14510, 14505, -6133, 9163, 24882, 6693, 18035, 18506, 33039, 24971, 22960, 17532, -27157, -49860, -37413, -16948, -2255, -1763, -11536, -13574, -16066, -14528, 4275, -25747, -39324, -46177, -58732, -60151, -66020, -51233, -39019, -34722, -34129, -17195, -21605, -10038, -14831, -26353, -41652, -15216, 1115, -11405, -27931, -47762, -35553, -12789, 19841, -12283, -31005, -7826, -1102, 16757, 50219, 38486, 16258, -12288, -19533, -10487]
10876a0487K0022L911j1487j7851K3187M161j5651M870j20j3195J678p233l057
10863b1252R797J6362r353r485R131j1810K591J2028k4996j0928J5715K628k8554
10850d8126r415J3145L4858J0301m5701K143o154L4540M3909K985m152l6123j7302
10837b5092R833j634j2381K2051p49J7620J2306k7498l1434K2944K2192k005j6195
10824a0042k2599k0915K6670M123J3024J0634m874J153J3287k2868l5953k189
10812e0549L9911K4232J9455j9866j2304j8829L1215R455l1178J4945J854p955
10800C86k0690K1577L9700k9147q060J7307p146k5666j4834R59P584J8495N461
10787E926l848k965Q194j0793k7891P015K2003j0761L98R746K648j0500J5934
$$ y = [-10487, 9535, 13446, 1959, -15892, 7295, 11456, -4195, 675, 555, -12640, -10962, -18195, -21252, -11455, 4907, -4446, -13931, -4800, -16610, -14019, -1991, -26987, -37915, -22200, -19572, -48126, -57541, -44396, -9538, 763, -44938, -42795, -48949, -14409, 29500, 32485, 28333, -7790, -25092, -15259, -16893, -29274, -7223, -7972, 9648, 21954, -5544, -36978, -14034, 8158, 6153, -10042, -32641, -53556, -26886, -22763, -9739, 895, -3979, -2826, 10461, -12407, -48360, -50549, -10638, 13594, 33049, 13183, 879, -17950, 13265, 22720, -8458, 6487, 8341, 386, -20304, 1273, 40973, 11826, 3766, 21073, 13927, -11739, -26573, -25614, -18030, 465, 5926, 2078, -887, 7307, -3486, -31377, -24362, -2359, -13120, -12722, -2976, -328, -10828, 5106]
10774E106J8373O275k5570r850P012o665L717J8969p60k2671l318J5543j5800
10761i639l497J7254j0157k1016j2274O711J1811m260R507K0597M08q639l122
10748f316L0959K4542j850k2053j1856m670K4781L064N855n120k1595o378N169
10735A4532k5403J7848M1874n157k5433j5960n120K723J923N34J0243j9813k1539
10722b8748J2761K025Q858P109j436k3510j9500O976J9082J6690O66K178R782
10709A2933k1168m0125M562J9028J6354p80q404m14l4914k0768P19K5275K4754
10696b2948j6454k3151N239K1674O685J3077J5400k0914p227P687N2699M58k5895
10683F330Q045k837k6508N495O976l4435k4108K320K7320L2972J1351J4633J864
$$ y = [5106, 23479, 29754, 4184, -5666, 1346, -5319, -1602, 17367, 16607, -6064, -9382, 6161, -9639, -13136, 4118, -6039, -27055, -39329, -32618, -20807, -25067, -15560, 5037, 5445, -3194, -6316, 24643, 49185, 47335, 25282, 13426, 8756, 33537, 36601, 42456, 37336, 15741, 9363, 14532, -10871, 6977, 48851, 43694, 18261, 2301, -2819, -96, 1827, 2361, 12604, -7209, -28748, -15987, -13962, -5104, 2005, 569, -22941, -42441, -35465, -16383, 307, 973, 3151, 12933, -8235, -48360, -43798, -24770, -8416, -9196, -17600, -18014, -52928, -73696, -72977, -47702, -22948, -39402, -62553, -57314, -35640, -28955, -15878, -478, -21392, -28619, -20932, 31767, 32225, 6330, 14375, 11538, -14970, -9475, -2499, -36934, -61042, -58722, -31402, 1570, 12921, 27554, 29418]
10670B9418L968Q390K718q880j7781k627j023n028J4995J4313k4560k2075j2601
10657b0773M046R499K5645J7386Q351J304N526j719M813k2282l0384M122J3173
10644A8707L5625k3915k4246J8128J8601l0516P719j7862K6549J6228j4316l9321
10632h619J704P19J0289K3595K7459j0654r670k7214j9616k244l690k5706K7024
10619a6623J1699k4071J9282L2960m158j2644j0655q917j3460k0320j4890n976
10607f7773J8235J0899M037K0704P107j324k31r280j1523m1841K056L6702l0820
10594f3052j3035K5955O873k768k456L490o259p251J9319L4004j6148j9921j2500
10581e3749L622L822m377J7491K3624k1151Q51P908j7665l5177J37L9298K1699
$$ y = [29418, 33386, 41776, 44494, 35614, 17833, 15206, 14183, 9155, 24150, 38463, 13903, -8172, -20773, -16727, -7228, 18417, 35803, 44154, 45458, 50984, 49265, 54078, 31796, 1412, 5534, 18707, 54332, 30417, 6171, 24299, 42900, 12384, 20103, 2241, 28790, 45018, 30702, -8619, -6915, -6196, 4093, 27688, 55147, 44493, 34823, 7609, -12007, -14251, -17941, -43647, -16623, -4924, -28995, -9713, 23247, 19089, 6445, -4210, -13127, -26587, -46907, -61797, -67773, -49538, -38639, -34602, -13898, -6791, -8115, -8346, -17626, -29149, -70990, -68934, -32232, -63052, -76087, -50132, -43259, -46027, -48483, -44993, -51252, -58503, -39184, -5180, -21328, -41249, -53749, -50127, -46305, -50682, -33191, -9567, -30718, -29867, -21959, -39624, -74801, -74664, -35366, -13667]
10568a3667K1771j1610k699o515p839p666j3778J4171Q997j8603j5224J3345J8469
10555b0848p364J289k1757J524M3507J4270k5665j7346j0048N000J0556j0394
10543c7276k5562j1924L6074L9179N877j2916j6118r347m404K3111K5155k3431
10531a1582j0151j5133l897j634j73K860J9730j6578K2709J7047j2880o36j1697
10518b2015n451L423j8423M107q582k0060J5320L6804k47j5760J5165J4872O599
10505E752K1880p823l0368l940J6839J9256K4179M019k9205J0240K8663k1037
10493C8455j1221R092j4900p643j6673q549J3749J7717o555K1919L7288j8846
10481E3833m1081J4187J0737k34l208r763o771o942k0210j6340J5697K361m5840
$$ y = [-13667, 8104, -3506, -6205, -12720, -20559, -28225, -42003, -27832, -18835, -37438, -52662, -39317, -20848, -28212, -26923, -48680, -47156, -3649, 10621, -15044, -32390, -42438, -37438, -26882, -37276, -62838, -74762, -38688, 491, 6368, -6548, -22666, -32013, -36417, -13306, 11849, -11582, -21733, -36866, -40763, -42397, -42570, -39710, -19980, -36558, -13849, 3198, -9682, -10318, -22015, -27466, -24043, -42466, -38359, -46941, -67001, -51681, -14877, -15124, -30884, -15719, -847, 5752, 27632, 19809, -10559, -14499, 2340, 21596, 45775, 49794, 20589, 30829, 59492, 38455, 27234, 36326, 21426, 13783, -2890, -11439, 2310, 20027, 13472, 35391, 72679, 53833, 12752, 26939, 37676, 37442, 34234, 24471, 17700, 10758, -9452, -25792, -10095, -7734, -53574]
10468e3574R25N2889J2108p684N553J1731k738P129K0718k7519m4927J449j6825
10455d0765l536j6056j2711j0764J0541L4717L457k0232P100K585J8236J4347
10443a3081J1284J0351j7650p770j2277l914k149j4051J4717K2113O536J968J4819
10430A0896j9962m1684K765n102j8592N5290J8R616N828j2319p265M6045k121
10417B3413k6478L7309q053k5034k7228J3939J9666q614k5876l417L2717p545
10405e201l0664J5676L7591k8685k0041j4858J134K5065k9157k8401J5594M5397
10393a6550K8434N240j8229q284k393l4396L927r630m311J8149N831J005P510
10380b3697j127q970J3692l7896j4506J9766K2722J6730L5746j2481r326J9153
$$ y = [-53574, -52649, 240, 12348, 4664, 10217, 21948, 19210, 26339, 47057, 19538, -25389, -23940, -40765, -44301, -60357, -73068, -83832, -73291, -38574, -35117, -55349, -48249, -45664, -27428, -13081, -1797, 8554, -9096, -16866, -29143, -33057, -35206, -49257, -34540, -12427, -5891, -3923, 10896, -9066, -50750, -47985, -53087, -71679, -16389, -16371, -6755, -927, -13246, -20511, 25534, 23413, -3065, 34244, 26191, 1157, -26071, -12132, 7534, -1080, -26956, -30373, 2344, -5201, -35865, -20189, 17402, -11283, -31324, -46182, -45048, -19983, -49140, -77541, -61947, -16550, 11884, 17124, -1105, -9389, -11782, -46178, -42251, -51881, -56192, -38043, -32212, -31207, -23697, -24824, -33794, -20102, -57998, -72504, -52738, -30016, -13286, 22460, 9979, 653, 19806]
10368A9806n123r947L1168J6294l5543j8737J2211L921p165n661J6150J0946j5105
10355A3215J1119n438j9997J0813J6838L633M922J1899N772R098j2987k0936l8320
10342a0369j26k715k5826N880M974J7382K2129L0652k2045n0388j9456J1817K0415
10329a7676J7334N551r052m496k6159r798P480J2123K0798M762k4981n1646N212
10316g0548K3707j657k5937P417q58K395l074k7544K555J5723J3343K4071M156
10303c6251j4629j200j6267r289L3311L1494j6225j2088J8610m904M622J7292
10291e524J473j227J1081N615m136k3461j4807j4780Q319M62N603K1939J692P527
10277b24n979k906q40j0136Q710J9012Q134k3925j1280Q484L30N352r223o456
$$ y = [19806, 14683, 4736, 35904, 52198, 16655, -2082, 10129, 14050, 6885, 1224, 17374, 28320, 13215, 24334, 18896, -1101, 9712, 26550, 30183, 35105, 47004, 52776, 61874, 48887, 27951, -10369, -10495, -13210, -39036, -33156, -28182, -10800, 11329, 41981, 19936, -30452, -49908, -38091, -17676, -342, 5209, -3843, -8339, -34498, -44296, -36816, -24693, -3895, 867, -24114, -75760, -70548, -46841, -48498, -74435, -67018, -67876, -65481, -68555, -96099, -93544, -77821, -64478, -40407, -36251, -50880, -52080, -68347, -77636, -44325, -12831, -29056, -41144, -22534, -27438, -22816, -5524, -4051, -5278, 5803, 11418, 7282, -16179, -30986, -45766, -37447, -36985, -31382, -9443, -7751, -224, -6203, -9109, -9949, -20085, -11375, 7637, 15771, -8154, -19434, -10950, -10620, -5268, -14491, -20947]
10263b0947K5768M825J7086k7885l3408K334j4329j9339R978K5643M9738J9389
10251C8853m1105P172R692k1986j0726K3229M504j6342j2851r93l603k1107J5063
10238c0200L6699j4115k564L459r947j427P408N848J1052k8234r342M917j1826
10225c8272P295J294L3206M677k0375R20k3116R681N5k063K9173o160M287K3486
10211B4088j979J3535M1495n195k5952l9096j0490J4008j6620k4146o327M7589
10199A0910N334q946L497l848J337j694j6603k6120j0097k2349j8690L1398R438
10186d6433P334j5995k5025P951Q849N9290J1513l3101l3402J58J9305J5719l907
10173b7744M498j5528K0103R530J3340O102l1275J6988R597L593K3293j9066k5839
$$ y = [-20947, 4821, 9646, 26732, -1153, -34561, -32227, -46556, -65895, -55917, -30274, 19464, 38853, -2252, 4920, 14612, -7374, -18100, 5129, 9633, -6709, -19560, -20553, -24156, -45263, -30200, 6499, -7616, -10180, -6721, -16668, -18095, -10687, -4839, 6213, -22021, -31363, -26446, -38272, -30977, -29683, 3523, 8200, -12175, -11255, -34371, -24690, -24635, -26698, 2475, -3685, 602, 24088, 22109, 35644, 77139, 71944, 45992, 6896, -3594, 10414, -6206, -30352, -36679, 10910, 16244, 7298, 10795, 6947, 8284, 6590, -10013, -36133, -46230, -68579, -87269, -55871, -46433, -39099, -55094, -80119, -72168, -63319, -4029, 7484, -25617, -59019, -58861, -39556, -23837, -27744, -23246, -38774, -18671, -9141, 4199, 10301, -20974, -3986, 5611, 9204, 32497, 13431, -12408]
10160a2408Q858p263M62j3158j3601L757K8930K2155M366J15P042O041j8516j473
10146A5307J3305k4668k1298J1711l0523k7621K1478M6353K9255l2626l4910k98
10134c4535K6032l862m382k0013N530L91K939m20J1176K437J5120J4097m259k3445
10120a3194r355k566J8510J2108J8288L244k7406k9035J527J6411K3774M097r307
10107G096j7750o007O554R853j5568M1107L5165q017j8605N31j6127k4942k722
10094i432j4772K852J851K5184K7860K449j2790l3829k6101j6542N471J5137P16
10081c1946q100J5218J4252R421j9863K876L6118j6758k5363k3451l1236k138
10069h0970L6281K0340O192k1823L577k583J2108J1876J1971K7769r309l1819
$$ y = [-12408, -3550, -10813, -10351, -23509, -37110, -33353, -4423, 17732, 22098, 22213, 29255, 35296, 16780, 15307, 28612, 3944, -17354, -5643, -36166, -63787, -42309, 4044, 33299, 673, -34237, -34535, -8503, -12365, -16747, -36760, -31230, -30839, -27900, -28320, -17144, -14707, 413, 14510, 10251, -13194, -22549, -25115, -6605, 5503, 23791, 27035, -371, -29406, -27879, -11468, 12306, 16403, 7096, -10654, -16661, -10107, -254, -15822, 25285, 60450, 52433, 33828, 34359, 18232, -6710, -9432, -24204, -21352, -19501, 5683, 33543, 35992, 23202, -10627, -36728, -53270, -47799, -32662, -31946, -40046, -24828, -10576, -1155, -21018, -18142, 17976, 1218, -24145, -47596, -78832, -80970, -44689, -24349, -18157, -39980, -36403, -38986, -26878, -15002, -3031, 24738, 15429, -16390]
10057a6390j9663k4575K8064L4714O747l502J5295L2942p306Q095O48k8484k3408
10044C177O548j6963l0616K7431J7431k1220k2011l8088O518K0750m76O296R509
10031c1714l0843J6572J7645m5354J2257J3877K824o915K884m2848j1437L7358
10019f5694N2822p289j2209K2028J3077j3309L4308J0157j2457k8277P762Q913
10007I832l032m694N046M8964J7650m7273l2442l70K7887J901l4918k1648O38
9994c2459L348J0891K9600j31j5762M834j7906O597j8641l1485K8772J5616J0328
9981f398K8970R611k2942m2468R679J4922L8715J0600J036n323m582q875j4990
9968G955k2546k4276P434J2209K649P947m121j2988j8097J2619R714J0014K3340
$$ y = [-16390, -36053, -60628, -32564, 2150, 8897, 5395, 20690, 53632, 46326, 54421, 55069, 26585, 3177, 9725, -7238, -37854, -10423, 7008, -14212, -36223, -74311, -67793, -47043, -47519, -41223, -31714, -62557, -45985, -28340, -73694, -61437, -47560, -44736, -51651, -48767, -91615, -103052, -65694, -12872, -20161, -32370, -10342, 2735, -10574, 23734, 33891, 21434, -6843, 919, 9832, 6800, 2106, 7152, 56116, 73766, 26493, -5949, -6319, 21568, 23469, -11449, -33097, -32459, -29111, -18220, 11380, 11249, -4513, 321, -17585, -10988, -29629, -61114, -32342, -16726, -6398, 22572, 32183, 9241, -33227, -23548, -8626, 30089, 40689, 41725, 36402, 31820, 22945, 7955, -14591, -38867, -31433, -19224, -16575, -8628, -12749, -25737, -43834, -31215, -21501, -11487, 11853]
9955A1853p630j5022k072R696r476J2514J8143j0617j2079K2151R415k917k755
9942B1204j2684l6030o158N085K2288j3956j3695j646R353K1909L4544M558j3802
9929B0970j9092O205k560j8011K4646m0573M931J8125N336n493J2163k6223J3955
9916e621J2754k9238J8017K7459P599l8140M109N817k961j081R452O301j1670
9903B797k9492l701M6570K7539j0679J315l270k438M371l3547j8273n656L7043
9890A2579M2846k8061K5980K0395l1506p409J1470n758p115K2924L8864K660K0909
9877A18778P540j3828p407K2768Q115q033k1297K949l4064l0140J4473K1764R935
9864I1553O7j2220l306J9730j1358l5065p256j8451p798J4983J3249K0193k0045
$$ y = [11853, 4223, -10799, -12871, -3175, -12651, -137, 18006, 7389, -4690, 17461, 26876, 23959, 21204, 8520, -27510, -33668, -28583, -6295, -20251, -33946, -35592, -26239, -4330, 30214, 34772, 20970, 1878, 8083, 5523, -12488, 12158, -28415, -23484, -5359, -23, -5516, 6647, -19576, -5621, 7133, -22105, -4088, 23371, 30970, -7170, -3061, 2756, -205, -1286, 8166, 14467, 2797, -26695, -30396, 16174, 43713, 33034, 34349, 31079, 28641, 33012, -535, -18808, -24464, 12579, 55425, 27364, 53344, 73739, 42233, 34824, 46294, 40536, 33421, 56345, 95209, 97869, 118778, 126318, 112490, 105083, 127851, 135966, 127933, 106636, 109585, 75521, 45381, 59854, 81618, 91553, 91620, 79400, 76094, 95824, 84466, 49401, 42145, 23694, 15896, 30879, 44128, 64321, 44276]
9851D4276j0566N6090J6917m0553j2468l0445M447j8165J6584L2570J9521P423
9839H5631q480k438j0187K9266L3380O390L8340j697J716J113J4984L0648N1695
9826B70361J8512K4115L4755M3039L7147P8105R0880J04776J57390J89570K45684
9815A294334L30025M24175N98127R13428J236514J661945K154570J953650Q98625
9806A1465393L4199o85183j308109k066238k349914j711701j004469o08213l87271
9797A378494k47145j65604r3733n3748r210p7P9454J86461K41771L81260N93127
9786B291050M72141m61481r05219n59501k63279j59682r0274n4833n0334k5769
9776A92819l5991m9629J110J7262k9051k3436j6010M461r33R311L931j8631L2610
$$ y = [44276, 33710, 89800, 106717, 66164, 53696, 23251, 27698, 9533, 26117, 58687, 78208, 85631, 77151, 74713, 64526, 93792, 127172, 133562, 171902, 170205, 171921, 173034, 188018, 218666, 270361, 288873, 312988, 347743, 390782, 427929, 506034, 596914, 701690, 859080, 1048650, 1294334, 1624359, 2048534, 2646661, 3560089, 4796603, 6458548, 8613118, 10566768, 11465393, 11499592, 10814409, 9506300, 7440062, 5090148, 3378447, 2373978, 1765765, 1378494, 1131349, 965745, 872012, 818264, 809054, 808977, 888431, 1074892, 1316663, 1697923, 2291050, 2763191, 2301710, 1396491, 836990, 573711, 414029, 323755, 268922, 218588, 192819, 156828, 107199, 108309, 125571, 96520, 73084, 57074, 61535, 60602, 69913, 73844, 55213, 87823]
9763H7823J8919k0765M446k019p610K067k0829n101n827q309K8162j0446k5402
9750C5109J4295L638j309Q279J610r630J550j3548r144j1921r876P431O578p256
9736A5806J023r30l275r786P691j4597j223L2129K0917J8705k2386q296l575Q280
9722D0483j0419Q107R553J6777L3865K242p906M0617M6172L7162K6998O9708P9387
9709C92746J15123J65479J57389K7799j23167j82943j45054r2995q0120n8380
9699A75877m4819m1563p926j471r331l2691l160j1686r977q687r703J5030J8794
9686B8687J0256j886l8467q098M0039J0055j0013k6467j2344k5134J8254O4661
9674D9543K9320M306j4456m3876k9405N679n887p949k603J3539j313k0433l5118
$$ y = [87823, 106742, 85977, 90423, 88404, 80794, 82861, 62032, 56931, 51104, 42795, 70957, 60511, 35109, 49404, 53042, 51733, 60012, 61622, 51992, 53542, 39994, 30850, 18929, 9053, 16484, 23062, 15806, 16829, 15899, 12624, 2838, 10529, -4068, -5291, 26838, 47755, 66460, 44074, 35778, 32203, 40483, 30064, 38171, 47724, 64501, 98366, 100608, 92702, 133319, 179491, 216653, 243651, 313359, 392746, 507869, 673348, 830737, 858536, 735369, 552426, 407372, 314377, 234257, 175877, 131058, 89495, 81569, 80098, 70767, 38076, 34916, 23230, 13253, 4566, -5137, 9893, 28687, 38943, 37057, -1410, -9508, 30531, 40586, 30573, 4106, -8238, -33372, -15118, 49543, 78863, 83169, 68713, 24837, -4568, 1111, -4776, -12725, -15328, -1789, -3102, -23535, -58653]
9661e8653K5617N4404Q756k4698Q019l793J05R524k659p337j0546J1031J9434
9648B9204M04m031j4606J5890J1925R557j9358j4481R397J5639l1898r035M0231
9635C8838K3462r601j7148J1873K0653j2785j6474j5128Q05J1594J13n435j7023
9622A3744j155k711J5635j2502k7378r381N871J769J2091k7695J7861o025j2600
9609c2476q230O773L7266J1058j994j6022R310J4710j0984k1053k4645K2581L577
9596a0129K3709P246j3417l8972j3053K3513O695o078k0926O374K0527K3048L087
9583A1624o873o286M88K295k8222j4055J667J0684K9151M391n311j4872k982m083
9569b2384m5408N535j0458j4725J7615K1110K5162O102R803J759l0189k3781Q768
$$ y = [-58653, -33036, 21368, 30124, 5426, 13445, 9652, 9757, 19281, 16622, 9285, -1261, 9770, 29204, 29608, 25577, 10971, 26861, 38786, 48343, 28985, 14504, 23901, 39540, 7642, -1393, 38838, 62300, 52699, 35551, 47424, 68077, 55292, 38818, 23690, 24495, 36089, 36202, 30767, 13744, 12589, 9878, 25513, 13011, -14367, -23748, -17877, -16108, -4017, -31712, -13851, -19876, -32476, -40706, -33933, 3333, 14391, 12397, -3625, 5685, 20395, 9411, -11642, -36287, -13706, -10129, 13580, 20826, 7409, -31563, -44616, -21103, -14408, -20486, -41412, -35038, -14511, 8537, 11624, 4751, -1535, -1047, 1248, -26974, -41029, -39362, -28678, 473, 4864, -447, -15319, -18301, -22384, -67792, -62257, -72715, -87440, -69825, -48715, -23553, -17451, -7648, -5889, -36078, -59859, -51091]
9556e1091J2807k0645o730N045K9871M1371l664k7106j4866J0519j4382j2078
9544e0949O002K6347K2105j4493L8N861L5607j2055k0067k2853P134P099j0471
9531b0695K0907R659k3175L5607k525m5858J3348M0086k3493l6251J8829J0879
9519b682j6274J1942K3170l933j0026k5595n24J1893j0327n579n558K5840J8420
9506A0767J1573J8869K662K316k991J524O773J9721l51k7774k711o439l0335J983
9492E587k657l5859j2865J125J4089k134Q299l850k0460o74K8105L5707r113L866
9478I166j2949K766p972l717J9939M068O054K7157n413r082M466Q982j1395M569
9464C6639J2035Q425k0991j9158K4909J4384O145J5831k9563k9577k3753K399
$$ y = [-51091, -38284, -58929, -65659, -60614, -30743, 10628, 6964, -20142, -35008, -24489, -38871, -50949, -44947, -18600, 3505, -10988, -10950, -5089, 30518, 18463, -1604, -24457, -17323, -10224, -20695, 212, 9871, -13304, 22303, 19778, -26080, -12732, 27354, 3861, -32390, -13561, -2682, -18956, -7014, 16156, 12223, 2197, -23398, -23922, -12029, -22356, -27935, -33493, -7653, 10767, 22340, 41209, 43871, 46187, 43196, 44720, 51493, 71214, 70863, 43089, 40378, 33939, 3604, 5587, 2930, -32929, -45794, -44669, -30580, -32714, -24415, -28265, -48725, -49399, -21294, 14413, 5300, 9166, -3783, -1017, -8989, -12706, 7233, 11301, 17355, 44512, 39099, 30017, 34483, 43465, 32070, 36639, 48674, 57099, 36108, 16950, 41859, 56243, 62388, 78219, 48656, 19079, -4674, -2275]
9452b275K1344Q450M800P256K836J1583k4132J0219j149K3297J9067n518L097
9439G8875j3710k8141k2001K123N513L0187n596J1342Q709q717j8903j2544L78
9426B7515P549K5842L5798o18K544q538j5459j302J7391P54j9607J4395m200l5902
9412D6162K0680K6898K4j621O86l962J0982j5874R488k433M5608L8582m629n00
9398A70091J33J786m2115j3487k3908j7292p380q79l050k006j9213j0327K0222
9385E2575J1664K079m708P395N138J3536n29j8231n3153n663J0866m813J202L8154
9371E5512R916K510J0009r974J4249Q160J392N407k3507R37L316q584O691L2793
9357A08827r848L416J6908N111O822J8960J6123J8417k4945p473j4949k3743J792
$$ y = [-2275, 19069, 27519, 32319, 39575, 42411, 53994, 29862, 40081, 38932, 62229, 81296, 75778, 78875, 65165, 37024, 15023, 17146, 22659, 52846, 47250, 58592, 67301, 58584, 39681, 27137, 27515, 35064, 60906, 96704, 96086, 98630, 90092, 74633, 73331, 90722, 91476, 71869, 86264, 82064, 46162, 66842, 93740, 93764, 92143, 92829, 88867, 99849, 83975, 93463, 91030, 136638, 175220, 170591, 170091, 170224, 172010, 129895, 116408, 92500, 75208, 67828, 66949, 63899, 61893, 42680, 32353, 52575, 64239, 66318, 61610, 69005, 74143, 87679, 87150, 68919, 15766, 10103, 20969, 16156, 17358, 55512, 65428, 67938, 77947, 67973, 82222, 90382, 91774, 97181, 73674, 74611, 77927, 69343, 76034, 108827, 98979, 102395, 119303, 124414, 131236, 150196, 166319, 184736, 159791, 152318, 137369, 113626, 115418]
9344A15418o18l5421N008K0179l9142k1698J4092K9500L0294k953n4378P7l350
9331E7008R895R009l8963j7158N688j9095l0142J9995J4243J1702O410J9348p586
9318D0354L301l228j2961k140J8940Q571l412n73J2311Q049j4338m9l3425l3442
9304a2042K9074N6996K2286J2491j9593n487J3236J8164K6607J1833K9144L9806
9292B22515n1l746j6537K1760j0252k5035j8676k4199P914J5999J2134L81l68
9279A81839L5942j8411k6519j2175k4405q805p394k3246L6559K1543J5987j8819
9267A52096n487j4277o928L0364k880j3794J7504k232J1822L4360M3315J4141
9255B58004K1272J9537K0468J7563N1735L4439K4717K1206K6580L7413K9115k7805
$$ y = [115418, 114800, 79379, 84387, 104566, 65424, 43726, 57818, 87318, 117612, 114659, 60281, 60358, 57008, 66903, 75912, 36949, 19791, 25479, 6384, -23758, -3763, 10480, 22182, 28592, 47940, 40354, 43655, 40427, 27466, 25326, 44266, 52837, 49425, 48852, 61163, 69212, 54874, 54825, 21400, -12042, 17032, 74028, 96314, 108805, 89212, 83725, 96961, 115125, 141732, 153565, 182709, 222515, 222464, 218718, 202181, 223941, 213689, 188654, 169978, 145779, 153693, 169692, 181826, 182207, 181839, 217781, 199370, 172851, 160676, 136271, 127466, 120072, 96826, 133385, 154928, 170915, 152096, 146609, 132332, 125404, 155768, 152888, 139094, 156598, 154366, 166188, 200548, 243863, 258004, 279276, 298813, 319281, 336844, 388579, 423018, 447735, 468941, 495521, 532934, 562049, 534244]
9243E34244J0449P543l9251l3052j4638K1702J0379o83K7391P24L619K481n94
9230E30314j4356r312J6483n577J1485L6473j1586l171L3587K947k5522l565P925
9217E66125J1930M5445Q274K6086K2805K7839J3896O9004N2984O957N8628J11226
9205A021199J04396N1530O2839Q8138Q0822Q3204O0184Q6892J42141J24289J42549
9194B048183J70321J54310J89006J96055K31983K66728L01751L63695M23177N16179
9184D861388O36826O86887P94572Q81690R80416J006941R39838P88606M24318
9175A2001482l2249n00625q70293j088924j117436j062772r39980q50423o96513
9166D842267n91771n04371m25664l40833k77312k40415j88627j64786j53952j31195
$$ y = [534244, 544693, 552236, 512985, 479933, 465295, 486997, 497376, 496693, 524084, 524808, 528427, 530908, 530314, 515958, 506646, 523129, 517552, 529037, 565510, 553924, 550753, 584340, 587287, 561765, 558200, 566125, 578055, 623500, 631774, 657860, 680665, 708504, 722400, 791404, 844388, 851345, 909973, 1021199, 1125595, 1177125, 1239964, 1328102, 1408924, 1492128, 1552312, 1639204, 1781345, 1905634, 2048183, 2218504, 2372814, 2561820, 2757875, 2989858, 3256586, 3558337, 3922032, 4345209, 4861388, 5498214, 6185101, 6979673, 7861363, 8841779, 9848720, 10788558, 11577164, 12001482, 11969233, 11468608, 10598315, 9509391, 8391955, 7329183, 6389203, 5538780, 4842267, 4250496, 3746125, 3320461, 2979628, 2702316, 2461901, 2273274, 2108488, 1954536, 1823341]
9156A823341q6242n4382m6592m8258p3785m6284l6581k328j7904q493k5054m7792
9144A329646n2829n5701p1918m2864k5635l6792n7603m7130m3247l6478j6808
9133H42641k1685M48j9132j4309k8701l1601l4811j170j8905o9913o2292k0759
9121E19811J1015p052l4155l4856k2017J15J2422m2355j6880J8763j1365k7107
9109C66339K1649Q586R14R765j5857K0223J4398Q632K055o211L3826J2024O414
9096D82757J3337J0633J707n880k8875j7203J1833o989l4036k9770l1949m2178
9084C23387j6973K746l2484j9597l7196k0711j1343J2477L393m074M971r077j6692
9071A78827n277l101K1192J5159j2821r324K7193j6973n098j2774J9673R668k0020
$$ y = [1823341, 1737099, 1682717, 1636125, 1587867, 1514082, 1467798, 1431217, 1428889, 1410985, 1402492, 1377438, 1329646, 1276817, 1221116, 1149198, 1106334, 1080699, 1043907, 986304, 939174, 895927, 859449, 842641, 820956, 821404, 802272, 787963, 759262, 727661, 692850, 691680, 672775, 602862, 540570, 519811, 530826, 523774, 489619, 454763, 432746, 432861, 445283, 402928, 386048, 404811, 393446, 366339, 387988, 396574, 397488, 407253, 391396, 411619, 426017, 434649, 436704, 430493, 464319, 476343, 482757, 496094, 506727, 508434, 502554, 473679, 456476, 468309, 461320, 427284, 397514, 365565, 323387, 306414, 309160, 276676, 257079, 219883, 199172, 187829, 200306, 203699, 199625, 204596, 195519, 178827, 173550, 170449, 191641, 206800, 193979, 184655, 211848, 194875, 189777, 177003, 196676, 206344, 186324]
9058A86324k6211o835k2123L430Q732R880M650M805K565Q213L0803p100j3727
9045A83406m0874l199Q468k664j99q390Q890K1156K7094L580j1363K0571n3417
9032A53059l2832j5190q679M3746O5358O033l3822k667p151k7600M663j0093l3382
9019A01443p061J3135K405p597J4095o156l5164k2647r94O546n286K670L315K9835
9005H8539L1015K6383Q118n521k3506j9872J4247K752k2695L3469J9870k2237
8993A30562r462O878L7696K692k6182k3901j8348J3715L3281L5063K2507Q422
8981B12923m4707o8187j7756J176J3449P341j0604J4654N873R839j6071k8763
8969G9167J0369L1418L1172J4376J3796L020o741r781n865J8155N712j3740j7983
$$ y = [186324, 160113, 153278, 131155, 134585, 143317, 153197, 157847, 162652, 165217, 173430, 204233, 197133, 183406, 142532, 139333, 147801, 145137, 144938, 136548, 145438, 166594, 193688, 197268, 185905, 206476, 153059, 120227, 105037, 96358, 140104, 205462, 211495, 177673, 175006, 167855, 140255, 144918, 134825, 101443, 94382, 107517, 109922, 102325, 116420, 110264, 75100, 52453, 51459, 58005, 52719, 55389, 58704, 88539, 119554, 145937, 154055, 148534, 125028, 105156, 119403, 122155, 99460, 132929, 152799, 130562, 121100, 127978, 165674, 168366, 142184, 118283, 99935, 113650, 146931, 181994, 204501, 212923, 168216, 100029, 82273, 83449, 96898, 104239, 93635, 108289, 114162, 124001, 107930, 79167, 89536, 120954, 152126, 166502, 180298, 183318, 176577, 166796, 160931, 179086, 184798, 171058, 153075]
8956A53075j0880j4024J6196K9160J1281j2512J4396q451k4778k0982J0635J9059
8944A62175p233k895j5928l759P014m695K1163J7299J1834K0707J1742j2996J4440
8931B18868M168j4251R99O742n743K2175n4q48o232k4351k5n321j5541O248J9535
8916B06369l071K4502K572Q940N373l525P491j7317k4489L605j5075m72J3282
8903B08185L1351J6800l0778k7313l6314J5672N699r831M630k6825j4335n26J4761
8890A51176P247j4675q468k0548L19n866N259J1610L4698J9957j3977k6483K3590
8877A63839R981J8807K9542J082l0876j6018O644O828P588J7307J7049J7105L9839
8864B88717m931j3972q054k396Q715L334j2826O390l0670j4147j2266j0106r915
$$ y = [153075, 142195, 128171, 144367, 173527, 184808, 172296, 186692, 178241, 153463, 132481, 143116, 162175, 154942, 152047, 136119, 132360, 139374, 134679, 155842, 173141, 184975, 205682, 217424, 204428, 218868, 223036, 208785, 209784, 216526, 210783, 232958, 232904, 232056, 225824, 201473, 201448, 196127, 180586, 186834, 206369, 203298, 227800, 230372, 239312, 244685, 241160, 248651, 231334, 206845, 210450, 195375, 194903, 208185, 239536, 256336, 225558, 198245, 161931, 177603, 183302, 173471, 178101, 151276, 136941, 136415, 151176, 158423, 143748, 135280, 114732, 115051, 109185, 114444, 126054, 160752, 180709, 166732, 140249, 163839, 173820, 192627, 222169, 223251, 192375, 176357, 183001, 189829, 197417, 214724, 231773, 248878, 288717, 283786, 269814, 261760, 259364, 268079, 271413, 258587, 264977, 234307, 220160, 207894, 197788, 187873]
8851A87873o376O801L1229m152l2116q481L471J3684k4229j4725K0658K6003L5117
8838B34757L11m230o144j327K7427L5184J1138P622J1272J4521n698R032M6324
8825C80189N0283M3566N7239O7563L9147N1741L5143J7499K018k2103j9640j2713
8813F89932q051J5454l0379l2413l9924n5241l1021l9738N986k2560R144j0550
8801D50639k4415j6300m294J9118O113J4902K427P516Q1555L9918M9318M4531
8789F71028J02917M2139L5065Q5442Q7496R1882J18588J20407Q7982P3482J17666
8778A634094J27357M6747L1519N8022K2553l1427l0809k4448M679k4388q2566
8767A731333j09934q8549r7809r0494n9144o9011q0730q8154p0062m9784j3073
$$ y = [187873, 181497, 188298, 219527, 215375, 183259, 174778, 178249, 191933, 167704, 152979, 173637, 199640, 234757, 235068, 230838, 224694, 223367, 250794, 285978, 297116, 304738, 316010, 330531, 324833, 333865, 380189, 430472, 474038, 531277, 598840, 637987, 689728, 724871, 742370, 744388, 722285, 702645, 689932, 681881, 697335, 666956, 634543, 594619, 539378, 508357, 468619, 474605, 452045, 461189, 450639, 426224, 409924, 405630, 424748, 430861, 445763, 448190, 455706, 537261, 577179, 626497, 671028, 773945, 816084, 851149, 936591, 1024087, 1115969, 1234557, 1354964, 1442946, 1516428, 1634094, 1761451, 1808198, 1839717, 1897739, 1920292, 1888865, 1858056, 1833608, 1838287, 1813899, 1731333, 1621399, 1532850, 1435041, 1344547, 1285403, 1216392, 1135662, 1047508, 977446, 927662, 914589]
8756I14589m6037n2735k3167K0520N283K1757k2635J5002L8375N4685K7576Q655
8744I61868K4927L1637J6688L5343M4567M7790L3918J4062K9643N9964R1273J07951
8732A499631R3705P4900P4226P8463J04802J24141O2639N2725J1960O407O748
8721B190347n753q1559p8618r9573j17594j33933j46974r1338q2866j16923j26534
8710A108682r1146p0063o6733n5974k9155m7478n0811j8884k0045k8004n3681
8699E76708k4286l45k293J4392J9462N7435M0180k2768l1164J6499J0938N7222
8687G11980O0530O5348P2929M4535N2926N4333O9071N6924P981j2097L4816L7026
8675A256302l236m2331j7199o7537r1237j00160p6428o0924n4538p5779n0430
$$ y = [914589, 868552, 815817, 792650, 813170, 818453, 840210, 817575, 832577, 870952, 925637, 953213, 961868, 986795, 1018432, 1035120, 1070463, 1115030, 1162820, 1196738, 1210800, 1240443, 1300407, 1391680, 1499631, 1593336, 1668236, 1742462, 1820925, 1925727, 2049868, 2112507, 2165232, 2177192, 2183599, 2190347, 2184594, 2103035, 2024417, 1924844, 1807250, 1673317, 1526343, 1435005, 1352139, 1235216, 1108682, 1017536, 947473, 880740, 824766, 795611, 748133, 697322, 678438, 658393, 630389, 576708, 552422, 552077, 549784, 564176, 583638, 641073, 681253, 658485, 627321, 643820, 654758, 711980, 772510, 837858, 910787, 955322, 1008248, 1062581, 1131652, 1188576, 1196557, 1184460, 1219276, 1256302, 1253066, 1210735, 1193536, 1125999, 1034762, 934602, 858174, 797250, 742712, 666933, 616503]
8664F16503k0056l6315o5963n2635j111M246l3691M531j7162k3798L902j4792
8652C63659j1040Q672k765k7067J457J1137k0797l4099k7501L566L210p877M1545
8639C02100K6142j2985m097M6671J8167N536j5904N570J7560P575j2827l9230
8627C44278n1723j3217k3593M150J3981L746q270p138l4207J1210l193l8209r5
8614A97720k754j3978N69m716O440p044j8607J9908j7571Q705O211j1395K0334
8601A83822q50m5165N980L806l3303O996N1280L2121J0354l724j8995j6473m0993
8588A34856j262L4143K1637L1102R934K1533k123R152p661l298n718j5605k5289
8575B01401P001q211j5088k5835J3698k9440J255j0074j7059J6024j2238o144
$$ y = [616503, 596447, 560132, 494169, 441534, 440423, 444669, 410978, 415509, 398347, 374549, 378451, 363659, 352619, 361291, 358526, 331459, 332916, 344053, 323256, 289157, 261656, 265222, 268432, 260555, 302100, 328242, 315257, 311160, 357831, 375998, 381534, 365630, 371200, 388760, 396335, 383508, 344278, 292555, 279338, 255745, 259895, 273876, 277622, 269352, 262214, 228007, 239217, 236024, 197815, 197720, 194966, 180988, 181557, 176841, 183281, 176237, 157630, 177538, 159967, 168672, 174883, 163488, 183822, 182972, 137807, 143787, 147593, 114290, 121286, 172566, 204687, 215041, 211317, 192322, 175849, 134856, 133594, 167737, 189374, 220476, 230410, 251943, 249820, 258972, 251311, 248013, 242295, 226690, 201401, 208402, 200191, 185103, 159268, 172966, 143526, 144781, 134707, 117648, 133672, 121434, 115290]
8563A15290L5531J9602k812j9101j2961n153r806M189m6416m2288J0540L3521
8551H0136K9546J7746l4885k0161J264R429J6936K1840J876K0882J7251l806k0124
8538A37930J231O055m119J7086k0535Q986K0783q696p668L9313j8229k7818P224
8525A51543m216l3841j6175O597K9669Q665J1188o102J0082n632J0033L635m2589
8512A22857m5915l272p249j6083q476J103L2605L0035q173L961K9560j058l7040
8499I2855m0595R256L1867J4927K2947K2220Q996j1919r11r085K31K0341n135
8486A55995j1162M648J9364m3053j8682K0434m683k1118J0780k9175k1462k772
8474E9114j5504J7184k940J9012j9656J3512K57k2921J537K3452J2654k3047o000
$$ y = [115290, 150821, 170423, 167611, 148510, 135549, 130396, 120590, 124779, 78363, 36075, 46615, 80136, 109682, 127428, 92543, 72382, 73646, 83075, 100011, 121851, 123727, 144609, 161860, 158054, 137930, 139161, 145216, 141097, 158183, 137648, 146634, 167417, 158721, 151053, 190366, 172137, 144319, 151543, 147327, 113486, 97311, 103908, 133577, 142242, 153430, 147328, 157410, 151778, 161811, 165446, 122857, 76942, 73670, 66421, 50338, 41862, 42965, 75570, 105605, 97432, 101393, 130953, 129895, 92855, 52260, 61516, 93383, 108310, 131257, 153477, 162473, 150554, 149643, 140558, 140789, 161130, 155995, 144833, 149481, 168845, 125792, 107110, 127544, 122861, 101743, 112523, 83348, 61886, 59114, 43610, 60794, 57854, 76866, 57210, 70722, 70979, 48058, 49595, 73047, 85701, 62654, 56654]
8461E6654K7178q20J203K1759j3805j8900O275j622k1628m96L670L8763J0943
8448A09174R550K0049J0871l111l2679m8219o7J7011M986R468P527N971k314K2090
8434A30307l2046j4830o920j4345r358j8782l907r658J9249J1826N794J11K4345
8421H1786j5441k5873k343j512j706J1820K0216p667l4698o05P798j0691k0015
8408A069P905J4319j3475o386P872J6324L0858k7554j4391J4507J3244p172Q70
8395C7990O673K9647j962j4017j0705M624n088q050L9293P681j7719o249k3968
8382C8150J641l084m46j715j7871K510J0578M774J1750J7226j0811k7869J9594
8369D4427J9713r084m5651l293J0222r861o765j5713p972J9630L264K3076L2242
$$ y = [56654, 83832, 83012, 84215, 105974, 92169, 73269, 79544, 77922, 56294, 55798, 59468, 98231, 109174, 118724, 138773, 149644, 146533, 113854, 65635, 65568, 82579, 87565, 97033, 104560, 110531, 108217, 130307, 98261, 83431, 76511, 62166, 52808, 34026, 30119, 20461, 39710, 51536, 57330, 57441, 81786, 66345, 40472, 38129, 36617, 34911, 46731, 66947, 59280, 24582, 23977, 31775, 21084, 1069, 8974, 23293, 9818, 3432, 11304, 27628, 58486, 30932, 16541, 31048, 44292, 37120, 37990, 44663, 74310, 72348, 58331, 47626, 52250, 47162, 39112, 78405, 86086, 68367, 62118, 38150, 39791, 36707, 36261, 34546, 16675, 19185, 29763, 34537, 46287, 63513, 52702, 24833, 44427, 64140, 55056, 9405, 6112, 16334, 6473, -292, -16005, -23977, -4347, -1083, 21993, 54235]
8356E4235j2644r528j0464k5119J1401K4226K020K433n25J1796Q064J1210k5625
8343D1480o148R572K189q520J71j4790K880o989m5668J4614R673n63k938O376
8329A339K3683R506K6914J3001m95k0539j8618l1683P797P495M650K3428J8038
8316F4516j2421o983k0122k9238J7103j4292j7677q512L6678K4347j3309J5435
8304C5525Q602j4391M2287J3602l6656j6092K2054K1164j1415k011k0017l4937
8292G715J8058K5739j4460k6689k3660M9n710J8451J865j079J7671R839K968k7068
8278C689j9456M304j0232J7433j9521J0904J2214J6392J3251m55j81q104N134
8265B5372p487K8108N454J3030Q846L619j6777j1918p071k6204k4652j862q480
$$ y = [54235, 41591, 32063, 21599, -3520, 7881, 32107, 34127, 36560, 36035, 47831, 55895, 67105, 41480, 35332, 44904, 47093, 38573, 38744, 23954, 26834, 19845, -25823, -11209, -1536, -2099, -5037, 1339, 25022, 34528, 61442, 74443, 73948, 53409, 34791, 3108, 10905, 18400, 23050, 46478, 64516, 52095, 45112, 24990, -4248, 12855, -1437, -19114, -27626, 9052, 33399, 20090, 35525, 44127, 29736, 72023, 85625, 48969, 32877, 54931, 76095, 64680, 62669, 42652, 7715, 25773, 51512, 37052, 10363, -13297, -13248, -18958, -507, 1358, 279, 17950, 27789, 30757, 3689, -15767, -11463, -21695, -4262, -23783, -12879, -665, 15727, 28978, 28523, 28342, 20238, 25372, 17885, 45993, 51447, 64477, 73323, 76942, 60165, 48247, 41176, 14972, -9680, -11542, -20022]
8252b0022J2409P427n194J5585L964J076m91J407j7519l1291m537J518J6763n861
8238b4766o585K1824k406J9343J3466J6001k0095m4016J6281K9982K968j5172
8226F825o366k9801r07M4348L6597J0510m771j5700p491J4690K1169j439k3640
8213D4024r077l2968l7110k7944l777k899J0368J6430J9669J1874J2885L9996
8201D1471q579j8518p163p90K958o196o241R592r169k8645q480K2531L5096N64
8187A8431J1763J8697R981j490k5201n601j2404k3786J5439O545J5115J9087J1969
8174E8545R768l0301J5276r090k3976k2091O677L0330O176n618l0710r276j2047
8161a6337j1129M428J9547R978q354k983L0565L8563J1825n314J5274J5119k3655
$$ y = [-20022, -7613, -186, -5380, 10205, 14169, 15245, 14754, 16161, -1358, -32649, -37186, -35668, -18905, -24766, -31351, -9527, -11933, 7410, 20876, 36877, 16782, -27234, -10953, 19029, 21997, 6825, 459, -29342, -30249, 14099, 50696, 61206, 56435, 40735, 33244, 47934, 69103, 67664, 44024, 34947, 1979, -35131, -63075, -66852, -69751, -59383, -42953, -23284, -11410, 1475, 41471, 32892, 14374, 7211, 6421, 9379, 3183, -3058, 6534, -2635, -31280, -39760, -17229, 17867, 18431, 30194, 48891, 58872, 57382, 32181, 26580, 14176, -9610, 5829, 12374, 27489, 46576, 58545, 68313, 38012, 53288, 44198, 20222, -1869, 4808, 35138, 41314, 35696, 4986, -4290, -16337, -27466, -23038, -3491, 6487, -1867, -4850, 25715, 64278, 76103, 70789, 86063, 101182, 77527]
8148G7527J2794L113J5775O153n4920n779J4700L4989K2077R463J4591K3991k8167
8135A46307R2l0308l5804O941k786j4930n908j339K1882j3873J3685L0456p720
8122A06695K9091K4993J5382M8321P1333L2623N4915M2072M2815O8979O6641P4358
8110F78218J22392J29373J72638K17830K56327K61650K53805J71038J36823J16546
8100B516640n1053j27907k20898k49292k23327j98036j81812j61496j35436j06179
8090H61204j31698j11167q8028p1131j7361J3093j1949m309K6520K0550n202J9326
8078D99848L7270J5948J1211Q355K9218j785l571K6154P6121R5164Q3041R1734
8066I68708J27736J59151J91953K55690L47597L83467M87149N07321M89968M11701
$$ y = [77527, 90321, 93434, 109209, 115362, 60442, 54663, 69363, 104352, 126429, 135892, 150483, 174474, 146307, 146399, 116091, 80287, 87228, 84442, 69512, 63604, 62265, 84147, 70274, 83959, 114415, 106695, 135786, 160779, 176161, 224482, 295815, 328438, 383353, 425425, 468240, 537219, 603860, 678218, 800610, 929983, 1102621, 1320451, 1576778, 1838428, 2092233, 2263271, 2400094, 2516640, 2465587, 2337680, 2116782, 1867490, 1644163, 1446127, 1264315, 1102819, 967383, 861204, 729506, 618339, 530311, 459180, 441819, 454912, 442963, 438654, 465174, 485724, 480522, 499848, 537118, 553066, 564277, 572632, 601850, 600065, 596494, 622648, 698769, 793933, 876974, 968708, 1096444, 1255595, 1447548, 1703238, 2050835, 2434302, 2921451, 3428772, 3918740, 4330441]
8056D330441K41567m4845k69724l97193m88174m69416m47225l62287k69546k37156
8046A586442j87926j92939j58376j59400r8207n6001n3073l4224j7670j4883j4202
8035E99541k3403M4171O6426L1521k8529l8142n7073q4004m8174R602K1298K7420
8023E20654K6344J2189K4596M4008J06445J18476J25885J36264J63773J73621
8013A452255J63291J48444J01194M8262l3294j11050j24214j24482j69568j90966
8003A159872j66348j25419j34877j06286q5526m7666n9048l0150k4610l3017l5758
7992C11167l7075q528R365L2126M4714j605o4253m5266l2974k405J3896k7847
7980A91315o6473k6061K6392N334r809J447K2690R422l7290J1626r358j6981K547
$$ y = [4330441, 4572008, 4527163, 4257439, 3860246, 3372072, 2902656, 2455431, 2093144, 1823598, 1586442, 1398516, 1205577, 1047201, 887801, 789594, 733593, 680520, 646296, 628626, 613743, 599541, 576138, 620309, 686735, 718256, 689727, 651585, 594512, 510508, 462334, 471936, 493234, 520654, 546998, 559187, 583783, 627791, 734236, 852712, 978597, 1114861, 1278634, 1452255, 1615546, 1763990, 1865184, 1913446, 1880152, 1769102, 1644888, 1520406, 1350838, 1159872, 993524, 868105, 733228, 626942, 541416, 493750, 434702, 404552, 379942, 346925, 311167, 274092, 265564, 274929, 307055, 351769, 350164, 285911, 240645, 207671, 205266, 219162, 191315, 124842, 98781, 125173, 130507, 120698, 122145, 144835, 154257, 116967, 128593, 119235, 102254, 104801]
7967A04801r784l3391Q618K4236o186Q869k01J9274M0653j8158k0838J9061O595
7954A43549j1793j6240j0125j0678l147k3079l3058k12L5171J7438J6768l0057
7942G4537j0857p916q037P572N211J0431K3961k796K223j5747j7050k100Q024
7929F7456J1052J318q213R080J220k0531j8360P029j2728r87J7470L4338J1203
7916I9347k4234k3352j1697J0107O139r717J1547O91K1256o905k7029k8944m158
7903A3051M5644M092m4704k5524J2352L3988L5690P247k384O521o66k2779J4556
7890G7084j69k620L443j624k0785j7488m1750o806J4346J6766M5328O099q088
7877F3736j2970J683j6061q989O619J7756N235k1802p184J2404J6088J0299k4357
$$ y = [104801, 95017, 61626, 70244, 94480, 88294, 97163, 96962, 116236, 156889, 138731, 117893, 136954, 143549, 131756, 115516, 105391, 94713, 91566, 68487, 35429, 35217, 70388, 87826, 104594, 74537, 63680, 55764, 47727, 55299, 60510, 70941, 94902, 92106, 94329, 78582, 61532, 59432, 67456, 78508, 79826, 71613, 80693, 81913, 61382, 43022, 50051, 37323, 36336, 53806, 88144, 99347, 75113, 51761, 40064, 50171, 56310, 46593, 58140, 58831, 80087, 73182, 46153, 17209, 13051, 58695, 62787, 18083, -7441, 4911, 38899, 74589, 81836, 79452, 85973, 85307, 62528, 77084, 76915, 74295, 77738, 76114, 55329, 37841, -3909, -10715, 3631, 20397, 65725, 71824, 63736, 50766, 52449, 36388, 27399, 34018, 51774, 57009, 35207, 28023, 40427, 56515, 66814, 42457]
7864D2457j9334J0285K3270j6029K2285K781q9M700l1174L2608R038L146K288
7851H6232k0104j8164M45j6710K2684J4305k1556P979J1769k7043m7330k864m554
7838a4911K2681J5376M2291l535p954O459J6244j2539m454k6630l5303j0256J0800
7825a731K1444M197K8955L1680J111j8696kL0469N317l539l0353l4836J3730k279
7811D5467R222K2429L133l026J6807k8780m141k8285m1525q581P137J3278K3249
7798B6384L2535J8900j583k2955l1235r223L12O693o802p505j2327M093k9010
7785c1723K3474M9536J3635n601r374n363m506J3784o811p080j0345k4931M717
7772e88k1665J1991L7979K6212q300J5668j9381j503J125l598r090k193K7273
$$ y = [42457, 23123, 33408, 56678, 40649, 62934, 65715, 65626, 70326, 39152, 71760, 80798, 83944, 86232, 66128, 47964, 48409, 31699, 54383, 68688, 47132, 55111, 66880, 39837, -7493, -10357, -14911, 7770, 23146, 65437, 61902, 53948, 60407, 76651, 64112, 59658, 33028, -2275, -12531, -1731, 19713, 23910, 52865, 84545, 85656, 66960, 66958, 97427, 102744, 99205, 68852, 34016, 47746, 45467, 54689, 77118, 80251, 77225, 94032, 65252, 61111, 32826, -8699, -17280, -10143, 3135, 26384, 58919, 77819, 76236, 53281, 22046, 12823, 13135, 19828, 13026, 5521, -6806, -2713, -31723, -8249, 41287, 54922, 49321, 39947, 34584, 30078, 43862, 37051, 29971, 19626, -5305, -588, -22253, -10262, 27717, 53929, 45629, 61297, 41916, 40413, 41538, 37940, 28850, 26657, 53930]
7759E3930N09j7432k4396K0606k61l0166o308J054J789k81J2021r69j822n08M916
7744A2682K99o86J987q525q944R942M912j5307J667J677o918L817K6598P326j1380
7729A9147j8123m928q11j3482J3364L6851j914m643r548q641l6115l7972L9529
7716b7286L8134j3439k6779L6030K1094J7415m101j8370r275P676J2883J2634
7704D6616N804m506k0858L52J7947j2819l1924j8601P95j6460M47j0588j1388
7691e5183L513K8439M0178J1549n620r354n110k545P479J0818R563N546k49m458
7677C4566k1862j3129J5842q367m147n41J8470k184j9686j3579P59J0150J9849
7664A6141q185j4126K8580l121J7487J1719J8317J2136j0951J1307k3251l4939
$$ y = [53930, 54439, 37007, 12611, 33217, 32956, 2790, -3518, -2464, -675, -956, 11065, 10096, 8274, 7766, 12682, 12981, 12295, 14282, 5757, -3187, 6755, 11667, -3640, -1973, -296, -7214, -3397, 23201, 30527, 19147, 1024, -3904, -4715, -18197, -4833, 32018, 30104, 25461, 15913, 7272, -28843, -66815, -27286, 10848, -2591, -29370, 6660, 27754, 45169, 41068, 22698, 13423, 21099, 33982, 46616, 52420, 47914, 27056, 27408, 45355, 32536, 612, -17989, -17194, -33654, -33207, -43795, -55183, -51670, -23231, 16947, 28496, 22876, 13522, 8412, 5867, 13346, 24164, 33727, 39273, 39024, 34566, 12704, -425, 15417, 7050, 2903, 2362, 20832, 18648, -1038, -14617, -13858, -3708, 16141, 7956, -6170, 22410, 19289, 36776, 48495, 66812, 78948, 67997, 79304, 56053, 21114]
7652B1114n725L870p377j9140O888P262n562J3823J0665N626L674R771j9855K1807
7638D6841M866J4254j3079J5553M364k7465j4102k1286O831R916j2579m651M722
7625A4185q459J5400L014j367J732K323o106L711j3424l0526j9180L2865O053
7612B21o572J2279j845J0994j9692q627K7904L6880j0068k0419r42j4999j5085
7599i971k1608L45J2289n977K0042J4975j5080J8558J8574j9631j1024q468k4537
7586c1513j1398O466J4396j0633j2124J8372L923q888J4775O888Q064K2319j2948
7573G699j4554J2400R787k098J5626O266J4431r937k534j8446p47m096N096o975
7559A1918P087J1882j2478n914J7754p153l0416j4748L7588J9258j5734r035m572
$$ y = [21114, 15389, 19259, 11882, -7258, -370, 6892, 1330, 15153, 25818, 31444, 35118, 44889, 25034, 46841, 51707, 65961, 52882, 68435, 72799, 45334, 31232, 9946, 16777, 26693, 14114, 9463, 14185, 5726, 21126, 24140, 22773, 24505, 26828, 20722, 24433, 11009, -19517, -38697, -5832, 221, -6351, 5928, 4083, 15077, -4615, -13242, 14662, 51542, 41474, 21055, 20113, 5114, -9971, -31579, -31234, -18945, -24922, -4880, 10095, -4985, 13573, 32147, 12516, 1492, -6976, -31513, -42911, -36445, -22049, -32682, -44806, -26434, -22511, -31399, -16624, -9736, -1672, 20647, 7699, -6855, 5545, 15332, 13234, 28860, 35126, 49557, 39620, 37086, 18640, 17893, 13797, 18893, 11918, 19005, 30887, 18409, 12495, 30249, 23096, -7320, -22068, 15520, 34778, 19044, 10009, 5437]
7546E437J966k7597j2532K1278J0939m993j0034j4383l1889L0251J6638j1383
7534b6302P150L5303j230j1718k5590J3901J3427o030N913O734j9314j8909K0509
7521f156k152j2414R986K4621L0567K8552m881l6480n2481k8905l671M1321N0092
7508C7999K998p357J2785o29k2836k5810j3341K7056L2269n505j2951p154j9015
7495a491K5132J4217j8551k1538q264L85k8380L997L6423n365n726J1140J8153
7482B0132P181r698j6264p705j0354J7234Q462J3330R967k4654Q567K7475N337
7469D9010l0987J439k2368j1571N602k650l1395J120J3702l66N316O151J4373
7456b624J7467k0301o760m2296J3089N6995R905K184j9019j0178k5221k878J6415
$$ y = [5437, 7403, -20194, -32726, -11448, -509, -5502, -15536, -29919, -61808, -31557, -14919, -26302, -19152, 16151, 14921, 3203, -22387, -8486, 4941, -1089, 4824, 11558, -7756, -26665, -6156, -8308, -20722, -10736, 13885, 44452, 73004, 68123, 31643, -20838, -49743, -53414, -12093, 37999, 40997, 33640, 46425, 45796, 22960, -2850, -16191, 10865, 43134, 37629, 24678, 17524, -1491, 23641, 37858, 19307, -2231, -10495, -10110, -38490, -34493, 1930, -3435, -9161, 1979, 20132, 27313, 17615, 1351, -6354, -16708, 526, 8988, 22318, 32285, 7631, 16198, 43673, 49010, 18023, 19462, -2906, -14477, -8875, -11525, -42920, -41800, -28098, -28464, -23148, -16997, -2624, 14843, -5458, -12218, -54514, -41425, 15570, 25475, 27659, 8640, -1538, -26759, -29637, -13222]
7443a3222J0511J1112K6161M0231k4R14o596q254j3939l934j4004k7842K143P393
7429A0650R556k955j5760m451k801k7025j8931J8317J2980r400N903Q026K0024
7416D133J1441k9167j1807J3380j796p419r928n166k3525J4875N0052L7819R4
7403D2986k1822m7453k948J6811J2030J1457O797k751J1700o622j454j2145j655
7390D931k862l2766k7884J5187J0008j2806n426K284Q174K1020K2238m579k14
7377b695Q265J761J4436j0744M023Q813k1919J5029n95k0841j0170q40J4906J5239
7363A4668J0805j8623q811j9612J235K1963J6352R401j5374j8877j9900L929o187
7350b9031N673J4167j8790N948J2271r876j3833k439l272J0147q558K7061L1804
$$ y = [-13222, -2711, 8401, 34562, 74793, 74769, 75683, 69087, 60833, 46894, 42960, 28956, 1114, 3257, 10650, 20206, 17251, 1491, -2960, -5761, -32786, -51717, -33400, -20420, -29820, -23917, -15891, 4133, 15574, -13593, -25400, -12020, -13816, -21235, -31163, -36329, -59854, -44979, 5073, 42892, 42986, 21164, -26289, -29237, -12426, -396, 11061, 17858, 15107, 26807, 20185, 18731, 6586, 4931, 2069, -30697, -58581, -43394, -33386, -46192, -51618, -49334, -41160, -20140, 2098, -2481, -2695, 5570, 7331, 21767, 11023, 15046, 23859, 1940, 16969, 16374, -4467, -14637, -15477, -571, 14668, 25473, 6850, -1961, -21573, -20338, 1625, 17977, 27378, 12004, -6873, -26773, -22844, -29031, -23358, -9191, -27981, -22033, -9762, -19638, -33471, -35910, -39182, -29035, -37593, -10532, 21272]
7337B1272k6533l778k136j1028K100J0788J3115L031J7515J2773k0975l0547j5941
7324c0344j492j1755J279m732J3695j8655p70K9004O182j1934n025K3788K106
7311h653j3681j1423q822K8596L3787Q772k28J7234j2545k2511m2488j1765k5270
7298f8997m0936N968M2187L688L7816J8521J466k1140o733K6895j4246m6197J934
7285e9774K3884K3302k2305O156o644L41J0714m981J3273J6339n771N972L2213
7272C2719j2679j7997P03J5257j1321l6093r697J8643K7871m072o585J4693k7562
7259a6120k7340j0090L0577K5902j2782n2217N614L0769o680L678J309P986l459
7246b2853k2389o088K7519J4098j0311j2884M77K050j0495O731J9500L8055j8725
$$ y = [21272, -5261, -9039, -11175, -22203, -20103, -9315, 3800, 6831, 24346, 37119, 16144, -14403, -30344, -31836, -43591, -42312, -47044, -33349, -52004, -52774, -23770, -17588, -29522, -34547, -10759, -8653, -22334, -33757, -42579, -13983, 19804, 28576, 28348, 45582, 33037, 10526, -31962, -43727, -68997, -109933, -103965, -61778, -58090, -20274, -1753, -287, -21427, -28160, -1265, -15511, -61708, -59774, -35890, -12588, -34893, -28737, -35381, -35040, -24326, -29307, -16034, 305, -5466, 506, 32719, 20040, 2043, 2746, 18003, 6682, -29411, -39108, -20465, 7406, 3334, -3251, 11442, -16120, -43460, -53550, -22973, 2929, -9853, -62070, -56456, -25687, -32367, -28689, -27380, -19394, -22853, -45242, -51330, -23811, -9713, -20024, -32908, -32431, -30381, -40876, -34145, -14645, 23410, 4685]
7233D685j2210l052Q680k2150J293K8487K4122j5525k1501k659L892j1483N531
7220a1890K3276O492k8009k2478j2486J2053R904K0917j7795M985K0182j0116
7208d965R64L730j0567n923r911k0256J6898J9565k4251L0130K0278K3011j2959
7195B5744l2141p577l0323J7612K511J6614K0165j3488L0200J2408J6544K92j0794
7182D7767L808j5922j7005J020Q29j3379Q629K5173j8035o606k4292j6910l1311
7169e6234j9821K7295J5871J9612L515R196n190K757K0893J355J6497j9442l8866
7156b2562J3289K2286k8253k0202O201K1720o42J4442Q668O302j0624k0820l541
7143a3736K8683J1376J2913Q53j5528j884j0888K554q86q443L578n7312q844K8457
$$ y = [4685, -7525, -10577, -1897, -24047, -22754, 5733, 29855, 14330, -7171, -9830, -5938, -17421, -11890, 11386, 17878, -10131, -32609, -45095, -33042, -23138, -2221, -20016, -15031, 5151, -4965, -4001, -271, -10838, -16761, -26672, -46928, -30030, -10465, -34716, -4586, 15692, 38703, 25744, -6397, -13974, -44297, -26685, -24174, -7560, 12605, -883, 29317, 41725, 58269, 58561, 47767, 51575, 35653, 18648, 19668, 20497, 7118, 15747, 40920, 22885, 16279, -8013, -24923, -56234, -76055, -48760, -32889, -13277, -9762, -566, -5756, -2999, 17894, 19249, 35746, 16304, -22562, -9273, 13013, -15240, -35442, -29241, -7521, -8163, 6279, 14947, 21249, 10625, -10195, -13736, 14947, 26323, 39236, 40089, 24561, 22677, 11789, 14343, 13457, 5014, 8592, -48720, -57564, -29107]
7129b9107L7011K2579k2737j9906J7898j2306J707M567O35j9241k3740K249R042
7116c1349k185J5677K8755j6926k0524K8571J8321l1934j0858m819p976R643K178
7103b3426R799o57J3630J199j483J9786J5429j4051j3982J560J4753K5729l1618
7090A6668m188r174j1796J7034K4354K9712l4586m7632j205L3904n368l3206J0121
7077a5362j1067l85P022K430m385K3918K4489P714j9048J1618K3959k1972m3697
7064a4766P922K9111o472q214o582j1238j4897j0889o348j3595K3011J1145q956
7051c0768J9784K4317O588K0376p369L854j5138m260J0226k5762k3036L3548K1166
7038C3526J739j4189l9693j2654j2097j8767K2986j526J7443M398r060k7286k3720
$$ y = [-29107, 7904, 30483, 7746, -12160, 5738, -6568, -4861, -294, 341, -18900, -42640, -40391, -31349, -33534, -17857, 10898, -6028, -26552, 2019, 20340, -11594, -22452, -27271, -35247, -25604, -23426, -13627, -14284, -654, 545, -938, 18848, 34277, 20226, 6244, 7804, 22557, 48286, 16668, 12480, 3306, -8490, 8544, 32898, 62610, 28024, -19608, -20813, 13091, 7723, -25483, -15362, -26429, -26814, -19792, -17362, -21747, 2171, 26660, 34374, 15326, 26944, 50903, 28931, -14766, -6844, 22267, 15795, 7581, 999, -10239, -25136, -36025, -42373, -55968, -32957, -21812, -30768, -10984, 13333, 19921, 40297, 32928, 36782, 21644, 17384, 27610, 1848, -21188, 12360, 33526, 35265, 21076, -18617, -31271, -43368, -62135, -39149, -40675, -23232, -18834, -27894, -55180, -78900]
7025g8900j303L781L3495J5690K0803R856Q250l45j2446k5251J088j6077J2940
7012b8419J5498l1343k6729J3926M2772l3595j9484o737J750J0907Q343O884L6317
6999i910L4718K531K4278j0047j1668j5242J6180n778l0997K654j2825r700j7583
6986d3389P41J768J892K513L0431L9230K866J0282N669l1202o625M786J9153j6908
6972B1207j3201L083m3051k9059j386p386j8313J6895K4044J2115K4574K739j8599
6959b6338M0634L7327j6154j3502m9134k1894M046O965k8697j3055k596o056K9702
6946e8752J2655j3464j7891R86L1014O685L3783K2688N39k0592k0686J0410k506
6933a5131p230j4737j2241J1474M269K4365J5246L943q674J3329P110p979j1072
$$ y = [-78900, -80203, -76422, -42927, -27237, -6434, 3422, 11672, 11327, -1119, -26370, -25282, -41359, -28419, -12921, -44264, -70993, -57067, -14295, -47890, -67374, -74111, -72361, -61454, -53111, -46227, -9910, 24808, 27339, 51617, 41570, 29902, 14660, 30840, 25062, -5935, -3281, -16106, -25806, -43389, -42648, -40880, -38988, -36475, -6044, 33186, 36052, 46334, 52003, 20801, 14176, 18962, 38115, 21207, 8006, 11089, -31962, -61021, -62407, -69793, -88106, -71211, -47167, -35052, -10478, -7739, -26338, 14296, 51623, 35469, 21967, -27167, -49061, -45015, -38050, -66747, -79802, -82398, -88454, -58752, -46097, -59561, -77452, -76466, -45452, -38767, -4984, 17704, 18243, -2349, -23035, -12625, -15131, -22361, -37098, -49339, -37865, -33596, -9231, 6015, 9958, 1284, 14613, 21723, 13744, 2672]
6920B672q853L51Q115O830p866p803J6826m446K119m584j5127k7300l353J3566
6906b8853j068j9311k6128J3902L8424L2313j086p643j7402L0648j1058k7991
6894b5253j502L458M5046J1856k4305k2613j1505K3865k210j3514p400j6607J6704
6881b3980j5718P397J4486N932J8555l1566P449J414J5594J8788k8947l2825L2373
6868a1048j978l026p936J2655J8104k6580M280Q723J9862K255K803p041m4304
6855c3231j8942J9836J1332L460L4591L6226m32L754j7355l2425n236P866m0095
6842c0651k6485J3630P856M750k2624O842k210k3331j6819K4711J9999P373K3223
6829a3736K5312j8204j7576k804M198M171J1194K6410k5896r826J3324l384J359
$$ y = [2672, -6181, -5830, 2285, 9115, 1249, -6554, 10272, 5826, 7945, 3361, -11766, -39066, -42419, -28853, -29921, -49232, -75360, -61458, -23034, 9279, 8193, 550, -16852, 13796, 2738, -25253, -26755, -23297, 21749, 33605, 9300, -13313, -24818, -953, -3163, -16677, -24077, -40684, -23980, -39698, -32301, -17815, -11883, 6672, -24894, -17445, -16031, -437, 18351, -10596, -43421, -11048, -13026, -16052, -23988, -11333, 6771, -19809, -15529, -6806, 13056, 15311, 18114, 11073, -33231, -52173, -32337, -21005, -17545, 17046, 53272, 52840, 56594, 39239, 6814, 1578, 9444, -30651, -57136, -43506, -35650, -30900, -53524, -46682, -48892, -72223, -89042, -64331, -44332, -36959, -13736, 11576, -6628, -24204, -27008, -22810, -18639, -7445, 18965, -6931, -16757, -3433, -6817, -5458]
6816e458J9175Q035K477J466J0908J4407l1644l6626l2735l6416K4305K0842K7053
6803a4211k376M953p462P72M4207J7582p245j8177j3942k238o175k1645M0711
6790A4754j9408p546N499K0990j5020k8574L814J5219J3057j3220k1822k9201
6778f1458L3502L8967M4797l0067j2762n393M842m271k3269L854J0647j83j1705
6765a2499J1011K6941o693k0072j9758k557k881P054J0114O42j5614k7103M607
6752d6808K8459L5970j0790J4086J2882q688k0160o934O893L301M892j8568N590
6739A25P653L573k6570k9219j4885K3018J7942j714k7165r270j0781J634J8048
6726d7611L5697L459j1743J1373J4022L3603r438l7554p909K6569J0333k3584
$$ y = [-5458, 13717, 21752, 24229, 25695, 36603, 51010, 19366, -17260, -49995, -86411, -62106, -41264, -14211, -16587, -11634, -19096, -18324, 25883, 43465, 36220, 18043, 4101, 1863, -4312, -25957, 14754, -4654, -12200, -6701, 14289, -731, -29305, -25491, -10272, 2785, -10435, -32257, -61458, -27956, 11011, 55808, 25741, 12979, 7586, 12428, 8157, -15112, -11258, -611, -794, -12499, -1488, 25453, 18760, -1312, -21070, -23627, -26508, -19454, -9340, -8698, -24312, -51415, -46808, -18349, 17621, 6831, 20917, 33799, 25111, 4951, -1983, 4910, 8211, 13103, -5465, 125, 7778, 11351, -15219, -44438, -59323, -36305, -18363, -20077, -47242, -56512, -67293, -65659, -47611, -11914, -8455, -20198, -8825, 5197, 38800, 29362, -8192, -16101, 10468, 20801, -2783]
6714b783R280m789n721K637L244o862J0944o483J5280J8682j4001j622l652k4364
6700a0210J7874K904L920j0536K630j9316J4431K473k8407r340L5199L1553Q687
6687D1862l0275n4210j9973J4451K6626P823P949j0467j0164l576L76K0227J0893
6674A542K0750J3479J621n592j171J1255l0451l4827k5839M595K6538j0112L0603
6661B391K4096Q325R51J4984l0864J7474k2923n764L5994p349l6041R94q814p916
6647a4462k0405J7325K7137j6177m3113J316M068j423J0051K5810J5534j1575
6635e914j3252k1281j1457j3935L3264K0837j9829O868Q594J565M633O695Q571
6622E359O577J6431j3350j5668l330n61j320k0935n796J071J1504j5526K0983
$$ y = [-2783, 6497, 1708, -4013, -1376, 1868, -4994, 5950, -533, 14747, 33429, 19428, 17806, 14154, -10210, 7664, 10568, 14488, 3952, 6582, -12734, 1697, 4170, -24237, -33577, 1622, 33175, 41862, 11587, -42623, -62596, -48145, -21519, -13696, -5747, -16214, -26378, -29954, -29578, -9351, 1542, 22292, 35771, 37392, 31800, 30629, 41884, 11433, -23394, -49233, -44638, -18100, -28212, 2391, 26487, 34812, 35763, 50747, 19883, 37357, 14434, 8670, 44664, 37315, 1274, 2268, -6546, -14462, -34867, -17542, 9595, -6582, -49695, -48379, -44311, -45734, -35683, -9873, 5661, -5914, -19166, -40447, -51904, -65839, -32575, -11738, -31567, -24699, -16105, -14540, -9907, -3212, 5359, 11936, 28367, 15017, -651, -3981, -4542, -5862, -26797, -32593, -31522, -20018, -35544, -14561]
6609a4561p150j4519q679j4128N87J4631K6985O71n698O044J4200J5380m279p312
6595B172m562j3360j7875K0089J9557N176o590K1499J2649k5501j59o005M424
6582A1514o225N110j3484m046j7126k6067j4049L1559R809J42J9757K2284Q650
6569B7828r383k7166j4913j0187o052J796K5723L263r53J1354J3032n089j6918
6556g665J3467J4058J4294K103l2841p118l859K936k404k4630j5607R018L6520
6543a728K3284L1126m5360m7928R014P753o830J7665J3227N100J7816j4932k1747
6530a3540l6506K1723L3233M80l0239j8392K1178J2809l643P592q060R681n268
$$ y = [-14561, -21711, -36230, -44909, -59037, -58450, -43819, -16834, -16163, -21861, -15817, -1617, 13763, 9484, 2172, -2390, -15750, -33625, -13536, 6021, 11197, 4607, 26106, 38755, 13254, 13095, 7090, 11514, 5289, 10399, -3085, -7131, -24257, -50324, -64373, -32814, -23005, -22863, -3106, 19178, 27828, 18445, -8721, -23634, -33821, -39873, -38077, -12354, -9091, -10044, 1310, 14342, 9253, -7665, 5802, 19860, 34154, 36257, 3416, -3702, -7561, -4625, -7029, -31659, -47266, -38248, -1728, 21556, 52682, 7322, -40606, -31592, -23839, -30669, -13004, 223, 5323, 23139, 8207, -13540, -50046, -28323, 4910, 5390, -24849, -43241, -22063, -9254, -12897, -5305, -13365, -3684, -8952]
$$ [...]
##END NTUPLES=NMR SPECTRUM
##END=
