##TITLE=Analysis number 328377
Compound Code cc 62304
Book Reference 464/142/4
Project Code adrs
Chemist Name chrisr
##JCAMPDX= 6.0         $$ Bruker NMR JCAMP-DX V2.0
##DATA TYPE= NMR SPECTRUM
##DATA CLASS= NTUPLES
##ORIGIN= Bruker BioSpin GmbH
##OWNER= nmr
$$ XWIN-NMR		Version 3.5
$$ Fri Jun  1 10:26:02 2007 GMT Daylight Time (UT+1h)  MAYBRIDGE\nmr@NMR_250MHZ
##.OBSERVE FREQUENCY= 250.131544655141
##.OBSERVE NUCLEUS= ^1H
##.ACQUISITION MODE= SIMULTANEOUS (DQD)
##.ACQUISITION SCHEME= undefined
##.AVERAGES= 16
##.DIGITISER RES= 18
##SPECTROMETER/DATA SYSTEM= dpx250
##.PULSE SEQUENCE= zg30
##.SOLVENT NAME= CDCl3
##.SHIFT REFERENCE= (INTERNAL, CDCl3, 0, 16.522)
##AUDIT TRAIL= $$ (NUMBER, WHEN, WHO, WHERE, WHAT)
$$ ##TITLE= Audit trail, XWIN-NMR		Version 3.5
$$ ##JCAMPDX= 5.01
$$ ##ORIGIN= Bruker BioSpin GmbH
$$ ##OWNER= nmr
$$ C:\u/data/dgb/nmr/ADRS/10/pdata/1/auditp.txt
$$ ##AUDIT TRAIL=  $$ (NUMBER, WHEN, WHO, WHERE, WHAT)
(   1,<2007-06-01 10:25:39.38 +100>,<MAYBRIDGE\nmr>,<NMR_250MHZ>,
      <created by zg, POWCHK disabled, PULCHK disabled
       configuration hash MD5:
       76 6E 9A 78 1E 09 19 81 EC 84 63 8F B0 6A 59 2D
       data hash MD5: 64K
       FB CD F6 94 B4 23 26 50 4C 92 BA 81 B9 D1 D5 58>)
(   2,<2007-06-01 10:25:52.80 +100>,<MAYBRIDGE\nmr>,<NMR_250MHZ>,
      <Start of raw data processing
       ef LB = 0.3 FT_mod = 6 PKNL = 1 SI = 32K 
       data hash MD5: 32K
       68 39 F4 CA E7 53 F2 EB E9 9D B8 B7 CF C5 10 1E>)
(   3,<2007-06-01 10:25:54.53 +100>,<MAYBRIDGE\nmr>,<NMR_250MHZ>,
      <apk 
       data hash MD5: 32K
       3D 4C 3F FB CC 22 45 E5 66 AF 76 3B AC E2 86 7D>)
(   4,<2007-06-01 10:25:55.28 +100>,<MAYBRIDGE\nmr>,<NMR_250MHZ>,
      <abs ABSG = 5 
       data hash MD5: 32K
       2D 26 67 94 61 7E 34 6A 4A 8C 03 E2 AD 52 E0 BD>)
$$ ##END=
$$ 
$$ hash MD5
$$ 7E 5C 0C EF 78 BE 0E 51 25 2F A6 89 C6 B7 51 EB
##$RELAX= 
##$RELAX= 
##$RELAX= 
##$RELAX= 
##$RELAX= 
##$RELAX= 
##$RELAX= 
$$ Bruker specific parameters
$$ --------------------------
##$DU= <C:\u>
##$EXPNO= 10
##$NAME= <ADRS>
##$PROCNO= 1
##$TYPE= <nmr>
##$USER= <dgb>
##$AMP= (0..31)
100 100 100 100 100 100 100 100 100 100 100 100 100 100 100 100 100 100 
100 100 100 100 100 100 100 100 100 100 100 100 100 100 
##$AQSEQ= 0
##$AQ_mod= 3
##$AUNM= <au_zg>
##$AUTOPOS= <10 >
##$BF1= 250.13
##$BF2= 250.13
##$BF3= 250.13
##$BF4= 250.13
##$BF5= 500.13
##$BF6= 500.13
##$BF7= 500.13
##$BF8= 500.13
##$BYTORDA= 1
##$CFDGTYP= 0
##$CFRGTYP= 5
##$CHEMSTR= <none>
##$CNST= (0..31)
1 1 145 1 1 1 1 1 1 1 1 1 1 1 1 1 1 1 1 1 1 1 1 1 1 1 1 1 1 1 1 1 
##$CPDPRG= <>
##$CPDPRG1= <>
##$CPDPRG2= <>
##$CPDPRG3= <>
##$CPDPRG4= <mlev>
##$CPDPRG5= <mlev>
##$CPDPRG6= <mlev>
##$CPDPRG7= <mlev>
##$CPDPRG8= <mlev>
##$CPDPRGB= <>
##$CPDPRGT= <>
##$D= (0..31)
0 1 0 0 0 0 0 0 0 0.06 0 0 0 0 0 0 0.0002 0 0 0 0 0 0 0 0 0 0 0 0 0 0 
0 
##$DATE= 1180689938
##$DBL= (0..7)
120 120 120 120 120 120 120 120 
##$DBP= (0..7)
150 150 150 150 150 150 150 150 
##$DBP07= 0
##$DBPNAM0= <>
##$DBPNAM1= <>
$$ [...]
##$SUBNAM7= <"">
##$SUBNAM8= <"">
##$SUBNAM9= <"">
##$SW= 20.6930455092707
##$SWIBOX= (0..15)
0 0 3 0 0 0 0 0 0 0 0 0 0 0 0 0 
##$SW_h= 5175.983436853
##$TD= 65536
##$TD0= 1
##$TE= 683.16
##$TE2= 300
##$TE3= 300
##$TEG= 300
##$TL= (0..7)
0 120 120 120 120 120 120 120 
##$TP= (0..7)
150 150 150 150 150 150 150 150 
##$TP07= 0
##$TPNAME0= <>
##$TPNAME1= <>
##$TPNAME2= <>
##$TPNAME3= <>
##$TPNAME4= <>
##$TPNAME5= <>
##$TPNAME6= <>
##$TPNAME7= <>
##$TPOAL= (0..7)
0.5 0.5 0.5 0.5 0.5 0.5 0.5 0.5 
##$TPOFFS= (0..7)
0 0 0 0 0 0 0 0 
##$TUNHIN= 0
##$TUNHOUT= 0
##$TUNXOUT= 0
##$USERA1= <user>
##$USERA2= <user>
##$USERA3= <user>
##$USERA4= <user>
##$USERA5= <user>
##$V9= 5
##$VALIST= <valist>
##$VCLIST= <CCCCCCCCCCCCCCC>
##$VD= 0
##$VDLIST= <DDDDDDDDDDDDDDD>
##$VPLIST= <PPPPPPPPPPPPPPP>
##$VTLIST= <TTTTTTTTTTTTTTT>
##$WBST= 1024
##$WBSW= 4
##$XGAIN= (0..3)
0 0 0 0 
##$XL= 0
##$YL= 0
##$YMAX_a= 428000
##$YMIN_a= -379739
##$ZGOPTNS= <>
##$ZL1= 120
##$ZL2= 120
##$ZL3= 120
##$ZL4= 120
##$ABSF1= 16.522
##$ABSF2= -4.171173
##$ABSG= 5
##$ABSL= 3
##$ALPHA= 0
##$AQORDER= 0
##$ASSFAC= 0
##$ASSFACI= 0
##$ASSFACX= 0
##$ASSWID= 0
##$AUNMP= <proc_1d>
##$AZFE= 0.1
##$AZFW= 0.1
##$BCFW= 0
##$BC_mod= 0
##$BYTORDP= 0
##$COROFFS= 0
##$CY= 12.5
##$DATMOD= 1
##$DC= 0
##$DFILT= <>
##$DTYPP= 0
##$F1P= 14.0000005364418
##$F2P= -0.99999901652339
##$FCOR= 0.5
##$FTSIZE= 32768
##$FT_mod= 6
##$GAMMA= 0
##$GB= 0
##$INTBC= 1
##$INTSCL= 1
##$ISEN= 128
##$LB= 0.3
##$LEV0= 0
##$LPBIN= 0
##$MAXI= 10000
##$MC2= 0
##$MEAN= 0
##$ME_mod= 0
##$MI= 0
##$NCOEF= 0
##$NC_proc= -3
##$NLEV= 6
##$NOISF1= 0
##$NOISF2= 0
##$NSP= 0
##$NTH_PI= 0
##$NZP= 0
##$OFFSET= 16.522
##$PC= 1
##$PHC0= -55.67305
##$PHC1= 7.165405
##$PH_mod= 1
##$PKNL= yes
##$PPARMOD= 0
##$PSCAL= 4
##$PSIGN= 0
##$REVERSE= no
##$SF= 250.13
##$SI= 32768
##$SIGF1= 0
##$SIGF2= 0
##$SINO= 400
##$SIOLD= 32768
##$SREGLST= <1H.CDCl3>
##$SSB= 0
##$STSI= 32768
##$STSR= 0
##$SW_p= 5175.98343685301
##$SYMM= 0
##$S_DEV= 0
##$TDeff= 65536
##$TDoff= 0
##$TI= <Analysis number 999999
Compound Code 99
Book Reference 9
Project Code 9>
##$TILT= no
##$TM1= 0
##$TM2= 0
##$TOPLEV= 0
##$USERP1= <user>
##$USERP2= <user>
##$USERP3= <user>
##$USERP4= <user>
##$USERP5= <user>
##$WDW= 1
##$XDIM= 32768
##$YMAX_p= 515940660
##$YMIN_p= -157035
$$ End of Bruker specific parameters
$$ ---------------------------------
##NTUPLES= NMR SPECTRUM
##VAR_NAME=  FREQUENCY,     SPECTRUM/REAL,   SPECTRUM/IMAG
##SYMBOL=    X,             R,               I
##VAR_TYPE=  INDEPENDENT,   DEPENDENT,       DEPENDENT
##VAR_FORM=  AFFN,          ASDF,            ASDF
##VAR_DIM=   32768,         32768,           32768
##UNITS=     HZ,            ARBITRARY UNITS, ARBITRARY UNITS
##FACTOR=    0.157963299565203, 1,           1
##FIRST=     4132.6476996994, 0,             0
##LAST=      -1043.33573715361, 0,           0
##MIN=       -1043.33573715361, -157035,     0
##MAX=       4132.6476996994, 515940660,     0
$$ Real data points
##PAGE= N=1
##DATA TABLE= (X++(R..R)), XYDATA
$$ [...]
19300B600k6987L47P605j5479K2626J0744J1398j2565L432K366oj0078q80J6690
19286A1813q782N351J158j4042J447J4658j0657j06J0464J289n236j1057k98P775
19272C777N453J7162n125K1829J892k7804k7351L071K7552J4264P915M883N384
19259E2902K920j6939j4274m789j2368o670k518J0397j3069r691J7718P383k527
19246H475k985K536M272k7236o241P210M436q59n840L754L0638Q542q122j8838
19232b58M997m91j7172p630P783m335J6003q706M094J280O281J3414m430J806
19218A2636m301J497J2018j5l371j5014Q0K011p003n279J3202Q560n499L893Q565
19203B1980p221r604J337J924l527M442O273l440m359p554j1514Q359N004k436
$$ plain form
19300 2600 -24387 -24040 -16435 -31914 -9288 1456 12854 289 3721 6087 6081 -3997 -4877 11813
19286 11813 3031 8382 9540 -4502 -3055 11603 946 840 11304 12593 7357 -3700 -3998 3777
19272 3777 9230 26392 21267 43096 44988 17184 -10167 -7096 20456 34720 42635 47518 52902
19259 52902 55822 38883 24609 19820 7452 782 -1736 8661 -4408 -14099 3619 11002 8475
19246 8475 5490 8026 12298 -14938 -21179 -13969 -9533 -10392 -16232 -12478 18160 26702 18580 -258
19232 -258 4739 4248 -12924 -20554 -12771 -17106 -1103 -9809 -5715 -4435 1846 15260 10830 12636
19218 12636 8335 9832 21850 21835 18464 3450 3530 5541 -1462 -6741 6461 15021 9522 13415 21980
19203 21980 14759 5155 6492 8416 4889 9331 15604 12164 7805 251 -11263 -2904 2100 -336
19189c36P274k721k125L871J2566q51M69J6024P421j3933k3330j252J5790J554
19175B0421r258M022J0902K964j3709j935Q932N893j0576p713k829m585j4038
19162a1509J1332K774J5315K1888L163j7202k2210O493J9756K2281j2400l872
19150C5809r309p190Q604K8236K9009R842j3077j142L537L330j8127M799J5300
19137H9621J9607L537M758M0137k637m661L5951N7601L7657J3001M6153M3284
19125C84009J9357J8648J3772j0540l2612l2800j5934k1910r403Q072O534L8025
19113C65218L1093J1644R18q514k4547k4050o1226m4157k9413l7406l7435k8385
19101A13740k563M995n496k0957j5238m503M343J5397l491j7220k8743r82J3977
$$ plain form
19189 -336 6938 4217 2092 5963 18529 17678 18147 34171 41592 27659 4329 3077 18867 20421
19175 20421 11163 15185 26087 29051 15342 13407 22339 28232 17656 9943 7114 2529 -11509
19162 -11509 -177 2597 17912 39800 42963 25761 3551 10044 29800 52081 39681 35809
19150 35809 26500 19310 27914 56150 85159 95001 81924 80782 84319 87649 69522 74321 89621
19137 89621 109228 112765 117523 157660 155023 150362 186313 243914 281571 294572 340725 384009
19125 384009 403366 422014 435786 425246 392634 359834 343900 321990 312587 320659 327193 365218
19113 365218 396311 407955 408873 400359 375812 351762 290536 246379 216966 179560 142125 113740
19101 113740 111177 116172 110676 89719 74481 69978 74321 89718 86227 69007 40264 39282 53259
19088E3259p795j2227k28o252j2893P878p175M290L138O293r780O638J7913M918
19074D7977m398j0107j0599m75K2735p35r493m864K717K409j2895j8040k1355
19061a7123m788J0544N922J0874N218k589j941N679n627q10l182J6542j0311j0489
19047b081M624J7411J6787J7085l2845j2364J584L38N155J4243l948N887J5332
19034D7208j1979k5161n500p742o2J5332k367l908O530O939K692n198L201N948
19020B5933M680j0428N342p068j0881n553J8742Q980k878j0386j7241p994J9291
19007A0539J0064J360L382k286n616p282O690Q823l079j0998o914o855k3863J3208
18993a2827J2321k680k5008n9K2110K2031N632j487j430N194M00n77J1756R982
$$ plain form
19088 53259 45464 33237 33009 26757 13864 21742 14567 18857 21995 28288 18508 25146 43059 47977
19074 47977 43579 33472 22873 22398 45133 44398 34905 30041 32758 35167 22272 4232 -17123
19061 -17123 -21911 -11367 -5445 5429 10647 8058 6117 11796 6169 5359 2177 18719 8408 -2081
19047 -2081 2543 19954 36741 53826 20981 8617 10201 10539 15694 29937 25989 31876 47208
19034 47208 35229 10068 4568 -3174 -3236 12096 9729 5821 12351 19290 21982 16784 19985 25933
19020 25933 30613 20185 25527 18459 7578 2025 20767 29747 26869 16483 -758 -8752 10539
19007 10539 20603 21963 25345 23059 17443 10161 16851 25674 22595 11597 4683 -2172 -26035 -12827
18993 -12827 -506 -3186 -28194 -28253 -6143 15888 21520 20033 18603 23797 24197 23620 35376 45358
18979D5358j7874r635Q974J4930L386J155r552q190p18J994r05J9161q434o613
18965C3037k405J0679m107l832K5438p524o032j7813j3096k2559j0248j7984L8727
18952B281L5150J4433l416q353p376j1813n97K242L59k153L262L941O110q967
18938B5103j324J0381M970k6790n619L335J0490J7701J1077m33r685o752k455
18925B9999j0170J446q546J0953L0192j549p437r120R631J1100p967j986j8669
18912B7877j755K2355K0999l947j1397K425j27q443j1370J896J5183m88n95P788
18898F0401q077N21r966j3323n893K612P887N86k3272k300K4554Q390N834p019
18884D0935o188Q563l119K617K6459L277L622L724j7195k8766j6355J357J8402
$$ plain form
18979 45358 27484 17849 26823 41753 45139 46294 36742 28552 27834 29828 28923 48084 39650 33037
18965 33037 30632 41311 37204 33372 58810 51286 45254 27441 14345 -8214 -18462 -36446 2281
18952 2281 37431 51864 48448 40095 32719 20906 20309 22551 22910 20757 24019 27960 34070 25103
18938 25103 23779 34160 39130 12340 6721 10056 20546 38247 49324 48891 39206 32454 29999
18925 29999 19829 21275 12729 23682 53874 52325 44888 35768 45399 56499 48532 46546 27877
18912 27877 26122 48477 69476 65529 54132 56557 56430 47987 36617 38513 53696 53208 52613 60401
18898 60401 52324 52845 42879 29556 23663 26275 34162 34748 11476 9176 33730 42120 47954 40935
18884 40935 34747 43310 40191 42808 69267 72544 76166 79890 62695 33929 17574 18931 37333
18871C7333J5121n576n000j1267N463J397J0678J9510M559r209q560N864M395
18858F4708l125k3867k7985L383K7959K8451q054p049p878M062J3630p147n002
18845E2086O28O724O840P975j4890r375j7980j0176J818r823k6934J0402J7404
18832A4699J1312l945j1621J5616J4874j1167J951N385J4003j2089k7607J0222
18820B1633L0834k2583k0230J8722J0034K6167M810R651k4156j4943L260Q886
18808E2085O198j7947m010o123J0525K1558P122r851P624q635n449n723J5455
18795F2829J2508J6875O462M324p143Q33o357k4270R131K8674L8871L1835p150
18782A67422k2608j593j3813n002J7076J2224j944L100j2312k8834k693J2709
$$ plain form
18871 37333 52454 46878 41878 30611 36074 37471 48149 67659 72218 63009 54449 60313 64708
18858 64708 61583 37716 9731 13114 41073 69524 61470 54421 46543 50605 64235 57088 52086
18845 52086 52714 59438 66278 74253 59363 49988 32008 21832 23650 13827 -13107 -2705 14699
18832 14699 26011 22066 10445 26061 40935 29768 31719 37104 51107 39018 11411 21633
18820 21633 52467 29884 9654 28376 38410 64577 69387 79038 54882 39939 43199 52085
18808 52085 58283 40336 36326 30203 40728 62286 69408 59557 67181 58546 53097 47374 62829
18795 62829 75337 92212 98674 102998 95855 96688 90331 66061 75192 103866 142737 174572 167422
18782 167422 144814 143221 129408 124406 141482 153706 151762 154862 142550 113716 111023 123732
18770A23732R41J8535M6055J2844Q393J2457j6674k4628j7419l2967k4123j1708
18758I5438R456O700l675r410k515p852j9848P745J859J862O94k07K0838P416
18744A08501J6070L052k2364k2095j540K0406J2176k997p999j4025K100O455R015
18731A06755l582k4029m283J5416j3475o390J649P004J2995J1957o303J4610O978
18718A19302r419J078J1779j1824o475L37K1433L847j9852L217K0874j9J1139
18705A45417k209L123Q10J9453J4591m650l473j6546j8335o566n309r60N617J7389
18691A48352J3110M24k544L291j471J2959K604j738O214n594m886r35K3009K2297
18677B15092n35k843L135Q649o833j2549J1759Q228m465J5523J0050N63J4970
$$ plain form
18770 123732 124673 143208 189263 202107 210500 222957 206283 181655 164236 131269 107146 95438
18758 95438 104894 111594 107919 98509 95994 88142 68294 76039 77898 79760 80454 80247 101085 108501
18744 108501 124571 127623 105259 83164 81624 102030 114206 111209 103210 89185 91285 97740 106755
18731 106755 103173 79144 74861 90277 76802 70412 72061 79065 92060 104017 97714 112324 119302
18718 119302 109883 110961 122740 110916 104441 104778 126211 130058 110206 113423 134297 134278 145417
18705 145417 143208 146331 147141 166594 181185 176535 173062 156516 138181 131615 126306 125346 130963 148352
18691 148352 161462 161886 159342 162633 161162 174121 176725 174987 181201 175607 170721 169786 192795 215092
18677 215092 214557 211714 214849 223498 216665 204116 215875 224103 219638 235161 245211 245774 260744
18664B60744J4634J1301J5363q52j6539j9766j4041n406M789N142N320J969N709
18651B68367k372n038R78J3545K572o794j691j179k0513M231L3618J6953p621
18638B95056J5672R424M662J3983K5515P470k0560j224M407K1720J209j286K2302
18625C98350K6462L3627L1102o07r999L833J7380J1019J9363K8514L609l756k118
18612E56779Q018k068J8862Q983J5202J7292p199J6282J6197R191J5776K9085
18600G02400N691R053j0416K1063L7565K8761N8283J7714K025J0663K5942J7540
18588I26284J6988L9791M0461K9395K6795O5855O1121N6397K7333L2327L6814
18577A359561P8501P9793P1646P6232R1777R6200R7048J26019J32645J23857J51342
$$ plain form
18664 260744 275378 286679 302042 301190 284651 264885 250844 245438 250227 255369 260689 262658 268367
18651 268367 265995 260957 261935 275480 278052 271258 269567 268388 247875 252106 285724 302677 295056
18638 295056 310728 320152 324814 338797 364312 371782 351222 349998 354405 376125 377334 376048 398350
18625 398350 424812 458439 489541 488934 478935 482768 500148 511167 530530 559044 562653 558897 556779
18612 556779 564797 562729 581591 590574 605776 623068 615869 632151 648348 657539 673315 702400
18600 702400 708091 717144 706728 727791 765356 794117 852400 870114 872139 882802 908744 926284
18588 926284 943272 983063 1023524 1052919 1079714 1145569 1206690 1263087 1290420 1322747 1359561
18577 1359561 1438062 1517855 1589501 1665733 1757510 1853710 1950758 2076777 2209422 2333279 2484621
18566B484621J59656J47703J60944J87412J92236K14377K46977K71580L05272
18557D370778L54960M05135M55385N22363O26863P07997P76332Q49480R63585
18548A0032878J073206J180727J285003J364410J461219J528922J604544J737897
18540B1268806J937778K289585K876535L612127M529779N520715O369247O819293
18532E5223865O625284N750722M272530K377922Q5053k615013m986439n693472
18524F1040452m483998k219496Q9739K052736L397920L920375L579643K469009
18516F9846380P72587j339366l979886o805891q486810q324470o957975n380265
18508B9344304m053050l075663k325100j823707j448750j163317r95630q77433
$$ plain form
18566 2484621 2644277 2791980 2952924 3140336 3332572 3546949 3793926 4065506 4370778
18557 4370778 4725738 5130873 5586258 6108621 6735484 7443481 8219813 9069293 10032878
18548 10032878 11106084 12286811 13571814 14936224 16397443 17926365 19530909 21268806
18540 21268806 23206584 25496169 28372704 31984831 36514610 42035325 48404572 55223865
18532 55223865 61849149 67599871 71872401 74250323 74335376 71720363 66733924 61040452
18524 61040452 56556454 54336958 54426697 56479433 59877353 63797728 67377371 69846380
18516 69846380 70618967 69279601 65299715 58493824 50007014 41682544 34724569 29344304
18508 29344304 25291254 22215591 19890491 18066784 16618034 15454717 14459087 13581654
18500A3581654p98976p60072p35421p17573o76462o11907n64732n28787m80425
18491G707299m71454m30722l92701l57162l54151l52243l11603k68791k58329
18482D510143k37469k19803k02891k33024k32221j90436j70924j53053j43065
18473B727257j44709j40360j53573j25501j20608j09224j15759r1218q4540p9273
18463A562492n5566n0004m8526n5161o3752n8993n8623m0768m8479n1127n2653
18452I78840n8042m2524j2872k2002l9916k2428l3960j7405k7835k7690k7540
18441F46626k2696j0306j0964j7441l2849l4497j7771j8045k2704j785J1429J1724
18429D80721p409k8345j3221M932o76j8197l7275k2114l279J2618M503o303j7672
$$ plain form
18500 13581654 12782678 12022606 11287185 10569612 9893150 9281243 8716511 8187724 7707299
18491 7707299 7235845 6805123 6412422 6055260 5701109 5348866 5037263 4768472 4510143
18482 4510143 4272674 4052871 3849980 3616956 3384735 3194299 3023375 2870322 2727257
18473 2727257 2582548 2442188 2288615 2163114 2042506 1933282 1817523 1726305 1641765 1562492
18463 1562492 1506926 1456922 1408396 1353235 1289483 1230490 1171867 1131099 1082620 1031493 978840
18452 978840 920798 878274 865402 843400 803484 781056 747096 729691 701856 674166 646626
18441 646626 623930 613624 602660 585219 552370 517873 500102 482057 459353 457568 468997 480721
18429 480721 473312 444967 431746 436678 436002 417805 380530 358416 355137 367755 372258 365955 348283
18416C48283j1781J9249j846n715j1888L87k5118j7159K0501r42Q550p947l621
18403C10953j0751m55J097J1407k011j2836m492k2665l162M211k629L015Oj400
18389B70288j1434j4859j3154J6970J1754q652l8601k1346N513r274k846j1778
18377A72581j006O805O8Q617J6127j5726o240p18j489n700l863K864J3972R40
18363A87232q698l140j4635n271M608j173K592J0381j1129j5182p736l759p65
18350A33325J5887J2809J414j6172N278k409n682J029Q494J459K0261j0478m3511
18337A21704K803J3163j5883n93r986r617J0104J8819J655r666r685J1186K2420
18324A46424l396j6065n844r362J2426J9226P708p58j8510j0818J035N857l358
$$ plain form
18416 348283 336502 355751 353905 348190 336302 336689 311571 294412 314913 313971 322521 314574 310953
18403 310953 300202 299747 300844 312251 310240 297404 292912 270247 267085 271296 268667 271682 271688 270288
18389 270288 258854 243995 230841 247811 259565 250913 212312 190966 196479 187205 184359 172581
18377 172581 171575 178380 178448 187065 203192 187466 181226 180508 179019 173319 169456 172320 186292 187232
18363 187232 178534 175394 160759 155488 160096 158923 161515 171896 160767 145585 137849 134090 133325
18350 133325 149212 162021 163435 147263 152541 150132 144450 145479 153973 155432 175693 165215 121704
18337 121704 124507 137670 121787 121194 111208 101591 111695 130514 132169 122503 112818 124004 146424
18324 146424 143028 126963 121119 111757 124183 143409 151117 150359 131849 121031 122066 127923 124565
18311A24565k708n803M620r708j01m324j1530K5274r09P945p703L677o462j1824
18297A05009m15k2596j4688J0202j0010M779J1740j2604p127J4608R918N889O286
18284A00991J3847M215j1338k5269k9625p449j678J5626N201J758Q068n361J2680
18271H1666j0651r265J861J5517O102j3904r197J8474R748j4444p147j321p618
18258E9821J3587L020l443j2765j1699Q825J3550J0734L310r49n342j7309l374
18245E7966l284J6028Q402J2029J8650k997j6681p069J4608P233j0409k4657j1096
18232E8723K0747J6971L474L397J016O061J0657P431p865O01J1129k4110l0364
18219G7868j669m738q466m262J6874J8967k3278j1931J4348k44m599O335j4273
$$ plain form
18311 124565 121857 116054 120674 110966 110865 106541 95011 120285 119376 127321 119618 123295 116833 105009
18297 105009 104594 81998 67310 77512 67502 72281 84021 71417 64290 78898 88816 94705 100991
18284 100991 114838 119053 107715 82446 52821 45372 43694 59320 64521 66279 74347 68986 81666
18271 81666 71015 61750 63611 79128 85230 71326 62129 80603 90351 75907 68760 67439 59821
18258 59821 73408 76428 72985 60220 48521 57346 70896 81630 84940 83991 78649 61340 57966
18245 57966 54682 70710 79112 91141 109791 106794 90113 83044 97652 104885 94476 69819 58723
18232 58723 79470 96441 99915 103312 104328 110389 121046 128477 120612 121213 132342 108232 77868
18219 77868 76199 71461 62995 58733 75607 94574 71296 59365 73713 73469 68870 75205 60932
18206F0932j1210L443J1774J5570j6355r364J4926J4653j7010j1944J0684K080
18194F8179q63L36P576Q84M529r289p815r919M946o173L677Q577J6814q494j7579
18179E5386j199J6992k0071j2021J6528N369n650m94K3198j393P225J5895m15
18166I9350R035m880J2539N55k1574L05Q465l271j9476J2493J6990M058J2325
18153A26914n123k071R934K1636P987J4992N76k914l203K3924N2122O334Q428
18140B59536M738J8294L0525L7022L0496M7371M6167O7770Q2821J15954J25295
18129H65989J37133J62168K06309K18077K22284K78391L35347L64686L54000L07040
18119C451424K59828K38205K05480K35961L57168O85533J235635J928105K562155
$$ plain form
18206 60932 49722 53165 64939 80509 64154 54790 69716 84369 67359 55415 66099 68179
18194 68179 67316 67652 75228 76112 80641 71352 63537 53618 58564 52391 56068 64645 81459 72965 55386
18179 55386 54187 71179 51108 39087 55615 60984 55334 54840 78038 76645 83870 99765 99350
18166 99350 108385 103505 116044 116599 95025 95330 103795 100524 81048 93541 110531 114589 126914
18153 126914 121791 119720 129654 151290 159277 174269 174845 171931 168728 192652 244774 251108 259536
18140 259536 264274 282568 313093 350115 380611 427982 474149 541919 624740 740694 865989
18129 865989 1003122 1165290 1371599 1589676 1811960 2090351 2425698 2790384 3144384 3451424
18119 3451424 3711252 3949457 4154937 4390898 4748066 5433599 6669234 8597339 11159494
18110A1159494L071782L194164K478750J248058O05395R04957j464616o593230
18102A4604754n853471k975194j509414q44840n20585l34786k27765j65802j09205
18093B063692o2980j7152p902o7563r8629j36073j24658r1569o5094o4936o7146
18082A259990m7381k6549j2779N23L280j6608k8129k9448n8547r0099j02466r1732
18070G60055p5118j8370m6J7408J7788K9787J8562j7603j6976k3946l1074r0078
18058E70389r9409o8392n0431m5635l7031K666k5123p284n788j2124q864j6978
18046A95996q544o004n677p343K799j514k8467j1120o483j0840K997j0708j5164
18033H9928j8267j2413o053n22J6952k30q657J6569J3834K714N434L366k6816
$$ plain form
18110 11159494 14231276 17425440 19904190 21152248 21757643 22662600 21197984 14604754
18102 14604754 8751283 5776089 4266675 3421835 2901250 2566464 2338699 2172897 2063692
18093 2063692 2000712 1983560 1975658 1908095 1809466 1673393 1548735 1457166 1392072 1327136 1259990
18082 1259990 1212609 1186060 1173281 1173804 1177084 1160476 1132347 1102899 1044352 954253 851787 760055
18070 760055 684937 666567 666521 683929 701717 731504 750066 732463 715487 691541 660467 570389
18058 570389 470980 402588 352157 306522 269491 272157 247034 239750 233962 221838 212974 195996
18046 195996 187452 181448 175771 168428 171227 169713 141246 130126 123643 112803 115800 105092 89928
18033 89928 71661 59248 53195 52673 69625 69395 60738 77307 91141 93855 99289 102655 75839
18020G5839k6600j5759j3839l66o579r465K5929K3141r958K5591N961l3855j5340
18007B4700N509N086r931j5938J7848K3539k551j3023o092N622J910J4542O709
17994E7930j2844l1130m971J0398N992p055k564k9019j2706J1549J3750K1363
17982B0693J6625J0401M761J6289l514k3020j0036J800J3867K0987M207r081p071
17969E6908j2243q472J3152J2877o357p245n823R066K5611O802J1739q6j376L707
17955I8260n901M74J1993O77j8349K893K398J4062N856m593k9j7607J1967P431
17941A09532L882Q447J9045K1218K1055J3356L0901K2335J1880R578K3039L7348
17929C31616L7176L3864N641J8593k15j8048j6236k7810p476o771p343J8110M981
$$ plain form
18020 75839 49239 33480 19641 19275 12696 3231 29160 52301 42343 67934 73895 40040 24700
18007 24700 30209 35295 25364 9426 27274 50813 48262 35239 29147 34769 36679 51221 57930
17994 57930 45086 13956 8985 19383 25375 18320 15756 -13263 -25969 -14420 -670 20693
17982 20693 37318 47719 52480 68769 65255 42235 32199 33999 47866 68853 73060 63979 56908
17969 56908 44665 36193 49345 62222 55865 48620 42797 51863 77474 84276 96015 95929 94553 98260
17955 98260 92359 92833 104826 105503 87154 90047 92445 106507 112363 107770 107741 90134 102101 109532
17941 109532 113414 121861 140906 162124 183179 196535 227436 249771 261651 271229 294268 331616
17929 331616 368792 402656 408297 426890 426675 408627 392391 364581 357105 350334 342991 361101 366082
17916C66082J5498L1110o147o129P511j6429m2955n9546l3305P7k6530n2950m5434
17903A30853j751q363J152l983j1892R001n363j2086j503r481J369o876k5944
17890E5133j7794N966N591N733R567N354j6448k3432m287J1930J8150j2888r439
17877C3136J976K7250J8853j446k0818j7726J954N035J6214j0173j0508j7077
17865B6670o596o445K653J0384J8384J2193J981R310j1759j6631j4129P674R026
17852D2715J1215j2449P77J6921O40J2784j974j2280j0617m580j4133O438Q192
17839D3649N018p178k3632n629J7137l766M729J4206J272l763j1061j697K2072
17826E1357o149k4365j7825n486K927r933J1536K8248j0093J329n691o940R079
$$ plain form
17916 366082 381580 412690 406543 400414 407925 391496 348541 288995 255690 255767 229237 176287 130853
17903 130853 129102 120739 121891 117908 106016 115017 109654 97568 96065 86584 87953 81077 55133
17890 55133 37339 43305 48896 54629 64196 69550 53102 29670 25383 37313 55463 42575 33136
17877 33136 35112 62362 81215 79769 58951 41225 43179 48214 64428 54255 43747 26670
17865 26670 20074 13629 16282 26666 45050 57243 59224 68534 56775 40144 26015 33689 42715
17852 42715 53930 41481 42258 59179 59819 72603 70629 58349 47732 43152 29019 35457 43649
17839 43649 48667 41489 17857 12228 29365 25599 30328 44534 45806 42043 30982 29285 51357
17826 51357 45208 20843 3018 -2468 459 -9474 2062 30310 20217 21546 15855 8915 17994
17813A7994M715J0424j3650j6050N094q908j034K8985J2764o571J3129P33j0862
17800C6763r646r422P2K17Q667N081N575L733j4005O628O827O596J0371J5450
17786G2907L937O822O33j337Q435O051l770j250j2005J6781L701q037j759j457
17772H9652J3841o521k3153N902L478J5239Q193j242j8727J1201J1277k3874N514
17759I0780L602m394Q786M782j6329m072R315j9158j6743j8680o129J3381l574
17746D1567K975J5847P322j497l960K31K61p526l430R101K076j2853N42O124P29
17731E7509O67O302j1568p846Q211j884j801j4716q878J2958J5684K083r817Q387
17717E5291N580J5920r909J0575N849j4096n897q615k29J4071Q200r336J0574
$$ plain form
17813 17994 22709 33133 19483 3433 8527 -381 -1415 27570 40334 33763 46892 47625 36763
17800 36763 27117 17695 17767 17984 26651 31732 37307 41040 27035 33663 40490 47086 57457 72907
17786 72907 76844 83666 84299 82962 91397 97448 93678 92428 80423 97204 100905 92868 91109 89652
17772 89652 103493 96972 73819 79721 83199 98438 106631 105389 86662 97863 109140 85266 90780
17759 90780 94382 89988 98774 103556 87227 83155 92470 73312 56569 37889 31760 45141 41567
17746 41567 44542 60389 67711 66214 62254 62485 62746 55220 51790 60891 62967 50114 50656 56780 57509
17731 57509 58176 64478 52910 45064 53275 51391 49590 34874 25996 38954 54638 56721 46904 55291
17717 55291 60871 76791 66882 77457 83306 69210 63313 54698 54469 68540 76740 67404 77978
17704G7978N089R608k755r816O367N830j1610j1159O562R020j5040K442K9940
17691A02456K711M690J979k89P358M790p324J12r707k0738j2759J5863K2059r02
17677A10299j790k899l789K237J4696J9027k0662j3084r326J9758K4004J3057
17665A51528R471j649j808M090M59j065r277n168p335M447K7854M0940P238R536
17651B29261r178k1144j1174j6330j0009l4299j7279J2365K1730K3787K2494J0053
17639B00277J5146P231n406m193j8987o61j4278o556j4737j4903O208J6958K7355
17626A93454K0351L4121Q758k3425j3430k560k171k8907O737J3769K4592R433
17614B40722K6356R639N039Q205J0808J1910R324n48J0212R454O033Q743J6354
$$ plain form
17704 77978 83067 92675 89920 80104 86471 92301 80691 69532 76094 85114 70074 72516 102456
17691 102456 105167 109857 111836 111547 118905 123695 116371 116483 106776 86038 73279 89142 111201 110299
17677 110299 108509 105610 101821 104058 118754 137781 117119 104035 94709 114467 138471 151528
17665 151528 160999 159350 157542 161632 162091 161026 151749 146581 139246 143693 171547 212487 219725 229261
17651 229261 220083 198939 187765 171435 161426 127127 109848 122213 143943 167730 190224 200277
17639 200277 215423 222654 217248 213055 194068 193407 179129 172573 157836 142933 149141 166099 193454
17626 193454 213805 247926 256684 233259 219829 217269 215098 186191 192928 206697 231289 240722
17614 240722 267078 276717 281756 289961 300769 312679 322003 321455 331667 341121 347154 355897 372251
17601C72251K4271K2643L771l797J3646K2304K977l0739j3455K4984K5826j116
17589D63566R109J0102J2853K310J225L7559L8690K8951o163j8028Q28M318R549
17576E94869K6125K3318o829K8878K7763Q617J7111J8490N2209K9891J9279L6208
17564H75929L3691L3405M5307M0064L4590L7624R1780P6322Q8432P0564Q1105
17553A508813Q7495O4789J02579J81911J95551J99908K21700K74679L41106M01552
17543C580083M65167N10308N83239O52171P09705Q29701R90739J149775J272069
17534A0742957J418039J568384J645542J607621J526947J457864J544807J854558
17526B3366719K490053L719959N531967P740838R808694J1213315J1206970R252030
$$ plain form
17601 372251 396522 419165 422936 419139 432785 455089 458066 427327 413872 438856 464682 463566
17589 463566 472675 482777 495630 497940 499165 536724 575414 604365 598202 580174 581002 585320 594869
17576 594869 620994 644312 637483 666361 694124 702741 719852 738342 790551 820442 839721 875929
17564 875929 909620 943025 988332 1028396 1062986 1100610 1192390 1268712 1357144 1427708 1508813
17553 1508813 1596308 1661097 1763676 1945587 2141138 2341046 2562746 2837425 3178531 3580083
17543 3580083 4045250 4555558 5138797 5790968 6500673 7330374 8321113 9470888 10742957
17534 10742957 12160996 13729380 15374922 16982543 18509490 19967354 21512161 23366719
17526 23366719 25856772 29576731 35108698 42849536 52658230 63871545 75078515 84330545
17518H4330545O067754L629402J305525n842854j5213145j5357256q765654k639658
17510D7514659J877937N282420P604228Q541712P496931M874929K387085P25137
17502H6305038m398737j4186890j7982057j3335137q185842n103178l408840k384385
17494A7319972j674506j196367q90689o69193n34678m65416n41667o70001p58200
17485I919255q06488p67129o57133n42455m50073m06721l69773l44915l36240
17476E238328l26520l02463l44302l41824l09961k41269k38948k17731j96104
17467B719206j73690j32251j38183j40927j16499q7956r3811j10709r0605q9064
17457A545511q5440r7969q1781o2550m9748m3947m8205o3482m8701k6073l9682
$$ plain form
17518 84330545 90398299 94027701 95333226 89490372 74277227 58919971 50154317 47514659
17510 47514659 49392596 54675016 62279244 70820956 78317887 83192816 85579901 86305038
17502 86305038 81906301 67719411 49737354 36402217 28216375 23113197 19704357 17319972
17494 17319972 15645466 14449099 13558410 12889217 12354539 11889123 11347456 10677455 9919255
17485 9919255 9112767 8345638 7688505 7146050 6695977 6289256 5919483 5574568 5238328
17476 5238328 4911808 4609345 4265043 3923219 3613258 3371989 3133041 2915310 2719206
17467 2719206 2545516 2413265 2275082 2134155 2017656 1929700 1835889 1725180 1634575 1545511
17457 1545511 1460071 1362102 1280321 1217771 1168023 1124076 1075871 1012389 963688 937615 897933
17446H97933l6361l6374m9326k7454k2104k6368k0910k1101k3793k1496n8866
17435E53780m0604j4003k2779m8213k8820q3k2914l8745l4616j290Q03j8240k6699
17422B57577p417j635K513n137j2903n487m908Q633P019K3785k828q534j9487
17409B31191k6209j2458N23L9436J8213M42O660m877j1553m990k0155l973j075
17396B11175k537K2564K0183K2548J6627r539j4269j8045m3091m2568k7678p830
17384A27540P734j1428L838K5756J9918Q377J0137L952r63k478j1175k3828k3484
17371A33896k2799m362J0225k425J3668p293m978N192J0166j5295m299L933j5575
17358A00054j2295J3511K4668J5519L449j9215J4704R576O041J1991J258j7824
$$ plain form
17446 897933 861572 825198 775872 748418 726314 699946 679036 657935 634142 612646 553780
17435 553780 513176 499173 476394 428181 399361 399278 376364 337619 303003 301713 302516 284276 257577
17422 257577 250160 248525 251038 245901 232998 227511 222603 231236 238255 262040 259212 250678 231191
17409 231191 204982 192524 193047 232483 250696 251138 257798 252921 241368 236378 216223 212250 211175
17396 211175 208638 231202 251385 273933 290560 281021 266752 248707 205616 163048 135370 127540
17384 127540 135274 123846 127684 153440 173358 181735 191872 195824 194861 192383 181208 157380 133896
17371 133896 111097 106735 116960 114535 128203 120910 115932 121124 131290 115995 111696 115629 100054
17358 100054 87759 101270 125938 141457 144906 125691 140395 149971 156012 168003 169261 151437
17346A51437J5986R888l500q647J3636l094l0658k2879P741J4060n063p606R037
17333A40338J6821j0470j4234j1178J4203J7471M03k3564k7982m659m346N674
17321I8477K912q745n45J94r673m221R091J460J2415J4172k1795k5014O675P41
17307G6144k3133O04J9740J3847M188Q39j3408k0562J5316k040r217o364L768
17294E9722J221Q35l360o876j231j344n595Q708j0526j0072m79O007j1735P753
17280C3028J2149J124j0805p804k3101Q307J2840K3353L966j6144k8206L680o18
17267A1769k248j594j4494R479O817J70k0073j5226M02Q597J9855R502n353n424
17253B179J4880K4676q955j6195l2401k2846L1596J1592R713J3897l6151o591
$$ plain form
17346 151437 167423 177311 173811 165164 178800 175706 145048 122169 129910 143970 138907 131301 140338
17333 140338 157159 146689 132455 121277 135480 152951 153354 129790 101808 97149 92803 98477
17321 98477 101389 92644 92099 92293 82620 78399 87490 88950 101365 115537 93742 68728 75403 76144
17307 76144 53011 53615 73355 87202 91390 92229 78821 58259 73575 71535 62318 55954 59722
17294 59722 60943 61778 58418 51542 50311 48967 43372 52080 41554 31482 31003 37010 25275 33028
17280 33028 45177 46301 35496 27692 4591 12898 25738 49091 53057 36913 8707 12387 11769
17267 11769 9521 7927 -6567 2912 9729 9899 -10174 -25400 -24998 -16401 3454 12956 7603 2179
17253 2179 17059 41735 32780 16585 -15816 -38662 -7066 4526 14239 28136 -8015 -14606
17241a4606L3371J3281p383j1700J5607K1371l516p680j0861j0609M964j2219
17229A0020j3387J0304n650Q09K2273M690K353k5336q767J5511J1942J5946P30
17216D1438J9902K4435o64o832j198r945j1135p905j2461n46J3048J1078K9337
17203H8552j2814k3237k964j6447p541J1734k100p269K344l042m558j6992K439
17190H105J9579J1501j0703j8292L006n856l290m472k631K618O999J7896K862
17177B7322k9720j4338O494m014o003J036J8475N110j6262j2920J8474J4246k5259
17164a7359p764j769J3855J3922J1767n218r74J4940k090j5356m996k5232j852
17151b8126O153l131R102n189J736N295j291Q076K1687J3376J1048K3100q511
$$ plain form
17241 -14606 18765 32046 24663 12963 28570 49941 46425 38745 27884 17275 22239 10020
17229 10020 -3367 6937 1287 2096 24369 29059 31412 6076 -2691 12820 24762 40708 41438
17216 41438 61340 85775 85111 78279 77081 67136 56001 48096 35635 35089 48137 59215 88552
17203 88552 75738 52501 49537 33090 25549 37283 35183 27914 30258 27216 22658 5666 8105
17190 8105 27684 39185 28482 10190 13196 7340 4050 -422 -3053 -435 6564 24460 27322
17177 27322 -2398 -16736 -10242 -14256 -20259 -19223 -748 4362 -11900 -24820 -6346 7900 -17359
17164 -17359 -25123 -26892 -13037 885 12652 7434 6460 21400 19310 3954 -1042 -26274 -28126
17151 -28126 -21973 -25104 -16002 -21191 -19455 -14160 -15451 -7375 14312 27688 38736 61836 53325
17138E3325k1516j7767j659n937q726j805j699J2510M188l945P618l600K49m279
17124F957j0815L471L193k95r126l940k756m470P841O649Q605J5152o23j4281
17110E562J5540j0903J1116j0010j986O44J8941J3599p368l6189k0685j6682M337
17097c4084J7875J1447j767N780J1580L067R892l439o713r632J8754J5165J354
17084C9279k2566j3389j759o536O114n125qn266K118m64O651j5940R347K1389
17070A3845k118j59k0039j047j0927J661P303r721K566J3780l209j9922J7302
17057a0685K2357m236L183K921j1186M727K1994M6k6290k140M2440P846k7784
17044B3193j1601k074J5331J9866p26j151j964K164O89m811l344R408J7100j244
$$ plain form
17138 53325 31809 14042 12383 6446 -2280 -4085 -5784 6726 10914 6969 14587 10987 11236 6957
17124 6957 -3858 -387 2806 2511 -6615 -10555 -13311 -17781 -9940 -3291 5314 20466 19843 5562
17110 5562 21102 10199 21315 11305 9319 9963 28904 42503 35135 -1054 -21739 -38421 -34084
17097 -34084 -16209 -4762 -6529 -749 10831 13898 23790 20351 13638 4006 22760 37925 39279
17084 39279 16713 3324 1565 -4971 1143 -3982 -3990 -9256 -7138 -7602 -951 -16891 -7544 13845
17070 13845 11727 11568 -8471 -9518 -20445 -18784 -11481 -21202 -18636 -4856 -8065 -27987 -10685
17057 -10685 11672 7436 10619 13540 2354 7081 29075 29121 2831 691 43131 50977 23193
17044 23193 11592 9518 24849 44715 43989 42838 40874 43038 43727 38916 35572 44980 62080 60836
17030F0836k9441j7675M057j663l85J361j5538k7226j0209K9461K9795j9610J390
17017E153M237r879q310n826k861J823J854P154O154L163Q246r435m422Q057R955
17002A5063Q482q007m651q650j1772J049J0052P931o657j2506J0320j2014j4028
16989b5388o592J4538K5491M009P38O459n79L798n018n945r942J9779q06j3233
16975G309J0765J0887P387k832p64J5393o443j0771J280L0363J9025J1530J7362
16962A10491J4516J7122K6897M765K8580N6642O9587P4819M5733L1236K3818K3499
16950E27705k3267n7199p6378o0407l1878L401R627L4496N8541N2130K8528J7853
16938D83152j2740j3206n8604q6663n9900o5448m1813l7399j4449r227m772N26
$$ plain form
17030 60836 31395 13720 17777 16114 15729 17090 1552 -25674 -35883 -6422 23373 3763 5153
17017 5153 9390 -489 -8799 -14625 -17486 -15663 -13809 -6655 -501 2662 10908 1473 -2949 5108 15063
17002 15063 23545 15538 10887 2237 -9535 -8486 1566 9497 2840 -9666 654 -11360 -25388
16989 -25388 -31980 -17442 8049 12058 12796 19255 18676 22474 17456 11511 1569 21348 20542 7309
16975 7309 18074 28961 36348 33516 32752 48145 41702 30931 32211 62574 81599 93129 110491
16962 110491 125007 142129 169026 173791 202371 259013 328600 403419 449152 480388 504206 527705
16950 527705 504438 447239 370861 310454 278576 281977 291604 326100 384641 436771 465299 483152
16938 483152 470412 457206 398602 311939 252039 186591 144778 107379 92930 83703 78931 79457
16926G9457j3748j5239k5075J218J1763N514Q004l590j5088l824O682j0093J282
16913B7263Q097j9580Q264R218j2952j8599m030p285K235L039k031K0479K2195
16900C6313J4559k1633j1126J4754j3571l0448q811J6617j340J6686k51J452j4369
16887a168n361J1908J8865m499j651j5590j0781Q293J9361p073k1635l691J6856
16874C834J7754p488j6059J2792j0085M413J2095k202j2432p519l1576o832J871
16861d1434m527L4260L104k1055q024J9823o935p692K4790N890J3126P821m265
16848A4882p932J2488k0603j4316M109J8081m253n270M028J1160m474p865R99
16835A034K789L504L775J3777o634l210J0479q94j8479p24n351k1848M378J1231
$$ plain form
16926 79457 65709 50470 25395 26613 38376 43890 51894 48304 33216 29392 36074 25981 27263
16913 27263 35360 15780 24044 33262 20310 1711 -2319 -9604 -7369 -4330 -6361 14118 36313
16900 36313 50872 29239 18113 32867 19296 -11152 -19963 -3346 -4686 12000 11749 13201 -1168
16887 -1168 -6529 5379 24244 19745 18094 2504 -8277 16 19377 12304 -9331 -13022 3834
16874 3834 21588 14100 -1959 10833 748 5161 17256 15054 2622 -4897 -36473 -43305 -41434
16861 -41434 -45961 -11701 -8597 -29652 -37676 -17853 -24788 -32480 -7690 -1800 11326 19147 14882
16848 14882 6950 19438 -1165 -15481 -11372 6709 2456 -2814 1214 12374 7900 35 1034
16835 1034 3823 7327 11102 24879 18245 15035 25514 24620 6141 5417 66 -21782 -17404 -6173
16821f173l051J0830j1614J717K3727J5627n468j3125k4458M273P640J9048K554
16808B1527n650k2486r586m837o393R475R340K0075J1019J1245p319j2043j6007
16795a640L913M619l773J3922r550m623j0370J4556l651o892L674O135j299n414
16781c93j6984j2907l231M747K003J5440N295K617m127j3289l550r861R545L048
16767b1647J559QJ162J4341P333j6374q894k120J260n840j793o74M629R298J1852
16752e900j1715j0493p783o515J8260J4755O129r877K1387O983j071M701J428
16739B0289j1003J4924K7062J0346k8598k3180m935p706o423j14P498j4284o430
16726b2554r002N734R696M45K165J3938k0032J9292J7344J135J461r839O244J925
$$ plain form
16821 -6173 -9224 1606 -10008 -8291 15436 31063 25595 12470 -11988 -7715 -75 18973 21527
16808 21527 15877 -6609 -16195 -21032 -27425 -17950 -8610 11465 22484 33729 26410 14367 -1640
16795 -1640 2273 6892 3119 17041 7491 2868 -7502 7054 3403 -3489 185 6320 5021 -393
16781 -393 -17377 -30284 -33515 -28768 -26765 -11325 -6030 -3413 -7540 -20829 -24379 -34240 -24695 -21647
16767 -21647 -20088 -20080 -18918 -4577 2756 -13618 -22512 -24632 -23372 -29212 -31005 -31679 -27050 -17752 -5900
16752 -5900 -17615 -28108 -35891 -42406 -24146 -9391 -3262 -13139 8248 15231 14160 18861 20289
16739 20289 9286 24210 51272 61618 33020 9840 4905 -2801 -9224 -9338 -1840 -16124 -22554
16726 -22554 -31556 -25822 -16126 -15681 -13516 422 -19610 -318 17026 18161 19622 9783 16027 17952
16712A7952J1380m610k3796j6335R964K8235l932R191L336p084j4588j3344J3265
16699I634q495k222j6621m169J0284k316p928n078P550R990J0758n350q926R290
16685c599m169l693j9428k0444r326J3899J3240K9831J3596O42M251j724p095
16672E981j4915j4191N173L717p79o297j2396p772m964M523R811k975r69J5320
16658b0733J2092r123m05j6526K0042J6459j5278j5498o288J717j23r658J3154
16645c0168J3459J055K0149l831j2622j2473k0966j8476J1959O537j310R125J7538
16632b0024J5105j4404k3134J6479P100j1077J0800L0221k730k5477O18K939j3984
16619b7568J18j2592J3684K6216J5203k0732j9557o173Q749J399R547P627P540
$$ plain form
16712 17952 29332 24722 926 -15409 -5445 22790 18858 28049 31385 24301 9713 -3631 9634
16699 9634 1139 -1083 -17704 -21873 -11589 -13905 -21833 -26911 -19361 -9371 1387 -3963 -12889 -3599
16685 -3599 -7768 -11461 -30889 -51333 -60659 -46760 -33520 -3689 9907 10549 14800 13076 5981
16672 5981 -8934 -23125 -17952 -14235 -15014 -21311 -33707 -41479 -46443 -41920 -32109 -35084 -36053 -20733
16658 -20733 -8641 -17764 -18169 -34695 -14653 1806 -13472 -28970 -35258 -33541 -33664 -43322 -30168
16645 -30168 -16709 -15654 4495 664 -11958 -24431 -45397 -63873 -51914 -45377 -46687 -37562 -20024
16632 -20024 -4919 -19323 -42457 -25978 -18878 -29955 -19155 11066 8336 -17141 -16523 -13584 -27568
16619 -27568 -27450 -40042 -26358 -142 15061 -5671 -25228 -31401 -22652 -21253 -11706 -4079 3461
16606C461M718K611j6682m724j3198j6549J7852L4427o388j1092M235p104N141
16593c292J4669j5602j3761K0618J6067j8876l7678Q7J572q341K7041J947K738
16580a2811J5523J6633k261J306L937q952J551k9792j7222J0869J8084N858j5327
16567a2604j7949J0791j2963P923J1879J2582N280j1421k531j1120J0034K6120
16555A6021N221K946L025O900j3420m944n124l12r479k3221L6k773O358P397P218
16540d151j614j2154p689K0816o833p944P129J1905j3043j8537n16K2034P401
16527c196j4261K657n301o656J440J5513J0613J5484L387j0427q289j3021j4445
16514b6502J0793R475j1414k1206J5961P429J2643N408J1621j4311k8918j999
$$ plain form
16606 3461 8179 10790 -5892 -10616 -23814 -40363 -22511 11916 5528 -5564 -1329 -8433 -3292
16593 -3292 11377 -4225 -17986 2632 18699 -177 -37855 -37768 -36196 -44537 -17496 -15549 -12811
16580 -12811 2712 19345 17084 18390 22327 13375 14926 -14866 -32088 -21219 -3135 2723 -12604
16567 -12604 -30553 -19762 -32725 -24802 -12923 -341 4939 -6482 -9013 -20133 -10099 16021
16555 16021 21242 24188 27213 34113 20693 15749 10625 10313 834 -22387 -22351 -25124 -18766 -11369 -4151
16540 -4151 -5765 -17919 -25608 -4792 -11625 -19569 -12440 -535 -13578 -32115 -32631 -10597 -3196
16527 -3196 -17457 -14800 -20101 -26757 -25317 -9804 809 16293 19680 9253 964 -12057 -26502
16514 -26502 -15709 -6234 -17648 -38854 -22893 -15464 -2821 2587 14208 -103 -29021 -31020
16502c1020P098o833n806K3829Q293J6235j420j7525M910K771j7648J1303q025
16489a3838m725k83N130K0399n447J0799J1108M910j2575r437k031O45K329o02
16475F382o886m381J4116J927j3858R699L878j492K521L892K398J456M972q205
16461A6419p676o418L666M807J889j8832j924j3231r441L297K7732J6311n822
16448A0777Q294o043P215j6071O300m356j7291j2496k2614J3396P678K0017n170
16435a0364j6236J6427J4690r959q010J8108j0466o652k738J9203M351j8091k4775
16422c4512J187K0730n481J9744J1469n097j5092j042R438K1097m30j2118p762
16409B131n774j4008j1106J4869R457L427j481o397n658P685J8846J1661j8241
$$ plain form
16502 -31020 -23922 -30755 -36561 -12732 -4439 11796 10376 -7149 -2239 532 -17116 -5813 -13838
16489 -13838 -18563 -18846 -13716 6683 1236 12035 23143 28053 15478 6041 4010 4655 6984 6382
16475 6382 -504 -4885 9231 11158 -2700 6999 10877 9385 11906 15798 18196 19652 24624 16419
16461 16419 8743 2325 5991 10798 12687 -6145 -8069 -21300 -30741 -27444 288 16599 10777
16448 10777 19071 13028 20243 4172 10472 6116 -11175 -23671 -46285 -32889 -25211 -5194 -10364
16435 -10364 -26600 -10173 4517 -5442 -13452 4656 -5810 -12462 -15200 4003 8354 -9737 -34512
16422 -34512 -33325 -12595 -18076 1668 13137 8040 -7052 -8094 1344 22441 22011 9893 2131
16409 2131 -3643 -17651 -28757 -13888 -4431 -1004 -2485 -8882 -14540 -6855 11991 23652 5411
16396E411k2031m914L502J2215J1464N549M297J2170J1397j8445n512j787j892
16383A1424M439L8j4002p068r729n771P029J523Q925k4604L83J2226J4405J3113
16369A2331o966o335L266j2168j1671l512O55P52N734P568J5450K785p315J411
16355A985P104K493j2373j1820k587m151J3658j802k554p461o31J7435M249k663
16341H82q520K909j0743Q745K5085j7163K658l950O901K4868N258m983j2862j5755
16327C330j8728k2675j970J4369K2405L085l363N691J1178q679l40j1210o450
16314a3357K413J5954J7n284j6229l901J1897r37k2012n865J4831J8064P618k3160
16300a9951L520R551J4399m799k561n013m65j2558J3129Q560j0746O858J1307
$$ plain form
16396 5411 -16620 -21534 -18032 -5817 5647 11196 15493 27663 39060 20615 15103 13316 11424
16383 11424 15863 15901 1899 -5169 -14898 -20669 -13640 -12117 -3192 -27796 -27413 -15187 -782 12331
16369 12331 5365 -970 2296 -9872 -21543 -25055 -24400 -23648 -17914 -10346 5104 7889 574 1985
16355 1985 9089 11582 -791 -12611 -15198 -19349 -5691 -7493 -10047 -17508 -18139 -704 3545 882
16341 882 -7638 -4729 -15472 -6727 18358 1195 3853 -97 6804 31672 36930 31947 19085 3330
16327 3330 -15398 -38073 -40043 -25674 -3269 -184 -3547 2144 13322 4643 4303 -6907 -13357
16314 -13357 -10944 5010 5027 -257 -16486 -20387 -8490 -9427 -31439 -37304 -22473 -4409 3209 -19951
16300 -19951 -16431 -6880 7519 2720 159 -4854 -5319 -17877 -4748 3812 -6934 -76 11231
16287A1231Q667o536k8765n076q6K82r693k3p361K222L3201R810j6262j0433J5328
16272c494j454J528n974q106J605o059l514j781N135n137p089o310K2545L303
16258a4802j839N275L431k701L176l98j4710k0944p846J6413Q138K4147J7499
16245A4839j1174j6618N904J7870q65j9709O452j1942J4535J793k2367j0371J0436
16232b1217q612m512Q322l411J4576J6396j2694M319m708q199k100J5992K3635
16219A7787J129p353j9097j853K414q068K876r451k0979k368J7338J9528J1908
16206C811p488q23L695p495o609k4725o147J2454K7334R331n418J2008K482Q584
16192B0994l79j810Q233j7258k1714N868J6623m544j8144m793K601j1186l693
$$ plain form
16287 11231 19898 13362 -15403 -20479 -20565 -20283 -29976 -29999 -37360 -35138 -1937 7873 -8389 -18822 -3494
16272 -3494 -4948 -3420 -9394 -17500 -15895 -21954 -25468 -27249 -22114 -27251 -34340 -40650 -18105 -14802
16258 -14802 -16641 -11366 -7935 -10636 -7460 -7858 -22568 -43512 -51358 -34945 -26807 -2660 14839
16245 14839 3665 -12953 -7049 10821 9956 -9753 -3301 -15243 -708 1085 -21282 -31653 -21217
16232 -21217 -29829 -34341 -26019 -29430 -14854 1542 -11152 -6833 -11541 -19740 -21840 -5848 17787
16219 17787 18916 11563 -7534 -9387 -6973 -15041 -12165 -21616 -42595 -44963 -27625 -8097 3811
16206 3811 -3677 -4500 -805 -8300 -14909 -39634 -45781 -33327 -5993 3338 -2080 9928 12410 20994
16192 20994 20615 18805 27038 9780 -11934 -6066 10557 6013 -12131 -16924 -14323 -25509 -29202
16179b9202q14o575K2533Q53k085m546q285q282R938K5903n08R167l925o506j5529
16164a7863n366Q826Q557r361m233L357l369L468J8804L712o299n233k6337k731
16150c4068J6458L871J5485O226j0886n962K965R540o60k9119j2547K965j600
16137c7332n628Q685J4048J5285L69j1822n526n120r347P642J9042J0964j5361
16124a4101j4231j3261j8049K088J5757J2532K714n122o93o524J667K0644J6238
16111c41j0540j8523j6225j4611J8496J3746J2245j4050l995J0683J1492O800
16099d823q841m701o343n688J0693P793J4710P782q274M759j1364l893J0268j4440
16085a2362R128J1237K1536p737q334J3938p892j2373j431j8298j0054N189N323
$$ plain form
16179 -29202 -30016 -36591 -14058 -13205 -15290 -19836 -28121 -36403 -26465 -562 -1070 8097 4172 -2334 -17863
16164 -17863 -23229 -14403 -5846 -15207 -19440 -16083 -19452 -15984 2820 6532 233 -5000 -31337 -34068
16150 -34068 -17610 -13739 1746 7972 -2914 -8876 -5911 3629 2969 -26150 -38697 -35732 -37332
16137 -37332 -42960 -34275 -20227 -4942 -4573 -16395 -21921 -27041 -36388 -28746 -9704 1260 -14101
16124 -14101 -28332 -41593 -59642 -57554 -41797 -29265 -26551 -31673 -32366 -38890 -37223 -16579 -341
16111 -341 -10881 -29404 -45629 -60240 -41744 -27998 -15753 -29803 -33798 -23115 -11623 -4823
16099 -4823 -13664 -18365 -24708 -30396 -19703 -11910 2800 10582 2308 7067 -4297 -8190 2078 -12362
16085 -12362 -3234 8003 29539 21802 13468 27406 19514 7141 5710 -12588 -22642 -17453 -12130
16072a2130j1199o938R590J4282j2108j2663O144J6877j0940j6411K276J5594
16060a7626j003J6648J1649l615J1703J0784N166m136p120p369J4531m186k2118
16047C308j7171Q330r021p691Q902R610o186j5842j0782K1914J4958r769Q814
16034f26r52m69K980l443r475l437J0550l328j1618j201Q099O323J7790q262m825
16019a894J9655j2361j0768j3577j5613J8254J3571n320k6107L667J6956J2771
16007g66P025M316q458j7806j0367K5137K4572J138k26P89n559N356O241m780
15993B6612m502j0931k306o042r536k580P909O588k4500o437j748q408j5032O80
15979e0233K855K2718L058J549n279j1341J2729K9223Q446q742m200k348R770
$$ plain form
16072 -12130 -23329 -30267 -20677 -6395 -18503 -31166 -25022 -8145 -19085 -35496 -33220 -17626
16060 -17626 -18629 -1981 9668 6053 17756 28540 33706 29570 22450 15081 29612 25426 3308
16047 3308 -13863 -5533 -14554 -22245 -13343 -3733 -9919 -25761 -36543 -14629 329 -9440 -626
16034 -626 -1578 -2047 933 -2510 -11985 -15422 -4872 -8200 -19818 -21019 -12920 -6597 11193 2931 -1894
16019 -1894 17761 5400 -5368 -18945 -34558 -16304 -2733 -8053 -34160 -30493 -13537 -766
16007 -766 6259 10575 2117 -15689 -26056 -919 23653 24791 24565 25354 19795 25151 31392 26612
15993 26612 22110 11179 8873 2831 -6705 -9285 -1376 5212 -19288 -25725 -27473 -35881 -50913 -50233
15979 -50233 -47378 -24660 -21602 -20053 -25332 -36673 -23944 5279 13725 4983 783 -1565 8205
15966H205j626J0459J937k7759p761J918j1449K574K0421j197j1285J7742o037
15953c858o203J560p138j3772K168K56q773J3735L9143J523o533J777K195L672
15939A9752K847r561k74m43p241j0508O181J0350N47p740n682M398N073k5809
15925a8110n20Q857p206j1448O347K259k680J5855J6257J6034J0109j3836j1912
15912A0006j6464n462R378p389j976K1273J9045k1015j0893k708N509k744j5753
15899a9193K0571K300r50j3572K775k871Q959R118p527Q767Q621o195l419k71
15885G113M561o201O383n818l005K001J0865m069l518r037j7956k4064L692J7553
15871b1500K5469J4961j7221j0425O762q163j8375L328J0058J216j3806J1398
$$ plain form
15966 8205 6579 17038 18975 -8784 -16545 -14627 -26076 -23502 -3081 -4278 -15563 2179 -3858
15953 -3858 -10061 -8501 -15639 -29411 -27243 -26987 -35760 -22025 17118 18641 12108 13885 16080 19752
15939 19752 22599 13038 12764 12321 5080 -5428 753 11103 11650 3910 -1772 2626 7699 -18110
15925 -18110 -18630 -9773 -16979 -28427 -22080 -19821 -22501 -6646 9611 25645 35754 21918 10006
15912 10006 -6458 -11920 -2542 -9931 -11907 9366 28411 7396 -3497 -6205 -696 -3440 -19193
15899 -19193 1378 3678 2728 -10844 -8069 -10940 -1981 7137 -390 8377 16998 10803 7384 7113
15885 7113 11674 5473 11856 6038 3033 5034 15899 11830 8312 -725 -18681 -42745 -39053 -21500
15871 -21500 3969 18930 1709 -8716 -1954 -10117 -28492 -25164 -15106 -13890 -27696 -16298
15859a6298J5556r601P252K7589J1238j8700l2285n376M517J5976M090l520m501
15846d063J506k732l958J4055j1599r701p035L49K1163J3248Q022m163j5475p918
15832h301J0698K915N28J0925n136p648q054J6766Q968k755k7960j3868L648J6426
15818b848J2948J6696m752j9087j0143n985Q85J9489j7118Q461L635k547J659
15805A293m808k3136j5568k704N796L8784K7288q653n98J688j5042J023p023j5399
15791a7059N398O806M826J4310j0610q795j201J0194O687L670J566Q327n209j3752
15777E158L328l58k3173j71j512p747j4795Q753O438R639J2338P786J664K383
15763I731j7379j3355N201k3709P676K2919o573M306Q80j6800L384J2428J435
$$ plain form
15859 -16298 -742 -10343 -3091 24498 35736 17036 -15249 -20625 -16108 -132 3958 438 -4063
15846 -4063 -2557 -5289 -9247 4808 -6791 -16492 -23527 -23178 -2015 11233 19255 15092 -383 -8301
15832 -8301 2397 5312 5840 16765 11629 3981 -4073 12693 21661 18906 -9054 -22922 -19274 -2848
15818 -2848 10100 26796 22044 2957 -7186 -13171 -12286 7203 -9915 -1454 2181 -366 1293
15805 1293 -3515 -26651 -42219 -44923 -39127 -343 26945 18292 17694 19382 4340 5363 -1660 -17059
15791 -17059 -11661 -4855 -29 14281 3671 -5124 -6325 3869 10556 14226 15792 24119 18910 5158
15777 5158 8486 8128 -15045 -15216 -16728 -24475 -39270 -30517 -24079 -14440 -2102 5684 7348 9731
15763 9731 -7648 -21003 -15802 -39511 -31835 -8916 -15489 -11183 -10303 -27103 -23719 -11291 -9856
15750i856N471P388n011m971j747P48M613j6802r266P348n469j8183J1389N255
15736b9093J1658J3172q208J79j5492k287N631R695R790J9881j9456j3758k918
15723b1206Q367k1464L611J4967p224J417L719k584O434R923J0840M81j2022R120
15709D379j0488L8K952k2496m511r262P962L248j3205R216J1515J4328K3350j4338
15695B688k2554j7050O556J8592R550Q219Q021r439j8650j559k2222j238K1405
15682a7681O390m385k030K839j9068j5427K5286L7515K2116l425j5844L277K605
15669B2168r599l313o74j5992j1735J4582o34j9823Q654K4888p45k8190j718J4819
15655g312j926j285k0397j289j3967m281K6752J3997J124K1921m395J2986j1495
$$ plain form
15750 -9856 -4385 3003 -2008 -6979 -8726 -7978 -3365 -20167 -29433 -22085 -27554 -45737 -34348 -29093
15736 -29093 -17435 -4263 -12471 -12292 -27784 -30071 -24440 -14745 -4955 14926 -4530 -18288 -21206
15723 -21206 -12839 -34303 -30692 -15725 -22949 -21532 -17813 -20397 -13963 -4040 6800 7281 -4741 4379
15709 4379 -6109 -6071 -3119 -25615 -30126 -39388 -31426 -28178 -41383 -32167 -20652 -6324 17026 2688
15695 2688 -19866 -36916 -30360 -11768 -2218 6001 14022 4583 -14067 -15626 -37848 -39086 -17681
15682 -17681 -11291 -15676 -17706 -14867 -33935 -49362 -24076 13439 35555 32130 16286 19563 22168
15669 22168 12569 9256 8582 -7410 -19145 -4563 -5197 -25020 -16366 8522 7777 -20413 -22131 -7312
15655 -7312 -9238 -10523 -30920 -32209 -46176 -50457 -23705 -9708 -8584 13337 8942 21928 10433
15642A0433j6110k5579l161O419R375J3748J6779n823j6256q861K0714l210P445
15629E913j3665P790k412j2280P173m127k5310J9746N485o385L532J843j280k440
15615a6417k45J1825M567p094j8861j0673M375N676K892K7600K3046M376N108
15602C6175J073p946L011N258m12j0374j2202N592J3922J0481n517r737r48p282
15588B1094j2504J4678r162m667L923J2934J2284o602r981j0267j0045J329R541
15575A2555j9564j2841k317o714o684Q756J3232K051J0628J3645L966j4746J0314
15562A2281J4201n301p572J521K954q962j9232j5201j842N904j141N929l692J4800
15548e353K1444J3124j192j4005l208j3811j4978J7788O753n934M276L810J1242
$$ plain form
15642 10433 -5677 -31256 -34417 -27998 -18623 -4875 11904 6081 -10175 -19036 1678 -1532 5913
15629 5913 -7752 38 -2374 -14654 -7481 -11608 -36918 -17172 -11687 -18072 -14540 -12697 -13977 -16417
15615 -16417 -16662 -4837 -270 -7364 -26225 -36898 -32523 -26847 -23955 3645 26691 31067 36175
15602 36175 37248 29302 32313 37571 37159 26785 14583 20175 34097 44578 39061 29324 28376 21094
15588 21094 8590 23268 14106 9439 13362 26296 38580 31978 21997 11730 1685 3014 12555
15575 12555 -7009 -19850 -22167 -28881 -35565 -26809 -13577 -11526 -898 12747 16713 1967 12281
15562 12281 26482 21181 13609 15130 18084 9122 -10110 -25311 -27153 -21249 -22390 -16461 -20153 -5353
15548 -5353 16091 29215 28023 14018 10810 -3001 -17979 -191 6562 628 4904 8714 19956
15535A9956J57j1467k7019m437L718L338J2199P47N66R05J1083n05k8295j4776
15521c3830J0174P494j004j3739j652N828K905o172M134J9663j708Q731j647m261
15507e084L812Q091j0499J003K861j9508M213J2444J331j5733l13J2039N055J1233
15493A0945J1353L508j0807q103P969K3446r296k1114r453N031q615j667Q744
15480A941J5353M013p310m777r662P86J2036K70j6482j4359J3364J9487j4510
15467A50j0563J947J874o63J3489J069j1986m661m439J937o02N921Q329k345J31
15452d12q046j2789J3354r088j588j4479j1195l512P411J1280K523P682J3769
15439e090K1921K589L576k6290k8618J700K6865o637k8310j2814J3163J4163M344
$$ plain form
15535 19956 20113 8646 -18373 -22810 -19092 -15754 -3555 -2808 -2242 -1337 9746 9241 -19054 -33830
15521 -33830 -23656 -16162 -17166 -30905 -32557 -26729 -23824 -29996 -25862 -6199 -7907 824 -823 -5084
15507 -5084 -1272 6819 -3680 -2677 184 -19324 -15111 -2667 -1336 -17069 -17382 -5343 -288 10945
15493 10945 22298 25806 14999 6896 14865 38311 29015 7901 -1552 3479 -5136 -6803 1941
15480 1941 17294 21307 13997 9220 -442 344 12380 12650 -3832 -18191 -4827 14660 150
15467 150 -10413 -8466 -6592 -7255 6234 7303 -4683 -9344 -13783 -11846 -12448 -6527 1802 -543 -412
15452 -412 -8458 -21247 -7893 -16981 -18569 -33048 -44243 -47755 -40344 -29064 -26541 -18859 -5090
15439 -5090 16831 19420 22996 -3294 -31912 -30212 -3347 -9984 -38294 -51108 -37945 -23782 -19438
15426a9438J81L944m600p582K5896J7479J0819m051q821J2844L700n208j4133
15413A1030k345J0946k1132j1180m170N535M683j8391q405J8304K632K867N178
15400d448m954O546m042m86L537k4708j7404K565Q872K1444K751l550o176q196
15386b8249j556P529R949J3733K1295k6229K866O672j3610k746R265j864m321
15373g266r702P027J7608N020j3309J9924J129l261J569l118p839r670j8072N312
15359a4648n942r742K383L207K132j2040q864K2579L2552j1975j9791m291L293
15346b1147J2446J8028j0699o589J3181O309n595K1318j4356m168L525l41j3643
15333a731j6769J780J1581J3940q024J0728Q738k6656N661j6826r341J8273J7840
$$ plain form
15426 -19438 -19257 -15313 -19913 -27495 -1599 15880 26699 22648 13827 26671 30371 25163 11030
15413 11030 8685 19631 -1501 -12681 -16851 -11316 -6633 -25024 -33429 -15125 -12493 -9626 -4448
15400 -4448 -9402 -2856 -6898 -7384 -3847 -28555 -45959 -43394 -34522 -13078 -10327 -13877 -20053 -28249
15386 -28249 -29805 -22276 -12327 1406 22701 -3528 -662 6010 -7600 -10346 -1081 -2945 -7266
15373 -7266 -16968 -9941 7667 12687 -622 19302 20431 17170 18739 15621 7782 -1888 -19960 -14648
15359 -14648 -20590 -30332 -27949 -24742 -22610 -34650 -43514 -20935 11617 -358 -20149 -24440 -21147
15346 -21147 -8701 9327 -1372 -7961 5220 11529 5934 27252 12896 8728 12253 11912 -1731
15333 -1731 -18500 -16720 -5139 8801 777 11505 20243 -6413 -752 -17578 -26919 -8646 9194
15320I194j3636j6480j568J1289J1576O454N737n683R138n759k039j0091O49J4374
15306A3155k905l728j6533k646N336O737M720j172M165j7826M738J5279p716J3670
15292A5274J1008Q75m422j8331k4618p059o380J2148N211K935j61j899r717J916
15278b3220j709j3199L858K9212M14l450K380J755j1455k1827N008Q896K1256
15265b081m971j6535L43m275j295p221p39J6182K0877n284o033K082L275K0629
15251A4954Q103k4922k5339K3856J2631n903o309L904L534P745l795j4028j4526
15238b0095L436J5555J0397j004o318k853R89l084l474P665J142q965o400j069
15224a4078M690M572j1497r157O958J0065L1n164O46J445j5605J2099j335K262
$$ plain form
15320 9194 -4442 -20922 -22490 -11201 375 6829 12566 6883 16021 10262 8223 -1868 -1219 13155
15306 13155 10250 6522 -10011 -12657 -7321 -584 4136 2964 7129 -10697 -5959 9320 1604 15274
15292 15274 26282 27157 22735 4404 -20214 -27273 -33653 -21505 -16294 -13359 -13520 -15419 -25136 -23220
15278 -23220 -24929 -38128 -34270 -5058 -4644 -8094 -5714 -3959 -15414 -37241 -32233 -23337 -2081
15265 -2081 -7052 -23587 -23244 -27519 -28814 -36035 -36774 -20592 285 -4999 -11032 -8950 -5675 14954
15251 14954 23057 -1865 -27204 -3348 9283 3380 -2929 975 4509 12254 8459 -5569 -20095
15238 -20095 -16659 -1104 9293 8289 1971 -882 107 -2977 -6451 1214 2356 -6609 -13009 -14078
15224 -14078 -9388 -4816 -16313 -25470 -18512 -8447 -8416 -13580 -12934 -11489 -27094 -14995 -16330 -14068
15210a4068M302o152O420J1783K69k3503j9257R754J9149P214R768p092P242N044
15196A0873k60k458m261n970K897N356n949P607L955j224j0888j9973r190J4942
15182a4543K0104J0798K787k7728j3632K1247J8565j5141l906k1673q767j591
15170c3480J497J0752p353N820L2159J8918n337k3698l957o140q028k749O320
15157a5276J1507J97Q997L735j5208k100j3667j2550R796K0897j3806N614j9255
15144c1119m94J1753j765R954R301J1147R834J2787k1182k4229j3291O120J0073
15131a1111J4648j1188J1228J5651m143n193o393k3118k0083p895J6469J0470
15119b0658j259O585Q423j3780k0477M492O311K1234R080k059l84J3793j9971
$$ plain form
15210 -14068 -9766 -15918 -9498 2285 2554 -20949 -40206 -30452 -11303 -4089 5679 -1413 5829 10873
15196 10873 10613 8155 3894 -2076 821 6177 228 7835 11790 10566 -322 -20295 -29485 -14543
15182 -14543 5561 16359 19146 -8582 -22214 -967 17598 2457 -1449 -23122 -31889 -33480
15170 -33480 -31983 -21231 -28584 -22764 9395 28313 22976 -722 -4679 -10819 -18847 -21596 -15276
15157 -15276 -3769 -3572 5425 9160 -6048 -8148 -21815 -34365 -24569 -3672 -17478 -11864 -31119
15144 -31119 -31613 -19860 -21625 -11671 -2370 8777 18611 31398 10216 -14013 -27304 -21184 -11111
15131 -11111 3537 -7651 3577 19228 15085 9892 3499 -19619 -39702 -47597 -31128 -20658
15119 -20658 -21917 -15332 -6909 -20689 -41166 -36674 -30363 -9129 -49 -2108 -2492 11301 -8670
15106h670q449J2174j70N803m927J685J4259j6814m987r78M087K090M783k039
15092b153O044R848j1477j3861j99O167O420r590J857K3788p009L535p871j8771
15078a3272k788M836J6438j2837L3044R853j6283j2190j643n291J347j2587M836
15065f537j2905j6449j7255J4345Q135J7564J9939O690j2307l6801K909O316J0980
15052a5376R222R211L553J858j6035j7300Q620j899m355j3411l868K4583J9547
15039D350P44J929j2994N919k2342k298K1908R748N715J0459J0677r365k0564
15026C886j424J3952K2789n748Q507R261j4420j1076j3619r458J2470M871j0652
15013I339q733j7055P170J2683R37j1613l704J2705J1766m012j1664l180n068
$$ plain form
15106 -8670 -17119 -4945 -5115 688 -4239 -2554 11705 -5109 -10096 -11074 -6987 -4897 -114 -2153
15092 -2153 3891 13739 2262 -11599 -11798 -5631 789 -8801 -6944 16844 9835 13370 5499 -13272
15078 -13272 -16060 -11224 5214 -7623 25421 35274 18991 6801 5158 -133 1214 -11373 -6537
15065 -6537 -19442 -35891 -53146 -38801 -30666 -13102 6837 13527 1220 -35581 -32672 -26356 -15376
15052 -15376 -6154 3057 6610 8468 -7567 -24867 -16247 -18146 -22501 -35912 -39780 -15197 4350
15039 4350 5094 7023 -5971 -52 -22394 -24692 -2784 6964 12679 23138 33815 24450 3886
15026 3886 2462 16414 39203 33455 41962 51223 36803 25727 12108 2650 15120 19991 9339
15013 9339 606 -16449 -9279 3404 4341 -7272 -10976 1729 13495 9483 -2181 -5361 -10429
15000a0429k521l892K4053N218J1984j5654l0624J0246Q065J738o615P493J0774
14987I836J1211p667j6279p682p124j147J5033J0347N392j4354l792J2069O810
14974A2653o829j295q287R574m76j807o112k2848N07J2653Q369j573n87K076R063
14959E081j1152K018o83J4431K951o288M116M836j7429j268J479K4382O807k4379
14945D902l0418n775K0030K6579J2224j6250j1347O980k069K0943R546J6559O300
14932E8204k3163l990p640j7212k0363j6923r00O115K5745K7416R562k0330j6190
14919C31p581O028j3350R025j5921J2054K6372l919m786j2831j4780j9964j3651
14906e2973P751K4058J0356k152q111n609q728o076R066P892J6030J73l136p667
$$ plain form
15000 -10429 -12950 -16842 7211 12429 24413 8759 -21865 -11619 -3554 -1816 -8431 -938 9836
14987 9836 21047 13380 -2899 -10581 -17705 -18852 -3819 6528 11920 -2434 -6226 5843 12653
14974 12653 5824 4529 -3758 5816 5340 3533 -2579 -25427 -24920 -12267 -3898 -5471 -6058 -3982 5081
14959 5081 -6071 -4053 -4736 9695 12646 6358 10474 15310 -2119 -3387 -1908 22474 29281 4902
14945 4902 -25516 -31291 -11261 15318 27542 11292 -55 6925 4856 25799 35345 51904 58204
14932 58204 35041 31051 23411 6199 -14164 -31087 -31987 -25872 -127 27289 36851 16521 331
14919 331 -7250 -1222 -14572 -5547 -21468 -9414 16958 13039 8253 -4578 -19358 -39322 -52973
14906 -52973 -45222 -21164 -10808 -12960 -21071 -26680 -35408 -41484 -32418 -24526 -8496 -8323 -11459 -19126
14892a9126k380L421l397L0264O562k5457K989j476j0962K879L075K1417O573
14879A4382Q064r744K0518j1162j6700p556M583P220p458M582K566q834j9056
14866a8595J62J1849Q407J7956k899r184j3549P690L971j8581k868k388J4757
14853c272n439j1532j7125j5887J8067L8730J2882k7096k8257O503J7117K474
14841a2835j6828J4201L4530J2623k400r593j5285n006J168O953k966k0129l972
14828a9539K3015P153J2443m749j8587j4577N315L824J307R838n538O727J7004
14815B3636p868k4418k7583O792m017n89J3563J4634J4944J2503J0338j3499k3952
14802e516j2100j838p497O472J9062M67M406J0123j81j5598L755J0819Q781j748
$$ plain form
14892 -19126 -21506 -18085 -21482 8782 15344 -10113 -7124 -8600 -19562 -16683 -13608 7809 14382
14879 14382 22446 12702 33220 22058 5358 -2198 2385 9605 2147 6729 9295 461 -18595
14866 -18595 -18433 -6584 1823 19779 16880 7696 -5853 1837 5808 -12773 -15641 -18029 -3272
14853 -3272 -8711 -20243 -37368 -53255 -35188 3542 16424 -10672 -38929 -32426 -15309 -12835
14841 -12835 -29663 -15462 19068 31691 29291 19698 4413 -593 575 7528 4562 -15567 -19539
14828 -19539 3476 10629 23072 18323 -264 -14841 -9526 -5702 -4395 5443 -95 6632 23636
14815 23636 15768 -8650 -36233 -29441 -33458 -34047 -20484 -5850 9094 21597 31935 18436 -5516
14802 -5516 -17616 -19454 -26951 -20479 -1417 -950 3456 13579 13398 -2200 1555 12374 21155 19407
14788A9407k88n706P080p862l263m216j710q147j4091l377j0408j4935J7381J5799
14774a4336R139j3494k363J4429o5J0159j4897k9511J160L4905K4034M932j7120
14761F972r642j0077j7387J659q708M967J7510r95j763p267N289J4803P371J868
14747D600J3450J2562j5792p530L978R512q252q402L891J192j273N567j0659j4057
14733a1213j565J60M592R568Q666n678p412R35R60m901J8497q041J3016J066K649
14718B1299K988M632m22k2964j5374M67l692J846Q325j4261N765j428J1458M427
14704C066j9874j1575m89N037J4820J0565q400o378K228J4169P694m81J03N890
14690A6375J1986P408J1210j1722j6181l832j152N153J0812K0880r279k0272j4632
$$ plain form
14788 19407 19119 13413 20493 12631 9368 5152 3442 -4705 -18796 -22173 -32581 -47516 -30135 -14336
14774 -14336 -5197 -18691 -21054 -6625 -6690 3469 -11428 -40939 -39779 -4874 19160 24092 6972
14761 6972 -2670 -12747 -30134 -28475 -37183 -32216 -14706 -15701 -17464 -24731 -19442 -4639 2732 4600
14747 4600 18050 30612 14820 7290 11268 20780 12528 4126 8017 9209 7936 13503 2844 -11213
14733 -11213 -12778 -12618 -8026 1542 10208 4530 -2882 -1947 -987 -5888 12609 4568 17584 18650 21299
14718 21299 24287 28919 28497 5533 -9841 -9374 -13066 -11220 -2895 -17156 -11391 -12819 -1361 3066
14704 3066 -16808 -28383 -28872 -23835 -9015 1550 -6850 -13228 -11000 3169 10863 10382 10485 16375
14690 16375 28361 35769 46979 35257 19076 15244 14092 19245 30057 50937 41658 21386 6754
14677F754n993n333o762K12l327N105L723j641J3390j08Q726J5743m221j4204
14663A2064L516K370J1164O1k2053j1517J953r247m986j4559M865J3342J8756
14650E729J1114n905j3598J1348J5548r399j3998j5170j1543p004K0363J7196
14638D681j0204k356J1178J085j9071K785m106M186O613M630J8578n067q212J249
14624E969j798N401N9J4418R402j0130j6942j675J2968J8919P188j5922k4171
14611C686l859K136j5956m104Q379Q126L569J2364J1070j691j7473r465r602R523
14597c297P871L131j2500j0564j7751J2989j1984M244K0967J6104j7781J5107
14585F536K994j5133q552J9942q862j7014l284l14J1414Q342N523M413n475n172
$$ plain form
14677 6754 761 -4572 -11334 -11122 -14449 -9344 -5621 -7262 6128 6020 14746 30489 26268 12064
14663 12064 15580 17950 29114 29175 7122 -4395 -2442 -11689 -16675 -31234 -26369 -13027 5729
14650 5729 16843 10938 -2660 8688 24236 14837 839 -14331 -25874 -32878 -12515 4681
14638 4681 -5523 -7879 3299 4384 -14687 -11902 -16008 -11822 -5209 -579 17999 12932 4720 5969
14624 5969 4171 9572 9631 24049 33451 23321 6379 4704 17672 36591 43779 27857 3686
14611 3686 -173 1963 -13993 -18097 -9718 -1592 1977 14341 25411 23720 6247 -3218 -12820 -3297
14597 -3297 4574 7705 -4795 -15359 -33110 -20121 -32105 -27861 -6894 9210 -8571 6536
14585 6536 9530 -5603 -14155 5787 -3075 -20089 -23373 -23687 -12273 -3931 1592 6005 530 -4642
14571d642M040P993j978j0030p814n419O777K3q349m5K5014J1508k1111J4486
14557A0453Q202j6787q348N486R603Q060M200L960q261m229J0792P699n46M478
14543C4762K651M445k1595j4654l196K797K439j1017r764p24O401J4762L0712
14530C8019p999j5692q780m094M670j352O250N761q74K4173O925J184q573k774
14516C6844q226K687k3042q727J0666J0310j2939O549N991j2787J1423R579r500
14503A8828N495L160j1433q183j0926Q739K9973J1772r915p440j6084J90J307
14490A5483J9246Q533n157j2237j2359k0209m551M284J4427n831P37J7706j6443
14477C629l276K779J3194O304j6844j0724R520K605j5276L76P488R853R586M114
$$ plain form
14571 -4642 -602 7391 5413 -4617 -12431 -17850 -11073 -11050 -19399 -19444 5570 17078 -4033 10453
14557 10453 18655 1868 -6480 -994 8609 16669 20869 24829 16568 12339 23131 30830 30284 34762
14543 34762 37413 41858 20263 5609 2413 5210 7649 -3368 -13132 -13856 -7455 7307 38019
14530 38019 30020 14328 5548 1454 6124 4772 11022 16783 15909 40082 47007 48191 39618 36844
14516 36844 28618 31305 8263 -464 10202 20512 7573 14122 20113 7326 18749 28328 18828
14503 18828 24323 27483 16050 7867 -3059 5680 35653 47425 37510 30070 13986 14176 15483
14490 15483 34729 43262 38105 25868 13509 -6700 -11251 -6967 7460 1629 2366 20072 3629
14477 3629 353 3132 16326 22630 5786 -4938 4582 7187 -8089 -7713 -225 9628 19214 23328
14463B3328m454j3352k924J0011k018K770k384K549J166j2366j1784k744m691
14450a6893m6j067J8824j9226j6931J7241J5193p182J0211J3592k604J598J3316
14437B6026J9344p320j1962j7001k2985L199O859M644K7201J6345p809o897p98
14424B8846j7448j5487J2274J1532j3318j4076o692n355l799J0198J1190J2993
14412A0858m940j3594J017j3821K020J6278k118j8634R366J6699J1085j2189m766
14399b739J1543r260j7108j460J8782Q921k4482r416O963m712O844l645j4942
14386c4711r049K0862K7457n373L111l752J988m35O117J360j553N735J8278J2078
14372D2113p518L56o352j4082j3647J996o155K854K767o597j9239o663L0280K4053
$$ plain form
14463 23328 18874 5522 2598 12609 10591 13361 10977 13526 14692 2326 -9458 -12202 -16893
14450 -16893 -16939 -18006 818 -18408 -35339 -18098 -2905 -10087 124 13716 11112 12710 26026
14437 26026 45370 38050 26088 9087 -13898 -10699 -3840 804 28005 44350 36541 29644 28846
14424 28846 11398 -4089 8185 19717 6399 -7677 -14369 -19724 -23523 -13325 -2135 10858
14412 10858 5918 -7676 -6659 -20480 -18460 -2182 -4300 -22934 -13568 3131 14216 2027 -2739
14399 -2739 8804 -456 -17564 -19024 -242 8679 -15803 -25219 -18256 -22968 -16124 -19769 -34711
14386 -34711 -43760 -22898 4559 -814 2297 -1455 533 98 6215 7575 6022 11757 30035 42113
14372 42113 34595 34951 28599 14517 870 2866 -3289 -435 2332 -4265 -23504 -30167 113 24166
14358B4166l480k950j853j0377N40L945N222q304m850J674K992P215M314P536
14344B5790J7031o52j0291K374k2690k372L376J5590j087K884J4356n618k4706
14331A3985M807J138q284L885N938j6458p756p690j2042K705J3314J7517p33n33
14317I793K1520o462l832k5036l615J9439K4779q28j6349k3497O698K1176R861
14304C3647M353j1755N151o825n139P034j1178j8960J0811J5708J0980L336p896
14291B9267N822n303k0260j1525M239j3055L487J3992Q024j660q054K617O225
14278A3816k539l645j8954m67J6618k821k5O193J0879j3797n442l059M056j2132
14264a1319M675O356j0635k450J5200J4289P498L756J4722N033o272m787j0877
$$ plain form
14358 24166 20686 17736 15883 5506 6046 9991 15213 6909 2059 3733 6725 13940 18254 25790
14344 25790 42821 42169 31878 34252 11562 9190 12566 28156 27069 29953 44309 38691 13985
14331 13985 18792 19930 11646 15531 21469 5011 -2745 -10435 -22477 -19772 -6458 11059 10326 9793
14317 9793 31313 24851 21019 -4017 -7632 11807 36586 35758 19409 -4088 2610 23786 33647
14304 33647 38000 26245 31396 24571 19432 26466 15288 -3672 7139 22847 33827 37163 29267
14291 29267 35089 29786 9526 -1999 2240 -10815 -7328 6664 14688 13028 4974 7591 13816
14278 13816 11277 7632 -11322 -11789 4829 2008 1983 8176 19055 5258 -184 -3243 813 -11319
14264 -11319 -6644 -288 -10923 -13373 1827 16116 23614 27370 42092 47125 40853 36066 25189
14251B5189k594r061j578j2025j6146J5100Q368N806r298J3399J65p974l2811
14238b3460L767K0306n4J531p36L449J1645N607R672p983J0232K652j4957j6895
14224D776l833m968k0591j8658J7763K4438J3757p826M558K436J501m524m067
14211D762R996J0612O645q122j0872j4670J3446M664m417m53r86j1096m776j8830
14197b4097L835J2241L22n480O766m700k0000p801M210K0737j2544j6899J0030
14184c3380K1831J1912j8456j2818P997l78P910j3253J5678J9962P90q265K079
14171A609o274Q815J7543J750q100o876J3996j0548q12O979j3420j7416J245J9319
14157G810Q990J4693j638j4657j1118j506J1269P928j5607j370L460J3155N448
$$ plain form
14251 25189 22595 13534 11956 -69 -16215 -1115 7253 13059 3761 17160 17325 9351 -23460
14238 -23460 -19693 613 559 2090 1354 4803 16448 22055 31727 23744 33976 36628 21671 4776
14224 4776 943 -4025 -24616 -43274 -25511 -1073 12684 4858 9416 11852 13353 8829 4762
14211 4762 14758 25370 32015 23893 13021 -1649 11797 16461 12044 11591 10605 -491 -5267 -24097
14197 -24097 -20262 -8021 -7699 -13179 -6413 -11113 -31113 -38914 -34704 -13967 -26511 -43410 -33380
14184 -33380 -11549 363 -18093 -30911 -22914 -23292 -15382 -28635 -12957 7005 7795 -470 1609
14171 1609 -4665 4150 21693 23443 15343 8467 22463 11915 11103 18082 4662 -12754 -11509 7810
14157 7810 16800 31493 29855 15198 4080 2574 13843 21771 6164 4794 8254 21409 26857
14144B6857K593j7201M048N321j4243L583k911m503k8790l999K6314l263r083
14131a5277P672J9778P219n208K0037L783n476j220J8435J0951j3696k0497p953
14118A8548J2288k831K565K1149j1537k7887N864O967j254Q547o42p0J0448k704
14104C9451o134n59j1314l181J1053J1656j3909J97p147j0778J1476N967k818
14091B3960J3979o565l0670j5931O255q001J2610L1230O492j5695q710j0294j643
14078b983p36J0843k2009p553R329L0613M630j0913j3679k973R766q179j2528
14065a6372j0120R063J8835J7019m988l769N514o408J2279J275l718j7009k3245
14052b1644l374J0001j4323j507J333J008R721K3185P988J719L016J3753j0864
$$ plain form
14144 26857 29450 12249 16297 21618 7375 10958 8047 3544 -25246 -29245 -2931 -6194 -15277
14131 -15277 -7605 12173 19392 14184 34221 38004 32528 31308 49743 60694 46998 26501 18548
14118 18548 30836 28005 30570 51719 40182 12295 18159 25126 23872 32419 31777 31707 42155 39451
14104 39451 33317 32758 21444 18263 29316 40972 27063 27260 20113 9335 20811 26778 23960
14091 23960 37939 31374 704 -15227 -8972 -16973 -4363 26867 33359 17664 8954 -1340 -2983
14078 -2983 -3719 7124 -14885 -22438 -13109 17504 22134 11221 -2458 -5431 4335 -3844 -16372
14065 -16372 -26492 -17429 1406 18425 13437 9668 15182 8774 21053 22328 18610 1601 -21644
14052 -21644 -25018 -15017 -29340 -30847 -29514 -28506 -18785 4400 12388 14107 17123 30876 20012
14039B0012m596j7362k627L445J2642N230k971P101j064J1842J7189J6340p690
14026E7491k6258m474N146o97k331M656J9240R712r521J5899l172j8261r483k430
14012C5517L71j2097L477K879J716j1550O734J2355K055j4953K124L975j9131
13999A3472j7635J223j027J3446J1865p4L846j132r381P168J5237N108k1498j6654
13985C964J2187N818j4600j4779r898J5505R883j6984J0655J4071j204j9339J495
13972c226J0667p951n016J6199n00j4237o811J0102J2071r546k824R21m650r123
13958a3924m172o883N669o233j6932J0085J3930J6646J3369l927l309R922J6409
13945C0650l511k5184n784J1153K8225K2850r701j9725r321q659m044N867L189
$$ plain form
14039 20012 15416 -1946 -4573 -1128 11514 16744 13773 20874 19810 31652 48841 65181 57491
14026 57491 31233 26759 31905 31208 28877 33533 52773 62485 52964 68863 65691 47430 37947 35517
14012 35517 35888 23791 27268 30147 31863 20313 27047 39402 41457 26504 28628 32603 13472
13999 13472 -4163 -2940 -3967 9479 21344 21270 25116 23984 14603 21771 37008 42116 20618 3964
13985 3964 16151 21969 7369 -7410 -17308 -1803 8080 -8904 1751 15822 14618 -4721 -3226
13972 -3226 7441 -510 -5526 10673 10173 -4064 -10875 -773 11298 1752 -1072 -151 -4801 -13924
13958 -13924 -18096 -24979 -19310 -25543 -42475 -32390 -18460 -1814 11555 7628 4319 14241 30650
13945 30650 27139 1955 -3829 7324 35549 58399 48698 28973 19652 10993 6949 12816 16005
13932A6005N550o657j5856o72Q182k50J0149o94r192P577R929j5409k969J3374
13918A9067J3058r199j2655q376q430m567K3238J7266p992j5094j0320k868q613
13905a5485J2242P561o280L884o061p043n61L823K756J4783K0907J0072R464j2704
13891C7358N428K1248o137k7297k5763j4389P890m477J3544j817J0178n601l510
13878F655J1039j3012j1669O557m262j768J7107K3402j2828l1028j947K0538q50
13865G934N243N906o381o46L2527j9349k0747l535j3041J1933J8858N560J1049
13852C5311J1909M494q512r473k0976M506l689o62R93n401k362Q936k248k419
13838A0407J923j0298j2823r781L869m27L836Q769N368J1081P199J8013J0281
$$ plain form
13932 16005 21555 14898 -958 -1630 6552 6302 16451 15757 6565 14142 24071 8662 5693 19067
13918 19067 32125 22926 10271 1895 -6535 -11102 12136 29402 21410 6316 -4004 -6872 -15485
13905 -15485 -3243 4318 -1962 1922 -4139 -11182 -11743 -7920 -5164 9619 30526 40598 50062 37358
13891 37358 42786 64034 57897 30600 4837 -9552 -1662 -6139 7405 5588 15766 10165 6655
13878 6655 17694 4682 -6987 -430 -4692 -6460 10647 34049 21221 -9807 -11754 8784 7934
13865 7934 13177 19083 12702 12056 44583 25234 4487 952 -12089 -156 18702 24262 35311
13852 35311 47220 51714 43202 33729 12753 17259 13570 12908 13901 8500 6138 15074 12826 10407
13838 10407 12330 2032 -10791 -20572 -16703 -17130 -13294 -4525 843 11924 19123 37136 47417
13825D7417M593J6243N916J950j2048k6746n316O98K618M976j2549j4404J5456
13812B8804j558P413K85j6900j3011n83R083R389l7j3141r455M017j013N116L437
13797A1846M362o620n454p303R203J793O54j6792o513K9112J8316J133n373l279
13783B5085J15m349j1756J1265k727k110l658j928Q899N824j6218r384J821j1040
13769a0161J0902J2041P196j5886q523J2907Q369K6817N477j0286M088J060J4227
13756E8228N62k3126j8332M536p553j3868J3854O073o60K4988J244j0677J379
13743C6648Q215k402p955k2308J5968J6845N537K899K562j6500L243K5280o330
13730F1702L483j1134j0625n68o108p405J8478K6669k213j4134M959L900n582
$$ plain form
13825 47417 52010 68253 74169 76119 64071 37325 32009 32707 35325 40301 27752 13348 28804
13812 28804 27246 34659 34944 18044 5033 4450 13533 22922 22885 9744 289 4306 3293 8409 11846
13797 11846 16208 9588 4134 -3169 6034 7827 8481 -8311 -14824 14288 32604 33737 28364 25085
13783 25085 25200 20851 9095 20360 17633 15523 11865 9937 18836 24660 8442 -942 879 -10161
13769 -10161 741 12782 19978 4092 -4431 8476 16845 43662 49139 38853 42941 44001 58228
13756 58228 58790 35664 17332 21868 14315 447 14301 20374 19714 44702 45946 35269 36648
13743 36648 44863 42461 34506 12198 28166 45011 50548 53447 56009 39509 42752 68032 61702
13730 61702 65185 54051 43426 42858 36750 29345 47823 74492 72279 58145 63104 67004 61422
13717F1422k9032j8732J7219R5J583K518j3078k0695j8767J8742J9587q639j3259
13704a036r353r270r61K737J0075q841p204M348j279K7805K559j7521J3674K6213
13690C1946R278m107j4983R113P979p16N448J6K693L0586M2652M1617P0977M2494
13676B74993N6082R6330J00111Q9222N1643N8289O7640P7605R9722J56161K51364
13665A379162L61890L71420L25156K50616J03671P0955m865m35574p51294n43660
13655A127477k77467j39209j19116q6496o4542j6281j6140j4110j8992m5794l7560
13644B91770L804j8148l1937j2448j4414p679k8849j058k499m563j418Q41j1270
13631A62132o838J7512m036q677p439J269j7132k0544k8231l71O20p241P268p440
$$ plain form
13717 61422 32390 13658 30877 30972 32555 35073 21995 1300 -17467 1275 20862 12223 -1036
13704 -1036 -10389 -19659 -20620 -17883 -7808 -16649 -23853 -19505 -20784 7021 9580 -7941 5733 31946
13690 31946 41224 37117 22134 31247 39226 38510 43958 43974 46667 77253 119905 161522 232499 274993
13676 274993 331075 427405 527516 616738 668381 726670 794310 871915 971637 1127798 1379162
13665 1379162 1741052 2112472 2437628 2688244 2791915 2862870 2858005 2422431 1671137 1127477
13655 1127477 850010 710801 591685 505189 440647 424366 408226 394116 375124 329330 291770
13644 291770 295574 277426 245489 233041 218627 210948 182099 181041 178542 173979 172561 173402 162132
13631 162132 155294 172806 168770 160093 152654 153923 136791 116247 88016 87645 88265 81024 88292 80852
13617H0852j3264K857R283Rl612l099J3936J6679j5834k1377j3916L48J9715J7076
13603H9653l5522K76K0776J3269j1693L716L633n706o307j047p848J2808J8381
13590I4389q143o455M353K353j0413j1327l936q249o089l66K5448q122K414J2760
13576G8617J3448J53n656l123L824l593j949m129M438K3743n908n298p288j6491
13562G0788P750L1067J5480j3524J077L661M138K5248M551j3718j8837l850n815
13549A08016J5671k772o347r327M2l701k908L66N864j0569Q818M794j9765j5553
13535G2629K1983o112K284L062J5001J4623j7013j3914K0054J7344l2378q2938
13523A4625j02048n7092r034l486J3421N6897M7842K7466J0917n76O753K1762
$$ plain form
13617 80852 67588 70445 79728 79737 76125 73026 86962 103641 87807 66430 52514 52862 72577 89653
13603 89653 54131 54407 75183 88452 76759 80475 84108 78402 72095 71048 63200 76008 94389
13590 94389 86246 79791 84144 86497 76084 64757 60821 52572 46483 46117 71565 63443 65857 78617
13576 78617 92065 92218 86562 83439 87263 83670 81721 77592 82030 105773 99865 94567 87279 70788
13562 70788 78538 109605 125085 111561 112638 116299 120437 145685 150236 136518 117681 113831 108016
13549 108016 123687 120915 114568 105241 105283 101582 98674 99040 104904 94335 103153 107947 88182 72629
13535 72629 94612 88500 90784 93846 108847 123470 106457 92543 112597 129941 97563 14625
13523 14625 -87423 -144515 -153549 -157035 -143614 -86717 -38875 -11409 -492 -1068 5685 27447
13511B7447J1032K4461k513m251O824J7845Q051j2757J942J2349J2966P57K6409
13498A30562K7176k4291j6422j3998J6904L5398K5072R379O681L291j1950J5162
13486B02964J1k525J8719J0294K5371Q706L686O272L7953K7021j0605l0534q461
13473B88872J0590L013k0779j0988k305P559k4704j7597j9739j4077m840q147
13461A86858k0990k427m380j8161m573K3902J8599q57m221j2635k047k3524j9961
13448A15583L178J6214L097k3830O393r893n900L1647L1121L48q91O131k7396
13435A45802j9339J664k984m633k2343j5145J5256K5852o065m222j9660O828K3643
13422A24654J8867K692k179N176k0805L817J0064k574n819N769K1604L0836J2901
$$ plain form
13511 27447 38479 62940 60427 56176 63000 80845 88896 76139 78081 90430 103396 104153 130562
13498 130562 157738 133447 117025 103027 119931 155329 180401 189780 196461 199752 187802 202964
13486 202964 202975 200450 219169 229463 254834 263540 267226 273498 311451 338472 327867 297333 288872
13473 288872 299462 302475 281696 270708 268403 275962 251258 233661 213922 199845 195005 186858
13461 186858 165868 163441 159061 140900 136327 160229 178828 177971 173750 161115 159068 135544 115583
13448 115583 118761 134975 138072 114242 120635 110742 104842 136489 167610 167958 167067 173198 145802
13435 145802 126463 128127 125143 120510 98167 83022 98278 124130 118065 113843 94183 101011 124654
13422 124654 143521 146213 144034 149210 128405 132222 142286 139712 133893 139662 161266 192102 205003
13409B05003J793J282J3750J1437l759L0208J6661J6340R647j1885m1833n3382
13397A95262l6830l942R327J769J0681K4360J2848J457M151l026K7915K2615J487
13384B68074m005j135J493K1961J9114K0583J9083L618k523J3033J1661j3265
13372C57692j9582K3647L4022M612k4147K9627O1359N3295M3420J6024J469l7107
13360E44331q8764o8903l6144M4585P5987J16894J87636P6595l3191m455k8379
13349G86192j31302j27839q1057j30620j33464p3006j9805k7703M511R0910J31707
13338B88524J05991J04046M0861j3395j2101j0125Q551K6747M4543J8211J1622
13327F13475J9113K3479L0771L7492L519o986o409K8726P448p285j5139M0147
$$ plain form
13409 205003 206796 208078 221828 233265 229506 259714 276375 292715 302362 290477 248644 195262
13397 195262 158432 154490 163817 165586 176267 200627 213475 214932 219083 216057 243972 266587 268074
13384 268074 264069 262934 264427 286388 305502 326085 345168 348786 346263 359296 370957 357692
13372 357692 338110 361757 395779 400391 376244 405871 467230 520525 563945 579969 581438 544331
13360 544331 455567 386664 350520 395105 471092 587986 775622 852217 819026 814571 786192
13349 786192 654890 527051 445994 315374 181910 108904 89099 61396 65907 156817 288524
13338 288524 394515 498561 539422 526027 513926 503801 512352 539099 583642 601853 613475
13327 613475 632588 656067 686838 724330 727849 720863 714454 743180 750628 743343 728204 768351
13315G68351O2676M2655K6265m804K9513K9923L3468K5776J1558M292M358K6325
13303A060356M1373M7503L7495K0907J5480J4227o658K588L3223K6998Q633r381
13291A292744J4476K7886J0236r574R483L6597N7265P3024M9375L7844N4424Q3880
13279A737660P2961L0674J1739N580L4439M2205M0657Q4710Q4103Q1600J08579
13268B334907J01209P1843O9126L7928M9864Q8527R9223J37308J79238J95722
13258C364895J85181J71735K03154K76525L35636L12388L17482L52967M74523
13249E994486N83152O30644P04370P82274R96686J293840J619222J995694K463038
13240A7063406K973501L479727L988638M657964N206795N701841O300144P250942
$$ plain form
13315 768351 831027 873682 899947 895143 924656 954579 988047 1013823 1025381 1029673 1034031 1060356
13303 1060356 1101729 1149232 1186727 1207634 1223114 1237341 1230683 1233271 1266494 1293492 1302125 1292744
13291 1292744 1307220 1335106 1345342 1335768 1345251 1381848 1439113 1512137 1561512 1599356 1653780 1737660
13279 1737660 1810621 1841295 1853034 1858614 1893053 1935258 1975915 2060625 2144728 2226328 2334907
13268 2334907 2436116 2507959 2577085 2615013 2664877 2753404 2852627 2989935 3169173 3364895
13258 3364895 3550076 3721811 3924965 4201490 4537126 4849514 5166996 5519963 5994486
13249 5994486 6577638 7208282 7912652 8694926 9691612 10985452 12604674 14600368 17063406
13240 17063406 20036907 23516634 27505272 32163236 37370031 43071872 49372016 56622958
13232E6622958Q345499Q668861P999153P106428O315768N994284O712352R084492
13224A16849795J5134133K5675836L9921417N4811508O5594416O9723824N9139598
13217D46850527L6026356J6494878J6568899j1005647j04510664j39163886q8114869
13210A73145594m6559371k6311081j6853954j1478658q002025n786635m048117
13203E4105753k665322j638144j271242j674750k469327l101764l206886k972531
13195C5105787k643928k328540k133562k029438j921277j734087j563135j518909
13187A9232911j387708j274989j166900j063697r76559r00549q24014p42251o42291
13178A0253953n64349n22662n21407m91704m56336l84162l79218l88784l56324
$$ plain form
13232 56622958 64968457 73637318 81636471 88742899 95058667 101052951 107765303 116849795
13224 116849795 131983928 157659764 197581181 252392689 317987105 387710929 446850527
13217 446850527 482876883 499371761 515940660 504935013 400424349 261260463 173145594
13210 173145594 126586223 100275142 83421188 71942530 63940505 58153870 54105753
13203 54105753 51440431 49802287 48531045 46856295 44386968 41285204 38078318 35105787
13195 35105787 32461859 30133319 27999757 25970319 24049042 22314955 20751820 19232911
13187 19232911 17845203 16570214 15403314 14339617 13363058 12462509 11638495 10896244 10253953
13178 10253953 9689604 9166942 8645535 8153831 7697495 7313333 6934115 6545331 6189007
13169F189007l39396l26013k95050l09664k99314k51254k33379j88236j69985
13160C776716j56435j48966j46121j56624j90334k08160j90816j55913j09022
13151B314325n8112n1543o1958o2229n5157j04073j27129j14732r7565q7910r8750
13140A395167p7782n9721p1431n7354n2223o7522m2468k5591l3240l3225j5270
13129H59340k9818l0437k9221l5090l4127l6017k9846p718r669M315O943L3886
13117F62541M5123N243j4825j6198k507L953n545K3373L5924K1717R448K4021
13105G92268M2952L6808O488l3287n0171n5401o1793p3880j07477o9626O5700
13094D92581J13325P4435N4019R3893R2889M3812m4111p4765j03517j49476r0937
$$ plain form
13169 6189007 5849611 5523598 5228548 4918884 4619570 4368316 4134937 3946701 3776716
13160 3776716 3620281 3471315 3325194 3168570 2978236 2770076 2579260 2423347 2314325
13151 2314325 2256213 2204670 2142712 2080483 2025326 1921253 1794124 1679392 1581827 1493917 1395167
13140 1395167 1317385 1257664 1186233 1128879 1076656 1009134 966666 941075 907835 874610 859340
13129 859340 829522 799085 769864 734774 700647 664630 634784 627066 617397 621712 628655 662541
13117 662541 707664 712907 698082 681884 679377 683330 677785 701158 737082 758799 768247 792268
13105 792268 835220 872028 878516 845229 795058 739657 677864 603984 496507 426881 492581
13094 492581 605906 680341 734360 828253 921142 964954 920843 846078 742561 593085 502148
13083E02148l5904q3926o9392k2966M607m6198r900N0443M0118J7860J2176J7930
13071C76996J6088O500R570J8524M3858M5117J0539q405k6500m5853l7661j0786
13059C97987r969o985j7424N390K6311K568K2928j587K410J0017J810J9003J7202
13046D69661k245N99j164p327L000l931J2864L4733J2610k08P997L1995L9698
13033E98282L4979K8522J6038k2281K0989j24r9934j19550n5433n329j5483j2272
13021C68404r465j2099q811j527q636J7643j546m4391l3625j1273J0094m783j3547
13008B46438j6394j2455N273O41K5561J1719L222j0547k3012j0020l3969j8614
12996A67843l095r817N573J3888L085r488K8296L1634l396j77j2448j1910n344
$$ plain form
13083 502148 466244 382318 312926 289960 294567 248369 238469 288912 329030 346890 359066 376996
13071 376996 393084 399584 409154 427678 471536 516653 527192 518787 492287 446434 408773 397987
13059 397987 388018 381033 363609 368999 395310 397878 420806 419219 421629 431646 433456 452459 469661
13046 469661 467416 468015 466851 459524 462524 458593 471457 506190 518800 518592 526589 558584 598282
13033 598282 633261 661783 677821 655540 676529 676405 576471 456921 401488 396159 380676 368404
13021 368404 358939 346840 338029 336502 327866 345509 343963 299572 265947 254674 264768 259985 246438
13008 246438 230044 217589 222862 223503 249064 260783 264005 253458 230446 220426 186457 167843
12996 167843 164748 154931 160504 174392 177477 167989 196285 227919 224523 224346 211898 199988 194644
12983A94644k8128k9310n622j6682j3093j2045M656L410Q189M822L2568L6k99
12970A43146K6837J3562m732k0851k1780j2672J3689R93j4551J3870j0566j7885
12958A09060j0742J4377L501K9300L1871K2653J3611J3142K2018L131J021j3603
12946B39340n0707k0778k1609j1051j5392o286J358p448j8537l732k53J977k07
12933H6675K0251J2033P834j5378p706K1231J1677J2641K7887j4177m562L8789
12921A97195P665R485J3931J4135J0710K1221J1061j3770j5435J9323Q950k458
12909B82013j2073n4533n9867n1567m3200k8543Q292L727J8409J5155J245n537
12897G3521O284L501q534k7163j1345L0488K3928q247j8227o898j6700n463J7948
$$ plain form
12983 194644 166516 137206 131584 114902 101809 89764 94420 97830 106019 110841 143409 143445 143146
12970 143146 169983 183545 178813 157962 136182 123510 137199 138192 123641 137511 126945 109060
12958 109060 98318 112695 116196 145496 177367 200020 213631 226773 248791 251922 252943 239340
12946 239340 188633 167855 146246 135195 119803 113517 114875 107427 88890 85158 84905 86882 86675
12933 86675 106926 118959 126793 111415 103709 124940 136617 149258 177145 162968 158406 197195
12921 197195 204860 214345 228276 242411 253121 274342 285403 271633 256198 275521 284471 282013
12909 282013 269940 215407 155540 103973 60773 32230 40522 44249 62658 77813 79058 73521
12897 73521 79805 83306 74772 47609 36264 66752 90680 82433 64206 57308 40608 35145 53093
12884E3093R860r87R516j1062j4470j5701J2600J0797l770K462K164k993K248
12871E3757o330k5837k370P950Q587p340L456j2920n940K4733J1345j4033m203
12858C0855J6957r789j92J527L951q054j4052K7526J6845K0951j1393q291j0373
12845E6468j4261J042r762R005O468j0719q124P500l03j3181J2896K5599K261
12832F4889j0228J2868J8776O018o53r204j6055j2062K244l427O8k915j8661l795
12818B7863J0897J3477Q328J727J0400J9604O610j2380p766p097q896P747J5910
12805H6424p80J3764J4507K3025J8985K450j70N075k499l316O299j846o312Q988
12791A64594K1063J2899k238k3545q869J6798K5703R599L095L3970J9864K0740
$$ plain form
12884 53093 62953 61966 71482 60420 45950 30249 42849 53646 49876 52338 54502 51509 53757
12871 53757 47427 21590 19220 27170 35757 28417 31873 18953 13013 37746 49091 35058 30855
12858 30855 47812 38023 37831 39358 43309 35255 21203 48729 65574 86525 75132 66841 56468
12845 56468 42207 43249 33487 42492 48960 38241 30117 37617 37314 24133 37029 62628 64889
12832 64889 54661 67529 86305 92323 91670 82466 66411 54349 56593 53166 53234 50319 31658 27863
12818 27863 38760 52237 60565 62292 72692 92296 98906 86526 78760 71663 62767 70514 86424
12805 86424 85644 99408 113915 136940 155925 158375 158205 163280 160781 157465 163764 161918 155606 164594
12791 164594 185657 198556 196318 172773 163904 180702 206405 216004 219099 253069 272933 293673
12779B93673O6104N1055N4854L1576M7660L4052N6229Q6397J59606K38867K92500
12768A412573L82966L79680K83467J59538Q9423P3536j90771o80155o62232l83194
12758H64831j79029r7970l8365j8675o0o455k4994m0489k5766k4621l1378l8580
12746C38449k1173j1319l0579k0987o270j9657m243N690k3064p186J750L067o527
12733A97951k2179j4809j1891M057j934j4803m84R232j0839j6035j5892l3598
12721F8776l877N689m411k6205j5055j7194J192J7856j960L592j6089q037K2304
12708B6581R427K686j383k5329L719J6999J4177K6718p690n890k9412j1258r056
12695A0289l685k705K7432Q098n667k0098n35J1310m835o034J7609L0038n840
$$ plain form
12779 293673 359777 410832 465686 497262 544922 578974 635203 721600 881206 1120073 1412573
12768 1412573 1795539 2175219 2458686 2618224 2707647 2781183 2590412 1910257 1248025 864831
12758 864831 685802 587832 549467 530792 530732 524277 499283 458794 433028 408407 377029 338449
12746 338449 317276 305957 275378 254391 248121 228464 224221 229911 206847 199661 201411 204478 197951
12733 197951 175772 160963 149072 153129 151195 136392 135908 145140 134301 118266 102374 68776
12721 68776 64899 70588 66177 39972 24917 7723 8915 26771 24811 28403 12314 4277 26581
12708 26581 36008 38694 37311 11982 15701 32700 46877 73595 65905 60015 30603 19345 10289
12695 10289 6604 3899 31331 39429 33762 13664 13129 24439 19604 13570 31179 61217 55377
12682E5377l2640L395L492k105j2542Q576L814L21k49j664jM080O15m589k570
12667B3310J4631J799r879n665P431P652R049J0640n687q986r484Q400j0134K401
12653C5478j1356J317K9871J9525j7739m999j2862j4142j0838n547l927j3927
12641i146J0953J6391K0105J2869j4563j781J4615R063k3309k0770j4362j709
12629a644K6860K0108j1837j9282q7j142M81L361r653o906J0665j071j4045j5761
12615a9953J4717N674N274Q355n239r71J942l784J3050J0098L3028q45j9324o158
12601C5864n173N783p300K4269O929j0923j2203n458p828j5902q109m304P089
12588B734P452N668m938J062J2409J200j2370m47M950J174K695o49k4986O050
$$ plain form
12682 55377 22737 26132 29624 27519 14977 23553 27367 27688 27439 25775 25774 29854 30469 25880 23310
12667 23310 37941 39740 29861 24196 31627 39279 48328 58968 53281 44295 34811 43211 33077 35478
12653 35478 24122 25439 55310 74835 57096 52097 39235 25093 14255 8708 4781 -9146
12641 -9146 1807 18198 38303 51172 36609 34828 49443 58506 35197 14427 65 -1644
12629 -1644 25216 45324 33487 14205 14118 12976 13457 16818 7165 259 10924 9853 -4192 -19953
12615 -19953 -5236 438 5712 14067 8828 7857 9799 6015 19065 29163 62191 61346 42022 35864
12601 35864 30691 36474 29174 53443 60372 49449 37246 31788 23960 8058 -51 -4355 2734
12588 2734 10186 15854 10916 11978 24387 25587 13217 12770 17720 18894 21589 20940 -4046 2004
12574B004Q269O317K6871o877m353j0558R834J3182j0619k3104j7616R358R931
12561A2639R960R779j882K994L958r252l965J076K854J1863J432R371O214l0936
12547B6105L880K644J4428j2629q865k723j6985n585J2387J6915J692q161l236
12534A9867J1025Q417P783r344j0244K1478l645j3363M592J7843j320r539k5666
12521A7884j0870J261J4059N312J3424K5335K4815r327l3487j6150j9278p330
12509E648K1929K5692J5764j3592j0365l332P739Q636J1308j5878n952m607n685
12496C7305n833o769m316K077L641J4073r560r667o697n968n091J1964O114L672
12482B4945p287n036J8607J668o516j0310R207L876P667J0012j0612n501L578
$$ plain form
12574 2004 10273 16590 43461 36584 32231 21673 31507 44689 34070 10966 -6650 2708 12639
12561 12639 22599 32378 30496 33490 37448 28196 24231 25307 28161 40024 41456 50827 57041 26105
12547 26105 29985 32629 47057 34428 25563 22840 5855 270 12657 29572 31264 23103 19867
12534 19867 30892 39309 47092 37748 27504 48982 45337 31974 36566 54409 53089 43550 17884
12521 17884 7014 8275 22334 27646 41070 66405 91220 81893 48406 32256 12978 5648
12509 5648 27577 53269 69033 55441 45076 41744 49483 58119 69427 53549 47597 42990 37305
12496 37305 31472 24703 20387 22464 26105 40178 30618 20951 14254 8286 3195 15159 21273 24945
12482 24945 17658 12622 31229 32897 26381 16071 25278 29154 36821 46833 36221 30720 34298
12469C4298k1502J2415K9683J3869Q792J6663R02j3779j1590N413J1383j198K393
12456H7742k626o480N927J584O692j3413j0205k0611j2774L0683O837j4302j0252
12443D8802n408j9450j8275K3883p54q449P460O017N794K035M687j5336j9125
12430A1881L971J9262J7787k677N022l1373j0868o571J7427K0878R1J013k137
12417D3706N710n167j5585n206J884K8935M626o060L856j1989k8019r275k946
12404D470n794j125l332q44J1345J7663l930j0260j3846J537K3486K335l699k741
12390A5265o252M056J6909J1406J487l773k879j3603j0153J405J407J0856j013
12377B5118J648N153j1982J38j1782r255p967P367K0911J3441j0431k0441j5985
$$ plain form
12469 34298 12796 25211 54894 68763 77555 94218 95120 81341 69751 75164 86547 85349 87742
12456 87742 85116 78636 84563 86147 92839 79426 69221 48610 35836 66519 73356 59054 48802
12443 48802 43394 23944 5669 29552 28798 20349 27809 33826 39620 41655 46342 31006 11881
12430 11881 15852 35114 52901 50224 55246 23873 13005 6434 23861 44739 44830 45843 43706
12417 43706 49416 44249 28664 23458 25342 54277 58903 52843 56699 44710 16691 7416 4470
12404 4470 -1324 -2449 -5781 -6625 4720 22383 18453 8193 -5653 -4116 19370 21705 18006 15265
12390 15265 9013 13069 29978 41384 42871 39098 36219 22616 12463 13868 15275 26131 25118
12377 25118 26766 31919 19937 20075 8293 -962 -8929 -1562 19349 32790 22359 1918 -14067
12364a4067j4948l074R439J6686o450Q170k482M081r864Q441P043k086m908k828
12350f847K7898J5802j0141Q893j1792k2655j5497O645p469n023J0796K830J2214
12337E654J2099J2490j1730q894j9304K303K4477N126k1093r082J4944J1463m219
12324A4234j1668J2725J2357n354O61k1560j387k435J506n909L959K4581P879
12311B9589j3276j7287l61J0486N137J3600N939j0778J3488K3277P16k4974j3799
12298B1757q429q259j666O959j0801p828p579J1958j477J742J469K1565J3485
12285C2896k1275l1290J0075J2477J551Q962Q307l045j0521j5135j0514m486O038
12272a5960j3897K546J0262K3980k435n241L808J0190J2314p78K0304q19j2972
$$ plain form
12364 -14067 -29015 -32089 -22650 -5964 -12414 -4244 -6726 -2645 -12509 -4068 2975 889 -4019 -6847
12350 -6847 21051 36853 26712 35605 23813 1158 -14339 -7694 -15163 -20186 -9390 -6560 5654
12337 5654 17753 30243 18513 9619 -9685 -7382 17095 22221 1128 -7954 6990 18453 14234
12324 14234 2566 15291 27648 22294 22955 1395 8 -2427 -921 -6830 -2871 21710 29589
12311 29589 16313 -974 -1335 9151 14288 27888 33827 23049 36537 59814 60530 35556 21757
12298 21757 13328 5069 3403 10362 -439 -8267 -15846 -3888 -5365 -3623 -2154 19411 32896
12285 32896 11621 -19669 -9594 2883 4434 13396 21703 18658 8137 -6998 -17512 -21998 -15960
12272 -15960 -29857 -27311 -17049 6931 4496 -745 3063 13253 25567 24789 45093 44274 31302
12259C1302n70M68n654k1889o034J1566J902P993L830J4589k6769k2717j216M958
12245h241J9789J1418j5013r296K6J7674J4074m789k0781J605k62m537l759n507
12231g599j4219J3092J8442n058m752p598Q381j0803j2530J2643j0399J0920J5058
12218E578K027q024l765J2943l773o457L57J1662p318j4223M823l964J2164J1905
12204A3935j6207o405P852J0856O961J2864Q371P196K0570J0298k4194j3619k6858
12191A1620k1034j0944J0395J5915j644j3155n675l89J2436Q073L005K445Q643
12178A9691P1p784o693j6583q220R424j3184J699J0675O876j7364J0918K0041
12165I567j5268j3444L0699R130Q18r535J6304O594q18P362J5196Q16N10J6734
$$ plain form
12259 31302 30732 31200 25546 3657 -2377 9189 11091 19084 22914 37503 10734 -11983 -13199 -8241
12245 -8241 11548 22966 7953 -1343 -1317 16357 30431 25642 4861 6466 6204 1667 -2092 -7599
12231 -7599 -21818 -8726 9716 4658 -94 -7692 689 -10114 -22644 -10001 -20400 -9480 5578
12218 5578 7605 -419 -4184 8759 4986 -1471 -1114 10548 3230 -10993 -6170 -10134 2030 13935
12204 13935 -2272 -8677 -825 10031 16992 29856 38227 45423 65993 76291 52097 38478 11620
12191 11620 -9414 -20358 -9963 5952 4308 -8847 -14522 -14911 -2475 5598 8603 11048 19691
12178 19691 19762 11978 5285 -11298 -19518 -10094 -23278 -21579 -10904 -4028 -21392 -10474 9567
12165 9567 -5701 -19145 11554 20684 21502 11967 28271 34865 34047 41409 56605 57421 57931 74665
12151G4665J970j0979n221j0615O862m404k2851Q692J861J2174K0159l084j0378
12138E8851j6817j2366k8948K68K8453l783j0886o570k624M51K0837l063k7283
12125c480p302q235K976J4777J2771J1617p110J2250o592j2676j1456k021j2531
12112a7012Q431J9620L794q508j5390J631J6837k798l298o311L842J4515j6406
12099a053j1035j4507N445J6524K1660J0009J5294K2982n415k4336k8795P59N271
12086A2803L79K3310N98j9003j4897L337j2650m938J2813j64M304Q957k0771j3326
12072a9248Q995n853R131K1397J7018K108k3998k1860J3053K1698p69k809j7118
12059A745o700K680J2346M992r919j2289m356M266J1742J6040j5574j895M135
$$ plain form
12151 74665 76635 65656 60435 49820 56682 52278 29427 38119 39980 52154 72313 69229 58851
12138 58851 42034 29668 720 988 29441 25658 14772 8202 5578 6029 26866 23803 -3480
12125 -3480 -10782 -19017 -16041 -1264 11507 23124 16014 28264 21672 8996 -2460 -4481 -17012
12112 -17012 -8581 11039 14833 6325 -9065 -7434 9403 6605 3307 -3004 838 15353 -1053
12099 -1053 -12088 -26595 -21150 -4626 17034 27043 42337 65319 59904 35568 6773 7532 12803
12086 12803 13182 36492 37090 18087 3190 6527 -6123 -11061 1752 1588 5892 14849 -5922 -19248
12072 -19248 -10253 -16106 -6975 14422 31440 33548 9550 -12310 743 22441 21672 18863 1745
12059 1745 -4955 -2275 10071 15063 5144 -7145 -11501 -7235 4507 20547 4973 3078 7213
12046G213o492j6145j2644L628J6010N371p347K789J0210L781q787J328P692p286
12032f79j1115Q60o482J9426Q295j1386K119k777Q363J924r541j8930p562O611
12018b0874q289p314L0412K2164o922j8970j2710K481K4925n602j8858j2365P604
12005b4318J2877K7750m77j0448k927J0873J541K985q70q539K660j454J7145K17
11991B7015n606o078P546l120j3786l041R90k290p952o763P018J2714M662P998
11977A9307J2929l487j899J96J3517l248O580J5287j783j4166M710J1895k370
11964E7468P281J0857K3168K8084k471j6894M734P980l6499l6938j6756k2451
11952G563j1054l711n392j4896j2585j364l267J6771J2048j3792R582r194j9504
$$ plain form
12046 7213 721 -15424 -28068 -24440 -8430 -3059 -10406 -7617 2593 6374 -2413 -1085 6607 -679
12032 -679 -11794 -10934 -17416 2010 10305 -1081 1038 -1739 6624 8548 -993 -19923 -27485 -20874
12018 -20874 -29163 -36477 -6065 16099 9177 -9793 -22503 -20022 4903 -699 -19557 -31922 -24318
12005 -24318 -11441 16309 15832 5384 2457 13330 14871 17856 16986 8447 11107 9653 26798 27015
11991 27015 21409 15331 22877 19757 5971 2930 3920 1630 -6322 -13085 -6067 6647 11309 19307
11977 19307 32236 28749 26850 27046 40563 37315 43895 59182 57399 43233 47943 59838 57468
11964 57468 64749 75606 98774 126858 124387 107493 112227 120207 83708 46770 30014 7563
11952 7563 -3491 -7202 -12594 -27490 -40075 -41439 -44706 -27935 -15887 -29679 -20097 -29291 -48795
11939d8795K8481K4034M765l265R409Q907J5476j7450j3432j0288p799M08k452
11926a2001J0900O724j0903k007Q950P253j0742m539J2311n640r570R836J0718
11913A1290N955j1067j2617j4460J138q544Q181K3508J376k599J0488K2400n79
11900C4470n464k0125j7314m140L166o987j1944J8382M792K671L808o346j6297
11887b1328O23K0694m662n78j2179j4946j111P504j116k299k4989J3007K4034
11874a7346l682j0675J3726J1459r648J83m884J7915L479m797J8737L86j3803
11861A050m304l2k325J9945K599k7373k2917J0527P449O139R319J0898p738k874
11847C63R583j2218l566J5896o331N195J982n730l605p063o855r442J2565J4579
$$ plain form
11939 -48795 -20314 3720 8485 5220 14629 23536 39012 21562 8130 -2158 -9957 -9549 -12001
11926 -12001 -1101 5623 -5280 -7287 1663 8916 -1826 -6365 5946 306 -9264 572 11290
11913 11290 17245 6178 -6439 -20899 -19761 -28305 -20124 3384 4760 2161 12649 35049 34470
11900 34470 29006 8881 -8433 -12573 -9407 -16394 -28338 -9956 -5164 -2493 1315 -5031 -21328
11887 -21328 -20705 -11 -4673 -5251 -17430 -32376 -33487 -25983 -27099 -29398 -54387 -41380 -17346
11874 -17346 -21028 -31703 -17977 -6518 -16166 -15983 -20867 -2952 527 -4270 14467 14853 1050
11861 1050 -3254 -3286 -5611 14334 16933 -10440 -33357 -22830 -15381 -9242 77 10975 3237 363
11847 363 9946 -2272 -5838 10058 3727 8922 10904 5174 1569 -5494 -12349 -21791 -9226 5353
11833E353M294J3680j5715j7581j702n315J6708J1452o513L332R952L022r505
11820A1462m954j856k3082l5039K8097J9133J1433m440j2126j316k1586j5326
11808d9600K8211J7778o31O939l779j1864R757K1782Q798o726j8473o40P048j6897
11794h297l009K1717Q834o035N641L783O870j0370k0996l34J7931p120l674J6708
11780B1649j1803j7048n679j944l868l750j265K3239J1488O551J2953o350j1515
11767A2658m283j1665r758n980R827J4762R82r673j2225j127P398J0382K320o181
11753b563o336r417j3618o386J4793K4345m122k3596J5706J7465N601N614j8391
11740i05L324N724j0070m180j364L325k521R674K525M117j1123o926K1199o107
$$ plain form
11833 5353 9647 23327 7612 -9969 -11671 -16986 -278 11174 4661 7993 17945 20967 11462
11820 11462 6508 4652 -18430 -53469 -25372 -6239 5194 754 -11372 -12688 -34274 -49600
11808 -49600 -21389 -3611 -4242 2697 -1082 -12946 -3189 18593 27391 20665 2192 1552 8600 -8297
11794 -8297 -11306 10411 19245 13210 18851 22634 29504 19134 -1862 -2196 15735 8615 4941 21649
11780 21649 9846 -7202 -12881 -14825 -18693 -22443 -23708 -469 11019 17570 30523 24173 12658
11767 12658 8375 -3290 -13048 -19028 -9201 5561 6543 -3130 -15355 -16482 -9084 1298 3618 -2563
11753 -2563 -8899 -18316 -31934 -38320 -23527 818 -3304 -26900 -11194 6271 11872 17486 -905
11740 -905 2419 8143 -1927 -6107 -7471 -4146 -6667 3007 5532 9649 -1474 -8400 12799 6692
11726F692q122j813j2283k0017K06J8594j5041k130K2914l356l777J3224J3173
11713H264j1473m139O898J6924m624j9265j3976R941j2649p673J0925J4813R038
11700C004q884N169J3039j076p698K507j198q497n422K16Q669J2570J0348J0258
11686C3005m408r060j0212K974P49P19j8945N96j4358M877K6957l171k2239O930
11672e586P538k2379o543Q87K392J5773Q638K1194j2341j2737j3568j6192K682
11659c0242j847R492l102L984j3502O189J8920J0332J8187O402k3761J177K728
11646D957K09k065q523n788L630Q154N868j951N646L321j8483m846J838q114j6270
11631c2417r495Q993R372R401O546J337o520r790J9199q529j4479J1027K1802
$$ plain form
11726 6692 -1430 -3243 -15526 -35543 -35337 -16743 -31784 -33914 -11000 -14356 -18133 -4909 8264
11713 8264 -3209 -7348 -450 16474 11850 -7415 -21391 -11450 -24099 -31772 -20847 -6034 3004
11700 3004 -5880 -711 12328 11252 3554 6061 4863 -3634 -9056 -8840 -171 12399 22747 33005
11686 33005 28597 19537 9325 12299 13048 13767 -5178 -4582 -18940 -14063 12894 9723 -12516 -5586
11672 -5586 1952 -20427 -26970 -26083 -23691 -7918 720 21914 9573 -3164 -16732 -32924 -30242
11659 -30242 -32089 -22597 -25699 -21715 -35217 -29028 -10108 224 18411 24813 1052 2229 4957
11646 4957 5166 3101 -5422 -11210 -7580 574 6442 4491 10137 13458 -5025 -9871 -8033 -16147 -32417
11631 -32417 -41912 -32919 -23547 -14146 -7600 -6263 -12783 -22573 -3374 -11903 -26382 -15355 6447
11618F447N301j8057k582j947N077J3330m170O178J2470K77j4047K283p116N312
11604H756j648R122l76J28k5496j6468N248N224J3044J952l166K474o143p758
11590a5107K8436J3794n412k3553k4162M662K2090q373O336Q803K012L161k9757
11577a7070r792J7916L0408K909j3003N292O554Q32m829j8160J171K014j3229
11564h987j5981p51K7406k206p501j3061P140J1268O722K364l1j1183L196M708
11550C103j6919J317R796O362K045j0450J0259N437K984O324n520j2879M356J1924
11536A8139j6320K375J3052p139k3854k5048K0280K2176J4770M72n687j2330k582
11523a696Q675m457J90m615J750J9800o320r012k3630j0536p747p111L7773L990
$$ plain form
11618 6447 11748 -6309 -8891 -10838 -5761 7569 3399 9577 22047 22324 8277 10560 3444 8756
11604 8756 7108 16230 15854 15982 -9514 -25982 -20734 -15510 -2466 -514 -3680 -1206 -7349 -15107
11590 -15107 13329 27123 21711 -1842 -26004 -21342 748 -7625 -1289 7514 9526 12687 -17070
11577 -17070 -26862 -8946 21462 24371 11368 16660 23214 24046 19217 1057 2228 4242 -8987
11564 -8987 -24968 -25719 1687 -519 -8020 -21081 -13941 -2673 4049 6413 6382 -4801 -1605 3103
11550 3103 -13816 -12499 -2703 3659 5704 -4746 5513 10950 13934 20258 14738 1859 6215 18139
11536 18139 1819 4194 17246 10107 -13747 -38795 -18515 3661 18431 18903 13216 886 -1696
11523 -1696 6979 2522 2712 -1903 -153 19647 13327 4315 -19315 -29851 -37598 -44709 -6936 -2946
11509b946j4333J255P542J3221O844L592j939O627p30J0241o436l560k1718j8112
11495b0452m614j807K2234Q794j8358K597O535J3894M10l998j3159O718J1891
11482A0685Q943j298j7470k258K681L317j399q582j6225q455J1611K0240K070
11469C860J552n700k3737j4868L286J3501Q670J2202J766J296J044P34J5074L070
11455B1750j8408J1270m865j1719j9590o603o083j5652J8679K02o397K0862O723
11442i831q546l210N399Q793m469p08O777o077J918l553j522m777K1591J3335
11428A5120J6220j4214j7791k1052n827N191R227L880m389R293K1653N333l810
11415A8834r899p261N340j418j4550l21P79j5814m496J8409L2218L817r953j8773
$$ plain form
11509 -2946 -17279 -16024 -8482 4739 11583 15175 13236 19863 19133 29374 22938 19378 -2340 -20452
11495 -20452 -25066 -26873 -4639 4155 -14203 -11606 -5071 8823 9233 5235 -7924 -1206 10685
11482 10685 19628 18330 860 -1398 1283 4600 3201 -5381 -21606 -30061 -18450 1790 3860
11469 3860 5412 -288 -24025 -38893 -35607 -22106 -13436 -1234 532 1828 2872 3606 18680 21750
11455 21750 3342 14612 9747 -1972 -21562 -28165 -34248 -49900 -31221 -31019 -37416 -16554 -9831
11442 -9831 -18377 -21587 -16188 -7395 -11864 -12572 -5795 -11872 -9954 -13507 -15029 -19806 1785 15120
11428 15120 31340 17126 -665 -21717 -27544 -22353 -13126 -9246 -13635 -4342 17311 22644 18834
11415 18834 8935 1674 7014 5596 -8954 -9275 -8496 -24310 -28806 -10397 21821 25638 15685 -3088
11401c088j175L127r936r238n877o091M238O06l400J9679J1306l670J0606K166
11387I253J4812K931j1608j3069k9031k74K61k377o668O232j0318j2949J7159
11374c5646J9353p500l708J1265J5743L37M677K703j6187o665Q755P262j0005
11361i616j0688k903J5369O884l872J0673o190j1374L917q434m459J0065J3054
11348B426j6440j1164j3283J5921L345j0024J3488Q179j3340J918q306J20M000
11335b3160K8046J1102J5222r333j6977j0862j0588j3404Q51J5905J6481o404
11323c121N42j1482j3385o774J6708l782L042J0959J2382J5330j7073k2718J8331
11310a041J7288J383j4801J580J0009O989J4352j0785l9409p341p971j3981O791
$$ plain form
11401 -3088 -4263 -1136 -11072 -20310 -26187 -32278 -28040 -27434 -30834 -11155 151 -3519 7087 9253
11387 9253 24065 26996 15388 2319 -26712 -26986 -26725 -29102 -35770 -29538 -39856 -52805 -35646
11374 -35646 -16293 -23793 -27501 -16236 -493 -156 4521 7224 -8963 -15628 -6873 389 -9616
11361 -9616 -20304 -23207 -7838 -954 -4826 5847 -343 -11717 -7800 -16234 -20693 -10628 2426
11348 2426 -14014 -25178 -38461 -22540 -19195 -29219 -15731 -7552 -20892 -18974 -27280 -27160 -23160
11335 -23160 4886 15988 31210 21877 4900 -5962 -16550 -29954 -29103 -13198 3283 -3121
11323 -3121 -2579 -14061 -27446 -34220 -17512 -21294 -18252 -7293 5089 20419 3346 -19372 -1041
11310 -1041 16247 17630 2829 4409 14418 21407 35759 24974 -14435 -21776 -29747 -43728 -36937
11297c6937K9085J9416m333j3834K3725J418k3553j6579n413J1024J2083J5074
11285A1176J1031j1777Q479R823J9780q196j7868j0739N006k799J1092k4177j937
11272a106J0945K848p854P100J0211k354j844r567j1422j4158j4156N342N075
11259b0940J1714M459j803j1114N162J3772j6909o875r060j0044J7793J0692J5580
11246B427j0424l893j28K574r539P786K1536m058m523n980k780P261j54M597J0650
11231A5352p108j3771j6289l456O198J9654j4558j4470j091J4302J3466J8723
11219A6952R180l704j1657l4131j1755R472J7557o670j2576K83N394n085q750
11206c5490M397J2053J1636J8229N82n181m797M352n57R765M599n813r614K529
$$ plain form
11297 -36937 -7852 11564 7231 -6603 17122 18540 -5013 -21592 -27005 -15981 -3898 11176
11285 11176 22207 10430 18909 28732 48512 40316 22448 11709 16715 13916 25008 831 -1106
11272 -1106 9839 12687 4833 11933 22144 19790 17946 8379 -3043 -17201 -31357 -26015 -20940
11259 -20940 -9226 -4767 -6570 -17684 -12522 1250 -15659 -22534 -31594 -41638 -23845 -13153 2427
11246 2427 -7997 -11890 -12018 -9444 -18983 -11197 10339 6281 1758 -4222 -7002 259 105 4702 15352
11231 15352 8244 -5527 -21816 -25272 -19074 580 -13978 -28448 -29539 -15237 -1771 16952
11219 16952 26132 22428 10771 -23360 -35115 -25643 -8086 -14756 -27332 -27049 -21655 -26740 -35490
11206 -35490 -31093 -19040 -7404 10825 11407 6226 1429 5781 5224 14989 19588 13775 4161 6690
11192F690J0671j8208M731J405o313L986q095r75O261o896J2529L6189J5097k1287
11178C5785j5581j3324k1117q117j597J7984O188j188q465K2307J721N590r298
11165A0888k596N190q337M99K5123k168o904j0220k3456M255O266K4364o563j1497
11151D844p833l948Q052J1472N997P561O313o828k8558J068p852K950M089O836
11137D163o233r583m526j855Q325j2933K839O127J1095J3914L946R748j2433j1679
11123I15j4198O36J4294N128l088O468n753j1719J3373J9349J552J157P479j2606
11109B2987k4783j0045J1744L245J94L8j2295Q77J0160L483J3847j3977J4167
11096A9642M644k1234p865J0901R73o743q127O600J1700k488n82o743P440O798
$$ plain form
11192 6690 17361 -847 3884 5289 -1024 2962 -5133 -6108 153 -6743 5786 41975 57072 35785
11178 35785 20204 6880 -14237 -22354 -23951 -5967 221 -967 -9432 12875 14596 20186 10888
11165 10888 8292 13482 5145 5644 30767 28599 21695 11475 -11981 -7726 -1460 22904 16341 4844
11151 4844 -2989 -6937 1115 12587 18584 26145 32458 25630 -2928 -1860 -9712 -6762 -2673 4163
11137 4163 -2070 -11653 -16179 -18034 -9709 -22642 -19803 -13676 -2581 11333 15279 25027 12594 915
11123 915 -13283 -12647 1647 6775 3687 10155 4402 -7317 6056 25405 26957 28114 35593 22987
11109 22987 -1796 -11841 -97 3148 3342 3380 -8915 -8038 2122 5605 19452 5475 19642
11096 19642 24286 3052 -4813 6088 7061 318 -7809 -1209 10491 8003 7421 678 8118 14916
11082A4916j5758k483j3115o5J5834J5296j7817L075J8654M905q251j3064l744
11069a617j8007j3824j648J0827J3520O624L769r329n037l141q661M41K5690m977
11055e370M194j1443o606J2130J4901l46r187P055Q714k669J3871r793l0690M479
11041a0760J6382J3010q641k8842q478j3172J5937J1934J0740M078J6474J0326
11029B8988j1948K473Q674M943M139j2555k6934k8161j2660L824m383J7486J5582
11016a0532K3693j6683j2675J5983J7670l640j0486J532j501o308n280O231J331
11003f65r018p163L448J272o576r761k109J2419J5443Q219m620q497L713K2252
10989A8357Q439j7792n375k7278j9890Q877j46M620Q290K6388J4865k6759n799
$$ plain form
11082 14916 -842 -3325 -16440 -16505 -671 14625 -3192 -117 18537 23442 15191 2127 -1617
11069 -1617 -19624 -33448 -35096 -24269 -10749 -4125 -356 -9685 -14722 -17863 -26524 -26083 -393 -5370
11055 -5370 -1176 -12619 -19225 -7095 7806 7460 -1727 5328 14042 11373 25244 15451 -15239 -10760
11041 -10760 5622 18632 9991 -18851 -27329 -40501 -24564 -12630 -1890 2188 18662 28988
11029 28988 17040 19513 28187 33130 37269 24714 -2220 -30381 -43041 -39217 -43600 -26114 -10532
11016 -10532 13161 -3522 -16197 -214 17456 13816 3330 4862 3361 -2947 -8227 -1996 -665
11003 -665 -9683 -16846 -13398 -12126 -18702 -28463 -30572 -18153 -2710 5509 889 -7608 -3895 18357
10989 18357 26796 9004 3629 -23649 -43539 -34662 -34808 -30188 -21898 4490 19355 -7404 -13203
10976a3203M717J7275k367r966j2137m22K3995J6671k2270l997R434J0127J3327
10963C1184j2883j6743o454r700K1350O371L149m205n486K651r374j3191J2178
10950a153R039j9043K3722J7605o824k5703k6761r16L129j0497k786J3913O934
10937a9341J1410K426O007J4499J134j9966j5185j1437L152R772J1449J7165P787
10924A8872n470p722J89m699r758K482l798j1587K155j0241J7262J0201p972j4799
10910b4885P469J0553J1352R670j5043q112J0691K50k8407j3473P892m419K8091
10897h371J8774j834n332j0624j0779J1158J8214p899o953P509L174O926k190
10884A1773k2074j492L674J643o551j6364j971L1737J3345p425n496Q873m626
$$ plain form
10976 -13203 -8486 8789 6422 -3544 -15681 -16103 7892 24563 2293 -1704 7730 17857 31184
10963 31184 18301 1558 -4896 -14596 6754 13125 16274 12069 6583 9234 -140 -13331 -1153
10950 -1153 7886 -11157 12565 30170 23346 -2357 -29118 -30034 -26905 -37402 -40188 -26275 -19341
10937 -19341 -7931 -5505 502 15001 16135 -3831 -19016 -30453 -27301 -17529 -6080 11085 18872
10924 18872 13402 5680 5869 1170 -8588 -6106 -9904 -21491 -19336 -29577 -12315 -2114 -10086 -24885
10910 -24885 -17416 -6863 4489 14159 -884 -8996 1695 1945 -26462 -39935 -32043 -36462 -8371
10897 -8371 10403 8569 3237 -7387 -18166 -7008 11206 3307 -3646 3863 7037 13963 11773
10884 11773 -10301 -11793 -8119 -6476 -13027 -29391 -31362 375 13720 6295 799 9672 5046
10871E046p340j0449j687O289K7069j3513o522J2776L814p893O245M292R671J2878
10857D0676k307l1580m377l012q924Q054R389O247q45j286m744q146M59o347o336
10842a3079k469j395J1517k814N049O95R127j098k0243J464K2597N788P506o479
10828A6166j0444j8666q917J4578J0954J0319O768j5390N193L09J3118o418j7064
10815E06J899l89j170J6433J520k0314O522J197L547l244j1013m990K5458q157
10801G805J814j9661q233N825P553j7551j0189j4974J1425L0113J8135m699o832
10788E31K1603J959n872P586J1750L073l057o71l420j2844q150p655j890J5878
10774A8821m888j6954k4661j916K7454N24J464J4351O700j4956o018k968Q313
$$ plain form
10871 5046 -2294 -12743 -14430 -8141 18928 5415 -1107 11669 15483 7590 13835 18127 27798 40676
10857 40676 38369 6789 2412 -600 -9524 -1470 7919 14166 13321 12035 7291 -855 -396 -6743 -13079
10842 -13079 -15548 -16943 -5426 -8240 -3191 -2496 6631 5533 -14710 -13246 9351 15139 22645 16166
10828 16166 5722 -12944 -21861 -7283 3671 13990 20758 5368 10561 10870 23988 17570 506
10815 506 2405 2016 846 17279 18799 -1515 5007 6204 9751 6507 -4506 -9496 15962 7805
10801 7805 9619 -10042 -18275 -12450 -4897 -22448 -32637 -47611 -36186 -6073 12062 7363 531
10788 531 22134 24093 18221 25807 37557 40630 37573 36902 33482 20638 12488 4833 2943 18821
10774 18821 13933 -3021 -27682 -29598 -2144 -1620 -156 14195 20895 5939 -79 -3047 5266
10761E266R383o526k867rj7288l261J7035k0807j7909J4722J3958j1504o098J332
10747b4573J8965L7092j83j9585J875j7654O092K5778K285N456q824j6962J1007
10734B0769j0982j0455K372m445k819K952n537K631P398L409j546j376m682j0951
10720a3262L387j3271j6088J9705L2389q04j2479k075J167N34l164R660J5349
10707B1048P627n882l1584J515R659J3268j91K374k3867j24p707j1034n118J3418
10693a6598J8809Q061N59J1511j7487O971J0733j1052j1942k911l761J89j914
10680h832K0492R670j3520m641K521r250k8600M501J9592K0597j2487j1596j3051
10667b4604J389J2775J9309k344q352L262j7500j2301J2278N353R900k229j5120
$$ plain form
10761 5266 14649 8123 5256 5247 -12041 -15302 1733 -19074 -36983 -22261 -8303 -19807 -25905 -24573
10747 -24573 -5608 31484 31301 11716 13591 -4063 2029 27807 30092 35548 26724 9762 20769
10734 20769 9787 -668 1704 -2741 -5560 -2608 -8145 -5514 1884 5293 3747 2371 -2311 -13262
10720 -13262 -9875 -23146 -39234 -19529 12860 12056 -423 -2498 -1331 -797 -3961 5699 21048
10707 21048 28675 22793 -8791 -7276 2383 15651 15460 17834 -6033 -6157 -13864 -24898 -30016 -16598
10693 -16598 2211 10272 10831 22342 4855 11826 22559 11507 -435 -3346 -7107 -6918 -8832
10680 -8832 11660 21330 7810 3169 5690 -3560 -32160 -27659 -8067 12530 43 -11553 -24604
10667 -24604 -23215 -10440 8869 6525 -1827 1435 -16065 -28366 -16088 -10735 -835 -3064 -18184
10654a8184j167L4j4397L87K7011J4402k6762J4881k974o76L830O760m469j274
10640b598K5186N516r603j4771q802q359j5324K477J9234Q174R369j0810n457
10627e768o072P615M298j091j6709P815J7733K152q964k0906o242r587k175L1187
10613f714L734k384M718K579O095j5337j2662j926o266l750O228l078J977j0200
10599c6986J2903J6881J2040J6123j646n878k1394r92J2668Q797l100j5606j1420
10586a7610O399J2749K270j2380m992J9565N780j3233K848M920K249N06L382J489
10572A3942p521k1833j5833N795K6363j521N790J8951J1201l29j7744m829N0k024
10558A0458K063J2132R122j5299j2576j5873k649p814n036l006k331j196Q184
$$ plain form
10654 -18184 -19351 -19317 -33714 -33327 -6316 8086 -18676 -3795 -6769 -7445 -3615 3145 -1324 -2598
10640 -2598 22588 28104 18501 3730 -5072 -13431 -28755 -26278 -7044 1130 10499 -311 -5768
10627 -5768 -11840 -4225 73 -1018 -17727 -9912 7821 9973 1009 -19897 -26139 -35726 -37901 -6714
10613 -6714 -2980 -5364 -646 1933 8028 -7309 -19971 -21897 -28163 -31913 -25685 -28763 -26786 -36986
10599 -36986 -24083 -7202 4838 20961 19315 13437 -7957 -8949 3719 12516 9416 -6190 -17610
10586 -17610 -11211 1538 3808 -8572 -13564 6001 11781 -1452 1396 6316 8565 9071 12453 13942
10572 13942 6421 -15412 -31245 -25450 913 -608 5182 24133 35334 35005 17261 12432 12482 10458
10558 10458 12521 24653 33775 18476 5900 -9973 -12622 -20436 -25472 -28478 -30809 -32005 -23821
10545b3821K1987Q357p921K504j02k633L669J1562r082j8984m032J82k343J0336
10531a0321J7558R327J037j0673j3354o946k842L400N731P263J3414r714j4984
10518a1104P23J1230j2549o740j0858j7475K069J7973O532J4607L492K3391L078
10505B4369j9749j9033j0459j1964j0297P780p782O156J9665J0315n065j138J9093
10492A891J062n478K0424l162K00q593l1181N906K8923R231k565l289j7722p927
10478a2280P613K7136J1966o797J1985j0031k8679M712M758o582p424j5551r896
10465b9070Q459L62P269J8789K2389J808j7851k5231J2729J8050j3850j3264K044
10452g367r215J3956K00j5809j5660j4703K928K5978J4383p882j2170N193R564
$$ plain form
10545 -23821 -1834 6523 -1398 1106 1004 -1629 2040 13602 4520 -14464 -18496 -18314 -20657 -10321
10531 -10321 7237 16564 17601 6928 -6426 -13372 -16214 -12814 -7083 180 13594 3880 -11104
10518 -11104 -10381 849 -11700 -18440 -29298 -46773 -44704 -26731 -20199 -5592 -2100 21291 24369
10505 24369 4620 -14413 -24872 -36836 -47133 -39353 -47135 -40979 -21314 -10999 -16064 -17202 1891
10492 1891 2953 -2525 17899 14737 14937 6344 -24837 -18931 9992 19223 16658 13369 -4353 -12280
10478 -12280 -4667 22469 34435 27638 39623 29592 913 5625 10383 3801 -3623 -19174 -29070
10465 -29070 -20611 -20249 -12980 5809 28198 30006 12155 -13076 -347 17703 3853 -9411 -7367
10452 -7367 -16582 -2626 -2426 -18235 -33895 -48598 -45670 -19692 -5309 -13191 -25361 -20168 -10604
10439a0604j64K9539l019q863L877k427j4104J1685K817n253j3044p242J2296
10426d506N569J941M839m525l701J3763j873j6880M713J4791J3847j7120j2942
10413b084k105J2862J8857J0946j5186j04j311O532j1108k3078j9950j3049N247
10400c3531K1533O956N623Q734l044k0134K673p837K234j378R564P022p333K086
10386f832P282j4467n7n120j3189R620K7011K505j6880l6069q412J7101K5544
10373a1963J9144L626M193j1359K4354j948j5694q750q948l315J7763N577N402
10360A8082k270q444m0354r997K1665J3892m877j2679j2498k01J6500p209M421
10347b3969K2256o536j0926m541L618p412J566J922J2910J3533n752o222q884
$$ plain form
10439 -10604 -10768 18771 15752 6889 10766 8339 -5765 5920 8737 3484 -9560 -16802 -4506
10426 -4506 1063 3004 7843 3318 -383 13380 11507 -5373 -660 14131 27978 10858 -2084
10413 -2084 -4189 8673 27530 38476 23290 23186 21875 28407 17299 -5779 -25729 -38778 -33531
10400 -33531 -11998 -5042 581 9315 6271 -13863 -11190 -19027 -16793 -18171 -8607 -1585 -8918 -6832
10386 -6832 450 -14017 -14074 -19194 -32383 -22763 4248 6753 -10127 -46196 -54608 -37507 -11963
10373 -11963 7181 10807 15000 3641 27995 26047 10353 1603 -7345 -10660 7103 12680 18082
10360 18082 15812 7368 -32986 -42983 -21318 -7426 -12303 -24982 -37480 -37681 -21181 -28390 -23969
10347 -23969 -1713 -8249 -19175 -23716 -20098 -27510 -25944 -24022 -11112 2421 -3331 -9553 -18437
10334a8437p249L08J465K1193Q053M657j3205L865o756J051L067J8476q183n107
10320C198P303K15j0581M436o592k966J3923K4974J331m329N690L863L12R600
10306E0377n798L116P88k1868j5808j6599q862R318J3321K710r363m925k39l097
10292f929R721n971q443j14J0248P344K304j305l378J8679J0993l196j592j0984
10278A7377R967j939k012k0652j5375J1148J0176o423q770M518Q024Q220K316
10265A6575M338k5183n727L767R747q606J0921o181r777J882K2176P367m289M556
10251B1566M366K2137j002j5310k4096j7228P370L344Q144R398q809Q85P600J0703
10237B9068j0167l3146p834j4387L005J0165k888n96J0238o075P421R225J6238
$$ plain form
10334 -18437 -25686 -25378 -23913 -2720 5333 9990 -3215 650 -6106 -5055 -1988 16488 8305 3198
10320 3198 10501 10716 135 4571 -2021 -4987 8936 33910 35241 30912 36602 40465 40777 50377
10306 50377 44579 47695 48483 26615 10807 -5792 -14654 -5336 7985 10695 1332 -3593 -3832 -6929
10292 -6929 2792 -3179 -11622 -11736 -1488 5856 8160 6855 3477 22156 33149 29953 28361 17377
10278 17377 27344 25405 23393 2741 -12634 -1486 8690 2267 -6503 -1985 6039 14259 16575
10265 16575 20913 -4270 -9997 -6230 3517 -5089 5832 -349 -10126 -8244 13932 21299 17010 21566
10251 21566 25932 48069 47067 31757 7661 -9567 -2197 1147 9291 18689 9880 10765 18365 29068
10237 29068 18901 -14245 -22079 -36466 -33461 -23296 -26184 -26780 -16542 -22617 -15196 -5971 10267
10224A0267J6845M873j5755j9340q009o204j441q009J0537j5310L74k31K3487
10211g916J6338L952l57j3684j2494j1098L476J1002J4884J6895O21j3404q133
10198H2P688P234o510j5763K924j2630K577J552p851K0268P550N055P218m262
10184A5132k3532j0645J0822J5957q753M963P204Q785o757J4407L631j716l4625
10171e127o127j6299n790M388K031J0651Q539K6279J4951n643Q76n168q62L3887
10157E6586R020j2801j3285n679j8183j6156r342J4170M946J470o432O25j1454
10144f515j7289N264L3753K836q206m762L930L43j1605K065j6048p072J1146J7219
10130E059p699J5689M71K2457R145J987k1017j0944j764J1015M506P83k1482j6839
$$ plain form
10224 10267 27112 31985 16230 -3110 -11119 -17323 -18764 -26773 -16236 -31546 -31172 -31403 -7916
10211 -7916 8422 12374 12017 -1667 -14161 -25259 -21783 -10781 4103 20998 21619 8215 82
10198 82 7770 15004 8494 -7269 -4345 -16975 -14398 -12846 -20697 -429 7121 12176 19394 15132
10184 15132 -8400 -19045 -8223 7734 -1019 3944 11148 19933 13176 27583 31214 29498 -5127
10171 -5127 -11254 -27553 -33343 -28955 -26924 -16273 -7734 18545 33496 27853 28729 23561 22699 56586
10157 56586 65606 52805 39520 33841 15658 -498 -9840 4330 9276 10746 4314 4939 -6515
10144 -6515 -23804 -18540 15213 18049 9843 5081 9011 9354 -2251 -186 -16234 -23306 -12160 5059
10130 5059 -2640 13049 13520 35977 45122 47109 26092 15148 13384 24399 28905 29688 8206 -8633
10116h633J0047J7665r386k1885j6817k2578Q945K1875J0139m008P089j0892K541
10103a5898L718P044p09m898q983P833j512o965M630J2459J0360N552o32n574
10089F425p876J0457J6115Q535k2348j2534P464n343k5134j5574Q885K1093k1732
10076c1567r634J9656K2866J4450k7291k1549J7303L706J1579k2606J643R638
10064a1806l371j4745N697O377N077K0465M724j0389j1172L9n647j3904J357K2187
10050e111P690o241M304J1301M658j2799J39m682L641J3324J1936j2416j5560
10037A84J537J4043n149j7569M95Q844J0320J4703k623l307J2833K3214J1522
10024F9047J7105j2796j722R651j9351l5638o597j6071n931J1134m387l4038j272
$$ plain form
10116 -8633 1414 19079 9693 -12192 -29009 -51587 -42642 -20767 -10628 -14636 -7547 -18439 -15898
10103 -15898 -12180 -5136 -5845 -10743 -19726 -11893 -13405 -20370 -15740 -3281 7079 12631 11999 6425
10089 6425 -1451 9006 25121 33656 11308 -1226 6238 895 -24239 -39813 -30928 -9835 -31567
10076 -31567 -41201 -21545 1321 15771 -11520 -33069 -15766 -12060 -481 -23087 -21444 -11806
10064 -11806 -15177 -29922 -24225 -17848 -12771 7694 12418 2029 -9143 -9104 -14751 -28655 -27298 -5111
10050 -5111 2579 -3662 642 11943 16601 3802 3941 -741 2900 16224 28160 15744 184
10037 184 1721 15764 10615 -6954 -6459 2385 12705 27408 24785 21478 34311 57525 69047
10024 69047 86152 73356 71634 81285 61934 26296 19699 3628 -2303 8831 4444 -29594 -30866
10011c0866J6329m455j5251j4157K1113K6375l812p569m422K5387J766K596l211
9998I823J423o426L219N797J5842j3639j7508j616J3694j4427j6533L0486J8320
9985B8455p806j9938q806P529O932J2731q606r928q129r563K913L680J3941m547
9971a142l394N995J8221k3943o661j811q895M70l848L825K911K783J1936K9152
9957B5599J8352j2225l616k7095q286J170K592j873O409J8387j0646o0L029N554
9943A7291Q831P985j1286r733m670O579p810j5131j6879P428J9583J7147L674
9930B3009P302K34j1397j3391J47r611j5232P025J7508J248j795K4248j7050o788
9916E457Q707l816j1506J4518R941J3933J3490Q927k0212j5395r758P776J3116
$$ plain form
10011 -30866 -14537 -18992 -34243 -48400 -27287 -912 -4724 -12293 -16715 8672 10438 13034 9823
9998 9823 11246 4820 8039 13836 29678 16039 -1469 -3085 10609 -3818 -20351 10135 28455
9985 28455 20649 711 -8095 -566 6366 19097 10491 563 -7566 -17129 -14216 -10536 3405 -1142
9971 -1142 -4536 1459 19680 -4263 -10924 -12735 -21630 -21160 -25008 -21183 -18272 -15489 -3553 25599
9957 25599 43951 31726 28110 1015 -7271 -6101 -3509 -5382 1027 19414 8768 8708 11737 17291
9943 17291 26122 34107 22821 13088 8418 14997 7187 -7944 -24823 -17395 2188 19335 23009
9930 23009 30311 30545 19148 5757 5904 -3707 -18939 -11914 5594 6842 5047 29295 12245 5457
9916 5457 14164 10348 -1158 13360 23301 37234 50724 59651 39439 24044 14286 22062 35178
9903C5178l848j6043O943J7129N906n481J8447M951L966j6935k6593k0871j7685
9890a4936m892J3002N813P000J5949p897q937p161j2029M908k549J1197O529O280
9876A2277K269K214m504n676l895j1404P422L852n594J466l465m61l197l33J1052
9861B023O826J3668J0061j2194j4254j354J975q273o328k174J4072K582K933J5067
9847B4630j3377j2383q188j1467J3667J6935J2079l379l608l9j3085J724j202
9834B307j5554j5210J2861K0347J1370K757l920L73R621k376p45J0544m479j2329
9820A5567j1403J8717K7119k929k4847j8785l1068r023L3282N008J2289J4160
9808B8087j3232k3163J0485Q060P037N406m320p990p807o732K331L43q905L004
$$ plain form
9903 35178 31330 15287 22230 39359 45265 39784 58231 63182 67148 50213 23620 2749 -14936
9890 -14936 -19828 -6826 -1013 5987 21936 14039 5102 -2059 -14088 -9180 -11729 -532 5997 12277
9876 12277 14546 16760 12256 6580 2685 -8719 -1297 2555 -3039 -1573 -5038 -5499 -8696 -9029 2023
9861 2023 8849 22517 32578 20384 6130 4776 6751 -1522 -7850 -10024 4048 6630 9563 24630
9847 24630 11253 -1130 -9318 -20785 -7118 9817 21896 18517 14909 14870 1785 3509 2307
9834 2307 -13247 -28457 -15596 4751 16121 18878 14958 15331 24952 22576 21831 32375 27896 15567
9820 15567 4164 22881 50000 47071 22224 3439 -27629 -36652 -3370 1638 13927 28087
9808 28087 14855 -8308 2177 10237 17274 22680 18360 10370 2563 -4169 -1838 -1495 -10400 -7396
9794g396J7210O63L07J347j7551m529p658J9588j196j2454l410Q630m224O69P79
9779i225j5249M607J8528K1341J1813P714P422j892k835k3122k5391p895M139
9766a0045k390j1754M134K4507l463n063L004J4950j1449k173J587N946k059j9188
9752a3456j0419N727k47J1400Q520o170o047p653j2484K7013J0476J6718K989
9739B6367O721j6627m361k247j5102J4732O895m928r248M788p563J2878L213j0899
9725D619l29o909P595o054k2656j0035N786K238J6046P244o424m321J1115N829
9711C744l259k789J0209J3743O720j6710j1845j4920K232R498j6899n179J4494
9698a0961J1064J9595J4273R726n565j3713k2896k6854l936J6507l246k0048L642
$$ plain form
9794 -7396 9814 10477 10784 12131 -5420 -9949 -17607 1981 785 -11669 -15079 -6449 -10673 -10004 -9225
9779 -9225 -24474 -19867 -1339 20002 31815 39529 46951 45059 42224 19102 -6289 -14184 -10045
9766 -10045 -12435 -24189 -20055 4452 989 -4074 -1070 13880 2431 258 1845 7791 5732 -13456
9752 -13456 -23875 -18148 -18395 -6995 1525 -4645 -10692 -18345 -30829 -3816 6660 23378 26367
9739 26367 33088 16461 12100 9853 -5249 9483 16378 11450 2202 6990 -573 12305 15518 4619
9725 4619 4290 -2619 4976 -1078 -23734 -33769 -27983 -25745 -9699 -2455 -8879 -13200 -2085 3744
9711 3744 485 -2304 7905 21648 28368 11658 -187 -15107 -12875 -3377 -20276 -25455 -10961
9698 -10961 103 19698 33971 43697 38132 24419 1523 -25331 -29267 -12760 -16006 -36054 -32412
9685c2412o393J8510K0096L728K609Q780n171o904M747j4565N336N084J612Q624
9671A3681r994j665P939l486O352O42k617Q85R902K5012J3574j9763j9561j5040
9657E861r241L868k037j6205Q022R488J2876p401Q582P688m297j0139q16J5670
9643B1919j086q558m256j6471J6074K7937J853k0869l3521n127Q278K3621P341
9630A7135M97K890K174o294K299n434j3897j7328Q134Q143J9565j855j9079j8125
9616b1175R29J4826J2084M916l495J4194m787q215p846o651l183k040L741j0438
9602a7140J112l425P439M136o5n245j2110K1639K5466o858l984n731J788J3587
9588B0609O798R482j1113k5288l981j463P042n722p241R858M720l637R538L371
$$ plain form
9685 -32412 -38805 -20295 -199 3529 6138 14918 9747 2843 7590 -6975 -1639 3445 5057 13681
9671 13681 3687 2022 9961 6475 12827 13469 10852 11737 21639 46651 60225 40462 20901 5861
9657 5861 -3380 488 -1549 -17754 -9732 -244 12632 5231 13813 21501 17204 7065 6249 21919
9643 21919 20833 12275 8019 -8452 7622 35559 37412 16543 -16978 -22105 -13827 9794 17135
9630 17135 17632 20522 22696 16402 18701 13267 -630 -17958 -9824 -1681 17884 16029 -3050 -21175
9616 -21175 -20246 -5420 6664 11580 8085 22279 17492 9277 1431 -5220 -8403 -10443 -6702 -17140
9602 -17140 -16028 -19453 -12014 -7878 -7943 -13188 -25298 -3659 21807 14949 10965 5234 7022 20609
9588 20609 27407 36889 25776 488 -3493 -4956 2086 -3636 -10877 -1019 3701 64 9602 12973
9574A2973O763R074N08k4533l678J5932p871k5552K018J0768J5360P717j3928
9561E551j5245n401j8228n038L6032K1802k5792j2090O149J2002J8104N223j1765
9548A1304j5463k209O833N649L581j3m61K0859J8285N2j1038L070K7830r914k9463
9533B8902j6768K514Q832p283L865n738N261N772j579M944L681k6128j5231J921
9519g035p079P144J4404l732P376N343l752p366M149J9735k270r222j7468Q460
9505H687J2052K647P172J0885J4805j7020j7774j442N892Q790L55q077j2882o775
9491G315n02M794J0672J9449J1361n288j5221l352P85M944L253M665P979J1919
9477F2773M180J8431n657J3336j3768j7125k4083l232J9041J1226J4045L119N711
$$ plain form
9574 12973 19736 28810 29318 4785 1107 17039 9168 -16384 -14366 -3598 11762 19479 5551
9561 5551 -9694 -15095 -33323 -38361 -2329 19473 -6319 -18409 -12260 -258 17846 23069 11304
9548 11304 -4159 -6368 465 6114 9695 9682 9221 30080 48365 48417 37379 40449 68279 58365 28902
9533 28902 12134 14648 23480 16197 20062 14324 19585 25357 23778 28722 32403 6275 -8956 -7035
9519 -7035 -14114 -6970 7434 3702 11078 16421 12669 5303 9452 29187 26917 17695 227 8687
9505 8687 20739 23386 30558 41443 56248 39228 21454 20012 25904 34694 35049 26972 14090 7315
9491 7315 6813 11607 22279 41728 53089 47801 32580 29228 30013 34957 38210 42875 50854 62773
9477 62773 66953 85384 79727 93063 79295 62170 38087 34855 53896 65122 79167 82286 87997
9464H7997O645M94j4503N17j3665J1999j2324P457O110o80J5495P899M255J1588
9450A19284J042k2824m165l52M274O639Q991L278L894M99M162j0936n080J1171
9436A19877N620j5669j8813K3838K4178J1720J9803J7718N018R1K119q680R180
9423A96000N031N416J5778K1676m170J2102o678Q577J080J099K2922J9406K1798
9410C20037K1468J8933J2477L1204K0213P643K4251L3533K7398K7677K1978L7290
9398F04102M8055N3808M7093L4253N0454O8826O7817O8607N3144O1109Q4744J07867
9386A349879J03587R7329R5383Q8606J27314J33793J07954J15556J19024J42057
9376B480482J50675J47281J33375J04782J23239Q2929N8974K7516K0549j0751
$$ plain form
9464 87997 94642 95136 80633 81150 67485 79484 67160 74617 80727 80047 95542 103441 107696 119284
9450 119284 120326 97502 93337 92985 97259 103898 112889 116167 120061 120560 124722 113786 108706 119877
9436 119877 125497 109828 91015 114853 139031 150751 170554 188272 193290 193381 195500 186820 196000
9423 196000 201031 206447 222225 243901 239731 251833 245155 253732 254812 255911 278833 298239 320037
9410 320037 341505 360438 372915 404119 424332 431975 456226 489759 517157 544834 566812 604102
9398 604102 652157 705965 753058 787311 837765 906591 974408 1043015 1096159 1157268 1242012 1349879
9386 1349879 1453466 1550795 1646178 1734784 1862098 1995891 2103845 2219401 2338425 2480482
9376 2480482 2631157 2778438 2911813 3016595 3139834 3222763 3281737 3309253 3329802 3319051
9366C319051l8938n6882j00661j30860j14619j38682j52259j41819j35684j44252
9356B164395j18878j10019r8662j25051j08840q5545r3614q3568o4518p5985p4549
9345A125166q6085n3855l5079m7640m7675m2475l8509m3566m3619l2017j5977
9334F38669l8176k3509l5144m1533j2034k0596k5157k7727n781n020j1291q905
9322C83796j5846j1086m960l1380k1874j459j5585j0268k2172j7620N158l219
9310B33485j8467r865K1450J4860L644p511k4027k2108j5256k086j0905k9511
9298A33703k8254J1677K614j5666O243J0916L123o523j5985j8009j6221K1536
9286H9154K4169j8882m104O898M615J1755j0388l476j5898k5570r367R538J6426
$$ plain form
9366 3319051 3280113 3223231 3122570 2991710 2877091 2738409 2586150 2444331 2308647 2164395
9356 2164395 2045517 1935498 1836836 1711785 1602945 1517400 1423786 1340218 1275700 1199715 1125166
9345 1125166 1039081 985226 950147 902507 854832 812357 773848 730282 686663 654646 638669
9334 638669 600493 576984 541840 500307 488273 467677 442520 414793 409012 403992 392701 383796
9322 383796 367950 356864 351904 320524 298650 297191 281606 271338 249166 231546 236704 233485
9310 233485 215018 205153 226603 241463 245107 237596 213569 191461 176205 174119 163214 133703
9298 133703 105449 117126 119740 104074 110317 121233 124356 117833 101848 83839 67618 89154
9286 89154 113323 94441 90337 97235 101850 113605 103217 99741 83843 58273 48906 58444 74870
9273G4870J0516O016k4063J077L746o929l230J7581J1532J0124j7641o295o852
9260G0452n670m223K0298J1895j1044j8443p682O472j5601N268K0647J3985r224
9247G7130J396j3437n00J0221l523j5472k250R058L7422q263m0736j6214J8240
9234E3072j404j1780j056j6442j0240Q078L047J416K0449J452r277N653k60n553
9220C7155r952j5177k8437J1277J7049J4790O709j6251J932J798J067J2178j2006
9207B2132q870Q642O425L4557J3854j8502k1329n096k392p735p027l425M850K2022
9193C8106M831j5726j9863n749J122j2511K596K4892l49R311l002j2594k099Q630
9179A7595j608p745k003M313J159J73l492j442p776K074O380j6091m27J1262N123
$$ plain form
9273 74870 85386 91402 67339 68416 72162 65233 62003 79584 91116 101240 83599 77304 70452
9260 70452 64782 60559 80857 92752 81708 63265 55583 62055 46454 51722 72369 86354 77130
9247 77130 78526 65089 64589 74810 71287 55815 53565 62623 100045 91782 51046 34832 53072
9234 53072 51668 39888 38832 22390 12150 20228 23275 24691 45140 46592 37315 42968 42708 37155
9220 37155 27203 12026 -16411 -5134 11915 26705 33414 17163 19095 20893 21960 34138 22132
9207 22132 13262 21904 28329 62886 76740 58238 36909 31813 29421 21686 14659 11234 16084 38106
9193 38106 42937 27211 7348 1599 2721 -9790 -7194 17698 17349 26660 23658 11064 8965 17595
9179 17595 15987 8242 6239 10552 11711 11884 8392 6950 -826 1248 7628 -8463 -8890 2372 7495
9164G495L525Q277J633p210L583J6083L923j0485k4502n148N611K402R374J1433
9150B5994p352r6J0834L899j9544j5704o327j0460K0622J3900J7594J0491rp424
9136C6418q524m575J7831j2848k0038N3J5966K1987m922l3845k596L656K1745
9123C0308J1139j316N042j8060j0797K594K524J6871J6122J386k1241k3386J3895
9110B5081r1j4428J341l874Q47K7133k724j1401q70l211R654p749j1951k082k978
9095B697j3398J3834J4233k0309j2247K093j2244M300K2390J8913j285J248N83
9082B0808m658o600p687M331L263L854j8164k3780m879Q921J1614o134J2172K9647
9068B2708J1301N85P748r539J936J1587j8858k6226j782j4524R378R655j1354
$$ plain form
9164 7495 11020 19297 20930 13720 17303 33386 37309 26824 2322 -2826 2785 5187 14561 25994
9150 25994 18642 18546 29380 33279 13735 -1969 -8296 -18756 1866 15766 33360 43851 43842 36418
9136 36418 27894 23319 41150 28302 8264 8317 24283 46270 41348 7503 4907 8563 30308
9123 30308 41447 40131 45173 27113 16316 18910 21434 38305 54427 55813 34572 11186 25081
9110 25081 24990 10562 11903 8029 8876 36009 33285 21884 21014 17803 27457 19708 7757 5675 2697
9095 2697 -10701 3133 17366 -2943 -15190 -13097 -25341 -21041 1349 20262 18977 20225 20808
9082 20808 16150 9550 1863 6194 9457 13311 -4853 -28633 -33512 -24591 -12977 -19111 -6939 22708
9068 22708 34009 34594 42342 32803 34739 46326 27468 1242 -540 -15064 -5686 3969 -7385
9055g385R176K0608K0492K44j8933m587J3027P559M603j6725O634N440k1235l8417
9041a9499r589J9529o331m664o278l17J2426K3181L944k210j373k590q832O48
9027a955K030j2495p941M065j302Q194J2517J2778j395o46j8737M342L3157m512
9013B8100l3798J51Q649p214j2062O289P247N048O251j1654O65j4884j6027L7511
8999D272J3880k811o223j5958J772l820J0008q747j2955j3339j048L200J6047
8986a5722J9187l795l651n882j0311J5991J2677r478N577J1085R795o72j8661
8973F140q283O404j1658N823k696p07K0985p857O660j883j868L717P437P0J0797
8958C3081P473p473m213n947R386J0777j5539j8702J2917j2460j809J4420L03
$$ plain form
9055 -7385 1791 22399 42891 43135 24202 19615 32642 40201 44804 28079 34713 40153 18918 -19499
9041 -19499 -29088 -9559 -15890 -20554 -26832 -27149 -14723 8458 12402 10192 8819 6229 -2603 -1955
9027 -1955 75 -12420 -20361 -16296 -17598 -9404 3113 15891 14496 13850 -4887 -545 32612 28100
9013 28100 -5698 -5547 3102 -4112 -16174 -9885 -2638 2410 8661 -2993 -2328 -17212 -33239 4272
8999 4272 18152 15341 9118 -6840 -5068 -8888 1120 -7627 -20582 -33921 -34969 -31769 -15722
8986 -15722 3465 -330 -3981 -9863 -20174 -4183 8494 -984 4593 15678 25473 24801 6140
8973 6140 -2143 4261 -7397 -1574 -4270 -4977 16008 8151 14811 12928 11060 14777 22214 22284 33081
8958 33081 40554 33081 28868 22921 32307 43084 27545 8843 21760 9300 7491 21911 22214
8945B2214J3215J4300j3670j1768L850N218o600j7129j1074K894m667P321J4928
8932A9032K5556M916J5709K6812j1342k3350K618l1815j9072j0492o585R674K744
8919D405k919L56P663l929J3291J9929J0712j2375r552j1714k0755k006K8826
8906B1932N643k3351l443j0054j5407l005J0032R970M850N290k7326j0097K1881
8893a3085J7972M284L619k617L49L12m501n687j4585O057k043J2843Q79k969L714
8878D542N607l149J3422J0312j7530k8777k079J2317J3828Q424P676J2050K99
8865C6942j3188R976o862j3368J7532M921m051k479l1342k186J6570PN092K089
8851A9653J2036K582R236j1361j682L585m900k725L971n889O945N283j6798J3126
$$ plain form
8945 22214 35429 49729 36059 24291 28141 33359 26759 9630 -1444 1450 -3217 4104 19032
8932 19032 44588 49504 65213 92025 80683 57333 59951 28136 9064 -1428 -8013 1661 4405
8919 4405 1486 1842 9505 5576 18867 38796 49508 37133 27581 15867 -4888 -6894 21932
8906 21932 27575 4224 781 -9273 -24680 -27685 -17653 -7683 -2833 2457 -24869 -34966 -13085
8893 -13085 4887 9171 12790 10173 10522 10834 6333 646 -13939 -7882 -9925 2918 3797 828 4542
8878 4542 10149 7000 20422 30734 13204 -15573 -17652 -5335 8493 16917 24593 36643 36942
8865 36942 23754 33730 26868 13500 31032 35953 31902 29423 -1919 -4105 12465 12472 17564 19653
8851 19653 31689 34271 43507 32146 30464 34049 29149 26424 30395 24506 31451 36734 19936 33062
8837C3062L1681j5249j2620j0499p222N568j5073j6247J8103M2753j410j2674
8825D0173j1392R17J3481l870j4087R91J0340K703J9307J7077j4654j0741j3894
8812C6351o666n238j4042R41r62R693J5694Q073m766j7581m34q433N656j0513
8798G773j5220J2259J1234O156k1423j605L184O703J3903N923j508q581J260M282
8784B4340n519q132M031l1195n837K6522o23O815J341m797K3526L3930O790P3
8770G1265j9349j1269J4142j5150j0426r272L518m363j8338j5k125R468J1175
8757A9261m737l879l44M538J903N104K390k4932o665O854J214l552j1492q14K4633
8742I482J1090j0689n442r361p156o058p285l956J9389N154r846j3680J2268L5082
$$ plain form
8837 33062 64743 49494 36874 26375 19153 24721 9648 -6599 11504 54257 52847 40173
8825 40173 28781 29698 43179 39309 25222 26213 36553 39256 58563 75640 60986 50245 36351
8812 36351 29685 24447 10405 11346 10384 20077 35771 43844 39078 21497 21063 12630 18286 7773
8798 7773 -7447 4812 16046 22202 779 -826 2358 9061 22964 28887 27379 18798 20058 24340
8784 24340 18821 10689 14720 -16475 -22312 4210 3587 10402 11743 6946 30472 64402 71192 71265
8770 71265 51916 40647 54789 39639 29213 19941 23459 19096 758 743 -1382 8086 19261
8757 19261 14524 10645 10301 14839 16742 21846 24236 -696 -7361 -507 707 -2845 -14337 -15151 9482
8742 9482 20572 9883 4441 -4920 -12076 -18134 -25419 -29375 -9986 -4832 -14678 -28358 -16090 18992
8728A8992J2388J2668k1067k1912P914Q335o681r396k2481j5672J2526K2752J0158
8715H524k849j8580l734J8481L738Q791L05k274j2075J8655q368j6811q066J1818
8701b445K1279n865j1837o653n659J8976R506N348j1629Q000m83m606J67r027
8687E072P47J0560M462L774J6024L2592j4595k3412p300k3283j0094J682J2159
8674H388q842j7018l78K1012K0565J0389j5695q321M429J3463O236o193M071o326
8660B5780l197j2381R151P027O68J2620k0373j2773m569p852R382K8216J7119
8647D8818m512q574L134m735J3315J4927o830k4269k009Q473k195j6995l474K0428
8633C5502J0794R198J0907j2650n079K2649l315o587j8646n873m970O298M036
$$ plain form
8728 18992 31380 44048 22981 1069 8983 17318 10637 1241 -21240 -36912 -24386 -1634 8524
8715 8524 5675 -12905 -16639 1842 5580 14371 14676 12402 327 18982 10614 -6197 -14263 -2445
8701 -2445 18834 12969 1132 -5521 -11180 7796 17302 22650 11021 19021 18538 13932 14099 5072
8687 5072 5819 16379 20841 24615 40639 73231 58636 35224 27924 4641 -5453 -3771 8388
8674 8388 -454 -17472 -17850 3162 23727 34116 18421 10100 14529 27992 34228 28035 32106 25780
8660 25780 22583 10202 19353 26380 27048 39668 19295 6522 1953 -5899 3483 31699 48818
8647 48818 44306 35732 38866 34131 47446 62373 55543 31274 29265 37738 35543 18548 15074 35502
8633 35502 46296 55494 66401 53751 48672 71321 68006 61419 42773 36900 31930 38228 42264
8620D2264j303K1295K4896J1931K6197L4150R856N722R964J9552j6003l6169k9086
8607A23266l2510j8605j0495R841J7823J3083j5014K5432K1297M961J0836q279
8595A41636j1711k0848j9121j0444r160N538J132N0j1444o403o661j9299j8270
8582A4995Q424n269l665J0065K4422J953p407m027R955J5299j588M442l570j5625
8568D8404O043l348L677k646j839M966l351J8264J275N305J2617P015K8186J9474
8554A44042K6867L8651J1790j0987K52l5809o4780k0992O822k9959j8826K355
8542D9426L195J142K873K787L296j4898k1883R123K2759N691l854r155j012R958
8528E9448m226p345J0627p722L002o59k2833R269J362p035M752M833M244r757
$$ plain form
8620 42264 40961 62256 87152 99083 125280 159430 169286 175008 184972 204524 188521 152352 123266
8607 123266 90756 72151 61656 71497 89320 102403 87389 112821 134118 139079 149915 141636
8595 141636 129925 109077 89956 79512 70352 75890 77022 77072 65628 59225 52564 33265 14995
8582 14995 23419 18150 14485 24550 48972 50925 43518 39491 49446 64745 63157 67599 64029 48404
8568 48404 54447 51099 54776 52130 50291 55257 51906 70170 71445 76750 89367 96382 124568 144042
8554 144042 170909 209560 221350 210363 210615 174806 110026 89034 95856 65897 47071 49426
8542 49426 52621 53763 56636 59423 62719 47821 25938 35061 57820 63511 59657 50502 49490 59448
8528 59448 55222 47877 58504 50782 53784 53125 30292 39561 40923 33888 38640 43473 47717 37960
8514C7960k073J4248J9266N674K242p401J2699P525J3873r971k7217K607J3528
8501H2960O876p634k4957Q475j0405j1265J2805J5298j3200j4256p718k2032q065
8488F882j2113l150J6598K1014l584j0268P701J5347m26j078j4770J4138p789
8475B8502j3335n318J5398J2309j7913O56K0553N028j3893m875J021m377K004
8462B5760j5400J833J9861R705k7967k3686j6167R547K382O284J5828R297j5421
8449A856k4871p725J0874J1653J4252K5977j7752k8801J9842K9547Q110q360j2541
8436B2061j3769m666j443j8961k4415J7041J7995k250p567j4388l187R514J3065
8423a0970J0285K0895O637n889j1746m310k163J2241J6371j2202j1531R435N135
$$ plain form
8514 37960 35887 50135 69401 75075 77317 69916 82615 90140 104013 94042 66825 69432 82960
8501 82960 89836 82202 57245 65720 55315 44050 56855 72153 58953 44697 36979 14947 6882
8488 6882 -5231 -8381 8217 29231 25647 15379 23080 38427 38001 36923 22153 36291 28502
8475 28502 15167 9849 25247 37556 19643 20299 40852 45880 31987 27112 28133 23756 25760
8462 25760 10360 12193 32054 41759 13792 -9894 -26061 -16514 -14132 -7848 7980 17277 1856
8449 1856 -23015 -30740 -19866 -8213 6039 32016 14264 -14537 5305 34852 42962 34602 22061
8436 22061 8292 3626 2183 -16778 -41193 -24152 -6157 -8407 -15974 -30362 -33549 -24035 -10970
8423 -10970 -685 20210 26847 20958 9212 4902 2739 14980 31351 19149 7618 17053 22188
8410B2188o605l369j0613o459j2099R734J7330J7190j9377k2362k059O891K7683
8397A8073j1119l0985q646R795J5762K9840j11j9840j2811O085K6981K794m210
8384B1608M471O490j2105j9449j1181K306J4177K795M615l165p220J4000J518
8371A8860j5032p678K443l237N245L327p433j981L077p428m388j4395p960J2265
8357b4315l990L062m465j780J7460O511j3664j1674K033R722J9932R65m790K34
8343d759J0564Q081l469q821P833q869P264O580j7493j6274P853O390j9406J0814
8329a3712P291l181J989k076K0641m532k5158L985P830J8273K178o264k1403j1074
8315b5213k4668j0202L0224K5307L435R368J2100R696j6094j2681J3268K354p392
$$ plain form
8410 22188 15583 12214 1601 -4858 -16957 -7223 10107 27297 7920 -14442 -16501 -9610 18073
8397 18073 6954 -24031 -32677 -22882 -7120 22720 22609 2769 -10042 -3957 23024 25818 21608
8384 21608 26079 32569 20464 1015 -10166 -7860 6317 9112 13727 10562 3342 17342 18860
8371 18860 3828 -3850 -1407 -4644 601 3928 -3505 -5486 -2409 -9837 -14225 -28620 -36580 -24315
8357 -24315 -28305 -25243 -29708 -31488 -14028 -7517 -21181 -32855 -30822 -21100 -1168 -203 -4993 -4759
8343 -4759 5805 13886 10417 1596 9429 560 7824 14404 -3089 -19363 -11510 -5120 -24526 -13712
8329 -13712 -6421 -9602 -7613 -9689 10952 6420 -18738 -14753 -6923 11350 13528 7264 -14139 -25213
8315 -25213 -49881 -60083 -29859 -4552 -1117 8251 20351 30047 13953 1272 14540 16894 9502
8302I502p322J2765n47j2317j5559J0766j4832k4466J3935K4838J5141k851M908
8289A3961K383K206k4956J7417J0027j5610m062j087j5693p475J4293J6281j5888
8276h203J2858m732J957J3884P239j7476k0792j500k720J0143l624O904P866l402
8262a598N138L099P609L336j7801o719J5971J2566j9770o578R091o937m247k277
8248i117J6196J1483O453J9239J297k3943j942j5962M651L037J352K547m17j5051
8234a77r749m019Q248K3863k9p885J0473J6615j5441P35J653o179n094L13m562
8219H765j7852o516O821m902l241Q489P752J779P594j3163q130P718j2462J696
8205a5652P758o903m070R214L596r166j0517Q538J1389J838k3789j4251L489K2103
$$ plain form
8302 9502 2180 14945 14398 2081 -13478 -2712 -17544 -42010 -28075 -3237 11904 9053 13961
8289 13961 16344 18550 -6406 11011 21038 5428 1366 279 -15414 -22889 -8596 7685 -8203
8276 -8203 4655 -77 1880 15764 23003 5527 -15265 -16765 -19485 -9342 -12966 -6062 1804 -1598
8262 -1598 3540 6639 14248 17584 -217 -6936 9035 21601 1831 -4747 4344 -2593 -6840 -9117
8248 -9117 7079 18562 25015 44254 45551 21608 19666 3704 8355 11392 12744 15291 14874 -177
8234 -177 -9926 -13945 -5697 18166 18137 10252 20725 37340 21899 22634 24287 18108 13014 13327 8765
8219 8765 -9087 -15603 -8782 -13684 -16925 -8436 -684 1095 8689 -4474 -12604 -4886 -17348 -15652
8205 -15652 -7894 -14797 -18867 -9653 -6057 -15223 -25740 -17202 -5813 -3975 -27764 -42015 -38526 -16423
8191a6423J8235P645L718J2611j5308k1983J3370K5845p186N241P46L532j4128
8178A5915k81J7323o020q804j2800n652R504J624N181J2256M698p746j1386m993
8164H819n438J8104j424j7108J1744M672j3548q79M229J1135j1840j4779P24K3027
8150A7438J3615k988k1053j4621r777j6469N677M0358K9692r171r468j0864k936
8137I433p748M388j0840p994o985K581l7J3253Q721j1333j7167j5263J3544K0333
8123e114m997O931Q899j760j0239m917p253O413L597o345O869M635O18K69n188
8108g582J94k7272j4255N476j0468K9748J2319K1898O111L086p380k780o730P968
8094A0333J0211o818j1355K246j1418o158J448J3800j1146q688M839K1997j764
$$ plain form
8191 -16423 1812 9457 13175 25786 10478 -11505 1865 27710 20524 25765 26511 30043 15915
8178 15915 15634 32957 26937 18133 5333 -319 9185 10809 15990 28246 32944 25198 13812 8819
8164 8819 3381 21485 20061 2953 14697 19369 5821 4942 9171 20306 8466 -6313 -5589 17438
8150 17438 31053 28065 7012 -7609 -17386 -33855 -28178 12180 41872 32701 23233 12369 9433
8137 9433 1685 6073 -4767 -12761 -19746 -17165 -17202 -3949 4772 -6561 -23728 -38991 -25447 -5114
8123 -5114 -10111 -3180 5719 3959 -6280 -11197 -18450 -12037 -8440 -14785 -7916 -3281 -2663 -2394 -7582
8108 -7582 -7388 -34660 -48915 -43439 -53907 -24159 -11840 10058 16169 19255 11875 9095 2365 10333
8094 10333 20544 13726 2371 4617 -6801 -12959 -11511 2289 -8857 -17545 -12706 9291 7527
8081G527j6086J367J8807K356R622N993j4162o475p069r367P472J0568j8959L537
8067d869J8812L914k203k13r686J810K325p903J1226j0709j6437j6570O703N502
8053a8298J0032J4759J5428J5780R41k5332j5536J5912n984o246k512J4881J5743
8040B9568r581j1950J7055J3721j1349j6899q738P492l753P942N724j6395L708
8027F545J6963J852N987l779j7941j5826r058J7264P921j057J3889J2545j8222
8014A7083j0818q6O629N790J803L413Q20q268L307j4981r691O692J5003Q522j5357
7999I861j1244Q636J3035J023J5392j431k508k1413k1759j7417L377M787N620
7986a4041M544O874Q470Q234N970J6499J011o289j4472m627n037j8106j714N374
$$ plain form
8081 7527 -8559 -7192 11615 13971 23593 29586 15424 8949 1880 -7487 -15 10553 -8406 -4869
8067 -4869 13943 17857 15654 15441 5755 7565 9890 1987 13213 2504 -13933 -30503 -23800 -18298
8053 -18298 -8266 6493 21921 37701 38642 13310 -2226 13686 7702 1456 -1056 13825 29568
8040 29568 19987 8037 25092 38813 27464 10565 1827 9319 5566 13508 19232 2837 6545
8027 6545 23508 25360 31347 27568 9627 -6199 -15257 2007 9928 8871 22760 35305 17083
8014 17083 6265 6179 12808 18598 20401 23814 24634 16366 19673 4692 -4999 1693 16696 25218 9861
7999 9861 -1383 7253 20288 21311 36703 35272 32764 11351 -10408 -27825 -24448 -19661 -14041
7986 -14041 -9497 -2623 5847 14081 20051 36550 37561 31272 16800 12173 7136 -10970 -12684 -7310
7972g310O377M513R821l876l806J8045P417o663j792k1658k2441k806M543P960
7958a1676L376J1127L124r196j448q356M087j090j1429n428J740O75N787K6038
7944G331K0730K732j2818Q344j0734j6433p956N269j172J4592N625R412J2064
7931C6986J363Q830p297L289K444Q486p523j2167Q143K62P36p107j8019M356J5594
7916C8376K0089P395k7833k2061j7956l121J0106m483q18l339o716J9347P98j0501
7902g17J8004J136q228j2134k611m622p743M516Q500J1367j150O111j555p910
7888B964J7912N142l4966p509J6328M477r198m822j1078R00M159K6819P578j5276
7874C430l173k974j4439j8072L631P336J180J7501J7631j744p986q729j202J1364
$$ plain form
7972 -7310 -933 3580 13401 9525 5719 23764 31181 24518 22726 1068 -21373 -24179 -19636 -11676
7958 -11676 -8300 2827 5951 -3245 -4693 -13049 -8962 -10052 -21481 -26909 -25169 -24494 -18707 7331
7944 7331 28061 30793 17975 26319 15585 -848 -8804 -3535 -4707 9885 15510 24922 36986
7931 36986 38349 47179 39882 43171 45615 54101 46578 34411 42554 42816 43552 36445 18426 22782 38376
7916 38376 58465 65860 38027 15966 -1990 -5111 4995 512 -306 -3645 -10361 8986 9784 -717
7902 -717 17287 18423 10195 -1939 -4550 -9172 -16915 -12399 -3899 7468 6318 12429 10874 2964
7888 2964 20876 26018 -8948 -16457 -129 4348 -4850 -9672 -20750 -19850 -15691 11128 18706 3430
7874 3430 257 -2717 -17156 -35228 -31597 -24261 -23081 -5580 12051 10307 2321 -6408 -7610 3754
7860C754R0o170j9161J3703K4895J7383j5297k3491p360l752K789r270l992m017
7846b9896R386N306L4510J3920m964o935k5440l630j7963K336K5606N853p660
7833D29q961j1747j1189p856P986R852l066q079K8922K7082j7658o571j9090N378
7819a4568Q990K822j590N997K2704M09j6112j1840m129q86J1340M819N137k530
7805A0563J742j845j8335J1380J0147l49j0111J2316K890j8612j9374K377P684
7792i527M045J5980K1747K1888j3496n8O04n636q288j6840O091L197l858j8165
7778b316Q642K1770J2209j9497j7952n739N98M246J0294L763p6L516j261N119
7764B3316J332J0061N206j1982j9349j7674j944J2873R443o298k5959k9998Q825
$$ plain form
7860 3754 3844 -2326 -21487 -7784 17111 34494 19197 -4294 -11654 -15406 -12617 -21887 -25879 -29896
7846 -29896 -20510 -15204 19306 33226 28262 21327 -4113 -7743 -25706 -23370 2236 8089 429
7833 429 -8532 -20279 -31468 -39324 -31338 -21486 -24552 -32631 -3709 23373 5715 -856 -19946 -14568
7819 -14568 -5578 -2756 -4346 1651 24355 24764 8652 -3188 -7317 -8203 3137 7956 13093 10563
7805 10563 12305 10460 -7875 3505 13652 13303 3192 15508 18398 -214 -19588 -17211 -9527
7792 -9527 -5482 10498 32245 54133 40637 40579 41183 35547 27259 10419 16510 19707 15849 -2316
7778 -2316 6326 28096 40305 20808 2856 -2883 -2285 1961 12255 16018 15942 19458 18197 23316
7764 23316 24648 34709 39915 27933 8584 -9090 -11034 1839 11282 4984 -20975 -50973 -42148
7751d2148K840n652J2368J6595P087r705m854k827L714J4555k401n739p958L73
7737b3752J6639r618j7261K6689M51j571l214r657L193m23j489o986k0642J0959
7723c6682K7635K429j0337m436N843J7506Q684j4490o184J947N635R320l753k0168
7709a7051M928J7596o760m135j5994J390J431n939O112J3463P577K018O868j4088
7695b584R264N632j3261o164J4991M700k2585j8916Q271P099j888K1963J0710
7682A7232p21M891n237P988j2239j3162j3269J4222j2756j9467l30M04K0646K860
7668h938M726n316o216l390Q194J6557K275k2303p772K825m644K587J64q65J0284
7653a1832J6595O161j3704j6285j0843j240J0675J7855M255J718K2r737J715K1854
$$ plain form
7751 -42148 -39308 -44960 -32592 -15997 -8910 -18615 -23469 -26296 -22582 -8027 -10428 -16167 -24125 -23752
7737 -23752 -7113 -16731 -33992 -7303 -6852 -8423 -11637 -21294 -18101 -18524 -20013 -26999 -47641 -36682
7723 -36682 -9047 -6618 -16955 -21391 -15548 1958 10642 -3848 -10032 -8085 -2450 6870 3117 -17051
7709 -17051 -12123 5473 -1287 -5422 -21416 -20026 -18595 -24534 -18422 -4959 2618 4636 11504 -2584
7695 -2584 6680 12312 -949 -7113 7878 12578 -10007 -28923 -20652 -13553 -15441 6522 17232
7682 17232 16511 21402 16165 24153 11914 -1248 -14517 -295 -13051 -32518 -32848 -32444 -11798 -8938
7668 -8938 -4212 -9528 -15744 -19134 -10940 5617 7892 -14411 -22183 -19358 -24002 -21415 -21251 -22116 -11832
7653 -11832 4763 10924 -2780 -19065 -29908 -31148 -20473 -2618 1637 3355 3377 -6360 -4645 17209
7639A7209Q207j5543n198P348J359j5930k482j200J6286o30j5530l142m107j2417
7625b5770J2509J4841j794j279K456o225j516J3442j0698k798K689M08R622L843
7611I730M28j9648j0575j738K7684J2271n567K662J6551K147k094p277k0011l870
7597F93j1334n746m614M395n54J5359N171N702J2973o570k569k1034K1857Q846
7583B2575k7672k803j8555R046J9769M881j7443k1277P218N939O376p04r63K389
7569a1224p311L193J321l481j7523o829J3207R504m568J4666Q982L540L0120K854
7555C6451j2939m977M123J4094j3370k3989j4887j4790q923j4295j0309K2937
7543d0874J4155J4153k2242k1698n481J2408J6395K4683J2561q754q651m109J3750
$$ plain form
7639 17209 25416 9873 4675 12023 13382 -2548 -5030 -6230 10056 9426 -6104 -9246 -13353 -25770
7625 -25770 -13261 1580 -214 -1493 963 -5262 -6778 6664 -4034 -6832 -4143 -3735 5887 9730
7611 9730 10158 -9490 -20065 -21803 5881 18152 12585 15247 31798 33945 31851 24574 4563 693
7597 693 -10641 -16387 -21001 -16606 -17160 -1801 3370 9072 22045 15475 12906 -8128 13729 22575
7583 22575 -5097 -7900 -26455 -17409 2360 7241 -10202 -31479 -24261 -18322 -11946 -12650 -13613 -11224
7569 -11224 -18535 -15342 -14021 -17502 -35025 -41854 -28647 -19143 -23711 -9045 -63 3477 33597 36451
7555 36451 23512 18535 22658 36752 23382 -607 -15494 -30284 -39207 -53502 -63811 -40874
7543 -40874 -26719 -12566 -34808 -56506 -61987 -49579 -33184 -8501 4060 -4694 -13345 -17454 -3704
7530c704J6979j807q34m989p854l765J2756R415m214K650k016q106l114j8686
7516a7289j4356N941K3246L286j9584J572p18P782M413j1409l410l933K0230J1863
7502G634l687l338M049n220j6519o634O003R873J195K798J6944k5764n705J5483
7488b888p498R502J300r219n386J5620R052K529n04J458k459P868p608j6389p416
7473a2038m860K452J4378j120n718Q910l275J338o882j117R602p662j3352P263
7459a2081J3831p62P12j2265j623r05p057J4165P137q385K781N276J927m708j994
7444c951Q648L492J1903L918j741J2970k5024j4948J4369n313j4962O99Q549L084
7430A693Q691L107L861j2255j8601o739L79K3874J19q562p923J82O426J3010J7463
$$ plain form
7530 -3704 13275 11468 10634 5645 -2209 -5974 6782 16197 11983 14633 12617 4511 1397 -17289
7516 -17289 -31645 -25704 -2458 828 -18756 -17184 -17902 -10120 -5707 -17116 -20526 -24459 -4229 7634
7502 7634 3947 609 4658 -562 -17081 -23715 -17712 -7839 -6644 -3846 13098 -12666 -18371 -2888
7488 -2888 -10386 -884 416 -8803 -14189 1431 10483 13012 12508 13966 11507 19375 11767 -4622 -12038
7473 -12038 -16898 -14446 -68 -1188 -6906 2004 -1271 67 -6815 -7932 1670 -5992 -19344 -12081
7459 -12081 1750 988 1700 -10565 -12188 -13093 -20150 -5985 1152 -7233 -4452 824 2751 -1957 -3951
7444 -3951 4697 8189 20092 24010 22269 35239 10215 -4733 9636 4323 -10639 -9940 -1391 1693
7430 1693 10384 13491 17352 5097 -13504 -20243 -19864 4010 4129 -4433 -12356 -12174 -5748 7262 24725
7415B4725O361k8514j5762j3299q365K7400L687j8492j604j905O161O245Q077
7402e285k3288j6534O304R146J419q802J0813J4198k3049p726J7118J7870J189
7389f627k589J7749r639j9424j6890j002Q381L935P917J0522K863l577j4445k133
7375b4959l457J4433J0479P47J850j0244o413J4557m963L868m208Q551o609O251
7361a17j1873k6011L138N110k660P906J3781R485J4702J4389n756M199J586j6069
7347A1810k0660r827k1297K510K2267N214O901j3506j4968J3284m26j098l50j0207
7333c0353M455J0229N932R164K6588j0301j4172J0665P073K617l921j3231j8289
7320a3544Q900K496K1946Q344j5822n095O395Lp070n005L815J320P595n423q557
$$ plain form
7415 24725 31086 2572 -13190 -26489 -34854 -7454 -3767 -22259 -23863 -25768 -19607 -13362 -5285
7402 -5285 -28573 -45107 -38803 -29657 -28238 -37040 -26227 -12029 -35078 -42804 -25686 -7816 -6627
7389 -6627 -9216 8533 -1106 -20530 -37420 -38422 -30041 -26106 -18189 -7667 -4804 -8381 -22826 -24959
7375 -24959 -28416 -13983 -3504 -2757 -907 -11151 -17564 -3007 -7970 -4102 -8310 241 -6368 -117
7361 -117 -11990 -38001 -34863 -29753 -32413 -24507 -10726 -1241 13461 27850 22094 26293 27879 11810
7347 11810 -8850 -18677 -39974 -37464 -15197 -9983 -3082 -16588 -31556 -18272 -18698 -19796 -20146 -30353
7333 -30353 -25898 -15669 -9737 -573 26015 15714 1542 12207 19280 21897 17976 4745 -13544
7320 -13544 -4644 -2148 19798 28142 12320 7225 13620 13623 6553 1548 5363 6683 14278 8855 298
7305B98J1537N369m889Q112j2824o093j5573p639j4229L098J6874J585l327n647
7291b3348Q447o032J2322l962r190M524J017O502P150R007k878N152j5601j2272
7277a9162J5254J0506m586j2094J6611J2626k655j779j1656J212R888n278J0603
7264A9490J1579j3727k0295r134r500O917J0761J3223k232k0291j2658J2923Q166
7251d778K4166Q193j7560J211Q278o589J315Q87j0583j491M861j9951k0370K147
7237c0264N898J2280K7323j254q082O385j0737j8689j2082J4443J9653j642j055
7224B177o650p822j4502J0169O544N514J879m557j1874q953m170J2652J3092J6142
7210I641r895k856m930J520P896R058O831m066j5334j8301k638J2968J0126J5133
$$ plain form
7305 298 11835 17204 12315 20427 7603 1510 -14063 -21702 -35931 -32833 -15959 -14374 -17701 -23348
7291 -23348 -14901 -20933 -8611 -12573 -21763 -17239 -16222 -9720 -2570 6437 3559 8711 -6890 -19162
7277 -19162 -3908 6598 2012 -10082 6529 19155 16500 14721 3065 4277 14165 8887 19490
7264 19490 31069 17342 -2953 -12087 -21587 -14670 -3909 9314 7082 -13209 -25867 -12944 -4778
7251 -4778 19388 27581 10021 11232 19510 12921 14236 15123 4540 3049 7910 -12041 -32411 -30264
7237 -30264 -24366 -12086 15237 13983 5901 12286 1549 -17140 -29222 -14779 4874 3232 2177
7224 2177 -4473 -12295 -26797 -16628 -10084 -4570 -2691 -7248 -19122 -28075 -32245 -19593 -6501 9641
7210 9641 -254 -3110 -8040 -6520 1376 10434 17265 13199 -2135 -20436 -23074 -10106 20 15153
7196A5153j0243j2715j2191J521K3400O351R480J0299J631P227K3970k1655k8011
7183A4217m209k8046k4774k401J5956r42n323j2665J7849K0600J7841J2265P337
7170B7705N593j3458p351r014o331j5187n60J1181J5436J0347O005m048K572j7305
7156E585p935Q89j971J7783n36j6948R103j4928j4635q520J338P148J2955J6969
7142F297P03M998j0477N84k0945k3789M735K8682P318l4019o145q309O130K9044
7128a5193K4069R626j2737k2557N953p472j2403n444J4868n181L56k785j1690
7115d0590k004L20K165r281Q82M982Q656K652O481J4937J0118m888p002J2854
7101B82m115L293n433k0211P091N793M17j421q301M959L3323J5553q798j7062
$$ plain form
7196 15153 4910 -7805 -19996 -18475 4925 11276 20756 31055 32686 39913 63883 42228 14217
7183 14217 10008 -18038 -42812 -45213 -29257 -30199 -35522 -48187 -30338 -9738 8103 20368 27705
7170 27705 33298 19840 12489 3475 -2856 -18043 -18603 -7422 8014 18361 24366 20318 22890 5585
7156 5585 -2350 -1461 -3432 14351 13815 -3133 5970 -8958 -23593 -32113 -30775 -23627 -10672 6297
7142 6297 7000 11998 1521 2105 -18840 -42629 -37894 -9212 -1894 -35913 -42058 -50367 -44237 -15193
7128 -15193 8876 18502 5765 -16792 -10839 -18311 -30714 -36158 -21290 -26471 -26115 -28900 -40590
7115 -40590 -42594 -42274 -40109 -49390 -48508 -43526 -34870 -32218 -25737 -10800 -682 -5570 -12572 282
7101 282 -3833 -540 -5973 -26184 -19093 -13300 -12883 -14304 -22605 -17646 15677 31230 22432 5370
7087E370j5182j628K0467J8930J4089j3198j8716j4945j2548j9668M756J1731
7075b0542K4244R079K1206L1074l226k4070m4969j183N994P370K1816p003N245
7062B5035J2338p718j6252r792k8765j0436M043J754K1619J1206j0034j3967m258
7049b5227K9998R499o233r023j1893J86K9417O353q283j4398O400J2231R202j0871
7035A7358O32N722k7322l7634q924L899J8046p371R512j4279j3567J1724J1430
7022c0774Q795L756O271J1439m090r9j1641N82N40N046K671L957p577J1024o28
7007g28M358O70N214M336j6448k0219j0738J3526p873j8389J2981J4844O398N090
6993f978K916J7047n203J8163k9313m3863J1586L268n164K3031L58j7574Q221
$$ plain form
7087 5370 -9812 -11440 9027 27957 42046 28848 10132 -4813 -17361 -37029 -32273 -20542
7075 -20542 3702 12781 33987 65061 61835 37765 -7204 -8387 -2393 4977 26793 19790 25035
7062 25035 37373 29655 13403 3611 -25154 -35590 -31547 -29793 -8174 3032 -7002 -20969 -25227
7049 -25227 4771 14270 8037 -986 -12879 -12693 16724 23077 14794 396 6796 19027 28229 17358
7035 17358 17990 23712 -3610 -41244 -50168 -46269 -28223 -35594 -26082 -40361 -53928 -42204 -30774
7022 -30774 -21979 -18223 -11952 -513 -4603 -4702 -16343 -15761 -15221 -10175 -7504 -3547 -11124 -100 -728
7007 -728 3630 4300 9514 13850 -2598 -22817 -33555 -20029 -27902 -46291 -33310 -18466 -12068 -6978
6993 -6978 -4062 12985 7782 25945 -3368 -47231 -35645 -32377 -37541 -14510 -14152 -31726 -23505
6980b3505L746J8857M523q475k793p319N242J933M073J1910j2717m936l96k3637
6966c3494J513J1361K938R085P025P920l011j0517k776m029N69L167R694J038
6952D83j1273J496J3257J056o96p783L763j957q669O589Q960K486k2022p036J8230
6937c116J9144J437j4373j1598N921q15j0743J0078K1010p933j4259j0816L941
6924a2122R528p593j0130j2214n396K0189J8199k003N82q042R659j553J471k1506
$$ plain form
6980 -23505 -19759 -902 3621 -4854 -7647 -14966 -9724 -7791 -3718 8192 -4525 -9461 -9857 -33494
6966 -33494 -31981 -20620 -17682 -8597 -1572 6348 3337 -7180 -9956 -13985 -13416 -10249 -555 483
6952 483 -10790 -9294 3963 5019 4323 -3460 303 -1654 -10323 -3734 5226 7712 -14310 -21346 -3116
6937 -3116 16028 17465 3092 -8506 -2585 -3400 -14143 -4065 16945 9012 -5247 -16063 -12122
6924 -12122 -2594 -10187 -20317 -32531 -37927 -17738 461 -1542 -960 -9002 657 -896 575 -20931
$$ [...]
##END NTUPLES=NMR SPECTRUM
##END=
