##TITLE=Analysis number 328353
Compound Code cc 62601
Book Reference 494/170
Project Code adrs
Chemist Name craigr
##JCAMPDX= 6.0         $$ Bruker NMR JCAMP-DX V2.0
##DATA TYPE= NMR SPECTRUM
##DATA CLASS= NTUPLES
##ORIGIN= Bruker BioSpin GmbH
##OWNER= nmr
$$ XWIN-NMR		Version 3.5
$$ Tue May 29 13:15:35 2007 GMT Daylight Time (UT+1h)  MAYBRIDGE\nmr@NMR_250MHZ
##.OBSERVE FREQUENCY= 250.131544655141
##.OBSERVE NUCLEUS= ^1H
##.ACQUISITION MODE= SIMULTANEOUS (DQD)
##.ACQUISITION SCHEME= undefined
##.AVERAGES= 16
##.DIGITISER RES= 18
##SPECTROMETER/DATA SYSTEM= dpx250
##.PULSE SEQUENCE= zg30
##.SOLVENT NAME= DMSO
##.SHIFT REFERENCE= (INTERNAL, DMSO, 0, 16.522)
##AUDIT TRAIL= $$ (NUMBER, WHEN, WHO, WHERE, WHAT)
$$ ##TITLE= Audit trail, XWIN-NMR		Version 3.5
$$ ##JCAMPDX= 5.01
$$ ##ORIGIN= Bruker BioSpin GmbH
$$ ##OWNER= nmr
$$ C:\u/data/dgb/nmr/ADRS/1650/pdata/1/auditp.txt
$$ ##AUDIT TRAIL=  $$ (NUMBER, WHEN, WHO, WHERE, WHAT)
(   1,<2007-05-29 13:15:04.57 +100>,<MAYBRIDGE\nmr>,<NMR_250MHZ>,
      <created by zg, POWCHK disabled, PULCHK disabled
       configuration hash MD5:
       76 6E 9A 78 1E 09 19 81 EC 84 63 8F B0 6A 59 2D
       data hash MD5: 64K
       51 4D E0 F6 C5 D8 F7 23 03 15 89 3C 55 40 E7 24>)
(   2,<2007-05-29 13:15:23.90 +100>,<MAYBRIDGE\nmr>,<NMR_250MHZ>,
      <Start of raw data processing
       ef LB = 0.3 FT_mod = 6 PKNL = 1 SI = 32K 
       data hash MD5: 32K
       DA 72 FC 52 34 74 9F 43 F6 AD 1D A0 28 6A 66 77>)
(   3,<2007-05-29 13:15:25.78 +100>,<MAYBRIDGE\nmr>,<NMR_250MHZ>,
      <apk 
       data hash MD5: 32K
       4B B5 3E FF 9C C0 3F 4E DB 48 0D 62 97 DF 8F 42>)
(   4,<2007-05-29 13:15:26.46 +100>,<MAYBRIDGE\nmr>,<NMR_250MHZ>,
      <abs ABSG = 5 
       data hash MD5: 32K
       98 1E 5F 7D 42 CA 3F 4E AE 65 C1 01 A7 71 DD 9B>)
$$ ##END=
$$ 
$$ hash MD5
$$ F1 01 2D 14 80 18 DB C6 1B 84 52 94 5F 9F F7 76
##$RELAX= 
##$RELAX= 
##$RELAX= 
##$RELAX= 
##$RELAX= 
##$RELAX= 
##$RELAX= 
$$ Bruker specific parameters
$$ --------------------------
##$DU= <C:\u>
##$EXPNO= 1650
##$NAME= <ADRS>
##$PROCNO= 1
##$TYPE= <nmr>
##$USER= <dgb>
##$AMP= (0..31)
100 100 100 100 100 100 100 100 100 100 100 100 100 100 100 100 100 100 
100 100 100 100 100 100 100 100 100 100 100 100 100 100 
##$AQSEQ= 0
##$AQ_mod= 3
##$AUNM= <au_zg>
##$AUTOPOS= <23 >
##$BF1= 250.13
##$BF2= 250.13
##$BF3= 250.13
##$BF4= 250.13
##$BF5= 500.13
##$BF6= 500.13
##$BF7= 500.13
##$BF8= 500.13
##$BYTORDA= 1
##$CFDGTYP= 0
##$CFRGTYP= 5
##$CHEMSTR= <none>
##$CNST= (0..31)
1 1 145 1 1 1 1 1 1 1 1 1 1 1 1 1 1 1 1 1 1 1 1 1 1 1 1 1 1 1 1 1 
##$CPDPRG= <>
##$CPDPRG1= <>
##$CPDPRG2= <>
##$CPDPRG3= <>
##$CPDPRG4= <mlev>
##$CPDPRG5= <mlev>
##$CPDPRG6= <mlev>
##$CPDPRG7= <mlev>
##$CPDPRG8= <mlev>
##$CPDPRGB= <>
##$CPDPRGT= <>
##$D= (0..31)
0 1 0 0 0 0 0 0 0 0.06 0 0 0 0 0 0 0.0002 0 0 0 0 0 0 0 0 0 0 0 0 0 0 
0 
##$DATE= 1180440903
##$DBL= (0..7)
120 120 120 120 120 120 120 120 
##$DBP= (0..7)
150 150 150 150 150 150 150 150 
##$DBP07= 0
##$DBPNAM0= <>
##$DBPNAM1= <>
$$ [...]
##$SUBNAM7= <"">
##$SUBNAM8= <"">
##$SUBNAM9= <"">
##$SW= 20.6930455092707
##$SWIBOX= (0..15)
0 0 3 0 0 0 0 0 0 0 0 0 0 0 0 0 
##$SW_h= 5175.983436853
##$TD= 65536
##$TD0= 1
##$TE= 683.16
##$TE2= 300
##$TE3= 300
##$TEG= 300
##$TL= (0..7)
0 120 120 120 120 120 120 120 
##$TP= (0..7)
150 150 150 150 150 150 150 150 
##$TP07= 0
##$TPNAME0= <>
##$TPNAME1= <>
##$TPNAME2= <>
##$TPNAME3= <>
##$TPNAME4= <>
##$TPNAME5= <>
##$TPNAME6= <>
##$TPNAME7= <>
##$TPOAL= (0..7)
0.5 0.5 0.5 0.5 0.5 0.5 0.5 0.5 
##$TPOFFS= (0..7)
0 0 0 0 0 0 0 0 
##$TUNHIN= 0
##$TUNHOUT= 0
##$TUNXOUT= 0
##$USERA1= <user>
##$USERA2= <user>
##$USERA3= <user>
##$USERA4= <user>
##$USERA5= <user>
##$V9= 5
##$VALIST= <valist>
##$VCLIST= <CCCCCCCCCCCCCCC>
##$VD= 0
##$VDLIST= <DDDDDDDDDDDDDDD>
##$VPLIST= <PPPPPPPPPPPPPPP>
##$VTLIST= <TTTTTTTTTTTTTTT>
##$WBST= 1024
##$WBSW= 4
##$XGAIN= (0..3)
0 0 0 0 
##$XL= 0
##$YL= 0
##$YMAX_a= 437358
##$YMIN_a= -346997
##$ZGOPTNS= <>
##$ZL1= 120
##$ZL2= 120
##$ZL3= 120
##$ZL4= 120
##$ABSF1= 16.522
##$ABSF2= -4.171173
##$ABSG= 5
##$ABSL= 3
##$ALPHA= 0
##$AQORDER= 0
##$ASSFAC= 0
##$ASSFACI= 0
##$ASSFACX= 0
##$ASSWID= 0
##$AUNMP= <proc_1d>
##$AZFE= 0.1
##$AZFW= 0.1
##$BCFW= 0
##$BC_mod= 0
##$BYTORDP= 0
##$COROFFS= 0
##$CY= 12.5
##$DATMOD= 1
##$DC= 0
##$DFILT= <>
##$DTYPP= 0
##$F1P= 14.0000005364418
##$F2P= -0.99999901652339
##$FCOR= 0.5
##$FTSIZE= 32768
##$FT_mod= 6
##$GAMMA= 0
##$GB= 0
##$INTBC= 1
##$INTSCL= 1
##$ISEN= 128
##$LB= 0.3
##$LEV0= 0
##$LPBIN= 0
##$MAXI= 10000
##$MC2= 0
##$MEAN= 0
##$ME_mod= 0
##$MI= 0
##$NCOEF= 0
##$NC_proc= -3
##$NLEV= 6
##$NOISF1= 0
##$NOISF2= 0
##$NSP= 0
##$NTH_PI= 0
##$NZP= 0
##$OFFSET= 16.522
##$PC= 1
##$PHC0= -63.25317
##$PHC1= 7.213222
##$PH_mod= 1
##$PKNL= yes
##$PPARMOD= 0
##$PSCAL= 4
##$PSIGN= 0
##$REVERSE= no
##$SF= 250.13
##$SI= 32768
##$SIGF1= 0
##$SIGF2= 0
##$SINO= 400
##$SIOLD= 32768
##$SREGLST= <1H.DMSO>
##$SSB= 0
##$STSI= 32768
##$STSR= 0
##$SW_p= 5175.98343685301
##$SYMM= 0
##$S_DEV= 0
##$TDeff= 65536
##$TDoff= 0
##$TI= <Analysis number 999999
Compound Code 99
Book Reference 9
Project Code 9>
##$TILT= no
##$TM1= 0
##$TM2= 0
##$TOPLEV= 0
##$USERP1= <user>
##$USERP2= <user>
##$USERP3= <user>
##$USERP4= <user>
##$USERP5= <user>
##$WDW= 1
##$XDIM= 32768
##$YMAX_p= 305723402
##$YMIN_p= -151417
$$ End of Bruker specific parameters
$$ ---------------------------------
##NTUPLES= NMR SPECTRUM
##VAR_NAME=  FREQUENCY,     SPECTRUM/REAL,   SPECTRUM/IMAG
##SYMBOL=    X,             R,               I
##VAR_TYPE=  INDEPENDENT,   DEPENDENT,       DEPENDENT
##VAR_FORM=  AFFN,          ASDF,            ASDF
##VAR_DIM=   32768,         32768,           32768
##UNITS=     HZ,            ARBITRARY UNITS, ARBITRARY UNITS
##FACTOR=    0.157963299565203, 1,           1
##FIRST=     4132.6476996994, 0,             0
##LAST=      -1043.33573715361, 0,           0
##MIN=       -1043.33573715361, -151417,     0
##MAX=       4132.6476996994, 305723402,     0
$$ Real data points
##PAGE= N=1
##DATA TABLE= (X++(R..R)), XYDATA
$$ [...]
16388I436O201M695L2666k609k5534j1097k3464j5629j1328J5112J6339K7438
$$ 9436 15637 20332 52998 50389 24855 13758 -9706 -25335 -36663 -21551 -5212 22226
16376B2226M9j7558N259l508q997L165P672L914n755J7593J2592q251m135o123
$$ 22226 22275 4717 9976 6468 -2529 636 8308 12222 6467 24060 36652 28401 24266 18143
16362A8143k66J4729q345j5176j1336P63K5539j1992k1748R457K6031r643k6258
$$ 18143 17877 32606 24261 9085 -2251 -1488 24051 12059 -9689 -232 25799 16156 -10102
16349a0102l379R546r201j3634n549n390J5256o480M835J3012J6995J9356O571
$$ -10102 -13481 -3935 -13136 -26770 -32319 -37709 -22453 -28933 -24098 -11086 5909 25265 31836
16336C1836r116j2312j1331j741J0616J2045j7327k4577L206J9962J7881P675
$$ 31836 22720 10408 -923 -2664 7952 19997 2670 -21907 -18701 1261 19142 26817
16324B6817p517L409N455o849P339q645j2581n879J4898K0402J0480j1464k1077
$$ 26817 19300 22709 28164 21315 28654 20009 7428 1549 16447 36849 47329 35865 14788
16311A4788j673k3174p484j2276J1596R25j6211J0435K4980J7612j6886j439q682
$$ 14788 13115 -10059 -17543 -29819 -18223 -17298 -33509 -23074 1906 19518 2632 1193 -7489
16298g489j60J7927J2458k1533j9321Q55l722j1891j1465J0466J900l940J6090
$$ -7489 -7649 10278 22736 1203 -18118 -17263 -20985 -32876 -44341 -33875 -31975 -35915 -19825
16285a9825O990N771K7918j404k9619L829J2984j920k382l414j6446K3942J7637
$$ -19825 -12835 -7064 20854 19450 -10169 -6340 6644 4724 2342 -1072 -17518 6424 24061
16272B4061o186Q094j6834o970j8002j2145M747j2108j1301K1969K5457J8173
$$ 24061 17875 25969 9135 2165 -15837 -27982 -23235 -35343 -46644 -24675 782 18955
16260A8955K676j22q205J2495j1851k5162l6485Q638K1904j2141j442R059j4317
$$ 18955 21631 21509 13304 25799 13948 -11214 -47699 -39061 -17157 -29298 -30740 -21681 -35998
16247c5998j0008q44J6372J4302n986L155P666L473L286o546j7183K904K2057
$$ -35998 -46006 -46850 -30478 -16176 -22162 -19007 -11341 -7868 -4582 -11128 -28311 -25407 -3350
16234c350O920K98J0651J3845j4032j86l0040m241L2700K3746K0764O591j5676
$$ -3350 3570 3868 14519 28364 14332 14146 -15894 -20135 12565 36311 57075 63666 47990
16221D7990j6577j5185k6686r501r16p84J5477J4225k6491k4029K2902O009k7888
$$ 47990 31413 16228 -10458 -19959 -20875 -21659 -6182 8043 -18448 -42477 -19575 -13566 -41454
16208d1454J2970M2625P519l612J8989o572j4899l757l279k157j7142J0280M1099
$$ -41454 -28484 14141 21660 18048 37037 30465 15566 11809 8530 6373 -10769 -489 40610
16195D0610q052k7890K400P994l2546j0500K6536J9471n066n375j6065r196P349
$$ 40610 32558 4668 7068 15062 -17484 -27984 -1448 18023 12957 7582 -8483 -17679 -10330
16182a0330j4867P882J794j2875M671L7143j2578J4827K4905k4258j0677j2203
$$ -10330 -25197 -17315 -15521 -28396 -23725 13418 840 15667 40572 16314 5637 -6566
16170f566j1302j742l837m165L0802J9992k3582o457R896J4123j0485l3354K0842
$$ -6566 -17868 -19610 -23447 -27612 3190 23182 -400 -6857 3039 17162 6677 -26677 -5835
16157e835K4529K26j7704m911p530o756P692r015Q112l478l160j6927K3970K3233
$$ -5835 18694 18920 1216 -3695 -11225 -17981 -10289 -19304 -11192 -14670 -17830 -34757 -10787 12446
16143A2446l422L569J0831Q163o778j0840P405q31k0853Q900P458J4338l154J060
$$ 12446 9024 12593 23424 31587 24809 13969 21374 20543 -310 8590 16048 30386 27232 28292
16129B8292O427M846l445J7825J3214j5615q896j809j1741k2761J82N017n842
$$ 28292 34719 39565 36120 53945 67159 51544 42648 40839 29098 6337 6519 11536 5694
16116E694Q217r236j0523q937j1044K6517J2722k228n826J3705j8887J290K4277
$$ 5694 13911 4675 -5848 -14785 -25829 688 13410 11182 5356 19061 174 1464 25741
16103B5741l774j1776J0479j7159p305q417j26J9404J1943L474j7538j6925J0467
$$ 25741 21967 10191 20670 3511 -3794 -12211 -12337 7067 19010 22484 4946 -11979 -1512
16090a512j0519l0640R286K7570l207j2200L284J9119J5311j5831q920K449j0074
$$ -1512 -12031 -42671 -33385 -5815 -9022 -21222 -17938 1181 16492 661 -8259 -5810 -15884
16077a5884j140P78K2984k074p423K086j398O781O15P537q589P621N70J336J887
$$ -15884 -17024 -16246 6738 4664 -2759 -673 -2071 4710 5325 12862 4273 11894 12464 13800 15687
16062A5687r998j7029K656o691l764J4441j5569L921J4534L952J0268R73J28L905
$$ 15687 5689 -11340 -8684 -15375 -19139 -4698 -20267 -16346 -1812 2140 12408 13381 13509 17414
16048A7414J839M077N745p070k9256r783n356m004K0281J9091J2050j9055n740
$$ 17414 19253 23330 29075 22005 -7251 -17034 -22390 -26394 -6113 12978 25028 5973 233
16035B33j1567j867l401Q208J1032N017j5981K758K1703j1534j4433j4972J1895
$$ 233 -11334 -13201 -16602 -8394 2638 7655 -8326 -5568 16135 4601 -9832 -24804 -12909
16022a2909J8362R227j1785n686q342j9492J0100J5459P371j0235J1225m307J1233
$$ -12909 5453 14680 2895 -2791 -11133 -30625 -20525 -5066 2305 -7930 3295 -1012 10221
16009A0221k2045j4810J3480J1494N501R075K3952O859k0128k493k3701m336J7077
$$ 10221 -11824 -26634 -13154 -1660 3841 12916 36868 43727 23599 21106 -2595 -6931 10146
15996A0146R519j9494M950J8607J3146J2649k1034l7830l1601j6723K4471L4097
$$ 10146 19665 171 5121 23728 36874 49523 28489 -9341 -40942 -57665 -33194 903
15984I03J9027O94l0848j3798J0945K2900j392k7958Q04L879N435n375P200K498
$$ 903 19930 20624 -10224 -24022 -13077 9823 8431 -19527 -18723 -14844 -9409 -14784 -7584 -5086
15970e086l961J1390O944J9900k020k5112j3341m029O679O641J67k004J0198K1831
$$ -5086 -9047 2343 9287 29187 27167 2055 -11286 -15315 -8636 -1995 -1828 -3832 6366 28197
15956B8197J8288j4946J833j2624q310j2994J305R732r500j5215O608J4164N10
$$ 28197 46485 31539 33372 20748 12438 -556 749 10481 981 -14234 -7626 6538 7048
15943G048N082k6846Q514o231J5396J0653l101n549j2297n531J0699N984K253
$$ 7048 12130 -14716 -6202 -12433 2963 13616 10515 4966 -7331 -12862 -2163 3821 6074
15930F074j9445l237J2115k72l749J07J6408J4123r626N938l680O677r65k2905
$$ 6074 -13371 -16608 -4493 -4765 -8514 -8407 8001 22124 12498 18436 14756 21433 20468 -2437
15916b437j977K8968o188J22k2530L589k4014j5397J3832L5300J5216r749K810
$$ -2437 -4414 24554 18366 18488 -4042 -453 -24467 -39864 -26032 9268 24484 14735 17545
15903A7545j446K1167K496m577j0988j3597j0652l395O897O652q945J922K1310
$$ 17545 16099 37266 39762 35185 24197 10600 -52 -3447 3450 10102 1157 3079 24389
15890B4389M838J1096J1665l695k6673j8443J9949l0173j0172K3037J3839J1057
$$ 24389 29227 40323 51988 48293 21620 3177 23126 -7047 -17219 5818 19657 30714
15878C0714j7196m9332j0475L1621L1753O872K0526O556p549r956j6440j4601
$$ 30714 13518 -35814 -46289 -14668 17085 23957 44483 51039 43490 33534 17094 2493
15866B493j9541j8328r039o052J844K4049Q209K0126K600l1687j653j5448J9967
$$ 2493 -17048 -35376 -44415 -50467 -48623 -24574 -16365 3761 6361 -25326 -26979 -42427 -22460
15853b2460L2810J9602k50l3893j8821j978q077r766J3690p702R942K4007P332
$$ -22460 10350 29952 29702 -4191 -23012 -24990 -33067 -42833 -29143 -36845 -26903 -2896 4436
15840D436J121n034M379J2123l238j0234J0166J5152J4824j5067K608L308J0630
$$ 4436 5557 523 4902 17025 13787 3553 13719 28871 43695 28628 31236 34544 45174
15827D5174p462l0514Q345O887o436o108M365o647j685M538K0466J5210k2725
$$ 45174 37712 7198 15543 22430 15994 9886 14251 7604 5919 10457 30923 46133 23408
15814B3408k6808R31J2316J0969J5643l033j4618j6037j7771M346K0025Q575l31
$$ 23408 -3400 -2469 9847 20816 36459 33426 18808 2771 -15000 -10654 9371 17946 17615
15801A7615L582j340r144J1990q379j5051K753k646k6443k7314K1617M121J7903
$$ 17615 21197 19857 10713 22703 14324 -727 2026 -620 -27063 -54377 -32760 -28639 -10736
15788a0736N255n539J9838m417o603J6537Q723J571K0411J825k3997j0663J496
$$ -10736 -5481 -11020 8818 4401 -2202 14335 23058 24629 45040 46865 22868 12205 13701
15775A3701J659k247Q70j5552J0343l182K5899r275j2883l795m063L329j4119
$$ 13701 15360 13113 13983 -1569 8774 5592 31491 22216 9333 5538 1475 4804 -9315
15762i315J1253J9501N111J4695J9497o511J3928R928J8347L3157L3637L4951
$$ -9315 1938 21439 26550 41245 60742 54231 68159 78087 96434 129591 163228 198179
15750A98179M1767Q9250J86857L77440P48687J358102J637737M46121j179897
$$ 198179 239946 329196 516053 893493 1642180 3000282 4638019 5084140 3904243
15741C904243j673278j011588n07510k29543j35060q0962p0348q6633l0330R818
$$ 3904243 2230965 1219377 711867 482324 347264 266302 195954 109321 78991 88809
15731H8809j4339J5159L432l378j7069n468o536J830l457j717j1507P848j3623
$$ 88809 74470 89629 93061 89683 72614 67146 60610 62440 58983 57266 45759 53607 39984
15718C9984j1513J3950m489j667k8515j9849K4133m832j2196p586L183J6160J6224
$$ 39984 28471 42421 37932 36265 7750 -12099 12034 7202 -4994 -12580 -9397 6763 22987
15705B2987j7169L196K7687K42M822n445k5110K024q119o726J1566K1237l293
$$ 22987 5818 9014 36701 36943 41765 36320 11210 13234 5115 -1611 9955 31192 27899
15692B7899p532r392J7706k4482K865P745k2365j7614J5819M697R152N166Q136
$$ 27899 20367 10975 28681 4199 7064 14809 -7556 -25170 -9351 -4654 4498 9664 17800
15679A7800K757j3844o118k3085M124j0426n809j549l278k769L6359K4888N375
$$ 17800 20557 6713 595 -22490 -18366 -28792 -34601 -36150 -39428 -42197 -5838 19050 24425
15666B4425K520n061l473Q58l967L048j1923R251K727j5194l413q796j4350J1378
$$ 24425 26945 21884 18411 19269 15302 18350 6427 15678 18405 3211 -202 -8998 -23348 -11970
15652a1970K8969R730j0090K1048k3496k0451j7239r443P122J6790L109Q281q862
$$ -11970 16999 26729 16639 37687 14191 -6260 -23499 -32942 -25820 -9030 -5921 2360 -6502
15639f502KJ3603q706j0461J9777M812j2605J93K8596P865j5807J5471j891J066
$$ -6502 -6500 7103 -1603 -12064 7713 12525 -80 113 28709 36574 20767 36238 34347 35413
15625C5413j8855j3453k5247k4260N338Q332l215K5695J3857k3516k8153R048
$$ 35413 16558 3105 -22142 -46402 -41064 -32732 -35947 -10252 3605 -19911 -48064 -39016
15613c9016K4318J3538K9149K3453r710J596n566m566j7737K0227l358j4023n73
$$ -39016 -14698 -1160 27989 51442 41732 43328 37762 33196 15459 35686 32328 18305 17732
15600A7732J1743M884K0416n315j6231r393j4748j1396k1773j5322j1570L8044
$$ 17732 29475 34359 54775 49460 33229 23836 9088 -2308 -24081 -39403 -50973 -12929
15588a2929O179j5154o714J1920K970p222k535J0653J1815l486o356J664m421
$$ -12929 -6750 -21904 -28618 -16698 -13728 -20950 -23485 -12832 -1017 -4503 -10859 -9195 -13616
15575a3616N071n95l79M881j4706j0443J6376Q990J9508Q892Q780p298j2722K93
$$ -13616 -8545 -9140 -9519 -4638 -19344 -29787 -13411 -4421 15087 23979 32759 25461 12739 13032
15561A3032P005j290R083k351k0392r122K4698k3744m2314J0486N034K5771Q91
$$ 13032 20037 18747 27830 25479 5087 -4035 20663 -3081 -45395 -34909 -29875 -4104 -3213
15548c213Q306l557k5765j1290K7712P771K98n902j2739J0893L5373j1217k6606
$$ -3213 5093 1536 -24229 -35519 -7807 -36 262 -5640 -18379 -7486 27887 16670 -9936
15535i936J2095N719j2690j1207K6467r383Q835J4468l461k9475l2712J0414K0634
$$ -9936 2159 7878 -4812 -16019 10448 1065 9900 24368 20907 -8568 -41280 -30866 -10232
15522a0232J1531K865o010j7454J4542K574L828j6047R601K4044o96j8039m06
$$ -10232 1299 4164 -1846 -19300 -4758 -2184 1644 -14403 -4802 19242 18546 507 101
15509A01R064J257j7231j000r129J7100n747j215J8711j236O229J1799J3985J0134
$$ 101 9165 10422 -6809 -7809 -16938 162 -5585 -6800 11911 10675 16904 28703 42688 52822
15495E2822j1757j0718M909n393k3799o721L86J1111q351l830L048q688q900j5264
$$ 52822 41065 30347 35256 29863 6064 -657 -271 10840 2489 -1341 1707 -6981 -15881 -31145
15481c1145q054O676J8181J5949j2432L639J9459J6100j7922l995j685P703n173
$$ -31145 -39199 -32523 -14342 1607 -10825 -7186 12273 28373 10451 6456 4771 12474 7301
15468G301k538k0621j3635n443k1890o39J8476O381O49J5005j0202M952K4271
$$ 7301 4763 -15858 -29493 -34936 -56826 -57465 -38989 -32608 -31959 -16954 -27156 -22204 2067
15455B067P734j5481J4412K5238n803j2440j9614l0663j8670K3793J6114n821
$$ 2067 9801 -5680 8732 33970 28167 15727 -3887 -34550 -53220 -29427 -13313 -19134
15443a9134L573J8825J1170P337K129o759O216o958l3187j1563K0723J6913j3701
$$ -19134 -15561 3264 14434 21771 23900 17141 23357 16399 -16788 -28351 -7628 9285 -4416
15430d416k019J9538j7636r26J8728p878J2201k0626O128p844J5799J8568j5063
$$ -4416 -6435 13103 -4533 -5459 13269 5391 17592 -3034 3094 -4750 11049 29617 14554
15417A4554j3421K2180O302M445K5795j4150m5575j3914m615r759Q803j5293P402
$$ 14554 1133 23313 29615 34060 59855 45705 130 -13784 -18399 -28158 -19355 -34648 -27246
15404b7246L151j0421j7243K1894N213N60p37J0320J0221k253N320l387O904j2038
$$ -27246 -24095 -34516 -51759 -29865 -24652 -24092 -24829 -14509 -4288 -6541 -1221 -4608 2296 -9742
15390i742j3810K5114j0992k904j4220J6365J1852O022q553l6146q38J1658K1817
$$ -9742 -23552 1562 -9430 -12334 -26554 -10189 1663 7685 -868 -37014 -37852 -26194 -4377
15377d377j346j0425j0126l907l15Q704K8507j7111j5174J1487k972r982o328
$$ -4377 -5723 -16148 -26274 -30181 -30496 -21792 6715 -10396 -25570 -14083 -17055 -27037 -33365
15364c3365P199J3831J7320J2216J6587j6814j0818O504q164p692p854j4940L321
$$ -33365 -26166 -12335 4985 17201 33788 16974 6156 12660 4496 -3196 -11050 -25990 -22669
15351b2669K505r811o394p268l484m112K5856J383J1058K3394j1554m929q453
$$ -22669 -20164 -29975 -36369 -43637 -47121 -51233 -25377 -23994 -12936 10458 -1096 -6025 -14478
15338a4478J1332j2208n112J3387M241k5171l2667J170L0093K7329J667o716j4369
$$ -14478 -3146 -15354 -20466 -7079 -2838 -28009 -60676 -59506 -29413 -2084 -417 -7133 -21502
15325b1502k136J3611K7483N07j9919k489q27K0141K8381m099k2574j2448J4358
$$ -21502 -23638 -10027 17456 17963 -1956 -4445 -5272 14869 43250 39151 16577 4129 18487
15312A8487J1355L012n780r991L995k1689N79P102M250k1627k0845N273K0753
$$ 18487 29842 32854 27074 17083 21078 -611 -32 7070 11320 -10307 -31152 -25879 -5126
15299e126l638n774O179o849j915M616j3747k65K2860J1693N434R26o205P455
$$ -5126 -8764 -14538 -8359 -15208 -17123 -12507 -26254 -26519 -3659 8034 13468 14394 8189 15644
15285A5644p329n581J5462l685j0557J2386O899P832j1786q076j2456k6487J373
$$ 15644 8315 2734 18196 14511 3954 16340 23239 31071 19285 11209 -1247 -27734 -26361
15272b6361J7265j225q720j594M519Q068K5852O96j954o0q235n317j2524Q987
$$ -26361 -9096 -10321 -19041 -20635 -16116 -8048 17804 18500 16546 16486 8251 2934 -9590 -603
15258f03m848l2039j1235K1973L3064J2014r584k0848L422q631J5422n142L395
$$ -603 -5451 -37490 -48725 -26752 6312 18326 8742 -12106 -8684 -17315 -1893 -7035 -3640
15245c640j3275J6359K7842l679j4178j5079R156K5767R246k8191J3263J151O925
$$ -3640 -16915 -556 27286 23607 9429 -5650 3506 29273 38519 10328 23591 24742 31667
15232C1667j684p872j6466K207K599J2816j6505l6141o316M6476K7786R787Q649
$$ 31667 29983 22111 5645 7852 10451 23267 6762 -29379 -35695 10781 38567 48354 57003
15219E7003j0085R6j914n1630J741Q949o96o276R549Q532l151k2926l719K6515
$$ 57003 46918 47014 45100 -6530 -4789 4160 3464 -2812 6737 15269 12118 -10808 -14527 11988
15205A1988j6390m836P660j0310j2105q645J8582J6004j8212q636R69J4782R440
$$ 11988 -4402 -9238 -1578 -11888 -23993 -32638 -14056 1948 -16264 -24900 -23931 -9149 291
15192B91J617J5315K044j2818l410j9072j2006j2311j0205l39n11K2350K5570
$$ 291 1908 17223 19267 6449 3039 -16033 -28039 -40350 -50555 -50894 -51405 -29055 -3485
15179c485K0786N233j9107r200p120o577m508J1565k7029J1418R248j478J6812
$$ -3485 17301 22534 3427 -5773 -12893 -19470 -23978 -12413 -39442 -28024 -18776 -20254 -3442
15166c442L4342K0548J9984k032m7453l011j7406j0066R548P588q307k5815j7425
$$ -3442 30900 51448 71432 69400 21947 18936 1530 -8536 1012 8600 293 -25522 -42947
15153d2947j1726P736J2908J6381J919k2357j2812J7628Q245j5341J3663J0177
$$ -42947 -54673 -46937 -34029 -17648 -15729 -38086 -50898 -33270 -25025 -40366 -26703 -16526
15141a6526m383P598K6669M978J5917j9663k4669O122q132J618P515J7124o335
$$ -16526 -20909 -13311 13358 18336 34253 14590 -10079 -3957 -12089 -10471 -2956 14168 7833
15128G833j0844o91l461K544l285q102J8550O670j1597J1210l741R042k9116K930
$$ 7833 -3011 -3702 -7163 -4619 -7904 -16006 2544 9214 -2383 8827 5086 14128 -14988 -12058
15114a2058l453j793j1716J1845L297j0589O272l950P105o305J2379r469j1795
$$ -12058 -15511 -17304 -29020 -17175 -13878 -24467 -18195 -22145 -15040 -21345 -8966 -18435 -30230
15101c0230j4182J9644J7273Q802k4815l361j4385O477N024j6504O741K5453Q265
$$ -30230 -44412 -24768 -7495 1307 -23508 -26869 -41254 -34777 -29753 -46257 -39516 -14063 -5798
15088e798K471j0058j2445O012p588k331J4604K8930K1029O898K325k6016j5042
$$ -5798 -3327 -13385 -25830 -19818 -27406 -29737 -15133 13797 34826 41724 44049 18033 2991
15075B991q479M626k909O756Q457j6726j6011N677j1327N331j6091l880q66o087
$$ 2991 -5488 -862 -3771 2985 11442 -5284 -21295 -15618 -26945 -21614 -37705 -41585 -42451 -48538
15061d8538J4087K8515j565J4755R492j0846k4036K859J4433o686j9317J7297
$$ -48538 -34451 -5936 -7501 7254 16746 5900 -18136 -15277 -844 -7530 -26847 -9550
15049i550N173N549j1606k3548K811J8728r032k3101N266J7024J8109J8954P378
$$ -9550 -4377 1172 -10434 -33982 -31171 -12443 -21475 -44576 -39310 -22286 -4177 14777 22155
15036B2155K2894j1069j1003L748k1828l0816O941j8261m535j492K2973p711J7446
$$ 22155 45049 33980 22977 26725 4897 -25919 -18978 -37239 -41774 -43266 -20293 -28004 -10558
15023a0558n971K5519K9621m034k6733L744L8130O614l6234q93R165j8359o867
$$ -10558 -16529 8990 38611 34577 7844 11588 49718 56332 20098 19205 28370 10011 3144
15010C144m960L748j2055P275J0973q207m263j2065J1534m550K5097K5230L668
$$ 3144 -1816 1932 -10123 -2848 8125 -82 -4345 -16410 -4876 -9426 15671 40901 44569
14997D4569J18l1495l1074M805J994J6735M325J6187l982r553k0946K444l970
$$ 44569 44687 13192 -17882 -13077 -11083 5652 9977 26164 22182 12629 -8317 -5873 -9843
14984i843j9333j5805J3547K5422P381J5405o840k4860j2319k0729n598J4905
$$ -9843 -29176 -44981 -31434 -6012 1369 16774 9934 -14926 -27245 -47974 -53572 -38667
14972c8667K3401j0747K3147J9596J454j905m319O346J4214M988L557q602j1967
$$ -38667 -15266 -26013 -2866 16730 18184 16279 11960 18306 32520 37508 41065 32463 20496
14959B0496m1114q744K8437n359l2632J8297J6507j3677m907M840j3997J6210
$$ 20496 -20618 -29362 -925 -6284 -38916 -20619 -4112 -17789 -22696 -17856 -31853 -15643
14947a5643J4286p341K432J490J5209k2270j1188m922J1800K284l323l319L4443
$$ -15643 -1357 -8698 -6266 -4776 10433 -11837 -23025 -27947 -16147 -13863 -17186 -20505 13938
14934A3938J0831l728o341j1984M934N621P945j1975r106J3314J9402J0975o156
$$ 13938 24769 21041 14700 2716 7650 13271 21216 9241 135 13449 32851 43826 37670
14921C7670k7755k1551J7059O760k4490k2291m190J0781L4639J3698J2489K648
$$ 37670 9915 -11636 5423 12183 -12307 -34598 -38788 -28007 6632 20330 32819 35467
14909C5467l3310J483K1983J5325j3240k4097J795O401J041J4427L144k1153K048
$$ 35467 2157 3640 25623 40948 27708 3611 5406 11807 12848 27275 30419 9266 11314
14896A1314j099j6950K3774L9137j0125k3503j1047K99K801j263J1762j5899p173
$$ 11314 10215 -6735 17039 56176 46051 22548 11501 11800 14601 13338 25100 9201 2028
14883B028o223j250J222j238N461j6533l444N620J8952k268J1324J9558j5988
$$ 2028 -4195 -5445 -4223 -5461 0 -16533 -19977 -14357 4595 2327 13651 33209 17221
14870A7221j2789j3077l215J9053p589j7730O437J5562J4244l6131j5558J1745
$$ 17221 4432 -8645 -11860 7193 -396 -18126 -11689 3873 18117 -18014 -33572 -21827
14858b1827l482J6149J8520J1898R212r547j9827j6558J7295N265j9641K2105
$$ -21827 -25309 -9160 9360 21258 30470 20923 1096 -15462 1833 7098 -12543 9562
14846I562m448J7062N061k6114M014j1798j8759J4203l2092o428K3654P601M239
$$ 9562 5114 22176 27237 1123 5137 -6661 -25420 -11217 -43309 -49737 -26083 -18482 -14243
14833a4243l705j0427j745J0275J1504J5417j3673Q202M12Q588k02J0671j5665
$$ -14243 -17948 -28375 -30120 -19845 -8341 7076 -6597 1605 2017 10605 10403 21074 5409
14820E409k2554J4756M2336O634K955j5097P074j386j4541r871k546o606q062
$$ 5409 -17145 -2389 39947 46581 49536 34439 41513 40127 25586 15715 13169 6563 -1499
14807a499J245j5121J1110M0830K6722l3935l4105q696J5059L2228N356j3046
$$ -1499 -254 -15375 -4265 36565 63287 29352 -4753 -13449 1610 33838 39194 26148
14795B6148j8188m420J6092j0388r087N343j8155Q896K802p845n849k6629M616
$$ 26148 7960 3540 19632 9244 157 5500 -12655 -3759 -957 -8802 -14651 -41280 -36664
14782c6664K0014R736K5719N128m46j4269k2746j4022l791o106J0928K4257M173
$$ -36664 -16650 -6914 18805 23933 23487 9218 -13528 -27550 -31341 -37447 -26519 -2262 1911
14769A911K7644J938k8693j3682M0565K2509o044P703o2140j8653J5381q20j9387
$$ 1911 29555 31493 2800 -10882 29683 52192 46148 53851 -8289 -26942 -11561 -12381 -31768
14756c1768K1947K7059J0201j5626j5521J7140n451j9892j0175N203K0071J3342
$$ -31768 -9821 17238 27439 11813 -3708 13432 7981 -11911 -22086 -16883 3188 16530
14744A6530j1409L1428L229j9262p901j9257o055j3371q897J15J2689m784M715
$$ 16530 5121 36549 39778 20516 12615 -6642 -12697 -26068 -34965 -34850 -22161 -26945 -22230
14731b2230k272J5229O240r956j7756J7650K4686P863k428K260p387J068K338
$$ -22230 -24502 -9273 -3033 -12989 -30745 -13095 11591 19454 17026 19286 11899 12967 15305
14718A5305j0650K995J3446j0535p263J440p145O795k522l254Q226j5280k5568
$$ 15305 4655 7650 21096 10561 3298 4738 -2407 4388 1866 -1388 6838 -8442 -34010
14705c4010J0386K7213J9302q328l1826P331L57l263q246j0575P410J5194J7452
$$ -34010 -23624 3589 22891 14563 -17263 -9932 -9575 -12838 -21084 -31659 -24249 -9055 8397
14692H397K0079j5433j5575O763J6881j0505j3003o909Q540l6j5636J8117K789
$$ 8397 28476 13043 -2532 4231 21112 10607 -2396 -9305 -765 -801 -16437 1680 4469
14679D469Q080Q578j0326m655K755Q242O016p596k5289q237j2782p81K995j1901
$$ 4469 12549 21127 10801 6146 8901 17143 23159 15563 -9726 -17963 -30745 -31526 -28531 -40432
14665d0432J7317J7743r432K747L014Q718j6723k2836L3666j468M324J6437p11
$$ -40432 -23115 -5372 -14804 -12057 -9043 -325 -17048 -39884 -6218 -7686 -3362 13075 12364
14652A2364j0876j5044Q417N581j3616k155J0828P240j634J2934J0148J684k7209
$$ 12364 1488 -13556 -5139 442 -13174 -15329 -4501 2739 1105 14039 24187 25871 -1338
14639a338N815j346j1222M170K750J2072L799q384J2713l976j9367r961J744o735
$$ -1338 4477 3131 -8091 -3921 -1171 10901 14700 6316 19029 15053 -4314 -14275 -12531 -19266
14625a9266k414K1710J0561n781j3486m354j5121j5460o575L922Q234L808j0697
$$ -19266 -21680 30 10591 4810 -8676 -13030 -28151 -43611 -50186 -46264 -38030 -34222 -44919
14612d4919L1410J0235N364K2076J1754n17q141l6788j3287q679L184J7786j2491
$$ -44919 -13509 -3274 2090 24166 35920 35403 27262 -9526 -22813 -31492 -28308 -10522 -23013
14599b3013k516K3077K4937J2807j8139k8935j2897k7346j2592J9487K1390R796
$$ -23013 -25529 -2452 22485 35292 17153 -11782 -24679 -52025 -64617 -45130 -23740 -13944
14587a3944Q985J4639p25J1563m0404k8435J3330N630r712P311Q946J6344j2765
$$ -13944 -4959 9680 8955 20518 -19886 -48321 -34991 -29361 -39073 -31762 -22816 -6472 -19237
14574a9237j7637K1131o829k4336J2723J0245J1817J4314K4802q370q989k0595
$$ -19237 -36874 -15743 -22572 -46908 -34185 -23940 -12123 2191 26993 18623 9634 -10961
14562a0961O129m676O677n443k1748P933R250N246O871K5598k0119k6715K43J0590
$$ -10961 -4832 -9508 -2831 -8274 -30022 -22089 -12839 -7593 -722 24876 4757 -21958 -21715 -11125
14548a1125J6790R67k0607J8j511j2183k018k205J9976l665R677q297k835l36
$$ -11125 5665 6632 -13975 -13957 -15468 -27651 -29669 -31874 -11898 -15563 -5886 -14183 -17018 -17354
14534a7354Q54Q147k5051j604O649O190J5115j2621k0670k81j2371j538J7074
$$ -17354 -16500 -8353 -33404 -35008 -28359 -22169 -7054 -19675 -40345 -40626 -52997 -54535 -37461
14521c7461J2257R518J5103R619J0098p501L683L076K953J724j2951N331J4304
$$ -37461 -25204 -15686 -583 9036 19134 11633 15316 18392 21345 23069 10118 15449 29753
14508B9753M478n752l147j507J576m762k6802L33R956P219o129k10r926k5524
$$ 29753 34231 28479 25332 23825 25401 20639 -6163 -5830 4126 11345 5216 5006 -4920 -30444
14494c0444J3398L5558N026n442J5533j1411j0157j6665j3499k73J8783k36r160
$$ -30444 -17046 18512 23538 18096 33629 22218 12061 -4604 -18103 -18376 407 171 -8989
14481h989m569m850k4069J665L0907Q03J0406j1558j8927j63K3397K093q403P185
$$ -8989 -13558 -18408 -42477 -40812 -9905 -9102 1304 -10254 -29181 -29344 -5947 -3854 -12257 -5072
14467e072j0057R537l863k4988P16J2762J9259J6442j2143k7411j494L0297Q756
$$ -5072 -15129 -5592 -9455 -34443 -33727 -20965 -1706 14736 2593 -24818 -26312 3985 12741
14454A2741m2549n062K6380L3358K906j2280K712j3487q76p594R392J6715k4810
$$ 12741 -29808 -34870 -8490 24868 27774 15494 18206 4719 3843 -3751 5641 22356 -2454
14441b454O54N919j0957J2153K974j8755j0047K0954K1475n825J9568j8L025K733
$$ -2454 -1800 4119 -6838 5315 8289 -10466 -20513 441 21916 16091 35659 35641 38666 41399
14427D1399K822p863j2283q530J4139N358j7168j0239j13o937j232J5281j1579
$$ 41399 44221 36358 24075 15545 29684 35042 17874 7635 7522 585 -647 14634 3055
14414C055j8863K2931K6761L711n518j5979j753O929J3330q209l0946j0054K743
$$ 3055 -15808 7123 33884 37595 32077 16098 14345 21274 34604 26395 -4551 -14605 -11862
14401a1862P482K2216P223k321j870q046j866k2274j3832j0860J1121K5761j9472
$$ -11862 -4380 17836 25059 22738 20868 12822 10956 -11318 -25150 -36010 -24889 872 -18600
14388a8600J8400R025l660p872J738j2861j4842j3945k173L9341K0463M93J0554
$$ -18600 -200 8825 5165 -2707 -969 -13830 -28672 -42617 -44790 -5449 15014 15507 26061
14375B6061M74j8073j3870O660p49j8006l551K418O256K3013K4874K789j1149
$$ 26061 26535 8462 -5408 1252 503 -17503 -21054 -18636 -12380 10633 35507 38296 27147
14362B7147K2971J614o748J389o308o356p96J5752j3918r026j4374k9917q020
$$ 27147 50118 51732 44984 46373 40065 33709 32913 48665 34747 25721 11347 -18570 -26590
14349b6590Q536J6185M256j995j0483l54N729K7354O672j0652M699P233j2982
$$ -26590 -18054 -1869 2387 392 -10091 -10445 -4716 22638 29310 18658 23357 30590 17608
14336A7608k503k3605J8194k7237n3364q193K4490j437J9347K7370K811K714o87
$$ 17608 15105 -8500 9694 -17543 -70907 -79100 -54610 -56047 -36700 -9330 -6519 -3805 -4492
14323d492K0891J6058J8807j2902n61j8282j5782o879j8411M440Q285l1974J2016
$$ -4492 16399 32457 51264 38362 37801 19519 3737 -3142 -21553 -17113 -8828 -40802 -28786
14310b8786K8344N902N684P169j8881p606N827P43q624p961j4733M497R111K1518
$$ -28786 -442 5460 11144 18313 -568 -8174 -2347 -1604 -10228 -18189 -32922 -28425 -19314 2204
14296B204J1354M713k633M461j7408M80k5619j536J8877p400J0005Q98m544K6446
$$ 2204 13558 18271 15638 20099 2691 3171 -22448 -23984 -5107 -12507 -2502 -1604 -6148 20298
14282B0298J3316J009q6j4n17j2641P874k8774L051J3494l154j1555K5960j5151
$$ 20298 33614 34623 34537 34523 34006 21365 29239 465 3516 17010 13856 2301 28261 13110
14268A3110n572j9726J6549J8572J0000M640n864k0747j3280j2925J4455K3715
$$ 13110 7538 -12188 4361 22933 32933 37573 31709 10962 -2318 -15243 -788 22927
14256B2927J6618Q653l6341o884K1825J17P403p213k6245j5539p298m568m945
$$ 22927 39545 48198 11857 4973 26798 26915 34318 27105 860 -14679 -21977 -26545 -31490
14243c1490q746m486K2563J4589p060r460R073J2988J7922L98k794k3708N597
$$ -31490 -40236 -44722 -22159 -7570 -14630 -24090 -15017 -2029 15893 16291 13497 -10211 -4614
14230d614M631j6499N785J3108K0954o41k1036q542J0898j5250q200J4694N343
$$ -4614 17 -16482 -10697 2411 23365 22724 1688 -6854 4044 -11206 -19406 -4712 631
14217F31r723j5871J1652J2491L7318J008o450r702k211m197j2462J9746n397
$$ 631 -9092 -24963 -13311 -820 36498 37506 31056 21354 19143 14946 2484 22230 16833
14204A6833o096M071Q518j7536q902R357p951J5790J4620J4164J3349l1187m5769
$$ 16833 10737 14808 23326 5790 -3112 6245 -1706 14084 28704 42868 56217 25030 -20739
14191b0739M630K787J6899J3137k754K486m412J1643j55k051n565k181J4677j8528
$$ -20739 -16109 -13322 3577 16714 13960 16446 12034 23677 23522 21471 15906 13725 28402 9874
14177I874l2235J8062j7623l4299o833j8411r558L7391K2671Q797J1326j6396
$$ 9874 -22361 -4299 -21922 -56221 -63054 -81465 -91023 -53632 -30961 -22164 -10838 -27234
14165b7234Q075K4271J4101p759J66k090m602j858n518Q090j396k2204L748L5940
$$ -27234 -19159 5112 19213 11454 11620 9530 4928 3070 -2448 5642 4246 -17958 -14210 21730
14151B1730N103j988j1023j4953Q456K0258q654j0143J6036l539j9648O087Q1
$$ 21730 26833 24845 13822 -1131 7325 27583 18929 8786 24822 21283 1635 7722 7803
14138G803N028J5298J2409J6415P647j4832J566j7679n4413j0213J1197J7702
$$ 7803 12831 28129 40538 56953 64600 49768 51334 33655 -20758 -30971 -19774 -2072
14126b072P280J1363J612p499l960K116o178m047J4295l494J068n023l34K242
$$ -2072 5208 16571 18183 10684 6724 8840 2662 -1385 12910 9416 10484 5461 5127 7369
14112G369q629k6648J7619J0020J2797K3315K1900Q548p02k4081j7510q550m543
$$ 7369 -1260 -27908 -10289 -269 12528 35843 57743 66291 65589 41508 23998 15448 10905
14099A0905j0594p562M029J8786j0199k397p905j8290q828K3746J4019N0q793
$$ 10905 311 -7251 -3222 15564 5365 2968 -4937 -23227 -32055 -8309 5710 5760 -3033
14086c033n844J5382J8631k2365j3147L1111j2800j6565L764Q901K4143J0382
$$ -3033 -8877 6505 25136 2771 -10376 20735 7935 -8630 -4866 4035 28178 38560
14074C8560j4514k3247N305j3173j5685J9503l414J3208j630k6995R36J4685J6
$$ 38560 24046 799 6104 -7069 -22754 -3251 -6665 6543 4913 -22082 -21146 -6461 -6445
14061f445q555J3086K0865n885M985p023q607j0022J871J1614l374j4116M604
$$ -6445 -15000 -1914 18951 13066 18051 11028 2421 -7601 -5730 5884 2510 -11606 -7002
14048g002K7207L3805j4173j8974j9172j0160R155J403j3175L686L6490K8855
$$ -7002 20205 54010 39837 20863 1691 -8469 686 2089 -11086 -7400 29090 57945
14036E7945J3718k3481k3009q44K782l1667k995q069J635j4881j5259J6243j6232
$$ 57945 71663 48182 25173 24329 27111 -4556 -7551 -15620 -13985 -28866 -44125 -27882 -44114
14023d4114J2046L740J7901J6077j4572K052j351R29j8849j5609K1935J105K592
$$ -44114 -32068 -28328 -10427 5650 -8922 -6870 -8221 -7292 -26141 -41750 -19815 -18710 -16118
14010a6118j0978L168N388Q481q302j5054K4424J5605m194j031P525n693l707
$$ -16118 -27096 -23928 -18540 -10059 -18361 -33415 -8991 6614 2420 1389 8914 3221 -486
13997d86m899M24m565L8849Q287k5489k5036M137k1726n750L422R282Q166n437
$$ -486 -5385 -4961 -9526 29323 37610 12121 -12915 -8778 -30504 -36254 -32832 -23550 -15384 -20821
13983b0821l809Q674J3204l139n492j3661J361J3019J462J9322m74L480j0587
$$ -20821 -24630 -15956 -2752 -5891 -11383 -25044 -23683 -10664 -9202 10120 9646 13126 2539
13970B539j1727K278K012j2972J3973K581J0979K8036k2561k4797k0994P576l326
$$ 2539 -9188 -6910 -4898 -17870 -3897 -1316 9663 37699 15138 -9659 -30653 -23077 -26403
13957b6403j6318Q719q65o018K0200J7232m700J431M217j5151J1169K463k3974
$$ -26403 -42721 -34002 -34867 -40885 -20685 -3453 -8153 -6722 -2505 -17656 -6487 -4024 -27998
13944b7998K4312K4357L648l190n013Q939n352l0770k3226P438J3870j0249k3168
$$ -27998 -3686 20671 24319 21129 16116 25055 19703 -11067 -34293 -26855 -12985 -23234 -46402
13931d6402o298K8998J7220k102N303K5859K573k5635k7081J856L7043P478j9575
$$ -46402 -52700 -23702 -6482 -8584 -3281 22578 25151 -484 -27565 -25709 11334 18812 -763
13918g63j9583j6288Q802K444j0329j0974L5064Q059j0946Q867K5355r667k763
$$ -763 -20346 -36634 -27832 -25388 -35717 -46691 -11627 -3568 -14514 -5647 19708 10041 7278
13905G278j6816m581N873k3475k4367l434L6245K4200P637J6212j1793k9280o428
$$ 7278 -9538 -14119 -8246 -31721 -56088 -59522 -23277 923 8560 24772 12979 -16301 -22729
13892b2729K7933N257p503k6997J797K599j2247q068J9950J5475L335R130l301
$$ -22729 5204 10461 2958 -24039 -22242 -19643 -31890 -39958 -20008 -4533 -1198 7932 4631
13879D631j0448k885n654J5329J3341l211k1764J6071K4294k4609j3385J413k716
$$ 4631 -5817 -8702 -14356 973 14314 11103 -10661 5410 29704 5095 -8290 -6877 -9593
13866i593R57L526j5639J4993J7952J3138k2098P745Q943k7786p893q71N353R680
$$ -9593 -8636 -5110 -20749 -5756 12196 25334 3236 10981 19924 -7862 -15755 -16626 -11273 -1593
13852a593J9649j9711l2682l812n505K7244j2454n844Q529J717p419J3907K0590
$$ -1593 18056 -1655 -34337 -38149 -43654 -16410 -28864 -34708 -26179 -24462 -31881 -17974 2616
13839B616j0937J2290N153j9371p755j0191j2007J1486J5354K8781R979m189j7076
$$ 2616 -8321 3969 9122 -10249 -18004 -28195 -40202 -28716 -13362 15419 25398 21209 4133
13826D133K409o758J168J900k8131j7543Q695J6603K9742R425j4579J865K395
$$ 4133 6542 -216 952 2852 -25279 -42822 -34127 -17524 12218 21643 7064 8929 11324
13813A1324P19j4168l200k073j0191l603L3660q075k8174r359K9435q776k13K4339
$$ 11324 12043 -2125 -5325 -7398 -17589 -21192 12468 4393 -23781 -33140 -3705 -12481 -12694 11645
13799A1645k2893j3526R854R490P707r784n992K372j232j8738L333n096Q772q46
$$ 11645 -11248 -24774 -14920 -5430 2277 -7507 -13499 -11127 -12359 -31097 -27764 -32860 -24088 -24934
13785b4934J9745N875k2989l2040k6302N83M8231L2920j6694j8535K966q285L153
$$ -24934 -5189 686 -22303 -54343 -80645 -80062 -31831 1089 -15605 -34140 -31174 -39459 -36306
13772c6306J1805L0386Q260q119m743j6151k0125j4034J0638J2037m102L3665
$$ -36306 -24501 5885 14145 6026 1283 -14868 -34993 -49027 -38389 -26352 -30454 3211
13760C211R08j857o282k3548m0504j0625K6218K3200O010j444q522o146J0415
$$ 3211 4119 2262 -4020 -27568 -68072 -78697 -52479 -29279 -23269 -24713 -33235 -39381 -28966
13747b8966k174J0544m252J22J647L583J0726k0090j9445K3592l01k1012K0038
$$ -28966 -31140 -20596 -24848 -24726 -23079 -19496 -8770 -28860 -48305 -24713 -25014 -46026 -25988
13734b5988K0829m049Q558J0474N412l733k19o212J1196j8634k8416K0480P014
$$ -25988 -5159 -9208 -650 9824 15236 11503 11284 5072 16268 -2366 -30782 -10302 -3288
13721c288j518k5105P460K7931R232j0047j3322Q072J2501M660k1956j5751L548
$$ -3288 -4806 -29911 -22451 5480 14712 4665 -8657 -585 11916 16576 -5380 -21131 -17583
13708a7583K394j0863k2274N111q45O455L358j2555P700J2346K5881l827j4128
$$ -17583 -15189 -26052 -48326 -43215 -44060 -37605 -34247 -46802 -39102 -26756 -875 -4702 -18830
13695a8830R075K6307l133k756k1947j5181P535J1606j2160J3067J2585J0243
$$ -18830 -9755 16552 13419 10663 -11284 -26465 -18930 -7324 -19484 -6417 6168 16411
13683A6411K571R593p805O430o530j3873k5861k2780Q617K4391r324q814r095
$$ 16411 18982 28575 20770 27200 20670 6797 -19064 -41844 -33227 -8836 -18160 -26974 -36069
13670c6069O844O867K9960R598j8863O162m333L012k8237J3709K3634k869l832
$$ -36069 -29225 -22358 7602 17200 -1663 4499 166 3178 -25059 -11350 12284 9415 5583
13657E583J3852P134k0750r133o702L5103M5525P435k0830k2196l2478k9158M452
$$ 5583 19435 26569 5819 -3314 -10016 25087 70612 78047 57217 35021 2543 -26615 -22163
13644b2163k844n239l039M045J3602m029K1173J4884n370n018J3247m293k4926
$$ -22163 -25007 -30246 -33285 -29240 -15638 -19667 1506 16390 11020 6002 19249 14956 -9970
13631i970k7860K2317K6940O898q216p231j502l0569n338J2980J6589K8250J1611
$$ -9970 -37830 -15513 11427 18325 10109 2878 1376 -29193 -34531 -21551 -4962 23288 34899
13618C4899P8J2213l939j3648m9296K353j1116J4964J1070j9861j6659L1227R977
$$ 34899 34977 47190 43251 29603 -19693 -17340 -28456 -13492 -2422 -22283 -38942 -7715 2262
13605B262j326M765j0505n893l237N618K0979O104n295J7371J3935j4948l7574
$$ 2262 936 5701 -4804 -10697 -13934 -8316 12663 18767 13472 30843 44778 29830 -7744
13592g744p270J388J3179n462p303J363j0423L220J6014M750j6591j9397k283
$$ -7744 -15014 -13626 -447 -5909 -13212 -11849 -22272 -19052 -3038 1712 -14879 -34276 -36559
13579c6559J5496K5644K816k6482Q25O461j252K966M998L39P031O272J3305K029
$$ -36559 -21063 4581 7397 -19085 -18260 -11799 -13051 -10085 -5087 -4748 2283 8555 21860 23889
13565B3889l0036p516J6680q658r154K1611J0279p011P130l222j8641r312p46
$$ 23889 -6147 -13663 3017 -5641 -14795 6816 17095 10084 17214 13992 -4649 -13961 -14707
13552a4707L623J0800J6754L96j072O356m449m19q192k86k798o646q921O435o503
$$ -14707 -11084 -284 16470 16866 15794 22150 17701 17282 9090 8804 6006 -640 -9561 -3126 -9629
13537i629k483r330J2215N664j3978J9487j0842j1741K835K1164J0965Q467M792
$$ -9629 -12112 -21442 -9227 -3563 -17541 1946 -8896 -20637 -17802 3362 14327 22794 27586
13524B7586N113j8431M883Q896m3910j3341Q957q8J9421k4994r668L4734j5122
$$ 27586 32699 14268 19151 28047 -15863 -29204 -20247 -20335 -914 -25908 -35576 -842 -15964
13511a5964O790K0414j0899r749J0363N549j7788m2162J0384K7894J4441J5123
$$ -15964 -9174 11240 341 -9408 955 6504 -11284 -53446 -43062 -15168 -727 14396
13499A4396M516j3693j6585m113L679N951K390j5621j4230j275K8759Q326l536
$$ 14396 18912 5219 -11366 -15479 -11800 -5849 -3459 -19080 -33310 -34585 -5826 2500 -1036
13486a036L5699l463r995n006j9495J1786N082k2885n139J6279N202K738l058
$$ -1036 34663 31200 21205 16199 -3296 8490 13572 -9313 -14452 1827 7029 9767 6709
13473F709J6108J8760O30j3333Q050P247k5289l348O785j0914j0400j381J0334
$$ 6709 22817 41577 42207 28874 36924 44171 18882 15534 22319 11405 1005 -376 9958
13460I958O339j3319J1573o760j0741o856k7462p244K2591J6302Q65j0620l2320
$$ 9958 16297 2978 14551 7791 -2950 -9806 -37268 -44512 -21921 -5619 -4754 -15374 -47694
13447d7694l438K3988J0529j797J699n172m571m628J676J1441P153L9711K0541
$$ -47694 -51132 -27144 -16615 -18412 -16713 -21885 -26456 -31084 -29408 -17967 -10814 28897 49438
13434D9438j6826j0176k5081k1122j729K464k954K1040j8625j6860m523j381K594
$$ 49438 32612 22436 -2645 -23767 -25496 -23032 -25986 -4946 -23571 -40431 -44954 -46335 -43741
13421d3741J9368J6626j1270p671J2905q203N798K0709N793j149n482j6574j2474
$$ -43741 -24373 -7747 -19017 -26688 -13783 -21986 -16188 4521 10314 9165 3683 -12891 -25365
13408b5365k4684J5974L0752P645N460R95J064M880o735j3743M915k1121l2977
$$ -25365 -50049 -34075 -3323 4322 9782 10777 11841 16721 9986 -3757 1158 -19963 -52940
13395e2940j256Q850Q553K0951J9836P809J5034J37o415k1940j9187k468j4887
$$ -52940 -54196 -45346 -36793 -15842 3994 11803 26837 26974 20559 -1381 -20568 -23036 -37923
13382c7923k4494J3451M096J6246J5374k983j9137O634l781n512J0750N236J2358
$$ -37923 -62417 -48966 -44870 -28624 -13250 -16233 -35370 -28736 -32517 -38029 -27279 -22043 -9685
13369i685r976j3133p035K5112k792j979L125L280J4273j8742L719l42Q950J9754
$$ -9685 -19661 -32794 -39829 -14717 -17509 -19488 -16363 -13083 1190 -17552 -13833 -14175 -5225 14529
13355A4529M593M127J1221J62l498p837j1737k5078J0914M473k7485K660J0703
$$ 14529 19122 23249 34470 34632 31134 23297 11560 -13518 -2604 1869 -25616 -22956 -12253
13342a2253O850J1702J4682r522k7719j6524J5620o029J617J1708k411j5348k1425
$$ -12253 -5403 6299 20981 11459 -16260 -32784 -17164 -23193 -21576 -9868 -12279 -27627 -49052
13329d9052l120J3149J1045j4867L335J5344J9376K378j6641k0960M546J1921
$$ -49052 -52172 -39023 -27978 -42845 -39510 -24166 -4790 -2412 -19053 -40013 -35467 -23546
13317b3546Q657n455k9085N796J6389J9048q245r381J9085P673j3981K4583k466
$$ -23546 -14889 -20344 -49429 -43633 -27244 -8196 -16441 -25822 -6737 936 -13045 11538 9072
13304I072K082m833m843K064J422q154j7568j4690q347K4486K4878k0478j5716
$$ 9072 11154 6321 1478 3542 4964 -3190 -20758 -35448 -43795 -19309 5569 -14909 -30625
13291c0625J6527o342P400j4870m569J5299L367K846P853j6777J2144J2095o57
$$ -30625 -14098 -20440 -13040 -27910 -32479 -17180 -13813 -10967 -3114 -19891 -7747 4348 3691
13278C691Q76k4787K9858K9461k0349j2014M868r9j1894J3012J8926k29k3664
$$ 3691 4567 -20220 9638 39099 18750 6736 11604 11505 -389 12623 31549 31320 7656
13265G656k5849m683J5463l09M551K5404q133k1366k0002k5506O391J3084Q070
$$ 7656 -18193 -22876 -7413 -7722 -3171 22233 14100 -7266 -27268 -52774 -46383 -33299 -25229
13252b5229j344J3543K4082M702m023J6238J6591j5159j0900n167N700o83r782
$$ -25229 -26573 -13030 11052 15754 11731 27969 44560 29401 18501 13334 19034 18351 8569
13239H569r560j3650N717J4880M262k4594j344K713p552j371N197p611p318J5
$$ 8569 -991 -14641 -8924 5956 10218 -14376 -15720 -13007 -20559 -21930 -16733 -24344 -31662 -31647
13225c1647J0303m68k2575J0636K2396j8797J7222M793l946m677J1536k618L783
$$ -31647 -21344 -21812 -44387 -33751 -11355 -30152 -12930 -8137 -12083 -16760 -5224 -7842 -4059
13212d059r329o121Q052k2K0664j0765l1406j7719K6854M0501l570j1395j1464
$$ -4059 -13388 -19509 -11457 -11479 9185 -1580 -32986 -50705 -23851 16650 13080 1685 -9779
13199i779l061k3509N836l794j3561K5210Q103q191M210J6902J5235J9373P911
$$ -9779 -12840 -36349 -30513 -34307 -47868 -22658 -14555 -22746 -18536 -1634 13601 32974 40885
13186D0885k5512k5557P030j0015J2247l163l946k1923j1897j1042P270K8067
$$ 40885 15373 -10184 -3154 -13169 -922 -4085 -8031 -29954 -41851 -52893 -45623 -17556
13174a7556J3039q721k4737R483J2782L1090j7708M140j0832q383O354R753J7114
$$ -17556 -4517 -13238 -37975 -28492 -15710 15380 -2328 1812 -9020 -17403 -11049 -1296 15818
13161A5818o141j6922l6092J1042J0728J428j0614j1421k5092j5509J1026K2018
$$ 15818 9677 -7245 -43337 -32295 -21567 -20139 -30753 -42174 -67266 -82775 -71749 -49731
13149d9731J4598q050O906K1770k875L2340J5488k1400o113R236K846l812r808
$$ -49731 -35133 -43183 -36277 -14507 -17382 14958 30446 9046 2933 12169 15015 11203 1395
13136A395M238O514k2991j3665K9228J2062M155k428J1978n474J7855r215j3237
$$ 1395 5633 12147 -10844 -24509 4719 16781 20936 18508 30486 25012 42867 33652 20415
13123B0415q448j387Q879L660k807k2063J613J8988O491N186n682o110r754j250
$$ 20415 11967 10580 19459 23119 20312 -1751 -138 18850 25341 30527 24845 18735 8981 7731
13109G731o922r178k3644M065N164k806k293Q310L0083L3327j6694N342j7874
$$ 7731 809 -8369 -32013 -27948 -22784 -25590 -27883 -19573 10510 43837 27143 32485 14611
13096A4611k7583j854R347M158k654j4569L783K9670L009L745m277l771j20p929
$$ 14611 -12972 -14826 -5479 -1321 -3975 -18544 -14761 14909 17918 21663 17386 13615 13495 5566
13082E566km224k1796r252J3823K47o207M184n527J1942J404J5165j1654n244
$$ 5566 5564 1340 -20456 -29708 -15885 -15638 -21845 -17661 -23188 -11246 -9842 5323 -6331 -11575
13068a1575N267l341J769K4991J7103j682l6220P269K8656j6833R931N555k0708
$$ -11575 -6308 -9649 -7880 17111 34214 32532 -3688 3581 32237 15404 25335 30890 10182
13055A0182o058o912L461j23r622J1503o497N29o993n035j2404l5177P667K3415
$$ 10182 4124 -2788 673 550 -9072 2431 -4066 -3537 -10530 -15565 -27969 -63146 -55479 -32064
13041c2064J1663L0415J934j6416l183P163J7769J1269J0905j8233j3330j8078
$$ -32064 -20401 10014 11948 -4468 -7651 -488 17281 28550 39455 21222 7892 -10186
13029a0186r217L285n090K002N077j2722q924J4433O334n770R232K193j3533k8822
$$ -10186 -19403 -16118 -21208 -19206 -14129 -26851 -35775 -21342 -15008 -20778 -11546 -9353 -22886 -51708
13015e1708J2641O556J5761J1565q923M27k0871K1438J2463Q170J5314J1270j2025
$$ -51708 -39067 -32511 -16750 -5185 -14108 -13681 -34552 -13114 -651 7519 22833 34103 22078
13002B2078l5399k8928J8389J8821l788J4426n740j2544J1348J347j547k571K57
$$ 22078 -13321 -42249 -23860 -5039 -8827 5599 -141 -12685 -1337 10 -1537 -4108 -3851
12989c851j718p906k6876j0183J870J2095K1635J3558Q371O103r202J4035N584
$$ -3851 -5569 -13475 -40351 -50534 -48664 -36569 -14934 -1376 6995 13098 3896 17931 23515
12976B3515j4151N455L064j9810j4498Q173J4311n950j2203k5715Q343Q468J0238
$$ 23515 9364 14819 17883 -1927 -16425 -8252 6059 109 -12094 -37809 -29466 -20998 -10760
12963a0760O163R869J2257q936J668n957q236J0020k0312j4676n483j3702J8465
$$ -10760 -4597 5272 17529 8593 10261 4304 -3932 6088 -14224 -28900 -34383 -48085 -29620
12950b9620J1916J3485j0908j1622O090l552J2915J2091m179N716J0140j2095
$$ -29620 -17704 -4219 -15127 -26749 -20659 -24211 -11296 795 -3384 2332 12472 377
12938C77j4878k885M038K5147o13J2968N854k590j3596K104q414p592K7985L467
$$ 377 -14501 -17386 -13348 11799 11186 24154 30008 27418 13822 15926 7512 -80 27905 31372
12924C1372j2004j8304m138M959M213j0102j0260j5654o757K2862J0539J8375
$$ 31372 19368 1064 -3074 1885 6098 -4004 -14264 -29918 -36675 -13813 -3274 15101
12912A5101P606O965k2563o097L5580J7822N39M130l1895k2078Q186L946L69O936
$$ 15101 22707 29672 7109 1012 36592 54414 54953 59083 27188 5110 13296 17242 17611 24547
12898B4547p563J3127K268k0689k8889l57k682j3377O04L559J4526O375M3928
$$ 24547 16984 30111 32379 11690 -17199 -17556 -20238 -33615 -33011 -29452 -14926 -8551 35377
12885C5377L7470k1126l0908k9355j0769Q974N460Q76M15k4697j0256R119J9956
$$ 35377 72847 51721 20813 -8542 -19311 -10337 -4877 -4001 -3586 -28283 -38539 -29420 -9464
12872i464O315k4106P590k480j0030j7225M549J4223L726n274K1866J6081L4096
$$ -9464 -3149 -27255 -19665 -22145 -32175 -49400 -44851 -30628 -26902 -32176 -10310 5771 39867
12859C9867J6086l4565j3690q317q159K6363K0784J44j2013l816r430l0869k2555
$$ 39867 55953 21388 7698 -619 -8778 17585 38369 38513 26500 22684 13254 -17615 -40170
12846d0170J1425J5922l846J4041r264O859O694j7177j3603P779o302j2098J2405
$$ -40170 -28745 -12823 -16669 -2628 -11892 -5033 1661 -15516 -29119 -21340 -27642 -39740 -27335
12833b7335K0705K1412J6808j4575k7396j6592R786P389J2106J7550l771J943
$$ -27335 -6630 14782 31590 17015 -10381 -26973 -17187 -9798 2308 19858 16087 18030
12821A8030k2680k4895k998J2004J2909R384j8587k5703J4453L7320K0328K15
$$ 18030 -4650 -29545 -32543 -20539 -7630 1754 -16833 -42536 -28083 9237 29565 29780
12809B9780M370j4145j4250l799m636j8979O569K4331K976j272J3392L943j4124
$$ 29780 34150 20005 5755 1956 -2680 -21659 -15090 9241 12217 10945 24337 28280 14156
12796A4156K2294K9130j7667j9687j3688m387j4164p284J5109Q935j0630j0226
$$ 14156 36450 65580 47913 28226 14538 10151 -4013 -11297 3812 12747 2117 -8109
12784h109r392m205Q226R915j735O412K473j1363l411M883R573J0073o776j9722
$$ -8109 -17501 -21706 -13480 -3565 -5300 1112 3585 -7778 -11189 -6306 3267 13340 6564 -13158
12770a3158l737J0001J9971J3539K404j2178k3602k341J314j5989j207K51O501
$$ -13158 -16895 -6894 13077 26616 29020 16842 -6760 -9101 -7787 -23776 -24983 -24732 -18231
12757a8231N046k277J2642J7080j6499J248J8069J5146m199p69R456j0412k4241
$$ -18231 -13185 -15462 -2820 14260 -2239 -991 17078 32224 28025 27256 36712 26300 2059
12744B059m0668J1086J32j855j4267K03k0806M766K0562K9636J7976j3815J4430
$$ 2059 -38609 -27523 -27391 -29246 -43513 -43310 -64116 -59350 -38788 -9152 8824 -4991 9439
12731I439J5025j5609j1067m918M150M684j4731o398Q227j6090o440j3034J199
$$ 9439 24464 8855 -2212 -7130 -2980 1704 -13027 -19425 -11198 -27288 -33728 -46762 -45563
12718d5563Q814J3474J2587P020m730j0845j0259P49J8501K132K0079J8516J484
$$ -45563 -36749 -23275 -10688 -3668 -8398 -19243 -29502 -28753 -10252 -8120 11959 30475 31959
12705C1959l2627k6746k015K9710K7232M877m379j1424j1129n970J5528l336l320
$$ 31959 -668 -27414 -29429 281 27513 32390 28011 16587 5458 -512 15016 11680 8360
12692H360o826Q066Q356k545n051l350J0953n093k0130L9471J9990j8623j4938
$$ 8360 1534 9600 17956 15411 10360 7010 17963 12870 -7260 32211 52201 33578 18640
12679A8640k4602k0025j3955J2179J7665R467L977O619J614j1784K812j0132j3898
$$ 18640 -5962 -25987 -39942 -27763 -10098 -631 3346 9965 11579 -205 2607 -7525 -21423
12666b1423K3074j9R136J2893M287p823k3577j1709k3651r617K2870K1278O353
$$ -21423 1651 1632 10768 23661 27948 20125 -3452 -15161 -38812 -48429 -25559 -4281 2072
12653B072K017J5029n028k4637L453J23J2969K3839l695r374j4611J4445J7714
$$ 2072 4089 19118 14090 -10547 -7094 -6971 5998 29837 26142 16768 2157 16602 34316
12640C4316o231q374q09j3296M253k855j469r315J678R450J7677j222j8107l1312
$$ 34316 28085 19711 18902 5606 9859 7004 5535 -3780 -2102 7348 25025 23803 5696 -25616
12626b5616L793K9351l63j6381N227K6276J9058o400n69J0868k441N58l529l1265
$$ -25616 -21823 7528 7165 -9216 -3989 22287 41345 34945 34376 45244 42803 43361 39832 8567
12612H567N142l733J1193J7150j2011k3334q975L867K1583j7088q797P904n22
$$ 8567 13709 9976 21169 38319 26308 2974 -6001 -2134 19449 2361 -6436 1468 946
12599I46K1967O868j0232j9969j8472J2013L8205N077O43m899r362Q773k5018
$$ 946 22913 29781 19549 -420 -18892 -6879 31326 36403 37046 32147 22785 31558 6540
12586F540k3375o357j4304k579J5911J6690K0266J6707p689l524j6236l0247j4299
$$ 6540 -16835 -23192 -37496 -40075 -24164 -7474 12792 29499 21810 18286 2050 -28197 -42496
12573d2496k3890J8048J1750P924K6609L4019O58l9187k3866J8420J3145J3895
$$ -42496 -66386 -48338 -36588 -28664 -2055 31964 32622 -6565 -30431 -12011 1134 15029
12561A5029k114r739P536N679j7945K875J5558k3032p255L942j4531L532K2387
$$ 15029 12915 3176 10712 16391 -1554 1321 16879 -6153 -13408 -9466 -23997 -20465 1922
12548A922K9443p451J1851L3455n648k2097l0335l035J534r824o536M649j4550
$$ 1922 31365 23914 35765 69220 63572 41475 11140 8105 9639 -185 -6721 -2072 -16622
12535a6622m311P700J0892J633o065n796K2948q916J0129j5915k4648K5169K5879
$$ -16622 -20933 -13233 -2341 -708 -6773 -12569 10379 1463 11592 -4323 -28971 -3802 22077
12522B2077O966K332J5896J701k6215M884k645r32k775l2000j8976L6570L0009
$$ 22077 29043 31375 47271 48972 22757 27641 24996 24064 21289 -10711 -29687 6883 36892
12509C6892p622j2124k088m169J333J3383J3220k7111J887J6506J2818q30k321
$$ 36892 29270 17146 15058 10889 12222 25605 38825 11714 13601 30107 42925 42095 39774
12496C9774m839j3876k8651j8651o314J7931L5873J4029j0668j2748j4361j3497
$$ 39774 34935 21059 -7592 -26243 -32557 -14626 21247 35276 24608 11860 -2501 -15998
12484a5998K5437m279j7878p56l239l740M995R856J7336J1277J0493j1344j1942
$$ -15998 9439 5160 -12718 -13474 -16713 -20453 -15458 -5602 11734 23011 33504 22160 10218
12471A0218j339P833J1345J3944j4995j499o455J6627k906o654k0563j1486l2253
$$ 10218 8879 16712 28057 42001 27006 25507 19052 35679 32773 26119 5556 -5930 -38183
12458c8183l390K2204M158J1184R951p42J968K826j4758M983J97K413j812q056
$$ -38183 -41573 -19369 -15211 -4027 5924 5182 7150 9976 -4782 201 398 2811 999 -7057
12444g057J0329O989P590K5818o99j2413k468k031O704j493k0696j4908J1799
$$ -7057 3272 10261 17851 43669 42970 30557 28089 26058 32762 31269 10573 -4335 7464
12431G464L5860J0842j2353N862L697j2320J0095L688j6936k6803R422P318p940
$$ 7464 43324 54166 41813 47675 51372 39052 49147 52835 35899 9096 18518 25836 17896
12418A7896L503J0648j2234O855j2675j9263r85n011K3758N09k548m269Q7J4923
$$ 17896 21399 32047 19813 26668 13993 -5270 -6255 -11266 12492 13001 10453 6184 6271 21194
12404B1194J986J3910j4125j8824q663O365p466L554n21l2168J9199J1901P657
$$ 21194 23180 37090 22965 4141 -4522 1843 -5623 -2069 -2590 -34758 -15559 -3658 3999
12391C999O560r918P558J7196K672J8088j466p773J0974O576q406K5596R14k3933
$$ 3999 10559 641 8199 25395 28067 46155 44689 36916 47890 54466 46060 71656 72570 48637
12377D8637L644o480k0378O483r358j1118p402j2436O82p226K2415K1153R299
$$ 48637 52281 45801 25423 31906 22548 11430 4028 -8408 -7726 -14952 7463 28616 37915
12364C7915J2142o87k901j9867N12N128o488N844o092n125p816r316j846J966
$$ 37915 50057 49370 46469 26602 27114 32242 25754 31598 25506 20381 12565 3249 1403 3369
12350C369j713L125K5541P114M720j455m616K1293J2017r771L045k1330j5290
$$ 3369 1656 4781 30322 37436 42156 40701 36085 57378 69395 59624 62669 41339 26049
12337B6049N465J5310J1959k8961k4268M501R354j2440q077n904K7839K1250M645
$$ 26049 31514 46824 58783 29822 5554 10055 19409 6969 -1108 -7012 20827 42077 46722
12324D6722m194j0611j7209k217J4714j1763Q856k3564j3125o509K0103J7274
$$ 46722 42528 31917 14708 12491 27205 15442 24298 734 -12391 -18900 1203 18477
12312A8477J217J1471K4707K2249k0583k1482k5087j4140J4834K3795J8734J0310
$$ 18477 19694 31165 55872 78121 57538 36056 10969 -3171 11663 35458 54192 64502
12300F4502j2309j0392k0630M992K2659M705l231J6598j86l0418j601r422M125
$$ 64502 52193 41801 21171 26163 48822 53527 50296 66894 66708 36290 34689 25267 29392
12287B9392P848K7331j1144p771L442q661O301Q034K4283m675k2947k629r177
$$ 29392 37240 64571 53427 45656 49098 40437 46738 54772 79055 74380 51433 48804 39627
12274C9627K9801J9717j1738m120j2002o330K486j1052j3656J5674R41J8050J2539
$$ 39627 69428 89145 77407 73287 61285 54955 57441 46389 32733 48407 49348 67398 79937
12261G9937O243O149j1482L173j9327K342n790P770N56j3754k3524p736J8778
$$ 79937 86180 92329 80847 84020 64693 67035 61245 69015 69571 55817 32293 24557 43335
12248D3335J5786m016m3R352j5665k2265J2k254J8096J2770o306P789j433R024
$$ 43335 59121 55105 55062 64414 48749 26484 26496 24242 42338 55108 48802 56591 55158 64182
12234F4182N296m704J3225K8137K1228j858j7671K19j3527L322m58k464l171r200
$$ 64182 69478 64774 77999 106136 127364 125506 107835 108054 94527 97849 97391 94927 91756 82556
12220H2556m768L750K1422K4822q616l2113j8669J4199j03N221n052Q023J0462
$$ 82556 77788 81538 102960 127782 119166 87053 68384 82583 82480 87701 82649 90672 101134
12207A01134j9119q642K7408J3725J2184q383M271K301R253j8184J027J0900j8994
$$ 101134 82015 73373 100781 114506 126690 118307 122578 124879 134132 115948 116975 127875 108881
12194A08881r05o650q900R548j441k206j1637K8492J4928l617P09K415J273j5248
$$ 108881 107976 101326 92426 101974 100533 98327 86690 115182 130110 126493 127202 129617 130890 115642
12180A15642j9711j225j2169j1825K1764L0087k228r556J7297j550K590J935j8329
$$ 115642 95931 94706 82537 70712 92476 122563 120335 110779 128076 126526 129116 131051 112722
12167A12722p544o420j9085J140K3823J2474k595o48J3644K2505j5965k4690K973
$$ 112722 105178 98758 79673 80813 104636 117110 114515 113867 127511 150016 134051 109361 112334
12154A12334J4327N808J4373M521O049N001k987k3634J8793K7430j1772k8381
$$ 112334 126661 132469 146842 151363 157412 162413 159426 135792 154585 182015 170243 141862
12142A41862J4384J1977j3982r764L2744J0496k2595j3830L266l222L566j2267
$$ 141862 156246 168223 154241 144477 177221 187717 165122 151292 154558 151336 154902 142635
12130A42635L907N689J0942j650L8054L0756J6087j1321j3202K0003j2942k8799
$$ 142635 146542 152231 163173 161523 199577 230333 246420 235099 221897 241900 228958 200159
12118B00159Q03r399O597J8305K7196J9065q119K535j5713j1335O34J769R085
$$ 200159 200962 191563 198160 216465 243661 262726 254607 257142 241429 230094 230728 232497 241582
12105B41582J393J1994J4746l579j9827k1602j3055K0240J2851o718N393L3460
$$ 241582 242975 254969 269715 266136 246309 224707 211652 231892 244743 238025 243418 276878
12093B76878J2559K945n025m009M124K8601Q785L428J9426J342p644k1069j7177
$$ 276878 289437 292382 287357 283348 287472 316073 324858 328286 347712 349054 341410 320341 303164
12080C03164J2386j4597K7456K0844O762R316P399p676P652J5887j6803l9194
$$ 303164 315550 300953 328409 349253 356015 365331 372730 365054 372706 388593 371790 332596
12068C32596m282M4338L4050J4167k4211l401R142K7359K6093p519k4356J1877
$$ 332596 328314 372652 406702 420869 396658 393257 402399 429758 455851 448332 423976 435853
12056D35853K1150J541J287O668j78R746K473K4597J8145K032K011K19K294J8224
$$ 435853 457003 458544 459831 466499 466321 476067 478540 503137 521282 523314 525325 525544 527838 546062
12042E46062K5944r034J5005M6586m54n989M615L4458J2163O922L6167K2081P080
$$ 546062 572006 562972 577977 624563 624109 618120 622735 657193 669356 676278 712445 734526 741606
12029G41606q556q217J5201K5885n313n361J2422J1443M2703O6991K2368k3660
$$ 741606 733050 724833 740034 765919 760606 755245 767667 779110 821813 888804 911172 887512
12017H87512j0001K0210J8549K9621L2069J6752J3469K9384K8145J7901l286M0061
$$ 887512 877511 897721 916270 945891 977960 994712 1008181 1037565 1065710 1083611 1080325 1120386
12005A120386M2242J4827J5284M8306M1246J2841K7318K5350P436L6250M4589
$$ 1120386 1162628 1177455 1192739 1241045 1282291 1295132 1322450 1347800 1355236 1391486 1436075
11994A436075K2894J7225K6727K2885P5627M7044K5970L7189N4551N0062K9483
$$ 1436075 1458969 1476194 1502921 1525806 1601433 1648477 1674447 1711636 1766187 1816249 1845732
11983A845732M1659O7123M9038N7787O6056L8783L2132O0473P6558O6668O5726
$$ 1845732 1887391 1954514 2003552 2061339 2127395 2166178 2198310 2258783 2335341 2402009 2467735
11972B467735P2127N6770N2905P9301Q6494P2509P2201R8324Q6927P3025O6058
$$ 2467735 2539862 2596632 2649537 2728838 2815332 2887841 2960042 3058366 3145293 3218318 3284376
11961C284376N7466P3573Q6781Q5880Q2324Q3662Q7886P8822P6377Q8529P9634
$$ 3284376 3341842 3415415 3502196 3588076 3670400 3754062 3841948 3920770 3997147 4085676 4165310
11950D165310R0234Q8356R0642Q3388Q7422P4079O4658M5102M7722Q0285O4225
$$ 4165310 4255544 4343900 4434542 4517930 4605352 4679431 4744089 4789191 4836913 4917198 4981423
11939D981423N6390N7323N1022L7339K2470Q991J0164P962j1885J6857o991l0256
$$ 4981423 5037813 5095136 5146158 5183497 5205967 5214958 5225122 5233084 5221199 5238056 5231065 5200809
11927E200809j9119j0214k8498k6484j8999m9560q1662m5811n5340p1432r1808
$$ 5200809 5181690 5171476 5142978 5116494 5097495 5047935 4966273 4920462 4865122 4793690 4701882
11916D701882p3685n7973o5550p1209n9921q4809j20746q8273q1686r9761p8226
$$ 4701882 4628197 4570224 4504674 4433465 4373544 4288735 4167989 4079716 3998030 3898269 3820043
11905C820043p7703p0164q3331n5828o6186q7330j02081j01774p2910m4482n3702
$$ 3820043 3742340 3672176 3588845 3533017 3466831 3379501 3277420 3175646 3102736 3058254 3004552
11894C004552m8766o2169p1780q8151q1385r1214p6595o5550n8748m9853o0728
$$ 3004552 2955786 2893617 2821837 2733686 2652301 2561087 2484492 2418942 2360194 2310341 2249613
11883B249613n6273m6623l5445l9916n6247p2425m6367l5302l0397l4660m0371
$$ 2249613 2193340 2146717 2111272 2071356 2015109 1942684 1896317 1861015 1830618 1795958 1755587
11872A755587k8848l9802n5122l8345k4319m5685m1311k5478l5844k6485k1770
$$ 1755587 1726739 1686937 1631815 1593470 1569151 1523466 1482155 1456677 1420833 1394348 1372578
11861A372578l3314j5933k6077q347k0482l1858k3609l2409l5189j3434q911j9046
$$ 1372578 1339264 1323331 1297254 1288907 1268425 1236567 1212958 1180549 1145360 1131926 1123015 1103969
11849A103969l6035l0954k4752j2162l2962m9714l0440j185q051k4473M000k9733
$$ 1103969 1067934 1036980 1012228 1000066 967104 917390 886950 885765 877714 853241 857241 827508
11837H27508k6203J282j6652k3454j1493k524j7607j9104k8798K648j1079O597
$$ 827508 801305 802587 785935 762481 750988 748464 730857 711753 682955 685603 674524 681121
11825F81121Q029k8175k0654n567p453j033k074j0797N757q815j6407k4256J4318
$$ 681121 689150 660975 640321 634754 627301 626268 624194 613397 619154 610339 593932 569676 583994
11812E83994j4070Q931l572p740K702l196k7674k5916L759m5181l1672K899q76
$$ 583994 569924 578855 575283 567543 570245 567049 539375 513459 517218 472037 440365 443264 442388
11799D42388m448q6J1199k62j1649k4884j3404J016j505J007J5235R637m899j9464
$$ 442388 437940 437854 449053 448791 437142 412258 398854 399870 398365 399372 414607 424244 419345 399881
11785C99881k4175p21r287j1903l778o220j9539j3782J3311R88l727L16j8324
$$ 399881 375706 374985 365698 353795 350017 343797 324258 310476 323787 324775 321048 321364 303040
11772C03040j4369k387J1191k941j254K558p811j4710n582J310K8843n326p567
$$ 303040 288671 286284 297475 294534 293280 295838 288027 273317 267735 269045 297888 292562 284995
11759B84995j7873n901N68P513M735k8872l6131J093K6720P635O928k971j3161
$$ 284995 267122 261221 261789 269302 274037 245165 209034 210127 236847 244482 251410 248439 235278
11746B35278L193N332r615k856k1812R533K704o047q580N109J5708m851K608N014
$$ 235278 238471 243803 234188 231332 209520 219053 221757 215710 207130 212239 227947 223096 225704 230718
11732B30718m358p022k2513Q592k0570L631j3592J153J5106k1422j0252K7998
$$ 230718 226360 219338 196825 205417 184847 188478 174886 176039 191145 169723 159471 187469
11720A87469M263L867r19j2363m190j807J2324N97l3209j6349p967p16l58J556
$$ 187469 191732 195599 194680 182317 178127 176320 188644 189241 156032 139683 131716 131000 130642 132198
11706A32198K0599J3775o82j8529k7871n548j6529P198J1127J7861P176N540J0319
$$ 132198 152797 166572 165890 147361 119490 113942 97413 104611 115738 133599 140775 146315 156634
11693A56634K733J5425k4475m5779J0126J0055n193q114K6797J0892J1578O534
$$ 156634 159367 174792 150317 104538 114664 124719 119526 111412 138209 149101 160679 167213
11681A67213k0341q403l631l006j8176Q938J290o685L738Q112o358J679J0335
$$ 167213 146872 138469 134838 131832 113656 122594 123884 117199 120937 129049 122691 124370 134705
11668A34705j9966L455j0796r716N155r1P614p367j0244k605j1879j3336J7630
$$ 134705 114739 118194 107398 97682 102837 102746 110360 102993 92749 90144 78265 64929 82559
11655H2559K910m860j8260r785J5906j3215P950J1417N780p557K306K6388L079
$$ 82559 85469 80609 62349 52564 68470 55255 63205 74622 80402 72845 75151 101539 104618
11642A04618l19j8443j7749j146J3478k2013l473L5592M419j5031j1279Q927j1868
$$ 104618 104299 85856 68107 66961 80439 58426 54953 90545 94964 79933 68654 77581 65713
11629F5713k8049m183M918J4859R694j6533r747J9629L888j9661j5802j678R863
$$ 65713 37664 33481 38399 53258 62952 46419 36672 56301 60189 40528 24726 23048 32911
11616C2911P243L029R716R781Q17k313O663q931j5566k6166J2416N88P778p250
$$ 32911 40154 43183 52899 62680 63497 61184 67847 58916 43350 17184 29600 30188 37966 30716
11602C0716J4182J1556J6095q956j3247q730j4891J0287K1859L6788p291l6114
$$ 30716 44898 56454 72549 63593 50346 41616 26725 37012 58871 95659 88368 52254
11590E2254j5096j55R843J1060K4408j0151k0227n0521m546J6864K4445k992j2800
$$ 52254 37158 37003 46846 57906 82314 72163 51936 1415 -3131 13733 38178 35186 22386
11577B2386J5588L419M501k0600k236K630J4679J1039j3740o671N972Q022j3555
$$ 22386 37974 41393 45894 25294 23058 25688 40367 51406 37666 30995 36967 44989 31434
11564C1434l420m803J3558J4449L0L446O636K544O493j0290j7540j2362j1267
$$ 31434 28014 23211 36769 51218 51248 54694 61330 63874 70367 60077 42537 30175 18908
11551A8908j4530m479K3264p906q419P756K2316r223L297K4985J4094j6640p06
$$ 18908 4378 -101 23163 15257 6838 14594 36910 27687 30984 55969 70063 53423 52717
11538E2717L408j65l333L305J3186J446L665m904j9400j6192k9867q130L7587
$$ 52717 56125 55960 52627 55932 69118 70564 74229 69325 49925 33733 3866 -4264 33323
11525C3323J3383j1579j7163Q435J0513k1465k9449P945K5146K6085J89Q058K014
$$ 33323 46706 35127 17964 26399 36912 15447 -14002 -6057 19089 45174 45363 53421 55435
11512E5435l2790K809K3531L651J0882j5289j6720K460J1124J0503O042Q27j4548
$$ 55435 22645 25454 48985 52636 63518 48229 31509 33969 45093 55596 61638 62465 47917
11499D7917r536J4148K758j8565j3082N521N48R520N869k9855l803J6328j4122
$$ 47917 38381 52529 55287 36722 23640 29161 29709 39229 45098 15243 11440 27768 13646
11486A3646k0582j2629L7310N8700j0876l875M611j0908j738k504j1619j363j439
$$ 13646 -6936 -19565 17745 76445 65569 61694 66305 55397 53659 51155 39536 38173 36734
11473C6734j0207K4030J3079N242o691P394k4887k6701j3008N920J9416J5342
$$ 36734 26527 50557 63636 68878 62187 69581 44694 17993 4985 10905 30321 45663
11461D5663J0310k5187j7474k341R601K683J9912j5208k9738N60n571n233K309
$$ 45663 55973 30786 13312 10971 20572 23255 43167 27959 -1779 -1219 -6790 -12023 -9714
11448i714q795L696J6185j2438Q514J3947j0180J531J4994K0719L980o664j1370
$$ -9714 -18509 -14813 1372 -11066 -2552 11395 1215 2746 17740 38459 42439 35775 24405
11435B4405j4250K1213j4035N5q401j5312J0753J6938o31n7j1179j8409o1j268
$$ 24405 10155 31368 17333 17388 8987 -6325 4428 21366 20735 20678 9499 -8910 -8971 -10239
11421a0239K627J1985K0084q263n784j9196o00O235O652P70K1570m999l5574K3713
$$ -10239 -7612 4373 24457 16194 10410 -8786 -9386 -3151 3501 4271 25841 20842 -14732 8981
11407H981K4167k123k5772J481j033j4541j0816j9844P498K1542O039n563K814
$$ 8981 33148 31025 5253 6734 5701 -8840 -19656 -39500 -32002 -10460 -4421 -9984 -7170
11394g170K3402n736J9167Q104j3188j2042j8311O854J6297K831L311k2658j72
$$ -7170 16232 10496 29663 37767 24579 12537 -5774 1080 17377 20208 23519 861 689
11381F89P664L5317o53r686j7040k2674K602J2170J5847J3967J567k3794j353
$$ 689 8353 43670 43017 33331 16291 -6383 -3781 8389 24236 38203 39770 15976 14623
11368A4623q712j4973K0355K668J4545o114k1324k0770j0768K7892L781k2630
$$ 14623 5911 -9062 11293 13961 28506 22392 1068 -19702 -30470 -2578 1203 -21427
11356b1427p844J9514M1450p772p703k8089j210L478p630k771L009K1459L1857
$$ -21427 -29271 -9757 31693 23921 16218 -11871 -13081 -9603 -17233 -20004 -16995 4464 36321
11343C6321o954k0944j4159J5196j7333q738J5382K7138J3278p327k2580k4076
$$ 36321 29367 8423 -5736 9460 -7873 -16611 -1229 25909 39187 31860 9280 -14796
11331a4796p512j5051M685J9497O842J699R129Pk3034L28M347L4307N767J0026
$$ -14796 -22308 -37359 -32674 -13177 -6335 -4636 4493 4500 -18534 -18206 -13859 20448 26215 36241
11317C6241p133k6792k1266j955K591K7095K4353R566k8128k034j0434j4562M932
$$ 36241 29108 2316 -18950 -20905 -18314 8781 33134 42700 14572 12538 2104 -12458 -7526
11304g526o234J789l230J8459K3559r08l6749l600p099k924J3112J4912J860r757
$$ -7526 -13760 -11971 -15201 3258 26817 25909 -10840 -14440 -21539 -24463 -11351 3561 5421 -4336
11290d336m588k1016j5617L060K2018O166M097J5577K7653j2756k2027J004J7107
$$ -4336 -8924 -29940 -45557 -42497 -20479 -14313 -10216 5361 33014 20258 -1769 -765 16342
11277A6342j1965j2370k1147J6984J892O87j2157j5469k0330r712J3101M6064
$$ 16342 4377 -7993 -29140 -12156 -10264 -9577 -21734 -37203 -57533 -67245 -54144 -8080
11265h080R359j0478J7932J3357R317K1784q906p598j1685k4492j5128R170K6644
$$ -8080 1279 -9199 8733 22090 31407 53191 44285 36687 25002 510 -14618 -5448 21196
11252B1196J7310L088j1172q787k659L637J0474j9714k0285L160m137J3334l190
$$ 21196 38506 41594 30422 21635 18976 22613 33087 13373 -6912 -3752 -7889 5445 2255
11239B255j2114p729m485O624J6833J1387J3453J2346j2760k1155j4395M86J8026
$$ 2255 -9859 -17588 -22073 -15449 1384 12771 26224 38570 25810 4655 -9740 -9254 8772
11226H772J3849k7761j4183J4955N558J994j0932l381J821J024m280m26j7089
$$ 8772 22621 -5140 -19323 -4368 1190 3184 -7748 -11129 -9308 -8284 -12564 -12990 -30079
11213c0079K3577J8382k0380j6876n994j3022R919P546k728J1739R247K2553J0613
$$ -30079 -6502 11880 -8500 -25376 -31370 -44392 -34473 -26927 -29655 -17916 -8669 13884 24497
11200B4497J2438j2001l8081J909k05j0440J742m206N537L390R985K0929K485
$$ 24497 36935 24934 -13147 -11238 -11443 -21883 -20141 -24347 -18810 -15420 -5435 15494 17979
11187A7979k2451m860j4626k2194n907K100J2838P816j4305M759L3609K3955j7405
$$ 17979 -4472 -9332 -23958 -46152 -52059 -49959 -37121 -29305 -43610 -38851 -5242 18713 1308
11174A308j6382J6396R206j9867p870j0267J3217j3630j6342L401J9539J6216
$$ 1308 -15074 1322 10528 -9339 -17209 -27476 -14259 -27889 -44231 -40830 -21291 -5075
11162e075J2696l0915j7745m850Q117Q59L248P349O002j2354k2687j3867J346
$$ -5075 7621 -23294 -41039 -45889 -37772 -36913 -33665 -26316 -20314 -32668 -55355 -69222 -67876
11149f7876J3200O434J0619J5735r687j3755L073j6132J775K6020N0147n300k0099
$$ -67876 -54676 -48242 -37623 -21888 -31575 -45330 -42257 -58389 -56614 -30594 19553 14253 -5846
11136e846J2167j2607K473O940j7421j6688M651j6144j1224K15J1067J6980j1510
$$ -5846 6321 -6286 -3813 3127 -14294 -30982 -26331 -42475 -53699 -53484 -42417 -25437 -36947
11123c6947l4790N520J8708M971j4005K2589P715K083K9187q965p919N19o401
$$ -36947 -71737 -66217 -47509 -42538 -56543 -33954 -26239 -24156 5031 -3934 -11853 -11334 -17735
11110a7735O662j0864j6365l395j1749P92J8192O772Q922J8457J4687j1734k3814
$$ -17735 -11073 -21937 -38302 -41697 -53446 -52654 -34462 -27690 -18768 -311 14376 2642 -21172
11097b1172m536L689J7986J507j3678j2545m266k839J4392J1613M641K561K624
$$ -21172 -25708 -22019 -4033 -2526 -16204 -28749 -33015 -35854 -21462 -9849 -5208 -2647 -23
11084b3M571K2401p65k7915n0438j7741p535L4398R052j9454r356K5621L7310
$$ -23 4548 26949 26184 -1731 -52169 -69910 -77445 -43047 -33995 -53449 -62805 -37184 126
11071A26K7522j2909j4943j11M125k96n639J250m209q761J35k2405N507K5582
$$ 126 27648 14739 -204 -315 3810 3514 -2125 -875 -5084 -13845 -13710 -36115 -30608 -5026
11057e026o658j7286m210n04K2503L946j3480M14K115K0709K0067m55n96k156
$$ -5026 -11684 -28970 -33180 -33684 -11181 -7235 -20715 -20301 -18186 2523 22590 22135 21539 19383
11043A9383R140r166m765N024m751o718p04J1385L7744L2898K8396k79l977l9065
$$ 19383 28523 19357 14592 19616 14865 8147 7443 18828 56572 89470 117866 117587 113610 74545
11029G4545k0605K18k7590q591K0937M3923L7016L3903M5911Q297j2904l7168
$$ 74545 53940 54158 26568 17977 38914 82837 119853 153756 199667 207964 195060 157892
11017A57892l9536j5212k1115k1468J436M436P103M171L1702Q247j6054l4113
$$ 157892 118356 103144 82029 60561 61997 66433 73536 77707 109409 117656 101602 67489
11005F7489j2771k1777j8213k978K147J1313R372J1027K660j0110K731k135k6738
$$ 67489 54718 32941 14728 11750 13897 25210 34582 45609 48269 38159 40890 38755 12017
10992A2017m0657k4164p214k148J2298p471j190j3781K1674j036k3812J7290K4761
$$ 12017 -28640 -52804 -60018 -62166 -49868 -57339 -58529 -72310 -50636 -51672 -75484 -58194 -33433
10979c3433J9790J0955J007J5317m704N98J7458K673l7071k1659J5879j0785k3829
$$ -33433 -13643 -2688 -1681 13636 8932 9530 26988 29661 -7410 -29069 -13190 -23975 -47804
10966d7804j64N473j7830N446K6074l009K359R720k3859j4681K6152J8698l17
$$ -47804 -47968 -42495 -60325 -54879 -28805 -31814 -29455 -19735 -43594 -58275 -32123 -13425 -13742
10953a3742j6288P885o50P803J4954q558J455r88J143Q082j0790j5408O366q747
$$ -13742 -30030 -22145 -22795 -14992 -38 -8596 -7141 -8129 -6986 1096 -9694 -25102 -18736 -27483
10939b7483L34j512j5207m530K926L163J0620J1906l671K991j7911j5646n463
$$ -27483 -27149 -28661 -43868 -48398 -45472 -42309 -31689 -19783 -23454 -20463 -38374 -54020 -59483
10926e9483K7390K6326k3136j6781J8767j203J2751L6948M575r50q346k2856L11
$$ -59483 -32093 -5767 -28903 -45684 -26917 -28120 -15369 21579 26154 25204 16858 -5998 -5687
10913e687J183j5591p537M949k2114j1854J2277K8412n409K384K2807J5111K7875
$$ -5687 -4504 -20095 -27632 -22683 -44797 -56651 -44374 -15962 -21371 -18987 3820 18931 46806
10900D6806R820k7123O573j0121j1147p348o943j4978j1869K3746n065j0437M876
$$ 46806 56626 29503 36076 25955 14808 7460 517 -14461 -26330 -2584 -7649 -18086 -13210
10887a3210r103k2475P098K8702k6533j8528Q692M5360J8926N475r356n087o901
$$ -13210 -22313 -44788 -37690 -8988 -35521 -54049 -45357 3 18929 24404 15048 9961 3060
10874C060R008j7041j7636p544j1891k0652J0228J2287J6418m605L0625O448j8840
$$ 3060 12068 -4973 -22609 -30153 -42044 -62696 -52468 -40181 -23763 -28368 2257 8705 -10135
10861a0135m916K40k773P063j2611J9654M100l374P631n24r437k2934Q994J1047
$$ -10135 -15051 -14811 -17584 -10521 -23132 -3478 622 -2752 4879 4355 -5082 -28016 -19022 -7975
10847g975N676O043N428l494p391j6786J509Q172K305n222j8735j210j0387L409
$$ -7975 -2299 3744 9172 5678 -1713 -18499 -16990 -8818 -6513 -11735 -30470 -31680 -42067 -38658
10833c8658O995J3585o315J1447K4919L711K430k1294P23K9920j4326l0519Q666
$$ -38658 -31663 -18078 -24393 -12946 11973 15684 18114 -3180 -2457 27463 13137 -17382 -8716
10820h716j1483j0902J533L1831k815j2291m922j5651Q057j3500Q338K0263o178
$$ -8716 -20199 -31101 -29568 2263 -552 -12843 -17765 -33416 -25359 -38859 -30521 -10258 -16436
10807a6436j647j661j9807q066K0312J8009M171o416j9984j232L3051N568O992
$$ -16436 -18083 -19744 -39551 -47617 -27305 -9296 -5125 -11541 -31525 -32757 294 5862 12854
10794A2854j2953j5736n705J310j6319J8389L4466k0906J0150K1560O924J2246
$$ 12854 -99 -15835 -21540 -20230 -36549 -18160 16306 -4600 5550 27110 34034 46280
10782D6280j8823l2879l7186m0323k6182j417L3035k852J3471K5583J0536J7864
$$ 46280 27457 -5422 -42608 -82931 -109113 -110530 -77495 -80347 -66876 -41293 -30757 -12893
10770a2893l6068k38o928n553n381p184n549r54M223O985j7342L4696K2584J6227
$$ -12893 -48961 -49199 -56127 -61680 -67061 -74245 -79794 -80748 -76525 -69540 -86882 -52186 -29602 -13375
10756a3375j0584j6115M784j6270M292J016k82J3233K775Q219M0936k006O081
$$ -13375 -23959 -40074 -35290 -51560 -47268 -46252 -46534 -33301 -30526 -22307 18629 16623 22704
10743B2704L1638L906J2198j8290k314L870L830o82j544L5630M8523N5364M7987
$$ 22704 54342 58248 70446 52156 49842 53712 57542 56860 55316 90946 139469 194833 242820
10730B42820J03253J77471K05554J82561J35841J17985J44998J65208N8769q7295
$$ 242820 346073 523544 729098 911659 1047500 1165485 1310483 1475691 1534460 1447165
10720A447165j61090j45539j14601j57508j98981k16061j35292p5745o0001o1320
$$ 1447165 1286075 1140536 1025935 868427 669446 453385 318093 242348 182347 121027
10710A21027l9063q434q217O162l5458k3554K048p733l984r954R070J462j5135
$$ 121027 81964 73530 65313 71475 36017 12463 14511 6778 2794 -7160 1910 3372 -11763
10697a1763k5655K265q647j2396p61L9217J1840J2612K45k1941k3550N789Q446
$$ -11763 -37418 -35153 -43800 -56196 -56957 -17740 -5900 6712 6957 -14984 -38534 -32745 -24299
10684b4299j4948j5512L956l951m802K7405j1879o242k797j0166j1989j4709N200
$$ -24299 -39247 -54759 -50803 -54754 -59556 -32151 -44030 -50272 -53069 -63235 -75224 -89933 -84733
10671h4733J9738K0551J2162N327p17j4171p593L1939K0455j9683k1898p665K0995
$$ -84733 -64995 -44444 -32282 -26955 -27672 -41843 -49436 -17497 2958 -16725 -38623 -46288 -25293
10658b5293r032p431Q042O715K1918O427k231J5480R538r384n443q894j3450m650
$$ -25293 -34325 -41756 -33714 -26999 -5081 1346 -885 14595 24133 14749 9306 412 -13038 -17688
10644a7688K1513O788l0727j9520L1222L7333K3541J9687J1869J1899L5841P6672
$$ -17688 3825 10613 -20114 -39634 -8412 28921 52462 72149 84018 95917 131758 208430
10632B08430Q1145R9756J14038Q9490Q2820R0221J24259J64822J65606J63806
$$ 208430 289575 389331 503369 592859 675679 765900 890159 1054981 1220587 1384393
10622A384393K43920M06794N39809P84884J109575J505231J876327J951550J468967
$$ 1384393 1628313 2035107 2574916 3359800 4469375 5974606 7850933 9802483 11271450
10613A1271450N38152m13198q37434p54507l57122K39899R91168J922189K988043
$$ 11271450 11809602 11396404 10558970 9804463 9447341 9687240 10678408 12600597 15588640
10604A5588640L925674M046722K676879J57319k116958k969385k477956j426097
$$ 15588640 19514314 23561036 26237915 26395234 24278276 21308891 18830935 17404838
10596A7404838k12913J107775K544659M031279N174472M944676K572905j260440
$$ 17404838 17191925 18299700 20844359 24875638 30050110 34994786 37567691 36307251
10588C6307251m379381n279934m427209k938596j502987k03963J079912K206863
$$ 36307251 31927870 26647936 22220727 19282131 17779144 17575181 18655093 20861956
10580B0861956K923128K576175P71448j809642l713587m078503l269743k191393
$$ 20861956 23785084 26361259 27132707 25323065 21609478 17530975 14261232 12069839
10572A2069839j268355m85213J35178O03683Q19199N43639k56051j252461j906684
$$ 12069839 10801484 10316271 10451449 11055132 11874331 12417970 12161919 10909458 9002774
10563I002774j963987j660309j248077r03686o59149m88981l49715k30610j80174
$$ 9002774 7038787 5378478 4130401 3226715 2567566 2078585 1728870 1498260 1318086
10554A318086j45531j19674j03506r8413o3304j04874r0352m5622l6457k2649
$$ 1318086 1172555 1052881 949375 850962 787658 682784 592432 546810 510353 487704
10544D87704l5403m3549k1225p197j5223n195k9267m1007j0315P80l698j1021
$$ 487704 452301 408752 387527 380330 365107 359912 330645 289638 279323 280103 276405 265384
10532B65384k0233m2232k5394J0611J7785O835j2666j2967K382J4241J8209L250
$$ 265384 245151 202919 177525 188136 205921 212756 200090 187123 189505 203746 221955 225205
10520B25205J7694K2262K6142J2833J5155J2230J0990M78l1853k2186m2213n3360
$$ 225205 242899 265161 291303 304136 319291 331521 342511 342989 311136 288950 246737 193377
10508A93377k4455j9781k6463q368j6470j6003J8778J4816j0536l0642L867K4428
$$ 193377 168922 149141 122678 114310 97840 81837 100615 115431 104895 74253 78120 102548
10496A02548J107j7969J3856J7839J1143j0310j5994m704K935j4377l742p800
$$ 102548 103655 85686 99542 117381 128524 118214 102220 97516 100451 86074 82332 74532
10484G4532R73N303J3744R702p891N855M629N936K5302j3709q365R902k5644k1339
$$ 74532 75505 80808 94552 104254 96363 102218 106847 112783 138085 124376 116011 125913 100269 78930
10470G8930P020n113l112J0541j9017p503P824l655k2988K0593K1280J5285q167
$$ 78930 85950 80837 77725 88266 69249 61746 69570 65915 42927 63520 84800 100085 91918
10457I1918k1190j4631K4779K9489k0992j7959R634K2903R363K4258k990K4523
$$ 91918 70728 56097 80876 110365 89373 71414 81048 103951 113314 137572 134582 159105
10445A59105J7887K008K6074j4880k0378O194l3750j9202K131k6566j4865o081
$$ 159105 176992 179000 205074 190194 169816 176010 142260 123058 125189 98623 83758 77677
10433G7677Q617k75q003J5276n748j1945k662j6362j2694J5491O182M3j024K247
$$ 77677 86294 86019 78016 93292 87544 75599 72937 56575 43881 59372 65554 65597 64573 66820
10419F6820J0765J0835j2051J275j259K2983J8231K407O477K326O171Q45J1044
$$ 66820 77585 88420 76369 77644 76385 99368 117599 120006 126483 128809 134980 135825 146869
10406A46869K2986k504J116N398L930n365j6749R119L0558K5453Q010p050j1657
$$ 146869 169855 167351 168467 173865 177795 172430 155681 164800 195358 220811 228821 221771 210114
10393B10114J4329J9550n083j9562r510J7847J3688q839j9417N874J2629K3411
$$ 210114 224443 243993 238910 219348 209838 227685 241373 232534 213117 218991 231620 255031
10381B55031J4508L0986K7784K7548R678J9451L1767M0133J2488M826P020M8949
$$ 255031 269539 300525 328309 355857 365535 384986 416753 456886 469374 474200 481220 530169
10369E30169M6865K0346P912Q536M5599N7770P8063Q6661Q8205P0713P6907Q6533
$$ 530169 577034 597380 605292 613828 659427 717197 795260 881921 970126 1040839 1117746 1204279
10357A204279R8345R1070Q8537J11684J44038J66775J74268K01287K46990L08797
$$ 1204279 1302624 1393694 1482231 1593915 1737953 1904728 2078996 2280283 2527273 2836070
10347B836070L65384M66005N34179N22580N59897P17039Q58004Q79731Q38020
$$ 2836070 3201454 3667459 4201638 4724218 5284115 6001154 6859158 7738889 8576909
10338H576909R22793J128607J445369J755911K141674K786925L752428N302413
$$ 8576909 9499702 10628309 12073678 13829589 15971263 18758188 22510616 27813029
10330B7813029P789317J1820933J8389232K8231912L9209949M2005754K9809141
$$ 27813029 35602346 47423279 65812511 94044423 133254372 175260126 205069267
10323B05069267J9570024K6704898L6496454J7882759j8995822l6892997k6499091
$$ 205069267 224639291 251344189 287840643 305723402 286727580 249834583 223335492
10316B23335492j8153050k9465466m1603669l8814503k6863525j7167406j1240557
$$ 223335492 205182442 175716976 134113307 95298804 68435279 51267873 40027316
10309D0027316p728156n478172l963194k977272k339521j860016j463637j272514
$$ 40027316 32299160 26820988 22857794 19880522 17541001 15680985 14217348 12944834
10301A2944834j138842r33891q06740q22218q70927p58923o07189n68234n96258
$$ 12944834 11805992 10872101 10065361 9243143 8372216 7613293 7006104 6437870 5841612
10292E841612n76251m90584m15392l56406k78791k27398k22220k08474j44373
$$ 5841612 5265361 4774777 4359385 4002979 3724188 3496790 3274570 3066096 2921723
10283B921723j22724j17132j19671j05241p3004n3700p9622q0582o9141p7589
$$ 2921723 2798999 2681867 2562196 2456955 2383951 2330251 2250629 2170047 2100906 2023317
10273B023317p7604n9441p8565q3747p5206m9239o4847n1576l8058m3832m8091
$$ 2023317 1945713 1886272 1807707 1723960 1648754 1599515 1534668 1483092 1445034 1401202 1353111
10262A353111k8773k2199m0869m4159p898j4573k9620l2328n3423m0642l9430
$$ 1353111 1324338 1302139 1261270 1217111 1209213 1194640 1165020 1132692 1079269 1038627 999197
10251I99197k9140l5969l3448j5726j9425j9775J0352j4784J382o636j9380k6738
$$ 999197 970057 934088 900640 884914 865489 845714 856066 841282 842664 836028 816648 789910
10239G89910k7257j3905j0836j8534n847j453J733k3220p624J7280J2445L576
$$ 789910 762653 748748 737912 719378 713531 712078 713811 690591 682967 700247 712692 716268
10227G16268k2942r152l882N0j4193l5700m3172j0964p12P946j3963l535J3026
$$ 716268 693326 684174 680292 680342 666149 630449 587277 576313 575601 583547 569584 566049 579075
10214E79075J9352J766J4695M059n552p559j4062Q777J3237M1866L3103M7337
$$ 579075 598427 600193 614888 618947 613395 605836 591774 600551 613788 655654 688757 736094
10202G36094M6089M6145Q3478J31200J64729J88206K38239L08898L60137L82491
$$ 736094 782183 828328 911806 1043006 1207735 1395941 1634180 1943078 2303215 2685706
10192B685706K43104M9816o1703l9078l1957j50327l29187l99974l53700k43411
$$ 2685706 2928810 2978626 2916923 2877845 2845888 2695561 2366374 1966400 1612700 1369289
10182A369289j97093j46050o6221o2342m6001n8989m6636n3507m3848k6974k0518
$$ 1369289 1172196 1026146 959925 897583 851582 792593 745957 692450 648602 621628 601110
10171F01110j8268l9939j04J0476J0006R74J6720K228l7269k7016k9012l0657
$$ 601110 582842 542903 542799 553275 563281 564255 580975 583203 545934 518918 489906 459249
10159D59249L499N310p705l860K7765M5440O687k6584l7643j6604k4267l0286
$$ 459249 462748 468058 460353 456493 484258 529698 536385 509801 472158 455554 431287 401001
10147D01001k630J5767Q407N636j935J7888L4667j7006m4876j8820m130P942j6799
$$ 401001 398371 414138 422545 428181 426246 444134 478801 461795 416919 398099 393969 401911 385112
10134C85112m7591k0781J4314L575j5690k7413l8771j7004k6164j2844j2964j2937
$$ 385112 337521 316740 331054 334629 318939 291526 252755 235751 209587 196743 183779 170842
10122A70842j9823j885j6739n231J666J8171K0485J9849R383K1360O80k8461J878
$$ 170842 151019 149134 132395 127164 128830 147001 167486 187335 196718 218078 218758 190297 192175
10109A92175J4277j3888o401l803P138m804r576J7900L0661J3776j9473j6492
$$ 192175 206452 192564 186163 182360 189498 184694 175118 193018 223679 237455 217982 201490
10097B01490j1206j2817J5238K4177Q323k9730L850J7484j0293j1676n011k4525
$$ 201490 190284 177467 192705 216882 225205 195475 199325 216809 206516 194840 189829 165304
10085A65304n445J6325J5717k2131Q321Q280r079m319o44k71n419k7048L000P825
$$ 165304 159859 176184 191901 169770 178091 186371 177292 172973 172329 172058 166639 139591 142591 150416
10071A50416k3274J8422L5488P188j8182k5006j4176j9405j389J1284J659p987
$$ 150416 127142 145564 181052 188240 170058 145052 130876 111471 110082 121366 123025 115038
10059A15038M917j806L678J7598l895k0849o277J6256j7404m784K670j0161o592
$$ 115038 119955 118149 121827 139425 135530 114681 108404 124660 107256 102472 105142 94981 88389
10046H8389N5465K3828j9415j1459k895N71J907J9227j4726j0761j3335k470Q283
$$ 88389 143854 167682 148267 136808 133913 134484 136391 155618 140892 130131 116796 114326 122609
10033A22609j9761r597l1065j4041K9374k213m7239O930M3851j3269k5200j8615
$$ 122609 102848 93251 62186 48145 77519 75306 28067 34997 78848 65579 40379 21764
10021B1764j6475l8531k6498k0288l3153l6953j283K311M9179M8477K8298J2599
$$ 21764 5289 -33242 -59740 -80028 -113181 -150134 -151417 -149106 -99927 -51450 -23152 -10553
10009a0553J7218L7047K2633K3555K2198R444n882O93r004j0725N104j257O19
$$ -10553 6665 43712 66345 89900 112098 121542 115660 116353 107349 96624 101728 100471 101090
9996A01090J4040J6842j8226o101M44O209J64J1793q786n832J789J3960j4298
$$ 101090 115130 131972 113746 107645 108089 114298 114462 126255 117469 111637 113426 127386 113088
9983A13088k3002o891k53m391k509r306L3016J9607J0185j5703k8146J8486K3677
$$ 113088 90086 83195 82942 78551 76042 66736 99752 119359 129544 113841 85695 104181 127858
9970A27858J0890j4978j3812j141l394J3493P271j8120j3239m229J6106J5869
$$ 127858 138748 123770 109958 108817 105423 118916 126187 108067 94828 90599 106705 122574
9958A22574j0395o382l1529k5329J6528J2815k285J0566J4566J4333r667l421
$$ 122574 112179 105797 74268 48939 65467 78282 75997 86563 101129 115462 105795 102374
9946A02374J7821J2411q309J4565k6856r378R451N661J9950j1116j1263K1849
$$ 102374 120195 132606 124297 138862 112006 102628 112079 117740 137690 126574 115311 137160
9934A37160P102r364M394P575l404J632M9107Q0653J21255R3687k1068p0973l4930
$$ 137160 144262 134898 139292 146867 143463 145095 194202 274855 396110 489797 468729 397756 362826
9921C62826K2869Q8178J54383K12694J97383J63275J23481J58531J49075K1905
$$ 362826 385695 473873 628256 840950 1038333 1201608 1325089 1483620 1632695 1654600
9911A654600j22514j54818j24396j12423j87635k23947j81205j27240o4971m8330
$$ 1654600 1532086 1377268 1252872 1140449 952814 728867 547662 420422 355451 307121
9901C07121o2741m3646j5961q505k240J90o700P010j6042m8615k7171j0916Q497
$$ 307121 244380 200734 184773 176268 174028 174218 167518 174528 158486 109871 82700 71784 80281
9888H0281J389K4013J2204o885j3833r221j7495R04J4005J9726j5035k1420P705
$$ 80281 81670 105683 117887 111002 97169 87948 70453 71357 85362 105088 90053 68633 76338
9875G6338K6168Q196k843k1231q861K5966j3898l2044j782M0049J4859p868k0502
$$ 76338 102506 110702 107859 86628 77767 103733 89835 57791 56009 96058 110917 103049 82547
9862H2547j3683M981q784K3705J0908K198j0934J032p05q213j0176j0102q420
$$ 82547 68864 73845 65061 88766 99674 101872 90938 91970 91265 83052 72876 62774 54354
9849E4354K2156Q243K4l162p682J2361J1906j6994k7910j7301J0783P100K934
$$ 54354 76510 84753 84777 81615 73933 86294 98200 81206 53296 35995 46778 53878 56812
9836E6812J396j5837O058K3035J0121L045M873j9167j8092k9223o29J3138J2447
$$ 56812 58208 42371 48429 71464 81585 84630 89503 70336 52244 23021 22392 35530 47977
9823D7977j2538l261K577J5442j1944p648o839R130J2178l991N063K6428j7293
$$ 47977 35439 32178 34755 50197 38253 30605 23766 32896 45074 41083 46146 72574 55281
9810E5281j7499l009q191K6175K3271j0190M674o84m83j0668j4254k2901l105
$$ 55281 37782 34773 26582 52757 76028 65838 70512 69828 69345 58677 44423 21522 18417
9797A8417m280L8362K5406J5685k1739k1311Q161J672K3332M202j4787j1116K1817
$$ 18417 14137 52499 77905 93590 71851 50540 58701 60373 83705 87907 73120 62004 83821
9784H3821O544n740K83j9205k7561r529J4568J2351K1830J7771J809j4318j0828
$$ 83821 90365 84625 84908 65703 38142 28613 43181 55532 77362 95133 96942 82624 71796
9771G1796J9156K5622r123j4022j7418l0388j8509O714J3918K2742P80j2825Q771
$$ 71796 90952 116574 107451 93429 76011 45623 27114 33828 47746 70488 71268 58443 67214
9758F7214J512j6911o915j6534j9637O885J1O583M224K6952O690j4338j619J0277
$$ 67214 68726 51815 44900 28366 8729 15614 15625 22208 26432 53384 60074 45736 44117 54394
9744E4394J2739J6744k4919j8740r430R035m926J1792L808J7266o075K1725M055
$$ 54394 67133 83877 58958 40218 30788 39823 34897 46689 50497 67763 61688 83413 87468
9731H7468k0831k960O809j4614r020L083l187j039K7547O741J633j9466l3782
$$ 87468 66637 63677 70486 55872 46852 49935 46748 45709 73256 79997 81630 62164 28382
9718B8382q449n230n953J2569J6139r11k0142Q029J3532q187L249Q02J5158k430
$$ 28382 19933 14703 8750 21319 37458 36547 16405 24434 37966 29779 33028 33830 48988 46558
9704D6558Q20j1458J2305M80J391j3867J57n507r196J4795j2644r434L809K1376
$$ 46558 47378 35920 48225 48705 50096 36229 36386 30879 21683 36478 23834 14400 18209 39585
9690C9585J9909K6289P179k9787j9045N455j1444q912J9486K3446l82j2294j2398
$$ 39585 59494 85783 92962 63175 44130 49585 38141 29229 48715 72161 71779 59485 47087
9677D7087L992R636o591k693K373j1539n940K4875k1060l743q724q435n336l55
$$ 47087 51079 60715 54124 51431 53804 42265 36325 61200 40140 36397 27673 19238 13902 13547
9663A3547J5031P977J7456o106k1149r419K7543l501o674r784R670J0659R715
$$ 13547 28578 36555 54011 47905 26756 17337 44880 41379 34705 24921 34591 45250 54965
9650E4965M4079L7384r423k2077n3723j8959J7227J4720k340q936j8339q723P653
$$ 54965 99044 136428 127005 104928 51205 32246 49473 64193 61853 52917 34578 25855 33508
9637C3508R722k7967j0437J2176L814J511k418M011O648N682J0612J5958j4306
$$ 33508 43230 15263 4826 17002 20816 22327 19909 23920 30568 36250 46862 62820 48514
9624D8514j4023m773P984P372M299j4743k9487P834l215n471m358J3774K6112
$$ 48514 34491 29718 37702 45074 49373 34630 5143 12977 9762 4291 -67 13707 39819
9611C9819N335J0943M34r436k314K4680L019k5977j4269r122L5821L4290j7017
$$ 39819 45154 56097 56531 47095 44781 69461 72480 46503 32234 23112 58933 93223 76206
9598G6206k3033j7869J4533K1230L854p702j4761j0489J9110o112l3493r163J2929
$$ 76206 53173 35304 49837 71067 74921 67219 52458 41969 61079 54967 21474 12311 25240
9585B5240J2478J0748O049p851j0926l7908k778J0031q478k7507k895O307l760
$$ 25240 37718 48466 54515 46664 35738 -2170 -4948 5083 -3395 -30902 -33797 -27490 -31250
9572c1250K7488M3413l2810K266J4685n052j462Q928N880J4435n007p350j9614
$$ -31250 -3762 39651 6841 9107 23792 18740 17278 26206 32086 46521 41514 34164 14550
9559A4550j9065j517L006J7358J61J6624J2084p156M206k8489j0729K00Q250J5109
$$ 14550 -4515 -6032 -3026 14332 14493 31117 43201 36045 40251 11762 1033 1233 9483 24592
9545B4592l678j4635J0939J7767k0564L439J1440n236j3536K5978J5164Q33j2025
$$ 24592 20914 6279 17218 34985 14421 17860 29300 24064 10528 36506 51670 52503 40478
9532D0478j2008J922K5241n622j1986k129l411l877j6631o193P566J2939j0241
$$ 40478 28470 30392 55633 50011 38025 35896 32485 28608 11977 5784 13350 26289 16048
9519A6048J1234J0758J3819J6706n602r464j4102n25N801Q766m898P602j8881
$$ 16048 27282 38040 51859 68565 62963 53499 39397 38872 44673 53439 48541 56143 37262
9506C7262l468O174J0233l29m556m3167o35L1106k085j2845o728J5911J9071k2274
$$ 37262 33794 39968 50201 49872 45316 2149 1514 32620 30535 17690 10962 26873 45944 23670
9492B3670j241l708J6689P962R65r980J1384K0622j7129j8623l9479j1239J2580
$$ 23670 22429 18721 35410 43372 44337 34357 45741 66363 49234 30611 -8868 -20107 -7527
9479g527K9536O333p571M282l278k621j3785p793p904J4006j8776J3265O232J9881
$$ -7527 22009 28342 20771 25053 21775 19154 5369 -2424 -10328 3678 -15098 -1833 4399 24280
9465B4280K4649k95j2412J2000j0880j0970j9664j1820j3134L841J0122J8230
$$ 24280 48929 48634 36222 48222 37342 26372 6708 -5112 -18246 -14405 -4283 13947
9453A3947K2308J1671l5253j0016L369J8015O625o138O094p259m574k232N900
$$ 13947 36255 47926 12673 2657 6026 24041 30666 24528 30622 23363 18789 16557 22457
9440B2457N414J212J760n035k0096L038K0665J1049j2526j6290j0657p496L1924
$$ 22457 27871 29083 30843 25808 5712 8750 29415 40464 27938 11648 991 -6505 25419
9427B5419J18j7235P376J374J1615K6989K749p778l093p353j297j1539r640M142
$$ 25419 25537 8302 15678 17052 28667 55656 58405 50627 47534 40181 38884 27345 17705 21847
9413B1847Q906n135j4259k0614K488K4099K0273R957j9192j2770j541k496J2601
$$ 21847 30753 25618 11359 -9255 -6767 17332 37605 47562 28370 15600 14059 11563 24164
9400B4164M597J3872j4598l1479J6667R966q873l309j0092k685J2416J7553j9130
$$ 24164 28761 42633 28035 -3444 13223 23189 14316 11007 915 -1770 10646 28199 9069
9387I069j6406n806L1260L3320k2522o150o477o227Q763Q659J2498j9417j7277
$$ 9069 -7337 -13143 18117 51437 28915 22765 16288 10061 18824 27483 39981 20564 3287
9374C287J2879K0512J9541J702j1167j4081K93R457j6577Q654L47R181n710o46
$$ 3287 16166 36678 56219 57921 46754 32673 32966 42423 25846 34500 34847 44028 38318 37672
9360C7672j352k3581L060q73q534q558L477Q783j429p153J80K676L336M056j533
$$ 37672 36320 12739 15799 14926 6392 -2166 1311 10094 8665 1512 1692 4368 7704 11760 10227
9345A0227n264Q334N758n392p452j769l218k8465p317K2247j9204k065K7302k865
$$ 10227 4963 13297 19055 13663 6211 4442 1224 -27241 -34558 -12311 -31515 -33580 -6278 -9143
9331i143k407o42k583O003K3237P444p133R017J8021m976j8310K7460Q539j9938
$$ -9143 -11550 -12192 -14775 -8772 14465 21909 14776 23793 41814 36838 18528 45988 54527 34589
9317C4589k2156j4213O445p322P540K0522j162n900L6018O749q532p614k1246
$$ 34589 12433 -1780 4665 -2657 4883 25405 24243 18343 54361 61110 52578 44964 23718
9304B3718K695r01k855K3896o80j3793j4342j928j769M930j644j0554r464j966
$$ 23718 26413 25512 22657 46553 45873 32080 17738 15810 14041 18971 17327 6773 -2691 -4657
9290d657J7426j3926j8251N100Q297P601k0585o328J7810K1442O396l258R291
$$ -4657 12769 -1157 -19408 -14308 -6011 1590 -18995 -25323 -7513 13929 20325 17067 26358
9277B6358L963J9327N472j2987j1636J1249O547m034l352J843J4522j1926J0198
$$ 26358 30321 49648 55120 42133 30497 41746 48293 44259 40907 42750 57272 45346 55544
9264E5544L812k36j6446p449j4853j6815p979K5727q281j2673k4355J2370L270
$$ 55544 59356 59120 42674 35225 20372 3557 -4422 21305 13024 351 -24004 -11634 -8364
9251h364j4027K9424K3040K788K7487j0469q423j021j5037j2666j0486j5232n343
$$ -8364 -22391 7033 30073 32861 60348 49879 41456 40435 25398 12732 2246 -12986 -18329
9238a8329L1282J037k3530J1228L678N859r705J1674J862J0036p239L962p928
$$ -18329 12953 13990 -9540 1688 5366 11225 1520 13194 15056 25092 17853 21815 13887
9225A3887l1185q148L949j8574J6048L9747K9618j5368j3626Q88J948j0766j3189
$$ 13887 -17298 -25446 -21497 -40071 -24023 15724 45342 29974 16348 17236 19184 8418 -4771
9212d771J0372o509k1968j6887K77J1932j0385K3951J1589J6140K160J9276O512
$$ -4771 5601 -908 -22876 -39763 -39486 -27554 -37939 -13988 -2399 13741 15901 35177 41689
9199D1689j3643L074p56j2263j8194j1233J498R397j3952j5843J2848L4490J3918
$$ 41689 28046 31120 30364 18101 -93 -11326 -9828 -431 -14383 -30226 -17378 17112 31030
9186C1030o433N191J9432k7559n604O49j1236l662J8478O620q12j5108K061j0835
$$ 31030 24597 29788 49220 21661 16057 16706 5470 1808 20286 26906 26094 10986 13047 2212
9172B212L925J3631j1781R42K0695J2163k25j8786k6712r458j0712J0551L2601
$$ 2212 6137 19768 7987 8929 29624 41787 41562 22776 -3936 -13394 -24106 -13555 19046
9159A9046K0209k3118j1268J2762J181J5204J66r537m494J0130j588j3743J263
$$ 19046 39255 16137 4869 17631 18812 34016 34182 24645 20151 30281 28693 14950 16213
9146A6213R13K191j569R647k0836J0498M116j3191j140j4620j483Q358K10j4059
$$ 16213 17126 19317 17748 27395 6559 17057 21173 7982 6842 -7778 -9261 -903 -693 -14752
9132a4752j4341l5163L0633L3911q227Q556K603j5995L184l24l722J8922Q599
$$ -14752 -29093 -64256 -33623 288 -7939 617 3220 -12775 -9591 -9915 -13637 5285 13884
9119A3884Q734k7228p211k1057O092J0821J9729L659j7786J4236L877K4366k0869
$$ 13884 22618 -4610 -11821 -32878 -26786 -15965 3764 7423 -10363 3873 7750 32116 11247
9106A1247l109J2065l844l106J6195J6743j999j7427j6678p522j2554J4039M505
$$ 11247 8138 20203 16359 13253 29448 46191 44192 26765 10087 2565 -9989 4050 8555
9093H555m289L153K6237R294l3513n963L3413J0842j3859k5452o292O684j250
$$ 8555 4266 7419 33656 42950 9437 3474 36887 47729 33870 8418 2126 8810 7560
9080G560R873J5455j32J6110j2013j5831L743J6923Q641N504k1493k6549j8354
$$ 7560 17433 32888 32756 48866 36853 21022 24765 41688 50329 55833 34340 7791 -10563
9067a0563Q445L0837r411j9191N825q333J4226J273K277q165l641j4254J4143
$$ -10563 -2118 28719 19308 117 5942 -2391 11835 13108 15385 7220 3579 -10675 3468
9054C468O815k760q6l698O447N957k385j2000Q562J9966R338m628k4667J7648
$$ 3468 10283 7523 7437 3739 10186 16143 13758 1758 10320 30286 39624 34996 10329 27977
9040B7977N333q038j2073j0742k925K0550R175K09m0032Q98O756l053K2990J8887
$$ 27977 33310 25272 13199 2457 -468 20082 29257 29466 -10566 -9668 -2912 -5965 17025 35912
9026C5912j8132j349J3558K225j42k7264j1749L720N149L335R408J3639J6653
$$ 35912 17780 16431 29989 32214 32072 4808 -6941 -3221 1928 5263 14671 28310 44963
9013D4963j0452J6496p841j5341m500Q769j0994j552p120j2928K1511R580l213
$$ 44963 34511 51007 43166 27825 23325 32094 21100 19548 12428 -500 21011 30591 27378
9000B7378j299j1627P643M51j4062j6484J247K7309K3941j788l725k3253J507
$$ 27378 26079 14452 22095 22546 8484 -8000 -6753 20556 44497 42709 38984 15731 17238
8987A7238J3390M51J0752q613L1875q68n009k6722k6613J7273o047j0754o830
$$ 17238 30628 31079 41831 33218 65093 64225 59216 32494 5881 23154 17107 6353 -477
8974d77J809O732K006R254n960O537J5421r932O918r445k3579J1966L978j2441
$$ -477 1332 8064 10070 19324 13364 19901 35322 25390 32308 22863 -716 11250 15228 2787
8960B787J7635P496L475j4972m709l888Q779J4897M247P511q358n665L069k7561
$$ 2787 20422 27918 31393 16421 11712 7824 16603 31500 35747 43258 34900 29235 32304 4743
8946D743k5165M56j188J9912m692K4561l985n184J9729j4850j8737K0813j3762
$$ 4743 -20422 -19966 -21154 -1242 -5934 18627 14642 9458 29187 14337 -4400 16413 2651
8933B651K682K655o690J5900K0494l77j8412n257R285l45j8873k573J5872q617
$$ 2651 5333 7988 1298 17198 37692 37315 18903 13646 22931 22586 3713 1140 17012 8395
8919H395r515o76j3081m291j01K5482J6483k7761l2026R750J2570k6522L928L2001
$$ 8395 -1120 -1796 -14877 -19168 -19269 6213 22696 -5065 -37091 -27341 -14771 -41293 -37365 -5364
8905e364J4284K4684J8008k9686k3186j6158J35l414M395M332Q225K0219R762
$$ -5364 8920 33604 51612 21926 -1260 -17418 -17283 -20697 -16302 -11970 -3745 16474 26236
8892B6236k0946k0084J0468K3104J3200j7178l046K8786j9664j8544P56q697j503
$$ 26236 5290 -14794 -4326 18778 31978 14800 11754 40540 20876 2332 3088 -5609 -7112
8879g112K9995K413M918j9982P400r847k236j8870R522J0423j913q571J0215p142
$$ -7112 22883 25296 30214 10232 17632 7785 5549 -13321 -3799 6624 4711 -3860 6355 -787
8865g87r988n727K2244L7492p25j2095k2925m43m772r31r658J0966R87J5221l4200
$$ -787 -10775 -16502 5742 43234 42509 30414 7489 7046 2274 1343 -8315 2651 3638 18859 -15341
8850a5341j3473J5847J0152p539J1929j0911j8873k7m029Q27r094K4877L2940
$$ -15341 -28814 -12967 -2815 -10354 1575 -9336 -28209 -28236 -32265 -31438 -40532 -15655 17285
8837A7285L4549L853p685j3178r949K6385K420k5834j9066K242K657Q184O664
$$ 17285 51834 55687 48002 34824 24875 51260 53680 27846 8780 11022 13679 21863 28527
8824B8527j4558k0426j676N851K4236J5575L961K1183p239k5712j8874o450o797
$$ 28527 13969 -6457 -8133 -2282 21954 37529 41490 62673 55434 29722 10848 4398 -2399
8811b399J4492m655J0955j0012r542K563K8572K9218o247j7490k6551r175o468
$$ -2399 12093 7438 18393 8381 -1161 1402 29974 59192 52945 35455 8904 -271 -6739
8798f739L78Q462J5839k872K87k356J2365l122j2475j0925m97K5160M3785N266
$$ -6739 -6361 2101 17940 15068 15355 12999 25364 22242 9767 -1158 -1655 23505 67290 72556
8784G2556Q1Q514j5737j4559n680P940M66k6059j5714J0035J0012o518K597J7307
$$ 72556 72637 81151 65414 50855 45175 53115 53581 27522 11808 21843 31855 25337 27934 45241
8770D5241P467k5027r736R740J6688n109k438J5758l7159j944k478k2792j1837
$$ 45241 52708 27681 17945 27685 44373 39264 36826 52584 15425 13481 11003 -11789 -23626
8757b3626J5954j37p80M166J5709Q23o247M339K5730J5734j0787r640k4133L303
$$ -23626 -7672 -7809 -8589 -4423 11286 12109 5862 10201 35931 51665 40878 31238 7105 10408
8743A0408J3195j2861J2371J1592J7416K1176N562k3490q826J558o047N059j931
$$ 10408 23603 10742 23113 34705 52121 73297 78859 55369 46543 48101 42054 47113 45182
8730D5182j6959r866K358K1274q553k7825j4158K762M00O323j1221j4642J4607
$$ 45182 28223 18357 20715 41989 33436 5611 -8547 -5785 -5385 938 -10283 -24925 -10318
8717a0318K7024K2049q00j9232j2902k229M795o793n545p397K6724p203p894k681
$$ -10318 16706 38755 37955 18723 5821 3592 8387 1594 -3951 -11348 15376 8173 279 -2402
8703b402N982K1073N976K3661L0352m060r202m8494l0235K6314J5336R570j2845
$$ -2402 3580 24653 30629 54290 84642 80582 71380 22886 -7349 18965 34301 43871 31026
8690C1026l6157r837J988Q192K4631L698j2863l719J4900L786q325j7685p275
$$ 31026 -5131 -14968 -12980 -4788 19843 23541 10678 6959 21859 25645 17320 -365 -7640
8677g640m432R475J3967L3722j9701q471p805k99J2858k71k1456j0460k725K967
$$ -7640 -12072 -2597 11370 45092 25391 16920 9115 8816 21674 21403 -53 -10513 -13238 -10271
8663a0271J4854m012p650J5163j0388k1032Q672J5146O608j6069o812J6393l5416
$$ -10271 4583 571 -7079 8084 -2304 -23336 -14664 482 7090 -8979 -15791 602 -34814
8650c4814j3244K4724L0197L2785l610p348k6506K0913J2907l698J1636j3091
$$ -34814 -48058 -23334 6863 39648 36038 28690 2184 23097 36004 32306 43942 30851
8638C0851k996K4018J4950j0916l5559l706J5143Q938L230N537j0674M740m124
$$ 30851 27855 51873 66823 55907 20348 16642 31785 40723 43953 49490 38816 43556 39432
8625C9432m1340m984j0421Q777l0016J2611J5100J4382K3179O41L14Q200J0026
$$ 39432 -1908 -6892 -17313 -8536 -38552 -25941 -10841 3541 26720 27361 27675 35875 45901
8612D5901k3541k6572j6705M631K8629o208J7699r468j1706J5090l488j3641r640
$$ 45901 22360 -4212 -20917 -16286 12343 6135 23834 14366 2660 17750 14262 621 -9019
8599i019j63o401j6249J1338J2190J2710K4860R300k6547j4127j4993L326J6612
$$ -9019 -9182 -15583 -31832 -20494 -8304 4406 29266 38566 12019 -2108 -17101 -13775 2837
8586B837J4852O367r631m107R182j2373K2542R12k3664J2800k098J0875J1795
$$ 2837 17689 24056 14425 10318 19500 7127 29669 30581 6917 19717 17619 28494 40289
8573D0289J2054K2725k739l3143k5757j9998J3765O690Q692j6646R252L174J9186
$$ 40289 52343 75068 72329 39186 13429 -6569 7196 13886 22578 5932 15184 18358 37544
8560C7544q816j0594K3260l6959j3718j4529L779R325N309K949j1611J2120K3859
$$ 37544 28728 18134 41394 4435 -9283 -23812 -20033 -10708 -5399 -2450 -14061 -1941 21918
8547B1918J4935l573k5905K673K2085M294R70O141r50k6003k8372j72J8305l76
$$ 21918 36853 33280 7375 10048 32133 36427 37397 43538 42588 16585 -11787 -11959 6346 5970
8533E970n268n037m26j607o805J7747J9603j7226j5251q225m768P200j505m098
$$ 5970 702 -4335 -4761 -6368 -13173 4574 24177 6951 -8300 -16525 -21293 -14093 -15598 -19696
8519a9696J4926O311K299K1809J9891l960k4827j3010J242J8484M738l6290J3975
$$ -19696 -4770 1541 3840 25649 45540 41580 16753 3743 4985 23469 28207 -8083 5892
8506E892N968J252j0126M008k3825R329J9536J099j9191K556J068K3431M856m464
$$ 5892 11860 13112 2986 6994 -16831 -7502 12034 13133 -6058 -3502 -2434 20997 25853 21389
8492B1389q221L823l30j6007k1722j9159J8406K6268O853j6262m889m89j123q04
$$ 21389 13168 16991 16661 654 -21068 -40227 -21821 4447 11300 -4962 -9851 -10340 -11463 -12267
8478a2267R583J9213P877j147R16R758k5202m4552K0339O692o200q263J1720O835
$$ -12267 -2684 16529 24406 23259 24175 33933 8731 -35821 -15482 -8790 -14990 -23253 -11533 -4698
8464d698J673P955J2044j6824k5447J5890J1580j4195J5947J7571o637j5140n369
$$ -4698 -3025 4930 16974 150 -25297 -9407 2173 -12022 3925 21496 14859 -281 -5650
8451e650j0260k0601n099Q923J3141K4357L8515n9J415k875P599j4716j1343k560
$$ -5650 -15910 -36511 -41610 -32687 -19546 4811 43326 43267 44682 41807 49406 34690 23347 20787
8437B0787k0318k669J3300j6671q116J1470m742k89N991J0310j3000k2387j3193
$$ 20787 469 -2200 11100 -5571 -13687 -2217 -6959 -7248 -1257 9053 -3947 -26334 -39527
8424c9527J4784P215N65J9147K4040J0677j3563M469L016j8519p716J3684J6211
$$ -39527 -24743 -17528 -16963 2184 26224 36901 23338 27807 30823 12304 4588 18272 34483
8411C4483q334r17m848k0999k415m007O753O881J3049K785J4739R803K2431j894
$$ 34483 26149 25232 20384 -615 -3030 -7037 -284 6597 19646 22431 37170 46973 69404 67510
8397F7510K5992L0521r999k4099k7499j5447k5236l745o325k408j457j05K192
$$ 67510 93502 124023 114024 89925 62426 46979 21743 17998 11673 9265 7808 7703 9895
8384I895J6855J9075q851l2249q937J2842l344j1171R46J7437l867j9102k158
$$ 9895 26750 45825 36974 4725 -4212 8630 5286 -5885 -4939 12498 8631 -10471 -12629
8371a2629K3446K4402J1919J3049J2156k2775l9930k01N805l835j3353J5142N587
$$ -12629 10817 35219 47138 60187 72343 49568 9638 9437 15242 11407 -1946 13196 18783
8358A8783j7333q073J8058Q407J0485j3413j3102K0290Q191q180O323R079o803
$$ 18783 1450 -6623 11435 19842 30327 16914 3812 24102 32293 24113 30436 39515 32712
8345C2712k369p116r042K276J6185k3521j3764Q466n182Q50L877j2779j384j475
$$ 32712 30343 23227 14185 16461 32646 9125 -4639 3827 -1355 -505 3372 -9407 -10791 -12266
8331a2266j6277j9085l15R426J5131J8662j0624K185J3219j9336J561j1492J4378
$$ -12266 -28543 -47628 -47943 -38517 -23386 -4724 -15348 -13163 56 -19280 -17719 -29211 -14833
8318a4833L433O508P205Q514J4709L3956N145k2780k9339k061j8313J638J6754
$$ -14833 -11400 -4892 2313 10827 25536 59492 64637 41857 12518 10457 -7856 -6218 10536
8305A0536J6706k0402j6118l012j4450K7876J3901J1347k824J9062R14j1929l0742
$$ 10536 27242 6840 -9278 -12290 -26740 1136 15037 26384 23560 42622 43536 31607 865
8292H65k2427q520K068j9198o316J0008J6358J1884P532o139j253j3112K0362
$$ 865 -21562 -30082 -28014 -47212 -53528 -43520 -27162 -15278 -7746 -13885 -15138 -28250 -7888
8279g888J1365R769J031j0069k2535j0534K0949l646J1724J7717p76j7993j4033
$$ -7888 3477 13246 14277 4208 -18327 -28861 -7912 -11558 166 17883 17107 -886 -14919
8266a4919J3564r67j6416p91j526J1676J2699r705L091L636j5200J1235K8998
$$ -14919 -1355 -2322 -18738 -19529 -21055 -9379 3320 -6385 -3294 342 -14858 -3623 25375
8253B5375J0670o933l361l0326R915O199J484l510j2184l9069n514K1003K0252
$$ 25375 36045 29112 25751 -4575 5340 11539 13023 9513 -2671 -41740 -47254 -26251 -5999
8240e999M840m750J9381Q312p65j926o673L1257j4612p018k5795k1848N167K4594
$$ -5999 -1159 -5909 13472 21784 21019 19093 12420 43677 29065 22047 -3748 -25596 -20429 4165
8226D165M4874j7897k1235J6039J3724m098k1462k224J8669O701j5163n541q233
$$ 4165 49039 31142 9907 25946 39670 35572 14110 11886 30555 37256 22093 16552 8319
8213H319m069J3491n700j1408p712L749n616k9815m889J7878K2976n08n203j7343
$$ 8319 4250 17741 12041 633 -7079 -3330 -8946 -38761 -43650 -25772 -2796 -3304 -8507 -25850
8199b5850J0652J7008J6957M720k0191j6856k8250j1742K5328J7160l113j1123
$$ -25850 -15198 1810 18767 23487 3296 -13560 -41810 -53552 -28224 -11064 -14177 -25300
8187b5300k5068K3517K2731K319n893q646j2361j5413n472J0556J5740J5149N517
$$ -25300 -50368 -26851 -4120 -1801 -7694 -16340 -28701 -44114 -49586 -39030 -23290 -8141 -2624
8174b624K644M745j4620l2803K197M717K145J3635l223L76J5208M736k1750j3947
$$ -2624 20 4765 -9855 -42658 -40461 -35744 -33599 -19964 -23187 -22811 -7603 -2867 -24617 -38564
8160c8564j8359Q834J4404J9278J1447R775J233j1693n717q034R844J4205L031
$$ -38564 -56923 -48089 -33685 -14407 -2960 6815 8048 -3645 -9362 -17396 -7552 6653 9684
8147I684k1960l0336Q742K3006j5377P147M4734K7251j738q841j6580L513P335
$$ 9684 -12276 -42612 -33870 -10864 -26241 -19094 25640 52891 51153 42312 25732 29245 36580
8134C6580j8816j1395n406p915n591R030K7819J1707k54p205k3314n187j206j2441
$$ 36580 17764 6369 963 -6952 -12543 -3513 24306 36013 35759 28554 5240 53 -1153 -13594
8120a3594J0855R638m200p13k0828j1109n443P186O297m917M862j8441K6217J7035
$$ -13594 -2739 6899 2699 1986 -18842 -29951 -35394 -28208 -21911 -26828 -21966 -40407 -14190 2845
8106B845J422L972K4021K724l908K150j2875o05R12M342J6077j6265k929n267
$$ 2845 4267 8239 32260 34984 31076 33226 20351 19746 20658 25000 41077 24812 21883 16616
8092A6616p572j4596q909J1886K760Q482n055J274K796J1103N667j3061l3990
$$ 16616 9044 -5552 -14461 -2575 185 8667 3612 4886 7682 18785 24452 11391 -22599
8079b2599l2064J6303K1868p855J9275K6837J1638l8256p559J3641J9095K1121
$$ -22599 -54663 -38360 -16492 -24347 -5072 21765 33403 -4853 -12412 1229 20324 41445
8067D1445l615J1836M63p134M863r10p413j8950j4456n302K6115j6656j3561n500
$$ 41445 37830 49666 50129 42995 47858 46948 39535 20585 6129 827 26942 10286 -3275 -8775
8053h775K3558J4300j0253n811J0752R889Q859k4365m3990M307K7590L7931K821
$$ -8775 14783 29083 18830 13019 23771 33660 42519 18154 -25836 -21529 6061 43992 46813
8040D6813k1770k3586k2690o33k893J1998r378m82K1992J651k4540o522o169J0030
$$ 46813 25043 1457 -21233 -21866 -24759 -12761 -22139 -22621 -629 1022 -23518 -30040 -36209 -26179
8026b6179K4800P316P228J7606m047j4850j6340j111P75M801K6516j1430m567
$$ -26179 -1379 5937 13165 30771 26724 11874 -4466 -5577 -4802 -1 26515 15085 10518
8013A0518N083J894n513P533j1087l264O436P779K2010j8380k8889J4365J614
$$ 10518 15601 17495 11982 19515 8428 5164 11600 19379 41389 23009 -5880 8485 10099
8000A0099k4750j1906J0260P592j84J9969l300r458R447m476k2932J0261J1483
$$ 10099 -14651 -26557 -16297 -8705 -8889 11080 7780 -1678 7769 3293 -19639 -9378 2105
7987B105J612j016k59j4252m632K8023K3700k434R737K848K3035k8482k3825P250
$$ 2105 3717 2701 2442 -11810 -16442 11581 35281 32847 42584 45432 68467 39985 16160 23410
7973B3410P147j4627J327k481P844k8749j1525Q455K8611L507j1862j4191l415
$$ 23410 30557 15930 17257 14776 22620 -6129 -17654 -9199 19412 22919 11057 -3134 -6549
7960f549J258K5738k019j3256r899p932J5932J0721l0242j4365Q131K3664O173
$$ -6549 -5291 20447 18428 5172 -4727 -12659 3273 13994 -16248 -30613 -22482 1182 7355
7947G355j9928j2510j3333K640O557J1833R618j8305O505n342j0561q591m88J3425
$$ 7355 -12573 -25083 -38416 -35776 -29219 -17386 -7768 -26073 -19568 -24910 -35471 -44062 -44550 -31125
7933c1125n563m993J1316J4422J1789K3644o203j996P639j9074k5859J870L3147
$$ -31125 -36688 -41681 -30365 -15943 -4154 19490 13287 11291 18930 -144 -26003 -24133 9014
7920I014R76k4266N671Q498k0770L093J6867J082M091j3635Q891r952r102O709
$$ 9014 9990 -14276 -8605 -107 -20877 -17784 -917 165 4256 -9379 -488 -10440 -19542 -12833
7906a2833J6058m787J212j8790j7801j5303q76J6165J940q728j870J9978P204
$$ -12833 3225 -1562 -350 -19140 -36941 -52244 -53120 -36955 -35015 -43743 -45613 -25635 -18431
7893a8431r27K5323J6830p145j4533q734J3570K02l320p940m96J2010n028j0064
$$ -18431 -19358 5965 22795 15650 1117 -7617 5953 6155 2835 -5105 -5601 6409 1381 -8683
7879h683j2414O497L0270J457k2451k256P2N588m368J2194K5162m317J4098M541
$$ -8683 -21097 -14600 15670 17127 -5324 -7580 -7508 -1920 -6288 5906 31068 26751 40849 45390
7865D5390j6247k2563j5741J701o423r180R081J0025O186j465J467J694q256m351
$$ 45390 29143 6580 -9161 -7460 -13883 -23063 -13982 -3957 2229 764 2231 3925 -4331 -8682
7851h682J7333J4651N855J0545n296k3153j2424N36L858j5143Q882K2757q540
$$ -8682 8651 23302 29157 39702 34406 11253 -1171 -635 3223 -11920 -3038 19719 11179
7838A1179l879K4892J3437j5129j0458N077R186J7353j2384j9832k1141K4710
$$ 11179 7300 32192 45629 30500 20042 25119 34305 51658 39274 19442 -1699 23011
7826B3011J9133j7796k5977J565J6976j0585J874M312J5386j6503l4054j2104
$$ 23011 42144 24348 -1629 -64 16912 6327 8201 12513 27899 11396 -22658 -34762
7814c4762J8830k525J934J9490m047k4508j7667k83K9939K1302J2706j554o994
$$ -34762 -15932 -18457 -16523 2967 -1080 -25588 -43255 -43538 -13599 7703 20409 18855 11861
7801A1861P425j3577j7856k4787N557J4759p628l548J3160M901o697k1769j3337
$$ 11861 19286 5709 -12147 -36934 -31377 -16618 -24246 -27794 -14634 -9733 -16430 -38199 -51536
7788e1536R664M8340J631P82K1285L228j6355j3321j9283R933m983r028r721N457
$$ -51536 -41872 6468 8099 8881 30166 33394 17039 3718 -15565 -5632 -10615 -19643 -29364 -23907
7774b3907J6815j3180p899J0311K4631J94O920j1116k6871k106J1777L1493K8298
$$ -23907 -7092 -20272 -28171 -17860 6771 6965 13885 2769 -24102 -26208 -14431 17062 45360
7761D5360p702k7853k0282J52J7852l805k2835j9724L1454L0717l059j0179m941
$$ 45360 37658 9805 -10477 -10325 7527 3722 -19113 -38837 -7383 23334 20275 10096 5155
7748E155M725k789p288j9057k8028J1778K3538n22O12R058Q527R654J3372J0935
$$ 5155 9880 7091 -197 -19254 -47282 -35504 -11966 -12488 -11876 -2818 5709 15363 28735 39670
7734C9670N67j6184R626K3676l935l4617k1891p818M222m326M864O0O504J0019
$$ 39670 40237 24053 33679 57355 53420 18803 -3088 -10906 -6684 -11010 -6146 -6086 418 10437
7720A0437r662k2795l175k56m198J7414L2332m054k2824L223J5033J0571N977
$$ 10437 775 -22020 -25195 -25451 -29649 -12235 20097 16043 -6781 -3558 11475 22046 28023
7707B8023r132k6914J6843K1562k1482k3588j0283J311J1631J2455P008r217o254
$$ 28023 18891 -8023 8820 30382 8900 -14688 -24971 -23660 -12029 426 7434 -1783 -8037
7694h037k65P351J642J3802J8994q219k3369o801j1901J7831J2965J0557k2676
$$ -8037 -8302 -951 691 14493 33487 25268 1899 -4902 -16803 1028 13993 24550 1874
7681A874q734j6082N343j075q257j840j2368Q232O81r112R300Q478J5376j7695
$$ 1874 -6860 -22942 -17599 -18674 -26931 -28771 -41139 -32907 -32226 -41338 -32038 -23560 -8184 -25879
7667b5879J215P923O935r693N650n972r717J1286J6982P316J1514p846p890j33
$$ -25879 -24664 -16741 -9806 -19499 -13849 -19821 -29538 -18252 -1270 6046 17560 9714 1824 1691
7653A691n991k071N550L718l35j5087l5907j7185L743n434J9565J6475q517R351
$$ 1691 -4300 -6371 -821 2897 2562 -12525 -48432 -65617 -61874 -67308 -47743 -31268 -39785 -30434
7639c0434J8293Q293k1244K4139J4812l3884j913L2126K3175j816q100r529J5128
$$ -30434 -12141 -3848 -25092 -953 13859 -20025 -21938 10188 33363 31547 23447 13918 29046
7626B9046j844o567j0580k0824l3053j463K8659N450J2180K025Q81n118k9705
$$ 29046 27202 20635 10055 -10769 -43822 -45285 -16626 -11176 1004 3029 3910 -1208 -30913
7613c0913M712Q372J360K0536J6632k0163r534p254j2286O630M167K2958r848
$$ -30913 -26201 -17829 -16469 4067 20699 536 -8998 -16252 -28538 -21908 -17741 5217 -4631
7600d631j2686P315J6785K527j4737M214o10P63q592o739m140r339J7865J8705
$$ -4631 -17317 -10002 6783 9310 -5427 -1213 -1823 -1060 -9652 -16391 -20531 -29870 -12005 6700
7586F700M264m437m55R175R321j1151j9641n301O898K2565m557m136p953l965
$$ 6700 10964 6527 6072 15247 24568 13417 -6224 -11525 -4627 17938 13381 9245 1292 -2673
7572b673o441p376M158j2318N681K8823K4984K7282j4627k2476l90k6942O957
$$ -2673 -9114 -16490 -12332 -24650 -18969 9854 34838 62120 47493 25017 24627 -2315 4642
7559D642Q229l450k3566P223J2578n145j0941n144J9220P056j1792k390m314J1574
$$ 4642 12871 9421 -14145 -6922 5656 511 -10430 -15574 3646 10702 -1090 -3480 -7794 3780
7545C780J1500p157L801j1986q892j2728K3368K6494p805j0179j6005m99K5782
$$ 3780 15280 8123 11924 -62 -8954 -21682 1686 28180 20375 10196 -5809 -6308 19474
7532A9474K1852j9872k7686q426P939j2519J7223J7272k6511p069L179L1566j2698
$$ 19474 41326 21454 -6232 -14658 -6719 -19238 -2015 15257 -11254 -18323 -15144 16422 3724
7519C724k8004K2411K1600k2908k6278K57m027J9876J6315J0275J0179j7931j1534
$$ 3724 -24280 -1869 19731 -3177 -29455 -29198 -33225 -13349 2966 13241 23420 5489 -6045
7506f045J3093Q997J7015J0555j2510L389O182r319j2595j9468k0908J5195J4991
$$ -6045 7048 16045 33060 43615 31105 34494 40676 31357 18762 -706 -21614 -6419 8572
7493H572L039N166N856j8352P676o705j8956J2430o025N818j9643N619J3887l294
$$ 8572 11611 16777 22633 4281 11957 5252 -13704 -1274 -7299 -1481 -21124 -15505 -1618 -4912
7479d912n659j8689K9040J6124j3919P11L904j689J0580j0569l874K8244j258
$$ -4912 -10571 -29260 -220 15904 1985 2696 6600 4911 15491 4922 1048 29292 28034
7466B8034l0624j8183l0026L3970L1074L629M580J2757K222r060p306N507j850
$$ 28034 -2590 -20773 -50799 -16829 14245 17874 22454 35211 37433 28373 21067 26574 24724
7453B4724j3883K9866J532j0591J347J021k3590j7313K1766K5504q293j0847j4446
$$ 24724 10841 40707 42239 31648 32995 34016 10426 -6887 14879 40383 32090 21243 6797
7440F797k860n462K0818p934l2792P866J4755r299J2898R91n781O04J281J2700
$$ 6797 3937 -1525 19293 11359 -21433 -13567 1188 -8111 4787 5778 -3 601 1882 14582
7426A4582j30j1018q498j1128O775j987j8396J8894K1295n827j0654M382K1264
$$ 14582 14452 3434 -5064 -16192 -9417 -11404 -29800 -10906 10389 4562 -6092 -1710 19554
7413A9554Q553K063k7258l0878m161Q494l751P00m584l074Q411Q48Q006Q74J0485
$$ 19554 28107 30170 2912 -27966 -32127 -23633 -27384 -26684 -31268 -34342 -25931 -25083 -17077 -16203 -5718
7398e718J6614j0326j5249k516J9890p167k0343M954K7542K406l465M815j5501
$$ -5718 10896 570 -14679 -17195 2695 -4472 -24815 -19861 7681 10087 6622 11437 -4064
7385d064P677J6122j112J1455k00q193R166O916j0404k3406k303L1128K4909m720
$$ -4064 3613 19735 18623 30078 29878 21685 30851 37767 27363 3957 1654 32782 57691 52971
7371E2971k4661L121k0783o268j9914J0565J6480k76O122k098m122J8345K765
$$ 52971 28310 31431 10648 4380 -15534 -4969 11511 11235 17357 15259 11137 29482 32247
7358C2247L682o514p897L59P16k7840j0848K4472K5116k155j3871J6489O106p446
$$ 32247 35929 29415 21518 21877 22593 -5247 -16095 8377 33493 31338 17467 33956 40062 32616
7344C2616n161k8759j9423n2J2257K844J2417O505j2457r628Q64J3653O189n567
$$ 32616 27455 -1304 -20727 -20779 -8522 -5678 6739 13244 787 -8841 -7977 5676 11865 6298
7330F298P463j8503j6302m221O450r570N422j111j1292K0007J5265p688J0705
$$ 6298 13761 -4742 -21044 -25265 -18815 -28385 -22963 -24074 -35366 -15359 -94 -7782 2923
7317B923J2732j4647k0295J1338J950O947P753J2541p984k7396k397J3022K5197
$$ 2923 15655 1008 -19287 -7949 -5999 948 8701 21242 13258 -14138 -16535 -3513 21684
7304B1684q230j167N621MQ240j9678k2971K2371O110j1371o551M58k4470l703
$$ 21684 13454 12287 17908 17912 26152 6474 -16497 5874 11984 613 -5938 -5480 -29950 -33653
7290c3653K2174J1143M357P409j3990k2382j548L6100j2250k7002M082K2177j5088
$$ -33653 -11479 -336 4021 11430 -2560 -24942 -26490 9610 -2640 -29642 -25560 -3383 -18471
7277a8471P358J2971N665k859l301q572j8347M685R958j1847k1004q282j6038
$$ -18471 -11113 1858 7523 4664 1363 -7209 -25556 -20871 -10913 -22760 -43764 -52046 -68084
7264f8084J4534J6675K0134K8434J4040j420k7502j5235r721r733N359K8152q558
$$ -68084 -53550 -36875 -16741 11693 25733 24313 -3189 -18424 -28145 -37878 -32519 -4367 -12925
7251a2925j0085K4564N881o357n881o018N231j2948k815j2057p597j900K6675
$$ -12925 -23010 1554 7435 1078 -4803 -10821 -5590 -18538 -21353 -33410 -41007 -42907 -16232
7238a6232J8261j5353K9198K3465j0520k2009k8487r004J2358n808o489q954R991
$$ -16232 2029 -13324 15874 39339 28819 6810 -21677 -30681 -18323 -24131 -30620 -39574 -29583
7225b9583J0357N012o72p486O014R59j3993p152J7417O639K5089k341O160Q27
$$ -29583 -19226 -14214 -14886 -22372 -16358 -15399 -29392 -36544 -19127 -12488 12601 10260 16420 17247
7211A7247l830j4974j6032M88j6503j0991K0821O463O915q95r340N995o656j4315
$$ 17247 13417 -1557 -17589 -17101 -33604 -44595 -23774 -17311 -10396 -11291 -20631 -14636 -21292 -35607
7197c5607r923J6284m183k48K1969K4243k481j4055o448m504j6194Q74j0973J4152
$$ -35607 -45530 -29246 -33429 -33677 -11708 12535 10054 -4001 -10449 -14953 -31147 -30273 -41246 -27094
7183b7094R17O551K9687J9267j5023k4048N665O435j3631j4527l857K6659J0593
$$ -27094 -26177 -19626 10061 29328 14305 -9743 -4078 2357 -11274 -25801 -29658 -2999 7594
7170G594Q303J7325J6032j0210j2300k246J4261k5551j7391K7010N856j0673j9722
$$ 7594 15897 33222 49254 39044 26744 24498 38759 13208 -4183 22827 28683 18010 -1712
7157a712j9967J5214Q552m988p135r81j8322k4462J7995J3858p359j0469K184
$$ -1712 -21679 -6465 2087 -2901 -10036 -11017 -29339 -53801 -35806 -21948 -29307 -39776 -37592
7144c7592M403j1910L5652Q358J4411k711k6291j1553K960R92O478j3737j556
$$ -37592 -33189 -45099 -9447 -1089 13322 10611 -15680 -27233 -24273 -23281 -16803 -30540 -32096
7131c2096R109Q730K547K3754n331p23L357p753l554k7082k79J9222R686Q930
$$ -32096 -22987 -14257 -11710 12044 6713 5990 9347 1594 -1960 -29042 -29321 -10099 -413 8517
7117H517j3888n02J4805R200k1123k6815J8343J7725j8519k3308M924L0213L5102
$$ 8517 -5371 -5873 8932 18132 -2991 -29806 -11463 6262 -12257 -35565 -30641 -428 34674
7104C4674J0974j4804k9722J452j2406J599J6511j159Q427K3697j9194k8053r137
$$ 34674 45648 30844 1122 2574 -9832 -8233 8278 7119 15546 39243 20049 -8004 -17141
7091a7141J5112R628J945Q226M867j5938l64j7649R042j2119j3049l163j2954
$$ -17141 -2029 7599 9544 17770 22637 6699 6335 -11314 -2272 -14391 -27440 -30603 -43557
7078d3557p199Q069O960N310J1259N407r827k9865q650P433J4523J2421J6175
$$ -43557 -50756 -42687 -35727 -30417 -19158 -13751 -23578 -53443 -62093 -54660 -40137 -27716 -11541
7065a1541J5124o628n643L49M394j8737j3335p257N945q16L3439J9565j4074K6903
$$ -11541 3583 -3045 -8688 -8339 -3945 -22682 -36017 -43274 -37329 -38145 -4706 14859 785 27688
7051B7688m257k6648R56M565m135j6092l7342J5053K8730P444j0J6786n616J2952
$$ 27688 23431 -3217 -2261 2304 -1831 -17923 -55265 -40212 -11482 -4038 -4048 12738 7122 20074
7037B0074K345l2191k3126r599K3219K1966j6788k5314J7987J2255M483J0439
$$ 20074 22419 -9772 -32898 -42497 -19278 2688 -14100 -39414 -21427 -9172 -4689 5750
7025E750n760k0524l3711L107L1001K0126O103Q673j791Q729J0240j2868j5871
$$ 5750 -10 -20534 -54245 -51138 -20137 -11 6092 14765 12974 21703 31943 19075 3204
7012C204q659L616K773J0024l583J2423j0250j6888j5330m7m8M80K436j6181J918
$$ 3204 -5455 -1839 934 10958 7375 19798 9548 -7340 -22670 -22717 -22765 -22285 -19849 -36030 -34112
6997c4112K0668j351j36K5036P742j8519r068j2806J1747J0783o25k0308k1917
$$ -34112 -13444 -14795 -14931 10105 17847 -672 -9740 -22546 -10799 -16 -641 -20949 -42866
6984d2866J4829L5031J1538q979k8216j1467O196J3630J495m771j3287K299n566
$$ -42866 -28037 6994 18532 9553 -18663 -30130 -23934 -10304 -8809 -13580 -26867 -24568 -30134
6971c0134o208J0659j560R652K1819J3894j6353k2216r029K6489p657k0690M022
$$ -30134 -36342 -25683 -27243 -17591 4228 18122 1769 -20447 -29476 -2987 -10644 -31334 -27312
6958b7312n659K443N593R281R965j3142j4317j534K5292K375K922J5213K168k7801
$$ -27312 -32971 -30528 -24935 -15654 -5689 -18831 -33148 -34682 -9390 -7015 -4093 11120 13288 -14513
6944a4513q066J8522J0447j8480n462j277l078J9806p859n006R235l33j7585k9407
$$ -14513 -22579 -4057 6390 -12090 -17552 -18829 -21907 -2101 -9960 -14966 -5731 -6064 -23649 -53056
6930e3056j0303M215J2319K6576J7786K6608j6780k3982k916J9180r878l354J7056
$$ -53056 -63359 -59144 -46825 -20249 -2463 24145 7365 -16617 -19533 -353 -10231 -13585 3471
6917C471j985j4042R286J3966r954l3267Q460J9881K1480J5171j8915k6455P205
$$ 3471 1486 -12556 -3270 10696 742 -32525 -24065 -4184 17296 32467 13552 -12903 -5698
6904e698o003j4921k759j0015L435J7931J4072J9928k391m72m795j99J6776J4511
$$ -5698 -11701 -26622 -29381 -39396 -35961 -18030 -3958 15970 13579 13107 8312 8113 24889 39400
6890C9400P630m205m4367M060J2691N392O451q624J652k482j0399r991m987J2751
$$ 39400 47030 42825 -1542 2518 15209 20601 27052 18428 20080 17598 7199 -2792 -7779 4972
6876D972Q387L1240j3348l3352J6066Q209j7080J884k2063j2327R208O394j6764
$$ 4972 13359 44599 31251 -2101 13965 22174 5094 6978 -15085 -27412 -18204 -11810 -28574
6863b8574L1232J1791M716J069O075k5436k9643N697K1724o404k77K0300J1686
$$ -28574 2658 14449 19165 20234 26309 873 -28770 -23073 -1349 -7753 -8030 12270 23956
6850B3956J44L003k2851j5328J4169L3003N672J7580q504m5323k1997N583J0431
$$ 23956 24100 27103 4252 -11076 3093 36096 41768 59348 50844 5521 -16476 -10893 -462
6837d62k012L1294j401j5892O206J2233j0241p134k5010R803m774j4717k803L106
$$ -462 -2474 28820 27419 11527 17733 29966 19725 12591 -12419 -2616 -7390 -22107 -24910 -21804
6823b1804O295R518K6105J731m1975j0658m313J5437L903p847Q778j7010P902
$$ -21804 -15509 -5991 20114 21845 -20130 -30788 -35101 -19664 -15761 -23608 -14830 -31840 -23938
6810b3938o220Q145Q931o593j0952K2759N006K1080K5552o036j3122k0459k773
$$ -23938 -30158 -22013 -13082 -19675 -30627 -7868 -2862 18218 43770 37734 24612 4153 1380
6797A380J6526J5072J1679j1324j9581j3352K203o208j5328j1286n801o002K0338
$$ 1380 17906 32978 44657 33333 13752 400 2603 -3605 -18933 -30219 -36020 -42022 -21684
6784b1684K3880r601j594M020k0301l648M402N327J7722J0013l958J6540o937
$$ -21684 2196 -7405 -8999 -4979 -25280 -28928 -24526 -19199 -1477 8536 4578 21118 14181
6771A4181k7862k866J6243m822q584l314j666J7308P168K992o070K678j025o910
$$ 14181 -13681 -16547 -304 -5126 -13710 -17024 -18690 -1382 5786 8778 2708 5386 4361 -2549
6757b549m505J5905o72P467l726Q717j8158k0882k834m59m085l72O964l758K485
$$ -2549 -7054 8851 8179 15646 11920 20637 2479 -18403 -21237 -21696 -25781 -26153 -19189 -22947 -20462
6742b0462Q9L862L275K933J8999J2265j0589k7144P927o51j9881p732K968j688
$$ -20462 -20373 -16511 -13236 -10303 8696 20961 10372 -16772 -8845 -9496 -29377 -37109 -34141 -35829
6728c5829j84J9421K3828n104k1677j4980m455O873J6075j3530m306j7076n695
$$ -35829 -36013 -16592 7236 2132 -19545 -34525 -38980 -32107 -16032 -29562 -33868 -50944 -56639
6715e6639K6787J2777k0682j0367R525J814J0305L6600O723J1022L246M60j9365
$$ -56639 -29852 -17075 -37757 -48124 -38599 -36785 -26480 10120 16843 27865 31111 31571 12206
6702A2206j6347L068q762P508L066R45n695k225k105K4861O023l992j8675k9381
$$ 12206 -4141 -1073 -9835 -2327 739 1684 -4011 -6236 -8341 16520 22543 18551 -124 -29505
6688b9505j4697K5755J7713O485j2351j7314l8000j541K1737K1065J8337J626
$$ -29505 -44202 -18447 -734 5751 -6600 -23914 -61914 -63455 -41718 -20653 -2316 -690
6676f90K021k6680j8368M47R734r88K1694K4009l020K601k3212j312j6457k50
$$ -690 1331 -25349 -43717 -43270 -33536 -34524 -12830 11179 8159 10760 -12452 -13764 -30221 -30471
6662c0471p968R994R129K3656J3813j6219m268n870j0066M226J2436r368r059
$$ -30471 -38439 -28445 -19316 4340 18153 1934 -2334 -8204 -18270 -14044 -1608 -10976 -20035
6649b0035J8169J9476K894j1152j4554Q569K340Q197J9220J558m694k2157l6334
$$ -20035 -1866 17610 20504 9352 -5202 3367 5707 13904 33124 34682 29988 7831 -28503
6636b8503p035K2345n062M015k63J6248j1895j6719L384J498k510r656J0281M4
$$ -28503 -35538 -13193 -18255 -14240 -14503 1745 -10150 -26869 -23485 -21987 -24497 -34153 -23872 -23828
6622b3828N413m042q1R735n764J0028O300J7077L7251M0201n61o7841k4963J091
$$ -23828 -18415 -22457 -22538 -12803 -18567 -8539 -2239 14838 52089 92290 91729 23888 -1075 16
6608A6j5117j748O992j1586j8779L958J4362l978N779J4168N903j789k5714N910
$$ 16 -15101 -16849 -9857 -21443 -40222 -36264 -21902 -25880 -20101 -5933 -30 -1819 -27533 -21623
6594b1623K3041r718j7823J2247K1619J3709K5265k3686l8121O010J409n685Q825
$$ -21623 1418 -8300 -26123 -13876 7743 21452 46717 23031 -15090 -9080 -7671 -13356 -4531
6581d531K107J4524J384p296j818Q518l002M824m18q244j3739j2786P227j3743
$$ -4531 -2424 12100 13484 6188 4370 12888 9886 14710 14292 6048 -7691 -20477 -13250 -26993
6567b6993j8992R634K6561m872N927K9888k5338P931K1721j0527p190N899j5744
$$ -26993 -45985 -36351 -9790 -14662 -8735 21153 -4185 3746 25467 14940 7750 13649 -2095
6554b095j2368j017o277R327J612P540j2307j7787J0817K2844R17j7376q939J8742
$$ -2095 -14463 -15480 -21757 -12430 -10818 -3278 -15585 -33372 -22555 289 1206 -16170 -25109 -6367
6540f367K5886j3400j3207K4149J2626j3747j1395N44J0282L588L292j8920J0794
$$ -6367 19519 6119 -7088 17061 29687 15940 4545 5089 15371 18959 22251 3331 14125
6527A4125J7712o379k3632K5815J8623l1082j9002k276R958J279j9917j0875J6183
$$ 14125 31837 25458 1826 27641 46264 15182 -3820 -6096 3862 5141 -14776 -25651 -9468
6514i468m414j0115k028m193Q511M495p628J9091R952J4463O615k045L609p372
$$ -9468 -13882 -23997 -26025 -30218 -21707 -17212 -24840 -5749 4203 18666 25281 23236 26845 19473
6500A9473m919j7789k923J7717J759l795j1925m013r482j1891j015K5342J8586
$$ 19473 14554 -3235 -6158 11559 13318 9523 -2402 -6415 -15897 -27788 -28803 -3461 15125
6487A5125r29r061O539L507L036n900k047L442j4985k5004J1557K6845P205j5111
$$ 15125 14196 5135 11674 15181 18217 12317 10270 13712 -1273 -26277 -14720 12125 19330 4219
6473D219p332k4897o263k2230n398M896j0066r15Q586j5972j7770m548J7443L9766
$$ 4219 -3113 -28010 -34273 -56503 -61901 -57005 -67071 -67986 -59400 -75372 -93142 -97690 -80247 -40481
6459d0481J0617n412O705l819j9841M930Q847j440J0719J1193N505O664J9933
$$ -40481 -29864 -35276 -28571 -32390 -52231 -47301 -38454 -39894 -29175 -17982 -12477 -5813 14120
6446A4120L4710j7303j9864p488R33N347j3655j0287J0487m050Q814K822m946
$$ 14120 48830 31527 11663 4175 5108 10455 -3200 -13487 -3000 -7050 1764 4586 -360
6433c60J907J1692k987j0823J9263J3720j3668j2648j5875r147p766o745p739
$$ -360 1547 13239 10252 -571 18692 32412 18744 6096 -9779 -18926 -26692 -33437 -41176
6420d1176L3775J0945j465k3923J138J7856J6457K3088K347p109k1023n099o796
$$ -41176 -7401 3544 2079 -21844 -20706 -2850 13607 36695 39042 31933 10910 5811 -985
6407i85k4637o225R088L2713R43o650k965j9853j4102J3199J0455Q998J1020j2469
$$ -985 -25622 -31847 -22759 9954 10897 4247 1282 -18571 -32673 -19474 -9019 -21 10999 -1470
6393a470k278J1772j9076j6924J6443J5729Q728J0019R591j7865r185R957j1070
$$ -1470 -3748 8024 -11052 -27976 -11533 4196 12924 22943 32534 14669 5484 15441 4371
6380D371l1322k3924o859Q959J9193J6918l839m490J7501j060K546O491L437n866
$$ 4371 -26951 -50875 -57734 -48775 -29582 -12664 -16503 -20993 -3492 -4552 -2006 4485 7922 2056
6366B056k0872j23k8815k3707Q120L0227M5885l76j1364Q551j4181q788k672q692
$$ 2056 -18816 -18939 -47754 -71461 -63341 -33114 12771 12395 1031 9582 -4599 -13387 -16059 -24751
6352b4751j7779P666J7928j369O480N226R168J8539l2676j4862K9437K5458m187
$$ -24751 -42530 -34864 -16936 -18305 -11825 -6599 2569 21108 -11568 -26430 3007 28465 24278
6339B4278J3647m53j2803j7925j6393m234q349k248K07J0889J061k3562p958K7768
$$ 24278 37925 37472 24669 6744 -9649 -13883 -22232 -24480 -24273 -13384 -12323 -35885 -43843 -16075
6325a6075J1342q491K83o418r606K0542R824K831J4813k709o640j5122q277p397
$$ -16075 -4733 -13224 -12941 -19359 -28965 -8423 1401 4232 19045 16336 9696 -5426 -13703 -21100
6311b1100K1152L658j3977j809Q738p093P406M728M879n81k5194J0524K3398J59
$$ -21100 52 3710 -10267 -12076 -3338 -10431 -3025 1703 6582 6001 -19193 -8669 14729 14888
6297A4888k8942O749P498J6103J0554o622j6043l0230j6416j59K600K5243j746
$$ 14888 -14054 -7305 193 16296 26850 20228 4185 -26045 -42461 -42620 -40020 -14777 -16523
6284a6523M830j3481r237Q041n127K822k849K5314P186j381M548k1152j6778l221
$$ -16523 -11693 -25174 -34411 -26370 -31497 -28675 -31524 -6210 976 -405 4143 -17009 -33787 -37008
6270c7008J4655L2247r688m93J2195j1055J1595J0803j3838j0616q51J6823N117
$$ -37008 -22353 9894 206 -287 11908 853 12448 23251 9413 -1203 -2054 14769 19886
6257A9886J84k7665k5992M430M0121L0074J793r885k3960J2720J937N177j820
$$ 19886 20070 -7595 -33587 -29157 10964 41038 42831 32946 8986 21706 23643 28820 27000
6244B7000o777m805J0558j984j2470j5578K916J5071j013j0833J3966o351j4000
$$ 27000 20223 15418 25976 23992 11522 -4056 -1140 13931 12918 2085 16051 9700 -4300
6231d300J1235l627Jr283L99o453M250j2756J916j373o214r109J5018N327J5563
$$ -4300 6935 3308 3309 -5974 -5575 -12028 -7778 -20534 -18618 -19991 -26205 -35314 -20296 -14969 594
6216E94k1462r247P554J8942l72N912j609n28J1645J056m678m001j2388l1047
$$ 594 -20868 -30115 -22561 -3619 -3991 1921 312 -216 11429 12485 7807 3806 -8582 -39629
6202c9629R823n015j1826J3855Q693J359J1257R090P028J010k3572m556o839l6492
$$ -39629 -29806 -34821 -46647 -32792 -24099 -22740 -11483 -2393 4635 5645 -17927 -22483 -29322 -65814
6188f5814m527O408N381J7035m366j4219o427K1052O460R317J5790J9682k1745
$$ -65814 -70341 -63933 -58552 -41517 -45883 -60102 -66529 -45477 -39017 -29700 -13910 5772 -15973
6175a5973l733p839J2458R556k6147o122K7224J7898r542k0667j1213O332J7050
$$ -15973 -19706 -27545 -15087 -5531 -31678 -37800 -10576 7322 -2220 -22887 -34100 -27768 -10718
6162a0718O133l526N60j5411K864k290m85Q513j6501j3895J113L1780K9275r122
$$ -10718 -4585 -8111 -7551 -22962 -20098 -22388 -22873 -14360 -30861 -44756 -43643 -11863 17412 8290
6148H290n28J6658n862N506J4867j4629p097M155m212m1820j4013K0576m105N910
$$ 8290 7762 24420 18558 24064 38931 24302 17205 21360 17148 -24672 -38685 -18109 -22214 -16304
6134a6304M849o835o138j7374j0753K2641K4155J3231l483R102l974P767k0961
$$ -16304 -11455 -18290 -24428 -41802 -52555 -29914 -5759 7472 3989 13091 9117 16884 -4077
6121d077j6309J4166J1127o944J9866P211K010J287k4746M333j0306M628p964
$$ -4077 -20386 -6220 4907 -2037 17829 25040 27050 28337 3591 7924 -2382 2246 -5718
6108e718k116l054J3401j8722j9277J6329Q217r566j3487K228J9262K6649K663
$$ -5718 -7834 -10888 2513 -16209 -35486 -19157 -10940 -20506 -33993 -31765 -12503 14146 16809
6095A6809O991N619j8581o888k618k7115p591l938q175J1011J2786K7280j2838
$$ 16809 23800 29419 10838 3950 1332 -25783 -33374 -37312 -45487 -34476 -21690 5590 -7248
6082g248l2512M331o223J7571K4255l550L958j4847o97J0629L931K799q536j4733
$$ -7248 -39760 -35429 -41652 -24081 174 -3376 582 -14265 -14962 -4333 -402 2397 -6139 -20872
6068b0872J001J0515J1565o333j0281J8858j308l357J9098o079k1039q191l497
$$ -20872 -19871 -9356 2209 -4124 -14405 4453 3145 -212 18886 12807 -8232 -16423 -19920
6055a9920l291M148p981j640n026o822o783N651K1030J3564J312J4675q069k6115
$$ -19920 -23211 -19063 -27044 -28684 -33710 -40532 -47315 -41664 -20634 -7070 -5758 8917 848 -25267
6041b5267o868L144J5757J4445k5771J1436P30n892j6472n769J5371O901K1061
$$ -25267 -32135 -28991 -13234 1211 -24560 -13124 -12394 -18286 -34758 -40527 -25156 -18255 2806
6028B806Q875j0728o378L593k8238q397j523J4575L7265J8195K553k9456l3685
$$ 2806 11681 953 -5425 -1832 -30070 -38467 -39990 -25415 11850 30045 32598 3142 -30543
6015c0543k8774q580o37L1640K1701m570k9600L329P877J1700J6943R822L70o832
$$ -30543 -59317 -67897 -68534 -36894 -15193 -19763 -49363 -46034 -38157 -26457 -9514 308 678 -6154
6001f154l0R57l825k698P662K4932j0623r608l64j1745j6043K870k279J2336m827
$$ -6154 -6184 -5227 -9052 -11750 -4088 20844 10221 613 249 -11496 -27539 -24669 -26948 -14612 -19439
5986a9439n583K526l249K892J2707M65J3207M17k9678k0893J0665L159o878Q609
$$ -19439 -25022 -22496 -25745 -22853 -10146 -9681 3526 3943 -25735 -46628 -35963 -32804 -39682 -31073
5972c1073K8223J3223p710j2149k3328k812L997J7163J9123l410J3478k6291j6311
$$ -31073 -2850 10373 2663 -9486 -32814 -35626 -31629 -14466 4657 1247 14725 -11566 -27877
5959b7877O345O518j6973j0714n88J0508j802L2546K1094p314L4381p174m4259
$$ -27877 -21532 -15014 -31987 -42701 -43289 -32781 -34583 -2037 19057 11743 46124 38950 -5309
5946e309K261J3791K0733O86n60R09k1490k2099j5625n02O563p182J2649K2222
$$ -5309 -3048 10743 31476 32162 31602 32511 11021 -11078 -26703 -27205 -20642 -27824 -15175 7047
5932G047j5283N513J5057p611j8933j865O43P659J2789L771j0022M615L296N45
$$ 7047 -8236 -2723 12334 4723 -14210 -16075 -15432 -7773 5016 8787 -1235 3380 6676 7221
5918G221q166L008j267N53k6003j7500M903K3699J1667j2117O836q088J0151q999
$$ 7221 -945 2063 796 1349 -24654 -42154 -37251 -13552 -1885 -14002 -7166 -15254 -5103 -14102
5904a4102J2623K2729q143j7159l894R687J7820j8686J6J1079K980l6333l7565
$$ -14102 -1479 21250 13107 -4052 -7946 1741 19561 875 891 11970 14950 -21383 -58948
5891e8948J2104J2314j4833m931Q440K2249J4301K2730J6020n67j0584j3032o319
$$ -58948 -46844 -34530 -49363 -54294 -45854 -23605 -9304 13426 29446 28879 18295 5263 -1056
5878a056n375J6323N314m185k4816j6476q995m151P582L182J9533j0073J9878
$$ -1056 -6431 9892 15206 11021 -13795 -30271 -39266 -43417 -35835 -32653 -13120 -23193 -3315
5865c315J1458J0458j4559j3956J0154J1686J4989J5476Q833j0288j1279j2516
$$ -3315 8143 18601 4042 -9914 240 11926 26915 42391 51224 40936 29657 17141
5853A7141m462n995r32k0780o818n781j0593J7789J6739j292j1293J845L579K8128
$$ 17141 12679 6684 5752 -15028 -21846 -27627 -38220 -20431 -3692 -4984 -16277 -14432 -10853 17275
5839A7275P61j0556j5540L196R109j7691N728J3391P145r452j6992o757K3571
$$ 17275 18036 7480 -8060 -4864 4245 -13446 -7718 5673 12818 3366 -13626 -20383 3188
5826C188K2098L487k3374j6521j2064k3337N655K4544J3774P095O003j0881l179
$$ 3188 25286 28773 5399 -11122 -23186 -46523 -40868 -16324 -2550 4545 10548 -333 -3512
5813c512r421j9033j952L6695P386l499j0514K0227P772M139O05j9094m066l7888
$$ -3512 -12933 -31966 -33918 2777 10163 6664 -3850 16377 24149 28288 28893 9799 5733 -32155
5799c2155N52M2971J9197j4371j3784k6585j5636M690M206K7528K5806K2058q706
$$ -32155 -31603 11368 30565 16194 2410 -24175 -39811 -35121 -30915 -3387 22419 44477 35771
5786C5771M516m031J2285j4374q852j9967j0879j2317j3482j0289J7920J1115
$$ 35771 40287 36256 48541 34167 25315 5348 -5531 -17848 -31330 -41619 -23699 -12584
5774a2584M709J8705O40J7022k36l3376j7058n383J2234J872l0557R889J7781
$$ -12584 -7875 10830 11470 28492 28256 -5120 -22178 -27561 -15327 -13455 -44012 -34123 -16342
5761a6342K0919N199p049l0925R078J9803l446m74k2094J5199K1270P16j2034
$$ -16342 4577 9776 2727 -28198 -19120 683 -2763 -3237 -25331 -10132 11138 11854 -180
5748a80m897j5873M851j3717J6163K1236k945k9357L835J7292P32J5736k0994
$$ -180 -5077 -20950 -16099 -29816 -13653 7583 4638 -24719 -20884 -3592 -2860 12876 -8118
5735h118J261R319J2693J1187J827N18k2507l541J1658j1342o468q915n273J6453
$$ -8118 -6857 2462 15155 26342 28169 28687 6180 2639 14297 2955 -3513 -12428 -17701 -1248
5721a248K8368k4033k2568J3334P220J3540J1041R842K779k3794P083K531k0988
$$ -1248 27120 3087 -19481 -6147 1073 14613 25654 35496 38275 14481 21564 24095 3107
5708C107k805j0770K1067M749l3359j791K8442J1581l766m772o267l361J1582
$$ 3107 302 -10468 10599 15348 -18011 -19802 8640 20221 16455 11683 5416 2055 13637
5695A3637k0351K791Q726j2039j2194k67K0289K881n614J104r190Q203M778J2176
$$ 13637 -6714 -3923 4803 -7236 -19430 -19697 592 3473 -2141 -1037 -10227 -2024 2754 14930
5681A4930m825k1894r201k0352j3159K2443J0899m026K2416J7479p663k4293j6270
$$ 14930 10105 -11789 -20990 -41342 -54501 -32058 -21159 -25185 -2769 14710 7047 -17246 -33516
5668c3516R473K5367K0869k088j5485k6321o70J6553J0836j501J5189j0791k2948
$$ -33516 -24043 1324 22193 20105 4620 -21701 -22371 -5818 5018 3517 18706 7915 -15033
5655a5033j5239j2314L102J3852R717o104N491k3245J830J3905J8209J6390j814
$$ -15033 -30272 -42586 -39484 -25632 -15915 -22019 -16528 -39773 -37943 -24038 -5829 10561 8747
5642H747m163o234J6841J9427k414l1300k2807Q039K4307K340K563k5044k7313
$$ 8747 4584 -1650 15191 34618 32204 904 -21903 -13864 10443 12783 15346 -9698 -37011
5629c7011J9142k726q604J98J3861n922J0707k556n13j2547K8167P766k0881J498
$$ -37011 -17869 -20595 -29199 -29001 -15140 -21062 -10355 -12911 -13424 -25971 2196 9962 -10919 -9421
5615i421J466j1898m561J8009J1630J1002K6238K1018J3838j2787k2584k3262
$$ -9421 -7955 -19853 -24414 -6405 5225 16227 42465 63483 77321 64534 41950 18688
5603A8688j7769j0190m169j6602J0784J730J013J5631j3557q391J5677j292k70
$$ 18688 919 -9271 -13440 -30042 -19258 -17528 -16515 -884 -14441 -22832 -7155 -8447 -8717
5590h717m2020R115N6475Q146n695O359k1076m529m712L292Q276j6537o632q893
$$ -8717 -50737 -41622 14853 22999 17304 23663 2587 -1942 -6654 -3362 4914 -11623 -18255 -27148
5576b7148k042K9897N243j5176k7652R691L7654J6485o836k0899j5539l0889J4554
$$ -27148 -29190 707 5950 -9226 -36878 -27187 10467 26952 20116 -783 -16322 -47211 -32657
5563c2657J7175J2102N28k632M114L300j979k635m308K5390J9659k2480k5695
$$ -32657 -15482 -3380 -2852 -5484 -1370 1930 -49 -2684 -6992 18398 38057 15577 -10118
5550a0118R470L679J0383Q853j964m241O494K429p946j9848j4032k383J0555p347
$$ -10118 -648 3031 13414 22267 20303 16062 22556 24985 17039 -2809 -16841 -19224 -8669 -16016
5536a6016o181K4021J0960J7098j8090j4792M259J2679K414O314j898q428k9456
$$ -16016 -22197 1824 12784 29882 11792 -3000 1259 13938 16352 22666 20768 12340 -17116
5523a7116p926m232K502J5919p154j1668r952j3543K8470L1850p857J640j4936
$$ -17116 -25042 -29274 -26772 -10853 -18007 -29675 -39627 -53170 -24700 7150 -707 933 -14003
5510a4003J63Q54M929r288L52j3817J4712J3154l085j1587j5620J2356K7101j858
$$ -14003 -13840 -12986 -8057 -17345 -16993 -30810 -16098 -2944 -6029 -17616 -33236 -20880 6221 4363
5496D363j1714j7192l9723J2635L9918J0220r44P139J0422O838m152k4549j7676
$$ 4363 -7351 -24543 -64266 -51631 -11713 -1493 -2437 4702 15124 21962 17810 -6739 -24415
5483b4415j2857Q422O797l635q58P334j0438j1038K7293P904m010k881q634j902
$$ -24415 -37272 -28850 -22053 -25688 -26546 -19212 -29650 -40688 -13395 -5491 -9501 -12382 -21016 -22918
5469b2918k676M183N285L7754r489j0650N151j197j8924j869P735L1506K1311
$$ -22918 -25594 -21411 -16126 21628 12139 1489 6640 5443 -13481 -15350 -7615 23891 45202
5456D5202k0243k8977KM578k909o659j4981j1397K1363K6024J7863r831j9018
$$ 45202 24959 -4018 -4016 562 -2347 -9006 -23987 -35384 -14021 12003 29866 20035 1017
5443A017k5795R710J6802j5041R418O001K0319K8561j6762k0779P42r852J1680
$$ 1017 -24778 -15068 1734 -13307 -3889 2112 22431 50992 34230 13451 14193 4341 16021
5430A6021N765n766N67J066J8506J0545j7889m4099m539m415J9735J520j5043
$$ 16021 21786 16020 16587 17653 36159 46704 28815 -15284 -19823 -24238 -4503 -2983 -18026
5417a8026j1413j6536K3635m584R066Q446p037l744N176k7q051j3528K5307K5026
$$ -18026 -29439 -45975 -22340 -26924 -17858 -9412 -16449 -20193 -15017 -15044 -23095 -36623 -11316 13710
5403A3710j4482Q277L842j6804Q123j4332k7395J2180J5149J8198l4487q563K1245
$$ 13710 -772 7505 11347 -5457 2666 -11666 -39061 -26881 -11732 6466 -28021 -36584 -15339
5390a5339K0355M50j068M378r238N719Q270J9077j628k1106k4353j9264J0485
$$ -15339 5016 5466 4398 8776 -462 5257 13527 32604 30976 9870 -14483 -33747 -23262
5377b3262K0188P984P838k4651K7442K0515j6160M413o587L056j531j7932n154
$$ -23262 -3074 4910 12748 -11903 15539 36054 19894 24307 17720 20776 19245 1313 -3841
5364c841J8209J4301j4278K99j0912m613k176J975j1052K736J0646J7352K397
$$ -3841 14368 28669 14391 14690 3778 -835 -3011 -1036 -12088 -9352 1294 18646 21043
5351B1043j1353Q30j9669k57p275P57L199L3526J005j1898J9028o866o082J4790
$$ 21043 9690 10520 -9149 -9406 -16681 -15924 -12725 20801 21806 9908 28936 22070 15988 30778
5337C0778J9666j4359k2545J4125J3697j9880j3785j0997j8048m09M279J6007
$$ 30778 50444 36085 13540 27665 41362 21482 7697 -3300 -21348 -21757 -17478 -1471
5325a471n287k263J2546J1417J816J283j2354j0051l809j546j20M917j2878k0137
$$ -1471 -6758 -9021 3525 14942 16758 18041 5687 -4364 -8173 -9719 -9839 -4922 -17800 -37937
5311c7937J6795R161J6301J461J4557k0170m04K2221l973j8251l0593K078L4877
$$ -37937 -21142 -11981 4320 5781 20338 168 -236 21985 18012 -239 -30832 -28754 6123
5298F123l935R853L7396j7730j8221o717p131O127n67p384P165o658l658j1504
$$ 6123 2188 12041 49437 31707 13486 6769 -362 5765 5198 -2186 4979 -1679 -5337 -16841
5284a6841k0486l320K4080j013j0416K6547N675o575j0582j0977J6386J8950r937
$$ -16841 -37327 -40647 -16567 -17580 -27996 -1449 4226 -2349 -12931 -23908 -7522 11428 1491
5271A491K3513L0342k4826j9391j6210p556J9649J0718k0394j9540j6524k1102
$$ 1491 25004 55346 30520 11129 -5081 -12637 7012 17730 -2664 -22204 -38728 -59830
5259e9830J9484J8594O918N150q096q96o180p070J130K0436R052m89J3106o258
$$ -59830 -40346 -21752 -14834 -9684 -17780 -18676 -24856 -31926 -30796 -10360 -1308 -1797 11309 5051
5245E051p045J6106p122Q197K5771j1806j5335k3624j6771N491O230k587j1308
$$ 5051 -1994 14112 6990 15187 40958 29152 13817 -9807 -26578 -21087 -14857 -17444 -28752
5232b8752j6630K4285J7815m519J7363J771P679J7276j4339j9831p623K197r568
$$ -28752 -45382 -21097 -3282 -7801 9562 11333 19012 36288 21949 2118 -5505 -3308 -12876
5219a2876O500k310k4099j0190J1704l682J5251Q536o420N227o723J1273L2791
$$ -12876 -6376 -8686 -32785 -42975 -31271 -34953 -19702 -11166 -17586 -12359 -19082 -7809 24982
5206B4982J9929n046k2704k0195J391o71L295j7335j0486J3212j5098J4181J3141
$$ 24982 44911 39865 17161 -3034 -1643 -2314 981 -16354 -26840 -13628 -28726 -14545 -1404
5193a404R02J2531P623j8490n778J9904n459l058k826j2379r07l344K1930Q455
$$ -1404 -502 12029 19652 1162 -4616 15288 9829 6771 3945 -8434 -9341 -12685 9245 17700
5179A7700L639j111j5298J229R579J899j3008k1802l234P913J3956J2412J0570
$$ 17700 21339 20228 4930 6159 15738 17637 4629 -17173 -20407 -12494 1462 13874 24444
5166B4444k8539k9139q530j212n863J4309j7947J2655J1640R588p350k4676K5363
$$ 24444 -4095 -33234 -41764 -42976 -48839 -34530 -52477 -39822 -28182 -18594 -25944 -50620 -25257
5153b5257J8761J1227n73m216o93m81r986j4288O42K4651Q914R042q945k8525
$$ -25257 -6496 4731 4158 -58 -751 -1232 -11218 -25506 -24864 -213 8701 17743 8798 -19727
5139a9727j5623J4784J5491K6828o084J5586q723l1044m101N018J1726J4595k679
$$ -19727 -35350 -20566 -5075 21753 15669 31255 22532 -8512 -12613 -7595 4131 18726 16047
5126A6047k6225n93N26K930p147l135k1089n863J0059O073L505J5811k807R733
$$ 16047 -10178 -10771 -10245 -7315 -14462 -17597 -38686 -44549 -34490 -28417 -24912 -9101 -11908 -2175
5112b175K4396J1352j4356l4875l2597R193K5049J2739J5623j2918l6178J0920
$$ -2175 22221 33573 19217 -15658 -48255 -39062 -14013 -1274 14349 1431 -34747 -23827
5100b3827L7729J4725o601k2507j0972j42K7456o963j4410L477K442r641j9654
$$ -23827 13902 28627 22026 -481 -11453 -11595 15861 8898 -5512 -2035 407 -9234 -28888
5087b8888O168J9936L3811K975k4995o298J6804j3218j2611p218J0940M849q248
$$ -28888 -22720 -2784 31027 34002 9007 2709 19513 6295 -6316 -13534 -2594 2255 -5993
5074e993J0470M281n550N794l390J5721J1555Q376q971j6872j7733j1919P521
$$ -5993 4477 8758 3208 9002 5612 21333 32888 41264 32293 15421 -2312 -14231 -6710
5061f710q055r46j0907j0196K2599N893j4511O815j2439l320P489J1322K1455
$$ -6710 -14765 -15711 -26618 -36814 -14215 -8322 -22833 -16018 -28457 -31777 -24288 -12966 8489
5048H489M150p973J3368n851J9700j951k8634l216j8198J9472Q961k3998M137
$$ 8489 12639 4666 18034 12183 31883 29932 1298 -1918 -20116 -644 8317 -15681 -11544
5035a1544J6140K2072j9125M218N479j9938P030m480k1273j3361L594K1735P434
$$ -11544 4596 26668 7543 11761 17240 -2698 4332 -148 -21421 -34782 -31188 -9453 -2019
5022b019r73j1734k367J2642n71R49r0k2177J230k945L861J0307J6137J734j0487
$$ -2019 -2992 -14726 -17093 -4451 -5022 -4073 -4163 -26340 -25110 -28055 -24194 -13887 2250 3984 -6503
5007f503K638n917j9588J590j3316j742j0J903J9452J1186m22j1096J5690m257
$$ -6503 -3865 -9782 -29370 -27780 -41096 -42838 -42848 -40945 -21493 -10307 -10729 -21825 -6135 -10392
4993a0392j1480L321m19j4087n832J322J0651j122k0001l744J0607K9085J7827
$$ -10392 -21872 -18551 -18970 -33057 -38889 -37567 -26916 -28038 -48039 -51783 -41176 -12091 5736
4980E736J614j6253j9451J1891J6615o250J9828R337j6677n334P118k0028k02
$$ 5736 7350 -8903 -28354 -16463 152 -6098 13730 23067 6390 1056 8174 -11854 -12056
4967a2056j2365r014J289K0914J3179p224l3381j0434K1137K792L362L367J896
$$ -12056 -24421 -33435 -32146 -11232 1947 -5277 -38658 -49092 -27955 -25163 -21801 -18434 -16538
4954a6538J1166o820p065J8441K0862q261q612K705p261k636j4212o523J2517
$$ -16538 -5372 -12192 -19257 -816 20046 11785 3173 5878 -1383 -4019 -18231 -24754 -12237
4941a2237Q523l97j5133k7040J6958m935M86K1935o472n79P91j7388N76N551K0413
$$ -12237 -3714 -4111 -19244 -46284 -29326 -34261 -33775 -11840 -18312 -18891 -18100 -35488 -34912 -29361 -8948
4926h948M296R056L636j449p483R069o846m4852j1480L0594j614o382N946K7565
$$ -8948 -4652 4404 8040 6591 -892 8177 1331 -43521 -55001 -24407 -26021 -32403 -26457 1108
4912A108K6819k4518k2247J1130Q228K763m577p945p016K1096R986k1857l512
$$ 1108 27927 3409 -18838 -7708 520 3283 -1294 -9239 -16255 4841 14827 -7030 -10542
4899a0542O685n263p494J0805j3139J0025K4272Q25k4712J8316n569j7027p535
$$ -10542 -3857 -9120 -16614 -5809 -18948 -8923 15349 16174 -8538 9778 4209 -12818 -20353
4886b0353m301j2241L8440q426q576K8736j3107m272J109K0290r320k00o086j4247
$$ -20353 -24654 -36895 1545 -6881 -15457 13279 172 -4100 -2991 17299 7979 7779 1693 -12554
4872a2554J095K8761q006j9253l257M06P620N739k0178k7219J4289J4411O289
$$ -12554 -11459 17302 9296 -9957 -13214 -12808 -5188 551 -19627 -46846 -32557 -18146 -11857
4859a1857K5814K234j5631j3269q89K3554K2426j3503m649n264j5918k596O373
$$ -11857 13957 16191 560 -12709 -13598 9956 32382 18879 14230 8966 -6952 -9548 -3175
4846c175Q060j5570j6298O9l391J3560J9830J4500k0919P820l591l4813j3172
$$ -3175 4885 -10685 -26983 -26914 -30305 -16745 3085 17585 -3334 4486 895 -33918 -47090
4833d7090K948K568M814j7724J4919n267r18K1983K1466M863M021K0329K5020
$$ -47090 -44142 -41574 -36760 -54484 -39565 -44832 -45750 -23767 -2301 2562 6583 26912 51932
4820E1932j2996k2189j8454j4549j097R15R072Q610Q611M25J4670J0812j0242
$$ 51932 38936 16747 -1707 -16256 -17353 -16438 -7366 1244 9855 10280 24950 35762 25520
4807B5520k1879J17n337l2127o84K5429J0149j0524n716j037m451q538j5428k389
$$ 25520 3641 3758 -1579 -33706 -34390 -8961 1188 -9336 -15052 -16089 -20540 -29078 -44506 -46895
4793d6895N853J1837J1752P994M172J516k160j5143q11m087R571L69J4937k2991
$$ -46895 -41042 -29205 -17453 -9459 -5287 -3771 -5931 -21074 -21885 -25972 -16401 -16032 -1095 -24086
4779b4086J626J5932k2245j5385K5154J5545q95j6276O56K2400R086n324p902
$$ -24086 -22460 -6528 -28773 -44158 -19004 -3459 -4354 -20630 -19974 2426 11512 6188 -1714
4766a714J2746J8131O424k9377k4326k4917n603K5176r052m23L03K0799j5408
$$ -1714 11032 29163 35587 6210 -18116 -43033 -48636 -23460 -32512 -32935 -32632 -11833 -27241
4753b7241K0218Q196j5641k0963J0785J1088J070J4627p205j4818N491q901J4646
$$ -27241 -7023 1173 -14468 -35431 -24646 -13558 -12488 2139 -5066 -19884 -14393 -23294 -8648
4740h648K1626L477N54r50k7843j6064M029K3059J041J1142J1762j523j3418L105
$$ -8648 12978 16455 17009 16059 -11784 -27848 -23819 -760 281 11423 23185 21662 8244 11349
4726A1349J406l952p620m345j906L2783J2301k3753j6942j1506r576o498J0807
$$ 11349 12755 8803 1183 -3162 -5068 27715 40016 16263 -679 -12185 -21761 -28259 -17452
4713a7452J4618J4856J6082k6309j9615r999M218k2956k9977P221L7357J9158
$$ -17452 -2834 12022 28104 1795 -17820 -27819 -23601 -46557 -76534 -69313 -31956 -12798
4701a2798J78K6265l034r840p976n003p388O909J234k4334k1559J2775M436J5498
$$ -12798 -12620 13645 10611 771 -7205 -12208 -19596 -12687 -11453 -35787 -57346 -44571 -40135 -24637
4687b4637K7835N841M169p543O68q843j5918n402r235j2110J6166J5304j0149
$$ -24637 3198 9039 13208 5665 6333 -2510 -18428 -23830 -33065 -45175 -29009 -13705 -23854
4674b3854m230k030L0196J6943K085j0103k1243j290J2913j1616q487K267j739
$$ -23854 -28084 -30114 82 17025 19110 9007 -12236 -13526 -613 -12229 -20716 -18449 -20188
4661b0188N883J5975O785J5848k1488L116j8475m349J0798J2844J9492j4861l407
$$ -20188 -14305 1670 8455 24303 2815 5931 -12544 -16893 -6095 6749 26241 11380 7973
4648G973j4251j0825P781j4711R592J6150K791J0973k459j5650J1911j1188k2387
$$ 7973 -6278 -17103 -9322 -24033 -14441 1709 4500 15473 13014 -2636 9275 -1913 -24300
4635b4300l245O816J736j563p012q642p235J1001K7769K6707j1144j1412k678
$$ -24300 -27545 -20729 -18993 -20556 -27568 -36210 -43445 -32444 -4675 22032 10888 -524 -3202
4622c202j9431M49J2205j4876K956K1131N861J4499j0905j2381L940R160j7514
$$ -3202 -22633 -22184 -9979 -24855 -21899 -768 5093 19592 8687 -3694 246 9406 -8108
4609h108j4063L1212J1895o682k4304J5770J5451N742j8376k9673j1902N584N15
$$ -8108 -22171 9041 20936 14254 -10050 5720 21171 26913 8537 -21136 -33038 -27454 -26939
4596b6939n530J7794K3151P15Q957M437k3726p567P826Q51N133l522j738p284
$$ -26939 -32469 -14675 8476 9191 18148 22585 -1141 -8708 -882 -31 5102 1580 -158 -7442
4582g442j7847m541J4397j462M312J9110K1054m548j2920m158j0678j5009R466
$$ -7442 -25289 -29830 -15433 -16895 -12583 6527 27581 23033 10113 5955 -4723 -19732 -10266
4569a0266J2129J147r040p090M6651j02q705J70j1585M181J4174j0720j3893j5404
$$ -10266 1863 3010 -6030 -13120 33531 33429 24724 24894 13309 17490 31664 20944 7051 -8353
4555h353J1252R766M75j4142J2148J8752j216j2406j2075k1473p897k384O760
$$ -8353 2899 12665 13140 -1002 11146 29898 28682 16276 4201 -17272 -25169 -27553 -20793
4542b0793l337J4608L334O70J0627k58o34O006J2591N391M433m833j7650l843
$$ -20793 -24130 -9522 -6188 -5518 5109 4851 4217 10223 22814 28205 32638 27805 10155 6312
4528F312O630k679j5857n856P311K8194N854l1713k9955k487J2854J4366J2894
$$ 6312 12942 10263 -5594 -11450 -4139 24055 29909 -1804 -31759 -34246 -21392 -7026 5868
4515E868J8790N858m447m665r569p421j5635r955p792K0365K0353P752q766j4905
$$ 5868 24658 30516 26069 21404 11835 4414 -11221 -21176 -28968 -8603 11750 19502 10736 -4169
4501d169k1589O983K7864Q747J5908j9509l067j871j2340N200k4454k7994J4037
$$ -4169 -25758 -18775 9089 17836 33744 14235 11168 9297 -3043 2157 -22297 -50291 -36254
4488c6254J4166J1476P93P674k846M611J1877J0835J203J4620k5712l0922K148
$$ -36254 -22088 -10612 -9819 -2145 -4991 -380 11497 22332 23535 38155 12443 -18479 -16331
4475a6331r327L257R816L1185J9329k6645m324o792j5823j2116k898p163J6553
$$ -16331 -25658 -22401 -12585 18600 37929 11284 6960 168 -15655 -27771 -30669 -37832 -21279
4462b1279m830R8K2803q80J7107R343j3131j5164N314j1421Q067K0577Q572o128
$$ -21279 -26109 -26011 -3208 -4088 13019 22362 9231 -5933 -619 -12040 -3973 16604 25176 19048
4448A9048j3682j3615m196k2R420K5947N763k9774j9073N824O444J065J0906p787
$$ 19048 5366 -8249 -12445 -12467 -3047 22900 28663 -1111 -20184 -14360 -7916 -6851 4055 -3732
4434c732O823N040j5728N426N695j2075p496J055k4963m891J8300J7397K5658
$$ -3732 3091 8131 -7597 -2171 3524 -8551 -16047 -14992 -39955 -44846 -26546 -9149 16509
4421A6509j64q387p232k4860j9007M3972N253k6265K312O758K5079j172j4274
$$ 16509 16345 7958 726 -24134 -43141 831 6084 -20181 -17869 -11111 13968 12796 -1478
4408a478N886J543J7297l91m775J012k3266l636m749j1211o564K3242K0076K367
$$ -1478 4408 5951 23248 22857 18082 19094 -4172 -7808 -12557 -23768 -30332 -7090 12986 15353
4394A5353M298l2624p198J4341J9897j0052K3061L0482l118k6360j4366n81J0689
$$ 15353 19651 -12973 -20171 -5830 14067 4015 27076 57558 54440 28080 13714 13133 23822
4381B3822m165k8956l521M717J4673J0299l925L687k460q745N86j9925O355k7
$$ 23822 19657 -9299 -12820 -8103 6570 16869 12944 16631 14171 5426 6012 -13913 -7558 -7585
4367g585k583r905R705J4042M638j3944j1277L292K6891j8776r488O676J0870
$$ -7585 -10168 -20073 -10368 3674 8312 -5632 -16909 -13617 13274 -5502 -14990 -8314 2556
4354B556R68j1045M045j4374K3437P065Q703P635K70k7424o976l692J1685J2727
$$ 2556 3524 -7521 -3476 -17850 5587 12652 21355 28990 29260 1836 -5140 -8832 2853 15580
4340A5580p948Q76p578L895j4228N579j696j2879l910k116m229M421K3357K476
$$ 15580 7632 8508 930 4825 -9403 -3824 -5520 -18399 -22309 -24425 -28654 -24233 -876 1600
4326A600l041Q714j2183r957j1377J0388K0313K601j0731r12K0837j3483k918
$$ 1600 -1441 7273 -4910 -14867 -26244 -15856 4457 7058 -3673 -4585 16252 2769 -149
4313a49P80j3975j2343L458J5780N862j3363J7890J5037j0097J1402J6464O882
$$ -149 631 -13344 -25687 -22229 -6449 -587 -13950 3940 18977 8880 20282 36746 43628
4300D3628l0082j8978r621M991J2470K979O192N807j9831j3038l060L143J0453
$$ 43628 13546 -5432 -15053 -10062 2408 5387 11579 17386 -2445 -15483 -18543 -15400 -4947
4287d947O354j9216J8605J060K247j3072N347N951J2910R664k9509K207Q434l581
$$ -4947 1407 -17809 796 1856 4103 -8969 -3622 2329 15239 24903 -4606 -2399 6035 2454
4273B454l63j4878j740L116j6717J5680J7968J5967L239k481j9257M507K092r079
$$ 2454 2091 -12787 -14527 -11411 -28128 -12448 5520 21487 24726 22245 2988 7495 9587 508
4259E08r001P659J3543O060L797l7955j4640K5503Q335J7003k056o328j385j3523
$$ 508 -8493 -834 12709 18769 22566 -15389 -30029 -4526 3809 20812 18756 12428 11043 -2480
4245b480R421K6235O310j3070M419n162P931l0578n951O339J0268K470m766O861
$$ -2480 6941 33176 39486 26416 30835 25673 33604 3026 -2925 3414 13682 16152 11386 18247
4231A8247M133n780k6437o215N823O748J8801j5108J335L4713k924j6706r325
$$ 18247 22380 16600 -9837 -16052 -10229 -3481 15320 212 1547 36260 33336 16630 7305
4218G305M089j1572q559j6144k1178q528K0348K4611J1583Q728n674j0818k3166
$$ 7305 11394 -178 -8737 -24881 -46059 -54587 -34239 -9628 1955 10683 5009 -5809 -28975
4205b8975M993P443j1896p149M199l614R794J7158J9205n914j2070q278P628J8929
$$ -28975 -23982 -16539 -28435 -35584 -31385 -34999 -25205 -8047 11158 5244 -6826 -15104 -7476 11453
4191A1453j1379l7492P47J8243L7054L727q626l564j9649l468L890J8472k438
$$ 11453 74 -37418 -36671 -18428 18626 22353 13727 10163 -9486 -12954 -9064 9408 6970
4178F970j5594k1886k845J5437J6362K1693p901r292k8067O766J7453J3871n155
$$ 6970 -8624 -30510 -33355 -17918 -1556 20137 12236 2944 -25123 -18357 -904 12967 7812
4165G812k73n400J8273L229N33J0708l6988l6833J2543J2755j6027j5740R903
$$ 7812 7539 2139 20412 23641 24174 34882 -2106 -38939 -26396 -13641 -29668 -45408 -35505
4152c5505J4160J2482Q397L746O44J2004J1576j4992j7302m454K4084O564k5573
$$ -35505 -21345 -8863 -466 3280 3924 15928 27504 12512 -4790 -9244 14840 21404 -4169
4139d169j2977o200J4301J4660J406r146J890n712j4441q79K1547R156j8825j2227
$$ -4169 -17146 -23346 -9045 5615 7021 -2125 -235 -5947 -20388 -21267 280 9436 -9389 -21616
4125b1616q956P782N859K8275j741q24J4066j3101k2116j6669R424J6248P101
$$ -21616 -30572 -22790 -16931 11344 9603 8779 22845 9744 -12372 -29041 -19617 -3369 3732
4112C732j9305L362J5558M79j6972j8475J3631O928l29o540J1911J0918p494l8308
$$ 3732 -15573 -12211 3347 3826 -13146 -31621 -17990 -11062 -11391 -17931 -6020 4898 -2596 -40904
4098d0904p435K6958K2412J2106q815k3814N024j2863M96j4l529j808j4663K1097
$$ -40904 -48339 -21381 1031 13137 4322 -19492 -14468 -27331 -26835 -26849 -30378 -32186 -46849 -25752
4084b5752R844k4383J0998J1707k4630j5625L2833J2585k2918J5613L6042J1510
$$ -25752 -15908 -40291 -29293 -17586 -42216 -57841 -25008 -12423 -35341 -19728 16314 27824
4072B7824O760j861P284j7558j4856J8468J0871q888k393j863L680R444o753l5896
$$ 27824 34584 32723 40007 22449 7593 26061 36932 28044 25651 23788 27468 36912 30159 -5737
4058e737l1069J9383k1008K159J7472m945O599O735j2739o537J213M134q768L496
$$ -5737 -36806 -17423 -38431 -36272 -18800 -23745 -17146 -10411 -23150 -29687 -28474 -24340 -33108 -29612
4044b9612J3674J4200k1466r054N031L0209K7485m131j1329J9455Q220j0793l300
$$ -29612 -15938 -1738 -23204 -32258 -27227 2982 30467 26336 15007 34462 42682 31889 28589
$$ [...]
##END NTUPLES=NMR SPECTRUM
##END=
