##TITLE=Analysis number 327615
Compound Code btb 07148
Book Reference 46188
Project Code adrs flro3
Chemist Name jom
##JCAMPDX= 6.0         $$ Bruker NMR JCAMP-DX V2.0
##DATA TYPE= NMR SPECTRUM
##DATA CLASS= NTUPLES
##ORIGIN= Bruker BioSpin GmbH
##OWNER= nmr
$$ XWIN-NMR		Version 3.5
$$ Wed Mar 28 09:35:39 2007 GMT Daylight Time (UT+1h)  MAYBRIDGE\nmr@NMR_250MHZ
##.OBSERVE FREQUENCY= 250.131544655141
##.OBSERVE NUCLEUS= ^1H
##.ACQUISITION MODE= SIMULTANEOUS (DQD)
##.ACQUISITION SCHEME= undefined
##.AVERAGES= 16
##.DIGITISER RES= 18
##SPECTROMETER/DATA SYSTEM= dpx250
##.PULSE SEQUENCE= zg30
##.SOLVENT NAME= DMSO
##.SHIFT REFERENCE= (INTERNAL, DMSO, 0, 16.522)
##AUDIT TRAIL= $$ (NUMBER, WHEN, WHO, WHERE, WHAT)
$$ ##TITLE= Audit trail, XWIN-NMR		Version 3.5
$$ ##JCAMPDX= 5.01
$$ ##ORIGIN= Bruker BioSpin GmbH
$$ ##OWNER= nmr
$$ C:\u/data/dgb/nmr/ADRS/2360/pdata/1/auditp.txt
$$ ##AUDIT TRAIL=  $$ (NUMBER, WHEN, WHO, WHERE, WHAT)
(   1,<2007-03-28 09:35:13.95 +100>,<MAYBRIDGE\nmr>,<NMR_250MHZ>,
      <created by zg, POWCHK disabled, PULCHK disabled
       configuration hash MD5:
       49 4B E0 1D 92 C2 6B 37 9F E6 65 BC 52 41 86 1D
       data hash MD5: 64K
       81 C1 BC 4A 6E 06 B7 08 7C C0 9F 8A F0 23 F2 F9>)
(   2,<2007-03-28 09:35:28.25 +100>,<MAYBRIDGE\nmr>,<NMR_250MHZ>,
      <Start of raw data processing
       ef LB = 0.3 FT_mod = 6 PKNL = 1 SI = 32K 
       data hash MD5: 32K
       63 69 D8 05 F5 B8 EE 1B 37 B6 47 CB 93 71 0E C2>)
(   3,<2007-03-28 09:35:29.97 +100>,<MAYBRIDGE\nmr>,<NMR_250MHZ>,
      <apk 
       data hash MD5: 32K
       E4 AE 4E AB A8 7D 1B E9 7A 7E B7 8B AF 76 36 1B>)
(   4,<2007-03-28 09:35:30.95 +100>,<MAYBRIDGE\nmr>,<NMR_250MHZ>,
      <abs ABSG = 5 
       data hash MD5: 32K
       15 14 11 F2 89 50 A7 C1 E1 47 B5 F0 39 5E C2 9D>)
$$ ##END=
$$ 
$$ hash MD5
$$ EF F1 8E 97 05 F5 23 13 26 2D 6B 41 1E 6D 98 53
##$RELAX= 
##$RELAX= 
##$RELAX= 
##$RELAX= 
##$RELAX= 
##$RELAX= 
##$RELAX= 
$$ Bruker specific parameters
$$ --------------------------
##$DU= <C:\u>
##$EXPNO= 2360
##$NAME= <ADRS>
##$PROCNO= 1
##$TYPE= <nmr>
##$USER= <dgb>
##$AMP= (0..31)
100 100 100 100 100 100 100 100 100 100 100 100 100 100 100 100 100 100 
100 100 100 100 100 100 100 100 100 100 100 100 100 100 
##$AQSEQ= 0
##$AQ_mod= 3
##$AUNM= <au_zg>
##$AUTOPOS= <2 >
##$BF1= 250.13
##$BF2= 250.13
##$BF3= 250.13
##$BF4= 250.13
##$BF5= 500.13
##$BF6= 500.13
##$BF7= 500.13
##$BF8= 500.13
##$BYTORDA= 1
##$CFDGTYP= 0
##$CFRGTYP= 5
##$CHEMSTR= <none>
##$CNST= (0..31)
1 1 145 1 1 1 1 1 1 1 1 1 1 1 1 1 1 1 1 1 1 1 1 1 1 1 1 1 1 1 1 1 
##$CPDPRG= <>
##$CPDPRG1= <>
##$CPDPRG2= <>
##$CPDPRG3= <>
##$CPDPRG4= <mlev>
##$CPDPRG5= <mlev>
##$CPDPRG6= <mlev>
##$CPDPRG7= <mlev>
##$CPDPRG8= <mlev>
##$CPDPRGB= <>
##$CPDPRGT= <>
##$D= (0..31)
0 1 0 0 0 0 0 0 0 0.06 0 0 0 0 0 0 0.0002 0 0 0 0 0 0 0 0 0 0 0 0 0 0 
0 
##$DATE= 1175070911
##$DBL= (0..7)
120 120 120 120 120 120 120 120 
##$DBP= (0..7)
150 150 150 150 150 150 150 150 
##$DBP07= 0
##$DBPNAM0= <>
##$DBPNAM1= <>
$$ [...]
##$SUBNAM6= <"">
##$SUBNAM7= <"">
##$SUBNAM8= <"">
##$SUBNAM9= <"">
##$SW= 20.6930455092707
##$SWIBOX= (0..15)
0 0 3 0 0 0 0 0 0 0 0 0 0 0 0 0 
##$SW_h= 5175.983436853
##$TD= 65536
##$TD0= 1
##$TE= 683.16
##$TE2= 300
##$TE3= 300
##$TEG= 300
##$TL= (0..7)
0 120 120 120 120 120 120 120 
##$TP= (0..7)
150 150 150 150 150 150 150 150 
##$TP07= 0
##$TPNAME0= <>
##$TPNAME1= <>
##$TPNAME2= <>
##$TPNAME3= <>
##$TPNAME4= <>
##$TPNAME5= <>
##$TPNAME6= <>
##$TPNAME7= <>
##$TPOAL= (0..7)
0.5 0.5 0.5 0.5 0.5 0.5 0.5 0.5 
##$TPOFFS= (0..7)
0 0 0 0 0 0 0 0 
##$TUNHIN= 0
##$TUNHOUT= 0
##$TUNXOUT= 0
##$USERA1= <user>
##$USERA2= <user>
##$USERA3= <user>
##$USERA4= <user>
##$USERA5= <user>
##$V9= 5
##$VALIST= <valist>
##$VCLIST= <CCCCCCCCCCCCCCC>
##$VD= 0
##$VDLIST= <DDDDDDDDDDDDDDD>
##$VPLIST= <PPPPPPPPPPPPPPP>
##$VTLIST= <TTTTTTTTTTTTTTT>
##$WBST= 1024
##$WBSW= 4
##$XGAIN= (0..3)
0 0 0 0 
##$XL= 0
##$YL= 0
##$YMAX_a= 342339
##$YMIN_a= -388662
##$ZGOPTNS= <>
##$ZL1= 120
##$ZL2= 120
##$ZL3= 120
##$ZL4= 120
##$ABSF1= 16.522
##$ABSF2= -4.171173
##$ABSG= 5
##$ABSL= 3
##$ALPHA= 0
##$AQORDER= 0
##$ASSFAC= 0
##$ASSFACI= 0
##$ASSFACX= 0
##$ASSWID= 0
##$AUNMP= <proc_1d>
##$AZFE= 0.1
##$AZFW= 0.1
##$BCFW= 0
##$BC_mod= 0
##$BYTORDP= 0
##$COROFFS= 0
##$CY= 12.5
##$DATMOD= 1
##$DC= 0
##$DFILT= <>
##$DTYPP= 0
##$F1P= 14.0000005364418
##$F2P= -0.99999901652339
##$FCOR= 0.5
##$FTSIZE= 32768
##$FT_mod= 6
##$GAMMA= 0
##$GB= 0
##$INTBC= 1
##$INTSCL= 1
##$ISEN= 128
##$LB= 0.3
##$LEV0= 0
##$LPBIN= 0
##$MAXI= 10000
##$MC2= 0
##$MEAN= 0
##$ME_mod= 0
##$MI= 0
##$NCOEF= 0
##$NC_proc= -5
##$NLEV= 6
##$NOISF1= 0
##$NOISF2= 0
##$NSP= 0
##$NTH_PI= 0
##$NZP= 0
##$OFFSET= 16.522
##$PC= 1
##$PHC0= 220.5007
##$PHC1= 1.76735
##$PH_mod= 1
##$PKNL= yes
##$PPARMOD= 0
##$PSCAL= 4
##$PSIGN= 0
##$REVERSE= no
##$SF= 250.13
##$SI= 32768
##$SIGF1= 0
##$SIGF2= 0
##$SINO= 400
##$SIOLD= 32768
##$SREGLST= <1H.DMSO>
##$SSB= 0
##$STSI= 32768
##$STSR= 0
##$SW_p= 5175.98343685301
##$SYMM= 0
##$S_DEV= 0
##$TDeff= 65536
##$TDoff= 0
##$TI= <Analysis number 999999
Compound Code 99
Book Reference 9
Project Code 9>
##$TILT= no
##$TM1= 0
##$TM2= 0
##$TOPLEV= 0
##$USERP1= <user>
##$USERP2= <user>
##$USERP3= <user>
##$USERP4= <user>
##$USERP5= <user>
##$WDW= 1
##$XDIM= 32768
##$YMAX_p= 345284545
##$YMIN_p= -296324
$$ End of Bruker specific parameters
$$ ---------------------------------
##NTUPLES= NMR SPECTRUM
##VAR_NAME=  FREQUENCY,     SPECTRUM/REAL,   SPECTRUM/IMAG
##SYMBOL=    X,             R,               I
##VAR_TYPE=  INDEPENDENT,   DEPENDENT,       DEPENDENT
##VAR_FORM=  AFFN,          ASDF,            ASDF
##VAR_DIM=   32768,         32768,           32768
##UNITS=     HZ,            ARBITRARY UNITS, ARBITRARY UNITS
##FACTOR=    0.157963299565203, 1,           1
##FIRST=     4132.6476996994, 0,             0
##LAST=      -1043.33573715361, 0,           0
##MIN=       -1043.33573715361, -296324,     0
##MAX=       4132.6476996994, 345284545,     0
$$ Real data points
##PAGE= N=1
##DATA TABLE= (X++(R..R)), XYDATA
$$ [...]
$$ plain form
16051 -91444 -85612 -45726 -21111 -53617 -101396 -69713 7972 -10699 18591 58690 14903 3295
16039 3295 14995 22312 38255 106808 82518 32413 -65796 -112929 -86673 -9273 50445 144665
16027 144665 153204 55139 19523 -1808 -51460 -16283 -110053 -133393 -73107 -45118 -53231 -7253
16015 -7253 -47504 -41810 -83981 -41816 -35350 -4414 -10294 -28008 6241 34041 48012 100656
16003 100656 110327 39676 -52032 -82753 -96793 -32308 28822 -26664 -91338 -159367 -90743 -115810
15991 -115810 -118434 -128440 -155576 -119811 -122546 -34483 -18823 -4460 6554 37647 41138 92283
15979 92283 87595 53171 14931 40076 54361 53566 37173 24282 45593 14244 3949 17473
15967 17473 45437 123443 88934 -11303 -73684 -68362 -86500 -49011 -59814 -56761 -8096 34170
$$ packed form
16051i1444N832L9886K4615l2506m7779L1683P7685j8671K9290M0099m3787j1608
16039C295J1700P317J5943O8553k4290n0105r8209m7133K6256P7400N9718R4220
16027A44665Q539r8065l5616k1331m9652L5177r3770k3340O0286K7989q113M5978
16015g253m0251N694m2171M2165O466L0936n880j7714L4249K7800J3971N2644
16003A00656R671p0651r1708l0721j4040O4485O1130n5486o4674o8029O8624k5067
15991a15810k624j0006k7136L5765k735Q8063J5660J4363J1014L1093L491N1145
15979I2283m688l4424l8240K5145J4285p95j6393j2891K1311l1349j0295J3524
15967A7473K7964P8006l4509j00237o2381N322j8138L7489j0803L053M8665M2266
$$ plain form
15955 34170 106593 93538 37961 285 -52386 13763 28337 51623 25884 -31127 -17221 -54757
15943 -54757 -10759 -13149 -93004 -166326 -186921 -180853 -65738 -158 -73915 -35795 29421 29677
15931 29677 13224 -1 -57763 -119397 -88834 -43865 -46980 -112786 -134986 -130175 -86205 -141142
15919 -141142 -163228 -130215 -115727 -77984 -74522 -64511 -27933 34817 29075 39341 12705 -12795
15907 -12795 -49273 -44376 14191 11280 27526 21615 40082 8993 -50718 -51048 -54893 -63763 -123787
15894 -123787 -147438 -164895 -163024 -125972 -75045 -62476 -51741 -66294 -97731 -46579 -25882 1640
15882 1640 15980 -7664 -28694 16088 399 -3891 51860 66481 11323 13787 20028 27584 -38170
15869 -38170 -34981 -87157 30001 115015 83755 8401 -16291 832 6735 -61003 -88236 -72424
$$ packed form
15955C4170P2423j3055n5577l7676n2671O6149J4574K3286k5739n7011J3906l7536
15943e4757M3998k390p9855p3322k0595O068J15115O5580p3757L8120O5216K56
15931B9677j6453j3225n7762o1634L0563M4969l115o5806k2200M811M3970n4937
15919a41142k2086L3013J4488L7743L462J0011L6578O2750n742J0266k6636k5500
15907a2795l6478M897N8567k911J6246n911J8467l1089n9711l30l845q870o0024
15894a23787k3651j7457J871L7052N0927J2569J0735j4553l1437N1152K0697K7522
15882A640J4340k3644k1030M4782j5689m290N5751J4621n5158K464O241P556o5754
15869c8170L189n2176J17158Q5014l1260p5354k4692J7123N903o7738k7233J5812
$$ plain form
15857 -72424 -67665 -98136 -37799 -53329 -154680 -119686 -83538 -96204 -113256 -64798 -79906 -29397
15845 -29397 78812 83282 19681 -32884 -83295 -62784 8387 53465 25043 -12027 -73401 -77533
15833 -77533 -68531 -70714 -104446 -146480 -71277 -21884 -28506 14774 -54278 -116009 -90029 -10660
15821 -10660 68819 65096 6330 -64076 -42615 -34367 -56745 -89007 -30608 -6756 7834 -36636
15809 -36636 -1699 -8825 -39049 -76548 -145968 -149766 -120055 -33623 -11607 -6349 26605 39303
15797 39303 18994 34603 -28421 -82025 -89823 -24597 -84804 -140750 -105103 -23946 -50480 -43304
15785 -43304 -6643 -44967 -58852 -23172 -19079 -76377 -205882 -212975 -148180 -121250 -76612 -73159
15773 -73159 -65818 -32376 -64952 -37474 5091 -51103 -99793 -65245 23724 38739 -28691 -104629
$$ packed form
15857g2424M759l0471O0337j5530j01351L4994L6148j2666j7052M8458j5108N0509
15845b9397J08209M470o3601n2565n0411K0511P1171M5078k8422l7070o1374m132
15833g7533R002k183l3732m2034P5203M9393o622M3280o9052o1731K5980P9369
15821a0660P9479l723n8766p0406K1461Q248k2378l2262N8399K3852J4590m4470
15809c6636L4937p126l0224l7499o9420l798K9711Q6432K2016N258L2954J2698
15797C9303k0309J5609o3024n3604p798O5226o0207n5946L5647Q1157k6534P176
15785d3304L6661l8324j3885L5680M093n7298j29505p093O4795K6930M4638L453
15773g3159P341L3442l2576K7478M2565n6194m8690L4548Q8969J5015o7430p5938
$$ plain form
15761 -104629 -160061 -87766 -32317 11531 51708 40447 37455 46739 53601 60033 50273 25317
15749 25317 30454 31355 20038 -51476 -94086 -77594 -73850 -26837 -32671 -36290 47436 48890 26887
15736 26887 -31080 -86688 -68452 -835 -29960 -96591 -93808 -46275 3257 -60889 -105890 -23087
15724 -23087 757 27267 24103 -38171 -54083 -25533 -105372 -128147 -145709 -27472 53662 87693
15712 87693 -28718 -24154 -60675 -66615 -15881 13262 -11220 35033 -8862 3367 80591 93988
15700 93988 78739 62077 83384 112644 101156 21815 -26977 -45457 -9112 42634 12058 -316
15688 -316 -79028 -153126 -159806 -144092 -141299 -81241 -39836 -75786 -85801 -64322 -72249 -76659 -81857
15675 -81857 -102872 -107560 -132831 -97236 -117862 -101957 -20140 36662 -7444 -29109 -32020 -55647
$$ packed form
15761a04629n5432P2295N5449M3848M0177j1261k992R284O862O432r760k4956
15749B5317N137R01j1317p1514m2610J6492L744M7013n834l619Q3726J454k2003
15736B6887n7967n5608J8236O7617k9125o6631K783M7533M9532o4146m5001Q2803
15724b3087K3844K6510l164o2274j5912K8550p9839k2775j7562J18237Q1134L4031
15712H7693j16411M564l6521n940N0734K9143k4482M6253m3895J2229P7224J3397
15700I3988j5249j6662K1307K9260j1488p9341m8792j8480L6345N1746l0576j2374
15688c16p8712p4098o680J5714K793O0058M1405l5950j0015K1479p927m410n198
15675h1857k1015m688k5271L5595k0626J5905Q1817N6802m4106k1665k911k3627
$$ plain form
15663 -55647 -59661 4089 -12150 -85596 -88841 -29548 22885 50384 124955 185693 158258 89935
15651 89935 50054 22396 15435 22765 51392 119208 104389 27119 -24814 -17727 -28937 -57016
15639 -57016 -3934 27683 84457 83046 36473 36471 37626 -51056 -111580 -87802 -108493 -112247 -25545
15626 -25545 -34194 -55644 -110758 -105519 -83291 -60654 -84827 -96959 -97571 -106110 -104593 -19079 59713
15613 59713 98087 72180 18287 -29983 -73725 -55528 -120975 -67714 -94209 -91352 -37528 -13
15601 -13 52668 46865 -3083 55821 100755 48103 17575 49582 42218 24725 -27966 -85619 -67713
15588 -67713 -49118 -58417 -58214 21324 -6704 -76350 -63199 2318 -23456 19862 -11451 -85931
15576 -85931 -51033 37033 30540 -22565 -107823 -141079 -47566 -3758 18794 25045 13273 12498
$$ packed form
15663e5647m014O3750j6239p3446l245N9293N2433K7499P4571O0738k7435o8323
15651H9935l9881k7658o961P330K8627O7816j4819p7270n1933P087j1210k8079
15639e7016N3082L1617N6774j411m6573kJ155q8682o0524K3778k0691l754Q6702
15626b5545q649k1450n5114N239K2228K2637k4173j2132o12q539J517Q5514P8792
15613E9713L8374k5907n3893m8270m3742J8197o5447N3261k6495K857N3824L7515
15601a3N2681n803m9948N8904M4934n2652l0528L2007p364j7493n2691n7653J7906
15588f7713J8595r299K03P9538k8028o9646J3151O5517k5774M3318l1313p4480
15576h5931L4898Q8066o493n3105q5258l3256R3513M3808K2552O251j1772p75
$$ plain form
15564 12498 34593 21224 -8286 -12657 45232 89111 -39218 -95576 -58542 -111321 -135303 -162087
15552 -162087 -174644 -159807 -70776 -35974 -51654 -136174 -109838 -48064 -70557 -126695 -133918 -75574
15540 -75574 -40971 -62750 -67005 -89595 -108890 -101759 -86404 -51921 -38020 -71754 -49978 -127867
15528 -127867 -148650 -175147 -193166 -118396 -59060 -155935 -61427 37067 60077 28119 36216 50474
15516 50474 21777 -15818 -38926 -34586 -2883 11343 -76762 -166930 -117159 -86735 -100463 -180166
15504 -180166 -178131 -168683 -133849 -148844 -144241 -102519 -75184 -16909 56446 59842 86 -37078
15492 -37078 -19805 64707 4323 -9167 -29292 -91706 -108435 -229306 -249455 -146889 -34464
15481 -34464 71363 22336 -15447 15308 47598 58421 59834 70287 23058 8276 54911 64413
$$ packed form
15564A2498K2095j3369k9510m371N7889M3879j28329n6358L7034n2779k3982k6784
15552a62087j2557J4837Q9031L4802j5680q4520K6336O1774k2493n6138p223N8344
15540g5574L4603k1779m255k2590j9295P131J5355L4483J3901l3734K1776p7889
15528a27867k0783k6497j8019P4770N9336r6875R4508R8494K3010l1958Q097J4258
15516E0474k8697l7595k3108M340L1703J4226q8105r0168M9771L0424j3728p9703
15504a80166K035R448L4834j4995M603M1722K7335N8275P3355L396n9756l7164
15492c7078J7273Q4512o0384j3490k0125o2414j6729j20871k0149J02566J12425
15481c4464J05827m9027l7783L0755L2290J0823J413J0453m7229j4782M6635R502
$$ plain form
15469 64413 44548 -783 -39256 -61865 -77076 -80870 -63040 -113582 -87137 74 -28722 -59485
15457 -59485 -108073 -47990 17194 -21113 -49881 -85985 -54873 22124 -19845 -14871 -32885 -101981
15445 -101981 -25322 -19853 34839 -4451 -58591 -91025 -110101 -140188 -51797 7098 21405 19210
15433 19210 -109422 -150421 -66209 -57685 -49440 -36760 -27775 -43400 -47249 -77524 -96465 -129079
15421 -129079 -28065 56180 29405 -43696 -100083 -119479 -142956 -150619 -129787 -75049 -33577
15410 -33577 7458 41851 60091 -47763 -39576 -70202 -42963 -98369 -90731 19021 81940 95191
15398 95191 68570 -51021 -88933 34214 101159 46427 20961 -25128 -3545 -15357 1777
15387 1777 -20769 -33782 13116 -4904 -57105 -95999 -73232 -41141 -49817 -44178 -66806 -79243
$$ packed form
15469F4413j9865m5331l8473k2609j5211l794J7830n0542K6445Q7211k8796l0763
15457e9485m8588O0083O5184l8307k8768l6104L1112P6997m1969M974j8014o9096
15445a01981P6659N469N4692l9290n4140l2434j9076l0087Q8391N8895J4307k195
15433A9210j28632m0999Q4212Q524Q245J2680Q985j5625l849l0275j8941l2614
15421a29079J01014Q4245k6775p3101n6387j9396k3477p663K0832N4738M1472
15410c3577M1035L4393J8240j07854Q187l0626K7239n5406P638J09752O2919J3251
15398I5191k6621j19591l7912J23147O6945n4732k5466m6089K1583j1812J7134
15387A777k2546j3013M6898j8020n2201l8894K2767L2091q676N639k2628j2437
$$ plain form
15375 -79243 -106148 -135219 -91016 -107588 -171699 -150092 -136113 -66767 -33287 -37234 -50397 -101093
15363 -101093 -93729 2982 -15662 -64315 -112927 -105939 -8548 148246 138731 -4232 -66207 -78655
15351 -78655 -63507 -78443 -109544 -90635 -31444 49310 147641 112371 65668 10633 -36810 -65518
15339 -65518 -14895 -14112 -49726 -27581 -13757 13522 28284 11340 -2953 -9591 -70436 -50276
15327 -50276 -65742 -26287 10449 46105 27894 24282 -26279 -94862 -82524 -19984 -59494 -68982
15315 -68982 -39041 -37927 6514 2078 -96674 -112679 -121044 -89777 -40982 -2552 -4843 -22330
15303 -22330 -31509 -4608 36393 20307 -38462 -20772 -56599 -25552 7759 106882 145749 38624
15291 38624 -50399 -72793 -67975 -97090 -37950 -61892 -72136 -103307 -60842 -90976 -91315 -9072
$$ packed form
15375g9243k6905k9071M4203j6572o4111K1607J3979O9346L3480l947j3163n0696
15363a01093P364R6711j8644m8653m8612O988R7391J56794r515j42963o1975j2448
15351g8655J5148j4936l1101J8909N9191Q0754R8331l5270m6703n5035m7443k8708
15339f5518N0623P83l5614K2145J3824K7279J4762j6944j4293o638o0845K0160
15327e0276j5466L9455L6736L5656j8211l612n0561o8583J2338O2540l9510r488
15315f8982K9941J114M4441m436r8752j6005q365L1267M8795L8430k291j7487
15303b2330r179K6901M1001j6086n8769J7690l5827L1047L3311R9123L8867j07125
15291C8624q9023k2394M818k9115N9140k3942j0244l1171M2465l0134l39Q2243
$$ plain form
15279 -9072 47104 -56586 -48503 -31676 -69049 -74033 -43542 -7843 59108 27152 -16022 3351
15267 3351 23366 56910 38004 686 -95634 -128812 -54061 -34123 -11025 19834 26672 78959
15255 78959 76505 -40110 -67354 9758 39901 6213 -15751 -5937 30011 19999 53282 84152
15243 84152 35825 18059 -13191 -102718 -157925 -149869 -154441 -82565 -122633 -79268 -40732 -15777
15231 -15777 -14479 -27907 -77888 -100905 -48976 9572 7894 8761 63220 50687 17929 10210 41075
15218 41075 51907 50311 -2093 -12371 -33390 25722 37828 40427 32203 81119 52408 72818
15206 72818 58095 52684 -41750 -154714 -177129 -119256 -81777 -151759 -129766 -53125 -11724 17860
15194 17860 62419 31705 78651 45325 -27457 -65788 -51182 -537 39799 51964 25852 -43516
$$ packed form
15279i072N6176j03690Q083J6827l7373m984L0491L5699O6951l1956m3174J9373
15267C351K0015L3544j8906l7318r6320l3178P4751J9938K3098L0859O838N2287
15255G8959k454j16615k7244P7112L0143l3688k1964R814L5948j0012L3283L0870
15243H4152m8327j7766l1250q9527n5207Q056m572P1876m0068M3365L8536K4955
15231a5777J298j3428m9981k3017N1929N8548j678Q67N4459j2533l2758p719L0865
15218D1075J0832j596n2404j0278k1019N9112J2106K599q224M8916k8711K0410
15206G2818j4723n411r4434j12964k2415N7873L7479o9982K1993P6641M1401K9584
15194A7860M4559l0714M6946l3326p2782l8331J4606N0645M0336J2165k6112o9368
$$ plain form
15182 -43516 19447 100537 71310 -45989 -38945 -15821 -17977 -60999 -80957 -100687 -85941 -65386
15170 -65386 -85957 -84159 -639 34109 -67342 -77967 -41597 -1777 -57947 -71316 -83588 -71874
15158 -71874 -20659 53851 64851 36296 58372 77550 9156 -47393 -35501 -134524 -127355 -55220
15146 -55220 -3762 102984 66694 -6254 -6129 -9593 -27596 -22673 -86090 -64502 -58824 -6873
15134 -6873 -14532 -40542 -43265 -51093 -53912 -93944 -44628 -45212 -92249 -103968 -150925 -171819 -152327
15121 -152327 -96871 -105894 -92403 -83864 -126758 -98688 -38308 -51751 -152639 -175816 -123298 -56175
15109 -56175 -33804 -18965 -35142 -101193 -139279 -65441 -33364 -73314 -42910 -17905 18840 46340
15097 46340 39722 -37468 -31258 -38280 -17550 27475 9465 43230 78280 1433 3020 14133
$$ packed form
15182d3516O2963Q1090k9227j17299P044K3124k156m3022j9958j9730J4746K0555
15170f5386k0571J798Q3520L4748j01451j0625L6370L9820n6170j3369j2272J1714
15158g1874N1215P4510J1000k8555K2076J9178o8394n6549J1892r9023P169P2135
15146e5220N1458J06746l6290p2948J25l464j8003M923o3417K1588N678N1951
15134f873p659k6010k723p828k819m0032M9316n84m7037j1719m6957k0894J9492
15121a52327N5456r023J3491Q539m2894K8070O0380j3443j00888k3177N2518O7123
15109e6175K2371J4839j6177o6051l8086P3838L2077l9950L0404K5005L6745K7500
15097D6340o618p7190O210p022K0730M5025j8010L3765L5050p6847J587J1113
$$ plain form
15085 14133 5708 1426 -38643 -16958 14919 -39070 -80498 -64818 -35269 -28308 -28228 5486 -87886
15072 -87886 -155217 -77959 -79736 -70527 -11962 17669 22836 -26020 -8965 57630 23629 40517
15060 40517 19489 -13189 -59007 -42177 -627 74204 25628 -98420 -106671 -86886 -120561 -78888
15048 -78888 -62474 -99757 -92672 -157766 -173891 -108103 -62172 -106632 -51565 39576 13664 -19429
15036 -19429 -143162 -181775 -82107 -65178 -24462 -15827 -43868 -23142 79042 82994 22730 -21056
15024 -21056 -81597 -85737 -83706 -51225 26751 -42116 -13206 -4497 -2962 7589 43517 109136
15012 109136 119967 104552 74458 8677 120 -77255 -31847 -69818 -50376 -53653 -49706 -103378
15000 -103378 -86579 -44827 -53487 -30248 1858 44879 12567 -6150 -31386 -56887 -39065 11460
$$ packed form
15085A4133q425m282m0069K1685L1877n3989m1428J5680K9549O961Q0L3714r3372
15072h7886o7331P7258j777R209N8565K9631N167m8856J7055O6595l4001J6888
15060D0517k1028l2678m5818J6830M1550P4831m8576j24048q251J9785l3675M1673
15048g8888J6414l7283P085o5094j6125O5788M5931m4460N5067R1141k5912l3093
15036a9429j23733l8613R9668J6929M0716Q635k8041K0726J02184L952o0264m3786
15024b1056o0541m140K031L2481P7976o8867K8910Q709J535J0551L5928O5619
15012A09136J0831j5415l0094o5781q557p7375M5408l7971J9442l277L947n3672
15000a03378J6799M1752q660K3239L2106M3021l2312j8717k5236k5501J7822N0525
$$ plain form
14988 11460 27170 15892 -146 -2888 -45276 -46294 37615 16160 56131 89475 -8389 -34808
14976 -34808 -21695 52001 57386 45159 75499 64772 31115 -5843 -58713 -81865 -88830 -36292
14964 -36292 -34369 -44763 -52296 -52107 -15678 -21941 12545 34980 37516 4704 6477 49031 -28100
14951 -28100 -28463 -47697 -39134 4659 45516 90695 21081 -67437 -46748 8345 -39100 9765
14939 9765 108994 61104 -79143 -49331 -101407 -82735 -52285 -54495 -52895 -48515 -104284 -94075
14927 -94075 -42592 -19243 2532 -60946 -7610 76216 -2853 -19891 39475 35746 66009 72837
14915 72837 98950 103144 136032 67584 25282 -6803 -77348 -65567 -86545 -79228 -12900 -30329
14903 -30329 -81629 -30145 -17114 -16550 -54440 -27440 27238 8357 -23740 -87220 -176263 -138350
$$ packed form
14988A1460J5710j1278j6038k742m2388j018Q3909k1455L9971L3344r7864k6419
14976c4808J3113P3696N385j2227L0340j0727l3657l6958n2870k3152o965N2538
14964c6292J923j0394p533J89L6429o263L4486K2435K536l2812J773M2554p7131
14951b8100l63j9234Q563M3793M0857M5179o9614q8518K0689N5093m7445M8865
14939I765R9229m7890j40247K9812n2076J8672L0450k210J600M380n5769J0209
14927i4075N1483K3349K1775o3478N3336Q3826p9069j7038N9366l729L0263O828
14915G2837K6113M194L2888o8448m2302l2085p0545J1781k0978P317O6328j7429
14903c0329n1300N1484J3031N64l7890K7000N4678j8881l2097o3480q9043L7913
$$ plain form
14891 -138350 -92043 -18658 4457 -71145 -98118 -71404 -118545 -117400 -132367 -107105 -100983 -27710
14879 -27710 65341 71678 45811 -10264 9191 -25789 -25314 291 19147 -74267 -52582 -65663
14867 -65663 -116358 -30355 -5793 71664 24157 -68761 -94625 1711 -8170 -81574 -95222 -88297
14855 -88297 -111944 -95254 -99039 -93116 -17392 -16167 17389 25273 -17059 -9367 -12382 -17377 -14504
14842 -14504 -62017 -62916 -43748 -44980 -46459 -42328 -62571 -3904 -31082 -2276 -12098 -44001 -39592
14829 -39592 18413 -7569 -45974 -107070 -90658 -82070 -90571 -110724 -164356 -239456 -147908 -109002
14817 -109002 -108603 -63822 -39003 -54715 -32240 -38686 -61927 -68030 -6750 28526 9205 8171
14805 8171 -4041 10513 -3726 -35081 -45818 -60748 -77201 -84482 -11061 43642 80228 82186
$$ packed form
14891a38350M6307P3385K3115p5602k6973K6714m7141J145j4967K5262O122P3273
14879b7710R3051O337k5867n6075J9455l4980M75K5605J8856r3414K1685j3081
14867f5663n0695Q6003K4562P7457m7507r2918k5864R6336r881p3404j3648O925
14855h8297k3647J6690l785N923P5724J225L3556P884m2332P692l015m995K873
14842a4504m7513q99J9168j232j479M131k0243N8667k7178K8806r822l1903M409
14829c9592N8005k5982l8405o1096J6412Q588q501k0153n3632p5100R1548L8906
14817a09002L99M4781K4819j5712K2475o446k3241o103O1280L5276j9321j034
14805H171j2212J4554j4239l1355j0737j4930j6453p281P3421N4703L6586J958
$$ plain form
14793 82186 38490 -3439 -53286 -53418 -30845 -60484 15218 62366 -6381 -20722 682 45376
14781 45376 50300 62453 98301 58840 12605 5627 -13025 -75080 -77712 -31785 -48851 -16636
14769 -16636 26621 16551 -32437 -56220 14443 63323 29020 34066 66936 110037 118680 -25356
14757 -25356 -109840 -108978 -44425 -14935 -49963 -102608 -127280 -96724 -25714 -5378 -56816 -8148
14745 -8148 -28865 67119 108586 77543 59717 -33435 -64662 17811 -7767 -71332 -67390 -7899
14733 -7899 25857 46310 62624 15490 23042 15880 74242 29567 -55890 -29833 -13072 -4128
14721 -4128 -4510 -7642 -46611 -13954 -29375 -73993 -95264 -40994 2444 47384 92047 34364
14709 34364 -41041 -118600 -79353 -84251 -76839 -114070 -123035 -65714 -69095 -80509 -58974 -11383
$$ packed form
14793H2186m3696m1929m9847j32K2573k9639P5702M7148o8747j4341K1404M4694
14781D5376M924J2153L5848l9461m6235o978j8652o2055k632M5927j7066L2215
14769a6636M3257j0070m8988k3783P0663M8880l4303N046L2870M3101Q643j44036
14757b5356q4484Q62O4553K9490l5028n2645k4672L0556P1010K0336n1438M8668
14745h148k0717R5984M1467l1043j7826r3152l1227Q2473k5578o3565L942N9491
14733g899L3756K0453J6314m7134P552p162N8362m4675q5457K6057J6761Q944
14721d128l82l132l8969L2657j5421m4618k1271N4270M3438M4940M4663n7683
14709C4364p5405p7559L9247m898P412l7231q965N7321l381j1414K1535M7591
$$ plain form
14697 -11383 14524 7037 46998 44541 -17137 -39022 24962 70776 74712 19734 -43846 -67985
14685 -67985 -167348 -120100 -74045 -83002 -96113 -54366 -23807 5195 32062 7473 -9828 32151
14673 32151 71367 36388 39009 21540 -28266 -48535 -83362 -129371 -94832 -35072 -11467 -23830
14661 -23830 -17804 -36093 15014 46435 41007 37051 61042 48922 7572 -52462 -9603 -69368
14649 -69368 -105976 -38858 -33819 -87148 -42425 101403 166105 87268 31577 42401 27054 21468
14637 21468 -17202 -75351 -122822 -119049 -41033 -53160 -84652 -44078 -92663 -74941 14957 -71038
14625 -71038 -89953 17460 48398 -35273 -2930 -20734 -10137 -26898 8631 47561 -32227
14614 -32227 -60297 -27909 -1948 -13108 61366 -6172 -20761 -56104 -50042 -51552 8151 76520
$$ packed form
14697a1383K5907p487L9961k457o1678k1885O3984M5814L936n4978o3580k4139
14685f7985r9363M7248M6055q957j3111M1747L0559K9002K6867k4589j7301M1979
14673C2151L9216l4979K621j7469m9806k0269l4827m6009L4539N9760K3605j2363
14661b3830O026j8289N1107L1421n428l956K3991j2120m1350o0034M2859n9765
14649f9368l6608O7118N039n3329M4723J43828O4702p8837n5691J0824j5347n586
14637B1468l8670n8149m7471L773P8016j2127l1492M0574m8585J7722Q9898q5995
14625g1038j8915J07413L0938q3671L2343j7804J0597j6761L5529L8930p9788
14614c2227k8070L2388K5961j1160P4474o7538j4589l5343O062j510N9703O8369
$$ plain form
14602 76520 50127 27567 4721 37829 30959 11771 -7437 -61809 2047 55578 41861 14761
14590 14761 32610 -44411 -56316 -84593 -58191 -108847 -168456 -176555 -134540 -85664 -75545 -80247
14578 -80247 -37172 35627 50157 22094 23553 20695 58242 80559 6724 -15336 109437 121958
14566 121958 96915 123266 109650 58390 64664 47885 90952 74425 -759 26762 43555 14612
14554 14612 10257 96949 88893 62853 21676 -29123 -34831 1428 -7997 -62651 -96626 177
14542 177 11925 7236 84987 66198 3407 -47458 14448 63385 77926 26653 -39397 -107786
14530 -107786 -110935 -92169 -133211 -81040 -110633 -89044 -18322 -12343 -56880 -39151 -59344 -61682
14518 -61682 -55214 -66861 8755 77836 39255 22019 1828 -29644 -46434 -18187 -14638 -15693
$$ packed form
14602G6520k6393k2560k2846L3108o870j9188j9208n4372O3856N3531j3717k7100
14590A4761J7849p7021j1905k8277K6402n0656n9609q099M2015M8876J0119m702
14578h0247M3075P2799J4530k8063J459k858L7547K2317p3835k2060J24773J2521
14566A21958k5043K6351j3616n1260O274j6779M3067j6527p5184K7521J6793k8943
14554A4612m355Q6692q056k6040m1177n0799n708L6259r425n4654l3975R6803
14542A77J1748m689P7751j8789o2791n0865O1906M8937J4541n1273o6050o8389
14530a07786l149J8766m1042N2171k9593K1589P0722N979m4537J7729k0193k338
14518f1682O468j1647P5616O9081l8581j7236k0191l1472j6790K8247L549j055
$$ plain form
14506 -15693 -14567 -11364 21174 7420 18130 -24868 -44311 -40646 -33675 10444 63085 144039
14494 144039 90599 -2050 -30808 -70046 -50477 -42633 -22727 10446 5979 16357 59102 154272
14482 154272 152804 148707 63847 51160 92335 80578 47543 -21562 -65793 29834 74684 16488
14470 16488 37752 103188 57531 67937 52544 57915 67679 82441 43903 -12580 29909 -4560
14458 -4560 -40743 -62063 -8039 59802 56071 -20479 -4256 49504 -4946 -25457 -9120 -13200
14446 -13200 -7854 11743 761 -48633 6179 79547 81876 107521 82873 87577 34095 -28519
14434 -28519 29148 3307 -32075 -34686 -24481 -13007 -41610 -31702 45342 38437 -29751 -80034
14422 -80034 -116253 -167044 -168562 -69601 -53011 -69403 -65026 -63594 -38130 -24353 50236 9667
$$ packed form
14506a5693J126L203L2538j3754J0710m2998j9443L665O971M4119N2641Q0954
14494A44039n3440r2649k8758l9238J9569P844J9906L3173m467J0378M2745R5170
14482A54272j468m097q4860j2687M1175j1757l3035o9105m4231R5627M4850n8196
14470A6488K1264O5436m5657J0406j5393N371R764J4762l8538n6483M2489l4469
14458d560l6183k1320N4024O7841l731p6550J6223N3760n4450k0511J6337m080
14446a3200N346J9597j0982m9394N4812P3368K329K5645k4648M704n3482o2614
14434b8519N7667k5841l5382k611J0205J1474k8603R908P7044o905o8188n0283
14422h0034l6219n0791j518R8961J6590j6392M377J432K5464J3777P4589m0569
$$ plain form
14410 9667 -56472 -66713 -57351 12198 49103 40686 5723 -10929 -41070 -27063 -121205 -222411
14398 -222411 -139163 -14754 19388 -45949 -57086 -38584 -10586 2349 -22095 40476 59923
14387 59923 -30040 -99841 -6521 69285 63408 75213 79651 65616 58896 140397 132662 74720
14375 74720 -30633 -58573 -8557 638 -21664 20591 26336 102861 102213 63303 58995 9087
14363 9087 -53539 -75458 -61220 -50665 -60117 -72580 -101281 -117301 -97607 -92065 -136461 -101620
14351 -101620 -40714 16065 20591 -7395 28449 37980 55010 18441 7143 3266 28064 29867
14339 29867 51817 33177 49298 79743 135503 181825 175965 121669 65247 43729 38863 74972
14327 74972 51744 44999 41683 54335 67984 33852 -75492 -63513 -66896 -46448 -56553 -36575
$$ packed form
14410I667o6139j0241R362O9549L6905q417l4963j6652l0141J4007r4142j01206
14398b22411Q3248J24409L4142o5337j1137J8502K7998J2935k4444O2571J9447
14387E9923q9963o9801R3320P5806n877J1805M438j4035o720Q1501p735n7942
14375G4720j05353k7940N0016R195k2302M2255N745P6525o48l8910m308m9908
14363I087o2626k1919J4238J0555r452j2463k8701j6020J9694N542m4396L4841
14351a01620O0906N6779M526k7986L5844R531J7030l6569j1298l877K4798J803
14339B9867K1950j8640J6121L0445N5760M6322n860n4296n6422k1518m866L6109
14327G4972k3228o745l316J2652J3649l4132j09344J1979l383K0448j0105J9978
$$ plain form
14315 -36575 -75644 -94436 -85318 -149557 -54139 11621 30089 -43210 -66917 -74431 -48799 -18450
14303 -18450 -25627 -40481 -50571 -41412 40298 123445 107712 41471 -3136 -70692 -138035 -138579
14291 -138579 -99609 -64899 -60457 -32347 -8075 -18730 -35730 -43190 -41862 -32678 -36353 -32827 -41037
14278 -41037 -88015 -73969 -59451 -51898 -117986 -135328 -62718 -13899 44558 83592 141741 149782
14266 149782 121159 94589 62902 68798 49809 -54131 -82666 -22338 -4044 78990 113895
14255 113895 17034 21255 93996 105547 97197 123644 104587 112996 166326 150503 118379 71367
14243 71367 74018 62653 38459 28324 57635 78194 60386 17053 5135 -12287 8503 37497
14231 37497 166911 155349 85433 58460 -7091 -141627 -181327 -83178 -46900 25005 13495
$$ packed form
14315c6575l9069j8792R118o4239R5418O5760J8468p3299k3707p514K5632L0349
14303a8450p177j4854j0090R159Q1710Q3147j5733o6241m4607o7556o7343n44
14291a38579L8970L4710M442K8110K4272j0655j7000p460J328R184l675L526q210
14278d1037m6978J4046J4518P553o6088j7342P2610M8819N8457L9034N8149Q041
14266A49782k8623k6570l1687N896j8989j03940k8535O0328J8294Q3034L4905
14255A13895r6861M221P2741J1551q350K6447j9057Q409N3330j5823l2124m7012
14243G1367K651j1365k4194j0135K9311K0559j7808m3333j1918j7422K0790K8994
14231C7497J29414j1562o9916k6973o5551j34536l9700R8149L6278P1905j1510
$$ plain form
14220 13495 -61887 -125262 -120425 -103548 -124483 -68603 -54338 -76504 -74881 -4954 79567 48390
14208 48390 32430 83631 106357 148362 135440 15986 -22314 12988 -2797 -27292 -40015
14197 -40015 -35793 -970 -3043 81243 129629 117379 33652 -3374 -21464 -46483 -28422 78015
14185 78015 103710 96844 124565 122452 66787 81962 103099 147873 154914 191916 169128 58012
14173 58012 -3911 24197 -36286 -53922 -71744 -76070 -108919 -64043 17865 48262 23174 1423
14161 1423 -52749 -126197 -160847 -118456 -73263 -66452 26883 71216 42292 62741 78632 81142
14149 81142 99951 116545 140004 98406 139971 104569 49889 -20254 -19080 -26326 -13176 -30853
14137 -30853 -16733 77839 90670 134553 149655 153049 153840 101084 64111 73130 114280 122596 183595
$$ packed form
14220A3495p5382o3375M837J6877k0935N5880J4265k2166J623O9927Q4521l1177
14208D8390j5960N1201K2726M2005j2922j19454l8300L5302j5785k4495j2723
14197d0015M222L4823k073Q4286M8386j2250q3727l7026j8090k5019J8061J06437
14185G8015K5695o866K7721k113n5665J5175K1137M4774P041L7002k2788j11116
14173E8012o1923K8108o0483j7636j7822m326l2849M4876Q1908L0397k5088k1751
14161A423n4172p3448l4650M2391M5193O811R3335M4333k8924K0449J5891K510
14149H1142J8809J6594K3459m1598M1565l5402n4680p0143J174p246J3150j7677
14137c0853J4120R4572J2831M3883J5102L394P91n2756l6973R019M1150Q316O0999
$$ plain form
14124 183595 158662 117545 61792 90369 66917 76861 53304 37366 -34649 -120633 -114152 -72227
14112 -72227 -48409 -11766 -17679 31176 28977 49714 90155 45881 -7737 -31389 -47179 409
14100 409 56242 122834 122426 140249 142711 116033 47409 62494 141144 150409 90700 76887 86653
14087 86653 135555 80837 47258 41394 -59244 -70924 -65142 -87591 -65013 -81987 -11189 21955
14075 21955 61208 90738 58396 81341 100598 30366 -98028 -99870 -11056 -48505 -30331 -9749
14063 -9749 21541 63913 67283 31301 55830 67773 72652 88023 81426 105172 64724 53261
14051 53261 25705 -61355 -86236 -65832 -103062 -56417 673 -43075 3090 147645 180270
14040 180270 159656 104462 59575 66896 85909 41348 -15794 -116537 -108893 -29184 20510 35787
$$ packed form
14124A83595k4933m1117n5753K8577k3452R944k3557j5938p2015q5984O481M1925
14112g2227K3818L6643n913M8855k199K0737M0441m4274n3618k3652j5790M7588
14100D09N5833O6592m08J7823K462k6678o8624J5085P8650R265n9709j3813R766
14087H6653M8902n4718l3579n864j00638j1680N782k2449K2578j6974P0798L3144
14075B1955L9253K9530l2342K2945J9257p0232j28394j842Q8814l7449J8174K0582
14063i749L1290M2372L370l5982K4529J1943M879J5371o597K3746m0448j1463
14051E3261k7556q7060k4881K0404l7230M6645N7090m3748M6165J44555L2625
14040A80270k0614n5194m4887P321J9013m4561n7142j00743P644P9709M9694J5277
$$ plain form
14028 35787 62422 111293 113930 109090 61143 44588 -13076 -20310 20718 -6857 -88310 -145201
14016 -145201 -105039 -62161 -54531 -48072 -98753 -79699 -76770 -86252 -48204 27572 35917 -33572
14004 -33572 -75993 -44099 -14309 -73512 -104809 -108591 -78056 -57531 -5781 7292 55676 140120
13992 140120 119740 92549 79808 5841 45038 36579 49248 115123 66184 -19413 -60405 -47624
13980 -47624 19721 93511 125864 92794 78460 80067 -2160 -61232 -41802 -92522 34029 129992
13968 129992 139584 81444 145043 147661 181815 155618 95887 134663 173101 192117 131892 46804
13956 46804 60379 53102 40511 41895 18678 28678 -38704 -97843 -78825 -24453 7629 41869
13944 41869 13500 59743 48414 -6431 -39056 12068 62225 12266 12810 22357 34639 91402
$$ packed form
14028C5787K6635M8871K637m840m7947j6555n7664p234M1028k7575q1453n6891
14016a45201M0162M2878P630O459n0681J9054K929r482L8048P5776Q345o9489
14004c3572m2421L1894K9790n9203l1297l782L0535K0525N1750J3073M8384Q4444
13992A40120k0380k7191j2741p3967L9197q459J2669O5875m8939q5597m0992J2781
13980d7624O7345P3790L2353l3070j4334J607q2227n9072J9430n0720J26551R5963
13968A29992R592n8140O3599K618L4154k6197n9731L8776L8438J9016o0225q5088
13956D6804J3575p277j2591J384k3217J0000o7382n9139J9018N4372L2082L4240
13944D1869k8369M6243j1329n4845l2625N1124N0157m9959N44R547J2282N6763
$$ plain form
13932 91402 64060 44326 27793 107535 28669 -30967 -23504 -19753 -60704 -67092 28043 108898
13920 108898 64147 131417 222840 148970 42474 66495 59982 11177 -18189 -2815 -28668
13909 -28668 -69833 -53035 -59500 -8302 -26091 -78124 -18067 37614 94585 107073 153178 72440
13897 72440 -29321 -20775 -26206 -71195 -58594 -25974 -14887 -15983 15700 25161 14856 51929
13885 51929 54219 15636 -19397 3059 -2020 -7448 -8274 -85294 -122477 -62024 -5518 39143 -10883
13872 -10883 16902 31110 15122 -38236 -52684 -75925 3375 55094 74394 14953 99151 142951
13860 142951 148163 61740 47157 -7442 -9816 2200 241 -1473 -13849 11153 57390 98341
13848 98341 26026 16147 67537 52152 31785 36228 53604 66130 -1761 20240 72465 139086
$$ packed form
13932I1402k7342j9734j6533P9742p8866n9636P463L751m0951o388R5135Q0855
13920A08898m4751O7270R1423p3870j06496K4021o513m8805k9366J5374k5853
13909b8668m1165J6798o465N1198j7789n2033O0057N5681N6971J2488M6105q0738
13897G2440j01761Q546n431m4989J2601L2620J1087j096L1683R461j0305L7073
13885E1929K290l8583l5033K2456n079n428q26p7020l7183O0453N6506M4661n0026
13872a0883K7785J4208j5988n3358j4448k3241P9300N1719J9300n9441Q4198M3800
13860A42951N212q6423j4583n4599k374J2016j959j714j2376K5002M6237M0951
13848I8341p2315r879N1390j5385k0367M443J7376J2526o7891K2001N2225O6621
$$ plain form
13836 139086 204926 212774 198198 131175 111422 118303 152445 121667 53023 641 35998 24236
13824 24236 -5126 26895 40065 28987 20934 16049 25810 59993 121452 86729 35193 -33311
13812 -33311 -2512 2750 6892 12643 35575 -27207 -12236 45280 107974 159524 149330 128143
13800 128143 90757 70873 120968 202349 133271 47344 5907 -18467 73077 87579 19641
13789 19641 -32449 -37961 -112371 -75268 21909 73874 15934 -30098 -22719 -29205 31500 40038
13777 40038 -17947 -10893 8790 25277 -6397 138888 110309 17907 20630 68449 21313 21633
13765 21633 14632 9163 2457 69848 14706 -30375 -3292 33872 -26411 -63738 2775 -23704
13753 -23704 16988 61625 100816 183011 242765 178224 104622 84334 87406 118727 43233 -25735
$$ packed form
13836A39086O5840P848j4576o7023j9753O881L4142l0778o8644n2382L5357j1762
13824B4236k9362L2021J3170j1078q053m885R761L4183O1459l4723n1536o8504
13812c3311L0799N262M142N751K2932o2782J4971N7516O2694N1550j0194k1187
13800A28143l7386j9884N0095Q1381o9078q5927m1437k4374R1544J4502o7938
13789A9641n2090n512p4410L7103R7177N1965n7940m6032P379o486O0705Q538
13777D0038n7985P054J9683J6487l1674J45285k8579r2402K723M7819m7136L20
13765B1633p001n469o706O7391n5142m5081K7083L7164o0283l7327O6513k6479
13753b3704M0692M4637L9191Q2195N9754o4541p3602k0288L072L1321p5494o8968
$$ plain form
13741 -25735 -60848 -22704 -43920 -36109 20624 -65473 -48716 33017 86420 97330 72653 33991
13729 33991 -16780 13916 76073 86527 100320 99148 66972 84172 113858 102940 171840 163181
13717 163181 89479 48012 32854 79966 126215 90060 67514 -4707 -9655 15305 8570 40074
13705 40074 113094 171548 114667 74014 115388 126855 134403 95022 74869 103639 54520 114132
13693 114132 111399 109899 64649 28999 69005 90596 90002 93555 8206 6249 -45293 -62322 -35551
13680 -35551 -56268 5066 24515 -57628 -86091 -102089 -58027 -18187 24075 30991 65971 108989
13668 108989 83133 37361 -46280 -11024 -49387 11923 7122 -11445 -14230 -103651 -117114 -85888
13656 -85888 -66424 64952 121172 98032 128940 96325 47170 17602 -45615 -7175 -28080
$$ packed form
13741b5735l5113L8144k1216P811N6733q6097J6757Q1733N3403J0910k4677l8662
13729C3991n0771L0696O2157J0454J3793j172l2176J7200K9686j0918O8900q659
13717A63181p3702m1467j5158M7112M6249l6155k2546p2221m948K4960o735L1504
13705D0074P3020N8454n6881m0653M1374J1467P548l9381k0153K8770m9119N9612
13693A14132k733j500m5250l5650M0006K1591n94L553q5349j957n1542j7029K6771
13680c5551k0717O1334J9449q2143k8463j5998M4062L9840M2262O916L4980M3018
13668A08989k5856m5772q3641L5256l8363O1310m801j8567k785q9421j3463L1226
13656h5888J9464J31376N6220k3140L0908l2615m9155k9568o3217L8440k0905
$$ plain form
13645 -28080 -99066 -60579 32545 58659 26944 23819 36697 -46628 -144201 -134477 -76019 30776
13633 30776 54673 41536 35187 89430 104707 113551 112032 41006 -35739 26875 44030 32268
13621 32268 83938 107352 114411 98979 27760 4441 55600 105770 2491 -67306 -83171 -26681
13609 -26681 24250 72310 45284 37321 33889 51207 87164 120692 140992 118966 145243 109900
13597 109900 102697 101069 49603 57255 51950 80761 32865 64434 151079 143455 120117 105683
13585 105683 130900 112400 157722 196004 149478 139227 47511 32597 55375 148050 131732
13574 131732 64570 82322 92447 117062 98116 68453 104130 102045 62467 -28989 14868 80765
13562 80765 170851 141768 101388 137040 38026 32033 65731 82798 63820 69427 80018 94670
$$ packed form
13645b8080p0986L8487R3124K6114l1715l125J2878q3325r7573R724N8458J06795
13633C0776K3897j3137o349N4243J5277Q844j519p1026p6745O2614J7155j1762
13621C2268N1670K3414P059j5432p1219k3319N1159N0170j03279o9797j5865N6490
13609b6681N0931M8060k7026p963l432J7318L5957L3528K0300k2026K6277l5343
13597A09900p203j628n1466P652n305K8811m7896L1569Q6645p624k3338j4434
13585A05683K5217j8500M5322L8282m6526j0251r1716j4914K2778R2675j6318
13574A31732o7162J7752J0125K4615j8946k9663L5677k085l9578r1456M3857O5897
13562H0765R0086k9083m0380L5652r9014n993L3698J7067j8978N607J0591J4652
$$ plain form
13550 94670 57175 50652 43735 80945 140704 122772 66996 -42706 -25627 23585 68030 128164
13538 128164 129757 98080 125698 147279 168665 134252 52917 32974 31731 18780 36792 49703
13526 49703 -11204 -92450 -13651 59017 28041 14107 70022 41996 61008 98857 75188 23000
13514 23000 34353 42057 109456 96239 36904 26947 72467 82445 98791 30089 -42764 -24657
13502 -24657 45844 34962 -8246 -63527 -61465 -55353 -18803 30841 -27552 -58592 -72473 -83129
13490 -83129 -77625 -76636 -23475 38973 82155 43321 -3418 -34112 5755 65720 40041 -21119
13478 -21119 -13105 16516 -42548 -120359 -175470 -137499 -49978 -33104 -42972 -36914 -18565 -29865
13466 -29865 -52645 -76115 -46080 62722 91468 55485 89426 182071 172523 80916 29379 65906
$$ packed form
13550I4670l7495o523o917L7210N9759j7932n5776j09702J7079M9212M4445O0134
13538A28164J593l1677K7618K1581K1386l4413q1335j9943j243j2951J8012J2911
13526D9703o0907q1246P8799P2668l0976j3934N5915k8026J9012L7849k3669n2188
13514B3000J1353P704O7399j3217n9335r957M5520R978J6346o8702p2853J8107
13502b4657P0501j0882m3208n5281K062O112L6550M9644n8393l1040j3881j0656
13490h3129N504R89N3161O2448M3182l8834m6739l0694L9867N9965k5679o1160
13478b1119Q014K9621n9064p7811n5111L7971Q7521J6874r868O058J8349j1300
13466b9865k2780k3470L0035J08802K8746l5983L3941R2645r548r1607n1537L6527
$$ plain form
13454 65906 85541 139088 131388 154318 98003 75835 -6116 -46375 14530 99906 113680 34224
13442 34224 24117 56499 136312 130927 51895 5442 -22415 -55785 -48369 -26912 -63010 -61195
13430 -61195 -119487 -152230 -103958 -125400 -162642 -126608 -130195 -92962 -33508 -762 -14791 -31408
13418 -31408 -96482 -52832 -21773 -32182 -27991 -54872 -35112 43067 1028 -32435 23003 14144
13406 14144 -15928 -24133 -49769 -55642 -64138 6836 35792 74776 38263 109499 132364 144316
13394 144316 119011 94644 49391 81283 81278 101337 69873 61403 86045 133520 60810 -43412
13382 -43412 -39601 14339 58944 90950 88191 126169 129283 136084 127270 109761 117955 98355 85408
13369 85408 53316 17873 34004 14094 73785 73038 57916 45741 57679 61274 40430 69352
$$ packed form
13454F5906J9635N3547p700K2930n6315k2168q1951m0259O0905Q5376J3774p9456
13442C4224j0107L2382P9813n385p9032m6453k7857l3370P416K1457l6098J815
13430f1195n8292l2743M8272k1442l7242L6034l587L7233N9454L2746j4029j6617
13418c1408o5074M3650L1059j0409M191k6881J9760P8179m2039l3463N5438q859
13406A4144l0072q205k5636n873q496P0974K8956L8984l6513P1236K2865J1952
13394A44316k5305k4367m5253L1892nK0059l1464q470K4642M7475p2710j04222
13382d3412L811N3940M4605L2006k759L7978L114O801q814j7509Q194j9600j2947
13369H5408l2092l5443J6131j9910N9691p47j5122j2175J1938L595k0844K8922
$$ plain form
13357 69352 85486 124750 106373 76833 83029 31493 103840 66424 11715 97786 92551 29690
13345 29690 17185 102988 102310 41811 -13647 -101471 -81375 -9690 21643 43044 22006 41437
13333 41437 72113 96136 86049 117560 107799 58345 28244 68010 66702 102660 122108 98609
13321 98609 92522 70852 102431 96746 31029 3958 -42456 -468 51373 82894 60727 -19222
13309 -19222 -21934 43962 133618 140741 86490 50490 47043 82358 90514 126249 83837 -39567
13297 -39567 -13871 48104 19784 -23752 -30502 -23078 54087 89226 109455 120674 127350 186803
13285 186803 256788 277705 190873 186966 221736 158980 123735 181928 152136 95396 168063 246896
13273 246896 287855 208415 144155 111128 91311 156500 239796 162675 157762 131161 132665 121958
$$ packed form
13357F9352J6134L9264j8377k9540O196n1536P2347l7416n4709Q6071n235o2861
13345B9690j2505Q5803o78o0499n5458q7824K0096P1685L1333K1401k1038J9431
13333D1437L0676K4023j0087L1511r761m9454l0101L9766j308L5958J9448k3499
13321I8609o087k1670L1579n685o5717k7071m6414M1988N1841L1521k2167p9949
13309a9222k712O5896Q9656P123n4251l6000l447L5315Q156L5735m2412j23404
13297c9567K5696O1975k8320m3536o750P424P7165L5139K0229J1219O676N9453
13285A86803O9985K0917q6832l907L4770o2756l5245N8193k9792n6740P2667P8833
13273B46896M0959p9440o4260l3027j9817O5189Q3296p7121m913k6601J504j0707
$$ plain form
13261 121958 134732 143805 143499 157230 187477 158981 108841 98282 108095 137136 229047 282050
13249 282050 327162 432508 467627 452662 377016 300932 234413 185022 167377 218861 267188
13238 267188 201665 123321 96302 95386 147193 172386 212015 200707 152427 188329 139046 124753
13226 124753 104045 92056 56872 130442 156950 61035 78389 134260 127093 144054 124433 116187
13214 116187 168102 162075 205318 244096 280987 256956 240301 217829 115869 19225 59749
13203 59749 150342 165337 146080 75251 35665 38771 16077 36809 85209 160261 205616 209354
13191 209354 200328 123799 134653 173045 217904 139271 81640 57733 53447 48917 51749 787
13179 787 25358 52548 28318 63407 84153 112366 80259 60954 52585 63971 95930 94299
$$ packed form
13261A21958J2774R073l06J3731L0247k8496n0140j0559R813K9041R1911N3003
13249B82050M5112J05346L5119j4965p5646p6084o6519m9391j7645N1484M8327
13238B67188o5523p8344k7019r16N1807K5193L9629j1308m8280L5902m9283j4293
13226A24753k0708j1989l5184P3570K6508r5915J7354N5871p167J6961j9621q246
13214A16187N1915o027M3243L8778L6891k4031j6655k2472j01960r6644M0524
13203E9749R0593J4995j9257p0829l9586L106k2694K0732M8400P5052M5355L738
13191B09354r026p6529J0854L8392M4859p8633n7631k3907m286m530K832n0962
13179G87K4571K7190k4230L5089K0746K8213l2107j9305q369J1386L1959j631
$$ plain form
13167 94299 114285 105625 106510 100662 130796 149235 102684 70553 23204 -17613 23536 90347
13155 90347 101080 171182 189839 191822 132088 116238 138017 112943 48653 41581 166 68430
13143 68430 57126 18318 19139 -47291 -62343 -6872 103698 149521 108362 74996 42761 27987
13131 27987 27934 36198 49919 49524 83570 141103 168127 136343 81277 53712 72200 134825 77174
13118 77174 7691 6848 -37024 -43008 59225 104417 118308 106242 148344 160407 123911 55176
13106 55176 -12999 -20816 -56964 -43029 -29400 16746 61525 90569 54140 16233 46198 62032
13094 62032 71519 38411 36102 71110 127561 182480 272308 249897 186602 160410 195992 256948
13082 256948 192174 148518 148652 149057 84937 16047 68000 127043 169052 222897 222651 202284 137954
$$ packed form
13167I4299J9986q660Q85n848L0134J8439m6551l2131m7349m0817M1149O6811
13155I0347J0733P0102J8657J983n9734j5850K1779k5074o4290p072m1415O8264
13143F8430j1304l8808Q21o6430j5052N5471J10570M5823m1159l3366l2235j4774
13131B7987n3Q264J3721l95L4046N7533K7024l1784n5066k7565J8488O2625n7651
13118G7174o9483q43m3872n984J02233M5192J3891j2066M2102J2063l6496o8735
13106E5176o8175p817l6148J3935J3629M6146M4779K9044l6429l7907K9965J5834
13094F2032R487l3108k309L5008N6451N4919Q9828k2411o3295k6192L5582O0956
13082B56948o4774m3656J34M05o4120o8890N1953N9043M2009N3845k46k0367o4330
$$ plain form
13069 137954 126240 140186 181550 225237 227742 239646 249916 293173 265145 312265 266286 206347
13057 206347 118302 61504 56591 134122 198126 155734 64054 100836 70916 45018 126847 138352
13045 138352 203558 280148 237189 251842 319019 481641 556812 458849 335082 288165 219614
13034 219614 169738 205285 228871 201982 252442 248518 237747 313312 288156 237022 193455 161110
13022 161110 67211 59239 51531 27836 1344 26563 -32248 17989 83805 138552 162717 211394
13010 211394 175128 171923 176769 201498 141690 123636 113805 91818 132360 161312 160309 236845
12998 236845 212237 291226 398890 400148 411493 399427 319809 309804 250653 223578 209764
12987 209764 296913 288576 233735 290645 317407 361286 336189 250143 239263 201448 200657 161932
$$ packed form
13069A37954j1714J3946M1364M3687K505J1904J0270M3257k8028M7120m5979n9939
13057B06347q8045n6798m913P7531O4004m2392r1680L6782k9920k5898Q1829J1505
13045A38352O5206P6590m2959J4653O7177J62622P5171r7963j23767m6917o8551
13034B19614m9876L5547K3586k6889N0460l924j0771P5565k5156n1134m3567l2345
13022A61110r3899p972p708k3695k6492K5219n8811N0237O5816N4747K4165M8677
13010B11394l6266l205M846K4729n9808j8054r831k1987M0542K8952j003P6536
12998B36845k4608P8989J07664J258J1345j2066p9618j0005n9151k7075j3814
12987B09764Q7149q337n4841N6910K6762M3879k5097q6046j0880l7815p91l8725
$$ plain form
12975 161932 225262 317285 285986 209035 168393 166321 206088 192436 150455 125442 134106 165967
12963 165967 203417 257086 244679 204177 177942 174578 187183 148233 89328 112776 158736 154467
12951 154467 165914 149699 126206 133630 71050 -18144 -39904 -46629 16933 135357 131558 128577
12939 128577 120856 105474 92774 123519 124621 159321 194909 167298 162871 74198 58169 72214
12927 72214 86327 114063 162554 200933 182773 101885 93198 171466 194827 101234 14401 89299
12915 89299 126484 141614 182891 175293 173538 169259 149550 161535 121454 42458 85143 119590
12903 119590 92374 72471 86224 -6083 -551 11784 43193 95865 108560 65850 -13616 -3233
12891 -3233 28397 69824 50436 61468 105450 167962 169262 84707 47782 86865 37896 16242
$$ packed form
12975A61932O3330R2023l1299p6951m0642k072L9767j3652m1981k5013Q664L1861
12963A65967L7450N3669j2407m0502k6235l364J2605l8950n8905K3448M5960m269
12951A54467J1447j6215k3493P424o2580q9194k1760o725O3562J18424l799k981
12939A28577p721j5382j2700L0745J102L4700L5588k7611m427q8673j6029J4045
12927G2214J4113K7736M8491L8379j8160q0888q687P8268K3361r3593q6833P4898
12915H9299L7185J5130M1277p598j755m279j9709J1985m0081p8996M2685L4447
12903A19590k7216j9903J3753r2307N532J2335L1409N2672J2695m2710p9466J0383
12891c233L1630M1427j9388J1032M3982O2512J300q4555l6925L9083m8969k1654
$$ plain form
12879 16242 7296 51422 77010 71025 77723 114427 125863 101065 90675 78002 101034 89534
12867 89534 52858 87171 55353 126360 155576 200525 179794 125659 171956 229488 132233 128179
12855 128179 142802 193033 213020 205393 161513 116674 39289 76133 110149 65470 46567 76445
12843 76445 147118 201142 195107 169061 107600 46918 53000 83808 67629 31778 38315 43434
12831 43434 25564 79437 142397 120630 54957 32596 49681 30753 13349 -13911 -30717 49359
12819 49359 131748 89682 37226 27786 59921 156047 169296 174973 223613 219874 220130 130478 45588
12806 45588 -14716 -76186 -13578 28883 61630 80011 86102 76447 66856 87815 49406 107162
12794 107162 163394 112510 35930 35830 131124 211346 217548 231582 172500 145995 100783 92660
$$ packed form
12879A6242q946M4126K5588n985O698L6704J1436k4798j0390j2673K3032j1500
12867H9534l6676L4313l1818P1007K9216M4949k0731n4135M6297N7532r7255m054
12855A28179J4623N0231J9987p627m3880m4839p7385L6844L4016m4679j8903K9878
12843G6445P0673N4024o035k6046o1461o0682O082L0808j6179l5851O537N119
12831D3434j7870N3873O2960k1767o5673k2361J7085j8928j7404k7260j6806Q0076
12819D9359Q2389m2066n2456r440L2135R6126J3249N677M8640l739K56q9652q4890
12806D5588o0304o1470O2608M2461L2747J8381O091r655r591K0959l8409N7756
12794A07162N6232n0884p6580j00R5294Q0222O202J4034n9082k6505m5212q123
$$ plain form
12782 92660 131267 130412 128557 120653 171681 168791 106277 55317 47013 50602 126766 107602 113497
12769 113497 22092 40376 58773 74859 136393 139265 106392 144893 185603 177370 246058 291461
12757 291461 275309 212598 163322 68047 112100 182823 175802 176165 166268 166577 157451 187208 104352
12744 104352 125621 113657 151809 231336 219982 181639 160372 143933 167057 229474 167547
12733 167547 121207 120010 106645 109371 119154 126111 60709 64309 136436 159827 111152 74360
12721 74360 74614 131322 191312 160527 125315 220336 274462 224027 204189 226166 233155 290145
12709 290145 308125 295686 234292 198573 183152 88688 93949 126479 151733 139035 165782 252721
12697 252721 225014 112156 101288 183406 219036 236624 230733 212620 188916 202895 139079
$$ packed form
12782I2660L8607q55j855p904N1028k890o2514n0960q304L589P6164j9164N895
12769A13497r1405J8284J8397J6086O1534K872l2873L8501M0710q233O8688M5403
12757B91461j6152o2711m9276r5275M4053P0723p021L63r897L09r126K9757q2856
12744A04352K1269j1964L8152P9527j1354l8343k1267j6439K3124O2417o1927
12733A67547m6340j197j3365K726R783O957o5402L600P2127K3391m8675l6792
12721G4360K54N6708N9990l0785l5212R5021N4126n0435j9838K1977O989N6990
12709B90145J7980j2439o1394l5719j5421r4464N261L2530K5254j2698K6747Q6939
12697B52721k7707j12858j0868Q2118L5630J7588n891j8113k3704J3979o3816
$$ plain form
12686 139079 129443 206376 204538 207152 262333 278443 195518 172027 239232 287823 288459 270213
12674 270213 240368 291001 349816 419895 460580 447111 504610 508084 447400 354545 307902 271188
12662 271188 272090 275377 210958 163543 178207 160960 114327 104717 84396 96475 129825 88624
12650 88624 53000 111742 217644 308399 265913 205876 232880 215877 235358 196452 130989
12639 130989 163065 205582 193136 224505 221144 193621 160396 171040 236955 235618 303957 352484
12627 352484 354030 320933 343891 334365 385142 386992 331270 269376 158702 52513 117814 53529
12615 53529 98059 187202 190178 160258 215454 150656 128767 171984 187934 169093 111327 138070
12603 138070 198431 174791 89060 134064 141407 143408 224845 205257 125677 106701 93291 105290
$$ packed form
12686A39079r636P6933j838K614N5181J6110q2925k3491O7205M8591O36j8246
12674B70213k9845N0633N8815P0079M0685j3469N7499L474o0684r2855m6643l6714
12662B71188R02L287o4419m7415J4664j7247m6633r610k0321J2079L3350m1201
12650H8624l5624N8742J05902R0755m2486o0037K7004j7003J9481l8906o5463
12639A30989L2076M2517j2446L1369l361k7523l3225J0644O5915j337O8339M8527
12627C52484J546l3097K2958r526N0777J850n5722o1894j10674j06189O5301o4285
12615E3529M4530Q9143K976k9920N5196o4798k1889M3217J5950j8841n7766K6743
12603A38070O0361k3640q5731M5004P343K001Q1437j9588p9580j8976j3410J1999
$$ plain form
12591 105290 121064 196483 202260 190512 117373 158075 242006 219445 185967 132679 38115 110917
12579 110917 171012 148748 134244 187672 257319 258075 250361 240257 229174 229584 152874 125299
12567 125299 118163 146734 154086 93343 85798 124418 86017 81483 129721 135402 105476 27814
12555 27814 92755 121140 62278 116278 129439 176170 234816 235264 189778 181017 226310 278164
12543 278164 208392 182248 182459 114141 83962 160340 139025 105600 119256 94039 132661 164564
12531 164564 115548 114855 88235 132831 146286 140003 114144 194057 164577 35076 72857 170224
12519 170224 229497 240411 210327 178995 249412 292978 207065 144265 137077 136228 111564 147278
12507 147278 194411 206821 179764 265751 326513 304269 228129 158888 103335 129503 132216 191553
$$ packed form
12591A05290J5774P5419N777j1748p3139M0702Q3931k2561l3478n3288r4564P2802
12579A10917O0095k2264j4504N3428O9647P56p714j0104j1083M10p6710k7575
12567A25299p136K8571P352o0743p545L8620l8401m534M8238N681k9926p7662
12555B7814O4941K8385n8862N4000J3161M6731N8646M48m5486q761M5293N1854
12543B78164o9772k6144K11o8318l0179P6378k1315l3425J3656k5217L8622L1903
12531A64564m9016o93k6620M4596J3455o283k5859P9913k9480j29501L7781R7367
12519A70224N9273J0914l0084l1332P0417M3566q5913o2800p188q49k4664L5714
12507A47278M7133J2410k7057Q5987O0762k2244p6140o9241n5553K6168K713N9337
$$ plain form
12495 191553 238139 256259 260584 252031 245786 256760 245072 253541 248556 276104 249449 274675
12483 274675 265353 248715 257852 265576 359205 384385 333649 235337 229358 229476 245954 253043 305138
12470 305138 313658 215943 271047 259344 178041 212821 249552 241879 245342 221413 164355 137819
12458 137819 210260 324262 314275 211198 168852 183518 254538 272100 274518 282978 307492 282679
12446 282679 170461 91688 81900 108335 176332 189719 147111 188993 221635 198512 170089
12435 170089 79589 146207 238583 231319 298452 365624 325378 267890 223486 251322 270061 283473
12423 283473 274415 281473 251425 188787 140515 175467 242485 232523 277818 336441 312262 325818
12411 325818 331381 259714 219378 237595 283536 318720 362975 398702 374341 204809 153341
$$ packed form
12495A91553M6586J8120M325q553o245J0974j1688Q469m985K7548k6655K5226
12483B74675r322j6638R137P724R3629K5180n0736r8312n979J18J6478P089N2095
12470C05138Q520r7715N5104j1703q1303L4780L6731p673L463k3929n7058k6536
12458A37819P2441J14002r987j03077m2346J4666P1020J7562K418Q460K4514k4813
12446B82679j12218p8773r788K6435O7997J3387m2608M1882L2642k3123k8423
12435A70089r0500O6618R2376p264O7133O7172m0246n7488m4404K7836J8739J3412
12423B83473r058P058l0048o2638m8272L4952O7018r962M5295N8623k4179J3556
12411C25818N563p1667m0336J8217M5941L5184M4255L5727k4361j69532n1468
$$ plain form
12400 153341 203092 218398 228118 268127 247735 305819 300960 266318 220922 86169 95903 170859
12388 170859 224629 246643 283857 234447 242646 264338 231522 264259 336533 333240 273405 250595
12376 250595 271722 370635 348878 287101 235626 271225 236089 243870 314579 371960 424130 424277
12364 424277 380886 252473 193862 173647 198825 305652 293645 296499 222517 274420 341778
12353 341778 421682 461825 494850 414198 391215 435988 347512 276258 246171 229950 270097
12342 270097 330051 300962 283836 259099 179561 192957 241330 340961 368165 358639 401490 393241
12330 393241 350795 389056 328789 296611 349230 419718 416047 398017 368219 277405 189483 182116
12318 182116 195540 223776 283840 243261 246791 273344 248718 294043 344867 408992 404598 425747
$$ packed form
12400A53341M9751J5306R720M0009k0392N8084m859l4642m5396j34753R734P4956
12388A70859N3770K2014L7214m9410Q199K1692l2816L2737P2274l293n9835k2810
12376B50595K1127R8913k1757o1777n1475L5599l5136P781P0709N7381N2170J47
12364D24277m3391j28413n8611k0215K5178J06827j2007K854p3982N1903O7358
12353C41778P9904M0143L3025q0652k2983M4773q8476p1254l0087j6221M0147
12342B70097N9954k9089j7126k4737p9538J3396M8373R9631K7204r526M2851q249
12330C93241m2446L8261o0267l2178N2619P0488l671j8030k9798r0814q7922p367
12318A82116J3424K8236O0064m0579L530K6553k4626M5325N0824O4125m394K1149
$$ plain form
12306 425747 412286 403965 456984 398275 380845 378843 375980 397277 468455 450943 481454 508503
12294 508503 519620 493436 501810 446778 437164 432646 371434 349544 434891 421255 347840 319471
12282 319471 318213 295658 312308 336538 337246 320552 372621 348461 319240 366666 370855 375511
12270 375511 457686 452192 420384 431218 399087 454222 461088 418659 376623 366633 376137 442450
12258 442450 454419 441858 417069 441863 429408 388024 430854 463973 419445 384453 359622
12247 359622 401404 455642 445041 441783 526043 493881 494468 459805 422938 441838 485180 491536
12235 491536 574185 637917 665102 589153 556867 465317 512273 625300 624374 576223 552622 613692
12223 613692 543128 491152 554060 568147 580489 621547 594913 590262 515703 512577 538468 617562
$$ packed form
12306D25747j3461q321N3019n8709j7430k002k863K1297P1178j7512L0511K7049
12294E08503J1117k6184Q374n5032r614m518o1212k1890Q5347j3636p3415k8369
12282C19471j258k2555J6650K4230P08j6694N2069k4160k9221M7426M189M656
12270C75511Q2175n494l1808J0834l2131N5135O866m2429m2036r990R504O6313
12258D42450J1969j2561k4789K4794j2455m1384M2830L3119m4528l4992k4831
12247C59622M1782N4238j0601l258Q4260l2162N87l4663l6867J8900M3342O356
12235D91536Q2649O3732K7185p5949l2286r1550M6956J13027r26m8151k3601O1070
12223F13692p0564n1976O2908J4087J2342M1058k6634m651p4559l126K5891P9094
$$ plain form
12211 617562 614812 625825 730702 728652 692727 708417 623121 561973 605243 646031 619847 676728
12199 676728 786814 800722 734748 612293 518972 506013 580673 623634 618663 642481 638468
12188 638468 627607 651799 672754 688186 701714 741938 791389 848890 824102 846897 802462
12177 802462 829750 892453 882289 862556 813291 819451 879321 900664 848154 850082 893523 889030
12165 889030 834332 841875 856158 803627 728956 760497 841188 876977 911622 937295 972014 1011754
12153 1011754 903060 832305 861045 925434 1024342 1043667 985976 952371 985976 965719 950517
12142 950517 924608 904246 891491 844343 915845 966436 971168 1052818 1105349 1087630 1066985 1143272
12130 1143272 1139037 1129700 1166350 1180858 1160154 1135759 1216294 1241954 1295583 1301994 1270187 1268715
$$ packed form
12211F17562k750J1013J04877k050l5925J5690q5296o1148M3270M0788k6184N6881
12199F76728J10086J3908o5974j22455r3321j2959P4660M2961m971K3818m013
12188F38468j0861K4192K0955J5432J3528M0224M9451N7501k4788K2795m4435
12177H02462K7288O2703j0164j9733m9265O160N9870K1343n2510J928M3441m493
12165H89030n4698P543J4283n2531p4671L1541Q0691L5789L4645K5673L4719L9740
12153A011754j08694p0755K8740O4389R8908J9325n7691l3605L3605k0257j5202
12142I50517k5909k0362j2755m7148P1502N0591M732Q1650N2531j7719k0645P6287
12130A143272m235r337L6650J4508k0704k4395Q0535K5660N3629O411l1807j472
$$ plain form
12118 1268715 1273969 1243365 1179512 1180015 1235356 1309004 1296665 1289696 1382600 1474695 1483445 1513522
12106 1513522 1505929 1457181 1422182 1374669 1374116 1463645 1559489 1535074 1534185 1606344 1624740 1612116
12094 1612116 1586159 1629622 1696605 1667383 1632855 1690289 1745059 1853041 1891364 1864531 1849053
12083 1849053 1848391 1836804 1869307 1949462 1962704 1943715 1990490 2000805 2031402 2130350 2173442 2190926
12071 2190926 2195385 2226097 2286978 2337083 2405766 2447909 2458422 2495076 2514415 2563361 2573251 2580895
12059 2580895 2597037 2676772 2743202 2744072 2803132 2928624 2945057 3022785 3088148 3138306 3196784
12048 3196784 3284954 3394515 3485960 3485990 3520777 3555515 3665169 3830576 3866227 3808395 3913049
12037 3913049 4067807 4253688 4298845 4427237 4550733 4633718 4778180 4876944 4928571 4999450
$$ packed form
12118A268715N254l0604o3853N03N5341P3648j2339o969R2904R2095Q750L0077
12106A513522p593m8748l4999m7513n53Q9529R5844k4415q89P2159J8396j2624
12094A612116k5957M3463O6983k9222l4528N7434N4770J07982L8323k6833j5478
12083A849053o62j1587L2503Q0155J3242j8989M6775J0315L0597R8948M3092J7484
12071B190926M459L0712O0881N0105O8683M2143J0513L6654J9339M8946R890P644
12059B580895J6142P9735O6430Q70N9060J25492J6433P7728O5363N0158N8478
12048C196784Q8170J09561R1445L0L4787L4738J09654J65407L5651n7832J04654
12037C913049J54758J85881M5157J28392J23496Q2985J44462R8764N1627P0879
$$ plain form
12027 4999450 5164614 5357711 5488614 5623826 5744219 5925183 6103017 6243571 6403389
12018 6403389 6613474 6886892 7086365 7267820 7517630 7759618 7960614 8178718 8511387
12009 8511387 8811630 9096419 9390736 9671824 10005717 10344538 10641220 10959961 11418226
12000 11418226 11872744 12409483 12875364 13396568 13933817 14382263 14903312 15550898 16242825
11991 16242825 16993080 17751374 18579508 19340259 20140273 20976582 21885424 22956369 24071012
11982 24071012 25145347 26272784 27518562 28771398 30031973 31401447 32707472 34125430
11974 34125430 35505921 36875881 38290583 39738263 41059232 42362144 43739354 44955491
11966 44955491 46066952 47084585 47918213 48727478 49328020 49678034 49850072 49808035 49595438
$$ packed form
12027D999450J65164J93097J30903J35212J20393J80964J77834J40554J59818
12018F403389K10085K73418J99473J81455K49810K41988K00996K18104L32669
12009H511387L00243K84789K94317K81088L33893L38821K96682L18741M58265
12000A1418226M54518N36739M65881N21204N37249M48446N21049O47586O91927
11991A6242825P50255P58294Q28134P60751Q00014Q36309R08842J070945J114643
11982B4071012J074335J127437J245778J252836J260575J369474J306025J417958
11974C4125430J380491J369960J414702J447680J320969J302912J377210J216137
11966D4955491J111461J017633Q33628Q09265O00542L50014J72038m2037k12597
$$ plain form
11957 49595438 49151745 48572045 47746126 46823273 45807389 44695601 43485261 42159376 40818970
11948 40818970 39413979 37957459 36555517 35165599 33766318 32350913 30976801 29724995
11940 29724995 28526648 27277867 26111690 25024993 23992980 22931696 21950510 21046199
11932 21046199 20158394 19310309 18450635 17685955 17035400 16412879 15765218 15095896 14464983
11923 14464983 13880327 13415389 13035398 12530474 12024557 11567450 11127044 10643642 10307415
11914 10307415 10001711 9668668 9389719 9112301 8842644 8562772 8338031 8073992 7724453
11905 7724453 7469870 7255802 6987921 6782842 6586826 6326154 6155266 6054641 5915271
11896 5915271 5688508 5446259 5309082 5178137 5053392 4928466 4797563 4678922 4540695
$$ packed form
11957D9595438m43693n79700q25919r22853j015884j111788j210340j325885j340406
11948D0818970j404991j456520j401942j389918j399281j415405j374112j251806
11940B9724995j198347j248781j166177j086697j032013j061284r81186r04311
11932B1046199q87805q48085q59674p64680o50555o22521o47661o69322o30913
11923A4464983n84656m64938l79991n04924n05917m57107m40406m83402l36227
11914A0307415l05704l33043k78949k77418k69657k79872k24741k64039l49539
11905G724453k54583k14068k67881k05079j96016k60672j70888j00625j39370
11896E915271k26763k42249j37177j30945j24745j24926j30903j18641j38227
$$ plain form
11887 4540695 4485049 4392368 4158151 3996249 3954652 3924861 3816604 3758200 3670782 3578399 3529863
11876 3529863 3457775 3385081 3332375 3306626 3222224 3127655 3049457 3022777 2990677 2886337 2752649
11865 2752649 2664081 2637288 2686836 2650941 2584652 2452402 2478797 2503453 2448692 2348021 2321304
11854 2321304 2298097 2217371 2181957 2169822 2118830 2036042 1976996 2014125 2027369 1980270 1918224
11843 1918224 1847493 1832948 1825180 1707471 1677840 1679588 1710362 1683817 1621183 1587633 1595706 1516693
11831 1516693 1495991 1463593 1408104 1406596 1430839 1462114 1450317 1393209 1354660 1275134 1181392
11820 1181392 1196093 1237976 1317807 1377349 1359179 1393031 1396194 1271046 1251074 1248896 1231658
11809 1231658 1222189 1172311 1149169 1143915 1115761 1109121 1101446 1043847 979497 927349 963895 1034648
$$ packed form
11887D540695n5646r2681k34217j61902m1597k9791j08257n8404q7418r2383m8536
11876C529863p2088p2694n2706k5749q4402r4569p8198k6680l2100j04340j33688
11865B752649q8568k6793M9548l5895o6289j32250K6395K4656n4761j00671k6717
11854B321304k3207q0726l5414j2135n0992q2788n9046L7129J3244m7099o2046
11843A918224p0731j4545p768j17709k9631J748L0774k6545o2634l3550Q073p9013
11831A516693k0702l2398n5489j508K4243L1275j1797n7108l8549p9526r3742
11820A181392J4701M1883P9831N9542j8170L3852L163j25148j9972k178j7238
11809A231658r469m9878k3142n254k8154o640p675n7599o4350n2148L6546P0753
$$ plain form
11797 1034648 1012964 979141 1010740 974420 883635 858709 919900 928105 919095 851204 816469 789646
11785 789646 782875 828141 862452 867527 888772 869925 861611 843290 850824 847798 852145 816922 739901
11772 739901 751090 780304 792235 819200 787462 773241 740649 726061 647868 668554 651126
11761 651126 594884 575839 721134 777327 789925 710717 647158 697000 715180 593608 559132
11750 559132 567007 578422 627500 656519 655099 668256 593300 509693 493675 589213 620779 529017
11738 529017 465910 497924 500485 533236 558374 514968 496712 470282 448275 441589 483869 563926
11726 563926 671390 706265 614068 501475 458951 521061 573514 582570 575406 581143 558599 574811
11714 574811 594737 568505 490729 476952 487484 520628 502858 483036 594328 580208 534292
$$ packed form
11797A034648k1684l3823L1599l6320r0785k4926O1191Q205r010o7891l4735k6823
11785G89646o771M5266L4311N075K1245j8847q314j8321P534l026M347l5223p7021
11772G39901J1189K9214J1931K6965l1738j4221l2592j4588p8193K0686j7428
11761F51126n6242j9045J45295N6193J2598p9208o3559M9842J8180j21572l4476
11750E59132P875J1415M9078K9019j420J3157p4956q3607j6018R5538L1566r1762
11738E29017o3107L2014K561L2751K5138m3406j8256k6430k2007o686M2280Q0057
11726E63926J07464L4875r2197j12593m2524O2110N2453R056p164N737k2544J6212
11714E74811J9926k6232p7776j3777J0532L3144j7770j9822J11292j4120m5916
$$ plain form
11703 534292 567186 658146 624542 554544 522950 487453 412696 397868 419246 435840 467285
11692 467285 460500 435606 421383 421677 451899 453075 456316 538914 533129 493673 535092 580577 547958
11679 547958 468847 359664 344045 381235 483101 521841 485940 559103 576003 576516 596745
11668 596745 540571 507102 478882 425257 474665 522993 404645 383178 458380 489614 433498
11657 433498 416535 424334 359488 333348 311117 327558 284054 315846 330162 323299 326365 319310
11645 319310 327987 368512 395038 418825 415597 429600 453940 434058 397433 384457 418916 471126
11633 471126 482710 468748 419246 314399 308794 334648 360328 377834 344980 362067 392834
11622 392834 370011 340422 377766 428530 470174 491359 498999 509233 460122 412208 400774 392098
$$ packed form
11703E34292L2894R0960l3604o9998l1594l5497p4757j4828K1378J6594L1445
11692D67285o785k4894j4223K94L0222J176L241Q2598n785l9456M1419M5485l2619
11679E47958p9111j09183j5619L7190J01866L8740l5901P3163J6900N13K0229
11668E96745n6174l3469k8220n3625M9408M8328j18348k1467P5202L1234n6116
11657D33498j6963P799o4846k6140k2231J6441m3504L1792J4316o863L066p055
11645C19310Q677M0525K6526K3787l228J4003K4340j9882l6625j2976L4459N2210
11633D71126J1584j3962m9502j04847n605K5854K5680J7506l2854J7087L0767
11622C92834k2823k9589L7344N0764M1644K1185P640J0234m9111m7914j1434q676
$$ plain form
11610 392098 311684 284647 291497 363757 409485 436338 441180 440218 466472 491318 463205 420904
11598 420904 377824 423451 437261 445496 447184 473437 515255 527257 469207 428016 460248 402498
11586 402498 425689 400136 374918 379401 379156 361124 367129 457263 483730 402175 375030 320073
11574 320073 276975 252381 264659 275403 310230 286903 346037 391398 384368 436082 486050 456762
11562 456762 441572 362905 335063 347563 271885 251600 302731 329704 358543 410544 459884
11551 459884 398508 334976 300263 419481 456222 432841 413450 364972 286674 220921 269274
11540 269274 330550 378077 382125 423858 471926 437768 402384 468970 423398 380564 350483 278439
11528 278439 239774 205940 251030 209473 258287 270389 265056 326594 363111 408847 390213 410423
$$ packed form
11610C92098q0414k7037O850P2260M5728K6853M842r62K6254K4846k8113m2301
11598D20904m3080M5627J3810Q235J688K6253M1818J2002n8050m1191L2232n7750
11586D02498K3191k5553k5218M483k45j8032O005R0134K6467q1555k7145n4957
11574C20073m3098k4594J2278J0744L4827k3327N9134M5361p030N1714M9968k9288
11562D56762j5190p8667k7842J2500p5678k0285N1131K6973K8839N2001M9340
11551D59884o1376o3532l4713J19218L6741k3381j9391m8478p8298o5753M8353
11540B69274O1276M7527M048M1733M8068l4158l5384O6586m5572m2834l0081p2044
11528B78439l8665l3834M5090m1557M8814J2102n333O1538L6517M5736j8634K0210
$$ plain form
11516 410423 433186 459201 424412 401878 336895 232049 187392 218568 284847 253077 282316
11505 282316 265172 236210 253751 291813 279070 271524 304306 377416 375497 387057 299751 228049
11493 228049 221839 321943 305517 261179 246992 259380 271936 340144 301593 295550 327773 389375
11481 389375 485325 483381 454807 449352 461765 420457 473879 564822 572184 605594 590761 518601
11469 518601 455379 438495 425885 429399 416287 357960 392839 338037 381851 420145 427975 369455
11457 369455 358460 404131 385327 401550 352940 257563 303587 366660 361015 412985 467104 450588
11445 450588 488152 495609 498171 473581 433236 410994 457634 471430 531807 497501 415045 474765
11433 474765 470967 430925 532614 605174 597736 695153 705275 684418 770828 847154 854564 837083
$$ packed form
11516D10423K2763K6015l4789k2534o4983j04846m4657L1176O6279l1770K9239
11505B82316j7144k8962J7541L8062j2743p546L2782P3110j919J1560q7306p1702
11493B28049o210J00104j6426m4338j4187J2388J2556O8208l8551o043L2223O1602
11481C89375R5950j944k8574n455J2413m1308N3422R0943P362L3410j4833p2160
11469E18601o3222j6884j2610L514j3112n8327L4879n4802M3814L8294P830n8520
11457C69455j0995M5671j8804J6223m8610r5377M6024O3073n645N1970N4119j6516
11445D50588L7564P457K562k4590m0345k2242M6640J3796O0377l4306q2456N9720
11433D74765l798m0042J01689P2560p438R7417J0122k0857Q6410P6326P410j7481
$$ plain form
11421 837083 881054 918496 1056843 1055215 1039443 1012419 978762 960601 934566 961268 972907
11410 972907 869399 784380 668964 630205 708124 723187 655906 619746 621137 677082 754999
11399 754999 771428 713340 646335 619582 645564 669717 667700 702749 668732 725438 703730 742352
11387 742352 802554 821965 844725 855817 805554 802264 845100 855710 919001 981190 1093244
11376 1093244 1246875 1288909 1340462 1415196 1517949 1577007 1634665 1613016 1531683 1471071 1489069
11365 1489069 1473798 1398210 1266380 1165103 1167631 1196733 1237513 1167779 1080976 1084960 1070871
11354 1070871 1040928 1047246 984079 921924 903855 799327 804150 799018 749752 697406 714980 658763
11342 658763 623599 627312 640559 693022 762822 821089 757678 741193 752518 731267 679285 676334
$$ packed form
11421H37083M3971L7442J38347j628j5772k7024l3657j8161k6035K6702J1639
11410I72907j03508q5019j15416l8759P7919J5063o7281l6160J391N5945P7917
11399G54999J6429n8088o7005k6753K5982K4153k017L5049l4017N6706k1708L8622
11387G42352O0202J9411K2760J1092n0263l290M2836J0610O3291O2189J12054
11376A093244J53631M2034N1553P4734J02753N9058N7658k1649q1333o0612J7998
11365A489069j5271p5588j31830j01277K528K9102M0780o9734q6803L984j4089
11354A070871k9943O318o3167o2155j8069j04528M823n132m9266n2346J7574n6217
11342F58763l5164L713J3247N2463O9800N8267o3411j6485J1325k1251n1982k951
$$ plain form
11330 676334 811261 907228 960117 933258 919274 905532 881103 1013876 1124279 1188201 1268845
11319 1268845 1278939 1295994 1215069 1202806 1169915 1133617 1068225 982141 882689 825547 827162
11308 827162 835627 883759 907660 887795 816826 772134 850183 827853 741823 688603 723527 683434
11296 683434 615567 631856 655281 625012 606393 612487 631921 625651 658065 637614 636671 656270
11284 656270 634982 617181 651201 682790 709769 675013 601610 578261 608745 667320 762218
11273 762218 780052 719233 653538 608305 607779 660696 678388 678624 677802 735969 754366 732663 712022
11260 712022 753342 702579 588907 601063 598926 606700 622549 654211 654379 593056 580006 630375
11248 630375 678192 704308 714266 687332 653567 654469 652915 642707 556854 510732 470907 525378
$$ packed form
11330F76334J34927R5967N2889k6859j3984j3742k4429J32773J10403O3922Q0644
11319A268845J0094J7055q0925j2263l2891l6298o5392q6084r9452n7142J615
11308H27162Q465M8132K3901j9865p0969m4692P8049k2330q6030n3220L4924m0093
11296F83434o7867J6289K3425l0269j8619O094J9434o270L2414k0451r43J9599
11284F56270k1288j7801L4020L1589K6979l4756p3403k3349L0484N8575R4898
11273G62218J7834o0819o5695m5233n26N2917J7692K36q22N8167J8397k1703k0641
11260G12022M1320n0763j13672J2156k137P774J5849L1662J68o1323j3050N0369
11248F30375M7817K6116R958k6934l3765R02j554j0208q5853m6122l9825N4471
$$ plain form
11236 525378 585710 634497 668451 703539 704303 651776 674579 716011 761116 755175 773609 738490
11224 738490 701673 750039 769773 684079 780433 811265 838737 851675 852582 805433 816424 894786
11212 894786 949696 856741 927111 936197 908916 854860 835903 843769 957801 934628 921726 891609
11200 891609 899066 883706 874244 814062 817105 789263 801275 905119 954168 894932 903427 971553
11188 971553 945110 871634 917449 915675 965921 943498 947957 1034885 1029142 1001934 1113163 1179808
11176 1179808 1194770 1144635 1079927 1034222 1079611 1132421 1149342 1192537 1189763 1198463 1122396 1094493
11164 1094493 1119465 1164430 1173696 1201902 1223652 1226168 1262269 1236775 1295221 1355691 1344182 1236916
11152 1236916 1141841 1157743 1251498 1265576 1218699 1128719 1105730 1139508 1173373 1244839 1262589
$$ packed form
11236E25378O0332M8787L3954L5088P64n2527K2803M1432M5105n941J8434l5119
11224G38490l6817M8366J9734q5694R6354L0832K7472J2938R07m7149J0991P8362
11212H94786N4910r2955P0370R086k7281n4056j8957P866J14032k3173j2902l0117
11200H91609P457j5360r462o0182L043k7842J2012J03844M9049n9236Q495O8126
11188I71553k6443p3476M5815j774N0246k2423M459Q6928n743k7208J11229O6645
11176A179808J4962n0135o4708m5705M5389N2810J6921M3195k774Q700p6067k7903
11164A094493K4972M4965R266K8206K1750K516L6101k5494N8446O0470j1509j07266
11152A236916r5075J5902R3755J4078m6877q9980k2989L3778L3865P1466J7750
$$ plain form
11141 1262589 1237292 1296612 1330880 1316051 1330578 1371751 1414590 1379924 1407496 1380303 1331341
11130 1331341 1264493 1219574 1243544 1224898 1227913 1243720 1293108 1342440 1380751 1453935 1505829
11119 1505829 1524953 1531691 1486988 1427474 1406129 1380244 1445409 1527987 1609837 1653097 1707073
11108 1707073 1675953 1712901 1712114 1682733 1726081 1765323 1775350 1753494 1779673 1794536 1841276 1925970
11096 1925970 2042338 2083882 2119167 2088853 1973516 1902844 1965625 2050113 2036845 2088543 2069887
11085 2069887 2020929 2154955 2220172 2191176 2217163 2255907 2309782 2292378 2363228 2445792 2500378
11074 2500378 2480711 2550759 2682486 2699248 2729486 2761215 2803511 2880409 2952455 2945873 3095778
11063 3095778 3202273 3290522 3316974 3426441 3536005 3607233 3664447 3737082 3817128 3926600
$$ packed form
11141A262589k5297N9320L4268j4829J4527M1173M2839l4666K7572k7193m8962
11130A331341o6848m4919K3970j8646L015J5807M9388M9332L8311P3184N1894
11119A505829J9124O738m4703n9514k1345k5885O5165Q2578Q1850M3260N3976
11108A707073l1120L6948p87k9381M3348L9242J0027k1856K6179J4863M6740Q4694
11096A925970J16368M1544L5285l0314j15337p0672O2781Q4488j3268N1698j8656
11085B069887m8958J34026O5217k8996K5987L8744N3875j7404P0850Q2564N4586
11074B500378j9667P0048J31727J6762L0238L1729M2296P6898P2046o582J49905
11063C095778J06495Q8249K6452J09467J09564P1228N7214P2635Q0046J09472
$$ plain form
11053 3926600 3997250 4153556 4311588 4496689 4720620 4987589 5317920 5660891 6012955 6397776
11043 6397776 6701161 6956804 7301653 7787599 8237444 8705953 9224631 9937626 10785668
11034 10785668 11742246 12799282 13992390 15334479 16743252 18410944 20380291 22808427
11026 22808427 25751546 29307373 33710457 39153642 45717734 53356450 61985540 71187050
11018 71187050 80524323 89599348 97858834 104791850 110126371 113452317 114558842 113482665
11010 113482665 110214109 105014257 98197443 90018060 80999381 71727653 62821941 54832080
11002 54832080 47994053 42361589 37965480 34556525 31925302 29995143 28537659 27479882
10994 27479882 26768614 26406682 26336753 26612328 27199563 28175521 29685843 31749420 34420883
$$ packed form
11053C926600P0650J56306J58032J85101K23931K66969L30331L42971L52064L84821
11043F397776L03385K55643L44849M85946M49845M68509N18678P12995Q48042
11034A0785668R56578J057036J193108J342089J408773J667692J969347K428136
11026B2808427K943119L555827M403084N443185O564092P638716Q629090R201510
11018G1187050R337273R075025Q259486O933016N334521L325946J106525j076177
11010A13482665l268556n199852o816814q179383r018679r271728q905712p989861
11002E4832080o838027n632464m396109l408955k631223j930159j457484j057777
10994B7479882p11268l61932o9929K75575N87235R75958J510322K063577K671463
$$ plain form
10985 34420883 37796022 41798257 46281465 51123061 56037547 60910925 65774456 70813017
10977 70813017 76345865 83038225 91646824 103034603 117749423 135957571 156903642
10970 156903642 179330554 201236916 220283610 234243189 241554634 241646808 235010139 223384369
10962 223384369 208871638 193867631 180285531 168970358 159835865 152068465 144464578
10955 144464578 136132941 126467170 115520481 103782581 91964395 81213152 72506905
10948 72506905 66212889 62277331 60224622 59485591 59438608 59357236 58893543 57865783 56136605
10939 56136605 53643938 50712191 47535927 44540964 42093037 40339920 39457981 39391149
10931 39391149 40066072 41499754 43736637 46877020 51073236 56507920 63526432 72476224
$$ packed form
10985C4420883L375139M002235M483208M841596M914486M873378M863531N038561
10977G0813017N532848O692360Q608599J1387779J4714820J8208148K0946071
10970A56903642K2426912K1906362J9046694J3959579P311445R2174o636669j1625770
10962B23384369j4512731j5004007j3582100j1315173r134493p767400p603887
10955A44464578q331637r665771j0946689j1737900j1818186j0751243q706247
10948G2506905o294016l935558k052709p39031m6983q1372m63693j027760j729178
10939E6136605k492667k931747l176264k994963k447927j753117q81939o6832
10931C9391149O74923J433682K236883L140383M196216N434684P018512Q949792
$$ plain form
10923 72476224 83490406 96605786 111357202 127064318 142858052 157605712 170147633
10916 170147633 179466625 184642285 184978925 180456158 171547200 158976394 143865906 127358138
10908 127358138 110531494 94494658 80059836 67548103 57110850 48659559 41932226
10901 41932226 36543377 32092257 28495578 25436541 22818579 20544018 18551861 16788659
10893 16788659 15238109 13883806 12690001 11553416 10612569 9785239 9023584 8390986 7851787
10884 7851787 7308393 6739545 6222438 5850950 5490654 5206272 4941503 4691949 4548565
10875 4548565 4329583 4063258 3863535 3739504 3657669 3654129 3510679 3324587 3213033 3036880
10865 3036880 2939624 2913227 2783760 2740883 2686284 2539622 2490248 2458950 2394053 2291908 2289469
$$ packed form
10923G2476224J1014182J3115380J4751416J5707116J5793734J4747660J2541921
10916A70147633R318992N175660L36640m522767q908958j2570806j5110488j6507768
10908A27358138j6826644j6036836j4434822j2511733j0437253q451291o727333
10901D1932226n388849m451120l596679l059037k617962k274561j992157j763202
10893A6788659j550550j354303j193805j136585r40847q27330p61655o32598n39199
10884G851787n43394n68848n17107l71488l60296k84382k64769k49554j43384
10875D548565k18982k66325j99723j24031q1835l540j43450j86092j11554j76153
10865C036880r7256k6397j29467m2877n4599j46662m9374l1298o4897j02145k439
$$ plain form
10854 2289469 2294694 2252599 2175867 2196861 2149532 2084396 2014745 2044835 2053917 2054230 2050011 2001618
10842 2001618 1998227 1928625 1919103 1805655 1691429 1685430 1577329 1489180 1530286 1598947 1661965
10831 1661965 1732551 1744833 1692980 1646536 1579998 1447550 1365290 1307246 1238161 1197735 1313431
10820 1313431 1363522 1322102 1266887 1207275 1195007 1167274 1137465 1066694 1090289 1097353 1022353
10809 1022353 1050820 1174203 1184518 1169442 1175815 1192190 1207865 1278065 1227000 1171706 1116014
10798 1116014 1072149 1137458 1224587 1303685 1335883 1285237 1316466 1326674 1378920 1422206 1382658
10787 1382658 1360294 1344580 1356682 1449418 1625542 1758736 1864051 2019323 2086159 2126057
10777 2126057 2254852 2309429 2217008 1970595 1733820 1555882 1355312 1292696 1235443 1237571
$$ packed form
10854B289469N225m2095p6732K0994m7329o5136o9651L0090R082L13m219m8393
10842B001618l391o9602r522j13448j14226n999j08101q8149M1106O8661O3018
10831A661965P0586J2282n1853m6444o6538j32448q2260n8044o9085m0426J15696
10820A313431N0091m1420n5215n9612j2268k7733k9809p0771K3595P064p5000
10809A022353K8467J23383J0315j5076O373J6375J5675P0200n1065n5294n5692
10798A116014m3865O5309Q7129P9098L2198n0646L1229J0208N2246M3286l9548
10787A382658k2364j5714J2102R2736J76124J33194J05315J55272O6836L9898
10777B126057J28795N4577r2421k46413k36775j77938k00570o2616n7253K128
$$ plain form
10767 1237571 1191541 1091350 1115604 1038819 1038515 1139828 1202654 1218135 1179464 1070810 1011192
10756 1011192 980594 1005082 1069415 1153460 1138806 1112555 1099011 1189792 1203974 1206475 1209816 1248597
10744 1248597 1317659 1403646 1527825 1567063 1535872 1489776 1503414 1530987 1577735 1581303 1685347
10733 1685347 1723260 1728134 1843687 1898249 1844079 1866999 1855630 1825759 1719859 1630482 1636033
10722 1636033 1714804 1836564 1984057 2136478 2326498 2495734 2677692 2817995 2934174 2923466
10712 2923466 2767111 2605012 2428966 2275574 2295417 2285398 2244201 2208315 2150391 2043485
10702 2043485 1974779 1874849 1780659 1755537 1749390 1723227 1716395 1785682 1740085 1787765 1757049 1761964
10690 1761964 1729414 1733337 1740942 1742917 1829548 1921150 2024144 2066208 2070297 2072446 2160059 2211806
$$ packed form
10767A237571m6030j00191K4254p6785l04J01313O2826J5481l8671j08654n9618
10756A011192l0598K4488O4333Q4045j4654k6251j3544R0781J4182K501L341L8781
10744A248597O9062Q5987J24179L9238l1191m6096J3638K7573M6748L568J04044
10733A685347L7913M874J15553N4562n4170K2920j1369k9871j05900q9377N551
10722A636033P8771J21760J47493J52421J90020J69236J81958J40303J16179j0708
10712B923466j56355j62099j76046j53392J9843j0019m1197l5886n7924j06906
10702B043485o8706r9930r4190k5122o147k6163o832O9287m5597M7680l0716M915
10690A761964l2550L923P605J975Q6631R1602J02994M2064M089K149Q7613N1747
$$ plain form
10678 2211806 2280382 2387395 2391984 2417986 2414629 2414050 2377208 2359345 2304014 2325928 2413798 2534711
10666 2534711 2664997 2728081 2856689 2869636 2912523 2968110 2993815 3078019 3144376 3139189 3312285
10655 3312285 3475905 3583372 3667062 3770343 3834390 3836170 3840468 3886356 3900824 4000327 4125018
10644 4125018 4207601 4312913 4499748 4645087 4838508 5072313 5226485 5440450 5749823 6079998
10634 6079998 6537820 7061073 7570624 8122193 8611809 9099019 9617566 10153432 10872278
10625 10872278 11803054 12967399 14530107 16636506 19381623 23085893 28110165 34579890
10617 34579890 42786098 52709204 62863165 70608542 73641956 72256997 69025629 66406476
10609 66406476 66047027 69013480 75816046 86865907 102707384 122740809 143132788 156708739
$$ packed form
10678B211806O8576J07013M589K6002l357n79l6842j7863n5331K1914Q7870J20913
10666B534711J30286O3084J28608J2947M2887N5587K5705Q4204O6357n187J73096
10655C312285J63620J07467Q3690J03281O4047J780M298M5888J4468R9503J24691
10644D125018Q2583J05312J86835J45339J93421K33805J54172K13965L09373L30175
10634F079998M57822N23253N09551N51569M89616M87210N18547N35866P18846
10625A0872278R30776J164345J562708K106399K745117L704270N024272O469725
10617C4579890Q206208R923106J0153961P745377L033414j384959l231368k619153
10609F6406476l59449K966453O802566J1049861J5841477K0033425K0391979J3575951
$$ plain form
10601 156708739 157739654 148062515 134976720 124537578 119412851 120617304 128558233 143600602
10593 143600602 165558941 192505268 218474594 233090605 228937853 211005061 190719987
10586 190719987 176309302 171022470 175509512 189931195 214340006 248003048 287289844
10579 287289844 323706621 345284545 345068756 328540345 306029545 282410185 257202798
10572 257202798 230085796 203519761 180736238 163245406 150328666 139430354 127569144
10565 127569144 113229781 97443545 82560759 70266995 60785477 53708706 48606602
10558 48606602 45126242 42923371 41677517 41375110 42111009 43953488 47250609 52299255
10550 52299255 58934895 66001438 70570380 70179555 66375885 62115705 59183627 58180001
$$ packed form
10601A56708739J030915r677139j3085795j0439142n124727J204453P940929J5042369
10593A43600602K1958339K6946327K5969326J4616011m152752j7932792k0285074
10586A90719987j4410685n286832M487042J4421683K4408811L3663042L9286796
10579B87289844L6416777K1577924k15789j6528411k2510800k3619360k5207387
10572B57202798k7117002k6566035k2783523j7490832j2916740j0898312j1861210
10565A27569144j4339363j5786236j4882786j2293764r481518p076771n102104
10558D8606602l480360k202871j245854l02407P35899J842479L297121N048646
10550E2299255O635640P066543M568942l90825l803670m260180k932078j003626
$$ plain form
10542 58180001 59388633 63209353 70186503 81125467 97016771 118138215 142466516
10535 142466516 162661745 169331662 163110320 154566216 152450092 160257142 178512960 206254995
10527 206254995 240312092 274215630 297809241 300503745 280683492 247209196 209268202
10520 209268202 173060750 141998533 117406192 99016809 85876959 77366638 72604671
10513 72604671 70704561 70009465 67685701 61791378 53698633 45957513 39738648 35064014
10505 35064014 31621975 29100009 27332004 25964099 24913279 24039110 23351137 22922463
10497 22922463 22811021 23110565 23732163 24662652 25948941 27772116 30138983 33027601 36692395
10488 36692395 41372911 47583079 55851011 66455459 79581699 94553618 109129327
$$ packed form
10542E8180001J208632L820720O977150J0938964J5891304K1121444K4328301
10535A42466516K0195229O669917o221342q544104k116124P807050J8255818K7742035
10527B06254995L4057097L3903538K3593611K694504j9820253l3474296l7940994
10520B09268202l6207452l1062217k4592341j8389383j3139850q510321m761967
10513G2604671j900110o95096k323764n894323q092745p741120o218865m674634
10505C5064014l442039k521966j768005j367905j050820q74169o87973m28674
10497B2922463j11442K99544O21598R30489J286289J823175K366867K888618L664794
10488C6692395M680516O210168Q267932J0604448J3126240J4971919J4575709
$$ plain form
10481 109129327 120080624 124859656 124202800 121725173 120217458 119079892 115514962 106869735
10473 106869735 93554855 78517635 64447027 52634101 43276185 36012361 30410492
10466 30410492 26080025 22600928 19745005 17352966 15431523 13819813 12461592 11323376
10458 11323376 10280475 9304025 8486057 7889496 7227449 6671969 6160403 5646014 5155365
10449 5155365 4719803 4395280 4031152 3706182 3443459 3209771 2864732 2659708 2576681 2443628
10439 2443628 2300206 2154372 2046374 2007377 1878604 1714995 1645588 1632536 1595876 1597665
10429 1597665 1537629 1496604 1439419 1361163 1335624 1277186 1264012 1235876 1190202 1178502 1157205
10418 1157205 1125436 1079451 953103 915494 942669 920790 891413 869364 877903 864105 725892
$$ packed form
10481A09129327J0951297M779032o56856k477627j507715j137566l564930q645227
10473A06869735j3314880j5037220j4070608j1812926r357916p263824n601869
10466C0410492m330467l479097k855923k392039j921443j611710j358221j138216
10458A1323376j042901r76450q17968n96561o62047n55480n11566n14389m90649
10449E155365m35562l24523l64128l24970k62723k33688l45039k05024q3027j33053
10439B443628j43422j45834j07998l8997j28773j63609o9407j3052l6660J789
10429A597665o0036m1025n7185p8256k5539n8438j3174k8136m5674j1700k1297
10418A157205l1769m5985j26348l7609K7175k1879k9377k2049Q539j3798j38213
$$ plain form
10407 725892 649319 704180 773233 731346 727904 677268 615381 567515 519619 516913 495215 423261
10395 423261 325864 275065 270565 236606 201490 188764 223149 258860 245500 203453 226989 207132
10383 207132 185603 234452 260333 294111 248275 186956 107041 79540 54220 20105 -15565
10372 -15565 17482 55042 1189 -19870 -38194 -19422 41536 96691 72393 106482 98993 112694
10360 112694 98197 168371 170448 137298 133995 123961 84480 29682 22970 4631 -14 -40094
10348 -40094 -61136 -7856 119664 101708 31384 -13007 -41336 -29606 39729 71426 93925
10337 93925 174721 122291 68712 92877 35024 61883 85314 87795 81855 60156 -4270 -77553
10325 -77553 -165916 -223265 -266658 -231741 -175729 -99109 -60941 -85780 -74109 -28743 -19305 26771
$$ packed form
10407G25892p6573N4861O9053m1887l442n0636o1887m7866m7896k706k1698p1954
10395D23261r7397n0799m500l3959l5116j2726L4385L5711j3360m2047K3536j9857
10383B07132k1529M8849K5881L3778m5836o1319p9915k7501k5320l4115l5670
10372a5565L3047L7560n3853k1059j8324J8772O0958N5155k4298L4089p489J3701
10360A12694j4497P0174K077l3150l303j0034l9481n4798o712j8339m645m0080
10348d0094k1042N3280J27520j7956p0324m4391k8329J1730O9335L1697K2499
10337I3925Q0796n2430n3579K4165n7853K6859K3431K481n940k1699o4426p3283
10325g7553q8363n7349m3393L4917N6012P6620L8168k4839J1671M5366R438M6076
$$ plain form
10313 26771 23915 -10534 -17751 -64305 -135504 -174563 -150886 -97587 -123619 -136063 -140187 -135591
10301 -135591 -58227 -14709 -9507 -71018 -72550 38240 102246 81442 12682 -112465 -176019
10290 -176019 -148281 -104584 -91734 -84161 -126437 -135900 -216755 -240357 -259811 -177881 -89643 -122890
10278 -122890 -143591 -131032 -77312 -34979 -5545 7781 -3570 -34714 -24160 -122799 -226704
10267 -226704 -182359 -118156 -129207 -76621 -42193 -11687 -43145 10557 -26651 -134321 -184774
10256 -184774 -146311 -58641 -28042 -1546 4939 -91288 -100077 -98160 -113319 -141506 -140152 -189141
10244 -189141 -138638 -92019 -124633 -126802 -208737 -189819 -40897 -32596 -29299 42843 91980 18877
10232 18877 -150849 -222540 -162775 36477 112855 67411 -31186 -115047 -108997 -120654 -69421
$$ packed form
10313B6771k856l4449p217m6554p1199l9059K3677N3299k6032j2444m124M596
10301a35591P7364M3518N202o1511j532J10790O4006k0804o8760j25147o3554
10290a76019K7738M3697J2850P573m2276r463q0855k3602j9454Q1930Q8238l3247
10278a22890k0701J2559N3720M2333K9434J3326j1351l1144J0554r8639j03905
10267b26704M4345O4203j1051N2586L4428L0506l1458N3702l7208j07670n0453
10256a84774L8463Q7670L0599K6496O485r6227q789J917j5159k8187J354m8989
10244a89141N0503M6619l2614k169q1935J8918J48922Q301L297P2142M9137p3103
10232A8877j69726p1691N9765J99252P6378m5444r8597q3861O050j1657N1233
$$ plain form
10221 -69421 -19707 -72464 -133822 -98748 -35874 5071 8093 90256 139784 99109 122186 49143
10209 49143 -26387 -49954 -37658 -2569 39139 15733 23210 44287 -24192 -92509 -130982 -73203
10197 -73203 -67286 -111539 -73315 -26666 -2070 2207 -53341 -80903 17728 74992 102021 118985
10185 118985 137827 191169 253186 227507 189846 248440 394078 531378 618176 616397 664197
10174 664197 701205 722733 842877 1002500 1165626 1297036 1403136 1476530 1533485 1586130
10164 1586130 1406105 1222318 1130374 1065376 923080 831410 842332 926782 1011934 1104625 1280333
10153 1280333 1249814 1047048 955358 872533 806097 709334 690505 669228 689762 736514 851160
10142 851160 940843 939989 918467 825185 696485 620209 621303 521283 516611 585605 664558 718277
$$ packed form
10221f9421M9714n2757o1358L5074O2874M0945L022Q2163M9528m0675K3077p3043
10209D9143p5530k3567J2296L5089M1708k3406P477K1077o8479o8317l8473N7779
10197g3203N917m4253L8224M6649K4596M277n5548k7562R8631N7264K7029J6964
10185A18985J8842N3342O2017k5679l7661N8594J45638J37300Q6798j779M7800
10174F64197L7008K1528J20144J59623J63126J31410J06100P3394N6955N2645
10164A586130j80025j83787r1944o4998j42296r1670J0922Q4450Q5152R2691J75708
10153A280333l0519k02766r1690q2825o6436r6763j8829k1277K0534M6752J14646
10142H51160Q9683q54k1522r3282j28700p6276J094j00020m672O8994P8953N3719
$$ plain form
10130 718277 777567 844325 834388 840785 922827 1050230 1088447 1072356 1131987 1203656 1200428 1198704
10118 1198704 1240112 1340978 1354815 1272746 1147721 1026538 895795 753676 629909 566988
10108 566988 518958 454266 421820 441145 444010 466678 505211 536894 539157 466043 361152 330185
10096 330185 335071 294698 227417 178484 206253 200688 170418 169533 121048 81624 111303 128667
10084 128667 104015 68518 96909 132751 137503 158009 222652 282358 313901 243598 309553 428727
10072 428727 455925 508114 571618 593634 547671 478050 461431 451724 451912 435971 389966 365024
10060 365024 331043 331642 337378 212918 179437 178658 182986 147383 129625 133425 173649 143187 52163
10047 52163 73341 45031 28887 81114 139779 66140 -10908 -25515 95515 71552 -20224
$$ packed form
10130G18277N9290O6758r937O397Q2042J27403L8217j6091N9631P1669l228j724
10118A198704M1408J00866J3837q2069j25025j21183j30743j42119j23767o2921
10108E66988m8030o4692l2446J9325K865K2668L8533L1683K263p3114j04891l0967
10096C30185M886m0373o7281m8933K7769n565l0270q85m8485l9424K9679J7364
10084A28667k4652l5497K8391L5842M752K0506O4643N9706L1543p0303O5955J19174
10072D28727K7198N2189O3504K2016m5963o9621j6619r707J88j5941m6005k4942
10060C65024l3981N99N736j24460l3481p79M328l5603j7758L800M0224l0462r1024
10047E2163K1178k8310j6144N2227N8665p3639p7048j4607J21030k3963r1776
$$ plain form
10036 -20224 -90164 -54873 -23121 65267 93297 47113 71126 17388 -14604 -30484 -42312 27387
10024 27387 43381 8619 -9136 -121317 -150485 -131160 -111932 -158718 -149192 -141087 -179430 -188499
10012 -188499 -171027 -179104 -105350 -51062 -13856 -28192 -85318 -158731 -127078 -66760 -78931 -66584
10000 -66584 7212 40007 13171 -37188 -29378 2962 -1192 -39646 -89843 -42889 -5221 -94453
9988 -94453 -117504 -122208 -140793 -159436 -130988 -52048 -16509 -41676 -26849 -96863 -141974 -194092
9976 -194092 -187580 -160738 -105360 -54159 7032 -19461 -93683 -119428 -146025 -220089 -232235 -170662
9964 -170662 -181928 -167769 -160665 -152754 -103230 -55044 -86469 -101702 -110718 -42404 2865 -46976
9952 -46976 -3101 71436 18568 14465 -70484 -110356 -117156 21016 28267 43398 47090 105244
$$ packed form
10036b0224o9940L5291L1752Q8388K8030m6184K4013n3738l1992j5880j1828O9699
10024B7387J5994l4762j7755j12181k9168J9325J9228m6786R526Q105l8343r069
10012a88499J7472q077P3754N4288L7206j4336n7126p3413L1653O0318j2171J2347
10000f6584P3796L2795k6836n0359P810L2340m154l8454n0197M6954L7668q9232
9988i4453k3051m704j8585j8643K8448P8940L5539k5167J4827p0014m5111n2118
9976a94092O512K6842N5378N1201O1191k6493p4222k5745k6597p4064j2146O1573
9964a70662j1266J4159P104P911M9524M8186l1425j5233r016O8314M5269m9841
9952d6976M3875P4537n2868m103q4949l9872o800J38172P251J5131L692N8154
$$ plain form
9940 105244 85745 70528 104952 156886 244882 325244 431696 615561 966875 1559200 2565570
9929 2565570 4233427 6825745 9750016 8977448 5815465 3452601 2025428 1252650 842125
9920 842125 658648 565170 427404 350385 281009 246024 150409 125034 68704 7677 -785
9909 -785 45101 71134 53716 15689 22794 -28110 -73794 -116034 -165680 -229723 -272300 -237633
9897 -237633 -224410 -194192 -68967 -40845 -71138 -114566 -173075 -230863 -180074 -120068 -92957
9886 -92957 -66986 -35145 -49009 -57089 -97913 -121074 -73034 -94269 -82447 -67437 -21741 6883
9874 6883 -61522 -75848 -121044 -149003 -126885 -114303 -125988 -237566 -202312 -182082 -193611 -225899
9862 -225899 -191307 -191270 -190494 -176874 -186063 -100159 -30668 -27868 -80394 -159883 -173208 -215663 -237178
$$ packed form
9940A05244j9499j5217L4424N1934Q7996Q0362J06452J83865L51314N92325J006370
9929B565570J667857K592318K924271p72568l161983k362864j427173p72778m10525
9920H42125j83477r3478j37766p7019o9376l4985r5615k5375n6330o1027q462
9909g85M5886K6033j7418l8027P105n0904m5684m2240m9646o4043m2577L4667
9897b37633J3223L0218J25225K8122l0293m3428n8509n7788N0789O0006K7111
9886i2957K5971L1841j3864q080m0824k3161M8040k1235J1822J5010M5696K8624
9874F883o8405j4326m5196k7959K2118J2582j1685j11578L5254K0230j1529l2288
9862b25899L4592L7P76J3620r189Q5904O9491K800n2526p9489j3325m2455k1515
$$ plain form
9849 -237178 -224713 -274126 -285995 -259584 -260084 -293313 -237984 -201477 -181949 -88872 -47714 -72687
9837 -72687 -43184 13663 -52116 -100995 -94751 -73401 -81616 -106661 -121082 -99738 -52165 -77168
9825 -77168 -100824 -120235 -104963 -140790 -176902 -207604 -212821 -261146 -296324 -228861 -146142 -40259
9813 -40259 7171 21220 -17114 -96220 -72421 -113522 -105482 -71303 -87524 -57054 12273 98821
9801 98821 97741 -29359 -132219 -146105 -57715 -38834 -82459 -27667 -50015 -109345 -112036 -10827
9789 -10827 61836 49542 60925 -4415 -60875 -116353 -32665 33374 5469 -5807 93031 267409
9777 267409 494143 721133 925470 935198 676062 339800 157983 38902 -82085 -41300
9767 -41300 -55789 -108700 -124650 -158513 -149646 -76327 -240 9088 -17846 -3608 47885 -34429
$$ packed form
9849b37178J2465m9413j1869K6411n00l3229N5329L6507J9528R3077M1158k4973
9837g2687K9503N6847o5779m8879O244K1350q215k5045j4421K1344M7573k5003
9825g7168k3656j9411J5272l5827l6112l0702n217m8325l5178O7463Q2719J05883
9813d0259M7430J4049l8334p9106K3799m1101Q040L4179j6221L0470O9327Q6548
9801I8821j080j27100j02860j3886Q8390J8881m3625N4792k2348n9330k691J01209
9789a0827P2663j2294J1383o5340n6460n5478Q3688O6039k7905j1276R8838J74378
9777B67409K26734K26990K04337R728k59136l36262j81817j19081j20987M0785
9767d1300j4489n2911j5950l3863Q867P3319P6087R328k6934J4238N1493q2314
$$ plain form
9755 -34429 -117997 -32842 55561 -1849 -76852 -52798 -89292 -89632 -116418 -150582 -129422 -188204
9743 -188204 -199144 -232130 -213683 -171217 -175822 -257116 -273383 -232280 -228750 -265612 -222235 -171795
9731 -171795 -206121 -193300 -125352 -119005 -65227 -83432 -56904 -1741 -9306 24157 65162 2415
9719 2415 -21284 -65421 -99416 -96612 -120956 -68575 -75115 -78228 -86730 -79911 -124707 -156477 -156250
9706 -156250 -167486 -266809 -234808 -144547 -68684 -71136 -169058 -196553 -98948 -55192 -8843 2435
9694 2435 17066 -26753 -48054 9972 56432 -9466 -64508 -52666 1428 -27115 14048 -13432
9682 -13432 -43715 -107495 -101722 -81799 -141568 -162468 -145827 -150562 -15085 89259 139259 116026
9670 116026 35219 -1087 41838 35003 -10434 -48426 -17597 43549 64032 51622 28410 131258
$$ packed form
9755c4429q3568Q5155Q8403n7410p5003K4054l6494l40k6786l4164K1160n8782
9743a88204j0940l2986J8447M2466m605q1294j6267M1103L530l6862M3377N0440
9731a71795l4326J2821O7948O347N3778j8205K6528N5163p565L3463M1005o2747
9719B415k3699m4137l3995K804k4344N2381o540l113q502O819m4796l1770K27
9706a56250j1236r9323L2001R0261P5863k452r7922k7495R7605M3756M6349J1278
9694B435J4631m3819k1301N8026M6460o5898n5042J1842N4094k8543M1163k7480
9682a3432l0283o3780N773J9923n9769k0900J6641m735J35477J04344N0000k3233
9670A16026q0807l6306M2925o835m5437l7992L0829O1146K0483j2410k3212J02848
$$ plain form
9658 131258 332714 422324 568387 903703 1446845 2143626 2685292 2313667 1518404 988077
9648 988077 676335 438248 283421 255898 205558 198035 172880 47382 -23891 31443 43044
9637 43044 21215 -42620 -61889 -66009 -25853 18368 -9175 -49915 -89405 -120446 -68625 -33893
9625 -33893 -27495 38090 45391 25748 -23487 -96593 -40090 41702 25741 -82820 -203687 -182205
9613 -182205 -57462 -15177 -12764 -25431 -24550 -102698 -139530 -51360 -41212 -32496 -77976 -165961
9601 -165961 -188372 -159144 -149068 -132601 -65854 -74977 -189453 -206549 -181692 -140532 -119891 -83260
9589 -83260 -79783 -35685 -53925 -98149 -73874 -44153 -80933 -112181 -98951 -94048 -84464 -43752
9577 -43752 -15443 -13460 -36603 -35297 -10336 -45916 -87340 -59860 -80998 -136834 -126155 -52141
$$ packed form
9658A31258K01456Q9610J46063L35316N43142O96781N41666l71625p95263n30327
9648I88077l11742k38087j54827k7523n0340p523k5155j25498p1273N5334J1601
9637D3044k1829o3835j9269m120M0156M4221k7543m0740l9490l1041N1821L4732
9625c3893O398O5585P301j9643m9235p3106N6503Q1792j5961j08561j20867K1482
9613a82205J24743M2285K413j2667Q81p8148l6832Q8170J0148Q716m5480q7985
9601a65961k2411K9228J0076J6467O6747r123j14476j7096K4857M1160K0641L6631
9589h3260L477M4098j8240m4224K4275K9721l6780l1248J3230M903R584M0712
9577d3752K8309J983k3143J306K4961l5580m1424K7480k1138n5836J0679P4014
$$ plain form
9565 -52141 -53812 -8264 72739 30906 -2954 -32063 -84760 -11827 52292 87336 -32342 -126859
9553 -126859 -173354 -146695 -127849 -57748 -60627 -137332 -49662 -13975 -71924 -101561 -44161 -91390
9541 -91390 -102572 -96617 -99875 -60166 -73789 -107387 -94826 -119057 -87114 -79298 -52749 -41929
9529 -41929 -95839 -59970 -36299 -23385 -12467 21841 -59496 -192748 -174335 -99967 -98487 -128254
9517 -128254 -114829 -149201 -67234 -8669 -2504 -90389 -144953 -107505 -143058 -108808 -43611 -41707
9505 -41707 -19222 -33845 9133 -22393 -89929 -106629 -64999 -39685 -1226 -71923 -70548 -4339
9493 -4339 12187 68281 35967 33165 33736 56018 -23504 -80807 -95702 -48990 -21629 -57787 -82545
9480 -82545 -76114 18523 40171 -14417 -37381 -59690 -59554 -41491 -31024 -34661 -53438 29364 75446
$$ packed form
9565e2141j671M5548Q1003m1833l3860k9109n2697P2933O4119L5044j19678r4517
9553a26859m6495K6659J8846P0101k879p6705Q7670L5687n7949k9637N7400m7229
9541i1390j1182N955l258L9709j3623l3598J2561k4231L1943P816K6549J0820
9529d1929n3910L5869K3671J2914J0918L4308q1337j33252J8413P4368J480k9767
9517a28254J3425l4372Q1967N8565O165q7885n4564L7448l5553L4250O5197J904
9505d1707K2485j4623M2978l1526o7536j6700M1630K5314L8459p0697J375O6209
9493d339J6526N6094l2314k802N71K2282p9522n7303j4895M6712K7361l6158k4758
9480h2545O431R4637K1648n4588k2964k2309J36J8063J0467l637j8777Q2802M6082
$$ plain form
9467 75446 -834 -98804 -150683 -105099 -114645 -93291 -28420 31705 -24423 -103957 -85842 -92678
9455 -92678 -94602 -63379 -84850 -167180 -143716 -185011 -177506 -71907 -5018 -5188 36894 -8004
9443 -8004 -11198 -26160 -56332 -37725 25671 7705 -38113 -54114 -34182 -33539 -60882 -108285 -119356
9430 -119356 -130357 -95477 -84178 -146882 -167019 -166498 -138553 -125276 -31596 -15825 -46651 -51272
9418 -51272 -53899 -85180 -102534 -109214 -66539 -55434 12597 3109 -58774 -99201 -134511 -123452
9406 -123452 -146257 -74051 -116831 -134007 -78797 -131086 -96853 -77190 -52645 -55830 -120499 -187203
9394 -187203 -217982 -174355 -100771 -115749 -161751 -128549 -73246 -89896 -85647 -44393 -106677 -146484
9382 -146484 -182902 -175072 -84215 -88851 -107521 -57268 -92743 -178948 -196475 -180279 -166921 -231867
$$ packed form
9467G5446p6280r7970n1879M5584r546K1354O4871O0125n6128p9534J8115o836
9455i2678j924L1223k1471q2330K3464m1295P505J05599O6889j70M2082m4898
9443h004l194j4962l0172J8607O3396j7966m5818j6001J9932O43k7343m7403j1071
9430a19356j1001L4880J1299o2704k0137N21K7945J3277R3680J5771l0826m621
9418e1272k627l1281j7354o680M2675J1105O8031r488o1883m0427l5310J1059
9406a23452k2805P2206m2780j7176N5210n2289L4233J9663K4545l185o4669o6704
9394a87203l0779M3627P3584j4978m6002L3202N5303j6650M249M1254o2284l9807
9382a46484l6418P830R0857m636j8670N0253l5475q6205j7527J6196J3358o4946
$$ plain form
9370 -231867 -246958 -175743 -158790 -124337 -132713 -83682 -62565 -22964 -74094 -81788 -52148 -10590
9358 -10590 7241 -56955 -113773 -101476 -13576 1546 -24998 -10198 -62805 -87299 -51057 -43430
9346 -43430 -61928 -81002 -45925 -22170 -15613 -39531 -50029 23850 39823 1792 25861 -52829
9334 -52829 -29943 -87310 -64095 -46084 -75220 -93698 -77019 -40628 -9456 -6092 1113 -19829
9322 -19829 -78495 -40135 -12861 -25930 -27603 22169 31187 13678 -35333 -95145 -86740 -51568
9310 -51568 11470 9720 -50062 -60175 -33373 -78413 -97738 -29758 242 -71454 -43590 -13611
9298 -13611 26337 -2578 -42303 -15366 -21244 9859 11721 63226 146737 25947 -4549 39763
9286 39763 21285 305 -40630 -108190 -113149 -168291 -132664 -108717 -71615 -35249 29802 1926
$$ packed form
9370b31867j5091P1215J6953L4453q376M9031K1117L9601n1130p694K9640M1558
9358a0590J7831o4196n6818J2297Q7900J5122k6544J4800n2607k4494L6242P627
9346d3430j8498j9074L5077K3755O557k3918j0498P3879J5973l8031K4069p8690
9334e2829K2886n7367K3215J8011k9136j8478J6679L6391L1172L364P205k0942
9322a9829n8666L8360K7274j3069j673M9772R018j7509m9011n9812Q405L5172
9310e1568O3038j750n9782j0113K6802m5040j9325O7980L0000p1696K7864K9979
9298a3611L9948k8915l9725K6937n878L1103J862N1505Q3511j20790l0496M4312
9286C9763j8478k0980m0935o7560m959n5142L5627K3947L7102L6366O5051k7876
$$ plain form
9274 1926 6181 -24857 3956 -89820 -174240 -196142 -204668 -157191 -125946 -91943 -54030 -36235
9262 -36235 -80560 -135049 -121312 -117056 -120185 -101016 -149597 -238082 -193929 -121008 -46703 3501
9250 3501 -57364 -89587 -47176 32292 126707 111614 -1623 43179 26382 -9386 4196 -1956
9238 -1956 21978 67955 68667 13539 -24430 26590 30172 56287 -4298 -12788 -8832 26716 36267
9225 36267 60387 38090 82169 13373 74245 30926 -23870 -37332 -20151 29610 -50624 -81981
9213 -81981 -104123 -118072 -32994 14599 38989 86484 85041 38409 42814 86644 64165 21378
9201 21378 -29718 -56302 -54659 33599 49052 982 -10522 -15691 25105 97409 44659 -36988
9189 -36988 -81719 -166051 -171589 -152389 -199601 -152529 -99552 -116779 -60253 1848 -23357 -98384
$$ packed form
9274A926M255l1038K8813r3776q4420k1902q526M7477L1245L4003L7913J7795
9262c6235m4325n4489J3737M256l129J9169m8581q8485M4153P2921P4305N0204
9250C501o0865l2223M2411P9468R4415j5093j13237M4802j6797l5768J3582o152
9238a956K3934M5977P12n5128l7969N1020L582K6115o0585q490L956L5548R551
9225C6267K4120k2297M4079o8796O0872m3319n4796j3462J7181M9761q0234l1357
9213h1981k2142j3949Q5078M7593K4390M7495j443m6632M405M3830k2479m2787
9201B1378n1096k6584J643Q8258J5453m8070j1504n169M0796P2304n2750q1647
9189c6988m4731q4332n538J9200m7212M7072N2977j7227N6526O2101k5205p5027
$$ plain form
9177 -98384 -125697 -138525 -103233 -67961 -29401 -11249 -33685 -47862 -83943 -48341 -12020 -29011
9165 -29011 12467 3025 23249 22753 56792 34728 2418 -3018 -19978 -42368 -138731 -144266 -109225
9152 -109225 -47920 -32894 -73150 -98848 -28488 -1769 -34275 -41654 82749 62070 18236 25411
9140 25411 33575 27373 -24491 8707 103247 95131 82784 102741 74877 20275 -4468 42745
9128 42745 99663 19688 -62811 -2558 9751 -14214 39960 48834 79224 97662 83605 39480
9116 39480 51865 13682 -18560 -22481 -16649 -52334 -92728 -119473 -136629 -120604 -33982 -17031
9104 -17031 19150 -14600 -91201 -62134 -50491 -82640 -124130 -116028 -25092 26788 36149 47452
9092 47452 -5918 3318 -14620 -4768 -16516 59492 56357 69227 98519 36695 -38511 -40997 -28057
$$ packed form
9177i8384k7313j2828L5292L5272L8560J8152k2436j4177l6081L5602L6321j6991
9165b9011M1478r442K0224m96L4039k2064l2310n436j6960k2390r6363n535L5041
9152a09225O1305J5026m0256k5698P0360K6719l2506p379J24403k0679m3834P175
9140B5411Q164o202n1864L3198R4540q116j2347J9957k7864n4602k4743M7213
9128D2745N6918p9975q2499O0253J2309k3965N4174Q874L0390J8438j4057m4125
9116C9480J2385l8183l2242l921N832l5685m0394k6745j7156J6025Q6622J6951
9104a7031L6181l3750p6601K9067J1643l2149m1490Q102R0936N1880R361J1303
9092D7452n3370R236j7938R852j1748P6008l135J2870K9292o1824p5206k486J2940
$$ plain form
9079 -28057 -67201 -101117 -92187 -13322 -13878 -3808 34008 17934 -15671 61331 46277 -44291
9067 -44291 -57804 -14776 -81789 -134430 -127075 -120664 -118200 -91699 -52291 -20566 -49340 -8770
9055 -8770 -9415 -26870 -67666 -72219 -5923 -72625 -73356 -86479 -84863 -57418 -76975 -25325 27054
9042 27054 -28920 -39701 28788 36719 -18656 3470 107551 70354 20014 37843 81261 30949
9030 30949 -65323 -129140 -171672 -153568 -78555 -53638 18094 -2082 -107977 -169829 -102193 -66304
9018 -66304 -131025 -105598 -119342 -72767 23676 -6876 -36870 -18964 -22768 -73060 -157914 -115626
9006 -115626 -37052 -12115 -63372 -64808 -14386 -64627 -90921 -24695 78477 55554 51436 -72427
8994 -72427 -60806 -18383 9234 34140 77875 64684 -92354 -51686 -15751 -11798 -66424 -58171
$$ packed form
9079b8057l9144l3916Q930P8865n56J0070L7816j6074l3605P7002j5054r0568
9067d4291j3513M3028o7013n2641P355O411K464K6501L9408L1725k8774M0570
9055h770o45j7455m0796m553O6296o6702p31j3123J616K7445j9557N1650N2379
9042B7054n5974j0781O8489P931n5375K2126J04081l7197n0340J7829M3418n0312
9030C0949r6272o3817m2532J8104P5013K4917P1732k0176j05895o1852O7636L5889
9018f6304o4721K5427j3744M6575R6443l0552k9994J7906l804n0292q4854M2288
9006a15626P8574K4937n1257j436N0422n0241k6294O6226J03172k2923m118j23863
8994g2427J1621M2423K7617K4906M3735j3191j57038M0668L5935L953n4626Q253
$$ plain form
8982 -58171 -122425 -153404 -161176 -81601 -66987 -107982 -79410 -79558 -115970 -130507 -72647 28548
8970 28548 50978 -36218 -76412 -22431 -4532 -51558 -28883 -30691 24074 -11868 -65666 -16224
8958 -16224 29919 31799 6565 -28566 -58271 -35914 -37820 -71447 -78677 -75688 -128275 -144882 -110275
8945 -110275 -77426 -34490 -90512 -74372 3198 -2501 47317 117803 97668 56430 -6740 -2176
8933 -2176 39337 -24952 -45764 -103996 -178852 -166053 -108943 -90902 -145639 -126470 -44000 39020
8921 39020 44368 9504 -10815 -30229 -22873 -37759 -10947 -50365 27886 44703 -8227 -52232
8909 -52232 40388 81750 26327 9507 -3915 13556 43168 1565 75993 167674 124060 66038
8897 66038 91519 102370 97883 72837 72791 67506 -33116 -17260 -8209 -44842 3350 101717 108068
$$ packed form
8982e8171o4254l0979p772P9575J4614m0995K8572j48l6412j4537N7860J01195
8970B8548K2430q7196m0194N3981J7899m7026K2675j808N4765l5942n3798M9442
8958a6224M6143J880k5234l5131k9705K2357j906l3627p230K989n2587j6607L4607
8945a10275L2849M2936n6022J6140P7570n699M9818P0486k0135m1238o3170M564
8933b176M1513o4289k0812n8232p4856J2799N7110J8041n4737J9169Q2470Q3020
8921C9020N348l4864k0319j9414P356j4886K6812l9418P8251J6817n2930m4005
8909e2232R2620M1362n5423j6820j3422J7471K9612m1603P4428R1681m3614n8022
8897F6038K5481J0851m487k5046m6n285j00622J5856R051l6633M8192R8367O351
$$ plain form
8884 108068 86928 67571 96422 160757 50233 29647 21500 69530 141941 168258 123441 131207
8872 131207 161304 202762 207123 143373 68878 79305 84139 76443 48146 68231 42821 58787
8860 58787 87790 98902 -16753 -55894 64906 189139 196991 107812 38840 -10255 -38368
8849 -38368 16720 55933 52538 82231 91891 81195 115726 133445 196447 164984 57098 -36876
8837 -36876 -101934 -58670 -45798 -30609 -48808 -41215 3017 22016 88986 76572 -19288 81815
8825 81815 85805 52969 104831 225000 255519 155688 80705 -47367 -42957 -13086 -116 59517
8813 59517 83743 89935 112716 134841 191348 183889 123167 76970 7197 29631 63781 35494
8801 35494 18541 64089 93760 127062 104530 92023 184735 254703 191948 162084 145842 147413
$$ packed form
8884A08068k1140j9357K8851O4335j10524k0586q147M8030P2411K6317m4817P766
8872A31207L0097M1458M361o3750p4495J0427M834p696k8297K0085k5410J5966
8860E8787K9003J1112j15655l9141J20800J24233P852q9179o8972m9095k8113
8849c8368N5088L9213l395K9693R660j0696L4531J7719O3002l1463j07886r3974
8837c6876o5058M3264J2872J5189j8199P593M4232J8999O6970j2414r5860J01103
8825H1815L990l2836N1862J20169L0519r9831p4983j28072M410K9871J2970N9633
8813E9517K4226O192K2781K2125N6507p459o0722m6197o9773K2434L4150k8287
8801C5494j6953M5548K9671L3302k2532j2507R2712O9968o2755k9864j6242J571
$$ plain form
8789 147413 50196 -25647 8331 61374 26555 46640 46234 51133 -17127 -68832 13014 63497
8777 63497 120598 86027 39821 25576 38002 106043 143315 82686 34611 41089 121660 138853
8765 138853 38631 -14324 -7181 -57081 -39544 -17763 -79647 -100119 -64806 -41392 -36083 2394
8753 2394 41013 13397 -1983 36172 81903 25439 26695 32369 32470 82294 39711 8730 33313
8740 33313 36785 46373 37306 6085 -20488 -29135 -41167 -60823 -97824 -29171 38374 28266 66870
8727 66870 129920 128444 115486 128433 120286 189209 137725 53896 80003 93885 61774 65643
8715 65643 39036 -58 -50945 -71192 -44465 -31197 -34113 17167 12765 79459 73628 47811
8703 47811 68561 62818 22473 -20426 -54544 -6514 106556 146555 141230 116194 71881 69669
$$ packed form
8789A47413r7217p5843L3978N3043l4819K0085m06M899o8260n1705Q1846N0483
8777F3497N7101l4571m6206j4245J2426O8041L7272o0629m8075O478Q0571J7193
8765A38853j00222n2955P143m9900J7537K1781o1884k0472L5313K3414N309L8477
8753B394L8619k7616j5380L8155M5731n6464J256N674J01M9824m2583l0981K4583
8740C3313L472R588r067l1221k6573q647j2032j9656l7001O8653O7545j0108L8604
8727F6870O3050j476j2958J2947q147O8923n1484q3829K6107J3882l2111L869
8715F5643k6607l9094n0887k0247K6727J3268k916N1280m402O6694n831k5817
8703D7811K0750n743m0345m2899l4118M8030J13070L9999n325k5036m4313k212
$$ plain form
8691 69669 44621 63398 78455 68244 29430 -43794 -66447 -33701 -25703 -31140 -80898 -62580
8679 -62580 7647 148402 215805 267655 224113 162123 170043 165757 182816 126690 105295 143690
8667 143690 110719 1480 11690 44445 53009 119139 151594 135159 135386 163612 191833 166685
8655 166685 99048 150034 183921 216556 172906 145628 85552 43083 13366 82138 159926 180918
8643 180918 204056 193317 189422 140918 110187 171236 247791 199284 130967 135712 133253 76680
8631 76680 80536 37927 14960 -15155 -7415 32754 66979 42356 92277 182591 132883 92635
8619 92635 67789 -18665 -25076 44819 36258 90691 79719 26887 17688 96324 85846 114817
8607 114817 215919 144890 57479 -2834 -88010 -116461 -73801 -2844 39203 67623 95412
$$ packed form
8691F9669k5048J8777J5057j0211l8814p3224k2653L2746P998n437m9758J8318
8679f2580P0227J40755O7403N1850m3542o1990P920m286J7059n6126k1395L8395
8667A43690l2971j09239J0210L2755Q564O6130L2455j6435K27K8226K8221k5148
8655A66685o7637N0986L3887L2635m3650k7278o0076m2469k9717O8772P7788K0992
8643A80918K3138j0739l895m8504l0731O1049P6555m8507o8317M745k459n6573
8631G6680L856m2609k2967l0115P740M0169L4225k4623M9921R0314m9708m0248
8619I2635k4846q6454o411O9895q561N4433j0972n2832r199P8636j0478K8971
8607A14817J01102p1029q7411o0313q5176k8451M2660P0957M2047K8420K7789
$$ plain form
8596 95412 104770 59653 91996 102641 112169 118725 149168 134399 90528 36111 -43303 -38982 -37926
8583 -37926 8048 72308 96558 68492 62604 33378 22012 35856 37637 46792 110871 105180 -1813
8570 -1813 -36162 -49555 -43629 5471 7256 53411 95761 122477 92060 11986 -74756 -37503
8558 -37503 30310 63411 79431 55845 95593 29083 48913 115137 126207 85314 41543 50525
8546 50525 51098 68023 47125 -23944 -47430 -66866 -50182 -39752 -51948 8282 34084 -5502
8534 -5502 -6208 -24600 -39868 5203 210264 294462 205442 109621 -16802 -103671 -67119 82038
8522 82038 130832 86620 -32379 -67408 29714 81154 -18680 13136 26742 8197 53082 77535
8510 77535 101196 85797 2341 -43515 16258 107939 138492 133863 125656 223848 328865 419557
$$ packed form
8596I5412R358m5117L2343J0645R528O556L0443j4769m3871n4417p9414M321J056
8583c7926M5974O4260K4250k8066n888k9226j1366J3844J781R155O4079n691j06993
8570a813l4349j3393N926M9100J785M6155M2350K6716l0417q0074q6742L7253
8558c7503O7813L3101J6020k3586L9748o6510J9830O6224J1070m0893m3771Q982
8546E0525N73J6925k0898p1069k3486j9436J6684J0430j2196O0230K5802l9586
8534e502p06j8392j5268M5071K05061Q4198q9020r5821j26423q6869L6552J49157
8522H2038M8794m4212j18999l5029R7122N1440r9834L1816J3606j8545M4885K4453
8510G7535K3661j5399q3456m5856N9773R1681L0553m629q207R8192J05017R0692
$$ plain form
8498 419557 375369 218319 119377 112391 92829 39707 39590 87629 120781 103635 117098 192949
8486 192949 360028 539290 612916 487554 290031 139611 64993 41346 93658 117360 34482
8475 34482 8209 29329 52095 29136 86296 29315 711 36583 65970 40313 -9425 -38144
8463 -38144 -66843 -24504 90294 171852 174673 263844 442350 663827 831955 830339 673092
8452 673092 384233 291155 238517 161230 112143 27404 67902 95014 66787 109307 174481
8441 174481 312665 341970 302695 278040 225811 162366 129593 102703 79124 79523 95167 72298
8429 72298 80904 64960 72162 91779 129953 158311 70209 83994 152155 182688 208820 250946
8417 250946 264974 224902 223895 248890 348143 448838 499208 505121 490196 378452 210252
$$ packed form
8498D19557m4188j57050r8942o986j9562n3122j17M8039L3152j7146J3463P5851
8486A92949J67079J79262P3626j25362j97523j50420p4618k3647N2312K3702q2878
8475C4482k6273K1120K2766k2959N7160n6981k8604L5872K9387k5657m9738k8719
8463c8144k8699M2339J14798Q1558K821Q9171J78506K21477J68128j616j57247
8452F73092k88859r3078n2638p7287m9087q4739M0498K7112k8227M2520O5174
8441A74481J38184K9305l9275k4655n2229o3445l2773k6890k3579L99J5644k2869
8429G2298Q606j5944P202J9617L8174K8358q8102J3785O8161L0533K6132M2126
8417B50946J4028m0072j007K4995R9253J00695N0370N913j4925j11744j68200
$$ plain form
8406 210252 91868 63538 -9743 -8212 -5054 26906 79067 63221 890 -23934 -15087 -68656
8394 -68656 -88552 -101846 -123882 -129075 -68832 -36492 32315 116269 76734 124579 128209 139236
8382 139236 136739 98116 95252 99704 32356 -21616 42625 105604 126859 109328 56432 5345
8370 5345 -22985 -21363 -58204 -6055 -35754 -142337 -204736 -184353 -173098 -139181 -85424 -29536
8358 -29536 39054 61952 15820 1329 43322 29480 54911 59508 39445 46384 79756 183465
8346 183465 218792 104954 118034 150544 157038 209005 136408 168886 167066 113438 39188 -12945
8334 -12945 -39982 3062 -1592 -89527 -75726 20709 20404 -19699 25155 47869 -2321 -24822
8322 -24822 -35449 -27945 1074 4972 69310 101971 103408 96555 193206 157987 87024 32267 78306
$$ packed form
8406B10252j18384k8330p3281J531L158L1960N2161j5846o2331k4824Q847n3569
8394f8656j9896j3294k2036n193O0243L2340O8807Q3954l9535M7845L630J1027
8382A39236k497l8623k864M452o7348n3972O4241O2979K1255j7531n2896n1087
8370E345k8330J622l6841N2149k9699j06583o2399K0383J1255L3917N3757N5888
8358b9536O8590K2898m6132j4491M1993j3842K5431M597k0063O939L3372J03709
8346A83465L5327j13838J3080L2510O494N1967p2597L2478j820n3628p4250n2133
8334a2945k7037M3044m654q7935J3801R6435l05m0103M4854K2714n0190k2501
8322b4822j0627P504K9019L898O4338L2661J437o853R6651l5219p0963n4757M6039
$$ plain form
8309 78306 170714 201284 274761 360584 368669 407422 433282 464494 501381 413367 304523 280334
8297 280334 253272 117476 122825 179824 155132 150487 6171 -58008 -37826 -19138 6518 1916
8285 1916 -27801 -18739 -66205 -94843 -89729 -38531 15664 78204 88325 43581 56816 45866
8273 45866 38980 49355 7955 77669 90121 23377 -796 -80721 -45561 -43324 -10593 5832
8261 5832 81579 155939 85066 60738 56341 24686 -11103 -38737 -35516 -60841 -78507 -27588
8249 -27588 -12326 -15269 -54136 -79976 15117 415 -99269 -143872 -81028 -24564 65054 66278
8237 66278 42176 39306 28328 6868 5051 -34842 -16697 32474 10760 -99081 -98776 -68273
8225 -68273 -64100 35818 92184 -4940 -57044 -25119 34880 48834 -18745 -117395 -170642 -166294
$$ packed form
8309G8306R2408L0570P3477Q5823Q085L8753K5860L1212L6887q8014j08844k4189
8297B80334k7062j35796N349N6999k4692m645j44316o4179K0182J8688K5656m602
8285A916k9717R062m7466k8638N114N1198N4195O2540J0121m4744J3235j0950
8273D5866o886J0375m1400O9714J2452o6744k4173p9925L5160K237L2731J6425
8261E832P5747P4360p0873k4328m397l1655l5789k7634L221k5325j7666N0919
8249b7588J5262k943l8867k5840R5093j4702r9684m4603O2844N6464Q9618J224
8237F6278k4102k870j0978k1460j817l9893J8145M9171k1714j09841L05L0503
8225f8273M173R9918N6366r7124n2104L1925N9999J3954o7579r8650n3247M348
$$ plain form
8213 -166294 -60718 -18214 -14983 -56266 706 103029 141289 49566 -53169 -140616 -158561
8202 -158561 -129844 -96474 -65441 -17801 29875 99817 -3679 -84058 -73748 -68731 -63842 -69883
8190 -69883 -7726 -22454 -84057 -104276 -77947 -132819 -164691 -102466 -108198 -172045 -231123 -146405
8178 -146405 -39673 22956 57790 37747 14740 -20195 24853 25957 -94396 -122297 -74397
8167 -74397 -1397 10640 -34772 6048 -63222 -69180 5376 -15861 14027 -47198 -34664 -57340
8155 -57340 -87197 -58677 -110404 -87256 -60797 -92714 -79870 -65965 -9963 -6809 -948 1032
8143 1032 -88342 -51443 -21117 -18129 7613 56929 -8842 -18919 26972 9405 -46898 -16398
8131 -16398 -19539 -39010 -11046 -46431 -96029 -119524 -162426 -129971 -115120 -126671 -174211 -170108
$$ packed form
8213a66294J05576M2504L231m1283N6972J02323L8260r1723j02735q7447j7945
8202a58561K8717L3370L1033M7640M7676O9942j03496q0379J0310N017M889o041
8190f9883O2157j4728o1603k0219K6329n4872l1872O2225n732o3847n9078Q4718
8178a46405J06732O2629L4834k0043k3007l4935M5048J104j20353k7901M7900
8167g4397P3000J2037m5412M0820o9270n958P4556k1237K9888o1225J2534k2676
8155e7340k9857K8520n1727K3148K6459l1917J2844J3905N6002L154N861J980
8143A032q9374L6899L0326K988K5742M9316o5771j0077M5891j7567n6303L0500
8131a6398l141j9471K7964l5385m9598k3495m2902L2455J4851j1551m7540M103
$$ plain form
8119 -170108 -137742 -119265 -126798 -63089 -60128 -98604 -130747 -105004 -89615 -32765 -4977 -69137
8107 -69137 -53469 -66112 -88145 -15336 60425 18582 -23337 -13977 54003 135123 50548 18538
8095 18538 77265 143302 120035 6495 -6443 -52651 -20468 11284 -9690 16153 14557 24053
8083 24053 -11124 -71497 -20180 -13456 -10033 17922 -13171 -13459 19424 63307 67883 45169 -49014
8070 -49014 -71941 -24067 28410 98498 58265 1242 -26512 -9684 28836 -2371 -46781 35489
8058 35489 32283 -1485 -30553 -74953 -57529 -31781 -26384 -61427 -69876 7759 57825 -1825
8046 -1825 -24783 -35953 -12072 -37244 -61249 -39202 -8051 27231 16508 30126 42891 23817
8034 23817 -38440 -77997 -86005 -27267 660 17559 20677 -4467 -82327 -108563 -147784 -119578
$$ packed form
8119a70108L2366J8477p533O3709K961l8476l2143K5743J5389N6850K7788o4160
8107f9137J5668j2643k2033P2809P5761m1843m1919R360O7980Q1120q4575l2010
8095A8538N8727O6037k3267j13540j2938m6208L2183L1752k0974K5843j596R496
8083B4053l5177o0373N1317O724L423K7955l1093k88L2883M3883M576k2714r4183
8070d9014k2927M7874N2477P0088m0233n7023k7754J6828L8520l1207m4410Q2270
8058C5489l206l3768k9068m4400J7424K5748N397l5043q449P7635N0066n9650
8046a825k2958j1170K3881k5172k4005K2047L1151L5282j0723J3618J2765j9074
8034B3817o2257l9557q008N8738K7927J6899L118k5144p7860k6236l9221K8206
$$ plain form
8022 -119578 -106372 -87922 -36599 -21682 -15827 4555 68394 139322 169068 82085 104793 99858
8010 99858 115846 109077 96482 19484 -22129 50702 35594 -69635 -102998 -91089 -134179 -98096
7998 -98096 -39654 14717 -37485 -30720 35147 66008 163729 180146 130362 207298 198320 118725
7986 118725 113967 76951 118251 167662 117072 20990 46954 46907 54746 109131 234374 189812
7974 189812 138653 76837 46254 65376 29153 13333 44144 20068 3550 33116 26178 71496
7962 71496 76406 59630 84420 104740 84865 75116 126741 106489 102162 122827 119206 146187 148445
7949 148445 146434 136140 121887 156799 186409 108864 76890 37108 -63907 -72772 -88596 -17321
7937 -17321 25362 -60433 -29379 1318 20663 71538 53284 -20091 -57351 4127 61054 19532
$$ packed form
8022a19578J3206J8450N1323J4917N855K0382O3839P0928K9746q6983K2708m935
8010I9858J5988o769j2595p6998m1613P2831j5108j05229l3363J1909m3090L6083
7998i8096N8442N4371n2202O765O5867L0861R7721J6417m9784P6936q978p9595
7986A18725m758l7016M1300M9411n0590r6082K5964m7P839N4385J25243m4562
7974A89812n1159o1816l0583J9122l6223j5820L0811k4076j6518K9566o938M5318
7962G1496M910j6776K4790K0320j9875r749N1625k0252m327K0665l621K6981K258
7949A48445k011j0294j4253L4912K9610p7545l1974l9782j01015q865j5824P1275
7937a7321M2683q5795L1054L0697J9345N0875j8254p3375l7260O1478N6927m1522
$$ plain form
7925 19532 20587 32507 81196 83540 56881 54975 25035 18076 13594 29307 26574 29080 64260
7912 64260 75677 24726 -22851 -40686 -87222 -153900 -93496 -94885 -68840 -27894 39297 -1
7900 -1 29828 31216 626 -27506 -20527 -9564 -11448 -36003 7468 49927 48713 1068 -39683
7887 -39683 -79453 -69897 -98113 -54227 2606 9586 18451 -1372 8549 31352 62304 81867 84626
7874 84626 22793 8548 24295 43410 4999 1899 23671 45937 42292 75923 62145 -60058
7862 -60058 -32361 -6761 -22896 -65818 -13722 10104 769 -51612 -78835 15033 8071 39754
7850 39754 70127 -24076 -86168 -78251 -41980 -45982 -79012 -77500 -21584 -16610 -9655 -25975 101
7837 101 11780 37552 84509 94518 37126 -2331 -33404 -45951 -94094 -151036 -132217 -94790
$$ packed form
7925A9532J055J1920M8689K344k6659j906k9940o959m482J5713k733K506L5180
7912F4260J1417n0951m7577j7835m6536o6678O0404j389K6045M0946O7191l9298
7900aK9829J388l0590k8132O979J0963j884k4555M3471M2459j214m7645m0751
7887c9683l9770R556k8216M3886N6833O980Q865j9823R921K2803L0952J9563K759
7874H4626o1833j4245J5747J9115l8411l100K1772K2266l645L3631j3778j22203
7862f0058K7697K5600j6135m2922N2096K3826r335n2381k7223R3868o962L1683
7850C9754L0373r4203o2092P917L6271m002l3030J512N5916M974O955j6320K6076
7837A01J1679K5772M6957J0009n7392l9457l1073j2547m8143n6942J8819L7427
$$ plain form
7825 -94790 -80561 -52617 -138843 -102537 -95219 -81424 -117563 -173313 -83897 90835 80479 -44201
7813 -44201 -83376 -23634 6809 19478 -15299 -46763 -18766 20203 -27555 -93643 -103675 -38584
7801 -38584 17854 15942 64167 58804 -41078 -105434 -67265 -36203 7820 40762 84441 107874
7789 107874 80647 29210 14745 -41026 -34900 23775 -7340 -9768 63574 104773 148805 72426
7777 72426 40021 2029 -74367 -107043 -117226 -119686 -138201 -110643 -81302 -176154 -176980 11256
7765 11256 35007 57124 29304 -5164 47741 51292 -7617 15357 131612 140892 102614 21468
7753 21468 -48758 -146449 -101296 -72597 -151168 -119874 -145424 -129286 -133602 -85360 -19228 2455
7741 2455 -47393 -54519 -17965 89737 135933 53475 23005 43078 37695 30648 11795 11544 13671
$$ packed form
7825i4790J4229K7944q6226L6306P318J3795l6139n5750Q9416J74732j0356j24680
7813d4201l9175N9742L0443J2669l4777l1464K7997L8969m7758o6088j0032O5091
7801c8584N6438j912M8225n363r9882o4356L8169L1062M4023L2942M3679K3433
7789A07874k7227n1437j4465n5771O126N8675l1115k428P3342M1199M4032p6379
7777G2426l2405l7992p6396l2676j0183k460j8515K7558K9341r4852q26J88236
7765A1256K3751K2117k7820l4468N2905L551n8909K2974J16255R280l8278q1146
7753B1468p0226r7691M5153K8699p8571L1294k5550J6138m316M8242O6132K1683
7741B455m9848p126L6554J07702M6196q2458l0470K0073n383p047j8853k51K127
$$ plain form
7728 13671 -25830 -3306 -1374 6431 32703 23144 27349 83270 89250 5836 -55617 -54644 -49446
7715 -49446 -36159 -77883 -32625 50215 7700 -56625 -46667 -21998 -12460 16326 34726 77388
7703 77388 77842 90976 130276 83329 25968 -37160 -65106 -14848 5992 10978 24259 -200
7691 -200 -30320 3050 6223 -58111 -43102 2734 41571 -39546 -111056 -97518 -100213 -122804 -133076
7678 -133076 -169918 -169759 -149352 -128757 -129467 -89215 -77203 -96742 -17420 47743 49152 8166 56080
7665 56080 9165 -28347 -25777 -17711 -20351 -34988 -91686 -126742 -82883 -24949 32286 125665
7653 125665 117268 33191 -11498 -25809 -39853 -5000 276 1411 2570 40909 -47426 -90595
7641 -90595 -78183 21985 29413 -20932 -26753 14279 3659 17721 -17570 -45792 -76384 -119002
$$ packed form
7728A3671l9501K2524J932P805K6272r559M205N5921N980q3414o1453R73N198
7715d9446J3287m1724M5258Q2840m2515o4325R958K4669R538K8786J8400M2662
7703G7388M54J3134L9300m6947n7361o3128k7946N0258K0840M986J3281k4459
7691b00l0120L3370L173o4334J5009M5836L8837q1117p1510J3538k695k2591j0272
7678a33076l6842J59K0407K0595p10M0252J2012j9539P9322O5163J409m0986M7914
7665E6080m6915l7512K570Q066k640j4637n6698l5056M3859N7934N7235R3379
7653A25665q397q4077m4689j4311j4044L4853N276J135J159L8339q8335m3169
7641i0595J2412J00168P428n0345n821M1032j0620J4062l5291k8222l0592m2618
$$ plain form
7629 -119002 -114220 -145851 -101064 -79094 -128866 -104505 -64868 -66813 -61239 -31115 -17780 -84250
7617 -84250 -80947 -1306 40897 1870 -9557 62924 138586 105327 59162 28231 -6270 -86573
7605 -86573 -78651 -61353 -83431 -86154 -117728 -36575 -29021 -12312 28748 17168 -15490 -31349
7593 -31349 -77311 -44280 -39152 -62529 -8147 156898 150091 42332 -35461 -80254 -29132 2322
7581 2322 52850 44407 47050 -30886 -60246 -96038 -138892 -153232 -80762 -1305 38433 45192 -3020
7568 -3020 -13723 -36377 -24595 -59356 -40449 -56401 -70072 -31644 38315 -40405 -83489 -76951
7556 -76951 -46227 -25736 -56878 -88490 -3395 25758 -35825 1411 23282 32538 -8341 -46706
7544 -46706 -44882 -1204 43908 84166 4687 -49622 -37125 -49693 -18067 -53206 -30087 -42060
$$ packed form
7629a19002M782l1631M4787K1970m9772K4361L9637j945N574L0124J3335o6470
7617h4250L303P9641M2203l9027j1427P2481P5662l3259m6165l0931l4501q0303
7605h6573P922J7298k2078k723l1574Q1153P554J6709M1060j1580l2658j5859
7593c1349m5962L3031N128k3377N4382J65045o807j07759p7793m4793N1122L1454
7581B322N0528q443K643p7936k9360l5792m2854j4340P2470P9457L9738O759m8212
7568c020j0703k2654J1782l4761J8907j5952j3671L8428O9959p8720m3084O538
7556g6951L0724K0491l1142l1612Q5095K9153o1583L7236K1871R256m0879l8365
7544d6706J824M3678M5112M0258p9479n4309J2497j2568L1626l5139K3119j1973
$$ plain form
7532 -42060 -14903 -11430 -45347 -105517 -122275 -139784 -101525 -134398 -98877 26320 29235 90802
7520 90802 139684 95747 36742 36539 51506 34934 -22344 -17866 -8447 -23198 -25361 -62162 -47561
7507 -47561 -7152 -64365 -110362 -117253 -56361 -53011 -42994 22661 80378 15800 -20292 19892
7495 19892 45971 -14279 -64443 -4506 -5610 -53030 -79247 -52345 -3980 -17000 3457 7323
7483 7323 19154 -32679 -104203 -42683 -9214 20760 16718 -45914 -37374 -30843 -62492 -57315 -77787
7470 -77787 -108501 -62652 -25721 -13835 19815 -8801 -7767 51960 72803 49136 -31851 -82784
7458 -82784 -55556 -37899 -48543 -20392 76916 87918 -23172 -118410 -149670 -31420 15869
7447 15869 60336 114334 135173 85992 82241 96386 27775 37756 51942 74541 58470 -9070
$$ packed form
7532d2060K7157L473l3917o0170j6758j7509L8259l2873L5521J25197K915O1567
7520I0802M8882m3937n9005k03J4967j6572n7278M478R419j4751k163l6801J4601
7507d7561M0409n7213m5997o891O0892L350J0017O5655N7717o4578l6092M0184
7495A9892K6079o0250n0164N9937j104m7420k6217K6902M8365j3020K0457L866
7483G323J1831n1833p1524O1520L3469K9974m042o2632Q540O531l1649N177k0472
7470g7787l0714M5849L6931J1886L3650k8616J034N9727K0843k3667q0987n0933
7458h2784K7228J7657j0644K8151R7308J1002j11090r5238l1260J18250M7289
7447A5869M4467N3998K0839m9181l751J4145o8611R981J4186K2599j6071o7540
$$ plain form
7435 -9070 -19309 -43379 -91561 -57389 -5458 -7169 -23352 9586 50787 8472 1760 -12384
7423 -12384 7875 46592 9367 37358 16774 -6943 -44964 -14214 24760 36329 62032 36048
7411 36048 -6795 -2659 -8390 -16189 57755 58667 -9444 15266 48588 38363 -1284 -14998 -48605
7398 -48605 12770 48878 11364 57788 108193 124104 89157 27653 -4400 -27321 -86337 -62218
7386 -62218 -98837 -66622 31491 -29369 -51288 -37770 -69919 -77319 -48542 -19941 41115 31625
7374 31625 37909 13470 -18715 57113 -10556 -94023 -97472 -31298 -2403 35280 -13369 -28471
7362 -28471 16664 48902 23083 -28100 -82833 -47891 -10316 -12174 -23972 5007 7217 -42207
7350 -42207 -76855 -80003 -18298 -28768 -33322 -67869 -87994 -35012 -11915 -4129 -9593 -38785 -45464
$$ packed form
7435i070j0239k4070m8182L4172N1931j711j6183L2938M1201m2315o712j4144
7423a2384K0259L8717l7225K7991k0584k3717l8021L0750L8974J1569K5703k5984
7411C6048m2843M136n731p799P3944R12o8111K4710L3322j0225l9647j3714l3607
7398d8605O1375L6108l7514M6424N0405J5911l4947o1504l2053k2921n9016K4119
7386f2218l6619L2215R8113o0860k1919J3518l2149p400K8777K8601O1056r490
7374C1625O284k4439l2185P5828o7669q3467l449O6174K8895L7683m8649j5102
7362b8471M5135L2238k5819n1183n4733L4942L7575j858j1798K8979K210m9424
7350d2207l4648l148O1705j0470m554l4547k0125N2982K3097P786n464k9192o679
$$ plain form
7337 -45464 -21947 127 -39822 -75005 -171735 -184268 -99875 7200 41493 -11589 9325 -10082
7325 -10082 8436 45472 83805 78548 74257 61571 41224 45294 96616 152188 107284 75826
7313 75826 39183 -22372 -69634 -20132 -3245 -6143 -50860 -27765 -40916 -40481 -52837 -28059
7301 -28059 -19462 -100958 -143651 -99909 -41821 -18334 -38932 -18756 65348 54077 3529 -51355
7289 -51355 -9771 59443 26664 -28848 -89297 -110439 -135870 -110463 -14666 -5192 30922 93759
7277 93759 83071 81083 37788 -33210 -65394 -57584 -19486 -1523 71987 107620 131588 103712
7265 103712 47174 38385 71703 70087 920 28959 97340 99009 6922 20314 7014 -16613
7253 -16613 -55201 -32621 -59499 -115953 -141414 -54480 -11981 -23837 -79981 -19721 -11284 -24784
$$ packed form
7337d5464K3517K2074l9949l5183r6730j2533Q4393J07075L4293n3082K0914j9407
7325a0082J8518L7036L8333n257m291j2686k0347M070N1322N5572m4904l1458
7313G5826l6643o1555m7262M9502J6887k898m4717K3095j3151M35j2356K4778
7301b8059Q597q1496m2693M3742N8088K3487k0598K0176Q4104j1271n0548n4884
7289e1355M1584O9214l2779n5512o0449k1142k5431K5407R5797R474L6114O2837
7277I3759j0688j988m3295p0998l2184P810L8098J7963P3510L5633K3968k7876
7265A03712n6538q789L3318j616o9167K8039O8381J669r2087J3392j3300k3627
7253a6613l8588K2580k6878n6454k5461Q6934M2499j1856n6144O0260Q437j3500
$$ plain form
7241 -24784 -64531 -69058 -25980 14366 66358 31346 -23968 -52388 -82881 -89656 -60810 -115139
7229 -115139 -103822 -109218 -118127 -57638 -60576 -112389 -58643 -19454 -60004 -128194 -126100 -122680 -130934
7216 -130934 -100323 -42375 42400 73266 46168 70998 59097 18427 703 28638 12435 -1642
7204 -1642 39722 44574 3353 -39246 -44200 -40516 -28565 -48632 10256 71988 97171 102445 164276
7191 164276 115206 22935 -8570 6497 11561 -13848 30511 77815 21254 -43249 -72833 -120131
7179 -120131 -125003 -156750 -166870 -135853 -170555 -163434 -125250 -53158 12954 -37897 -54199 -6242
7167 -6242 64861 41827 3416 55651 68206 39886 -13705 21685 46003 68621 35312 -65357
7155 -65357 -39956 -9140 20386 -31529 -54087 781 -10774 -60563 -16548 -27373 -30679 19847
$$ packed form
7241b4784l9747m527M3078M0346N1992l5012n5314k8420l0493o775K8846n4329
7229a15139J1317n396q909O0489k938n1813N3746L9189m0550o8190K094L420q254
7216a30934L0611N7948Q4775L0866k7098K4830j1901m0670j7724K7935j6203j4077
7204a642M1364M852m1221m2599m954L684J1951k0067N8888O1732K5183N274O1831
7191A64276m9070r2271l1505J5067N064k5409M4359M7304n6561o4503k9584m7298
7179a20131m872l1747j0120L1017l4702P121L8184P2092O6112n0851j6302M7957
7167f242P1103k3034l8411N2235J2555k8320n3591L5390K4318K2618l3309j00669
7155f5357K5401L0816K9526n1915k2558N4868j1555m9789M4015j0825l306N0526
$$ plain form
7143 19847 21635 10259 -4157 -46330 -95796 -124381 -110296 -91650 -51380 -48049 -63470 -65168
7131 -65168 14913 51606 52707 53798 35533 14891 -102734 -130781 -76934 -17067 -24951 -30393
7119 -30393 -12293 65640 146119 180719 57896 1998 69306 86892 33006 -4219 18466 57994
7107 57994 72559 137032 148668 150455 91503 72968 100199 88588 -37088 -47943 -21347 20628
7095 20628 43852 18463 -9532 10718 -20691 -89671 -74129 58506 44835 36022 83501 95063
7083 95063 146175 110418 69595 19801 87340 124767 98800 60587 52593 18158 147 -5813
7071 -5813 46168 77333 77840 73872 64873 12839 -29660 -82685 -38474 7467 59657 39644 51229
7058 51229 59620 69837 47283 -11740 776 -50510 -37909 -12779 -27673 -36138 -81705 -109886
$$ packed form
7143A9847J788j1376j4416m2173m9466k8585J4085J8646M0270L331j5421j698
7131f5168Q0081L6693J101J091j8265k0642j17625k8047N3847N9867p884n442
7119c0393J8100P7933Q0479L4600j22823n5898O7308J7586n3886l7225K2685L9528
7107E7994J4565O4473J1636J787n8952j8535K7231j1611j25676j0855K6596M1975
7095B0628K3224k5389k7995K0250l1409o8980J5542J32635j3671q813M7479J1562
7083I5063N1112l5757m0823m9794O7539L7427k5967l8213p994l4435j8011n960
7071e813N1981L1165N07l968q999n2034m2499n3025M4211M5941N2190k0013J1585
7058E1229Q391J0217k2554n9023J2516n1286J2601K5130j4894q465m5567k8181
$$ plain form
7046 -109886 -90121 -28382 -31228 -65762 -97030 -93373 79139 91139 99980 135296 102625 -23641
7034 -23641 -108304 -157708 -114581 -2074 72086 60009 4107 -30342 19728 1379 -38709 -87233
7022 -87233 -81885 -84907 -82940 -16884 -32454 -32679 -11194 -38289 -55229 -19425 -23819 -24198 24397
7009 24397 95485 10349 -165249 -153235 -50754 18671 68537 87216 67697 98112 166588
6998 166588 142928 150733 136929 80599 51088 -689 -82451 -96748 11924 10819 -16493 -2683
6986 -2683 10297 36499 5315 -8270 -22949 56899 76305 -6314 -52818 -40376 -3148 -1343
6974 -1343 -47271 -84717 -103305 -106455 -50048 -6004 -63862 -54198 -184 43867 135353 138753 67438
6961 67438 1387 -47063 -61341 3952 44470 61964 26139 -98665 -53508 96505 55566
$$ packed form
7046a09886J9765O1739k846l4534l1268L657J72512J2000Q841L5316l2671j26266
7034b3641q4663m9404M3127J12507P4160j2077n5902l4449N0070j8349m0088m8524
7022h7233N348l022J967O6056j5570k25K1485k7095j6940L5804m394l79M8595
7009B4397P1088q5136j75598J2014J02481O9425M9866J8679j9519L0415O8476
6998A66588k3660P805j3804n6330k9511n1777q1762j4297J08672j105k7312J3810
6986b683J2980K6202l1184j3585j4679P9848J9406q2619m6504J2442L7228J805
6974a343m5928l7446j8588l150N6407M4044n7858R664N4014M4051R1486L400p1315
6961F7438o6051m8450j4278O5293M0518J7494l5825j24804M5157J50013m0939
$$ plain form
6950 55566 -48842 10694 -251 -62844 -30486 47918 26437 -11594 56215 50185 33592 89766
6938 89766 63549 36504 21868 32182 36731 60061 105766 58851 4548 -18984 11436 -5431
6926 -5431 -73697 -69605 -57539 -86341 -117168 -35475 -76129 -70868 -120490 -114522 -108715 -86587 -56992
6913 -56992 -80420 -88815 -92300 -103864 -72929 -20733 8279 -455 -51886 -41323 -12597 54346
6901 54346 103113 102051 28868 -34741 34929 96937 57635 46666 949 43415 101158 33569
6889 33569 -1155 -10582 -15676 -4165 11967 31775 -1285 -8673 -26159 -19437 -22505 5606 32854
6876 32854 32855 85418 41314 10753 56873 51850 -9163 36294 53094 79674 128163 137786 14554
6863 14554 -58795 -120799 -127142 -93580 -96501 -71405 45990 56241 28917 -96498 -147818 -148384
$$ packed form
6950E5566j04408N9536j0945o2593L2358P8404k1481l8031O7809o030j6593N6174
6938H9766k6217k7045j4636J0314M549K3330M5705m6915n4303k3532L0420j6867
6926e431o8266M092J2066k8802l0827Q1693m0654N261m9622N968N807K2128K9595
6913e6992k3428q395l485j1564L0935N2196K9012q734n1431J0563K8726O6943
6901E4346M8767j062p3183o3609O9670O2008l9302j0969m5717M2466N7743o7589
6889C3569l4724r427n094J1511J6132J9808l3060p388j7486O722l068K8111K7248
6876C2854JN2563m4104l0561M6120n023o1013M5457J6800K6580M8489R623j23232
6863A4554p3349o2004o343L3562k921K5096J17395J0251k7324j25415n1320n66
$$ plain form
6851 -148384 -159690 -54417 -77997 -65245 -48451 4919 78689 76978 -20092 -84245 -86828 -20683
6839 -20683 148 48118 41512 -24641 -77090 -117553 -59785 -64383 -57426 33055 47244 -20165
6827 -20165 -95189 -118051 -34000 -45912 -51460 34547 69864 95513 63003 16051 -39703 -21169
6815 -21169 5317 -20336 -18303 -4294 -13163 -23832 -10435 -3379 -43488 -49188 14469 37834 854
6802 854 -46969 -6100 18352 4902 37089 117341 143722 83031 -6174 -16981 -13317 -28269
6790 -28269 19964 16223 -2828 12927 24316 14196 27534 48313 -58 25957 36709 -37673
6778 -37673 -2543 17478 -16567 -66427 -69811 -102788 -106858 -31771 1813 -2875 22239 5844
6766 5844 -50630 -64813 -70590 -27909 -19941 -140526 -163277 -101495 -45067 -21018 28092 61038
$$ packed form
6851a48384j1306J05273k3580J2752J6794N3370P3770j711r7070o4153k583O6145
6839b0683K0831M7970o606o6153n2449m0463N7768m598O957R0481J4189o7409
6827b0165p5024k2862Q4051j1912n548Q6007L5317K5649l2510m6952n5754J8534
6815b1169K6486k5653K033J4009q869j0669J3397P056m0109n700O3657K3365l6980
6802H54m7823M0869K4452j3450L2187Q0252K6381o0691q9205j0807L664j4952
6790b8269M8233l741j9051J5755J1389j0120J3338K0779m8371K6015J0752p4382
6778c7673L5130K0021l4045m9860l384l2977m070P5087L3584m688K5114j6395
6766E844n6474j4183n777M2681P968j20585k2751O1782N6428K4049M9110L2946
$$ plain form
6754 61038 70077 34681 -565 18994 9926 -16230 -32258 -29679 72807 78691 -20069 -74273
6742 -74273 -119535 -108381 -41180 29714 -17656 -92124 -69958 -42259 -11105 4679 42623 -15545
6730 -15545 -25453 9661 103160 127742 134865 83876 116243 176049 125740 76934 46730 59428
6718 59428 25464 17522 -23239 -31786 -41199 31135 71790 107098 63716 18341 -41372 18474
6706 18474 51188 29172 27569 40694 64340 76755 52715 -24389 -43144 -74127 -51835 -63105
6694 -63105 -52110 -120727 -22133 70653 126637 69533 84882 132612 140352 156622 136892 10909
6682 10909 -36408 6742 10006 -29332 -83018 -56203 -26527 -4065 37483 78166 44618 24790
6670 24790 -53027 -17094 27326 82673 76811 80660 53391 62478 9002 46508 59125 38928
$$ packed form
6754F1038R039l5396l5246J9559r068k6156j6028K579J02486N884r8760n4204
6742g4273m5262J1154O7201P0894m7370p4468K2166K7699L1154J5784L7944n8168
6730a5545r908L5114R3499K4582P123n0989L2367N9806n0309m8806l0204J2698
6718E9428l3964p942m0761q547r413P2334M0655L5308m3382m5375n9713N9846
6706A8474L2714k2016j603J3125K3646J2415k4040p7104j8755l0983K2292j1270
6694f3105J0995o8617R8594R2786N5984n7104J5349M7730P740J6270j9730j25983
6682A0909m7317M3150L264l9338n3686K6815K9676K2462M1548M0683l3548j9828
6670B4790p7817L5933M4420N5347n862L849k7269R087n3476L7506J2617k0197
$$ plain form
6658 38928 34470 68433 -10691 -30356 -67977 -40656 9381 -3571 34310 66547 50765 73232
6646 73232 25878 29474 10271 -42080 30302 65999 37674 -6028 -77817 -57535 -12839 -65840
6634 -65840 -69039 -84128 -80314 -81332 -103577 -113670 -93813 -89625 -77219 -97045 -65017 -59325 -53606
6621 -53606 -64828 -117008 -70201 -55483 -35397 -50943 -63994 -599 60480 118036 29326 38639
6609 38639 97609 140006 140804 140462 129387 92380 109553 103879 90915 14051 -44552 26648 14229
6596 14229 26405 85943 81428 71706 38988 72959 121414 85439 27068 -13990 -48166 -18965
6584 -18965 -11787 -75906 -66952 8440 14012 -70627 -116186 -75749 -15888 9707 20074 4606
6572 4606 68366 110233 126359 72174 45667 33147 -4242 35210 -4141 -32073 -4428 -24309
$$ packed form
6658C8928m458L3963p9124j9665l7621K7321N0037j2952L7881L2237j5782K2467
6646G3232m7354L596j9203n2351P2382L5697k8325m3702p1789K0282M4696n3001
6634f5840l199j5089L814j018k2245j0093J9857M188J2406j9826L2028N692N719
6621e3606j1222n2180M6807J4718K0086j5546j3051O3395O1079N7556q8710R313
6609C8639N8970M2397P98l42j1075l7007J7173n674j2964p6864n8603P1200j2419
6596A4229J2176N9538m515r722l2718L3971M8455l5975n8371m1058l4176K9201
6584a8965P178o4119Q954P5392N572q4639m5559M0437N9861K5595J0367j5468
6572D606O3760M1867J6126n4185k6507j2520l7389L9452l9351k7932K7645j9881
$$ plain form
6560 -24309 -40618 41141 49008 47598 28365 -42106 -53502 -20365 4449 16482 -60548 -101370
6548 -101370 -79421 -104592 -133350 -103909 -54770 -25776 58471 83557 87881 86345 48629 40650
6536 40650 19231 4746 -65727 -37933 73757 145800 153327 88581 22075 23245 52182 58839
6524 58839 66179 67658 29973 99921 140528 87922 42225 60029 -2116 55658 79360 69467
6512 69467 22036 -60719 -75782 -82518 -26525 21457 19560 16075 -5637 48145 92074 32359
6500 32359 -61379 -31577 -46405 -13208 22022 29102 81521 30353 -1713 -27105 -30040 -5318
6488 -5318 9480 -20952 -51897 -54809 -11532 -32741 737 6251 -28474 -106050 -97845 -16315 37980
6475 37980 8941 -25491 8222 8505 25607 -37524 -82694 -134120 -168196 -59526 -61426 43204
$$ packed form
6560b4309j6309Q1759P867j410j9233p0471j1396L3137K4814J2033p7030m0822
6548a01370K1949k5171k8758K9441M9139K8994Q4247K5086M324j536l7716p979
6536D0650k1419j4485p0473K7794J11690P2043P527o4746o6506J170K8937O657
6524E8839P340J479l7685O9948M0607n2606m5697J7804o2145N7774K3702r893
6512F9467m7431q2755j5063o736N5993M7982j897l485k1712N3782M3929n9715
6500C2359r3738K9802j4828L3197L5230P080N2419n1168l2066k5392k935K4722
6488e318J4798l0432l0945k912M3277k1209L3478N514l4725p7576Q205Q1530N4295
6475C7980k9039l4432L3713K83J7102o3131m5170n1426l4076J08670j900J04630
$$ plain form
6463 43204 111237 141958 135060 129809 69516 72844 -9878 -26656 -13228 -68349 4902 -63468
6451 -63468 -127385 -39636 1315 -10060 -49722 30272 39507 38174 39590 128841 107056 -1020
6439 -1020 -32624 -30838 -43814 -31861 68991 33188 17313 4781 -14241 10352 -3933 46073
6427 46073 72939 35328 -48799 -38535 1812 77726 92326 80162 69839 27026 -8647 7366
6415 7366 -7288 -24034 -1778 -15653 -58864 -110340 -80636 -56489 -76896 -109741 -83302 -2346
6403 -2346 -17330 -49833 -45719 -26528 -60224 50900 132559 134915 85753 26471 18995 59977
6391 59977 30406 9986 79246 73411 -7100 -12334 13052 10554 -11610 -97589 -85707 -35406
6379 -35406 -44905 2426 27270 37105 5341 4153 -89352 -125488 -25212 -19203 -21345 -35039 -23037
$$ packed form
6463D3204O8033L0721o898n251o0293L328q2722j6778J3428n5121P3251o8370
6451f3468o3917Q7749M0951j1375l9662P9994R235j333J416Q9251k1785j08076
6439a020l1604J786j2976J1953J00852l5803j5875j2532j9022K4593j4285N0006
6427D6073K6866l7611q4127J0264M0347P5914J4600j2164j0323m2813l5673J6013
6415G366j4654j6746K2256j3875m3211n1476K9704K4147k0407l2845K6439Q0956
6403b346j4984l2503M114J9191l3696J11124Q1659K356m9162n9282p476M0982
6391E9977k9571k0420O9260n835q0511n234K5386k498k2164q5979J1882N0301
6379c5406r499M7331K4844R835l1764j188r3505l6136J00276O009k142j3694J2002
$$ plain form
6366 -23037 -52918 -16656 -28587 -63655 -137131 -87718 -62686 -73378 -26215 -20403 35481 118499
6354 118499 103589 62525 80655 24303 -75342 -74247 28410 43568 42313 20769 29382 -502
6342 -502 20106 11998 -64918 -25848 -201 -44310 -140178 -114478 -41230 -53421 -60046 -42100 -38945
6329 -38945 -37899 2435 -24934 -16032 24764 -26870 -45179 -28522 64470 62704 5848 41773
6317 41773 89528 8144 -48221 -69185 -168935 -177262 -99991 2450 114851 157419 83304 34635
6305 34635 61241 90808 73905 2621 -27749 20508 -23600 -74620 -55555 4539 11928 -33582
6293 -33582 18157 80093 115789 102109 40037 9843 18204 -71660 -85447 -65794 -60827 -91571
6281 -91571 -89487 -68908 -63646 -37422 -3897 -18642 43298 54034 476 -29889 -54118 -134071
$$ packed form
6366b3037k9881L6262j1931l5068p3476M9413K5032j0692M7163N812N5884Q3018
6354A18499j4910m1064J8130n6352r9645J095J02657J5158j255k1544Q613k9884
6342e02K0608q108p6916L9070K5647m4109r5868K5700P3248j2191o625J7946L155
6329c8945J046M0334k7369Q902M0796n1634j8309J6657R2992j766n6856L5925
6317D1773M7755q1384n6365k0964r9750q327P7271J02441J12401M2568p4115m8669
6305C4635K6606K9567j6903p1284l0370M8257m4108n1020J9065O0094P389m5510
6293c3582N1739O1936L5696j3680o2072l0194Q361q9864j3787J9653M967l0744
6281i1571K084K0579N262K6224L3525j4745O1940J0736n3558l0365k4229p9953
$$ plain form
6269 -134071 -213672 -165274 -55832 3415 -59119 -59745 -12467 -58111 -69879 -59249 -59163 -2149
6257 -2149 36263 51402 138313 142113 79878 107037 72003 -12515 112 4627 -14203 -32647
6245 -32647 -51967 -86283 -107677 -73214 -14362 -43418 -21105 -46282 -65879 -78309 -90426 -79370
6233 -79370 -31600 -34603 -33697 -54116 -10552 3755 54203 25544 -53515 -26326 12317 -32728
6221 -32728 -41284 -81822 -43402 -68928 -55507 44912 47505 94642 142318 120335 124558 124820 40853
6208 40853 25439 10600 -32789 -100939 -127195 -70814 -60357 -66802 -62655 9540 56160 44046
6196 44046 63137 87680 90549 100892 85272 10619 -124365 -108530 -58128 -28808 9437 5322
6184 5322 35405 46824 -23067 -119272 -57778 -7245 44772 31702 11403 11700 -42822 -133032
$$ packed form
6269a34071p9601M8398J09442N9247o2534o26M7278m5644j1768J0630Q6N7014
6257b149L8412J5139Q6911L800o2235K7159l5034q4518J2627M515j8830j8444
6245c2647j9320l4316k1394L4463N8852k9056K2313k5177j9597j2430j2117J1056
6233g9370M7770l003R06k0419M3564J4307N0448k8659p9059K7189L8643m5045
6221c2728q556m0538L8420k5526J3421J00419K593M7137M7676k1983M223K62q3967
6208D0853j5414j4839m3389o8150k6256N6381J0457o445M147P2195M6620j2114
6196D4046J9091K4543K869J0343j5620p4653j34984J5835N0402K9320L8245m115
6184E322L0083J1419o9891r6205O1494N0533N2017j3070k0299K97n4522r0210
$$ plain form
6172 -133032 -191483 -217308 -146344 -107542 -39672 16376 -13204 -42973 -108756 -98863 -114077 -60811
6160 -60811 -41853 -68596 -56729 -92449 -122374 -109513 -67774 -53991 -52891 -20351 -32414 -63449
6148 -63449 -33884 -69616 -60673 -36622 5352 66953 56636 -8440 -77476 -114483 -113113 -67540
6136 -67540 1312 56767 13758 24822 32221 35441 6186 25513 -19354 -23166 -12734 39475
6124 39475 111598 93397 85895 14131 -2770 58416 61941 16051 -5694 -64996 -41112 -33398
6112 -33398 -19302 -321 -12544 -44676 -71157 -125713 -175101 -199661 -145855 -118805 -99726 -93289
6100 -93289 -83757 -102374 -50973 21046 4086 -37665 -74345 -62227 -40600 13692 64484 102457
6088 102457 81232 30702 56538 46828 20831 -54571 -52336 28508 12449 -49178 -6068 -59736
$$ packed form
6172a33032n8451k5825P0964L8802O7870N6048k9580k9769o5783R893j5214N3266
6160f0811J8958k6743J1867l5720k9925J2861M1739J3783J100L2540j2063l1035
6148f3449K9565l5732Q943K4051M1974O1601j0317o5076o9036l7007J370M5573
6136f7540O8852N5455m3009J1064P399L220k9255J9327m4867l812J0432N2209
6124C9475P2123j8201p502p1764j6901O1186L525m5890k1745n9302K3884P714
6112c3398J4096J8981j2223l2132k6481n4556m9388k4560N3806K7050J9079O437
6100i3289R532j8617N1401P2019j6960m1751l6680J2118K1627N4292N0792L7973
6088A02457k1225n0530K5836r710k5997p5402K235Q0844j6059o1627M3110n3668
$$ plain form
6076 -59736 -84076 -34199 -1226 -30653 -16410 -43985 -25246 -56395 -46933 -5920 4778 25024
6064 25024 15842 -68487 -147265 -149908 -74776 57941 114354 115542 24349 12654 47980 65983
6052 65983 72616 69324 42208 49614 57110 17846 -22252 -13808 54461 116786 81409 -24870 -54384
6039 -54384 -47299 -84315 -126730 -77903 -13508 -47086 -95064 -168664 -144916 -45657 16706 -4935
6027 -4935 2824 82415 118090 67068 88918 136670 64396 -70029 -129806 -45595 396 -5948
6015 -5948 -26674 -75861 -90236 -35480 -51790 -25036 5737 -43303 -135590 -120470 -65335 -21007
6003 -21007 -81318 -175677 -148617 -109577 -89319 -81280 -99767 -114874 -52714 -84342 -126321 -121285
5991 -121285 -103576 -133047 -174801 -140177 -101969 -75495 -23323 66619 78173 106363 117718 128844
$$ packed form
6076e9736k4340M9877L2973k9427J4243k7575J8739l1149R462M1013J0698K0246
6064B5024r182q4329p8778k643P5132J32717N6413J188r1193j1695L5326J8003
6052F5983O633l292k7116P406P496l9264m0098Q444O8269O2325l5377j06279k9514
6039e4384P085l7016m2415M8827O4395l3578m7978p3600K3748R9259O2363k1641
6027d935P759P9591L5675n1022K1850M7752p2274j34425n9777Q4211M5991o344
6015e948k0726m9187j4375N4756j6310K6754L0773m9040r2287J5120N5135M4328
6003b1007o0311r4359K7060L9040K0258Q039j8487j5107O2160l1628m1979N036
5991a21285J7709k9471m1754L4624L8208K6474N2172Q9942J1554K8190J1355J1126
$$ plain form
5979 128844 105462 13064 -63876 -80485 -23414 1827 56422 74043 62691 -8249 -1837 -32561
5967 -32561 -9974 -66295 -40549 3412 -12880 25714 14970 9794 21737 7231 2817 32407
5955 32407 18675 12526 74709 66973 48748 41022 -17237 -178497 -162883 -93604 -32163 -11781
5943 -11781 53065 135786 130533 86015 51730 13130 -27029 -47705 -32953 -13081 -17324 -78991
5931 -78991 -68905 -28368 61627 17572 -36690 -76576 -1655 55037 45395 49903 98468 81453
5919 81453 78123 80187 59464 -3449 -6580 37788 26971 -112329 -82717 -31752 -59207 -74672
5907 -74672 5031 32023 13448 18483 72037 101081 82188 57521 11266 68360 139884 84771
5895 84771 24808 21933 11618 -23653 -64983 -64272 -88193 -58790 -47038 -24148 39057 -37438
$$ packed form
5979A28844k3382r2398p6940j6609N7071K5241N4595J7621j1352p0940O412l0724
5967c2561K2587n6321K5746M3961j6292L8594j0744n176J1943j4506m414K9590
5955C2407j3732o149O2183p736j8225p726n8259j61260J5614O9279O1441K0382
5943a1781O4846Q2721n253m4518l4285l8600m0159k0676J4752J9872m243o1667
5931g8991J0086M0537Q9995m4055n4262l9886P4921N6692r642M508M8565j7015
5919H1453l330K064k0723o2913l131M4368j0817j39300K9612N0965k7455j5465
5907g4672P9703K6992j8575N035N3554K9044j8893k4667m6255N7094P1524n5113
5895H4771n9963k875j0315l5271m1330P11k3921K9403J1752K2890O3205p6495
$$ plain form
5883 -37438 -80746 -50294 -81760 -81292 -53886 -82645 -71527 -48538 -36378 -120018 -68494 -34876
5871 -34876 -33481 -18227 43504 62477 7115 2568 -12955 80862 116010 110680 75915 58949
5859 58949 78802 33287 -22010 -41515 -73717 -104031 -63984 -15500 -21751 -90303 -79591 -51350
5847 -51350 -53211 -550 32922 -1061 -16946 41969 41839 88580 138308 117901 67358 55634
5835 55634 55667 121392 128572 87198 14513 -25763 41900 138419 154367 114717 17745 -6101 6778
5822 6778 78766 130481 61748 21671 18281 50377 60513 95722 85044 14715 8235 39286
5810 39286 51966 39684 -31239 17786 65653 21912 -67934 -128456 -98451 -65175 -67931 -57565
5798 -57565 -15570 42651 59858 25866 81172 70293 23097 -20592 16120 44875 67712 100032
$$ packed form
5883c7438m3308L0452l1466M68K7406k8759J1118K2989J2160q3640N1524L3618
5871c4876J395J5254O1731J8973n5362m547j5523R3817L5148n330l4765j6966
5859E8949J9853m5515n5297j9505l2202l0314M0047M8484o251o8552J0712K8241
5847e1350j861N2661L3472l3983j5885N8915j30M6741M9728k0407n0543j1724
5835E5634L3O5725P180m1374p2685m0276O7663R6519J5948l9650r6972k3846J2879
5822F778P1988N1715o8733m0077l390L2096J0136L5209j0678p0329o480L1051
5810C9286J2680j2282p0923M9025M7867m3741q9846o0522L0005L3276k756J0366
5798e7565M1995N8221J7207l3992N5306j0879m7196m3689L6712K8755K2837L2320
$$ plain form
5786 100032 110155 85463 58420 62978 63468 -37465 -89946 -59821 7117 25851 45603 40759
5774 40759 -18121 39652 98206 101226 32493 -40048 -65899 -79879 58140 82482 -5581 -25641
5762 -25641 -35948 -44917 15007 46734 44403 45683 50656 -45729 -64383 -1438 -43316 -118302 -156628
5749 -156628 -159403 -157358 -174461 -186285 -97342 -30444 -8448 27126 106181 124443 71108 59344
5737 59344 34999 30628 62395 46484 19739 12667 -43266 -60144 -119289 -125742 -126079 -89177 -47385
5724 -47385 -23849 -100050 -124564 -79794 -17515 33865 3903 -26082 -21448 -27464 -58038 -42752
5712 -42752 -48246 -87085 -76391 -36631 -19025 50629 28531 -8122 62940 14668 -4383 -3287
5700 -3287 45828 60788 15366 12849 -25880 -30413 9244 51790 -25037 -141231 -119791 -38575
$$ packed form
5786A00032J0123k4692k7043M558M90j00933n2481L0125O6938J8734J9752m844
5774D0759n8880N7773N8554L020o8733p2541k5851j3980J38019K4342q8063k0060
5762b5641j0307q969N9924L1727k331J280M973r6385j8654O2945m1878p4986l8326
5749a56628k775K045j7103j1824Q8943O6898K1996L5574P9055J8262n3335j1764
5737E9344k4345m371L1767j5911k6745p072n5933j6878n9145o453l37L6902M1792
5724d7385K3536p6201k4514M4770O2279N1380k9962k9985M634o016l0574J5286
5712d2752n494l8839J0694L9760J7606O9654k2098l6653P1062m8272j9051J096
5700c287M9115J4960m5422k517l8729m533L9657M2546p6827j16194K1440Q1216
$$ plain form
5688 -38575 491 -12244 36774 83446 51653 40255 11944 6122 40544 58132 140484 55605
5676 55605 14417 9787 -46477 -41823 -40560 -23295 -37481 -47743 60587 68780 62137 32360 -9478
5663 -9478 -117518 -140731 -162342 -105376 -116712 -84447 -34263 -46413 -99657 -143325 -105531 -16820
5651 -16820 -59554 -119439 -68215 -51380 -76437 -54414 -44766 -3054 74489 69393 43981 53739
5639 53739 92575 22487 -1645 -5400 29092 -33923 -100533 -49905 -53300 -75028 -171411 -166493
5627 -166493 -91756 -30484 -17886 25870 30150 59020 24131 24706 18190 25336 88930 21221 -75921
5614 -75921 -104580 -75648 -88444 -134877 -159208 -164767 -109685 -104872 -30986 23840 46675 24722
5602 24722 20162 28240 47707 -21744 -4033 33346 18138 35791 39159 35375 38626 -69810 -139139
$$ packed form
5688c8575L9066j2735M9018M6672l1793j1398k8311n822L4422J7588Q2352q4879
5676E5605m1188m630n6264M654J263J7265j4186j0262J08330Q193o643k9777m1838
5663i478j08040k3213k1611N6966j1336L2265N0184j2150n3244m3668L7794Q8711
5651a6820m2734n9885N1224J6835k5057K2023R648M1712P7543n096k5412R758
5639E3739L8836p0088k4132l755L4492o3015o6610N0628l395k1728r6383M918
5627a66493P4737O1272J2598M3756M280K8870l4889N75o516P146O3594o7709r7142
5614g5921k8659K8932j2796m6433k4331n559N5082M813P3886N4826K2835k1953
5602B4722m560Q078J9467o9451J7711L7379j5208J7653L368l784L251j08436o9329
$$ plain form
5589 -139139 -108346 -21515 -34433 54869 80900 67253 72720 95860 63580 -13836 -13564 -41094
5577 -41094 22216 13297 -30225 -36656 -43813 -4688 93851 165922 93013 95288 138327 106088 99741
5564 99741 138026 98716 -11271 -11356 143360 77159 -59822 -94249 -94571 -70797 -10791 15093
5552 15093 -11907 15277 17338 2556 -24206 -109621 -109298 -168671 -124008 -95659 2108 70382
5540 70382 92439 64177 61304 79102 23934 -21643 -10623 -75401 -62716 -73884 -66223 -46924
5528 -46924 -82994 -63104 13908 31101 14491 -62720 -169365 -127584 -75743 -96411 -100789 -46174
5516 -46174 34160 -10679 -39504 -23866 -110 -49982 -612 17045 -60352 -65222 -8025 -60809
5504 -60809 -51478 -38820 -36636 -64459 -64536 -29526 -82785 -130083 -151967 -175547 -104357 -100060 -163138
$$ packed form
5589a39139L0793Q6831j2918Q9302K6031j3647N467K3140l2280p7416K72k7530
5577d1094O3310q919m3522o431p157L9125R8539P2071p2909K275M3039l2239o347
5564I9741L8285l9310j09987q5J54716o6201j36981l4427l22K3774O0006K5884
5552A5093k7000K7184K061j4782k6762q5415L23n9373M4663K8349R7767O8274
5540G0382K2057k8262k873J7798n5168m5577J1020o4778J2685j1168P661J9299
5528d6924l6070J9890P7012J7193j6610p7211j06645M1781N1841k0668m378N4615
5516d6174Q0334m4839k8825J5638K3756m9872M9370J7657p7397m870N7197n2784
5504f0809R331J2658K184k7823p7L5010n3259m7298k1884k3580P1190M297o3078
$$ plain form
5491 -163138 -148697 -81500 -69559 -97083 -52747 -26678 -38979 277 33410 64662 140334 153853
5479 153853 68447 -70125 -88376 -69267 -27188 -1375 -42070 -23355 -51049 16163 37481
5468 37481 -56750 -77070 -34865 -23260 41881 76050 -18657 -23366 -2066 50069 57319 14901
5456 14901 -34669 -10475 -27807 -92872 -132156 -91240 -123884 -129891 -126251 -83714 -63325 -86697
5444 -86697 -80437 -59388 -100722 -86467 -65256 -75113 9512 -21264 -47397 -14648 -54539 -117122
5432 -117122 -75784 -84328 -50307 -18701 -60240 -16682 94872 62821 -45868 -106584 -125784
5421 -125784 -98126 1032 -19952 16837 23794 4714 -5580 -2093 35412 2725 -109457 -114044
5409 -114044 -23869 -46733 -56811 -71174 -60504 11040 53050 28009 12289 10708 89590 80088
$$ packed form
5491a63138J4441O7197J1941k7524M4336K6069j2301L9256L3133L1252P5672J3519
5479A53853q5406j38572j8251J9109M2079K5813m0695J8715k7694O7212K1318
5468C7481r4231k0320M2205J1605O5141L4169r4707m709K1300N2135P250m2418
5456A4901m9570K4194j7332o5065l9284M0916l2644o007L640M2537K0389k3372
5444h6697O260K1049m1334J4255K1211r857Q4625l0776k6133L2749l9891o2583
5432a17122M1338q544L4021L1606m1539M3558J11554l2051j08689o0716j9200
5421a25784K7658R9158k0984L6789O957j9080j0294L487L7505l2687j12182m587
5409a14044R0175k2864j0078j4363J0670P1544M2010k5041j5720j581P8882r502
$$ plain form
5397 80088 71905 -11343 15715 37304 33018 17946 -19392 -6591 -19455 1639 41839 61333
5385 61333 12029 -26502 -1973 2952 -25841 -48695 3612 80680 79734 66601 79352 -11447
5373 -11447 -59574 -70597 -25282 5309 39044 46773 5934 -97848 -157938 -70024 -100779 -123183
5361 -123183 -61986 12276 -18920 -3318 -87219 -153768 -102980 -55126 -35672 -21529 -12036 39220
5349 39220 -21440 -27552 -106724 -94015 -19458 44167 -9327 -66325 -114876 -143668 -118741 -20306
5337 -20306 16562 20980 -179 22964 18859 15132 -9643 -41467 -41261 -10290 -16521 39637 25089
5324 25089 36885 6947 -12030 -3671 852 15990 -257 -61372 3217 46660 110661 -21381
5312 -21381 -78593 -70103 -29811 -112811 -103312 -82599 -63022 -50311 -50257 -75732 -51873 -26540 49625
$$ packed form
5397H0088q183q3248K7058K1589m286j5072l7338J2801j2864K1094M0200J9494
5385F1333m9304l8531K4529M925k8793k2854N2307P7068r46j3133J2751r0799
5373a1447m8127j1023M5315L0591L3735P729m0839j03782o0090Q7914l0755k2404
5361a23183O1197P4262l1196J5602q3901o6549N0788M7854J9454J4143R493N1256
5349C9220o0660o112p9172J2709P4557O3625n3494n6998m8551k8792K4927R8435
5337b0306L6868M418k1159K3143m105l727k4775l1824K06L0971o231N6158j4548
5324B5089J1796k9938j8977Q359M523J5138j6247o1115O4589M3443O4001j32042
5312b1381n7212Q490M0292q3000R499K0713J9577J2711N4k5475K3859K5333P6165
$$ plain form
5299 49625 45419 36874 59843 115426 21779 -33602 -35864 -3160 14945 75538 175154 201726
5287 201726 176726 206080 139079 660 3923 23133 95467 134795 91062 55946 25565 42537
5275 42537 16404 12703 -41138 -35239 -315 44517 76407 47624 47656 38824 12053 38124 -20956
5262 -20956 -74716 -56466 -39284 19902 23374 56848 52942 67051 104894 49261 15591 43245
5250 43245 6793 -94754 -125247 -52820 -2200 -45495 -37523 41780 16568 -45186 -63263 -83196
5238 -83196 -91275 -37575 -28834 -21152 -85448 -43242 -31808 -77129 -94768 -78741 -65137 -66630 -26025
5225 -26025 -9164 -13108 8900 -59499 -33322 -61731 -85516 -13051 -787 -17331 -36137 -52178
5213 -52178 -36554 19588 62410 28717 -17471 30032 15954 -79335 -75186 -45774 -11179 -23401
$$ packed form
5299D9625m206q545K2969N5583r3647n5381k262L2704J8105O0593R9616K6572
5287B01726k5000K9354o7001j38419L263J9210P2334L9328m3733l5116l0381J6972
5275D2537k6133l701n3841N899L4924M4832L1890k8783L2q832k6771K6071n9080
5262b0956n3760J8250J7182N9186L472L3474l906J4109L7843n5633l3670K7654
5250D3245l6452j01547l0493P2427N0620m3295P972P9303k5212o1754j8077j9933
5238h3196q079N3700Q741P682o4296M2206J1434m5321j7639J6027J3604j493M0605
5225b6025J6861l944K2008o8399K6177k8409k3785P2465J2264j6544j8806j6041
5213e2178J5624N6142M2822l3693m6188M7503j4078r5289M149K9412L4595j2222
$$ plain form
5201 -23401 -74426 -68185 -106575 -47772 26770 71845 74463 39194 42143 121929 167163 151139
5189 151139 58506 -19762 -87323 -61593 -19675 -27617 11354 3743 -64816 -35396 35753 -30682
5177 -30682 -103625 -115042 -82855 -18586 5259 44534 50587 89316 142828 101882 63005 -11798
5165 -11798 -33539 69577 168100 141495 -8542 -87328 -47773 -3267 87949 167748 100223
5154 100223 60347 43436 -23975 -95142 -130773 -43184 -49892 -63797 -115824 -91219 -43675 -817
5142 -817 12972 48431 76724 70766 3927 -53545 -43848 -10763 -4457 58958 45378 10235 -13245
5129 -13245 21062 -80670 -68914 30292 89061 49162 27370 32053 22675 -31761 -69103 -90390
5117 -90390 -83418 -44544 -71228 -57887 -59142 -154772 -137031 -101556 -105416 -37555 5662 28179
$$ packed form
5201b3401n1025O241l8390N8803P4542M5075K618l5269K949P9786M5234j6024
5189A51139r2633p8268o7561K5730M1918p942L8971p611o8559K9420P1149o6435
5177c0682p2943j1417L2187O4269K3845L9275O053L8729N3512m0946l8877p4803
5165a1798k1741J03116R8523k6605j50037p8786L9555M4506R1216P9799o7525
5154A00223l9876j6911o7411p1167l5631Q7589o708j3905n2027K4605M7544M2858
5142h17J3789L5459K8293n958o6839n7472R697L3085O306O3415j3580l5143k3480
5129a3245L4307j01732J1756R9206N8769l9899k1792M683r378n4436l7342k1287
5117i0390O972L8874k6684J3341j255r5630J7741L5475l860O7861M3217K2517
$$ plain form
5105 28179 43660 31594 87538 87149 75086 34872 -26194 29059 40998 2644 61081 90705
5093 90705 50955 -16834 318 -12631 -19531 -33097 -53244 -55134 31005 67092 47700 77334
5081 77334 63387 27455 -19561 11335 -9054 -31086 3405 21267 -43521 -2879 53865 20092
5069 20092 10860 58963 40082 110 -26480 4515 23533 -15003 -23007 -89354 -83680 -79440 -93603
5056 -93603 -84652 -57351 -19022 4353 41421 97464 108734 86766 151645 142628 97797 -5731
5044 -5731 -809 -19357 17945 3982 -5535 38650 56998 27590 -50449 -69319 -37079 -1128
5032 -1128 95230 93068 121303 23317 -43281 -10789 53442 57216 52680 31582 34403 90901 114209
5019 114209 99748 45956 13447 -39919 -20761 -30215 10071 -30224 -48188 7638 34037 20920
$$ packed form
5105B8179J5481j2066N5944l89j2063m0214o1066N5253J1939l8354N8437K9624
5093I0705l9750o7789J7152j2949o900j3566k0147j890Q6139L6087j9392K9634
5081G7334j3947l5932m7016L0896k0389k2032L4491J7862o4788M0642N6744l3773
5069B0092r232M8103j8881l9972k6590L0995J9018l8536q004o6347N674M240j4163
5056i3603Q951K7301L8329K3375L7068N6043J1270k1968O4879r017m4831j03528
5044e731M922j8548L7302j3963r517M4185J8348k9408p8039j8870L2240L5951
5032a128R6358k162K8235r7986o6598L2492O4231L774m536k1098K821N6498K3308
5019A14209j4461n3792l2509n3366J9158r454M0286m0295j7964N5826K6399j3117
$$ plain form
5007 20920 -44409 -20261 15700 8308 23805 12494 -42148 -36115 -8439 -51426 -88334 -137571
4995 -137571 -137986 -71036 -84211 -79510 -114409 -142718 -90839 -2143 80556 53244 70348 114333
4983 114333 67716 29409 30097 42109 23509 25208 18205 -11383 10165 37945 74441 -1390
4971 -1390 -2465 72894 162455 77930 80616 41650 -1607 43805 102435 131954 14538 -68652
4959 -68652 -62704 -71419 -114344 -138380 -80502 -53591 -34388 -70355 -64194 -31183 3389 16994
4947 16994 -18840 -510 47148 3268 -7752 -41566 34517 -2365 -74181 -36596 -29325 -13497
4935 -13497 -8414 67045 117192 59549 1210 31711 70004 143835 134698 107971 132802 128788
4923 128788 90127 98974 84149 11528 18073 82453 123015 118135 105571 103479 170492 215502
$$ packed form
5007B0920o5329K4148L5961p392J5497j1311n4642O033K7676m2987l6908m9237
4995a37571m15O6950j3175M701l4899k8309N1879Q8696Q2699k7312J7104M3985
4983A14333m6617l8307O88J2012j8600J699p003k9588K1548K7780L6496p5831
4971a390j075P5359Q9561q4525K686l8966m3257M5412N8630K9519j17416q3190
4959f8652N948q715m2925k4036N7878K6911J9203l5967O161L3011L4572J3605
4947A6994l5834J8330M7658m3880j1020l3814P6083l6882p1816L7585P271J5828
4935a3497N083P5459N0147n7643n8339L0501L8293P3831r137k6727K4831m014
4923A28788l8661Q847j4825p2621O545O4380M0562m880j2564k092O7013M5010
$$ [...]
##END NTUPLES=NMR SPECTRUM
##END=
