##TITLE=Analysis number 237696
Compound Code btb 07340
Project Code adrs
Chemist Name stores
##JCAMPDX= 6.0         $$ Bruker NMR JCAMP-DX V2.0
##DATA TYPE= NMR SPECTRUM
##DATA CLASS= NTUPLES
##ORIGIN= Bruker BioSpin GmbH
##OWNER= nmr
$$ XWIN-NMR		Version 3.5
$$ Mon Apr  2 10:03:55 2007 GMT Daylight Time (UT+1h)  MAYBRIDGE\nmr@NMR_250MHZ
##.OBSERVE FREQUENCY= 250.131544655141
##.OBSERVE NUCLEUS= ^1H
##.ACQUISITION MODE= SIMULTANEOUS (DQD)
##.ACQUISITION SCHEME= undefined
##.AVERAGES= 16
##.DIGITISER RES= 18
##SPECTROMETER/DATA SYSTEM= dpx250
##.PULSE SEQUENCE= zg30
##.SOLVENT NAME= DMSO
##.SHIFT REFERENCE= (INTERNAL, DMSO, 0, 16.522)
##AUDIT TRAIL= $$ (NUMBER, WHEN, WHO, WHERE, WHAT)
$$ ##TITLE= Audit trail, XWIN-NMR		Version 3.5
$$ ##JCAMPDX= 5.01
$$ ##ORIGIN= Bruker BioSpin GmbH
$$ ##OWNER= nmr
$$ C:\u/data/dgb/nmr/ADRS/70/pdata/1/auditp.txt
$$ ##AUDIT TRAIL=  $$ (NUMBER, WHEN, WHO, WHERE, WHAT)
(   1,<2007-04-02 10:03:28.46 +100>,<MAYBRIDGE\nmr>,<NMR_250MHZ>,
      <created by zg, POWCHK disabled, PULCHK disabled
       configuration hash MD5:
       49 4B E0 1D 92 C2 6B 37 9F E6 65 BC 52 41 86 1D
       data hash MD5: 64K
       86 60 13 64 87 33 68 66 52 72 B4 91 7E 1C 46 EC>)
(   2,<2007-04-02 10:03:43.61 +100>,<MAYBRIDGE\nmr>,<NMR_250MHZ>,
      <Start of raw data processing
       ef LB = 0.3 FT_mod = 6 PKNL = 1 SI = 32K 
       data hash MD5: 32K
       7E E1 B3 E0 29 7E D9 D0 D8 2A F6 BC 25 48 EF F9>)
(   3,<2007-04-02 10:03:45.26 +100>,<MAYBRIDGE\nmr>,<NMR_250MHZ>,
      <apk 
       data hash MD5: 32K
       2B 85 65 C9 CE 6D F7 B0 15 C7 2C 6E 4F 6F 26 71>)
(   4,<2007-04-02 10:03:46.01 +100>,<MAYBRIDGE\nmr>,<NMR_250MHZ>,
      <abs ABSG = 5 
       data hash MD5: 32K
       BA 79 DE 22 44 12 52 3C 4D 3D FA 16 CC 9E E7 2F>)
$$ ##END=
$$ 
$$ hash MD5
$$ 34 09 9D ED 31 F4 08 DA AA 69 A2 CB DD 88 64 0D
##$RELAX= 
##$RELAX= 
##$RELAX= 
##$RELAX= 
##$RELAX= 
##$RELAX= 
##$RELAX= 
$$ Bruker specific parameters
$$ --------------------------
##$DU= <C:\u>
##$EXPNO= 70
##$NAME= <ADRS>
##$PROCNO= 1
##$TYPE= <nmr>
##$USER= <dgb>
##$AMP= (0..31)
100 100 100 100 100 100 100 100 100 100 100 100 100 100 100 100 100 100 
100 100 100 100 100 100 100 100 100 100 100 100 100 100 
##$AQSEQ= 0
##$AQ_mod= 3
##$AUNM= <au_zg>
##$AUTOPOS= <10 >
##$BF1= 250.13
##$BF2= 250.13
##$BF3= 250.13
##$BF4= 250.13
##$BF5= 500.13
##$BF6= 500.13
##$BF7= 500.13
##$BF8= 500.13
##$BYTORDA= 1
##$CFDGTYP= 0
##$CFRGTYP= 5
##$CHEMSTR= <none>
##$CNST= (0..31)
1 1 145 1 1 1 1 1 1 1 1 1 1 1 1 1 1 1 1 1 1 1 1 1 1 1 1 1 1 1 1 1 
##$CPDPRG= <>
##$CPDPRG1= <>
##$CPDPRG2= <>
##$CPDPRG3= <>
##$CPDPRG4= <mlev>
##$CPDPRG5= <mlev>
##$CPDPRG6= <mlev>
##$CPDPRG7= <mlev>
##$CPDPRG8= <mlev>
##$CPDPRGB= <>
##$CPDPRGT= <>
##$D= (0..31)
0 1 0 0 0 0 0 0 0 0.06 0 0 0 0 0 0 0.0002 0 0 0 0 0 0 0 0 0 0 0 0 0 0 
0 
##$DATE= 1175504606
##$DBL= (0..7)
120 120 120 120 120 120 120 120 
##$DBP= (0..7)
150 150 150 150 150 150 150 150 
##$DBP07= 0
##$DBPNAM0= <>
##$DBPNAM1= <>
##$DBPNAM2= <>
##$DBPNAM3= <>
$$ [...]
##$SUBNAM7= <"">
##$SUBNAM8= <"">
##$SUBNAM9= <"">
##$SW= 20.6930455092707
##$SWIBOX= (0..15)
0 0 3 0 0 0 0 0 0 0 0 0 0 0 0 0 
##$SW_h= 5175.983436853
##$TD= 65536
##$TD0= 1
##$TE= 683.16
##$TE2= 300
##$TE3= 300
##$TEG= 300
##$TL= (0..7)
0 120 120 120 120 120 120 120 
##$TP= (0..7)
150 150 150 150 150 150 150 150 
##$TP07= 0
##$TPNAME0= <>
##$TPNAME1= <>
##$TPNAME2= <>
##$TPNAME3= <>
##$TPNAME4= <>
##$TPNAME5= <>
##$TPNAME6= <>
##$TPNAME7= <>
##$TPOAL= (0..7)
0.5 0.5 0.5 0.5 0.5 0.5 0.5 0.5 
##$TPOFFS= (0..7)
0 0 0 0 0 0 0 0 
##$TUNHIN= 0
##$TUNHOUT= 0
##$TUNXOUT= 0
##$USERA1= <user>
##$USERA2= <user>
##$USERA3= <user>
##$USERA4= <user>
##$USERA5= <user>
##$V9= 5
##$VALIST= <valist>
##$VCLIST= <CCCCCCCCCCCCCCC>
##$VD= 0
##$VDLIST= <DDDDDDDDDDDDDDD>
##$VPLIST= <PPPPPPPPPPPPPPP>
##$VTLIST= <TTTTTTTTTTTTTTT>
##$WBST= 1024
##$WBSW= 4
##$XGAIN= (0..3)
0 0 0 0 
##$XL= 0
##$YL= 0
##$YMAX_a= 193978
##$YMIN_a= -241911
##$ZGOPTNS= <>
##$ZL1= 120
##$ZL2= 120
##$ZL3= 120
##$ZL4= 120
##$ABSF1= 16.522
##$ABSF2= -4.171173
##$ABSG= 5
##$ABSL= 3
##$ALPHA= 0
##$AQORDER= 0
##$ASSFAC= 0
##$ASSFACI= 0
##$ASSFACX= 0
##$ASSWID= 0
##$AUNMP= <proc_1d>
##$AZFE= 0.1
##$AZFW= 0.1
##$BCFW= 0
##$BC_mod= 0
##$BYTORDP= 0
##$COROFFS= 0
##$CY= 12.5
##$DATMOD= 1
##$DC= 0
##$DFILT= <>
##$DTYPP= 0
##$F1P= 14.0000005364418
##$F2P= -0.99999901652339
##$FCOR= 0.5
##$FTSIZE= 32768
##$FT_mod= 6
##$GAMMA= 0
##$GB= 0
##$INTBC= 1
##$INTSCL= 1
##$ISEN= 128
##$LB= 0.3
##$LEV0= 0
##$LPBIN= 0
##$MAXI= 10000
##$MC2= 0
##$MEAN= 0
##$ME_mod= 0
##$MI= 0
##$NCOEF= 0
##$NC_proc= -4
##$NLEV= 6
##$NOISF1= 0
##$NOISF2= 0
##$NSP= 0
##$NTH_PI= 0
##$NZP= 0
##$OFFSET= 16.522
##$PC= 1
##$PHC0= 225.8588
##$PHC1= 6.802954
##$PH_mod= 1
##$PKNL= yes
##$PPARMOD= 0
##$PSCAL= 4
##$PSIGN= 0
##$REVERSE= no
##$SF= 250.13
##$SI= 32768
##$SIGF1= 0
##$SIGF2= 0
##$SINO= 400
##$SIOLD= 32768
##$SREGLST= <1H.DMSO>
##$SSB= 0
##$STSI= 32768
##$STSR= 0
##$SW_p= 5175.98343685301
##$SYMM= 0
##$S_DEV= 0
##$TDeff= 65536
##$TDoff= 0
##$TI= <Analysis number 999999
Compound Code 99
Book Reference 9
Project Code 9>
##$TILT= no
##$TM1= 0
##$TM2= 0
##$TOPLEV= 0
##$USERP1= <user>
##$USERP2= <user>
##$USERP3= <user>
##$USERP4= <user>
##$USERP5= <user>
##$WDW= 1
##$XDIM= 32768
##$YMAX_p= 399057000
##$YMIN_p= -485577
$$ End of Bruker specific parameters
$$ ---------------------------------
##NTUPLES= NMR SPECTRUM
##VAR_NAME=  FREQUENCY,     SPECTRUM/REAL,   SPECTRUM/IMAG
##SYMBOL=    X,             R,               I
##VAR_TYPE=  INDEPENDENT,   DEPENDENT,       DEPENDENT
##VAR_FORM=  AFFN,          ASDF,            ASDF
##VAR_DIM=   32768,         32768,           32768
##UNITS=     HZ,            ARBITRARY UNITS, ARBITRARY UNITS
##FACTOR=    0.157963299565203, 1,           1
##FIRST=     4132.6476996994, 0,             0
##LAST=      -1043.33573715361, 0,           0
##MIN=       -1043.33573715361, -485577,     0
##MAX=       4132.6476996994, 399057000,     0
$$ Real data points
##PAGE= N=1
##DATA TABLE= (X++(R..R)), XYDATA
$$ [...]
$$ plain form
17379 124225 154065 171951 235835 357434 377761 400234 379357 308306 314733 351975 332460
17368 332460 406197 500907 523389 534757 538009 579294 715019 772679 838299 901026 997217
17357 997217 1191246 1316844 1443979 1588204 1824048 2041985 2151427 2383213 2696417 3046439
17347 3046439 3498571 4171779 5186851 6344591 7933274 10034569 12834140 16217789
17339 16217789 20052010 24202716 28599325 32537044 35580598 37624868 38646357 38657007
17331 38657007 37760757 36222222 34604190 33498177 33259639 34155320 36149848 38874508
17323 38874508 42077167 44906252 46807878 47367614 46570031 44275683 40515437 35679921
17315 35679921 30409016 25194772 20427881 16425860 13111648 10508053 8516302 7000835
$$ packed form
17379A24225K9840J7886O3884J21599K0327K2473k0877p1051O427L7242j9515
17368C32460P3737R4710K2482J1368L252M1285J35725N7660O5620O2727R6191
17357I97217J94029J25598J27135J44225K35844K17937J09442K31786L13204L50022
17347C046439M52132O73208J015072J157740J588683K101295K799571L383649
17339A6217789L834221M150706M396609L937719L043554K044270J021489J0650
17331C8657007q96250j538535j618032j106013k38538Q95681J994528K724660
17323C8874508L202659K829085J901626N59736p97583k294348l760246m835516
17315C5679921n270905n214244m766891m002021l314212k603595j991751j515467
$$ plain form
17307 7000835 5927500 5067505 4332546 3909547 3635787 3339407 3026797 2751509 2538338
17298 2538338 2319362 2142765 1881401 1708226 1532637 1420901 1364866 1285637 1151454 1001656
17288 1001656 1042073 960165 790591 717917 771270 741510 611451 555747 457427 441873 567397
17277 567397 564449 515593 513719 573214 560951 600183 679481 671565 629616 649066 717024 730547
17265 730547 693210 734243 764978 779327 776768 832635 804175 725478 749184 836523 948592
17254 948592 945922 945477 936139 1003638 1150543 1241795 1329985 1494802 1663229 1921730 2227541
17243 2227541 2694906 3419808 4271739 5304985 6451863 7555265 8649384 10048202 11823782
17234 11823782 13645882 14722819 14912338 14789576 15136838 15751116 16249562 15914825 15066077
$$ packed form
17307G000835j073335q59995p34959m22999k73760k96380l12610k75288k13171
17298B538338k18976j76597k61364j73175j75589j11736n6035p9229j34183j49798
17288A001656M0417q1908j69574p2674N3353k9760j30059n5704r8320j5554J25524
17277E67397k948m8856j874N9495j2263L9232P9298p916m1949J9450O7958J3523
17265G30547l7337M1033L0735J4349k559N5867k8460p8697K3706Q7339J12069
17254I48592k670m45r338O7499J46905R1252Q8190J64817J68427K58501L05811
17243B227541M67365P24902Q51931J033246J146878J103402J094119J398818J775580
17234A1823782J822100J076937J89519j22762L47262O14278M98446l34737q48748
$$ plain form
17225 15066077 14225696 13525146 13247228 13211213 13426601 13609487 13305670 12691363 12140452
17216 12140452 11788927 11596102 11124722 10166653 8922699 7759464 6822422 5945279 5118326
17207 5118326 4338256 3767062 3314795 2997572 2762803 2670161 2579682 2544092 2539087 2642378
17197 2642378 2763385 2989331 3281716 3578985 4178651 4962572 5929017 7259011 8912679
17188 8912679 10575497 12212473 13994123 16296214 19142647 21913269 23677197 24130155
17180 24130155 24199791 24810350 26053119 26878942 26472739 25278567 24184489 23524817 23236059
17171 23236059 23409446 23994559 24498075 24201608 23192054 22245561 21858730 21666107 20672244
17162 20672244 18561705 16027960 13798737 11884551 10050546 8455049 6890334 5672573
$$ packed form
17225A5066077q40381p00550k77918l6015K15388J82886l03817o14307n50911
17216A2140452l51525j92825m71380r58069j243954j163235r37042q77143q26953
17207E118326p80070n71194m52267l17223k34769r2642r0479l5590n005J03291
17197B642378J21007K25946K92385K97269N99666P83921R66445J329994J653668
17188H912679J662818J636976J781650K302091K846433K770622J763928M52958
17180B4130155O9636O10559J242769Q25823m06203j194172j094078o59672k88758
17171B3236059J73387N85113N03516k96467j009554r46493l86831j92623r93863
17162B0672244k110539k533745k229223j914186j834005j595497j564715j217761
$$ plain form
17154 5672573 4651956 3913654 3256981 2794160 2483071 2258784 2019636 1821002 1662746
17145 1662746 1494661 1437015 1340433 1249092 1139284 1050063 970697 917942 834325 741478 699962
17134 699962 788397 759801 721433 685384 644363 576643 537297 531762 463493 475659 483972 542517
17122 542517 522284 520209 509522 440460 457875 447763 388017 414954 410272 377134 356296 386375
17110 386375 337986 275958 344015 269508 229497 227155 206376 186011 188662 173285 184130 238190
17098 238190 249732 344443 397242 397220 447167 391682 356288 341474 261028 261274 254289 196774 73694
17085 73694 88847 154222 254606 321356 372044 387969 441466 487852 496440 575675 660630 790865
17073 790865 877274 860039 970518 1017835 1086732 1161548 1231240 1258693 1353482 1446453 1507994
$$ packed form
17154E672573j020617p38302o56673m62821l11089k24287k39148j98634j58256
17145A662746j68085n7646r6582r1341j09808q9221p9366n2755q3617r2847m1516
17134F99962Q8435k8596l8368l6049m1021o7720l9346n535o8269J2166Q313N8545
17122E42517k0233k075j0687o9062J7415j0112n9746K6937m682l3138k0838L0079
17110C86375m8389o2028O8057p4507m0011k342k0779k0365K651j5377J0845N4060
17098B38190J1542R4711N2799k2M9947n5485l5394j4814q0446K46o985n7515j23080
17085G3694J5153O5375J00384O6750N0688J5925N3497M6386Q588P9235Q4955J30235
17073G90865Q6409j7235J10479M7317O8897P4816O9692K7453R4789R2971O1541
$$ plain form
17062 1507994 1616018 1766689 1832459 1939712 2129107 2413709 2803228 3230456 3801353 4455935
17052 4455935 5364720 6844931 8808101 11260774 14291721 17737163 21716346 26112862
17044 26112862 30810754 35548917 39459094 42038182 43347684 43766398 43608288 42583607
17036 42583607 40159026 36307238 31697002 27155115 23134644 19448136 15885933 12721309
17028 12721309 10085702 8034504 6523217 5544242 4806374 4121394 3618485 3292985 3043854
17019 3043854 2807073 2633188 2474038 2393271 2282319 2222799 2171496 2113595 2060990 2068206 2079475
17008 2079475 2062360 2026767 2088918 2278841 2391016 2533191 2966149 3490300 4246915 5205045
16998 5205045 6428706 8064176 10102730 12373820 14961042 17640457 20376771 22828329
$$ packed form
17062A507994J08024J50671O5770J07253J89395K84602L89519M27228N70897O54582
17052D455935R08785J480211J963170K452673L030947L445442L979183M396516
17044B6112862M697892M738163L910177K579088J309502M18714j58110j024681
17036D2583607k424581l851788m610236m541887m020471l686508l562203l164624
17028A2721309k635607k051198j511287r78975p37868o84980n02909l25500k49131
17019C043854k36781j73885j59150q0767j10952n9520n1303n7901n2605P216J1269
17008B079475j7115l5593O2151J89923J12175J42175M32958N24151P56615R58130
16998E205045J223661J635470K038554K271090K587222K679415K736314K451558
$$ plain form
16990 22828329 24530201 25271410 25495265 25486034 24988483 23602564 21263444 18599751 15952333
16981 15952333 13587777 11362671 9269983 7458135 5896719 4628079 3795795 3226753
16973 3226753 2721941 2308664 1976756 1710871 1501386 1406225 1317909 1218009 1210478 1189620
16963 1189620 1184970 1099106 943042 925460 869250 800876 761945 621995 459465 413772 371807
16952 371807 273657 284413 386318 395815 360205 305974 365884 430230 406399 407579 388731 378964
16940 378964 376965 381250 296742 310660 304866 232789 154529 223684 312464 369113 363551 294823
16928 294823 213440 118693 83424 143502 118128 142420 121870 164993 260181 298389 318122
16917 318122 337323 344525 361431 340308 378861 425026 438592 409759 318153 272846 221558 148596
$$ packed form
16990B2828329J701872P41209K23855r231m97551j385919k339120k663693k647418
16981A5952333k364556k225106k092688j811848j561416j268640q32284n69042
16973C226753n04812m13277l31908k65885k09485r5161q8316r9900p531k0858
16963A189620m650q5864j56064j7582n6210o8374l8931j39950j62530m5693m1965
16952C71807r8150J0756J01905R497l5610n4231N9910O4346k3831J180j8848r767
16940C78964j999M285q4508J3918n794p2077p8260O9155Q8780N6649n562o8728
16928B94823q1383r4747l5269O0078k5374K4292k0550M3123R5188L8208J9733
16917C18122J9201P202J6906k1123L8553M6165J3566k8833r1606m5307n1288p2962
$$ plain form
16905 148596 140785 165843 155868 146290 113848 44793 38317 80996 130144 93326 157418 170334
16893 170334 186859 220018 171261 68001 112525 183967 190644 205691 144373 183702 149416
16882 149416 32358 47328 43016 27644 8280 -46176 -68368 42383 114812 148236 49296
16871 49296 -30903 -43671 85161 248871 277837 297601 258056 202161 166066 143231 134373
16860 134373 149439 155907 154880 139361 85362 78962 51249 26334 47481 26782 130967 171169
16848 171169 114067 36353 16184 66201 1592 -10806 108453 182933 187503 137429 124506
16837 124506 148010 264378 228571 163999 141955 68198 135034 232331 307424 335086 275002
16826 275002 294755 290920 218245 175361 271586 264059 234604 217639 168889 227735 281754 229231
$$ packed form
16905A48596p811K5058r975r578l2442o9055o476M2679M9148l6818O4092J2916
16893A70334J6525L3159m8757j03260M4524P1442O677J5047o1318L9329l4286
16882A49416j17058J4970m312j5372j9364n4456k2192J10751P2429L3424r8940
16871D9296q0199j2768J28832J63710K8966J9764l9545n5895l6095k2835q858
16860A34373J5066O468j027j5519n3999o400k7713k4915K1147k0699J04185M0202
16848A71169n7102p7714k0169N0017o4609j2398J19259P4480M570n0074j2923
16837A24506K3504J16368l5807o4572k2044p3757O6836R7297P5093K7662o0084
16826B75002J9753l835p2675m2884R6225p527k9455j6965m8750N8846N4019n2523
$$ plain form
16814 229231 191124 206457 220587 135241 43358 -2989 64519 93414 113545 69652 83276
16803 83276 -8208 -26412 -28010 -76192 -53232 -66367 -44156 -83787 -107225 -7034 66636 135371
16791 135371 70110 9063 -84 96366 144697 101965 29730 -32113 34412 97217 135250 100940
16779 100940 -5044 -3442 -5374 11860 -5076 56778 71705 66000 91842 102997 133370 133592
16767 133592 125429 57005 -102603 -147528 -47365 61595 18114 46396 -24934 -53976 -48200
16756 -48200 79666 109937 20002 -10209 47677 34698 26197 50766 72149 56806 35528 -12398
16744 -12398 -21500 5097 -34240 -24945 29796 75611 97679 128754 153013 105681 31087 6463
16732 6463 58614 74032 124901 174862 109708 1145 -24634 4307 30363 25793 61187 47359
$$ packed form
16814B29231l8107J5333J4130q5346r1883m6347O7508K8895K0131m3893J3624
16803H3276r1484j8204j598m8182K2960j3135K2211l9631k3438J00191P3670O8735
16791A35371o5261o1047r147R6450M8331m2732p2235o1843O6525O2805L8033l4310
16779A00940j05984J602j932J7234j6936O1854J4927n705K5842J1155L0373K22
16767A33592q163o8424j59608m4925J00163J08960m3481K8282p1330k9042N776
16756d8200J27866L0271q9935l0211N7886j2979q501K4569K1383j5343k1278m7926
16744a2398r102K6597l9337R295N4741M5815K2068L1075K4259m7332p4594k4624
16732F463N2151J5418N0869M9961o5154j08563k5779K8941K6056m570L5394j3828
$$ plain form
16720 47359 60425 -18838 -36075 -51035 -66653 -56060 -10225 70941 135326 147108 185732 237825
16708 237825 245541 187588 161247 157931 185829 223897 272800 231894 260587 251072 338447 421955
16696 421955 415755 335996 289653 199475 117325 107597 109630 100934 150184 167883 178911 158052
16684 158052 204675 146076 55290 41508 11869 -6587 14290 26182 -9142 8774 107624
16673 107624 129776 83110 21028 29450 -38571 -27479 33698 77872 117101 148687 143810 111441
16661 111441 155800 228632 236695 201255 252310 261787 229766 212574 289241 399363 333494 189495
16649 189495 77114 110425 144912 180082 145547 124847 121502 171069 175101 201567 205715 157892
16637 157892 132519 130007 109755 124429 66376 -21335 -132239 -124336 -18351 99644 81006
$$ packed form
16720D7359J3066p9263j7237j4960j5618J0593M5835Q1166O4385J1782L8624N2093
16708B37825P716n7953k6341l316K7898L8068M8903m0906K8693r515Q7375Q3508
16696D21955o200p9759m6343r0178q2150r728K033q696M9250J7699J1028k0859
16684A58052M6623n8599r0786j3782k9639j8456K0877J1892l5324J7916R8850
16673A07624K2152m6666o2082Q422o8021J1092O1177M4174L9229L1586m877l2369
16661A11441M4359P2832Q063l5440N1055R477l2021j7192P6667J10122o5869j43999
16649A89495j12381L3311L4487L5170l4535k0700l345M9567M032K6466M148m7823
16637A57892k5373k512k0252J4674n8053q7711j10904P903J05985J17995j8638
$$ plain form
16626 81006 36743 -52756 -18357 77918 31312 -21996 18310 90245 64321 33881 26100 16187
16614 16187 10808 49410 86264 93319 31207 -17949 6607 78051 83830 83063 129247 117543 61727
16601 61727 273 -12054 5454 19421 69873 53017 -29112 -89437 -109814 -132424 -127318 -136719
16589 -136719 -94629 -6777 -7899 -13534 99001 135322 65907 51696 74147 95823 112756 83448
16577 83448 44103 24115 49359 1752 -84983 -15440 86401 118162 32871 11386 16745 1411
16565 1411 25161 24556 -5589 -63961 -6814 60217 65767 11355 5257 1466 -14957 -7723 59977
16552 59977 91543 81847 83238 183394 159796 129731 89006 98957 168931 138837 116372 81518
16540 81518 12675 -13447 99853 109933 80532 71139 -11367 -16895 -35808 -83691 31998 108720
$$ packed form
16626H1006m4263q9499L4399R6275m6606n3308M0306P1935k5924l0440p781r913
16614A6187n379L8602L6854P055o2112m9156K4556P1444N779p67M6184j1704n5816
16601F1727o1454j2327J7508J3967N0452j6856q2129o0325k0377k2610N106r401
16589a36719M2090Q7852j122n635J12535L6321o9415j4211K2451K1676J6933k9308
16577H3448l9345j9988K5244m7607q6735O9543J01841L1761q5291k1485N359j5334
16565A411K3750o05l0145n8372N7147O7031N550n4412o098l791j6423P234O7700
16552E9977L1566r696J391J00156k3598l0065m0725R951O9974l0094k2465l4854
16540H1518o8843k6122J13300J0080k9401r393q2506n528j8913m7883J15689P6722
$$ plain form
16528 108720 60821 13032 -2500 12275 90785 94922 97958 112309 158275 140606 179220 228991
16516 228991 230767 147851 129990 120298 133593 134687 145020 133885 153843 87220 71418 86722
16504 86722 89188 57690 14702 28944 -71297 -30984 80221 34069 47052 133812 130868 84845
16492 84845 63702 27856 95198 174179 117547 89250 121366 94737 20262 31506 3298 -51476
16480 -51476 -67560 -35706 -36072 37934 33772 54927 58134 8148 -7227 -14645 -8341 22547 63114
16467 63114 20715 68529 70403 -4082 37958 43116 -24270 -142226 -188212 -130399 -89233 -97082
16455 -97082 -108262 -112281 -147230 -158257 -95542 -141861 -169502 -69202 -7237 -49673 3253 21047
16443 21047 53988 17950 62730 83368 -38993 -63163 -34427 -35354 -37544 -97479 -103672 -45116
$$ packed form
16528A08720m7899m7789j5532J4775P8510M137L036J4351M5966j7669L8614M9771
16516B28991J776q2916j7861r692J3295J094J0333j1135J9958o6623j5802J5304
16504H6722K466l1498m2988J4242j00241M0313J11205m6152J2983Q6760k944m6023
16492H4845k1143l5846O7342P8981n6632k8297L2116k6629p4475J1244k8208n4774
16480e1476j6084L1854l66P4006m162K1155L207m9986j5375p418O304L0888M0567
16467F3114m2399M7814J874p4485M2040N158o7386j17956m5986N7813M1166p849
16455i7082j1180m019l4949j1027O2715m6319k7641J00300O1965m2436N2926J7794
16443B1047L2941l6038M4780K0638j22361k4170K8736r27k190n9935o193N8556
$$ plain form
16431 -45116 -33921 -78676 -117777 -5984 91069 115059 14027 -88190 30893 -602 -103445
16420 -103445 -157772 -95359 -105276 -81890 -69327 -78867 -61852 -96325 -85962 -109743 -93456 -22850
16408 -22850 3896 15002 41126 70265 61290 -13810 -80467 -80711 -67457 -33810 -82537 -98296
16396 -98296 -57510 15867 46252 -24257 -81194 -38440 25099 43759 66423 83217 62634 -960
16384 -960 -15472 28207 48022 -94 8681 119476 126262 32897 -22103 -100484 -186385 -229457
16372 -229457 -70177 69874 104936 46283 -51369 -59481 -109708 -124316 -117486 -127323 -63442 31814
16360 31814 65038 61820 76036 48504 89814 18200 -32261 -18396 54079 9013 -29353 -49925
16348 -49925 -45025 -31298 -45695 -41703 -14612 -76672 -138702 -169917 -139794 -106956 -103948 -87687
$$ packed form
16431d5116J1195m4755l9101J11793R7053K3990j01032j02217J19083l1495j02843
16420a03445n4327O2413r917K3386J2563r540J7015l4473J0363k3781J6287P0606
16408b2850K6746J1106K6124K9139q975p5100o6657k44J3254L3647m8727j5759
16396i8296M0786P3377L0385p0509n6937M2754O3539J8660K2664J6794k0583o3594
16384i60j4512M3679J9815m8116Q775J10795O786r3365n5000p8381q5901m3072
16372b29457J59280J40051L5062n8653r7652q112n0227j4608O830r837O3881R5256
16360C1814L3224l218J4216k7532M1310p1614n0461J3865P2475m5066l8366k0572
16348d9925M900J3727j4397L992K7091o2060o2030l1215L0123L2838L008J6261
$$ plain form
16336 -87687 -6007 83569 47300 -46475 -119960 -133907 -84077 -107063 -67241 -22188 21942 32475
16324 32475 -64197 -53976 11852 32342 35436 37117 10471 44001 14350 62031 135094 171092
16312 171092 159611 96192 -18488 -36002 49174 119482 30627 -23663 -7588 20362 48811
16301 48811 25605 26245 28267 -36310 2500 66533 -36440 -82725 31635 2650 -111243 -61320
16289 -61320 -119281 -84539 -33993 -9405 -52200 -78304 -17309 -61591 -129785 -108887 -27054 25296
16277 25296 -14373 -29457 3489 -22321 9751 65736 21411 11657 68922 16985 -67945 -101448
16265 -101448 -77807 -76131 -50640 17283 -59086 -92939 -21335 20233 -25640 -41505 29775 79625
16253 79625 90794 9629 -62363 28497 45135 -81493 -127497 -35146 5292 -31289 -49540
$$ packed form
16336h7687Q1680Q9576l6269r3775p3485j3947M9830k2986L9822M5053M4130J0533
16324C2475r6672J0221O5828K0490L094J681k6646L3530k9651M7681P3063L5998
16312A71092j1481o3419j14680j7514Q5176P0308q8855n4290J6075K7950K8449
16301D8811k3206O40K022o4577L8810O4033j02973m6285J14360k8985j13893M9923
16289f1320n7961L4742N0546K4588m2795k6104O0995m4282o8194K0898Q1833N2350
16277B5296l9669j5084L2946k5810L2072N5985m4325r754N7265n1937q4930l3503
16265a01448K3641J676K5491O7923p6369l3853P1604M1568m5873j5865P1280M9850
16253G9625J1169q1165p1992R0860J6638j26628m6004R2351M0438l6581j8251
$$ plain form
16242 -49540 1189 -36821 -52876 28560 30950 42518 106469 48074 28650 -7701 32749 32391
16230 32391 115204 104945 39753 42477 5884 -37373 -72845 -97447 -38512 21978 56646 113903
16218 113903 80749 30875 -33408 1275 42612 56940 24663 -6837 -21272 3523 28991
16207 28991 -53680 -49823 13990 88344 76500 25652 -5572 -94210 -99492 -106943 -14571 83512
16195 83512 77081 37088 -120661 -159657 -170850 -144027 -46140 -706 86993 56174 -17721 -47086
16183 -47086 -80672 -39472 -28524 -72764 -94122 -59976 -97816 -36603 -10870 -5757 69741 85519
16171 85519 44747 -9794 -13576 23169 109709 125424 89438 -9175 -47324 -52156 -143156 -155464
16159 -155464 -91842 60976 136566 62758 1477 31004 38342 -28350 7119 57911 -48951
$$ packed form
16242d9540N0729l8010j6055Q1436K390J1568O3951n8395j9424l6351M0450l58
16230C2391Q2813j0259o5192K724l6593m3257l5472k4602N8935O0490L4668N7257
16218A13903l3154m9874o4283L4683M1337J4328l2277l1500j4435K4795K5468
16207B8991q2671L857O3813P4354j1844n0848l1224q8638n282p451R2372R8083
16195H3512o431l9993j57749l8996j1193K6823R7887M5434Q7699l0819p3895k9365
16183d7086l3586M1200J0948m4240k1358L4146l7840O1213K5733N113P5498J5778
16171H5519m0772n4541l782L6745Q6540J5715l5986r8613l8149m832r1000j2308
16159a55464O3622J52818P5590p3808o1281K9527P338o6692L5469N0792j06862
$$ plain form
16148 -48951 -75972 -17141 2385 73584 34319 -844 54655 67588 48899 25653 -32092 -32008
16136 -32008 -39439 -71572 -48404 33950 -14110 -75751 -87941 -117846 -76130 -72489 -35902 -40082
16124 -40082 -41516 7449 -1758 -98100 -112591 -209050 -216486 -131651 -111599 20287 31483 12563
16112 12563 54710 90087 89698 80099 76775 105553 24995 -9763 30427 36507 119393 148075 56887
16099 56887 -43102 -67631 -5847 17359 -24164 -96248 -92693 -60977 -6375 30266 64096 60074
16087 60074 95346 19487 31982 25239 -12300 -38065 -42079 5884 5287 -18910 -24065 -37888 -117001
16074 -117001 -39642 -32648 -77900 33256 130522 189085 225618 171498 158533 104989 57864
16063 57864 62935 56400 91205 125328 60058 36072 73966 67261 73754 79284 51127 -20323 -12462
$$ packed form
16148d8951k7021N8831J9526P1199l9265l5163N5499J2933j8689k3246n7745Q4
16136c2008p431l2133K3168Q2354m8060o1641j2190k9905M1716L641L6587m180
16124d0082j434M8965r207r6342j4491r6459p436Q4835K0052J31886J1196j8920
16112A2563M2147L5377l89r599l324K8778q0558l4758M0190O080Q2886K8682r1188
16099E6887r9989k4529O1784K3206m1523p2084L555L1716N4602L6641L3830m022
16087F0074L5272p5859J2495o743l7539k5765m014M7963n97k4197n155j3823p9113
16074a17001P7359O994m5252J11156R7266N8563L6533n4120j2965n3544m7125
16063E7864N071o535L4805L4123o5270k3986L7894o705O493N530k8157p1450P861
$$ plain form
16050 -12462 -25935 1866 28765 7525 36640 71053 50662 63966 42661 14449 53746 56977
16038 56977 17966 67112 92966 29033 66112 133074 185850 223492 287289 305326 273398 222315
16026 222315 245486 226776 327791 363262 246210 266857 236508 207576 191247 134249 144931
16015 144931 127438 125186 81957 109268 197673 190144 182693 227775 339164 391780 273299 186707
16003 186707 196887 291122 330329 328584 256763 308414 217884 182668 226505 224572 235788 240417
15991 240417 215376 167178 142968 171211 152155 70431 24661 -2564 21125 113173 102755
15980 102755 73389 105529 116576 132024 119193 93536 50640 13745 1668 22364 26421 90388
15968 90388 114134 121078 121442 129592 87663 36226 -26601 -102671 -46744 -49007 -56231 39277 73381
$$ packed form
16050a2462j3473K7801K6899k1240K9115L4413k0391J3304k1305k8212L9297L231
16038E6977l9011M9146K5854o3933L7079O6962N2776L7642O3797J8037l1928n1083
16026B22315K3171j8710J01015L5471j17052K0647l0349k8932j6329n6998J0682
16015A44931j7493k252m3229K7311Q8405p529p451M5082J11389N2616j18481q6592
16003A86707J0180R4235L9207j745p1821N1651r0530l5216M3837j933J1216M629
15991B40417k5041m8198k4210K8243j9056q1724m5770k7225K3689R2048j0418
15980A02755k9366L2140J1047J5448j2831k5657m2896l6895j2077K0696M057O3967
15968I0388K3746O944L64Q150m1929n1437o2827p6070N5927k263p224R5508L4104
$$ plain form
15955 73381 56296 29 -838 -47468 22947 101475 87327 138209 163458 59335 -56867 -61457
15943 -61457 -12330 19603 5476 -24941 20780 64619 133005 77943 9607 12621 89897 209798
15931 209798 185060 140916 101337 63886 8609 3853 -3280 -51233 23557 78103 20487 -38424
15919 -38424 -48032 10028 6242 -24871 -23859 547 -34898 -43573 1424 2247 -45050 -63753 -5433
15906 -5433 -53823 -103161 -86432 -49274 -9579 -11406 -48731 -33665 -18343 -14646 59673 -33328
15894 -33328 -106301 -53150 -5966 27147 34391 -70775 -41693 -29066 -23310 -28929 -41633 18548
15882 18548 62320 101414 126872 104307 13714 -59684 -142268 -62139 -99697 -44607 -2137 9034
15870 9034 84702 152730 161933 105560 -19974 -78690 -83119 48201 62733 41627 54670 106293
$$ packed form
15955G3381j7085n6267q67m6630P0415P8528j4148N0882K5249j04123j16202m590
15943f1457M9127L1933j4127l0417M5721M3839O8386n5062o8336L014P7276J19901
15931B09798k4738m4144l9579l7451n5277m756p133m7953P4790N4546n7616n8911
15919c8424r608N8060l786l1113J012K4406l5445q675M4997Q23m7297j8703N8320
15906e433m8390m9338J6729L7158L9695j827l7325J5066J5322L697P4319r3001
15894c3328p2973N3151M7184L3113P244j05166K9082J2627N756n619j2704O0181
15882A8548M3772L9094K5458k2565r0593p3398q2584Q0129l7558N5090M2470J1171
15870I034P5668O8028R203n6373j25534n8716m429J31320J4532k1106J3043N1623
$$ plain form
15858 106293 122197 105256 -32711 -88677 39386 110850 101560 79594 85296 48559 92936
15847 92936 98166 35721 18087 1943 -38937 -80386 -75671 -83412 -68104 -68978 -71054 -4436 89569
15834 89569 -1068 -56150 -52340 -12619 35565 23175 -2172 -31719 -2043 -23997 -48024 -40866
15822 -40866 -62884 -137258 -87368 5784 -53594 -297 4867 -81180 -143553 -155502 -148864 -123388
15810 -123388 -27459 23752 45842 -11808 7385 -26681 -59923 -85493 -11525 8593 -120892
15799 -120892 -83039 -61279 -74126 -95216 -111278 -28305 -37257 -117624 -103722 -65743 -7390 56607
15787 56607 85830 138201 40397 25539 88279 103877 24087 70499 141794 195643 170783 181089
15775 181089 104847 18738 -72430 -108687 -38372 -33461 39046 74999 107021 61569 -20443 -90340
$$ packed form
15858A06293J5904j6941j37967n5966J28063P1464r290k1966N702l6737M4377
15847I2936N230o2445j7634j6144m0880m1449M715p741J5308q74k076O6618R4005
15834H9569r0637n5082L810L9721M8184j2390k5347k9547K9676k1954k4027P158
15822d0866k2018p4374M9890R3152n9378N3297N164q6047o2373j1949O638K5476
15810a23388R5929N1211K2090n7650J9193l4066l3242k5570P3968K0118j29485
15799a20892L7853K1760j2847k1090j6062Q2973q952q0367J3902L7979N8353O3997
15787E6607K9223N2371r7804j4858O2740J5598p9790M6412P1295N3849k4860J0306
15775A81089p6242q6109r1168l6257P0315M911P2507L5953L2022m5452q2012o9897
$$ plain form
15763 -90340 -131812 -68846 59747 30804 -10405 -42888 23353 30084 -4624 93561 101606 25607
15751 25607 102132 112648 107702 67481 -73640 -140564 -63815 -5428 89689 94525 106133 97889
15739 97889 15825 -30001 -16125 -10459 14462 52719 59841 41595 31877 -38244 -7974 8658
15727 8658 -66965 -72742 -73135 -58276 -69299 -21356 -40408 -118652 -188558 -184732 -110110 -59535 -22513
15714 -22513 -53643 -86978 -40308 -39139 -28868 42359 29203 -84461 -135496 -29939 9743
15703 9743 64730 20370 -52739 -53202 -68865 -20775 67841 23598 901 56375 98376 73173
15691 73173 80642 78638 65479 77269 91070 96394 1298 -110369 -77695 -95237 -102350 44253
15679 44253 58007 -37302 -34306 -13163 -21231 -66690 -37453 1424 1473 25629 -36917 -110469 -28810
$$ packed form
15763i0340m1472O2966J28593k8943m1209l2483O6241O731l4708R8185Q045p5999
15751B5607P6525J0516m946m0221j41121o6924P6749N8387R5117M836J1608q244
15739I7889q2064m5826J3876N666K4921L8257P122j8246r718p0121L0270J6632
15727H658p5623n777l93J4859j1023M7943j9052p8244o9906L826P4622N0575L7022
15714b2513l1130l3335M6670J169J0271P1227j3156j13664n1035J05557L9682
15703I743N4987m4360p3109m63j5663M8090Q8616m4243k2697N5474M2001k5203
15691G3173P469k004j3159J1790J3801N324r5096j11667L2674j7542p113J46603
15679D4253J3754r5309K996K1143q068m5459K9237L8877M9K4156o2546p3552Q1659
$$ plain form
15666 -28810 20786 -28824 -59980 -33590 88928 92888 62065 44349 10860 -48280 -96518 -57038
15654 -57038 -37319 -36048 -37427 -48315 -13890 110336 145354 68338 75051 88240 42812 4049
15642 4049 28840 -26590 -84770 -130786 -81740 -118299 -45172 -84556 -107578 -128889 -76729 -60621
15630 -60621 -65161 -42874 -45524 -116126 -118413 -83956 -121624 -132198 -10310 75811 22813 -47732
15618 -47732 -123532 -142193 -27239 49978 18167 -7519 -39896 -14380 -86750 -139409 -123113
15607 -123113 -70629 -7927 25713 159 -45177 -38700 -44080 28553 20652 -47535 -56243 -35963
15595 -35963 -50241 6621 93988 84805 84122 52842 26731 -21627 -93757 -160548 -148819 -54102
15583 -54102 -11848 -4090 25470 13920 -27460 3055 -15198 -8684 38359 26732 19525 24702
$$ packed form
15666b8810M9596m9610l1156K6390J22518L960l0823j7716l3489n9140m8238L9480
15654e7038J9719J271j379j0888L4425J24226L5018p7016O713J3189m5428l8763
15642D049K4791n5430n8180m6016M9046l6559P3127l9384k3022k1311N2160J6108
15630f0621m540K2287k650p0602k287L4457l7668j0574J21888Q6121n2998p0545
15618d7732p5800j8661J14954P7217l1811k5686l2377K5516p2370n2659J6296
15607a23113N2484O2702L3640k5554m5336O477n380P2633p901o8187q708K0280
15595c5963j4278N6862Q7367r183o83l1280k6111m8358p2130o6791J1729R4717
15583e4102M2254P758K9560j1550m1380L0515j8253O514M7043j1627p207N177
$$ plain form
15571 24702 -7141 -106375 -142793 -128136 -115817 -156448 -193818 -174001 -141640 -24265 1047
15560 1047 -16133 9531 -26674 -69267 -50522 -18939 -73444 -77164 -14320 -36464 -9952 -44864
15548 -44864 38111 144419 140653 234780 191467 55333 29827 12430 -56231 31525 -10404
15537 -10404 -41760 -44295 28277 65663 18700 18432 61171 18341 8295 1309 19186 -1558
15525 -1558 77164 130208 133551 88860 49013 15758 18772 26499 -32443 -73577 -39409 -68000
15513 -68000 -86040 -16634 90301 150102 141683 77095 24150 -45273 -1791 -18872 14532 79304
15501 79304 74420 23395 24678 6432 -35207 -52735 -41962 -7679 3448 11358 31369 -19696
15489 -19696 -45074 -57403 -29944 -75889 -135918 -122838 -42607 44480 112009 188034 91276 60005
$$ packed form
15571B4702l1843r9234l6418J4657J2319m0631l7370J9817L2361J17375K5312
15560A047j7180K5664l6205m2593J8745L1583n4505l720O2844k2144K6512l4912
15548d4864Q2975J06308l766R4127m3313j36134k5506j7397o8661Q7756m1929
15537a0404l1356k535P2572L7386m6963k68M2739m2830j0046o986J7877k0744
15525a558P8722N3044L343m4691l9847l3255L014P727n8942m1134L4168k8591
15513f8000j8040O9406J06935N9801q419o4588n2945o9423M3482j7081L3404O4772
15501G9304m884n1025J283j8246m1639j7528J0773L4283J1127P910K0011n1065
15489a9696k5378j2329K7459m5945o0029J3080Q0231Q7087O7529P6025r6758l1271
$$ plain form
15477 60005 -79539 -131064 -69694 -110694 -133029 -150177 -136025 -125903 -97358 -62705 -6271
15466 -6271 48492 899 -64306 -38163 12944 74955 52817 14403 30455 45672 59687 111172
15454 111172 92988 64592 9335 -111675 -90567 -8341 -13940 -125752 -77107 -97298 -169264
15443 -169264 -171105 -127172 -29360 -7092 -905 57003 81751 -83 13254 -5889 -23786 -45445
15431 -45445 -8943 93937 73990 53682 125454 143111 87678 1 -21200 -59862 -91750
15420 -91750 -30175 -9401 -20414 78821 75244 -7163 -70868 -194009 -231149 -174744 -132722 -91887
15408 -91887 -40772 -79361 -85576 1653 -14106 -11902 -142517 -172760 -95813 -67755 -58882 34214
15396 34214 -4887 -76208 -113027 -81373 -84635 -23274 64561 80920 4815 -69459 -50736 16853
$$ packed form
15477F0005j39544n1525O1370m1000k2335j7148J4152J0122K8545L4653N6434
15466f271N4763m7593o5205K6143N1107O2011k2138l8414J6052J5217J4015N1485
15454A11172j8184k8396n5257j21010K1108Q2226n599j11812M8645k0191p1966
15443a69264j841M3933R7812K2268O187N7908K4748q1834J3337j9143j7897k1659
15431d5445L6502J02880j9947k0308P1772J7657n5433q7677k1201l8662l1888
15420i1750O1575K0774j1013R9235l577q2407o3705j23141l7140N6405M2022M0835
15408i1887N1115l8589o215Q7229j5759K204j30615l0243P6947K8058Q873R3096
15396C4214l9101p1321l6819L1654l262O1361Q7835J6359p6105p4274J8723O7589
$$ plain form
15384 16853 -24528 -17000 -62796 -61591 -13533 -18198 -24285 -37449 12087 -15142 -41826 -22362
15372 -22362 -15621 56006 108380 87025 82873 136836 103168 56484 1487 28280 -21001 -72531
15360 -72531 3084 63882 51346 -87044 -190527 -200500 -195059 -169970 -92404 -61916 -84498 -103233
15348 -103233 -145052 -89524 -89116 -126689 -145326 -100685 -77344 -89707 -69219 -48418 18952 75472
15336 75472 22881 -111384 -161719 -73776 -18052 -36064 -6158 -54711 -108247 -129014 -101556
15325 -101556 -109576 -133996 -102111 -91821 -4868 47838 -2959 -69358 -122879 -91727 504 -29833
15313 -29833 -20959 -55785 -55499 -59747 -45293 10647 37849 127751 131725 98505 64656 32786 -16403
15300 -16403 -31842 -50833 34722 -3407 12419 -40992 -109236 -109071 -116538 -21813 21807 15153
$$ packed form
15384A6853m1381P528m5796J205M8058m665o087j3164M9536k7229k6684J9464
15372b2362O741P1627N2374k1355m152N3963l3668m6684n4997K6793m9281n1530
15360g2531P5615O0798j2536j38390j03483r973N441K5089P7566L0488k2582j8735
15348a03233m1819N5528M08l7573j8637M4641K3341j2363K0488K0801O7370N6520
15336G5472n2591j34265n0335Q7943N5724j8012K9906m8553n3536k0767K7458
15325a01556q020k4420L1885J0290Q6953N2706n0797o6399n3521L1152R2231l0337
15313b9833Q874l4826K86m248J4454N5940K7202Q9902L974l3220l3849l1870m9189
15300a6403j5439j8991Q5555l8129J5826n3411o8244J65p467R4725M3620o654
$$ plain form
15288 15153 57799 -37866 -107169 -33258 -94273 -114070 -28496 -15183 -14527 -21121 61260 117665
15276 117665 107764 108376 102285 51026 -7095 -26688 17500 18131 13703 20413 14051 11438 51508
15263 51508 49502 109143 110943 139414 48601 -24094 -5296 27094 -4834 -86441 -61957 26653
15251 26653 125066 162417 50253 37258 56560 10370 -31111 -24775 28717 -23789 -27625 -9365
15239 -9365 33817 7867 -26124 -8853 -34243 -85338 -79369 -100687 -95175 -59713 -15015 91836
15227 91836 120146 90395 76263 110055 67840 42100 49741 25690 -18781 -78330 -71232 -6243
15215 -6243 -14437 19812 49127 95163 -85543 -88318 -32112 -23996 -32267 -123016 -103906 6739
15203 6739 26611 65747 63742 44082 78999 178773 157185 161946 65049 -11764 156336 170114
$$ packed form
15288A5153M2646r5665o9303P3911o1015j9797Q5574J3313O56o594Q2381N6405
15276A17665r901O12o091n1259n8121j9593M4188O31m428O710o362k613M0070
15263E1508k006N9641J800K8471r0813p2695J8798L2390l1928q1607K4484Q8610
15251B6653R8413L7351j12164j2995J9302m6190m1481O336N3492n2506l836J8260
15239i365M3182k5950l3991J7271k5390n1095N969k1318N512L5462M4698J06851
15227I1836K8310k9751j4132L3792m2215k5740P641k4051m4471n9549P098O4989
15215f243q194L4249K9315M6036j80706k775N6206Q116q271r0749J9110J10645
15203F739J9872L9136k005j9660L4917R9774k1588M761r6897p6813J68100J3778
$$ plain form
15191 170114 140284 125312 -33609 -77184 -48177 -24617 -31608 -13775 -49786 -83686 -71836
15180 -71836 -98500 -183150 -203753 -127933 -127876 -71945 -1266 23520 9630 21325 38930 62456
15168 62456 -17267 -43622 -100934 -94822 -26216 -31119 -12442 -31013 -60726 -99393 -13272 19343
15156 19343 -1764 -54132 -58169 -89270 -125849 -52214 17534 4111 -49692 -120563 -195712 -158964
15144 -158964 -93831 -39186 21589 30648 -38158 21802 40742 29952 69458 127914 155969 100701
15132 100701 -1192 -18327 -18734 -1327 53686 147877 149380 103050 115131 154706 201917 212211
15120 212211 180110 142883 99805 103788 136428 118178 72217 -17582 -72314 -5294 76004 74846
15108 74846 -16486 -14160 53137 106431 54021 -37629 -50230 -2223 78834 109930 129414 93772
$$ packed form
15191A70114k9830j4972j58921m3575K9007K3560o991J7833l6011l3900J1850
15180g1836k6664q4650k0603P5820N7N5931P0679K4786j3890J1695J7605K3526
15168F2456p9723k6355n7312O112O8606m903J8677j8571k9713l8667Q6121L2615
15156A9343k1107n2368m037l1101l6579P3635O9748j3423n3803p0871p5149L6748
15144a58964O5133N4645O0775R059o8806N9960J8940j0790L9506N8456K8055n5268
15132A00701j01893j7135m07J7407N5013R4191J503m6330J2081L9575M7211J0294
15120B12211l2101l7227m3078L983L2640j8250m5961q9799n4732O7020Q1298j158
15108G4846r1332K326O7297N3294n2410r1650j2601M8007Q1057L1096J9484l5642
$$ plain form
15096 93772 82448 170141 182100 181527 129084 123267 145835 63553 29168 -9300 -28167 -87028
15084 -87028 -100398 -170621 -116100 -47257 -81794 -77951 -92177 -101839 -39879 57702 163141 245574
15072 245574 126386 -12761 -38477 -46430 -61309 -13431 33205 125447 70270 56624 -8110
15061 -8110 -78648 43354 181316 217463 249215 196790 78162 37586 78360 105256 120749
15050 120749 62338 -1045 37903 10993 -66354 -80013 36047 11895 -22829 -3490 108010
15039 108010 85005 54521 -12101 -118324 -168036 -84507 7242 -4189 -25246 -7018 -755
15028 -755 21731 44416 15981 44332 44565 9089 2931 -45887 27669 16072 -99 90546 87223
15015 87223 8491 -17760 29726 4014 62634 71209 56889 90644 92351 120312 100531 153947
$$ packed form
15096I3772j1324Q7693J1959n73n2443n817K2568q2282l4385l8468j8867n8861
15084h7028j3370p0223N4521O8843l4537L843j4226r662O1960R7581J05439Q2433
15072B45574j19188j39147k5716p953j4879M7878M6636R2242n5177j3646o4734
15061h110p0538J22002J37962L6147L1752n2425j18628m0576M0774K6896J5493
15050A20749n8411o3383L8948k6910p7347j3659J16060k4152l4724J9339J11500
15039A08010k3005l0484o6622j06223m9712Q3529R1749j1431k1057J8228O263
15028g55K2486K2685k8435K8351K33l5476o158m8818P3556j1597j6171R0645l323
15015H7223p8732k6251M7486k5712N8620Q575j4320L3755J707K7961j9781N3416
$$ plain form
15003 153947 179760 123100 37913 13872 -18503 -19800 6271 93383 127594 203328 157730 118499
14991 118499 88618 128357 189117 131350 154991 84099 12959 -485 -75805 -42390 3913
14980 3913 -86169 -123402 -40104 21537 15957 9842 5642 -41016 89234 153882 204510 260670
14968 260670 257875 252749 299252 250141 117840 65046 81578 160500 207856 260937 320887 317878
14956 317878 336118 408976 375950 360612 378394 420519 340319 375091 333141 250353 261138
14945 261138 239626 244408 257729 289103 282093 313164 304109 290733 241975 193279 86618 65542
14933 65542 95484 188828 216336 205930 137192 45332 27217 79666 75285 129314 158340 206579
14921 206579 208714 132543 176749 169916 168610 152071 141959 274876 344867 281762 331881 332289
$$ packed form
15003A53947K5813n6660q5187k4041l2375j297K6071Q7112L4211P5734m5598l9231
14991A18499k9881L9739O0760n7767K3641p0892p1140j3444p5320L3415M6303
14980C913r0082l7233Q3298O1641n580o115m200m6658J30250O4648N0628N6160
14968B60670k795n126M6503m9111j32301n2794J6532P8922M7356N3081N9950l009
14956C17878J8240P2858l3026j5338J7782M2125q0200L4772m1950q2788J0785
14945B61138k1512M782J3321L1374p010L1071r055j3376m8758m8696j06661k1076
14933F5542K9942R3344K7508j0406o8738r1860j8115N2449m381N4029K9026M8239
14921B06579K135p6171M4206o833j306j6539j0112J32917O9991o3105N0119M08
$$ plain form
14909 332289 315503 217114 64147 96345 167056 163036 142513 129265 134069 207324 167923 81487
14897 81487 169888 330202 297500 243950 229894 225855 255872 283310 302398 284030 200109 158397
14885 158397 227527 195031 206967 281923 332127 353838 392301 352530 233564 226565 303745
14874 303745 282286 280638 240752 227842 267619 365794 417978 445569 391059 387340 307003 302205
14862 302205 334293 348478 334114 364862 482014 493104 544060 458309 376114 376504 389232 271710
14850 271710 278455 320662 314497 308863 377654 420510 362136 333471 393038 442062 485192 517770
14838 517770 472595 452949 422427 374074 305693 369541 427887 408861 399788 461376 480200 516143
14826 516143 595879 555608 494960 533611 587312 536617 475966 476304 543763 546602 488809 494692
$$ packed form
14909C32289j6786r8389j52967L2198P0711m020k0523j3248M804P3255l9401q6436
14897H1487Q8401J60314l2702n3550j4056m039L0017K7438J9088j8368q3921m1712
14885A58397O9130l2496J1936P4956N0204K1711L8463l9771j18966o999P7180
14874C03745k1459j648l9886j2910L9777R8175N2184K7591n4510l719q0337m798
14862C02205L2088J4185j4364L0748J17152J1090N0956q5751q2195L90J2728j17522
14850B71710O745M2207o165n634O8791M2856n8374k8665N9567M9024M3130L2578
14838E17770m5175j9646l0522m8353o8381O3848N8346j9026r073O1588J8824L5943
14826E16143P9736m0271o0648L8651N3701n0695o0651L38O7459K839n7793N883
$$ plain form
14814 494692 502102 457111 432125 498331 462598 518185 603829 513360 454927 496278 512191 514541
14802 514541 599458 711063 808350 792949 807776 811314 810317 850850 866283 863403 900372 898043
14790 898043 843531 858153 938880 948030 874036 863529 884125 904177 896796 990634 1038461 1013966
14778 1013966 1065715 1085064 1123554 1133322 1191091 1218727 1200876 1177169 1188874 1253517 1314528
14767 1314528 1372525 1442296 1490143 1624951 1631067 1482810 1547402 1645068 1690739 1712537 1839930
14756 1839930 1883864 1932704 1997619 2122706 2232524 2345823 2488997 2555226 2549269 2541665 2512556
14745 2512556 2672121 2798729 2947663 3133870 3245478 3341336 3434069 3578522 3770090 3954997
14735 3954997 4186047 4463431 4644531 4814694 4963946 5140833 5428063 5766126 6069677
$$ packed form
14814D94692P410m4991k4986O6206l5733N5587Q5644r0469n8433M1351J5913K350
14802E14541Q4917J11605R7287j5401J4827L538r97M0533J5433k880L6969k329
14790H98043n4512J4622Q0727R150p3994j0507K0596K0052p381R3838M7827k4495
14778A013966N1749J9349L8490R768N7769K7636j7851k3707J1705O4643O1011
14767A314528N7997O9771M7847J34808O116j48257O4592R7666M5671K1798J27393
14756A839930M3934M8840O4915J25087J09818J13299J43174O6229n957p604k9109
14745B512556J59565J26608J48934J86207J11608R5858R2733J44453J91568J84907
14735C954997K31050K77384J81100J70163J49252J76887K87230L38063L03551
$$ plain form
14726 6069677 6395518 6773886 7014212 7385485 7783399 8226818 8695030 9182082 9769836
14717 9769836 10392548 11082924 11742605 12513707 13377319 14401861 15493937 16699303 17921983
14708 17921983 19245469 20816086 22426958 24208289 26198113 28323487 30612549 33102803
14700 33102803 35758665 38585349 41482683 44481452 47539692 50589686 53414184 55831936
14692 55831936 57819008 59332160 60212449 60369964 59834977 58701277 56967261 54743427
14684 54743427 52122051 49242526 46285205 43297282 40329268 37489728 34884235 32368348
14676 32368348 29909329 27787439 25855664 24039234 22370394 20882378 19479192 18201871
14668 18201871 17024788 15879735 14805445 13879917 13117138 12382614 11731646 11195060 10558796
$$ packed form
14726F069677L25841L78368K40326L71273L97914M43419M68212M87052N87754
14717I769836O22712O90376O59681P71102Q63612J024542J092076J205366J222680
14708A7921983J323486J570617J610872J781331J989824K125374K289062K490254
14700C3102803K655862K826684K897334K998769L058240L049994K824498K417752
14692E5831936J987072J513152Q80289J57515n34987j133700j734016k223834
14684E4743427k621376k879525k957321k987923k968014k839540k605493k515887
14676C2368348k459019k121890j931775j816430j668840j488016j403186j277321
14668A8201871j177083j145053j074290r25528p62779p34524o50968n36586o36264
$$ plain form
14659 10558796 9931150 9408176 8931295 8437187 8029095 7673120 7295604 6951292 6616651
14650 6616651 6326518 6040647 5810932 5525859 5277755 5141420 4887732 4630719 4497995
14641 4497995 4360800 4207491 4066135 3929130 3846310 3687530 3497569 3382422 3269179 3161634
14631 3161634 3088913 3051373 2886167 2790000 2654962 2486803 2403133 2484369 2506710 2405046
14621 2405046 2287689 2237852 2222332 2207651 2181202 2082745 2006739 1852859 1698007 1651323 1676599
14610 1676599 1651986 1624226 1711334 1740278 1697795 1632707 1486463 1388907 1415004 1372751 1393515
14599 1393515 1346327 1235906 1194973 1167487 1166818 1168847 1117988 1077609 1099032 1147019 1141132 1184936
14587 1184936 1260662 1188688 1185384 1141638 956703 851982 873054 896111 895782 918484 885640
$$ packed form
14659A0558796o27646n22974m76881m94108m08092l55975l77516l44312l34641
14650F616651k90133k85871k29715k85073k48104j36335k53688k57013j32724
14641D497995j37195j53309j41356j37005q2820j58780j89961j15147j13243j07545
14631C161634p2721l7540j65206r6167j35038j68159q3670Q1236K2341j01664
14621B405046j17357m9837j5520j4681k6449r8457p6006j53880j54852m6684K5276
14610A676599k4613k7760Q7108K8944m2483o5088j46244r7556K6097m2253K0764
14599A393515m7188j10421m0933k7486o69K029n0859m0379K1423M7987n887M3804
14587A184936P5726p1974l304m3746j84935j04721K1072K3057l29K2702l2844
$$ plain form
14576 885640 904604 1015901 1018716 1008623 994559 883387 848225 943631 1008220 1049382 1007695
14565 1007695 977998 929921 908322 921577 904242 935845 961801 976332 985197 849390 779829
14554 779829 737345 683692 628010 617135 630381 683007 796785 806266 747286 701177 707408 740552
14542 740552 792534 788406 840883 774426 698037 667121 613910 637405 678345 758956 722679 738025
14530 738025 754313 748643 773941 795448 780308 735737 816695 869127 882543 833762 803888 881803
14518 881803 840071 724238 634514 612954 644677 624506 541300 520711 491991 545485 544717 556526
14506 556526 541578 528821 495733 410968 423497 429428 415711 409451 447980 531193 453596 368467
14494 368467 376404 414990 481966 483286 457858 468158 441626 375384 389429 458928 402690 385147
$$ packed form
14576H85640J8964J11297K815j0093j4064j11172l5162R5406O4589M1162m1687
14565A007695k9697m8077k1599J3255j7335L1603K5956J4531Q865j35807o9561
14554G79829m2484n3653n5682j0875J3246N2626J13778R481n8980m6109O231L3144
14542G40552N1982m128N2477o6457p6389l0916n3211K3495M0940Q0611l6277J5346
14530G38025J6288n670K5298K1507j5140m4571Q0958N2432J3416m8781k9874P7915
14518H81803m1732j15833q9724k1560L1723k0171q3206k0589k8720N3494p68J1809
14506E56526j4948j2757l3088q4765J2529N931j3717o260L8529Q3213p7597q5129
14494C68467P937L8586O6976J320k5428J0300k6532o6242J4045O9499n6238j7543
$$ plain form
14482 385147 406702 327887 267720 388444 462106 423738 432369 421655 472001 534454 501476
14471 501476 508267 562537 531197 544857 583052 599622 563391 511892 458698 529405 501307 489950
14459 489950 511403 579928 583010 583084 583416 598141 543082 481880 511857 592168 634173 563311 551232
14446 551232 520867 475390 437805 474854 554756 678056 708068 636265 531309 582169 644985
14435 644985 620926 642418 619421 492570 463556 559625 601760 719885 830403 848552 757179
14424 757179 765972 770753 728184 802439 805167 766802 800171 840146 814799 765863 742584 763379
14412 763379 850675 784294 741994 729472 731558 722851 689456 554012 530937 553485 583902 525870
14400 525870 545832 551536 564061 540605 557907 611541 574167 514352 509977 570561 613188 610675
$$ packed form
14482C85147K1555p8815o0167J20724P3662l8368Q631j0714N0346O2453l2978
14471E01476O791N4270l1340J3660L8195J6570l6231n1499n3194P0707k8098j1357
14459D89950K1453O8525L082P4L32J4725n5059o1202K9977Q0311M2005p0862j2079
14446E51232l0365m5477l7585L7049P9902J23300L0012p1803j04956N0860O2816
14435F44985k4059K1492k2997j26851k9014R6069M2135J18125J10518J8149r1373
14424G57179Q793M781m2569P4255K728l8365L3369L9975k5347m8936k3279K0795
14412G63379Q7296o6381m2300j2522K086q707l3395j35444k3075K2548L0417n8032
14400E25870J9962N704J2525k3456J7302N3634l7374n9815m375O0584M2627k513
$$ plain form
14388 610675 560440 646025 720695 687367 647136 624326 668706 705090 760855 903671 932099
14377 932099 856101 855431 891194 908041 895260 880889 900779 896599 820011 788876 714194 825465
14365 825465 946394 874801 855436 954968 1026893 1028784 1002242 1083513 1214835 1369434 1426216
14354 1426216 1410992 1433985 1441356 1393172 1343354 1352771 1361280 1408499 1420224 1469373 1511801 1608649
14342 1608649 1689340 1759434 1781459 1791441 1829253 1833454 1901390 2110966 2169328 2107449 2098907 2108390
14330 2108390 2157748 2264925 2346709 2434800 2559761 2681922 2860785 3042104 3156543 3232405
14320 3232405 3341275 3450018 3587853 3752163 3928549 4078672 4280163 4418591 4607670
14311 4607670 4795109 4899494 5135626 5391655 5629104 5904706 6227506 6570184 6877786
$$ packed form
14388F10675n0235Q5585P4670l3328m0231k2810M4380L6384N5765J42816K8428
14377I32099p5998o70L5763J6847j2781j4371J9890m180p6588l1135p4682J11271
14365H25465J20929p1593j9365R9532P1925J891k6542Q1271J31322J54599N6782
14354A426216j5224K2993P371m8184m9818R417Q509M7219J1725M9149M2428R6848
14342A608649Q0691P0094K2025R982L7812M201O7936K09576N8362o1879q542R483
14330B108390M9358J07177Q1784Q8091J24961J22161J78863J81319J14439P5862
14320C232405J08870J08743J37835J64310J76386J50123K01491J38428J89079
14311D607670J87439J04385K36132K56029K37449K75602L22800L42678L07602
$$ plain form
14302 6877786 7207849 7602750 7946837 8383037 8858338 9388541 9962116 10572838 11273060
14293 11273060 12040747 12881398 13746295 14608897 15571215 16647391 17906207 19248010 20695007
14284 20695007 22272118 24035477 25957521 27956549 30088342 32379512 34817746 37455249
14276 37455249 40142853 42928763 45697283 48544273 51079690 53260690 55005033 56355341
14268 56355341 57241647 57526985 57202346 56174986 54665015 52785097 50600749 48180041
14260 48180041 45564120 42763982 40060510 37290600 34736666 32413390 30191260 28173756
14252 28173756 26182915 24418641 22788134 21261423 19868347 18501794 17340847 16287307
14244 16287307 15285539 14322334 13482155 12742824 12026721 11341038 10713298 10187190 9715850
$$ packed form
14302F877786L30063L94901L44087M36200M75301N30203N73575O10722P00222
14293A1273060P67687Q40651Q64897Q62602R62318J076176J258816J341803J446997
14284B0695007J577111J763359J922044J999028K131793K291170K438234K637503
14276C7455249K687604K785910K768520K846990K535417K181000J744343J350308
14268E6355341Q86306K85338l24639j027360j509971j879918k184348k420708
14260D8180041k615921k800138k703472k769910k553934k323276k222130k017504
14252B8173756j990841j764274j630507j526711j393076j366553j160947j053540
14244A6287307j001768r63205q40179p39331p16103o85683o27740n26108m71340
$$ plain form
14235 9715850 9164631 8596656 8185483 7743282 7453498 7140234 6710946 6425022 6216777
14226 6216777 5975292 5780451 5596463 5356960 5065643 4811486 4715533 4625930 4426738 4226613
14216 4226613 4000061 3915255 3764410 3603711 3492832 3478696 3304317 3156874 3087800 3077809
14206 3077809 2984196 2815182 2656197 2639558 2577150 2527838 2453374 2400329 2303598 2255725 2203602
14195 2203602 2234581 2199389 2088095 1995190 1906103 1868057 1791659 1803325 1841618 1800485 1782752
14184 1782752 1770269 1646346 1526199 1501320 1498754 1435515 1412495 1478931 1485931 1418837 1328537
14173 1328537 1284230 1239829 1260293 1250448 1241155 1223057 1189179 1125217 1143881 1122969 1087611 1067197
14161 1067197 1066858 1042467 1062964 1065079 1020522 943377 853107 945875 959394 896797 871532 914363
$$ packed form
14235I715850n51219n67975m11173m42201k89784l13264m29288k85924k08245
14226F216777k41485j94841j83988k39503k91317k54157r5953q9603j99192k00125
14216D226613k26552q4806j50845j60699j10879j4136j74379j47443o9074r991
14206C077809r3613j69014j58985j6639o2408m9312p4464n3045r6731m7873n2123
14195B203602L0979l5192j11294r2905q9087l8046p6398J1666L8293m1133j7733
14184A782752j2483j23923j20147k4879k566o3239k3020O6436P000o7094r0300
14173A328537m4307m4401K0464r845r293j8098l3878o3962J8664k0912l5358k0414
14161A067197l39k4391K0497K115m4557p7145r0270R2768J3519o2597k5265M2831
$$ plain form
14149 914363 983033 990755 1000532 964437 916434 890581 886624 857207 863574 854966 765269 785097
14137 785097 830209 805899 814081 892730 872969 713744 620274 659872 743092 725749 721927 748182
14125 748182 696150 657228 615582 613598 536173 486573 484861 466115 501451 471051 496845 488974
14113 488974 467200 531430 521206 460552 490649 582630 586256 580373 552615 528469 594309 633583
14101 633583 603361 614679 617158 549033 546435 649275 717774 643501 607305 655626 651437 573018
14089 573018 567966 608185 585020 632057 574476 521402 468182 367043 454261 490320 475951
14078 475951 494950 440243 402016 461407 472933 390412 374158 297529 295104 325466 355298 389277
14066 389277 321578 259992 243374 298911 331382 292227 374546 357320 313458 252941 258060 135803
$$ packed form
14149I14363O8670P722R777l6095m8003k5853l957k9417O367q608q9697J9828
14137G85097M5112k4310Q182P8649j9761j59225r3470L9598Q3220j7343l822K6255
14125G48182n2032l8922m1646j984p7425m9600j712j8746L5336l0400K5794p871
14113D88974k1774O4230j0224o0654L0097R1981L626n883k7758k4146O5840L9274
14101F33583l0222J1318K479o8125k598J02840O8499p4273l6196M8321m189p8419
14089E73018n052M0219k3165M7037n7581n3074n3220j01139Q7218L6059j4369
14078D75951J8999n4707l8227N9391J1526q2521j6254p6629k425L0362K9832L3979
14066C89277o7699o1586j6618N5537L2471l9155Q2319j7226m3862o0517N119j22257
$$ plain form
14054 135803 69123 55404 129754 209444 247805 196974 258108 288104 322072 267128 161952
14043 161952 147088 290777 287703 287722 260294 269429 219760 231086 252206 262682 261628 230195
14031 230195 237301 275928 333742 315792 329699 269218 212258 171219 131876 185391 204671 210321
14019 210321 279011 301634 186232 119417 149372 215726 394852 481548 506506 499291 557550
14008 557550 550588 485479 387602 369380 344574 288929 259514 259109 322606 321126 231763 219137
13996 219137 218527 260856 230243 231185 241990 300258 327948 309310 273422 353310 389308 411670
13984 411670 322393 259964 243103 236338 222413 131610 126669 24794 22879 101561 129157 198731
13972 198731 214574 231913 262278 264611 230673 99635 26510 103536 233293 256944 193352
$$ packed form
14054A35803o6680j3719P4350P9690L8361n0831O1134K9996L3968n4944j05176
14043A61952j4864J43689l074J9k7428R135m9669J1326K1120J0476j054l1433
14031B30195P106L8627N7814j7950J3907o0481n6960m1039l9343N3515J9280N650
14019B10321O8690K2623j15402o6815K9955O6354J79126Q6696K4958p215N8259
14008E57550o962o5109r7877j8222k4806n5645k9415m05O3497j480q9363j2626
13996B19137o10M2329l0613R42J0805N8268K7690j8638l5888P9888L5998K2362
13984D11670q9277o2429j6861o765j3925r0803m941j01875j915P8682K7596O9574
13972A98731J5843J7339L0365K333l3938j31038p3125P7026J29757K3651o3592
$$ plain form
13961 193352 89328 98516 174369 230970 203618 103244 25272 73514 76555 170527 251656
13950 251656 233155 148061 122490 126751 48719 29666 89752 93281 130449 172191 73013 52759
13938 52759 60334 82670 40534 9092 -30534 -39325 28082 2705 124665 265996 193918 103755
13926 103755 77505 121634 156837 235870 215030 165525 120863 15625 -27870 -48085 -32380
13915 -32380 19795 61637 52852 48231 17554 23235 -17204 150160 239490 162309 154864 148717
13903 148717 128200 54095 -11875 -32853 -59934 63364 86956 101592 115790 70244 58194
13892 58194 98026 73513 44712 46743 117925 115307 134818 122948 111410 65354 17854 10137
13880 10137 25991 -66543 -33756 80517 91856 5343 63232 179301 142221 196512 202713
$$ packed form
13961A93352j04024R188P5853N6601k7352j00374p7972M8242L041R3972Q1129
13950B51656j8501q5094k5571M261p8032j9053O0086L529L7168M1742r9178k0254
13938E2759P575K2336m2136l1442l9626q791O7407k5377J21960J41331p2078r0163
13926A03755k6250M4129L5203P9033k0840m9505m4662j05238m3495k0215J5705
13915c2380N2175M1842q785m621l0677N681m0439J67364Q9330p7181p445o147
13903A48717k0517p4105o5970k0978k7081J23298K3592J4636J4198m5546j2050
13892E8194L9832k4513k8801K031P1182k618J9511j1870j1538m6056m7500p717
13880A0137J5854r2534L2787J14273J1339q6513N7889J16069l7080N4291O201
$$ plain form
13869 202713 235005 163933 145594 156546 196936 164408 141990 114957 58473 -17514 -645
13858 -645 -20854 -8528 66862 59718 19986 -2449 -13193 105007 145138 194215 212453 174165
13846 174165 143007 57148 48642 95584 88760 47276 27440 141229 210373 190829 201953 185029
13834 185029 169977 185461 193484 194597 165139 153767 91173 46372 132083 111639 107600 95953
13822 95953 106650 156313 166473 221469 216340 130555 82047 -20380 -116969 -120265 -29186 29502
13810 29502 75289 105602 146281 153125 103825 143197 132500 73744 19915 -22121 -16744 40172
13798 40172 -54396 -98766 -35066 -15327 96500 137012 80865 67420 79142 18661 35955
13787 35955 36694 125666 137697 80260 113038 115448 77344 35069 -63991 -38421 -14128 26358
$$ packed form
13869B02713L2292p1072j8339J0952M0390l2528k2418k7033n6484p5987J6869
13858f45k0209J2326P5390p144l9732k2435j0744J18200M0131M9077J8238l8288
13846A74165l1158q5859q506M6942o824m1484j9836J13789O9144j9544J1124j6924
13834A85029j5052J5484Q023J113k9458j1372o2594m4801Q5711k0444m039j1647
13822I5953J0697M9663J0160N4996n129q5785m8508j02427r6589l296R1079N8688
13810B9502M5787L0313M0679O844m9300L9372j0697n8756n3829m2036N377N6916
13798D0172r4568m4370O3700J9739J11827M0512n6147j3445J1722o0481J7294
13787C5955P39Q8972J2031n7437L2778K410l8104m2275r9060K5570K4293M0486
$$ plain form
13775 26358 82923 148003 111693 138621 125398 148597 136148 44750 -23973 1940 59039 120
13763 120 -18772 -31302 20600 4437 -5932 126620 172941 100078 120672 93539 12772 -70879
13751 -70879 -23162 -9889 -2424 -30262 -2207 61415 78439 24678 -10313 -34896 -37070 -76613
13739 -76613 -60453 -16875 -4017 36442 101320 158169 98886 84155 111989 163028 144656 102356
13727 102356 42411 3286 58718 2771 -40180 21465 87694 86098 136475 104726 64227 -1093
13715 -1093 -59499 -62083 -58490 -49048 -15102 76002 69553 -10963 -24609 5928 56356 54756 55518
13702 55518 131478 125863 53599 132152 177541 211858 140238 89014 120344 115020 55796 65233
13690 65233 119158 122655 147429 208430 167244 108418 133192 129099 88863 49363 -544 -98460
$$ packed form
13775B6358N6565O5080l6310K6928j3223K3199j2449r1398o8723K5913N7099n8919
13763A20j8892j2530N1902j6163j0369J32552M6321p2863K0594k7133q0767q3651
13751g0879M7717J3273P465k7838K8055O3622J7024n3761l4991k4583k174l9543
13739g6613J6160M3578J2858M0459O4878N6849n9283j4731K7834N1039j8372m2300
13727A02356n9945l9125N5432n5947m2951O1645O6229j596N0377l1749m0499o5320
13715a093n8406k584L593R442L3946R1104o449q0516j3646L0537N0428j600P62
13702E5518P5960n615p2264P8553M5389L4317p1620n1224L1330n324n9224R437
13690F5233N3925L497K4774O1001m1186n8826K4774m093m0236l9500m9907r7916
$$ plain form
13678 -98460 -109908 -38696 -24913 47236 65240 -9729 -43257 -30197 -62244 -108182 -42406 -201
13666 -201 -50351 -63629 58157 81190 32420 -19657 21103 29596 75177 84282 84076 82902 81544
13653 81544 10442 41995 109602 128907 74104 19499 -30718 -104889 -112673 -75234 27616 115451
13641 115451 91417 51636 2618 -19993 -56455 -13481 42100 10041 -16343 63750 173365
13630 173365 79309 -59453 -108407 -45864 51727 22212 -54956 -113330 4207 167902 255403
13619 255403 234924 193791 164022 104605 8471 -37715 -7358 56487 30437 -19751 -27520 -51557
13607 -51557 -26361 59961 41544 3138 -18242 36475 48069 29819 14909 34572 35524 50756
13595 50756 79839 127330 54914 64274 81146 158756 75586 -14588 -31662 -15061 40152 42553
$$ packed form
13678i8460j1448P1212J3783P2149J8004p4969l3528J3060l2047m5938O5776M2205
13666b01n0150j3278J21786K3033m8770n2077M0760Q493M5581R105k06j174j358
13653H1544p1102L1553O7607J9305n4803n4605n0217p4171p784L7439J02850Q7835
13641A15451k4034l9781m9018k2611l6462M2974N5581l2059k6384Q0093J09615
13630A73365r4056j38762m8954O2543R7591k9515p7168n8374J17537J63695Q7501
13619B55403k0479m1133k9769n9417r6134m6186L0357O3845k6050n0188p769k4037
13607e1557K5196Q6322j8417l8406k1380N4717J1594j8250j4910J9663R52J5232
13595E0756K9083M7491p2416R360J6872P7610q3170r0174j7074J6601N5213K401
$$ plain form
13583 42553 24434 83750 62001 94230 54885 -57213 -38463 -26490 -36967 -37344 -50988 -58966
13571 -58966 -22049 -7283 -24513 -52243 -74775 -13822 11739 62795 138552 136575 120924 115898
13559 115898 109319 37003 -17405 13180 39441 45426 4776 -20555 -33739 37241 53821 5711
13547 5711 -46026 -27933 36671 63302 89192 69895 50032 -11688 -102119 -68683 -44562 -77826
13535 -77826 -70774 -81323 -50072 -86909 -66912 -59671 -146037 -171936 -170990 -164507 -110942 -79284 -98733
13522 -98733 -76226 -61811 -71575 -105119 -55510 -9745 49461 97625 89657 139753 177038 101621
13510 101621 24155 -28909 -28548 22990 59849 -47196 -96466 -93286 -29311 44005 -3830 -55964
13498 -55964 10112 72388 95816 44333 -26478 -93463 -65494 -88072 -159680 -154032 -110373 -74327
$$ packed form
13583D2553j8119N9316k1749L2229l9345j12098J8750J1973j0477l77j3644p978
13571e8966L6917J4766j7230k7730k2532O0953K5561N1056P5757j977j5651n026
13559A15898o579p2316n4408L0585K6261N985m0650k5331j3184P0980J6580m8110
13547E711n1737J8093O4604K6631K5890j9297j9863o1720r0431L3436K4121l3264
13535g7826P052j0549L1251l6837J9997P241q6366k5899R46O483N3565L1658j9449
13522i8733K2507J4415r764l3544M9609M5765N9206M8164p968N0096L7285p5417
13510A01621p7466n3064L61N1538L6859j07045m9270L180O3975P3316m7835n2134
13498e5964O6076O2276K3428n1483p0811o6985K7969k2578p1608N648M3659L6046
$$ plain form
13486 -74327 -5330 -17792 23756 28947 -1607 10486 75435 123152 135071 97205 52190 -3686
13474 -3686 -54967 14046 198792 192013 191801 153993 88639 15994 20985 -26361 23542 76954
13462 76954 42000 70188 90830 122041 75841 43600 -73978 -163401 -170668 -109530 -84262 -51765
13450 -51765 -60498 -123635 -90421 -59620 -40979 3899 6464 -32632 -46068 -79548 -18101 28993
13438 28993 114413 161831 166070 60034 -21016 -71706 -58654 -11166 50663 53959 85566 175486
13426 175486 112354 -33922 -57419 -1796 21468 40163 -394 -2996 -74455 -95008 -94894 -86679
13414 -86679 -28266 27699 1699 -28856 -42038 30220 46303 63018 77408 78132 84513 42083
13402 42083 930 8278 47155 97751 39094 83341 167699 152310 151935 133342 81275 69811
$$ packed form
13486g4327O8997j2462M1548N191l0554J2093O4949M7717J1919l7866m5015n5876
13474c686n1281O9013J84746o779k12l7808o5354p2645M991m7346M9903N3412
13462G6954l4954K8188K0642L1211m6200l2241j17578q9423p267O1138K5268L2497
13450e1765q733o3137L3214L0801J8641M4878K565l9096j3436l3480O1447M7094
13438B8993Q5420M7418M239j06036q1050n0690J3052M7488O1829L296L1607Q9920
13426A75486o3132j46276k3497N5623K3264J8695m0557k602p1459k0553J14Q215
13414h6679N8413N5965k6000l0555j3182P2258J6083J6715J4390P24O381m2430
13402D2083m1153P348L8877N0596n8657M4247Q4358j5389l75j8593n2067j1464
$$ plain form
13390 69811 71005 45380 51900 72062 88967 112441 78996 73568 26355 15488 14796 -44072 -68080
13377 -68080 -50865 -65807 -29237 -43353 -98051 -36809 -3195 62677 89917 19150 21708 94078
13365 94078 124991 11324 -81823 -148819 -122819 -66179 -47815 -54758 -49231 -8336 26160 -94737
13353 -94737 -135181 -49049 -45311 -149083 -171187 -117220 -39958 -5738 1174 -37813 -9789 130446
13341 130446 229127 96755 -65179 -90679 -39344 -98815 -107720 -66740 -85689 -145518 -126770
13330 -126770 -105361 -63961 -117780 -130380 -71617 15078 -14947 -30341 65724 44536 53891 95650
13318 95650 122520 129936 255382 360094 299928 179681 113288 48001 37287 23114 10862
13307 10862 76780 120026 163361 126862 136253 103660 4679 22198 146432 166571 56638
$$ packed form
13390F9811J194k5625O520K0162J6905K3474l3445n428m7213j0867o92n8868k4008
13377f8080J7215j4942L6570j4116n4698O1242L3614O5872K7240p0767K558P2370
13365I4078L0913j13667r3147o6996K6000N6640J8364o943N527M0895L4496j20897
13353i4737m0444Q6132L738j03772k2104N3967P7262L4220O912l8987K8024J40235
13341A30446R8681j32372j61934k5500N1335n9471q905M0980j8949n9829J8748
13330a26770K1409M1400n3819j2600N8763Q6695l0025j5394R6065k1188R355M1759
13318I5650K6870P416J25446J04712o0166j20247o6393o5287j0714j4173j2252
13307A0862O5918M3246M3335l6499R391l2593r8981J7519J24234K0139j09933
$$ plain form
13296 56638 75935 157196 198204 171128 162092 180330 146020 46197 42780 72660 105072 177291
13284 177291 168177 113909 119536 75770 33051 62925 65097 55750 148047 47526 4825 16150
13272 16150 -20584 -8239 -78460 -155997 -131025 -14790 971 24858 86196 93260 150667 82049
13260 82049 -43173 -82822 -59615 323 -26045 -12954 49126 69324 118737 47170 -7239
13249 -7239 -57064 13624 20419 40085 98311 134854 159611 136324 168394 203258 195810 121837
13237 121837 32899 -43887 -118459 -92615 -50002 -109701 -144379 -118463 -71504 -50026 64172
13226 64172 58400 38917 90389 100978 119775 147549 85330 69209 22224 -13815 24931 -18506
13214 -18506 72157 67734 25100 360 -7633 -23776 16666 37032 -39725 -19403 -5959 -25820
$$ packed form
13296E6638J9297Q1261M1008k7076r036J8238l4310r9823l417K9880L2412P2219
13284A77291r114n4268N627m3766m2719K9874K172r347R2297j00521m2701J1325
13272A6150l6734J2345p0221p7537K4972J16235J5761K3887O1338P064N7407o8618
13260H2049j25222l9649K3207N9938k6368J3091O2080K0198M9413p1567n4409
13249g239m9825P0688O795J9666N8226L6543K4757k3287L2070L4864p448p3973
13237A21837q8938p6786p4572K5844M2613n9699l4678K5916M6959K1478J14198
13226F4172n772j9483N1472J0589J8797K7774o2219j6121m6985l6039L8746m3437
13214a8506R0663m423m2634k4740p993j6143M0442K0366p6757K0322J3444j9861
$$ plain form
13202 -25820 -69913 -73894 3868 88712 94148 94835 86680 69602 39125 11235 24719 11883 -21297
13189 -21297 -14820 15436 19683 -51869 -127703 -127997 -127081 -54869 -27189 82216 135722 93388 953
13176 953 -71991 13396 18811 12445 28427 57635 67259 113103 70391 54012 -6450 -8478 -23577
13163 -23577 -55347 -87459 -45941 -22927 -94021 -51050 22576 31210 2179 -15378 17091 23813
13151 23813 41904 -31036 -42814 79683 97425 82226 103166 76863 115754 64331 77656
13140 77656 65864 -4044 -101606 -93891 -53546 -96232 -21414 109651 88959 14137 -71558 -91740
13128 -91740 -101532 -45102 -63494 -25155 -45333 -85497 -153643 -182590 -149219 -97155 -87558 -90008
13116 -90008 -131037 -66608 -43332 -50939 -69553 -41772 59483 76715 12604 -8365 89126 52563
$$ packed form
13202b5820m4093l981P7762Q4844N436O87q155j7078l0477k7890J3484j2836l3180
13189b1297O477L0256M247p1552p5834k94R16P2212K7680J09405N3506m2334r2435
13176I53p2944Q5387N415o366J5982K9208R624M5844m2712j6379o0462k028j5099
13163b3577l1770l2112M1518K3014p1094M2971P3626Q634k9031j7557L2469O722
13151B3813J8091p2940j1778J22497J7742j5199K0940k6303L8891n1423J3325
13140G7656j1792o9908r7562P715M0345m2686P4818J31065k0692p4822q5695k0182
13128i1740r792N6430j8392L8339k0178m0164o8146k8947L3371N2064R597k450
13116i0008m1029O4429K3276p607j8614K7781J01255J7232o4111k0969R7491l6563
$$ plain form
13104 52563 -42884 -161183 -240620 -198431 -55782 -57761 -33083 -55227 -18884 98213 141876
13093 141876 102785 150562 166064 94161 39817 -1419 -44402 -9398 -40911 -22812 1543
13082 1543 36927 -54820 -132370 -121300 -73108 -2298 -18524 15170 105712 84420 44431 73845
13070 73845 135760 170695 94236 20903 -8305 -26750 20536 60378 60347 48104 57728 73214
13058 73214 84420 44073 -23603 21902 85192 122830 116847 73428 10764 29489 -13902 -41234
13046 -41234 34333 -4920 -1234 21084 744 -20820 -70836 -24782 -3723 -69113 -132103 -79799
13034 -79799 -65293 -63753 -80317 -85709 -47302 9493 108996 110923 129311 146442 48381 -50949
13022 -50949 -114571 -112654 -140141 -159021 -185009 -134414 -27763 -24168 -132671 -116660 -24490 -86981
$$ packed form
13104E2563r5447j18299p9437M2189J42649j979K4678k2144L6343J17097M3663
13093A41876l9091M7777J5502p1903n4344m1236m2983L5004l1513J8099K4355
13082A543L5384r1747p7550J1070M8192P0810j6226L3694R0542k1292l9989K9414
13070G3845O1915L4935p6459p3333k9208j8445M7286L9842l1j2243R624J5486
13058G3214J1206m0347o7676M5505O3290L7638n983m3419o2664J8725m3391k7332
13046d1234P5567l9253L686K2318k0340k1564n0016M6054K1059o5390o2990N2304
13034g9799J4506J540j6564n392L8407N6795R9503J927J8388J7131r8061r9330
13022e0949o3622J917k7487j8880k5988N0595J06651L595j08503J6011R2170o2491
$$ plain form
13010 -86981 -67691 -76864 -121344 -91136 -132467 -114735 -59634 -38792 -13236 58894 28675 -35180
12998 -35180 -32988 35799 49933 51241 22679 64109 80782 79082 73205 76218 29543 -45356 -55794
12985 -55794 -31793 -17248 25569 50085 63069 18888 -4610 -16902 -40707 -38537 -48211 -173
12973 -173 2922 -72585 -39020 3149 1596 23385 -72818 -140184 -99591 28658 67707 11934
12961 11934 33471 32780 32936 63861 -18792 -23886 78724 110094 -19524 -73443 -34396 -41466
12949 -41466 -103813 -65338 -60655 -45970 -129539 -118407 -58983 -18975 -33612 -71132 7276 15366
12937 15366 -87772 -86469 -52692 18707 112764 161887 90607 29584 68262 32984 5051 12198
12925 12198 -4080 34318 -28026 -50815 -30493 -105914 -96607 -51341 -41142 -5742 110561 170075
$$ packed form
13010h6981J9290r173m4480L0208m1331J7732N5101K0842K5556P2130l0219o3855
12998c5180K192O8787J4134J308k8562M1430J6673j700n877L013m6675p4899j0438
12985e5794K4001J4545M2817K4516J2984m4181k3498j2292k3805K170r674M8038
12973a73L095p5507L3565M2169j553K1789r6203o7366M0593J28249L9049n5773
12961A1934K1537o91J56L0925q2653n094J02610L1370j29618n3919L9047p070
12949d1466o2347L8475M683J4685q3569J1132N9424M0008j4637l7520P8408Q090
12937A5366j03138J303L3777P1399R4057M9123p1280o1023L8678l5278k7933P147
12925A2198j6278L8398o2344k2789K0322p5421R307M5266J0199L5400J16303N9514
$$ plain form
12913 170075 194050 126836 141196 152407 99525 67557 124262 148355 81084 -70040 -57031
12902 -57031 -2677 -7709 -96310 -32930 38722 62074 -29681 -32931 -65863 -100252 -132174 -151716
12890 -151716 -54351 29813 48099 107486 90050 65241 68039 7385 -10302 -21724 3254 43761
12878 43761 52417 75116 63103 -28039 -33240 -16134 -12914 -30621 -73866 -104574 -64095 -175728
12866 -175728 -160838 -11955 100294 141880 138866 141594 127583 103814 87876 104599 979
12855 979 -50581 -37875 -117946 -125275 -27783 -6047 25072 54002 41418 11488 36910 62468
12843 62468 44734 33919 40375 58942 58856 -59657 -112029 6201 92010 -3847 -47747 -86010
12831 -86010 -105481 -94795 -108009 -73393 -89527 -105493 -36307 -69623 -201402 -222911 -95097
$$ packed form
12913A70075K3975o7214J4360J1211n2882l1968N6705K4093o7271j51124J3009
12902e7031N4354n032q8601O3380P1652K3352r1755l250l2932l4389l1922j9542
12890a51716R7365Q4164J8286N9387j7436k4809K798o0654j7687j1422K4978M0507
12878D3761Q656K2699j2013r1142n201J7106L220j7707m3245l0708M0479j11633
12866a75728J4890J48883J12249M1586l014K728j4011k3769j5938J6723j03620
12855I79n1560J2706q0071p329R7492K1736L1119K8930j2584k9930K5422K5558
12843F2468j7734j0815O456J8567q6j18513n2372J18230Q5809r5857m3900l8263
12831h6010j9471J0686j3214L4616j6134j5966O9186l3316j31779k1509J27814
$$ plain form
12820 -95097 -19597 -51585 -83841 -27593 -23745 -11112 -4593 45135 97486 160799 116645 109087
12808 109087 69198 81232 44785 75190 90682 34509 31805 101410 113330 50815 85897 34325
12796 34325 -12661 23836 -45266 5144 -17953 -25151 -14904 -107262 -177378 -130190 -67493 -32683
12784 -32683 31321 31875 -15671 17031 33688 -18784 16514 19813 77900 33223 -69000 -180510
12772 -180510 -150849 -154239 -170100 -105228 -59207 -93002 -120739 -75696 15347 38 46273 -24560
12760 -24560 -103064 -64310 -98735 -96482 17840 64738 24208 8208 26829 15911 -46148 -112623
12748 -112623 -136603 -159605 -192689 -196297 -122960 1470 58977 85967 100043 72687 67100 35934
12736 35934 42469 47841 19755 -135368 -188548 -165523 -105002 -34220 -64182 -83019 -123213 -141504
$$ packed form
12820i5097P5500l1988l2256N6248L848J2633O519M9728N2351O3313m4154p558
12808A09087l9889J2034l6447L0405J5492n6173k704O9605J1920o2515L5082n1572
12796C4325m6986L6497o9102N0410k3097p198J0247r2358p0116M7188O2697L4810
12784c2683O4004N54m7546L2702J6657n2472L5298L299N8087m4677j02223j11510
12772a80510K9661l390j5861O4872M6021l3795k7737M5043R1043j5309M6235p0833
12760b4560p8504L8754l4425K253J14322M6898m0530j6000J8621j0918o2059o6475
12748a12623k3980k3002l3084l608P3337J24430N7507K6990J4076k7356n587l1166
12736C5934O535N372k8086j55123n3180K3025O0521P0782k9962j8837m0194j8291
$$ plain form
12724 -141504 -116584 -95168 -27044 60819 50535 -65166 -162725 -186848 -94766 -79160 -92716
12713 -92716 -65474 -44941 18013 -10901 -34275 59532 109364 -18947 -35948 -19885 33528
12702 33528 49229 44891 7472 -3480 711 -34743 -27567 62350 21328 -74736 -152662 -150594
12690 -150594 -124371 -115770 -83667 -49862 -21478 16080 -23188 -26025 26970 87999 85669 65782
12678 65782 -16281 38322 117793 143555 80692 34196 41915 2310 21444 63364 22693 31388
12666 31388 90356 113466 105667 75121 -5891 10614 71260 94415 90947 83366 14885 -79366
12654 -79366 -146824 -98356 -25697 -21987 -45578 31676 29394 -19631 -64378 -162746 -208090 -172789
12642 -172789 -16471 95239 129089 149836 95395 -18204 -39120 -14149 -25933 -24537 -79152
$$ packed form
12724a41504K4920K1416O8124Q7863j0284j15701r7559k4123R2082J5606j3556
12713i2716K7242K0533O2954k8914k3374R3807M9832j28311j7001J6063N3413
12702C3528J5701m338l7419j0952M191l5454P176Q9917m1022r6064p7926K068
12690a50594K6223Q601L2103L3805K8384L7558l9268k837N2995O1029k330j9887
12678F5782q2063N4603P9471K5762o2863m6496P719l9605J9134M1920m0671Q695
12666C1388N8968K3110p799l0546q1012J6505O0646K3155l468p581o8481r4251
12654g9366o7458M8468P2659L710k3591P7254k282m9025m4747r8368m5344L5301
12642a72789J56318J11710L3850K0747n4441j13599k0916K4971j1784J396n4615
$$ plain form
12631 -79152 -92862 -135708 -118426 -68125 -64468 -57825 29387 101171 117591 81932 3248 -20353
12619 -20353 -103515 -182336 -133834 11038 28677 34383 66371 5826 -51078 -11047 23182 39314
12607 39314 83211 121688 49347 46093 45760 18729 33787 57828 42879 36832 56827 66293 141616
12594 141616 203084 134316 63911 30877 110177 120532 52815 -62297 -146776 -103099 -94762
12583 -94762 -81132 -99453 -24522 47261 78313 91672 37827 49876 32156 -34244 -11956 12295
12571 12295 47685 41043 60780 30495 -84713 -79389 -4856 -5090 -86161 -166160 -125691 -51625
12559 -51625 -15307 -20996 628 -52933 -109891 -171956 -151396 -121124 -109697 21025 85388 87787
12547 87787 38771 -14734 -104112 -108625 -44258 -82581 -121645 -62021 -33182 -122186 -238803 -200401
$$ packed form
12631g9152j3710m2846J7282N0301L657O643Q7212P1784J6420l5659p8684k3601
12619b0353q3162p8821M8502J44872J7639N706L1988o0545n6904M0031L4229J6132
12607C9314M3897L8477p2341l254l33k7031J5058K4041j4949o047J9995R466P5323
12594A41616O1468o8768p0405l3034P9300J0355o7717j15112q4479M3677Q337
12583i4762J3630j8321P4931P1783L1052J3359n3845J2049j7720o6400K2288K4251
12571A2295L5390o642J9737l0285j15208N324P4533k34q1071p9999M0469P4066
12559e1625L6318n689K1624n3561n6958o2065K0560L0272J1427J30722O4363K399
12547H7787m9016n3505q9378m513O4367l8323l9064N9624K8839q9004j16617L8402
$$ plain form
12535 -200401 -97639 -95308 -1570 -50093 -134201 -151139 -172127 -93795 17030 106190 168889
12524 168889 106585 51964 59478 6798 21484 86494 149845 117232 87956 70525 80925 117780
12512 117780 76658 18127 21299 18262 -29530 -67845 -133289 -89260 -83762 -57409 -27228 -13234
12500 -13234 -31138 -35938 -46059 -85088 -139052 -126068 -158757 -163241 -108947 -7969 86626 42720
12488 42720 14784 35998 97892 39936 -72081 -118585 -144815 -91678 41772 104623 75541
12477 75541 46658 -13765 -38184 -113211 -83075 27540 56924 52692 16939 -21608 -41202 -70878
12465 -70878 -99191 -112416 -108056 -58181 -100787 -125253 -77265 -10156 -40445 -47889 -41013 -80806
12453 -80806 -51964 -3056 44192 38499 95847 128927 19743 -33492 -37288 -107035 -84827 -153110
$$ packed form
12535b00401J02762K331R3738m8523q4108j6938k0988P8332J10825Q9160O2699
12524A68889o2304n4621P514n2680J4686O5010O3351l2613k9276j7431J0400L6855
12512A17780m1122n8531L172l037m7792l8315o5444M4029N498K6353L0181J3994
12500a3234j7904m800j0121l9029n3964J2984l2689m484N4294J00978R4595m3906
12488D2720k7936K1214O1894n7956j12017m6504k6230N3137J33450O2851k9082
12477G5541k8883o0423k4419p5027L0136J10615K9384m232l5753l8547j9594k9676
12465g0878k8313j3225M360M9875m2606k4466M7988O7109l0289p444O876l9793
12453h0806K8842M8908M7248n693N7348L3080j09184n3235l796o9747K2208o8283
$$ plain form
12441 -153110 -187093 -194906 -117039 -17031 42375 120105 72119 53373 63728 34989 38049 -78115
12429 -78115 -109608 -72468 7638 31694 -18627 -44031 -94682 -81333 1525 22941 28451 -122061
12417 -122061 -198384 -117692 8668 -21041 -4504 13583 67165 83553 65697 56764 -4030
12406 -4030 2381 23060 -47088 -72494 -34670 -91832 -23018 566 -92854 -167618 -142461 -135192
12394 -135192 -191653 -163473 -132860 -10751 108245 146939 177935 112972 62571 77493 91894
12383 91894 108544 104106 20177 6656 31951 46206 -7890 24579 75183 98430 114746 73954
12371 73954 111725 45038 -7877 -36833 -98165 -175580 -99884 -2380 75985 130118 147541 110244
12359 110244 56240 73251 64757 93781 28602 -24775 -9320 -48140 -108066 -83233 -86254 -10743
$$ packed form
12441a53110l3983p813P7867J00008N9406P7730m7986j8746J0355k8739L060j16164
12429g8115l1493L7140Q0106K4056n0321k5404n0651J3349Q2858K1416N510j50512
12417a22061p6323Q0692J26360k9709J6537J8087N3582J6388j7856q933o0794
12406d030O411K0679p0148k5406L7824n7162O8814K3584r3420p4764K5157P269
12394a35192n6461K8180L0613J22109J18996L8694L0996o4963n0401J4922J4401
12383I1894J6650m438q3929j3521K5295J4255n4096L2469N0604K3247J6316m0792
12371G3954L7771o6687n2915k8956o1332p7415P5696R7504P8365N4133J7423l7297
12359A10244n4004J7011q494K9024o5179n3377J5455l8820n9926K4833l021P5511
$$ plain form
12347 -10743 67594 51215 36534 37557 -28563 -45486 -56284 42841 79500 126388 124099 62374
12335 62374 -108694 -88330 -32847 -22739 -3849 27707 32480 -13104 -89593 -59226 63681
12324 63681 149435 205591 117904 7206 -76282 -7844 31601 -12524 5383 81332 74094 12958
12312 12958 -9014 21512 -36609 -88646 -81117 -156212 -75865 -16745 -87081 -119082 -84952 -101497
12300 -101497 -90878 -84403 -77406 -6692 27008 42302 20027 -9121 13115 56468 -14440 -86519
12288 -86519 -68518 -24810 61346 165187 92737 15317 16086 -50070 -78589 -84008 -101056 -73801
12276 -73801 -30150 -86269 -115254 -69699 -53373 -123953 -173361 -138301 -94065 -72494 37728
12265 37728 116653 86344 -30923 -55645 -144705 -32573 166166 181149 24488 -49066 -62085
$$ packed form
12347a0743P8337j6379j4681J023o6120j6923j0798R9125L6659M6888k289o1725
12335F2374j71068K0364N5483J0108J8890L1556M773m5584p6489L0367J22907
12324F3681Q5754N6156q7687j10698q3488O8438L9445m4125J7907P5949p238o1136
12312A2958k1972L0526n8121n2037P529p5095Q0347N9120p0336l2001L4130j6545
12300a01497J0619O475O997P0714L3700J5294k2275k9148K2236M3353p0908p2079
12288h6519J8001M3708Q6156J03841p2450p7420P69o6156k8519n419j7048K7255
12276g3801M3651n6119k8985M5555J6326p0580m9408L5060M4236K1571J10222
12265C7728P8925l0309j17267k4722q9060J12132J98739J4983j56661p3554j3019
$$ plain form
12254 -62085 -88407 -112893 -45018 -33908 -46418 -92148 -51097 13327 65066 30881 76891 130252
12242 130252 101355 32395 -20544 12775 16156 -74454 -84090 -11302 58611 62135 38170 11742
12230 11742 -18588 -56662 -64019 -23699 4369 -27278 -69658 -107936 -19837 1983 16107 46470
12218 46470 119252 148211 124100 154373 92137 24916 44043 -17924 -6630 -27748 -9752 57350
12206 57350 177375 159628 103551 32501 21036 -19509 -11433 -22050 4379 51080 56422 -241
12194 -241 -34518 -38949 10075 5748 44330 84396 86915 139961 169344 153921 139984 121434 92319
12181 92319 88155 70539 128187 106632 58522 30714 41801 109058 105235 100867 155267 180571
12169 180571 238576 228866 188524 112121 -21849 -19281 22724 88720 149770 156937 70835 -477
$$ packed form
12254f2085k6322k4486O7875J1110j2510m5730M1051O4424N1739l4185M6010N3361
12242A30252k8897o8960n2939L3319L381r0610r636P2788O9913L524k3965k6428
12230A1742l0330l8074p357M0320K8068l1647m2380l8278Q8099K1820J4124L0363
12218D6470P2782K8959k4111L0273o2236o7221J9127o1967J1294k1118J7996O7102
12206E7350J20025j7747n6077p1050j1465m0545Q076j0617K6429M6701N342n6663
12194b41l4277m431M9024m327L8582M0066K519N3046K9383j5423j3937j8550k9115
12181I2319m164j7616N7648k1555m8110k7808J1087O7257l823m368N4400K5304
12169A80571N8005r710m0342p6403j33970K568M2005O5996O1050P167q6102p1312
$$ plain form
12157 -477 -44471 -41353 -30692 -10922 -34430 -70935 -6824 -22114 -124309 -130784 3377 30719
12145 30719 7770 6424 -7808 -1770 -19427 -40435 -14373 -20705 -28402 18115 -16970 16535
12133 16535 45067 89212 121557 119131 218437 256684 195452 163680 146707 50195 -6630 29625
12121 29625 68992 82926 56146 26807 9532 40652 34977 47170 158760 167814 115974 130635
12109 130635 223441 261861 186849 144767 211549 236102 226859 166904 130446 152555 191179 195015
12097 195015 117203 60031 -5095 -114607 -133883 -81882 8343 -17736 -78107 17078 51050
12086 51050 3089 -6453 -33762 -64669 -5943 34773 55901 50959 53150 91013 119604 170781
12074 170781 211302 204192 170682 201004 219867 226449 278735 297258 230600 204182 270007 237305
$$ packed form
12157d77m3994L118J0661J9770k3508l6505O4111j5290j02195o475J34161K7342
12145C0719k2949j346j4232O038j7657k1008K6062o332p697M6517l5085L3505
12133A6535K8532M4145L2345k426R9306L8247o1232l1772j6973r6512n6825L6255
12121B9625L9367J3934k6780k9339j7275L1120n675J2193J11590R054n1840J4661
12109A30635R2806L8420p5012m2082O6782K4553r243n9955l6458K2109L8624L836
12097A95015p7812n7172o5126j09512j9276N2001R0225k6079o0371R5185L3972
12086E1050m7961r542k7309l0907N8726M0716K1128m942K191L7863K8591N1177
12074A70781M0521p110l3510L0322J8863O582N2286J8523o6658k6418O5825l2702
$$ plain form
12062 237305 175208 178279 146201 120544 155011 208487 244740 239676 240468 255077 347257 348535
12050 348535 294499 284265 338036 311418 350689 382882 397690 280708 54110 -196840 -417599
12039 -417599 -485577 -364877 -214303 -85297 -80665 -45813 -40083 -96916 -55885 36167 134305
12028 134305 155129 91214 12350 -48637 43246 153814 125756 105541 83421 86853 80625 158123
12016 158123 210000 175871 109862 40780 70453 59428 89710 90549 169846 187125 213564 244088
12004 244088 242308 248063 165839 182853 237706 333454 335921 343445 404678 351576 337926 365481
11992 365481 395069 426575 369454 411547 547060 539222 517685 487869 565965 699844 765116
11981 765116 713368 602921 614620 634703 626604 690762 711273 730090 659396 557262 617700
$$ packed form
12062B37305o2097L071l2078k5657L4467N3476L6253n064P92J4609R2180J278
12050C48535n4036j0234N3771k6618L9271L2193J4808j16982k26598k50950k20759
12039d17599o7978J20700J50574J29006M632L4852N730n6833M1031R2052R8138
12028A34305K0824o3915p8864o0987R1883J10568k8058k0215k2120L432o228P7498
12016A58123N1877l4129o6009o9082K9673j1025L0282Q39P9297J7279K6439L0524
12004B44088j780N755q2224J7014N4853R5748K467P524O1233n3102j3650K7555
11992C65481K9588L1506n7121M2093J35513p838k1537k9816P8096J33879O5272
11981G65116n1748j10447J1699K0083q099O4158K0511J8817p0694j02134O0438
$$ plain form
11970 617700 720371 812654 795990 734636 863109 952944 1057793 1239196 1292498 1321604 1357108
11959 1357108 1527858 1651180 1683117 1810566 1966337 2035097 2120685 2257573 2410480 2596610
11949 2596610 2750148 2937526 3277215 3548406 3709948 3877873 4166036 4520994 4856073
11940 4856073 5346048 5814584 6360348 6997617 7669316 8415360 9263274 10336092 11630806
11931 11630806 13161197 14973984 17119689 19785164 23097888 27195024 32350842 39079274
11923 39079274 48053152 60414363 77788150 102470315 137948075 188091098 254934985
11916 254934985 332333969 393576411 399057000 344861719 266186687 195493043 143901169
11909 143901169 108587222 84278382 67159717 54760329 45527583 38309621 32588080
$$ packed form
11970F17700J02671R2283j6664o1354J28473Q9835J04849J81403N3302K9106L5504
11959A357108J70750J23322L1937J27449J55771O8760Q5588J36888J52907J86130
11949B596610J53538J87378L39689K71191J61542J67925K88163L54958L35079
11940D856073M89975M68536N45764O37269O71699P46044Q47914J072818J294714
11931A1630806J530391J812787K145705K665475L312724M097136N155818O728432
11923C9079274Q973878J2361211J7373787K4682165L5477760N0143023O6843887
11916B54934985P7398984O1242442N480589n4195281p8675032p0693644n1591874
11909A43901169l5313947k4308840j7118665j2399388r232746p217962n721541
$$ plain form
11902 32588080 28066590 24467656 21456330 19013498 16852919 15131941 13600820 12278152
11894 12278152 11177436 10222120 9394651 8706318 8045796 7413476 6899604 6424590 6092934
11885 6092934 5759800 5498130 5293206 5019795 4665796 4384831 4197673 4002269 3814785
11876 3814785 3648993 3538823 3458191 3312099 3122005 2975979 2818420 2642171 2585206 2516663
11866 2516663 2358613 2282640 2165862 2068009 1919361 1852490 1782255 1664249 1664484 1632883 1493646
11855 1493646 1408712 1405081 1368150 1385977 1408890 1308656 1275314 1217814 1090531 1077640 1114551
11844 1114551 1191656 1178606 1168979 1060842 1064385 1062249 1085807 1044313 987573 898360 895640 894739
11832 894739 890383 920188 851499 766925 769592 775303 765445 736991 686375 690135 752695 729490
$$ packed form
11902C2588080m521490l598934l011326k442832k160579j720978j531121j322668
11894A2278152j100716r55316q27469o88333o60522o32320n13872m75014l31656
11885F092934l33134k61670k04924k73411l53999k80965j87158j95404j87484
11876C814785j65792j10170q0632j46092j90094j46026j57559j76249n6965o8543
11866B516663j58050p5973j16778r7853j48648o6871p0235j18006K35l1601j39237
11855A493646q4934l631l6931J7827K2913j00234l3342n7500j27283j2891L6911
11844A114551P7105j3050r627j08137L543k136K3558m1494n6740q9213k720r01
11832H94739m356K9805o8689q4574K667N711r858k8454n0616L760O2560k3205
$$ plain form
11820 729490 709514 784975 730110 639189 573293 592502 625061 615025 605718 629259 577357 536802
11808 536802 522719 509915 533536 508768 453630 435230 468092 553478 688641 766767 805447
11797 805447 852717 869261 865916 931772 1009559 1129557 1203481 1190953 1176213 1051936 853194
11786 853194 678316 534077 421038 459640 554185 529737 508652 394018 326876 289644 311946
11775 311946 271123 203172 235446 303704 276669 276336 240490 265785 320457 338351 370461 438629
11763 438629 391169 353140 315960 306542 244788 226281 199762 201543 238796 302910 259535 224003
11751 224003 222070 213397 296634 315471 290886 235958 137278 230752 329702 321853 326033 257383
11739 257383 264966 253656 259575 259908 232983 214687 234383 191744 202622 230107 102980 16625
$$ packed form
11820G29490j9976P5461n4865r0921o5896J9209L2559j0036r307K3541n1902m0555
11808E36802j4083j2804K3621k4768n5138j8400L2862Q5386J35163P8126L8680
11797H05447M7270J6544l345O5856P7787J19998P3924j2528j4740j24277j98742
11786H53194j74878j44239j13039L8602R4545k4448k1085j14634o7142l7232K2302
11775C11946m0823o7951L2274O8258k7035l33l5846K5295N4672J7894L2110O8168
11763D38629m7460l8029l7180r418o1754j8507k6519J781L7253O4114m3375l5532
11751B24003j933q673Q3237J8837k4585n4928r8680R3474R8950p849M180o8650
11739B57383P583j1310N919L33k6925j8296J9696m2639J0878K7485j27127q6355
$$ plain form
11727 16625 -46206 -24815 24147 74825 54011 -19799 39412 39253 -49906 -37950 29602 110598
11715 110598 193891 116927 87946 154548 191283 232274 271616 346603 363251 177750 108429
11704 108429 103656 41887 37575 146791 133223 160242 252817 256909 164582 -20128 -115737 -48504
11692 -48504 -1363 -24172 82061 63912 37568 103042 117575 21268 -31300 78418 100917
11681 100917 88439 -1870 8598 -10653 22598 65822 88829 134095 210965 180909 149530
11670 149530 98918 111563 81535 67598 85893 68841 111290 151984 197605 215100 201990
11659 201990 125182 124687 101268 34563 69667 97446 122668 226455 205143 133939 117476 96764
11647 96764 41074 -10362 -64590 -49297 -13446 -46333 -91286 -61662 4045 44822 -6176 47650
$$ packed form
11727A6625o2831K1391M8962N0678k0814p3810N9211j59q9159J1956O7552Q0996
11715A10598Q3293p6964k8981O6602L6735M0991L9342P4987J6648j85501o9321
11704A08429m773o1769m312J09216j3568K7019R2575M092r2327j84710r5609O7233
11692d8504M7141k2809J06233j8149k6344O5474J4533r6307n2568J09718K2499
11681A00917j2478r0309J0468j9251L3251M3224K3007M5266P6870l0056l1379
11670A49530n0612J2645l0028j3937J8295j7052M2449M0694M5621J7495j3110
11659B01990p6808m95k3419o6705L5104K7779K5222J03787k1312p1204j6463k0712
11647I6764n5690n1436n4228J5293L5851l2887m4953K9624O5707M0777n0998N3826
$$ plain form
11635 47650 65869 72634 93604 -1815 -50353 -79969 -95488 -57607 -10336 -47634 -34617 93815
11623 93815 112657 117619 21767 -96158 -78871 -15138 -27845 -66645 -63766 20621 32568 13095
11611 13095 -7884 -34065 -11309 52972 100739 152722 234555 247199 157586 118096 75999 41122
11599 41122 114762 195570 192836 140266 72201 1822 54583 61419 -1534 -61325 -21561 65060
11587 65060 66329 17923 -37439 26479 112895 112196 43151 30600 37788 115643 57565 -24589
11575 -24589 -38812 -17855 39985 49290 9767 -9057 -33448 20129 37980 64278 92005 112322
11563 112322 110735 23442 -48047 -17098 -58196 -35334 109113 89710 73361 80990 104369 17442
11551 17442 -53432 -3957 8016 50675 52879 38414 93562 96133 45049 45321 21015 2828
$$ packed form
11635D7650J8219O765K0970r5419m8538k9616j5519L7881M7271l7298J3017J28432
11623I3815J8842M962r5852j17925J7287O3733j2707l8800K879Q4387J1947j9473
11611A3095k0979k6181K2756O4281M7767N1983Q1833J2644q9613l9490m2097l4877
11599D1122P3640Q0808k734n2570o8065p0379N2761O836o2953n9791L9764Q6621
11587F5060J269m8406n5362O3918Q6416o99o9045j2551P188P7855n8078q2154
11575b4589j4223K0957N7840R305l9523j8824k4391N3577J7851K6298K7727K0317
11563A12322j587q7293p1489L0949m1098K2862J44447j9403j6349P629K3379q6927
11551A7442p0874M9475J1973M2659K204j4465N5148K571n1084K72k4306j8187
$$ plain form
11539 2828 -77407 -6016 -32150 -48218 19020 70228 17703 1010 6266 18662 34480 85562
11527 85562 111342 94652 25183 16562 48749 40314 13730 -57802 -21067 -11128 20222 105921
11515 105921 91402 91569 -7844 -26944 -67150 -93158 -25636 -9507 7846 -50321 -42533 53751
11503 53751 163246 133698 27302 -64001 -115076 -50662 46453 111514 174834 123027 29720
11492 29720 65666 44470 42034 64994 65936 3207 -41451 -41447 64051 4668 -5320 118859 34916
11479 34916 5073 21059 22002 80794 45253 -50081 -136392 -161433 -108239 -28614 255 -13705
11467 -13705 18851 37864 43564 9934 13182 95606 37352 -35761 -53249 -23552 -86765 -121019
11455 -121019 -96460 -35297 -12606 21213 89542 95076 88156 38437 -70546 -73436 -77766 -78360
$$ packed form
11539B828q0235P1391k6134j6068O7238N1208n2525j6693N256J2396J5818N1082
11527H5562K5780j6690o9469q621L2187q435k6584p1532L6735R939L1350Q5699
11515A05921j4519J67r9413j9100m0206k6008O7522J6129J7353n8167P788R6284
11503E3751J09495k9548j06396r1303n1075O4414R7115O5061O3320n1807r3307
11492B9720L5946k1196k436K2960R42o2729m4658MJ05498n9383r988J24179q3943
11479C4916k9843J5986R43N8792l5541r5334q6311k5041N3194P9625K8869j3960
11467a3705L2556J9013N700l3630L248Q2424n8254p3113j7488K9697o3213l4254
11455a21019K4559O1163K2691L3819O8329N534o920m9719j08983k890m330n94
$$ plain form
11443 -78360 -76792 -82021 -91540 -86202 -63389 -163244 -129728 -54092 -49027 -59698 10820 -19835 -48547
11430 -48547 -59240 21215 35387 74084 53916 11406 15214 -8737 -137 14736 -3176 16084
11418 16084 37837 56570 8415 -17196 -78327 -62725 7983 69241 108255 124976 103388 69914
11406 69914 52466 83509 72191 -15199 -45111 -29835 -2901 -31597 -59631 10975 54567 16794
11394 16794 21380 69344 49386 -18913 -54622 -88723 -133679 -86467 -116021 -184887 -118061 90582
11382 90582 72184 38535 25421 88332 71813 129256 120413 60609 61428 44004 -41555 -18152
11370 -18152 -43754 -50810 27439 48746 45120 31327 100386 121371 97971 86461 4274 8635
11358 8635 -47782 -36082 2002 35428 -7073 14319 77602 9644 -52088 -57994 -122436 -47870
$$ packed form
11443g8360J568n229r519N338K2813r9855L3516P5636N065j0671P0518l0655k8712
11430d8547j0693Q0455J4172L8697k0168m2510L808k3951Q600J4873j7912J9260
11418A6084K1753J8733m8155k5611o1131J5602P0708O1258L9014J6721k1588l3474
11406F9914j7448L1043j1318q7390k9912J5276K6934k8696k8034P0606M3592l7773
11394A6794M586M7964j9958o8299l5709l4101m4956M7212k9554o8866O6826K08643
11382I0582j8398l3649j3114O2911j6519N7443q843n9804Q19j7424q5559K3403
11370a8152k5602p056P8249K1307l626j3793O9059K0985k3400j1510q2187M361
11358H635n6417J1700L8084L3426m2501K1392O3283o7958o1732n906o4442P4566
$$ plain form
11346 -47870 70239 108924 87411 6569 -38900 -133720 -146619 -75300 -101934 -103131 -82099 -61069
11334 -61069 -36049 -64727 -99472 -60395 -53275 -56109 2236 47802 37003 -29007 -21732 -35553
11322 -35553 -21629 -30937 22822 7681 -35313 -15038 60809 67333 56003 -41370 -20695 -73234
11310 -73234 -103638 -122416 -174786 -131105 -1217 2815 92621 144621 88396 27292 12113 -30065
11298 -30065 -54055 4506 64145 18963 78219 103831 -9299 32992 120675 139743 31447
11287 31447 -46770 5791 20222 86244 117681 29863 11009 34336 63640 82859 -9740 -20223
11275 -20223 38657 132869 69215 -45113 -63801 -97570 -47940 46624 73542 65056 26467 34244
11263 34244 118590 75742 68444 98331 140822 93644 82630 85616 29735 89472 56836 -6428
$$ packed form
11346d7870J18109L8685k1513q0842m5469r4820j2899P1319k6634j197K1032K1030
11334f1069K5020k8678l4745L9077P120k834N8345M5566j0799o6010P275j3821
11322c5553J3924r308N3759j5141m2994K0275P5847O524j1330r7373K0675n2539
11310g3234l0404j8778n2370M3681J29888M032Q9806N2000n6225o1104j5179m2178
11298c0065k3990N8561N9639m5182N9256K5612j13130M2291Q7683J9068j08296
11287C1447p8217N2561J4431O6022L1437q7818j8854K3327K9304J9219r2599j0483
11275b0223N8880R4212o3654j14328j8688l3769M9630R4564K6918q486l8589P777
11263C4244Q4346m2848p298K9887M2491m7178j1014K986n5881N9737l2636o3264
$$ plain form
11251 -6428 3205 26872 -54357 -84561 -81499 -55740 10618 78834 62500 40045 109692 147204
11239 147204 19732 -142574 -142153 -146708 -197286 -158314 -116753 -6359 27592 -48005 -36989
11228 -36989 8118 142259 101741 77752 -6023 -54851 -49586 43695 84223 63077 72230 74208
11216 74208 75878 151604 160597 155855 116571 81801 40974 -19067 7692 -60829 -66047 -52688
11204 -52688 -112253 -113939 -79075 -41923 -11131 18472 -22420 -18389 -50380 -34166 -23343 -15468
11192 -15468 41215 -41483 -188907 -131133 11466 -88933 -78265 13176 22081 7311 52438
11181 52438 166967 143744 44074 52085 43434 62683 10116 16956 79187 163573 195847 255598
11169 255598 232857 163574 55222 12042 41329 24361 54100 128725 111645 84173 -31499
$$ packed form
11251f428R633K3667q1229l0204L062K5759O6358O8216j6334k2455O9647L7512
11239A47204j27472j62306M21m555n0578L8972M1561J10394L3951p5597J1016
11228c6989M5107J34141m0518k3989q3775m8828N265R3281M0528k1146R153J978
11216G4208J670P5726Q993m742l9284l4770m0827o0041K6759o8521n218J3359
11204e2688n9565j686L4864L7152L0792K9603m0892M031l1991J6214J0823P875
11192a5468N6683q2698j47424N7774J42599j00399J0668R1441Q905j4770M5127
11181E2438J14529k3223r9670Q011q651J9249n2567O840O2231Q4386L2274N9751
11169B55598k2741o9283j08352m3180K9287j6968K9739P4625j7080k7472j15672
$$ plain form
11158 -31499 -27724 -23539 42909 47573 35506 97682 114024 113197 80373 75041 60281 -3599 -2268
11145 -2268 -51877 -115543 -128095 -63076 23598 41215 46649 106214 134423 61988 -93170 -140994
11133 -140994 -8653 33272 -35260 -58465 -60361 -61832 -92472 -165828 -74923 -63006 -120050 -76612
11121 -76612 -3448 -18531 -22803 -123066 -169580 -174889 -198861 -60991 19197 -85079 -133803
11110 -133803 -56899 52364 101143 62217 110098 81482 12160 -88594 -142450 -184786 -193043
11099 -193043 -216440 -188138 -128361 -48892 2366 16321 11834 25835 -29432 -106059 -168384 -79069
11087 -79069 -58871 -37779 -57020 -55742 -23573 -130992 -162496 -174043 -160442 -167667 -206790 -222325
11075 -222325 -101868 -60921 -79702 -97115 -96906 -25456 61401 82598 85457 60481 8314 -37362
$$ packed form
11158c1499L775M185O6448M664j2067O2176J6342q27l2824n332j4760o3880J331
11145b268m9609o3666j2552O5019Q6674J7617N434N9565K8209p2435j55158m7824
11133a40994J32341M1925o8532k3205j896j471l0640p3356R0905J1917n7044M3438
11121g6612P3164j5083m272j00263m6514n309k3972J37870Q0188j04276m8724
11110a33803P6904J09263M8779l8926M7881k8616o9322j00754n3856m2336q257
11099a93043k3397K8302N9777P9469N1258J3955m487J4001n5267p6627o2325Q9315
11087g9069K0198K1092j9241J278L2169j07419l1504j1547J3601p225l9123j5535
11075b22325J20457M0947j8781j7413K09P1450Q6857K1197K859k4976n2167m5676
$$ plain form
11063 -37362 -12375 -37331 -124733 -182950 -86240 23364 78532 64981 21858 6211 14808 -9636
11051 -9636 16586 -21927 -64188 11413 103187 214555 228048 255724 256434 250444 264027 279801
11039 279801 243194 213350 240131 352730 454454 532129 499886 512039 563994 517484 502125
11028 502125 516521 473712 435685 510667 655096 760043 842883 892065 898581 897478 809564
11017 809564 669807 574463 477016 405880 357312 418723 435614 521282 568038 582290 577201
11006 577201 546481 450386 343986 260083 199852 261667 302696 255621 166641 222913 221019
10995 221019 232508 154849 119791 170500 160835 104780 46703 -13905 -30956 -73057 -4441 49725
10983 49725 34687 44420 14908 9839 26724 16566 -57247 -89340 -15902 -30651 -23987 16259
$$ packed form
11063c7362K4987k4956q7402n8217R6710J09604N5168j3551m3123j5647Q597k4444
11051i636K6222l8513m2261P5601R1774J11368J3493K7676P10n990J3583J5774
11039B79801l6607k9844K6781J12599J01724P7675l2243J2153N1955m6510j5359
11028E02125J4396m2809l8027P4982J44429J04947Q2840M9182O516j103q7914
11017H09564j39757r5344r7447p1136m8568O1411J6891Q5668M6756J4252n089
11006E77201l0720r6095j06400q3903o0231O1815M1029m7075q8980N6272j894
10995B21019J1489p7659l5058N0709r665n6055n8077o0608j7051m2101O8616N4166
10983D9725j5038R733k9512n069J6885j0158p3813l2093P3438j4749O664M0246
$$ plain form
10971 16259 81333 170300 144764 117832 102574 47816 5218 57172 163984 112033 3856
10960 3856 -27398 -60684 -56022 -21963 -3458 -2186 2547 -11669 -3820 -40155 36461 43422 43000
10947 43000 -10983 -42370 -90612 43036 31353 7501 44288 57525 94253 144937 96915
10936 96915 -12226 -84700 -109742 -69651 -117657 -108656 -92685 1406 -18831 24704 113419 68670
10924 68670 -50248 -86432 -91735 -109492 -144931 -92295 2771 -50237 -87245 -56634 -93571 -32392
10912 -32392 36065 21646 85080 97349 -22299 -92219 -91598 -29168 18260 16288 68541 139565
10900 139565 31484 -66232 -80088 -56674 31125 31391 79811 106809 5948 -2207 -11322 33761
10888 33761 70590 79191 33261 16969 87342 113512 106493 55607 -45765 -13108 -28788 -31112
$$ packed form
10971A6259O5074Q8967k5536k6932j5258n4758m2598N1954J06812n1951j08177
10960C856l1254l3286M662L4059J8505J272M733j4216P849l6335P6616O961m22
10947D3000n3983l1387m8242J33648j1683k3852L6787J3237L6728N0684m8022
10936I6915j09141p2474k5042M0091m8006R001J5971R4091k0237M3535Q8715m4749
10924F8670j18918l6184n303j7757l5439N2636R5066n3008l7008L0611l6937O1179
10912c2392O8457j4419O3434J2269j19648o9920O21O2430M7428j972N2253P1024
10900A39565j08081r7716j3856K3414Q7799K66M8420K6998j00861q155r115M5083
10888C3761L6829Q601m5930j6292P0373K6170p019n0886j01372L2657j5680k324
$$ plain form
10876 -31112 53011 78948 155203 172524 87508 64857 14766 -19159 68611 92750 103719 125769
10864 125769 120337 100906 132395 125223 78330 78964 95717 75595 -2643 -83696 -87617 22401
10852 22401 100781 52887 44777 65953 74190 95545 92193 107394 138641 239158 207165 189554
10840 189554 173191 173990 153366 67498 122265 160811 176839 104476 61803 23149 2921 27824
10828 27824 1485 76448 163682 159657 85005 82393 121129 18980 -2296 24556 -28680 -28173
10816 -28173 54201 26987 14142 58439 76366 94611 103921 40641 31497 63054 55793 -34042
10804 -34042 -101254 7826 12544 31407 69493 30597 44517 -25988 -13974 -18224 23321 20859
10792 20859 -11035 47189 -26971 -8046 71765 101150 192505 236758 197051 228093 348557
$$ packed form
10876c1112Q4123K5937P6255J7321q5016k2651n0091l3925Q7770K4139J0969K2050
10864A25769n432j9431L1489p172m6893O34J6753k0122p8238q1053l921J10018
10852B2401P8380m7894q110K1176Q237K1355l352J5201L1247J00517l1993j7611
10840A89554j6363P99k0624q5868N4767L8546J6028p2363m2673l8654k0228K4903
10828B7824k6339P4963Q7234m025p4652k612L8736j02149k1276K6852n3236N07
10816b8173Q2374k7214j2845M4297J7927J8245R310o3280r144L1557p261q9835
10804c4042o7212J09080M718J8863L8086l8896J3920p0505J2014m250M1545k462
10792B0859l1894N8224p4160J8925P9811K9385R1355M4253l9707L1042J20464
$$ plain form
10781 348557 317773 279296 240684 123165 4438 -27513 -32727 21391 31343 -16068 6893
10770 6893 29041 23376 25732 -6790 -21696 -42626 18824 55483 24109 92202 131029 57913
10758 57913 44679 4660 -4135 62552 95072 27823 -61328 -207756 -196609 -135658 -22750
10747 -22750 21869 39486 73284 105156 128599 152660 141774 172597 145231 124245 148631 143574
10735 143574 111704 99386 92165 77810 125481 51682 -3381 9665 71561 138739 121404 103166
10723 103166 56224 39325 75047 138403 129709 53768 -57133 -80307 -75177 -128540 -176247 -203735
10711 -203735 -255000 -231994 -155738 -161743 -208328 -178859 -178270 -294868 -375500 -425664 -361192 -274235
10699 -274235 -224005 -188080 -186964 -211252 -209320 -176325 -151127 -119182 -97156 -149086 -148148 -54688
$$ packed form
10781C48557l0784l8477l8612j17519j18727l1951n214N4118R952m7411K2961
10770F893K2148n665K356l2522j4906k0930O1450L6659l1374O8093L8827p3116
10758E7913j3234m0019q795O6687L2520o7249q9151j46428J1147O0951J12908
10747b2750M4619J7617L3798L1872K3443K4061j0886L0823k7366k0986K4386n057
10735A43574l1870j2318p221j4355M7671p3799n5063J3046O1896O7178j7335j8238
10723A03166m6942j6899L5722O3356q694p5941j10901k3174N130n3363m7707k7488
10711b03735n1265K3006P6256o005m6585K9469N89j16598q0632n0164O4472Q6957
10699b74235N0230L5925J116k4288J932L2995K5198L1945K2026n1930R38R3460
$$ plain form
10687 -54688 -26905 -40435 -75752 -136495 -143763 -136262 -186470 -165588 -186712 -162444 -47824 -13223
10675 -13223 23057 17800 -44304 -41189 62253 151015 33805 -41371 -67318 -13956 -43287 7578
10663 7578 70310 113409 161506 192200 233093 223303 326960 353837 334088 414553 552305 640584
10651 640584 727328 789295 891108 824586 784111 699707 695176 748620 843646 924477 886712
10640 886712 879314 1024439 1123855 1216972 1451408 1640813 1840930 2108082 2516373 2894096
10630 2894096 3174949 3400117 3642323 3950344 4407153 5071032 5892411 6961939 8361237
10621 8361237 10424602 13199936 16954901 21805496 27864021 35179330 42776331 48543656
10613 48543656 50754665 49582283 46931015 44685411 44086853 45876091 50600568 58654940
$$ packed form
10687e4688K7783j3530l5317o0743p268P501n0208K0882k1124K4268J14620L4601
10675a3223L6280n257o2104L115J03442Q8762j17210p5176k5947N3362k9331N0865
10663G578O2732M3099M8097L0694M0893r790J03657K6877j9749Q0465J37752Q8279
10651F40584Q6744O1967J01813o6522m0475q4404m531N3444R5026Q0831l7765
10640H86712p398J45125R9416R3117K34436J89405K00117K67152M08291L77723
10630B894096K80853K25168K42206L08021M56809O63879Q21379J069528J399298
10621H361237K063365K775334L754965M850595O058525P315309P597001N767325
10613D8543656K211009j172382k651268k245604n98558J789238M724477Q054372
$$ plain form
10605 58654940 70387575 85250176 100414468 110421634 110903616 103101144 92437442
10598 92437442 83613491 78886490 78912872 83994237 94354468 109875203 129105908 147217337
10590 147217337 156188338 150744803 134172069 114365300 97615775 86367042 80693434
10583 80693434 79952930 83833954 91777163 101976692 110776473 112766007 105138340 90763333
10575 90763333 75167451 62357063 53527222 48325896 46159739 46404624 48344605 50850409
10567 50850409 52294045 50985591 46130410 38808077 31064956 24409965 19257793 15457409
10559 15457409 12717632 10672731 9041069 7890940 7112502 6316767 5621769 5068749 4572436
10550 4572436 4150092 3853250 3557107 3181382 2881856 2642543 2491849 2410625 2352345 2198689
$$ packed form
10605E8654940J1732635J4862601J5164292J0007166M81982p802472j0663702
10598I2437442q823951m727001K6382N081365J0360231J5520735J9230705J8111429
10590A47217337Q971001n443535j6572734j9806769j6749525j1248733n673608
10583H0693434p40504L881024P943209J0199529Q799781J989534p627667j4375007
10575I0763333j5595882j2810388q829841n201326k166157K44885J939981K505804
10567E0850409J443636j308454m855181p322333p743121o654991n152172l800384
10559A5457409k739777k044901j631662j150129p78438p95735o94998n53020m96313
10550D572436m22344k96842k96143l75725k99526k39313j50694q1224n8280j53656
$$ plain form
10540 2198689 2113805 2091371 2033764 1946538 1896886 1778728 1681012 1588462 1498007 1396253 1309737
10529 1309737 1342534 1367531 1287116 1232462 1186912 1151657 1128467 1196761 1111631 1035519 1028339
10518 1028339 1028539 1034385 952817 963630 921071 883207 902430 883689 895152 998326 941381 933094
10506 933094 852027 785513 737021 690773 648952 575438 564235 563786 628663 664525 639623 645996
10494 645996 626737 605878 595566 670113 707823 650494 609225 632531 644360 682079 732110
10483 732110 747434 744530 682807 699513 694730 691052 769917 766769 720801 678911 516881 445383
10471 445383 565767 676805 795854 782343 742670 661637 614618 582143 470162 405577 398730
10460 398730 416098 451612 440806 448471 341060 291897 347615 447422 490648 489636 449034 420573
$$ packed form
10540B198689q4884k2434n7607q7226m9652j18158r7716r2550r0455j01754q6516
10529A309737L2797K4997q0415n4654m5550l5255k3190O8294q5130p6112p180
10518A028339K00N846q1568J0813m2559l7864J9223j8741J1463J03174n6945q287
10506I33094q1067o6514m8492m6248m1821p3514j1203m49O4877L5862k4902O373
10494F45996j9259k0859j0312P4547L7710n7329m1269K3306J1829L7719N0031
10483G32110J5324k904o1723J6706m783l678P8865l148m5968m1890j62030p1498
10471D45383J20384J11038J19049j3511l9673q1033m7019l2475j11981o4585o847
10460C98730J7368L5514j0806P665j07411m9163N5718R9807M3226j012m0602k8461
$$ plain form
10448 420573 345012 294805 294539 303147 243697 224302 252890 245379 227870 210087 199295 226779
10436 226779 281799 229769 150262 130294 153672 185909 152482 174505 209333 160989 167797 193271
10424 193271 215276 174177 162564 132497 117282 177870 225602 258341 179629 162374 220110
10413 220110 253672 247053 221292 286743 342506 345090 336303 249644 185225 88686 120242 135603
10401 135603 102984 7672 28202 128335 144151 129217 108951 72659 58522 33142 36391
10390 36391 7192 9398 119319 187444 214544 255831 289919 227301 213096 266075 252139 209567
10378 209567 120593 96137 93489 175327 74827 39313 128420 236238 214570 216252 270605
10367 270605 268040 322863 256124 290079 280524 231130 210009 227348 203842 186059 148195 134658
$$ packed form
10448D20573p5561n0207k66Q608n9450j9395K8588p511j7509j7783j0792K7484
10436B26779N5020n2030p9507j9968K3378L2237l3427K2023L4828m8344O808K5474
10424A93271K2005m1099j1613l0067j5215O0588M7732L2739p8712j7255N7736
10413B20110L3562o619k5761O5451N5763K584q787q6659o4419r6539L1556J5361
10401A35603l2619r5312K0530J00133J5816j4934k0266l6292j4137k5380L249
10390C6391k9199K206J09921O8125K7100M1287L4088o2618j4205N2979j3936m2572
10378B09567q8974k4456k648Q1838j00500l5514Q9107J07818k1668J682N4353
10367B70605k565N4823o6739L3955r555m9394k1121J7339k3506j7783l7864j3537
$$ plain form
10355 134658 139048 155969 84680 60975 56269 65119 36959 41695 132667 196022 121667 121116 170021
10342 170021 186710 111627 37669 26517 38630 12204 -26726 8727 169021 188009 177660
10331 177660 148618 81918 -43253 -40241 48945 49318 12224 11580 98493 121029 76430 90305
10319 90305 79349 10640 -3107 33279 121701 172594 170448 142768 81277 37189 -14655 55963
10307 55963 102317 123702 125766 170114 133227 50944 131702 173603 71223 42757 26414 -69970
10295 -69970 -3610 76217 26900 38894 74908 119396 122706 109957 111733 89829 124077 87340
10283 87340 23217 -42715 -6349 -42485 -63610 -6652 -15171 -52036 -4492 35234 23618 -61590
10271 -61590 -59264 40653 89635 72909 65290 116436 157884 144341 179185 177714 154719 188453
$$ packed form
10355A34658M390J6921p1289k3705m706Q850k8160M736R0972O3355p4355n51M8905
10342A70021J6689p5083p3958j1152J2113k6426l8930L5453J60294J8988j0349
10331A77660k9042o6700j25171L012Q9186L73l7094o44Q6913K2536m4599J3875
10319I0305j0956o8709j3747L6386Q8422N0893k146k7680o1491m4088n1844P0618
10307E5963M6354K1385K064M4348l6887q2283Q0758M1901j02380k8466j6343r6384
10295f9970O6360P9827m9317J1994L6014M4488L310j2749J776k1904L4248l6737
10283H7340o4123o5932L6366l6136k1125N6958q519l6865M7544L9726j1616q5208
10271f1590K326R9917M8982j6726p619N1146M1448j3543L4844j471k2995L3734
$$ plain form
10259 188453 258648 218811 123733 79512 70796 -31232 -68924 -52240 94834 130073 11071
10248 11071 -4699 47777 177845 157774 87429 154628 181304 130361 168416 170711 184246 139561
10236 139561 5677 -50639 -77550 -95764 -36428 -30133 -3347 -24840 76725 96301 68096
10225 68096 29565 93695 38834 -55854 11437 75697 176145 136239 67493 -11437 -27370
10214 -27370 20089 15156 127739 99755 20086 65771 125576 130495 64124 132720 155407 184355
10202 184355 144096 129128 175558 172406 116606 84060 53826 23153 34697 96413 65115 52296
10190 52296 25908 9065 9361 9888 24343 -33603 -74473 -57419 45767 138893 163802 186951
10178 186951 144682 102149 151196 265418 295324 307769 340127 356341 297665 355607 376122
$$ packed form
10259A88453P0195l9837r5078m4221q716j02028l7692J6684J47074L5239j19002
10248A1071j5770N2476J30068k0071p0345O7199K6676n0943L8055K295J3535m4685
10236A39561j33884n6316k6911j8214N9336O295K6786k1493J01565J9576k8205
10225F8096l8531O4130n4861r4688O7291O4260J00448l9906o8746p8930j5933
10214b7370M7459m933J12583k7984p9669M5685N9805M919o6371O8596K2687K8948
10202A84355m0259j4968M6430l152n5800l2546l0234l0673J1544O1716l1298j2819
10190E2296k6388j6843K96N27J4455n7946m0870J7054J03186R3126K4909K3149
10178A86951m2269m2533M9047J14222K9906J2445L2358J6214n8676N7942K0515
$$ plain form
10167 376122 530658 665556 628429 549946 471483 551942 642823 677337 659651 628849 572472
10156 572472 644046 753536 842008 850732 830810 701064 487418 383301 421303 423926 442563
10145 442563 493327 597466 688092 724203 752718 699402 583464 503743 397781 267901 295409
10134 295409 356207 333637 301778 258007 171535 114214 118552 152226 184203 220341 190477 127404
10122 127404 133015 175714 160007 83769 24866 116465 144658 108426 143991 199414 275898 172582
10110 172582 45574 -3843 61406 37304 -34618 -65964 -48197 -56735 -152772 -102748 -8066
10099 -8066 -25462 90141 169353 100397 -18726 -129817 -132285 -50672 -39088 -42322 -65682 -31770
10087 -31770 52492 1798 91832 60036 -35119 25127 -22486 -6767 743 -4787 -56026 -26165
$$ packed form
10167C76122J54536J34898l7127p8483p8463Q0459R0881L4514j7686l0802n6377
10156E72472P1574J09490Q8472Q724j9922j29746k13646j04117L8002K623J8637
10145D42563N0764J04139R0626L6111K8515n3316j15938p9721j05962j29880K7508
10134B95409O0798k2570l1859m3771q6472n7321M338L3674L1977L6138k9864o3073
10122A27404N611M2699j5707p6238n8903R1599K8193l6232L5565N5423P6484j03316
10110A72582j27008m9417O5249k4102p1922l1346J7767q538r6037N0024R4682
10099h066j7396J15603P9212o8956j19123j11091k468Q1613J1584l234k3360L3912
10087c1770Q4262n0694R0034l1796r5155O0246m7613J5719P510n530n1239K9861
$$ plain form
10075 -26165 26262 8386 54799 65244 90612 79412 10007 -7983 10475 -84669 -123533 -69310
10063 -69310 21157 -5770 -66339 -1300 24070 -59368 -166445 -133158 -37093 -67401 -57306
10052 -57306 -40717 -89755 -125483 -136189 -95415 -131099 -155859 -73937 -36035 -63992 -24497 504
10040 504 50301 -3511 33660 52076 57399 -14436 3078 80474 76058 20839 83286 104814
10028 104814 86940 50254 -14689 -105926 -119153 -132745 -132002 -138871 -35189 26634 41051 62328
10016 62328 55512 4844 -4548 16580 -12775 -28033 21193 116496 89876 64037 20150 -4939
10004 -4939 -121809 -149360 -92453 -54660 -94343 -155894 -109104 25898 167466 250032 169982
9993 169982 79853 1224 -9545 -14158 51468 40624 -34434 -133956 -77837 -49210 22502 4589
$$ packed form
10075b6165N2427j7876M6413J0445K5368j1200o9405j7990J8458r5144l8864N4223
10063f9310R0467k6927o0569O5039K5370q3438j07077L3287R6065l0308J0095
10052e7306J6589m9038l5728j0706M0774l5684k4760Q1922L7902k7957L9495K5001
10040E04M9797n3812L7171J8416N323p1835J7514P7396m416n5219O2447K1528
10028A04814j7874l6686o4943r1237j3227j3592P43o869J03682O1823J4417K1277
10016F2328o816n0668r392K1128k9355j5258M9226R5303k6620k5839m3887k5089
10004d939j16870k7551N6907L7793l9683o1551M6790J35002J41568Q2566q0050
9993A69982r0129p8629j0769m613O5626j0844p5058r9522N6119K8627P1712j7913
$$ plain form
9981 4589 -46715 -62451 -19902 -69201 -74674 -42384 -45606 52473 70385 2129 -62535 -137882
9969 -137882 -77352 -42171 -14379 103208 160152 49386 50191 84187 39282 -8572 3460 -3277
9957 -3277 44781 92244 13710 -13791 66603 67917 34774 67554 126657 145452 87133 8254
9945 8254 22593 17056 30119 -23287 -57939 -66693 -106252 -44533 73826 254161 323413 341374
9933 341374 641587 1100834 1511942 1296398 794893 388357 218279 136966 49864 -1030
9923 -1030 -29791 -67246 -41116 -34872 -32352 -74618 5469 -12702 -28865 -25433 22933 124807
9911 124807 175973 94393 30909 -30720 -15499 -4157 -57465 -94700 3954 149649 95362
9900 95362 -17395 -3586 56390 106953 52698 -17988 -4739 20882 40395 56570 59787 88887
$$ packed form
9981D589n1304j5736M2549m9299n473L2290l222R8079J7912o8256o4664p5347
9969a37882O0530L5181K7792J17587N6944j10766Q05L3996m4905m7854J2032o737
9957c277M8058M7463p8534k7501Q0394J314l3143L2780N9103J8795n8319p8879
9945H254J4339n537J3063n3406l4652q754l9559O1719J18359J80335O9252J7961
9933C41374L00213M59247M11108k15544n01505m06536j70078q1313q7102n0894
9923a030k8761l7455K6130O244K520m2266Q0087j8171j6163L432M8366J01874
9911A24807N1166q1580o3484o1629J5221J1342n3308l7235R8654J45695n4287
9900I5362j12757J3809N9976N0563n4255p0686J3249K5621J9513J6175L217K9100
$$ plain form
9888 88887 95494 84962 96243 82866 47388 29931 -15890 -54374 7166 82956 34198 -70809
9876 -70809 -17780 40258 -56857 -124503 -160944 -137226 -64910 33290 43089 30924 -21312 -27801
9864 -27801 39860 29593 -19749 -38398 -51267 -30132 -6322 66344 117690 43093 61584 25813
9852 25813 -50186 -118319 -53864 -92261 -134433 -137054 -96462 -23974 59256 60276 -40555 -18732
9840 -18732 41219 3409 -41999 -12302 33179 59550 56923 -39445 -26815 -55620 -151206 -184103
9828 -184103 -126983 -168351 -230446 -200690 -156646 -195151 -135231 -134181 -117288 -134525 -193294 -146751
9816 -146751 -138641 -158557 -143693 -106980 10400 31404 21834 -71320 -5146 25999 64769 87285
9804 87285 95874 553 -128424 -143508 -74678 -31354 -30621 -2001 -6332 -66836 -88257 -12283
$$ packed form
9888H8887O607j0532J1281j3377l5478j7457m5821l8484O1540P5790m8758j05007
9876g0809N3029N8038r7115o7646l6441K3718P2316R8200R799j2165n2236o489
9864b7801O7661j0267m9342j8649j2869K1135K3810P2666N1346p4597J8491l5771
9852B5813p5999o8133O4455l8397m2172k621M0592P2488Q3230J020j00831K1823
9840a8732N9951l7810m5408K9697M5481K6371k627r6368J2630k8805r5586l2897
9828a84103N7120m1368o2095K9756M4044l8505N9920J050J6893j7237n8769M6543
9816a46751Q110j9916J4864L6713J17380K1004r570r3154O6174L1145L8770K2516
9804H7285Q589r5321j28977j5084O8830M3324P33K8620m331o0504k1421P5974
$$ plain form
9792 -12283 73943 14110 8382 -4081 -84760 -122986 -42925 -73434 -30192 -21899 -33543 -27638
9780 -27638 -34416 29493 71385 62257 -10168 -64205 -67788 -4757 29204 67506 50910 -23515
9768 -23515 -49875 16880 98639 112565 128602 91287 123449 103044 100305 87994 132402 122517
9756 122517 21739 -46667 -66764 -7479 34818 23970 -26708 -35625 23860 179148 123180
9745 123180 -2542 -67506 -81515 -91015 -10995 149647 210698 56931 11202 52318 58860
9734 58860 90254 66278 -29939 -62242 41819 43563 -48074 -94386 -172958 -158226 -80398 -35023
9722 -35023 -37868 -58457 -44248 -24150 25095 110422 134006 117927 216755 229542 163104 80110
9710 80110 103809 134376 103487 12170 21165 -58006 -100285 -83626 -163904 -131098 -61046 -2669
$$ packed form
9792a2283Q6226n9833n728j2463q0679l8226Q0061l0509M3242Q293j1644N905
9780b7638o778O3909M1892r128p2425n4037l583O3031L3961L8302j6596p4425
9768b3515k6360O6755Q1759J3926J6037l7315L2162k0405k739j2311M4408r885
9756A22517j00778o8406k0097N9285M2297j0848n0678q917N9485J55288n5968
9745A23180j25722o4964j4009r500Q0020J60642O1051j53767m5729M1116O542
9734E8860L1394k3976r6217l2303J04061J744r1637m6312p8572J4732P7828M5375
9722c5023k845k0589J4209K0098M9245Q5327K3584j6079R8828J2787o6438q2994
9710H0110K3699L0567l0889r1317Q995p9171m2279J6659q0278L2806P0052N8377
$$ plain form
9698 -2669 23620 9032 -52644 -122390 -152387 -22107 56540 9909 59289 46049 -77637 -40134
9686 -40134 -64538 -136040 -169648 -75208 18555 95919 64374 42201 6067 -45848 -61122 -7138
9674 -7138 23134 -26899 -107101 -38291 34407 37008 90392 60787 4509 50928 83514 -970
9662 -970 -33814 -81847 -75532 -49964 -41689 -47002 -52096 -7799 59556 -436 20609 89406 175258
9649 175258 169714 225303 375995 650031 942301 921453 743733 533746 338786 236518
9639 236518 113853 54733 106076 160876 161152 131905 161816 173293 212438 116331 -9767 -97550
9627 -97550 -123847 -30200 -19748 -66425 -29616 -15157 17605 43305 33610 -45829 -83187 -140798
9615 -140798 -85052 -14472 -6927 18672 51215 92164 29511 50411 -27701 -31781 -47978 -87383
$$ packed form
9698b669K6289j4588o1676o9746k9997J30280P8647m6631M9380j3240j23686L7503
9686d0134k4404p1502l3608R4440R3763P7364l1545k2173l6134n1915j5274N3984
9674g138L0272n0033q0202O8810P2698K601N3384k9605n6278M6419L2586q4484
9662i70l2844m8033O315K5568Q275n313n094M4297O7355n9992K1045O8797Q5852
9649A75258n544N5589J50692K74036K92270k0848j77720k09987j94960j02268
9639B36518j22665n9120N1343N4800K76k9247K9911J1477L9145r6107j26098q7783
9627i7550k6297R3647J0452m6677L6809J4459L2762K5700r695p9439l7358n7611
9615a40798N5746P0580P545K5599L2543M0949o2653K0900p8112m080j6197l9405
$$ plain form
9603 -87383 -70611 -75492 -33467 -126729 -206724 -166857 -88022 -15086 33684 21202 32878 82535
9591 82535 169089 155602 109276 51576 94743 111850 57056 -12215 -28254 -46619 -64909 -84510
9579 -84510 -63270 -81933 -102286 -21001 -56262 -194081 -166954 -138360 -113343 -2057 111494
9568 111494 119776 134960 58230 41025 14027 11189 15519 49100 9244 7859 -13249 -37173
9556 -37173 12885 45608 71779 -4953 -3844 54209 39723 41995 -46101 -7570 60016 23134
9544 23134 -46985 -185625 -210308 -149123 -115332 -62995 -63561 -65726 -98458 -107978 -51216 27370
9532 27370 -35167 -97768 -78830 -6123 44916 75461 73099 120779 125045 108867 105822 80252
9520 80252 2563 -21803 9839 11754 -72060 -88303 -61581 -90496 -94756 -31527 42496 75826
$$ packed form
9603h7383J6772m881M2025r3262p9995L9867P8835P2936M8770j2482J1676M9657
9591H2535Q6554j3487m6326n7700M3167J7107n4794o9271j6039j8365j8290j9601
9579h4510K1240j8663k0353Q1285l5261j37819K7127K8594K5017J11286J13551
9568A11494Q282J5184p6730j7205k6998k838M330L3581l9856j385k1108k3924
9556c7173N0058L2723K6171p6732J109N8053j4486K272q8096L8531O7586l6882
9544B3134p0119j38640k4683O1185L3791N2337n66k165l2732r520N6762P8586
9532B7370o2537o2601J8938P2707N1039L0545k362M7680M266j6178l045k5570
9520H0252p7689k4366L1642J915q3814j6243K6722k8915m260O3229P4023L3330
$$ plain form
9508 75826 49353 978 10765 -38994 -38459 -5868 -12616 45091 25985 -60611 -82572 -139052 -192713
9495 -192713 -159277 -72541 -3839 53769 42669 -12509 5810 -29800 -33254 -1421 12794 -22803
9483 -22803 -767 -28500 80169 120119 92251 33602 35309 68061 52679 66044 68859 80891
9471 80891 -9054 -31846 -32322 -25554 40262 101202 95908 -3030 1645 5463 -3586 31464 30934 8840
9457 8840 38406 94806 121876 167080 147258 150809 105428 91049 100319 88177 64116 22879
9445 22879 37476 27935 66298 67216 47735 91935 110721 93177 55651 93609 145751 122641
9433 122641 126689 81422 -7689 -102865 -111755 -126960 -60503 22928 26911 -8503 -31081 -59677
9421 -59677 -102575 -28743 74897 79514 98606 49305 15638 12565 9768 3851 29444 22686 -21567
$$ packed form
9508G5826k6473m8375R787m9759N35L2591o748N7707j9106q6596k1961n6480n3661
9495a92713L3436Q6736O8702N7608j1100n5178J8319l5610l454L1833J4215l5597
9483b2803K2036k7733J08669L9950k7868n8649J707L2752j5382J3365K815J2032
9471H0891q9945k2792m76O768O5816O0940n294r8938M675L818r049L5050n30k2094
9457H840K9566N6400K7070M5204j9822L551m5381j4379R270j2142k4061m1237
9445B2879J4597r541L8363R18j9481M4200J8786j7544l7526L7958N2142k3110
9433A22641M048m5267q9111r5176q890j5205O6457Q3431L983l5414k2578k8596
9421e9677m2898P3832J03640M617J9092m9301l3667l073k797n917K5593o758m4253
$$ plain form
9408 -21567 -64509 -48415 -25931 11168 12500 87476 138158 104227 53150 -13355 -29006 -83049
9396 -83049 -120175 -62007 17622 27556 62077 114305 110497 18564 9862 6414 -45977 -19202 90257
9383 90257 207004 175873 99538 64690 51594 60935 138745 200099 212983 155977 176293 121598
9371 121598 46341 47067 10046 28209 -54387 -9649 107996 79402 -34628 -43556 52159 -43712
9359 -43712 -108759 -134766 -173253 -143383 -108535 -125632 -104700 -70525 -34962 41066 60765 19000
9347 19000 20757 -21587 23780 27392 -398 -47061 4245 88782 82329 105569 109150 122506 82661
9334 82661 138474 121908 141607 114177 168555 158553 115350 8827 -37634 -67681 25710 9208
9322 9208 39719 82666 46865 -79242 -113027 -46367 -43063 15470 3253 5696 35691 -25357
$$ packed form
9408b1567m2942J6094K2484L7099J332P4976N0682l3931n1077o6505j5651n4043
9396h3049l7126N8168P9629R934L4521N2228l808r1933q702l448n2391K6775J09459
9383I0257J16747l1131p6335l4848j3096R341P7810O1354J2884n7006K0316n4695
9371A21598p5257P26l7021J8163q2596M4738J17645k8594j14030q928R5715r5871
9359d3712o5047k6007l8487K9870L4848j7097K0932L4175L5563P6028J9699m1765
9347A9000J757m2344M5367L612k7790m6663N1306Q4537o453K3240L581J3356l9845
9334H2661N5813j6566J9699k7430N4378j0002m3203j06523m6461l0047R3391j6502
9322I208L0511M2947l5801j26107l3785O6660L304N8533j2217K443K9995o1048
$$ plain form
9310 -25357 -47470 -118982 -55724 -79684 -135334 -93234 6112 -20086 -142731 -185113 -70979
9299 -70979 1205 16833 69634 101895 176653 165654 103590 -862 -25459 -21376 -4789 -32045
9287 -32045 19039 26924 -164 -28951 -28685 -53943 -4035 62742 20946 -53328 -68425 -40169
9275 -40169 44175 64515 40047 18527 2673 54301 10914 -95236 -151845 -98698 -110303 -84553
9263 -84553 -73271 -89886 -33701 -19681 -46138 -96970 -50833 58369 98513 85346 -1280 -122446
9251 -122446 -175561 -152852 -100767 -68042 -85311 -84287 -94840 10355 50046 44494 85643 -1184
9239 -1184 -98021 -119411 -58812 -80328 -87765 -129285 -60012 -15682 13194 76041 83024 70927
9227 70927 46215 192 -16001 -10039 17084 11570 46479 57967 41797 43573 47141 59650 62246
$$ packed form
9310b5357k2113p1512O3258k3960n5650M2100R9346k6198j22645m2382J14134
9299g0979P2184J5628N2801L2261P4758j0999o2064j04452k4597M083J6587k7256
9287c2045N1084P885k7088k8787K66k5258M9908O6777m1796p4274j5097K8256
9275d0169Q4344K0340k4468k1520j5854N1628m3387j06150n6609N3147j1605K5750
9263h4553J1282j6615N6185J4020k6457n0832M6137J09202M0144j3167q6626j21166
9251a22446n3115K2709N2085L2725j7269J024j0553J05195L9691n552M1149q6827
9239a184r6837k1390O0599k1516p437m1520O9273M4330K8876O2847O983j2097
9227G0927k4712m6023j6193N962K7123n514L4909J1488j6170J776L568J2509K596
$$ plain form
9214 62246 -49488 -107226 -72365 -77152 -111363 -52193 -12119 48539 89258 115688 7807 -64300
9202 -64300 -53922 60173 65153 -11783 -49405 -22080 -5707 -42663 -13301 9362 -3488 -27699
9190 -27699 14367 19056 20208 24298 42116 -794 -68277 -81323 -36277 65238 104342 130370
9178 130370 92596 76618 60632 2680 24757 -177 -39903 -55092 -40254 -86110 -100576 -45558
9166 -45558 -41632 18629 -49520 -36364 -2339 -24133 -28565 106832 109293 16300 -59296 -119597
9154 -119597 -51055 43487 29148 78963 74986 16492 11257 16444 3382 -20686 -21232 -105422 -116060
9141 -116060 -64210 -50243 -65672 30234 71112 58846 71490 93097 1699 27469 58476 41566
9129 41566 33468 16593 -4775 -49885 -47377 12909 69075 108432 46893 19800 -28396 6139
$$ packed form
9214F2246j11734n7738L4861m787l4211N9170M0074O0658M0719K6430j07881p2107
9202f4300J0378J14095M980p6936l7622K7325J6373l6956K9362K2663j2850k4211
9190b7699M2066M689J152M090J7818m2910o7483j3046M5046J01515L9104K6028
9178A30370l7774j5978j5986n7952K2077k4934l9726j5189J4838m5856j4466N5018
9166d5558L926O0261o8149J3156L4025k1794m432J35397K461r2993p5596o0301
9154a19597O8542R4542j4339M9815l977n8494n235N187j3062k4068n46q4190j0638
9141a16060N1850J3967j5429R5906M0878j2266J2644K1607r1398K5770L1007j6910
9129D1566q098j6875k1368m5110K508O0286N6166L9357o1539k7093m8196L4535
$$ plain form
9117 6139 18021 -25597 -66049 -143531 -44158 -24523 -47524 -57703 -39016 13365 72941 146335
9105 146335 193681 137670 138388 123045 113967 120178 109049 93077 34276 718 -27410 27457
9093 27457 64142 73488 6146 -76499 -47390 -51942 -10370 -6064 -25804 -7372 -89166 -93542 -116669
9080 -116669 -37079 9539 -57943 -46862 -29179 -3318 30069 91240 124416 77439 77335 63046
9068 63046 60139 26214 57008 85683 75405 41669 21997 -44524 -101101 -102665 -34274 30704
9056 30704 25254 -26128 6239 -24304 -55151 -57035 -69439 -130773 -112531 -110368 -86167 -15498
9044 -15498 42477 68322 -11536 -124218 -162939 -167285 -11379 83556 27681 9262 7151 -30437
9032 -30437 -81058 -176750 -124844 -102915 -122144 -87815 -113854 -129226 -71713 -13884 -22199 -62730
$$ packed form
9117F139J1882m3618m0452p7482R9373J9635k3001j0179J8687N2381N9576P3394
9105A46335M7346n6011P18j5343r078O211j1129j5972n8801l3558k8128N4867
9093B7457L6685R346o7342q2645K9109m552M1572M306j9740J8432q1794m376k3127
9080a16669P9590M6618o7482J1081J7683K5861L3387O1171L3176m6977j04j4289
9068F3046k907l3925L0794K8675j0278l3736j9672o6521n6577j564O8391O4978
9056C0704n450n1382L2367l0543l0847j884j2404o1334J8242K163K4201P0669
9044a5498N7975K5845p9858j12682l8721m346J55906R4935n5875j8419k111l7588
9032c0437n0621r5692N1906K1929j9229L4329k6039j5372N7513N7829q315m0531
$$ plain form
9020 -62730 -39607 131227 162843 72405 6500 -37399 -28933 -32389 -61144 -84900 -109684 -94435
9008 -94435 -73491 -97384 -123858 -110283 -124731 -99355 -39948 22652 -5121 -98302 -150670 -115892
8996 -115892 -132750 -96211 -46771 -40730 -60589 -35632 47079 99032 52539 75361 -28785 -97448
8984 -97448 -15891 -936 -14420 -60475 -205911 -173761 -121115 -95804 -90980 -12702 -38374 10736
8972 10736 -36686 -38002 -66942 -48437 21108 26932 11467 -63595 -84653 -63447 -51917 -29033
8960 -29033 -94778 -147901 -123156 -47016 40181 78007 18485 13498 -7152 40197 43203 -1340
8948 -1340 -30334 24408 18142 53605 68086 99886 97433 21401 -30347 -1904 -4635 48579 -13639
8935 -13639 -22339 -88298 -46452 -6260 -5643 8369 14545 130225 147172 136624 140834 80343 15002
$$ packed form
9020f2730K3123J70834L1616r0438o5905m3899Q466l456k8755k3756k4784J5249
9008i4435K0944k3893k6474J3575j4448K5376N9407O2600k7773r3181n2368L4778
8996a15892j6858L6539M9440O041j9859K4957Q2711N1953m6493K2822j04146o8663
8984i7448Q1557J4955j3484m6055j45436L2150N2646K5311M824P8278k5672M9110
8972A0736m7422j316k8940J8505O9545N824j5465p5062k1058K1206J1530K2884
8960b9033o5745n3123K4745P6140Q7197L7826n9522m987k0650M7349L006m4543
8948a340k8994N4742o266L5463J4481L1800k453p6032n1748K8443k731N3214o2218
8935a3639q700o5959M1846M0192O17J4012O176J15680J6947j0548M210o0491o5341
$$ plain form
8922 15002 24592 -98315 -145867 -99890 -13362 42668 7969 30052 19566 -29494 -70757 -73452
8910 -73452 35563 12501 -14893 -48047 -17242 -26500 -12500 21163 -35364 -83340 -5068 63065
8898 63065 41087 16576 47799 58966 14986 33631 18542 -41106 -41769 -100883 -103085 -91308
8886 -91308 -9452 19533 -19905 41941 68624 65588 14660 28727 28433 28760 10745 36257 130675
8873 130675 101320 115133 74036 41698 12571 7146 -72852 -276491 -303528 -219801 -126703 -102059
8861 -102059 -101420 -48705 -35901 -100374 -75277 -65902 -3486 103378 80734 56037 84449 126669
8849 126669 118828 65042 8784 -598 -6062 -84783 -79757 -67818 30708 88793 69936 53492
8837 53492 64018 106325 58667 13934 -45882 -50255 -17858 -65634 -67633 -8229 -20181 -9745
$$ packed form
8922A5002R590j22907m7552M5977Q6528N6030l4699K2083j0486m9060m1263k695
8910g3452J09015k3062k7394l3154L0805r258J4000L3663n6527m7976P8272O8133
8898F3065k1978k4511L1223J1167m3980J8645j5089n9648o63n9114k202J1777
8886i1308Q1856K8985l9438O1846K6683l036n0928J4067k94L27j8015K5512R4418
8873A30675k9355J3813m1097l2338k9127n425p9998k03639k7037Q3727R3098K4644
8861a02059O39N2715J2804o4473K5097R375O2416J06864k2644k4697K8412M2220
8849A26669p841n3786n6258r382n464p8721N026J1939R8526N8085j8857j6444
8837E3492J0526M2307m7658m4733n9816m373L2397m7776j999N9404j1952J0436
$$ plain form
8825 -9745 -69441 17597 51085 46138 -63005 -111826 -95129 -19420 28852 -43909 -67506 -81944
8813 -81944 -89883 -651 55851 22706 18150 74302 21433 15585 51169 -633 -39153 -8904
8801 -8904 -56081 -70990 -159809 -134751 -58034 -19641 -7096 -73500 -58633 -120311 -48359 62048
8789 62048 21406 -15079 -18251 -30965 -26956 -51187 -11236 32049 59837 -14487 -2648 -83469
8777 -83469 -95334 34092 73130 3798 -71701 -69900 -45703 -102085 -164618 -121344 -27458 -20841
8765 -20841 -10202 11745 38258 52092 128331 95109 37298 49225 -25121 -8741 25353 -6422
8753 -6422 -30217 -107496 -134368 -116165 -67925 36367 71332 19176 18657 41538 130964 42811
8741 42811 45765 -8125 -38 -18104 -477 104616 148916 156182 177037 186814 170297 100114
$$ packed form
8825i745n9696Q7038L3488m947j09143m8821J6697P5709M8272p2761k3597j4438
8813h1944p939Q9232N6502l3145m556N6152n2869n848L5584n1802l8520L0249
8801h904m7177j4909q8819K5058P6717L8393J2545o6404J4867o1678P1952J10407
8789F2048m0642l6485l172j2714M009k4231L9951M3285K7788p4324J1839q0821
8777h3469j1865J29426L9038o9332p5499J801K4197n6382o2533M3274R3886O617
8765b0841J0639K1947K6513J3834P6239l3222n7811J1927p4346J6380L4094l1775
8753f422k3795p7279k6872J8203M8240J04292L4965n2156n19K2881Q9426q8153
8741D2811K954n3890Q087j8066J7627J05093M4300P266K0855R777j6517p0183
$$ plain form
8729 100114 -3802 -11422 -26579 18031 11244 -64094 -120876 -164066 -92278 37354 21752 -33590
8717 -33590 -45191 -79474 -134652 -159791 -118176 -167106 -110088 1121 24340 56738 77795 43991
8705 43991 48963 65337 86757 44946 -5160 17515 99143 105483 10438 -61456 -34521 9789
8693 9789 -167 -36407 -111940 -55602 51483 88851 91835 96871 52038 38855 -40745 -141643
8681 -141643 -65810 -71763 -9571 74368 44346 6885 25218 -2161 57227 -1304 -6204 -40586
8669 -40586 -52620 -19515 27545 44614 -51613 -43602 -17862 10896 35225 18228 5658 87686
8657 87686 82499 120321 134449 116519 70795 56058 26100 -1694 13855 -35404 -72629 -63405
8645 -63405 -56741 -74695 51661 -8527 -38553 20995 57249 66915 118011 106361 -21457 -94521
$$ packed form
8729A00114j03916p620j5157M4610o787p5338n6782m3190P1788J29632j5602n5342
8717c3590j1601l4283n5178k5139M1615m8930N7018J11209K3219L2398K1057l3804
8705D3991M972J6374K1420m1811n0106K2675Q1628O340r5045p1894K6935M4310
8693I789r956l6240p5533N6338J07085L7368K984N036m4833j3183p9600j00898
8681a41643P5833n953O2192Q3939l0022l7461J8333k7379N9388n8531m900l4382
8669d0586j2034L3105M7060J7069r6227Q011K5740K8758K4329j6997j2570Q2028
8657H7686n187L7822J4128j7930m5724j4737k9958k7794J5549m9259l7225R224
8645f3405O664j7954J26356o0188l0026N9548L6254R666N1096j1650j27818p3064
$$ plain form
8633 -94521 -71432 -17013 32048 88846 38109 -33083 -101554 -108292 -61821 -13717 16412 26538
8621 26538 -11476 -109560 -119217 -66603 -74525 -14136 38425 34569 -421 4878 -33821 -43420 -87233
8608 -87233 -65482 -66040 -80124 -4481 -62217 -130195 -95515 -64072 43185 5566 12211 33466
8596 33466 -45915 -109260 -117957 -114278 -143449 -117605 -60397 -35734 -63065 -39036 -8122 102999
8584 102999 177091 192484 117883 -22190 -129390 -128911 -58081 -4710 -44770 -70959 -53423 61183
8572 61183 106132 94250 77952 16053 39582 37305 38303 -27401 -59563 24019 -18536 -2364
8560 -2364 83471 88162 131623 150993 94741 71527 2007 -62220 -54260 -45348 -153489 -186548
8548 -186548 -156631 -152198 -114387 -92010 -98085 -69996 619 71254 95980 18878 -53881 -105798
$$ packed form
8633i4521K3089N4419M9061N6798n0737p1192o8471o738M6471M8104L0129J0126
8621B6538l8014r8084r657N2614p922O0389N2561l856l4990N299l8699r599m3813
8608h7233K1751n58j4084P5643n7736o7978L4680L1443J07257l7619O645K1255
8596C3466p9381o3345q697L679k9171K5844N7208K4663k7331K4029L0914J11121
8584A02999P4092J5393p4601j40073j07200M79P0830N3371m0060k6189J7536J14606
8572F1183M4949j1882j6298o1899K3529k277R98o5704l2162Q3582m2555J6172
8560b364Q5835M691M3461J9370n6252k3214o9520o4227P960Q912j08141l3059
8548a86548K9917M433L7811K2377o075K8089P0615P0635K4726p7102p2759n1917
$$ plain form
8536 -105798 -84202 -30532 -50231 -37041 54320 45987 37200 21245 -8198 60618 113147 131784
8524 131784 62293 16852 -71804 -82118 -76011 -18786 40039 7980 10083 64395 89422 113238
8512 113238 162846 149981 111649 33194 12331 45556 71054 68038 89213 129781 38054 21865
8500 21865 55995 63566 24711 -57071 -79729 -19584 16544 -27439 -61780 16996 73271 -21023
8488 -21023 -11495 4822 9299 -9792 38422 7331 -105065 -151404 -95659 -114235 -87587 -32688
8476 -32688 -76644 218 39852 62879 124599 74935 86274 94774 40916 20955 -63108 -124455
8464 -124455 -79471 29746 37759 18739 42819 -42378 -14048 90982 65895 42132 35023 36131
8452 36131 -60695 -44595 7049 -30797 -2767 67396 29016 10517 80935 119205 36968 -42159
$$ packed form
8536a05798K1596N3670j9699J3190R1361q333q787j5955k9443O8816N2529J8637
8524A31784o9491m5441q8656j0314O107N7225N8825l2059K103N4312K5027K3816
8512A13238M9608j2865l8332p8455k0863L3225K5498l016K1175M0568r1727j6189
8500B1865L4130P571l8855q1782k2658O0145L6128m3983l4341P8776N6275r4294
8488b1023R528J6317M477j9091M8214l1091j12396m6339N5745j8576K6648N4899
8476c2688m3956P6862L9634K3027O1720m9664J1339Q500n3858j9961q4063o1347
8464a24455M4984J09217Q013j9020K4080q5197K8330J05030k5087k3763p109J108
8452C6131r6826J6100N1644l7846K8030P0163l8380j8499P0418L8270q2237p9127
$$ plain form
8440 -42159 -2850 57572 12007 -28258 -26000 -14069 19841 6733 -33323 -46970 -93591 -78660
8428 -78660 -90953 -125078 -99502 -30938 -1495 -2042 -40649 -55338 -14151 14990 54943 148058
8416 148058 151870 76963 -68391 -112446 -118444 -146732 -154977 -107485 -95480 -109372 -22198 -31845
8404 -31845 3331 -18578 -76030 -30068 -30852 -50690 -30984 -152863 -198611 -103275 -63175 -54437
8392 -54437 -52871 -95432 -93198 -43168 -63124 -42298 -59432 -34848 -95096 -133914 -174931 -111369
8380 -111369 -48659 -60631 -52429 -62012 -73818 -954 26424 56434 -22919 -11108 -33347 -2718
8368 -2718 42654 -18431 -36553 129451 139095 96416 29792 -22357 32974 14758 -4553 -15857
8356 -15857 -84273 -56762 -38161 -72921 -154789 -213494 -158077 -164592 -170588 -106287 -61558 -11092
$$ packed form
8440d2159L9309O0422m5565m0265K258J1931L3910j3108m0056j3647m6621J4931
8428g8660j2293l4125K5576O8564K9443n47l8607j4689M1187K9141L9953R3115
8416A48058L812p4907j45354m4055n998k8288q245M7492J2005j3892Q7174r647
8404c1845L5176k1909n7452M5962p84j9838J9706j21879m5748R5336M0100Q738
8392e4437J566m2561K234N0030j9956K0826j7134K4584o0248l8818m1017O3562
8380a11369O2710j1972Q202r583j1806P2864K7378L0010p9353J1811k2239L0629
8368b718M5372o1085j8122J66004R644m2679o6624n2149N5331j8216j9311j1304
8356a5857o8416K7511J8601l4760q1868n8705N5417o515n996O4301M4729N0466
$$ plain form
8344 -11092 564 -6876 -44369 -79019 -72715 3696 -14458 -42792 8720 -7386 -29746 -21595
8332 -21595 -49652 -92316 -80409 14018 10243 -17951 -117006 -113829 -64036 -63348 -72674 -49416 -32269
8319 -32269 19580 15415 -30754 -2228 -10643 -33447 34857 968 -85125 -107031 -94744 10620
8307 10620 25277 6210 -47712 516 3413 -37736 -4913 5572 45272 73902 106213 136148
8295 136148 135100 130092 26016 -1879 40948 -4050 -71251 -82287 30588 146420 159887
8284 159887 66054 55960 70611 30615 -47863 -30926 -12162 11061 43537 9351 -52173 -33094
8272 -33094 -85866 -113468 -108683 -144967 -151304 -69013 -48866 -57673 -90203 -79096 -90214 -66894
8260 -66894 28709 62469 38482 22538 73911 87229 127374 125315 137256 90454 -2177 74776
$$ packed form
8344a1092J1656p440l7493l4650O304P6411j8154k8334N1512j6106k2360Q151
8332b1595k8057m2664J1907R4427l775k8194r9055L177M9793O88r326K3258J7147
8319c2269N1849m165m6169K8526q415k2804O8304l3889q6093k1906J2287J05364
8307A0620J4657j9067n3922M8228K897m1149L2823J0485L9700K8630L2311K9935
8295A36148j048n008j04076k7895M2827m4998o7201j1036J12875J15832J3467
8284A59887r3833j0094J4651l9996p8478J6937J8764K3223L2476l4186o1524J9079
8272c3094n2772k7602M785l6284o337Q2291K0147q807l2530J1107j1118K3320
8260f6894R5603L3760k3987j5944N1373J3318M0145k059J1941m6802r2631P6953
$$ plain form
8248 74776 171335 34565 -40368 -64935 -44768 -2219 3596 -66034 -98110 -43034 13203 24195
8236 24195 -35638 75504 185540 160911 105369 4322 -57994 -13809 -84090 -20652 47897
8225 47897 44187 -7806 10515 2713 -21179 -16788 -41925 -55911 -65496 -122946 -163326 -142117 -115495
8212 -115495 -90725 -98484 -125814 -12123 -88960 -90503 -49629 -19208 23802 33316 32146 44657
8200 44657 41031 -47118 -90195 -83825 -3533 73914 81889 18940 6857 35855 34605 -31834 -21102
8187 -21102 60574 180532 117266 57203 7593 -102128 -195093 -170976 -133321 -106005 -99219 -36360
8175 -36360 -36294 -29424 18423 36638 -18606 -59720 -43096 5842 3378 48669 69158 70343 57027
8162 57027 -8258 -37949 -123355 -152750 -42718 -62268 -19497 68408 88818 79885 101836 -6141
$$ packed form
8248G4776R6559j36770p4933k4567K0167M2549N815o9630l2076N5076N6237J0992
8236B4195n9833J11142J10036k4629n5542j01047o2316M4185p0281O3438O8549
8225D7897l710n1993J8321p802k3892M391k5137j3986r585n7450m0380K1209K6622
8212a15495K4770p759k7330J13691p6837j543M0874L0421M3010R514j170J2511
8200D4657l626q8149m3077O370Q0292P7447P975o2949j2083K8998j250o6439J0732
8187b1102Q1676J19958o3266o0063m9610j09721r2965K4117L7655K7316O786O2859
8175c6360O6O870M7847J8215n5244m1114J6624M8938k464M5291K0489J185j3316
8162E7027o5285k9691q5406k9395J10032j9550M2771Q7905K0410q933K1951j07977
$$ plain form
8150 -6141 -99881 -12204 35171 15243 32928 77848 65939 38458 -6774 13361 64168 129606
8138 129606 76931 119337 228809 190295 103346 -34491 -1905 90156 44601 -32425 481
8127 481 74982 80506 33794 -3349 -10259 -50548 -19199 -28734 -68506 -147105 -161834 -119187 -111192
8114 -111192 -81212 -56252 -88276 -133204 -112029 -29486 -70372 -160245 -135753 -102543 -38967 11035
8102 11035 3294 -67997 -72139 -18577 10586 47927 83103 16307 -29028 -622 -1392 -90840 -155401
8089 -155401 -156688 -152303 -176206 -181247 -120055 -60672 -50488 -91770 -99079 -75706 -31914 11748
8077 11748 19113 -4569 93514 121319 -4590 -39284 25159 28666 -66708 -138235 -78075 -25537
8065 -25537 -34284 -78759 -96760 -159213 -152510 -129328 -91032 -46424 -76394 -86421 -70806 -123910
$$ packed form
8150f141r3740Q7677M7375j9928J7685M4920j1909k7481m5232K0135N0807O5438
8138A29606n2675M2406J09472l8514q6949j37837L2586R2061m5555p7026L2906
8127D81P4501N524m6712l7143o910m0289L1349r535l9772p8599j4729M2647P995
8114a11192K9980K4960l2024m4928K1175Q2543m0886q9873K4492L3210O3576N0002
8102A1035p741p1291m142N3562K9163L7341L5176o6796m5335K8406p70q9448o4561
8089a55401j287M385k3903n041O1192N9383J0184m1282p309K3373M3792M3662
8077A1748P365k3682R8083K7805j25909l4694O4443L507r5374p1527O0160N2538
8065b5537q747m4475j8001o2453O703K3182L8296M4608k9970j0027J5615n3104
$$ plain form
8053 -123910 -144232 -60663 -57536 -94719 -95111 -53554 20481 1465 -83911 -135500 -146552 -111110
8041 -111110 -57595 -54479 -137596 -91356 2881 70799 102632 19287 72079 103547 23237 -71595
8029 -71595 -66683 -115074 -56762 -69239 -42231 -44812 -90929 -40148 -61540 -104373 -80499 11214
8017 11214 21415 121072 139862 106695 38780 105317 68249 24855 7259 -22887 342 64927
8005 64927 -17586 3658 -22033 -16549 -55391 34381 19827 4928 -42644 -47248 -57835 -35501
7993 -35501 39290 50828 11197 -22188 -74526 -68980 4981 26689 -97727 -143499 -108940 -38965
7981 -38965 -60339 -71976 -53616 -40364 -64296 -27228 -48214 -68113 10052 19583 -41167 6340
7969 6340 -20051 -58707 26374 37936 45293 58707 52894 79048 2455 -22024 27032 35943 55749
$$ packed form
8053a23910k0322Q3569L127l7183l92M1557P4035j9016q5376n1589j1052L5442
8041a11110N3515L116q3117M6240R4237O7918L1833q3345N2792L1468q0310r4832
8029g1595M912m8391N8312j2477K7008k581m6117N0781k1392m2833K3874R1713
8017A1214J0201R9657J8790l3167o7915O6537l7068m3394j7596l0146K3229O4585
8005F4927q2513K1244k5691N484l8842Q9772j4554j4899m7572m604j0587K2334
7993c5501P4791J1538l9631l3385n2338N546P3961K1708j24416m5772L4559O9975
7981c8965k1374j1637J8360J3252k3932L7068k0986j9899P8165R531o0750M7507
7969F340k6391l8656Q5081J1562P357J3414n813K6154p6593k4479M9056Q911J9806
$$ plain form
7956 55749 27238 -3661 32796 33192 -940 -34386 -94904 -34015 -70931 -75343 -23516 -17906 -53475
7943 -53475 -73639 -24773 -39684 -4664 5540 8716 -59420 -95035 -72376 32526 25752 19435
7931 19435 -4682 15703 83283 79902 46035 -76811 -112715 -102577 -76186 -109315 -183907 -248837
7919 -248837 -263359 -179914 -144088 -138943 -114818 -104610 -67957 -65417 -79825 -91630 -42255 34687
7907 34687 986 -4064 -59044 -43551 -22899 -38635 -28461 72865 6862 -53782 -74195 -93629
7895 -93629 -79793 -57253 -25657 -1968 -4323 -34210 -2243 110271 155422 119667 -15813 -65227
7883 -65227 -54174 -50555 -87869 -134266 -78060 -4980 23715 39860 -29002 15172 44844 45480
7871 45480 -24852 -48799 7206 36958 52643 -14557 -89795 -136967 -180416 -106197 -112618 -52029
$$ packed form
7956E5749k8511l0899L6457L96l4132l3446o0518O0889l6916m412N1827N610l5569
7943e3475k0164M8866j4911L5020J0204L176o8136l5615K2659J04902o774o317
7931A9435k4117K0385O7580l381l3867j22846l5904J0138K6391l3129p4592o4930
7919b48837j4522Q3445L5826N145K4125J0208L6653K540j4408j1805M9375P6942
7907C4687l3701n050n4980J5493K0652j5736J0174J01326o6003o0644k0413j9434
7895i3629J3836K2540L1596K3689k355k9887L1967J12514M5151l5755j35480m9414
7883f5227J1053L619l7314m6397N6206P3080K8695J6145o8862M4174K9672O36
7871D5480p0332k3947N6005K9752J5685o7200p5238m7172m3449P4219o421O0589
$$ plain form
7859 -52029 33325 16166 27324 34528 18593 67227 118734 162014 189624 125740 17741 68904
7847 68904 79769 46231 95735 108173 171960 184591 120370 35083 -76433 -96417 -79028 -101819
7835 -101819 -88743 -63543 -75466 -36665 1983 32957 5325 -62327 -72081 -98299 -99032 -90023
7823 -90023 -84089 -38665 -34428 23143 79641 130818 114282 108900 95463 20386 -8406 -6447 -10695
7810 -10695 -79481 -15629 -26066 -7396 -5721 -7894 95116 142679 111228 56285 7744 11183
7798 11183 10718 29369 80080 123655 134199 110202 81775 69063 177383 186708 138623 152153
7786 152153 139176 142174 174531 130100 139494 131623 91068 105928 -24854 -28932 -40968 -8854
7774 -8854 101671 77004 14213 -75353 -30306 34899 113173 75844 58662 39526 -35322 -110340
$$ packed form
7859e2029Q5354j7159J1158P204j5935M8634N1507M3280K7610o3884j07999N1163
7847F8904J0865l3538M9504J2438O3787J2631o4221q5287j11516j9984J7389k2791
7835a01819J3076K5200j1923L8801L8648L0974k7632o7652r754k6218p33R009
7823i0023N934M5424M237N7571N6498N1177j6536n382j3437p5077k8792J959m248
7810a0695o8786O3852j0437J8670J675k173J03010M7563l1451n4943m8541L439
7798A1183m65J8651N0711M3575J0544k3997k8427j2712J08320R325m8085J3530
7786A52153j2977K998L2357m4431R394p871m0555J4860j30782m078j2036L2114
7774h854J10525k4667o2791q9566M5047O5205P8274l7329j7182j9136p4848p5018
$$ plain form
7762 -110340 -78548 -78053 -15694 -6809 8057 56925 15124 -86094 -49420 -17675 -31962 -51343
7750 -51343 -97921 -62897 -31021 -93686 -131993 -114002 7616 95792 7152 1531 -50172 17882
7738 17882 16107 -2773 3808 -64504 -101306 -102985 -87664 -24195 -8601 9891 60046 -29108
7726 -29108 -85179 -98187 -853 25889 21906 27118 18394 -54071 7591 -35714 -38430 -10353 38263
7713 38263 39196 21679 -50382 -78752 -44879 -14738 23307 66669 72281 52867 39983 24891
7701 24891 2187 -54300 -96739 -16822 -2966 -24567 19113 -7600 37510 40463 39951 108815
7689 108815 91158 41264 -6221 -88582 -105669 2837 -71250 -101514 -97943 -133614 -135874 -95016
7677 -95016 -115351 -125133 -43394 -56023 -61750 -7066 -16059 28992 52693 48753 36045 61271 -16846
$$ packed form
7762a10340L1792M95O2359Q885J4866M8868m1801j01218L6674L1745j4287j9381
7750e1343m6578L5024L1876o2665l8307J7991J21618Q8176q8640n621n1703O8054
7738A7882j775j8880O581o8312l6802j679J5321O3469J5594J8492N0155q9154
7726b9108n6071j3008R7334K6742l983N212q724p2465O1662m3305k716K8077M8616
7713C8263R33j7517p2061k8370L3873L0141L8045M3362N612j9414j2884j5092
7701B4891k2704n6487m2439P9917J3856k1601M3680k6713M5110K953n12O8864
7689A08815j7657m9894m7485q2361j7087J08506p4087l0264L571l5671k260M0858
7677i5016k0335r782Q1739j2629n727N4684q993M5051K3701l940j2708K5226p8117
$$ plain form
7664 -16846 -56843 -60333 -30734 -28000 -30155 60227 112950 135054 81640 131037 90640 49657
7652 49657 -14262 -67960 -35570 4313 -47295 -78376 -69466 -18933 -55513 -22765 32007 21577
7640 21577 74746 70569 -5086 24374 -13818 -10968 -28561 -78221 -60184 3125 17370 7538
7628 7538 16202 7278 -19112 -5464 -40767 -17959 32771 46371 120578 53301 27030 -46357
7616 -46357 -51642 36823 132059 153219 86455 11780 -25182 -20663 -28221 -44735 -67620 -43348
7604 -43348 -24680 16979 58369 110594 15168 -21734 94859 80290 28165 -17263 -7948 11616
7592 11616 -38199 -37151 -11030 115433 133198 174207 65535 -20030 44756 98753 103038 134463
7580 134463 167870 77910 1524 -4789 -29520 54960 68359 -17889 18713 65448 39414 -3007
$$ packed form
7664a6846l9997l490K9599K734k155R0382N2723K2104n3414M9397m0397m0983
7652D9657o3919n3698L2390L9883n1608l1081Q910N0533l6580L2748N4772j0430
7640B1577N3169m177p5655K9460l8192K850j7593m9660J8037O3309J4245r832
7628G538Q664q924k6390J3648l5303K2808N0730J3600P4207o7277k6271p3387
7616d6357n285Q8465R5236K1160o6764p4675l6962M519p558j6514k2885K4272
7604d3348J8668M1659M1390N2225r5426l6902J16593j4569n2125m5428R315J9564
7592A1616m9815J048K6121J26463J7765M1009j08672q5565O4786N3997M285L1425
7580A34463L3407q9960p6386o313k4731Q4480J3399q6248L6602M6735k6034m2421
$$ plain form
7568 -3007 -15578 4528 7637 44872 27977 -6329 -82963 -137612 -95809 8071 33136 22213
7556 22213 25936 5630 -47478 -36271 -18680 -82751 -124031 -128681 -117490 -91569 -134651 -173858
7544 -173858 -29447 -14321 29686 -512 -42277 -119195 -223749 -175096 -137119 -60016 -897
7533 -897 -6062 -1804 -53815 16405 93745 82648 93568 73316 37039 106267 78233 -49329
7521 -49329 -24990 -28132 -70576 -59278 -64295 -28462 -28575 -29876 23431 40683 5614 -82233 -93768
7508 -93768 -56851 9887 -22139 -116624 -132290 -124120 -123858 -51616 -11988 -21300 1706 -45801 -36195
7495 -36195 -35728 -80195 -118697 -94501 -39504 -79586 -128727 -101554 -79338 -36152 41599 35398
7483 35398 18917 -44678 -72612 -14408 -66799 -28627 -5759 -13170 -19135 20133 54991 9392
$$ packed form
7568c007j2571K0106L109L7235j6895l4306p6634n4649M1803J03880K5065j0923
7556B2213L723k0306n3108J1207J7591o4071m1280m650J1191K5921m3082l9207
7544a73858J44411J5126M4007l0198m1765p6918j04554M8653L7977P7103N9119
7533h97n165M258n2011P0220P7340j1097J0920k0252l6277O9228k8034j27562
7521d9329K4339l142m2444J1298n017L5833j13j301N3307J7252l5069q7847j1535
7508i3768L6917O6738l2026r4485j5666Q170K62P2242L9628r312K3006m7507R606
7495c6195M67m4467l8502K4196N4997m0082m9141K7173K2216M3186P7751o201
7483C5398j6481o3595k7934N8204n2391L8172K2868p411n965L9268L4858m5599
$$ plain form
7471 9392 32356 28308 36414 36123 -58868 -124119 -137858 -95296 -1588 15866 82555 110492 98665
7458 98665 102654 52194 33283 68315 116507 143368 134711 111466 79458 18241 49144 -22768
7446 -22768 -55543 -45456 5463 89684 88074 39729 33339 74513 114802 110221 113712 62220 102951
7433 102951 58837 -4338 -99958 -176391 -140392 -87711 39928 96154 39177 35795 40962 55400
7421 55400 64516 353 6111 -52582 -41407 28074 -10101 -95054 -102980 -118133 -102297 -48418
7409 -48418 -46555 -75151 34461 143057 161259 178647 54239 -62812 -66095 -11690 17986
7398 17986 55113 26264 95705 166625 214708 180111 108462 100993 60107 -11340 -151720 -192392
7386 -192392 -181206 -117086 -29859 -57070 -97961 -178393 -162063 -138348 -109593 -96984 -40602 -9241
$$ packed form
7471I392K2964m048Q106k91r4991o5251j3739M2562R3708J7454O6689K7937j1827
7458I8665L989n0460j8911L5032M8192K6861q657k3245l2008o1217L0903p1912
7446b2768l2775J0087N0919Q4221j610m8345o390M1174M0289m581L491n1492M0731
7433A02951m4114o3175r5620p6433L5999N2681J27639N6226n6977l382N167J4438
7421E5400R116o4163N758n8693J1175O9481l8175q4953p926j5153J5836N3879
7409d8418J863k8596J09612J08596J8202J7388j24408j17051l283N4405K9676
7398A7986L7127k8849O9441P0920M8083l4597p1649p469m0886p1447j40380m0672
7386a92392J1186O4120Q7227k7211m0891q0432J6330K3715K8755J2609N6382L1361
$$ plain form
7374 -9241 15470 73258 1154 -57355 12093 6782 -42804 -66271 -63892 -112418 -100817 -60104
7362 -60104 -6001 -1071 5897 46631 -6572 -123616 -274338 -341627 -145370 -40671 -51527
7351 -51527 -52071 -7287 2138 -89868 -51998 38219 48500 16793 -41302 -31531 -37652 2707 -23525
7338 -23525 -50992 28077 1018 -2099 38967 -94 -55812 -21210 2454 13348 -42971 -52971
7326 -52971 -180906 -125942 -64110 -97292 -115213 -51933 -38045 -78246 -75322 -18168 -42555 -31812
7314 -31812 -66507 -81794 -210088 -197633 -146384 -106030 -89564 19403 26916 7522 71589 35006
7302 35006 -15163 -26001 2781 116141 152566 151786 131024 59812 -13140 -83172 -43213 -172650
7290 -172650 -208552 -196040 -125958 -159224 -188776 -141331 -23898 18838 68022 78023 71119 24601
$$ packed form
7374i241K4711N7788p2104n8509O9448n311m9586k3467K379m8526J1601M0713
7362f0104N4103M930O968M0734n3203j17044j50722o7289J96257J04699j0856
7351e1527n44M4784R425r2006L7870R0217J0281l1707n8095R771o121M0359k6232
7338b3525k7467P9069k7059l117M1066l9061n5718L4602K3664J0894n6319j0000
7326e2971j27935N4964O1832l3182j7921O3280J3888m0201K924N7154k4387J0743
7314c1812l4695j5287j28294J2455N1249M0354J6466J08967P513j9394O4067l6583
7302C5006n0169j0838K8782J13360L6425p80k0762p1212p2952p0032L9959j29437
7290a72650l5902J2512P0082l3266k9552M7445J17433M2736M9184J0001o904m6518
$$ plain form
7278 24601 14529 19688 -43722 -18465 -29883 61964 84869 86397 30346 32760 7286 6531 39419
7265 39419 87236 -81759 -137091 -75249 -33989 -35749 17739 38866 -40123 -66333 20790 16128
7253 16128 288 45248 32201 -49676 -97557 -169211 -215322 -210643 -149583 -79941 -32779 11986
7241 11986 -20856 -51997 13875 21521 2518 42077 60523 87257 121399 14668 -62359 -113760
7229 -113760 -94546 47505 83947 100086 7818 -10965 -2153 -39621 -6841 -20937 22945 56224
7217 56224 93363 67549 32033 13107 5924 -4428 -11897 -14822 -31837 89538 93189 106604
7205 106604 54111 66360 35200 36655 17328 -14840 -14124 -29441 -163467 -195369 -136514 -41965
7193 -41965 -8858 -10320 393 60659 47443 -24335 -54840 -7246 40590 62864 -23122 -92286
$$ packed form
7278B4601j0072N159o3410K5257j1418R1847K2905J528n6051K414k5474p55L2888
7265C9419M7817j68995n5332O1842M1260j760N3488K1127p8989k6210Q7123m662
7253A6128j5840M4960j3047q1877m7881p1654m6111M679O1060O9642M7162M4765
7241A1986l2842l1141O5872P646j9003L9559J8446K6734L4142j06731p7027n1401
7229a13760J9214J42051L6442J6139r2268j8783Q812l7468L2780j4096M3882L3279
7217E6224L7139k5814l5516j8926p183j0352p469k925j7015J21375L651J3415
7205A06604n2493J2249l1160J455j9327l2168P16j5317j34026l1902N8855R4549
7193d1965L3107j462J0713O0266j3216p1778l0505M7594M7836K2274q5986o9164
$$ plain form
7181 -92286 -113121 -132855 -130424 -133575 -83532 -36117 -27569 4150 -36540 -90005 -82164 -47088 -1895
7168 -1895 7258 -43676 -43246 32350 81263 39162 66602 71039 105536 95724 78726 -3901 -65342
7155 -65342 -52495 34966 52923 94329 77756 39338 111692 140273 121587 135518 80833 -7357
7143 -7357 10449 13652 -47651 -3894 18445 -34056 -194941 -175861 -1111 43028 -57956 -116709
7131 -116709 -135586 -80753 -27007 -30391 -57050 -2568 37788 48486 73409 49902 81538 118277
7119 118277 75944 118420 70108 117504 94349 24084 41451 109360 67473 51570 79193 96192
7107 96192 129831 166284 112513 16653 -18866 17549 -46974 -130643 -143307 -115008 -100131 -171008
7095 -171008 -162080 -134308 -65615 38218 28247 -28275 -79820 -32644 -26514 -42439 -57912 -34417
$$ packed form
7181i2286k0835j9734K431l151N0043M7415Q548L1719m0690n3465P841L5076M5193
7168a895R153n0934M30P5596M8913m2101K7440M437L4497r812j6998q2627o1441
7155f5342J2847Q7461J7957M1406j6573l8418P2354K8581j8686J3931n4685q8190
7143g357J7806L203o1303M3757K2339n2501j60885J9080J74750M4139j00984n8753
7131a16709j8877N4833N3746l384k6659N4482M0356J0698K4923k3507L1636L6739
7119A18277m2333M2476m8312M7396k3155p0265J7367O7909m1887j5903K7623J6999
7107I6192L3639L6453n3771r5860l5519L6415o4523q3669j2664K8299J4877p0877
7095a71008Q928K7772O8693J03833r971n6522n1545M7176O130j5925j5473K3495
$$ plain form
7083 -34417 40259 76319 66382 31153 15979 -62132 -82597 -41937 15710 56570 -97117 -96929
7071 -96929 -102084 -105810 -19891 43400 106282 122516 57085 57961 55920 -44212 73688 195842
7059 195842 170036 144286 32216 -83256 -149770 -92490 48245 89300 86217 122695 170551
7048 170551 183103 135819 50056 69994 2700 -82841 -60290 -13763 73755 88853 135268 258096
7036 258096 280330 183251 152608 113508 60661 17809 -4529 53782 27181 -91912 -132369
7025 -132369 -75548 -26922 -36671 -109686 -37577 -90301 -117602 -102104 -96517 -35316 6789 16545
7013 16545 41418 129849 160832 42408 -52360 -64469 12152 85452 71521 4581 -63211 7227
7001 7227 23653 5620 23318 -24874 -15052 -20519 -37589 43567 85929 11640 -51924 -80072
$$ packed form
7083c4417P4676L6060r937l5229j5174p8111k0465M0660N7647M0860j53687J88
7071i6929n155l726Q5919O3291O2882J6234o5431Q76k041j00132J17900J22154
7059A95842k5806k5750j12070j15472o6514N7280J40735M1055l083L6478M7856
7048A70551J2552m7284q5763J9938o7294q5541K2551M6527Q7518J5098M6415J22828
7036B58096K2234r7079l0643l9100n2847m2852k2338N8311k6601j19093m0457
7025a32369N6821M8626r749p3015P2109n2724k7301J5498N587O1201M2105R756
7013A6545K4873Q8431L0983j18424r4768j2109P6621P3300j3931o6940o7792P0438
7001G227J6426j8033J7698m8192R822n467j7070Q1156M2362p4289o3564k8148
$$ plain form
6989 -80072 -144852 -163135 -184420 -232444 -234288 -181895 -116215 -125297 -64237 -48077 -82697 -157856
6977 -157856 -130009 -136084 -93301 -15872 -3719 29766 8000 45927 165494 182649 104348 106982
6965 106982 105869 44899 12846 -26836 -122830 -121133 -30265 17264 602 49499 132073 109931
6953 109931 60774 60810 71969 5820 -83781 -99881 -49304 -14279 76586 126837 42552 -30215
6941 -30215 -104976 -114451 -73947 -47938 89770 106281 38472 24679 -2280 33523 75849 75511
6929 75511 103492 80089 31955 61336 9274 1447 -26724 -120893 -175784 -95844 -119418 -51277
6917 -51277 -10578 54562 76501 -7720 -82632 -124856 -141060 -175338 -163513 -129346 -45604 -48768
6905 -48768 -59699 15478 -1606 11387 50954 36276 40321 -29418 -29091 24796 -35117 -11595
$$ packed form
6989h0072o4780j8283k1285m8024j844N2393O5680r082O1060J6160l4620p5159
6977a57856K7847o075M2783P7429J2153L3485k1766L7927J19567J7155p8301K634
6965A06982j113o0970l2053l9682r5994J697R0868M7529j6662M8897Q2574k2142
6953A09931m9157L6J1159o6149q9601j6100N0577L5025R0865N0251q4285p2767
6941c0215p4761r475M0504K6009J37708J6511o7809j3793k6959L5803M2326l38
6929G5511K7981k3403m8134K9381n2062p827k8171r4169n4891P9940k3574O8141
6917e1277M0699O5140K1939q4221p4912m2224j6204l4278J1825L4167Q3742l164
6905d8768j0931P5177j7084J2993L9567j4678M045o9739L27N3887n9913K3522
$$ plain form
6893 -11595 9887 38100 19641 41963 51923 27602 -22248 -25158 -17927 -6391 -11077 24961 132695
6880 132695 115291 79889 102771 128353 118921 108348 41442 49028 62873 9608 -87704 -130565
6868 -130565 -159842 -182096 -106340 -31118 38840 50444 96459 124904 114782 90531 -20575
6857 -20575 -80284 -142987 -101164 8952 52756 22403 -39936 -30203 -35515 -76362 28323 59802
6845 59802 25135 35987 41276 9445 -25183 -95392 -86052 -152706 -139572 -165797 -160674 -90327
6833 -90327 -81763 -89011 -75518 14632 47724 28667 -15285 -117009 -138266 -130351 -133946 -93720
6821 -93720 -51134 -32047 -28242 -73738 -60478 -89749 -88702 -76995 -142600 -167149 -100708 5151
6809 5151 66594 50156 58003 95548 52943 -59054 -120022 -61597 -64523 -12325 -15660 -49224
$$ packed form
6893a1595K1482K8213j8459K2322R960k4321m9850k910P231J1536m686L6038J07734
6880A32695j7404l5402K2882K5582r432j0573o6906P586J3845n3265r7312m2861
6868a30565k9277k2254P5756P5222O9958J1604M6015K8445j0122k4251j11106
6857b0575n9709o2703M1823J10116M3804l0353o2339R733n312m0847J04685L1479
6845E9802l4667J0852N289l1831l4628p0209R340o6654J3134k6225N123P0347
6833i0327Q564p248J3493R0150L3092j9057m3952j01724k1257P915l595M0226
6821i3720M2586J9087L805m5496J3260k9271J047J1707o5605k4549O6441J05859
6809E151O1443j6438P847L7545m2605j11997o0968N8425k926N2198l335l3564
$$ plain form
6797 -49224 34339 55607 52485 5139 -9206 -13734 -2498 -23068 44766 103975 64163 98122
6785 98122 101921 117591 99094 154454 180610 202599 129284 111633 121186 119141 23274 12423
6773 12423 16855 -37585 -23001 4341 -44671 -84596 -128673 -116431 -57054 -2578 20327 1913
6761 1913 -110387 -194977 -131706 7771 24951 150992 121822 149166 145376 63668 48220 38713
6749 38713 38423 6656 11122 -99508 -77729 -19901 -29859 -83850 -42450 -43462 -90553 -135974 -74495
6736 -74495 -2290 -62849 -64715 -69856 -88026 -128262 -133851 -104915 -95297 -49112 -38964 -51709 -30096
6723 -30096 -14442 -47778 -48505 -49935 187 45809 86067 160544 40743 38749 58181 2341
6711 2341 -1941 57223 54151 13380 -16349 -11455 -83859 -104727 -24646 32422 57564 5996 -8970
$$ packed form
6797d9224Q3563K1268l122m7346j4345m528J1236k0570O7834N9209l9812L3959
6785I8122L799J5670j8497N5360K6156K1989p3315j7651R553k045r5867j0851
6773A2423M432n4440J4584K7342m9012l9925m4077J2242N9377N4476K2905j8414
6761A913j12300q4590O3271J39477J7180J26041k9170K7344l790q1708j5448r507
6749C8713k90l1767M466j10630K1779N7828r958n3991M1400j012m7091m5421O1479
6736g4495P2205o0559j866n141j8170m0236n589K8936R618M6185J0148j2745K1613
6723c0096J5654l3336p27j430N0122M5622M0258P4477j19801j994J9432n5840
6711B341m282N9164l072m0771k9729M894p2404k0868Q0081N7068K5142n1568j4966
$$ plain form
6698 -8970 19749 53226 57726 34420 -9135 62429 34651 101995 67337 -1317 65349 63422
6686 63422 -12060 1258 13905 -34247 -54782 -110993 -128794 -138355 -83598 -15224 17905 -35729
6674 -35729 -113662 -87297 -39013 -71504 -5829 19463 -8739 -16576 14469 115648 100472 40693
6662 40693 61975 158287 131948 63985 -8635 -9911 -7830 9349 -12512 18063 13978 3865
6650 3865 -15391 -33559 -16022 -18366 -40282 -17287 -2637 47487 53558 43442 72336 31901
6638 31901 -79198 -95584 -35279 -50967 -19627 -4698 -17108 -10208 -43599 -3095 -13007 -51643
6626 -51643 -9485 -5285 -5602 44605 71066 67102 105094 102667 68034 16010 17226 -26275 -73074
6613 -73074 -109381 -104587 -41860 15314 76766 76034 -25683 -63746 -37865 -48092 -89009 -40209
$$ packed form
6698h970K8719L3477M500k3306m3555P1564k7778O7344l4658o8654O6666j927
6686F3422p5482J3318J2647m8152k0535n6211j7801r561N4757O8374L3129n3634
6674c5729p7933K6365M8284l2491O5675K5292k8202p837L1045J01179j5176n9779
6662D0693K1282R6312k6339o7963p2620j276K081J7179k1861L0575m085j0113
6650C865j9256j8168J7537k344k1916K2995J4650N0124O071j0116K8894m0435
6638C1901j11099j6386O0305j5688L1340J4929j2410O900l3391M0504r912l8636
6626e1643M2158M200l17N0207K6461l964L7992k427l4633n2024J216m3501m6799
6613g3074l6307M794O2727N7174O1452p32j01717l8063K5881j0227m0917M8800
$$ plain form
6601 -40209 6171 -33628 1632 41700 49908 18551 -33453 -55897 -4835 124233 117231 21453
6589 21453 -99237 -142230 -136205 -111103 -123342 -63088 -5415 12064 -44148 -89479 -83649 -31320
6577 -31320 77748 122678 77234 14720 44792 49934 40658 39124 990 79042 109550 -1186
6565 -1186 -15283 -54319 -68595 -69719 -26759 85706 98157 73107 101695 115466 172929 144843
6553 144843 59634 34938 44134 52845 14066 45506 46079 11555 8510 -14639 -55781 -41098 -30530
6540 -30530 -30152 51313 -5216 -90905 -60283 28267 44309 52789 4350 3356 9948 -39509 -49343
6527 -49343 -93629 -52634 -20599 -57275 -31424 43604 57078 49003 42719 23331 -40611 -106809
6515 -106809 -172239 -171574 -166953 -98552 15774 2468 34887 92768 3342 2111 1414 -95040 -71899
$$ packed form
6601d0209M6380l9799L5260M0068Q208l1357n2004k2444N1062J29068p002r5778
6589B1453j20690m2993O025K5102j2239O0254N7673J7479n6212m5331N830N2329
6577c1320J09068M4930m5444o2514L0072N142r276j534l8134P8052L0508j10736
6565a186j4097l9036j4276j124M2960J12465J2451k5050K8588J3771N7463k8086
6553A44843q5209k4696R196Q711l8779L1440N73l4524l045k3149m1142J4683J0568
6540c0530L78Q1465n6529q5689L0622Q8550J6042Q480m8439r94O592m9457r834
6527d9343m4286M0995L2035l6676K5851P5028J3474q075o284j9388o3942o6198
6515a06809o5430O65M621O8401J14326j3306L2419N7881q9426j231o97r6454K3141
$$ plain form
6502 -71899 23960 111751 166607 200831 147438 39927 -19258 56920 90598 106495 144217 118600
6490 118600 77664 66524 87525 86813 -64300 -183389 -173604 -88035 -37673 -81103 -105556 -46390
6478 -46390 -28314 -7932 -5800 -72965 -58954 28766 45998 106499 68582 233 -83542 -33344
6466 -33344 -39538 -39417 -30146 -107876 -135850 -147580 -67733 29690 87206 7290 7656 6503 -47244
6453 -47244 -109212 -93088 -125481 -160876 -156848 -122830 12966 55649 30990 98347 187924 137680
6441 137680 34830 -51067 -110161 -48875 24932 4182 -8975 -34628 -64972 -84657 -118818
6430 -118818 -116708 -106047 -118814 -13706 53878 35196 31366 74624 86344 102745 64369 6905
6418 6905 -50642 -57392 -41856 -31470 14357 33302 85071 64888 -42080 -47456 -4273 41788
$$ packed form
6502g1899R5859Q7791N4856L4224n3393j07511n9185P6178L3678J5897L7722k5617
6490A18600m0936j1140K1001p12j51113j19089R785Q5569N0362m3430k4453N9166
6478d6390J8076K0382K132o7165J4011Q7720J7232O0501l7917o8349q3775N0198
6466c3344o194J21R271p7730k7974j1730P9847R7423N7516p9916L66j153n3747
6453d7244o1968J6124l2393l5395M028L4018J35796M2683k4659O7357Q9577n0244
6441A37680j02850q5897n9094O1286P3807k0750j3157k5653l0344j9685l4161
6430a18818K110J0661j2767J05108O7584j8682l830M3258J1720J6401l8376n7464
6418F905n7547o750J5536J0386M5827J8945N1769k0183j06968n376M3183M6061
$$ plain form
6406 41788 87904 111324 135406 76301 21335 53682 38754 66663 25426 6249 63952 -8064
6394 -8064 -52474 -64138 -59167 -65674 -20123 53523 99759 88487 101390 97790 71724 55306 -28659
6381 -28659 -55113 -90449 -21505 42352 -48520 -111129 -52209 6728 -11675 19948 142981 88230
6369 88230 55447 -14395 -196124 -162578 3171 48775 -33238 -88512 -66560 -44812 -93672
6358 -93672 -55868 -10610 40984 -8022 -76341 -39748 -17279 -39577 -46167 -6568 18691 30362
6346 30362 -1158 25501 11487 25413 -22979 60370 42984 -62848 -19094 60305 40765 40233
6334 40233 -21688 -72735 -76288 -66408 -72218 -122818 -77483 16924 57271 71110 84615 -10973
6322 -10973 -34538 -39664 19970 -7702 -35897 -1857 49161 30832 -22528 -43257 -102751 -130153
$$ packed form
6406D1788M6116K3420K4082n9105n4966L2347j4928K7909m1237j9177N7703p2016
6394h064m4410j1664M971o507M5551P3646M6236j1272J2903l600k6066j6418q3965
6381b8659k6454l5336O8944O3857r0872o2609N8920N8937j8403L1623J23033n4751
6369H8230l2783o9842j81729L3546J65749M5604q2013n5274K1952K1748m8860
6358i3672L7804M5258N1594m9006o8319L6593K2469k2298o590L9599K5259J1671
6346C0362l1520K6659j4014J3926m8392Q3349j7386j05832M3754P9399j9540n32
6334D0233o1921n1047l553R880n810n0600M5335R4407M0347J3839J3505r5588
6322a0973k3565n126N9634k7672k8195L4040N1018j8329n3360k0729n9494k7402
$$ plain form
6310 -130153 -136507 -145795 -89957 -50439 -32375 8505 3687 -21678 -18520 -9713 2116 17910 -23676
6297 -23676 -51788 -107794 -111471 -94637 -154558 -201180 -213270 -127720 -94396 -57675 -98711 -81174
6285 -81174 -43606 -79275 -126040 -86754 -110402 -119155 -49697 -50353 -129759 -42879 20606 85839
6273 85839 88753 60648 -6695 -27747 37182 24904 20060 43012 -333 -35922 -38102 1472
6261 1472 -31447 -31138 -34686 -12978 -29891 -89307 -107421 -136202 -113888 -63688 -83718 -18783 25304
6248 25304 12935 21694 32190 -27788 -8749 -34263 -10944 -32982 -68645 -128572 -134469 -13770
$$ packed form
6310a30153o354r288N5838L9518J8064M0880m818k5365L158Q807J1829J5794m1586
6297b3676k8112n6006l677J6834n9921m6622j2090Q5550L3324L6721m1036J7537
6285h1174L7568l5669m6765L9286k3648q753O9458o56p9406Q6880O3485O5233
6273H5839K914k8105o7343k1052O4929j2278m844K2952m3345l5589k180L9574
6261A472l2919L09l548K1708j6913n9416j8114k8781K2314N0200k0030O4935M4087
6248B5304j2369Q759J0496n9978J9039k5514K3319k2038l5663n9927n897J20699
$$ [...]
##END NTUPLES=NMR SPECTRUM
##END=
