##TITLE=Analysis number 327616
Compound Code btb 09194
Book Reference 61263
Project Code adrs flro3
Chemist Name jom
##JCAMPDX= 6.0         $$ Bruker NMR JCAMP-DX V2.0
##DATA TYPE= NMR SPECTRUM
##DATA CLASS= NTUPLES
##ORIGIN= Bruker BioSpin GmbH
##OWNER= nmr
$$ XWIN-NMR		Version 3.5
$$ Wed Mar 28 09:44:24 2007 GMT Daylight Time (UT+1h)  MAYBRIDGE\nmr@NMR_250MHZ
##.OBSERVE FREQUENCY= 250.131544655141
##.OBSERVE NUCLEUS= ^1H
##.ACQUISITION MODE= SIMULTANEOUS (DQD)
##.ACQUISITION SCHEME= undefined
##.AVERAGES= 16
##.DIGITISER RES= 18
##SPECTROMETER/DATA SYSTEM= dpx250
##.PULSE SEQUENCE= zg30
##.SOLVENT NAME= CDCl3
##.SHIFT REFERENCE= (INTERNAL, CDCl3, 0, 16.522)
##AUDIT TRAIL= $$ (NUMBER, WHEN, WHO, WHERE, WHAT)
$$ ##TITLE= Audit trail, XWIN-NMR		Version 3.5
$$ ##JCAMPDX= 5.01
$$ ##ORIGIN= Bruker BioSpin GmbH
$$ ##OWNER= nmr
$$ C:\u/data/dgb/nmr/ADRS/2370/pdata/1/auditp.txt
$$ ##AUDIT TRAIL=  $$ (NUMBER, WHEN, WHO, WHERE, WHAT)
(   1,<2007-03-28 09:43:46.59 +100>,<MAYBRIDGE\nmr>,<NMR_250MHZ>,
      <created by zg, POWCHK disabled, PULCHK disabled
       configuration hash MD5:
       49 4B E0 1D 92 C2 6B 37 9F E6 65 BC 52 41 86 1D
       data hash MD5: 64K
       47 F1 B0 F5 B8 00 D8 0B 3C 3F B6 4F 08 DD 11 5A>)
(   2,<2007-03-28 09:44:07.67 +100>,<MAYBRIDGE\nmr>,<NMR_250MHZ>,
      <Start of raw data processing
       ef LB = 0.3 FT_mod = 6 PKNL = 1 SI = 32K 
       data hash MD5: 32K
       5D F9 4F 85 4D E1 C1 57 6B 4F FD F9 A6 0C 68 2D>)
(   3,<2007-03-28 09:44:10.11 +100>,<MAYBRIDGE\nmr>,<NMR_250MHZ>,
      <apk 
       data hash MD5: 32K
       2C CF CD 24 95 C1 2B 31 06 D9 34 D1 A7 3A 01 12>)
(   4,<2007-03-28 09:44:11.00 +100>,<MAYBRIDGE\nmr>,<NMR_250MHZ>,
      <abs ABSG = 5 
       data hash MD5: 32K
       F2 E9 18 DD 36 7F AC 0E A8 BE 5D 7E 31 E9 7A 15>)
$$ ##END=
$$ 
$$ hash MD5
$$ 84 EF 5C D2 BB 5A 96 4A F8 10 BB 00 05 66 6D 5D
##$RELAX= 
##$RELAX= 
##$RELAX= 
##$RELAX= 
##$RELAX= 
##$RELAX= 
##$RELAX= 
$$ Bruker specific parameters
$$ --------------------------
##$DU= <C:\u>
##$EXPNO= 2370
##$NAME= <ADRS>
##$PROCNO= 1
##$TYPE= <nmr>
##$USER= <dgb>
##$AMP= (0..31)
100 100 100 100 100 100 100 100 100 100 100 100 100 100 100 100 100 100 
100 100 100 100 100 100 100 100 100 100 100 100 100 100 
##$AQSEQ= 0
##$AQ_mod= 3
##$AUNM= <au_zg>
##$AUTOPOS= <3 >
##$BF1= 250.13
##$BF2= 250.13
##$BF3= 250.13
##$BF4= 250.13
##$BF5= 500.13
##$BF6= 500.13
##$BF7= 500.13
##$BF8= 500.13
##$BYTORDA= 1
##$CFDGTYP= 0
##$CFRGTYP= 5
##$CHEMSTR= <none>
##$CNST= (0..31)
1 1 145 1 1 1 1 1 1 1 1 1 1 1 1 1 1 1 1 1 1 1 1 1 1 1 1 1 1 1 1 1 
##$CPDPRG= <>
##$CPDPRG1= <>
##$CPDPRG2= <>
##$CPDPRG3= <>
##$CPDPRG4= <mlev>
##$CPDPRG5= <mlev>
##$CPDPRG6= <mlev>
##$CPDPRG7= <mlev>
##$CPDPRG8= <mlev>
##$CPDPRGB= <>
##$CPDPRGT= <>
##$D= (0..31)
0 1 0 0 0 0 0 0 0 0.06 0 0 0 0 0 0 0.0002 0 0 0 0 0 0 0 0 0 0 0 0 0 0 
0 
##$DATE= 1175071422
##$DBL= (0..7)
120 120 120 120 120 120 120 120 
##$DBP= (0..7)
150 150 150 150 150 150 150 150 
##$DBP07= 0
##$DBPNAM0= <>
##$DBPNAM1= <>
$$ [...]
##$SUBNAM7= <"">
##$SUBNAM8= <"">
##$SUBNAM9= <"">
##$SW= 20.6930455092707
##$SWIBOX= (0..15)
0 0 3 0 0 0 0 0 0 0 0 0 0 0 0 0 
##$SW_h= 5175.983436853
##$TD= 65536
##$TD0= 1
##$TE= 683.16
##$TE2= 300
##$TE3= 300
##$TEG= 300
##$TL= (0..7)
0 120 120 120 120 120 120 120 
##$TP= (0..7)
150 150 150 150 150 150 150 150 
##$TP07= 0
##$TPNAME0= <>
##$TPNAME1= <>
##$TPNAME2= <>
##$TPNAME3= <>
##$TPNAME4= <>
##$TPNAME5= <>
##$TPNAME6= <>
##$TPNAME7= <>
##$TPOAL= (0..7)
0.5 0.5 0.5 0.5 0.5 0.5 0.5 0.5 
##$TPOFFS= (0..7)
0 0 0 0 0 0 0 0 
##$TUNHIN= 0
##$TUNHOUT= 0
##$TUNXOUT= 0
##$USERA1= <user>
##$USERA2= <user>
##$USERA3= <user>
##$USERA4= <user>
##$USERA5= <user>
##$V9= 5
##$VALIST= <valist>
##$VCLIST= <CCCCCCCCCCCCCCC>
##$VD= 0
##$VDLIST= <DDDDDDDDDDDDDDD>
##$VPLIST= <PPPPPPPPPPPPPPP>
##$VTLIST= <TTTTTTTTTTTTTTT>
##$WBST= 1024
##$WBSW= 4
##$XGAIN= (0..3)
0 0 0 0 
##$XL= 0
##$YL= 0
##$YMAX_a= 423880
##$YMIN_a= -470075
##$ZGOPTNS= <>
##$ZL1= 120
##$ZL2= 120
##$ZL3= 120
##$ZL4= 120
##$ABSF1= 16.522
##$ABSF2= -4.171173
##$ABSG= 5
##$ABSL= 3
##$ALPHA= 0
##$AQORDER= 0
##$ASSFAC= 0
##$ASSFACI= 0
##$ASSFACX= 0
##$ASSWID= 0
##$AUNMP= <proc_1d>
##$AZFE= 0.1
##$AZFW= 0.1
##$BCFW= 0
##$BC_mod= 0
##$BYTORDP= 0
##$COROFFS= 0
##$CY= 12.5
##$DATMOD= 1
##$DC= 0
##$DFILT= <>
##$DTYPP= 0
##$F1P= 14.0000005364418
##$F2P= -0.99999901652339
##$FCOR= 0.5
##$FTSIZE= 32768
##$FT_mod= 6
##$GAMMA= 0
##$GB= 0
##$INTBC= 1
##$INTSCL= 1
##$ISEN= 128
##$LB= 0.3
##$LEV0= 0
##$LPBIN= 0
##$MAXI= 10000
##$MC2= 0
##$MEAN= 0
##$ME_mod= 0
##$MI= 0
##$NCOEF= 0
##$NC_proc= -2
##$NLEV= 6
##$NOISF1= 0
##$NOISF2= 0
##$NSP= 0
##$NTH_PI= 0
##$NZP= 0
##$OFFSET= 16.522
##$PC= 1
##$PHC0= 230.6932
##$PHC1= 4.974546
##$PH_mod= 1
##$PKNL= yes
##$PPARMOD= 0
##$PSCAL= 4
##$PSIGN= 0
##$REVERSE= no
##$SF= 250.13
##$SI= 32768
##$SIGF1= 0
##$SIGF2= 0
##$SINO= 400
##$SIOLD= 32768
##$SREGLST= <1H.CDCl3>
##$SSB= 0
##$STSI= 32768
##$STSR= 0
##$SW_p= 5175.98343685301
##$SYMM= 0
##$S_DEV= 0
##$TDeff= 65536
##$TDoff= 0
##$TI= <Analysis number 999999
Compound Code 99
Book Reference 9
Project Code 9>
##$TILT= no
##$TM1= 0
##$TM2= 0
##$TOPLEV= 0
##$USERP1= <user>
##$USERP2= <user>
##$USERP3= <user>
##$USERP4= <user>
##$USERP5= <user>
##$WDW= 1
##$XDIM= 32768
##$YMAX_p= 280912914
##$YMIN_p= -383342
$$ End of Bruker specific parameters
$$ ---------------------------------
##NTUPLES= NMR SPECTRUM
##VAR_NAME=  FREQUENCY,     SPECTRUM/REAL,   SPECTRUM/IMAG
##SYMBOL=    X,             R,               I
##VAR_TYPE=  INDEPENDENT,   DEPENDENT,       DEPENDENT
##VAR_FORM=  AFFN,          ASDF,            ASDF
##VAR_DIM=   32768,         32768,           32768
##UNITS=     HZ,            ARBITRARY UNITS, ARBITRARY UNITS
##FACTOR=    0.157963299565203, 1,           1
##FIRST=     4132.6476996994, 0,             0
##LAST=      -1043.33573715361, 0,           0
##MIN=       -1043.33573715361, -383342,     0
##MAX=       4132.6476996994, 280912914,     0
$$ Real data points
##PAGE= N=1
##DATA TABLE= (X++(R..R)), XYDATA
$$ [...]
23662 31243 9381 1235 21196 27761 28424 18782 12785 20143 8231 8212 16495 12630 12178 26823
23648 26823 18055 10906 8446 15412 15065 13663 5699 12181 7316 -2964 -1592 12062 22930 31539
23634 31539 31740 28373 17618 24157 27044 40527 34422 23273 9706 3753 15186 10500 9178
23621 9178 11336 18470 20989 26383 32922 38259 42148 31926 20721 27686 31982 34550 41612 41053
23607 41053 25789 12595 -9649 -15178 -2151 6344 -1294 -2136 4147 -5652 -3171 7100 -9060
23594 -9060 -11829 -3885 6547 23091 19283 14391 2734 -9049 -15209 -6158 11464 19822 25686
23581 25686 27282 32325 22860 17007 17645 18034 12736 19171 29479 36044 34456 28352 24931 11775
23567 11775 5595 11717 3711 4232 16547 9032 15502 27576 22229 9788 12293 9231 5428 26679
23553 26679 33586 35282 23064 21960 24377 31811 28829 18194 10819 2262 3197 7169 -5872 -16136
23539 -16136 -5279 5607 -6898 10421 17625 6309 15290 7770 -1561 -300 3289 490 -4861
23526 -4861 -14272 -4255 14304 6801 4492 19389 20012 13734 17487 24825 20768 1578 960 644
23512 644 -492 9373 22364 22249 11928 18482 12027 8014 -2793 -7803 -3977 -8347 -5200 -3977
23498 -3977 1304 139 5897 25752 26211 27369 33362 13389 4938 7719 8058 3104 -1529 -5704 -14731
23483 -14731 -11027 -9419 -10049 -7036 4055 22657 31184 27474 23182 26703 26057 25107 36792 34605
23469 34605 28583 38693 28143 34324 28555 32885 32126 25334 23072 19046 17697 16308 9209 13789
23455 13789 5139 5482 24937 13946 10017 27499 9372 -7617 -7123 -5150 -5796 10624 17701 13991
23441 13991 13604 12339 14750 14641 7850 1371 2285 -7848 -10973 -14136 -6416 -5207 -16499 -14345 -13099
23426 -13099 -13293 -5315 -6173 1532 332 -14698 -4476 13559 8666 8613 -579 -19912 -26821 -21934
23412 -21934 -12244 -5291 -11513 -24697 -15183 -5231 6697 -6190 -12958 -2055 -9009 -14677 -7939
23399 -7939 -4769 1158 16225 24617 -1216 -9675 -2668 -2905 -14130 -16996 -11480 6449 7265 -3718
23385 -3718 -1384 -6458 -14352 2106 1424 -3675 -8839 -3246 -2813 5928 5515 -4646 -24523 -34855
23371 -34855 -33190 -9718 12624 10312 14620 6778 -2032 -10752 -15359 -1167 15829 16553 17466 10232
23357 10232 4704 -1709 -2717 761 13224 20343 12348 -1567 -1152 7886 -1937 -14730 2795 8189
23343 8189 5948 16009 18845 10478 9997 18931 20814 7431 -2189 -15319 -28617 -33144 -16603 534
23329 534 1822 -2620 7049 16634 27509 19912 5579 11788 6442 8173 303 -5277 8272 21621
23315 21621 9424 -1307 -1221 -921 -5561 -3025 -14786 -10128 -7809 -5152 -5065 -11339 -4075 421 -7049
23300 -7049 -4798 1544 -3463 7529 1089 -3739 -5635 51 1041 -6192 -11809 -4046 7221 8938
23286 8938 5344 3310 2049 3385 1942 3676 4219 -1459 3009 299 -4721 -10048 -1796 22893 36327
23271 36327 29564 25106 30991 23582 3315 157 -4424 -4964 1962 25364 25468 26744 13021 1262
23257 1262 5142 10872 4034 -1362 9822 3776 -2048 -4433 878 10767 -4579 -22649 -21307 -2822
23243 -2822 1423 -8850 -19181 -18244 -12437 -14480 -8467 4687 5701 6915 5419 -2546 -10171 924
23229 924 6727 6892 2795 -6994 -12265 -9432 -1508 8308 -1088 -380 6169 10824 10534 6058 2895 -2022
23213 -2022 -5286 -4949 -11907 -15672 -4479 -492 -19375 -13123 -13872 -10603 -12444 -3982 4265 14584
23199 14584 20349 16822 -5628 -9781 -5288 -277 5496 -10795 -25046 -23553 -14328 2486 987
23186 987 -13037 -17379 -16770 -9889 -4119 -5385 -4506 1613 12966 32483 30533 33947 30605 1177
23172 1177 -14041 -12745 -7935 -9677 -4696 -541 -6223 -16451 -20066 -11016 -5550 4402 -666 9705
23158 9705 5136 -11502 -12201 -1823 -1695 1868 -2841 -13763 -14573 -977 7689 13906 26873 25686
23144 25686 -1502 -17001 -16207 -13935 -10874 -11083 -5852 8121 6089 -4779 -11676 -15534 -6247 -5120
23130 -5120 864 5216 8575 2967 10596 9377 11803 8031 460 1788 -3011 14518 30602 29409
23116 29409 24447 28617 20730 449 -14190 -1651 19504 24023 22747 9057 9666 14259 11883
23103 11883 -2578 -391 -7397 4510 1176 -5545 8065 13102 15870 2853 8938 8248 15176 18634
23089 18634 9812 -3252 -18858 -15563 -12987 -12258 -15140 3797 29043 35450 25301 8849 1944
23076 1944 7051 6240 -162 -13466 -14817 -10137 -15286 -6917 -4548 -4098 -2946 -1832 5173 3411 4405
23061 4405 -4700 -19261 -16189 -934 -1964 4891 6271 11728 5487 4399 -942 -5505 -2076 4900
23047 4900 -2549 -13475 -10791 469 -7217 -14512 -10328 -5385 -8416 -1085 5567 -2926 12972 21482
23033 21482 15356 2034 9943 23923 11932 13235 13746 17613 19644 15696 17444 14783 30481 36772
23019 36772 26829 17543 10554 10368 -4618 -11285 -12317 -3681 10709 25286 19409 5548 12497 10676
23005 10676 -4627 -10113 -4838 -4751 -1049 8024 12232 9947 2950 -1084 -2622 -6549 -9693 -10741 -12474
22990 -12474 -18167 -2991 1218 -5576 -14045 -13206 7935 18378 9538 19398 25042 22310 11965 18305
22976 18305 20279 19643 15510 11934 6538 10891 6780 4379 -4693 -9116 361 -6290 -17598 -25949
22962 -25949 -16793 -7844 7268 14542 -39 -12005 -23582 -11825 -11920 -304 8870 -4142 13422
22949 13422 30438 24614 16444 11023 12675 18334 17049 10800 18316 11329 8361 -3255 -5690 -191
22935 -191 -5627 3922 9824 10621 8842 5969 -5230 -15032 -23109 -14990 -5817 8536 766 -7571 -2907
22920 -2907 4037 1228 9446 27485 30356 10637 5746 4782 -5139 -1408 8771 21640 28011 21262
22906 21262 9656 753 -3189 -6501 5369 10628 19531 20255 10043 9389 3203 -5625 -9446 -15484
22892 -15484 -7228 11449 32690 25802 2382 -4606 4239 -9011 -12565 2032 -647 -3483 1213
22879 1213 -2487 -26536 -29620 -9754 8802 8463 12368 24962 33723 29083 23628 11161 10028 15553
22865 15553 30606 15547 -14990 -11296 11271 10050 16013 11393 2367 4425 1687 -6723 -8752
22852 -8752 -9795 -6775 4375 2294 7777 -10334 -14694 -12635 -4492 -1535 849 -2943 -12712 -4879
22838 -4879 -3594 -12403 -20415 -17922 -20175 -28093 -31016 -22230 -14327 -13505 -9043 1998 4103 1440 3713
22823 3713 21467 28344 9326 -15733 -21357 -14808 -7854 -6689 -11364 -22681 -18725 -16127 -18081 -15066
22809 -15066 -1307 2067 1420 -5436 -1153 -5019 4262 23170 17441 7734 5936 18052 23059 17119
22795 17119 2201 1369 -9919 -24272 -34619 -17616 -7379 2500 -2442 -10957 -7201 -2967 4356
22782 4356 9270 -4171 2611 -4441 -10961 -11470 -16903 -5205 -2552 -3678 -717 -6496 -12713 4828
22768 4828 -6317 -16772 -12763 -11121 -9405 -7587 7158 6735 8334 4898 -2709 -1635 -4102 -4195 -9457
22753 -9457 -19229 -31208 -26774 -13490 -4749 -8340 1367 -9254 -25896 -22616 -16285 -284 16328
22740 16328 7781 -59 -7145 -19512 -12434 -10342 -29038 -29534 -22508 -508 4971 -2638 -17923 -15799
22726 -15799 -10905 4605 3668 9700 6496 -13898 -29995 -21333 -10441 3678 20383 9973 7642
22713 7642 19806 14534 13144 17588 3039 -7696 -9482 -17077 -2545 2464 1516 3598 -1025 -8996
22699 -8996 -12675 -5791 10164 -8064 -19620 -13279 -15407 -17321 -12824 -11278 -9665 -2310 -5466 -6546
22685 -6546 -9116 -4549 -1342 2946 -3610 -1322 9382 1000 -13315 -2816 10415 887 -13544
22672 -13544 -10273 -412 456 -5374 -2948 8626 14655 16018 7979 9438 13157 10288 -3173 -3043
22658 -3043 -4614 -3927 3445 9943 32236 27898 6140 10868 13716 8416 8384 10777 15611 -894 -18743
22643 -18743 -19431 7577 29598 23550 6272 4933 771 -2493 -3782 6610 8884 -4576 -21958
22630 -21958 -14622 -9834 -10906 -10056 -10021 -11752 -1995 -3562 -13280 -16931 -26653 -16577 -14691 -1555 16192
22615 16192 18946 10597 16930 22846 -652 -23849 -25439 -17793 -3881 -7055 -4486 -14088 -2699
22602 -2699 18264 24385 17606 3920 452 6745 6516 15337 18601 14325 5465 4159 4233 706 5770
22587 5770 11058 -3171 -8004 -13773 -16136 -14447 -5605 13599 27123 11603 -2520 5612 13322
22574 13322 4544 -797 4723 12347 9931 17708 6954 3269 -6632 -28115 -36131 -28596 -33258 -32186
22560 -32186 -24093 -22714 -13991 -10541 -5824 -6177 -20932 -18368 -1988 22040 12048 8327 -2283 4344
22546 4344 600 -1392 -2918 -22888 -30382 -18980 -5089 15459 23170 22146 20297 29384 10803
22533 10803 -83 1098 13549 -3434 -21886 -25970 -15065 -5138 14982 13205 8283 -7492 -4341
22520 -4341 1770 -11454 -18021 -9784 -11176 -8217 6807 7466 17525 21181 32028 34748 25170 12750
22506 12750 8083 -2442 -7890 -15823 -17803 -8927 -11646 -23323 -12634 103 2407 5143 -11808
22493 -11808 -10069 -18463 -26392 -25434 -21515 -19095 -8221 1425 4388 888 -1911 -9137 -18019 -8216
22479 -8216 -2303 6109 -399 -3078 -11801 -15561 -14515 -7814 -9482 -15424 -16724 5313 5159 -4166 -1172
22464 -1172 2287 -786 -1077 -1219 6586 8646 14779 19355 2733 -28 -4792 -10741 1457 8682 229
22449 229 139 -14376 -26947 -7139 -11012 -7038 902 787 -3137 -11581 -12247 -14098 -8449 6818 9187
22434 9187 420 5866 11077 12561 13077 10258 1051 -3819 9958 25139 25692 8101 7371 14117 2444
22419 2444 6155 14583 6881 3934 7454 8984 7795 -1655 8660 4673 -2794 -112 -24877 -16350
22405 -16350 4420 22806 26863 24886 8871 -6591 -17504 -19542 -6145 -1158 9182 9935 10161
22392 10161 -93 -10116 -9734 -7424 341 1617 6681 370 -16526 -15020 3187 18786 341
22379 341 -23121 -21709 815 -3581 -4416 -2332 3286 8735 3767 -6209 -7650 -2978 -2816 -1177 12218
22364 12218 20678 25149 29214 19337 -955 -920 11044 12692 4261 3177 5902 4705 4248 11467 16651
22349 16651 14730 75 -9179 -11144 -15053 -8361 -13935 -16298 -10043 -1739 16599 11213 514 3762
22335 3762 2413 7523 4235 12672 30872 31333 23171 8244 5786 17866 27863 16193 32763 28900
22321 28900 12585 -1174 2387 1321 -19827 -33128 -17297 -8005 8142 14529 -2136 756 -820
22308 -820 -9857 -18949 -32830 -33335 -12443 -2668 1058 7659 6871 2653 91 8880 -446 -7408 -16989
22293 -16989 -9712 11788 20174 16466 8625 7293 -11935 -21148 -19988 -16498 -19119 -25096 -17284 -7699
22279 -7699 6477 5561 10271 20306 32201 31247 21213 10374 6844 17795 30650 14851 6820
22266 6820 4489 -1273 -5272 129 5082 6627 -3873 -11947 -10922 -2457 6530 3388 -16345 -23782
22252 -23782 -23780 -26154 -26881 -18152 -10909 -6375 8052 4272 -10321 -7810 -5885 2747 21019 10250
22238 10250 10661 23644 24562 22575 9792 -3782 42 6006 14388 3752 90 14248 27890
22225 27890 28439 10040 -16661 -9938 -7097 -2991 -8283 -5898 -615 -3957 -16585 -24675 -10889 454
22211 454 -4891 -590 5387 1113 -7789 -4600 1658 2504 -11661 -31420 -39409 -40979 -41000 -34042 -30012
22196 -30012 -22307 -9228 6485 6710 -1773 9433 19737 8650 11234 9679 1224 -5616 -2223
22183 -2223 -7491 -7938 -3908 1042 -2928 -12678 2510 9754 370 -9951 -7293 716 1056 -5654 -10995
22168 -10995 -6969 -7496 -13059 -8052 676 3440 -11438 -15854 -7246 3849 -9658 -5192 -9812 -4745
22154 -4745 -2366 -6390 -14882 -10640 -8370 -3320 6923 12045 8712 -3902 -504 -5380 244 10638
22140 10638 17666 14857 4258 3562 5846 -5396 -18349 -18131 -1164 9884 7430 8945 4380 -7151
22126 -7151 -14217 -8469 -11454 -16 26153 24483 24769 5641 -1186 5060 -7574 -11194 -19394 -37225
22112 -37225 -30629 -5620 -6167 -13276 -12943 6711 25844 22409 12757 16394 33291 50777 27181
22099 27181 27111 36763 28104 18697 -6934 -7958 7784 2295 7694 5597 -1362 -4921 -3131 2128
22085 2128 4669 -1213 10326 13900 11061 9100 12526 21911 24375 -1470 -13235 -11050 -11796 -1106
22071 -1106 8156 1489 6583 14132 15254 17826 9493 10521 2004 2489 -9814 -12230 -5336 5195
22057 5195 16674 15229 5698 -1536 2687 12012 16641 20024 8016 -18155 -29955 -12146 3127
22044 3127 11218 19268 21881 27810 19582 4416 910 -7323 -5679 314 -11209 -3131 -15380 -18435
22030 -18435 -23030 -25991 -22589 -14031 -5305 -10563 -15918 -23025 -14258 -15034 -21948 -17907 -7780 -11161
22016 -11161 1334 9148 9634 -2044 -19145 -15891 -10079 -9010 -10087 -1433 6361 8840 -10404 -12182
22002 -12182 -18536 -30832 -18170 -3813 -7596 -22686 -41282 -47155 -42246 -20490 -13224 -18320 -11537
21989 -11537 -15936 -15605 -7975 -5614 -3663 -15226 -15236 -8487 7911 17776 7119 6805 13704 6427 8782
21974 8782 -2388 -15645 -21722 -28012 -33479 -36381 -38928 -30330 -4316 5003 1892 -6486 -10535 -21932
21960 -21932 -10070 -2471 -11240 -15599 -22058 -25480 -20850 -12071 -7907 475 -800 -6968 -9798 -2210
21946 -2210 -3376 4916 -5465 -14674 -29173 -39740 -28398 -5272 8337 3924 10252 9785 -5686
21933 -5686 -12696 -8114 -4179 -2894 -3648 480 14213 17998 7817 11394 16054 8267 4042 6160
21919 6160 4970 1441 7889 11170 1380 -12766 -10045 -7386 6005 30283 33637 19386 12619 12574
21905 12574 18639 3074 1211 -14565 -31882 -32654 -26316 -6315 2290 13270 24319 10758 -2338
21892 -2338 -8265 -12915 254 12225 13407 7292 -3821 -2365 -5944 -16163 -12371 -348 -993 -9852
21878 -9852 -20328 -13660 -6933 2659 2521 10884 7784 5342 15861 3322 -14032 -22101 -13657 -2727
21864 -2727 -9918 -12179 -12353 -5048 11840 5196 4494 -4603 -7172 -4308 -1198 2834 3765 3708 20981
21849 20981 23163 21185 16153 12963 5601 2750 -6877 -18643 -32208 -18773 -8064 -3632 4296
21836 4296 4329 1217 -3560 -8348 -9630 -7384 -10454 -19936 -14930 -684 -7920 -6856 -7549 -7768 -9485
21821 -9485 -18675 -5857 436 -435 -18181 -12346 -11549 -20848 -29769 -19075 -4291 2134 -9321 -13548
21807 -13548 -4990 -11482 -6757 -17933 -23263 -15869 532 3513 5995 7075 2204 -3246 2768 -17674
21793 -17674 -12065 -12872 -28145 -28475 -22845 -15198 -18328 -1506 -9957 -10875 -10510 -14251 -22821 -24680 -14321
21778 -14321 -1946 -6286 -789 -4499 -13691 -14326 -12102 -16623 -16254 -8451 -4092 3939 2875 -2018 -9668
21763 -9668 -17277 -8716 2545 2709 -6134 -20072 -19277 -17960 -12648 -9554 -8400 -7157 -8772 -11977 4795
21748 4795 12498 8991 -2404 -3965 -1889 368 -18869 -27215 -25194 -26435 -14924 -6652 -9040 -5462
21734 -5462 -5985 9839 12947 5092 17375 21364 12998 3911 8927 1545 -19023 -34240 -16149 -14725
21720 -14725 -16998 -7374 5426 15502 12020 12375 185 491 -7042 -9671 19135 16509 -5021 -14208
21706 -14208 6113 17678 31511 21027 8809 7299 13539 14342 10829 12107 27529 33082 21425
21693 21425 -412 -7197 -13489 -16964 -9071 -10173 -7064 14675 15348 16020 5452 -6260 -4508 -3167
21679 -3167 146 485 -17976 -23165 -15716 -14878 -9818 -3356 -5942 -6075 -8177 -18453 -30682 -28471 -19921
21664 -19921 -30922 -15693 -3130 -1428 -7291 -10148 -6252 -13514 -20113 -1671 -1646 -10640 -13659 -3563
21650 -3563 -7339 -9449 852 1667 -18250 -24340 -25754 -18497 -17838 -18913 -17767 -21397 -13507 -12269 -15108
21635 -15108 -22333 -7885 451 -12336 -15253 -12934 -2434 -2820 3512 9544 13969 3440 -2043 -590
21621 -590 11289 5363 -10256 -34120 -33136 -12299 -9047 -5491 -10010 -1157 3649 10302 18559 16382
21607 16382 25967 17407 -239 591 6597 -3436 -18759 -4539 4068 -14202 -16879 788 7881
21594 7881 -11948 -4098 6069 115 -17167 -22261 -14293 -16829 -18792 -11729 10514 2053 3273 3667
21580 3667 3365 3655 3236 -345 -6062 -31881 -14747 3810 7502 9034 17451 19809 19768 19553 16179
21565 16179 3815 7547 8679 -6775 -11489 -5556 3729 -5211 -17035 -18388 2474 25283 33733
21552 33733 28709 21042 11567 -10289 -8214 -8353 -11200 3704 10288 6401 5813 5644 3504 2763 1545
21537 1545 -5593 -8810 -20118 -19520 -25854 -24832 -17532 -16930 -22788 -22092 -22828 -31305 -22660 -31437 -32470
21522 -32470 -18872 -13952 -8788 -233 -5508 -1067 11143 35156 28561 19012 5162 -149 3511
21509 3511 3704 -8834 2275 16749 19900 15804 3522 -5666 -12225 -8830 7272 7102 -854 -1608
21495 -1608 9299 2136 -9867 -10375 -5534 1276 1607 -7239 -21746 -33196 -26419 1306 -717 -3707
21481 -3707 -9235 -6205 -11608 -11109 -13251 -61 6152 -4678 -15902 -18155 -22940 -14269 -14660 -19061
21467 -19061 -23235 -25386 -17137 -13429 422 3350 -10702 -27184 -26334 -26930 -17150 -15103 -18459 -24914
21453 -24914 -34927 -36585 -33310 -27113 -22434 -9728 2682 8693 13525 3345 -3751 7899 15790
21440 15790 21110 14040 3159 -2012 -15988 -14639 -19399 -17649 -3885 17980 27694 23566 7211
21427 7211 -477 845 12378 10279 -4169 -13097 -21917 -16444 -1109 -5042 7456 13450 -1464
21414 -1464 -1838 839 -1258 -5848 -16725 -22915 -3941 -4557 -14800 18666 23303 5902 -2146 784
21400 784 17418 9667 -3016 -2583 -2900 12410 26169 31321 26571 13092 3888 4418 10562 4813
21386 4813 -8153 -14596 -11316 -9144 6808 8436 4750 -7233 -3439 -409 2306 5413 9477 2340
21372 2340 -10255 -16757 811 -3990 2215 2970 4190 -9664 -10122 796 20433 13609 -4115 -14072
21358 -14072 -19530 -12051 -9289 -7316 -2006 -3553 -12721 -8859 -11642 404 -3326 -8669 -12889 -5663
21344 -5663 1239 -6508 -13496 -4053 -3434 -11547 -11313 -22649 -24212 -17790 -17855 -16686 -24001 -34997 -22941
21329 -22941 -20424 -7547 4303 -4237 -12436 3012 16184 6779 6262 -7104 -18845 -39026 -32088
21316 -32088 -24048 -22838 -18098 -18652 -23187 -32295 -25428 -23300 -23856 -19459 -15602 -23689 -37384 -20756
21302 -20756 -9799 -16394 -9963 -9359 -29577 -32203 -19115 -15137 -18533 -24340 -18592 1437 17696
21289 17696 19149 2921 -4935 -3028 9366 -1093 1006 1119 -27132 -27392 -19538 -21340 -32603 -21383
21275 -21383 1156 2266 6421 -7543 -6640 9242 9374 -9366 -1455 17529 21052 24012 24671 11054
21261 11054 -9263 -25972 -28615 -26747 -21760 -17411 -16322 -6131 -3452 -16198 -24216 -11867 3396
21248 3396 -2373 -11012 -23029 -21622 -4663 15251 5092 16514 35513 40388 19343 -3768 3775
21235 3775 8159 -5967 -18394 -24670 -18627 -16905 -23702 -19852 -12458 -7882 -781 461 -4988 -20888
21221 -20888 -21185 -13784 -7153 -19800 -34982 -20334 2480 7237 888 5892 329 -11369 -17628
21208 -17628 -11378 -9195 -13114 -7951 2895 -7088 -12265 -17833 -15515 -18470 -987 24140 24369 17822
21194 17822 3598 -9264 -17484 -5693 -9418 -3913 -587 3325 2676 -2074 -14091 -21471 -23814 -16918
21180 -16918 -13751 742 -4208 -5254 -8377 -7400 3574 3857 437 1335 9853 17990 5702 -14866
21166 -14866 -2799 879 -4023 1459 7245 2418 5792 1725 -4928 -8707 -8087 -1641 -5841 -6197 -12555
21151 -12555 -29735 -30332 -24007 -17550 -8785 4148 8281 1429 -1284 -9369 -20542 -2848 15971
21138 15971 13659 -6953 -10235 -14819 -22458 -24225 -23276 -10681 739 4528 7239 -2057 -9019 -8260
21124 -8260 -6917 -15113 2819 4293 3539 11509 20222 6865 4666 -751 -5961 -8478 -4008 -3039 -21327
21109 -21327 -32859 -24187 -29490 -24689 -17290 -16480 -18514 -16696 -8996 -4527 -2960 -3672 -18942 -19327 -15316
21094 -15316 -4766 -5846 -6202 -5679 -11035 -13878 -25049 -17934 -16256 -9845 3010 20030 13554 7213
21080 7213 -12586 -22040 -24280 -15990 -12584 -13559 91 4102 -1398 -6871 -12463 -8040 -4746 -1736
21066 -1736 4729 -121 -12804 -29836 -39509 -28756 -18957 -12001 -10363 -15506 -11443 4162 3318 -2220
21052 -2220 161 3075 5897 -7348 -19090 -4634 4913 9912 -800 -9804 -17095 -12436 -11126 564
21038 564 -1082 -10540 -10312 -14159 -18850 -17609 -16312 -14552 -10629 -9048 -7025 -9676 -11427 -14849 -12943
21023 -12943 -12123 -3277 12693 17817 15925 7337 7080 7446 4062 1361 16123 13209 14929 21949 18204
21008 18204 11624 5069 5328 -2061 -7020 -12844 -6762 14088 16943 5325 -5092 -19600 -24858 -15043
20994 -15043 -5101 -4413 545 -4691 -2684 -3089 -6160 -14392 -5071 4599 11659 7514 188 -9551 -11772
20979 -11772 -1636 -4989 16189 23202 610 -8080 -8697 8121 6702 -7536 4258 12977 1754
20966 1754 -16459 -28195 -19513 -6095 2489 -2903 -15920 -16125 -23464 -27993 -16939 -14719 -11403 -2025
20952 -2025 530 7955 20203 15566 8980 -43 -6882 -11420 -15216 -15585 -10746 -14182 -10860 -9574 -22041
20937 -22041 -21725 -13360 3640 19164 15490 12357 5022 -8932 -11593 -6811 -8582 -16220 -14071 -6798
20923 -6798 -19070 -5657 2947 -12001 -18580 -2496 7961 5968 -7351 -2820 6627 -6835 -11792
20910 -11792 -11286 -4459 -5704 -7916 5687 5855 6604 18539 8594 6092 6312 5088 9480 2478 1734
20895 1734 -8082 -9712 -15097 -19320 -20786 -18385 -12084 -2673 4840 7676 11379 4056 -7210 -12770
20881 -12770 -26485 -40287 -32079 -17041 -19714 -18228 -22551 -30442 -14439 -5058 -11855 -23575 -19666
20868 -19666 -9950 1785 -11133 -13071 -17927 -21103 -11618 9648 11073 13393 -4719 3627 16951
20855 16951 3502 -5923 -11761 -11044 -6847 -4017 -3904 -3508 -9170 3521 8072 7939 20369 9759
20841 9759 7685 10702 9814 -15034 -25325 -26384 -28144 -25355 -17385 -21090 -21780 -23632 -36601 -27865
20827 -27865 -15515 -16278 -11537 -9159 -21993 -25445 -15839 -3887 1887 -10670 -11529 -1673 3192 -14912
20813 -14912 -25537 -10092 -385 -1425 -16147 -8433 -8039 -9536 -3907 -7023 -15432 -24544 -25746 -13636
20799 -13636 -11665 -16750 2957 14339 2616 -5955 2446 -6364 -17762 -25514 -4604 2059 -6633
20786 -6633 -12722 -17178 -7019 -9487 2528 11491 7663 11005 -1972 -5522 1145 324 13102 5967
20772 5967 1900 9231 -2969 -14349 -15094 -10917 -18608 -21235 -15169 -16716 -22884 -22208 -26962 -26425 -28342
20757 -28342 -29219 -30740 -35479 -29604 -20815 -7417 3200 8938 9468 -2392 103 5825 8259 10503
20743 10503 -3697 -8115 -12467 -18226 -14965 -28739 -35416 -28697 -16041 -16966 -25319 -29699 -9881 -1289
20729 -1289 316 4607 7087 444 8683 15025 14965 2050 -9842 -14971 -18950 -22483 -10914 -18113
20715 -18113 -14526 -11716 2142 12976 10132 -3949 9627 19950 6965 4040 -6287 -9354 -8986
20702 -8986 -3169 4530 -7659 -20149 -2810 -59 -7576 -17157 -13010 3955 6584 11930 2489 27
20688 27 8699 19475 6165 -21689 -27066 -16383 -15562 -74 10615 14660 22361 22738 -383 -3554
20674 -3554 13165 13714 15194 3125 -16249 -23301 -14350 -13415 -5284 -2868 -4245 -6461 -5659 -15618 -18169
20659 -18169 -14244 -11560 -26169 -25128 -8237 7868 92 -16295 -12332 -15228 2669 5976 16188
20646 16188 26318 17744 10101 1816 -1620 -1538 769 -460 10366 19048 16666 -3703 -10191 -5742
20632 -5742 11792 22558 12955 -3036 -3653 -9122 -4258 2066 3834 12076 2334 5796 6954 -6836
20618 -6836 -13374 -11316 -18388 -9906 -8828 -18727 -9176 -5354 -16342 -18384 -21839 -14807 -19597 -42736
20604 -42736 -36605 -26760 -31792 -16265 -18174 -10136 3727 5829 6732 -6380 -10346 -19808 -1953 17894
20590 17894 21053 9648 -13289 -14330 -3473 -4906 -3081 -17726 -9545 -8292 -9135 4421 16008
20577 16008 8822 8243 15894 8909 11397 13090 -2485 -2417 10373 4580 -7395 -2753 5133 -5785
20563 -5785 -3093 -4776 4895 4283 -5433 -6056 6388 14745 9178 -149 1086 2468 3803 -9371 -26993
20548 -26993 -43332 -47496 -47656 -42741 -40696 -26135 -12881 -19436 -16045 -20442 -16494 -18615 -14112 -18203
20534 -18203 -3459 4049 13514 -751 -12436 -11811 -2698 -5328 597 3193 13755 8078 5320 -7739
20520 -7739 -23741 -25951 -23876 -17216 -13934 -12110 -12879 -19933 -14311 -7601 -6072 -10334 -11633 -2515 5649
20505 5649 11440 6430 -810 -8377 -2915 6386 -3459 -29832 -13615 7502 8756 -5541 -31236
20492 -31236 -17826 -3090 -3408 -6801 -1401 -4165 -451 -8295 -18939 -10139 -443 -12770 -34330
20479 -34330 -40078 -29981 -9265 2034 -6091 -12368 -14763 -10433 -8848 -11958 -25837 -28815 -20306
20466 -20306 -14645 -2571 3165 -5454 -10029 -13419 -16688 4435 2893 -6124 -13839 -18727 -26126 -21916
20452 -21916 -11960 -14352 -12761 -1149 25634 28213 32998 21289 8067 -1222 -17382 -15411 -5707
20439 -5707 -10988 -17420 -25333 -22446 -18671 -4650 -8065 -9528 -12307 -1259 9352 17262 5349 -6255
20425 -6255 -17335 -12147 -9624 -10711 86 14196 11174 3551 1381 15392 19005 11409 -5876
20412 -5876 -11232 4234 -2456 -19533 -10722 1351 7924 6843 7257 -12314 -11219 2624 7908 -3025
20398 -3025 -5443 -5860 3165 8326 -5322 -10942 4148 12991 15306 18500 16489 -11644 -20777 -21724
20384 -21724 -9688 -7904 -9587 -12184 -11554 -2522 -3164 -21988 -26154 -6491 13850 736 -17252
20371 -17252 -15961 -19046 -19348 -6601 8121 -2485 -1124 2073 -5492 -18990 -39116 -31139 -1590
20358 -1590 -4252 -11442 4859 15412 16232 12685 3765 -8695 -9041 15066 27271 22440 -1276 -21827
20344 -21827 -28043 -16249 -19501 -21432 -12671 -14099 -10223 -2145 7908 2342 -17259 -16088 -3936
20331 -3936 -11678 -15601 -6737 -2689 -3176 -11451 -18383 -6333 867 -6907 -13900 -15895 -28033 -31092
20317 -31092 -35431 -26057 -24164 -22928 -9464 8794 13235 1683 -355 -6670 -13361 -3136 4822
20304 4822 7537 18060 7818 -7684 -23620 -28099 -24936 -19429 -23052 -13579 -10140 -13974 2730
20291 2730 -256 -6965 -6879 -16018 -11325 2108 -175 -11628 -5687 3032 -7251 2985 7190 -3354
20277 -3354 -14272 -14452 -2353 -11116 -16327 -9254 -13518 -6475 253 -9896 7138 14181 6254 3463
20263 3463 755 -6632 -9528 -13727 -34802 -41311 -36442 -35004 -38893 -48235 -32282 -14489 -7355 1300
20249 1300 -3264 -16525 -7070 6134 7579 -2441 -11064 -17305 -19240 -7543 8160 7178 13837 11305
20235 11305 -766 -8843 -7362 891 15676 799 -13181 -22035 -20798 -9215 6250 3605 3190
20222 3190 -2090 -11380 -5195 796 2285 -20172 -13496 -15903 -17352 -23469 -22721 -27815 -17947 -4815
20208 -4815 3658 2535 6140 8172 12200 -729 -15888 -17893 -14581 -11332 -10301 -11000 -8209 -16692
20194 -16692 -18825 -7746 -811 6180 12009 14879 16015 13103 10056 21497 15463 -5274 -18198
20181 -18198 -18099 -4864 -3452 -12786 -3596 6524 4766 -802 -183 -2719 -5540 -12573 -6959 -1676 4174
20166 4174 -11201 -23982 -10400 -2973 -4783 -13616 -14434 -20085 -3640 5846 13443 14149 12142 -2683
20152 -2683 -13335 -3920 15089 13910 704 -8530 -955 1999 13046 4290 12105 -3582 -6709
20139 -6709 -5662 -20457 -25070 -10397 -802 13899 31393 29959 23170 13669 -4195 -20543 -21546
20126 -21546 -22466 -16234 -10990 -25315 -18506 -14259 -9032 -3624 -6109 -11883 5776 11497 12515 1133
20112 1133 -771 11 -6589 16107 18480 8879 -16500 -25892 -10660 -2129 -11080 -7830 -2332 -10286
20098 -10286 -11677 -11291 -12326 -27428 -20416 -16176 -20025 -30452 -25261 -16955 -15203 -14945 -29959 -10765
20084 -10765 17345 15183 15183 12973 -1980 -5811 -1264 3429 8091 10040 3332 -13794 -26100 -22238
20070 -22238 -26604 -22015 -15799 -13680 2402 15372 10553 889 -3257 2252 2066 -3134 -10076 -12755
20056 -12755 -22370 -22304 -23829 -20286 -18740 -11303 -4146 -313 2384 493 3397 439 6095 6163 -4880
20041 -4880 -3302 -2308 -3134 -15574 -24648 -16405 -3810 4861 -1537 3040 17443 28722 31829 23435
20027 23435 6282 -9843 -10513 -9092 5722 9718 3493 -1323 5989 9446 -1550 -4690 10489
20014 10489 17222 20600 21037 8939 12676 5612 3480 5431 7287 11656 24126 28569 8704 -4736
20000 -4736 -26550 -24392 -1632 17382 22120 10906 1286 -2460 -10756 -7644 -7463 -14897 -2390 3952
19986 3952 -7269 -15194 609 7633 -4915 -17799 -1478 3314 -14938 -18334 -13971 -24525 -25770
19973 -25770 -18693 -15590 -20302 -2996 11783 22459 20598 18002 16516 19036 14073 6134 11373 8663
19959 8663 -3588 -12346 -12208 -10937 -6308 -4347 -4126 -5787 -220 8132 3768 -8010 -17836 -25379 -26365
19944 -26365 -16200 -17221 -22990 -25794 -22602 -14062 -16065 -3699 1701 19176 28897 18333 12930
19931 12930 7297 19295 16369 20113 24988 22306 8069 11065 11613 9026 10331 1223 -1841 12521
19917 12521 10897 2453 8021 8248 1381 4459 -1093 -37488 -49231 -33753 -12419 -967 5435
19904 5435 9456 7659 15318 16200 14977 9211 -4977 -2069 -4240 -610 -4440 -17537 -8137 -7102
19890 -7102 -7994 -14355 -919 4287 -2323 -11573 -5553 -1648 -26467 -29222 -30369 -35051 -36774 -28251
19876 -28251 -25244 -15480 -3568 8770 6803 3489 -6649 -6072 14724 8803 -3532 -2074 -2399 1348
19862 1348 19453 13526 -4676 -5482 -6620 -11442 -26509 -14494 -3399 4813 2262 5382 4254 -1015
19848 -1015 17865 23915 2455 1542 -8763 1810 16647 14985 11384 10986 6889 14563 14356 -347
19834 -347 -4155 -20161 -14727 -16338 -19670 -14411 -4518 7211 6694 2503 -6277 -7292 172 14030
19820 14030 16775 10060 7454 5872 151 -7385 702 -616 -5588 3629 4184 -4418 -4458 19425 21505
19805 21505 2377 3975 21859 24738 21934 23255 12287 15116 27669 14460 3562 4518 -9476
19792 -9476 -15501 -21864 -20444 -20712 -16348 -14066 -5237 5402 4853 -2563 -6185 -15148 -38731 -47729 -38738
19777 -38738 -18003 -3666 -15223 -18714 -5258 8228 10719 758 -882 3134 -7942 -18288 -3684
19764 -3684 6508 784 -11439 -8434 -20543 -22471 -5415 -5181 -13068 -18870 -22723 -30217 -20059 -19859
19750 -19859 -18397 -17620 -25466 -22833 -23692 -30167 -17705 5810 7679 -4059 -6217 -2251 -2774 1704
19736 1704 -2758 -8120 6058 8260 -4381 -13710 -12061 -10071 79 2599 10611 -5420 -14680 -7822
19722 -7822 1292 -2100 -13480 -19897 -21570 -20934 -13988 -2579 -8224 -29927 -34535 -24127 -14981 -22688
19708 -22688 -12609 -15855 -10273 7517 -4887 -8013 -9085 -15235 -27988 -35288 -19606 -2712 16490
19695 16490 11864 3509 1750 2563 -448 -11503 -16414 -25011 -18647 -17049 -13603 -7929 -7031 3900
19681 3900 8501 11834 10764 -6864 -5574 -6347 -11136 -13061 -3351 -4701 923 2707 536 -3864 2085
19666 2085 -6571 -5758 -9483 -11845 -14162 -5854 -12012 -15400 -11390 -3210 -5154 -25602 -28449 -29411 -37313
19651 -37313 -49585 -48526 -29307 -38648 -32117 -16859 -17278 1463 12591 2173 -238 -10984 8166
19638 8166 17176 3818 2532 -6050 -5274 -916 6225 -1810 -16749 -1827 3916 2436 -2692 -9624
19624 -9624 -7152 -10557 -8392 -18800 -16553 -18597 -11043 2574 2232 -23181 -31718 -26342 -22311 -21628
19610 -21628 -14717 -20963 -4576 12622 19883 25479 13803 2135 4186 8738 5182 7410 -13132
19597 -13132 -27367 -37904 -22033 -3973 7493 -6740 -21479 -23621 -18666 -865 4018 -18058
19585 -18058 -22700 -11573 887 2634 845 -7417 -8766 -8978 -15373 -10965 -1133 -674 5805 -3349
19571 -3349 -3284 -8874 -18855 -17135 -15988 1940 -4333 -14735 -10128 -18395 -17027 -2558 -319 -5871
19557 -5871 -14301 -8818 -9703 7450 1639 -11695 -10241 -12551 -8059 -14096 -17814 -23902 -18273 6779
19543 6779 15851 3123 -4155 6374 12654 1382 -15360 -32329 -30443 -11289 -1032 6778 -4970
19530 -4970 -14481 -10701 -9581 -24867 -28918 -19179 -8465 -7183 -3914 22624 23516 9661 -6874 -7173
19516 -7173 -2594 5317 7724 12313 9667 5909 -6488 -12740 -1632 14472 27430 15061 11270
19503 11270 6915 12615 12446 -964 -12437 -13576 -4332 -12896 -28635 -23746 -31923 -26571 -12494 -6536
19489 -6536 11581 17900 3852 -9679 -5587 16658 3851 6723 13267 16734 7374 5607 13064
19476 13064 11552 16224 15259 10792 836 4005 -8953 -24034 -22714 -15341 -17452 -17299 -9549 -12641
19462 -12641 -22310 -22047 -32050 -26297 -14942 -20572 -17027 -7117 -15023 -31367 -18442 -15865 -9319 -3077
19448 -3077 -4166 -11306 -10494 -13794 -30675 -32848 -24998 -25023 -8125 9422 8351 -6785 -7117 -10439 -16437
19433 -16437 -19869 -24007 -20852 -20157 -30258 -30783 -29072 -33828 -36317 -22399 -3351 -368 -16633 -15963
19419 -15963 -6360 6819 -10039 -10671 -23196 -10751 -980 5867 -8673 -16110 -7851 -9732 -14692
19406 -14692 -25689 -31755 -28299 -27475 -18620 -17233 -10488 -13389 -12438 -427 792 -9236 -22606 -35925
19392 -35925 -25741 -30032 -29409 -26720 -23798 -4981 -11515 -3014 4054 7034 -1499 -800 -5966 -9222
19378 -9222 -15056 -19018 -19763 -24270 -23351 -15425 -10441 4771 11198 8584 9335 4873 -16368 -23439 -21494
19363 -21494 -4915 -1635 2575 6293 5282 -27100 -38237 -31795 -20463 -25713 -31690 -31065 -19894
19350 -19894 -15665 -16782 -21386 -24716 -4373 11050 7904 10110 6764 8762 -2962 -10579 -10924 2092
19336 2092 -2644 -15646 -20815 -17239 -10217 -9366 8485 12675 4510 6306 -17658 -29513 -12923 -3344
19322 -3344 -5118 -15893 -18370 3916 5519 7159 -447 -12631 -20862 -24103 -11683 -5452 -13096 -9705
19308 -9705 10923 23828 19633 38 -14651 -28362 -14073 -1020 1987 -9591 -18035 -22347 -13973
19295 -13973 1505 4544 -1002 -10421 -7370 4262 -5243 -14027 -9694 -844 8956 -7463 -35041
19282 -35041 -26311 -11614 2035 9771 9403 -2359 1868 6850 14489 19260 11763 2266 9464 10643
19268 10643 6028 2742 -8929 -14941 -18877 -10668 2903 2823 -6505 547 2901 -6523 -15485 -14022
19254 -14022 -23963 -18579 -4914 -11426 -20999 -11266 -2328 -12168 -15199 -20318 -18945 -16080 -13725 -14782
19240 -14782 -17321 -13984 -23025 -13607 -572 -92 -10434 -22375 -29254 -21607 -12610 -15376 -13727 -8585
19226 -8585 -351 4330 6325 5491 -17584 -30270 -16145 -18044 -29059 -21496 6047 11713 3614 -8366
19212 -8366 730 -9381 -19648 -13930 -4898 -7978 -8785 -8056 -11926 -20156 -29548 -39745 -22652 -5357
19198 -5357 -1771 -4211 -4813 -9678 -10409 2903 23763 18514 -1341 -5997 -9644 -5412 -10778 -12920
19184 -12920 -1575 -7446 -21424 -16127 -7153 -5665 -19104 -20466 -8646 -14648 -11022 -1561 -1495 3486
19170 3486 589 992 -12222 -21910 -13683 -1141 -7740 -6290 -16724 -15813 -2863 15825 15080 19847
19156 19847 22717 21731 15498 5148 3451 5451 -567 -7294 -7961 7256 4275 -532 3038 15794
19142 15794 24006 10251 7095 -663 -3170 -7150 -9812 -5317 5206 15386 4939 -5846 -22752
19129 -22752 -26523 -19178 -14773 -10340 -2859 10572 970 -7104 -5808 -23084 -21358 4536 -126 4855
19115 4855 10798 3087 -21435 -29908 -22137 -10740 -22974 -25868 -34624 -37044 -30688 -26080 -20246 -9818
19101 -9818 -17426 -27146 -22016 -12574 -15186 -23628 -14419 -17309 -11126 -12407 -12193 -23409 -25452 -4696
19087 -4696 14277 11831 17046 2607 -12315 -10751 -10938 -14957 -18640 -15266 -10279 -2494 3592 2755
19073 2755 3271 -13639 -19376 -18129 -9769 -16801 -20657 -16789 7789 10807 3653 1181 -3667 -1141
19059 -1141 13406 28164 13691 -6711 -13211 -15037 -25711 -20115 -14937 -15834 -5831 -1828 -8586
19046 -8586 -11276 -9255 -4142 -19764 -17930 -13762 -21375 -33739 -28068 -14271 -3426 -440 -9765 -29735
19032 -29735 -26749 -10896 -17064 -19365 -20405 -21575 -15225 -3629 -8154 -6832 -18290 -25041 -16582 -15686
19018 -15686 -8930 -18007 -17027 -17785 -9765 -9285 -1984 -189 -10863 -22725 -18898 -17066 -24394 -22600 -20721
19003 -20721 -5449 -5082 -3750 -6029 -9074 -18592 -13127 -17977 -22851 -11506 -22039 -35742 -34010 -22933
18989 -22933 -10044 1558 891 -11324 -20192 -15882 -8856 1045 -207 -3564 521 723 14005 13145
18975 13145 -4355 -5142 -2518 -8389 -16256 -2017 5488 -9498 -21790 -31862 -14946 -2426 3039
18962 3039 10234 11504 -1433 243 2075 -5802 -22330 -10835 3148 7103 8241 17563 9542 -8922
18948 -8922 -27344 -27507 -1004 12271 18517 21193 2358 -2673 1735 18607 16073 13388 12075 3411
18934 3411 15996 15553 20322 20415 17568 6157 4280 16588 27077 25614 6838 -13507 -21258 -7369
18920 -7369 -4536 -3921 1156 -16926 -17086 -17442 -10408 -17441 -16655 -6853 11236 13132 -3374 1416 -9803
18905 -9803 -16371 -18118 -14131 -2698 -1284 4502 2873 2088 6366 -378 -21525 -19775 -16829 -25008
18891 -25008 -22467 -16703 -28956 -25942 -7126 8176 4910 -4479 12802 15454 23514 22010 26284
18878 26284 10447 -2385 -2476 -3369 12928 23249 11682 -3032 2796 7064 8572 16346 5518
18865 5518 -2235 -4396 4559 10960 7799 6377 10236 8509 10332 8323 6314 9573 7197 5094 14874
18850 14874 26870 19419 14464 15371 20017 10187 8577 3522 9517 6159 6335 12687 6157 16938
18836 16938 28416 32287 17700 12478 8130 4159 2609 7566 2713 -10679 -25894 -13158 5112
18823 5112 4782 4191 -1295 -10008 -16971 -9095 7546 2464 8039 14736 3497 782 662 7284 -3832
18808 -3832 -28107 -37431 -34016 -34857 -12917 13072 7121 -11238 -31982 -31733 -25938 -8210 -634 -1378
18794 -1378 -8021 -7317 -4870 -3016 -4745 -7334 -6946 -15864 -14072 -20011 -17197 -3019 1273 -24582 -22848
18779 -22848 -23162 -10226 -9008 -9170 -3462 7094 17081 17557 14599 22546 42166 79291 121797 140040
18765 140040 139406 130355 105269 68282 52437 36342 31339 17459 2596 5032 12238 27462 25307
18752 25307 21024 32425 18440 1588 12497 20962 23351 -3298 -6907 -6252 -13869 -16868 -5001
18739 -5001 3804 8209 462 -4900 -17336 -17456 -1900 -7799 -3582 -7649 -13285 -6902 -3253 3102
18725 3102 3199 5352 -1021 6575 15071 8902 0 -543 -2765 -7268 -4151 -19865 -36572 -48114 -28625
18710 -28625 -24137 -25194 -17895 -19084 -9709 9632 12608 2267 6279 866 -18421 -10575 1360
18697 1360 2871 -12191 -11328 9233 4308 -3303 16190 18179 -1414 7592 9182 3110 6034 5216
18683 5216 1183 1177 -1893 -7650 -19674 -9163 -7347 -8846 923 17605 20746 6951 16304 28818
18669 28818 34043 23280 4152 -801 2716 759 -13463 -17579 -15821 2750 7344 -5155 -15827
18656 -15827 -7272 3167 -7361 -16706 -7457 -2175 -11310 -16300 -23539 -22543 -7439 -9207 -10380 -4536
18642 -4536 -4763 -19575 -18145 -11500 -15490 -17557 -21016 -16866 -18246 -17068 -19578 363 4602 -7410
18628 -7410 -13941 -14190 -5931 -11514 -16004 8780 19778 14960 22144 6035 3930 -8323 -15378 251
18614 251 4211 9556 9630 7360 -4329 -11438 -14343 -12939 -14272 -5971 -4018 -4560 715 -406 -3362
18599 -3362 -17611 -24522 -14723 -6470 -11305 -15743 -10004 2917 582 -1005 4470 13171 8441 9721
18585 9721 11398 8510 4195 5580 1392 -14651 -16391 -17815 -16154 -11051 2181 11282 7143 -4318
18571 -4318 -6276 -8146 -15210 -11388 -7878 -18921 -21567 -13579 2351 7778 -5651 -11117 1606 3611
18557 3611 -3603 -145 15121 19164 17533 7225 7614 -3621 -4237 -3961 3705 -1776 -7883 -8826 -15723
18542 -15723 -5921 -8551 -13208 -7992 -2857 11558 24044 9242 -5622 -5594 4503 -813 6320 16963
18528 16963 12206 8758 -3162 18 10339 16669 -2980 8208 5547 -5909 -14885 -2773 9822
18515 9822 4967 -2594 -9019 -17129 -5576 4551 1453 -6857 -8221 -10027 -15694 -8594 -3229 -7838
18501 -7838 7143 27475 16383 15134 28864 19641 17998 9116 -2386 -2078 10227 1284 -14376
18488 -14376 -13246 -14242 -16708 -15013 -19956 -10744 -19032 -25670 -13768 2611 8144 -5254 -15143 -12435
18474 -12435 -16408 -11631 -16938 -1433 5177 -5145 -4790 7049 -3446 -21185 -3239 -4387 -7314
18461 -7314 -8754 2772 2396 -15576 -25427 -22018 -14497 -5427 -10657 -16609 -8414 4293 9819 4917
18447 4917 12073 19858 21798 9212 -12378 -14500 -6085 2996 10047 12918 3273 8517 10293 -4392
18433 -4392 -15830 -22186 -18737 -13292 -15557 -16385 -13060 -4417 -3160 -10955 -28841 -24544 -17643 -19193
18419 -19193 -26095 -16618 -13790 -16300 -6215 -11416 -23852 -18607 -13858 -23044 -16360 -4730 5232 -63
18405 -63 -12308 -15753 -13605 -5860 1007 -4341 -9863 -1255 -2263 -12918 -32633 -31544 -12422 -9934
18391 -9934 -12000 -3440 -10659 -12924 -9912 -12169 -32099 -23883 -14350 -7053 -13098 -17608 -13170 -21281
18377 -21281 -16870 -9957 -7632 -11648 -2321 9798 16768 13863 23023 30431 34222 36921 40256 34332
18363 34332 27523 21931 31613 35963 42346 29720 1097 -9367 -5324 7447 5952 6229 6442 5913
18349 5913 5042 12159 13067 5716 -4571 -12512 -1036 959 6659 -1603 -8399 4013 3535 709 12537
18334 12537 23623 28190 18105 12953 5127 -6516 -13040 -6736 -3702 3321 -4197 -31457 -42357
18321 -42357 -37935 -32406 -19649 -17310 -23498 -7917 19276 21017 9541 13501 -1664 -7259 4352
18308 4352 -2085 -6845 -12378 -2768 -1372 -8826 1732 2107 4630 2878 -134 -4527 10435 18427
18294 18427 19579 10173 16975 21482 8933 16361 26233 16287 30465 42115 33851 26020 21104 23650
18280 23650 21724 21216 27795 29475 29393 7638 164 -9417 717 7721 9011 -6169 -3204 16123
18266 16123 -1489 -2204 2836 -4594 -13090 -6881 2741 12688 5168 -342 10823 8715 3264 -9326
18252 -9326 -15290 -608 8977 16787 7519 -403 -2674 17255 36989 32766 25104 18378 34041 41405
18238 41405 55250 74743 97612 101602 72991 38080 14835 1741 -5761 3964 12064 16418 16158
18225 16158 27465 21835 19368 10751 -2619 2648 -1008 13173 13062 5467 16526 16023 7132 1892
18211 1892 -939 -8473 -5924 -18007 -6307 -5719 -3092 -430 7838 8849 -1417 13924 30604 33585
18197 33585 17382 9675 4400 7689 9326 21285 13827 8920 13093 14023 24331 28763 12916 12208
18183 12208 22719 40500 52709 48766 35887 36220 25177 26224 32581 17156 17624 13365 20792
18170 20792 21756 14660 14477 13707 19489 25709 35854 33768 19226 21661 27310 35336 44774 57270
18156 57270 66329 70169 80663 88341 77297 72788 71366 72322 71146 74744 78974 93972 106652 103176
18142 103176 92531 96514 109320 129300 154092 161519 164670 170073 180159 188187 204981 220944
18130 220944 256863 295775 331070 379125 421163 476271 539333 596003 684722 815342 971167
18119 971167 1151950 1378583 1677839 2108889 2695543 3490630 4563791 6150320 8638060
18110 8638060 12837433 19793699 26964224 26415093 22036255 15320879 9706299 6502581
18102 6502581 4685266 3532390 2722665 2155979 1756441 1455890 1224948 1037354 879443
18093 879443 768199 670204 613319 560904 493737 427299 386955 361145 315484 289045 282278
18082 282278 261031 226738 202215 181365 170046 158096 142902 117976 109836 115239 114926 107547
18070 107547 109101 125491 115993 103543 94223 85780 80458 65972 51582 46026 48374 47302 40106
18057 40106 44751 55959 58588 65892 58269 47822 40851 37894 36050 33949 48124 54103 49925 44561
18043 44561 29467 14025 8440 24103 44157 41245 28150 22891 27507 16497 18514 14998 30541
18030 30541 36335 13820 10109 5907 1498 5102 12100 14325 19563 23600 30168 27382 19252 22231
18016 22231 19341 16323 13090 5594 13160 18754 21083 12052 -8373 -4620 15812 15543 18053 310
18002 310 802 -4032 -10279 7266 17987 10574 4272 2453 -3664 -6698 -3955 -15431 -9575 -2019
17988 -2019 1615 2645 17327 16459 23516 26951 19954 -6826 -27670 -45605 -45212 -37311 -20204 -12776
17974 -12776 -8807 -6472 6135 3773 -1852 7491 -1777 -11465 -22505 -21187 -17913 -10175 808 3185
17960 3185 8827 -9109 -15469 -28078 -22910 -13699 -11682 -5944 -14425 -10108 -9632 -13039 -14257 -12651
17946 -12651 -9165 -20409 -32471 -32700 -19217 -8530 -8211 -2765 8906 3397 -833 -5233 -2187 -12516
17932 -12516 -12081 -3887 -7861 -14616 -23750 -11413 -6736 -22339 -21358 -12989 -12623 -8742 -805 8404 -4737
17917 -4737 -10184 -19192 -32150 -21804 -11968 -10291 -5191 -7173 -13989 -21038 -20594 -9817 -31272 -37351
17903 -37351 -19937 -8472 -9472 -9454 -2913 -2240 -5100 -4517 -2595 -594 -20327 -27222 -23071 -22783 -18142
17888 -18142 -24806 -22954 -9953 6336 17847 11236 14231 14438 10345 4238 3034 13355 8368 -8736
17874 -8736 -16801 -1098 -11495 -15330 -12250 -14758 -10975 -6463 10720 20834 15558 7935 8848 5646
17860 5646 12693 20016 12119 -3018 -8764 3953 -5510 1936 5342 -2528 -11602 -2376 3798 -1357
17846 -1357 -4367 -12942 -7586 1281 8231 14534 -7887 -6957 -8810 -22421 -30926 -19422 -16189 -4699
17832 -4699 10054 9887 6637 7777 6365 7927 7426 102 1700 9982 5790 5928 18948 10506 -863
17817 -863 1099 7569 -2028 -12055 -32378 -30973 -28325 -7019 513 -10592 -9864 -8159 -12614 -9452
17803 -9452 -7839 -15134 -23109 -1074 10661 -5259 -11474 -13606 -8594 -3413 -8242 -15065 -9696 -5383
17789 -5383 -6966 -13618 -11648 8616 14409 7534 -962 -8420 -7628 -1908 -3007 12332 6285 -164
17775 -164 2391 3989 10115 16332 25551 22588 14869 13955 5499 -3643 -2350 6724 16596 7488 -672
17760 -672 -1051 11024 13376 6074 -15896 -31348 -28507 -31196 -28203 -24823 -21674 -17433 -5855 5488
17746 5488 8047 -4146 -23444 -33190 -29740 -21494 -11378 -6059 -11686 -12423 -5400 -9531 -22966 -10971
17732 -10971 -15410 -25704 -15136 -13229 -21114 -27712 -35627 -37252 -24931 -1057 -2160 -12260 -10643
17719 -10643 -2369 -4500 -9231 -25997 -20454 -10560 -8798 -9415 -7519 -16948 -18895 -2255 -8392 -14597
17705 -14597 -20719 -21440 -10906 -3596 -14662 -21227 -18878 -2718 8203 -703 -7923 -6991 -20526 -23927
17691 -23927 153 9052 961 8320 4101 -3503 -11719 -9106 -21945 -19867 -15579 -10654 -6246 12093
17677 12093 12989 -1163 -1675 302 -5298 -996 2912 -7489 -10667 3404 5936 -180 -2123 -1557
17663 -1557 1902 3185 -341 1263 -1350 -300 10645 18353 24294 24927 10602 -2447 -3552 -7315
17649 -7315 -17238 -14993 -27049 -23497 -5373 11100 17686 6651 -16555 -17545 -10509 -2521 15136
17636 15136 8947 -14340 -20391 -31483 -37468 -32802 -13215 -9458 -8437 -4255 -6401 -10684 -18366 -20366
17622 -20366 -17563 -19929 -9267 1543 -6150 1923 -12317 -17223 -4834 -3894 -14567 -9829 -12394
17609 -12394 -9587 -5343 945 -19291 -21475 -10480 -6820 207 2693 -2290 1474 -2342 4744 3824
17595 3824 -8972 -10865 -5148 8117 20953 12574 -268 -206 6604 5635 1418 -1144 1637 5503
17581 5503 210 -8671 -15346 -9683 -7480 -19927 -25659 -33290 -27502 -10007 -7480 4823 7585 4864
17567 4864 9005 4529 1319 -3490 -14602 -19180 -11728 -15700 -10099 393 13746 7035 10756 3220
17553 3220 -14887 -8659 -5510 -8840 -11419 -5848 4674 -1093 802 -3416 4492 13166 688 -11222
17539 -11222 -15258 -14918 -17483 -28266 -31264 -23339 -2349 14616 2734 2336 1831 -2946 -14166 -16211
17525 -16211 -20538 -18985 -32279 -36130 -32692 -26291 -14943 -17044 -21000 -9790 -4714 -8810 -10310 1768
17511 1768 11935 12095 7606 -1251 -8133 -2184 -3716 -10910 -9131 -25 -1253 -17453 -1956 2537
17497 2537 19160 20469 14571 12135 3687 -8721 -3172 -5715 -13834 -2178 3196 -1479 -8248 -14788
17483 -14788 -13970 -18719 -11632 395 -5178 -14609 3091 15257 15861 14416 11505 10042 6234 9293
17469 9293 -423 -1112 -6508 -14156 -14779 -13487 -8068 -873 9533 1867 -5767 -16836 -10645 -14584 -21599
17454 -21599 -9292 5709 6425 -5179 -12609 -11061 -17568 -14732 -1525 30931 61153 80183 117722
17441 117722 135217 132067 103311 76345 58006 36553 36078 48520 50445 43492 43593 33639 30391
17428 30391 28573 10863 -13113 -22232 -20849 -7376 -4775 -24365 -25315 -2269 6467 9480 5886
17415 5886 -7047 -4995 -5324 -15393 -26707 -20889 -23874 -26754 -36095 -36460 -33726 -22878 -12473 -2066
17401 -2066 6316 -2548 -9260 -12389 -10422 -15661 -9123 8637 12359 16257 10626 -5953 -19457 -9081
17387 -9081 -8263 -14519 -22556 -7295 -1246 -3120 1402 12345 9097 5435 2619 6273 -7639 -8514
17373 -8514 -2007 4738 14725 1601 -11548 -3270 -5161 -3948 -10328 -15408 -3484 -11765 -4560 3130
17359 3130 2155 6895 4996 -7073 -9847 -17449 -14726 -14114 -17607 -16488 -19392 -26460 -10867 -5745 -6424
17344 -6424 -16068 -26616 -33180 -30422 -23466 -8703 -12061 -14697 -10744 -15232 -17039 -10137 3301 9084
17330 9084 -2189 -11715 -19877 -27964 -19614 -151 -2 -4639 -12880 -34625 -5714 13863 23397 18172
17316 18172 15558 4608 -11976 -31969 -39784 -19329 13006 21700 23899 27793 17089 18760 22195
17303 22195 29528 14959 26942 28041 17306 11767 8292 13392 8996 15866 10797 -848 5668
17290 5668 2212 -1963 -6644 -19337 -22378 -16198 -4012 3178 2756 -9197 -5341 -13282 -22374 -7388
17276 -7388 -26 12077 12212 2609 -3112 -12085 -23720 -13128 -7191 -4584 -11424 -11237 -12595 -23775
17262 -23775 -29709 -36311 -45575 -37657 -33505 -27106 -26199 -24203 -25507 -26816 -24534 -19375 -10353 13265
17248 13265 28225 21752 16945 10239 7015 3873 14257 26739 19309 6899 12657 6049 6327 10107
17234 10107 5360 -3049 -813 -11404 -11400 -553 5214 9398 9489 -3740 -11020 -7594 -4781 6562 7396
17219 7396 8858 8862 17797 1799 -8807 1184 3203 9790 22264 30748 16465 14889 20410 8569
17205 8569 -5426 -14016 4907 10278 4189 9404 3314 9730 15094 9993 -3923 -6071 -11954 -19528
17191 -19528 -20202 -24037 -35121 -41615 -31087 -15459 -13961 -14803 -14849 -20049 -18000 -8640 -6270 9764
17177 9764 17325 28148 40049 41114 28030 13762 8946 13876 15659 17281 21480 19393 25018 25681
17163 25681 9182 10291 25098 35627 42637 30494 2301 9739 11353 3071 -375 -11890 -30462
17150 -30462 -37259 -34845 -27169 -12971 -19315 -14297 3092 8688 2347 -9589 -17414 -10165 7309
17137 7309 11890 13898 -2499 -28657 -28234 -22478 -14632 -15633 -6436 -8023 797 9878 -1478 -13714
17123 -13714 -7441 -9116 -6566 -8337 -8785 -1364 998 4037 19889 20189 4280 10997 18306 1768
17109 1768 6248 2674 8510 11245 12172 5476 -9572 -12400 -10804 -9154 -8798 1198 8435 9634 4848
17094 4848 -507 -511 6565 2535 -1219 -17942 -11690 -5105 -2734 -4103 -9790 -17954 -8082 -12639 -6003
17079 -6003 5488 -3719 -6331 13292 18086 5883 -481 238 -13917 -16821 -4999 5320 13047
17066 13047 11067 10069 -421 -19546 -16723 -18658 -16393 -14346 4882 10681 -8060 -3310 -4614 -2500
17052 -2500 -10558 -17058 -14815 -16813 -15750 -25047 -18630 -17984 -11906 -4317 2899 -2728 -19735 -25144 -19214
17037 -19214 -15089 -3677 654 -6217 -11377 -20705 -23994 -16733 -18006 -12376 -343 8346 5203 -913
17023 -913 3604 -7605 -3001 5504 1717 -7360 668 1547 8769 17426 16414 13396 -4222 -7258 -14576
17008 -14576 -10713 -5819 -5695 -1927 -14501 -26568 -23655 -20445 -11143 -4918 -1009 7736 20013 15441
16994 15441 6509 4255 4067 -3818 -2014 -1651 -3499 -11897 -10901 -11554 -6960 -14518 -16722 -17289 -9263 -6524
16978 -6524 -1712 2613 -1354 7497 24741 25294 9482 2874 -7278 -6051 -8302 -12731 -18214 -18779
16964 -18779 -31803 -35045 -24297 -21661 -20424 -17656 -11137 -4200 -999 -392 16583 -4261 -21583
16951 -21583 -24346 -19095 -13857 -6714 -8006 -11416 -998 -10583 -18402 -12832 -9250 -4524 -7351 -7808
16937 -7808 -589 1202 651 -7024 -2464 3271 -3524 -8274 4143 3 -12950 -1645 2146 -7543
16923 -7543 -6614 -9391 232 -22858 -23291 -7866 -6832 6985 12287 5463 -707 -2757 2326 4655
16909 4655 -929 5532 -14038 -12894 -10606 -14157 -14207 -12669 -21585 -19578 -10394 -662 -7603 -6178 7693
16894 7693 24221 19397 3563 18804 26699 6876 -9672 -12450 -1772 -6053 -8716 9256 11363
16881 11363 11210 2194 4090 13129 7642 1969 724 -15346 -13999 -7186 433 -1422 -14447 -11295
16867 -11295 -12056 -25488 -14611 -2105 -10663 -12755 -4030 -2309 -8049 7235 17973 7837 5687
16854 5687 11921 7998 5628 15079 -4418 -22365 -15667 -4924 -15147 -8241 -10604 -12896 -3438 11782
16840 11782 9570 12731 17771 10688 -6506 -9469 -4624 -10941 -15492 -9793 8254 9785 479 20311
16826 20311 14111 -3023 -8822 -12013 -20909 -10057 4133 2929 1840 -3633 -7993 15041 28300
16813 28300 26386 22467 9173 100 -5742 -4268 -4863 5245 6557 -2590 10586 12386 4547 -13187
16799 -13187 -7335 -4490 1030 12936 11508 -8531 -14196 -14719 -9988 -14571 -365 1948 1247 2160
16785 2160 -6413 -5610 -4996 2498 -2347 -13903 -24202 -27867 -13759 -1623 -1187 -11927 -14358 -9946
16771 -9946 -4961 8846 10051 -1145 -4046 12759 19866 26035 12446 8409 13014 9552 4467 -1472
16757 -1472 -2473 3700 -3186 2579 6862 -2325 5830 8020 -9349 -18742 -8298 -3160 -11701 -20616
16743 -20616 -6910 -6989 -9558 -11667 -10168 -4647 -8017 -9622 -987 5492 -3599 5432 12282 15394 19212
16728 19212 8501 181 -7308 2264 -1154 -13610 -14603 -12140 -8123 -7254 -14237 -15193 -20487 -15640 -4925
16713 -4925 9209 20434 24975 28433 26579 17968 17086 7410 -3147 -10240 -9026 2084 24152 20712
16699 20712 2513 -11100 -13445 -13052 -14627 -5962 -2061 -7926 -17530 -16121 -5267 7753 18074
16686 18074 14804 7005 4358 -5983 -6565 12172 25697 37557 38850 48194 56194 52992 72818
16673 72818 71003 69380 72208 69250 86436 117102 153326 201826 259365 322284 379472 440709
16661 440709 524181 586514 607889 626017 609953 561323 494719 432758 348243 273523 210533
16650 210533 154205 107709 74522 60779 57232 60966 58021 44797 44790 45611 37277 39232 23996 11881
16636 11881 10052 15339 15874 16021 12990 8440 13156 18944 23213 21651 21859 18850 7997 16108 27426
16621 27426 34145 30877 28567 34373 38141 32052 22274 23043 25324 12512 -2321 -17467 -22657 -21204
16607 -21204 -13337 -10368 1145 2735 11476 17719 24481 26131 29405 22555 5044 -6598 -14534 -12399
16593 -12399 8012 6888 -1749 -3272 9790 20337 24452 29561 37502 34291 28707 16017 19503
16580 19503 23274 17574 13884 27125 35466 28498 26543 21305 21454 5756 -12471 -10407 4929 14316
16566 14316 13829 11407 -3055 10482 23911 16692 11692 3534 -3363 -10697 -5124 6486 7396 5891
16552 5891 9931 7259 -4428 5440 4206 5593 4331 7789 7809 19034 19518 8098 2442 -7613
16538 -7613 -15640 -9507 1171 10451 7345 5978 -10586 -13508 -4267 -9399 -10157 -15684 -25556 -11574
16524 -11574 -11675 -27286 -24117 -16043 -6636 4579 26897 36544 34082 12228 8527 18083 32466
16511 32466 23526 22297 22742 15784 15438 16237 8494 12333 8456 16027 2439 -14030 4965 31470
16497 31470 43207 41350 36534 36129 17036 16290 19491 22477 1822 -3519 -5689 8076 6356 2547
16483 2547 10483 11783 14300 16139 34099 25879 1250 -3868 9298 9870 7315 2437 -9052 -689
16469 -689 -10755 -27040 -18338 -100 9565 9491 -4385 9540 23351 19966 750 -16361 -10909
16456 -10909 -7315 -15365 -624 8412 14019 7804 12257 7682 -8333 -11200 4894 13427 13498 15298
16442 15298 21546 25729 35555 21034 18009 26246 32437 23363 12855 15068 21588 12828 2621 -3163
16428 -3163 9310 8853 8850 10044 3335 -9421 -16105 -9541 -14086 -11131 2973 12410 12385 9439 1704
16413 1704 14816 23507 30579 23339 6637 -4236 -3022 601 -1530 6074 9138 12788 14386 5172
16399 5172 -3432 -6766 -12098 -5963 -553 6310 6867 12311 7848 -7274 -18932 -18779 1642 16008
16385 16008 15021 13067 20123 17128 20751 16968 27216 34915 40769 48509 46708 39432 23388 22000
16371 22000 25363 29612 36724 50797 58048 71170 61087 30572 26372 32588 30757 23979 26974
16358 26974 23123 13814 20673 38361 44296 24620 15384 19711 17269 22646 20653 20186 30161 36699
16344 36699 31165 34292 50221 61802 73374 93662 120818 134715 137206 138647 125074 106441
16332 106441 87767 95120 96038 81081 67962 54140 46672 53214 56716 51977 47606 43212 36169
16319 36169 31749 32780 28812 14505 12528 14196 3012 3483 20543 14179 17388 28713 41082
16306 41082 48058 41019 23332 8218 7936 13218 32102 30927 24269 25081 12751 20053 25691 41410
16292 41410 52974 53742 40769 40214 48454 44282 43452 36355 47210 49050 47910 42398 42646 44098 42951
16277 42951 41438 31309 22235 22395 13475 22042 39754 48248 60152 72587 82989 70951 69443
16264 69443 82002 93293 89885 101605 112723 96366 89608 109088 101802 82289 84661 80108 71340
16251 71340 66434 51839 48286 55330 65795 67893 65350 75228 77822 73296 87742 76575 66933
16238 66933 64310 64828 84654 114130 121277 105252 87629 101443 120433 126049 134927 134259 131136
16225 131136 154103 161882 152757 153831 160324 171939 179972 194223 246093 282567 329308 367010
16213 367010 403550 434202 467452 490980 480815 442086 397526 345235 299987 256604 214962
16202 214962 185824 150279 131526 129970 115567 108365 108012 104142 93265 85277 84774 98745 98380
16189 98380 105531 124350 138971 138186 132416 119306 121260 120312 120025 121919 107951 111153 105917 97394
16175 97394 99408 105900 116248 122778 113066 117961 123431 127969 150788 173118 183415 181172 168193
16162 168193 165507 168987 178109 175852 177166 175516 178909 176826 182045 195400 214034 229464 241625
16149 241625 245035 246014 242724 252697 255357 250247 264127 273223 267771 274513 305070 341357 357519
16136 357519 376998 395757 410442 423762 428584 435633 451921 467428 505389 537837 546576 564961
16124 564961 622014 654307 661192 678768 724939 791320 838606 906162 958397 1021015 1099000 1186636
16112 1186636 1286757 1416688 1554701 1709196 1891959 2111210 2365838 2660310 2992239
16103 2992239 3353595 3726325 4123970 4579861 5113800 5709732 6424548 7318240 8500379
16094 8500379 10115050 12297665 15288423 19490387 25490791 33909968 44747830 56801041
16086 56801041 69710652 84484025 99342420 109422187 114047999 115487415 112939277
16079 112939277 104624804 91970844 77331888 62675557 49400653 38038763 28831666
16072 28831666 21948466 17102666 13714157 11271929 9472252 8130049 7116569 6321229
16064 6321229 5679483 5176267 4747391 4354940 3987281 3656105 3343160 3031731 2734951
16055 2734951 2456328 2215034 2006965 1820573 1642621 1489336 1387290 1279416 1192399 1119106
16045 1119106 1069987 1015529 956368 900714 850194 805648 724800 667201 631879 605503 577480
16034 577480 566447 543802 515914 492293 469147 454058 448080 430213 410790 395340 396825 389612
16022 389612 380175 350691 319763 306675 301698 279629 274397 265016 249272 247050 241980 241778 231360
16009 231360 218669 226019 238467 234930 223145 194243 177171 174563 179321 186038 188576 186095 168740
15996 168740 160682 156634 170134 168167 167615 169657 160906 162928 166716 179471 154405 131127 130634 147417
15982 147417 167366 170581 154872 130442 109857 107510 123172 121112 125924 109138 118591 135577
15970 135577 144153 140422 128633 136781 134801 128862 133898 137744 140901 131522 113779 71324 32194
15957 32194 -13389 -57362 -98512 -136209 -154964 -181120 -178325 -162400 -142467 -108718 -91284 -80728
15945 -80728 -71854 -56516 -43294 -28033 -11346 2343 -2030 -6417 -16097 -11061 -11288 -15019 -9603
15932 -9603 -13688 468 3364 4548 7993 4432 1191 2113 -2980 -1787 6634 5404 9224 -2152
15918 -2152 -11514 -9614 3188 -3476 -8987 -16784 -6656 -8885 -6431 -7424 -8949 -4086 -5914 -14413
15904 -14413 -18913 -19879 -9033 -11679 -18942 -21077 -14581 -9352 -14186 -8517 -13196 -4434 7065 14294
15890 14294 15385 24024 28751 25088 32190 43056 33905 17459 16289 9523 14507 5865 3755 -7314
15876 -7314 -24227 -23228 -6887 10593 24646 26972 36598 41312 50446 44957 33312 20692 21854
15863 21854 37486 31575 26630 29311 21430 19937 37591 43849 28610 13930 -5749 -12822 -10885
15850 -10885 -11327 -3116 2021 1870 8546 20990 32763 25138 20032 13356 12924 21193 13095 2750
15836 2750 -6292 11157 26857 29299 21141 20671 25703 24140 19162 12989 22223 22998 11846 6488
15822 6488 6674 9223 10518 15339 19125 15342 10280 9869 18078 24096 5531 -9686 -12023 -9964 -7506
15807 -7506 -1427 3929 7561 13767 16614 16704 25733 26035 11992 4804 -9035 -24303 -30240 -20380 -15857
15792 -15857 -2123 671 1289 2357 7679 18284 35139 31158 27679 31096 34574 33688 24995 22334
15778 22334 22983 29519 30871 44423 40296 23545 24985 43339 40481 27239 45770 51219 36682
15765 36682 29107 20582 21097 12151 407 -2619 -10385 -5501 -2087 -6269 1338 5798 -1454 11654
15751 11654 18773 8494 8045 20011 9440 10326 15157 12318 7880 8127 6008 -2862 -9356 -21244
15737 -21244 -35312 -12055 14130 7588 558 2005 -8698 -15197 -907 -7054 -3372 8680 13199
15724 13199 7128 1609 6735 14730 13399 -1281 -14336 -11493 -6002 2226 12326 16288 -1024
15711 -1024 -6782 4587 17734 5087 13295 -1616 -10082 151 3088 -9312 -9539 -5004 97
15698 97 -981 -4088 -5913 -11735 -20930 -27779 -20501 -16955 -13921 -952 10154 13898 2352 3197 1741
15683 1741 -2002 128 -7622 -471 4811 3182 7739 16459 20620 25089 11995 12379 35274 23299
15669 23299 5914 -7281 -10744 -670 11465 9221 5243 6268 8153 10886 19191 13951 -6803
15656 -6803 -21563 -31274 -28133 -12252 -3827 -10044 -12272 2621 2980 -5023 -17 -3338 -18126 -26321
15642 -26321 -15044 -9429 -5084 -7318 -1940 -751 -4696 -1511 -1183 3591 -842 -2435 -1745 7526 -214
15627 -214 2916 861 -5445 -1943 -8171 -15861 -19995 -25970 -30689 -28911 -21745 -29071 -24188 -21726 -16095
15612 -16095 -19216 -13149 -14864 -6098 7495 2323 2697 203 -3473 -3208 -8376 215 -4530 6089
15598 6089 -5261 -18635 -11399 -2598 -3417 6545 8405 4181 1233 11125 11020 771 6315 -499
15584 -499 -5443 -12522 -4042 -19950 -10410 15599 15854 -12334 -11870 -9814 -8458 -6242 -4567 -14194 -17520
15569 -17520 -7076 -3065 -5189 2976 19785 29664 9742 -8961 -1921 3839 8752 12299 15133
15556 15133 9110 1008 1630 9984 17044 13534 18110 19535 23846 21019 23130 10577 -2012 -6586
15542 -6586 5958 6610 -4768 -12199 -13990 -3453 5156 8964 4960 1309 -6857 -22386 -14783 -5072
15528 -5072 11081 1048 9836 14427 26939 27497 10010 1689 -3660 3395 10142 8569 29392 43929
15514 43929 47973 47992 45705 57730 58352 75350 100166 150103 203242 263114 330305 398757 473827
15501 473827 539413 576860 596146 598592 573260 526546 463995 392629 317833 253246 212925 164510
15489 164510 129741 104879 83095 61390 50389 47463 51497 47847 47504 28284 31064 27407 21303
15476 21303 8648 1015 11487 20287 21483 9886 13240 11712 15326 16726 5040 2486 -6079
15463 -6079 -16767 -31343 -27873 -20240 -24175 -18115 287 10229 -667 2080 25902 31330 28139
15450 28139 21672 12554 8811 1807 292 141 10899 12781 13272 11909 7193 -6971 -1881 17412
15436 17412 36305 34967 18660 11069 11151 6837 9000 11272 2656 323 -564 1016 -582 3758 4838
15421 4838 -1208 4986 10025 5057 -5084 -3595 -550 22022 15919 12774 924 -11270 -12397 -2328
15407 -2328 4368 5958 7391 2970 -2210 -8037 243 10697 7313 9522 -7125 -8112 -3912 20181
15393 20181 25837 2640 -12564 -20348 -21951 -19363 -20121 -15802 -17801 -18264 -14555 -15957 -6505 2817
15379 2817 -2108 973 17924 15731 10960 16214 26498 29425 35047 48866 39597 18903 6597
15366 6597 -1805 -15782 -14893 0 9144 12119 18527 22955 31465 24592 23571 12031 -6981 -4832
15352 -4832 -7986 8503 19516 24303 26263 16048 7391 4924 -14266 -42428 -48762 -36504 -21433
15339 -21433 3964 7925 4078 -3912 -6454 -25305 -28535 -35866 -34350 -32478 -16632 -11479 -26722
15326 -26722 -41390 -48431 -39037 -38625 -41703 -27298 573 11136 -288 -3583 631 14014 13540
15313 13540 19621 4497 -15749 -17715 -13705 5592 7873 1473 -9147 -7507 -15304 -16269 1547
15300 1547 3225 -12420 -11186 -19855 -24201 -5873 16736 44827 33095 -1069 -15394 -1088 2975
15287 2975 2411 -20502 -10266 -1052 5288 13539 5227 2753 -2510 -5070 -5500 -16104 -18463 -15014
15273 -15014 -17921 -6861 -8764 -3524 24075 36355 17764 13865 16574 9447 13330 6283 -1423
15260 -1423 8114 4069 -129 -10594 -4686 517 5567 -1089 4905 7636 9835 2015 -474 16809
15246 16809 25382 14893 4865 -3228 3066 8062 11561 3260 -9275 -19289 -10103 4391 15681
15233 15681 9124 -13939 -14644 -19790 -22253 -18511 -18649 -11961 -3441 -4026 -17246 -18718 -29428 -20890
15219 -20890 -13929 -15256 -19700 -15896 -3180 -1965 4977 -2654 -7001 -11954 6041 14804 -7925 -23773
15205 -23773 -15676 -11996 -16531 -20965 -11795 -1662 -2021 -13477 -15361 -25092 -22164 -11078 -12026 -9080
15191 -9080 -14991 -7601 -4984 -10800 -12591 -23836 -23743 -14534 -6368 -782 -14121 -28160 -23538 -19291
15177 -19291 1720 7645 4013 2834 -1607 7208 9308 -3690 -6379 -7973 -11747 -21196 -15458 -219
15163 -219 -2135 -9304 2943 10588 8823 46 2530 -297 -5183 -14627 -17273 -14816 -15007 -13171 -4690
15148 -4690 1247 -6336 -16337 -2563 4834 12964 10598 -6715 -12773 6047 20807 -9988 -8650
15135 -8650 -13295 -20436 -27662 -15762 1823 13116 17892 32755 32754 20910 9416 2501 -6099 -6685
15121 -6685 -12390 -2233 17221 11719 9244 6659 -16589 -35193 -36625 -18996 -8389 -9321 -5678
15108 -5678 -4304 -9649 386 11258 598 -13468 -8837 2961 -4104 -5889 1552 7447 -5495
15095 -5495 -6915 893 7549 -1825 6769 17904 21404 27844 41035 30271 3846 6990 6606 18771
15081 18771 21988 7966 8938 12507 2869 -3426 -8219 3034 9012 20641 5899 -202 -835 -181
15067 -181 -10302 -13930 -6563 -9956 -15257 -18499 -16444 -10583 -7037 4730 -3053 -13057 -22076 -20685
15053 -20685 -7293 -2863 -1582 -2291 6988 1623 3577 11564 9022 8210 8803 7067 -12197 -5297 -1998
15038 -1998 12005 19449 10943 9952 -2136 -12862 -17423 -20094 -12380 8168 -4258 -6734 9325
15025 9325 9815 5174 13773 10054 1759 3635 -9149 -12523 1905 1229 -16482 -19667 -32149 -38614
15011 -38614 -30305 -19306 -11423 -5706 -6991 -14436 1528 4127 -8833 -3208 1 -14441 -24162
14998 -24162 -23423 -16141 -13578 -9705 -4441 -7755 -5008 -10065 -25620 -14769 -313 17593 31342
14985 31342 7476 -150 -1948 2131 -6964 -14560 -15399 -22749 -10407 11678 9742 -3896 -5695 -1359
14971 -1359 -17543 -13232 -13135 254 -4312 -18726 -18137 -3101 -6236 -27261 -18720 -6880 -5832 -6277
14957 -6277 31 2203 15366 11596 11827 19200 26640 15540 19148 2327 -8395 -6451 -14075 -8416
14943 -8416 3014 -2065 -3716 -14841 -16250 -4230 11489 8754 4441 2186 -4656 -5065 4051 3601
14929 3601 6969 4414 10052 12803 -2767 -20922 -30293 -15867 -6697 -10126 -12120 -4015 -120 -6634
14915 -6634 -8413 -4761 -3275 4243 5058 -7154 -9423 -16326 -17739 -10760 -11457 -14630 -12916 -2536 3317
14900 3317 -99 1997 -6674 -6297 -1707 -4813 2967 10798 29374 40111 22218 6851 5317 5397
14886 5397 -1377 -13756 -9785 6253 549 -1400 6985 8673 -14212 -13038 -3319 4185 8601 11312
14872 11312 7856 6050 -13240 -25897 -28061 -27961 -25179 -7593 -12013 -36019 -37633 -26233 -10354
14859 -10354 -14072 -21353 -6231 -8877 -22457 -36772 -24872 -22058 -10322 6735 6107 6229 5390 -11041
14845 -11041 -4871 12646 22960 16251 9319 9959 14390 18271 6863 -3343 -7356 -8166 -9713 -13762
14831 -13762 -19134 -19253 -18579 -10279 -5205 -10157 -4434 9196 9571 -2237 -12191 -23426 -6072 -5374
14817 -5374 -9975 -10766 -10619 656 5563 10964 16723 16699 8210 -7997 -2887 7683 14422 20862 27151
14802 27151 35781 22863 15628 21456 23590 5705 -7409 -10385 10947 15121 12882 7436 -2627
14789 -2627 -3198 -15713 -29695 -28837 -3959 -3347 -1277 19127 17172 3262 5549 3845 -10078 -13881
14775 -13881 -10047 233 11918 7585 -6214 -6008 -1687 8218 15390 -34 -13178 -5818 8501
14762 8501 7468 -5184 -1019 2134 2017 -12159 -7247 -12119 -107 23264 28238 29421 25614 15113
14748 15113 -1927 -10045 -20737 -33642 -21469 -10453 -2647 9775 12555 13543 437 -2091 -18090
14735 -18090 -25089 -18177 7582 7931 -3253 -8540 -9842 8796 19599 -448 -8526 -12616 -20144
14722 -20144 -12720 5871 606 -7440 2397 6012 12112 7389 1665 -681 -4838 -9977 -4292 -1232
14708 -1232 -8705 -7464 -1188 -5072 -8820 3029 17013 16700 10364 12494 9586 8274 5639 8198
14694 8198 24402 28573 18812 12365 11959 22700 14018 1063 -5132 -16948 -6674 7686 15379
14681 15379 10884 -14878 -12644 -1249 -2620 1478 3262 -7653 -9746 2294 4719 -5289 -16439
14668 -16439 -9268 2375 16654 24124 13775 12585 4209 -16187 -12417 -3842 -5118 -17263 -26852
14655 -26852 -26333 -36979 -23020 -20302 -29389 -35173 -24765 -24263 -1217 3165 -698 3847 12421 10318
14641 10318 10336 17230 12752 3927 5993 -9851 -17566 -28088 -29577 -25266 -20391 -5577 -2587 -14005
14627 -14005 -14509 -9405 -5380 -4469 4564 5355 -561 -17710 -30457 -32456 -30773 -26929 -24286 -15027 -16079
14612 -16079 -23682 -30315 -19000 -23287 -15315 -4198 -11542 -8292 -9735 -12974 -4464 11090 18545 18698
14598 18698 -11525 -1826 5793 -6251 -10566 -19149 -7682 1118 -3795 -12679 -6305 -5268 -82 -1793
14584 -1793 5461 7501 1545 5979 3889 -11282 -7847 -10186 -15056 -7997 4012 14724 15601 17720
14570 17720 20877 13977 6769 1016 -2344 535 -1405 -14729 -33549 -24535 -5167 4686 1506 -5209
14556 -5209 -5156 -1335 13438 16665 20177 14431 -10558 -25551 -13931 -1365 -2229 550 10782 3386
14542 3386 6699 23392 26094 30916 17488 831 5731 19425 29885 17927 14115 5346 6010
14529 6010 8969 8229 -11 3741 6670 11857 3014 3443 23495 31643 31095 29993 19510 19190 39869
14514 39869 30031 19655 8606 -1995 9482 10957 624 -3280 6250 22393 12581 13719 10113
14501 10113 22612 30895 23848 16171 9937 20288 21127 16807 -2578 2231 55 -1148 -2441 -5192
14487 -5192 396 3534 4473 1582 8290 6348 8778 12456 155 -1043 -6783 -11587 -14046 -10382 -10812
14472 -10812 9279 25163 21104 8369 13160 4790 -13418 -9062 -6460 2383 8678 22056 27382
14459 27382 34904 39546 17943 4723 11928 -5887 -932 5730 27518 29418 5194 4772 10818
14446 10818 4007 3560 10701 26207 33061 21529 21725 15554 22434 15667 14292 19052 7288 -11386
14432 -11386 -22671 -30901 -32595 -9639 9025 14504 24210 34445 12740 -1129 -1166 2464 10113
14419 10113 13421 10112 3363 13981 13468 10255 19316 12982 13653 6967 7211 433 1942 15732 12321
14404 12321 3990 13819 26232 15716 8120 13033 8326 -6993 -28402 -15688 -8856 -5078 3810
14391 3810 4295 -4778 -340 6652 13141 8104 5505 4549 -3045 -27854 -47760 -34325 -13590 11329
14377 11329 13613 380 -4223 -6513 -4079 -618 827 -21592 -9954 -5001 -10969 -19132 -20028 -13947
14363 -13947 -4465 -6277 -16000 -15385 -10360 8596 26836 27888 16284 3673 5392 4777 -744 -5310
14349 -5310 -10435 -8153 3648 -611 -14973 -25040 -9415 9075 14166 3533 4720 14224 9639
14336 9639 26989 24852 6220 16777 11947 -6704 -16008 -19566 -11075 -5828 375 -2365 -17707
14323 -17707 -25363 -8517 2993 -6708 -8395 2466 2049 10801 6853 -7514 -6579 3337 5427 -12268
14309 -12268 -6224 4720 4913 10078 14065 17510 18493 17212 15930 17474 17595 13417 7221 -915 -448
14294 -448 -11757 -18550 -6075 -4124 -14861 -14862 -12377 -4741 -7661 -7472 -7644 833 7239 15385 16470
14279 16470 10563 395 -12813 -5327 9867 11847 15025 9715 1243 -2490 7314 13924 16483 15626
14265 15626 18865 28600 18959 21022 37019 63092 46328 28966 14994 751 -1892 -3979 5553
14252 5553 27611 22488 6247 7112 -5480 -9473 15937 33066 23215 13530 2741 10021 20510
14239 20510 10332 10807 16870 18758 26943 24621 20769 33831 35066 30946 12873 5015 20986 25220
14225 25220 22408 28582 27853 18268 11238 10652 25738 35870 26755 21395 16372 12361 2202 -13320
14211 -13320 -17847 4808 7573 -4895 -23611 -29810 -20707 -1730 18910 28815 19537 16792 16947
14198 16947 10478 2566 -210 -15210 -17306 -14631 -9022 -3219 -3637 -22394 -20060 -8961 926 11920
14184 11920 2700 -1133 21570 33577 24579 14856 9595 13628 15345 -205 -12578 -6763 2764
14171 2764 664 3440 -3948 -2481 -6952 495 -6686 -9464 2307 12202 6834 645 -18087 -10964
14157 -10964 1725 13342 21543 21209 13955 6892 24125 27230 19575 17678 13850 13002 4042 -828
14143 -828 -10829 -12769 -9309 -9575 -7450 8858 10224 3331 4750 10810 14647 9596 15455 12226 10255
14128 10255 10998 5346 -13167 -255 7478 4187 -1487 -5764 -6599 -3147 4256 21123 9307 -7387
14114 -7387 -2822 -1923 -5882 5636 9865 5573 7622 9299 13128 21579 19948 6906 -2561 -12777
14100 -12777 417 1572 3919 -2664 6237 11040 -4010 -15093 5603 7014 15622 26720 5753
14087 5753 -11642 -3138 -4194 -9780 10081 23421 3380 -6220 -8526 -962 1441 -1148 4203 14670
14073 14670 9323 -7067 -4556 -6989 -9147 -817 7288 18160 22069 19260 6997 3339 20333
14060 20333 16573 5855 3210 -4103 4344 16780 16256 13457 5242 6606 8879 4739 -21027 -25159
14046 -25159 -7403 5873 -1289 -217 8884 9406 9067 10787 13635 2795 2428 -5669 -16385 -21374
14032 -21374 -18312 -17101 -16774 -10580 2627 4081 3348 6924 7679 20235 29507 32959 11897 13164
14018 13164 9876 -1091 -3721 10191 10999 1150 -3217 11110 27321 30715 22851 16007 17797 15053
14004 15053 14013 10665 6521 6974 -5267 -370 -10736 -8806 13779 11536 -5591 -8113 -3490 10459
13990 10459 7722 21386 27047 28882 15842 6851 10094 2902 3577 208 -1759 1423 1492 12366
13976 12366 10294 10119 24096 19475 5697 3321 647 -8066 -4557 15472 15052 10436 10340 19124 6218
13961 6218 7930 17686 16346 -2981 -10018 4934 12644 12503 20194 17315 8421 5023 9843 -946
13947 -946 -7574 -12676 -7478 373 15298 18347 16476 23225 24331 6942 -6027 329 17146 12829
13933 12829 12511 10610 4959 11236 15714 9228 5016 7710 10133 -588 9930 16207 7486 15227
13919 15227 19333 -5126 -25157 -19442 -22930 -19281 -7567 619 16887 30236 15513 -191 9613
13906 9613 -1183 -18387 -14698 5713 16436 19224 13312 4503 -5107 -11366 -1561 1510 5731 15358
13892 15358 13850 15200 8958 16368 30288 21449 21705 6609 -12797 -16212 -7411 -10805 -5800 12200
13878 12200 33526 41117 31111 17031 6281 9993 11715 19944 16575 339 -4604 4929 19703
13865 19703 15642 21768 27718 24231 21266 18326 21173 11041 -1103 -1187 2547 -4153 -10119 17
13851 17 15466 23379 21721 18091 18783 19159 3332 -8493 -14196 -311 -1085 6874 21459 21992 15637
13836 15637 14856 4810 6457 7775 -4762 -15072 -11943 -1343 -10485 -12761 -10561 15974 32631
13823 32631 25092 11281 10913 16880 18621 26770 25297 16651 5895 12790 9160 421 5240 11047
13809 11047 17781 18917 17443 14046 7343 13759 26851 35807 12284 584 -653 10288 27177
13796 27177 21359 18595 15018 17323 23668 11320 13634 34701 45533 45013 40126 36927 20350 5932
13782 5932 1450 -3225 -6307 -4047 10158 4361 762 5803 14906 1882 -17824 -3044 6162 3056
13768 3056 -8295 4247 22782 16631 8998 5645 58 7858 14277 7611 7774 18885 17472 9989
13754 9989 2642 -771 1208 -13021 -15428 4233 14238 4291 4122 -1788 -14295 -13342 -14453 -13460
13740 -13460 -6537 432 2219 13650 14761 15147 13242 19546 30049 31064 23519 22223 4193 -20422
13726 -20422 -26707 -19980 -12948 -8755 7554 7753 -2981 -6121 8333 8180 506 9986 5836 4530
13712 4530 14419 10914 22673 22055 18156 19382 16622 15266 311 2243 16222 21025 35026 23463
13698 23463 10913 6828 4357 6332 28448 33999 25557 8928 -2446 3977 19179 14318 24894
13685 24894 36892 25982 22477 28911 45891 55113 45919 22920 10493 12576 15227 12449 20727
13672 20727 16554 11306 4833 15303 14416 5435 -2245 13507 27344 22380 9872 8388 20185
13659 20185 23568 33049 14444 1930 13075 16142 31607 28629 20166 13323 20320 26109 26663 18417
13645 18417 13548 14638 17826 8757 15967 16980 17600 14484 11905 4408 -3956 4844 8137 11530 25207
13630 25207 31278 26795 37550 50597 50153 29387 13949 14058 20780 15054 8819 3794 7331 -2629
13616 -2629 10262 25122 19215 17177 6242 -4783 8065 15018 14914 17775 18532 16281 -2357 -7691
13602 -7691 3984 12295 24721 43436 46496 45160 51069 48631 27443 24821 18076 18365 32052 46212
13588 46212 34230 31130 27841 16627 25181 28629 26367 23811 17974 26217 39867 43330 33082
13575 33082 24268 18921 7397 9944 5902 7578 21048 39447 44762 21903 13734 11609 18107
13562 18107 21465 11103 15386 12170 8937 17254 24895 24576 6711 7660 25441 36473 34578 27626
13548 27626 32490 42105 41150 19921 13328 20892 17263 9141 8158 2480 -1192 -4642 -6412 -7422 -1871
13533 -1871 5752 10233 19939 24874 28111 21625 12774 29633 14686 8914 15046 15542 18703 25620
13519 25620 25411 29031 34819 23239 13613 12247 13015 5261 10483 23708 28526 20763 14825 24893
13505 24893 31843 22490 13806 9808 6747 15414 14073 8043 16160 13484 10114 22136 25855 35517
13491 35517 23966 11724 7944 -16673 -22524 -7005 10866 18710 18370 9835 2887 -1699 345
13478 345 2781 2097 -3256 -2218 9010 17153 9753 8902 8082 23209 25436 31355 46855 23466 18611
13463 18611 10953 10330 22155 11919 -3255 -15171 -10520 5533 11279 7733 4917 13367 12318
13450 12318 30668 27498 28601 36091 33031 23473 16404 11167 16423 28443 28744 30753 30748 23966 26845
13435 26845 22442 24689 21333 11891 16764 37010 42820 30399 18831 17742 17297 16821 5949 12676
13421 12676 9721 6504 10186 12511 24795 39609 35741 24180 32807 23685 27016 23564 24098 24949
13407 24949 11367 18006 23324 17525 17126 15799 10925 15830 16597 19093 18837 18534 25938 16826 24666
13392 24666 39069 48993 41748 28390 22352 28465 24673 18901 20206 21210 34809 45399 42253
13379 42253 34389 23476 18939 15252 17468 15888 24381 18977 26575 28661 14035 7970 31149 34962
13365 34962 20914 7941 6816 6566 19581 21733 13768 4718 5554 12163 13271 13689 24451 24532 13611
13350 13611 6179 10618 10644 15478 20527 30688 31521 20864 10297 3355 6282 -965 706 -24 991
13335 991 11822 24190 32583 38668 35049 18146 27521 29096 36700 42412 39456 40418 43606 35821
13321 35821 29910 17550 16692 27151 21568 22056 29065 39821 37706 25816 18917 18001 11759 20344
13307 20344 24586 24965 39306 48009 54831 57675 51644 37854 13225 -6033 3179 16158 34244
13294 34244 43276 41032 26169 8179 8859 20781 37306 29265 23014 32011 37256 39883 37427 32246
13280 32246 42136 34607 10294 12823 20101 24229 18695 13593 21087 25695 12052 15079 17007 16921
13266 16921 9095 12996 11613 17763 14291 19386 25530 18241 26079 40839 36746 26639 28585 28775
13252 28775 26795 9887 3334 -7017 -1989 21609 24862 23509 23708 24314 20781 21986 41085 59451
13238 59451 61117 56479 51758 47953 49432 62664 47850 37388 33381 20789 22726 30073 33501
13225 33501 28276 39912 35276 26983 35395 49740 35669 24687 17286 15412 28310 27564 21045
13212 21045 20710 30042 33233 44459 49009 42842 38949 29139 15909 8003 15822 22522 23112 27901
13198 27901 33945 33595 24147 32591 31465 35717 42222 34261 11028 7071 15553 27299 24968 21411
13184 21411 25486 35474 40426 47840 33391 31360 25712 11779 24455 33089 32652 30419 23563 32092
13170 32092 19880 20427 35331 40683 35898 22824 40355 50385 57569 67521 66766 54067 63863
13157 63863 56824 36629 40556 32704 32550 56160 57377 51261 49376 60349 46697 37517 39743 44801
13143 44801 46474 50728 49489 63167 50332 38924 32084 43044 37373 33681 23104 31094 55960
13130 55960 60442 58731 54081 69083 64862 63886 76601 77185 69340 58310 67500 73414 60442 55594
13116 55594 65948 78498 87038 79863 67774 59874 53164 45388 49436 39007 38522 48748 66163
13103 66163 69828 71041 62254 53321 49399 54443 62994 65741 54858 51424 63574 58113 57790 72825
13089 72825 78427 88514 92289 104313 119093 120999 115993 125087 150343 176191 200870 230828 290665
13076 290665 355638 434836 544328 673805 783273 887774 1039060 1247474 1433530 1522370
13066 1522370 1504656 1459111 1487663 1537489 1511950 1368626 1177077 989863 877005 777554
13056 777554 657343 517917 404949 324224 286887 256961 229391 190655 164694 140049 132476
13045 132476 128513 118495 114385 112099 103042 85767 73153 74480 85596 84093 79982 83937 81526
13032 81526 72154 77101 84805 69959 55929 51761 52870 51747 72717 71027 52768 35312 38181
13019 38181 44893 51673 57305 64537 65491 62498 63666 71782 66478 48351 33919 33838 47201 49007
13005 49007 50049 54623 69573 82498 86575 78407 62564 56071 61528 70045 81139 69452 72177
12992 72177 76067 88155 101353 96861 75094 65074 47416 46025 42869 38513 43385 46050 47528
12979 47528 53179 51970 57403 69286 62939 50183 42094 52860 68385 75649 83741 71324 52142
12966 52142 60565 55622 45761 42785 49457 55515 54847 44773 59312 64959 54402 59383 85435 83725
12952 83725 84677 82353 81347 78959 69018 59267 62181 46377 41052 41435 24290 12185 -1228 -2989
12938 -2989 9052 -4731 -12336 -2119 -5840 -19351 -22251 -34210 -24492 -13477 -6737 -14061 -11358
12925 -11358 10629 38269 57756 59731 64446 65383 79845 74831 69605 74240 76990 80098 98048
12912 98048 103268 108390 99487 95501 90043 107613 113326 108375 104362 104738 93954 86110 72732 74814
12898 74814 95120 96275 99756 97836 90274 86680 88275 97767 111050 125595 148080 157211 148118
12885 148118 168417 190423 196585 197030 218350 247854 280075 292230 288569 311797 339494 352303
12873 352303 346342 322863 296334 292551 286081 279312 242055 216237 202503 180854 171906 155886
12861 155886 144420 147505 153543 143121 140469 149329 158323 138009 139819 140613 138167 120031 119258 128063
12847 128063 129580 141649 132610 122341 132858 139196 136661 136341 140481 152171 148617 140113 134752
12834 134752 134490 144111 143319 150974 162394 153246 145233 142379 152397 147994 157803 162959 175728 168372
12820 168372 159611 151425 148377 144357 137614 138014 137140 154313 159890 168128 182158 195049 203633 210311
12806 210311 220111 224407 228459 245329 257904 266072 275417 284776 290920 287012 266255 259376 252469
12793 252469 258854 274553 276258 276334 258791 254336 274478 292346 286511 273303 261478 265527 272118
12780 272118 288628 288499 289421 291511 303571 308360 335691 351965 342490 342365 360590 380459 397670
12767 397670 399703 412419 434293 459827 472725 492485 523704 571681 617063 678748 750894 831422
12755 831422 915191 981417 1053174 1126507 1205334 1255836 1257946 1213448 1131201 1067236 1044985 1005333
12743 1005333 924897 793718 670938 591511 539817 490804 440836 381232 360361 342982 325946
12732 325946 318036 328561 329648 334971 351609 365425 379395 395072 408443 399410 374712 379736
12720 379736 377323 371800 379961 400255 427787 430545 424411 440231 445140 456318 477477 491676 487536
12707 487536 478333 490413 515925 542306 561912 564806 574728 590346 596382 615871 644285 667815
12695 667815 683256 691089 712429 740755 761097 774001 801302 826201 847204 887065 923459 935032
12683 935032 952594 979047 1007370 1026263 1056500 1087941 1125073 1171758 1230152 1279932 1350419
12672 1350419 1412230 1455363 1514048 1578168 1633870 1702186 1793846 1868783 1937259 2025980 2111271
12661 2111271 2216935 2333288 2466992 2615742 2788809 2975225 3186269 3411096 3649477
12652 3649477 3921552 4212321 4554818 4940673 5360154 5839298 6387974 7010098 7718521
12643 7718521 8530372 9491811 10646078 12030587 13709376 15792099 18439911 21826479
12635 21826479 26084290 31517209 38701963 48539902 62304845 81085400 104258202 127799108
12627 127799108 148697637 170426591 199141361 236629691 268714748 278942826 273787348
12620 273787348 267599577 272603761 280912914 270386276 240788933 204026096 172974153
12613 172974153 151996044 132800216 110893718 88024520 67536132 52055824 41228683
12606 41228683 33580497 27952259 23673797 20304156 17583549 15358865 13540974 12060554
12598 12060554 10821064 9736326 8814643 8037356 7357959 6752202 6212558 5731030 5281636
12589 5281636 4893912 4559463 4276067 4005326 3748111 3519605 3319272 3129213 2953170
12580 2953170 2792482 2639479 2485102 2344936 2216640 2080180 1975797 1878760 1800809 1730298
12570 1730298 1655755 1576686 1510869 1457257 1403800 1356747 1315846 1248628 1186846 1149471 1109630
12559 1109630 1079356 1067497 1041383 993784 962693 923697 887070 853180 834771 801883 773102
12548 773102 738779 723834 711691 697321 681614 659671 634560 628426 619585 597066 569342 556531
12536 556531 546587 530087 515075 517753 508970 490387 472403 468992 469449 460105 461193 453258 447521
12523 447521 446290 435629 416499 393683 386315 389752 375813 369525 375040 357364 348845 357183 367117
12510 367117 375548 371218 365510 364192 377138 380628 385934 365293 330938 294328 252930 205719 156673
12497 156673 88291 -9997 -87130 -155258 -201560 -244530 -307618 -374954 -383342 -360417 -313683 -291816
12485 -291816 -273007 -238992 -199024 -158723 -123726 -83366 -58894 -55489 -54739 -40753 -31265 -17754
12473 -17754 -7735 5102 16733 16520 908 -14151 -3227 30257 49732 45534 28274 11287
12461 11287 11126 21589 16669 10498 17457 20077 29807 25037 -5007 -15059 -5185 -3783 -12829 -14605
12447 -14605 -10395 -7907 -16596 -6408 -4058 -22415 -18448 -20544 -30067 -24252 4483 18619 18093 12644
12433 12644 23009 35206 54051 69476 73615 85936 77123 70162 81935 88599 82295 77872 56910
12420 56910 58504 56154 33908 34412 37685 44480 40519 30693 26859 31797 44048 35475 38860 48794
12406 48794 65224 68482 65773 55724 50141 48893 52978 58320 50938 50896 57098 44687 37397 46444
12392 46444 51998 36308 24165 29179 41954 42380 43787 38646 35620 17538 20542 14506 20429 23256
12378 23256 35003 40177 31055 34009 54276 64555 64993 67524 79257 87382 81488 76990 71443 70793
12364 70793 57738 44221 44019 50231 45892 36035 32443 27344 22142 33358 42076 17495 5012
12351 5012 9446 21618 44945 43762 29089 22373 17826 27547 33108 36641 23684 13080 2539
12338 2539 -4556 -5174 1227 -8831 -21900 -16209 -3786 13979 8366 -2469 -8159 -6908 359 12650
12324 12650 17604 32615 40141 46395 54824 83953 82409 71473 71403 79376 112895 131758 110475
12311 110475 96574 94464 126145 141052 134093 111334 102907 104886 99100 96394 93439 74360 67447
12298 67447 84278 94476 78426 68756 65526 69725 52965 54080 60874 63370 46058 40204 48745
12285 48745 51022 44194 33822 46453 58083 50248 38409 35734 29112 10603 -3495 7322 14333
12272 14333 12791 17482 34903 28162 20675 13991 17025 21722 9294 6832 14297 29448 17940
12259 17940 1723 -10681 -4848 -1392 755 4982 6198 -37 -3859 -6270 5059 18693 14727
12246 14727 11530 4733 -13349 -4736 9758 19774 22506 17861 22303 28166 20077 18788 15629 4412
12232 4412 5419 -1337 6990 3692 11563 20496 15560 11265 27073 26736 20766 27507 27379 18761 5861
12217 5861 13812 26264 18111 -3126 3657 4989 6424 4280 -13435 -15372 -6638 -3870 -4445 -4298
12203 -4298 -11451 -2921 3091 9682 23450 24048 16768 22467 30297 29411 32207 42364 39265 43656 51852
12188 51852 64216 79630 97609 100892 101827 136724 173524 221622 251351 318712 419117 547327
12176 547327 661658 775141 905912 1065753 1257777 1425584 1497173 1485512 1465432 1485956
12166 1485956 1512616 1442404 1281960 1092129 918892 786415 685533 575151 447850 345580
12156 345580 255110 191009 149798 125837 111892 105416 93307 59700 50664 62588 46139 37075
12144 37075 40739 38760 39510 36831 40946 36601 27640 45047 45318 43914 41710 26508 25446 25754 25596
12129 25596 24237 14731 6772 4493 10885 16120 15088 18913 16866 15354 6648 3367 6268 3136
12115 3136 -5844 5317 12328 9661 7439 12836 22235 17127 14396 15573 5413 3161 -2807 -618
12101 -618 -9640 2769 4501 -279 1898 7014 27948 11590 11185 7602 8635 -6964 -5529 -7621
12087 -7621 4220 11961 10675 -7716 -14622 -9259 -15296 -12270 -4702 -12331 -15480 -12197 250 15114
12073 15114 13624 3861 -3733 -8177 -16714 -14430 -4764 9300 -2260 -19555 -11172 -8653 -2944 7634
12059 7634 -1248 -5046 5343 -1033 5936 13254 2799 2575 13018 9832 3709 -7417 -19675 -20066
12045 -20066 -29614 -28999 -18595 -2281 4380 -7391 -14257 -6856 -15268 -12290 -16226 -11436 -4696 7410
12031 7410 20882 22378 8991 -2985 -5120 3667 -2906 -15815 -18908 -37081 -30282 -19503 -15844
12018 -15844 -17861 -10665 -7972 -17849 -9923 -8852 -16415 -10708 -8377 -9885 4903 12927 6700 22359
12004 22359 14782 -18711 -15719 -10070 -25421 -15131 2211 6539 3412 1068 12833 14544 21120
11991 21120 21089 5414 -6372 -7565 -1693 12093 7412 -2829 -8673 -15799 -15995 -15427 -9833 -10055 -18199
11976 -18199 -5061 4203 3506 11719 15223 10984 10874 12160 9711 -834 -5369 -384 3255 4477
11962 4477 14547 16381 3177 -10085 -18659 -33959 -42844 -29463 -10 -2236 -11139 -23207 -27021
11949 -27021 -23386 -22349 -8992 5637 17283 27414 26010 14994 21392 34601 39476 24411 1839
11936 1839 256 -7204 -12754 -9116 -1254 -5489 -6588 -12955 -31947 -37565 -43071 -34557 -21901 -30140
11922 -30140 -18797 -17684 -13385 -14064 -4252 -6268 -2730 -15965 -25623 -16790 -19119 -16976 -20197 -15812
11908 -15812 -11994 -16512 -7611 5571 -367 -7479 -7020 4238 -2514 -17151 -12827 -6579 -15678 -15448
11894 -15448 -26730 -28683 -28399 -24445 -19112 -10202 -19082 -37109 -32391 -18526 -7253 -13641 -26150
11881 -26150 -23040 -15388 -24380 -27844 -34459 -38298 -28503 -17505 -14719 -18977 -17662 -11411 -9092 22
11867 22 -9777 -17547 -12436 -5297 -13386 -26394 -21172 -12439 -17220 -6383 -16845 -30712 -19567 -7721
11853 -7721 -11894 -24912 -14692 -2882 586 -9305 -12154 -3251 269 -9119 -18218 -19584 -23814 -34320
11839 -34320 -27108 -33169 -40252 -37260 -21918 -11671 -3928 2111 15744 24813 8690 -20212 -21385
11826 -21385 -7777 -5511 -15850 -21062 -14086 -7208 -830 -4227 -20249 -31155 -24003 -17595 -2432
11813 -2432 15467 12025 -4513 12838 13218 3601 482 -12702 360 -2067 2951 20852 6923
11800 6923 -2586 -15715 -13428 -8467 4877 9074 5798 6433 -7949 -34315 -25891 -4558 4113 970
11786 970 4902 -4519 -8614 -7226 1914 9502 17977 15204 7510 9303 9363 7308 10592 11109 13899 8217
11770 8217 -1314 397 679 -17690 -23829 -21353 -29132 -31724 -6900 -9745 -10870 -19675 -24864 -27273
11756 -27273 -18335 2433 9339 5626 -3006 -14178 -30750 -23238 -19310 -16703 -12045 -13834 -25221
11743 -25221 -29476 3075 2188 -4955 5626 3585 -10705 -18396 -17205 -21589 -21840 -8766 -10335 -18755
11729 -18755 -19282 -20967 -16319 -10539 -14998 -18653 -22477 -21300 -25188 -23295 -17715 -15844 -20449 -20237 -19412
11714 -19412 -21874 -28548 -19391 -11932 -13597 -14303 -16905 -12063 -6015 -2865 -23164 -48739 -50722 -28797
11700 -28797 -8217 4615 1306 -2104 -7700 -20749 -19143 -20995 -4398 6145 -352 -9424 -15415
11687 -15415 -22224 -37731 -45161 -26718 -17012 -21072 -24728 -22289 -24568 -7063 -1002 -13930 -35275
11674 -35275 -40903 -39140 -23627 -17120 -22612 -21896 -23431 -26083 -19020 -16887 -19687 -31391 -27987 -24141
11660 -24141 -33728 -40157 -35690 -9746 -3730 8552 18935 6085 -2099 -4475 -6274 -24262 -25272
11647 -25272 -15948 -14241 881 307 -9796 -6199 3045 12525 5373 -8032 -9647 -18087 -19713 -17285
11633 -17285 -13025 -6343 2047 15312 22283 5407 1665 3776 -15264 -25801 -20775 -16600 -5448
11620 -5448 4879 15328 21911 16151 6719 2988 1888 3925 -7514 -14300 -10979 -6210 -12644 -20671
11606 -20671 -7768 10245 13620 -1108 -19951 -27949 -17364 -5203 1626 -4369 -8294 -13258 -26604
11593 -26604 -35154 -37276 -28085 -16795 -11152 -12005 -28000 -17045 -12530 -18389 -13955 -6213 787 14941
11579 14941 21703 2815 -16659 -10471 -3211 4106 -536 -14049 -27204 -11495 -7384 -11111 -14026
11566 -14026 -5533 9261 974 -10713 -20741 -18362 -4816 -10788 -29786 -33402 -27354 -22171 -7252
11553 -7252 -107 3754 4369 -4739 -15738 -18547 -15987 -19933 -29631 -11625 -13061 -9874 -1646 -8596
11539 -8596 -18894 -23074 -20973 -9742 -8683 -6291 -4097 959 5018 8064 14684 16652 2060 686
11525 686 8081 19634 14339 893 -9818 -1402 3042 6316 -8790 -9057 -11615 -22789 -23230 -15294
11511 -15294 -24906 -16433 10307 12786 -276 -3667 1757 2343 4099 8369 314 -7586 -7325 -2907
11497 -2907 1172 -10209 -9934 -3776 95 -3119 -3509 3991 2573 -4360 -16 3474 19030 17481 6633
11482 6633 -3716 -13666 -9377 -1167 864 11705 15498 4327 -1718 -11429 -12155 -8637 -3075 -1419
11468 -1419 -5403 2999 2431 -74 -20536 -28797 -17182 -24237 -24998 -20659 -30623 -29679 -11947 -1016
11454 -1016 1398 -14192 -7665 -1816 -3765 -9681 -10029 -17265 -37771 -40637 -30414 -22518 -9917 986
11440 986 1496 6620 -9480 -21863 -14657 -20637 -13669 -4328 -8143 -9382 -1679 5546 -4258 -14922
11426 -14922 -14754 -20720 -38870 -38999 -15811 -21535 -35647 -13267 2757 9082 12138 14476 -1982
11413 -1982 -6685 -11787 -4147 -2369 -520 5262 112 10806 4005 6312 6077 13287 12540 -10369 -21026
11398 -21026 -23085 -8815 -6418 5060 -4716 -2614 4117 -1713 -6456 -8276 -8659 -9941 -4728 3845
11384 3845 12160 9191 11896 8746 182 -3458 -4979 974 11067 10782 10547 21940 33238 44406
11370 44406 28959 9002 -6641 -13476 -1163 1744 -7296 -10664 -5231 -11229 -17486 586 20593
11357 20593 24908 7101 -6058 -7886 -5943 -6562 -13729 -17728 -17072 -11113 -9224 -17102 -17407 -18086 -11668
11342 -11668 -8055 -15233 -32144 -39114 -38462 -30971 -18305 -12424 -5750 3064 -2 1231 9551 -3634
11328 -3634 2053 -545 -5330 -2180 -3170 -11938 -23144 -20232 -13596 228 -7869 -19031 -19000 -9852 -9265
11313 -9265 -16237 -15435 -12095 1591 -997 -18930 -25932 -17162 -9100 -6892 -2019 -8329 -11314 11568
11299 11568 15921 -13016 -23983 -35353 -34032 -18625 -21501 -25267 -23477 -26691 -30694 -38112 -21416
11286 -21416 -14323 -5935 8193 6021 -2327 1287 5226 -4293 -7187 -7299 -6093 -5932 -10750 -705
11272 -705 -595 8740 7645 -4756 -16594 -14274 -12329 -31219 -33714 -18267 -12302 -31239 -47160 -47904
11258 -47904 -43431 -26600 -18929 -18665 -24268 -22596 -9691 9396 15079 4350 133 -4931 -9283 -14811
11244 -14811 -20364 -4457 8181 11679 25046 16657 -9500 -8701 11250 6536 15387 11036 14599
11231 14599 5012 -14149 -12308 -4531 -17708 -13685 -5066 -7693 5348 7260 2459 5130 3967 -3638
11217 -3638 -14519 -8730 10208 18938 19895 20805 25100 15807 -6290 -20640 -6323 1130 -882 6365
11203 6365 11694 10240 18283 22071 1556 -12857 -17882 -7294 -793 -6089 -6299 132 614 -1745
11189 -1745 2076 -1396 -11671 -26333 -20791 -23645 -17617 -14217 -7937 -10843 -10150 -5353 -247 13924
11175 13924 2710 -7337 -9269 -11896 -21203 -25202 -13317 -20855 -26046 -5002 10463 7650 -4357
11162 -4357 -22863 -26339 -14111 -13187 -17278 -23628 -23967 -28134 -32511 -28497 -22389 -20248 -19961 -10260 -7227
11147 -7227 -14524 -7932 -9725 -20206 -19395 -7595 3251 4045 11815 25989 21055 5764 -1579 -5661
11133 -5661 -11229 -20860 -22187 -23125 -29064 -12875 -8158 -15462 -11792 -2639 -7603 -12105 -14441 -6601 -833
11118 -833 -7259 -19573 -21969 -19434 -8069 -154 -10238 -5811 -8185 -13317 -17623 -22046 -17908 -4602
11104 -4602 -4507 7436 -1040 -5795 -14597 -5398 -1326 -14425 -10269 -20238 -13392 -5661 -373 -2102 -16475
11089 -16475 -21364 -10836 -5616 -6334 -3127 4196 -17761 -15782 -8022 4403 10792 4967 -974 -16397
11075 -16397 -19293 -19358 -1428 -223 -12302 -23186 -24045 -18396 -30247 -29521 -13111 -13420 -6052 -12100
11061 -12100 -18983 -16047 -25303 -24627 -18986 -16920 -27937 -23312 -13795 -11636 -15959 -21734 -23128 -13075
11047 -13075 -16657 -15460 -1018 5181 -3122 -1462 12648 14768 18771 33309 25206 7927 -6218
11034 -6218 -9905 -6881 7226 13579 9428 2251 -1233 -18747 -30467 -32841 -18833 -17628 -36975
11021 -36975 -36546 -22628 -16877 -13697 -7954 -9498 -30365 -22754 -19354 -32182 -30352 -30257 -32012 -24019
11007 -24019 -10852 2203 13078 17318 20689 15707 867 -15536 -8753 -862 -10602 -12730 -11080
10994 -11080 2653 -2529 -6392 -9121 -21715 -17972 -5790 -4339 -22756 -22654 -23082 -22110 -14013 -12336
10980 -12336 -13174 -23771 -19051 -11402 -14298 -12567 -14678 -15132 -13980 -2698 3659 -3340 -645 13050
10966 13050 20016 10990 16198 18959 8524 49 -6865 -23374 -29366 -26397 -14457 -4060 -7851
10953 -7851 -8651 -4144 -11457 -14583 -7541 -3950 3043 9437 15549 6428 1264 -4301 -4620 17639 24631
10938 24631 12163 14799 10181 26525 22162 6534 -11994 -18172 -22858 -22435 -22530 -30799 -22313 -17871
10924 -17871 -16109 -19719 -9505 -18483 -21403 -33315 -29617 -11752 -6691 -16509 -26010 -32284 -19835
10911 -19835 -24138 -22903 -16288 -2761 237 6646 -9036 -7198 -5762 -8424 -14008 -3554 1711 -2343
10897 -2343 -7738 -11107 -16076 -16159 -10093 -5347 -30171 -44165 -45366 -23696 -12188 -10856 -11764 -13181
10883 -13181 -24917 -13453 -17884 -22175 -28489 -31486 -17880 -13131 -18521 -31336 -23342 -4577 113
10870 113 4283 -8480 -583 7789 15741 15250 9107 19635 19901 14684 16556 11989 2522 22934 25926
10855 25926 5935 905 4640 18327 6335 -3573 -9193 -11436 -16762 -10511 -16765 -14537 9232
10842 9232 7177 -7104 -2734 9298 11481 3824 -898 -2323 47 -1919 -5132 -6730 -6927 2358
10828 2358 19065 12625 -21141 -32123 -21953 -3316 3319 6974 8624 7934 11826 9348 9291 16594
10814 16594 21741 30798 27141 23879 16322 6402 7074 12664 7099 -2213 -1304 1894 -10405 -8512 -4471
10799 -4471 10337 25895 17144 10139 3576 -9969 -12530 -27878 -39635 -45385 -43046 -25292 -2832
10786 -2832 -2092 -15781 -12418 -13579 -15883 -9547 -5257 -12654 -8396 5266 17314 14486 -561 340
10772 340 1652 -5169 1749 9118 3469 1514 1570 13634 3883 -6176 -3113 -17788 -18551 -4947 14608
10757 14608 13872 -3244 -20464 -24204 -19460 -4107 -533 -11584 -7093 -17097 -29897 -16030 -5463
10744 -5463 -20301 -23645 -22310 9915 21475 7959 -9459 -16798 -20462 -13144 68 10447 24412
10731 24412 24098 9015 618 -2231 1780 -10692 -6094 -6005 -22288 -23951 -28692 -22230 -6629 1736
10717 1736 -5177 1192 -538 -10782 -11901 -15637 -17079 -14867 -33276 -26875 -22364 -17974 -13861 -11339
10703 -11339 -9637 2973 10946 12287 16096 23587 20442 10108 -5450 -18133 -10146 4781 5896
10690 5896 118 -11745 1658 -264 -10748 -10075 -1079 -4553 -8283 7121 18623 17134 19021 11884
10676 11884 12518 14954 8655 -1723 -9895 -3099 4866 9605 10720 3347 -10661 -17756 -7177 -4708
10662 -4708 -3233 10235 8230 3920 -10394 -27914 -37143 -42159 -30230 -19593 -17036 -14355 919
10649 919 11628 21798 20424 20956 25243 16687 9872 2768 -1878 4318 6453 4174 -12163 -16435
10635 -16435 -15869 -6465 4952 20000 24492 16633 4810 -8625 -15649 -19265 -19252 -25383 -21436 -33956
10621 -33956 -27282 -23516 -24018 -16009 -9496 132 10363 6233 6627 12488 16815 23944 29850 31616 23304
10606 23304 3484 2514 5394 -9288 -16555 -8863 -3261 7802 20056 11406 8378 8703 12039 4808
10592 4808 -22887 -25020 -26149 -26573 -23867 -17070 -30683 -37844 -28671 -21955 -14312 -8936 -10170 -2910
10578 -2910 2808 8549 2409 278 -5002 -1350 1714 12191 5996 -15027 -19923 -28842 -13403 14846
10564 14846 11230 -4837 -1864 -4877 -1988 -3868 -13964 -19072 -6321 4932 3707 -9181 -21298
10551 -21298 -7647 -11012 -15576 -9450 -6925 -5437 -9326 -13506 -15562 -26794 -34179 -32679 -17440 7437
10537 7437 -5369 -10021 -16721 -11527 -14040 -20508 460 6117 -4799 -7171 -4860 -13106 -16879 -27427
10523 -27427 -32209 -29155 -12548 7870 -2932 -19424 -17733 -8881 -11045 925 20036 14557 10372
10510 10372 3458 -689 7841 14198 2382 -15078 -10009 -7724 -1914 -7726 -9555 -11051 -6398 -9431
10496 -9431 -10006 -13768 -3657 1954 -8226 -13283 -10278 -6051 -1651 7059 5636 12511 14949 21717
10482 21717 19742 4189 3786 11732 17873 -2154 -17771 -21554 -23578 -36632 -44141 -27302 -13191
10469 -13191 -4522 2775 -393 7390 13978 7830 14803 7783 -10063 -21498 -14088 -4389 -2112 -4252
10455 -4252 1833 -968 6954 -7097 -10821 -4823 3231 -5322 -2760 4278 -14633 -16550 -23287 -14074
10441 -14074 -3908 -1490 4451 1993 3445 -5386 668 8000 11439 8287 11934 2845 -16779 -22818
10427 -22818 -9764 -12198 -16999 -2424 -3874 -8730 -13402 -14481 2830 1463 -4946 4032 -1827 -3561
10413 -3561 -15092 -17436 -24373 -10699 14981 23236 17091 18906 14465 17102 21007 24381 19611 16893
10399 16893 9899 245 -10127 -10389 -3205 -10315 1828 3142 -846 4899 8820 -2765 4166 846
10385 846 -6830 1562 -2156 4587 6382 2227 -5000 -10066 -2662 2826 -317 2443 7872 1629 8530
10370 8530 2257 3550 -3004 -691 11 9143 21295 17886 -976 -17043 -9925 -10219 2669 14862
10356 14862 16707 12926 -361 -7860 -5914 -6765 -10689 -12644 -20851 -23181 -13861 4870 3226 -1134
10342 -1134 65 -3740 -707 277 -601 2057 -1888 6027 -5706 -19937 -15534 -6580 -1966 -4651 -23500
10327 -23500 -8926 4176 -5329 -14433 -48 1980 -1921 -2400 11921 16658 -1585 -12294 1662
10314 1662 2253 -3612 -11698 -15912 -13248 -12905 -7649 4192 10254 6871 2854 9817 187 5805 11436
10299 11436 6250 6302 13604 19082 21366 25396 8060 -11701 -19120 -9465 -19200 -36327 -35541 -35177 -28207
10284 -28207 -31793 -6718 17735 13839 3482 9112 20027 12567 9261 16032 19962 25895 25352 14550
10270 14550 -3881 -15144 -12421 18856 19637 9635 2229 386 -2764 264 7232 1496 -9759
10257 -9759 -4392 -7904 -8316 -10051 -15170 -15821 -10279 4732 8786 6669 14365 20080 25032 28077 618
10242 618 -7258 -12039 -8896 -801 7234 8841 3439 -3447 1784 11163 4213 9852 13203 11094 18171
10227 18171 18407 13177 8528 5554 -2661 -6316 -3826 -398 3836 4287 3490 -4953 -5537 -10286 -12762
10212 -12762 -6887 -12713 -8129 -6532 -17478 -11685 -16676 9268 29570 20415 -7306 -26361 -24102
10199 -24102 -6558 19442 10703 4431 -6208 -9107 -14675 -13221 963 -379 2828 4816 -7164
10186 -7164 -17343 -19756 -8482 -7557 -449 3005 4392 10744 9609 -3496 -5546 8745 29047 37951
10172 37951 44800 28655 11613 5485 9235 6336 -1976 -7380 1831 7089 573 -741 9147 7307
10158 7307 -2547 -18730 -22899 -15113 -8352 8055 2527 -17684 -33177 -31096 -28483 -36926 -23256
10145 -23256 3724 5666 8686 5545 4425 15540 17190 20825 25745 20613 26329 24659 10286 -5665
10131 -5665 -6260 13265 7760 -8626 353 8686 5353 5735 21848 31779 26192 16662 20038 21028 15780
10116 15780 -471 -1562 -12653 -21138 -15978 -3706 -3778 -72 13360 2976 -1399 9591 20842
10103 20842 29186 23472 14317 24036 11681 4251 6399 -2469 -10102 3871 11032 1831 -905 7187
10089 7187 -1669 -1865 -6508 -5897 -11064 -14015 -1854 7757 20319 20810 18002 16946 15567 13009 27954
10074 27954 26826 15561 8428 20290 31868 22940 8125 208 6808 4184 397 6671 13471
10061 13471 17896 16826 20502 18504 9843 11805 22072 21849 25603 31161 21170 70 5713 10525
10047 10525 -683 -5294 9593 10249 4851 10234 12486 29085 44140 32677 11708 4155 4202 9631
10033 9631 8694 121 7984 13924 22929 28771 24912 13732 3137 -1502 14992 10457 -1765 -1320
10019 -1320 12345 10872 3861 8261 14543 21184 17458 19400 24041 26316 15501 12870 -3694 -13820
10005 -13820 -12981 1944 16196 16288 22586 31129 26952 15604 6638 13873 23245 29810 16709 5545
9991 5545 2418 6745 7477 6699 7768 2760 -7314 1744 4235 -2613 6210 -4808 -12363 -5539 8523
9976 8523 6656 12471 14543 -3506 -1692 8244 11666 -4754 -28645 -24925 -16498 -23302 -20552 -5993
9962 -5993 -812 -3560 3165 9537 8738 10922 22031 40098 32448 24176 18002 6528 -11369 1078
9948 1078 -13498 -23390 -12097 -6436 12387 10952 2319 2668 -11817 -31895 -30165 -25400 -1185 5435
9934 5435 10299 24272 33922 33930 31209 5356 -1372 9090 9049 9714 11388 10238 16084 9328 257 -25128
9918 -25128 -17844 -14382 -10577 9425 8216 7225 6673 -2183 -6985 -7698 873 10734 7205 -6983 -3828
9903 -3828 5145 14872 26602 36919 41272 26727 23586 10511 29984 56320 69777 56378 29569
9890 29569 9655 6999 12341 21035 27828 25478 11361 3404 9320 20463 17250 12471 8105 3637
9876 3637 5345 5654 -1505 -13907 -21971 -12064 -2325 2006 -6547 -4594 6221 7513 8303 4752 10877
9861 10877 1164 -8922 7240 7096 11311 17741 26176 27116 26119 3564 -12212 -3952 -7124 -8873
9847 -8873 -5598 15120 21386 28571 21440 25040 19509 5812 4456 12632 15679 5239 3460 5235
9833 5235 5083 -3878 -14679 -9588 17181 20790 24774 20232 6290 15992 11390 16706 12960 3706
9819 3706 9238 9388 -2875 -1315 14081 11957 14099 6972 16421 16140 14601 12013 8677 1354 -2353
9804 -2353 4123 1909 -2931 278 11057 8010 15413 20207 2711 -7898 -24268 -20785 -17033 -25083
9790 -25083 -24281 -9183 -10728 -5765 -18737 -10146 6545 6820 4173 9631 15326 -3782 1932 8149
9776 8149 10014 23679 35000 30785 20512 15079 14938 11032 19089 28484 6849 -24289 -31223 -25884
9762 -25884 -7472 2462 3069 6129 16398 17799 22722 20035 11998 11869 16050 26755 20801 16273
9748 16273 98 446 7254 7146 -1071 -4311 -5258 -14667 -11604 8551 13226 9683 15184 20465 6903
9733 6903 1903 11953 22603 14533 4449 7691 4343 6306 -4581 7836 14814 27376 42351
9720 42351 31228 23356 11884 -8718 -18681 -19740 -5399 6653 5483 735 -6098 10520 24771
9707 24771 31229 35392 28389 15386 9331 16261 17464 27170 17916 15573 7261 9905 19862 24044
9693 24044 19380 15210 14688 15947 17180 12405 3701 11401 7005 14012 13254 7708 -5394 -4910 996
9678 996 11698 18892 30075 40437 45269 31151 26376 38478 45381 33010 29691 32127 13675
9665 13675 10355 1680 4730 25543 29165 13450 10529 33457 49311 36369 18513 -1733 4189
9652 4189 27176 36425 26351 22662 31464 41816 39752 25599 16828 20820 23413 27476 35439 35734
9638 35734 35810 32039 29678 26466 32167 31768 31445 47310 56527 46729 27094 28135 22319 4296 5422
9623 5422 25017 45758 52975 46768 35483 21284 15466 4644 9702 10133 3922 13074 15220 18692
9609 18692 28288 27399 25875 25541 34358 34336 33894 30665 24112 23753 45426 51116 29992 14634 16491
9594 16491 28117 29221 27383 19687 9228 8805 21624 24348 17375 4921 -8364 -863 1007 6915
9580 6915 9172 17132 15484 5881 7943 23903 27998 31965 35028 37943 44261 40863 30656 24830
9566 24830 22951 20631 17066 11035 15178 27601 27292 21912 30518 50909 54463 36210 23283 10821
9552 10821 10810 13688 19451 20151 5358 11441 27082 39286 28688 19379 28189 39586 38632 44610
9538 44610 33516 14562 3793 3114 7663 21615 36253 23924 26977 35220 40445 31292 29803
9525 29803 33773 17994 1922 5450 19395 27796 30284 40386 31291 22179 25913 43186 48321
9512 48321 47802 37757 23881 45125 46909 33003 21846 20883 14779 31198 48686 42608 36028
9499 36028 37606 46921 67634 83220 66301 45380 30429 32758 29810 21192 26627 32990 41550
9486 41550 34824 33394 47611 58336 47833 38012 52057 48746 46665 40858 26034 25782 22387 27055
9472 27055 37719 42652 41498 26390 18960 17798 34504 59634 63946 44862 28263 11639 14044
9459 14044 21093 24357 35859 32462 16716 20343 7673 10147 13581 24873 41335 42027 43760 34385
9445 34385 35261 41945 46719 39786 23767 26109 40083 43330 30864 31879 25148 29259 37152 26321
9431 26321 21181 35928 36973 29528 33085 43249 36878 41163 47833 51592 56461 48837 48329 41777
9417 41777 54510 37079 33861 43996 36939 17827 19299 27681 21339 43403 55518 48676 36029
9404 36029 34468 24146 16986 19745 25061 32981 42179 45215 37084 48116 39819 29808 33797 42492
9390 42492 38692 35541 40904 40958 34638 49604 50104 40863 28076 25796 29019 37716 40282 41570 45011
9375 45011 36777 35887 31498 26364 13487 13338 15623 35573 60649 52925 57846 56191 51795 49788
9361 49788 58097 42097 34783 46494 55773 53762 62011 51290 29081 35387 42582 36297 33754 25999
9347 25999 26690 33971 49143 58649 43258 34472 31684 16659 -171 -1010 13615 28960 33954 35892
9333 35892 29471 20799 9267 3727 15475 32475 47663 54126 51446 26980 20324 25760 38602
9320 38602 49840 48730 32318 31484 39373 32317 31294 51640 48570 38949 33524 30132 31589 30964
9306 30964 25260 29379 35719 38646 39035 43317 51533 51455 57214 69147 60263 55239 54853 47507 44913
9291 44913 48775 55477 57651 59587 56429 61920 51227 44166 36426 35553 38836 42936 42100 29213 8402
9276 8402 9026 27350 43410 49718 49441 50245 49289 35672 27872 32654 55967 58672 32782 23183 37118
9261 37118 35237 43507 48354 47041 36580 14415 17474 29531 31001 35059 22366 17972 38473
9248 38473 52745 56603 52907 29586 16445 28063 31654 47193 55403 47163 35501 36577 42364
9235 42364 50151 32837 36552 49388 71580 66646 69516 76046 60472 37879 22284 25018 30453
9222 30453 38883 32975 31461 35488 53799 56938 45372 33065 47309 45118 42362 51369 52267 51202
9208 51202 59547 62789 50564 41771 47208 46955 33832 37955 40144 31258 39144 38583 42341 49732 50609
9193 50609 52963 55960 58181 46616 27229 33796 44075 40009 32715 41171 46447 56001 59282 66677
9179 66677 58295 47822 37282 50323 47538 38012 41267 55775 49227 34382 35915 50120 57468
9166 57468 48015 48141 52446 48028 64222 74628 71622 71970 72399 77551 69222 56672 47515 36004
9152 36004 30216 24632 12833 17909 22523 12473 4128 20761 32239 41713 30547 32663 40531
9139 40531 33189 15846 7494 36767 38848 35667 35923 42898 26672 23418 24670 24658 17709 21710 23568
9124 23568 35570 29642 27637 43811 53700 66687 71382 65048 51200 45115 28606 26138 39261
9111 39261 46577 43668 28976 25840 41287 43641 38117 45220 39336 36135 24590 24909 33558 42816
9097 42816 50020 42398 43629 45583 38640 41377 40848 49920 39273 45237 44306 33566 33576 25425 33656
9082 33656 29919 32837 49116 42980 39584 47069 48115 52098 46862 41091 57589 56470 45706 45069
9068 45069 49464 33138 24091 26339 26994 32574 31824 29696 28488 28011 45223 50088 38938 27404
9054 27404 19678 32831 51443 60769 64607 58037 43989 40010 29620 30106 31458 34454 32295 33479
9040 33479 41840 44266 33097 29823 50492 59413 53640 56721 56942 47916 43407 37881 39562 39235 41465
9025 41465 36700 31093 27615 37911 40035 49747 59170 53817 53779 45473 48219 58087 54151 47625 31951
9010 31951 37487 46636 32198 27355 32383 35342 33718 42174 40608 29322 28335 16272 16427 19865
8996 19865 24560 16912 30006 41552 41612 42825 51471 44681 27680 30764 41849 39213 34711 33278
8982 33278 22616 21691 32655 28966 33379 54313 54366 44570 38085 36646 37723 36304 25661 30165
8968 30165 23197 29036 43585 54765 37303 30188 41723 55743 59381 57744 56418 62024 51966
8955 51966 41336 48038 57242 42337 39701 42023 47384 42721 44994 53124 60674 49492 27121 25249
8941 25249 32049 45478 50907 35406 27513 41772 42429 45263 62761 54269 51599 49429 37144 46230
8927 46230 45657 33936 31904 25633 24343 13742 4504 12294 10821 13760 23566 18547 20301 22689
8913 22689 21267 16794 9406 13766 35406 31442 19534 29038 31861 27463 36172 37156 30229 12523
8899 12523 8424 7782 8686 21374 26693 32367 33499 33073 34661 27452 16705 4603 19757 30558
8885 30558 32331 27720 34581 41307 40705 21079 10934 23411 28424 25495 31226 43719 54311 47577
8871 47577 27091 35392 24820 15760 20254 26769 42061 54781 50658 41243 29340 31405 30899 35096
8857 35096 43862 41602 42993 42014 39660 39887 41104 31376 30076 31505 19741 1075 3859 23657
8843 23657 22517 28827 24620 25258 22457 31953 50301 63648 61691 58561 50934 45815 46450 48054 41877
8828 41877 33771 35553 38508 29108 24126 41426 44855 43066 39124 39162 51270 38772 31550 21914
8814 21914 14421 20216 22395 33119 26252 21060 20483 25201 24945 22250 18166 23691 25717 31151 41375
8799 41375 62346 49434 43068 40894 33816 33388 38416 48151 60200 60415 61961 46515 41816 37529
8785 37529 34939 41872 41141 46931 48538 40292 47523 58603 71499 70455 66816 54822 65236 62066
8771 62066 61789 50760 33973 37518 41936 43908 38919 40739 39935 38653 42716 30022 17023 18516
8757 18516 24402 15156 23371 24624 18599 25026 27951 38349 46161 49539 36293 29746 20058 11903
8743 11903 -4081 6602 26798 34466 46942 58770 60968 65521 57998 52694 51211 56821 74251
8730 74251 82975 67028 68238 87491 98001 98721 96324 96017 83532 73766 76837 83947 76636 55559
8716 55559 48399 48875 56986 51158 37962 34590 36722 44724 47293 46158 35654 37055 44645 55745
8702 55745 61572 56427 67191 61812 40780 45073 56787 63964 58967 47741 43953 42594 50923 53792
8688 53792 58735 70224 66458 61352 71168 74119 88399 91377 96851 75982 68576 85280 82319 68615
8674 68615 74224 83437 86370 89599 82375 65986 61534 65291 76094 80545 83393 74905 66979 62214
8660 62214 72547 84402 77562 77773 90198 98209 93807 97951 105123 99082 96277 105280 122660 119963
8646 119963 113466 106828 107576 113315 134034 143087 137107 139419 131849 137888 146383 150143 149580 144858 147851
8631 147851 165778 177834 181176 198103 224550 246667 251609 250426 254273 252665 266079 283869 302974
8618 302974 334199 374218 419420 451448 492835 528719 574937 628819 693322 779642 865308 965041
8606 965041 1084874 1218058 1365336 1556967 1768864 2013797 2325740 2723358 3165883 3711864
8596 3711864 4353602 5072506 5780256 6246225 6243156 5714056 4864164 3931598 3092691 2445643
8586 2445643 1981014 1613390 1325333 1111537 951488 823223 715780 635960 569394 503581
8576 503581 459454 408947 369364 336981 314239 283513 267724 253449 230682 206569 185376 168097
8564 168097 164248 159231 157224 148918 119351 109488 114617 138552 127448 114613 106462 110510 108361
8551 108361 99772 90515 83100 100888 98440 95328 95116 104330 93699 74479 67129 60813 55457 48276
8537 48276 43053 38222 47780 50150 47998 55135 48801 46289 46683 55577 63501 58488 50075 44510 45596
8522 45596 48533 39569 24815 26446 32311 40518 43200 41834 39984 47712 45656 46531 44564 54223 55965
8507 55965 42168 29475 20624 17670 18552 20199 22305 23829 9135 -3021 19396 25279 26446 19804
8493 19804 18433 10442 -10593 -12253 -15377 -28363 -18071 -2260 4358 3849 8116 6993 -7589 -10830
8479 -10830 -10115 -16180 -487 12504 -1525 -1458 20293 34907 37791 41128 28648 24622 39266 33627
8465 33627 19677 8929 -2334 -3009 2954 2668 9132 13655 18779 6336 7161 11834 10451 15572
8451 15572 16874 1827 -6067 13786 22212 24164 23705 17436 11615 16086 8386 -3396 -11780 321
8437 321 619 5449 25254 27049 10810 16480 13847 14472 12938 14161 11132 7394 15052 10492 14352
8422 14352 24572 15400 8856 16756 16267 14690 20835 16064 12734 2475 -448 -6439 -8037 -6880
8408 -6880 12180 37479 48052 40848 29740 16060 22847 31455 18630 5594 636 -5022 -9567
8395 -9567 -10403 4957 -4883 -8510 13763 11896 -6466 -7392 -6265 -9701 1528 12858 10287 7237
8381 7237 7710 16027 9702 1316 1188 7907 -12 6051 20572 11677 4459 6874 7155 17576 5832
8366 5832 2478 -89 -2964 6921 17620 12947 7259 12557 21143 24912 17568 5336 -162 -11317
8352 -11317 -12628 -3347 12446 16452 7728 10635 19140 12717 16262 23994 25787 21721 35592 28594
8338 28594 21631 29659 29253 24705 41567 43112 19477 -4342 2907 14619 -11409 -8719 -3277 1065
8324 1065 28222 29520 21308 23222 26432 29274 29838 28637 8887 14911 24445 24125 8023 -6853
8310 -6853 18286 36544 36736 18729 17108 22834 26271 28371 26358 13576 12225 12274 6279 3882 -597
8295 -597 -4018 558 1670 10443 15199 10834 8334 12501 8619 5971 25995 42202 46407 35413
8281 35413 18523 5637 -14714 -19963 -22270 -30461 -12115 10489 11320 8497 531 -2395 -8058 -19259
8267 -19259 -24401 -13217 4895 23178 23420 12312 8208 -5365 -3108 7054 -4920 -12497 -15189
8254 -15189 -2149 1309 -2396 -11699 -534 5021 2466 2328 7788 8187 6798 2869 -5239 -9299 -1123
8239 -1123 5612 -864 -6866 11682 13520 17279 30442 43212 39682 40811 20037 26494 22263 2059
8225 2059 -15683 -1295 4005 14505 19358 16331 19447 20036 11349 8629 4686 3761 5832 17981
8211 17981 20390 18780 8949 15121 11222 13641 17689 14235 9210 12439 537 -10882 -11236 -6550
8197 -6550 1552 -1348 -9113 -6445 11310 15427 4782 3741 14951 5129 -4932 -10831 -3352 8216
8183 8216 9110 937 4037 11673 6001 5076 17486 28501 27595 9644 12323 13236 7823 1983 -2997
8168 -2997 964 11874 14783 3831 -9200 -242 4877 20779 5551 -8183 -16707 -21873 -20078
8155 -20078 -13209 4770 4692 8187 6966 14557 19877 22920 20367 9358 7125 10255 683 -6668 -17239
8140 -17239 -1378 5268 2915 -5828 -3046 9140 27959 21299 4826 -142 357 10431 12870 6660
8126 6660 -3259 1756 6404 2516 -3018 7725 12544 -9704 -19414 -9405 338 -1210 2670 3933
8112 3933 12497 35022 47275 47454 37659 37472 35899 30590 32758 32089 40446 42871 34888 19580 2937
8097 2937 4805 26174 27943 26681 21513 17839 14279 19655 19652 22670 35260 35685 43275 46613 31746
8082 31746 13940 12840 16135 7950 5874 -4226 -9052 -15124 -30554 -23289 -9916 -3584 -7522 -11362
8068 -11362 -5974 3422 9944 13165 14477 12755 13842 17869 27413 23274 24269 18270 4688 9013 9536
8053 9536 11474 15452 32285 42263 50073 50441 54821 59845 63422 78205 86057 100598 120849 115126
8039 115126 118528 119776 112922 113003 113648 106438 102154 113883 99154 86851 76146 77548 65169 68346
8025 68346 68019 72076 70087 79738 89433 78271 68849 47176 37186 64321 86809 82091 76396 80715
8011 80715 91347 96670 99530 96845 113317 132119 157587 188356 217387 249221 292175 326797
7999 326797 331678 312415 272297 236341 206738 173704 138801 134092 135808 130502 115841 100774
7987 100774 80776 74012 81461 76866 66691 60186 55665 61636 60485 71073 67102 59339 49966 45990
7973 45990 47825 32810 32169 50727 66889 97411 96832 76465 76208 70197 58522 66006 74108 86314
7959 86314 89721 95661 107446 106244 102617 106537 103708 93223 102168 96072 84763 85323 73401 51696
7945 51696 64135 60635 32312 22471 10375 -3822 18163 22225 13353 11603 1043 5469 7255
7932 7255 4812 -2482 181 7085 11307 13851 8119 7976 4746 15266 21501 12206 11603 14828 25955
7917 25955 34021 28280 10403 7124 3994 6917 11096 18384 32374 42583 21231 11004 11839 -8652
7903 -8652 -19162 -18344 -10930 -8149 -6930 3831 6382 4007 -828 8171 19812 26090 21241 13693
7889 13693 23420 27734 6152 4515 -2366 -17635 -11605 -7208 10931 20318 23147 14860 4471 8224
7875 8224 12718 19188 20131 22599 33880 31671 30510 15344 11899 18649 20170 8199 10404 4900
7861 4900 8026 20759 26423 14955 -1367 -17431 -13725 9703 21630 19278 8977 2010 6616
7848 6616 8928 6338 -1358 -4297 -2184 361 6170 -3332 -8900 96 7207 984 3636 9472 21534
7833 21534 8404 -12352 -16178 -7934 -11983 -13072 -20541 -27110 -26696 -2929 8234 2680 -2384 -10732
7819 -10732 -22974 -31081 -23306 -22876 -22232 -26912 -17274 -13177 -11982 -14609 -23173 -4653 -2034 1660 4694
7804 4694 3351 4644 1037 -4616 -8323 -12317 -21177 -32946 -33265 -45405 -37660 -8149 -3700 -192
7790 -192 -2055 -3356 8367 7176 -7490 5638 9629 10887 1997 -10902 -11193 389 -4053 -18830
7776 -18830 -15181 -1053 393 -18026 -29738 -34736 -26289 -13571 -10179 300 3631 -6114 7159
7763 7159 10882 2969 -4128 -13196 -4421 7954 495 5601 17932 16462 7666 3938 10089 4259
7749 4259 6067 16572 8984 -7547 6548 27696 29542 14308 -4607 -6777 -12842 -9873 -10476 4660
7735 4660 5239 -5912 -20411 -19869 -938 4822 7889 5270 2197 -2782 -4240 -5339 -8774 -347 12745
7720 12745 3804 -20824 -22076 -17699 -2766 -5549 -10324 -2704 -2617 661 7857 -261 -18662 -21942
7706 -21942 -31318 -21440 -22733 -29426 -13759 -4833 -9262 -19361 -12362 -2630 -22019 -23201 -22481 -23128
7692 -23128 -17123 -2730 1013 9747 19251 16261 18931 10800 4505 13049 8035 6474 4074 -1593
7678 -1593 -7973 -3814 8745 19566 14333 7752 -4206 -7143 238 13996 14622 16917 5729 9501
7664 9501 -5086 -19349 1418 7249 2815 7488 3626 -2300 2250 4001 1293 3074 10303 6220
7650 6220 19166 25380 6862 6133 15527 13269 16197 558 -7710 -5759 -9222 -20215 -26608 -26174
7636 -26174 -16747 -10625 -11393 -14788 -16135 -16471 -2791 3832 22138 21182 14510 19112 -1806 -17937
7622 -17937 -16004 -24047 -17532 -1484 5174 -1787 -9522 -9995 -3939 -5435 -3888 -7518 -9053 -8462 2432
7607 2432 18705 28396 16236 -872 7071 19325 17120 15327 18970 6496 6540 4959 10538 3538
7593 3538 -12480 4450 -347 -16552 -30235 -27881 -24727 -16695 -6582 -808 -613 -4333 -4894 3135
7579 3135 -8570 2561 -1451 -2219 -2904 -608 6501 11356 16392 23926 20873 18015 13596 3691 -750
7564 -750 -17807 -33518 -34825 -20073 -10407 5439 2007 -1934 -5012 -19672 -18340 -8247 -16417 -11785
7550 -11785 2890 -6822 -11933 -9845 3839 13428 27585 35463 25668 15664 14681 9880 5381 -12111
7536 -12111 -23622 -21676 -15921 -7869 -9798 -11664 -8549 -6169 -16895 -36650 -49712 -35032 -28900
7523 -28900 -30185 -25664 -18008 -4185 6388 10171 14831 11973 3086 9304 12208 -3018 -13096 -5544
7509 -5544 -5065 820 2866 -9324 -20852 -23787 -13586 -17005 -22142 -20316 -22201 -37683 -36846 -15983
7495 -15983 -8245 -12958 -9053 -8592 5868 15651 9950 3143 -12497 -17417 -8356 -14801 -32423 -28487
7481 -28487 -11151 11567 10658 10306 -293 -1749 -831 1733 -2837 -9612 -3949 2856 17939 21961
7467 21961 11737 -3348 -11635 -18889 -7219 -7526 -4895 5867 1415 -5892 -6480 -26380 -28367 -18104
7453 -18104 -5166 -19928 -21587 -20744 -18159 -9234 -9528 -10161 -15424 -10139 -6731 -13613 -10960 -10627 -20415
7438 -20415 -17828 -14316 -14136 3783 22980 27263 31742 38176 28380 17229 -1413 -5405 -9073 -14231
7424 -14231 -16544 -23635 -14586 -1270 -13691 -9537 3531 1824 3961 -4364 -22440 -37822 -37436 -28096
7410 -28096 -8543 -11524 -27918 -25024 -10211 -7898 -16784 -13542 -8906 1177 -11546 -16222 -19317
7397 -19317 -9466 -11690 -20915 -20536 -7477 18124 17451 9645 -1425 2420 -3764 -4520 -8507 -14281 -25643
7382 -25643 -30039 -15556 -8227 -4806 -13419 -22759 -25348 -15315 -23738 -28542 -16343 -235 -232 -9515
7368 -9515 -12586 -14426 -10612 -4530 -16218 -5795 5926 7752 1822 -1587 -8416 -15927 -26914 -27219
7354 -27219 -26982 -20167 -15449 -11536 -20775 -14116 -9914 687 -2212 -3049 -3608 -17845 -24244 2218 2598
7339 2598 -8491 -17538 -24629 -26147 -27570 -26381 -32580 -9099 12934 1316 -9188 -3 15591
7326 15591 31956 22689 16276 28655 24558 14173 6139 -2182 -11583 -1619 6379 6008 8869 -2746
7312 -2746 -11031 -12902 -18138 -33802 -21170 -11800 -4972 1142 11031 21432 12452 -16814 -8223 2039
7298 2039 -9795 -6991 -1200 -4568 6492 4304 3376 9357 11859 2989 9809 -642 -5541 -5125 -27383
7283 -27383 -28834 -5457 880 -6492 -17580 -21927 -27128 -25874 -10377 -13784 -21738 -34757 -33185 -34563
7269 -34563 -37102 -37319 -20680 -13138 11683 -6930 -14484 -5398 -5869 -13037 -9430 4421 11304 -1704
7255 -1704 -13723 -18491 -19092 -6761 1936 -3175 -12104 -1963 9928 7501 11672 9327 -1043 -11265
7241 -11265 3951 14377 -7560 -27238 -44096 -60832 -44284 -23987 -3387 -6588 -10753 -20236
7229 -20236 -17307 -5002 1295 7733 -7640 -20033 -7314 -3566 5877 10534 19886 -2884 -14046
7216 -14046 -18438 -21622 -16263 -11938 -22763 -15887 577 -8181 -22053 -18992 -11672 -11428 -9771 -9404
7202 -9404 -17079 -20783 -12666 -4387 628 12569 22664 29117 23940 13205 -2138 -7630 -6725 -9780
7188 -9780 -18884 -15902 -17690 -5042 5708 -940 -3180 -6619 -6436 -18594 -23622 -9499 7281 13726
7174 13726 5361 -6197 -16865 -19282 -21119 -21078 -23797 -23660 -16439 -11174 -10639 -5443 -16096 -30060 -29598
7159 -29598 -25477 -29198 -23894 -13312 -11115 -8028 -1719 -8657 -22087 -30408 -20621 -15538 -19703 -17285
7145 -17285 -24921 -21132 -19505 -15672 -11162 4530 13975 7157 13350 12569 5487 14194 13211 1429 -7161
7130 -7161 -9793 -4172 8226 15083 6075 -1951 13613 18691 6022 4957 14186 22017 7355 -2900
7116 -2900 4245 9140 1290 -10350 -13972 -23312 -32006 -35880 -41220 -46064 -33416 -17440 -18226 -30208
7102 -30208 -24495 -17950 -5372 6334 4785 -1860 -4770 5040 6663 7228 1132 -2532 3126 -2834
7088 -2834 -11556 -12625 -8156 -17503 -36850 -37416 -33258 -20023 -18759 -20993 -33782 -32072 -25933 -22272
7074 -22272 -18662 -3220 1516 1224 -3689 -4385 5549 16378 23321 17999 10572 3013 -9976 -13917
7060 -13917 -12359 -10044 7580 17175 14306 15914 4052 7095 11775 -6808 -28684 -33353 -19501
7047 -19501 -14152 -4106 5175 2190 8582 22213 16339 -128 -13912 -2615 -9384 -7878 -3659
7034 -3659 -7430 6015 25043 19184 4306 -7325 -25379 -19146 -19556 -25679 -16918 -12036 -9485 -584
7020 -584 9243 487 -15656 -6185 -10672 -23848 -26790 -19247 -11074 -16118 -8136 -7120 -5174 -1594 6225
7005 6225 1999 -12982 -10683 -713 4746 8902 -13621 -10726 -3536 -7230 -5742 -3147 -4211 2842
6991 2842 7276 8701 12052 7973 1681 2206 -1746 2843 4731 4575 18599 19495 7077 6709 5044
6976 5044 -4197 -20897 -34846 -23835 -17954 -11904 -10222 -15507 -22894 -19021 -17101 -28029 -20927 1173
6962 1173 14743 23814 34352 30618 22798 13986 7077 6003 4549 -5805 -12854 -17121 -8427 -3699
6948 -3699 1384 12748 18504 8485 -7670 -22603 -6427 8830 6596 -8515 -2837 6653 6533
6935 6533 4966 -1652 -9896 -320 5321 2994 745 -9208 -13887 -9301 -7721 -7540 -20339 -33111 -34667
6920 -34667 -26358 -21062 -16495 -12417 -17986 -18279 -9357 3105 -2794 -4143 2175 1357 -4190 7652 11977
6905 11977 17151 26543 13683 1913 4038 -75 5658 -4228 -2340 1297 -6621 -3365 4626 4235
6891 4235 2867 3321 2575 3373 9790 10492 1012 -5881 -5614 2845 -13616 -13444 -3981 3403 6797 9735
6875 9735 2061 -1454 -9701 -25224 -17858 -15520 -11225 -1480 1306 -4050 -1554 5071 -1804 -184 -5158
6860 -5158 -21662 -28745 -18658 -15729 -10487 -12206 -19880 -25198 -18018 -15990 -18743 -22052 -26746 -17589
6846 -17589 -28775 -37943 -25193 -8138 -674 7578 -2381 4254 63 -6440 -7576 -5296 -8331 -26750
6832 -26750 -18217 -8167 -6910 -6829 -7478 -11561 -1411 1948 -9834 -17691 -8510 -12785 -18014 -3030
6818 -3030 13976 13671 8442 2523 5849 8376 6736 -3265 -8885 3627 13558 8727 -8637 -20695
6804 -20695 -23565 -16841 -18720 -30985 -27481 -28684 -17534 -11918 1555 -4606 -13615 -32272 -43200
6791 -43200 -36964 -22124 -22600 -36444 -33248 -20614 -16555 -16718 -16244 -16974 -12711 -26412 -18529 -6039
6777 -6039 -3189 -10925 -11786 -18941 -17005 -4356 5351 -1969 -997 8923 11872 -1951 -16402 -8125 -11758
6762 -11758 -18195 -31918 -30184 -8372 -1442 -1143 8913 5218 -6603 -12188 -7286 -6802 -11169 -17156
6748 -17156 -19162 -11335 4162 5946 -4249 -14028 -16617 -8976 -3091 551 -178 -8281 -6575 -4903
6734 -4903 -7173 11446 14103 -935 -14177 -21880 -27416 -11472 -3856 1323 3418 462 11579 21167
6720 21167 21871 8183 5312 9878 19157 24845 18070 9538 -4269 -12751 3468 6402 -3982 -13702
6706 -13702 -17610 -16482 -18963 -28611 -24509 -8383 -6227 -7114 -16061 -27219 -19062 -19240 -20774 -25291 -10386
6691 -10386 -2924 -14543 -14564 -19512 -10884 4440 2533 9632 26647 23857 22843 13726 2328 -11719
6677 -11719 -9371 -6260 -12755 -22132 -13019 -9516 -10299 -14654 -11871 -5573 -8111 -153 9805 -5724 -9060
6662 -9060 -11896 -4708 12387 13349 -9508 -22102 -6533 6447 17545 14498 4921 22288 24761
6649 24761 7238 6354 3454 -9678 -10369 -4139 15783 18754 2935 -17025 -28583 -24604 -23291 -14142
6635 -14142 3079 16730 28218 19893 18511 23270 13959 1025 -5986 -1756 4224 -1251 4581 9094
6621 9094 2619 -3568 -1911 -7268 -13844 -15254 -17697 -9733 -1460 -3562 -18476 -17130 -17747 -22542 -32644
6606 -32644 -24699 -15753 -5478 -2870 -7055 -13616 -18827 14459 21541 4661 -2313 5980 12505 6267
6592 6267 -5448 -19019 -36447 -34608 -29064 -32882 -22901 -11818 -1801 -7341 -20073 -11945 5611
6579 5611 -1486 -11942 -19818 -13110 -30651 -16018 -9611 -11179 -4174 11742 5873 -8472 -5526 1367
6565 1367 -6124 1784 -6991 -22860 -16350 -12353 -12843 -18214 -324 12744 6147 877 -16327 -22438
6551 -22438 -17785 -14490 -7749 9968 9464 895 -11911 -14995 1714 15846 12911 8407 994 1837
6537 1837 6450 -3656 -15510 -4490 11651 10679 3107 12836 5131 -8425 -15713 -12742 -5557 -3026
6523 -3026 1676 -11244 -21437 -22376 -10797 4688 3218 926 1577 2460 13350 16864 3130 -15399
6509 -15399 -22224 -14419 -4775 -2544 -13128 -14396 -7261 -8039 -8644 1401 -9657 -18932 -23745 -24501 -6919
6494 -6919 2876 -2325 -10984 -16532 2526 8011 -434 -2756 -227 6206 7941 7179 1541 -528 -7574
6479 -7574 -4542 15787 2683 -601 1551 7702 19389 5758 -5220 5419 12861 4076 4734 2730
6465 2730 -798 -2630 2194 -4324 1985 4877 9604 16536 22959 7304 4755 6391 10640 2928 -8035
6450 -8035 -7052 5832 14288 6031 14679 15599 15704 16943 17009 18195 16876 15765 16379 8048 2523 2175
6434 2175 -4412 -3046 -2736 -5890 -5614 -8383 -18587 -5477 -2785 -16570 -35587 -40637 -30972 -18428
6420 -18428 -22269 -25859 -12215 3895 391 -1594 15127 17117 22610 24438 13005 7080 -346 3753
6406 3753 7514 95 -1043 1716 1610 782 -14827 -17418 -16286 -17570 -1495 -3569 -8602 -2338 -13446
6391 -13446 -29004 -26845 -9403 -6850 6502 16728 7438 -4755 -14500 -14794 -1488 -2712 -10051
6378 -10051 -8241 -25534 -24558 -5718 -12303 -21879 -29654 -15973 -11974 -6624 2913 5805 2963 1088
6364 1088 200 -10914 -12175 -7278 11053 15212 7936 -13817 -24250 -31137 -21339 -5202 -6484 -8382
6350 -8382 652 622 11060 10338 11329 6267 -779 -9387 758 6510 4636 13029 19272 11673 -1301
6335 -1301 -7431 -18133 -13721 -15015 -9003 -24742 -35654 -35375 -27272 -22061 -17399 -31561 -44904 -45612
6321 -45612 -27220 -25448 -11913 5596 1747 -15784 -11094 -12038 -10728 -2280 179 2060 7035 8320
6307 8320 4395 2090 9218 5488 -559 5196 8113 20365 15337 -15438 -18987 -8667 -11099 -17771
6293 -17771 -18202 -6091 2832 -1262 -2530 -9508 -12543 -16690 -11954 5012 10055 18156 14689 5242
6279 5242 -2675 8018 16537 13198 17649 15335 6815 6539 -1302 -22281 -17975 -11874 -22759 -22634 -16060
6264 -16060 -25977 -29050 -13654 16653 10974 6776 11471 1198 -12030 -17708 -16554 -5422 1569
6251 1569 764 -251 2993 5732 -3993 -11078 -8837 -8068 -19712 -16794 -23238 -13047 -4012 -9160 -10403
6236 -10403 -12019 -10567 -14517 -8019 10721 -8772 -22020 -30696 -27495 -19443 -11992 -12348 -14274 -21132
6222 -21132 -30017 -20629 -2989 -8629 -11085 -11815 -7509 -9092 -15255 -37918 -36345 -19715 -16733 -7578
6208 -7578 -1800 -15300 -22087 -19824 -21529 -22178 -15970 -4090 5161 7087 -565 2303 6882 -12053
6194 -12053 -3523 68 -13725 -19062 -16625 -11005 2077 2730 -7159 9196 10300 2496 2995 -7018
6180 -7018 -8186 -11934 -12063 -2270 9862 17931 -2960 -26227 -33260 -26890 -8522 -500 -11188 -7047
6166 -7047 -5446 935 7830 -357 -7398 -3749 -5075 -10965 -2574 8202 5818 -6056 -16073 -10030
6152 -10030 -10696 -5696 11478 30080 24338 8103 12677 10654 10780 -6015 -15306 -6903 -9138 1141
6138 1141 4020 5949 309 2434 -3421 -16226 -27311 -16298 -13770 -3659 12653 19979 20023 20047 16798
6123 16798 17583 19370 8336 11992 -7181 -6863 -15087 -21781 -14968 4190 15736 -3948 -27592 -28707
6109 -28707 -15055 -9604 -9458 -12757 -18523 -10250 -5466 -12196 -3807 5714 4461 17308 19929 24632
6095 24632 -2542 -20603 -13429 -25921 -17662 -6007 1851 895 10874 3717 2084 7655 6927 -2800
6081 -2800 1477 -6107 -14628 -3660 23478 40478 44290 37590 33845 25643 16800 12403 9124 -8115
6067 -8115 -30203 -34415 -33430 -31476 -14017 1063 416 -7811 -6913 5097 1491 -1195 2149 -5828 2613
6052 2613 20205 25064 16323 9125 428 2760 2768 1420 5406 8867 6454 -6832 -14882 -18993 -16709
6037 -16709 -279 -17767 -26243 -8044 3695 -3784 -18242 -20459 -8823 -6665 -7790 -14055 -10636
6024 -10636 -2655 3787 -2769 -10284 -16085 -26206 -29722 -12346 3307 6115 -9413 -15640 -1080
6011 -1080 -6846 -11507 -21084 -23397 -19735 -5591 1870 -16267 -30698 -37842 -27512 -2360 18600
5998 18600 16520 -1114 -20624 -35543 -38742 -23748 -20991 -12059 3713 1526 8759 11338 12521
5985 12521 7419 3287 -5539 -10824 -5477 -4773 5138 12779 -3021 -3324 -6506 3738 3861 15121 28252
5970 28252 28802 20026 14508 705 -18150 -27882 -16581 -44 -1526 -1066 2752 1533 9668 6789
5956 6789 4407 -2718 3596 -7076 -14888 -19509 -14441 -10923 -16222 -24823 -26370 -15093 -16076 -10750 1729
5941 1729 -3746 -14867 -9655 15212 16559 4432 -7635 -9799 2537 7921 5015 10145 15335 19608
5927 19608 14078 13460 10106 9752 3807 -10464 -14328 -1447 2850 -1340 -959 14317 6354 -18838
5913 -18838 -12036 1910 -1878 -168 -12213 -4382 -6996 -6144 -2842 786 -12238 -18555 -22292 -20952
5899 -20952 -23947 -18161 -10422 -13277 -2052 3978 7502 -5520 -10101 -6258 -8413 -7788 -11123 -21717
5885 -21717 -17858 -13197 -13106 -15330 -18201 -1847 20157 17367 6821 7716 4499 6902 -5059 -11956
5871 -11956 -16107 -23081 -20666 -8593 6433 11877 2403 -7242 -15737 -19673 -10698 -6846 -7423 -6649 -4093
5856 -4093 -1446 6288 8537 1676 1273 -1557 6968 4116 -5945 -3034 -4802 -216 14422 19989 19968
5841 19968 10847 980 7962 17530 4994 -3080 -8734 -13505 -9235 -6380 2963 12548 -272 -1523
5827 -1523 20650 29673 24852 14099 5072 412 -1125 -9436 -10478 -645 -5260 -5827 5807 16062
5813 16062 17463 23943 26472 20674 14860 -3758 -7720 -8771 -874 13997 9689 6760 3649 -15173
5799 -15173 -27198 -35810 -27993 -19721 -11481 -9799 -13425 -11582 882 10257 8423 16104 14972 -6369
5785 -6369 -13029 -8879 1438 -3099 -22422 -24623 -18222 -14805 -15799 -10165 -8787 -4579 -21904 -23803
5771 -23803 -24136 -19059 -24409 -36024 -18282 -3360 1503 -3545 2130 -2605 -1061 -3681 -10804 -4322
5757 -4322 6589 6255 10305 1080 -4685 -11244 -1749 10052 14532 8573 -4882 -8035 -1861 10612
5743 10612 6140 13552 18155 21235 17756 8168 1669 8935 1292 -4658 -5448 4 13494 18283 10577
5728 10577 5833 4324 -12166 -8411 8317 14165 7409 4648 7087 -1231 4956 12193 8439 14480
5714 14480 24562 19544 -7330 -24442 -13031 11611 17600 17413 6336 -16447 -16238 -7234 5846
5701 5846 -1477 -4492 8684 15186 13759 19278 15648 8490 -7510 -7213 -12818 -13991 -5190 -12057 -17602
5686 -17602 -22255 -16273 1120 -4695 -18293 -15886 1764 1184 -1547 -1364 -9250 -7842 -4238 -3697 -1239
5671 -1239 -5810 -20755 -20563 -10754 -5815 -3551 -1863 -11181 1967 5601 10580 19517 7779 -8361
5657 -8361 -7383 -2432 8348 -136 -17918 -14271 -10812 -18581 -26049 -23280 1601 19984 16791 4076
5643 4076 -3914 -17950 -21352 -25692 -21676 -10341 -9596 -10935 -13634 -10545 -24397 -25225 -15256 -15984 -21419
5628 -21419 -22379 -23203 -20038 -23550 -24184 -19741 -17290 -15087 -11958 -12208 -15625 -22881 -31150 -20530 -3358
5613 -3358 399 -14019 -11444 -21236 -27168 -8992 -7738 -15336 -7899 12999 10516 992 -10209 -15771
5599 -15771 -26985 -29898 -29246 -21144 -15172 -13726 -17130 -14394 -16152 -22444 -22045 -4610 17983 10667
5585 10667 -4589 -4622 1342 3184 -1926 -2836 2902 3491 -2644 -12012 -7026 -10452 -14299 -7889 -12037
5570 -12037 -16494 -24292 -30470 -30805 -30842 -45826 -31667 -8885 -9561 -17009 -33824 -29673 -15132 -20355
5556 -20355 -25442 -19632 -13734 -5912 -1632 -810 -9432 -7968 727 -2660 -16014 -36768 -34148 -49124
5542 -49124 -52765 -40173 -26787 -34864 -9466 -2362 -9835 -5316 6126 -8047 -7660 13238 21527
5529 21527 -4265 -21421 -28012 -28526 -21113 -20886 -21363 -21447 -16187 -21459 -22764 -24185 -36538 -34864 -10147
5514 -10147 1429 2090 3357 -15442 -8999 -2757 -3717 -21321 -12543 -2480 2758 6005 387 4681
5500 4681 2785 -9193 -13733 -10776 490 -10390 -14187 -5814 -3760 -14416 -6426 -6851 -2069 -7676
5486 -7676 -2035 5892 6336 19570 14051 -1972 -10220 -21066 -19149 -3311 2771 -5284 -11102 -14730
5472 -14730 -9901 140 2492 6205 7297 874 6550 15040 3183 -10642 -8121 5702 8203 6598
5458 6598 15786 4081 -5401 -9674 -21783 -20498 -24188 -17968 383 -6555 -14509 -16349 -8749 -11328
5444 -11328 -11798 -7017 -4304 -14043 -18522 -29010 -41706 -34743 -13695 -2937 628 -2926 273 9737
5430 9737 2102 576 2031 -4892 -18537 -18582 -9307 7511 22585 14774 6199 7741 20396 13462
5416 13462 1978 -4337 1914 14035 15791 1266 1010 -21351 -19306 -3054 19712 26623 21835
5403 21835 7931 -2018 7703 2196 -1877 -5420 -6221 -12434 508 -4294 -11146 5711 18444 17873
5389 17873 5196 10258 12727 8367 2638 -1297 -16796 -14801 5582 21157 35196 28789 13309
5376 13309 4513 -23677 -29123 -9701 -10238 -18741 -17280 -12114 -16457 -16486 -12592 -217 969 -3746 -18988
5361 -18988 -18932 -5402 1053 -6623 -11793 -26978 -26829 -19578 -20327 -32796 -35024 -23700 -15975 -5489
5347 -5489 -486 11316 23289 23201 16595 771 -940 -7966 -10568 -1222 14418 9593 11567 15916
5333 15916 6539 -7601 -14994 2933 11689 20086 14425 11843 12895 4829 384 11304 5746 1087
5319 1087 9898 11755 10032 4118 5456 -3821 3573 13847 12123 11573 1798 -19279 -20324 -18119 -28020
5304 -28020 -30671 -17929 -8618 -8089 -16140 -318 26160 26231 19198 6124 -14481 -15269 755 3683
5290 3683 6926 -927 -2115 2625 -2936 -12704 2581 9427 14457 8298 9332 15798 1303 9496
5276 9496 11481 510 -7266 -4735 12552 12458 14049 5058 4632 -5751 -4166 9638 8458 10348 9530
5261 9530 7768 12278 30502 20104 17933 21426 20532 27194 20916 -10602 -8432 -6114 -13178 -8899
5247 -8899 -19369 -22768 -18227 -20315 -14388 -9789 -8495 -10128 -19200 -25972 -12722 -11794 -27947 -20926
5233 -20926 -1415 7113 -429 1946 4558 17145 21921 27508 12766 -14035 -27852 -15334 3288
5220 3288 -3672 -459 5530 11547 17556 12453 -1423 -14562 -24476 -26173 -32309 -26621 -27088 -16555
5206 -16555 -16601 -20850 -13337 -6417 -7515 -2200 -10868 -14134 -8176 -4850 -13100 -3841 4854 9183 7404
5191 7404 1282 -8388 -11444 -14130 -23526 -24002 -13913 -10494 5512 17885 12163 1844 -1032 -8718
5177 -8718 -17612 -15537 -10748 -22903 -24538 -3876 8248 -2856 -4616 -3618 -3545 -13722 -14867 352
5163 352 4261 11005 10297 18029 12325 -1152 -16745 -11494 -6859 -24293 -34494 -25767 -21103 -16910
5149 -16910 -4812 -4999 -3632 -12968 -13573 -18107 -27229 -35725 -37712 -21322 -8262 -3991 -7149 -17377
5135 -17377 -15353 -10982 11695 13788 5716 4501 1246 -8175 -18187 -12275 -24085 -17828 -9963 -15569
5121 -15569 -21031 -17031 -8116 -16526 -10712 -14134 -4860 -1530 6557 18311 22413 6576 6268 2065
5107 2065 -3103 -3109 -11610 -11539 -3915 302 11732 4015 -4465 13535 20891 17641 19671 32368 25718
5092 25718 19980 6671 13259 12182 -1073 -6848 3443 6077 -8902 -563 -1878 -18840 -16906
5079 -16906 -14457 -11011 -6576 10966 16168 15144 11883 22104 8550 865 -5566 -12662 -17162 -13158
5065 -13158 3310 3220 14716 8909 -3534 -9897 -9363 1886 -11066 -23281 -19949 -17758 -25067 -6120
5051 -6120 6838 839 -2752 -2617 -10775 -22141 -6511 -1935 -7289 -13372 364 -2129 -14268 -29766
5037 -29766 -32933 -26277 -12117 -10843 -3240 1771 -6902 -17381 -14664 -1816 3068 3494 3795 11718
5023 11718 7939 4536 11292 23879 11163 -1544 -3785 4948 461 -4581 -6183 -2717 5036 8574
5009 8574 -9016 -805 8891 18078 16015 7842 4120 2218 -8011 3372 9925 9102 8748 6859 2259
4994 2259 16617 15279 -2667 1894 15143 25282 14220 -14697 -28091 -12041 3912 11044 7515
4981 7515 -4170 -13805 -5881 11951 12795 11938 4586 6243 13882 18886 19362 14603 14993 -47 -15743
4966 -15743 -19623 -28480 -20256 -8894 -8064 -4716 -1804 -14389 -20864 -31818 -40117 -38486 -31337 -15741
4952 -15741 -19986 -19623 -11487 -15301 -22977 -28124 -36531 -29885 -22315 -3733 -5752 -232 8167 6727 14204
4937 14204 8069 4391 9620 10008 1945 9043 23 -9422 -9263 -8890 -20236 -29534 -21132 -19674 -23074
4922 -23074 -20151 401 -3739 1398 5436 6010 3874 958 12565 1192 -1289 -2554 -12286 -8825
4908 -8825 -5088 -4805 -7518 -8531 -7739 -3384 -11090 -9575 1194 -14430 -22217 2727 21616 19749
4894 19749 -10256 -17699 -3561 4405 -3466 -17800 -8352 9583 7585 -7756 2588 13300 5200
4881 5200 -9552 -6310 1012 5132 -2699 -17773 -15954 -7223 3542 -7950 -1655 -1294 7594 201
4867 201 1654 4474 6757 -5142 -9046 -6273 -8369 -7986 -2096 -4955 -12149 899 9847 14156 14517
4852 14517 8573 -1534 1426 -4501 -14320 -17366 -23211 -13356 -5577 5835 11020 -4407 -4766 -1495
4838 -1495 -4730 6042 -5645 -10536 -17561 -23501 -21886 -22678 -19814 -10796 -12816 -10092 -5319 289 -2092
4823 -2092 -6681 -7646 -3112 -5466 -9586 -7547 -12815 -6668 332 9184 27345 19705 7127 16818 23950
4808 23950 18123 -459 -8421 456 -5806 -12961 -20405 -22813 -24362 -19339 -14715 -2985 4332 1592
4794 1592 -9587 -8336 -1984 -4128 -9410 -11832 738 12816 18270 21804 11179 6788 293 996
4780 996 6673 8270 760 -15171 -20424 -6227 -6006 -13939 -28199 -44002 -36318 -15104 1248 15915
4766 15915 7021 7153 2243 2420 5588 1994 -11402 -26929 -26686 -33498 -36460 -16740 656 12 -15642
4751 -15642 -41830 -31096 -33290 -25422 -12637 -8591 -6877 -2470 -1475 -16890 -20234 -11943 -25940 -29608
4737 -29608 -10252 -7471 -1151 3562 9523 10005 1146 -12931 -21297 -22291 -18108 -6389 -10188 -1346
4723 -1346 4221 3670 -227 1164 -5108 -8647 -1792 -11718 -4589 1905 7207 -5027 -12008 -7865 4636
4708 4636 6586 12119 1922 -2066 1520 -726 18053 11200 4503 -2816 1199 6873 10119 11741
4694 11741 5840 -3131 -882 -1338 6741 7777 9657 8180 9339 1710 -8892 5407 5991 -1712 5289
4679 5289 -11342 -15634 -9214 193 5466 -4288 -20333 -17715 -5161 -2177 -4109 -11402 -9699 -11106
4665 -11106 -5802 142 6564 -1396 -2006 1670 9955 -805 -13228 -13176 8071 4351 -11057 -8670
4651 -8670 -15161 -34249 -41987 -28245 -18053 -20720 -18275 -7173 -3811 9033 9959 13158 19008 21829
4637 21829 8471 8473 13933 -6353 -9220 -2870 -17925 -20898 -8687 9412 8544 -5917 -705 -6478
4623 -6478 -11308 -17024 -26643 -28696 -17182 -6626 1645 7864 11197 15034 12753 6335 8912 1724
4609 1724 3667 18493 24604 25389 19928 997 -13366 -17485 -21351 -26010 -14648 -638 6188 -1355
4595 -1355 -4906 -10723 -13784 -250 -4975 -29557 -27056 -6567 -3297 6412 17308 12243 -9328 -13637
4581 -13637 -2163 59 -578 -5688 -12389 -23223 -23576 -26202 -23294 -16356 1901 25139 13210 -12965
4567 -12965 -18197 -11676 -3366 -6354 4930 25868 33057 31413 8153 11729 15896 13414 9227 4480
4553 4480 1633 5178 23590 44892 31090 9554 5458 6057 -1150 6972 10004 10991 2848 5855
4539 5855 6045 4530 -8926 -19031 -14857 -13971 -9716 -22618 -35944 -27023 -17559 -11120 -11390 -16013 -22380
4524 -22380 -33021 -35429 -14544 -6177 -7386 -21982 -20703 -18593 -8616 2927 -4904 3525 9612 5206
4510 5206 2355 1502 4060 9243 10971 4292 -1409 -1728 9530 15439 7751 12977 1895 -7095 11555
4495 11555 19852 15727 19277 11562 -8522 -17479 -4156 5654 3530 -7534 -14534 -11009 -6236 -9721
4481 -9721 2224 17658 12742 -1226 4002 6484 19556 12285 -1619 -24428 -34847 -29344 -29827
4468 -29827 -18877 -2473 13951 24149 19645 4631 4024 13544 17621 21209 13336 15079 9726 8572
4454 8572 31823 20924 -3627 -15095 -18765 -23665 -30407 -42694 -34255 -29040 -8986 -1452 -787 -3143
4440 -3143 1421 5395 9915 9186 19208 17931 19547 15038 -5065 7370 13707 9902 12047 7103
4426 7103 3482 -6754 -8603 -8230 -13018 -14160 -28845 -30672 -10993 -8236 -10319 -712 8685 14181
4412 14181 9295 -509 10636 15294 4950 -4171 -13704 3945 16011 10704 13844 5248 -13125
4399 -13125 -10648 -21665 -28541 -17500 -11845 -2319 8908 12432 14760 17688 19207 14130 11151 -3443
4385 -3443 -8072 -13932 -24183 -10485 165 -9146 -6147 -15400 -13693 -9496 -7085 -6265 -3195 303
4371 303 3069 -3390 -19574 -9718 7092 16302 8684 3695 -1647 -15036 -14615 -8461 5172 15961
4357 15961 12623 8372 11402 17055 19887 24728 32872 36909 27245 11674 -2308 -9171 2799 8829
4343 8829 10603 5992 10152 7137 -648 -3891 -8205 -5547 2896 16834 18586 26461 2762 -8501
4329 -8501 -8392 1227 12693 28165 26869 -1757 -8195 1057 -3211 -1929 6373 485 2599 790
4315 790 8190 7331 -2065 4503 17394 20600 10714 4716 -8996 -5649 2738 7921 629 -2363 4321
4300 4321 5519 6240 -1906 -6166 1090 -4902 -7733 -6392 -2220 -2947 -16060 -17663 -9499 -22308 -28936
4285 -28936 -20480 -11594 -7929 -4649 3359 -871 -6347 -11066 -15412 -8388 5879 12849 5677 -8459
4271 -8459 -7707 -2712 2832 5197 -9710 -16189 -17527 -17577 -11526 -1847 5739 -9392 -13798 -6829 -13238
4256 -13238 -7681 5162 2913 11215 8780 15897 21901 2522 -7627 -25865 -29313 -27634 -32025 -18683
4242 -18683 -11466 5701 23468 14254 -1609 -17600 -25935 -22386 -10785 4025 15956 13932 -802
4229 -802 -7240 9801 18925 17320 -7355 -26272 -25009 -20642 -18100 -637 11914 10195 13965 22447
4215 22447 5309 -12361 -8668 6563 15062 6969 10272 16957 6561 -5455 5174 10053 6560
4202 6560 -7482 -17529 -4304 7734 13830 10458 -6815 -8818 1102 2380 17687 19704 16734
4189 16734 15479 9050 10585 7168 5894 14965 16257 19032 14384 15594 26209 22767 26511 23100
4175 23100 26514 33852 28888 26798 15911 9677 3254 9157 9043 8699 6962 7743 3655 -15677 -9638
4160 -9638 -6406 -4280 -1473 -34 1494 -1297 253 11155 12149 4111 904 587 -6297 -12402 2250
4145 2250 5952 1204 7713 -3317 -14832 -15204 -22725 -27932 -19581 -19417 -12952 2540 17930 8020
4131 8020 -9063 -26195 -22125 -21548 -14721 3125 6301 -8368 -14911 -1392 4677 726 4196 1452
4117 1452 -8581 -5534 -5508 -18351 -12412 -15653 -26314 -25775 -22331 -10571 -13581 -27692 -31537 -26815
4103 -26815 -33483 -35682 -26403 -8149 14440 14071 15010 8021 -8362 2891 9168 17636 18212 12737
4089 12737 19786 14023 9658 28218 29092 7554 2749 8041 10348 -5274 -7221 -13711 -9273 -9032
4075 -9032 -17369 -15244 -7817 877 -2839 4369 13295 12946 -4738 -11159 -1415 -14687 -19296 -16294 -13006
4060 -13006 -33725 -25492 -11680 -9236 -14828 -3320 11816 10673 12721 21569 15881 7903 -1821 8155
4046 8155 14181 16395 10022 11785 15919 3313 -4512 -6551 -7398 2007 7393 16636 16456 5828 -6711
4031 -6711 -15548 -19829 -9685 -4315 -17394 -12982 -6945 -5779 1793 8628 -1036 -6838 -8338 -21410
4017 -21410 -23473 -9887 1102 -19555 -39860 -18212 -2171 -1198 -486 14907 20785 11717 8614
4004 8614 -8348 -20959 -10942 -15874 -21219 -18807 -9807 12069 16975 27753 24444 11410 30641
3991 30641 27723 13635 12470 3820 -5575 6478 12991 9483 -5978 -13352 -3745 2654 -7067 -11760
3977 -11760 -12020 -10099 -14198 632 -2655 -3818 -6835 -13559 -21786 -25572 -13734 -7729 -14171 -683
3963 -683 2688 -6527 1058 -4423 -9323 -18320 -27301 -25054 -17579 -12893 -8480 -9893 11308 11699 13353
3948 13353 10615 2901 -3724 -4773 -10246 -10816 -4766 -7180 1600 14029 23838 27801 32106 24386 11557
3933 11557 7624 762 -16037 -27178 -25980 -21156 -23478 -37174 -36896 -27470 -20596 -10379 -8160 -12428
3919 -12428 -9180 -8746 -1219 -3015 1013 2423 12497 -2672 -4185 -1998 11834 10828 8421 9787
3905 9787 11426 16533 21313 26029 31040 26721 26180 23161 25392 32020 20704 11130 3867 -4384 -1754
3890 -1754 -3121 -6205 -10819 -21921 -28313 -20272 -20698 -3188 3572 2287 5473 8195 -4846 242
3876 242 8667 17989 19712 15835 1732 -9894 -11103 1214 6291 16855 14262 9871 22571 15126
3862 15126 2234 -2854 -5471 10724 11781 27845 30600 20065 14499 6619 -8706 -23624 -13692
3849 -13692 -8856 3508 4142 -675 -12561 -27343 -17519 1454 -2719 -14642 -9528 -15897 -17369 -7756
3835 -7756 19462 19583 12871 9338 746 -1547 14 -4224 -1084 5658 1988 13706 16428 14906 17141
3820 17141 1841 -13509 -8892 15688 19502 16168 19729 17434 23732 16049 -1088 -15595 -12661
3807 -12661 -13953 -23096 -22400 -7388 -9767 -5418 -4968 -9162 -13009 -7031 -8650 6517 5583 -7409 -14285
3792 -14285 -1967 1926 -4184 -4905 -10719 -13978 -522 5397 10042 3357 964 13475 9145 17833
3778 17833 16327 8155 -13777 -14786 6681 2200 -22045 -40701 -22309 -8591 866 12961 10516
3765 10516 8121 5588 1587 14144 3871 -9977 -13628 -9368 -15801 -21624 -7822 8264 2348
3752 2348 -264 -4865 -11395 -2949 3628 -13939 -15357 5478 13431 1338 -7516 -3999 -16570 -9614
3738 -9614 -10662 -14485 -7251 -24729 -25498 -5869 -9751 -24775 -25904 -17546 -17725 -26303 -32254 -30647 -38927
3723 -38927 -40428 -33845 -27414 -15718 -11912 4617 22510 30151 25450 22094 17418 15837 3979 -8631
3709 -8631 -22955 -33942 -19705 -12068 -9508 -6659 -15898 -19676 7433 4967 -21654 -36139 -30963
3696 -30963 -15162 -18064 -8701 14813 14662 3552 18446 6462 -14739 -15703 5719 14508 5267
3683 5267 -207 653 -6123 -4915 -3473 -4291 3832 18381 8759 -2098 6253 11204 14434 3836 1518
3668 1518 -2918 -5388 8621 361 -1031 9249 11784 4934 11371 11947 -19363 -25091 -24978 -10821
3654 -10821 2628 15421 15807 3717 -11060 -11787 677 21959 26980 12807 14411 24897 20431
3641 20431 3744 6312 8266 5952 9685 8705 -12753 -21746 -14128 -3558 -13075 -10833 -5245 -2510
3627 -2510 1615 22971 18518 15566 13227 4628 6226 -3722 -1865 -2503 -5025 -10271 -7400 2868 -645
3612 -645 -946 1754 3867 -3059 -5013 5368 -436 -5939 8657 21117 6050 -7409 3660 16903
3598 16903 7813 7445 11675 9189 5814 13102 -7878 -19763 -13255 -16669 -26638 -3437 20866 24634
3584 24634 19904 30150 33233 33010 24320 17895 12427 -5542 -9053 -6337 -2194 -6716 -10201 -17180
3570 -17180 -10036 13064 21357 24697 23698 2942 -19090 -18558 -15172 -17417 -17663 -15192 -2002 -4672
3556 -4672 -8098 -4476 -3767 -5109 -12343 -3852 8571 8944 -6135 -8571 4285 10575 10299 8213 -7652
3541 -7652 -5296 1970 -3452 599 10796 5220 13999 19341 10240 -7138 -1403 9430 11800 120
3527 120 -22428 -38134 -46027 -46480 -31376 -14202 -6993 1676 -1723 -14029 -7104 -887 5400 -6380
3513 -6380 -7948 -1515 3562 1628 9035 8718 -992 -1705 4505 4556 -5465 -7272 -9191 -7395 -17925
3498 -17925 -21419 -28555 -13900 9317 16385 -1951 848 -4008 -11423 -14420 -9664 -9439 -18285 -27735
3484 -27735 -32600 -11380 -6083 4182 21671 14830 -5840 -11898 -5834 5937 11571 20454 20147 12947
3470 12947 19937 11496 3361 3160 7311 14859 18189 10256 4842 -1806 860 9755 6834 11113 8721
3455 8721 2979 -5082 -9983 -9176 -17866 -26099 -15714 -13194 -7573 -8301 -5693 -1251 -12204 -14332 -17679
3440 -17679 -13746 -8186 -12502 -24683 -16736 -26444 -17177 -16111 -4865 13803 25764 27347 4600
3427 4600 -27541 -24624 -12815 -9887 -9791 -11570 -4894 8255 4109 -8550 -6892 6328 2398 12141
3413 12141 26804 29859 12255 8416 -6686 -10243 -5501 6682 8535 -9472 -16142 -10207 1779
3400 1779 4997 1787 -650 5704 18665 24732 14602 13188 5178 3837 10354 18294 27524 18574
3386 18574 2898 8652 7621 21112 19602 13102 1332 -1546 9391 8951 10394 12248 12370 25871
3372 25871 13669 9690 11620 6226 7951 3202 -3985 -5220 3500 4500 16133 15963 13347 11720
3358 11720 2656 -11922 -21970 -20908 4763 20128 20196 17281 22 -7992 10600 18269 15394 18739
3344 18739 12248 5996 15793 15332 22342 26129 16973 15661 12542 13899 -742 -12427 -6533 1113
3330 1113 6883 17380 3232 -24350 -27036 -22902 -20036 -17670 -15332 -16728 -15618 -24486 -19061 -16940
3316 -16940 4175 5421 499 -12856 -25090 -13000 -5718 -2000 105 -11328 -18794 -28077 -12173
3303 -12173 15143 14205 1593 631 -6203 -2253 2348 1292 1028 -9033 -16922 -28916 -10474 4273
3289 4273 22856 25112 25098 11498 -2432 -14254 -16447 -22883 -14889 -18508 -11600 -1276 5795 3286
3275 3286 2581 -8635 -5117 13062 11514 8363 8458 2319 -6668 -5116 -18810 -34558 -29994 -15613
3261 -15613 -19963 -23196 -21112 -14908 -11964 -8815 6156 16656 10438 7659 6361 -8685 -18400 -18849
3247 -18849 -28235 -21270 -15586 -13871 -14785 -19292 -17003 -15276 -9856 10491 5852 -7144 -10970 -4720
3233 -4720 -10370 -13253 -5843 -8772 -18554 -14252 -6192 -13620 -5184 -940 -6417 -10712 7130 1053 -6710
3218 -6710 -11733 -14294 -13753 -12724 -7783 -6776 -2196 4775 -6767 -20169 -17422 -7211 -18466 -12307
3204 -12307 6945 16836 11497 19129 10418 5882 10560 9972 4591 11137 14066 19442 8919 7522
3190 7522 4035 7044 15188 12513 19017 19447 12562 19826 30931 22441 -4829 -7738 7648 4796
3176 4796 8335 14978 15593 10592 -6986 -7087 3509 -1948 -6973 -3316 12648 17034 17468 12517 -6596
3161 -6596 5077 13268 6534 7851 2056 866 6331 1620 -994 1916 -282 -780 -8670 -14892 -2372
3146 -2372 9307 23397 10173 -4026 -10371 -1650 1477 553 -12305 -10279 -569 2263 -5951 4054
3132 4054 11920 15244 23604 30813 31573 24766 8382 5632 9793 19608 9724 604 -6613 1920 -17537
3117 -17537 -27811 -28098 -32895 -18314 -2778 -6505 -11573 -5750 -86 -16181 -21073 -3689 -4301 -12472
3103 -12472 -9877 -11428 -9179 -3077 9782 -956 -4829 6969 14923 471 -1373 8971 18018
3090 18018 15210 5868 -11683 -24227 -18927 -19752 -8962 8199 6208 3181 2353 2812 4891 14434
3076 14434 9756 7192 15904 12813 2355 2736 17489 20310 -418 -14810 -1016 -2097 -1932 -4464
3062 -4464 -8542 10016 32253 37135 36350 26457 10944 -4196 -15007 -23955 -34788 -24356 -20878
3049 -20878 -287 9528 4639 -1813 -9525 -7870 1726 -2289 -12239 -2436 13243 25337 18976 9324
3035 9324 5765 917 -14575 -9241 5642 9078 -4081 -13039 -11318 -11391 -3870 -1738 -6856 -10730 -8561
3020 -8561 1356 8832 6523 8647 16790 15609 7321 -8867 -18856 -11961 -6020 1487 -807 -340 -10158
3005 -10158 -13973 -20914 -8660 -355 9308 1683 8946 16113 16689 350 -18405 -28339 -11578 5443
2991 5443 7657 5576 -3526 2594 1235 -7979 -19091 -15375 -16012 -16194 -29293 -27116 -11489 -3060 -11805
2976 -11805 -11628 -16058 -26010 -28019 -29369 -28798 -19756 -1959 -9353 -4418 10290 13235 3713 4901 6513
2961 6513 5025 -6378 -3111 9572 19919 22463 12771 -540 2384 10807 7625 14266 16524 19928
2947 19928 9163 -1889 -17312 -20282 -616 13884 29384 22158 3620 -12523 -16572 -13823 -13310
2934 -13310 -11514 3298 10189 -734 8656 14159 25219 35507 31901 13150 -13906 -24908 -23491
2921 -23491 -3602 -9004 -5709 2201 -620 -5181 -1989 827 -9801 1987 10765 9434 8525 -13211
2907 -13211 -14657 -10546 671 7741 3411 4243 -1855 -3177 4475 -4961 -10912 -22349 -30076 -34758
2893 -34758 -15262 3453 4739 -12368 -14663 -14951 -2598 1421 -10281 -26154 -26435 -7955 -7077 -10766
2879 -10766 -1720 2129 6701 -673 12745 13032 4665 -6378 -8191 7540 1092 -10212 -9047 -7160
2865 -7160 -25293 -22804 -5791 -6721 2198 -1097 -20364 -29734 -25264 -4137 4524 12351 11762 7069
2851 7069 5778 -5731 -11656 7534 22513 13874 18831 22614 18436 9386 -3261 4230 13203 20403
2837 20403 17999 9918 8681 456 -5603 6703 12437 26752 17092 9838 13015 4036 -406 11438
2823 11438 25528 29540 36001 41702 29174 -1209 -4433 -3081 -8616 -12782 -23508 -23742 -9148 -14417
2809 -14417 -11848 -2267 -7536 -17609 -16930 -24106 -19099 -3447 2343 -13245 -25073 -9860 1591
2796 1591 7643 14474 18679 11930 14538 33499 36453 7236 -6339 2606 -2546 4882 14440 11135
2782 11135 13302 1492 -9695 -6007 7719 27530 22783 11568 11862 12529 10745 3605 -3428 -1635
2768 -1635 2927 6220 -8625 -9252 -2782 -8637 -5212 -1717 864 -4742 -1323 25405 18649 9735 -10280
2753 -10280 -426 8772 -11818 -15973 2353 20713 37950 28902 24977 30600 29947 18925 6920
2740 6920 12648 18433 23499 21048 22525 10539 7061 11377 15091 -1985 -3973 -6489 -9923 7534
2726 7534 16798 11482 4913 5415 -485 331 9930 18373 12972 1643 5353 -11074 -19366 -15131 -18350
2711 -18350 -18312 -1932 -4065 -17039 -20957 -8255 5837 1605 -15786 -11902 -8800 -2319 -6362 -16058
2697 -16058 -8179 8806 26129 19569 1243 -17332 -4710 -7686 -7245 2708 6198 2971 -8670
2684 -8670 -3376 -6949 -11371 -2457 4254 2282 5073 3225 236 512 -6174 -9241 -3680 629 7966
2669 7966 12569 30631 41136 48726 34494 18883 15487 3357 -632 5938 14287 3156 -1276
2656 -1276 -1582 3594 -4553 -3907 -190 -177 11743 4876 -14764 -16817 -2097 11891 18720 14264 17292
2641 17292 6610 -8259 -18256 -8096 9947 7597 10304 18071 22195 15576 1854 -15083 -24112
2628 -24112 -13745 -19016 -13545 -242 -5438 -4846 5780 9800 6003 4900 9926 3515 1070 5001
2614 5001 5354 1579 5429 -818 -1810 9157 14963 6412 6548 9555 7810 13967 2327 -565 5264
2599 5264 -7353 -10160 -10235 -24440 -13541 -14439 -13188 -11180 -278 -3321 554 9747 13965 17285 32141
2584 32141 8057 -8246 -5956 10863 5144 -645 6474 -1214 -12575 -6285 8892 9844 4038 5904
2570 5904 -11335 -13821 9812 14687 14639 -1382 -6269 9558 11777 7487 428 996 3028 -7960
2556 -7960 -13797 -1564 30856 40848 27408 3502 -15402 -18610 -17006 -8574 -11548 -15808 -3979
2543 -3979 15254 8803 10651 -3879 -1950 5562 2810 1538 7859 -5786 3553 -4841 -8942 -6656
2529 -6656 -3191 1899 1264 1277 4228 1887 -11053 -17881 -18212 -10045 -8122 -9782 1103 1686 -8569
2514 -8569 -6935 3264 16816 13930 -4489 -7779 -2017 5345 7010 9543 3264 -30 -5837 -9936
2500 -9936 3357 32124 16653 -17011 -11602 1271 7316 -8659 -12662 -5962 -6669 -485 387 639
2486 639 6854 -6553 -14213 -10748 -16184 -16834 -11236 -12403 -20962 -282 2292 -10332 -18618 -22663 -24328
2471 -24328 -4071 4160 -2158 -10543 -2545 -2855 -5433 -567 1195 -4623 -13285 -17091 -4958 -13307
2457 -13307 -21151 -795 11131 1994 -4914 -4335 1386 17035 31065 28577 13445 2090 8610
2444 8610 17329 20158 10655 -2925 9247 6685 -7216 -2783 -5013 2931 26123 30028 20854 15189
2430 15189 2694 852 -16541 -23161 -3139 10225 -2182 -23278 -28340 -17256 -23155 -24948 -31484
2417 -31484 -29602 -21168 -22692 -22935 -15813 2423 -14361 -15121 10896 10057 -518 811 -2657 -9051
2403 -9051 -12042 -216 8298 6010 10352 5019 -7203 -484 -7108 7529 1494 2233 -7401 -19640
2389 -19640 -14068 -2549 227 1746 14726 11928 16714 14506 4251 6124 14604 12938 -4871 -16356
2375 -16356 -1262 -6036 -15776 -12048 -5665 -14568 -8378 -1741 13234 8070 -3844 -10717 -1446 -1438 1371
2360 1371 1485 5236 1954 -9572 -17428 -22935 -14207 6111 9348 4295 -1632 -1426 8227 21120 19036
2345 19036 8350 5444 8120 -12438 -18474 530 8389 3630 5374 19508 14260 880 11007
2332 11007 9587 8767 2703 -1038 -2653 -5162 -11511 -11726 -17397 -24801 -26362 -11772 6238 23101
2318 23101 14118 -12793 -29017 -17880 -11284 -8959 -15446 -5120 15046 3567 -3750 -11695 -11738 -4528
2304 -4528 1635 10077 -4858 -12941 -11481 -3064 11857 7523 -3403 -17066 -18629 -6333 8126
2291 8126 20076 25267 1245 -4429 -7145 -5684 -20469 -21695 -1740 6935 25180 19683 10619 16229
2277 16229 23666 28290 16636 8993 8642 11087 4734 -4329 -6386 -4159 -999 -4595 -6566 7237
2263 7237 7519 7928 7008 21186 18664 18095 5155 -20356 -23854 3196 12527 4514 4871 -3608 -19688
2248 -19688 -30360 -19065 -12331 -13478 -8697 -5785 -7570 14421 12168 5070 20 -3370 11548 11447
2234 11447 22668 40329 47912 30819 14362 2001 -8144 -2599 1421 -23334 -25558 -3955 8178
2221 8178 13922 28997 39807 41852 24308 25878 33480 29376 12888 11166 12596 3879 -6351 1653
2207 1653 -2447 -8591 -4975 10692 27799 27498 22375 25697 22778 25310 14450 13199 14483 6987
2193 6987 -6568 -12540 -9267 -3624 -8853 -20548 -5840 477 -16264 -19631 -14371 -5184 -10407 -19541
2179 -19541 -19076 -26581 -17650 9790 24052 26720 22930 9469 -15626 -30433 -27185 -23228 -28737 -19612
2165 -19612 -15762 -13783 -8154 771 -9790 -15303 -11878 -7022 -11039 -6109 -1117 -1619 -5665 -5527 -5920
2150 -5920 -1864 -3307 813 -6361 -10233 8228 12928 -611 -26893 -21585 11688 22286 9019
2137 9019 -4797 -9612 -13466 -17619 -12084 -8088 261 14053 20086 9378 -578 -8134 -6513 -9094
2123 -9094 5686 20906 16048 12062 5374 -8465 -6348 632 2655 4760 1919 628 6348 24366
2109 24366 24161 18372 8495 10716 11173 9426 -341 -8543 -1631 3320 7883 4654 4465 -2269 -3933
2094 -3933 14270 31843 32739 22852 16626 12281 -1483 -16788 -26253 -34072 -20067 -12578 -15997 -6734
2080 -6734 11542 -8169 -27390 -21808 12548 25471 21828 13740 -3920 -1437 5701 17628 5694
2067 5694 -1859 -5403 6566 17923 10949 4723 2952 -1007 10754 14261 5011 1104 -606 6147
2053 6147 8755 20346 10182 2027 6816 21618 26922 23076 29869 30982 20999 1303 11606 20402
2039 20402 20948 19220 18056 17611 22670 29317 31943 25057 11450 13763 1558 -9581 -21704 -19132
2025 -19132 -6662 16507 19897 11766 13402 16377 11154 4417 1766 -8 6679 11562 3510 -2605
2011 -2605 -4009 -10073 -12438 -5389 4437 295 6721 3049 -9491 -1384 111 8688 12244 14718 13105
1996 13105 22969 22932 18194 14539 12689 21623 20828 19671 10075 -1942 2687 20390 25473 10387 -8727
1981 -8727 -8293 -6732 -5338 -7761 4765 9669 -8981 -9211 17983 19684 5200 -2690 -10918 -3070
1967 -3070 -739 -4362 -272 1818 -7944 -234 8172 18215 15567 6090 6217 7037 3958 -3164 11681
1952 11681 20285 18700 6541 3840 9458 15295 4545 2502 12269 -5616 -16429 -6074 -2174
1939 -2174 -5962 -1307 3822 868 791 17984 15383 15828 1136 -8317 -15607 -14852 -12042 1756 7773
1924 7773 3537 -3686 -3112 -8655 -3982 -2151 6840 19403 16768 12643 3400 15833 8109 -14054
1910 -14054 -16096 -1901 15018 22365 10488 4770 -3771 10633 5103 -8517 -6419 12494 20517
1897 20517 18381 14901 7975 -6395 -10845 -13818 -14400 -10274 2268 22619 25083 19893 11259 -7486
1883 -7486 5559 11444 1449 4708 2164 -707 -6047 2978 5748 11447 7081 -3039 -20105 -27481
1869 -27481 -20643 -18238 -7224 4646 8993 6007 -8827 -4644 3460 -1092 3569 750 1294 313
1855 313 -9215 -12250 -5852 1223 1209 -881 -10110 -5814 1973 14984 34618 29285 31354 22377 24631
1840 24631 34946 20064 6695 8188 8039 5005 8590 7819 23662 28514 20535 16432 13445 9294
1826 9294 9698 4395 4505 -10686 -18700 -25336 -18499 -15980 -9728 -4681 -973 -776 2829 -3143 -744
1811 -744 3705 5196 -2690 -10824 -15808 -20250 -7231 -2907 2226 1016 -3490 1053 2113 7930 19163
1796 19163 21422 26534 15566 5289 9042 1449 -10533 -7013 1577 13640 -1662 -4471 15032
1783 15032 16852 16416 2075 -6821 -2702 6130 11328 19563 17193 3659 -2167 -395 -3558 537
1769 537 13176 27002 30411 2096 2005 12244 -9368 3910 18807 29440 33614 18237 4688
1756 4688 -4340 -14817 -19821 -14341 7825 7222 -4517 10793 12901 5512 4468 6227 3128 -12181
1742 -12181 -12197 -6624 -451 3256 9205 13401 17721 28992 15833 -7119 -17469 -7846 -4371 -3228
1728 -3228 -18741 -15030 -6403 -1333 -10846 -14782 -24078 -10069 5537 7271 16884 12480 7643 13900
1714 13900 8716 15066 17481 -195 -6964 5264 10362 18609 25314 35920 28981 15725 18342 15037
1700 15037 4039 -2 2271 -7844 -3104 198 -4224 -1692 -7092 -18515 -17180 -3127 -4293 -5322
1686 -5322 -8500 12789 26551 13476 -3148 -665 -1426 -1145 -1018 -6739 9109 27435 12550 4802
1672 4802 7674 18749 -892 -34844 -41424 -27737 -16407 -16352 -10676 -10643 -14006 -14263 -16113 -20000 -7632
1657 -7632 13416 6624 1780 8341 11735 14846 3604 -13931 -26855 -24912 -23804 -22437 -21414 -3548
1643 -3548 9603 18928 6475 3752 7222 13967 18489 18044 24185 25815 13985 8637 15588 7392
1629 7392 11009 4585 -8822 -11201 -6403 15805 10807 2847 -3735 3057 17835 17259 3868 4885
1615 4885 7831 6612 -2495 -661 2406 12744 10358 3740 3096 870 -2779 -7412 -12167 288 9663
1600 9663 18028 19368 10010 -6725 -13509 -12563 -20035 -12844 5544 14112 17419 9176 1956 1807 14468
1585 14468 18392 24500 34865 21771 4569 302 2694 10644 23977 19399 19562 36718 19851
1572 19851 18999 13904 2313 -6715 -9010 -4446 -2377 -3982 620 3142 1843 -317 2623 21198
1558 21198 25306 24446 10609 -3264 913 26206 15539 2023 -2409 298 -2314 5192 -1897 -12162
1544 -12162 2008 -246 -2120 -1252 3487 9368 -9233 -18770 -19379 -7510 -550 -4380 827 3703
1530 3703 -3275 -13409 -10665 -6635 -7653 -2932 -5895 6734 10322 8468 -1008 -7847 5631 7122
1516 7122 -6006 -12709 -7585 -8993 -8915 -6581 -1215 -7848 -11832 -1212 -3733 -23362 -16218 1448
1502 1448 -1201 -3049 9234 22308 25331 20297 -5270 -12930 10334 7420 8049 15426 28788 38544
1488 38544 21247 4076 -7919 -16653 -16346 -2961 4276 4065 2251 3439 1921 2563 -1430 9816
1474 9816 20680 13575 14548 16443 10861 10728 -3157 4196 10564 12702 5178 -7325 -6116 8923
1460 8923 -5360 -6358 49 10713 17809 22713 7208 -17806 -22130 -16776 -18663 -12747 -17483 -6314
1446 -6314 -1784 -7609 -14436 -15925 -15381 3928 14601 16935 12540 1222 -9485 -6012 3888 7429
1432 7429 3708 12762 8226 -4581 84 -9021 -12603 -7967 -3484 8008 13845 14573 8302 19 -1225
1417 -1225 16697 27831 26271 27929 21929 7190 1493 -3480 2779 11867 5475 25765 18687 3659
1403 3659 4148 9888 -5128 -18777 -14693 -6355 -9371 -34760 -38675 -38039 -26882 -24028 -20800 -4174
1389 -4174 -7790 -256 3145 -7275 -13185 513 8358 12802 5774 2000 6643 17292 23865 18834
1375 18834 1106 -3126 2155 -9368 -20880 -22213 -13175 12669 23960 18908 17685 17100 17344 12441
1361 12441 12829 22838 19761 3379 -11496 -13871 2871 14252 22962 18325 14655 14380 4452 9410
$$ [...]
##END NTUPLES=NMR SPECTRUM
##END=
