##TITLE=Analysis number 327455
Compound Code btb 09252
Book Reference 189209
Project Code adrs  flro3
Chemist Name jom
##JCAMPDX= 6.0         $$ Bruker NMR JCAMP-DX V2.0
##DATA TYPE= NMR SPECTRUM
##DATA CLASS= NTUPLES
##ORIGIN= Bruker BioSpin GmbH
##OWNER= nmr
$$ XWIN-NMR		Version 3.5
$$ Mon Mar 26 15:23:47 2007 GMT Daylight Time (UT+1h)  MAYBRIDGE\nmr@NMR_250MHZ
##.OBSERVE FREQUENCY= 250.131544655141
##.OBSERVE NUCLEUS= ^1H
##.ACQUISITION MODE= SIMULTANEOUS (DQD)
##.ACQUISITION SCHEME= undefined
##.AVERAGES= 16
##.DIGITISER RES= 18
##SPECTROMETER/DATA SYSTEM= dpx250
##.PULSE SEQUENCE= zg30
##.SOLVENT NAME= CDCl3
##.SHIFT REFERENCE= (INTERNAL, CDCl3, 0, 16.522)
##AUDIT TRAIL= $$ (NUMBER, WHEN, WHO, WHERE, WHAT)
$$ ##TITLE= Audit trail, XWIN-NMR		Version 3.5
$$ ##JCAMPDX= 5.01
$$ ##ORIGIN= Bruker BioSpin GmbH
$$ ##OWNER= nmr
$$ C:\u/data/dgb/nmr/ADRS/1990/pdata/1/auditp.txt
$$ ##AUDIT TRAIL=  $$ (NUMBER, WHEN, WHO, WHERE, WHAT)
(   1,<2007-03-26 15:23:23.91 +100>,<MAYBRIDGE\nmr>,<NMR_250MHZ>,
      <created by zg, POWCHK disabled, PULCHK disabled
       configuration hash MD5:
       49 4B E0 1D 92 C2 6B 37 9F E6 65 BC 52 41 86 1D
       data hash MD5: 64K
       58 3C 96 45 68 57 99 C0 6D 01 F9 07 CC 47 0C FA>)
(   2,<2007-03-26 15:23:36.74 +100>,<MAYBRIDGE\nmr>,<NMR_250MHZ>,
      <Start of raw data processing
       ef LB = 0.3 FT_mod = 6 PKNL = 1 SI = 32K 
       data hash MD5: 32K
       1D AD BB 48 23 C2 F5 18 19 E0 E7 04 1A 58 E7 AA>)
(   3,<2007-03-26 15:23:38.69 +100>,<MAYBRIDGE\nmr>,<NMR_250MHZ>,
      <apk 
       data hash MD5: 32K
       BC 3F 73 C6 02 0F B8 A7 7A A7 E4 02 32 EE 67 20>)
(   4,<2007-03-26 15:23:39.50 +100>,<MAYBRIDGE\nmr>,<NMR_250MHZ>,
      <abs ABSG = 5 
       data hash MD5: 32K
       36 B8 3A 8C 42 6D 11 C2 39 F6 9E 3A C6 57 BB AF>)
$$ ##END=
$$ 
$$ hash MD5
$$ 45 4A 0A FC 60 35 2F 80 50 1C 57 A3 CE 63 0A C9
##$RELAX= 
##$RELAX= 
##$RELAX= 
##$RELAX= 
##$RELAX= 
##$RELAX= 
##$RELAX= 
$$ Bruker specific parameters
$$ --------------------------
##$DU= <C:\u>
##$EXPNO= 1990
##$NAME= <ADRS>
##$PROCNO= 1
##$TYPE= <nmr>
##$USER= <dgb>
##$AMP= (0..31)
100 100 100 100 100 100 100 100 100 100 100 100 100 100 100 100 100 100 
100 100 100 100 100 100 100 100 100 100 100 100 100 100 
##$AQSEQ= 0
##$AQ_mod= 3
##$AUNM= <au_zg>
##$AUTOPOS= <45 >
##$BF1= 250.13
##$BF2= 250.13
##$BF3= 250.13
##$BF4= 250.13
##$BF5= 500.13
##$BF6= 500.13
##$BF7= 500.13
##$BF8= 500.13
##$BYTORDA= 1
##$CFDGTYP= 0
##$CFRGTYP= 5
##$CHEMSTR= <none>
##$CNST= (0..31)
1 1 145 1 1 1 1 1 1 1 1 1 1 1 1 1 1 1 1 1 1 1 1 1 1 1 1 1 1 1 1 1 
##$CPDPRG= <>
##$CPDPRG1= <>
##$CPDPRG2= <>
##$CPDPRG3= <>
##$CPDPRG4= <mlev>
##$CPDPRG5= <mlev>
##$CPDPRG6= <mlev>
##$CPDPRG7= <mlev>
##$CPDPRG8= <mlev>
##$CPDPRGB= <>
##$CPDPRGT= <>
##$D= (0..31)
0 1 0 0 0 0 0 0 0 0.06 0 0 0 0 0 0 0.0002 0 0 0 0 0 0 0 0 0 0 0 0 0 0 
0 
##$DATE= 1174919002
##$DBL= (0..7)
120 120 120 120 120 120 120 120 
##$DBP= (0..7)
150 150 150 150 150 150 150 150 
##$DBP07= 0
##$DBPNAM0= <>
##$DBPNAM1= <>
$$ [...]
##$SUBNAM7= <"">
##$SUBNAM8= <"">
##$SUBNAM9= <"">
##$SW= 20.6930455092707
##$SWIBOX= (0..15)
0 0 3 0 0 0 0 0 0 0 0 0 0 0 0 0 
##$SW_h= 5175.983436853
##$TD= 65536
##$TD0= 1
##$TE= 683.16
##$TE2= 300
##$TE3= 300
##$TEG= 300
##$TL= (0..7)
0 120 120 120 120 120 120 120 
##$TP= (0..7)
150 150 150 150 150 150 150 150 
##$TP07= 0
##$TPNAME0= <>
##$TPNAME1= <>
##$TPNAME2= <>
##$TPNAME3= <>
##$TPNAME4= <>
##$TPNAME5= <>
##$TPNAME6= <>
##$TPNAME7= <>
##$TPOAL= (0..7)
0.5 0.5 0.5 0.5 0.5 0.5 0.5 0.5 
##$TPOFFS= (0..7)
0 0 0 0 0 0 0 0 
##$TUNHIN= 0
##$TUNHOUT= 0
##$TUNXOUT= 0
##$USERA1= <user>
##$USERA2= <user>
##$USERA3= <user>
##$USERA4= <user>
##$USERA5= <user>
##$V9= 5
##$VALIST= <valist>
##$VCLIST= <CCCCCCCCCCCCCCC>
##$VD= 0
##$VDLIST= <DDDDDDDDDDDDDDD>
##$VPLIST= <PPPPPPPPPPPPPPP>
##$VTLIST= <TTTTTTTTTTTTTTT>
##$WBST= 1024
##$WBSW= 4
##$XGAIN= (0..3)
0 0 0 0 
##$XL= 0
##$YL= 0
##$YMAX_a= 523789
##$YMIN_a= -493132
##$ZGOPTNS= <>
##$ZL1= 120
##$ZL2= 120
##$ZL3= 120
##$ZL4= 120
##$ABSF1= 16.522
##$ABSF2= -4.171173
##$ABSG= 5
##$ABSL= 3
##$ALPHA= 0
##$AQORDER= 0
##$ASSFAC= 0
##$ASSFACI= 0
##$ASSFACX= 0
##$ASSWID= 0
##$AUNMP= <proc_1d>
##$AZFE= 0.1
##$AZFW= 0.1
##$BCFW= 0
##$BC_mod= 0
##$BYTORDP= 0
##$COROFFS= 0
##$CY= 12.5
##$DATMOD= 1
##$DC= 0
##$DFILT= <>
##$DTYPP= 0
##$F1P= 14.0000005364418
##$F2P= -0.99999901652339
##$FCOR= 0.5
##$FTSIZE= 32768
##$FT_mod= 6
##$GAMMA= 0
##$GB= 0
##$INTBC= 1
##$INTSCL= 1
##$ISEN= 128
##$LB= 0.3
##$LEV0= 0
##$LPBIN= 0
##$MAXI= 10000
##$MC2= 0
##$MEAN= 0
##$ME_mod= 0
##$MI= 0
##$NCOEF= 0
##$NC_proc= -3
##$NLEV= 6
##$NOISF1= 0
##$NOISF2= 0
##$NSP= 0
##$NTH_PI= 0
##$NZP= 0
##$OFFSET= 16.522
##$PC= 1
##$PHC0= 79.2281
##$PHC1= 4.589846
##$PH_mod= 1
##$PKNL= yes
##$PPARMOD= 0
##$PSCAL= 4
##$PSIGN= 0
##$REVERSE= no
##$SF= 250.13
##$SI= 32768
##$SIGF1= 0
##$SIGF2= 0
##$SINO= 400
##$SIOLD= 32768
##$SREGLST= <1H.CDCl3>
##$SSB= 0
##$STSI= 32768
##$STSR= 0
##$SW_p= 5175.98343685301
##$SYMM= 0
##$S_DEV= 0
##$TDeff= 65536
##$TDoff= 0
##$TI= <Analysis number 999999
Compound Code 99
Book Reference 9
Project Code 9>
##$TILT= no
##$TM1= 0
##$TM2= 0
##$TOPLEV= 0
##$USERP1= <user>
##$USERP2= <user>
##$USERP3= <user>
##$USERP4= <user>
##$USERP5= <user>
##$WDW= 1
##$XDIM= 32768
##$YMAX_p= 468921629
##$YMIN_p= -167969
$$ End of Bruker specific parameters
$$ ---------------------------------
##NTUPLES= NMR SPECTRUM
##VAR_NAME=  FREQUENCY,     SPECTRUM/REAL,   SPECTRUM/IMAG
##SYMBOL=    X,             R,               I
##VAR_TYPE=  INDEPENDENT,   DEPENDENT,       DEPENDENT
##VAR_FORM=  AFFN,          ASDF,            ASDF
##VAR_DIM=   32768,         32768,           32768
##UNITS=     HZ,            ARBITRARY UNITS, ARBITRARY UNITS
##FACTOR=    0.157963299565203, 1,           1
##FIRST=     4132.6476996994, 0,             0
##LAST=      -1043.33573715361, 0,           0
##MIN=       -1043.33573715361, -167969,     0
##MAX=       4132.6476996994, 468921629,     0
$$ Real data points
##PAGE= N=1
##DATA TABLE= (X++(R..R)), XYDATA
$$ [...]
23854 -1619 -3503 587 2312 -2083 -4650 -3486 3252 10108 17446 13249 6082 7097 3439 2814 -1512
23839 -1512 -2332 1 -2630 -7215 -1358 3570 4907 9 -6129 -2791 5318 8090 -429 -1148 -1701
23824 -1701 1235 4909 4159 4812 3939 3138 2913 3427 4966 3804 3612 686 -4021 -13374 -11385 -1355
23808 -1355 8293 7256 5915 14370 8857 -2459 -7025 -3920 -3518 -4221 -1902 -2617 -6266 -6046 -5741 1139
23792 1139 3146 -4876 -6224 -6765 -4187 3557 1098 -1459 1249 3445 3920 -3755 -5475 -7684 -8960
23777 -8960 -1330 1051 -10753 -12151 -5632 -1026 -2253 -369 449 904 -1940 -356 3479 6233 6850
23762 6850 1560 2790 3526 10084 15951 13132 3033 3265 -412 -3735 -7232 -6755 3053 8461 6337
23747 6337 2371 1363 273 5480 7027 962 -5873 -6771 -7462 -8789 -5422 -5238 -3717 -3515 -4967 -9700
23731 -9700 -9758 -9176 -8084 -10971 -11262 -11501 -6348 -8748 -3956 2312 104 -2954 -4644 -1439 1566 -3880
23715 -3880 -4755 -635 -3066 2461 13050 15950 10944 9731 8429 5978 7936 9206 4135 2246 4330
23700 4330 1745 -2661 -2746 6372 -1438 -11274 -10807 -10815 -9207 -9898 -6419 -3787 -1057 176 -497 3832 2700
23683 2700 4798 11308 12691 11088 4519 5919 4778 3506 2931 -1687 1132 -3663 -4604 -6162 -1690
23668 -1690 -1858 1003 4531 151 8 5416 3199 -1985 -3888 -524 637 1052 4930 10122 6412
23653 6412 5933 6058 6283 4024 6743 735 -779 -3784 -7121 -7861 -6011 -1152 2918 2985 4183 6532
23637 6532 12297 11371 6111 2755 -522 1508 2655 6337 8251 5798 1257 -176 4111 7953 6864
23622 6864 2 -2637 -1571 2757 1621 4185 2941 2634 1712 6787 11682 5981 4640 3941 7658
23607 7658 6025 1424 -1405 2031 2851 11236 15434 14540 10688 8901 10456 3372 2283 1927 202
23592 202 -4485 -4662 -2961 -2347 1589 -2921 -439 -2173 -6551 -7860 -1927 2129 3887 -2076 -5500
23577 -5500 -8737 -4668 -2119 -1476 -814 1877 5025 -3893 -3206 6707 3112 -5287 -11960 -13245 -3789
23562 -3789 -42 4131 -1084 -9571 -5985 -79 1596 -1119 -7648 -9884 -12484 -12595 -7214 -698 2092
23547 2092 2186 2248 1374 -3008 -6144 -75 849 -4942 -6790 1652 828 -1338 -1748 -4527 -4432 -3300 -2680
23530 -2680 -1791 -495 4235 9540 3830 4261 3884 8250 4254 -5257 -15102 -18484 -7666 -2450 428
23515 428 10845 16105 9101 2189 2022 756 -7897 -15912 -15136 -15212 -8303 -4502 -740 2252 -2404 133
23499 133 7159 5021 480 -2805 -215 121 4537 4808 5080 8342 5863 1225 2437 4406 3802 4718
23483 4718 5648 3181 3499 4322 3080 -687 -2636 -9810 -11240 -11628 -11933 -6559 470 4603 2716 6924
23467 6924 1362 -235 1897 3298 3411 6708 5354 -4260 -3016 1905 -3958 -7094 -5691 -3737 -4565
23452 -4565 -5636 -4007 -704 -2727 -2785 -3366 -6377 2185 7773 3306 -4069 -6158 -2991 -5791 -2440
23437 -2440 411 -7094 -8590 -4426 -1791 -1771 -3334 -3201 -5868 1557 2523 -7103 -9759 -9380 -12909 -12779
23421 -12779 -9631 -3471 -10706 -13978 -6856 681 5222 5111 18 -288 1083 -1686 -4098 -8504 -5182
23406 -5182 119 1926 2437 -1079 -5974 -4676 -7096 -252 648 -1041 -2717 -10094 -8291 -4756 -5302
23391 -5302 -4241 -12698 -14900 -13018 -4474 255 -3410 -1780 3881 3739 1375 2778 321 -1525 3797
23376 3797 7344 3278 6623 10547 4022 -2521 -7904 -10103 -11049 -11208 -11528 -8519 -10905 -11608 -8745 -4680
23360 -4680 -5868 -9062 -6228 -3343 -11102 -11053 -3960 2060 2810 -5403 -8754 -1231 5984 7355 3304
23345 3304 4067 4953 4975 -794 -3849 -1105 1635 3580 2361 -4299 -2849 1253 1642 5126 2413 154
23329 154 283 -385 -1910 3244 7862 8533 12754 3954 -5018 -10013 -5637 1390 -1788 -5947 -8798 -5725
23313 -5725 -6996 -4976 -2220 -8441 -14432 -13665 -13265 -9140 -5237 1222 -387 570 221 -2881 -3770 -3693
23297 -3693 -2145 -3110 -8203 -2213 -498 1875 1600 -600 -1583 -2621 809 6835 4442 1234 3976
23282 3976 3788 5455 5808 3626 6676 6009 4980 -676 -7775 -6495 -2070 5298 11135 15418 10377
23267 10377 4446 3316 2262 -363 3631 7069 10818 8635 9221 3230 -321 1471 5084 6235 4677
23252 4677 -343 3475 4304 3529 3628 6781 7239 9575 5204 6392 9641 3540 -3462 -8399 -7515 -7180
23236 -7180 -8576 -5217 -8710 -11871 -15013 -14510 -8353 -9521 -11211 -16246 -16020 -12202 -9017 -4806 -1767
23221 -1767 2313 5187 3861 -4042 -3253 758 3691 3421 -1106 1221 4382 4880 1618 -4549 -7999
23206 -7999 -7348 -1369 9609 12251 9170 3103 -1108 -2311 -1411 -379 1408 4846 5592 1699 -1127
23191 -1127 517 1516 5294 3877 -4398 -709 3785 6025 2364 955 -901 -10423 -10512 -4815 -1415
23176 -1415 -1255 -2308 -3744 -2224 -1822 -417 -4443 -8912 -11530 -10150 -10101 -9973 -4381 -7053 -13397 -6495
23160 -6495 -1065 -769 -2202 353 -1206 -2748 -6933 -8244 -1528 -2336 -7297 -3804 -5814 -7455 -11800
23145 -11800 -14090 -11376 -10067 -18356 -12626 -2053 4842 6137 3198 -3458 -5515 -702 -6187 -8593
23131 -8593 -8086 -6630 -933 1704 3612 7262 5730 3081 -49 -1269 1794 -1318 -4049 -7817 -4963
23116 -4963 1177 14505 16708 12267 12026 9494 4963 -5135 -12365 -9354 -660 8994 10906 7770
23102 7770 7035 10892 11418 7635 8250 7878 5783 -1235 -1272 -1169 -4054 -350 5034 3747 1058 922 -2780
23085 -2780 -2106 -3537 -1505 2962 1494 1606 4293 2367 2070 4939 2517 -81 -1189 -1482 2860 1496
23069 1496 -1358 1364 3048 2724 801 -1865 1722 4482 2487 -3537 -2074 36 -4839 -3151 -714
23054 -714 -4849 -7414 -3022 -4447 -11770 -13883 -11974 -11621 -14549 -18238 -16400 -11563 -9824 -3935 1754
23039 1754 735 1674 8566 10328 6881 5003 4264 2654 2753 524 1508 6209 8669 -78 -1487 -5612
23023 -5612 -2121 2485 -2248 -2969 -4324 2960 7623 1849 701 -1130 -8049 -6489 -316 1146 -1617
23008 -1617 -4302 2287 5849 3763 -431 -2087 -2426 -4513 -4486 -7297 -7667 -2497 -2615 -7516 -6480 -7981
22992 -7981 -2668 2025 -1130 72 4117 528 -3481 -5552 -5140 -326 -4346 -12895 -9649 882 -2820
22977 -2820 -4664 -3530 -2985 -3373 -1589 1982 3191 2879 3222 5966 3925 1534 1403 2714 1804 3906
22961 3906 3661 4618 2120 -1678 -1806 -2537 -820 4416 6425 1044 581 -1832 -2374 -2696 -6229 -9380
22945 -9380 -7892 -4941 -7405 -9351 -9387 -8496 -2089 -6021 -7780 3715 13000 5975 2662 -1380 -3672
22930 -3672 -1216 -3499 -2507 -952 -4116 -7294 -4119 -2675 -697 -93 2176 8123 6843 564 -1090
22915 -1090 -4833 -4377 1550 8360 11242 7749 4964 4436 2178 -4901 -4295 -1731 5042 5158 -4072 -6883
22899 -6883 -4854 -573 4115 8375 7503 9936 7916 -399 -1165 4755 2300 -4684 -5278 -3553 -1222
22884 -1222 -1187 -5647 -4578 878 1945 3236 5088 -2873 -2943 -786 -385 2659 9366 10176 3378 -2337
22868 -2337 -8963 -8594 -6958 -8987 -5317 -4957 -8774 -9962 -1578 -640 3832 1896 -4707 -10408 -7559
22853 -7559 -5180 -840 3389 -4215 -10146 -7605 -4935 -8092 -8006 -6756 -6322 -372 1395 -422 213 2824
22837 2824 1949 -1226 -8780 -8000 -6747 -7029 -3841 -1268 -2111 -12127 -6715 -2342 -2952 -5926 -11959 -11786
22821 -11786 -8500 -11761 -11413 -5802 -6410 -8644 -223 555 5970 4571 853 2819 -478 -3784 -4999
22806 -4999 2236 745 -3202 -1544 3248 5452 -590 -10103 -6135 1094 689 -5967 -11265 -12331 -5809
22791 -5809 -6163 -5061 4371 7914 5694 -5827 -9345 -5481 -3139 -6181 -10163 -7183 -10255 -13476 -6771
22776 -6771 -7026 -4575 5187 7259 3114 -3246 -15843 -17231 -17836 -16019 -12780 -14785 -10023 -5750 -899
22761 -899 -1829 -3090 -7096 -7968 -7126 -5945 -9408 -7765 -1818 -675 1551 -5199 -12157 -9649 -7598 -6728
22745 -6728 -7637 -6428 -6978 769 6504 10243 2122 -7881 -795 -1951 -6329 -6028 -5934 -6730 -9354 -8469
22729 -8469 -1026 -3295 -8024 -6503 -10087 -3207 554 673 802 129 1823 696 3459 7328 5103
22714 5103 -193 -1098 -4967 -7657 -7925 -5103 4775 9842 6807 4973 3992 3640 3833 -917 -6332 -8299
22698 -8299 -8900 -6215 -8851 -12914 -6157 -7043 -6874 -1161 2797 6534 3017 -549 -3636 -11253 -10583 -14428
22682 -14428 -15326 -15006 -14193 -9241 -9910 -7035 2327 -1844 2134 7142 9146 1932 1297 6617 4885 5478
22666 5478 4198 -4430 -6000 -5302 -907 -2190 -7678 -8798 -10259 -8154 -5281 -8346 -14766 -15138 -14120
22651 -14120 -11589 -7062 -5358 -4650 535 7927 14492 7774 8915 13539 19779 17753 16718 10655 5517
22636 5517 4711 4932 8915 8981 4322 4112 1621 539 -473 -2125 -6348 -8913 -7611 -4171 -51 5675
22620 5675 10755 13297 8665 5993 4042 -674 -8609 -7083 -1738 -2792 -4804 -2460 -1007 4320 5331
22605 5331 3039 8655 10161 8796 1496 -1934 -1142 877 -7590 -5601 -6526 -9219 0 4391 5110
22590 5110 5941 6291 4519 5291 5095 2042 547 -313 1484 153 2990 4191 10512 9185 -2845 -7426
22574 -7426 -10794 -9463 -6500 -7587 -11881 -14268 -13008 -8951 -11412 -10042 -3975 1688 -1169 3666 12279
22559 12279 11269 7607 4570 -4815 -5426 4569 -2125 -8137 -5127 -6539 -5658 -3283 -2741 -3999 -2851
22544 -2851 3929 7651 4347 801 434 4084 4702 757 -5777 -7260 -6168 2157 3914 6120 9347
22529 9347 6528 8919 9815 10602 9173 5909 1988 5171 -2563 -6999 -1238 1370 9411 12574 12279
22514 12279 8338 3854 1319 2581 -5024 -4216 -5862 -4013 -7195 -1803 471 -1197 -4015 -11340 -16711
22499 -16711 -9139 -437 5915 13805 13034 5230 2347 -1109 -3336 -1703 -6131 868 4385 5773 629
22484 629 -7553 -4664 -2325 -12 -3220 -2569 -159 -889 -7338 -5767 -5922 -6525 -11175 -15051 -3742 4165
22468 4165 4664 7184 8305 1267 -2532 -330 -2407 1195 1835 4354 2801 2700 -4730 -11421 -5406
22453 -5406 -662 1771 -3234 -4585 -4168 -5432 -5735 -3293 -4524 -285 7632 2071 -10119 -11839 -5219
22438 -5219 260 -784 -4798 -3860 -6856 -1342 3622 5714 -5710 -1537 1570 2392 -656 4092 16361
22423 16361 20423 19439 20472 16733 12569 9550 13836 11137 10218 6670 3292 8030 11921 2975 -1598
22408 -1598 -5349 -4181 -6570 -2232 -823 -1485 -2511 -5266 -1486 -213 -5517 -7989 -6100 -2802 -5582
22393 -5582 -8993 -3844 -2417 -2184 -7043 -10526 -12407 -8504 -2320 5743 4147 458 1023 -1010 -3030
22378 -3030 4135 6335 2460 509 -5012 -5291 -1102 -294 -2627 -5821 -3825 -1171 -1993 8599 14961
22363 14961 15638 13504 7213 5274 -288 3851 7646 6212 163 1410 12 2022 1282 -5744 -2085
22348 -2085 -47 -6211 -6977 -1538 1393 -2834 -3244 -6750 -12080 -15679 -8163 -801 -2290 399 -754
22333 -754 -565 2288 729 -847 181 -3645 -3931 719 90 -603 -3595 -9406 -8454 -8041 -2739 558
22317 558 4931 4855 -4421 1367 4570 4851 -325 -1281 -1246 -5144 -1044 -2180 -4446 605 6544 3305
22301 3305 -510 247 -1066 -7182 -4760 -1412 -4402 -5323 -8092 -9811 -7706 -2653 -146 -2284 -1337
22286 -1337 28 -325 -563 -5 2100 5152 1620 2429 9875 9715 9426 7186 7334 7070 6189 3339 8029
22269 8029 9420 4485 -463 -854 -5060 -5247 -4281 -4217 1470 8988 9410 5564 -572 -2259 -2663 4298
22253 4298 6962 3723 4911 5306 1407 -7082 -10513 -8437 -3645 -2134 -5349 -1946 -4939 -10637 -10999
22238 -10999 -7958 -1676 977 -2478 319 5312 7533 5763 1734 3569 5390 3941 106 -3380
22224 -3380 -4955 -2949 4891 458 -3021 1691 5102 2360 2221 2255 4341 6145 3396 2251 2451 2113
22208 2113 2935 3462 6236 -104 -3837 -1402 -7270 -5399 -4037 -5659 -6626 -8929 -6557 -4871 -4168 1788
22192 1788 1189 -11660 -16907 -9526 240 -3350 -10189 -9454 -2103 -4151 -2596 -568 -2517 -5723 -5974
22177 -5974 1939 7585 6032 949 -765 -3572 -3217 4110 1368 -908 -1145 -783 4284 2443 -800
22162 -800 -6103 -6091 -9870 -8184 -2100 3638 16 -1584 -451 -1465 -1589 -1292 -3426 -10579 -12536 -6051
22146 -6051 -429 2509 785 -2285 -2891 -2143 -5094 -2297 -55 2004 2156 1645 2347 -4990 -19586 -17193
22130 -17193 -14020 -6773 -9789 -10931 -16104 -12205 -7091 -6531 -8191 -7564 -5532 -7484 -11837 -7495 -1857
22115 -1857 1540 471 2474 3162 5438 -2488 -4862 -2711 1268 -4764 -4126 -948 -2455 856 37
22100 37 -1890 -2392 132 -1307 -4773 -2012 -4492 -4895 -439 1358 -1698 -6257 -6548 -4214 -4538 -3222
22084 -3222 -3509 -5489 -5352 -3483 -5285 -8533 -11071 -5317 -3032 -1632 -3394 5858 9385 4276 2315
22069 2315 1668 -7150 -7946 -13375 -18855 -18646 -13167 -10982 -9198 -4640 -6732 -6861 -7790 -3070 -4328 -8481
22053 -8481 -7963 -9173 -1325 1470 -2717 2965 4025 972 1386 -1862 -677 1623 7529 10696 1491
22038 1491 -7140 -3595 1305 4938 183 -7839 -8250 -8304 -14192 -14776 -14067 -17854 -19740 -12783 -1748 5529
22022 5529 6661 3676 -1734 -4112 -6133 -6180 -5509 5155 5998 -2929 -11785 -6005 -1018 4800 6702
22007 6702 10186 5670 3034 2686 -3061 938 -3243 -4274 -7559 -3455 -12665 -18522 -13956 -12476 -7663
21992 -7663 -9420 -5447 -2172 -834 1478 -246 426 6793 11648 2600 -10950 -11151 -6160 -3977 920
21977 920 879 -1046 -6338 -13661 -14818 -10219 -8912 -8175 -7464 -9601 -6855 -12002 -14406 -15017 -10950 -8835
21961 -8835 -7546 -62 392 -1456 -5982 -4516 883 2398 209 -5757 -4969 -4043 -2600 -7296 -15590
21946 -15590 -12503 -10384 -8956 609 6890 6416 -2663 -9498 -9850 -15826 -21059 -20831 -19886 -20444 -22952 -14359
21930 -14359 -8495 -7697 -8152 -10968 -9581 -6648 357 6435 13776 12473 16225 18001 18014 7551 -5744
21915 -5744 -10721 -5186 -3894 -2819 2889 567 808 -444 -4377 -4148 4719 7405 12012 4871 4497
21900 4497 6363 319 -5829 -9775 -5946 -5270 -3699 -8099 -8374 -2912 -2235 -1888 -8320 -14390 -8072 -4315
21884 -4315 -4995 -11053 -10692 -1104 4590 4658 10467 9453 8736 4392 -5540 -6763 -2342 -582 1768 6120
21868 6120 12649 5545 -5691 -5551 -9520 -11298 -532 -4896 -4984 -6502 -7202 -9617 -14866 -9690 -2330
21853 -2330 4242 1881 -1235 -2035 513 -1138 -2996 -7169 -10103 -10345 -9605 -11184 -6502 -6121 -2596 -2808
21837 -2808 -3753 -705 401 2306 6819 4661 7415 14654 13628 7930 4867 1851 846 2192 7411
21822 7411 4507 -113 2803 -1120 433 7029 5302 1932 -644 -2031 -124 -5772 -10409 -6774 -1991
21807 -1991 -3126 -3696 6637 1748 -5275 -297 590 -4757 -8992 -8053 -164 2359 2152 3436 1827
21792 1827 -1552 -725 -380 -4283 -8045 -4375 -2087 -3056 61 -1341 1371 -694 -5568 -9343 -11205
21777 -11205 -6928 -243 6619 5572 3050 -6058 -653 1942 2049 1185 -2902 -5241 -7745 -5512 452
21762 452 3461 3082 -1942 -2968 -5860 -7697 -8407 -14761 -14322 -4607 -1475 -768 -1685 -2788 -2321 -1596 -2320
21745 -2320 1725 3892 4956 402 -6004 -11675 -10966 -8546 -830 -301 -3388 -2535 -4499 -6279 -7890
21730 -7890 -9441 -14495 -13481 -12961 -10388 -13647 -16714 -16556 -14420 -15716 -12369 -11066 -5577 -3319 -1865
21715 -1865 410 2674 3617 4182 -3014 -9743 -15211 -19948 -25773 -21454 -14475 -8555 -9000 -2000 -837
21700 -837 3192 3387 1956 6273 4397 -1576 -5159 -6285 -9373 -8231 -6946 -1035 803 -4335 -7904
21685 -7904 -8422 -10118 -5864 -10097 -8618 -2013 1458 1704 -3686 -8446 -6215 5528 9730 3181 711
21670 711 2323 -1436 -4359 -3378 -3832 -8611 -11499 -14640 -13203 -8641 -1593 2700 5413 -3366 -8664
21655 -8664 -8256 -11150 -7072 -5743 -3992 -5794 -5353 -4817 -184 -1620 -2805 -3370 -5911 -792 -2170 -1912
21639 -1912 3335 7091 4249 6043 2293 2325 -2697 -4952 -3446 3573 4060 1456 -142 -3748 -4859
21624 -4859 1374 2680 2717 5350 1174 -5950 -2969 5699 10258 9114 6544 3163 529 9147 10947
21609 10947 11009 9204 2799 -4118 -3068 -4409 -3116 -80 -11423 -18486 -16229 -13451 -15505 -16535 -15789
21594 -15789 -15523 -10920 -3929 -2001 -3930 -2830 -4084 1186 2422 7451 16149 11635 4579 -2367 -8745
21579 -8745 -10203 -9703 -11940 -11528 -2371 106 -248 4753 64 -4996 -5589 -7618 -11493 -14682 -6283 -3887
21563 -3887 -2514 -6992 -8795 -6215 289 948 7425 5096 2003 175 2570 4402 1965 1078 -3475
21548 -3475 -3627 5374 8384 2296 -1894 -4700 -7227 -6716 -5715 3388 5761 8080 8433 5308 3704
21533 3704 2879 2757 -4193 -1067 -3793 -6820 -5406 527 6759 9425 7516 -1043 -6179 1451 6890
21518 6890 4934 -5344 -14692 -18928 -21349 -16293 -9507 -8082 -5738 289 -647 -3878 -6018 -9676 -9005
21503 -9005 -5363 -3082 -5942 -4097 4050 4304 -3350 -1920 -3830 -15666 -16951 -9324 -1699 -1360 -391
21488 -391 2464 -1360 -2025 -3447 -7729 -7591 -1788 -7000 -8026 -3178 -4306 -2609 -6792 -7355 260 -943
21472 -943 1407 5148 2487 1222 2034 -2471 143 1734 1042 429 2003 444 559 -1211 -1471 -3208
21456 -3208 -5455 2106 3055 3240 2649 1163 -376 -3969 -7259 -10687 -9498 -13559 -16991 -12828 -11115
21441 -11115 -6726 -9060 -4196 -7472 -18448 -19821 -13824 -16900 -11082 -6288 -2068 2193 -2811 -7142
21427 -7142 -10749 -12886 -11150 -5157 -7451 -8167 -10787 -10152 -8789 -10686 -13525 -10595 -7327 -9088 -12510
21412 -12510 -9956 -6130 -498 -936 -3308 -4798 3323 1509 -4999 -13517 -9253 -5615 -542 1702 3648
21397 3648 4932 3021 -1289 -1937 -3372 -1144 325 2153 -3685 -2299 -954 -4709 -1698 -863 -499
21382 -499 4578 8341 11959 3463 -427 -4664 -6941 -5498 -2350 -7146 -5032 -4822 -3495 -2036 -341
21367 -341 -2596 684 933 1180 -322 49 -2603 -1009 2550 -1031 -5459 -4011 4954 6949 5767 10162
21351 10162 9144 7193 5875 -53 -1935 -3982 -3854 -7939 -12049 -16839 -11912 2306 3826 -2186
21337 -2186 -5486 -7436 -3767 -2959 -5553 -7138 -8038 -11221 -10742 2357 1858 573 1020 -1456 -1330 668
21321 668 5118 12915 4401 -2490 1154 -2258 -2839 530 -1929 -1227 -2715 -10483 -11298 -12187 -12115 -10605
21305 -10605 -7030 1127 5185 2369 -3149 -4411 -8860 -10153 -5097 -8254 -11136 -6457 -5268 -4176
21291 -4176 737 -3848 -861 427 3409 4028 6113 5699 10826 14428 7028 1568 907 925 -6206 -7033
21275 -7033 -5654 -7652 -14680 -9887 -10134 -10687 -8976 -10426 -4279 -961 970 -1197 -2582 -2331 -5698
21260 -5698 -996 -5920 -11137 -8031 -8635 -11880 -19840 -20480 -15690 -9361 -4112 -4985 -2980 -358 -619 1329
21244 1329 -2260 -4297 -5378 -4419 -4672 -8214 -8607 -6904 -452 -1273 -3313 -7943 -10463 -11747 -9902 -5316
21228 -5316 419 -1036 -2009 -7877 -11125 -5631 -9553 -11039 -2472 -2262 3196 5201 5273 5210 9573 5984
21212 5984 3354 1734 -4732 -7746 -5747 644 2209 -4246 -1767 4802 6466 2919 -2839 -6380 -3761
21197 -3761 -4947 -9458 -5515 1912 3700 -3 -4464 -10930 -15968 -11034 -9003 -13901 -9496 -4044 2112
21182 2112 2599 -6521 -13079 -12927 -13536 -13197 -13310 -8549 -5991 -1541 5333 6477 6398 1038 -3795 -486
21166 -486 2204 2725 4724 1718 -3395 -3807 -492 4138 8078 7297 2373 1150 429 -240 -6003 -6265
21150 -6265 -4609 2489 6108 3307 -2326 -771 891 930 -205 -4248 -3301 -6699 -13831 -10973 -3904
21135 -3904 -1346 -5192 -10566 -14513 -9307 -11233 -11565 -8776 -2341 -4245 -2197 1057 1733 2373 -1728
21120 -1728 916 -801 -2238 -6863 -5098 -1578 -4892 -13994 -10450 -4812 2054 2752 5223 -664 -3415
21105 -3415 -11004 -5989 861 3729 4824 6648 7683 1947 -5170 -7151 -12782 -10903 -12953 -16128 -6687
21090 -6687 2424 3674 4776 293 510 980 1773 -420 -2286 -130 5415 9367 4850 6565 9014
21075 9014 2768 -5954 -15053 -8549 -5195 -7276 -8963 -2826 382 1965 -3074 -8717 -4574 1638 1428
21060 1428 4885 10163 10119 101 -3065 -5416 -7167 664 -2875 -10775 -12274 -12436 -11753 -8368 -2284
21045 -2284 -1533 -2589 -2719 -2285 -5028 -4831 1277 6715 5686 2328 -2731 -3525 -121 1959 780 2954
21029 2954 -685 -2597 1170 -812 -2491 -5380 -8126 -2767 -6185 -4284 -3593 -4876 -1816 4685 -584
21014 -584 -1425 2854 10029 6561 2976 953 -4260 -7448 -4102 -579 -1553 2401 -2544 -11855 -11089 1670
20998 1670 7917 2676 5217 6543 5932 3597 -4003 -9105 -8012 -6344 -3871 -2090 -2874 -2910 1772 7385
20982 7385 8881 11291 4837 716 -3157 -1147 -3651 -5684 2383 6950 5470 -1461 2163 4689 3789
20967 3789 1160 -2199 -5102 -2316 2185 2571 5026 5683 -2123 -899 -463 -3291 1677 7028 11047
20952 11047 5413 3968 1320 2741 -3547 341 2305 -4891 -7002 -246 -10 -2157 -2224 -910 -3638
20937 -3638 -3749 -9570 -8769 -790 6367 8670 7678 7098 1721 1785 4979 2658 -6888 -6297 -5137 -4108
20921 -4108 -2048 -8981 -12680 -19289 -18744 -15063 -9940 -8488 -8292 -8031 -8557 -6828 -6237 -5836 -4352 -7273
20905 -7273 -7485 -1864 3446 2244 2517 3974 3727 -3958 -12462 -12556 -11798 -12453 -5750 -172 -2136 -5656
20889 -5656 -5599 -7566 -7987 -5358 857 -3911 -3278 -2034 2181 -143 -5651 -6995 -10837 -7915 -2310 -3522
20873 -3522 -5020 -6506 -8408 -3502 666 4198 10725 7282 -2527 1446 2467 -584 1106 1286 162
20858 162 -3979 -1698 -2716 3295 7394 3910 -4040 -813 3465 -3346 -10794 -10503 -785 4353 4846
20843 4846 9688 5748 1355 5455 5125 1376 -762 -1448 314 1013 267 2262 -606 -1729 115 5385
20827 5385 5432 9516 11550 5899 -2871 -5694 -670 3646 5623 5262 4096 2462 4872 7653 6498
20812 6498 499 -192 -2469 -2966 -9098 -9051 -8119 -3839 -1731 -3686 -4535 -3880 -10710 -9338 -1466 7659
20796 7659 4640 1777 5516 660 3243 9519 8911 7914 8214 5829 4768 3090 306 -1067 -4092
20781 -4092 -1610 -179 -6334 -7814 -13587 -11464 -7530 -8505 -4674 -3391 -1738 -948 -1765 4675 1748
20766 1748 -1626 -6376 -6019 -2910 4532 6976 4816 338 783 1974 4716 7909 6537 -1991 -6312
20751 -6312 -4568 3482 4974 7410 -574 -9833 -10811 -5593 1005 -1198 -6170 -6821 -1103 1719 3314
20736 3314 6772 5322 -9820 -14982 -13904 -8451 -5640 -7208 -6759 -4275 -433 -327 -11373 -19406 -18879
20721 -18879 -14614 -17347 -13299 -10258 -5429 -330 -3582 -2341 2111 5291 -2371 -5604 -518 1495
20707 1495 3784 5700 45 -2158 764 -1945 -2777 -3202 -2407 -10120 -5997 -2300 942 -1063 -2781
20692 -2781 -1637 -3057 -9268 -10419 -6308 -5834 -1530 4704 2361 215 -1901 -3354 -979 2172 -2410
20677 -2410 -6497 -9101 -1909 1723 5430 10897 15792 7787 -10014 -7185 2943 254 -4228 -7844
20663 -7844 -6677 -7597 -9460 -6937 -5407 -9156 -10746 -7086 -6690 -4754 3797 9023 6336 7412 1776
20648 1776 -4858 -6291 -7350 -3982 -5078 -13725 -12218 -2219 6466 6638 2874 -4755 -6062 765 2829
20633 2829 683 557 -102 -3276 -12796 -15064 -10753 -8456 -8919 -5819 1733 2804 2421 555 -3825 -15265
20617 -15265 -12312 -8113 -8920 -17160 -26190 -16727 -4516 403 -1347 5813 10593 6221 1321 9726
20603 9726 13536 4246 -3493 -4362 -7342 -6819 -4625 -6351 -11162 -11993 -6951 -5014 -12680 -13097 -3653 -5604
20587 -5604 -5770 -5642 -6905 -6099 -9571 -9019 4952 12630 13710 8731 9956 13061 9769 1943 -3511
20572 -3511 -6070 -2238 551 1321 -1012 -1369 5063 12327 9106 2955 1140 778 2439 6114 4885
20557 4885 -4753 -14098 -6171 -7144 -9032 -11467 -9311 -3387 -5528 -8184 -7328 -409 2063 3274 2472
20542 2472 -1407 -343 -4287 -6121 -1972 1873 3318 5536 1970 -1263 -5325 -8883 -7882 -11101 -12210
20527 -12210 -7098 -4063 -8679 -8134 -554 -2661 1228 2985 -922 -3380 -3530 -1915 -743 -4339 -2657
20512 -2657 -5965 -13465 -13826 -8346 -3877 -891 -2654 -6398 -9524 -11610 -15126 -12968 -9545 -3869 -691
20497 -691 -4111 -3373 -685 -4024 -6092 -1822 -1468 510 -3429 2525 12123 8942 8631 10107 3977 3990
20481 3990 6504 9170 11102 7496 5634 774 -977 3848 7133 7567 3463 2564 1240 -8256 -10558
20466 -10558 -4764 -1977 1602 4777 8217 8239 4744 7030 6925 -5164 -3643 5945 7222 9170 10519
20451 10519 9629 7343 6392 863 -129 4374 3228 8369 6884 7574 8623 7981 9089 1598 -2523 -10358
20435 -10358 -10982 -4926 -2010 -10167 -3726 -976 -5363 2305 5562 -1989 -3610 -9432 -6163 -239 1774
20420 1774 -612 377 -2465 5544 7331 7700 8701 12203 15249 8008 48 -4373 -419 -2142 3673
20405 3673 5298 585 -5271 -394 -4081 -3779 -1615 -3799 -10181 -11795 -10374 -3328 -4505 -7491 -12959
20390 -12959 -15109 -9361 -3337 -4259 -3692 -5592 -7142 -9323 -9720 -8873 -8820 -9520 -4250 -2136 1690 -1902
20374 -1902 -687 -2465 -581 -3540 -3967 -7164 -10330 -8519 -5022 -3067 -1030 2680 -6403 -9982 -2885
20359 -2885 -4422 -3733 -11898 -7124 -1475 -3848 -229 3640 6742 4238 8422 6096 -985 -3686 -1100
20344 -1100 2189 -1569 -5056 -5345 -4896 -5100 -9483 -8147 0 3628 -5400 -7087 -9267 -10930 -12572
20329 -12572 -12597 -9929 -9349 -7958 -2089 -5533 -7201 -8464 -9813 -12719 -2663 8553 5230 -404 -2836
20314 -2836 -5091 -11164 -7058 3799 8387 15919 14678 14383 15497 16672 13920 7797 2507 -5863 -5366
20299 -5366 -1758 2566 7114 2578 998 143 -2309 -7311 -3122 -5109 -4678 -2987 -3050 -3604 810 893
20283 893 -1248 -1018 -2697 -1109 -2669 2425 5143 5452 4570 1143 2313 -1456 -2365 -3769 -1657 3466
20267 3466 6901 6079 -1470 3881 4219 1236 -1471 21 4238 -2742 -6299 -3490 2273 5282 7537
20252 7537 8797 5831 7434 4253 1395 3820 3092 1932 -3927 4903 11546 9977 5284 7269 4985
20237 4985 716 -6192 -12739 -13035 -9634 -2916 3561 4353 6723 6350 5987 2421 525 7281 10216 3370
20221 3370 -4707 -3940 -4006 -603 2357 -2142 -3186 3063 9368 9754 7315 7650 8387 7737 6808 2985 1837
20204 1837 -4647 -8082 -4873 2398 -1563 -7565 -3655 -3334 -6656 -5938 -7998 -5027 -3149 -4388 -8390
20189 -8390 -10790 -12014 -5846 -6196 -2789 3785 67 1274 540 5825 -6667 -8274 -732 -7143 -17458
20174 -17458 -17039 -16152 -8568 -7983 -5301 -6342 -5688 -6450 -5750 2597 7948 7752 3241 -1693 -2934 -3737
20158 -3737 -5733 4098 11327 8201 8260 9897 12386 14211 3799 443 2057 6692 2539 -770 -149
20143 -149 820 -1282 -206 -3346 -3428 -3670 -3759 -187 498 2738 382 778 -4609 -6847 -6279 977 11626
20126 11626 13759 16673 10979 10174 8815 -593 -2592 -7747 -7891 -2891 4616 -1871 -12349 -11462 -4280
20111 -4280 -117 -3317 -8104 -8311 -6704 -9068 -10222 -5265 -2613 -496 -1680 -4963 -2106 -712 1447
20096 1447 -1517 -11720 -12432 -10397 -14812 -10135 -564 1288 3244 115 2611 3892 1288 497 5283
20081 5283 5853 4997 2702 -2020 -3918 -1071 1426 5194 4861 -1690 -5784 -7278 -9070 -9136 -8989 -7383
20065 -7383 -8588 -10301 2234 5598 3130 -552 4464 10297 6809 3059 -1916 -4317 -1127 5745
20051 5745 3300 1700 388 -2683 -2801 -9813 -11274 -10401 -5640 -8532 -8726 -7686 -3779 -4440 -3819 -4888
20035 -4888 2042 3723 -4095 -7903 -9976 -7371 -2405 -6675 -7335 -3470 -2334 -3477 -5341 -5468 -3824
20020 -3824 421 5921 2012 7209 2286 -4058 -7389 -3167 2521 7859 6744 6321 4040 5280 10285
20005 10285 6835 7545 4657 2710 -1301 2128 -3736 -3516 -11821 -9141 -4848 -7824 -5016 -11841 -8790
19990 -8790 -6274 -8239 -10060 -12936 -16435 -20232 -10583 -2882 -6441 -7074 -12377 -9597 -343 -1743 -10529
19975 -10529 -10297 -4228 -3991 -5509 -5004 -2245 -5469 -8266 -6841 397 3480 999 -902 1477 3029
19960 3029 12298 8850 -1086 -3500 738 2208 383 -7187 -11785 -9130 -2669 -1369 2331 6041 1188
19945 1188 -3283 -1009 7758 9951 5829 -1646 -3065 -3603 -4283 -2897 1092 1181 -1638 -3015 -1793 -3595
19929 -3595 -7547 -7398 -5001 -1428 -562 3328 3804 -1088 -1952 -1535 1233 -7595 -14831 -12654 -3827 2234
19913 2234 -5684 -4936 907 7026 8589 3909 1078 1714 -4575 -9816 -8299 -2911 -2142 -8011 -6964
19898 -6964 -105 4051 5254 7891 8010 10270 9059 -693 -11074 -11678 -5154 -9307 -6690 -1515 2956
19883 2956 5559 4554 5287 2500 2193 1898 -4360 -9650 -5304 1492 1290 -1208 -7487 -6000 -5999 -9697
19867 -9697 -9466 -10290 -15131 -17276 -17420 -11866 -7777 -1368 3254 3082 6321 1699 -230 -1610 -7592 -7197
19851 -7197 -4865 -5150 -3691 -6168 -6390 -4424 -9948 -11192 -7515 -302 3973 5559 7273 941 -5889
19836 -5889 -14039 -17976 -12300 -11007 -14976 -14641 -15496 -14421 -5257 -9693 -10620 -7977 -3018 -3011 -13034 -10845
19820 -10845 -6083 840 8020 6259 3882 -1362 -7973 -4647 -4400 -3090 -3114 -7169 -4297 2915 7130
19805 7130 6225 9710 7433 -1497 -10371 -10522 -1874 6227 8156 12199 8674 170 -1005 1077 4908
19790 4908 9546 3921 -2252 -1539 2546 6004 4137 3033 1247 2885 3377 2469 1061 942 2000 6807
19774 6807 5547 -36 -312 7108 9963 1899 -9846 -10396 -2562 2302 5514 5198 4006 4237 3021
19759 3021 6435 8896 4093 -545 8784 10203 4139 2486 2409 -104 1708 2607 1063 -5563 -9961
19744 -9961 -10703 -7660 -4189 -267 -323 756 1133 -3167 4182 10540 7946 1736 1594 11491 14693 13368
19728 13368 17049 15544 6175 615 -3891 -1085 -3617 2830 1087 -8702 -7674 -4985 -6933 -13463
19714 -13463 -12496 -4536 1744 -4520 -5091 -2569 2460 5112 9979 13616 7890 -379 -3931 1200 5166
19699 5166 6897 7567 1874 -4512 -8243 -5418 -6309 -2230 2549 -3617 -7822 -11219 -1053 5549 7130
19684 7130 6383 1697 706 7067 6566 -1272 948 3009 48 -3053 -5333 434 5333 4866 6473 11046
19668 11046 10574 11709 1195 -7544 -6902 -9525 -12804 -9897 -3796 1447 2850 2947 4298 5991 53
19653 53 -5692 -8140 -7532 2631 8663 8066 9947 6826 -1227 -5448 -6968 -4397 -1224 5536 6596
19638 6596 1420 2774 2660 -4362 -2215 -2099 -7313 -4150 -1390 260 1722 -87 -1690 -805 -4264
19623 -4264 1254 -562 -5235 -8950 -10920 -12932 882 -431 -6163 -9228 -11390 -7961 -5517 -4334
19609 -4334 -5270 -5788 -12745 -12917 -7188 -2671 -594 4744 5286 1268 1954 9566 9244 7246 3428 128
19593 128 -298 1238 4848 6638 8264 5330 1703 4942 5330 743 -3399 -9332 -8111 2432 8647
19578 8647 9256 4439 5829 11161 11362 3796 1491 9091 10824 9219 4010 -1533 1662 5425 6752
19563 6752 -1676 -7795 -5582 -10710 -11209 -6894 -13794 -7626 202 -3220 -15454 -13784 -8793 -8252 -9710
19548 -9710 -8208 -4649 -1763 -6370 -8848 -2759 476 -2096 -1440 -796 -3028 767 -2976 -756 -416
19533 -416 -4285 -568 -1616 -9103 -11280 -8352 -9948 -9192 -4765 555 -4049 -5658 -5288 -10434 -11060 -6605
19517 -6605 -5124 -8524 -6649 -1609 4649 10272 10965 11861 8372 5852 -1225 -4787 -539 3770 257
19502 257 958 -1840 -10407 -8324 -3809 -2151 -1194 1487 4041 12613 20399 20501 15572 6096 -3680 -4710
19486 -4710 -6165 -1549 2374 -1437 -5556 -4683 -3974 4304 -3621 -1421 -2411 5111 16841 18427 19431
19471 19431 13164 4681 4889 11559 5156 -5260 -6589 927 6477 5730 4459 -4214 -4390 1424 4336
19456 4336 5116 5730 3641 4505 341 -5801 5766 15514 10132 247 -9398 -2122 2762 2841 1295 -4752
19440 -4752 -10705 -11713 -3612 -283 960 -4107 -395 7104 8964 13223 10101 786 -2454 -2163 -2007
19425 -2007 873 6540 8541 5649 7939 8647 8402 7921 11301 7900 1112 -3539 -8401 -11936 -8337
19410 -8337 2743 3473 7581 10656 9314 10194 6331 4894 1757 -3615 -3792 -6998 -11003 -16524 -12314
19395 -12314 -4806 3601 11078 17465 11496 5549 9828 8915 5447 4138 -3632 -8105 -154 7978 12406
19380 12406 11837 8653 4131 9 -809 -2937 -6068 -1616 1728 2214 3208 -902 2949 4494 -280
19365 -280 1852 8537 8180 5388 8541 12855 3127 -864 5424 10417 10194 7968 6930 -1769 -2313 -2726
19349 -2726 -4210 -8399 -5427 -3280 187 1506 -2041 -5971 -7113 -163 3615 7328 5696 4890 8772
19334 8772 12711 9183 1628 -1246 -1788 -1053 -911 3697 11581 11875 11032 11173 5934 4861 6459 10648
19318 10648 11147 10606 9931 10762 13982 12116 6629 4940 5015 1926 -187 1358 2857 1680 -4430 -11391
19302 -11391 -7741 -6465 -6237 -11864 -21289 -22745 -19338 -9551 -2215 -6005 -4590 832 -1165 -2554 -3408
19287 -3408 -129 -2810 -3123 1442 5081 6726 3303 -5498 -8876 -6364 -2171 255 860 1285 -3660
19272 -3660 -5849 427 267 -6198 -6790 -5103 -2041 -6498 -358 -1332 -4359 -2886 231 1888 368
19257 368 -646 7261 7738 3892 537 -1523 -5630 -8084 -5777 1071 3977 8996 12611 13944 7662
19242 7662 -2370 -4731 -2839 1903 5919 5890 3236 1529 607 -1889 1535 -462 -8401 -9300 -10334
19227 -10334 -8897 -12991 -7080 2560 2903 -8344 -14023 -14037 -7646 407 5968 5357 3539 5193 -1950
19212 -1950 -8780 -14692 -14396 -9094 -4193 -529 5145 11072 11748 14835 9531 1987 -3027 -7601 359
19197 359 -6424 -6203 -7004 -2725 -3190 -13250 -15904 -11285 -7379 -5045 -6401 -2887 -1808 -660 -1316 -9894
19181 -9894 -8081 -2139 -2067 -3026 -2833 -4232 -7917 -4363 -304 1446 -2215 -3738 -636 5048 6458 4319
19165 4319 -128 -2818 -2231 -4026 -162 -488 -1834 -3214 -9684 -13209 -11862 -12060 -10534 -7081 -9725
19150 -9725 -15322 -12114 -7265 -4795 -4853 -895 -669 6486 9145 8712 5878 -7275 -10814 -4504 1651
19135 1651 2851 7522 7143 1929 1375 1185 10518 11019 10586 13799 11567 7662 3768 7527 9940 4577
19119 4577 1833 10109 12131 7690 3422 1629 -1545 -2670 3743 4446 1558 240 4102 3192 -752
19104 -752 -4452 1334 3818 1048 -2158 -1527 1983 5760 4427 3649 5924 7680 8444 5623 5408 6501
19088 6501 5178 8402 5674 3336 3079 5124 3852 3356 7802 7061 -496 -5570 -5095 -3122 -883 -3355
19072 -3355 -3361 -5708 88 1587 381 -93 4560 6837 8552 2410 -4795 -4371 -4320 -3959 -7013 -6424 -2506
19055 -2506 -899 7606 9972 3588 -5171 -7327 -4591 1541 -1427 -2155 2790 6564 2635 1699 791
19040 791 792 -480 -2293 -3037 -8414 -1485 755 -1251 333 1611 38 -5095 -119 7781 7567 11977
19024 11977 11881 9905 7540 1117 1902 11091 10635 7728 8787 4631 -5284 -16419 -12557 -4990 -1049
19009 -1049 2925 -689 2893 13545 15756 13835 10629 6934 3585 281 1637 1430 -2319 -408 -2859
18994 -2859 -1729 1301 1442 -7781 -9819 -4832 -907 -1168 -2353 -8937 -11827 -13532 -5667 1829 -3436
18979 -3436 -680 5646 11143 9441 7032 8620 7279 2122 -5427 -1906 452 7251 5844 -586 2000
18964 2000 4985 5917 13508 17475 15673 11211 5183 4186 889 -6383 -9067 -3578 2411 -1469 857
18949 857 3481 -1662 -2543 -1836 -2985 -6026 -4453 -4172 -3906 2168 9191 14227 16653 17030 15919 9602
18933 9602 3793 2300 1408 1299 -2772 -5855 -6174 -4296 -7495 -9633 -8875 872 7630 7286 10001 9099
18917 9099 7560 1168 454 272 2300 4016 3555 3999 1591 2510 4048 3320 4817 9548 18474 18642
18901 18642 12778 4313 6827 8336 4706 -2129 -906 3236 12304 14232 9626 9871 11245 17099 16180
18886 16180 10907 9802 11407 4926 3768 524 2523 4739 4693 9237 11942 7235 8086 9567 4308
18871 4308 3288 1083 42 7297 15811 10204 9250 10917 14734 14981 15567 14124 9965 11626 12607 11961
18855 11961 18587 14003 7870 3503 -1234 -492 2514 6464 693 -2363 -2954 -578 6511 8918 8511
18840 8511 3761 6116 16014 13374 7947 5878 2312 1680 2586 427 299 2467 7550 8487 6069 3621
18824 3621 5339 1660 -198 -1336 1976 10643 16134 20331 14844 10095 9641 1118 299 9857 15927
18809 15927 14784 8545 5380 3995 4671 7099 8940 14286 12906 9501 9051 10380 9829 8959 11077
18794 11077 9304 8395 5267 5410 9486 12618 10520 9716 9581 5029 6387 4557 3052 1151 -465
18779 -465 3316 3002 -1403 -4250 5425 10183 16613 20979 21981 30894 38898 41082 50942 68183 73284
18764 73284 59273 40732 32213 32365 22963 14493 11322 20766 18051 13236 12161 18789 24931 27256
18750 27256 31049 38839 57159 65854 67275 58660 52213 59108 73526 93705 99603 105334 103852 96193
18736 96193 85479 69691 66074 67705 79153 84753 71630 55989 42422 29353 22242 15905 18281
18723 18281 15552 15399 12012 10647 3930 2539 9190 11947 14509 16670 9244 11411 17179 14364 14571
18708 14571 16110 23363 21962 21620 30130 40977 47946 55236 73087 89231 84760 79962 71232 69313
18694 69313 83624 102880 114148 125894 130728 119747 109267 95482 82447 82515 86164 89711 84238
18681 84238 69309 55571 42846 32153 27139 30646 21498 11072 10544 11090 12296 18013 25866 23831
18667 23831 11443 2487 2772 11290 15514 12412 12214 16557 24142 24480 21981 21904 24540 22310 17286
18652 17286 16233 20484 20925 19272 22576 23504 25085 29841 32000 33608 30820 32258 39097 42170 51169
18637 51169 61931 76570 96809 116195 121804 127535 120223 103661 92768 93280 102912 102577 101766 91554
18623 91554 73240 59844 47112 46326 55336 52676 53823 62605 69316 77131 92632 106910 111002
18610 111002 125042 139221 130212 111473 91588 91593 101937 112652 123378 131551 137514 139676 137996
18597 137996 143501 158414 167872 177864 186588 186601 185057 184573 188332 202527 243378 287590 312273 314885
18583 314885 299765 278529 261476 251802 251093 244159 223950 190631 157235 121386 89505 69411
18571 69411 67713 64934 57571 51471 47267 43262 38606 39031 37289 38381 35134 25958 26872 31827 32341
18556 32341 34114 39213 40481 34324 29526 29207 35062 35805 31915 34132 37194 39890 41740 51324 61357
18541 61357 74181 85396 99205 111763 118849 118548 108082 105821 104924 112668 125247 136643 130385
18528 130385 112642 95333 69830 54955 51043 46789 43410 45952 48401 46624 38000 33085 31260
18515 31260 26902 30498 35180 37523 38948 37945 33610 32725 28067 26808 25623 24607 27951 32145 32798
18500 32798 32621 26873 19272 23692 29825 27720 24839 29094 34270 31144 31442 30976 32544 26952 24933
18485 24933 20582 21685 21858 24395 24896 18894 18483 17058 18469 24545 26905 26603 23230 21794 29099
18470 29099 33350 29037 27541 24034 20184 19667 21599 23810 28572 26213 29923 32635 27814 20755 20761
18455 20761 20621 19393 15697 13556 15492 24151 29815 27624 27134 18052 21665 28450 31752 32371 34770
18440 34770 33330 36519 33452 34435 32818 31815 31982 32355 29130 28625 33351 30987 20621 17368 25423
18425 25423 25249 24206 18464 20079 18600 25900 29299 26060 27651 31054 26743 32516 34810 39307 35620
18410 35620 34966 23300 19392 21398 22478 29926 30097 32811 39988 44953 45046 44223 42852 41314 44564
18395 44564 50437 45057 39590 38304 37817 40246 45271 43013 37306 30164 32793 32976 32730 35049 38631
18380 38631 48339 46186 41187 41746 45780 51620 42817 37069 35722 33587 30368 24947 23972 25692 24167
18365 24167 28645 29423 35546 44323 46631 43213 32567 30027 33485 44622 46396 38523 32796 38825
18351 38825 42113 45351 43515 44030 43888 46018 47982 45180 47091 54418 53539 50901 50643 46152 46138 52089
18335 52089 59018 66511 62788 55167 53881 43023 45447 49332 44532 38651 41941 35048 36324 36356 33126
18320 33126 33366 34915 36153 38291 43169 51509 54763 52877 47781 46147 49032 45411 45164 44343 41172
18305 41172 42552 44775 42733 48468 53932 60580 77586 107467 129251 139277 139325 129940 111505 95437
18291 95437 82051 70559 68783 67347 67185 58603 52709 59040 57714 58427 57751 54999 57827 57858 57100
18276 57100 54261 60134 71326 71247 62780 51561 50053 61696 66754 71522 67580 59158 52177 49976
18262 49976 50378 52675 54862 55250 58807 67192 77878 82848 86409 89490 89010 102512 126993 148240
18248 148240 174124 193213 207711 219975 225036 212224 196458 168354 140614 113944 86037 79836
18236 79836 79768 81626 83465 75280 69355 67775 64012 64660 71658 68153 74272 85976 88237 88676 94082
18221 94082 92482 90221 93853 94250 90150 92302 95710 106592 112399 113707 117636 117240 115330 120715 128371
18206 128371 143862 152118 150042 149299 148134 147158 153578 158852 169204 186352 197988 204393 201268 197552
18192 197552 179862 161209 150682 150253 151354 154986 159649 168104 180680 193567 207306 223434 234513
18179 234513 237592 240320 241416 243361 249852 253710 265521 278110 289071 312489 349883 392269 447304
18166 447304 503250 552050 584973 591766 585469 573076 575318 592717 631924 679324 735324 790686
18154 790686 851351 936144 1042241 1192297 1400601 1705577 2162842 2768196 3407620 3754566
18144 3754566 3664220 3368103 3168424 3262051 3656951 4315819 5269794 6635401 8671669
18135 8671669 11573229 14988809 17805186 18598976 17262645 14923357 13227130 13088331
18127 13088331 14417925 15987329 16067245 14051734 10822124 7763167 5603222 4315881
18119 4315881 3601918 3240175 3108295 3130395 3242457 3419200 3677409 4051009 4635803 5656054
18109 5656054 7484512 10507137 13971533 14389674 11995748 8447586 5880408 4656648
18101 4656648 4155266 4043375 4213645 4684601 5539910 6756007 7933687 8624516 8963281
18092 8963281 9413137 10461605 12425377 15619557 20387753 26517275 32638734 36513378
18084 36513378 36971037 34430199 31066801 29078504 30070701 33772934 37529670 37670856
18076 37670856 32996988 25502219 18214294 12870064 9484304 7462179 6267732 5591851
18068 5591851 5289341 5262509 5345003 5374816 5174332 4712105 4114789 3506335 2991296 2607000
18058 2607000 2355094 2194791 2085628 2013126 1966091 1959909 1987977 2058624 2198877 2407840
18048 2407840 2678993 3012338 3424395 3950820 4654718 5620438 7011352 9066857 11929159
18039 11929159 15303008 18423639 20111050 19915539 18491729 17170392 17257760 19240676
18031 19240676 22301911 24429173 23645329 20101493 15366678 11288874 8597434 7170728
18023 7170728 6565924 6343634 6227393 5905004 5255855 4394915 3496349 2740420 2188661
18014 2188661 1834480 1619483 1484451 1400104 1334421 1273593 1216150 1155666 1085265 1008999 948577
18003 948577 906222 882304 853836 811667 744972 658845 577064 511459 466933 446700 438750 439455
17991 439455 447284 432853 409835 381571 344425 310574 277541 249056 238542 231974 221921 216691
17979 216691 208759 202954 204882 216691 225021 224467 226084 225050 217408 214563 213655 214169 221094 231874
17965 231874 243571 258008 270335 277022 274202 268735 273361 281978 293358 307513 328411 353512
17953 353512 372962 378345 381477 388478 397611 404761 416190 423495 427697 431763 443306 460209 485884
17940 485884 495014 493438 488116 477332 459215 441893 430107 423691 412283 409975 408198 402764 395343
17927 395343 400670 403402 401021 392730 363758 316348 268499 231163 192176 171074 155152 139775
17915 139775 127145 118349 113873 118350 117886 121596 125057 131632 132936 133090 135173 135188 150696 169981
17901 169981 185225 193371 189050 181428 187206 204451 217885 229465 226072 202674 188724 184808 174790
17888 174790 176621 188274 202531 210979 211128 208830 202421 209862 216609 222130 227936 226519 213885 197565
17874 197565 175326 166933 162773 159704 146263 136319 132764 120644 102305 84334 77892 78400 80497
17861 80497 84885 87270 80285 68922 70970 77361 77009 66599 62420 71131 80679 92742 107457 115301
17847 115301 116371 114690 113731 110654 108907 114736 112120 103986 99125 97001 95724 92299 92047 93569 98660
17832 98660 106859 114372 115680 104229 94826 94600 98120 100667 98911 95308 85752 76379 69193 62610
17818 62610 56948 50339 47067 52953 58874 61408 60259 53835 53728 53896 54157 52577 45801 49280 45645
17803 45645 48555 53412 52743 54296 52858 50426 51583 53019 54434 56723 56628 57753 66901 71673 74866
17788 74866 73193 64864 59154 57377 60860 65834 64520 57952 58610 64967 64419 68769 62121 63436 73901
17773 73901 69748 72369 71478 68983 77601 79863 76683 76088 75718 72685 80773 86253 89667 87252 78203
17758 78203 80989 84534 77272 77000 83074 90018 88734 87863 92128 92322 87263 76578 71811 70609 68794
17743 68794 66437 60555 58833 63617 64574 60563 59257 55175 64350 72874 74616 73788 74680 81023 84407
17728 84407 87803 94282 94587 94917 100408 103433 100441 96621 103275 102436 97607 90271 83821 85368 92678
17713 92678 100524 106326 109569 113571 115566 113597 114810 119625 120240 117793 123287 125982 124895 125532 123427
17698 123427 113457 112774 114421 109573 112928 110300 103729 103263 95267 86150 86673 92099 103152 100362 92234
17683 92234 82135 77120 82113 79945 71708 73312 79037 77454 76168 82079 83207 81956 80208 81182
17669 81182 78592 69123 60184 66515 74962 75919 79117 82020 76817 75869 81321 86037 95282 99804 100481
17654 100481 103020 101668 108646 124154 126188 124303 131344 140547 143467 137565 145099 143332 134435 138083
17640 138083 148717 158550 165792 160650 158876 163629 166891 182113 195470 198879 194822 181706 179772
17627 179772 192853 206270 222641 236627 241505 238028 231662 223656 219108 222697 232942 247064 249876
17614 249876 251653 248164 245339 234484 221482 215911 216607 221353 224374 235709 247640 259215 270507
17601 270507 274251 279349 288826 304456 310337 315305 321441 331158 344629 369913 389469 409587 444981
17588 444981 482887 528400 555238 559544 550299 538392 546714 566673 585477 589859 579690 545811
17576 545811 511463 491223 478896 465575 456917 455390 455106 453789 458413 470703 481986 493435 505309
17563 505309 521040 531884 540585 546123 557783 569614 588971 610918 632779 659927 691500 725486
17551 725486 761659 804076 849241 908733 973437 1035481 1095835 1171868 1260562 1370727 1489160
17540 1489160 1631243 1794809 1943973 2079531 2211982 2365806 2581334 2866870 3217646
17531 3217646 3621880 4135197 4856633 5888281 7354956 9285763 11376773 13349874 15521718
17522 15521718 17973405 19900484 21314696 22869013 24719963 26696059 29057428 31370073
17514 31370073 32728751 33468618 33738015 33028549 31787546 30523647 29062843 27631604
17506 27631604 26804334 25897510 23651702 20626577 17616989 14781654 11920848 9246015
17498 9246015 7205991 5886844 5068774 4544594 4197077 3949472 3761980 3612344 3508990
17489 3508990 3451142 3430355 3458585 3542741 3690873 3932881 4278804 4749525 5405594 6325724
17479 6325724 7551071 8913720 10233443 11730947 13475996 15028893 16388556 17901857
17471 17901857 19668272 21807770 24645959 27746315 30041022 32053087 34540412 36629800
17463 36629800 37422683 37862528 38445760 39066007 40161492 41642382 42096303 41613034 41097754
17454 41097754 40570950 39258382 37641051 37010684 38292628 41601300 46661678 53215538
17446 53215538 61351548 70482711 78881032 85487401 90170312 92455319 92722894 92341415
17438 92341415 91796973 90695087 89107247 86405885 80961392 72703786 62935424 53033588
17430 53033588 44157334 37178506 32299288 28679285 25458082 22418618 19507698 16675091
17422 16675091 14001773 11709692 9940839 8652984 7701063 6915408 6231757 5646082 5148038
17413 5148038 4741804 4414517 4172045 3992818 3853953 3759602 3707273 3700028 3768359 3935664
17403 3935664 4228381 4665404 5295896 6179675 7399719 9133713 11579451 14787890 18444524
17394 18444524 22008574 24755520 25984873 25869377 25112442 24419458 24119821 24058951 23547648
17385 23547648 22042185 19672606 16971345 14669571 13316593 13114944 13824152 14962425
17377 14962425 15974848 16351954 16055873 15401050 14758683 14327517 14047408 13547350 12453887
17368 12453887 10756443 8721313 6748046 5093963 3876203 3061512 2514459 2135586
17360 2135586 1862801 1645978 1465781 1325019 1205586 1103598 1018380 945987 875527 810018
17350 810018 750349 702197 661637 624810 587969 557109 519796 486141 459989 438766 420792
17339 420792 402114 382445 364328 350744 340804 331533 318799 310274 302211 294375 291922 289742 290353
17326 290353 285264 279394 282202 285256 277394 268595 259765 257438 256741 262452 266947 263026 255644 254627
17312 254627 261222 266160 258177 244109 232315 230796 221875 212529 213044 207811 204970 211558 216820 213432
17298 213432 209324 202683 197527 196563 193710 197189 195941 196560 197704 199494 195298 190171 188375 184376 175031
17283 175031 167762 161523 158723 153195 152293 152938 152865 149325 143121 143166 137923 136298 137247 135870 127215 124347
17267 124347 125207 124196 121737 116148 108376 108756 106893 100962 102834 92919 88063 88663 88076 86790 82909
17252 82909 80588 81015 84738 86631 97840 105526 104002 100950 102066 106621 109751 110917 108384 103807
17238 103807 100661 95097 91279 91204 88259 82935 87046 81390 77296 76272 75760 74205 74399 76913 80055
17223 80055 81411 82744 83177 77504 78465 77817 76516 79093 78096 69904 60311 56036 51751 50362 58828
17208 58828 61184 58987 54105 50506 42215 37626 46972 47679 48910 50060 46529 49684 47779 48864 55946
17193 55946 55275 50458 52298 52570 44712 36820 37783 42373 43335 45787 41650 34766 33238 39045 48291
17178 48291 53733 46144 36228 35255 33638 29323 29231 34066 33606 29849 27531 27433 29995 36044 36959 33145
17162 33145 31702 35292 33292 28303 27489 23079 15672 15019 6840 3016 7526 16321 17818 13935 10611
17147 10611 13679 17590 15996 19051 19059 19950 23827 15162 7987 4495 5963 8243 11522 18871 12053
17132 12053 3948 4449 5336 4945 6761 9524 12919 10212 4235 1680 1316 -2085 -4214 -3273 -4094 -8525
17116 -8525 -8128 -1506 971 72 2528 1816 2960 7145 8538 6244 3427 -482 -3073 -296 -431 -3056
17100 -3056 -1244 219 3709 3182 3413 2742 11217 15065 17671 19562 12367 10574 16294 17090 9284 532
17084 532 -610 2257 3250 4477 493 -2781 -3769 -3483 -5030 -3924 -588 3836 1540 -109 -3332 3354
17068 3354 7656 8187 11459 12617 14955 5578 -5495 -10966 -8115 -5097 -5871 -4287 -9995 -10078 -2556
17053 -2556 -781 -2780 4918 6164 1442 -3012 -3517 -2533 2484 401 1899 2508 -5377 -9039 -5390
17038 -5390 -3315 -1583 4748 11128 17401 8562 419 7414 14183 15281 14832 9998 5185 10550 15658
17023 15658 17898 24458 24195 30945 36131 43113 50017 61799 78217 90399 100043 112728 120146 125168
17009 125168 139757 146385 153554 166123 166901 167393 171169 169190 163877 158427 147470 128810 114665
16996 114665 106581 100108 96968 91350 78068 57714 40605 33502 31549 26063 20858 17492 17778 18793
16982 18793 15903 14115 5322 3053 8760 12518 16715 15968 14133 23729 34162 37054 49365 65278
16968 65278 79320 92859 100989 118093 134727 145505 156537 172301 190042 218333 238364 260267
16956 260267 285377 305623 317340 322865 323431 314012 304661 297365 291517 290580 295334 304683 312135 317974
16942 317974 328200 341793 351616 360573 366829 364095 344274 330879 321256 309171 298586 287080
16930 287080 274338 264856 251633 241219 236401 237490 231435 212781 197890 189897 168140 147692
16918 147692 144072 141936 139001 128363 113643 99095 81034 61237 46772 35169 25807 16237
16906 16237 14295 10247 5227 12361 22821 25926 26947 22838 17664 21547 23851 25824 32499 35628
16892 35628 42658 52981 56449 58733 74895 90442 106201 112393 105039 104185 107496 107818 108191 113691
16878 113691 113782 102079 95903 89164 85320 87138 92383 100770 110646 110845 104145 97889 99768 99270 95161
16863 95161 92490 88764 74880 61899 44032 32091 22710 16323 6249 4605 2573 -609 3433
16850 3433 6196 -5304 -4814 -4164 -1079 3265 340 -1475 -3327 -2951 -1456 -1217 -1676 5989 10324 7960
16834 7960 8853 11863 12713 11126 6290 5183 6622 8955 6576 226 6737 13743 13019 11759 15395
16819 15395 11458 3538 -2194 -4174 -123 217 3214 4601 9724 9587 2091 -3769 -1290 -4895 -1737
16804 -1737 -80 961 -287 -4758 -2418 -1091 -6923 -5463 -6455 -3024 -2925 -4527 -9022 -5944 -1303
16789 -1303 -251 -1878 -578 -1130 -1129 9752 17745 18515 14791 7142 3643 -5143 -10641 -10583 -5989 -3372
16773 -3372 -5892 -3725 73 3366 7064 4996 839 -5286 -11127 -14658 -4761 5549 1436 -445
16759 -445 4732 7806 3985 -4735 -9203 -4246 -8345 -6811 1995 10468 4617 -1832 -3972 -6746 -13359
16744 -13359 -10573 -5997 -9101 -15241 -16250 -18245 -15870 -9541 -8329 -5850 -6323 -3160 -4539 -8141 -10625
16729 -10625 -13071 -16426 -18408 -8929 -9243 -12997 -14246 -16418 -12805 -7535 -976 -385 -4844 -4554 -4250
16714 -4250 -9211 -11637 -7252 -5375 -6792 -248 519 -4438 -6014 -2685 -2270 -1627 -4020 -7185 -12528
16699 -12528 -11521 -4818 -6132 -4883 -11398 -20365 -25492 -21824 -21809 -11987 -1558 -7405 -14403 -10355 -7012
16684 -7012 -5626 -5357 -4447 1788 5992 7624 8459 4550 -1237 -428 -72 756 -1286 2959 -3735 -10289
16668 -10289 -6369 -4693 -6328 -8745 -8181 -1259 975 -2514 -5255 -4056 -1637 2494 -1323 -3352 -686
16653 -686 -10035 -12454 -12858 -7574 -3178 -4993 2647 6029 -2095 -5509 -2196 -3398 3349 8976 12931
16638 12931 14599 14200 15733 11885 5972 2117 474 1964 4916 6221 1571 -60 -72 2380 935
16623 935 -1944 -1895 -1908 -5374 -8278 -16355 -19187 -13365 -13463 -8231 -7091 -8110 -15520 -15069 -11479 -10657 -8105
16606 -8105 -3808 -3491 -5987 -9049 -10663 -11797 -21101 -25417 -16648 -12669 -16303 -14468 -12246 -12694 -13640
16591 -13640 -16541 -20223 -17742 -7958 -2072 -4223 -7051 -7488 -8928 -6119 -10723 -11905 -6639 64 927
16576 927 -2252 486 6357 9736 7660 4264 5951 2295 -4845 -2798 -2200 769 128 -2745 -1833 -4458
16560 -4458 -3372 -905 3639 7281 10536 9179 4762 5099 3119 2306 -1423 -5200 -6160 -2719 -3347 1244
16544 1244 1589 9921 10975 11346 13477 2501 -744 1282 -3996 -3560 -5709 -8575 -10394 -11794 -5663
16529 -5663 -7272 -8682 -8586 -5911 -4816 -947 2721 1311 -2731 -8818 -1545 591 -405 -4802 -4903 -580
16513 -580 2574 1923 -1633 -4543 -8977 -3075 718 -405 -5277 -7263 -9537 -962 -474 -6666 -12440
16498 -12440 -11824 -11327 -8844 -9479 -5113 -9014 -13124 -12166 -14010 -4634 -2555 -1885 1105 -760 -810 4774
16482 4774 4264 -511 4389 7685 2070 -9365 -14224 -4189 292 -1313 1423 -848 2541 3960
16468 3960 2239 1159 -3009 -6007 -9868 -10038 -6294 -2234 -1759 -2853 116 4575 2527 -4680 -8269
16453 -8269 -3078 -3140 -4529 -3408 -5508 -9557 -6987 -5199 -3723 -3325 -12983 -13971 -17832 -15565 -16015 -12474
16437 -12474 -13079 -3060 -2763 -1275 -7032 -10736 -2809 -4647 -8281 -11443 -7742 -2669 -2400 -6017 -9520
16422 -9520 -7003 -5243 -3968 -707 -501 -5653 -418 4822 6529 6648 638 -1665 -1312 79 1419
16407 1419 925 -7497 -10135 -10867 -8724 -4741 -4101 -4174 -2461 2512 -7772 -7733 -767 -4830 -8036 -5285
16391 -5285 437 -2218 -2396 -869 -7959 -8579 -8616 -10452 -9832 -8254 -9744 -12041 -7132 -5165 -13429 -22998
16375 -22998 -20698 -13644 -1972 -3929 -10215 -8459 -8567 -9445 -4336 4063 4320 3646 2161 -614 -886
16360 -886 -3658 -8109 -2243 4681 3337 -739 -8798 -5688 -5734 -6284 3186 4583 -2316 -8945 -12136 -8014
16344 -8014 -2703 -5334 -10769 -13807 -6856 2246 -3433 -8466 -9180 -3691 -998 -5666 -6645 -1985 -99
16329 -99 4253 8421 10133 9426 2808 5975 896 -7 -6616 -11191 -11879 -10076 -8860 -15906 -14204 -1952
16313 -1952 5942 7513 5600 6187 7598 9089 12852 12452 9552 9157 12844 3501 -3336 -1123 -5157
16298 -5157 -7174 -10648 -15175 -14519 -15081 -14989 -6874 -438 -2276 -6887 -1775 -2009 -7257 -3829 1249 -4926
16282 -4926 -5462 583 -2633 -9951 -7758 -6668 -2451 -1535 -6202 -9717 -9974 -11260 -13759 -18777 -13818
16267 -13818 -6079 -2788 -4391 -2740 -4391 -9216 -7721 -6974 -7307 1680 10308 3983 -648 -2072 -3971
16252 -3971 -8001 -6446 1591 3809 6578 514 -8070 -5816 8779 10709 6187 -1497 -6010 -12769
16238 -12769 -11828 -8963 -10362 -8770 -4661 -6 -1477 -7309 179 430 -2993 -2484 -6853 -10505 -8679
16223 -8679 -7420 -9240 -8830 -6884 -6737 -8341 -5773 -1434 -1863 3701 4698 2457 -407 -3163 -4513 -8323
16207 -8323 -13132 -9052 -185 -1787 -2244 -9019 -446 1589 2251 7814 9827 10380 164 -10228 -11713
16192 -11713 -8350 -5112 -8865 -9247 -6457 -2627 341 -3186 -4050 2016 4023 2167 1085 -4687 -3784
16177 -3784 -6137 -15115 -15974 -13709 -8893 -4657 -13736 -13831 -10314 -6993 -2714 -7654 -9087 -9508 -11474 -8132
16161 -8132 -16855 -16063 -4133 -727 1041 2527 1210 3785 -18 -2385 2338 991 2561 5415 3498
16146 3498 -893 1422 240 2470 9935 7809 -1264 -1217 -6422 -5681 -3605 -3150 -1460 2079 5227 -1364
16130 -1364 -2918 3916 214 -5652 -6528 -2213 -1517 -7322 -6516 -6888 -3930 -4361 -6168 -1861 -6036 -7648
16114 -7648 251 1235 -2061 -3464 2308 1321 -6240 -9696 -7221 -1436 -4367 -9798 -7767 -12844 -16652
16099 -16652 -8825 -3262 304 -2641 -4390 -10690 -13002 -13685 -12201 -13891 -6739 193 -4786 -14002 -15783
16084 -15783 -20493 -13940 -6730 -2808 2166 -249 -1029 1700 1517 -1446 -4655 -9104 -10147 -6244 134
16069 134 9666 13112 8089 5980 4506 -1313 341 -235 -3859 -6306 -9925 -5389 -1477 -1372 1717
16054 1717 3128 -3052 -3017 -64 -1831 -3463 -2026 -6659 -3271 -1430 -3969 -5764 -2489 -3421 -4483
16039 -4483 -9566 -4928 4602 1788 1052 -428 4282 5910 74 -5433 -5965 -7747 -6494 -4201 -5633
16024 -5633 -9675 -10016 -2550 1427 5668 3376 1960 -509 -4558 801 2707 11120 15432 17476 13191
16009 13191 -1454 161 1763 -36 2630 7690 3792 4869 5523 2362 -2335 -7248 -7332 -3689 -1417
15994 -1417 301 -363 -907 -4070 -5172 -3258 -2643 -83 6099 1329 -2731 -5207 -9426 -4412 5154
15979 5154 7731 5585 6880 6798 1355 5044 10524 13870 17082 16859 13117 15962 14857 7737 6597
15964 6597 8350 4734 998 -3400 -4837 -1975 -11183 -10741 -8271 -7009 -9659 -11843 -14196 -14061 -8066
15949 -8066 -1241 -1937 -5354 -6823 2321 3817 2914 3856 -458 -4508 3235 9356 2310 859 6863
15934 6863 13956 15761 11409 3010 224 -861 1586 5723 3939 1665 2651 7529 15171 13464 5131
15919 5131 10319 11665 4619 -1968 -4404 -3197 3406 976 2856 6006 1031 -2299 -4800 -5276 -3919
15904 -3919 1502 5268 8993 4918 -2175 -4554 -8082 -3210 -1216 -1349 2894 1789 -5353 -5292 2162
15889 2162 4634 -176 2322 2207 -382 -3000 -1376 4376 8879 12929 7437 7693 7396 -992 -143 -2533
15873 -2533 -6090 -11194 -12687 -8607 -40 1943 2186 8573 13758 14772 7609 3891 12035 6476 1122
15858 1122 6089 13342 13332 10569 11357 7036 8677 4337 4295 10290 17568 16530 18562 26461 31664 34914
15842 34914 36212 32219 22307 19767 17435 16071 8644 2685 -3752 -6166 -5652 548 3541 -1699 -617
15827 -617 -2245 -8210 -9195 -5515 -8760 -10620 -8762 -10083 -5613 -1045 4063 2630 3337 7029 1374
15812 1374 315 10030 12520 5092 1494 -1521 1690 3220 1250 977 4378 10483 3782 503 -6657
15797 -6657 -4065 -6842 -12633 -10715 -5289 -6147 -5216 -3352 -5130 -2258 6654 10536 10562 2409 -6683 -8338
15781 -8338 -1803 5079 2218 -1033 4612 6799 6252 9612 10206 6712 4527 6875 10795 10420 8015
15766 8015 3264 -2844 -2396 -6850 -5593 -5782 -6829 -4722 -6666 -7182 -4620 -1473 -1644 -4058 -7925 -8931
15750 -8931 -5643 -1670 -97 14 -674 2397 5155 3355 4092 -3063 -3271 -1652 -2365 -8960 -4814 -4214
15734 -4214 -9125 -11027 -12168 -8217 -8416 -7262 -11413 -14733 -11253 -7441 -4788 -10200 -7962 -2418 -7676
15719 -7676 -11024 -6487 -1894 -59 -3536 -6815 -5654 -6890 1012 1107 1035 2189 -787 -3861 -5061 -7764
15703 -7764 -11681 -9434 -3479 5543 10993 8365 2028 1668 -2038 -1957 -5801 -6534 -1011 21 -6735 -3601
15687 -3601 -6333 -3111 7048 8628 340 -9285 -8368 -6620 -5029 -5898 -3424 4663 3956 1175 -485
15672 -485 -2382 -1602 -591 -3482 -3513 -7077 -14120 -17505 -14765 -1901 3331 -1652 -5218 -7241 -3177
15657 -3177 -2308 -4030 501 2288 -332 -4680 -1165 -1519 797 -1453 -497 3843 5499 4248 -4418
15642 -4418 -5142 -10275 -14307 -6344 -1928 -100 2518 8330 13836 13379 249 -10044 -3625 3982 9110
15627 9110 10992 5565 -2290 -495 2043 8300 6625 -913 -2817 -7868 -9949 -5511 -5476 -5138 -4755 -9103
15611 -9103 -5976 5000 3080 6566 894 680 972 -6551 -7962 -3204 -2887 -1527 -1321 1930 4435
15596 4435 2049 1150 876 -4003 -3619 -6232 -9442 -13801 -14354 -1672 576 -6736 -7217 -9103 -10199 -8996
15580 -8996 -10805 -9413 -4056 -1457 1876 7670 7800 1625 -2599 -6456 -4357 -4861 -7102 -5723 -3661
15565 -3661 -3354 -5129 -2064 -4320 1192 8477 6158 80 -1887 -82 5310 8277 2916 179 5616
15550 5616 9528 13739 12141 10744 10127 11114 9180 7181 8026 6528 4791 2970 6657 5518 5258 4129
15534 4129 -3710 -1784 168 -4301 -2762 -1993 2593 6466 6629 5651 4049 -2240 320 3085 6185
15519 6185 4355 -885 -3699 -5847 -5399 -4756 -4915 376 -2640 -2284 -2042 -3261 1411 2548 4387 -3210
15503 -3210 -4282 -8821 -8079 -5329 -192 420 -5381 -6903 -3604 -3837 -551 -4966 -7960 -5647 -1174
15488 -1174 897 -41 6330 8439 7629 1866 2296 5249 3449 107 -1632 5341 5791 7180 3521 -2595
15472 -2595 -6517 -6422 -3244 6221 7368 836 1 -337 -5729 -3134 1064 4603 6639 3668 6751 6292
15456 6292 2743 -1685 6050 12877 13109 9071 8067 9357 12274 11292 5398 3741 2231 3894 8242
15441 8242 10445 6674 -3429 -5309 -3694 -2965 -2566 -5416 -2601 -2061 -11464 -5992 -7956 -9926 -10522
15426 -10522 -5868 3817 8497 7957 4624 2102 64 476 3204 4863 6596 6956 2782 -994 -4232
15411 -4232 -8208 -6838 -6108 -2133 -726 971 7862 12442 8832 2374 -3640 270 5183 9124 6775
15396 6775 10079 8948 8162 5479 4318 1562 876 390 2486 5998 2398 -2400 -5174 -91 1799
15381 1799 3077 -367 -1661 -7425 -10337 -4950 1759 3710 3895 3086 2302 57 -236 2483 1798 2456
15365 2456 -1112 -646 1173 -2703 1009 2351 4422 2609 1798 -2780 -2623 -1778 -2445 -3800 -1874 -576
15349 -576 -3657 -1020 3850 -1560 -8451 -15372 -14929 -13915 -18316 -17381 -10648 -6650 -2276 -5021 -396
15334 -396 916 4205 2664 6 5666 13244 9438 11965 9254 5505 3153 -649 -11406 -11060 1275
15319 1275 -2061 -5223 -6668 -6544 -7552 -9186 -8225 -10042 -9639 -10101 -9324 -174 2660 2891 4546 1448
15303 1448 -6567 -1326 3557 1285 8823 10263 10235 12649 17026 18156 13145 11217 6145 8335 7403
15288 7403 4274 2312 6240 4921 3216 2449 4550 14860 12884 11124 -984 -752 -3060 -2602 -7085
15273 -7085 -12610 -16609 -13870 -8166 -6885 -2333 1096 -881 -3305 -3609 2607 5427 10783 7865 -768
15258 -768 1484 -6550 -8774 -8297 -9171 -6392 38 5797 11578 6215 3124 -2556 -7900 -12255 -6634
15243 -6634 -1592 881 4778 -1431 -1022 4484 3027 -809 -3406 -2811 4453 643 -3079 -5467 -4503
15228 -4503 -3349 -3337 -3470 -813 -142 -5297 -7680 -7788 -1790 3451 2553 4442 822 -1984 -5904 -2721
15212 -2721 4699 8952 9007 954 -1889 -1507 4846 12865 15447 15357 10031 2222 -3989 -4339 -7461 -9675
15196 -9675 -8176 -14318 -5058 774 1473 -24 -2087 -4428 -5083 1210 4942 3430 6390 11621 10976
15181 10976 6399 -3199 -8225 -3854 -626 -709 -12420 -13228 -9071 -1173 -4669 -10214 -6104 -1144 3344
15166 3344 642 2859 6122 2151 3599 8831 6783 3413 5315 8371 6503 12979 12811 3232 -6606
15151 -6606 -3574 -3977 -3945 -235 167 -942 -6705 -6351 2000 5288 -3746 -4669 -5720 1016 7132 7524
15135 7524 3672 2869 5526 5204 5897 2788 1547 2645 4502 6188 4570 2098 -704 -1268 1119 6480
15119 6480 7660 8925 10246 7830 -273 -8603 -5443 -3546 1342 8019 7974 13066 12062 8630 9812
15104 9812 12251 5899 -801 -6754 -6975 3202 7901 3090 798 2828 -1611 -1221 1217 -3181 -5529
15089 -5529 1012 5681 4877 993 -4175 -3230 4100 6971 4376 -900 1545 202 160 5152 253 -4508
15073 -4508 -3098 -1962 9260 6365 -6526 -7075 -3044 2499 11107 4184 4766 1921 -965 2475 6951
15058 6951 7243 9368 6213 4938 1944 7534 9031 518 -8707 -6527 -425 -1198 2247 5539 957
15043 957 -4002 -5959 -2510 2511 4575 8202 10401 12021 8415 1856 1910 3429 2125 1120 5015
15028 5015 348 -6269 -10394 -13029 -11110 -711 3037 -583 -3459 3716 8526 9714 12557 11312
15014 11312 4531 3341 5931 7974 7538 1544 -4796 1356 4 -316 3328 7756 11556 7946 6932
14999 6932 7144 8233 9639 13358 16277 21567 27391 35883 39702 41292 48056 53408 64605 85203
14985 85203 114670 155897 159323 128781 79142 46355 36906 29979 32064 27172 25141 20578 20028
14972 20028 14527 6399 7297 5640 5391 2801 -3017 -1485 5649 7021 4349 7533 14310 15558 8766
14957 8766 8277 2650 3887 6231 3009 2948 6314 10042 10737 1134 -3601 -4652 116 1055 926 763
14941 763 1312 8386 10828 8363 5530 7958 6491 1422 2179 3121 3491 3295 5387 7753 15091 12125
14925 12125 3062 -2365 -1115 7177 7280 1647 1552 2120 6783 5796 4447 3722 2702 826 5701 6753
14909 6753 2715 5221 6670 4465 151 -4054 -1684 1845 3669 3615 2347 1107 601 -4640 -3362
14894 -3362 -673 -5235 -6263 2079 6453 6303 6591 6994 5468 4836 7031 12369 8866 1606 3224 3915
14878 3915 981 -1713 -6314 -5605 525 4441 4889 4929 12848 19657 20282 16704 13339 6819 1869 5871
14862 5871 5885 3003 3783 4889 5851 8628 11648 16230 17103 13897 12001 8429 8431 11604 16657 15362 7852
14845 7852 9194 7482 9552 12224 13940 12667 10550 3067 3011 4856 9953 12546 16053 12966 11453
14830 11453 19817 22345 16638 6856 2597 1939 -3202 3298 6179 8311 2712 -1984 2713 11920 17335
14815 17335 9248 -3362 -5249 -1140 -4071 -7490 -6148 2650 6755 -2020 63 9626 12412 13980
14801 13980 12380 6253 11665 15606 14180 17592 18782 11097 9725 2515 -605 1058 2733 207
14787 207 2108 5166 2760 5520 7216 3947 7335 8282 8773 11152 8244 6988 4263 525 2221
14772 2221 9596 6002 3970 4871 8376 14957 14417 7438 4687 7576 3780 -4545 -6497 -8242 -4775
14757 -4775 -754 1935 3929 14673 11287 9504 12830 12683 15397 11091 10492 14834 21785 17672 11445
14742 11445 5709 3447 565 2097 7249 16623 12000 11141 11047 9494 4048 6615 12691 15521 13964
14727 13964 17342 10911 4907 2007 -1098 -6907 -4541 4189 2801 239 5534 12841 13888 7118
14713 7118 5957 8837 11011 15648 18274 10201 2252 -1768 -5074 -4690 -5039 -6050 -1301 5163 6833
14698 6833 13885 19365 18695 18090 15138 12606 9888 7997 10298 6063 -99 2215 1533 5399 11422
14683 11422 13038 8450 2838 4273 7887 6541 182 171 6199 13063 10081 12056 17154 14484 8949
14668 8949 1442 -4187 2100 9644 14375 13217 10245 6906 7037 6527 14139 17131 21476 15777 10290
14653 10290 7312 11641 12090 13732 13680 5035 2590 4739 8341 9263 13347 13065 14341 11527 8528 8676
14637 8676 5165 7250 5773 8775 10591 6885 3409 2052 5074 11341 13079 15296 18152 16589 13575
14622 13575 14450 11666 5707 7432 13297 15127 19501 10690 11212 13434 11863 13825 17808 17587 20932
14607 20932 15416 12655 13317 10731 5646 1010 1301 8157 10208 9262 9041 10085 10489 9475 9291 11313
14591 11313 13374 12888 8922 4285 6605 8417 14981 17464 17688 13200 11321 16515 17601 14946 17835
14576 17835 17656 20572 14394 13222 15275 16730 11397 4242 -2481 -6148 -782 -5490 -4812 2496 9006
14561 9006 7994 5395 4117 2627 10543 15096 18568 13955 6251 -80 -1789 -5065 -4870 1942 3071
14546 3071 1081 1363 3007 2426 5133 4447 2916 5804 11788 12467 8049 10180 10707 11343 6826 3874
14530 3874 4000 12480 10768 10784 20647 24447 25361 20771 14987 15225 18829 15758 10514 10257 14862 12340
14514 12340 5795 3119 6960 8640 1927 4482 10789 13374 6826 5957 6959 5694 5269 3710 5603
14499 5603 6576 5491 -3020 -3954 -2908 -1805 1565 1368 1677 -3070 -5458 968 4828 -290 -4684 -3601
14483 -3601 3871 17524 23249 14483 9466 8285 9656 15811 16228 14814 11789 11348 11722 7259 10012
14468 10012 15457 22158 16672 13383 15641 14301 11139 9135 12235 18671 26193 23711 20059 14486
14454 14486 12295 12044 15680 18607 10769 1342 5787 11330 11635 13784 11452 10789 11786 8955 6359
14439 6359 11174 16632 23512 22097 21406 15753 15000 14003 15030 10096 4326 5239 4708 8328 7166 6029
14423 6029 6780 9931 7328 8496 13824 14730 11036 11693 13184 9008 4606 3738 5456 8399 10976 6558
14407 6558 -142 -223 -548 -416 2644 -2077 -5892 -4528 -3800 2358 7364 7027 8375 9199 10559 17794
14391 17794 21322 18891 16086 12516 12295 11137 2126 -324 4542 6063 642 -2919 -1507 -2063 -1865
14376 -1865 5075 10054 10778 9318 4676 8318 9823 8806 5751 4542 9328 13336 9137 2165 2402
14361 2402 4900 3636 5543 4868 638 -8184 -9142 -2187 2255 796 -1350 -3922 2627 9722 4396
14346 4396 7140 14397 17950 13205 13195 9484 5659 5065 7494 9431 9799 8706 15764 15240 3570 -1431
14330 -1431 -1790 3263 14442 12182 11518 16548 16079 14934 17711 20699 25947 27820 16700 11660 12819
14315 12819 17907 14250 12281 10315 7465 13595 13697 7753 7888 9930 8772 1435 -2109 -3339 4061
14300 4061 10930 10178 10200 9887 9929 6745 7281 8356 -461 -5347 -1233 -632 1297 8184 6267 -171 736
14283 736 -1359 2938 7786 549 -7016 -6439 -3573 827 2946 5010 7809 5341 1838 -2752 -325
14268 -325 3566 10364 13816 9092 6660 2420 -452 7903 17196 18887 13934 6653 8401 5729 8879
14253 8879 14556 10784 1920 2219 1457 1996 3386 713 -2898 1131 4961 2346 1316 6268 -2643
14238 -2643 -2808 2228 8885 13918 9904 3545 8803 12818 11345 12601 20491 21370 12786 10173 16571
14223 16571 18044 12925 15245 18710 19040 8803 2689 9184 12562 7096 12289 19191 19553 15737 18365
14208 18365 20658 20460 17702 20389 23334 23364 21981 26289 23080 21222 17417 11053 10463 15466 16872
14193 16872 16316 12360 9477 15447 15542 11236 15793 15031 12100 10519 6587 10648 11461 10067 8652 11016
14177 11016 9211 12477 15341 11785 14121 17240 23190 25979 18735 13686 20516 19931 21342 22879 14875
14162 14875 11686 18084 15647 17036 19517 21443 19995 20263 20198 19707 24003 24697 30866 29174 18066
14147 18066 11464 14165 19962 17345 12270 14001 10075 3307 5668 17927 24907 32640 26951 16785
14133 16785 11658 12281 14732 14824 16055 17666 25627 26537 25899 26012 22555 14987 14192 23161 31950 37610
14117 37610 36800 33806 27800 20228 14634 7189 11380 18383 19141 22687 20532 18325 19146 22527 19748
14102 19748 20879 26004 29378 26935 26804 27938 24435 22531 18821 16989 20480 21340 17182 15448 12758
14087 12758 12538 12727 19798 21458 15703 19922 15942 14582 8908 5617 13281 15511 19681 17886 14951
14072 14951 13905 11089 16280 14017 12784 17106 20660 22488 15971 15844 23224 22481 23963 23391 21719
14057 21719 23217 20500 18074 19973 18607 20445 20401 14646 14157 18004 19857 20511 25152 21730 23660
14042 23660 33617 33431 30803 34145 41620 51653 67380 79197 91593 106043 116179 131717 144270
14029 144270 161288 169924 172654 173569 168681 165975 162068 149295 137877 125152 107332 94078 86485
14016 86485 80901 68146 62388 58649 59492 57082 51353 54005 53396 55428 61953 64559 65093 66935 67221
14001 67221 70436 79477 86268 88501 93334 101410 111992 123847 147318 165765 177953 184371 187171
13988 187171 182836 176104 163595 149107 123290 107953 90038 71959 60270 51274 40959 33053
13976 33053 33470 35385 35791 30942 21033 24709 23654 18109 21117 24031 20646 18933 22954 30245 37650
13961 37650 40905 38116 33958 27010 16770 18489 19026 15990 15601 20376 21174 22129 25654 35418 40188
13946 40188 31837 20448 16222 17055 21862 20348 16368 13361 9900 1939 782 4425 8760 14441
13932 14441 15138 15814 23543 22172 23738 19413 15713 14138 18013 15609 15099 15882 15706 21154 25287 31914
13916 31914 30870 17077 14536 17614 19323 18365 14955 12737 17450 18327 19431 21192 16657 20606 24040
13901 24040 26008 24178 25840 25203 29181 24859 17426 24866 28654 27484 31620 34729 26617 18736 20627
13886 20627 22900 24624 22660 19909 18211 10051 4933 7552 11868 17930 20042 20924 21243 17161 19926
13871 19926 17979 22025 21004 25658 30077 30166 28917 29775 30178 30646 29795 27449 24918 26619 25451 25971
13855 25971 22393 23567 21763 14514 11005 18195 28170 24712 25271 25386 27140 31524 33515 24621 26279
13840 26279 24141 25643 29274 29602 26299 23412 19960 19961 16290 14690 13653 13683 15269 20875 25459 28768
13824 28768 25405 23192 23863 20492 25830 35173 24281 22496 26768 24613 33557 30005 24144 18452
13810 18452 15001 15711 13845 11065 15196 13474 12119 18222 20102 16218 19235 17435 15870 20707 17940
13795 17940 20304 26959 28452 19406 14398 14642 13875 13294 13777 19046 19793 16806 7315 9336 9246 11523
13779 11523 7861 13801 25295 28079 27866 26845 24529 20886 25538 28000 28205 24049 20693 25225 28539
13764 28539 24545 16313 14264 13706 15204 14983 16895 24123 26936 28847 28614 24399 26862 31905 30601
13749 30601 28255 24716 26711 32715 30085 25270 25749 26657 25131 18702 18031 18060 23178 31165 30155 28169
13733 28169 30847 27550 27263 27463 28171 24650 25165 24718 27720 30050 28139 30146 29889 26011 27715 15782
13717 15782 12176 16287 14266 14839 19069 26464 20643 18467 28412 24864 15927 12656 15005 19846 32677
13702 32677 42745 40109 38022 32442 30775 29636 27769 26802 34286 33597 34023 32783 31404 29203 31383
13687 31383 35199 38053 37816 36997 38390 36513 33052 33792 31626 34091 41996 42974 45760 50365 49149
13672 49149 49820 52472 50424 54045 55330 65008 80075 86623 87442 93308 103258 122929 148147 183954
13658 183954 240149 304807 379891 455307 536497 618432 685370 726709 735429 715509 667175 596014
13646 596014 503501 402222 311974 239683 186187 147901 122761 106859 95363 83516 74226
13635 74226 72006 60832 55870 45486 38598 45939 43943 40208 42907 43803 42571 42426 45722 45185 39780
13620 39780 41206 45875 42808 41387 38128 30345 25961 33536 37671 33617 34114 37505 37396 48164 49359
13605 49359 44464 37061 31439 38748 37329 36175 39081 40832 43134 37118 38025 48158 53117 49838
13591 49838 45781 41988 39507 38023 40721 39194 36794 35278 41251 46913 47581 44714 39932 40723 39278
13576 39278 43812 45557 43972 43544 34568 31626 36554 30271 30398 33564 41249 42687 39595 38957 39211
13561 39211 36196 37993 37078 32144 34248 36369 33280 32820 34031 35256 36400 39382 44805 41924 33734
13546 33734 33622 34798 35065 42957 40808 37836 34104 32826 28755 28381 32944 41032 38388 42709 48047
13531 48047 50466 53210 54324 50516 41223 35431 25342 27940 26675 26713 37069 40451 32674 29149
13517 29149 31947 38512 38475 34245 31500 37588 40143 40424 36785 34120 29823 28025 23113 19092 23711
13502 23711 31070 42849 43455 37922 35184 31603 30132 30759 32036 28722 26368 28093 33533 25736 26159
13487 26159 32519 39759 48084 55917 51266 45166 40529 41184 37326 34167 38402 39048 41538 42464 42664
13472 42664 41549 46879 46988 45721 51183 45617 39012 34858 37422 40162 39506 39894 40234 37915 34286
13457 34286 32118 33210 30675 32700 37979 38080 35842 36126 37031 39169 39317 44106 40299 37005 39613
13442 39613 42474 41923 40238 38381 37429 44238 47954 53871 43752 37121 36179 31626 32230 30793 31143
13427 31143 31898 34228 34511 40357 44704 44209 48638 52696 48578 43263 44121 49025 57290 57479 50977 50508
13411 50508 50218 52116 55877 55823 53436 48228 37982 33697 40316 42055 39840 44332 45667 38451 37786
13396 37786 38481 36070 42411 45193 42168 43821 50263 51055 49328 42647 47209 42980 35603 48193 59277
13381 59277 54926 51978 49176 48016 36358 35202 35842 37574 44226 43781 42395 40157 37359 41597 46609
13366 46609 48805 53417 55628 55747 51424 50789 41579 29864 29086 37985 41997 47048 50408 52657 55312
13351 55312 56864 55056 48433 44508 46726 44656 35549 37440 42320 44336 49710 55062 56846 56168 52181
13336 52181 52397 49734 42619 40621 45149 46294 47122 43401 42137 43558 43833 34685 33556 38218 44771
13321 44771 53365 54877 48041 50027 50495 40482 37148 40650 47245 49175 48918 52825 57621 58095 52660
13306 52660 47164 46457 43874 42977 48313 53365 53477 50791 46921 43836 43706 45881 49492 51741 53694
13291 53694 56703 52161 46937 45183 44995 46746 44151 48840 51221 48488 50857 58403 63836 60239 56075
13276 56075 51452 39037 36730 41995 45256 44428 38960 41147 51847 55149 60276 60705 51984 55794
13262 55794 61103 61925 60190 58791 60311 61873 63415 62885 60691 62065 63390 66886 64496 57923 53231
13247 53231 59535 59755 58333 58729 57184 54637 54704 52486 52084 60226 60088 49464 49726 47507 57045 60886
13231 60886 56072 51185 50635 51828 49848 47675 48054 46031 49895 57728 54714 53508 55033 59287 67673
13216 67673 73765 69767 66537 65276 63914 59747 63817 60088 60418 56534 56678 57454 60383 59597 63246
13201 63246 66800 62670 69262 72465 74462 79707 77824 76181 75041 70960 75158 84899 74125 64490
13187 64490 65551 63196 65327 68388 65989 66945 68935 66630 59622 66649 75722 81234 76007 75392 77489
13172 77489 78599 83952 87413 84285 75920 72489 66864 64866 70797 73896 70378 67418 70950 79076
13158 79076 80087 86540 88630 87739 75357 70027 68303 71451 72653 67046 61253 61553 64883 72858 78257
13143 78257 85370 93496 87243 80197 75066 62763 56597 67062 83482 86452 80804 78968 76389 72008
13129 72008 67568 67711 75308 72469 67240 76164 85244 84465 79697 74289 76454 84348 88088 85430 81733
13114 81733 78493 74919 75134 72161 77495 88740 96699 103327 109688 118242 128098 137011 145799 152149
13100 152149 169709 184123 195975 215241 235494 263910 296040 331164 386043 459193 562766
13089 562766 696337 878643 1152295 1569436 2096130 2505351 2494992 2071725 1485127 1001133
13079 1001133 697303 519252 410379 341187 299983 269609 246697 220880 197172 186371 177206
13068 177206 172218 169473 166928 158127 143254 141956 142892 133421 120765 117173 115025 118508 115626 109842
13054 109842 106642 110157 117922 117675 111138 102371 102187 102564 97731 95669 96129 97343 98547 101026 103830
13039 103830 108819 109464 100598 90495 87810 83155 80155 76389 79585 81226 84912 83402 86187 89943
13025 89943 95804 105452 104150 103451 100603 99799 100678 97228 99360 104841 110392 113596 112856 109664 101763
13010 101763 99642 97939 100430 104643 106806 104034 101077 98183 101521 110928 110679 112594 110164 109488 114320
12995 114320 114450 117182 119365 112695 108788 111649 117524 123027 133063 132424 126903 119520 130875 147221
12981 147221 148668 139260 131719 135044 135646 134881 112464 95144 86642 86517 84824 103291 130999 149193
12967 149193 154315 152747 143293 143158 144714 144110 141857 139004 135247 128880 130033 142955 143375 144040 150813
12952 150813 161337 166186 179715 195005 208063 214480 222300 227851 227826 226537 221847 227866 223939 222041
12938 222041 225138 227317 235635 254439 292003 356442 442919 542746 663677 819511 1047467
12927 1047467 1399894 1916793 2489391 2812625 2646494 2093741 1462944 980993 682351
12918 682351 513902 415883 352101 303226 265064 236619 228749 232623 228484 210641 202837 206083
12906 206083 214460 226089 244495 265083 290735 321999 349513 359236 351900 325852 300388 284102
12894 284102 281014 282418 272532 268980 270717 276092 281756 288520 298170 288935 266660 251999 247680 241972
12880 241972 226179 202576 179134 156684 148013 152399 150590 141419 143386 156082 166936 179745
12868 179745 193464 201094 202655 201383 206993 210748 218987 214180 196905 187935 179392 181195 177349 174865
12854 174865 168354 146538 123954 117011 118431 130313 152627 178357 211356 242214 267550 282475
12842 282475 275534 255030 243452 239744 234713 233011 238567 236488 225836 210109 198191 190813 194102
12829 194102 212426 237279 261777 281289 313334 361179 418953 495279 575907 674040 816856
12818 816856 1061761 1436581 1720877 1629637 1299113 913502 657675 520297 448423 416542
12808 416542 393512 369126 367307 384255 393824 386920 364766 324955 278302 241244 231894 237449
12796 237449 247542 255442 264899 275866 278075 266070 251804 244579 235679 208883 177842 158804
12784 158804 184514 232901 273243 308853 338376 365364 381681 390591 393856 405456 426675 456163
12772 456163 481150 486750 483226 497281 506248 503050 501603 510207 527941 542742 557713 555907 542986
12759 542986 523780 496830 478630 477529 487618 496132 500520 499609 503411 511374 518931 529706 533017
12746 533017 534809 541837 558262 573739 597389 648172 713190 773520 835479 924390 1043684 1185766
12734 1185766 1336720 1487074 1610973 1698821 1735340 1697331 1594001 1453203 1308081 1183230
12724 1183230 1089117 1019968 968862 936855 936770 956889 993262 1057347 1138238 1235999 1394507 1642479
12712 1642479 1947374 2123274 2026332 1706814 1355793 1101523 965942 905038 861915 842345
12702 842345 841601 841022 844122 841911 843992 871836 915727 966278 1017054 1053161 1073057 1089992 1126387
12689 1126387 1176518 1215585 1250545 1279132 1296477 1320587 1360925 1414668 1479707 1558216 1648232
12678 1648232 1733549 1793596 1840217 1905255 2003601 2124938 2238020 2331055 2425839 2524809 2644475
12667 2644475 2803772 2982612 3181402 3406592 3651512 3922901 4231557 4602784 5066718
12658 5066718 5656027 6409971 7318611 8331242 9477704 10757296 11893752 12645784 13266373
12649 13266373 14261078 16012313 18579715 21797528 25459402 29840423 35720141 43980412
12641 43980412 55251777 69936632 88575098 112377611 144817610 193234695 266996540
12634 266996540 365012795 450473722 468921629 408481348 303386722 202051339 132523111
12627 132523111 91398027 66832853 51081026 40347617 32821763 27491947 23692740
12620 23692740 20926667 18621750 16350383 14119574 12142362 10563307 9342505 8366085
12612 8366085 7511218 6731952 6030310 5454165 5009970 4648589 4308079 3969858 3662170
12603 3662170 3395898 3175212 2979155 2821209 2700409 2584613 2461962 2331352 2207773
12594 2207773 2095880 2016646 1967538 1923565 1841327 1716563 1571904 1440167 1358934 1320338
12584 1320338 1299381 1283447 1277868 1266521 1242967 1205968 1146218 1091529 1062861 1052486 1044153 1032387
12572 1032387 1015291 990016 963874 945932 919369 877653 841388 810121 787860 784249 794054 814630
12560 814630 829165 837777 842137 838143 823503 820651 808733 798154 785222 758515 736280 726047
12548 726047 723086 717682 702263 686065 675108 671728 669099 664139 666499 675889 688315 695008 718270
12535 718270 751639 785116 818863 842285 856023 856830 845280 836282 831805 847943 870561 893528
12523 893528 910822 930983 961222 1006329 1062532 1107749 1136398 1154451 1182376 1229391 1293350
12512 1293350 1366617 1446143 1529841 1619834 1686852 1718771 1727033 1733022 1786585 1912017 2070709
12501 2070709 2204924 2290470 2357584 2446872 2580822 2763126 2961950 3169018 3380429 3570595
12491 3570595 3759739 3959732 4193271 4485377 4867969 5323232 5844280 6434004 7130691
12482 7130691 7988092 9035699 10314712 11922035 13979050 16610603 19971101 24101748
12474 24101748 29056982 35294555 43637886 54899794 69677917 88592012 113090370
12467 113090370 147338260 199587942 279077056 379360756 459191724 467348629 400224917
12460 400224917 292496484 192862621 125509994 86150507 62876350 48034864 38009648
12453 38009648 31120417 26416013 23148297 20574037 18099169 15617022 13333368 11466190
12445 11466190 10009958 8834863 7860987 7060683 6393359 5827422 5349491 4945821 4601686
12436 4601686 4277895 3951607 3624219 3316290 3055843 2846784 2689758 2571426 2463799
12427 2463799 2370059 2295530 2208764 2102123 1985737 1883552 1809805 1747670 1651892 1535442
12417 1535442 1420014 1341922 1301742 1273658 1248877 1218604 1186078 1135805 1083888 1031232 986070
12406 986070 958863 956428 955046 943468 926788 919835 915836 928432 942678 939060 918636 892646
12394 892646 872052 862073 860933 867301 880008 898662 902914 905138 903942 890683 866588 851472 854030
12381 854030 858570 861141 877115 895849 914780 916431 923150 946503 970715 1002957 1040922 1079537
12369 1079537 1119098 1151381 1183272 1222362 1260023 1306435 1366973 1445854 1533048 1621848 1721789
12358 1721789 1834814 1954800 2096417 2270319 2487296 2754459 3075689 3446766 3862885
12349 3862885 4331628 4843396 5405075 6004831 6653045 7344387 8081842 8868504 9708573
12340 9708573 10634778 11714636 13037192 14724453 16945799 19947106 24052009 29694019
12332 29694019 37439903 48049952 62395946 80899069 103079456 127644182 152494781
12325 152494781 174621674 190910957 199086825 198104847 187845666 169466976 145539672
12318 145539672 119377765 93868756 71139670 52559876 38691205 29143286 22888239
12311 22888239 18809393 16055761 14119886 12697482 11592977 10697726 9915746 9180747
12303 9180747 8477211 7797404 7152348 6554442 5994420 5469749 4986704 4556174 4169522
12294 4169522 3797355 3427592 3049658 2686134 2357655 2085683 1883222 1748468 1634925
12285 1634925 1524793 1429284 1337206 1259672 1195060 1138785 1080071 1021355 958423 898891 848302
12274 848302 808409 787007 781068 781111 778835 771565 766470 763721 756442 752642 742864 719412 688894 650872
12260 650872 621371 602724 589270 583793 568300 544123 511662 483545 459916 445244 446347 454007
12248 454007 450327 451462 456290 453551 437853 402428 357109 321480 302693 293987 279900 267599
12236 267599 257190 245087 229827 224501 233284 228764 228600 228405 230262 234249 240279 251795 261113 260948
12222 260948 263251 261693 260143 256380 251111 241699 233825 219759 211523 205524 203696 204023 199387 192841
12208 192841 186324 176405 163987 160190 158482 165731 179115 180508 188743 199336 193713 197085 207641
12195 207641 221091 242586 257028 259912 259613 264074 268887 275385 286392 300262 319564 348364 396325
12182 396325 449060 513729 599359 715642 883503 1140726 1547307 2081802 2527378 2577563
12172 2577563 2187801 1605625 1087321 747559 546534 433216 354068 297379 265078 240776
12162 240776 231556 219884 202295 184955 172288 157694 147900 139645 123552 95573 70797 54244
12150 54244 42638 32766 22851 14271 23498 39192 51864 55401 61476 68870 64680 62556 57092 48482
12136 48482 50220 55019 51280 47436 50463 55641 67892 86702 105542 110503 105655 88945 66306
12123 66306 51027 43843 47809 58272 56765 48927 28907 11480 5112 2743 2112 11765 24920
12110 24920 31698 39907 46317 57154 63726 68563 65029 66078 62489 54874 55091 46997 36292 29912
12096 29912 31172 29066 29576 37381 45427 44558 34066 38250 52462 62732 65412 62792 59363 60691
12082 60691 56710 58881 60557 61504 65069 63112 57984 57870 58229 49642 41888 39566 38284 39756 37399
12067 37399 38946 43750 38776 35073 39013 41068 40306 34040 30576 29898 22814 23190 27197 33257 39539
12052 39539 39107 38992 38730 36808 40923 46516 49749 46537 46089 37278 23845 20602 25596 23891 17656
12037 17656 11275 -2058 -8346 -11393 -8232 -8754 -6730 -8533 -12033 -10444 -6603 8630 18582 25227
12023 25227 31633 33663 39013 33402 37385 43342 39723 34086 25291 25555 30628 39343 48161 54256 62228
12008 62228 72373 80353 92790 122873 160152 210449 270979 344057 437563 558377 734678
11997 734678 1000829 1412731 1995531 2575743 2827992 2594107 2063958 1553904 1266177 1226529
11987 1226529 1430815 1810629 2079170 1925029 1464372 953368 602575 408286 305696
11978 305696 237814 191659 155155 129112 111704 97311 87721 80109 70194 59642 55810 57049
11966 57049 57625 58912 61399 56283 57007 58517 46379 32124 27931 28107 34816 48189 52518 47217
11952 47217 45408 40427 36525 21945 6303 2861 6949 14921 14111 15242 17033 16775 20800 27750
11938 27750 29973 23883 24314 34476 40829 39273 43797 46998 52355 54349 64270 67421 72896 77293
11924 77293 83279 88600 99011 112747 139184 177090 230366 301030 381247 482761 604204 742833
11912 742833 874501 976589 1045370 1061056 1020344 944300 827006 692494 551625 424583
11902 424583 320826 240429 173634 128020 100986 86828 70378 61124 51420 44760 30822 23170
11890 23170 25862 19256 12564 8125 10901 13722 12000 7140 2623 -1123 -8135 -4999 -8529 -14621
11876 -14621 -13996 -12101 -10886 -5309 -6616 -3780 2227 -2760 -6706 -8979 -12628 -11238 -20242 -22658 -23657
11861 -23657 -25014 -20612 -18274 -21099 -23699 -24211 -19440 -14217 -20432 -20336 -15203 -9750 -9186 -11144 -16524
11846 -16524 -12065 -4704 -1509 -3074 -4923 -10674 -11195 -11321 -8025 -5796 -9737 -14550 -11930 -10101 -11276
11831 -11276 -12069 -5492 1147 -7604 -20430 -16520 -7833 -2287 -1356 -5535 -9493 -15622 -19682 -19844 -8164
11816 -8164 -4601 -670 10460 19716 16526 6046 -564 -1414 -2572 -7371 -19241 -22619 -22102 -19387
11802 -19387 -15045 -12396 -10607 4320 9977 5549 1813 2835 2846 2414 364 1635 1150 597 7754
11787 7754 228 -4768 -8871 -8410 -5196 -3384 -2839 5095 22288 31068 33794 36011 27112 17586 8326
11772 8326 -81 -4843 -4645 -2821 -297 546 2662 3675 -2552 -11842 -12200 -10802 -9719 -6619 -16062
11757 -16062 -16314 -16091 -16758 -17552 -18905 -21510 -24803 -23064 -21215 -17076 -11955 -8709 -8873 -9321 -6301 361
11741 361 3553 -2522 -10078 -10317 -14025 -14743 -17861 -23873 -23279 -19002 -20383 -19667 -19606 -22985 -16685 -11879
11725 -11879 -13046 -16456 -11884 -7258 -13903 -19402 -16915 -21827 -25952 -18367 -11689 -13841 -17925 -23026
11711 -23026 -24552 -20285 -20886 -17538 -20245 -15517 -5031 -611 -7313 -8319 -12034 -16242 -13502 -18493
11697 -18493 -23433 -26377 -25903 -27135 -28442 -20372 -17860 -8992 -14511 -21449 -26632 -33056 -28752 -23113 -15286
11682 -15286 -9374 -2163 -1859 -4101 -3184 -576 -2479 -7039 -2074 73 -13104 -18914 -13508 -10141 -11283
11667 -11283 -16365 -16693 -12022 -14402 -15157 -16074 -15364 -15183 -10715 -7043 -7283 -12122 -12332 -6508 -7790 -9374
11651 -9374 -10394 -14430 -21069 -24603 -21822 -23818 -22051 -21989 -23725 -28697 -27645 -24190 -16532 -11796 -7872
11636 -7872 -11526 -11459 -13519 -15935 -11544 -10416 -17482 -19751 -18261 -16308 -13573 -18872 -19162 -14655 -16065
11621 -16065 -19183 -20506 -23179 -21135 -13938 -15860 -20103 -20478 -20344 -19097 -17517 -13981 -12186 -12083 -17947
11606 -17947 -15042 -14225 -14233 -18933 -15667 -12338 -6040 -8129 -12905 -9963 -3892 -9094 -13151 -14944 -14711 -12208
11590 -12208 -16007 -17258 -24060 -23753 -22332 -17601 -17252 -19519 -25084 -24294 -22575 -22977 -20318 -16320 -13361
11575 -13361 -6283 -7902 -14239 -17461 -16401 -20842 -27494 -29157 -22047 -23733 -27195 -22901 -18615 -12473
11561 -12473 -7102 -8011 -12542 -20207 -23748 -28010 -25370 -18156 -11779 -15653 -16086 -12453 -10892 -12139 -13740
11546 -13740 -13444 -16056 -22090 -14549 -13200 -9192 -4541 -8687 -13277 -19707 -15666 -9359 -6770 -16249 -19371
11531 -19371 -16633 -14142 -11876 -10141 -5091 -4435 -10984 -13396 -17867 -14795 -17684 -19446 -20713 -23030 -25946
11516 -25946 -24431 -19979 -16694 -12518 -11804 -16344 -14792 -20813 -19936 -20693 -28984 -32196 -28099 -22595 -18704
11501 -18704 -11961 -14275 -21731 -22434 -17509 -14550 -18185 -14266 -7475 -8044 -15446 -21511 -21032 -18012 -11700
11486 -11700 -14158 -12864 -7357 -14212 -21640 -21707 -25994 -25905 -16459 -13163 -14244 -16848 -11508 -13403 -11936
11471 -11936 -9669 -9119 -14824 -15697 -17513 -16331 -10622 -3736 -11897 -21038 -21640 -18160 -13640 -11213 -11948
11456 -11948 -13992 -22295 -26604 -25202 -25474 -26466 -19482 -17917 -14750 -13385 -20578 -22474 -17299 -15348 -22046
11441 -22046 -25163 -23526 -15550 -15629 -15841 -13242 -13310 -16753 -11059 -1208 -4369 -10916 -19814 -24059 -24851 -24526
11425 -24526 -21859 -16420 -13797 -9065 -1329 -4314 -15184 -16482 -10108 -7776 -10524 -11220 -10291 -10646 -12712
11410 -12712 -15201 -16002 -17554 -20406 -20797 -26770 -24030 -9588 -4594 -8122 -13257 -16967 -14023 -7967 -7460
11395 -7460 -18921 -25530 -18028 -14404 -22712 -30088 -22828 -19933 -19887 -17444 -18399 -18367 -19576 -23082 -19907 -22353
11379 -22353 -26768 -26645 -24821 -18186 -13320 -15157 -22255 -13166 -9964 -8800 -7399 -9009 -11138 -9942 -13128
11364 -13128 -18095 -19167 -20913 -21576 -20454 -15943 -20979 -23628 -24748 -19239 -15390 -11992 -9431 -5700 -3346
11349 -3346 -9420 -12263 -6917 -6553 -15308 -20870 -18568 -13014 -11486 -14208 -13117 -10689 -12641 -12394 -17109
11334 -17109 -18709 -20877 -12310 -12012 -10791 -11478 -12983 -12345 -17218 -12063 -9160 -13083 -14769 -8733 -7016
11319 -7016 -9364 -14215 -11996 -17265 -14589 -12811 -11550 -14323 -17769 -15598 -11458 -13793 -17407 -19392 -20067
11304 -20067 -18611 -17992 -15367 -20420 -20573 -13710 -4770 661 1217 1776 2130 -9652 -18609 -24093 -23774 -20464
11288 -20464 -16893 -15379 -15641 -12818 -7145 -10501 -14986 -15461 -13930 -13305 -6866 6208 12852 7483 -738
11273 -738 -1488 -2752 -5994 -9068 -12572 -19605 -20356 -15667 -15837 -12349 -7385 -5910 -6287 -11289 -13880 -13025
11257 -13025 -4732 -6837 -7373 -10933 -8242 -6794 -9841 -12278 -11671 -13019 -13358 -8967 -13413 -18265 -15531
11242 -15531 -9763 -10410 -13501 -16069 -14378 -12638 -10489 -6715 -6737 -8873 -4023 -2362 -5811 -69 3436
11227 3436 -250 -4209 -6696 -14401 -18981 -14900 -7659 -15933 -16374 -11418 -7204 -7835 -10900 -7916 -5162
11212 -5162 -3653 -10340 -15683 -18062 -15817 -12623 -12495 -8413 -13015 -16927 -18985 -20343 -22148 -26116 -21548
11197 -21548 -15353 -9702 -8607 -9615 -6527 -3948 -14178 -17870 -13893 -13185 -16701 -15308 -17230 -18819
11183 -18819 -16810 -14715 -14941 -14051 -11472 -11251 -12919 -12750 -14144 -14858 -12286 -11742 -5564 -5697 -8333 -9417
11167 -9417 -16599 -20372 -21323 -24450 -25138 -24460 -16954 -9312 -4903 -14739 -18866 -16644 -8067 3046 3927
11152 3927 -4839 -4220 -3795 -6531 -7388 -8387 -12687 -9766 -17914 -26951 -21890 -18810 -17318 -13247 -13451 -16149
11136 -16149 -19825 -17431 -10834 -7722 -9816 -18562 -23334 -16714 -13487 -14064 -11960 -3512 -3832 -5076 -6192
11121 -6192 -9417 -14060 -12721 -15659 -10933 -3700 121 -8892 -17784 -16686 -11457 -9183 -14735 -13050 -14697
11106 -14697 -16126 -8903 -2535 -3712 -9957 -17605 -18763 -14271 -12657 -9285 -16546 -13144 -8583 -6470
11092 -6470 -5861 -10713 -11488 -12132 -12930 -2596 -3449 -8811 -6383 -10222 -7165 -2865 -1075 -4823 -9056 -8975
11076 -8975 -5798 -3338 -24 293 775 4594 -390 -12739 -13276 -12507 -9771 -8525 -13607 -11091 -7145
11061 -7145 -7672 -8832 -9682 -7099 -8100 -6722 -7336 -2986 -6086 -9719 -14897 -19044 -10974 -10923 -16267 -13382
11045 -13382 -8994 67 1712 -4879 -6238 -4996 -244 214 -447 991 1029 -2512 -7617 -11085 -8569
11030 -8569 -9880 -5549 2141 3236 -1739 -2263 -1431 -12363 -15481 -12707 -13711 -9656 -4433 -4016 -697
11015 -697 1107 2871 -5290 -12042 -12973 -10937 -10918 -5437 -805 -1195 3023 -2023 -11999 -6768 -3556 -6012
10999 -6012 -2827 -6397 -2684 2256 -2043 -10185 -11632 -12637 -7802 -11666 -13251 -5318 1982 7030 4353
10984 4353 9547 10520 10650 16042 15601 8837 2338 2402 10742 12656 9834 509 -1264 1901 -19 1346
10968 1346 -494 -3088 -4589 -3742 -5681 -13058 -20863 -17138 -13845 -13068 -10647 -7706 -6662 -4111 -2071
10953 -2071 2188 3905 1725 390 277 3310 6700 7283 3724 -2181 -1466 3146 6752 10485 10930 13283
10937 13283 6730 -651 -2581 -437 -842 -9185 -20169 -20064 -19219 -14809 -13618 -13281 -11414 -2186 -1061
10922 -1061 -3686 -3777 -782 1425 -5663 -8824 -13427 -15443 -9829 -6509 -10200 -7867 581 6796 10498
10907 10498 7111 -3153 -12659 -12519 -12695 -9091 -6993 -3048 -2884 -14329 -20084 -17960 -16493 -16856 -18235
10892 -18235 -18706 -22878 -24230 -18946 -8925 -2479 1898 -2632 -5574 -8473 -10855 -15224 -19720 -22277
10878 -22277 -15045 -15264 -11656 -13202 -9762 -8538 -6740 -1293 4232 1510 4638 6597 8068 12900 13884
10863 13884 10920 7525 7775 9769 6379 3646 1347 1838 -4332 -2456 8610 7405 -195 -8526 -4736
10848 -4736 -3232 -5597 -1662 -687 -3054 -1427 -4512 -7753 -5686 -9001 -15986 -19944 -18442 -17577 -2888
10833 -2888 3062 -705 -4558 -6405 -13199 -16491 -25986 -31513 -32284 -30413 -25874 -23074 -23895 -17080 -14220
10818 -14220 -15446 -14088 -8439 -1432 -4229 -2228 -3617 -10063 -8865 -2742 4871 10892 17290 11797
10804 11797 7205 4510 3850 649 2866 3189 505 -3765 -5873 -9008 -9275 -11356 -13348 -10281 -11124
10789 -11124 7 4295 2697 22 774 3556 7244 10300 11833 7444 5328 7250 -861 -5813
10775 -5813 -12872 -19004 -17442 -9708 -4258 -3447 -3862 -6876 -6801 -5549 -9918 -10087 -3138 4805 4151 -1960
10759 -1960 -8382 -15644 -6792 2201 1916 3301 313 530 4754 2913 2294 1862 1234 1160 10633 23109
10743 23109 23735 18807 14436 13725 15241 12282 8001 6109 1806 3177 1637 5438 3027 3429 4654
10728 4654 4305 518 -2547 -9987 -12130 -5993 3636 1792 -2905 -1674 9316 9559 8196 10959 7004
10713 7004 2634 -5263 -7980 -10289 -7631 2978 10689 11257 10082 19404 26867 30659 31111 25822 23297
10698 23297 33333 36056 33803 30226 23508 17348 4144 -4628 -7369 -4752 -2888 -6540 -12564 -9150
10684 -9150 -5955 -10620 -7585 -2627 1382 5678 4068 -1447 -6771 -13701 -11853 -9053 -6100 -2255 69
10669 69 5368 5035 5104 5320 9376 9207 9320 4877 1208 277 3821 3546 4422 8778 7988 3823 2084 686
10651 686 2458 94 -52 3074 2217 -2656 -1712 -6682 -4578 -8346 -7697 -7114 -10559 -2027 2007 6232
10635 6232 3624 2516 2832 122 -4472 -5687 -5848 -8607 -3827 -4329 -4371 -4766 -1253 3764 5677 4407
10619 4407 -1148 1976 4510 2780 7724 11188 12198 12055 10262 2564 -1093 -4189 -3075 -5806 -6884
10604 -6884 -6184 19 -3167 -10697 -13409 -14745 -11960 -7528 -7911 -9821 -4607 1258 5051 6055 -526
10589 -526 -4615 262 -4908 -9083 -5662 -7572 -2263 -35 -6372 -5244 -9552 -17817 -16625 -17693 -21311
10574 -21311 -18433 -11324 -9830 -6088 -275 -2680 -5402 -2665 3563 10240 18232 9349 1087 -2309
10560 -2309 -6303 -7416 -10578 -9132 -523 7224 7689 -1310 -2708 -634 -3226 -2477 -4822 -2436 -3869
10545 -3869 -3614 3521 6772 2744 5302 6469 2425 6794 8520 11002 5134 850 2723 4917 3407
10530 3407 -844 -1513 -1944 -6780 -9630 -4438 -2813 -4436 -4919 -5373 -8710 -3708 6144 2944 1802 -2842
10514 -2842 -3603 -2464 -2801 -6849 -10389 -12592 -15769 -13192 -7905 -5012 -4177 -2709 3475 3458 2060 -2760
10498 -2760 -3393 -706 -1490 -5107 -7929 -5150 -3281 -611 -465 2479 9469 8386 2423 3545 6031
10483 6031 14509 13876 12458 11979 6725 7260 5632 586 -935 967 4917 5861 8394 8346 9310 4753
10467 4753 3207 2255 4350 7835 12350 8207 5548 10719 10728 13669 15106 19022 19767 10465 7391 9717
10451 9717 11111 14572 19854 21340 15474 17572 21122 24095 33379 33424 29008 21044 17800 18069 16682
10436 16682 8600 11321 17360 25296 30408 26284 17074 20161 19540 20839 25906 22717 15173 13520 9939
10421 9939 11084 14908 13826 7459 8985 5956 3674 951 1739 3332 -2905 1447 -1698 -6153 -7676
10406 -7676 -11857 -16434 -13413 -8171 -7069 -9425 -8604 -8799 -1843 190 -764 -723 -4089 -5668 -7344 -9699
10390 -9699 -18149 -21812 -12339 -4830 -1602 -1517 -3869 -2630 -347 5850 9154 4102 2512 8095 3540
10375 3540 -638 2601 6548 10329 10584 8682 10981 8007 6637 5064 5057 -761 -3207 -8556 -9630 -4266
10359 -4266 3942 4881 -2869 -6524 -1991 3089 3225 -501 -7015 -10970 -10196 -8753 -3614 -5502 -3088
10344 -3088 -5781 -7511 -1478 274 -3617 -425 2001 2376 3526 5395 -811 -5612 -2956 3085 2605
10329 2605 4106 2340 -365 -3504 -682 -1556 3215 6849 1011 1056 4118 9336 14480 12465 10906
10314 10906 11058 11879 9525 2024 3253 5409 1668 3703 13259 15876 17157 8516 -344 -1540 38
10299 38 -2351 -2929 -5715 -3302 -3483 -2974 3388 2888 -2267 -6742 -7202 -3777 -12404 -18494 -15706 -10865
10283 -10865 -4819 -4721 -5986 -4017 4292 -783 6670 4663 2019 5626 11218 17054 26708 33923 35139
10268 35139 28275 27561 22805 20432 18453 13962 22363 22001 9124 408 -6340 -12337 -15184 -14420 -12339
10253 -12339 -2614 2269 4604 5281 5802 7586 -1052 -8557 -4690 -4423 -1425 899 5632 3476 -1947
10238 -1947 -11510 -16507 -4748 2021 825 -99 1603 8965 6709 4363 2688 -6048 -18956 -21763
10224 -21763 -16244 -4373 1088 10569 13546 10078 3466 6408 3178 2882 992 655 1255 10538 10683
10209 10683 4691 5668 10962 15778 19246 20319 16359 13400 12459 11633 5623 -1170 -9943 -12456 -9742
10194 -9742 -7203 -5751 -2540 -2823 -8451 -11870 -9609 -6506 -981 -1081 -6825 -4944 -671 867 3046
10179 3046 3658 2746 6438 9356 9696 9744 9591 9256 9814 9504 5801 7977 7361 -1435 -3751 -4205 -8341
10162 -8341 -14308 -13512 -7078 -7612 -12723 -17091 -14685 -13228 -14845 -15369 -16919 -18887 -13564 -11837 -10630
10147 -10630 -9591 -14354 -15728 -9832 -7263 -3859 388 -762 -6014 -5648 -4890 -8415 -14087 -15585 -13577
10132 -13577 -14855 -9089 -2348 -4654 -6149 -539 -1319 -5900 -7908 -4786 -6841 -4059 294 4196 -2444
10117 -2444 -5544 -6825 285 1669 1020 -4517 -6227 -720 -315 -1118 4204 5223 7114 15439 21268
10102 21268 21481 25300 27147 27351 34590 36050 28281 29008 32676 36104 37555 35452 48768 64014 86065
10087 86065 104301 119944 125266 112952 87023 59751 44077 33520 16755 5121 7340 4427
10075 4427 -6159 -6607 3889 8358 7635 7615 11319 11038 5644 4615 8896 12493 8338 2667 7633
10060 7633 10371 11796 16481 15556 18014 21011 18068 19779 21804 18108 20590 30199 45336 62855
10046 62855 77548 68626 52323 34910 19089 8060 10679 9206 4856 10537 10094 11841 9954
10033 9954 11802 14728 7805 4793 2345 1728 8518 9803 2417 1728 3511 4222 -5308 -696 2953
10018 2953 8844 4950 286 -2439 1400 -1408 -471 4621 10092 5673 3770 2929 631 -2959 -672
10003 -672 4290 4060 853 -5044 -8816 -6723 -5226 -3584 694 5554 2988 5320 13335 13567 11433
9988 11433 7437 8631 10148 18943 35089 49361 53849 58349 68657 73899 66604 57351 42765 25610
9974 25610 14760 11280 14149 15739 12105 8803 8697 5203 5604 2046 7332 8329 7474 5154 -442
9959 -442 -13363 -19689 -14880 -7495 -2935 -4476 -5093 -7521 -4860 -6463 -9726 -3968 2582 4901 13548
9944 13548 25507 25665 18198 14400 11502 11777 10660 12403 8054 3060 -670 -4566 -7998 -6944 2218
9929 2218 1758 -2215 -2345 608 -5510 -7089 -8540 -12213 -7676 -316 -1141 -2337 3000 6138 16 -7436
9913 -7436 -5921 400 4502 3314 5322 -2117 -7826 -5885 -733 3866 6283 10242 5685 4090 12222
9898 12222 15752 14602 12912 8405 10192 8861 4466 7131 10445 13045 15533 17876 11829 5023 -3165
9883 -3165 -5278 -3221 -1153 86 -2831 1358 882 -1123 -175 -2778 -1460 2560 4548 86 -1772
9868 -1772 -3666 -2388 2562 4185 3598 7925 8954 11469 18155 21731 22910 23173 18461 10050 9737 12150
9852 12150 11843 12677 9657 3375 -2040 -4970 -4182 -3675 -4062 601 9527 10468 10325 9408 3768 8856 9057
9835 9057 6922 4116 3516 -2998 -6992 -6686 -6862 -8984 -8328 -7872 -4417 -6990 -5290 -7569 -10102 -13776
9819 -13776 -6088 -1528 708 2354 360 -1270 2273 7355 5825 7548 11586 13347 8964 5319 8792
9804 8792 20465 20489 13013 14020 13658 23653 26821 19902 14599 14693 16276 15581 20640 23614 20646 12928
9788 12928 8541 8515 11207 12530 8589 7856 12647 17973 24337 23793 30184 32439 34898 41258 46839 52113
9772 52113 53403 63312 72745 64394 57668 51295 37497 30547 28845 25640 20751 18852 15767 13045
9758 13045 18559 16881 17044 21109 15307 10992 3872 2913 4752 -1988 -6935 -4373 3585 2863 -962
9743 -962 467 4148 1077 -4032 -4058 -4765 -2011 6815 6146 3916 -1390 -2671 -3262 5180 14464 18853
9727 18853 13752 7407 2385 -3570 -3097 -1387 -3862 -5136 -3191 -6177 -6633 -6440 -6721 -9705 -7630 -6439
9711 -6439 -1497 -2433 -1183 2371 4488 1402 -891 7078 9928 11093 17362 17975 13745 9262 7101
9696 7101 9712 13237 16080 10240 14866 20354 23406 25330 26300 27256 26058 30269 35901 31132 24504
9681 24504 21960 20513 15972 20622 22286 23835 25371 13275 7724 15416 19632 15062 14008 18641
9667 18641 27366 30783 32713 38360 42343 42238 48641 50086 39402 37920 37798 28962 23928 22914 20421
9652 20421 22154 22623 19941 17039 15898 14619 12422 16564 24249 26736 22854 15402 10889 5000 11861
9637 11861 21557 24825 21597 21277 24968 33217 38437 44061 42709 45105 52966 58080 61918 67070 66754
9622 66754 68574 63106 58140 49559 40621 34341 28401 18865 19630 19241 14450 13355 14150 17777 23334
9607 23334 25992 13674 8870 9604 7193 5408 11250 13825 13131 9982 7638 10012 13296 11642 21447
9592 21447 28238 25142 24297 27903 25750 27753 32140 33053 27867 25087 20726 20695 22561 25203 19672 11335
9576 11335 5762 4688 -91 -7559 -335 3118 6667 7128 10294 10319 5089 -2211 -3600 1044 3495
9561 3495 -1296 -4744 -3165 -708 -5484 -11288 -9796 -5965 874 1918 1207 -1398 -5199 -2984 8209
9546 8209 7458 2341 -1757 -8319 -10848 -8266 -4328 -5267 -2978 -3142 -7087 -5235 -6320 -5904 -1339 -4050
9530 -4050 -1089 960 -3436 -7335 -8055 -7960 -7466 -5465 -4460 -3217 -435 3106 6118 3822 -513 -1960
9514 -1960 -5506 -3708 2835 2604 525 -2021 579 -1016 -8304 -11308 -8092 -1305 -360 -5560 -6541 -6521
9498 -6521 -4714 1404 9081 2463 -10905 -11271 -5898 -3085 -3456 3595 2015 -1511 468 -2486 -1509
9483 -1509 3735 9221 5085 4153 -2243 -4307 -1801 5288 9761 4173 608 -4345 -3029 -1554 -1715
9468 -1715 -1297 3082 4577 -1519 -4981 -9118 -8114 -7093 -5837 -3862 -1305 -2418 -10846 -15333 -5448
9453 -5448 -5162 -6357 -720 6240 9600 4158 8416 6058 -52 1302 5278 5696 9997 7957 3414
9438 3414 4390 -1445 -6650 -8898 -13636 -15956 -3235 1477 -829 -410 -4170 -4832 -4902 -8080 -7031 -1332
9422 -1332 -1334 -2907 4568 11574 9905 3054 -1829 5343 10239 16119 15185 9492 4090 10795 12931 12531
9406 12531 6175 -2270 -4375 -4742 -3064 -5338 -9495 -6034 -2986 -4314 -3646 -4187 -3755 -537 -7366 -8222
9390 -8222 -1895 279 -406 -1710 1804 5416 464 2415 164 -1627 2933 -3605 -3458 -1465 -1974 673
9374 673 3217 10867 11393 3924 -2953 -8852 -148 598 -3218 -7028 -7760 -3601 1440 -1446 -3031 -10801
9358 -10801 -6290 -4402 -2632 1237 4403 5257 9830 14178 11581 640 -6362 -3220 -2562 9279 10562
9343 10562 8560 4398 -503 3622 10977 12125 15644 13312 21318 19784 15512 22311 22809 22870 27974
9328 27974 33996 32713 24865 21785 20531 24401 31274 40742 40340 42925 39779 28206 27515 39914 48085
9313 48085 54545 50199 43723 51793 62351 65522 76995 75530 70550 74252 78493 93361 105556 121411
9299 121411 130383 142095 161041 182259 198456 220840 250808 286000 342056 408120 473573 555917
9287 555917 670805 810340 973889 1174000 1427807 1752208 2136274 2576319 3013258 3308709
9277 3308709 3325063 3043513 2582721 2090722 1654740 1308408 1043909 844877 690027 571998
9267 571998 493422 426758 372019 328540 287302 259315 241412 226738 216073 211969 219926 245562
9255 245562 282905 306823 289805 246551 190863 144492 111485 93871 82735 77211 75061 67719
9243 67719 63645 60455 55499 50843 53109 49319 41949 36599 34196 29192 26589 28246 26939 23717 20021
9228 20021 23513 26823 31628 34103 28393 21525 15349 19091 18193 24638 23953 13470 19568 20370 18887
9213 18887 19886 19161 17819 13965 15602 17824 8782 3212 9750 6680 7733 14154 21308 17919 12707
9198 12707 13966 16234 12742 8524 14196 18737 20708 27899 24925 16344 7000 4762 2694 195 -611
9183 -611 -3927 4709 11101 14796 15799 11739 13036 7523 7203 8711 14771 16865 14499 18338 13893
9168 13893 11164 12144 9386 11337 5668 -4337 -10148 -4574 -4227 86 9045 15997 20156 18840 15516
9153 15516 9788 1974 197 -3284 -862 5894 3466 7357 10021 3758 -1547 3490 7440 1862 -4227
9138 -4227 -1458 -2521 2274 1322 -1772 3121 2073 -1199 -3790 -1617 2035 1614 -2672 -6869 -8772
9123 -8772 -2666 4703 6001 5102 6162 4481 1682 5950 9105 9562 8633 11314 7285 11641 9333 4853
9107 4853 10840 5669 1268 -2840 1868 7935 10256 14577 14646 5120 10917 17540 14868 11161 13452
9092 13452 10241 7587 5082 6658 12910 9872 4582 2349 4572 4150 4529 1263 250 -2593 -4814
9077 -4814 186 -1951 -7720 -9308 -10805 -6354 -856 -1201 -6295 -5078 -327 2440 1987 316 -2266
9062 -2266 -3935 -9399 -10984 -4095 -3759 -10929 -14904 -10161 -5275 -787 6229 2360 3918 4471 3906 -3714
9046 -3714 -5816 2957 9193 5771 -1009 -1654 -2099 5142 3860 9478 10954 5850 -1063 -7003 265
9031 265 6345 7273 5049 2111 9922 12007 11812 5459 6498 5984 5271 5918 2702 -1149 -2221 -1555 -4382
9014 -4382 -9507 -5634 -1649 -1047 484 -3704 -7383 -8163 -11876 -8030 -696 3078 3141 344 1189 -1973
8998 -1973 -5252 -5440 -915 -3049 -3947 4283 6184 1205 -997 -3 -3417 -5103 3552 3780 -1237 -5565
8982 -5565 -7936 -2918 -488 -2045 -4296 -5179 -586 4928 1465 -2545 2147 28 -2350 2511 -3406
8967 -3406 -4769 -3959 -10042 -8365 -4162 1777 2920 -264 -482 -4577 -8104 -5733 -4717 -645 -3891
8952 -3891 -2340 199 4054 9801 9444 -1501 -4238 -2890 -1757 2939 4435 4503 -715 2135 11543
8937 11543 8261 5742 4039 -2585 -3878 -5815 -5657 -4776 -6827 -10681 -8245 -8061 -12588 -16844 -19367
8922 -19367 -15440 -10488 -6329 287 -1966 -7367 -8153 -11642 -7791 -3535 -4608 -1726 -219 -3389 -1998
8907 -1998 -2506 -5180 -10055 -5229 -413 -499 -4331 -2649 -2789 1900 451 8440 11919 13309 14364 7963
8891 7963 5526 7049 6138 5480 5156 9860 17053 26611 26836 23957 24050 31098 39759 50575 62061 71435
8875 71435 97263 129209 157649 174264 163852 133655 95785 67777 50009 34520 26995 25478
8863 25478 21633 18246 17234 12509 15378 15314 9087 7375 9768 7912 3885 8264 10656 10351 12307
8848 12307 10440 8063 10285 8491 9619 6721 6694 2346 -5566 -7003 -6118 -12678 -13039 -6552 -1023 1748
8832 1748 -408 1187 -1858 -11145 -11740 -5225 -2914 -438 1300 -1051 -96 -4455 -6636 -11116 -11239 -14569
8816 -14569 -14024 -14688 -17302 -15256 -5789 572 -680 -2796 -446 339 1965 7499 4855 6517 8608
8801 8608 10030 4558 4374 9298 11381 6734 1630 3169 335 1361 894 -4685 -5580 -1718 1208 -1564
8785 -1564 -4491 866 528 3689 8949 4905 2028 4561 1147 -5724 -5453 -1492 -2134 -7691 -7740 172
8769 172 1095 6527 6134 5710 4485 4284 5547 4472 2880 -3570 -1695 -3417 -1309 4705 6789 7982
8753 7982 5824 3721 5761 4255 803 439 3899 3982 10445 16736 14532 11318 14537 13275 9506 7761
8737 7761 4991 -913 -4424 -3367 2476 6630 8557 11209 9986 8663 9047 8574 9029 7902 3902 5344
8721 5344 4601 2176 2139 5405 6602 12492 4553 5907 3576 7437 8569 6915 14647 14017 13185 12564
8705 12564 8337 9001 15714 11857 13784 10968 15931 18946 21822 15023 15723 25328 25681 24287 20505
8690 20505 12417 15617 22451 18844 9674 13868 19386 21552 23124 21841 14388 14126 19578 18388 20856
8675 20856 29821 33896 35704 36687 32830 31270 33028 30318 28707 29273 32250 34896 40279 43059 40804
8660 40804 38722 43502 42527 39888 41128 40314 30601 32606 44839 49301 50694 47358 47271 54506 57649
8645 57649 62278 61639 57347 59027 52296 52294 59657 63848 68941 71252 72481 71695 71209 74748 81826 86620
8629 86620 95399 102721 103094 107163 118577 132386 148076 157784 171251 176672 189318 203145 216277
8616 216277 223917 230059 235247 241778 232880 218085 196843 172908 146511 133313 116792 102604 89946
8603 89946 71141 68276 60385 55532 45860 30271 28241 32734 34232 38544 39044 33185 23977 15338
8589 15338 8359 7296 8338 9428 4902 4670 14961 23755 22053 23018 18467 13751 7890 720 1504
8574 1504 6307 6509 8173 11750 8675 2271 1219 -94 6788 2822 -4351 -8945 -1907 -1615 999
8559 999 -634 -6710 -6573 -6912 -8627 -682 4417 7501 9845 10090 10410 9363 10697 8462 3663 -563
8543 -563 -4257 -7795 -5362 -1572 -1613 -7039 -7422 -5789 1469 -2903 -6398 -2430 4915 5646 4098 -4855
8527 -4855 -6180 -1647 -2918 -4378 -3663 1429 7180 1540 -961 3650 1918 40 -145 -1113 -610 2848
8511 2848 7669 9264 15963 10866 8802 16962 12423 15203 15529 16817 12501 11639 9773 9778 3402 1455
8495 1455 -245 712 1856 774 1201 1913 -1280 -4348 -8004 -9878 -2631 10441 14239 12508 3909
8480 3909 1920 1926 4975 1413 -119 574 -3595 -4064 -3986 1123 -525 -4798 -2697 4296 1490 -2537 -3099
8463 -3099 -6859 -1232 -407 -150 -884 -673 -1552 -7426 -2511 2478 7393 4488 1565 -3360 -2989 -10416
8447 -10416 -9388 -138 9654 6586 370 3834 10384 6550 7445 14317 13165 11893 12872 9515 4815
8432 4815 -2522 -4179 9301 13903 12469 14958 9408 3597 5491 10474 14680 16140 10380 8856 5076
8417 5076 1475 4735 4319 1670 -1903 2902 3752 -465 489 5934 5582 6052 5826 2240 -7089 -10763
8401 -10763 -10894 -7542 -2661 -5257 -6350 -651 4589 1288 -5135 -4982 -6469 -6592 -10683 -12108 -6095
8386 -6095 -1089 112 1373 3572 3046 2428 -1218 -6877 -361 552 -5422 2479 5530 8439 14399 12415
8370 12415 7845 4843 8965 3087 -752 -387 -1506 -3650 -5468 -3376 1905 -118 -5309 -4226 3342
8355 3342 -1720 -4385 1757 334 -1952 -4633 -9189 -9594 -6429 -3591 -4204 -3562 -4628 -4269 -5107 -2802
8339 -2802 1189 2214 3974 3478 2579 4656 -3404 -8013 -12349 -5394 1838 -313 5726 15217 8843
8324 8843 267 1230 -386 6147 7508 4569 -40 -1641 -3103 -7445 -9400 -5804 -6619 -6135 1263 6071
8308 6071 8622 3509 2245 6173 9213 5242 -1444 6193 7580 5198 2479 8070 2525 2066 3975
8293 3975 -553 1797 4144 3663 4913 4635 -1307 -921 -943 -332 1652 3079 -4009 -11002 -7118 -4213
8277 -4213 -4703 1712 3564 2429 5358 12828 14043 8826 8400 4677 -734 8738 13864 18378 26872
8262 26872 28853 33436 44936 66794 95689 119925 129808 114275 93085 66556 43615 29082
8250 29082 24758 20206 15374 14624 10224 7221 9834 15617 14875 3564 4723 3553 3591 2068 1090 2317
8234 2317 -4313 -10842 -12401 -5315 6827 14412 17043 14866 4012 -2246 -889 -4780 -6057 -4365
8220 -4365 -4652 -10212 -5968 -11485 -11368 -6915 -8677 -10941 -7804 -4749 -2688 -7052 -15156 -18632 -12697
8205 -12697 -1105 -141 4259 -3612 -13019 -11961 -8476 -6639 -4195 -102 6601 5901 3662 3485 1842
8190 1842 4000 5921 1018 1136 8030 6793 4591 17 -1282 -9534 -12506 -8118 -8580 -10507 -10320 -10795
8174 -10795 -3509 -2960 -2254 -254 7113 6689 4621 8593 10402 17115 20682 21860 21810 22290 25724 39785
8158 39785 47815 65135 102438 130799 176511 216857 222278 180446 125324 87651 57584 34344
8146 34344 23607 24500 20935 22612 28222 29314 26259 18967 11779 14146 11871 8992 6234 8881 13771
8131 13771 13960 11973 10724 15445 18299 19038 12679 11343 13909 11123 8740 15388 23645 34947 37511
8116 37511 44538 62103 84559 111795 151373 191579 210983 193181 154618 113264 75612 49929
8104 49929 35413 22399 13125 11183 11420 10007 9170 10059 17965 26647 25997 12723 15878 18350 15940
8089 15940 9192 5486 2627 5002 10425 11382 10871 7022 1386 7965 8862 755 2958 10987 13643
8074 13643 8896 8429 11797 15176 10789 9169 7861 3479 -8473 -6625 -3932 -4915 -1231 6422 8123
8059 8123 10418 10654 6943 8021 8974 8332 6150 7742 10837 14477 26263 24309 19466 16064 17875
8044 17875 20224 20574 17818 14170 13713 11095 8920 3269 4850 8373 5980 3833 7327 11257 12627
8029 12627 13689 19531 26937 25299 26846 26647 34639 40586 37582 39553 42987 40554 31609 22995 15220
8014 15220 16728 20528 17890 16284 15576 11568 11673 12712 12348 13896 18166 10942 7064 6396 5875 5528
7998 5528 8176 6134 6951 10089 10651 13195 11153 8687 11055 10696 11776 9590 16804 12805 8162 10399
7982 10399 11254 16322 23087 24783 20045 14928 15480 13777 16075 12077 14840 18076 15317 3718 -3887
7967 -3887 -3853 -814 -1805 995 3317 3326 8094 13030 17771 18219 19188 15006 12427 11621 10828 15292 12087
7950 12087 4044 2824 34 754 3789 3659 4961 5189 5190 3111 11968 17560 14120 4593 357 -5451
7934 -5451 -4966 2067 444 -171 403 1417 2664 6652 3375 2414 8513 7474 717 978 -367 -1479
7918 -1479 -3818 4817 12669 11495 5026 3841 -4795 -7392 -7915 -6107 -9739 -3838 1327 -2579 -3962
7903 -3962 1082 362 2583 -4923 -9689 -4898 1563 -6612 -9398 -1880 3176 5903 3645 1383 2073
7888 2073 3079 3626 3075 -3036 -3989 -2970 1969 -16 678 1942 5005 8870 1486 -3848 -3788 648
7872 648 -985 -4072 6611 5991 716 5954 4845 1101 -547 4205 -2290 -1249 1012 797 2047
7857 2047 1340 -1843 -5758 -4553 299 1321 -6492 -7789 -3157 -4968 -14777 -14879 -13862 -8847 -5442
7842 -5442 -4452 -5463 -4762 -1093 2618 3195 4963 5786 2895 1175 5174 -710 -2834 371 -372 5899
7826 5899 5474 7779 6682 4368 4332 4043 4240 -1592 7948 4439 471 6085 382 -2922 7406 6486
7810 6486 10083 4874 2907 4907 -5625 -6470 -8532 -9264 -11352 -7907 -8581 -13170 -17246 -17184 -12184 -10937
7794 -10937 -3300 842 5413 -365 -4419 -5049 -812 3354 4773 4269 4679 1200 262 -6615 -2369 -860
7778 -860 17 2552 4235 6836 5512 1794 -1003 2839 3922 -1325 -10635 -11419 -1284 1772 -1857
7763 -1857 -514 -4131 -1948 -565 189 -1039 9451 6985 -1082 -5409 -9060 -10247 -8013 -7019 -8340
7748 -8340 -2783 1229 1707 4664 3570 -220 -2876 -2718 -5880 -921 2726 -960 -1236 -2181 -5644 -10465
7732 -10465 -10252 -6266 -7891 -6082 -10991 -10164 -5317 -5440 -5542 -5091 -3246 -1973 -1594 -5413 -8788 -1752
7716 -1752 1056 -4353 -8803 -6745 -7891 -952 3851 2700 -1721 -1794 2125 2957 3317 -305 2880 2971
7700 2971 1146 -2365 -6064 -10285 -15005 -14272 -6561 -2767 1004 -313 -5524 -7833 -6805 -6516 -6417 -2363
7684 -2363 -973 -7307 -16861 -16908 -14422 -13509 -2821 1436 12470 16990 14928 9662 8947 15785 14462
7669 14462 6388 -5179 -5289 -5695 -7227 -1203 -6 -4383 2172 7142 3786 599 3886 3486 1145
7654 1145 5407 511 -3690 -4412 -5786 -5347 -505 2437 5804 11260 6238 2113 -3717 -6884 1786
7639 1786 3139 -5177 -4971 -9321 -8544 1084 -149 3225 5168 4711 9725 6944 -2436 -4374 -5491 -12048
7623 -12048 -14881 -9437 2944 1840 -2718 -9107 -13993 -13610 -17156 -22842 -21581 -11248 -11008 -11921 -8809
7608 -8809 -8399 -10637 -6205 3256 2861 -3510 -5462 -1728 -1335 -1510 2397 6641 1706 -1839 -1174 -1972
7592 -1972 -69 7033 11702 9659 96 2383 7539 9328 4339 2296 1631 5674 -2034 -10373 -11808
7577 -11808 -5706 -2679 -6145 -5304 -1995 -11328 -17806 -19288 -14023 -8766 -5349 -8797 -13452 -12794 -4662
7562 -4662 1493 -226 -581 1398 8634 7145 4089 888 -7073 -2753 -2106 -4932 -1394 5110 8618
7547 8618 4916 2651 9676 10878 5036 998 3664 2795 1852 -6290 -7550 -4596 -4299 -3521 1082 -1154
7531 -1154 -2446 -2161 3241 1380 363 -4669 -3247 -2240 -3978 -5634 -6228 -3970 -5446 -5799 -2339 -4328
7515 -4328 -5062 -8110 -9321 590 4098 3419 -2496 -8023 -12242 -13862 -3538 -1863 -7791 -5468 -10606
7500 -10606 -14693 -15660 -7548 -6147 -8418 -7438 -3124 4490 3792 4494 9198 8680 7016 4273 1367 354
7484 354 4135 11071 7420 5435 6874 4906 3435 -1 -729 -3408 -154 1299 3319 6917 6279 3029
7468 3029 3441 8636 6289 7468 10937 9259 4718 533 -5100 -3446 2070 4447 -193 1982 740
7453 740 155 -1535 -2710 4418 8395 1200 2390 7026 4459 8334 6488 -3932 -8193 -7258 -5699
7438 -5699 -1142 2027 8284 5920 4632 9187 8545 -806 -7947 -9945 -7353 -5337 -2770 862 6232
7423 6232 7335 -314 1661 -4340 -9350 -11478 -9737 -3245 282 676 3008 2850 4105 2563 -5964
7408 -5964 -8101 -9042 -3242 1869 1247 -1912 1857 -2646 -850 4397 934 25 1615 -1179 -2534 -10651
7392 -10651 -17126 -8078 -2182 -355 9023 4948 -2447 -2282 5208 3126 -4436 -6148 -6793 -6166 -4422
7377 -4422 -164 -4787 -10248 -15540 -14892 -5142 -327 -640 -6647 -5227 -1992 -5195 -7225 -4592 3037
7362 3037 3666 -187 -4078 -6099 -7156 -11278 -14257 -10349 -8851 -10047 -11772 -7829 -9861 -13338 -5601
7347 -5601 -238 3628 2258 3330 2996 4077 4524 2334 4209 2805 1001 8612 14590 15957 6646
7332 6646 4709 -1995 -10638 -12283 -7538 -3285 -1676 -2747 -4183 1106 -1983 -1755 -7665 -12999 -13423
7317 -13423 -15392 -18114 -17234 -9581 -7934 -9881 -11382 -11777 -7704 -6243 -3644 -5587 -1819 -1010 -9202
7302 -9202 -9385 -14630 -9067 -5838 34 -2824 -5678 -15452 -20792 -15008 -12680 -3880 1008 1214 -2772
7287 -2772 -111 -74 -1840 -7257 -7537 -5284 -5559 -8159 -6643 -5220 -3976 -4445 -2018 -1733 -4472 -4156 -4319
7270 -4319 -3739 -4328 -3665 -7245 -7575 -13120 -6555 -5508 -4844 -117 2125 4383 8660 4562 -3639 -4912
7254 -4912 -5920 -6639 -7013 -13180 -16506 -23344 -20217 -15276 -12759 -17861 -19808 -14236 -12471 -13062 -14293 -8953
7238 -8953 393 3395 3726 -186 -3068 -6331 -7551 -2389 665 1516 7371 8825 5602 4817 4021 -905
7222 -905 -3141 -3695 -5627 -4722 -2127 -4494 -2654 7450 10921 12286 11330 2585 2368 1868 3334 7687
7206 7687 9116 561 -9053 -8409 638 -262 -2354 -704 -4699 -9091 -6073 -5204 -9090 -6321 -2584 -1011
7190 -1011 -1925 -7709 -6791 -2745 4693 2856 -3781 -7596 -2700 4777 1377 -4888 -9839 -13226 -13969 -8553
7174 -8553 -11475 -11917 -8340 -9546 -13586 -9752 -7483 -7011 -8708 -6623 -7013 -6359 -8256 -10184 -7054 -5637
7158 -5637 -11078 -7860 -6010 338 1191 -2597 -3055 -4766 -190 235 8180 6872 -5106 -7566 -6108
7143 -6108 -1393 1037 -3181 -8445 -8941 -4830 -1510 3347 3201 6409 7767 9614 7345 5938 4751
7128 4751 -454 -2692 -2379 -3295 -1395 -2976 -1484 -2307 -9678 -12552 -11118 -11255 -13171 -13619 -12026 -9237
7112 -9237 -4677 1539 1686 -962 -2028 235 -429 2069 6539 2716 -2557 -361 8749 7019 -918
7097 -918 -216 -4194 -3551 -2567 1953 24 -363 -564 -3675 -3172 -7188 -6864 569 6207 5379 5902 3232
7080 3232 709 -7624 -8997 -3801 3458 4007 972 4165 3583 -397 291 -878 149 3102 5761 8295
7064 8295 6307 1916 -1849 -10769 -10570 1683 7978 2894 136 -6152 -8014 -4843 -3640 -7067 -5289
7049 -5289 -501 -1822 -1515 -2882 -3630 -7173 -10903 -7103 -2881 -3654 -4748 -1386 4601 3599 -2294 -6701
7033 -6701 -3209 -645 -4758 -7589 -7301 -6927 -2434 2349 2123 -3843 -4881 -7828 -12872 -16123 -11873 -3133
7017 -3133 -2556 -1697 -4150 -7824 -9328 -6062 213 10793 10124 8423 715 -12318 -11286 -940 6412
7002 6412 8205 7595 9713 7255 585 3734 -2310 -5621 -4757 -5736 -8329 -13245 -12293 -5064 12306 13475
6986 13475 4224 -2954 -8125 -9384 -8411 -5464 -4182 -7853 -9669 -13302 -15649 -16970 -17561 -17448 -8220
6971 -8220 -7920 -8126 -7560 -5777 -5745 -6643 -12723 -10266 -5973 2338 3252 -107 -6554 -9188 -13334 -16525 -13572
6954 -13572 -7083 -4606 -8145 -5731 -5797 -7406 -352 3418 1700 6336 -127 -4777 -7456 -4712 -5579
6939 -5579 -8120 -7062 -4636 -5244 -498 6779 4008 4057 -2744 -2141 5543 4602 3164 657 -6504 -16098
6923 -16098 -15282 -6358 -3980 -3861 -2651 -6329 -3615 -2103 -4739 2100 7384 4107 -3329 -2331 -5191
6908 -5191 855 1737 -7455 -9359 -5241 -1643 -5346 -4531 -364 -1032 -6001 -4427 107 2312 4999 5675
6892 5675 6568 2116 -4571 -1525 240 -4335 -5779 -10418 -11467 -8208 -10231 -14069 -9669 -10176 -4979
6877 -4979 2037 2511 7107 8096 6939 1502 1017 2093 -531 -789 703 2176 -346 -2432 2712 10061
6861 10061 9591 3528 3126 5033 1980 -2501 2832 5057 -1613 -6187 -9498 -8751 -2942 -1495 703
6846 703 1151 -1716 -7852 -6764 -7012 -5761 5012 6698 3573 9560 3296 -568 -3269 -3761 -3710 -4973
6830 -4973 -6013 -6130 -6831 -9096 -5512 -896 -302 -1918 -8348 -8477 -3400 626 -2558 -10188 -15161 -13483
6814 -13483 -4394 524 1814 659 687 -6959 -7172 -5455 -14002 -17887 -7271 -1302 -4692 -7974 -9277
6799 -9277 -3576 -2704 -15 7548 9535 7628 2588 -1922 893 5301 7325 10754 10569 7655 -3888
6784 -3888 -6808 -10072 -10150 -7761 -2130 -1613 -4815 -5949 -1539 -939 -8800 -5678 -3208 1266 -2207 -4593
6768 -4593 -2452 2659 1124 -2088 179 -1875 -2280 -1372 -5672 -10555 -10505 -10473 -13988 -17387 -11263 -2421
6752 -2421 -4416 -3753 -4690 -330 1870 1030 1781 1455 2103 -3530 953 6259 9743 5500 -3223 -4965
6736 -4965 3304 4570 -256 -2727 -2587 -4242 -1851 3080 -6070 -5367 -7343 -4752 -1450 -3637 -370
6721 -370 6100 5302 2482 5460 7141 2491 1842 5694 6463 -2266 -7483 -6410 -3704 4467 5711 3546
6705 3546 603 2666 -712 -4344 69 -2815 -8710 -12956 -8312 -6237 -5200 -2637 -5347 -8863 -5842
6690 -5842 -9635 -3828 -2060 -5253 -13537 -13441 -10040 -4304 -1492 -2722 -4057 -11193 -11867 -10592 -5885 -6122
6674 -6122 -8849 -3029 480 -1189 -3324 -6841 -5826 -822 -1033 -5432 -5824 -6418 -11223 -15519 -12752 -6363
6658 -6363 -4375 -7070 -5260 -8156 -7485 1358 9787 3134 -3132 -8989 -6461 -2351 -4904 -9648 -10002
6643 -10002 -7534 -10115 -8623 -8400 -10100 -10221 -5635 -6430 893 4571 1714 -4056 -4020 -10733 -9034 -7658
6627 -7658 427 -27 -521 -7639 -7156 -7597 -9380 -10979 -15433 -8044 -8252 -6466 -3662 -5981 -11897 -13677
6611 -13677 -7364 -640 2478 -3395 -6732 -9079 -5468 -4977 -4073 -3902 -4949 -10128 -18506 -17630 -14395 -11231
6595 -11231 -2763 4378 7243 5924 1375 -2810 -8436 -8301 -6184 -4502 -4211 -7070 -14907 -10804 -4858
6580 -4858 -5609 -9239 -5822 -6109 -12136 -8342 -7783 -7391 -1500 -184 -4248 -1940 33 -2156 639 -3469
6564 -3469 -4597 -5751 -7609 -1747 3258 6646 499 -10406 -8824 -2399 4246 4531 1765 -2261 -4426
6549 -4426 -2301 2458 6850 7452 3527 -867 -5345 -13017 -9083 -5034 -4208 -1168 -3533 -5946 -5749 -3228
6533 -3228 1442 5934 5330 7801 5061 -139 -2919 4170 2510 -6460 -8745 -10635 -11519 -8403 -8103 -13069
6517 -13069 -11950 -9112 -9358 -8321 -14375 -15482 -9457 -9582 -4916 -5456 -3957 3434 1955 1834 -118 -1231
6501 -1231 4249 969 -4361 -7720 -5160 -4935 -7377 -832 2295 -106 -5950 -4854 -3577 -1544 1181
6486 1181 -1740 -100 -3374 -183 -1666 -8739 -8056 -5591 -10143 -7146 -3683 -3982 170 4669 4467 4364
6470 4364 18 -5596 -1620 -3159 -4693 -9370 -9046 -6900 -6674 -9646 -10414 -7144 -3729 1868 -2877 826
6454 826 9088 6721 1944 4016 -139 -1876 -1165 -6295 -2179 2426 6076 3155 -862 -1492 -2679 -6871
6438 -6871 -11374 -8318 -8027 -6260 2161 4255 2027 1484 4744 935 2138 5224 9651 7017 3035
6423 3035 371 -1728 -1898 -5366 -14863 -16310 -10921 -1973 1005 1389 3172 2131 3277 -4828 -8178
6408 -8178 -8896 -3379 -2765 3775 761 -2523 -3974 -2090 -1010 -1112 3040 5175 4908 3942 4088 6841
6392 6841 9929 8779 6525 1471 -4660 -14398 -13675 -7826 -1974 753 3127 1509 -4771 -6948 -6641
6377 -6641 -5872 -7273 2486 7937 6490 -6559 -11552 -10616 -3882 -8893 -15284 -18043 -15821 -9703 -6677
6362 -6677 -4768 700 426 4452 5854 -7440 -9707 -6489 -899 -5511 -3789 2736 7245 9027 8204
6347 8204 7721 1546 5686 4417 2788 -1782 -5687 -7195 -7512 -7130 -225 -5684 -7797 -3570 2996 4770
6331 4770 2339 3711 3158 1849 -5039 -13255 -8801 -3374 1192 3613 -3951 -4770 -4414 -2100 -5441 -7677
6315 -7677 -1104 3679 1271 -355 2665 5209 7750 6769 5406 1504 795 -3287 -7895 -7335 -205 -1446
6299 -1446 1392 7065 8651 4238 2660 1298 -4918 -11615 -7475 -14947 -17865 -13356 -3299 1574 -931
6284 -931 -3407 -8737 -12034 -11900 1003 7093 11064 10458 8469 10177 9472 8224 8496 7112 3814 -1039
6268 -1039 -6526 -12909 -12321 -7473 -2768 -2540 -4527 -8144 -10594 -9413 -3443 3306 3917 2867 -2135 4842
6252 4842 1807 -1773 -2324 847 -661 -5058 -1540 3574 2430 4101 3039 -7932 -9310 -11868 -5026
6237 -5026 -5718 -6353 2342 4592 3149 -1154 3465 1546 7430 7175 1401 -2184 -12923 -14828 -5063
6222 -5063 -7122 -10779 -5225 2919 2240 6790 9363 12583 21012 15689 6463 6941 11342 5750 4579
6207 4579 8990 9254 6697 5503 1969 2990 10866 12926 8099 4217 2490 -21 -8661 -7283 -10215
6192 -10215 -7243 368 -2572 -2610 3427 12666 11331 7836 -1615 -9992 -6902 -3849 -11557 -12153 -13095 -3929
6176 -3929 2964 6225 1117 -2677 -4183 -3742 -5572 -10751 -9582 26 8436 8271 1931 1274 -4640 -5682
6160 -5682 4545 10236 7009 5869 3502 6454 5033 720 373 623 138 -2132 -3172 3409 6707
6145 6707 -156 -3878 1367 3353 -1188 -4256 -2358 -2168 -8454 -13133 -9144 -1837 6557 7290 7507 528
6129 528 2541 10 -2384 -4135 626 294 -6785 -6360 -3824 -5829 -2509 -4236 -7266 -4416 -442 1375
6113 1375 -2339 -4975 -11525 -3805 16 -2102 -3531 -3802 -5010 -7735 -6138 -6788 -10813 -12454 -12347 -9418
6097 -9418 -5695 -672 6611 10712 10219 8648 9988 6296 2650 567 2476 7924 11908 13061 8497
6082 8497 5770 1529 -8828 -5695 -9625 -12070 -10831 -7134 1481 2459 -5076 -6050 -12414 -12955 -1916
6067 -1916 -793 -3163 -8528 -9607 440 11382 10417 2629 2013 2824 -4167 -2363 -3708 -4985 -4297
6052 -4297 -2255 -1209 -1289 -2298 -8100 -1917 5986 4641 1957 -8288 -12282 -2355 319 1482 4431
6037 4431 3943 2928 -1091 1258 3803 -4488 -5877 -8560 -6766 -4190 -5007 -10564 -15605 -8873 -414
6022 -414 -860 -2026 1357 1430 3092 -7235 -8273 -8627 -9055 -3968 -190 2163 -43 248 -118 -6513 -15208
6005 -15208 -15289 -9192 -1512 -920 -5328 -2164 1380 -1496 -2690 -6895 -6408 -2262 2140 2046 -4660 -8429
5989 -8429 -5217 -5598 -3355 722 2755 392 10573 551 -2510 -4348 -4297 3021 2396 -3626 -5847
5974 -5847 -14054 -13991 -6801 -7990 -7363 -1558 2413 -631 -1592 860 2392 785 -9425 -13380 -6964 -1949
5958 -1949 -2689 -1712 3301 -7 1174 -1351 -7374 -9658 -14758 -17464 -8693 -2304 -5806 -7806 -14151
5943 -14151 -13858 -14043 -14876 -9098 -6938 -2392 3439 -612 -411 2992 5099 11010 11524 5909 2454 -2527
5927 -2527 -340 -6940 -8920 422 7034 9219 8924 10683 11178 9351 1177 543 1380 1719 7486 4725
5911 4725 1387 -4028 -6803 -176 -4338 -12304 -16426 -13884 -12103 -12489 -5821 3448 -14 -3665 -1807
5896 -1807 1660 4464 3887 4832 5811 1473 980 -227 -468 4166 5569 5778 6101 4971 2638 811 2176
5879 2176 8063 10084 4526 -7789 -6906 -4973 -1865 -3529 -4424 -6577 -5076 -5942 -11025 -16422 -15405
5864 -15405 -9877 -8063 -8706 -3550 2303 1764 3736 9350 9634 -389 4244 4189 3814 4050 3664 986
5848 986 2459 9660 8438 5534 3072 1275 -791 -3682 -218 3112 8117 10162 6147 -5703 -6578
5833 -6578 -1465 4834 3594 -1761 -6908 -4625 -7008 -10239 -8815 -1339 -227 2535 1021 -3554 -5945
5818 -5945 -5064 883 4777 7174 6740 7365 2459 -4329 -11953 -12869 -12966 -11727 -11991 -7394 -3027 6501 9687
5801 9687 13624 13928 7101 6129 10508 -48 -11208 -6809 -2471 -3823 -10916 -12865 -10181 -8641 -8780
5786 -8780 -3131 3823 8393 6108 2675 -4657 -6314 -9544 -10663 -3506 1150 8575 8021 6427 1094
5771 1094 -2845 -5542 -6887 -872 -3726 -2628 -1567 -10462 -15811 -18311 -10146 -2987 2695 7550 2739
5756 2739 4104 6140 5617 -1952 -7852 -11143 -5898 -5344 -8122 735 11560 14217 9540 3378 3297 5162
5740 5162 2464 -1149 -1482 2310 2159 -789 -209 4944 7298 10961 9118 6897 4429 -27 2622 -1375
5724 -1375 -6473 -8229 -7792 -5399 -7829 -10719 -11700 -12696 -15438 -16957 -19194 -22545 -16172 -13759 -6625 656
5708 656 4424 6107 1694 -4260 1463 5837 4486 6144 5688 -136 -5534 -5395 -3001 590 -4552 -5393
5692 -5393 -10223 -14127 -8150 -2607 -2320 -1430 -6008 -3597 -1358 -3960 298 -1932 -7628 -1969 6472
5677 6472 5596 4947 -578 -6908 -9158 600 4934 5442 6289 -2253 -7349 -3427 -2219 -4579 -5033 -7380
5661 -7380 -5801 -5035 -4774 -4919 -6517 -4734 1805 11540 10063 8483 8480 3331 2341 6334 8141 4953 -684
5644 -684 5452 7208 8451 14231 16772 13229 8403 7275 1481 -1898 -4717 -838 2794 1574 5895
5629 5895 1400 -5371 -3562 936 -900 -1044 491 7074 2035 777 7210 11609 3601 -717 -2455
5614 -2455 321 -666 -1598 1401 2312 -5574 1044 3166 748 -3865 -4658 -1610 1912 7639 8057 8247
5598 8247 9365 14940 12489 8799 9474 -3219 -10743 -8639 -2401 3050 -2852 -5537 -1506 -1951 -4222
5583 -4222 -15013 -17690 -14783 -14387 -8471 -263 1824 3523 6375 4264 1699 -5876 -9307 -5243 -8260
5568 -8260 -8485 -6291 -3667 -4929 -9266 -7337 -104 1250 2059 4837 8041 6169 4994 3668 -3842
5553 -3842 -6075 -1303 2607 4594 2755 3631 7316 3327 -2328 -4527 -1708 -134 -1767 -4841 -10515
5538 -10515 -11416 -13016 -17779 -17141 -10961 -9607 -4109 -6082 -7940 -7278 -149 7457 4329 146 7552
5523 7552 5513 -527 -3899 -4883 -5880 -1067 -616 3283 -1174 -5398 -4875 -1553 -303 226 1673 -1005
5507 -1005 -4104 -193 6320 8319 4267 -4282 -7220 -2387 2481 -2563 -2439 1773 -3571 -4105 -3988 230
5491 230 3639 7930 7254 4482 720 3208 -1143 -5026 -1202 -2747 -5268 -3711 -3074 -5453 -3461 665
5475 665 8127 10597 8556 -2397 -9535 -16493 -16641 -13261 -13643 -14274 -12753 -12432 -11895 -10753 -2654 -688
5459 -688 -1197 -2303 -473 -3546 -4292 -2223 3812 6999 3192 594 2450 4485 2687 1032 2902 -4930
5443 -4930 -5266 -4275 -3379 -6929 -12122 -8868 -5712 -2411 300 2234 -3272 -5494 -4173 -4598 -327 2340
5427 2340 -2398 -570 2626 2288 -878 -727 -5852 -7386 -1341 7902 1348 2120 6997 5539 2973 5070
5411 5070 11500 13073 5102 -1478 -877 3315 6246 5843 2531 2682 -602 -1460 -3041 -331 2123 4778
5395 4778 5253 7382 8895 5740 3387 1713 1701 -2748 785 -2497 -5446 -5350 2192 856 -1214 -6305
5379 -6305 -6389 -8163 -11748 -12648 -18143 -11698 2427 5083 -79 -4337 -6676 -4608 737 -538 -1888
5364 -1888 350 -8111 -9932 -7099 -5715 -2997 -6050 -342 -528 -1970 -924 -6443 -11760 -9136 -2594
5349 -2594 4940 2152 2981 3484 7685 6784 4910 1832 1231 -5774 -15627 -14289 -1506 8031 10460 8662
5333 8662 6538 3485 3278 4989 4618 5610 1098 -640 -4866 -10077 -9120 -2541 -4307 -1388 5234 3853
5317 3853 7999 14691 19809 16942 11223 9295 6674 -4709 -754 -391 -2180 1554 5001 -2472 -4388
5302 -4388 -1224 -2179 253 1768 -6745 -9236 -2160 3639 2513 -4427 -4126 -2634 2268 1663 921 -2295
5286 -2295 -8402 -12609 -12243 -4786 2571 556 7291 12321 6392 743 4265 2826 2713 149 -249 2366
5270 2366 343 -2930 2530 1092 -261 389 -722 -3842 -6261 -7716 -2787 -1230 -1221 -3782 -6237 -2829
5254 -2829 -2205 -9055 -9049 -8960 225 4547 8391 8009 5308 2419 2953 4751 660 -1685 -15 8296 9052
5237 9052 3143 -109 -5354 -7821 -1230 1879 8022 4882 420 -5525 -3229 2134 2260 -2271 -6006
5222 -6006 -4956 2222 8112 5094 476 -6563 -5993 -9296 -115 -3891 -8335 -6479 -1400 1725 4881
5207 4881 4412 6797 6323 10821 17609 8132 3022 -1159 -7180 -8553 -3755 -3149 -3646 -2908 -2904 -6700 -5659
5190 -5659 -4314 -2747 -6806 1599 9663 6919 1148 982 6552 4747 2027 6580 5408 769 -4343
5175 -4343 -4608 -637 -3150 -1497 -2424 -2701 -5628 -10850 -6846 -1762 9959 11144 3182 -4640 -10211
5160 -10211 -3107 -2548 1796 1286 42 105 -2731 -4010 -5859 -9960 -16394 -15938 -12003 -6358 -7640 -2721
5144 -2721 -5838 -9102 -4204 -3437 -6604 -1073 9990 9647 8080 4504 2559 -3948 -4413 1564 6105
5129 6105 5182 4235 -2774 1700 8838 241 -5070 -6245 350 3249 4621 2549 3716 -334 2164
5114 2164 1105 -8444 -7332 614 4233 2377 3408 216 3370 5908 2969 4235 2232 -879 -2443
5099 -2443 -3953 2014 4401 1449 6229 4000 4520 2969 383 2189 -4597 -5404 -4559 -5187 -9171 -5680
5083 -5680 -2077 1943 5363 4888 1019 -1514 1126 -2461 -7344 -10631 -6141 -7017 -12030 -8784 -10241
5068 -10241 -4906 -3100 -7909 -9124 -11462 -8113 -8751 -8798 -10995 -3636 -1122 -8074 -5252 830 -2678
5053 -2678 -450 4977 3415 -5078 -9718 -1708 -2747 -2163 -3246 -8440 -15198 -11615 -12371 -11106 -6796
5038 -6796 -8481 -5743 450 4531 1299 -4457 -5165 -5407 -9062 -9733 -12742 -12552 -7107 -5605 1039 3412
5022 3412 3085 8457 6739 5612 7221 2724 -3040 -8272 -10418 -5348 -7708 -6839 -5951 -3355 932 1717
5006 1717 812 -8965 -16562 -11548 -10151 -11626 -8137 -11895 -11115 -7480 -5518 -1928 4407 2779 700
4991 700 -1633 -9826 -7556 716 1725 -3358 -3456 -1715 -3626 -2204 4205 8062 12968 10450 6143 6358
4975 6358 8823 9394 7024 -609 -9523 -7641 292 5578 -6035 -8592 -827 1405 -2305 -9770 -13043
4960 -13043 -12439 -5656 198 820 -3642 -4379 -1869 57 2033 7249 9505 10893 8885 6999 -2318
4945 -2318 -6181 -5884 -1218 3917 1831 2101 1099 -99 866 417 717 2121 -3366 3105 4369 5135
4929 5135 3050 -1587 -5107 -4388 -4705 292 -5929 -15446 -12741 -8972 603 4119 3966 4307 2483 -4790
4913 -4790 -9021 -9399 -9833 -1784 56 2099 -4458 -15631 -16066 -11579 -10843 -7417 1310 7201 8633 6681
4897 6681 1963 -2020 -3946 -9409 -12393 -10086 -11309 -9599 -3011 -903 -1627 1385 1975 -2296 -5269
4882 -5269 -6940 -4257 -10287 -10849 -14617 -9263 -9619 -10158 -9983 -9684 -1575 291 -5981 -11083 -7379 -2861
4866 -2861 -7122 -6550 -4559 -8436 -3247 248 -4476 -9181 -2636 598 2751 6897 5170 1367 272
4851 272 1798 3523 3720 2656 -2888 -6525 -13461 -15094 -10754 -10775 -8488 -6560 -2026 -8221 -12215 -10836
4835 -10836 -8091 -1546 -875 -5504 -5605 -8953 -8426 -4516 -2555 -2719 -1529 -6874 -5045 1482 2661 -1957
4819 -1957 -1999 1192 -1280 2807 4327 9338 8423 7486 9328 7168 9107 12702 11801 1456 -1159 4697
4803 4697 5334 3532 4431 6070 3114 108 3630 -1638 2440 4595 -3777 -6699 -8866 -6171 -3665
4788 -3665 -2227 2759 -2923 -3251 7799 16269 17204 6162 2939 6327 2825 -3552 -8740 -9172 -6384
4773 -6384 -136 -3756 1688 1260 5247 11270 4529 -1242 -2566 -3998 -5664 -2398 5263 5890 9682
4758 9682 10126 5813 2959 1507 2662 -2049 64 676 2141 6050 9767 10201 3724 1435 1261 1561
4742 1561 4935 7378 8432 6213 3698 4320 8423 5784 -278 -3616 1027 1214 -4179 -993 5469
4727 5469 13179 14440 10384 536 -3157 2105 1896 336 10501 14054 4567 4878 1740 2101 6742
4712 6742 3741 5161 924 -2626 -6101 1104 10661 17659 12372 10078 5970 2870 -7 3680 4061
4697 4061 10005 11395 6865 258 -4408 -4059 1658 4561 4696 2375 -4134 -3621 -6847 -9311 -9173 -5310
4681 -5310 -6530 -11001 -7742 -7619 -3988 3035 4272 -6789 -9900 -13841 -6293 -1772 -2778 -2165 -6227
4666 -6227 -4230 -7108 -4824 6775 7494 1288 -9492 -4188 1555 -547 1498 3157 886 3982 13019
4651 13019 13874 10172 6583 5046 3080 2370 4416 -185 -1641 2267 752 5860 4442 2025 59
4636 59 -2829 2028 5401 9491 11128 10336 5739 6550 -1957 -8411 -11432 -11100 -5874 -10202 -11431 -1835
4620 -1835 1870 3984 7921 6297 5386 11947 7007 2020 3080 5503 2884 7064 7534 5348 1159
4605 1159 3691 4583 6295 5598 6681 3622 3310 9425 9474 7045 3891 2495 3869 812 -735 -1485
4589 -1485 -1632 700 2861 2143 -1902 3199 3553 -937 -5897 -7990 408 8772 8603 9581 9050 10865
4573 10865 9570 10109 6400 695 -3737 -4327 -2053 4415 3852 -2639 -10073 -11586 -13036 -13984 -12762 -9393
4557 -9393 1209 5912 -988 -5458 -7112 -5321 -905 162 -2581 -9439 -12842 -8060 -4248 -3104 -398
4542 -398 -313 2478 6937 7479 3018 6562 9753 3327 -5752 -4392 392 6297 4381 8128 12837 9371
4526 9371 6381 1214 1116 3809 5349 2940 846 5122 11860 18794 20276 17611 7796 494 1483 6982
4510 6982 3205 4200 4195 7983 19893 28892 21742 12643 11676 12553 7981 6674 6496 2239 -3889 -2649
4494 -2649 2353 2891 -6452 -4822 1745 6881 7762 -636 1061 -4289 -5843 862 358 -2258 -5439 -4138
4478 -4138 -5131 -5020 -7809 -9215 -8759 -2215 804 -3709 -6610 -1077 3017 2454 -2280 3714 7577 9091
4462 9091 12632 10358 5615 3886 -345 -8744 -9022 -9555 -7033 -2673 -58 -556 -4019 -7266 -4071 8857
4446 8857 10577 2639 -2983 1871 8268 9764 5752 5391 3190 5820 11463 11880 11040 14900 16077 13558
4430 13558 3620 -65 6893 1567 3192 9252 5760 2249 -1478 805 7399 5976 3555 5134 6682
4415 6682 9482 7424 5564 5411 3016 -2771 -6240 851 2996 -283 -4618 -4843 131 -920 -3302
4400 -3302 -3077 658 2776 3099 4144 4985 968 -97 6359 3620 618 2849 10 47 3948 2221
4384 2221 2909 -1703 -682 6957 569 -6807 -1998 -1777 -4512 -1947 -218 5049 5744 4644 7878 5111
4368 5111 3426 1680 887 -159 1846 2658 1862 1014 8254 6223 6065 -2129 -3504 -3123 -2582 -6564 -3041
4351 -3041 -6426 -3207 -8180 -11289 -11519 -1288 2903 -6476 -7602 -5809 -4504 -4371 -9066 -8314 -70
4336 -70 12465 17949 12386 2633 -2932 -6641 -9419 -13915 -17439 -11911 -9957 -2472 1911 3773 -4962
4321 -4962 -2722 3298 2071 2188 6652 5568 8167 3532 746 4791 3810 -4864 -7998 -3422 3535
4306 3535 7015 8227 12297 10017 5026 5499 3955 514 1228 2752 5769 12248 8714 7446 10188
4291 10188 6740 -5237 -16064 -19571 -19544 -9126 -4170 -1888 -1720 563 -2857 -3342 2764 -337 85
4276 85 2029 5106 11121 12092 15602 15736 13731 9480 5401 9200 7736 1409 1596 3473 3697 -321
4260 -321 -3234 1597 -695 3325 533 -4352 -5037 -2716 -4436 757 3066 6111 1736 611 2347
4245 2347 2913 4500 3490 1698 -691 -3563 -6431 -6106 -3556 -1708 -1883 -2190 -4878 -5025 -5146 -8295
4229 -8295 -5806 -11095 -7252 -8802 -13765 -16944 -13065 -5672 1434 2690 1695 -4388 -4351 -385 -3634 -5208
4213 -5208 2677 469 -2310 -4556 -5143 -652 1629 -74 1988 4214 -2387 -6395 -9073 -852 5413
4198 5413 2968 931 3911 8041 14389 10620 819 -900 9076 14565 10769 -1028 -8211 -3578 -7105
4183 -7105 -6048 -8318 -7828 -7914 123 7788 14328 12042 6594 -2982 -3713 -6113 -6517 -2367 -659 -3678
4167 -3678 2396 6774 1545 -1042 -1473 -10912 -14975 -4065 5608 7003 5411 8341 3746 -1002 -2665
4152 -2665 5060 2436 4760 7419 6662 995 843 687 2326 217 -7669 -6768 -2255 -855 -3730 986
4136 986 4616 2412 6229 7274 4641 3043 -2237 -3423 711 5232 -5968 -11840 -10475 -4326 -2598
4121 -2598 -6804 -6133 -3869 3245 9746 3308 1051 2623 371 -2496 -4125 -3112 -5273 -1976 8268
4106 8268 8605 9042 7243 5095 197 -2278 2262 14776 22574 14030 6075 7467 16356 16948 14438
4091 14438 15354 11321 1446 -8535 -3657 1898 5450 3000 6014 7980 7018 8203 7335 -360 -1766
4076 -1766 2556 -574 -3293 -1802 517 2602 3794 3412 552 -1462 -6902 -6988 -3746 -1685 -1325 2021
4060 2021 1601 2380 8407 5689 3396 196 2474 -2274 -3176 -8171 1510 4461 6520 3831 932 -3002
4044 -3002 -5389 -15406 -11995 -2412 6002 7205 14363 10446 7348 4654 7530 13613 16420 11813 14035
4029 14035 13314 8750 6896 3346 3784 4574 1941 929 788 2154 732 -4682 -3626 -4179 -5121 -5156 400
4012 400 175 4819 5537 4533 1263 -3835 -7709 -5406 -1742 794 -506 -4989 -7236 -4765 -3301 990
3996 990 846 -6000 -1740 5720 705 7520 12337 7736 11929 10137 7927 10849 12799 8194 3523
3981 3523 -2399 -9680 -12615 -5397 -4671 -2088 2014 4387 2269 -3535 2311 5177 -367 -4174 770
3966 770 1027 -969 6517 11535 -1426 -2957 -4222 -4522 -3894 3380 7687 4791 5119 4968 94 7183
3950 7183 11193 7915 -2764 -4824 -2389 -4890 -5145 -1916 4373 7205 1531 216 2968 5741 3401
3935 3401 862 2675 9195 8466 1319 2223 11383 11017 9015 11245 6233 1682 1708 2750 3996 987
3919 987 -1486 -1843 -635 -6797 -299 2802 1751 -962 2466 -2180 -5544 -5874 -84 3151 3995 -155
3903 -155 4358 8176 6846 1448 -5042 -7531 -6349 -3088 5640 4608 6441 3756 -3121 -7556 -2790
3888 -2790 2384 2891 2693 1521 -1294 1296 2889 -931 -3144 510 3090 -1896 286 1119 -3029 101
3872 101 -2401 -4526 1626 2431 304 -6154 -4437 958 1763 6358 2942 -4661 -769 2032 175 3129
3856 3129 4282 7189 6823 8423 12165 7959 4420 4834 9960 9831 3843 -147 -835 2289 6428 8352
3840 8352 6226 -1256 -3035 3844 3434 4813 4020 -1186 -36 6954 6638 308 -571 424 4805 7346
3824 7346 7237 9172 6742 4976 302 2924 296 -1317 -4620 -4982 -8390 -5863 -4751 -7091 -9528
3809 -9528 -7881 -9166 -9340 -7897 -7845 -10663 -3838 3773 6787 -1748 -7718 -6694 -104 2235 4398 8122
3793 8122 10831 1064 -529 6420 10724 5898 7194 13145 5425 -2898 -7823 -5575 362 5811 2578
3778 2578 -3150 -5966 -5113 -2553 6422 6168 4299 9113 7817 7867 8136 9809 11248 7817 1301 8171
3762 8171 12583 6707 -3963 -6008 -6147 -10459 -15530 -16726 -5695 3294 -10034 -9965 -4238 -4566 -239
3747 -239 -1714 -5842 -9545 -11318 -811 -1960 1689 376 -1224 -757 7952 7067 5211 8770 7958 2990
3731 2990 4383 8892 6558 6534 10117 12937 4182 -589 1816 5507 4199 8972 9093 1488 -1386 1015
3715 1015 -391 -916 1893 996 6047 8781 5574 793 -4957 -6680 -8258 -8165 -3082 -5670 1584 5066
3699 5066 1381 -2128 830 1712 356 -1502 -2054 3101 2361 -883 1618 7431 9075 6213 17 8739
3683 8739 4446 941 -1856 -5394 -9575 -11518 -12828 -6584 -9090 -6822 -3460 1845 5639 10189 10235
3668 10235 4182 -3661 -6933 -7921 1575 3169 5283 2007 7445 3503 -3424 -8480 -4839 -1841 -6075
3653 -6075 -9425 -1729 4611 3115 4655 996 -2971 5604 9047 9881 2165 -2088 -7786 -9097 -9557
3638 -9557 -12249 -5203 1449 4858 4168 4646 -1416 -4615 -7485 -8587 -8749 -964 -650 -1797 -1045 -5996
3622 -5996 -10330 -16546 -11318 -11801 -9197 -2884 -3077 -5264 -5372 -9187 -13818 -12169 -6351 -449 -3340 -918
3606 -918 3176 3915 1952 -1453 -3025 -1387 -2075 -4827 -7621 -5393 -7819 -8156 -5178 4053 5735 1714
3590 1714 55 -134 7484 11337 3712 2637 -4225 -11911 -11136 -4057 -2793 -604 -3046 -7814 -8366 -668
3574 -668 -519 -6561 -7930 -9456 -6166 -3546 760 -1207 -3679 -762 258 1861 1507 3845 1395 -5329
3558 -5329 -4156 -2461 -6280 -15242 -10828 -436 4078 8464 6384 5950 5860 2804 4828 6832 5600
3543 5600 1565 -2760 -5836 -4645 2831 8307 2952 1124 2151 2911 -2217 -797 4767 9777 6695
3528 6695 781 -1603 364 -4621 -7796 4377 5880 630 389 -591 889 3254 -1103 -165 -3593
3513 -3593 -6756 -8251 -13397 -13237 -8847 -2302 1209 -4992 -7749 -6540 -3974 -1489 -477 -3551 733
3498 733 -238 -3818 -4692 -657 -4086 -3981 -6613 -4484 941 1370 6548 8490 3301 -6071 -9042 -7120
3482 -7120 609 6120 5617 5586 10491 7268 5856 10717 8929 1463 -2275 -29 11300 13171 9210
3467 9210 6937 -403 468 2611 2860 4357 7480 9953 12467 7860 7139 3222 -2467 -7916 -8536 -5309
3451 -5309 -1491 -8392 -6707 -130 3120 372 4276 6548 -2802 -10812 -4974 2793 8532 10746 6572
3436 6572 4105 -1017 2887 8892 9343 -250 -1516 -6078 -339 5126 5289 3661 3421 7035 10079 10327
3420 10327 12868 16470 15138 11474 10540 4972 2859 2118 -759 -4455 -8467 -8209 -3263 5333 5028 8972
3404 8972 13387 11755 10109 6875 -72 -243 -2465 -4904 -9275 -13430 -13467 -15303 -10345 -3891 -6004 -2463
3388 -2463 3945 8612 7497 529 -4415 -64 7711 3591 428 -4817 -2014 2543 4121 797 -1964
3373 -1964 -34 1461 2562 5308 3338 -126 1642 765 -8084 -7990 -4566 -8331 -2458 2218 -6 405
3357 405 1516 -4275 -10589 -10400 -2883 -1400 2062 1964 1135 4870 8159 8275 1519 -696 2471 7803
3341 7803 8211 9147 12116 11869 15276 9782 9024 6839 2019 106 291 -5470 -5317 -511 79 -914 3212
3324 3212 15562 15000 10354 10168 12138 9806 9773 4805 4865 2021 -3774 -7568 -14639 -13314 -7645 1596
3308 1596 6419 4156 455 2182 5431 -2876 -11214 -9634 -4811 2922 8819 212 -2113 -1310 219
3293 219 -1699 2403 7579 10433 7845 -4871 -4072 -335 -6502 -4267 -5496 -2568 3268 3857 2536
3278 2536 -3370 -4064 -429 2678 7846 5772 713 -2481 -3613 -3310 162 -3574 -3033 2304 2631 6769
3262 6769 7625 -4424 -13647 -10366 -3911 -164 -771 1543 6331 12158 13808 10143 9107 1622 -2225
3247 -2225 752 -1500 2565 -227 -722 -360 2905 -1271 -4308 -5760 -11500 -4790 2092 3391 903
3232 903 -937 4018 6631 3625 1031 -4566 -3554 2258 5295 11522 12877 13317 13278 4471 759 858
3216 858 6916 11719 12432 9819 6766 7851 7186 10280 10404 4218 -41 134 -2539 -4191 -4243 -7828 -8
3199 -8 -712 -1277 2891 5105 2385 -2541 -2039 -2496 6944 10644 7369 6789 4840 3927 3546 3363 2136 17035
3181 17035 17282 13738 4932 1036 2468 4757 -1701 2096 5718 13138 17699 12338 12591 17612 20749
3166 20749 15736 9848 7990 7213 7940 -3503 -7047 -3699 -2549 -6060 -14279 -11912 -4126 -3861 -8
3151 -8 3086 5454 3945 -181 -1035 8171 7960 372 5898 13290 10353 7735 6116 6014 1294 4765
3135 4765 11238 1889 -4540 772 5212 3189 636 1397 499 7436 6124 41 -110 -2393 -2673 1665
3119 1665 716 -11 -3354 -4267 903 559 2733 -1134 -5107 -8739 -10127 -1388 6965 9819 6657 -1819
3103 -1819 2822 3445 10640 7099 985 3178 4817 2401 3828 5922 3039 1458 -559 -1984 -6042
3088 -6042 -10253 -14290 -11603 -6525 -13070 -16512 -6707 2261 4198 731 -3690 -3114 -4563 -2710 -4772
3073 -4772 -3648 4015 7709 1844 -6039 -8225 -3536 -3407 -2684 4802 9224 3529 -5020 -1380 6783
3058 6783 3904 -7288 -1827 2230 5068 5351 4376 2751 3252 7567 6910 3312 9763 12428 6580 4319
3042 4319 4938 9862 11095 8572 169 -4618 -10420 -18641 -15959 -8076 -1960 -3314 -151 7030 7586
3027 7586 -3722 -5334 -1029 -437 -1787 -4 3875 -90 1675 1329 -3160 -4120 -6300 -8924 -5452
3012 -5452 -9668 -16933 -15553 -6833 336 -3511 -12431 -13657 -15333 -15192 -14574 -12308 -4668 -1200 -5068
2997 -5068 -6705 -226 7019 -300 -4246 -6852 -739 4355 5111 260 11432 19018 19309 9017 4988
2982 4988 4109 -854 -2183 -3506 -3483 2000 775 489 2953 5257 -336 -4579 -3132 3988 8790 18197
2966 18197 14565 6133 3922 3726 1803 1928 -739 -2176 3014 2874 1798 5186 6459 356 -5825
2951 -5825 -549 1263 2991 5107 2909 -2818 -6836 -10328 -1228 6817 2791 -994 4751 4955 2248
2936 2248 -4029 -11324 -4156 -4221 -6052 228 5845 10831 8864 9433 10675 9313 1282 -10915 -11071 -7199
2920 -7199 -6721 -5531 -3353 -1413 -543 107 -1770 488 2276 6796 10838 8562 7984 5447 3611 100
2904 100 -6847 -7262 -710 -7209 -8409 -6837 -7696 -10371 -2274 2003 5681 6526 4300 3782 5101 2347
2888 2347 8052 7114 -1636 3373 1389 -3610 -4678 -342 87 -2943 -5856 -4159 -2874 2990 5711
2873 5711 -55 288 1411 -1537 -7710 -4781 -2643 528 -885 -116 3209 5738 7312 788 158 4574
2857 4574 5568 3701 -1211 2480 -1876 -726 -5924 -14050 -8143 -10096 -7761 -6509 -6150 -4303 738
2842 738 -643 233 1296 -2934 -2701 -2120 -3914 -7381 -11078 -17301 -10804 -4002 2869 4720 5084 6090
2826 6090 7395 2848 -974 3816 8836 4172 1662 -1794 -3207 1379 8675 9263 388 3545 12438
2811 12438 16745 14609 8193 4838 4819 4970 5797 5785 4269 8196 17809 13706 7377 6840 3488 3439 -1776
2794 -1776 -6580 -3231 738 -2996 -8719 -11705 -5793 -3368 1493 5203 5983 3119 5487 2266 1380
2779 1380 5225 4833 5001 3114 4586 2263 -1510 178 3541 -95 -6777 -6750 -8980 -7403 -3658 -5402
2763 -5402 -4972 -6207 -4364 3094 6431 937 -1485 3984 2600 -2760 1193 6556 12921 8574 3494
2748 3494 6105 5216 4955 -1754 -12311 -10973 -4620 1715 11320 11217 3119 -389 294 -2651 -2855 -235
2732 -235 -2554 -3782 58 2212 5416 11695 7497 6519 -3312 -10688 -7146 2349 1757 -3571 -1846 -1804
2716 -1804 -6705 -2127 -3130 4472 6268 11031 15850 18313 11599 566 -5046 -4180 4957 2928 -986
2701 -986 -7611 -13188 -17712 -20274 -14780 -5921 -722 2986 1741 2956 5690 -1120 1327 4719 571
2686 571 -1017 4597 9409 10018 5434 1890 3406 4478 9890 9062 6454 8533 3663 1397 -2364 -3105
2670 -3105 -961 -4770 -6009 -572 4967 4296 6222 4071 1729 3984 8704 7910 3716 1365 -1015
2655 -1015 277 3843 8328 5343 2224 -918 -10160 -19840 -20541 -11552 -2707 3634 2578 -3671 -469
2640 -469 5830 6692 8860 6129 4012 3906 -1723 -7076 -7887 -5837 -8029 -5353 -2350 3468 7288 11716
2624 11716 11656 6133 2159 -1824 -5414 -4857 -7507 -9501 -6421 -3580 -10274 -10019 -6729 -2881 3508 1928
2608 1928 675 2927 1574 165 -1749 84 5105 7955 6390 8100 3929 1824 7066 8924 -1454
2593 -1454 -10883 -1702 5818 4721 1727 4617 5142 -1759 -859 -532 -938 -1031 -8897 -15405 -10318 -3251
2577 -3251 111 388 2238 -1565 -8182 -8331 -3157 579 2755 3460 -1617 2133 2187 4553 11849 12020
2561 12020 8216 1871 -1175 -2617 -2652 -2415 -1033 1208 9849 9723 6074 2044 1580 398 3515 2974
2545 2974 4332 1930 557 -212 3650 4956 5673 6041 9469 763 -2625 3690 7556 5643 6051 9311
2529 9311 9170 5923 -1582 -3469 -4970 1432 2923 1807 -2679 -10114 -11843 -3111 -5199 -3164 6044
2514 6044 7909 8110 6621 7480 2243 5255 4798 9712 15168 13312 18107 17251 11658 7787 7549 6158
2498 6158 8045 3645 5558 -4146 -9155 -12185 -10255 -3620 -3493 -363 -574 3513 3474 3762 2661 6931
2482 6931 10005 7509 7461 8627 10643 9782 5373 2787 -1268 648 6558 3540 8630 9168 5795 -1034
2466 -1034 -495 -5635 -3404 196 3863 -2177 -9783 -10931 -10942 -3555 -1875 376 -1019 -3655 -1493 1261
2450 1261 -6375 -10987 -13159 -4630 -2241 -2563 -5005 -248 6378 4485 6738 -1241 -3698 -2626 874
2435 874 -2625 1104 2142 1506 -4192 34 1962 -3284 -8927 -4131 56 208 -2021 -5758 3167 9181
2419 9181 9951 6880 6101 13817 13331 3036 -1121 -7163 -4517 -3844 -2292 896 93 -3926 -6518 -7195
2403 -7195 -967 5377 6827 3816 -511 -3018 -6368 -8362 -598 3643 4118 2415 10728 12711 3865
2388 3865 -1415 -3359 -2052 -3594 -8066 -2713 1591 -3189 -8540 -6056 -3314 -4273 -3429 4243 4371 9081
2372 9081 7181 8218 3298 -4544 -5988 -3860 -3269 -7073 -7736 -7920 -1938 -6846 -8027 -7239 -7611 -6392
2356 -6392 -6646 -2573 -1092 3611 -2496 -7472 2596 12046 4648 -1106 1570 -2162 -1369 1157 5014
2341 5014 4393 993 -799 760 1513 1149 3302 877 -1959 -6005 -2345 -6398 -9047 -2490 1595 -2042
2325 -2042 -597 175 -2011 -1 5389 -2972 -7116 -2008 2245 4161 3905 3844 2489 -1182 -5149 -3822
2309 -3822 -2073 -2632 -2729 6651 1761 -2403 -407 4515 10177 9854 6720 10005 14563 11397 5937 5600
2293 5600 6659 12703 1816 1354 4523 3906 4714 -1099 -3137 -2020 -1307 2398 4238 5266 8354 12206
2277 12206 13148 13431 9912 1251 -2231 2302 3846 147 -3705 -2525 -2860 -11517 -7900 -5118 885
2262 885 3008 -1381 464 -2568 -1849 4490 11521 8460 -1075 -2523 1270 7422 5311 -5723 -12796
2247 -12796 -9590 -4349 -1261 -1489 -476 -3335 -2627 1120 6286 12781 8306 -1573 -3711 -2986 -3292 -3051
2231 -3051 -1578 -4521 -8429 -11633 -11454 -6421 -4202 3240 1363 -1600 -6345 -6153 1177 6187 4077
2216 4077 1281 1650 2581 6425 2904 -1266 652 2476 -1087 -2907 3994 9845 8614 2518 -1834
2201 -1834 -3525 609 379 -1913 -4915 889 794 932 7384 9199 7868 1405 -1106 -616 2015 3615
2185 3615 393 3183 5033 7944 8902 6527 11103 7886 3068 -131 -959 -1626 10261 19336 13918
2170 13918 2354 -2630 1081 -2580 -2250 -4515 -6183 -3830 -3436 6138 6712 3050 -395 -2281 2623
2155 2623 4628 7658 8778 9514 5429 -3290 -6730 -5763 -3207 -6840 -7253 -4632 -1346 -2275 -1959 4392
2139 4392 8377 3908 2336 2212 6646 8191 3131 -6964 -6603 -2940 -5310 -4589 -4437 -10303 -11055 -15292
2123 -15292 -11426 -7228 759 7363 12704 15016 14652 12880 7816 5124 5282 5295 7066 9920 7181 3633
2107 3633 7633 6242 -77 -1682 -1436 -2904 767 3657 4114 5408 2069 4242 10223 7108 7309 10347
2091 10347 11952 12241 3410 3856 -530 -8123 -6549 -3016 -1538 10094 2970 -4314 -3126 -686 -5852
2076 -5852 -5425 337 3344 8353 8709 8996 4060 3500 904 1447 5355 4902 4083 6669 11280 15270 13981
2059 13981 9549 3645 11297 18107 11979 5085 9336 10267 9462 9456 5443 8167 7219 724 -4341 -1733
2043 -1733 5378 10473 8238 5148 6890 1580 1367 5061 6007 7033 5736 10298 16393 9783 3837
2028 3837 2888 -6056 -7923 5949 5649 -835 -6276 -7624 -2535 1075 4744 5005 -5394 -7222 -4913
2013 -4913 -11322 -11866 -7049 -8430 -9399 -3459 4955 10693 18414 20870 18179 16031 18964 16320 12985
1998 12985 9263 8641 15852 18028 3163 -54 -6198 -4560 -5620 -5338 -4021 205 5687 6731 1813
1983 1813 2629 851 1785 -1731 -4774 -654 -1580 -2284 430 -559 648 -262 4731 9221 11118 5946
1967 5946 -7863 -13112 -10807 -3979 2058 4109 894 836 1000 6879 14088 11661 2702 1416 -1604
1952 -1604 533 5075 10385 13723 7242 2580 3893 7538 4188 3669 5249 2464 -4475 -4548 -4165 -2742
1936 -2742 -8450 -10884 -12512 -14832 -12235 -14180 -15019 -15267 -10928 -4239 1963 2847 -6173 -7983 -9155 -12150
1920 -12150 -11232 -9971 -3197 -5233 -8058 -5041 1952 2627 4075 5410 1253 2741 3727 -21 -5267
1905 -5267 -6902 -6964 -8399 -7774 -6861 -8750 -4716 -1677 798 2065 8750 10996 8063 7336 6335 6861
1889 6861 9526 8282 11476 5668 1842 4144 9167 8121 4396 4488 6129 1229 -291 -3157 664
1874 664 1410 3946 7716 -1629 -695 6669 11041 2886 -4373 -5361 558 -744 -7856 -11729 -13234 -7775
1858 -7775 3850 13978 8904 -2104 -9509 -12147 -9460 -5259 -8105 -5696 1470 4307 2186 -6864
1844 -6864 -9460 -7552 4277 9693 2993 -694 4453 147 236 2423 -59 1939 9869 1573 -12139
1829 -12139 -13262 -1949 2532 3224 -1885 -615 508 -1012 -5685 368 5106 1815 -3488 1604 2102
1814 2102 -2583 1289 241 185 768 1701 2001 -207 344 -671 -4230 -598 3494 5906 1386 1845 3438
1797 3438 5458 6340 -2332 -11480 -10365 -6647 -3816 1659 614 -1651 -2700 2626 3014 3412 10842 5452
1781 5452 4874 7538 5382 12064 11146 2973 6295 8474 3806 1856 6717 11262 9713 4595 6885
1766 6885 10298 8976 4008 -789 -700 2195 8144 6620 6445 10468 10803 10851 1406 -7541 -12574 -6042
1750 -6042 -1176 -2965 -2442 5904 8675 6739 5265 1070 -6408 -5750 -4767 -4283 -2059 200 -884 -9990
1734 -9990 -12996 -7172 -478 -1217 967 -105 -613 -4773 453 462 -877 3337 6823 3029 5754 11530
1718 11530 15934 12151 -1033 -3718 664 -450 -1817 -4004 -816 -2566 -3028 4663 7590 4042 -1979
1703 -1979 -2872 -1782 2060 707 5097 7888 2596 -3250 -6359 -7230 -4755 1603 6222 4745 3385
1688 3385 1827 1856 5096 -426 -3961 -7872 -11467 -6073 -3434 -3895 -4440 5409 3916 6908 9892 12170
1672 12170 8500 -1078 -1160 -2676 -3933 -500 3209 2571 3990 2304 -2825 372 6029 4797 5321 5865
1656 5865 8633 7980 83 -610 -4304 -5737 -5453 -2335 -385 6152 2822 -1044 -609 3335 7937 10097
1640 10097 5159 1583 -1036 -4078 -7497 -7485 -3875 -132 -9176 -11406 -3915 240 -2416 2957 3959
1625 3959 5677 3614 2932 -2701 -5236 337 -1908 -8753 -5295 -565 2630 -1063 -2070 1377 6867
1610 6867 2108 -3681 -4216 -2709 -2321 -7673 -5424 -457 663 576 1239 192 -1239 -324 -6973 -10396
1594 -10396 -6387 -188 1324 2191 1738 3833 3946 -1624 -7365 -4951 -5847 -6677 -1837 5422 14122 10424
1578 10424 12064 12295 5624 4070 12833 14559 8720 2099 6744 12681 10430 5394 -4082 -2700 119
1563 119 5061 8174 4914 1049 3332 -1723 -6104 -7281 -10078 -8644 -4225 481 4723 484 2406
1548 2406 3985 1074 -5191 -6705 -6673 -1709 1164 2083 -348 1491 5144 2853 632 1447 4136 1057
1532 1057 6380 5928 -199 1386 6407 3164 -990 -2241 -2541 1098 -2323 440 3774 3042 1938 -2955
1516 -2955 -1226 -2138 -1891 -229 4645 4236 7812 2031 -4324 -2109 -1461 -3727 -2210 3012 2636 8030
1500 8030 10160 3682 1241 2068 -1122 -865 890 2650 7534 10340 9261 6351 13393 14089 9023 9420
1484 9420 8940 6412 6656 2204 -2692 -6768 -1209 -3891 -5936 -4217 -612 -1866 -3589 917 5450
1469 5450 12292 6829 596 1807 2952 4839 10352 8263 3170 -3366 -8554 -9425 -9473 -13861 -12905 -11055
1453 -11055 -11204 -7344 -1648 355 1702 2924 1297 -2308 -7672 -4312 2495 1992 -1661 -11661 -13874
1438 -13874 -8018 -4894 -5479 -6456 -6440 -103 4065 5437 4127 -1204 -6333 -8005 -4628 1149 -1898 -114
1422 -114 2223 5974 1160 3705 7291 6778 4465 -669 -5000 -6399 -5530 -2297 -863 2229 -1873 -4446
1406 -4446 -10347 -10303 -5027 -1901 -2636 2161 3965 5494 2261 1894 97 -6926 -13120 -13453 -17356 -19131
1390 -19131 -14726 -13729 -10329 -4886 -10509 -13058 -9792 -11508 -15288 -12991 -7418 -1783 8857 5152 -44
1375 -44 210 1223 2439 2087 5613 9330 7687 8005 4701 -2540 -9075 -9559 -7888 -6305 -1747 -122
1359 -122 -1656 -4134 -8702 -14423 -13186 -12480 -10658 -3894 -2621 -3762 -272 1480 -1370 441 -663
1344 -663 1734 -3828 -8660 -7187 -4916 947 3731 6019 2331 3601 2825 2682 2892 4230 6161 4158
1328 4158 9281 4930 1039 -1455 -1758 6093 5226 5553 10802 10238 3344 -655 -875 -3451 -1587 -267
1312 -267 2760 -1789 -3083 -309 3856 -1538 -5649 -8312 -8885 -7213 -9835 -9875 -9039 -11051 -10948 -12195
1296 -12195 -10380 -6453 -1603 -2740 -5308 1537 2890 2573 271 -1448 -4641 -7456 -6179 -1913 -979
1281 -979 -8793 -16680 -15278 -13230 -12074 -10206 -5176 -372 1319 -1059 -369 1754 -1903 -621 5071
1266 5071 1658 -4381 -5302 -9788 -15044 -15787 -7332 -3413 -8258 -7063 -7320 -6783 -6111 -7734 -9572 -5477
1250 -5477 -1296 -2412 1633 943 -1329 2416 7588 7272 12770 5919 -2006 -4193 -1558 616 7813
1235 7813 3281 -4140 -1860 642 -2092 -3056 -2688 -6487 -9170 -10837 -6539 -4269 -6874 -6559 -3700 -4728
1219 -4728 402 -1698 3094 6184 1906 159 3532 5954 7309 4462 4451 7537 7610 3064 8050 3327
1203 3327 -3980 -3962 -6093 -9948 -6411 -8482 -13414 -15016 -9841 665 3346 2304 -4360 -9313 2224
1188 2224 7610 2777 -25 -5369 -6506 -4166 -5463 -2772 -2528 -4560 747 5567 7211 3573 -1471
1173 -1471 -6592 1399 9587 4112 -1750 -1751 3990 305 -6198 -4055 -8148 -12788 -15429 -10205 -10326 -13380
1157 -13380 -9177 -4230 -663 1293 524 715 -3702 -6628 -7730 -5629 7651 10040 9667 8355 7913
1142 7913 6050 3998 6160 4795 2540 -312 -1317 -936 -1255 -4441 -4182 -411 5095 2346 -2426 -3902
1126 -3902 -8465 -11831 -9636 -7909 -6500 -8570 -12099 -8810 -13392 -11654 -5752 1998 2817 2983 5654
1111 5654 7058 5231 3279 2691 -6000 -7799 -2126 1169 2605 5088 -4603 -15132 -18641 -9797 -8102
1096 -8102 -2200 -6049 -5553 -1268 -3581 -5623 -7151 -4559 3769 4868 1250 -2348 -5301 -7515 -5331
1081 -5331 -2934 -5050 -5572 -7529 -10874 -5769 -2404 -3994 -5289 -15527 -12916 -9060 -4933 -3562 -9216
1066 -9216 -9623 -10078 -8908 -4645 -8598 -11719 -8951 -6516 -9470 -18801 -16896 -6414 867 -297 -465
1051 -465 -10428 -8813 -8284 -5648 -2236 2904 8829 5594 1428 6739 6190 676 -3244 -4067 -6980 -2908
1035 -2908 2418 -434 -5044 -6985 -1270 -1802 -3220 1644 10760 8321 707 1431 1112 -1736 -219 3284
1019 3284 1015 -7411 -9036 -8379 -4501 -6110 -9773 -11358 -8638 -2166 2587 -1765 -7476 -6305 -4112
1004 -4112 -1912 -5755 -7900 6803 11564 9731 9641 5813 278 -3065 -7681 -1639 2304 -2659 -3367
989 -3367 4319 -344 -6286 -2086 8120 3636 -2862 -6740 -1559 1079 6062 7287 12410 17231 10559
974 10559 3475 2573 4673 7362 10026 10056 12227 8297 2245 -4292 -11332 -13334 -6603 -222 3458 1844
958 1844 -4560 716 -1164 -8688 -13505 -7578 -7720 -5683 -4607 2130 7979 10410 12425 13709 15317
943 15317 13642 12950 6944 1631 584 5395 6499 8304 1162 -2835 -4833 -6467 -818 1152 2549
928 2549 6252 7603 3519 -1079 -3180 -4956 -7491 -3090 4001 4534 6038 7258 11724 13955 15311
913 15311 13698 5318 745 -5841 -11356 -8663 -746 3143 7228 2613 -151 698 789 -1354 -3408 1247
897 1247 10318 7107 -6231 -6251 -2597 -6486 -2256 7807 3514 -2752 -2950 1711 -8804 -12764 -12160
882 -12160 -10222 -8557 -5654 -7759 -3879 -3212 -6745 -528 -4001 -2784 -6834 -7602 -4946 -3502 -5094
867 -5094 2320 4108 11959 8199 4418 3593 -767 -1480 -469 -4056 -2102 -52 2053 2617 3888 2186
851 2186 6885 6803 10390 10618 846 -31 5000 12345 9445 3057 -3123 -9797 -18023 -16226 -9211 -1021
835 -1021 1487 -2059 5261 9216 6549 5646 5135 5537 7933 5628 -959 -2881 -5017 -2298 -4338 -11522
819 -11522 -10099 -6081 -2708 3625 9073 7397 652 4064 3546 -822 -164 2066 4468 396 1533
804 1533 8385 7921 7485 2494 3148 3325 3406 -464 2647 1124 -2225 -3049 -3463 -3634 1457 2349 6425 7716
786 7716 7348 9866 13543 9496 10719 4785 4255 5924 2938 3870 924 -5438 -1993 -2131 -1974 -4058
770 -4058 -2724 -1809 1477 3843 -1349 -1300 1475 4413 5548 4193 4471 4435 2191 3085 3281 1375 -2822
753 -2822 -5742 -8494 -8306 1113 14401 12195 8478 5783 3294 24 2050 5694 18144 17363 10384
738 10384 6189 5652 7048 5474 1113 789 4416 1097 -688 -5295 -8927 -10185 -2607 6281 5484 4052
722 4052 -3371 -7566 -5853 -3178 -7477 -3580 -2215 1038 -5822 -6014 -2210 -2811 -112 -679 -1113 -1459
706 -1459 3293 2429 2620 3480 2405 -18 2376 6094 7096 4806 2712 5367 5795 7307 2203 2307
690 2307 411 -3636 238 614 1481 2109 5314 12798 13793 6029 5340 6397 -4300 -13128 -7253 -4150
674 -4150 265 275 -1666 -2324 -5017 -3441 812 7583 7362 -1073 1160 -548 9762 10680 5585 2562
658 2562 -2157 -7699 -6689 -5430 -2034 -2515 -1045 6116 6171 5387 10051 13189 14866 14708 15353 16187 16759
641 16759 9367 862 1266 1311 -6003 -4787 3267 796 -151 -2478 -3713 -493 4257 10157 7625 12356
625 12356 10548 10426 8298 2846 1683 -1804 -2020 6111 9525 5875 2017 352 583 -3996 -5492 -5896
609 -5896 -4136 -3032 -4011 -1311 -3456 2657 10897 9181 4282 4799 10580 9865 4732 2387 -2498 -5078
593 -5078 3293 2050 2905 11242 11772 7649 9534 1942 1117 -4760 -10368 -12674 -15073 -8109 -3080 -2696
577 -2696 -1625 1712 1243 -1516 1361 -3441 -4693 -5273 -1691 7296 14222 7385 445 -3373 -2477 -2311
561 -2311 435 3214 -3639 -5824 -9340 -10487 -4308 -1576 2082 214 6562 11197 11465 7744 7822 15019
545 15019 15361 13498 10072 3424 -4305 -1538 3313 4804 1291 -271 2174 4861 5890 -758 -2073
530 -2073 2079 10741 14471 10373 3514 91 -3989 -3365 -3407 -171 41 -1693 5920 7090 5333 4720
514 4720 -2778 -4510 -3795 -3277 5557 13631 9544 2852 3093 7646 8117 10566 8663 3909 5579 6987
498 6987 2861 1126 -956 -913 1438 2789 1172 -2558 -2048 -498 1215 -116 -1787 844 3090 2649
$$ [...]
##END NTUPLES=NMR SPECTRUM
##END=
