##TITLE=Analysis number 327119
Compound Code btb 09810
Project Code adrs lab3
Chemist Name stores
##JCAMPDX= 6.0         $$ Bruker NMR JCAMP-DX V2.0
##DATA TYPE= NMR SPECTRUM
##DATA CLASS= NTUPLES
##ORIGIN= Bruker BioSpin GmbH
##OWNER= nmr
$$ XWIN-NMR		Version 3.5
$$ Mon Mar 12 11:55:42 2007 GMT Standard Time (UT+0h)  MAYBRIDGE\nmr@NMR_250MHZ
##.OBSERVE FREQUENCY= 250.131544655141
##.OBSERVE NUCLEUS= ^1H
##.ACQUISITION MODE= SIMULTANEOUS (DQD)
##.ACQUISITION SCHEME= undefined
##.AVERAGES= 16
##.DIGITISER RES= 18
##SPECTROMETER/DATA SYSTEM= dpx250
##.PULSE SEQUENCE= zg30
##.SOLVENT NAME= CDCl3
##.SHIFT REFERENCE= (INTERNAL, CDCl3, 0, 16.522)
##AUDIT TRAIL= $$ (NUMBER, WHEN, WHO, WHERE, WHAT)
$$ ##TITLE= Audit trail, XWIN-NMR		Version 3.5
$$ ##JCAMPDX= 5.01
$$ ##ORIGIN= Bruker BioSpin GmbH
$$ ##OWNER= nmr
$$ C:\u/data/dgb/nmr/ADRS/670/pdata/1/auditp.txt
$$ ##AUDIT TRAIL=  $$ (NUMBER, WHEN, WHO, WHERE, WHAT)
(   1,<2007-03-12 11:55:23.43 +000>,<MAYBRIDGE\nmr>,<NMR_250MHZ>,
      <created by zg, POWCHK disabled, PULCHK disabled
       configuration hash MD5:
       49 4B E0 1D 92 C2 6B 37 9F E6 65 BC 52 41 86 1D
       data hash MD5: 64K
       C0 44 AC F4 BA 91 FF 15 29 87 15 FE 37 02 D1 D9>)
(   2,<2007-03-12 11:55:35.50 +000>,<MAYBRIDGE\nmr>,<NMR_250MHZ>,
      <Start of raw data processing
       ef LB = 0.3 FT_mod = 6 PKNL = 1 SI = 32K 
       data hash MD5: 32K
       31 86 62 3D 89 4B C5 FB 0A CD A2 6A 57 91 A5 5B>)
(   3,<2007-03-12 11:55:37.05 +000>,<MAYBRIDGE\nmr>,<NMR_250MHZ>,
      <apk 
       data hash MD5: 32K
       3C 54 46 C5 94 FE 6B A1 2A 8F BF 88 0C F1 33 F3>)
(   4,<2007-03-12 11:55:37.91 +000>,<MAYBRIDGE\nmr>,<NMR_250MHZ>,
      <abs ABSG = 5 
       data hash MD5: 32K
       18 93 A8 F0 A0 CF 50 CC EE B7 AC 91 EE 45 AD 3F>)
$$ ##END=
$$ 
$$ hash MD5
$$ 83 E7 18 9F D0 76 AF A0 27 68 09 25 86 51 CD EB
##$RELAX= 
##$RELAX= 
##$RELAX= 
##$RELAX= 
##$RELAX= 
##$RELAX= 
##$RELAX= 
$$ Bruker specific parameters
$$ --------------------------
##$DU= <C:\u>
##$EXPNO= 670
##$NAME= <ADRS>
##$PROCNO= 1
##$TYPE= <nmr>
##$USER= <dgb>
##$AMP= (0..31)
100 100 100 100 100 100 100 100 100 100 100 100 100 100 100 100 100 100 
100 100 100 100 100 100 100 100 100 100 100 100 100 100 
##$AQSEQ= 0
##$AQ_mod= 3
##$AUNM= <au_zg>
##$AUTOPOS= <9 >
##$BF1= 250.13
##$BF2= 250.13
##$BF3= 250.13
##$BF4= 250.13
##$BF5= 500.13
##$BF6= 500.13
##$BF7= 500.13
##$BF8= 500.13
##$BYTORDA= 1
##$CFDGTYP= 0
##$CFRGTYP= 5
##$CHEMSTR= <none>
##$CNST= (0..31)
1 1 145 1 1 1 1 1 1 1 1 1 1 1 1 1 1 1 1 1 1 1 1 1 1 1 1 1 1 1 1 1 
##$CPDPRG= <>
##$CPDPRG1= <>
##$CPDPRG2= <>
##$CPDPRG3= <>
##$CPDPRG4= <mlev>
##$CPDPRG5= <mlev>
##$CPDPRG6= <mlev>
##$CPDPRG7= <mlev>
##$CPDPRG8= <mlev>
##$CPDPRGB= <>
##$CPDPRGT= <>
##$D= (0..31)
0 1 0 0 0 0 0 0 0 0.06 0 0 0 0 0 0 0.0002 0 0 0 0 0 0 0 0 0 0 0 0 0 0 
0 
##$DATE= 1173700522
##$DBL= (0..7)
120 120 120 120 120 120 120 120 
##$DBP= (0..7)
150 150 150 150 150 150 150 150 
##$DBP07= 0
##$DBPNAM0= <>
##$DBPNAM1= <>
##$DBPNAM2= <>
$$ [...]
##$SUBNAM7= <"">
##$SUBNAM8= <"">
##$SUBNAM9= <"">
##$SW= 20.6930455092707
##$SWIBOX= (0..15)
0 0 3 0 0 0 0 0 0 0 0 0 0 0 0 0 
##$SW_h= 5175.983436853
##$TD= 65536
##$TD0= 1
##$TE= 683.16
##$TE2= 300
##$TE3= 300
##$TEG= 300
##$TL= (0..7)
0 120 120 120 120 120 120 120 
##$TP= (0..7)
150 150 150 150 150 150 150 150 
##$TP07= 0
##$TPNAME0= <>
##$TPNAME1= <>
##$TPNAME2= <>
##$TPNAME3= <>
##$TPNAME4= <>
##$TPNAME5= <>
##$TPNAME6= <>
##$TPNAME7= <>
##$TPOAL= (0..7)
0.5 0.5 0.5 0.5 0.5 0.5 0.5 0.5 
##$TPOFFS= (0..7)
0 0 0 0 0 0 0 0 
##$TUNHIN= 0
##$TUNHOUT= 0
##$TUNXOUT= 0
##$USERA1= <user>
##$USERA2= <user>
##$USERA3= <user>
##$USERA4= <user>
##$USERA5= <user>
##$V9= 5
##$VALIST= <valist>
##$VCLIST= <CCCCCCCCCCCCCCC>
##$VD= 0
##$VDLIST= <DDDDDDDDDDDDDDD>
##$VPLIST= <PPPPPPPPPPPPPPP>
##$VTLIST= <TTTTTTTTTTTTTTT>
##$WBST= 1024
##$WBSW= 4
##$XGAIN= (0..3)
0 0 0 0 
##$XL= 0
##$YL= 0
##$YMAX_a= 488773
##$YMIN_a= -404451
##$ZGOPTNS= <>
##$ZL1= 120
##$ZL2= 120
##$ZL3= 120
##$ZL4= 120
##$ABSF1= 16.522
##$ABSF2= -4.171173
##$ABSG= 5
##$ABSL= 3
##$ALPHA= 0
##$AQORDER= 0
##$ASSFAC= 0
##$ASSFACI= 0
##$ASSFACX= 0
##$ASSWID= 0
##$AUNMP= <proc_1d>
##$AZFE= 0.1
##$AZFW= 0.1
##$BCFW= 0
##$BC_mod= 0
##$BYTORDP= 0
##$COROFFS= 0
##$CY= 12.5
##$DATMOD= 1
##$DC= 0
##$DFILT= <>
##$DTYPP= 0
##$F1P= 14.0000005364418
##$F2P= -0.99999901652339
##$FCOR= 0.5
##$FTSIZE= 32768
##$FT_mod= 6
##$GAMMA= 0
##$GB= 0
##$INTBC= 1
##$INTSCL= 1
##$ISEN= 128
##$LB= 0.3
##$LEV0= 0
##$LPBIN= 0
##$MAXI= 10000
##$MC2= 0
##$MEAN= 0
##$ME_mod= 0
##$MI= 0
##$NCOEF= 0
##$NC_proc= -4
##$NLEV= 6
##$NOISF1= 0
##$NOISF2= 0
##$NSP= 0
##$NTH_PI= 0
##$NZP= 0
##$OFFSET= 16.522
##$PC= 1
##$PHC0= 229.5644
##$PHC1= 5.253539
##$PH_mod= 1
##$PKNL= yes
##$PPARMOD= 0
##$PSCAL= 4
##$PSIGN= 0
##$REVERSE= no
##$SF= 250.13
##$SI= 32768
##$SIGF1= 0
##$SIGF2= 0
##$SINO= 400
##$SIOLD= 32768
##$SREGLST= <1H.CDCl3>
##$SSB= 0
##$STSI= 32768
##$STSR= 0
##$SW_p= 5175.98343685301
##$SYMM= 0
##$S_DEV= 0
##$TDeff= 65536
##$TDoff= 0
##$TI= <Analysis number 999999
Compound Code 99
Book Reference 9
Project Code 9>
##$TILT= no
##$TM1= 0
##$TM2= 0
##$TOPLEV= 0
##$USERP1= <user>
##$USERP2= <user>
##$USERP3= <user>
##$USERP4= <user>
##$USERP5= <user>
##$WDW= 1
##$XDIM= 32768
##$YMAX_p= 294988482
##$YMIN_p= -563287
$$ End of Bruker specific parameters
$$ ---------------------------------
##NTUPLES= NMR SPECTRUM
##VAR_NAME=  FREQUENCY,     SPECTRUM/REAL,   SPECTRUM/IMAG
##SYMBOL=    X,             R,               I
##VAR_TYPE=  INDEPENDENT,   DEPENDENT,       DEPENDENT
##VAR_FORM=  AFFN,          ASDF,            ASDF
##VAR_DIM=   32768,         32768,           32768
##UNITS=     HZ,            ARBITRARY UNITS, ARBITRARY UNITS
##FACTOR=    0.157963299565203, 1,           1
##FIRST=     4132.6476996994, 0,             0
##LAST=      -1043.33573715361, 0,           0
##MIN=       -1043.33573715361, -563287,     0
##MAX=       4132.6476996994, 294988482,     0
$$ Real data points
##PAGE= N=1
##DATA TABLE= (X++(R..R)), XYDATA
$$ [...]
25243G391K3209n919k4618k723k5494k1189M346P461R37R501J7305K627J1112
25230C946R308k9926J3529J1432j9988N569o331j5619M599k687J4876O926j5015
25217a9381M954J3602o607k700n772K9291J1313j0751k595J5336J0268q47k4238
25204A1873P817k4369J132j3977p898r406r685K5346K9948j5798k192K1257j7204
25191c156j5246O215j0182M7513M4677j5762l3874l5644K4734K4245r745k0670
25179C105j393J5358m701j3107R873J1852J0167L2363J648m0622k6617k232J5536
25166A1230J3474J7351k6607k3930q194J5255P891n404J8935N020j1883j6719
25154c581Q773J0870P033o004k3044M229n594k452J662J3374J6220J6563l783
$$ y = [7391, 30600, 24681, 63, -2660, -28154, -49343, -44997, -37536, -36599, -27098, -9793, -7166, 3946, 13254, -16672, -3143, 8289, -11699, -6130, -12461, -28080, -23481, -26168, -11292, -4366, -19381, -14427, -825, -7432, -10132, -15904, 13387, 24700, 13949, 11354, 26690, 36958, 36111, 11873, 19690, -4679, -3547, -17524, -25422, -34828, -44513, -19167, 10781, -5017, -7209, 14048, -3156, -18402, -12187, -22369, 25144, 69821, 54059, 20185, -15459, 9275, 33520, 23775, 3105, 1712, 17070, 12369, -738, 9135, 20987, 31154, 63517, 65165, 24543, -2074, -4306, 11230, 24704, 42055, 15448, -8482, -16676, -1421, 6470, 1066, 20001, 25021, 13138, -3581, 5192, 16062, 23095, 17091, -5953, -1724, -7318, -9770, -8108, 5266, 21486, 38049, 34266]
25141C4266l784j5765j3085j5823M117R760L56P351L349j3689j6612P504J6763
25128D708l661j3378r576J9410O838j4456J4406L0878j8386k4070K302k81j0736
25115a6002K986j590m099L193o217q386p692P235J3825N601k2130J0228K1004
25102b044p414q724q215K0773K3622L670j633q50j226j9609J398J2825J6101K687
25088C1361o317k065r19p938l243j1643J3292j2461K0477K6558j7916k6605k6965
25075b4384j0252K6320J5322J5687J061q817n275k730m0690n150K5768L9451J3852
25062D0163j2450j6227J4560J0965j7729k9684j1589j13J4875K5572J4245r33
25050C1655k2701j3351O334J85n724j3303L594J4173K2510p469k5774J3M311K5622
$$ y = [34266, 30482, 14717, 1632, -14191, -10074, -314, 42, 7393, 10742, -2947, -19559, -12055, 4708, 1047, -12331, -21907, -2497, 4341, -10115, 4291, 35169, 16783, -7287, -4985, -5266, -16002, -13016, -14606, -18705, -15512, -21729, -30115, -37807, -30572, -16747, -11146, -33276, -23048, -2044, -9458, -18182, -26397, -5624, 17998, 21668, 20035, 19185, 17959, -1650, -252, 12573, 28674, 31361, 25044, 22979, 22060, 14122, 10879, -764, 12528, 67, 20544, 47102, 29186, 2581, -24384, -34636, -8316, 7006, 22693, 23754, 14937, 9662, 6932, -33758, -38908, -13140, 26311, 40163, 27713, 11486, 26046, 37011, 19282, -10402, -21991, -22104, -7229, 18343, 32588, 31655, 8954, -4397, 1937, 2122, -3602, -16905, -13311, 862, 23372, 15903, -9871, -9858, -5547, 20075]
25036B0075L087l552R754O379j5215l2328j0743L050K497L1507K6657K880J329
25023D5377l0560k6850R634J2527j3574j095k835p97k540j0459J9639r860J5854
25010D461J3735j1900k5257n112j7498J6655J405J6475J9401O81N64k4178j808
24997a2376J3074K0997m63m5940o766Q106K2334J3136O101l85k7725J6225R590
24984A5908j0003l7858p035L0725J5475k102k0036j7076L8016L8463k1885k0692
24972A900J9364r939j3786k8266M40O058j4518n58j3059J0836M1298P030k9736
24959b2936l69Q779J3893o555J699k5463l201k079K5383L0226J843M441J3491
24946C9152O09m164p539j2772M116O088J1274J1017j9527j9159L005j0124J769
$$ y = [20075, 23162, 19610, 29364, 35743, 20528, -11800, -22543, -19493, -16996, 14511, 41168, 44048, 45377, 14817, -12033, -2399, 10128, -3446, -4541, -7376, -8173, -10713, -21172, -1533, -11393, 4461, 18196, 6296, -18961, -24073, -41571, -24916, -23511, -7036, 12365, 13046, 13610, -10568, -12376, 698, 21695, 21232, -24708, -31474, -23368, -1034, 12102, 18203, 17818, -9907, 6318, 15908, 5905, -31953, -38988, -8263, 7212, 5110, -14926, -32002, 6014, 44477, 22592, 1900, 21264, 11325, -2461, -30727, -30287, -24229, -38747, -39305, -52364, -41528, -230, 6800, -22936, -23305, -14526, -633, -7188, -5489, -30952, -34153, -36232, -10849, 19377, 21220, 25661, 39152, 39761, 35597, 28058, 15286, 19402, 25490, 36764, 47781, 28254, 9095, 12100, 1976, 3745]
24933C745j589j6449R919m166j5745O364J0525r059P414O954P892k1143k7305
24920d2643q296K1210K3761r689k0835K1794m82J1115K926p614N422O963k4405
24907b0773j9090q504K6782L0867p003m1549j024K1780K6623l514k2290R638j3592
24894b1649n042L8875R359J2702p459l410j368K557K688k5414P234J0545k3647
24881d029n580k9268k775K3987K3326K0262n557p938m314K2931N227m5493j0094
24868a9315O659J6854J8057Q977n373n943J4631J0218K9671k3662j2555k7920
24856A0299l7553N40M9538o082m266k089k541j2822j3893j616Q372m215J9937
24843C609j9552K231N574o263J9595J8146k03P546k5402j3307m95k917m828j7651
$$ y = [3745, 2156, -14293, -4374, -8540, -24285, -17921, -7396, -16455, -9041, -2087, 5805, -15338, -42643, -50939, -29729, -5968, -15657, -36492, -14698, -15180, -4065, -1139, -8753, -3331, 3632, -20773, -39863, -48367, -21585, 9282, 2279, -39270, -40294, -18514, 8109, 4595, -17695, -8057, -21649, -26691, 12184, 21543, 34245, 26786, 23376, 22008, 24565, 27253, 1839, 9073, 19618, -4029, -9609, -38877, -41652, -17665, 5661, 25923, 20366, 12428, 8114, 31045, 36272, -9221, -19315, -12656, 4198, 22255, 31232, 25859, 19916, 34547, 44765, 74436, 50774, 38219, 10299, -27254, -26714, 22824, 16742, 12476, 10387, 7846, -4976, -18869, -20485, -12113, -16328, 3609, -15943, -13712, -8138, -14401, 5194, 23340, 23137, 30683, 5281, -8026, -8521, -11438, -16266, -33917]
24829c3917j7927K1609J1326m834k117M120J399K309R387P724K4769l198j5284
24816E366k8222l0640j7995L2080n03J7562J4558n753k0129N53j6276q149O91
24803e6857L1031N959J4233P816k112K2319J4342J1252j4967k7223j2847k708
24791i762n792j4685P409J4557p035N05J159M724Q517K4126k0536j6436N309N951
24777a989k369M509J5554L3978J1842n967k5365k249K2584J1824k8658q085L085
24764B8694L961o816l260j8594p952K0030J4730k629n098j8790k193N279O339
24751A3701J468L796k104R469j4860j6365J5028K3406L372l1942l0795p93Q361
24738a8258r343J0482m858P244o630J1173J1415L5529J1727k7086k2623J2775
$$ y = [-33917, -51844, -30235, -18909, -23743, -25860, -21740, -20341, -18032, -8645, -921, 23848, 20650, 5366, -22856, -53496, -71491, -39411, -39914, -22352, -7794, -13547, -33676, -33123, -49399, -57548, -56857, -25826, -19867, -5634, 2182, 70, 22389, 36731, 47983, 33016, 5793, -7054, -9762, -15554, -30239, -22830, -8273, -15308, -14803, -13644, -8920, -403, 23723, 3187, -13249, -7940, -1989, -4358, 151, 15705, 49683, 61525, 55558, 30193, 27944, 50528, 62352, 33694, 25609, 28694, 32655, 25839, 22579, 3985, -3967, 16063, 30793, 28164, 23066, 4276, 2083, 7362, 13701, 15169, 18965, 16861, 26330, 11470, -4895, 10133, 33539, 36911, 4969, -25826, -26619, -18258, -27601, -17119, -21977, -14733, -21363, -10190, 1225, 36754, 48481, 21395, -1228, 11547]
24726A1547p50p626k1934J8180K1786J3184K55k4614j0656J5038J767K6655j3122
24713B9710J2711k0018k0337Q614L860O477L550k1212n918k481K5222N819q876
24700A7121o065j636j9662L0354J2133j0938l1621k446L672j631K2878J4999k9987
24687b829k8049N354L17j3694J3618J4388o323L1255K7876m58m4043l232J4105
24674H285L6060K4312q986k9912j5330q261j1477K2665l867J38j6301K632j143
24661a185j9663M165K9318n39j6436j0715k79j4755l677j317J4711K6405k705
24648C328k0824J3060K945P737M821M22m114p217P200J7388J3294j0052q705m0810
24634b1527r744K1872K7287j1143j1951R723M945L968k5668Q688J1913l6556j5301
$$ y = [11547, 10797, 3171, -18763, -583, 21203, 34387, 34642, 10028, -628, 14410, 16177, 42832, 29710, 42421, 22403, 2066, 10680, 14540, 21017, 24567, 3355, -2563, -5044, 20178, 25997, 17121, 11056, 9420, -10242, 20112, 32245, 21307, -10314, -12760, -9088, -10719, 12159, 27158, -2829, -30878, -25524, -25207, -38901, -25283, -10895, -17218, 14037, 41913, 41455, -2588, -5820, 8285, 44345, 68657, 59671, 29759, 14429, 6168, -5309, 17356, 13489, 13627, -2674, -42, -1185, -20848, -16683, 12635, 12096, -4340, -15055, -15334, -30089, -33766, -35083, -20372, 6033, 3328, -17496, -4436, -1491, 6246, 11067, 11489, 7375, 158, 7358, 24746, 38040, 27988, 19283, -21527, -31271, -9399, 17888, 6745, -5206, 4517, 9462, 13430, -12238, -3550, 8363, -28193, -43494]
24621d3494K6965O509n493K4050J1916j2205n704R957M805J9453m6069k7529R837
24608b7002K4419Q8l7210K9261J3902L536j6092j2429O723J6319k3090R213K2573
24595A0211K7130K4043j7727K282o056k7299p523R056n034j7430n825r348p909
24582c1429J6083j068n291l230k286J7741q038k1215J4559K6971k8045j9311J5774
24569b8785K0173J2184Q657l988o843J3930M512p383j4034k2860L558k674p097
24556c0650j4600K5561M8467k2337j9162K6904J380L978J1469o155j4391k703
24544G761J7425J571j4553J0894q048q71l4j7187j8996J1449K6286K0527j2411
24531B3813k822j5461j0616o47k2770P128K3130J9550p047p802j3706k882R047
$$ y = [-43494, -16529, -10020, -15513, 8537, 20453, 8248, 2544, 12501, 17306, 36759, -9310, -36839, -27002, -2583, -2495, -39705, -10444, 3458, 6994, -9098, -21527, -14804, 1515, -21575, -12362, 10211, 37341, 61384, 43657, 45939, 39883, 12584, 5061, 14117, 9083, -8347, -14172, -23520, -31429, -15346, -16414, -21705, -24935, -27221, -9480, -17518, -38733, -24174, 2797, -25248, -44559, -28785, -8612, 3572, 12229, 8241, 1398, 15328, 19840, 12457, -1577, -24437, -20879, -23553, -30650, -45250, -19689, 28778, 6441, -12721, 14183, 15563, 19541, 31010, 24855, 10464, 7761, 25186, 26757, 12204, 23098, 15050, 14179, 14145, -3042, -22038, -10589, 15697, 36224, 23813, 20991, 5530, -5086, -5733, -28503, -21375, 1755, 21305, 14258, 6456, -7250, -10132, -1085]
24518a085j952j5935J149K7784J3861J5496r971k8351r320j4346J1480L382j0287
24505a8095p262Q27M999j6623l4041J2043K8852J2743J4144J6623O680J3975j1657
24492B3208p231k3183m645l373P180K1460J1605k0250k3718j1215M725j629L4625
24479G559n351j4770J6642K5148P319J2575k782k0407j2898J1788k680k32O762
24466B8673j1909l381N583K4757J2315m774j5504l8566k644Q283j2402j3516j3926
24453c7011J6313L5355K7386J6949k1331o901J6337o422k9280l4186m733K7054
24441d70M7187k0824l3734k23K0915N072l485q631R977K227q653j0037m828j7071
24427b2578K048M90l759n219J0821L4629J2007j6015j9674K4366J1728R011j5560
$$ y = [-1085, -3037, -18972, -17823, 9961, 23822, 39318, 29347, 996, -8324, -22670, -11190, -7808, -18095, -25357, -24530, -19531, -36154, -70195, -58152, -29300, -16557, -2413, 14210, 20890, 34865, 23208, 15977, -7206, -11851, -15224, -8044, 13416, 25021, 4771, -18947, -30162, -25437, -27066, 7559, 2208, -12562, 4080, 29228, 36547, 49122, 46340, 25933, 13035, 24823, 22143, 21911, 28673, 16764, 13383, 18966, 43723, 56038, 51264, 35760, -2806, -5450, 2833, -9569, -23085, -37011, -20698, 14657, 42043, 58992, 37661, 30760, 47097, 40675, 11395, -22791, -27524, -470, 46717, 25893, -7841, -8064, 12851, 17923, 14438, 5807, 15784, 18011, 9358, -679, -5507, -22578, -20530, -20040, -23799, -29018, -18197, 16432, 28439, 12424, -7250, 17116, 28844, 37855, 22295]
24414B2295j0324m223J3615L936k2808k2404J8865R309k932O194j1211k2812k9839
24401e2339j1362J8814J7965L2475J5858K0475N696j0743j8950m243Q46K8134
24389D2626q998p708k0831q997L789J9942R027l668l5925L675M961K732l697k509
24375e581m1261OM3129n625j232P885k2724o33J1504K9921J6850L875J5038J697
24361E2849r315k7321J238J4789k210k3064k2529K6545q704p120l890R16J2191
24348D375j8542J272L2631K814j6131j5552k427J3570k679p017P456J2865J1496
24335B4131L6893j6799l0744j8357j1960J3660j4339l7982K3930J9072L6675J0795
24323C4975j21j8578n077m062P079j2811k00K7233k065k6765J5780j0907Q670
$$ y = [22295, 11971, 7748, 21363, 25299, 2491, -19913, -1048, 8261, 5329, 11523, 312, -22500, -52339, -63701, -44887, -26922, 5553, 21411, 41886, 47582, 36839, 17889, 13646, 14492, 42626, 33628, 25920, 5089, -3908, -119, 19823, 28850, 25182, -10743, -7068, -2107, 625, -3072, -5581, -46842, -46836, -3707, -9332, -10564, -2679, -25403, -26036, -14532, 15389, 32239, 36114, 51152, 52849, 43534, 16213, 17451, 32240, 30030, 6966, -15563, 10982, 2278, -4842, -8732, -7816, 4375, -14167, -12895, 19736, 22550, 6419, -9133, -11560, 2010, -669, -7686, -230, 12635, 24131, 61024, 44225, 13481, -4876, -16836, -3176, -17515, -55497, -31567, -12495, 24180, 34975, 34854, 16276, 11199, 7137, 14216, 1405, 1205, 28438, 26373, -392, 15388, 4481, 13151]
24310A3151k8000R01K5443J2736j6368m1274j4821J7366K0950J1947J027J2869
24298A5927o019l1728J0014L0812J3511j4503N6K7563M477O339j012j2412n238
24285C7787k9091l0758K2483J593j4055N236J3551m748m509P768m1131N08p80
24272c6146n906J8329M758o970J2298j5465j2377J2720M862J7348L104J4507j9031
24259g969L10k023l128M3296K133l3654l2711j003l169L824J1427J7543J3137
24246H013K7940L2470l3285k2073k5909q222k3146o061j5954L394M4188L2582
24234A3937j189l757j3436j1536j4839J4458K0089K24l991m956k62q984q348k00
24220b2790j2784J0054J1550L8115N05j1211j1606R566j370J3620K8567J734R227
$$ y = [13151, -14849, -13948, 11495, 24231, 7863, -33411, -48232, -30866, -9916, 2031, 3058, 15927, 9908, -21820, -11806, 19006, 32517, 18014, 18070, 45633, 50110, 56449, 55437, 43025, 37787, 8696, -22062, 421, 2014, -12041, -6805, 6746, 1998, -2511, 5257, -35874, -35366, -36146, -42052, -23723, -18965, -25935, -13637, -29102, -41479, -28759, -23897, -6549, -3445, 11062, -7969, -7659, -9682, -12810, 30486, 32619, -1035, -33746, -34749, -37918, -34094, -22667, -5124, 8013, 35953, 68423, 35138, 13065, -12844, -21066, -44212, -50273, -66227, -62833, -18645, 13937, 12748, 8991, -4445, -15981, -30820, -16362, 3727, 3951, -40, -4996, -5258, -14242, -22590, -22790, -35574, -25520, -13970, 24145, 24650, 13439, 1833, 11399, 10029, 23649, 52216, 53950, 63177]
24207F3177l0470l7052m781j945J7949N243k7072j5553J9810K7153j8948j0198
24195a2687Q211J4915j8601J415j3335j2593k817J0314R426m604K1191J0341K7786
24182C8962k3518k6851p407L166n956K620J2169O938r177K7070m642q408P004
24169A1970J9806J0365k4870j9116k3203J1546r238l5185K0334K1981j9473l414
24157c8497Q244L3752J8926k9102j3595o804J3056R919K1233j4741k3193k174
24145b2976J3257Q000q73j2112J5960J3948J1201l347J1591l1317J9022K2353
24133D4707J0992j8492j5146j812j3020j3007j8809k3281k4554M100M2136K2189
24121c997J7201J24j9751K801k0361J5674K1685J3387j0372j5222k2161j6227
$$ y = [63177, 32707, -4345, -9126, -11071, 6878, 12121, -14951, -30504, -10694, 16459, -2489, -12687, -4476, 10439, -8162, -6747, -20082, -32675, -35492, -25178, -15752, -20356, 835, 11176, 38962, 15444, -11407, -18814, -15648, -21604, -18984, -6815, 123, -9054, 18016, 13374, 4966, 11970, 31776, 42141, 17271, -1845, -25048, -13502, -22740, -57925, -37591, -15610, -35083, -38497, -30253, 3499, 22425, -6677, -20272, -27076, -14020, -4101, 17132, 2391, -20802, -22976, -9719, -1719, -2592, -14704, 1256, 15204, 26405, 23058, 34649, 3332, 22354, 44707, 55699, 37207, 22061, 20249, 7229, -5778, -24587, -47868, -72422, -68322, -26186, -3997, 13204, 13328, -6423, -3622, -23983, -8309, 13376, 26763, 16391, 1169, -20992, -37219]
24109c7219j287k0470j879J9936o896o988P349L4759J8636J5910J3582j2409k2885
24096A39O462q870k4158K2830M373k2202J1710J4422J9111k924N447n705m500
24083A6135Q882J9741p614r46j1570J894o975j8967L253Q160J2081K198K5657
24070E1929k1191Q586L24J5635j8498l0187j78L6206J4573k1826p58J483J762
24057C7860l823k9176j6385K6897M0746M22j0473k5339n308k1987L443K1683O062
24044B4622k73j2026n918R97J7659P606k8266j4709J0277J3810J7641K5452l744
24031E3128%p495O200J2453q598J283o639k2420K558o035O868j664j2526q906
24017H207n606m316l813J6650J7930J2257M267k1309l7040l040j149J8586q763
$$ y = [-37219, -38506, -58976, -60855, -40919, -47815, -54803, -47454, -12695, 5941, 21851, 35433, 23024, 139, 6601, -2269, -26427, -3597, 776, -21426, -9716, 4706, 23817, 20893, 26340, 20635, 16135, 25017, 44758, 37144, 36198, 24628, 26522, 19547, 580, 3833, 11993, 24074, 26272, 51929, 30738, 39324, 39648, 55283, 36785, 6598, 6420, 42626, 57199, 35373, 34615, 36098, 37860, 34037, 4861, -11524, 15373, 56119, 56541, 46068, 20729, 15421, -6566, -3123, 18560, 24622, 24349, 12323, 6405, 7402, 25061, 32667, 4401, -10308, -31, 13779, 31420, 56872, 53128, 53128, 45633, 51833, 64286, 55688, 56971, 50332, 27912, 30470, 24435, 31303, 29639, 17113, 8207, 2601, -1715, -5528, 11122, 29052, 41309, 45576, 24267, -12773, -15813, -16962, 1624, -7139]
24004g139p419o927O434K5314K079k0783j1464p66j0524k4656L181J7312L7384
23991B026J3459J671R445q960k2070J3788o533N901K9125r493j3208L0561J8441
23978F4153m3922P729K4246K1504l4269k8480N366j1204l4255o323j6988J834
23966e0609K0339K2007m992M24P443K7697J0259k7680L155p959J173J2671J5482
23953B9410j2658p620n557l2966j376J9173Q326l4827l167K5705O8j7256k5289
23940e8034J3193K2660n97j8886J0116K020J9809L2843k826k3365K300J5452J0631
23927B5316J377L401l1098o721k6433q21J861L3726N42l2127j568J8206Q548J3047
23913G256L335L909O873k5405q056m853P26j8439J8159J8532J2850P738m273k6539
$$ y = [-7139, -14558, -21485, -15051, 10263, 12342, -8441, -19905, -20671, -31195, -55851, -52670, -35358, 2026, 15485, 17156, 26601, 17641, -4429, 9359, 2826, 8727, 37852, 28359, 15151, 45712, 64153, 20231, 27960, 52206, 73710, 39441, 10961, 16327, 5123, -29132, -35455, -52443, -50609, -30270, -8263, -13255, -12831, -5388, 22309, 32568, 4888, 8043, 84, 1257, 13928, 29410, 16752, 9132, 3575, -29391, -30767, -11594, -3268, -38095, -41262, -15557, -15489, -32745, -58034, -44841, -22181, -22778, -41664, -31548, -29528, -9719, 23124, 20298, -3067, -767, 14685, 25316, 26693, 30094, -1004, -7725, -34158, -34979, -33118, 608, 1150, -30977, -32545, -14339, -5791, 7256, 10591, 14500, 21373, -4032, -12088, -16941, -16215, -34654, -16495, 2037, 14887, 22625, 18352, -8187]
23899h187R004l0345k4049Q054K6920K8610j3434Q747l399o273r778j1680R466
23886a6344J0568K3525O821j2115k500j5573q207K0826K0940k1260N981K2152
23874C4814l936j8440J4890o116l2173j2685R162J2089k1134k4962J5934K8350
23862d207l878J7612j0431j1709o726K2197K8521n791j4932k1902Q810J0994j7920
23849i362K7120K263j5970j2376K3801J2565l168j2677R342K9811K3316j2341
23837F2324l6825l0726Q024p985k0724O264m653P99k5099J1580L6593N809j1443
23824f062O514K0751O466j3538N46J8651J267o606j2746k7361k1769K0752P02
23811a2433J5007O537P742M334j5109k2593j230J760K502L735J3775K9945m2385
$$ y = [-8187, 817, -29528, -53577, -45523, -18603, 10007, -3427, 5320, 1921, -4352, -14130, -25810, -16344, -5776, 17749, 24570, 12455, 9955, -5618, -13825, 7001, 27941, 6681, 12662, 34814, 30878, 12438, 27328, 21212, -10961, -23646, -14484, -2395, -23529, -48491, -32557, -4207, -8085, 9527, -904, -12613, -19339, 2858, 31379, 25588, 10656, -11246, -2436, 8558, -9362, 17758, 20021, 4051, -8325, 15476, 28041, 24873, 12196, 21538, 51349, 74665, 62324, 25499, -5227, 2797, -5188, -25912, -19648, -24301, -23502, -48601, -37021, -428, 5381, -6062, 452, 21203, 27669, 14131, 14677, 33328, 34595, 27989, 15243, -12118, -33887, -13135, -12433, 2574, 9111, 16853, 21187, 6078, -16515, -17745, -15985, -13483, -9748, 4027, 33972, -8413]
23798h413m0775L749K0835L1452J3274j3006O948K663p261r616L0124j2973k7555
23785a0554o237J1847j4360l481L1982K5454l0540j4751l7713J9762L6357R729
23773A7495J0342q6m7832k353o277m096K009Q215J4064Q514p129o995j3158k7915
23759e5202R919Q245p796R4P614J7651m662J723P325L4042P584j7774k6190K2286
23745D859L6736k6366k2401K7636P334l716p547q297j6986q127J2928l346M969
23732b324q642k6434O107k551k778K56J1988K4680O987j5254l722Q202J7033L295
23718A6843r910j2874k0366J3427n054p839l114P481J5504O460K5886J2225J4416
23705E3085q448j7374k2374j8409J2127J3055l1964l5119N808K4450N345O107
$$ y = [-8413, -49188, -45439, -24604, 6848, 20122, 7116, 14064, 16727, 9466, -150, 29974, 17001, -10554, -16791, -4944, -19304, -22785, 9197, 34651, 4111, -10640, -48353, -28591, 7766, 17495, 27837, 27751, -20081, -22434, -28711, -32807, -30798, -22583, -8519, -5, -7134, -14129, -27287, -55202, -45283, -37038, -44834, -44740, -37126, -19475, -24137, -22414, -15089, 18953, 26537, 8763, -17427, 4859, 41595, 15229, -7172, 20464, 27798, 24082, 16535, 8238, -8748, -16875, -3947, -7293, -2324, -10966, -37400, -31293, -33844, -36622, -36366, -24378, 302, 7289, -7965, -11687, -3485, 13548, 16843, 6933, -5941, -26307, -12880, -17934, -25773, -28887, -21406, -5902, 558, 26444, 38669, 53085, 44637, 27263, 4889, -13520, -1393, 11662, -20302, -55421, -49613, -25163, -19818, -13711]
23693a3711J2969j8717q28L875J1899M393l989k8336j1955J0583J4972j0062q964
23680c7871r443p908J3128J8589m54J8573P489j2928P061J3053m2305j8835J4534
23667c7317K4609k6666k0054k1485R119J6419J8257M150J5903O943j9517n882
23655c5521n825j5588p43J4105M86O150J1110J0879J9671m868R294J1438j2821
23642G767q402L5029J289j1751l4151k0789k619J6485o180J3831J2872l078k237
23629a934m835O93J1387j1063r405K2778J036J249k3533K0490L9681K1065m527
23616F3082m230k5465m6971j8974J2402J6764p160J4535p026p873N596J6691K4128
23603C5499J8014j988k3354O955K3030j012l9087j4888J5944l3721j3750n011
$$ y = [-13711, -742, -19459, -20287, -16412, -4513, -120, -4109, -32445, -44400, -33817, -18845, -28907, -37871, -47314, -55222, -42094, -23505, -23959, -5386, 2103, -10825, -3764, 9289, -33016, -51851, -37317, -12708, -39374, -59428, -80913, -71794, -55375, -37118, -32968, -17065, -10122, -29639, -35521, -41346, -56934, -57677, -43572, -43086, -36936, -25826, -14947, 4724, -144, 9150, 20588, 7767, -635, 34394, 35683, 23932, -10219, -31008, -33627, -17142, -23322, -9491, 3381, 303, -1934, -6769, -6076, 5311, -5752, -15157, 7621, 8657, 9906, -13627, 6863, 46544, 67609, 63082, 58852, 33387, -13584, -32558, -20156, -3392, -10552, 3983, -3043, -10916, -5320, 11371, 35499, 53513, 51525, 28171, 35126, 58156, 57144, 18057, 3169, 19113, -14608, -28358, -33369]
23591c3369j1340L695o589K7800M165j7389m616j3259o595N069J4346J8785j3213
23578c2510r871o232n960O821L1992J9103p436n106p731n524P346O930r833r176
23564b7187N112j4820l1027r853K2418K6981K458K1578M245K1417P708J1989j0603
23551C0416j3094j0591r839o145j449j8116n530K6084P722q557k1086M85l0500
23538f0200k47J6604Q097L2308j0104q990J161K638K5146J9117j5524r942M574
23525D638N660p281l909j1893J9893J2657J1812J1197r039l9181j1500N029J8886
23512F969p26O903m915k927j635P42k5520M603K4647j2582q783K2352P607j3173
23498C562r472l3663j8271P555n293K9292J5842m589P069N254k5011m0253P553
$$ y = [-33369, -44709, -41014, -47603, -19803, -15638, -33027, -37643, -50902, -57497, -52428, -38082, -19297, -32510, -42381, -48613, -54573, -47752, -15760, 3343, -4093, -9199, -16930, -22454, -15108, -8178, -18011, -27187, -22075, -36895, -67922, -77775, -55357, -28376, -25918, -4340, -95, 21322, 29030, 41019, 30416, 17322, 6731, -3108, -9253, -10702, -28818, -34348, -8264, -542, -9099, -30185, -29700, -60200, -60447, -43843, -35746, -3438, -13542, -22532, -21371, -18733, 6413, 25530, 10006, 64, 4638, 10298, 3017, -892, -12785, 7108, 19765, 31577, 42774, 33735, -5446, -16946, -11917, 6969, 6243, 13146, 8231, 5304, 3669, 4411, -21109, -16506, 8141, -4441, -13224, 9128, 16735, 3562, -5910, -39573, -57844, -50289, -55582, -26290, -10448, -15037, -7968, -2714, -27725, -67978, -60425]
23485f0425L6922K8426K0225Q416l2284j7084p503M486J6656Q366K5796L83k7413
23472D967p757Q195J9747j3320j9109q388j5007K28P627r387R185K4073p544j076
23458g566j947l844l644L619J4816l647k802j192k401j6156P061K0647K4451R827
23444C7222J261l0903l1112l650L7446L5447J5885l2759r722l8829j9514J7145
23432b2083L7449J4350K642o150J887K638k8869l0178j7983j8713M2889L6273
23420A4152j4525l212K727O173J8811M2071j3480j9735l3931k1906k1284j288
23408d5427J7230J7004K9164J9028q340j2413l1682J3561K952p147J1731J4279
23396A9940M989M287L0311j5077j7675j1022j9887j2439o374J4101K9862J471
$$ y = [-60425, -23503, 4923, 25148, 33564, 1280, -15804, -23307, -18821, -2165, 6201, 31997, 32380, 4967, -2790, 5405, 25152, 11832, -7277, -15665, -30672, -30444, -22817, -32204, -23019, 1054, -6490, -7566, -9513, -13357, -17001, -13382, 1434, -2213, -5015, -6207, -8608, -24764, -17703, 2944, 27395, 37222, 38483, 7580, -23532, -27182, 10264, 45711, 61596, 28837, 19115, -19714, -39228, -22083, 15366, 29716, 32358, 26208, 28095, 30733, 1864, -28314, -46297, -65010, -22121, 14152, -373, -3585, -858, 5315, 24126, 66197, 52717, 32982, -949, -22855, -44139, -45427, -28197, -11193, 17971, 36999, 28659, 16246, -15436, -1875, 1077, -6070, 5661, 19940, 24929, 29216, 59527, 44450, 26775, 15753, -4134, -16573, -22947, -8846, 21016, 22487]
23384B2487R024k5884m8896P31K8185K3872L352q801j2398r553m686J278j8677
23371c9966J0689J2535j4750K1968q297l463P375J481j4710n48J3767K7437j919
23358A1599M228L5619j4664j414r546o818n005k0956j4371k0711k0480J4457J0218
23345c7844j2735L533P950J5430j4690O107R362L3155O474q86p517P749L238p407
23331A1919j2207l4049n314k262o026p551k3709J1994J7453J920J9975J4725J183
23318a1949K8311K136j2166k5072j295R483Q198J2984p064J2864J3061o434j4384
23305H673j0276J7099N526k8664L018O007j1013j6515k940K1677K4015L240l055
23292A6792K9075k775l0734r438l302j2625r063J7058q664j4294M980k2395n693
$$ y = [22487, 31511, 5627, -43269, -42538, -14353, 9519, 12871, 4070, -8328, -17881, -22567, -21289, -39966, -29277, -16742, -31492, -9524, -17821, -21284, -13909, -12428, -27138, -27686, -13919, 13518, 11599, 15827, 51446, 36782, 35368, 25822, 19004, 13999, -6957, -21328, -42039, -62519, -48062, -37844, -50579, -47046, -39096, -23666, -38356, -32249, -22887, 10268, 16742, 15856, 8339, 16088, 19326, 11919, -288, -34337, -39651, -41913, -47939, -55490, -79199, -67205, -49752, -47832, -27857, -13132, -11949, 16362, 18498, 6332, -18740, -20035, -10552, -2354, 10630, 3566, 16430, 29491, 23057, 8673, -1603, 15496, 21022, -7642, -4624, 1383, -9630, -26145, -29085, -7408, 16607, 19847, 16792, 45867, 43092, 12358, 2920, -382, -13007, -22070, -5012, -13676, -27970, -22990, -45385, -51078]
23279e1078K2243K3292K5186l5157O586L6805j0612k8141j4982N866J150j2815
23267c1657K1696K0920k1188j815J7811L848j4656j7715M896R143k2697M623J2080
23254a4711j4912M436L9896J4787J5785j693r633r869O560l860j4528l214k1785
23241a2741J2769J0799n530r77J4063L392p013J0925j6208o185m702l911j0720
23228a6039l569k70m195l49N847k274N940R335j8380J2802K3779K9254j966j4288
23214B5627k4583n573L638k546l691L698J0376J5616m727M929k4149r562R981
23201i66m983N63O189j9178O095K3981r253l9309k2358K6267K1260o070j2154
23188b9916L3646K3445j1586k7109J503J0292k2624j0054m346j2468P037K840
$$ y = [-51078, -28835, -5543, 19643, -15514, -8928, 27877, 17265, -10876, -25858, -19992, -18842, -31657, -9961, 10959, -10229, -12044, 5767, 9615, -5041, -22756, -17860, -8717, -31414, -26791, -14711, -29623, -25187, 14709, 29496, 45281, 43588, 33955, 24086, 30646, 26786, 12258, 9044, -12741, 28, 10827, 5297, 4320, 18383, 21775, 14762, 25687, 9479, 3294, -1408, -5319, -16039, -19608, -19878, -24073, -24422, -18575, -20849, -14909, -5574, -23954, -11152, 12627, 41881, 39915, 25627, 1044, -4529, -891, -3437, -7128, -3430, 6946, 22562, 17835, 22764, -1385, -10947, -966, -5949, -5386, 803, -18375, -12280, 11701, 2448, -36861, -59219, -32952, -11692, -17762, -29916, 3730, 27175, 15589, -11520, -10017, 275, -22349, -32403, -36749, -49217, -42180, -39340]
23176c9340J9482K6458j1951k868J9676q695N297K9159J977j7384q324j0134k592
23163G61j645o562J4144J7815K271J0302O993Q398k6829j1892j8294m703j9408
23150b8649j1993L5790N404k574J413j9286K91K2920q459L156K7013K4146j4402
23137C4770p083k5751n1726m221J6033J0906J6174M2325J8920l1730n457J5020
23125B8180K5742j9160k9400l371j7423k2038M667J6362O640m119K2626q715j6009
23112a6018l222M596J4942K0010J3054j4086L080r314Q683r165K4212k01k5505
23099A1066j8611k9508Q613J9478o629k2547n569j5767N660L0074J0346M342K1170
23086A2118J5189j3105k2961L3109J2138j1188k8033J8538L6951j1416m1598j0295
$$ y = [-39340, -19858, 6600, -5351, -8219, 11457, 2762, 8059, 37218, 39195, 21811, 13487, 3353, 761, -884, -7446, 6698, 24513, 26784, 37086, 44079, 52477, 25648, 13756, -4538, -9241, -28649, -40642, -4852, 552, -2022, -609, -19895, -19604, 3316, -5143, -1987, 25026, 49172, 34770, 27687, 1936, -49790, -54011, -37978, -27072, -10898, 31427, 50347, 18617, 13160, 28180, 53922, 34762, 5362, 1991, -15432, -37470, -32803, -16441, -9801, -13920, 8706, -9, -16018, -19240, -14644, 298, 20308, 33362, 19276, 22356, 13042, 21725, 12560, 36772, 36571, 11066, -7545, -37053, -28440, -8962, -15591, -38138, -43707, -59474, -53814, -23740, -13394, -9052, 12118, 27307, 14202, -8759, 24350, 36488, 25300, -2733, 15805, 52756, 41340, -258, -10553]
23074a0553O512K9733p576m1434p274J8849K3320L927j4172K9657N302m0475l3298
23061c7482P434p991J4114q00J6365J8895o269o584J0065j8957m2906P355k095
23048d8856j3249K0330K215K5946n79k7006J9018L5653p979j4831K877M534N5229
23035E3302K931j1294k6193k6305J1489K0995j9060m069j7979j2130j2165J7281
23023b3197J5834J2208N137j8332k1353n010K0094L692k1586k2289l63J7083L210
23010c4872J1290L462j6484J2448k1690K2415L5062l501J928j4515l818K2982
22998A4707j7366k7857J6086l748p286N800M802K9816k2022p731J3391k340j0547
22985a4295j507k237J9614J1303Q102p678n094k030k5163K237J6401L3547P796
$$ y = [-10553, -4041, 25692, 18116, -23318, -30592, -11743, 11577, 15504, 1332, 30989, 36291, -4184, -37482, -30048, -38039, -23925, -24725, -8360, 10535, 4266, -2318, 7747, -11210, -54116, -46761, -48856, -62105, -41775, -39560, -13614, -14193, -41199, -22181, 13472, 5493, -9338, -6461, -1927, 53302, 56233, 44939, 18746, -7559, 3930, 24925, 5865, 1796, -16183, -28313, -40478, -23197, -7363, 4845, 9982, -8350, -29703, -34713, -14619, -10927, -32513, -54802, -55165, -38082, -34872, -23582, -20120, -36604, -24156, -45846, -23431, 11631, 8130, 10058, -4457, -8275, 14707, -2659, -30516, -14430, -18178, -25464, -19664, -14862, 14954, -7068, -14799, -1408, -3748, -14295, -15802, -18039, 1575, 12878, 20980, 13302, 8208, 6178, -18985, -16748, -347, 33200, 40996]
22972D0996j9621q137j2918p073J7996K3735j3383p616J7362k4735k5371j4096
22960c2861K0598K1311k1750J0374k1878k0238k446K4148K1997k0282j2794K2457
22948a1364J0842k7172M369K7793K4331l3324k1884P297p275j4915j69m444q717
22935e4632J1678O223l926J3920J9740N329n661J3016j855r956L0734l825j5180
22922E605K747j3182r357K1910K5793K776l9142k1375j0602K0516K8849K8917
22910D3455j2870j3836O018J043K4362n296k0947m296k6103j50K7388q896j6967
22897g095j198J0706J4361J46n082j6964K2128k857k0630j6115L2477o802l5084
22884c2009L719J834J4127J8472p649k578L8350J1045l2104j9281j8230m023j6548
$$ y = [40996, 21375, 13238, 320, -6753, 11243, 34978, 21595, 13979, 31341, 6606, -18765, -32861, -12263, 9048, -12702, -2328, -24206, -44444, -46890, -22742, -745, -21027, -33821, -11364, -522, -27694, -23325, 4468, 28799, -4525, -26409, -19112, -26387, -41302, -41471, -45915, -54632, -42954, -36731, -40657, -26737, -6997, -1668, -7329, 5687, 3832, -6124, 24610, 20785, 5605, 8352, -4830, -14187, 7723, 33516, 36292, -2850, -24225, -34827, -14311, 14538, 43455, 30585, 16749, 22767, 23810, 48172, 42876, 21929, 17633, -8470, -8620, 18768, 9872, -7095, -8293, 2413, 16774, 16920, 11838, -5126, 17002, 14145, -6485, -22600, 9877, 3075, -32009, -28290, -26456, -12329, 6143, -1506, -4084, 34266, 45311, 13207, -6074, -24304, -28327, -44875]
22871d4875K3305K2285k9237k7411j0322L2559J005K0078r004j4488o868O49J8951
22858b3373K9036L0477j0059j2621j9459j1248k2597k68O551q650j8411j307J4743
22845d7186j945J1632L0480J0738J4412p210m747J9084p371n298Q875q920r455
22832C089l496q740J212M52j42k975k6415R527L7606K092J6666J1135j0650j3718
22818A5643j4344j6551j5684K3485r613J5841L4986Q675J0366J3810o664j9964
22806C9986k3629j0459o474N541J888Q794O064k1996k3588J269J2028K4747Q646
22793B2817j71k5028K1321O278j4584n725K3589K240k2054n549P809J281j4126
22780a902k0563k1674J3632Q224Q214K2733J4046J1557k5410j9594J382r211K6407
$$ y = [-44875, -21570, 715, -28522, -55933, -66255, -33696, -32691, -12613, -21617, -36105, -42973, -42324, -23373, 5663, 36140, 26081, 13460, -5999, -17247, -39844, -40112, -33561, -42211, -60622, -61929, -47186, -49131, -37499, -7019, 3719, 18131, 10921, 6174, 25258, 17887, 12589, 21464, 12544, 3089, -407, -9147, -7935, -7483, -7625, -10600, -37015, -27488, 10118, 12210, 28876, 40011, 29361, 15643, 1299, -15252, -30936, -7451, -17064, -1223, 33763, 42438, 52804, 66614, 59950, 39986, 16357, 5898, -576, 4965, 6853, 15647, 21711, -285, -23873, -22604, -10576, 14171, 22817, 22646, -2382, 18939, 25217, 10633, 4908, 28497, 30737, 8683, 3134, 10943, 12224, -1902, -22465, -44139, -30507, -22283, -14069, 8664, 22710, 34267, 8857, -10737, -9355, -18566, 7841]
22767G841K1463k2047n752l42J2072k0741k4053J8067J0470l110j20K4742Q3k0811
22753b238K0086j3709J1983q997k3837R620K3422k7093l0945J4958L6864K4777
22741C4891K2476k0934J966r774o896j8573n868K150k172j1458O601J4254J5508
22728B2171k0459O214J5854j3592o012Q623o009l0536n415J3031K0111j0151j8932
22715b5102J0068L4820P827j2376j8440J220K532j1542J5386M265j6785M605K3213
22702A9691J4189P02k0675k0551L192l062J1268Q343j4483j2951n805J2342n444
22689a3244j0387Q944K4921M7520O810k5010j5513j0337k0257J3042K7281l551
22677C0219k3955J1344O508j3445J6825m503n761j6499k354l984L510Q303K3632
$$ y = [7841, 29304, 7257, 1505, 1163, 13235, -7506, -31559, -13492, -3022, -6132, -6252, 18490, 18573, -2238, 17848, 4139, 16122, 7125, -16712, -7092, 16330, -10763, -41708, -26750, 10114, 34891, 57367, 36433, 38399, 28625, 21729, 3156, -2712, -562, -2734, -14192, -7591, 6663, 22171, 1712, 7926, 23780, 10188, 4176, 12799, 6790, -23746, -29161, -16130, 3981, -6170, -25102, -15034, 19786, 27613, 15237, -3203, -1983, 549, -10993, 4393, 8658, -8127, -3522, 19691, 33880, 34582, 13907, -6644, -3452, -6514, 4754, 13097, -1386, -14337, -20142, -7800, -13244, -23631, -14687, 10234, 57754, 64564, 39554, 24041, 13704, -6553, 6489, 33770, 30219, 6264, 17608, 24116, 10671, 27496, 22993, 17232, 733, -1621, -5605, -2095, 6208, 29840]
22664B9840j9780J6110k1259k7897J7277J1212j6489j0011O850J1213J6623P506
22652B1195j9222l2541N891K1917j586J621L2772J3250k0885l4460l556J526N231
22639h847J286j9660K194J526J1580K748J5735J9701J818k5068r38m384j5548
22626a7857P342K0018L420j7348O641Q875k8619P805O707J5519j4564r586J8681
22613G034j9488j934J1364j383k1277j3985J1464J601L237K8835k5442k1248O72
22600d0550O051L2049j3253j4806j583R96k550J2749J3485q476k0644M313L1090
22587a129K5517J831l226m221K110j8481M414R302l639R815L176j2498Q911j7688
22573D194k2397j2602R953q967m328K5855O093j3236K8503j0679J094m385K639
$$ y = [29840, 10060, 26170, 4911, -22986, -5709, 5503, -10986, -20997, -14147, -2934, 13689, 21195, 1973, -30568, -24677, -2760, -4346, -2725, 30047, 43297, 22412, -12048, -15604, -14078, -8847, -7561, -27221, -25027, -23501, -11921, -9173, 6562, 26263, 28081, 3013, 2075, -2309, -17857, -10515, 9503, 12923, -4425, 2216, 11091, -17528, -9723, -3016, 12503, -2061, -11647, 7034, -12454, -14388, -3024, -4407, -25684, -39669, -28205, -26604, -23367, 5468, -19974, -41222, -40550, -34499, -2450, -15703, -30509, -32092, -31096, -33646, -20897, -7412, -15888, -36532, -32219, -1129, 24388, 26219, 22993, 18772, 20882, 2401, 6815, 16117, 12478, 22293, 25469, 12971, 21882, 4194, -18203, -30805, -20852, -29819, -34147, -8292, -2199, -15435, 13068, 2389, 3483, -902, 1737]
22560A737j58J3698J9017k0586q827p572M627k100J7535k0175j9677K5435j3406
22547a0452j4834K0362k9824j5293R878K4341L8584l3560j089N012k1730j3932
22535d2537l828R63L4299M1644J3735m629k196j9800j9210k8714l0316J581J6119
22522d2889L6784K2496l6730j8528l59p611K5184L5404J3063J4502J914l4656
22510H574K598N283n669r926j0562l666l444Q652P354k0683j9664q872j006M400
22496d6631J5827K5424K6734J5043j7939l5009J0150J5746j2989j05j6208j1911
22484c1868j5311j6316M062K4322L840n712p349M0156L1151m442k5513l6275j7184
22471e6439J0263J2482J8495J8858q010k0727K6535O751q567n906k8624Q096j429
$$ y = [1737, 1579, 15277, 34294, 13708, 4881, -2691, 1936, -164, 17371, -2804, -22481, 2954, -10452, -25286, -4924, -34748, -50041, -40163, -15822, 22762, -10798, -11887, -6875, -28605, -42537, -46365, -45402, -11103, 30541, 44276, 39647, 37451, 17651, -1559, -30273, -60589, -59008, -42889, -6105, 16391, -20339, -38867, -39226, -46837, -21653, 13751, 26814, 41316, 43230, 8574, 11172, 16455, 10786, 860, -9702, -13368, -16812, -8160, -806, -21489, -41153, -50025, -51031, -46631, -30804, -5380, 21354, 36397, 18458, -16551, -6401, 9345, -3644, -3749, -19957, -31868, -47179, -63495, -59433, -35111, -31271, -36983, -44332, -4176, 26975, 22533, -2980, -39255, -56439, -46176, -33694, -15199, 3659, -4351, -25078, 1457, 8208, -359, -6265, -34889, -26793, -28222]
22458b8222j1458L1281o546l3834j9842J2209L0203K7397L635k6454j9479K0018
22446b1092J6852n916n3852J1183K9037K05o016J42j0700j758J9717K1284j3774
22433a4688j1377M708O455p27J8883J1648Q534N980k7053J5692L5599M35l2060
22420B2029j251J5918j0084k4779q652J5771m512k2955j5608J775M926l678p585
22407c8685j858O561J1227K6084Q06J3462L4606j7660k8912J0195l3150L810L3945
22394B0431P238p566r489J2031J3774j0897j8481J0620k6287j6917Q394J0686
22382f463P248o902l4991j4337J920k1907j7210L3794P774P482K1779j2837P563
22369b7087m482J6807M7463k8010N695J3137j2281j4530J985j9657M88j2885K996
$$ y = [-28222, -39680, -8399, -14945, -48779, -68621, -56412, -26209, 1188, 4823, -21631, -41110, -21092, -4240, -10156, -64008, -52825, -23788, -23583, -29599, -29457, -40157, -41915, -22198, -914, -14688, -26065, -21357, -14902, -15629, 3254, 14902, 23436, 29416, 2363, 18055, 53654, 54089, 22029, 20778, 36696, 26612, 1833, -6819, 8952, 4440, -18515, -34123, -32348, -27422, -31100, -38685, -40543, -33982, -22755, 3329, 4135, 17597, 52203, 34543, 5631, 15826, -17324, -13514, 20431, 27669, 20103, 10614, 22645, 36419, 25522, 7041, 17661, -8626, -25543, -17149, -6463, 785, -6117, -41108, -55445, -53525, -75432, -92642, -58848, -51074, -43592, -21813, -34650, -27087, -31569, -14762, 32701, 4691, 10386, 23523, 11242, -3288, -1303, -20960, -20472, -33357, -30361]
22356c0361O426o200M108K43O845j383j7914P298J9547l255N236j354j0960m0332
22342f2056r15J7753K7157J7811J0040K1158M860J222m0605p205L7672Q018j4849
22329B0061j1248k3416q268N816J7057K2914j6818k459P77J275q840l6680o253
22316d6082K1505K3150J2548k6998J570O077n607l3123J6723L2153J3552l229
22304A2239n529j7096r734J3835J4077J3155K734j964J0064l8507k8801J3932
22292b1595L830j6510j6026q053J4003J5624q553N074o613K077K1308J9564K3581
22279B7711J3953j3100j3587j5531j6176O049L753K3755k8855l4348J6406K5206
22267d764m23j3393j8194L633K2749k1024K269N488l631K6017K930q178P183j5190
$$ y = [-30361, -23935, -30135, -26027, -25784, -18939, -20322, -38236, -30938, -11391, -14646, -9410, -10764, -21724, -62056, -62971, -45218, -18061, -250, 9790, 30948, 35808, 37030, -3575, -10780, 26892, 34910, 20061, 8813, -14603, -22871, -17055, 2, 22916, 6098, 3639, 4416, 5691, -3149, -39829, -46082, -24577, -1427, 11121, -15877, -14307, -8230, -13837, -46960, -30237, 1916, 15468, 12239, 6710, -10386, -20120, -6285, 7792, 20947, 23681, 21717, 31781, -6726, -35527, -21595, -17765, -34275, -50301, -58354, -44351, -28727, -37280, -32206, -38819, -36742, -15434, 4130, 27711, 41664, 28564, 14977, -554, -16730, -10681, -6928, 16827, -12028, -46376, -29970, -4764, -5187, -18580, -36774, -33141, -10392, -31416, -29147, -23659, -27290, -1273, 1657, -6521, 662, -14528]
22253a4528M748o317O418O565j0215L2n041j357Q218k442q286J1667O258k878
22239g158J1670j531J9561K965j2056R088l7361k6303j4289K5225K2162K4073
22227A6046J8565q708K2082O738j0984k5254m5478M781R338K3094Q286j8678O992
22214F820l3178j3027J6806P444J8193n236L186l348J5510m852j7849J3929N060
22201I458j9013J5307J9441j4109p121R062k6580P540L7808O966l6096l0771p454
22188c5562K8182Q290j9152j1445O392q609J349L7328R416J8542j4323k4392j9959
22175b3943j3548R086j2714K88K9442j662k7329O699r000Q974J333R245o894j2683
22161d2706R253Q264K0232j1666p126P677j2574J2010M619o462j5370J8294K0101
$$ y = [-14528, -9780, -16097, -9679, -3114, -13329, -13297, -18338, -19695, -11477, -13919, -22205, -10538, -4280, -7158, 4512, 2981, 22542, 25507, 13451, 22539, -14822, -41125, -55414, -30189, -8027, 16046, 34611, 25903, 47985, 54723, 43739, 18485, -26993, -22212, -12874, 10220, 18506, -172, 6820, -26358, -39385, -22579, -15135, 3058, -2178, 1008, -2340, 13170, 8318, -9531, 4398, 9458, -9555, 5752, 25193, 11084, 3963, 13025, -13555, -6015, 31793, 38759, 2663, -28108, -35562, -7380, 910, -18242, -29687, -23295, -31904, -30555, 6773, 16189, 34731, 20408, -3984, -23943, -37491, -28405, -41119, -40831, -11389, -13051, -40380, -33681, -42681, -33707, -32374, -23129, -30023, -42706, -33453, -25189, -4957, -16623, -23749, -16072, -28646, -16636, -12017, -18479, -33849, -15555, 4546]
22148D546J3272k3491q389Q772k3021K2315J3026j5504k5757m301M1956J5769
22136A9193Q924q360j8554j6083K7067Q228P989K1528q996j1967L046j0313j2053
22123I649j0208j5740l2906p246P350J3419j628P26K2209K9253k7806j7254J6033
22110a4149J1822j2402p63K0334j1716K8501J8437k4608k2837K59K4580J1326
22098B8784L175K4134l3395j8739m85l1746J08K1471M597O680m628k6037O912
22085a9169K5726R266k958K3839k702j381k280j6097K086l868k1706l1089j1891
22072e2224P759J1440L3925m695j2072k7742j588J3056J9706K0566N572J2313
22060B6016L0684j2009K020j5033P156j3289l2892m871J2453o80R726O918k8160
$$ y = [4546, 17818, -5673, -14062, -5290, -28311, -5996, 7030, -8474, -34231, -38532, 3424, 19193, 28117, 19757, 1203, -14880, 12187, 20415, 28404, 49932, 40936, 28969, 32015, 21702, 9649, -559, -16299, -49205, -56451, -49101, -35682, -37310, -36584, -14375, 14878, -12928, -30182, -14149, -2327, -14729, -15492, 4842, -6874, 21627, 40064, 15456, -7381, -7122, 17458, 28784, 31959, 56093, 22698, 3959, 3474, -28272, -28164, -6693, -2096, 4584, -44, -26081, -19169, 6557, 15823, 12865, 36704, 34002, 32621, 30341, 14244, 16330, 12462, -9244, -40333, -52224, -44465, -33025, 900, -3795, -15867, -43609, -45197, -32141, -12435, 8131, 13703, 26016, 56700, 44691, 46711, 31678, 38834, 25545, -7347, -12218, 235, -445, 9281, 16199, -11961]
22047a1961N839l524l1016J5951L8170j0527j9462k2755l421O525J2704l630R509
22034a7598P876k5576q1J0072M397M546L302R644m180j6344k5148j3483l521j1353
22020g7447J9654J3326k3282n280K9240J2186J4970N282Q914j2556j7983O346
22008b6630k253J966J96K7521J8937J2933J902j9042j799j7423o509r004j9484
21995c8689J2271K5875J4222l436M670j1201k9630j7401M555J0570K2155J2631
21983F592J330k4784L606J2185R220N487k609K9366O712J2887j2565j9422N37
21970B8542L767L590n418j8173l397O777J703j3166K210j3818j500j3502j4596
21957c6981r924J6811L282Q553N799l0411o939o219l248K0313K9083K1818j210
$$ y = [-11961, -6122, -9646, -40662, -24711, 13459, 2932, -16530, -39285, -42706, -36181, -23477, -27107, -17598, -9722, -35298, -35379, -25307, -20910, -16364, -13062, -3418, -7598, -23942, -49090, -62573, -66094, -77447, -57793, -44467, -67749, -73029, -43789, -31603, -16633, -11351, -2437, -14993, -32976, -26630, -28883, -26917, -26721, 800, 19737, 32670, 34572, 15530, 13731, -3692, -10201, -19205, -38689, -26418, -543, 13679, 10243, 14913, 3712, -25918, -43319, -38764, -28194, -6039, 6592, 7922, -16862, -13256, -1071, 8149, 13636, 11027, 40393, 47105, 59992, 47427, 28005, 28542, 32309, 35899, 30481, 12308, 8911, 15688, 17391, 4225, 6435, -7383, -8883, -22385, -36981, -46905, -30094, -26812, -18259, -12460, -42871, -49810, -56029, -59277, -38964, -9881, 11937, 10727]
21944A0727j6830J9730J2491k9966j6639J7267J4131j3807o983K1524N18l6291
21932b4128K5793J7110k3103J9246n068k5862j8402j209O347m14J4416K2418R019
21919A6163j3739k8692j0849L6407J7900j5607p665J3888K2592j1360k1269j4392
21907a6623k2420j4266K882K3720Q169o330j0196L1089l71Q425l699J5443P320
21894B3143k1172l4640M942J730m656L502L9096j912o842m980J9468O686o1127
21881c6762K809J2989O844J9414q052k9947N062J4574J2528K2204m998k9690K8645
21868A5620J1007J653J0298m5489j9519j2118l0068J4681L8372J5598J0230j6926
21856f661j6440J9149J645k3597k9949l616M0463J7064l4718J6963L0090R902
$$ y = [10727, -6103, 13627, 26118, -3848, -20487, -3220, 10911, -2896, -9879, 11645, 12163, -24128, 1665, 18775, -4328, 14918, 9850, -16012, -34414, -35623, -29276, -29690, -15274, 7144, 16163, 2424, -26268, -37117, -710, 17190, 1583, -6082, 7806, 30398, 19038, -2231, -16623, -39043, -53309, -50427, -26707, -18538, -24868, -35064, -3975, -4346, 4079, 380, 15823, 23143, 1971, -32669, -27727, -25997, -30653, -27151, 11945, 10033, 3191, -1789, 17679, 24365, -36762, -33953, -20964, -14120, 5294, -2758, -32705, -27643, -13069, -541, 21663, 16665, -13025, 15620, 26627, 28280, 38578, -6911, -26430, -38548, -68616, -53935, -15563, 35, 10265, -6661, -23101, -3952, -2307, -25904, -55853, -59469, -19006, -1942, -36660, -19697, 10393, 20295]
21844B0295l148j8137l3614k8550o572J6228L1091J2332K2411K5761l2945l1316
21832b6164l004M06K3942J9058p553J7286J6365l090p039k5256k0066R533L562
21819b020k2864N199J2096J9062R90k0772J3588J652K7094M759N636o518m1814
21806c912j8156j2906j8588J9756L4874J8821j6044m3117k0860J5454P367J6318
21794b0993K1551m288J3295J1237n212Q561J2613p601N558m4575j9584J4717R728
21781d993J1483k0761j7738L160o447M145j0900J221L2827o761J501K0666M177
21768A1580J4405r345l2393j0715j8902O921R746O09J6125J3670j4868m9969p317
21755g0453K4638N5405J5222l5320j8119L6124K9698l600q97o311m1638j7787
$$ y = [20295, 17147, -990, -34604, -63154, -69726, -53498, -22407, -10075, 12336, 38097, 5152, -26164, -29168, -28762, -4820, 14238, 6685, 23971, 40336, 37246, 30207, 4951, -15115, -5582, -2020, -24884, -19685, -7589, 11473, 12463, -8309, 5279, 6931, 34025, 38784, 44420, 37902, -3912, -22068, -34974, -53562, -33806, 1068, 19889, 3845, -39272, -60132, -44678, -37311, -20993, 558, -3730, 9565, 20802, 15590, 24151, 36764, 29163, 34721, -9854, -29438, -14721, -4993, 6490, -14271, -32009, -28849, -35296, -31151, -42051, -40830, -8003, -14764, -13263, 7403, 11580, 25985, 16640, -15753, -26468, -45370, -38449, -28703, -28094, -11969, 1701, -13167, -63136, -70453, -45815, 9590, 24812, -10508, -28627, 7497, 37195, 33595, 32698, 26387, -15251, -33038]
21743c3038j3342N540K3828l528K174N279k805k921k415J0939J7057J8283K08
21730B5259o990p401j9961k1946k8291j0609m163K4178j0481j20J6357M5749J0827
21717A2408q59n604j157N183k9296k9622Q608J4526m869l79K2638K7452m317n822
21703H890M0879K3382k3788l9799N636J7096j9902k0990j56Q840J1812P677K961
21690B2538j0406K765j49L740K348p984q800K4192K93k8361j195K3536Q890r897
21676B1510r341k345P136O847J0461k1410k2412Q256K5295J066j9852k0048J3053
21663a784k4225k4657J5602O781J0992n445J7310L149J7238o33k4053k226j2244
21650b4195M618J3675J6872K1678J0169j4621j3636k892j0765j8653K8242j8807
$$ y = [-33038, -46380, -40840, -17012, -20540, -18366, -13087, -15892, -18813, -21228, -10289, 6768, 25051, 25259, 18269, 10868, -9093, -31039, -59330, -69939, -74102, -49924, -60405, -60525, -44168, 1581, 12408, 11549, 5945, 4788, 9971, -19325, -48947, -40339, -25813, -30682, -31061, -8423, 19029, 14712, 8890, 49769, 73151, 49363, 9564, 15200, 32296, 12394, -8596, -8752, 88, 11900, 19577, 22538, 12132, 14897, 14748, 18488, 20836, 12852, 4052, 28244, 28537, 176, -1019, 22517, 31407, 21510, 12169, 9824, 16960, 23807, 34268, 12858, -9554, -1298, 23997, 25063, 5211, -14837, -1784, -26009, -50666, -35064, -28283, -17291, -22736, -5426, -2277, 14961, 14328, -9725, -11951, -24195, -19577, -5902, 10970, 32648, 42817, 28196, 14560, 11668, 903, -17750, 10492, -8315]
21638h315j2322R829q192q86n656J767n822k077R853K4209J5996J5062k29k2467
21624A0750j0426k2552L8K2474j0679n956J2166N177O696n662K5838j2925k2850
21611g911j6879Q614n12o157j4218k4467L7718l2o316n09O676K4966k349k5137
21597b6513J425j714N817M839Q400L196R391j8014j8734K8777J2674k0186l3233
21584d3875j0286L0492K6959j0143k0742O891j2298k0010L3056J3673l2185j6746
21572e5214P786L187n66P86K1446J6013O016j679l1690n591K962j2358p617j8775
21558g5294K1271L2580k5644k9918N249l257J5510K1627M9165K2373j1825k0990
21546H47j4669r074K7070l327O725J1269j4759n643L354l252j1750J988L604k51
$$ y = [-8315, -20637, -10808, -19000, -19886, -25542, -23775, -29597, -31674, -21821, 2388, 18384, 33446, 33217, 10750, 324, -22228, -22190, 284, -10395, -16351, -4185, 992, 7688, 2026, 27864, 14939, -7911, -24790, -16176, -16688, -22845, -37063, -61530, -23812, -23844, -30160, -30669, -23993, 973, -1376, -26513, -25088, -26802, -20985, -16146, -7746, -4550, 4841, -13173, -31907, -3130, 9544, -10642, -43875, -54161, -23669, 3290, -6853, -27595, -20704, -33002, -53012, -19956, -6283, -38468, -55214, -47428, -44241, -44807, -44021, -22575, -6562, -546, -2225, -33915, -39506, -36544, -48902, -56519, -75294, -54023, -21443, -47087, -77005, -71756, -75013, -59503, -37876, 11289, 33662, 21837, 847, -13822, -22896, 4174, 847, 7572, 18841, 4082, -1561, 1793, -1459, -13209, -11221, -7617, -7868]
21532g868P023k949j468j5965P240L363P634M007j5106j2267L4643P024r271q950
21518b910O387J4475L9790j534k9512m4204N227L3303r237l647q184j8386j2424
21505c0856O634j7635q334k31J2817J3571Q256J3720k1133R28r620j2086L52Q821
21491c4796m565J610J2722K0841R246p599n32j109K887J271J008k691o52J8878
21477A6519k5849j5861J8809j7696J9924K9613k2897k834M193P188R369n624J1184
21464B6038j6017j6310r054J2996L510J1699j390l3772j7766J4132l135m193L68
21451c2894J0033r241j3785K2287J0583O216K452N070j2569M499J059p555p21
21438a4566K321r463k5106n97M2931K3708j6286k3630j0185j9473J9204L4193
$$ y = [-7868, -845, -3794, -5262, -21227, -13987, -10624, -2990, 1017, -14089, -26356, 8287, 15311, 6040, -2910, 3477, 17952, 57742, 56208, 26696, -17508, -12281, 21022, 11785, 8138, -46, -18432, -30856, -24222, -41857, -50191, -50422, -37605, -24034, -15778, -2058, -23191, -22263, -31883, -43969, -43617, -34796, -39361, -37751, -25029, -4188, 5058, -2541, -3073, -4182, -1295, -24, 984, -1707, -2359, 16519, -9330, -25191, -6382, -24078, -4154, 25459, 2562, -272, 3921, 11109, 20478, 14854, 26038, 10021, -6289, -15343, -2347, 1163, 12862, 11472, -22300, -40066, -25934, -29069, -33262, -32894, -22861, -32102, -45887, -23600, -13017, -6801, -4349, 721, -11848, -7349, -6290, -13845, -14566, -12245, -21708, -46814, -47411, -4480, 19228, 2942, -20688, -30873, -50346, -31142, 3051]
21426C051j5256K341q049k9638R707K6996p571j6507l5986l1099P017R529K0431
21413f5034N4582J2136k0600k662k1706J8499j459o110J4686K3569k2805j4764
21401c1668J4349K3291N63l7630L905J6204J1218m947L916m786k5154J935J9420
21388i384R218k0658J7192O388j162J3308O168J1559K1650l2280q747k1024J4219
21375F447J2935j7805j2885K0095M144K5150J7325J474j2139m0374k5071J1370
21363i334Q18k484M3442R964j2075p704o675k6550J8647O488j4681J4683J1780
21350B6319o969j0027M443n681j9355J5787L6322L535j8996P255L4020p544j3852
21337D5257j8369m407k957J105j5196L957J3820R80n462r84n2393j9138L248Q69
$$ y = [3051, -12205, -9864, -17913, -47551, -37844, -10848, -18419, -34926, -70912, -102011, -94994, -85465, -65034, -10452, 1684, -18916, -21578, -43284, -24785, -26244, -32354, -17668, 5901, -16904, -31668, -17319, 5972, 6535, -31095, -27190, -10986, 232, -4715, -799, -5585, -30739, -28804, -9384, -166, -20824, -3632, 2756, 1594, 14902, 21070, 32629, 54279, 21999, 13252, -7772, 6447, 19382, 1577, -11308, 8787, 12931, 38081, 55406, 56880, 44741, 4367, -20704, -9334, -8516, -11000, 32442, 42406, 30331, 22627, 15952, -10598, 8049, 14537, -144, 14539, 26319, 19350, 9323, 13766, 8085, -11270, 4517, 40839, 44374, 25378, 32633, 66653, 59109, 45257, 26888, 22481, 19524, 20629, 5433, 9390, 23210, 24190, 18728, 17744, -34649, -53787, -50539, -49670]
21323d9670J186J5506j1055j61L613L4076l695j2041K8766q28k2522k5038m717
21310d6580J9520j39J3265J3067j644P092j5468m3826k963K0421P188J0047j6793
21297c6813L830P708j1806k2506k7943L3976K5095J3554J295l760n562R978L6745
21284B3791n291k4550k6516m087L0292K5631o717j2650M262l145k3146j1454L7229
21271C649M1490J8912k3983m7907j3589l875Q852M428m169N957L9262J2278J8719
21258F0024j2798k94j9597k2723o092j3765q89J3954j1248j3825J8753O543k2059
21245b4016l4857J5446M657K1839J1435J8422J6346k0183j560r58l0526L791O859
21232a3305L1288k9235n0604R271K6807P910N039L4976J5530r798O887j5845l0683
$$ y = [-49670, -48484, -32978, -44033, -44194, -40581, -6505, -10200, -22241, 6525, 5697, -16825, -41863, -46580, -27060, -27199, -13934, -867, -2511, 4581, -10887, -54713, -57676, -37255, -30067, -20020, -36813, -32983, -25275, -37081, -59587, -87530, -53554, -28459, -14905, -13610, -17370, -22932, -12954, 23791, 18500, -6050, -32566, -36653, -6361, 19270, 12553, -97, 4165, 1020, -22126, -33580, 3649, 45139, 64051, 40068, -7839, -21428, -25303, -16451, -12023, -16192, -10235, 29027, 41305, 60024, 47226, 46932, 27335, 4612, -1480, -15245, -16134, -2180, -13428, -27253, -8500, -1957, -24016, -58873, -43427, -38770, -16931, -5496, 12926, 29272, 9089, 7529, 6571, -23955, -20164, -13305, 17983, -11252, -61856, -52585, -25778, -17868, -12829, 22147, 37677, 27879, 34766, 18921, -11762]
21219a1762n268L67J596R905J8742R721J3566j4172r994j9407l757K3140k095
21206A0582r387j1597k5452J6217J3021j9758k6857K7871K1971L0434J8981M292
21194E0318l1429m552J2922j5804j1072q956q220Q807J3970J880k7898n198K0142
21181e090j142r309m697l672j525K713J7701J1853M143L445J7624M951p818m371
21167B4806k135k0028k921n990K1029R849k0563k5157k9844m103R669J0451P492
21154b7445j9788k9207L0810K1207r27J6389Q668O780J6469l146j1373J432n788
21141D081j4054l9272L7205m571m073O654k582m233P091M9719O27j5681Q965p614
21127B2262R071M445O93j3185k5201J3877N504k8544m5365m90J4865K7499P370
$$ y = [-11762, -17030, -16663, -15067, -5162, 13580, 23301, 36867, 22695, 12701, -6706, -10463, 12677, 10582, 1195, -10402, -35854, -19637, -6616, -26374, -53231, -25360, -3389, 27045, 46026, 50318, 18889, 14337, 27259, 11455, 383, -8573, -16793, -7986, 5984, 7864, -20034, -25232, -5090, -6232, -15541, -20238, -23910, -25435, -22722, -5021, 6832, 10975, 14420, 32044, 36995, 29177, 24806, 22671, 2643, -278, -6268, 14761, 24610, 4047, -21110, -50954, -55057, -45388, -34937, -27445, -47233, -76440, -45630, -24423, -25350, -8961, -293, 6487, 22956, 19810, 8437, 9869, 4081, -9973, -49245, -12040, -16611, -20684, -14030, -16612, -20845, -13754, 35965, 36592, 20911, 29876, 22262, 31333, 35778, 36471, 23286, -1915, 11962, 17466, -11078, -56443, -56933, -42068, -14569, -7199]
21114g199n751k3829j5887J0055J8225k2665J3467j8913P192K2955K0419n738
21102g669R191O759l1158r853j1609R337p056K7910L4513J3195j9504j5910M443
21089B589P879J2623P450r930k433j3364o911j964j3525j362N762L600L282m934
21075a1238O713N610k9507j1084K0862l738k071J0318L2355m946L190R306K769
21062B8539k071j2063k2336k8701N93k516j9181J5932P688j0293O350J1789j425
21049b7695j6679l064J8107L0506p6M884r216N80j7307P585n00m526M736m591
21035a7256J2730O425O200p496j3285k2138R231L6620j016k98J5774J1658o206
21022C0943n18j0324p76M114p475j4647O685r268O328j0045l143J0674N307J2322
$$ y = [-7199, -12950, -36779, -52666, -42611, -24386, -47051, -33584, -52497, -45305, -22350, -1931, -7669, 1522, 8281, -22877, -32730, -44339, -35002, -42058, -14148, 20365, 33560, 14056, -1854, 2589, 10468, 23091, 30541, 20611, 18178, 4814, -2097, -4061, -17586, -18948, -13186, -9586, -6304, -11238, -4525, 1085, -28422, -39506, -18644, -22382, -24453, -14135, 18220, 13274, 16464, 25770, 28539, 26468, 14405, -7931, -36632, -36039, -38555, -57736, -41804, -34116, -44409, -38059, -26270, -27695, -44374, -47438, -29331, 1175, 1099, 5983, -3233, -2653, -19960, -12375, -12875, -17401, -12665, -17256, -4526, 1899, 8099, 603, -12682, -34820, -25589, 11031, 10015, 9717, 25491, 37149, 30943, 30425, 20101, 19325, 23439, 15964, 1317, 8002, -1266, 5062, -4983, -8126, 2548, 7855, 20177]
21008B0177K3984r99J550M17k5283p524k8901j2795K2247Q851k5218k1396k083
20995d6973J1295p261Q872J675J37k4652J6464J4078Q865J4742j022J5458j3128
20982a450l055j2462j3977J0946J7178J1001Q212o775J423j7656j9161j7162r410
20969e2348K1753K9005J0257j508M477j4836k7917L4595L0328m951k8806J43m339
20956d147J4881j8389L965k799J4162r91q712j4299j6730J7592o79j7413K550
20943c1009M492K9206M996R722L674k2305j282K1844j5778l1811J332K347k113
20930b6685n982L6541L3756K2259k0549l4276Q695J1001Q990j8311l8688l860
20918b7109n411K1208j2195o545O102J8464J992k4397J8669J1007l6371k2448
$$ y = [20177, 44161, 43162, 44712, 45129, 19846, 12322, -16579, -29374, -7127, 1724, -23494, -44890, -46973, -35678, -42939, -34067, -32392, -32255, -56907, -40443, -26365, -17500, -2758, -3780, 11678, -1450, -4505, -16967, -30944, -19998, -2820, 8181, 16393, 9618, 11041, -6615, -25776, -42938, -52348, -30595, -1590, 8667, 7159, 11636, -3200, -31117, 3478, 33806, 28855, 49, 192, -4147, 10734, -7655, -3690, -6489, 7673, 6682, -2030, -16329, -33059, -15467, -16146, -33559, -31009, -26517, 2689, 7685, 17407, 21081, -1224, -2506, 19338, 3560, -28251, -26919, -24572, -26685, -32667, 3874, 37630, 59889, 39340, 5064, 13759, 24760, 33750, 15439, -23249, -27109, -32520, -11312, -23507, -30052, -23950, -5486, -3494, -27891, -9222, 1785, -34586, -57034]
20906e7034J6566K9571L6026j5560m280M471l633j4318k3305o697O182J1527J3724
20893f760L412j3723n97P144J5395r083n1J6226J3001k356j3270o367J0580j2202
20879A349k8479l4L956K1498J8050k173k1627L078j5017j7540K0272J7882N814
20866G029j334k3056k9994P293q29j881O684R676k325Q484N719j9066l2420j058
20852f7078q738j5725L8523M5196J2780J1650l033k093R350k488j5948K2482j0220
20839A4658k0930m406M558M696K1315O946P165k486j2976j2521q18J926J1525
20826A8652L936N623j3173J4162K82o749k2918l4354L344j0663j2761L6090N6
20813a8473P385j6636k7224p919J1874K7468j640J6358K788O45J9J634J22l727
$$ y = [-57034, -40468, -10897, 25129, 9569, 5289, 9760, 6127, -8191, -31496, -38193, -32011, -20484, -6760, -3348, -17071, -17668, -10524, 4871, -4212, -4263, 11963, 24964, 22608, 9338, 2971, 13551, 1349, -27130, -27164, -23208, -1710, 16340, 14167, -7460, -4382, -19399, -36939, -16667, 1215, 7029, 5695, -17361, -47355, -40062, -40891, -42772, -36088, -26412, -28737, -20253, -14534, -33600, -66020, -67078, -75816, -91541, -53018, -7822, 4958, 16608, 13575, 11482, 20832, 18344, 2396, 24878, 14658, -6272, -10678, -6120, -1424, 19891, 26837, 34002, 31516, 18540, 6019, 5201, 7127, 18652, 22588, 28211, 15038, 29200, 29482, 22733, -185, -34539, -31195, -41858, -54619, -18529, -18473, -11088, -27724, -54948, -62867, -50993, -23525, -25165, -8807, -6019, -5374, -5355, -3721, -3599, -7326]
20799g326k3460p876L6638P999p088j7286o033J2992K3074j6408j91Q242r61l98
20785A918J8398J2088m3629m238j1078k2187J5989O409l240K5806O39Q596L743
20772I214N395l966k0510j5522R364K1985K8404k8130P866J3076l4146j9896L2815
20759E949J0359J271Q433j0241k842l486j9682Q986r358k3939J2614p554q754
20746c8244J5149M330k984l057o444J3000O536Q14j7870q722J2306J4106J0119
20733i61j1760k8400p111K711J0409j3659j2466j4671J1361L2892J6769j2643
20721b7529N425Q192j2958K2176L949j6274K0897k4280l1481L2904J4344k494
20709g129m561k8762K7154Q159j1457N900j9977j08J5286K2314L2802k8335j5405
$$ y = [-7326, -30786, -38662, -2024, 5975, -1113, -18399, -24432, -11440, 11634, -4774, -4965, 3277, 2316, 1918, 20316, 32404, -11225, -15463, -26541, -48728, -32739, -26330, -29570, -3764, -3125, 5471, 9214, 14609, 10643, -9867, -25389, -16025, 5960, 34364, 6234, 14100, 27176, -6970, -26866, 5949, 16308, 17579, 26012, 15771, 12929, 9443, -10239, -1253, -10611, -34550, -21936, -29490, -38244, -23095, -18765, -21749, -24806, -31250, -18250, -11714, -10900, -28770, -37492, -25186, -11080, -961, -12721, -41121, -48232, -45521, -35112, -48771, -61237, -75908, -64547, -31655, -14886, -27529, -22104, -13912, -26870, -4694, -745, -17019, 3878, -20402, -51883, -18979, -4635, -7129, -11690, -40452, -13298, -5139, -16596, -10696, -30673, -30781, -15495, 6819, 39621, 11286, -4119]
20696d119M609Q036m110R673J028K158k1191n762r365k3426j2661J8714K6895
20683i521N624J6659l9919k6693j0099K5377L6776m267n666P769J2399j5923n515
20670a2999J4197M0044j2815K6506q764k9931Q924L648q351p471j4386j0371r098
20657b0867L1954j402j782J0728K952l104j5994N738J923k6649k3832J5201K3278
20644a856Q829J570o704j2708J1780J4399l2849M891j935j244K4758J8666n951
20631B1646k2756k3346k5416m089n013q08L7956L566l3103M906J6389m104j736
20618c5908j8580J9022J9504K6023q222j2014k7061o98K1868K9082P620l5486
20606a4850k5721L146R0n758K1573J4086j8150J3708O113j1974K8326K1078r733
$$ y = [-4119, 490, 8526, 4416, 14089, 15117, 17275, -3916, -9678, -19043, -42469, -55130, -36416, -9521, -3897, 12762, -27157, -53850, -63949, -38572, -1796, -6063, -11729, -3960, 8439, -7484, -12999, 1198, 41242, 28427, 54933, 46169, 16238, 25162, 28810, 20459, 12988, -1398, -11769, -20867, 11087, 9685, 7903, 18631, 21583, 18479, 2485, 8223, 10146, -16503, -40335, -25134, -1856, 6973, 8543, 1839, -10869, 911, 15310, -17539, -12648, -14583, -15827, 8931, 27597, 21646, -1110, -24456, -49872, -53961, -58974, -59782, -21826, -18260, -51363, -46457, -30068, -34172, -35908, -54488, -35466, -15962, 10061, 1839, -10175, -37236, -37934, -16066, 13016, 20636, -14850, -40571, -37425, -37335, -43093, -21520, -7434, -25584, -11876, -5763, -17737, 10589, 31667, 21934]
20593B1934j9731K260l176p477K21L736m891j1236J413J0960K681M124J8377j6008
20579C187j1135k1026K1245N278J9797j6629j8610m328p93P93N557J6869k710
20566b505l564k4366p970Q641o875J008J2836j0000K0483L304J0778m22L086j1669
20552g235j2320N765N187J568K0021k5225j0888l109p564n100J054J6600K6672
20539E426J3515k5727k7956O371r058K6865j5553j1598J9804K9375K0712Q719
20527D0895r110k3991j2272J2045J8846m065J361K324j4134m2589j1333k158Q183
20514c5998r176P439O238J531m284k9692M90K0603J5149K1367n020k939Q846J6833
20500A1387n633P489J1248J179n660j9981r32p783j3374l964L0953Q582k1311
$$ y = [21934, 2203, 4463, 1287, -6190, -5969, -2233, -7124, -18360, -16947, -5987, -3306, 818, 19195, 3187, -7948, -28974, -7729, -2451, 17346, 717, -17893, -22221, -23014, -22221, -16664, 205, -2505, -6069, -30435, -38405, -29764, -36639, -35631, -22795, -32795, -12312, -9008, 1770, 1348, 4434, -7235, -19555, -13790, -8603, -7035, 12986, -12239, -23127, -26236, -33800, -38900, -37846, -21246, 5426, 18941, -6786, -34742, -28371, -37429, -10564, -26117, -37715, -17911, 11464, 32176, 40895, 31785, 7794, -4478, 7567, 26413, 22348, 23709, 26033, 11899, -30690, -42023, -44181, -35998, -45174, -37735, -31497, -29966, -34250, -63942, -63452, -42849, -27700, -6333, -11353, -14292, -5446, 11387, 5754, 13243, 24491, 25670, 20010, 29, -903, -8686, -22060, -26024, 4929, 13511, -7800]
20487g800N173K2619J5725j1250j5625j4790J1300j0749J3095R04J746p491k1999
20474a9142m875p47k2j0619l547n362l7400O642M0277J8371q782o938J6484K1791
20460F131n754k704N415k081j572O256R873r308J3174P566M036K500l713J5625
20446D5444J4992j2618l019j1806k7870m9543k400J7296n419O31J2509J1853K7018
20433A7068J6267o116k6462K1133q56j3293k6207J1191L7800j1037k8362j5460
20421b4334L786J408o378j1646L060o105k423m942p294j178L2469L1426J6790
20408B4639j0637l8147K6154K5326J0039M272j2786j8751p556l90J9630j1119
20396A0674p35r443k0183j7916J1443K052j978l666l790P138q891j5773J5523
$$ y = [-7800, -2627, 19992, 35717, 24467, 8842, -5948, 5352, -5397, 7698, 8602, 10348, 2857, -19142, -24017, -24764, -24786, -35405, -38952, -44314, -81714, -75072, -34795, -16424, -25206, -32144, -15660, 6131, 377, -2327, 3088, 1007, -565, 5691, 15564, 6256, 19430, 26996, 31032, 33532, 29819, 45444, 60436, 47818, 44799, 32993, 5123, -44420, -46820, -29524, -34943, -34312, -21803, -9950, 17068, 33335, 27219, 757, 21890, 21034, 7741, -18466, -7275, 30525, 19488, -8874, -24334, -20548, -19140, -25518, -37164, -34104, -40209, -42632, -47574, -54868, -56046, -23577, 7849, 24639, 14002, -24145, 2009, 27335, 37374, 41646, 28860, 10109, 2553, 2163, 21793, 10674, 9939, 496, -19687, -37603, -26160, -24108, -26086, -29752, -33542, -26404, -35295, -51068, -35545]
20383c5545p987k3636j3575P643J9034J3316Q633r880j6455K3199J2052J3082
20371a0119J8681O513p103k994j6521P229J2034P650k5906n103j0478l565J4175
20358a5507k078r188k2595J8315M1326J3198K97J6617J0436j7773J5395N219k9426
20345B4236Q3o426j3485N275K803j90J008j0514j6919j3221R605K6866j9283j314
20331a1476J4323j1914j3796J246J5298j0881J0054J498q964M581J0229k467k530
20318d799j984o774k4625M032J3837l800L0879K9066J3246j8731p861j5878k4662
20305a8054K1843K3038q396k3162j3640m1110j6032j3191j1852J8475K9422J2779
20293c9880O560k168K9025K2550j0934K411l133k3027q499R986J16j5007j9128
$$ y = [-35545, -43532, -67168, -80743, -73100, -54066, -40750, -32117, -41997, -58452, -35253, -23201, -10119, 8562, 15075, 7972, 4978, -11543, -4314, 7720, 15370, -10536, -15639, -26117, -29682, -15507, -17585, -26773, -49368, -31053, 10273, 23471, 23768, 40385, 50821, 33048, 48443, 53662, 24236, 24319, 17893, 4408, 9683, 12486, 12296, 13304, 2790, -14129, -27350, -17745, 9121, -10162, -11476, 2847, -9067, -22863, -21617, -6319, -17200, -7146, -5648, -14612, -10031, 198, -2269, -4799, -6783, -13557, -38182, -34150, -20313, -24113, 6766, 35832, 49078, 30347, 22486, 6608, -18054, 3789, 26827, 18431, -4731, -18371, -59481, -75513, -88704, -100556, -82081, -52659, -39880, -33320, -35488, -6463, 16087, 5153, 7564, 4431, -18596, -27095, -17109, -16993, -32000, -51128]
20280e1128L4512L1939P069j7776p745M665n257K1059j590k1365n565J1045J827
20267A690k1805J3503j8991J8954K4071k4728m4940J1457L5847M63j1406L581
20255a2304j6735K3902L92j8514j8957j103L308K1984j797k331m293o376K3895
20242h929L0224L1538J3261l1266k7935k3857k670l905l189J0402O300p126K1264
20229D112J4493K7180Q256j7792j3533k5119J0712R690j9799L540J3045j9969
20217e184m8J0149n308q599K876k4603R789J6843Q538l634P041m852O705J95m9446
20202c9538l5020J5979K7285J5359L371m734K4056J7709o578q141J540p15J7027
20189B7600K729k2431l179j8702l2645j4096R257K7206J7383j6727K5637L4212
$$ y = [-51128, -16616, 15323, 22392, 4616, -3129, 1536, -3721, 17338, 15748, -5617, -11182, -137, 1690, -20115, -6612, -25603, -6649, 17422, -7306, -52246, -40789, -4942, -4479, -15885, -12304, -29039, -5137, -4745, -23259, -42216, -43319, -40011, -18027, -19824, -22155, -26448, -32824, -8929, 21295, 52833, 66094, 34828, 6893, -16964, -19634, -23539, -26728, -16326, -10026, -17152, 4112, 18605, 45785, 54041, 36249, 22716, -2403, 8309, 17999, -1800, 1740, 14785, -5184, -5232, 4917, -391, -8990, -6114, -30717, -20928, -4085, 4453, 819, 7860, 3008, 9713, 9908, -39538, -74558, -58579, -31294, -15935, -12564, -17298, 6758, 24467, 17889, 9748, 11288, 10573, 27600, 30329, 7898, 4719, -13983, -46628, -60724, -51467, -24261, -6878, -23605, 2032, 36244]
20177C6244o948j1015l3204k5935p664K4117O3k9780P876L4329K0745m609j8169
20164a3950n101R977K41p708l963P941M6707k828m0669k2033L775j351K3880J0194
20150E112k2854p671P249L627j244k699P029j4236k2537N669O068K3350L4828
20137B1691R819J5241j9261k4510N393P380M597r482J4015J390r698j5512R493
20124A0556j6158j6298J4600j49p719L740J3221O983R042k0266J584J0339K15
20111I690J2561J5008k1720j1602n981o561p846J129J2862p926j5516j4601K63
20098d0240j162J4792J8141n351L194K9696K8144Q151l1952k3842j2790k9861
20086d3080k1256L0363L4016J9067K0374Q661j8065j1097k7041k382k4387O137
$$ y = [36244, 29296, 18281, -14923, -40858, -48522, -24405, -24342, -54122, -46246, -11917, 8828, 4219, -13950, -19051, -9074, -8833, -16541, -20504, -12563, 34144, 31316, -9353, -31386, -27611, -28962, -5082, 5112, -17742, -25413, -18164, -14537, -15781, -18480, -11451, -25687, -48224, -42555, -36487, -13137, 21691, 31510, 46751, 27490, 2980, 8373, 15753, 20350, 10868, 24883, 26273, 16575, 1063, 10556, -5602, -21900, -7300, -7449, -15168, -11428, 1793, 8776, 17818, -2448, -864, 9475, 9690, 22251, 37259, 15539, 3937, -2044, -8605, -16451, -15322, -2460, -10386, -25902, -40503, -40240, -41402, -26610, -8469, -13820, -10626, 19070, 47214, 55365, 23413, -429, -13219, -43080, -64336, -33973, 43, 19110, 39484, 48145, 30080, 18983, -8058, -10440, -34827, -28690]
20074b8690L4321J7945k4525K5075p741k3818l202J1338J1898m719J8368k4961
20062A289k3097J7513M66j9246j0111Q620K0853m205J4132L833J9778J0836p357
20049C3304p764l4018k4825P659K9823j0389k7874J2863J0254Q386P710k997O389
20036H521k3948k7098Q477L6622Q088k3788l2270K5432J1701j785J890k141N974
20023d325k6296O312Q160m339l128K5105j619R855P762j3505j3957J2037J3148
20010A5210J253Q078j2860K350j9485q248J9825N649o081j5995K3600K1034M577
19997C8907J4431j8543j4809k3721k1254m943R722J6641p746M5735L3892j0297
19985E8015k2961m853p509j0992m802J6696m210l7867J014L5263n742k1091p65
$$ y = [-28690, 5631, 23576, -949, 24126, 16385, -7433, -10635, 703, 12601, 7882, 26250, 1289, -21808, -4295, -3829, -23075, -33186, -24566, -3713, -7918, 6214, 10047, 29825, 40661, 33304, 25540, -8478, -33303, -25644, 4179, -6210, -34084, -21221, -10967, -2581, 5129, 2132, 8521, -15427, -42525, -34048, 2574, 10662, -13126, -45396, -19964, -8263, -10048, -8158, -10299, -4325, -30621, -24309, -16149, -20488, -23616, 1489, -130, 9725, 17487, 3982, -9975, 2062, 15210, 16463, 24541, 11681, 14031, -5454, -13702, 6123, 11772, 5691, -10304, 13296, 34330, 38907, 53338, 34795, 19986, -3735, -24989, -29932, -20210, -3569, -11315, 34420, 68312, 58015, 35054, 30201, 22692, 11700, 6898, 23594, 19384, -18483, -17469, 17794, 12052, -9039, -9804]
19972i804j0019k501L986J1240o218j335K1272k675l8998K1047l117j2861r946
19959c9929j5873L4729M2218K2347j6976j7658l0974n392Q088J6074k273l519
19947i138j4103O007o510J0459j3786l2131J6253K4836r211K0165j2810j3308
19935c3277k657m349Q666k0748o208J4372P480J8129Q275M689j3012m451j167
19922b4258J8817j63j775J2757R975J1819q81m3307j0274J1626j708J5811R222
19909G661j2118p777Q746J9605K994j1712k5095k702j6574l753K1864n845M158
19896b0548P308n808J1706P631P660k439j1254K2142K1619k457j1541k1254N449
19883H214J0691n587j4204K2689l5480k9390P898O589j4909M305M461J2474l29
$$ y = [-9804, -19823, -22324, -18338, -7098, -13316, -14651, 6621, 3946, -35052, -14005, -17122, -29983, -39929, -55802, -21073, 21145, 43492, 26516, 8858, -22116, -27508, -19420, -3346, -5619, -9138, -23241, -17234, -23744, -13285, -27071, -59202, -42949, -18113, -27324, -7159, -19969, -33277, -35934, -40283, -31617, -52365, -58573, -44201, -36721, -18592, -10317, -5628, -18640, -23091, -24258, -5441, -5604, -7379, 5378, 15353, 27172, 26291, -17016, -27290, -15664, -17372, -1561, 7661, -4457, -12234, -3488, 16117, 19111, 7399, -17696, -20398, -36972, -40725, -18861, -24706, -20548, -13240, -19048, -7342, 289, 7949, 5510, -5744, 16398, 38017, 35560, 24019, 2765, 8214, 18905, 13318, -886, 21803, -13677, -43067, -35169, -28580, -43489, -39184, -34723, -22249, -22578]
19870b2578J3213K0285R045Q548k8873k1585m1559j8960K8384K8648M2123J6280
19858C2971k621k7278k0832j2789O744n376Q15l021r77J4077P465q169J1557L803
19844c631K650N648j4471P177K1527j8324j1007R037J2986K3856J1146l1155k9224
19831a3785N568R115J0516L262r675Q842J6230j7435j4604l2435K1525J7355k7857
19818b3378j2550J0497J5859n997J2139J8772Q788j4734q960l9845k3554r642
19806g2605L3245p12Q48Q320p327k7458m405O528R311O314l56J4381o687R929
19792c0674Q282m046J844L648K095n196j586j1133N027J1668K2782Q209n050r915
19778d045J1902n181L1401o943r565r54J3621j3249J3861R41J034k5831j5783
$$ y = [-22578, -9365, 10920, 19965, 28513, -360, -21945, -63504, -82464, -54080, -25432, 16691, 32971, 30350, 3072, -17760, -30549, -23805, -29181, -28366, -31387, -32364, -18287, -10822, -18991, -7434, -3631, -981, 4667, -9804, -2627, 18900, 576, -10431, -1394, 11592, 35448, 46594, 15439, -13785, -8217, 898, 11414, 14676, 5001, 13843, 30073, 12638, -1966, -34401, -12876, 4479, -23378, -35928, -25431, -9572, -15569, -3430, 15342, 24130, 9396, 436, -39409, -62963, -72605, -39360, -40072, -39224, -30904, -38231, -65689, -70094, -63566, -54255, -47941, -48297, -33916, -40603, -30674, -22392, -26438, -24594, -20946, -18851, -24047, -25633, -36766, -31739, -20071, 2711, 10920, 5870, -4045, 7857, 2676, 34077, 27134, 17569, 16615, 30236, 16987, 30848, 31789, 32823, 6992, -8791]
19765h791L48j5343q861J1669r314j7303J2895K5303O3048J2917r076l254K7506
19752H1744L1869P0986Q3317J10994J23525J21608K9375q2089j26785q4195p0895
19741B89454l7167k9363l9863l6082J2233M6784Q3733J12675J50496J10988k4829
19730F39059o4459j1116j6733j7877m4105j01257j22050p2361q3224j4518l931
19719H7428k4551j9046o058J5128R658p340j3362q017K842J7902L2651K1338L4831
19706A43404J8384l816O790j7317j9956j6808m973m34J7163L1083L0422K6329
19694B10271J05603J31035J42072J25245J6038o7307j26846j28463l8853P256
19684C76051M8709N8727L1596j0117q050J5058L6329J2091l5959q2496j14909
$$ y = [-8791, -8443, -23786, -32647, -20978, -30292, -47595, -34700, -9397, 53651, 66568, 57492, 54238, 81744, 113613, 184599, 267916, 378910, 502435, 624043, 653418, 571329, 444544, 360349, 289454, 252287, 222924, 183061, 146979, 159212, 205996, 289729, 402404, 552900, 663888, 639059, 574600, 563484, 546751, 528874, 484769, 383512, 261462, 189101, 105877, 91359, 87428, 62877, 43831, 37773, 52901, 62559, 55219, 41857, 33840, 36682, 54584, 87235, 108573, 143404, 161788, 157972, 164762, 147445, 127489, 110681, 105708, 105274, 122437, 153520, 183942, 210271, 315874, 446909, 588981, 714226, 730264, 662957, 536111, 407648, 368795, 376051, 424760, 483487, 515083, 504966, 496916, 511974, 548303, 560394, 524435, 441939, 327030]
19673C27030j20233l5779l4292k995j0556l5606j4637n902j7649k6507j169K2111
19661D3816J844J0702j0110j8646P551j4679K3057R620j3788M368p936k5460j054
19648I285K4478L2980k3496m4567j0989J2354J39j633o183k9773J7835L2815j067
19635A2178k4573j1252m075K6793j0679R07j2242r576r14M2276j1271r042n12
19622a1982j4642Q078k850l6515J2857L2107J1397j3404J1019j5551J6719P141
19610D374j7654j8429K5668m537p336k5987J6704M217K201K1316Q694m8922l538
19597d3229K409p968l0270k23K8144L7394j463j0732l108j3359o847O430R95m537
19583d6364J2378J5916p04r645L3607J1495j435k4614M242P510J965k0744l5488
$$ y = [327030, 206797, 171018, 136726, 133731, 123175, 87569, 72932, 67030, 49381, 22874, 21705, 43816, 45660, 56362, 46252, 27606, 35157, 20478, 43535, 53155, 39367, 43735, 35799, 10339, 9285, 33763, 66743, 43247, -1320, -12309, 45, 184, -1449, -7632, -37405, -19570, 13245, 12178, -12395, -23647, -27722, -929, -11608, -10701, -22943, -32519, -33433, 8843, -2428, -11470, -11982, -26624, -18546, -21396, -57911, -45054, -12947, -1550, -14954, -3935, -19486, -2767, 4374, -13280, -31709, -6041, -10578, -17914, -43901, -27197, -22980, -20779, 537, 9231, -39691, -43229, -40820, -48788, -79058, -79281, -51137, -13743, -15206, -25938, -29046, -42405, -49252, -42822, -41827, -46364, -33986, -18070, -18774, -28419, 5188, 16683, 15248, -9366, -5124, 2386, 4351, -16393, -51881]
19570e1881J70q36J5215K0938J5201j6763j247J1564l389k7153j5324K1659K0292
19557a1554j9855O110J8362j3004J554J0343J6938p192J1874R537o643j1171o834
19544a535R765K709r348j5110J6027J1589n383j0625K8013J1910J838K6005k0991
19531D4864l0162J3181J3339j6038k1469k8643q860L545P566J9324k1015j5548
19519c9916Q156k24K9112j7454P866q151j0166n574K020L1626K3090n588k3876
19506i079K1829J2518j1146k9503l2897J5531j1629k184J1157k7627m208Q299
19494e8939K770q284K7370K7193J5009j0024J73J9832P274q625J3742l716l0484
19481f709K3658K6326m489k1085o652k1345J4648J209q933j258K4033J5278J8015
$$ y = [-51881, -51711, -52547, -37332, -16394, -1193, -17956, -19203, -7639, -11028, -38181, -53505, -31846, -11554, -31409, -25299, -6937, -19941, -18387, -8044, 8894, 1702, 13576, 23113, 16470, 5299, -1535, 8230, 10939, 1591, -13519, 2508, 14097, 8714, -1911, 26102, 38012, 39850, 65855, 44864, 14702, 27883, 41222, 25184, 3715, -24928, -33788, -30243, -22677, -3353, -24368, -39916, -31760, -31984, -2872, -20326, -12460, -20611, -30777, -36351, -34331, -2705, 20385, 14797, -9079, 12750, 25268, 14122, -15381, -48278, -32747, -44376, -46560, -35403, -63030, -67238, -58939, -56169, -64453, -37083, -9890, 5119, -4905, -4732, 15100, 22374, 13749, 27491, 23775, -6709, 16949, 43275, 38786, 17701, 11049, -10296, 4352, 5561, -3372, -4630, 19403, 34681, 52696]
19468E2696K7842K9819N245j5793j0006j680k3171k0533o325m7908n064J1210
19456c668R451K3695K6468O191l1553k5285k3037O468R122O151R360O651l400
19443A6614p718j3357l838j1240j9838K7267J3968j9453R896J0285M046o51q455
19430b474j8281O498K0752K3184K4786K1801L2497L121J6382L5575N0177O6661
19418B80679N9464L3263L7812R991j4266j0707l4887p944J2844N676P340k0282
19406C58983q7377o7539m7841n3112l6935j4404l796J8474k62k4836j2818p675
19394B0862o018n108p740M400J9933j878J9656J0809m6527l6832j2301J4288J6878
19381i578K248j6641k1492j3603K6574K1026J6484J4299j611J1970K5987M8135
$$ y = [52696, 80538, 110357, 115602, 99809, 89803, 88123, 64952, 44419, 38094, -9814, -14878, -3668, 5783, 29478, 55946, 62137, 30584, 5299, -17738, -11270, -2148, 4003, 13363, 20014, 16614, 8896, -4461, -8299, -19539, -39377, -12110, 1858, -17595, -7699, 2586, 6632, 5981, -2474, -20755, -14257, 6495, 29679, 54465, 76266, 108763, 111884, 128266, 163841, 214018, 280679, 340143, 373406, 411218, 421209, 406943, 396236, 361349, 353405, 366249, 371925, 379265, 358983, 271606, 204067, 156226, 103114, 66179, 51775, 47979, 66453, 66191, 41355, 28537, 20862, 14844, 9736, 1996, 6396, 26329, 24451, 44107, 54916, 8389, -28443, -40744, -26456, -9578, -7330, -23971, -45463, -59066, -32492, -11466, 5018, 19317, 17706, 29676, 55663, 103798]
19369A03798M4343P2935Q6376L1944j4834j314o727n0909k8502K642M8885Q9608
19357C78245N3308K7155q577l4402r4209p5557o4919n2421l2937j4198o684k4401
19345E0403k5620m5640k5899J0454K7560K6096L0462K6398L5609K1503J8989j4886
19333A35429j8650j8218J7648O803o475R584p002j6346k1066j59k395J783K9578
19320A10514l034j1843j3471O379J2578M4213j6491n087L4695J2973j8051k2737
19308A30638j9953j2144j511J2526L9078M1978m018J7179L7060K0588l2067m2775
19296A86579j7417q458m296j9903j3012J3026R032m385j3850J5142M7166P4245
19284B63869R0195Q3109m542k9263j108k4569l0073k8310j4331J2846J7776K278
$$ y = [103798, 148141, 221076, 307452, 339396, 324562, 323248, 316521, 265612, 237110, 239752, 288637, 378245, 431553, 458708, 450131, 415729, 321520, 245963, 181044, 128623, 95686, 81488, 74804, 50403, 24783, -20857, -46756, -36302, -8742, 17354, 47816, 74214, 109823, 131326, 150315, 135429, 116779, 98561, 116209, 123012, 116537, 126121, 119119, 102773, 81707, 81548, 79153, 80936, 110514, 107480, 95637, 82166, 88545, 101123, 145336, 128845, 123758, 158453, 171426, 153375, 130638, 110685, 98541, 97030, 109556, 148634, 190612, 186594, 203773, 240833, 261421, 229354, 186579, 169162, 160704, 156408, 136505, 123493, 136519, 145551, 141166, 127316, 142458, 189624, 263869, 354064, 437173, 432631, 403368, 402260, 377691, 347618, 319308, 304977, 317823, 335599, 337877]
19272C37877k861J0094N4639L5104N013j2667n180l7566k7213j0515m330K6836
19260C69231L8062K7348M0676J1544M6425M6199J9112J0919j1141M4871Q3944
19249G27190P0128M1879N2786K9897L8404M6008Q8890J47975J74262K40405L09826
19238A967650M49435N00870M64959L84710L08231L88693O07924R81791J556355
19229G610618K549204L843586M521657L866955J223159j685918k497112j924512
19221A7507637m44502J288854L269806O111671J0810454J8892484L0819542M0605643
19213A28861589M0285342K3738567o696012k2774060k8585391k4375357k1680779
19206H8773899j8152319j3111569o935983m87310M784930O809157M344852l090387
$$ y = [337877, 335016, 345110, 399749, 434853, 439866, 427199, 422019, 384453, 357240, 346725, 342395, 369231, 407293, 434641, 475317, 486861, 533286, 579485, 598597, 609516, 598375, 643246, 727190, 797318, 839197, 891983, 921880, 960284, 1006292, 1095182, 1243157, 1417419, 1657824, 1967650, 2417085, 2917955, 3382914, 3767624, 4075855, 4464548, 5072472, 6054263, 7610618, 10159822, 14003408, 18525065, 22392020, 23615179, 21929261, 19432149, 17507637, 17063135, 18351989, 21621795, 27733466, 38543920, 57436404, 88255946, 128861589, 169146931, 192885498, 186189486, 163415426, 134830035, 110454678, 88773899, 70621580, 57510011, 50574028, 50086718, 54871648, 61680805, 66025657, 62935270]
19198F2935270j0334376j2150682j0474015p186149m501896k921744j984641j336706
19190A2045061q63964o45477n48469m71353m18373k42985n8425Q3569K38750K78228
19180I396562K82864L26166N33984J070861J935666L341026N577086Q871515J2086315
19171D3422045J2587133Q617905j52280o553074p324839l945674J912633Q732809
19163E7296658J5689083K2042894K7817025L2022822L6042727K7163315M616137
19156B22690661k9955362m5967812m3592866l1781328j9088114j1384713p167692
19149C3752774m352535k012245L00579K261343K600521Q83332l073204n539582
19141B4820983n596532m326163k711288j659729j128926q67538p23883o92605
$$ y = [62935270, 52600894, 40450212, 29976197, 22790048, 18288152, 15366408, 13381767, 12045061, 11181097, 10535620, 9987151, 9515798, 9097425, 8854440, 8796015, 8879584, 9118334, 9396562, 9679426, 10005592, 10539576, 11610437, 13546103, 16887129, 22464215, 31335730, 43422045, 56009178, 64627083, 64474803, 57921729, 50596890, 46651216, 48563849, 57296658, 72985741, 95028635, 122845660, 154868482, 190911209, 218074524, 222690661, 192735299, 146767487, 103174621, 71393293, 52305179, 40920466, 33752774, 29400239, 27387994, 27688573, 29949916, 32550437, 33433769, 30360565, 24820983, 19224451, 14898288, 12187000, 10527271, 9398345, 8530807, 7806924, 7114319]
19133G114319p06215p36789o73829n37347m62770l95783k81657k49277j99433
19124B871219j43710j40687j20262j11350j66393j26282r7377j18705j03486r9877
19114A643090r5298q3775j10824j04399o7155k6066m1177n3532n3067m0328k7653
19103I39816k0478l0110n7239p0186m3340k9724l112j0103j0923l1155l0135O62
19091F03973j0190l2917l6424j5741P342J1135L2633L4275M7548K7827K2412R675
19079G01548l085K3950Q124l2032m8392o8645m2385j4565n0594k5222K4200l444
19067D69458N260M42M378J4432J5487j0368k8227j3933k0263l2860n6205J0352
19055C57953p579K3978K7885k0093l250N365l411L301J8817J7022N0385K9389
$$ y = [7114319, 6408104, 5671315, 4997486, 4460139, 3997369, 3601586, 3319929, 3070652, 2871219, 2727509, 2586822, 2466560, 2355210, 2188817, 2062535, 1965158, 1846453, 1742967, 1643090, 1547792, 1464017, 1353193, 1248794, 1181639, 1155573, 1114396, 1060864, 1007797, 967469, 939816, 919338, 889228, 831989, 761803, 718463, 688739, 685627, 675524, 664601, 633446, 603311, 603973, 593783, 560866, 524442, 508701, 516043, 527178, 559811, 594086, 641634, 669461, 691873, 701548, 698463, 722413, 730537, 698505, 650113, 581468, 539083, 524518, 473924, 448702, 472902, 469458, 474718, 475160, 479538, 493970, 509457, 499089, 470862, 456929, 436666, 403806, 347601, 357953, 350374, 374352, 402237, 382144, 378894, 384259, 380848, 384149, 402966, 419988, 470373, 499762]
19043D99762J1655K8688M9734R4020O9745P6232N9955L2656k0167o1797k2882
19032H17601p231k4544J6724O2133O9990L3043K4682J8790n2414r3906n3675r9043
19020G12150j13408r1703l5409j8212m5426m4632k277j2135k851J4644r152K660
19008C54249J41j9602m5937k662J5131j1805L396o116k2713k1030o789O338p227
18995B35374j8982N740R355M6272Q288k6428j9671j8355j8422P027J1712J0350
18983B32260j579k7635N88n628p476K1985O354r119m262O44k4729r199L516Q986
18969A84706K4676j8367l3718j531P804J2396k7387k6933P64K2604Q124J0799
18957A63937m331k614k7231m1412J1724L3142Q499j5533k2042r817J1146j7648
$$ y = [499762, 511417, 540105, 589839, 683859, 753604, 829836, 889791, 922447, 902280, 840483, 817601, 810370, 785826, 802550, 864683, 934673, 967716, 992398, 1011188, 958774, 864868, 811193, 712150, 598742, 507039, 471630, 453418, 407992, 363360, 361083, 348948, 346097, 360741, 351589, 354249, 354390, 334788, 288851, 286189, 301320, 289515, 292911, 286795, 264082, 243052, 236263, 242601, 235374, 216392, 222132, 231487, 277759, 286047, 259619, 239948, 221593, 203171, 210198, 221910, 232260, 230681, 203046, 203634, 198006, 190530, 212515, 218869, 209750, 205488, 206132, 181403, 172204, 175720, 184706, 209382, 191015, 157297, 155766, 163570, 175966, 148579, 121646, 122410, 145014, 153138, 163937, 159606, 156992, 129761, 88349, 100073, 133215, 141714, 126181, 104139, 94322, 105468, 87820]
18945H7820q654J2653K0494O360K992K4857j3502j441J1621r337o371l371K276
18932A26397Q923K3000K748j5344j1841r12j1575J3589q35K3366j7697l5912L125
18919A07032l988Q693j6790J8395J2040J3049K824J9055K3747j7497j5343p126
18907A44091k100M035Q463M6797M050k1642p416K3629K7701o164Q848L0890L1627
18894B92809M7779O8991R1605Q1019K3838L5013M4774j4422l3811m2869k7014
18883E67712j8164k503K1017O4661O5781L7913L6591j6430p7199n3328K1359k0897
18871F26513o9076n8596l9269k0173j4939j7777j1246l8358p3355l5038j6777
18860B31909j3898l052j1722l362j8156r040j0740j2932J0412J0525J0414R973
$$ y = [87820, 79166, 91819, 112313, 118673, 121665, 146522, 133020, 131579, 143200, 133863, 127492, 124121, 126397, 135320, 158320, 161068, 145724, 133883, 132971, 121396, 134985, 134150, 157516, 139819, 103907, 107032, 103044, 111737, 94947, 113342, 125382, 138431, 141255, 160310, 184057, 166560, 151217, 144091, 141991, 146026, 154489, 201286, 205336, 183694, 176278, 199907, 227608, 221444, 230292, 261182, 292809, 340588, 409579, 501184, 582203, 606041, 641054, 685828, 671406, 637595, 594726, 567712, 549548, 547045, 568062, 632723, 698504, 736417, 773008, 756578, 679379, 626051, 647410, 626513, 557437, 498841, 459572, 439399, 424460, 406683, 395437, 357079, 283724, 248686, 231909, 218011, 214959, 203237, 199875, 181719, 172679, 161939, 149007, 159419, 169944, 180358, 190331]
18848A90331l501k004K1925K6153K6193L98r275P22J9992N304J4483L8296L0226
18835C59243L4433P8372Q6783L1809K4064K6259L400m8105n4865m1488m1482l8003
18823D20420j17K3075r627k8463j9962m1429k6990k1959p3222m4870q170J9887
18811A88573Q217m019k5171n0321j4695K2608K7207n195J1035N500k0545k0733
18799A22461m7661j3371O327J8927N3000r689l4429l4152n173n242j2084j3418
18787B5496L4729K0098J176k2682j6907r225J5795K3740j7533k3403p052K5110
18775D9342J4743K5496K7418n500r257j407K1978R7508J33399J09183o6240j33680
18763B62983l7493j8504Q646j4169k0902k5981j9786k4929q421L1512L0680K3168
$$ y = [190331, 186830, 184826, 206751, 232904, 259097, 259495, 250220, 250942, 270934, 276238, 290721, 329017, 359243, 393676, 472048, 558831, 590640, 614704, 640963, 644363, 596258, 541393, 499905, 458423, 420420, 420303, 443378, 433751, 405288, 385326, 343897, 316907, 294948, 221726, 176856, 168686, 188573, 196790, 192771, 167600, 117279, 102584, 125192, 152399, 147204, 158239, 163739, 143194, 122461, 74800, 61429, 67756, 86683, 139683, 129994, 95565, 61413, 56240, 50998, 38914, 25496, 60225, 80323, 81499, 58817, 41910, 32685, 48480, 72220, 54687, 31284, 24232, 49342, 64085, 89581, 116999, 111499, 102242, 100835, 122813, 220321, 353720, 462903, 396663, 262983, 225490, 206986, 215632, 201463, 180561, 154580, 134794, 109865, 101444, 132956, 163636, 186804]
18751A86804Jl5871k9044j388j5867k2494m4063l0527J9428K7860J0057K262J3056
18738H0214j0741Q57j3529j6818l857K0042N822P412P084J8008Q834j5851J509
18725H8986K6227L9911J4565j1560L4687K8943r060q883j824J4763M3312N9700
18713C19767M3870Q159k5086k4250k2873m047K2421L0783J7037j1334J7590j8615
18701C53422m5370l8815p3936j8335J9693k0092k5441J5967J6586J1522N7695
18690B52896R7912J00303N7167M6131J4552j8331N784k2827j9501l8896p5589
18679C99601o2766J0773N3624J06513J12544O7644m951q8441j16801o3903j8248
18668C95589K8146J6222K1105K8909q2177r4224n0625l4179K1511L6219M2980
$$ y = [186804, 186805, 150934, 121890, 120502, 104635, 82141, 38078, 7551, 26979, 54839, 64896, 67158, 80214, 69473, 70330, 56801, 39983, 36126, 56168, 61990, 69402, 76486, 94494, 103328, 87477, 88986, 115213, 155124, 169689, 158129, 192816, 221759, 212699, 203816, 201992, 216755, 260067, 319767, 363637, 371796, 346710, 322460, 299587, 295540, 317961, 348744, 365781, 354447, 372037, 353422, 308052, 269237, 195301, 176966, 196659, 176567, 151126, 167093, 183679, 195201, 252896, 350808, 451111, 508278, 554409, 568961, 550630, 556414, 533587, 514086, 475190, 399601, 336835, 347608, 401232, 507745, 620289, 687933, 682982, 594541, 477740, 413837, 395589, 423735, 439957, 461062, 489971, 407794, 313570, 262945, 228766, 250277, 286496, 329476]
18657C29476L7225J5430k6360n4192l1652k5719k2266r422l2756k80r058m0094
18645A30332K1435K8140j5691L6950Q3748J35772J17045Q3343P7763P3127L5826
18634H07790J4363M028l7325p7952j14603j14364n7847L527n133k0961R345K3039
18622D33907Q8391J28036J81065J53344M4414j13540j97953j89684j38265q2030
18612C07685n4588n5086k5571k4720k3301j2177j9675K1319J9507j894J6568J5270
18600A63337j4493l3121L343P200J0774l244j9531j3387o572l0760P606J7489
18588H8641K1144j5107J0584K7591l1069l2848L2336K4867K492K214J2999K1091
18576A64935j7956p029J4727l836J4627j650J2232O396K4977K3119L8186K4627
$$ y = [329476, 366701, 382131, 355771, 301579, 269927, 244208, 221942, 212520, 179764, 179484, 170426, 130332, 151767, 179907, 164216, 201166, 284914, 420686, 537731, 621074, 698837, 771964, 807790, 822153, 826181, 788856, 710904, 596301, 481937, 424090, 427617, 422484, 401523, 410868, 433907, 522298, 650334, 831399, 984743, 1029157, 915617, 717664, 527980, 389715, 307685, 253097, 198011, 172440, 147720, 124419, 112242, 92567, 113886, 133393, 131499, 148067, 163337, 148844, 115723, 119066, 126266, 137040, 133796, 114265, 100878, 94306, 63546, 71152, 88641, 109785, 94678, 105262, 132853, 101784, 68936, 101272, 126139, 128631, 130845, 143844, 164935, 146979, 139950, 154677, 150841, 165468, 163818, 176050, 182446, 207423, 230542, 268728, 293355]
18564B93355J1513j8049j641K3052K1641p64M0126R9743J38346J19966K5568n3536
18552F99320q7749q4358o2824o6684j6327N1500O184o1757l2211k0714k0930k4246
18540B79204l5293k9092k4031r465m1765o3770J770M9415L2761M046j2615k7227
18528A23938j0423k461j7450k9826j8290k4865K4013K0276R133J115J6848N2374
18516A44382O7264P7777L7976p2591p7049m0770M046N4201O7228K9850l4840o3810
18504A93664o1159j1815J1007M0358L0865j3332r508M725M2483K9056j9921m3948
18492A92475o653K3319j9977k717R400o858k1161J5379J0444j3863q742P462L000
18479A81508O637j8145k2184o377N031j5365l2622j1190K6664K4963L9866J7132
$$ y = [293355, 304868, 286819, 285178, 308230, 329871, 329107, 369233, 468976, 607322, 727288, 752856, 699320, 611571, 527213, 464389, 397705, 381378, 432878, 439062, 377305, 345094, 324380, 303450, 279204, 243911, 214819, 190788, 181323, 139558, 75788, 77558, 126973, 159734, 163780, 151165, 123938, 113515, 111054, 93604, 63778, 45488, 20623, 44636, 64912, 74045, 75160, 92008, 144382, 211646, 289423, 327399, 254808, 177759, 136989, 141035, 195236, 262464, 292314, 257474, 193664, 132505, 120690, 131697, 172055, 202920, 189588, 180080, 184805, 227288, 256344, 236423, 192475, 185822, 209141, 189164, 186447, 195847, 188989, 167828, 183207, 193651, 179788, 171046, 178508, 181508, 188145, 170000, 147816, 141439, 146470, 131105, 98483, 87293, 113957, 138920, 178786, 195918]
18467A95918j3362j0467j5072J4371K5230O9944N5634L2127O9702N5214L6040
18456E15279O588J181k6071j3742k0874J2697L5393K9659L9754L3611O0408N0515
18444G24398k2534o0428n4262m2717l5362n9478k9896k643m663p129n959K2052
18432D21379K9663J1179J1171j5137J1122L4821j9598l9680K255R838N6787N8038
18420E71838L4800L5717P3084M3065L7205L5603O1848Q7747O8048P7005J35988
18409A261948J63004J55635J52360K28597K35094K55542K88300K46561J55689
18400C142730J56321J88944K05249J95137K85104M00249O93664J115649J667178
18391H050225K462347L102829K593760K201025L256430L126419Q412j108042L94342
$$ y = [195918, 182556, 172089, 157017, 171388, 196618, 266562, 322196, 354323, 424025, 479239, 515279, 521867, 523048, 496977, 483235, 462361, 475058, 510451, 540110, 579864, 613475, 673883, 724398, 701864, 641436, 587174, 544457, 509095, 449617, 419721, 417078, 412415, 405286, 399327, 421379, 451042, 462221, 473392, 458255, 469377, 504198, 484600, 444920, 447175, 457013, 513800, 571838, 606638, 642355, 715439, 758504, 795709, 831312, 893160, 980907, 1048955, 1125960, 1261948, 1424952, 1580587, 1732947, 1961544, 2196638, 2452180, 2740480, 2987041, 3142730, 3299051, 3487995, 3693244, 3888381, 4173485, 4573734, 5267398, 6383047, 8050225, 10512572, 13615401, 16209161, 18410186, 21666616, 24793035, 24801447, 23693405, 24087747]
18382B4087747J293519J890097M619686R952600J7515675K3915791K1202777J7751224
18374A22229116K6174915K7974125J198493j6030443j0074644q396565k0927052
18367A22147945k4866117j6438705q544941n819186m971669k616502J254556J014412
18359F1159793n351562p825621n550920n466037p101744o442952m469686k956379
18351A5994892j980809j417618r52589n59248l35440l10467k01558r5204j09165
18342A0032794o5939Q9538L52187P57533J402834K450927M060538N847142O347645
18333C1275199N033570N399052P265399M521049j427230r79729L031309M724365
18325E8842984N037358R113893J7319577K2164102J5482596P593109J1549180
$$ y = [24087747, 25381266, 27271363, 31891049, 41843649, 59359324, 83275115, 104477892, 122229116, 148404031, 176378156, 177576649, 161546206, 151471562, 143074997, 122147945, 97281828, 80843123, 72298182, 66478996, 61507327, 58890825, 60145381, 61159793, 55808231, 47982610, 42431690, 36965653, 29863909, 23420957, 18951271, 15994892, 14014083, 12596465, 11643876, 11084628, 10749188, 10438721, 10237163, 10141959, 10032794, 9966855, 10056393, 10408580, 11166113, 12568947, 15019874, 19080412, 24927554, 31275199, 36308769, 41707821, 48973220, 53494269, 52067039, 51087310, 54118619, 58842984, 63880342, 72994235, 90313812, 112477914, 127960510, 135553619, 147102799]
18318A47102799J2931171p065197k6092747j9596778j3998638j9332717k0152793
18311E3795100j3409265p478030l830761j995419j520687o37687N24213n13470
18303B4933994k963576k809888j949174k400913k783561k243783j546503j056995
18295G179601p63658n32941l68122l08300k81879k25597k18274k56821l34388
18286C889621l19746k86041k88088k29697j81780j64302j14054q3643p6325j00096
18276B045849j09824j10471q6215q6871m7715m3714o5487n1976j13050j39322
18266A191204q3604o6573o8177m6428m8699l6791m7984m4555m1733m3516k687
18255F60457l1600k9956j7791j7843k3895L068k707K0166L1645L2517J8787J8364
$$ y = [147102799, 160033970, 152968773, 126876026, 107279248, 93280610, 73947893, 53795100, 40385835, 32907805, 29077044, 27081625, 25560938, 24923251, 25447464, 24933994, 21970418, 19160530, 17211356, 14810443, 12026882, 9783099, 8236596, 7179601, 6415943, 5883002, 5514880, 5206580, 4924701, 4699104, 4480830, 4224009, 3889621, 3569875, 3283834, 2995746, 2766049, 2584269, 2419967, 2305913, 2222270, 2145945, 2045849, 1936025, 1825554, 1739339, 1652468, 1604753, 1561039, 1495552, 1443576, 1330526, 1191204, 1107600, 1041027, 972850, 926422, 877723, 840932, 792948, 748393, 706660, 663144, 660457, 628857, 598901, 581110, 563267, 539372, 542440, 539733, 559899, 591544, 624061, 642848, 661212]
18243F61212K1939j1062j9082M58n7790m3946j8020l891J8953M2740J8538k2393
18231E87656l8981l7676j5931K214J4854k3092j3788l0732k0274j8383k4252j1657
18219C69958o111R255N847j3513q919M93Q006p548j2024l447J7827J6832l981
18206C72675j6688J977k6446p764N720o296k2131j255J6546R646J3232J9770K4660
18193C83646k8359L1526K6810L5611J9885K1140J6213k5606l6934j032K3241O541
18181D72682j9281k0123K885j1857m8436j2263J2244j982k1470N726M737r716
18169C53146J765r603p887K1694L422l1564J0817K5443j0586m3260j4278r01j5166
18156B83042j971K1105M0913J8823J9296j1014k5112k3180k9579j7812k574j3916
$$ y = [661212, 683151, 672089, 653007, 653465, 595675, 551729, 533709, 529818, 548771, 591511, 610049, 587656, 548675, 510999, 495068, 497282, 512136, 489044, 475256, 444524, 424250, 405867, 381615, 369958, 363847, 373102, 378949, 365436, 356517, 357010, 365016, 357468, 345444, 341997, 359824, 376656, 372675, 355987, 357964, 331518, 323754, 329474, 323178, 301047, 299792, 316338, 325984, 339216, 358986, 383646, 355287, 386813, 413623, 449234, 469119, 490259, 506472, 480866, 443932, 442900, 466141, 472682, 453401, 433278, 436163, 424306, 375870, 363607, 375851, 373869, 352399, 358125, 362862, 353146, 354911, 345308, 337421, 359115, 362537, 330973, 341790, 367233, 356647, 313387, 299109, 298208, 283042, 281071, 302176, 343089, 361912, 381208, 370194, 345082, 321902, 292323, 274511, 271937, 258021]
18144B58021m087j5535j513K4583L4574k346p274N8922K7873P573J391J7152J3661
18131D12995L0862M0396J6656K3731N1000N3935L8563L9382P0075J03728J27044
18120A008367J59176K26504K65601K86705L90226O33307R96106J648772K861548
18111H476312N472525J1047015K0620717K4547229p973245k7052555j4998891
18104B0139107o967124l749368k255410j568384j177490q57632o19989m25755
18096B517955l12121k67038k43287j99371j56175j42509j12883q3469l2879p3004
18086H95219o6831o6322p0665m0490k7526k2642l4822l6693n503m5637k4107J2840
18074D66821L432j5637l7977l3334l6226o022qk8537l2337j3519J3891J0718j3216
$$ y = [258021, 253934, 238399, 236886, 261469, 296043, 293697, 286423, 345345, 373218, 380791, 382182, 399334, 412995, 443857, 484253, 500909, 524640, 575640, 629575, 668138, 707520, 777595, 881323, 1008367, 1167543, 1394047, 1659648, 1946353, 2336579, 2969886, 3965992, 5614764, 8476312, 13948837, 24995852, 45616569, 70163798, 62190553, 35137998, 20139107, 13171983, 9422615, 7167205, 5598821, 4421331, 3563699, 2943710, 2517955, 2205834, 1938796, 1695509, 1496138, 1339963, 1197454, 1084571, 1001102, 968223, 895219, 828388, 762066, 691401, 650911, 623385, 600743, 565921, 529228, 523725, 478088, 453981, 466821, 470253, 454616, 416639, 383305, 347079, 341057, 341049, 312512, 280175, 266656, 280547, 291265, 278049]
18061B78049l8433k2814p420K45J6648M1775K5131k236l4045m6065k954q347j9374
18048A80160R102l066K5938K4080j6453j1450l7766k2756k1752p224K7460J883
18036A48156M698J3610m5n976p357J212j2608j1393m737n49k0233j0061m233K0718
18022A11202k2363k621K111m766J4985J4327l2913r964j2802p664K1650O188N974
18009H3344j2545J6258J2961j9780r098J2622M6742J6527N070k9340n066K4789
17997A42484j6678k9806k3039k2199Q550L9939M0961j5276l0015k3860O873L61
17985G8295l3787J696J9864K8025L5531K3631L930k2872l2151n441J7231J619
17973A15571j0119j8954j4133k0842l7128J3301L6886K9500K4319p146j600k1599
$$ y = [278049, 239616, 216802, 209382, 209627, 226275, 268050, 293181, 290945, 256900, 210835, 207881, 199534, 180160, 189262, 186196, 212134, 236214, 219761, 208311, 170545, 147789, 126037, 118813, 146273, 148156, 152854, 166464, 166419, 160443, 153086, 154298, 141690, 130297, 125560, 125011, 104778, 94717, 90484, 111202, 88839, 86218, 88329, 83563, 98548, 112875, 79962, 69998, 57196, 49532, 71182, 77370, 83344, 70799, 87057, 100018, 80238, 71140, 83762, 130504, 147031, 152101, 122761, 117695, 142484, 125806, 96000, 72961, 50762, 59312, 99251, 140212, 124936, 94921, 71061, 77934, 78295, 44508, 46204, 66068, 94093, 129624, 153255, 157185, 134313, 102162, 96721, 113952, 115571, 105452, 86498, 72365, 51523, 14395, 27696, 64582, 94082, 118401, 111255, 109655, 88056]
17961H8056J6664K2907J21J9108n0087k9630m774j2317J4483L444l1707J7829
17949E4097p701j0628K3984K1543k9162K746K4582Q716l2853m1619j202J7003
17937B9506J052J5426j4767M552Q223J4086J1634J0500k0743q914j5731k1282
17925A3542K9532K0127J3273J7643j656l9275K7594M3457p483m3545l3926J1824
17913E1107N557l3933J9527K3138q462K8970j1169o898K0625N450j2285O552K8453
17900A16632J0783k7557k06Q77j1743k5077k6165j214J1931L6139K1384m5441
17888F0343n341o461M500L690j728j7715L1343K7243j2082k1680J1550J4908Q099
17875I6669Q711J9149J0457M0293O1268L2939J0311K3014L5608K2056L5214L1985
$$ y = [88056, 104720, 127627, 127748, 146856, 96769, 67139, 62365, 50048, 64531, 67975, 36268, 54097, 46396, 35768, 59752, 81295, 52133, 54879, 79461, 88177, 55324, 13705, 12503, 29506, 30558, 45984, 31217, 35769, 43992, 58078, 69712, 80212, 59469, 50555, 34824, 13542, 43074, 63201, 76474, 94117, 92461, 53186, 80780, 124237, 116754, 73209, 39283, 51107, 56664, 22731, 42258, 65396, 56934, 85904, 74735, 67837, 88462, 93912, 81627, 88179, 116632, 127415, 99858, 99652, 100529, 88786, 63709, 37544, 36330, 48261, 84400, 105784, 60343, 55002, 48541, 53041, 56731, 55003, 37288, 68631, 95874, 83792, 62112, 73662, 88570, 96669, 105380, 124529, 134986, 175279, 236547, 269486, 279797, 302811, 338419, 360475, 395689, 427674]
17863D27674O0526L8285l764J1798K7487K6920K8791N0808O2695k3858l3081J0155
17851F84436L515n4341q5291q9733o4752m9289m7845l2104J3719K0044j265J6999
17839C14093k294k2971m8418l5074k7203l0899J917l8067R672q133q654q538j7863
17826G7568N593L4408k140q12O141K4495K1425J6709M4539K1511K8157L3494K9945
17813C41033L3410P5192M9701J9807M3927L6982j2767q3012k9295m365k5214k1974
17801D23425k8539J1377L4652q089K3697O7506N182o6829n3890l1311m1320l6297
17789B99564n6013m7369k4010j4882N374k2175n7868j5628J421j868L7304r739
17777I4111k3639o897K785J3143J4137J9540j269l2649j0418j8200O528J466M896
$$ y = [427674, 488200, 526485, 522721, 534519, 562006, 588926, 617717, 668525, 731220, 707362, 674281, 684436, 687951, 633610, 548319, 458586, 393834, 344545, 296700, 264596, 278315, 298359, 297094, 314093, 311799, 288828, 240410, 205336, 178133, 147234, 149151, 111084, 120756, 112623, 103969, 95431, 77568, 83161, 117569, 115429, 114617, 120758, 145253, 166678, 183387, 227926, 249437, 277594, 311088, 341033, 374443, 449635, 499336, 519143, 563070, 600052, 587285, 504273, 474978, 470613, 445399, 423425, 394886, 406263, 440915, 432826, 456523, 524029, 529211, 462382, 408492, 377181, 335861, 299564, 243551, 196182, 172172, 157290, 162664, 140489, 82621, 66993, 68414, 66546, 103850, 94111, 70472, 63575, 66360, 79503, 93640, 113180, 111911, 79262, 68844, 50644, 57172, 58638, 63534]
17764F3534J6813o791p746m352K0672k2058q826r123N781k097J6264J4983l472
17751G3582m215K2124j6591L479j0203j2222r001j829r070J2651p230l3243l527
17738D705K8527L3949J1029p717j4170K204J2417k2539N92P123k7820k2104J7320
17725B3516L7499J5389k942k7548n096K919Q812o660j5989R9K6613j3558j6295
17712B6759K2674n218j7251k0362K999O234j5083J8940L0082K3603o691J5059
17700H1745k9550r874J8334J8145o731k2523j5836J3005J0949j7544j594J8785
17688E7311j2367j0936M336J8468p828j961O110m0174L321L3539L726k8040K4311
17675D9816j1589J480j8812P922j67j467R067j307J1820J0544k6133l6554r59
$$ y = [63534, 80347, 73556, 65810, 61458, 82130, 60072, 51246, 42123, 47904, 45807, 62071, 77054, 73582, 69367, 91491, 74900, 78379, 68176, 55954, 46953, 45124, 36054, 48705, 41475, 8232, 4705, 33232, 67181, 78210, 70493, 56323, 58527, 70944, 48405, 48997, 56120, 28300, 6196, 23516, 61015, 76404, 73462, 45914, 40818, 43737, 52549, 45889, 29900, 29999, 56612, 43054, 26759, 49433, 44215, 26964, 6602, 9601, 15835, 752, 19692, 49774, 73377, 66686, 81745, 52195, 42321, 60655, 78800, 72069, 49546, 33710, 46715, 57664, 40120, 38526, 57311, 44944, 34008, 38344, 56812, 48984, 47023, 53133, 12959, 16280, 49819, 53545, 25505, 49816, 38227, 39707, 20895, 28817, 28650, 27183, 36250, 34943, 46763, 57307, 31174, -5380, -6339]
17662f339J0598K2172O118q117J3839p316J8076R749J3147j4496j922o728k1808
17649B6973K1563J1300m545k2115k1555P976K3983K8099m306k000j0227m951K5821
17636G6016K8748k238j4349j0601j0472k846J0810j5306k1542k5215K0692O427
17624D0124o78j0327k5693k0114J1479K4085L1482q369m873j8437j6049N893K4245
17611C2768K6370K7895q574n767m603l7883j9057o713j1559K9925K315n418J9068
17598C8767r912j9337l8985l024r76K0284K7226J1930k8876R076Q668R548m836
17585A9553k3731J5682L0576k0747j3224L430L210J9160K6840j4730L651J1224
17573F0894n358M317p796L470l992k7497K6669K4524q496n5660j0247J5936n992
$$ y = [-6339, 4259, 26431, 32549, 24432, 38271, 30955, 49031, 58780, 71927, 57431, 55509, 48781, 26973, 48536, 59836, 55291, 33176, 11621, 19597, 43580, 71679, 67373, 65373, 55146, 50195, 76016, 104764, 102526, 88177, 77576, 67104, 64258, 75068, 59762, 38220, 13005, 33697, 40124, 39446, 29119, 3426, -16688, -5209, 18876, 50358, 41989, 37116, 18679, 2630, 8523, 32768, 59138, 87033, 78459, 72692, 68089, 30206, 11149, 4436, -7123, 22802, 25117, 19699, 38767, 28855, 9518, -29467, -32491, -33467, -13183, 14043, 25973, -2903, 6173, 14841, 24389, 19553, -4178, 11504, 42080, 21333, 8109, 11539, 14749, 33909, 60749, 46019, 49670, 60894, 55536, 59853, 52057, 55527, 51535, 24038, 50707, 75231, 66735, 11075, 828, 16764, 10772]
17560A0772J322K4070j2962l6471K7759K1378k2261k255n863K1194J6044N122
17548D7849j8173k8520p289M0799J1858k2357k330J1994j49J917j712K0494J1190
17535F5571r318j1388l986J0640n624Q533k1855j1752N204K7498R477j5966j7549
17522B9485J2458O12l5874k020J0358J6518j4367j2337J310r660j2534j2866M2589
17509A3672L3204N370j0356l2622P987j4449j0364Q80P336K2103j1876j6354J0563
17496E094J820j0863Q842J438R824j3282J0316l3999j1752K959k07l480L4794
17483A504K7758L3808K1007p008m2810p835N4349J737o557j1951k2948p986P362
17470D0430m94l7748R592L4184J6814m930k9602j2296J6091j5247K6887R299k4128
$$ y = [10772, 12094, 36164, 23202, -13269, 14490, 35868, 13607, 11352, 5489, 26683, 42727, 47849, 29676, 1156, -6133, 34666, 46524, 24167, 21837, 33831, 33682, 35599, 33887, 54381, 65571, 56253, 44865, 40879, 51519, 45895, 54428, 32573, 20821, 26025, 53523, 63000, 47034, 29485, 41943, 42555, 6681, 4661, 15019, 31537, 17170, 4833, 6143, -3517, -16051, -28917, 13672, 46876, 52246, 41890, 9268, 17255, 2806, -7558, -6678, 658, 22761, 10885, -5469, 5094, 6914, -3949, 4893, 6331, 16155, 2873, 13189, -20810, -32562, -29603, -29810, -33290, 1504, 29262, 63070, 84077, 77069, 34259, 26424, 80773, 82510, 75953, 64002, 41054, 33068, 40430, 39936, 2188, 11780, 45964, 62778, 57848, 28246, 15950, 32041, 16794, 43681, 52980, 28852]
17457B8852j9214K1699N680j7266k6453L889J0027L3180L3161Q748n834q589L117
17444G0997L4873P4772J10750O3337j07738j16860n9941j2950n712k4620K069
17433B8977J3887o914j1178J8098J6049J807J0505j2525j3308j9193k5940j0964
17421a0699J8292R660j1733q750o809J2402J011j3074o918J2549k595N497k440
17408c607o130K5579K4797J9676p932k8443j1587J3899R557j8123m767j0214J1564
17395A4269L2996J1084J927k1416l8942J4921K9384j4458k8276k2707J4685M032
17383b501k3765J2635o328J8980K2137N619j2086j3732L1309J0390j1612O955
17371C8001q751j4221l2393K9701K4269J2960P973q887k2149k6603K134L294J1593
$$ y = [28852, 9638, 31337, 37017, 19751, -6702, -2813, 7214, 40394, 73555, 82303, 76469, 67880, 70997, 105870, 180642, 291392, 354729, 246991, 130131, 70190, 57240, 51528, 26908, 28977, 42864, 35950, 24772, 42870, 58919, 60726, 71231, 58706, 45398, 26205, 265, -10699, 7593, 17253, 5520, -3230, -10039, 2363, 3374, -9700, -16618, -4069, -6664, -1167, -3607, -9737, 15842, 40639, 60315, 52383, 23940, 12353, 26252, 35809, 17686, 12919, 2705, 14269, 47265, 58349, 60276, 38860, -82, 14839, 44223, 29765, 1489, -21218, -6533, -2501, -26266, -13631, -19959, -979, 21158, 26777, 14691, 959, 32268, 42658, 31046, 38001, 29250, 15029, -17364, 12337, 36606, 49566, 57539, 48652, 26503, -100, 2034, 5328, 16921]
17358A6921M710L1895k3939j1485N059k2442m890l0634K0487n333K0042L142j6783
17345a3250P777r525J5116n481j8585Q739L306j4272r955m342J7010J2245J3887
17332B670j4739L326K2489M345k6936J6041K5830m330L972o586j6708n249K9075
17319C3200K760M070Q966J7681J0097l8025k1399j045J2469J2002j757k6928O10
17306A2701L955k8415m592J0777M996J2276J281j9852j5280L5556M814k5918L120
17293d581L3490j4612j5267j2435J3654K9442O214J6947k6454l0607k5241R179
17281b0271K1716k3522k679q36j7815p009Q469J3856M6959J9590J3566J158j8838
17268C4344J3485j1647j9336p909k357k591J0433J6903J3037P855j3972j244J3864
$$ y = [16921, 21631, 53526, 29587, 18102, 23161, 719, -4171, -34805, -14318, -19651, 391, 3533, -13250, -5473, -14998, 118, -5363, -23948, -15209, -11903, -26175, -36130, -40472, -23462, -11217, 2670, -12069, -8743, 13746, 18091, -8845, 7196, 33026, 28696, 32668, 26082, 9374, 4125, 33200, 35960, 40030, 48996, 66677, 76774, 38749, 17350, 16305, 28774, 40776, 39019, 12091, 12701, 16656, -11759, -16351, -5574, -578, 11698, 12979, -6873, -22153, 13403, 18217, -7701, -4581, 28909, 14297, -970, -13405, 249, 29691, 35905, 52852, 26398, -4209, -29450, -20271, 1445, -22077, -24756, -25592, -43407, -50416, -41947, -28091, 18868, 38458, 52024, 53182, 34344, 47829, 36182, 16846, 8937, 6580, 3989, 14422, 31325, 44362, 52217, 38245, 37001, 50865]
17255E0865R741l731P11M947n094j808j3382j7154l6776k519M312M266J6452Q318
17241A9148n480j4474J6134k913k5681l044J4340L4680K3705L251o562j3546j9658
17228A9900L4422q055j4076o670L651J629o070J8139K2267n193J5740j2782m8096
17215A4806j2843m32J4919N277j4733j4066j0405N304p265P494L6524j531l1097
17202h048o490K3615p735j3649o609l70J2060M560k0457J9027K9089j8090l8598
17189c1695O122K790M0630J7538o788j0989M737k0151k8691K9151J9795K413N070
17176B9932K5917M240J1982M603j3529l2390p212k4761j6860N123J4694K90J0364
17163A2393k1192j1910j7546J889J5059Q774l548j970M467p822K0728R001J5782
$$ y = [50865, 60606, 56875, 57586, 62533, 57439, 55631, 42249, 25095, -11681, -14200, -9888, -5622, 10830, 19148, 13668, -806, 15328, 12415, -13266, -16310, -1970, 32710, 56415, 59666, 53104, 39558, 19900, 54322, 46267, 32191, 25521, 29172, 30801, 24731, 42870, 65137, 59944, 75684, 62902, 14806, 1963, 1531, 16450, 21727, 6994, -7072, -17477, -12173, -19438, -11944, 24580, 23049, -8048, -14538, 9077, 1342, -12307, -18916, -19286, -7226, -2666, -23123, -4096, 24993, 6903, -31695, -25573, -22783, 17847, 35385, 28597, 17608, 22345, 2194, -26497, 2654, 22449, 24862, 29932, 55849, 60089, 72071, 76674, 63145, 30755, 23543, -1218, -18078, -12955, 1739, 2029, 12393, -8799, -20709, -38255, -36366, -21307, -12533, -16081, -18051, -13584, -21406, -678, 8323, 24105]
17150B4105J2708L249k742m903k4970O345K1105j386J4361J3192p114M908l1390
17137B7468l8139l790K9367o010q140K1175J6013k99p821k2448P860N699r145
17124A1790n392J0826r873J136m428j0950J1250K0j0153J7672J9798J7066O950
17111E5712k3288j9860j4283O833J8443O611J8773Q897k5022r567J2077l773j2212
17098A9341o233k226k1376j83L9691K7385l4845k5137J8234j1113j1691n349k543
17085a6045Q769K959Q055K2375L2938O142j7916k0904J684j5333m687j0960j9645
17072b2568L925J965R578p552j2516L0693Q375j3053p546j1560L2524J4294j8771
17059G788o407K9335o147k4367L265q618L082J9737J4678J1322j9554j9129J0474
$$ y = [24105, 36813, 40062, 37320, 32417, 7447, 13792, 34897, 33511, 47872, 61064, 53950, 58858, 27468, -10671, -14461, 14906, 8896, 756, 21931, 37944, 37645, 29824, 7376, 15236, 20935, 11790, 6398, 17224, 7351, 8487, 4059, -6891, 4359, 4379, -5774, 11898, 31696, 48762, 55712, 32424, 12564, -1719, 5114, 23557, 30168, 48941, 57838, 32816, 23249, 35326, 31553, 19341, 13108, 10882, -10494, -10677, 29014, 56399, 21554, -3583, 14651, 3538, -8153, -13502, -16045, -7276, -4317, 3738, 26113, 59051, 65193, 47277, 26373, 28057, 12724, 8037, -2923, -22568, -18643, -16678, -7100, -14652, -27168, 3525, 11900, -1153, -8699, -20259, 12265, 26559, 7788, 1381, 30716, 24569, 202, 3467, -5151, -2069, 17668, 32346, 43668, 24114, 4985, 15459]
17046A5459l303O790M020Q76o990o906j6433J4716J5506J1755J3429J842L3064
17033H3825J8166m3802j0961J4748J7129k8202p919J2409r803j1815m17M840l3542
17020D656l5210K4713j186K5432M463j5253K8392M5437j3665m4745m613J7411
17008C5832L24m375L979j0016j785n472L805R710J696j9440O130J9653l871q629
16994B7541j5833m678j6961J559P74J1220qp645K1968J2292K3706k6621k0258
16981G056j1859L879k1020q668K3605N014K7002J956P392k5404l4030L461K8806
16968G190p124k7344j3060L993K1568j925k669J7291K507j0432L63R505L0644
16955C0507n84J3219k37j7980O07l8418K228K4934J0538K4011q188j9801k6836
$$ y = [15459, 12156, 18946, 22966, 23842, 16852, 9946, -6487, 8229, 23735, 35490, 48919, 50761, 83825, 101991, 58189, 47228, 61976, 79105, 50903, 42984, 55393, 45590, 33775, 33358, 38198, 4656, -30554, -5841, -7027, 18405, 22868, 7615, 36007, 81444, 67779, 23034, 18421, 35832, 36156, 31781, 35760, 25744, 23959, 18487, 22292, 32002, 33698, 14258, 20388, 40041, 36170, 27541, 11708, 7030, -9931, -8372, -7598, 3622, 3614, -4031, 17937, 30229, 53935, 27314, 7056, -4803, -924, -21944, -30612, -7007, -1993, 25009, 26965, 34357, 8953, -25077, -21616, 7190, 66, -27278, -40338, -36345, -14777, -16702, -19371, -2080, 427, -10005, -9642, -137, 30507, 29923, 43142, 42905, 24925, 25532, -12886, -10658, 14276, 24814, 48825, 40637, 20836, -6000]
16942f000k0108O061K3704K5165N437j9702k4382j9583J8505Q648N219N015K0605
16929B8584j2731j9579l32J9092J2208J4410q684l7505j9528M532M230P054l786
16916a2035j9558J0759K3639R876k1781k8000J7733K6329L042j959r1K8031l977
16903C2008J154K8916j6359k8573j0208j2516q139J8978K202J9754j3624m820
16891H773R948j1827j2282p660J5494j2569Q469L633o32M012J402p176j8516j4778
16877c3709J9985K7352j4617j212J5815K2216p999j4186O202N308j5586j120m14
16864H035k6990l0324N120J5166o994P738L3547M2890L141k9846M107K1819nj0516
16850C6888p881j2322L228L636k1298K851K7832J0699P669R390o223j0987n637
$$ y = [-6000, -26108, -20047, 3657, 28822, 34259, 14557, -9825, -29408, -10903, -2255, 2964, 7979, 28584, 15853, -3726, -4058, 15034, 27242, 41652, 32968, -4537, -24065, -19533, -15303, -8249, -12035, -31593, -20834, 2805, 12681, -9100, -37100, -19367, 6962, 10004, 8045, 7954, 35985, 32008, 33162, 62078, 45719, 17146, 6938, -5578, -13717, 5261, 7463, 27217, 13593, 8773, 18721, 6894, -5388, -13048, 2446, -10123, -1654, 1979, 1347, 5359, 6761, -415, -18931, -33709, -13724, 13628, -989, -2201, 13614, 35830, 27831, 13645, 19847, 25155, 9569, 8449, 8035, -18955, -49279, -44159, -28993, -35987, -28249, 5298, 48188, 51329, 21483, 25590, 47409, 47404, 36888, 29007, 16685, 19913, 23549, 2251, 5102, 32934, 43633, 51302, 60692, 54469, 43482, 37845]
16837C7845j0475k7146k1929j3362R337J1936J1633J4780j1194M502J7210J9895
16825D3032k6926k0541k7677j1656P145R477O087K8925L1749j1783q093j968j3631
16812D140j5829K3692j3582O497J7732k9760J3210Q718j3912j8526o84N85o801
16799b4520M732M5983P073P546j5508j5038m121j7413l3811m599r28P333K5591
16786a7680O692Q228k13P48N550J5233K7237k0790j5228K0132m229k0806l795
16773A079K8329R94o202j0409j2646l8612j4675K2808L7682l909q934K0942J2544
16760B8991J6138k7179l6926k865j5814L0448K7749J3693p684k9625r548J0344
16748b278L705j9063j5980o412N418J2559J6557J5265j3888K9407K5782j2679
$$ y = [37845, 27370, 224, -21705, -35067, -25730, -13794, -2161, 12619, 1425, 5927, 23137, 43032, 16106, -4435, -32112, -43768, -36623, -27146, -21059, 7866, 39615, 27832, 19739, 17771, 4140, -11689, 12003, -1579, 4918, 22650, -7110, 6100, 14818, 906, -17620, -18304, -17719, -24520, -19788, 26195, 33268, 40814, 25306, 10268, 6147, -11266, -45077, -49676, -50604, -43271, -17680, -10988, -2760, -2973, -2225, 3325, 18558, 45795, 25005, 9777, 29909, 25680, 4874, 1079, 29408, 30402, 24200, 13791, 1145, -37467, -52142, -29334, 8348, 4439, -4495, 16447, 28991, 45129, 17950, -18976, -21841, -37655, -7207, 20542, 34235, 26551, -3074, -12622, -2278, 1427, -17636, -33616, -40028, -34610, -22051, -5494, 9771, -4117, 25290, 51072, 38393]
16736C8393j109J1616k0265k9896n218k0005k0530J8568J2816J6560M0280j3419
16724B7791O767m944j4546o725k9387M4J1942M0421K2833l130l1885N228M5916
16711G0325j0843k9720J9081K994k0874k1131m378J456J3488j0326l7659K3820
16699c767M3898m963j6195l7089k6155k49L2126K8270J219j431p968M65M29L1157
16685C9747J534j7854L130k6948k4663j0201K0616l957j1569K8926j9992r860
16673c1091K1802J7277q021k1458l600L9274K3580L0268m729k560M545j4590j880
16660D8817K940j734n721j1541p157k9309K090J2933M189J9515J0911j1646k2352
16647A1935Q990j6475J6228L6922n272j0659J8672j8099l0095j0162l250J1521
$$ y = [38393, 37284, 48900, 28635, -1261, -6479, -26484, -47014, -28446, -15630, 930, 41210, 27791, 34558, 29614, 15068, 8343, -21044, -21000, -9058, 31363, 54196, 51066, 19181, 24409, 70325, 59482, 29762, 48843, 51837, 30963, 9832, 5454, 6910, 20398, 10072, -27587, -3767, 40131, 35168, 18973, -18116, -44271, -44520, -12394, 15876, 17095, 15664, 7696, 8161, 8590, 39747, 41281, 23427, 26557, -391, -25054, -35255, -14639, -18596, -30165, -1239, -21231, -31091, -9289, 7988, -33, -21491, -25091, 14183, 37763, 68031, 63302, 60742, 65287, 50697, 48817, 51757, 50023, 44302, 32761, 25604, -3705, -1615, 11318, 15507, 35022, 45933, 34287, 11935, 20925, 4450, 20678, 57600, 52328, 41669, 60341, 42242, 12147, 1985, -1265, 10256]
16635A0256L1974N514j7323j1666j2866M0614L0659J0887l0689k1381P062k5047
16623A7994j3099Q683j1454o430K5766J7106J8025J2845j6181j1232j9594P055
16611B9484J2708r494k4897j2025j6920K286n568K0382R901O388N932R030O405
16598C3612j7941N00Q389j2671K4706J8243j8229o904j6070p600O71J7723J0667
16585C5096P962j3207k1127l7655Q876J4368K8297K3648j3965k8350q891L7386
16573C2438J499Q533j2844k2786k3511q820J2280J7879k7071k2931J6894J8401
16561a0039j056n944J4134K823J0878k5068L55J6325J2637R329J0276K886j5786
16548B1750j1937k1304k617r618l833K840J2892o642L5799J5957q525J329J090
$$ y = [10256, 42230, 47744, 30421, 18755, 5889, 46503, 77162, 88049, 57360, 35979, 43041, 17994, 4895, 13578, 2124, -4306, 21460, 38566, 56591, 69436, 53255, 42023, 22429, 29484, 42192, 32698, 7801, -4224, -21144, -18858, -24426, -4044, 5857, 12245, 18177, 27207, 33612, 15671, 16171, 24560, 11889, 36595, 54838, 36609, 29705, 13635, 6035, 6706, 24429, 35096, 43058, 29851, 8724, -28931, -20055, -5687, 22610, 46258, 32293, 3943, -4948, 32438, 33937, 42470, 29626, 6840, -16671, -25491, -13211, 4668, -22403, -45334, -28440, -10039, -11095, -17039, -2905, -82, 10796, -14272, -13917, 2408, 15045, 24374, 34650, 37536, 21750, 9813, -11491, -14108, -23726, -27559, -24719, -11827, -18469, 17330, 33287, 24762, 26091, 27181]
16535B7181M192j0842k1036j3161l5186J5914K6008j9641k6730L770r423O130
16523e2824J9115L4426J8597k4605o800J4129l396k0539K8484J5763j7247j2443
16511g340J096P518j5699l323O250J3955J8348L910R026K3639q824o094k1099
16498B1363k3782J3244K3848j1537l3887j7380L4595r53o546K0614O718N650j0045
16485B1902m1923O775O161k537J1680J6760J2206J2588J6189J8221k2606o0332
16473d916j9756j509L9239J2352j7029j1354j4780J3606K8735n920m16J0403o328
16460B2327J7871L912j7425J5274J1637j7132j6738J3434k242j6577j0295n896
16448a850J2464K7672M125j4545j4152J4804K4612J1285K2404K34j6138j8129
$$ y = [27181, 31373, 20531, -505, -13666, -48852, -32938, -6930, -26571, -53301, -49531, -58954, -52824, -33709, 717, 19314, -5291, -12091, 2038, -1358, -21897, 6587, 22350, 5103, -7340, -6244, 1274, -14425, -17748, -11498, 2457, 20805, 24715, 33741, 57380, 48556, 42462, 21363, -2419, 10825, 34673, 23136, -10751, -28131, 6464, 5511, -1035, 19579, 26297, 31947, 21902, -20021, -13246, -7085, -9622, 2058, 18818, 31024, 43612, 59801, 78022, 55416, -4916, -24672, -26181, 13058, 25410, 8381, -2973, -17753, -4147, 24588, 18668, 18252, 28655, 22327, 40198, 44110, 26685, 41959, 53596, 36464, 19726, 33160, 30918, 14341, 4046, -1850, 10614, 38286, 42411, 27866, 13714, 28518, 53130, 64415, 86819, 87053, 70915, 52786]
16436E2786l2378J945j1498J5620j6098k8554K2927O776o398J355O106J5796L9640
16423F8025O651j9672n0430m653O557J1506j1412N965J3845q319O023K5966J4469
16410F4521J1279N670l101l786j4669j7229j079p96j8698j5679K3620J9929m963
16397D5019O031j1186J932j251J0328J6258N797l4348k9730K1885J5522p285O25
16384C9597j8857O077j9687o717R111N088o208q983k0449k0999K0003L4411N517
16371A7904p863k8240j6566p787J1270K5626j5398L633j2600J1094J3618l60J7803
16358A2134J4177m048j9921k5647k527J3856J7777L0541K4847L063m4930m646
16346A4676R28L170K0971J5532o610p738j9076J4354R476k7551k1756K3303J6391
$$ y = [52786, 20408, 22353, 10855, 26475, 10377, -18177, 4750, 11526, 5128, 6483, 12589, 28385, 68025, 74676, 55004, 4574, -79, 6478, 17984, 6572, 12537, 26382, 18063, 24086, 50052, 64521, 75800, 81470, 78369, 74583, 59914, 42685, 41606, 40810, 22112, 6433, 30053, 49982, 45019, 51050, 39864, 41796, 40545, 50873, 67131, 72928, 38580, 8850, 30735, 46257, 38972, 39597, 20740, 26817, 7130, 413, 9524, 14612, 8404, -579, -21028, -42027, -22024, 12387, 17904, 10041, -18199, -34765, -42552, -31282, -5656, -21054, -17421, -30021, -18927, -5309, -5669, 12134, 26311, 22263, 2342, -23305, -25832, -11976, 5801, 36342, 61189, 64252, 19322, 14676, 15604, 18774, 39745, 55277, 48667, 40929, 21853, 36207, 45683, 18132, -3624, 19679, 36070]
16333C6070J8024p999k0862j4997j436K2029K7015l1224j7354P301L4990K5937
16321G7494J615m0467j9263J1199p948K4541K3534j7870j1837j8762j2727N808
16309A5317P929R772j405k5655j1371j0489J9983L607P845m223j5478Q268K3584
16296B7684q412j1085K1632l026j0888K2808r629j5884j4997K6556M3777j6268
16284E2268l4110j2872k1460K5886K7310j4248m894k5973K7901K7774m648j474
16272D1460N25R90j5527l74M225p164k1621k5357J7439J299K127j2166j1298K464
16258b2978J8084J3681N189k3582q587K4162J0248Q852m1037j1783J5776K4233
16246A2258J2596K1665J2677k5670p281J6764L546p413J7042K289l3513n664r040
$$ y = [36070, 54094, 46095, 25233, 10236, 8800, 30829, 57844, 26620, 9266, 16567, 51557, 77494, 79109, 38642, 19379, 30578, 22630, 47171, 70705, 52835, 40998, 22236, 9509, 15317, 23246, 33018, 31613, 5958, -5413, -15902, 4081, 7688, 15533, 11310, -4168, 4100, 27684, 19272, 8187, 29819, 26793, 15905, 38713, 29084, 13200, -1797, 24759, 68536, 52268, 18158, 5286, -16174, 9712, 37022, 22774, 17880, -8093, 19808, 47582, 42934, 41460, 41985, 42975, 27448, 27074, 31299, 24135, 2514, -22843, -5404, -4105, -1978, -14144, -25442, -22978, -4894, 8787, 13976, -9606, -18193, 5969, 16217, 25069, -15968, -27751, -11975, 12258, 24854, 46519, 59196, 33526, 26245, 43009, 46555, 39142, 56184, 58473, 24960, 19296, 10256]
16233A0256O791m85N769k0566m616K1711J4822Q663k4100k1204K3420j9293l593
16220b425m470J1435R670n227J5904O0j8694k5068n590K6498K0613o249P862l2956
16206h637j9600K0421N14K673O386L371K0400J3709j9185k5907j2273j2372K0009
16193a0491k7492L964J5064Q976J1918K3953j301m4087R762M8473J0776j5441
16181C4074j2193j5300q139k576K288m890O018L193l134k232j0128k4815P984
16168b9850L6275J0195j4061j7746J8291Q903j4008P603l588O944j010k370j4338
16155h760J16M4878R129Q292r901j5536n446n136j2164K6698J8184j3553m174
16142C2627j7920j0547J4221K2840l4170j1141J9053m996P783k469P993J5617
$$ y = [10256, 17047, 16562, 22331, 1765, -2851, 18860, 33682, 42345, 18245, -2959, 20461, 1168, -2425, -6895, 4540, 14210, 8983, 24887, 24947, 6253, -18815, -24405, 2093, 22706, 16457, 24319, -8637, -28237, -7816, -7302, -4629, 1757, 5128, 25528, 39237, 20052, -5855, -18128, -30500, -10491, -37983, -34019, -18955, -9979, 1939, 25892, 24591, -19496, -9734, 38739, 49515, 34074, 21881, 6581, -1558, -4134, -1846, -6736, -718, 2475, -659, -2891, -13019, -37834, -29850, 6425, 16620, 2559, -15187, 3104, 12007, -2001, 5602, 2014, 8958, 7948, 5578, -8760, -8644, 36234, 45363, 53655, 43754, 28218, 22772, 17636, 5472, 32170, 50354, 36801, 32627, 14707, 4160, 18381, 41221, 7051, -4090, 14963, 9967, 17750, 15281, 23274, 38891]
16130C8891j4540J1494N668k7520k6553k2483j1717P527J1754j434J3779J7936
16118B802K728Q815J455K5675o171l729M18j2622O797j5561K2069J5389k0907
16105B7158l9197n364L406j1359K312Q138K717m361J660m147J9649J8449j0762
16092H299o190J5619p035j4964l748J0290j9251R042J2530p270J1685m444L313
16079G876r562J6568K2877j982l9766N133R979K0872K4813J4820j1680k127k1431
16066C6390n0397q189O415J4418l069K2364k537n198j6850k8310N153P026J7047
16053e737J9940O005L9510l736r957l6305J285J4843J789k0801j5289k0879j6275
16040d5607n401J7642L1995p227J6239k1917n731L5358J5102r692j730J4314M510
$$ y = [38891, 24351, 35845, 41513, 13993, -12560, -35043, -46760, -39233, -27479, -28913, -15134, 2802, 5530, 14345, 15800, 41475, 35304, 31575, 31993, 19371, 26168, 10607, 32676, 48065, 27158, -12039, -17403, -13997, -25356, -23044, -14906, -12189, -16550, -14890, -19037, 612, 19061, 8299, 2109, 17728, 10693, -4271, -8019, 2271, -16980, -7938, 4592, -2678, 9007, 4563, 7876, -1686, 14882, 37759, 35777, -3989, 1144, 11123, 31995, 56808, 71628, 59948, 57821, 36390, -14007, -22196, -15781, -1363, -4432, 17932, 15395, 10197, -6653, -34963, -29810, -22784, -5737, 14203, 20208, 59718, 55982, 46025, 9720, 11005, 25848, 27637, 6836, -8453, -29332, -45607, -51008, -33366, -1371, -8598, 7641, -14276, -20007, 15351, 30453, 20761, 19031, 33345, 37855]
16027C7855q500l1345L604K610L237r194q71K492m866L888j3008j8441R947J9650
16013b942j054L090J1806J5841o161l5493J6767o330l856P933P03j9707k1341
16000d0744j137K8325J3299k2728j9515J4328J5662p492J7071J2992n622L1076
15988C5515L4511o970k9203j8731J8884K8598K765k8202j1974k2959J0995L539
15976A6768j8247j3817J1159l01l0041J671j0418M214K0949K8553J9862L712R408
15963D3472j6123k4454L326l711p588Q520M1571L6595j2834j7744l2696k2616
15951d282p72k9829o43J1603J0283J07k823l566J9378Q425q487Q684J9n954K435
15936D578J9820K467P689J1098q756j5011L344k5847J231J3080j8701J4415j7862
$$ y = [37855, 29355, -1990, 1614, 4224, 7461, -1733, -2604, -112, -4978, -1090, -14098, -32539, -22592, -2942, -3996, -906, 10900, 26741, 20580, -14913, 1854, -4476, -8332, -399, 304, -19403, -40744, -41881, -13556, -257, -22985, -42500, -28172, -12510, -20002, -2931, 10061, 4439, 35515, 70026, 63056, 33853, 15122, 34006, 62604, 65369, 37167, 25193, 2234, 13229, 16768, -1479, -15296, -4137, -4438, -34479, -32808, -43226, -39012, -18063, 10490, 30352, 34064, 43472, 27349, 2895, 6221, 2510, -5078, 3442, 45013, 81608, 68774, 51030, 18334, -4282, -5054, -34883, -35526, -23923, -13640, -13533, -16356, -19922, -544, 7881, -606, 8078, 8097, 2143, 4578, 24398, 26865, 34554, 45652, 36896, 21885, 25229, -618, 613, 13693, -5008, 9407, -8455]
15923h455p807k0913J1276K3082J7851j6586j5194j2181K4250J3206k138j3410
15911g019j5868l3694L1678L2788m616Q327K6335J022k8291k1568j763J366O03
15898a0700r689L113k056J321J5161N172R881J51R726j7360j5777k697J2947l181
15884c988O772l3531j5364J1070J0183J5765Q055r691J0051N343o627j6551P179
15871a1334M839J2061J3228N667k5701p862L17k0278P808O057J0637J5102k0064
15858i523J3836J3972q403K741J3001J1557M115j0414k477j7341m149o745j6965
15845a6795j1818J8433K076q164j2566M3200k3671p478L4202J7945l0686r499
15833d821L4058K0471j8269j4961l4850J0207J9426J1765J766K309l5104Q204
$$ y = [-8455, -16262, -37175, -25899, -2817, 15034, -1552, -16746, -28927, -4677, 8529, 6391, -7019, -22887, -56581, -24903, 7885, 3269, 11596, 37931, 38953, 10662, -10906, -12669, -11303, -10700, -20389, -17276, -19332, -18011, -2850, 2322, 12203, 12354, 22080, 4720, -11057, -13754, -807, -3988, 2784, -30747, -46111, -35041, -24858, -9093, -1038, -10729, -678, 4665, -1962, -18513, -11334, -6495, 5566, 18794, 24461, -1240, -9102, -8785, -29063, -21255, -15198, -4561, 10541, -9523, 4313, 18285, 9882, 12623, 25624, 37181, 41296, 30882, 28405, 11064, 6915, 170, -16795, -28613, -10180, -8104, -16268, -28834, 14366, -9305, -16783, 17419, 35364, 4678, -4821, 29237, 49708, 31439, 16478, -18372, -8165, 11261, 23026, 24792, 27101, -8003, 201]
15821B01K0483j197J0585J1177q663l2311J0827j0428K12J2611q409J4037L1824
15808E0949L760j7153J0929L1906M48N450M207j6214k1208P415k3637l537J3753
15795D7068j6489o977p717j1907Q641L204O473p395k6426j2905M0948K0094l4654
15782A958J491k5635r519K9329M1176J9009j8788j1539J4813j2569j1501O770
15770B4995j4850l4504M650K2121J5670q116J0814L7125l65k0339q067K0971J3055
15757F3160r791N54J8763k0643m0358j2610L032k8900r349K5142R435J9577K3245
15744D1257Q36N390j7133j6684k3396L448J2737q591m000n685n122m361J5683
15731e621J2721k657J4558q028m764P948n7k9366J578J2772M511J3467q660l68
$$ y = [201, 20684, 19487, 30072, 41249, 32586, 275, 11102, 674, 886, 13497, 5088, 19125, 50949, 54709, 37556, 48485, 80391, 80839, 86289, 90496, 74282, 53074, 60489, 36852, 33315, 47068, 30579, 23602, 15885, 3978, 12619, 15823, 22296, 14901, -11525, -24430, 16518, 36612, 1958, 3449, -22186, -31705, -2376, 38800, 57809, 39021, 27482, 42295, 29726, 18225, 24995, 10145, -24359, -19709, 2412, 18082, 9966, 20780, 57905, 57540, 37201, 29134, 50105, 63160, 53369, 53923, 72686, 52043, 11685, -925, 2107, -26793, -36142, -11000, -1565, 18012, 41257, 42093, 47483, 30350, 13666, -9730, -6282, 6455, -2136, -6136, -11821, -16943, -21304, -5621, 7100, 4443, 19001, 10973, 6209, 14157, 14100, -15266, -13688, -916, 3595, 17062, 8402, 8034]
15717H034J9112J5670J1747J0802k2210j2328k789P830N637K1303J2677m0798
15705C4687l9933K729J5874K1013J6358q712j6949K277j9999j9463K387J2855
15693C124M1072j8221q979K4382K0218K321N397k5983K77m821j6256r276K9679
15680D2934k5599J587j958m0238k5794J0195J8139Q785M888o463M7612L4739j6723
15667E2104k825j0757k6138O928P525j1876m950n681Q089k003K33J1274K837j2356
15653A2404J346Q444l983k3756J330K7602k138q640j5102J0901J5490p580R065
15640B5383J2017L010J2838R341j9955j4511l0948l4278J4672K0370J9961K2452
15628D0352k5365j5444Q759J6055L89j2149M901j377j2280J3789m368n809k579
$$ y = [8034, 27146, 42816, 54563, 65365, 43155, 30827, 28038, 35868, 41505, 62808, 75485, 34687, -5246, -2517, 13357, 34370, 50728, 42016, 25067, 27344, 7345, -12118, -9731, 3124, 44196, 25975, 16996, 41378, 61596, 63917, 69314, 43331, 43608, 38787, 22531, 13255, 42934, 17335, 18922, 16964, -23274, -49068, -38873, -20734, -11949, -7061, -13524, 34088, 68827, 52104, 49279, 38522, 12384, 19312, 26837, 14961, 10011, 4330, 12419, 10416, 10649, 21923, 24760, 12404, 13750, 22194, 18211, -5545, -4215, 23387, 21249, 12609, -2493, 8408, 23898, 16318, 25383, 37400, 40410, 53248, 62589, 42634, 28123, -2825, -37103, -22431, -2061, 17900, 40352, 14987, -457, 8302, 24357, 24746, 12597, 17498, 16121, 3841, 17630, 13262, 7453, 4874]
15615D874L994n896K26q885k1504J2060R654r824O006J2092K0897J8423N603j1375
15601C6345j4713K317J237J0274J6078k6862l1031k1529O826K703K1100p053j456
15588e764j3175J5223n304M826K568K7587K710J6061o218j5617O43m009k2187
15575b656j9313o717O854J2988K9879K4095J7640L140l0583m6270n718J896j0136
15562b4901n813k1901j684L2960L6400j337L104j1547j6763J5648l1503K1188
15550f149Q028l070J0829J583k2329o055L972L653O425K2693Q314j5818k8674
15537a6598j9678j2421N053K2904j0973K5336R302J5165j6484n979O162J7581
15525A9370J0171j0770K0008q332j0168j8465o884J1955L0387O02J4952J1466
$$ y = [4874, 8868, 2972, 3198, -5687, -27191, -15131, -5477, -15301, -9295, 2797, 23694, 42117, 47720, 36345, 21632, 23949, 25186, 35460, 51538, 24676, -6355, -27884, -21058, -18355, 2745, -4308, -5764, -18939, -3716, -9020, -4194, -1626, 25961, 28671, 44732, 38514, 22897, 23540, 19531, -2656, -21969, -28686, -21832, -8844, 21035, 45130, 62770, 65910, 35327, -10943, -16661, -14765, -24901, -30714, -52615, -54299, -21339, 15061, 13724, 16828, 5281, -11482, 4166, -27337, -6149, 1879, -1191, 9638, 11221, -11108, -17163, -13191, -9538, -3113, 19580, 27894, 12076, -16598, -36276, -48697, -43644, -20740, -31713, -6377, 2925, 18090, 1606, -4373, 1789, 19370, 29541, 18771, 38779, 30447, 20279, 1814, -5070, 6885, 37272, 37874, 52826, 64292]
15513F4292m5854j9571j818P277j6820k8596p200M0835J6754J3012K2867l0632
15501A4546K402O320l996J0386L5473j7768k9779k0081k341L4912P475k1860k1077
15488e388R915J820K6707Q91q783Q832J4451L1737l0022l8875l346P263q908j0193
15474c899p833J1315K59j9559M241m647K8643P718l4612K452J1643M068j6466
15461a6677k0622j4935K5369j5964K0761P003j8639K5510J6703r159l217P18R508
15448F359J8684M525r135j5399k6301j8119L2493J2083m78K2631l28j3987k5462
15435a2434J1516O450j7797R312L1680l520r171J0607J0850O724m1229l440Q028
15422G576L941L408j9578j1814Q643M209J886r922l775K8771q394q906M6304L2953
$$ y = [64292, 18438, -1133, -2951, 4326, -12494, -41090, -48290, -7455, 9299, 22311, 45178, 14546, 16948, 23268, 19272, 29658, 65131, 47363, 17584, -2497, -4838, 30074, 37549, 15689, -5388, 4527, 6347, 33054, 33945, 25162, 33994, 48445, 80182, 50160, 11285, 7939, 15202, 6294, -3899, -11732, -417, -158, -19717, -15476, -20123, 8520, 16238, -18374, -15922, -4279, -211, -16677, -37299, -52234, -26865, -42829, -22068, -15065, -33704, -8194, 8509, -650, -3867, -3149, 6359, 25043, 29568, 20433, 5034, -21267, -39386, -6893, 5190, 4712, 27343, 27015, 13028, -12434, -918, 5532, -12265, -2953, 28727, 25207, 16036, 26643, 37493, 44217, 2988, -452, 7576, 11517, 14925, -4653, -16467, -7824, -3615, -1729, -11651, -15426, 13345, 4951, -3955, 42349, 75302]
15408G5302K419k020l3580j0374K9410J1342l9506l4618M952J2517K2552P83O828
15395D6007p943k4587J0961Q239J805q443P451J857K844l853m045J038j4134J7283
15381C4480K204n326N117o813j5063l2604j3787J3361m596r097m452J9546L8197
15368B1167J2729k9754l2038r023N3047L9396r742J6250p055m2221p788j2247
15356g279J796k0116p182N284r848K4356M916q966J0835j6J9198p175j6858k738
15342a3793k934j0827k682J811J1930J5796J3129J1112l515r734k1356J4521j8622
15329a5164j8462j8695r394M958K3784j050K4739O759k0836k2787l370L4289M2029
15316B6800m341j6935l0092K376J7277J6692k3609m0348L509J1576K6553K8028
$$ y = [75302, 77721, 75701, 42121, 31747, 61157, 72499, 32993, -1625, 3327, 15844, 38396, 39179, 46007, 38064, 13477, 24438, 32677, 34482, 26039, 33490, 35347, 38191, 34338, 30293, 31331, 17197, 34480, 36684, 31358, 36475, 29662, 14599, -18005, -31792, -18431, -23027, -32124, -36576, -17030, 21167, 33896, 4142, -27896, -36919, 16128, 55524, 45782, 62032, 54977, 12756, 4968, -7279, -5483, -25599, -32781, -27497, -37345, -12989, -8073, -17039, -6204, -6220, 12978, 5803, -11055, -13793, -16727, -27554, -30236, -28425, -16495, -699, 12430, 23542, 20027, 10293, -11063, 3458, -15164, -33626, -52321, -61715, -56757, -32973, -34023, -9284, -2525, -23361, -46148, -49518, -15229, 26800, 22459, 5524, -24568, -22192, -4915, 11777, -11832, -52180, -48671, -37095, -10542, 17486]
15304A7486j1042j8983R116N344P102K209k9690q509N224k683K658K4070J493
15291C795J3309j4580J3359J5393m701m815n016L443K2631l175k7166k2367O181
15278c709J8126Q201J9300J5449P308L656J261J3163j5183M977p877Q31k3904
15265D1599l0989n801J4473k4537m2042K72n785j184j4344j0240J5076L0347J5441
15252a7714K295p745m16K3201m158R424K6973k4481j1868O164j1347k9786M485
15239c4973j513j392L2291k783k7894k8199k300j4290K5426M4621K4722j4452
15227g36k6035k616J2076N439N811J0439m42J286L928j6317o341m851L373K9529
15213A4543j4200R287o685K419k6721k1350L441k45K5416L96O494J4439k637j3490
$$ y = [17486, 6444, -12539, -3423, 1921, 9023, 11232, -18458, -26967, -21743, -24426, -21768, 2302, 3795, 17104, 2524, 15883, 31276, 26575, 21760, 16744, 20187, 42818, 39643, 12477, -9890, -3709, 14417, 22618, 41918, 57367, 64675, 68331, 69592, 82755, 67572, 72549, 64672, 65503, 41599, 10610, 4809, 19282, -5255, -47297, -47025, -52810, -53994, -68338, -78578, -63502, -33155, -17714, -15419, -23164, -23580, -379, -4537, 4887, 31860, 7379, -4489, 1675, -9672, -39458, -34973, -36486, -37878, -5587, -8370, -36264, -64463, -66763, -81053, -55627, -11006, 13716, -736, -26771, -29387, -17311, -11872, -6061, 4378, 3936, 5222, 9150, -7167, -13508, -18359, -14986, 14543, 343, 9630, 2945, 5364, -21357, -42707, -39266, -39511, -14095, -13699, -7205, 7234, 4597, -8893]
15199h893j0701k917K1113j2264J5797L0256p261q154p977n799L397m640k6525
15186b4568R339K2221j453O876j1454l3214R736P294l413K2251L1285o272k0537
15173H091j6727j5948K099l1360Q579p425R616K4869J1124J6225O998k816J2136
15160B5461k6530k1518J68L5958L1832J6135l5517k3075J583J8850k9956J6157
15148I548J3362J1190J614l5961k2012L2687R919j9902k752R999q829o051K615
15135d573J0714j1548J833j025k264J761J2054K754J3325k293p995M906P751j4195
15121A1205J1215J3052J7207q930k7976l9862j7400M748N5547K6464k211J271
15109D4330K635j89j7926k4524m770k808J8839m617j0413n807j6153j1545J081
$$ y = [-8893, -19594, -22511, -1398, -13662, 2135, 32391, 25130, 16976, 8999, 3200, 6597, 1957, -24568, -15229, 6992, 5539, 12415, 961, -32253, -22517, -15223, -18636, 3615, 34900, 28628, 8091, -8636, -24584, -22485, -53845, -45266, -52691, -43075, -18206, -7082, 9143, 16141, 13325, 25461, -1069, -22587, -22419, 13539, 45371, 61506, 25989, 2914, 4497, 23347, -6609, 9548, 22910, 34100, 35714, -247, -22259, 10428, 20347, 445, -2307, 7692, -1137, -7188, -4573, 6141, -5407, -3574, -4599, -6863, -5102, 6952, 9706, 23031, 20738, 12743, 17649, 25400, 11205, 22420, 35472, 52679, 43749, 15773, -24089, -41489, -36741, 18806, 45270, 43059, 44330, 46965, 46776, 28850, 4326, -444, -3252, 15587, 10970, 557, -5250, -21403, -32948, -31867]
15096c1867Q213N595j4043J7525L7873J2579L738j2399k0215O200J4347L162M061
15083C4769n751j2281n182K3818K748j9158l1109J9038L2508r87k7781j5532j5709
15070b0609O688J1845m049k9286J9698J5106j0223L66J2344P644M318j7214R929
15057F557Q710j1035J7803P411k3765l190J5638J8714J388j7328j4413N055k4334
15044a2789p785n395l326J654J1352J0849O716O739l6021M528K4760L6473o620
15031C1135l3171J5432K5274j2286N099J8461K04l9203j5747k460L153k8606j1504
15018d4219P979L0955J5960P395L635M720o575j0195O194j0387O688J0839J0769
15005C3758o690l5897J4358J9768j4734K6231J187p838Q731j0011j5236j3485
$$ y = [-31867, -23654, -18059, -32102, -14577, 23296, 35875, 39613, 27214, 6999, 13199, 27546, 30708, 34769, 29018, 16737, 11555, 35373, 38121, 18963, -12146, 6892, 39400, 38413, 10632, -4900, -20609, -13921, -2076, -6125, -35411, -15713, -607, -10830, -10464, 1880, 9524, 13842, -3372, 6557, 15267, 4232, 22035, 29446, 5681, 2491, 18129, 36843, 38231, 20903, 6490, 11545, -12789, -20574, -25969, -29295, -27641, -16289, -5440, 1276, 8015, -28006, -23478, 1282, 37755, 31135, -2036, 13396, 38670, 26384, 31483, 49944, 50148, 10945, -4802, -7262, -4109, -32715, -44219, -36240, -5285, 10675, 18070, 21705, 26425, 19850, 9655, 15849, 5462, 12150, 22989, 33758, 27068, -8829, 5529, 25297, 10563, 36794, 37981, 30143, 38874, 28863, 13627, 142]
14993A42k3238K7162K7558K1090m363k0101L938k1014m234l5J0314j1415M946
14980A0750Q840J908j4765J0214J53K561m308l9067l8963K3120J7129J083m033
14967b5378L84J8729J3067k9797k3826k1704L1497J5345n500J8094K0683N729
14955A7323j4281q866M547j5460K1113K9973k4507k7658k1911L8848M1117j3554
14943B6684n0351J5037J2163k4969J6908J7624N309k363o48R11k6029j2908O462
14930a6170Q871K88K7861K2746r564m195m3500r695K0666j4344m2886J5035L5924
14917h963K2707r83k0426r669j4374m393J7848n836p7J5496j9431k1954P350N647
14903c7058j1630M838L5548M2372K789J6448k1562m7505L612K3470J3220R800
$$ y = [142, -23096, 4066, 31624, 52714, 48351, 28250, 32188, 11174, 6940, 6905, 17219, 5804, 10750, 19590, 21498, 6733, 16947, 17100, 19661, 15353, -23714, -62677, -39557, -22428, -21345, -25378, -24994, -6265, 6802, -22995, -46821, -68525, -37028, -21683, -27183, -9089, 11594, 17323, 3042, -5824, -1277, -16737, 4376, 34349, 9842, -17816, -39727, -879, 40238, 26684, -23667, -8630, 3533, -21436, -4528, 13096, 18405, 16042, 15394, 16305, -9724, -22632, -16170, -7299, -7011, 20850, 43596, 34032, 29837, -13663, -23358, -2692, -17036, -59922, -44887, -8963, 13744, 12761, -7665, -17334, -31708, -36101, -18253, -24089, -24166, -8670, -28101, -50055, -42705, -37058, -48688, -43850, -8302, 34070, 36859, 53307, 31745, -15760, -12148, 11322, 24542, 34342]
14891C4342q542l546L037J0873l7340j7060J2622j93m738k0891m704J5697Q539
14878a1904l5796k2196J7321K8178M1131j8835m9550j3311n679J0247L9738J4160
14866f496o065L1360q957j7020q10K0164K3842M276m9040j5630J6238L546j4492
14853a9084J9135L4104j3137k2582q783K785j6519j7943L0953J5118k5638l3031
14841e4622J6357J583J2044J6298Q5N52j2922k5718K166L294J3158j508o438K4992
14827a0679L1495L270k9805j9984J6863K785N273p488J0812J9827p926o082J2461
14814B0822j8496j0817l591J314j9482K4802K7684m7168n5207k870L0122J0589
14802d2298P449L1000k84j9746j4776k7295K1368M2735j4199j6039O826J5366
$$ y = [34342, 25800, 22254, 25291, 36164, -1176, -18236, -5614, -5807, -10545, -31436, -36140, -20443, -11904, -47700, -69896, -52575, -24397, 16734, -2101, -51651, -64962, -70641, -60394, -20656, -6496, -12561, 18799, 9842, -7178, -7988, 12176, 36018, 40294, -8746, -24376, -8138, -4592, -19084, 51, 34155, 21018, -1564, -10347, -7562, -24081, -42024, -11071, 4047, -21591, -54622, -38265, -36682, -24638, -8340, -8255, -7703, -20625, -46343, -44177, -40883, -27725, -29233, -35671, -10679, 20816, 24086, -5719, -25703, -8840, -6055, -782, -8270, 2542, 22369, 14443, 8361, 20822, 2326, -8491, -12082, -10768, -30250, -5448, 22236, -24932, -80139, -83009, -52887, -42298, -34849, -3849, -4133, -23879, -38655, -65950, -44582, -1847, -16046, -32085, -25259, -9893]
14790i893o999J0717K8382K555l7400j4592P998O394j5614j7076r979P297K4281
14777b3929N766j0967j8140r04K7543J1054r199k1683L410N607O549o420j3508
14764d4821k4308K8818L8526K0582J0902k9831j9630j9097J5080k3641q656K3889
14752c2187L827J0901K134k2020k099L198J413K6916O185O90K0402p944n923j4377
14738h884K933J9471n356J5933k5120k7706q570M584K2499L6934J5413N669j9341
14725B8459k1323k0394J5493K7961k2939k4905J9989Q953O529J2852R219J318
14713D1212J4244k6203o778M351j0523j9462P449k810j1986r403J5802l771l435
14700a1313m739J2186K3271J6523o88o952j3143j9559l313L3023k6364j1833q716
$$ y = [-9893, -16892, -6175, 22207, 24762, -12638, -27230, -19232, -12838, -28452, -45528, -55507, -48210, -23929, -18163, -29130, -47270, -48174, -20631, -9577, -18776, -40459, -37049, -31442, -24893, -31313, -44821, -69129, -40311, -1785, 18797, 29699, -132, -19762, -38859, -23779, -47420, -56076, -32187, -28360, -17459, -15325, -37345, -39444, -36246, -34833, -7917, -1732, -1042, 19360, 11416, 5493, -8884, -5951, 13520, 8164, 24097, -1023, -28729, -37299, -32715, -10216, 26718, 42131, 47800, 28459, 7136, -13258, 2235, 30196, 7257, -17648, 2341, 11294, 17823, 30675, 39894, 41212, 55456, 29253, 22475, 26826, 16303, -3159, 4290, 1480, -10506, -19909, -4107, -7878, -11313, -16052, -3866, 19405, 35928, 35240, 28288, 15145, -4414, -7727, 25296, -1068, -12901, -21617]
14687b1617J2085n560m755k8571o63L7167j0739j9301p804n026K2251J00L6479
14674D046Q501m272J1552P841J0872P393j9147k089l0857K35j677k489l480k3901
14660c7472J7467L7076r644k66J192k990k390L7426k702l2471M445J6298n91K373
14646B7751L54l0270k3519J0542j7080Q975L6112J8600P870m296k409O879m005
14633C5504O289K557p109p533r755k8059L0128M323j4776M239k2265Q627j1696
14620i526J219N486k2578j5548J3541K7441J0991o386J1171n010l4318J2682L3526
14607B2691N300k1733J420J996q340K78K1805k194k6367k4419r044K1021M210
14594a3376K517k292L142n093l6013n535L8029J3832J8434L4419M839m5232m1011
$$ y = [-21617, -9532, -15092, -19847, -48418, -49081, -11914, -22653, -41954, -49758, -54784, -32533, -32433, 4046, 12547, 8275, 19827, 27668, 38540, 45933, 26786, 24697, -6160, -5925, -7602, -10091, -13571, -37472, -20005, 17071, 7427, 7161, 8353, 5363, 2973, 40399, 37697, 5226, 9671, 25969, 25378, 27751, 28105, -2165, -25684, -15142, -32222, -23247, 12865, 31465, 39335, 35039, 32630, 39509, 35504, 41793, 44350, 37241, 29708, 19953, -8106, 22022, 26345, 11569, 15808, -6457, 2170, -9526, -8307, -2821, -25399, -40947, -27406, 35, 11026, 4640, 15811, 10801, -23517, -10835, 22691, 27991, 6258, 7678, 9674, 1334, 1612, 23417, 21223, -5144, -29563, -38607, -17586, -13376, -10859, -13151, -10009, -15102, -51115, -56650, -18621, -4789, 13645, 48064, 52903, 7671, -33340]
14581c3340l0216L159M0392N6392J0862l1973k1432k1644P593L7502k1261m0954
14569d4920J0423M6983L6856N949M597j1834M778l638m3072j7074j7446J1663
14557a6735M315K8852L5055J561k7404l6740J0603l696j2321j1049J831j099K5153
14544a674J5998O44q263k2635j280P604J7863m65k0717j4105J2571J3021O05r267
14530a0100N798N737j4033J2302L0409P224j1797j7301j9438n286k6561J0738
14518c2308K6717L1762K3584j2888l9094l5143K1517R639J7101k1008J0754L4445
14506C5078J1622j3959k2122l304j5655j9477n337O541K4497L4243J7233j8122
14494C1238m5551j2482J1689J6096k5029j9486L0867J5376K915m659k807l3714
$$ y = [-33340, -63556, -60397, -20005, 36387, 47249, 15276, -6156, -27800, -20207, 17295, -3966, -44920, -34497, 12486, 49342, 55291, 59888, 48054, 52832, 49194, 6122, -10952, -28398, -16735, -12420, 16432, 51487, 53048, 25644, -11096, -493, -4189, -16510, -27559, -25728, -26827, -1674, 14324, 14968, 6705, -15930, -17210, -9606, 8257, 7792, -12925, -27030, -14459, -1438, -833, -10100, -4302, 1435, -12598, -296, 30113, 37337, 25540, 8239, -11199, -16485, -43046, -32308, -5591, 26171, 49755, 36867, -2227, -37370, -15853, -6214, 10887, -10121, 633, 35078, 46700, 32741, 10619, 7315, -8340, -27817, -33154, -26613, -2116, 32127, 49360, 31238, -14313, -26795, -15106, 990, -24039, -43525, -12658, 2718, 5633, 974, -1833, -35547]
14482c5547M0235K3402M695Q499P138j5596o154L89O471k0012J5369k3176m575
14469A138m607j7652J2728K1146n852k8463l410R29r658L1279o700j3524M696
14456a7950K6921L1485M330j1709n58j6609J933J207O94j8301j3790k1102Q069
14443b5380K7377J6606k3599J2587q57j2912J1441j4472P865J3887j9398j8511
14431b5366Q699J410j1869J8221K2909J7684J3552r351l1459o459j3136j217J2495
14418c887K4524k6591P098Q010J2485j097L738Q96J0544L637j2219j916p740j6146
14404A336o374J6429O097k5336j1445j4004K0376K6254O82j7452k2351J3722P460
14391d606j6977R465K9143J6146J3099Q538J145j7534q608j1011n455m087J150
$$ y = [-35547, 4688, 28090, 32785, 41284, 48422, 32826, 26672, 27061, 33532, 13520, 28889, 5713, 1138, -3469, -21121, -8393, 12753, 6901, -21562, -24972, -24043, -33701, -2422, -9122, -22646, -17950, 8971, 40456, 44786, 33077, 32519, 15910, 17843, 19050, 19744, 1443, -12347, -33449, -25380, 1997, 18603, -4996, 7591, 6734, -6178, 5263, -9209, -1344, 12543, -6855, -25366, -16667, -15257, -27126, -8905, 14004, 31688, 45240, 35889, 4430, -2029, -15165, -16382, -3887, 20637, -5954, 1144, 9154, 21639, 20542, 24280, 25176, 35720, 39357, 27138, 25222, 17482, 1336, -5038, 11391, 17488, -7848, -19293, -33297, -12921, 13333, 14015, -3437, -25788, -12066, -4606, -21583, -12118, 17025, 33171, 46270, 54808, 55953, 38419, 29811, 18800, 13345, 9258, 10408]
14378A0408J7085O721k6505R12L812m886J4369J3015j3859k0864R062R12k2560
14365a2378q362J176M42p752k691L3119J6827Q97j70J9569k326p560k906J8053
14351D5938k0785o140J4538J599j5145p36n927K997j3058k0115K481p576J0298
14338a1631J667N545K0654K027j416L244J8572j1017l1330j4540L2056R949j2610
14325A1170L845J4328K069l0583j2936j9715K0852J4008j3634J0476M4117L251
14313D7248K930j3138l6169j6527j8360r953L3169L9818P089l8058k6612K0229
14301h334J3939q099k2313j6774k0158J2904L2398J7696M920K5890J7342M57K905
14288E2773k3554k5351k1371k769L178j5840n535K497O18J652J2475K3725O476
$$ y = [10408, 27493, 34214, 7709, 8621, 12433, 7547, 21916, 34931, 21072, 208, 9270, 10182, -12378, -20740, -19564, -19122, -26874, -29565, 3554, 20381, 21278, 21108, 40677, 38351, 30791, 27885, 45938, 25153, 19013, 33551, 35150, 20005, 19269, 13342, 16339, 3281, -16834, -14353, -21929, -11631, -9964, -4419, 16235, 18262, 16846, 20090, 38662, 27645, -3685, -18225, 13831, 23780, 11170, 15015, 29343, 31412, 829, -12107, -31822, -10970, 3038, -10596, -120, 43997, 47248, 50178, 37040, 871, -15656, -34016, -43969, -10800, 29018, 36107, -1951, -28563, -8334, 5605, -2494, -24807, -41581, -61739, -48835, -16437, 1259, 6179, 32069, 49411, 49868, 52773, 29219, 3868, -17503, -20272, -17094, -32934, -38469, -35972, -35354, -33702, -21227, 2498, 8974]
14275H974j4820J3952J1980J1949j021j7229m4639j9829j4880L325J7818K703
14263d1717r313K112J1084L0372J6171j614N516K823J1236J413j8270j904N479
14250A3388j9303o570n853K566K4271j472p440k1014M068O298P950J687O391j157
14236C810q48r66K203r692M0968M812j9413J4155k882k8620r617J9885j1872l288
14222a365k7508m732M656P355o069J3787J2178k298r289j2037J5804k7025P048
14209b9495J7990j2729k540m653Q692J8072K0359k5017r722n888J8751J5728m962
14196D586k0739J9996r121N809Q316k2887j9691L1425K5556k7493K541K269j2540
14183a1973J1914K6258n138J6062n255k4387l8729l779L691K4209K6984K2874
$$ y = [8974, -5846, 8106, 20086, 32035, 31014, 13785, -30854, -50683, -65563, -62238, -44420, -41717, -51030, -48918, -37834, -7462, 8709, 7095, 12611, 15434, 26670, 28083, 9813, 7909, 13388, -5915, -12485, -18338, -15772, 8499, 7027, -413, -21427, -17359, -11061, -3111, -1424, 4967, 3810, 2962, 1996, 4199, -5493, 35475, 40287, 20874, 35029, 32147, 3527, -6090, 13795, 1923, -1365, -28873, -33605, -28949, -21594, -27663, -13876, -1698, -3996, -13285, -25322, -9518, -36543, -29495, -11505, -24234, -26774, -31427, -22735, -4663, 15696, -9321, -19043, -24931, -6180, 9548, 4586, -16153, 3843, -5278, 531, 8847, -14040, -33731, -2306, 23250, -4243, -1702, 567, -11973, -59, 26199, 21061, 37123, 31868, 7481, -31248, -35027, -31336, -7127, 19857, 42731]
14171D2731L230q886k1256j0315o688j4875p408J8999Q611l365p905J1351M41
14158D665j5734j8169N716N388K3333K2845J349m892K528K1271j9484j0970m763
14145A3083l224j9689j9321L511k472r539J5442j1687m861k1263JQ051O591J6065
14131b9312P75k230r843l381R976J5914J5500O484r896n041j7387j2150K0826
14118a9765n129N819J4680j2464k4666k4267Q060n532J8074J1799M961J128J204
14105b6098J2421r1o099L556k8940k3909J1565L6577J1909r856m411j1987M516
14092c0847j4901m008Q82L514J9779j3546o51K5030k737J8151L779k0783j9448
14079c5786J035K5989K0169J0034k7417M338K3689k434l630M288N923n156l860
$$ y = [42731, 45961, 37075, 15819, 5504, -1184, -16059, -23467, -4468, 4143, 778, -7127, 4224, 4665, -11069, -29238, -23522, -18134, 5199, 28044, 29393, 24501, 27029, 48300, 28816, 17846, 13083, 9859, -9830, -29151, -25640, -28112, -37651, -22209, -33896, -38757, -60020, -60019, -51968, -45377, -29312, -28537, -30767, -40610, -43991, -34015, -18101, -2601, 3883, -6013, -11054, -28441, -40591, -19765, -24894, -19075, -4395, -16859, -41525, -65792, -57732, -63264, -45190, -33391, -28430, -27302, -26098, -13677, -13768, -19867, -16311, -45251, -69160, -57595, -21018, -9109, -18965, -23376, -35363, -30847, -45748, -49756, -48874, -45360, -25581, -39127, -39778, -14748, -17485, 666, 4445, -16338, -35786, -34751, -8762, 11407, 21441, -5976, -1638, 22051, 19617, 15987, 20275, 26198, 21042, 17182]
14066A7182j4048n645J180R303P604j3738L258R491j1262j0836k4455l983j6270
14053e2219J3743R956L1676K4031j8876l208Q491j5344J7776o726m215K4433J6584
14040D6102J1421l6153k2951j0970j515R640N950j2871j0791K168J0088J9947
14028A0065r808k3158K480j4370L959Q485K3125j1055O362K3916R911J1991j5080
14015B6823l5382q127L540J1296N284j1722j5337j2384J9132J9179j402r706k7704
14002c6510Q558k260o554K9519J413K6634J9325K4869J398l1658r084K032j2189
13989A5493j060r18J062R633l041j7648m0722n38N6806Q30k2040N55J0203j2378
13975c763p989J1412Q269J5632J1927m603k9337j5041Q37j5080K1803J479K791
$$ y = [17182, 3134, -2511, -1331, 7972, 15576, 1838, 5096, 14587, 3325, -7511, -31966, -35949, -52219, -38476, -28520, 3156, 27187, 8311, 5103, 13594, -1750, 16026, 9300, 5085, 29518, 46102, 57523, 21370, -1581, -12551, -14066, -4426, 1524, -11347, -22138, -19970, -9882, 10065, 257, -22901, -20421, -34791, -30832, -22347, 778, -10277, -3915, 20001, 29912, 41903, 26823, -8559, -16686, -13146, -1850, 3434, -8288, -23625, -36009, -16877, 2302, 900, -8806, -36510, -27952, -30212, -36766, -7247, -5834, 20800, 40125, 64994, 66392, 34734, 25650, 27682, 15493, 14433, 13515, 14577, 24210, 21169, 3521, -37201, -37739, 19067, 19897, -2143, -1588, 8615, -3763, -11752, -340, 7929, 23561, 35488, 30885, 1548, -13493, -12656, -27736, -5933, -4454, -1663]
13962a663n133j0115K1211O046k9086K8867J3180J6249J3173M532l8191j2323
13950F747K0976j1061j8290k5020j876k134k3637j2508J1261J0788M0045M438
13938b71p486L801K3897j148l352J7696j2048k1844M836K337r310j8070n630J6621
13924i971J5007k542l841K0323K1476K3130k744P529m257j5598q829j0636Q93
13911B9940j6954n334q893N484J5388J7055n273N788K6873n2972l2147j0243n464
13898c6752J2918K2892J326l7649M577K5236L8918J2076k176k5392j7691k1463
13886b3180Q325K1072N124j3108K0848O921k5883k4439j292J4032k633K69J6727
13873B783o204r985j5807Q43O008j465q747j0835K4164J5591k4374L7256j4121
$$ y = [-1663, -6796, -16911, 4300, 10346, -18740, 10127, 23307, 39556, 52729, 57261, 19070, 6747, 27723, 16662, -1628, -26648, -28524, -30658, -54295, -66803, -55542, -44754, -4709, -271, -7757, -3956, 19941, 18793, 15441, 33137, 21089, -755, 4081, 6418, -2892, -20962, -26592, -9971, 5036, 2494, -1347, 18976, 40452, 63582, 60838, 68367, 64110, 48512, 39683, 29047, 29940, 12986, 7652, -1241, 4243, 19631, 36686, 31413, 37201, 64074, 11102, -21045, -31288, -36752, -23834, -942, 384, -37265, -32688, -7452, 31466, 43542, 41366, 15974, -1717, -23180, -14855, 6217, 11341, -1767, 19081, 26002, 119, -24320, -25612, -11580, -14213, -13944, 2783, -3421, -13406, -29213, -28370, -22362, -23827, -32574, -43409, -19245, -3654, -28028, 9228, -4893]
13860d893j9101J7167o729q198J2028J1569R702k55k609n133n994k1109j3814
13847c7369m347R72j0510K6757J0518O928P197K4207K2190j9564m1786k4705K9320
13834a0192N487M696J0210L726K5436Q55k3034p801j2812j3721J2274J5940j3418
13821b354j0100J3515N694j1436k6667r474J0430K3638L403P425K2578j4958l0657
13808a8963k891J6320J6997k5505j9916m061K2411O957K1269K4018j5582M578
13796B5632j0390l6283j3861O872Q364J270J2288J450n063q743N558J2673j8645
13783a8878r207O194k859j1238k7182K3322J6089J0776L1525J6124K761j555J3883
13770D9755M71q250J1788k5776m1483J9150P368N909P916j0838K5036r051l5277
$$ y = [-4893, -23994, -6827, -13556, -21754, -9726, 1843, 11545, 11290, 8681, 3548, -2446, -23555, -37369, -41716, -40744, -51254, -24497, -13979, -7051, 146, 24353, 46543, 26979, -14807, -39512, -10192, -4705, -9, 10201, 13927, 39363, 40218, 17184, 9383, -3429, -17150, -4876, 11064, -2354, -12454, 1061, 6755, -4681, -31348, -40822, -30392, -6754, -3351, 4074, 26652, 11694, -18963, -21854, -5534, 11463, -14042, -33958, -38019, -15608, -8651, 12618, 36636, 21054, 25632, 15242, -21041, -34902, -28030, -19666, -18396, -6108, -4658, -9721, -18464, -12906, -233, -18878, -28085, -21891, -24750, -35988, -63170, -39848, -23759, -12983, 18542, 34666, 37427, 35872, 49755, 50226, 41976, 53764, 27988, -13495, 5655, 13023, 18932, 26848, 16010, 41046, 31995, -3282]
13757c282k1696k4531m152K4479K3379J7295n41k3766R902K6689l474j3895N925
13744A2332l0016Q300L6711K3699j5414K64m146m9071j5071j1141L1021J8827
13732F295J2880Q759j8229j658n462j1024j59Q059J2125k5536j3204J2872j7599
13719c1881l1847j8139N304K0988J0336R597p193r653J6733j1633j4715q472K8138
13706d2437J3766j3268J4374J4285m850J4297O327J2969l306J1317j9371j1733
13694g630O381q198N839k7111q071J0081J0764L238J1098M585R185K020M928R200
13680B6309K1305j1465j1274K3168J8223j1030r406k1490k2942k3527j482J0884
13668a2727o970O934K6831M182k7420j5402j8462K0982O039J2776J0619k1615
$$ y = [-3282, -24978, -49509, -53661, -29182, -5803, 11492, 10951, -12815, -2913, 23776, 20302, 6407, 12332, -17684, -9384, 27327, 51026, 35612, 35876, 31730, -17341, -32412, -43553, -12532, 6295, 19175, 27934, 9705, 8047, 2585, -8439, -8598, -539, 11586, -13950, -27154, -14282, -31881, -63728, -81867, -76563, -55575, -45239, -35642, -42835, -52488, -35755, -47388, -62103, -70575, -42437, -28671, -41939, -27565, -13280, -18130, -3833, 2494, 15463, 12157, 23474, 4103, -7630, -1249, -9447, -3608, -30719, -38790, -28709, -17945, -14707, -3609, 976, 10161, 12181, 17109, 26309, 47614, 36149, 24875, 48043, 66266, 55236, 45830, 24340, 1398, -22129, -23611, -12727, -19697, -12763, 14068, 18250, -9170, -24572, -43034, -22052, -16013, -3237, 7382, -14233]
13656a4233j390j5881n237J5884J2836J5649J1745j7857k3252p47N632l180j4618
13643c4649J7183K0907J4248j9267M915J1070M391k9732L600K6551k1297P929
13631E849J4023k1579m4409J4463J9996j9362o670K5862l265P469J817k7736o409
13618c9951L187j5821O79k3745J2423L2000n63K155O291R595j0730j2711k5542
13605f2733P692K8796L872J829R492j0785K2526k7953L494L2816k0466j6477J5735
13592a2162J7948L0026k7997k4881j2445j1824P176K6708R439K855J1427j1365
13580D905K4879j038j3805k9270o696N818o556J5081J2769k1846Q028J4003N508
13567A1780j891L58J080l396k922k7454j7131K9012P795N465j4905J2647J5469
$$ y = [-14233, -15623, -31504, -36741, -20857, -8021, 7628, 19373, 1516, -21736, -22483, -16851, -20031, -34649, -17466, 3441, 17689, -1578, 3337, 14407, 18798, -10934, -7334, 19217, -2080, 5849, 19872, -1707, -46116, -31653, -11657, -31019, -37689, -11827, -15092, -7623, -5806, -33542, -39951, -36764, -52585, -51906, -75651, -63228, -31228, -31791, -29636, -23345, -13750, -24480, -37191, -62733, -55041, -26245, -22373, -20544, -11052, -21837, 689, -27264, -23770, 9046, -11420, -27897, -12162, 5786, 35812, 7815, -17066, -29511, -41335, -34159, -7451, 1988, 4843, 16270, 4905, 29784, 28746, 14941, -14329, -21025, -15207, -21763, -6682, 6087, -15759, -7731, 6272, 11780, 9889, 10247, 11327, 7931, 5009, -22445, -39576, -10564, -2769, 2696, -12209, 438, 15907]
13554A5907J8122j3159k7496k3806J3070J1959j2269M580o778j0204L1665J8603
13542B0194j4655l1040l5288K5051K2312q019j1642k658j6880l466M3526J0056
13530b509j5944r183J5348J4591o41j3134O51L0596J5094n255P848k9154p664
13517F44r278P521K5507j5006m6348k6739L9147J5152K799J5269P584n764l70
13504A0118q277j6272o021J7809K9891P918j8689l1404K662J0477L086j5720n321
13491a9743L27J6241K4129q72l9545j6707j5492J6568L841M324M334o526j2633
13478d1754L898k61J7664J5018j7715o110M1379L1003m415k6269l7220k3661R198
13465c9245L1042q659m945J6505J3034j2830R248Q163q207k1039k3103q781K8531
$$ y = [15907, 34029, 20870, -6626, -30432, -17362, -5403, -17672, -13092, -19870, -30074, 1591, 20194, 5539, -25501, -60789, -35738, -13426, -21445, -33087, -35745, -52625, -56091, -12565, -2509, -18453, -27636, -12288, 2303, 1662, -11472, -10821, 19775, 34869, 29614, 37462, 8308, 644, -8634, -1113, 24394, 9388, -36960, -63699, -24552, -9400, -6601, 8668, 16252, 10488, 10118, 1841, -14431, -20452, -2643, 27248, 35166, 16477, -14927, -12265, -1788, 1298, -14422, -19743, -19416, -3175, 20954, 20082, -19463, -36170, -51662, -35094, -31253, -26929, -22595, -29121, -41754, -37856, -38117, -20453, -5435, -23150, -29260, 12119, 43122, 38707, 12438, -24782, -48443, -39245, -8203, -16862, -21807, -5302, 7732, -5098, 4150, 12313, 4106, -16933, -40036, -48817, -20286]
13452b0286M0992L509l0643M745j0739l0647n268K3326J9641J906N156j9533j296
13439a9137J6658j0275k1662Q22J7772J9q28k8083l3589J9187L7270l37J8158
13426d025J6653k6863j7331R057m249J7938J4939j7283q957k787k4919j3510K6077
13413c5260l865r1J0971L1119J9448j1298j7817J0836J3579j7253L249l7946k295
13400c6623q739K9123N759O177K2102l0961k543Q009O651M590k1979k4968N055
13387c8347J3532J6939J9588q424J3441n351j8670j9936N299q834j496Q74Q151
13374b3234k116J1701k5873n705K3080L0725K1179L830l298k3005J1741J8213
13362C7238j955l9013m966K989j6133j0289O619m922l84L387K942j1325L817j6966
$$ y = [-20286, 20706, 24215, -6428, -1683, -12422, -43069, -48337, -25011, -5370, -3464, 1692, -17841, -19137, -2479, -12754, -34416, -33594, -15822, -15803, -16631, -44714, -78303, -59116, -21846, -22183, -4025, 12628, -14235, -31566, -22509, -26758, -8820, 6119, -11164, -20121, -22908, -47827, -61337, -35260, -39125, -39216, -28245, 2874, 22322, 11024, -6793, 4043, 17622, 369, 3618, -34328, -36623, -45362, -16239, -10480, -4303, 17799, -13162, -15705, -7696, -1045, 3545, -18434, -43402, -38347, -24815, -7876, 11712, 3288, 16729, 11378, -7292, -27228, -21929, -30763, -32259, -31385, -23234, -25350, -13649, -39522, -45227, -22147, 8578, 29757, 33587, 30289, 7284, 19025, 37238, 35283, -3730, -8696, -5707, -21840, -32129, -25510, -30432, -30816, -27429, -24487, -35812, -31995, -48961]
13348d8961R132K1157R720L1188J8550r178k1330K2064k253j7642l4192q279R085
13335b0939J3171K8358K014J767L408k5388j498N394k2875L594Q247k5497j586
13322c1830K0227J0344m172k1246k2920p766L706J0495K3008L8483P744j2577
13310A3496k8758m5205p121O540K4518L6603K524Q264j3052j9741k410O27j3247
13297c6962j886j5009L4357J3924J7972K0549J3071k2484j1926K781k9354j9072
13285c4039J6086p741K3114J2970m024Q359J732k4567n594q744J9105o85j6746
13272b0774J1331o921q834j2998K0172k104K307L7232k792j6493k6548J6985M436
13259e001J3513J7426j7548J7918q988k2435q949J744k2241k70p251M706j126
$$ y = [-48961, -39829, -18672, -8952, 22236, 40786, 31608, 10278, 32342, 30089, 12447, -21745, -30024, -20939, -7768, 20590, 22604, 24371, 27779, 2391, 893, 6287, -16588, -12994, -4747, -30244, -31830, -11603, -1259, -5431, -26677, -49597, -57363, -53657, -43162, -20154, 18329, 26073, 13496, -15262, -60467, -67588, -61048, -36530, 73, 2597, 10861, -2191, -21932, -24342, -23715, -36962, -38848, -53857, -19500, -5576, 12396, 32945, 46016, 23532, 11606, 14387, -14967, -34039, -17953, -25694, -2580, 10390, 6366, 14725, 16457, -8110, -13704, -22448, -3343, -4028, -20774, -9443, -16364, -25198, -38196, -18024, -20128, -17821, 19411, 16619, 126, -26422, -9437, -5001, 8512, 25938, 8390, 26308, 17320, -5115, -14064, -12320, -34561, -34831, -42082, -37376, -38502]
13246c8502K2009J8052J47N980o224K474l2496N898k324R06J6710K0721j4795
13233a444j4325j1690n504M48J5927j8031j5919O841J7149o199j6778o699K2128
13220c4096M3674P129J277m896P752k7035k0454J5530J9257j1418j0999q65J7341
13207B197J3930k5340k2231J3365O715p62k790J7434j0288Q6j9265p616M215j3104
$$ y = [-38502, -16493, 1559, 1706, 7686, 1462, 3936, -28560, -22662, -24986, -24080, -7370, 13351, -1444, -15769, -27459, -32963, -32515, -16588, -34619, -50538, -43697, -26548, -32747, -49525, -56224, -34096, 9578, 16707, 17984, 13088, 20840, -6195, -26649, -11119, 8138, -3280, -14279, -15144, 2197, 16127, -9213, -31444, -18079, -11364, -12126, -14916, 2518, -7770, -7684, -26949, -34565, -30350, -43454]
$$ [...]
##END NTUPLES=NMR SPECTRUM
##END=
