##TITLE=Analysis number 327124
Compound Code btb 09943
Project Code adrs
Chemist Name hajos
##JCAMPDX= 6.0         $$ Bruker NMR JCAMP-DX V2.0
##DATA TYPE= NMR SPECTRUM
##DATA CLASS= NTUPLES
##ORIGIN= Bruker BioSpin GmbH
##OWNER= nmr
$$ XWIN-NMR		Version 3.5
$$ Mon Mar 12 15:11:32 2007 GMT Standard Time (UT+0h)  MAYBRIDGE\nmr@NMR_250MHZ
##.OBSERVE FREQUENCY= 250.131544655141
##.OBSERVE NUCLEUS= ^1H
##.ACQUISITION MODE= SIMULTANEOUS (DQD)
##.ACQUISITION SCHEME= undefined
##.AVERAGES= 16
##.DIGITISER RES= 18
##SPECTROMETER/DATA SYSTEM= dpx250
##.PULSE SEQUENCE= zg30
##.SOLVENT NAME= CDCl3
##.SHIFT REFERENCE= (INTERNAL, CDCl3, 0, 16.522)
##AUDIT TRAIL= $$ (NUMBER, WHEN, WHO, WHERE, WHAT)
$$ ##TITLE= Audit trail, XWIN-NMR		Version 3.5
$$ ##JCAMPDX= 5.01
$$ ##ORIGIN= Bruker BioSpin GmbH
$$ ##OWNER= nmr
$$ C:\u/data/dgb/nmr/ADRS/700/pdata/1/auditp.txt
$$ ##AUDIT TRAIL=  $$ (NUMBER, WHEN, WHO, WHERE, WHAT)
(   1,<2007-03-12 15:11:07.99 +000>,<MAYBRIDGE\nmr>,<NMR_250MHZ>,
      <created by zg, POWCHK disabled, PULCHK disabled
       configuration hash MD5:
       49 4B E0 1D 92 C2 6B 37 9F E6 65 BC 52 41 86 1D
       data hash MD5: 64K
       2F 63 1F 36 DC D6 1E 39 CE CA 13 57 B6 09 72 A6>)
(   2,<2007-03-12 15:11:21.74 +000>,<MAYBRIDGE\nmr>,<NMR_250MHZ>,
      <Start of raw data processing
       ef LB = 0.3 FT_mod = 6 PKNL = 1 SI = 32K 
       data hash MD5: 32K
       86 CC 1E 2F 1F C1 45 46 04 EF 2A 38 7B CA 52 73>)
(   3,<2007-03-12 15:11:23.50 +000>,<MAYBRIDGE\nmr>,<NMR_250MHZ>,
      <apk 
       data hash MD5: 32K
       E7 9C 93 24 EA AA BB 3C 0C 8A 92 86 1C 5B C1 F4>)
(   4,<2007-03-12 15:11:24.30 +000>,<MAYBRIDGE\nmr>,<NMR_250MHZ>,
      <abs ABSG = 5 
       data hash MD5: 32K
       A6 59 EE E9 5E 86 7A 1F E1 19 C9 7D 1B 3D 31 CC>)
$$ ##END=
$$ 
$$ hash MD5
$$ B0 33 5F 04 E2 41 D5 7E CD B3 27 27 07 8B BE 28
##$RELAX= 
##$RELAX= 
##$RELAX= 
##$RELAX= 
##$RELAX= 
##$RELAX= 
##$RELAX= 
$$ Bruker specific parameters
$$ --------------------------
##$DU= <C:\u>
##$EXPNO= 700
##$NAME= <ADRS>
##$PROCNO= 1
##$TYPE= <nmr>
##$USER= <dgb>
##$AMP= (0..31)
100 100 100 100 100 100 100 100 100 100 100 100 100 100 100 100 100 100 
100 100 100 100 100 100 100 100 100 100 100 100 100 100 
##$AQSEQ= 0
##$AQ_mod= 3
##$AUNM= <au_zg>
##$AUTOPOS= <33 >
##$BF1= 250.13
##$BF2= 250.13
##$BF3= 250.13
##$BF4= 250.13
##$BF5= 500.13
##$BF6= 500.13
##$BF7= 500.13
##$BF8= 500.13
##$BYTORDA= 1
##$CFDGTYP= 0
##$CFRGTYP= 5
##$CHEMSTR= <none>
##$CNST= (0..31)
1 1 145 1 1 1 1 1 1 1 1 1 1 1 1 1 1 1 1 1 1 1 1 1 1 1 1 1 1 1 1 1 
##$CPDPRG= <>
##$CPDPRG1= <>
##$CPDPRG2= <>
##$CPDPRG3= <>
##$CPDPRG4= <mlev>
##$CPDPRG5= <mlev>
##$CPDPRG6= <mlev>
##$CPDPRG7= <mlev>
##$CPDPRG8= <mlev>
##$CPDPRGB= <>
##$CPDPRGT= <>
##$D= (0..31)
0 1 0 0 0 0 0 0 0 0.06 0 0 0 0 0 0 0.0002 0 0 0 0 0 0 0 0 0 0 0 0 0 0 
0 
##$DATE= 1173712266
##$DBL= (0..7)
120 120 120 120 120 120 120 120 
##$DBP= (0..7)
150 150 150 150 150 150 150 150 
##$DBP07= 0
##$DBPNAM0= <>
##$DBPNAM1= <>
##$DBPNAM2= <>
##$DBPNAM3= <>
$$ [...]
##$SUBNAM7= <"">
##$SUBNAM8= <"">
##$SUBNAM9= <"">
##$SW= 20.6930455092707
##$SWIBOX= (0..15)
0 0 3 0 0 0 0 0 0 0 0 0 0 0 0 0 
##$SW_h= 5175.983436853
##$TD= 65536
##$TD0= 1
##$TE= 683.16
##$TE2= 300
##$TE3= 300
##$TEG= 300
##$TL= (0..7)
0 120 120 120 120 120 120 120 
##$TP= (0..7)
150 150 150 150 150 150 150 150 
##$TP07= 0
##$TPNAME0= <>
##$TPNAME1= <>
##$TPNAME2= <>
##$TPNAME3= <>
##$TPNAME4= <>
##$TPNAME5= <>
##$TPNAME6= <>
##$TPNAME7= <>
##$TPOAL= (0..7)
0.5 0.5 0.5 0.5 0.5 0.5 0.5 0.5 
##$TPOFFS= (0..7)
0 0 0 0 0 0 0 0 
##$TUNHIN= 0
##$TUNHOUT= 0
##$TUNXOUT= 0
##$USERA1= <user>
##$USERA2= <user>
##$USERA3= <user>
##$USERA4= <user>
##$USERA5= <user>
##$V9= 5
##$VALIST= <valist>
##$VCLIST= <CCCCCCCCCCCCCCC>
##$VD= 0
##$VDLIST= <DDDDDDDDDDDDDDD>
##$VPLIST= <PPPPPPPPPPPPPPP>
##$VTLIST= <TTTTTTTTTTTTTTT>
##$WBST= 1024
##$WBSW= 4
##$XGAIN= (0..3)
0 0 0 0 
##$XL= 0
##$YL= 0
##$YMAX_a= 128431
##$YMIN_a= -267609
##$ZGOPTNS= <>
##$ZL1= 120
##$ZL2= 120
##$ZL3= 120
##$ZL4= 120
##$ABSF1= 16.522
##$ABSF2= -4.171173
##$ABSG= 5
##$ABSL= 3
##$ALPHA= 0
##$AQORDER= 0
##$ASSFAC= 0
##$ASSFACI= 0
##$ASSFACX= 0
##$ASSWID= 0
##$AUNMP= <proc_1d>
##$AZFE= 0.1
##$AZFW= 0.1
##$BCFW= 0
##$BC_mod= 0
##$BYTORDP= 0
##$COROFFS= 0
##$CY= 12.5
##$DATMOD= 1
##$DC= 0
##$DFILT= <>
##$DTYPP= 0
##$F1P= 14.0000005364418
##$F2P= -0.99999901652339
##$FCOR= 0.5
##$FTSIZE= 32768
##$FT_mod= 6
##$GAMMA= 0
##$GB= 0
##$INTBC= 1
##$INTSCL= 1
##$ISEN= 128
##$LB= 0.3
##$LEV0= 0
##$LPBIN= 0
##$MAXI= 10000
##$MC2= 0
##$MEAN= 0
##$ME_mod= 0
##$MI= 0
##$NCOEF= 0
##$NC_proc= -5
##$NLEV= 6
##$NOISF1= 0
##$NOISF2= 0
##$NSP= 0
##$NTH_PI= 0
##$NZP= 0
##$OFFSET= 16.522
##$PC= 1
##$PHC0= 225.3711
##$PHC1= 27.81036
##$PH_mod= 1
##$PKNL= yes
##$PPARMOD= 0
##$PSCAL= 4
##$PSIGN= 0
##$REVERSE= no
##$SF= 250.13
##$SI= 32768
##$SIGF1= 0
##$SIGF2= 0
##$SINO= 400
##$SIOLD= 32768
##$SREGLST= <1H.CDCl3>
##$SSB= 0
##$STSI= 32768
##$STSR= 0
##$SW_p= 5175.98343685301
##$SYMM= 0
##$S_DEV= 0
##$TDeff= 65536
##$TDoff= 0
##$TI= <Analysis number 999999
Compound Code 99
Book Reference 9
Project Code 9>
##$TILT= no
##$TM1= 0
##$TM2= 0
##$TOPLEV= 0
##$USERP1= <user>
##$USERP2= <user>
##$USERP3= <user>
##$USERP4= <user>
##$USERP5= <user>
##$WDW= 1
##$XDIM= 32768
##$YMAX_p= 498054852
##$YMIN_p= -790230
$$ End of Bruker specific parameters
$$ ---------------------------------
##NTUPLES= NMR SPECTRUM
##VAR_NAME=  FREQUENCY,     SPECTRUM/REAL,   SPECTRUM/IMAG
##SYMBOL=    X,             R,               I
##VAR_TYPE=  INDEPENDENT,   DEPENDENT,       DEPENDENT
##VAR_FORM=  AFFN,          ASDF,            ASDF
##VAR_DIM=   32768,         32768,           32768
##UNITS=     HZ,            ARBITRARY UNITS, ARBITRARY UNITS
##FACTOR=    0.157963299565203, 1,           1
##FIRST=     4132.6476996994, 0,             0
##LAST=      -1043.33573715361, 0,           0
##MIN=       -1043.33573715361, -790230,     0
##MAX=       4132.6476996994, 498054852,     0
$$ Real data points
##PAGE= N=1
##DATA TABLE= (X++(R..R)), XYDATA
$$ [...]
##PAGE= N=2
##DATA TABLE= (X++(I..I)), XYDATA
25851 1377611 1376594 1226093 1200021 1215798 1425108 1365461 1322567 1431457 1479434 1341884 1355812
25840 1355812 1277420 1235449 1358187 1384455 1542175 1386012 1072203 1146088 1336412 1410782
25830 1410782 1303707 1211862 1187298 1192911 1273179 1576063 1728544 1498894 1261809 1261487 1325473
25819 1325473 1397433 1296339 1115706 1370170 1727264 1591616 1540997 1525685 1301662 1215730
25809 1215730 1276955 1266552 1291983 1326917 1352698 1359164 1382423 1242849 1263576 1318746 1385158
25798 1385158 1487587 1332845 1181541 1004339 955806 1073753 1116201 1174179 1174524 1217631 1044090
25787 1044090 1044468 1152327 1289180 1540640 1712329 1667680 1537556 1319429 1286636 1336929
25777 1336929 1134758 1073141 1265710 1410679 1513228 1528475 1765502 1710486 1619878 1521996
25767 1521996 1554803 1394831 1413389 1534258 1585264 1537413 1412264 1257928 1404423 1642347
25757 1642347 1866813 1856142 1768794 1568272 1052086 1078915 1288216 1445550 1400716 1348020
25747 1348020 1299006 1463715 1508048 1490123 1634111 1587855 1562243 1519772 1491831 1504856 1664180
25736 1664180 1828321 1703577 1449197 1491198 1598730 1593928 1391997 1434947 1346457 1343574 1249984
25725 1249984 1399122 1389501 1512922 1350337 1236271 1283349 1382069 1397620 1307960 1263308 1460891
25714 1460891 1529699 1412854 1568675 1614404 1666955 1669025 1545988 1493913 1492171 1311404 1252543
25703 1252543 1136056 1175578 1309321 1454004 1468612 1317120 1152687 1269085 1331416 1266194
25693 1266194 1185967 1107276 1101395 1190068 1396812 1444432 1488502 1612306 1730089 1541049 1371090
25682 1371090 1442220 1561022 1344950 1387758 1454858 1407029 1311548 1360597 1391450 1274426 1142805
25671 1142805 1143082 1399836 1384165 1443385 1485715 1644606 1583531 1423085 1414881 1536871 1467895
25660 1467895 1391645 1360495 1470236 1473165 1460253 1387917 1323862 1212603 1255129 1425100 1404820
25649 1404820 1313869 1344795 1313392 1459493 1363992 1276622 1322696 1365440 1456152 1638897 1552862
25638 1552862 1610458 1701725 1773549 1615306 1493308 1565466 1493711 1403447 1464942 1543972 1475003
25627 1475003 1340971 1440306 1546468 1530353 1547946 1440380 1493736 1437930 1461502 1558481 1449040
25616 1449040 1346910 1397420 1342530 1220534 1459375 1374444 1331093 1260821 1202123 1051970
25606 1051970 1097441 1279760 1309464 1363334 1323252 1274242 1271490 1559767 1493011 1448256 1435300
25595 1435300 1333537 1312097 1434774 1443856 1460549 1568167 1653054 1627655 1515854 1346605
25585 1346605 1240264 1421283 1615499 1631544 1489235 1375877 1323620 1364038 1318983 1288862
25575 1288862 1441916 1665854 1652288 1690485 1515382 1439144 1536685 1481298 1403452 1357737 1313302
25564 1313302 1097898 1245694 1312475 1470750 1606419 1620336 1649855 1507166 1394009 1543546
25554 1543546 1735624 1754897 1737293 1692362 1477403 1450011 1213281 1021944 1052680 1326959
25544 1326959 1503710 1600383 1654217 1503652 1224406 1354457 1353533 1243171 1342212 1385363 1512024
25533 1512024 1525845 1357230 1504794 1706295 1411756 1073831 1008730 1134929 1233620 1441370
25523 1441370 1522827 1429485 1592229 1657585 1433947 1241227 1311971 1359313 1354475 1383970 1433816
25512 1433816 1523348 1403838 1279002 1198466 1231628 1289308 1388633 1512924 1416523 1422491 1467262
25501 1467262 1359473 1344388 1603948 1718170 1710180 1639980 1593330 1693782 1770218 1703583 1645421
25490 1645421 1743121 1547723 1637826 1705279 1759416 1740899 1826824 1908545 1804659 1416274 1337467
25479 1337467 1318617 1278019 1296391 1299294 1387841 1450335 1406702 1294023 1360747 1448254 1402989
25468 1402989 1404794 1437526 1346141 1334707 1269181 1181917 1253294 1413912 1487645 1538841 1431131
25457 1431131 1476756 1563502 1483444 1316965 1413929 1317074 1210171 1474999 1544141 1341902
25447 1341902 1445023 1359141 1312750 1176185 1261807 1390988 1510177 1535809 1553794 1439929
25437 1439929 1366173 1371267 1247020 1121363 1214527 1386545 1368354 1341669 1266969 1046024 1240106
25426 1240106 1328118 1387173 1366953 1426442 1472411 1390789 1481006 1493592 1473366 1486359 1332393
25415 1332393 1485991 1658177 1710069 1623086 1523239 1390300 1394185 1612772 1761660 1592980
25405 1592980 1598169 1613223 1540492 1650736 1842602 1747641 1654559 1577291 1641358 1680589 1673008
25394 1673008 1716345 1733961 1639108 1702511 1734811 1602419 1449275 1464438 1410520 1681762 1615231
25383 1615231 1426281 1455386 1769689 1993764 1968889 1970065 1764758 1803666 1627343 1545583
25373 1545583 1685010 1842553 1651177 1441328 1377325 1418927 1555852 1644229 1755643 1701388
25363 1701388 1568498 1517659 1587184 1670357 1370306 1259434 1422105 1418543 1717499 1798745
25353 1798745 1752048 1615491 1417237 1170283 1165874 1208042 1480211 1753088 1744674 1537655
25343 1537655 1278099 1277048 1379353 1341160 1213844 1164616 1282492 1502588 1537377 1363159
25333 1363159 1352574 1643266 1767150 1641439 1522784 1531781 1654345 1487477 1351309 1320826
25323 1320826 1301191 1225286 1354145 1406026 1674771 1721882 1620474 1630912 1575933 1401989
25313 1401989 1348807 1421089 1511892 1497962 1686260 1787773 1599430 1450274 1398259 1450453
25303 1450453 1600350 1565971 1536306 1373891 1249542 1304068 1522308 1439408 1487143 1554928
25293 1554928 1276786 1226414 1260742 1328814 1318501 1464548 1608014 1621771 1461470 1665332
25283 1665332 1668292 1586919 1553161 1538448 1556145 1442208 1440538 1358477 1412736 1495335 1467668
25272 1467668 1600417 1795461 1717902 1694537 1700528 1589992 1517910 1350319 1452241 1703073
25262 1703073 1660195 1521506 1630161 1645078 1686494 1662768 1697973 1548828 1289369 1431593
25252 1431593 1555727 1471755 1353845 1333616 1461367 1320956 1302796 1488938 1505706 1356172
25242 1356172 1125465 1150357 1299447 1507090 1650570 1429008 1545755 1529771 1246787 1304167
25232 1304167 1417451 1276750 1301724 1213509 1157531 1239117 1331696 1332134 1409901 1335294 1487163
25221 1487163 1472210 1159849 1141891 1280284 1253378 1287987 1463547 1646628 1605074 1453336
25211 1453336 1674367 1774580 1536290 1429525 1505626 1349480 1297978 1427891 1752589 1692476
25201 1692476 1456207 1109022 1176621 1424708 1643230 1772351 1611630 1427741 1417644 1487468
25191 1487468 1562846 1636733 1610869 1720724 1638107 1398399 1193277 1213757 1496270 1563508
25181 1563508 1594477 1515223 1358974 1368864 1335655 1295804 1226518 1070077 1144783 1009605 1015164
25170 1015164 1256826 1434979 1499395 1640355 1596465 1487796 1369894 1275786 1349644 1405929
25160 1405929 1446173 1512785 1433992 1476461 1515429 1409223 1228763 1228020 1376388 1353209 1336576
25149 1336576 1238451 1332154 1543193 1483476 1335298 1429298 1597666 1372986 1315354 1477608
25139 1477608 1268531 1090280 1096133 1254727 1384160 1499841 1480553 1634239 1538157 1742007
25129 1742007 1759771 1558906 1597063 1561028 1433996 1492857 1576961 1517185 1492313 1458416 1522127
25118 1522127 1762107 1803770 1591977 1597666 1757814 1538739 1353585 1437264 1534954 1459353
25108 1459353 1504506 1607475 1495673 1437243 1553737 1486279 1469969 1358643 1248372 1340187
25098 1340187 1482320 1415208 1247745 1249486 1380862 1458499 1516810 1703802 1748524 1819680 1783154
25087 1783154 1732690 1739232 1800538 1739892 1568624 1617311 1637622 1546241 1577668 1762376 1891242
25076 1891242 1866239 1717126 1574744 1508693 1653265 1762048 1653338 1547089 1417523 1311469
25066 1311469 1270473 1395612 1459839 1578013 1687664 1521734 1479655 1497911 1686152 1616146
25056 1616146 1738109 1819059 1594718 1478615 1540971 1602304 1707469 1781091 1710249 1659444
25046 1659444 1671496 1481155 1326264 1457760 1557320 1455044 1374892 1344291 1390093 1384210 1434906
25035 1434906 1465650 1590027 1532935 1443229 1322304 1381155 1481431 1652292 1603015 1574186
25025 1574186 1632641 1626457 1554717 1735608 1770371 1794715 1819507 1664792 1517616 1417076 1293557
25014 1293557 1351960 1329299 1230454 1221508 1287068 1341690 1501254 1503139 1729051 1727462 1533576
25003 1533576 1399443 1323806 1402610 1548109 1526983 1387433 1403975 1763612 1745877 1524004
24993 1524004 1583340 1600148 1588475 1479447 1412300 1456707 1416649 1318110 1285019 1314834 1496910
24982 1496910 1572590 1610889 1484072 1450932 1255833 1073658 1176275 1214200 1525113 1651341
24972 1651341 1560296 1486605 1501112 1354642 1479265 1799294 2069130 1884424 1711337 1507950
24962 1507950 1362232 1334704 1332213 1452475 1509786 1444042 1478191 1338831 1421112 1567335 1584183
24951 1584183 1276308 962452 1048144 1235852 1408584 1510972 1554016 1532410 1624920 1741740
24941 1741740 1821011 1851999 1737389 1705507 1763687 1671228 1639294 1554726 1614178 1584651 1526315
24930 1526315 1393890 1298169 1335636 1307798 1445269 1485713 1534697 1621730 1613258 1542307 1466067
24919 1466067 1333119 1219593 1213108 1419709 1551063 1397209 1380908 1350220 1402146 1389278
24909 1389278 1435459 1489317 1639297 1610430 1409021 1385380 1612409 1461255 1290424 1336849
24899 1336849 1448633 1453844 1598156 1718862 1663054 1523839 1745878 1703125 1462291 1449168
24889 1449168 1628883 1584283 1725732 1757062 1653197 1659236 1690763 1617823 1541966 1378367 1223967
24878 1223967 1344534 1485315 1514256 1357873 1247635 1402190 1418640 1313589 1408956 1503993
24868 1503993 1380296 1431338 1527929 1439195 1556208 1553090 1441816 1463952 1572466 1636152 1567096
24857 1567096 1612626 1691191 1765487 1943964 1784474 1759770 1694296 1519575 1324947 1455268
24847 1455268 1503365 1477911 1497205 1615558 1635107 1534131 1430707 1521196 1760584 1725861
24837 1725861 1528596 1351949 1396351 1494219 1511828 1270586 1199918 1574347 1713434 1722485
24827 1722485 1565429 1645086 1780492 1785993 1745648 1729912 1738050 1338888 1157996 1249188 1232095
24816 1232095 1329622 1463785 1441757 1709625 1751518 1691817 1776923 1831505 1956336 1959058 1851848
24805 1851848 2017402 1991676 1664458 1514811 1596806 1711599 1599714 1679949 1656505 1647888
24795 1647888 1740990 1660827 1455310 1639395 1627626 1459437 1527324 1535695 1469132 1528397 1460203
24784 1460203 1576228 1579165 1487590 1662487 1771617 1901776 1977208 1876784 1829674 1750218
24774 1750218 1619107 1469462 1399562 1276523 1412357 1637630 1837601 1883682 1966086 1909167
24764 1909167 1807507 1724138 1854030 1780730 1776316 1734483 1659431 1463772 1360971 1215787
24754 1215787 1288183 1430907 1470066 1515050 1552949 1511619 1466487 1484217 1540627 1548382 1612837
24743 1612837 1628072 1674188 1769005 1748834 1658701 1764800 1777502 1640822 1536478 1521881 1599469
24732 1599469 1584433 1526395 1518937 1506332 1450151 1431840 1705570 1770224 1724014 1698294 1596088
24721 1596088 1782901 1833835 1768899 1790004 1998082 1960881 1830593 1582396 1243763 1214186
24711 1214186 1608112 1652017 1721176 1679347 1609223 1815653 1669074 1607523 1775269 1678374
24701 1678374 1607898 1753998 1918564 1786988 1678461 1689645 1674549 1883711 1930758 1722288
24691 1722288 1774622 1818797 1762154 1714109 1731961 1790032 1731148 1483747 1410006 1639388 1914505
24680 1914505 1815608 1718110 1841431 1931297 1879698 1829276 1675152 1456586 1581615 1548891
24670 1548891 1618993 1436738 1431821 1715159 1785671 1665962 1698256 1623792 1578371 1879071 1950030
24659 1950030 1617051 1306823 1199223 1226796 1261943 1346793 1362604 1601507 1605407 1387963
24649 1387963 1387152 1408113 1638085 1928120 1908493 1719957 1658926 1704231 1701254 1566504 1426144
24638 1426144 1328684 1363984 1407291 1324376 1343520 1276098 1113591 1226128 1382287 1427363 1444919
24627 1444919 1704291 1689061 1425407 1348019 1359167 1576934 1671708 1632674 1652909 1705093 1817256
24616 1817256 1773862 1768997 1515095 1688541 1755208 1672537 1490749 1265975 1304810 1426799
24606 1426799 1493919 1495404 1602257 1405910 977399 828700 1112279 1326647 1467415 1541568
24596 1541568 1491768 1420001 1429093 1682240 1765155 1643481 1706985 1925689 1858461 1855447 1714147
24585 1714147 1505470 1490648 1617969 1602000 1605504 1703139 1725235 1750402 1812180 1938447 1832994
24574 1832994 1795344 1975658 1943689 1791088 1578574 1574602 1457473 1566990 1543338 1616510
24564 1616510 1530740 1432231 1539772 1808091 1703301 1647988 1654222 1782883 1726889 1672371 1518229
24553 1518229 1315498 1423051 1714106 1811494 1733591 1619085 1650688 1710565 1623250 1567022
24543 1567022 1530631 1373258 1298152 1361840 1653174 1794309 1626362 1445555 1589332 1794272
24533 1794272 1738657 1753899 1763606 1687369 1557981 1642459 1688998 1732007 1563201 1614707 1726679
24522 1726679 1588000 1630363 1829900 1917613 1753584 1611351 1570780 1611938 1509150 1384114
24512 1384114 1355247 1462928 1519757 1494882 1422343 1559047 1502262 1567655 1841852 1789320 1659429
24501 1659429 1643462 1630548 1688642 1710064 1645154 1594407 1504549 1524616 1743822 1935918 1780423
24490 1780423 1691098 1601432 1751664 1818264 1594717 1360772 1400546 1659718 1660837 1652191 1617979
24479 1617979 1351676 1195359 1207534 1340316 1389854 1562521 1541203 1683246 1734236 1743977
24469 1743977 1731749 1614924 1664268 1741441 1771191 1830758 1763086 1791254 1871790 1668520 1430569
24458 1430569 1333954 1531165 1802785 1670753 1544151 1736120 1631147 1816750 1754895 1940873
24448 1940873 1904867 1764036 1851223 1861915 1921002 1785788 1636075 1613317 1608605 1828099 2057250
24437 2057250 2116184 1932011 1869620 1959508 1979472 1825176 1751742 1729131 1761853 1886998 1921915
24426 1921915 1955018 2034867 2042238 1905028 1691657 1701484 1695341 1876745 1828294 1852846 1891987
24415 1891987 1762283 1566410 1436645 1363750 1419363 1470238 1443401 1437116 1371528 1410649 1377184
24404 1377184 1524280 1884472 1996189 1765392 1570864 1441668 1617551 1605666 1572801 1628321
24394 1628321 1684283 1645093 1648236 1645009 1387003 1469241 1540592 1585270 1556819 1460604 1411212
24383 1411212 1383786 1530076 1547878 1597675 1542946 1652900 1698529 1638508 1659562 1579877 1515991
24372 1515991 1587711 1746163 1693895 1810607 1918217 1957257 2074266 1892723 1563669 1701442
24362 1701442 1562586 1482021 1411930 1340684 1270967 1433184 1504746 1519770 1660717 1688275 1679612
24351 1679612 1620375 1441972 1338258 1324927 1284463 1221189 1311732 1519622 1627687 1624960 1756026
24340 1756026 1763036 1687672 1666053 1688918 1965083 2159271 1952935 1689296 1854739 2019382
24330 2019382 1768346 1675983 1771385 1737694 1628270 1707340 1823218 1749013 1665746 1552032
24320 1552032 1499079 1444281 1550928 1477075 1551266 1759978 1930072 1881064 1921960 1841723 1650067
24309 1650067 1603612 1647537 1921551 2093378 1980543 2016289 1921709 1783834 1652623 1608095
24299 1608095 1821228 1736279 1652970 1720590 1642396 1615891 1662679 1816955 1770622 1924528 2047742
24288 2047742 1985064 1805163 1579224 1427300 1498874 1591901 1584101 1441664 1561828 1613492
24278 1613492 1686083 1792776 1738284 1696016 1794243 2084861 2210176 2118750 1997211 1855754
24268 1855754 1678307 1381580 1350356 1493365 1566932 1762105 1659670 1626156 1517254 1441450
24258 1441450 1600380 1585143 1626653 1636472 1611580 1674042 1690856 1733133 1719956 1528541 1503608
24247 1503608 1422289 1541998 1464257 1479535 1584354 1521521 1502435 1509661 1468290 1288488 1272560
24236 1272560 1446254 1690922 1880969 1837861 1802462 1920216 1939391 1859134 1738448 1760913
24226 1760913 1802079 1573358 1622870 1571091 1496469 1791219 1945799 1846772 1830576 1766787 1725196
24215 1725196 1575076 1508806 1607398 1617472 1537944 1683465 1542585 1587462 1607440 1619818 1484877
24204 1484877 1807125 1832201 1802526 1664215 1631019 1648598 1681460 1948450 1888746 1941369 1962426
24193 1962426 1926683 1798569 1724307 1927169 1920434 1747133 1761629 1796633 1828249 1657697 1488976
24182 1488976 1381016 1323530 1649126 1860082 1788776 1743764 1730829 1841153 1947473 2172093
24172 2172093 2009908 1860652 1930473 1966005 1735291 1626031 1682692 1773006 1667523 1575678
24162 1575678 1771355 1873995 1853386 2073312 1940628 1732138 1618169 1674411 1891320 1892751
24152 1892751 1850237 2036537 1919928 1696254 1721338 1703013 1748210 1938717 2054631 1900828
24142 1900828 1839346 1884434 1861734 1778894 1868151 2018670 1889358 2008311 1931779 1800174
24132 1800174 1746973 1653214 1730376 1608337 1594895 1528535 1442890 1562948 1651767 1587034 1538344
24121 1538344 1551825 1808794 1890714 1851828 1929007 1932489 1847449 1780026 1774981 1776764 1875164 1905709
24109 1905709 1737381 1785129 1839903 1654682 1756611 2003659 1936550 1687735 1778361 1756312
24099 1756312 1479151 1505091 1538135 1627355 1741882 1800909 1954757 2098435 2045429 1931264
24089 1931264 1931490 1950426 2133745 2156450 1922820 1789113 2016687 2011129 1923619 1922834 1834996
24078 1834996 1721628 1786591 1810627 1658494 1681710 1662157 1605924 1531338 1607828 1643804 1607567
24067 1607567 1589529 1626614 1730326 1675999 1729319 1566086 1629906 1656034 1605263 1600881 1534175
24056 1534175 1600567 1590717 1826890 1798671 1715250 1750894 1918179 1926537 1748435 1676245 1798955
24045 1798955 1672859 1516808 1599153 1817981 1888048 1939405 1846971 1962079 1915959 1749202
24035 1749202 1744233 1708743 1861249 1730076 1655648 1742971 1854512 1721067 1594572 1462017
24025 1462017 1769203 2049482 2007084 1966959 1936225 2023261 1922391 1868600 1756739 1884231
24015 1884231 2135843 2223679 1962967 1711389 1653830 1608509 1552595 1634518 1847605 2007940
24005 2007940 2094496 1856822 1747298 1740496 1805392 1899262 1970485 1862680 1807810 1916709 1995873
23994 1995873 1932901 1879703 1771848 1809722 1809011 1840642 1761125 1721395 1662716 1674089 1613185
23983 1613185 1545894 1580417 1721934 1495172 1218211 1264378 1515860 1577918 1725713 1843461
23973 1843461 1849793 1857963 1906427 1802522 1738531 1877961 1703972 1779792 1745585 1730507 1861845
23962 1861845 1909307 1896622 1970790 1965643 1902794 1764710 1727044 1671780 1667603 1653441 1702473
23951 1702473 1827095 1852949 1976802 1853297 1916903 1957305 1890893 1598996 1416421 1288816
23941 1288816 1481571 1620560 1797896 1796266 1690671 1604602 1666995 1635981 1820510 1865041
23931 1865041 1961315 1950274 1896091 1764359 1650650 1659746 1632878 1804281 1982699 1888407 1799040
23920 1799040 2074054 2142972 1896454 1687208 1593193 1580838 1618421 1561701 1577432 1772935
23910 1772935 1608562 1715801 1767559 1831872 1896252 1657023 1511953 1586502 1590827 1635087 1688996
23899 1688996 1674779 1860100 1816844 1866784 1736492 1804458 2027179 1967843 1932814 1911981 1896156
23888 1896156 1971848 1897084 1819839 1803973 1924851 2014644 1987955 1793971 1856085 1878234 1859731
23877 1859731 2101341 2162470 1956101 1896959 1744552 1814398 1962388 2057324 2004537 1913311
23867 1913311 1786390 1660031 1567522 1454440 1488711 1633037 1510723 1299118 1472136 1681013
23857 1681013 1624259 1559231 1606656 1594079 1612041 1661475 1620687 1699914 1743170 1606186 1671961
23846 1671961 1957969 1895195 1865244 2055710 1828558 1670961 1563152 1429523 1429733 1496537
23836 1496537 1605884 1709823 1825892 1753879 1856017 1879258 1906723 1793772 1821382 1703767
23826 1703767 1812980 1719080 1626426 1618876 1614908 1817600 1972304 2047746 1827924 1551543 1588712
23815 1588712 1834267 1994612 1902792 1977701 1948703 1786083 1688746 1628233 1735476 1775090
23805 1775090 1599896 1489324 1600855 1650155 1852620 1845028 1806476 1718509 1725048 1795984 1814820
23794 1814820 1693380 1676942 1620716 1664709 1590171 1558436 1521783 1606956 1745480 1699104 1756362
23783 1756362 1762989 1893646 1873255 1850238 1914464 1998094 1882770 1825385 1909648 2009872 1906777
23772 1906777 1865041 1960510 2012784 1956198 1774575 1682734 1560656 1526903 1469825 1414995 1448502
23761 1448502 1554489 1589719 1695259 1535206 1454192 1838245 1831374 1915335 2226853 2184004
23751 2184004 2007765 1891504 1889274 1758461 1612123 1499525 1721223 1998131 2075205 1951472
23741 1951472 1889358 1906572 1944363 1976174 2016327 1984074 1737790 1637941 1783731 1828763 1629950
23730 1629950 1592952 1860935 1862001 1712756 1527524 1614977 1701870 1780513 1721833 1803594 1681205
23719 1681205 1577629 1435097 1320826 1286276 1605248 1756459 1814076 1784356 1906558 1966170
23709 1966170 1956747 2125825 2242200 2245344 2149143 1858589 1785909 1955186 1799654 1735222 1921009
23698 1921009 1911065 1754314 1872984 1961712 1804113 1877718 1903261 1723876 1697800 1655112 1625200
23687 1625200 1546909 1475361 1548101 1646733 1750460 1777062 1834578 2019012 1933946 1794080 1831199
23676 1831199 1687626 1286606 1323395 1475684 1563100 1710362 1795415 1897003 2003334 2043596
23666 2043596 1961927 1976202 2246559 2288380 2060448 1798871 1730197 1704774 1516884 1511365 1722197
23655 1722197 1748007 1822535 1848484 2036003 2024635 1895400 1834751 1803488 1730464 1841157 1723360
23644 1723360 1618496 1697156 1577162 1625718 1847607 1956931 1976639 2005807 1888875 1729663
23634 1729663 1833698 1896898 1901118 1885374 1928934 1926703 2032063 1961561 2080124 1807080 1504327
23623 1504327 1653112 1833739 1867120 1783663 1767781 1740363 1960100 2053287 1932491 1947057
23613 1947057 1859831 2077991 2280174 2349044 1995964 1794148 1831479 1804373 1881995 1988398
23603 1988398 1864703 1749971 1739688 1761152 1719070 1746242 1880091 1865300 1759179 1906356
23593 1906356 1923792 1960671 2080242 1995806 1973989 2178398 2174733 2253893 2212809 2194517 2095316
23582 2095316 1977099 1952504 1916754 1907664 1816543 1861298 2103080 2161003 2132769 2026470 1880364
23571 1880364 1947557 1950202 1851842 1812650 1672322 1655533 1758581 1910355 2075016 2106713 2066162
23560 2066162 2094243 1853494 1927359 1840676 1813865 1807850 2006358 1961208 1994456 1873840 1686959
23549 1686959 1646934 1720987 1877795 1885148 1822132 1882320 1772282 1764461 1906225 2004262 2011883
23538 2011883 1857646 1899820 2100055 1807418 1543750 1675529 1813839 2082074 2165913 1940011
23528 1940011 1797348 1778849 1961651 1961680 2193061 2083527 2025555 1941940 1938934 1855930 1669668
23517 1669668 1490353 1486950 1632348 1884828 1984554 1923178 1983548 2125673 2097854 2125426 2224735
23506 2224735 2043000 2032225 2015356 1857665 1856122 1863122 1931343 1968490 2013126 2086797 2202063
23495 2202063 2179546 2173020 2189311 2182736 2113387 2127840 2063830 1889979 1944688 2254508 2255805
23484 2255805 1973644 1919965 1886838 1909878 2108949 2140080 2108341 2129413 1978369 1921377 1888618
23473 1888618 1972191 2109401 2268447 2385514 2357318 2267714 2158332 2067587 1909230 1862160
23463 1862160 1728285 1952687 2110684 1854200 1656882 1851542 2004458 1807415 1662204
23454 1662204 1655693 1765729 2013769 1950761 2033367 2184811 2040259 1828617 1969608 2062705
23444 2062705 2110763 2060033 2190255 2166010 2275840 2098326 1861348 1888616 2094624 2340925
23434 2340925 2316610 2278505 2228536 1981992 1916516 1967178 2050907 2159535 2119514 2045844 1882554
23423 1882554 1832859 1864594 1997758 2097134 2298395 2436836 2414457 2285465 2316690 2246468
23413 2246468 2163674 2108150 2063890 1913883 1963977 2128287 2255124 2133593 1994787 2064540
23403 2064540 1920981 1978250 2062638 2106029 1940793 1716380 1571165 1561640 1555886 1467488 1539687
23392 1539687 1887953 1889765 1987477 1993225 1980367 2011169 2068463 1973812 1904242 1921378 1925911 1927458
23380 1927458 1765019 1591689 1740245 1804735 1901189 1756758 1669779 1953117 2122025 1998968
23370 1998968 1951926 2065410 2118943 2038335 1846714 1740523 1869628 1856667 1808134 1898690
23360 1898690 1828391 1679093 1842888 2173753 2204689 2235416 2098317 1880512 2109335 2140378
23350 2140378 2066835 1929410 2023530 1933032 1673036 1925737 2124382 1977605 1958817 2081404
23340 2081404 2068700 2087415 2128685 1915651 1872997 1862310 1951012 2205114 2202764 2073681 2140484
23329 2140484 2032802 1933595 2104818 2154732 1935981 1779016 1748730 1781108 1846715 1914299
23319 1914299 1817101 1718110 1764635 1957175 2064565 2253165 2355752 2293003 2087495 1889587
23309 1889587 1956162 1986736 2037122 2047806 1980290 1910284 1891850 1864739 1969723 2039449 2050445
23298 2050445 2013167 2084802 2003432 1792928 1750986 1805993 1802931 1820991 1970429 1971249 1977921 2051547
23286 2051547 2047791 2112344 2253581 2202161 1932889 1821134 2010353 1904153 1927631 1977142
23276 1977142 2127729 2221228 2171572 2154494 1988201 2004501 1870916 1678375 1745638 1862636
23266 1862636 2058885 2093252 1981428 1967340 1659282 1698183 1830776 1878058 1888521 2038623
23256 2038623 2162835 2026738 1979667 2056341 2053323 1967120 2059079 2034318 2018538 2033298 1922999
23245 1922999 1752832 1811563 1948017 1961563 1868186 1893917 2044402 1986840 1920071 1959632 1932918
23234 1932918 1930800 1874904 1987706 2010136 1918648 2031089 2136243 2040870 1955446 1881614 1885746
23223 1885746 1987020 1960483 2062138 2066814 2046075 1904080 1917196 1885313 1837525 1908663 1937916
23212 1937916 2003015 2146859 2219910 2054113 1937478 1869390 1988080 1962611 1887626 1911809
23202 1911809 1864332 1762648 1675353 1661336 1578549 1707611 2056848 2021949 1844728 1868873
23192 1868873 1993430 2174361 2360054 2132568 1999622 2087181 2173045 2020007 1953958 1987060
23182 1987060 2179331 2252088 2365389 2416339 2298197 2038727 2089033 2292580 2378896 2224349
23172 2224349 2161150 2231768 2009552 1875169 1788596 1996155 2079176 2035495 1985475 1896073 1917276
23161 1917276 2183259 2315006 2185263 2155807 2054892 2207861 2264126 2367019 2443667 2386887
23151 2386887 2250620 2164322 2226478 2030121 1806648 1807769 1816540 1807641 1903645 1944262 1983596
23140 1983596 2121068 2093358 1947349 1983426 2128636 2118877 2122873 1903540 1755451 1874034
23130 1874034 2060770 1994989 1860057 1857264 1983713 1931681 1891448 1781401 1906858 2012215
23120 2012215 1999919 2042544 2065853 2167860 2277837 2268609 2264155 2164368 2117144 2158678 2229090
23109 2229090 2224606 2274570 2214850 2117663 2219985 2363878 2238601 2148211 2166358 2092805 2147740
23098 2147740 2262694 2273036 2209869 2093900 2109279 2340908 2412308 2254251 2354734 2411889
23088 2411889 2374710 2278152 2354831 2308561 2244855 2194138 2259962 2262664 2298786 2264468 2011106
23077 2011106 1914009 1926534 1987964 1962720 2009694 2331201 2515937 2553200 2531887 2489267 2351445
23066 2351445 2432765 2295634 2357576 2280863 2223550 2250930 2357748 2219363 2139502 2018879
23056 2018879 1872052 1935040 2155418 2221876 2413287 2483451 2230537 2078448 1979431 2034150
23046 2034150 2152929 1995900 1836995 2013763 2131701 2239967 2350304 2391762 2213723 2023983
23036 2023983 1987538 2073293 2109682 2151515 2257437 2404727 2330332 2300389 2148073 2281612
23026 2281612 2300987 2354048 2277472 2177990 2147617 1998333 1768242 1826120 2011682 2057558 2167572
23015 2167572 2221469 2028144 1925996 1725983 1593385 1651623 1771793 1921260 1910187 1934751
23005 1934751 1866466 1806635 1855313 1732968 1706713 1496708 1359994 1484403 1673802 1749834
22995 1749834 1597137 1805381 2021098 2008488 2106942 1983611 1754360 1843590 2056475 2215985
22985 2215985 1965712 1942264 1974798 2305995 2361058 2209856 2157069 2201792 2101209 1876115
22975 1876115 2013872 2240416 2425670 2372323 2340069 2334821 2251617 1971389 2009758 2050227 2164473
22964 2164473 2237010 2295307 2189700 2138383 2091529 1950507 1822805 1698826 1814551 1994924
22954 1994924 2058666 1889062 1698418 1804322 1840148 1843012 1768895 1746176 1858519 2010487
22944 2010487 1989984 2034940 2045779 2058902 1949670 1703959 1612393 1633400 1713656 1945281 2025741
22933 2025741 2161489 2334667 2371944 2447692 2534947 2491488 2360383 2252901 2229414 2362520
22923 2362520 2533173 2597313 2616854 2559198 2431988 2364978 2375814 2394952 2262812 2387180
22913 2387180 2439070 2278675 2134186 2111724 2246888 2195035 2044502 2264470 2308851 2249564
22903 2249564 2077654 1868183 1902926 2084524 2104630 2004738 1886505 2059155 2194119 2220823
22893 2220823 2020638 1942123 1851169 1955486 1992537 2139313 2197190 2132384 2033685 2344491
22883 2344491 2415849 2228377 2290893 2327559 2060904 1919242 1912996 1877923 1760802 1671099 1678610
22872 1678610 1804753 1907363 1848800 1846740 1862271 1807197 1853354 1965747 2146822 2373054
22862 2373054 2378406 2382798 2436414 2498803 2650405 2542175 2336653 2167165 2024670 1863127
22852 1863127 2003371 2314699 2353334 2115126 2211307 2290911 2218536 2224312 2304113 2252129 2032998
22841 2032998 2131575 2292208 2330619 2322395 2171702 1883143 1684001 1755046 1961172 1977047
22831 1977047 1884898 1865485 2037571 2000303 1737751 1712704 2023801 2303162 2361172 2244279
22821 2244279 2015375 1843483 1967685 1998478 2134811 2215409 2262289 2380705 2442179 2399393
22811 2399393 2378721 2301172 2062535 2165833 2312459 2277158 2135065 2110949 2047212 2040566 1995778
22800 1995778 1869989 1852592 1870984 2008556 2239899 2570732 2657246 2469456 2240113 2314996
22790 2314996 2304271 2219348 2121203 2084844 2305617 2481597 2529935 2508541 2330083 2252198 2409101
22779 2409101 2364447 2179078 2167112 2240067 2372633 2331322 2273449 2376971 2579506 2433106
22769 2433106 2346998 2347628 2334470 2151551 2148887 2404811 2497677 2449048 2220596 2060637 2128004
22758 2128004 2208674 1934607 1780739 1846656 2054424 2081588 2049760 2091002 2220253 2102537
22748 2102537 2124630 2291031 2325469 2471872 2506476 2429412 2322543 2083926 1748392 2095714
22738 2095714 2202251 2127564 2137366 2260784 2326886 2123104 2103758 2124597 2013577 1961746 2147232
22727 2147232 2432878 2330479 2110769 1969561 1692395 1732291 1997243 2104890 2330445 2352579
22717 2352579 2224436 2227446 2256910 2301952 2316136 2415488 2312746 2098432 2063211 2020051 1884464
22706 1884464 1944626 2185563 2040414 2128944 2254166 2255002 2265945 2128482 2074238 1843167 1696585
22695 1696585 1840230 1968011 2141406 2250111 2057885 2074392 2158164 2178024 2194281 2250695
22685 2250695 2241802 2415740 2304408 2201102 2195458 2334662 2520390 2516087 2564148 2646712 2624658
22674 2624658 2565391 2378885 2309004 2337674 2340628 2455754 2460941 2443011 2372388 2258478 2163975
22663 2163975 2342265 2349213 2230914 2058588 1947343 1999100 2283605 2502980 2252161 2068510
22653 2068510 1988506 1935231 1915307 2087443 2353036 2432479 2446905 2451791 2249478 2062599 2150612
22642 2150612 2323485 2448901 2381661 2364106 2291976 2454909 2316788 2104948 2193316 2144671
22632 2144671 2170320 2021939 2089310 2231839 2341242 2329328 2371462 2261734 2166244 2185594
22622 2185594 2275929 2471187 2481266 2303937 2198143 2298782 2322176 2130793 2073650 2047936
22612 2047936 2171165 2191102 2113623 2181521 2201962 2337215 2574586 2622051 2516057 2203721
22602 2203721 2062059 2143363 2145631 2387591 2371565 2351498 2442201 2719790 2547133 2424255
22592 2424255 2370005 2277632 2213723 2142082 2067323 2089558 2184867 2136536 2391783 2504957 2404290
22581 2404290 2263875 2232537 2222318 2205970 2143480 2206512 2430733 2643518 2459509 2225483
22571 2225483 2160725 1986312 1887852 1950875 2044867 2175471 2256577 2134445 2140392 2264871 2195910
22560 2195910 2282629 2454932 2296679 2328375 2392682 2434201 2262839 2094018 2391410 2411573
22550 2411573 2421526 2530019 2503783 2343980 2210010 2206313 2147451 2208451 2142615 1942195 1964871
22539 1964871 2240301 2257759 2261542 2365170 2369592 2372885 2415414 2348882 2478005 2447718 2308870
22528 2308870 2357048 2245871 2164853 2200650 2160273 2192746 2045796 2012667 2118429 2184058 2182195
22517 2182195 2220013 2140489 2015467 2108815 2260160 2374534 2535622 2444298 2130680 2011541
22507 2011541 2141992 2176448 2178319 2083825 2129060 2293218 2335016 2412323 2271961 2332676 2389752
22496 2389752 2621312 2478497 2122462 2151570 2337012 2303456 2107722 2337378 2340865 2410834
22486 2410834 2635622 2391297 2209924 2198760 2230468 2319670 2307853 2429365 2559220 2306934
22476 2306934 2126632 2065944 2103079 2114311 2036295 2090553 2114516 2144121 2181483 2171366 2235069
22465 2235069 2296327 2286161 2277260 2439399 2542705 2709347 2854563 2689931 2384000 2264222
22455 2264222 2381417 2367992 2196736 2091645 2139503 2421964 2723802 2663184 2519683 2338904
22445 2338904 2386616 2563962 2538533 2284217 2178751 1955026 2031252 2009978 2017459 2088356 2363614
22434 2363614 2555004 2372529 2311333 2441047 2347005 2404293 2410276 2343752 2350011 2342842 2287576
22423 2287576 2439639 2596092 2617146 2642595 2515127 2423912 2337318 2316503 2385600 2534831
22413 2534831 2392636 2302642 2301475 2380443 2466132 2617402 2661950 2446347 2497702 2347379 2369518
22402 2369518 2436091 2495300 2579825 2621405 2581477 2504876 2443133 2290225 2524813 2640712 2785696
22391 2785696 3017381 2820513 2707530 2798124 2679664 2684414 2521129 2322011 2458532 2481519
22381 2481519 2456309 2309545 2163125 2061817 2436461 2586703 2495134 2502130 2364176 2240142
22371 2240142 2176852 2200147 2302579 2302229 2259474 2420341 2532326 2518772 2453051 2454807 2443005
22360 2443005 2322779 2235616 2076302 1964888 2034852 2201594 2251662 2238315 2415289 2561696
22350 2561696 2693974 2542625 2406566 2464971 2533249 2449235 2343070 2348625 2300360 2318189 2369557
22339 2369557 2343722 2289540 2312649 2301692 2378573 2526929 2435410 2358979 2230743 2214169 2288686
22328 2288686 2339551 2252577 2282325 2316635 2309745 2295638 2447895 2435412 2325895 2267807 2168063
22317 2168063 2380921 2591637 2665187 2345116 2383172 2593755 2742391 2801883 2643570 2706407
22307 2706407 2613614 2267272 2339499 2490689 2538304 2490364 2446653 2356632 2473616 2647556
22297 2647556 2591292 2480552 2273031 2400260 2418307 2448184 2411823 2356836 2261961 2401265
22287 2401265 2420867 2487559 2414351 2334852 2480617 2406379 2309672 2258910 2176408 2141313 2193696
22276 2193696 2209141 2254177 2350339 2392392 2357205 2268910 2135065 2243419 2369509 2347652 2314556
22265 2314556 2419196 2613966 2422258 2336604 2384056 2155920 1909552 1993228 2149616 2102230
22255 2102230 2256917 2362449 2275346 2424180 2443396 2400027 2319915 2598593 2843318 2824260
22245 2824260 2660321 2393416 2366216 2438700 2486332 2455729 2621493 2752794 2614782 2457381
22235 2457381 2382924 2308873 2328975 2302188 2289430 2304709 2212699 2126364 2125432 2170767 2122966 2192475
22223 2192475 2349628 2613726 2625339 2567444 2318375 2187326 2251788 2308737 2411073 2451495
22213 2451495 2712921 2821095 2702208 2613583 2444750 2593088 2702104 2673300 2836195 2683864
22203 2683864 2582688 2645821 2391804 2224416 2298404 2266276 2249151 2248771 2319611 2330608 2443061
22192 2443061 2542685 2669214 2585992 2445839 2396088 2517040 2523597 2420617 2330768 2396358 2478947
22181 2478947 2482617 2567130 2578050 2543419 2482740 2330703 2242907 2345032 2320633 2346777 2455639
22170 2455639 2532381 2592167 2536650 2544028 2639962 2668765 2327506 2228985 2237726 2245293 2379920
22159 2379920 2458570 2446136 2490236 2401453 2441889 2380062 2086975 2305008 2580124 2633658 2769160
22148 2769160 2786956 2648792 2297349 2331498 2561634 2443723 2424000 2598135 2496136 2357272
22138 2357272 2346204 2398803 2439727 2471477 2564117 2632869 2668444 2643790 2754720 2703807 2572666
22127 2572666 2457145 2442611 2394897 2437371 2343989 2316543 2364007 2273781 2233856 2036765 2046310
22116 2046310 2169633 2307092 2350883 2383033 2506419 2455720 2238692 2296417 2468505 2563254
22106 2563254 2573551 2616487 2755992 2751883 2596338 2808035 2904665 2825687 2714543 2724928 2676307
22095 2676307 2683771 2662724 2505637 2535484 2584831 2291489 2273814 2427316 2496295 2466095 2313791
22084 2313791 2318048 2455225 2595179 2630514 2530275 2354916 2409286 2682717 2688707 2274409
22074 2274409 1992601 2096452 2326670 2674588 2687438 2443812 2582340 2611191 2433221 2261903
22064 2261903 2274472 2482831 2549391 2608814 2687310 2405654 2497048 2333101 2506924 2547130
22054 2547130 2597931 2720820 2694597 2599194 2574770 2602861 2571779 2620104 2782199 2766251 2749602
22043 2749602 2889771 2987020 2948397 2887804 2820204 2519601 2466731 2436529 2344305 2446682 2480481
22032 2480481 2453083 2511549 2607679 2560558 2424858 2432209 2590931 2793433 2779275 2897830 3131905
22021 3131905 3011605 3002151 2994488 2943796 2745256 2621241 2653619 2671047 2737641 2624683 2528144
22010 2528144 2437158 2479177 2635265 2679693 2640690 2645642 2653424 2604468 2411834 2552340 2653686
21999 2653686 2793595 2777004 2667846 2497926 2585457 2631802 2717123 2675701 2656699 2677414 2596859
21988 2596859 2255335 2162834 2195464 2283403 2315230 2510658 2645682 2517432 2500672 2521345
21978 2521345 2519306 2360785 2620156 2756722 2779052 2670308 2577534 2357859 2228994 2253633
21968 2253633 2376684 2427634 2591558 2868583 2953760 2949104 2904425 2593114 2410828 2408469 2353412
21957 2353412 2232890 2332684 2625371 2705042 2749052 2644024 2635892 2645580 2720346 2713522 2692785
21946 2692785 2674631 2440040 2432647 2360677 2490485 2625847 2622647 2562903 2500705 2404948 2286127
21935 2286127 2390138 2379252 2432410 2798946 2903776 2501130 2447212 2649025 2702247 2826911
21925 2826911 2920414 2828390 2570649 2577816 2403958 2493201 2536453 2556904 2820050 2857607 3088905
21914 3088905 3117776 2926630 2964351 2898833 2783205 2629062 2575055 2779011 2971365 2934183
21904 2934183 2688951 2548050 2598228 2636080 2721967 2712830 2634851 2563192 2698628 2720843 2567731
21893 2567731 2376843 2296052 2247405 2281481 2318194 2512086 2600225 2508566 2485762 2684341 2641534
21882 2641534 2397974 2423429 2499973 2776956 2660881 2566295 2599867 2695669 2780267 2658104
21872 2658104 2560013 2419861 2343023 2467920 2571086 2592041 2488239 2396523 2399600 2288175
21862 2288175 2254959 2475205 2647080 2735769 2554021 2597271 2766672 2901086 2907654 2837683
21852 2837683 2889527 2822195 2667118 2643592 2730667 2844239 2765585 2554420 2637269 2789423
21842 2789423 2757252 2578257 2563238 2567382 2525690 2504948 2563039 2484009 2500788 2724514 2790587
21831 2790587 2715761 2797320 2753080 2756347 2858632 2897844 2733893 2614427 2696949 2790172 2862769
21820 2862769 2882796 2800432 2577582 2483632 2362713 2451762 2440704 2419714 2707467 2821066
21810 2821066 2994344 3050104 2923889 2828988 2751536 2576985 2651658 2771839 2818645 2824872 2817375
21799 2817375 2768496 2753844 2606635 2432954 2550856 2649296 2635789 2639447 2722618 2773444 2824919
21788 2824919 2793073 2664935 2586318 2430534 2570687 2696854 2631900 2717540 2972839 3241261
21778 3241261 3237455 3123762 3042836 3178124 3335009 3318133 3048782 2756959 2645891 2773261
21768 2773261 2847916 2848294 2941628 3043635 3152640 3168133 3040317 2826466 2937008 2834106
21758 2834106 2724856 2866934 2814149 2892546 2789183 2640109 2642606 2744049 2909589 2881832
21748 2881832 2812886 2871078 2735397 2686972 2576679 2615206 2714853 2690758 2572719 2615850 2814090
21737 2814090 2704093 2484706 2737206 2999048 3074115 2809314 2700267 2674124 2431209 2305335
21727 2305335 2477795 2638247 2669201 2627176 2451100 2575166 2731211 2657529 2698826 2624100
21717 2624100 2794312 2936813 2664952 2481292 2314824 2372109 2537399 2609873 2632598 2491655
21707 2491655 2451367 2654214 2449247 2346881 2508234 2614698 2539930 2563120 2723020 2904490
21697 2904490 2966174 2972487 2797560 2789820 2812449 2844942 2841585 2881922 2591076 2768895 2935117
21686 2935117 2997707 3039825 3138264 2934705 2880746 2950186 2913075 2735542 2721730 2798056 2817632
21675 2817632 2765463 2671357 2764115 2680645 2696157 2946705 2997273 2820080 2598702 2447993
21665 2447993 2441161 2545431 2782095 2859404 2807866 2874729 2793113 2703718 2725701 2999506 3186706
21654 3186706 3115371 3009545 3117407 3020104 2870483 2896337 2757551 2810674 2894201 2828951
21644 2828951 2769322 2747372 2812374 3034596 3101522 3018819 2916240 2856044 3001820 3125811
21634 3125811 3219705 3187346 3129137 3105060 2880516 2901059 3025965 3177236 3184077 2920177 2789716
21623 2789716 2612316 2546789 2636091 2640450 2822438 2715113 2669798 2699902 2799565 3021487 3112052
21612 3112052 3024283 2758332 2529145 2459036 2519080 2595535 2576716 2574881 2712073 2938249 2967535
21601 2967535 2840767 2706914 2589688 2570988 2611547 2690897 2594917 2724127 2763465 2718195
21591 2718195 2668583 2612530 2600885 2662349 2642228 2861441 3171440 3132248 2900353 2576608
21581 2576608 2547029 2610124 2648245 2731416 2854625 2979352 3219337 3189489 3074681 2910966
21571 2910966 2870007 2924104 2936439 2690677 2620270 2747143 2715176 2886638 3017123 3235654
21561 3235654 2951843 2746803 2836017 2913414 3091972 3324316 3279304 3201341 3247374 3207007
21551 3207007 2913833 2766217 2934562 2984723 2888707 2926185 2952856 2811245 2958243 3151342
21541 3151342 3194747 3358261 3185628 2971945 2822284 2752829 2922275 3145071 3064330 3082100
21531 3082100 3085681 3092446 2948070 2921080 3102017 3183823 3097049 2935094 2772235 2984056 2948578
21520 2948578 3077514 3165291 3252265 3084735 3022774 2990207 2853826 2778476 2811824 2873602 2838032
21509 2838032 2840363 2852778 2806143 2846651 2869766 2922229 2834049 2811349 2829195 2791100 2712750
21498 2712750 2946034 2968954 2861439 3043908 3092289 2900320 2922107 2875509 2833877 2744784
21488 2744784 2922585 3082096 3014260 2929184 3052052 3174724 3119303 3197804 3271928 3405819
21478 3405819 3170006 3071236 3054499 3120505 3061328 2982653 3069396 3103920 3178087 3117710 2946656
21467 2946656 2814735 2978396 2946510 2899216 3155127 3299338 3167949 3032151 2976940 2992797
21457 2992797 2978106 2896623 2901796 2823847 2661316 2682099 2778840 2774161 2798769 2817613 2904278
21446 2904278 2883487 2726303 2793293 2672495 2783850 2933570 2983714 2796371 2563982 2844461
21436 2844461 3176454 3372460 3340508 3265468 3339739 3165171 3072335 3026154 2977865 3121834
21426 3121834 2916634 2692567 2758082 2986626 3009204 3045789 3334789 3318687 3059121 2977771
21416 2977771 2852896 2672513 2913974 2977677 3091573 3174251 2968584 2911700 2813079 2696234
21406 2696234 2954274 3121913 3151170 3026423 2880422 2706833 2641701 2866460 2698459 2756810
21396 2756810 2775330 2623624 2673689 2810228 2670679 2612120 2706287 2711518 2706440 2699067 2758310
21385 2758310 2998247 3098160 2931660 2910662 2963158 2890115 3041287 3085232 3035166 3075388 3081607
21374 3081607 2918732 2921650 2821694 2952528 3237069 3346968 3324908 3321063 3277912 3156768 2980591
21363 2980591 3109634 3175791 3155193 3207535 3113672 3104680 3243373 3285575 3298999 3436293 3435836
21352 3435836 3411781 3179102 3092950 3303558 3271912 3219689 3212756 3210093 3277468 3320879 3283112
21341 3283112 3188580 3170754 2921622 2814914 2849115 2817340 2908084 3018225 3206176 3075813
21331 3075813 3167365 3090959 2979525 3041696 2913612 2918324 3040112 3169765 3355882 3187247
21321 3187247 3215878 3303309 3367115 3306171 3323417 3263126 3052429 2993863 3141981 3096641 2820836
21310 2820836 2863995 3001515 3063712 3132529 3292392 3614423 3752139 3503980 3284236 3088288
21300 3088288 2955056 3111808 3228822 3196517 3130862 3180205 2948618 3082342 3118894 3177081
21290 3177081 2949743 2694107 2909330 3130676 3301875 3288183 3208244 3123630 2996073 3079812
21280 3079812 3282541 3260164 3289432 3458345 3501737 3319691 3246897 3307322 3269640 3288730 3346613
21269 3346613 3198882 2940958 2950840 3408832 3506049 3563670 3590594 3341629 3224869 3279059
21259 3279059 3109207 2999603 3165543 3259012 3310789 3291272 3193481 3179670 3336268 3445385
21249 3445385 3403234 3186469 3007857 2779292 2695827 2901196 3006342 3103282 3249887 3305014
21239 3305014 3337596 3559419 3424633 3158308 2838715 2808705 2983683 3033504 3128320 3066000
21229 3066000 3017264 3355380 3393382 3201676 3145322 3286588 3250384 3214500 3153051 3048542
21219 3048542 3193915 3248762 3269160 3338668 3495712 3440504 3229350 2993279 3078953 3121076
21209 3121076 3075250 3096974 3200304 3221705 3358066 3453245 3527134 3486756 3543720 3447918 3150265
21198 3150265 3020260 3079317 3108642 3103927 3132194 3271677 3455410 3430365 3282075 3163886
21188 3163886 3076150 3242277 3325284 3316743 3216520 3163421 3192088 3286644 3374200 3367382 3338026
21177 3338026 3345061 3274898 3199624 3192489 3293183 3272829 3409201 3599053 3330913 3122555 3219352
21166 3219352 3321852 3379614 3498231 3666863 3562980 3493867 3323503 3175644 3333322 3411086
21156 3411086 3482888 3470383 3405633 3478954 3410048 3438193 3624423 3446680 3345457 3526331
21146 3526331 3488556 3380540 3397797 3345461 3233803 3157991 2947310 2934496 3005889 3262381
21136 3262381 3231243 3127580 3159183 3238205 2999651 3094825 3301443 3358229 3493119 3449495
21126 3449495 3428490 3464944 3504926 3347178 3204015 3115249 3107362 3326403 3379553 3170512 3223326
21115 3223326 3379364 3372883 3165493 2978122 3104933 3496423 3445602 3223017 3057633 3083695
21105 3083695 3118584 2928310 3165413 3206434 3012866 3009622 3241033 3554436 3463976 3297865
21095 3297865 3508615 3464247 3119776 3080021 3093201 3006980 2920166 2969304 3055152 3286823 3381119
21084 3381119 3333113 3214717 3125517 3255986 3213011 3197407 3130614 3091609 3041537 3054361 3216045
21073 3216045 3093422 3095922 3076937 3193487 3017908 2983613 3172630 3434908 3391135 3260272
21063 3260272 3160145 3181053 3189277 3293819 3307559 3265259 3330568 3356542 3493414 3517012 3476608
21052 3476608 3558732 3573285 3539315 3430067 3192967 3066409 2981905 3064963 3342537 3326501
21042 3326501 3378334 3239045 3148534 3425278 3426841 3358374 3396169 3450535 3664250 3524762 3416766
21031 3416766 3395788 3426231 3576670 3632915 3722250 3561415 3421129 3433342 3458269 3590300
21021 3590300 3456659 3314839 3481431 3570321 3482375 3518765 3588377 3727160 3904988 3884802
21011 3884802 3767601 3721038 3763508 3603571 3399862 3425373 3574068 3544820 3672363 3607287
21001 3607287 3623213 3644673 3494167 3486704 3317041 3293001 3393608 3519826 3618230 3843506
20991 3843506 3723891 3308509 3338313 3535598 3547935 3569062 3694001 3768623 3776125 3794162 3671037
20980 3671037 3502303 3481817 3544938 3584047 3570727 3464601 3643570 3654748 3547490 3670078
20970 3670078 3873564 3972405 3852340 3471850 3348965 3512605 3441734 3354406 3409660 3570703
20960 3570703 3622076 3603757 3479083 3495500 3547596 3634740 3780232 3742462 3656166 3734623 3789573
20949 3789573 3801927 3778941 3926309 3759347 3466837 3580011 3732833 3747486 3846423 3889607
20939 3889607 3655139 3616839 3648968 3603652 3566871 3587058 3743625 3724271 3624991 3420592 3349258
20928 3349258 3335085 3544152 3508177 3593673 3696785 3600883 3415397 3403518 3450037 3454442 3481824
20917 3481824 3467196 3623745 3499100 3502535 3583477 3696366 3479881 3476991 3643194 3511819
20907 3511819 3490328 3755807 3673310 3644244 3542639 3524513 3448587 3549704 3737988 3570145
20897 3570145 3361759 3322238 3217697 3382725 3634241 3539210 3505339 3586176 3640379 3751086
20887 3751086 3873497 3855627 3889217 3712848 3785702 3690424 3662172 3830496 3870560 4009100
20877 4009100 3899428 3673270 3573172 3723508 3725609 3629032 3439215 3197303 3272551 3443863
20867 3443863 3515311 3515220 3532273 3627637 3718181 3504109 3469516 3344758 3374583 3641279 3868373
20856 3868373 3921219 3893671 3622928 3622613 3439915 3462180 3632931 3388068 3446549 3628507 3600029
20845 3600029 3424022 3420773 3448968 3534251 3669899 3767838 3745564 3669862 3644618 3630161 3458201
20834 3458201 3481628 3585988 3590903 3519435 3674246 3559810 3532054 3673699 3874889 3717430
20824 3717430 3660796 3437058 3474376 3524587 3449031 3412082 3424748 3640843 3830354 3903801 3975669
20813 3975669 3842210 3621385 3745716 3950659 4061738 4009214 3701309 3645446 3834902 3930837
20803 3930837 3878405 3907517 3921516 3784743 3627163 3521922 3642452 3828391 3791416 3748772
20793 3748772 3802151 3770247 3618120 3631289 3714050 3925155 3859807 3833182 4008973 4006626 3769587
20782 3769587 3626554 3710209 3744979 3728015 3317916 3248495 3623447 3793439 3867359 3968229
20772 3968229 3906711 3885978 3813697 3710109 3808998 3714407 3494287 3641040 3752989 3581496
20762 3581496 3460722 3524257 3619106 3564343 3821497 3903835 3803677 3825294 3599614 3566842
20752 3566842 3592906 3741109 3830896 3843969 3827112 3724811 3971872 4217488 4247137 4164988
20742 4164988 4253848 4126879 3783390 3868030 3842343 3664188 3700469 3737990 3750743 3607891
20732 3607891 3493795 3662256 3692850 3754496 3845594 3866791 3718752 3695291 3792655 4038543
20722 4038543 3953659 3964799 3948086 3875687 3787215 3875996 3858434 3727746 3629255 3612307 3773398
20711 3773398 3785381 3732626 3827458 3780387 3690713 3705854 3730622 3921037 3986124 4143740 4209257
20700 4209257 4087689 4133085 4046979 4056801 4006552 3794810 3754374 3976582 4139512 3995027
20690 3995027 3867679 4112706 4107322 4153964 4222698 4124158 4049685 4136188 4295681 4257798 4015205
20679 4015205 3820566 3953307 3843208 3695728 3593657 3722245 3778773 3656267 3767151 3878793
20669 3878793 3941560 3967014 3935897 3813065 3804987 3718662 3781273 3895194 3897143 3920820 4062157
20658 4062157 4081398 3915553 3960433 4117885 4135482 4053752 4070389 3964044 4018698 4117535 3935811
20647 3935811 3673076 3698355 3917758 4019313 4035062 3956020 3978881 3803329 3805729 3948219
20637 3948219 4055794 3789837 3618460 3648477 3904133 4066744 4190820 4499201 4480063 4241494
20627 4241494 4231696 4171818 4256129 4061651 4037632 4076259 4186145 4142199 4118988 3923993 3945959
20616 3945959 4071613 4209100 4185288 3983578 3861289 3939505 3916333 3899161 4023988 4106399
20606 4106399 4159421 4308337 4303629 4191785 4163324 4224139 4226548 4350829 4313527 4179512 3821358
20595 3821358 3664113 3712899 3805526 3973374 4018532 4044454 3911039 3792748 3922383 3821608
20585 3821608 3902647 4181832 4181326 4146724 4178534 4171954 3950962 4001287 4125333 3987870 3887725
20574 3887725 4129823 4409340 4258974 4202514 4103769 3993516 3971941 3798341 3907555 4079491
20564 4079491 4094290 3995042 4120776 4169303 4342039 4366535 4290730 3936860 3694729 3654203
20554 3654203 3972632 4234031 4237478 4218795 4096864 3890897 3843047 4018991 4052580 4086450
20544 4086450 3942999 3868880 4031545 4007449 3958056 4002048 3901565 3823236 4141473 4379215
20534 4379215 4464546 4364796 4180488 4251024 4135891 4295017 4551213 4839039 4726089 4504821
20524 4504821 4668266 4807373 4629695 4546982 4527286 4499605 4266519 4232033 4191288 4302984
20514 4302984 4402216 4446055 4475586 4369939 4310794 4464218 4467072 4467325 4403461 4403865 4207926 4114406
20502 4114406 4012545 4144317 4218782 4249419 4341508 4374078 4323704 4175028 4220006 4384676
20492 4384676 4309614 4260410 4118845 4161634 4092625 4077128 4308754 4166246 4152267 4286708
20482 4286708 4184771 4158916 4149955 4028487 4006924 4063517 4355087 4401688 4323427 4345810 4336936
20471 4336936 4182958 4213991 4080582 4000387 4133445 4217951 4179200 4148484 4320941 4459044
20461 4459044 4441497 4450657 4529031 4468154 4308224 4258657 4327578 4408329 4504394 4465741 4478300
20450 4478300 4470918 4388900 4325069 4301337 4290295 4173174 4135295 4057918 3995033 3842278 3961735
20439 3961735 4128872 4261891 4573097 4402174 4061536 3863040 3884048 3997490 4007508 4121831
20429 4121831 4239917 4241502 4207679 4337209 4299060 4203125 4434612 4558508 4557419 4744450 4636053
20418 4636053 4458921 4357429 4452492 4627332 4538637 4409973 4346644 4277098 4327392 4535472
20408 4535472 4476076 4234443 4347949 4396541 4356671 4425142 4389655 4324231 4430147 4328601
20398 4328601 4344991 4443746 4513976 4431718 4470813 4289915 4417759 4528271 4707125 4539426
20388 4539426 4500487 4556175 4411451 4464394 4512379 4669634 4772611 4627438 4658989 4699642
20378 4699642 4513593 4557752 4589326 4687985 4668659 4369526 4304676 4349721 4335224 4330557 4361068
20367 4361068 4430596 4434358 4392231 4208850 4056917 4079204 4262697 4305625 4606190 4757203
20357 4757203 4593586 4270715 4084232 4139543 4509864 4720689 4741555 4513363 4482573 4795274
20347 4795274 4959724 4998549 5106418 5073957 4987782 4736865 4616321 4656351 4666864 4625572
20337 4625572 4617331 4629691 4837761 4763257 4598413 4453982 4404571 4436884 4449076 4471598 4580429
20326 4580429 4754054 4668930 4644426 4712346 4752215 4835867 4836154 4834396 4504021 4352424 4346785
20315 4346785 4284386 4502316 4746299 4647442 4533895 4564014 4824081 5085497 5033039 4771063
20305 4771063 4853783 4990157 4899989 4888543 4967311 4704705 4523534 4522022 4560387 4437336 4508241
20294 4508241 4659977 4790216 4919100 4881860 4785697 4657044 4690315 4778409 4825684 4837624
20284 4837624 4805326 4883544 4798519 4617660 4573578 4261414 4301396 4488697 4700730 4876100
20274 4876100 4707560 4816297 4907771 4943642 4861765 4956939 4891094 4679383 4699721 4707136 4489170
20263 4489170 4389198 4314825 4304333 4528234 4624908 4757851 4996745 4980455 5115397 5104658
20253 5104658 4974603 5039949 5059547 5171704 5101098 5065277 5057818 5132686 4965712 4872981 4852253
20242 4852253 4912792 4857503 5040204 5200337 5197488 5257885 5217307 5075776 4880092 4792256 4796856
20231 4796856 4817241 5006194 5012942 4767274 4641835 4729207 4904875 4934613 5131193 5107547
20221 5107547 4944658 4845305 4842638 5011317 5107900 5164910 5099159 4957253 4903653 5056873 5031196
20210 5031196 4763384 5077339 5177042 5225461 5273005 5012510 4648322 4529477 4591317 4672240
20200 4672240 4824890 4827483 5064554 5133118 5162678 5080047 5055308 5167071 5224162 5462727 5366934
20189 5366934 5169151 5055052 5079211 5133656 5075183 4917342 4996234 5136355 5025100 4793742
20179 4793742 4809021 5035696 5176516 5122449 5030377 5010477 5044708 5014834 5040082 5104675 5148122
20168 5148122 5206854 5356456 5467796 5487817 5394924 5192277 5149812 4935109 5134303 5543527
20158 5543527 5833178 5790836 5534455 5320280 5163498 5109632 5086519 5075254 5205482 5295361
20148 5295361 5469266 5441785 5321400 5347730 5322153 5308993 5313234 5214913 5191363 5395206 5393671
20137 5393671 5330216 5164612 5156017 5129481 5159191 5232900 5426161 5486725 5219166 5242906 5417662
20126 5417662 5384119 5400618 5386402 5252762 5159533 5087808 5285188 5390707 5336270 5412005 5474145
20115 5474145 5651929 5594185 5615813 5687592 5643204 5580767 5530831 5554689 5580281 5581271 5491263
20104 5491263 5364141 5262724 5315970 5471371 5447047 5500402 5584028 5583437 5466331 5379307 5518638
20093 5518638 5484872 5353930 5509496 5805250 5874914 5540371 5243982 5277252 5250898 5433263
20083 5433263 5485501 5418924 5305195 5437172 5572876 5662479 5522103 5549344 5671705 5762205
20073 5762205 5875408 5891985 5826540 5997593 5850217 5581649 5669424 5805374 5687771 5464129
20063 5464129 5627479 5681670 5420930 5493256 5567426 5573620 5658046 5596777 5483972 5453739 5428986
20052 5428986 5368166 5462724 5593656 5716718 5779873 5921943 6042422 5985430 6061115 6131511
20042 6131511 6114112 6018244 5693638 5757551 5729047 5613601 5529345 5665881 5942582 5981688
20032 5981688 5936701 5725115 5555712 5565498 5666088 5783766 5855257 5843124 5908922 5944780 6018115
20021 6018115 5956179 5996284 6084132 6140733 6183440 6124230 5981139 5853141 5752852 5575465
20011 5575465 5620387 5807715 5792337 5637001 5592477 5721215 5820135 5727453 5813846 5974790
20001 5974790 5963474 6086876 6153517 6084914 6010531 5891280 5778009 5898699 5788241 5694083
19991 5694083 5898293 5862893 5562234 5457335 5547103 5703450 5693614 5580397 5695346 5790404
19981 5790404 5823731 5820495 5862895 6069367 6041049 6150108 6158278 6042846 5988913 5966471 5901447
19970 5901447 5733510 5751394 5788809 5848571 5993092 6196714 6325083 6117494 5942660 6020759
19960 6020759 6020193 6044791 6230401 6397008 6273163 6044780 6180150 6346282 6260220 6226174
19950 6226174 6266191 6368476 6371051 6373657 6374780 6372196 6352353 6070534 5990027 6060986 5938916
19939 5938916 5969145 6339959 6447008 6524591 6568114 6395289 6382555 6515493 6521673 6633531
19929 6633531 6653895 6580373 6527469 6492194 6517336 6488705 6479077 6587480 6571258 6881591 6886813
19918 6886813 6674973 6485737 6358536 6297091 6373477 6431702 6200931 6091166 6002261 5726432
19908 5726432 5917924 5994142 5949651 6032593 6210327 6334814 6389888 6445022 6385495 6381848 6298087
19897 6298087 6014287 5854039 5944265 6000823 5977740 6094516 6186507 6553991 6640647 6493566
19887 6493566 6464128 6456562 6483532 6569550 6517883 6618123 6478771 6517478 6614865 6655039 6577942
19876 6577942 6768003 6723820 6706043 6700820 6669994 6708816 6705751 6808963 6885266 6968589 6809457
19865 6809457 6760940 6614354 6690236 6747864 6765481 6578743 6455889 6459638 6542637 6401655 6393130
19854 6393130 6376060 6270680 6188209 6381146 6590761 6497413 6653916 6828679 6723371 6639368
19844 6639368 6666911 6528379 6532973 6736049 6842388 6928029 6941233 6755143 6486425 6407629
19834 6407629 6667371 6761038 6658041 6569689 6474311 6694353 6716224 6691474 6844568 6847869 6910425
19823 6910425 6871365 6716620 6753103 6803995 6844780 6789836 6815611 6994180 7215387 7129483 7011198
19812 7011198 6749179 6794287 6952637 6710303 6489792 6589311 6826733 6986622 6948790 6975495
19802 6975495 6991660 6892242 6935668 7012618 7048644 7067715 7084937 7191779 7266457 7319635 7488093
19791 7488093 7314286 7124899 7047996 7217321 7407152 7406677 7207628 7089560 7324405 7411642
19781 7411642 7467812 7437133 7404838 7108678 6988841 6979460 7056815 7160909 7200882 7342328 7146270
19770 7146270 7109614 7110790 7139647 7341407 7431783 7464401 7488564 7416785 7536370 7763657 7768290
19759 7768290 7501770 7181102 7161490 7226553 7354283 7362386 7276048 7488325 7591445 7491057
19749 7491057 7481403 7502150 7488411 7383191 7342017 7363329 7451697 7580319 7527275 7664267 7706938
19738 7706938 7527804 7713431 7919479 7870006 7797773 7727259 7827777 8045461 8160038 8060649
19728 8060649 8030351 8065900 7969461 7904883 7814439 7698937 7561979 7686116 7976652 8213194
19718 8213194 8185905 8096940 8172086 8115477 8204600 8202430 8167504 8210048 8258769 8151183 8039109
19707 8039109 8081400 8231138 8385219 8444878 8527641 8327333 8167218 8135549 8107466 7899195
19697 7899195 7845563 8171203 8334011 8534121 8525874 8423972 8438450 8644969 8599530 8492993
19687 8492993 8478676 8623910 8530316 8527713 8645400 8658526 8497735 8362661 8560168 8497573
19677 8497573 8565611 8692943 8595631 8569108 8608155 8697695 8749243 8605905 8625000 8577263 8844326
19666 8844326 8910498 8821363 8813989 8912997 8960715 8970874 9024676 9061577 9009687 9075759 9245492
19655 9245492 9284597 9145669 9037992 9064990 8875611 8818474 8685098 8717672 9103292 9292791
19645 9292791 9256883 9276203 9083550 9290500 9436626 9477403 9266001 9299242 9375524 9464934
19635 9464934 9560349 9509776 9369169 9268789 9411439 9625879 9581578 9631985 9773881 9767051
19625 9767051 9785814 9916040 9763720 9846726 9857690 9858641 9890289 9927474 10017738 9876060 9763998
19614 9763998 9929879 10000711 9809548 9639232 9723040 9821374 9868001 9840106 9780676 9679351
19604 9679351 9885657 10042890 10072731 9908860 9938212 10141648 10329993 10303903 10227637 10226212
19594 10226212 10302549 10379222 10465431 10606786 10603003 10592525 10794143 10876828 10418917 10227780
19584 10227780 10592184 10752110 10743726 10665995 10492501 10592067 10705740 10774792 10726677 10653879
19574 10653879 10953628 11059686 11139207 11147023 10993891 11140494 11215579 11224322 11308591 11459515
19564 11459515 11255818 11253251 11278769 11522780 11811568 11609703 11486422 11480891 11490924 11508695
19554 11508695 11687858 11756286 11798498 12033792 12494397 12573808 12606860 12663430 12544068 12357516
19544 12357516 12206988 12218424 12280023 12415983 12590145 12598271 12755251 12796314 12856629 12868911
19534 12868911 13128389 13049981 12877393 12933432 12940396 12972431 12869595 12984573 13134537 13074215
19524 13074215 13093003 13179195 13283011 13292077 13397237 13604498 13742030 13826734 13861509 13940280
19514 13940280 14148841 14286389 14360457 14309658 14318972 14273220 14378912 14472353 14403386 14360955 14594606
19503 14594606 14753875 14899363 15030308 15040145 15105480 15153032 15356757 15501540 15637019 15732238
19493 15732238 15784110 15851001 16033625 16053577 16054148 16147783 16151255 16317210 16487133 16745692 16926737
19482 16926737 16933829 16977444 17173561 17328469 17326841 17489436 17659474 17966449 18115415 18191259
19472 18191259 18283231 18602390 18819106 18855494 18882128 18932286 19253494 19391013 19604305 19771735
19462 19771735 19987947 20399381 20462724 20597055 20955986 21320115 21624962 21958985 22241585
19453 22241585 22711832 23030262 23153793 23363583 23613955 24009213 24516195 24800959 25155297
19444 25155297 25602849 26118944 26686970 26977350 27367799 27868663 28265314 28826731 29668781
19435 29668781 30348685 30827201 31280505 31760797 32456541 33458957 34404027 35504958 36468175
19426 36468175 37416643 38315807 39382511 40706963 42475538 44398755 46485188 48710293
19418 48710293 51231668 54281157 58076436 62415347 67003661 70936467 71463621 65705899
19410 65705899 61158757 64675478 70966540 72672036 61452829 39683016 22677518 15071025
19402 15071025 17755515 20184402 12346519 -6573312 -30907915 -40734931 -35834591 -28900586
19394 -28900586 -26460352 -32137700 -38774424 -37501604 -32503201 -27278754 -23114966 -19584118
19386 -19584118 -16213305 -12953108 -10070489 -7529308 -5264595 -3361935 -1591857 277380
19378 277380 2174144 4002195 5643051 6974204 8447335 10073850 11957671 13798799
19370 13798799 15579610 17412939 19530362 21696446 24273613 27170829 30112364 33381571
19362 33381571 37482751 42387293 47759004 52635784 54599941 49664021 43292876 46034144
19354 46034144 53558157 59221530 53845611 27928868 -3148054 -12343508 -4965759 2733539
19346 2733539 -1327381 -27731128 -61315312 -71287256 -65136251 -57135250 -53170440 -57746696
19338 -57746696 -65875484 -66092522 -61326179 -55974409 -51567729 -47910937 -44561922 -41643833
19330 -41643833 -38804923 -36220255 -34216561 -32582953 -30920915 -29551643 -28209297 -26961405
19322 -26961405 -25809939 -24597089 -23658376 -23051106 -22196782 -21447698 -20838624 -19871394 -18991762
19313 -18991762 -18390918 -17873517 -17786443 -17265280 -16538678 -15896169 -15315804 -14717538 -14137611
19304 -14137611 -13749712 -13575957 -13021370 -12650076 -12353389 -11950049 -11565941 -11465823 -11306303
19295 -11306303 -11024278 -10771260 -10400047 -9878037 -9670326 -9403947 -9095843 -8880286 -8778342
19286 -8778342 -8550160 -8429619 -8379777 -8126400 -7756385 -7488788 -7120295 -7002504 -6942560 -7037092
19276 -7037092 -6829660 -6567277 -6398920 -6275825 -6068135 -5837702 -5869856 -5703311 -5496265 -5410311
19266 -5410311 -5318263 -5048101 -5029357 -4893203 -4737293 -4595479 -4358241 -4325579 -4290054 -4187937
19256 -4187937 -4159974 -3833030 -3686229 -3345945 -3398385 -3468180 -3398483 -3210107 -2984713 -2826876
19246 -2826876 -2702821 -2712136 -2691945 -2782680 -2829970 -2652944 -2564719 -2477055 -2478418 -2458135 -2320508
19235 -2320508 -2276388 -2104318 -2024175 -1825227 -1790392 -1704815 -1531693 -1406260 -1380723 -1386727 -1380193
19224 -1380193 -1545116 -1319554 -1282151 -1046136 -865397 -846332 -964138 -1063812 -1069441 -981391
19214 -981391 -837729 -652605 -792874 -776502 -546915 -389414 -355029 -207140 -251429 -105753
19204 -105753 139778 208681 143146 123469 73939 99580 131164 27965 130278 267355 321434
19193 321434 410810 383882 394875 386254 296574 398576 537664 663374 874626 1141206 1115494
19182 1115494 1069841 940711 965417 879043 840941 849657 1023857 1226038 1347983 1223434
19172 1223434 1124913 1142880 1144056 1283196 1583831 1756935 1756970 1719286 1682022 1650069 1500328
19161 1500328 1541500 1667153 1677368 1708023 1870878 2017175 2046403 2052507 1975664 2229434 2230460
19150 2230460 2185642 2234747 2144957 2103248 2188653 2199493 2332079 2325415 2395518 2472546 2418102
19139 2418102 2439532 2093637 2007011 2034484 2269700 2479820 2790979 2908930 3020955 2729865
19129 2729865 2462254 2433979 2450140 2460769 2627935 2771181 2904437 3247845 3035864 2963501
19119 2963501 2991286 3056309 3086718 3142268 3397963 3452534 3597831 3745983 3716462 3569523
19109 3569523 3463028 3439781 3593021 3632636 3816218 3825904 3884881 3966041 3883665 3656196 3616953
19098 3616953 3803024 4079334 4032121 3839375 3639811 3485598 3575986 3655400 3780037 3836506
19088 3836506 3674369 3544090 3464329 3362423 3531913 3879759 4057080 3903013 3669281 3876993
19078 3876993 4121334 4201894 4272311 4360437 4176946 4079020 4151196 4213887 4476222 4735255
19068 4735255 4858729 4599111 4312779 4145411 4362445 4736035 4963630 4971519 4889557 4775716
19058 4775716 4670215 4560746 4587076 4406127 4477285 4665858 4823850 4944568 4954133 4908253
19048 4908253 4847054 4806813 4810548 4873544 4910123 4868526 4920392 4918167 5045905 5173317 5179413
19037 5179413 5327078 5477999 5455707 5344476 5370654 5145882 5078335 5377689 5437578 5432618
19027 5432618 5503390 5461644 5352050 5285864 5297052 5026933 4915329 5050336 5153667 5162614
19017 5162614 5031555 4999708 5162195 5161102 5000445 4867180 5011993 5122647 5195235 5162632
19007 5162632 5346777 5361635 5434437 5516946 5325644 5222812 5334861 5371594 5497330 5337996
18997 5337996 5192366 5465093 5607977 5828748 5805324 5799325 5905957 6085977 6110386 6214365
18987 6214365 6275667 6055797 6037930 6149844 6221339 6120398 5935505 6205672 6281804 6355085
18977 6355085 6446539 6590749 6576762 6551133 6628191 6545612 6575012 6440128 6003723 5845624
18967 5845624 6188715 6396363 6046151 6041190 6114333 5819315 5613051 5862568 5795573 5797520
18957 5797520 6207607 6461995 6482641 6449467 6382741 6463642 6587741 6666755 6428109 6147119
18947 6147119 6092080 6298757 6300212 6475579 6648631 6843070 6826430 6705029 6848826 7073949
18937 7073949 7075559 7048600 7122714 7238615 7300587 7138170 7053901 7124812 7053406 7168382 7548499
18926 7548499 7596558 7377159 7439194 7675785 7593114 7488600 7411249 7425607 7484872 7654529
18916 7654529 7727624 7805119 7691351 7528114 7356946 7467740 7442168 7562970 7634940 7704301
18906 7704301 7710273 7811509 7819831 7872062 8141117 8198483 8350328 8430686 8330304 8186754 8282733
18895 8282733 8350186 8266321 8315147 8300661 8485382 8610522 8579855 8497701 8269132 8339586 8313468
18884 8313468 8363701 8372234 8098121 8101388 8121999 7984658 8031814 8029140 8198912 8270663 8312550
18873 8312550 8387149 8275928 8212943 8190485 8176854 8425900 8725633 8671759 8398358 8366434
18863 8366434 8531420 8720251 8627188 8725373 8961731 9189102 9228877 9191217 9405953 9448058
18853 9448058 9239861 8967345 8960060 9140374 9086538 8992816 9126175 9317284 9563885 9606510
18843 9606510 9638718 9784910 9865292 9899799 10016715 10010747 9908544 9810786 9664787 9805196
18833 9805196 9915681 9875125 9806015 9698099 9680112 9875712 10022892 10129999 10019010 9878189
18823 9878189 9905257 9847685 9720365 9587040 9580302 9849300 9870891 10177322 10208266 10086641
18813 10086641 10132728 10217794 10314707 10177983 10115976 10381046 10640224 10683977 10692966 10759039 10909292
18802 10909292 11013607 10818862 10785074 10826173 10776491 10743055 10812615 10998885 11281791 11396964
18792 11396964 11394700 11308026 11329001 11296948 11388630 11513651 11547365 11516181 11577722 11400608 11565920
18781 11565920 11819656 12016749 12007336 12131592 12247054 12095066 12005147 12046173 12391821 12709848
18771 12709848 12807965 13008927 13195123 13569996 13372663 12430160 11125294 10819661 10830621
18762 10830621 11113899 11272160 11294345 11417538 11947642 12179321 12278498 12295619 12285568 12382877
18752 12382877 12384153 12246619 12136219 12371919 12333129 12438265 12462140 12487447 12535567 12536938 12906486
18741 12906486 13064657 13020179 13058964 13188979 13358924 13264844 13357025 13712023 13584824 13528807
18731 13528807 13465212 13489281 13378046 13484915 13555899 13696839 13733012 13708157 13663871 13630355
18721 13630355 13690270 13933102 14116730 14159704 14187363 14178997 14414325 14602781 14626263 14575173
18711 14575173 14477229 14560396 14658684 14749461 15065579 15265810 15145969 15366334 15660439 15682403
18701 15682403 15355951 15277726 15506360 15610660 15602615 15631557 15768392 15763814 15641806 15474311
18691 15474311 15719873 16065864 16198819 16425701 16694453 16651167 16486530 16287752 16477223
18682 16477223 16763797 17005961 17192610 17250535 17244314 17195647 17364882 17406731 17647946 17680315
18672 17680315 17744955 17764021 17731585 17693001 17726741 18019186 18284699 18357706 18570241 18718352
18662 18718352 18880261 19029325 18920631 18917441 19164784 19305097 19531065 19643208 19764809 20089743
18652 20089743 20273933 20456554 20738135 20756458 20696545 20511214 20412835 20455820 20532898 20690018
18642 20690018 20979547 21248368 21508755 21578871 21657396 21953992 22202017 22272416 22217527 22253513
18632 22253513 22455890 22634794 22591456 22707367 22917837 22925359 23077938 23446626 23585082 23777267
18622 23777267 24129277 24355479 24490602 24792489 25209206 25366071 25464028 25440497 25611423 25798233
18612 25798233 25812178 26151667 26368807 26653822 27013717 27435051 27919533 28165120 28358336
18603 28358336 28502711 28591436 28800969 29009264 29252467 29606445 29970154 30337143 30809406
18594 30809406 31158848 31551656 31841558 32142978 32815342 33374115 33897070 34301539 35104742
18585 35104742 35938775 36717710 37245291 38080798 39088134 40196698 41346528 42602694 43401010
18576 43401010 42515373 38611733 34890244 34490371 35918120 37625654 38972144 38812974
18568 38812974 35813788 32016292 31087531 32058282 33480161 34973965 36359147 37465877
18560 37465877 38316913 39288152 40384457 41668539 42782554 43728404 44639709 45523458 46612427
18551 46612427 48057221 49433265 50949549 52170432 53431627 54780153 56031838 57496495
18543 57496495 58850932 59381688 60455790 62433595 64431788 66404995 68479871 70737345
18535 70737345 73239051 76401515 79986767 83893061 88356198 93390067 99028117 105572457
18527 105572457 113318399 121941301 130404481 134877734 126176492 96135989 66979084 62098404
18519 62098404 72091090 85396951 95341613 93843058 68878248 35322433 26040095 36256658
18511 36256658 51682526 67498578 82202611 92737219 90996232 76440922 61599542
18504 61599542 50246251 49236498 48754750 35740229 19290882 6648011 7248220 21010566
18496 21010566 39476641 59940590 82553166 107009594 131504356 149462196 140328726
18489 140328726 78732001 -2040041 -47932355 -47445478 -24077122 -13840181 -56591612
18482 -56591612 -154523254 -222848929 -228839842 -207718257 -185117135 -166702592 -151985926
18475 -151985926 -139580581 -128472707 -118421840 -110111715 -103398099 -97601144 -92006094
18468 -92006094 -86485244 -81440846 -76971568 -73349010 -70007716 -66823877 -63653454 -60306250
18460 -60306250 -57020027 -53578732 -50473565 -47147778 -43874727 -41424816 -41074564 -43156848
18452 -43156848 -45387116 -47426944 -46963228 -45958814 -47072413 -49527339 -51994133 -52270485
18444 -52270485 -50202231 -47705846 -45540169 -43505493 -41626106 -40142588 -38704284 -37454343
18436 -37454343 -36356025 -35539195 -34889768 -34180777 -33284814 -32256701 -31456079 -30638594 -29972589
18427 -29972589 -29301088 -28651082 -27920289 -27170178 -26483590 -25703767 -25253790 -24881994 -24332605
18418 -24332605 -23817400 -23429710 -22800502 -22017785 -21603975 -21230497 -20936061 -20428326 -19932350
18409 -19932350 -19498542 -19225636 -18870995 -18382304 -18161025 -17892286 -17371189 -16955685 -16426539
18400 -16426539 -16065091 -15639189 -15168025 -14809256 -14477724 -14155575 -13691471 -13432540 -13114626
18391 -13114626 -12757416 -12674785 -12645801 -12419249 -12023946 -11975223 -11827365 -11618725 -11342805 -11159120
18381 -11159120 -10981513 -10665359 -10111281 -10009208 -9897733 -9526202 -9350840 -9124908 -8829333
18372 -8829333 -8536665 -8544260 -8457601 -8123943 -7920959 -7800701 -7301949 -7004279 -6858105 -6656449
18362 -6656449 -6418656 -6236783 -6145995 -5798367 -5361513 -5213891 -5109184 -5174971 -5213576 -5077394
18352 -5077394 -4859482 -4526614 -4365403 -4156789 -3954152 -3638759 -3375946 -3268704 -3023172
18343 -3023172 -2891158 -2692342 -2670122 -2455765 -2183053 -1872925 -1911642 -1951500 -1589859 -1245927
18333 -1245927 -973554 -938073 -671400 -458117 -333652 -212581 -109533 102507 298694 490300
18323 490300 797682 1052699 1294851 1647250 1763049 1828576 1977440 2165000 2654094 3029187
18313 3029187 3080564 3240026 3458564 3812321 3795334 3844151 4073907 4380786 4635785 4866529
18303 4866529 4973345 5028222 5312315 5780096 6239315 6384031 6482250 6607287 6707748 6762590
18293 6762590 7153985 7415814 7693620 8157033 8670554 9225491 9521455 9758575 10017269
18284 10017269 10334553 10950592 11649213 12423530 13037957 13590489 14101231 14651969 14526221
18275 14526221 13218519 10670851 9525592 9804536 10600197 11402998 12347687 13054109 13606205
18266 13606205 14218728 15057019 15500721 15937868 16547621 17284884 18038666 18596220 19418988
18257 19418988 20272557 21261176 22422336 23359385 24064747 25069327 26461514 27973424 29873039
18248 29873039 32012379 34142142 36515903 39543745 43075067 47344808 52064332 56609186
18240 56609186 58677419 51608731 27435594 -1636258 -14232691 -12855390 -7541929 -2330112
18232 -2330112 2386936 6410473 9967494 13525487 17323602 21461429 25754322 30613283
18224 30613283 36157842 41283742 43815227 38091153 16830361 -7811638 -16475539 -13834141
18216 -13834141 -8314642 -3025434 1846426 6496696 11238204 16047104 20851400 25992015
18208 25992015 30188532 29877514 20215111 5867695 -7722042 -15584691 -13643547 -8426855
18200 -8426855 -3584687 582169 4638113 8808594 12941117 17574255 22731440 28190018
18192 28190018 34059255 40423735 46758208 50162577 45008688 28473442 13408789 5530695
18184 5530695 -10048966 -33564912 -45578049 -43420302 -36656902 -30116674 -24398629 -19289717
18176 -19289717 -14651932 -10187957 -6044111 -2050689 2086467 6585740 11448974 16461961
18168 16461961 21073717 23078225 17234284 -1824046 -19978392 -23501842 -19763736 -14679205
18160 -14679205 -9652329 -4469332 742444 5991552 11116551 15728967 18322112 14224284
18152 14224284 1779223 -10971866 -22472049 -25774929 -22429393 -17730012 -13257322 -9341660
18144 -9341660 -5578459 -1649846 2223861 6237836 10134820 14152961 18739378 23344920
18136 23344920 27665316 29908745 24772345 8251945 -8652336 -12922758 -8758513 -3124771
18128 -3124771 2193551 7272747 12013219 16760791 21638457 26730100 32096161 37963012
18120 37963012 44539951 51733362 59764081 69371870 80801968 95015000 113197672 136060090
18112 136060090 164552786 197161820 222928619 202980454 36521317 -211219742 -276779996
18105 -276779996 -245957245 -209047013 -180906645 -160149778 -144549232 -131931643 -121536019
18098 -121536019 -112973246 -105529355 -99348514 -93845798 -88526001 -83759653 -79617330 -76007401
18090 -76007401 -72741926 -69879346 -66974294 -64006133 -61661322 -59690598 -57667352 -55779695
18082 -55779695 -54128470 -52315209 -50856369 -49451339 -48207496 -46852534 -45653262 -44606599
18074 -44606599 -43836922 -42991430 -42204325 -41284470 -40264446 -39172873 -38140211 -37374871 -36662564
18065 -36662564 -35967760 -35319323 -34952713 -34549602 -34075003 -33593035 -33212051 -32655143 -32575997
18056 -32575997 -32274917 -31544850 -31021893 -30659442 -30382507 -30099634 -29740300 -29234519 -29020930
18047 -29020930 -28916223 -28602235 -27994247 -27460913 -27267517 -27005778 -26566996 -26491859 -26424618 -26020041
18037 -26020041 -25615496 -25392779 -25213887 -24932440 -24745493 -24494161 -24212784 -23894313 -23719477
18028 -23719477 -23391586 -22779953 -22484899 -22250811 -22030694 -21747284 -21502821 -21534678 -21280751
18019 -21280751 -21025825 -20759666 -20490990 -20106309 -19924966 -19733274 -19370769 -19210812 -19042075
18010 -19042075 -18949508 -18733681 -18397696 -18185386 -18015783 -17846814 -17802510 -17636286 -17577230 -17516951
18000 -17516951 -17352665 -17020485 -17041630 -17033813 -17354425 -17752085 -17940146 -18061749 -18384070 -18639291
17990 -18639291 -18652376 -18530437 -18622817 -18732275 -18775830 -18598233 -18479915 -18166619 -18210179 -18086023
17980 -18086023 -17766957 -17437231 -16921206 -16754816 -16550587 -16460454 -16405088 -16213693 -16161688 -15911420
17970 -15911420 -15669903 -15601950 -15501052 -15253510 -15041694 -14634433 -14496029 -14519017 -14471894 -14369148
17960 -14369148 -14284686 -14200726 -14434537 -14380154 -14055941 -13990479 -13908083 -13611225 -13503973 -13585787
17950 -13585787 -13693727 -13791897 -13924393 -13829121 -13787748 -14040210 -14141397 -14024070 -14021288 -14156699
17940 -14156699 -14156377 -14212019 -14234513 -14534350 -14415734 -14308200 -14194909 -14120242 -14064082 -13733715
17930 -13733715 -13377343 -13362128 -13340757 -13133657 -12944006 -12712726 -12599763 -12705855 -12826079 -12742745
17920 -12742745 -12769222 -12828536 -12895142 -12707124 -12555507 -12403546 -12533239 -12610587 -12668554 -12236136
17910 -12236136 -11982820 -11982196 -11856137 -11707053 -11450626 -11401287 -11586012 -11643117 -11358411 -11141267
17900 -11141267 -11171903 -11242314 -11142286 -11209875 -11324434 -11287026 -11502100 -11381356 -11202815 -11054364
17890 -11054364 -10869733 -10876587 -10919874 -10989306 -10895951 -10624473 -10486876 -10428816 -10338013 -10560584
17880 -10560584 -10713451 -10531544 -10356306 -10139582 -10178505 -10427624 -10494225 -10380814 -10245270 -10131682
17870 -10131682 -10106233 -10050652 -10021895 -10050641 -10047402 -9749531 -9695736 -9741406 -9867666 -9876805 -9808173
17859 -9808173 -9568139 -9250938 -9227953 -9369229 -9608825 -9628733 -9579124 -9530299 -9454374 -9340981
17849 -9340981 -9149091 -9162949 -9279486 -9173059 -9174654 -9198866 -9149163 -9152659 -9066630 -8975814 -9051834
17838 -9051834 -9201139 -9078754 -8964273 -8873882 -8923717 -8790439 -8547503 -8566979 -8519033 -8350126
17828 -8350126 -8325461 -8294373 -8291355 -8548239 -8482890 -8178040 -8182042 -8181951 -8409309 -8358511 -8079484
17817 -8079484 -8087138 -8008013 -7962467 -8177790 -8174472 -7988509 -7887546 -7894152 -7959237 -7877686 -7643568
17806 -7643568 -7660078 -7691478 -7686082 -7672181 -7685230 -7821307 -8038304 -7828071 -7527620 -7443250 -7577709
17795 -7577709 -7603242 -7590246 -7460561 -7506485 -7655737 -7735831 -7619573 -7555874 -7450428 -7542509
17785 -7542509 -7325848 -7244523 -7213643 -7187572 -7225569 -6993381 -6887514 -6912326 -6861368 -6607090
17775 -6607090 -6567402 -6616554 -6464360 -6372349 -6627108 -6912828 -6774122 -6645414 -6657357 -6723073
17765 -6723073 -6756870 -6778258 -6791738 -6847457 -6677198 -6719237 -6647564 -6554462 -6509496 -6375766 -6424510
17754 -6424510 -6364548 -6585810 -6638227 -6527650 -6627746 -6726619 -6452904 -6172853 -6214686 -6358488
17744 -6358488 -6468203 -6255698 -6180413 -6161155 -5951911 -6009829 -6074688 -6005792 -5878620 -5710009
17734 -5710009 -5763165 -5757060 -5683463 -5467442 -5601924 -5651895 -5625125 -5657848 -5714662 -5768045 -5664485
17723 -5664485 -5577954 -5533612 -5406212 -5275037 -5064944 -5045424 -5215653 -5374564 -5215543 -5344998
17713 -5344998 -5320333 -5167167 -5124878 -5097126 -5182783 -5203330 -5341365 -5517088 -5206358 -4932153
17703 -4932153 -4703455 -4607882 -4597316 -4689923 -4621583 -4414862 -4391754 -4480954 -4362300 -4150278
17693 -4150278 -4201270 -4472153 -5008415 -5243303 -5263353 -5295449 -5292266 -5564268 -5805246 -6147291
17683 -6147291 -6269287 -5960115 -5560580 -5515656 -5631278 -5599827 -5507607 -5459114 -5240491 -5154927
17673 -5154927 -4977549 -4986631 -5151268 -5468892 -5280319 -5077242 -5177808 -5064977 -5237355 -5344078
17663 -5344078 -5257062 -5304875 -5191870 -5053817 -4850872 -4775801 -4709376 -4430903 -4190136 -4152251
17653 -4152251 -4486061 -4527097 -4668484 -4883553 -4899391 -4799774 -4586859 -4629427 -4756903 -4648231
17643 -4648231 -4436153 -4360450 -4202368 -4462273 -4724159 -4637928 -4293420 -4152925 -4080217 -3964920
17633 -3964920 -4017503 -4088620 -4195833 -4248324 -4250139 -4071304 -4085806 -4133221 -4291290 -4305873 -4330464
17622 -4330464 -4268025 -4244198 -4265615 -4235495 -4339660 -4441645 -4421492 -4370312 -4220330 -4221232 -4165543
17611 -4165543 -4148389 -4078006 -3776288 -3788829 -3764249 -3514724 -3479801 -3537721 -3764713 -3999372
17601 -3999372 -4073981 -3979138 -3678326 -3803456 -3795791 -3743173 -3697413 -3535150 -3596852 -3739998 -3662436
17590 -3662436 -3706963 -3691333 -3583456 -3382681 -3282481 -3263098 -3261783 -3500202 -3472134 -3198959
17580 -3198959 -3072838 -3159744 -3195336 -3390179 -3245082 -3189388 -3241839 -3407922 -3405874 -3149951
17570 -3149951 -2932909 -3017532 -3107471 -3058005 -2932377 -2847504 -3001180 -3084443 -3255233 -3239114
17560 -3239114 -3147924 -3204028 -3400687 -3321542 -3260144 -3376659 -3346951 -3326795 -3100271 -2994417
17550 -2994417 -3086239 -3171487 -3140448 -2989373 -3029405 -2995055 -3051899 -2955687 -2821062 -2558450 -2586535
17539 -2586535 -2642287 -2646456 -2390287 -2328456 -2293752 -2074478 -2083339 -2324745 -2313289 -2450576 -2572200
17528 -2572200 -2637693 -2424163 -2321798 -2039058 -2110328 -2211878 -2055113 -2171612 -2333215 -2281009
17518 -2281009 -2216543 -1943816 -1931863 -1882549 -1712451 -2008883 -2027956 -1886164 -1929464 -2047037
17508 -2047037 -2164632 -2136941 -2018488 -2041292 -2115528 -2043351 -1810137 -1833275 -2023481 -2064947
17498 -2064947 -1814851 -1877720 -1812716 -1799717 -1589432 -1821508 -1818663 -1581199 -1492583 -1683635
17488 -1683635 -1702791 -1703060 -1676795 -1384117 -1152843 -1168284 -1167965 -1097641 -942683 -1165364 -1381303
17477 -1381303 -1353683 -1418429 -1413975 -1208286 -1349471 -1414191 -1374694 -1150336 -1121522 -1135473 -926366
17466 -926366 -714162 -725526 -646901 -707502 -619237 -801659 -835364 -851384 -735346 -701138 -630863
17455 -630863 -482727 -385970 -334633 -106624 50504 106828 248866 308994 334667 324709 494038
17444 494038 819294 818534 221266 -1362199 -2029356 -1874448 -1711520 -1573471 -1471327 -1113384
17434 -1113384 -923168 -859681 -881548 -966998 -916470 -787807 -621897 -598263 -435306 -283509
17424 -283509 -302165 -325895 -362235 -219128 -90328 -124084 -274550 -224203 -233861 -87007 -11775
17413 -11775 35927 61369 78146 49295 99184 218920 289505 235391 67755 -101776 -51518
17402 -51518 71806 273326 353548 387113 379575 315562 337874 371611 293300 424079 689739
17391 689739 530743 491543 681996 826547 870574 1006390 1111458 1030952 810539 848009
17381 848009 802099 754435 812005 1084887 1345392 1435774 1570559 1652198 1656679 1596073 1625380
17370 1625380 1790578 1713319 1636525 1756426 1803582 1785732 1941843 2034141 2068548 2214624
17360 2214624 2295268 2125325 2122454 2238345 2115123 2038878 2102418 2356290 2628824 2713932
17350 2713932 2643005 2462069 2347454 2366556 2546372 2752676 2896928 2762059 2711275 2803414
17340 2803414 2862127 3086450 3244261 3200706 3210973 3238236 3305854 3457855 3643219 3661788
17330 3661788 3698800 3658076 3804681 3831503 3955425 4040115 4067176 3842250 3962846 4031162
17320 4031162 3936562 3859214 3876040 4105015 4135335 4304234 4473012 4663090 4729046 4776345
17310 4776345 4882985 4969286 4841477 4951248 5158180 5145207 4904555 4908167 5283925 5515393
17300 5515393 5535520 5727014 5917931 5937901 5992187 6189691 6190947 6272985 6365398 6450230 6677982
17289 6677982 6918495 6987780 7023408 7103478 7353985 7404645 7336988 7462594 7425355 7402388 7861881
17278 7861881 8147814 8162926 8340746 8533935 8720830 8851609 8992499 9113364 9170817 9277300
17268 9277300 9597662 9877936 10060412 10158192 10186689 10298825 10396878 10704390 10976409 11305270
17258 11305270 11319490 11399308 11536311 11756097 11890008 11889409 12139296 12524784 12892122 13225253
17248 13225253 13532938 13803026 13954455 14281943 14870627 15264454 15473068 15630233 15794189
17239 15794189 16123399 16652907 17099422 17467588 17864182 18315898 18651392 19319875 19781100
17230 19781100 20278299 20871846 21486108 21858895 22180479 22525519 23253191 24126057 25010772
17221 25010772 25652617 26322520 26937103 27752227 28661699 29600250 30452433 31510565 32858563
17212 32858563 34214792 35500814 36881231 38703853 40648861 42373292 44379450 46589184
17204 46589184 48839469 51207114 53217425 55488029 58253767 61482640 65430111 69752266
17196 69752266 74240601 79522237 86214466 94217967 103875036 115596477 129855981 147191145
17188 147191145 167203784 187117427 196338285 168276813 93584676 29272058 6042415
17181 6042415 8135966 7358305 -38254061 -120756008 -175036866 -191108507 -182196817 -163870623
17173 -163870623 -147025586 -133248146 -121429989 -110968657 -102102502 -94874335 -88720503
17166 -88720503 -83449081 -78551518 -74237120 -70533805 -67363614 -64678248 -62310896 -59887928
17158 -59887928 -57427711 -54720620 -52388927 -50592161 -48897413 -47194940 -45694098 -44113464
17150 -44113464 -42902401 -41918652 -40710367 -39390928 -38275041 -36936028 -36060489 -35345248
17142 -35345248 -34571473 -33828687 -33316718 -32721533 -31830782 -31006528 -30226289 -29395248 -28756713
17133 -28756713 -28360079 -28074369 -27637124 -26964961 -26677460 -26418769 -25829968 -25181354 -24743870
17124 -24743870 -24227599 -23874741 -23619272 -23292071 -23027158 -22782003 -22329755 -22017869 -21800772
17115 -21800772 -21692706 -21357563 -20901293 -20736106 -20617474 -20342728 -19937509 -19559237 -19104242
17106 -19104242 -18860140 -18629337 -18387961 -18280473 -18215379 -18179429 -18036011 -17801354 -17489877 -17303660
17096 -17303660 -17159997 -17035970 -16963906 -16927681 -16758983 -16563200 -16405081 -16307786 -16225434 -15942822
17086 -15942822 -15605746 -15358911 -15396463 -15388922 -15275507 -15041530 -14888722 -14669183 -14479945 -14680221
17076 -14680221 -14805045 -14692682 -14431697 -14149355 -13875524 -13693806 -13863607 -13871099 -13624754 -13504843
17066 -13504843 -13471305 -13441135 -13284235 -13229284 -13092956 -13185151 -13278044 -13086726 -12919957 -12857722
17056 -12857722 -12901155 -12944219 -12841787 -12456429 -12533378 -12704509 -12528197 -12522540 -12236587 -12031219
17046 -12031219 -11949088 -11707432 -11706345 -11825492 -11872686 -11846021 -11644823 -11538618 -11551667 -11399930
17036 -11399930 -11529771 -11351688 -10956033 -10806638 -10883692 -11067089 -11039377 -11001881 -11012722 -10852433
17026 -10852433 -10675735 -10758231 -10699736 -10554753 -10401886 -10539256 -10612430 -10295716 -10114399 -10302047
17016 -10302047 -10342873 -10245555 -10013648 -9956029 -9957334 -10024805 -9940216 -9770267 -9758221 -9656973 -9420078
17005 -9420078 -9650584 -9661120 -9555813 -9467319 -9407090 -9499444 -9614538 -9518658 -9207452 -9079280
16995 -9079280 -9179548 -9327823 -9509052 -9331366 -9323817 -9360273 -9279340 -9279251 -9329506 -9122326 -8958738
16984 -8958738 -8941490 -8984251 -8859099 -8754686 -8814149 -8714651 -8943197 -8851142 -8750518 -8652101
16974 -8652101 -8564963 -8515047 -8382946 -8329761 -8644258 -8610499 -8639972 -8622928 -8556485 -8469355 -8453804
16963 -8453804 -8410245 -8292006 -8179099 -8345749 -8468918 -8487721 -8604483 -8567260 -8455103 -8097962
16953 -8097962 -7873228 -7701172 -7737108 -7791676 -7815523 -7761992 -7804034 -7868336 -8065791 -7994613 -7841301
16942 -7841301 -7792092 -7561401 -7619205 -7783499 -7539077 -7243971 -7031110 -7146190 -7155534 -7266891
16932 -7266891 -7425245 -7414000 -7365902 -7434276 -7350114 -7182915 -7330934 -7310674 -7405944 -7509454
16922 -7509454 -7460409 -7300900 -7075712 -6994388 -7031728 -6935904 -6982662 -7020849 -7144701 -7154468 -7007513
16911 -7007513 -7039306 -6904964 -6825926 -6945795 -7068514 -7104097 -7016860 -6826325 -6629515 -6606563
16901 -6606563 -6655936 -6508008 -6622189 -6717176 -6617088 -6528071 -6573140 -6487931 -6586543 -6746835
16891 -6746835 -6842375 -6758474 -6683393 -6873952 -6826587 -6607130 -6304484 -6332543 -6293610 -6205456 -6223384
16880 -6223384 -6287930 -6336255 -6120055 -6145067 -6283297 -6429430 -6440461 -6348667 -6521362 -6665449
16870 -6665449 -6520273 -6581868 -6627425 -6509317 -6407174 -6194468 -6245532 -6333830 -6349136 -6405230
16860 -6405230 -6576112 -6512706 -6432092 -6439179 -6383346 -6217435 -6273235 -6233203 -6352420 -6453415 -6354427
16849 -6354427 -6181483 -6086038 -5948979 -5904982 -5929868 -5935301 -6096456 -5921543 -5647643 -5794354
16839 -5794354 -6046730 -6074449 -5933682 -5924197 -5849297 -5864191 -5745396 -5731815 -5763275 -5823372 -5841601
16828 -5841601 -5782107 -5877710 -5877000 -5873571 -6031793 -6080501 -6070208 -5995066 -5806103 -5888524 -5934500
16817 -5934500 -5797599 -5551626 -5550635 -5586611 -5659418 -5671785 -5780337 -5762829 -5591711 -5508141 -5682286
16806 -5682286 -5813874 -5705226 -5659405 -5611362 -5672111 -5630616 -5598504 -5422739 -5609380 -5626783
16796 -5626783 -5497195 -5323296 -5212841 -5321621 -5565361 -5564953 -5670021 -5665710 -5421791 -5423277 -5486182
16785 -5486182 -5661553 -5695595 -5635262 -5490929 -5400669 -5223309 -5103381 -5261232 -5277625 -5162352
16775 -5162352 -5169611 -5167384 -5110298 -5004969 -5138196 -5303375 -5259625 -5257953 -5251498 -5142398 -5111822
16764 -5111822 -4971762 -4923153 -5177152 -5212420 -5207436 -5193443 -5118811 -5146500 -5475612 -5430839 -5346605
16753 -5346605 -5124212 -4807575 -4863604 -4956160 -5067111 -4805871 -4695779 -4694025 -4773251 -4851715
16743 -4851715 -4912257 -4952225 -4898425 -4856184 -5001960 -5064656 -4898854 -4665056 -4600424 -4610095 -4577414
16732 -4577414 -4615666 -4701748 -4712361 -4679329 -4638923 -4501161 -4522770 -4811396 -4786408 -4659031 -4628898
16721 -4628898 -4623991 -4684151 -4424765 -4634365 -4762070 -4615276 -4539184 -4535729 -4422762 -4483854 -4501029
16710 -4501029 -4561801 -4712383 -4903779 -4759340 -4617451 -4708016 -4658079 -4593020 -4419172 -4275526
16700 -4275526 -4312996 -4307031 -4326067 -4415863 -4402489 -4604747 -4601434 -4352756 -4026202 -3906414 -3924702
16689 -3924702 -4059026 -4218979 -4182106 -4074296 -3949240 -3972272 -4263487 -4236677 -4165566 -4018547
16679 -4018547 -3785198 -3674567 -3699287 -3743849 -3468792 -3403162 -3463114 -3662150 -4149232 -4633120
16669 -4633120 -4634050 -4551080 -4603580 -4569555 -4745635 -5244768 -5538768 -5529391 -5189211 -5147542 -5128660
16658 -5128660 -5038809 -4921532 -4684989 -4606896 -4558485 -4551472 -4524630 -4400179 -4391452 -4514065 -4533675
16647 -4533675 -4506812 -4592764 -4663153 -4554294 -4321620 -4294061 -4524127 -4548604 -4448858 -4423782 -4394834
16636 -4394834 -4322098 -4229772 -4265399 -4201758 -4325333 -4335961 -4309583 -4339078 -4562545 -4603992 -4627611
16625 -4627611 -4733842 -4731358 -4746969 -4645958 -4589565 -4542777 -4345899 -4142838 -4154794 -4278613
16615 -4278613 -4238636 -4113049 -4284899 -4273516 -4238204 -4327014 -4328838 -4278218 -4279072 -4455806 -4600247
16604 -4600247 -4528869 -4318696 -4216040 -4022947 -3902850 -3951853 -4184612 -4080749 -3952403 -4041157
16594 -4041157 -4035232 -4018459 -3903267 -3892154 -3941198 -3997942 -4043433 -3960936 -3958468 -3869603 -3772460
16583 -3772460 -3851400 -3831809 -3912521 -4094714 -4252614 -4314964 -4146901 -4076983 -4133689 -4084327 -3945885
16572 -3945885 -3948712 -3803968 -3728912 -4001479 -4240132 -4010058 -3902660 -4037314 -3982500 -4099292
16562 -4099292 -4122268 -4282314 -4272648 -4016992 -3908657 -3925193 -4123676 -4040849 -4090436 -4154578 -4201345
16551 -4201345 -4047750 -3915533 -3904182 -3997466 -4079652 -3911021 -3510941 -3457556 -3648210 -3699138
16541 -3699138 -3625351 -3768184 -3949958 -4090655 -3995730 -3863621 -3820157 -3732612 -3801847 -3721824
16531 -3721824 -3499309 -3632778 -3738786 -3815989 -3695484 -3653471 -3731229 -3626623 -3557393 -3605221
16521 -3605221 -3602960 -3521054 -3497172 -3506580 -3634671 -3642547 -3586351 -3479158 -3244135 -3351523 -3435078
16510 -3435078 -3476002 -3734761 -3896472 -3788933 -3906206 -3988437 -4101305 -3889067 -3754926 -3750524
16500 -3750524 -3606168 -3667725 -3727959 -3459785 -3400479 -3434172 -3350404 -3368858 -3484229 -3502362 -3431006
16489 -3431006 -3416023 -3543045 -3623632 -3649820 -3440465 -3402507 -3575154 -3444003 -3462276 -3466143 -3517407
16478 -3517407 -3614106 -3800305 -3931145 -3978386 -3852396 -3876878 -3620964 -3443257 -3562766 -3550232
16468 -3550232 -3437260 -3411498 -3444057 -3566763 -3560875 -3335403 -3282595 -3124558 -3128300 -3341267 -3437597
16457 -3437597 -3449576 -3451816 -3402858 -3499703 -3618944 -3395729 -3269226 -3388569 -3473434 -3512477 -3189583
16446 -3189583 -2912797 -3079663 -3111102 -3175882 -3203934 -3264929 -3152403 -3018095 -2934494 -3048121
16436 -3048121 -3207376 -3346593 -3422122 -3295820 -3167251 -3312267 -3430923 -3339482 -3316405 -3126969
16426 -3126969 -2967009 -2834950 -2583784 -2762080 -2771844 -2667703 -2694738 -2951027 -3219644 -3195597
16416 -3195597 -3025268 -3146710 -3340809 -3228985 -3216251 -3024201 -2978434 -2807923 -2918245 -3175190
16406 -3175190 -3268611 -3132181 -3194317 -3007107 -2886720 -2939578 -3003889 -3194821 -3161629 -3130008
16396 -3130008 -3124188 -3072034 -3070389 -2927559 -3008895 -3284771 -3317527 -3164674 -2936974 -3007564 -3111785
16385 -3111785 -3308384 -3411776 -3347444 -3206264 -3109406 -3051702 -3046672 -3024429 -3107747 -3037148 -2847555
16374 -2847555 -2855883 -2847926 -2761677 -2854225 -3086844 -3155446 -3115976 -3088836 -2877319 -2909664 -3125349
16363 -3125349 -3182473 -3138327 -2929255 -2968105 -3074987 -3033984 -2951975 -2968291 -3021027 -3070626 -3021621
16352 -3021621 -2800765 -2715676 -2783681 -2789515 -2852920 -3029438 -2905403 -2675367 -2699998 -3065523
16342 -3065523 -3262658 -2994574 -2871521 -2945783 -3182417 -3059410 -2966971 -2954631 -2998446 -3042870
16332 -3042870 -3025512 -3007904 -2890335 -2918998 -2907446 -2953575 -2978306 -3030278 -3125931 -3076939 -3117266
16321 -3117266 -3115109 -2867225 -2815193 -2768554 -2797938 -2552534 -2447269 -2686175 -2598350 -2517920 -2580194
16310 -2580194 -2626718 -2657620 -2618151 -2543311 -2545917 -2571616 -2546802 -2725491 -2643526 -2547953 -2457141
16299 -2457141 -2348843 -2454217 -2684027 -2817481 -2853526 -2819264 -2666747 -2605765 -2619366 -2728037
16289 -2728037 -2667390 -2589130 -2614622 -2761706 -2728653 -2735769 -2803341 -2795937 -2898594 -2806599 -2722193
16278 -2722193 -2629200 -2430817 -2490905 -2643954 -2672583 -2436216 -2226045 -2297936 -2217866 -2375500
16268 -2375500 -2402256 -2287756 -2333416 -2502096 -2606061 -2646388 -2641468 -2669583 -2732083 -2499000 -2514808
16257 -2514808 -2803556 -2716167 -2916341 -2894514 -2664124 -2836573 -2774544 -2572133 -2424232 -2556744
16247 -2556744 -2572786 -2569098 -2576240 -2768629 -2744751 -2692232 -2596302 -2745662 -2754108 -2780060 -3055514
16236 -3055514 -2988077 -2641892 -2552863 -2469404 -2464239 -2730472 -2689723 -2589834 -2533162 -2428189 -2199294
16225 -2199294 -2511092 -2705685 -2557948 -2515598 -2466734 -2581775 -2782249 -2735043 -2706454 -2713099
16215 -2713099 -2837442 -2660378 -2449154 -2281181 -2213410 -2125197 -2134846 -2301478 -2413605 -2527836
16205 -2527836 -2389717 -2477479 -2578421 -2477196 -2323560 -2301923 -2360564 -2436672 -2563519 -2512357
16195 -2512357 -2480383 -2330746 -2310183 -2218468 -2191458 -2375684 -2449946 -2488696 -2354914 -2235236
16185 -2235236 -2300036 -2233263 -2370392 -2321071 -2173295 -2293465 -2457869 -2624205 -2449902 -2310862
16175 -2310862 -2386725 -2451279 -2168911 -2156350 -2193142 -2572240 -2459271 -2290270 -2315690 -2315533 -2320456
16164 -2320456 -2331160 -2127066 -2194312 -2178281 -2159032 -2173062 -2046690 -2042180 -2105255 -2288622 -2583615
16153 -2583615 -2609982 -2430400 -2550657 -2528554 -2503914 -2328947 -2166140 -2288583 -2642789 -2559349
16143 -2559349 -2392613 -2317193 -2314122 -2277478 -2293129 -2261305 -2197675 -2075525 -2059569 -2189619 -2225007
16132 -2225007 -2279596 -2336648 -2327105 -2441883 -2582453 -2662210 -2233387 -1947667 -1922765 -1959437 -2067968
16121 -2067968 -2212818 -2249736 -2146326 -2235340 -2221611 -2338160 -2330978 -2373754 -2419407 -2431740 -2349817
16110 -2349817 -2164723 -2256662 -2424589 -2327327 -2147301 -2295986 -2339915 -2314956 -2299607 -2297585 -2318658
16099 -2318658 -2444520 -2481431 -2348919 -2301527 -2173118 -2115595 -2308146 -2648384 -2626583 -2443953
16089 -2443953 -2510641 -2585893 -2510200 -2300653 -2235094 -2148122 -2193900 -2269327 -2321480 -2278217 -2246063
16078 -2246063 -2295510 -2385813 -2559535 -2639938 -2531614 -2509404 -2564852 -2617643 -2497098 -2527580 -2450630
16067 -2450630 -2239086 -2129565 -2265153 -2535924 -2344674 -2004838 -1853990 -1925150 -1945562 -2057468
16057 -2057468 -2208106 -2299226 -2415730 -2307504 -2280856 -2184703 -2002861 -1917691 -2111541 -2048387
16047 -2048387 -1874006 -1760413 -2071841 -2131665 -2028157 -1952643 -1874781 -1950797 -1809625 -1628802
16037 -1628802 -1526003 -1651849 -1870327 -2101469 -2238107 -2102523 -2006690 -2101475 -2250633 -2327777
16027 -2327777 -2359753 -2363687 -2473237 -2471911 -2411772 -2252786 -1924717 -1721619 -1819590 -1846476 -1920525
16016 -1920525 -2046402 -2134031 -2165808 -2146903 -2320206 -2398452 -2218306 -2113183 -2077546 -2060404
16006 -2060404 -2006764 -1997286 -2088687 -2027067 -2014192 -2111931 -2118798 -2082601 -1966370 -1978999 -1963991
15995 -1963991 -1986772 -2048364 -2153686 -2240078 -2287072 -2279981 -1934322 -2060897 -2071384 -1976951 -1930786
15984 -1930786 -2002705 -1913085 -1706958 -1612407 -1743350 -1930789 -2056555 -1922550 -1847969 -1875131
15974 -1875131 -2019047 -2015276 -1937793 -2033021 -2032309 -1908094 -1927455 -2028296 -2163861 -2096155 -2047786
15963 -2047786 -1940340 -1767191 -1952063 -2159336 -2033938 -1941661 -2001720 -2008452 -2123472 -2077058
15953 -2077058 -1797587 -1734738 -1770404 -1889282 -1970440 -1884337 -1878309 -1938894 -1770406 -1917131 -2083421
15942 -2083421 -2075683 -1973171 -2077775 -2155405 -2232306 -2252808 -2245564 -1997949 -2113331 -2134184 -2123374
15931 -2123374 -1954713 -1821482 -1919149 -1976517 -1814111 -1690810 -1989834 -2069999 -1725117 -1719885
15921 -1719885 -1879705 -1975484 -2195404 -2276296 -2028709 -1991157 -2038348 -2139063 -2141249 -1972580
15911 -1972580 -1632212 -1617076 -1828187 -1813780 -1589929 -1431720 -1454784 -1549761 -1789113 -1927044
15901 -1927044 -1943701 -1770274 -1665122 -1641050 -1795154 -1773088 -1780532 -1596643 -1379125 -1207757
15891 -1207757 -1169085 -1260917 -1376622 -1312964 -1472480 -1711662 -1781754 -1741726 -1897281 -1849189
15881 -1849189 -1797245 -1611220 -1665570 -1789392 -1929269 -2110682 -2176294 -2138642 -2135269 -2316483
15871 -2316483 -2228013 -2053475 -1922142 -1934886 -2031221 -2135189 -2253154 -2302933 -2230295 -2108234
15861 -2108234 -2079918 -2058855 -1708459 -1378096 -1559053 -1686810 -1781927 -1617737 -1338550 -1590758
15851 -1590758 -1818960 -1802978 -1883835 -1868928 -1829989 -1966381 -1801306 -1760607 -1820897 -1700148
15841 -1700148 -1911011 -2030878 -1953976 -1986361 -1752740 -1594287 -1633907 -1743486 -1841914 -1718442
15831 -1718442 -1678919 -1798097 -1917656 -1950815 -1963908 -1841816 -1884606 -1781760 -1694327 -1818047
15821 -1818047 -1955388 -1817586 -1591071 -1567449 -1821550 -1922635 -1792557 -1553080 -1421439 -1353890
15811 -1353890 -1549821 -1780722 -1800647 -1862029 -1730382 -1642080 -1601499 -1589497 -1435629 -1411903
15801 -1411903 -1656152 -1714208 -1620715 -1799501 -1929979 -1723154 -1471986 -1402255 -1276837 -1184100
15791 -1184100 -1125378 -1289817 -1351693 -1480057 -1576512 -1592438 -1579125 -1659423 -1654336 -1585991 -1541667
15780 -1541667 -1698570 -1805512 -1717493 -1483338 -1483001 -1598490 -1557795 -1373322 -1338318 -1302607 -1285800
15769 -1285800 -1185935 -1338056 -1344201 -1414541 -1493267 -1375035 -1249904 -1187686 -1233768 -1248259 -1329617
15758 -1329617 -1380589 -1373382 -1425172 -1391012 -1320546 -1379968 -1381332 -1148752 -1021711 -1262287 -1448851
15747 -1448851 -1440767 -1564031 -1533330 -1523329 -1437091 -1494197 -1702777 -1580085 -1373908 -1251024
15737 -1251024 -1308883 -1307021 -1349482 -1520988 -1253279 -1261348 -1022144 -957837 -1254923 -1363405 -1348008
15726 -1348008 -1462336 -1750815 -1771255 -1752220 -1746523 -1724604 -1603273 -1456267 -1572623 -1548226
15716 -1548226 -1547653 -1644868 -1587323 -1574618 -1469497 -1397398 -1331049 -1401943 -1367399 -1334229 -1276563
15705 -1276563 -1232008 -1355616 -1433256 -1520185 -1591017 -1659721 -1671577 -1687212 -1436869 -1220637 -1176920
15694 -1176920 -1386521 -1464750 -1374044 -1238947 -1150382 -1050607 -1271039 -1276122 -1289392 -1205527 -1145632
15683 -1145632 -1146607 -1217172 -1240946 -1218967 -1317245 -1127381 -1168412 -1226914 -1343936 -1530427 -1566123
15672 -1566123 -1479842 -1594499 -1682198 -1659914 -1509287 -1634480 -1588108 -1496896 -1454358 -1347337
15662 -1347337 -1342703 -1278647 -1151550 -1167902 -1290504 -1285087 -1230312 -1290993 -1464924 -1335841 -1349284
15651 -1349284 -1233466 -1003172 -1103198 -1196376 -1165111 -1101893 -1214136 -1408910 -1512173 -1567201
15641 -1567201 -1509878 -1280222 -1267400 -1166480 -1126837 -1033044 -1094207 -1171479 -1381444 -1586654
15631 -1586654 -1589792 -1414095 -1330286 -1424754 -1424976 -1442063 -1498575 -1640782 -1558396 -1501330 -1510840 -1454589
15619 -1454589 -1373431 -1525621 -1518141 -1350331 -1221755 -1115729 -1080634 -1094470 -982732 -1058179
15609 -1058179 -1183886 -1193891 -1102711 -1047327 -952424 -913975 -933159 -1010467 -1133668 -897835 -749015
15598 -749015 -630783 -942233 -1053585 -1293378 -1262255 -1216482 -1239414 -1444524 -1561472 -1303459
15588 -1303459 -1187198 -1187270 -1125901 -1266217 -1296952 -1379294 -1385646 -1368136 -1375987 -1453271 -1248215 -1187391
15576 -1187391 -1184985 -1195943 -1059340 -1018118 -1125155 -1131844 -1169364 -1238667 -1311213 -1153812 -1041535
15565 -1041535 -941309 -865552 -1058410 -1066880 -1160025 -1143680 -1110526 -1273449 -1278093 -1260827 -1264441
15554 -1264441 -1329452 -1371274 -1396840 -1544893 -1648846 -1554789 -1389088 -1223188 -1240399 -1174283
15544 -1174283 -1081438 -1185400 -1164034 -1051362 -1067668 -1180513 -1050889 -999331 -905861 -948529
15534 -948529 -931764 -1035259 -1028545 -910330 -921662 -819341 -970689 -1203916 -1314363 -1285056
15524 -1285056 -1241080 -1137502 -864291 -861164 -877845 -1100096 -1036697 -870776 -785658 -1125082
15514 -1125082 -1149076 -996960 -1023154 -876678 -773235 -823580 -963465 -832176 -689956 -758131
15504 -758131 -1035525 -1217688 -1270922 -1161914 -1122717 -1055644 -845580 -848777 -949894 -896907 -918144
15493 -918144 -1092856 -1170305 -1055713 -902735 -1053180 -1213665 -1399922 -1429708 -1141091 -946472
15483 -946472 -976620 -1006608 -880124 -831445 -1167071 -1365303 -1282266 -1248429 -1066414 -1007410 -1062766
15472 -1062766 -1073113 -964262 -724981 -607287 -593997 -774764 -983002 -845560 -687858 -604463
15462 -604463 -601777 -727187 -651266 -717047 -997350 -1147862 -975898 -772213 -692126 -740974 -920442
15451 -920442 -1090579 -1104155 -1227576 -1224860 -1069991 -976027 -1008963 -971791 -1058905 -1045826 -1001902
15440 -1001902 -959173 -1009112 -1029735 -1024283 -868516 -691762 -651545 -832928 -854383 -916878 -726435
15429 -726435 -547428 -624287 -701924 -869879 -959922 -783468 -896878 -832419 -676821 -622420
15419 -622420 -604779 -723678 -726290 -602709 -620004 -576952 -484906 -646130 -810951 -888402 -1012662
15408 -1012662 -995363 -900268 -864802 -810640 -758810 -790812 -782562 -811100 -786873 -599811 -409903
15397 -409903 -321898 -446221 -656595 -744845 -712563 -539601 -464052 -555153 -509224 -592036 -707211
15386 -707211 -782185 -735287 -766893 -851192 -870471 -999453 -1172430 -1327792 -1234656 -1044285 -1052298
15375 -1052298 -1045408 -893929 -609688 -674487 -614210 -726648 -992419 -1078040 -952215 -817515
15365 -817515 -775893 -655640 -663519 -630582 -575165 -633229 -820596 -956055 -1063104 -946172 -730321
15354 -730321 -710186 -835643 -870277 -747789 -539318 -567903 -653798 -733689 -800809 -946880 -1035105
15343 -1035105 -903545 -865457 -630936 -531128 -544107 -727046 -977238 -949437 -776481 -770900
15333 -770900 -697377 -935963 -838359 -758372 -905387 -907145 -686460 -665102 -807771 -832124 -663602
15322 -663602 -654852 -666303 -633683 -655072 -440242 -344389 -570118 -706357 -723592 -748575 -915356
15311 -915356 -853896 -634251 -480114 -609613 -832377 -629643 -571229 -692618 -945302 -855128
15301 -855128 -746527 -881733 -922008 -674116 -598004 -666639 -678517 -448601 -547608 -842524
15291 -842524 -979569 -1117331 -1365967 -1414284 -1242608 -956587 -791519 -657066 -510667 -507621
15281 -507621 -584677 -524811 -710617 -798976 -671175 -535578 -456569 -673803 -580596 -504847 -402110
15270 -402110 -452725 -627934 -644881 -617999 -650026 -688927 -801663 -832515 -585481 -542537 -623229
15259 -623229 -710308 -589335 -306704 -300654 -423211 -647491 -420989 -256853 -332108 -547660
15249 -547660 -630539 -712679 -898055 -916009 -696960 -710323 -827385 -838187 -642265 -620578 -544972
15238 -544972 -501654 -471974 -315260 -223472 -332604 -565517 -688658 -613553 -675053 -550499
15228 -550499 -612501 -724327 -679423 -595913 -564419 -512077 -472253 -501067 -420008 -348642 -389683
15217 -389683 -270026 -396542 -663598 -804636 -800630 -895790 -726286 -730723 -629513 -432509
15207 -432509 -241340 -209635 -241823 -251606 -148578 -280120 -483720 -575231 -624818 -663889 -689355
15196 -689355 -789431 -574682 -528118 -576455 -501266 -376872 -318197 -308870 -123356 -118476 -280709
15185 -280709 -334411 -336704 -412115 -292590 -171621 -144355 -232865 -364474 -373478 -236155 -158957
15174 -158957 -140938 -330394 -317255 -407526 -288198 -214680 -186747 -243350 -230594 -90122 -58775
15163 -58775 -280226 -526411 -752808 -746494 -610085 -712519 -678234 -635428 -466484 -490670 -533844
15152 -533844 -363160 -83220 -179399 -355627 -445276 -519163 -446562 -370910 -359685 -365094 -282521
15141 -282521 -244021 -263198 -301285 -535327 -437157 -223004 -224859 -215700 -87958 -107681 -96098
15130 -96098 -224868 -325892 -392401 -492693 -652677 -606868 -404478 -345121 -269408 -212773 -287473
15119 -287473 -200283 -126403 -205250 -298008 -225406 -309993 -461591 -413113 -427691 -706692 -589849
15108 -589849 -416120 -95942 -70404 -153098 -218192 -234529 -443963 -316544 -149442 -38417
15098 -38417 -96988 -136249 -287895 -287109 -151515 -120272 -199763 -284998 -162505 -98078 -149968
15087 -149968 -187890 -186237 -182481 -230249 -398943 -185560 94247 36039 -24761 -172630 -229786
15076 -229786 -338088 -420251 -405924 -338016 -501171 -304395 -13506 -78516 -463694 -537138
15066 -537138 -286311 -196750 -110665 -98438 -32049 -72496 -180865 -265775 -292307 -182864 -246312
15055 -246312 -303993 -79255 108158 66680 37956 52522 -205981 -518089 -505662 -562796 -569599
15044 -569599 -677987 -765163 -671136 -331789 -107907 -46160 -14664 -18074 -51894 -177315 -238201
15033 -238201 -334294 -271210 -315171 -277230 -213320 -249908 -260680 -210830 -91658 -72298 -292694
15022 -292694 -403741 -391633 -436933 -542108 -535056 -259760 362664 436429 173064 6747
15012 6747 -19838 36640 -17044 -196415 -348162 -304435 -257033 -75228 18729 -36803 -178413
15001 -178413 -224038 -204728 -64629 -127965 -132942 -100683 203741 36121 -45764 -148588 -218949
14990 -218949 -225000 -78391 8507 -26462 -107879 -128694 177974 417089 168866 71569 207095
14979 207095 293311 49415 -9599 -23681 -17669 23106 59064 142994 389639 317531 -4982
14968 -4982 -25202 -76597 64331 137224 241319 179398 270390 320461 117101 -3923 141899
14957 141899 45830 11019 125811 231415 117066 98800 83623 77403 161574 219044 166854
14946 166854 205163 204772 131512 -33108 45132 -45889 -105709 -72041 -99163 -94727 201956 261868
14934 261868 282055 195773 63256 25187 183477 241453 262741 212353 99552 110042 29410
14923 29410 -36028 -178013 -163974 -115893 22809 336946 512424 515437 311760 336797 281435
14912 281435 304581 265035 285763 342520 306779 356703 413800 431537 328682 180134 -71224
14901 -71224 -104360 58057 73981 12235 79843 167010 109262 151100 310659 459118 413699
14890 413699 158696 -7093 -27961 66172 279713 402883 414808 427991 491608 434875 412085
14879 412085 291053 109754 94273 1311 -14780 69606 281228 385863 422213 374311 184621
14868 184621 26289 162 117635 323640 237970 246294 173646 -154624 -75474 -6547 -120735
14857 -120735 -164049 21978 -53814 -7990 -101544 93074 323112 409062 355148 92954 -42217
14846 -42217 168869 329968 284878 289077 360340 471508 335859 286928 255036 242893 251391
14835 251391 144997 82220 239258 329474 244056 253716 63738 161570 248309 275321 408748
14824 408748 327359 306162 270159 211807 200304 511792 671675 859085 712281 544395
14814 544395 468810 155155 128066 305763 222957 151714 192646 254591 344467 476567 638695
14803 638695 781679 695682 661007 558572 521593 534794 522095 526903 288065 181826 310081
14792 310081 292092 308432 354816 414248 330119 573493 743432 605464 504290 433123 432073
14781 432073 281821 270308 404296 375467 242512 491746 818406 904480 834235 657546
14771 657546 472159 448419 506563 520614 461832 510162 500457 483329 266372 112575 256189
14760 256189 367369 478603 526877 638145 644394 628205 477874 501938 855103 1090073
14750 1090073 941015 779056 722375 724067 682330 496426 221732 264450 440446 535798
14740 535798 667245 784559 746899 631184 580450 611442 746941 960710 947465 813213
14730 813213 611975 615910 766550 935190 864697 477821 290070 510934 433120 383860
14720 383860 414156 507479 527525 468024 539107 505946 584446 710677 1003363 1015176 940818
14709 940818 775670 669324 831735 673901 466348 524823 631752 993470 1048170 936259
14699 936259 757301 637962 593861 785975 730943 622274 694465 853858 841670 897547
14689 897547 823805 842345 1164170 1292123 1138021 915811 640232 630081 617083 454830
14679 454830 414835 545913 560694 601825 487567 359892 321880 399264 480682 326683 187186
14668 187186 206377 618910 698626 590350 546248 646239 788626 876522 703399 676303 567617
14657 567617 518520 656618 890149 1082665 1144390 911422 843014 1005881 1147635 1088862
14647 1088862 970653 945240 1216977 1428290 1141997 883493 844526 716137 556888 670350
14637 670350 917959 855935 844531 705123 736944 618917 712982 861558 1007242 1083640
14627 1083640 993481 766329 769500 782958 678047 862676 1034632 1088994 955727 849533
14617 849533 956014 1079114 1180383 1139453 945265 813402 873102 784691 865251 951301
14607 951301 991266 1124191 1281878 1170998 1030412 1231562 1354627 1280326 1365445 1436070
14597 1436070 1174414 1006136 793451 661928 680536 770628 987687 1074330 1032650 951232
14587 951232 1104582 1091436 1052183 1093478 1151320 1254509 1471303 1447859 1007273 978176 1232368
14576 1232368 1107705 1049371 1126030 1083705 1111110 1098476 1103998 1025887 839273 763922 887232
14565 887232 1145440 1082329 1017360 1083469 1188469 1171546 1047036 1080069 963825 1095563
14555 1095563 1065611 1142835 1271160 1196423 1207485 1096374 854258 902371 1203149 1351338
14545 1351338 1178118 1079060 1015187 985452 1163401 1309257 1445325 1465540 1407207 1246418
14535 1246418 1115866 973533 1253398 1262492 1177018 1304044 1307762 1447620 1557800 1292955
14525 1292955 1100443 971537 972951 1030106 1078781 1187408 1037067 1149969 1279877 1314336
14515 1314336 1369112 1429541 1612042 1495125 1458434 1366774 1274620 1155722 1147607 1231500 1435066
14504 1435066 1458584 1488587 1500487 1537974 1351735 1113664 1177674 1332197 1443711 1408372
14494 1408372 1311632 1152083 1213759 1274466 1336712 1352736 1382845 1594016 1500919 1672988 1833433
14483 1833433 1744138 1589340 1493617 1317301 1408435 1293172 1276340 1310821 1581973 1636222
14473 1636222 1591486 1406326 1334168 1341802 1431868 1639421 1619538 1565226 1489340 1538128 1774975
14462 1774975 1725824 1486884 1415675 1412425 1666377 1559477 1423637 1406816 1512986 1439182
14452 1439182 1325371 1388624 1450717 1544285 1631707 1587723 1526198 1301959 1315218 1461892 1466147
14441 1466147 1690870 1896751 1836751 1901000 1705486 1696397 1705840 1715107 1776603 1673007 1514144
14430 1514144 1380050 1258201 1318596 1244116 1364442 1322160 1167233 1288050 1257065 1241683
14420 1241683 1386375 1459187 1372666 1320026 1140746 1038869 1254999 1107182 1014238 1105135
14410 1105135 1284494 1601622 1779853 1625955 1494222 1567191 1448635 1498876 1517490 1662489
14400 1662489 1595390 1585193 1635264 1648572 1489620 1623185 1842444 1837441 1806703 1819762 1693647
14389 1693647 1574751 1570294 1789250 1856838 1802569 1644551 1698385 1684644 1739004 1840107 1739756
14378 1739756 1655293 1710641 1823963 1841672 1917890 2191959 2140123 2125844 2044893 1946992 1789641
14367 1789641 1938795 2024750 1821429 1681754 1618060 1789436 1790611 1812823 1800665 1797649 1795774
14356 1795774 1815151 1715159 1759208 1738511 1698063 1889569 1904702 1947103 1989027 1961314 1788792
14345 1788792 1823819 1793029 1940469 1802875 1800269 1771576 1858911 1875892 2013262 1749053 1916881
14334 1916881 2134218 2019637 2148912 2049102 2098837 2265220 2272121 2271539 2439355 2573424 2318506
14323 2318506 2176222 2086594 2054388 2043511 1998250 2099650 2041463 1929022 1819189 1669895
14313 1669895 1872789 1981312 2090034 2184780 2112045 2074915 2080975 2137599 2053820 1952151 2082858
14302 2082858 1929329 1855047 1941908 2112180 2171704 2115113 2070961 2273122 2458752 2333815
14292 2333815 2433164 2654831 2500368 2191167 1910030 2053231 2363050 2445059 2213533 2197517
14282 2197517 2129830 2056175 1994973 2079662 2058841 2006068 2187362 2328018 2429317 2566003
14272 2566003 2635878 2377359 2320796 2492418 2466057 2415732 2408730 2384301 2471273 2477494 2585086
14261 2585086 2465779 2289697 2350306 2432443 2505487 2391635 2259899 2199974 2184940 2246593
14251 2246593 2163060 2149718 2267132 2228996 2013033 2229812 2293023 2216027 2179640 2214426 2256219
14240 2256219 2189904 2209148 2430483 2357892 2244027 2161294 2255320 2476322 2623361 2594869
14230 2594869 2764788 2756670 2543549 2515267 2541154 2564294 2460438 2489718 2572058 2516999 2500037
14219 2500037 2465533 2357692 2304122 2266219 2354792 2383412 2355539 2481397 2536687 2533821 2630254
14208 2630254 2642344 2625160 2608380 2529984 2519892 2601362 2515704 2596648 2719905 2759098 2781947
14197 2781947 2798676 2634978 2334918 2362665 2517900 2525493 2371143 2000271 1955993 2241564
14187 2241564 2391800 2612709 2951403 2974945 2906715 2844977 2900382 2688446 2758643 2790845
14177 2790845 2855193 2727965 2688175 2688633 2554949 2687027 2899505 2898407 2789948 2800891 2674123
14166 2674123 2747718 2801263 2967585 3085748 3001634 2827194 2870117 2892914 2802243 2440743
14156 2440743 2389778 2531963 2850062 2964875 2838074 2686245 2642820 2801993 2914991 2785043
14146 2785043 2671454 2736078 2839077 2936909 3202376 3208751 3016286 2877557 3087459 3144840
14136 3144840 3041695 2945110 2788152 2816813 2940840 3000976 3061408 2922984 2812600 2983178
14126 2983178 2971894 3020683 3235386 3342509 3200271 3328390 3330838 3224938 3088760 2948368
14116 2948368 2809589 3131819 3052584 2991649 3000628 2785612 2709526 2791720 2987242 3209923
14106 3209923 3247124 3115068 3264263 3340177 3318509 3410263 3306595 3261285 3150357 3240944
14096 3240944 3290068 3376244 3634157 3536293 3421750 3446517 3304098 3229497 3099004 3055553
14086 3055553 3044435 3076680 3077048 3250609 3204187 3268767 3353359 3487894 3600368 3679891 3774101
14075 3774101 3770234 3857920 3807254 3720212 3561100 3379035 3342523 3286907 3187944 3207946 3349266
14064 3349266 3537061 3648901 3614036 3516834 3434980 3189555 3126855 3105240 3154686 3163776 3359300
14053 3359300 3442752 3470230 3353091 3489788 3555334 3470012 3506889 3539224 3644506 3811278
14043 3811278 3864918 3904012 3708971 3432275 3552314 3342715 3185392 3205645 3510681 3687317
14033 3687317 3800560 3981804 3843335 3941983 3906483 3932507 3887061 3734718 3736023 3872089
14023 3872089 3771211 3689423 3885889 3897212 3811870 3553171 3600279 3660190 3566717 3455316
14013 3455316 3437980 3422479 3548735 3555736 3602422 3721753 4002862 4091918 4141905 4058246 4060645
14002 4060645 4014947 4085621 4001241 3856157 3957323 4111578 4213149 4204175 4074967 3946174
13992 3946174 3775091 3714824 3620713 3601608 3697439 3981631 3947369 3613616 3485359 3623932
13982 3623932 3738920 4052328 4082505 3958505 4043227 3925398 4027106 4347838 4407301 4313145
13972 4313145 4271623 4196453 4341261 4249342 4096368 3882511 3925975 4163310 4300823 4200929
13962 4200929 3978942 3935137 4189093 4324438 4227323 4166705 4072559 3883342 4025426 4130333
13952 4130333 4247032 4430948 4279044 4252351 4170891 3970389 4095244 4268791 4306692 4366097
13942 4366097 4388096 4354884 4382214 4418308 4365577 4317128 4077390 3994473 4003478 4002433 4188491
13931 4188491 4212002 4487352 4629381 4452814 4515985 4585814 4352253 4283448 4295249 4342466
13921 4342466 4475943 4666637 4814505 4653173 4510248 4335730 4134993 4228205 4172236 4232071
13911 4232071 4129467 4173924 4241084 4310647 4456123 4462999 4350072 4411812 4479065 4489590 4726987
13900 4726987 4832528 4493647 4440579 4480749 4582353 4697888 4772834 4734484 4622999 4625720
13890 4625720 4503250 4385564 4366905 4484740 4544864 4322071 4144402 4295910 4301678 4272836
13880 4272836 4321121 4217695 4180822 4197990 4327815 4245735 4180952 4276768 4338071 4394774 4336112
13869 4336112 4538401 4640567 4553839 4478288 4359212 4196108 4378798 4483613 4362718 4271752
13859 4271752 4278652 4356974 4168744 4136014 3980847 4188773 4326151 4372844 4307314 4332276 4178741
13848 4178741 4281331 4378592 4328357 4265285 4393237 4482862 4478768 4521017 4551861 4595803 4645795
13837 4645795 4620190 4692482 4598224 4384698 4395497 4136001 4068081 4082325 4024401 4025714 4235202
13826 4235202 4227122 4182708 4145879 4099390 4068374 4157656 4206748 4227734 4058360 3983408 4085653
13815 4085653 4013733 4034436 4218875 4279797 4304344 4223928 4282266 4157756 4031788 4158744
13805 4158744 4229280 4295282 4359328 4318342 4275550 4279173 4190178 4203612 4334364 4115355 3747468
13794 3747468 3659885 3680484 3632666 3399578 3546035 3699647 3692734 3568760 3757098 3824453
13784 3824453 3918229 3993438 3851544 3785440 3720558 3827636 3882462 3593281 3619900 3743803
13774 3743803 3815664 3705979 3655455 3541577 3211506 3017038 3137486 3402623 3568694 3520649
13764 3520649 3331089 3268119 3484542 3335117 3260634 3426314 3410738 3228739 3327405 3364228
13754 3364228 3261132 3004373 3085109 3175052 3317845 3302031 3183042 3216778 3220634 3184140 3159521
13743 3159521 3158007 3103239 2973524 3043158 2906630 2772158 2793477 2852429 2659657 2665706 2530633
13732 2530633 2473189 2509958 2463533 2393826 2455071 2360828 2220123 2229424 2241018 2227070 2329209
13721 2329209 2321968 2341297 2341408 2216362 2056766 2171072 2181968 2209105 2270190 2154868 2017800
13710 2017800 1869094 1964077 2153588 2226910 2059705 1979831 1963237 2019664 2149657 2123451
13700 2123451 1969674 1866538 1829489 1728001 1697684 1794590 1845897 1974936 1796640 1559418
13690 1559418 1413748 1435657 1496947 1339784 1329708 1167339 938284 926545 911189 909984 994232
13679 994232 1141960 1171411 1289431 1322536 1151239 934622 703251 770915 843400 667250
13669 667250 609016 544069 477308 402076 503927 626866 638677 493840 206514 199776 114503
13658 114503 40260 25213 -39876 14567 -122439 -276539 -225009 -167195 -124188 -204559 -160182
13647 -160182 -99574 -228970 -355133 -427223 -452958 -407955 -372842 -576737 -620705 -710282 -688701
13636 -688701 -575588 -604737 -441769 -326027 -454036 -654600 -880679 -1060259 -1130064 -1008174
13626 -1008174 -890290 -840706 -1030673 -1129940 -944215 -1030923 -1231563 -1364714 -1563567 -1568850
13616 -1568850 -1516779 -1514082 -1550533 -1576178 -1699415 -1846665 -1863116 -1745315 -1806146 -1835161 -1849433
13605 -1849433 -1931656 -2007317 -1997586 -2203763 -2357599 -2375541 -2434284 -2494860 -2559983 -2746031 -2707000
13594 -2707000 -2645113 -2643363 -2605414 -2430794 -2541230 -2702834 -2670878 -2731682 -2779962 -2812712 -2782679
13583 -2782679 -2852798 -2773396 -2853268 -2901063 -2799617 -2828713 -2872352 -2830728 -2778914 -2903400 -3216978
13572 -3216978 -3499875 -3566208 -3508693 -3525818 -3451842 -3521818 -3386441 -3397581 -3407953 -3487667 -3540860
13561 -3540860 -3262944 -3314758 -3475986 -3514044 -3544665 -3891911 -3876574 -3987575 -4057688 -4020760
13551 -4020760 -3982525 -3887322 -3767794 -3670561 -3598505 -3752040 -3959925 -4104830 -4254612 -4091047
13541 -4091047 -4022552 -4186692 -4304149 -4281823 -4186846 -4290899 -4177839 -4311523 -4384575 -4407971
13531 -4407971 -4454102 -4322476 -4178499 -4082084 -4194359 -4534360 -4695093 -4826518 -4844097 -4977762
13521 -4977762 -5011281 -4856219 -4929755 -4841632 -4676725 -4642788 -4572783 -4674163 -4874091 -4943377
13511 -4943377 -5047786 -4911693 -4875550 -4776603 -4761743 -4780868 -4928303 -5028001 -5211528 -5343213
13501 -5343213 -5539388 -5316006 -5098820 -5020923 -4937220 -5082931 -5125750 -5002854 -4721526 -4807290
13491 -4807290 -4841894 -4945300 -5184013 -5112254 -5167922 -5327266 -5272020 -5285993 -5304959 -5184469
13481 -5184469 -5175484 -5162407 -5264254 -5321814 -5486771 -5778636 -5628490 -5462893 -5421102 -5606193
13471 -5606193 -5423186 -5329581 -5399644 -5398356 -5487996 -5612736 -5696426 -5607846 -5616199 -5475983 -5336875
13460 -5336875 -5360456 -5374341 -5359495 -5333520 -5653477 -5820672 -5787487 -5907123 -5601011 -5363568
13450 -5363568 -5442693 -5562616 -5514095 -5655410 -5773359 -5640336 -5762448 -5691186 -5612918 -5531907
13440 -5531907 -5701432 -5890831 -6023983 -6232088 -6361366 -6467483 -6159087 -5980098 -6102282
13431 -6102282 -5895330 -5931196 -5981853 -5812728 -5773101 -5677571 -5656076 -5800811 -5904660 -5854513
13421 -5854513 -5852469 -5933887 -5840897 -5726468 -5744831 -5820985 -5774345 -5769988 -5685255 -5517483 -5568649
13410 -5568649 -5576029 -5723178 -5670953 -5605662 -5696700 -5915320 -5911586 -5724536 -5629671 -5755325 -5851594
13399 -5851594 -5826083 -5830552 -5921738 -5741402 -5634027 -5673876 -5820648 -5674496 -5489086 -5683519
13389 -5683519 -5675686 -5680342 -5653003 -5904506 -6074320 -6038974 -6002238 -6011101 -6066708 -6315884 -6337269
13378 -6337269 -6191008 -6033031 -6021009 -6124293 -6131018 -6185604 -5964160 -5760284 -5679336 -5954408
13368 -5954408 -6035822 -6159806 -6151944 -6076325 -6065040 -5990103 -6113052 -6157852 -6012793 -5919089 -5957909
13357 -5957909 -5962467 -6119782 -6121287 -6098021 -6069649 -6096271 -5979362 -5984243 -6017905 -6078313 -6069122 -5952304
13345 -5952304 -5987241 -6253709 -6242440 -6103025 -5892130 -5908990 -5903111 -5871013 -5903549 -5969262 -5774376
13334 -5774376 -5862529 -5933625 -5859807 -5898496 -5930816 -5747211 -5762122 -5943651 -6046582 -5907385
13324 -5907385 -5542725 -5497024 -5485544 -5596437 -5839748 -5918025 -5697354 -5582238 -5620779 -5640870
13314 -5640870 -5648689 -5887277 -5973138 -5816112 -5752524 -5667488 -5510721 -5655449 -5891337 -5867526
13304 -5867526 -5770998 -5848046 -5725025 -5362076 -5227389 -5360239 -5581822 -5711303 -5695226 -5634837
13294 -5634837 -5556882 -5725088 -5772953 -5775285 -5717187 -5665081 -5564293 -5361656 -5491563 -5526565 -5428728
13283 -5428728 -5326393 -5401366 -5446652 -5554555 -5953182 -5927892 -5818310 -5797003 -6066440 -6170336
13273 -6170336 -5992950 -5880216 -5742108 -5625333 -5637519 -5693629 -5587673 -5643366 -5730396 -5744521
13263 -5744521 -5761346 -5993438 -6242731 -5986083 -5793561 -5617414 -5686044 -5800639 -5907564 -5892410
13253 -5892410 -5992127 -6028711 -5989487 -5930682 -5688831 -5528406 -5439392 -5485180 -5677851 -5562237
13243 -5562237 -5291380 -5188441 -5099059 -5316800 -5380913 -5403698 -5517742 -5590851 -5431080 -5477254
13233 -5477254 -5630879 -5489445 -5386433 -5203925 -5293643 -5293843 -5086185 -5021699 -5180196 -5237126
13223 -5237126 -5262054 -5314508 -5338887 -5401738 -5506821 -5483409 -5507146 -5529754 -5447892 -5288907 -5115554
13212 -5115554 -5280576 -5395814 -5504926 -5386192 -5402079 -5403081 -5400801 -5447424 -5460188 -5468589 -5582949
13201 -5582949 -5601344 -5562767 -5461417 -5332562 -5303279 -5379504 -5249846 -5063393 -5495015 -5592885
13191 -5592885 -5311357 -5340252 -5461139 -5546221 -5552465 -5239015 -5239324 -5246619 -5253251 -5264364 -5245528 -5232758
13179 -5232758 -5274771 -5198536 -5123195 -5233039 -5068967 -5110274 -5150800 -5282401 -5270593 -5305446 -5317008
13168 -5317008 -5252103 -5089491 -4944155 -5118143 -5475091 -5790237 -5607366 -5375276 -5280812 -5268098
13158 -5268098 -5349781 -5444905 -5533737 -5506892 -5417378 -5267624 -5169088 -5015687 -5114874 -5178715 -5182516
13147 -5182516 -5026715 -5194932 -5250726 -5282463 -5434390 -5521123 -5347348 -5238070 -5133831 -4839944
13137 -4839944 -4812778 -4993388 -5075529 -4918378 -4798236 -4938436 -4966424 -5006351 -4935327 -5230674
13127 -5230674 -5375650 -5290119 -5149842 -4997812 -4932377 -5117461 -5055590 -4987448 -4908659 -4913607 -4875772
13116 -4875772 -4850113 -4835637 -4935933 -5045520 -5073193 -4971603 -4979677 -5035075 -5240435 -5059888
13106 -5059888 -4930977 -4733502 -4760368 -4826364 -4869578 -4876057 -4858242 -4844341 -4976144 -5101644 -5196686
13095 -5196686 -5248838 -5157835 -5133199 -5210416 -5135240 -4966639 -4814520 -4649982 -4589207 -4467527
13085 -4467527 -4525541 -4699299 -4724271 -4741613 -4748296 -4706640 -4904030 -4996567 -4947095 -4935140 -5021687
13074 -5021687 -5044318 -5042029 -4964924 -4976868 -4860556 -4834491 -5013483 -5093700 -4965832 -4852142 -4671337
13063 -4671337 -4563980 -4631814 -4931861 -5070576 -5010877 -4954955 -4923056 -4914171 -4730536 -4777837 -4896346
13052 -4896346 -4915295 -4761066 -4463005 -4529401 -4705776 -4719008 -4606283 -4545929 -4700691 -4869690
13042 -4869690 -4917448 -4940182 -4882362 -4820234 -4663776 -4459872 -4456474 -4678522 -4758789 -4668895 -4628566
13031 -4628566 -4442157 -4389997 -4547859 -4596046 -4353595 -4370103 -4616140 -4630548 -4605795 -4997699
13021 -4997699 -5217036 -4969291 -4834318 -4673138 -4623687 -4536230 -4562931 -4659212 -4809368 -4921567
13011 -4921567 -4809541 -4631969 -4414736 -4341981 -4417753 -4487282 -4649476 -4647978 -4437957 -4408290
13001 -4408290 -4500107 -4531231 -4577103 -4516010 -4604194 -4683323 -4829819 -4802416 -4710124 -4815272 -4780534
12990 -4780534 -4564845 -4418940 -4370858 -4518475 -4601136 -4481562 -4445361 -4484275 -4501212 -4574214
12980 -4574214 -4666742 -4793212 -4685140 -4405841 -4317156 -4191154 -4180672 -4334374 -4392927 -4397681
12970 -4397681 -4376946 -4418086 -4464795 -4370037 -4262343 -4541416 -4547229 -4437608 -4358640 -4071555 -4086422
12959 -4086422 -4062114 -4061719 -4251022 -4188467 -4166140 -4140794 -4235610 -4348557 -4445673 -4324727 -4198705
12948 -4198705 -4309695 -4411675 -4306499 -4302732 -4347097 -4184501 -4001023 -4217227 -4390834 -4417604
12938 -4417604 -4251609 -4266370 -4302790 -4404141 -4582196 -4361081 -4251850 -4388105 -4525843 -4264367
12928 -4264367 -4182676 -4186262 -4256198 -4148787 -4064232 -4152059 -4034699 -3995976 -4270478 -4344140 -4255976
12917 -4255976 -4330662 -4506844 -4452531 -4268758 -4255252 -4345938 -4191972 -4049123 -3954925 -3746602
12907 -3746602 -3775355 -3856060 -3958698 -4041198 -4028966 -3973960 -4362051 -4422645 -4479407 -4591595 -4527274
12896 -4527274 -4504793 -4508977 -4385096 -4124464 -4077180 -4068381 -4270789 -4322331 -4229483 -3950246 -3902924
12885 -3902924 -3941412 -4144826 -4379380 -4249937 -4189085 -4321089 -4338231 -4351728 -4404836 -4266619
12875 -4266619 -4204385 -4280349 -4213805 -4176173 -4128017 -4205234 -4341381 -4165463 -4147187 -4011732 -4007767
12864 -4007767 -4081989 -4178849 -4189584 -4084217 -4084923 -4053558 -4032806 -4048096 -3937132 -3751498 -3729488
12853 -3729488 -3730592 -3949553 -4182582 -4103287 -4004817 -4136523 -4123859 -4073388 -4081878 -4159056 -4084199
12842 -4084199 -4127433 -4209638 -4191448 -4005057 -3995723 -4074344 -4153829 -4322011 -4402147 -4304246 -4358384
12831 -4358384 -4332793 -4467431 -4305269 -4145702 -4138799 -4196495 -4250614 -4095594 -3937596 -3888453
12821 -3888453 -3729711 -3512633 -3561863 -3745349 -3927677 -3944350 -3874789 -3811388 -3833646 -3718667
12811 -3718667 -3544712 -3605319 -3659614 -3578460 -3630469 -3873898 -3987270 -3917776 -3818910 -3891636 -3872462
12800 -3872462 -3947645 -3834515 -3704068 -3692779 -3883354 -3869428 -3758119 -3718478 -3813696 -3862808
12790 -3862808 -3796557 -3801283 -3829019 -4057197 -4157557 -4241482 -4132366 -3896427 -3953677 -4259560
12780 -4259560 -4199969 -4200735 -4246409 -4252355 -4240256 -4286708 -4126851 -3885463 -3604559 -3700550 -3737902
12769 -3737902 -3817234 -3724004 -3811524 -3870007 -4052514 -3856756 -3809012 -3877759 -4004101 -4035077 -3952587
12758 -3952587 -3884625 -3778818 -3691598 -3758062 -3927750 -3994986 -3804391 -3675230 -3794809 -3624431
12748 -3624431 -3751094 -3874865 -3987182 -3879716 -3837824 -4065026 -4040447 -4103552 -4066221 -4034620
12738 -4034620 -3976254 -3997434 -3842672 -3613874 -3590347 -3618096 -3635968 -3632349 -3493268 -3382181 -3529213
12727 -3529213 -3642991 -3546586 -3657498 -3824287 -3985048 -3943708 -3623696 -3563811 -3635635 -3736817
12717 -3736817 -3836962 -3777889 -3576816 -3460622 -3523835 -3466595 -3567135 -3852521 -3921486 -3903136
12707 -3903136 -3888524 -3840518 -3725938 -3667291 -3521556 -3563484 -3723362 -3964231 -4015303 -3822408
12697 -3822408 -3738736 -3812711 -3815152 -3841518 -3857577 -3806315 -3659698 -3525595 -3535199 -3476233 -3476393 -3544513
12685 -3544513 -3548963 -3633389 -3819949 -3877702 -3744212 -3699216 -3618569 -3558556 -3542986 -3639761 -3806177
12674 -3806177 -3711366 -3548176 -3607896 -3609652 -3306986 -3283245 -3435383 -3285416 -3084308 -3195365
12664 -3195365 -3477114 -3564638 -3608308 -3737101 -3899201 -3971074 -3855365 -3744339 -3794366 -3839756
12654 -3839756 -3931583 -3750149 -3338133 -3204903 -3220921 -3313405 -3395946 -3313236 -3346280 -3459383
12644 -3459383 -3454971 -3525616 -3768031 -3737209 -3543035 -3406947 -3363353 -3407936 -3413718 -3499553 -3448766
12633 -3448766 -3458480 -3503193 -3425961 -3579746 -3646891 -3534074 -3484744 -3411090 -3316372 -3479479 -3386043
12622 -3386043 -3181035 -3313422 -3318467 -3232822 -3273807 -3373687 -3415755 -3426266 -3502792 -3542572 -3603380
12611 -3603380 -3576130 -3595899 -3647951 -3687666 -3728611 -3736387 -3749054 -3755715 -3575987 -3529668 -3722160
12600 -3722160 -3559675 -3416370 -3420933 -3471468 -3559627 -3555778 -3424357 -3234611 -3211302 -3067561 -3124135
12589 -3124135 -3381247 -3451287 -3515738 -3612714 -3530929 -3583484 -3528585 -3475499 -3395268 -3531362 -3421233
12578 -3421233 -3379633 -3251662 -3252036 -3378517 -3451279 -3554697 -3638319 -3704013 -3585797 -3572074 -3744384
12567 -3744384 -3779004 -3776634 -3625803 -3556704 -3439749 -3309561 -3371151 -3528802 -3496425 -3379899
12557 -3379899 -3317557 -3189841 -3182912 -3129375 -3158526 -3411273 -3636737 -3688113 -3604454 -3510985 -3405780
12546 -3405780 -3450199 -3562995 -3387156 -3155971 -3188769 -3350991 -3380504 -3422404 -3363620 -3370929 -3536289
12535 -3536289 -3450239 -3469509 -3475424 -3196576 -3043601 -3130411 -3385087 -3527848 -3470807 -3406347 -3427972
12524 -3427972 -3323971 -3339049 -3286966 -3288614 -3362871 -3316000 -3187848 -3388236 -3583031 -3727810
12514 -3727810 -3709720 -3654393 -3404777 -3357351 -3491315 -3559286 -3277268 -3221476 -3162066 -3030676
12504 -3030676 -3200754 -3369801 -3118413 -3013779 -3158818 -3074325 -3231055 -3345375 -3277171 -3386408
12494 -3386408 -3366188 -3384140 -3180844 -3073931 -3292001 -3510149 -3538444 -3573531 -3705122 -3608336
12484 -3608336 -3430712 -3376720 -3639242 -3702423 -3516297 -3463992 -3494341 -3441780 -3424062 -3397990 -3206752
12473 -3206752 -3240516 -3246240 -3073212 -2859592 -2796018 -2890676 -2917354 -2878395 -2929567 -3138038 -3103680
12462 -3103680 -3175435 -3234708 -3405893 -3481014 -3383493 -3521414 -3522164 -3279573 -3106366 -3122592 -3117348
12451 -3117348 -3033034 -3165532 -3341996 -3442615 -3264444 -2999888 -3203911 -3426615 -3333966 -3314393
12441 -3314393 -3195992 -3207325 -3192898 -3375924 -3346125 -3395964 -3235911 -2952725 -2911340 -2878503
12431 -2878503 -3100877 -3147180 -3193272 -3197289 -3142589 -2973975 -2974861 -3053597 -3084836 -3089711 -3014090 -3215410
12419 -3215410 -3381047 -3296394 -3145837 -3119924 -3288502 -3353292 -3601322 -3633503 -3403342 -3193857
12409 -3193857 -3096806 -3197379 -3072814 -2930275 -3022653 -3172122 -3163218 -3187624 -3037338 -2831192
12399 -2831192 -2767319 -3086573 -3235751 -3103409 -3049601 -2976140 -3018869 -3095435 -3039500 -2867506
12389 -2867506 -3036961 -3257139 -3383806 -3232443 -3177186 -3208164 -2952920 -2875350 -3190902 -3185229
12379 -3185229 -3065414 -2902070 -2800210 -2726255 -2838291 -3012296 -2862462 -2907237 -3033022 -2928786
12369 -2928786 -3122391 -3231892 -3186840 -3350212 -3536945 -3290415 -3023946 -3027814 -3014182 -2903971
12359 -2903971 -2667551 -2689968 -2987117 -3044505 -3159998 -3285150 -3206589 -2984205 -3046770 -3006582
12349 -3006582 -2813864 -2795311 -2651902 -2719058 -2861452 -2759744 -2785190 -3011308 -3267336 -3302677
12339 -3302677 -3289885 -3553354 -3543524 -3453415 -3247265 -3202825 -3197953 -3316337 -3252915 -3081667 -3080613
12328 -3080613 -3230286 -3195680 -2979990 -2844268 -2678691 -2726964 -2707905 -2740384 -2680708 -3009200
12318 -3009200 -3295815 -3341830 -3186020 -2785558 -2679037 -2808814 -2846077 -2877904 -2986406 -2959056
12308 -2959056 -3054082 -2980982 -3018863 -3005633 -2939650 -2823791 -2945758 -3131750 -3210338 -3332749
12298 -3332749 -3096979 -3075488 -3072663 -2897971 -2693287 -2518783 -2746044 -2865455 -2865196 -2964188 -3088745
12287 -3088745 -2905238 -2634508 -2571703 -2817275 -2933566 -3071862 -3099338 -3219561 -3255156 -3143032
12277 -3143032 -3053476 -2828257 -2689186 -2683386 -2651633 -2823971 -3101252 -2872754 -2720294 -2940264
12267 -2940264 -2829415 -2646839 -2576810 -2588904 -2776019 -3042337 -2908127 -2988924 -3186410 -3251235
12257 -3251235 -2992654 -2832066 -2891886 -2725887 -2467663 -2352314 -2398387 -2734560 -2860017 -2861181
12247 -2861181 -2963125 -2946723 -2945565 -3146643 -3434491 -3497219 -3232759 -3064798 -2931567 -2689029
12237 -2689029 -2550550 -2786312 -3006741 -2889704 -2625777 -2375779 -2587535 -2730260 -2769302 -2678625
12227 -2678625 -2590861 -2549279 -2621489 -2784153 -2728971 -2872677 -3037672 -3120501 -3138470 -3023402
12217 -3023402 -2787649 -2699383 -2719137 -2634395 -2552166 -2529130 -2748585 -2930957 -2913126 -2707672
12207 -2707672 -2753639 -2805267 -2837790 -2740292 -2709006 -2743642 -2819135 -2692264 -2723175 -2832164 -2958771
12196 -2958771 -2753566 -2600019 -2824444 -3083527 -3160015 -3071708 -2944662 -2832131 -2691101 -2707717
12186 -2707717 -2863194 -2922671 -2831844 -2894966 -2769999 -2640392 -2653643 -2504301 -2486175 -2496625
12176 -2496625 -2688812 -2676907 -2619968 -2639085 -2442404 -2379609 -2467588 -2460519 -2527081 -2543321 -2849731
12165 -2849731 -2649980 -2571016 -2463839 -2471110 -2591412 -2791560 -3009874 -3132155 -3168488 -3232675
12155 -3232675 -3022610 -2790123 -2859214 -2857119 -2671161 -2745719 -2957727 -2859287 -2885118 -3027203
12145 -3027203 -2800764 -2851662 -3054296 -3063387 -3069957 -3009010 -2940999 -2848724 -2833106 -2726307 -2747257
12134 -2747257 -2833170 -2772971 -2680352 -2542788 -2442515 -2409185 -2531583 -2857047 -2913303 -2899602
12124 -2899602 -2848065 -2757789 -2604158 -2489820 -2397021 -2193856 -2304941 -2392690 -2406212 -2315405
12114 -2315405 -2453471 -2616229 -2589402 -2647358 -2682816 -2645594 -2653486 -2668636 -2721046 -2655320 -2647202
12103 -2647202 -2537715 -2426340 -2573581 -2592987 -2632191 -2737650 -2893843 -2889325 -2845794 -2527354
12093 -2527354 -2574358 -2706719 -2609861 -2654354 -2654622 -2557857 -2670520 -2797491 -2763118 -2692893 -2688373
12082 -2688373 -2699276 -2775907 -2633107 -2490612 -2406303 -2235831 -2176171 -2227034 -2331973 -2509862
12072 -2509862 -2743647 -2716464 -2401934 -2324135 -2279697 -2239156 -2259241 -2353290 -2362121 -2451192 -2501967
12061 -2501967 -2636898 -2772653 -2687126 -2536624 -2444352 -2599291 -2763988 -2762363 -2847381 -2762059
12051 -2762059 -2643000 -2646293 -2604774 -2581223 -2510585 -2552665 -2664409 -2525329 -2715518 -2774114 -2647260
12040 -2647260 -2843461 -2825550 -2646055 -2422036 -2542882 -2831107 -2940841 -2727012 -2538886 -2531217
12030 -2531217 -2622314 -2593427 -2466832 -2560423 -2610342 -2793235 -2850123 -2663817 -2493701 -2611651
12020 -2611651 -2659244 -2540561 -2586676 -2692659 -2812997 -2616239 -2369654 -2189268 -2266460 -2365729
12010 -2365729 -2504327 -2731073 -2832687 -2962793 -2993617 -2849958 -2761092 -2687646 -2521685 -2626428
12000 -2626428 -2716620 -2699829 -2680856 -2681469 -2714099 -2641372 -2647227 -2901681 -3033405 -3041219 -2843982
11989 -2843982 -2793451 -2787019 -2535056 -2463684 -2411297 -2473458 -2484549 -2490978 -2521128 -2588732 -2536722
11978 -2536722 -2534261 -2616991 -2773808 -2561927 -2469533 -2230813 -2086470 -2331855 -2374673 -2376477 -2225336
11967 -2225336 -2223044 -2286730 -2308141 -2449444 -2381881 -2275932 -2344309 -2294925 -2322317 -2452280 -2434315
11956 -2434315 -2450922 -2328936 -2404850 -2503599 -2504887 -2528989 -2521218 -2510976 -2545994 -2458438 -2305334
11945 -2305334 -2243295 -2259675 -2218105 -2210704 -2144983 -2209465 -2568322 -2722138 -2565315 -2513113 -2518519
11934 -2518519 -2607170 -2808036 -2697619 -2551872 -2483089 -2482623 -2367686 -2410178 -2421904 -2475910 -2538561
11923 -2538561 -2530885 -2717785 -2686273 -2513624 -2292447 -2471729 -2737780 -2794448 -2634473 -2511707
11913 -2511707 -2616133 -2715595 -2883604 -2788676 -2644271 -2628362 -2746888 -2718246 -2469508 -2310644
11903 -2310644 -2225304 -2319183 -2255778 -2215715 -2182483 -2160869 -2410747 -2656770 -2523535 -2603028 -2569575
11892 -2569575 -2350043 -2415623 -2431404 -2519747 -2468952 -2333121 -2280154 -2234236 -2505235 -2507581 -2357898
11881 -2357898 -2270354 -2191390 -2192161 -2423418 -2422521 -2353709 -2148357 -2039929 -2099758 -2323366 -2527848
11870 -2527848 -2652820 -2659093 -2721700 -2755451 -2479137 -2427743 -2400840 -2433406 -2565243 -2600691 -2487535
11859 -2487535 -2303403 -2291785 -2569004 -2667007 -2534858 -2410124 -2308776 -2549265 -2621335 -2733169
11849 -2733169 -2556661 -2509620 -2398839 -2384425 -2562209 -2543538 -2288310 -2212303 -2560937 -2600205
11839 -2600205 -2524535 -2652003 -2707388 -2583756 -2499001 -2433688 -2471291 -2488511 -2558400 -2442929 -2435643
11828 -2435643 -2496718 -2534249 -2562310 -2637948 -2851847 -2696242 -2510473 -2338275 -2263954 -2406987
11818 -2406987 -2521510 -2590705 -2703463 -2735493 -2736898 -2722790 -2685075 -2678664 -2623387 -2632025 -2615539
11807 -2615539 -2578475 -2660054 -2717557 -2783816 -2669510 -2495402 -2626497 -2771442 -2850572 -2906160
11797 -2906160 -2738125 -2491272 -2262103 -2122230 -2328471 -2579486 -2854883 -2778223 -2768082 -2799821
11787 -2799821 -2455640 -2453722 -2438022 -2355021 -2599379 -2694010 -2514214 -2398446 -2440510 -2530074 -2518366
11776 -2518366 -2574262 -2572913 -2486862 -2402141 -2541375 -2622793 -2648160 -2584990 -2573737 -2750780 -2798268
11765 -2798268 -2705725 -2713080 -2647070 -2741946 -2632725 -2777498 -2840029 -2549681 -2379361 -2284533 -2247238
11754 -2247238 -2287365 -2310118 -2344266 -2460321 -2425519 -2435898 -2374494 -2420639 -2447978 -2371244 -2382119
11743 -2382119 -2323015 -2245554 -2178303 -2334801 -2474623 -2477438 -2658724 -2635416 -2710804 -2650968 -2561612
11732 -2561612 -2343800 -2352146 -2398004 -2383635 -2548985 -2794964 -2698206 -2578999 -2422641 -2201228
11722 -2201228 -2227816 -2430598 -2367923 -2180863 -2160320 -2308389 -2388381 -2492609 -2359356 -2281259
11712 -2281259 -2232477 -2350658 -2639832 -2548683 -2268967 -2250427 -2446089 -2521210 -2394818 -2375100
11702 -2375100 -2430176 -2640641 -2520563 -2305311 -2327519 -2455671 -2461964 -2396238 -2372931 -2336204 -2292486
11691 -2292486 -2332063 -2197324 -2310268 -2387146 -2305012 -2181096 -2174173 -2204789 -2323895 -2485408
11681 -2485408 -2569128 -2468238 -2476305 -2228227 -2165450 -2234925 -2312162 -2264573 -2173562 -2203496 -2349980
11670 -2349980 -2525930 -2545289 -2614960 -2574812 -2625228 -2400189 -2165729 -2158308 -2127018 -2109675 -2241823
11659 -2241823 -2220540 -2171535 -2092480 -2126908 -2195455 -2312787 -2428379 -2273409 -2180035 -2285450
11649 -2285450 -2331123 -2290346 -2265774 -2201563 -2252154 -2470430 -2557572 -2297844 -2208599 -2403019 -2465319
11638 -2465319 -2372316 -2466186 -2676645 -2660602 -2647054 -2752203 -2543712 -2226308 -2174772 -2220776
11628 -2220776 -2444740 -2535386 -2460307 -2438336 -2389860 -2402093 -2298358 -2132392 -2085557 -2309913
11618 -2309913 -2313422 -2253662 -2198393 -2268630 -2161243 -2143644 -2115281 -2260723 -2122517 -2071331 -1840322
11607 -1840322 -1758120 -1948313 -2059064 -1988242 -1905021 -2030252 -2083437 -2063156 -2213370 -2387482
11597 -2387482 -2428719 -2342872 -2304687 -2060986 -1956035 -2049853 -2113540 -2167707 -2242956 -2228649 -2251689
11586 -2251689 -2288980 -2369318 -2385567 -2360771 -2334406 -2211845 -2134290 -2017762 -2094847 -2216537 -2159289
11575 -2159289 -2133840 -2201215 -2308021 -2375889 -2413726 -2274660 -2479606 -2467771 -2448220 -2307488
11565 -2307488 -2120868 -2168202 -2316791 -2329163 -2315629 -2305632 -2299094 -2283329 -2393599 -2436668 -2096807
11554 -2096807 -1825535 -1815165 -1870874 -2032556 -2052900 -2122494 -2156501 -1867806 -1954392 -2075655
11544 -2075655 -2152460 -2291737 -2305709 -2281456 -2328724 -2181227 -2125168 -2129158 -2284383 -2343092 -2595649
11533 -2595649 -2469265 -2369726 -2102812 -2204056 -2245392 -2241557 -2007978 -1812644 -1867297 -1736576
11523 -1736576 -1944110 -2216738 -2280516 -2175459 -2003749 -1922839 -2015681 -2155254 -2016979 -1838540
11513 -1838540 -1947606 -1917253 -2012299 -2103179 -2122849 -2122999 -2152730 -2231000 -2258009 -2189831 -2220577
11502 -2220577 -2093884 -1886540 -1866203 -2048003 -2111550 -1927712 -2150226 -2206705 -2017064 -1929576
11492 -1929576 -2157060 -2257263 -2301315 -2350311 -2271723 -2325002 -2316160 -2248686 -2041116 -1922422 -1985358
11481 -1985358 -2164727 -2251878 -2258710 -2375679 -2487427 -2660248 -2635132 -2418994 -2517667 -2514963 -2240725
11470 -2240725 -2309014 -2302442 -2231316 -2267391 -2313002 -2130942 -2094214 -2234848 -2254205 -2207725 -2015004
11459 -2015004 -2184909 -2374693 -2310606 -2264236 -2325890 -2382895 -2443569 -2357246 -2165089 -2343947
11449 -2343947 -2354784 -2319303 -2272345 -2170232 -1952310 -2014969 -2029084 -2136764 -1978977 -1994297
11439 -1994297 -2246525 -2315139 -2331237 -2521867 -2512618 -2386314 -2347777 -2619851 -2728994 -2683291
11429 -2683291 -2440719 -2379952 -2273710 -2352027 -2242977 -1920506 -1884529 -1893460 -1985218 -2063032 -1935156
11418 -1935156 -1930653 -1892272 -2042866 -2240282 -2164363 -2035041 -2080147 -2187942 -2302631 -2337311
11408 -2337311 -2182818 -2026748 -1922099 -2071943 -2139657 -2062316 -2023552 -2056867 -2172668 -2064805
11398 -2064805 -2033763 -2117673 -2202181 -2241921 -2012077 -1932820 -2099386 -2178008 -2069508 -2043178 -2147007
11387 -2147007 -2167998 -2122892 -2264652 -2245419 -2263618 -2381374 -2321762 -2251152 -2486677 -2376641
11377 -2376641 -2212344 -2227323 -2229659 -2244671 -2098792 -1871115 -2126792 -2164268 -2135549 -2096736 -1894916
11366 -1894916 -1980805 -1935326 -2120005 -2187353 -2134740 -1872180 -1772637 -2182180 -2381293 -2490888
11356 -2490888 -2523710 -2431461 -2256921 -2243171 -2136062 -2100129 -2088885 -2258211 -2287891 -1971207
11346 -1971207 -1716584 -1799680 -1974024 -2021172 -2013689 -2069169 -1989297 -2002074 -1914966 -1952698 -2149646
11335 -2149646 -1940267 -1875756 -1863827 -2027031 -1861243 -1717157 -1717946 -1989417 -2117854 -1974265
11325 -1974265 -1979841 -2136896 -2199980 -2313324 -2365683 -2390496 -2247164 -2279498 -2091985 -1887816
11315 -1887816 -1924944 -1995056 -1916921 -1769011 -1700637 -1891114 -1911585 -2019747 -2196579 -1920243
11305 -1920243 -1766109 -1890418 -1974057 -1911439 -1999543 -2165028 -2263316 -2277705 -2400803 -2388278
11295 -2388278 -2309129 -2268352 -2292049 -2346894 -2058039 -2048945 -2315658 -2517484 -2450934 -2355036 -2220942
11284 -2220942 -1983840 -1962650 -2038845 -2058845 -2154711 -2087607 -1959238 -2137286 -2085724 -2056683 -2106896
11273 -2106896 -1899191 -1716934 -1531474 -1521852 -1629377 -1785118 -1742276 -1760315 -1847962 -1870436
11263 -1870436 -1976088 -2178690 -2184110 -2312544 -2342014 -2196601 -2159114 -1963924 -2045528 -2280741
11253 -2280741 -2260956 -2063149 -1941077 -1927610 -2029715 -1960453 -1883493 -1906806 -1852580 -2142711
11243 -2142711 -2133144 -2012320 -1796084 -1862102 -1941603 -1945491 -1924405 -1805925 -1891201 -1994233 -1874608
11232 -1874608 -1988243 -1841155 -1662640 -1754858 -1756635 -1721983 -1783972 -1593704 -1470206 -1552654
11222 -1552654 -1689551 -1677357 -1792400 -1797714 -1895512 -2219030 -2411316 -2419322 -2217548 -2093075
11212 -2093075 -2007094 -1929971 -1788168 -1858888 -1895322 -1833278 -1652859 -1912663 -2333523 -2394461
11202 -2394461 -2223890 -1898224 -1913760 -1818697 -1902403 -2154654 -2057421 -1966769 -1955283 -2030967 -1956863
11191 -1956863 -1651434 -1557946 -1721465 -1843815 -1901131 -1895917 -2077989 -2058498 -1962319 -1709945
11181 -1709945 -1761896 -2030640 -2102754 -2009990 -1881179 -1775524 -1916359 -2052888 -2027193 -1746721
11171 -1746721 -1704393 -1482614 -1610632 -1972431 -2005766 -2049561 -1957949 -1890121 -1933513 -2075637
11161 -2075637 -2198766 -2066965 -1923362 -1974786 -2048927 -2044843 -1977624 -2063897 -2033513 -1990079 -1940386
11150 -1940386 -1846899 -1793913 -1829154 -1927883 -1903299 -2073638 -2105586 -1921593 -1948103 -2100718 -2124394
11139 -2124394 -2033480 -1955867 -2011229 -1951548 -1803715 -1910985 -1942861 -1822006 -1812842 -1862974 -2054660
11128 -2054660 -2129759 -2017056 -1830171 -1931583 -1957670 -1978307 -2107721 -2158998 -2139368 -2020981
11118 -2020981 -1778895 -1598951 -1678289 -1882875 -1918292 -1702960 -1510834 -1595823 -1670290 -1541196
11108 -1541196 -1796478 -1978629 -2219987 -2189233 -1950041 -1763528 -1725478 -1757764 -1679200 -1703509
11098 -1703509 -1879583 -1931945 -1973065 -1880980 -1727082 -1666994 -1835452 -1854926 -1911298 -2101395
11088 -2101395 -2105950 -2092421 -2318938 -2248965 -1994844 -2002159 -2031475 -2009347 -2075924 -2080202 -2099196
11077 -2099196 -2127222 -2040134 -1919084 -1970798 -1945016 -1811652 -2013477 -2106978 -2049478 -2025477 -1979020
11066 -1979020 -2087590 -2133203 -2099322 -2015823 -2076290 -2260694 -2121366 -1994079 -1883508 -1759810
11056 -1759810 -1837148 -1776131 -1797825 -1949198 -1940996 -1887051 -1807212 -1838392 -1814966 -1924632 -1816053
11045 -1816053 -1720171 -1687445 -1802946 -1818339 -1781968 -1828629 -1752253 -1877515 -1987713 -2086273 -2194538
11034 -2194538 -2032909 -2012378 -2217770 -2332466 -2156414 -1944988 -1993214 -1978499 -2080795 -2215038
11024 -2215038 -2277979 -1999903 -1684602 -1773446 -1897193 -2051201 -2027833 -1894586 -1907337 -2043143
11014 -2043143 -2186978 -2061468 -1921331 -1761054 -1735445 -1879009 -1797971 -1640468 -1673170 -1977017
11004 -1977017 -2039885 -1744026 -1619061 -1516578 -1537177 -1574563 -1654960 -1589881 -1756032 -1840519
10994 -1840519 -1685211 -1692796 -1754807 -1922432 -2189566 -2122609 -1992979 -1910116 -1865976 -1777307 -1742952
10983 -1742952 -1760376 -1758413 -1654907 -1600726 -1576587 -1573829 -1649355 -1689133 -1685541 -1897668 -1855556
10972 -1855556 -1720390 -1830604 -2029199 -2056194 -1936441 -1960451 -1866153 -1771764 -1749792 -1699799
10962 -1699799 -1682165 -1710285 -1652604 -1730174 -1848028 -1835785 -1915967 -1839801 -1883743 -1965675 -1972031
10951 -1972031 -1985459 -2105538 -1945568 -1948140 -1971917 -1999351 -1892924 -1948682 -1950311 -1809051 -1667941
10940 -1667941 -1771377 -1834913 -1819332 -1781363 -1786765 -1845840 -1858670 -1933340 -1941532 -1968487 -2027817
10929 -2027817 -1936809 -1666263 -1577788 -1610565 -1840108 -1869503 -1713138 -1789281 -1958659 -2216871
10919 -2216871 -2289392 -2078799 -1949664 -1786103 -1714234 -1845407 -1738135 -1591053 -1606603 -1693576
10909 -1693576 -1635493 -1657405 -1476192 -1284758 -1287446 -1509587 -1920737 -1872486 -1458253 -1638062
10899 -1638062 -1973328 -1945630 -1720537 -1715074 -1800384 -1878485 -1880760 -1956606 -1959396 -2064687 -2011678
10888 -2011678 -1840218 -1976549 -2030690 -2002009 -1869975 -1991696 -1904962 -1734096 -1878826 -2147249
10878 -2147249 -2130468 -1988994 -1953315 -1898059 -2038687 -2097024 -1876355 -1836961 -1773987 -1740302 -1864232
10867 -1864232 -1870713 -1805228 -1937805 -1837202 -1660478 -1469485 -1355753 -1618634 -1867020 -1613983
10857 -1613983 -1612574 -1836788 -1725772 -1785876 -1924166 -2011413 -1983939 -1893660 -1756174 -1630409
10847 -1630409 -1505814 -1458582 -1428482 -1559455 -1426345 -1419046 -1535066 -1622952 -1633497 -1609626 -1536608
10836 -1536608 -1505395 -1780952 -1834323 -1860070 -1844563 -1957542 -1805434 -1807328 -1990936 -1949354 -1930136
10825 -1930136 -1869413 -1760877 -1904456 -2066487 -2148719 -2137029 -2027429 -2012056 -1870271 -1788318
10815 -1788318 -1891252 -1949241 -1978195 -2145654 -2100444 -1908704 -1833725 -1702015 -1561007 -1683989
10805 -1683989 -1820241 -2117109 -2143946 -1759720 -1658204 -1815871 -1709376 -1591221 -1447264 -1486634
10795 -1486634 -1663839 -1808881 -1685341 -1578582 -1716531 -2028727 -2016767 -1987133 -1968102 -1818527
10785 -1818527 -1994942 -2032027 -1763566 -1745130 -1804543 -1835759 -1869285 -1568554 -1585174 -1834433
10775 -1834433 -1899898 -1757558 -1752065 -1613895 -1780893 -1905563 -1879271 -1969355 -1845220 -1728830
10765 -1728830 -1790228 -2009599 -1880513 -1687688 -1748750 -1743191 -1824926 -1926808 -2044813 -2110842
10755 -2110842 -1797240 -1759916 -1809285 -1814778 -1705627 -1593889 -1782102 -1901791 -2028618 -1822683
10745 -1822683 -1624577 -1653319 -1689593 -1694996 -1669584 -1522698 -1487201 -1538345 -1627221 -1615330 -1604030
10734 -1604030 -1841102 -1812416 -1710792 -1714740 -1634734 -1672999 -1808516 -1783804 -1582726 -1353888
10724 -1353888 -1184883 -1260288 -1633140 -1795307 -1713746 -1810165 -1896975 -1879074 -1961815 -1868504 -1731838
10713 -1731838 -1733295 -1990733 -2094598 -1851496 -1805531 -1805273 -1776972 -1562976 -1569650 -1674453 -1497285
10702 -1497285 -1492879 -1620851 -1697973 -1632992 -1731193 -1787136 -1910950 -1926540 -1960249 -2086319 -2062101
10691 -2062101 -2006942 -1774372 -1382598 -1404123 -1765686 -1839491 -1770559 -1777540 -1899927 -1846711 -1614601
10680 -1614601 -1714442 -1877106 -1867529 -1845788 -1667849 -1657614 -1675070 -1737436 -1738806 -1842331 -2034515
10669 -2034515 -2054662 -1957236 -1919867 -1877405 -1634287 -1458469 -1701886 -1843568 -1842567 -1894320 -1919457
10658 -1919457 -1733730 -1834057 -2044454 -1890954 -1728373 -1928871 -2056179 -1929217 -1829565 -1728318
10648 -1728318 -1700089 -1665403 -1541278 -1515899 -1339423 -1402189 -1390862 -1583591 -1676910 -1533449
10638 -1533449 -1453370 -1767110 -1801729 -1902988 -1813461 -1573655 -1596269 -1872854 -1875134 -1715973
10628 -1715973 -1769174 -1813373 -1724495 -1785724 -1840966 -1955883 -2070266 -2005538 -1896527 -1758893
10618 -1758893 -1734622 -1788645 -1896562 -1880259 -1671437 -1626986 -1633111 -1617838 -1734774 -1841614 -1821763
10607 -1821763 -1775004 -1815896 -1933028 -1962698 -1927622 -1977892 -1909461 -1801208 -1821626 -1631716 -1508756
10596 -1508756 -1523392 -1745280 -1914478 -1917556 -1806376 -1701691 -1537373 -1622841 -1567085 -1536502
10586 -1536502 -1493521 -1599343 -1730834 -1838805 -1816280 -1878648 -1787443 -1609716 -1596042 -1724003
10576 -1724003 -1699006 -1571959 -1579460 -1616619 -1559843 -1675227 -1583153 -1735938 -1633460 -1675091 -1748922
10565 -1748922 -1645958 -1696519 -1896674 -1950186 -2033169 -2092734 -2011208 -1806819 -1733676 -1873111
10555 -1873111 -1844865 -1604604 -1523567 -1311429 -1413045 -1626843 -1439209 -1406678 -1705668 -1799092
10545 -1799092 -1889080 -1876666 -1926756 -2022586 -1993149 -1885671 -1727746 -1619320 -1587758 -1598309 -1532834
10534 -1532834 -1567028 -1904180 -2018766 -1993058 -1590960 -1554941 -1699231 -1576554 -1578782 -1573756 -1798615
10523 -1798615 -1677199 -1611309 -1555706 -1513799 -1693714 -1936571 -1921705 -1675744 -1708522 -1642099
10513 -1642099 -1559634 -1799144 -1743929 -1626967 -1641393 -1622787 -1690987 -1658180 -1709399 -1651290 -1556875
10502 -1556875 -1609977 -1578837 -1452868 -1343986 -1483842 -1700212 -1764398 -1627754 -1555902 -1694329
10492 -1694329 -2079605 -1918857 -1602933 -1412533 -1433823 -1573448 -1717160 -1610976 -1438420 -1419441
10482 -1419441 -1404817 -1508540 -1537895 -1619221 -1560380 -1684476 -1764650 -1699690 -1705852 -1878307 -1897282
10471 -1897282 -1855908 -1804043 -1663858 -1496818 -1535382 -1613138 -1728035 -1928695 -1913633 -1748547
10461 -1748547 -1636698 -1708775 -1801162 -1834731 -1817115 -1531986 -1340158 -1332423 -1266388 -1151222 -1161908
10450 -1161908 -1211501 -1499170 -1696104 -1759211 -1892831 -1920231 -1788065 -1649824 -1551831 -1580573
10440 -1580573 -1548775 -1508769 -1393421 -1458692 -1612694 -1771250 -1662774 -1736180 -1722453 -1716948 -1735968
10429 -1735968 -1831842 -1659005 -1501625 -1378830 -1379212 -1456832 -1530362 -1729347 -1867568 -1777041 -1750321
10418 -1750321 -1722733 -1698971 -1614826 -1482950 -1328718 -1434756 -1388327 -1299202 -1358985 -1451232 -1550459
10407 -1550459 -1587690 -1476698 -1402935 -1381056 -1289417 -1282921 -1276677 -1274874 -1231833 -1291308 -1428615
10396 -1428615 -1458480 -1484297 -1325331 -1299761 -1251934 -1349138 -1448301 -1201749 -1103231 -1094737 -1236464
10385 -1236464 -1052468 -1054719 -1202825 -1228845 -1256886 -999304 -855524 -919303 -864270 -908440 -933025
10374 -933025 -797599 -981255 -1086004 -974100 -1052078 -1065806 -925884 -680433 -658165 -814529
10364 -814529 -775051 -708752 -719692 -725072 -681540 -526491 -291832 -293242 -282153 -297683 -268853
10353 -268853 -265061 -101590 211741 513930 636253 810457 928989 911910 862493 553083
10343 553083 -4357 -398525 -1133441 -1673456 -2053276 -2578911 -3167978 -3493280 -3695949 -3957269
10333 -3957269 -3993408 -3975752 -3922849 -3619526 -3380408 -3192738 -2871378 -2637165 -2825947 -2988179
10323 -2988179 -2995087 -2817984 -2548395 -2425966 -2443470 -2581737 -2691545 -2673470 -2562602 -2357382
10313 -2357382 -2410266 -2456237 -2479591 -2408642 -2220900 -2161391 -2040002 -2012607 -2102183 -2032268 -1886717
10302 -1886717 -1925855 -2194645 -2102981 -2061061 -1973098 -1887322 -1884461 -1883711 -1830228 -1835867 -1984933 -2109783
10290 -2109783 -2025793 -1957188 -1892459 -1746498 -1643139 -1790046 -1894875 -1876264 -1746431 -1390294
10280 -1390294 -1286701 -1392230 -1588875 -1780175 -1745664 -1775077 -1949087 -2148104 -2190038 -2293903
10270 -2293903 -2110073 -2102548 -1876111 -1816949 -1757515 -1754350 -1821186 -1880475 -1789982 -1692833 -1741741
10259 -1741741 -1953777 -2158136 -2359367 -2417363 -2280606 -2230464 -2083501 -1955857 -1924003 -2118598
10249 -2118598 -1919041 -1578991 -1602250 -2009449 -2146868 -2176124 -2275989 -2002363 -1610741 -1388301
10239 -1388301 -1594786 -1570286 -1538521 -1862765 -1903329 -1617195 -1656651 -1790640 -1622733 -1478667
10229 -1478667 -1664812 -1742305 -1808934 -1942783 -1968613 -1850164 -1798396 -1896855 -1947572 -1855392 -1891087
10218 -1891087 -1819769 -1814754 -1925718 -1928698 -1997561 -1804206 -1689272 -1848324 -1795398 -1845067 -1929223
$$ [...]
##END NTUPLES=NMR SPECTRUM
##END=
