##TITLE=Analysis number 327118
Compound Code btb 10243
Project Code adrs lab3
Chemist Name stores
##JCAMPDX= 6.0         $$ Bruker NMR JCAMP-DX V2.0
##DATA TYPE= NMR SPECTRUM
##DATA CLASS= NTUPLES
##ORIGIN= Bruker BioSpin GmbH
##OWNER= nmr
$$ XWIN-NMR		Version 3.5
$$ Mon Mar 12 11:48:34 2007 GMT Standard Time (UT+0h)  MAYBRIDGE\nmr@NMR_250MHZ
##.OBSERVE FREQUENCY= 250.131544655141
##.OBSERVE NUCLEUS= ^1H
##.ACQUISITION MODE= SIMULTANEOUS (DQD)
##.ACQUISITION SCHEME= undefined
##.AVERAGES= 16
##.DIGITISER RES= 18
##SPECTROMETER/DATA SYSTEM= dpx250
##.PULSE SEQUENCE= zg30
##.SOLVENT NAME= CDCl3
##.SHIFT REFERENCE= (INTERNAL, CDCl3, 0, 16.522)
##AUDIT TRAIL= $$ (NUMBER, WHEN, WHO, WHERE, WHAT)
$$ ##TITLE= Audit trail, XWIN-NMR		Version 3.5
$$ ##JCAMPDX= 5.01
$$ ##ORIGIN= Bruker BioSpin GmbH
$$ ##OWNER= nmr
$$ C:\u/data/dgb/nmr/ADRS/680/pdata/1/auditp.txt
$$ ##AUDIT TRAIL=  $$ (NUMBER, WHEN, WHO, WHERE, WHAT)
(   1,<2007-03-12 11:48:09.58 +000>,<MAYBRIDGE\nmr>,<NMR_250MHZ>,
      <created by zg, POWCHK disabled, PULCHK disabled
       configuration hash MD5:
       49 4B E0 1D 92 C2 6B 37 9F E6 65 BC 52 41 86 1D
       data hash MD5: 64K
       CB DA 7A 50 40 51 84 A9 EE D1 36 2C 7A D5 B1 4B>)
(   2,<2007-03-12 11:48:24.30 +000>,<MAYBRIDGE\nmr>,<NMR_250MHZ>,
      <Start of raw data processing
       ef LB = 0.3 FT_mod = 6 PKNL = 1 SI = 32K 
       data hash MD5: 32K
       E4 B3 48 F3 F6 F5 E7 E3 1A 45 79 D9 FA 3D 7A D4>)
(   3,<2007-03-12 11:48:25.97 +000>,<MAYBRIDGE\nmr>,<NMR_250MHZ>,
      <apk 
       data hash MD5: 32K
       37 F2 B3 90 11 92 11 95 B7 9F 57 A0 DD AE 77 91>)
(   4,<2007-03-12 11:48:26.68 +000>,<MAYBRIDGE\nmr>,<NMR_250MHZ>,
      <abs ABSG = 5 
       data hash MD5: 32K
       A7 8D 4B E6 C1 59 D2 3F 22 CA FD 19 71 97 4C 3C>)
$$ ##END=
$$ 
$$ hash MD5
$$ 91 CF 62 20 3C ED 6F 30 8C D9 EA 37 71 8D 30 A0
##$RELAX= 
##$RELAX= 
##$RELAX= 
##$RELAX= 
##$RELAX= 
##$RELAX= 
##$RELAX= 
$$ Bruker specific parameters
$$ --------------------------
##$DU= <C:\u>
##$EXPNO= 680
##$NAME= <ADRS>
##$PROCNO= 1
##$TYPE= <nmr>
##$USER= <dgb>
##$AMP= (0..31)
100 100 100 100 100 100 100 100 100 100 100 100 100 100 100 100 100 100 
100 100 100 100 100 100 100 100 100 100 100 100 100 100 
##$AQSEQ= 0
##$AQ_mod= 3
##$AUNM= <au_zg>
##$AUTOPOS= <8 >
##$BF1= 250.13
##$BF2= 250.13
##$BF3= 250.13
##$BF4= 250.13
##$BF5= 500.13
##$BF6= 500.13
##$BF7= 500.13
##$BF8= 500.13
##$BYTORDA= 1
##$CFDGTYP= 0
##$CFRGTYP= 5
##$CHEMSTR= <none>
##$CNST= (0..31)
1 1 145 1 1 1 1 1 1 1 1 1 1 1 1 1 1 1 1 1 1 1 1 1 1 1 1 1 1 1 1 1 
##$CPDPRG= <>
##$CPDPRG1= <>
##$CPDPRG2= <>
##$CPDPRG3= <>
##$CPDPRG4= <mlev>
##$CPDPRG5= <mlev>
##$CPDPRG6= <mlev>
##$CPDPRG7= <mlev>
##$CPDPRG8= <mlev>
##$CPDPRGB= <>
##$CPDPRGT= <>
##$D= (0..31)
0 1 0 0 0 0 0 0 0 0.06 0 0 0 0 0 0 0.0002 0 0 0 0 0 0 0 0 0 0 0 0 0 0 
0 
##$DATE= 1173700088
##$DBL= (0..7)
120 120 120 120 120 120 120 120 
##$DBP= (0..7)
150 150 150 150 150 150 150 150 
##$DBP07= 0
##$DBPNAM0= <>
##$DBPNAM1= <>
##$DBPNAM2= <>
$$ [...]
##$SUBNAM7= <"">
##$SUBNAM8= <"">
##$SUBNAM9= <"">
##$SW= 20.6930455092707
##$SWIBOX= (0..15)
0 0 3 0 0 0 0 0 0 0 0 0 0 0 0 0 
##$SW_h= 5175.983436853
##$TD= 65536
##$TD0= 1
##$TE= 683.16
##$TE2= 300
##$TE3= 300
##$TEG= 300
##$TL= (0..7)
0 120 120 120 120 120 120 120 
##$TP= (0..7)
150 150 150 150 150 150 150 150 
##$TP07= 0
##$TPNAME0= <>
##$TPNAME1= <>
##$TPNAME2= <>
##$TPNAME3= <>
##$TPNAME4= <>
##$TPNAME5= <>
##$TPNAME6= <>
##$TPNAME7= <>
##$TPOAL= (0..7)
0.5 0.5 0.5 0.5 0.5 0.5 0.5 0.5 
##$TPOFFS= (0..7)
0 0 0 0 0 0 0 0 
##$TUNHIN= 0
##$TUNHOUT= 0
##$TUNXOUT= 0
##$USERA1= <user>
##$USERA2= <user>
##$USERA3= <user>
##$USERA4= <user>
##$USERA5= <user>
##$V9= 5
##$VALIST= <valist>
##$VCLIST= <CCCCCCCCCCCCCCC>
##$VD= 0
##$VDLIST= <DDDDDDDDDDDDDDD>
##$VPLIST= <PPPPPPPPPPPPPPP>
##$VTLIST= <TTTTTTTTTTTTTTT>
##$WBST= 1024
##$WBSW= 4
##$XGAIN= (0..3)
0 0 0 0 
##$XL= 0
##$YL= 0
##$YMAX_a= 535270
##$YMIN_a= -505557
##$ZGOPTNS= <>
##$ZL1= 120
##$ZL2= 120
##$ZL3= 120
##$ZL4= 120
##$ABSF1= 16.522
##$ABSF2= -4.171173
##$ABSG= 5
##$ABSL= 3
##$ALPHA= 0
##$AQORDER= 0
##$ASSFAC= 0
##$ASSFACI= 0
##$ASSFACX= 0
##$ASSWID= 0
##$AUNMP= <proc_1d>
##$AZFE= 0.1
##$AZFW= 0.1
##$BCFW= 0
##$BC_mod= 0
##$BYTORDP= 0
##$COROFFS= 0
##$CY= 12.5
##$DATMOD= 1
##$DC= 0
##$DFILT= <>
##$DTYPP= 0
##$F1P= 14.0000005364418
##$F2P= -0.99999901652339
##$FCOR= 0.5
##$FTSIZE= 32768
##$FT_mod= 6
##$GAMMA= 0
##$GB= 0
##$INTBC= 1
##$INTSCL= 1
##$ISEN= 128
##$LB= 0.3
##$LEV0= 0
##$LPBIN= 0
##$MAXI= 10000
##$MC2= 0
##$MEAN= 0
##$ME_mod= 0
##$MI= 0
##$NCOEF= 0
##$NC_proc= -4
##$NLEV= 6
##$NOISF1= 0
##$NOISF2= 0
##$NSP= 0
##$NTH_PI= 0
##$NZP= 0
##$OFFSET= 16.522
##$PC= 1
##$PHC0= 76.83007
##$PHC1= 5.327541
##$PH_mod= 1
##$PKNL= yes
##$PPARMOD= 0
##$PSCAL= 4
##$PSIGN= 0
##$REVERSE= no
##$SF= 250.13
##$SI= 32768
##$SIGF1= 0
##$SIGF2= 0
##$SINO= 400
##$SIOLD= 32768
##$SREGLST= <1H.CDCl3>
##$SSB= 0
##$STSI= 32768
##$STSR= 0
##$SW_p= 5175.98343685301
##$SYMM= 0
##$S_DEV= 0
##$TDeff= 65536
##$TDoff= 0
##$TI= <Analysis number 999999
Compound Code 99
Book Reference 9
Project Code 9>
##$TILT= no
##$TM1= 0
##$TM2= 0
##$TOPLEV= 0
##$USERP1= <user>
##$USERP2= <user>
##$USERP3= <user>
##$USERP4= <user>
##$USERP5= <user>
##$WDW= 1
##$XDIM= 32768
##$YMAX_p= 506042122
##$YMIN_p= -62998
$$ End of Bruker specific parameters
$$ ---------------------------------
##NTUPLES= NMR SPECTRUM
##VAR_NAME=  FREQUENCY,     SPECTRUM/REAL,   SPECTRUM/IMAG
##SYMBOL=    X,             R,               I
##VAR_TYPE=  INDEPENDENT,   DEPENDENT,       DEPENDENT
##VAR_FORM=  AFFN,          ASDF,            ASDF
##VAR_DIM=   32768,         32768,           32768
##UNITS=     HZ,            ARBITRARY UNITS, ARBITRARY UNITS
##FACTOR=    0.157963299565203, 1,           1
##FIRST=     4132.6476996994, 0,             0
##LAST=      -1043.33573715361, 0,           0
##MIN=       -1043.33573715361, -62998,      0
##MAX=       4132.6476996994, 506042122,     0
$$ Real data points
##PAGE= N=1
##DATA TABLE= (X++(R..R)), XYDATA
$$ [...]
$$ plain form
13817 -36134 -23082 -10594 -14676 -17773 -25986 -27718 -35228 -42234 -35391 -41135 -44479 -27760 -15718
13804 -15718 -24254 -13612 -4734 -11623 -31567 -38056 -37055 -18996 -9882 -10500 -11703 -10222 6718 20174
13790 20174 23778 16888 5921 -7955 -4725 -8762 -27197 -30550 -23725 -28134 -8085 4455 6016
13777 6016 2185 4938 3058 -299 2250 1944 10295 9676 2515 -22725 -27378 -21016 -16044 -12459 -3238
13762 -3238 -13322 -32067 -27789 -24303 -29452 -21831 -23731 -29511 -22849 -15278 -15384 -16656 -2446 5686
13748 5686 3098 -10057 -25446 -24912 -29541 -30384 -24876 -24801 -34749 -33418 -25040 -18255 -7636 -16323 -25540
13733 -25540 -34926 -38575 -37252 -36069 -27846 -13928 -9650 -13869 -26202 -18850 -18666 -19808 -16281 -2918
13719 -2918 -5168 -16115 -17419 -13088 -71 -9484 -8719 -5464 -4555 -10772 -20667 -24885 -15241 -7781 -9478
$$ packed form
13817c6134J3052J2488m082l097q213j732p510p006O843n744l344J6719J2042
13804a5718q536J0642Q878o889j9944o489J001J8059R114o18j203J481J6940J3456
13790B0174L604o890j0967j3876L230m037j8435l353O825m409K0049J2540J561
13777F016l831K753j880l357K549l06Q351o19p161k5240m653O362M972L585R221
13762c238j0084j8745M278L486n149P621j900n780O662P571j06j272J4210Q132
13748E686k588j3155j5389N34m629q43N508P5r948J331Q378O785J0619q687r217
13733b5540r386l649J323J183Q223J3918M278m219j2333P352J84j142L527J3363
13719b918k250j0947j304M331J3017r413P65L255R09o217r895m218R644P460j697
$$ plain form
13704 -9478 -27361 -31119 -34656 -34454 -31920 -38059 -41245 -41538 -35854 -6034 -12266 -24121 -42892 -30947
13690 -30947 -15519 -13622 -24586 -25480 -25256 -24170 -29329 -26772 -10486 5645 5933 6180 -1225 -1062 -1060
13675 -1060 1215 3567 -7186 -19119 -24610 -20172 -7054 8717 5151 -1249 -20649 -24854 -28545
13662 -28545 -9844 -2633 2752 -7192 -12185 -23192 -20470 -21682 -18619 -13498 -10020 -5188 -6579 -8807
13648 -8807 2946 11924 14937 10716 6404 -789 -8069 -15978 -26609 -32365 -19113 -16416 -27098 -25109
13634 -25109 -23592 -26733 -18601 -6606 -10152 -15109 -23200 -18723 -25495 -986 7682 4001 -9330 -15655
13620 -15655 -10264 4596 7331 -2945 -4797 -15199 -27095 -30133 -25063 -23888 -12579 -2646 -1800
13607 -1800 -8194 -21001 -35812 -28956 -21184 -10908 -5992 -15091 -30262 -31225 -20312 -4783 -4260 -10325
$$ packed form
13704i478j7883l758l537K02K534o139l186k93N684K9820o232j1855j8771J1945
13690c0947J5428J897j0964q94K24J086n159K557J6286J6131K88K47p405J63K
13675a060K275K352j0753j1933n491M438J3118J5771l566o400j9400m205l691
13662b8545J8701P211N385r944m993j1007K722j212L063N121L478M832j391k228
13648h807J1753Q978L013m221m312p193p280p909j0631n756J3252K697j0682J989
13634b5109J517l141Q132J1995l546m957q091M477o772K4509Q668l681j3331o325
13620a5655N391J4860K735j0276j852j0402j1896l038N070J175J1309R933Q46
13607a800o394j2807j4811O856P772J0276M916r099j5171r63J0913J5529N23o065
$$ plain form
13593 -10325 -15519 -38652 -30252 -26890 -30269 -31339 -18104 -22976 -24116 -16421 4644 3465 1332 3720
13579 3720 -3601 -11387 -16377 -20525 -8262 -2636 -23379 -20978 -16982 -17458 -18313 -7240 -9950 -10661 -3004
13564 -3004 -2464 -6962 -5227 -15235 -14423 -17848 -9565 -6959 -8248 -4247 -19094 -24649 -23160 -21455 -18866
13549 -18866 -16611 -7954 -10495 -12342 -14169 2192 14707 6997 8095 -4353 1240 -3808 -27216
13536 -27216 -29808 -28486 -11576 -926 -6640 -17932 85 -2119 -8038 -10357 -25136 -23810 -13746
13523 -13746 -15367 -16910 -16161 -29570 -23476 -22736 -24500 -27270 -29998 -25450 -17088 -8442 -22918 -21541
13509 -21541 -18969 -15627 -22858 -23971 -27051 -22694 -16086 3184 -6385 -4262 3450 6271 -51 -5120
13495 -5120 -13515 -14892 -22775 -23203 -13039 -9800 -3794 -8806 -18565 -20440 -20194 -14497 -19712 -26056 -39932
$$ packed form
13593a0325n194k3133Q400L362l379j070J3235m872j140P695K1065j179k133K388
13579C720p321p786m990m148J2263N626k0743K401L996m76q55J1073k710p11P657
13564c004N40m498J735j0008Q12l425Q283K606j289M001j4847n555J489J705K589
13549a8866K255Q657k541j847j827J6361J2515p710J098j2448N593n048k3408
13536b7216k592J322J6910J0650n714j1292J8017k204n919k319j4779J326J0064
13523a3746j621j543P49j3409O094P40j764k770k728M548Q362Q646j4476J377
13509b1541K572L342p231j113l080M357O608J9270r569K123P712K821o322n069
13495e120q395j377p883m28J0164L239O006n012r759j875K46N697n215o344j3876
$$ plain form
13480 -39932 -39725 -33675 -26486 -1706 -2867 -9318 -18410 -15011 -9166 -2391 137 -8166 -19889 -11752
13466 -11752 -7576 2314 -4665 -7483 -17074 -8961 3476 -3188 -17470 -12961 -6270 -5697 -19898 -24119
13452 -24119 -21293 -11954 -13916 -6556 2545 4254 -5492 -5137 -4363 -6671 2683 2172 -2937 -2046 -7413
13437 -7413 -15820 -20089 -18152 -12988 -9880 -11442 -25521 -37634 -33255 -17893 -11248 -9375 -17798 -29169
13423 -29169 -27240 -12626 -17492 -22967 -13689 -7427 -2025 -13385 -27500 -15462 -15293 -22702 -21815 -32154
13409 -32154 -41132 -37835 -26423 -25697 -27054 -25260 -23230 -23259 -27448 -30835 -30580 -36479 -35053 -33121 -17247
13394 -17247 -7924 -1262 -10571 -19792 -17419 -12312 -22570 -33111 -29725 -31025 -30856 -42037 -35118 -36511
13380 -36511 -33793 -28973 -7974 -3082 -15854 -18485 -14072 -8022 -5265 -7083 704 7196 -6985 -23892
$$ packed form
13480c9932K07O050P189K4780j161o451r092L399N845O775K528q303j1723Q137
13466a1752M176R890o979k818r591Q113J2437o664j4282M509O691N73j4201m221
13452b4119K826R339j962P360R101J709r746L55P74k308R354n11n109Q91n367
13437g413q407m269J937N164L108j562j4079j2113M379J5362O645J873q423j1371
13423b9169J929J4614m866n475R278O262N402j1360j4115J2038J69p409Q87j0339
13409c2154q978L297J1412P26j357J794K030k9m189l387K55n899J426J932J5874
13394a7247R323O662r309r221K373N107j0258j0541L386j300J69j1181O919j393
13380c6511K718M820K0999M892j2772k631M413O050K757j818P787O492j4181j6907
$$ plain form
13366 -23892 -23329 -11953 -9724 -15715 -23676 -23511 -20878 -20858 -10699 -15255 -27729 -30970 -17126 -12370
13352 -12370 -17808 -19985 -3125 1535 -11184 -38523 -41892 -45358 -29204 -10752 -11502 -14212 -15004 -11900
13338 -11900 -14415 -15569 -25238 -31973 -28913 -12407 -13832 -9310 -5724 -18013 -24864 -22681 -3213 -4526
13324 -4526 -11422 -25907 -33337 -24949 -10034 2096 3349 6737 18061 19880 1754 1218 7494 -6231
13310 -6231 -5466 -12257 -21751 -21693 -14565 -13871 -9685 -21712 -30669 -27722 -33809 -30568 -26978 -18208 -8381
13295 -8381 -9070 -20610 -26116 -26308 -19961 -2137 3094 -2034 -12155 -18965 -20250 -19260 -24141 -21324 -28453
13280 -28453 -31257 -27852 -13076 -5378 -11292 -16356 -29334 -18209 -19872 -22265 -30465 -25929 -27152 -36338
13266 -36338 -29427 -22000 -26226 -30064 -4440 -6069 -18689 -13221 -1905 -6172 -8917 -3129 1377 -7485
$$ packed form
13366b3892N63J1376K229n991p961J65K633K0J0159m556j2474l241J3844M756
13352a2370n438k177J6860M660j2719k7339l369l466J6154J8452p50k710p92L104
13338a1900k515j154r669o735L060J6506j425M522L586j2289o851K183J9468j313
13324d526o896j4485p430Q388J4915J2130J253L388J1324J819j8126n36O276j3725
13310f231P65o791r494N8P128O94M186j2027q957K947o087L241L590Q770R827
13295h381o89j1540n506j92O347J7824N231n128j0121o810j285R90m881K817p129
13280b8453k804L405J4776P698n914n064j2978J1125j663k393q200M536j223r186
13266c6338O911P427m226l838K5624j629j2620N468J1316m267k745N788M506q862
$$ plain form
13252 -7485 -11429 -3899 -5905 -10118 -14202 -14128 -6594 6519 -9145 -37258 -31439 -16363 -17767 -18450
13238 -18450 -5669 -746 2235 -4156 -7520 -7143 -17642 -3741 7833 -5801 -10334 -24694 -18776
13225 -18776 -25622 -27705 -12362 -6134 -6060 -8072 -12008 -16439 -14219 11800 -1479 -11632 -3562 -1115
13211 -1115 -14769 -14692 -12410 -24495 -35899 -40828 -39971 -39544 -47167 -41912 -29386 -20551 -20479 -18065 -12180
13196 -12180 -13580 -23134 -10388 -8419 -24819 -23714 -6134 -12444 -10815 -12936 -22163 -30834 -22744 -13551
13182 -13551 -18597 -15573 -8490 -7678 -21474 -21567 -14553 -16257 -19912 -18621 -16695 -8952 -7895 -10772 -6385
13167 -6385 5067 -6406 -16031 -8002 -7963 -16079 -15500 -14761 -16594 -27454 -34597 -34732 -29287 -14910 -6173
13152 -6173 -16040 -28881 -18730 -21307 -36135 -35601 -36416 -38263 -27581 -38433 -37851 -16183 -7171 -17534
$$ packed form
13252g485l944P530k006m213m084P4P534J3113j5664k8113N819J5076j404o83
13238a8450J2781M923K981o391l364L77j0499J3901J1574j3634m533j4360N918
13225a8776o846k083J5343O228P4k012l936m431K220K6019j3279j0153Q070K447
13211a115j3654P7K282j2085j1404m929Q57M27p623N255J2526Q835P2K414N885
13196a2180j400r554J2746J969j6400J105J7580o310J629k121r227q671Q090R193
13182a3551n046L024P083Q12j3796r3P014j704l655J291J926P743J057k877M387
13167f385J1452j1473r625Q029L9q116N79P39j833j0860p143j35N445J4377Q737
13152f173r867j2841J0151k577j4828N34q15j847J0682j0852N82K1668R012j0363
$$ plain form
13138 -17534 -14057 -13889 -23214 -12663 -12625 -12802 -18586 -11878 -6363 -6679 -13371 -19459 -13058 -10262 -5336
13123 -5336 -7701 -15120 -16147 -25905 -15334 -13268 -2557 575 1669 -12083 -18870 -16316 -18871 -12600
13109 -12600 -15098 -29168 -41032 -41608 -36202 -33736 -24843 -22317 -28634 -27499 -23360 -22618 -17416 -17462 -20358
13094 -20358 -14517 -32606 -47572 -54059 -43025 -34215 -26781 -15704 -13818 -8815 -149 11582 -806
13081 -806 -9756 -9552 -13542 -32624 -20992 6196 18202 10172 -12022 -13707 -22428 -34712 -31147 -24935
13067 -24935 -26600 -18346 -12781 -6686 -10637 -14327 -2859 10438 7176 -2347 -15624 -40166 -43745
13054 -43745 -32843 -32676 -31393 -28661 -12658 -6604 -9012 -12888 -17604 -22430 -23622 -19520 -17023 -25169
13040 -25169 -28259 -26759 -23594 -21416 -29306 -26829 -19317 -17610 -13180 -11571 -23236 -19652 -8239 -16356
$$ packed form
13138a7534L477J68r325J0551L8j77n784O708N515l16o692o088O401K796M926
13123e336k365p419j027r758J0571K066J0711L132J094j3752o787K554k555O271
13109a2600k498j4070j1864n76N406K466Q893K526o317J135M139P42N202m6k896
13094b0358N841j8089j4966o487J1034Q810P434J1077J886N003Q666J1731j2388
13081h06q950K04l990j9082J1632K7188J2006q030k2194j685q721j2284L565O212
13067b4935j665Q254N565O095l951l690J1468J3297l262r523j3277k4542l579
13054d3745J0902J67J283K732J6003O054k408l876m716m826j192M102K497q146
13040b5169l090J500L165K178p890K477P512J707M430J609j1665L584J1413q117
$$ plain form
13026 -16356 -7378 -20926 -26854 -19857 -21031 -12524 -2927 3311 8501 420 -492 1752 -7244 -7764 -14347
13011 -14347 -5004 -6393 -3105 7810 16938 7476 -3490 -17531 -17139 -16396 -20435 -11703 -9855 -12346
12997 -12346 -24081 -26263 -23688 -19726 -21817 -16937 -10002 -20856 -20857 -20037 -25901 -36820 -33689 -26095 -24705
12982 -24705 -17692 -15080 -36693 -41031 -17648 -17434 -17988 -13105 -21661 -21937 -16470 -6401 -21710 -25945
12968 -25945 -17682 -11170 -20409 -22561 -22718 -20644 -26448 -21485 -21967 -17177 -12492 -4017 6627 2597 -1481
12953 -1481 -7432 -20948 -19152 -20929 -27471 -28159 -25163 -25604 -30562 -34156 -30246 -10913 -12767 -22095 -20922
12938 -20922 -15201 -24839 -30625 -36215 -36639 -31992 -23370 -19165 -25992 -23706 -18189 -18926 -25218 -17511 -7814
12923 -7814 -2182 -110 1859 -19196 -26382 -16040 -8300 5836 6798 -3818 -7559 -7468 -14039 -23887
$$ packed form
13026a6356Q978j3548n928O997j174Q507R597O238N190q081r12K244q996n20o583
13011a4347R343j389L288J0915R128r462j0966j4041L92P43m039Q732J848k491
12997a2346j1735k182K575L962k091M880O935j0854jQ20n864j0919L131P594J390
12982b4705P013K612k1613m338K3383K14n54M883q556k76N467J0069j5309m235
12968b5945Q263O512r239k152j57K074n804M963m82M790M685Q475J0644m030m078
12953a481n951j3516J796j777o542o88K996m41m958l594L910J9333j854r328J173
12938b0922N721r638n786n590m24M647Q622M205o827K286N517p37o292P707R697
12923g814N632K072J969k1055p186J0342P740J4136R62j0616l741R1o571r848
$$ plain form
12909 -23887 -18867 -25074 -20844 -20650 -21035 -30817 -16572 -5068 -7127 -11872 -14260 -14865 -9119 -9668 -14749
12894 -14749 -1933 376 -7320 -12945 4516 865 -6736 -19140 -7579 -11665 -31033 -41832 -35712
12881 -35712 -12517 -19151 -15922 -16858 -30722 -28729 -31652 -27001 -31965 -27013 -20798 -12081 -23797 -16024
12867 -16024 4818 16146 476 3094 -3603 -21096 -25793 -15228 -6402 -8784 -10293 -20967 -19325
12854 -19325 -13829 -17234 -17231 -21874 -27082 -20322 -4988 5326 170 -6746 -31143 -27712 -24874 -33428
12840 -33428 -25147 -11124 -9209 -19339 -28256 -45563 -51315 -50329 -31811 -24689 -7089 8788 -5586
12827 -5586 -4643 -10709 -28135 -30987 -33510 -16696 -15379 -20037 -24160 -35564 -39918 -38339 -36213 -21359
12813 -21359 -22134 -30071 -25561 -26584 -21297 -17161 -22337 -34478 -24860 -18130 -22037 -27353 -31556 -31676 -17207
$$ packed form
12909b3887N020o207M230J94l85r782J4245J1504k059m745k388o05N746n49n081
12894a4749J2816K309p696n625J7461l651p601j2404J1561m086j9368j0799O120
12881c5712K3195o634L229r36j3864J993k923M651m964M952O215Q717j1716P773
12867a6024K0842J1328j5670K618o697j7493m697J0565Q826k382j509j0674J642
12854a9325N496l405Lm643n208O760J5334J0314n156o916k4397L431K838q554
12840c3428Q281J4023J915j0130q917j7307n752R86J8518P122J7600J5877j4374
12827e586R43o066j7426k852k523J6814J317m658m123j1404m354J579K126J4854
12813b1359p75p937M510j023N287M136n176j2141R618O730l907n316m203j20J4469
$$ plain form
12798 -17207 -15076 -20116 -28952 -28680 -18042 -21627 -14735 -5617 -9114 -12557 -4419 3798 1660 -23923
12784 -23923 -35763 -31933 -44467 -54318 -43932 -25241 -6013 -6859 -10805 -10358 -19231 -27011 -26609 -20566
12770 -20566 -31662 -37575 -30014 -42022 -41778 -36472 -19853 -15004 -15501 -14948 -16292 -32834 -34449 -15736
12756 -15736 -9812 -14862 -17491 -26861 -46555 -61561 -52031 -42299 -34159 -36254 -50544 -54526 -40976
12743 -40976 -33757 -27806 -29845 -36271 -30585 -21427 -30386 -33057 -13058 -12297 -21965 -25140 -12752 -5717
12729 -5717 -11277 -4735 -3116 -11386 -8009 -72 8541 14471 6696 -9704 -17338 -17790 -13395 5313
12715 5313 19807 7953 -10242 -15319 -12634 -18365 -11980 -12919 -4191 -12554 -16230 -16001 -9511 -15373
12701 -15373 -33227 -23486 -28731 -28157 -21247 -15178 -8021 -6991 -6387 -12863 -20214 -20144 -29316 -25999 -21795
$$ packed form
12798a7207K131n040q836K72J0638l585O892R118l497l443Q138Q217k138k5583
12784b3923j1840L830j2534r851J0386J8691J9228q46l946M47q873p780M02O043
12770b0566j1096n913P561j2008K44N306J6619M849m97N53j344j6542j615J8713
12756a5736N924n050k629r370j9694j5006R530R732Q140k095j4290l982J3550
12743d0976P219N951k039o426N686R158q959k671J9999P61r668l175J2388P035
12729e717n560O542J619q270L377P937Q613N930p775j6400p634m52M395J8708
12715E313J4494j1854j8195n077K685n731O385r39Q728q363l676K29O490n862
12701a5373j7854R741n245N74O910O069P157J030O04o476p351P0r172L317M204
$$ plain form
12686 -21795 -24614 -29079 -15798 -15016 -10438 -22062 -28216 -16704 -19449 -25878 -15817 -19936 -18735 -17341
12672 -17341 -10303 -8254 -15512 -29814 -36824 -25630 -25190 -33382 -29063 -14928 -7958 -11162 -14041 -4564
12658 -4564 -2194 -7512 -18856 -38019 -31836 -37218 -35489 -28157 -23664 -17978 -17674 -20503 -24754 -31026
12644 -31026 -41946 -40880 -23300 -12601 -23682 -22869 -30771 -43592 -47014 -40391 -29513 -30763 -34750
12631 -34750 -24644 -11881 -11259 -17842 -15289 -18946 -21307 -27783 -39179 -37652 -27890 -23181 -39404 -50353
12617 -50353 -36320 -35382 -38790 -28945 -23347 -24473 -15847 -18514 -17724 -14989 -25295 -32963 -34598 -30139
12603 -30139 -36173 -33663 -35974 -44016 -35343 -18378 -24383 -26784 -23344 -16827 -19131 -14744 -6548 -11873
12589 -11873 -17552 -17028 -18657 -15542 -6944 -5858 -16522 -31055 -41125 -31653 -20698 -16545 -15810 -17500
$$ packed form
12686b1795k819m465J3281P82M578j1624o154J1512k745o429J0061m119J201J394
12672a7341P038K049p258j4302p010J1194M40q192M319J4135O970l204k879R477
12658d564K370n318j1344j9163O183n382J729P332M493N686L04k829m251o272
12644c1026j0920J066J7580J0699j1081Q13p902j2821l422O623J0878j250l987
12631c4750J0106J2763O22o583K553l657k361o476j1396J527R762M709j6223j0949
12617e0353J4033R38l408R845N598j126Q626k667P90K735j0306p668j635M459
12603c0139o034K510k311q042Q673J6965o005k401L440O517k304M387Q196n325
12589a1873n679N24j629L115Q598J086j0664j4533j0070R472J0955M153P35j690
$$ plain form
12575 -17500 -24048 -26930 -12015 -18784 -31830 -23178 -37283 -46590 -32394 -31479 -36176 -17494 -2542
12562 -2542 -2746 -10074 -13967 -16645 -24736 -34548 -40677 -36935 -52067 -46832 -39143 -31835 -34622 -30841 -32685
12547 -32685 -37123 -38142 -41129 -48248 -37694 -17518 -20397 -29886 -30930 -33832 -34082 -35974 -41213 -44527
12533 -44527 -47366 -45819 -34685 -19554 -8504 -15834 -19386 -16488 -25694 -31424 -40128 -42173 -36138 -26668
12519 -26668 -16522 -9309 -4548 9011 2488 -3628 -8102 -6894 -12003 -18395 -16711 -6780 -15893 -17322
12505 -17322 -17600 -23175 -23416 -20554 -12300 -3521 1813 1934 -2398 3679 1725 -3428 -6703 -11945 -6988
12490 -6988 -8945 -17489 -39122 -39091 -43311 -42600 -39203 -55466 -51330 -45060 -36617 -21375 -15878 -19136 -8700
12475 -8700 -17157 -29688 -21315 -21196 -18396 -17092 -6660 1181 -4776 -19760 -28745 -23494 -12317 -4813
$$ packed form
12575a7500o548k882J4915o769j3046Q652j4105r307J4196R15m697J8682J4952
12562b542k04p328l893k678q091r812o129L742j5132N235P689P308k787L781j844
12547c2685m438j019k987p119J0554K0176k879r489j044k902k50j892n239l314
12533d4527k839J547J1134J5131J1050p330l552K898r206n730q704k045O035R470
12519b6668J0146P213M761J3559o523o116m474J208n109o392J684R931r113j429
12505a7322k78n575k41K862Q254Q779N334J21m332O077j954n153l275n242M957
12490f988j957q544k1633L1m220P11L397j6263M136O270Q443J5242N497l258J0436
12475h700q457j2531Q373J19K800J304J0432P841n957j4984q985N251J1177P504
$$ plain form
12461 -4813 -8771 -9583 -2975 -10508 -11959 -17020 -17338 -33205 -36538 -30276 -26900 -24684 -32794 -33385 -29170
12446 -29170 -25273 -25727 -31757 -30872 -29354 -27972 -41046 -43350 -34618 -27882 -29021 -38011 -29158 -23872 -26794
12431 -26794 -31067 -27404 -23335 -20672 -13743 -10086 -16500 -16886 -36014 -50689 -37048 -25147 -14950
12418 -14950 -8095 -14450 -16417 4053 16643 5068 2102 -2779 -12378 -21516 -8656 -7720 -20813
12405 -20813 -26951 -9610 -12908 -29242 -44468 -51268 -49645 -51362 -27134 -29317 -34753 -30362 -27266
12392 -27266 -23476 -25418 -21560 -20820 -25606 -17774 -3616 -7067 -10560 -7672 -9160 -15431 -3203 5954
12378 5954 -9119 -22184 -26532 -19494 -17483 -20929 -22561 -16014 -19771 -26094 -42328 -43106 -32596 -33639
12364 -33639 -43896 -53722 -43822 -23488 -34000 -33385 -25984 -5952 422 -891 -4482 -17952 -19079
$$ packed form
12461d813l958q12O608p533j451n061l18j5867l333O262L376K216q110n91M215
12446b9170L897m54o030Q85J518J382j3074k304Q732O736j139q990Q853N286k922
12431b6794m273L663M069K663O929L657o414l86j9128j4675J3641J1901J0197
12418a4950O855o355j967K0470J2590j1575k966m881r599r138J2860R36j3093
12405b0813o138J7341l298j6334j5226o800J623j717K4228k183n436M391L096
12392b7266L790j942L858P40m786P832J4158l451l493K888j488o271J2228R157
12378E954j5073j3065m348P038K011l446j632O547l757o323j6234p78J0510j043
12364c3639j0257r826R900K0334j0512O15P401K0032O374j313l591j3470j127
$$ plain form
12351 -19079 -16399 -15182 -25019 -24790 -23280 -48627 -61309 -53139 -42729 -39900 -35025 -37945 -33539 -14595
12337 -14595 -17677 -30133 -38806 -49859 -46322 -36593 -32320 -28524 -25889 -29883 -24454 -28790 -32470 -28552
12323 -28552 -19958 -14995 -8228 -26190 -31675 -27162 -31170 -20899 -13303 -17118 -13171 -11485 -24246 -31660
12309 -31660 -41783 -28309 -26281 -32090 -14722 -5393 -2503 -8338 -24512 -28147 -27140 -2503 3791
12296 3791 -8830 -22627 -24807 -29172 -13474 -12897 -3614 5678 -12357 -33113 -39189 -41587 -39508 -29841
12282 -29841 -21699 -15803 -22727 -28973 -20633 -10686 -20150 -28338 -15703 -18484 -19143 -15314 -18845 -8932
12268 -8932 3966 -4818 -23071 -19603 -18678 -28557 -26798 -26222 -26553 -22446 -22686 -15752 -11424 -28563 -27625
12253 -27625 -16020 -6604 -9720 -1579 -4093 -23464 -30807 -35292 -33116 -39625 -51166 -41858 -24174
$$ packed form
12351a9079K680J217r837K29J510k5347j2682Q170J0410K829M875k920M406J8944
12337a4595l082j2456q673j1053L537R729M273L796K635l994N429m336l680L918
12323b8552Q594M963O767j7962n485M513m008J0271P596l815L947J686j2761p414
12309c1660j0123J3474K028n809J7368R329K890n835j6174l635J007K4637O294
12296C791j2621j3797k180m365J5698N77R283R292j8035k0756o076k398K079R667
12282b9841Q142N896o924o246Q340R947r464q188J2635k781o59L829l531R913
12268h932J2898q784j8253L468R25r879J759N76l31M107k40O934M328j7139R38
12253b7625J1605R416l116Q141k514j9371p343m485K176o509j1541R308J7684
$$ plain form
12240 -24174 -26322 -23928 -23946 -26173 -21262 -11867 -11740 -202 -4516 -11897 -13583 -12217 -6245 -17353 -29592
12225 -29592 -26857 -17994 -7864 -16042 -15542 -17136 -27102 -11018 -9956 -15755 -21865 -22190 -20711 -20714 -34337
12210 -34337 -35432 -30685 -29002 -25178 -26328 -39543 -37288 -22131 -8267 -3237 1428 -3276 2835 7050
12196 7050 -9566 -19129 -23755 -24201 -27163 -32483 -32631 -19478 -16533 -31871 -26983 -33400 -41133 -40188 -41824
12181 -41824 -37841 -25554 -20691 -28997 -18291 -17144 -22489 -28650 -29731 -20322 -14151 -24843 -28426 -30699
12167 -30699 -35411 -33052 -24097 -23241 -17483 -17191 -13583 -12536 -16587 -22792 -19517 -10277 -12577 -2222 -4408
12152 -4408 -12961 -30741 -23474 -13746 -23699 -36186 -40867 -26819 -21967 -20027 -19243 -9870 -6122 603
12138 603 6176 12054 13202 -2476 -29517 -41198 -43855 -37661 -22458 -18223 -9809 640 -13898
$$ packed form
12240b4174k148K394j8k227M911R395J27J1538m314p381j686J366N972j1108j2239
12225b9592K735Q863J0130q178N00j594r966J6084J062n799o110l25J479lj3623
12210c4337j095M747J683L824j150j3215K255J5157J3864N030M665m704O111M215
12196G050j6616r563m626m46k962n320j48J3153K945j5338M888o417p733R45j636
12181d1824L983J2287M863q306J0706J147n345o161j081R409O171j0692l583k273
12167c0699m712K359Q955Q56N758K92L608J047m051o205L275R240k300J0355k186
12152d408q553j7780P267R728r953j2487m681J4048M852J940P84R373L748O725
12138F03N573N878J148j5678k7041j1681k657O194J5203M235Q414J0449j4538
$$ plain form
12125 -13898 -34255 -35313 -33939 -43425 -41121 -38096 -22777 -9075 -17221 -24745 -25053 -25618 -25433 -31287
12111 -31287 -23735 -23489 -27521 -28943 -21838 -16381 -20391 -17223 -15598 -16783 -10749 -4013 -8115 -9599 -15466
12096 -15466 -25475 -30165 -30457 -14047 -14151 -27942 -48351 -62998 -51707 -33456 -35923 -31828 -25058
12083 -25058 -20119 -15078 -19720 -20120 -15184 -23934 -27528 -20470 -14533 -9162 -20625 -26086 -34837 -33746
12069 -33746 -31458 -25180 -19952 -25059 -26729 -21807 -18075 -21391 -22036 -29386 -34818 -24308 -24536 -23352 -20443
12054 -20443 -23140 -18405 -22393 -30498 -29829 -30993 -33214 -27045 -30011 -32498 -34688 -24679 -15871 -11335
12040 -11335 -9944 -15021 -16386 -26614 -37202 -36766 -33574 -33803 -28002 -15713 -13760 -17454 -11353 -5666
12026 -5666 -18318 -13509 -7469 -12489 -26419 -19656 -15594 -21884 -23689 -21294 -33277 -34875 -29787 -21969
$$ packed form
12125a3898k0357j058J374r486K304L025J5319J3702q146p524l08n65J85n854
12111c1287P552K46m032j422P105N457m010L168J625j185O034O736m102j484n867
12096a5466j0009m690k92J6410j04j3791k0409j4647J1291J8251k467M095O770
12083b5058M939N041m642m00M936q750l594P058N937N371j1463n461q751J091
12069c3746K288O278N228n107j670M922L732l316o45p350n432J0510k28J184K909
12054b0443k697M735l988q105O69j164k221O169k966k487k190J0009Q808M536
12040a1335J391n077j365j0228j0588M36L192k29N801J2289J953l694O101N687
12026e666j2652M809O040n020j3930O763M062o290j805K395j1983j598N088P818
$$ plain form
12012 -21969 -17527 -19947 -29390 -20366 -22134 -22513 -20891 -18575 -27561 -45510 -45437 -32855 -31590 -36139 -40017
11997 -40017 -40439 -30322 -26728 -26758 -24345 -12315 -18758 -25087 -22403 -8872 4657 6282 3209 -1268
11983 -1268 -4775 -7227 -16165 -30888 -31487 -31313 -19853 -5838 -18194 -25816 -12562 -5758 -6294 -2590
11969 -2590 -10018 -23889 -24835 -19143 -19194 -26395 -21001 -19527 -16632 -8337 -11819 -7068 -10187 -22736 -40819
11954 -40819 -43973 -31785 -28483 -36680 -42701 -48765 -33412 -32343 -32657 -34121 -35542 -39627 -22819 -13056
11940 -13056 -29474 -39249 -37252 -33686 -29468 -36535 -43248 -39429 -29638 -24970 -40948 -48182 -33795 -22436
11926 -22436 -20503 -22516 -15453 -22524 -17204 -12017 -15940 -16465 -2919 1595 -5143 -19222 -25299 -32778
11912 -32778 -23055 -13777 -14626 -22386 -21417 -18150 -23451 -32092 -38569 -35321 -40499 -41087 -34031 -21479 -20034
$$ packed form
12012b1969M442k420r443R024j768l79J622K316q986j7949P3J2582J265m549l878
11997d0017m22J0117L594l0K413J2030o443o329K684J3531J3529J625l073m477
11983a268l507k452q938j4723n99J74J1460J4015j2356p622J3254O804n36L704
11969b590p428j3871r46N692n1p201N394J474K895Q295l482M751l119j2549j8083
11954d0819l154J2188L302q197o021o064J5353J069l14j464j421m085J6808R763
11940a3056j6418r775J997L566M218p067o713L819R791M668j5978p234J4387J1359
11926b2436J933k013P063p071N320N187l923n25J3546M514o738j4079o077p479
11912c2778R723R278q49p760R69L267n301q641o477L248n178n88P056J2552J445
$$ plain form
11897 -20034 -21108 -16488 -17949 -34230 -22107 -2959 1291 -10788 -14145 -12472 -2017 -5789 -2327
11884 -2327 -5276 -2252 -10233 -19538 -29751 -35462 -28546 -39620 -35882 -19386 -6932 6410 -1799
11871 -1799 -6693 -4743 -11312 -29218 -28817 -31552 -25630 -29895 -42117 -43497 -44026 -42898 -34339 -24886 -19382
11856 -19382 -9882 -18471 -31581 -22503 -17518 -20485 -37394 -52702 -49844 -43395 -42613 -42890 -37800 -31127
11842 -31127 -26635 -25500 -25978 -26225 -38156 -44335 -49857 -52412 -44402 -41493 -40650 -31455 -17834 -6232
11828 -6232 -11244 -30702 -39497 -32191 -36574 -45145 -50507 -41166 -19815 -4992 -2884 -18649 -30733
11815 -30733 -25335 -24832 -32537 -35536 -46395 -41802 -52822 -40261 -22940 -16011 -8549 -8583 -18782 -20261
11801 -20261 -31021 -44651 -51113 -43713 -34401 -34598 -30665 -20312 -9440 -19565 -28696 -38802 -39668
$$ packed form
11897b0034j074M620j461j6281J2123J9148M250j2079l357J673J0455l772L462
11884b327k949L024p981r305j0213n711O916j1074L738J6496J2454J3342q209
11871a799m894J950o569j7906M01k735N922m265j2222j380n29J128Q559R453N504
11856a9382R500q589j3110R078M985k967j6909j5308K858O449P82k77N090O673
11842c1127M492J135m78k47j1931o179n522k555Q010K909Q43R195J3621J1602
11828f232n012j9458q795P306m383q571n362R341K1351J4823K108j5765j2084
11815c0733N398N03p705k999j0859M593j1020J2561J7321O929P462l4j0199j479
11801b0261j0760j3630o462P400R312j97L933J0353J0872j0125r131j0106q66
$$ plain form
11788 -39668 -38575 -26409 -9526 -7544 -17461 -19850 -27659 -40117 -39550 -47166 -45783 -44894 -40189 -23437
11774 -23437 -24623 -25421 -22407 -14390 -23480 -27407 -21190 -9047 -9013 396 -6642 -9518 -8939 -14082 -6642
11759 -6642 -14711 -13924 -4569 -5612 -20892 -29419 -30579 -19845 -17410 -22219 -21328 -22409 -11152 180
11745 180 1476 -16610 -23936 -17273 -14481 -19327 -24015 -20406 -11405 -9287 -11258 -6872 -24736 -18962
11731 -18962 4864 6967 -14545 -38336 -37177 -34586 -17831 -27110 -29754 -23971 -13023 -17156 -22777
11718 -22777 -24284 -3205 6999 -10368 -18592 -21426 -23868 -34679 -34585 -14460 -633 2314 -9752
11705 -9752 -18567 -25615 -27774 -19604 -12609 -16952 -23441 -8851 -5628 -2260 724 -9963 -11224 -9593
11691 -9593 -13331 -22752 -25649 -25745 -23384 -30320 -27560 -28467 -33648 -36162 -32801 -35666 -30171 -11472 -4903
$$ packed form
11788c9668J093J2166J6883J982r917k389p809j2458N67p616J383Q89M705J6752
11774b3437j186p98L014Q017r090l927O217J2143L4R409p038k876N79n143P440
11759f642q069P87R355j043j5280q527j160J0734K435m809Q91j081J1257J1332
11745A80J296j8086p326O663K792m846m688L609R001K118j971M386j7864N774
11731a8962K3826K103k1512k3791J159K591J6755r279k644N783J0948m133n621
11718b2777j507K1079J0204j7367q224k834k442j0811R4K0125J3827K947j2066
11705i752q815p048k159Q170O995m343o489J4590L223L368K984j0687j261J631
11691i593l738r421k897r6K361o936K760r07n181k514L361k865N495J8699O569
$$ plain form
11676 -4903 -19857 -34404 -34335 -36139 -47247 -44349 -42062 -48209 -44501 -50768 -50043 -32883 -20862 -9898
11662 -9898 -6083 -18656 -18882 -12147 -12313 -18291 -12331 -5245 -2903 -10959 -8774 -1820 5490 -11180 -21419
11647 -21419 -25052 -23906 -3226 17899 14235 14863 25311 22202 14106 26384 33957 45418 58334
11634 58334 78501 87121 107749 135567 159923 187318 235506 324221 451200 627808 855186
11623 855186 1115185 1381663 1614321 1783143 1848790 1812638 1670004 1454457 1206060 961319
11613 961319 747076 583305 455303 360291 287036 252426 227835 197233 182759 192128 193788
11602 193788 188736 198514 213608 211824 219478 237602 261235 294183 309855 325649 320826 329702 340427
11589 340427 372061 436415 536344 630525 720861 816106 900623 968042 1016088 1054949 1064472 1055668
$$ packed form
11676d903j4954j4547O9j804j1108K898K287o147L708o267P25J7160J2021J0964
11662i898L815j2573k26O735j66n978N960P086K342q056K185O954P310j6670j0239
11647b1419l633J146K0680K1125l664O28J0448l109q096J2278P573J1461J2916
11634E8334K0167Q620K0628K7818K4356K7395M8188Q8715J26979J76608K27378
11623H55186K59999K66478K32658J68822O5647l6152j42634k15547k48397k44741
11613I61319k14243j63771j28002r5012p3255l4610k4591l0602j4474R369J660
11602A93788n052R778J5094j784P654J8124K3633L2948J5672J5794m823Q876J0725
11589C40427L1634O4354R9929R4181R0336R5245Q4517O7419M8046L8861R523q804
$$ plain form
11577 1055668 1056326 1073587 1129246 1204634 1308501 1414759 1525640 1602164 1624490 1595187 1515687
11566 1515687 1396403 1277451 1174413 1083296 1033103 1012105 1000432 993496 968951 910862 845353
11555 845353 787064 728557 700755 685041 686635 676779 664263 635553 597571 554745 503551 445118
11543 445118 396303 362692 326320 281850 251043 239049 226531 217630 210224 207019 189801 185833
11531 185833 201483 225863 243514 277101 331674 408003 526110 695084 924523 1189955 1473757
11520 1473757 1733611 1928536 2009163 1988092 1853849 1630425 1358186 1089923 848833 652426
11510 652426 503617 402105 314943 238526 201782 183833 171716 164125 155663 127261 120789 117459
11498 117459 100422 74470 74491 60540 46974 37075 36356 34702 37317 28159 15337 15425 19899 19153
$$ packed form
11577A055668O58J7261N5659P5388J03867J06258J10881P6524K2326k9303p9500
11566A515687j19284j18952j03038r1117n0193k0998j1673o936k4545n8089o5509
11555H45353n8289n8507k7802j5714J594r856j2516k8710l7982m2826n1194n8433
11543D45118m8815l3611l6372m4470l0807j1994j2518q901p406l205j7218l968
11531A85833J5650K4380J7651L3587N4573P6329J18107J68974K29439K65432K83802
11520A473757K59854J94925Q0627k1071j34243k23424k72239k68263k41090j96407
11510F52426j48809j01512q7162p6417l6744j7949j2117p591q462k8402o472l330
11498A17459j7037k5952K1j3951j3566r899p19j654K615r158j2822Q8M474p46
$$ plain form
11484 19153 15976 24006 20586 15703 1362 3186 12579 12619 649 -7127 -10830 -16407 -16020 1514
11470 1514 16012 20846 22038 20270 19686 21288 7499 2890 -9249 -21751 -16400 -19834 -9258 3808
11456 3808 -1991 -10573 -12223 -2615 5336 -2357 -4030 523 -6970 -9330 1031 2918 8205 16278
11442 16278 19489 20133 12007 9803 -3625 9747 9644 11384 15490 8062 1005 -8680 -5617 8063
11428 8063 20147 28120 31029 53706 76942 126091 175703 220239 234735 205129 159905 120788
11416 120788 83619 69581 48396 29889 18251 16843 23058 33717 30732 27208 23878 25170 23188
11403 23188 19274 26624 43937 58628 64902 62872 69612 80594 94777 124256 173174 218408 269452
11390 269452 339536 415854 486167 530946 568019 592821 572413 533887 486007 444286 408222
$$ packed form
11484A9153l177Q030l420m883j4341J824R393M0j1970p776l703n577L87J7534
11470A514J4498M834J192j768n84J602j3789m609j2139j2502N351l434J0576J3066
11456C808n799q582j650R608P951p693j673M553p493k360J0361J887N287Q073
11442A6278L211O44q126k204j3428J3372j03J740M106p428p057r685L063J3680
11428H063J2084P973K909K2677K3236M9149M9612M4536J4496k9606m5224l9117
11416A20788l7169j4038k1185j8507j1638j408O215J0659k985l524l330J292j982
11403B3188l914P350J7313J4691O274k030O740J0982J4183K9479M8918M5234N1044
11390B69452P0084P6318P0313M4779L7073K4802k0408l8526m7880m1721l6064
$$ plain form
11379 408222 394496 434365 496754 526554 526768 477378 407842 321895 246430 186593 149608 122914
11367 122914 101082 90003 95804 95229 77262 72066 73666 82903 83108 70334 78700 107026 112636
11354 112636 123120 159133 186855 211247 234529 269680 316141 365255 407863 458143 506161
11343 506161 554124 611160 662231 718958 774243 806477 821822 825991 821759 798520 777872 765762
11331 765762 757242 732467 676705 596571 526995 463018 415890 369994 334804 304720 265463 234301
11319 234301 198157 180533 173473 157922 115984 83874 85019 78540 80271 67294 63442 62346 68715
11306 68715 61172 45919 57516 52169 57449 67127 72976 105129 130218 133946 148119 199777 272704
11293 272704 345597 429976 519088 610070 662849 688906 680623 624997 551603 493894 437614 364775
$$ packed form
11379D08222j3726L9869O2389K9800K14m9390o9536q5947p5465n9837l6985k6694
11367A22914k1832j1079N801n75j7967n196J600R237K05j2774Q366K8326N610
11354A12636J0484L6013K7722K4392K3282L5151M6461M9114M2608N0280M8018
11343E06161M7963N7036N1071N6727N5285L2234J5345M169m232k3239k0648j2110
11331G65762q520k4775n5762q0134o9576o3977m7128m5896l5190l0084l9257l1162
11319B34301l6144j7624p060j5551m1938l2110J145o479J731j2977l852j096O369
11306F8715p543j5253J1597n347N280R678N849L2153K5089L728J4173N1658P2927
11293B72704P2893Q4379Q9112R0982N2779K6057q283n5626p3394n7709n6280p2839
$$ plain form
11281 364775 290002 225871 180863 140902 118651 108415 112748 91371 68353 56343 45744 43051
11269 43051 36179 35385 32535 36711 32984 37598 29331 19849 15977 23877 29749 31563 42299 32478
11255 32478 21834 15796 28571 33728 21120 18558 20880 27405 43622 62164 74921 83689 98816
11242 98816 109435 112556 111448 99327 91622 80173 75948 76264 68314 51458 56036 63988 38312
11229 38312 23408 11024 4842 14380 23060 14569 12547 6465 3368 -116 -8716 7636 16159 15546
11215 15546 8691 14201 25621 24254 28246 32452 17335 10134 11998 32586 36874 31149 29444 42944
11201 42944 52538 51511 53857 61021 75417 84548 92614 98340 114790 121094 121201 105778 98908 111437
11187 111437 109326 88678 83795 96183 102897 99227 89313 90106 91614 74665 66909 72423 75748 66185
$$ packed form
11281C64775p4773o4131m5008l9961k2251j0236M333k1377k3018j2010j0599k693
11269D3051o872p94k850M176l727M614q267r482l872P900N872J814J0736r821
11255C2478j0644o038J2775N157j2608k562K322O525J6217J8542J2757Q768J5127
11242I8816J0619L121j108j2121p705j1449m225L16p950j6856M578P952k5676
11229C8312j4904j2384o182R538Q680q491k022o082l097l484q600J6352Q523o13
11215A5546o855N510J1420j367L992M206j5117p201J864K0588M288n725j705J3500
11201D2944R594j027K346P164J4396R131Q066N726J6450O304J07j5423o870J2529
11187A11437k111k0648m883J2388O714l670r914P93J508j6949p756N514L325r563
$$ plain form
11173 66185 52884 46860 39013 34068 25192 11452 7522 14810 35862 46508 38847 46698 55301
11160 55301 62071 59084 49693 56349 49524 34267 40062 49630 43038 39431 48086 53729 62521 75288
11146 75288 75385 87031 115251 123632 138018 143612 151561 144495 138418 137467 132568 139207 136255 145128
11132 145128 129696 131835 136191 140269 142992 134235 137481 149488 152920 152081 155619 164739 179366 197320
11118 197320 217045 243039 242758 245447 235750 227006 224517 226571 217546 193382 190443 178209 161147
11105 161147 156493 140070 135904 142537 140152 123254 125074 135573 149166 143958 137464 134368 126530
11092 126530 125863 139284 143951 152826 151689 139064 135284 140990 148565 169004 193993 208404 210793
11079 210793 221622 219850 216151 212853 224575 239651 263604 274859 273228 283514 302928 302681 293446
$$ packed form
11173F6185j3301o024p847m945q876j3740l930P288K1052J0646p661P851Q603
11160E5301O770k987r391O656o825j5257N795R568o592l607Q655N643Q792J2767
11146G5288R7J1646K8220Q381J4386N594P949p066o077r51m899O639k952Q873
11132A45128j5432K139M356M078K723q757L246J2007L432q39L538R120J4627J7954
11118A97320J9725K5994k81K689r697q744k489K054r025k4164k939j2234j7062
11105A61147m654j6423m166O633k385j6898J820J0499J3593n208o494l096p838
11092A26530o67J3421M667Q875j137j2625l780N706P575K0439K4989J4411K389
11079B10793J0829j772l699l298J1722J5076K3953J1255j631J0286J9414k47r235
$$ plain form
11066 293446 290780 284978 281123 269449 263583 247621 235809 221464 224657 221881 215222 223508 227391
11053 227391 228276 231528 236937 246957 265414 287307 283319 267347 273136 292758 305052 329000 348379
11040 348379 376558 381781 395280 416668 448007 466917 496361 527838 564176 589745 617076 641688
11028 641688 679763 717728 773239 826135 848465 879173 935938 1001945 1064341 1132139 1206581
11017 1206581 1297113 1393162 1497420 1629702 1793466 1979212 2194279 2457279 2796519 3205810
11007 3205810 3666592 4164319 4702660 5267215 5853648 6492167 7207396 8053506 9139169
10998 9139169 10601980 12725126 15858119 20442001 26995732 35884586 47090212 60080250
10990 60080250 73878162 87162000 98466845 106358106 109720336 108045099 101674874 91647935
$$ packed form
11066B93446k666n802l855j1674n866j5962j1812j4345L193k776o659Q286L883
11053B27391Q85L252N409J0020J8457K1893l988j5972N789J9622J2294K3948J9379
11040C48379K8179N223J3499K1388L1339J8910K9444L1477L6338K5569K7331K4612
11028F41688L8075L7965N5511N2896K2330L0708N6765O6007O2396O7798P4442
11017A206581R0532R6049J04258J32282J63764J85746K15067K63000L39240M09291
11007C205810M60782M97727N38341N64555N86433O38519P15229Q46110J085663
10998I139169J462811K123146L132993M583882O553731Q888854J1205626J2990038
10990F0080250J3797912J3283838J1304845P891261L362230j675237o370225j0026939
$$ plain form
10982 91647935 79363650 66275802 53683829 42602341 33647886 26935257 22167353
10975 22167353 18886012 16629511 15046256 13904463 13050481 12394970 11862484 11416068 11061974
10966 11061974 10801356 10632576 10608125 10766095 11164745 11886780 12986875 14470002 16333306
10957 16333306 18571283 21160263 24093767 27362530 30991542 35069472 39749208 45141847
10949 45141847 51317841 58383588 66501456 75818070 86311465 97734025 109693676 121554328
10941 121554328 132509713 141643374 148068737 151040660 150115000 145359668 137337786 126969560
10933 126969560 115346762 103543337 92511670 83008185 75388762 69554848 65058481
10926 65058481 61377116 57981316 54412157 50390922 45925569 41142139 36262839 31537932
$$ packed form
10982I1647935j2284285j3087848j2591973j1081488q954455o712629m767904
10975B2167353l281341k256501j583255j141793q53982o55511n32486m46416l54094
10966A1061974k60618j68780k4451J57970L98650P22035J100095J483127J863304
10957A6333306K237977K588980K933504L268763L629012M077930M679736N392639
10949D5141847O175994P065747Q117868R316614J0493395J1422560J1959651J1860652
10941A21554328J0955385R133661O425363K971923r25660m755332q021882j0368226
10933A26969560j1622798j1803425j1031667r503485p619423n833914m496367
10926F5058481l681365l395800l569159m021235m465353m783430m879300m724907
$$ plain form
10918 31537932 27203737 23459277 20422384 18060957 16231804 14835908 13804230 13073942
10910 13073942 12615858 12369252 12241670 12214568 12271836 12401891 12607840 12929901 13465763 14358215
10900 14358215 15789529 18064589 21581957 26882356 34493522 44686661 57313608 71647581
10892 71647581 86532143 100508439 111986812 119500236 121956055 118975048 111080926 99477556
10884 99477556 85679115 71199792 57385631 45296680 35519504 28134777 22840062
10877 22840062 19126532 16480367 14577316 13131999 11968307 10959974 10057997 9202786
10869 9202786 8370608 7559587 6785509 6062336 5421564 4837975 4361067 3979953 3656443
10860 3656443 3382137 3129961 2915339 2721437 2556368 2410864 2278737 2148051 2021175
$$ packed form
10918C1537932m334195l744460l036893k361427j829153j395896j031678p30288
10910A3073942m58084k46606j27582k7102N7268J30055K05949L22061N35862Q92452
10900A4358215J431314K275060L517368N300399P611166J0193139J2626947J4333973
10892G1647581J4884562J3976296J1478373P513424K455819k981007p894122j1603370
10884I9477556j3798441j4479323j3814161j2088951r777176p384727n294715
10877B2840062l713530k646165j903051j445317j163692j008333r01977q55211
10869I202786q32178q11021p74078p23173o40772n83589m76908l81114l23510
10860C656443k74306k52176k14622j93902j65069j45504j32127j30686j26876
$$ plain form
10851 2021175 1890636 1775032 1679911 1602895 1546271 1502913 1464699 1431829 1392136 1346999 1317063
10840 1317063 1277011 1233042 1184698 1147296 1115383 1066510 1028102 987751 957059 941436 941739 931284
10828 931284 895627 864022 852907 838709 824389 823014 827380 819643 802338 786783 793365 786975
10816 786975 749484 735947 725692 702738 691775 679567 648714 632766 608095 581868 574950 569213
10804 569213 548908 529557 504742 487694 478566 467433 459673 446694 431728 416334 390683 377273
10792 377273 378554 375914 359210 346259 346067 353838 362189 382046 389293 389199 406119 430365 429649 437141
10778 437141 439599 456682 471834 466989 469993 477935 480056 481775 477000 466224 446160 435973 433750
10765 433750 442859 449613 450177 432309 426297 421975 410663 394666 383433 368496 364533 366433 367982
$$ packed form
10851B021175j30539j15604r5121p7016n6624m3358l8214l2870l9693m5137k9936
10840A317063m0052m3969m8344l7402l1913m8873l8408m0351l0692j5623L03j0455
10828I31284l5657l1605j1115j4198j4320j375M366p737j7305j5555O582o390
10816G86975l7491j3537j0255k2954j0963j2208l0853j5948k4671k6227o918n737
10804E69213k0305j9351k4815j7048r128j1133p760j2979j4966j5394k5651j3410
10792C77273J281k640j6704j2951j92P771Q351J9857P247r4J6920K4246p16P492
10778D37141K458J7083J5152m845L004P942K121J719m775j0776k0064j0187k223
10765D33750R109O754N64j7868o012m322j1312j5997j1233j4937l963J900J549
$$ plain form
10752 367982 373268 369399 356370 344690 344519 330843 316336 291887 258943 231173 206093 194431
10740 194431 193728 203750 222480 225682 216333 207918 207767 199380 201978 201629 210659 195452 179862 176617
10726 176617 182333 191386 195104 186183 185200 185682 176595 159080 156865 159199 164182 168968 168874 169033 189127
10711 189127 208652 219177 240785 268038 263808 257228 260086 257717 251423 237544 220913 196565
10699 196565 167254 163430 162520 149855 153052 142192 128704 104759 98453 101694 113615 121816 129483
10686 129483 136309 140771 139527 139971 140769 140913 157069 159951 125218 118173 131315 131240 134255 135770 138933
10671 138933 136233 136491 145612 138510 124767 120209 121690 118873 112892 118868 115248 109502 115127 108033
10657 108033 100715 97680 100544 112394 120123 111109 95048 95286 107741 110699 111022 105606 99016 89060
$$ packed form
10752C67982N286l869j3029j1680j71j3676j4507k4449l2944k7770k5080j1662
10740A94431p03J0022J8730L202r349q415j51q387K598l49R030j5207j5590l245
10726A76617N716R053L718q921r83M82r087j7515k215K334M983M786r4J59K0094
10711A89127J9525J0525K1608K7253m230o580K858k369o294j3879j6631k4348
10699A96565k9311l824r10j2665L197j0860j3488k3945o306L241J1921Q201P667
10686A29483O826M462j244M44P98J44J6156K882l4733p045J3142p5L015J515L163
10671A38933k700K58R121p102j3743m558J481k817n981N976l620n746N625p094
10657A08033p318l035K864J1850P729r014j6061K38J2455K958L23n416o590r956
$$ plain form
10643 89060 77163 73886 84245 89787 81243 88760 97749 111170 102531 97195 95342 100599 103429 97322
10629 97322 107679 111232 101401 88553 82105 70443 62314 72202 87515 78508 77701 77320 73843 71639
10615 71639 75075 87050 84992 79375 71157 61325 70018 67541 73919 77390 74749 77864 85092 86881
10601 86881 96528 108161 109275 96868 102375 116826 118612 114165 124547 138141 158674 181176 215033
10588 215033 255535 309826 375494 434349 485092 544885 584586 596232 598615 576277 520434 466742
10576 466742 404460 338448 276515 228446 208784 187188 154470 136409 123251 107981 100358 94109
10564 94109 84087 90692 92097 97774 98494 114840 123772 127287 144070 148497 152085 163502 169566 178325
10550 178325 194382 209722 225258 247828 267430 297829 324285 350038 388825 443800 490925
$$ packed form
10643H9060j1897l277J0359N542q544P517Q989J3421q639n336j853N257K830o107
10629I7322J0357L553r831j2848o448j1662q129R888J5313r007q07l81l477k204
10615G1639L436J1975k058n617q218r832Q693k477O378L471k641L115P228J789
10601H6881R647J1633J114j2407N507J4451J786m447J0382J3594K0533K2502L3857
10588B15033M0502N4291O5668N8855N0743N9793L9701J1646K383k2338n5843n3692
10576D66742o2282o6012o1933m8069j9662k1596l2718j8061j3158j5270p623o249
10564I4109j0022O605J405N677P20J6346Q932L515J6783M427L588J1417O064Q759
10550A78325J6057J5340J5536K2570J9602L0399K6456K5753L8787N4975M7125
$$ plain form
10539 490925 553630 615330 683897 745757 805705 840284 857092 861699 833371 782076 715090 657155
10527 657155 598803 556946 518596 471309 434056 409600 384991 363833 335346 315996 305840
10516 305840 287720 266214 244046 220183 180902 159924 149776 130209 125889 119968 113011 104997
10504 104997 111086 124434 125272 112099 109192 119050 121555 127617 121676 130303 130634 158809 194914 229565
10490 229565 272322 321079 391011 474987 550512 603040 635584 655395 644711 608904 568040
10479 568040 514807 427845 355225 297899 236160 188776 155539 127487 105363 91734 85607 79836
10467 79836 75103 75708 82382 72575 57467 54632 38139 38726 33368 29920 41103 63461 52716 53601
10453 53601 61609 44620 33195 38301 29919 20050 20454 29182 41367 43917 36068 26712 31989 35247
$$ packed form
10539D90925O2705O1700O8567O1860N9948L4579J6808M607k8328n1295o6986n7935
10527F57155n8352m1857l8350m7287l7253k4456k4609k1158k8487j9350j0156
10516C05840j8120k1506k2168k3863l9281k0978j0148j9567m320n921o957q014
10504A04997O089J3348Q38j3173k907R858K505O062n941Q627L31K8175L6105L4651
10490B29565M2757M8757O9932Q3976P5525N2528L2544J9811j0684l5807m0864
10479E68040n3233q6962p2620n7326o1739m7384l3237k8052k2124j3629o127n771
10467G9836m733O05O674r807j5108k835j6493N87n358l448J1183K2358j0745Q85
10453E3601Q008j6989j1425N106q382r869M04Q728J2185K550p849r356N277L258
$$ plain form
10439 35247 35949 34024 40286 48783 41145 28300 19432 29717 37722 41176 43873 44009 44211 36033 28630
10424 28630 38346 31688 37497 31428 26033 22352 23913 34777 26330 21497 22180 26971 47358 54474
10410 54474 28068 9050 2339 9428 9780 8805 8252 11307 12948 7478 -2554 -127 9846 19538
10396 19538 16416 9006 9917 5315 -3937 -7620 -4142 -5413 -9454 9387 25454 10085 -968 -6197
10382 -6197 -12219 -8540 -5109 6888 15419 13921 11426 23199 23809 17564 2918 7373 5477 8303
10368 8303 15097 19562 19322 11969 2078 -3685 -2172 -11241 -4525 6955 13974 10361 -5836 810
10354 810 328 5918 22134 18690 26100 38794 18964 13366 24336 14194 -1679 -10511 -12571 -17847
10340 -17847 -10691 5870 2211 10326 20273 23165 25720 27318 36874 25422 22426 17266 15012 17986
$$ packed form
10439C5247P02j925O262Q497p638j2845q868J0285Q005L454K697J36K02q178p403
10424B8630R716o658N809o069n395l681J561J0864q447m833O83M791K0387P116
10410E4474k6406j9018o711P089L52r75n53L055J641n470j0032K427R973R692
10396A9538l122p410R11m602r252l683L478j271m041J8841J6067j5369j1053n229
10382f197o022L679L431J1997Q531j498k495J1773O10o245j4646M455j896K826
10368H303O794M465k40p353r891n763J513r069O716J1480P019l613j6197O646
10354H10m82N590J6216l444P410J2694j9830n598J0970j0142j5873q832k060n276
10340a7847P156J6561l659Q115R947K892K555J598R556j1452k996n160k254K974
$$ plain form
10326 17986 25212 28322 19281 19685 24724 11081 -810 -13719 -35973 -35590 -19726 -16898 -12311 9449
10312 9449 9018 -4614 -19342 -8228 6758 18142 16660 12538 5826 -12509 -13515 -2858 1812
10299 1812 403 -2768 19785 2904 -4512 -13252 -12647 -6181 60 689 -12435 -8489 -13737 -14705 -2886
10284 -2886 590 2613 10755 13330 19144 12148 4557 1682 5149 5071 168 2664 430 -4161 -3966
10269 -3966 -3600 11103 17485 19687 21387 11138 15336 2854 -14824 -3466 1851 -17653 -14459
10256 -14459 -14276 -11193 838 15122 14807 18200 22349 30585 20362 9943 8969 3370 -6956 -7494
10242 -7494 5251 -114 -11091 -23451 -20161 2254 2772 -14616 -30453 -16160 3912 19459 29611
10229 29611 21974 -2004 -16643 -22205 -5629 6685 2805 2904 6301 2705 18928 15016 14053 19567
$$ packed form
10326A7986P226L110r041M04N039j3643j1891j2909k2254L83J5864K828M587K1760
10312I449m31j3632j4728J1114J4986J1384j482m122o712j8335j006J0657M670
10299A812j409l171K2553j6881p416q740O05O466O241O29j3124L946n248r68J1819
10284b886L476K023Q142K575N814o996p591k875L467p8m903K496k234m591J95
10269c966L66J4703O382K202J700j0249M198j2482j7678J1358N317j9504L194
10256a4459J83L083J2031J4284l15L393M149Q236j0223j0419r74n599j0326n38
10242g494J2745n365j0977j2360L290K2415N18j7388j5837J4293K0072J5547J0152
10229B9611p637k3978j4639n562J6576J2314l880R9L397l596J6223l912r63N514
$$ plain form
10215 19567 3622 3843 6267 744 4101 3370 1397 -18940 -37988 -35063 -21692 -12183 -7987 -11827
10201 -11827 -20704 -17388 -15081 -8443 -2526 -13935 -23482 -15119 -16897 -29008 -26609 -9824 7033
10188 7033 2773 18244 17901 17130 12496 -2289 -12169 -25639 -27732 -22662 -18292 -3304 2659 565
10174 565 1421 -7422 -279 7964 3165 -1697 -8793 -12382 -10758 -22065 -20800 -10733 -13907 -22511 -14903
10159 -14903 194 11588 6094 3188 -12853 -14301 -1337 6711 6930 17351 3349 5007 11308
10146 11308 8850 7991 -5018 5300 19536 4878 -8464 -16702 -21177 -14351 -10825 -15485 -16002 -21311
10132 -21311 -23849 -20630 -2874 -5898 -1288 -10966 -9783 1445 9416 6761 1283 -8786 1517
10119 1517 3619 -2632 -4408 -9514 -8936 -799 -7339 -9483 -3966 -8503 -27043 -30799 -30002 -23070 -20659
$$ packed form
10215A9567j5945K21K424n523L357p31j973k0337j9048K925J3371R509M196l840
10201a1827q877L316K307O638N917j1409r547Q363j778j2111K399J6785J6857
10188G033m260J5471l43p71m634j4785r880j3470k093N070M370J4988N963k094
10174E65Q56q843P143Q243m799m862p096l589J624j1307J265J0067l174q604P608
10159a4903J5097J1394n494k906j6041j448J2964Q048K19J0421j4002J658O301
10146A1308k458q59j3009J0318J4236j4658j3342q238m475O826L526m660n17n309
10132b1311k538L219J7756l024M610r678J183J1228P971k655n478j0069J0303
10119A517K102o251j776n106N78Q137o540k144N517m537j8540l756P97O932K411
$$ plain form
10104 -20659 -10605 4504 2020 1386 -10356 -8307 -6649 -9996 -6576 -5365 -8332 -3309 6042 5792
10090 5792 5180 7013 10963 15002 19898 19525 9014 3946 7947 2293 -6225 -8896 -16880 -15538 -13238
10075 -13238 -4258 -13913 -8820 -2481 -3740 -13489 -12843 -13211 -12954 -6534 8544 8553 14997 21521 17386 4966
10059 4966 -2571 2986 5089 19745 36284 20569 11683 23738 36366 77275 130783 207468 342121
10046 342121 472532 424323 275565 155177 96337 66377 49609 26696 5486 -4272 -1461
10035 -1461 3494 2127 -1923 4633 89 -10717 3454 14480 5326 2977 -700 -293 13705 15676
10021 15676 15748 259 -9592 -16417 -16774 -15966 -12261 -10491 -14411 -24247 -27140 -17947 -6260 921 -2326
10006 -2326 4028 7642 11802 4359 -9209 -8805 4789 13182 13834 3154 1217 -12818 -15895 -10081
$$ packed form
10104b0659J0054J5109k484o34j1742K049J658l347L420J211k967N023R351k50
10090E792o12J833L950M039M896l73j0511n068M001n654q518k671p984J342K300
10075a3238Q980r655N093O339j259r749O46l68K57O420J5078RO444O524m135j2420
10059D966p537N557K103J4656J6539j5715q886J2055J2628M0909N3508P6685J34653
10046C42121J30411m8209j48758j20388n8840k9960j6768k2913k1210r758K811
10035a461M955j367m050O556m544j0806J4171J1026r154k349l677M07J3998J971
10021A5676P2j5489r851o825l57Q08L705J770l920r836k893R193J1687P181l247
10006b326O354L614M160p443j3568M04J3594Q393O52j0680j937j4035l077N814
$$ plain form
9992 -10081 -8042 -7572 -12559 -13597 -18972 -24279 -26344 -16171 -15546 -7103 6334 4592 17704 28267
9978 28267 36806 20057 8096 -14715 -19196 -20752 -10955 -6569 -22408 -23152 -20779 -12659 -4506 -5097
9964 -5097 -11912 -7383 2190 5428 6045 10111 21925 17791 17358 22111 18668 21306 29066 40243 42025
9949 42025 36194 18481 12100 9340 -5252 -3083 -5134 2968 18519 25666 10283 -4882 7544
9936 7544 16489 18665 18995 31272 45764 58977 78712 77656 50288 24579 13644 11311 4119
9923 4119 -1114 16549 25267 6323 -4909 -11479 -9371 -2053 -283 -4905 -11693 -10040 -5227 -9365
9909 -9365 -11280 -8840 -4084 2007 -969 1595 2290 -4254 -16004 -13793 -13734 -12266 -13081 -18708 -20537 -18479
9893 -18479 -15397 -12957 -9853 -5821 -18242 -11332 -11310 -4014 6970 7367 2345 7270 -428 -4016 9804
$$ packed form
9992a0081K039M70m987j038n375n307k065J0173O25Q443J3437j742J3112J0563
9978B8267Q539j6749j1961k2811m481j556R797M386j5839p44K373Q120Q153n91
9964e097o815M529R573L238O17M066J1814m134m33M753l443K638P760J1177J782
9949D2025n831j7713o381k760j4592K169k051Q102J5551P147j5383j5165J2426
9936G544Q945K176L30J2277J4492J3213J9735j056k7368k5709j0935k333p192
9923D119n233J7663Q718j8944j1232o570K108P318J770m622o788J653M813m138
9909i365j915K440M756O091k976K564O95o544j1750K211N9J468q15n627j829K058
9893a8479L082K440L104M032j2421O910K2P296J0984L97n022M925p698l588J3820
$$ plain form
9878 9804 7920 -2620 -3137 -1877 -20 13220 16732 15452 13186 15080 22210 27101 16370 16408 19379
9863 19379 24022 37031 27828 4064 1855 4766 -2705 230 2777 -6763 -10282 -3000 -6234 -10035
9849 -10035 -4126 -2544 -5489 462 9238 -4122 -9185 -8118 404 1819 -1386 1806 -9264 -20069
9835 -20069 -8928 -3402 -4192 -2725 5473 12869 9897 -2827 -9907 -2806 13357 14062 13589 14131 10282
9820 10282 -1760 -7227 1169 10736 13038 -1955 -11781 -21850 -21561 -22242 -15571 -1352 2318 3369
9806 3369 1733 267 -530 -2526 -16792 -28547 -8390 13035 34004 30606 24500 23035 11148 13136
9792 13136 8762 -110 -4363 -14102 -7223 -3307 -7794 -8368 -6455 -944 10863 19158 7856 2152
9778 2152 8990 6273 -4109 -10425 -11347 -12920 -2637 11851 28216 16627 8821 10558 7066 8258
$$ packed form
9878I804j884j0540n17J260J857J3240L512j280k266J894P130M891j0731L8K971
9863A9379M643J3009r203k3764k209K911p471K935K547r540l519P282l234l801
9849a0035N909J582k945N951Q776j3360n063J067Q522J415l205L192j1070j0805
9835b0069J1141N526p90J467Q198P396k972j2724p080P101J6163P05m73N42l849
9820A0282j2042n467Q396R567K302j4993r826j0069K89o81O671J4219L670J051
9806C369j636j466p97j996j4266j1755K0157K1425K0969l398o106j465j1887J988
9792A3136m374q872m253r739O879L916m487n74J913N511J1807Q295j1302n704
9778B152O838k717j0382o316r22j573J0283J4488J6365j1589p806J737l492J192
$$ plain form
9764 8258 20285 33466 27434 12329 20049 12398 4252 -1443 -4913 538 7811 8674 20398 25642
9750 25642 21290 25546 32126 19885 7540 -5615 -3437 -3165 -10500 -27579 -17414 4621 13224
9737 13224 10314 15832 2044 -1500 5462 2223 19540 11812 4370 7603 15796 13877 14093 17742
9723 17742 10832 7872 14841 5963 11022 10937 9529 3147 18830 30513 29435 44209 44378 29680
9709 29680 30909 32864 32401 34218 42520 52156 69654 98727 139826 179985 218031 230034 194428
9696 194428 157692 120557 81829 59612 50531 46412 36552 35793 34272 30083 23441 23327 18117 1016
9682 1016 8706 16665 8019 25899 27433 20484 26266 30554 39535 44745 34923 38843 51224 66044
9668 66044 71769 95845 122502 147049 166623 184530 217118 245843 256492 250603 229476 209991
$$ packed form
9764H258J2027J3181o032j5105P720p651q146n695l470N451P273Q63J1724N244
9750B5642m352M256O580j2241j2345j3155K178K72p335j7079J0165K2035Q603
9737A3224k910N518j3788l544O962l239J7317p728p442L233Q193j919K16L649
9723A7742o910k960O969q878N059q5j408o382J5683J1683j078J4774J69j4698
9709B9680J229J955m63J817Q302R636J7498K9073M1099M0159L8046J2003l5606
9696A94428l6736l7135l8728k2217r081m119r860p59j521m189o642j14n210j7101
9682A016P690P959q646J7880J534o949N782M288Q981N210r822L920J2381J4820
9668F6044N725K4076K6657K4547J9574J7907L2588K8725J0649n889k1127j9485
$$ plain form
9656 209991 198825 215699 247531 295902 340363 344824 339881 325913 301781 281318 264334 244682
9644 244682 233799 242068 256454 263040 269351 271587 250895 218507 182349 150716 116298 95774
9632 95774 91234 74780 71003 68496 79364 83145 88601 93449 105437 128682 126975 119580 135575
9619 135575 156653 193665 240116 273429 271376 257218 239551 237459 236043 238554 271908 323997
9607 323997 390894 465786 539324 594074 646457 682077 673815 622835 555770 478006 402879 339336
9595 339336 294523 248654 216772 194571 177848 177063 187938 226788 257852 263340 248286 218600
9583 218600 199185 169120 154288 151420 153076 137339 128824 124781 125190 141116 157234 146169 142848
9570 142848 143134 134429 161121 207365 236739 267685 285812 298260 313390 320667 309470 303879 317522
$$ packed form
9656B09991j1166J6874L1832M8371M4461M461m943j3968k4132k0463j6984j9652
9644B44682j0883Q269J4386O586O311K236k0692l2388l6158l1633l4418k0524
9632I5774m540j6454l777k507J0868L781N456M848J1988K3245j707p395J5995
9619A35575K1078L7012M6451L3313k053j4158j7667k092j416K511L3354N2089
9607C23997O6897P4892P3538N4750N2383L5620q262n0980o7065p7764p5127o3543
9595C39336m4813m5869l1882k2201j6723p85J0875L8850L1064N488j5054k9686
9583B18600j9415l0065j4832k868J656j5737q515m043M09J5926J6118j1065l321
9570A42848K86q705K6692M6244K9374L0946J8127J2448J5130P277j1197n591J3643
$$ plain form
9557 317522 342934 372928 419389 476727 495132 480599 430484 370852 328540 317973 308787 305951
9545 305951 301829 286717 268978 273834 271548 265764 238960 216196 201442 189193 192607 189534 190231
9532 190231 196667 200742 186980 163154 140260 138987 149478 153445 166619 172029 163410 181063 187226
9519 187226 170437 155697 143269 144337 150910 151038 161597 184989 189831 190230 190680 222277 269379
9506 269379 294646 305591 308130 283514 247010 210703 208247 205480 203387 190753 179118 177851 168893
9493 168893 165938 160710 174906 208016 243085 291226 336125 372609 374679 362444 321514 260908
9481 260908 205724 179492 174057 161439 158867 152613 156657 161639 180512 191721 180155 160292 152163
9468 152163 159337 157050 158779 175536 192638 213063 235344 252555 273753 269695 262370 234680 204269
$$ packed form
9557C17522K5412K9994M6461N7338J8405j4533n0115n9632m2312j0567r186k836
9545C05951m122j5112j7739M856k286n784k6804k2764j4754j2249L414l073O97
9532A90231O436M075j3762k3826k2894j273J0491L967J3174N410q619J7653O163
9519A87226j6789j4740j2428J068O573J28J0559K3392M842L99M50L1597M7102
9506B69379K5267J0945K539k4616l6504l6307k456k767k093j2634j1635j267q958
9493A68893k955n228J4196L3110L5069M8141M4899L6484K070j2235m0930o0606
9481B60908n5184k6232n435j2618k572o254M044M982J8873J1209j1566j9863q129
9468A52163P174k287J729J6757J7102K0425K2281J7211K1198m058p325k7690l0411
$$ plain form
9455 204269 178194 172300 173215 160480 157819 167485 156889 141986 140823 154939 191435 217564 251162
9442 251162 297606 349331 403424 452184 468611 446623 401972 348370 292493 260859 254409 261047
9430 261047 281883 305617 336282 372272 389317 426358 455701 481143 516017 551006 569215 573475
9418 573475 562093 565494 554124 523160 490967 442033 410160 383796 364690 335717 297251 265662
9406 265662 243864 239891 251377 254306 263133 261796 270788 291034 315331 340969 376235 400819 438507
9393 438507 469536 481591 488784 504190 527104 525572 503471 486822 491105 531967 610632 703875
9381 703875 793887 865237 906024 953054 1038304 1138449 1195552 1215289 1201757 1145976 1032355
9370 1032355 899913 778641 692783 664099 661368 679892 704371 743546 789429 823895 855109
$$ packed form
9455B04269k6075n894R15j2735k661R666j0596j4903j163J4116L6496K6129L3598
9442B51162M6444N1725N4093M8760J6427k1988m4651n3602n5877l1634o450O638
9430B61047K0836K3734L0665L5990J7045L7041K9343K5442L4874L4989J8209M260
9418E73475j1382L401j1370l0964l2193m8934l1873k6364j9106k8973l8466l1589
9406B65662k1798l973J1486K929Q827j337Q992K0246K4297K5638L5266K4584L7688
9393D38507L1029J2055P193J5406K2914j532k2101j6649M283M0862P8665R3243
9381G03875R0012P1350M0787M7030Q5250J00145N7103J9737j3532n5781j13621
9370A032355j32442j21272q5858k8684k731J8524K4479L9175M5883L4466L1214
$$ plain form
9359 855109 883960 872038 812094 764561 727613 710151 684553 652825 647319 678551 723006 752135
9347 752135 749541 714768 685514 688000 705674 760561 835036 940875 1040896 1093130 1095405 1056679
9335 1056679 1003186 985028 994389 1021974 1096615 1225829 1403846 1613773 1807569 1909827 1918233
9324 1918233 1919263 2008972 2158108 2330783 2477134 2597299 2711631 2850934 3029299 3252272
9314 3252272 3494370 3783171 4141280 4631850 5336941 6426926 8148700 10831350 14816570
9305 14816570 20031815 25310941 28783387 29867649 29425621 27876847 24908211 20755775
9297 20755775 16421430 12774346 10066941 8177796 6879168 6001426 5394042 4958711 4644801
9288 4644801 4384991 4115985 3868773 3700171 3621759 3589778 3630235 3757349 3974402 4288064
$$ packed form
9359H55109K8851j1922n9944m7533l6948j7462k5598l1728n506L1232M4455K9129
9347G52135k594l4773k9254K486J7674N4887P4475J05839J00021N2234K275l8726
9335A056679n3493j8158R361K7585P4641J29214J78017K09927J93796J02258Q406
9324A918233J030Q9709J49136J72675J46351J20165J14332J39303J78365K22973
9314C252272K42098K88801L58109M90570P05091J089985J721774K682650L985220
9305A4816570N215245N279126L472446J084262m42028j548774k968636m152436
9297B0755775m334345l647084k707405j889145j298628q77742o07384m35331l13910
9288D644801k59810k69006k47212j68602p8412l1981M0457J27114K17053L13662
$$ plain form
9278 4288064 4685250 5155364 5677456 6252342 6896355 7639904 8528497 9715195 11463628
9269 11463628 14078439 17895898 23142769 29698289 36652823 42520956 46148016 47803115
9261 47803115 48753221 50553163 54521168 60413885 65800485 67627106 64002493 55972348
9253 55972348 47139895 40608030 37297572 36483857 36803064 37166775 37364904 37751297 38433420
9244 38433420 39717571 42192554 44870176 44708966 40129902 33204781 26618851 21584891
9236 21584891 18033425 15561894 13875789 12826889 12338166 12320066 12697687 13420194 14402873
9227 14402873 15555502 16721509 17898382 19468957 22141570 26545066 32808619 40358593
9219 40358593 47323822 50930663 50504162 48275284 47145860 49034523 54888344 65145317
$$ packed form
9278D288064L97186M70114N22092N74886O44013P43549Q88593J186698J748433
9269A1463628K614811L817459N246871O555520O954534N868133L627060J655099
9261D7803115R50106J799942L968005N892717N386600J826621l624613q030145
9253E5972348q832453o531865l310458q13715L19207L63711J98129L86393O82123
9244C8433420J284151K474983K677622j61210m579064o925121o585930n033960
9236B1584891l551466k471531j686105j048900m88723j8100L77621P22507R82679
9227A4402873J152629J166007J176873J570575K672613M403496O263553P549974
9219D0358593O965229L606841m26501k228878j129424J888663N853821J0256973
$$ plain form
9211 65145317 78889576 92833529 102696002 106898014 106962603 105092487 102109149 97071806
9203 97071806 89722874 81563163 73617068 65632977 57648046 50142066 43540590 38084643
9195 38084643 34102567 31984096 32062183 34536087 39183437 44987843 49344503 48518605 42607609
9186 42607609 35047000 28545400 23626750 20045892 17552910 15887464 14806874 14219516
9178 14219516 14071099 14320120 15052874 16442988 18730080 22052202 26167778 30349676 34404431
9169 34404431 39250937 45067283 50368199 54070956 56688455 58808337 60893386 62833802
9161 62833802 64861844 68169034 72702174 76576926 77918724 75312604 68337449 59118974
9153 59118974 51183395 46793386 45677319 45443966 43713909 40750161 38383822 37318621
$$ packed form
9211F5145317J3744259J3943953R862473M202012O4589j870116k983338n037343
9203I7071806p348932q159711p946095p984091p984931p505980o601476n455947
9195C8084643l982076k118471P8087K473904M647350N804406M356660q25898n910996
9186D2607609p560609o501600m918650l580858k492982j665446j080590n87358
9178A4219516j48417K49021P32754J390114K287092L322122M115576M181898M054755
9169C4404431M846506N816346N300916L702757K617499K119882K085049J940416
9161F2833802K028042L307190M533140L874752J341798k606120o975155r218475
9153E9118974p935579m390009j116067k33353j730057k963748k366339j065201
$$ plain form
9145 37318621 37053564 37251533 37122730 35089606 31123815 26746255 23217455 20808054 19196619
9136 19196619 17850765 16365976 14626542 12823488 11190832 9833675 8767114 7950150
9128 7950150 7321440 6858880 6549860 6363914 6312063 6409740 6620689 6889097 7213991 7660446
9118 7660446 8339835 9430361 11174524 13986378 18400827 24801658 32683438 39800435
9110 39800435 43562788 44058594 42476151 38462646 31832907 24402761 18178668 13786919
9102 13786919 10876598 8937091 7602071 6639585 5892468 5309537 4817520 4357502 3932382
9093 3932382 3544606 3207676 2925041 2675703 2474415 2302950 2149426 2029439 1929211 1818238
9083 1818238 1713877 1628794 1546562 1458833 1389744 1327278 1275688 1227573 1181180 1150789 1118783
$$ packed form
9145C7318621k65057J97969j28803k033124l965791m377560l528800k409401j611435
9136A9196619j345854j484789j739434j803054j632656j357157j066561q16964
9128G950150o28710m62560l09020j85946n1851R7677K10949K68408L24894M46455
9118G660446O79389J090526J744163K811854M414449O400831P881780P116997
9110C9800435L762353M95806j582443m013505o629739p430146o224093m391749
9102A3786919k910321j939507j335020r62486p47117n82931m92017m60018m25120
9093C932382l87776l36930k82635k49338k01288j71465j53524j19987j00228j10973
9083A818238j04361q5083q2232q7729o9089o2466n1590m8115m6393l0391l2006
$$ plain form
9072 1118783 1109955 1130152 1178566 1239896 1270126 1255620 1207837 1132542 1047120 984705 959113 941015
9060 941015 930439 921230 903689 873946 840395 812932 805953 806441 823914 838029 862462 863325 853378
9047 853378 836691 811091 795389 779061 790304 810731 847600 882308 913935 936430 961065 961059
9035 961059 933325 902229 887464 874853 891452 922463 973095 1036547 1135755 1252105 1396781
9024 1396781 1547828 1674155 1731310 1713822 1664370 1580689 1444357 1268202 1125970 1007772
9014 1007772 917920 845940 803837 760363 713548 681378 654578 626030 611435 602056 596883 590267
9002 590267 586957 584267 595781 610513 621761 632350 662630 709506 750162 793766 864235 971081
8990 971081 1078210 1154341 1210505 1229907 1235132 1254836 1289215 1330177 1418670 1556952 1707492
$$ packed form
9072A118783q828K0197M8414O1330L0230j4506m7783p5295q5422o2415k5592j8098
9060I41015j0576r209j7541k9743l3551k7463o979M88J7473J4115K4433Q63r947
9047H53378j6687k5600j5702j6328J1243K0427L6869L4708L1627K2495K4635o
9035I61059k7734l1096j4765j2611J6599L1011N0632O3452R9208J16350J44676
9024A396781J51047J26327N7155j7488m9452q3681j36332j76155j42232j18198
9014A007772q9852p1980m2103m3474m6815l2170k6800k8548j4595r379n173o616
9002E90267l310k690J1514J4732J1248J0589L0280M6876M0656M3604P0469J06846
8990I71081J07129P6131N6164J9402N225J9704L4379M0962Q8493J38282J50540
$$ plain form
8979 1707492 1848098 1964490 2027216 2067428 2118442 2153507 2139109 2073775 1959424 1826142 1699827
8968 1699827 1586429 1438943 1274258 1109903 966549 866277 796562 768732 740870 713295
8958 713295 683740 661824 637913 637060 636996 623120 621138 623576 629687 652872 694891 729968 758208
8945 758208 786665 820179 862491 901848 939078 976719 1025373 1095003 1199432 1301814 1415481
8934 1415481 1556577 1710840 1832870 1914873 1984726 2107904 2247339 2339884 2351724 2324952
8924 2324952 2284971 2204490 2055831 1863090 1701177 1583369 1495199 1455317 1467610 1531414 1648680
8913 1648680 1792409 1946952 2136938 2357940 2611448 2978066 3536844 4391109 5723107
8904 5723107 7779922 10857317 15045569 19766844 23303217 23704652 20820978 16403353
$$ packed form
8979A707492J40606J16392O2726M0212N1014L5065j4398o5334j14351j33282j26315
8968A699827j13398j47486j64685j64355j43354j00272o9715k7830k7862k7575
8958G13295k9555k1916k3911q53o4j3876j982K438O111K3185M2019L5077K8240
8945G58208K8457L3514M2312L9357L7230L7641M8654O9630J04429J02382J13667
8934A415481J41096J54263J22030Q2003O9853J23178J39435R2545J1840k6772
8924B324952l9981q0481j48659j92741j61913j17808q8170l9882J2293O3804J17266
8913A648680J43729J54543J89986K21002K53508L66618N58778Q54265J331998
8904E723107K056815L077395M188252M721275L536373M01435k883674m417625
$$ plain form
8896 16403353 12306350 9310195 7323951 6006676 5123367 4527814 4117843 3839727 3643717
8887 3643717 3515876 3423240 3371974 3373128 3421039 3511100 3608328 3689844 3746951 3822124 3936398
8876 3936398 4090229 4335582 4697456 5272531 6122822 7202613 8284007 9145415 9760824
8867 9760824 10348271 11149491 12221746 13473143 14943895 16982811 20015028 24361517 30129477
8858 30129477 37188344 45060116 52972393 59944851 64823256 66740016 65544290 61191357
8850 61191357 53744076 44810951 36947413 31643657 28635465 26673846 24716494 22470116
8842 22470116 20115372 17829667 15638538 13647303 12021050 10829182 10035577 9551928
8834 9551928 9299073 9254757 9382451 9665538 10162638 10993068 12146462 13487174 14931997
$$ packed form
8896A6403353m097003k996155j986244j317275q83309n95553m09971k78116j96010
8887C643717j27841r2636n1266J154M7911R0061R7228Q1516N7107P5173J14274
8876C936398J53831K45353L61874N75075Q50291J079791J081394Q61408O15409
8867I760824N87447Q01220J072255J251397J470752K038916L032217M346489N767960
8858C0129477P058867P871772P912277O972458M878405J916760j195726m352933
8850F1191357p447281q933125p863538n303756l008192j961619j957352k246378
8842B2470116k354744k285705k191129j991235j626253j191868p93605m83649
8834I551928k52855m4316J27694K83087M97100Q30430J153394J340712J444823
$$ plain form
8825 14931997 16597332 18803565 21632803 24513474 26707417 28093059 29270755 31213868
8817 31213868 34354607 38517229 43439027 49249213 56412298 64840310 73688273 81577284
8809 81577284 86891111 89041603 89180803 89061264 89511336 89668082 87696876 82921118 77203220
8800 77203220 72543691 68158271 61895588 53863538 46217485 40197366 35495139 31190797
8792 31190797 26758074 22650279 19474741 17314854 15896456 14969849 14398219 14123249 14135481
8783 14135481 14471836 15110011 16032559 17209674 18657202 20505160 22916467 25822845 28647389
8774 28647389 30580225 31599143 32754145 35030174 38437109 42332810 46303875 50627442
8766 50627442 55552223 60613400 65164322 69167599 73031177 77169527 81776782 86672542
$$ packed form
8825A4931997J665335K206233K829238K880671K193943J385642J177696J943113
8817C1213868L140739M162622M921798N810186P163085Q428012Q847963P889011
8809H1577284N313827K150492J39200j19539M50072J56746j971206m775758n717898
8800G7203220m659529m385420o262683q032050p646053o020119m702227m304342
8792C1190797m432723m107795l175538k159887j418398r26607n71630k74970J2232
8783A4135481L36355O38175R22548J177115J447528J847958K411307K906378K824544
8774B8647389J932836J018918J155002K276029L406935L895701L971065M323567
8766E0627442M924781N061177M550922M003277L863578M138350M607255M895760
$$ plain form
8758 86672542 90694715 92824228 92762126 90344822 85373209 77780322 67974047 57556288
8750 57556288 48666375 42207679 37371633 32911630 28200845 23586130 19627981 16628164
8742 16628164 14494962 12975162 11852635 10992165 10297159 9784547 9474561 9437527 9662254
8733 9662254 10163164 10986805 12114225 13328208 14175804 14587985 14965416 15610137 16409738
8724 16409738 17164631 18048556 19484720 21705774 24478554 27391680 30260116 33542802
8716 33542802 38120201 44376492 51403552 57233668 60253867 60589444 58727250 54459900
8708 54459900 47774234 39997644 32927172 27581552 23863103 20974804 18175526 15360621
8700 15360621 12861224 10869229 9300914 8028018 6989320 6122163 5428676 4890033 4464681
$$ packed form
8758H6672542M022173K129513o2102k417304m971613p592887r806275j0417759
8750E7556288q889913o458696m836046m460003m710785m614715l958149k999817
8742A6628164k133202j519800j122527q60470o95006n12612l09986l7034K24727
8733I662254N00910Q23641J127420J213983Q47596M12181L77431O44721P99601
8724A6409738P54893Q83925J436164K221054K772780K913126K868436L282686
8716C3542802M577399O256291P027060N830116L020199L35577j862194m267350
8708E4459900o685666p776590p070472n345620l718449k888299k799278k814905
8700A5360621k499397j991995j568315j272896j038698q67157o93487n38643m25352
$$ plain form
8691 4464681 4123495 3838151 3602188 3389653 3230371 3101313 2994712 2926261 2876295 2859078
8681 2859078 2881468 2941563 3043169 3170765 3348268 3595901 3933140 4447968 5245462 6494985
8671 6494985 8396489 11142817 14696976 18458158 21205723 21617137 19498354 15903017
8663 15903017 12185201 9163793 7009235 5550024 4542312 3826820 3313566 2934440 2646565
8654 2646565 2389919 2159803 1963847 1783165 1630505 1504134 1411381 1330745 1258468 1202864
8644 1202864 1153956 1109379 1064707 1018068 973418 938502 906378 876060 838505 810211 786959
8633 786959 771203 747095 725905 714867 689190 665002 647347 610044 582141 569455 565973 559580
8621 559580 552219 548620 533117 519561 500276 485225 477507 465281 461605 456524 457949 454043 437771
$$ packed form
8691D464681l41186k85344k35963k12535j59282j29058j06601o8451m9966j7217
8681B859078K2390O0095J01606J27596J77503K47633L37239N14828P97494J249523
8671F494985J901504K746328L554159L761182K747565M11414k118783l595337
8663A5903017l717816l021408k154558j459211j007712p15492n13254l79126k87875
8654B646565k56646k30116j95956j80682j52660j26371r2753q0636p2277n5604
8644A202864m8908m4577m4672m6639m4650l4916l2124l0318l7555k8294k3252
8633G86959j5756k4108k1190j1038k5677k4188j7655l7303k7903j2686l482o393
8621E59580p361l599j5503j3556j9285j5051p718j2226l676n081J425l906j6272
$$ plain form
8608 437771 438820 453763 473723 469744 465289 470939 487894 513149 526022 524641 525957 512963 510918
8595 510918 510034 507425 506714 507180 493570 484167 478297 479968 474709 465330 445943 429191 407210 397644
8581 397644 387486 367190 348815 328229 312049 311134 320683 322509 317474 307496 287303 281319 285507
8568 285507 275775 281531 286311 284597 276778 281389 279571 294091 308573 331458 334310 342693 341177 339366
8554 339366 338489 329831 330623 353377 366666 402545 439401 490573 580627 712888 845219 969620
8542 969620 1022305 1030445 1042662 1120178 1252689 1383826 1443022 1389483 1291341 1205508 1125426
8531 1125426 1037000 917435 778362 648507 537262 469774 438319 410931 362736 329483 306422
8520 306422 294459 279908 271337 261794 252632 263325 267673 266381 287362 312406 335112 352013 363134
$$ packed form
8608D37771J049J4943J9960l979m455N650J6955K5255J2873j381J316j2994k045
8595E10918q84k609p11M66j3610r403n870J671n259r379j9387j6752k1981r566
8581C97644j0158k0296j8375k0586j6180r15R549J826n035r978k0193n984M188
8568B85507r732N756M780j714p819M611j818J4520J4482K2885K852Q383j516j811
8554C39366q77q658P92K2754J3289L5879L6856N1172R0054J32261J32331J24401
8542I69620N2685Q140J2217P7516J32511J31137N9196n3539r8142q5833q0082
8531A125426q8426j19565j39073j29855j11245o7488l1455k7388m8195l3253k3061
8520C06422j1963j4551q571r543r162J0693M348j292K0981K5044K2706J6901J1121
$$ plain form
8507 363134 365295 377841 397725 422796 449332 483209 540432 632430 780809 1010774 1332699
8496 1332699 1667275 1930803 2075785 2060910 1928201 1765914 1603425 1436930 1281643 1136757
8486 1136757 996069 866608 763460 687839 632958 586822 550032 512133 476581 440400 403581
8475 403581 370828 340589 321785 316478 309999 324883 338468 347148 358207 367168 360910 364411 377566
8462 377566 393423 399311 415646 441302 488091 560984 641470 691014 716007 705606 670511 649564
8450 649564 651109 680698 752923 811310 803345 739715 634848 528753 453917 431957 426602 418987
8438 418987 432791 463303 462860 427189 374738 341548 317256 298024 289278 289954 293598 288994 278248
8425 278248 281926 284489 307249 333789 358520 378639 392502 397732 416783 416269 412717 425624 447265
$$ packed form
8507C63134K161J2546J9884K5071K6536L3877N7223R1998J48379K29965L21925
8496A332699L34576K63528J44982j4875j32709j62287j62489j66495j55287j44886
8486A136757j40688j29461j03148p5621n4881m6136l6790l7899l5552l6181l6819
8475D03581l2753l0239j8804n307o479J4884J3585Q680J1059Q961o258L501J3155
8462C77566J5857N888J6335K5656M6789P2893Q0486M9544K4993j0401l5095k0947
8450F49564J545K9589P2225N8387p965o3630j04867j06095p4836k1960n355p615
8438D18987J3804L0512m43l5671n2451l3190k4292j9232q746O76L644m604j0746
8425B78248L678K563K2760K6540K4731K0119J3863N230J9051n14l552J2907K1641
$$ plain form
8412 447265 485084 513430 545846 563369 575129 590469 613168 617194 587572 562488 556280 550201
8400 550201 520527 492401 468166 454095 429495 405324 369461 335172 297449 267041 238829 226434
8388 226434 235276 250287 252901 250907 262556 269996 272455 278892 293012 304939 323909 337279 361597
8375 361597 377865 392989 417866 447163 461744 465347 462706 462655 475914 501135 528570 575848 604997
8362 604997 639908 689308 726664 746659 758839 754695 738417 706055 674840 640094 606052 557143
8350 557143 513846 476179 430486 376113 324953 289270 278299 289338 305282 304093 303070 305951
8338 305951 305090 305154 309479 288660 278769 268883 251539 248763 241629 243726 267978 290556 313234 340544
8324 340544 355496 353236 344783 336312 328504 348174 384735 429316 486306 535555 565107 560261 541581
$$ packed form
8412D47265L7819K8346L2416J7523J1760J5340K2699M026k9622k5084o208o079
8400E50201k9674k8126k4235j4071k4600k4171l5863l4289l7723l0408k8212j2395
8388B26434Q842J5011K614j994J1649P440K459O437J4120J1927J8970J3370K4318
8375C61597J6268J5124K4877K9297J4581L603k641n1J3259K5221K7435M7278K9149
8362F04997L4911M9400L7356J9995J2180m144j6278l2362l1215l4746l4042m8909
8350E57143m3297l7667m5693n4373n1160l5683j0971J1039J5944j189j023K881
8338C05951q61O4M325k0819r891r886j7344k776p134K097K4252K2578K2678K7310
8324C40544J4952k260q453q471p808J9670L6561M4581N6990M9249K9552m846j8680
$$ plain form
8311 541581 510433 470449 419711 391774 374179 355135 341813 330930 314679 324541 324934 329335
8299 329335 337515 349397 348579 350695 350842 344980 316877 301769 295898 302530 313123 310495 323998 357685
8285 357685 399892 469400 568977 679985 782214 819381 816716 778050 712953 652084 601222
8274 601222 571755 536386 514967 478717 422449 363505 309027 267076 228325 207394 201957 202040
8262 202040 231106 257685 251215 247791 254154 246807 255816 270076 284612 311667 342431 356077 370319
8249 370319 390178 392790 395588 398213 404666 405850 420016 442748 468286 502032 548869 629231 742141
8236 742141 918260 1130384 1297734 1339193 1245777 1107027 983432 920098 885053 825427 747833
8225 747833 647581 542730 463350 419968 402103 391772 404800 405605 419087 436929 456080 453943
$$ packed form
8311E41581l1148l9984n0738k7937j7595j9044j3322j0883j6251R862L93M401
8299C29335Q180J1882q18K116J47n862k8103j5108n871O632J0593k628J3503L3687
8285C57685M2207O9508R9577J11008J02229L7167k665l8666o5097o0869n0862
8274F01222k9467l5369k1419l6250n6268n8944n4478m1951l8751k0931n437Q3
8262B02040K9066K6579o470l424O363p347R009J4260J4536K7055L0764J3646J4242
8249C70319J9859K612K798K625O453J184J4166K2732K5538L3746M6837Q0362J12910
8236G42141J76119K12124J67350M1459r3416j38750j23595o3334l5045n9626p7594
8225G47833j00252j04851p9380m3382j7865j0331J3028Q05J3482J7842J9151k137
$$ plain form
8213 453943 461513 502635 554402 609708 665319 729439 794156 873900 971893 1085224 1229797
8202 1229797 1436834 1718750 2105184 2629982 3278188 3959671 4577813 4956524 4942419 4570585
8192 4570585 4015716 3415803 2936187 2651444 2514106 2431681 2353207 2268907 2178750 2101802
8182 2101802 2049573 2030315 2060769 2110268 2183767 2306117 2481091 2666164 2876035 3136171
8172 3136171 3441413 3809472 4247029 4778329 5406814 6117540 6900390 7771417 8700423 9690794
8162 9690794 10784881 12086842 13792617 16111013 19303187 23684477 29843440 38860454
8154 38860454 52508778 73005303 101973856 138000828 176200405 212242404 242417349
8147 242417349 257401583 249626410 224111822 188450976 147681133 109445883 80149933
$$ packed form
8213D53943P570M1122N1767N5306N5611O4120O4717P9744R7993J13331J44573
8202A229797K07037K81916L86434N24798O48206O81483O18142L78711j4105l71834
8192D570585n54869n99913m79616k84743j37338q2425p8474q4300r0157p6948
8182B101802n2229j9258L0454M9499P3499J22350J74974J85073K09871K60136
8172C136171L05242L68059M37557N31300O28485P10726P82850Q71027R29006R90371
8162I690794J094087J301961J705775K318396L192174M381290O158963R017014
8154C8860454J3648324K0496525K8968553L6026972L8199577L6041999L0174945
8147B42417349J4984234p775173k5514588l5660846m0769843l8235250k9295950
$$ plain form
8140 80149933 60421944 47457991 38618270 32299600 27616377 24014884 21219737 19050731
8132 19050731 17335073 15971510 14890032 14065812 13468661 13043455 12777494 12683331 12782735
8123 12782735 13104944 13698103 14539166 15588267 16804450 18079914 19370024 20776707 22461136
8114 22461136 24577096 27298597 30927073 35939292 43070996 53608603 69771305 95277762
8106 95277762 135976716 198555470 283581046 378937125 463734191 506042122 486341258
8099 486341258 417204150 325583825 238460348 171450396 126168202 96675401 76888267
8092 76888267 62996931 52921740 45401221 39579176 34918700 31057627 27813785 25119685
8084 25119685 22845993 20803455 18889080 17223781 15897208 14897126 14158460 13649186
$$ packed form
8140H0149933j9727989j2963953q839721o318670m683223l601493k795147k169006
8132A9050731j715658j363563j081478q24220n97151m25206k65961r4163R9404
8123A2782735L22209N93159Q41063J049101J216183J275464J290110J406683J684429
8114B2461136K115960K721501L628476N012219P131704J0537607J6162702K5506457
8106I5277762M0698954O2578754Q5025576R5356079Q4797066M2307931j9700864
8099D86341258o9137108r1620325q7123477o7009952m5282194k9492801j9787134
8092G6888267j3891336j0075191p520519n822045m660476l861073l243842k694100
8084B5119685k273692k042538j914375j665299j326573j000082p38666n09274
$$ plain form
8076 13649186 13340147 13205790 13198800 13286726 13456071 13713538 14103327 14721346 15636624 16899144
8066 16899144 18673791 21224662 24977639 30748933 39780328 53680782 73893835 99855852
8058 99855852 127542670 152680685 173685059 185600830 180782417 162989443 143086093
8051 143086093 122596861 98377207 73902811 54443718 41150840 32381795 26415712
8044 26415712 22147222 18909069 16346027 14294559 12638647 11267096 10102632 9104980
8036 9104980 8248867 7505171 6873760 6322161 5852925 5424697 5046764 4738346 4469601 4229945
8026 4229945 4033591 3861995 3690240 3514506 3360781 3186649 3011016 2847477 2671764 2503868
8016 2503868 2364619 2248792 2141247 2071811 2029669 2004941 1959393 1911032 1855596 1784521 1702774
$$ packed form
8076A3649186l09039j34357o990Q7926J69345K57467L89789O18019R15278J262520
8066A6899144J774647K550871L752977N771294R031395J3900454K0213053K5962017
8058I9855852K7686818K5138015K1004374J1915771m818413j7792974j9903350
8051A43086093k0489232k4219654k4474396j9459093j3292878q769045n966083
8044B6415712m268490l238153k563042k051468j655912j371551j164464r97652
8036I104980q56113p43696o31411n51599m69236m28228l77933l08418k68745k39656
8026D229945j96354j71596j71755j75734j53725j74132j75633j63539j75713j67896
8016B503868j39249j15827j07545o9436m2142k4728m5548m8361n5436p1075q1747
$$ plain form
8005 1702774 1637977 1593809 1550449 1518438 1467069 1416565 1394068 1378488 1362771 1340677 1316497
7994 1316497 1306453 1307656 1304496 1303157 1287756 1268947 1237852 1206340 1197191 1201413 1192241 1173645 1171649
7981 1171649 1170706 1181536 1201674 1215633 1212943 1197057 1162992 1121729 1063505 980808 913544 852851
7969 852851 801213 752340 732061 727031 712750 685641 679125 673783 660252 647473 643134 648967 638288
7956 638288 630996 628441 624064 605565 592256 593460 614338 622009 631252 633160 624764 632433 625224 612928
7942 612928 603096 585859 582583 593827 595983 590144 598712 606043 600938 590531 589481 583488 571122
7929 571122 556074 538199 539488 531651 504674 485395 465666 451694 451185 429271 412666 399009
7917 399009 397087 398506 412708 413148 402267 386739 370687 358659 341770 323442 306237 288964
$$ packed form
8005A702774o4797m4168m3360l2011n1369n0504k2497j5580j5717k2094k4180
7994A316497j0044J203l160j339j5401j8809l1095l1512r149M222r172j8596j996
7981A171649r43J0830K0138J3959k690j5886l4065m1263n8224q2697o7264o0693
7969H52851n1638m8873k0279n030j4281k7109o516n342j3531j2779m339N833j0679
7956F38288p292k555m377j8499j3309J204K0878P671R243J908q396P669p209j2296
7942F12928r832j7237l276J1244K156n839Q568P331n105j0407j050n993j2366
7929E71122j5048j7875J289p837k6977j9279j9729j3972n09k1914j6605j3657
7917C99009j922J419J4202M40j0881j5528j6052j2028j6889j8328j7205j7273
$$ plain form
7905 288964 292175 298584 308329 330454 340503 363362 383339 386484 407156 441324 461420 456172 432786
7892 432786 418204 400118 386377 375645 369923 364747 348495 354115 349929 342106 333032 318555 307614
7879 307614 307767 302602 316102 326877 328554 318643 318212 333160 331610 326437 315330 311160 305342 311581
7865 311581 304452 292166 287023 274712 249469 248234 250527 243588 237842 236471 235183 231747 249671
7852 249671 277514 299317 318955 335821 337347 326218 314665 307895 290618 269940 266102 262872
7840 262872 262159 258322 252927 262679 258452 248779 248066 239627 247462 249122 249641 250984 242746 241634 234398
7825 234398 240627 235859 224880 217624 213722 210673 213296 233970 244633 230857 222993 229612 235478
7812 235478 228696 212548 207788 212792 210410 207494 215020 228042 226357 239273 243240 245545 238026 223544
$$ packed form
7905B88964L211O409R745K2125J0049K2859J9977L145K0672L4168K0096n248k3386
7892D32786j4582j8086j3741j0732n722n176j6252N620m186p823r074j4477j0941
7879C07614J53n165J3500J0775J677r911m31J4948j550n173j1107m170n818O239
7865C11581p129j2286n143j2311k5243j235K293o939n746j371j288l436J7924
7852B49671K7843K1803J9638J6866J526j1129j1553o770j7277k0678l838l230
7840B62872p13l837n395R752m227r673p13q439P835J660N19J343q238j112p236
7825B34398O229m768j0979p256l902l049K623K0674J0663j3776p864O619N866
7812B35478o782j6148m760N004k382k916P526J3022j685J2916L967K305p519j4482
$$ plain form
7798 223544 215818 219780 209328 215981 218208 217687 212723 212967 218670 214759 205946 207002 206168 203048 195477
7783 195477 181189 195873 200066 197243 205148 204744 198892 187011 178881 173356 191880 207777 218467
7770 218467 214725 203268 193951 193485 202053 203793 201673 219483 222952 236968 252137 257787 294880
7757 294880 348201 404668 492759 639343 828924 1087724 1370454 1596483 1675719 1577617 1335628
7746 1335628 1049809 810176 625446 518214 427646 363170 325973 291739 271313 260213 242887
7735 242887 219726 216421 204938 203739 193761 194042 198720 189562 194396 185989 179859 180225 192572 201559
7721 201559 202130 210574 231003 230439 228822 245527 271110 297678 337341 376802 436484 518223 644374
7708 644374 847476 1159496 1613869 2201893 2813588 3171165 3025692 2453215 1809755 1302295
$$ packed form
7798B23544p726L962j0452O653K227n21m964K44N703l911q813J056q34l120p571
7783A95477j4288J4684M193k823P905m04n852j1881q130n525J8524J5897J0690
7770B18467l742j1457r317m66Q568J740k120J7810L469J4016J5169N650L7093
7757B94880N3321N6467Q8091J46584J89581K58800K82730K26029P9236r8102k41989
7746A335628k85819k39633j84730j07232r0568o4476l7197l4234k0426j1100j7326
7735B42887k3161l305j1483j199r978K81M678r158M834q407o130L66J2347Q987
7721B01559N71Q444K0429n64j617J6705K5583K6568L9663L9461N9682Q1739J26151
7708F44374K03102L12020M54373N88024O11695L57577j45473n72477o43460n07460
$$ plain form
7698 1302295 960518 742957 597382 502720 441017 398978 365341 347051 320416 285732 267979
7687 267979 250522 233872 224025 223331 208810 209747 198395 196055 195356 182063 166608 165409 176613
7674 176613 182166 188236 185657 193817 200939 205290 213348 222338 232149 259807 310655 370944 472914
7661 472914 620016 823495 1062473 1261760 1354110 1291617 1132296 918797 720487 559915
7651 559915 435244 349461 298836 261791 235527 216543 215287 207695 184725 168540 153087 151566
7639 151566 163959 160750 144691 130190 121081 125502 141870 128112 116132 103472 98562 103694 105382
7626 105382 101646 102357 113267 114233 100069 93154 89802 89483 97520 99878 110974 111036 101703 102914 103005
7611 103005 100622 103912 84443 78639 76770 78372 92854 96095 98107 95137 97896 106451 109869 97459
$$ packed form
7698A302295l41777k17561j45575r4662o1703m2039l3637j8290k6635l4684j7753
7687B67979j7457j6650r847o94j4521R37j1352k340o99j3293j5455j199J1204
7674A76613N553O070k579Q160P122M351Q058Q990R811K7658N0848O0289J01970
7661D72914J47102K03479K38978J99287R2350o2493j59321k13499j98310j60572
7651E59915j24671q5783n0625l7045k6264j8984j256p592k2970j6185j5453j521
7639A51566J2393l209j6059j4501r109M421J6368j3758j1980j2660m910N132J688
7626A05382l736P11J0910R66j4164o915l352l19Q037K358J1096O2r333J211R1
7611A03005k383L290j9469n804j869J602J4482L241K012k970K759Q555L418j2410
$$ plain form
7597 97459 94084 89632 88062 70669 64369 72653 82404 87007 81875 71719 74795 63078 59324 51297
7583 51297 61877 74367 77107 88973 86902 72550 74934 82403 73322 63780 66687 81318 86376
7570 86376 88761 80324 71345 72868 69445 67145 78631 79774 73395 62039 70507 73648 71891 74101
7556 74101 76652 80154 78766 74141 67772 57973 67089 77742 84967 84575 81311 67184 56473 60303
7542 60303 66939 55967 69314 75184 72020 69264 80018 74416 74895 62295 56827 58763 61571 48576
7528 48576 49365 52674 54209 53021 57066 59709 62038 68435 67286 59615 64836 59044 51091 53564 60283
7513 60283 81616 88510 85617 77122 85500 82696 84755 74616 55010 48307 56521 76045 81013 72410
7499 72410 77496 86155 89711 89912 79564 74280 81649 87039 70862 66744 62729 62564 62543 52812 45910
$$ packed form
7597I7459l375m452j570j7393o300Q284R751M603n132j0156L076j1717l754q027
7583E1297J0580J2490K740J1866k071j4352K384P469r081r542K907J4631N058
7570H6376K385q437q979J523l423k300J1486J143o379j1356Q468L141j757K210
7556G4101K551L502j388m625o369r799R116J0653P225l92l264j4127j0711L830
7542F0303O636j0972J3347N870l164k756J0754n602M79j2600n468J936K808j2995
7528D8576P89L309J535j188M045K643K329O397j149p671N221n792p953K473O719
7513F0283K1333O894k893q495Q378k804K059j0139j9606o703Q214J9524M968q603
7499G2410N086Q659L556K01j0348n284P369N390j6177m118m015j65k1r731o902
$$ plain form
7484 45910 58377 68900 61406 60702 49013 36160 36734 46865 45359 57441 57927 43601 61773
7471 61773 76566 84201 83601 74368 58156 45297 39898 35470 41053 61827 60294 38678 30051 37015
7457 37015 41359 47503 31753 21606 35854 40574 44352 53817 67254 81817 71334 56978 59182
7444 59182 63535 69361 70903 66627 53319 53036 61395 67130 57066 64791 77341 78351 77051 64061
7430 64061 49189 39741 38879 40886 42321 51036 51969 57307 61980 60300 53276 36872 27739 23521 22705
7415 22705 30891 38281 51402 70269 64554 61386 61730 43289 34947 32672 45161 57256 57863 70933
7401 70933 75316 58377 38684 36747 45750 54631 56031 59796 54154 40604 40131 38149 47909 55785
7387 55785 51671 43202 46227 52295 38152 29303 22025 18375 25143 19772 37806 45922 47697 53092
$$ packed form
7484D5910J2467J0523p494p04j1689j2853N74J0131j506J2082M86j4326J8172
7471F1773J4793P635o00r233j6212j2859n399m428N583K0774j533k1616q627O964
7457C7015M344O144j5750j0147J4248M720L778R465J3437J4563j0483j4356K204
7444E9182M353N826J542m276j3308k83Q359N735j0064P725J2550J010j300j2990
7430F4061j4872r448q62K007J435Q715R33N338M673j680p024j6404r133m218q16
7415B2705Q186P390J3121J8867n715l168L44j8441q342k275J2489J2095O07J3070
7401G0933M383j6939j9693j937R003Q881J400L765n642j3550m73j982R760P876
7387E5785m114q469L025O068j4143q849p278l650O768n371J8034Q116J775N395
$$ plain form
7373 53092 53024 52010 43496 32791 32624 30940 19380 10505 7392 13871 22088 26530 24228 27381 26659
7358 26659 33199 47473 40822 41973 48132 57581 63337 71697 58455 51348 38802 41638 41474 47835
7344 47835 44918 43958 40804 28966 21082 30012 43885 46072 44473 39345 24698 25581 43573 54292
7330 54292 62565 75472 64940 55885 60536 66295 72802 75259 63746 52666 42689 34247 52255
7317 52255 45028 47654 64931 68575 66550 53517 41516 41553 39212 38401 41222 46632 37410 25130
7303 25130 30259 38947 30822 20060 32092 43138 43843 35248 31622 35021 43069 51071 58227 66160
7289 66160 74617 74050 60237 46475 25487 29002 36185 32420 27558 33371 48565 77842 90449
7276 90449 97845 106024 100109 77684 84235 86280 95858 89710 62043 39449 41937 45386 50464 57670
$$ packed form
7373E3092o8j014q514j0705j67j684j1560q875l113O479Q217M442k302L153p22
7358B6659O540J4274o651J151O159R449N756Q360j3242p107j2546K836j64O361
7344D7835k917r60l154j1838p884Q930J3873K187j599n128j4647Q83J7992J0719
7330E4292Q273J2907j0532r055M651N759O507K457j1513j1080r977q442J8008
7317E2255p227K626J7277L644k025j3033j2001L7k341q11K821N410r222j2280
7303B5130N129Q688q125j0762J2032J1046P05q595l626L399Q048Q002P156P933
7289F6160Q457n67j3813j3762k0988L515P183l765m862N813J5194K9277J2607
7276I0449P396Q179n915k2425O551K045R578o148k7667k2594K488L449N078P206
$$ plain form
7262 57670 58890 52639 41719 46572 44218 45923 23869 2793 -10924 -4476 21867 22927 23056 35104
7248 35104 18970 30345 40575 32046 39599 54122 56617 51876 51578 34194 24969 22995 19024 18169
7234 18169 25103 23420 18386 18650 23120 7977 19213 12083 1705 1243 9017 12435 12739 34225
7220 34225 39126 34133 39684 47617 51556 47366 51322 45846 31515 16096 17310 22716 38386 42875
7206 42875 35368 38004 36576 31276 32578 28224 27822 24410 13997 22173 16344 21480 25725 15119
7192 15119 -1538 7715 15365 22450 31347 30206 35285 31028 26453 21502 13989 21659 34443 24996
7178 24996 16635 19429 33026 32207 35958 39036 37473 25920 28003 34526 28775 20351 15951 15077 25199
7163 25199 24959 16722 11282 20023 28820 34911 42279 35219 21998 4995 -2146 10876 14359 25562
$$ packed form
7262E7670J220o251j0920M853k354J705k2054k1076j3717O448K6343J060J29J2048
7248C5104j6134J1375J0230q529P553J4523K495m741k98j7384r225j974l971q55
7234A8169O934j683n034K64M470j5143J1236p130j0378m62P774L418L04K1486
7220C4225M901m993N551P933L939m190L956n476j4331j5419J214N406J5670M489
7206D2875p507K636j428n300J302m354m02l412j0413Q176n829N136M245j0606
7192A5119j6657R253P650P085Q897j141N079m257m575m951p513P670J2784r447
7178B4996q361K794J3597q19L751L078j563j1553K083O523n751q424m400q74J0122
7163B5199k40q237n440Q741Q797O091P368p060j3221j7003p141J3022L483J1203
$$ plain form
7149 25562 27457 20130 19470 21279 22265 12089 22795 25089 25049 24503 13582 -6204 2716 28550 45158
7134 45158 44521 39941 55667 63149 51345 36833 22240 30075 40441 37836 33602 43106 42334 47781
7120 47781 49844 33964 4706 -3102 12830 28356 26236 19784 10573 16676 19010 17127 12288 26298
7106 26298 32516 17896 8774 16015 21900 40653 60084 65537 47405 37134 30677 31350 22858 27786
7092 27786 20488 25265 20083 19620 20636 33695 30371 26224 44414 60905 50283 37080 26984
7079 26984 25205 27273 30896 27817 12900 7665 -178 5242 29148 33306 28906 29163 30619 31989
7065 31989 31559 40306 48716 48304 44971 29319 39461 44841 36901 40392 47182 44784 35643 19506
7051 19506 23277 38190 44804 55160 48416 48356 57738 71585 64354 66167 54781 43068 39953 33302
$$ packed form
7149B5562J895p327o60J809R86j0176J0706K294m0n46j0921j9786Q920K5834J6608
7134D5158o37m580J5726P482j1804j4512j4593P835J0366k605m234R504p72N447
7120D7781K063j5880k9258p808J5932J5526k120o452r211O103K334j883m839J4010
7106B6298O218j4620r122P241N885J8753J9431N453j8132j0271o457O73q492M928
7092B7786p298M777n182m63J016J3059l324m147J8190J6491j0622j3203j0096
7079B6984j779K068L623l079j4917n235p843N420K3906M158m400K57J456J370
7065C1989m30Q747Q410m12l333j5652J0142N380p940L491O790k398r141j6137
7051A9506L771J4913O614J0356o744o0R382J3847p231J813j1386j1713l115o651
$$ plain form
7037 33302 27327 20722 16534 8230 9789 16275 20750 29332 22215 22737 26396 24215 9752 10253 23250
7022 23250 29955 14747 8490 12331 14609 24397 24325 17752 20145 14270 11195 24579 30713 20052
7008 20052 18306 18711 28862 35841 35388 30608 28098 32729 34141 43978 42345 55369 64614 52813
6994 52813 21781 20541 34221 34495 25899 20867 17308 16327 19254 32597 41905 45596 39023 34153
6980 34153 32794 29846 22231 19453 23040 26089 28447 31992 30050 8687 2231 4463 9613 22020
6966 22020 27601 39653 54192 50148 42010 32163 37031 35432 35118 29916 28545 21490 5744 4277
6952 4277 12312 14793 17598 28364 38134 44020 53998 39497 31660 34686 43405 39726 31574 21055
6938 21055 15826 31121 34809 34002 25289 8953 2988 3178 19286 28320 23085 19063 17133 15690
$$ packed form
7037C3302n975o605m188q304J559O486M475Q582p117N22L659k181j4463N01J2997
7022B3250O705j5208o257L841K278R788p2o573K393n875l075J3384O134j0661
7008B0052j746M05J0151O979m53m780k510M631J412R837j633J3024R245j1801
6994E2813l1032j240J3680K74q596n032l559r81K927J3343R308L691o573m870
6980C4153j359k948p615k778L587L049K358L545j942k1363o456K232N150J2407
6966B2020N581J2052J4539m044q138r847M868j599l14n202j371p055j5746j467
6952D277Q035K481K805J0766R770N886R978j4501p837L026Q719l679q152j0519
6938B1055n229J5295L688q07q713j6336n965J90J6108R034n235m022j930j443
$$ plain form
6924 15690 14908 10762 6444 3158 13932 29741 39763 43644 30628 9614 -4835 -9465 -6258
6911 -6258 -5724 139 5831 7740 3187 5262 17896 11382 13188 27094 33680 28299 25940 33670 25860
6896 25860 20626 18619 15305 16970 27142 23335 19165 24304 28549 27069 31359 32260 36294 43042 23897
6881 23897 10197 3477 7861 10585 30968 50688 53709 48140 36046 23955 26841 18050 14851
6868 14851 11586 3786 12923 31034 34207 32761 32665 28724 35416 24746 23075 15774 10387 15634 13001
6853 13001 18637 7136 9285 -1684 -8331 -2374 9267 20178 13207 17021 29884 30005 27076 18437
6839 18437 20975 34761 36328 26408 7659 -2252 -6788 -13770 -2153 2019 -3111 2047 7703 13343
6825 13343 19199 32258 43775 34358 20975 28951 39375 39387 28157 23567 13001 8307 6907 10612
$$ packed form
6924A5690p82m146m318l286J0774J5809J0022L881j3016k1014j4449m630L207
6911f258N34N863N692J909m553K075J2634o514J806J3906O586n381k359P730p810
6896B5860n234k007l314J665J0172l807m170N139M245j480M290R01M034O748j9145
6881B3897j3700o720M384K724K0383J9720L021n569j2094j2091K886q791l199
6868A4851l265p800R137J8111L173j446r6l941O692j0670j671p301n387N247k633
6853A3001N636j1501K149j0969o647N957J1641J0911o971L814J2863J21k929q639
6839A8437K538J3786J567r920j8749r911m536o982J1617M172n130N158N656N640
6825A3343N856J3059J1517r417j3383P976J0424J2j1230m590j0566m694j400L705
$$ plain form
6811 10612 19316 26008 19184 18266 11437 13920 36210 29509 24620 27190 35608 40191 38329 31111 16970
6796 16970 17106 16285 1000 -2132 -1253 -86 -254 4632 11807 3893 -3701 -11515 -1481 11496 24744
6781 24744 19348 19738 25130 39348 38060 33956 24137 1902 -5632 -6118 3521 12851 21176 27430 28139
6766 28139 18418 21470 31260 16748 19091 23968 26412 18668 11330 12890 23727 26028 21505 14973
6752 14973 6986 4388 5619 -351 2348 14622 18280 1017 -9062 4012 26136 42524 49500
6739 49500 31776 12772 20650 34637 45037 42704 35528 13677 10005 13347 7532 20317 19143
6726 19143 9949 8295 19440 28492 22930 18896 21630 17772 5282 5372 11517 21170 27740 26632 28952
6711 28952 19180 14142 10248 4884 10628 9087 5159 9255 14836 20211 21426 26850 25509 23647 17617
$$ packed form
6811A0612Q704O692o824r18o829K483K2290o701m889K570Q418M583j862p218j4141
6796A6970J36q21j5285l132Q79J167j68M886P175p914p594p814J0034J2977J3248
6781B4744n396L90N392J4218j288m104r819k2235p534m86R639R330Q325O254P09
6766B8139r721L052R790j4512K343M877K444p744p338J560J0837K301m523o532
6752A4973p987k598J231n970K699J2274L658j7263j0079J3074K2124J6388O976
6739D9500j7724j9004P878J3987J0400k333p176k1851l672L342n815J2785j174
6726A9143r194j654J1145R052n562m034K734l858j2490R0O145R653O570j108K320
6711B8952r772n038l894n364N744j541l928M096N581N375J215N424j341j862o030
$$ plain form
6696 17617 14657 10382 28193 28136 30831 46863 39505 29998 28861 37456 28202 10367 24353 35438
6682 35438 23797 20037 19048 19471 16352 13467 15834 15829 22736 21378 18616 33718 41063 30058 15080
6667 15080 5938 70 -5293 -576 -11320 -13891 3141 4712 14317 6856 3567 12602 12334 12821 21353
6652 21353 17084 7947 -9385 -14766 -1731 13567 28720 27628 31810 30161 10750 -4518 -6874
6639 -6874 7983 8526 14066 20395 9935 -12259 -6089 21532 24101 16251 13875 19420 29021 36407
6625 36407 32566 14075 7023 11250 19666 35650 43216 50843 37252 25177 23289 3187 -3580
6612 -3580 -8267 -2811 2158 5758 -3480 4390 22316 22258 10701 3880 10442 11720 12959 4992 3180
6597 3180 4493 -1141 10876 23605 23395 27573 27468 24571 14202 5799 2023 7653 12946 2526
$$ packed form
6696A7617k960m275J7811n7K695J6032p358r507j137Q595r254j7835J3986J1085
6682C5438j1641l760r89M23l119k885K367nO907j358k762J5102P345j1005j4978
6667A5080r142n868n363M717j0744k571J7032J571R605p461l289R035k68M87Q532
6652B1353m269r137j7332n381J3035J5298J5153j092M182j649j9411j5268k356
6639f874J4857N43N540O329j0460k2194O170K7621K569p850k376N545R601P386
6625C6407l841j8491p052M227Q416J5984P566P627j3591j2075j888k0102o767
6612c580m687N456M969L600r238P870J7926n8j1557o821O562J278J239p967j812
6597C180J313n634J2017J2729k10M178j05k897j0369q403l776N630N293j0420
$$ plain form
6583 2526 11393 25863 33802 17451 11670 17974 17899 7578 8713 15078 6065 -4980 -9230 13651
6569 13651 16012 9861 10666 580 5353 14344 14984 20608 39462 38780 23326 18080 21460 12620 3852
6554 3852 1685 -1770 6626 18746 13318 14158 25124 33231 25994 33469 38150 41206 41404 46745 54216
6539 54216 41224 31069 28561 21709 22262 11411 5484 -3424 776 8878 8958 -2834 5243 13143
6525 13143 5643 -5019 -5319 16019 33444 28884 25953 17900 27843 32452 19444 6081 736 2838
6511 2838 12073 8812 8753 22551 20041 19011 21929 17202 25885 23348 18489 15740 22180 11394 -1651
6496 -1651 284 13355 14970 16946 21342 21803 26897 28046 23192 11808 1073 916 11343 5436
6482 5436 10939 26092 32441 23269 14542 8639 -2144 -9395 2132 9850 16842 16806 13619 -1195
$$ packed form
6583B526Q867J4470P939j6351n781O304p5j0321J135O365r013j1045m250K2881
6569A3651K361o151Q05j0086M773Q991O40N624J8854o82j5454n246L380q840q768
6554C852k167l455Q396J2120n428Q40J0966Q107p237P475M681L056J98N341P471
6539E4216j2992j0155k508o852N53j0851n927q908M200Q102Q0j1792Q077P900
6525A3143p500j0662l00K1338J7425m560k931q053R943M609j3008j3363n345K102
6511B838R235l261n9J3798k510j030K918m727Q683k537m859k749O440j0786j3045
6496a651J935J3071J615J976M396M61N094J149m854j1384j0735j57J0427n907
6482E436N503J5153O349r172q727n903j0783p251J1527P718O992l6l187j4814
$$ plain form
6468 -1195 -16894 -28805 -20466 -17761 -1800 10998 -3250 -6378 -8566 -7429 -8981 -843 8161 17288
6454 17288 12197 10367 14796 4918 10226 21498 2968 -4231 -2816 -467 3223 4310 12230 13921
6440 13921 14674 7977 -2152 -19171 -17052 -13119 -1989 -2529 -1112 4765 -2724 -8784 -1957 8683
6426 8683 10146 21105 23905 37073 36462 20043 20038 18850 13169 9997 19281 30175 25420 20759 6646
6411 6646 -3736 -2529 -7830 -9667 -3823 9034 9109 21108 20135 12886 14784 11320 14968 25314 25008
6396 25008 19138 5265 -3068 -2569 6597 13739 8058 19497 19617 -5114 -8981 -809 1196 23050
6382 23050 17974 22205 29698 23329 16047 8188 2551 10575 13863 1995 -12065 -19035 -14523 -5015
6368 -5015 -8773 -8452 -22561 -15641 -67 15595 19086 11515 6292 5308 14631 19191 27315 27321 16716
$$ packed form
6468a195j5699j1911Q339K705J5961J2798j4248l128k188J137j552Q138R004R127
6454A7288n091j830M429r878N308J1272j8530p199J415K349L690J087P920J691
6440A3921P53o697j0129j7019K119L933J1130n40J417N877p489o060O827J0640
6426H683J463J0959K800J3168o11j6419nj188n681l172R284J0894m755m661j4113
6411F646j0382J207n301j837N844J2857P5J1999r73p249J898l464L648J0346l06
6396B5008n870j3873q333M99R166P142n681J1439J20k4731l867Q172K005K1854
6382B3050n076M231P493o369p282p859n637Q024L288j1868j4060o970M512R508
6368e015l758L21j4109O920J5574J5662L491p571n223r84R323M560Q124Oj0605
$$ plain form
6353 16716 10494 -2236 -9083 -9041 -6453 4645 26938 33343 38819 35133 31010 17828 2392 23422
6339 23422 31561 26319 19146 10569 4145 2043 -1563 8470 17661 21854 21212 13834 6070 7729 20078
6324 20078 19014 10063 17945 16740 10103 5152 -3422 6574 10930 17685 18109 13860 -1360 1233 -8028
6309 -8028 9220 6711 7478 4988 4172 15930 27197 27590 19217 18426 18296 27894 27143 27565 22175 13176
6293 13176 12572 12956 -787 -2279 3300 11443 8754 8353 21606 18372 6908 11653 -12095 -21157
6279 -21157 -10643 -10705 -11425 -52 1982 -1244 3206 10196 16857 19015 18499 19216 10252 226 -4638
6264 -4638 -4181 -5490 -12312 -15017 7347 13684 18978 33672 20281 16164 20869 37565 46025 35527
6250 35527 9399 -823 4427 19059 19780 5679 -4564 500 -3737 4742 4504 -4674 4378 6234
$$ packed form
6353A6716o222j2730o847M2K588J1098K2293O405N476l686m123j3182j5436K1030
6339B3422Q139n242p173q577o424k102l606J0033R191M193o42p378p764J659J2349
6324B0078j064q951P882j205o637m951q574R996M356O755M24m249j5220K593r261
6309h028J7248k509P67k490q16J1758J1267L93q373p91j30R598p51M22n390q999
6293A3176o04L84j3743j492N579Q143k689m01J3253l234j1464M745k3748r062
6279b1157J0514o2p20J1373K034l226M450O990O661K158n16P17q964j0026m864
6264d638M57j309o822k705K2364O337N294J4694j3391m117M705J6696Q460j0498
6250C5527k6128j0222N250J4632P21j4101j0243N064m237Q479k38r178R052J856
$$ plain form
6236 6234 5304 -915 11049 21449 18375 2842 -9968 -18846 -12315 -7351 -7081 -869 16143 16497
6222 16497 17266 12658 259 -13147 -19990 -16228 -5598 -4002 3500 5815 13317 13617 23591 15505
6208 15505 11523 7675 4424 15418 29735 18082 10270 12211 20222 19398 20649 23234 14965 19763
6194 19763 20540 25557 29886 23339 25499 28581 37084 16543 5368 7284 9847 14851 10788 8654
6180 8654 23571 31651 31527 43880 43695 36866 33008 27628 29274 35781 24660 7143 7423 2485 -3901
6165 -3901 -15701 -12776 4384 11697 12395 1530 3352 11421 4444 13994 27915 28002 22570 21163 20382
6150 20382 17670 305 -3467 -7958 -8122 -12898 -9988 -7453 -830 -2079 -2335 8480 12714 22683 31938
6135 31938 25243 16158 2776 -7397 -9733 -1139 13243 20598 26608 26695 20897 15472 13223 10211
$$ packed form
6236F234r30o219J1964J0400l074j5533j2810q878O531M964K70O212J7012L54
6222A6497P69m608j2399j3406o843L762J0630J596P502K315P502L00R974q086
6208A5505l982l848l251J0994J4317j1653p812J941Q011q24J251K585q269M798
6194A9763P77N017M329o547K160L082Q503k0541j1175J916K563N004m063k134
6180H654J4917Q080j24J2353j85o829l858n380J646O507j1121j7517K80m938o386
6165c901j1800K925J7160P313O98j0865J822Q069o977R550J3921Q7n432j407p81
6150B0382k712j7365l772m491j64m776K910K535O623j249k56J0815M234R969R255
6135C1938o695r085j3382j0173k336Q594J4382P355O010Q7n798n425k249l012
$$ plain form
6121 10211 5351 1483 537 2658 3818 12063 14512 10046 10542 21140 13042 10223 16264 22195 17199
6106 17199 19596 18452 27326 35651 26719 14060 11122 -5489 -5147 -4224 -8499 -17505 -13842 -15573 -16538
6091 -16538 -10506 -4559 -3063 -4609 -3516 -4572 -5630 -8422 3743 24009 9759 -1432 -17392
6078 -17392 -12593 5343 15592 1701 14976 14283 -2973 -11095 -19441 -1447 10516 -6475 -11959
6065 -11959 -1471 6861 13430 9465 10603 3960 7539 8418 8930 7158 5384 -13271 -23818 -18283
6051 -18283 -9909 -9046 -3753 -1356 5722 7273 -862 -235 -8879 -8882 -9545 -9184 -6918 -10983 -2403 645
6035 645 -6164 -2045 3699 11905 14102 17264 10506 -2565 -12872 -11665 -14354 -14085 -2001 15569
6021 15569 18128 10402 4007 6477 10552 9737 14506 18645 12013 9273 15242 19989 11730 2475 -3759
$$ packed form
6121A0211m860l868r46K121J160Q245K449m466M96J0598q098k819O041N931m996
6106A7199K397j144Q874Q325q932j2659k938j6611L42R23m275r006L663j731r65
6091a6538O032N947J496j546J093j056j058k792J2165K0266j4250j1191j5960
6078a7392M799J7936J0249j3891J3275o93j7256q122q346J7994J1963j6991n484
6065a1959J0488Q332O569l965J138o643L579Q79N12j772j774j8655j0547N535
6051a8283Q374Q63N293K397P078J551q135O27q644lo63L61K266m065Q580L048
6035F45o809M119N744Q206K197L162o758j3071j0307J207k689K69J2084J7570
6021A5569K559p726o395K470M075q15M769M139o632k740N969M747q259r255o234
$$ plain form
6006 -3759 -3903 -12904 -18426 -1926 14660 15703 16954 29738 29411 15402 12814 5759 -7508 3614
5992 3614 6968 1372 -9350 -15059 -10555 -7801 -6066 6789 16901 15887 7831 8270 8053 8488 11451
5977 11451 12485 7730 2531 -962 3858 8521 14988 31334 34084 20175 10324 12605 9347 10871
5963 10871 4993 1227 3792 -48 -11822 -11965 -3931 3782 11007 6946 16794 12116 5023 10239 15212
5948 15212 -7413 -12979 2666 12825 9677 4927 -2811 1747 8373 13764 17142 16404 2308 14069
5934 14069 25787 27815 17016 19956 12092 1294 3464 2267 -5082 10051 15685 11776 16949 18947
5920 18947 17627 18752 16556 6181 736 -2212 -1483 4644 463 6372 2909 8934 7162 7805 3605
5905 3605 80 -3157 6678 9237 2960 6623 4814 2382 -785 -14085 -20214 -16239 -20495 -17320 -4297
$$ packed form
6006c759j44r001n522J6500J6586J043J251J2784l27j4009k588p055j3267J1122
5992C614L354n596j0722n709M504K754J735J2855J0112j014q056M39k17M35K963
5977A1451J034m755n199l493M820M663O467J6346K750j3909r851K281l258J524
5963A0871n878l766K565l840j1774j43Q034P713P225m061R848m678p093N216M973
5948A5212k2625n566J5645J0159l148m750p738M558O626N391L378p38j4096J1761
5934A4069J1718K028j0799K940p864j0798K170j197p349J5133N634l909N173J998
5920A8947j320J125k196j0375n445k948P29O127m181N909l463O025j772O43m200
5905C605l525l237R835K559o277L663j809k432l167j3300o129L975m256L175J3023
$$ plain form
5890 -4297 4622 -2023 -4877 -2016 -3822 -11047 -11735 -12841 -10222 583 11030 7718 -1644 -6373 -5151
5875 -5151 1504 3584 5789 -1297 -7212 -8925 10081 13320 3434 6992 -11111 -23044 -13569 -9568
5861 -9568 -8816 -9205 -246 1548 10989 -9608 -14433 -1059 922 2617 15923 10471 2235 -3399 -886
5846 -886 4549 857 -5217 -7647 -10453 -4427 -2962 -8140 -3288 -11773 -9378 -15944 -14337 -13521 6240
5831 6240 14719 11608 3295 1259 -2246 -2446 13628 22350 9951 9850 15905 17863 5427 2513 -1244
5816 -1244 -2867 -1273 991 1500 -7730 -16471 -22058 2768 5963 -3703 -7081 -16304 -28315 -26545 -13540
5801 -13540 -2916 6912 2299 774 -14550 -4430 -2449 -16700 -14086 -16579 -12293 -3696 6985
5788 6985 12282 14074 10865 710 5140 8529 1197 -15122 -20539 -12433 923 2063 -10991 -11803
$$ packed form
5890d297Q919o645k854K861j806p225o88j106K619J0805J0447l312r362m729J222
5875e151O655K080K205p086n915j713J9006L239r886L558j8103j1933R475M001
5861i568P52l89Q959J794R441k0597m825J3374J981J695J3306n452q236n634K513
5846h86N435l692o074k430k806O026J465n178M852q485K395o566J607Q16J9761
5831F240Q479l111q313k036l505k00J6074Q722j2399j01O055J958j2436k914l757
5816a244j623J594K264N09r230q741n587K4826L195r666l378r223j2011J770J3005
5801a3540J0624R828m613j525j5324J0120J981j4251K614k493M286Q597J0681
5788F985N297J792l209j0155M430L389p332j6319n417Q106J3356J140j3054q12
$$ plain form
5774 -11803 -20796 -25182 -20839 -24085 -15531 681 7597 4338 -8747 -20468 -16316 1093 7439 5657
5760 5657 4721 -972 -10284 -11763 246 -9300 -13010 -13818 -6801 -5517 -1709 17447 28010 17696
5746 17696 -3008 12523 11770 -1050 -7466 -9419 -3542 11892 11378 8539 7717 -7077 -24155 -22419
5732 -22419 -6649 8186 20160 8133 4381 -18178 -14957 4558 2683 -2568 329 -9765 -18811
5719 -18811 -15466 -15294 -13865 -25194 -16829 1671 13846 9228 17244 21837 8522 4858 -5560 -9114
5705 -9114 -4632 -9944 -7173 -4335 -10648 -6368 2543 6098 683 -5000 -14349 -12065 -1572 944 -190
5690 -190 -20232 -18523 -7213 -18674 -19008 -10760 4862 7668 -2182 -689 -832 855 -927 -3366 -17165
5675 -17165 -13178 -11881 -9276 -340 11377 988 814 -344 6763 4339 -17265 -17986 -3202 -8333
$$ packed form
5774a1803q993m386M343l246Q554J6212O916l259j3085j1721M152J7409O346j782
5760E657r36n693r312j479J2009r546l710q08P017J284L808J9156J0563j0314
5746A7696k0704J5531p53j2820o416j953N877J5434n14k839q22j4794j7078J736
5732b2419J5770J4835J1974j2027l752k2559L221J9515j875n251K897j0094r046
5719a8811L345J72J429j1329Q365J8500J2175m618Q016M593j3315l664j0418l554
5705i114M482n312K771K838o313M280Q911L555n415n683r349K284J0493K516j134
5690a90k0042J709J1310j1461l34Q248J5622K806r850J493j43J687j782k439j3799
5675a7165L987J297K605Q936J1717j0389j74j158P107k424k1604p21J4784n131
$$ plain form
5661 -8333 -2521 8855 2426 -10596 -7839 3420 9862 11696 16976 15198 8071 6152 5907 2516
5647 2516 -10341 -5316 7918 6053 -1924 -13853 -10769 10811 8664 -2750 4682 669 5431 10169
5633 10169 21724 2277 9388 16800 9820 -2171 -9434 -13739 -8633 2286 11443 11367 4899 5012
5619 5012 -352 774 -7665 6377 4117 6089 3987 76 5542 2501 6225 10858 9668 -6749
5605 -6749 -18466 -19311 -11371 -11270 -16610 -17320 -24254 -23645 -1556 4284 10885 10909 3395 -1805 -717 1332
5589 1332 -9787 56 -1473 -18799 -19656 -28828 -23516 -2957 -1229 -8787 -10248 -6955 -10360 -12616
5575 -12616 -15592 -9350 -7424 2160 11890 6223 -2050 1250 5096 6179 -3716 -10511 -5186 -10699 -1121
5560 -1121 18965 24790 14220 -1192 10878 11122 17524 18888 11443 13493 14616 -7514 -11966 -9161
$$ packed form
5661h333N812J1376o429j3022K757J1259O442J834N280j778p127j919k45l391
5647B516j2857N025J3234j865p977j1929L084K1580k147j1414P432m013M762M738
5633A0169J1555j9447P111P412o980j1991p263m305N106J0919R157p6o468J13
5619E012n364J126q439J4042k260J972k102l911N466l041L724M633j190j6417
5605f749j1717q45P940J01n340p10o934O09K2089N840O601K4p514n200J088K049
5589A332j1119R843j529j7326q57r172N312K0559J728p558j461L293l405k256
5575a2616k976O242J926R584R730n667q273L300L846J083r895o795N325n513R578
5560a121K0086N825j0570j5412J2070K44O402J364p445K050J123k2130m452K805
$$ plain form
5546 -9161 -13420 -4115 12099 12589 11846 7949 3346 8394 19683 27866 12154 -9591 -14243 -8836
5532 -8836 1766 -592 -2393 -1791 6821 17512 23487 19998 16731 11729 -7733 -21173 292 8197
5518 8197 -10526 -19040 -1270 -9529 -20659 -6781 5162 9015 19077 24585 17639 20343 31392
5505 31392 41094 26793 7503 6054 7415 3837 -3588 -10619 -7772 -2610 -2111 -2954 4671 12745 7373
5490 7373 8682 2282 -12396 -25217 -36789 -43214 -16193 6707 10978 4318 -7351 -12733 -3246
5477 -3246 6352 14913 8706 4464 6371 10514 2265 -12618 -11966 5701 333 -1657 -10032 -10647 5268
5462 5268 18548 24118 24010 18950 4496 -2400 7064 13006 13463 9215 1279 -3076 -7018 -5500 1096
5447 1096 12529 28922 25121 -1676 -18312 -10896 -1602 -4302 -3860 -5438 4388 9582 6973 7070 -1447
$$ packed form
5546i161m259R305J6214M90p43l897m603N048J1289Q183j5712k1745m652N407
5532h836J0602k358j801O02Q612J0691N975l489l267n002j9462j3440K1465P905
5518H197j8723q514J7770q259j1130J3878J1943L853J0062N508o946K704J1049
5505C1392R702j4301j9290j449J361l578p425p031K847N162M99q43P625Q074n372
5490G373J309o400j4678j2821j1572o425K7021K2900M271o660j1669n382R487
5477c246R598Q561o207m242J907M143q249j4883O52J7667n368j990q375o15J5915
5462E268J3280N570j08n060j4454o896R464N942M57m248p936m355l942J518O596
5447A096J1433J6393l801k6797j6636P416R294k700M42j578R826N194k609R7q517
$$ plain form
5432 -1447 -14288 -21635 -5153 -1044 -12242 -15628 -19330 -19172 -9380 4181 -6002 211 11947 1873
5418 1873 -349 -8990 -7971 -4624 451 -735 1188 -3419 -6141 -7324 8640 11619 2841 213 -652
5403 -652 -4206 -13816 -19232 -4771 -2248 1667 6963 8695 8323 5734 -2657 -17973 -26234 -15534 -9752
5388 -9752 -3614 -3874 3916 28588 37736 24710 10593 -2402 -13597 -258 1571 -15417 -27364
5375 -27364 -17882 -18822 -18635 -10604 -11714 -18011 -19878 -30815 -36895 -39951 -27468 -19723 363 10893
5361 10893 16982 16764 10496 3325 6281 8703 7089 9023 10677 2506 -14826 -16372 -8800 -697 -1575
5346 -1575 -13923 -24094 -26337 -21697 -6036 13787 13504 12815 -5920 -15052 -17697 -22978 -18625 -16649
5332 -16649 -14162 -18722 -25007 -30325 -19755 -11504 1113 17753 18848 18047 17817 12424 -11211 -6739
$$ packed form
5432a447j2841p347J6482M109j1198l386l702J58R792J3561j0183O213J1736j0074
5418A873k222q641J019L347N075j186J923m607k722j183J5964K979q778k628q65
5403f52l554r610n416J4461K523L915N296J732l72k589q391j5316q261J0700N782
5388i752O138k60P790K4672R148j3026j4117j2995j1195J3339J829j6988j1947
5375b7364R482r40J87Q031j110o297j867j0937o080l056J2483P745K0086J0530
5361A0893O089k18o268p171K956K422j614J934J654q171j7332j546P572Q103q78
5346a575j2348j0171k243M640J5661J9823k83o89j8735r132k645n281M353J976
5332a6649K487m560o285n318J0570Q251J2617J6640J095q01k30n393k3635M472
$$ plain form
5318 -6739 3808 -1137 4063 10333 16042 27646 34982 19202 -2526 -9217 -14954 -24297 -23356 -22449
5304 -22449 -22149 -10896 -5745 4419 6529 13956 12931 1176 -17206 -23960 -23017 -24000 3490 15540
5290 15540 11669 1904 -485 8205 5695 -10668 -20732 -11515 -7028 -10838 -5377 -287 14673 18536
5276 18536 26796 34073 15805 17184 19803 24536 12936 5476 5799 12686 29041 30137 35372 36233
5262 36233 29226 19610 11423 8165 3247 -1121 -11593 -4499 1539 6612 -2392 -14878 -23276 -33469
5248 -33469 -34762 -22235 -5996 -16212 -27182 -26025 -22006 -20455 -13742 -2258 -7890 -6933 -6002 -10957
5234 -10957 -12255 -8400 -10940 -18313 -26384 -24070 -28488 -35966 -38504 -29717 -29961 -30130 -10147 2544 3972
5219 3972 3039 17010 26090 15416 -7751 -13957 -191 -7922 -10244 -1224 -7710 -12341 -8828 -8958
$$ packed form
5318f739J0547m945N200O270N709J1604P336j5780k1728o691n737r343R41R07
5304b2449L00J1253N151J0164K110P427j025j1755j8382o754R43r83K7490J2050
5290A5540l871r765k389Q690k510j6363j0064R217M487l810N461N090J4960L863
5276A8536Q260P277j8268J379K619M733j1600p460L23O887J6355J096N235Q61
5262C6233p007r616q187l258m918m368j0472P094O038N073r004j2486q398j0193
5248c3469j293J2527J6239j0216j0970J157M019J551O713J1484n632R57R31m955
5234a0957j298L855k540p373q071K314m418p478k538Q787k44j69J9983J2691J428
5219C972r33J3971R080j0674k3167o206J3766p731k322R020o486m631L513j30
$$ plain form
5205 -8958 -13416 -13223 -16808 -18848 -6617 -3293 -12708 -19410 -20528 -29972 -20397 -10735 -7502 -9339 -6132
5190 -6132 3552 568 -435 4171 8647 -5099 -20019 -18519 -11055 -11106 -8095 -4869 -7138 -10200 -17108
5175 -17108 -11217 -11390 -5637 59 -7923 -17518 -13435 -6626 -7190 -1395 6432 -2432 -14084 -15908 -22787
5160 -22787 -16055 -20179 -8395 6563 12607 7281 5006 -729 -17064 -13084 -13329 -2835 9269 3126
5146 3126 -9004 -24105 -19403 -12302 -3182 -1247 -2055 3823 -7408 -6012 11773 22379 11103 2230
5132 2230 5401 -2851 -2946 -2837 -28173 -33062 -20402 -15180 -12443 -14368 -12904 -14002 -7999 670 -7148
5117 -7148 -7115 -6040 -5895 -4329 -3893 3667 16697 16898 15021 1270 -11563 -10318 -10626 -491 1773
5102 1773 -7364 -10360 -20401 -29494 -19745 -8516 -636 -15608 -22169 -24330 -27533 -33671 -30094 -23322
$$ packed form
5205h958m458J93l585k040J2231L324r415o702j118r444R575R662L233j837L207
5190f132R684k984j003M606M476j3746j4920J500P464n1L011L226k269l062o908
5175a7108N891j73N753N696p982r595M083O809n64N795P827q864j1652j824o879
5160b2787O732m124J1784J4958O044n326k275n735j6335L980k45J0494J2104o143
5146C126j2130j5101M702P101R120J935q08N878j1231J396J7785J0606j1276q873
5132B230L171q252r5J09k5336m889J2660N222K737j925J464j098O003Q669p818
5117g148L3J075J45J566M36P560J3030K01j877j3751j2833J245l08J0135K264
5102A773r137k996j0041r093R749J1229P880j4972o561k161l203o138L577O772
$$ plain form
5088 -23322 -18325 -26780 -27251 -21637 -11903 -10665 -17859 -24177 -17333 -5152 -8437 -18719 -30768 -21848
5074 -21848 -13913 -6452 -16910 -21963 -15807 -578 7539 10565 10623 8604 -361 -7918 -8369 -6096 9838
5059 9838 9602 3834 -3179 -7089 -1617 1529 11016 12922 12679 22242 18218 8930 18702 10881 -520
5044 -520 -5624 4642 -1835 585 15478 18201 4869 -5982 -4157 -13984 -19169 -4932 -5561 -11768
5030 -11768 -16910 -14151 -10288 -16732 -12235 388 582 646 12301 16103 308 -20156 -14454 2583
5016 2583 4165 55 -10749 -5649 2835 9836 15927 1106 -2621 -3391 -5170 -86 -3322 -16420
5002 -16420 -9666 -1374 -4269 -4349 -8670 -6603 8863 21286 27367 21023 -376 -16782 -12386 -12786
4988 -12786 -19224 -12698 -5614 -5055 -19406 -30530 -21714 -7310 -2869 1312 -12730 -4632 110 -1858
$$ packed form
5088b3322M997q455m71N614R734J238p194o318O844J2181l285j0282j2049Q920
5074b1848P935P461j0458n053O156J5229Q117L026N8k019q965p557m51K273J5934
5059I838k36n768p013l910N472L146R487J906k43R563m024r288R772p821j1401
5044e20n104J0266o477K420J4893K723j3332j0851J825r827n185J4237o29o207
5030a1768n142K759L863o444M497J2623J94O4J1655L802j5795k0464N702J7037
5016B583J582m110j0804N100Q484P001O091j4821l727p70j779N084l236j3098
5002a6420O754Q292k895q0m321K067J5466J2423O081o344k1399j6406M396m00
4988a2786o438O526P084N59j4351j1124Q816J4404M441M181j4042Q098M742j968
$$ plain form
4974 -1858 -3789 -3963 -13709 -15293 -8765 -16348 -27702 -19978 -15849 -18154 -21315 -25134 -29109 -25158 -26571
4959 -26571 -24503 -10054 12395 18576 10798 -1762 -5920 -8532 -3226 -28780 -34476 -17017 -2324
4946 -2324 -10884 -14975 -20540 -18861 -13196 -18005 -10314 2121 666 -2173 -12263 -15269 -22827 -22669 -18527
4931 -18527 -10041 16443 15476 9632 9079 12290 6851 -6846 -10847 -15666 -13307 1732 -7615 -13170
4917 -13170 -15687 -9945 6789 8516 9103 4559 -9450 -9185 -5455 -9347 -16431 -18739 -11463 -2666 -2138
4902 -2138 -12870 -10805 -2191 -783 -3510 1815 -10078 -12590 -19868 -29037 -34223 -23525 -2857 17898
4888 17898 10840 9946 17567 15099 15563 11767 6279 3317 -1334 6493 19435 17077 16409 8346 6138
4873 6138 5186 1385 8248 9032 -755 -10913 -3732 -6016 -20381 -27190 -26402 -21229 -28451 -36225 -31781
$$ packed form
4974a858j931j74r746j584O528p583j1354P724M129k305l161l819l975L951j413
4959b6571K068J4449K2449O181p778j2560m158k612N306k5554n696J7459J4693
4946b324q560m091n565J679N665m809P691J2435j455k839j0090l006p558J58M142
4931a8527Q486K6484r67n844n53L211n439j3697m001m819K359J5039r347n555
4917a3170k517N742J6734J727N87m544j4009K65L730l892p084k308P276Q797N28
4902b138j0732K065Q614J408k727N325j1893k512p278r169n186J0698K0668K0755
4888A7898p058q94P621k468M64l796n488k962m651P827J2942k358o68q063k208
4873F138r52l801O863P84r787j0158P181k284j4365o809P88N173p222p774M444
$$ plain form
4858 -31781 -25764 -27639 -26132 -23596 -18479 -20300 -6505 -12551 -13950 -9848 -3295 -5222 1434 8037
4844 8037 16657 -79 6469 5468 -7544 -12457 -13984 -27466 -19045 -15489 -19966 -16048 -13720 -6473
4830 -6473 470 -5651 3913 10111 11863 12288 17144 8488 10966 17533 20520 6822 -10980 -13151 -17816
4815 -17816 -6476 5031 10242 8826 -7466 -8126 -17264 -23353 -28329 -21458 -13732 3410 -11853 -16615
4801 -16615 -18396 -9042 -1157 -4476 -14606 -15569 1644 8397 1877 -11826 -13869 -19153 -12881 -12737
4787 -12737 -17432 -22591 -23461 -13403 -9137 12463 17111 6098 -517 17652 5987 -18411 -19650
4774 -19650 -11250 -5763 870 10058 4494 -16103 -17142 4415 10809 3726 -797 -1856 2559 745
4760 745 -3033 -6085 8014 11964 2124 -994 7877 19698 21442 13497 -2130 -7383 -17729 -15514
$$ packed form
4858c1781O017j875J507K536N117j821J3795o046j399M102O553j927O656O603
4844H037Q620j6736O548j001j3012m913j527j3482Q421L556m477L918K328P247
4830f473O943o121R564O198J752M25M856q656K478O567K987j3698j7802k171m665
4815a7816J1340J1507N211j416j6292o60r138o089m976O871P726J7142j5263m762
4801a6615j781R354P885l319j0130r63J7213O753o520j3703k043n284O272J44
4787a2737m695n159q70J0058M266K1600M648j1013o615J8169j1665k4398j239
4774a9650Q400N487O633R188n564k0597j039K1557O394p083m523j059M415j814
4760G45l778l052J4099L950r840l118Q871J1821J744p945j5627n253j0346K215
$$ plain form
4746 -15514 3472 -14441 -22542 -12695 -3319 -686 9404 3885 -6920 2140 -2017 8802 27938
4733 27938 31342 5528 -2077 5074 10870 7388 -13441 -13639 -2004 -5533 -12181 -6139 -770 2410
4719 2410 -4404 -10841 -11499 -3969 2646 5982 6282 -3832 -23086 -25172 -15372 -1493 12179 20257
4705 20257 16233 7674 7155 9500 2913 -14163 -16611 -4058 -4955 7353 6338 14447 3074 -6804
4691 -6804 -18799 -32024 -31977 -30346 -29378 -22483 -1923 6971 16428 66 -3629 -17573 -8004 -7634 -4503
4676 -4503 3837 -309 -22545 -30273 -17288 -10451 -6246 -387 -3317 -13244 -13719 -17052 -8545 -1898 -7345
4661 -7345 416 -6528 -19441 -26365 -33476 -18745 965 -4027 -6919 -12268 -21654 -23511 -25259 -20939
4647 -20939 -10213 -4271 -8698 -12647 -9228 -22242 -28005 -21976 -20420 -6555 1101 11642 20031 9368
$$ packed form
4746a5514J8986j7913q101R847R376K633J0090n519j0805R060m157J0819J9136
4733B7938L404k5814p605P151N796l482k0829j98J1635l529o648O042N369L180
4719B410o814o437o58P530O615L336L00j0114j9254k086R800J3879J3672Q078
4705B0257m024q559n19K345o587j7076k448J2553q97J2308j015Q109j1373r878
4691f804j1995j3225M7J631R68O895K0560Q894R457j6362l695j3944R569L70L131
4676d503Q340m146k2236p728J2985O837M205N859k930r927m75l333Q507O647n447
4661g345P761o944j2913o924p111J4731J9710m992k892n349r386j857j748M320
4647b0939J0726N942m427l949L419j3014n763O029J556J3865P656J0541Q389j0663
$$ plain form
4633 9368 4054 11820 14604 16499 -3677 -12827 -4636 3269 4939 -15357 -29844 -23098 -14914 -7695
4619 -7695 623 7153 956 -5740 -460 9830 4811 1514 2137 7543 8684 8767 -8939 -19723 -14908
4604 -14908 7 11065 19660 19860 15982 8816 6199 4013 -4913 2043 4412 938 -17215 -25278
4590 -25278 -4941 17856 17167 3725 -26018 -36386 -26851 -17228 -8760 -10145 -14096 -20521 -22924 -10008
4576 -10008 3781 6616 5277 -5148 -7899 11675 23133 16704 18114 7082 -5700 -20688 -16561
4563 -16561 -14669 -14560 -25346 -43006 -33619 -18793 -11558 -22947 -26506 -18962 -8611 -1693 -10199 -19267
4549 -19267 -5606 -4174 -18652 -20105 -11641 -2677 8912 4118 -6538 -2079 2101 8833 12615 9915
4535 9915 1599 -6870 -2669 -2018 3617 17804 19863 8056 8365 11894 3468 -9081 -9932 -1198 -2724
$$ packed form
4633I368n314P766K784J895k0176r150Q191P905J670k0296j4487O746Q184P219
4619g695Q318O530o197o696N280J0290n019l297O23N406J141Q3j7706j0784M815
4604a4908J4915J1058Q595K00l878p166k617k186q926O956K369l474j8153q063
4590b5278K0337K2797o89j3442k9743j0368R535R623Q468j385l951o425k403J2916
4576a0008J3789K835j339j0425k751J9574J1458o429J410j1032j2782j4988M127
4563a6561J892J09j0786j7660R387J4826P235j1389l559P544J0351O918q506r068
4549a9267J3661J432j4478j453Q464Q964J1589m794j0656M459M180O732L782k700
4535I915q316q469M201O51N635J4187K059j1807L09L529q426j2549q51Q734j526
$$ plain form
4520 -2724 -7933 7558 9185 8933 -1727 -10303 -16225 -11038 302 4880 7779 9345 -2404 -15935
4506 -15935 -14958 -4772 6958 16507 13077 4622 3943 -3285 -11591 -2679 -3862 -1416 -8147 -13854 -11201
4491 -11201 -8247 -11686 -8998 -6823 -12526 -19657 -20705 -23412 -25208 -14915 -16206 -12260 -5669 -7475
4477 -7475 -7622 4897 11486 6862 -717 -15577 -16978 -13600 -5397 -2961 5759 7681 7122 1849 6668
4462 6668 9047 4706 317 4982 -3182 -3971 -4 -5516 2291 6229 296 -9740 5823 11967 549
4447 549 -2589 -6342 -27627 -30426 -9951 504 -9956 -19563 -14306 -19087 -18141 -6559 -4432 -4521 -2664
4432 -2664 -5302 -9741 -21474 -30939 -21672 -10415 -1421 17848 15246 10492 17388 21516 20843 21356 -662
4417 -662 -16174 -23886 -17060 4995 2083 -10815 -26619 -33751 -19415 -12518 -11996 -9718 -8301 -2569
$$ packed form
4520b724n209J5491J627k52j0660q576n922N187J1340M578K899J566j1749j3531
4506a5935R77J0186J1730R549l430q455o79p228q306Q912j183K446o731n707K653
4491a1201K954l439K688K175n703p131j048k707j796J0293j291L946O591j806
4477g475j47J2519O589m624p579j4860j401L378Q203K436Q720J922n59n273M819
4462F668K379m341m389M665q164p89L967n512P807L938n933j0036J5563O144j1418
4447E49l138l753k1285k799K0475J0455j0460r607N257m781R46J1582K127q9J857
4432b664k638m439j1733r465R267J1257Q994J9269k602m754O896M128o73N13k2018
4417f62j5512p712O826K2055k912j2898j5804p132J4336O897N22K278J417N732
$$ plain form
4403 -2569 -2935 1757 2536 -9463 -4273 4414 4500 7666 6685 1859 12556 19225 11403 -3023 -9418
4388 -9418 -2802 -5106 -10264 -943 -7650 -8134 -5379 371 8373 16363 17527 4821 -12591 -6444 -1945
4373 -1945 -2560 -8830 -7283 7181 17120 18591 22512 9035 -19606 -20737 -3739 7284 -15198 -34709
4359 -34709 -43648 -43992 -22737 -11789 -29034 -47458 -37215 -26065 -10192 3832 13559 10914 8905
4346 8905 5690 -11623 -12002 7239 7236 -4720 -17639 -18080 -17826 -7263 567 -3890 -13025 -4572 -2964
4331 -2964 -1225 3716 2896 -1162 -5608 -17750 -26667 -23377 -8970 441 8178 209 -5488 -9841 -14609
4316 -14609 -15387 -12086 382 14213 16152 16112 12654 17235 13159 8954 -1374 -15255 -9283 1483
4302 1483 -951 -1718 4996 5612 7453 13776 12486 -1203 -2939 -2748 -17548 -27804 -26498 -12853 -1200
$$ packed form
4403b569l66M692P79j1999N190Q687Q6L166r81m826J0697O669p822j4426o395
4388i418O616k304n158R321o707m84K755N750Q002P990J164j2706j7412O147M499
4373a945o15o270J547J4464R939J471L921j3477k8641j131J6998J1023k2482j9511
4359c4709q939l44K1255J0948j7245j8424J0243J1150J5873J4024R727k645k009
4346H905l215j7313l79J9241lj1956j2919m41K54J0563P830m457r135Q453J608
4331b964J739M941q20m058m446j2142q917L290J4407R411P737p969n697m353m768
4316a4609p78L301J2468J3831J939m0l458M581m076m205j0328j3881N972J0766
4302A483k434p67O714O16J841O323j290j3689j736J91j4800j0256J306J3645J1653
$$ plain form
4287 -1200 -10600 -13261 -15975 -18306 -7483 -1838 -7432 -14940 -16330 -14598 -8618 813 6539 5599 -2730
4272 -2730 -6892 472 4524 -1859 2497 2016 -7134 -969 546 1976 -8525 -20310 -14687 -5658 11920
4257 11920 17144 3933 2547 6913 6102 4128 4224 9161 9525 7913 3940 9012 3350 -6110 -19310
4242 -19310 -19863 -19393 -17281 -21549 -12397 5586 15694 8491 5044 9034 8656 9840 5523 9186 19423
4227 19423 5825 -30 -6526 -9294 -15511 -21017 -27608 -11710 -3245 -12853 -26140 -21268 -18050 -19894
4213 -19894 -10624 -18042 -28405 -19691 -7860 -10414 -6896 -8408 -11074 -6246 9462 13844 4250 -10451
4199 -10451 -16420 -13405 -11029 -8962 -16033 -10692 -13010 536 15634 8824 792 4670 7840 -3104
4185 -3104 5178 2746 -4884 -18228 -28049 -25050 -18109 -11424 -2126 2521 -5630 -9000 -8204 -3328 -4981
$$ packed form
4287a200r400k661k714k331J0823N645n594p508j390J732N980R431N726r40q329
4272b730m162P364M052o383M356m81r150O165J515J430j0501j1785N623R029J7578
4257A1920N224j3211j386M366q11j974R6M937L64j612l973N072n662r460j3200
4242a9310n53M70K112m268R152J7983J0108p203l447L990l78J184m317L663J0237
4227A9423j3598n855o496k768o217n506o591J5898Q465r608j3287M872L218j844
4213a9894R270p418j0363Q714J1831k554L518j512k666M828J5708M382r594j4701
4199a0451n969L015K376K067p071N341k318J3546J5098o810q032L878L170j0944
4185c104Q282k432p630j3344r821K999O941O685R298M647q151l370P96M876j653
$$ plain form
4170 -4981 -13131 -21918 -13953 1439 1866 2132 7470 2380 -5536 -10267 -8443 -8527 -14846 -18754 -15923 -8839
4154 -8839 -2766 6655 -955 -19773 -18380 -10374 -13928 -16199 -27207 -25569 -15974 -10663 -8687 -14132
4140 -14132 -18172 -16207 -10721 -17005 -11342 5585 8522 119 -10787 -15112 -18619 -12608 -3973 -11414
4126 -11414 -10328 -13112 -7699 -1865 -8148 -4636 1778 3064 7485 3014 -3437 593 -2820 208 2259
4111 2259 651 9628 10740 6498 -3904 -13812 -5196 11468 8033 11042 8099 3574 -2181 -7060
4097 -7060 2250 4023 8077 10780 6000 9450 2781 3005 13418 8418 -1101 -13539 -23953 -19691
4083 -19691 -5890 -6933 -6315 -7523 -11425 -8543 330 -2506 -10547 -11091 -8173 2361 16374 28890
4069 28890 24789 7603 -1222 -2752 7780 19186 16601 19454 504 -13303 -10851 -4322 -2905
$$ packed form
4170d981q150q787P965J5392M27K66N338n090p916m731J824q4o319l908K831P084
4154h839O073R421p610j8818J393Q006l554k271j1008J638R595N311J976n445
4140a4132m040J965N486o284N663J6927K937q403j0906m325l507O011Q635p441
4126a1414J086k784N413N834o283L512O414J286M421m471o451M030l413L028K051
4111B259j608Q977J112m242j0402r908Q616J6664l435L009k943m525n755m879
4097g060R310J773M054K703m780L450o669K24J0413n000r519j2438j0414M262
4083a9691J3801j043O18j208l902K882Q873k836q041n44K918J0534J4013J2516
4069B8890m101j7186q825j530J0532J1406k585K853j8950j3807K452O529J417
$$ plain form
4056 -2905 -10506 -12896 -9540 -7244 -6520 -18774 -8710 -4131 -12765 -12701 9856 28219 27294 21106 11804
4041 11804 9928 5590 -12831 -12005 -2153 -11030 -5170 -554 -13012 -11965 -1790 4360 1470 -9818
4027 -9818 -10292 -14848 -19699 -27749 -25086 -17870 -13742 7055 -10454 -23900 -19355 -10510 -10039 297
4013 297 -12684 -22431 -26887 -38435 -31278 -25854 -20876 -9212 -4589 -13925 -15135 -20740 -17953 -14899
3999 -14899 -1267 -12801 -29071 -21765 -17344 -12923 -21780 -25340 -35895 -30054 -26485 -20916 -24842 -10474
3985 -10474 -5630 -7764 -21308 -13068 -2484 -8763 -18695 -29978 -24547 -22591 -26245 -12223 -19402 -14369
3971 -14369 -17310 -11426 -10344 -12215 3373 20232 -2 -7670 -6769 -2372 -5813 -14748 -12604 -1943
3957 -1943 3855 10237 -118 -8648 -1726 1022 1976 6116 -5868 -14530 -9030 1026 1842 245 7339
$$ packed form
4056b905p601k390L356K296P24j2254J0064M579q634O4K2557J8363r25o188r302
4041A1804j876m338j8421Q26R852q877N860M616j2458J047J0175O150k890j1288
4027i818m74m556m851q050K663P216M128K0797j7509j3446M545Q845M71J0336
4013B97j2981r747m456j1548P157N424M978J1664M623r336j210n605K787L054
3999a4899J3632j1534j6270P306M421M421q857l560j0555N841L569N569l926J4368
3985a0474M844k134j3544Q240J0584o279r932j1283N431J956l654J4022p179N033
3971a4369k941N884J082j871J5588J6859k0234p668R01M397l441q935K144J0661
3957a943N798O382j0355q530O922K748R54M140j1984q662N500J0056Q16j597P094
$$ plain form
3942 7339 17513 4833 -1747 3684 -905 -10584 -12504 -12477 -18891 -29626 -31292 -19365 2307 11535
3928 11535 -458 -7944 -11544 -7835 -5425 -7330 -1063 6757 2839 -9265 -5122 -11957 -27558 -25989
3914 -25989 -8189 -13416 -12183 -5138 -12133 -37030 -26046 -12256 -3069 -7596 -4505 -3745 -5965 -1919
3900 -1919 8679 9133 8273 9543 3204 15141 12217 -12894 -26229 -27037 -15839 1519 7780 5534
3886 5534 6909 8456 1000 5363 6660 -6293 -23817 -17683 -4339 7346 1116 -18202 -22603 -8250
3872 -8250 -2389 531 -13104 -11585 -5205 -4452 -98 1255 -12354 -21126 -12383 -450 -2213 -8704
3858 -8704 -19802 -21352 -21124 -7688 1417 8834 9161 1714 -9931 -8317 -13037 -19149 -20208 -8841
3844 -8841 862 -5756 -19096 -28280 -33346 -33758 -3224 9636 14227 7494 -5562 -10306 -6558 -2005
$$ packed form
3942G339J0174j2680o580N431m589r679j920K7o414j0735j666J1927K1672R228
3928A1535j1993p486l600L709K410j905O267P820l918j2104M143o835j5601J569
3914b5989J7800n227J233P045o995k4897J0984J3790R187m527L091P60k220M046
3900a919J0598M54q60J270o339J1937k924k5111j3335q08J1198J7358O261k246
3886E534J375J547p456M363J297j2953j7524O134J3344J1685o230j9318m401J4353
3872h250N861K920j3635J519O380P53M354J353j3609q772Q743J1933j763o491
3858h704j1098j550K28J3436R105P417L27p447j1645J614m720o112j059J1367
3844h841R703o618j3340r184n066m12L0534J2860M591o733j3056m744L748M553
$$ plain form
3830 -2005 -7579 -17581 -18273 -15773 -21640 -21554 -14727 -21124 -10720 -7873 -13936 -14795 -4226 6629 2723
3815 2723 9975 17573 6050 -6336 1613 -10055 -20539 -14653 -10548 -5335 8552 -2073 -15262
3802 -15262 -22519 -21292 -12622 -11896 -16808 -11958 2684 10907 2888 -6245 -6386 -6102 -9722 -12068 -9136
3787 -9136 3255 1685 -6092 -2961 2392 -798 -2328 -17874 -18867 -17982 -16551 -16229 -13405 -1778 1185
3772 1185 3329 6196 14130 19859 11445 563 -7629 -6184 7543 10064 3899 841 -3066 -5845
3758 -5845 -1731 6368 6494 11852 6094 5500 11441 -2904 1659 6511 11296 17144 9131 7837 2243
3743 2243 280 83 -4178 -3861 -5807 -5702 -3510 -9106 -12484 -14688 -12587 -13769 -19646 -24212 -19801 -29137
3727 -29137 -20683 -17660 -14554 -13099 -8006 -10061 -18072 -13161 -7258 -22560 -35088 -37168 -33260 -25284
$$ packed form
3830b005n574j0002o92K500n867Q6O827o397J0404K847o063q59J0569J0855l906
3815B723P252P598j1523j2386P949j1668j0484N886M105N213J3887j0625j3189
3802a5262p257J227Q670P26m912M850J4642Q223q019r133j41K84l620k346K932
3787i136J2391j570p777L131N353l190j530j5546r93Q85J431L22K824J1627K963
3772A185K144K867P934N729q414j0882q192J445J3727K521o165l058l907k779
3758e845M114Q099J26N358n758n94N941j4345M563M852M785N848q013j294n594
3743B243j963j97m261L17j946J05K192n596l378k204K101j182n877m566M411r336
3727b9137Q454L023L106J455N093k055q011M911N903j5302j2528k080L908P976
$$ plain form
3713 -25284 -27095 -15299 -7471 974 -4533 1289 7558 -4971 -2312 5791 -1406 -12232 -22848 -27050
3699 -27050 -12666 -9625 -16474 -12200 -14202 -18319 -27950 -19157 -8829 -1724 -2468 -1813 8606 24626
3685 24626 13178 7615 -760 3871 10269 -2582 -4079 -1140 -3717 -6435 -14273 -6424 -11314 -12737
3671 -12737 -1246 25012 26797 18740 -642 3875 -3017 -11751 -23239 -25523 -25327 -18071 -23167 -18167
3657 -18167 3026 15391 13292 682 -4390 -2164 -3937 -18905 -21220 -11570 -1445 6471 9497
3644 9497 98 15022 15904 -2979 -12731 -7039 -7029 8484 21777 22004 11272 -7284 -25117 -18326
3630 -18326 743 7154 7346 -74 -1983 -130 -1325 -3204 2588 1120 -3371 -8899 -11411 -12542 -5949
3615 -5949 -841 -8641 -19186 -9595 -517 -3904 -3747 -12535 -18971 -21815 -17681 -9717 -2892 -4257 -5267
$$ packed form
3713b5284j811J1796P828Q445n507N822O269j2529K659Q103p197j0826j0616m202
3699b7050J4384L041o849M274k002m117r631Q793J0328P105p44O55J0419J6020
3685B4626j1448n563q375M631O398j2851j497K939k577k718p838P849m890j423
3671a2737J1491K6258J785q057j9382M517o892q734j1488k284J96P256n096N000
3657a8167K1193J2365k099j2610n072K226j773j4968k315R650J0125P916L026
3644I497r399J4924Q82j8883r752N692J0J5513J3293K27j0732j8556j7833O791
3630a8326J9069O411J92p420j909J853j195j879N792j468m491n528k512j131O593
3615e949N108p800j0545R591R078l387J57q788o436k844M134P964O825j365j010
$$ plain form
3600 -5267 -10711 -7554 -798 4087 -3360 -1468 -12156 -14158 -16699 -15430 -2626 -6317 -14353 -15346 -20298
3585 -20298 -32289 -30294 -11187 -17089 -27029 -16251 -12126 -23874 -27318 -18226 -13929 -13571 -15211 -13896
3571 -13896 7178 18505 9903 14934 6784 1862 -16700 -29811 -22747 -11850 851 18231 24820
3558 24820 20549 18876 14798 13457 -2303 -11468 -32784 -43769 -34704 -28022 -12305 -20052 -27291 -31972
3544 -31972 -28466 -30797 -30581 -26616 -13977 -11602 -11758 -11221 -9714 -6865 -14398 -4094 -803 7484 349
3529 349 -8151 -12403 -17231 -13346 -15214 -31540 -34371 -25118 -21619 -16089 -25497 -30588 -44732 -44505 -37050
3514 -37050 -33925 -33347 -32740 -27593 -25692 -49804 -39311 -16588 -6903 -12069 -11202 2029 -6486 -2274
3500 -2274 -8683 -9772 -6002 -13770 -21558 -15976 -16519 -15541 -6300 4714 -6085 -14507 -15294 -11978 1968
$$ packed form
3600e267n444L157O756M885p447J892j0688k002k541J269J2804l691q036r93m952
3585b0298j1991J995J9107n902r940J0778M125j1748l444R092M297L58j640J315
3571a3896K1074J1327q602N031q150m922j8562j3111P064J0897J2701J7380O589
3558B4820m271j673m078j341j5760r165k1316j0985R065O682J5717p747p239m681
3544c1972L506k331K16L965J2639K375j56N37J507K849p533J0304L291Q287p135
3529C49q500m252m828L885j868j6326k831R253L499N530r408n091j4144K27P455
3514c7050L125N78O07N147J901k4112J0493K2723R685n166Q67J3231q515M212
3500b274o409j089L770p768p788N582n43R78R241J1014j0799q422p87L316J3946
$$ plain form
3485 1968 1837 2323 8485 11791 10002 11658 23334 24686 14439 6888 6297 1463 -7771 -3798 711
3470 711 -11824 -17592 -7904 -13708 -18145 -16181 -23399 -3630 5391 3250 11184 18168 -1087 -6158
3456 -6158 -8882 -16848 -22180 -20519 -23324 -19228 -27893 -33722 -30280 -27484 -20971 -4060 19795 27000
3442 27000 18266 6637 -3204 -10556 -13871 -8432 -10259 1421 8253 7455 4905 3102 4082 2019 24
3427 24 -2213 -2995 -7614 -7128 -746 -6194 -17280 -19098 -8184 8392 5011 5464 -2558 -12451 -8946
3412 -8946 10189 6101 5105 12584 15953 13261 -512 -2503 -353 -3903 -4881 -3095 9954 8628 6035
3397 6035 -8060 3995 6013 13028 13159 -15535 -26670 -16496 -13278 -10044 8447 23080 18395
3384 18395 17110 -7509 -19117 -31764 -32138 -19444 -9600 -22820 -25578 -24049 -25967 -23692 -17134 -5075
$$ packed form
3485A968j31M86O162L306j789J656J1676J352j0247p551n91m834r234L973M509
3470G11j2535n768R688n804m437J964p218J9769R021k141P934O984j9255n071
3456f158k724p966n332J661k805M096q665n829L442K796O513J6911K3855P205
3442B7000q734j1629r841p352l315N439j827J1680O832p98k550j803R80k063j995
3427B4k237p82m619M86O382n448j1086j818J0914J6576l381M53q022r893L505
3412h946J9135m088r96P479L369k692j3773j991K150l550r78J786J3049j326k593
3397F035j4095J2055K018P015J31k8694j1135J0174L218L234J8491J4633m685
3384A8395j285k4619j1608j2647l74J2694R844j3220k758J529j918K275O558J2059
$$ plain form
3370 -5075 4597 -6624 -29109 -29439 -25100 -15410 -13902 -20979 -24511 -4710 10550 4373 -6352 -10344
3356 -10344 -10301 -18838 -25461 -11701 -3224 -3993 -11812 -17564 -18125 -7599 -9066 -4980 -1411 1580 -3591
3341 -3591 -7891 -12142 -14802 -10797 -4507 -7572 1440 -3826 -17549 -12624 -16164 -10042 -4025 -11602 -15046
3326 -15046 -15943 -5003 -4099 -6665 -1625 -2973 -7314 3219 3576 -10158 -18967 -1904 5682 4163
3312 4163 -14056 -24684 -8606 3732 4752 -384 -17194 -25349 -37984 -32872 -6685 9821 10544
3299 10544 7218 -7512 -10586 -10637 -24717 -23267 -28234 -23812 -18862 -12949 -4392 -16899 -33103 -34889
3285 -34889 -30497 -20333 -11873 -7431 4798 -4657 -7741 -616 -16684 -33727 -30571 -22319 -7999
3272 -7999 -2009 -8 -1347 -863 -3148 -5233 -5971 -23785 -38947 -28987 -17782 -13600 -22597 -13092 -5833
$$ packed form
3370e075R672j1221k2485l30M339R690J508p077l532J9801J5260o177j0725l992
3356a0344M3q537o623J3760Q477p69p819n752n61J0526j467M086L569K991n171
3341c591m300m251k660M005O290l065R012n266j3723M925l540O122O017p577l444
3326a5046q97J0940R04k566N040j348m341J0533L57j3734q809J7063P586j519
3312D163j8219j0628J6078J2338J020n136j6810q155j2635N112K6187J6506P23
3299A0544l326j4730l074n1j4080J450m967M422M950N913Q557j2507j6204j786
3285c4889M392J0164Q460M442J2229r455l084P125j6068j7043L156Q252J4320
3272g999N990K001j339M84k285k085p38j7814j5162R960J1205M182q997R505P259
$$ plain form
3257 -5833 -4975 13724 16549 12838 19071 3300 3039 8753 9814 6738 8531 3055 3736 3734 4735 14147
3241 14147 7218 4039 5756 12510 13743 8049 -393 1318 -224 -16495 -13730 -102 -8141 -6466
3227 -6466 -14927 -12098 1837 6929 8493 2370 14349 15486 9873 62 -5597 -14675 -9149 -8297 -16992
3212 -16992 -25348 -22061 -11013 -18568 -25920 -25964 -12411 -18300 -18233 -30188 -20349 -7219 -4052 -2016 55
3197 55 -5999 -10408 -15090 -16481 -22814 -21344 -8801 780 -2261 6554 3220 13280 15237 477 -936
3182 -936 3620 -2669 6606 5577 -2232 7702 -4220 -7373 -9743 -24688 -22714 -17729 -8889 -4327 608
3167 608 6303 545 9633 4343 -5761 -4114 -4309 4487 6673 17382 6568 5434 -8893 -16333
3153 -16333 -21709 -8053 1407 6179 9338 12588 17840 28877 11045 -2233 -9729 -20519 -17292
$$ packed form
3257e833Q58J8699K825l711O233j5771k61N714J061l076J793n476O81kJ001R412
3241A4147o929l179J717O754J233n694q442J711j542j6271K765J3628q039J675
3227f466q461K829J3935N092J564o123J1979J137n613r811n659r078N526Q52q695
3212a6992q356L287J1048p555p352m4J3553n889O7j1955R839J3130L167K036K071
3197E5o054m409m682j391o333J470J2543R581l041Q815l334J0060J957j4760j413
3182i36M556o289R275j029p809R934j1922l153k370j4945J974M985Q840M562M935
3167F08N695n758R088n290j0104J647j95Q796K186J0709j0814j134j4327p440
3153a6333n376J3656R460M772L159L250N252J1037j7832j3278p496j0790L227
$$ plain form
3140 -17292 -444 8804 -2754 -26716 -39079 -30092 -22927 -14570 -2337 -906 -4751 -14328 -17171
3127 -17171 -14348 -8495 3267 18886 34876 19681 7459 -6226 -8623 5192 15182 -6883 -11310
3114 -11310 -6140 -14318 -23700 -14634 6197 9456 12217 20779 -1383 -12006 -12510 -10192 -14077 -9504
3100 -9504 -3820 1976 -8721 -12961 -15866 -2538 -9894 -9250 -10883 -22641 -20501 -19815 -25340 -22676 -16928
3085 -16928 -15985 -18878 -4494 1453 -7624 -28263 -23914 -18884 -22903 -23922 -6885 -1831 -15593 -10316
3071 -10316 11866 23311 29997 24168 13672 8413 1425 -15509 -25818 -25173 -14275 -6504 -3701
3058 -3701 -2646 -11910 -19690 -15496 -10448 -6209 -227 -11537 -11134 -7811 -628 6556 -8662 -18355 -20720
3043 -20720 -16264 -8625 -11626 -18996 -16981 -15081 -17682 -7972 -5872 -6210 -5065 -4545 -3683 2079 19787
$$ packed form
3140a7292J6848R248j1558k3962j2363Q987P165Q357J2233J431l845r577k843
3127a7171K823N853J1762J5619J5990j5195j2222j3685k397J3815R990k2065m427
3114a1310N170q178r382R066K0831L259K761Q562k2162j0623n04K318l885M573
3100i504N684N796j0697m240k905J3328p356O44j633j1758K140O86n525K664N748
3085a6928R43k893J4384N947r077k0639M349N030m019j019J7037N054j3762N277
3071a0316K2182J1445O686n829j0496n259o988j6934j0309O45J0898P771K803
3058c701J055r264p780M194N048M239N982j1310M03L323P183P184j5218r693k365
3043b0720M456P639l001p370K015J900k601R710K100l38J145N20Q62N762J7708
$$ plain form
3028 19787 20376 9254 9999 2724 -13708 4186 1314 -3978 -11170 -2402 -7991 -12905 -1430 6998
3014 6998 10139 25683 33148 33335 32471 18332 4695 -9094 -15458 -21501 -27796 -15790 -7600 -670
3000 -670 -1462 -4600 -5233 -2053 -10966 -15584 -11024 -4998 -10379 -22858 -19910 -16639 -12799 -22727 -16589
2985 -16589 -15516 -6198 15549 -1489 -11907 -21729 -15792 -854 -357 1861 -2815 294 4827 1264
2971 1264 -1569 -2210 -16412 -26888 -25389 -15181 -7160 -867 12815 2249 4627 16762 13195 2546
2957 2546 -10558 1657 3270 -7250 1205 6531 -4909 -11664 -12346 3542 5838 3035 4451 -3538
2943 -3538 -8626 -252 -404 -8853 -1419 5954 -8001 -4365 -3084 -13899 -25970 -35509 -26714 -8889
2929 -8889 4539 11656 -3910 -11179 -15043 -6992 1089 -803 3055 -4217 -11336 -21859 -21139 -2538
$$ packed form
3028A9787N89j1122P45p275j6432J7894k872n292p192Q768n589m914J1475Q428
3014F998L141J5544P465J87q64j4139j3637j3789o364o043o295J2006Q190O930
3000f70p92l138o33L180q913m618M560O026n381j2479K948L271L840r928O138
2985a6589J073R318K1747j7038j0418r822N937J4938M97K218m676L109M533l563
2971A264k833o41j4202j0476J499J0208Q021O293J3682j0566K378J2135l567j0649
2957B546j3104J2215J613j0520Q455N326j1440o755o82J5888K296k803J416p989
2943c538n088Q374j52q449P434P373j3955L636J281j0815j2071r539Q795J7825
2929h889J3428P117j5566p269l864Q051Q081j892L858p272p119j0523P20J8601
$$ plain form
2915 -2538 -3021 -8149 -12061 -12939 -5597 -148 -6296 -6600 725 3577 6521 -2286 -10661 -14827 -6533 -3350
2899 -3350 -10544 -14130 -10864 -11776 -15551 -12908 -5996 -15889 -16285 101 7701 9247 8196 -3377 -2151
2884 -2151 1915 11007 6591 -6855 -12449 4684 19882 12387 -1683 -13489 -4440 -7866 -2995 -7513
2870 -7513 -22677 -21756 -6236 243 8452 5029 6590 -422 -2692 5836 2149 1570 9129 9061 124
2855 124 2710 9320 579 -2773 -5321 -6686 -8168 -11709 -13407 -16195 -14436 7826 23328 20146 860
2840 860 -3721 -4430 -640 -305 1717 -4134 -7628 -13703 -9369 -12 4343 12546 16348 5908 181
2825 181 -6150 -1755 -6670 -3563 5033 10219 8864 2310 -11307 -13695 -16750 -9788 1101 2283 -1410
2810 -1410 -1290 1151 -2814 -6462 -6995 -15774 -8436 -6861 -7654 -11588 -13120 -17528 -15667 -9883 -6390 -393
$$ packed form
2915b538m83n128l912q78P342N449o148l04P325K852K944q807q375m166Q294L183
2899c350p194l586L266r12l775K643O912r893l96J6386P600J546j051j1573J226
2884b151M066R092m416j3446n594J7133J5198p495j4070j1806R049l426M871m518
2870g513j5164R21J5520O479Q209l423J561p012k270Q528l687n79P559o8q937
2855A24K586O610q741l352k548j365j482l541j698k788J759K2262J5502l182j9286
2840H60m581p09L790L35K022n851l494o075M334R357M355Q203L802j0440n727
2825A81o331M395m915L107Q596N186j355o554j3617k388l055O962J0889J182l693
2810a410J20K441l965l648n33q779P338J575p93l934j532m408J861N784L493N997
$$ plain form
2794 -393 4904 8606 5571 2206 -306 -12922 -16511 -16687 -7732 961 7025 4827 -14745 -16829 -12379
2779 -12379 -9923 -8662 1890 -3226 -7374 -6554 -14539 -27620 -26162 -12557 -14525 -5663 -1145 -836
2765 -836 1962 5441 573 -11475 -22254 -2702 20551 17298 12989 16049 14838 9937 13254 13374
2751 13374 -5107 -6718 3020 3480 9194 12860 10137 15472 13934 16469 11008 10027 7175 -70 -3846
2736 -3846 -20245 -32061 -25354 -26642 -16741 5166 23469 26145 16920 -7753 -13780 -9584 1646
2723 1646 411 2011 -15030 -23400 -16600 -12045 1352 -4244 -13227 -12078 317 4498 1142 -3241
2709 -3241 -10694 -5486 -249 -6323 -21584 -15033 -10943 -5143 -3986 -7852 -2292 -16976 -19914 -9508
2695 -9508 298 -973 19715 26998 16376 1193 -18384 -26166 -25440 -14556 -7136 -9564 -7453 -2180
$$ packed form
2794c93N297L702l035l365k512j2616l589j76Q955Q693O064k198j9572k084M450
2779a2379K456J261J0552n116m148Q20p985j3081J458J3605j968Q862M518L09
2765h36K798L479m868j2048j0779J9552K3253l253m309L060j211m901L317J20
2751A3374j8481j611R738M60N714L666k723N335j538K535n461r81k852p245l776
2736c846j6399j1816O707j288R901K1907J8303K676r225k4673o027M196J1230
2723A646j235J600j7041q370O800M555J3397n596q983J149J2395M181l356m383
2709c241p453N208N237o074j5261O551M090N800J157l866N560j4684k938J0406
2695i508R806j271K0688P283j0622j5183j9577p782P26J0884P420k428K111N273
$$ plain form
2681 -2180 -8306 -7076 -21404 -23352 -9515 -4285 -6141 -13014 -20803 -12553 -9642 -2058 -5354 -10334
2667 -10334 7543 17529 3366 -5597 2609 -15074 -15219 -10663 -13231 -4909 -8310 -5022 4701 3951
2653 3951 8975 4485 -8134 4853 9460 -10851 -23347 -22608 -23464 -32898 -18995 -7970 -9346 -20086
2639 -20086 -12569 -10195 -1767 -10571 -24019 -9564 -5552 -985 6863 10578 -10046 -15077 -16698 -13464
2625 -13464 -17777 -21086 -21083 -30303 -37419 -37487 -25116 -13679 -2492 -8748 -6325 3860 3338 -2650 15609
2610 15609 17226 9601 -6249 -29348 -21775 -905 2601 -5980 -5086 2213 4599 8615 14849 13239
2596 13239 5840 9594 -2222 -12950 -5890 -5079 -6289 -6070 690 9311 -2747 -14306 -20696 -18669
2582 -18669 -12973 -7730 -6217 -815 1535 -10882 -20841 -15812 -16042 -14646 -22220 -21715 -13699 -15676 -26598
$$ packed form
2681b180o126J230j4328j948J3837N230j856o873p789Q250K911P584l296m980
2667a0334J7877R986j4163q963Q206j7683j45M556k568Q322l401L288R723p50
2653C951N024m490j2619J2987M607k0311j2496P39q56r434J3903J1025j376j0740
2639b0086P517K374Q428q804j3448J4455M012M567P848L715k0624n031j621L234
2625a3464m313l309Lr220p116o8J2371J1437J1187o256K423J0185n22n988J8259
2610A5609J617p625j5850k3099P573K0870L506q581Q94P299K386M016O234j610
2596A3239p399L754j1816j0728P060Q11j210K19O760Q621j2058j1559o390K027
2582a8669N696N243J513N402K350j2417r959N029k30J396p574N05Q016j977j0922
$$ plain form
2567 -26598 -17814 -9206 924 6377 -2638 -7689 2487 5973 8689 -7811 -25947 -12798 1117
2554 1117 -6739 -14271 -11073 -1437 1695 3968 -5578 -3472 -10027 -15473 -265 8232 15668 25033 21008
2539 21008 10419 12199 16041 6911 -7022 -10221 -4681 -753 -15809 -18723 -18570 -2897 1183 -5693
2525 -5693 -5460 -10475 -6604 -13574 -14263 -25915 -28103 -16059 9208 17557 20473 33511 29695 18835
2511 18835 -3350 -16643 -17870 -15596 -10788 2160 17795 21996 15793 5604 -6118 -18390 -5632
2498 -5632 2513 5668 -4128 -17393 -14291 -17327 -16772 -22338 -30968 -14954 -6739 -18531 -13367 -1776
2484 -1776 -7023 -8147 -3805 -2813 7313 10108 8748 4272 4385 8758 4198 -9757 -11137 -10847 -4294
2469 -4294 2156 -14244 -23605 -22823 -11571 5645 10250 12650 11685 -9281 -18544 -19844 -3177 8893
$$ packed form
2567b6598Q784Q608J0130N453r015n051J0176L486K716j6500j8136J3149J3915
2554A117p856p532L198R636L132K273r546K106o555n446J5208Q497P436R365m025
2539B1008j0589J780L842r130j3933l199N540L928j5056k914J53J5673M080o876
2525e693K33n015L871o970o89j1652k188J2044K5267Q349K916J3038l816j0860
2511A8835k2185j3293j227K274M808J2948J5635M201o203j0189j1722j2272J2758
2498e632Q145L155r796j3265L102l036N55n566q630J6014Q215j1792N164J1591
2484a776n247j124M342R92J0126K795j360m476J13M373m560j3955j380K90O553
2469d294O450j6400r361P82J1252J7216M605K400r65k0966r263j300J6667J2070
$$ plain form
2455 8893 4271 -7344 -877 1261 492 -2359 -14157 -13468 -18188 -10095 13861 14593 19833 12133 45
2440 45 -737 -3721 -3840 -4766 -4328 -6433 -12659 -11053 -8375 -5569 7078 13868 229 -1988 10016 16256
2424 16256 10820 11661 8835 15493 20588 12934 4468 8060 -816 -17875 -12835 -10538 -27338 -22167
2410 -22167 -19843 -20069 -20099 -15644 661 42 -12910 3457 5188 14246 1600 -6341 -11994 -2173 3525
2395 3525 15609 13516 -3620 -9310 -3701 -8806 -8788 -9646 -19315 -26284 -22881 -21170 -23582 -12795 -5485
2380 -5485 -735 3585 -5752 -3285 -11344 -19113 -16867 1733 10347 23611 25276 14936 15714 13182
2366 13182 15828 -1984 -4311 -282 8806 15162 604 -200 6742 5145 1891 -3356 2042 1794 871
2351 871 -2111 4916 11561 11035 15282 6704 -474 9438 12288 872 -16910 -23539 -23642 -19299 -18659
$$ packed form
2455H893m622j1615O467K138p69k851j1798O89m720Q093K3956P32N240p700j2088
2440D5p82k984j19r26M38k105o226J606K678K806J2647O790j3639k217J2004O240
2424A6256n436Q41k826O658N095p654q466L592q876j7059N040K297j6800N171
2410b2167K324k26l0M455J6305o19j2952J6367J731R058j2646p941n653R821N698
2395C525J2084k093j7136n690N609n105J8q58r669o969L403J711k412J0787P310
2380e485M750M320r337K467q059p769K246J8600Q614J3264J665j0340P78k532
2366A3182K646j7812k327M029R088O356j4558q04O942j597l254n247N398k48r23
2351H71k982P027O645n26M247q578p178R912K850j1416j7782o629j03M343O40
$$ plain form
2336 -18659 -10766 -12982 -8186 -13925 -14532 -9137 3170 4440 5246 -1512 -39 6046 1840 7635 -1715
2321 -1715 -7111 6451 13394 20820 14585 97 -3620 -4420 -15756 -5005 -7976 -10902 -12898 -10715
2307 -10715 -7480 -8892 -7962 -11606 -10674 -2446 -10953 -17200 -16968 -14186 -7406 10125 12523 4590 7429
2292 7429 -3444 -3660 3136 2972 1758 4756 -112 -15454 -14444 -5089 -11524 -7974 2795 13268
2278 13268 18568 21385 13882 21112 13791 8103 13096 15955 5416 1857 -2738 2777 4019 1253
2264 1253 -3112 -2739 -13349 -4801 4558 14271 4624 -7230 -9152 930 6428 -7557 -15385 -22939
2250 -22939 -11588 -5193 -13300 -22259 -25718 -21794 -7960 -733 6966 8966 422 -9470 -11173 -9789
2236 -9789 1021 9478 14383 10685 -1233 -1542 4465 -2324 -10114 -8893 -4603 -3273 7904 9188
$$ packed form
2336a8659P893k216M796n739o07N395J2307J270Q06o758J473O085m206N795r350
2321a715n396J3562O943P426o235j4488l717q00j1336J0751k971k926j996K183
2307a0715L235j412R30l644R32Q228q507o247K32K782O780J7531K398p933K839
2292G429j0873k16O796j64j214K998m868j5342J010R355o435L550J0769J0473
2278A3268N300K817p503P230p321n688M993K859j0539l559m595N515J242k766
2264A253m365L73j0610Q548R359R713r647j1854j922J0082N498j3985p828p554
2250b2939J1351O395q107q959l459L924J3834P227P699K000q544r892j703J384
2236i789J0810Q457M905l698j1918l09O007o789p790J221M290J330J1177J284
$$ plain form
2222 9188 -195 -14044 -16214 -2622 15176 26806 30486 24747 17017 9290 6334 16092 3729 -14159
2208 -14159 -21037 -24148 -13115 -13427 -15357 -12730 -7204 -3811 -6761 -4563 5627 1282 2485 11525
2194 11525 13739 4407 -4128 8917 19824 8369 475 8306 11369 -5356 3407 10116 5365 -2504
2180 -2504 -22402 -20515 -21179 -17003 -23780 -14378 4117 10665 482 -13059 -17430 -11384 -5040 -4293
2166 -4293 -6582 -1180 4377 6390 11138 7883 10660 6677 1076 5848 11389 17690 8601 -13265 -23536
2151 -23536 -3437 22422 21749 -5540 -5324 6511 -136 -13603 -20498 -9367 2575 8203 4344
2138 4344 -7257 -11952 -19213 -14446 -5097 -7070 -9429 -15042 -15083 -16790 -17586 -16125 -15748 -7943 104 -14968
2122 -14968 -20988 -11530 -11591 -13687 -19123 -17717 -17254 -16901 -12768 -14301 -15624 -11631 -4763 9234 7238
$$ packed form
2222I188r383j3849k170J3592J7798J1630L680n739p730p727k956R758j2363j7888
2208a4159o878l111J1033l12j930K627N526L393k950K198J0190m345J203R040
2194A1525K214r332q535J3045J0907j1455p894P831L063j6725Q763O709m751p869
2180b504j9898J887o64M176o777R402J8495O548j0183j3541m371O046O344P47
2166d293k289N402N557K013M748l255K777l983n601M772N541O301r089k1866j0271
2151b3536K0099K5859o73k7289K16J1835o647j3467o895J1131J1942N628l859
2138D344j1601m695p261M767R349j973k359n613m1j707p96J461L77P805Q047j5072
2122a4968o020R458o1k096n436J406M63L53M133j533j323L993O868J3997j996
$$ plain form
2107 7238 12468 9603 3556 11709 19231 15934 15924 10889 1576 -2776 -1213 -1600 -11762 -10725 -7546
2092 -7546 12148 13505 11145 13653 10573 7398 6728 -296 -2703 -2076 -4559 -7567 2096 12148 7113
2077 7113 -5011 -17586 -28094 -33834 -24527 -5310 -2657 -6707 -8166 -8621 3221 1471 1275 -8075
2063 -8075 -13318 -13921 -13450 -15210 -3937 -1135 7276 -4342 -11332 -12099 -15981 -19029 -22044 -24634 -31105
2048 -31105 -35214 -24233 -14574 -10743 -8986 -13867 -1892 6032 10277 10 -7164 -10951 -16566 -20818
2034 -20818 -10159 16049 3392 -2262 8683 3490 -13198 -9776 -1701 1814 4703 -11043 -13296
2021 -13296 -17235 -12627 -11298 6807 7172 -2064 -7307 -14133 -13576 -4880 11357 3257 8509 9875 11159
2006 11159 19168 25798 22124 11573 5488 1020 -14333 -17360 -13980 -16558 -9554 -7223 -7339 -11985
$$ packed form
2107G238N230k865o047Q153P522l297j0n035r313m352J563l87j0162J037L179
2092g546J9694J357k360K508l080l175o70p024k407O27k483l008R663J0052n035
2077G113j2124j2575j0508n740R307J9217K653m050j459m55J1842j750j96r350
2063h075n243o03M71j760J1273K802Q411j1618o990p67l882l048l015k590o471
2048c1105m109J0981R659L831J757m881J1975P924M245j0267p174l787n615m252
2034b0818J0659K6208j2657n654J0945n193j6688L422Q075L515K889j5746k253
2021a3296l939M608J329J8105L65r236n243o826N57Q696J6237q100N252J366J284
2006A1159Q009O630l674j0551o085m468j5353l027L380k578P004K331j16m646
$$ plain form
1992 -11985 -15275 -13464 -2165 13331 18659 24700 16978 -3900 -12895 -5825 -1289 6172 9326 13080
1978 13080 7916 -4150 6805 18897 13963 -1925 -2600 4026 9575 11882 8632 -4119 -9243 2718
1964 2718 -1724 13116 30326 20315 -2971 -9354 -7873 -17189 -4093 -4741 -11925 534 647 -8577
1950 -8577 -7181 -202 -2020 -14146 -12463 -7328 5157 13627 4348 -3512 -4003 -7995 -15454 -3077
1936 -3077 16546 21600 9709 -1858 -18676 -9503 -11755 -7621 -3919 -9626 2432 17985 20153
1923 20153 11985 8087 14893 14356 267 -108 -6729 -5917 -2292 -3919 -13290 10726 14558 22370 22574
1908 22574 12981 7932 16336 21292 16826 12294 10392 10385 9158 4113 3824 1643 -2704 -6414 -6938 -12235
1892 -12235 -10309 -17431 -17803 -21467 -13248 -14204 -9628 -3524 1693 10136 16096 25030 24719 25642 22476 13241
$$ packed form
1992a1985l290J811J1299J5496N328O041p722k0878q995P070M536P461L154L754
1978A3080n164j2066J0955J2092m934j5888o75O626N549K307l250j2751n124J1961
1964B718m442J4840J7210j0011k3286o383J481r316J3096o48p184J2459J13r224
1950h577J396O979j818j2126J683N135J2485Q470r279p860m91l992p459J2377
1936c077J9623N054j1891j1567j6818R173k252M134L702n707J2058J5553K168
1923B0153q168l898O806n37j4089l75o621Q12L625j627r371K4016L832P812K04
1908B2574r593n049Q404M956m466m532j902pj227n045k89k181m347l710n24n297
1892a2235J926p122l72l664Q219r56M576O104N217Q443N960Q934l11R23l166r235
$$ plain form
1876 13241 8708 3957 17043 20951 19709 19579 29834 22081 14626 574 -3640 -9325 -15366 -15875
1862 -15875 -15280 -11484 -7727 611 7254 4466 -7453 -9109 -7017 -856 -3076 -208 9216 17873 23555
1847 23555 34756 27974 26385 30252 30208 21670 35846 37641 13065 -1892 -1921 789 9269 9194 4971
1832 4971 11112 12421 5130 3855 9690 7632 9884 9159 4503 4877 13079 14330 6228 6243 5078 -2733
1816 -2733 5048 17609 18228 11620 13136 12117 8033 5903 332 -2169 -8027 262 9905 -1653 -4780
1801 -4780 4197 -4627 -10979 -6273 4407 12368 10171 1701 -110 -6950 -17498 -27573 -13457 -2722
1787 -2722 -582 -1019 -3716 -9251 -14827 -4400 -6894 -16799 -9970 -9061 -19650 -23180 -8797 -15694 -19874
1772 -19874 1626 -1892 -12993 -14555 -25408 -14699 -3601 -2082 -4511 -4553 -3341 -3159 -6738 -5189
$$ packed form
1876A3241m533m751J3086L908j242j30J0255p753p455j4052m214n685o041n09
1862a5875N95L796L757Q338O643k788j1919j656K092O161k220K868R424Q657N682
1847B3555J1201o782j589L867m4q538J4176J795k4576j4957k9K710Q480p5m223
1832D971O141J309p291j275N835k058K252p25m656L74Q202J251q102J5j165p811
1816b733P781J2561O19o608J516j019m084k130n571k501n858Q289R643j1558l127
1801d780Q977q824o352M706J0680P961k197q470j811o840j0548j0075J4116J0735
1787b722K140m37k697n535n576J0427k494r905O829R09j0589l530J4383o897m180
1772a9874K1500l518j1101j562j0853J0709J1098J519k429m2J212J82l579J549
$$ plain form
1758 -5189 8215 8202 12080 13768 9982 8230 10398 8163 8493 -8625 -17473 -10483 -2500 4627 -4031
1743 -4031 -11425 -498 175 2422 654 -10211 -6356 -6852 -5419 3168 -5881 -12181 3128 7716 14826
1728 14826 16642 19417 11924 -3464 -963 1598 2752 4439 13003 20216 16421 18296 23763 21554
1714 21554 -996 -12604 -7210 8692 15518 2561 -8304 -20197 -22318 -18174 -5725 15026 4931
1701 4931 -5169 -16159 -9837 -2493 2126 5946 2454 -3274 1136 9492 13152 13808 5520 7635 14463
1686 14463 25811 9206 7341 3544 -8694 -10957 -717 2094 14528 17699 14499 -4144 -2016
1673 -2016 6211 1026 -8637 -11865 -14645 -6264 3683 -254 -5013 -3010 10521 14172 12825 13242 18300
1658 18300 22028 22502 14297 20123 9174 3670 17648 14747 -246 -3715 -9537 -4393 5788 11850
$$ packed form
1758e189J3404j3L878J688l786j752K168k235L30j7118q848O990P983P127q658
1743d031p394J0927O73K247j768j0865L855m96J433Q587r049o300J5309M588P110
1728A4826J816K775p493j5388K501K561J154J687Q564P213l795J875N467k209
1714B1554k2550j1608N394J5902O826j2957j0865j1893k121M144J2449K0751j0095
1701D931j0100j0990O322P344M619L820l492n728M410Q356L660O56q288K115O828
1686A4463J1348j6605j865l797j2238k263J0240K811J2434L171l200j8643K128
1673b016Q227n185r663l228k780Q381R947l937m759K003J3531L651j347M17N058
1658A8300L728M74q205N826j0949n504J3978k901j4993l469n822N144J0181O062
$$ plain form
1644 11850 20586 7897 -9845 -5861 629 4940 5447 8754 11406 12372 8360 18503 14055 453
1630 453 -27038 -17397 -5380 6452 -785 -7416 7869 25534 33000 14386 9249 5121 -1217 -6772
1616 -6772 -226 7541 11291 5531 7813 5400 -478 -10868 -8106 -3419 -1778 -13941 -29504 -31868
1602 -31868 -24582 -7242 2779 3329 2484 12943 -636 -13709 -20006 -12114 -14979 -13463 3107 6723
$$ packed form
1644A1850Q736j2689j7742L984O490M311N07L307K652R66m012J0143m448j3602
1630D53k7491R641J2017J1832p237o631J5285J7665P466j8614n137m128o338n555
1616f772O546P767L750n760K282k413n878j0390K762M687J641j2163j5563k364
1602c1868P286J7340J0021N50q45J0459j3579j3073o297P892k865J516J6570L616
$$ [...]
##END NTUPLES=NMR SPECTRUM
##END=
