##TITLE=Analysis number 327690
Compound Code btb 10716
Book Reference 133805
Project Code adrs flro3
Chemist Name jom
##JCAMPDX= 6.0         $$ Bruker NMR JCAMP-DX V2.0
##DATA TYPE= NMR SPECTRUM
##DATA CLASS= NTUPLES
##ORIGIN= Bruker BioSpin GmbH
##OWNER= nmr
$$ XWIN-NMR		Version 3.5
$$ Mon Apr  2 09:09:18 2007 GMT Daylight Time (UT+1h)  MAYBRIDGE\nmr@NMR_250MHZ
##.OBSERVE FREQUENCY= 250.131544655141
##.OBSERVE NUCLEUS= ^1H
##.ACQUISITION MODE= SIMULTANEOUS (DQD)
##.ACQUISITION SCHEME= undefined
##.AVERAGES= 16
##.DIGITISER RES= 18
##SPECTROMETER/DATA SYSTEM= dpx250
##.PULSE SEQUENCE= zg30
##.SOLVENT NAME= DMSO
##.SHIFT REFERENCE= (INTERNAL, DMSO, 0, 16.522)
##AUDIT TRAIL= $$ (NUMBER, WHEN, WHO, WHERE, WHAT)
$$ ##TITLE= Audit trail, XWIN-NMR		Version 3.5
$$ ##JCAMPDX= 5.01
$$ ##ORIGIN= Bruker BioSpin GmbH
$$ ##OWNER= nmr
$$ C:\u/data/dgb/nmr/ADRS/10/pdata/1/auditp.txt
$$ ##AUDIT TRAIL=  $$ (NUMBER, WHEN, WHO, WHERE, WHAT)
(   1,<2007-04-02 09:08:38.92 +100>,<MAYBRIDGE\nmr>,<NMR_250MHZ>,
      <created by zg, POWCHK disabled, PULCHK disabled
       configuration hash MD5:
       49 4B E0 1D 92 C2 6B 37 9F E6 65 BC 52 41 86 1D
       data hash MD5: 64K
       02 BB 17 1B 3C F9 D3 A1 D0 7F C5 8C 15 FF 2C 76>)
(   2,<2007-04-02 09:09:05.43 +100>,<MAYBRIDGE\nmr>,<NMR_250MHZ>,
      <Start of raw data processing
       ef LB = 0.3 FT_mod = 6 PKNL = 1 SI = 32K 
       data hash MD5: 32K
       A3 A3 E6 31 1C FD DB A7 A4 04 59 DE 77 0B AA 09>)
(   3,<2007-04-02 09:09:07.18 +100>,<MAYBRIDGE\nmr>,<NMR_250MHZ>,
      <apk 
       data hash MD5: 32K
       44 BA 63 B0 89 4E A8 9C D7 D4 4B 09 2E 45 C4 72>)
(   4,<2007-04-02 09:09:08.01 +100>,<MAYBRIDGE\nmr>,<NMR_250MHZ>,
      <abs ABSG = 5 
       data hash MD5: 32K
       B8 13 B8 E1 36 70 6E B9 0F 5B 00 0C 90 9B 57 11>)
$$ ##END=
$$ 
$$ hash MD5
$$ 0A 40 98 33 ED 1F 74 23 BD 88 74 45 AB 33 D1 F2
##$RELAX= 
##$RELAX= 
##$RELAX= 
##$RELAX= 
##$RELAX= 
##$RELAX= 
##$RELAX= 
$$ Bruker specific parameters
$$ --------------------------
##$DU= <C:\u>
##$EXPNO= 10
##$NAME= <ADRS>
##$PROCNO= 1
##$TYPE= <nmr>
##$USER= <dgb>
##$AMP= (0..31)
100 100 100 100 100 100 100 100 100 100 100 100 100 100 100 100 100 100 
100 100 100 100 100 100 100 100 100 100 100 100 100 100 
##$AQSEQ= 0
##$AQ_mod= 3
##$AUNM= <au_zg>
##$AUTOPOS= <3 >
##$BF1= 250.13
##$BF2= 250.13
##$BF3= 250.13
##$BF4= 250.13
##$BF5= 500.13
##$BF6= 500.13
##$BF7= 500.13
##$BF8= 500.13
##$BYTORDA= 1
##$CFDGTYP= 0
##$CFRGTYP= 5
##$CHEMSTR= <none>
##$CNST= (0..31)
1 1 145 1 1 1 1 1 1 1 1 1 1 1 1 1 1 1 1 1 1 1 1 1 1 1 1 1 1 1 1 1 
##$CPDPRG= <>
##$CPDPRG1= <>
##$CPDPRG2= <>
##$CPDPRG3= <>
##$CPDPRG4= <mlev>
##$CPDPRG5= <mlev>
##$CPDPRG6= <mlev>
##$CPDPRG7= <mlev>
##$CPDPRG8= <mlev>
##$CPDPRGB= <>
##$CPDPRGT= <>
##$D= (0..31)
0 1 0 0 0 0 0 0 0 0.06 0 0 0 0 0 0 0.0002 0 0 0 0 0 0 0 0 0 0 0 0 0 0 
0 
##$DATE= 1175501312
##$DBL= (0..7)
120 120 120 120 120 120 120 120 
##$DBP= (0..7)
150 150 150 150 150 150 150 150 
##$DBP07= 0
##$DBPNAM0= <>
##$DBPNAM1= <>
$$ [...]
##$SUBNAM7= <"">
##$SUBNAM8= <"">
##$SUBNAM9= <"">
##$SW= 20.6930455092707
##$SWIBOX= (0..15)
0 0 3 0 0 0 0 0 0 0 0 0 0 0 0 0 
##$SW_h= 5175.983436853
##$TD= 65536
##$TD0= 1
##$TE= 683.16
##$TE2= 300
##$TE3= 300
##$TEG= 300
##$TL= (0..7)
0 120 120 120 120 120 120 120 
##$TP= (0..7)
150 150 150 150 150 150 150 150 
##$TP07= 0
##$TPNAME0= <>
##$TPNAME1= <>
##$TPNAME2= <>
##$TPNAME3= <>
##$TPNAME4= <>
##$TPNAME5= <>
##$TPNAME6= <>
##$TPNAME7= <>
##$TPOAL= (0..7)
0.5 0.5 0.5 0.5 0.5 0.5 0.5 0.5 
##$TPOFFS= (0..7)
0 0 0 0 0 0 0 0 
##$TUNHIN= 0
##$TUNHOUT= 0
##$TUNXOUT= 0
##$USERA1= <user>
##$USERA2= <user>
##$USERA3= <user>
##$USERA4= <user>
##$USERA5= <user>
##$V9= 5
##$VALIST= <valist>
##$VCLIST= <CCCCCCCCCCCCCCC>
##$VD= 0
##$VDLIST= <DDDDDDDDDDDDDDD>
##$VPLIST= <PPPPPPPPPPPPPPP>
##$VTLIST= <TTTTTTTTTTTTTTT>
##$WBST= 1024
##$WBSW= 4
##$XGAIN= (0..3)
0 0 0 0 
##$XL= 0
##$YL= 0
##$YMAX_a= 397348
##$YMIN_a= -375960
##$ZGOPTNS= <>
##$ZL1= 120
##$ZL2= 120
##$ZL3= 120
##$ZL4= 120
##$ABSF1= 16.522
##$ABSF2= -4.171173
##$ABSG= 5
##$ABSL= 3
##$ALPHA= 0
##$AQORDER= 0
##$ASSFAC= 0
##$ASSFACI= 0
##$ASSFACX= 0
##$ASSWID= 0
##$AUNMP= <proc_1d>
##$AZFE= 0.1
##$AZFW= 0.1
##$BCFW= 0
##$BC_mod= 0
##$BYTORDP= 0
##$COROFFS= 0
##$CY= 12.5
##$DATMOD= 1
##$DC= 0
##$DFILT= <>
##$DTYPP= 0
##$F1P= 14.0000005364418
##$F2P= -0.99999901652339
##$FCOR= 0.5
##$FTSIZE= 32768
##$FT_mod= 6
##$GAMMA= 0
##$GB= 0
##$INTBC= 1
##$INTSCL= 1
##$ISEN= 128
##$LB= 0.3
##$LEV0= 0
##$LPBIN= 0
##$MAXI= 10000
##$MC2= 0
##$MEAN= 0
##$ME_mod= 0
##$MI= 0
##$NCOEF= 0
##$NC_proc= -4
##$NLEV= 6
##$NOISF1= 0
##$NOISF2= 0
##$NSP= 0
##$NTH_PI= 0
##$NZP= 0
##$OFFSET= 16.522
##$PC= 1
##$PHC0= 220.5234
##$PHC1= 3.684755
##$PH_mod= 1
##$PKNL= yes
##$PPARMOD= 0
##$PSCAL= 4
##$PSIGN= 0
##$REVERSE= no
##$SF= 250.13
##$SI= 32768
##$SIGF1= 0
##$SIGF2= 0
##$SINO= 400
##$SIOLD= 32768
##$SREGLST= <1H.DMSO>
##$SSB= 0
##$STSI= 32768
##$STSR= 0
##$SW_p= 5175.98343685301
##$SYMM= 0
##$S_DEV= 0
##$TDeff= 65536
##$TDoff= 0
##$TI= <Analysis number 999999
Compound Code 99
Book Reference 9
Project Code 9>
##$TILT= no
##$TM1= 0
##$TM2= 0
##$TOPLEV= 0
##$USERP1= <user>
##$USERP2= <user>
##$USERP3= <user>
##$USERP4= <user>
##$USERP5= <user>
##$WDW= 1
##$XDIM= 32768
##$YMAX_p= 443539551
##$YMIN_p= -412454
$$ End of Bruker specific parameters
$$ ---------------------------------
##NTUPLES= NMR SPECTRUM
##VAR_NAME=  FREQUENCY,     SPECTRUM/REAL,   SPECTRUM/IMAG
##SYMBOL=    X,             R,               I
##VAR_TYPE=  INDEPENDENT,   DEPENDENT,       DEPENDENT
##VAR_FORM=  AFFN,          ASDF,            ASDF
##VAR_DIM=   32768,         32768,           32768
##UNITS=     HZ,            ARBITRARY UNITS, ARBITRARY UNITS
##FACTOR=    0.157963299565203, 1,           1
##FIRST=     4132.6476996994, 0,             0
##LAST=      -1043.33573715361, 0,           0
##MIN=       -1043.33573715361, -412454,     0
##MAX=       4132.6476996994, 443539551,     0
$$ Real data points
##PAGE= N=1
##DATA TABLE= (X++(R..R)), XYDATA
$$ [...]
17727b7830l176J6301J1968l8846J985M827J8446M3288K139j4878O292J7896j4224
17714B4188l0316j4826j3774K6887J343k671j964J3019K3406K8426J8460k0994
17702E1184m2039J6230L4844j4384o0065k5460J6513J4592O066K349J132K6364
17690B7326M8469k7033k3980k6245j3051j6400J168O630R61L1928J0896q446l0070
17677a7847j1638q028l1340J0820K9754J0180j3422m1266L2127L8616k1052j3373
17665c6469J1820K0160n840P217j0340o180k5959J2485n064J1187L638k5710Q858
17652d0197j1316n719L4620m900o666K7488K0064j8120k139J1464k4239J1791
17640g869J6323P619J9382j1438l6121k7576J6768R217m1923l1355m419q969M8694
$$ y = [-27830, -31006, -14705, -2737, -41583, -39598, -34771, -16325, 26963, 29102, 14224, 20516, 38412, 24188, -6128, -20954, -34728, -7841, -6498, -9169, -11133, 1886, 25292, 53718, 72178, 51184, 9145, 25375, 60219, 45835, -14230, -39690, -23177, -8585, -2519, -170, 962, 27326, 75795, 48762, 24782, -1463, -14514, -30914, -29746, -23116, -22155, 9773, 20669, 12223, -17847, -29485, -37513, -68853, -58033, -28279, -18099, -31521, -72787, -40660, -2044, -23096, -36469, -24649, -4489, -10329, -3112, -13452, -19632, -45591, -33106, -38170, -26983, -23345, -49055, -40197, -51513, -57232, -22612, -27512, -34178, -6690, 13374, -4746, -6885, 4579, -19660, -7869, 8454, 16073, 35455, 24017, -12104, -39680, -22912, -13695, -55618, -86973, -91392, -100361, -51667]
17627e1667L0276k4952m0208L2573M930P738k38K2426K5225l1252L1148O254j2592
17614c39N365j494l7795l2925J1170L3302j5483p697J1232M932K0820M932N83
17601c397L3014J5236J252k6017l9293k2292Q629J1332J844r08J9782K3906k3161
17588g3l2929J8571J0178j9981m485j6891l2431r441q938K1729L5696M6268L7390
17575D4663j5491k9834j8807l275K146r188m9541r771O1995L0651L324J4325r04
17562B0293N077j1061k3597J433r396M121l0355j8690N4845k141o775J792K1024
17549F570J2181l0029j4840K8956M2098k9848l1871j7361r15j2772j9134K2081
17537d4884j8062j8393l672L2272M4107J5334j954M710p364p130J8093J5892J718
$$ y = [-51667, -21391, -46343, -86551, -53978, -49048, -41310, -41548, -19122, 6103, -25149, 5999, 12253, -339, 5026, 3532, -34263, -67188, -56018, -22716, -38199, -45896, -34664, -29732, -8912, -3980, -3397, 29617, 44853, 46105, 20088, -19205, -41497, -32868, -21536, -19692, -20600, -818, 23088, -73, -33002, -14431, -4253, -24234, -28719, -45610, -78041, -87482, -96420, -74691, -38995, 7273, 44663, 29172, -662, -19469, -22744, -20598, -29786, -79327, -89098, -27103, 3548, 6872, 21197, 20293, 25370, 14309, -9288, -7855, -17251, -13130, -43485, -62175, -7330, -9471, -16246, -14454, 6570, 18751, -11278, -26118, 2838, 44936, 15088, -16783, -34144, -35059, -47831, -66965, -44884, -62946, -81339, -85011, -52739, -8632, 6702, 4748, 9458, 2094, -5036, 13057, 28949, 30667]
17524C0667j6987J5820q957K4290J3777n5856k9911M3022L4929j2503l6885k5841
17512b4435L1117K5273J1825n754j1315O468j7583m2233l9322N423Q017Q605l812
17499d7726o066Q862K2722n17J4053J6646J1203K4784k1213j2109r202O905P091
17486A5433j0516k0337l0758P363L0496j2210J3455J5063l9037k0963K4059K6693
17474a259L3530J1565r321j9553l7143l1539O27K9485K2793j8143j0231j6260
17462d5449L9977j251l7710Q366N9981o457l5889m173n6k3928O101J6439P281
17449a6768n581m1179o326K8255L4094k3963O462K5665p772j5650R13K3018J2248
17436A3416J0827j2816j9087r116M2264J3982k3410n386p418j5676J7270M0124
$$ y = [30667, 13680, 29500, 20543, 44833, 58610, 2754, -27157, 15865, 50794, 38291, 1406, -24435, 6682, 31955, 43780, 38026, 26711, 33179, 15596, -26637, -65959, -60536, -52519, -43914, -47726, -53792, -44930, -22208, -22725, -8672, 7974, 19177, 43961, 22748, 10639, 1437, 8342, 15433, 4917, -15420, -46178, -38815, -8319, -20529, -7074, 7989, -31048, -52011, -27952, -1259, 32271, 43836, 34515, 14962, -22181, -53720, -53093, -23608, -815, -18958, -29189, -45449, -5472, -6723, -44433, -36067, 23914, 17457, -18432, -22605, -22661, -46589, -40488, -24049, -16768, -22349, -63528, -69854, -41599, -7505, -31468, -25006, 659, -7113, -22763, -21850, 1168, 13416, 24243, 11427, -7660, -16776, 25488, 39470, 16060, 10674, 3256, -12420, 4850, 44974]
17424D4974J7358k1537O099n1968j9793M9082p234O155n882R691j8337n0382L149
17411c8625J1251J6531r032j234L3577J8112M004L108q66k1796k879j0780j0356
17398h985J022j3221K2510K6480r327m8922K3739M6805j11n2290L2669K0654l6864
17385D159n1707n050L6502L4663L2907j5140n1932o564K7286o1216n4310J9352
17373i1050j433L342J1137K1070r900N971J8449j4652J4516j7054l529R786J6215
17360c7132J7490J7240k0666p245j299J0027J4315l2330j547J5008M7178k1156
17348a17k7145P489j7669O668J8891r402K4143R805j2572n547p12j4683j8632
17335c9483O521K8237L0495o892Q99l973N259J6158l9751N552M4189j5783m8769
$$ y = [44974, 62332, 40795, 46894, -5074, -24867, 24215, 16981, 23136, 17254, 26945, 8608, -41774, -38625, -27374, -10843, -19875, -21109, 12468, 30580, 34584, 37692, 36826, 15030, 12151, 1371, -8985, -7963, -21184, 1326, 27806, 18479, -30443, -6704, 40101, 39990, -12300, 20369, 41023, 4159, -47548, -52598, -16096, 18567, 51474, 36334, -15598, -22162, 5124, -56092, -110402, -91050, -92483, -89141, -78004, -56934, -66834, -60863, -42414, -57066, -42550, -59604, -63133, -53347, -37132, -19642, -2402, -23068, -30313, -31612, -21585, -7270, -39600, -41147, -26139, 21039, -117, -27262, -19773, -37442, -30774, -11883, -21285, 2858, 12663, 91, -5456, -6168, -20851, -39483, -32962, -4725, 25770, 18878, 19777, 15804, 21063, 37221, -2530, 3022, 47211, 31428, -17341]
17322a7341j6038K9559k860O228m3895J1591K994n993k117J7462L5349J6198j2427
17309A8710j4035k5110j9162J0483k3748k0411M6421L3341L2433m4028m4429J8266
17297c1269L530K3024m917l735K3625J0898Q290r453l6288m8208k7175K3327P284
17284f1067L0079K1372L547J4239l1867k6258N236R49J3974K1608q134m158J3125
17271g355m063p894L6037K7283j9243R457K1714J5924J2837l3735p734j0908j273
17258C1047j3906k5195o1514l4280M1510M3755K4336j6587j3567k2689J4177J7464
17246a5449l9823L287L2600o208J7484p966N837O473n0995j1769K1804L0812L5704
17233B1791Q358l4701m0598J99K238K1543j223L7259K3013K6245k568R71o2408
$$ y = [-17341, -33379, -3820, -6680, -452, -44347, -32756, -29762, -35755, -37872, -20410, 14939, 31137, 18710, 4675, -20435, -39597, -29114, -52862, -73273, -26852, 6489, 38922, -5106, -49535, -31269, -27739, -4715, -9632, -13367, 10258, 21156, 29446, 19993, -16295, -64503, -91678, -68351, -61067, -30988, -9616, -6069, 8170, -23697, -49955, -44719, -43770, -29796, -8188, -16322, -20480, -7355, -11418, -19312, 16725, 44008, 24765, 34222, 55936, 71860, 84697, 50962, 43228, 32320, 31047, 17141, -8054, -69568, -103848, -62338, -18583, 5753, -10834, -24401, -47090, -32913, -15449, -55272, -51985, -19385, -25593, -8109, -16075, -10238, -3765, -54760, -66529, -44725, -13913, 21791, 30149, -4552, -45150, -44951, -42713, -21170, -22393, 14866, 37879, 64124, 61556, 62527, 119]
17220A19l1536j2938K3591O26n120P614q360M007J6294k9110n571j1536K4776
17207b7144n371l2364L7804L075k6411J1109k8268j1801K1031J7182J5212P004
17195a8942k3548l3066K8070L2171K9248p32K9338j360j8291k7014k0574l2085
17183e6785J0628J8311j2608K0905j195K6389K4502j7729q695O50j6307k2944
17171c4878R035K8627k8047k4870l956K3565k7440j6147J0122J1243l5420k1699
17159a09865M6107N1445M348k275j2000j2073L7910M0147m8398k1332k4221n813
17147e6020L9337k8284K1122L2775J2501j3594j6359P236r303Q576j8118K0265
17135A34O441o344J59J5145K0718m92j5575j1560K884l5797j0106L235J2475Q1087
$$ y = [119, -31417, -44355, -20764, -20138, -25258, -17644, -26004, -21997, -5703, -34813, -40384, -51920, -27144, -32515, -64879, -27075, -24000, -50411, -39302, -67570, -79371, -58340, -41158, -25946, -18942, -42490, -75556, -47486, -15315, 13933, 13201, 42539, 41179, 22888, -4126, -24700, -56785, -46157, -27846, -40454, -19549, -20744, 5645, 30147, 12418, 3723, 4373, -11934, -34878, -25843, 2784, -25263, -50133, -54089, -30524, -57964, -74111, -63989, -52746, -88166, -109865, -63758, -12313, -7965, -10240, -22240, -34313, 3597, 43744, -4654, -25986, -50207, -56020, -16683, -44967, -23845, 8930, 21431, 7837, -8522, -1286, -10589, -2013, -20131, 134, 6575, 231, 390, 15535, 36253, 35761, 20186, 8626, 11510, -24287, -34393, -31158, -18683, 62404]
17121F2404K4568R881m3318m1225R961R158M109J1541J6533n6533k1962J2846
17109b037J2057j5180J0111Q306k9793n794J6923N8198J1338K769l4248l7049
17097d399K4299J6364j2030m330J5365L87k1078k7803M850k9538O059L3207k765
17084a412n3704j0462J0788J5097K1470K1135j3664l893j0541J3341r263L4225
17072A3117M4942k244n4505k5839k660L926M0747j4987k4311k8374l8409K6265
17060f2332L8679J5086l366j0054m217L0552Q31J2974q99l325l6424j7836M0655
17047C24N1593l5396n6951J5440O349J1730K0351J4984R081J2685J8840l2273
17035C6757k0664l8376R711L7583L700o4702m4212J395j7045K4896J2728l7398
$$ y = [62404, 86972, 96853, 53535, 12310, 22271, 31429, 35538, 47079, 63612, 7079, -14883, -2037, 10020, -5160, 4951, 13257, -16536, -22330, -5407, 52791, 64129, 66898, 32650, -4399, 19900, 36264, 24234, 19904, 35269, 35656, 14578, -13225, -8375, -37913, -31854, 1353, -1412, -55116, -65578, -54790, -39693, -18223, 2912, -10752, -14645, -25186, -11845, -21108, 13117, 58059, 55815, 1310, -24529, -27189, -23263, 17484, 2497, -21814, -50188, -88597, -62332, -23653, -8567, -11933, -21987, -26204, 4348, 5179, 18153, 17254, 13929, -22495, -40331, 324, 51917, 16521, -40430, -24990, -18641, -6911, 13440, 28424, 37505, 50190, 69030, 36757, 16093, -22283, -12572, 25011, 28711, -35991, -80203, -78808, -95853, -70957, -58229, -95627]
17023i5627O859K4677J2717K9079q994k4275M8045J036l1686L746J707j1211Q485
17010c5442l065k5524j6661M1248O8232P219j2606l0297M607K017j7508J7905
16998A25k3718L198J1617L521k8563K3789j6400j8337j3156N431n209Q831O928
16985d1943j7468L567K9022L3493J5618L6301K4587J9779J1063r918k9166k2869
16973E2066n7680J8521L6557n5864J1458J8837k5155K4333O620m2020l0442n314
16961d8083M160r825O571K9526J548L627R870k3945j8844J2692j1979K5809M4907
16948B6034K720j6388K4779J7556q393K784J516Q24P727j250k2401l3708k7148
16935b5348j400J9380o973k442J0454j3147K7615r124m4656L3763n920m293j3166
$$ y = [-95627, -88768, -64091, -51374, -22295, -31289, -55564, -7519, -6483, -38169, -34423, -32716, -43927, -35442, -38507, -64031, -80692, -39444, 28788, 36007, 23401, -6896, -2289, -272, -17780, 125, -23593, -20395, -8778, -5257, -33820, -10031, -26431, -44768, -57924, -52493, -57702, -48871, -41943, -59411, -55844, -26822, 6671, 22289, 58590, 83177, 102956, 114019, 104101, 74935, 52066, -5614, 12907, 49464, -6400, 5058, 23895, -1260, 23073, 29693, -12327, -42769, -48083, -43923, -53748, -47177, -17651, -16103, -12476, -2606, -26551, -45395, -32703, -44682, -18873, 26034, 28754, 12366, 37145, 54701, 46308, 49092, 50608, 51432, 59159, 57909, 35508, 1800, -25348, -26748, -7368, -14341, -16783, -6329, -19476, 8139, -985, -45641, -11878, -17798, -22091, -35257]
16922c5257Q216M181k9381j0327J2152M1529K2018o682k6285j82K5432L620L4234
16909D3268K124j2672J0228j0865k1728r84n508k8553j2334L3355K5327k0107
16897A551P086J6093L036J3579j4134j3553j8815M6196J6726o425j9894P91k2998
16884I239j8138o156j1636K8536K46j6411M0894Q700m1118l122j8253j5100N028
16871c7291J2355K0898q831k6349J8223K521J650j4143l5683M761M4546J1371
16859e972k0514J8286p743M569J8471J0617j0807j1885L365L5594J9223l5636
16847A7568m068j2991j8861j775l2742L258K2201O03J5783O884p059R007K0512
16834A8320j2886j1879J1379r119K5802J2982o587r407m2527J794j8328K2306
$$ y = [-35257, -27041, -22860, -52241, -62568, -50416, -8887, 13131, 6449, -19836, -20018, 5414, 9034, 43268, 45392, 32720, 42948, 32083, 10355, 9371, 3863, -24690, -37024, -3669, 21658, 1551, 8637, 24730, 27766, 41345, 27211, 13658, -5157, 41039, 57765, 51340, 31446, 32237, 9239, -8899, -15055, -26691, 1845, 2091, -14320, 26574, 35274, -5844, -8966, -27219, -42319, -37291, -24936, -4038, -12869, -39218, -20995, -18474, -16824, -30967, -66650, -61889, -17343, -5972, -26486, -8200, -15943, -11374, 7097, 17714, 6907, -4978, -1613, 33981, 53204, 17568, 13500, 509, -18352, -20127, -52869, -49611, -27410, -26807, -11024, -4140, -11199, -2192, 18320, 5434, -6445, 4934, -4185, 21617, 34599, 28012, 18605, -23922, -22128, -40456, -18150]
16822a8150K5393J3564L6892l2465O683K64Q54j7999k2247J0894j0954j286O041
16809b516J2318L3962M1672j2347n0167l0382k2890M097L4974Q705o931j6631
16797f136k0840k382J8203p94M547j0065R029o557k0324j3736K5354L7708K754
16784A6761j1044K4137j8466J9648k6802k6016K4213J7453k4950k5926j0099P851
16772c3240K0243j6226k7872R846L1227N4609R922k7055j3946K2199k4950l49
16760D408L408n136j7790J1369J6540p816L630q103l1935M006J2263J6342R049
16747A0235Q750L145m925n0106k1558J9841K2908J4869J563n33J3558l0353L8760
16734B6154k7009l3520J3452j3467n107M117m0350J1588L4953M0316L4092K5026
$$ y = [-18150, 7243, 20807, 57699, 25234, 31917, 32181, 33035, 15036, -7211, 3683, -7271, -8557, -2516, 9802, 43764, 85436, 73089, 22922, -7460, -30350, -26253, 8721, 17426, 10495, -6136, -26976, -29358, -11155, -11949, -7402, -17467, -8438, -14995, -35319, -49055, -23701, 14007, 16761, 5717, 29854, 11388, 31036, 4234, -21782, 2431, 19884, -5066, -30992, -41091, -33240, -12997, -29223, -57095, -47249, -16022, 38587, 48509, 21454, 7508, 29707, 4757, 4408, 7816, 2680, -15110, -3741, 12799, 4983, 8613, 510, -31425, -27419, -15156, 1186, 10235, 18985, 22130, 17205, -32901, -54459, -34618, -11710, 3159, 4722, 4189, 17747, -12606, 26154, -855, -34375, -20923, -34390, -39497, -35380, -75730, -64142, -29189, 11127, 45219, 70245]
16722G0245nj1109l7826l9444L1027l3959l1264K8875m335j6511P811O611K1330
16709h554J5800k9638k6961l3508n849K7741M9990L3805k0178j7086L527J2527
16697A616p607m1858l0792J0540O1795M4763j4788J4266k683k8430j907J1353
16685A6268k5326j3850J7883J711k4101j3199r606k973J0928J688J0932K6379
16673c266j0053K2434j7998J1969n699J6357l810k2030j2274k5692M899J7865
16661b7298J1930k9182K6006M5061L4090K0262P349k8215L737q775q917l6124
16649I924J1641J5581l4973j1954j808n2259j4986o333N878L7106J8297J809K791
16636a9286J5386J7943j2361l5024j8204N193K0391L4066j6554p391j625j652
$$ y = [70245, 70240, 59131, 21305, -18139, 12888, -21071, -52335, -23460, -27795, -44306, -36495, -29884, -8554, 7246, -22392, -49353, -82861, -88710, -60969, -10979, 22826, 2648, -14438, -10911, 1616, -5991, -47849, -78641, -68101, -6306, 38457, 23669, 37935, 35252, 6822, 4915, 16268, -9058, -22908, -5025, -3314, -27415, -40614, -50220, -53193, -42265, -40577, -29645, -3266, -13319, 9115, -8883, 3086, -2613, 13744, 9934, -12096, -24370, -50062, -45163, -27298, -15368, -44550, -18544, 26517, 60607, 80869, 88218, 60003, 63740, 54965, 46048, 9924, 21565, 37146, 2173, -9781, -11589, -63848, -78834, -85167, -79289, -42183, -23886, -22077, -19286, -3900, 14043, 1682, -33342, -51546, -46353, -25962, 8104, -8450, -15841, -17466, -19118]
16624a9118Q041k2418M559O502Q719l12J7876N132q335J0725R465j0745j0272
16611a81l1754K8472M9383p901k6124m295p473m2178k159p939J8600L4470l64
16598E57J2513k8200k0344j7315L1066l746o653J146j7578n6593K5924K1476R674
16585d8073q10J9807P395K2676r870m0829j2915J3527K2295k0753n584O593J8936
16572b7605Q712K6928J8827M612j4193k9124J5822R102r072k3456L088M2001l018
16559B2624n1286J078o278r083n992n325j3811L4537j2262l7433l867N5159J2167
16546a9772j6185J2397k2090Q439q642J0603J4851J4992K3615L600j4568j0957
16534c717K895J654K1845J2694k0776J6233j7442J3259j745j6021o469J203J7414
$$ y = [-19118, -11077, -33495, -28936, -22434, -13715, -14027, 3849, 8981, 646, 11371, 20836, 10091, -181, -31935, -3463, 45920, 38019, 11895, 7600, 127, -42051, -44210, -52149, -33549, 921, 557, 13070, -15130, -35474, -52789, -21723, -25469, -32122, -30976, -48554, -105147, -79223, -57747, -48073, -48883, -29076, -21681, 995, -8875, -49704, -62619, -49092, -26797, -47550, -53134, -46541, -27605, -18893, 8035, 26862, 31474, 17281, -11843, 3979, 13081, 4009, -19447, -16359, 25642, 22624, -28662, -27584, -33862, -42945, -48937, -54262, -68073, -33536, -45798, -83231, -87098, -31939, -19772, -35957, -23560, -45650, -37211, -45853, -35250, -20399, -5407, 18208, 21808, 7240, -3717, -822, 832, 22677, 35371, 14595, 30828, 13386, 26645, 24900, 8879, 2410, 3613, 21027]
16521B1027J5395J849j0776N915L6040l2547m2713J1036K7995j9749L9287L1699
16509H4458n417j0616j2440Q475K537k5772k4805k2570O03K9678n366J1062k1782
16496H045n405R685R230J2260P052k3878j0132n547P58j8810J9799j542j5946
16483a4431L2377M607k1893P984J1340K2657K2737R989m3968n8115j1671k709
16471d1096m777k0547j9779K4447L6929r463K128K3925l275q198l82o841l4564
16458f1493M8166L4179j4047L429j0078L1887J0564j5012o7o400J5272P713k3412
16445B0701P697L0075p844l8008l7468j7083J2298r209m977L4693R750O386J202
16432H213L672k3525r707L720N7841K1407k7627p925J1080j9922k2166j3775J9954
$$ y = [21027, 36422, 38271, 27495, 33410, 69450, 36903, -5810, 5226, 33221, 13472, 52759, 84458, 79041, 68425, 55985, 64460, 66997, 41225, 16420, -6150, -5547, 24131, 18765, 29827, 8045, 2640, 12325, 21555, 33815, 40867, 16989, 6857, 1310, 2068, -16742, 3057, 1515, -14431, 17946, 22553, 660, 8644, 19984, 42641, 65378, 75367, 31399, -26716, -38387, -41096, -45873, -66420, -86199, -61752, -24823, -34286, -32158, -8233, -11508, -19706, -20088, -26929, -61493, -13327, 20852, 6805, 10234, 156, 32043, 42607, 27595, 27528, 21128, 36400, 44113, 20701, 28398, 58473, 50629, 12621, -24847, -41930, -29632, -38841, -43818, -9125, 625, 7011, 8213, 11885, -11640, -21347, -17627, 40214, 61621, 33994, 26069, 37149, 17227, -4939, -18714, 1240]
16419A240J2220Q718j6570N97r724k7861j607j2908j1638l463M0807l574k1279
16406d5042k310K8703L4997j4930K866K354j6386J1077K6214m278k5035j68r250
16393a1188n58j450j3487L437l526l00l2948o766L9765M6115K0064n1233l600
16380a5675L7227J2659j5149k5414k0765J2069k0997P438R046P128L608J4525
16368E700n932K7035j1949k6730O460q653m4095R499N0220J7558J5787q235k2433
16355D232m084l6606k6048K4354J8964J6066l8616k3324L6582j0642k3101Q516
16343e3707L8814L2277m9129k2679n487j6354K0495M0167L1388L0873r66k5664
16331B0028l3315l0681j2033L3928k1366k6431R603J7048M0945K8825j2842l8492
$$ y = [1240, 13460, 22178, 5608, 6205, -3519, -31380, -32987, -45895, -57533, -60996, -20189, -23763, -45042, -47352, -18649, 16348, 1418, 4284, 6638, -9748, 1329, 27543, 23265, -1770, -1938, -11188, -11746, -13196, -26683, -23246, -26772, -27072, -60020, -66786, -27021, 19094, 39158, -12075, -15675, 21552, 34211, 19062, -6352, -27117, -15048, -36045, -28607, -19561, -12433, -8825, 5700, -232, 26803, 14854, -11876, -5416, -14069, -58164, -48665, 1555, 19113, 34900, 26665, 4232, 148, -36458, -62506, -38152, -19188, -3122, -41738, -65062, -28480, -39122, -62223, -53707, -14893, 17384, -31745, -54424, -59911, -76265, -55770, -15603, 15785, 46658, 45692, 20028, -13287, -43968, -56001, -22073, -43439, -69870, -60267, -43219, -2274, 26551, 13709, -24783]
16319b4783j2099J4343k7398O439L9355J4997m72j269r406J3753J2667k325k1761
16306B041n243j0641j5537k45L871K2481l5393K5029q84K3858J7819k942O890
16293C1104J7696K172m6089j2131Q13J0599K6810M42o837P167k1551m0714k5786
16280e6305J2682J2218M6252K8191j5360J6109J8046j3255j0076k140J6781J050
16268E4193N489P44j3356l2799j2739k3747J0007K6691j484J3413J9265L1947
16256G7624k0144l5589K3216j2759l4320J9562N5010k9414p4511k3679L0169M8802
16244B3967L2844K5058l2611k2020K7059q021k7216q979q206j9301j3329J8870
16232a1885k697q040k5394K3281L866k2446J7335j2250P948k4040M04K2571P369
$$ y = [-24783, -36882, -22539, -49937, -43498, -4143, 10854, 10382, 9113, -293, 13460, 26127, 23802, 2041, -3202, -13843, -29380, -29625, -25754, -3273, -38666, -13637, -14521, 9337, 27156, 24214, 31104, 48800, 50972, 4883, -7248, -6435, 4164, 30974, 31416, 24579, 31746, 10195, -30519, -56305, -43623, -31405, 14847, 43038, 27678, 43787, 61833, 48578, 38502, 36362, 53143, 54193, 59682, 60426, 47070, 14271, 1532, -22215, -12208, 14483, 12999, 26412, 45677, 77624, 57480, 21891, 45107, 32348, -1972, 17590, 72600, 43186, -31325, -55004, -24835, 23967, 56811, 81869, 49258, 27238, 54297, 46276, 19060, 10081, 1875, -17426, -30755, -11885, -14582, -22622, -48016, -24735, -20869, -43315, -25980, -38230, -30282, -54322, -53918, -31347, -23978]
16219b3978m734k6478K6876L0164k397k0664L189k457N153n7214K0585K7376L1008
16206F429K2940L8229k1442j6983j9956j4098J805J9622l3413n1854N847m406
16194f7280L3023k2443k606K751J7925J9078L3804k1162m791k4630N210N972j6569
16181d1718J8033O804Q284R929k7078j377K6661L549K834j1448K1468n785j4646
16168d490K157L8453J1359k6293m5996J4287M7084j2370L23J454K310k685m8952
16155b3359N453M7978J5795k2314k365J820j7265k3444K430K9018k3762r939K5947
16142E993j5902l7340K2984P456L020Q528N118J8512K218K5669L0033k3545m0455
16129A2289o520J8046l5498l1862J4990l943l205K3649K346J2027K9224J6403
$$ y = [-23978, -28712, -55190, -28314, 1850, -547, -21211, -18022, -20479, -15326, -72540, -51955, -24579, 6429, 29369, 67598, 46156, 29173, 9217, -4881, -3076, 16546, -16867, -68721, -62874, -67280, -34257, -56700, -59306, -56555, -38630, -19552, 14252, -6910, -11701, -36331, -31121, -25149, -41718, -23685, -16881, -8597, 1332, -25746, -27123, -462, 3087, 5921, -5527, 15941, 10156, -4490, -2333, 36120, 47479, 21186, -24810, -10523, 36561, 24191, 24514, 25968, 28278, 25593, -23359, -17906, 30072, 45867, 23553, 21188, 23008, 5743, -17701, -15271, 13747, -10015, -19954, 5993, -9909, -47249, -24265, -16809, -13789, -5261, -143, 18369, 20587, 46256, 76289, 52744, 12289, 5769, 23815, -11683, -43545, -28555, -32498, -35703, -12054, -9708, 2319, 31543, 47946]
16117D7946K2001l5962l9949j2683o494K1341L2258m485j3653k8272K1985O3256
16105F7289m049J618J1095k453j8348J753r646l7160l3348J3309J5408r564j9761
16092b3857Q382L9436J2460m566k0496j6009K6509k448o5742n3952N374O5014
16080b9895L1693J568Q16J2790L3561K831k0806l1493n3750J5635O2803r45q827
16067A5981j6804q568J5K1725l1885l6109K0210r142O798K5088K2375J981p601
16054D064M169q343j8372J8605n173q831p252J1912N991P432j046K0067J4588
16041C7811Q111j3989m860K0945K9858K8462m4090k6326l3193o515M3492K0029
16029E9735l518k1898k5643k0375j7902Q665K512p970M734M490K6665Q161J7794
$$ y = [47946, 69947, 33985, -5964, -18647, -25141, -3800, 28458, 23973, 10320, -17952, 4033, 67289, 63240, 64858, 75953, 73500, 55152, 56905, 47259, 10099, -23249, -9940, 5468, -4096, -23857, -15475, 23961, 36421, 31855, 11359, -4650, 21859, 19411, -46331, -100283, -94909, -29895, 1798, 3366, 4182, 16972, 50533, 53364, 32558, 1065, -52685, -37050, 25753, 24808, 15981, -823, -9391, -9376, 12349, -19536, -55645, -35435, -44577, -37779, -12691, 9684, 11665, 4064, 8233, -110, -18482, 123, -5050, -13881, -21133, -9221, -3230, 4202, 3156, 23223, 37811, 45922, 31933, 27073, 48018, 77876, 106338, 62248, 35922, 2729, -3786, 39706, 59735, 56217, 34319, 8676, -11699, -29601, -20936, -18424, -26394, -21660, -17170, 9495, 17656, 35450]
16016C5450j0199M320k5557j8557j0775K4227Q756J0349L0225O584k5184K742
16004C2381k6998L470l1162N30M1350J8085l6243q2570l217K0795k3925M723L1148
15991e1633j6395M1897Q762k41J7188N227k889j9429j828K5249l469k3794J8844
15978b511j0858k5544r555K624j1418J2006J0067K9477N5323k3453r688k986l088
15965A0396j8340Q694K4686K347N720k1264j309J280l9685p843j9481K830L6254
15952a5715N152r796J5909L2471K4507j3961k6151j5561K1137l0580o330K6644
15940G726K8038k7614n0794j602L5984L7738N747M1724j7264n3033j8964J7577
15928E263J3866k1841j2686L677K2551j9571J5836J0626k6417O02j3524l115o19
$$ y = [35450, 25251, 29571, 4014, -14543, -25318, -1091, 7665, 18014, 48239, 54823, 29639, 32381, 5383, 8853, -22309, -21779, 19571, 37656, 1413, -81157, -84374, -63579, -87504, -82781, -51633, -68028, -26131, -17369, -17610, -422, 4805, 1916, -17513, -19341, 5908, 2439, -21355, -2511, -13369, -38913, -48468, -45844, -57262, -45256, -35189, -5712, 49611, 26158, 16470, 13484, 10396, -7944, 750, 25436, 27783, 33503, 12239, 10930, 12210, -27475, -35318, -54799, -51969, -15715, -10563, -20359, -4450, 28021, 52528, 38567, 12416, -3145, 17992, -12588, -18918, 7726, 35764, 8150, -42644, -44246, -8262, 29476, 35223, 76947, 59683, 6650, -12314, 5263, 19129, -2712, -15398, -11721, 10830, -8741, 7095, 17721, -8696, -8094, -21618, -24733, -25352]
15915b5352j5167l521m868R193M716J192M0241K7362J6475p36k2106j8858K0564
15902B9135N530j3749o5189m0320M590k936K1888M7577J6213J5773N3114O005
15890G7631j1504k831k1867m1699l5909j9028j1890J6944O009K5753L0458J4490
15878B6557O589K2104K388J2154l4113p989K2368m2480r774M22j8738l6925J3248
15865d4189O6568J9784k4909q925R355k2025J1917K4145J1760R320K3993k2503
15853E4291j4971O252k2993P410k3845J5112o133j255J0630P723n4414k639j1592
15840c6424M2258K7646l523K3207m303j2415m514J123n3387k1547K3508L2074
15828A3703m3808l5333L6908K7163M492J6948m0355Q298k789j1591j0726K0140
$$ y = [-25352, -40519, -44040, -48908, -39715, -34999, -33807, 6434, 33796, 50271, 49535, 27429, 8571, 29135, 34665, 20916, -44273, -84593, -80003, -82939, -61051, -13474, 2739, 18512, 71626, 77631, 66127, 63296, 41429, -270, -36179, -55207, -67097, -50153, -44144, -18391, 12067, 26557, 33146, 55250, 57638, 69792, 35679, 27690, 50058, 7578, -2196, -1774, -20512, -57437, -44189, 22379, 42163, 17254, 8329, 17684, -4341, 7576, 31721, 43481, 52801, 76794, 54291, 39320, 45572, 22579, 29989, 6144, 21256, 15123, 13868, 24498, 32221, -22193, -24832, -36424, 5834, 33480, 29957, 53164, 48861, 36446, 31932, 33055, -20332, -41879, -18371, 13703, -30105, -65438, -28530, -1367, 3125, 20073, -20282, -11984, -14773, -26364, -37090, -16950]
15816a6950p566K2011J4531J7029q898m3378M619r089K1812K4095J3677n890k4854
15803A149j5506j5646q083N448J6543k6901j6804O947Q719L1652R624j9430J3737
15790h551J9194k7212k2512J573k0559k1395l096K2444J3205N1801N3405Q47j2533
15777D6611k0059J3721L199k2047k6436l970j387K5517L0053O416l1139l5786
15765a5307m1285J3376J517j0403j954J6944Q888j8193l8935R129L4723K6941
15753a4559J2916M162l3029j8217O077j264K4753N947J4329J2393l8139k6650
15741e1281L267P463K4911m852J2503L8206K3168j2362O45k4232j926K7472j2806
15728C0176m8791j6944j2389j1314j0273M1711J0476J0990K8817p895l4769J1696
$$ y = [-16950, -24516, -2505, 12026, 29055, 20157, -23221, -18602, -27691, -5879, 18216, 31893, 26003, 1149, -14357, -30003, -38086, -32638, -16095, -42996, -59800, -52853, -44134, -12482, -2858, -22288, -8551, 10643, -16569, -39081, -37508, -58067, -79462, -82558, -60114, -46909, 4892, 58297, 59144, 46611, 26552, 40273, 43472, 21425, -5011, -8981, -10368, 15149, 45202, 51618, 20479, -15307, -56592, -43216, -41699, -52102, -54056, -37112, -28224, -46417, -85352, -76223, -41500, -14559, -1643, 2519, -30510, -48727, -42650, -43914, -19161, -13214, 1115, 13508, -24631, -51281, -48014, -40551, -15640, -20492, -7989, 30217, 53385, 41023, 41668, 17436, 15510, 42982, 30176, -18615, -35559, -47948, -59262, -69535, -27824, -17348, -6358, 22459, 14564, -20205, -8509]
15716h509o865J3285l9325K3892j8546N934M0415k6948k7906k2106k5438P656
15704h4461K2982L3256J0389k3812l057k3277r676M2940J460J3838J9403J6810
15692A6795k3039p29J8663K1305M238n642J34K5677Q924J9419k2182l4905l3106
15679d448l6638j8374L746L228r593k1127r299N766K0942J0250m935k660O7532
15666D390P523j0030k2593k3813J5868O418Q755j6878k4601K855M5251O7694L0294
15653I1133l2269k2465j0874k3416j3955j4970J7086K9511M6571k6535j5854p898
15641A6065j2925J0990J4011J5517k4023o904k9493q954K1059J6403m819m8872
15629d1945k857K6389j4813l2312M3597L8369j2252m6096M471J7766K6973J5852
$$ y = [-8509, -15374, -2089, -41414, -17522, -36068, -30134, 10281, -16667, -44573, -66679, -92117, -84461, -61479, -28223, -17834, -41646, -44703, -67980, -77656, -34716, -33256, -19418, -15, 16795, -6244, -6973, 11690, 32995, 37233, 31591, 31725, 57402, 66326, 85745, 63563, 28658, -4448, -41086, -59460, -55714, -52486, -62079, -83206, -92505, -86739, -65797, -55547, -60482, -63142, 4390, 11913, 1883, -20710, -44523, -28655, -22237, -13482, -30360, -54961, -52106, -6855, 60839, 91133, 58864, 36399, 25525, 2109, -11846, -26816, -9730, 19781, 66352, 39817, 23963, 16065, 3140, 14130, 28141, 43658, 19635, 12731, -16762, -25716, -4657, 11746, 6927, -41945, -44802, -18413, -33226, -65538, -21941, 16428, 4176, -41920, -37449, -19683, 7290, 23142]
15617B3142k3225l821M5329J1589k8656o230N34J3170n48K1959n960j650L6222
15604H1855J6545m2903j6030n3672L0960O987j563k905k3480k2817J920K3083
15592b020J1920L0835k7153m2317L079k6448n432L2611K8675q047l0780k2762
15580e7839J417J6709J995n677L1256K1800Q760K9348k6339J852J5705N492l2757
15567A1722O567r916j2525j0058J0518K3317k7262k1851p529P06J1883N6884L9033
15554G1489N200k0525k8085j4967N515k9497M220L7498Q138m2481m3497J7663
15542b9329K9332j0158J8447Q563J6543k687n0743k8057L8309O2692K1408m9702
15530B4618j3896l4200o448l8202J5818O7843M074j7495k9288Q085j3663L8338
$$ y = [23142, -83, -3904, 41425, 53014, 24358, 18128, 18662, 31832, 31284, 53243, 47283, 45633, 81855, 98400, 55497, 39467, -14205, 16755, 23742, 22179, 19274, -4206, -27023, -25103, -2020, 9900, 40735, 13582, -28735, -25656, -52104, -57536, -24925, 3750, -4297, -35077, -57839, -56422, -39713, -37718, -43395, -12139, 9661, 18421, 47769, 21430, 23282, 38987, 44479, 11722, 18289, 8373, -4152, -14210, -3692, 19625, -7637, -29488, -37017, -36311, -24428, 32456, 71489, 76689, 56164, 28079, 13112, 18627, -10870, -6650, 30848, 38986, -3495, -46992, -29329, 3, -10155, 8292, 16855, 33398, 30711, -20032, -48089, -9780, 52912, 74320, 24618, 10722, -23478, -29926, -68128, -52310, 15533, 19607, 2112, -27176, -19091, -32754, 5584]
15518E584J8036j698q173M725q035O432o995R380j7261l3817q940k2593J1995
15505e1360j5950j9439J3182L6100K1823K1115P322l1923j3471O562P221L043
15493a5775k01K2331M3403l7001l7419k6211J5387N6134J5699j9522M132K491
15481B3448n056m0784l588J8681K5046J2311K121J1691L977L195M4983nj3033
15468H2987M42n999m660j101j9703j3489n30j4615K724j4586l9444j8387L1846
15455a4515L1591L1310j5041Q293l54q413p114J3542j1195L3554k2511l3229O068
15442A1986K301k5339J0862L8636p572j7260K6491k0914m1588k5464N616K4410
15430a7835J8643L594R065p071Q476Q745K335l377N91J7558l0769m4542O071L7052
$$ y = [5584, 23620, 21922, 13749, 18474, 10439, 16871, 9876, 19256, 1995, -31822, -40762, -63355, -51360, -67310, -86749, -73567, -37467, -15644, 5471, 12793, -19130, -32601, -26039, -18818, -15775, -15976, 6355, 49758, 12757, -24662, -50873, -35486, 20648, 36347, 16825, 20957, 23448, 18392, -22392, -25980, -7299, 17747, 30058, 32179, 43870, 47847, 51042, 96025, 96020, 82987, 83429, 77430, 72770, 71669, 51966, 38477, 37947, 23332, 26056, 11470, -27974, -46361, -14515, 17076, 48386, 33345, 41638, 41284, 32871, 25757, 39299, 28104, 61658, 39147, 5918, 11986, 14287, -11052, -190, 38446, 30874, 13614, 40105, 19191, -22397, -47861, -42245, -17835, 808, 4402, 13467, 6396, 14872, 23617, 25952, 22575, 23166, 40724, 9955, -34587, -28516, 8536]
15416H536L1820k4234k012p159M3355K5180k1549n1874l9124k0255R355M0284
15404g677L8068J1204m828l518k9316j7404j018J0883J3738o431m033j2317O486
15391f163M2863l1125k3943p076O276L9689o173r519k26j4696p421k6974k455
15378d6943l961K7167K4801j203K5651J6866k9917J3038O926l9971P28r250N49
15365a5519L627N157J2710k1906M584j713L9432J7930m478j4120m616k929k1850
15352c691J382M910k524L6605L3086m6917k3338J7019m665k7131r392K1253L135
15339b68K6514o91q87j1202k5715k8728K6713N2028L1472J9112k6134l2244J3304
15326D3274P225k0466R990K8893J2925n1353l7449l836N486M663p820M5160J492
$$ y = [8536, 40356, 16122, 14110, 6951, 50306, 75486, 53937, 2063, -37061, -57316, -47961, -7677, 30391, 41595, 36767, 33249, 3933, -13471, -14489, -3606, 10132, 3701, -332, -12649, -6163, 36700, 5575, -18368, -25444, -19168, 20521, 14348, 4829, 4603, -10093, -17514, -44488, -46943, -50904, -23737, 1064, -139, 25512, 42378, 12461, 25499, 32425, -7546, -6818, -16068, -15519, -11892, -6735, 5975, -15931, -11347, -13060, 26372, 44302, 39824, 25704, 21088, 18159, -3691, -2309, 2601, 77, 36682, 69768, 22851, -487, 16532, 11867, -15264, -24656, -3403, -268, 26246, 25555, 24668, 13466, -12249, -40977, -14264, 37764, 69236, 88348, 62214, 29970, 43274, 50499, 30033, 40023, 68916, 81841, 30488, -6961, -10797, -5311, -648, -8468, 36692, 38184]
15313C8184r90L1355P90o2771q881N4732j8110j6455K0853M739l2493J9002j4227
15300A5728j4896o738j4850l7899k7808M1869M8676l9721k4278K2025K3147J5469
15288G24j1115k6551l3821K5539L6337K7021L4920k3550k7252Q836k6862j2169
15276b7943M3606N1299j0678q814P048j0738j9848J5314j5863k8269J5564K578
15264A3256k9317N094r159J1177M9058k0613j1505L487n715J4744P911L4561j9457
15251D3522k3999l4704k1174O659J0050J4587k5158l8768J404N0119K9052k5050
15239a3460o103J3020K0864J3624J487j5637k1931o114k528J4628K7858j1654
15227A4054l302p327K2841n630L3577N146l4177j4870J3568m3389J1533L5171
$$ y = [38184, 37194, 68549, 69339, 6568, -2313, 52419, 34309, 17854, 38707, 43446, 10953, 29955, 15728, 832, -5906, -20756, -58655, -86463, -44594, 4082, -35639, -59917, -37892, -14745, 724, -10391, -36942, -70763, -45224, -8887, 18134, 53054, 29504, 2252, 11088, -15774, -27943, 15663, 66962, 56284, 47470, 54518, 43780, 23932, 39246, 23383, -4886, 10678, 13256, -16061, -10967, -20126, -8949, 40109, 19496, 7991, 11478, 5763, 20507, 28418, 62979, 43522, 19523, -15181, -36355, -29696, -19646, -5059, -30217, -68985, -67581, -17462, 11590, -13460, -19563, -6543, 14321, 27945, 29432, 13795, -8136, -14250, -16778, -2150, 25708, 14054, 10752, 3425, 26266, 20636, 54213, 59359, 25182, 10312, 23880, -19509, -7976, 27195]
15215B7195k0797p305k011p531K9872J7553j7113K8497J7279l9992j1751M299
15203A8195J8961L740m594L439J2750l364l0122l2985k3617j8M3770K5668q195
15190B3628K5932J3918J7622k2707m5033q567O328k9005k0354j3801L5691j542
15178a7890J5611j9805o691M1187R514N805J3761j684n78k0537J3439j4504j2833
15165D795r037k6080J5380M4653R925k1247m5895j9024J0061M6162N824j4023
15153A494J1176K5073o263M953n623m9200J053K2646L5546K6738M035k9799j3495
15140B8334n4536Q161K4707K17j3313j126k6416J739K1759M5500Q761l839l075
15127C6873n996J7347K4619k7331j7921k0432n4145j639m494K0897j4163K1756
$$ y = [27195, 6398, -907, -2918, -10449, 19423, 36976, 19863, 48360, 65639, 25647, 13896, 18195, 37156, 40896, 36302, 39741, 52491, 49127, 19005, -13980, -37597, -37615, 6155, 31823, 23628, 49560, 63478, 81100, 58393, 13360, 4793, 11121, -17884, -38238, -52039, -16348, -17890, -2279, -22084, -28775, 12412, 21926, 27731, 41492, 39808, 39230, 18693, 32132, 17628, 4795, -4242, -30322, -14942, 29711, 39636, 18389, -27506, -46530, -36469, 9693, 15517, 1494, 12670, 37743, 31480, 36433, 30810, -18390, -17337, 5309, 40855, 67593, 71628, 41829, 28334, -26202, -18041, 6666, 6883, -6430, -7556, -33972, -32233, -10474, 35026, 43787, 39948, 36873, 30877, 48224, 72843, 45512, 27591, 7159, -46986, -48625, -53119, -32222, -46385, -24629]
15115b4629O474Q86J9381K808n21K0594o398O247j1763M694k5504O719J4601K3809
15101C7398K3426M282m4916l6052r150K6382J533j5791J5668K2595j2746J0553
15089B3182J5046Q13m8751q313j1849p700k4503K7896J9302L3683J2639j2925
15077A8520j8363o906K762J5388K542Q330K8728K5964K624N397m8219j8064K028
15064B0731J3213p527k4589j616K4697k3137K0445q008J7471m105K7377J0381
15052F5333k8154m9140j1060J5626M1203K1976l565k4528m3391r577K5947L2182
15040C2852J7472K1239j9446j5369n2764p82K6644Q500J3342R271k3972Q370M900
15027C0257j1834q530K2496J7236l8233J72j3124R451K6690J7930l862R052K2171
$$ y = [-24629, -18155, -17269, 2112, 4920, 4399, 24993, 18595, 24842, 13079, 17773, -7731, -1012, 13589, 37398, 60824, 65106, 20190, -15862, -25012, 1370, 2903, -12888, 2780, 25375, 12629, 23182, 38228, 39041, -9710, -18023, -29872, -37572, -62075, -34179, -14877, 18806, 31445, 18520, 157, -6749, -3987, 11401, 13943, 22273, 51001, 76965, 79589, 84986, 36767, 18703, 20731, 33944, 26417, 1828, 212, 24909, 1772, 22217, 14209, 31680, 27575, 54952, 65333, 37179, -11961, -23021, -7395, 33808, 55784, 52219, 27691, -15700, -25277, 670, 32852, 50324, 71563, 52117, 36748, -16016, -16798, 9846, 18346, 31688, 40959, 16987, 25357, 30257, 18423, 9893, 32389, 49625, 11392, 11564, -1560, 7891, 34581, 52511, 48649, 57701, 79872]
15014G9872k4163r83K3381O936k7134L857Q525K8451j4771k5841J7302M6685k7129
15001I4988m7436K61Q93J7073l1464n5142o344P149M640J1067j1540m8824J4235
14988e0444N7576j1798l3347M502J5860p555k7091K2408L0036l1434j3030j0110
14976e4427K6765J7934k2902J2840J6939J1961k2944J6807k0950J8121K3217q60
14964B2501R43k775K7238L2312l9918n314M1439k8760j214j8846K60l7J6935J3200
14950E7964J655q324j4409j9087M100j9544j4595J7447J6344l285j3374K1548
14938B6440j9178m4712m0148l895N9001N6306N111J6426L5385j8059j6729k5234
14926C0714l290Q508j7413p500L07l1554M0051N7214l1258n0385j6725k486M485
$$ y = [79872, 55709, 54726, 78107, 85043, 57909, 61766, 70291, 98742, 83971, 58130, 75432, 122117, 94988, 47552, 47813, 48706, 65779, 34315, -20827, -27171, -20022, -15382, -4315, -15855, -64679, -50444, 7132, -4666, -38013, -33511, -17651, -25206, -52297, -29889, 147, -31287, -44317, -54427, -27662, -9728, -32630, -19790, -2851, 9110, -13834, 2973, -17977, 144, 23361, 22501, 23444, 20669, 47907, 80219, 40301, 34987, 76426, 47666, 46452, 27606, 27866, 27829, 44764, 57964, 59619, 51295, 36886, 17799, 21899, 2355, -12240, 5207, 21551, 18266, 4892, 26440, 7262, -37450, -77598, -81493, -22492, 33814, 38925, 55351, 90736, 72677, 55948, 30714, 27424, 35932, 18519, 11019, 11326, -20228, 19823, 77037, 45779, -4606, -21331, -23817, -19332]
14913a9332K7704J1892j3418k6237J0595J3973r228j121p35r53n772m768L9791
14900B2391M8505k8160j7063m152j1149J1245N93m0043q727M789K008K426j7898
14887c5235M1049o487K7994l005J0389k5213m2992L6858N0085K4731m8768P92
14875C0198r285k2355l075M8667K2487j5795k0252j5531o9R158k2487J4732j0868
14862E525k820O984O492l1135J5574N821k4694q497n262K6346J4616J4023K4775
14849D7748J9919N1532R253k5293J4386j7992m2735n0006k4768j1305K7501P482
14837E722O587k4129k1787L0292j8023j5929j0484J6211q680K0619L6023p455
14825H967j4727j0607K0999J7325M6948r158n6965m3317J8381M94j6469M3370
$$ y = [-19332, 8372, 20264, 6846, -19391, -8796, 5177, -4051, -5172, -5907, -6860, -12632, -17400, 22391, 70896, 42736, 25673, 21521, 10372, 21617, 22210, -17833, -26560, -21771, -19763, -17337, -35235, 5814, -673, 27321, 24316, 34705, 9492, -33500, 3358, 53443, 78174, 29406, 30198, 20913, -1442, -4517, 44150, 66637, 50842, 30590, 15059, 14990, 24148, 1661, 16393, 5525, 2705, 9689, 16181, -14954, 620, 6441, -18253, -26750, -32012, -5666, 8950, 22973, 47748, 67667, 119199, 128452, 103159, 117545, 99553, 56818, 6812, -17956, -29261, -1760, 5722, 12309, -11820, -33607, -3315, -21338, -37267, -47751, -31540, -40220, -19601, 16422, 8967, -5760, -16367, 4632, 21957, 68905, 59747, 2782, -40535, -22154, -21660, -38129, 5241]
14813E241K291J2983M7454o738l6312J8014l799l10k236l7056k9419P753L2390
14800A0256L7107k0245k2618k040J4421l6742o638m7378o374K4307R117O3176
14788A6349N259j9814o242P595l9156l7867J1390j4774k3377j166J7073P0696
14776a4034N3320k909k5147k0991Q394k1051k5915J553L3411J3823K873j0763
14764g436J9490K8616J1590n9673l5107M1837J3370k9692J2239l485J5373J4803
14752B1925L310k3713J115M8123J7361J9668l4369k7254o721J6197R002j2373
14740C2271J9761j3398J0597K2799m7014j8951L6163N2026K4341J2406J61l4642
14728I6520k8231k4977J2719j5902K806K7721m7030l3236L9374K3011N12j5196
$$ y = [5241, 7532, 20515, 67969, 61231, 24919, 42933, 39134, 38824, 36588, -468, -29887, -22134, 10256, 47363, 27118, 4500, 2460, 16881, -19861, -26499, -73877, -80251, -55944, -46827, 16349, 21608, 1794, -4448, 3147, -36009, -73876, -62486, -77260, -100637, -101803, -84730, -14034, 39286, 36377, 11230, -9761, -1367, -22418, -48333, -46780, -13369, 454, 3327, -7436, 12054, 40670, 52260, -7413, -42520, -683, 12687, -17005, -4766, -8251, 7122, 21925, 25235, 1522, 2637, 50760, 68121, 87789, 53420, 26166, 19445, 35642, 44644, 32271, 52032, 38634, 49231, 72030, 25016, 6065, 42228, 94254, 118595, 131001, 131162, 96520, 68289, 43312, 56031, 40129, 42935, 70656, 23626, -9610, 29764, 52775, 53287, 38091]
14716C8091K2357L0073j2019o2280j5017M8643N848j1507O845o484k5053j7888
14704A609j6016K2699J411J0723K0629K513k89k7143k627N3006K377n4458o0320
14691d5886J1020K0399j5616j3195K2880J0177O930J7890O101k4169J6104N6462
14679F9097m514m8575j0975j5727n393N1116M6400J035j3154j0502j9128k1485
14667A8195j1486K7061K892n739L2413Q725p406P502k3922k9160k2254j3536o307
14654b3022L5241m106O670K7424j4993n0530O143l770J6821J153q964K853K1805
14641A2725M941m2932l2044K5197O72p117O4843M6929J13K5581k2984n1926l1135
14628g137l2641K0416M2825p28j9419J6283k1605r755j3941M1869K0170j3780
$$ y = [38091, 60448, 90521, 78502, 16222, 1205, 49848, 55696, 44189, 51034, 44550, 19497, 1609, -14407, 8292, 9703, 20426, 41055, 43568, 43279, 16136, 13509, 66515, 68892, 14434, -45886, -34866, -14467, -30083, -43278, -20398, -10221, -3291, 14599, 20700, -3469, 12635, 69097, 64583, 16008, 5033, -10694, -16087, 35029, 81429, 82464, 69310, 58808, 39680, 18195, 6709, 33770, 36662, 30923, 63336, 72061, 64655, 72157, 48235, 19075, -3179, -16715, -23022, 12219, 8113, 14783, 42207, 27214, -23316, -17173, -20943, -4122, -2969, -11933, -9080, 12725, 17666, -25266, -57310, -32113, -31441, -38558, 26285, 73214, 73327, 98908, 75924, 23998, -7137, -39778, -19362, 23463, 22735, 3316, 19599, -2006, -11761, -25702, 16167, 36337, 22557]
14616B2557m0224n528K1880J3463R910J0579L5227K5168k569n4391l2595o655
14604c178n063J2152q551j938j9368J266L7569J6607J1460J1741q581p193L8543
14591G5466J4605j4909j469k9502j3770r582R405R251K552j5592o390j9879l0371
14578c0185j1655J408L5854J180L4465k3696q177K4654J0859K4936N64j8419J5022
14565E6810M960k1825j2740P371N43r371L77M217J4947J9964j2905k0011J8350
14552E0687J1828j8113k8275k2894m2138j0356o251j5657J4220J1026K0182K2495
14540a3246M9005J0227j7972l7620Q687L703J8891j0265j7562m0292k1955K2366
14528d6033L5562l2591k2786N586K3965K6940J3340O026l5160k0592J0751K4389
$$ y = [22557, -17667, -23195, -1315, 12148, 22058, 32637, 67864, 93032, 90463, 36072, 3477, -3178, -8241, 3911, -4640, -6578, -25946, -24680, 12889, 29496, 40956, 52697, 44116, 36923, 75466, 90071, 75162, 73693, 44191, 30421, 20839, 30244, 39495, 42047, 26455, 20065, 186, -30185, -41840, -40432, -4578, -3398, 31067, 7371, -806, 23848, 34707, 59643, 60207, 41788, 56810, 61770, 39945, 27205, 34576, 35119, 25748, 26125, 30342, 45289, 65253, 52348, 32337, 50687, 62515, 44402, 16127, -6767, -48905, -59261, -65512, -81169, -66949, -55923, -35741, -13246, 35759, 45986, 28014, -9606, -919, 2784, 21675, 11410, -6152, -46444, -68399, -46033, -10471, -43062, -65848, -60262, -36297, -9357, 3983, 10009, -25151, -45743, -34992, -10603]
14516a0603N2193J4106p74l7663n6555o239L1840J6052J7334R901m128K7206j1240
14503D1430k7439j2052j3209k1740q155L1154J0294k5578J2282R601J0398O910
14491A3896J5403L568q532J8479j4261k294N972k087k5710j9633q448J7633K3038
14478A7024L881J8017O671j0624k8110M177L161N48j9692k0248K6243M2387l814
14465C9621k4675k5179J2437L9412j2735j0133M8888L1126j7801q057o872p033
14453E8999j1210o183l3840K9837K6421l0266J881k4781k49L8685j1639N569k6808
14440A6416j182l806l6534r263J1683K6338M7899J5863j4573O677Q586q29K795
14427G0070j3811l2442l6835k896Q571o20J2709M054k719J6993j6821m575p309
$$ y = [-10603, 41590, 55696, 54922, 17259, -39296, -45535, -13695, 2357, 19691, 29592, 25464, 52670, 41430, 13991, 1939, -11270, -33010, -41165, -10011, 283, -25295, -13013, -3412, 6986, 13896, 29299, 32867, 24335, 42814, 28553, 26259, 32231, 30144, 4434, -15199, -23647, -6014, 17024, 20905, 38922, 45593, 34969, 6859, 11036, 14197, 14745, -4947, -25195, 1048, 43435, 39621, 14946, -10233, 2204, 41616, 28881, 18748, 67636, 98762, 80961, 72904, 66032, 58999, 47789, 41606, 7766, 37603, 64024, 33758, 35639, 10858, 10609, 49294, 37655, 43224, 16416, 15234, 11428, -25106, -34369, -22686, 3652, 51551, 67414, 52841, 59518, 68104, 67275, 70070, 56259, 23817, -13018, -15914, -7343, -7963, 4746, 8800, 6081, 23074, 6253, 1678, -5631]
14414e631j7093k0812L0462M2666j6626n837J4556j9677j2900K8234K5148k389
14402D0101j3079N023j8756O195k6844j3404j0593Q469K3029n646J366N0140O931
14389E2932k1598k1987k843q472M2261j8720j1730J8633K955l2755M5118K7131
14377G0925p466n3171l0578K1939N1703L9319L4315j5050k4923k8328M09L6040
14365I5134k7786m2126k1711l7788J994k3731K8073K6175J684j4410k4179n052
14353d3723L2534M5344m882j4915O292J0498J285J8398K0232k8046r986Q249p96
14340D0484k1418o351J1362k0219P188J3752K6235K2423j2022M105O243N749J2083
14327H9614q124q024l2151l3825o515R430J7826k073J0085J9240P502j63M756
$$ y = [-5631, -22724, -43536, -13074, 29592, 12966, 7129, 21685, 2008, -10892, 17342, 42490, 40101, 27022, 32045, 13289, 19484, -7360, -20764, -31357, -22888, 141, -5505, -4139, 46001, 52932, 31334, 9347, 6504, -1968, 40293, 21573, 9843, 28476, 31431, -1324, 43794, 70925, 63459, 10288, -20290, 1649, 53352, 92671, 126986, 111936, 87013, 58685, 59094, 95134, 67348, 25222, 3511, -34277, -32283, -56014, -27941, -1766, -82, -14492, -38671, -43723, -11189, 34155, 29273, 14358, 20650, 31148, 32433, 50831, 71063, 43017, 33031, 41280, 40484, 19066, 12715, 24077, 3858, 11046, 24798, 51033, 73456, 61434, 65539, 71782, 77531, 89614, 81490, 73466, 41315, 7490, 975, 10405, 28231, 26158, 36243, 55483, 62985, 62822, 67578]
14314F7578L960j160J4857m102m7479l1394K3493N226n4904j2909J6836O1045
14302D1047J1169l5018j2886K5274j782L8797K4072k6834o6794j7186M3089K3532
14290D6480j4038k7307k8871k514r305q463j3510L2696j424L2308M9888J876k8214
14277B9602j83K9828K4376m7474j0810p06N066L724J5682K9871m583j3582k6841
14264C3970k9898q826k6991j8755L1871N561J3901j2627Q404Q206J4354M2541
14252F1711k6874k7229N988p624j7275K8156J9756L999J9585j5712n5087Q34J9940
14239A0168n001j7251J7484k281J0267K4451r428J0543K0910n582j7809j3969
14227B2502K266J7990M7144J1113n7815q908J5243k1408j6451M4785R244J0441
$$ y = [67578, 71538, 70378, 85235, 81133, 33654, 2260, 25753, 30979, -23925, -36834, -19998, 41047, 52216, 17198, 4312, 29586, 27804, 66601, 90673, 63839, -2955, -20141, 22948, 46480, 32442, 5135, -23736, -26250, -35555, -44018, -57528, -24832, -26256, 6052, 55940, 57816, 29602, 29419, 59247, 83623, 36149, 25339, 24633, 29699, 33423, 49105, 78976, 74393, 60811, 33970, 4072, -4754, -31745, -50500, -18629, -13068, 833, -11794, -3390, 4816, 19170, 61711, 34837, 7608, 13596, 5972, -11303, 16853, 36609, 40608, 60193, 44481, -10606, -9772, 10168, 5167, -12084, 5400, 3119, 13386, 37837, 28409, 38952, 59862, 54280, 36471, 22502, 24768, 42758, 89902, 101015, 43200, 34292, 49535, 28127, 11676, 56461, 65705, 76146]
14215G6146k0268l0139R4j4654L240J69J2052l6958J870J9729j5186p292M988
14202f209K5159K0694m4876J2522M2126L0970p993k9923L2064J9657k9436k5231
14190C9524O090P403o794k3944K0258K3190J1672N855L6286J8031l1911l7327
14178F8333J90J3130l507n0584M023J9227J0778q085o531R583J3470k535J392
14165F8884J1300j3727l2620k930j5797L2626J0910P218j5930O563p948J6180
14153F4729K9440R217Q094p0742j9502N082O146M0670J9399O424j7717j1539l3530
14140C6171J6123o457K7498J2325J6773L3180K1932o8675o6805j1300m325M925
14128A1365k7625k0979J2332M6055K9139o858k5432Q196k4220P289j0789k8513
$$ y = [76146, 55878, 25739, 25833, 11179, 14419, 14588, 26640, -10318, -8448, 11281, -3905, -11197, -6209, 18950, 39644, -5232, 7290, 49416, 80386, 72393, 42470, 74534, 94191, 64755, 39524, 45614, 53017, 46223, 22279, 42537, 65727, 77399, 83254, 119540, 137571, 105660, 68333, 68523, 81653, 78146, 27562, 31585, 50812, 61590, 53505, 46974, 56557, 70027, 67492, 68884, 80184, 66457, 33837, 30907, 15110, 47736, 58646, 65864, 49934, 56497, 48549, 64729, 94169, 103386, 111480, 40738, 21236, 26318, 32464, 73134, 92533, 98957, 81240, 69701, 36171, 52294, 45837, 73335, 85660, 102433, 135613, 157545, 88870, 22065, 10765, 6440, 11365, -16260, -37239, -24907, 21148, 50287, 43429, 17997, 26193, 1973, 9262, -1527, -30040]
14116c0040J5892O3097L79j7171k7996j6554L2727L6712j3106k0960j6247o987
14104b54L540O974j0925M030j5464p67J1791J6396N084J5254k8574l0282J3033
14091a0164L2268P813k549j9098q000J1569J4474K7537K0959l1962o1620K3748
14079D975m531k5317J7923Q218J6669J7339K1774k083o0776o957J8770K9569m184
14066C1389j4779p174j5837L6559J9100J677j7940J9282j1960l4607O7123R404
14054H2237j8389M451o402k3415k0956M667o459l054K8995K9391K4886j2739m9994
14041C3219n4277k2410K8494L1037j452j1300O052J9861J2655J9349L0594L146
14029I4968j1685j7182J3297n841m4301j8466R902M621n016l058n673j2858J1080
$$ y = [-30040, -14148, 48949, 49328, 32157, 4161, -12393, 20334, 57046, 43940, 22980, 6733, -254, 3286, 10260, -665, 3365, -12099, -12866, -1075, 15321, 20405, 35659, 7085, -23197, -10164, 22104, 29917, 27368, 8270, 270, 11839, 26313, 53850, 74809, 42847, -18773, 4975, 444, -24873, -6950, 1268, 17937, 35276, 57050, 54967, -5809, -12766, 6004, 35573, 31389, 16610, 9436, -6401, 30158, 49258, 50935, 32995, 52277, 40317, 5710, 72833, 82237, 63848, 68299, 61897, 38482, 17526, 22193, 15734, 12680, 41675, 71066, 95952, 83213, 33219, -21058, -43468, -14974, 16063, 14611, 3311, 9363, 29224, 41879, 61228, 91822, 94968, 83283, 66101, 79398, 73557, 29256, 10790, 20692, 25313, 20297, 17239, 11566, -1292, 9788]
14016I788K6385J8604j2183m5063r988L4129L5444p523j5228J389K5589M188M648
14003G0179k3723l8324J993N1094M1897j6812m4448k9144J337J9231R107k404
13991C9983p585R282L3008j3417l085M2389K295k0504j0810n150k4507j9337j337
13978B1225j626j1093J5178J6818J1886k4254m8075M3335N4178J7347L9472j7654
13966A16737k5968j8977n71m751q19k216L579r973l922j496j4552l452k9183J1774
13952A6210N8690j2097J964L6916o897r259j0474k2112n067N8352L8268k5134
13940A19360j0154l6709m9634N860J2382j1814J925M995j389l7877O956R307J8777
13927C1985N2404l0337k238k507P951k5814k3792J2207K5358L4918k0046l7421
$$ y = [9788, 36173, 54777, 42594, -2469, -12457, 21672, 57116, 49593, 34365, 35754, 61343, 65531, 70179, 46456, 8132, 10125, 61219, 103116, 86304, 41856, 12712, 14049, 33280, 42387, 39983, 32398, 41680, 74688, 61271, 58186, 100575, 102870, 82366, 71556, 66406, 41899, 22562, 21225, 19599, 8506, 23684, 40502, 52388, 28134, -19941, 23394, 77572, 94919, 134391, 116737, 90769, 71792, 71221, 66470, 65651, 63435, 67014, 57041, 53119, 51623, 37071, 33619, 4436, 16210, 74900, 62803, 64767, 101683, 94786, 85527, 75053, 52941, 47874, 106226, 144494, 119360, 109206, 72497, 22863, 28723, 41105, 29291, 31216, 36211, 34822, -3055, 3901, 13208, 31985, 84389, 54052, 51814, 49307, 57258, 31444, 7652, 19859, 45217, 80135, 60089, 22668]
13915B2668k262R095k9404J8249K8034k2922j3935K2845K1418Q61Q014l645k0423
13902C8593k0417k180l7493L214l0727O897K1320Q523J0101J5627n654L9597r774
13889C7627j1357M2944J348j4373L3338J4759j840r7j6976n197j65j028j3577
13876F5406K205N2350K5953l9422l2582l3378j1727J6390R295q592J8232m231
13864E9899l2146k3110K0074L7675P845J5060j9150M921L7336L5714J3498m3208
13852A14408k0044j8527j3398L983L47k4015j767N5421K259j7741l5610Q8J4945
13839F0349J4463k2172K1669l52j5188r549j3542R121N214R473k842p465K9916
13826G9095k0192k4234K4256M2175J5612l8807j8545r048J8836K6510j1719o668
$$ y = [22668, 20406, 29501, 97, 18346, 46380, 23458, 9523, 32368, 53786, 54647, 62661, 59016, 38593, 18176, 15996, -21497, -18283, -49010, -42113, -20793, -12270, -2169, 13458, 7804, 47401, 37627, 26270, 69214, 70562, 56189, 89527, 104286, 102446, 102349, 85373, 80176, 80011, 78983, 65406, 67611, 119961, 145914, 106492, 73910, 40532, 28805, 45195, 54490, 45898, 64130, 59899, 27753, 4643, 24717, 62392, 70237, 85297, 66147, 71068, 108404, 144118, 157616, 114408, 94364, 75837, 62439, 66422, 66769, 42754, 40987, 96408, 98667, 80926, 45316, 45404, 60349, 74812, 52640, 74309, 73957, 58769, 49220, 35678, 44799, 50013, 59486, 56644, 49179, 79095, 58903, 34669, 58925, 101100, 116712, 77905, 59360, 50312, 69148, 95658, 83939, 77271]
13814G7271k0847J5446l5390L0887q83M1938l8173k5175N997N065L3623k6123
13802F3636j1408j9042K3765K4123m432l492J7798J3755m532l2266m3668o28r256
13789A4353l1862L9174m9j5485n447M2180J3026J8629j0467k699k3029j5848K139
13776B4615K416K6388k0707J8777Q297K6440o492j1071O803L1251r997J1579j7126
13763I1173m6881J2755K6389M4277k3929o7568p897J2035k4996L4851L9002j2979
13751G6232k4223l9509l2206M6907K4704j0845n508k581K9990J8746o32j7278
13739F3797p209P948l418j9762J596j3358L6419j625k2622L619K1344N204J4733
13726H6666n495k6952k33K1041K6857R172j3817K7046k1896p9707Q67K2767N331
$$ y = [77271, 56424, 71870, 36480, 67367, 66484, 108422, 70249, 45074, 51071, 56136, 89759, 63636, 52228, 33186, 56951, 81074, 76642, 73150, 90948, 104703, 100171, 67905, 24237, 23609, 14353, -17509, 21665, 21616, 6131, 684, 42864, 55890, 74519, 64052, 61353, 38324, 22476, 24615, 27031, 53419, 32712, 51489, 59786, 86226, 79734, 68663, 75466, 106717, 96720, 108299, 91173, 44292, 57047, 83436, 127713, 103784, 36216, 28319, 40354, 15358, 50209, 89211, 76232, 52009, 12500, -19706, 27201, 51905, 41060, 35552, 32971, 62961, 81707, 81075, 63797, 56588, 64536, 61118, 41356, 42952, 29594, 66013, 64388, 41766, 45385, 66729, 71933, 86666, 81171, 54219, 53986, 75027, 101884, 111056, 97239, 124285, 102389, 22682, 23549, 46316, 51647]
13713E1647q931p503L401L5865J1960J0010k3484k8208j8288M4718J9169j3730
13701G6626j3682J6879Q841k3168l3735K2162K7226N4383p09j6578L367n959n946
13688A09707J8905k1101m3827j5442j7867j508L4061K1205J9651K4327L0156l2449
13676A25818j0302K0575k8926N981J841j1752l4911J34m724j4069j9457k3245
13664F963j0149j2573J9050R367M0541L8563L1011M279n39J0257Q686K0266j4029
13651A51693n0590q871j183m0711l8928J7187K4946M2438J1729k0528l1674k9661
13639B5847M3K4788P2777p528q051k6753o992K2451r087l6353k8206J537R37k1621
13625C789K4283J3459J997l4336L291K3606J4067o480q665R470k038J7533J6016
$$ y = [51647, 42716, 35213, 38614, 74479, 86439, 96449, 72965, 44757, 26469, 71187, 90356, 76626, 62944, 79823, 88664, 65496, 31761, 53923, 81149, 135532, 134823, 118245, 121612, 115653, 109707, 128612, 107511, 63684, 48242, 30375, 28867, 62928, 84133, 103784, 128111, 158267, 125818, 115516, 136091, 107165, 113146, 114987, 103235, 68324, 68458, 63734, 49665, 30208, 6963, -3186, -15759, 3291, 12658, 53199, 91762, 122773, 127052, 126513, 136770, 145456, 165722, 151693, 101103, 92232, 91049, 50338, 11410, 28597, 53543, 95981, 107710, 87182, 55508, 25847, 25890, 50678, 123455, 115927, 107876, 81123, 74131, 96582, 87495, 51142, 22936, 24473, 25410, 3789, 28072, 41531, 43528, 9192, 12483, 36089, 50156, 43676, 35011, 44481, 42443, 59976, 75992]
13612G5992j0491k360P211K2030l3092N708J0764J0048m0106j4397L9408J5106
13600H5821K5166J2632m8499j9018j3719p232K067K8793M1929K653m8005k4720
13588C7868L308K2564M5943L8596K7043k0151k0555q244J1842j5504n3599J0739
13576G9850K3675j0477j183j1018k2308l9699j4895J2355K4599J171J6818J0076
13564F8964K721J1249J9470j6257j1577K7497K5654j1422l2055N607j8328P70
13552G2293J9980L8853k0744k5246q28J801J5971K5539J904J0175k6554j7209
13540I5935K0130J2690P274j0978j1604j7872j0471r034K6429J8676r978k4788
13528H6409J3488L0435k3417l5787L664l2506L1844M761o744L9917K399k7125
$$ y = [75992, 65501, 63141, 70352, 92382, 59290, 64998, 75762, 85810, 45704, 31307, 70715, 85821, 110987, 123619, 75120, 56102, 42383, 35151, 37218, 66011, 107940, 110593, 62588, 37868, 41176, 63740, 109683, 148279, 175322, 155171, 134616, 126372, 138214, 122710, 69111, 79850, 103525, 93048, 91865, 80847, 58539, 18840, 3945, 16300, 40899, 42070, 58888, 68964, 71685, 82934, 102404, 86147, 74570, 102067, 127721, 116299, 84244, 89851, 71523, 72293, 92273, 131126, 110382, 85136, 84308, 86109, 102080, 127619, 129523, 139698, 113144, 95935, 116065, 128755, 136029, 125051, 113447, 95575, 85104, 76070, 102499, 121175, 111197, 86409, 99897, 130332, 106915, 71128, 74792, 42286, 74130, 78891, 72147, 112064, 114463, 87338]
13516H7338J5296o884q249J1341j816r16J6903j797k3050L970j4152J0635J5369
13503A03988l4545n7904o790L1551K1302K826L4318K6998O716M366J1039O140
13491A50005j8001J5666q601p543l65j1936K0569q806k7193M608J6694J4267l6227
13478A03137r125K634l0633o859K2788l253k1102m554K0712K9907K1571j4086
13466A11137n264J3766K5792l249l8094L109N071j2328J7352K5928r408O491p
13453A40296R956M1184J5730j8479j4620l867l6920M933K529J0837j6350j8550
13441A16679Q681Q663j2661J0544K3900J2619J8000k449k8382l6628j8960M1573
13429A41579O425k9951j0666J7864L6538N925Q426J9669n687m7086m506M414L3120
$$ y = [87338, 102634, 95750, 87501, 98842, 97026, 96110, 113013, 111216, 88166, 92136, 77984, 88619, 103988, 69443, 11539, 4749, 36300, 57602, 60428, 94746, 121744, 128460, 132826, 143865, 150005, 132004, 147670, 139069, 131526, 131161, 119225, 139794, 130988, 103795, 108403, 125097, 139364, 103137, 94012, 96646, 66013, 59154, 81942, 78689, 57587, 53033, 73745, 103652, 125223, 111137, 105873, 119639, 145431, 142182, 104088, 107197, 112268, 99940, 117292, 143220, 133812, 140303, 140296, 150252, 191436, 207166, 188687, 174067, 170200, 133280, 138213, 140742, 151579, 135229, 116679, 125360, 134023, 121362, 131906, 155806, 168425, 186425, 183976, 155594, 118966, 100006, 141579, 148004, 118053, 107387, 125251, 161789, 167714, 176140, 195809, 190122, 143036, 138530, 142944, 176064]
13416A76064J6181l6820k0446o165L2917j0111N425K6964J3317J679Q73J1824
13404B11702p644o19K8679L428j1636l7538l0175J5597L3006L1363o480l3714
13392A95969j6207J931Q22l1639j3435M3543M8420l2729l6842k4014j1871j081
13380A22867O7728K9802L136m5320o668k5347J1771J2112R714r779r457l4022
13368A26537J106J2923J081J4999K0410L682q497J1315J1560p314j318J432m806
13355A83110j7848m9007J6129N2391L8688j1506L260L5143j0752L7157Q28k4487
13343B53106O046m860o1233m79o806l0221r236l855m448j3615K792m657L6796
13330A59330K9084J243J3976k5804M947K7355J0995j3973j7482J3593m230k3543
$$ y = [176064, 192245, 155425, 134979, 128814, 161731, 151620, 157045, 184009, 197326, 199005, 199878, 211702, 204058, 203439, 232118, 235546, 223910, 186372, 156197, 171794, 204800, 236163, 229683, 195969, 179762, 181693, 182515, 150876, 137441, 180984, 229404, 196675, 159833, 135819, 123948, 122867, 190595, 220397, 223533, 178213, 171545, 146198, 157969, 170081, 179795, 170016, 160559, 126537, 127643, 140566, 141647, 156646, 177056, 180738, 172241, 183556, 195116, 187802, 186484, 187916, 183110, 165262, 116255, 132384, 184775, 223463, 211957, 215217, 250360, 239608, 276765, 277593, 253106, 259152, 254292, 193059, 192580, 185774, 155553, 146317, 142462, 138014, 124399, 127191, 122534, 159330, 188414, 189657, 203633, 177829, 182776, 210131, 221126, 207153, 189671, 203264, 199034, 175491]
13318A75491j4391P932M087j4939q866O5147J1229k5740M883K1578J2525L850
13306B42786l281k1911m8201k2726j0058L2148n696j0981n148k342M174K1022
13294A69786M8126k561k3154j9030j6572m4267l7807m215K6894J8906J0673l795
13282A22984l3157K0613K0401N442j4378j5805l136J3436l312Q896O408J3900
13270A42292M2048P822l6350r000l915M5667O268k4816n0428k8439k1734M9772
13258A19187L6789m314j0159Q54J9729J7074r48p587J3736J8365j0141n7290m7404
13245H7891K902J0629q450J2887L7959m718j2912k8430L2377j5603R519M7197
13233A71248j7798o5664L1004J4514j2322J223m096J3985J1672J6371O809j261
$$ y = [175491, 161100, 169032, 173119, 158180, 149314, 214461, 225690, 199950, 204833, 226411, 238936, 242786, 239505, 217594, 169393, 146667, 136609, 168757, 163061, 152080, 146932, 144590, 148764, 169786, 217912, 215351, 192197, 173167, 156595, 112328, 74521, 70306, 97200, 116106, 126779, 122984, 89827, 110440, 130841, 136283, 121905, 106100, 102964, 116400, 113088, 121984, 128392, 142292, 184340, 192162, 155812, 146812, 142897, 188564, 194832, 170016, 119588, 91149, 69415, 119187, 155976, 151662, 141503, 142357, 162086, 179160, 178212, 170625, 184361, 202726, 192585, 135295, 87891, 90793, 101422, 92972, 105859, 143818, 139100, 126188, 97758, 130135, 114532, 124051, 171248, 153450, 87786, 118790, 133304, 120982, 122205, 118109, 132094, 143766, 160137, 166946, 165685]
13221A65685L6648R518k767l0909m2319j0566K9178L3000l7886K4433J0918J1989
13209A96922n232K3619P200p46j0335n0750l4198K2953O4932N0999n657k4041
13197B35666j673J0840J5581j7217K1958L4190m4094n4434k2916J1414K4064K2988
13185B36367m5272m4879o137k0795J9198L321R608M684L1456K1413k757l0940
13173A75267J3990L70l7684L4484J6570j4836K7531M854r656O652q260K1925J6769
13160B47976J6636k790l7583l7518K4916J2978p699l919K0168j2917J0782J6914
13148B47944J0532j9558k9254j4020J7084K122l4432P979L235o190p196o238M5917
13135B17925L5216J750k750q564L5179K0997k2289j9941L7527j3705l1948J6555
$$ y = [165685, 202333, 211851, 209084, 178175, 135856, 125290, 154468, 187468, 149582, 174015, 184933, 196922, 191690, 215309, 222509, 221763, 211428, 160678, 126480, 149433, 214365, 265364, 259707, 235666, 233993, 244833, 260414, 243197, 265155, 299345, 255251, 200817, 177901, 189315, 213379, 236367, 191095, 146216, 140079, 119284, 138482, 141803, 151411, 156095, 187551, 208964, 206207, 175267, 189257, 189627, 151943, 186427, 202997, 188161, 215692, 220546, 210890, 217542, 209282, 231207, 247976, 264612, 261822, 224239, 186721, 211637, 224615, 216916, 212997, 233165, 220248, 231030, 247944, 258476, 238918, 209664, 195644, 212728, 214850, 180418, 188397, 191632, 185442, 178246, 172008, 217925, 253141, 254891, 252141, 243577, 278756, 299753, 277464, 257523, 295050, 281345, 249397, 265952]
13123B65952K6680J2278j0680k1479K2848j4965k9082L186j0112K0360K1729M0363
13111C27078K26o971O418M3235L7137j2098k7849m7693j3976M3056q120k6502
13099C13941p161k4062k0027N5220M4456R671j9131m624l1271M59J4906J232K0149
13086C53758R999j2395J3070n89R407J628J9295J9619q637N6260j442j5146j1000
13073D33827l8697j0703J7986j7415j7443k9887o120L4001L024O4057K5410N0952
13061E08992q80l4867j600j6582K87N4032J7291J6493m4516R546M2140K2308J1945
13048E84589L4356J8289j6753k0695p654L8325l401M2273O4491Q281O958K3055
13036G72114P797K2710J9131M716K0055M4678l235N56k003K2441L4726L9882N0023
$$ y = [265952, 292632, 304910, 294230, 272751, 295599, 280634, 251552, 254738, 244626, 264986, 286715, 327078, 327304, 320333, 326751, 369986, 407123, 395025, 367176, 319483, 305507, 348563, 340443, 313941, 306780, 282718, 262691, 317911, 362367, 372038, 352907, 348283, 317012, 317471, 332377, 333609, 353758, 363757, 351362, 364432, 363843, 373250, 374878, 394173, 413792, 405155, 461415, 459973, 444827, 433827, 395130, 384427, 402413, 384998, 367555, 337668, 331548, 365549, 368573, 432630, 458040, 508992, 508112, 473245, 471645, 455063, 455350, 509382, 526673, 543166, 498650, 508196, 550336, 572644, 584589, 618945, 637234, 620481, 599786, 592132, 630457, 627056, 669329, 733820, 742101, 749059, 772114, 779911, 802621, 821752, 826468, 846523, 891201, 887966, 888522, 886519, 908960, 943686, 983568, 1033591]
13023A033591O4733O5515J8915L4100J8843P9857J15453N7557P1027R6963J04209
13012A760763J06311J25041J63315J41581J54210K00670J79407J91618J92545
13003C215461K40503K59372K45289K39138K30793K58316K74763K84425L07299
12994E555359L09675K73328L12420K99543L18383L01216L07030L35764L46514
12985H359232L30537L37489L63650L54424L37734L23027L14414L67942K97688
12976A1386137L10687L29767L46303L27939L40960L17174K78389K67876K50247
12967A4155479J93270J37290J61461J76781J40858J29795J34532J24706J17886
12958A5472058J24719P9574Q2294N8794L0348Q8080O7932O1745O3703P0845P1299
$$ y = [1033591, 1098324, 1163839, 1182754, 1216854, 1235697, 1315554, 1431007, 1488564, 1559591, 1656554, 1760763, 1867074, 1992115, 2155430, 2297011, 2451221, 2651891, 2831298, 3022916, 3215461, 3455964, 3715336, 3960625, 4199763, 4430556, 4688872, 4963635, 5248060, 5555359, 5865034, 6138362, 6450782, 6750325, 7068708, 7369924, 7676954, 8012718, 8359232, 8689769, 9027258, 9390908, 9745332, 10083066, 10406093, 10720507, 11088449, 11386137, 11696824, 12026591, 12372894, 12700833, 13041793, 13358967, 13637356, 13905232, 14155479, 14348749, 14486039, 14647500, 14824281, 14965139, 15094934, 15229466, 15354172, 15472058, 15596777, 15676351, 15758645, 15817439, 15847787, 15935867, 16003799, 16065544, 16129247, 16200092, 16271391]
12947A6271391L1240K3602Q377p689o0103j08346j14195j00050q4432r8607j42825
12936A5618363j93821j71182r9612j46343j66208j45803k09756j94972j89866
12927A4100800k20938k64673k77364k70625k84360k84486k58204k67291k47576
12918A1725283k33437k17341k05838k20347j93666j48155k04575j66739j09290
12909A0025895p4007m4696p0259p1239n8847k2036M9716K5018j7251j3516N2322
12898I781100R4462R0878Q4966R7357R3350J65824J97966J97890J90885K05875
12888A1200553K36572K09290K44495K76173K75438K50988K48825K95097L16068
12879A3553499K62151K78944K44931K03793J87847K37649K28283K15954K16391
$$ y = [16271391, 16302631, 16326233, 16334610, 16326921, 16266818, 16158472, 16044277, 15944227, 15859795, 15761188, 15618363, 15424542, 15253360, 15153748, 15007405, 14841197, 14695394, 14485638, 14290666, 14100800, 13879862, 13615189, 13337825, 13067200, 12782840, 12498354, 12240150, 11972859, 11725283, 11491846, 11274505, 11068667, 10848320, 10654654, 10506499, 10301924, 10135185, 10025895, 9951888, 9907192, 9836933, 9765694, 9706847, 9684811, 9734527, 9759545, 9742294, 9728778, 9781100, 9875562, 9966440, 10051406, 10148763, 10242113, 10407937, 10605903, 10803793, 10994678, 11200553, 11437125, 11646415, 11890910, 12167083, 12442521, 12693509, 12942334, 13237431, 13553499, 13815650, 14094594, 14339525, 14543318, 14731165, 14968814, 15197097, 15413051, 15629442]
12870A5629442K00575K01189K11853K29603K20446J95614J55537J68572J38709
12861A7351540J07286R0959M9563O8798N3493J4837N271J0878K0316K702l1361
12850A7744282n872K370l3827m6798j8552p2260p2001j25412j38424j60644k07322
12839A6865540j91537j89147j76080k15635k28820k03832k75792l24411l01920
12830A4758366k82043k62095k63196k65308k43541k40852k97297l41403l36878
12821A2225753k89349l11106l29763l36148l27689l47581k86429k65560k94437
12812I437691l05876l18251l19565l79106l51368k96114k96575k50652k42874
12803F677310k55679k88711k63531k55443k43059j93121j97458j96866j43886
$$ y = [15629442, 15830017, 16031206, 16243059, 16472662, 16693108, 16888722, 17044259, 17212831, 17351540, 17458826, 17549785, 17599348, 17668146, 17721639, 17736476, 17741747, 17752625, 17772941, 17775643, 17744282, 17738410, 17740780, 17706953, 17660155, 17641603, 17569343, 17497342, 17371930, 17233506, 17072862, 16865540, 16674003, 16484856, 16308776, 16093141, 15864321, 15660489, 15384697, 15060286, 14758366, 14476323, 14214228, 13951032, 13685724, 13442183, 13201331, 12904034, 12562631, 12225753, 11936404, 11625298, 11295535, 10959387, 10631698, 10284117, 9997688, 9732128, 9437691, 9131815, 8813564, 8493999, 8114893, 7763525, 7467411, 7170836, 6920184, 6677310, 6421631, 6132920, 5869389, 5613946, 5370887, 5177766, 4980308, 4783442, 4639556]
12794D639556j45459j70522j24486j32529j01114j07546r6202j19256j09457p6995
12784C455990p1315k5132l0124m8288p5722n0268k0249q1132p7503k112m9014
12773B925131O366l890m4242k4373k5662k8362j1583l6206m9078k4811j2493l9005
12761B631792k5197j2451L2303Q720k1187l3743l9023N0655L5603m4695o0955
12750B521822j9743k9992j8168j3861Q144j1562l0295j6228J4631J5008l4846
12739B384910j2013m515m8847j5403q335m927K095n5037m3212j6240J6632K388
12727B197496l6252k0026J3346l8612m4110l5225n0993j1662m5061P822J6164
12716A952887j3881k6046n0935p560p680j6170L722k6676o0871k8469J883l2850
$$ y = [4639556, 4494097, 4323575, 4199089, 4066560, 3965446, 3857900, 3761698, 3642442, 3532985, 3455990, 3384675, 3359543, 3329419, 3281131, 3205409, 3155141, 3134892, 3053760, 2976257, 2974145, 2925131, 2931497, 2927607, 2883365, 2858992, 2833330, 2804968, 2793385, 2757179, 2708101, 2683290, 2670797, 2631792, 2606595, 2594144, 2626447, 2635167, 2613980, 2580237, 2541214, 2591869, 2627472, 2582777, 2521822, 2502079, 2472087, 2453919, 2440058, 2448202, 2436640, 2406345, 2390117, 2404748, 2419756, 2384910, 2372897, 2368382, 2319535, 2304132, 2295797, 2290870, 2292965, 2237928, 2194716, 2178476, 2195108, 2197496, 2161244, 2141218, 2154564, 2115952, 2071842, 2036617, 1985624, 1973962, 1928901, 1936723, 1952887, 1939006, 1912960, 1862025, 1854465, 1846785, 1830615, 1834337, 1807661, 1746790, 1718321, 1720204, 1687354]
12704A687354n739l2846l6230k2189k0231p9325o0583j4804j2589l1166o3724
12693A307928l7505j0158l666O131o18l1315l1540n243l1817o5873m1146j9654
12681A035524j068j9293j4878o1259l8792j3893n910j8165k1521l5414m404m3223
12669G57704j3413j9642r990k1523m5546k3124o454j112k0964m0671k8329J5950
12657E42886K6924l7313l6518J4124j6093j483j0338j5018m3514q671r685k6084
12645C79217k8585l003n945L029K0539L3966K1453j8246l295N3162K2061j6244
12633D58109l2737L343k5720j3400m2149l2433J9604K4695l7926l1316K9645J1904
12621C31619j2685J0092j3102l6969k6037K0076K9176J1119l444L5368J6768k1539
$$ y = [1687354, 1681615, 1648769, 1612539, 1590350, 1570119, 1490794, 1430211, 1415407, 1402818, 1371652, 1307928, 1270423, 1260265, 1256599, 1262730, 1262112, 1230797, 1199257, 1194014, 1162197, 1096324, 1055178, 1035524, 1034456, 1015163, 1000285, 939026, 900234, 886341, 880431, 862266, 840745, 805331, 800927, 757704, 744291, 724649, 714659, 693136, 647590, 624466, 618012, 616900, 595936, 555265, 526936, 542886, 569810, 532497, 495979, 510103, 494010, 492527, 482189, 467171, 423657, 414986, 405301, 379217, 350632, 347629, 341684, 344713, 365252, 399218, 420671, 402425, 399130, 452292, 474353, 458109, 425372, 428715, 402995, 389595, 347446, 315013, 334617, 359312, 321386, 290070, 319715, 331619, 318934, 329026, 315924, 278955, 252918, 272994, 302170, 313289, 309845, 345213, 361981, 340442]
12609C40442m4063p402l1493K92Q797K3100O882J0615K6338j8531r810j78K1094
12596C26083M6763L2025J6571k3203q1862o7716K155j742k4443K6115p768m2910
12584B00068k9797J6558M7344j7673l2581J0853J9870K0312L800k0652l4488Q323
12572A91937J1881J0582k807n654K1733J4225J7483j21J1626J5953j8272l9845
12560B28721M1838M0243l6033j4439M0158J7449o453J5635j8335l8837l4391J630
12548B37186L6121N827l2482M338K936j7396m133Q494P680m1274n1315k0601Q45
12535A36226J8794K5069J8066M2936N643m622J1780l4903j2486Q73O058K2077
12523B35511J9080J9594j2543m0M6006p208l0459n791l2609K917L5847j3981l5879
$$ y = [340442, 296379, 288977, 257484, 257776, 266573, 289673, 296555, 307170, 333508, 314977, 305167, 304989, 326083, 372846, 404871, 421442, 398239, 316377, 248661, 250816, 249074, 224631, 250746, 242978, 200068, 170271, 186829, 234173, 216500, 183919, 194772, 214642, 234954, 238754, 218102, 183614, 191937, 203818, 214400, 211593, 205939, 227672, 241897, 259380, 259259, 270885, 286838, 268566, 228721, 270559, 310802, 274769, 260330, 300488, 317937, 311484, 327119, 308784, 269947, 235556, 237186, 273307, 279134, 246652, 250990, 253926, 236530, 232397, 240891, 248571, 207297, 155982, 135381, 136226, 155020, 180089, 198155, 241091, 246734, 242112, 253892, 218989, 206503, 207376, 213434, 235511, 254591, 274185, 261642, 261602, 307608, 300400, 269941, 264150, 231541, 234458, 270305, 256324, 220445]
12510B20445J9425K0604k3188j1222k618l480R565K0563K8666J5590P340k9463
12498B72227j4850J4686J3398K5984o098k9957j4944J1751k796K0048K6327K3127
12486C38903L6808j07l3845J9117K7178k0460m020j2855m5260K1348J2348j1742
12474C27413O452J308K976J0807j3399o179J1480J4172j8770J0577m263m2979
12462B99595K7829O687l2054J6238L0773J8706J4285O530k1093J203o798l5954
12450C25947k8041J1346L0463q259M130R463k4267k3064j8058j1674R937j2326
12438B65597L829L4050O0243L9277j4156k7280l5057q87J8581k8631l0166m0782
12426B44618n305K5427K464L5629J111j2413j240j5075j1090Q325j9674J3318
$$ y = [220445, 239870, 260474, 237286, 226064, 223446, 219966, 229531, 250094, 278760, 294350, 301690, 272227, 257377, 272063, 285461, 311445, 305347, 275390, 260446, 272197, 269401, 289449, 315776, 338903, 375711, 375604, 341759, 360876, 388054, 367594, 363574, 350719, 305459, 326807, 339155, 327413, 333865, 335173, 338149, 348956, 335557, 329378, 340858, 355030, 336260, 346837, 342574, 299595, 327424, 334111, 302057, 318295, 349068, 367774, 382059, 388589, 367496, 368699, 361901, 325947, 297906, 309252, 339715, 331456, 335586, 345049, 320782, 297718, 279660, 267986, 277923, 265597, 269426, 303476, 363719, 402996, 388840, 361560, 326503, 325616, 344197, 315566, 285400, 244618, 239313, 264740, 267204, 302833, 303944, 291531, 290291, 275216, 264126, 272451, 252777, 266095]
12414B66095J4338l8182n919K2732o92J1088J5941J6180J4200k1586l613K7931
12402C18513L5675M2997l6417k1940j2534k6239k1309M7692K8951q159K5328l923
12390C68635k0626k1864j2438J3844K8590L557k0859M2476O564l1680o64j8633
12378C36902K7807r818j2653p377J9512P175L616M77K0422K644K0785k8875L798
12365C84415j1204j6094r350l753K2657j3871J1491J3169l1459j8789K1464k2333
12353C26343o220J0144p488K0789M2582L2162L1564l4549n0555j3019j1286k306
12341C38161q162M7245L9812O317k1700k0875O746r599k5188k8745j4880j798
12329C07334K2647O552o857j5754j3782L471L2318N377J2572j3096M709n561j0556
$$ y = [266095, 280433, 242251, 236332, 259064, 258372, 269460, 285401, 301581, 315781, 294195, 290582, 318513, 354188, 397185, 360768, 338828, 326294, 300055, 278746, 326438, 355389, 347230, 372558, 368635, 348009, 326145, 313707, 327551, 356141, 359698, 338839, 381315, 387879, 356199, 355535, 336902, 364709, 354891, 342238, 334861, 354373, 361548, 365164, 365641, 386063, 388707, 409492, 380617, 384415, 373211, 357117, 347767, 344014, 366671, 352800, 364291, 377460, 346001, 327212, 348676, 326343, 320123, 330267, 322779, 343568, 386150, 418312, 449876, 415327, 364772, 351753, 340467, 338161, 329999, 377244, 417056, 423373, 401673, 380798, 387544, 377945, 352757, 324012, 309132, 307334, 329981, 336533, 329676, 313922, 300140, 303611, 335929, 341306, 353878, 340782, 345491, 339930, 329374]
12316C29374k1040k0968R517r667Q897J0389j387J0030J7729j109J6827p986l6440
12303C04166j4594J1685l223o405J747K0239J3152j2725K0222q957M2991l8485
12291C29813n3407n631M1318K2012K633j4294r251k1537j162J3139j1293j0889
12279B81451p754k4504R265l0888Q633N748O02q566N100N54M1234j4184l726Q105
12265B71070j5281j5952K2632j0802j5636K6947j1094Q844K4393O1211M3846n278
12253C84900j9067n5918k0585K8367K5586O824k6493k0002l423K8197r621j377
12241C17388L3520M0757J6118n1859k946O472K3478N369J4161k7585j4546L0715
12229C91042J0099m611N577k0157k3412n04M187L1816j1771k0303k125j3563J8700
$$ y = [329374, 308334, 287366, 296883, 287216, 296113, 306502, 305115, 315145, 332874, 331765, 348592, 340606, 304166, 289572, 301257, 298034, 291629, 293376, 313615, 326767, 314042, 334264, 325307, 368298, 329813, 276406, 270775, 312093, 334105, 336738, 322444, 313193, 291656, 290494, 303633, 292340, 281451, 273697, 249193, 258458, 227570, 236203, 241951, 242553, 233987, 239087, 239641, 280875, 266691, 262965, 271070, 255789, 239837, 262469, 251667, 236031, 262978, 251884, 260728, 285121, 346332, 390178, 384900, 365833, 309915, 289330, 317697, 343283, 350107, 323614, 303612, 300189, 328386, 318765, 317388, 350908, 391665, 407783, 355924, 352978, 359450, 382928, 388297, 402458, 374873, 360327, 391042, 401141, 396530, 402107, 381950, 358538, 358034, 362221, 394037, 382266, 361963, 359838, 346275, 364975]
12216C64975L617l547K6303Q969K0680Q291L3790N5388J7284N0337O5372M6629
12204F98088M6240L6664J9178q99l5485o9895o5618k6236k7429k8578k2407l9201
12192D84422q807o802l2376m2811K7278O6646K9154k1138j1946j3132M136J2044
12180D86668J909q095J7737K3188j8060J3806M8832j9956k7181j7929l2644l1342
12168D36933K9028k86k1249J2747J7780N864J0706J4510j346l5363k1230j6158
12156D31936K9718j2457j023M4801L6055n086L0368O855j389k8808J505K2663
12144E55138o65J5632K3746j7477L3197L832j4402N939N4722l5829m7287j1767
12132E64779o808R360n305k0660M349o219j0846K516j176L0812J2713M3474K2443
$$ y = [364975, 368592, 365045, 391348, 400317, 420997, 429288, 463078, 518466, 535750, 586087, 651459, 698088, 744328, 780992, 800170, 799271, 763786, 693891, 628273, 602037, 574608, 546030, 523623, 484422, 475615, 468813, 436437, 393626, 420904, 487550, 516704, 495566, 483620, 470488, 474624, 486668, 488577, 480482, 498219, 521407, 503347, 517153, 565985, 546029, 518848, 500919, 468275, 436933, 465961, 465675, 444426, 457173, 474953, 480817, 491523, 506033, 504687, 469324, 448094, 431936, 461654, 449197, 448174, 492975, 529030, 523944, 554312, 561167, 559778, 530970, 532475, 555138, 554473, 570105, 593851, 576374, 609571, 613403, 599001, 604940, 659662, 623833, 576546, 564779, 557971, 567331, 562026, 541366, 545715, 539496, 528650, 531166, 529990, 560802, 573515, 616989, 639432]
12119F39432k2356J7860L6722l1854l763K1555k5485j6695k890l91N9443J7759
12107F89337J5673O961m8940k537N2931L1159J9815J3134k962O027K7435K3713
12095H31746J4126j0005Q685K5049O5839J2597j3959N247o378j7777M635K838
12083I22643k5064k197M481R384N059L7170M5331J0062P733J8466j6229l111N8561
12070A072289M9714L051J9189K0639J5224J0975l1819L7941K9123J4845L4993
12059A276164L9387R114q086M0605L1027K4434K8863k2331k0919J5113J5049L5018
12047A463438K2421M3562L8356l171L0766P431J8596M0581L4015J6627M8959M636
12035A766217M5834N2305N7736L2943J7251Q8164N4706o920j6047O7239L0773
$$ y = [639432, 617076, 634936, 671658, 639804, 636041, 657596, 632111, 615416, 612526, 612135, 671578, 689337, 705010, 711971, 663031, 660494, 713425, 744584, 764399, 777533, 774571, 780598, 808033, 831746, 845872, 835867, 844552, 869601, 935440, 948037, 934078, 939325, 932947, 915170, 919805, 922643, 897579, 895382, 899863, 909247, 914306, 951476, 996807, 1006869, 1014602, 1033068, 1016839, 1013728, 1072289, 1122003, 1125054, 1144243, 1164882, 1180106, 1191081, 1159262, 1197203, 1226326, 1241171, 1276164, 1315551, 1324665, 1316579, 1357184, 1388211, 1412645, 1441508, 1419177, 1398258, 1413371, 1428420, 1463438, 1485859, 1529421, 1567777, 1564606, 1595372, 1602803, 1621399, 1661980, 1695995, 1712622, 1761581, 1766217, 1812051, 1864356, 1922092, 1955035, 1972286, 2060450, 2115156, 2108236, 2092189, 2159428, 2190201]
12024B190201J5007M1377Q1111O2775L4929N3058O0926P5267M6657P0204J01385
12013B832897J32528O9128L1766Q5926J43360J02632J20269J32768J28213J30604
12003C910091J30403J11099J37051J88353J86398J96433K17958K04684K17388
11994E499858K13007K32048K29291K56954K86822L42446L77512L54862M21423
11985H214223M42562M68132N20402N38792N93664P15753P62370P84627Q52369
11976A3892894R66361J032752J150000J303809J447684J665416J869583K093285
11968B5421784K428746K767605L195105L735465M356238N102934O019696P125885
11960F0153458Q560275J0310699J2500446J5304369J8936727K3544178K9261670
$$ y = [2190201, 2205208, 2246585, 2327696, 2390471, 2425400, 2478458, 2539384, 2614651, 2661308, 2731512, 2832897, 2965425, 3034553, 3066319, 3152245, 3295605, 3398237, 3518506, 3651274, 3779487, 3910091, 4040494, 4151593, 4288644, 4476997, 4663395, 4859828, 5077786, 5282470, 5499858, 5712865, 5944913, 6174204, 6431158, 6717980, 7060426, 7437938, 7792800, 8214223, 8656785, 9124917, 9645319, 10184111, 10777775, 11493528, 12255898, 13040525, 13892894, 14859255, 15892007, 17042007, 18345816, 19793500, 21458916, 23328499, 25421784, 27850530, 30618135, 33813240, 37548705, 41904943, 47007877, 53027573, 60153458, 68713733, 79024432, 91524878, 106829247, 125765974, 149310152, 178571822]
11953A78571822L6164880M3841624N1058040N4788662M9510963K9603560l169794
11946D40369757l5827747n4837211n7991209n1694910m2499303l3891555k6846053
11939A36781769k1353413j7128240j3885327j1385298r390681p762425o467088
11932D9409297n445099m644111l995426l440447k953018k558626k286293k044831
11924B2041446j781612j572594j411331j222054j132239j031190r47247q46829
11916A2096350p36521p16480o14933n46362n18196m80110m49798l71668l57928
11907G304354l43343l12456l18232k75551k51621k57573k67759k26381k06360
11898D845078k21299j64942j55473j43186j23801j25706j39000j63993j43713
$$ y = [178571822, 214736702, 258578326, 309636366, 364425028, 413935991, 443539551, 440369757, 404542010, 349704799, 291713590, 240018680, 197519377, 163627822, 136781769, 115428356, 98300116, 84414789, 73029491, 63638810, 55876385, 49409297, 43964198, 39320087, 35324661, 31884214, 28931196, 26372570, 24086277, 22041446, 20259834, 18687240, 17275909, 16053855, 14921616, 13890426, 12943179, 12096350, 11359829, 10643349, 10028416, 9482054, 8963858, 8483748, 8033950, 7662282, 7304354, 6961011, 6648555, 6330323, 6054772, 5803151, 5545578, 5277819, 5051438, 4845078, 4623779, 4458837, 4303364, 4160178, 4036377, 3910671, 3771671, 3607678, 3463965]
11889C463965p5747o8298q1338o8254j06407r9640j08860r9077l9882q8665m3291
11878B584506o3148o3922l9317o8129o1939o0174n2571o0520j1392n7533q8158
11867A957703j06305p1594o6012l8251l5722q307p476M821n0539j699j2902n2919
11855A510798l8149k4798p5079m6114k0950j4827k225M9783J5128n4170l6246
11844A263151k5074o5900q3092k5485K2260N7407J1340J3839M0609p516l9475
11833A162064l0927J1583n4352J9443k121j0102M727j0917K6298j4605J3044M6587
11821A160722M4657p227j4576j8324n5090n5612m0472l6894m2790m5389q494n895
11809H74616j4598n2791o6072l9960J3920K0856J8908k8250J3439j5950K7118
$$ y = [3463965, 3388218, 3319920, 3238582, 3170328, 3063921, 2964281, 2855421, 2756344, 2716462, 2627797, 2584506, 2521358, 2457436, 2418119, 2349990, 2288051, 2227877, 2175306, 2114786, 2103394, 2045861, 1957703, 1851398, 1779804, 1713792, 1675541, 1639819, 1631512, 1624036, 1628857, 1578318, 1576619, 1563717, 1510798, 1472649, 1447851, 1372772, 1326658, 1305708, 1290881, 1288656, 1338439, 1353567, 1299397, 1263151, 1238077, 1172177, 1089085, 1063600, 1085860, 1143267, 1154607, 1168446, 1209055, 1201539, 1162064, 1131137, 1142720, 1088368, 1107811, 1105690, 1095588, 1100315, 1089398, 1115696, 1101091, 1114135, 1160722, 1205379, 1198152, 1183576, 1165252, 1110162, 1054550, 1014078, 977184, 934394, 889005, 880511, 874616, 860018, 807227, 741155, 701195, 715115, 735971, 754879, 726629, 740068, 724118, 751236]
11798G51236L92k8942l2710M6738K6187k1090j0991j9680n74j1446M349k1292
11786F82177j2252P59K3812l6406L201K6135k2904J2067j6875m2672M587J6058
11774F37687N06k3751J1214J0061k9607P600L5804K7164k7020l727m625l3287
11762F08019m0903q549l1342k2971J788R440j8453j3577J4903M2838O770J1523
11750E59486K4033J6520J7163j5431r815l1233K9821k4722j904K7426M368J9234
11738F14946r441j1747M3684K151p166j7515r821J9364j3976N356j05j5314N478
11725F05894j5575l8850k4835L4448O928L76J3080O405m471K2759j5952Q266J160
11712E99633p970J4154K1529J089J957L2292K5079j6824K1531j1356R875k4972
$$ y = [751236, 751628, 722686, 689976, 736714, 762901, 741811, 730820, 711140, 710566, 699120, 703469, 682177, 669925, 670684, 694496, 658090, 661291, 687426, 664522, 676589, 659714, 617042, 621629, 637687, 638193, 614442, 625656, 635717, 606110, 613710, 649514, 676678, 649658, 645931, 641306, 608019, 567116, 558567, 527225, 504254, 506042, 515482, 497029, 483452, 498355, 541193, 547963, 559486, 583519, 600039, 617202, 601771, 591956, 560723, 590544, 565822, 563918, 591344, 595712, 614946, 605505, 593758, 637442, 639593, 632427, 614912, 605091, 624455, 610479, 615835, 615730, 600416, 605894, 590319, 551469, 526634, 561082, 568010, 568386, 581466, 587871, 583400, 606159, 590207, 598473, 599633, 591663, 605817, 627346, 628435, 630392, 662684, 687763, 670939, 692470, 681114, 690989, 666017]
11700F66017m2275K2575M8386o367j6289J1074J6678L7015k3465k5576K2948m673
11688G06048M2221J1385k6589l7838K4968N193j1879N6587N2823M684l447J0727
11676H34883M4250O7340K0716K1j3478L4034M2010J5894K0693J0322M3972J02414
11664A223071L4262L2036O6598N9717R1274R0251O7812J27363J43334J19157J47652
11653B202527J63573J71237J85715K46318K70521L13905L67779L81743M02221
11644D705539M14102M71270N38090N75332O11507O24364O41701O52382O28416
11635I862703N57411M91616M04516K56768J88971J63446J76868K07164K18068
11626A2527531K11031J85373J50321M3687n7q0616j03900j57993k01332k67941
$$ y = [666017, 623742, 646317, 694703, 688336, 672047, 683121, 699799, 736814, 713349, 687773, 710721, 706048, 748269, 759654, 733065, 695227, 720195, 725388, 713509, 770096, 822919, 827603, 824156, 834883, 879133, 946473, 967189, 967210, 953732, 987766, 1029776, 1045670, 1066363, 1076685, 1120657, 1223071, 1257333, 1289369, 1355967, 1415684, 1506958, 1597209, 1665021, 1792384, 1935718, 2054875, 2202527, 2366100, 2537337, 2723052, 2969370, 3239891, 3553796, 3921575, 4303318, 4705539, 5119641, 5590911, 6129001, 6704333, 7315840, 7940204, 8581905, 9234287, 9862703, 10420114, 10911730, 11316246, 11573014, 11761985, 11925431, 12102299, 12309463, 12527531, 12738562, 12923935, 13074256, 13117943, 13117886, 13037270, 12933370, 12775377, 12574045, 12306104]
11616A2306104k99979l22272l50343l46143l42605l43052l42275l83156m14370
11607I161909m29531m20728m70030n11833m90177m75265m48387m50309l82084
11598E083565l29520l13225l13171k67946k17966k06579j69810j73350j43006
11589B948992j24654j44944j47117j12020m2939l1832o6160q7735n3808m9949
11579B087834k8825n3706j6763K1210l5276k5455j5234J7830K4349L7043M022
11568B017029j739o210J5537L9143J2572M1441L7650M4173O4638O8992N8293P4942
11556B466461J07967J27741J06780J66172J73709J75549K35594K83386K35203
11547D078562K70579L45246L89351M20362M62637N29326N75532O08320O16003
$$ y = [12306104, 12006125, 11683853, 11333510, 10987367, 10644762, 10301710, 9959435, 9576279, 9161909, 8732378, 8311650, 7841620, 7329787, 6839610, 6364345, 5915958, 5465649, 5083565, 4754045, 4440820, 4127649, 3859703, 3641737, 3435158, 3265348, 3091998, 2948992, 2824338, 2679394, 2532277, 2420257, 2377318, 2345486, 2279326, 2191591, 2137783, 2087834, 2059009, 2005303, 1988540, 2009750, 1974474, 1949019, 1933785, 1951615, 1975964, 2013007, 2017029, 2015290, 2009080, 2024617, 2063760, 2076332, 2117773, 2155423, 2199596, 2264234, 2333226, 2391519, 2466461, 2574428, 2702169, 2808949, 2975121, 3148830, 3324379, 3559973, 3843359, 4078562, 4349141, 4694387, 5083738, 5504100, 5966737, 6496063, 7071595, 7679915, 8295918]
11538H295918O28476O38425O20341O28718O02238N29822M87615N19784M64330
11529A3415667M54212M74083M28741M04968L85455L39258L11455K23187J67425
11520A6604451O6843m4613j51810j77828k38888l02022l41234l36279l16436l57944
11510A4404240m48084m54123m55969m39913m99610n21585n53180n75591n67684
11501I888501n48797o08819o03424n08516m64589m36697m21979l99724l45440
11492E550516k55541j79007j64244k13692k33412j75877j14322j18876j20477
11483C975068r7287o7636l0902p018k9948l9313m1278j2537K4862M3811K1133
11472C738955O5802L2124M3409N4281M2526R1274R4568J32483R9624J10220J86684
$$ y = [8295918, 8924394, 9562819, 10183160, 10811878, 11414116, 11943938, 12431553, 12951337, 13415667, 13869879, 14343962, 14772703, 15177671, 15563126, 15902384, 16213839, 16437026, 16604451, 16671294, 16626681, 16474871, 16297043, 16058155, 15756133, 15414899, 15078620, 14762184, 14404240, 13956156, 13502033, 13046064, 12606151, 12106541, 11584956, 11031776, 10456185, 9888501, 9339704, 8730885, 8127461, 7618945, 7154356, 6717659, 6295680, 5895956, 5550516, 5294975, 5115968, 4951724, 4738032, 4504620, 4328743, 4214421, 4095545, 3975068, 3877781, 3810145, 3779243, 3772225, 3742277, 3702964, 3661686, 3649149, 3674011, 3717822, 3738955, 3804757, 3836881, 3880290, 3934571, 3977097, 4068371, 4162939, 4295422, 4395046, 4505266, 4691950]
11461D691950K06442J99204J87752K14849K65157K58064K65470K56561K69647
11452F815096L31839L58182L60957L43670L31062L62626L50076L16009K59661
11443I829178K37914K49454K29253K22828J38886O7973P8478N3545j587J0142
11433A1116064r256k8708l0925l2585j9382j866j5880l3949j8106n978K668l7832
11421A0884265k7215o6638j20354j11721j08769j56341k10613k12139k42976k95037
11411I332462l53838l46230l54137l43777l13956l91907l97213l61108l72742
11402F097554l04710k59603l12560k97437k24565j96180j86785j74608j66168
11393C974938j45539j44876q9815j02281p9719j9095k3203p0022n7697m7300K3962
$$ y = [4691950, 4898392, 5097596, 5285348, 5500197, 5765354, 6023418, 6288888, 6545449, 6815096, 7146935, 7505117, 7866074, 8209744, 8540806, 8903432, 9253508, 9569517, 9829178, 10067092, 10316546, 10545799, 10768627, 10907513, 10975486, 11053964, 11107509, 11105922, 11116064, 11106808, 11078100, 11047175, 11014590, 10995208, 10993342, 10977462, 10943513, 10925407, 10919429, 10922097, 10884265, 10857050, 10790412, 10670058, 10558337, 10449568, 10293227, 10082614, 9870475, 9627499, 9332462, 8978624, 8632394, 8278257, 7934480, 7620524, 7228617, 6831404, 6470296, 6097554, 5792844, 5533241, 5220681, 4923244, 4698679, 4502499, 4315714, 4141106, 3974938, 3829399, 3684523, 3594708, 3492427, 3412708, 3393613, 3370410, 3300388, 3242691, 3195391, 3219353]
11382C219353K7434j0313J0943k2290J9831N3689J06427O6919P7970J07618J01407
11371C758988J11532J17819R5018J21877J74397J55417J50578J87146K28518K28954
11361E330244K48302L00333L24038L63618L43129L61265M33210M38313M24153
11352H566605M25469M12596M78568M91294M79399L83910L71777L82107L36253
11343A2327978K97731K72861K45142J94801J14450P2306L9805J1095m8047m4256
11333A3483866n1286k9517m8376p7451m4881l9066l5908q5415p8489r6102o3389
11322A2833986j02923r7339j40840j75495j61589k24743k82312l13710l49570
11313A0985465l65863l76052m35889m90356m74796m61458m44179m60012m67415
$$ y = [3219353, 3246787, 3236474, 3247417, 3225127, 3244958, 3298647, 3405074, 3471993, 3549963, 3657581, 3758988, 3870520, 3988339, 4083357, 4205234, 4379631, 4535048, 4685626, 4872772, 5101290, 5330244, 5578546, 5878879, 6202917, 6566535, 6909664, 7270929, 7704139, 8142452, 8566605, 8992074, 9404670, 9883238, 10374532, 10853931, 11237841, 11609618, 11991725, 12327978, 12625709, 12898570, 13143712, 13338513, 13452963, 13525269, 13565074, 13576169, 13528122, 13483866, 13432580, 13403063, 13354687, 13277236, 13232355, 13193289, 13157381, 13071966, 12993477, 12897375, 12833986, 12731063, 12633724, 12492884, 12317389, 12155800, 11931057, 11648745, 11335035, 10985465, 10619602, 10243550, 9807661, 9317305, 8842509, 8381051, 7936872, 7476860, 7009445]
11304G009445m50361m23194l88868l68654l40887k98132k89318k83110k63238
11295C903683k58276k00052j62662j83540j99562p3869o9912j36868p5549j01640
11285B441753j27571j13634q8613n8867o6887l2882m4441p3626n9874l7190k5046
11274A713122q071n9492o007k4354j1528l3007k5595O144k2073l4542o4528k0859
11262A409210L1736J1784j7806q537K3586J8109J7471j601l2641j0293j8743L623
11250A425898L7809j8195k3558L12O061L7714K3946J5846j4346P7008K635n646
11238A565484P472R158M3925J5770K8370M5565L5660M1047K9497j2407J4002N3892
11226A877435Q0760K4115P138O4333P7465K5926K5381Q3403P6656N8264P2160
$$ y = [7009445, 6559084, 6135890, 5747022, 5378368, 5037481, 4739349, 4450031, 4166921, 3903683, 3645407, 3445355, 3282693, 3099153, 2899591, 2825722, 2755810, 2618942, 2543393, 2441753, 2314182, 2200548, 2111935, 2053068, 1986181, 1953299, 1908858, 1835232, 1775358, 1738168, 1713122, 1705051, 1645559, 1639552, 1615198, 1603670, 1570663, 1545068, 1551212, 1529139, 1494597, 1430069, 1409210, 1440946, 1452730, 1434924, 1426387, 1449973, 1468082, 1485553, 1483952, 1451311, 1441018, 1422275, 1425898, 1463707, 1445512, 1421954, 1422266, 1428327, 1466041, 1489987, 1505833, 1491487, 1568495, 1571130, 1565484, 1572956, 1582114, 1626039, 1641809, 1670179, 1715744, 1751404, 1792451, 1821948, 1809541, 1823543, 1877435, 1958195, 1982310, 1989448, 2053781, 2131246, 2157172, 2182553, 2265956, 2342612, 2400876, 2473036]
11215B473036J06637Q0982M8970Q1072P8918J46809J16743Q2885N4560J08708
11205C379320J20063O9039J28030J22676J19676J05792J27660J51707J25882Q5078
11195D534923Q8047J03867J04199J53472J36073J20688R2070J08422J08146J20299
11185E670206R1896M7156J05471J24283J28013Q5912O9874N7117M1101L9486N0650
11174F511165O4413N4767N9022L0223J0570N0843K3199M1535L333l024p898j696
11162F836452L0579j8839k6604J7096k1562n2113o2286l1718K3051l9314p4191
11151F580551p7098r8995o9759j262n7310n6530r9116j14630p9146q8379j24118
11140E714208q8420o3900q2185q8257r2858j17050j01176o8845r1653p2206n9181
$$ y = [2473036, 2579673, 2660655, 2709625, 2790697, 2869615, 3016424, 3133167, 3216052, 3270612, 3379320, 3499383, 3568422, 3696452, 3819128, 3938804, 4044596, 4172256, 4323963, 4449845, 4534923, 4622970, 4726837, 4831036, 4984508, 5120581, 5241269, 5333339, 5441761, 5549907, 5670206, 5762102, 5809258, 5914729, 6039012, 6167025, 6252937, 6322811, 6379928, 6421029, 6460515, 6511165, 6575578, 6630345, 6689367, 6719590, 6730160, 6781003, 6804202, 6845737, 6849070, 6846046, 6838148, 6836452, 6867031, 6848192, 6821588, 6838684, 6817122, 6765009, 6702723, 6671005, 6694056, 6654742, 6580551, 6503453, 6404458, 6334699, 6333437, 6276127, 6219597, 6120481, 6005851, 5926705, 5838326, 5714208, 5625788, 5561888, 5479703, 5391446, 5298588, 5181538, 5080362, 5011517, 4919864, 4847658, 4788477]
11129D788477m7802o6359j05866q1505o1567o7012q8016r5720q9178o7651p1021
11118C946780l8504k0122o1940o0809p5040p6298p1153k9421l8357p5654l4801
11107C364681j3752o8581o5619n2678o4526j8569l1063p7026n6407k0533K4974
11096B920901k0690p8208l5105j9812o1113m5110j7529K8543j7103l7601m9199
11085B567974p972j4872P835o5671o0647m787J2230J9673l7469j1705n78j3852
11073B390159J4352L962j9052k3839r203L2297j4360K9734k214k8335J603J8419
11061B393523k4047J1362O342j1786k8165K3743N8172M4261R447K8788o278J7107
11049B522469L3885K8378J8917L2181K9239L9939K6685R830K663k6511j0705J2431
$$ y = [4788477, 4740675, 4674316, 4568450, 4486945, 4425378, 4358366, 4270350, 4174630, 4085452, 4017801, 3946780, 3908276, 3888154, 3826214, 3765405, 3690365, 3614067, 3542914, 3513493, 3475136, 3399482, 3364681, 3350929, 3282348, 3216729, 3164051, 3099525, 3080956, 3049893, 2972867, 2916460, 2895927, 2920901, 2900211, 2822003, 2786898, 2767086, 2705973, 2660863, 2643334, 2671877, 2654774, 2617173, 2567974, 2560002, 2545130, 2552965, 2487294, 2426647, 2421860, 2434090, 2453763, 2416294, 2404589, 2404011, 2390159, 2404511, 2408473, 2389421, 2365582, 2356379, 2388676, 2374316, 2404050, 2401836, 2373501, 2375104, 2393523, 2369476, 2380838, 2387180, 2375394, 2347229, 2370972, 2429144, 2473405, 2482852, 2511640, 2505362, 2522469, 2556354, 2584732, 2603649, 2635830, 2665069, 2705008, 2731693, 2741523, 2744186, 2717675, 2706970, 2719401]
11037B719401M4944Q363R791P6684N1169M1237K0223J9932J8493l5988J171K2483
11025B997903K644J3616J9959M9541P1216L1866j0107o9343n2093j5012n2207
11014B987983j6138j0260M34N311J721L5918M4689j2648o3669o5149n5059n3945
11002B799188l4662l8484n9670k1886M5239N4108m911k2442m8762l5204R85p2442
10990B561057k3607O193n1498m388M785m328n046L9220q052J3642j8607j2730
10978B496641K9793O3512L1881l4761k3417K6651K0566L055K5518O6949L0863
10967B737251j6116K0802K3528N2973N4384N0226L8045J6604P3040N9867J6591
10956C127195N3824O9318P4466O1668M5212N8287Q5937J03420Q3354R3917J25367
$$ y = [2719401, 2764345, 2772708, 2782499, 2859183, 2910352, 2951589, 2971812, 2991744, 3010237, 2974249, 2975420, 2997903, 3000547, 3014163, 3034122, 3083663, 3154879, 3186745, 3176638, 3107295, 3055202, 3040190, 2987983, 2971845, 2961585, 2962019, 2967330, 2969051, 3004969, 3049658, 3037010, 2973341, 2908192, 2853133, 2799188, 2764526, 2726042, 2666372, 2644486, 2689725, 2743833, 2738922, 2716480, 2667718, 2632514, 2633499, 2561057, 2537450, 2543643, 2492145, 2487757, 2492542, 2488214, 2483168, 2522388, 2514336, 2527978, 2509371, 2496641, 2526434, 2589946, 2621827, 2587066, 2563649, 2590300, 2610866, 2613921, 2639439, 2706388, 2737251, 2721135, 2741937, 2765465, 2818438, 2872822, 2923048, 2961093, 2977697, 3050737, 3110604, 3127195, 3181019, 3250337, 3324803, 3386471, 3431683, 3489970, 3575907, 3679327, 3762681, 3856598, 3981965]
10945C981965J12174P4572P4462P6547J29100J27361J61215J27144J54043J93370
10935E211953J94766J96537K15364K31280K46254K33583K42385L35546L43457
10926G451125L50482L68421M25776M70160M23403M69260N07077N90318O69263
10917A1725285P49601Q21221Q54218R47380J077913J115329J188524J358492J500079
10908B1338042J634882J800579J944415K111272K274216K453515K572993K714650
10900C8844564K791242K848647K838025K756734K612557K355372K092469J762956
10892E8902566J429845J112615O76547L25879Q6035j11719k80658l54047l95160
10883F1391903m44233l73517l42587k72272j58275n5687O9129J56966K09266K77485
$$ y = [3981965, 4094139, 4168711, 4243173, 4319720, 4448820, 4576181, 4737396, 4864540, 5018583, 5211953, 5406719, 5603256, 5818620, 6049900, 6296154, 6529737, 6772122, 7107668, 7451125, 7801607, 8170028, 8595804, 9065964, 9489367, 9958627, 10465704, 11056022, 11725285, 12474886, 13296107, 14150325, 15097705, 16175618, 17290947, 18479471, 19837963, 21338042, 22972924, 24773503, 26717918, 28829190, 31103406, 33556921, 36129914, 38844564, 41635806, 44484453, 47322478, 50079212, 52691769, 55047141, 57139610, 58902566, 60332411, 61445026, 62121573, 62447452, 62533487, 62421768, 62141110, 61787063, 61391903, 60947670, 60574153, 60231566, 59959294, 59801019, 59745332, 59814461, 59971427, 60180693, 60458178]
10873F0458178L49860L29622K72993J54465M2798j77442m49790p64371j089411
10864E9126902j415402j748326k118105k426978k605579k737945k762697k805049
10856D0506821k772900k675281k540010k422153k269868k132726j958840j783722
10848B1951321j624211j476257j357636j258827j146921j015294r57763q54114
10840A2260298p73768p45994o70634o16655n05657m94638m41931m14204m13259
10831G183558l12859k97659l17048k61705k49999k46498k53482j79136j12452
10822D952720j35427j58566j61781j06868j22378r4857r2981j14530n4815o1479
10812C849038q1146j8566m93K2270J4632J0801R678L5574M3299N6176J10306J10173
$$ y = [60458178, 60808038, 61137660, 61410653, 61565118, 61607916, 61430474, 60980684, 60216313, 59126902, 57711500, 55963174, 53845069, 51418091, 48812512, 46074567, 43311870, 40506821, 37733921, 35058640, 32518630, 30096477, 27826609, 25693883, 23735043, 21951321, 20327110, 18850853, 17493217, 16234390, 15087469, 14072175, 13114412, 12260298, 11486530, 10740536, 10069902, 9453247, 8947590, 8452952, 8011021, 7596817, 7183558, 6870699, 6573040, 6255992, 5994287, 5744288, 5497790, 5244308, 5065172, 4952720, 4817293, 4658727, 4496946, 4390078, 4267700, 4172843, 4079862, 3965332, 3910517, 3849038, 3767892, 3749326, 3748833, 3771103, 3785735, 3796536, 3806214, 3841788, 3885087, 3941263, 4051569, 4161742]
10800D161742R7505J47059J63855J75570J72189J60124K27862K83753L36016L35215
10790F260890L42027L17903L27229L81000L87699L95482M09062M14285L76745
10781I612322L59543L63024L57980L52892K89852K41002K01471J84775J33793
10772A2096654Q5507O0408J2092K6895m7898m7058n5154m6589l3046P883J4901
10761A2074595L1282j2588k0073J0701N6302j9141l7757K3260L077l5865m9138
10750A2024655r4435j83932j80229k23610k82982k59592l29737l74952m06891
10741I688295m49858m31008m37167m49298m17307m14911m39482m06288l39390
10732E903586l19454l11889l46264l40489k59368j79261k07389j42327r3851j07896
$$ y = [4161742, 4259247, 4406306, 4570161, 4745731, 4917920, 5078044, 5305906, 5589659, 5925675, 6260890, 6602917, 6920820, 7248049, 7629049, 8016748, 8412230, 8821292, 9235577, 9612322, 9971865, 10334889, 10692869, 11045761, 11335613, 11576615, 11778086, 11962861, 12096654, 12182161, 12242569, 12254661, 12281556, 12233658, 12186600, 12131446, 12084857, 12051811, 12059694, 12074595, 12105877, 12093289, 12073216, 12083917, 12140219, 12121078, 12083321, 12106581, 12109658, 12073793, 12024655, 11930220, 11746288, 11566059, 11342449, 11059467, 10799875, 10470138, 10095186, 9688295, 9238437, 8807429, 8370262, 7920964, 7503657, 7088746, 6649264, 6242976, 5903586, 5584132, 5272243, 4925979, 4585490, 4326122, 4146861, 3939472, 3797145, 3703294, 3595398]
10722C595398j65424j73911j06936q8094o3289o6443p3578o2248p4177o5184l9062
10711B617052q629k1450k6346J4957L7577J2149K4313O8209K7265M7631R4308
10700B887036Q3920M0953Q6556J00764J06694J10518J65254J78705K04490K22634
10690D187524K21098K55144K67642K95215K95937L06850L34511L34959L35851
10681F834731L74606L88024L34320K84708K83745K80619K56226K27349K11692
10672I476020J77977J25305J19753M8977N941l0732r844j7375l158K480l0304
10661I865040p3299j174o276l3252M569N2643M6647M6544J6071M0707K2529k7310
10649I953439j5149l0632q9652j41093j76850k23901k69868k44399k21573j96260
$$ y = [3595398, 3429974, 3256063, 3149127, 3061033, 2997744, 2931301, 2857723, 2795475, 2721298, 2656114, 2617052, 2608423, 2586973, 2560627, 2575584, 2613161, 2625310, 2649623, 2717832, 2745097, 2792728, 2887036, 2970956, 3011909, 3098465, 3199229, 3305923, 3416441, 3581695, 3760400, 3964890, 4187524, 4408622, 4663766, 4931408, 5226623, 5522560, 5829410, 6163921, 6498880, 6834731, 7209337, 7597361, 7931681, 8216389, 8500134, 8780753, 9036979, 9264328, 9476020, 9653997, 9779302, 9899055, 9948032, 9953973, 9923241, 9913397, 9896022, 9892864, 9895344, 9865040, 9791741, 9790567, 9784291, 9751039, 9755608, 9808251, 9854898, 9901442, 9917513, 9958220, 9980749, 9953439, 9938290, 9907658, 9818006, 9676913, 9500063, 9276162, 9006294, 8761895, 8540322, 8344062]
10639H344062k24556l00142k57353k48757k42866k03855j61458j40696j04092
10630F460287q9033r7871r9114o1279K0460R7735K60684L76440N69240Q16213
10620H253762J098571J599494K059853K532538K952686K975898K263318R82059
10612B4718179k51886q73606p77460n5106R53783K156941L568765M974077N988282
10603D0401969N879342L828964L38583k850354m087098l445346j717044K09776
10595C8558792K280876M432155O410417P492132O688623L273418k149017o661548
10587F0325848p998699o793969m607387k352101k67596J621415L140495L820508
10579D6888514L001444L87079l215568n921675o418722n314654l719102k172212
$$ y = [8344062, 8119506, 7819364, 7562011, 7313254, 7070388, 6866533, 6705075, 6564379, 6460287, 6371254, 6273383, 6174269, 6112990, 6133450, 6231185, 6491869, 6868309, 7437549, 8253762, 9352333, 10951827, 13011680, 15544218, 18496904, 21472802, 23736120, 24718179, 24466293, 23592687, 22815227, 22760121, 23713904, 25870845, 29439610, 34413687, 40401969, 46281311, 50110275, 50448858, 47598504, 43511406, 40066060, 38349016, 38558792, 40839668, 45271823, 51682240, 59174372, 65862995, 69136413, 66987396, 60325848, 52327149, 45533180, 40925793, 38573692, 38306096, 39927511, 43068006, 46888514, 49889958, 50277037, 47061469, 41139794, 34721072, 29406418, 25687316, 23515104]
10571B3515104r54809k6544O57361Q13762L08848q07529k177562l106137l246797
10562A4975697k777695k186034j633938j167101r45777p05417n16660l80365l49456
10553D313254l10106k18415j93312k02561j78271j73876j10721o9394m0562m2695
10543B773341q7951j01658m7201o0706m7064o2809J2508J1187o4332l9087k7816
10532B258412k1324J2185p994l3454q866k0093m7365j1159l9262l9088J566m8880
10520A994678p1409l0617o816Q799J4484l1050j6602n2739m2096n0305m1456o5190
10508A609681j6988L4844K6155l5678m4359k6409m1653m0526j134K0904l1664
10497A453173j1733P60m3691k6224L983k8737q349l2735j5708J461k2190O331
$$ y = [23515104, 22560295, 22533751, 23191112, 24004874, 24313722, 23506193, 21328631, 18222494, 14975697, 12198002, 10011968, 8378030, 7210929, 6265152, 5559735, 5043075, 4662710, 4313254, 4003148, 3784733, 3591421, 3388860, 3210589, 3036713, 2925992, 2856598, 2816036, 2773341, 2685390, 2583732, 2536531, 2475825, 2428761, 2365952, 2378460, 2389647, 2325315, 2286228, 2258412, 2237088, 2249273, 2241279, 2207825, 2198959, 2178866, 2131501, 2120342, 2081080, 2041992, 2043558, 1994678, 1923269, 1892652, 1885836, 1894635, 1909119, 1878069, 1861467, 1808728, 1766632, 1716327, 1674871, 1609681, 1592693, 1627537, 1653692, 1618014, 1573655, 1547246, 1505593, 1465067, 1463933, 1484837, 1453173, 1441440, 1442200, 1398509, 1372285, 1376268, 1347531, 1339182, 1306447, 1290739, 1292200, 1270010, 1276341]
10485A276341j4331q778J8364L7376j6911j9468j0034k101q317j9899j7157j4006
10473A201079J151O7827N3551J6644r88n680J0387K1513L3500l94P189K6452M7051
10460A479282J7572p542n40J2503K9681K7809J8776K3131O1137M5366N3650N6631
10448A817456M5323M7622Q6550M9999J7001N0775O3423M7586N0472Q7109M6835
10437B410151N9309L5205N0441Q8753O5323M4298N9576R7405J18912J19517J13818
10426C262708J33842J42062J69011K05376K09759K43868K27132L06121L21211
10417E221090L78807M50126N19531M59345M86215N72122O14543N83927N49700
10408I835406N55590N78025N32329M83797M36683M45712M32486M18647L85471
$$ y = [1276341, 1262010, 1253232, 1271596, 1308972, 1292061, 1272593, 1262559, 1260458, 1252141, 1232242, 1215085, 1201079, 1202230, 1270057, 1323608, 1340252, 1339264, 1333584, 1343971, 1365484, 1398984, 1398590, 1405779, 1432231, 1479282, 1496854, 1489312, 1488772, 1501275, 1530956, 1558765, 1577541, 1600672, 1661809, 1707175, 1760825, 1817456, 1862779, 1910401, 1996951, 2046950, 2063951, 2114726, 2178149, 2225735, 2276207, 2363316, 2410151, 2469460, 2504665, 2555106, 2643859, 2709182, 2753480, 2813056, 2910461, 3029373, 3148890, 3262708, 3396550, 3538612, 3707623, 3912999, 4122758, 4366626, 4593758, 4899879, 5221090, 5599897, 6050023, 6569554, 7028899, 7515114, 8087236, 8701779, 9285706, 9835406, 10390996, 10969021, 11501350, 11985147, 12421830, 12867542, 13300028, 13718675, 14104146]
10399A4104146L91700L37666L27257L02167K77202K27992J58438R1479K6633q0322
10389A6164358j73247j60678k06712k72528l57889l42294l28573l45567m12450
10380A3564420m16524m17138m40702n13256n36961n60804o17497o36866n77371
10371H847301n52723n48659n29348n04691m52399m29522m00492l23421l08024
10362D798022k54234k01379j48045j30343j31652j54830j51236j15539q5000r8674
10352C327090j14131j07157r3719p2462p4965n4291o1099n736m3481m2367k8633
10341B629049j3348K2071M4553l63n7432J8299M1722N1406L4808O0194N7541P2311
10329B960811N9946O4729J33619J10995J32817J36104J82247K16737K82349L16048
$$ y = [14104146, 14495846, 14833512, 15160769, 15462936, 15740138, 15968130, 16126568, 16218047, 16244680, 16164358, 15991111, 15830433, 15623721, 15351193, 14993304, 14651010, 14322437, 13976870, 13564420, 13147896, 12730758, 12290056, 11776800, 11239839, 10679035, 10061538, 9424672, 8847301, 8294578, 7745919, 7216571, 6711880, 6259481, 5829959, 5429467, 5106046, 4798022, 4543788, 4342409, 4194364, 4064021, 3932369, 3777539, 3626303, 3510764, 3425764, 3327090, 3212959, 3105802, 3012083, 2939621, 2864656, 2810365, 2749266, 2743530, 2700049, 2657682, 2629049, 2615701, 2637772, 2682325, 2681962, 2624530, 2642829, 2684551, 2735957, 2770765, 2830959, 2888500, 2960811, 3020757, 3085486, 3219105, 3330100, 3462917, 3599021, 3781268, 3998005, 4280354, 4596402]
10319D596402L07517L26844L95780M60313M47170M58780M80551M80260M82736
10310H436353N38762M67044M24974M60468M47559M41339M14213L90992L98025
10301A2419729L41084L44183L28697L52863K93401K74346K18216J26779Q0006
10292A4779304L4548l3828o2324j17622j49100j88053k07614j70806j69727j82452
10282A3532326k18654k25993k79424l57021l56628l79378l84824m31916m46388
10273A0452100m47659m32293m14778m46485m07722l43543l54447l10111k95199
10264F999863l07617k50760j87036k03108j94888j95472j46655j89669j74122
10255E150536j41744j25415j13153j26539q0110r8778p6585j03590j07398j8971
$$ y = [4596402, 4903919, 5230763, 5626543, 6086856, 6534026, 6992806, 7473357, 7953617, 8436353, 8975115, 9442159, 9867133, 10327601, 10775160, 11216499, 11630712, 12021704, 12419729, 12760813, 13104996, 13433693, 13786556, 14079957, 14354303, 14572519, 14699298, 14779304, 14813852, 14780024, 14717700, 14600078, 14450978, 14262925, 14055311, 13884505, 13714778, 13532326, 13313672, 13087679, 12808255, 12451234, 12094606, 11715228, 11330404, 10898488, 10452100, 10004441, 9572148, 9157370, 8710885, 8303163, 7959620, 7605173, 7295062, 6999863, 6692246, 6441486, 6254450, 6051342, 5856454, 5660982, 5514327, 5324658, 5150536, 5008792, 4883377, 4770224, 4643685, 4563575, 4464797, 4388212, 4284622, 4177224, 4158253]
10245D158253P728o7512p1024k2704r754k954j2958k4475J4384L1177J2019J4933
10233D027113N3641M531m053Q939J2808N3041L3561M7392N1686M0646J7021O4746
10221D411072Q6914J40049O7398N8313J31294J38180J58511K20537K42267K51164
10211E905699K96026L02091L33045L85294M42872M66170M72284M88178M93894
10202I585553M83948M97270N19591N09870M95899M99668M32792L99985L86082
10193A3810658L15824K42649J65266J44760Q8754J1143K1029K1110Q362m435r442
10182A4815678o9513o1204m0997l953Q6024P3996P7432R3045J18372J25788J44479
10171A5359147J58857J49384J60630J61922J85228K41588K27611J96770J96023
$$ y = [4158253, 4165981, 4098469, 4027445, 4004741, 3994987, 3992033, 3979075, 3954600, 3968984, 4000161, 4012180, 4027113, 4080754, 4085285, 4081232, 4090171, 4102979, 4156020, 4189581, 4236973, 4288659, 4329305, 4346326, 4411072, 4497986, 4638035, 4705433, 4763746, 4895040, 5033220, 5191731, 5412268, 5654535, 5905699, 6201725, 6503816, 6836861, 7222155, 7665027, 8131197, 8603481, 9091659, 9585553, 10069501, 10566771, 11086362, 11596232, 12092131, 12591799, 13024591, 13424576, 13810658, 14126482, 14369131, 14534397, 14679157, 14767911, 14779054, 14800083, 14821193, 14829555, 14825120, 14815678, 14746165, 14684961, 14643964, 14640011, 14726035, 14800031, 14877463, 14970508, 15088880, 15214668, 15359147, 15518004, 15667388, 15828018, 15989940, 16175168, 16416756, 16644367, 16841137, 17037160]
10162A7037160J83705K17346L09511K94431L22897L20560L56401L54617L00788
10153A9697416L16885L37140K60266K77711K41870J97842K12185J95823J37249
10144B1874387J72849J62794O4254L6936K9354N738m2110j3097L764o0450j18229
10133B2116190r2856j53519j94685j95909k20159k54709l56018l13162l26052
10124B0009121l57353l09781l51620l06465l08674l22126k65573k50522k82231
10115A7254776k20325j99506j21343r3554r9568m4142j6635L491N1500R3423P2546
10104A6680663Q3776J42023J51370J55946R4390J09393J48655P0179L5202N4885
10094A7726482J8587o5529r9308j19713j62332k67526k57318l60121m55839m70758
$$ y = [17037160, 17220865, 17438211, 17747722, 18042153, 18365050, 18685610, 19042011, 19396628, 19697416, 20014301, 20351441, 20611707, 20889418, 21131288, 21329130, 21541315, 21737138, 21874387, 22047236, 22210030, 22274284, 22311220, 22340574, 22346312, 22304202, 22291105, 22294869, 22234419, 22116190, 22023334, 21869815, 21675130, 21479221, 21259062, 21004353, 20648335, 20335173, 20009121, 19651768, 19341987, 18990367, 18683902, 18375228, 18053102, 17787529, 17537007, 17254776, 17034451, 16834945, 16713602, 16620048, 16520480, 16476338, 16459703, 16463194, 16514694, 16608117, 16680663, 16764439, 16906462, 17057832, 17213778, 17308168, 17417561, 17566216, 17636395, 17671597, 17726482, 17745069, 17679540, 17580232, 17460519, 17298187, 17030661, 16773343, 16413222, 15957383, 15486625]
10084A5486625m87170n42163n54666n28755n11322n28137n23197m90464m74366
10075A0846385m28488m46897m24269l05730k75002l01589k52610k15381k27022
10066G969397j86951j39149j28129j16034o9334m0757o5648p6198r1231n6241
10056F999725l4819k5408m1203o8011q6299p0217q6709j03619q1226p3753m7082
10045F281379j11293r5541q8177n4676n2951q6008r1448q0537o2106j0834m0842
10034E506966m1560l9502N346N5749N468r458K4082L8495m745k7752L0159J8722
10022E561970k7703j0693O030r838k6504r800n4369n6585k4957k9871k9265p1857
10010E216558n3058n5478q9289r4675j34405j36922r2066j08452j41602j80968
$$ y = [15486625, 14999455, 14457292, 13902626, 13373871, 12862549, 12334412, 11811215, 11320751, 10846385, 10417897, 9971000, 9546731, 9241001, 8965999, 8664410, 8411800, 8196419, 7969397, 7782446, 7643297, 7515168, 7399134, 7329800, 7289043, 7223395, 7147197, 7055966, 6999725, 6964906, 6939498, 6898295, 6830284, 6743985, 6673768, 6587059, 6483440, 6402214, 6328461, 6281379, 6170086, 6074545, 5986368, 5931692, 5878741, 5792733, 5701285, 5620748, 5558642, 5547808, 5506966, 5465406, 5425904, 5431250, 5486999, 5492467, 5483009, 5507091, 5545586, 5540841, 5513089, 5543248, 5561970, 5534267, 5523574, 5529604, 5519766, 5493262, 5483462, 5429093, 5372508, 5347551, 5317680, 5288415, 5216558, 5163500, 5108022, 5018733, 4924058, 4789653, 4652731, 4560665, 4452213, 4310611, 4129643]
10000D129643k09941j19627j32766p7862r1405j49263j28592q8864r9839q0854
9990B950630j01507j06169j01906q0557q5461o8609l4678k8606l7243j10686j05865
9979B089343n0596l2655m3184l8936j3441k8041o9119o4712m3388p0561l7307
9968A597403k7719p398n314k8248l2421m0798m5995m6098o7903j7954m239k3420
9956A249896l3427l589k1097j9595r654l9756n9659m5143l9005J8736l985n3930
9944I39792l6533k597Q955j5039k9337k6275j2208J1327j0018m6014k4462k7735
9932G29856J4266J3400k8777J4694K3388N758N443J838o8741l9886q730J4969
9920F77478K0148J4988k2026m774k8298O684p231m4570m6670j2805j3318K512
$$ y = [4129643, 3919702, 3800075, 3667309, 3589447, 3498042, 3348779, 3220187, 3131323, 3031484, 2950630, 2849123, 2742954, 2641048, 2560491, 2475030, 2406421, 2371743, 2343137, 2305894, 2195208, 2089343, 2038747, 2006092, 1962908, 1923972, 1910531, 1882490, 1813371, 1748659, 1705271, 1634710, 1597403, 1569684, 1562286, 1556972, 1528724, 1496303, 1455505, 1409510, 1363412, 1295509, 1277555, 1273316, 1249896, 1216469, 1212880, 1191783, 1172188, 1162534, 1122778, 1063119, 1017976, 978971, 997707, 993722, 939792, 903259, 900662, 909617, 894578, 865241, 838966, 826758, 838085, 828067, 782053, 757591, 729856, 744122, 757522, 728745, 743439, 766827, 772585, 778028, 779866, 711125, 671239, 662509, 677478, 697626, 712614, 690588, 685814, 657516, 664200, 656969, 612399, 565729, 552924, 539606, 542118]
9908E42118j1674J0865O5660M328n1146j8083L1966j383l3356j9618o001j7766
9896D95910n301O580k3569k0052l5317n099r41P522M0006j0730j0414q096J457
9883D31956j8104n565L058q363N829J9511l919N529k0220j2958K9153Q868L3893
9870D68668j1234j7099l3977j2569j2737j6063J610J3127j2850O7870M1950r403
9858D67293N370k4445m9330k6648K2566N1713j5582l4773J1630J602m4094m2006
9846C23296l9569R236j0316l933k0150K582K2282Q391q352Q702R136K5972J4450
9833C41727q0949j3310R814J2806K4476k0482l0400l9039l0776J3320K6358J3759
9821B27304O926K2265k2841j3718M9731n251k0441j112l712K1177p738J5475j229
$$ y = [542118, 530444, 541309, 606969, 611297, 560151, 542068, 574034, 572651, 539295, 519677, 513676, 495910, 490609, 497189, 473620, 453568, 418251, 413152, 412211, 419733, 459739, 449009, 438595, 430499, 431956, 413852, 408287, 411345, 402982, 408811, 428322, 424403, 429932, 409712, 396754, 425907, 434775, 468668, 457434, 440335, 406358, 393789, 381052, 364989, 366599, 379726, 366876, 434746, 476696, 467293, 472663, 448218, 398888, 372240, 394806, 446519, 430937, 396164, 407794, 409396, 365302, 323296, 283727, 292963, 282647, 278714, 258564, 261146, 283428, 291819, 283467, 292169, 301305, 327277, 341727, 260778, 247468, 257282, 270088, 294564, 274082, 243682, 204643, 173867, 187187, 213545, 227304, 234230, 256495, 233654, 219936, 269667, 264416, 243975, 242863, 239151, 260328, 252590, 268065, 266836]
9808B66836j4457j8425J7300N259r074K740O0122L5461j8376l1143j0465k2431
9796B63347O388K4550m908j2054J1301J1076o23l54J8326k1482J223j2317K5087
9783C09560K508J7846J7969J373j989k1828l0490j2787J3350l923J2711j8103
9771B86197j8205R32m215o900P352M4818k6057j1758L845j0641k394L8436M4457
9758C45867k0807k07m362l1273K6265j0131m4560q496L648R095P2k5479j6815
9745B22817k0736M309J9532l479L5157L9682l9310k5527j6384n949K1687j3186
9733B18613j652O897P114J4149N279k6J3396o638n694K388N963j3175k787M509
9719B48336J6092K4147k2117l0669n516J2139K4657J3528P969l462p488o585m2475
$$ y = [266836, 252379, 233954, 251254, 256513, 247439, 250179, 310301, 345762, 327386, 296243, 285778, 263347, 269735, 294285, 289377, 277323, 288624, 299700, 299077, 298723, 317049, 295567, 296790, 284473, 309560, 312068, 329914, 347883, 349256, 347267, 325439, 294949, 282162, 295512, 291589, 304300, 286197, 267992, 268924, 264709, 257809, 265161, 309979, 283922, 272164, 276009, 265368, 262974, 301410, 345867, 325060, 324853, 320491, 289218, 315483, 305352, 260792, 252296, 255944, 265039, 265111, 239632, 222817, 202081, 206390, 225922, 222443, 257600, 297282, 257972, 232445, 216061, 210112, 231799, 218613, 216961, 223858, 230972, 245121, 250400, 250374, 263770, 257132, 251438, 253826, 259789, 246614, 243827, 248336, 264428, 288575, 266458, 235789, 230273, 242412, 267069, 280597, 288566, 285104, 277616, 271031, 228556]
9706B28556J7041j1464P306J3352K2110L1598q469p0938r58J2607M0506J8733
9694B99980n784k8725n833j9647M899Q651k0726J5389j4662J2376J0140k067P620
9681B61611L0355l9778j8372M0676N4776K693m2455n8542l5630J9061j917M083
9669B16561K0423L735K2135L518l631M269l126j6766M334M709K7443L1197O507
9656C21308n6676j3334L1009K1537K6558P3191J55762J36880j7955j06259j42013
9645D30008r4873n6440o1049J0570K1269K3918j4035k6318K3579n481J2113j9210
9633B44051O031M91n0674k2902L7668L8008K3889k1234P106L1430j8599j7931
9621B57334j3225m953K7066j733j8843K3178J5838k9308J0265J4168m4914M553
$$ y = [228556, 245597, 234133, 241439, 254791, 276901, 308499, 300030, 229092, 228134, 240741, 281247, 299980, 294196, 265471, 259638, 239991, 244890, 253541, 232815, 248204, 233542, 245918, 256058, 253991, 261611, 291966, 252188, 233816, 274492, 329268, 331961, 289506, 230964, 195334, 214395, 212478, 216561, 236984, 240719, 262854, 266372, 262741, 267010, 263884, 247118, 251452, 256161, 283604, 314801, 321308, 264632, 251298, 282307, 303844, 330402, 403593, 559355, 696235, 678280, 572021, 430008, 335135, 278695, 217646, 228216, 249485, 273403, 259368, 233050, 256629, 251148, 263261, 244051, 250082, 250573, 199899, 176997, 214665, 252673, 276562, 255328, 262434, 293864, 275265, 257334, 244109, 239156, 266222, 264489, 245646, 268824, 284662, 255354, 265619, 279787, 234873, 239426]
9609B39426M7516k4882j3518j9425L735l66r849J8896O168J6794N21L178J6571
9596B84765J380j2791K3368l8978k4440l823n484K3156J798o282K9050K3868k7472
9583B68115J1815J0973j5699K2782r055k6646M8079L329l5672l838K4364J2892
9571C11439J7752m001j0968j968K1878J5667J6921J3438k6959n9094k998J2659
9559C03766k2097j3515M0223K7673M5853J4077N185j072k3331k8755k749p387
9547C37871Q360L0564m701m4329k4019L5832J888J5993L1532L3808N429p204J1364
9534D32388K7848l4749n442L4512L1812L2804J9205j186J6015L1407K0702J4388
9522F19704M5413J1941r574M975L9117K1343k3040l1266k1679N6230N9425K1940
$$ y = [239426, 286942, 262060, 248542, 229117, 232852, 232486, 222637, 241533, 247701, 264495, 265016, 268194, 284765, 286145, 273354, 296722, 257744, 233304, 229481, 223997, 247153, 248951, 242669, 271719, 295587, 268115, 279930, 290903, 275204, 297986, 288931, 262285, 310364, 313693, 278021, 274183, 298547, 311439, 329191, 325190, 314222, 312254, 334132, 349799, 366720, 380158, 353199, 294105, 291107, 303766, 281669, 268154, 308377, 336050, 381903, 395980, 401165, 400093, 376762, 348007, 345258, 337871, 346231, 376795, 372094, 327765, 303746, 339578, 341466, 357459, 388991, 422799, 428228, 421024, 432388, 460236, 425487, 420045, 454557, 486369, 519173, 538378, 537192, 553207, 584614, 605316, 619704, 665117, 677058, 667484, 672459, 711576, 732919, 709879, 678613, 656934, 713164, 772589, 794529]
9510G94529j3076K1160L3543K3663J2826N2481O0596K8745j6956K0002K3150L8529
9498A079192Q4103N0963L8223O1726L9731Q38K4233K9144j7631K8690K3677J289
9486A444178K1545L7034L904l2479K0245Q115P871k2519j706n2353n5165k4302
9474A354368j5894l4482n3808o0743q1330k1073O650j0553m262k1780k491j1821
9462A042781J0029J4977j572l178L2067K9426J7099M8458N9526N2494L5535M3074
9450A380716K0517P2376Q1471Q2957J12856J09640Q1457Q3340N4901Q8776J11463
9439B280470J61552J79793J72727J80457K26614K52436K25816K28211K66248K36747
9429D411071K79330K91377K54728K63122K46877K62009K54493K63347K85590K03705
$$ y = [794529, 781453, 802613, 836156, 859819, 872645, 925126, 985722, 1014467, 997511, 1017513, 1040663, 1079192, 1163295, 1214258, 1252481, 1314207, 1353938, 1354776, 1379009, 1408153, 1390522, 1419212, 1442889, 1444178, 1465723, 1502757, 1506661, 1474182, 1494427, 1502542, 1510413, 1487894, 1486188, 1433835, 1378670, 1354368, 1338474, 1303992, 1250184, 1189441, 1108111, 1087038, 1093688, 1083135, 1078873, 1057093, 1054602, 1042781, 1052810, 1067787, 1066215, 1063037, 1095104, 1124530, 1141629, 1190087, 1249613, 1302107, 1337642, 1380716, 1401233, 1473609, 1555080, 1638037, 1750893, 1860533, 1941990, 2025330, 2080231, 2169007, 2280470, 2442022, 2621815, 2794542, 2974999, 3201613, 3454049, 3679865, 3908076, 4174324, 4411071, 4690401, 4981778, 5236506, 5499628, 5746505, 6008514, 6263007, 6526354, 6811944, 7015649]
9419G015649K40279K19679K23537K30457J29048O2264M8385l135m8409j05088
9409H012666j84079k17189l15910l02781l47480l63881l71839l60425k89932k38553
9399E020597k32515k81240k50454j26537j28534j40268r4433p8832n7613q924
9389C621247K3901J6857L4600L9521M2242N6255O8906O8067O1502P8581O4431
9378D176110J05720J43864J99819J81628J92968K44415K79174K65016K99131M32096
9368F519941M51001N09218O31191O75645P15211P80476Q79860R24250R39548R53278
9358A3979619R33591Q91741Q37567P49570O17886N20334L58316K24731P1830j03299
9348A9081886k88672m44467n71228o54396p71601q76134r07881q75183r07323
$$ y = [7015649, 7255928, 7475607, 7699144, 7929601, 8058649, 8120913, 8169298, 8166163, 8117754, 8012666, 7828587, 7611398, 7295488, 6992707, 6645227, 6281346, 5909507, 5549082, 5259150, 5020597, 4788082, 4506842, 4256388, 4129851, 4001317, 3861049, 3766616, 3687784, 3630171, 3621247, 3645148, 3662005, 3696605, 3736126, 3778368, 3834623, 3903529, 3971596, 4033098, 4111679, 4176110, 4281830, 4425694, 4625513, 4807141, 5000109, 5244524, 5523698, 5788714, 6087845, 6519941, 6970942, 7480160, 8111351, 8786996, 9502207, 10282683, 11162543, 12086793, 13026341, 13979619, 14913210, 15804951, 16642518, 17392088, 18009974, 18530308, 18888624, 19113355, 19185185, 19081886, 18793214, 18348747, 17777519, 17123123, 16351522, 15475388, 14567507, 13692324, 12785001]
9339A2785001q70105q51222p81749p44719o92615n77387n45392n26752m23229
9330F771831l99228l31180l54664k88437k33069k03901j98678j70851j83514j66463
9320D241846j04222q0360o5547k7428L6903m118J1334M3663K7610N7624R6408
9309D233713P8007O7695J18084J62346J55944J92849K48980K65431K65296L25484
9299F113829L71714M10470M47981M93021N22768M74450N18289M11347M02422L54665
9289A0520956K41193J33993M5034o8732j63384k17292l09288l34661l50342m00111
9279I097366m56594m45348l73859l54650l87339l56818l65382k99281k68090k71434
9269E518571k37471j98798k66368k90734k45037k25834k30571k30457j83821j64615
$$ y = [12785001, 11914896, 11063674, 10281925, 9537206, 8844591, 8267204, 7721812, 7195060, 6771831, 6372603, 6041423, 5686759, 5398322, 5165253, 4961352, 4762674, 4591823, 4408309, 4241846, 4137624, 4057264, 3991717, 3964289, 4001192, 3997074, 4008408, 4052071, 4079681, 4137305, 4233713, 4311720, 4379415, 4497499, 4659845, 4815789, 5008638, 5257618, 5523049, 5788345, 6113829, 6485543, 6896013, 7343994, 7837015, 8359783, 8834233, 9352522, 9763869, 10166291, 10520956, 10762149, 10896142, 10941176, 10872444, 10709060, 10491768, 10182480, 9847819, 9497477, 9097366, 8640772, 8195424, 7821565, 7466915, 7079576, 6722758, 6357376, 6058095, 5790005, 5518571, 5281100, 5082302, 4815934, 4525200, 4280163, 4054329, 3823758, 3593301, 3409480, 3244865]
9259C244865j33606j68772j82684r5772r2667j26344j18642p9034n0491l5039
9249B161814n5854l1230n2838J3088K8314L198L3771M1773j6711j047J4833M2829
9237B181940O0287N4560L6883Q9518O8399Q0284O5859P4242M1319M1741P1157
9226B866189N0845P679k0385J3878M2986l9316j5851K190k6422K0691M9856k7777
9214B924563m7427m979m2481n3532p8741m6605l2702n3037o3670q2822r1347p4817
9202B252403o4065k0501l1940n0756Q183L781j5971k1304O863J8032K8564O7330
9190B180619K1591R814J8793M0863O7417J15770L6225P7754J22593R4468J10754
9179B896661J38727J23907J69426J94806J93155J59659J67642J97151K76468K47626
$$ y = [3244865, 3111259, 2942487, 2759803, 2664031, 2571364, 2445020, 2326378, 2247344, 2196853, 2161814, 2105960, 2074730, 2021892, 2034980, 2063294, 2066492, 2100263, 2142036, 2125325, 2124278, 2139111, 2181940, 2242227, 2296787, 2333670, 2423188, 2491587, 2571871, 2637730, 2711972, 2753291, 2795032, 2866189, 2917034, 2924713, 2904328, 2918206, 2961192, 2921876, 2906025, 2908215, 2881793, 2902484, 2952340, 2924563, 2877136, 2872157, 2829676, 2776144, 2697403, 2650798, 2618096, 2565059, 2501389, 2418567, 2327220, 2252403, 2188338, 2167837, 2135897, 2085141, 2093324, 2097105, 2081134, 2059830, 2066693, 2084725, 2113289, 2180619, 2202210, 2212024, 2230817, 2271680, 2339097, 2454867, 2491092, 2568846, 2691439, 2785907, 2896661, 3035388, 3159295, 3328721, 3523527, 3716682, 3876341, 4043983, 4241134, 4517602, 4765228]
9169D765228K44790K75490L15462L12446L24132L15479L09857L52265L91239L47118
9159G953506L91029L83326L92215M28262M28588L89993L35399K96863L06458J81991
9149A1487630J22474N6277l2473j60649j81532k09103l23142l96896m12104m59729
9139I490753m57426m39530m50019m24400m15174l56410l07103k42047k52232k19626
9129E926786j55710j80226j23002q2295j01908o5933l8300l5230o029l8050j6270
9118E083833O0786R6304P2447O5412J10165J56549J25918J55359K02166J88878
9108F317817K30406K76888L06639L23467L18455L58851M04744M94447N19549N86293
9098A0137556O04753O06584O34496O71167O17325O29255O14190N47092M78853
$$ y = [4765228, 5010018, 5285508, 5600970, 5913416, 6237548, 6553027, 6862884, 7215149, 7606388, 7953506, 8344535, 8727861, 9120076, 9548338, 9976926, 10366919, 10702318, 10999181, 11305639, 11487630, 11610104, 11666381, 11633908, 11473259, 11291727, 11082624, 10759482, 10362586, 9950482, 9490753, 9033327, 8593797, 8143778, 7719378, 7304204, 6947794, 6640691, 6398644, 6146412, 5926786, 5771076, 5590850, 5467848, 5385553, 5283645, 5217712, 5179412, 5144182, 5138153, 5100103, 5083833, 5144619, 5240923, 5313370, 5378782, 5488947, 5645496, 5771414, 5926773, 6128939, 6317817, 6548223, 6825111, 7131750, 7455217, 7773672, 8132523, 8537267, 9031714, 9551263, 10137556, 10742309, 11348893, 11983389, 12654556, 13271881, 13901136, 14515326, 15062418, 15541271]
9089A5541271M48143L06380J93763M0656p0231j98403l17265l63204m64189n52982
9079A4563939o77269p56849p67098p56899p26751p07477p25813p05666o04131
9070H135986n60110n58165m88600m29061l25666k96967k77760k35015j96999j74768
9060D592875j44208j41118r3715j13232j29092j51885j62322q4700n3550n5470
9050C463583j4697N643p590K6518J5486J4346o588J7395N6221P3496P2608Q9764
9038C806185J23187J62272J97835J85746K07513J84847K31140K25012J83625K14615
9028E721977J84540J30159J25979R1514K2753J9201j3103r8462j20093j55720
9018E908745j76453j93649j62934j88067k18917k17840k23801j55865j50063j86853
$$ y = [15541271, 15989414, 16295794, 16489557, 16530213, 16459982, 16261579, 15944314, 15581110, 15116921, 14563939, 13886670, 13129821, 12362723, 11605824, 10879073, 10171596, 9445783, 8740117, 8135986, 7575876, 7017711, 6529111, 6100050, 5774384, 5477417, 5199657, 4964642, 4767643, 4592875, 4448667, 4307549, 4213834, 4100602, 3971510, 3819625, 3657303, 3572603, 3519053, 3463583, 3448886, 3454529, 3446939, 3473457, 3488943, 3503289, 3496701, 3514096, 3570317, 3643813, 3716421, 3806185, 3929372, 4091644, 4289479, 4475225, 4682738, 4867585, 5098725, 5323737, 5507362, 5721977, 5906517, 6036676, 6162655, 6254169, 6276922, 6296123, 6283020, 6184558, 6064465, 5908745, 5732292, 5538643, 5375709, 5187642, 4968725, 4750885, 4527084, 4371219, 4221156, 4034303]
9008D034303k09287j30879j40341j74182j92039j63417j56881j38849j30009j48474
8998B449945j79651j48608j51261r9540r2260q2296q0247q4638j10607o8847l4053
8987A317937q0291o6057k6353l8776l5532k0856l8498n0661p5798k1385r395K593
8975H56928J8152j5852k3316J5478J6548Q346M3726j6267r807K8916k4413J8305
8963I16744k9061m9026M423M8674J2298K3383J1787k9890l2382K2002j1342l1121
8951H56489j2417j8243j4040L523m3903k2312l0859k8421m0154k8210j4752Q78
8939F07579M765o0672m6825K802J12j8485n6887R982k55j1296j0008p24J8336
8926D38424r222k6617l2043K843M289k112k3743j0808o972j8896R705j8821p422
$$ y = [4034303, 3825016, 3694137, 3553796, 3379614, 3187575, 3024158, 2867277, 2728428, 2598419, 2449945, 2270294, 2121686, 1970425, 1870885, 1778625, 1696329, 1616082, 1531444, 1420837, 1351990, 1317937, 1237646, 1171589, 1145236, 1106460, 1070928, 1050072, 1011574, 960913, 885115, 863730, 854335, 856928, 875080, 859228, 835912, 851390, 867938, 876284, 920010, 903743, 893936, 922852, 898439, 916744, 887683, 838657, 843080, 891754, 904052, 927435, 939222, 909332, 876950, 898952, 887610, 856489, 844072, 825829, 811789, 815312, 771409, 749097, 718238, 689817, 649663, 621453, 606701, 607579, 612344, 551672, 504847, 507649, 507761, 489276, 432389, 442371, 442116, 430820, 420812, 420088, 438424, 429202, 402585, 370542, 373385, 377674, 375562, 351819, 341011, 334039, 315143, 324848, 306027, 298605]
8913B98605j2667O291P32q901q08Q646k0813j7911m0060m4792K1563J9664J640
8900B11189o75k4684k3751J9333k2430n3920l9528K6879L1452K8334M6112r389
8888A88922J6616R555k7216J740j6618J3123j3015j0231p565j3877J7111r155
8876A49390k7811L0456q007J6018j1457l2691Q35M5480N223j4989L1820j3348
8864A70919l2985j6814j5201l0356q968K4356J7618M0278J6138L909l1151p692
8852A30051k0296j143J430L839k5302K1319J8804k2541j3351L6134L514k0495
8840A11963k2616j4227j6698J350K3895N213r009J3908J6845j4068k2714M086
8828G7928K7864L4005M054K1435J4715L57k3963j8613m4515Q266J9759l09k4314
$$ y = [298605, 285938, 292229, 292961, 284060, 283252, 291898, 271085, 253174, 213114, 168322, 189885, 209549, 211189, 210514, 185830, 162079, 181412, 158982, 105062, 65534, 92413, 123865, 152199, 198311, 188922, 205538, 215093, 187877, 189617, 172999, 186122, 173107, 162876, 155311, 141434, 158545, 149390, 121579, 152035, 144028, 160046, 148589, 115898, 116733, 162213, 167436, 152447, 184267, 170919, 137934, 121120, 105919, 75563, 66595, 90951, 108569, 148847, 164985, 168894, 137743, 130051, 109755, 108612, 110042, 113881, 88579, 109898, 128702, 106161, 92810, 128944, 132458, 111963, 89347, 75120, 58422, 59772, 83667, 88880, 79871, 93779, 110624, 96556, 73842, 77928, 105792, 139797, 143851, 165286, 180001, 180358, 156395, 137782, 93267, 101533, 121292, 120983, 96669]
8815I6669k2765r379M109K2830k8261j2440L264P288K4997j9945n8789q591M1531
8802D0518J8678l583Q145j8674o950J5520K8436l5264j7893P713N227r396j9308
8789A3169k7482N289R698K8310J5638J8814n517k5827k7013k1521K8895L0268
8777D2721j402P256n700p098Q884N3212K1123j5764k5912m1310j3074J4276J8271
8764E5483j0642J4224J6363j2406K260N71r791K6578J2083k3277J6233n740m00
8751H1539J98K7102P614J4767k1033j0929L955k3438q601J0488K4228j3403n3089
8738C9398N743J8104n670k5302J6000K5785j2053K2394j3135J5769N064p932j0329
8725G3836K7997n359m1366j9222k605j4058L4559j647k1394p151K2527L2419K5090
$$ y = [96669, 73904, 64525, 68634, 91464, 63203, 50763, 54027, 61315, 86312, 66367, 7578, -1013, 40518, 59196, 55613, 63758, 45084, 38134, 53654, 82090, 46826, 28933, 36646, 41873, 32477, 13169, -14313, -9024, 674, 28984, 44622, 63436, 57919, 32092, 5079, -16442, 12453, 42721, 41319, 48575, 42875, 35777, 44661, 97873, 118996, 103232, 77320, 36010, 22936, 37212, 55483, 44841, 59065, 75428, 63022, 65282, 65853, 56062, 82640, 94723, 71446, 87679, 81939, 81539, 81737, 108839, 116453, 131220, 110187, 99258, 103213, 79775, 71174, 81662, 105890, 92487, 39398, 45141, 63245, 57575, 32273, 48273, 74058, 62005, 84399, 71264, 87033, 92097, 84165, 73836, 101833, 96474, 55108, 35886, 33281, 19223, 53782, 52135, 30741, 23590, 46117, 78536, 103626]
8712A03626l3475Q414M4716l2073k9305k1101L7209N0276j6447m3826k8648j1353
8700B8013K3937l5733r274M3746M7342m2667O426l821K0424K1370r806o477j9325
8687F4155l8149Q12L5377K734k3962j0018j7252K124J7264mK0631J7570q501O598
8673F9379L418L94K407j5568K911J5451r87j6444O905m921J3729Q580j6677j5563
8659E3014J4598K3084l0720j2190P961O8674p612l672l7005l6618J5673K1815
8647G7002J6319j6081n891k3386O272K6187r304J5736K7090O262k2166j5961K516
8634H4595K8019J9963J9137j7320m2028k9416N622J852j5281j5119k003K1002
8622E9023j960j7167J6633R00k2040k7411m504N0669r975l2318k4341j9570O090
$$ y = [103626, 70151, 78565, 123281, 91208, 61903, 40802, 78011, 128287, 111840, 68014, 39366, 28013, 51950, 16217, 6943, 50689, 98031, 55364, 61790, 57969, 78393, 99763, 89957, 83480, 64155, 26006, 26818, 62195, 64929, 40967, 30949, 13697, 15821, 33085, 33081, 53712, 71282, 62781, 69379, 72797, 73191, 75598, 60030, 62941, 78392, 77405, 60961, 67866, 62945, 76674, 85254, 68577, 53014, 67612, 90696, 59976, 47786, 55747, 124421, 116809, 113137, 76132, 39514, 55187, 77002, 93321, 77240, 71349, 47963, 54235, 80422, 71118, 86854, 113944, 120206, 98040, 82079, 84595, 112614, 132577, 151714, 134394, 92366, 62950, 68572, 70424, 55143, 40024, 38021, 59023, 57063, 39896, 56529, 57429, 35389, 7978, 3474, 54143, 44168, 11850, -12491, -32061, -25971]
8609b5971K6413K9287K6299l5883M3942Q350L851j8550o991L3803k4119m9211
8597A1220p833J0276J9414k9162K097M0034K4035m165J3987j5964J3090q940p695
8584F0394J643l2562N252n89K6024J7346Q503j2144L505K1186p64m7966j2706
8571C7122J7430J7823J5389n23j2855P153J1248J724k6957m793j3033k6762n7578
8558c4612q936N6442L6816R677j3607k7121L4753K8647l5209k3232J7489r279
8546C1828j6093J5462r420j4170J1284q564j4620k823q33O2531N1390N8909k6113
8533A38768m6279j8388l575k0087o344J2605K5400l931j7136j9552l0156P097
8521A8422O4596K5314k5165k5433j6235m831J4094k1100J4849K4246k736k802
$$ y = [-25971, 442, 29729, 56028, 20145, 64087, 72437, 76288, 57738, 50747, 84550, 60431, 11220, 3387, 13663, 33077, 3915, 6012, 46046, 70081, 65916, 79903, 63939, 77029, 68089, 60394, 62037, 29475, 34727, 34138, 60162, 77508, 86011, 73867, 77372, 98558, 97794, 49828, 37122, 54552, 72375, 87764, 87241, 74386, 81539, 92787, 94511, 67554, 62761, 49728, 22966, -34612, -43548, 12894, 49710, 59387, 45780, 18659, 53412, 82059, 46850, 23618, 41107, 31828, 15735, 31197, 21777, 7607, 18891, 10327, -4293, -7116, -7949, 54582, 105972, 164881, 138768, 92489, 74101, 70526, 50439, 44095, 56700, 82100, 78169, 61033, 41481, 11325, 18422, 83018, 108332, 83167, 57734, 41499, 36668, 50762, 29662, 44511, 68757, 66021, 63219]
8509F3219l8399k1237K3760K3392j3417k2916K0534M541m680K1313J3030k0692
8497D8448k9691j8407L1164L623l3098L528K5610k5893K9694N0100m479l8488
8485D2111l5112J5817K5686Q724j1213k8404j5287K1739J3554K8930M532l2051
8473C9026k3840o082l6820k427K1297R618k5764R66M488q733O529k150J6429K2997
8459A5534K5745m128j9150J3174j3703P764J0170J5842j9683m8218K6173L5310
8447D4830M9058r407p616O550j6814j9217p218p467L9330L4497n2845n3720K2541
8434B2502j9416J0552Q369k299J4501J0507n4003j8850J6303K1036n543M142K7392
8421C5193m852m9438N387q88k5674J0789M415l28j0264K4970K6033J339k9974
$$ y = [63219, 24820, 3583, 27343, 50735, 37318, 14402, 34936, 39477, 34797, 56110, 69140, 48448, 18757, 350, 31514, 35137, 2039, 5567, 31177, 5284, 34978, 85078, 80599, 42111, 6999, 22816, 48502, 57226, 46013, 17609, 2322, 24061, 37615, 66545, 71077, 39026, 15186, 9104, -27716, -30143, -8846, 772, -24992, -24026, -19538, -28271, -21742, -23892, -7463, 15534, 41279, 37151, 18001, 31175, 17472, 25236, 35406, 51248, 31565, -16653, 9520, 44830, 93888, 84481, 76865, 83415, 66601, 47384, 40166, 32699, 72029, 106526, 53681, -39, 22502, 3086, 13638, 22007, 19708, 34209, 44716, -9287, -28137, -11834, 9202, 3659, 7801, 35193, 30341, -19097, -13710, -14598, -40272, -29483, -25068, -25396, -35660, -10690, 15343, 16682, -13292]
8408a3292k7414J2218M7786K1509R126k7612n1999J7586R51P816J1036M121m9316
8395c7484o878M937K1016K7547k1619j7900K7709K3347j3272o537J3342l596R307
8382A9919k7109j2126K6201K4891l601k5604J4141J6110P497J6506p442l3294
8370A6089J0814r544K5658J4463O985l8649j0775m0J346N06J1959j9616j0998
8357a802K5050J8633j1239K4620J2516k5659j4329J1996P888O12n218m694k2530
8344A5844k1800J3057K8451j7367k5646j6062L5142L3944R802p790k2559m1869
8332a6853L216M950J6798K7286r888J104K7259j3528j6813k1593j751L908J357
8319E452o607j5982r988O8586K5840J8892P505m9865j7975k1215j7906K1934N7473
$$ y = [-13292, -40706, -28488, 19298, 40807, 49933, 22321, -29678, -12092, -11141, -3325, 7711, 11832, -37484, -44362, -39425, -18409, 9138, -12481, -30381, -2672, 20675, 7403, 866, 14208, 10612, 19919, -7190, -19316, 6885, 31776, 28175, 2571, 16712, 32822, 40319, 56825, 49383, 16089, 26903, 17359, 43017, 57480, 64465, 25816, 15041, 15001, 16347, 16853, 28812, 9196, -1802, 23248, 41881, 30642, 55262, 67778, 42119, 27790, 39786, 47674, 48286, 43068, 38374, 15844, -5956, 7101, 35552, 18185, -7461, -23523, 11619, 45563, 55365, 47575, 25016, -16853, -13637, -8687, 8111, 35397, 25509, 26613, 53872, 40344, 23531, 1938, 187, 4095, 5452, -1155, -17137, -27125, 41461, 67301, 86193, 93698, 43833, 25858, 4643, -13263, 8671, 66144]
8306F6144N5435k0211l1237J092K057j0319k7850M2753K895r741j4691j6904J0634
8293E0057k1623M6846J06104M6718K6907J7699J11813K20767L11147L69940L47875
8282A634250N9755l71292m36138l41730j90182q8253j4078j8835l3864n857J3597
8271B07373l824j5150m5734p585K1695m6481j8504j782j727J9314J6039l0335
8259I3299j4415L850K8705J1281J071K4204k5926K1615L2819Q9128J43152J33543
8247E42326J85981K89602L87527K62198r9126m45197l96360k77875j76564q7507
8237A85005p9336k8151N145m683k7589N34K1630K242J9797n0801k8187J3156J9887
8224D8649k8694j7027K6673K4465j7212k3172j6256j8269j9770m201J2400J0970
$$ y = [66144, 121579, 101368, 70131, 71223, 73280, 62961, 35111, 77864, 80759, 71018, 56327, 39423, 50057, 28434, 75280, 181384, 228102, 255009, 272708, 384521, 605288, 916435, 1286375, 1634250, 1694005, 1322713, 886575, 544845, 354663, 266410, 252332, 233497, 199633, 193776, 207373, 203549, 188399, 142665, 135080, 156775, 110294, 91790, 90008, 88281, 107595, 123634, 93299, 78884, 82734, 111439, 122720, 123791, 147995, 122069, 143684, 176503, 265631, 408783, 542326, 728307, 1017909, 1405436, 1667634, 1568508, 1123311, 726951, 449076, 272512, 185005, 105669, 77518, 82663, 77980, 50391, 50925, 72555, 74797, 94594, 43793, 15606, 28762, 48649, 19955, 2928, 29601, 54066, 36854, 13682, -2574, -20843, -40613, -44814, -32414, -21444]
8212b1444J427k8932M6174L3792m270N27J808q548l5750n1113o071N2558J7690
8199b152L2443K8382J0659j2923J9326k4474J3099j6890m7718j2595k1022K703
8187c1162R406L7078J5421j0834j9264l154L968j752J6050m660P808K8062L6692
8174H3659k0039m0352L96j4355j5863P236K1854J0710n175j4656k7649m1345j4301
8161f9880k9877K2585N7593j9049k2791M6138L1741j4501q551o712J9904J3243
8149A9843j1858J1359M569l4906o3823P657K4714o026j480J0570P116r153K6144
8136a5274l4364P740N842K6792K4150J2184k2290k1730L8374L4454j2116k312
8124D1450o794j5779K4850J0960L212k3056k9145l5523K7711M4475l2494o9312
$$ y = [-21444, -20017, -48949, -2775, 31017, 26747, 27274, 29082, 20534, -15216, -66329, -72400, -19842, -2152, 30291, 58673, 69332, 56409, 75735, 51261, 64360, 47470, -248, -12843, -33865, -31162, -21756, 15322, 30743, 19909, 645, -2509, 1459, -293, 15757, 11097, 18905, 46967, 83659, 63620, 23268, 23664, 9309, -6554, 682, 22536, 33246, 28071, 13415, -14234, -55579, -69880, -99757, -77172, -19579, -38628, -61419, -15281, 16460, 1959, -6592, -13304, 6600, 19843, 7985, 19344, 23913, -10993, -74816, -67159, -42445, -48471, -49951, -39381, -32265, -41418, -15274, -49638, -41898, -36056, -9264, 14886, 27070, 4780, -16950, 21424, 55878, 43762, 41450, 34656, 18877, 43727, 54687, 57899, 34843, 5698, -29825, -2114, 42361, 9867, -59445]
8112e9445n88L3278O2216K8488N776J3952k7163l0711j9964J1696l4109j9332
8100c5906q943J092J0547K538j5070l038K7498L4935N176j3443m984j2389J4024
8087B037R605k0194o864P590M924Q126K5143M1658k0575l0082K1715M3857P288
8074I4228N009m4112k2296l2866m64l1642L684J6403k2759j8293L7990P871J6207
8061H960o295K7466L082j4906N34K1761j1379l0426M10k732j332M7371j948J042
8047D1608K3686j6210k4624N018k2177k007n223L9080m512K198k390j1921J7433
8034C9959J7302j9323J0173o0114k1695K5614k555J179j2701M015K0141K2962
8022B4957r011k2230l3359K4753J3394J5234K4365k4633J4546K0171m2229l7783
$$ y = [-59445, -60033, -26755, 35461, 63949, 69725, 83677, 56514, 25803, 5839, 17535, -16574, -35906, -44849, -43757, -33210, -30672, -45742, -48780, -21282, 13653, 18829, 5386, 402, -11987, 2037, 11642, -8552, -15416, -7826, -2902, 5224, 30367, 72025, 51450, 21368, 43083, 86940, 94228, 99237, 55125, 32829, -37, -501, -32143, -28459, -12056, -34815, -53108, -15118, -7247, 8960, 2665, 30131, 33213, 18307, 18841, 40602, 29223, -1203, -793, -3525, -4857, 42514, 40566, 41608, 65294, 49084, 24460, 29478, 7301, 5294, 71, 39151, 34639, 36837, 34447, 22526, 39959, 57261, 37938, 48111, -12003, -33698, -8084, -10639, -9460, -22161, -18146, 1995, 24957, 15946, -6284, -39643, -14890, -1496, 13738, 38103, 13470, 28016, 48187, 5958, -31825]
8010c1825L56K6606L0909k7021j7447L9137K8819J959R927m5833m8827j0822M5424
7997A362L1526L70l6843k0049L1226K5518k0282J2315K9023k4376m0388j7451
7985b8049K1700J2360J7932l8541j5712m160N9062K8932o3p644J2975N792j1904
7972E2680p681p688k8950k0679q234o810K4514m247K429J1223k5277k8019n603
7959e2342p118M764J1793K5422j1650J3060M872k8667L7630L6865J1909J2168
7947E8706J1531n5904r113J8219r257j8135j7299L5892R766O601o45l805r261
7934A7296L0617k0916O095K8684m1987m4195J7232O846K2010k500k3282Q178n2376
7921d8298p463L1504K2114R988K5017K7317k4533l3978k4078l5792K6410M8631
$$ y = [-31825, -31469, -4863, 26046, -975, -18422, 20715, 49534, 51493, 61420, 15587, -33240, -44062, 1362, 32888, 33258, -3585, -23634, 7592, 33110, 12828, 25143, 54166, 29790, -10598, -28049, -6349, 6011, 23943, -14598, -30310, -34470, 24592, 53524, 53461, 45817, 58792, 64584, 52680, 44999, 37311, 8361, -12318, -20552, -27362, -2848, -7095, -4666, 6557, -18720, -46739, -52342, -59460, -54696, -42903, -17481, -29131, -16071, -11199, -39866, -2236, 34629, 46538, 58706, 70237, 14333, 5220, 23439, 14182, -3953, -21252, 14640, 24406, 31007, 30362, 26557, 17296, 47913, 26997, 33092, 61776, 19789, -24406, -7174, -328, 21682, 19182, -4100, 4078, -48298, -55761, -24257, -2143, 7845, 32862, 60179, 35646, 1668, -22410, -58202, -31792, 16839]
7909A6839J7860j9439j1893m177k2858M207J5058m935l2502j9544k653o707j6865
7896h7609j9557N7291O2734K0815j7429k0548l5208o200l214M8817K0367k2613
7884b354j9456o599j1501L303R45Q945J3223k993K5263K7763K0925k5808O883
7871C8539K2531J842j600j3566K5442j4573k1243j2225l6927l316k312m406j9086
7858d0900k7875K45k4100J0515J8437N1154L2663k9357K3403J9261J1526Q413
7846E3385j6263m9617l7293m1392K804L5539M1811J4933M637k632J2945J3435
7834C2292J4918j2641k4000l7387l9914r359L9747k8241m1417K1646L9565L4500
7822a0291J3619L12j1712K9557o901k4744J4767l700j7170L43l1038q115q293
$$ y = [16839, 34699, 15260, 3367, -810, -23668, -19461, -4403, -9338, -41840, -61384, -64037, -70744, -87609, -107166, -49875, 12859, 33674, 16245, -4303, -39511, -45711, -48925, -108, 20259, -2354, -21810, -28409, -39910, -36607, -35662, -26717, -13494, -16487, 8776, 36539, 57464, 31656, 38539, 61070, 62912, 61312, 47746, 73188, 58615, 37372, 25147, -11780, -15096, -17408, -21814, -40900, -68775, -68530, -92630, -82115, -63678, -12524, 20139, -9218, 14185, 33446, 44972, 53385, 37122, -12495, -49788, -91180, -88376, -52837, -11026, 3907, 8544, 5912, 18857, 32292, 47210, 34569, 10569, -26818, -66732, -76091, -36344, -64585, -106002, -84356, -44791, -10291, 3328, 3640, -8072, 21485, 14584, -10160, 4607, 907, -16263, -15920, -46958, -55073, -63366]
7809f3366L9809M0338J009J1846J4687l1571j6398P36l210J5772k844l1716l645
7796b8553K2135K097j0540J7034J7221l417m364K0846L9250p358m3675m724K2510
7783C8462j935n1813l7890M354L5683L6961k7028l974K7650K4355J3645n3559
7771D911k4655n61R301L4876p282j1216j8871J662K3975j392n0068p877K6556
7758b0641Q020j2047m1963M2995N4497l715j3230j1442k3259j1861j759j313R231
7745b6487N428J4234m5653J6305K3003m1721L636J6975O5279J4346m0721J1904
7733A6528K6152L5599l8840k9061j6138O172k2275j7341l7210K1801M6864K610
7721e139n0274k7738O16p09L0199J7450L6754J7337l064l7188K1749J4351M826
$$ y = [-63366, -23557, 16781, 17790, 29636, 44323, 12752, -3646, -2910, -6120, 9652, 6808, -24908, -28553, -6418, -4321, -14861, 2173, 19394, 15977, 11613, 32459, 71709, 64351, 20676, 15952, 38462, 36527, -15286, -53176, -48822, -13139, 23822, -3206, -7180, 20470, 44825, 58470, 4911, -19744, -20305, -11004, 23872, 16590, 5374, -13497, -11835, 12140, 10748, -39320, -47197, -20641, -12621, -24668, -66631, -23636, 30861, 27146, 13916, 2474, -20785, -32646, -34405, -35718, -26487, -21059, -6825, -52478, -36173, -13170, -54891, -51255, -34280, 30999, 45345, 4624, 16528, 42680, 78279, 39439, 10378, -5760, 412, -21863, -39204, -76414, -54613, -7749, -5139, -55413, -83151, -82535, -83244, -53045, -35595, 1159, 18496, 15432, -21756, -7, 14344, 19170]
7708A9170m736j2583m97j5968J1379J1569M0989J3510n079K9433j7659j8506N990
7695E7012r317k1491J350l1060j7911K8701m54j2256j2554n659k9831p701O6736
7682E565J7399O570k7898k4996j6356K6975J2731l4975J245K5208J5236J4299
7670B1003j3365k7557j2269L598J5492K7086k0473L7687P313J4877k9286n7770
7658c3664j0393K7252J3279M83K1294K0509k2868j6581k637r113J6188L051J8014
7645B4814n741j3123P897J9370k2686n2188M4578J3649Q857Q826j7603q467J8961
7632B7144K2735J1323m3923m2229N1391N8141l912l1887l0742j4227J8117k4610
7620b679L7231K4463l8729l2869K8009R065k4830k911P659j2122q682j6844p606
$$ y = [19170, 14434, 1851, 1354, -14614, -3235, 8334, 49323, 62833, 57754, 87187, 69528, 51022, 57012, 47695, 26204, 27554, -3506, -21417, 7284, 6830, -5426, -17980, -23639, -53470, -61171, 5565, 22964, 29534, 1636, -23360, -39716, -12741, -10, -34985, -33740, -8532, 6704, 21003, 7638, -19919, -32188, -28590, -13098, 13988, -6485, 31202, 38515, 53392, 24106, -33664, -44057, -16805, -3526, -3043, 18251, 38760, 15892, -689, -3326, -12439, 3749, 6800, 24814, 19073, 5950, 13847, 33217, 10531, -41657, 2921, 16570, 25427, 34253, 16650, 8183, 27144, 49879, 61202, 17279, -24950, 26441, 84582, 80670, 48783, 18041, 3814, 21931, -2679, 34552, 59015, 20286, -12583, 15426, 24491, -339, -3250, 4409, -7713, -16395, -33239, -40845]
7607d0845j0856L3279L8340q367K850j5045j5592o561O2027Q91k9701J3797K6091
7594E0308k683n2271j4681m999M5030Q897j7254j6212j6245K057m464K1089J1586
7581A0158K6671J248J2673L777k1233l7262k4305L2854J6422j8223K7373j5005
7569A5148k1656k9593k7325J9671L5761N835J5901L096J0663j0132l2027j6824
7557c1482M4839J1509M445O265k4213k3470L5806J3014k843j3124K1489K0527
7545F2762R52m5749k0129j1057K5206O407K0531j9467l2459m2647J753j4981L0623
7532c8255J047k1979J4936J3095K7803K681k4389l2397K2139L0701L65k2013j1490
7519c7756M1349N5993m420k5750l888k8614J3714J9231L3321j3147n3583j4716
$$ y = [-40845, -51701, -18422, 19918, 11551, 14401, -644, -16236, -22797, 39230, 40121, 10420, 24217, 50308, 47625, -4646, -19327, -24326, 20704, 29601, 12347, -3865, -20110, -18053, -22517, -1428, 10158, 36829, 38077, 50750, 54527, 33294, -3968, -28273, 4581, 21003, 2780, 30153, 15148, -6508, -36101, -63426, -43755, -7994, -2159, 13742, 16838, 27501, 17369, -14658, -31482, 13357, 24866, 29311, 35576, 11363, -12107, 23699, 36713, 33870, 20746, 42235, 62762, 63714, 17965, -2164, -13221, 11985, 18392, 38923, 19456, -13003, -55650, -53897, -68878, -38255, -37208, -59187, -44251, -31156, -3353, -672, -25061, -57458, -35319, -4618, -4253, -26266, -37756, 3593, 59586, 55166, 29416, 25528, -3086, 10628, 29859, 63180, 50033, -3550, -18266]
7507a8266L2692J5777p727r901l8708p831J3840l8105p948k647L6457O3141J2542
7494D3316o5168n9706J8815J9686J9132J6880R018J8760P599J622R63Q7j3793
7481A7211o478j0528l4585J2681k506Q962J2805L0147l1059k4260j5801k999p840
7468e4250L8512J6758k7737j6556Q120J2705J0831q127J7436j1612l6464K0190
7456c0194K6541J8013l877j4001J914k1372k5167J0375L0099M1351M2262Q905
7444H4849j5568k4293K6064j9982k8621R829J5309l7257j900n001k2319j9J6300
7431b609N1045k4635m0964j2442J342J8234n970J534L7840p898j9962P85j275
7418d975J5293l4297r835K0476N411P706L7743j5752j8259L156q0n812K1425k931
$$ y = [-18266, 14426, 30203, 22476, 12575, -26133, -33964, -20124, -58229, -66177, -68824, -32367, 30774, 43316, -21852, -81558, -62743, -43057, -23925, -7045, 1973, 20733, 28332, 29954, 30917, 31004, 17211, 10733, 205, -34380, -21699, -24205, -15243, -2438, 27709, -3350, -27610, -43411, -46410, -54250, -15738, 1020, -26717, -43273, -35153, -22448, -11617, -19744, -2308, -13920, -50384, -30194, -3653, 14360, 10483, -3518, -1604, -22976, -48143, -37768, -7669, 33682, 75944, 84849, 69281, 44988, 71052, 51070, 22449, 32278, 47587, 10330, 8430, 3429, -18890, -18909, -2609, 48436, 23801, -17163, -29605, -28263, -10029, -15999, -14465, 23375, 15477, -4485, -3700, -4975, 10318, -23979, -33814, -13338, -7927, -221, 37522, 21770, 3511, 6667, 6587, 775, 22200, 19269]
7404A9269k3480k7589k1032L9253L3405j9104k75L7225L680L098n0441n0070M0852
7391a5209M0616K295j3412k8451J5457K0219j3159k6758J4470n655L7341K6078
7379E3832k879K5651m1476j8650n17j3069q900n785k1508L53L2140N7540l84m0188
7365A6160j2856O8P498k5972j2521j6549L7387L7934l519m1206j854J9775J5205
7352A9550M572k3966m2522q214J0681n705J189J8017n445k0121K6722M3488K619
7339B0865j5036J9150n414j3921J716J5382J2251m1640j4666L7543J189k3271
7327e852j0016j9493N903K2831M687J2580J9878n1289k0306m413j2078J2083K564
7314d2921J4017J9055l0082l67K5433P146K2882J3706J2337K4797l214k6438l6622
$$ y = [19269, -4211, -31800, -52832, -13579, 19826, 722, 447, 37672, 41352, 44450, -5991, -56061, -15209, 25407, 27702, 14290, -14161, 1296, 21515, 8356, -18402, -3932, -9587, 27754, 53832, 50953, 76604, 35128, 16478, 15961, 2892, -6008, -11793, -33301, -32948, -808, 56732, 56348, 16160, 3304, 3372, 10870, -15102, -27623, -44172, -6785, 31149, 27630, -13576, -15430, 4345, 19550, 24122, 156, -42366, -50580, -39899, -45604, -44415, -26398, -31843, -51964, -25242, 18246, 20865, 5829, 24979, 19565, 5644, 7360, 22742, 34993, -6647, -21313, 16230, 17419, -5852, -15868, -35361, -29458, -6627, -1940, 10640, 30518, -20771, -41077, -45490, -57568, -45485, -42921, -28904, -9849, -39931, -40298, -14865, -7719, 15163, 28869, 41206, 66003, 62789, 36351, -271]
7301b71j9372k240l6986l015K3712K1636Q70k0390l536o573l1873L3300M6909
7288B171p163l902n446k2566j4045M0140M3832R649l6843O254K3733J2069j693
7275D6190K209l4129o372J0696K626O5663L0582l1022m132k5179j829K1409J2784
7262H9496l6467l1883k2873j9697O849n322M135n130J1159o249J0253J0372r909
7249e266k494m527L2867J5838l7103Q206M5249M5608Q53l0582k8208k6629K5136
7236C8948L607J3737J6643l755q400l699q722k2999n0041J5673p91k5589L8240
7223B852m974k5751k9687l2150j2657N9523J8890l411K5608O381j2031k8754P947
7210b8214L1623l3664L452K1651k859j8795j1652O131J9515O171k414K7198k2098
$$ y = [-271, -19643, -21883, -58869, -61884, -38172, -16536, -15666, -36056, -39592, -46165, -78038, -44738, 2171, -4992, -8894, -14340, -36906, -50951, -10811, 33021, 42670, 5827, 12081, 35814, 47883, 46190, 48399, 14270, 7898, 18594, 21220, 86883, 117465, 86443, 82311, 57132, 55303, 76712, 89496, 53029, 21146, -1727, -21424, -14575, -19897, -15762, -20892, -9733, -15982, -5729, 4643, -5266, -7760, -12287, 20580, 36418, -685, 7521, 52770, 98378, 99231, 68649, 40441, 13812, 38948, 42555, 56292, 72935, 69180, 60780, 57081, 48359, 25360, -24681, -9008, -9799, -35388, 2852, -2122, -27873, -57560, -89710, -102367, -42844, -23954, -27365, -1757, 4624, -7407, -36161, -28214, 3409, -30255, -26803, -5152, -8011, -26806, -38458, -32327, -12812, -6641, -9055, 18143, -3955]
7197c955j1033N1668p812k6621j617N290j8410O378Q85J4389o869r541p632K0434
7183E554J9399k3351l0385K161l1109m891L6702P3413J2085n4860k4085l624n560
7170b8551n694L731K2470l3317J2668L5043L4169J6985j7893k3395o615Q025j2138
7157E488j5975k467O308J4701k4186k2019l4570K0217P256k069K5940J392L5722
7144A5738K5661k2711m5006K778Q688l9267J8121J6505j6504n657n112k5237m8309
7131a20312P179M6570J9655N4876J4223j7236K5784J2530J4505j9478l1139p341
7119a84K0094k3180j7804K208j0397J531M1314M1477K5852j8716l6722l0012j3218
7106a7757J6562K462n271k508m8362Q575L4997J189k1958K7672N5271j4892l9251
$$ y = [-3955, -14988, 36680, 28868, 2247, 630, 5920, -12490, -6112, -5227, 9162, 2293, -7248, -14880, 5554, 24953, 1602, -28783, -26622, -57731, -62622, -25920, 47493, 59578, 4718, -19367, -22991, -28551, -34245, -30514, -8044, -41361, -28693, 6350, 40519, 57504, 39611, 16216, 9601, 17626, 5488, -10487, -12954, -6646, 8055, -16131, -38150, -72720, -52503, -45247, -47316, -21376, -19984, 15738, 41399, 18688, -26318, -23540, -14852, -54119, -35998, -19493, -35997, -41654, -46766, -72003, -120312, -113133, -66563, -46908, 7968, 22191, 4955, 30739, 43269, 57774, 38296, 7157, -184, 19910, -3270, -21074, -18866, -29263, -27732, 13582, 55059, 80911, 62195, 25473, -4539, -17757, -1195, 1267, -4004, -6512, -54874, -46299, -11302, -10113, -32071, -4399, 50872, 35980, -3271]
7093c271j573k1156l9968J643J7242K8471j2475J7475q567L127r990k0391j4118
7080f3551J1416J9352K9790J5738J6602j7920k4016J1500p687j5710j4542K4628
7068a4400M3818n222K3387q650l5422j4477q363m876l0328l341K5792J5128K661
7055a4293L0041K2359k8836l1428J5044r777m971o218q205J6570J5164J6042R176
7042B0668J9448l0079j9733r577K1420P345l234p784j6407j3798K4809J2920j8606
7029a2608k4024N067r590R070K5228K0199Q850m3940M7499K2487m8422k3181j9403
7016d2768k1549N641J8216J1093j522L6581J1828j8760P586L1576j7207k1530
7004h15j070O848k3219k1831J8939L6841Q916p402m980k9908k9862M8764K8395
$$ y = [-3271, -4844, -26000, -65968, -64325, -47083, -18612, -31087, -13612, -22179, -19052, -29042, -49433, -63551, -52135, -32783, -2993, 12745, 29347, 11427, -12589, -1089, -8776, -24486, -39028, -14400, 29418, 24196, 47583, 38933, 3511, -10966, -19329, -24205, -54533, -57874, -32082, -16954, -14293, 15748, 38107, 9271, -22157, -7113, -16890, -21861, -28079, -36284, -19714, -4550, 11492, 20668, 40116, 10037, -9696, -19273, 2147, 9492, 6258, -1526, -17933, -31731, -6922, 5998, -12608, -36632, -31565, -41155, -32085, -6857, 13342, 22192, -21748, 25751, 48238, -184, -23365, -42768, -64317, -58676, -40460, -29367, -30889, 5692, 17520, -1240, 6346, 37922, 20715, -815, -1885, 4963, -18256, -40087, -21148, 15693, 24609, 17207, 12227, -17681, -47543, 1221, 29616]
6991B9616J181j9190k1505K2041L1593l4140o0039R379O915k0458P602N9589J8786
6978C1370m948L782k2470M1626l79k3847j6247J4788K6817k3777j0918K6254N84
6965D2635m3500j9563k059l7541J0318K6165M966K1383K2689j5955l9821j7961
6953d8244M0880j331j0309m26J5176k2749n6864n292L6608J9186K3905m169j1744
6940b5373N1160R287l8177k1380k733p744L0176M3919p659k3844j8999L738k3415
6927c1044L142J7387L6754j4061m1653l0182K020L4794L3836P323P056J4498m3412
6914c542l2489p322N0132J844N4J9056k6280o554J7416k6012j1295K1405K6220
6901B2633k5546j7643Q597J2421K9541q02J7910l329J1374j439l4729k7245J501
$$ y = [29616, 30797, 11607, -9898, 12143, 43736, 9596, -50443, -41064, -34149, -54607, -47005, 12584, 31370, 26422, 30204, 7734, 49360, 48981, 25134, 8887, 23675, 50492, 26715, 15797, 42051, 42635, -865, -20428, -22487, -60028, -49710, -23545, -18579, 2804, 25493, 9538, -30283, -48244, -7364, -8695, -19004, -19430, -4254, -27003, -83867, -89159, -52551, -33365, -9460, -13629, -25373, 25787, 35074, -3103, -24483, -27216, -34960, -4784, 39135, 31476, 7632, -11367, -7629, -31044, -27902, -10515, 26239, 12178, -29475, -59657, -57637, -22843, 10993, 18316, 25372, 39870, -3542, -36031, -43353, 6779, 8623, 8677, 27733, 1453, -5101, 12315, -13697, -24992, -3587, 22633, -2913, -20556, -11959, 462, 30003, 29201, 47111, 43782, 55156, 53717, 18988, -8257, -6756]
6888f756J0392K173k6742K0747O0373k4418j4450P990j7535j8116L920J984J223
6875G85n824l3672J3875o127J1331L6440J0105J3597k3658j602J9664m6509j3758
6862b5353J0458M1355K0831j1038j3796n89L757j2061p673L429J0766J1109j764
6849B9431k145k6246k474k091J6328k014k712l584J4593j8461k2090Q520J7194
6836D249K463M750l206j3187k7749k8277J2832K2369j9877J7178K0031q685k2226
6823c9335L1941K2414m4172j8510r837j8705L6820M4330K3623K5152j409k4427
6811B7885J213l920l446n894J7463k8918j9585J8165J3974J1550k8126k8362K1971
6798f030O913K9481Q5p0690n1001N5839M0650J2682l7841k1123L2353L7166j1816
$$ y = [-6756, 3636, 5809, -20933, -186, 60187, 35769, 21319, 29309, 11774, -6342, -2422, -438, 785, -5039, -38711, -24836, -30963, -19632, 16808, 26913, 40510, 16852, 15250, 34914, -11595, -25353, -14895, 26460, 47291, 36253, 22457, 21868, 25625, 13564, 5891, 9320, 20086, 31195, 29431, 27286, 1040, -1434, -3525, 12803, 10789, 8077, 4493, 19086, 625, -21465, -12945, 4249, 6712, 11462, 8256, -4931, -32680, -60957, -48125, -25756, -45633, -28455, -8424, -17109, -39335, -7394, 15020, -29152, -47662, -57499, -76204, -39384, 4946, 28569, 53721, 52312, 27885, 29098, 25178, 21732, 15838, 33301, 4383, -15202, 2963, 16937, 28487, 361, -28001, -6030, 883, 30364, 30449, -40241, -91242, -35403, 5247, 17929, -19912, -41035, -8682, 28484, 16668]
6785A6668P42j1959Q624j2104J485M239l0598Q15l350P827l484l4196K3554k6313
6771e8050O437K3399L7742L1235K2437j3246l6463J8448l5322j1996j5099j4735
6759d5213k2272k822K9193K1592j1176l7237k73q739K5248K7877K436n202L7732
6746A1144J1578k0058m650R906J9069O008l0757j1950P34J8749M16m1646m496
6733c5953J2822K1285k604K3044J1984n0196n6970R917M4976M6011m112k8749
6721h545k0913j7492N6530K0685j669o918q972k4707R691j3566j6262j0879J0013
6708c3004r74n490K9033p592K174J8900K492J5487m4671k5029J8848M6550N20
6695A7244K4573m0571k548j1825O509L8377o101l5190m3581j1265K5092P409M0478
$$ y = [16668, 17410, 5451, 14075, 1971, 3456, 7695, -22903, -22088, -25438, -17611, -21095, -55291, -31737, -58050, -51613, -28214, 9528, 40763, 63200, 49954, 13491, 31939, -3383, -15379, -30478, -45213, -67485, -70307, -41114, -19522, -30698, -67935, -68208, -76947, -51699, -23822, -21386, -26588, 11144, 22722, 2664, -1986, 7920, 26989, 32997, 2240, -9710, -8976, 9773, 10189, -31457, -35953, -23131, -1846, -4450, 18594, 30578, -19618, -76588, -66671, -21695, 24316, 20204, -8545, -29458, -46950, 9580, 30265, 28596, 21678, 12706, -12001, -2310, -15876, -32138, -43017, -33004, -33978, -39468, -10435, -18027, -15853, 3047, 5539, 21026, -23645, -48674, -29826, 16724, 17244, 41817, 1246, -1302, -13127, -6618, 31759, 25658, -9532, -53113, -64378, -39286, -31877, 8601]
6682H601M347k0964m891k412R582r690K1221L2913k197j8656l6793l1438r588
6669e9965Q54l061j9524k6601P287P537P006J7747K5628M5206j3985j8696r206
6656c9773J2248J4007J9777L6958j4912J0505j5805m041P284k2175n3852l6456
6644h6235k270M4186L4396M2525p117j1641J345l4982L0074J2824L964j8162J369
6631A0276R161l9833l5596J1126j276K2437O84j6800o58p917J9880k0861l1723
6618h1100L2927q411J8269m574K4211K9042k6830j9498j198j7995P307K6987J7661
6605c202j464l2064q105K5959L3091J9433q639N401L521j4597L024J5905j6998
6592B1265k867j1250j9318k0055L0997J593Q564j226K677k4236l2305J3669K1885
$$ y = [8601, 12948, -8016, -12907, -15319, -5737, -15427, 5794, 38707, 36510, 17854, -18939, -50377, -59965, -59111, -62172, -81696, -108297, -101010, -93473, -86467, -68720, -43092, 2114, -11871, -30567, -39773, -27525, -13518, 6259, 43217, 28305, 38810, 23005, 18964, 26248, 4073, -49779, -86235, -88505, -44319, -9923, 32602, 25485, 13844, 15189, -19793, 10281, 23105, 27069, 8907, 10276, 19437, -20396, -55992, -44866, -46142, -23705, -23021, -39821, -40479, -48396, -28516, -49377, -81100, -48173, -56584, -38315, -42889, -18678, 10364, -16466, -35964, -37162, -55157, -47850, -20863, -3202, -4666, -36730, -44835, -18876, 14215, 33648, 25009, 30410, 33931, 19334, 22358, 38263, 21265, 18398, 7148, -12170, -32225, -1228, 365, 8929, 7703, 10380, -13856, -46161, -32492, -10607]
6579a0607p546p364k5971j452j2968L0198L4522J3520m837J4411R984j4351l2725
6566a5186p008L2312j0868k979M2445L534R783j1626j8810l4162j3413j3897n974
6553d5849k8268L7417M0437j15j4852M4081J0653J998m47j7410k1483k2331j7711
$$ y = [-10607, -18153, -25517, -51488, -52940, -65908, -35710, -1188, 12332, 7495, 21906, 31890, 17539, -15186, -22194, 10118, -750, -3729, 38716, 42250, 52033, 40407, 21597, -12565, -25978, -39875, -45849, -74117, -36700, 3737, 3622, -11230, 32851, 43504, 45502, 45055, 27645, 6162, -16169, -33880]
$$ [...]
##END NTUPLES=NMR SPECTRUM
##END=
