##TITLE=Analysis number 327854
Compound Code btb 11186
Project Code adrs
Chemist Name jom
##JCAMPDX= 6.0         $$ Bruker NMR JCAMP-DX V2.0
##DATA TYPE= NMR SPECTRUM
##DATA CLASS= NTUPLES
##ORIGIN= Bruker BioSpin GmbH
##OWNER= nmr
$$ XWIN-NMR		Version 3.5
$$ Thu Apr 12 13:06:27 2007 GMT Daylight Time (UT+1h)  MAYBRIDGE\nmr@NMR_250MHZ
##.OBSERVE FREQUENCY= 250.131544655141
##.OBSERVE NUCLEUS= ^1H
##.ACQUISITION MODE= SIMULTANEOUS (DQD)
##.ACQUISITION SCHEME= undefined
##.AVERAGES= 16
##.DIGITISER RES= 18
##SPECTROMETER/DATA SYSTEM= dpx250
##.PULSE SEQUENCE= zg30
##.SOLVENT NAME= CDCl3
##.SHIFT REFERENCE= (INTERNAL, CDCl3, 0, 16.522)
##AUDIT TRAIL= $$ (NUMBER, WHEN, WHO, WHERE, WHAT)
$$ ##TITLE= Audit trail, XWIN-NMR		Version 3.5
$$ ##JCAMPDX= 5.01
$$ ##ORIGIN= Bruker BioSpin GmbH
$$ ##OWNER= nmr
$$ C:\u/data/dgb/nmr/ADRS/1270/pdata/1/auditp.txt
$$ ##AUDIT TRAIL=  $$ (NUMBER, WHEN, WHO, WHERE, WHAT)
(   1,<2007-04-12 13:06:00.49 +100>,<MAYBRIDGE\nmr>,<NMR_250MHZ>,
      <created by zg, POWCHK disabled, PULCHK disabled
       configuration hash MD5:
       49 4B E0 1D 92 C2 6B 37 9F E6 65 BC 52 41 86 1D
       data hash MD5: 64K
       4B EF 45 E1 5D 2F 80 6E 72 1A 2C 01 69 2F 53 B5>)
(   2,<2007-04-12 13:06:14.43 +100>,<MAYBRIDGE\nmr>,<NMR_250MHZ>,
      <Start of raw data processing
       ef LB = 0.3 FT_mod = 6 PKNL = 1 SI = 32K 
       data hash MD5: 32K
       A0 2F 34 34 CC 78 2A 7E 23 F0 B1 A2 DE 57 43 67>)
(   3,<2007-04-12 13:06:16.42 +100>,<MAYBRIDGE\nmr>,<NMR_250MHZ>,
      <apk 
       data hash MD5: 32K
       4D EC F6 75 B2 98 61 12 B1 DC 80 76 F0 0C 37 44>)
(   4,<2007-04-12 13:06:17.18 +100>,<MAYBRIDGE\nmr>,<NMR_250MHZ>,
      <abs ABSG = 5 
       data hash MD5: 32K
       2C CA B4 FC 25 4E 36 2F 5F 5F 84 65 AA C7 5B D7>)
$$ ##END=
$$ 
$$ hash MD5
$$ FB 83 18 57 ED 29 47 B3 7E CF C5 56 93 05 4A B0
##$RELAX= 
##$RELAX= 
##$RELAX= 
##$RELAX= 
##$RELAX= 
##$RELAX= 
##$RELAX= 
$$ Bruker specific parameters
$$ --------------------------
##$DU= <C:\u>
##$EXPNO= 1270
##$NAME= <ADRS>
##$PROCNO= 1
##$TYPE= <nmr>
##$USER= <dgb>
##$AMP= (0..31)
100 100 100 100 100 100 100 100 100 100 100 100 100 100 100 100 100 100 
100 100 100 100 100 100 100 100 100 100 100 100 100 100 
##$AQSEQ= 0
##$AQ_mod= 3
##$AUNM= <au_zg>
##$AUTOPOS= <21 >
##$BF1= 250.13
##$BF2= 250.13
##$BF3= 250.13
##$BF4= 250.13
##$BF5= 500.13
##$BF6= 500.13
##$BF7= 500.13
##$BF8= 500.13
##$BYTORDA= 1
##$CFDGTYP= 0
##$CFRGTYP= 5
##$CHEMSTR= <none>
##$CNST= (0..31)
1 1 145 1 1 1 1 1 1 1 1 1 1 1 1 1 1 1 1 1 1 1 1 1 1 1 1 1 1 1 1 1 
##$CPDPRG= <>
##$CPDPRG1= <>
##$CPDPRG2= <>
##$CPDPRG3= <>
##$CPDPRG4= <mlev>
##$CPDPRG5= <mlev>
##$CPDPRG6= <mlev>
##$CPDPRG7= <mlev>
##$CPDPRG8= <mlev>
##$CPDPRGB= <>
##$CPDPRGT= <>
##$D= (0..31)
0 1 0 0 0 0 0 0 0 0.06 0 0 0 0 0 0 0.0002 0 0 0 0 0 0 0 0 0 0 0 0 0 0 
0 
##$DATE= 1176379559
##$DBL= (0..7)
120 120 120 120 120 120 120 120 
##$DBP= (0..7)
150 150 150 150 150 150 150 150 
##$DBP07= 0
##$DBPNAM0= <>
##$DBPNAM1= <>
##$DBPNAM2= <>
##$DBPNAM3= <>
$$ [...]
##$SUBNAM7= <"">
##$SUBNAM8= <"">
##$SUBNAM9= <"">
##$SW= 20.6930455092707
##$SWIBOX= (0..15)
0 0 3 0 0 0 0 0 0 0 0 0 0 0 0 0 
##$SW_h= 5175.983436853
##$TD= 65536
##$TD0= 1
##$TE= 683.16
##$TE2= 300
##$TE3= 300
##$TEG= 300
##$TL= (0..7)
0 120 120 120 120 120 120 120 
##$TP= (0..7)
150 150 150 150 150 150 150 150 
##$TP07= 0
##$TPNAME0= <>
##$TPNAME1= <>
##$TPNAME2= <>
##$TPNAME3= <>
##$TPNAME4= <>
##$TPNAME5= <>
##$TPNAME6= <>
##$TPNAME7= <>
##$TPOAL= (0..7)
0.5 0.5 0.5 0.5 0.5 0.5 0.5 0.5 
##$TPOFFS= (0..7)
0 0 0 0 0 0 0 0 
##$TUNHIN= 0
##$TUNHOUT= 0
##$TUNXOUT= 0
##$USERA1= <user>
##$USERA2= <user>
##$USERA3= <user>
##$USERA4= <user>
##$USERA5= <user>
##$V9= 5
##$VALIST= <valist>
##$VCLIST= <CCCCCCCCCCCCCCC>
##$VD= 0
##$VDLIST= <DDDDDDDDDDDDDDD>
##$VPLIST= <PPPPPPPPPPPPPPP>
##$VTLIST= <TTTTTTTTTTTTTTT>
##$WBST= 1024
##$WBSW= 4
##$XGAIN= (0..3)
0 0 0 0 
##$XL= 0
##$YL= 0
##$YMAX_a= 503582
##$YMIN_a= -411958
##$ZGOPTNS= <>
##$ZL1= 120
##$ZL2= 120
##$ZL3= 120
##$ZL4= 120
##$ABSF1= 16.522
##$ABSF2= -4.171173
##$ABSG= 5
##$ABSL= 3
##$ALPHA= 0
##$AQORDER= 0
##$ASSFAC= 0
##$ASSFACI= 0
##$ASSFACX= 0
##$ASSWID= 0
##$AUNMP= <proc_1d>
##$AZFE= 0.1
##$AZFW= 0.1
##$BCFW= 0
##$BC_mod= 0
##$BYTORDP= 0
##$COROFFS= 0
##$CY= 12.5
##$DATMOD= 1
##$DC= 0
##$DFILT= <>
##$DTYPP= 0
##$F1P= 14.0000005364418
##$F2P= -0.99999901652339
##$FCOR= 0.5
##$FTSIZE= 32768
##$FT_mod= 6
##$GAMMA= 0
##$GB= 0
##$INTBC= 1
##$INTSCL= 1
##$ISEN= 128
##$LB= 0.3
##$LEV0= 0
##$LPBIN= 0
##$MAXI= 10000
##$MC2= 0
##$MEAN= 0
##$ME_mod= 0
##$MI= 0
##$NCOEF= 0
##$NC_proc= -4
##$NLEV= 6
##$NOISF1= 0
##$NOISF2= 0
##$NSP= 0
##$NTH_PI= 0
##$NZP= 0
##$OFFSET= 16.522
##$PC= 1
##$PHC0= 80.03707
##$PHC1= 4.635359
##$PH_mod= 1
##$PKNL= yes
##$PPARMOD= 0
##$PSCAL= 4
##$PSIGN= 0
##$REVERSE= no
##$SF= 250.13
##$SI= 32768
##$SIGF1= 0
##$SIGF2= 0
##$SINO= 400
##$SIOLD= 32768
##$SREGLST= <1H.CDCl3>
##$SSB= 0
##$STSI= 32768
##$STSR= 0
##$SW_p= 5175.98343685301
##$SYMM= 0
##$S_DEV= 0
##$TDeff= 65536
##$TDoff= 0
##$TI= <Analysis number 999999
Compound Code 99
Book Reference 9
Project Code 9>
##$TILT= no
##$TM1= 0
##$TM2= 0
##$TOPLEV= 0
##$USERP1= <user>
##$USERP2= <user>
##$USERP3= <user>
##$USERP4= <user>
##$USERP5= <user>
##$WDW= 1
##$XDIM= 32768
##$YMAX_p= 419189582
##$YMIN_p= -54276
$$ End of Bruker specific parameters
$$ ---------------------------------
##NTUPLES= NMR SPECTRUM
##VAR_NAME=  FREQUENCY,     SPECTRUM/REAL,   SPECTRUM/IMAG
##SYMBOL=    X,             R,               I
##VAR_TYPE=  INDEPENDENT,   DEPENDENT,       DEPENDENT
##VAR_FORM=  AFFN,          ASDF,            ASDF
##VAR_DIM=   32768,         32768,           32768
##UNITS=     HZ,            ARBITRARY UNITS, ARBITRARY UNITS
##FACTOR=    0.157963299565203, 1,           1
##FIRST=     4132.6476996994, 0,             0
##LAST=      -1043.33573715361, 0,           0
##MIN=       -1043.33573715361, -54276,      0
##MAX=       4132.6476996994, 419189582,     0
$$ Real data points
##PAGE= N=1
##DATA TABLE= (X++(R..R)), XYDATA
$$ [...]
13956b618M291o255L886J1702P404K445l711j7238o04L158o318j0762m035k1704
13942d0359K689K120k651Q439Q320K462R166O974m314j639J687K798n643J162
13928h789n264L533L872J1109L537k649J3635j1806j6172p967J380J1319j352
13915e614j36n11R46k272p619N779J2506n434j5550m217M640L370j952J878q637
13900b2823M160L316Q1l890P841N573M392q551p668n11K680K446Q924j9111Q91
13885b2250P062j015k120Q755J691L230j2038k0982M9J5928M114L81k699j4285
13871c4179N26J7484j95J303N85k481L683m57p389j799O709R917J0762n001K956
13856B424l405j528o356J743o600m869l765K058J1489P767K7n412o903l894q210
$$ y = [-2618, 1673, -4582, -696, 11006, 18410, 20855, 17144, -94, -698, 2460, -3858, -14620, -18655, -40359, -37670, -35550, -38201, -29762, -21442, -18980, -9814, -2840, -7154, -8793, -7106, -4308, -9951, -8789, -14053, -10520, -6648, 4461, 7998, 5349, 18984, 7178, -8994, -16961, -15581, -4262, -5614, -5750, -6261, -5315, -7587, -15206, -9427, 3079, -2355, -17905, -22122, -17482, -14112, -16064, -14186, -22823, -18663, -15347, -15266, -19156, -11315, -5742, -1350, -9901, -17569, -18080, -15400, -12954, -4030, -23141, -22250, -15188, -16203, -18323, -9568, -7877, -4647, -16685, -37667, -37618, -21690, -17576, -17195, -19894, -34179, -33653, -16169, -16364, -15061, -14476, -16957, -13274, -13731, -21120, -22919, -16210, -6293, 4469, -532, 2424, -981, -2509, -8865, -7122, -13722, -18591, -22356, -20298, -8809, -1042, -1015, -6427, -13330, -17224, -25434]
13841b5434k863J9889K179l472p651j1269o232K707J4218n071J888o461J228Q527
13827a7817K257R042j4449j0219J0609m248n267m923O676J2550J2160j939j1679
13814a7247m06Q312l616M47p416q686m449O509L450k112k929K463R957J304l427
13799a7846n973j138l422o783K197j472R851L484j356J268p107O599M661k402
13785a9439m295r141P895j164J3935j504r111J998J2625p646r503j633Q813O715
13771a1455o75J700k133q216N845L763p495j1011p507O490J8722Q64m545j989
13757a7642l382N073J2975Q961q226j0438p884p970M22P707Q076n762j1064M678
13743b4476L137J916J0608j543k509p71M886J848j1939Q803J4144j8905k780M82
$$ y = [-25434, -28297, -8408, -6229, -9701, -17352, -28621, -34853, -32146, -17928, -22999, -21111, -27572, -26344, -17817, -15560, -6518, -20967, -31186, -20577, -24825, -30092, -35015, -28339, -15789, -3629, -5568, -17247, -17653, -9341, -12957, -12510, -19926, -28612, -33061, -26552, -23102, -25214, -28143, -25680, -15723, -14419, -17846, -23819, -24957, -28379, -35162, -32965, -34437, -24586, -21102, -22458, -21190, -28297, -21698, -17037, -19439, -23734, -32875, -24980, -26144, -12209, -13713, -22824, -20826, -8201, -15847, -25350, -26983, -18170, -11455, -12130, -10430, -12563, -20779, -14934, -11171, -18666, -29677, -37184, -30694, -11972, -11108, -15653, -17642, -21024, -15951, -2976, 5985, -2241, -12679, -20563, -28533, -28111, -20404, -12328, -18090, -29154, -24476, -21339, -19423, -8815, -10358, -12867, -13638, -8752, -6904, -18843, -10040, 4104, -14801, -17581, -17099]
13729a7099j218n322K697N517K27l502L397l599J647O789j280L182M860j6604
13715b0308n687K162J2132J4512J535p381o601L505k010j1299Q1K72j3265N760
13701b6592J2590J071L211j1400j3937N215M401L141M079p835n645k01j1010j653
13687d4565J3206J8850K266k804j5614n880Q780J1284R260L807k945l999j0712
13674a9066Q871J5647K044J0137N6K282K250K035O283j0830j9984j2271p18Q514
13660d750J9373K159j0450j6592j0188N738m613L135j8491q390J5404R213R955
13647h497P756j617R880Q409P692n78j8339m609j3245j5194J561Q993M448J1764
13633a576K086j608O906M913K100J559O770N426O728J1736L896j927j6395j8004
$$ y = [-17099, -18317, -23639, -20942, -15425, -15198, -18700, -15303, -18902, -17255, -10466, -11746, -8564, -3704, -20308, -25995, -23833, -11701, 2811, 4346, -3035, -9636, -6131, -8141, -19440, -19359, -19087, -32352, -26592, -14002, -12931, -9720, -21120, -35057, -29842, -25441, -22300, -18221, -26056, -31701, -31902, -42912, -44565, -31359, -12509, -10243, -13047, -28661, -34541, -25761, -14477, -5217, -1410, -4355, -8354, -19066, -10195, 5452, 7496, 17633, 17689, 19971, 22221, 24256, 30539, 19709, -275, -12546, -13264, -4750, 14623, 16782, 6332, -10260, -20448, -14710, -19323, -16188, -34679, -43069, -27665, -18452, -8497, -741, -2358, 7522, 15931, 23623, 23045, 4706, 97, -13148, -28342, -26781, -17788, -13340, -1576, 510, -1098, 5808, 10721, 12821, 14380, 21150, 26576, 33304, 45040, 48936, 47009, 30614, 12610]
13619A2610j9052r037P208J3210K437o89n804N150J710k541k692L432p373j292
13605b723j575K968o566p894J2623R295j0744n815K144n925k769m006O436M163
13591a0388O885K238P451j0192p61n904Q840J1128N831o048K475n874k431k0706
13577a7456o194M25R130J3873L971n084O821l624p249j7947n652O410l825n749
13563c2150J1650P188k373J704Q239P620n834j4733j820n412j3352J1290P056
13550b0927J75q886n039p1P448J1899M667J6401O290n890j2835K52M064l281k088
13535g821p249O047o235j3253l643J6225N127p15k319J275Q052n544j168m186
13521a5407m411Q485j073m679P982J2084J6392R010q583n779K756j7248k376J4163
$$ y = [12610, -6442, -15479, -8271, 4939, 7376, 6687, 883, 6033, 7743, 5202, 2510, 5942, -1431, -2723, -4298, -1330, -7896, -15790, -3167, 6128, -4616, -10431, -8287, -14212, -16981, -20987, -14551, -10388, -3503, -1265, 6186, -4006, -4767, -10671, -1831, 9297, 15128, 9080, 11555, 5681, 3250, -17456, -23650, -23225, -14095, -222, 3749, -1335, 5486, 1862, -5387, -23334, -28986, -22576, -26401, -32150, -20500, -13312, -15685, -13981, -5742, 1878, -3956, -18689, -20509, -25921, -39273, -27983, -20927, -20752, -29638, -34677, -34748, -27300, -15401, -10734, 5667, 11957, 6067, -6768, -6516, -2452, -5733, -7821, -15070, -9023, -15258, -28511, -32154, -15929, -10802, -11517, -13836, -12561, -4509, -10053, -11221, -15407, -19818, -11333, -12406, -17085, -9103, 2981, 19373, 28383, 19800, 14021, 16777, -471, -2847, 11316]
13507A1316j385J968l949j5078J39M423p198L907P865j1853m053M530j2684r210
13493c1262Q117R120J1357O214o518N739j1221o097o656o651j5100P304K3047
13480a2607J8198j180N168l160K40N14q839j5202Q58q598l472m05J1315J4979
13466b191q468N015R556r38K01q805n989L062J5421K543q292k315k553n324L740
13451e337J425l332M04R194J260l421O285K248m904r844n459n36k658j0337Q634
13436a6378L497k211k308O918J4091l955r668K613O370L475N332k753n095o002
13422f074N109q457k600L545L534m727p856j1229P575J1337Q874r22j545m015
13408g451j6181p252J677P665R130P838J526n486j2164j5423L31J0129J2747p280
$$ y = [11316, 9931, 11899, 7950, -7128, -6989, -2566, -9764, -5857, 2008, -9845, -13898, -9368, -22052, -31262, -23145, -14025, -2668, 3546, -2972, 2767, -8454, -14551, -21207, -27858, -42958, -35654, -12607, 5591, 4411, 9579, 6419, 6659, 7173, -1666, -16868, -16010, -24608, -28080, -28485, -17170, -2191, -10659, -5644, 3912, 2974, 3175, -5630, -11619, -8557, 6864, 9407, 1115, -1200, -3753, -9077, -5337, -3912, -7244, -6840, 2354, 3614, 193, 6478, 8726, 3822, -6022, -11481, -12017, -14675, -25012, -16378, -12881, -15092, -17400, -10482, 3609, -346, -10014, -7401, -1031, 2444, 7776, 5023, -72, -6074, -965, -9422, -12022, -8477, -4943, -9670, -17526, -28755, -21180, -9843, -969, -1891, -3436, -7451, -23632, -30884, -29207, -21542, -12412, -4574, -3048, -8534, -20698, -36121, -35790, -25661, -12914, -20194]
13394b0194j2441L767J0087N782k968n313o818J0697J1175k286l1948l164K4687
13381a8937j141q834P561M03j3215J101k437j359R290J5515j183j3671r446m439
13367d0792J525Q172J364Q812N55k940K165j450l323P334Q002j556o892o0L223
13352a5861Q857Q054j321j1519o060n851P383P151k043N783k033J3480J1583o458
13338A1145k0414j0529J1897O38j1686j9954M096J7105l643K110m629J4060M608
13325e196j3329j348R452M954j322p823p540n26K187n660n658K972K234j038K2333
13310e308J5021l037n301n159J214J688J753Q483k382l559l428q581J1366L564
13296F334j4774j2819L377J9473J5213r707k974j360l277L816L620q893o955j260
$$ y = [-20194, -32635, -28868, -18781, -12999, -15967, -21280, -28098, -17401, -6226, -8512, -40460, -43624, -18937, -20078, -28912, -21351, -20948, -34163, -33062, -35499, -36858, -27568, -12053, -13236, -26907, -36353, -40792, -39267, -31095, -29731, -20919, -20364, -23304, -21139, -22589, -25912, -18578, -10576, -12132, -19024, -19084, -15861, -7004, 1050, -271, -11790, -17850, -23701, -16318, -9167, -11210, -5427, -7460, 6020, 17603, 11145, -9269, -19798, -7901, -7263, -18949, -38903, -34807, -17702, -21345, -19235, -23864, -9804, -5196, -18525, -19873, -10421, -5467, -6789, -14612, -22152, -22678, -20491, -26151, -31809, -28837, -26603, -27641, -5308, 9713, 6676, 1375, -3784, -2570, -882, 871, 9354, 6972, 3413, -15, -8596, 2770, 6334, -8440, -21259, -17882, 1591, 16804, 7097, 4123, 2763, -514, 3302, 6922, -1971, -8926, -10186]
13282a0186P931R94k0240K299J6460Q552r741m671j541q397J064M918Q096J663
13268b799N730J0474q206j0767j616r69J191p402J312M703p95Q127j3415J553
13254a2879J0780j3521j2292q57J4695J7527J38R001j6764k0322N979J1205p510
13241a4820K35j1585l978J0260R89P075P403M562K107O012o702K36L690n73p468
13226b557m400P61k497l707O944j0040K4n084k331n069K314R667n846K724M653
13211a4444M607j887Q39p152O42J2590k334J798J659p967q554k290J6481J5499
13197I487O791p530l435p706j7167k785L552r471K255J617M305p15N689M962j906
13182a2057m944j8665l614j764L628J8752J2459J1047J1266j332p269j646k017
$$ y = [-10186, -2255, -1261, -21501, -19202, -2742, 5810, -3931, -8602, -10143, -18540, -17476, -12558, -4462, -2799, 2931, 13405, 5199, -5568, -7184, -8153, -6962, -14364, -13052, -8349, -9144, -1017, -14432, -12879, -2099, -15620, -27912, -28769, -14074, 3453, 3591, 12592, -4172, -24494, -18515, -7310, -14820, -14585, -26170, -30148, -19888, -18899, -11824, -4421, 141, 2248, 8260, 1558, 1794, 5484, 4911, -2557, -6957, -6196, -8693, -12400, -5456, -15496, -15472, -20556, -22887, -27956, -25642, -15975, -21821, -19097, -14444, -9837, -11724, -10885, -18037, -17395, -4805, -7139, -5341, -3682, -11649, -20203, -22493, -6012, 9487, 16278, 8748, 5313, -2393, -19560, -22345, -18793, -28264, -26009, -24392, -20087, -20802, -15113, -10151, -12057, -17001, -35666, -39280, -41044, -37416, -18664, -6205, 4842, 16108, 14776, 7507, 5861, 3844]
13169C844k678j843p626l074J530o550l758J9219Q292r335k409J783r750k3732
13155c6087O571L4984J4795J39M219j0967j5663J432J617o27j0129o0P901p497
13141i372j5432N192R239O46j2157J719L85P578J282L89R696O939m538n89o68
13126C09l112o47J2173O431Q852r967j6285j776l913j1168L185Q083j0986j2633
13112c1454j480J156J5047J3031J7433J4335L459k0560j1377k900o228o53n11
13099a0702J0643l176N502O32j0586r67n044q403j0193R428J5022L852J562K313
13085a17l595l856k266L855k564j2574O304Q236j3079K284R427R244j3195q620
13071b0516R915m163j4835M374J581L230K879l289J1689l62r973J477P464O411
$$ y = [3844, 1166, -677, -8303, -11377, -9847, -16397, -20155, -936, 7356, -1979, -4388, -2605, -12355, -36087, -29516, 5468, 20263, 20402, 24621, 13654, -2009, -577, 1040, 413, -9716, -9776, -1875, -9372, -24804, -19612, -10373, -9727, -21884, -20165, -19780, -12202, -10920, -10531, -835, 6104, 1566, 977, 309, -2803, -3450, 8723, 15154, 24006, 14039, -2246, -4022, -7935, -19103, -15918, -7835, -18821, -31454, -32934, -31778, -16731, -3700, 13733, 28068, 31527, 10967, -410, -3310, -9538, -10191, -10702, -59, -3235, 2267, 2899, -7687, -8654, -13698, -22101, -32294, -22866, -7844, -3992, -2430, -117, -3712, -7568, -9834, -5979, -8543, -21117, -14813, -6577, -19656, -17372, -7945, 1299, -11896, -20516, -10601, -14764, -29599, -25225, -23644, -20414, -17535, -20824, -9135, -9497, -19470, -17993, -10529, -4118]
13057d118r230k623O208j4424r842O334q666j606J7072N296l37m921K021l561
13043b2397j454O273J271m388j423J2443lj5948L604J6078Q745j8204o859J2692
13029i570J4671L631j1424L025k763j1275j3578j2128O111R191R276o808l661
13016b5302J4658j753p964m026q459O514P802p726p656M787R40l92J1251J1230
13002f096P500r043j2578j032j990m641O851P881J053l205k349j6434l996J4329
12988b3750N045l31J2106O680m996n369J363J499Q558k183N472N120j6844n626
12974a3256q009o62M164R378p017O110O278l058P219O100l467J541J9276J449
12960B6046j0501m592m423l481q017o098M295j556k11K93o613N112K0974J0583
$$ y = [-4118, -13348, -15971, -9763, -24187, -34029, -27695, -36361, -37967, -20895, -15599, -15936, -20857, -18836, -22397, -23851, -17578, -16307, -20695, -22118, -9675, -9678, -25626, -22022, -5944, 2801, -15403, -22262, -9570, 5101, 8732, -2692, 333, -2430, -13705, -27283, -39411, -33300, -24109, -14833, -21641, -25302, -10644, -12397, -20361, -24387, -32846, -26332, -18530, -26256, -33912, -29125, -28185, -28577, -17326, -6096, 1404, -7639, -20217, -21249, -23239, -27880, -21029, -13148, -12095, -15300, -17649, -34083, -38079, -23750, -18705, -19036, -6930, -250, -5246, -10615, -9252, -7753, 805, -1378, 4094, 9214, -7630, -13256, -21265, -21927, -17763, -8385, -15402, -9292, -3014, -6072, 1147, 7247, 3780, 5321, 24597, 26046, 15545, 10953, 6530, 3049, -4968, -11066, -6771, -8327, -8538, -8245, -14858, -9746, 11228, 21811]
12946B1811r116K766p482j0712J944K445N284K12j5237k777L804P951J2782J561
12932A5236P102Q143J2116J5110O68j783o250j2861j4541j3675j1203O211m38
12919C835L630j3657Q229P546l913L789K242m153l020r806L107l123J774j1266
12905a4786j6434J2436K3806P129q714J322N725J0402m998p034m007m361Q234
12892H720J0994M916l322j5617L79P805J892r884o042j4113l616j1736J0349K077
12878a7198j043j711K882R948k929m380P887j3984j6615J3164L826j4200j580
12865c5933O358K654J3628J7232l362j323N40j0915j0086O043O759k053P962o57
12851c153K907R848K576j3471q342r573R138J857j5736o04R775Q984o286l896
$$ y = [21811, 12695, 15461, 7979, -2733, -789, 1656, 6940, 7152, -8085, -10862, -7058, 893, 13675, 15236, 22338, 30481, 42597, 57707, 58375, 56592, 50342, 37481, 22940, 9265, -1938, 4273, 3835, 7465, -6192, 2037, 9583, 5670, 9459, 11701, 7548, 4528, -5278, -2171, -5294, -3520, -14786, -31220, -18784, 5022, 12151, 3437, 4759, 10484, 20886, 15888, 8854, 4847, 486, 8720, 19714, 24630, 21308, 5691, 6070, 13875, 15767, 5883, -159, -14272, -17888, -29624, -19275, -17198, -18241, -19952, -17070, -7122, -10051, -14431, -6544, -20528, -37143, -23979, -20153, -34353, -35933, -29575, -26921, -13293, 3939, 577, -746, -206, -11121, -21207, -15164, -8405, -10458, -2496, -3153, -246, 9602, 12178, -1293, -9635, -19208, -10070, -8213, -23949, -24553, -14778, -5794, -12080, -15976]
12837a5976j054R557J3611Q462K32l191j4166r697k714N61J245N082r292k226
12823a9566O019J833J968l937k291J694M850o431L970P493l411m867o40M029J1097
12808A810k086n220N340j847O768L679n950k776j2920k155L6J941J8961K893o936
12793A538n654L164k948p820J0771k305m88J535k166j587K784j659o665J768L711
12778f021R29O196N444p296q480n709o109P318J4j6483p723J6384R066O02M422
12763g446P721Q536j704m166n221q350k891j996J1491P157p172o289O665q024
12749a1689M174J668j871Q16J0529o8M315L719M233q146j7025L312L497J5483
12735A2947q850p856O898L785n954r221o265J370J0102o828j0743l311Q059L003
$$ y = [-15976, -17030, -7473, 6138, 14600, 14832, 11641, -2525, -12222, -14936, -14375, -13130, -8048, -17340, -19566, -13547, -11714, -9746, -13683, -15974, -14280, -9430, -15861, -11891, -4398, -7809, -12676, -13316, -9287, 1810, -276, -5496, -156, -2003, 4765, 8444, 2494, -282, -13202, -15357, -15321, -13380, 5581, 8474, 1538, -4116, -952, -3900, -11720, -949, -3254, -3742, -2207, -4373, -5960, -3176, -4835, -11500, -9732, -6021, -5092, 1104, 6548, -748, -9228, -14937, -21046, -13728, -13714, -30197, -37920, -21536, -12470, -11868, -7446, 275, 8811, 7107, 2941, -2280, -10630, -13521, -15517, -4026, 3131, -4041, -10330, -3665, -11689, -7515, -5847, -7718, -6902, 3627, 3559, 7874, 11593, 15826, 7680, -9345, -6033, -2536, 12947, 4097, -3759, 3139, 6924, 970, -8251, -14516, -13146, -3044, -9872, -20615, -23926, -15867, -12864]
12721a2864R240j486J303q678n818P081P279o437r607O307R151N542m953k226
12707f166o5Q730J9209L930q196n791o301L51j1757q103j685L080J4727K539p79
12692C723M020J3946l010j0785m775L981r645p646j2080j510J664J1861Q293J0007
12678H044P232R575N706m073j6090n305K94p978L745k966k246R71R74K620l625
12663c122q463j4967P747J1021J4393J8697k604j4590l867j987J3250p636j3066
12650e194k827M326N248n303J452N325m019M25n58p927J2217Q939q905j9829P262
12635i368J7861M566M385p78M40L838p752j473n56P914Pp8j3592m218J0677l444
12619H429k625M084r253O861P385l191j2901K942J1982J4922r000n395K370R843
$$ y = [-12864, -3624, -5110, -3807, -12485, -18303, -11222, -3943, -10380, -19987, -13680, -4529, 1013, -3940, -6166, -6231, 2499, 21708, 25638, 17442, 11651, 5350, 5701, -6056, -14159, -15844, -12764, 1963, 4502, 3723, 7743, 21689, 18679, 7894, 3119, 7100, -2545, -10191, -22271, -23781, -22117, -10256, -1963, 8044, 15276, 24851, 30557, 26484, 10394, 5089, 5383, -2595, 1150, -1816, -4062, -3091, -2117, 503, -3122, -11585, -26552, -18805, -7784, 6609, 25306, 22702, 8112, 4245, 2258, 15508, 7872, -5194, -8021, -3695, 1553, -3750, -2298, 3027, -992, -567, -1125, -9052, 3165, 12104, 3199, -16630, -9368, 8493, 13059, 17444, 16666, 17106, 20944, 13192, 11719, 11163, 19077, 19084, 19006, 5414, 1196, 11873, 8429, 5804, 9888, 635, 7496, 14881, 11690, -1211, 1731, 13713, 28635, 19635, 14240, 16610, 26453]
12605B6453j490j1171R381K79k156j845j5151o726N407m915k882J7967J9286j284
12591C1153o082J55j313j015m82M297p488j3858k595L469J2546M067J5347L731
12577D1932k648l824n377j121j252j2648j8091K53J6067L049O041m219q928j441
12563G793o950r592l575N442M019R860K617n37n916j562j3296r435J5266J2718
12549F852O044Q918M167j4928n468K815p00j669m388N069K2079m872k930k156
12535A8833O148K412j4173J928q293J205R113R105L148o844j288r56q69J344r154
12520A1659m701J511m629P87J0878l246r011j0712m446o478J365O577P518J448
12506a480m088L507K361r394n959O034K862N976J1938k40j1441j0347N228O196
$$ y = [26453, 24963, 13792, 23173, 23452, 21296, 19451, 4300, -2426, 2981, -1934, -4816, 13151, 32437, 31153, 25071, 25226, 23913, 22898, 22416, 26713, 19225, 5367, 2772, 6241, 18787, 22854, 38201, 41932, 39284, 35460, 30083, 28962, 27710, 15062, -3029, -2776, 13291, 16340, 22381, 18162, 9234, 7793, 843, -8749, -12324, -6882, -2863, 6997, 9614, 9077, 3161, 1599, -11697, -21132, -5866, 6852, 12896, 21814, 25981, 11053, 5585, 8400, 7700, 6031, 1643, 6712, 28791, 23919, 20989, 18833, 24981, 27393, 13220, 15148, 6855, 8060, 17173, 26278, 29426, 22582, 21294, 20338, 19469, 20813, 11659, 6958, 8469, 3840, 4627, 15505, 12259, 3248, -7464, -11910, -18388, -17023, -10446, -2928, -1480, -5568, -2061, 300, -9094, -15053, -9019, -6157, -181, 11757, 11517, 76, -10271, -5043, 1153]
12492A153o212J2909J1096p386J946O530J3210K101O034R544O975N887l799j0061
12478D9927j5334l630J895j0719j2784K538M320p323r284J0229J5048J0443K151
12465C7477q988p250O195J6251K794j1202k944k763l940q629K798J2558j0809
12452B1548j6637j3590p936P746J1194J4230J2663M215K113r075m920Q242O258
12439C6051l66o94m44J1293O985L534L117J5874R024L262k186l194p789q425r563
12424E6479P97Q199K744M866J859M227M219j0694j3282N322P742k549m29J338
12410G0838j6761k989k360M886O823q480P180N975k3041o571J2559O167O760J499
12396F2485L166m091M481P684P835P768M371P044N862K611L858L435K46K0823
$$ y = [1153, -5059, 7850, 18946, 11560, 13506, 20036, 33246, 35347, 41381, 50925, 57900, 63787, 59988, 49927, 34593, 30963, 32858, 22139, 9355, 11893, 16213, 8890, -394, 9835, 24883, 35326, 37477, 28489, 21239, 27434, 43685, 46479, 35277, 32333, 29570, 25630, 17001, 19799, 32357, 21548, 4911, -8679, -16615, -8869, 2325, 16555, 29218, 33433, 35546, 26471, 21551, 29793, 36051, 35685, 34991, 34547, 45840, 52825, 56359, 59476, 75350, 84374, 87636, 85450, 82256, 74467, 66042, 56479, 57276, 65475, 68219, 73085, 74944, 79171, 83390, 72696, 59414, 64736, 72478, 69929, 69500, 70838, 54077, 51088, 48728, 53614, 60437, 51957, 59137, 65112, 42071, 35500, 48059, 54226, 60986, 62485, 65651, 61560, 66041, 73725, 81560, 89328, 93699, 100743, 106605, 109216, 113074, 116509, 116755, 137578]
12382A37578K0059N452L126L294J0510L266j5376j7449L761k983n371k060r296
12369A34511k548M972J620k0168l4356j992J8668l179j6202j7416j4210R171j449
12356E7422n948R901J3676Q5j5675q666J1369L400O026J1715J5936P954P735N56
12342A15486L79j839N886M151k680L643O767M569J1108j500j3055k345r039o411
12328A15120r526q979j389L147j6061j5265j756n006K513L140J461j0919m641
12315E1839P221q563J149m167l764O970Q016m390O386k524n647N786O533J0313
12301G5158N638N537k468n975n740n918o313M366K433K1548j4467o940r394q114
12287D9351m909J440J2953O316o658j718j286j3623q35J3845Q280q214l145m385
$$ y = [137578, 157637, 163089, 166215, 169509, 180019, 183285, 167909, 150460, 154221, 151238, 145867, 143807, 134511, 131963, 136935, 138555, 118387, 84031, 82039, 100707, 97528, 81326, 63910, 49700, 58871, 57422, 51474, 61375, 75051, 75136, 59461, 50795, 62164, 65564, 71590, 83305, 99241, 107195, 114930, 115486, 115865, 114026, 119912, 124063, 121383, 125026, 131793, 136362, 147470, 145970, 132915, 130570, 121531, 115120, 105594, 96615, 95226, 98373, 82312, 67047, 65291, 60285, 62798, 65938, 67399, 56480, 51839, 59060, 50497, 51646, 47479, 43715, 50685, 58701, 54311, 60697, 58173, 52526, 58312, 64845, 75158, 80796, 86333, 83865, 77890, 72150, 66232, 59919, 64285, 66718, 88266, 73799, 66859, 57465, 49351, 44442, 45882, 58835, 65151, 58493, 56775, 55489, 41866, 41031, 54876, 63156, 54942, 51797, 47412]
12273D7412q690j3819m170J0812J5639P503o254j1689j031O620m937R557J4688
12260F1641P950O47L335Q182j031j2147Q924O125p594j0154l156q480J697M519
12246F0458O245K190r144p798n839J5882L294j5929q677J7313M572j5389q404
12233C8774J3336J702J992k999M950O292q183j881J818J1086j815k383K24K587
12219F5500N813J930l07J7815L800N654l471J272L01j973K68r085p063m34J0519
12204I0539o943p596J2042J8061l111L894o53q475j714j0586p248k3027p810N62
12190D7935P468N020l388m475n747M138O082Q59N194J0522P557p566r55m43n04
12175G1697l851L405o068j0467m691M26k45P036j065o13J9602N516l347J856J734
$$ y = [47412, 38722, 24903, 20733, 31545, 47184, 54687, 48433, 36744, 35713, 42333, 37396, 46953, 61641, 69591, 70238, 73573, 81755, 80724, 68577, 77501, 83626, 76032, 65878, 62722, 54242, 55939, 60458, 66703, 68893, 59749, 51951, 46112, 61994, 65288, 49359, 40682, 57995, 62567, 47178, 38774, 52110, 53812, 55804, 52805, 57755, 64047, 55864, 53983, 55801, 66887, 65072, 62689, 62913, 65500, 71313, 73243, 72936, 90751, 94551, 100205, 96734, 98006, 98307, 96334, 96602, 87517, 80454, 80020, 90539, 83596, 76000, 88042, 106103, 102992, 106886, 106233, 97758, 96044, 85458, 78210, 55183, 47373, 47935, 55403, 60423, 57035, 52560, 46813, 50951, 57033, 57892, 63086, 73608, 81165, 73599, 72644, 72201, 71697, 67846, 71251, 65183, 54716, 50025, 50451, 50206, 57242, 56177, 55564, 75166, 80682, 77335, 79191, 80925]
12160H0925N126J2136j475k0233j3570L919J863j5960j7064n627J1609P673K58
12147D9580l428j3052j0220Q958O646Q25K845N494J1968K269M948J22L535k267
12133F8223J737k006r212k47j171J454k138k900K100J2403N169m855j4460j6933
12119C7164Q995J6825J275j547m259q086l84k683k318J484J0342P51R603m195
12105F2967p640P8j0933q221q807O137P451O648j3594j386J4355L078J2421J321
12091F3875l731O487j443k62k209J0236Q877j1998j2398n651k740N051L323j0356
12077D7061q969M491O778q003K509J348k750O64P418L683m222j6071o13J6303
12063D9627Q580r982r993Q254K811q548l665n599J5233J360j0611k993k354J2880
$$ y = [80925, 86051, 98187, 96712, 76479, 62909, 66828, 68691, 52731, 35667, 30040, 41649, 49322, 49580, 46152, 33100, 22880, 31838, 38484, 39309, 42154, 47648, 59616, 61885, 66833, 66955, 70490, 68223, 69960, 67954, 58742, 58495, 57324, 58778, 56640, 53740, 55840, 68243, 73412, 68557, 54097, 37164, 46159, 62984, 64259, 62712, 58453, 50367, 49983, 47300, 44982, 46466, 56808, 57559, 67162, 62967, 55327, 55405, 44472, 36251, 27444, 33581, 41032, 47680, 34086, 32700, 47055, 50133, 62554, 63875, 60144, 66631, 65188, 64926, 62717, 72953, 81830, 69832, 57434, 51783, 49043, 54094, 57417, 47061, 38092, 42583, 49361, 41358, 43867, 45215, 42465, 43129, 50547, 54230, 50008, 33937, 33324, 49627, 58207, 48225, 38232, 46486, 49297, 40749, 37084, 31485, 46718, 48078, 37467, 34474, 32120, 45000]
12049D5000n916o313M275J5715K007l61J3874m720p343L531l955L323O7R126L29
12034F8639l848N051Q73K292J7689K1496j2412j7997l443j1099j6145N43L23K776
12020E4738J525O259p276P027K557r516K505K049l942R739N940Q923n903j0603
12006F4022J2612k62m240O54l511N896m331j3186O034P677P757K465L147K509
11992H7243r771j0609L805Q170P394k00R41r4M45Q172q72j5784o808J2828p632
11977G7228p240Q362J710p184R628r357K207N556j467L096J7109K545M77L796
11963A06466P999Q661m937Q543k255p841Q005J3438J324J84O610p629J952m153
11949A36367K275N37k996m680o8L523j69L229j209q782n49o591O700L261n987
$$ y = [45000, 39084, 32771, 37046, 52761, 54768, 54407, 68281, 63561, 56218, 59749, 55794, 59117, 59184, 68310, 68639, 64791, 69842, 70715, 73007, 90696, 112192, 99780, 81783, 78340, 67241, 51096, 51639, 51962, 54738, 56263, 62522, 55246, 62273, 64830, 55314, 57819, 59868, 55926, 65665, 71605, 80528, 74625, 64022, 76634, 76372, 72132, 72786, 69275, 75171, 70840, 57654, 63688, 71365, 79122, 81587, 84734, 87243, 77472, 66863, 70668, 78838, 86232, 86032, 86973, 86879, 87324, 95496, 94624, 78840, 72032, 84860, 77228, 69988, 78350, 80060, 72876, 82504, 73147, 75354, 80910, 79443, 82539, 99648, 102193, 102670, 106466, 114465, 123126, 118189, 126732, 124477, 116636, 124641, 138079, 139403, 139587, 146197, 138568, 140520, 136367, 138642, 139179, 136183, 131503, 131435, 134958, 134789, 138018, 136809, 128027, 127478, 120887, 127587, 130848, 124861]
11934A24861n479K004j0527J555L756k581k109l321J4137Q565J5752P750L744
11921A58107l415n824J7493K0100J2530l921m435N500J2417J0361j181j7913k6612
11908A73207J294J2814k42P084K030k0782k5224j1951R896o50j526m234q182p36
11894A32798J0270J9715j410o766q460q861p752r573R046q787m068J0605O202
11881A32959J2798N496N62J5520O044L266J5329J9125J5667Q209K2725p045j0504
11868B40151K434J0275m810J751J1685r874k4025k7038j9350m917M837j3601r318
11855A58200Q18q423m972J377k471k99M964P256P758M142p936l276j0971J2911
11841A59078J4915K144J1562j436n033q685o126j2475j0832N966L341L162R869
$$ y = [124861, 119382, 121386, 110859, 112414, 116170, 113589, 111480, 108159, 122296, 130861, 146613, 154363, 158107, 154692, 148868, 166361, 186461, 198991, 195070, 190635, 196135, 208552, 218913, 217732, 199819, 173207, 174501, 187315, 187073, 194157, 196187, 175405, 150181, 138230, 148126, 147476, 145950, 141716, 133534, 132798, 143068, 162783, 161373, 154607, 146147, 137286, 129534, 119961, 129007, 120220, 116152, 126757, 132959, 145757, 151253, 151815, 167335, 173379, 176645, 191974, 211099, 226766, 234975, 257700, 250655, 240151, 242585, 252860, 248050, 249801, 261486, 251612, 227587, 200549, 181199, 176282, 181119, 167518, 158200, 159018, 150595, 145623, 147000, 144529, 144230, 149194, 156450, 164208, 168350, 160414, 157138, 146167, 159078, 173993, 176137, 187699, 186263, 181230, 172545, 166419, 153944, 143112, 149078, 152419, 155581, 165450]
11828A65450J6289J7171p835j4448j6532P763J3005o796l684L366m538L222k320
11815A70113k91L103L235l593N527q518j101M476P917L246N794N760J018j844
11801A94842m882J1436J5543J8554J1981O229M290J6436Q35j5685j5688k7704
11789B16187k5914j1392o559m385K577R14m753N014k038j6512l968J3051J5381
11776A77603J1608m978j0495R35J2828K2670M24n739o312p55Q582J0979J1954
11763B29304n533j2775N319P432J5313J1616r391q508J0097R031J6381K0270R294
11750B97850R573J7191j6317k4837k3626k3108j5294l699P829P234o736n219L695
11737B24536K424K197R343K928m643k765J0865L10R894Q701P465K45j1447j46
$$ y = [165450, 181739, 198910, 191075, 176627, 160095, 167858, 180863, 174067, 170383, 173749, 169211, 172433, 170113, 169822, 172925, 176160, 172567, 178094, 169576, 168475, 172951, 180868, 184114, 189908, 195668, 196686, 194842, 189960, 201396, 216939, 235493, 247474, 253703, 257993, 274429, 275264, 259579, 243891, 216187, 190273, 178881, 172322, 167937, 170514, 171428, 166675, 171689, 169651, 153139, 149171, 162222, 177603, 189211, 184233, 173738, 174673, 187501, 210171, 210595, 204856, 198544, 197789, 206371, 217350, 229304, 223771, 210996, 216315, 223747, 239060, 250676, 241285, 232777, 242874, 251905, 268286, 288556, 297850, 307423, 324614, 308297, 283460, 259834, 236726, 221432, 217733, 225562, 232796, 226060, 220841, 224536, 226960, 229157, 238500, 241428, 236785, 234020, 244885, 245195, 255089, 263790, 271255, 271500, 260053, 259907]
11723B59907k587P782J8459K9383J8949O195l230j0476j7331l481j6729k50O030
11710B92621Nn015q459K498j0593m883O584O395p129q465k177m40L221n448M972
11695B63687J0912O002l24r513o182m433k640K7761J6360M288J3912J4589R916
11682C44335M891M013J0852J0295K1331K3640J3713K8164L1034J7303J9569L54
11670E29494k4231m1025n3044m0797j5851k103l596q613Q36J2652J0920K2420
11658C87062P386k025J7195L4849K5641J0931M541N052r751o916k2905k9254j0426
11645D11380o962j4198o47P861J2102R320P675R778N070O985j1069L450R351J4711
11631D64807K5823M1485M3790K3595J4797j7927k7055m3477m3302j9551l575m591
$$ y = [259907, 257320, 265102, 283561, 312944, 331893, 338088, 334858, 324382, 307051, 303570, 286841, 286591, 292621, 292626, 287611, 279152, 281650, 271057, 266174, 272758, 279153, 272024, 263559, 261382, 260942, 264163, 258715, 263687, 274599, 280601, 280277, 270764, 264582, 260149, 257509, 285270, 301630, 305918, 319830, 334419, 344335, 349226, 353239, 364091, 374386, 395717, 419357, 433070, 461234, 492268, 509571, 529140, 529494, 505263, 464238, 411194, 370397, 354546, 352443, 348847, 340234, 341070, 353722, 364642, 387062, 394448, 392423, 409618, 444467, 470108, 481039, 485580, 490632, 480881, 473965, 451060, 421806, 411380, 404418, 390220, 389573, 397434, 409536, 418856, 426531, 436309, 441379, 448364, 437295, 440745, 450096, 464807, 490630, 532115, 575905, 599500, 614297, 596370, 569315, 525838, 482536, 462985, 459410, 454819]
11619D54819l373J5827Q057K1519J8362L193K755m082k52r317J0960J4077J8205
11606E50750J6077J1928J1708R505j045j2900k5738k8439j7819k2396k0480j9531
11594D51620L748N063J8495N043Q843J9806L6948M4842L0251K8655L0733k49j7528
11581F66270k7059j7949k4737l8254l7432r291m921J489N241j2735M511K0397
11569E25530J7308J3680J6393Q557j235j2896P529O592K6934J9253J2894Q897
11557F49436J0184J4967K2396L3213K5803Q746m186j4669k9386l9776l4260l0838
11545F11630j2449j985j9832k0893L442P338N704R945K830M674j760k1700N375
11532E72319m11J1452K1824J4136J7267L6811K7071Q102O046j1883j1204K138
$$ y = [454819, 451446, 467273, 475330, 496849, 515211, 518404, 521159, 517077, 516825, 507508, 518468, 532545, 550750, 566827, 578755, 590463, 599968, 598923, 586023, 560285, 531846, 514027, 491631, 471151, 451620, 455368, 460431, 478926, 483969, 492812, 512618, 549566, 594408, 624659, 653314, 684047, 683798, 666270, 639211, 621262, 596525, 558271, 520839, 511548, 506627, 508116, 513357, 500622, 505133, 525530, 542838, 556518, 572911, 581468, 580233, 567337, 574866, 581458, 608392, 627645, 640539, 649436, 659620, 674587, 696983, 730196, 755999, 764745, 760559, 745890, 716504, 676728, 642468, 611630, 599181, 597196, 577364, 556471, 559913, 567251, 572955, 582900, 585730, 590404, 588644, 566944, 572319, 571908, 583360, 605184, 619320, 636587, 673398, 700469, 708571, 714617, 702734, 691530, 693668]
11520F93668j338j1155j2484M335j3771l330J9529J8658q830l4906m1248k0314
11508E88814j2241j6647j5484j1714J9937K5310J4572P839J4362P353M481L2219
11496F58801L7805L5790J7410j751j9890l3488j8602l307j300j7626q550j0772
11484F34520p284j5168n065j303J282m147J44L270R727K1546J5224L1083K7032
11471G10861J5758M2304N4086M5115M2065L2620K5412P344M331n384j9617l0754
11459I24141k9944m1078m5029k7335r792j024j0485j9363L587J11N50L831j0184
11446G37986j3062j1019K631j7220n536J803J4546J2646L895N792J4880J7363
11434G64705R110K185J108j2427K550J6090J9939K3506K8017j56l958K1886O402
$$ y = [693668, 692330, 681175, 668691, 673026, 659255, 655925, 675454, 694112, 685282, 650376, 609128, 588814, 576573, 559926, 544442, 532728, 552665, 577975, 592547, 600386, 614748, 622101, 626582, 658801, 696606, 732396, 749806, 748055, 728165, 694677, 676075, 672768, 671468, 653842, 645292, 634520, 627236, 612068, 607003, 605700, 606982, 602835, 602979, 606249, 615976, 637522, 652746, 683829, 710861, 726619, 768923, 823009, 868124, 910189, 942809, 968221, 975565, 979896, 974512, 954895, 924141, 894197, 853119, 808090, 780755, 770963, 769939, 759454, 740091, 743678, 743789, 744339, 748170, 737986, 724924, 713905, 716536, 699316, 693780, 695583, 710129, 722775, 726670, 732462, 747342, 764705, 773815, 776000, 777108, 764681, 767231, 783321, 803260, 826766, 854783, 854627, 850669, 872555, 878957]
11421H78957Q599J2208N64L753p846o761P849P368J4739p136O75L7378K2257J0418
11407I83022j896N146K0460J5897P026j2936P141J5077J4063Q430R283J1395J8717
11394A100825J9347K3214K9102J6328m461j0001r72J1420J9583K8964J5695Q623
11382A257667J5061K2034K3922K3990L0504N738l182m496j1174k598K651J0655
11370A370772J8038q935r890O967q12M153O50R785L3032K5622R469J9566K7952
11357A506369L8345M4906N8685P2683O1967N2965J9524n8375o5239k9328o622
11346A695880O696J7242L6231K9176K7063L5324N8877N2791M7050N2242N6996
11335B115568N5384M9004L6358L2285M4262N6067O9781M2746K7155L0214K7712
$$ y = [878957, 887556, 899764, 900328, 904081, 896235, 889474, 897323, 904691, 919430, 912294, 912969, 950347, 972604, 983022, 981126, 986272, 1006732, 1022629, 1029655, 1016719, 1023860, 1038937, 1053000, 1061430, 1070713, 1082108, 1100825, 1120172, 1143386, 1172488, 1188816, 1184355, 1174354, 1173382, 1184802, 1204385, 1233349, 1249044, 1257667, 1272728, 1294762, 1318684, 1342674, 1373178, 1378916, 1375734, 1371238, 1360064, 1357466, 1360117, 1370772, 1388810, 1379875, 1369985, 1376952, 1376140, 1380293, 1380943, 1390728, 1423760, 1449382, 1458851, 1478417, 1506369, 1544714, 1589620, 1648305, 1720988, 1782955, 1835920, 1855444, 1797069, 1731830, 1702502, 1695880, 1702576, 1719818, 1756049, 1785225, 1812288, 1847612, 1906489, 1959280, 2006330, 2058572, 2115568, 2170952, 2219956, 2256314, 2288599, 2332861, 2388928, 2458709, 2501455, 2528610, 2558824, 2586536]
11324B586536P180k1284n2332n4786l7089L615K8622L5674N1738O1658P3313O3271
11312B746116O2442N2083M4308K7386L988O72p747j1266p908q171j3019j0881
11300B878003J7831J7884J8454K0729L0074L6797N7949O1045P5861R2950R4659
11289C402236J03630J19251J21909J33192J34183J12312J04808Q9324J09310J33093
11279D563248J77519K50518L44790M63605O23243Q14959J025022J196624J275985
11270A0735513J149425P95041K43280l63504q81373j145003j136286r29133o32384
11261G835576l68672j80344l0524Q0079J69030K83941M12733N82767P93625J056389
11251A0634600J333027J582947J722381J664404J377823Q82913K41522l66403
$$ y = [2586536, 2593716, 2572432, 2520100, 2465314, 2428225, 2431840, 2460462, 2496136, 2547874, 2609532, 2682845, 2746116, 2808558, 2860641, 2904949, 2932335, 2936323, 2936995, 2929248, 2917982, 2910074, 2901903, 2888884, 2878003, 2895834, 2913718, 2932172, 2952901, 2982975, 3019772, 3077721, 3138766, 3214627, 3307577, 3402236, 3505866, 3625117, 3747026, 3880218, 4014401, 4126713, 4231521, 4320845, 4430155, 4563248, 4740767, 4991285, 5336075, 5799680, 6422923, 7237882, 8262904, 9459528, 10735513, 11884938, 12679979, 12923259, 12559755, 11678382, 10533379, 9397093, 8467960, 7835576, 7466904, 7286560, 7256036, 7336115, 7505145, 7789086, 8201819, 8784586, 9578211, 10634600, 11967627, 13550574, 15272955, 16937359, 18315182, 19198095, 19439617, 19073214]
11243A9073214p67974q45943o41238j95733L24815P30009Q61463N58983q9943
11234A9007653q56635j425152j588356j369093r69768n67343k19139L4614K45938
11225A2292719N01020Q18074J213096J658558K135338K540349K712812K527515
11217B6399481J872495Q47228l58843j407091k056654k165990j754804j021061
11209B0354761j15519Q13161J679887K399528K920641L111775K770955J874266
11201C5809455O33512n21789j359864j967384k277909k252193j874909j195743
11193B4993176l14927O90205J757632K796117L755103M402030M474516L744969
11185D6298821K265113K32815j872192l482873m217947m023933l126592j857813
$$ y = [19073214, 18305240, 17459297, 16818059, 16622326, 16947141, 17677150, 18538613, 19097596, 19007653, 18151018, 16725866, 15137510, 13768417, 12798649, 12231306, 12012167, 12046781, 12292719, 12793739, 13611813, 14824909, 16483467, 18618805, 21159154, 23871966, 26399481, 28271976, 29119204, 28760361, 27353270, 25296616, 23130626, 21375822, 20354761, 20239242, 21052403, 22732290, 25131818, 28052459, 31164234, 33935189, 35809455, 36442967, 35921178, 34561314, 32593930, 30316021, 28063828, 26188919, 24993176, 24678249, 25368454, 27126086, 29922203, 33677306, 38079336, 42553852, 46298821, 48563934, 48796749, 46924557, 43441684, 39223737, 35199804, 32073212, 30215399]
11177C0215399n43360O62901J751796K826266L973089N181785O245026O867828
11169E7180730O715763N597161L712591J668325K22079r3639O93767J953584K689230
11160H0339591K076355j65913l480879o744090q856245r294434q275743o518052
11152C9080590m713695l303907k345049j687271j238887r22289o67177m62346
11144B3739969k83900q3141J40971M05254P03543R95004J304260J682063K189752
11135C0793775K936643M001841N459760P291913R281024J0649051J0518562Q609340
11127H9541909M301452k862808q334703p508430l242243O54172K700966K673884
11119G7924199O07385m284397r949496j1082252q392980n547665l616772k327438
$$ y = [30215399, 29672039, 30334940, 32086736, 34913002, 38886091, 44067876, 50312902, 57180730, 63896493, 69493654, 73206245, 74874570, 75096649, 75003010, 75696777, 77650361, 80339591, 82415946, 82250033, 78769154, 72025064, 63168819, 53874385, 45598642, 39080590, 34366895, 31062988, 28717939, 27030668, 25791781, 24869492, 24202315, 23739969, 23456069, 23372928, 23513899, 23919153, 24622696, 25617700, 26921960, 28604023, 30793775, 33730418, 37732259, 43192019, 50483932, 59764956, 70414007, 80932569, 89541909, 93843361, 90980553, 82645850, 75137420, 71895177, 72549349, 75250315, 77924199, 78531584, 74247187, 64297691, 53215439, 44822459, 39274794, 35658022, 33330584]
11111C3330584j321575m69718L51381J266217K403983L816540N284262O136661
11103E0798335N778643M067710j15832o694844j0180660q173701m890005k668748
11095B7920898j355198m83748K26033R33204J713330K591039L280495L405513
11087C8231566K752499J124572j834270m656552n008868l686355k304443j336159
11079B3281990o77341k05421K28239P77453J587844K520503L306230L442994K836043
11070C7098534J143275k458092n680414n562689l698806k225226j338182p88271
11062A6490129m66604k64357r0621R4579K86681N35521Q41551J159514J428902
11053B0015295J521822J380630R18968k8203j197371j721046j255719l79714N23878
$$ y = [33330584, 32009009, 31539291, 31890672, 33156889, 35560872, 39377412, 44661674, 50798335, 56576978, 60644688, 60528856, 53834012, 43653352, 35479651, 30589646, 27920898, 26565700, 26081952, 26307985, 27241189, 28954519, 31545558, 34826053, 38231566, 40984065, 42108637, 40274367, 35617815, 30608947, 26922592, 24618149, 23281990, 22604649, 22399228, 22627467, 23404920, 24992764, 27513267, 30819497, 34262491, 37098534, 38241809, 35783717, 30103303, 24540614, 20841808, 18616582, 17278400, 16490129, 16023525, 15759168, 15668547, 15763126, 16049807, 16585328, 17426879, 18586393, 20015295, 21537117, 22917747, 23836715, 23808512, 22611141, 20890095, 19634376, 19254662, 19778540]
11044A9778540J296029J752119J720462J174473j50568k281310l502858l017543
11036A6769344k042666j308455q74818o41648m84404l45749k33790j32435m7415
11027A0657964K5499J20236K36336M13471O62665R40740J188371J287046J090518
11018A6622846N87540m99002j992839k456429j880418j226689q12977n62423m08688
11009G370921l12397k44326k11663j92516j77618j87606j88769j72263j47546
11000E536217j23076j06514o9205n6648p0440r9118j48877j58953j15263p5468
10990D512655n8517n2008n3150m6293n0446m2867l3987j2886J3660M166k1793
10979D158534n0369r0256j32292j46250j44918j19934r7022q2017q3551p3205
$$ y = [19778540, 21074569, 22826688, 24547150, 25721623, 25571055, 23289745, 19786887, 16769344, 14726678, 13418223, 12543405, 11901757, 11417353, 11071604, 10837814, 10705379, 10657964, 10683463, 10803699, 11040035, 11453506, 12116171, 13056911, 14245282, 15532328, 16622846, 17210386, 16711384, 14718545, 12262116, 10381698, 9155009, 8342032, 7779609, 7370921, 7058524, 6814198, 6602535, 6410019, 6232401, 6044795, 5856026, 5683763, 5536217, 5413141, 5306627, 5237422, 5180774, 5110334, 5011216, 4862339, 4703386, 4588123, 4512655, 4454138, 4402130, 4348980, 4302687, 4252241, 4209374, 4175387, 4162501, 4176161, 4180327, 4158534, 4108165, 4017909, 3885617, 3739367, 3594449, 3474515, 3377493, 3295476, 3211925, 3138720]
10969C138720o1433p0277n8290n8693l7200l2201m2117k3361k3834j9386k8258
10958B683670l0466o205J1366k867J914J2276o816l5223p0172p3735m0649k2124
10946B420969k7464j1977m349j7643l2419m0831l7890l8270l4058l1704j9306
10935B125058l6526n7492n5366n7330l4508m4963l4394k9277j0730k1587j6132
10924A726753r721K759o327n115r287R686J4740P819L589k2478l8497j8151p530
10911A648240Q761k920r356L678R508M313J0006L2373M9651N9552N9783M3947
10899A917536q09l9198n9057k9955j9934k0013J111N202r224q300k214l303j5349
10886A716493j4119j1850j5660q280k9525k7475k9991m5137l5890n376J1246K3041
$$ y = [3138720, 3077287, 3007010, 2948720, 2890027, 2852827, 2820626, 2778509, 2755148, 2731314, 2711928, 2683670, 2653204, 2646999, 2658365, 2655498, 2657412, 2669688, 2662872, 2627649, 2557477, 2483742, 2443093, 2420969, 2393505, 2381528, 2377179, 2359536, 2327117, 2286286, 2248396, 2210126, 2176068, 2144364, 2125058, 2088532, 2031040, 1975674, 1918344, 1883836, 1838873, 1804479, 1775202, 1764472, 1742885, 1726753, 1717032, 1719791, 1713464, 1708349, 1699062, 1708748, 1723488, 1731307, 1734896, 1712418, 1673921, 1655770, 1648240, 1657001, 1654081, 1644725, 1648403, 1657911, 1662224, 1672230, 1704603, 1754254, 1813806, 1873589, 1917536, 1916727, 1877529, 1818472, 1788517, 1768583, 1748570, 1749681, 1754883, 1745659, 1737359, 1735145, 1731842, 1716493, 1702374, 1690524, 1674864, 1666584, 1637059, 1609584, 1579593, 1534456, 1498566, 1493190, 1504436, 1527477]
10874A527477J4484M881lj1300k9972k3972Q052K2255K2468L4588Q778J0265L2086
10861A620087L2443P0302R6616Q3271O9809O4668P6647M9868O2666O9372O3767
10850B359516P5780Q9510P4462N0508M2489L7859K1222J6026J1564k02k776k7237
10838B748721p1217j23335j22679j04373j06267j00576q5902m5923k7823j3990
10828A946636j4168J3978K8607L5890K1264r144k1140k0546l750j143K1032L2673
10816B030189K8357M9941P5827R4710J10517J14871J27164J19552J30060J28879
10806C010067J41886J28034J40213J13960M7570q746l8880l5532l2746j8872j1945
10795C435009P470J4865m694n5351n3663l8893j0812q886O867O3732J06050J54927
$$ y = [1527477, 1541961, 1546842, 1546839, 1535539, 1505567, 1481595, 1489647, 1511902, 1534370, 1568958, 1577736, 1588001, 1620087, 1652530, 1722832, 1819448, 1902719, 1972528, 2037196, 2113843, 2163711, 2226377, 2295749, 2359516, 2435296, 2524806, 2599268, 2649776, 2692265, 2730124, 2751346, 2767372, 2778936, 2778734, 2775958, 2748721, 2677504, 2554169, 2431490, 2327117, 2220850, 2120274, 2034372, 1988449, 1960626, 1946636, 1932468, 1946446, 1975053, 2010943, 2032207, 2023063, 2001923, 1981377, 1977627, 1976484, 1997516, 2030189, 2058546, 2108487, 2184314, 2279024, 2389541, 2504412, 2631576, 2751128, 2881188, 3010067, 3151953, 3279987, 3420200, 3534160, 3581730, 3572984, 3534104, 3498572, 3465826, 3446954, 3435009, 3442479, 3457344, 3452650, 3397299, 3343636, 3304743, 3293931, 3285045, 3291912, 3355644, 3461694, 3616621]
10783C616621J92363K59039L16002L03192K82149K34591J23152P0497J83949K92451
10773E874006L86428M64563N30693N95378P06508Q00710R13908J091575J381204
10764A2744973J797947K343812L113703M248322N719093P298776Q378551Q222266
10756E3867443O395678K229317m056334r304293j0545705q473650n768003l749778
10748B0594675k457827j652340j161600q59301o50678n13133m27753l54087k87836
10739A2230120k24223j11834O2552K16822L18227L84647M21545M06120M20479
10730A4124455O21262Q74863J117114J331674J550156J769974K005884K247490
10722B5642872K548944K975752L717635M806018O297087Q367534J1341032J5482435
$$ y = [3616621, 3808984, 4068023, 4384025, 4687217, 4969366, 5203957, 5327109, 5397606, 5581555, 5874006, 6260434, 6724997, 7255690, 7851068, 8557576, 9358286, 10272194, 11363769, 12744973, 14542920, 16886732, 20000435, 24248757, 29967850, 37266626, 45645177, 53867443, 60263121, 62492438, 58436104, 49131811, 38586106, 30112456, 24344453, 20594675, 18136848, 16484508, 15322908, 14463607, 13812929, 13299796, 12872043, 12517956, 12230120, 12005897, 11894063, 11956615, 12173437, 12491664, 12876311, 13297856, 13703976, 14124455, 14745717, 15620580, 16737694, 18069368, 19619524, 21389498, 23395382, 25642872, 28191816, 31167568, 34885203, 39691221, 45988308, 54355842, 65696874, 81179309]
10714H1179309K0513942K5221311K7094806K3610402J4347233j816312k5110766
10707A65039925l9125580l3143565k1648904j3495394q638570n764933m041427
10700C9181552k972272k293605j894860j718467j620071j544905j511480j392180
10692B4233712j112594p72199m67676k43241q1777P1865K13487L95216O24494
10683B2861287Q69664J113381J361084J609318J863132K120744K392123K762517
10675C6953250L404552M388479N766926P699890J0438376J4319097J9292772K4479245
10667A26742587K7691207K5969832J8321830M251214j8523311l8617627l7854870
10660A07980862k6135566j6324073j0345546o874471m781850l496977k723985
$$ y = [81179309, 101693251, 126914562, 154009368, 177619770, 191967003, 190150691, 165039925, 125914345, 92770780, 71121876, 57626482, 48987912, 43222979, 39181552, 36209280, 33915675, 32020815, 30302348, 28682277, 27137372, 25625892, 24233712, 23121118, 22348919, 21881243, 21638002, 21556225, 21628090, 21841577, 22236793, 22861287, 23730951, 24844332, 26205416, 27814734, 29677866, 31798610, 34190733, 36953250, 40357802, 44746281, 50513207, 58213097, 68651473, 82970570, 102263342, 126742587, 154433794, 180403626, 198725456, 202976670, 184453359, 145835732, 107980862, 81845296, 65521223, 55175677, 48301206, 43519356, 40022379, 37298394]
10653C7298394k249421k028517j934484j882819j838437j768093j547971j248937
10645B2799715r62503p33034n87521m75094l78943k60833j49639l7127J06938
10636A9321959K27684L27010M31627N55061O60349P86441R74098J271773J696721
10627B6252723K285261L136080M351944N963289P701170Q849646Q605687O489443
10619G3635243J759457n331352j1055007j2103563r589732o531736m297480k895725
10611B3590105k029890j499994j176889r86589q90405q30848p84356p78637p66005
10602A3846492o89665n67368m62514l93776l28098k71452k47157j90635j80576
10593A0515251j50429j37521j28946j55077j62091j46576j24650j21699j30623
$$ y = [37298394, 35048973, 33020456, 31085972, 29203153, 27364716, 25596623, 24048652, 22799715, 21837212, 21104178, 20516657, 20041563, 19662620, 19401787, 19252148, 19215021, 19321959, 19549643, 19876653, 20308280, 20863341, 21523690, 22310131, 23284229, 24556002, 26252723, 28537984, 31674064, 36026008, 41989297, 49690467, 58540113, 67145800, 73635243, 75394700, 70063348, 59008341, 46904778, 37315046, 30783310, 26485830, 23590105, 21560215, 20060221, 18883332, 17896743, 17006338, 16175490, 15391134, 14612497, 13846492, 13156827, 12589459, 12126945, 11733169, 11405071, 11133619, 10886462, 10695827, 10515251, 10364822, 10227301, 10098355, 9943278, 9781187, 9634611, 9509961, 9388262, 9257639]
10584I257639j44439j61911j80252k21492k53307k50268k44075k30331k24161
10575G347403k20115j87752j81431j81943j64900j59233j53848j42241j37660
10566E818280j37713j39151j21100j00229p6008p5534o8966n3938n5974o0173
10556D929494m5206j9685n741o228l5099k9577j8018l9103m1315m1514m5143o2687
10544D540178q5327r3141j09872j08469j00844j05519r1889r2382q8735r3505
10534C570495j16156j35626j17770j01702j00259r5241p2955n8643n4740o9569
10524B647834p5145o8959o3878o7520p2581p5035n1301k4673p314j0385j4802
10513B116241k2621l0686l4779m403J383K030q512j0425k4602m0811n0080n2824
$$ y = [9257639, 9113200, 8951289, 8771037, 8549545, 8296238, 8045970, 7801895, 7571564, 7347403, 7127288, 6939536, 6758105, 6576162, 6411262, 6252029, 6098181, 5955940, 5818280, 5680567, 5541416, 5420316, 5320087, 5244079, 5168545, 5099579, 5045641, 4989667, 4929494, 4884288, 4864603, 4858862, 4852634, 4817535, 4787958, 4769940, 4730837, 4689522, 4648008, 4602865, 4540178, 4454851, 4361710, 4251838, 4143369, 4042525, 3937006, 3845117, 3752735, 3664000, 3570495, 3454339, 3318713, 3200943, 3099241, 2998982, 2903741, 2830786, 2772143, 2717403, 2647834, 2572689, 2503730, 2439852, 2372332, 2299751, 2224716, 2173415, 2148742, 2141428, 2131043, 2116241, 2093620, 2062934, 2028155, 2023752, 2025135, 2027165, 2018653, 2008228, 1983626, 1942815, 1892735, 1839911]
10501A839911n4166k9944j3259j4498j7047j0312K812J7187K2295l974k3460m0928
10489A674617m7761o6486p0399o4008o2159l3095l2227j7444j4966k1657l7847
10478A206568l2707k4440k0503j7430k9995j9598m394Q677J812K263m743l716
10466A061794j1621k0137j7775m799j3201K95j052n751j536L2K206O764K58Q270
10452A003747Q408m757J3026K0564L6049L5243M1598N4767N0828M5544L8304L2315
10440A375636K1486J2326n353j2425k1128l4530o1018p3588o4506m1129k7560
10429A068211l0038j8276k8215j7372m08q598j4765m995J0443P145P331J234j1693
10416I60004j131o324q382j5248k4099k0187l2257l0931k0276k2910r066j9164
$$ y = [1839911, 1785745, 1755801, 1742542, 1728044, 1710997, 1700685, 1703497, 1720684, 1742979, 1739005, 1715545, 1674617, 1626856, 1560370, 1489971, 1425963, 1363804, 1330709, 1298482, 1281038, 1266072, 1244415, 1206568, 1173861, 1149421, 1128918, 1111488, 1081493, 1061895, 1057501, 1066178, 1067990, 1070253, 1065510, 1061794, 1050173, 1030036, 1012261, 1007462, 994261, 994556, 993504, 987753, 986217, 986249, 988455, 995219, 995477, 1003747, 1012155, 1007398, 1020424, 1040988, 1077037, 1112280, 1153878, 1208645, 1259473, 1305017, 1343321, 1375636, 1397122, 1409448, 1404095, 1391670, 1370542, 1336012, 1274994, 1201406, 1136900, 1095771, 1068211, 1038173, 1019897, 991682, 974310, 973902, 965304, 950539, 945544, 955987, 963132, 970463, 971697, 960004, 958873, 952549, 944167, 928919, 904820, 884633, 852376, 821445, 801169, 778259, 769193, 750029]
10404G50029j7452j298J1063K1279L5309L0843J1759r661o045N817j679K802K0720
10391H53486J8156J9921L5603J6754J8427m105l0647l6184m5584m5557l0482k0087
10379G49701j8834k6207j526j5096j7913j3616K9K323J0221l391N206J1343M31
10366F82671o647k694P885J2407J409q356k026r863p85r342n281N998Q548j6299
10352F57625k6119k0877r194k0404m333k33m839j263k2088j466M644J0754P180
10339E69387K5317J7741L3620M9326K9342j004j5712k3140m5134m2022l8034l1035
10327E28652k4695r59M12p910p247j0954k933o756j795r489J512R476J7245K3680
10313E08239J7847K3495K5051K140O583J9200J2379r326j3646j4612j4881K857
$$ y = [750029, 732577, 731279, 742342, 763621, 798930, 829773, 841532, 831871, 825826, 831643, 829964, 832766, 853486, 871642, 891563, 927166, 943920, 962347, 958242, 927595, 891411, 845827, 800270, 769788, 749701, 730867, 704660, 703134, 688038, 670125, 656509, 656538, 658861, 669082, 665691, 670897, 682240, 682671, 676024, 673330, 681215, 693622, 695031, 686675, 684649, 674786, 674001, 664659, 659378, 665376, 673924, 657625, 631506, 610629, 601435, 581031, 576698, 576465, 571626, 570363, 548275, 546809, 551453, 562207, 569387, 594704, 612445, 646065, 695391, 724733, 723729, 708017, 684877, 639743, 597721, 559687, 528652, 503957, 502998, 503410, 495500, 488253, 477299, 474366, 467610, 465815, 456326, 457838, 467314, 484559, 508239, 526086, 549581, 574632, 576772, 583355, 602555, 614934, 605608, 591962, 577350, 562469, 565326]
10301E65326N439R270J7161K5431K6968L7824L1559N1606J01579J18543J30176
10290A120882J30465P5090L1011o3685j41036j77288j51463j08031o8785l2128
10280F15032k6413k2526j5726j2277j2906p417q480j0762o771n562o292k4628
10268D55272j2694J968L554R862k064j4202K1888J1994j0475L140R729P884P351
10255D93207J1108K4987K2153J5207L5943M2358O1134Q6247J07785J21524J29512
10244A151165J19777O1681l5346j48358j90032j63720j13322o6784n8629m7218
10234E09214j8642r221q959j6117k0973j6052q612k811j0678j949l295k294l831
10221C85780o946M464J626j1296j1089N015J2107J485O758K3796K6258K7458L4823
$$ y = [565326, 570765, 580035, 597196, 622627, 649595, 687419, 718978, 770584, 872163, 990706, 1120882, 1251347, 1326437, 1357448, 1293763, 1152727, 975439, 823976, 715945, 647160, 615032, 588619, 566093, 550367, 538090, 525184, 517767, 509287, 498525, 491754, 486192, 479900, 455272, 442578, 444546, 448100, 457962, 455898, 441696, 463584, 475578, 465103, 468243, 477972, 485856, 493207, 504315, 529302, 551455, 566662, 602605, 644963, 706097, 792344, 900129, 1021653, 1151165, 1270942, 1332623, 1297277, 1148919, 958887, 795167, 681845, 615061, 556432, 509214, 490572, 481351, 472392, 456275, 435302, 419250, 410638, 407827, 397149, 395200, 391905, 389611, 385780, 378834, 383298, 384924, 373628, 362539, 367554, 379661, 381146, 387904, 411700, 437958, 465416, 500239]
10208E00239N4703P3478Q2026P9052N9627K0272m1892o7381m3446j2199j9194
10197F85285l6239m4623m7111p4742o9618l7116l3812k0750K596q142N186P955
10185C28869k327k3488j5890q821m757m079j0098j1435r896O64N195J313O684
10172B51934K52l967l218n770N472m418j4123K44J2082L194k1785j0510P315N453
10158B22155R670J1089l224j757L614j23O59L850m133k1010j0195J2845L118j2162
10144B14396j0796n005L689m619N266P895o403m022N091K192q360k109P778N612
10130B10605n924K389J0561l517k0884j4561m618k974m655Q174M223K644m30o06
10116A80427O755M87p82j5393p938K836P438n36m447p766M292J6026M039M517
$$ y = [500239, 554942, 628420, 710446, 789498, 849125, 869397, 827505, 760124, 716678, 704479, 685285, 649046, 604423, 557312, 482570, 412952, 375836, 342024, 321274, 323870, 315728, 320914, 328869, 326542, 303054, 287164, 278343, 273586, 269507, 259409, 247974, 238078, 238742, 243937, 245250, 251934, 252186, 248219, 245001, 239231, 244703, 240285, 226162, 226406, 238488, 241682, 219897, 209387, 216702, 222155, 231825, 242914, 239690, 237933, 241547, 241424, 242083, 245933, 241800, 220790, 210595, 223440, 226558, 214396, 203600, 198595, 202284, 197665, 202931, 210826, 204423, 200401, 205492, 207684, 199324, 197215, 204993, 210605, 204681, 207070, 217631, 214114, 193230, 178669, 174051, 171077, 166422, 174596, 178819, 181463, 181033, 180427, 187182, 187669, 186887, 171494, 163556, 166392, 173830, 173294, 168847, 161081, 165373, 181399, 185438, 189955]
10102A89955N730p605p882n748J0492Q361M001j0936j469Q656N774j888k070j1626
10088A83745n264L038l96k631N15n540M452j5252k699J1357J5187J0314k511k0159
10074A74156j5828R0Q65q965R219K615M63P608j2215o037k759J670p932j2296
10060A30654j2239k138N356Q64j2599l941P072Q323N380J3815J2589o795J0414
10047A56755J3931n462o024p323M051j461J369j4484L470L239n123k152O36O013
10033A47435J578L764q012P861J2723J3891m828r705q625j6000L704r95J5028
10020A57819R153Q022N29l670j9765p603J8924O726j0446M748L733R929Q470j2668
10006A73901n242K2656L0628K3421M292J1065J2705P440J9824K4417L4712K0402
$$ y = [189955, 195685, 188080, 180198, 174450, 184942, 193303, 197304, 186368, 184899, 193555, 199329, 197441, 195371, 183745, 178481, 181519, 181123, 178492, 179007, 173467, 177919, 162667, 159968, 171325, 186512, 196826, 194315, 174156, 158328, 158418, 159283, 150318, 159537, 162152, 162615, 170223, 158008, 151971, 149212, 150882, 142950, 130654, 118415, 116277, 121633, 122497, 109898, 105957, 113029, 121352, 126732, 140547, 153136, 146341, 156755, 170686, 165224, 159200, 151877, 155928, 154467, 155836, 141352, 144822, 148061, 142938, 140786, 141422, 147435, 149013, 152777, 144765, 152626, 165349, 179240, 174412, 164707, 156082, 140082, 143786, 142791, 157819, 166972, 174994, 175523, 171853, 152088, 144485, 163409, 170135, 159689, 164437, 168170, 178099, 186569, 173901, 168659, 191315, 221943, 245364, 249656, 260721, 273426, 280866, 300690, 325107, 359819, 380221]
9994C80221K4047N8647M1674P0549J11334J75749K47967L70743N10896M75438
9984B467265L75288L41119m09960j061588n89024k73906j49841r0524n2601m5137
9974E11091l9239k8867k8379k1676k5714r923j6359j7318j4385M59l890o458m718
9961B94624n867M042M302n333j4530L347J734n740m179r806j0475j872m585O140
9947B51802r54o75q413q606j084R491R108l797qQ6m363k43K849L899k447l627
9931B43018p71p161o122n378o512k5771q667J01k275K651J3012J1488N393m29
9917B12577k012O063k782J3086J4618J0200K9585L3094J1826P06o667k5455j6866
9904B77973m836p194k3848j3851q753j6153j7088J06K157Q594Q468K168P437j831
$$ y = [380221, 404268, 462915, 504589, 575138, 686472, 862221, 1110188, 1480931, 1991827, 2467265, 2842553, 3183672, 2773712, 1712124, 1123100, 849194, 699353, 608829, 556228, 511091, 471852, 442985, 414606, 392930, 367216, 357293, 340934, 323616, 309231, 309690, 305800, 299342, 294624, 288757, 292799, 297101, 291768, 277238, 280585, 282319, 276579, 272400, 262594, 252119, 250247, 245662, 251802, 250848, 250173, 241760, 233154, 232070, 241561, 250669, 246872, 246864, 246950, 242587, 242344, 245193, 249092, 246645, 243018, 242247, 235086, 228964, 223586, 217074, 191303, 182636, 182737, 180462, 183113, 196125, 207613, 213006, 212577, 210565, 216628, 213846, 226932, 241550, 251750, 281335, 314429, 326255, 326961, 320294, 294839, 277973, 273137, 265943, 242095, 228244, 219491, 203338, 186250, 186356, 188513, 197107, 205575, 207743, 215180, 213349]
9890B13349o427L534R663j203Q181L4720L1332J5809R275L273j0830k4577k0386
9877B65713j0649j0216q482M845J0479P606Q222K0372K7399K6594J7806J4008
9865C73697K8027N319J3039K1068J8201K8234N0220J9852k0036m2816m9408k0229
9853D25168o188J6032L1040L9950P5268R3274P1790J9061k8037q0930q6848n8773
9841E10807l2643j3713k6683k3606l9039l4659k9223l4732j4673q246n356j4970
9829B33264l494K381o034j5147l57j3596j7831p991R850l724q439p946Q402Q500
9815A77838M157j2811r450j0923j3942P382J7269J0126R025n212r325p135l245
9802A53754K184j704m736j1469j421P569L109l930N733J8586K153j3551o03j4721
$$ y = [213349, 206922, 210456, 220119, 218916, 227097, 261817, 293149, 308958, 318233, 321506, 310676, 286099, 265713, 255064, 244848, 236366, 241211, 251690, 259296, 267518, 287890, 315289, 341883, 359689, 373697, 401724, 407043, 420082, 441150, 459351, 487585, 537805, 557657, 537621, 494805, 445397, 425168, 418980, 435012, 466052, 506002, 581270, 674544, 746334, 765395, 737358, 656428, 569580, 510807, 478164, 464451, 437768, 414162, 375123, 340464, 311241, 276509, 261836, 253590, 248234, 233264, 229770, 232151, 226117, 210970, 210613, 197017, 179186, 171195, 181045, 177321, 168882, 160936, 169338, 177838, 181995, 169184, 159734, 148811, 134869, 142251, 159520, 169646, 178671, 173459, 164134, 156999, 153754, 155938, 154234, 149498, 138029, 136608, 144177, 147286, 143356, 149089, 167675, 169828, 156277, 155674, 140953]
9788A40953j6419M522P29J548Q473J6912J0019O324j868j5083j0164P144Q589
9775A61679P888m372k1318L695J1275j250N889R563L287j3981n749J0962K548
9762A70116l550J462j248Q986J5126j781P979J8797L3409K9275L4634K7745L0690
9749C71640M1950R859j8242m3776k2216J491K4407M5453L3924P4199J21002J55679
9737G95370K30703K99091K94659K30066J48187k26321n76656l81349k08538j15731
9727D89481p8355m8821k5881k3843j9926j5884k1707j8583j2139j315j0321l0562
9715A82144q980l070J1401k39j0804l486j9002p393m114J188j772L939m71l586
9701A35755j1727m39J0454n301m652L466R560O014l218K26l325l798o015N491
$$ y = [140953, 124534, 129056, 129785, 131333, 139806, 156718, 166737, 173061, 171193, 156110, 145946, 153090, 161679, 169567, 165195, 143877, 147572, 158847, 157597, 163486, 173049, 176336, 162355, 156606, 167568, 170116, 166566, 168028, 166780, 175766, 190892, 189111, 197090, 215887, 249296, 278571, 313205, 340950, 371640, 413590, 423449, 405207, 361431, 339215, 340706, 365113, 410566, 444490, 518689, 639691, 795370, 1026073, 1325164, 1619823, 1849889, 1998076, 1771755, 1195099, 813750, 605212, 489481, 411126, 362305, 336424, 312581, 292655, 276771, 255064, 236481, 224342, 223027, 212706, 182144, 173164, 170094, 181495, 181256, 170452, 166966, 147964, 140571, 136457, 137645, 135873, 139812, 139341, 135755, 124028, 123589, 134043, 128742, 124090, 127556, 137116, 143130, 139912, 140138, 136813, 133015, 127000, 132491]
9687A32491R092l573p666o708R59J731K33l623O572M423j5492J7869Q094N224
9673A49626O140J7679J5107J3185L6245O0112N7209N2723M6883K7569J9744j565
9661E00657j5543k2128m1410k8723k0454j6976J1548L3114K6591K6427o820k6698
9649D19585n4179o2203n4119n3731l3428P009k931k2004q908J0492m936l289M519
9636A41877K21p919R868j669j2396j8344m423l103m066L37K707k740K683M497
9622A07530q858M505Q192l141j1964M949J2386n071n553j2076r557M285p648m446
9608G3533j472N814R026J2615k623L990M540Q32m075q411q983l24P13r995K18
9593G5398r815N6R066q424N276R227o25m923j6295m016K1659j749M944j933O73
$$ y = [132491, 141583, 138010, 130344, 123636, 124595, 126326, 126559, 122936, 129508, 133931, 118439, 136308, 144402, 149626, 155766, 173445, 188552, 201737, 237982, 298094, 355303, 408026, 454909, 482478, 502222, 500657, 485114, 462986, 421576, 392853, 372399, 355423, 366971, 400085, 426676, 453103, 446283, 419585, 365406, 303203, 249084, 195353, 161925, 168934, 166003, 143999, 135091, 145583, 140647, 137358, 141877, 142098, 134179, 144047, 142378, 129982, 111638, 107215, 104112, 100046, 100383, 103090, 100350, 103033, 107530, 98672, 103177, 111369, 108228, 96264, 101213, 113599, 108528, 102975, 90899, 81342, 85627, 77979, 73533, 72061, 77875, 86901, 99516, 96893, 100883, 105423, 106255, 102180, 93769, 84786, 84462, 85175, 75180, 75398, 65583, 65639, 74705, 66281, 71557, 80784, 80159, 75236, 58941, 54925, 76584, 74835, 79779, 77846, 78519]
9578G8519k04J367R822n393j912k412j175j8103r954J2838J0556j2087j1194l785
9564D6883J5960Q760J50j6771P769M72l279J2360R337l426J072R241J061R512
9550I9101k898p804j57j2395j3121l527J3079n29l709j902R262R212j0694p220
9536F6698l772j5434P397J2812J8325L7344K3011J9685K3478O794k1034m7060
9524A28244k3546q634j1823j1479L6J3728k624k0981J2263K1137L130l442k854
9511I3155r382j2386P40N352K327o033J0676N247j1549j975J4731j662j422J4532
9497A02351J6199J5967K5394J5920J9033l636m6645l5973j5472o465k324r442
9485G4907k682J7329K2154J6790K3193k630l4281l0665o064L353O540o431j0728
$$ y = [78519, 78315, 79682, 89504, 84111, 82199, 79787, 78612, 60509, 50555, 63393, 73949, 61862, 50668, 46883, 62843, 71603, 71753, 54982, 62751, 63223, 59944, 72304, 81641, 78215, 79287, 88528, 89589, 99101, 96203, 88399, 88242, 75847, 62726, 59199, 72278, 71749, 68040, 66138, 75400, 84612, 73918, 66698, 62926, 47492, 54889, 67701, 86026, 123370, 146381, 166066, 189544, 196338, 175304, 128244, 104698, 96064, 84241, 72762, 72798, 86526, 83902, 62921, 75184, 96321, 99451, 96009, 93155, 83773, 71387, 72127, 77479, 79806, 73773, 84449, 89696, 78147, 76172, 90903, 89241, 87819, 102351, 118550, 134517, 159911, 175831, 194864, 191228, 144583, 108610, 93138, 86673, 84349, 74907, 72225, 89554, 111708, 128498, 151691, 149061, 114780, 84115, 78051, 81404, 87944, 81513, 70785]
9472G0785J006K000K188q958o597Q262k029n367j4206j1703L797j04N395J3181
9458E7650M588L156R402J2860j0565j2737o670L778R463J3157Q350J1330J5523
9445A19285J4925K662k0310k4170l160n130j1704l905n9j2791j1696j0684J0500
9432D3763J1334J1139O662J0713o052j1102J3973l269n959k223r343j739M181
9419F2078l98j3842n172L006j3903n919P004J4660m967k0559O410J1055L567K37
9405D3257M23K63K177l680P81N414j3428K656J0686O717Q827J0357j1746j4323
9391D8381j4838K177R277q160J044O364P792r250J960J323o330J3938J924j7284
9377C8318j1005k166m597J6053p68m088n687J5733J2008j2613m73k597m911r384
$$ y = [70785, 71791, 73791, 75979, 67021, 60424, 68686, 66657, 61290, 47084, 35381, 39178, 39074, 44469, 57650, 62238, 65394, 74796, 87656, 77091, 64354, 57684, 61462, 70925, 84082, 92432, 103762, 119285, 134210, 136872, 116562, 92392, 89232, 84102, 72398, 68493, 68434, 55643, 43947, 33263, 43763, 55097, 66236, 72898, 83611, 77559, 66457, 80430, 77161, 71202, 68979, 59636, 57897, 62078, 61680, 47838, 42666, 45672, 31769, 25850, 32854, 47514, 42547, 21988, 28398, 39453, 43020, 43257, 43680, 43943, 46120, 42440, 43221, 48635, 35207, 37863, 48549, 55266, 64093, 74450, 62704, 48381, 33543, 35720, 44997, 36837, 37881, 44245, 52037, 42787, 44747, 46070, 39740, 53678, 55602, 38318, 27313, 25147, 20550, 36603, 35835, 31747, 26060, 41793, 53801, 41188, 40715, 38118, 33207, 23823]
9363B3823J2993l844M538P726r390m191L412M96l250n502K59l438k021Q861O889
9348C7361r51p189m145q254N829Q839k62O47N509m835k866J043K648l635J371
9333C1110K82P43J0468N86R38R176q39k786J199q528O264r867p482M181M851l126
9317C7170J870J758L084R267R881p801j4413j1901J682J500L88o099o463J3619
9303C3542L547M022m192N71L071M153L303o327m165J3174J1543j5448J225J1840
9289E9859P85R97j719R12J3600O912l033j0371L602j7125j6745P15J2253L52j2374
9274C8620o088J4983l304L930N48n416L122m941j4218N587R144R750j0310n62
9260D0845L187Q06q377q682P234J1562l099J0758Q191n386N091n50q616k39J368
$$ y = [23823, 36816, 32972, 37510, 45236, 35846, 31655, 35067, 35563, 32313, 26811, 27070, 23632, 21611, 30472, 37361, 36410, 29221, 25076, 16822, 22651, 31490, 31228, 31875, 37384, 32549, 29683, 30726, 33374, 29739, 31110, 31392, 32135, 42603, 43189, 44127, 53303, 52464, 49678, 50877, 42349, 48613, 38746, 31264, 35445, 40296, 37170, 39040, 40798, 43882, 53149, 63030, 55229, 40816, 28915, 30597, 32097, 32485, 26386, 19923, 33542, 37089, 41111, 36919, 37490, 40561, 44714, 48017, 41690, 37525, 50699, 62242, 46794, 48019, 59859, 60644, 61641, 59922, 60834, 74434, 81346, 78313, 67942, 71544, 54419, 37674, 38389, 50642, 50994, 38620, 32532, 47515, 44211, 48141, 48689, 43273, 46395, 41454, 27236, 32823, 41967, 51717, 41407, 40845, 44032, 44838, 36461, 27779, 35013, 46575, 43476, 54234, 62425, 57039, 62130, 61580, 52964, 52725, 54093]
9245E4093J591Q774l2j4m125j3058m545o230J067M564J784Q700J2j1269q981o950
9229B5381n77j557j913K230l079p202p47J1937L738m679m537k379L11N054J4728
9214C6709J2638Q306M20j2028r636K421Q796j267N081r180n829P501m523Q18q874
9199C1353m950L059o735o157Q407J4603J6176N585j1011q376L798q313n275P688
9185C9852rp333J450l807R334P614m448j8103L845N293m79J107P71M20j368j736
9169C2403n470l233N132P726o542j7475K363P072J7026J5013l707j1761R4N458
9155D4099J3074Q0l646o696l852n792m126K947O846P502j997j133j651n459q421
9140C1775R275P032O87O541j1597n083m144p900O513l015j633J2002O350l43j667
$$ y = [54093, 55684, 64458, 64426, 64412, 60287, 47229, 42684, 36454, 37521, 42085, 43869, 52569, 52581, 41312, 32331, 25381, 24804, 23247, 21334, 23564, 20485, 13283, 12536, 24473, 28211, 23532, 18995, 16616, 16927, 21981, 36709, 49347, 57653, 58073, 46045, 36409, 38830, 47626, 46359, 51440, 42260, 36431, 43932, 39409, 40227, 31353, 26403, 29462, 22727, 16570, 24977, 39580, 55756, 61341, 50330, 41954, 45752, 37439, 32164, 39852, 39843, 32510, 33960, 30153, 39487, 47101, 42653, 24550, 28395, 33688, 33209, 34316, 35087, 35507, 34139, 32403, 26933, 23700, 28832, 36558, 30016, 12541, 14904, 21976, 39002, 54015, 50308, 38547, 38641, 44099, 57173, 57253, 53607, 46911, 43059, 37267, 33141, 36088, 42934, 50436, 48439, 47306, 45655, 40196, 31775, 41050, 48082, 48769, 55310, 43713, 38630, 34486, 26586, 33099, 30084, 28451, 40453, 46803, 46460, 44793]
9125D4793J4247J475m848M120J3772n853j0478r342k748n58j0772j3133J1995
9112C2670R987N788o290J632L456K982N85L820P14j004j4912L156J3566l556m12
9097E2182J0079n221m860j5301Q45j206j0920M910K225Q007J3577Q824j1594j0818
9083D0729M405J907J484j4765R682J0409j0717K664K577p671n453M090L83M943
9069D4667P190j183l972K570k083j1488j0307L067N286R193N369L373J643r71
9055E2354O505J37K58O015J1897k505O30j8121k0722m417J0474Q162O795m153
9041E3309n431m220N95J1693L589O91m835M64o711j0222k395Q744P447k80l673
9026D8765M601J6238j2908O107M945j1138j262J114M853o580l494l283m721M104
$$ y = [44793, 59040, 60515, 55667, 59787, 73559, 67706, 57228, 47886, 45138, 44580, 33808, 20675, 32670, 42657, 48445, 42155, 43787, 47243, 50225, 50810, 54630, 55344, 54340, 39428, 42584, 56150, 52594, 52182, 62261, 57040, 52180, 36879, 37724, 36518, 25598, 30508, 32733, 40740, 54317, 63141, 51547, 40729, 45134, 47041, 48525, 33760, 43442, 53851, 43134, 45798, 48375, 40704, 35251, 39341, 39724, 44667, 51857, 50674, 46702, 49272, 47189, 35701, 25394, 28461, 33747, 42940, 48309, 51682, 53325, 52354, 58859, 58996, 59254, 65269, 77166, 74661, 75291, 57170, 36448, 32031, 42505, 50667, 57462, 53309, 47878, 43658, 44253, 55946, 59535, 60226, 55391, 55855, 49144, 38922, 36527, 45271, 52718, 52438, 48765, 53366, 69604, 56696, 62803, 67748, 56610, 55348, 56462, 61315, 54735, 51241, 47958, 43237, 47341]
9012D7341Q771O60P849O584r382o713n285P473K161N345J975l719j0284n834J6450
8997F3392L675j1142j0978P05k03J3660P580o918M56k837q730j0932Q245J5860
8983F1833M210J8J1409J4038k89N786L562j184j3442q673J521q701K868k00j4068
8968E8688m388J4378p326j5586j923J020M780N137M657K352J1681R3l540P84J120
8953G1927j2107L133k469k35N35j106j299m64N611J804j1773o804q72O117J2514
8938F4512j666l457K864J185j0333m690K823J265J1686N634N17O337o368K110
8924G2419m24M024R855p437k259j429k612L40J3763N431L111J351K362N007K078
8909A05580N066M206N770L708J2057k770l076l656p999j1193L841q98M619j4688
$$ y = [47341, 56112, 56772, 64621, 71205, 61823, 55110, 49825, 57298, 59459, 64804, 66779, 63060, 52776, 46942, 63392, 67067, 55925, 44947, 45652, 45449, 59109, 66689, 59771, 60227, 57390, 48660, 37728, 45973, 61833, 66043, 66061, 77470, 91508, 91219, 97005, 100567, 99383, 85941, 77268, 78789, 70088, 72956, 72756, 58688, 54300, 68678, 61352, 45766, 43843, 44863, 49643, 54780, 59437, 61789, 73470, 73563, 70023, 70807, 71927, 59820, 62953, 60484, 60249, 60784, 59678, 58379, 57915, 63526, 65330, 53557, 46753, 45881, 51998, 64512, 62846, 59389, 62253, 63438, 53105, 48415, 51238, 52503, 64189, 69823, 70340, 76677, 70309, 72419, 71995, 76019, 85874, 78437, 76178, 74749, 72137, 72477, 86240, 91671, 94782, 96133, 98495, 103502, 105580, 110646, 114852, 120622, 124330, 136387, 133617, 130541, 126885, 118886, 107693, 111534, 110636, 115255, 100567]
8895A00567j5818M390n952J165O249N465j902p822k726P62O704J1701m130n968
8881I2685J256o399j464Q58j0873j832P781j061p976M956l717o742R286L860J507
8866H2125J4628j758n351k025q45q397l227J1462N807J0531j0702j1856N456J0686
8852I6534n378q969L709P312O490n116M980M47O887r038n076K4p73P686j0503
8837H9216j3117p13J207R092N894j1332o741j0661L775N35J78k595L880J9468
8823H8086R999r683J714O860M077L445Q36O21p90J9586R028j2646j4458j0060
8809I6615P833k308n940L773R626L297J626N6j8440O591K1156J7327o362o137
8795A28713p231j0722j1359J510Q306J5164Q849j7328j0107j4394J2372J4034
$$ y = [100567, 84749, 89139, 83187, 84352, 90601, 96066, 94164, 86342, 83616, 84378, 91082, 102783, 98653, 92685, 93941, 87542, 86078, 86936, 76063, 74231, 82012, 80951, 72975, 77931, 74214, 67472, 76758, 80618, 82125, 96753, 94995, 89644, 87619, 86774, 78377, 75150, 86612, 92419, 102950, 92248, 80392, 85848, 96534, 91156, 82187, 85896, 93208, 99698, 94582, 99562, 100009, 106896, 97858, 92782, 92806, 92033, 99719, 89216, 76099, 75386, 76593, 85685, 91579, 80247, 73506, 62845, 66620, 67155, 67333, 64738, 68618, 88086, 98085, 88402, 90116, 96976, 101053, 104498, 105334, 105955, 105165, 124751, 133779, 121133, 106675, 96615, 104448, 102140, 96200, 99973, 109599, 112896, 114522, 114578, 96138, 102729, 123885, 141212, 134850, 128713, 121482, 110760, 99401, 100911, 109217, 124381, 133230, 115902, 105795, 91401, 103773, 117807]
8783A17807J1575K101N816l202m824n848r99J3263J576Q266R081O71k1995j0664
8769A22624J4701M826O204K108r4L318J0531R347j1039n827R812J7958P562j396
8755A90635m457J057o487m752j0236m195J0434J0869k09L797j4102j1895l335
8742A57124J9767r81j461q485j8039K599Q431J2087N134r223n266r76n989q324
8728A46398j253P454Q189M513K610L874l536j683O264P256J0654P470l901P805
8714B02114J676L363J1405J1374N019Q954Q867j444j1658q635j1751r88J3810
8701B32106J063k499P98N680Q507J3305P993r808p100K742Q387J6900O820J0771
8687B95665L109l34m032k41Q172K0799L0598K6278J9718L2873K9974K4218J8630
$$ y = [117807, 129382, 131483, 137299, 134097, 129273, 123425, 122426, 135689, 137265, 145531, 154612, 155283, 133288, 122624, 137325, 142151, 148355, 150463, 150369, 153687, 164218, 173565, 162526, 156699, 166511, 184469, 192031, 190635, 186178, 187235, 180748, 175996, 165760, 161565, 171999, 182868, 182659, 186456, 172354, 160459, 157124, 176891, 175910, 174449, 165964, 147925, 150524, 158955, 171042, 176176, 166953, 161687, 160711, 154722, 146398, 145145, 152599, 160788, 165301, 167911, 171785, 168249, 166566, 172830, 180086, 190740, 198210, 194309, 202114, 203790, 207153, 218558, 229932, 234951, 243905, 252772, 251328, 239670, 231035, 219284, 218296, 232106, 233169, 230670, 231468, 237148, 245655, 258960, 266953, 257145, 250045, 252787, 261174, 278074, 284894, 295665, 298774, 298440, 294408, 294167, 302339, 323138, 353736, 380014, 399732, 432605, 462579, 486797, 505427]
8674E05427L7423N6322N9074R2220J16576J41440J83070K24803K39740K47021
8664A903116K05604P6108o7444k29888l34461k79419k07682j42063r3679o4117
8654G66075m7228l4739j6519j7742o491O825p067l93M439K345J5813K3160K1427
8641G09905J3913P558K6209L8908O2205O2606P9685R8638J11859J46831K01176
8630A559493K58870L25139L96171M60487M65029L84148K17355J0139m1315R5433
8620D130949K03564J86852O4036j23957m59717o96395o46064m77506l26980k22129
8610A632653j54016j03091p0316n5715n4125m2934l7824k9200j9166q011j3003
8599A045252N597J2743L236J4907M1773M1423M8099N4503O6521P5708J30937J66822
$$ y = [505427, 542850, 599172, 658246, 750466, 867042, 1008482, 1191552, 1416355, 1656095, 1903116, 2108720, 2184828, 2117384, 1887496, 1553035, 1273616, 1065934, 923871, 830192, 766075, 718847, 684108, 667589, 649847, 643356, 650181, 643114, 642721, 647160, 649505, 665318, 688478, 709905, 723818, 731376, 757585, 796493, 858698, 921304, 1000989, 1099627, 1211486, 1358317, 1559493, 1818363, 2143502, 2539673, 3000160, 3465189, 3849337, 4066692, 4076831, 4035516, 4130949, 4334513, 4521365, 4585401, 4461444, 4001727, 3305332, 2659268, 2181762, 1854782, 1632653, 1478637, 1375546, 1305230, 1249515, 1195390, 1152456, 1114632, 1085432, 1066266, 1058255, 1045252, 1050849, 1063592, 1066828, 1081735, 1123508, 1164931, 1213030, 1267533, 1334054, 1409762, 1540699, 1707521]
8587A707521K28969K90294L99352N29273O42833O92086O19245L70196n9918l77726
8577E042125n36946m90624l07925j92328j64472k03797k65824l42718l57617l02219
8567A877655k09550j35817j00498q2406n5534m1368l8159l9124l5506k7159j8832
8556A093702q741j4516j8254k4668j3903m219K188K3454K0662J8633L9256M2695
8544A156289M3581O7029R5219J32070J78639K25200K62995K80627K53102J73811
8534B868562O071k45681l78907l00884j79616j17731j03233o9344l1520o176J5039
8523A456580P673J0592O898L4254O4264R8389J23594J61715K32039L16242M25014
8512B937254N34547O42130O59115N22030K28546l46931q93049r37974o58799l90932
$$ y = [1707521, 1936490, 2226784, 2626136, 3155409, 3798242, 4490328, 5109573, 5479769, 5419851, 5042125, 4505179, 4014555, 3706630, 3514302, 3349830, 3146033, 2880209, 2537491, 2179874, 1877655, 1668105, 1532288, 1431790, 1349384, 1293850, 1252482, 1214323, 1175199, 1139693, 1112534, 1093702, 1084961, 1070445, 1052191, 1027523, 1013620, 1009401, 1011589, 1035043, 1055705, 1074338, 1113594, 1156289, 1199870, 1266899, 1362118, 1494188, 1672827, 1898027, 2161022, 2441649, 2694751, 2868562, 2874633, 2628952, 2250045, 1949161, 1769545, 1651814, 1548581, 1479237, 1447717, 1441541, 1456580, 1464253, 1474845, 1481743, 1515997, 1580261, 1678650, 1802244, 1963959, 2195998, 2512240, 2937254, 3471801, 4113931, 4773046, 5295076, 5523622, 5176691, 4283642, 3345668, 2686869, 2295937]
8502B295937k55166j66814j12189p9005o3419m7141l9858l7885l0354l3405l8779
8491A391922k6519j7535L248j131J5586K6018M1104M9000M6948L6447J9167L0141
8479A614396M9172Q9579J31129J87933K46817L27016M47377N72076O33714N75771
8469D874980M07202J1447o08078r33753p92243n16004l11327j69779r1702o6261
8459A804482n4484p5057p5986n2153j8420J0755J4419L031q336m1442n5522q6119
8447A365168o9099n1513m6567l2768J942L752Q130J3618J5907K6414K0295J7502
8435A272781K0426J6958N1332R7055J31057J76699J87432J47247P8376m3622j73726
8424A962015j82331j10290n9840j0697K2860N4248P8782J14660J31581J31067
$$ y = [2295937, 2040771, 1873957, 1761768, 1682763, 1619344, 1572203, 1532345, 1494460, 1464106, 1430701, 1391922, 1365403, 1347868, 1351116, 1349985, 1365571, 1391589, 1432693, 1481693, 1528641, 1565088, 1584255, 1614396, 1663568, 1753147, 1884276, 2072209, 2319026, 2646042, 3093419, 3665495, 4299209, 4874980, 5282182, 5293629, 4685551, 3751798, 2959555, 2443551, 2132224, 1962445, 1870743, 1804482, 1749998, 1674941, 1598955, 1546802, 1528382, 1539137, 1553556, 1556587, 1548251, 1506809, 1451287, 1365168, 1296069, 1244556, 1197989, 1165221, 1167163, 1170915, 1179045, 1192663, 1208570, 1234984, 1255279, 1272781, 1293207, 1310165, 1361497, 1458552, 1589609, 1766308, 1953740, 2100987, 2179363, 2135741, 1962015, 1779684, 1669394, 1609554, 1598857, 1621717, 1675965, 1754747, 1869407, 2000988, 2132055]
8414B132055J01138K8460J7518M5377P9878J25608J80692J98766K05665K03945
8404C319102J75990J20631R5562M1869o4678k26576k75866k21850j39935q2669
8394B741580n6080m5970l3566k8578j3708K4676R1028J53038K44410L29496L56135
8383C762461L21446J96457j60069m62555l53739k26344j38519o6505l8971K1179
8373B854841P6610J40974J71500J77131J66131J78504J79172J91024K12549K20556
8363D568992K18771J66726M6151q1459q4906l3899n350k7685q5315j95603l10366
8352D176057k89014j80176j17870q0317o8144n5058k9432k4920q416Q911K254
8341C333875K1349O4940J05177R5579M4316p1869j56747j62876r6277m1496m4446
$$ y = [2132055, 2233193, 2261653, 2279171, 2324548, 2404426, 2530034, 2710726, 2909492, 3115157, 3319102, 3495092, 3615723, 3711285, 3753154, 3688476, 3461900, 3186034, 2964184, 2824249, 2741580, 2685500, 2639530, 2605964, 2577386, 2563678, 2588354, 2679382, 2832420, 3076830, 3406326, 3762461, 4083907, 4280364, 4120295, 3657740, 3304001, 3077657, 2939138, 2872633, 2833662, 2854841, 2931451, 3072425, 3243925, 3421056, 3587187, 3765691, 3944863, 4135887, 4348436, 4568992, 4787763, 4954489, 5000640, 4919181, 4834275, 4800376, 4795026, 4767341, 4682026, 4486423, 4176057, 3887043, 3706867, 3588997, 3508680, 3440536, 3385478, 3356046, 3331126, 3322710, 3331621, 3333875, 3355224, 3420164, 3525341, 3620920, 3665236, 3593367, 3436620, 3273744, 3177467, 3135971, 3091525]
8330C091525m5217l6806J5528O1947O4628P9928R6681J07168J16851J15496J12590
8319C780319J19530J35766J70766K29487K76407L42540M16439M23850L41577K36231
8309F472912l3707l84439l62487j75233k7548N1393J18489J62622K28579K90711
8299F341292L21380L32426K99176K18294K46702L29347M62244N79336O87270Q10408
8289A0627875R48505J072949J212365J354056J528214J740208K033433K346229
8281B2863834K716782L156473L795659M781612O211529Q227410J1133145J5315790
8273G8202234K0833940K6712977L0284058K8681502K1058173M849310k1351644
8266A89270550m0786089l8621044k6587939j6809450j0808237p215856n002992
$$ y = [3091525, 3046308, 3009502, 3025030, 3086977, 3151605, 3231533, 3328214, 3435382, 3552233, 3667729, 3780319, 3899849, 4035615, 4206381, 4435868, 4712275, 5054815, 5471254, 5895104, 6236681, 6472912, 6439205, 6054766, 5692279, 5517046, 5489498, 5540891, 5659380, 5822002, 6050581, 6341292, 6662672, 6995098, 7294274, 7512568, 7759270, 8088617, 8550861, 9130197, 9817467, 10627875, 11576380, 12649329, 13861694, 15215750, 16743964, 18484172, 20517605, 22863834, 25580616, 28737089, 32532748, 37314360, 43525889, 51753299, 62886444, 78202234, 99036174, 125749151, 156033209, 184714711, 205772884, 210622194, 189270550, 148484461, 109863417, 83275478, 66466028, 55657791, 48441935, 43438943]
8259D3438943l659588k822183k240441j808837j479442j241668j082754r52859
8251B8151171p85263n13016j82726J17341L73801O02597Q20650J051499J343754
8242C0979808J663255K032710K425537K843671L333858L887108M565545N353204
8234E7084696O400787Q050543J0476363J3925099J8962133K6464701L7018751
8227A78383073M9741722N9666195N9176716M7997784K4224092l0556475q3936151
8220C04696956q3157143n7224328l5746163k2664216j5021897j0488873p788752
8213G2605584o102872m953907m138839l581422l228175l010027k856122k578929
8205D2155291k101355j555034j136013q34691o26252n68311n12403k97481k9208
$$ y = [43438943, 39779355, 36957172, 34716731, 32907894, 31428452, 30186784, 29104030, 28151171, 27365908, 26852892, 26670166, 26787507, 27161308, 27763905, 28584555, 29636054, 30979808, 32643063, 34675773, 37101310, 39944981, 43278839, 47165947, 51731492, 57084696, 63485483, 71536026, 82012389, 95937488, 114899621, 141364322, 178383073, 228124795, 287790990, 346967706, 394965490, 419189582, 388633107, 304696956, 221539813, 164315485, 128569322, 105905106, 90883209, 80394336, 72605584, 66502712, 61548805, 57409966, 53828544, 50600369, 47590342, 44734220, 42155291, 40053936, 38498902, 37362889, 36528198, 35901946, 35333635, 34821232, 34523751, 34494543]
8196C4494543K73587N65002Q23369J084009J387160J735769K170026K687643L392080
8187D8613188M418157N906643Q015188J1084860J5381357K0702417K5623902K7255534
8179A67001246K3649080J4159316m666625k9235712l9675984l2380001k1334132
8172G7517188j3519222q849438o075828m435313l452541k819122k358800k027675
8164C3979249j841123j713265j638767j554597j371236j136406r01811p42607
8156B3079437o74759o66162o63185o28043n62642m72424l85024l22152k89278
8147A8415768k66201k40261k04431j93810k29112k68757l20666l57090l87838
8138A5947602m16908m29770l94265l65348l89573l96883l60948l22044k99144
$$ y = [34494543, 34768130, 35333132, 36156501, 37240510, 38627670, 40363439, 42533465, 45221108, 48613188, 53031345, 58937988, 66953176, 78038036, 93419393, 114121810, 139745712, 167001246, 190650326, 204809642, 200143017, 170907305, 131231321, 98851320, 77517188, 63997966, 55148528, 49072700, 44637387, 41184846, 38365724, 36006924, 33979249, 32138126, 30424861, 28786094, 27231497, 25860261, 24723855, 23822044, 23079437, 22404678, 21738516, 21075331, 20447288, 19884646, 19412222, 19027198, 18705046, 18415768, 18149567, 17909306, 17704875, 17511065, 17281953, 17013196, 16692530, 16335440, 15947602, 15530694, 15100924, 14706659, 14341311, 13951738, 13554855, 13193907, 12871863, 12572719]
8129A2572719l22227l32359l15749k71591k40208k43703k45860k34532k21412
8120A0145078j97418k02901j94993j76012j79072j78813j46179j21807j02767
8111H645116q6325o3608o5224n3650o6525o2078n9564n2394o1152o5468m4080
8100G965048o5283q7340j02487j14436j22112j34815j68724k17060k61290k64845
8090F426656k51107k37998k19685j86106j51924j30307j46164j68485j63963j43746
8080D627171j52766j62321j58687j38730j15164r5809q7159q1812r9542j29592
8070C405589j34862j24343j06423p2946m7603k0958k8412k3940l3175m5882m1809
8059B725236m0527o1640n9600n1008n6176m7295m3174n4179n9940n5988m5562
$$ y = [12572719, 12250492, 11918133, 11602384, 11330793, 11090585, 10846882, 10601022, 10366490, 10145078, 9947660, 9744759, 9549766, 9373754, 9194682, 9015869, 8869690, 8747883, 8645116, 8558791, 8495183, 8429959, 8376309, 8309784, 8247706, 8188142, 8135748, 8074596, 8009128, 7965048, 7899765, 7812425, 7709938, 7595502, 7473390, 7338575, 7169851, 6952791, 6691501, 6426656, 6175549, 5937551, 5717866, 5531760, 5379836, 5249529, 5103365, 4934880, 4770917, 4627171, 4474405, 4312084, 4153397, 4014667, 3899503, 3803694, 3716535, 3634723, 3535181, 3405589, 3270727, 3146384, 3039961, 2967015, 2919412, 2898454, 2870042, 2846102, 2812927, 2767045, 2725236, 2684709, 2623069, 2563469, 2512461, 2456285, 2408990, 2365816, 2311637, 2251697, 2195709, 2150147]
8048B150147m6590o1099o9974q3307p3584l5457m1572k7452j4606k2622l9128
8037A634756m9194n6507n0296m7315n2008l7966o566P142Q546K92r369l2380m1461
8024A267674m5653k7307j6971q130q09N733J970j221o316N634k470r999L492j085
8010A164542J219p386j9879j0466r763j3770q472J984Q097M553p328j7042j8721
7997A067568n760P796O745L58k327M22j0325j3520k038R763J8954N56o84L926
7983A081434J5962K223K564j1971n389l402r609l695Q79P510N480j0577j2558
7970A058851k1906k0001j1860r140p607l370j5245j9173k1301p429J6426K6403
7958I64648O095n112l031j6559n476j9407k1305k1963k983O492j8583j9898m36
$$ y = [2150147, 2103557, 2042458, 1972484, 1889177, 1815593, 1780136, 1738564, 1711112, 1696506, 1673884, 1634756, 1585562, 1529055, 1478759, 1431444, 1379436, 1341470, 1334904, 1342046, 1350592, 1350884, 1341515, 1309135, 1267674, 1222021, 1194714, 1177743, 1169613, 1168804, 1174537, 1176507, 1175286, 1168970, 1174604, 1172134, 1162135, 1165627, 1164542, 1165761, 1158375, 1138496, 1128030, 1118267, 1104497, 1096025, 1098009, 1106106, 1110659, 1103331, 1086289, 1067568, 1061808, 1069604, 1076349, 1076707, 1074380, 1074802, 1064477, 1050957, 1048919, 1058682, 1077636, 1078192, 1077508, 1081434, 1097396, 1099619, 1102183, 1090212, 1084823, 1081421, 1071812, 1068117, 1068996, 1076506, 1081986, 1071409, 1058851, 1036945, 1016944, 1005084, 995944, 988337, 984967, 969722, 950549, 929248, 921819, 938245, 964648, 970743, 965631, 962600, 946041, 940565, 921158, 899853, 877890, 874907, 881399, 862816, 842918, 842482]
7945H42482p7l835j5799k1058j9580o126k873q338j6698j9953p830j9698k9355
7932F71262k0550K049o498m418j380J182k10j5443j0250j7687k5370k3298j9301
7919E30088j8402k3652o396K1153N0198P2221N8729J5303r938k6378k9549k5929
7907F07448j4566k1769j2856P938j1169j2972k375n218p982k817n228j3498j932
7894E03004q318J015k978j7609o787K10l163j7196L110J1792K1072J3821j69K526
7880E00330J3849K2535J9502L5323O5002O2341Q0773J36661J55770J71958J66411
7869A430455J08520j1361j68896k10222j63357j17680q7793n0380l1987k4324
7859F72975k7299j1640j7757j8194k3280p518J265n877O160J722j0695K939Q189
$$ y = [842482, 842405, 838570, 822771, 801713, 782133, 776007, 773134, 764796, 748098, 728145, 720315, 700617, 671262, 650712, 652761, 646263, 641845, 640465, 641647, 641437, 625994, 615744, 598057, 572687, 549389, 530088, 511686, 488034, 481638, 502791, 552989, 625210, 683939, 699242, 689304, 662926, 633377, 607448, 592882, 571113, 558257, 566195, 555026, 542054, 539679, 534461, 526479, 523662, 518434, 504936, 503004, 494686, 495701, 492723, 475114, 468327, 468537, 465374, 448178, 451288, 463080, 484152, 497973, 497804, 500330, 514179, 536714, 556216, 591539, 656541, 718882, 799655, 936316, 1092086, 1264044, 1430455, 1538975, 1527614, 1358718, 1148496, 985139, 867459, 779666, 729286, 697299, 672975, 645676, 634036, 616279, 598085, 574805, 567287, 568552, 562675, 568835, 570557, 559862, 562801, 570990]
7846E70990J3100Q336K442j013J0085Q805N770J6304K2734J5856J3110K6107L9594
7833G52220O4108P4707Q5538J33906J80277K47091L16724L25033K81625K15034
7823B676263k9518l87892m85467l64094k46739j52099r8877n9831n6817l8900
7813G56029k6960q899k2804k1722k6470j6266j6994j3168j3946q213n656j2018
7801E62913q515l483l372n93k0330n436j666J7362N138p723m904K7777J9083J8432
7787E94683J6981L5928N4370P1917R9320J28882J43861J41271J06060J1436j22745
7776A281964k00263j98021j48982r6485o2316l3904k1739k3885o642j359j1363
7765D77005j1294k2083k8387q267r271l5560k6434j6296J949q970j5250q163O205
$$ y = [570990, 584090, 592426, 594868, 593855, 603940, 612745, 618515, 634819, 657553, 673409, 686519, 712626, 752220, 816328, 891035, 976573, 1110479, 1290756, 1537847, 1854571, 2179604, 2461229, 2676263, 2646745, 2258853, 1773386, 1409292, 1162553, 1010454, 911577, 851746, 794929, 756029, 729069, 720170, 697366, 675644, 649174, 632908, 615914, 602746, 588800, 580587, 574931, 562913, 554398, 550915, 547543, 546950, 526620, 521184, 519518, 536880, 542018, 534295, 529391, 557168, 576251, 594683, 611664, 647592, 701962, 773879, 873199, 1002081, 1145942, 1287213, 1393273, 1404709, 1281964, 1081701, 883680, 734698, 638213, 575897, 541993, 520254, 496369, 489727, 488368, 477005, 465711, 443628, 415241, 406974, 397703, 362143, 335709, 319413, 321362, 312392, 297142, 288979, 295184]
7752B95184N34l126J946J693p780l561j3829R407m248q516o814m78O68k474j5875
7737B42731l264k893J5535J3372p035K994p441j0072q476r510j0564j544N890
7724B19723O828K358k910R418l886j1584K757L295r003k1387j5431j8655O782
7711A68305J4808J5597J3120j3022p656Q681J1488L227j424J5393j124o02%M299
7697B31090K237j1604j2046j1904m800K710L689J390q242m786n084p301n646l175
7683A66528J0308K550l546j0126j0598j793M880O438Q556P095J7097Q78j1458
7670A86809j0997j1402R639K0260J5331r148j1356O3o632j0538j1536J3197P349
7657A81039J1507o345N77J868J1741r098j9332Q73j222j2916j5232J395M406l620
$$ y = [295184, 295718, 292592, 294538, 296231, 288451, 284890, 271061, 280468, 276220, 267704, 260890, 260412, 261080, 258606, 242731, 239467, 236574, 252109, 265481, 258446, 261440, 253999, 243927, 235451, 225941, 215377, 213833, 219723, 226551, 228909, 225999, 235417, 231531, 219947, 222704, 225999, 216996, 195609, 180178, 161523, 168305, 183113, 198710, 211830, 198808, 191152, 199833, 211321, 214548, 213124, 228517, 227393, 226791, 226791, 231090, 233327, 221723, 209677, 197773, 192973, 195683, 199372, 200762, 192520, 187734, 182650, 175349, 169703, 166528, 176836, 179386, 175840, 165714, 155116, 153323, 158203, 164641, 173197, 180292, 197389, 198267, 186809, 175812, 164410, 174049, 194309, 209640, 200492, 189136, 189199, 182567, 172029, 160493, 173690, 181039, 192546, 186201, 186778, 188646, 200387, 191289, 171957, 172830, 171608, 158692, 143460, 144855, 149261, 145641]
7643A45641J126L063q617J737j0329j54N353l024L663P811n679p917q602K26J289
7628A25587m756o119N064j322K865Q025O177j0336l934P158K962K499j810n484
7614A26576k515N600m001j4356r866j0593O107J3718o738J238m212K372K37J411
7600A04978k603n554J664J451O847j733p958K747O295P161M203j593j5513j4994
7586H5398k415l412O914R97k86j6354J374O52k154J1073Q603j298j598Q040J2649
7571A08183k699m905l423l570q3n521j153L656K454p132j2451l270J095J0912
7557H2093Q286R785k68m814r266j4895n67J2042M480m24J105p115N474J768l862
7542H3822K756K820k724L314P55j8123j0879J1696K1367R954k0128j2196j4400
$$ y = [145641, 146767, 149830, 141213, 142950, 132621, 132467, 137820, 134796, 138459, 146270, 140591, 132674, 124072, 124298, 125587, 120831, 114712, 119776, 118454, 121319, 129344, 135521, 125185, 121251, 128409, 131371, 133870, 132060, 126576, 124061, 129661, 125660, 111304, 101438, 90845, 96952, 110670, 103932, 105170, 100958, 103330, 103567, 104978, 102375, 96821, 98485, 99936, 106783, 105050, 97092, 99839, 106134, 113295, 117498, 115905, 100392, 85398, 82983, 79571, 86485, 87482, 87196, 70842, 72216, 72868, 70714, 81787, 90390, 89092, 87494, 95534, 108183, 105484, 100579, 97156, 93586, 93503, 87982, 86829, 90485, 92939, 85807, 73356, 70086, 71181, 82093, 90379, 100164, 99896, 95082, 85816, 70921, 70354, 82396, 86876, 86452, 87557, 80442, 85916, 87684, 83822, 86578, 89398, 86674, 89988, 90743, 72620, 61741, 73437, 94804, 104758, 84630, 72434, 58034]
7529E8034L456P199l620m45J1799N702N599K44R501M150M442L125p333N675Q061
7514A15589k92k578q642k820o442j0747m815o706J971J1522M659L745r985P167
7500I1626q558q322J78J1065M048l999k291r436O21J9231K382l130N288Q307j7545
7485H9465j3878k792K838J4956N685l727j2665o714N914m651j1781K757P575j940
7471G1042K373l111j3666M674J582m733P35R239O819l175K220M798j2373k086
7457F4338j2265N27k140p17P362M60K089J168r584j1930n946j0221J3575Q984
7443D5700n7q007o327O332J2864k303l318Q159p904l730Q620J0277P431j561P160
7428G3336j5213q722P312m431O26J104Q960L473o307j0951k31L36m375r761J774
$$ y = [58034, 61490, 68689, 65069, 64624, 76423, 82125, 87724, 87968, 97469, 101619, 106061, 109186, 101853, 107528, 115589, 115297, 112719, 104077, 101257, 94815, 84068, 79253, 72547, 74518, 86040, 90699, 94444, 84459, 91626, 83068, 74746, 74924, 85989, 90037, 86038, 83747, 74311, 74932, 94163, 96545, 93415, 98703, 107010, 89465, 75587, 72795, 75633, 90589, 96274, 92547, 79882, 73168, 79082, 74431, 62650, 65407, 72982, 71042, 73415, 70304, 56638, 61312, 62894, 58161, 58896, 68135, 74954, 71779, 73999, 78797, 66424, 64338, 52073, 52600, 50460, 49743, 57105, 57565, 59654, 60822, 51238, 39308, 33362, 23141, 36716, 45700, 45643, 37636, 31309, 37641, 50505, 48202, 44884, 53043, 45139, 41409, 50029, 60306, 67737, 66176, 73336, 58123, 49401, 56713, 52282, 52908, 54012, 62972, 66445, 60138, 49187, 48956, 49292, 44917, 35156, 36930]
7413C6930R880P964M904m226K387k493j0177J967j1210k872j1337J411J0336l261
7399C0203P645O003J145J011j0181L857L182p701J591P744l183r386n873P898
7385C3955n59R967K842L00q273r602M208J1097m729o997M654K0552J04p298p544
7370D2677o206o913k299J2798o089Q982J4325j0120L939k661q490K556J0733J8870
7356G2102m101k5510m850J3588M782j6115K056M788r945j0687n835l392O009P107
7342B9997l296j672J864O918p110Q385P278r268n089j125J477J500l200J1536
7328C8195m951J0711O367M083n011r433Q83p040k038j0192r856o067O176K6097
7314C7924M716n136j5365j8238Q538m319p278R776M97O320R982o953q06Q075m337
$$ y = [36930, 46810, 54774, 59678, 55452, 57839, 55346, 45169, 47136, 35926, 33054, 21717, 23128, 33464, 30203, 37848, 43851, 44996, 46007, 35826, 39683, 42865, 35164, 36755, 44499, 41316, 31930, 26057, 33955, 33396, 43363, 46205, 46505, 38232, 28630, 32838, 43935, 39206, 32209, 36863, 57415, 57519, 50221, 42677, 36471, 29558, 27259, 40057, 33968, 42950, 57275, 47155, 51094, 48433, 39943, 42499, 53232, 72102, 68001, 42491, 37641, 51229, 56011, 39896, 41952, 46740, 36795, 26108, 20273, 16881, 22890, 29997, 26701, 25029, 26893, 33811, 26701, 35086, 42364, 33096, 28007, 26882, 28359, 29859, 26659, 38195, 33244, 43955, 50322, 54405, 49394, 39961, 40844, 33804, 31766, 21574, 11718, 5651, 11827, 37924, 42640, 37504, 22139, 3901, 12439, 8120, 842, 10618, 11115, 17435, 27417, 20464, 19658, 27733, 23396]
7299B3396r41J539M166j697M311l911j816q3J0872J087j0183o57R848O906l471
7284C9366M55o832q778O741J5591l486j0736j5048J0517L168k294Q59L202j0869
7270B1856r36q60r00L088J5558K334k2334L813R624P69j003n838j268J2571k135
7255C4339j5110L490j915k393n01J1252J328M524N72p916K435M488r316M93j552
7240B4218j2631k073L617N486L777L539Q933M72n511j2391j0414k039J478Q296
7226A4757Q587L465P935l740L446L500l667N488l670p966P372R223j2385n476
7212B6869m956k247n747O489j727j145p572n123j0442P266M345k829M396R633
7198A7210J4971M773q396L714M006n210q438q940p407P974K967L945N985R862
$$ y = [23396, 22455, 23994, 28160, 26463, 30774, 26863, 25047, 24964, 35836, 36923, 26740, 26083, 35931, 42837, 39366, 39821, 32989, 24211, 30952, 46543, 43057, 32321, 17273, 27790, 30958, 28664, 29523, 32725, 21856, 20920, 20060, 19160, 22248, 37806, 40140, 17806, 21619, 31243, 32012, 31009, 25171, 23903, 36474, 34339, 19229, 22719, 20804, 18411, 17910, 29162, 30490, 35014, 35586, 27670, 30105, 34593, 25277, 25770, 24218, 11587, 9514, 13131, 18617, 22394, 25933, 34866, 35338, 29827, 17436, 7022, 4983, 6461, 14757, 23344, 26809, 34744, 31004, 34450, 37950, 34283, 39771, 36101, 28135, 35507, 44730, 32345, 26869, 21913, 19666, 13919, 20408, 18681, 17536, 9964, 4841, -5601, 1665, 6010, 3181, 7577, 17210, 32181, 36954, 28558, 32272, 36278, 31068, 22630, 13690, 6283, 14257, 17224, 21169, 27154, 37016]
7184C7016m777l071l567j1801o818J037J4445J4246j031p575M727j778l893j493
7170B5667n699m465L652j1590k4695M300Q645J2077j900J757R980M27k568J1361
7156B6949r656k799J9336k06r71k510o517N06l957R021Q268j1310j3560l600j30
7141H864M557K072O832j49K157k640j5808r528J946j511j1827n088M346p97O539
7126a0035K7111p25r238k002J0233P677Q835j6144o089Q860O740M767n516j1345
7112A3129M740o415k77j771L941M641j0031j570J0348J3924J5125j5104r854k543
7098A8283L305j0957l331n957N326J4712O414L834p909q212j2446L169R118M162
7084A9511j6292n370n01J0544j3469o317O607J8767M504Q304l290j389r074n896
$$ y = [37016, 32239, 29168, 25601, 13800, 6982, 8019, 22464, 36710, 35679, 28104, 32831, 31053, 27160, 25667, 19968, 15503, 19155, 7565, -17130, -12830, -4185, 7892, 5992, 7749, 17729, 18156, 15588, 26949, 17293, 14494, 33830, 33624, 32653, 30143, 23626, 24132, 20175, 29196, 37464, 26154, 12594, 8994, 8864, 13421, 15493, 22325, 22176, 24333, 21693, 5885, -3643, -1697, -3208, -15035, -20123, -15777, -16574, -10035, 17076, 16351, 7113, 5111, 15344, 23021, 31856, 15712, 9623, 18483, 25223, 29990, 24474, 13129, 17869, 11454, 11177, 9406, 13347, 17988, 7957, 6387, 16735, 30659, 45784, 30680, 20826, 18283, 21588, 10631, 7300, 1343, 6669, 21381, 27795, 31629, 23720, 15508, 3062, 6231, 15349, 19511, 3219, -2151, -2652, 7892, -5577, -11894, -5287, 13480, 17984, 26288, 22998, 21609, 12535, 6639]
7070F639N21K847p95p327j4601j1476O986O944J0998N446O314k632K831O252p077
7055A1870r646k108J9551J0143Q611n570j5749j3911j1169l598N69J0987L051
7042C031N049j3165r417J2260j93K10J6176J2809q231o567R996Q93k927L227J394
7027B4545j6892o066l467M033M336Q708O730N856N639p291m702K420J320j4055
7013A1114j4762L795J5592o958k1748m150J3723J0108J533k784P782j007M780
7000A7018Q299j3967q636L757Q951J4669M941l815j6835p158p750q234k879Q531
6986c108R874O040l358M086m551l09j4457m937N671J0817o487j0901k986J3481
6972a125J0136O909r008J256n477j981m410P694O525j3637J718Q147Q200L218
$$ y = [6639, 7160, 10007, 9212, 1885, -12716, -24192, -17206, -10262, 736, 6182, 12496, 9864, 12695, 18947, 11870, 2224, 116, 19667, 29810, 38421, 32851, 17102, 3191, -7978, -11576, -11007, -20, 3031, 8080, -5085, -14502, -2242, -2435, -2225, 13951, 26760, 18529, 11962, 21958, 22851, 19924, 23151, 24545, 7653, 1587, -1880, 2153, 6489, 15197, 21927, 27783, 33422, 26131, 21429, 23849, 25169, 11114, -3648, 147, 15739, 8781, -12967, -17117, -3394, 6714, 8247, 5463, 13245, 12238, 17018, 25317, 11350, 2714, 6471, 15422, 30091, 35032, 31217, 14382, 7224, -526, -8760, -11639, -3108, 6766, 12806, 9448, 13534, 8983, 8674, -5783, -10720, -5049, 5768, -719, -11620, -14606, -1125, 9011, 15920, 6912, 8168, 2691, 710, -3700, 3994, 10519, -3118, -1400, 6747, 14947, 18165]
6958A8165k17j3624j2803P270J4135M245o0j686q642m130K409J4214M94k684j0420
6943F666J423J2783N385k8q661j949n496M63p195K393r255P345J4329Q860r783
6928A7280k0410r228k886J3457J0141j1173j1172P451J8862J1376K316k2506j076
6915B432q221n168N68J6064R541P735M774M263J2894l398n531m226k729j2542
6901A6456p210J728O197j0664j5710j767l083M066P432j7275P264K8059m64K6
6887A5055m42j110L514q311J897J3264j1558j8721r888l906L199J8087K0699R804
6873C1583q849q294j2574j6164o097l059J2911R625k270M564n844j2091J3095
6860c464J8381m403O535J1124j2687n388J56L162J429K218k766j152O888m933
$$ y = [18165, 17948, 4324, -8479, -1209, 12926, 17171, 17111, 15425, 6783, 2653, 5062, 19276, 19770, 17086, 6666, 8089, 20872, 26257, 26229, 17568, 15619, 10123, 10586, 3391, 5784, -3471, 3874, 18203, 27063, 17280, -3130, -12358, -15244, -1787, 8354, -2819, -13991, -6540, 12322, 23698, 26014, 3508, 2432, -5789, -10957, -10389, 5675, 15216, 22951, 27725, 31988, 44882, 41484, 35953, 31727, 28998, 16456, 9246, 10974, 17171, 6507, -9203, -10970, -14053, -9987, -2555, -19830, -12566, 15493, 15029, 15055, 14613, 13503, 17017, 8706, 10603, 23867, 12309, -6412, -16300, -20206, -17007, 1080, 21779, 31583, 22734, 14440, 1866, -14298, -20395, -23454, -10543, -918, -3188, 1376, -4468, -16559, -3464, 14917, 10514, 17049, 28173, 15486, 10098, 10254, 13416, 14845, 17063, 14297, 13145, 20033, 15100]
6846A5100k1131o063J0632M888l028k877l859j915o137k302J1305J7026k622j3323
6832d306r237O302Q539o304j0719j0325M729N362J3611P957K581m029Q966Q381
6818B1508R13L299j470p974l383q434n299K984K0747M196o546j0940P81J181L256
6803A4819k353O658J141m815r33j255P274M541k093l542J483n44j351p003k395
6788I632q609l338J595m83r25j2766J0892J1255K512p092p34J1929J8330N743
6774C7941j2624o396o889j6709q599m623O295J608R386O131L521m441k2005Q447
6760h957J8065J104j5269j7137P877N145Q669l056j942j2462p67K049j906N585
6746a3002q61l162m102M416J4365O647P64k980j669o726M424M972m876M425N688
$$ y = [15100, -6031, -12094, -1462, 3426, 398, -2479, -6338, -8253, -14390, -16692, -5387, 11639, 9017, -4306, -13543, -7241, 1298, -5006, -15725, -26050, -21321, -15959, -2348, 5609, 8190, 4161, 13127, 21508, 22421, 25720, 24250, 16276, 12893, 4459, -840, 2144, 22891, 27087, 20541, 9601, 10382, 11563, 14819, 12466, 19124, 20265, 15450, 14517, 13262, 20536, 25077, 22984, 19442, 20925, 20381, 19030, 12027, 9632, 1023, -2315, -720, -1203, -2128, -14894, -4002, 7253, 9765, 2673, 1939, 13868, 32198, 37941, 25317, 18921, 12032, -4677, -13276, -17899, -11604, -9996, -610, 5521, 9042, 4601, -17404, -8957, 9108, 10212, -5057, -22194, -14317, -9172, -503, -3559, -5501, -17963, -18730, -16681, -18587, -13002, -13863, -17025, -21127, -16711, -2346, 4301, 5065, 2085, 416, -6310, -1886, 3086, -1790, 2635, 8323]
6731H323J866N305j2481r827R265J054j3782o39k854o25R472P597j3958n045Q049
6716h280O219M474p701j3681J0874O325L220k109P034l420j842N469n841r61J611
6701A391l057m678J4703K720J920n791j7361p799J457K336K720P041k193k443
6687i034J1908J0312k793J0950j2565R253J8320K249l07J031j5317K272o281p818
6673A2180m745P48O443O73K186n32m916l563m026n306k498l287O769O480l877
6658B729j674o365j5054m420P912J5345j431j1549J160k04M36M686m811j712n169
6643b0121j0264o355O393J2410O048K364p914Q560L422M744K987Q845K009m240
6629H888r384l319o19o212k64J1074j182m524k060j1977l346K2792J7488m290
$$ y = [8323, 10189, 15494, 3013, -6814, 2451, 3505, -10277, -10916, -13770, -14395, -4923, 2674, -11284, -16329, -8280, -2061, 2413, -5288, -18969, -8095, -1770, 1450, -659, 6375, 2955, 1113, 6582, 741, -220, 1391, -1666, -6344, 8359, 11079, 12999, 7208, -10153, -17952, -16495, -14159, -11439, -4398, -6591, -9034, 2874, 13186, 10393, 21343, 8778, 18031, 36351, 38600, 38293, 39324, 24007, 26279, 19998, 12180, 7435, 8183, 14626, 15299, 17485, 16953, 12037, 8474, 4448, -858, -3356, -6643, 126, 6606, 2729, 1055, -5310, -20364, -24784, -16872, -1527, -2958, -14507, -13347, -13551, -13115, -8429, -13240, -14952, -20121, -30385, -36740, -30347, -17937, -11889, -9525, -17439, -8879, -5457, -713, 2274, 11119, 13128, 8888, -496, -3815, -4434, -10646, -10910, 164, -1018, -5542, -7602, -19579, -22925, -133, 17355, 13065]
6615A3065q172k773j346n982P125j7450r730O207J2997p39N582M337O620J285
6601A1026j0077l143K2653J3207l926j8018k0990j620J7053N040l51m977m617
6588A260R01p18M947Q39k793o715m748O449O782N857M635j0225N299j6192Q02
6573c620Q643O864q495M305N106j3810p463L252m279o122Q28J0017R485M446j2099
6558b942j2678q474m191K227L4298P058K322q35l399j2509l803J952R71J0917
6544A0914j0526k720J059j4446m257O988P490J146O36o621P055L257q262r63J946
6529g304O106J888j359r939L530k105m496p297M208P713L280K705O958m785p953
6514h850O867L503k501N191j1942r815J2262o136o137r700r577J99P061Q980j104
$$ y = [13065, 4893, 2120, 774, -5208, 1917, -15533, -25263, -19056, -6059, -6798, -1216, 3121, 9741, 11026, 949, -2194, 20459, 33666, 29740, 11722, -9268, -10888, 6165, 11205, 10854, 5877, 1260, 2161, 1443, 6390, 7229, 4436, -2279, -7027, -578, 6204, 12061, 16696, 6471, 11770, -4422, -3620, 5023, 11887, 3392, 7697, 12803, -1007, -8470, -5218, -9497, -15619, -14791, -4774, 4711, 9157, -2942, -15620, -24094, -28285, -26058, 8240, 15298, 17620, 16785, 13386, 877, -2926, -974, -3, 10914, 388, -2332, -1273, -15719, -19976, -12988, -5498, -4352, -3716, -10337, -3282, -25, -8287, -9250, -7304, -1198, 690, -669, -10608, -7078, -9183, -13679, -20976, -16768, -9055, -5775, -3070, 3888, -897, -8850, -1983, 1520, -981, 4210, -7732, -17547, -5285, -11421, -17558, -27258, -36835, -36636, -29575, -20595, -21699]
6499b1699m688o674R339J1802J4180K159j169j2699L6O091N922M799k314k35j4305
6484i455k354q804r488J4129J3498N682j1926K924o923K443j257J2158l96L325
6470C556J1609n726j0421O012o999n370k313J132K649l520Q712P478j4912r798
6456a7911N637M960L984r437J903O318p428j6933J0780J8478O721j222j1064j800
6442g014j869m099J883R202k507o017J1309k343j7874P543P846o471J118P324
6428a969Q140Q12k949r210N64O381N680Q982n178n645o472q181R605l327j714
6413d481J0282Q142n501K552j0254o473K378q336k76J0208R829J446M634n572
6399H578j2128Q41K982o3O195P863o299M078J0627P711k3581j6551P55n300Q52
$$ y = [-21699, -26387, -33061, -23722, -11920, 2260, 4419, 3250, -9449, -9413, -3322, 2600, 7399, 5085, 4850, -9455, -11809, -20613, -30101, -15972, -2474, 3208, -8718, -5794, -12717, -10274, -11531, 627, 231, 3556, 15165, 9439, -982, 5030, -1969, -7339, -9652, -8520, -5871, -9391, -679, 6799, -8113, -17911, -12274, -7314, -3330, -12767, -10864, -4546, -11974, -28907, -18127, 351, 7072, 5850, -5214, -7014, -8883, -12982, -11099, -1897, -4404, -10421, 888, -1455, -19329, -11786, -3940, -10411, -9293, -1969, 6171, 6983, 4034, -5176, -4612, 1769, 7449, 16431, 11253, 5608, -864, -9045, 560, -2767, -4481, 5801, 13943, 8442, 10994, 740, -5733, -3355, -11691, -11967, -1759, 8070, 9516, 14150, 8578, -3550, -2709, 273, 210, 6405, 14268, 7969, 12047, 22674, 30385, 6804, -9747, -8992, -14292, -13440]
6384a3440Q656O239L461K652M649j077q245n524r908j1640R136P064K367J0449
6370D839j349O81Q44j1456l688L964J998p921r063K738l479Q44N12k486J2105
6355a0917J2564j437l576o770M924k652L222J174l281p53M70N117L958O65O113
6340H821j1008o449N433L256j5573R255J2419L655k566J210l483J2427o67j7738
6326a008j1192j5947J1692J6062N003m32l837J3117l095j2719M079o771j0259
6313a5307m505P133Q502J7876M04j0990j419j8191k960J337l017l648l098P799
6299b0084Q288J2585O22m033N428J0525R804j0569q495P44M44J785R661J436j0249
6284G892q553N47J224p8M120J1853l87j158j1787m998l714j0115J2120J9421o519
$$ y = [-13440, -4784, 1455, 4916, 7568, 12217, 11140, 2895, -2629, -12537, -24177, -15041, -7977, -5610, 4839, 3490, 4171, 5015, -6441, -10129, -6165, -4167, -12088, -21151, -18413, -21892, -21048, -20536, -23022, -10917, 1647, 210, -3366, -10136, -5212, -7864, -4642, -3468, -6749, -7502, -7032, -1915, 2043, 2708, 8821, -2187, -8636, -3203, 53, -15520, -6265, 6154, 9809, 7243, 8453, 4970, 17397, 16730, -1008, -12200, -28147, -16455, -393, 4610, 4178, 341, 13458, 10363, -2356, 1723, -5048, -15307, -19812, -12679, -4177, 13699, 14103, 3113, 1694, -16497, -19457, -18120, -21137, -24785, -27883, -20084, -11796, 789, 1411, -2622, 2806, 13331, 23135, 12566, 4071, 4815, 5259, 7044, 16705, 18141, 7892, -661, -114, 1110, 1032, 5152, 17005, 16618, 15460, 3673, -1325, -5039, -15154, -3034, 16387, 9868]
6269I868j0622j41J5009j2572j1378J221M942l092o049j840J375J1141J1648M810
6255A4320K932n322m498k706j9002r080M220L320J0109j735j1508m019O575M309
6241a2085N41r3M212K22k459m599R109Q074p169l299o97j908k352l820k248K830
6225a5741K874j146J892o503O766K410l406M554K235K056J4990j1787j0607n546
6211a6959m552M78J137M759M220k934o957N124J1045J796J2568O363o649j3109
6197c670q32m39j881j0107M160N502M053j7203l391L791M51O81L423R98K05P946
6181f313L147r78J801q756N88Q563J3592N149l337o41j0722j9642j4318J0286
6167b1581J6649P562J85l40j0660M818O769l843j1673j847k974O321j846K166
$$ y = [9868, -754, -895, 14114, 1542, -9836, -8615, -3673, -6765, -12814, -14654, -13279, -2138, 9510, 14320, 17252, 11930, 7432, 4726, -14276, -23356, -19136, -15816, -5707, -7442, -18950, -22969, -16394, -12085, -11544, -11637, -7425, -7203, -9662, -14261, -5152, 2922, -4247, -7546, -8243, -10151, -12503, -16323, -18571, -15741, -12867, -14013, -12121, -18624, -11858, -9448, -12854, -8300, -6065, -4009, 10981, -806, -11413, -16959, -21511, -21033, -19896, -15137, -10917, -13851, -20808, -15684, -4639, -2843, 9725, 16088, 9439, -3670, -4502, -4941, -6822, -16929, -12769, -7267, -3214, -20417, -23808, -20017, -19566, -18885, -15462, -14464, -14259, -6313, -3166, -4144, -2343, -11099, -10511, -1948, 11644, 16793, 13456, 12815, 2093, -17549, -31867, -21581, -4932, 2630, 2815, 2475, -8185, -3367, 3402, -441, -12114, -13961, -16935, -10614, -12460, -10294]
6153a0294m174P36N842J011j6947N382J3986O258l572K186j485k134K99K68N361
6138B723P523J0598L99j2640j7369N82O533k418k525K255N155J3017J166o942
6124H057n158o444l173J358L046l366O750O864j976J803k554j2059j6470m371
6110b7693J875J243k84K716Q167N666N513p11O164N826R442K899O163j2329r288
6095E369p3L93o062j7979o932J6883O696J5997k932k0365k970K948Jo70k238n412
6079a7346J258p243L142J2527L534k795L291N450q769N353J8178M18j2743j1728
6065g473j0088q694J6701K2270j1746j3004J161J1529J17M256M367l610K755n680
6051B861q133k760r994O722N23P596J2501L244r848p697Q054m493q608K853J1900
$$ y = [-10294, -14468, -13732, -7890, -6879, -23826, -18444, -4458, 1800, -1772, 414, -1071, -3205, -2906, -2638, 2723, 10246, 20844, 21243, 8603, -8766, -8184, -1651, -4069, -6594, -4339, 816, 13833, 14999, 8057, 2899, -3545, -6718, -5360, -2314, -5680, 1070, 7934, 5958, 7761, 5207, -6852, -23322, -27693, -25818, -24575, -24859, -22143, -13976, -8310, -2797, -3508, 2656, 8482, 17924, 20823, 26986, 14657, 5369, 5296, 5689, -373, -18352, -25284, -8401, -1705, 14292, 11360, -9005, -11975, -9027, -9026, -9696, -11934, -17346, -16088, -23331, -20189, -7662, -4128, -6923, -3632, 1818, -6951, -1598, 16580, 16998, 4255, -7473, -17561, -26255, -9554, 12716, 970, -12034, -10873, 656, 773, 5029, 9396, 5786, 8541, 2861, -5272, -8032, -18026, -11304, -10781, -3185, 9316, 12560, 2712, -4985, 3069, -1424, -10032, -7179, 4721]
6036D721r955j077N213O65j3021j0505k184J1443K163K985N516o458r133r145
6022b8772O132L462K294K010J4988L393n239O96K330Q609l888n169j898j1036
6008a2088o99O774Q901L010L394n743j4912m198P101k271l276J2584O005k22j1933
5993g573L715k919O071l857p657n387J6887K0990M450l636m583Q415M662j3916
5979A5662q232o356q679k086L764m45j478m506j313r14K0425l903q099J1901K047
5964G788q669j1540O181j88k155o844k40N823M216O174n060m932n668k579L939
5949a3754j44K401J2928o451q28n907n514m315K208J2454l76r525k168o23J3420
5934f194J2632j0278j0690R165J4600O232j4805o451N870P881M536r705p463q794
$$ y = [4721, -5234, -6311, -1098, -433, -13454, -23959, -26143, -14700, -12537, -9552, -4036, -10494, -19627, -28772, -22640, -19178, -16884, -14874, 114, 3507, -1732, -1036, 1294, 9903, 6015, 846, -1052, -12088, -12787, -6013, 2888, 5898, 9292, 3549, -11363, -15561, -8460, -10731, -14007, -1423, 4582, 4360, -7573, -3858, -6777, -706, -4563, -12220, -17607, -720, 20270, 24720, 21084, 16501, 24916, 29578, 15662, 7430, 1074, -7605, -9691, -5927, -6372, -7850, -12356, -13669, -14583, 5842, 1939, -6160, 5741, 7788, -881, -12421, -6240, -6428, -8583, -15427, -15667, -9844, -5628, 546, -4514, -9446, -15114, -17693, -13754, -13898, -11497, 1431, -5020, -5848, -11755, -17269, -21584, -19376, -6922, -7298, -16823, -18991, -19614, -6194, 6438, -3840, -14530, -5365, 9235, 15467, 662, -5789, 81, 7962, 12498, 2793, -4670, -13464]
5920a3464O12M176n497l143L684M462K203J2782O49k968j422O607J157n948j55
5905C735J2745J623k988M856m578j0092o02j2219r970P39j855k964j60k539J6653
5890g616Q058Q29p932j714k763j1433K894K427J21J3656P674p566j7916r607n554
5875c6442J1911J0943m464J6m666l122k889L594R361N695k900l939Q271K992N923
5860B84j01l550j6569p651R627j4458l96J2957J6169L610n619M623J510j3927
5846a3491N036m674N288R478M930o401l956P518N377o523q816j5674k41O870K010
5831a3269J4863J2546R145J9185o420j6774j8930j6073k2630J690J3197J2402
5819a1068J7223N1p832l314J454m650N097N26p996L257J1186L582J449L366q719
$$ y = [-13464, -12852, -8676, -14173, -17316, -13632, -9170, -6967, 5815, 6464, 3496, 2074, 8681, 9838, 3890, 3735, 16480, 18103, 15115, 19971, 15393, 5301, 4699, -7520, -17490, -16751, -18606, -21570, -21730, -24269, -7616, 442, 1271, -6661, -8375, -11138, -22571, -19677, -17250, -17129, -3473, 4201, -3365, -21281, -30888, -36442, -24531, -13588, -18052, -18036, -22702, -25824, -28713, -25119, -15758, -10063, -12963, -16902, -8631, -5639, 284, 183, -3367, -19936, -27587, -17960, -32418, -32814, -19857, -3688, -78, -5697, -1074, 436, -13491, -8455, -13129, -7841, 1637, 6567, 166, -3790, 3728, 9105, 2582, -6234, -21908, -22149, -15279, -13269, 1594, 14140, 23285, 42470, 36050, 19276, 346, -15727, -38357, -36667, -23470, -11068, 6155, 6206, -1626, -4940, -3486, -8136, -3039, -2513, -10509, -7252, 3934, 7516, 8965, 12331, 3612]
5804C612j6008K369R334P989l902q372j0205o392O47K581k679k817M980n686o211
5789c0760J3059j931K2318K8680L5245K8064n655p135q184j6325k9747k7237l0002
5776b9610k3239J7270K4067J9213o718j7229j033M738R754K417k01J849K42p937
5762f417J2421m255q698Q497o280K540n897j9010j616o615j931n862M015J3908
5748b5200R813J632K250Q518J696N568m031J2330L6846L3468O38K44k942j5698
5734F5132l2654k9276k7889j7590L880K5148K2395O75j7237J252J667J2709M740
5721A2952j4903n571J6511m247r157N973O390p301l135m152k518n944L180N713
5707f209J1981L301n390r152j0833j693p116N177R608r685r315m177J4004J3334
$$ y = [3612, -12396, -10027, -693, 7296, 3394, -4978, -15183, -21575, -20928, -18347, -21026, -23843, -18863, -24549, -30760, -17701, -19632, 2686, 31366, 66611, 94675, 89020, 81885, 73701, 57376, 27629, 392, -29610, -52849, -35579, -11512, 7701, 983, -16246, -17279, -12541, -2787, -370, -571, 1278, 1520, -6417, 6004, 1749, -6949, 1548, -4732, -2192, -8089, -27099, -28715, -35330, -37261, -43123, -39108, -25200, -15387, -13755, -11505, -2987, -1291, 4277, 246, 12576, 49422, 82890, 83528, 83772, 80830, 65132, 32478, 3202, -24687, -42277, -38397, -13249, 9146, 9821, -7416, -6164, -4497, 8212, 12952, -1951, -7522, 8989, 4742, -4415, 1558, 7948, 647, -2488, -6640, -9158, -15102, -11922, -6209, 5772, 9073, 3683, -5469, -16302, -17995, -25111, -19934, -10326, -20011, -29326, -33503, -19499, -6165]
5693f165J6380R80j7848q323O740j0930K014o230r522Q300J8746k771p283J591
5679a4321J5159J1559j4611k691l192k62p280L223N785j6023o026R2J3690N477
5665i421j6614j7640K1750K2524j132n125p611M93r129N818J3562J0169L646m777
5651F513j4723j6136m118J5132Q020l216m431R389R329O994P718J6966k631l905
5637C0901j1038j7319n566j533J1010o460q152M890p513n762M543m842k391P18
5623a8514j293R091J0074n714K612J0141j672o938q343o641q215R546J1382r031
5609a3515j0938L345J3074k992j0478n089J8270J7959l050L623L164K701m584
5596A1490J467j1116L385o347j2005k512R178J0148N193q955Q622M394q626m410
$$ y = [-6165, 10215, 11195, -6653, -14976, -8236, -19166, -17152, -23382, -32904, -24604, -5858, -8629, -15912, -14321, 838, 12397, -2214, -4905, -8097, -8359, -15639, -12416, -6631, -22654, -28680, -28588, -14898, -9421, -26035, -43675, -21925, 599, -533, -5658, -13269, -12776, -21905, -16087, -2525, 7644, 11290, 6513, -8210, -24346, -28464, -13332, -5312, -8528, -12959, -3570, 5759, 12753, 20471, 37437, 34806, 30901, 19863, 2544, -3022, -4555, 6455, -5, -8157, -3267, -10780, -16542, -11999, -16841, -19232, -18514, -19807, -10716, -642, -6356, -3744, 6397, 4725, -2213, -10556, -17197, -25412, -15866, -4484, -13515, -24453, -21108, -8034, -11026, -21504, -26593, -8323, 9636, 6586, 10209, 13373, 16074, 11490, 12957, 1841, 5226, -1121, -13126, -15638, -6460, 3688, 8881, -74, 8548, 12942, 4316, -94]
5582i4j483n038J876l386Q506L304J0490p202j1880j987j904n179J509P635J2967
5567H134N607r729l455P66j8611L341R793Q019J1871o393J0277p077j1136K0n964
5552d537J799p967q515J502j26k782K626k000O711j309O993J2993K910M025J174
5537A3497p765L585N447o145o358J39o025R251O28l230j732j733q782l70M290
5522e303k93J883q312M12r09j0348l251L777r007J1731K0026K018l366q442j1330
5507b0714Q510K377J579R426j324k968q986M298K225j660K84p990J0364Q582L668
5492G671K565k787r019L269J095K983J4018K030L389k142k744j4738j2516n819
5478a2745p463K294L754L800l604l016Q687N494o961r40J2339j4803m618K87k290
$$ y = [-94, -1577, -6615, -4739, -8125, 381, 3685, 14175, 6973, -4907, -6894, -8798, -13977, -12468, -4833, 8134, 13741, 4012, 557, 1323, -17288, -13947, -4154, 3865, 15736, 9343, 19620, 12543, 1407, 1427, -4537, -2738, -10705, -19220, -17718, -17844, -20626, -18000, -20000, -13289, -14598, -7605, 5388, 8298, 12323, 13497, 5732, 9317, 14764, 8619, 2261, 2400, -3625, 5626, 6254, 3024, 1292, -441, -9223, -9593, -5303, -5596, -3713, -12025, -11613, -12522, -22870, -26121, -22344, -31351, -19620, 406, 2424, -942, -9384, -20714, -12204, -9827, -8248, 1178, -146, -3114, -12100, -7802, -5577, -7237, -6953, -14943, -4579, 4003, 7671, 10236, 7449, -1570, 1699, 2794, 5777, 19795, 21825, 25214, 23072, 20328, 5590, -6926, -12745, -20208, -17914, -14160, -10360, -13964, -16980, -8293, -2799, -9760, -10700, 1639, -13164, -17782, -17495, -19785]
5463a9785K792O294M702J7090R030n797j5380j2053q514M743J4089J2945J0484
5450B0640q506m382l3j1256q561L074M898k408p793q58M629o323j921M573K60
5435a3967J3701j651m119M775o305m04l704l392K828l037m776J965J2364K967
5421b755n854n77N535M750j0149j6981j732N867J1291J5103j765M998o197r87
5407E47k275R438M359j7776p042O58p456L355k197p545q185N655P310J1623L040
5392f491P631p181j8223j294K441J1541n06P467J775j1151j844J6828l471o499
5378h977p723j566M355K803p02l477j3392j6765j492J1855K0297K0518N637J097
5364A2468N35J602j2374j8686n361O422Q437n083n110m052j2573j020N038p823
$$ y = [-19785, -16993, -10699, -5997, 11093, 20123, 14326, -1054, -13107, -21621, -16878, -2789, 10156, 20640, 12134, 7752, 7719, -3537, -12098, -9024, -4126, -6534, -14327, -15185, -10556, -16879, -18800, -14227, -13967, -266, -1917, -6036, -1261, -7566, -7970, -11674, -15066, -12238, -15275, -20051, -18086, -5722, -2755, -8609, -9186, -3651, 1099, -9050, -26031, -27763, -21896, -10605, 4498, 2733, 7731, 1534, 547, -1728, 7710, 12069, -5707, -12749, -12091, -19547, -16192, -18389, -25934, -34119, -28464, -21154, -9531, -6491, 1140, -6041, -24264, -25558, -23117, -11576, -12082, -4615, -2840, -13991, -15835, 993, -2478, -8977, -16700, -18266, -13911, -11108, -11810, -15287, -28679, -45444, -46936, -35081, -14784, 5734, 11371, 12468, 13003, 14605, 2231, -16455, -21816, -15394, -6957, -12040, -17150, -21202, -33775, -34795, -29757, -37580]
5350c7580J0749K1755P376K438r390k259P559K120l082l557n571k314J0527j4064
5336a5293j4976o924L0752J4836k930o794K482N175J120P135Q302k270N205O245
5322C2065j2922j1469k671j0683m296K00K656M312j596j1714n934J0589R752J1875
5308A0164k744o962m631j5173p012O825K900P555L817m877J638j0055o786N318
5294b0023J2478K545p872N561J6446O941j874K057K832R135k181j1621m866j2360
5280b802l899o544k590m0l714m47M733m538J866n57m877Q423J4502J219K919J2619
5264A6273O967l257p087L872l414q496j5576q556o257K56R708k766M851J4592
5250A110R104O579L756m184j8577J784k85j658r726k5080n781m501O425J4336
$$ y = [-37580, -26831, -5076, 2300, 4738, -4652, -6911, 648, 2768, -314, -3871, -9442, -11756, -1229, -15293, -30269, -37193, -6441, 8395, 5465, -1329, 1153, 6328, 7448, 14583, 22885, 20615, 25820, 32065, 19143, 7674, 5003, -5680, -9976, -9776, -7120, -2808, -4404, -16118, -22052, -11463, -1711, 10164, 7420, 458, -4173, -19346, -26358, -19533, -16633, -9078, -5261, -10138, -8500, -18555, -25341, -20023, -7545, -5000, -12872, -7311, 9135, 16076, 14202, 16259, 19091, 28226, 26045, 14424, 9558, -2802, -6701, -13245, -15835, -15875, -19589, -20036, -15303, -19841, -17975, -18532, -23409, -14986, -484, 735, 3654, 16273, 23240, 19983, 12896, 16768, 13354, 4858, -10718, -19274, -25531, -25275, -15567, -18333, -13482, 1110, 10214, 16793, 20549, 16365, -2212, -428, -713, -2371, -12097, -37177, -42958, -47459, -41034, -26698]
5236b6698K0018m327j1558J0279J96P593N283j3863j432M174J061L886r105j5225
5222b9718P873K2193K183j0164M71l468Q70j0109O321O225L727K343Q714L742
5208A1203m280o948j3794K342J6945l262j4715j3371k226J5789J0573l939o402
5195a2085N551L348j008O239j278j4915n010N336m095m599m65k264J0755O111
5181h379J7236q671p110r925o290K608k431q490o494M093R660J2638k009R18O274
5166f372j827m899L437R97j939K647N54O742m048L803Q982P247k572m863m749
5151C140n024J426p351q651m622M36p873j0781n483Q021J4782R152N085J2701
5137D958L392k786j4202j028q91n999l118k27N7J5729R557j5675n768o3M531J821
$$ y = [-26698, -6680, -11007, -22565, -12286, -12090, -4497, 786, -13077, -14509, -10335, -9274, -5388, -14493, -29718, -21845, 348, 2531, -7633, -7162, -10630, -9760, -19869, -13548, -7323, -3596, -1253, 7461, 11203, 6923, -25, -13819, -11477, 5468, 2206, -12509, -25880, -28106, -12317, -1744, -5683, -12085, -6534, -3186, -4194, 2045, 767, -14148, -19158, -13822, -17917, -22516, -22981, -25245, -14490, -8379, 8857, 186, -6924, -16849, -23139, -20531, -22962, -31452, -37946, -33853, -24193, -11555, -13564, -12646, -6372, -8199, -13098, -9661, -8664, -10603, -7956, -7402, -660, -4708, -905, 8077, 15324, 12752, 7889, 3140, -1884, -458, -7809, -16460, -21082, -20646, -28519, -39300, -44783, -36762, -21980, -12828, -7743, 4958, 8350, 5564, -8638, -9666, -10557, -16556, -19674, -19901, -19844, -4115, 5442, -10233, -16001, -16064, -11533, -9712]
5121i712p32p112k428M510N12R629j022N551Q691l140o626j9108O051L896N05
5106a0535n660k528j502k16K2701J2710q735K267k883j4018l383P428J62j0283
5092a4475J1168N3k593j6650J614J3064O036N72n282j4038o670Q693J1712n946
5078a2742n21j497J514Q506P598m61l956M639N677j364Q35r471J94N457l484R3
5062A017K737r529n682J001m813N289J587o509N586J2487j1010p281N664N407
5048d049n218n989R651o117r489N904L095J094J927J067m320K294m881K130J4148
5033A247J3979p048j0921j0634p092j1318m91l264N114N419K1329M068n697q028
5019a3337J3722K653p674j0351K569m122j1232J8757Q888p289j84N9q985J215
$$ y = [-9712, -10444, -17556, -19984, -15474, -14962, -5333, -6355, -804, 7887, 4747, -1879, -20987, -14936, -11040, -10535, -16195, -18723, -20225, -20441, 2260, 14970, 6235, 8502, 5619, -8399, -11782, -4354, -4192, -14475, -3307, -3254, -5847, -22497, -20883, -7819, -1783, -1211, -6493, -20531, -27201, -18508, -6796, -12742, -13263, -14760, -13246, -4740, 2858, 2397, -1559, 3080, 8757, 7393, 8228, -1243, -1049, 4408, 924, 1017, 3754, -5775, -11457, -10456, -15269, -9980, -8393, -14902, -9316, 3171, -7839, -15120, -9456, -4049, -9267, -15256, -5605, -11722, -21211, -15307, -12212, -11118, -9191, -8124, -12444, -10150, -15031, -12901, 1247, 15226, 8178, -2743, -13377, -20469, -31787, -32278, -35542, -30428, -25009, -3680, 388, -5309, -13337, 385, 3038, -4636, -14987, -12418, -16540, -27772, -9015, -127, -7416, -7600, -7541, -16526, -15311]
5005a5311N524P037J5123k467k549n562J586j125j4770k252M305Q723K573m712
4991c877p592J854r567m559O525O694M902N397O657j2313q620R762P443J406j2158
4976h046J671J625M890k236J518L462r401K041K639j6502m496N194M332J1815
4962a494Q258J2392m280r521j0677n754K124k518Q77j31Q541J952k99J1416N72
4947A1458j0173j2259m215K51M180L448N195J416j3202m71L762l714m492n478
4933b4294J0099J1709N73J860m146j884k587Q859J264q193N301J1276j067j989
4919F781L06k587p617j5567J0046O644j92k850Q699M761O394j0975o73N968k756
4904F382o327r682N779J153Q281m751j6753l48J1900J0356o020q074q1J810j0457
$$ y = [-15311, -9787, -2750, 12373, 9906, 7357, 1795, 3381, 2256, -12514, -14766, -10461, -1738, 835, -3877, -11469, -9615, -19182, -23741, -17216, -10522, -5620, -223, 6434, -5879, -14499, -4737, 2706, 4112, -8046, -6375, -4750, 140, -2096, -578, 2884, -6517, -4476, -1837, -18339, -22835, -17641, -13309, -1494, 6764, 19156, 14876, 5355, -5322, -11076, -8952, -11470, -10593, -10724, -2183, -231, -530, 10886, 11458, 1285, -10974, -15189, -14938, -10758, -7310, -2115, -699, -13901, -14372, -10610, -14324, -18816, -24294, -14195, -2486, -1913, -53, -4199, -6083, -8670, 189, 1453, -6740, -1439, 9837, 8770, 6781, 7087, 4500, -3117, -18684, -8638, -1994, -2186, -5036, 3663, 8424, 14818, 3843, 3170, 9138, 6382, 55, -9627, -3848, -2695, 5586, 835, -15918, -16266, -4366, 5990, -30, -8104, -8185, -6375, -16832]
4889a6832j936L079k487M636J1990J848O206p721K457p335l828J508J2911R446
4875A3942m49M096n317k0120o814o244j345O565q66N698q305j3062O987l714k876
4860c1824J5033O848J053l991k853J0294J648o416m438O367q60J646J0856M648
4846H011j3110m132L489k177O930k487o677n328r34L544J610J200j2118Q54R897
4831a1428k754K644K746J032L146N172n133j5957k325P317k729n118J4607J0522
4817A742j29j31P909j2409m176p227j7470M94R791O162j7098o407J3461J6130
4803i358J2675J1200R287r78k5021k318l256J075q276m941J197N827n889j2693
4789c1469N260J0239J810M603O944K787n310o791N442P557L347O316q497q2P370
$$ y = [-16832, -18768, -15689, -18176, -13540, -1550, 298, 6504, -1217, 1240, -6095, -9923, -8415, 4496, 13942, 13493, 17589, 12272, -7848, -14662, -20906, -22251, -15686, -16552, -10854, -19159, -32221, -25234, -28948, -31824, -16791, -9943, -8890, -12881, -15734, -5440, -3792, -10208, -14646, -8279, -9139, -7493, 3363, 8011, -5099, -9231, -5742, -7919, -989, -3476, -10153, -15481, -16415, -12871, -11261, -10061, -22179, -21325, -11428, -14182, -11538, -8792, -7760, -4614, 558, -4575, -20532, -22857, -15540, -18269, -23387, -8780, 1742, 1613, 1482, 9391, -3018, -7194, -14421, -31891, -31397, -21606, -15444, -32542, -38949, -25488, -9358, 3317, 14517, 23804, 22826, -2195, -4513, -7769, -6694, -14970, -19911, -18714, -12887, -18776, -31469, -26209, -15970, -14160, -9557, -2613, 174, -5136, -11927, -6485, 1072, 4419, 10735, 2238, 2156, 9526]
4774I526r528q05p100L013J1575j0628o568J11J31j522Q04P593J6216J762m281
4759A0299j4578k0299m395J7120J6664j425j5119R76K598r497q404O280K102M096
4745a3582J47j847K845O409K498J0677N395K423m45p865j6994J1501j30q629M815
4730b782K561q484j3488P801J0053K309R47J1031M449p20j109j1821p466m548
4716a1267j954M785R557l745l956o780O719K555j613J0497O777q940m814J6204
4702A4025O11o547n927J566O346j767J700j892k115Q24N27j9926M951N469o87
4687b842Q801R027J2167j9768j0777j437M055m862n100j4797j476N821J887M593
4673a4708P882P113J62K466K83p377j0546j102K984m497l460J0086O611q085O46
$$ y = [9526, -2, -807, -7907, -4894, 6681, -3947, -10515, -10404, -10273, -11795, -10991, -3398, 12818, 14580, 10299, -4279, -24578, -28973, -11853, 4811, 3386, -11733, -10757, -8159, -17656, -26060, -19780, -17678, -13582, -13435, -15282, -12437, -6028, -3530, 7147, 12542, 14965, 14520, 6655, -10339, 1162, 1032, -7597, -2782, -221, -8705, -22193, -14392, -4339, -2030, -1083, 9948, 14397, 13677, 12568, 747, -6719, -11267, -13221, -8436, 1121, -2624, -6580, -13360, -6641, -4086, -5699, 4798, 11575, 2635, -2179, 14025, 14636, 8089, 2162, 3728, 10074, 8307, 10007, 8115, 6000, 6824, 7351, -12575, -7624, -2155, -2842, 5959, 14986, 27153, 7385, -3392, -4829, -774, -5636, -10736, -25533, -27009, -21188, -19301, -14708, -6826, 287, 449, 2915, 3198, -4179, -14725, -15827, -12843, -17340, -20800, -10714, -4103, -12188, -11542]
4658a1542N015M29j1416k054K046k839j381k733Q933K2592J3457q750n541j9164
4644a2948q668O157N419P090J150j454k926q126k760R012J4075K129l509l101
4630A540j1549L813L76j5918k2Q475J9932N01p378j826M722R716O279o762j2673
4615g74j0926L914M675P917q8j1502j1151L955J8214P835R87j9811j029Q304Q338
4600H858K87j3682n526o21J817k745K754J0262J0122Q440j0551r864l058j124
4586d631o717J2304K031m376k080k474k599Q949r73q283P62p391O96K916N592
4571f274J4522p254n425m251N986R363M828l947M76n410m558r794K921k169p381
4556a8367K892J0133O563J881Q331Q232K705j570J72o411k866r08r143j972P826
$$ y = [-11542, -6527, -6098, -17514, -19568, -17522, -20361, -21742, -24475, -15542, 7050, 20507, 11757, 6216, -12948, -21616, -15459, -10040, -2950, -1800, -3254, -6180, -14306, -17066, -8054, 6021, 8150, 4641, 1540, -10009, -6196, -5820, -21738, -21760, -13285, 6647, 7148, -230, -2056, 2666, 12382, 18661, 11899, -774, -11700, -7786, -3111, 4806, 4718, -6784, -17935, -13980, 4234, 12069, 13056, -6755, -7784, 520, 8858, 9145, -4537, -10063, -10684, -8867, -11612, -8858, 1404, 11526, 19966, 9415, -449, -3507, -4631, -11348, 956, 2987, -1389, -3469, -5943, -8542, 407, -566, -8849, -8087, -15478, -14782, -11866, -6274, 8248, 994, -4431, -8682, -2696, 6667, 11495, 7548, 8024, 2614, -1944, -11738, -8817, -10986, -18367, -15475, -5342, 1221, 3102, 11433, 19665, 22370, 20800, 20972, 14561, 11695, 10787, 1644, -328, 7498]
4541G498j391L254M13k211m348j1240Q818Q061o716P995n049k091N739k218N056
4526A1570p979j6198n09Q326r872j595J1748J005p390j3157N659P906J2261L580
4512E355K432j0576j9677j541R285J0154j693j628J145j1446p493M119M109M350
4498a3105J972K783J0108j03m912Q211l540n9L968j541r945k738j1760Q715q126
4483b0072n089M094J8435P196O153r733q528j596K098m18K763m042PM272K834
4468a626m783L568L512J485k729o27M244p884P124J525r419K013o0m314R539P098
4452H666o5o101p449j1449k717M237J1260N126J3208m282k3036n117Q480J2480
4438C241n337P768M386n352m467q426k582p16j942K422L009j27j757K0759R71
$$ y = [7498, 6107, 9361, 9774, 7563, 3215, -8025, 793, 8854, 2138, 10133, 5084, 2993, 8732, 6514, 11570, 3591, -12607, -13116, -4790, -14662, -16257, -4509, -3504, -10894, -24051, -18392, -10486, 1775, 5355, 7787, -2789, -22466, -24007, -14722, -4568, -6261, -7889, -6744, -18190, -25683, -21564, -17455, -13105, -11133, -8350, 1758, 1655, -3257, 4954, 1414, 1355, 5323, 3782, -6163, -8901, -20661, -11946, -20072, -25161, -21067, -2632, 4564, 10717, 984, -7544, -9140, -7042, -7460, -4697, -8739, -8732, -4460, -1626, -6409, -2841, 671, 2156, -573, -1200, 3044, -4840, 2284, 3809, -5610, -3597, -3657, -7971, 1568, 8666, 8601, 2500, -4949, -16398, -19115, -14878, -3618, 1508, 14716, 10434, -12602, -17719, -9239, 3241, -2096, 5672, 10058, 4706, 239, -8187, -10769, -11485, -13427, -11005, -7996, -8123, -9880, 10879, 11850]
4423A1850k1173M071K050j7402l776J3130N205M917n469J260R723L612m168j4339
4409a0509k316M016J5899J3476O95k704p733J311n781j3262o389M521M991r91
4395d776J205R043o013K937j2948k214R329J1978k551p160J557O938Q531k094
4381A3762q167p077j1460l637R632R288O164j1235O935k951k227j1721O443P023
4367G72J73m892k539n6J2340O181J747n005j3579p859N534p634n958M432J2593
4352c750k577J595l38q276o474P560J8462q80m778K54J431j3080J9751L867j2059
4337G08n743l794q355R649Q701j4560Q719L207m514r061q460K471R541M748J651
4322e092j340J1388J0146J3247L991j1877m651j7079m029l229r464k156N514K543
$$ y = [11850, -9323, -5252, -3202, -20604, -24380, -11250, -6045, -1128, -6597, -5337, 4386, 7998, 3830, -10509, -12825, -8809, 7090, 20566, 21261, 18557, 10824, 12135, 6354, -6908, -13297, -8776, -3785, -4776, -3571, 5472, -541, 2396, -10552, -12766, -3437, 8541, 5990, -1170, 387, 7325, 15856, 13762, 5595, -1482, -12942, -16579, -6947, 2341, 8505, -2730, 4205, 1254, -973, -12694, -6251, 772, 945, -3947, -6486, -6542, 5798, 11979, 13726, 8721, -4858, -12717, -7183, -14817, -20775, -16343, -3750, -6327, -4732, -5070, -13346, -19820, -12260, 6202, 5322, 544, 798, 2229, -10851, 8900, 12767, 708, -5035, -8829, -17184, -7535, 1166, -13394, -4675, -1468, -5982, -15043, -23503, -21032, -11491, -6743, -5092, -6432, 4956, 15102, 28349, 32340, 20463, 15812, -1267, -5296, -8525, -17989, -20145, -14631, -12088]
4308a2088j2277K50N869J3390N535o635j316N428M012o325N632J0266L634k917
4294A2458j3257n877l505Q448J491N859M10O541Jk741N193j7837q064m124N633
4279i371J914P271r319j1331K856L609K045R989J257j5062o465M433p553P968
4265a7759L788L877K288j2968O892J5429M650O111N696r111n011l759k071p609
4251i557k508l573j1035r38R613J0928n243j761J2173m70r814m290j267m019R955
4236a1806J1160o51k0720m783P579P63m156O360P753j440K903J987J051J172N069
4221B241J0769n812o73r770m382l229o236J2406q2k763R621O742j185o714k895
4206a962M037O805m979j5885M102R62R150k299r497j0748p211J0003K0806J929
$$ y = [-12088, -24365, -24115, -18246, -4856, 679, -5956, -7272, -1844, 2168, -4157, 1475, 11741, 15375, 12458, -799, -6676, -10181, -1733, -242, 5617, 6027, 12568, 12569, 9828, 15021, -2816, -10880, -15004, -9371, -7457, -186, -9505, -20836, -17980, -14371, -12326, -2337, -1080, -16142, -22607, -18174, -25727, -17759, -13971, -10094, -7806, -20774, -13882, 1547, 6197, 12308, 18004, 8893, 3882, 123, -1948, -9557, -12065, -15638, -26673, -27611, -17998, -7070, -12313, -14074, -1901, -2371, -12185, -16475, -17742, -21761, -11806, -646, -1297, -22017, -26800, -19221, -18458, -22614, -16254, -8501, -9941, -7038, -5051, -4000, -2828, 2241, 13010, 7198, 6525, -3245, -7627, -10856, -17092, -4686, -4768, -7531, 2090, 8832, 7647, 933, -1962, 2075, 8880, 3901, -11984, -7882, -6920, 2230, -69, -9566, -20314, -27525, -17522, 3284, 5213]
4192E213o507p194k07Q195Q628j722M155P064K378o116l965L887k2k864l441M575
4176A2057N802q751l163J919j6262m182Q493J2709R449j1047j851K976M398j4009
4162a462j5394K790j091l368J3867J509k616O984j2807j3074N723J4036J7088
4149A2185J278n971l738N334j558n430p264J2190k937k4397p994O619N757N144
4135a0782r514J641R001N195J2793n029l183l120m397k257L23p807k370j024L51
4120b0179P808J2184Q934r258j669J555l445m889l383M251j1825m822k708K0970
4106f476P289o511J976o619q653p269K292k709Q652O447L764q478Q792M899r782
4091a2386M596K2856n460m43q60J3470j0509k955o70J235j0814k492L208J3303
$$ y = [5213, -1294, -8488, -8695, -500, 8128, 6406, 10561, 17625, 20003, 13887, 9922, 13809, 13787, 10923, 7482, 12057, 17859, 9108, 5945, 7864, -8398, -12580, -4087, 8622, 18071, 7024, 5173, 8149, 12547, -1462, -16856, -14066, -15157, -18525, -4658, -3149, -5765, 1219, -11588, -24662, -18939, -4903, 12185, 13463, 7492, 3754, 9088, 7530, 2100, -5164, 7026, 4089, -20308, -28302, -21683, -15926, -10782, -20296, -18655, -9654, -4459, 8334, 3305, 122, -2998, -7395, -9652, -9329, -17136, -19506, -20530, -20179, -12371, -187, 8747, -511, -2180, -625, -4070, -8959, -12342, -8091, -19916, -24738, -27446, -6476, 813, -5698, -3722, -10341, -18994, -26263, -23971, -26680, -18028, -11581, -7817, -16295, -7503, -2604, -12386, -7790, 15066, 9606, 9163, 8303, 21773, 11264, 8309, 7639, 8874, -1940, -4432, -1224, 12079]
4077A2079O627O640Q512j8238j1793l869M647M101q670k4907j3533J0157J0599
4064a7648O205p884J4286J8195k453k1587p303n383q930k77J2615Q805J414l085
4050a3030L793l448P269L882l342r38n864m8Q243n316j0795L464k279R058J2419
4035C068J886l036q236j6831K897K2282Q317L079j1510m680J270j0567k386L759
4021a0688m642M155J6951N657p923j2580j1782J6164J7105m885j2645P592L892
4008F371n056m063o928q281P610N229L652m160j2014n457j854K300J0290j0814
3994b3175k784M409k11L040R208q390k33J1840O476R649N70j1004n305R649J2790
3979A6529R990o734j4420M332p143n768J04M515O505L785j0192o660m485p064
$$ y = [12079, 18706, 25346, 33858, 15620, 3827, -42, 4605, 8706, 36, -24871, -38404, -28247, -17648, -11443, -19327, -5041, 13154, 10701, -10886, -18189, -23572, -32502, -32779, -20164, -11359, -9945, -13030, -9237, -12685, -5416, -1534, -4876, -5814, -11678, -11726, -3483, -8799, -19594, -16130, -18409, -9351, 3068, 4954, 1918, -6318, -23149, -20252, 2030, 10347, 13426, 1916, -2764, -1494, -12061, -14447, -10688, -15330, -11175, 5776, 11433, 3510, -9070, -20852, -4688, 12417, 7532, -5113, 2479, 6371, 1315, -2748, -9676, -17957, -10347, -5118, -1466, -5626, -17640, -23097, -24951, -22651, -12361, -23175, -25959, -21550, -21761, -18721, -9513, -17903, -18136, -6296, 180, 9829, 10399, -605, -5910, 3739, 16529, 26519, 19785, 5365, 9697, 2554, -3214, -3110, 1405, 7910, 11695, 1503, -5157, -9642, -16706]
3965a6706Q630N757m891o346J78J6113M714Q83j3624p259p99o154l589M891J2899
3950e303j13r796m593Q960R370P739K08p304j2603o871r69J2726M412r438o707
3935b0282K976L337J3879J5209p083j6939L200J2767m504j0753J582j850M788
3922c673p977r649N301R69p921J511N895N386n418O095R163P84k592j239j6009
3907a9374R34Q653P555k119o694j562J06m474J2183pr117k716N997M437M198M440
3891B440m177o68o803j1912j5J4401J1662k522j7650K51L691N905m651M594N21
3876d933n340J409J6098P248N638n180k5206j0696Q056r903q813J0997Q040k220
3862a4805M871q564r459L428J420m501L765J5770O736L796j347m661J0666J0391
$$ y = [-16706, -8076, -2319, -7210, -13556, -13378, 2735, 7449, 8332, -5292, -12551, -13350, -19504, -23093, -18202, -5303, -5416, -15212, -19805, -10845, -1475, 6264, 6472, -832, -13435, -20306, -21275, -8549, -4137, -13575, -20282, -17306, -13969, -90, 15119, 8036, -8903, -5703, 7064, 2560, -8193, -6611, -8461, -3673, -11650, -21299, -15998, -15029, -22950, -21439, -15544, -10158, -15576, -9481, -318, 466, -2126, -3365, -19374, -18440, -9787, -2232, -4351, -11045, -12607, -12501, -16975, -4792, -4799, -13916, -16632, -10635, -6198, -2000, 2440, -1737, -2405, -9208, -21120, -21135, -6734, 4928, 2406, -15244, -14993, -11302, -5397, -10048, -5454, -4933, -10273, -8864, 7234, 14482, 20120, 14940, -10266, -20962, -12906, -22809, -31622, -20625, -12585, -14805, -9934, -18498, -27957, -24529, -23109, -27610, -23845, -8075, -1339, 2457, 1110, -3551, 7115, 17506]
3848A7506l496p542J392r588j2507Q780K304l312K822M84J001J2493l074o498
3834G65k112L389R32o39N628J56k267k236M73J0712L102j4500q967L373K448p02
3818d45j259Q977j441k531m675j8404L894J951N715O582Q384O907p498m941j615
3803c99R734J2395m858l061l130q289M897J596N004k685K820j172k2340l072J2258
3788c02J8848o886l318m506n735Q692P09J634J37J943q758j5196J3414J0784r664
3773A796j2364L308M643n13r72Q025R116l416j4561m858J298Q944J05J885L040
3758E476n739P008r725j4137P69j076M948k002Q899j973J1209K755q63J996k943
3743D602r738K377k34p571m443k106M48L162l576o744M296J1942m494j430l694
$$ y = [17506, 14010, 6468, 7860, -1728, -14235, -5455, -3151, -6463, -3641, -3157, -2156, 10337, 7263, 765, -1347, 2042, 2974, 2335, 7963, 8119, 5852, 3616, 4089, 14801, 17903, 3403, -5564, -2191, 257, -445, -1704, 7273, 5832, 3301, -1374, -19778, -15884, -13933, -8218, -1636, 6748, 13655, 6157, 1216, -399, 9335, 21730, 16872, 13811, 10681, 2392, 7289, 8885, 13889, 11204, 14024, 12852, -9488, -12560, -302, 18546, 11660, 8342, 3836, -1899, 6793, 7502, 9136, 9273, 11216, 2458, -12738, 676, 11460, 1796, -10568, -7260, -2617, -3130, -4102, 3923, 13039, 9623, -4938, -9796, -8498, 446, 551, 2436, 5476, -263, 6745, -2980, -17117, -16348, -17424, -12476, -14478, -5579, -7552, 3657, 6412, 5549, 7545, 4602, -5136, -2759, -2993, -10564, -15007, -17113, -16665, -13503, -17079, -23823, -19527, -7585, -12079, -13509, -17203]
3728a7203n71Q559J156l970O221p614j0756Q309J0098K518J1770j262j845R090
3714A4500N532n194j5001L075p227p851k99P653P645p10o03j609P836n716j069
3699I62p963j6981J0568P039M913O353N799l004r997L724K932L509J461j379q78
3684G058P704L541l127N866N36L77m152j98q616m499r42p594m0Q102j852J903
3668D067K338L277o171n929M06L811P016O42j1389j878N053J5513r382n476j157
3653G41N166l252Q572M848j775J784k057q569R99K9N142j0624L052m435L678k168
3637A131O897L328j6137j0817L039O546m689N280O770M491r875k1403m467M839
3623b5067J9486R691j6913r199L732ol349j1412L515J8862O294O739q396j585
$$ y = [-17203, -17774, -9215, -8059, -12029, -5808, -13422, -24178, -15869, -5771, -3253, 8517, 7255, 5410, 14500, 20032, 14838, -163, 2912, -4315, -12166, -12465, -4812, 2833, 2123, 1520, -89, 7747, 2031, 962, -7001, -23982, -13414, -6375, -1462, 4891, 10690, 7686, -2311, 1413, 4345, 7854, 9315, 7936, 7058, 14762, 18303, 15176, 21042, 21578, 21955, 17803, 17605, 8989, 4490, 3548, -4046, -4086, 4016, 2164, 4067, 6405, 9682, 3511, -2418, -2012, 1799, 8815, 9457, -1932, -3810, 1243, 16756, 7374, 1898, 741, 5907, 2655, 11227, 16075, 14300, 16084, 14027, 5458, 6457, 6486, 11628, 1004, 4056, -379, 3299, 1131, 8028, 11356, -4781, -15598, -12559, -6013, -10702, -5422, 1348, 5839, -4036, -25439, -29906, -25067, -5581, 4110, -12803, -22002, -18270, -18276, -21625, -33037, -29522, -10660, -4366, 2373, -6023, -7608]
3609g608P358L246o101N45q178n145o082J0494Q785j5599k052J4333j2173n047
3595b3224N5l479R012P354L401O09K154j0650p511J1571R741J106J782R282j1926
3580g23q591j979j3836J2610R091p334M00p464K661O105J1961J732l273j030J2948
3565A3278J134r492M949r4J689j1987Q768J0101r34k333k531j5851O886o395L670
3550H58l694r310J5502P220k835p829j2696l603R790L800m179L793N5N747o557
3535c938o456j1444M866r486P729J4312J3262k885J2952j5577j4576J959J1369
3522B087l33p613R81p233j679J6019p88q809N62O167m964m988N894J718j775m979
3506i733J760J864J4981J0357n74j5160k940l676K235R514M569n34P95m609j0446
$$ y = [-7608, -250, 2996, -3105, -2560, -10738, -15883, -21965, -11471, -2686, -18285, -20337, -6004, -18177, -23224, -23169, -26648, -17636, -10282, -6881, -6272, -4118, -14768, -22279, -10708, -967, 139, 1921, 11203, -723, -9314, -11293, -25129, -12519, -3428, -10762, -10362, -17826, -15165, -9060, 2901, 4633, 1360, 330, 13278, 14412, 4920, 9869, 9775, 11464, -523, 8245, 18346, 17412, 15079, 12548, -3303, 3583, -2812, 858, -2836, -12146, 3356, 10576, 7741, -88, -12784, -16387, -6597, -2797, -6976, -3183, -3128, 2619, -3938, -10394, -21838, -16972, -26458, -18729, -4417, 8845, 5960, 18912, 3335, -11241, -9282, 2087, 1754, -5859, -4878, -12111, -13790, 2229, 1441, -7368, -6806, -639, -5603, -10591, -4697, -2979, -4754, -9733, -7973, -6109, 8872, 19229, 18655, 3495, 555, -3121, -886, 8628, 13197, 12663, 13458, 8849, -1597]
3491a597j8875m515M735J2572j675M808J2520Q468N11n653k601n261J74O074o508
3476C177K49P68k782o101j2716P274J2140n399j6932J1697Q70K16j535m111K355
3461a0830J006R800J8021P625R61j2617j810N103K829j0446N313R719o592n845
3447A2237m356j765O662j292l348r853l262j4678Q212j337o795L054O360L283
3433f878N392k913q137N24M687O19O673P195K621N373J415j384O051r723L328
3418A4843j064q888r970n413Q530J1673n622j3462M817O021m443J248J2757L428
3404A4455j2599m967J375M157O761M411o929q673J0J375P210K6058R654q877j4546
3389A8875k6000k5623q484P184K3472J2081L207K100K848j2613J534N69l293O255
$$ y = [-1597, -20472, -24987, -20252, -7680, -9355, -4547, 7973, 16441, 16952, 11299, 8698, 3437, 3611, 9685, 3177, 3426, 4194, 1412, -4689, -17405, -10131, 2009, -3390, -20322, -8625, -7755, -7539, -9074, -13185, -10830, -9824, -24, 17997, 25622, 26583, 13966, 12156, 17259, 20088, 9642, 14955, 24674, 18082, 12237, 7881, 6116, 12778, 11486, 8138, -1715, -4977, -19655, -11443, -12780, -19575, -16521, -10161, -6878, -1486, -4399, -12536, -12012, -7325, -6706, -33, 7162, 9783, 15156, 16571, 15187, 21238, 11515, 14843, 13779, 4891, -5079, -10492, -1962, 9711, 4089, -9373, -4556, 1465, -2978, -1730, 11027, 14455, 1856, -3111, -1736, 2421, 9182, 13593, 6664, -2009, -1999, -624, 6586, 32644, 42298, 33421, 18875, -7125, -32748, -41232, -34048, -10576, 1505, 4712, 6812, 9660, -2953, -1419, -850, -4143, 2112]
3375B112r547l100J2129K558q005j058j844k591L342R307J2399P514j2514k164
3361H538m060Q427l322n023l541j5402Q970N869P986k003J0959R256j3789l996
3347H869k834j4769n465q405j2944j0052J347J0314J593P778J5273l271J3350
3334G84J0423p206k298N308J590n985N620P272m045o16j293Q487o057n817j4082
3319g915l21O061L197o422J036R8J037n689J4359K4674J947k5279k984L100m97
3304F402o101P827R575n474j7341o745q490j3040J66M94J0956K795L000P585J7131
3289H740j050k991j0893M500J3493l58n27j071p370l599M620O68m734l709P648
3274C367O118k408j2526M213O446Q82o91O309j6916p436n111q98J2334N902k484
$$ y = [2112, -7435, -10535, 1594, 4152, -3853, -4911, -6755, -9346, -6004, 3303, 15702, 23216, 10702, 8538, 4478, 12905, 9583, 4560, 1019, -14383, -5413, 456, 8442, 6439, 17398, 26654, 12865, 8869, 6035, -8734, -14199, -22604, -35548, -45600, -44253, -33939, -32346, -24568, -9295, -12566, 784, 11207, 4001, 1703, 7011, 8601, 2616, 8236, 15508, 11463, 10847, 9554, 18041, 11984, 6167, -7915, -8236, -2175, 1022, -5400, -4364, -4266, -3229, -8918, 5441, 30115, 32062, 6783, 3799, 6899, 6402, 301, 8128, 17703, 12229, -5112, -11857, -20347, -33387, -33221, -32727, -21771, -18976, -15976, -8391, 8740, 7690, 4699, -6194, -1694, 11799, 11441, 10914, 9843, 2473, -1126, 3494, 4162, -572, -4281, 3367, 9485, 7077, -5449, -1236, 5210, 6092, 5401, 11710, -5206, -12642, -17753, -18651, -6317, -415, -2899]
3259b899K622K6440J2064q615j3125k2082j8103R209J7770j3839k0420M321K3614
3246c043J6552L420P199r675r7J1856K337n178p783o284j6100K933J2092o23m994
3231B612j0043j317J5251J0889L66o293q504J1042R056m632k0598j5596j234O195
3217a2806J285p404J7543J3355j2852j2962J089L61N852j092Q210J1220j558L661
3203A3902P312l596l713n997R31o600j461N505R984O350j2312l986L169j921M091
3188A1658q059n260j973j4976P34K987J1655m030q485K37M670J1009j212k150
3174c195P332r586q769J188j923l358J0397R450M741P949M921Q6k2519r232L068
3159i450Q823N657j6129j0525R121J3890L769O647J692m327q84j088m872j194
$$ y = [-2899, -277, 26163, 38227, 29612, 16487, -5595, -23698, -14489, 3281, -10558, -30978, -26657, -3043, 13509, 16929, 24128, 14453, 14356, 26212, 28549, 23371, 15588, 9304, -6796, -3863, 8229, 7606, 2612, -7431, -8748, 6503, 17392, 17758, 11465, 2961, 14003, 23059, 18427, -2171, -17767, -19001, -12806, -11521, -18925, -1382, 11973, -879, -13841, -12752, -12391, -6539, -7631, 579, 11799, 10241, 13902, 21214, 17618, 13905, 7908, 8839, 2239, 778, 6283, 16267, 22617, 10305, 6319, 9488, 7567, 11658, 3599, -1661, -3634, -18610, -17876, -14889, -3234, -7264, -15749, -15512, -10842, 167, -1045, -3195, 4137, -5449, -14218, -13030, -14953, -18311, -7914, 1536, 6277, 14226, 19147, 19233, -3286, -12518, -9450, -627, 5030, -11099, -21624, -12503, 1387, 5156, 11803, 13495, 9168, 8284, 7196, 2324, 1130]
3145A130O416q074m961J270n056n228P830N040O363q959M58Q467k267M241L802
3130A0472m991p586j149P62j2823l839J5538J0492N331j1421l867o314J0702J1396
3116A2703l190L442j085j1918j3583j967J2212Q076K460J192R364m921j2155q696
3102h066K853L579N687q42P95r458l432J83J5090J5825q70k533m94q757J801j0192
3086A169N324k895O749L173O083j6635j1330N016P388P140j422M562N95l547j1871
3071e01j508P448r817L481l137j221R676m688j608K622J068l638K409j6760j341
3056a7515J1953J335m742j4767L532O786J1879M753m594j4782R30p281j299K511
3042b1301L486O82O617L343O571K986L63j357K707P525J0773j1766o522P846J735
$$ y = [1130, 7546, -528, -5489, -4219, -9275, -14503, -6673, -1633, 4730, -4229, -3771, 4696, 2429, 6670, 10472, 5481, -2105, -3254, -2492, -15315, -19154, -3616, 6876, 12207, 786, -3081, -9395, 1307, 12703, 9513, 12955, 11870, -48, -13631, -15598, -3386, 4690, 7150, 8342, 17706, 12785, 630, -8066, -5213, -1634, 4053, 3211, 4006, -5452, -8884, -8701, 6389, 22214, 21344, 18811, 18317, 9560, 11361, 1169, 6493, 3598, 10347, 13520, 19603, 2968, -8362, -3346, 4042, 11182, 9760, 14322, 14917, 11370, -501, -2009, 5439, -4378, -897, -4034, -5255, 4421, -267, -1875, 747, 1815, -1823, 586, -16174, -17515, -5562, -4227, -8969, -23736, -20204, -13418, -1539, 3214, -1380, -16162, -15232, -22513, -23812, -21301, -17815, -17133, -10516, -7173, -602, 2384, 2747, 1390, 4097, 11622, 22395, 10629, 4107, 11953, 13688]
3027A3688l027O228K80O766q879j3224M702O49k152J878O798L427j0033j1392
3013d291L034M109l066o441O200L399J2641n773n712J7848q060j0680l012J0495
2999A0691M543j4663r139j257M225K635J0791r757M120K610j1662m351P320m5
2985c939j996J708l916l277R693N77L5j674j0046J0483J0880l939j4691j0012
2971b0114J015p73J0095M754j067J0023l884K212r126K1P296N729j416n844M770
2956C691M91R63k404q38P347K212K104m502j4717j5548m426J5300J2051K137J086
2941D947J983L195j1916j860J1187q01j3199k336J612j910k418k668P5P561P819
2926A271P633r010o109K574j706K33M889K967o248N075J0341m634O28N523j7019
$$ y = [13688, 10661, 16889, 17169, 23935, 15056, 1832, 6534, 7183, 5031, 6909, 13707, 17134, 7101, -4291, -1257, 2852, -214, -6655, -455, 2944, 15585, 9812, 4100, 21948, 13888, 3208, 196, 10691, 15234, 571, -8568, -9825, -5600, -2965, 7826, -1931, 2189, 4799, -6863, -11214, -3894, -3939, -5935, -4227, -8143, -11420, -1727, -1150, -1115, -2789, -12835, -2352, 8528, 4589, -10102, -20114, -19099, -19872, -9777, -5023, -6090, 3933, 49, 2261, -6865, -6844, 452, 6181, 4765, -1079, 3691, 4182, 5145, 2741, 1903, 9250, 11462, 13566, 9064, -5653, -21201, -25627, -10327, 1724, 3861, 4947, 6930, 10125, -1791, -3651, 7536, 6735, -6464, -8800, -7188, -9098, -11516, -14184, -14109, -6548, 1271, 8904, -106, -6215, -3641, -5347, -5114, -225, 2742, -3506, 1569, 11910, 7276, 7904, 13427, -3592]
2911c592R489O952n175n737R8p64j1601j3241J0646L207J444M988J2523J0176
2897A9413O646k561j0712r220k800p22O211M396k995j0526n094j105J603l43j137
2882h946l204Q087L044P683L032m130k496l445J872k471J2885m51k666j1838q560
2867a1604j790l43l488O097J1102r964k432J1959J0868O490L463O139k518n963
2853A8016m9p390j431j8690m074L978J8788M815o571m503k0089J5388Q722n463
2839A447j1398j1314o751O203J6303k919P972k993J4384O093k202J397q421p530
2825B71o400n877m635q073L726M912L322J6108K494O072J735o340K867M241o926
2810G497j2579j284M018l389K95R08J0398J207j9502L03O652j0470k691J3834
$$ y = [-3592, 5897, 12849, 7674, 1937, 2035, 1271, -10330, -23571, -12925, -9718, -8274, -3286, 9237, 19413, 26059, 23498, 12786, 3566, 766, 44, 6255, 10651, 7656, -2870, -7964, -9069, -7466, -7809, -8946, -12150, -4063, -1019, 6664, 9696, 5566, 3070, -375, 1497, -974, 11911, 11460, 8794, -3044, -11604, -13394, -13737, -17225, -11128, -26, -9990, -12422, -463, 10405, 16895, 20358, 26497, 23979, 18016, 17967, 10577, 9146, -9544, -13618, -9640, 9148, 13963, 7392, 2889, -17200, -1812, 6910, 1447, -9951, -21265, -28016, -21813, -5510, -8429, -457, -3450, 10934, 17027, 14825, 16222, 7801, 271, -6129, -12006, -16641, -24714, -20988, -16076, -12754, 3354, 5848, 11920, 13655, 7315, 10182, 14423, 7497, -5082, -6366, -2348, -5737, -5442, -4534, 5864, 7071, -12431, -12128, -5476, -15946, -18637, -4803]
2796d803N176k1405j489j060K463k26p704J330J2579P011p052O126J7756K939
2782A1641p675o600p2l456O356n63N449j3846j3180j760K4572L527p324l261K585
2767c607J299j897L829k379m53J668K105O016p857m615M084P780J4040Q687n609
2752B3091o02r842m301k976l299m530p679k556O704K451j931J9867K642M410p338
2737A4111l456j1197q72k517M448Q551l416q057q615l409J9167J0935R756R339
2723C4768j6173n195k252J187R850J474r458n086K960n230O959N468j3971j0505
2709e204J0983Q455P111k419j0438k882o770j5675K288j961q660J4038J3606n254
2695b782n55J185q269r11J2035N248J5198K712j3485l844j0303j744N163Q982
$$ y = [-4803, 373, -21032, -22521, -23581, -21118, -21344, -29048, -27718, -15139, -8128, -15180, -9054, 8702, 11641, 3966, -2634, -2706, -6162, 194, -369, 5080, -8766, -21946, -23706, 866, 4393, -2931, -6192, -3607, -2308, -4205, -376, -2755, -3208, -1540, 565, 6581, -1276, -5891, -1807, 5973, 20013, 28700, 23091, 22489, 12647, 8346, 5370, 2071, -2459, -10138, -12694, -5990, -3539, -5470, 14397, 17039, 21449, 14111, 10655, -542, -1414, -3931, 517, 9068, 5652, -2405, -11020, -14429, 4738, 15673, 25429, 34768, 18595, 13400, 11148, 12335, 22185, 23659, 14201, 9115, 12075, 6845, 13804, 19272, 5301, -5204, 5779, 14234, 21345, 18926, 8488, 5606, -1164, -16839, -14551, -16512, -25172, -11134, 2472, -2782, -3337, -2152, -10421, -11332, 703, 5951, 21149, 23861, 10376, 6532, -3771, -5515, -352, 8630]
2681H630P821k88j843q321O0n649J85n469P998n223l435j979J2295K561J1616
2666A8959O584k3604j5503q497j1478J2597J4384P173L057m719P682j3385r069
2653a5819J3397K932L756J988P977J206N123r530M100n93m115j510j7493J277
2639g304M154j251l837j797J9688K1771m381k1060l048p427J732J129L820k272
2625h3j0002p82J2852L675K463p344r737l665J956P514k610m520J2855L274q019
2610b173j274k400K528p894r303L454R375Q304M26N940q635J105j326o863J782
2595f954J4078J0994J591l372m427j2975o584p40r752J1697J7990Q875p314q225
2581D882n595K145Q59j2822l132J765M113L590R533o098K113J7343m934j3962
$$ y = [8630, 16451, 16163, 14320, 5999, 6059, 410, 595, -4874, 3124, -2099, -5534, -7513, 4782, 7343, 18959, 25543, 1939, -13564, -22061, -33539, -20942, -6558, 615, 3672, -1047, 6635, -6750, -15819, -2422, 510, 4266, 6254, 14231, 15437, 20560, 11030, 15130, 14537, 10422, 8912, -8581, -7304, -3150, -4401, -8238, -10035, 9653, 31424, 27043, 5983, 2935, -4492, -2760, -1631, 2189, -83, -10085, -10867, 1985, 5660, 8123, 779, -8958, -12623, -10667, -3153, -5763, -10283, 2572, 5846, -2173, -3447, -5847, -3319, -11213, -20516, -17062, -7687, 617, 1043, 6983, -1652, -547, -1873, -8736, -6954, 7124, 18118, 19709, 16337, 11910, -1065, -7649, -8389, -18141, -6444, 11546, 20421, 13107, 4882, -713, 1432, 2291, -10531, -13663, -11898, -7785, -4195, 5338, -760, 1353, 18696, 13762, -200]
2567b00p992O721M787M085J057k134rk170J1363P992K622j2652k1403l624R525
2552b032J8141L341l679l486m433p522j0854O686J870k328M652M970O450j1466
2538C10k635J5045O197p472r6l016r636j2605J714O615j5865o895J3333n333j171
2523b1510J0011J5830L455J797j884j362J272j8887r651P934J3981L727j0612
2510e899N713Q013j481K430p957l200n314j5787j090L74J6057J8763j6221j4164
2496a9763K95J3167J6706K818l905l963j0062M364O526p529n257o335j0220R699
2482a3459J3830N578j3473j637K2007r145m998L588J266K073N277J868j6815r153
2468a3193J876L10J0838r918j212R799M042o232l610j13J104Q030K474P07p0O34
$$ y = [-200, -8192, -1471, 3316, 7401, 8458, 6324, 6315, 4145, 15508, 23500, 26122, 13470, -7933, -11557, -2032, 16109, 19450, 15771, 12285, 7852, 330, -10524, -3838, -1968, -4296, 356, 5326, 11776, 310, -2325, 12720, 18917, 11445, 11349, 8333, -1303, -13908, -12194, -5579, -21444, -28339, -15006, -20339, -21510, -11499, 4331, 7786, 9583, 7699, 6337, 7609, -11278, -20929, -12995, 986, 4713, -5899, -186, 7827, 6346, 8776, 819, -2381, -7695, -23482, -24572, -24198, -8141, 10622, -5599, -19763, -19468, -6301, 10405, 13223, 9318, 5355, -4707, -343, 6183, -1346, -6603, -12938, -23158, -13459, 371, 5949, -7524, -9161, 12846, 3701, -1297, 2291, 3557, 5630, 10907, 12775, -4040, -13193, -11317, -11007, -169, -10087, -11299, -1500, 2542, -3690, -7300, -7413, -6309, 1721, 4195, 4902, 4832, 5466]
2452E466m20j2049r459r249m8J6995J54L982O261L047K485k024q51l814M079N215
2436I770M82O497N908m855R70k349j2999j3232p70Q121O287M704m28k865M07l219
2420B429r369O891J1683q011M85J803o526k740k00J564M138J0666O324k794j17
2405A6226q892j0669M003l314p636l468P809j731P772M841J1147r442p776L983
2391B853K561m435L078n338Q13J5749q15j3025o490N5R005N164j3248j035M100
2376a008j3165j877k808o255q313J9357J2723o268J2509K416J1836Q833p020o380
2362A4580r146J3803K893j1221r659M510J2433j4666j1761o358J661R828O354
2349C251P835m55K551N314o58Q69o183r72R28j2373p807J6396M760J1666K770
$$ y = [5466, 5046, -7003, -16462, -25711, -25759, -8764, -8610, -4628, 1633, 4680, 7165, 5141, 4290, 476, 4555, 9770, 10252, 16749, 22657, 17802, 18772, 16423, 3424, -9808, -10578, -2457, 3830, 8534, 8106, 5241, 5648, 2429, -6940, -49, 11634, 3623, 4108, 5911, -615, -3355, -3555, -1991, 2147, 12813, 19137, 16343, 16226, 7334, -3335, 668, -2646, -10282, -13750, -5941, -7672, 100, 4941, 16088, 6646, -1130, 2853, 5414, 979, 4057, -1281, -468, 15281, 14466, 1441, -5049, -4994, 4011, 9175, -4073, -5108, -1008, -14173, -16050, -18858, -25113, -33426, -14069, -1346, -7614, 4895, 7311, 19147, 27980, 20960, 14580, 5434, 19237, 22130, 10909, 1250, 5760, 18193, 3527, -8234, -14592, -12931, -3103, 3251, 11086, 10631, 13182, 18496, 17838, 18707, 12524, 11552, 12480, 107, -7700, 8696, 13456, 25122, 27892]
2334B7892j1093l488j4230j8134j579J0536J3820j3983j7601L433J3393J6558
2322E524J4624r318n31k1486m329J0466K782j008N575M993J2172N559j9042j7552
2308a1571j960K0202K396j226Q989r247j9425j1178M441j792r14O249O313J3453
2294D730J098M78k041O358p673j197l13j7124k209R507j452j499L486k455n889
2279a6195N037j486K668J0717N868J136j6738j8577R688P531M387O368Q520M986
2265A3910p402j0322R837L24o498j95J9540L830j6557j5628J0566J3924p103l76
2251G850j0807j0907J4809J5525j7583q594J2394J1922L988K516p268j5561n488
2238g204n182M219K714J3441N014k695q485L17p454Q583N675j5195K01J3668O173
$$ y = [27892, 16799, 13311, -919, -19053, -20632, -10096, 3724, -10259, -27860, -24427, -11034, 5524, 20148, 10830, 10299, -11187, -15516, -5050, -2268, -3276, 2299, 7292, 19464, 25023, 5981, -11571, -13531, 6671, 9067, 7841, 16830, 7583, -11842, -23020, -18579, -20371, -21285, -15036, -8723, 4730, 5828, 6306, 4265, 10623, 2950, 1753, 1440, -15684, -17893, -8386, -9838, -11337, -7851, -10306, -16195, -11158, -12644, -9976, 741, 6609, 7745, -8993, -27570, -17882, -10351, -5964, 404, 8924, 13910, 6508, -3814, 6023, 6347, -151, -346, 19194, 23024, 6467, -9161, 1405, 15329, 8226, 7850, -2957, -13864, 945, 16470, -1113, -9707, 2687, 14609, 18597, 21113, 13845, -1716, -7204, -12386, -8167, -5453, 7988, 13002, 10307, 1822, 2139, -5315, 3268, 8943, -6252, -6051, 7617, 13790]
2223A3790k909q621q780J2992L711j3827K220J1722l100q706r166K899j074K629
2209f220j649m79M055N942O952j90j039k748j2549j0959k775K1270L161r385J853
2194d760O850K007q798j8471o12M159O920K4641N52L031m864p436M5p894j0780
2179a5410M360J3262r868k944N495M425m916L994K577k596K648o380P193K154
2165C994k382p275N57Q447L564n576l994J319m732M895m146r209J4340Q754n079
2150C477j5491l46J5493J0558m179l802j1352p019j1754o621N130J9296j810n322
2136a3742M702J6359J4194O671J840j8335m185n83P48j0600N66%M80j692o748
2121a0325M500K530k2122K21J5360o31r34L195O86n877L821R965J1350p191J457
$$ y = [13790, 10881, 2260, -6520, 6472, 10183, -3644, -1424, 10298, 7198, -1508, -10674, -7775, -8849, -6220, -7869, -8348, -4293, 1649, 8601, 8411, 7372, 4624, -7925, -18884, -21659, -389, 2772, -6613, -4760, 2090, 4097, -4701, -23172, -23784, -19625, -12705, 11936, 12488, 15519, 10655, 3219, 3264, -4630, -15410, -11050, 2212, -7656, -10600, -5105, -680, -5596, -1602, 975, -1621, 1027, -5353, 1840, 3994, 1612, -5663, -5106, 3341, 6905, 1329, -2665, -1346, -6078, -1183, -5329, -14538, -198, 8556, 3477, -12014, -12360, 3133, 13691, 9512, 5710, -5642, -12661, -24415, -31036, -25906, -6610, -8420, -13742, -9040, 7319, 21513, 28184, 30024, 11689, 7504, 6921, 7669, -2931, -2365, -2365, -1885, -3577, -10325, -5825, -3295, -25417, -25196, -9836, -10467, -11401, -8206, -7520, -13397, -9576, 389, 11739, 4548, 6005]
2106F005L746p607n73L335J1570o41j598m252l194l912N819j0171m658J0875n96
2091D148l985Q985M750o768l085j160r845r300j1202Q624N452m136N030N610Q336
2076A454K048O632K138J1568n84r12j4287J630m207j3176K881J3582K869j1577
2062E9r368K233m660M944P074j026M426N690K143q523k603l500J0302P665l430
2047A1426R166K958p41p495J509K071o93n526j3180p185L053L370L106j213R029
2032I655k424q975J1890O565K488r178j4402N645L082j31J1813N114j597o40J827
2017B0732n076o516P083J4652l553j5319m585l056M730J3670k934K840j4016K748
2003A1400p953k795j827O939P158Ml989p796N79j71O421n509n74O572j2242Q65
$$ y = [6005, 9751, 2144, 1571, 4906, 16476, 15835, 14237, 9985, 6791, 2879, 8698, -1473, -6131, 4744, 4148, 163, 9148, 13898, 7130, 4045, 2885, -6960, -16260, -27462, -18838, -13386, -17522, -12492, -6882, 1454, 3502, 10134, 12272, 23840, 23256, 22344, 8057, 9687, 5480, -7696, -4815, 8767, 11636, 59, -9309, -7076, -11736, -6792, 282, -744, 3682, 9372, 11515, 2992, 389, -3111, 7191, 14856, 11426, 20592, 23550, 22809, 15314, 16823, 18894, 18201, 12675, -505, -7690, -4637, -1267, 1839, 626, 9655, 7231, -1744, 10146, 16711, 19199, 10021, -4381, 1264, 4346, 4215, 16028, 21142, 19545, 18905, 20732, 15656, 9140, 16223, 30875, 27322, 12003, 7418, 4362, 9092, 22762, 19828, 22668, 8652, 11400, 3447, 652, -1175, 5764, 12922, 12926, 8937, 1141, 1720, 1549, 7970, 2461, 1887, 8459, -3783, -2918]
1987b918m84j2565J1127R654P49R464l266j589j1326K104l885o983j09n33L144
1972g416q18N888Q854R032r624j6840K498Q500k666N51K618K268K286l784J4813
1957A6160M287k921l882o274n140q557J0333J1228n022p787k660N22J164n685
1943d234n117k57R500O335o187J275N425Q768P25p945P891K980m472l570j1063
1928E4M865M922l818P900L38m571M264J749j627p126L833q490o185P329L503O579
1912A3519r518j3364K078q022r179L618k109o129J7024L788O040n89r196J853
1898a0186n204k227P631o642m22K1276R264l52m055p851m81O829N613m689k101
1883F403N706k207m710n274o845O619P412N699L148l383r500L704j347J547Q017
$$ y = [-2918, -3402, -15967, -4840, 4814, 5563, 15027, 11761, 10172, -1154, 950, -2935, -9918, -10027, -10560, -7416, -8234, -2346, 6508, 15540, 5916, -10924, -8426, 74, -2592, -2041, 577, 2845, 5131, 1347, 16160, 20447, 17526, 13644, 7370, 2230, -6327, 4006, 15234, 10212, 2425, -235, 287, 1451, -4234, -9351, -9608, -108, 6227, 40, 1315, 6740, 15508, 16233, 8288, 16179, 19159, 14687, 11117, 54, 4919, 9841, 6023, 13923, 14261, 9690, 13954, 15703, 14076, 6950, 10783, 2293, -3892, 3437, 6940, 13519, 4001, -9363, -7285, -15307, -24486, -20868, -22977, -29106, -12082, -8294, -2254, -2843, -12039, -10186, -15390, -17617, -9986, -16628, -17050, 4226, 13490, 13138, 9083, 1232, 751, 7580, 13193, 8504, 6403, 12109, 9902, 5192, -82, -6927, -308, 7104, 12803, 15951, 12568, 3068, 6772, 5425, 6972, 14989]
1868A4989n684j1385j1311M663j357k795l32J994N940J8939p800n48P761J69L330
1853A6573j2789j2276r34j310l463k398K412K961R21q211m074M102M996P549K908
1838c033p560K427L431O718L322j8833n845N96J3750M645J591o683l671R484m338
1823c999J3070J3486q882J477n70j2921J681n188j0879N970l128M03N095K326
1809b059K75q109K407L172O756Q261j6388J1116M445j3681q086J3025P091j2402
1795d177j566P750l944l109Q206N248N205K318m654q165j0605p772K283K6297
1781A3315l238j0233P545Q451n3p509n186P814P263k264M443l588j2444m560j4908
1766a5152N369Q498R068q640Q79P161N31k871O91K349j13m060N9R399L538N283
$$ y = [14989, 9305, -2080, -13391, -8728, -10085, -12880, -13212, -11218, -5278, 13661, 5861, 5313, 13074, 13243, 16573, 3784, -8492, -9426, -10736, -14199, -16597, -14185, -11224, -10303, -18514, -22588, -18486, -13490, -5941, -3033, -10593, -8166, -4735, 1983, 5305, -13528, -19373, -18777, -5027, -382, 1209, -5474, -9145, 339, -3999, 9071, 22557, 13675, 15152, 14582, 1661, 3342, -1846, -12725, -6755, -9883, -9480, -4385, -2059, -1784, -9893, -7486, -4314, 2442, 10703, -5685, 5431, 9876, -3805, -11891, 1134, 8225, -4177, -5743, 2007, -1937, -5046, 3160, 8408, 13613, 15931, 11277, 3112, -7493, -15265, -12982, 13315, 10077, -156, 7389, 15840, 15787, 8278, 3092, 10906, 18169, 15905, 20348, 16760, 4316, -244, -15152, -9783, -1285, 7783, -857, 22, 7183, 7714, 4843, 5534, 7883, 7770, 3710, 3769, 13168, 16706, 21989]
1750B1989N301M317k1509r67K0914N931k0932j9082q5P886M196n595l742J0411
1736I033l248o102l51o30K244k413M09J515L37r602M316N739q719k668k841P623
1720e358M633j8310P53O529L508M297j127O183j769p690m161M483K578N126O153
$$ y = [21989, 27290, 31607, 10098, 9131, 30045, 35976, 15044, -4038, -4123, 3763, 7959, 2364, -1378, 9033, 5785, -317, -668, -1298, 946, -1467, -1058, 457, 794, -8808, -4492, 1247, -7472, -10140, -12981, -5358, -725, -19035, -18282, -11753, -8245, -3948, -5075, 1108, -661, -8351, -12512, -8029, -5451, -325, 5828]
$$ [...]
##END NTUPLES=NMR SPECTRUM
##END=
