##TITLE=Analysis number 327280
Compound Code btb 11191
Book Reference b
Project Code adrs lab3
Chemist Name stores
##JCAMPDX= 6.0         $$ Bruker NMR JCAMP-DX V2.0
##DATA TYPE= NMR SPECTRUM
##DATA CLASS= NTUPLES
##ORIGIN= Bruker BioSpin GmbH
##OWNER= nmr
$$ XWIN-NMR		Version 3.5
$$ Mon Mar 19 12:09:00 2007 GMT Standard Time (UT+0h)  MAYBRIDGE\nmr@NMR_250MHZ
##.OBSERVE FREQUENCY= 250.131544655141
##.OBSERVE NUCLEUS= ^1H
##.ACQUISITION MODE= SIMULTANEOUS (DQD)
##.ACQUISITION SCHEME= undefined
##.AVERAGES= 16
##.DIGITISER RES= 18
##SPECTROMETER/DATA SYSTEM= dpx250
##.PULSE SEQUENCE= zg30
##.SOLVENT NAME= CDCl3
##.SHIFT REFERENCE= (INTERNAL, CDCl3, 0, 16.522)
##AUDIT TRAIL= $$ (NUMBER, WHEN, WHO, WHERE, WHAT)
$$ ##TITLE= Audit trail, XWIN-NMR		Version 3.5
$$ ##JCAMPDX= 5.01
$$ ##ORIGIN= Bruker BioSpin GmbH
$$ ##OWNER= nmr
$$ C:\u/data/dgb/nmr/ADRS/1200/pdata/1/auditp.txt
$$ ##AUDIT TRAIL=  $$ (NUMBER, WHEN, WHO, WHERE, WHAT)
(   1,<2007-03-19 12:08:36.79 +000>,<MAYBRIDGE\nmr>,<NMR_250MHZ>,
      <created by zg, POWCHK disabled, PULCHK disabled
       configuration hash MD5:
       49 4B E0 1D 92 C2 6B 37 9F E6 65 BC 52 41 86 1D
       data hash MD5: 64K
       3F A6 C3 EA 4D E5 C7 A4 06 4B A8 58 F6 76 AF 4B>)
(   2,<2007-03-19 12:08:50.48 +000>,<MAYBRIDGE\nmr>,<NMR_250MHZ>,
      <Start of raw data processing
       ef LB = 0.3 FT_mod = 6 PKNL = 1 SI = 32K 
       data hash MD5: 32K
       FD 59 C6 37 A5 3C 52 11 A9 B8 48 B4 B7 41 B4 42>)
(   3,<2007-03-19 12:08:52.47 +000>,<MAYBRIDGE\nmr>,<NMR_250MHZ>,
      <apk 
       data hash MD5: 32K
       A8 02 4C C8 83 0B 31 FE 98 82 B0 DC BA 09 7B 45>)
(   4,<2007-03-19 12:08:53.25 +000>,<MAYBRIDGE\nmr>,<NMR_250MHZ>,
      <abs ABSG = 5 
       data hash MD5: 32K
       84 8B B7 A5 58 3B 67 C7 77 B8 D6 EB 89 83 C6 DB>)
$$ ##END=
$$ 
$$ hash MD5
$$ 9E 76 55 3C DC 5B C7 50 2F 85 67 66 0F BA D5 EB
##$RELAX= 
##$RELAX= 
##$RELAX= 
##$RELAX= 
##$RELAX= 
##$RELAX= 
##$RELAX= 
$$ Bruker specific parameters
$$ --------------------------
##$DU= <C:\u>
##$EXPNO= 1200
##$NAME= <ADRS>
##$PROCNO= 1
##$TYPE= <nmr>
##$USER= <dgb>
##$AMP= (0..31)
100 100 100 100 100 100 100 100 100 100 100 100 100 100 100 100 100 100 
100 100 100 100 100 100 100 100 100 100 100 100 100 100 
##$AQSEQ= 0
##$AQ_mod= 3
##$AUNM= <au_zg>
##$AUTOPOS= <19 >
##$BF1= 250.13
##$BF2= 250.13
##$BF3= 250.13
##$BF4= 250.13
##$BF5= 500.13
##$BF6= 500.13
##$BF7= 500.13
##$BF8= 500.13
##$BYTORDA= 1
##$CFDGTYP= 0
##$CFRGTYP= 5
##$CHEMSTR= <none>
##$CNST= (0..31)
1 1 145 1 1 1 1 1 1 1 1 1 1 1 1 1 1 1 1 1 1 1 1 1 1 1 1 1 1 1 1 1 
##$CPDPRG= <>
##$CPDPRG1= <>
##$CPDPRG2= <>
##$CPDPRG3= <>
##$CPDPRG4= <mlev>
##$CPDPRG5= <mlev>
##$CPDPRG6= <mlev>
##$CPDPRG7= <mlev>
##$CPDPRG8= <mlev>
##$CPDPRGB= <>
##$CPDPRGT= <>
##$D= (0..31)
0 1 0 0 0 0 0 0 0 0.06 0 0 0 0 0 0 0.0002 0 0 0 0 0 0 0 0 0 0 0 0 0 0 
0 
##$DATE= 1174306115
##$DBL= (0..7)
120 120 120 120 120 120 120 120 
##$DBP= (0..7)
150 150 150 150 150 150 150 150 
##$DBP07= 0
##$DBPNAM0= <>
##$DBPNAM1= <>
$$ [...]
##$SUBNAM7= <"">
##$SUBNAM8= <"">
##$SUBNAM9= <"">
##$SW= 20.6930455092707
##$SWIBOX= (0..15)
0 0 3 0 0 0 0 0 0 0 0 0 0 0 0 0 
##$SW_h= 5175.983436853
##$TD= 65536
##$TD0= 1
##$TE= 683.16
##$TE2= 300
##$TE3= 300
##$TEG= 300
##$TL= (0..7)
0 120 120 120 120 120 120 120 
##$TP= (0..7)
150 150 150 150 150 150 150 150 
##$TP07= 0
##$TPNAME0= <>
##$TPNAME1= <>
##$TPNAME2= <>
##$TPNAME3= <>
##$TPNAME4= <>
##$TPNAME5= <>
##$TPNAME6= <>
##$TPNAME7= <>
##$TPOAL= (0..7)
0.5 0.5 0.5 0.5 0.5 0.5 0.5 0.5 
##$TPOFFS= (0..7)
0 0 0 0 0 0 0 0 
##$TUNHIN= 0
##$TUNHOUT= 0
##$TUNXOUT= 0
##$USERA1= <user>
##$USERA2= <user>
##$USERA3= <user>
##$USERA4= <user>
##$USERA5= <user>
##$V9= 5
##$VALIST= <valist>
##$VCLIST= <CCCCCCCCCCCCCCC>
##$VD= 0
##$VDLIST= <DDDDDDDDDDDDDDD>
##$VPLIST= <PPPPPPPPPPPPPPP>
##$VTLIST= <TTTTTTTTTTTTTTT>
##$WBST= 1024
##$WBSW= 4
##$XGAIN= (0..3)
0 0 0 0 
##$XL= 0
##$YL= 0
##$YMAX_a= 449124
##$YMIN_a= -343021
##$ZGOPTNS= <>
##$ZL1= 120
##$ZL2= 120
##$ZL3= 120
##$ZL4= 120
##$ABSF1= 16.522
##$ABSF2= -4.171173
##$ABSG= 5
##$ABSL= 3
##$ALPHA= 0
##$AQORDER= 0
##$ASSFAC= 0
##$ASSFACI= 0
##$ASSFACX= 0
##$ASSWID= 0
##$AUNMP= <proc_1d>
##$AZFE= 0.1
##$AZFW= 0.1
##$BCFW= 0
##$BC_mod= 0
##$BYTORDP= 0
##$COROFFS= 0
##$CY= 12.5
##$DATMOD= 1
##$DC= 0
##$DFILT= <>
##$DTYPP= 0
##$F1P= 14.0000005364418
##$F2P= -0.99999901652339
##$FCOR= 0.5
##$FTSIZE= 32768
##$FT_mod= 6
##$GAMMA= 0
##$GB= 0
##$INTBC= 1
##$INTSCL= 1
##$ISEN= 128
##$LB= 0.3
##$LEV0= 0
##$LPBIN= 0
##$MAXI= 10000
##$MC2= 0
##$MEAN= 0
##$ME_mod= 0
##$MI= 0
##$NCOEF= 0
##$NC_proc= -3
##$NLEV= 6
##$NOISF1= 0
##$NOISF2= 0
##$NSP= 0
##$NTH_PI= 0
##$NZP= 0
##$OFFSET= 16.522
##$PC= 1
##$PHC0= 81.80844
##$PHC1= 2.643105
##$PH_mod= 1
##$PKNL= yes
##$PPARMOD= 0
##$PSCAL= 4
##$PSIGN= 0
##$REVERSE= no
##$SF= 250.13
##$SI= 32768
##$SIGF1= 0
##$SIGF2= 0
##$SINO= 400
##$SIOLD= 32768
##$SREGLST= <1H.CDCl3>
##$SSB= 0
##$STSI= 32768
##$STSR= 0
##$SW_p= 5175.98343685301
##$SYMM= 0
##$S_DEV= 0
##$TDeff= 65536
##$TDoff= 0
##$TI= <Analysis number 999999
Compound Code 99
Book Reference 9
Project Code 9>
##$TILT= no
##$TM1= 0
##$TM2= 0
##$TOPLEV= 0
##$USERP1= <user>
##$USERP2= <user>
##$USERP3= <user>
##$USERP4= <user>
##$USERP5= <user>
##$WDW= 1
##$XDIM= 32768
##$YMAX_p= 519166125
##$YMIN_p= -97791
$$ End of Bruker specific parameters
$$ ---------------------------------
##NTUPLES= NMR SPECTRUM
##VAR_NAME=  FREQUENCY,     SPECTRUM/REAL,   SPECTRUM/IMAG
##SYMBOL=    X,             R,               I
##VAR_TYPE=  INDEPENDENT,   DEPENDENT,       DEPENDENT
##VAR_FORM=  AFFN,          ASDF,            ASDF
##VAR_DIM=   32768,         32768,           32768
##UNITS=     HZ,            ARBITRARY UNITS, ARBITRARY UNITS
##FACTOR=    0.157963299565203, 1,           1
##FIRST=     4132.6476996994, 0,             0
##LAST=      -1043.33573715361, 0,           0
##MIN=       -1043.33573715361, -97791,      0
##MAX=       4132.6476996994, 519166125,     0
$$ Real data points
##PAGE= N=1
##DATA TABLE= (X++(R..R)), XYDATA
$$ [...]
17867A5171677l536377k622657j695694j071917p08692n14509l66141k03905l8566
17858D413219J70959M43961Q34604J445739K392772L615374M492491M292318K050126
17849B4151563j440503k750467k301607j016465Q73905K243942J872781n73331
17841B1059818k958944l616202l381483k653259j744430j060651o41128m13900
17833D589821l11517k48309j99768j21766j1318J15135K97898N42019R10884J476487
17823G039566K358877L469999M180865M011323K092753j199294k526510k088873
17815A7338706q01544J035729K295474K005204k80416k536786k915141k269132
17807A3872094q97952R36550K504400L180762K603783m7123k381394k530190j706964
$$ plain form
17867 15171677 11635300 9012643 7316949 6245032 5536340 5021831 4655690 4451785 4413219
17858 4413219 4584178 5028139 5862743 7308482 9701254 13316628 17809119 22101437 24151563
17849 24151563 22711060 19960593 17658986 16642521 17516426 19760368 21633149 21059818
17841 21059818 18100874 14484672 11103189 8449930 6705500 5644849 5003721 4589821
17833 4589821 4278304 4029995 3830227 3708461 3697143 3812278 4110176 4652195 5563079 7039566
17823 7039566 9398443 12868442 17049307 21060630 23153383 21954089 19427579 17338706
17815 17338706 16537162 17572891 19868365 21873569 21593153 19056367 16141226 13872094
17807 13872094 12974142 13910692 16415092 19595854 22199637 22152514 19771120 17240930 15533966
17798A5533966j88861J397383J965044P36408j779425l152082l223277k770335
17790H518821j966222j243584p73299m89104l28383k35233j66219j04963k2759
17781C189055P5934J92595L61995N84139R34124J544633K454581L339567L633369
17772A6309992L022030M87437j986029k287846j536143n4449J424582J979672
17764A7359246R76549j606839l111515l210204k808208k023433j299203q38978
17756C437415n64982m04455l04332k28869j72065j37808j11944r9309q4565p6871
17746A252215q5865q3193o2788l6709k4741j6321j3636m8654p0219p2233p0691
17735F67165l9268m669R316K3082K3698j5311n6498o1960l9360j6693l700Q255
$$ plain form
17798 15533966 15345105 16742488 18707532 19443940 17664515 14512433 11289156 8518821
17790 8518821 6552599 5309015 4535716 4046612 3718229 3482996 3316777 3211814 3189055
17781 3189055 3264989 3457584 3819579 4403718 5337842 6882475 9337056 12676623 16309992
17772 16309992 19332022 19819459 17833430 15545584 14009441 13954992 15379574 17359246
17764 17359246 18335795 16728956 13617441 10407237 7599029 5575596 4276393 3437415
17756 3437415 2872433 2467978 2163646 1934777 1762712 1624904 1512960 1413651 1329086 1252215
17746 1252215 1166350 1083157 1020369 983660 958919 942598 928962 880308 810089 737856 667165
17735 667165 627897 623228 632544 655626 679324 664013 607515 545555 506195 489502 485802 494057
17723D94057J540m4150n7612n3339m6909k8609k1171j4200q419r710m730l654
17711B03094r574Q42k236o832P66J2345J6586K3285L9266M4600M3023M0533J757
17698D07455k4383l2221k8170m89K2260J5119P103j9556m6687n3902m5728l5590
17686A65211j9220j3850j1938q685o001k700n401p58k062o208o46k068m750j241
17672G9683R72o924Q94O881n004q484K448M078l900k745K9K864O032p920J865
17657G0769q369q569P82j544M88J295p073m067p562l043m975l481L805N256M99
17642C4211Q713R18K351K142K696r81o453k666K592K544j831n247j162K299N540
17627D5666l570P35l739p896n411Q33K298n921l098K593Q561R847m4q072J103
$$ plain form
17723 494057 495597 451447 393835 340496 293587 264978 243807 229607 221188 211478 206748 203094
17711 203094 193520 194362 192126 185294 186060 198405 214991 238276 277542 322142 365165 405698 407455
17698 407455 383072 350851 322681 322192 344452 359571 366674 347118 300431 246529 200801 165211
17686 165211 145991 132141 120203 111518 105517 102817 97416 96658 94596 88388 87742 85674 80924 79683
17672 79683 80655 73731 74625 81506 76502 68018 70466 74544 70644 67899 67928 70792 76824 68904 70769
17657 70769 62400 53831 54613 53069 53557 54852 47779 43712 36150 33107 28132 24651 28456 33712 34211
17642 34211 42924 43842 46193 48335 51031 50050 43597 40931 43523 46067 44236 38989 37827 40126 45666
17627 45666 42096 42831 39092 31196 25785 26618 28916 22995 19897 22490 31051 40898 40854 32782 33885
17612C3885m258O07Q761J271l386M330M298J214k427m945j2265j124M43n963n803
17597A4638K61j716P196J3302J015L339K30L99n610j1291n179J537O008Q59k885
17582B2103O156q80o684R61n304j39n89n383K25J884k121k508m755P41l552l422
17566c267J243J2831J1196M323L142K15K748J364m492Q07l178L9L741j436L767
17551C3043j258r671n260m53l343L23j863j397n989J0M990j632l498K556O024
17536A2582Q282P542k331r40n023q026r263l63O864Q66j140n813j34l55p758m242
17520i252j14J420O94K959J0376M829l633j318J329j833k336L897m485l230L461
17505B764K875l650p622l762q26P128P380N85m685n338K178j765l773R54J742
$$ plain form
17612 33885 29627 30234 38995 40266 36880 41210 45508 46722 44295 39350 27085 25961 26404 20441 14638
17597 14638 14899 13183 20379 33681 34696 38035 38265 38664 33054 21763 16584 18121 24129 24988 22103
17582 22103 28259 27379 20695 21656 16352 16213 15624 10241 10466 12350 10229 7721 2966 3707 155 -3267
17566 -3267 -2024 10807 22003 26326 29468 29683 32431 33795 29303 30110 26932 26971 30712 29276 33043
17551 33043 31785 22114 16854 16401 13058 13381 11518 10121 4132 4142 9132 7500 4002 6558 12582
17536 12582 20864 28406 26075 25135 20112 12086 2823 2460 9324 10190 9050 3237 3103 2748 -5010 -9252
17520 -9252 -9366 -7946 -7252 -4293 6083 10912 7279 5961 7290 5457 3121 7018 2533 -697 2764
17505 2764 5639 1989 -5633 -9395 -10221 -3093 4287 4872 187 -5151 -2973 -4738 -8511 -7557 -5815
17490e815m00L899P037L684L314l67j943j614k758N40O462M226o283J016l959
17475G039k042J605m627L024p47m750N896K44L480J0011m721j323k640m7P140
17460A7542J1142l946n828m958m991j725K787k403M844J529Q013K1670K7081L1178
17446A01935L9118L3441J7048J3402K8791K3219J5221K7580N452k5207m3549l4014
17434B02437j6508M632J0301q481k9230l8129l2602j5488o113M741J3766J8083
17422A07409J8756J7376J0313M397M635J1852J1641K0726J9272k345j5197k7757
17410A81078j8044p610l503j031j5274k2123j6866j2322j7455j2920k824M670
17398E5776M912J2261K7444L2085K6610M696o852p77J8072M0433M1074J3005k0825
$$ plain form
17490 -5815 -6215 -2316 4721 8405 11719 11352 9409 7795 5037 5577 12039 16265 9982 10998 7039
17475 7039 4997 6602 1975 4999 4252 -498 5398 5642 9122 19133 14412 13089 10449 10402 17542
17460 17542 28684 24738 18910 13952 8961 7236 10023 7620 12464 13993 22006 43676 70757 101935
17446 101935 141053 174494 191542 204944 233735 256954 272175 299755 305207 280000 236451 202437
17434 202437 185929 190561 200862 192381 163151 125022 92420 76932 70819 75560 89326 107409
17422 107409 126165 143541 153854 158251 162886 174738 186379 207105 226377 224032 208835 181078
17410 181078 163034 155424 151921 150890 135616 113493 96627 84305 66850 53930 51106 55776
17398 55776 60688 72949 100393 132478 159088 163784 156932 156155 174227 214660 255734 268739 247914
17385B47914l6188l1416j4996Q26M56l284k5810l0290k5678n282R353J0433R939
17372A05977J3601J9868N539L166R524J5739K7526J5402l134j9436k7766k0657
17360A45349o757m889J521l662j8820k8972j9929j3057j4884q375J722J135j1925
17347A8457o881K023K089k864n925l206P585k056O11M188O242r03O591J2584P904
17332D6439J5442K3563K2853J0030j0636q208l778n800Q514R673R896o088j5803
17319I6097j9146j2309j4565j3120j0368k22R2J193n19j667o21L288J0176J3314
17305E1623R151K1508K6724M9751N1180L3677L068j6306k2848j4951O906K8740
17293B28223K1180r767k1774l1870l8330k2478j9684j2683n57O303J7293J4616
$$ plain form
17385 247914 211726 180310 165314 166140 166596 163312 137502 107212 81534 76252 85605 96038 105977
17372 105977 119578 139446 144985 148151 157675 173414 200940 216342 213208 193772 166006 145349
17360 145349 138592 133703 135224 131562 112742 83770 63841 50784 35900 27525 29247 30382 18457
17347 18457 11576 13599 15688 12824 6899 3693 11278 9222 9833 14021 20263 19360 25951 38535 46439
17332 46439 61881 85444 108297 118327 107691 99483 95705 89905 98419 108092 117988 111900 96097
17319 96097 76951 64642 50077 36957 26589 26367 26459 27652 27133 25466 24845 28133 38309 51623
17305 51623 60774 82282 109006 158757 209937 243614 246682 230376 207528 192577 199483 228223
17293 228223 249403 239636 217862 185992 147662 125184 105500 92817 92260 98563 115856 130472
17281A30472L310j2277j4412l142M503J0474J8400J2383N082N724J7114K1802
17269A99433L627k4965l8002k2108Q589K1249K1227N755k1192l2281k0074l104
17257I8154R320K0835L8067L5843J126j1934m265M639K992J7781J5081j2989k7278
17244A87372j7842j1408j8102k2670k3264l0227j4089m512n329q157q390j537
17232B1845o33Q10P094L268N218O492J0364K3776L6385K7913j0579k4154k0124
17219H7675j550J0552J7033J8182j236k8052l0755k4604r345k116m096r508o731
17206A5449j955J905n899q468K569L589k120o723j156K684K390k675n017q57M19
17191e865R07P07n633K777J529K209m65m72q7K033J386q56K084K31j670j1724
$$ plain form
17281 130472 133782 121505 107093 103951 108454 118928 137328 149711 154793 160517 177631 199433
17269 199433 203060 178095 140093 117985 126574 147823 169050 174805 153613 121332 101258 98154
17257 98154 107474 128309 166376 202219 203345 191411 187146 191785 194777 212558 227639 214650 187372
17244 187372 169530 158122 140020 117350 94086 63859 49770 45258 39929 31772 23382 21845
17232 21845 21212 22022 29116 32384 37602 44094 54458 78234 114619 142532 131953 107799 87675
17219 87675 86125 96677 113710 131892 130656 102604 71849 47245 37900 35784 31688 22180 15449
17206 15449 13494 15399 9500 1032 3601 7190 5070 -1653 -2809 -125 2265 -410 -5427 -6284 -5865
17191 -5865 -4958 -4251 -9884 -7107 -5578 -3369 -3834 -4306 -4393 -2360 -974 -1830 254 485 -1185 -12909
17175a2909p349N957N955J329m96q34O395J319j563n357j562L747J096K865j496
17160b903k084o481l892k622Q828M309L854l225M797q190j919K01N25l696J361
17145a1137l420K18n160Q275M054l118q745O220P496J298J76m60J36L688j867
17130b346o39j7k813l069m401L783M362J215j876L219K993n474r91L052J447j668
17114c223P26n806k748L555k760J224L94l113l001j533j076j246N027Q232M065
17099a283j644m814M78K830L725J638K122k848k400n339n876j409J0254L424M351
17084C209J358l732l008o864k435l838m192J727L399P040p66m340J850j335N174
17069f753k181j742k229j564L424K984j632k330m026n417M252J921K400j784n380
$$ plain form
17175 -12909 -20258 -14301 -8346 -7017 -7513 -8347 -1952 -633 -2196 -7553 -9115 -5368 -4272 -1407 -2903
17160 -2903 -4987 -11468 -15360 -17982 -9154 -4845 -991 -4216 581 -7609 -9528 -9327 -8802 -12498 -11137
17145 -11137 -14557 -14339 -19499 -11224 -7170 -10288 -19033 -12813 -5317 -4019 -3843 -4303 -4167 -479 -2346
17130 -2346 -2985 -3002 -5815 -8884 -13285 -9502 -5140 -3925 -5801 -2582 411 -5063 -6054 -3002 -1555 -3223
17114 -3223 -2497 -8303 -11051 -7496 -10256 -9032 -8638 -11751 -14752 -16285 -17361 -18607 -13580 -5348 -1283
17099 -1283 -2927 -7741 -7263 -4433 -708 930 3052 204 -2196 -7535 -13411 -14820 -4566 -1142 3209
17084 3209 4567 835 -2173 -9037 -11472 -15310 -19502 -17775 -14376 -7336 -8102 -12442 -10592 -11927 -6753
17069 -6753 -8934 -10676 -12905 -14469 -11045 -8061 -9693 -12023 -16049 -21466 -17214 -15293 -12893 -14677 -20057
17054b0057K762J791L537N670N153R52K596P76o532J718L774o14l220n731J988
17039e437M443j056k449Q075P824p219j595m237o551j0067M102L506K142N936
17025b583K936o487M260Q0p780J238q861q53O88O101J88m78K185k60k584m366
17009a6576K255L445l166n29M82j750m127l672l86m53M803L632l048p91N203R20
16993a3758L400k982j622J865j33K074J552O62J686n040K763k607o04Q76P73P818
16977c277M301j438l184q86L529Q535J636k810j38J766o155m993j1086m024O853
16962a1371K826K36j356j582O227j372K88j872j011R39k426l187M783M634m925
16947i169m12P692J215p642k11k864M139Q967n978n998l19N261N629k671p694
$$ plain form
17054 -20057 -17295 -15504 -11967 -6297 -1144 -192 2404 3180 -3352 -1634 2140 1526 -1694 -7425 -5437
17039 -5437 -994 -2050 -4499 3576 11400 4181 2586 -1651 -8202 -18269 -14167 -10661 -8519 -2583
17025 -2583 353 -6134 -1874 -1794 -9574 -8336 -17197 -18050 -17362 -11261 -11073 -11551 -9366 -9626 -12210 -16576
17009 -16576 -14321 -10876 -14042 -14571 -14089 -15839 -19966 -23638 -24024 -24477 -19674 -16042 -19090 -19881 -14678 -13758
16993 -13758 -10358 -13340 -14962 -13097 -13230 -11156 -9604 -8942 -7256 -12296 -9533 -12140 -12744 -11868 -11095 -3277
16977 -3277 1024 -414 -3598 -4484 -955 7580 9216 6406 6268 8034 1879 -3114 -14200 -18224 -11371
16962 -11371 -8545 -8309 -9665 -11247 -5020 -6392 -6104 -7976 -8987 -8048 -10474 -13661 -8878 -4244 -9169
16947 -9169 -9581 -1889 -674 -8316 -8527 -11391 -7252 1715 -4263 -10261 -10580 -5319 310 -2361 -10055
16932a0055J923J654r92K05M873L13K329m409j503n095n102q62K35N002Q69P17
16916i898N684j819n225m717m268k827M268L200K103M588M298K535R90m008L667
16901a429p489j1684j775M044M811P92l916J507J0983J297k275k402k753K841
16887g448J70k316K920o84j352N335k576l753P94M868M931J110m529n942J778
16872f694j159L568j149m754O24J976l749q841k763j002Q055L421k364L901K855
16857h075N241J230l497n593k579J446O574K704M78k157J219R72p092N87O635
16842a907o09m296n969L16K967k353K062K901L310L585M033j622l64j46l377l244
16826d713k229K925K346N71r311p165J381N929K085j387m386K459o27q4N441K099
$$ plain form
16932 -10055 -8132 -6478 -7470 -7265 -2392 -2079 250 -4159 -5662 -10757 -15859 -16721 -16486 -11484 -10615 -9898
16916 -9898 -4214 -6033 -11258 -15975 -20243 -23070 -18802 -15602 -13499 -8911 -4613 -2078 -1088 -5096 -1429
16901 -1429 -8918 -20602 -22377 -18333 -13522 -12730 -16646 -15139 -4156 -2859 -5134 -7536 -10289 -7448
16887 -7448 -7278 -9594 -6674 -7358 -8710 -3375 -5951 -9704 -8910 -4042 889 1999 -2530 -8472 -6694
16872 -6694 -7853 -4285 -5434 -10188 -9564 -7588 -11337 -20178 -22941 -23943 -15888 -12467 -14831 -10930 -8075
16857 -8075 -2834 -1604 -5101 -10694 -13273 -11827 -5253 -2549 -2071 -4228 -3009 -2037 -9129 -8542 -1907
16842 -1907 -2516 -6812 -12781 -12465 -9498 -11851 -9789 -6888 -3578 7 4040 2418 2054 1908 -1469 -4713
16826 -4713 -6942 -4017 -1671 -1100 -10411 -17576 -16195 -10266 -8181 -9568 -13954 -11495 -12122 -12206 -6765 -4666
16810d666L055M90M545k691j3376L60M531l249l987Q888p45l965L841j387J784
16795f572N341k160r73N484L602O370j900n580o802m086o29k401j936M298n3L41
16779g656j791K742P075l280k658l31j250M123M282K221k678k211O8l178k266
16764f788l505K36M756r18k702L049l16n82M3n886n31j364J484N415N623N977
16748C991k363p922k227J291l915p041n502K336M025k107L088R078P733k468l172
16733e175q92m128L18J261l399m780j332O91J96j684j070M948R048P885J855n968
16717b226R84k053o988k807L746p07j39l975j721R32j672J563KQ182P933l291
16701b237kJ144J122o185r94n302r585J012J1330O262m706l644L521O214L251
$$ plain form
16810 -4666 -1611 -1121 3424 733 -12643 -12283 -7752 -11001 -14988 -6100 -6845 -10810 -6969 -8356 -6572
16795 -6572 -1231 -3391 -4364 1120 4722 11092 9192 3612 -3190 -7276 -7905 -10306 -12242 -7944 -7997 -7656
16779 -7656 -9447 -6705 370 -2910 -5568 -5899 -7149 -3026 1256 3477 799 -1412 -1344 -4522 -6788
16764 -6788 -10293 -10057 -5301 -6219 -8921 -5872 -6188 -6770 -6727 -12613 -13144 -14508 -13024 -7609 -1986 3991
16748 3991 1628 -6294 -8521 -7230 -11145 -18186 -23688 -21352 -17327 -19434 -16346 -7268 465 -2003 -5175
16733 -5175 -6067 -10195 -9877 -8616 -12015 -16795 -18127 -17436 -17240 -18924 -19994 -15046 -5998 1887 3742 -2226
16717 -2226 -1242 -3295 -10283 -13090 -9344 -10051 -10190 -14165 -15886 -14954 -16626 -15063 -15061 -6879 1054 -2237
16701 -2237 -2239 -1095 27 -6158 -7152 -12454 -22039 -21027 -9697 -3435 -8141 -11785 -8264 -2050 1201
16686A201l230K694K975l581k689n99k60N548k208n802J112l49n316k579m061
16671a7144j807K501K019O011j027r970q724N464N022j983P355J770q244P17M800
16656a3240L958M900J692o051N8M683m82r19K387K028l729j689l523o26k109o09
16640a3271L443O296n191l353n86M440P142k693k601L208N365m916n130k515k284
16625a2646J301q555n18J1277L315J011P812K052l887m996p041J286j752l852
16611a5193o126L426M909j268l742J787Q220O994j929p968N18n822j433P812L760
16596f055n384j822M587R03o529l499K570O85r4N558P028N651l389j3150M320
16581h620L590K217O140k47l850n734J988k875k988K872M793o644m651k692L950
$$ plain form
16686 1201 -2029 665 3640 59 -2630 -3229 -3489 2059 -149 -5951 -4839 -5188 -10504 -13083 -17144
16671 -17144 -18951 -16450 -14431 -8420 -9447 -19417 -28141 -22677 -17655 -19638 -12283 -10513 -18757 -18040 -13240
16656 -13240 -9282 -4382 -2690 -8741 -8683 -4000 -4482 -5401 -3014 -986 -4715 -6404 -9927 -10553 -12662 -13271
16640 -13271 -9828 -3532 -8723 -12076 -12662 -8222 -1080 -3773 -6374 -3166 2199 -2717 -7847 -10362 -12646
16625 -12646 -11345 -19900 -20418 -9141 -5826 -4815 2997 5049 1162 -3834 -10875 -9589 -11341 -15193
16611 -15193 -21319 -17893 -12984 -14252 -17994 -16207 -7987 -993 -2922 -10890 -10372 -16194 -17627 -9815 -6055
16596 -6055 -11439 -13261 -8674 -7771 -14300 -17799 -15229 -14544 -14638 -9080 -2052 3599 210 -12940 -8620
16581 -8620 -5030 -2813 3327 3080 -770 -6504 -4516 -7391 -10379 -7507 -2714 -9358 -14009 -16701 -12751
16566a2751k194q39P893R932r11k875K82o315L165M113k56k05M218j577m787Q55
16550b252j055K80N200k391n761M38j046r919O8P208P95o615p362O893Q870L162
16534c487p287L39M317k450k428O02P645J214m211l53j201q87k263j572O49j061
16518a2434k378O799o115m479J799p97M878L188l787o15Q56M320K712J549m35
16503d939j0096n623J049J630M039J347J125N0j0435m740N469R730Q57k298N003
16488g832j752K278l671O75K037J290O04J726l028m57L883J965n106K385l187
16473h190l001m02k950P162L437K357k424m786J608j602J445o90l78m235j143
16458a3792N142K851j874k236j231n056N222k573q997m175j656O544J393L981
$$ plain form
16566 -12751 -14945 -15784 -7891 2041 1130 -1745 -1463 -7778 -4613 -500 -756 -961 3257 1680 -3107 -2252
16550 -2252 -3307 -3027 2173 -218 -5979 -5541 -6587 -16506 -16438 -9230 -8435 -15050 -22412 -15519 -6649 -3487
16534 -3487 -10774 -10435 -6118 -8568 -10996 -10394 -2749 -1535 -5746 -6099 -7300 -8187 -10450 -12022 -11373 -12434
16518 -12434 -14812 -8013 -14128 -18607 -16808 -17605 -12727 -9539 -13326 -13941 -13085 -8765 -6053 -4504 -4939
16503 -4939 -15035 -20658 -19609 -17979 -13940 -12593 -11468 -11418 -21853 -26593 -21124 -11394 -10537 -12835 -7832
16488 -7832 -9584 -7306 -10977 -10302 -8265 -6975 -6371 -4645 -7673 -8130 -4247 -2282 -7388 -5003 -8190
16473 -8190 -11191 -11593 -14543 -7381 -3944 -1587 -4011 -8797 -7189 -8791 -7346 -8036 -8414 -12649 -13792
16458 -13792 -8650 -5799 -7673 -9909 -11140 -16196 -10974 -13547 -22544 -26719 -28375 -21831 -20438 -16457
16444a6457l988K819r81o727N555J0774r28L239k315p3k931j68P62M434O847K354
16428B216k421q30J491l797n216j576N820r71o72n153l58l022K624j28L25P50
16412a0918k35Q99L361n686m831K816k194M007M664r29q142r79K766P006Q627
16397B32k494k918j0566O2J412n4j545Q841J0502J859j176k41m303J31K330J488
16381C560m588j509L96M807K07J852m553q131K502M448J776M50R431k065q244
16366C39l377j217J593q09o07r09k730j798K559K893l648J787K869p169o398m729
16350b1351L354O621L20n111r74L825N4j881k255J029O886P99N53J759m715l238
16334a4325q72j0192j312J4123J832J767J43l067O584M548j199R59k927O12J637
$$ plain form
16444 -16457 -20445 -17626 -18607 -25334 -19779 -9005 -9933 -6694 -9009 -9082 -12013 -12181 -11419 -6985 -138 2216
16428 2216 -205 -1035 456 -3341 -8557 -10133 -4313 -5284 -5956 -11109 -11467 -14489 -11865 -11993 -11668 -10918
16412 -10918 -11153 -10254 -6893 -12579 -17410 -14594 -16788 -12781 -8117 -9046 -17188 -18167 -15401 -8395 232
16397 232 -2262 -5180 -15746 -15684 -14272 -14326 -15871 -7030 3472 5331 4155 3914 -389 -258 2072 3560
16381 3560 -1028 -2537 -2141 2666 2873 4725 172 -7959 -5457 -1009 767 1217 10648 8583 339
16366 339 -3038 -4255 -2662 -3471 -4078 -4987 -7717 -9515 -6956 -4063 -7711 -5924 -3055 -10224 -16622 -21351
16350 -21351 -17997 -11376 -11056 -16167 -17141 -13316 -13262 -15143 -17398 -16369 -9483 -8684 -8131 -6372 -11087 -14325
16334 -14325 -15197 -25389 -26701 -12578 -10746 -8979 -8836 -11903 -5319 -771 -1970 -1011 -3938 -3326 -1689
16319a689l47N68m783j691Q1o903m000L275K463J67j08J452M787O64O807K617
16303C360q49k552m299k135j051k240l412J541N710k078q434n909M330M05J923
16288a5690M675k260J501o27O33L689L711j796L511K898N266n997k425m369K729
16273d551M319j40j284o259P408O207l196j0196q035l849M169k876k477N811k727
16258a7676K131L295p365N420N548J922N315N48j8k162j687m938r427J553q5N181
16242a2445K790Q88n01l704j227N230M704J919m559j655k422j96K76n295k514
16227a8711K615O849J870k326K486m910J216M827n402j142K478K411l573m439
16213a5751l039l448N656o73k951J396K435J794m107L1M635K196M99P029l069
$$ plain form
16319 -1689 -2036 -1468 -6251 -7942 -7861 -14764 -18764 -15489 -13026 -12859 -12967 -11515 -6728 -6064 743 3360
16303 3360 2511 -41 -4340 -6475 -7526 -9766 -13178 -11637 -5927 -8005 -16439 -22348 -18018 -17613 -15690
16288 -15690 -11015 -13275 -11774 -12401 -11768 -8079 -4368 -6164 -2653 245 5511 -486 -2911 -7280 -4551
16273 -4551 -232 -372 -1656 -7915 -507 5700 2504 -7692 -15727 -19576 -15407 -18283 -20760 -14949 -17676
16258 -17676 -15545 -12250 -19615 -14195 -8647 -6725 -1410 -862 -880 -3042 -4729 -9667 -19094 -17541 -17626 -12445
16242 -12445 -9655 -8767 -9268 -12972 -14199 -8969 -4265 -2346 -6905 -8560 -10982 -11178 -10902 -16197 -18711
16227 -18711 -16096 -9247 -7377 -9703 -7217 -12127 -10911 -6084 -11486 -12628 -10150 -7739 -11312 -15751
16213 -15751 -18790 -22238 -16582 -17255 -20206 -18810 -16375 -14581 -18688 -18657 -14022 -11826 -11327 -4298 -7367
16198g367r23Q159j00m756J467m107j244p834M929O212M86m087k422j282n618
16183a8487j008N976M943n36l049p765l397m549j152N316J0210n967P047Q988
16169c430j711k319P40N113l887m405J694l193M627P919L141l942j272j212n192
16154g329K420k688k959M03Q708L692n797j1113p675P20m341j481M033K297M192
16139a6918Q564N063o053r580J371P144l254n03K876J211K026j909p981K898O889
16124h156J413n638q62j27K233M863R055k386n489M79r88L476J293n581J451M405
16108e59l782j991j509p718n224M278O468L453N155l746m672k85k479l79M472
16093h518N178j697p766p181K510K005J59p3L290Q093M144M908j362l616m033
$$ plain form
16198 -7367 -8290 -131 -231 -4987 -3520 -7627 -8871 -16705 -11776 -5564 -5078 -9165 -11587 -12869 -18487
16183 -18487 -19495 -13519 -8576 -9112 -12161 -19926 -23323 -27872 -29024 -23708 -13498 -19465 -12418 -3430
16169 -3430 -5141 -7460 -6720 -1607 -5494 -9899 -8205 -11398 -6771 1148 4289 347 -925 -2137 -7329
16154 -7329 -4909 -7597 -10556 -10153 -1445 2247 -3550 -14663 -22338 -21618 -25959 -27440 -23407 -21110 -16918
16139 -16918 -8354 -3291 -9344 -18924 -17553 -10409 -13663 -14166 -11290 -10079 -8053 -9962 -17943 -15045 -8156
16124 -8156 -6743 -12381 -13243 -13370 -11137 -6274 2781 395 -5094 -4615 -5603 -2127 -834 -6415 -4964 -559
16108 -559 -4341 -6332 -7841 -15559 -20783 -16505 -10037 -6584 -1429 -5175 -9847 -10132 -12611 -12990 -8518
16093 -8518 -3340 -5037 -12803 -19984 -17474 -15469 -15310 -15383 -12093 -4000 144 5052 3690 74 -3959
16078c959k778j915o79r55p45o855k092J858M548N185J13n34K136P34N861O875
16062F798K03n320K543L911o116n315p525m782L031Q375K332J168o749J463N619
16047c64N522o327Q65p15r518l809R57N974K711K435l712r097L371L546r19o49
16031i729L917j461n113K779J1729L606l886k768L918k874l444l605J742J291
16017c898K748L261M478P35K15n242P31O43m022k8j034r753R29K428j661M570
16001d900k915o81o06k146m345m524P613K230K895M909o06K402Q745k767r220
15986c916n768k696M918J731l580q121m201R418J207L905J14l172n248m063L789
15971a5683O419M468j006j004n221J566J688k268p264J090L653m146M964r98k452
$$ plain form
16078 -3959 -6737 -8652 -9331 -10286 -11031 -17886 -19978 -18120 -13572 -8387 -8274 -8808 -6672 -5938 -77 6798
16062 6798 7001 1681 4224 8135 2019 -3296 -10821 -15603 -12572 -4197 -1865 -697 -7446 -5983 -364
16047 -364 5158 -1169 -304 -1019 -10537 -14346 -13389 -7415 -4704 -2269 -5981 -15078 -11707 -8161 -9080 -9729
16031 -9729 -5812 -7273 -12386 -9607 2122 5728 1842 -926 2992 118 -3326 -6931 -5189 -3898
16017 -3898 -1150 2111 6589 7324 7539 2297 3028 3671 -351 -379 -1413 -11166 -10237 -7809 -9470 -4900
16001 -4900 -7815 -8496 -9102 -11248 -15593 -20117 -12504 -10274 -7379 -2470 -3076 -674 8071 5304 -3916
15986 -3916 -9684 -12380 -7462 -5731 -9311 -17432 -21633 -12215 -11008 -7103 -6989 -10161 -15409 -19472 -15683
15971 -15683 -9264 -4796 -5802 -6806 -12027 -10461 -8773 -11041 -18305 -17215 -13562 -17708 -12744 -13742 -16194
15956a6194M765L231k724M713N47j347N322J475N551o57q355n94M681l001j356
15941c943l05m848O395J0287L309k268o209p579m547J091j464N805M090k660m085
15926f931o357P4P042N97p292N065M149J562K653k132n708L84O742K647m625l696
15910e826M643J77L87j15J480M342J437l921k302n112M911L387m928q847o764
15895a7051J904L885Q886J0841N43p348o581N28l378K64K460K526N627J25j486
15880A745K533K294J517R4m418k220N974n698j394J667r121K881l8M240J851l322
15864a415m037r29q55K721j593j0954L077K548N906l974l777M140N353L73L978
15849E62m22n980l901nk2n33m787J760M939l274L169K577j277M087K059K212Q35
$$ plain form
15956 -16194 -11429 -8198 -10922 -6209 -5662 -7009 -1687 -212 5339 4682 -3673 -4267 414 -2587 -3943
15941 -3943 -4248 -9096 -2701 7586 10895 8627 2418 -5161 -9708 -8617 -10081 -4276 -186 -2846 -6931
15926 -6931 -13288 -13214 -6172 -5575 -12867 -7802 -3653 -2091 562 -1570 -7278 -6894 -152 2495 -2130 -5826
15910 -5826 -1183 -1006 -619 -734 746 5088 6525 2604 302 -4810 101 3488 -1440 -10287 -17051
15895 -17051 -15147 -11262 -2376 8465 9008 1660 -4921 -4393 -7771 -7507 -5047 -2521 3106 3231 1745
15880 1745 4278 6572 8089 8183 3765 1545 7519 1821 427 2094 -7027 -4146 -4184 56 1907 -1415
15864 -1415 -5452 -6381 -7236 -4515 -6108 -17062 -13985 -11437 -5531 -9505 -13282 -9142 -3789 -3416 562
15849 562 140 -5840 -9741 -9746 -9768 -10301 -15088 -13328 -8389 -11663 -8494 -5917 -7194 -3107 -1048 1164 1999
15832A999k466p227K208o80l589O742O251j016L220J659k378m714n579J935m392
15817h027p219l22M421K147m70OL282O523j721n96K54P04k207M429J954l0L278
15800F406O703J464l762r92Q38l677j385n493l179J692L95M579k941m084QJ825
15784a603K228l79L803p718l927M286O092L931L553q51p008M96K253M60K023j952
15768E687L114N181m980l464n971n351k440K718L05n861N115K2j0578L640R02
15753a1961M381k998j79Q472K410m428K66j458J298m549k563L51J960k282J960
15738i320K595k10M102N07L355Q81O305l385n565r31m374L897m95o836o011N639
15722i846N951P290r36Q95o542l453K980K952k666n38q57Q586K093n027l418n087
$$ plain form
15832 1999 -467 -7694 -5486 -6166 -9755 -3013 3238 2222 5442 7101 4723 9 -5570 -3635 -8027
15817 -8027 -15246 -15568 -11147 -9000 -9470 -9464 -6182 341 -1380 -1976 -1722 -1018 -3225 1204 3158 3128 6406
15800 6406 13109 14573 10811 9819 10657 6980 5595 102 -3077 -1385 -990 3589 648 -3436 -3428 -1603
15784 -1603 625 246 4049 -3669 -7596 -3310 2782 6713 10266 9415 2407 2903 5156 5616 7639 5687
15768 5687 8801 13982 9002 5538 -433 -5784 -8224 -5506 -5201 -11062 -5947 -5925 -16503 -12863 -11961
15753 -11961 -7580 -10578 -10757 -2285 125 -4303 -4037 -5495 -4197 -8746 -11309 -10958 -8998 -11280 -9320
15738 -9320 -6725 -6935 -2833 -2326 1029 1910 8215 4830 -735 -1666 -6040 -2143 -2638 -9474 -15485 -9846
15722 -9846 -3895 3395 2459 3354 -3188 -6641 -3661 -709 -3375 -3913 -4770 3816 5909 882 -2536 -7623
15706g623n255q97m620j702p60O125J0328m734k99K536Q80o138j172L118K524
15691g689o750J226M513M491P015j180r624m905NR04l20o75M833Q486m116j0954
15675a4740p55M613J927m905N22M550O254L440m463o040m33L683N183K010l420
15660b574k52Q08o52j922l42P326j308K520m983p016r38k848L427M668q592l909
15644a6587l248O056K195M144K395J454l961L131Q784K139n182K408N714O212
15630A5654n067j2302j4125J1L338o10L436L858J122M413L954j105r71K023n228
15615a599k990r611k07J407n96K938J987j161j304P117N244k916p199j647N165
15600e372n66l672N667J759j547k713j645k003M794L916J97k222q352L222K016
$$ plain form
15706 -7623 -12878 -13775 -18395 -20097 -20857 -14732 -4404 -9138 -9437 -6901 -6021 -12159 -13331 -10213 -7689
15691 -7689 -14439 -13213 -8700 -4209 2806 1626 -7998 -12903 -12898 -11994 -12314 -12989 -8156 330 -3786 -14740
15675 -14740 -15495 -10882 -8955 -13860 -13338 -8788 -2534 906 -3557 -9597 -10030 -6347 -1164 846 -2574
15660 -2574 -2826 -2018 -2670 -4592 -4934 2392 1084 3604 -1379 -8395 -9333 -12181 -8754 -4086 -12678 -16587
15644 -16587 -19835 -13779 -11584 -7440 -5045 -3591 -7552 -4421 4363 6502 1320 3728 9442 15654
15630 15654 10587 -1715 -15840 -15829 -12491 -13101 -9665 -5807 -4685 -272 3682 2577 1606 3629 -1599
15615 -1599 -4589 -14200 -14407 -13000 -13596 -10658 -8671 -9832 -11136 -4019 1225 -1691 -8890 -10537 -5372
15600 -5372 -5938 -9610 -3943 -2184 -3731 -6444 -8089 -10092 -5298 -1382 -1185 -3407 -11759 -8537 -6521
15585f521M908O998M501R56n797J987m944r451m883K593N0j281N530Q02n911n215
15569a5678L661l64j23K006N097O605k55k922j608l169n544J615l688m464M997
15554a3834n55o04J111K769O747j020J590J131o105j295K270L460n333p52J2388
15539A968M931k705p044k481J182P348O462K61j224j0363m164k03N160O64p205
15524g413l879j07K572l137k202o01M932J327Q855M86r06J46o197k360j39J035
15508g588N936l270k09K039N211K801q192j906j293l103O14M995K969o95L006
15493A315n104l481J377N108K079p4o247m462J55N150l80m565K82K84M496k59
15477d326J447j233l664j72k476J687l894j961P104O393J914j13P428l495j1197
$$ plain form
15585 -6521 -1613 5385 9886 10842 5045 7032 2088 -7363 -12246 -9653 -9603 -10884 -5354 -4552 -10463 -15678
15569 -15678 -12017 -12381 -12504 -10498 -5401 1204 949 -1973 -3581 -6750 -12294 -10679 -14367 -18831 -13834
15554 -13834 -14389 -14993 -13882 -11113 -4366 -5386 -3796 -2665 -8770 -10065 -7795 -4335 -9668 -10420 1968
15539 1968 6899 4194 -2850 -5331 -4149 3199 9661 9922 8698 -1665 -5829 -6032 -872 -208 -7413
15524 -7413 -11292 -11399 -8827 -11964 -14166 -14767 -9835 -8508 347 833 -73 73 -6124 -8484 -8623 -7588
15508 -7588 -1652 -4922 -5131 -3092 2119 4920 -3272 -5178 -6471 -9574 -8960 -3965 -996 -1691 1315
15493 1315 -3789 -7270 -5893 -785 1294 1220 -5027 -9489 -9334 -4184 -4564 -9129 -8847 -8563 -4067 -4326
15477 -4326 -2879 -4112 -7776 -7948 -10424 -8737 -12631 -14592 -7488 -1095 819 706 8134 4639 -6558
15462f558l982k941k486N191J814k528M585o278k895K729J7112L731p142l428
15448c076q86L399K752m277P30K525p843j066N310J171J784P55m879J585l950
15433e966r00m793J155K788O907N534j847n757Q25L447N689l975K076j752l840
15418d09K910j425p142q283M087M389l262r3J788j654n048L472L496J274O985
15403A085L384N33m183m990J558k928r88O459L716n806L21n706j0199J362P285
15388i097O342r50P92p62J433M18L646M304j762o406q484n053j528j331K349O411
15372i678m285l490l04L608J992L847K893K773M318m341n60l762j675L170K445
15357c049J337L012m34j905N85j497m89J518M667m09l569r04J728N68j741k070
$$ plain form
15462 -6558 -10540 -13481 -15967 -10776 -8962 -11490 -6905 -13183 -16078 -13349 3763 7494 352 -3076
15448 -3076 -3962 -563 2189 -2088 -1358 1167 -6676 -7742 -2432 -1261 523 1278 -3601 -2016 -5966
15433 -5966 -6866 -11659 -10504 -7716 -809 4725 2878 -2879 -2054 1393 7082 3107 5183 3431 -409
15418 -409 2501 1076 -6066 -14349 -10262 -5873 -9135 -9228 -7440 -9094 -14142 -10670 -7174 -5900 1085
15403 1085 4469 5002 819 -4171 -2613 -5541 -6529 -70 3646 -2160 -1839 -7545 -17744 -16382 -9097
15388 -9097 -2755 -3705 -2913 -3675 -2242 -1824 1822 6126 4364 -2042 -10526 -15579 -17107 -18438 -16089 -9678
15372 -9678 -13963 -17453 -17757 -14149 -12157 -8310 -5417 -2644 1674 -2667 -3227 -6989 -8664 -5494 -3049
15357 -3049 -1712 1300 866 -1039 -454 -1951 -2440 -922 3745 3336 -233 -1137 591 1159 -582 -2652
15341b652j399m514N49n861q26K705L609K532N118L694N754k811q836p40M942
15326A264j686l346q590k510j334L820J0140K329j059P42N071m81o270L076r73
15311A93K67j86j877Lr251l259J929m234M833K631j243k603L261J908L090R1k242
15294f689k871P36l150M252j221M61L128j055n637j019M442L906M501l101o47
15279c964J144j047l72p637k256N076R780P560q472n471j476N445O123K16J343
15264E992K195P83p937j085m211L258l291k773Q222K603n165J323N098R77k534
15249C455k212m967k455L846O23n776N174P82J255J053j303m856M105K466n506
15234d316j403l458L235L587J033J307o493l292P043j763j863N903P051L546n766
$$ plain form
15341 -2652 -4051 -8565 -8016 -13877 -14703 -11998 -8389 -5857 -739 2955 8709 5898 -2938 -3678 1264
15326 1264 -422 -3768 -12358 -14868 -16202 -12382 -2242 87 -972 -230 4841 4360 -1910 1166 193
15311 193 460 274 -1603 -1600 -10851 -14110 -12181 -16415 -11582 -8951 -10194 -12797 -9536 -7628 -4538 -4447 -6689
15294 -6689 -9560 -8824 -11974 -7722 -8943 -8482 -5354 -6409 -12046 -13065 -8623 -4717 -216 -3317 -3964
15279 -3964 -2820 -3867 -4239 -11876 -14132 -9056 724 8284 -188 -5659 -7135 -1690 4433 4649 5992
15264 5992 8187 8970 1033 -52 -4263 -1005 -4296 -7069 1153 3756 -1409 -86 5012 5989 3455
15249 3455 1243 -3724 -6179 -2333 -1710 -7486 -2312 -1530 -275 778 -525 -5381 -1276 1190 -4316
15234 -4316 -5719 -9177 -5942 -2355 -1322 -15 -6508 -9800 -2757 -4520 -6383 -480 6571 10117 4351
15219D351r139j589j615j04N646R649l696p544p14Q30J480K13j160P296K424p046
15203g18j2755j253N851k48R46J173L59m2r078R703P261N48P23j550o87L727l518
15186D42J689M15j895K800o037J096J491l52k784k588l818J860Q129N516j0069
15171d105l684p845L959P179L076k181k024N851k514J67o111N08R49j683L844
15156d614N848l801J787P846k790l936K150m062k055J40M348N96J524l365m649
15141e033j9n22J028J232K092M75O71j998j874k72q035K06O975K600L7l588j005
15124g030J503J0R368J808o563m783l479P67K800p47L274L374l945J093J513l856
15108d893J057L357R04n509l364p04R2J459K474k661l161j922M276P303M861O91
$$ plain form
15219 4351 -4788 -6377 -7992 -8096 -2450 7199 3503 -4041 -4755 -3925 -2445 -2232 -3392 3904 6328 -718
15203 -718 -13473 -14726 -8875 -9123 -8177 -7004 -6645 -6687 -15765 -6062 1199 1747 2470 920 233 3960 442
15186 442 2131 2546 651 3451 -2586 -1490 1 -351 -3135 -5723 -9541 -7681 448 5964 -4105
15171 -4105 -7789 -15634 -11675 -4496 -1420 -3601 -5625 226 -2288 -2121 -8232 -7724 -6775 -8458 -4614
15156 -4614 1234 -2567 -780 7066 4276 340 2490 -1572 -3627 -3487 861 1457 2981 -384 -5033
15141 -5033 -5052 -5574 -4546 -3314 -1222 -747 -76 -2074 -3948 -4220 -12255 -12049 -5074 -2474 -2437 -6025 -7030
15124 -7030 -5527 -5517 3851 5659 -904 -5687 -9166 -8399 -5599 -6346 -3072 302 -3643 -2550 -1037 -4893
15108 -4893 -3836 -479 425 -5084 -8448 -9152 -9060 -7601 -5127 -7788 -10949 -12871 -8595 -1292 3569 4260
15092D260m792j724J602J860q988o17J986K411R402j427k975L285N49N17K487
15077G836n277K866j213j0731n144K823M080L677N70K35R33k092m278n87k238
15062h540j96K184N35M441r3m896n154n044j973L356M43N509J186J113N363J441
15046c25R18j586P85l097N35l110j43n66L528O9N27l688J339l055K945O528m101
15029b497m358l797l936J123J0482L169k281l005l081j244K483N326J879n82m612
15014d931L12R125L323q099j644l182M706l379N407m627j603K376M426J107k253
14999A064M736J314n108p773N78K612M77n699o913K188N744k5r80j64O088l663
14983e524r863j560N454N025k88M616j407m589K419J943L784j63j746j606J553
$$ plain form
15092 4260 -532 -2256 -654 1206 -7782 -8399 -6413 -4002 5400 3973 998 4283 4832 5349 7836
15077 7836 2559 5425 4212 -6519 -11663 -8840 -4760 -1083 -513 -278 655 -1437 -5715 -6302 -8540
15062 -8540 -8736 -6552 -6017 -1576 -1669 -6565 -11719 -16763 -18736 -15380 -14937 -9428 -8242 -7129 -1766 -325
15046 -325 593 -993 -208 -3305 -2770 -5880 -6023 -6589 -3061 -2992 -2465 -6153 -4814 -7869 -4924 1604 -2497
15029 -2497 -6855 -10652 -14588 -13465 -2983 186 -2095 -5100 -8181 -9425 -6942 -1616 263 -319 -4931
15014 -4931 -4619 4506 7829 -270 -1914 -5096 -390 -3769 1638 -2989 -4592 -2216 2210 3317 1064
14999 1064 5800 7114 2006 -5767 -5189 -2577 -2100 -7799 -14712 -12524 -6780 -6805 -7785 -7949 -1861 -5524
14983 -5524 -15387 -16947 -11493 -6468 -6756 -2140 -3547 -8136 -5717 -3774 10 -153 -1899 -3505 -1952
14968a952k327l323K445O853N20K3J63R50J52J398p625j0663K439M666J286m556
14952i551n611l89J692J520M013N717N58J09J147k960M90L082L881l943k229n40
14936c014J124l667j851K240L482K280J55l057k708o32L679q61O970M079o417
14921A802j994J036L411j0353m461N831k260r95K808J478l823m961N315P760R72
14906A566j669j668l521k410m326m894l855Q997P535l239l169m77J312k065K053
14891i830J817K396O3J36M890J556k785J689M298M727p53n416J597L56k264K943
14875E420N57q363J156O516M681m381m652p735J337k14L626O310j823l863n469
14860f897Q29M449R349L123l997j427J43m010j868j888L136l268j942K746K541
$$ plain form
14968 -1952 -4279 -7602 -5157 1696 2216 2239 2402 3352 3504 4902 -2723 -13386 -10947 -6281 -4995 -9551
14952 -9551 -15162 -15551 -13859 -12339 -8326 -2609 -2051 -1942 -795 -3755 -3265 -183 3698 -245 -2474 -3014
14936 -3014 -1890 -5557 -7408 -5168 -1686 594 749 -2308 -5016 -5648 -1969 -2830 4140 8219 1802
14921 1802 -192 844 4255 -6098 -10559 -4728 -6988 -7983 -5175 -3697 -7520 -12481 -7166 594 1566
14906 1566 -103 -1771 -5292 -7702 -12028 -16922 -20777 -11780 -4245 -7484 -10653 -11130 -9818 -11883 -9830
14891 -9830 -8013 -5617 -5554 -5418 -528 1028 -1757 -68 4230 8957 8204 2788 4385 4741 2477 5420
14875 5420 5977 -2386 -1230 5286 9967 5586 934 -6801 -5464 -5678 -2052 4258 2435 -1428 -6897
14860 -6897 -6068 -1619 7730 10853 6856 5429 5572 1562 -306 -2194 942 -2326 -4268 -1522 1019
14845A019k496k184n687Q11K651j721N37R965k07n067k898o849m794M993R509
14830b418L509O294L688k972j142m113k991J797j792R70K504L003J888n52J7L547
14814A1237l367p885r827p06M795k873l450M751M837N198K005J622P027l97o013
14799F954k112n997K037O158K963Q341J2534J3579Q238K5260L6920M3061M8153
14786B06089M9982L6116J9405M148r624k9864m1936m4861m3623l0725k4926j9754
14774G0427j1914p961j0940j1663m317L556J545m617l593j1252j43j621N73K51
14760H331n112K46M930n470qK284j926M84m474m108o80q67R09r2K596Q633J840
14743G516j234k99j291l55K053k05l662p381j179L427L780K265K526J688k685
$$ plain form
14845 1019 -1477 -3661 -9348 -8537 -5886 -7607 -7070 2895 2688 -2379 -5277 -12126 -16920 -11927 -2418
14830 -2418 1091 7385 11073 8101 6959 2846 -145 1652 -140 830 3334 6337 8225 7673 7690 11237
14814 11237 7870 -15 -9842 -10548 -5753 -8626 -12076 -7325 -2488 2710 4715 6337 13364 12967 6954
14799 6954 4842 -1155 882 7040 10003 18344 30878 44457 52695 77955 114875 157936 206089
14786 206089 256071 292187 311592 315740 306116 276252 234316 189455 145832 115107 90181 70427
14774 70427 58513 50552 39612 27949 23632 27188 28733 24116 20523 9271 9128 7507 8080 8331
14760 8331 3219 3465 8395 2925 2917 5201 3275 3759 -715 -4823 -5503 -6370 -5461 -5553 -2957 5676 7516
14743 7516 6282 5983 4692 4337 6390 6185 2523 -4858 -6037 -2610 1170 3435 5961 7649 4964
14728D964J208K559jM629m084k610L486M397k00k382j076j39l795m717J2240J2218
14712B6697n69l508P939J7840J0976R364K6277K9194L0215L6803M3235L9480K4966
14699B98909J4922m935k2738l5293m3878m6035m2351k8338j6736j4146q468p983
14687D2930r885j3806j813k791m010l020l693l124N893N126J251P60l726k328
14673G764k873m97l811M871j669k912K681j108m90k746K101k07o535m681M168
14658e944M009M263K48j684l891K615M802j848o421J430J098j458J1713n440q044
14643d552k308N308N040M94j841k385j537j038O647R96n324l59r12l802o592j658
14627a3823M628J702j48R406K251l310K249J313J057k526n461m912M003J275M11
$$ plain form
14728 4964 6172 8731 8730 13359 9275 6665 10151 14548 14348 11966 10890 10751 6956 2239 14479 26697
14712 26697 26128 22620 30559 48399 59375 68739 95016 124210 154425 191228 234463 273943 298909
14699 298909 313831 308896 286158 250865 206987 160952 118601 90263 73527 59381 50913 42930
14687 42930 33045 19239 17426 14635 10625 7605 3912 788 6681 11807 13058 13818 10092 7764
14673 7764 4891 4394 583 5454 3785 873 3554 2446 1956 -790 1311 1104 -5431 -10112 -5944
14658 -5944 -1935 2328 2576 892 -2999 -384 4418 2570 -3851 -2421 -1323 -2781 8932 3492 -4552
14643 -4552 -6860 -1552 3488 3982 2141 -244 -1781 -2819 3828 4824 -500 -859 -1771 -5573 -12165 -13823
14627 -13823 -9195 -7493 -7641 1765 4016 706 2955 4268 5325 2799 -2662 -7574 -3571 -2296 -1885
14612a885L618n800l020N661O13J001J425k153K261N621m775j1657j397Q06m999
14597a4680m996n085K939N854l67l829O132P358J010j121m85O950L765O870r1
14582A0224k336o149J729m012m529P856Q98n765L584L776m647j596Q89P216J614
14567H752J879k116j5216o80n005k775N759M297Q806l531o388N674K00J700k279
14552i23N152M263m3J590m433m559o047k576n29k34P129Q802k106n374p536K090
14536e334P065O630J432k748j301O105M540J081p006r91p156q686m129K898J865
14521e735o21o87O877m153k572L457j278k125l427N375L640m20J23J569j68J182
14505A037N76L576J479l212L069J027r163P63k815m944L40L848J275J453m151
$$ plain form
14612 -1885 1733 -4067 -7087 -1426 -813 188 1613 -540 1721 7342 2567 -9090 -10487 -9681 -14680
14597 -14680 -19676 -24761 -21822 -15968 -16335 -20164 -14032 -6674 -5664 -6785 -7270 -320 3445 10315 10224
14582 10224 7888 1739 3468 -544 -5073 2783 3681 -2084 1500 5276 629 -967 -78 7138 8752
14567 8752 10631 8515 -6701 -7381 -12386 -15161 -9402 -5105 3701 170 -6218 -544 -344 1356 -923
14552 -923 4229 8492 8449 10039 5606 1047 -5000 -7576 -8105 -8339 -1210 7592 5486 112 -7424 -5334
14536 -5334 1731 8361 9793 7045 5744 11849 16389 17470 10464 9473 2317 -6369 -10498 -7600 -5735
14521 -5735 -6356 -7043 -166 -4319 -6891 -3434 -4712 -6837 -10264 -4889 -1249 -1669 -1546 23 -145 1037
14505 1037 1613 5189 6668 3456 6525 7552 -1611 -848 -3663 -8607 -8267 -4419 -3144 -1691 -5842
14490e842q089J695M792L935Q309Q16k070n772o71Q46J100k270k882N556N155
14475D608K330N455M343j1399m269j279J87j1582J57J0486O846M050J917r922
14461A928q092j409j615k723O638J399j445K424L030n642J185J149M398L603j517
14446C311m042N188L440m596q940r16L971J481K93J754K617k832o477M212Q045
14431F509L294L946k158J445k161k539m382n792j538Q759R26k232l712p061o85
14416g381J44M257K216K414K503O384J336J667l0L148k892l385M77k629l681j294
14400C254M191j784l127m460N572N395j712n871M463J1071K603q032o083l018
14386B462k694N260J489l837j393N40J638m587L741L45J158R183m113m814q89
$$ plain form
14490 -5842 -13931 -12236 -7444 -3509 4800 5616 3546 -2226 -2897 -2051 -951 -3221 -6103 -547 4608
14475 4608 6938 12393 16736 5337 1068 -211 -24 -11606 -11449 -963 5883 9933 11850 1928
14461 1928 -6164 -7573 -9188 -11911 -5273 -3874 -5319 -2895 135 -5507 -4322 -3173 1225 4828 3311
14446 3311 -731 4457 7897 3301 -5639 -6555 -2584 -1103 -810 944 3561 729 -5748 -1536 6509
14431 6509 9803 13749 11591 13036 10875 8336 3954 -1838 -3376 5383 6309 4077 365 -6696 -7381
14416 -7381 -7237 -2980 -764 1650 4153 10537 11873 13540 13510 16658 13766 10381 10858 8229 4548 3254
14400 3254 7445 5661 2534 -1926 3646 9041 7329 1458 5921 16992 19595 11563 5480 2462
14386 2462 -232 5028 6517 2680 1287 1827 3465 -1122 2619 2964 4122 13305 9192 4378 3489
14371C489r424M048K995m104l164L383k041N067J140k377p79P320M571o734R1
14356C481K185j388p79n235K027K903M164M043K474m63p63m179p33r165n986N923
14340a491P250J137K017O326k420o572p023K892M365J456p43n394n234k245L571
14325b108Q365O207q48o193q188k068k290o522J674Q023O804l672l200n15o478
14310a1009n563Q424Q201Q9R934k20k922p49l06l92N53L094n112j0443k714L221
14294e914K856O813J1041k545l714O29J4631J8960N583n197o103q381m962l510
14280B0187p562j954M348r851p566P743L920l609n904o131L276J0130L052p095
14266B984p081L128l233Q43p61L903N284p60j479k969L008J072j363N769N094
$$ plain form
14371 3489 -5935 -1887 1108 -2996 -6160 -2777 -4818 249 1389 -988 -1767 5553 10124 3390 3481
14356 3481 5666 4278 3499 -1736 291 3194 7358 11401 13875 13412 12649 8470 7737 -1428 -7414 -1491
14340 -1491 5759 6896 8913 15239 12819 6247 -776 2116 6481 7937 7194 1800 -3434 -5679 -2108
14325 -2108 6257 12464 11616 5423 -2765 -4833 -7123 -13645 -11971 -3948 2856 -816 -4016 -4531 -11009
14310 -11009 -16572 -8148 53 142 10076 9856 6934 6185 5879 5487 6040 9134 4022 -6421 -9135 -5914
14294 -5914 -3058 3755 14796 12251 8537 9166 23797 42757 48340 43143 37040 28659 23697 20187
14280 20187 12625 10671 15019 5168 -2398 5345 9265 5656 -248 -6379 -3103 7027 10079 2984
14266 2984 -4097 -969 -4202 -3359 -4120 -217 5067 4307 2828 -141 2867 3939 2576 8345 13439
14251A3439l516n43L084L72k450j04m911k403N464j3k849k994k924r21J782J130
14235A643M229J623n53l32l386l869M94N366q256j699J038L841K487l29M534M393
14219A1224n704m686j179k472q87J923K360k022J197J478L851j464j288k233J639
14204A737pO58k238k295N074O409K30k744r371N77K140N692O98K765K648j519
14188A0454Q88o63P75M652o273n330M484o81n780p359k013l88l630P494M471l860
14172b759j614K463P431k539Q86j860Q7J347J557o2K289k598p8K413p46k85K249
14155H181o712r168r60L242L933j236N293p44j970J195K685j31q30N184j581l426
14139B955l170l136J07O103k604n024j144j079k355O546J3347M541p769o422m33
$$ plain form
14251 13439 9923 9380 12464 12836 10386 10282 5371 2968 8432 8419 5570 2576 -348 -1269 513 1643
14235 1643 5872 7495 6942 6610 3224 -645 -151 5215 -3041 -4740 -3702 139 2626 2297 6831 11224
14219 11224 5520 834 -345 -2817 -3704 -1781 579 -1443 -246 1232 5083 3619 2331 98 1737
14204 1737 1730 2388 150 -2145 2929 9338 9568 6824 -2547 -1970 170 5862 6560 9325 11973 10454
14188 10454 11342 10679 11454 16106 9833 4503 8987 8306 2526 -4833 -6846 -7234 -10864 -3370 1101 -2759
14172 -2759 -4373 -1910 5521 2982 3868 2008 2095 3442 4999 4937 7226 4628 4550 6963 6217 5932 8181
14155 8181 1469 -7699 -8659 -5417 -1484 -2720 2573 1829 -141 1054 3739 3608 2778 7962 6381 2955
14139 2955 -215 -3351 -3244 2859 255 -4769 -5913 -6992 -9347 -2801 10546 15087 7318 896 463
14124D63K980l296n45N562K898qP92k41m333p188q97o17L406j607M345k615l337
14107d238m851l835L481K697K077J264K817R93j156q25J494J527l143L19P582
14092F203K187n835L088K672K02m626k958K052m813L453J02L286N110m937k240
14077B946M768q47L897K494n88j348m060R05k62L040M71k872n406o869O15J622
14061a494m55j652n8l439N58J0509Q70o721k879j893K369N870Q830K219N52N282
14045A8468J6631J8099k31r258j8705j1033p945l040J407O708j194k900q201r94
14031b188N245L293k547l943j092L369j806K210M010K121j821n76k045j341K695
14016E584k356j277k787K851J093N475K170m588j734Q2l076j128L25m501O07N64
$$ plain form
14124 463 3443 147 -398 5164 8062 8054 8846 8605 4272 -2916 -3813 -4430 -1024 -2631 1714 -901 -4238
14107 -4238 -9089 -12924 -9443 -6746 -4669 -3405 -588 405 -751 -1576 -82 1445 -1698 -1379 6203
14092 6203 8390 2555 5643 8315 8517 3891 933 2985 -1828 1625 1727 5013 10123 5186 2946
14077 2946 7714 6867 10764 13258 12670 11322 7262 8167 7905 10945 11416 8544 3138 -3731 -3116 -1494
14061 -1494 -1949 -3601 -3659 -7098 -6540 3969 4839 -1882 -4761 -6654 -4285 1585 10415 12634 13186 18468
14045 18468 35099 53198 52967 43709 25004 13971 6026 2986 4393 11101 9907 7007 -1194 -2188
14031 -2188 3057 6350 3803 -140 -1232 2137 331 2541 6551 8672 6851 6275 4230 2889 5584
14016 5584 3228 1951 -836 2015 3108 8583 10753 6165 4431 4513 1437 309 634 -3867 -3260 -2696
14000b696j525P869L340L487M86m10Q49o915l902O133P512m573k160k478k304
13985B713o397M304Q111L814j739m595J116J225L067l864o690r39l90N071k11
13970D596j02L760L866k986o256j338r10k577J319l424J59j232L733n231l416
13955a0039P881L701m018q21j144J066M635M942M617K663r0n416n804k237l850
13940c914k832L788J1574O212J458J302l782K830q231l513l895j243J309O228
13926G291l095l288lk292l562N127L834N172M47N777k969r09M36k900J18l213
13910E971n421O850N967J05J703m279k504L395n51J937M194O05j160m007m2O89
13894A3452o14J637n023k820K353L347K2l311L59O347O36n87k611q769J071K776
$$ plain form
14000 -2696 -4221 3648 6988 10475 10961 10551 11400 4485 583 6716 14228 9655 7495 5017 2713
13985 2713 -3684 620 8731 12545 10806 6211 7327 8552 11619 7755 1065 126 -264 4807 4596
13970 4596 4494 8254 12120 9134 2878 1540 630 -1947 -628 -4052 -3893 -5125 -1392 -6623 -10039
13955 -10039 -2158 1543 -2475 -3296 -4440 -3374 1261 6203 10820 13483 13393 7977 2173 -64 -3914
13940 -3914 -6746 -2958 8616 14828 16286 17588 13806 16636 8405 4892 997 -246 1063 7291
13926 7291 4196 908 905 -1387 -4949 178 4012 9184 9631 15408 12439 11530 11966 9066 9184 5971
13910 5971 550 7400 13367 13472 15175 10896 8392 11787 11236 13173 17367 17972 16812 12805 12763 13452
13894 13452 12838 14475 9452 6632 8985 12332 12354 9043 9402 15749 16385 15798 13187 4418 5489 8265
13878H265K338p755p551l160K797J85L651K355N988O353n765j242M41m006l710
13863h16n896k281P243J788l970m2K013M054M531k969j910o430M10K804l036J303
13847c204m375j476L291K378j572Q197M036K265n095m91K196M567o022p038n292
13832g635p651L671M477N394J356J407j679L317N470k301j268L711n281K54O339
13817I581M32p208l505J655N747N37n284j596J4J382M939l247k993M771p398L833
13801A660L256Q61k4K338L035K47j458M884L343l201k038l283n410k710L06K483
13785D289k071K301r44K22M194M027m438m470o928j822J513Q224J879n881P629
13770G724J1170o20n131m813J302M518K206q45L051M024P307m137p763j4641j25
$$ plain form
13878 8265 10603 2848 -4703 -7863 -5066 -4881 -1230 1125 7113 13466 7701 6459 6900 2894 -816
13863 -816 -6712 -8993 -1750 38 -3932 -3974 -1961 2093 6624 3655 1745 -4685 -4275 -1471 -4507 -3204
13847 -3204 -7579 -9055 -5764 -3386 -4958 3239 7275 9540 4445 3954 6150 10717 4695 -2343 -7635
13832 -7635 -15286 -11615 -7138 -1744 -388 1019 -660 2657 8127 5826 4558 8269 2988 3242 9581
13817 9581 10013 2805 -700 955 6702 7239 1955 359 373 1755 6694 3447 454 5225 -2173 1660
13801 1660 4916 5777 5753 8091 11126 11373 9915 14799 18142 14941 12903 9620 4210 1500 1806 4289
13785 4289 2218 4519 3575 3797 7991 12018 7580 3110 -3818 -5640 -4127 4097 5976 95 7724
13770 7724 18894 18274 13143 8330 9632 14150 16356 15511 18562 22586 29893 25756 17993 3352 3227
13755C227O107l793m727n32p013M453R432m772j1528j262P984O965j282q325K513
13740b553l808m153M533m73m25M627K189l397k732J557N85N77k282K317M830n733
13724d341k841O220P353O29k730R0L919M245n781l676J047M612p943p64l208k129
13708e298N319J0842j574N65P651j784n370n531J031M771j38n20n082L00k353
13693B829J644N690L087M115o324Q36K795q743m776R427K667K739k692q571J122
13678E845L93k031M588m476R99M374L028k150K87k43j0991J233m023q51R756M791
13662A0529J646j232p170j163l20k565r60N323L99o932l392J868j22l269P889
13647E29O52l470J412P079O253Q288M547o202o911L162K867k005r5k673l670o616
$$ plain form
13755 3227 9334 5541 814 282 -6731 -2278 7154 2382 -9146 -10408 -2424 4541 3259 -5066 -2553
13740 -2553 -6361 -10514 -5981 -6454 -6879 -2252 -63 -3460 -6192 -4635 -4050 -3473 -5755 -3438 1392 -4341
13724 -4341 -7182 -962 6391 7020 4290 4380 8299 12544 6763 3087 4134 8746 803 39 -3169 -5298
13708 -5298 21 10863 9289 9854 17505 15721 10351 4820 5851 10622 10484 9964 4882 5182 2829
13693 2829 4473 10163 13250 17365 11041 11877 14672 5929 1153 10580 13247 15986 13294 4723 5845
13678 5845 6238 4207 8795 4319 5318 9692 12720 10570 10857 10614 -377 856 -3167 -4018 5738 10529
13662 10529 12175 10943 3773 2610 2290 -275 -1235 4088 4487 -2445 -5837 -3969 -4091 -7360 529
13647 529 1181 -2289 -877 6202 12455 20743 25290 19088 12177 15339 18206 16201 16106 13433 9763 3147
13631C147K982K491J1191k492p417q964N52O487l064q346j825m282M621R158L451
13616G690n221p81P209M490k023n212m798R97O377k327j1790J288O371M172k317
13601D125J638N637K332l800Q01l231j2094j899M823L619M521O144j237k492l707
13586E180J247L221n47M94k039k169m04l805m912k814k234J441K548n829Q8O744
13570c790R464O610J900j07J206l523n042k190m604R97O520P259K755j683o135
13555I637j360K743P424O377o92q930K084n167p415k444O69N564J926o292n61
13540C563J402k096K27J090K167j171J874k283p666M902K207j143M512q818k037
13525c270j064j185K686Q454M618l661n285K880j090J038R027J305j119J461J870
$$ plain form
13631 3147 6129 8620 19811 17319 9902 938 1490 7977 4913 -3433 -5258 -9540 -4919 4239 7690
13616 7690 2469 1688 8897 13387 11364 6152 1354 2351 8728 6401 -5389 -4101 2270 6442 4125
13601 4125 5763 11400 13732 9932 10733 7502 -4592 -6491 -1668 1951 6472 12616 11379 8887 5180
13586 5180 6427 9648 9101 9595 7556 5387 4983 1178 -3734 -6548 -8782 -7341 -4793 -10622 -10534 -3790
13570 -3790 5674 12284 14184 14077 15283 11760 6718 4528 -76 921 7441 14700 17455 15772 9637
13555 9637 8277 11020 18444 24821 24129 15199 17283 12116 4701 2257 2926 8490 10416 4124 3563
13540 3563 4965 2869 3096 4186 6353 5182 7056 4773 -2893 2009 4216 3073 7585 -1233 -3270
13525 -3270 -4334 -5519 -2833 5621 10239 6578 1293 4173 3083 4121 13148 14453 13334 14795 16665
13510A6665r453q11K655l452J067n45K446L772k20o334J055M437O061K226M51
13495B0020R48p039j2788k837O596K760j196m071n180j028J4026R552O965k923
13481B3805j0790m098K582l94R75j006O679R56j1363m668J110L192J759J896N845
13466A6480J850o836o84P345J373p66m288j412M951r56j837m436q847k156O419
13451F200M609L140K760l125L452K292p315m877l530j879J924M255M211q08o098
13436E211k344N41n507O324L456M169j238O49K269j373n289m912m11K102N668
13421I315k024K11K490k97j702o570j738N097m391O21R461M586r876n833P301
13406F651l133K180K490l911n668o15P032N267J1287j89r036n624k918j040J54
$$ plain form
13510 16665 7212 6401 9056 5604 6671 6126 8572 12344 12124 5790 6845 11282 17343 19569 20020
13495 20020 20968 13929 1141 -1696 4900 7660 6464 2393 -2787 -3815 10211 19763 26728 23805
13481 23805 13015 8917 11499 11105 12080 11074 17753 18709 7346 2678 3788 6980 8739 10635 16480
13466 16480 18330 11494 10810 18155 19528 18762 14474 13062 18013 17057 15220 10784 1937 -219 6200
13451 6200 10809 13949 16709 13584 17036 19328 12013 7136 3606 1727 3651 7906 12117 11309 5211
13436 5211 2867 3408 -2099 4225 7681 11850 10612 11261 13530 12157 6868 1956 1545 3647 9315
13421 9315 7291 7502 9992 9695 7993 1423 -315 4782 391 1012 10473 15059 5183 -650 6651
13406 6651 3518 5698 8188 4277 -1391 -2006 5026 10293 21580 21391 12355 6731 3813 2773 2927
13391B927M939l053p288o308O058N750j461N54K733N911m83M03q263m545J620
13376e06J0956M446J477M241m974j0036l729K194j988n606j952L895M833M712
13362G963K167n38M649N615k315r267j582l739K854N823K628K00L44l583l601
13347G618m643m063O049J39j215L224L530K150N86O883m104j6223o850L420R070
13332E571J1616l125j792K75L09L759L206l8n857p593K99M02p70l579o13m28K3
13315A665M647Q993l32J270p413j351o59l880K223j283j367n21L485K293k550
13300E220K038N80L5O314m923n74Q182O115n616k660n383j576M359k404r690K176
13284B193M733P646o124m854J472M016N927M594L441o98l438o274l679j584MM292
$$ plain form
13391 2927 7866 4813 -2475 -8783 -2725 3025 1564 2118 4851 10762 10279 10682 2419 -2126 -506
13376 -506 10450 14896 16373 20614 15640 5604 1875 4069 2081 -3525 -5477 -1582 3251 7963
13362 7963 10130 9592 14241 19856 17541 8274 6692 2953 5807 11630 14258 14458 14802 11219 7618
13347 7618 2975 -1088 4961 5100 3885 7109 10639 12789 13375 20258 16154 -69 -6919 -3499 5571
13332 5571 17187 14062 12270 12545 12854 16613 19819 19781 13924 6331 6630 7032 6262 2683 2070 1642 1665
13315 1665 6312 15305 14973 16243 8830 7479 6820 2940 5163 3880 2513 1992 5477 7770 5220
13300 5220 7258 7838 7873 14187 9264 8690 16872 22987 17371 14711 9328 7752 12111 9707 17 2193
13284 2193 6926 14572 8448 3594 5066 9082 15009 19603 23044 22346 18908 12634 8955 7371 7375 11667
13268A1667J783j884k841N02O125K058n988R63j051l000K172J110j439J912J250
13253A3339N916J011o690n843N15N188n93l305O480j139j020n702m157k103L358
13238E255L917q77J366j784O127M433L08k85N50K90k329l887n738k092R41L639
13222I834O984L087n285l958l25J188J993n655j796j465j992K013J0450L376p467
13207A0982l554L118K943j240j03k543K001O597K124M66l9n265K413Q009j044
13192B4865q255r513K538K559J656K717n012l919K710K943M040K457m400l460
13178A1926l155K067l205k299L318J269k330K97o81j652l08L821Qj793m921J346
13162C708r06O148P542N076M16K273L112J022o90q068M338J495o684l978j020
$$ plain form
13268 11667 13450 11566 8725 9227 15352 17410 11422 12385 11334 8334 10506 11616 10177 12089 13339
13253 13339 19255 20266 13576 7733 8248 13436 12843 9538 16018 14879 13859 8157 4000 1897 5255
13238 5255 9172 8295 9661 7877 14004 18437 18745 18460 19010 19300 16971 13084 7346 5254 6195 9834
13222 9834 16818 19905 14620 10662 10337 11525 13518 7863 6067 4602 2610 4623 15073 18449 10982
13207 10982 7428 10546 13489 12249 12146 9603 11604 18201 20325 20791 20752 15487 17900 25909 24865
13192 24865 16610 7097 9635 12194 13850 16567 11555 7636 10346 13289 17329 19786 15386 11926
13178 11926 8771 10838 7633 5334 8652 9921 7591 7888 7207 5555 5247 9068 9076 7283 2362 3708
13162 3708 2802 8950 16492 21568 21984 24257 27369 28391 27701 19633 23971 25466 18782 14804 13784
13147A3784n300O30O141K113J740K231j761o741l04M402Q311l995q443m094j602
13132G112k165j69R682k852o695M742M668l678j1744L340L487J787R2n142N198
13117G663L684M237q811Q8J743k793Q1p902j276N452J299j819N75k395k378L449
13101H97O49r25J055o98J546P839M3p16J796L604J179o55J030p040r189l128J0905
13084H192P544J256K452O571k274N58K820j33m955k245P51q06n258K99l395k934
13068H443R69K302Q75l984j135N168k087r77J155N32O030P83M677O623k485n903
13052B0986l489N433Q412k432m010j945J382K290l937m155K591N024j584J693
13038B6259J907l043o791J205N654q42L189l959o992L814N003j437m769k284K054
$$ plain form
13147 13784 8484 9114 15255 17368 19108 21339 19578 12837 12533 16935 25246 21251 12808 8714 7112
13132 7112 4947 4778 14460 11608 4913 9655 14323 10645 -1099 2241 5728 7515 7607 2465 7663
13117 7663 11347 15584 6773 6861 8604 5811 5892 -2010 -3286 2166 3465 1646 2221 -174 -2552 897
13101 897 1546 621 1676 978 2524 10363 10406 9690 11486 15090 16269 15614 16644 9604 415 -2713 8192
13084 8192 15736 16992 19444 26015 23741 24299 27119 26986 22031 19786 20537 19731 14473 14772 11377 8443
13068 8443 9412 11714 12589 8605 7470 12638 10551 9574 10729 11261 17291 18074 22751 29374 26889 20986
13052 20986 17497 22930 31342 28910 24900 22955 24337 26627 22690 18535 21126 26150 24566 26259
13038 26259 28166 25123 18332 19537 25191 24349 27538 23579 16587 20401 25404 23967 19198 16914 18968
13023A8968k66M892o3m546p28o59l061j240L582P47J389K63l717k256k741j002
13007I562j703O409L199J101N77k966K52N7j814K419l71l453O81Q632K62J244
12991B4088k377o633o70L644N370N125m012m617M021K59j5k833p07M901l176L96
12975B2764j10L906N763k435p917o443o85M599O975j323k952k274m08o336k869
12960A0255M460m945o452l71R817j778M264J1589k82J590O525j786m397l385Q02
12945B5906p917q463r137k84N14L110O724L774j961j712n907r695j687O8m760
12930a1427j809r7L978J880J875J1876N801p120J90O456P341n259j566RN766J034
12914A8928L439N941J789J886r232p962R10n237K068O791J263m485k30M760J74
$$ plain form
13023 18968 18702 23594 23531 18985 18257 17598 14537 13297 16879 17626 19015 19278 15561 13305 10564 9562
13007 9562 7859 14268 17467 18568 19145 16179 16431 16488 14674 17093 16722 13269 13950 22582 22844 24088
12991 24088 21711 15078 14408 18052 23422 28547 24535 19918 23939 24198 24183 21350 20643 25544 22368 22764
12975 22764 22654 26560 32323 29888 21971 15528 14843 19442 26417 25094 22142 19868 19460 13124 10255
12960 10255 14715 9770 3318 2947 12764 10986 15250 26839 26557 28147 34672 32886 28489 25104 25906
12945 25906 17989 9526 389 105 619 3729 10453 14227 12266 10554 4647 -5048 -6735 -6667 -11427
12930 -11427 -13236 -13333 -9355 -7475 -5600 6276 12077 4957 5147 11603 18944 13685 12119 12128 17894 18928
12914 18928 22367 28308 30097 31983 22751 14789 15699 10462 12530 19321 20584 16099 15869 20629 20803
12899B0803m630M378K506l081o793j121J2402j610l728P1l349J961L622o0J464
12884B2835k44p074k076l58K464M633p749l927K639N105M987j445L207q94k746
12869A9357q092L533J857L36N279Q978J190j4952l063K602J797J127k771j501
12855A5677p92L533J987n314J786L207j180n587r67J962K036n167j471J863Q115
12840A9688O892l046p884o26M81M622N591j735o162K612M193M29l394l370q58
12825A7433k880K588l68p091q80j1P64L941k141k209p54k968M142O445N298N040
12809B6349J521j45K497L222K700k118l800J0047L477o885m154K91R102M697M669
12794E1470j1m674o132p278o569m280J0917J415j89m540p360l510k334R625M212
$$ plain form
12899 20803 16173 20551 23057 19976 13183 12062 24464 22854 19126 19197 15848 17809 21431 21371 22835
12884 22835 22591 15517 13441 13083 15547 20180 12431 8504 11143 16248 21235 19790 22997 22103 19357
12869 19357 11265 14798 16655 16991 22270 31248 32438 17486 14423 17025 18822 19949 17178 15677
12855 15677 14885 18418 20405 15091 16877 20084 18904 13317 12350 14312 16348 11181 9710 11573 19688
12840 19688 26580 23534 15650 15024 15505 20127 25718 23983 17821 20433 24626 25055 21661 18291 17433
12825 17433 14553 17141 16773 9682 8802 8791 9555 13496 11355 9146 8392 5424 9566 16011 21309 26349
12809 26349 27870 27725 30222 33444 36144 34026 30226 40273 43750 36865 32711 33002 42104 46801 51470
12794 51470 51459 46785 40653 33375 26806 22526 33443 34858 34669 30129 22769 19259 16925 26550 30762
12779C0762n432j955m132l669l346k427P509K782l267M424M928q37N516K824K901
12764C6581J689j819K168N726q31p827k022j169j800J906K121N65m102l593o78
12749B6915j216J834K952J158l108p314J274O846L719J457n853m167P86O71L676
12734B9630l3j603J855O937J988j822n812n143K894M713l126k084L581n381o6
12719B6528M298l363M495J547Q07K042J617j5l436o747l782N833K233K141J380
12704C5578J038K732J20l107J952l008n76k334j593L529j001k254k107k520p367
12689A9082J338N051k625J757J534q100J24Q809k854j631K77R33l66L351m0n03
12673B6137j729m755k284M699L884K225Q74K67r65K434K64L903r30o170k253K900
$$ plain form
12779 30762 25330 23375 19243 15574 12228 9801 17310 20092 16825 21249 26177 25340 30856 33680 36581
12764 36581 38270 36451 38619 44345 43514 35687 33665 32496 30696 32602 34723 35288 31186 27593 26915
12749 26915 25699 27533 30485 31643 28535 21221 22495 29341 33060 34517 28664 24497 25283 25954 29630
12734 29630 29597 27994 29849 36786 38774 36952 31140 25997 28891 33604 30478 28394 31975 26594 26528
12719 26528 30826 27463 31958 33505 34312 36354 37971 37956 34520 27773 23991 29824 32057 34198 35578
12704 35578 36616 39348 39468 36361 38313 35305 34729 32395 30802 34331 33330 31076 28969 26449 19082
12689 19082 20420 25471 22846 24603 26137 18037 18161 26970 24116 22485 22762 23695 23329 26680 26640 26137
12673 26137 24408 19653 17369 22068 25952 28177 29051 29318 28353 30787 31051 34954 34024 27854 25601 28501
12657B8501N41l11M191M915P39O60l436n398N34J563L101j487q53q947m198Q663
12641B8778P619J388l537o100O42N942Q971m609p032J14n841n17J415N026l58
12626C1901l806l430K356R6J517m254k224J556K600p940R19K009j629k425k720
12611A4526k379K251N556L616l612n915K18M705P02k053l390L146M284J477Q56
12596B3988M786o76L347q63l868N708m977o211L352L651m006N575J865k864m904
12581B3903M765M950N970j1288o636N950K961L755j863l159R46k624p13J67l224
12566B3860L457n258k426Q953L874j251r77R42n339q631M841O077K548k056q1
12551B8533m789q38L082P566N907j967l589j611m51K53L09M498j600n113O988
$$ plain form
12657 28501 29042 28731 32922 37837 38576 39236 35800 30402 30936 32499 35600 34113 33260 24313 20115 28778
12641 28778 36397 37785 34248 28148 28790 34732 43703 39094 32062 32176 26335 25818 27233 32259 31901
12626 31901 28095 24665 27021 27117 28634 24380 22156 23712 26312 18372 19291 21300 19671 17246 14526
12611 14526 12147 14398 19954 23570 19958 14043 14261 18966 19668 17615 14225 17371 21655 23132 23988
12596 23988 28774 28098 31445 30582 26714 32422 27445 21234 24586 28237 24231 29806 31671 28807 23903
12581 23903 28668 33618 39588 28300 21664 27614 30575 34330 32467 29308 30254 27630 26917 27084 23860
12566 23860 27317 22059 19633 28586 32460 31209 30232 31174 25835 17204 22045 28122 30670 28614 28533
12551 28533 23744 22906 25988 33554 39461 37494 33905 32294 31843 32096 32405 36903 35303 30190 37178
12536C7178L929p370k185O101O127j92r229p641N53K764J154M301M373n963l259
12521C0641m584k651l993O223M853J646K384k251K15j128k690J219n232Q35l088
12506B2399j920L868M476P11K883K406j190l894n629K980Q056M427k628K527L224
12491D2696O992K827J243P408l373m819m012M329O17o869j75J95J504N04O821
12476E5888L80n885k050J538l734M19J083m803m968m859J152Q078M68o447p052
12461B9208Q162Q228r60J683Q73l149k70j710J71Q971R265K617L250Q357J049
12446G5745K478M805l648k064n406p729K280L380R418J5124O504K732J0128l419
12432A10328r203n579p630j5585j4361o023K910N35o409j72rl640n101Q13J914
$$ plain form
12536 37178 41107 33737 31552 37653 43780 43588 34359 26718 27271 30035 31189 35490 39863 33900 30641
12521 30641 26057 23406 19413 25636 30489 32135 34519 32268 32483 31355 28665 29884 24652 25487 22399
12506 22399 20479 24347 28823 29534 32417 34823 33633 29739 24110 27090 35146 39573 36945 39472 42696
12491 42696 49688 52515 53758 61166 57793 52974 48962 53291 53908 47039 46864 47059 48563 49067 55888
12476 55888 56268 50383 48333 49871 46137 46556 47639 42836 37868 33009 34161 42239 42707 36260 29208
12461 29208 37370 45598 44638 46321 47194 44045 43775 42065 42236 51207 60472 63089 66339 74696 75745
12446 75745 78223 83028 79380 77316 71910 64181 66461 69841 79259 94383 100887 103619 113747 110328
12432 110328 101125 95546 87916 72331 57970 51947 54857 55392 48983 48811 48802 45162 40061 40874 42788
12417D2788O998P456k045J131j909J812k902m881l306p529K117L978M970j035
12403D7643K019O052P827q89M824Q004P261J5268J2404Q028O523R373J6535K853
12389A53725j430r282j1479j7033j3886j0947o403m277k840l842l263J659m454
12376F6248j0870p136k628L56l221K941L925N565K167j421m48k361P65j178L045
12361E5749l87j716k085J830J786N681L552p538o212R821P365Q025J1292P787
12347I4950N925M040m383r312q439o993n583j498k817N35K033o21J387J231n175
12332F5280j0098o182K166O894r91m58L597K247l064m614j88k493K588L708l490
12317E4902k269M476K426o861j433L661L970N823l976M23k118p89m319o31R17
$$ plain form
12417 42788 49786 57242 55197 56328 54419 56231 53329 48448 45142 37613 39730 43708 48678 47643
12403 47643 49662 55714 63541 62652 67476 75480 82741 98009 110413 118441 124964 134337 150872 153725
12389 153725 152295 143013 131534 114501 100615 89668 83265 78988 76148 72306 69043 70702 66248
12376 66248 55378 48242 45614 45970 42749 45690 49615 55180 57347 55926 55478 53117 53882 52704 55749
12361 55749 55362 53646 51561 53391 55177 60858 64410 56872 50660 60481 67846 75871 87163 94950
12347 94950 100875 104915 100532 91220 82781 75788 70205 68707 65890 66425 68458 67837 69224 70455 65280
12332 65280 55182 49000 51166 58060 57069 56611 60208 62455 59391 54777 54589 52096 54684 58392 54902
12317 54902 52633 57109 59535 52674 51241 54902 58872 64695 60719 61142 59024 58235 53916 53285 54202
12302E4202L151o0N044M663o007k213O17J442j905l543m152J319L03q49n636O419
12286E2795Q792N212J025L302M641J014N266l047j2657M062P666J597L384J5589
12272I8641N319L776J5734K2914K6595M2672N4318M4718K8102K346k0989l1820
12260B92326l7904m2735l4227k3197r539j9919j5354n297k527m02j744n965p206
12247H6310Q50k12n694J088p428J46Q459P347O15M843O23n19j522J057N433M308
12231A05704J2353K2404J2753K4435L5099K8221K2649L3385L7958L7181L5966
12220D08108M1737K9965J7448k1285m2645n5807m1349l2464k0945n088J9507J1534
12208C08716j223l284j2107j7740j8923k7814k8830k6825k8378j8166j0371l631
$$ plain form
12302 54202 57353 57293 62337 67000 60993 58780 59397 60839 58934 55391 51239 52558 52861 52012 46376 52795
12286 52795 61587 66799 67824 71126 75767 76781 82047 79000 66343 70405 78071 79668 83052 98641
12272 98641 103960 107736 123470 146384 172979 215651 269969 314687 342789 345135 324146 292326
12260 292326 254422 211687 177460 154263 144724 124805 109451 104154 101627 101225 99481 93516 86310
12247 86310 87160 86948 81254 82342 74914 75060 83519 90866 91481 96324 96947 96428 94906 95963 101396 105704
12231 105704 118057 140461 153214 177649 212748 240969 263618 297003 334961 372142 408108
12220 408108 449845 479810 497258 475973 433328 377521 336172 303708 282763 277675 297182 308716
12208 308716 307493 304209 292102 274362 255439 227625 198795 171970 143592 125426 115055 111424
12196A11424l639%p864j0797p485M368N345l127j303j333N099l034J701L521K645
12181I5521J412L264J4863Q451J2235K2081K9640M0206N6883O0333N6584L4254
12169D35727K956k8325n2902n2015m3381m1878l0632j8625o443o703m728m781
12157A48270j3512j4041j4162j4389q631k030n653l742k960R97j922j166n418
12144F1641p873p773o2P704N665N516j0027j339L551K126K640m424r696M733P547
12129E9929J206m845m382p68M163P272Q99j54J616J612l244M939Q826Q053J2510
12114I7632L744l942k115k966p534j472M121K549R94p598M603L76J3099Q134J384
12099A11009P193J904j6139j3214p113J544N673p272l323n51r490J681n92l845
$$ plain form
12196 111424 107785 107785 99921 89124 81639 86007 91352 88225 86922 85589 90688 87654 89355 92876 95521
12181 95521 96933 100197 115060 123511 135746 157827 187467 227673 284556 344889 401473 435727
12169 435727 438683 410358 357456 305441 262060 220182 189550 170925 164482 157779 153051 148270
12157 148270 134758 120717 106555 92166 83535 81505 75852 72110 69150 70147 68225 67059 61641
12144 61641 53768 45995 45933 53637 59302 64818 54791 53452 57003 59129 61769 57345 47649 52382 59929
12129 59929 61135 56290 51908 51140 55303 62575 63474 63320 64936 66548 63304 68243 77069 85122 97632
12114 97632 101376 97434 95319 92353 84819 83347 87468 90017 91011 83413 88016 88392 101491 109625 111009
12099 111009 118202 120106 103967 90753 83640 85184 90857 83585 80262 79711 70221 71902 71310 67465
12085F7465l058k202n171j016l830J758J0835K254O88J1453J544p722r266M924
12071F8656J736K990j12n161j663M352j646p153o964r65Q348j976j1834j338j819
12056D5451K963K047j787K060J029L78K039j273J758k062m19q13j213l124P995
12041E5029M191J79K211m434r76M226R60K71M584O38k143L469L314K614K195J56
12025G6484j324j2993n834O510L040K034n503q038n341Q23J842K928R09M012n807
12010E3742n544J992M539O370Q051k112n544m038k955j248M802M819J412J999
11996F6285q223n463J557L313N070J291m465j719K548J131J050O157O058k835
11982G1755j1434J065Q132j597m780k527r58J320q73Q841k855j745k230j567R054
$$ plain form
12085 67465 64407 62205 57034 56018 52188 53946 64781 67035 67723 79176 80720 72998 63732 68656
12071 68656 70392 73382 73270 68109 66446 70798 69152 61999 55035 54070 62418 60442 48608 47270 45451
12056 45451 48414 50461 48674 50734 51763 52141 54180 52907 54665 52603 52184 51371 50158 47034 55029
12041 55029 59220 59399 61610 57176 56200 60426 61386 61657 66241 66879 64736 68205 71519 74133 76328 76484
12025 76484 75160 62167 56333 62843 65883 67917 62414 54376 49035 49858 51700 54628 55537 59549 53742
12010 53742 48198 50190 54729 61099 69150 67038 61494 57456 54501 53253 58055 62874 64286 66285
11996 66285 58062 52599 54156 57469 62539 63830 59365 57646 60194 61325 62375 68532 74590 71755
11982 71755 60321 61386 69518 67921 63141 60614 59656 60976 60103 68944 66089 64344 62114 60547 69601
11967F9601O976R448o973l862o441k831K801p165m670L995N605K443L66J151J892
11952G2336Q22O39J90J311K500N259k737j2797k693M945Q51P287Q027P92r259
11937G7473p08k722k186j318n239n262M446K316K008N464j159j1704N9O617O066
11922G4151j66k104K759L919K492M454P749K0296K5544K2650j2211l0680k2719
11909I6134j1040m579k378O410k546N30P839j102j494p086m963q635l554r21Q454
11894G1069O753m799o300l483K77k781k263O47L218N402m217o152J666P111O53
11879F6801k165J708J641R85m508k569J446K550J698J367K679N541M62k79q24
11864G6533O066L343L336K965j0128j939j406J276M249R35j728O708j776L042
$$ plain form
11967 69601 76577 86025 79052 75190 68749 65918 68719 61554 56884 60879 66484 68927 69293 70444 72336
11952 72336 73158 73797 73987 75298 77798 83057 80320 67523 64830 69775 70626 77913 85940 86732 77473
11937 77473 76765 74043 71857 70539 65300 60038 64484 66800 68808 74272 73113 61409 61468 68085 74151
11922 74151 73985 71881 74640 78559 81051 85505 93254 113550 139094 161744 149533 118853 96134
11909 96134 85094 80515 78137 84547 82001 82531 90370 89268 87774 80688 75725 67090 63536 62615 71069
11894 71069 77822 73023 66723 63240 63517 60736 58473 59120 62338 67740 63523 57371 59037 66148 66801
11879 66801 64636 66344 67985 68970 64462 61893 63339 65889 67587 68954 71633 77174 77636 77357 76533
11864 76533 82599 85942 89278 92243 82115 80176 78770 80046 84295 85230 83502 90210 88434 91476
11850I1476n112r786l669r5l508L47L652J873l182r48K498L221L089j69k783m276
11834G2628K2P814M474K258m14j25K376LK518q414j3160m985O202O844P198j571
11818H3668L326k927m363k064K165M26Lm451M271J615P238O151r965j1194N63
11803G4462M812J507R15L647O886J76M531J6n583p537k526J262k575N511J061
11788H6565o444k582R310N105K706K59l693L477l467n844Q95J3023P258J021K930
11773A10519P521O411o085q229j241n353o455L08K389L139M277N265n219m851
11759A02396M594j904j03K679N153L473J2182M094Q109J6275J5085K4727L2555
11746B29315M4642K5415R813K815O594J998k8685m9473l8716k3547j4349r223
$$ plain form
11850 91476 86364 76578 72909 72814 69306 69653 73305 75178 71996 71048 73546 76767 79856 79687 76904 72628
11834 72628 72650 80464 84938 87196 86782 86657 89033 89036 91554 83140 69980 64995 71197 78041 85239 83668
11818 83668 86994 84067 79704 77640 79805 80231 80234 75783 80054 81669 88907 95058 85093 73899 74462
11803 74462 79274 80781 81696 85343 92229 92405 96936 96952 91369 83832 81306 82568 79993 85504 86565
11788 86565 80121 77539 86849 91954 94660 94919 91226 94703 91236 85392 86287 99310 106568 107589 110519
11773 110519 118040 124451 118366 110137 108896 103543 97088 97396 99785 102924 107201 112466 107247 102396
11759 102396 106990 105086 104983 107662 112815 116288 128470 132564 140673 156948 172033 196760 229315
11746 229315 273957 299372 309185 312000 318594 320592 291907 242434 203718 180171 165822 156599
11734A56599q97K047k354q917m911l408p865j1J681J68n099m867K201O890M445
11719A35702k059l531N478J0968P730R266J1720J4904J2259K7913L3492L0773
11707B94615M4095N3488N8991P9217R3676R5283N5718J3798P813K1003l3853j34986
11695F48858j50973j07022o3920l8207k3051k1963j1505p985j8455j4495p543
11684A83739q790l778r927o130l02O50M113p41k74J534P299L108K626J4082J2642
11669A99851J8755K2577L3388M4865M7186N4881O3361O6356P1218Q5090R0754
11658G98282P9849L5925k3715n2978o9232j00569j14745j04805q3105n5210l0248
11647B79449j5574j4387j3824q630j2187j3479p940L376m644j0857l731m439n399
$$ plain form
11734 156599 155702 157749 155395 146478 141567 138159 130294 130283 131964 132132 127033 122166 124367 131257 135702
11719 135702 133643 130112 135590 146558 154288 163554 175274 190178 202437 230350 263842 294615
11707 294615 338710 392198 451189 530406 624082 719365 775083 788881 796694 817697 783844 648858
11695 648858 497885 390863 326943 288736 265685 243722 232217 224232 205777 191282 183739
11684 183739 174949 171171 161244 155114 154812 155462 159575 158834 158560 160094 167393 170501 173127 187209 199851
11669 199851 218606 241183 274571 319436 366622 421503 484864 551220 622438 707528 798282
11658 798282 878131 914056 890341 837363 768131 667562 552817 448012 364907 309697 279449
11647 279449 263875 249488 235664 227034 214847 201368 193428 196804 192160 181303 177572 173133 167734
11634A67734l073l570K436J1225k517j837P537R581N853O579J2074J5978K2790
11621B50790K7987L7128L8048L1188K5962J9461J0358j1431k0887l7016m4346
11610C27242l8827l3300l0082j3008k54j518j0334p887q692k882o532m526r02
11597A68498k013L522l327k412r6m636J916K925m62L532K011P8j106l621L372
11582A68181J33O68J728O863M482p649q640o22o078M317J2426L567p647n409n517
11567A60803J63K82J046K003n536l015o671M351J0633K327q42L780M047l790J851
11552A71432M626J0222M588N623R199M57J804O782P935O901M465J0006Q695M252
11538B56987j078M01R14K296J143k387O021J7391K1639K5459K8111L8670L6954
$$ plain form
11634 167734 164661 161091 163527 174752 172235 170398 177935 187516 193369 199948 212022 228000 250790
11621 250790 278777 315905 353953 385141 411103 430564 440922 429491 408604 371588 327242
11610 327242 288415 255115 225033 212025 211771 210253 199919 192032 183340 180458 173926 169400 168498
11597 168498 166485 170007 166680 164268 164172 159536 161452 164377 163915 167447 169458 169536 168430 164809 168181
11582 168181 168314 168982 170710 177573 182055 174406 165766 165144 159066 163383 175809 179376 171729 166320 160803
11567 160803 160966 161248 162294 164297 158761 155746 149075 153426 164059 166386 165544 169324 173371 169581 171432
11552 171432 176058 186280 190868 196491 205690 206147 207951 214733 222668 229569 234034 244040 252735 256987
11538 256987 255909 256310 257224 259520 260663 258276 264297 281688 303327 328786 356897 395567 432521
11525D32521M7605O6041O6893L3743p08J0912L3996K9818J6751l4424q9985j02161
11513E11002o8144m1108j5131j3449j4944j1707r195j7877j6396p402o768r554
11501B79327L45l009n274n476k099k306M309J1754M111J3632J1382J2153J5025
11488C33874K0497K1473K3202M6403P3481R5785Q5861M0146J3157J5489J359J0907
11476G81634Q3204J60692N7843k01690k29517j33567o6399k8760o230j287K764
11465D18687k036j01q444L16k33m661j4928j8342j6958j8056o115r720J0696J7203
11451C47308J4669J3064R949J100j638l65K087J2074K1888K9049M1510O8679J03981
11438F63355J08293L3806l6218k0934L9570M3589m6956j13188r2424o4129m3935
$$ plain form
11525 432521 480126 546167 613060 646803 646095 657007 691003 720821 737572 703148 613163 511002
11513 511002 442858 401750 386619 373170 358226 346519 337324 319447 303051 295649 288881 279327
11501 279327 279672 276663 271389 265913 263814 261508 265817 277571 281682 295314 306696 318849 333874
11488 333874 354371 375844 399046 445449 518930 614715 700576 740722 753879 769368 770727 781634
11476 781634 864838 1025530 1083373 881683 652166 518599 452200 423440 417210 415923 418687
11465 418687 416651 416550 408106 408422 408189 403528 388600 370258 353300 335244 329129 319409 330105 347308
11451 347308 361977 375041 384990 386090 384452 384087 386174 398248 420136 449185 490695 559374 663355
11438 663355 771648 805454 769236 748302 787872 831461 784505 671317 578893 514764 470829
11427D70829k2802j1687p621o963K033P683N560p489l639k102l024p039k229p28
11413D10782J2150J1096P028O957J1043Q608L706J411N96P634J8131J2148J9578
11400E30868K0988K7919L8600O0765O4644O6352P8206Q1109N4125K6275j0334
11389A039517l7896m6470m6909n3690m1850k0697j3576j4395r545k0778j8233
11378G15478q072j2651J459m392q258o690P014K2478K5304K2580J8686K0301K0241
11365H13478K5277K0578Q061J6643M0161O1431Q1613J05596J45656J89741K07546
11354A715781J55736L4415q4754j18972j09420q6518p2705m9516j9483J2596K5067
11343A402227K9361K9339J4793J264j3765k6945k7304j6052k294L5819O4490Q1838
$$ plain form
11427 470829 448027 436340 428719 421756 423789 431472 437032 429543 425904 423802 420778 413739 411510 410782
11413 410782 422932 434028 441056 448013 459056 467664 471370 472781 473377 481011 499142 511290 530868
11400 530868 551856 579775 618375 679140 743784 810136 888342 969451 1023576 1049851 1039517
11389 1039517 1001621 955151 908242 854552 812702 792005 778429 764034 754489 733711 715478
11378 715478 707406 694755 696214 691822 683564 676874 683888 706366 731670 754250 772936 793237 813478
11365 813478 838755 859333 867394 884037 924198 985629 1067242 1172838 1318494 1508235 1715781
11354 1715781 1871517 1905932 1821178 1702206 1592786 1506268 1433563 1384047 1364564 1377160 1402227
11343 1402227 1431588 1460927 1475720 1476984 1463219 1436274 1408970 1392918 1390624 1426443 1490933 1572771
11331A572771M7138J3691L1894M5374N4751M4650M6467N7591P3431Q8454R8772
11320B174984J21797J48976J81686K50420L49032N13546P05275O65388J29652
11311E240756n12763o32363m07367j86615k9243P0970J13988J55210K31820L38505
11301D382898M20690M80316M93642L79244J49438n9233j29077m2718J01345K50405
11291F426950L89497N41374P17458Q81959J014860J083164J123966J261411J569765
11282A5010404K025675K764855L886511N589449Q360537J2887266J9445651K6039959
11274I6010307K3684302P417273j085124R188066K7147613M4764584N9066898
11267B66193919O5606255M8004880L207264m2905760o3807993n7601364m0442192
$$ plain form
11331 1572771 1619909 1633600 1665494 1710868 1765619 1810269 1856736 1914327 1987758 2076212 2174984
11320 2174984 2296781 2445757 2627443 2877863 3226895 3740441 4445716 5111104 5240756
11311 5240756 4727993 4095630 3688263 3501648 3472405 3543375 3657363 3812573 4044393 4382898
11301 4382898 4803588 5283904 5777546 6156790 6306228 6246995 6117918 6075200 6176545 6426950
11291 6426950 6816447 7357821 8075279 8957238 9972098 11055262 12179228 13440639 15010404
11282 15010404 17036079 19800934 23687445 29276894 37637431 50524697 69970348 96010307
11274 96010307 119694609 127111882 126026758 135214824 162362437 207127021 266193919
11267 266193919 331800174 379805054 383012318 340106558 276298565 218697201 178255009
11260A78255009k6252661j7635023j2106607j0038496j1238900j3277530j4452700
11253G3253092j4052777j2251535r741479p068148m966860l613452k777075k234425
11245A6547341j859168j579536j362279j167714r75574q08321p06598o44295n90370
11236F853486n47146n12990m64241l95408l35710k84450k60205k39020k17522
11227C596794j88296j49745r6542k2460O3298J91312L06645L58414K97825J14372
11217D471617j33068l27175m16505m31982m06246l51323k77938k14434j55422
11208A757524j12002p7085o3128m3133l4816l5775m9106m6461k9087k2517j6887
11197A227527j6683k1019j6738n925M922J0864L4064L7805L2141K8612K3402O429
$$ plain form
11260 178255009 152002348 134367325 122260718 112222222 100983322 87705792 73253092
11253 73253092 59200315 46948780 37207301 30139153 25172293 21558841 18781766 16547341
11245 16547341 14688173 13108637 11746358 10578644 9603070 8794749 8088151 7443856 6853486
11236 6853486 6306340 5793350 5329109 4933701 4597991 4313541 4053336 3814316 3596794
11227 3596794 3408498 3258753 3162211 3139751 3203049 3394361 3701006 4059420 4357245 4471617
11217 4471617 4338549 4011374 3594869 3162887 2756641 2405318 2127380 1912946 1757524
11208 1757524 1645522 1568437 1505309 1462176 1427360 1391585 1342479 1296018 1266931 1244414 1227527
11197 1227527 1210844 1189825 1173087 1167162 1172084 1182948 1217012 1254817 1286958 1315570 1338972 1345401
11185A345401p1J0002L3598Q7920J61252K29939K40811J88123R1261k3407j41119
11174B223710k25330k42242k10471j52897j10933p4497n2824m8164m9599n2965
11164A003788m6114n0527m8708m2661l9502l5187l4371m4127n0576n4203n2786
11153E05026m5583l8627l6624k3193l348n295J984J1747J4206J6663J9127J9236
11141D35319K4209N7990Q5350J08003J32419J29045J30458J28536J04419O9670
11131A405418M5517J0964l7059r2011j33275j48432j52499j44975j12592p9863
11121E61193n6449l2457r511K770O151J6536l440j9115j7603j0478J1259N4855
11109E03711J00526Q9428K6654J1452J2755l4632j17646j22867q3971m6405k3921
$$ plain form
11185 1345401 1345330 1355332 1388930 1476850 1638102 1868041 2108852 2296975 2388236 2364829 2223710
11174 2223710 1998380 1756138 1545667 1392770 1281837 1207340 1154516 1106352 1056753 1003788
11164 1003788 957674 907147 858439 815778 776276 741089 706718 662591 612015 557812 505026
11153 505026 459443 420816 384192 360999 357651 352356 354340 366087 380293 396956 416083 435319
11141 435319 459528 517518 602868 710871 843290 972335 1102793 1231329 1335748 1405418
11131 1405418 1450935 1461899 1424840 1332829 1199554 1051122 898623 753648 641056 561193
11121 561193 504744 472287 462776 465546 471697 488233 484793 465678 448075 437597 448856 503711
11109 503711 604237 693665 720319 731771 744526 709894 592248 469381 385410 339005 315084
11098C15084r604Q656K3754K5557L781j5482j9365l7713m1719l2682k6902r554
11086A83811J0600M977J196M219m310J0831J0444J1392n05j9937k3392l0568l1534
11073A27224l2305k0976j1945O62P755J1155J1076K4650K9087J7416N330q76p718
11060A60535K692M853J2870J0452k49o32L631K023l311K122o213n227K257r181
11046A76622o403q673j3048n222J246k724k972l004M947J779M873N054l625o555
11032A42295K97m199n21Q1J0334K8993J4546L664P202K5313L9549L4721J7819
11019C20094J486q791j2599j3702o019k108K189R809K2687K5703L9293M3823O4552
11006D86417R8747J38710K21686L49373N20638O38382N43090K76409Q177k86520
$$ plain form
11098 315084 305480 314136 337890 363447 367228 351746 332381 294668 252949 220267 193365 183811
11086 183811 194411 199388 200584 204803 200493 211324 221768 233160 232655 212718 189326 158758 127224
11073 127224 94919 73943 61998 62660 70415 81570 92646 117296 146383 163799 169129 168253 160535
11060 160535 163227 168080 180950 191402 191153 190521 194152 196175 192864 194986 188773 183546 185803 176622
11046 176622 170219 161546 148498 143276 144522 141798 138826 135822 140769 142548 147421 152475 148850 142295
11032 142295 142592 138393 137872 137953 148287 177280 191826 195490 202692 228005 267554 302275 320094
11019 320094 321580 312789 300190 286488 280469 278361 280550 290359 313046 338749 378042 421865 486417
11006 486417 585164 723874 945560 1294933 1815571 2453953 2997043 3273452 3281629 2995109
10996B995109m56307m04468k99493k17853k02628k05027j98175j70397j41776
10987F98985j17046q8641o4185n3353m1141k8905k3299k0706j6666n612j123r373
10975B28935K084J1055J2283K4918K9588L8265M3809L6160K2503J8991L5012N6703
10963E60306M6283R783m7035o7499o8558n5112k8252j4993M428K3168M3989P5636
10951D82144Q5117Q4403O3604M0110J8933L779j7483j9946q513O296L0793M0950
10939H10187K882n3174r4439j08717j04548p7710n6360l4381j7589j2346j854
10928B51951L949M68j5177k2924k3899k5165j3959j3015j2534o500K063N964N850
10915A37072P804J5794J8299K7364L6338M7457N8286M1027J7682n406k1593k9474
$$ plain form
10996 2995109 2538802 2134334 1834841 1616988 1414360 1209333 1011158 840761 698985
10987 698985 581939 493298 429113 375760 334619 305714 282415 261709 245043 239431 238308 228935
10975 228935 231019 242074 254357 279275 308863 347128 390937 427097 449600 468591 503603 560306
10963 560306 606589 616372 569337 501838 433280 378168 349916 334923 339351 362519 406508 482144
10951 482144 567261 651664 715268 755378 774311 778090 760607 740661 732148 738444 769237 810187
10939 810187 813069 759895 665456 556739 452191 374481 318121 283740 266151 253805 251951
10928 251951 255900 256368 241191 218267 194368 169203 155244 142229 129695 123195 125258 131222 137072
10915 137072 144876 160670 178969 206333 242671 290128 348414 389441 407123 401717 380124 350650
10903C50650k6394r54J8543L8019N7608O7428Q0756P1557M3951J102k1916l1278
10891F49072l2990k7663j8587j516l265k0380k9954k3970k2051o6548p8315n9704
10879B64129l7376j7838r103j0264j4393j2020n948k01O542N227p74Q940L649
10866A80570J660J1687J6067J3706J9256K9588L9291N8868Q5718J20580J52841
10855G29832K05136K92238M16685O06863P66017M43939m55542q05591n65372k93894
10845A340311j10391m4991q6100j33148j08352o3223p3511j02853j11036j00283
10835D06423p7675m4923l0254k1614k2083k3593j6611j1872q292o882q140j3519
10823A20965l795J864P209l965n481j424Q263J5889J5473R062J3177K2641K4754
$$ plain form
10903 350650 324256 323302 341845 379864 437472 504900 585656 657213 701164 702266 680350 649072
10891 649072 616082 588419 569832 568316 565051 544671 514717 490747 468696 402148 323833 264129
10879 264129 226753 208915 199812 189548 175155 163135 157187 156986 163528 168755 167981 176921 180570
10866 180570 182230 193917 209984 223690 242946 272534 311825 370693 456411 576991 729832
10855 729832 934968 1227206 1643891 2250754 3016771 3460710 3005168 2199577 1634205 1340311
10845 1340311 1229920 1184929 1098829 965681 857329 794106 720595 617742 506706 406423
10835 406423 328748 283825 253571 231957 209874 186281 169670 157798 149506 142624 134484 120965
10823 120965 117170 119034 126243 122278 116797 115373 123636 139525 154998 164060 177237 199878 224632
10810B24632K0864K3058J4099J4081P748O714J031N168J8191K5135Q280k0370
10798C48631l1026j4188j222j7433m4577l9035k8097j7784k0204j0988r252m239
10786A10586m977J713o021j1745m711K288J597M754J783n258m040l068p410P904
10772H3395K324k89m503l862j240Q180P640J88q298m2J488o824M397P086K7n993
10756H3674l356J771O090o13J311m494p407J716N448L446K983p802n355n453J460
10741G3419m213l276K596L252R085O213l666o009r52n519j408J211K091l041J78
10726F9961Q329J577L341Q610K89l257l784Q33J727K551K705m15N005O835K443
10711A06750J0474N226J27r319o587r27j062J878N389J171R12N673J2795M364
$$ plain form
10810 224632 245496 268554 282653 296734 304482 311196 312227 317395 335586 360721 369001 348631
10798 348631 317605 303417 302195 284762 240185 201150 173053 155269 135065 124077 114825 110586
10786 110586 105609 107322 101301 89556 84845 87133 88730 93484 95267 90009 85969 82901 75491 83395
10772 83395 85719 85430 80927 77065 75825 84005 91645 91833 83535 83493 84981 78157 82554 89640 89667 83674
10756 83674 80318 82089 88179 87566 88877 84383 76976 78692 84140 87586 90569 82767 77412 71959 73419
10741 73419 69206 65930 68526 71778 80863 87076 83410 77401 76449 70930 69522 70733 72824 69783 69961
10726 69961 78290 79867 83208 91818 92107 88850 85066 85899 87626 90177 92882 92467 97472 104307 106750
10711 106750 117224 122450 122577 113258 106671 105744 104682 106560 111949 113120 114032 119705 132500 136864
10697A36864N365K976L17J879P637O790J5957K4222M4591O5588O9139P1097K8999
10684D81421o2832r8301r1128n5721k1428l242l500N571R915K411j0954j3172
10672A39040o458n454L675J408L498p815j2190j0276j1437o083r238M242J5442
10659I8354M378j470J5543J3320M207J694Q898L537m942o474n011j0649q219r525
10645A03641K996L744K664J147O175N984L11L249N763R269J3976J2277J7207K4835
10631B13238J9016R684o354j2992J480N392j3794l5946m1288k8432j1877J177
10619I9304J9831K0483J7202K3201J1850n288p573m381J361l069l703l516m709
10606A60993p285j112j0631m226R666J0590M198J5316J1195L321q589J866m422
$$ plain form
10697 136864 142229 145205 145522 147401 155038 161828 177785 202007 246598 312186 381325 452422 481421
10684 481421 418589 320288 229160 173439 152011 148769 145269 150840 160755 163166 152212 139040
10672 139040 132582 127128 130803 132211 135709 127894 115704 105428 93991 87908 78670 82912 98354
10659 98354 102732 101262 116805 130125 134332 136026 144924 148461 143519 137045 132034 121385 113166 103641
10645 103641 106637 110381 113045 114192 120367 126351 126662 129911 135674 144943 158919 171196 188403 213238
10631 213238 232254 241938 235584 222592 224072 229464 215670 179724 138436 110004 98127 99304
10619 99304 119135 139618 156820 180021 191871 186583 179010 174629 175990 172921 169218 165702 160993
10606 160993 153708 152596 141965 137739 147405 157995 162193 177509 188704 192025 183436 185302 180880
10593A80880r566k87J5462J8532K4374J9677K857K511l662j2427j0721j724K321
10580B28227l737l444k548O026J4145J3568O677k329q017j1669l005P53Q022J8055
10566B60724K0974K4224K7559K9448L0808L9058M6641N3125N652n4416m4148j8221
10554D21428j1605k517J0832K5621J9198Q897Q635P302N996j533j1304j2374j0383
10541D58193j2555m329n025p475m880K787M580N291j231p766p899p334Q766K1852
10527D42975K1121K1853R582r274j6501j3743J997J0047K0137K9251K1753J3797
10515E52995K178k817J414R441P667J2759J2043K2094K5508P603Q71m753q123
10502F38880J79M025J6342K5011L3797L1706Q352j4772k39J9128L0485M0181N5521
$$ plain form
10593 180880 171314 171027 186489 205021 229395 249072 251929 254440 250778 238351 227630 225906 228227
10580 228227 224490 221046 218498 224524 238669 252237 258914 256585 248568 236899 233894 234647 242669 260724
10566 260724 281698 305922 333481 362929 393737 432795 479436 532561 538213 483797 439649 421428
10554 421428 409823 407306 418138 443759 462957 471854 480489 487791 493787 492254 480950 468576 458193
10541 458193 445638 441309 436284 428809 423929 426716 431296 436587 435356 427590 419691 412357 421123 442975
10527 442975 464096 485949 495531 486257 469756 456013 458010 468057 488194 517445 539198 552995
10515 552995 555173 552356 553770 563211 570878 583637 595680 617774 643282 650885 651756 647003 638880
10502 638880 639059 643084 659426 684437 718234 749940 758292 743520 743281 762409 792894 833075 888596
10489H88596N6380M5987M2709M7782P6884R0809O4837L7207K3085M0621O2227
10478A477124N6058K4544j0199j8141J8887N8504O4666O2374O3001J00013J44763
10467B041594J55827J45819J53105J43483J32223J35495K10301K90687K98252
10458C706786K86746L07222L63896M49220N61630P43917J040179J371462J410065
10449A0241123Q13491L29610N58930J052128J598362K265003L058611M081615
10441B3998873N678802Q355763J2324074J8401380K8557504M6285408P4815089
10434B18416893J13236710J36237500N1275022j06431079j42641305r5333506
10428A74760235n4043927l1363648j9172887j2192032q238869o518125o313961
$$ plain form
10489 888596 944976 990963 1033672 1081454 1158338 1249147 1313984 1351191 1374276 1414897 1477124
10478 1477124 1533182 1557726 1547527 1529386 1548273 1606777 1671443 1733817 1796818 1896831 2041594
10467 2041594 2197421 2343240 2496345 2639828 2772051 2907546 3117847 3408534 3706786
10458 3706786 3993532 4300754 4664650 5113870 5675500 6419417 7459596 8831058 10241123
10449 10241123 11054614 11384224 11943154 12995282 14593644 16858647 19917258 23998873
10441 23998873 29677675 38033438 50357512 68758892 97316396 143601804 218416893
10434 218416893 331653603 467891103 519166125 412735046 270093741 174760235
10428 174760235 120716308 89352660 70179773 57987741 49748872 43230747 36916786
10421C6916786o141709n187546m087015l141891k267961j458617q59178r53918
10413A2818951j622500j737106j404393j083265q43832o79032n78132m79476l93169
10404C998046l19613k72495l07813l18039k54120j92374j70913j12557q3864j05243
10394A861015j21162j28974j04545r2573j05453j39925j47865j04734p0191m7758
10384G97835m3985n5455n4376l6949n626P525m684j9260j5573L706L730j201j2890
10371E62797j6528k3036m9418m5890j4923L688K468m077j5256k1987k2257k5107
10359C30474k5997j2544R344K7448K8322K5146L8965P8768J43968K21380L05163
10348A170437J76298j81895k89856j66354m2319L1226P2366P6106L7689l4723
$$ plain form
10421 36916786 30775077 25587531 21500516 18358625 16090664 14632047 13772869 12818951
10413 12818951 11196451 9459345 8054952 6971687 6127855 5448823 4870691 4391215 3998046
10404 3998046 3678433 3405938 3098125 2780086 2525966 2333592 2162679 2050122 1966258 1861015
10394 1861015 1739853 1610879 1506334 1413761 1308308 1168383 1020518 915784 845593 797835
10384 797835 753850 698395 644019 607070 601444 608969 604285 585025 569452 573158 576888 575687 562797
10371 562797 546269 523233 473815 427925 413002 416690 419158 415081 399825 377838 355581 330474
10359 330474 304477 291933 301277 328725 357047 382193 421158 499926 643894 865274 1170437
10348 1170437 1346735 1164840 874984 708630 666311 697537 769903 846009 883698 848975
10338H48975r9555j33124j18519p8751o4784o0892n0151m0829k0805K132k129
10327A81568j0091p969n326k575j8113k5137k3450j4744j0021n78P336P521R399
10314H7820M180r98J444P492P538M292r948j298K1113K6280J8738P036o254l546
10300A63889k191p269J4688K8162K4064r802l3385l5091l3830l2199j8590J71
10288E8617K858O647l31p676m560m346k2076j4757m255m034N125P071O168R739
10274C4190P190m963p640m055j0314o054J375M699Q807J3909P313Q867P555m077
10260E6802p185p405r56j6398j0814o653o140O655O641j0505j4345J047J3781
10247D525J9024J0931J1632J2325N51k6196m5678n1214k6758o933J3490K192j0251
$$ plain form
10338 848975 749420 616296 497777 419026 354242 293350 243199 202370 181565 183697 181568
10327 181568 171477 163508 158182 155607 137494 112357 88907 74163 64142 63564 70900 78421 87820
10314 87820 92000 91002 92446 99938 107476 111768 101820 100522 121635 147915 166653 173689 167435 163889
10300 163889 161698 154429 169117 197279 221343 211541 178156 143065 109235 77036 58446 58617
10288 58617 61475 68122 67791 60115 55555 51209 29133 14376 10121 6087 11212 18283 24451 34190
10274 34190 41380 36417 28777 24722 14408 8354 9729 14428 23235 37144 44457 53324 60879 56802
10260 56802 49617 42212 41256 24858 14044 7391 1251 7906 14547 4042 -10303 -9256 4525
10247 4525 23549 34480 46112 58437 58988 32792 -12886 -64100 -90858 -97791 -84301 -82109 -92360
10234i2360M189P501J7972J2606J2780J9554J5207Q827J368j0987p353O875Q233
10221D412P508Q670M710P90j5712j0542r344r446l625p71j86k310j995O832J4652
10206f357Q628J1004K0485J7293n553m476K249q740l167N082M748j737l28N021
10192D4152M870k063K1658J6923L887p706j0796j1848m972n013L615M770n980
10179E1497r304l055n047j0110j843N750O966L583o94n104q539r543j935J574
10165A4196O768J5537R495k247q746j326L092O930k310l141L378P587K968J3497
10151F5678K0635K6516K5153K9499L2574K6016L3063K4532K6852M2017N5971Q9739
10139D98245J30549J96206K82428M07253N97321Q49720J095430J178277Q34599
$$ plain form
10234 -92360 -88171 -80670 -62698 -50092 -37312 -17758 -2551 6276 7644 -3343 -10696 -3821 4412
10221 4412 11920 20590 25300 26090 10378 -164 -9508 -18954 -22579 -23350 -23536 -25846 -27841 -21009 -6357
10206 -6357 2271 13275 33760 51053 45500 41024 43273 34533 31366 36448 41196 39459 39131 44152
10192 44152 49022 46959 68617 85540 89427 81721 70925 59077 54105 49092 52707 57477 51497
10179 51497 42193 39138 34091 23981 22138 27888 34854 38437 37743 32639 24100 14557 12622 14196
10165 14196 20964 36501 45996 43749 35003 33677 36769 43699 41389 38248 41626 49213 52181 65678
10151 65678 86313 112829 137982 167481 200055 226071 259134 283666 310518 352535 408506 498245
10139 498245 628794 825000 1107428 1514681 2112002 2961722 4057152 5235429 6070028
10130F070028L0763q21756j204800j105136q12792n49006l63059k46396j76268
10121H21578j32160j04010r1706p0619n4662l8677k9313l8889l7438k1854k3011
10110A79239l0288l0689k5437j7119j0287j3977p748k434l232o528q609q112N158
10097A9937K71n826l687k813l819J199o85m855j359j927q357l762j389N234K94
10082a1544m292K863J173N25r07P60P9j128j603j1098n181L37K436J461L857J0007
10066a2255J0833K754k662k275o21j2675j134P779P778l873j0982n824J212n167
10052b7112k345Q588M464l903M661J095R4j46n824K117O157K392j025M73j276
10037a1590k189n44K060J823K375P261L101O043M21N986J4423M908P41J072O00
$$ plain form
10130 6070028 6100791 5279035 4074235 2969099 2156307 1607301 1244242 997846 821578
10121 821578 689418 585408 493702 423083 368421 329744 300431 261542 224104 202250 179239
10110 179239 148951 118262 92825 75706 65419 51442 43694 41260 38028 31500 22891 14779 19937
10097 19937 20208 14382 10695 7882 4063 5262 4577 -278 -1637 -3564 -11921 -15683 -17072 -11838 -11544
10082 -11544 -15836 -12973 -11800 -11275 -12182 -11422 -11343 -12471 -14074 -25172 -30353 -30016 -27580 -26119 -22262 -12255
10066 -12255 -1422 1332 -1330 -3605 -4226 -16901 -18035 -10256 -2478 -6351 -17333 -23157 -21945 -27112
10052 -27112 -29457 -20869 -16405 -20308 -15647 -14552 -14458 -14604 -20428 -18311 -12154 -9762 -10787 -10314 -11590
10037 -11590 -13779 -14323 -12263 -10440 -8065 -804 2297 8340 8761 14747 29170 34078 34819 35891 36491
10022C6491R351N474J0133J1580K4497K5463M1526O3532R2722J34817K24610L77354
10010A057550N86851P68025M24654m85816q12668n69784l21082j79389j14149
10001C54192p1856m6222m4380l1950k2868k1987j8948j3447j5395j5639l683r722
9989C8095p144o835k204j509o102l699J51n031j143J07o975j441m656O040R012
9974F666J4995K1522M2781N7003j6190n8976m4896j5868k848j086j6m592N80R80
9960E5m036j1070m042m327l903M591j294J172L103Q41O08M59M825J943m889q908
9944b4872l073N343K926j991l948o261J719j292j4220j59Q791O354j93J287O085
9929b3504O17J620k351M31N621O59J64k850K860N35Q88M183N020m19o608J070
$$ plain form
10022 36491 45842 51316 61449 73029 97526 122989 164515 228047 320769 455586 680196 1057550
10010 1057550 1644401 2412426 2837080 2351264 1538596 968812 647730 468341 354192
10001 354192 282336 236114 191734 159784 136916 114929 95981 82534 67139 51500 47817 38095
9989 38095 30951 24116 21912 20403 14301 10602 10753 5722 4579 4686 -2289 -3730 -8386 -2346 6666
9974 6666 21661 43183 85964 142967 126777 67801 22905 7037 4189 3103 3087 -1505 -925 55
9960 55 -3981 -15051 -19093 -23420 -27323 -22732 -24026 -22854 -19751 -18910 -18302 -17843 -13018 -11075 -15964 -24872
9944 -24872 -27945 -22602 -19676 -21667 -25615 -31876 -30157 -31449 -45669 -45828 -37037 -30683 -30876 -29589 -23504
9929 -23504 -22887 -21267 -23618 -23187 -17566 -16907 -16743 -19593 -16733 -16198 -15310 -11127 -6107 -6526 -13134 -12064
9913a2064l755j957L330j825l687n870j495k964O1J987N518J207j726l612K25
9898b6627L810m917o069L379O846j26n330L721J05l008m739Q462J3428O055p204
9883a2214j3238k576L191K135J585J359j74L463J02K00l08Q04n672n074j46L554
9867b3009J106N286J221q11o664n548N717K910J74K321K445j682j287r58j77K743
9851a6213N229N337n536j076O281K658j665p697N60m80R14m191K652P7l491p37
9835a7378n31P7M667J367p02n3l544j155j337L314M091J496j76l963j336N710
9819i453k41l604l036N650L353K478N987L37p588j1701o136K35N696K338o85J757
9803a4613J434K320k266N16K107O74j4400k244Q547O70l689k31O805N529K718
$$ plain form
9913 -12064 -15819 -17776 -14446 -16271 -19958 -25828 -27323 -30287 -30226 -28239 -22721 -21514 -23240 -26852 -26627
9898 -26627 -22817 -27734 -33803 -30424 -23578 -23704 -29034 -25313 -25208 -28216 -32955 -24493 -11065 -5010 -12214
9883 -12214 -25452 -28028 -24837 -22702 -21117 -19758 -19932 -16469 -16367 -16167 -16475 -15671 -21343 -26417 -26563 -23009
9867 -23009 -21903 -16617 -15396 -16207 -22871 -28419 -22702 -19792 -19618 -17297 -14852 -16534 -17821 -18779 -18956 -16213
9851 -16213 -10984 -5647 -11183 -12259 -5978 -3320 -4985 -12682 -12122 -12602 -11688 -15879 -13227 -13150 -16641 -17378
9835 -17378 -17909 -17832 -13165 -11798 -12500 -12553 -16097 -17252 -18589 -15275 -11184 -9688 -9864 -13827 -15163 -9453
9819 -9453 -9694 -13298 -16334 -10684 -7331 -4853 1134 1471 -6117 -17818 -23954 -23719 -18023 -15685 -16370 -14613
9803 -14613 -13179 -10859 -13125 -12609 -10502 -9828 -24228 -26472 -17925 -17255 -20944 -21175 -14370 -8841 -6123
9788f123j451l621m476M864q65l195K703K034n45k705m377N785J0276J897P65
9773I66k873k433m165M014K846N583j274K605K444J959m851n494m885j169N278
9758a449M728j0372k102M512l799n598k936K828l571n489L925N8M333K817M251
9743g864p719m947J743K324M163J586m392j289J661L417M595O20J04R7J509j224
9727e616J837L328M534l457L93N612M573J141l105m068Q06O945J1575L358j260
9712B6596n444m536j145L612P212J3704Q889n580j1856o05m41m684q21j404P748
9697C1245J2874m478k742m199j5j26l809J733N304M184o426j3623j024R362L021
9682C1281k517k027m735q711o040P48P326J681r376o922j3834J349L309j978m71
$$ plain form
9788 -6123 -7574 -11195 -15671 -10807 -11672 -14867 -12164 -10130 -10675 -13380 -17757 -11972 -1696 201 966
9773 966 -1907 -4340 -8505 -4491 -1645 3938 2664 5269 7713 9672 4821 -673 -5558 -6727 -1449
9758 -1449 3279 -7093 -9195 -4683 -8482 -14080 -17016 -14188 -17759 -23248 -19323 -19265 -14932 -12115 -7864
9743 -7864 -15583 -20530 -18787 -16463 -12300 -10714 -15106 -16395 -14734 -11317 -6722 -6102 -5998 -5901 -4392 -5616
9727 -5616 -3779 -451 4083 626 1019 6631 11204 12345 9240 5172 5978 12923 24498 27856 26596
9712 26596 21152 16616 15471 19083 26295 39999 48888 43308 31452 30847 30406 25722 24901 23497 31245
9697 31245 44119 39641 36899 32700 32685 32559 28750 30483 35787 39971 33545 19922 18898 28260 31281
9682 31281 28764 26737 22002 13291 7251 7999 15325 17006 7630 708 -13126 -11777 -8468 -10446 -10917
9667a0917P824M754L803k78M30K095m021K697J995J690K960M008p973l938M982
9652A0111J18l240o532K94M294K993j375P90N232Q017n790j0202m441K149j671
9637G47l64M863p091L241P963M904K963k106j008L052M250k173l71l057o211n047
9621D555J158l489n478Q95k967q05L849l74o344L192P151J781O196O00j986l058
9605D876l511k606N043J3342M2683M9051J1240l2900m6644l1082j3294j1330L789
9592a1343J5916Q210K409j4188j3981Q259J1164J98N131M413J098k890k449K560
9578A4507M632M93m884o379N213N667j790j644J375o87k60K022J236m158l330
9563A2013K584M511L949k9K734n242K349k460P17K05k536o174k060J0375L243
$$ plain form
9667 -10917 -3093 1661 5464 5186 5616 7711 3690 6387 8382 10072 13032 17040 9067 5129 10111
9652 10111 10229 6989 457 751 5045 8038 6663 7453 12685 20702 14912 4710 269 2418 747
9637 747 383 5246 -1845 1396 9359 14263 17226 15120 14112 17164 21414 19241 18870 15813 9602 4555
9621 4555 5713 2224 -3254 -2359 -5326 -6131 -2282 -2656 -9000 -5808 1343 3124 9320 9920 7934 4876
9605 4876 1365 -1241 3802 17144 59827 108878 120118 87218 40574 9492 -3802 -15132 -11343
9592 -11343 4573 12783 15192 1004 -12977 -4718 6446 6644 11775 16188 17286 14396 11947 14507
9578 14507 19139 19632 14748 8369 13582 19249 17459 15815 17190 16503 16243 18265 19501 15343 12013
9563 12013 14597 19108 23057 23028 25762 20520 22869 20409 21126 21331 18795 12621 10561 20936 24179
9548B4179l186j211k120J457J928k328m678N69N568J3454P646K093M078J4425
9534F1874K5549L5027N2707O9788O9487L3217j3387o2497p2651n9635l7872j7702
9522H3905j1525j1809j7997o159L531j499m931k241N258M478j572P99J0790J1432
9508F2460J4690J0306K4394N0008O7220O7945L8242p35l3587o5056o6429n6393
9496A13065l5073j0175j0931j0320m415n583l897J083J769K777J919P61k591k426
9482C5963l525k015L071n047O45N671J396j854p610K656M117M137N377J485m621
9467C9846p16n081m351q77J245k897j460M888J0889j137n934L253k121l365j899
9452C0283k648P18K988O426K134m33p864l599k225J279r16l353K528K760l62M288
$$ plain form
9548 24179 20993 19782 17662 19119 21047 18719 14041 14610 20178 33632 41278 43371 47449 61874
9534 61874 87423 122450 175157 244945 314432 347649 334262 271765 199114 139479 101607 83905
9522 83905 72380 60571 42574 36415 39946 38447 33516 31275 36533 41011 39439 40238 51028 62460
9508 62460 77150 87456 111850 161858 229078 297023 335265 334530 300943 235887 169458 113065
9496 113065 77992 67817 56886 46566 42151 36568 32671 33754 35523 38300 40219 40980 38389 35963
9482 35963 32438 30423 33494 28447 29092 34763 36159 34305 26695 29351 33468 37605 42982 44467 39846
9467 39846 39130 34049 29698 28821 30066 27169 25709 30597 41486 40349 34415 37668 35547 32182 30283
9452 30283 27635 28353 31341 37767 39901 39468 31604 28005 25780 27059 26143 22790 25318 28078 27716 32004
9436C2004L226N591l7k275M436N225O674J706j165J2011J2227k876q709j0058
9422E7980M652J4010j706j7018j0916J602q25j136K196p646n580o64J875P473
9408D4297j702o654K549N605N108J797P95k768N98k351J89k797O01O796n648j0548
9392C5867k658N250O270L936o33N766N086n12r78q52J728m941J048j24k433m632
9376D7188j055K936N218K802m069L089L501P49n746k461J043L679k556j865M033
9361E6486o182J036k74o718M032M983L065k571N29O064m56q10j821o495O307L942
9345F1117O98K582m393k680n084j531j428l918L813M031Q576R482L731j938l704
9330F9354q839k825K892O107L123J002m490p096P701J0960k101m477L583k599
$$ plain form
9436 32004 35230 40821 40784 38509 42945 48170 54844 56550 55385 67396 79623 76747 68038 57980
9422 57980 62632 76642 74936 57918 47002 48604 47779 46643 48839 41193 35613 34949 36824 44297
9408 44297 42595 35941 38490 44095 49203 51000 51795 49027 49625 47274 47463 44666 45267 52063 46415 35867
9392 35867 33209 38459 44729 48665 48032 53798 58884 58372 57394 56542 58270 53329 54377 54253 51820 47188
9376 47188 46133 49069 54287 57089 53020 56109 59610 60359 54613 52152 53195 56874 54318 52453 56486
9361 56486 50304 51340 51066 44348 48380 53363 56428 53857 54386 60450 59994 59184 57363 50868 57175 61117
9345 61117 61815 64397 60004 57324 52240 50709 49281 45363 49176 53207 61783 71265 74996 73058 69354
9330 69354 60515 57690 60582 66689 69812 70814 66324 59228 66929 77889 75788 71311 74894 72295
9316G2295j757p65J865M990M775O917M242q33l654Q099J6703L424j2613o042K974
9301A00620L291p468m514m209p389l40P705j7l708q223m443p25L022K038L95l41
9285G5694L653J394m25j615L180J683n497l429O644O902j349j386r804n205k227
9270F8213J755L708J988N184L316m465J517J0238j276N22M846p72q120n693L411
9255H4372J404m361R90N764l087l806M487r65j974j847R368P588L15J095k099
9240I7244O93O627m664N61O38K496O423m124p133N168K058O37r3j61l845J827
9224A04352K178K569L840j067J329J590o871l093j302O650j210l274Q64P949K653
9209A17157M610K768P304O49o025m996m022L032M939j743J830j176j54L499j563
$$ plain form
9316 72295 70538 69773 71638 76628 81403 88320 92562 91729 88075 96174 112877 116301 103688 97646 100620
9301 100620 103911 96443 91929 87720 80331 79991 87696 87679 83971 75748 71305 70580 73602 75640 76035 75694
9285 75694 79347 80741 80316 78701 81881 83564 78067 74638 81282 88184 86835 85449 75645 70440 68213
9270 68213 69968 73676 75664 80848 84164 79699 81216 91454 90178 90700 95546 94774 86654 80961 84372
9255 84372 85776 81415 82405 88169 85082 81276 85763 84798 82824 80977 90345 97933 98248 99343 97244
9240 97244 97937 104564 99900 100461 101099 103595 110018 105894 98761 103929 105987 106624 106531 106370 102525 104352
9224 104352 106530 109099 112939 111872 113201 114791 107920 104827 103525 110175 108965 105691 106555 114504 117157
9209 117157 121767 124535 131839 132488 126463 121467 117445 120477 125416 123673 125503 124327 124173 127672 126109
9194A26109m63k10k207l040N403J4969K132j486n902m735K74N272K246j80j80
9179A38002L35l881K658J82K711j821l74m128L083L336l908J567M782N736L661
9164A51941J827n172k375l974o889N527K849O589J2048K352k347m49L066m108
9150A60885O736P258l190k969M1J225k490P955L758k776m630l797K711N959l610
9135A73066J768M297K521N054k185L505m488m055R10J480P662l5o911m923Q695
9120A86361J517L878N285n599l917K755R436M374k720m695j846k426L286L050
9106A98739m31o60N862O5K97P329N250Q639K690j168J372m869j511P420j341P971
9090B35654L65n829K844K341K983M726M66m750Q200J350N644n21k44L403L936
$$ plain form
9194 126109 125646 125436 123229 120189 125592 140561 142693 141207 135305 130570 130844 136116 138362 138182 138002
9179 138002 138337 134456 137114 137296 140007 138186 137812 133684 136767 140103 136195 137762 142544 148280 151941
9164 151941 153768 148596 146221 142247 135358 140885 143734 150323 162371 164723 162376 161927 164993 160885
9150 160885 167621 174879 171689 168720 168761 169986 167496 175451 179209 176433 171803 168006 170717 176676 173066
9135 173066 174834 179131 181652 186706 184521 188026 183538 179483 180393 181873 189535 189500 182589 177666 186361
9120 186361 187878 191756 197041 191442 187525 190280 199716 204090 201370 196675 194829 192403 195689 198739
9106 198739 198308 197648 203510 203575 203872 211201 216451 225090 227780 226612 227984 223115 221604 229024 227683 235654
9090 235654 236019 230190 233034 235375 238358 243084 243550 238800 247000 248350 253994 253473 253229 256632 260568
9075B60568P633o683p567m370L052O803N270J0855R24p512l805j24N526O443M914
9060B81927J421L11l084p1Q056L488M247M611O611K526l32J652N290j633r32K739
9044C16827L768J91J958J156J44j969N400L296O714l647l248P444j622J135R96
9029C38543L090J2940K98k885L448L1M473J2892J0087J837q15N220l371o03K212
9014C87397P419J0032j743l783j138Q270L716L516Q866P941J0076L404l733m01
9000D39839M504j77L76J4123P752l292o58O030M56L468P088J152N363K002N593
8985D93619L998P782O394J776K636P524J5601J674j973M749J825M287M689N494
8971E60075R929R752j18L544Q11K797R218J1485K491O50O156J0754L858O027Q710
$$ plain form
9075 260568 268201 261518 253951 249581 252633 259436 264706 275561 276485 268973 265168 265044 270570 277013 281927
9060 281927 283348 283659 280575 280504 288560 292048 296295 300906 307517 310043 309711 311363 316653 315020 314088 316827
9044 316827 320595 320786 322744 323900 324044 322075 327475 330771 337485 333838 330590 338034 336412 337547 338543
9029 338543 341633 354573 354871 351986 355434 355465 359938 372830 382917 384754 383939 389159 385788 385185 387397
9014 387397 394816 404848 403105 399322 398184 406454 410170 413686 422552 430493 440569 443973 440240 439839
9000 439839 444343 444166 444542 458665 466417 463125 462467 468497 468953 472421 479509 480661 486024 488026 493619
8985 493619 497617 505399 511793 513569 516205 523729 539330 541004 539031 543780 545605 549892 554581 560075
8971 560075 570004 579756 579638 583182 583993 586790 596008 607493 609984 610634 616790 627544 631402 637429 646139
8956F46139M571Q259J1404J3006J477Q35M994L512O866Q965J2321R424O664J0591
8942G49028k072n284Q870Q101P656J1763J1417R026J3358J4700J3150L356K50
8929H43319J0175J2973Q480P060J2287J6410J1988J2587J4438J4637J1777J6219
8917I92350J5284J0018J2473J7414N922J3331R371R094Q342O411J4025K0183J7648
8904A151866J2149J1031J7440J8111J7198J0725J7306K2711J8223J8885K2640
8893A338285J6174K0718K0179K0690J6022J6745K4785K3847J9209J6983K0024
8882A553661K7145K7462K9773K9457J9758K3195K9000K8000K8417K8358K3494
8871A847720J9691K9930K5911K9397L4842L7572L4893L8470M0360L4776L3256
$$ plain form
8956 646139 650710 658969 670373 683379 684856 685691 690685 694197 701063 710028 722349 731773 738437 749028
8942 749028 746956 741672 750542 758643 766299 778062 789479 798505 811863 826563 839713 843069 843319
8929 843319 853494 866467 874947 882007 894294 910704 922692 935279 949717 964354 976131 992350
8917 992350 1007634 1017652 1030125 1047539 1053461 1066792 1076163 1085257 1093599 1100010 1114035 1134218 1151866
8904 1151866 1164015 1175046 1192486 1210597 1227795 1238520 1255826 1278537 1296760 1315645 1338285
8893 1338285 1354459 1375177 1395356 1416046 1432068 1448813 1473598 1497445 1516654 1533637 1553661
8882 1553661 1580806 1608268 1638041 1667498 1687256 1710451 1739451 1767451 1795868 1824226 1847720
8871 1847720 1867411 1897341 1923252 1952649 1987491 2025063 2059956 2098426 2138786 2173562 2206818
8860B206818L0373M0693M9681M4632M6359M0086L3744M0521M2642N6191M8117
8849B679857M3327M6974M9417N2354N6824N6860N6265O0995N8617N8552O2700
8838C282742O5879O3961O8487O6198P3891P6590P5415P3261Q0176P6787Q1177
8827D084564Q7630Q4507Q7099R6905Q9544R3615R7565R3589J01652J07113J09690
8816E133473J18524J12776J09226J16383J15037J21279J21848J26833J24384J29376
8806F329139J31899J39631J35383J34125J39052J38887J41380J39199J40912J38122
8796G707729J46530J35893J48244J45842J44699J44872J33829J38853J29694J22233
8786I098418J19965J18967J20887J07451J07752R5268R4255R0890Q1238P2514
$$ plain form
8860 2206818 2237191 2277884 2327565 2372197 2418556 2458642 2492386 2532907 2575549 2631740 2679857
8849 2679857 2723184 2770158 2819575 2871929 2928753 2985613 3041878 3102873 3161490 3220042 3282742
8838 3282742 3348621 3412582 3481069 3547267 3621158 3697748 3773163 3846424 3926600 4003387 4084564
8827 4084564 4172194 4256701 4343800 4440705 4530249 4623864 4721429 4815018 4916670 5023783 5133473
8816 5133473 5251997 5364773 5473999 5590382 5705419 5826698 5948546 6075379 6199763 6329139
8806 6329139 6461038 6600669 6736052 6870177 7009229 7148116 7289496 7428695 7569607 7707729
8796 7707729 7854259 7990152 8138396 8284238 8428937 8573809 8707638 8846491 8976185 9098418
8786 9098418 9218383 9337350 9458237 9565688 9673440 9768708 9862963 9953853 10035091 10107605
8776A0107605O7653N5601M5381M0897L4038K0933Q060j1841j8789k9894k8931
8765A0290713k8621l1650l3349m4603n7258p7219q7840j01654j03022j00837j03911
8754I520749j09399j12064j25013j21696j32830j44481j46784j35592j43704j47809
8744H201377j40115j42601j38879j43674j43996j42576j37655j41186j45140j40760
8734F784795j37988j33928j39984j38749j26052j27305j27831j19820j22830j24124
8724E486184j19488j10796j20112j06564r9168r8458j08703j03969j00062r6098
8714D422766q6684r4533r4222r1115q1270p7423q0767p7921p4085p6801p5569
8703C512376p3089p7058p4026o9091o2344n0296n6508n8822o4253n9061n3448
$$ plain form
8776 10107605 10175258 10230859 10276240 10317137 10351175 10372108 10380168 10368327 10349538 10319644 10290713
8765 10290713 10262092 10230442 10197093 10152490 10095232 10018013 9930173 9828519 9725497 9624660 9520749
8754 9520749 9411350 9299286 9174273 9052577 8919747 8775266 8628482 8492890 8349186 8201377
8744 8201377 8061262 7918661 7779782 7636108 7492112 7349536 7211881 7070695 6925555 6784795
8734 6784795 6646807 6512879 6372895 6234146 6108094 5980789 5852958 5733138 5610308 5486184
8724 5486184 5366696 5255900 5135788 5029224 4930056 4831598 4722895 4618926 4518864 4422766
8714 4422766 4336082 4241549 4147327 4056212 3974942 3897519 3816752 3738831 3664746 3587945 3512376
8703 3512376 3439287 3362229 3288203 3219112 3156768 3106472 3049964 2991142 2926889 2867828 2814380
8692B814380m8577m9045n8165n1792m4195m6509m6438m4145m1256m5313m6693
8681B292252m1517m1123m0776l6200l5792l8714l7644l5395l0030l3736l5509
8670A885816l6634l6549k8917k8279l0198k8701j7931j5825k2401k8347l1386
8659A580648k4946k5387k3336k5581k3062j9911j6767k0775k5727k0456k6260
8648A328440j6873j8696k7606k2160j2525j2171j3062j5377j7266j1037j8093
8637A143574j8391j5666j2250j4429r193j3053j6209j2879n847j5429j6160q473
8625I85595j942o806o186l572j585R794J9497L1171N4321Q8129J12056M8998p5583
8612A253887j34577j13864p4223n3524k6312j7196j6283k0891j2521q628j8250
$$ plain form
8692 2814380 2765803 2716758 2658593 2606801 2562606 2516097 2469659 2425514 2384258 2338945 2292252
8681 2292252 2250735 2209612 2168836 2132636 2096844 2058130 2020486 1985091 1955061 1921325 1885816
8670 1885816 1849182 1812633 1783716 1755437 1725239 1696538 1678607 1662782 1640381 1612034 1580648
8659 1580648 1555702 1530315 1506979 1481398 1458336 1438425 1421658 1400883 1375156 1354700 1328440
8648 1328440 1311567 1292871 1265265 1243105 1230580 1218409 1205347 1189970 1172704 1161667 1143574
8637 1143574 1125183 1109517 1097267 1082838 1073645 1060592 1044383 1031504 1025657 1010228 994068 985595
8625 985595 983653 976847 970661 967089 965504 975298 994795 1025966 1080287 1168416 1280472 1329470 1253887
8612 1253887 1119310 1005446 931223 877699 851387 834191 817908 797017 784496 775868 757618
8601G57618j6292j2766j2707j3438o944p259j3049o102j0352m425J628q180q814
8588F38918n183o533l129q913p608l32j380m382k285J550M534R669K2499L7339
8574F74764N9339R1332J01068M8870m6061j13417j12163p2750m8185k6889j5991
8563E39917j7665j2531n116n765m391r646j3085n737n618p850p786p503j0262
8550D26962p666p560n79n292o878L240o284l617M496M75p003l738n731m313j119
8535C75393j0837o739m676M314L83m361P06j672p054p77l972q906J318K057m653
8520C30524o822j016l145j73J89p493p71n77J713l885q175k990n764r187m414
8505B78014o074j625K409J210R23q921j335L251n340n173J213L442p311l299l605
$$ plain form
8601 757618 741326 728560 715853 702415 695471 688212 675163 669061 658709 654284 655912 647732 638918
8588 638918 633735 627202 624073 615160 607552 607220 605840 601458 599173 600723 605257 614926 637425 674764
8574 674764 734103 825435 926503 975373 929312 815895 703732 630982 582797 555908 539917
8563 539917 522252 509721 504605 498840 494449 484803 471718 465981 460363 452513 444727 437224 426962
8550 426962 419296 411736 411157 405865 398987 402227 395943 392326 396822 397297 390294 386556 380825 376512 375393
8535 375393 364556 357817 353141 357455 357838 353477 354183 352511 345457 344680 340708 331802 333120 335177 330524
8520 330524 323702 322686 319541 319368 319557 312064 311293 310716 312429 308544 300369 297379 291615 282428 278014
8505 278014 271940 270315 272724 273934 274857 265936 264601 267852 262512 257339 258552 261994 254683 251384 247779
8490B47779k242l939K165M774k377j2238j095o210m397K682m212j553m34j151
8476B17552l326q656k072J808J236L163N17m303m279J388n096m86L47j915N506
8461B01384J78k650j307j455m377o80P1o916K828K04j0850J587K967r550m114
8446A67320M461J251l959o734m484J150P513J184L16p927o144l091L557K60j709
8431A52964j50m284J315L166L123k445k891N49p642p64M283k196j618r9r35J314
8415A43690J974Q51k660j2854q959N571N193k419P72O079L015m116n471m6m569
8400A26051k365K677o572j0571N126O880j952n600n118N545N975o654j445P573
8386A19550o875n87K433O59l157l520K811M39k008l595K89m099o115k865M519
$$ plain form
8490 247779 245537 241598 243763 248537 246160 233922 232827 226617 222220 224902 220690 219137 218703 217552
8476 217552 214226 205570 203498 205306 206542 209705 210222 205919 201640 203028 197932 197446 197793 195878 201384
8461 201384 201562 198912 197605 196150 191773 191093 191164 184248 187076 187280 176430 178017 180984 171434 167320
8446 167320 171781 173032 169073 162339 157855 159005 166518 167702 168018 160091 153947 150856 154413 154673 152964
8431 152964 152814 148530 149845 153011 156134 153689 150798 151347 143705 142941 147224 145028 143410 143311 142376 143690
8415 143690 145664 146515 143855 131001 122042 127613 132806 130387 131159 137238 140253 136137 130666 130620 126051
8400 126051 123686 126363 119791 109220 114346 121226 119274 113674 108556 114101 120076 113422 111977 119550
8386 119550 112675 112088 114521 115180 112023 108503 111314 111753 109745 106150 106439 102340 96225 93360 97879
8371I7879Q146Q245l35m345p476l987Q484K681k1n679p093M011K173L973n410
8356A01246K977L624p131o612O08j695P65R807K673n048l041L433o825n908n462
8341H3411j974P898K64o078J651K941J966M0o331n456J285K152k09k770k266M986
8325H1510L438J059K293p581p497L258M91m4j3j0889m336Q860K105o177K792k236
8309F7033K96L163j243K686M613n770o446l20N253m075M873L788K808p126r993
8294E9540R00Q343M691n021m586N046r29m311j866j993M328m8o45k19o702j139
8278E5389n224J72M977l409k512M205Q195n889O990N070n926j875k322M67j667
8263E6641K374K006p044q741K991O401O660L829q79l535k588j410l865q19M195
$$ plain form
8371 97879 106025 114270 113935 109590 102114 98127 106611 109292 109271 103592 96499 100510 102683 106656 101246
8356 101246 104223 107847 100716 94104 94712 93017 93782 103589 106262 101214 98173 101606 94781 88873 83411
8341 83411 81437 89335 89599 83521 85172 88113 90079 90119 83788 78332 79617 81769 81560 78790 76524 81510
8325 81510 84948 86007 88300 80719 73222 76480 76971 76927 76914 66025 61689 70549 72654 66477 69269 67033
8309 67033 67329 70492 69249 71935 76548 70778 64332 64012 69265 65190 70063 73851 76659 69533 59540
8294 59540 60440 68783 73474 68453 63867 68913 67984 63673 61807 59814 64142 64094 63449 63230 56528 55389
8278 55389 50165 50337 55314 51905 49393 53598 61793 55904 62894 67964 62038 60163 57841 58308 56641
8263 56641 59015 61021 53977 45236 48227 54628 61288 65117 64238 60703 58115 56705 52840 52021 56216
8248E6216R25j01k807M650j749p413m138l659O746P03j320l771K122L180n460
8233D4124p654J713M133L913M205l79Q99J797K132K752k112j1237o020M517r69
8218D1814M909m242j908k484K340J204r93K380N196J515K297j872k704J301P57
8203D9510l461m687q971J429L029O858k14o93o897k503Q62j436Q44L798j13L840
8187D1195J912j0790o424m53L035P189q02M13J466p02k460l189j421j272P81M898
8171C3376j280J457P37J435k067M45J472j658m302P87m329j863L834O301K986
8156C7331j857q358o400k414K648L883l995K731M723J992j556N352J226o18P9
8141C4767j997n595m361n8q672k897J665J560M088N432l36m217l74L493m721l641
$$ plain form
8248 56216 57141 57040 54233 58883 57134 49721 45583 41924 48670 49373 48053 44282 46404 49584 44124
8233 44124 36470 38183 42316 46229 50434 50055 50954 52751 54883 57635 55523 44286 38266 42783 41814
8218 41814 46723 42481 40573 38089 40429 41633 40640 43020 48216 49731 52028 50156 47452 48753 49510
8203 49510 46049 41362 32391 33820 36849 43707 43493 42800 35903 33400 34262 32826 33670 37468 37355 41195
8187 41195 43107 32317 25893 25440 28475 35664 34862 35275 36741 36039 33579 30390 28969 27697 28478 33376
8171 33376 32096 33553 34290 35725 33658 34103 35575 33917 29615 30402 26073 24210 28044 34345 37331
8156 37331 35474 27116 20716 18302 20950 24833 20838 23569 28292 30284 28728 34080 35306 34688 34767
8141 34767 32770 27175 22814 22756 14084 11187 12852 14412 18500 23932 23596 19379 19005 22498 17777 14136
8125A4136K659Q209K780l46K281k224m14L144m553r154J439p51k672J745K366
8110A8645n36L901N484M943Q417m826r680M51q06m414k014K528m533m313k171
8095A1076M725M143j633M840L369K136j0179p039M960L924l022j004m00J121l81
8080A6636m097M85N62k061O573P209j698J699j535K741K448m824n503l70L880
8065B2145p3m066l717K27J876J806j440l905n63j528M552j924k611k31r80k498
8049G070j306J7j180n325J938R55J848P228L586K605J417o46J8q266q486L494
8033D967M180M668M055O488j644l14j448J763L472m194l124q70j417l861N498
8018A8219M698K054j802o56n91n91K295Q372P16m101n000j099o01j245N539m578
$$ plain form
8125 14136 16795 25004 27784 27438 29719 27495 27081 30225 25672 16518 17957 17206 14534 16279 18645
8110 18645 18109 22010 27494 32437 40854 36028 26348 26799 25993 21579 19565 22093 17560 13247 11076
8095 11076 15801 19944 18311 23151 26520 28656 18477 11438 16398 20322 17300 16296 15896 17017 16636
8080 16636 12539 13024 13586 11525 18098 25307 23609 25308 23773 26514 28962 24138 18635 18265 22145
8065 22145 22072 18006 14289 14516 16392 18198 16758 12853 12290 10762 15314 13390 10779 10548 9568 7070
8049 7070 5764 5781 4601 -724 1214 2169 4017 11245 14831 17436 18853 18207 18225 9959 1473 4967
8033 4967 9147 13815 17870 24358 22714 22400 20952 22715 26187 21993 18869 17999 16582 12721 18219
8018 18219 22917 24971 23169 22513 21922 21331 23626 31998 32714 28613 23613 22514 21913 20668 26207 21629
8002B1629o707o604l524K521N550O661J040L037L774m335n877k668N648N032q656
7987A6521p498L406Q397J101o349m26K41k486P97K818k24O416L797n483n29o12
7971A9887K826l508k781j894k865L691M46o22K231O442M268l303k514J777p065
7956A7016j2661k279m775l60O596N816o34j904m609J47R79J377M762L957k221
7941A1207j104p401M75Q328K532j632M758J1025K375q784j76k990N6l07m384N841
7925A9819K150q052p834k379J583O440L392J373j921m074R78P007Q84j626l690
7910A4050j559M880j773J32o02J143r01K371O578K656q737m689J05M354l331p089
7894G588l470P431J1263N965K226n244L455m402n971L952j102m249j022j928k517
$$ plain form
8002 21629 14922 8318 4794 7315 12865 19526 20566 23603 27377 23042 17165 14497 20145 25177 16521
7987 16521 9023 12429 20826 21927 15578 15152 15393 12907 13704 16522 16298 22714 26511 21028 20499 19887
7971 19887 22713 19205 16424 14530 11665 15356 15802 15180 17411 23853 28121 24818 22304 24081 17016
7956 17016 4355 2076 -2699 -3059 3537 9353 8719 6815 2206 2353 3332 4709 9471 13428 11207
7941 11207 10103 2702 3177 11505 14037 12405 17163 28188 30563 21779 21603 18613 18669 18362 13978 19819
7925 19819 21969 13917 6083 3704 5287 11727 15119 16492 14571 10497 11475 18482 19366 17740 14050
7910 14050 12491 17371 15598 15730 15128 16271 15370 17741 24319 26975 18238 13549 13654 18008 14677 7588
7894 7588 4118 11549 22812 28777 31003 25759 29214 24812 18841 22793 21691 17442 16420 14492 11975
7879A1975p14R05R98n334m464K036o19k40J332o49O409M501q50l285p590j741
7863B670r21p32J090j266M652M556L156O254K47L231J048J04o435p370l729O39
7847G194J967j496L688Q154M06l988m918r015K14m508J829Q495J773m168L710
7832I337N416l402J04J320L388k690p894m703K05O435J660n822j728J427K869
7817E922M639L094J334j800p875j1428o009O449L764K642n78m031K262K815L174
7802D374M399N251L637l208L64k710l919J410Q43m419J06M001l235l556J257K880
7786G475P521j031l691q01K936m198j554j530j511M565L960m228l608r72n147
7771a814m052J024R387Q969j607o063J032n695N10J41p451l838k092j56l508O951
$$ plain form
7879 11975 11261 12166 13164 7830 3366 5402 4783 4543 5875 5226 11635 16136 15286 12001 4411 2670
7863 2670 1749 1017 2107 841 5493 10049 13205 19459 19706 22937 23985 24089 17654 10284 6555 7194
7847 7194 9161 7665 11353 19507 19913 15925 11007 1992 2206 -2302 -473 8022 9795 5627 9337
7832 9337 14753 11351 11455 12775 16163 13473 5579 876 1081 7516 9176 3354 1626 3053 5922
7817 5922 10561 13655 14989 13189 5314 -6114 -12123 -5674 -1910 732 154 -3877 -1615 1200 4374
7802 4374 8773 14024 17661 14453 14817 12107 8188 9598 10441 6022 6128 10129 6894 3338 4595 7475
7786 7475 14996 13965 10274 9473 12409 8211 6657 5127 3616 8181 12141 7913 4305 3333 -1814
7771 -1814 -5866 -4842 4545 13514 11907 5844 6876 1181 1691 1832 -5619 -9457 -11549 -11705 -15213 -8262
7755h262J2338P864K352j0113n263o55N06l053l496L684j1r43l186N209O448m94
7739B925O109L326n958n480k401j624l147M081L899P18p46L853k422n435o237
7724h539M23J081J41q52O158Q82m787k868L945K96q37K369m422n051K72O180p057
7707a2666N866P565K788O183l577n260n454n434j091O652N8Q40P13j915M089m900
7691e543j716j764k948l572k17Q002j636k317k822P274J841Q817N060K623k86
7676A0796k402p554p979J08l217n4L022N256k755P72N892L22M118m377q314L988
7660b378k972l828K185J854J686O37o041R96l182K617R77N262M654k726n238q97
7644f394L881J049M501L236j479n472o590n882J83l472M532R823K915Q771jk932
$$ plain form
7755 -8262 4076 11940 14292 4179 -1084 -1739 -1233 -4286 -7782 -4098 -4109 -5052 -8238 -3029 3419 2925
7739 2925 9034 12360 6402 922 -1479 -3103 -6250 -2169 1730 2448 1702 5555 3133 -2302 -8539
7724 -8539 -8116 -7035 -6894 -7746 -1588 -706 -5493 -8361 -4416 -4120 -4957 -2588 -7010 -12061 -11789 -5609 -12666
7707 -12666 -6800 765 3553 9736 6159 899 -4555 -9989 -11080 -4428 -4370 -3530 -2817 -4732 -643 -5543
7691 -5543 -7259 -9023 -11971 -15543 -15760 -7758 -9394 -11711 -14533 -7259 -5418 3399 8459 11082 10796
7676 10796 8394 840 -7139 -7031 -10248 -10302 -7280 -2024 -4779 -4007 1885 2207 6325 1948 -6366 -2378
7660 -2378 -5350 -9178 -6993 -5139 -3453 -2816 -8857 -7861 -11043 -8426 -7449 -2187 2467 -259 -5497 -6394
7644 -6394 -2513 -1464 3037 6273 4794 -678 -7268 -13150 -12967 -16439 -11907 -2084 831 9602 9601 6669
7628F669n504j610L714M682K860q854m813J507j0074p946k329j884N058J3534
7614d990P836k22l767o416m604m74K352N267M280J984P1j992r54J117N327K180
7598F995l618o808q223q008J206N603R62j362J895J326R210L535l217k687J475
7583a716n076L039P990J548K751N07p113n606k081K725ol978j789l728K574P280
7567b679J028o486M573M35j182L387j624l113O521o634L6r67o844M500J024J262
7551f763M851L120L813p79m467k434k832J300k309j637o730M390Q029J281k193
7536c360M129M277k756k554p234j815P366j701m346K159J030m357n766L435j607
7521a3100M070j405K233J925o147J046O679p19q28j671J626K109k051L240L041
$$ plain form
7628 6669 1165 -445 3269 7951 10811 1957 -2856 -1349 -11423 -19369 -21698 -23582 -18524 -4990
7614 -4990 2846 2624 -1143 -7559 -12163 -12637 -10285 -5018 -738 1246 1317 -675 -1629 -512 4815 6995
7598 6995 3377 -3431 -11654 -19662 -18456 -12853 -11891 -13253 -11358 -10032 -822 2713 -504 -3191 -1716
7583 -1716 -6792 -3753 4237 5785 8536 9043 1930 -3676 -5757 -3032 -3038 -7016 -8805 -12533 -9959 -2679
7567 -2679 -1651 -8137 -3564 -3129 -4311 -924 -2548 -5661 860 -5774 -5738 -6705 -13549 -9049 -8025 -6763
7551 -6763 -1912 1208 5021 4242 -225 -2659 -5491 -4191 -6500 -8137 -14867 -10477 -2448 -1167 -3360
7536 -3360 769 5046 2290 -264 -7498 -9313 -1947 -3648 -7994 -5835 -4805 -9162 -14928 -11493 -13100
7521 -13100 -9030 -10435 -8202 -6277 -12424 -11378 -4699 -5418 -6246 -7917 -6291 -4182 -6233 -2993 48
7506D8K445O40k329m638P11L453n119m396O02j590k989j49J498O908P555K108
7490D758M667N023K334q143o288n566K39k688j356j79J97J775k866p38N738l412
7474f505l675M97M228j279p10L592n037Q22R948Q388k791o329j0359J454J973
7459e783J886L113P729N486n746r550m64p482n63P958J323q27K46J108n57n111
7443g234N568l697r966k168Q325N974q085L634L812K519M631l105r680J120M721
7428c631L378k208q603N476L898R66o084J125N046k360J095j179q90l73P17J620
7412b007L54m304o40N08m07J040k462k351J298J974j48K716p332J184M735o00
7396f442k769M070Q066K51j0828l463M180P048R00q51k746R2m135j580r28M419
$$ plain form
7506 48 2493 3133 804 -3834 -3123 330 -4789 -9185 -8583 -10173 -13162 -13311 -11813 -4905 2650 4758
7490 4758 9425 14448 16782 8639 2351 -3215 -2976 -5664 -7020 -7199 -7002 -5227 -8093 -8831 -3093 -6505
7474 -6505 -10180 -9683 -5455 -6734 -7444 -3852 -8889 -8067 1881 10269 7478 1149 -9210 -7756 -5783
7459 -5783 -3897 -784 6945 12431 6685 -2865 -3329 -10811 -11374 -3416 -2093 -2920 -2674 -1566 -2123 -7234
7443 -7234 -1666 -5363 -15329 -17497 -9172 -3198 -11283 -7649 -3837 -1318 3313 208 -9472 -8352 -3631
7428 -3631 -253 -2461 -11064 -5588 -1690 -724 -6808 -5683 -637 -2997 -1902 -3081 -3971 -4344 -3627 -2007
7412 -2007 -1653 -5957 -6597 -6089 -6496 -5456 -7918 -10269 -8971 -6997 -7145 -4429 -11761 -10577 -5842 -6442
7396 -6442 -9211 -5141 2925 3176 -7652 -11115 -6935 113 1013 162 -2584 -2492 -6627 -8207 -9135 -4716
7380d716l432q55k382L888M704l745q18m176n30N690k310N293K770m194j0080
7365a4893K931M231P890q60K6m121K97j643l153N04j149P501Q517J998n268Q8
7349B896p477m529O31K239p96M33P680J75Nj955M39j869K368m46m200n488K86
7332i608Q54N176J653q475p716L735j462K828n93L582R806K842j944k566K176
7317B88M408m581o264M055k535J147j323k60L834K625q093k252N053J773L417
7302A292P10j795l61j198j127k960K188R188K255j55o217K506M544o835k835L727
7286B927p708j0598j391l534l145J230N085Q442K833L299J522m465o733m444m389
7271b1069M626P904j018j889O39P908M892k654m939n15n364P73P254N945m95l961
$$ plain form
7380 -4716 -8148 -9003 -11385 -7497 -2793 -6538 -7356 -11532 -12062 -6372 -8682 -3389 -619 -4813 -14893
7365 -14893 -11962 -7731 159 -701 -675 -4796 -4499 -6142 -9295 -8791 -9940 -2439 6078 8076 2808 2896
7349 2896 -4581 -9110 -8479 -6240 -7036 -6603 1077 1252 1257 -698 -259 -2128 240 -206 -4406 -9894 -9608
7332 -9608 -8754 -3578 -1925 -10400 -18116 -14381 -15843 -13015 -13608 -10026 -220 2622 678 -1888 288
7317 288 4696 115 -6149 -2094 -4629 -3482 -4805 -5065 -1231 1394 -6699 -8951 -3898 -2125 1292
7302 1292 2002 207 -154 -1352 -2479 -5439 -3251 5937 8192 8037 1820 4326 8870 2035 -800 2927
7286 2927 -4781 -15379 -16770 -20304 -23449 -22219 -17134 -8692 -5859 -2560 -1038 -5503 -12236 -16680 -21069
7271 -21069 -16443 -8539 -9557 -11446 -10807 -2899 1993 -661 -5600 -6115 -11479 -10706 -3452 2493 1998 -1963
7255a963K669m627K992P443j245m797j737n39M279k224m639j278l853L743K236
7240c540n113p23M500M748k684l41N321q751k704L620K785m804n803l246k994
7225a9729j124N986J193L532L59k546L891K208N405N211J63k746k19o240k013
7210f669o34N308N799K152m012j525j898k717k70j605K283j959r077p26L524L499
7194h527J37M40K560O74q14K183k148p489p28L700K806M3O098K570j016J150J237
7177B876M478Q47K536J22j130l627j0546l856K897N92l867L273K589M165k589
7162a240p676K25K849J514p238R611P854K164P17m305m181n955Q114L991j927
7147D517j530j0222l08M453L415k500j1568l332Q410Q049p235l224M57N85N013
$$ plain form
7255 -1963 706 -3921 -929 6514 5269 472 -1265 -1804 2475 251 -4388 -5666 -9519 -5776 -3540
7240 -3540 -8653 -9376 -4876 -128 -2812 -3153 2168 -6583 -9287 -5667 -2882 -7686 -13489 -16735 -19729
7225 -19729 -20853 -14867 -13674 -10142 -9783 -12329 -8438 -6230 -825 4386 4549 1803 1584 -4656 -6669
7210 -6669 -7303 -1995 3804 5956 1944 419 -1479 -4196 -4466 -6071 -3788 -5747 -14824 -15550 -12026 -8527
7194 -8527 -8390 -7950 -5390 -4716 -5530 -3347 -5495 -12984 -13712 -10012 -7206 -7163 -1065 1505 489 1639 2876
7177 2876 7354 8201 10737 10859 9729 6102 -4444 -8300 -5403 -4811 -8678 -5405 -2816 1349 -1240
7162 -1240 -8916 -8691 -5842 -4328 -11566 -1955 5899 8063 8780 4475 294 -5661 2453 6444 4517
7147 4517 2987 -7235 -7543 -3090 325 -2175 -13743 -17075 -8665 -616 -7851 -11075 -10618 -10033 -5020
7132e020L809M26J870J433m830p17P362L679K831n291k711n902k149l733m370
7117a3313N064L774J0021L845r713j3246l591m442M512M031q98j842k2m290O00
7102a9510N828L65j290m182M935p02Q8R12k310L949j177j194K846L31Q607Q410
7086E906J983k085o807j2499K298L969K695j984l4M991M260J420l445j534r98
7071a864q478q106K065P005J620L930J060N615L63l325k941k546J247K086N110
7056B841n780k763J614k01N33L283P03R058k065R90J88k180k237n911k332k149
7040f408j114n273M033K785N920J503k264j923K041k36Q954J39l429j3116q162
7025a6550l910P112J3442M290q402p564l103L471N488N060L351p511q329n673
$$ plain form
7132 -5020 -1211 -785 1085 2518 -2312 -3029 4333 8012 10843 5552 2841 -3061 -5210 -8943 -13313
7117 -13313 -8249 -4475 5546 9391 -322 -13568 -17159 -21601 -17089 -13058 -13956 -15798 -15820 -20110 -19510
7102 -19510 -13682 -13317 -14607 -18789 -13854 -14556 -14468 -13556 -15866 -11917 -13094 -14288 -11442 -11111 -2504 5906
7086 5906 7889 5804 -1003 -13502 -11204 -7235 -4540 -6524 -6558 -1567 2693 4113 668 -866 -1864
7071 -1864 -10342 -18448 -16383 -9378 -7758 -3828 -2768 2847 3210 -115 -3056 -5602 -4355 -2269 2841
7056 2841 -2939 -5702 -4088 -4289 -3756 -473 230 9288 7223 8213 8401 6221 3984 -1927 -4259 -6408
7040 -6408 -7522 -12795 -8762 -5977 -57 1446 -818 -2741 -700 -936 8018 8157 4728 -8388 -16550
7025 -16550 -20460 -13348 94 4384 -4018 -11582 -14685 -11214 -5726 -666 2685 -4826 -13155 -18828
7011a8828K094J060M106K823k715K384Q28j973R69K525M349O222l567j583M443
6996C137J679m797m557n252K950O624l995p666K470Q640N629m580p124L114p778
6981a1506l375P960L936J060J410L626n10q10n434O793n01k569L585K62l742p850
6965g665p584K309j891q59j027M188Q474J534n132o424L644J689J543o65k276
6950a0142L007k573o740p73J774P406L895K658j659j656k364j915J1476K437l419
6935A412q250K912K118k11n972M20k301L175l937m998j189J170J508R326Q623
6920C806l01j535k820m80m487k838j1942j819R815M708j927K431l55l158k424
6905a3326j086j150j571J691N540K831K113Rq309r445J079J1970M652K74m950
$$ plain form
7011 -18828 -16734 -15674 -11568 -8745 -11460 -9076 -8248 -10221 -9252 -6727 -2378 3844 277 -1306 3137
6996 3137 4816 19 -4538 -9790 -6840 -216 -4211 -11877 -9407 -767 4862 282 -6842 -3728 -11506
6981 -11506 -14881 -6921 -2985 -1925 -515 3111 2601 1791 -3643 3150 2649 80 3665 3927 185 -7665
6965 -7665 -15249 -12940 -14831 -15690 -16717 -12529 -4055 -2521 -7653 -14077 -10433 -8744 -7201 -7866 -10142
6950 -10142 -7135 -9708 -16448 -17221 -15447 -8041 -4146 -1488 -3147 -4803 -7167 -9082 2394 4831 1412
6935 1412 -6838 -3926 -1808 -2019 -7991 -7571 -9872 -6697 -10634 -15632 -16821 -15651 -14143 -4817 3806
6920 3806 3505 1970 -850 -1330 -5817 -8655 -20597 -22416 -12601 -7893 -9820 -7389 -7744 -10902 -13326
6905 -13326 -14412 -15562 -17133 -15442 -9902 -7071 -4958 -4949 -13258 -22703 -21624 -9654 -5002 -4728 -9678
6890i678o506M514N374K791J598P067k126m898L357l318j892K198q68p319n40
6875a0246k151o71M399L397J231M43m214j902J376Q37j548K431J142l918P17M297
6859d380P538m388q881p825M82N8O346R07J302M174O346n602j995p401o317Q61
6843a8775J3493K196r295m301k064M157M880l38J686p88p242L455O909j78m195
6828a0400j967j423J306L844L50N530M288P92k460m116q503l371J021L352P628
6813d129K315j642m4k893m099j831l006L118L961K537j025K584J579k246r35Q54
6797d902K733l926k166o142j64Q406O639K819m992j517L034M161n760p497L899
6782e375O319m973p595j395M341M758j801k944j897p43j661k67N20Q72j215M622
$$ plain form
6890 -9678 -16184 -11670 -6296 -3505 -1907 5160 3034 -1864 1493 -1825 -3717 -1519 -2387 -9706 -10246
6875 -10246 -12397 -13068 -8669 -5272 -4041 -3598 -7812 -9714 -8338 -7501 -9049 -6618 -5476 -9394 -8677 -4380
6859 -4380 3158 -1230 -10111 -17936 -17454 -17396 -11050 -10143 -8841 -4667 1679 -3923 -5918 -13319 -19636 -18775
6843 -18775 -5282 -3086 -12381 -16682 -18746 -14589 -9709 -10047 -8361 -9149 -16391 -12936 -6027 -6205 -10400
6828 -10400 -12367 -13790 -12484 -8640 -8290 -2760 1528 2320 -140 -4256 -12759 -16130 -15109 -11757 -4129
6813 -4129 -1814 -3456 -3500 -6393 -10492 -12323 -15329 -12211 -8250 -5713 -6738 -4154 -2575 -4821 -5756 -4902
6797 -4902 -2169 -6095 -8261 -14403 -14567 -6161 478 3297 -1695 -3212 -178 3983 -1777 -9274 -5375
6782 -5375 944 -4029 -11624 -13019 -8678 -3920 -5721 -8665 -10562 -11305 -12966 -13233 -12713 -11841 -13056 -8434
6766h434N041L697l473p02L208o578q269O186L018N47k852n752J826p126P16N150
6750a3797n451p17J262J926N201L75n874j895P006M946o739m69M43K738J529L5
6734i481N967K071J292o853P40l676p876M329J452N442P35M340k60j714J605J129
6718g58q745j587L747k981m869k208Q285N323K052m96J755l842o826m537M356
6703a1331J994J033r1l582p963J31M043J4729M568l853N077M184k549r705K068
6688a247J968j825P283J530M530m493n407j0933j715O11m190o703Q245R281N727
6673B662j957K185k759r057Q68P569J197k165o107l965O52L536N468L169j790
6658d94o944k386J584P945n203k513J643N66R49L492L196J748J754l024m575l581
$$ plain form
6766 -8434 -3393 304 -3169 -3871 -663 -7241 -15510 -9324 -6306 -5759 -8611 -14363 -12537 -19663 -18947 -13797
6750 -13797 -19248 -19965 -18703 -16777 -11576 -11201 -17075 -18970 -11964 -7018 -13757 -14226 -13783 -11045 -9516 -9481
6734 -9481 -3514 -1443 -151 -7004 -6264 -9940 -17816 -13487 -12035 -6593 -5858 -1518 -1778 -3492 -1887 -758
6718 -758 -9503 -11090 -7343 -10324 -15193 -17401 -9116 -3793 -1741 -2237 -482 -4324 -11150 -15687 -11331
6703 -11331 -9337 -8304 -8395 -11977 -19940 -19809 -15766 -1037 3531 -322 4755 8939 6390 -3315 -1247
6688 -1247 721 -1104 6179 7709 12239 7746 2339 -8594 -10309 -9698 -13888 -20591 -12346 -3065 2662
6673 2662 705 2890 131 -8926 -8058 -489 708 -1457 -7564 -11529 -10877 -7341 -1873 1296 -494
6658 -494 -7438 -9824 -8240 -295 -5498 -8011 -6368 -5802 -4853 -1361 1835 3583 5337 2313 -2262 -5843
6642e843m731L319O581l10l868n74j589o501l197j439L88J0914M131p86p238o80
6626a1423Q81L957l532k684O046P691j223m411m865M957K246k833n326j357P450
6611d426L631J137o507n146k51K819L383j685N51N230Q85P71M2j499k869j73m9
6594d156L202j839N82M000L138o055j304K587N37o05o547k152j692j329n925M1
6578a7517L105N026K068n188k984J51n056M43K209l05o98L178N383M336J0329
6563D480J78l549R39r843j618L623m78K929J1n05O396J162l391n188j12P840L277
6546F151m072l520n755o69p39L306O213N000m090j232M835r211m272P034J042
6531B1l109p22n035r725P82J0003P388O186J986k738J292O32n671o503o881k316
$$ plain form
6642 -5843 -10574 -7255 -674 -984 -4852 -5426 -7015 -13516 -16713 -18152 -17764 -6850 -2719 -3505 -10743 -11423
6626 -11423 -10542 -6585 -10117 -12801 -6755 936 -287 -4698 -9563 -4606 -2360 -5193 -10519 -11876 -4426
6611 -4426 -795 342 -6165 -11311 -11562 -8743 -5360 -7045 -6494 -1264 -379 392 434 -1065 -3934 -4107 -4156
6594 -4156 -954 -2793 -2211 1789 4927 -1128 -2432 155 692 87 -6460 -8612 -10304 -11633 -17558 -17517
6578 -17517 -14412 -9386 -7318 -12506 -15490 -15339 -20395 -19952 -17743 -18048 -18746 -15568 -10185 -5849 4480
6563 4480 4658 1109 2048 -7795 -9413 -5790 -6268 -3339 -3328 -3833 2563 3725 334 -4854 -4966 2874 6151
6546 6151 2079 -1441 -7196 -7865 -8604 -5298 915 5915 1825 593 5428 -3783 -8055 -1021 21
6531 21 -3088 -3810 -8845 -18570 -17788 -7785 -397 5789 7775 5037 6329 6961 1290 -5213 -12094 -14410
6515a4410P654N687q95P690M25L150L107n688j1048p827M114P634N138l063r92
6500F76l067r084n149K033M901M998j455n01O285R942K5q264n012j929k19K636
6484c184O576k497j388n867l138j123N845L164l464n12J41n714n736N510O870
6469d517R328L098K585J406l972j0433j528J55J405l98O763L629m290q998J568
6454d199K575k353j472j252P74k730r12J941Q455O642q50n18o445m367k553J117
6438f147M103l535j589L933p57p629k742M015M355l560j526N436L423L66j899
6423c753J27j738Q84K354O136J119N36k818n942l816J202M052r32l483k172k796
6407a1040K150K132K18j932M61j329M736N087P9j415j085O111k894k400j305k276
$$ plain form
6515 -14410 -6756 -1069 -1964 5726 6151 9301 12408 6720 -4328 -12155 -8041 -407 4731 1668 676
6500 676 -2391 -11475 -16624 -14591 -9690 -4692 -6147 -6648 -363 9579 9604 1340 -3672 -5601 -5820 -3184
6484 -3184 3392 895 -493 -6360 -9498 -10621 -4776 -1612 -5076 -5588 -5447 -11161 -16897 -11387 -4517
6469 -4517 4811 7909 10494 11900 7928 -2505 -4033 -3878 -2473 -2871 3892 7521 3231 -5767 -4199
6454 -4199 -1624 -3977 -5449 -6701 -5927 -8657 -9569 -7628 827 7469 6619 6101 -344 -4711 -7264 -6147
6438 -6147 -2044 -5579 -7168 -3235 -3992 -11621 -14363 -10348 -5993 -9553 -11079 -5643 -2220 -1854 -3753
6423 -3753 -3626 -5364 -4480 -2126 4010 5129 5665 2847 -3095 -6911 -5709 -1657 -2589 -6072 -8244 -11040
6407 -11040 -8890 -6758 -6540 -8472 -8011 -9340 -4604 483 562 -853 -1938 4173 1279 -1121 -2426 -4702
6391d702m218J132M209O8m42m725q86j761J010L990m433n718m386j632M466j652
6375a9680q73K170L826Q394K994Q694l049p865J749O305o690j712K458L273j630
6360a636p044K770l456M097K623Q367J1896k917p681q343l585j252K861k438o268
6345a2006k819O087K787p613l138O641J922M882N569n674l440m95j690k172j660
6330a2819o498J758P106M582k134Q77k00k538L163k338O519p798J569K687p07
6315f771L478l11l337n092L796P692J043M126J057k027k369k751m381l495J277
6300h065K741O61L15o776m606q82J437l654j947P95R335j025j328Q549R316Q67
6284E733r699n771k880j050k911O151L672K025N038M913L050j899k926k259j355
$$ plain form
6391 -4702 -8920 -7788 -3579 -3511 -3953 -8678 -9564 -11325 -10315 -6325 -10758 -16476 -20862 -22494 -18028 -19680
6375 -19680 -20553 -18383 -14557 -6163 -3169 5525 2476 -5389 -3640 2665 -4025 -5737 -3279 -6 -1636
6360 -1636 -8680 -5910 -9366 -5269 -2646 5721 17617 14700 7019 -1324 -4909 -6161 -3300 -5738 -12006
6345 -12006 -14825 -8738 -5951 -13564 -16702 -10061 -8139 -3257 2312 -3362 -6802 -7297 -8987 -11159 -12819
6330 -12819 -19317 -17559 -10453 -5871 -8005 -7128 -7328 -9866 -6703 -9041 -2522 -10320 -8751 -6064 -6771
6315 -6771 -3293 -3604 -6941 -12033 -8237 -545 498 4624 5681 3654 1285 -1466 -5847 -9342 -8065
6300 -8065 -5324 -4663 -4348 -11124 -15730 -16612 -15175 -18829 -20776 -19981 -10646 -11671 -12999 -4450 4866 5733
6284 5733 -3966 -9737 -12617 -13667 -16578 -10427 -6755 -4730 308 5221 8271 6372 3446 1187 -168
6269a68L027L122M906k828j206L31j1918o146l627K795M707L944O54k62L374L837
6253D542M162m346n560o979k964L89j438j326K570J671j09K824M003N109M505
6238G053L193n393j8390K095j981j202Q65j755O79Q903k874n365m196L757N093
6223i518N771j604k679p537q3J810J333K314L569k205l366J12J036j57M758k215
6207h661m332j441K224K687P075R387o552q913N16M334o4l499M609L342p9j624
6191i91j734j283k206j573P531l00k993j974K523j660m315l146K43P715K626j589
6175c126o68J146k036k875J855J408J375m760l491L035k553m89P744N174J140
6160B879k102q92o209R78j841k06L865k198m54L900J569n406k002m121j504j669
$$ plain form
6269 -168 2859 5981 10887 8059 6853 7184 -4734 -10880 -14507 -11712 -7005 -3061 -2407 -2669 705 4542
6253 4542 8704 4358 -1202 -8181 -11145 -10756 -12194 -13520 -10950 -9279 -9388 -6564 -2561 2548 7053
6238 7053 10246 4853 -13537 -11442 -13423 -14625 -13760 -15515 -14836 -5933 -8807 -14172 -18368 -14611 -9518
6223 -9518 -3747 -5351 -8030 -15567 -15650 -13840 -12507 -10193 -6624 -8829 -12195 -12083 -11047 -11204 -6446 -8661
6207 -8661 -12993 -14434 -12210 -9523 -2448 6939 387 -8526 -8010 -3676 -3740 -7239 -2630 712 633 -991
6191 -991 -2725 -4008 -6214 -7787 -256 -556 -3549 -5523 -3000 -4660 -8975 -12121 -11878 -4163 -1537 -3126
6175 -3126 -3794 -2648 -4684 -7559 -5704 -4296 -2921 -7681 -11172 -8137 -10690 -11179 -3435 1739 2879
6160 2879 777 -115 -6324 -5346 -7187 -7393 -3528 -5726 -6180 -2280 -711 -6117 -8119 -12240 -13744 -15413
6144a5413J009l752K68J191M537L120L517O340q36p233l415J237K273N149L440
6129A432J848j931J135Q93n958j890j214K314P29M721k678l801n669J633j574
6114a0010K054P594k02R48j866l027L08L22j980k815k478j219K577J006m944K671
6098a1061N394m80j769k066l09J390j837K722L16O244m609j0275m095M562Q250
6083g623M124m022j689M973L40m432O03J080j160k157r2J146r50N243Q728M582
6067H694J842R60j027m290M17k909o694l465K407m28o09k965l493j05M250N082
6051b333N418l959r68P66K235L112m951o652N318K640k628J472J509k326l739
6036e086j907N710l728p06J261o439o250j269M730P175o1L28k772j64j929O244
$$ plain form
6144 -15413 -14404 -18156 -17888 -16697 -12160 -9040 -5523 817 -19 -7252 -10667 -9430 -7157 -2008 1432
6129 1432 3280 1349 2484 3377 -2581 -4471 -5685 -3371 -2642 2079 -599 -4400 -10069 -8436 -10010
6114 -10010 -7956 -362 -564 384 -1482 -4509 -4201 -3879 -5859 -8674 -11152 -12371 -9794 -8788 -13732 -11061
6098 -11061 -5667 -6147 -7916 -9982 -10291 -8901 -10738 -8016 -7700 -1456 -6065 -16340 -20435 -15873 -7623
6083 -7623 -3499 -7521 -9210 -4237 -3897 -8329 -7726 -6646 -7806 -9963 -10055 -8909 -9859 -4616 4112 8694
6067 8694 10536 11496 10469 6179 6596 3687 -3007 -6472 -4065 -4493 -5102 -8067 -11560 -11665 -7415 -2333
6051 -2333 3085 -874 -1842 -1076 1159 4271 -680 -7332 -2014 626 -2002 -530 979 -1347 -5086
6036 -5086 -6993 -1283 -5011 -5717 -4456 -10895 -17145 -18414 -13684 -6509 -6570 -6242 -9014 -9178 -11107 -4863
6020d863P200j456l172l484k48J924O691k937n276j708K609J1350q01o138k158
6005b467J861n24p71L357n262m419l562M435L092o68o966j13N891R065k950r237
5989i238j94L854M395m058j781j598MP686k186J6K29o30N414J821K883m137k008
5972D72l938M315k42k839P04j384o70j161M503L832j276N435J433p200j318q250
5956g584J380Q293R315l372n162l477L41m512L068n688M93j299l349m154p886
5941b3593N481M044M547M622L472K584j515L327R61o887n667N051M971J615j947
5926A066k830k631J197K801j395m010o57l1L581N750n340p966K050n13M66n216
5910a3678M368N572j399o83j318r97O027K367k071j518M190N464r505l070k141
$$ plain form
6020 -4863 2337 881 -2291 -5775 -6023 -4099 2592 -345 -5621 -7329 -4720 6630 5829 -309 -2467
6005 -2467 -606 -1130 -1901 1456 -3806 -8225 -11787 -7352 -4260 -4928 -11894 -12007 -6116 2949 -1 -9238
5989 -9238 -9432 -5578 -1183 -5241 -7022 -8620 -8616 -930 -3116 -3100 -2871 -3501 1913 3734 6617 2480 472
5972 472 -3466 849 607 -2232 -1528 -2912 -3582 -4743 -240 3592 2316 7751 9184 1984 666 -7584
5956 -7584 -6204 2089 11404 8032 2870 -607 -266 -4778 -1710 -7398 -6905 -8204 -11553 -15707 -23593
5941 -23593 -18112 -14068 -9521 -4899 -1427 1157 -358 2969 3930 -2957 -8624 -3573 1398 3013 1066
5926 1066 -1764 -4395 -3198 -397 -1792 -5802 -6459 -6490 -2909 2841 -2499 -10465 -8415 -8928 -8462 -13678
5910 -13678 -9310 -3738 -5137 -5820 -7138 -8135 -2108 259 -1812 -3330 860 6324 -3181 -6251 -8392
5895h392K635n59o368l737p18Q63L380M823J647k498j96L011P647m099j283L776
5879f8O602n80m175k546m404N416J070p908k394L812P685K034m420l686m68j687
5863e717J76R297k936k184k518n807L499O437p976L58K460k851K278k814K719
5848e579N44L249o132p926j95N906N368J570m870k49M207l227J298K940q36J525
5832b407m07K672O69J964k70O548l293l186k121q97J820L219K485m172m920l265
5816e561k010k293O210j942J354K766L161L347M923k705o760J156Q89L480J632
5801G647J90n39k052p787J717p78m76m366p034p46M043j481N057N369N012l828
5785e2j2195P0N119K236J534J792j828P85O540k320n380l420o06R138N347m591
$$ plain form
5895 -8392 -5757 -6316 -12684 -16421 -17139 -16276 -12896 -8073 -6426 -8924 -9120 -6109 1538 -2561 -3844 -68
5879 -68 6534 5954 1779 -767 -5171 245 1315 -6593 -8987 -5175 2510 4544 124 -3562 -4030 -5717
5863 -5717 -5541 3756 820 -1364 -3882 -9689 -6190 247 -7729 -7371 -4911 -7762 -5484 -8298 -5579
5848 -5579 -5035 -1786 -7918 -15844 -16039 -10133 -4765 -3195 -8065 -8314 -4107 -7334 -6036 -3096 -3932 -2407
5832 -2407 -2814 -142 527 2491 2221 8769 5476 2290 169 -728 1092 4311 6796 2624 -2296 -5561
5816 -5561 -7571 -9864 -3654 -5596 -4242 -1476 1685 5032 9955 7250 490 1646 2535 6015 7647
5801 7647 7837 7298 5246 -2541 -824 -1602 -2078 -6444 -13478 -14224 -10181 -11662 -6605 -1236 3776 -52
5785 -52 -12247 -12177 -7058 -4822 -3288 -1496 -3324 -2539 4001 1681 -3699 -7119 -7725 1413 6760 2169
5769B169P67L569L990J503n075k183M845j311j0698n792O043m780M35m280m045
5754a4843j806J474N805j664p33K971N769J0184K485q900n442k942N273k276k614
5739g259k008m11P004K988J731n803l58L536R729l13J980J296j435P313j107k236
5723A4647m738k636r86l885n584L445N641m320p09J143K33M059q81k33p38l400
5707A058l328l962l473k639J348P334R841j337j863j3910j226M826l477l019n673
5692a9500J925L466L850K057M668K074P70p87L07J665M232k38K306Q54n221n016
5676b588J1210K100k286m269o60l186J143L92m625K097K016l687m73J568P18o934
5660g464m256J322L232Q404l249m349o899m169L332o52K076O798N743K279M5J181
$$ plain form
5769 2169 2936 6505 10495 11998 6923 4740 9585 8274 -2424 -8216 -2173 -6953 -6518 -10798 -14843
5754 -14843 -16649 -15175 -9370 -11034 -11767 -8796 -3027 7157 9642 742 -4700 -7642 -2369 -4645 -7259
5739 -7259 -9267 -9678 -2674 314 2045 -3758 -4116 -580 9149 8836 10816 12112 10677 17990 16883 14647
5723 14647 9909 7273 6287 2402 -3182 263 5904 1584 875 2018 2251 6310 5429 5196 4458 1058
5707 1058 -2270 -6232 -9705 -12344 -10996 -3662 6179 4842 2979 -10931 -12157 -7331 -10808 -13827 -19500
5692 -19500 -17575 -14109 -10259 -8202 -3534 -1460 -690 -1477 -1170 495 4727 4489 6795 7649 2428 -2588
5676 -2588 8622 10722 8436 4167 3507 321 1464 1856 -2769 -672 1344 -2343 -2816 -1248 -530 -7464
5660 -7464 -11720 -10398 -7166 1238 -2011 -6360 -13259 -17428 -14096 -14748 -12672 -5874 -131 2148 2193 3374
5644C374M770o95q399q589j169M039K952K251k73P36L681L162J206j449K171j531
5628F237J354o089j190j619J423J398q35J984k246M43J330K646j043n781M685
5613B697O284L536J66p082J301j042m942M01j171m870m54o421j867p01Q502L647
5597b016j134p66j606m627p722O356J998j881K070K325M426J093p124k866k235
5582a3709R762K283m060k771j592M254L785O173k756r094k932P336J185o7k593
5567d796P45k22L781K054J957l364o761J687R43l663k034j44j49M807j385k009
5551h553O83o60k369K682Q936N908L367M16o765j443N070m100n402J69K326m19
5535a54K311M397K268J897n262L188L327m932l321j107j477j826j330L387O291
$$ plain form
5644 3374 8144 7449 -950 -9539 -10708 -6669 -3717 -1466 -1739 -1003 2678 5840 7046 5597 7768 6237
5628 6237 7591 1502 312 -1307 116 1514 679 2663 417 860 2190 4836 3793 -1988 2697
5613 2697 8981 12517 12683 5601 6902 5860 918 1319 148 -4722 -5176 -11597 -13464 -14165 -5663 -2016
5597 -2016 -3150 -3916 -5522 -10149 -17871 -11515 -9517 -11398 -9328 -7003 -2577 -1484 -8608 -11474 -13709
5582 -13709 -3947 -1664 -5724 -8495 -10087 -5833 -2048 4125 1369 -7725 -10657 -3321 -2136 -2203 -4796
5567 -4796 -4051 -4273 -492 1562 3519 155 -6606 -4919 -3976 -7639 -9673 -9817 -9966 -5159 -6544 -8553
5551 -8553 -7870 -8530 -10899 -8217 719 6627 9994 10410 3645 2202 7272 3172 -2230 -2061 265 -154
5535 -154 2157 6554 8822 10719 5457 8645 11972 7040 3719 2612 1135 -691 -2021 1366 7657
5520G657K810n323j945L00l854l382K099K909N925n69n106q96l777K848k854l361
5504f519m4j463k205K403l436j5109j923N187O716L243N2P032J037r73k89J46
5488f145M004J369m340o43K19k026j950j779N628N746O537R69j126j031l895J493
5472C030p610l607N9l799P53J648L239K562M171q30j557j201p36J237j155R734
5456E938J801n932o826p42q87q02L651O044j706m843q64k030J31L620L191o93
5440i49j757l338K11j267m966O848l143l673J113J931M896k928m397N002L700
5425b717k38m461J128K13M348L263N02o112L595R472m153p740J17L544k321j785
5409c345J988L105P455O02p300J114K908j817j817L673k18J073j754j834K525
$$ plain form
5520 7657 10467 5144 3199 3499 -355 -3737 -1638 1271 7196 6627 1521 625 -3152 -304 -3158 -6519
5504 -6519 -6563 -8026 -10231 -7828 -11264 -26373 -28296 -23109 -16393 -13150 -13098 -6066 -5029 -6002 -6291 -6145
5488 -6145 -2141 -772 -5112 -5755 -5536 -7562 -9512 -11291 -5663 83 6620 7589 6463 5432 1537 3030
5472 3030 -4580 -8187 -8128 -11927 -11174 -9526 -6287 -3725 446 -384 -1941 -3142 -3878 -2641 -3796 5938
5456 5938 7739 1807 -5019 -5761 -6648 -7450 -3799 2245 539 -4304 -5168 -7198 -7067 -3447 -256 -949
5440 -949 -2706 -6044 -5833 -7100 -12066 -5218 -8361 -12034 -10921 -8990 -4094 -7022 -11419 -6417 -2717
5425 -2717 -2955 -7416 -6288 -6075 -1727 1536 2038 -4074 -479 8993 4840 -2900 -2783 761 -1560 -3345
5409 -3345 -1357 1748 9203 9805 2505 3619 6527 4710 2893 6566 6348 7421 5667 3833 6358
5394F358j311l038n53l564K000L365k687l281n88M233j608k269J109j397o15k709
5378f555j261N541K613m4J579o346l441Q05p06K512J261r024P536J587q248j232
5362a3423N349Q784L606p525k56R82Q69P82L727J580o591L197l73n309J168r29
5346d362J509N110Q059N87l511j006L196N585j456o601k588J110L15n073o363
5331e489j0218Q39M673O164Q80K11j174l798r49P900L513m955o561M758N760l875
5315b321O335L070k962m529n215O30R970J048k931k238j531L777M987r55l371
5300C764k984n988l175M404K150J134r18r73N834r5k806q513r238J310J0186N023
5284h85K020M492o33m654k578m754q47R932L347k094M075l121K937J975k734j500
$$ plain form
5394 6358 5047 2009 1456 -2108 -108 3257 570 -2711 -3299 934 -674 -2943 -1834 -3231 -3846 -6555
5378 -6555 -7816 -2275 338 294 1873 -4473 -7914 -7109 -7815 -5303 -4042 -13066 -5530 -3943 -12191 -13423
5362 -13423 -8074 710 4316 -3209 -3465 -2483 -1614 -832 2895 4475 -2116 1081 708 -4601 -3433 -4362
5346 -4362 -2853 2257 10316 10903 7392 6386 9582 15167 13711 7110 4522 5632 5947 874 -5489
5331 -5489 -15707 -14868 -10195 -4031 -3151 -2940 -4114 -7912 -8861 -961 2552 -2403 -8964 -4206 1554 -2321
5315 -2321 4014 7084 4122 -407 -5622 -4992 4978 6026 3095 857 -674 3103 8090 7135 3764
5300 3764 780 -5208 -8383 -3979 -1829 -695 -1613 -2586 3248 3153 347 -8166 -17404 -16094 -5908 -885
5284 -885 1135 5627 4994 340 -2238 -6992 -7839 2093 5440 3346 7421 4300 7237 9212 6478 4978
5268D978l362p459l322N430J909M700R420rj242L83n051J285j899m168k350l553
5252d310p03Q129J498J272p84M479N786k052o801K195Q728j187n370k896j3634
5237e650m845N249J845m079j396N741l63r362QQ540M309l719n12M425k013m486
5221f308r26l404L6L150m087K470K218K285j459j084L607L247r079J338R094J62
5205A260o445j438k2k301j150m946M827M466J90o50M429O816R115P95J141K268
5189A8355o422o391o753q473J937R464M898l201j203M741j825l165n872n778M849
5174d839P755K975l633p275L624R147m693p974m467J232L11M41N14L349k482j746
5158g761k471J742L912k416N699K10j27k900R48J375k699n026j29N587K314j548
$$ plain form
5268 4978 1616 -5843 -9165 -3735 -1826 2874 12294 12285 11043 11426 6375 7660 5761 1593 -757 -4310
5252 -4310 -5013 3116 4614 5886 5102 9581 15367 13315 6514 8709 17437 16250 10880 7984 -5650
5237 -5650 -10495 -5246 -3401 -7480 -8876 -3135 -3498 -12860 -12852 -4312 -3 -3722 -4234 191 -1822 -6308
5221 -6308 -7234 -10638 -10602 -7452 -11539 -9069 -6851 -4566 -6025 -7109 -3502 -255 -9334 -7996 1098 1260
5205 1260 -5185 -6623 -6645 -8946 -10096 -15042 -10215 -5749 -5559 -6209 -1780 5036 14151 14946 16087 18355
5189 18355 11933 5542 -1211 -9684 -7747 1717 6615 3414 2211 6952 5127 1962 -3910 -9688 -4839
5174 -4839 2916 5891 2258 -5017 -1393 7754 3061 -4913 -9380 -8148 -7837 -7396 -6882 -3533 -6015 -7761
5158 -7761 -10232 -8490 -4578 -6994 -1295 -1085 -1212 -4112 -3164 -1789 -4488 -9514 -9643 -4056 -1742 -3290
5142c290k298p238q79k949L81P311N452p96j066k500J0036N569j216L958l205
5127G270l06Q87J057L860J196l842p525p283n839k287P222k616j866O839K314
5112i19M857L831K42q957r670m730M062N518L522J742K112o955o759k683M050
5097a0737J6281N196k091K938L432l201o16p837m286l867J1243j961k823j215
5083D56j725M209m295L825N869o348O918J809J726j897k089m979J830J103o248
5068A64k306J279O443k170j765L552K892m903m020k346k62P48M992l133k767K030
5052a572k563j075k282K758j002n162j055L672L536L601K052k598L892R016M143
5037A5361q60P16J643q235o749o788P39P958O336n911l004J508j877o347K29K445
$$ plain form
5142 -3290 -5588 -12826 -13705 -16654 -16273 -8962 -3510 -4306 -5372 -7872 2164 7733 6517 10475 7270
5127 7270 6964 7851 8908 12768 13964 10122 2597 -4686 -10525 -12812 -5590 -8206 -10072 -3233 -919
5112 -919 3938 7769 8011 -946 -10616 -15346 -11284 -5766 -2244 -502 1610 -5345 -12104 -14787 -10737
5097 -10737 5544 10740 8649 11587 15019 11818 11202 3365 -921 -4788 6455 4494 1671 456
5083 456 -1269 2940 -1355 2470 8339 1991 8909 10718 12444 10547 8458 3479 5309 6412 164
5068 164 -2142 -863 5580 3410 1645 5197 8089 3186 -834 -3180 -3442 -2694 2298 -835 -3602 -1572
5052 -1572 -4135 -5210 -7492 -4734 -5736 -10898 -11953 -8281 -4745 -1144 908 -1690 2202 11218 15361
5037 15361 14501 15217 16860 8625 1876 -4912 -4173 3785 10121 4210 1206 2714 837 -5510 -5281 -2836
5021b836K041j599n267l025M432M255m587M485l242l41j191K805R290M762j2254
5006b272j1377R38K307L52j926l877K351Q703O336K118n719l023m647j578m289
4991a5603J288K733N507N641j052M308k464K24k68m681K346L969K082l850l496
4976c316Q62l805l472n591N028J35O549J4323J004j0039o680l906o50O52p894
4961a6800R77M382Q878R06l750O723R165j35n703l103K386K862l887N103J140
4946I144l338N62K858j163m197Q97L135j960n21q56m313m821q29n498m770p5R9
4929a5646J023N721L962K201O017N119J900m857k811r2p445O96K709J707j902
4914a698k598j754n67R341N719Q728J461l025r900Q1j233M31N535l776p305J147
$$ plain form
5021 -2836 -795 -2394 -7661 -10686 -6254 -1999 -6586 -2101 -5343 -5684 -6875 -4070 5220 9982 -2272
5006 -2272 -13649 -12711 -10404 -10052 -11978 -15855 -13504 -4801 1535 3653 -2066 -5089 -9736 -11314 -15603
4991 -15603 -14315 -11582 -6075 -434 -1486 2822 358 582 314 -4367 -2021 1948 4030 180 -3316
4976 -3316 -2454 -6259 -9731 -15322 -10294 -10159 -3610 10713 11717 1678 -5002 -8908 -9558 -8906 -16800
4961 -16800 -15823 -11441 -2563 -1657 -5407 1316 10481 10346 4643 1540 3926 6788 2901 8004 9144
4946 9144 5806 6368 9226 8063 3866 4763 7898 5938 5417 4561 248 -4573 -5402 -10900 -15670 -15745 -15646
4929 -15646 -14623 -8902 -4940 -2739 3278 8397 10297 5440 2629 2537 -4908 -4212 -1503 204 -1698
4914 -1698 -4296 -6050 -6617 2724 8443 17171 18632 15607 5707 5788 4555 4986 10521 6745 -560 587
4898E87o477n101M158O439K89n506L060L197Q012k271o855J14q10M550N262K073
4882A0721n290m892K475K123K893o59m523k491m88J1288L160j638l474r314p947
4867h056K814Q84M947k109j884l354N878j98m717L346N557r7J833l624k985N755
4851C990L772m556m070j595j121M220M769q05j738n459j800Q68L102M12m923P96
4835d138M985m02l722J262m465j8P283N441M011o392j601l161P220P739k939l336
4819G767p243O932j070l200j188r53q049j180n039N142K370J2577J411m325L276
4804G228k627q504o488L023J2312k652o705j611J160R469l524O23o669n731L873
$$ plain form
4898 587 -5890 -10991 -6833 -394 -105 -5611 -2551 646 8658 6387 -468 -354 -1164 3386 8648 10721
4882 10721 5431 539 3014 5137 8030 7371 2848 357 -131 11157 14317 12679 9205 -109 -8056
4867 -8056 -5242 -4358 589 -1520 -3404 -6758 -880 -1078 -5795 -2449 3108 3011 4844 1220 -1765 3990
4851 3990 7762 3206 -864 -2459 -3580 640 5409 4604 2866 -2593 -4393 -3525 -423 -11 -4934 -4138
4835 -4138 847 445 -3277 -2015 -6480 -6498 785 6226 10237 3845 2244 -917 6303 14042 11103 7767
4819 7767 524 7456 6386 3186 1998 1045 -7004 -8184 -13223 -8081 -5711 6866 8277 3952 7228
4804 7228 4601 -3903 -10391 -7368 4944 2292 -4413 -6024 -4864 4605 1081 1704 -4965 -10696 -6823
$$ [...]
##END NTUPLES=NMR SPECTRUM
##END=
