##TITLE=Analysis number 327793
Compound Code btb 12548
Book Reference 238930
Project Code adrs flro3
Chemist Name jom
##JCAMPDX= 6.0         $$ Bruker NMR JCAMP-DX V2.0
##DATA TYPE= NMR SPECTRUM
##DATA CLASS= NTUPLES
##ORIGIN= Bruker BioSpin GmbH
##OWNER= nmr
$$ XWIN-NMR		Version 3.5
$$ Tue Apr 10 10:23:13 2007 GMT Daylight Time (UT+1h)  MAYBRIDGE\nmr@NMR_250MHZ
##.OBSERVE FREQUENCY= 250.131544655141
##.OBSERVE NUCLEUS= ^1H
##.ACQUISITION MODE= SIMULTANEOUS (DQD)
##.ACQUISITION SCHEME= undefined
##.AVERAGES= 16
##.DIGITISER RES= 18
##SPECTROMETER/DATA SYSTEM= dpx250
##.PULSE SEQUENCE= zg30
##.SOLVENT NAME= DMSO
##.SHIFT REFERENCE= (INTERNAL, DMSO, 0, 16.522)
##AUDIT TRAIL= $$ (NUMBER, WHEN, WHO, WHERE, WHAT)
$$ ##TITLE= Audit trail, XWIN-NMR		Version 3.5
$$ ##JCAMPDX= 5.01
$$ ##ORIGIN= Bruker BioSpin GmbH
$$ ##OWNER= nmr
$$ C:\u/data/dgb/nmr/ADRS/760/pdata/1/auditp.txt
$$ ##AUDIT TRAIL=  $$ (NUMBER, WHEN, WHO, WHERE, WHAT)
(   1,<2007-04-10 10:22:49.59 +100>,<MAYBRIDGE\nmr>,<NMR_250MHZ>,
      <created by zg, POWCHK disabled, PULCHK disabled
       configuration hash MD5:
       49 4B E0 1D 92 C2 6B 37 9F E6 65 BC 52 41 86 1D
       data hash MD5: 64K
       BC A6 DA A9 F3 83 B7 82 1B 63 9C B2 7A 1F F8 E0>)
(   2,<2007-04-10 10:23:03.31 +100>,<MAYBRIDGE\nmr>,<NMR_250MHZ>,
      <Start of raw data processing
       ef LB = 0.3 FT_mod = 6 PKNL = 1 SI = 32K 
       data hash MD5: 32K
       57 43 DB 84 5A B9 63 FD E0 42 F5 4B 07 11 21 5E>)
(   3,<2007-04-10 10:23:05.23 +100>,<MAYBRIDGE\nmr>,<NMR_250MHZ>,
      <apk 
       data hash MD5: 32K
       4C DA AC B1 E4 F6 67 F7 E3 C4 A3 71 56 11 45 DC>)
(   4,<2007-04-10 10:23:06.10 +100>,<MAYBRIDGE\nmr>,<NMR_250MHZ>,
      <abs ABSG = 5 
       data hash MD5: 32K
       8E 95 C0 28 0B 14 8D 75 01 71 B2 B8 61 64 95 9F>)
$$ ##END=
$$ 
$$ hash MD5
$$ 88 38 A8 8F 16 3E EB 18 35 BD 92 48 4E C7 E9 31
##$RELAX= 
##$RELAX= 
##$RELAX= 
##$RELAX= 
##$RELAX= 
##$RELAX= 
##$RELAX= 
$$ Bruker specific parameters
$$ --------------------------
##$DU= <C:\u>
##$EXPNO= 760
##$NAME= <ADRS>
##$PROCNO= 1
##$TYPE= <nmr>
##$USER= <dgb>
##$AMP= (0..31)
100 100 100 100 100 100 100 100 100 100 100 100 100 100 100 100 100 100 
100 100 100 100 100 100 100 100 100 100 100 100 100 100 
##$AQSEQ= 0
##$AQ_mod= 3
##$AUNM= <au_zg>
##$AUTOPOS= <13 >
##$BF1= 250.13
##$BF2= 250.13
##$BF3= 250.13
##$BF4= 250.13
##$BF5= 500.13
##$BF6= 500.13
##$BF7= 500.13
##$BF8= 500.13
##$BYTORDA= 1
##$CFDGTYP= 0
##$CFRGTYP= 5
##$CHEMSTR= <none>
##$CNST= (0..31)
1 1 145 1 1 1 1 1 1 1 1 1 1 1 1 1 1 1 1 1 1 1 1 1 1 1 1 1 1 1 1 1 
##$CPDPRG= <>
##$CPDPRG1= <>
##$CPDPRG2= <>
##$CPDPRG3= <>
##$CPDPRG4= <mlev>
##$CPDPRG5= <mlev>
##$CPDPRG6= <mlev>
##$CPDPRG7= <mlev>
##$CPDPRG8= <mlev>
##$CPDPRGB= <>
##$CPDPRGT= <>
##$D= (0..31)
0 1 0 0 0 0 0 0 0 0.06 0 0 0 0 0 0 0.0002 0 0 0 0 0 0 0 0 0 0 0 0 0 0 
0 
##$DATE= 1176196968
##$DBL= (0..7)
120 120 120 120 120 120 120 120 
##$DBP= (0..7)
150 150 150 150 150 150 150 150 
##$DBP07= 0
##$DBPNAM0= <>
##$DBPNAM1= <>
$$ [...]
##$SUBNAM7= <"">
##$SUBNAM8= <"">
##$SUBNAM9= <"">
##$SW= 20.6930455092707
##$SWIBOX= (0..15)
0 0 3 0 0 0 0 0 0 0 0 0 0 0 0 0 
##$SW_h= 5175.983436853
##$TD= 65536
##$TD0= 1
##$TE= 683.16
##$TE2= 300
##$TE3= 300
##$TEG= 300
##$TL= (0..7)
0 120 120 120 120 120 120 120 
##$TP= (0..7)
150 150 150 150 150 150 150 150 
##$TP07= 0
##$TPNAME0= <>
##$TPNAME1= <>
##$TPNAME2= <>
##$TPNAME3= <>
##$TPNAME4= <>
##$TPNAME5= <>
##$TPNAME6= <>
##$TPNAME7= <>
##$TPOAL= (0..7)
0.5 0.5 0.5 0.5 0.5 0.5 0.5 0.5 
##$TPOFFS= (0..7)
0 0 0 0 0 0 0 0 
##$TUNHIN= 0
##$TUNHOUT= 0
##$TUNXOUT= 0
##$USERA1= <user>
##$USERA2= <user>
##$USERA3= <user>
##$USERA4= <user>
##$USERA5= <user>
##$V9= 5
##$VALIST= <valist>
##$VCLIST= <CCCCCCCCCCCCCCC>
##$VD= 0
##$VDLIST= <DDDDDDDDDDDDDDD>
##$VPLIST= <PPPPPPPPPPPPPPP>
##$VTLIST= <TTTTTTTTTTTTTTT>
##$WBST= 1024
##$WBSW= 4
##$XGAIN= (0..3)
0 0 0 0 
##$XL= 0
##$YL= 0
##$YMAX_a= 141644
##$YMIN_a= -182844
##$ZGOPTNS= <>
##$ZL1= 120
##$ZL2= 120
##$ZL3= 120
##$ZL4= 120
##$ABSF1= 16.522
##$ABSF2= -4.171173
##$ABSG= 5
##$ABSL= 3
##$ALPHA= 0
##$AQORDER= 0
##$ASSFAC= 0
##$ASSFACI= 0
##$ASSFACX= 0
##$ASSWID= 0
##$AUNMP= <proc_1d>
##$AZFE= 0.1
##$AZFW= 0.1
##$BCFW= 0
##$BC_mod= 0
##$BYTORDP= 0
##$COROFFS= 0
##$CY= 12.5
##$DATMOD= 1
##$DC= 0
##$DFILT= <>
##$DTYPP= 0
##$F1P= 14.0000005364418
##$F2P= -0.99999901652339
##$FCOR= 0.5
##$FTSIZE= 32768
##$FT_mod= 6
##$GAMMA= 0
##$GB= 0
##$INTBC= 1
##$INTSCL= 1
##$ISEN= 128
##$LB= 0.3
##$LEV0= 0
##$LPBIN= 0
##$MAXI= 10000
##$MC2= 0
##$MEAN= 0
##$ME_mod= 0
##$MI= 0
##$NCOEF= 0
##$NC_proc= -6
##$NLEV= 6
##$NOISF1= 0
##$NOISF2= 0
##$NSP= 0
##$NTH_PI= 0
##$NZP= 0
##$OFFSET= 16.522
##$PC= 1
##$PHC0= 205.9458
##$PHC1= 45.21796
##$PH_mod= 1
##$PKNL= yes
##$PPARMOD= 0
##$PSCAL= 4
##$PSIGN= 0
##$REVERSE= no
##$SF= 250.13
##$SI= 32768
##$SIGF1= 0
##$SIGF2= 0
##$SINO= 400
##$SIOLD= 32768
##$SREGLST= <1H.DMSO>
##$SSB= 0
##$STSI= 32768
##$STSR= 0
##$SW_p= 5175.98343685301
##$SYMM= 0
##$S_DEV= 0
##$TDeff= 65536
##$TDoff= 0
##$TI= <Analysis number 999999
Compound Code 99
Book Reference 9
Project Code 9>
##$TILT= no
##$TM1= 0
##$TM2= 0
##$TOPLEV= 0
##$USERP1= <user>
##$USERP2= <user>
##$USERP3= <user>
##$USERP4= <user>
##$USERP5= <user>
##$WDW= 1
##$XDIM= 32768
##$YMAX_p= 559129795
##$YMIN_p= -11127940
$$ End of Bruker specific parameters
$$ ---------------------------------
##NTUPLES= NMR SPECTRUM
##VAR_NAME=  FREQUENCY,     SPECTRUM/REAL,   SPECTRUM/IMAG
##SYMBOL=    X,             R,               I
##VAR_TYPE=  INDEPENDENT,   DEPENDENT,       DEPENDENT
##VAR_FORM=  AFFN,          ASDF,            ASDF
##VAR_DIM=   32768,         32768,           32768
##UNITS=     HZ,            ARBITRARY UNITS, ARBITRARY UNITS
##FACTOR=    0.157963299565203, 1,           1
##FIRST=     4132.6476996994, 0,             0
##LAST=      -1043.33573715361, 0,           0
##MIN=       -1043.33573715361, -11127940,   0
##MAX=       4132.6476996994, 559129795,     0
$$ Real data points
##PAGE= N=1
##DATA TABLE= (X++(R..R)), XYDATA
$$ [...]
15466a00827n92364l00432j3455l81802L70798J35016K83238L40372L67212p031
15456A00725K88034K68519m16854m80203j92123K98207N05351K72083M4914r9546
15446E89107O1093m2881j94343j33260q3091n41953j24963K64808J72010j54387
15436a87860J22992J4006o2376K17075J4963r0621o613k31188K34535j8756m77382
15425d71225K68931P9917q7214n1154L56984J0664m15477k63166K2453J11914
15415d37373K91226J58444r1654J4408P0002J81397j85370k28489J59079k22657
15405b90987o2999K13098J72103K44168j42136l02004J20934O5030K9501p7578
15395c0870l01045j42911L71460K29577n3222J31351k20368j84978q3576L142
$$ plain form
15466 -100827 -693191 -993623 -1007078 -1388880 -1018082 -883066 -599828 -259456 107756 100725
15456 100725 388759 657278 240424 -239779 -431902 -133695 371656 643739 688653 589107
15446 589107 650200 607319 412976 279716 196625 -345328 -470291 -205483 -33473 -187860
15436 -187860 -64868 -50862 -113238 103837 118800 28179 21566 -209622 24913 6157 -471225
15425 -471225 -202294 -122377 -209591 -260745 96239 106903 -308574 -571740 -549287 -437373
15415 -437373 -146147 12297 -79357 -64949 5053 186450 1080 -227409 -68330 -290987
15405 -290987 -353986 -140888 31215 275383 133247 -168757 -47823 17207 46708 -30870
15395 -30870 -331915 -474826 -103366 126211 72989 204340 -16028 -201006 -284582 -281440
15385b81440O9248j40366m2150L3326J39594J24675j87751q1953J97863o9600
15375b38554j38966j84606K64020L36805k73403J97636M271l30356j73927K14306
15365c22774J59830q1876j9966J48689Q4160M411k12778r897N5866N4369L1424
15354a08542j92825n2664K6811n1309K29607j54288m50033K22649K95655M7726
15344a87213R7866J93211K06945K7467j03231q2786K30166K04135k17686l48833
15334B0041J93416L64684q5402j61647l82673k0490M0489P1458j14926J20847
15324D5797k04321l44298K06720L74854J87015M2787j10491m05363k26463K03716
15314b30047L74799K48568k22964j01071j8028O1024k08096J16044L36446L04541
$$ plain form
15385 -281440 -212192 -352558 -394708 -361382 -221788 -97113 -284864 -366817 -168954 -238554
15375 -238554 -377520 -562126 -298106 38699 -234704 -37068 -32797 -363153 -537080 -322774
15365 -322774 -162944 -244820 -264786 -116097 -31937 -27526 -240304 -250201 -194335 -139966 -108542
15354 -108542 -301367 -354031 -327220 -378529 -148922 -303210 -753243 -530594 -234939 -187213
15344 -187213 -89347 103864 310809 338276 235045 152259 382425 586560 368874 20041
15334 20041 213457 578141 492739 331092 -51581 -72071 -31582 39876 -75050 45797
15324 45797 -158524 -502822 -296102 78752 265767 308554 198063 -207300 -433763 -230047
15314 -230047 144752 393320 170356 69285 51257 112281 -95815 20229 356675 661216
15304F61216k38586n51627j12841L4318J34171j18591m19480J00455K32606J85124
15294i3235J78619j92657j4798J05061k0933m90545k83590J11004K96950l77697
15284g81821N0721L92245K13494J67799j53952k82578k66037N0999L31599M1846
15274b35685p4791L54645J72577k37035p4538P8694l05805O2678J94675K14824
15264A50239M4352r358m85016l63152J84261N4286n5559J87029L5726J94611M4859
15253a7722j82139m06656j32184L55247L08787K16199J6123k3403o5938R09Q7834
15242A57057m8679l07237o2301j83030j59833K0024l16219m3648K35292J67568
15232e41006K45034L83204K75152o2746n47354k13070J87149O5010j33978j09687
$$ plain form
15304 661216 422630 -128997 -241838 -207520 -73349 -191940 -611420 -510965 -278359 -93235
15294 -93235 85384 -107273 -122071 -17010 -37943 -528488 -812078 -701074 -404124 -781821
15284 -781821 -731100 -338855 -125361 42438 -111514 -394092 -660129 -609130 -277531 -235685
15274 -235685 -310476 44169 216746 -20289 -94827 -16133 -321938 -259260 -64585 150239
15264 150239 194591 185233 -299783 -662935 -478674 -424388 -479947 -292918 -257192 -62581 -17722
15253 -17722 -199861 -606517 -738701 -383454 -74667 141532 157655 134252 68314 69223 157057
15242 157057 108378 -198859 -261160 -444190 -604023 -583999 -900218 -943866 -708574 -541006
15232 -541006 -295972 87232 362384 299638 -247716 -460786 -273637 -208627 -342605 -452292
15222d52292N2769k5177J59168J86071J27259J57721O6184l00322m01329j47738
15212e77686J55009j39P8404j96962j39867l6195K41420N53816O20269j42445
15202E55624j87767j0446j33877J25344l0922P6799r5397k14944k86023k03513
15192d05122j48294J6326J61777L13118K162k40965K24178J44350K44383j00351
15182B11562N0598j28556K0060Q6339P4688j20171R3550l0740m8252P6470K03654
15171D89202l38589k21329k6066M5184j5205j52532n8762r2936J34490j18940
15161c55483j23807j30962K42235R8483K58020q9983j56634l7757j40621K96998
15151a39511O6333K0122p72Q371n4562J51264J94488O8913k69492p7763J2023
$$ plain form
15222 -452292 -399523 -424700 -265532 -79461 47798 205519 271703 -28619 -429948 -577686
15212 -577686 -422677 -422816 -344412 -541374 -681241 -717436 -476016 77800 698069 555624
15202 555624 367857 357411 223534 348878 317956 394755 299358 84414 -201609 -405122
15192 -405122 -553416 -537090 -375313 -62195 -60033 -300998 -76820 67530 311913 211562
15182 211562 262160 133604 153664 240003 314691 194520 288070 257330 209078 285548 489202
15171 489202 150613 -70716 -96782 -51598 -66803 -219335 -278097 -371033 -236543 -355483
15161 -355483 -479290 -610252 -368017 -269534 -11514 -101497 -258131 -295888 -436509 -139511
15151 -139511 -73178 -53056 -53828 -45457 -100019 51245 245733 314646 45154 -32609 -20586
15140b0586l75543p2121J63645o8179K3623J03710j32485K0672N3658n606k50039
15129e59251P6171K18905J49508N8051K18077J95620k49706K03142Q6904M54N9251
15118D57126j58663j25176j86999j37324J70727R0658m4685m92863o5452N68429
15108G5778L04340m7486j16254k71582j50831K64647L13866l1781J1003J15499
15098D67199P1097n3468m18057j20569P6895j1432K80450R8786R357O9047k92549
15087A76756o2196q1627k16973j57693j09793j35414m1701M83788J30925O422
15077g506k24030j89612j29200K14988N90632j5718L6261J94367J72919K78757
15067I21858k98235k68143n5545n4271j3337k41890j85043J39109J04797N6267
$$ plain form
15140 -20586 -396129 -468250 -304605 -372784 -349161 -245451 -377936 -357264 -303606 -309212 -559251
15129 -559251 -483080 -264175 -114667 -56616 161461 357081 107375 310517 397421 397875 457126
15118 457126 298463 173287 -13712 -151036 19691 110349 65664 -427199 -492651 75778
15108 75778 380118 332632 216378 -55204 -206035 58612 372478 340697 351700 467199
15098 467199 538296 484828 66771 -53798 23097 11665 292115 390901 400258 469305 176756
15087 176756 114560 32933 -184040 -341733 -451526 -586940 -628641 -144853 -13928 -7506
15077 -7506 -231536 -421148 -550348 -335360 255272 239554 275815 470182 643101 921858
15067 921858 623623 355480 299935 245664 232327 -9563 -194606 -55497 49300 105567
15057A05567O1997Q3149J51733k5933l95599o9599L74843j00971j72627P5949
15047H8509k09149o1766J39704K98471M595k42502j5169L23019k90822m6951M1911
15036B9850m2708m5826L1648P9714m4737J0496K297l33921K4625J50353K49894
15025A11685j89702o11168l06846J36875M00380m0643J88018J67517q5931j67758
15015c97573L27077K26127k27813L1080j85612J0314J68046J98896K9367L64367
15005E44276O1707K1887k12207k12903j9368j18098L81033N24679k28421n00775
14995B41810j57531j96864M32N0364Q104l28753P5195P8488M7778M1145K31755
14984I1923n228N1983j14016j11849j15094l66343n4550K26294N16386J20087
$$ plain form
15057 105567 167564 250713 402446 376513 -19086 -88685 286158 185187 12560 88509
15047 88509 -120640 -182406 -42702 255769 260364 17862 2693 325712 34890 -12061 29850
15036 29850 -12858 -58684 -27036 52678 7941 18437 20734 -313187 -288562 -138209 111685
15025 111685 -78017 -689185 -996031 -859156 -458776 -499419 -311401 -143884 -229815 -397573
15015 -397573 -70496 155631 -72182 -41102 -226714 -216400 -48354 150542 179909 544276
15005 544276 605983 627870 415663 202760 183392 65294 446327 971006 742585 241810
14995 241810 84279 -112585 -112153 -61789 -53685 -382438 -307243 -228755 -180977 -139832 91923
14984 91923 86695 138678 24662 -87187 -202281 -568624 -623174 -396880 119506 239593
14974B39593j2330k68813q5807K38588m7856l4174L17595k21317m18014P2886
14964b19649j97450K24535J73646K5504l652J06251j41967k88262k39221J54727
14954d05538M8983L39770K48417j88444m69351k9632K43039J50036j97760l01527
14944e62007P799M70651K06663J2852Q4935p5551j42070L3252J71051L5160j08340
14933A34395k10444J31782J11244n9629O0266O286O0903m2485J5371l7944m10208
14922b40463l56415J96390K9791r9013L6727n1966J26466K80058L0437N5051R1180
14911I8243O1055m2822j96699k05143J5767k56432K69123L2187L65185K2969J25118
14900B88551Q0142o6485L26447K17717j73973j52517l60748k63527j92707J51785
$$ plain form
14974 239593 227263 -41550 -127357 111231 63375 29201 346796 125479 -292535 -219649
14964 -219649 -417099 -192564 -18918 6586 2934 109185 -32782 -321044 -560265 -405538
14954 -405538 -356555 -16785 231632 43188 -426163 -455795 -212756 -62720 -260480 -562007
14944 -562007 -554208 -83557 123106 135958 220893 145342 3272 36524 207575 242735 134395
14933 134395 -76049 55733 166977 107348 167614 173900 234803 192318 207689 169745 -240463
14922 -240463 -596878 -400488 -370697 -469710 -432983 -484949 -358483 -78425 -47988 7063 98243
14911 98243 159298 116476 -80223 -285366 -269599 -526031 -256908 -224721 140464 163433 288551
14900 288551 368693 302208 628655 846372 672399 519882 159134 -104393 -297100 -145315
14890a45315j36689P0643p3447j70363K67413J44532j09975J78619J13297O4756
14880B03471k469J55638L0772k34933l94638l48902N5166J67199L1638J72942
14870a64116K82738J29225j6102J6685Q854m22558k58185R5000K98184K09943
14860A79668J64328K5616l9072j75258l0516K2062j28368k00634J29040m43532
14850d96666k8177K61974L07431J02883Q7504K2116j70123k16297j92423K32583
14840h9195L09395p8744L0176k83613J97198K12951L07930K37560p5979k46581
14830E21098j82229P1099k10325N8967J71170o3155m3906M4169N2447k60697m14748
14819b56110r5838J14680j01128n3592q8302l06146j61725K63821J94900K99223
$$ plain form
14890 -145315 -282004 -211361 -284808 -455171 -187758 -43226 -153201 25418 138715 203471
14880 203471 201002 356640 387412 152479 -242159 -591061 -535895 -368696 -337058 -164116
14870 -164116 118622 247847 231745 248430 257284 -165274 -423459 -328459 -30275 179668
14860 179668 343996 369612 330540 155282 124766 146828 18460 -182174 -53134 -496666
14850 -496666 -524843 -262869 44562 147445 234949 257065 86942 -129355 -321778 -89195
14840 -89195 220200 141456 171632 -111981 85217 298168 606098 843658 767679 521098
14830 521098 338869 409968 199643 258610 429780 366625 322719 366888 419335 158638 -256110
14819 -256110 -351948 -237268 -338396 -391988 -480290 -786436 -948161 -684340 -489440 -190217
14809a90217j3661O8113O6793M3089O4438K15330k40598p4808m77196j75986J43566
14798e71137L1153N3354K38574n0916l5894K05772K8275K53908O0569K04723m6618
14787C71763K12960j15112j94794k03711N0814L09506k66529k4193k3806r7139
14777A9759Q5892K16852K0056m77410n1441Q103o460j59054L79307L09141o6994
14766B77751j42634l47865k9296J61961K28243j75823r107o623P408K53963J25215
14755C43193k41344J3240J38376M44561J27417m07796l42678K19158m4212j39625
14745A10290L66375Q7222j49297o6227o213k19866J9487j79356n7241N22404j01656
14734C25922J59575j42398j56973k91713K3315J40997J08515k9054q0016K3244
$$ plain form
14809 -190217 -203878 -135765 -68972 -25883 38555 253885 13287 -61521 -538717 -714703 -571137
14798 -571137 -539984 -486630 -248056 -298972 -334866 -129094 -100819 153089 213658 418381 371763
14787 371763 584723 469611 274817 71106 121920 431426 164897 140704 116898 19759
14777 19759 105651 322503 342559 -134851 -186292 -178189 -184649 -343703 35604 344745 277751
14766 277751 135117 -212748 -242044 -80083 148160 -27663 -36770 -43393 -35985 217978 343193
14755 343193 101849 115089 253465 698026 825443 417647 74969 294127 249915 110290
14745 110290 476665 563887 414590 348363 342150 122284 141771 -37585 -94826 427578 325922
14734 325922 485497 343099 186126 -105587 -82272 58725 167240 138186 58170 81414
14724H1414l8962K16338j1062q5185N9164J07880Q2407k34718J28682K7744l87062
14713e3360j16060L99733q9216j5049K62q0132O1663k41879Q3736M9938J67990
14702A67626j16667j45341J85256N8578l27369O2502K29606L33289J29983K4798
14692F02261l70882O2938k16950j70994l2330J09511n7524j87264r2360M65431
14682A11837J02482k64361r7057K585k16140J4750K73371J34576l23326K3842
14672b37441m2618J55283L06401m4240m3270Q9874k68877l62110K97035J28407
14662b1556p7463K40183k2347l23384q2430K57098R9735R9025J90943J73516j59087
14651C74233j18362j56152N7043l3566k76542k7735L32410M73252k1164l98001
$$ plain form
14724 81414 42452 258790 247728 162543 221707 329587 411994 177276 305958 333702 -53360
14713 -53360 -169420 230313 141097 126048 126310 46178 107841 -134038 -50302 -364 167626
14702 167626 50959 -94382 90874 149452 -177917 -115415 114191 447480 577463 602261
14692 602261 231379 294317 77367 -93627 -125957 -16446 -73970 -261234 -353594 111837
14682 111837 214319 -50042 -147099 -144514 -360654 -345904 -72533 62043 -261283 -237441
14672 -237441 -280059 -124776 181625 137385 94115 183989 -84888 -446998 -149963 -21556
14662 -21556 -99019 141164 118817 -204567 -286997 -29899 69836 168861 359804 533320 374233
14651 374233 255871 99719 156762 123196 -153346 -181081 151329 624581 603417 205416
14641B05416M4008q8246j63890K84087P4691k23900K11964L38533K00038m71375
14631D11326m16626K08401j58186l66424o0615K55897L46186j41921k07898j77221
14621c07081J32293J29967O6083J17052N8662J16147k28332m38204k55090K01724
14611d06779J15859m5321o7075M35156K70322j54095k28311r09Q7852J86683K35372
14600D28754J04917k98714j69184K5578m2779K7372o1786p8982J48450M6198k47745
14589a17921J37861L37910K32846K12001k3330k31912o5833M300k67808L0772
14579B48886k69632n7264K00237j94678j66881J00270K24150m6532j37932m37261
14569e36637m4841L36750K69220k66106o4859L07141J70381n1117K69487L12263
$$ plain form
14641 205416 249424 161178 -2712 281375 356066 132166 344130 682663 882701 411326
14631 411326 -5300 203101 44915 -321509 -382124 -126227 219959 78038 -129860 -307081
14621 -307081 -174788 -44821 21262 138314 196976 313123 84791 -353413 -608503 -406779
14611 -406779 -290920 -336241 -403316 31840 302162 148067 -80244 -81153 6699 193382 428754
14600 428754 533671 234957 65773 91351 48572 75944 14158 -64824 83626 129824 -117921
14589 -117921 19940 357850 590696 802697 779367 547455 481622 485922 218114 248886
14579 248886 -20746 -78010 122227 -72451 -239332 -139062 85088 38556 -99376 -536637
14569 -536637 -581478 -244728 24492 -241614 -306473 668 171049 119932 389419 701682
14559G01682r6991o0862m12913m94023p8291J17311K54397M41630J3446K22834
14549F08220o0575j46860J79046M4346j52810J64810k17191k56035j70072k06069
14539b13190J23591P7954m4021l9547l357q0278J54609l1142K85527n3648j03574
14528G2924Q9665k62489q7624L69452K90873K20100r3804k63172K3864p4038j03589
14517A82162J61451K49504j65943m04836m2646p4218j78451l7450L16703O2547
14507F8823o1687J76901J09236K03801r9193m71525k20624m3513j36105L1930
14497d41956l4520K57897J96064m7427K62496O6907K57116N3110n35536m70600
14487d36449J6036j01429m849K99221L72925k5171j01772J18618j52031k08334
$$ plain form
14559 701682 604691 543829 130916 -363107 -441398 -324087 -69690 371940 385386 608220
14549 608220 547645 400785 579831 624177 471367 636177 418986 162951 -7121 -213190
14539 -213190 -89599 -11645 -55666 -95213 -98570 -178848 -24239 -55381 230146 176498 72924
14528 72924 162589 -99900 -187524 181928 472801 692901 599097 335925 359789 285751 182162
14517 182162 343613 593117 427174 22338 -20308 -94526 -272977 -310427 6276 68823
14507 68823 7136 184037 293273 497074 397881 -73644 -294268 -337781 -473886 -441956
14497 -441956 -476476 -218579 -22515 -69942 192554 259461 516577 569687 34151 -436449
14487 -436449 -420413 -521842 -526691 -227470 145455 120284 18512 137130 -14901 -223235
14477b23235K49208P2042j25754l3519O6261L31866j01083m41673j38029J75940
14467a67976L40806L01367k74302j79359l08672k03759p7872o1705k8213Q0807
14457e78878M83966L77673r3513l04338j33264K0431K5855o1670l8835J20924
14447a81649K22440j22681l298O1251r77j84771j4368m8409n5941J69680k2589
14436a81312J45945L8337j61752J75762j5843J24285J34525j41889p0293k44207
14426a96442j37296K01941R087k14137J77894Q8409J42128R9908o8508l92239
14416b89255M445M18395M88691M8933Q2254j08278r1341l43682n016m8256k07893
14405e1003n6585J15048l33347J40445J18895n7815R079j79207j33223J86723
$$ plain form
14477 -223235 25973 98015 -27739 -61258 5003 336869 235786 -205887 -343916 -167976
14467 -167976 172830 474197 199895 20536 -288136 -491895 -569767 -631472 -659685 -578878
14457 -578878 -94912 282761 189248 -115090 -248354 -227923 -202068 -263738 -302573 -181649
14447 -181649 40791 -81890 -85188 -23937 -24914 -209685 -224053 -272462 -328403 -158723 -181312
14436 -181312 -35367 2970 -158782 16980 1137 125422 259947 118058 47765 -196442
14426 -196442 -333738 -131797 -122710 -336847 -158953 -70544 71584 171492 102984 -289255
14416 -289255 -284810 133585 622276 671209 753463 645185 553844 210162 205146 156890 -51003
14405 -51003 -107588 7460 -325887 -185442 -66547 -124362 -115283 -294490 -427713 -240990
14395b40990J94385k0788M0992q8875j18890k804N1821m1553l8906K5419L3257
14384b06932K88611P9759n4707j20012l2853k66059k5737r1472K6739J92876J20681
14373h9106j90469O6168J09086j8020P0358J42053r630j86819M410N2981L35395
14362B86407J26107K992j46329j03573Q50J13416j83360j10816J25347L64635
14352D75676J52901M0007Q4415L0651l69234j09834k38283r5852J28918M44899
14342E44264j7325J8640j72088l96584m00893L66064K85683k3716J38524O2411
14332D04980l19040k04807n9766K23401O7289J76217k32673k84407j58481R6108
14322b91179J85848K67251j22482K16435n2193l7638J10616l86490j29034M39445
$$ plain form
14395 -240990 -46605 -67393 -26401 -115276 -234166 -236970 -185149 -226702 -265608 -240189 -206932
14384 -206932 81679 161438 106731 -13281 -46134 -312193 -337930 -429402 -402663 -209787 -89106
14373 -89106 -279575 -213407 -104321 -122341 -51983 90070 80440 -106379 -101969 -48988 286407
14362 286407 412514 415506 269177 165604 166454 279870 96510 -14306 111041 475676
14352 475676 628577 668584 752999 783650 414416 304582 66299 -29553 99365 544264
14342 544264 526939 545579 373491 -23093 -423986 -57922 227761 204045 342569 404980
14332 404980 85940 -118867 -178633 44768 112057 288274 55601 -228806 -387287 -291179
14322 -291179 -105331 161920 39438 255873 203680 166042 276658 -109832 -238866 200579
14312B00579r610j70095j83280L30118L2301L3097j56480o6682l0186K21659L31420
14301E32841k09061k82261J82349J13041J88183J26208j89877j59014k09525q2835
14291A0049J96235K41719M1944j06163j31195L56187J26602q70774l83624M89613
14281b9407J09452L599k91045j94679K157K81135O0531J96303J49010k76164r9551
14270h8659l74220m6435J76156L22538L01442R0036P072P9900j65920J86671K62185
14259G50766j22367k57963j23953m10135j22213L22443K43156K35964j72779M6491
14249C89410N0076j18109k75896m12235j20545L98264K49664O8118j53073k3856
14239E1818j82484j55257k06838K4329J56227K92107K42088Q0351j4565j03784
$$ plain form
14312 200579 190969 20874 -162406 167712 200013 233110 76630 9948 -20238 201421 532841
14301 532841 323780 41519 223868 336909 525092 651300 461423 302409 92884 10049
14291 10049 206284 448003 489947 383784 252589 608776 735378 -135396 -519020 -29407
14281 -29407 80045 83644 -207401 -402080 -399923 -118788 -58257 138046 287056 10892 -88659
14270 -88659 -462879 -509314 -333158 -10620 290822 380858 387930 467830 301910 488581 750766
14259 750766 628399 370436 246483 -163652 -285865 36578 279734 515698 342919 389410
14249 389410 439486 321377 45481 -366754 -487299 -89035 160629 228747 75674 51818
14239 51818 -130666 -285923 -492761 -468432 -312205 -20098 221990 302341 287776 183992
14229A83992j9629j08629j30634l1643k16972J07587L38100P7106J59614j72217
14219A86675j08660J32294l9659l16185q4220j04246k795J04152J98871q1231
14209a15004N7094J17783K19226j16221l88645o320M32617j23613r5509J73008
14199A54416J1035L97627k46677l36403k61942L97746N66947J42879k00174j09046
14189E16408J87960k08057j97446J07913j38911k39398L12253L9625Q275p0893
14179C17729o8401J5577j82578N8772l6688K55965K01203j7475l08014n352K16866
14168D47604L21458n0332m02619j60451R7207j28444K7217j62345J01021r0937
14158f21R680J73275j49685k48528L47829J0232j68177k94085j68738K28813J06799
$$ plain form
14229 183992 164363 55734 -74900 -106543 -323515 -215928 122172 199278 358892 186675
14219 186675 78015 210309 170650 -145535 -229755 -334001 -336796 -232644 -33773 -115004
14209 -115004 -57910 59873 279099 162878 -225767 -232087 200530 76917 -18592 154416
14199 154416 165451 563078 316401 -20002 -281944 115802 682749 825628 625454 516408
14189 516408 704368 496311 298865 406778 267867 28469 340722 380347 388622 317729
14179 317729 249328 264905 82327 141099 104411 360376 561579 544104 236090 230738 447604
14168 447604 769062 718730 316111 155660 252867 124423 151640 -10705 90316 -621
14158 -621 9059 182334 32649 -215879 131950 142182 -25995 -320080 -488818 -260005 -153206
14147a53206K92815j42075k54725J39289J20542L95526j96337k7544J54502l9287
14137B89500j09173p0342L2935L38468K27375J08038k30503l1316J38749J60643
14127H54374Q260k35993j8435J21648l0841k08103k66523l32647J48957J14654
14117A55351L63300M34705K583l33883l69286P1700J67974j52493j75370j99518
14107c4937J15738j03648J32933k26670o3498j889J80585j15098k92324K81302
14097a27506R380R759Q3144J61035L85037K46024j2654j46886m33204K50642k92729
14086A32042o582k09211j5275J23003L87872Q1714r7833j25515J52252k01217
14076B21250k4949q3953K27491J13180m64911l90966K59391j51385k8147K19456
$$ plain form
14147 -153206 139609 -2466 -257191 -117902 2640 398166 201829 174285 328787 289500
14137 289500 180327 109985 142920 481388 708763 816801 586298 554982 693731 854374
14127 854374 862634 626641 608206 729854 699013 490910 224387 -108260 40697 155351
14117 155351 518651 953356 955939 622056 252770 324470 492444 339951 164581 -34937
14107 -34937 80801 -22847 110086 -116584 -180082 -181971 -1386 -116484 -408808 -127506
14097 -127506 -118126 -108367 -25223 135812 520849 766873 754219 607333 174129 424771 132042
14086 132042 125460 -83751 -99026 23977 411849 493563 395730 270215 422467 221250
14076 221250 196301 112348 339839 453019 -11892 -402858 -143467 -294852 -322999 -103543
14066a03543M96121L6169l23521m85157M004M18830M13795J72929J59045J72247
14056I60919p6898m04266j10003k33750p115M9564k54374j04024m1073L16584
14046I5564K36896L7765j29472R3354K6748k0751J12734m08550j29364j53436
14036b38512Q9910L97380J76735q3136J06274J71521J5112l11031N712O7281L008
14025D00254k74298j95774R25L41543K5514Q9094K49712j17260j6363K4802Q9549
14014F17698Q2771j14026K5043j94140j99774q5189j65697J81648L4442q4345
14004I8431m6119Q4706j76257k17161L83864m163J23157J2778K7439l3596m6624
13993B06455N09377J79653r9725m13531l48529L76338o272l60566k47278k3956
$$ plain form
14066 -103543 392578 428747 105226 -379931 -375927 42903 456698 629627 788672 960919
14056 960919 884021 479755 369752 136002 128887 178451 -75923 -179947 -221020 95564
14046 95564 332460 370225 240753 334107 360855 340104 452838 44288 -85076 -238512
14036 -238512 -148602 248778 425513 342377 448651 620172 635284 324253 329965 397246 400254
14025 400254 125956 -69818 -68893 272650 298164 387258 636970 519710 503347 528149 617698
14014 617698 700469 586443 611486 417346 217572 132383 -33314 148334 182776 98431
14004 98431 52312 137018 -39239 -256400 127464 123301 246458 259236 286675 253079 206455
13993 206455 715832 895485 795760 382229 33700 410038 403766 43200 -204078 -228034
13983b28034K83377L40773R8366j11078q5874k56791l23634R3944K6582J57626
13973d743Q0565J85895L99375K00006K03052j7687m32709n12960J6485M93584
13963F10863K14468L0062j31911m19163j22532Q6392o3916n6589Q8158J73843
13953D09675M1717j74203k2933J64007m6518k11615K09437k47079K31779L97215
13943G51482j49850n8086J86595N9908j46160j36508l9405k89255L12418K17554
13933G08693j75554J66829P4918K13329r7775m4842r9103o8314k29751l9038j82605
13922B26787m1978L46989M73113Q2105j77432j76699j24667J03542J57121j8210
13912H50671l82394l2963l0063m6938K16639J3915p8152k36100k05239J85207
$$ plain form
13983 -228034 55343 396116 494482 383404 297530 40739 -282895 -188951 -162369 -4743
13973 -4743 75822 261717 661092 861098 1064150 1046463 613754 100794 117279 610863
13963 610863 825331 855393 723482 304319 181787 268179 204263 147674 235832 409675
13953 409675 451392 277189 254256 418263 371745 160130 369567 122488 354267 751482
13943 751482 601632 543546 730141 790049 643889 507381 467976 178721 491139 708693
13933 708693 533139 699968 774886 988215 890440 845598 746495 678181 448430 409392 226787
13922 226787 184809 531798 1004911 1087016 909584 732885 608218 711760 868881 850671
13912 850671 468277 435314 405251 358313 574952 588867 510715 274615 69376 254583
13902B54583M12381J15675j69797k92446k68047j20215Q1338M5300n7277L1122
13892C2617L24636L75599J06081l94223k86462l17101j84314N43084K68934j89225
13882B79626j21960Q0653j62575K36889J24364J10416L7004K8089K3184J34568
13872G70258k17194k41559k19308k09931M9241K12528J44163J01351k0149j38902
13862B30498k8882J12430q0822K32808L48011k25242k16483L6102j3339n2922
13852C42159J29596N0995l86431l81973j2394J92569L19749M18554j58586j42240
13842C71998L5701J40000k1937l15302J11474K39244j79693l24708j4908K86066
13832C27935P1089k8145K59533m5341r4738l21714m4173L96818J26541L3039k90963
$$ plain form
13902 254583 666964 782639 612842 320396 52349 -67866 13472 58772 1495 32617
13892 32617 357253 732852 838933 444710 158248 -158853 -343167 199917 468851 279626
13882 279626 157666 238319 75744 312633 436997 547413 584417 612506 635690 770258
13872 770258 553064 311505 92197 -117734 -68493 144035 288198 389549 369400 230498
13862 230498 201616 314046 233224 466032 814043 588801 372318 408420 395081 342159
13852 342159 471755 522750 136319 -245654 -258048 -65479 254270 672824 514238 371998
13842 371998 407699 547699 525762 210460 321934 561178 381485 56777 41869 327935
13832 327935 399024 370879 630412 585071 490333 168619 124446 521264 647805 680844 389881
13821C89881k62203K05869J05475J0905J5251K3231J1241j29420j95932l28982
13811a54684K46602M03712l02512k39527j48237n0327K07277K82947M36063M55103
13801A136417k4708q2171j39638l34852k76312J36761m0494k04804K4313J24300
13791C18812J56115j02016J06004K69696L78639J77243o0614k42320j38898l85732
13781D76929J52188j58134o411J60969J23967j56198K47625q8030J401r0124K78474
13770I42656k16558k67642k16295q0882q7794r9691N10367K19770j04181M7349
13760F47099J95438j73228j50134n9109k39980o4347J18059P2375L3617J99515
13750E79305k82853j11357j03549l16128k3794J03660J70620K69128J73025M26176
$$ plain form
13821 389881 127678 333547 439022 449927 465178 488409 499650 370230 174298 -154684
13811 -154684 91918 495630 193118 -46409 -194646 -244973 -37696 245251 681314 1136417
13801 1136417 1111709 1029538 889900 555048 278736 415497 375003 170199 194512 318812
13791 318812 474927 372911 478915 748611 1127250 1304493 1243879 1001559 862661 476929
13781 476929 629117 470983 464572 625541 749508 593310 840935 752905 754306 664182 942656
13770 942656 726098 458456 242161 161279 73485 -26206 484161 703931 599750 647099
13760 647099 842537 669309 519175 460066 220086 155739 273798 346173 379790 579305
13750 579305 296452 185095 81546 -234582 -258376 -154716 15904 285032 458057 884233
13740H84233J02031j72427j5104p0975j21715N3646j29413q8275L35265q3013
13730F94253L4050j22988J04978J44752p3911k48804n04819j5935J06352J10853
13720B28781n3879L30712P6232k14528q787L27210P315l76916j64853J02283Q0797
13709C34367K7682R1674K33869Q933j23339J6386l43326k22222J92938M74245
13699F91207M11400k51959l67554p0090O2534K45167l2632k99462K0858J62320
13689E71789M17570Q3952m91193j89431K01849L26834k59567k88788P8832K10699
13679F62546P3232k41867k704N4932j9459K66551j033k2837J53778J44715L7869
13668A105723n1993l37097k77791j05755j82416l6206j12298l4891M91301K96781
$$ plain form
13740 884233 986264 813837 798733 727758 606043 659689 530276 442001 777266 694253
13730 694253 728303 605315 710293 855045 781134 532330 27511 11576 117928 228781
13720 228781 174902 505614 581846 367318 358531 685741 693056 316140 151287 253570 334367
13709 334367 362049 453723 687592 696525 573186 589572 246246 24024 216962 691207
13699 691207 1102607 850648 483094 413004 475538 720705 688073 388611 409469 571789
13689 571789 989359 1073311 582118 392687 594536 921370 661803 373015 451847 662546
13679 662546 735778 493911 491207 546139 526680 793231 792198 769361 923139 1067854 1105723
13668 1105723 1053730 716633 438842 333087 150671 114465 2167 -32724 458577 755358
13658G55358k80465K11127L02045k0897J7463Q5536J7503j36118l24560k93625
13648C33367k5268j08175L0455N17255M25646l03849r6061m80463O3654O12729
13638I69290N31881Q4188j31033n7697l54741k08541l55590J17795k05711k50705
13628A39136k32341j33560L9489K25233L23507J12230j79145O3942J34618J80623
13618F73732j89310j5981J52663J45222n53J42430K8140J17825J81504j74611
13608A061061l76288M0436M32823j0115j08384j11581j51332m19823K34621J50998
13598G42416m8666j48594j03623n0798j11443J3943J28439j29821k59960J70385
13588B02278l6195M94530J24147k59008o705P2103J90844R2378n4863J16632m37999
$$ plain form
13658 755358 474893 686020 988065 967168 984631 1070167 1087670 951552 626992 333367
13648 333367 308099 199924 230379 747634 1173280 869431 773370 292907 356561 969290
13638 969290 1501171 1585359 1454326 1396629 1041888 833347 477757 595552 389841 139136
13628 139136 -93205 -226765 -187276 37957 361464 473694 294549 358491 493109 673732
13618 673732 484422 468441 621104 766326 765773 908203 936343 1054168 1235672 1061061
13608 1061061 684773 725209 1158032 1147917 1039533 927952 776620 356797 591418 742416
13598 742416 693750 545156 441533 390735 279292 293235 421674 291853 31893 202278
13588 202278 166083 660613 784760 525752 519047 591150 781994 874372 819509 936141 498142
13577D98142m36976j36584j90221K08208K60998L18878L7053N5422J69029m50956
13567C32993O2044M28642P6384K1346j18975l03135J49075N6429j59549K9386
13557E74640J82599K25356j32140k07712q8736l6412m0832l4651K32171K72866
13547I47149k73783j68369J12007r9890R4933M34561q7134N3515j2021p9258n3176
13536H68534P6747l07652K32702J98928R885j86895j33578J75174k7550k14126
13526F92169O9730N9668N61025J85371m38484n26459m3712K55610J45895j3522
13516I47291k59513k25384m5195K57180L3464k29320j92563J51114K36873L77381
13506A051328o7165q4454n0285j96969J35929J36625l26393l5569O3149l69504
$$ plain form
13577 498142 61166 -75418 -265639 -57431 203567 522445 559498 614920 783949 332993
13567 332993 395037 823679 900063 921409 802434 499299 648374 704803 545254 574640
13557 574640 757239 982595 850455 642743 554007 517595 476763 442112 674283 947149
13547 947149 673366 504997 617004 517114 612047 1046608 959474 1012989 1000968 921710 868534
13536 868534 945281 637629 870331 1069259 1079144 892249 758671 933845 906295 692169
13526 692169 761899 821567 1382592 1567963 1129479 603020 559308 814918 960813 947291
13516 947291 687778 462394 417199 674379 707843 478523 285960 437074 673947 1051328
13506 1051328 984163 899709 849424 652455 788384 925009 598616 563047 626196 256692
13496B56692o9971M82269O285n8924l7498o3887j19979J29827J15847L13551J21757
13485A075969L17763L3139r9749k0567J77772K16140R6582k9216Q8628j32676
13475A723785j86659j95482K00053J11437j66840j17422j53284k12021j89320
13466H14247O1781j04011k23531l57918k29227q0726L25060n4430K41930J08225
13456E01400m3645L07259K69641k1774l59235m1294L98576o918q0915k62135j16407
13445E44553J62948J70766k10575J09176o6267k133q8147K53952R0370O9240O7811
13434A101694K5219l6500r0529k60131j32368L06804k92261k17004N11039L75866
13424A291829k40760k99740k3553J15248j92667J57389J25653K19529L13909k86276
$$ plain form
13496 256692 186721 668990 675275 616351 578853 514966 394987 524814 640661 954212 1075969
13485 1075969 1393732 1426871 1327122 1306555 1484327 1700467 1797049 1767833 1856461 1723785
13475 1723785 1537126 1341644 1541697 1653134 1486294 1368872 1215588 1003567 814247
13466 814247 876028 772017 548486 190568 -38659 -119385 205675 151245 393175 501400
13456 501400 457755 765014 1034655 1012881 653646 612352 1010928 1004010 923095 660960 544553
13445 544553 707501 878267 667692 776868 710601 708468 620321 874273 964643 1033883 1101694
13434 1101694 1126913 1090413 999884 739753 607385 914189 621928 404924 915963 1291829
13424 1291829 1051069 751329 727776 843024 650357 807746 933399 1152928 1466837 1180561
13414A180561k50977M9565M1643k51285k51531j35226J63222K99136M19679Q4075
13404A348862l8078J32554k23217q9576M1541q4556j16822K80984K8187o0070
13394A219809m48188j79786K19027K15285J34784k26794j61279K8189k28376J98256
13384G70927M44468K11043l69748k82990K27826m7180j31398J57963J02781J15316
13374A199008J84526q1384l10388O7619j68851k07964j96755K5792j28178M8939
13364D32364L44091J41924J95692j4317l08047r0782K36679J26752K89882q1308
13354A272930j84519l0569j85482m7920Q2789K0861K11560N6416m3237N4473J68440
13343A375742J94657k47404j27187j44405m86340J86918K87341K15672k69640
$$ plain form
13414 1180561 929584 979149 1020792 769507 517976 382750 545972 845108 1264787 1348862
13404 1348862 1310784 1443338 1220121 1130545 1172086 1087530 970708 1251692 1279879 1219809
13394 1219809 771621 591835 810862 1026147 1160931 934137 772858 801047 572671 770927
13384 770927 1215395 1426438 1056690 773700 1001526 954346 822948 980911 1083692 1199008
13374 1199008 1383534 1302150 991762 1059381 890530 682566 485811 511603 383425 432364
13364 432364 776455 918379 1114071 1099754 791707 700925 937604 1064356 1354238 1272930
13354 1272930 1088411 1057842 872360 824440 907229 928090 1139650 1196066 1152829 1207302 1375742
13343 1375742 1570399 1322995 1195808 1051403 565063 751981 1039322 1254994 985354
13334I85354M8835K65928O4816N3197l10251l08420l9008N00685r4732J15092
13324A281496n4301k59441l9910L6479J02298J40977o3384j33291J09284Q745
13314A128952J18735j9418n6103o9063j21785J37455n4405l23612n082R8046j71227
13303F62493J73950P404j03935K51691j13991j61717J79849k0820J18927M58098
13293A451949N5053J75515P272k04663O1375r1647o6371j7399j11774p2539q2627
13282A104144j25905J3030J63330j85398K07597j7983m29191j13910N46211J39692
13272A301617n4183j04144j74070l45229j74061R7518N3255M65352J87270j1198
13262A242127J34502K31147j75522j55406k92295M2548o6482K21392K8864n1348
$$ plain form
13334 985354 1034189 1300117 1364933 1418130 1107879 799459 760451 1261136 1166404 1281496
13324 1281496 1227195 967754 927844 964323 1066621 1207598 1144214 1010923 1120207 1128952
13314 1128952 1247687 1228269 1172166 1103103 981318 1118773 1064368 740756 735674 833720 662493
13303 662493 836443 843847 739912 991603 877612 715895 895744 874924 993851 1451949
13293 1451949 1507002 1682517 1689789 1485126 1546501 1454854 1388483 1371084 1259310 1186771 1104144
13282 1104144 978239 991269 1154599 969201 1176798 1158815 729624 615714 1161925 1301617
13272 1301617 1247434 1143290 969220 623991 449930 547448 600703 1066055 1253325 1242127
13262 1242127 1376629 1607776 1432254 1276848 984553 1027101 960619 1182011 1210875 1159527
13252A159527N6653j01493J72229Q1768p0729k63839l61720j98030J58842j26471
13242E06737r5675K61599K40838J86904J75888R4689k14542N8437K47251k7749
13232A434377q9479k85803Q4101L17946Q3995j46215K1131j93398j13639j80904
13222I32112K26091q215K45162J04508k48357j11026P0502J95777j97828q0742
13212A127984N8544Q8063l44787R2950p7287P8095j03358j13660j54722j08109
13202E43713M080L12373L73585j13377P3436m0497j36040J22895J7826L20903
13192A478897n2657L1952m0447j24862k23257k00954l94588o4180K50084J01023
13182G61011M14391J86097j93913k40150L9177L68826J73584M24838r7015j67241
$$ plain form
13252 1159527 1216180 1114687 1286916 1368684 1297955 1034116 672396 474366 633208 506737
13242 506737 411062 672661 913499 1100403 1276291 1370980 1156438 1214875 1462126 1434377
13232 1434377 1344898 1059095 1143196 1461142 1545137 1398922 1420053 1226655 1113016 932112
13222 932112 1158203 1149988 1395150 1499658 1251301 1140275 1210777 1406554 1208726 1127984
13212 1127984 1186528 1274591 929804 1022754 945467 1023562 920204 806544 651822 543713
13202 543713 547793 860166 1233751 1120374 1193810 1153313 1017273 1140168 1157994 1478897
13192 1478897 1426240 1458192 1417745 1292883 1069626 868672 474084 409904 659988 761011
13182 761011 1175402 1361499 1167586 927436 966613 1335439 1509023 1933861 1836846 1669605
13172A669605m2457m4078j04732l33027K70974l4394J50659p3549o378j21669
13162A330954k75618K32556j13132L2822K9724J43136k1346k08702j14070j82887
13152H53437l73056L93864O29086K71131J8639l94036k79653k96001j25548J94128
13142H91991N5123J42704J09620R1463j33244j63642l6579M54162K57253k80712
13132A388139k07225N106K9437K22715L3045M6685k36338k25129n4924K69295
13122A270806M73520L10026j75440m51011q1413J51802L0516K4312m36465j19603
13112I97050M59346K50765r5422j7938J01799k7573k97228P915k67316k53792
13102H57606K60388J90784j35228J25041L60312R3474J12825j13533k38693J04590
$$ plain form
13172 1669605 1627148 1583070 1478338 1145311 1416285 1381891 1532550 1459001 1452623 1330954
13162 1330954 1055336 1287892 1174760 1207582 1237306 1380442 1359096 1150394 1036324 853437
13152 853437 480381 874245 1503331 1774462 1793101 1399065 1119412 823411 697863 891991
13142 891991 947114 1089818 1199438 1290901 1157657 994015 957436 1411598 1668851 1388139
13132 1388139 1180914 1186020 1215457 1438172 1471217 1517902 1281564 1056435 1001511 1270806
13122 1270806 1744326 2054352 1878912 1427901 1346488 1498290 1528806 1553118 1116653 997050
13112 997050 1456396 1707161 1611739 1593801 1695600 1668027 1370799 1378714 1111398 857606
13102 857606 1117994 1308778 1173550 1298591 1658903 1752377 1865202 1751669 1512976 1617566
13092A617566L58745L7694k33022r5709l5102K3942k18127k88052n5249K68745
13082A381431K67476k7838k79492J29729K74198N6255L17568J73533l87293m67842
13072A437725j17427K92495M52810Q8044j56115r3305P0275K19439L8098j52326
13062B079713J63835j50092j33029k50888k97558J73201K85291K41476k54924
13053A857025n22951J80904J74947J66904O5014m2561P2402J2558q0017P123j07978
13042A783370o3056j0518k2382k79015k10397p5096L18225J07090r926r149Q2817
13031A611963R2063j6037R8329k94632k01745P3646M40321J2086R6819p6244j9506
13020A817063p1494k0483j11515J9645p9272k33302L8645M52674K1039l57377
$$ plain form
13092 1617566 1976311 2014005 1780983 1685274 1650172 1674114 1455987 1167935 1112686 1381431
13082 1381431 1648907 1621069 1341577 1471306 1745504 1801759 2119327 2292860 1905567 1437725
13072 1437725 1320298 1612793 2065603 2153647 1997532 1904227 1974502 2193941 2232039 2079713
13062 2079713 2243548 2093456 1960427 1709539 1411981 1585182 1870473 2111949 1857025
13053 1857025 1334074 1514978 1689925 1856829 1921843 1879282 1951684 1964242 1884225 1891348 1783370
13042 1783370 1720314 1709796 1687414 1408399 1198002 1122906 1441131 1548221 1538295 1529146 1611963
13031 1611963 1704026 1687989 1786318 1491686 1289941 1363587 1803908 1815994 1912813 1836569 1817063
13020 1817063 1745569 1725086 1613571 1633216 1553944 1320642 1359287 1811961 1833000 1475623
13010A475623l81854K13263L05517K02836K04052r4909j81736j42176n1161j54401
13000A395054K17829J63030j3561Q1199J60227J02908r7706K5719r1040K75473
12990B219132K21688j30972o39366q9753j32421J05366J62576P2505m3748K02667
12980A947674k31133m001L03612J04609o8564j7536j67822j43993K33974P7916
12970B034736L1901k11963J28210p779l06953j96769K32214L4665J53522N43296
12960B435080j44590k69669l70502K0546K950K70655J19868n9297j53234J03630
12950A955437J20001k04089m63557l96516o7759L28050M33762K32871k8210L02808
12940B212798J78549l97063Q2560K54414O8564o6114K5670k19869r5813j00253
$$ plain form
13010 1475623 1093769 1307032 1612549 1815385 2019437 1924528 1742792 1600616 1549455 1395054
13000 1395054 1612883 1775913 1762352 1843551 2003778 2106686 2008980 2034699 1943659 2219132
12990 2219132 2440820 2309848 1670482 1580729 1448308 1553674 1716250 1788755 1745007 1947674
12980 1947674 1716541 1712540 2016152 2120761 2052197 2034661 1866839 1722846 1956820 2034736
12970 2034736 2066637 1854674 1982884 1975105 1668152 1471383 1703597 1738262 1891784 2435080
12960 2435080 2290490 2020821 1650319 1670865 1673815 1944470 2064338 2005041 1851807 1955437
12950 1955437 2075438 1871349 1407792 1011276 943517 1271567 1705329 1938200 1909990 2212798
12940 2212798 2391347 1994284 2076844 2331258 2399822 2333708 2359378 2139509 2043696 1943443
12930A943443k8747J05026p3388j22055J16162J28591J43472J13038k81007J1155
12920B055690J19374j49499J98799N5721l01126L6719j48641j9225m9191K29470
12910B028091J89577J16402m1476j21274K54736N5915l02332J6359J38815j2670
12900B322143L8178J25277j03584O5682J52653l696m9110k10318J3320J60797
12890B511342J23064k63899l87163k20980O6392K8637L38816J46196j44624l4564
12880B163217L02297K62375J13948j91284j09800j35262q054J37999O0524J09443
12870B705403l43800R106M3398J18628O9927n2531k06360r5743m4046l55019k0556
12859A828407L20180j33688J43330L91986l87476J25052J77487n2630M7905J61901
$$ plain form
12930 1943443 1914696 2019722 1946334 1824279 1940441 2069032 2212504 2325542 2044535 2055690
12920 2055690 2175064 2025565 2224364 2280085 1978959 2015678 1867037 1847812 1798621 2028091
12910 2028091 2217668 2334070 2292594 2171320 2426056 2481971 2179639 2195998 2334813 2322143
12900 2322143 2360321 2485598 2382014 2447696 2600349 2596653 2547543 2337225 2350545 2511342
12890 2511342 2634406 2370507 1983344 1762364 1828756 1857393 2196209 2342405 2197781 2163217
12880 2163217 2465514 2727889 2841837 2650553 2540753 2405491 2397437 2535436 2595960 2705403
12870 2705403 2361603 2370709 2414107 2532735 2602662 2550131 2343771 2248028 2203982 1848963 1828407
12859 1828407 2148587 2014899 2158229 2550215 2162739 2287791 2465278 2412648 2460553 2622454
12849B622454j24339O6171q2518k37897j3167j31983m2981M27352L36707Q8484
12839B908283K38135j32777k19106k15271K10377j89655j57973l19756j0011J00496
12829B212742K30561J24249J45928j88202l47962k20979K1296J79817K52222L34656
12819B744328j51390J20053J57812Q012K86134K30704q0839l72737j06515p4295
12809B761267k75361R0101k75626p385j03227M08353N5923O9460K23702Q3824
12799C031031l20554j74498K2595n2731K39555K16192p4547l24348j59546k21588
12789B181561J29327K99560Q3188j3058j80725r8135J05206J44114N9301L3908
12779B744247m515j68463k24604O9360L64116j42677l3851M19828L270l48553
$$ plain form
12849 2622454 2498115 2564286 2481768 2243871 2230704 2098721 2055740 2483092 2819799 2908283
12839 2908283 3146418 3013641 2794535 2579264 2789641 2599986 2442013 2122257 2112246 2212742
12829 2212742 2443303 2567552 2713480 2525278 2177316 1956337 1977633 2157450 2409672 2744328
12819 2744328 2592938 2712991 2870803 2878815 3164949 3395653 3314814 2942077 2835562 2761267
12809 2761267 2485906 2576007 2300381 2292996 2189769 2598122 2654045 2723505 2947207 3031031
12799 3031031 2710477 2535979 2558574 2505843 2745398 2961590 2887043 2562695 2403149 2181561
12789 2181561 2310888 2610448 2693636 2680578 2499853 2401718 2506924 2651038 2710339 2744247
12779 2744247 2739732 2571269 2346665 2416025 2780141 2637464 2603613 3023441 3026711 2678158
12769B678158j30020j20112K52525j57066j90792J86073L29963M9229R8749j87254
12759B809453J47003r1918m667o0802q9399K62686j26974k84964j73371K18463
12749B605510K46335O9335o8721K01986J8429k00674J40094K4401j43847J27621
12739C020469K0998j3074K4847L3525k28944k26028J9783p9642K4797P7636k37777
12728B436590j71333J24624J56307L18653L18592L11736j14066l31472Q266R6125
12718C154022J68314q0153m1486M4229l44862L29104R4326m43807J78371L2968
12708C091026N2244j35786r2753N7749K67744j90357k8280k05895m77500j39018
12698B199174J03142p5931P806R6548L16705L05942N4509n02k83413j64688K11661
$$ plain form
12769 2678158 2548138 2428026 2680551 2523485 2332693 2518766 2848729 2897958 2996707 2809453
12759 2809453 2956456 2864538 2859871 2799069 2709670 2972356 2845382 2560418 2387047 2605510
12749 2605510 2851845 2921180 2852459 3054445 3072874 2872200 3012294 3036695 2892848 3020469
12739 3020469 3041467 3028393 3053240 3086765 2857821 2631793 2651576 2571934 2596731 2674367 2436590
12728 2436590 2265257 2389881 2546188 2864841 3183433 3495169 3381103 3049631 3057897 3154022
12718 3154022 3322336 3242183 3200697 3244926 2900064 3229168 3323494 2879687 3058058 3091026
12708 3091026 3143270 3007484 2914731 2972480 3240224 3049867 3021587 2815692 2338192 2199174
12698 2199174 2302316 2226385 2234191 2330739 2647444 2953386 3007895 3007393 2723980 2559292 2770953
12687B770953J99841o2957L14805k61915j69049J57242L30053J89330Q6646m6401
12677C508548k88712N1119K5985k63159j28783J14170N7964Q4662J86514k50266
12667C098042k24242j6811R1251K81046J46748p8366j73993k91996j73693n97
12657B657389P7626K22030L00246K35310N0606j66810P3173N2100J06054l1857
12647C575867j58876J9577J37263O9786j47539k24806L834K81393k7478j70202
12637C358819P0363J44909j58701k25652Q4031L36535l8237l81527o4330r711
12627C116499K73496J20784J04245j65326k30565j14515M5811K93647J25910P5405
12617C645391j65017j08451J8130K65911M05114k22367l43528j02483J01839N2211
$$ plain form
12687 2770953 2970794 2907837 3222642 2960727 2791678 2948920 3278973 3468303 3554949 3508548
12677 3508548 3219836 3270955 3296940 3033781 2904998 3019168 3077132 3161794 3348308 3098042
12667 3098042 2873800 2856989 2948240 3229286 3376034 3297668 3123675 2831679 2657986 2657389
12657 2657389 2735015 2957045 3257291 3492601 3543207 3376397 3449570 3501670 3607724 3575867
12647 3575867 3416991 3436568 3573831 3643617 3496078 3271272 3275106 3556499 3529021 3358819
12637 3358819 3429182 3574091 3415390 3189738 3273769 3610304 3572067 3190540 3126210 3116499
12627 3116499 3389995 3510779 3615024 3449698 3219133 3104618 3150429 3444076 3569986 3645391
12617 3645391 3480374 3371923 3390053 3655964 4061078 3838711 3495183 3392700 3494539 3546750
12607C546750j45018P752j57214J20958N3377J84622Q1997j42807m2794Q644M8121
12596C564388J82741n5902o9658R9350P35440N14224n9859m72524m82444m03173
12586C552583k52286M09336M54964m1861k4085K56907j55863l53142k60951j05357
12576C480245j42692J05949M72887J19723m0907M4288J30637J69143P6032j50515
12566D264790m44146l7086K18213J8322l93612j18325J35945J86162J67930K29451
12556D227644j50491P5794O98660M2012k58551k31452j36643j07459j02539l44335
12546C712640l2994N0562J0343J98509K97366J37252P0543k91384j7828L35322
12536D470331J37410L4101l3686j88288R1011Q3369K538J05513k46058P5372j88371
$$ plain form
12607 3546750 3401732 3409484 3252270 3373228 3426605 3611227 3693224 3550417 3507623 3516267 3564388
12596 3564388 3747129 3691227 3621569 3720919 4456359 4970583 4910724 4438200 3955756 3552583
12586 3552583 3300297 3709633 4164597 4122736 4098651 4355558 4199695 3846553 3585602 3480245
12576 3480245 3337553 3443502 3916389 4036112 3995205 4039493 4170130 4339273 4415305 4264790
12566 4264790 3820644 3783558 4001771 4020093 3626481 3508156 3644101 3830263 3998193 4227644
12556 4227644 4077153 4152947 4851607 4893619 4635068 4403616 4266973 4159514 4056975 3712640
12546 3712640 3679646 3730208 3740551 3939060 4236426 4373678 4444221 4152837 4135009 4470331
12536 4470331 4607741 4641842 4608156 4419868 4510879 4594248 4596786 4702299 4456241 4531613 4343242
12525D343242k88247K01591K18265j71582j014q8020J24863J25030J28508K5872
12515D618508O2865k3105o7132j11281o8700O3912j83914n1176j02381l78111
12505C759485j08195K52020K66601j11716j29465L18424K69152l3753l17545L5156
12495D200164M01993M14530j44112j76450j79935K560N3945N1342o6482k48806
12485D308749L67491K64156k55234N4139P5076k04040p5123n6544j55297N1478
12475D374851j57107R511R8477J30031K51810k29827j79888O1111l910R3345M39792
12464D888196M8042l77187j77164J84204K5584k09213N3254O2774O1196l8028
12454D521658J75206j74950Q5295K09874l55663j76117L4309p8701j05052j45275
$$ plain form
12525 4343242 4054995 4256586 4474851 4303269 4302255 4214235 4339098 4464128 4592636 4618508
12515 4618508 4681373 4658268 4591136 4479855 4411155 4475067 4291153 4239977 4137596 3759485
12505 3759485 3651290 3903310 4169911 4058195 3928730 4247154 4516306 4482553 4165008 4200164
12495 4200164 4602157 5016687 4872575 4696125 4516190 4518750 4572695 4624037 4557555 4308749
12485 4308749 4676240 4940396 4685162 4739301 4814377 4610337 4535214 4478670 4323373 4374851
12475 4374851 4217744 4227255 4325732 4455763 4707573 4477746 4297858 4358969 4355059 4448404 4888196
12464 4888196 4936238 4559051 4381887 4566091 4591675 4382462 4435716 4498490 4559686 4521658
12454 4521658 4696864 4521914 4607209 4817083 4461420 4285303 4319612 4240911 4135859 3990584
12444C990584j0814L64579N34594O0349j34550j8771k46868K06625L31082L8523
12434E115333m3069l43303j51463J31480K94075K42561O2516j67102j05467K95548
12424E331109K5466l94023K80675j59913j33670o9040m02062K20646O148j17094
12414D588242K7997Q5413M213j08253j56591J86480J62529J11652L93129j82177
12404E112634j84182N543J2679j24711K69980L44793R6677l7541j07950L53255
12394E741177J29407o56194k36052j6274J13287J73307j86581J9008m8803k44549
12384D787733P0823j15122j77510J31272P2169J11738Q4566j36721J9937M47076
12374E295961K16552m3301k61051k9794j02832k61425M3276J64889K21848N9000
$$ plain form
12444 3990584 3979770 4344349 4878943 4939292 4804742 4785971 4539103 4745728 5076810 5115333
12434 5115333 5072264 4728961 4577498 4708978 5003053 5245614 5308130 5141028 5035561 5331109
12424 5331109 5356575 4962552 5243227 5083314 4949644 4880604 4478542 4699188 4705336 4588242
12414 4588242 4616239 4701652 4705865 4597612 4441021 4627501 4790030 4901682 5294811 5112634
12404 5112634 4928452 4933995 4946674 4821963 5091943 5436736 5533413 5495872 5387922 5741177
12394 5741177 5870584 5214390 4978338 4962064 5075351 5248658 5062077 5081085 5032282 4787733
12384 4787733 4858556 4743434 4565924 4697196 4769365 4881103 4965669 4828948 4848885 5295961
12374 5295961 5512513 5469212 5208161 5178367 5075535 4814110 4857386 5022275 5244123 5303123
12364E303123l47133k54200j70739N4329K97770L74706M09261Q1687J81880k15457
12354E715227o8696q1025j18143J59730j6412K05787l04798K9118Q8033L12531
12344E921352k4744k6978j13742P9283J55579j87062k19513j88806N19371n8164
12334E856576j85621r3015K29814o0267m4540o2214j4781J91306K35033j89636
12324E862655j464n5720j36919r216K45522J15952m3146m4667q9043M7705P0666
12313E962325l12470j06068j46671k53180J09937L05167J31041K46381j89851
12304E746611J5484O5763p0425K00731k6733K51180k08389k32504j77816L1701
12294E595603J78112r2700k5981J18541l7811m0026j46885L82005L65661j2717
$$ plain form
12364 5303123 4955990 4701790 4531051 4585380 4883150 5257856 5667117 5748804 5930684 5715227
12354 5715227 5646531 5565506 5447363 5607093 5590681 5796468 5491670 5520788 5608821 5921352
12344 5921352 5896608 5869630 5755888 5835171 5990750 5803688 5584175 5395369 5914740 5856576
12334 5856576 5670955 5577940 5807754 5747487 5702947 5640733 5625952 5817258 6052291 5862655
12324 5862655 5861191 5805471 5668552 5659336 5904858 6020810 5977664 5932997 5843954 5891659 5962325
12313 5962325 5649855 5543787 5397116 5143936 5253873 5559040 5690081 5936462 5746611
12304 5746611 5762095 5827858 5757433 5958164 5931431 6182611 5974222 5741718 5563902 5595603
12294 5595603 5773715 5681015 5655034 5773575 5735764 5695738 5548853 5930858 6296519 6283802
12284F283802l76658J942J57222r5872q6311J13574J1413J33907l6436J26164
12274F232747j24834K1800J77429k51192k06459Q1615P2483Q5471j98606p4932
12264E815522j87399p980q4358j76880P1427K82067r3288l2915J51634J22745
12254E860575K48944p2428j72748K34469M12956J18494K59070k32190l41565J0483
12244F326060r0161K3079j88605p0007N4636O7775m27261p5992Q1835K11422R7711
12233F010492L22707L1966k0316P5516J03073R6504M5996p5761n11601j47233
12223E931343J93313K08174n4717l31034j23415q6003O3053J52416L87516N68218
12213F908864K24820m33196l72627L7576O2528J88170K98968K54045l16840k95239
$$ plain form
12284 6283802 5907144 5909086 6066308 5970436 5884125 5997699 6009112 6143019 6106583 6232747
12274 6232747 6107913 6129713 6307142 6055950 5849491 5931106 6003589 6089060 5890454 5815522
12264 5815522 5628123 5620143 5535785 5358905 5430332 5712399 5619111 5586196 5737830 5860575
12254 5860575 6109519 6037091 5864343 6098812 6511768 6630262 6889332 6657142 6315577 6326060
12244 6326060 6235899 6258978 6070373 6000366 6055002 6122777 5695516 5619524 5701359 5912781 6010492
12233 6010492 6333199 6365165 6344849 6420365 6523438 6619942 6665938 6590177 6078576 5931343
12223 5931343 6124656 6332830 6278113 5947079 5823664 5737661 5800714 5953130 6340646 6908864
12213 6908864 7133684 6700488 6327861 6365437 6427965 6616135 6915103 7169148 6852308 6557069
12203F557069l622J55593p2300j5082m3033r8126q0142K11073J48174j90225k78666
12192F290713Q1601K46947q7777q4630j44894J68983L23379j097J14525J8101
12182F925851j51614q1964k25784r3618J63460J39766m9539l31238j38164N58069
12172F715225l8524k31518k36728n8485J91800K69707J34329J92304J1015p8772
12162F870353j6323k04880j09961K82966J00089k29005L6463k31628j00724L48880
12152F746230j5750L030k22853J79170K78635R899k35195j60047N7996j37027
12142F504088J10517N61641M16591q1231k21145l67209Q9456j7746q0372j06452
12132F808138j75626J88878k08495j23393J91718K19056J75808j02446k03707
$$ plain form
12203 6557069 6553447 6709040 6636740 6621658 6578625 6480499 6400357 6611430 6759604 6569379 6290713
12192 6290713 6372314 6619261 6531484 6446854 6301960 6470943 6794322 6793225 6907750 6925851
12182 6925851 6774237 6692273 6466489 6372871 6536331 6676097 6626558 6295320 6157156 6715225
12172 6715225 6676701 6445183 6208455 6149970 6341770 6611477 6745806 6938110 6949125 6870353
12162 6870353 6854030 6649150 6539189 6822155 6922244 6693239 6729702 6498074 6397350 6746230
12152 6746230 6730480 6733510 6510657 6689827 6968462 6978361 6743166 6583119 6641115 6504088
12142 6504088 6614605 7176246 7592837 7511606 7290461 6923252 7012708 6994962 6914590 6808138
12132 6808138 6632512 6821390 6612895 6489502 6681220 6900276 7076084 6973638 6769931
12123F769931o0052R6637k49900l15233K2330N03602L99725O21496M09418j15971
12113H081983k77581k48498k61245j34453J30678J27781l23404m9524J81975j30842
12103G096870k9155k31682n5734o4239L41690L24157j35956j63461J72171K67101
12093G521762J9927L39948K03783k12407l95502m2259J92060j48619j34299J65934
12083G510328N5538J92840J68131J54171l01396l60777k30280M8138j92421l58699
12073F685573J19712k206K97948L16315j72136j93715j29850j67553K27971o4601
12063F917458O7141M3360m18569J84305M69358K08918P1697L8465m06787l32688
12053F842658k6307J71294N1659q5717L14421k1345J09791J90611k2349j14824
$$ plain form
12123 6769931 6709879 6806516 6556616 6241383 6263713 6767315 7167040 7788536 8197954 8081983
12113 8081983 7804402 7555904 7294659 7160206 7290884 7418665 7095261 7045737 7227712 7096870
12103 7096870 7067715 6836033 6780299 6716060 7057750 7381907 7245951 7082490 7254661 7521762
12093 7521762 7541689 7881637 8085420 7873013 7477511 7435252 7627312 7478693 7344394 7510328
12083 7510328 7565866 7758706 7926837 8081008 7779612 7418835 7188555 7236693 7044272 6685573
12073 6685573 6805285 6803079 7101027 7417342 7245206 7051491 6921641 6754088 6982059 6917458
12063 6917458 6984599 7027959 6609390 6793695 7263053 7471971 7543668 7582133 7175346 6842658
12053 6842658 6816351 6987645 7039304 6953587 7268008 7246663 7356454 7547065 7524716 7409892
12043G409892l01341k83109o4093j8403J68869K69284M0852k56834Q2750L75495
12033G423362Q3180J15614k51997L80570K94713Q627K4504l98267q1794M14045
12023H012557k22877l33607J20196J81262l1449k23685l18323k14991q8788K64824
12013G145119J06918M3988j88413j81040J08807J59805K0481M3840P6011J073
12003G336589k71367P1347M00904K4614l9183k5937k27765k84306j25532j56584
11993F702780J19321N39046L04668j90170p5489K303r9588K6751k94887o872K59971
11982G287834K14982m4948k50814J2926J18448m4157L63421l2105k00347m17408
11972G007832m92013K40757M29279N1292J19997N5844k2236k81842J79566J12778
$$ plain form
12043 7409892 7108551 6825442 6761349 6742946 6911815 7181099 7221951 6965117 7047867 7423362
12033 7423362 7506542 7622156 7370159 7750729 8045442 8054069 8078573 7680306 7598512 8012557
12023 8012557 7789680 7456073 7576269 7757531 7726082 7502397 7184074 6969083 6880295 7145119
12013 7145119 7252037 7296025 7107612 6926572 7035379 7195184 7215665 7259505 7335516 7336589
12003 7336589 7065222 7136569 7537473 7562087 7522904 7496967 7269202 6984896 6859364 6702780
11993 6702780 6822101 7361147 7665815 7475645 7400156 7402459 7302871 7329622 7034735 7027863 7287834
11982 7287834 7502816 7457868 7207054 7219980 7338428 7294271 7657692 7625587 7425240 7007832
11972 7007832 6515819 6756576 7185855 7237147 7357144 7412988 7390752 7108910 7288476 7401254
11962G401254m43596j03377L42838L98636J06873m22462J1419L07431K14104K09865
11952H022985j54168k22923l02538k1309j41483j19404j0290J30982k8876R077
11942G162053j43699P2260J80321J33750J3829J04705k49774J11852J69865k90383
11932G264779k50574J30904J27095N2763j36373j86173L37772R6190j16948j84133
11922G135302j30960L19441N7947j78110K0786R2137L20123j15198k09202J82794
11912G495060l07289k01983K02155l68872j82248l26710Q562M95898M11272n9201
11902G166644j47785k61458K57205m3127r3309O5443K60307K66809n6K59982o851
11891G723804k51751k4367O2984j47092j23024l87390p913J18024N7283o7335
$$ plain form
11962 7401254 6957658 6854281 7197119 7595755 7702628 7280166 7291585 7599016 7813120 8022985
11952 8022985 7868817 7645894 7343356 7322047 7180564 7061160 7050870 7181852 7152976 7162053
11942 7162053 7018354 7090614 7270935 7404685 7418514 7523219 7273445 7385297 7555162 7264779
11932 7264779 7014205 7145109 7272204 7324967 7188594 7002421 7340193 7436383 7319435 7135302
11922 7135302 7004342 7323783 7381730 7203620 7224406 7316543 7636666 7521468 7312266 7495060
11912 7495060 7187771 6985788 7187943 6819071 6636823 6310113 6318675 6814573 7225845 7166644
11902 7166644 7018859 6757401 7014606 6971479 6878170 6943613 7203920 7470729 7470673 7730655 7723804
11891 7723804 7472053 7447686 7510670 7363578 7240554 6853164 6845251 6963275 7020558 6953223
11881F953223k22431K97416J09632L33591R9010l39466k46135L14205J86755k33842
11871G251958Q5386K51067k06563j62644p6576j0057N6240J12785l24662j61192
11861F815742j35605L25168K12392K42111j16595q8612j32014L11207q6874k08565
11851G138355l28935M8870J08808J00178K1179j10553j71464l3414Q4313L19743
11841G177080R6056k87195k11824L26224Q5944j39324p4802K96745k07079r1582
11831F970243R4153O4112j9270J38554J60738o7805l49134l4469l2069p1143j41052
11820F712858Q8709J24246Q9127l0429k10026K39753K2983j69020n4502O4415
11810F878114O6763j97462l4399K80630n3613q0098q6635k2283j85854r5204k0077
$$ plain form
11881 6953223 6730792 7028208 7137840 7471431 7570441 7230975 6984840 7299045 7485800 7251958
11871 7251958 7337344 7588411 7381848 7219204 7142628 7132571 7188811 7301596 6976934 6815742
11861 6815742 6680137 7005305 7217697 7459808 7343213 7254601 7122587 7433794 7346920 7138355
11851 7138355 6809420 6858290 6967098 7067276 7088455 6977902 6806438 6773024 6857337 7177080
11841 7177080 7273136 6985941 6774117 7100341 7186285 7046961 6972159 7268904 7061825 6970243
11831 6970243 7064396 7128508 7109238 7247792 7408530 7340725 6991591 6957122 6925053 6853910 6712858
11820 6712858 6801567 6925813 7014940 6984511 6774485 7014238 7037221 6868201 6813699 6878114
11810 6878114 6944877 6747415 6713016 6993646 6940033 6859935 6773300 6751017 6565163 6469959 6449882
11799F449882k48591K94991N04536k2521M2911K16958J29830k25003l34514l2910
11789F775569K07880J1093l86593o3454j738j11372j24596p658j89099j55294
11779E954738K70443M22584L57574J34135l5237n16977m13628J05702q3285Q2896
11769F278945K34790q4052j03076l4512L13464K17597n7362j44449j50441q3892
11759F387012M84017J43659l81599n37331K41689N82557K75087j75363j32463
11750F887265O6489K10871J02933M3136k47800j54668o9841k37015k45447O0486
11740F416409J3600q0126J88717l8840o3177l1770k6212k98726l17809J9836K14235
11729E996137K02259j61531j64516M24175j30839k05669q607L52673J48580J05709
$$ plain form
11799 6449882 6201291 6496282 7000818 6978297 7021208 7238166 7367996 7142993 6808479 6775569
11789 6775569 6983449 6994542 6607949 6544495 6542757 6431385 6306789 6299131 6110032 5954738
11779 5954738 6225181 6647765 7005339 7139474 7104237 6587260 6173632 6279334 6196049 6278945
11769 6278945 6513735 6429683 6326607 6292095 6605559 6823156 6765794 6621345 6470904 6387012
11759 6387012 6871029 7014688 6633089 6095758 6337447 6920004 7195091 7019728 6887265
11750 6887265 6953754 7164625 7267558 7310694 7062894 6908226 6838385 6601370 6355923 6416409
11740 6416409 6430009 6349883 6538600 6499760 6436583 6404813 6378601 6079875 5762066 5781902 5996137
11729 5996137 6198396 6036865 5872349 6296524 6165685 5960016 5951409 6304082 6452662 6558371
11719F558371L24635k33352l40385r7203J95739J51130j3421m1916k25887m06634
11709E871077J61198K47530k14265j37122j23498q2816o7823l5290J19519M00266
11699F138776L88685N2158l20541j46922j96147P4536J18139j72033q003J3370
11689E942018k39812r5878O5304J01132j19446L4619K56722J77143m3708n429
11679F072665J16187q0318m09773K6651k06708J54151j3639m4817K64760j20377
11669E758782j9757P8632J66240K09345J37577j48111j69044l27959M4540Q0221
11659E810466K29898k76075j3910K61958J36816j82552m19996N1845J92906J43210
11649E934566j84292k89228K8056K25397j8818k00134l44799J08074K99286O6862
$$ plain form
11719 6558371 6883006 6649654 6309269 6212066 6407805 6558935 6545514 6503598 6277711 5871077
11709 5871077 6032275 6279805 6065540 5928418 5804920 5722104 5654281 5618991 5738510 6138776
11699 6138776 6527461 6579619 6259078 6112156 5916009 5990545 6108684 5936651 5928648 5942018
11689 5942018 5702206 5606328 5671632 5772764 5653318 5687937 5944659 6121802 6078094 6072665
11679 6072665 6188852 6108534 5698761 5725412 5518704 5672855 5659216 5614399 5879159 5758782
11669 5758782 5739025 5817657 5983897 6193242 6330819 6182708 6013664 5685705 5730245 5810466
11659 5810466 6040364 5764289 5750379 6012337 6149153 5966601 5546605 5598450 5791356 5934566
11649 5934566 5750274 5461046 5489102 5714499 5695681 5495547 5150748 5258822 5558108 5624970
11639E624970J62469L61491j35933J31924j65531k43869p4901J95022n0556m1144
11629E763942n15565k65407L50953J92069p1540j12673M53509J18092r4422l11984
11619E506974J96987J23345l65089j01958M2669K4929j982N199o3809j08843M0213
11608E298635K66713J02259j12555J34060L9268j01364K6857k16477l30095K248
11598E109549j36366K03345o9555P0817j2833r6910l65100K88562K29963J39205
11588E360677J51977j31968j64612O4905K19589m84454J32938J53589o3466q2361
11578E156814j44876K6717k88882j74106P8900K20844K15923K03109K49138j18956
11568E424625m43239J6168L501J42981k05716l13270k058K46792q345k13159j01257
$$ plain form
11639 5624970 5787439 6148930 6012997 6144921 5979390 5735521 5660620 5855642 5805086 5763942
11629 5763942 5248377 4982970 5333923 5525992 5454452 5341779 5795288 5913380 5818958 5506974
11619 5506974 5703961 5827306 5462217 5360259 5402928 5427857 5425875 5431074 5367265 5258422 5298635
11608 5298635 5565348 5667607 5555052 5689112 5728380 5627016 5653873 5437396 5107301 5109549
11598 5109549 4973183 5176528 5106973 5177790 5164957 5068047 4702947 4991509 5221472 5360677
11588 5360677 5512654 5380686 5216074 5280979 5500568 5016114 5149052 5302641 5239175 5156814
11578 5156814 5011938 5038655 4749773 4575667 4654567 4875411 5091334 5294443 5543581 5424625
11568 5424625 4981386 4997554 5001055 5144036 4938320 4625050 4622992 4869784 4861439 4648280 4547023
11557D547023L29678P9149N744r3313J07470m6587L30316N6976k80164k98666
11547D737626m06192R1209K28299K03640J55706r7408J43820j70417j66248k62297
11537D457738J45187j38025J98699r6067J659K62602j74230k37793J44136J04972
11527D668878J74072J14173k48809j49126R3519N5020K8277k3510k31607k19808
11517D261079L5317q1210J01670O2614P9961j12337J91418K89835J33807k68633
11507D693521M3064j28057j93745M5305P8599j91741l67719N6809p7026j10287
11497C848723L31458J8647k4293l1468j76569N1498M2041k8197J07125K20116
11487D359081L71787j87080l14801J03798L5563L80232L05102j47417m65781m05852
$$ plain form
11557 4547023 4876701 4955850 4961594 4868281 4975751 4929164 5259480 5316456 5036292 4737626
11547 4737626 4331434 4422643 4650942 4854582 5010288 4912880 5056700 4886283 4720035 4457738
11537 4457738 4602925 4464900 4663599 4567532 4569191 4831793 4657563 4419770 4563906 4668878
11527 4668878 4842950 4957123 4708314 4559188 4652707 4707727 4736004 4712494 4480887 4261079
11517 4261079 4296396 4215186 4316856 4379470 4459431 4347094 4538512 4828347 4962154 4693521
11507 4693521 4736585 4608528 4414783 4460088 4538687 4346946 3979227 4036036 3959010 3848723
11497 3848723 4180181 4198828 4174535 4143067 3966498 4017996 4060037 4031840 4138965 4359081
11487 4359081 4730868 4543788 4228987 4332785 4368348 4748580 5053682 4906265 4440484 4034632
11477D034632j31863m474r1058O8858L32573M3719l98998j12485J80153O51785
11467D572842P0738k50456k35487j64762j22457N3127L539J0694R6206K1723k78330
11456C777377k66763J31426r7799k01428K19378M16360J38818J9041l79724l07045
11446C449641J466M18034j76800j46081n3636L74221m12649k68860K84975q7939
11436C382372k86585k21306K23872M63284j94843k76698k581M29127O3255j54225
11426C425672J2418j5201K79806J44955o7147L9053L18179j40231J70675k56741
11416C911438n53595l09634J12195K64601K72554J26291k46606j77731K72301
11407C671814J07569Q3419M2037r6036k52768j39023n6890L00782J53507M1748
$$ plain form
11477 4034632 3902769 3898295 3807237 3876095 4208668 4252387 3853389 3740904 3921057 4572842
11467 4572842 4643580 4393124 4157637 3992875 3870418 3923545 3927084 3937778 4033984 4055707 3777377
11456 3777377 3510614 3642040 3544241 3342813 3562191 3978551 4117369 4136410 3756686 3449641
11446 3449641 3451107 3869141 3692341 3546260 3492624 3866845 3454196 3185336 3470311 3382372
11436 3382372 3095787 2874481 3098353 3561637 3366794 3090096 3087515 3516642 3579897 3425672
11426 3425672 3438090 3422889 3702695 3847650 3780503 3819556 4137735 3997504 4168179 3911438
11416 3911438 3357843 3048209 3160404 3425005 3697559 3823850 3577244 3399513 3671814
11407 3671814 3779383 3862802 3904839 3808803 3556035 3417012 3360122 3660904 3814411 3856159
11397C856159J41430L0811l31851q6442K4654k63898k46029l8336J47699J97030
11387C431227J47585r1269k53893n5345R3762R664J23085k48085q6206k56902
11377B813623L19497j05648q0923J78905K12300r8438n1648J14236l33006r5324
11367B873574K42225N10727L88151k18126k50185l31127j58815J57721Q5172L7477
11357C336794l04115j09359j59887J48516m6862J48459K27886l30979J34941K24741
11347C270135k33424j4371J16048l56837K22427M5447q4514O64M39046J20065
11337C524686k800k15601k25159l1076n06013k32196J24405j77501J93187J42511
11327B594443l348L10138J04202m7858j45534M1340J7459l04295l27428k9328
$$ plain form
11397 3856159 3997589 4028400 3696549 3610107 3634761 3370863 3124834 3086498 3234197 3431227
11387 3431227 3578812 3487543 3233650 3178305 3272067 3281731 3404816 3156731 3070525 2813623
11377 2813623 3133120 3027472 2946549 3125454 3337754 3239316 3187668 3301904 2968898 2873574
11367 2873574 3115799 3626526 4014677 3796551 3546366 3215239 3056424 3214145 3299317 3336794
11357 3336794 3032679 2923320 2763433 2911949 2865087 3013546 3241432 2910453 3045394 3270135
11347 3270135 3036711 3022340 3138388 2781551 3003978 3049425 2964911 2965575 3404621 3524686
11337 3524686 3521886 3306285 3081126 3050050 2544037 2311841 2436246 2258745 2451932 2594443
11327 2594443 2591095 2901233 3005435 2957577 2812043 2853383 2870842 2566547 2239119 2209791
11317B209791J98890J94177q1037O1893J17291j20691R8434K77934k91109l47663
11307B317910K31793K0246J81196j16863Q4096j42564q4696M7847j56245j38972
11297B243748j05534k24693K03987O4625N22389J32967j24143k66836R6201N504
11287B548215n8462l9893j99583j05909L67052J54282J15146N9221j54089p8309
11277B607671l53561r3637K8015K87912N54130k08785l78770j69050j00681j3621
11267B159623J39151J57617N4571k14309n9701L93975q6932k6295l39267l49994
11257A828439J29577K59512M2737N1504M2317k45998j23825j14691r6260K40690
11247B014002j32507J8869K23489J62030P4031m5168k39330l52094K9147J98279
$$ plain form
11317 2209791 2408681 2602858 2521821 2583714 2701005 2580314 2678748 2956682 2665573 2317910
11307 2317910 2549703 2569949 2751145 2634282 2718378 2575814 2491118 2538965 2382720 2243748
11297 2243748 2138214 1913521 2117508 2182133 2704522 2837489 2713346 2446510 2542711 2548215
11287 2548215 2489753 2449860 2250277 2144368 2511420 2665702 2780848 2840069 2685980 2607671
11277 2607671 2254110 2160473 2188488 2476400 3030530 2821745 2442975 2273925 2173244 2159623
11267 2159623 2298774 2456391 2510962 2296653 2236952 2630927 2543995 2517700 2178433 1828439
11257 1828439 1958016 2217528 2260265 2311769 2354086 2108088 1984263 1869572 1773312 2014002
11247 2014002 1881495 1900364 2123853 2285883 2359914 2314746 2075416 1723322 1752469 1950748
11237A950748k35241o9557N24186J66918k66698j56080K16373o3438n7404j30908
11227A878899l21206J73066M42224J84294j91313j85781M349k4153O887l12758
11217A654508K0206K21422J49535J25544R6421k58948l4213K30967l0181r6787
11207B078474o4258k44971J35309J2547m50446j17570L63R6261J64829K20552
11197A831090K82174L11903Q9859R7252k54405l1106j41861k26047L7587N0047
11187B046493j25858o4877J44226J5387N8766l72102k07786J31522J05068k39456
11177A491383P4424p8503l6549L97691K85736j49940k81564j70139O8462k33173
11167A367828J54822M94130j78031j34109J02073k49676k21864J4622r4095J79253
$$ plain form
11237 1950748 1715507 1645950 2170136 2337054 2070356 1914276 2130649 2067211 2009807 1878899
11227 1878899 1557693 1730759 2172983 2357277 2165964 1980183 1984532 1960379 1967266 1654508
11217 1654508 1674714 1896136 2045671 2171215 2267636 2008688 1974475 2205442 2175261 2078474
11207 2078474 2014216 1769245 1904554 1917101 1466655 1349085 1349448 1445709 1610538 1831090
11197 1831090 2113264 2425167 2515026 2612278 2357873 2326767 2184906 1958859 1996446 2046493
11187 2046493 1920635 1855758 1999984 2015371 2074137 1702035 1494249 1625771 1730839 1491383
11177 1491383 1565807 1487304 1450755 1848446 2134182 1984242 1702678 1532539 1601001 1367828
11167 1367828 1522650 2016780 1838749 1704640 1806713 1557037 1335173 1349795 1255700 1434953
11157A434953R6291j13512j1235k31849l7583M80735P0975l00840n9276j53865
11147A174794J79147K75906j60765J309K85149R5791J62596k43193j39556K01734
11137A832912K34194K1027j01018j15160j05193K24925k36004k58452j15410k53975
11127A127846j25946k9440q2737j20536R0400J94906j09892L3170J36175K64248
11117A378194L1747l6236k9352K53797m0046j44104r5792q3033l4705L29279j94650
11106A335099q4102n0649l1701r5218J73470N6092o9608J57030r3901o0367o5752
11095A170393j11181L1031L26352j90342k15422l32576j81596J87351J53120J50696
11085I87826J12716J48081j31144p6484J47585L6425O8625j97593l32287r7991
$$ plain form
11157 1434953 1531244 1417732 1406497 1174648 1137065 1617800 1688775 1387935 1328659 1174794
11147 1174794 1353941 1629847 1469082 1470391 1755540 1851331 2013927 1770734 1631178 1832912
11137 1832912 2067106 2088133 1987115 1871955 1766762 1991687 1755683 1497231 1381821 1127846
11127 1127846 1001900 972460 889723 769187 859587 1054493 944601 977771 1113946 1378194
11117 1378194 1409941 1373705 1344353 1598150 1558104 1414000 1318208 1235175 1200470 1529749 1335099
11106 1335099 1250997 1200348 1168647 1073429 1246899 1302991 1233383 1390413 1296512 1236145 1170393
11095 1170393 1059212 1090243 1416595 1226253 1010831 678255 496659 684010 837130 987826
11085 987826 1100542 1248623 1117479 1040995 1188580 1225005 1293630 1096037 763750 665759
11075F65759l2808K563r068M3945L06371N5947J60642J13524K4896k85378k34501
11064H11892j27332J77573K40231j82914J12921l09716k96644P0543K42364J09776
11054H48694j83583n0423m7246K32003J06282N4037K5493L22303O0159n598j49904
11043A212217J51920p5806r167M062j26555J30116L61598J58717M34762Q5981
11033B327845j29783J68493L88572j88463K8611k2464l80748k33596L31967L00553
11023B590987J97245N48897L88628Q7034k31707j89920j51012j87754j73706k72827
11013B605865k76414n4680L867l0732k30564J44411n85q9878k61306N9536l09352
11002A560168l44544K96177J15296j5076l0485M0658J77696l66374r3463L7223
$$ plain form
11075 665759 632951 635514 626446 670391 976762 1032709 1193351 1306875 1331771 1046393 811892
11064 811892 684560 862133 1102364 919450 1032371 722655 426011 496554 738918 848694
11054 848694 665111 614688 567442 799445 905727 959764 985257 1307560 1367719 1362121 1212217
11043 1212217 1364137 1288331 1279164 1283226 1156671 1286787 1648385 1807102 2241864 2327845
11033 2327845 2198062 2366555 2755127 2566664 2595275 2572811 2192063 1958467 2290434 2590987
11023 2590987 2788232 3337129 3725757 3812791 3581084 3391164 3240152 3052398 2878692 2605865
11013 2605865 2329451 2274771 2278638 2247906 2017342 2161753 2161168 2071290 1809984 1869520 1560168
11002 1560168 1215624 1511801 1627097 1612021 1581536 1622194 1799890 1433516 1340053 1377276
10992A377276O4542j84089m11732n82286J81273q7002k57801L52327L26028k66386
10982E12150j11215N8711j70042q0619j49439j68091J42051K56244M52803J26694
10972H69247m04390k22058j8646m2345j35896K44070j0901p67596j75856K29718
10962d34653J56609k22529o7843M18881L23251l4225N8985L5564l22096k80124
10952c68180Q5422J57016K79999k56821l82877M63136L38804k37673J13998N44413
10942G37237q5626m64304r4526j81058j53539l2520K86798L29099j3158k86148
10932D2255l4445J16801J08305p512k75416j50515j13038l47756J74936j27767
10922f14152J53366J01790P321l50489J33983J26399l8085J98467k77876k26184
$$ plain form
10992 1377276 1441818 1257729 845997 263711 444984 357982 100181 452508 778536 512150
10982 512150 400935 459646 289604 208985 59546 -108545 33506 289750 742553 869247
10972 869247 464857 242799 224153 181808 45912 289982 279081 -488515 -664371 -434653
10962 -434653 -278044 -500573 -568416 -149535 173716 139491 198476 234040 -88056 -368180
10952 -368180 -282758 -125742 154257 -102564 -485441 -22305 316499 78826 192824 737237
10942 737237 651611 187307 92781 -88277 -241816 -274336 12462 341561 328403 42255
10932 42255 7810 124611 232916 225404 -50012 -200527 -313565 -661321 -486385 -614152
10922 -614152 -460786 -358996 -351675 -702164 -568181 -441782 -479867 -281400 -559276 -785460
10912g85460R5998K77752N0771k83850J58761K68159k20726n1442O2170L7128
10902c90739l0090J5684k48532M1227K41279N295j15915j33522l37254l86008
10892a338575K31001O08987N8256N4011J83035M8687j16599Q9680k01846n5113
10882d38476L23249j03538k12472r9130L3012l12226l23523j00355j08709j16345
10872a458513K13580N49454J88079j13422O716j20785L4907M5111O8279Q8777
10862d97817l477j29461q9557J3761j15296k20396o5250J32633K95927o9285L3104
10851g15114l05745j81358j97552K24466L58856L0705J0329K32631j59571o4356
10841g66709J61103j07140l21422j06365J10039J06982q7787k43300l8592K91923
$$ plain form
10912 -785460 -689462 -411710 -360939 -644789 -486028 -217869 -438595 -490037 -427867 -390739
10902 -390739 -420829 -405145 -653677 -612450 -371171 -365876 -481791 -615313 -952567 -1338575
10892 -1338575 -1107574 -498587 -440331 -386320 -203285 -154598 -271197 -181517 -383363 -438476
10882 -438476 -115227 -218765 -431237 -530367 -497355 -809581 -1133104 -1233459 -1342168 -1458513
10872 -1458513 -1244933 -695479 -507400 -620822 -614106 -734891 -699984 -654873 -586594 -497817
10862 -497817 -501294 -630755 -720312 -706551 -821847 -1042243 -1107493 -974860 -678933 -748218 -715114
10851 -715114 -1020859 -1202217 -1399769 -1175303 -816447 -785742 -775413 -542782 -702353 -766709
10841 -766709 -605606 -712746 -1034168 -1140533 -1030494 -923512 -1011299 -1254599 -1293191 -1001268
10831a001268K1934l54749p8242j68381J27879N70260R7667m67954m64523m73002
10821b190379J26986L01763m7811J81090M8884l55070j30161L56864J83007k57189
10811a782016k1140O2889k51665l8482J39993j04053j27051j93377j56355J83982
10801b287275m7469j05552J42670K88253l65577l33885o6802L18198M2228j52215
10791b567426J3663J48471J0818r6163m47437j75403J83575J08335J68680J46622
10781b506265j7264J78814K46044k60904K4316j76970l37392K05262J42486K83772
10771b218101R0849j5463j23613j59774M591k83463k2216K26449p5439N485k57082
10760b827777j78267J57986K33354K81890R1778m52221m50098k58420j6796J84387
$$ plain form
10831 -1001268 -979334 -1334083 -1412325 -1580706 -1452827 -882567 -784900 -1252854 -1717377 -2190379
10821 -2190379 -2063393 -1761630 -1809441 -1628351 -1579467 -1934537 -2064698 -1707834 -1524827 -1782016
10811 -1782016 -1803156 -1740267 -1991932 -2030414 -1890421 -1994474 -2121525 -2314902 -2471257 -2287275
10801 -2287275 -2334744 -2440296 -2297626 -2009373 -2374950 -2708835 -2775637 -2457439 -2415211 -2567426
10791 -2567426 -2553763 -2405292 -2394474 -2490637 -2938074 -3113477 -2929902 -2821567 -2652887 -2506265
10781 -2506265 -2523529 -2344715 -2098671 -2359575 -2335259 -2512229 -2849621 -2644359 -2501873 -2218101
10771 -2218101 -2127252 -2142715 -2266328 -2426102 -2421511 -2704974 -2727190 -2500741 -2576180 -2570695 -2827777
10760 -2827777 -3006044 -2848058 -2614704 -2332814 -2241036 -2693257 -3143355 -3401775 -3418571 -3234184
10750c234184L1845j5394l23534J1116J89483J8128r8056J43526k40899J05847
10740c412122K59079J89341j42870k40680J71571p1919l56464L1960L4826R2300
10730c444978k41113j28530Q6101L4796N35721k00340m13125o4745n3024K00392
10720c688845J67811R678m8253j96878k64769J45822R8525r7338j86744l76220
10710d437211l42406o8864J17856k61536k37956o7258J26301Q8623j13274k62691
10700e458416r2313r3597l04286J63649R5545o3030j91750p7677l24603j41895
10690f488373j27412m1517j44126m58936k26909R4630q5979K45292K45298j53789
10680g141821l09014m8157l8011j03707j76395Q808j44386l15352L863j38851
$$ plain form
10750 -3234184 -3202339 -3217733 -3541267 -3530151 -3340668 -3322540 -3420596 -3277070 -3517969 -3412122
10740 -3412122 -3153043 -2963702 -3106572 -3347252 -3175681 -3247600 -3604064 -3572104 -3537278 -3444978
10730 -3444978 -3686091 -3814621 -3728520 -3693724 -3158003 -3358343 -3771468 -3836213 -3889237 -3688845
10720 -3688845 -3521034 -3511356 -3559609 -3756487 -4021256 -3875434 -3776909 -3874247 -4060991 -4437211
10710 -4437211 -4779617 -4848481 -4730625 -4992161 -5230117 -5297375 -5171074 -5082451 -5195725 -5458416
10700 -5458416 -5550729 -5644326 -5948612 -5784963 -5689418 -5752448 -5944198 -6021875 -6346478 -6488373
10690 -6488373 -6615785 -6657302 -6801428 -7260364 -7487273 -7392643 -7478622 -7233330 -6988032 -7141821
10680 -7141821 -7450835 -7498992 -7537003 -7640710 -7817105 -7808297 -7952683 -8268035 -8264172 -8403023
10670h403023k85715n3619L1681N7380K35323j76596j41375n8999J62586k58931
10660h891288N4949j6743k49286j73904J61103K5290m57561j57594N5944K08264
10650i440826n4321J27870J08684m63650q7434l461m47820j41022j45180m58440
10640a1005600J90421p3458j59052q0251Q9508K71124K38358P52283L76738O72635
10630h727294J302169J177459R69730Q61607J630930K331575L233106M693514
10622G472796O159740P918424R984865J2149539J3350476J4892255J6662818J8760625
10614A07351538K0682941K1382192J7068319Q835260K641404J739527N786886
10607A85488067J1494039J6383675K1052396K6225458L2882617L9234806L9268443
$$ plain form
10670 -8403023 -8688738 -8742357 -8710676 -8653296 -8417973 -8594569 -8735944 -8794943 -8632357 -8891288
10660 -8891288 -8836339 -8853082 -9102368 -9276272 -9115169 -9089879 -9547440 -9705034 -9649090 -9440826
10650 -9440826 -9495147 -9367277 -9258593 -9722243 -9809677 -9813138 -10260958 -10401980 -10547160 -11005600
10640 -11005600 -10815179 -10888637 -11047689 -11127940 -11038432 -10767308 -10528950 -9776667 -9399929 -8727294
10630 -8727294 -7425125 -6247666 -5277936 -4416329 -2785399 -453824 2779282 7472796
10622 7472796 13632536 21550960 31535825 43685364 57035840 71928095 88590913 107351538
10614 107351538 128034479 149416671 166484990 175320250 177961654 179701181 185488067
10607 185488067 196982106 213365781 234418177 260643635 293526252 332761058 372029501
10600C72029501K5316922Q24290j6718070j7736571q197132L041623J2564989
10593C71125552K0962105K8676978L8224317M5073943L9970063J5096837k3529553
10586E35600242m9400061n0659898l8170755k3000113j0716730j328629P623449
10579C69947505J5344644J9059707J4123973m416693l0342418m5643742m4122288
10572B93950688l3707244k2710013j4643160q256769l219529N8001Q83856k392917
10564B09962913j0461393j9765413k5240166k4545346k0730227j6447667j2634872
10557H0137829r239511o899931n765008m664084l754766l212796k532406k557312
10549D1512015k510497j982278j711737j459054j272861j383652j249581j010865
$$ plain form
10600 372029501 397346423 398170713 381452643 363716072 355518940 358560563 371125552
10593 371125552 392087657 420764635 458988952 504062895 544032958 559129795 535600242
10586 535600242 486200181 435540283 397369528 374369415 363652685 362324056 369947505
10579 369947505 385292149 404351856 418475829 414059136 383716718 338072976 293950688
10572 293950688 260243444 237533431 222890271 214633502 211413973 211471974 212355830 209962913
10564 209962913 199501520 179736107 154495941 129950595 109220368 92772701 80137829
10557 80137829 70898318 63998387 58233379 53569295 49814529 46601733 44069327 41512015
10549 41512015 39001518 37019240 35307503 33848449 32575588 31191936 29942355 28931490
10541B8931490q58865o68277j065369j256484o76657o15092p77132n01394o83001
10532B1829219l30790m48707l60673k40487m37252k94104l47242j31135k66697
10523A8972132q51404k86867p6128m53990n75761k98099j76802n16312o53757
10514A5083012K8190J86890j29148j85474k44683j14413l44814L9509p0287k11648
10504A4037134k43657k54984j24949j96257l62877n25823l40144k21868l98766
10495A1367809j71257K72746J27790J53553L23342l66521k04438l60661j66552
10486A0975811K74420r3184j71369R657j00139J1771M8629l14449j78165j9917
10476A0443065j48517j46346N2227J35821O8399k57094j95365k30147j06752Q0678
$$ plain form
10541 28931490 28072625 27404348 26338979 25082495 24405838 23790746 23013614 22512220 21829219
10532 21829219 21498429 21049722 20689049 20448562 20011310 19717206 19369964 19238829 18972132
10523 18972132 18120728 17833861 17757733 17303743 16727982 16429883 16253081 15736769 15083012
10514 15083012 15111202 15298092 15168944 14983470 14738787 14624374 14279560 14319069 14248782 14037134
10504 14037134 13793477 13538493 13413544 13217287 12854410 12328587 11988443 11766575 11367809
10495 11367809 11196552 11469298 11597088 11750641 12073983 11707462 11503024 11142363 10975811
10486 10975811 11250231 11157047 10985678 10995335 10895196 10906967 10955596 10641147 10462982 10443065
10476 10443065 10294548 10148202 10200429 10336250 10404649 10147555 9952190 9722043 9615291 9695969
10466I695969r0043Q0970O4597m18318l15507J67538K63772m8764j26372l24888
10456H948954l81074k04419j56120l90651o8023J34844o8505k30040p497k82538
10446G294931k0690N5788K03149M1094M6787m05336j12080j8468k3076K43358
10436G305457j46843N0368r3961q3748J97909l10033l25692J92089J46510j70636
10426F761420l86711K48105J70793r962p9647j7731j87103k03414L42216K70027
10416F907993j93787l41422k87752j42658J84618Q3151L8922k80732J9346p5262
10406E912417o5438K37244l41857M6947j54683q0982L97543L79452k85090j35298
10396E910255l3807j6464l82716l01514j23470K79588M31049j50200P4595j41322
$$ plain form
10466 9695969 9605926 9686896 9751493 9333175 9017668 9185206 9448978 9400214 9273842 8948954
10456 8948954 8567880 8363461 8207341 7816690 7748667 7883511 7815006 7584966 7577469 7294931
10446 7294931 7274241 7330029 7533178 7574272 7621059 7215723 7103643 7085175 7062099 7305457
10436 7305457 7158614 7208982 7115021 7031273 7229182 6919149 6593457 6785546 6932056 6761420
10426 6761420 6374709 6622814 6793607 6783645 6703998 6686267 6499164 6295750 6637966 6907993
10416 6907993 6714206 6372784 6085032 5942374 6126992 6210143 6249065 5968333 5987679 5912417
10406 5912417 5846979 6084223 5742366 5789313 5634630 5553648 5951191 6330643 6045553 5910255
10396 5910255 5876448 5859984 5477268 5175754 5052284 5331872 5762921 5612721 5687316 5545994
10386E545994k35509P0476J05921J37558k73277m65265q2435O3381J97777K47752
10376E312373L37653l3341n3556q6421m3361l7893J8291J35678j16083m85795
10366D947545O4603J23495j784j86816o05138l21801L57705J40680Q4945J66172
10356D769606j94123j30051k58682J35416L43604Q5976K36165L8457K42429K07404
10346E476201m14037k10381j74360k09827R006l36119n6280K18763k3491j58218
10336D121257j00673j11377P1840n5373J38904K17987p4403L2300J78K31927k06165
10325D266402k70457P6896J3500q8132L37L45179l7002j30762k42462j08585J37273
10314C962187J01501n78148N1386L81417J81098j16145j92033K15674J86474L19245
$$ plain form
10386 5545994 5310485 5380961 5486882 5624440 5351163 4885898 4803463 4866844 5064621 5312373
10376 5312373 5650026 5616685 5563129 5476708 5433347 5395454 5413745 5549423 5433340 4947545
10366 4947545 5012148 5135643 5133859 4947043 4341905 4020104 4377809 4518489 4603434 4769606
10356 4769606 4575483 4445432 4186750 4322166 4665770 4751746 4987911 5026368 5268797 5476201
10346 5476201 5062164 4851783 4677423 4467596 4476602 4140483 4084203 4302966 4279475 4121257
10336 4121257 4020584 3909207 3981047 3925674 4064578 4282565 4208162 4240462 4240640 4472567 4266402
10325 4266402 3995945 4072841 4086341 3998209 3998546 4343725 4306723 4175961 3933499 3824914 3962187
10314 3962187 4063688 3485540 3536926 3918343 4099441 3983296 3791263 4006937 4193411 4512656
10304D512656j22313j23255Q031p1398J77028k20664J3755M7875k89083l37291
10294C595341L6893p6203Q9371r772k24523L3172L22528j87652l28999N0080K97630
10283C597866m6775N3664J46553L8550l46731P3199m3803k07839k31383J46304
10273C179605J84602K12753Q8794r3776k5555O4090M2015q40258l68173M12612
10263B856709p3809N364L01064R8474M6311o3442k92090j20174K53389M27205
10253C439001N2689j44878o1838J48334j42070l7664j01340K1894M47002o9994
10243C551136N1900j40848m20309j08191j34601l7287L54980K0772m04118L69358
10233C102792N29301K038o16608M5081J98936J34788k69906l86006l17972L3371
$$ plain form
10304 4512656 4390343 4267088 4275119 4203721 4380749 4160085 4173840 4221715 3932632 3595341
10294 3595341 3632234 3556031 3645402 3635630 3411107 3444279 3766807 3579155 3250156 3300236 3597866
10283 3597866 3551091 3604755 3751308 3789858 3443127 3516326 3472523 3264684 3033301 3179605
10273 3179605 3364207 3576960 3665754 3571978 3546423 3610513 3652528 2812270 2444097 2856709
10263 2856709 2782900 2788264 3089328 3187802 3234113 3170671 2878581 2758407 3011796 3439001
10253 3439001 3491690 3346812 3284974 3433308 3291238 3253574 3152234 3174128 3621130 3551136
10243 3551136 3603036 3462188 3041879 2933688 2799087 2761800 3116780 3137552 2733434 3102792
10233 3102792 3632093 3634131 3017523 3062604 3261540 3396328 3126422 2740416 2422444 2455815
10223B455815M62398J08821l2558k25758J74903J73401j43102K03545r2796l92243
10213B692426l0546k48191K27846K86361j24239J50138M32491j74576k69674J18701
10203C060737J20469Q8887M5182P6740j00867k52674j45680q3777p6761P8931
10193B811187L91101k44433n15906l03963M18589J17813R7256J45096M8920j09308
10183B856352k23542K42546J938L48854K02422J87298K08359J0271K25830p6245
10173C984083j73431k52983K50944M29061J80935k3132j55874p0018J01774K33561
10163D504920K94577n11759M2178J57828K46197J63911M3781j73699K47877N64692
10153E580503J55481J12666k63737k32748k56917q8372j28070j43113l57613j97646
$$ plain form
10223 2455815 2918213 3027034 2994476 2768718 2943621 3117022 2973920 3177465 3084669 2692426
10213 2692426 2661880 2413689 2641535 2927896 2803657 2953795 3386286 3211710 2942036 3060737
10203 3060737 3181206 3270093 3315275 3392015 3291148 3038474 2892794 2809017 2732256 2811187
10193 2811187 3202288 2957855 2441949 2137986 2556575 2674388 2771644 2916740 2965660 2856352
10183 2856352 2632810 2875356 2877294 3226148 3428570 3615868 3824227 3834498 4060328 3984083
10173 3984083 3810652 3557669 3808613 4237674 4418609 4395477 4239603 4169585 4271359 4504920
10163 4504920 4799497 4287738 4329916 4487744 4733941 4897852 4941633 4767934 5015811 5580503
10153 5580503 5735984 5848650 5584913 5352165 5095248 5006876 4878806 4735693 4378080 4180434
10143D180434l0184M74439K5300m8968J57484k34372k34737j48485k48181k7263
10133C865467l41259j50595K52382M9585R0348J97084k46437k83722n07229M9572
10123B975196l0890l51616K25590J44159j07050l21263l24168l20979O47384J71203
10113B707566j70235j75124K65702L4089P4040K1735l1502R5654r1263k6489j23558
10102B580615M8096J02547k43026m49814l51605K29107K30566J40619j54285j78426
10092A954394J03130j05918j86930Q038K04081l0712J29696j89906M5079K14520
10082B145472j50352P0250R193K8038k0933q0588J01110N10255J30968m02719
10072B340694l71270J34319K24703J88115j09492J19790j00269l68683j88782
$$ plain form
10143 4180434 4150250 4624689 4649989 4601021 4758505 4524133 4289396 4140911 3892730 3865467
10133 3865467 3524208 3373613 3625995 3675580 3765928 3963012 3716575 3432853 2925624 2975196
10123 2975196 2944306 2592690 2818280 2962439 2855389 2534126 2209958 1888979 2536363 2707566
10113 2707566 2537331 2362207 2627909 2661998 2736038 2757773 2726271 2821925 2730662 2704173 2580615
10102 2580615 2628711 2731258 2488232 2038418 1686813 1915920 2146486 2287105 2132820 1954394
10092 1954394 2057524 1951606 1764676 1772714 1976795 1946083 2075779 1885873 1930952 2145472
10082 2145472 1995120 2065370 2074563 2102601 2081668 2001080 2102190 2612445 2743413 2340694
10072 2340694 1969424 2103743 2328446 2516561 2407069 2526859 2426590 2057907 1869125
10063A869125K59743O7642J47626o3323l22045N6169M98457K73741r5926l33321
10053B357888k12721q622K0620P7548L84381J44645n5836N1810j08999j79652
10043B471062l31976k4037o7434P7746K0171N9789K5479L932N00426j06279l67296
10032B261583M9569O6302N5315l7359k64874k00339k93689j39904p0995K89359
10022A714968N53402J26869k33128k1002l6195J33330l82347j97070j40222K24316
10012A742921o7213J53190L55058k59179K1925j92136K38768J34461k34192L23241
10002B216844J45626j1209k66227k1042j09312J5402J81468Q1912k65384j85038
9992A783040K33443K99656j94203n6616l27484q94L34322m9479J40055K12095
$$ plain form
10063 1869125 2128868 2196510 2344136 2280813 1958768 2014937 2513394 2787135 2691209 2357888
10053 2357888 2145167 2136545 2157165 2234713 2619094 2763739 2707903 2759713 2650714 2471062
10043 2471062 2139086 2115049 2047615 2125361 2145532 2205321 2230800 2234732 2735158 2628879 2261583
10032 2261583 2311152 2377454 2432769 2395410 2130536 1930197 1636508 1496604 1425609 1714968
10022 1714968 2268370 2395239 2162111 2141109 2104914 2238244 1855897 1658827 1518605 1742921
10012 1742921 1675708 1828898 2183956 1924777 1946702 1754566 1993334 2127795 1893603 2216844
10002 2216844 2362470 2351261 2085034 2063992 1954680 1970082 2151550 2233462 1968078 1783040
9992 1783040 2016483 2316139 2121936 2065320 1737836 1736942 2071264 2021785 2161840 2373935
9982B373935J15550J9737k42995l93925K30224J00058k43050k52243Q2711J81171
9972A971173J9193J18335l1648j89318j24289K39030k93084j19828j09414j57290
9962A322860o0838J89269J31363Q6372L44263n9070L2033k2875J17012q7943n45674
9951A446772k60805M38153j32701j29316j32874K23269M32445j20267N3822O8589
9941A887087k5741k9631k9366j62870J56941k13832K58688K5534j22697o5872
9931A678241K7810O8419R7189P5638J52623J99205Q5542K3800p1913R2235k9897
9920B398892l43941k05197j08190R0166n1483R7161N7954j53643L2639j01067
9910A713291k71820L72549J40716o5256l98385k13799q3746j66519L82332M99446
$$ plain form
9982 2373935 2489485 2509222 2266227 1872302 2102526 2202584 1959534 1707291 1790002 1971173
9972 1971173 1990366 2108701 2077053 1887735 1763446 2002476 1709392 1589564 1480150 1322860
9962 1322860 1262022 1451291 1582654 1669026 2013289 1954219 1986252 1963377 2080389 1992446 1446772
9951 1446772 1185967 1624120 1491419 1362103 1229229 1452498 1884943 1764676 1818498 1887087
9941 1887087 1861346 1831715 1802349 1639479 1796420 1582588 1841276 1866810 1744113 1678241
9931 1678241 1706051 1774470 1871659 1947297 2099920 2299125 2384667 2408467 2336554 2428789 2398892
9920 2398892 2054951 1849754 1741564 1831730 1780247 1877408 1935362 1781719 1814358 1713291
9910 1713291 1441471 1814020 1954736 1889480 1491095 1277296 1193550 1027031 1409363 1908809
9900A908809q6966j92393J03655J12906l01066R1347J00408o5441O0112J43159
9890A874530m4451l06472j8311J55159j20603j4118M08200J42125j78466k24898
9880A672695j99122J47891k26204k76959j22621N4915L38540K36049j03143r6180
9870A425861J32608J5437M91505j16550m48614k48751J11958K07359N1249l30239
9860A291823l39848L30571j15228K6229J30808R4967J88597j47316m68740r7224
9850H94639J1011M40605J98273j40607J7307J53187r9893j20900n6557j43999
9840A153066J71319L4255j12961j94821K71519o8322k78721J34931L47180K06191
9830A663636J50152j74204m34977l06919N5574K75599J52982j75181j13995J55856
$$ plain form
9900 1908809 1821843 1629450 1733105 1846011 1544945 1636292 1736700 1671259 1731371 1874530
9890 1874530 1830079 1523607 1505296 1660455 1539852 1525734 1933934 2076059 1897593 1672695
9880 1672695 1473573 1621464 1395260 1118301 995680 1050595 1389135 1625184 1522041 1425861
9870 1425861 1558469 1573906 2065411 1948861 1500247 1251496 1363454 1570813 1622062 1291823
9860 1291823 951975 1282546 1167318 1193547 1324355 1419322 1607919 1460603 991863 894639
9850 894639 905650 1346255 1544528 1403921 1421228 1574415 1474522 1353622 1297065 1153066
9840 1153066 1324385 1358640 1245679 1050858 1322377 1254055 975334 1110265 1457445 1663636
9830 1663636 1813788 1639584 1204607 897688 953262 1228861 1381843 1206662 1092667 1248523
9820A248523k15954p1284L8741l5596R9584J97479J74511K30926q5314p7155k90594
9809A213867o4611L41K03356o7509k57124J78195k11815k2106K99461K44869N0263
9798A567187l8155j32395J26025K59958J43311k45690j20810K696p1832l69527
9788A120768k07964K20912J54023M2925J05376P8887j350L8614J4102K6461J11610
9777A704364j1629q1853k47954k68740l01786N4426l3846j85716J08599J18204
9767H54069K6898j04825R5574j1682Q8526L34795K61692J47823J28131l2881l62553
9756A425567P4504k21226K32797j4850o7382k95325Q8955l7947m5911m5378k92909
9745H00895j09047J16499J11833J87634J31249K57082r9246k02061R7786N12889
$$ plain form
9820 1248523 1032569 961285 1000026 964430 1064014 1261493 1436004 1666930 1581616 1504461 1213867
9809 1213867 1149256 1149597 1352953 1285444 1028320 1206515 994700 972594 1272055 1516924 1567187
9798 1567187 1529032 1396637 1522662 1782620 1925931 1680241 1559431 1562127 1490295 1120768
9788 1120768 912804 1133716 1287739 1330664 1436040 1514927 1513577 1552191 1566293 1592754 1704364
9777 1704364 1692735 1610882 1362928 1094188 792402 846828 812982 627266 735865 854069
9767 854069 880967 776142 871716 860034 948560 1283355 1545047 1692870 1821001 1788120 1425567
9756 1425567 1500071 1278845 1511642 1496792 1429410 1134085 1223040 1185093 1139182 1093804 800895
9745 800895 691848 808347 920180 1107814 1239063 1496145 1396899 1194838 1292624 1805513
9735A805513J20214j17121K1016J46847j25826J299j51393l9769J68157R2204
9725A921141l39232j28831m3680j54335M08494J80926k17413J83355J83534k78386
9715A715573j34997Q7521p5564J02975m93367Q9580K9499N3905K54917O3975k18682
9704A475335n4065M50191J02849n58117l12884j07306L22764J31846K20948m4039
9694A627522O9563j89904r0517k04851p6512j94280j977J91297L73665j51501
9684A352505j4664L94028J1650k44883l52253n2740n1980O7945j59124j58709
9674G91775J34805K92715L66338K6206J72308j01632n20187r064J30111L27648
9664A611023k75076j37550q5998Q4075L28524J05151J66326k3216p9618j36971
$$ plain form
9735 1805513 1925727 1808606 1829622 1976469 1850643 1851942 1700549 1660780 1828937 1921141
9725 1921141 1581909 1453078 1409398 1255063 1663557 1844483 1627070 1810425 1993959 1715573
9715 1715573 1580576 1668097 1592533 1695508 1202141 1291721 1321220 1375125 1630042 1694017 1475335
9704 1475335 1421270 1871461 1974310 1416193 1103309 996003 1318767 1450613 1671561 1627522
9694 1627522 1697085 1507181 1416664 1211813 1135301 941021 939044 1130341 1504006 1352505
9684 1352505 1337841 1731869 1743519 1498636 1146383 1093643 1041663 1109608 950484 791775
9674 791775 926580 1219295 1585633 1611839 1784147 1682515 1162328 1153264 1283375 1611023
9664 1611023 1335947 1198397 1112399 1196474 1524998 1630149 1796475 1773259 1693641 1556670
9654A556670n1726K20181L29598L8731k66829J76291M51957O01065O37797O30502
9644D324237m47867j091282l78367k37756k66120j58448J9433j35992K26423J44195
9634A998456n04752j9116J19487n01951j7989J64876o16j51305M2149K11428k73738
9623A066929l41834L8721M65925J3264R1836j12299j06913k45052J58307J89137
9613A218021K29326p2419J06156m4585q505J38872m7543j67117k61763L9026j10492
9602A018977p6200l50361J51178L58850P3487j85024j40512m69062J30528J37404
9592F49265J04530Q5286K30544j25482l5392J22284J03742k23045M5937P1613
9582A029282L26845J49801j37591m0114p2410R3316j30762R5256m1466j33360
$$ plain form
9654 1556670 1504944 1725125 2054723 2093454 1826625 2002916 2454873 3055938 3693735 4324237
9644 4324237 3876370 2785088 2406721 2168965 1902845 1744397 1763830 1627838 1854261 1998456
9634 1998456 1493704 1474588 1594075 1092124 1074135 1239011 1238395 1087090 1129239 1340667 1066929
9623 1066929 725095 763816 1229741 1243005 1334841 1222542 1115629 870577 1028884 1218021
9613 1218021 1447347 1374928 1481084 1436499 1427994 1566866 1519323 1352206 1090443 1129469 1018977
9602 1018977 942777 592416 743594 1102444 1175931 990907 850395 381333 511861 649265
9592 649265 753795 839081 1069625 944143 908751 1031035 1134777 911732 957669 1029282
9582 1029282 1356127 1505928 1368337 1328223 1255813 1349129 1218367 1313623 1272157 1138797
9572A138797J29551j86042k11126Q530O0545L30676K99326j32898M3351j95128
9562A285582m77192N1433L13958K04818L8814l91153k87907L42849K15842k63630
9552A033414k15031k87044m55780K46405P69174L00872p8347J74991j39330O8595
9542A417919j74336j6858j02172j0192L948l25216K07069K0802n3115m1128j75243
9531G51478M60993K97330l39888j55917R7820M8503L0900j07202k43233L6968
9521H77752J08492P4985K00399j06427O227K33747N1299J09102m0910j37356l63583
9510A013727k50849j41601L1643J69696K52517K70122L7476O7743P2111j97406
9500A325179q6977K76733k05200J57825J04815l26420k69563m3816L5021j2127
$$ plain form
9572 1138797 1268348 1082306 871180 879710 940255 1270931 1570257 1437359 1480710 1285582
9562 1285582 808390 859823 1173781 1378599 1417413 1026260 738353 1081202 1297044 1033414
9552 1033414 818383 531339 75559 321964 1091138 1392010 1313663 1488654 1349324 1417919
9542 1417919 1243583 1226725 1124553 1114361 1118309 793093 1000162 1020964 967849 926721 751478
9531 751478 1212471 1509801 1169913 1013996 1111816 1160319 1191219 1084017 840784 877752
9521 877752 986244 1061229 1261628 1155201 1161428 1395175 1446474 1555576 1514666 1377310 1013727
9510 1013727 762878 621277 652920 822616 1075133 1345255 1382731 1450474 1522585 1325179
9500 1325179 1238202 1514935 1309735 1467560 1572375 1245955 976392 932576 967597 955470
9490I55470k08839k08702J11226J11782p4949L7364q2098K07272J35633r7405
9480H86754Q3261k10624l53569L8424K73627K33436O1924j69527k29593k02980
9470D11133Q0081N46234L73444j78930j91921q2037M861m2161l34476k2148K87096
9459H51176L34156L6894j72118K66377J20084l03128p3531J19360p5598j77893
9449I25779j52875Q9723j38351k27935j28789j30523j41164J31695m5215r6847
9439H5498L8071R1146P9116M701o8108M09958m1776m07740J75357K43679L2891
9428F42793p5690J50678K01557K3522j23461j13660J0834J7221K1845j20233K52128
9417H87534J36533j72979j51245J41066K64399M7054k7424l06671l38526M03086
$$ plain form
9490 955470 746631 537929 649155 760937 685988 723352 641254 848526 984159 886754
9480 886754 970015 759391 405822 444246 717873 951309 1013233 843706 614113 411133
9470 411133 491214 1037448 1410892 1231962 1040041 958004 962865 920704 586228 564080 851176
9459 851176 1185332 1222226 1050108 1316485 1436569 1133441 1059910 1179270 1103672 925779
9449 925779 772904 862627 724276 496341 367552 237029 95865 227560 182345 85498
9439 85498 123569 214715 293831 298532 230424 640382 598606 190866 366223 609902 642793
9428 642793 567103 717781 919338 942860 819399 705739 716573 733794 755639 635406 887534
9417 887534 1024067 851088 699843 840909 1105308 1152362 1124938 818267 479741 882827
9407H82827K63381K51327n3492l31033j87426k65058k8803J63742M15717L6939
9397A148121m2918k9263n7959J4478K04802m25977l02302R008K82158K02397l68325
9386F34220O3859P5854J25150q7606l1539r8235j0871J08933O8505J47416M02853
9375A398539K69780l92856j43922P3960p2596k41240L8316m0900j25211L43K62118
9364A026331K16327j11205j32163m4948j26164k38066L20979J13201l05337j73885
9354E45070j04050o7665L75021J89209k985m13573j69761k14690K15947J40273
9344D92796P0509L43090K6502Q2170L80811K07671j51702l69335m50484p3655
9334E58373J9051J97230K07970K58959j12027m23083k947J78063j37894j08624
$$ plain form
9407 882827 1146208 1397535 1344043 1013010 825584 560526 531723 695465 1111182 1148121
9397 1148121 1105203 1075940 1017981 1032459 1237261 811284 508982 517990 800148 1002545 634220
9386 634220 698079 773933 899083 811477 779938 681703 670832 779765 848270 995686 1398539
9375 1398539 1668319 1275463 1131541 1205501 1132905 891665 929981 889081 763870 764213 1026331
9364 1026331 1242658 1131453 999290 954342 828178 590112 911091 1024292 718955 545070
9354 545070 441020 373355 748376 937585 934600 521027 351266 136576 352523 492796
9344 492796 563305 906395 932897 1015067 1395878 1603549 1451847 1082512 632028 558373
9334 558373 577424 774654 982624 1241583 1129556 706473 703526 881589 743695 635071
9324F35071K03159j453L2734j90886q874K7284l85037k96442J9748m9918Q4398
9313F9784J68893L32499l9102l1668K0374R5754L16747J32622j47430m57244k22809
9302B38420K98695K44758K95653K31320m89035l08100Q3019K45720J89700P6760
9292A106910k37265m38406l35301P1699j0300L09097L23453P7439n6641l13132
9282D97553O2298J49851j84316L00000Q6983J18530n9105L782L0755p0221k8271
9271I07839j36727k10574k16101j61676K24044M94873o7913k47505k41258J34804
9261D79806K96785P283k10234o8530r7345J67233j98717Q4104k30719J19096J3365
9250C62127j00350k40561l6261J01102J30345L14891K22836K75162k22376k25750
$$ plain form
9324 635071 838230 836777 869511 678625 669751 697035 311998 15556 35304 -14614 69784
9313 69784 238677 571176 532074 500406 520780 616534 933281 1065903 918473 461229 238420
9302 238420 537115 781873 1077526 1308846 819811 511711 594730 840450 1030150 1106910
9292 1106910 869645 431239 95938 167637 157337 466434 789887 867326 810685 497553
9282 497553 559851 709702 525386 825386 912369 1030899 971794 975576 1006331 936110 907839
9271 907839 771112 560538 344437 182761 406805 901678 833765 586260 345002 479806
9261 479806 776591 783874 573640 505110 407765 574998 376281 460385 229666 348762 362127
9250 362127 261777 21216 -15045 86057 216402 531293 754129 1029291 806915 581165
9240E81165k67132M3131o5197o5072R5931K0756k49176J81563K2807J3231L37584
9229F49591K02551L37814k87833k57065Q7936K64964J62874j23833l76788j93510
9219D66701K96223K45676k64479R2012n6299l39578o6153M03392j38024Q2189
9209G21660N06155K89358k48803l28163l96901j21792l9792K2790L40874M9784
9199G95170m12126K647K75082K4044l44057p0415j37160K6604L92430K93739J31792
9188I77750j7163K52238m9379k45251m62228j36674j17046j17316J66528L29692
9178E81151j8379N2163j87272j78666j09805j60136L87131K27489P2369j26185
9168E39860r130J77565o3437R707p4034J37087n6962l01283L58544J55911j18441
$$ plain form
9240 581165 314033 357164 291967 226895 322826 343582 94406 275969 298776 312007 649591
9229 649591 852142 1189956 902123 645058 732994 997958 1160832 1036999 660211 466701
9219 466701 762924 1008600 744121 836133 779834 440256 374103 777495 639471 721660
9209 721660 1227815 1517173 1268370 940207 543306 421514 381722 404512 745386 795170
9199 795170 383044 385691 660773 684817 340760 270345 133185 159789 552219 845958 977750
9188 977750 960587 1212825 1163446 918195 455967 319293 202247 84931 251459 581151
9178 581151 562772 614935 427663 248997 139192 -20944 366187 593676 666045 539860
9168 539860 530730 708295 644858 654565 580531 717618 660656 359373 717917 873828 755387
9157G55387R3973n1647K48545l7720l64940M6921k10563k557n2830j20368r512
9146B94689M35650M17637O5137k80107k71818q0615N3630k28386Q6109L1723J6802
9135E40451J69365j68803j61734Q5630J19076L69561K09442l11277j82725k47161
9125D21825k3519j51210J3422K08568P9108J74731m39470q6070L4857q394l7935
9114A85913o7062J0060N2209R5997J35870J11171L223K78910J30381l3169j31250
9103G72253j23285N71J17074l22304J73215J88686j35163m37289J16701n5000
9093B95459O1922k35172m3469K85424j53211p6197l0607J74684K09171J26984
9083F14988j70715j82013r6408l7194l3753K2636M93558J41492K692j55730J52122
$$ plain form
9157 755387 849360 797713 1046258 1008538 643598 690519 479956 477399 424569 304201 294689
9146 294689 730339 1147976 1213113 933006 661188 580573 634203 405817 491926 523649 540451
9135 540451 709816 541013 379279 464909 583985 953546 1162988 851711 668986 421825
9125 421825 398306 247096 260518 469086 548194 722925 283455 197385 232242 223848 185913
9114 185913 118851 128911 181120 277117 412987 524158 527381 806291 936672 903503 772253
9103 772253 648968 649539 766613 444309 617524 806210 671047 233758 350459 295459
9093 295459 357381 122209 78740 364164 210953 134756 104149 278833 488004 614988
9083 614988 444273 262260 165852 128658 94905 117541 611099 752591 755283 599553 751675
9072G51675J28762k12763j95251q7263j06299k6587L7559L9346L6896L53341j11953
9061F07463j25125j85153j31902l9613L20751p8986k07798R3301K1829K03877
9051D78644J78545J01061k08102k112l73175Q336L1801l40790K00403J28532J71930
9040C75073L20056K6206k07939p959j68356J66003j20262K01144P5171J61847
9030H20984j80125k66712j4704K9242K48162j1292J47584L51240n8998j27365
9020I38016m13176Q8925J75909k07767j18251k6881k3857P3386O159j19816m5916
9009C26731m6001k896l47581j82802P3732O30990J89145m17397M0380J55444J3075
8998D32820j10065p5020K54355j125P9830n6236n60995j52916L44599j99221n120
$$ plain form
9072 751675 880437 667674 472423 385160 278861 252274 289833 329179 366075 719416 607463
9061 607463 482338 297185 165283 125670 446421 367435 159637 252938 274767 478644
9051 478644 657189 758250 550148 548036 174861 183197 214998 -125792 74611 203143 375073
9040 375073 695129 721335 513396 505437 337081 503084 382822 583966 659137 820984
9030 820984 640859 374147 359443 388685 636847 625555 773139 1124379 1065381 938016
9020 938016 524840 613765 789674 581907 463656 436775 412918 486304 492463 372647 326731
9009 326731 280730 277834 -69747 -252549 -178817 452173 641318 223921 264301 419745 432820
8998 432820 322755 247735 502090 500965 580795 524559 -36436 -189352 155247 -43974 -49094
8987d9094K2357K06742L87672M30771J5506l84610J74278j46293k20460Q2800
8977E19669k61314J76981K88047J812j55056K08494J76854k43889k17654j11822
8967C82122J35614K57854j08544k47250K78757K43338O210M9265k87017j69372
8957E40977j9842J48120J46009o6189r8883l2663m43847p5037N84855M73692k60492
8946H96700o4063Q781k35642j98607J70892l5677K15569R871K1225J70472k03996
8935G55525r1240M4721P0498j38870p2804Q4721p1358j36652j13515L5923r8768
8924B68181k11138J70724J40225j33485j28426K25245k39966j13071K17858M21721
8914F17868k171r5183l19264l75950R8404J02460K22142Q8853j8312j70147p5921
$$ plain form
8987 -49094 -26737 180005 567677 998448 1013954 629344 803622 657329 436869 519669
8977 519669 258355 435336 723383 725195 570139 778633 955487 711598 493944 382122
8967 382122 517736 775590 667046 419796 698553 941891 948101 997366 710349 540977
8957 540977 521135 669255 815264 749075 650192 617529 173682 98645 683500 1157192 896700
8946 896700 832637 841418 605776 407169 578061 542384 757953 767824 789049 959521 755525
8935 755525 664285 709006 779504 640634 567830 652551 581193 444541 331026 366949 268181
8924 268181 57043 227767 367992 234507 106081 331326 91360 -21711 196147 617868
8914 617868 615697 520514 201250 -174700 -76296 26164 248306 337159 318847 148700 72779
8903G2779j28127M9920L41775L55325q3544n2882j82275j18193J38859m8069J1808
8892C57376N3939k62898K10313M53950k5878l1006J09418J54222k51095j8659
8882G49682M8458m30131m26404j95282j48555N04228M72626L44099k22255m1888
8872F54578J0986k42880o64698l48349K61585M36151K98117m9150l11166j40034
8862i4860j69953o3064M02063K69335N8781q0651k99072j83201N1843r167K19254
8851A01308j1437J71112P3760k59108k40257K64656K16223q1423Q6366M03038
8841G24238M7101k12753j55247q5899P1867L20020m3825k05710l19843n9496q01
8830G9652J63972q7718N0624K31641l16787o838K78455J25116o0147N740J67754
$$ plain form
8903 72779 -55348 -5428 336347 691672 608128 555246 372971 254778 393637 345568 357376
8892 357376 411315 148417 358730 812680 786802 755796 865214 1019436 768341 749682
8882 749682 798140 368009 -58395 -253677 -402232 101996 574622 918721 696466 654578
8872 654578 665564 422684 -242014 -590363 -328778 107373 405490 356340 45174 -94860
8862 -94860 -264813 -327877 74186 343521 402302 321651 22579 -160622 -108779 -117946 101308
8851 101308 89871 260983 334743 75635 -164622 100034 316257 234834 321200 724238
8841 724238 771339 558586 403339 317440 389307 709327 665502 459792 139949 80453 79652
8830 79652 243624 155906 206530 438171 121384 114546 393001 518117 457970 463710 631464
8819F31464j41924l32308k1707J3817o8687j05307K46630O9682J25485j50865
8809B66280j10365L0983r0015l41901j0899R629j00783J50891K73590K11754O8557
8798C57721K86771M953m10833k10723j60768m6969L75261K34664m0912J0241K5460
8787D24866j2670l19326k04615J06148K34311K11318l5790J7166p0257K4928j42370
8776B33709j4587J32339j89842L3369K73678J2918k07745k20893j84597K9027
8766a02624J75617q7271K01096J25415L56033J76525j93456J06954J50049N22784
8756A431122L50466M90357K2524K72191O53306N97311q7509p02054o60024l73971
8746A993719j72251n53776p8999N6841Q4338j79899K0959r8129j61045J69392
$$ plain form
8819 631464 489540 157232 135525 149342 80655 -24652 221978 291660 417145 266280
8809 266280 155915 186898 96883 -245018 -255917 -246288 -347071 -196180 77410 289164 357721
8798 357721 644492 649445 238612 27889 -132879 -179848 195413 430077 389165 399406 424866
8787 424866 412196 92870 -111745 -5597 228714 440032 404242 421408 351151 376079 233709
8776 233709 219122 351461 161619 194988 468666 481584 273839 52946 -131651 -102624
8766 -102624 72993 -14278 186818 312233 668266 844791 651335 758289 908338 1431122
8756 1431122 1781588 2271945 2294469 2566660 3219966 3817277 3729768 3027714 2367690 1993719
8746 1993719 1821468 1267692 1188693 1245534 1329872 1149973 1170932 1072803 911758 1081150
8736A081150l23538r3920J59283j12561M1358J33764M4311k37339K4679l86065
8726C31122q0986K4944Q7689j40705l1104K20411J47283K88654O48550N62387
8716B058245L95402n5581O7390L43783M21297N27546K79611l40598r92329m66457
8706B238309l70725k52887m4090k31045k05835J08437K3282K7546l29850m32153
8696E30989j64860j51386M1124N1935R8622P8028m83494k50518L67867N39736
8686F58043M47127K4188k65659k62883K5439P1585j91823J09427L6430k23760
8676D28114m18193p6362J39422M1502R2236J54104M24467K92603k11896l53448
8666E12549k10136J76467O3780K8161j62203o9159j57646j2374j7796Q1845k9192
$$ plain form
8736 1081150 757612 663692 822975 710414 751772 885536 929847 692508 717187 331122
8726 331122 250136 275080 362769 222064 190960 411371 558654 847308 1495858 2058245
8716 2058245 2453647 2398066 2465456 2809239 3230536 3758082 4037693 3697095 2704766 2238309
8706 2238309 1867584 1614697 1570607 1339562 1133727 1242164 1265446 1292992 963142 530989
8696 530989 366129 214743 255867 307802 406424 484452 958 -249560 118307 658043
8686 658043 1105170 1129358 863699 600816 626255 697840 506017 615444 651874 428114
8676 428114 9921 -66441 72981 114483 206719 360823 785290 1077893 865997 512549
8666 512549 302413 478880 542660 570821 408618 339459 181813 169439 151643 233488 204296
8655B04296Q1175M34327q9546k51533j6617q7407j98097K85264J19770m5204k81360
8644A55068K76659O7803j21340L54924j67531l70023l868M33521L5272l3607K68808
8633H95686J5625m5964k64936k8400J8148k61175J9890M52819J02724j30691j37917
8622F35809j44585j54928R2109q0651o3823J48859J62321r0852j16389J48173
8612E36043M776N0104J02136k66774r2433l8606j45038j8856M78979O0652j80138
8601D90845k65307m32078L06331K26816J94151J909m6589k01583K43765J9068
8591E37328J8850j34946j58049m60709J00462L57397k10144q219M49580K53597
8581G45147J74570l59434l57916N1314K47679L3060K72572L02322L5510l95237
$$ plain form
8655 204296 285471 719798 630252 378719 362102 274695 76598 361862 481632 436428 155068
8644 155068 431727 499530 378190 733114 565583 195560 191692 625213 660485 626878 895686
8633 895686 911311 865347 600411 572011 590159 328984 348874 801693 904417 773726 635809
8622 635809 491224 336296 428405 347754 283931 432790 595111 504259 387870 536043
8612 536043 540819 590923 693059 426285 333852 295246 150208 131352 610331 670983 490845
8601 490845 225538 -206540 99791 326607 520758 522667 476078 274495 518260 537328
8591 537328 556178 421232 263183 -197526 -97064 260333 50189 41970 491550 745147
8581 745147 919717 560283 202367 253681 501360 534420 806992 1109314 1144824 749587
8571G49587L029q4681j06648P6741k94285l13702J09557J95863k60281P0L88511
8560D63761K53724K04504j86599p8372k8343j88541m49419N2780J57184L70315
8550E70994J87545J82488p4466L8120l56191q1122k22020j30156J06311m8480
8540A73023N47615k28310k91051J28828j22002j38965n9083J43368O4119l18640
8530a01098m16537m4543M49709Q5568m5154M44495K28052m80862l57540R3375
8520a44535K97389O6497J36359r868j8175Q6164J74250p1191l4062n0070k18651
8509B14107O34N0990m0948j0273L18797P4768R3649j40321j97878J31634O2656
8498E57815j82717k24542j54591L3082L61662J02163k69982J04362K7250k88694
$$ plain form
8571 749587 752616 667935 561287 638028 343743 30041 139598 335461 75180 75250 463761
8560 463761 717485 921989 735390 657018 628675 440134 -9285 43495 200679 570994
8550 570994 758539 941027 866561 904681 548490 467368 245348 115192 221503 173023
8540 173023 720638 492328 201277 330105 208103 69138 10055 153423 217542 -101098
8530 -101098 -517635 -562178 -112469 -26901 -72055 372440 600492 119630 -237910 -144535
8520 -144535 152854 219351 355710 345842 327667 413831 588081 516890 482828 432758 214107
8509 214107 214741 265731 224783 214510 533307 608075 701724 561403 363525 495159 557815
8498 557815 375098 150556 -4035 29047 390709 492872 222890 327252 354502 65808
8488F5808M1364m0595j2201N8987J27815O9764P5035q2156q5206o9647j26204
8477B2764J69927K4100k3364j7424k55584M9245M8469j0968Q9859P2184J22288
8466B91496K91613K79690J98545n3820j97587j7622j48312j84269k06380J61587
8456D14941J80765l4850R6206L11012q6515J63770o4170m0625K5963K12887j86082
8445I93302l1949R1235p553p1503r9489J41763m1482j97213l86974L62972K63029
8434A016138j09255L0962j39373q9041k79027R882j31615r0694J39128o6961k13520
8423G6624l149j40911P1840k3272k3840k9038j24298L1625J59958k37279P0042
8412a71698K65350M8164m20941n3372J54737L01652O4460L15591l14661j49407
$$ plain form
8488 65808 107172 66577 54376 113363 241178 310942 385977 303821 218615 148968 22764
8477 22764 192691 216791 193427 176003 -79581 -30336 18133 7165 97024 169208 291496
8466 291496 583109 862799 1061344 1007524 809937 792315 644003 459734 253354 414941
8456 414941 595706 560856 657062 968074 881559 1045329 981159 940534 966497 1179384 993302
8445 993302 961353 1052588 1045035 973532 874043 1015806 974324 777111 390137 753109 1016138
8434 1016138 906883 937845 798472 709431 430404 440286 308671 217977 357105 290144 76624
8423 76624 73475 -67436 4404 -18868 -42708 -71746 -196044 -164419 -4461 -241740 -171698
8412 -171698 93652 141816 -279125 -332497 -177760 123892 188352 503943 189282 39875
8402C9875r892q5098q2763N8985L16095j21918Q3099J04123m40814j65956N639
8391b98625L97161Q1605K14517J47482J1800J32M2131N22749k02498l44440l05578
8380B66436j48363r6120k38453L7441J78919K26405M1651j32211k41558n75129
8370f80982L3618K38898J37788J67059R2169J74855P2949K63652J46629k31835
8360D14800R4228p9723m36482j12047j9742k8070r1366K2893L3516K3161j09910
8349b88742M7339Q007q1139l5563M506O15385R0420k7820L91234M66492p1039
8338A119080n73282m56827k70156K04862J67668J63317J22272k70081N1665k17491
8328D1027Q6728m36266k04942J05569R8347m4676K53766n1055p2705J40984M58902
$$ plain form
8402 39875 29983 -55115 -137878 -78893 237202 115284 198383 302506 -138308 -304264 -298625
8391 -298625 98536 180141 394658 542140 553940 554072 596203 1118952 916454 572014 266436
8380 266436 118073 21953 -216500 -179059 -140 226265 267916 135705 -105853 -680982
8370 -680982 -647364 -408466 -270678 -103619 -11450 163405 236354 500006 646635 414800
8360 414800 509028 429305 -7177 -119224 -138966 -167036 -258402 -235509 -201993 -178832 -288742
8349 -288742 -241403 -233396 -314535 -350098 -345592 269793 360213 332393 723627 1190119 1119080
8338 1119080 545798 88971 -181185 23677 191345 354662 476934 206853 258518 41027
8328 41027 127755 -308511 -513453 -407884 -309537 -354213 -100447 -151502 -224207 -83223 375679
8317C75679O5298N9257l2096l08883q8074P6079l8996j6740l79710j34478k64566
8306f87230j9510M10114K43403K7846q602J47074K59263J78472k97313n26126
8296b72609j76759L04049J15382N9823j43993r6593K18112M33560J76779J32240
8286G49991K49887M26924N43415Q16058R06854R63938J642120J975844J122595
8277I397626j044618k531892j898214r94725p16239n83024n3485j49738j78951
8268A246740l35032l98193N8719O7645q6063k28498j23143K86181P8881L1797
8258E99034J36679J55909k26125O4392k45338M5345K39266J77752J59571J21340
8248A227825J52865M53613P49899Q93613L58143M48078J068428J511370K161154
$$ plain form
8317 375679 440977 500234 468138 159255 71181 147260 108264 91524 -288186 -422664 -687230
8306 -687230 -706740 -296626 -53223 -25377 -33979 113095 372358 550830 253517 -272609
8296 -272609 -449368 -145319 -29937 29886 -114107 -210700 7412 440972 617751 749991
8286 749991 999878 1426802 1970217 2786275 3693129 4657067 6299187 8275031 9397626
8277 9397626 8353008 5821116 3922902 2928177 2211938 1628914 1575429 1425691 1246740
8268 1246740 911708 513515 572234 639879 553816 325318 202175 488356 567237 599034
8258 599034 735713 891622 665497 729889 484551 529896 769162 946914 1106485 1227825
8248 1227825 1380690 1834303 2584202 3477815 3835958 4284036 5352464 6863834 9024988
8239I024988Q38664j676907k638011j815612j292211p78371k27242K49229j97042
8230A487485j25491J41117l7895J90315l40642l81951J34678L12425J21714O5989
8220A567744j09796K522K9853k03054j92112m13630l66034k2782j33691m1245
8210A17775L86812J02525k41777q9377k07321j20564N5458O7477M59206J710j62048
8199C69876j03701M2769R4004m12272k1419J01906K17069O8984J88790J53311
8189F99317k53489K29172L71312j15681j27830r9582N7498k3552J27160J64758
8179A029083l00983j48356P1215M3302m9000N3117J17858j42297k19767k98216
8169A55956K3343R700j08828K02178K18152J17192L9388K306j5742r2010k69678
$$ plain form
8239 9024988 9863652 8186745 5548734 3733122 2440911 1662540 1435298 1684527 1487485
8230 1487485 1361994 1503111 1465216 1655531 1314889 932938 1067616 1380041 1501755 1567744
8220 1567744 1457948 1460470 1490323 1287269 1095157 681527 315493 292711 159020 117775
8210 117775 504587 607112 365335 275958 68637 -51927 3531 71008 530214 531924 369876
8199 369876 266175 308944 402948 -9324 -30743 71163 288232 357216 546006 699317
8189 699317 445828 675000 1046312 930631 802801 703219 760717 737165 864325 1029083
8179 1029083 728100 579744 650959 694261 645261 698378 816236 673939 454172 155956
8169 155956 179299 188999 80171 282349 500501 617693 657081 659387 643645 551635 281957
8158B81957P5540n806j46980n7076M64712q8771l95388Q8853Q9938R2642L77792
8147G77413k56680k47866P7296j08323j4374k02961j2525L44234L7111o8005p1625
8136B53695J00788J03822l03130k6173R2819Q2303L24913J70077j55113q896J46087
8125G81192j44133K44756K8421m67670n26208n0788K42778R5454J82580m69Q2917
8114D68830j63221J66030L43454k07088l83857k21396P3428L8652k77223n2306
8104b14697J86026K27426k22957J52694M4446k1358J52604J90667j68393J48472
8094D74930L02373o3737j53064j50521k5710j33344k38047K06203R9687J479n293
8083C14956l5381l73343k64055K35419M81166N49538j37620k97298j71441J564
$$ plain form
8158 281957 357497 351691 204711 147635 612347 523576 128188 217041 306979 399621 777413
8147 777413 520733 272867 350163 241840 227466 24505 11980 356214 393325 325320 253695
8136 253695 354483 458305 155175 129002 221821 304124 629037 799114 644001 635105 781192
8125 781192 637059 881815 910236 442566 -83642 -134430 108348 203802 386382 385913 468830
8114 468830 305609 471639 815093 608005 224148 2752 76180 114832 -162391 -214697
8104 -214697 -28671 198755 -24202 128492 172938 151580 304184 494851 326458 474930
8094 474930 777303 713566 560502 409981 384271 250927 12880 219083 318770 320249 314956
8083 314956 279575 -93768 -357823 -122404 358762 908300 770680 473382 301941 303505
8073C03505j45670P0368j62499J25495K00122n4997k82803J0365R0321k32693
8063g8486J76153J48567j17417k9121L434K56487q2561k07138m11739J61389L60733
8052A80301J14753R4431k726j10411P6711p1910k09805L6224N0139j71550J69673
8041A55830J80092L138j94290J99861k6274J13786m54817Q7825O2702J34295L25480
8030E87628m3108j3044j36155j8783j48540k70161k3969R9172O4532N9456M7101
8019B04129J27096J02572J1634M2331J38901l0879k10940Q2801k31942j22703
8009A13000P8681J46575j5733j61385K3937j22217N2444j11734J8818j70550k14193
7998c62357K66344J53496k4762R9370K78642l20954N9824J86142j77415k95993
$$ plain form
8073 303505 157835 228203 65704 191199 391321 336324 53521 63886 154207 -78486
8063 -78486 97667 246234 128817 99696 103130 359617 277056 69918 -341821 -180432 180301
8052 180301 295054 389485 386759 276348 353059 281149 71344 107568 157707 -13843 155830
8041 155830 335922 339060 144770 344631 318357 432143 -22674 65151 127853 262148 587628
8030 587628 544520 531476 395321 376538 227998 -42163 -66132 33040 97572 157028 204129
8019 204129 331225 433797 445431 487762 626663 595784 384844 467645 235703 113000
8009 113000 191681 338256 322523 161138 185075 62858 115302 3568 22386 -148164 -362357
7998 -362357 -96013 57483 32721 132091 410733 89779 149603 335745 158330 -137663
7988a37663j60602n0775O4739R100K19442K48148J3278j69838l2456L0321K29547
7977B63241k43402J1424L13288J93547k3530l27311m08063P7511P7539l0859q903
7966a05518Q2308J89173K56321P7062j02407j60437j52799K31693K947j82621
7956A35722M5213L902k95371j53115J02217J22278J13525L67414k6724k02369
7946B12692j17972j2207n2382L09J68496j10758j54347J87525K68113j71655n9635
7935A58179K4472k10169k84170N5509L57039j79944J31210J15286k19564J15126
7925F2974J61298n6968k86269R3408L74480m884l04150j62917k85566j3280K25687
7914a96187j79996J26878J78576L8301p4849M72845N2423k84662L6325o7264M3103
$$ plain form
7988 -137663 -298265 -349040 -284301 -275201 -55759 192389 205667 35829 3373 33694 263241
7977 263241 19839 31263 344551 538098 514568 187257 -220806 -143295 -65756 -96615 -105518
7966 -105518 -23210 165963 422284 499346 396939 236502 83703 315396 318343 135722
7956 135722 180935 184837 -110534 -263649 -161432 -39154 74371 441785 415061 212692
7946 212692 94720 82513 30131 30440 198936 88178 -66169 121356 389469 217814 158179
7935 158179 182651 -27518 -311688 -256179 100860 -79084 52126 167412 -52152 62974
7925 62974 224272 167304 -118965 -25557 348923 344039 39889 -123028 -408594 -421874 -196187
7914 -196187 -376183 -249305 -70729 -32428 -107277 365568 417991 133329 169654 102390 145493
7903A45493r0239J38277Q2741N8916m48315n0730M73525J48602j93599p8080k83647
7892i7056r390k8307O0012L27364j37919k22655j49764l00651j03262J73277L49703
7881a38648K21176K73493J89028k18897k38830j55847J96443J79333J52003j44078
7871C15176Q1099m28754k47514J52334J53885K8048L33738J56260l20746k6861
7861A96665j89633j18182N5780k80862K43179M53018P5344L5532l95482l64107
7851b88748O8720K93172K12431K50842k48495k63755k33412m73412J52591K66716
7841b63350R6891j60747j3969R0747J49636J49517J23489l9133j40841J40601
7831A32841K156K02991Q5465j04326j78123j54756j10366j39588O7790l02151
$$ plain form
7903 145493 55254 193531 276272 335188 -113127 -163857 309668 458270 264671 186591 -97056
7892 -97056 -106446 -134753 -74741 252623 114704 -107951 -257715 -558366 -661628 -488351 -138648
7881 -138648 82528 356021 545049 326152 87322 -68525 127918 307251 459254 315176
7871 315176 396275 -32479 -279993 -127659 26226 54274 388012 544272 223526 196665
7861 196665 7032 -111150 -55370 -336232 -93053 359965 435309 470841 75359 -288748
7851 -288748 -220028 73144 285575 536417 287922 24167 -209245 -682657 -530066 -263350
7841 -263350 -166459 -327206 -341175 -250428 -100792 48725 172214 133081 -7760 132841
7831 132841 134997 337988 423453 319127 141004 -13752 -124118 -263706 -195916 -498067
7821d98067k33914M23895k3687j30445M13811J25878k95139K7851K38016J49125
7811A97324L53754M69518r5854n2936p2200l03299j04365N7340J02570j48150
7801D03702J29234j64992k63086j7837q9965K97053J89849J86577k40946m0862
7791C88727R0105j22860J23407k34759p8630j91361Q0203J82874J74783P0282
7781D82771J56839j68048n34892j90351J81475o0225k28J5529P6045l06878l5966
7770c83929J62224M29331m0029P6131L1341n17201o5448J83457q9789R7898N7377
7759e8637O3585j48795L10282o6125k83770j95630L08357K03420K11300j05189
7749B38798j51077q8625J490K63409r7545q9096J540j20625N7015r3446K44954
$$ plain form
7821 -498067 -731981 -308086 -331773 -462218 -48407 77471 -217668 -189817 48199 197324
7811 197324 551078 1020596 924742 871806 799606 496307 391942 449282 551852 403702
7801 403702 532936 367944 104858 87021 -2944 294109 483958 670535 429589 388727
7791 388727 478832 355972 479379 244620 165990 -25371 54832 237706 412489 482771
7781 482771 639610 471562 -63330 -253681 -72206 -132431 -132659 -117130 -41085 -347963 -383929
7770 -383929 -221705 207626 167597 243728 275069 -242132 -307580 -124123 -213912 -116014 -58637
7759 -58637 4948 -143847 166435 100310 -183460 -379090 -70733 132687 343987 238798
7749 238798 87721 -904 586 263995 166450 77354 78894 -41731 15284 -78162 166792
7738A66792j4198r0943j3736k69982o1448J40586J20231L5994j93121O3198N06410
7727C89783m8976M3499P7299j47379j55614j09485Q8230J45842j36487l44626
7717a97914J62915M6356k77556L4211j73611j8578K12282L9708J92858K0009R3128
7706A33808k84834j22531O0773M17133J87583R5192P4042n1093j88396k07057
7696A14620j11271j05361k77599J43987J9528J50233j22414R8228J23497M5507
7686G8955L59K01682l50662j37060J27022M24839J61160p3146r4892J17756j91922
7675B64091j86862k55897l26099k04709K29357M81426L6101j21963J89688L10783
7665D15916j69553Q6724M51369j86810k31002L23864Q7721m65588l03290K03837
$$ plain form
7738 166792 152594 61651 47915 -222067 -283515 -142929 -22698 13296 -179825 -116627 389783
7727 389783 340807 384306 461605 314226 158612 49127 137357 283199 146712 -197914
7717 -197914 -34999 11357 -266199 -231988 -405599 -424177 -211895 -172187 20671 40680 133808
7706 133808 -151026 -273557 -212784 204349 391932 487124 561166 510073 321677 114620
7696 114620 3349 -102012 -379611 -235624 -216096 -65863 -188277 -90049 33448 78955
7686 78955 79314 280996 -69666 -206726 -79704 345135 506295 433149 338257 456013 264091
7675 264091 77229 -178668 -504767 -709476 -480119 1307 37408 -84555 105133 415916
7665 415916 246363 333087 784456 597646 366644 690508 778229 312641 9351 213188
7655B13188K85331m69089K33790Q2006j99913l59011j75489J89060L41197L58244
7645D99314l4184Q4272m8598k55105j81503k59289J22351L62083O7352j36920
7635B19773l46877j33357J2143R9882O7585o6476J68348L70959L81512m56569
7625C16923j31524K5320k78488P5408N8983l36828M9607M22541j86660r587m25705
7614d20010Q3555L65524Q1996k44130j00851m389m4891J23749R2737j92541K51331
7603g920o6447j02011Q1459K4665J68605O0087J32609J91939J69150j94436k43501
7592B14199p6629L40957J08815l29601l57646k12099q5631k8835l4570j6651J24449
7581c53242N9002o4857K02362K47056p3609K02963N0606k43649j12673p3006K65482
$$ plain form
7655 213188 498519 29430 263220 345226 145313 -213698 -389187 -200127 141070 499314
7645 499314 465130 549402 500804 245699 64196 -195093 -72742 289341 356693 219773
7635 219773 -127104 -260461 -248318 -148436 -80851 -147327 21021 391980 773492 316923
7625 316923 185399 210719 -67769 7639 66622 -270206 -220599 201942 15282 5695 -420010
7614 -420010 -336455 29069 111065 -133065 -233916 -238305 -283196 -159447 -66710 -259251 -7920
7603 -7920 -74367 -176378 -94919 -70254 98351 158438 291047 482986 652136 457700 214199
7592 214199 137570 478527 587342 257741 -99905 -312004 -397635 -426470 -461040 -477691 -353242
7581 -353242 -294240 -359097 -156735 90321 16712 219675 270281 26632 -86041 -159047 106435
7570A06435L11445j97684J0782p176l65637L3982m4719m2901m3994J32729N32882
7559D26144J87912J53746j89167q1509k74768m23063J29665J84861k170j15868
7549d217j99843L0539J70298J16852J44140R083r5602p7486O9766J88268j60603
7538A91195N1402j35683k90786l79486J8514J96480L97336J31409m11977k13606
7528d45202r6414J46094K03519k72850K9143M2878J68335J23052m05330O8024
7518d38751L79314J51984j19565L0223J64174l74671k4529M30120k16805j87249
7508b05755l8587j53681L62708J84405J47642k5053j47087j2772J3349N602P1993
7497B02764k07169J31677J9564Q9313k77618m36382m6045O0786R1884N42843M15808
$$ plain form
7570 106435 417880 220196 230978 223802 -141835 -107853 -152572 -195473 -239467 -106738 426144
7559 426144 614056 767802 578635 497126 222358 -200705 -71040 113821 111651 -4217
7549 -4217 -204060 -173521 -3223 113629 257769 266852 171250 93764 163530 351798 191195
7538 191195 242597 106914 -183872 -563358 -544844 -348364 48972 180381 -231596 -445202
7528 -445202 -541616 -395522 -192003 -464853 -435710 -392832 -224497 -101445 -506775 -438751
7518 -438751 -59437 92547 -27018 3205 167379 -207292 -231821 198299 -18506 -205755
7508 -205755 -244342 -398023 -35315 149090 296732 271679 124592 111820 125169 130771 202764
7497 202764 -4405 127272 146836 236149 -41469 -477851 -523896 -463110 -371226 171617 587425
7486E87425j42677k35747j47305k14253J52502J17083q7404q978q9284o3545L67774
7475B35591k8373m1786n7304n417q0128P9982P5866N8810j32896J0501K900k69059
7463a51313J76512J69180j10826k92973K4615K63216K61984m8762l7721P4660
7453C28572l4826q3747j12308j68985J98154L4205J31731K8547J84187L1951J66779
7442G04260k46652j25682m37067k10014K17531j4868j99725L1531Q0474J15276
7432h4936K97949K8500j67851p9691m4285P403O0245n2668j3759J48446j50728
7421e1375j29137j27812L3906M45667K81511L7253k36868m29814j47701L76505
7411E2135J07749J93008r3172j16393m1185j99363j690Q4796l7838k08834k51152
$$ plain form
7486 587425 444748 209001 61696 -152557 -55 117028 29624 20646 -68638 -132183 235591
7475 235591 207218 165432 108128 102711 22583 102565 178431 237241 104345 114846 117746 -151313
7463 -151313 25199 194379 83553 -209420 -184805 78411 340395 291633 253912 328572
7453 328572 293746 209999 97691 -71294 126860 161065 292796 321343 505530 537481 704260
7442 704260 457608 331926 -105141 -315155 -97624 -112492 -312217 -280686 -200212 -84936
7432 -84936 213013 241513 73662 -6029 -50314 -42911 17334 -35334 -49093 99353 -51375
7421 -51375 -180512 -308324 -274418 171249 452760 490013 253145 -176669 -324370 52135
7411 52135 159884 352892 259720 143327 102142 -97221 -98911 -14115 -51953 -260787 -511939
7400e11939K96248L90460K96088l35457l99614J52500k22632l54793N7296J88224
7390d43619K59332J37272l0567k0982K09973K88131j35040l26684k32007l37754
7380f31945r7309K25771K3086q3517j85433J30037J02410N12902Q8535k66537
7370a82000l34414P7878K93489Q2577k64194o313M7138J26395K13819O628K85364
7359C46367K32407m12367l95882R2926L07052N5425k63816k81015J63595J17035
7349c8273P8365k86016k2687K34254J86930m9720J05688O5696k03642k63808l8036
7338b31249L43659k16888k84827L34411J70784j18674j52458o2225L19768P1891
7328A74192J50303j4810k8765j16484L53092k04976n13856p8847j9282L9379N20707
$$ plain form
7400 -511939 -215691 174769 470857 135400 -264214 -111714 -334346 -689139 -631843 -443619
7390 -443619 -184287 -47015 -77582 -98564 111409 399540 264500 -62184 -294191 -631945
7380 -631945 -729254 -503483 -480397 -563914 -749347 -619310 -516900 -3998 84537 -182000
7370 -182000 -516414 -438536 -145047 -62470 -326664 -332977 -285839 -159444 54375 61003 346367
7359 346367 578774 166407 -229475 -136549 170503 225928 -37888 -318903 -155308 -38273
7349 -38273 40092 -245924 -268611 -34357 152573 102853 208541 274237 70595 -193213 -231249
7338 -231249 112410 -104478 -389305 -54894 115890 -2784 -155242 -217467 102301 174192
7328 174192 324495 309685 280920 164436 517528 312552 -201304 -280151 -299433 -260054 260653
7317B60653M07473k04752j92784k03757m50949j40733q1187J51472L40595O4604
7307d9365K07455J4928K55806q666l81509J124M51621L55167l07943k87252K00707
7296D52073k25480l78096m0932R6403M97529J86959k75234p9925K88646k95611
7286B26332j94578j20759P3079j91821J61742k31952k38516R7541K82984J91261
7276E5313j07428k7114M9865k06390J53751L12945k13596k3310K54535K03024
7266D51595m09942l242k49960J31610J25775q4720k80385Q4692L66562j25392
7256F593k63608j61379M50635L46794R3135j19906j56250k04150l90997J71985
7246b27148K02240K17858j21428J40575m5554j35733k62665m96K77513M62024
$$ plain form
7317 260653 668126 463374 270590 66833 -384116 -524849 -606036 -454564 -113969 -49365
7307 -49365 158090 173018 428824 420158 38649 39773 491394 846561 538618 251366 452073
7296 452073 226593 -151503 -192435 -96032 401497 588456 313222 233297 521943 226332
7286 226332 31754 -89005 -15926 -207747 -46005 -277957 -516473 -418932 -135948 55313
7276 55313 -52115 -79229 -29364 -235754 -82003 230942 17346 -5964 248571 451595
7266 451595 41653 38411 -211549 -79939 45836 -38884 -319269 -234577 131985 6593
7256 6593 -257015 -418394 32241 379035 472170 352264 196014 -8136 -399133 -227148
7246 -227148 -24908 192950 71522 212097 166543 30810 -231855 -232351 45162 507186
7236E07186J54498Q2592l59688n59925j19828Q5498K40588M35962l80016k91938
7226b05071n375J44025l3953r4032M4414J18165M37970K27568j81965l31230k11505
7215i0989l16863j16259J12242K12574j27593J0844L57315R6659j40673j92299
7205a95042l44280p8327M26330k22330K31667K32518l32481j45140p4174K17115
7195b84144L13640j70402n6544J43912J72862O5266J08165R473l30755k15423
7185b43950K68572J5437n5330K01099j88913j0326J77834M4386L215Q2229o350
7174B87903k84600J35461L00090j83335q162j49526q4183j75585q5387k43735
7164d91059J38093j04048Q4787K45548M20399l3996J564k57131L6249J55020k7497
$$ plain form
7236 507186 661684 744276 384588 -175337 -295165 -209667 30921 466883 86867 -205071
7226 -205071 -210446 -66421 -100374 -194406 -149992 -31827 406143 633711 451746 120516 -90989
7215 -90989 -407852 -524111 -411869 -199295 -326888 -316044 41271 137930 -2743 -195042
7205 -195042 -539322 -617649 -191319 -413649 -181982 50536 -281945 -427085 -501259 -284144
7195 -284144 29496 -140906 -197450 -53538 119324 184590 292755 302228 -28527 -243950
7185 -243950 24622 40059 -15271 185828 -3085 -13411 164423 208809 212024 294253 287903
7174 287903 3303 138764 438854 255519 247357 97831 13648 -161937 -247324 -491059
7164 -491059 -352966 -457014 -372227 -126679 293720 259724 261288 4157 40406 195426 167929
7153A67929N2187j18300O8819q475l11509q3093o4550j82232J97716N12247K9413
7142B60152q2427K25733M54252j61264k78911j01885N4852K1352l78189k68741
7132b55076K47898O1981k06231j57978j72091J01540J70435P2165j35010J92741
7122g9626K57249K72779M7728l44858r4503K81097l330j75425j206O3390m5886
7111A77409m44127j29853K3951L29797J07559m0074j14228j14803m760k43993
7101d53122K62784N14175O5320n99609k08466Q0409j96108p82794k32898O79386
7091h70923O17448l127Q9054L93032k95332j82288L08966J31964j11307k05997
7081a28510j164j3763j66649j73579K56785l9314m03211J29648N80038L30414
$$ plain form
7153 167929 220116 101816 170635 162160 -149349 -232442 -296992 -479224 -281508 230739 260152
7142 260152 177725 403458 857710 696446 417535 315650 370502 391854 13665 -255076
7132 -255076 -7178 54803 -151428 -309406 -481497 -379957 -209522 -137357 -272367 -79626
7122 -79626 177623 450402 498130 153272 58769 339866 336536 161111 159905 223295 177409
7111 177409 -266718 -396571 -372620 -42823 64736 24662 -89566 -204369 -209129 -453122
7101 -453122 -190338 323837 389157 -210452 -418918 -338509 -534617 -1317411 -1550309 -870923
7091 -870923 -253475 -256602 -167548 225484 -69848 -252136 56830 188794 77487 -128510
7081 -128510 -129674 -143437 -310086 -483665 -226880 -266194 -669405 -539757 40281 370695
7071C70695k44261l14959j7638J40287L56618N8691l33622k87755K95493R8071
7061A21620l38377l4825J8456J3635r9540P8152J52139K04637p5826K22015k41191
7050B0895k47339j36700K04786L07543K06887m86098j80165J44679J45016M38953
7040D18457l08387J0043m4664n2328Q0509r1199m79730n19047J70109L48934O2838
7029d04465j7023O8132J40046K06954Q5651J58968q625J3050j91621K32361J95176
7018D78604j34993k29390l87881n8044L867J04242j15965N5560j13552l1346L02724
7007a26174M9276J11366J14599L0654j21050J38067J66176k0189j65534l05417
6997a28226J31633K93002r902j47526l16874o1813p0802J18233p4283l68350r267
$$ plain form
7071 370695 126434 -188525 -206163 -65876 290742 349433 15811 -271944 23549 121620
7061 121620 -216757 -251582 -233126 -219491 -319031 -240879 -88740 115897 40071 262086 20895
7050 20895 -226444 -363144 -158358 149185 356072 -130026 -310191 -165512 -20496 418457
7040 418457 110070 120113 75449 23121 103630 12431 -467299 -986346 -816237 -467303 -404465
7029 -404465 -421488 -353356 -213310 -6356 79295 238263 229638 242688 51067 283428 478604
7018 478604 343611 114221 -273660 -331704 -327837 -223595 -339560 -284000 -397552 -428898 -126174
7007 -126174 -76898 34468 149067 179721 58671 196738 362914 342725 177191 -128226
6997 -128226 3407 296409 286507 138981 -177893 -239706 -310508 -192275 -266558 -634908 -644175
6986f44175L42999J69238j49819m70111k61477M54641J82995K34553P0605m722
6976g5273k63351k84615K73450L84959j57684K3153l58249j6823K75555K10010
6966A1132M01053M469r9615m03689p2447J03465l00006j11641K46353J06117J09179
6955e630j05997J36029m194j15263r848k2034r9669j36823j11949l70022Q56J70855
6943f73689L44863L73289J22729l51704p8451J40493O8490L68936J4442J29709
6933D59107L7565j68309j92665L24349j38440j97465j23934l5449l68178K272
6923d01147L00698r703p8487K45530J09559l94779k43833K13581j7599j5837K00092
6912i1925j13860r1555p8167j24194j42119N8189J88139K65677Q0113M4355J49080
$$ plain form
6986 -644175 -301176 -131938 -281757 -751868 -1013345 -558704 -375709 -141156 -70551 -75273
6976 -75273 -338624 -623239 -349789 35170 -122514 -99361 -457610 -474433 -198878 11132
6966 11132 412185 416654 317039 -86650 -159097 -55632 -355638 -467279 -220926 -114809 -5630
6955 -5630 -111627 24402 20208 -95055 -104903 -126937 -226606 -363429 -475378 -845400 -844544 -673689
6943 -673689 -328826 44463 167192 -184512 -262963 -122470 -53980 314956 329398 459107
6933 459107 496672 328363 135698 460047 321607 124142 208 -35241 -403419 -401147
6923 -401147 -100449 -110152 -188639 56891 166450 -228329 -472162 -258581 -276180 -292017 -91925
6912 -91925 -205785 -297340 -375507 -499701 -641820 -583631 -395492 -129815 -49702 -5347 143733
6901A43733j0057j70056k97335M9065P1986P0739K02531k7723m51132p6594o2683
6890e57526J26927J13498R3269P9837q1444m4918j68237k5216J90468R3774j31755
6879c11323Q7052j13005j64069K00678R0543M1340R7120K61422p2670q0743M3041
6868G9386l61380j3790L18511J45642n4112p832k06875l96444j5443M51209N66893
6857E05765j12417l11884l46624L2590K3475K42038M10995j11826j64321q3683
6847H4108j67896p5712j84770K58602p1937Q3106K397K07956J98647k63836j39309
6836f8644j6525j01018J65454j58998K91064p0014m23142q1953Q7573K4712k8021
6825c79512j30415l79562k7292L98077J08834p086K34420j69807k58671K3355
$$ plain form
6901 143733 133676 -36380 -333715 -284650 -212664 -141925 60606 32883 -418249 -494843 -557526
6890 -557526 -430599 -317101 -223832 -143995 -225439 -270357 -438594 -463810 -273342 -179568 -311323
6879 -311323 -224271 -337276 -501345 -300667 -210124 -168784 -71664 189758 117088 36345 79386
6868 79386 -281994 -295784 22727 168369 114257 106425 -100450 -496894 -512337 -61128 505765
6857 505765 393348 81464 -265160 -232570 -209095 32943 443938 332112 167791 84108
6847 84108 -83788 -159500 -344270 -85668 -157605 -74499 -72102 135854 334501 70665 -68644
6836 -68644 -85169 -186187 -20733 -179731 111333 41319 -381823 -463776 -376203 -351491 -379512
6825 -379512 -509927 -889489 -916781 -518704 -409870 -416956 -182536 -352343 -611014 -587659
6815e87659J11857L84859J35211k9977j31949K36111P6193n64519K2758K64286
6805h2829j20835M7618J06617k87793N7174k20586l53432K83978K95276l0602
6795c05414j18135K3367J71184j21828K1607J55064j09893j81702R6788K35634
6785a33328j82737l36937j564K30706J29319j03494R6528R7650K74685j86864
6775a16036p796K5619l3286r5136j90419k70949R9037N53285K73581k2406O7170
6764B82664o7946M8008m4849j78650m0278j63260k10069R0339J9545k91164r8640
6753f54300J86632k90744N2642Q2304j72650K64576N22990L2687k12786k27981
6743d16630r2623n1319K39588J22364P2944p3054p65M2215K86248r9073l55414
$$ plain form
6815 -587659 -475802 -90943 44268 14291 -117658 118453 194646 -369873 -347115 -82829
6805 -82829 -203664 -156046 -49429 -337222 -280048 -500634 -854066 -570088 -274812 -305414
6795 -305414 -423549 -400182 -228998 -350826 -329219 -174155 -284048 -465750 -368962 -133328
6785 -133328 -316065 -653002 -654566 -423860 -294541 -398035 -301507 -203857 70828 -116036
6775 -116036 -123832 -98213 -131499 -226635 -417054 -688003 -588966 -35681 237900 215494 282664
6764 282664 214718 262726 217877 39227 -1051 -164311 -374380 -284041 -264496 -555660 -654300
6753 -654300 -467668 -758412 -705770 -623466 -796116 -531540 -8550 24137 -188649 -416630
6743 -416630 -509253 -560572 -320984 -198620 -125676 -198730 -199495 -157280 128968 29895 -325519
6732c25519N1523L52311P2924K2138O5099j38502O7847k46000k62692K80733K12498
6721A52360j14578r384n6009l07130m486L77900R0118j39427M4977M4445j56310
6710g7524K12007N4230K14605L0893k30003K48833q7014M1160J42370m6122P7078
6699E80513q610k56790j15696j56731J42005J12305l73136K17180j25907j29296
6689a14163p3330J68998j62049k19433o4724L16128K01155m2668m9762n5182j68362
6678b63392l2777N6095K50666K05131p7743k75410R366K39903P2008k30508k3066
6667f9727K39089k18832o278K22102J77156k96380M9984j7117K37709L01299j05089
6656E13916j63939o0051j85223j96330P6902J92852n1167m63299l05827L49709
$$ plain form
6732 -325519 -273996 78315 151239 173377 238476 99974 167821 -78179 -340871 -60138 152360
6721 152360 37782 28398 -27611 -334741 -339227 38673 128791 -10636 34341 78786 -77524
6710 -77524 134483 188713 403318 434211 204208 453041 366027 407187 549557 503435 580513
6699 580513 571903 315113 199417 42686 184691 296996 -76140 141040 15133 -114163
6689 -114163 -187493 -18495 -180544 -399977 -464701 -148573 52582 9914 -39848 -95030 -263392
6678 -263392 -296169 -240074 10592 215723 137980 -137430 -128064 111839 183847 -46661 -69727
6667 -69727 169362 -49470 -55748 166354 343510 47130 97114 79997 317706 619005 513916
6656 513916 349977 289926 104703 -91627 -14725 178127 126960 -336339 -642166 -292457
6646b92457K35470N400J63919M8256j49422J9293j57424j66631J77052K50263
6636A33719J25024j7151k664j02660n17036j21948M01202J66330J93680J13899
6626C72395j0529J14817j62211j12109J0750r1755j62774K25243J36682r1953
6616B28556j99740K22701K3770N0688k03730J89683N2767n73488k06051L30826
6606h4018J98772M6645J61536P4193j90096o2330K282K8820n8473l00265k47841
6595d30775K3521L16568l8494j97596n9981K02500k1532j95443K14929K34069
6585D7766J21364J58032k55381o9540j16255J79715j44980R0830j29567j30538
6575b48554J62595N14808J05519j76290k96279l59100P4799L77915M64385O9688
$$ plain form
6646 -292457 -56987 -51587 112332 160588 11166 30459 -126965 -293596 -116544 133719
6636 133719 258743 241592 238928 136268 -380768 -502716 -101514 64816 258496 372395
6626 372395 361866 476683 314472 202363 213113 121358 -41416 183827 320509 228556
6616 228556 28816 251517 275287 325975 122245 311928 364695 -208793 -414844 -84018
6606 -84018 114754 161399 322935 397128 207032 144702 146984 175804 117331 -182934 -430775
6595 -430775 -407254 -90686 -129180 -326776 -386757 -184257 -205789 -401232 -186303 47766
6585 47766 169130 327162 71781 2241 -114014 65701 -79279 11551 -118016 -248554
6575 -248554 -85959 428849 534368 358078 61799 -297301 -222502 155413 619798 689486
6565F89486l67252l26351j2670J88167J45499J41335q9468o5339m7555l97995
6555a42143l7306L07013l7669q7221Q2333J72209K5844j90825k04088K20432K21594
6544C30173k04071J46573J77319p8957l52901r6925J16317j34975O6737Q533K15318
6533A93141l15610k45857J86853M55620J65193k20002l42082j48817P1337j4634
6523b14858K24683J03382n6359j68839J75124j67508m00582J09064M67204L2481
6513A03792J92856l6492l98094J20148K09771m8383l08433l04111M38146q7127
6503a17927j64504j18605K12187J9691q5233J19994L7356R0259J6651l00203o54
6492b90988l1847K01661K70600L10r6708n4717J81679K11750l11291o20688q3523
$$ plain form
6565 689486 322234 -4117 -16787 171380 316879 458214 368746 303407 255852 -142143
6555 -142143 -179449 127564 89895 2674 85007 257216 283060 92235 -111853 108579 330173
6544 330173 126102 272675 449994 371037 18136 -78789 37528 -97447 -30710 -22177 193141
6533 193141 -122469 -368326 -181473 274147 439340 219338 -122744 -271561 -200224 -214858
6523 -214858 9825 113207 56848 -111991 63133 -104375 -504957 -395893 71311 103792
6513 103792 296648 260156 -137938 -17790 191981 143598 -164835 -468946 -30800 -117927
6503 -117927 -282431 -401036 -188849 -169158 -254391 -134397 -97041 -6782 9869 -290334 -290988
6492 -290988 -322835 -121174 149426 149736 53028 -1689 179990 391740 80449 -540239 -623762
6481f23762J00623k49315N2854L78850N52542o1788l24815k01223M3295O2051
6471b70688j03962m2724R0859j82683K28851O45290j07103k14922J15656J83836
6461C42410J37760Q0996J1702m10550P4403k91543K64272K07861l11256j67237
6451f1182j81591M2532J83653k8804k4621K55151K3598P489j91237j00242J61200
6440H5946K51674m31381r6641K48487j79681m34033l39722o0759M6963N51612
6430c57535J58456m9778M1142m3646R3963k16525O5659K67436R0124P5353J53932
6419B78581k61641j64804j85096K52286L08770k1008L9452O7438m4731k94990
6409b5743m5730J84185J73550K4489q0939l64375m9535K5427j4619K00292n2725
$$ plain form
6481 -623762 -523139 -772454 -719600 -340750 211792 150004 -174811 -376034 -332739 -270688
6471 -270688 -374650 -417374 -326515 -509198 -280347 364943 257840 42918 158574 342410
6461 342410 480170 561166 572868 162318 236721 -54822 209450 417311 106055 -61182
6451 -61182 -242773 -200241 -16588 -45392 -70013 185138 208736 216225 24988 -75254 85946
6440 85946 337620 -93761 -190402 58085 -121596 -555629 -895351 -956110 -909147 -357535
6430 -357535 -199079 -248857 -207715 -251361 -157398 -373923 -308264 -40828 49296 124649 278581
6419 278581 16940 -147864 -332960 -80674 228096 207088 246540 313978 269247 -25743
6409 -25743 -71473 112712 286262 310751 229812 -134563 -184098 -158671 -173290 27002 -25723
6398b5723m26256q7150J94053k47685K9257O2472J69940K18184K38517j47931
6388b2322k41714J58603L97145O2676L5386j36267k49816p884j53275P0851M62763
6377C76146J9639k30531j64018Q7212N7897L29871q3362j58393o3115J5156l13962
6366a27460j47630l64648k42292L01283K64247J70084M3173J67930k22449p871
6356a65633M3003L720j1177K78k42931R3777K00589J988r7254k47659r1498K28704
6344b84093j37311r4613K67883J84728K04107Q6441k26321J10700j82069j97949
6334b68497q6459L39537J78394J0133l34689N7179J29678l08339m6620J1176K43684
6323g4823m2154l17872k89626J57182L80109O1729j86120q6913j64638J21277
$$ plain form
6398 -25723 -451979 -539129 -345076 -592761 -563504 -501032 -331092 -112908 125609 -22322
6388 -22322 -264036 -105433 291712 354388 389774 253507 3691 -4193 -157468 -86617 376146
6377 376146 395785 165254 1236 88448 146345 476216 392854 234461 171346 186502 -127460
6366 -127460 -275090 -639738 -882030 -580747 -316500 -146416 -103243 64687 -157762 -165633
6356 -165633 -122630 -118910 -130087 -129809 -372740 -278963 -78374 -76386 -173640 -421299 -512797 -284093
6344 -284093 -421404 -516017 -248134 -63406 140701 227142 821 111521 -70548 -268497
6334 -268497 -354956 -15419 162975 173108 -161581 -104402 25276 -283063 -329683 -318507 -74823
6323 -74823 -116977 -434849 -724475 -567293 -187184 -125455 -311575 -398488 -563126 -441849
6313d41849K65606J70114l24116j55630k33671M7362j82133k57904J84070M71702
6303d56449J38783J66N62771j32423n33074j8363L09J04700J60292Q54M09149
6292B36715L498k17000L82359r6647l75674l7199l9812q035j02240J42994K19603
6281A08562K54591k0115J75383j07213k73022j33659Q6276j80629j81992N26046
6271B54228R0636m9192o2366j87763k97009q4977j12862p5654k31899J74241j16860
6260f99477J20076R3527n6015L67720K60475J1337k90308k29674K33950N83751
6250C95362r4562k45303N3707J80057L6791j0850k37160m07183Q7325L21875o4532
6239A5527j48229O1965N2205j84283j31007R395j48949J33937J56978j92661K98751
$$ plain form
6313 -441849 -176243 -6129 -330245 -485875 -719546 -672184 -854317 -1112221 -928151 -456449
6303 -456449 -317666 -317500 245271 112848 -420226 -438589 -438280 -333580 -173288 -172434 236715
6292 236715 240213 23213 405572 308925 -66749 -103948 -143760 -151795 -254035 -111041 108562
6281 108562 363153 343038 518421 411208 138186 4527 90803 -89826 -271818 254228
6271 254228 344864 295672 233306 45543 -251466 -336443 -449305 -524959 -756858 -582617 -699477
6260 -699477 -579401 -485874 -541889 -174169 86306 97643 -192665 -422339 -188389 395362
6250 395362 300800 55497 109204 289261 326052 315202 78042 -329141 -241816 80059 15527
6239 15527 -132702 -70737 -18532 -202815 -333822 -324427 -473376 -339439 -182461 -375122 -76371
6228g6371L09288j68337N2720n3704Q3108L484Q4357J97587j08793K3893R3824
6217D41056r6062j92527j58702j42430m1004P7713N00863J02640l18854n23621
6207c50928l14405p5590K49206m3003j41079J96721P1176l170O9802M54668L40939
6196D54337k91273l13360j8786j4548P7780J09671j94061q4980L0427L1095J05315
6185a08383J52448J36302n9370j12165K93256J8230k20100l5054K20008J38486
6175D23658l87246n89084l05825k91363P8425K62595K57532M7289J41962J03168
6165b58889L6794m7342J02576K09735L111j12592J20242j2747j17815j15486k58980
6154d51393m03361j24107M19527N49891J0786J0539p4864J37835O1266N568j02887
$$ plain form
6228 -76371 232917 64580 117300 63596 146704 150188 234545 432132 323339 347232 441056
6217 441056 344994 152467 -6235 -148665 -189669 -111956 388907 491547 172693 -350928
6207 -350928 -665333 -740923 -491717 -534720 -675799 -479078 -407902 -411072 -341270 113398 454337
6196 454337 163064 -150296 -169082 -183630 -105850 3821 -190240 -275220 -244793 -213698 -108383
6185 -108383 44065 180367 120997 8832 302088 320318 100218 65164 285172 423658
6175 423658 36412 -552672 -858497 -1149860 -1071435 -808840 -551308 -504019 -362057 -258889
6165 -258889 -222095 -269437 -166861 42874 45985 -66607 53635 40888 -76927 -192413 -451393
6154 -451393 -854754 -978861 -559334 -9443 1343 11882 -62982 74853 136119 141687 38800
6143C8800M8978m60770m43918L17221O61534m5028j5866j94540J49216n464j8809
6132C1354j94851J21060K78988r25o5765j08399K05664r1397l85069k6171K8358
6121b07153p0296n1181j02571J14900j40536j22230m4049L51906k2879R0167J66674
6110c7248l614m65204k03333j69957n4654J86048L63665J73750l11976L0450K34655
6099b57418J65556L6662J35013n7295J67723l12171j55148q1307n9977j03981
6089e22343j27203J09926L79515m6417k77530J32274o2646K34692L31360J19268
6079B70896j89509k83102k88573k49214N8245L10158j8240n0013k09195j2071
6069f60618K60895K81234L8630o881r5332m87809K29695J52258J12517P0615K90759
$$ plain form
6143 38800 87778 -372992 -816910 -499689 161845 116817 100951 -93589 55627 50163 31354
6132 31354 -163497 -42437 236551 235626 169861 61462 267126 175729 -209340 -235511 -207153
6121 -207153 -277449 -328630 -431201 -316301 -456837 -579067 -623116 -271210 -294089 -203922 -37248
6110 -37248 -40862 -506066 -709399 -879356 -934010 -747962 -384297 -210547 -522523 -492073 -257418
6099 -257418 -91862 -55200 79813 22518 190241 -121930 -277078 -358385 -418362 -522343
6089 -522343 -649546 -539620 -160105 -206522 -484052 -351778 -414424 -179732 151628 270896
6079 270896 81387 -201715 -490288 -739502 -681257 -371099 -389339 -439352 -648547 -660618
6069 -660618 -399723 -118489 -79859 -86740 -182072 -669881 -440186 -287928 -175411 -104796 185963
6058A85963r7589j73047k92570J31225L95240m9715j48926P7069j30442m50534
6048e53326J4684J93444O6769J44593j52114j29044M6503J18858J22492J20992
6038f149K92918p6134j72924m91226p0651J82894N4261r0695K59995K14222O7951
6027A64462K2401k2332j98356k55845R1491P3714l7633O0605n0976l56798K86371
6016b22896L60304j19520n9276K28080K15795L25460k96285l56930P8803J08153
6006B61688j69768k09081L25977R7274l04001k8177k87386K725K32938J92446
5996A14635l26212n2764K38643r2426k76187q7286K22792o81k47694m2773P5729
5985d74224j71195n2357k2774J33213L49224K24421J3081K10540P4986l20372
$$ plain form
6058 185963 88374 -84673 -377243 -246018 149222 99507 -49419 27650 -102792 -553326
6048 -553326 -538642 -345198 -278429 -133836 -285950 -414994 -368491 -249633 -127141 -6149
6038 -6149 286769 210635 37711 -453515 -524166 -341272 -287011 -377706 -117711 96511 164462
6027 164462 186863 164531 -33825 -289670 -198179 -124465 -162098 -101493 -152469 -509267 -222896
6016 -222896 137408 17888 -41388 186692 402487 727947 431662 74732 153535 261688
6006 261688 91920 -117161 208816 306090 2089 -26088 -313474 -310749 -77811 114635
5996 114635 -211577 -264341 -25698 -118124 -394311 -481597 -258805 -259486 -507180 -549953 -474224
5985 -474224 -645419 -697776 -720550 -587337 -238113 -13692 -611 209929 284915 -35457
5975c5457J0089Q225k66574K7704J77909k47070q4631R6196O6260p3481M00767
5964G9937n7375k04947R2015r66j02939P7767o3454m1519k4807J14428O5915j26042
5952a91987j0580r9106j11192L87995j63174j86571J71620o6178j55395j47936
5942e72504J88049J86904L3822m3359k2575j45451R4385J07149P9033k3258l08171
5931d25976j38507J41277K96330k4938j800R9304k86040L4553J57108L166j23953
5920b69476J16703N5124q507o1585J02112k66897k01028K99693j46872J79259
5910b01474J67027o0909j67298P3344j24972j58340k34494K91694K0612N7667
5900c37143m8155l1408L5887L7201Q0185L51918L22348J0690n3337l96133j54551
$$ plain form
5975 -35457 -25368 -17143 -283717 -256013 -78104 -325174 -409805 -313609 -247349 -320830 79937
5964 79937 22562 -182385 -90370 -91336 -194275 -116508 -179962 -221481 -246288 -131860 -65945 -191987
5952 -191987 -202567 -301673 -412865 -24870 -188044 -374615 -202995 -269173 -424568 -572504
5942 -572504 -384455 -197551 -163729 -207088 -229663 -375114 -280729 -173580 -94547 -117805 -425976
5931 -425976 -564483 -423206 -126876 -151814 -153614 -54310 -340350 -305797 -148689 -145523 -269476
5920 -269476 -152773 -97649 -106156 -167741 -65629 -332526 -533554 -233861 -380733 -201474
5910 -201474 -34447 -95356 -262654 -189310 -314282 -472622 -707116 -415422 -394810 -337143
5900 -337143 -385298 -416706 -380819 -343618 -263433 88485 410833 421523 368186 -27947 -182498
5889a82498P4728j60949q0348R4331j26519J0957K08214M6236L50393Q3486j79214
5878A38817k26477m3851M06176j24489l29979j86665k40682k20206j25316J00558
5868h52114Q5424J10310j60440J18726J77847K74899N09281q2343j46154m0044
5858d608R0550k96752k07845N0359K14206J79110K90965j04934o2624j32611m9549
5847c3733N7804M86388K14846n7682n8213l04036j76048L08160J46679k56459
5837C27706J57275K55m96929l27859M10891K91251j25065j02860k69825j07689
5827b42849N8324J74840Q9723m2314r4724k76852j65446q3391j39496j56810L59757
5816e19238J75690K07531J16119o1069N1687K16835j74541J25458m5666o0976
$$ plain form
5889 -182498 -107770 -268719 -349067 -254736 -381255 -370298 -162084 -115848 234545 318031 138817
5878 138817 -87660 -131511 274665 150176 -179803 -366468 -607150 -827356 -952672 -852114
5868 -852114 -766690 -656380 -816820 -698094 -520247 -245348 263933 181590 35436 -4608
5858 -4608 85942 -210810 -418655 -368296 -154090 25020 315985 211051 148427 15816 -33733
5847 -33733 24071 510459 725305 667623 609410 305374 129326 437486 584165 327706
5837 327706 484981 485236 -11693 -339552 71339 362590 237525 134665 -135160 -242849
5827 -242849 -184525 -9685 80038 37724 -57000 -333852 -499298 -582689 -722185 -878995 -519238
5816 -519238 -343548 -136017 -19898 -80967 -29280 187555 13014 138472 92806 31830
5806C1830j84812K70656J4175o5957j83627j82711J59376K74885J560j18928m1609
5795b5162O3479L9653K11120j94592m7050j5953n8217k86291N12235L27707k2824
5784E04105l65087j46614l18753J20584K30020k6462k34003K276J61487O0673
5774a1774K24969J314j42631R581J6376r4780J469j64326l96245j61872J49711
5763e68208R024j87861K67784L02450J07422j14767k34666m51208J1845J18111
5753g40074j80698K48042M14708M37797q0451j62406j49829p3630Q7798K30195
5743C1452R3021L0243j54561O2076O0038m24497j32511Q2640M0472K40976j30021
5732b00672q8808J6336k05183r0945J12678p9115J82054N78020K74113m89886
$$ plain form
5806 31830 -152982 117674 131849 65892 -117735 -300446 -141070 133815 135375 16447 -25162
5795 -25162 38317 77970 289090 94498 47448 31495 -26722 -313013 199222 526929 504105
5784 504105 139018 -7596 -326349 -205765 24255 -2207 -236210 -233934 -72447 -11774
5774 -11774 213195 214509 71878 81459 97835 3055 4524 -159802 -556047 -717919 -568208
5763 -568208 -559184 -747045 -479261 -176811 -69389 -184156 -418822 -870030 -858185 -740074
5753 -740074 -920772 -672730 -258022 179775 99324 -63082 -212911 -286541 -198743 31452
5743 31452 124473 154716 155 62231 122269 -302228 -434739 -352099 -311627 -70651 -200672
5732 -200672 -289480 -273144 -478327 -569272 -456594 -535709 -353655 224365 498478 8592
5722H592j12253o1502j33659K63549K26644k0598k1384l03892j27633q2415J08081
5711b56470Q2940J5513P0002k92595j31556K29025L19121J23394r1882l05527
5701b38035R2394J43147j53960J85727K44587p8808k29392K29333K18908k96818
5691A17083m60294l18541J77092J78728J92307l273j30627K0260m2275m9925J74475
5680a44990J98490j91029l80153l1251K38760K89554K36459J11657J4871J52343
5670D94711r2953p5435m6399l06504j40681n4507L25280J13836k71137k78483
5660c32272j77075M6099J70216n1035J6972j16571J21785l74696o5406L94411
5650c67572L1803k82693j20564j05412o3404L9495K84946K14562R2278J36374
$$ plain form
5722 8592 -103661 -165163 -298822 -35273 191371 170773 149389 -154503 -282136 -364551 -256470
5711 -256470 -173530 -158017 -88015 -380610 -512166 -283141 35980 159374 67492 -238035
5701 -238035 -145641 -2494 -156454 29273 273860 195052 -34340 194993 413901 117083
5691 117083 -343211 -661752 -484660 -305932 -113625 -116898 -247525 -227265 -269540 -319465 -144990
5680 -144990 53500 -137529 -517682 -548933 -310173 -20619 215840 327497 342368 494711
5670 494711 401758 326323 279924 -26580 -167261 -221768 103512 217348 -53789 -332272
5660 -332272 -509347 -463248 -293032 -344067 -327095 -443666 -321881 -696577 -761983 -367572
5650 -367572 -335769 -618462 -739026 -844438 -907842 -868347 -583401 -368839 -276561 -140187
5640a40187K04731j47041j08609r7009K54005K00983N9498k77689r4431k86922
5630d32671n88349p5885M98878J53507l6553J19851L0593m07911K9545J46036
5620e62959L10159q6145Q7666n8692k40149j186n5387k10852j46891L19017J73109
5609d72310r7626N9106L72579o0664M1616K22254m18163m23654j10156L48643
5599e38375j23730j35237K50525j78279R4888l86839J81500M23755K3104J63647
$$ plain form
5640 -140187 64544 -82497 -191106 -288115 -34110 166873 226371 -51318 -145749 -432671
5630 -432671 -1021020 -1096905 -598027 -444520 -481073 -361222 -330629 -738540 -708995 -562959
5620 -562959 -252800 -338945 -251279 -309971 -550120 -551306 -606693 -817545 -964436 -645419 -472310
5609 -472310 -569936 -510830 -138251 -198915 -157299 64955 -353208 -776862 -887018 -538375
5599 -538375 -662105 -797342 -546817 -725096 -630208 -1017047 -835547 -411792 -388688 -225041
$$ [...]
##END NTUPLES=NMR SPECTRUM
##END=
