##TITLE=Analysis number 327486
Compound Code btb 13005
Book Reference 75747 b
Project Code adrs flro3
Chemist Name jom
##JCAMPDX= 6.0         $$ Bruker NMR JCAMP-DX V2.0
##DATA TYPE= NMR SPECTRUM
##DATA CLASS= NTUPLES
##ORIGIN= Bruker BioSpin GmbH
##OWNER= nmr
$$ XWIN-NMR		Version 3.5
$$ Tue Mar 27 11:24:45 2007 GMT Daylight Time (UT+1h)  MAYBRIDGE\nmr@NMR_250MHZ
##.OBSERVE FREQUENCY= 250.131544655141
##.OBSERVE NUCLEUS= ^1H
##.ACQUISITION MODE= SIMULTANEOUS (DQD)
##.ACQUISITION SCHEME= undefined
##.AVERAGES= 16
##.DIGITISER RES= 18
##SPECTROMETER/DATA SYSTEM= dpx250
##.PULSE SEQUENCE= zg30
##.SOLVENT NAME= DMSO
##.SHIFT REFERENCE= (INTERNAL, DMSO, 0, 16.522)
##AUDIT TRAIL= $$ (NUMBER, WHEN, WHO, WHERE, WHAT)
$$ ##TITLE= Audit trail, XWIN-NMR		Version 3.5
$$ ##JCAMPDX= 5.01
$$ ##ORIGIN= Bruker BioSpin GmbH
$$ ##OWNER= nmr
$$ C:\u/data/dgb/nmr/ADRS/2160/pdata/1/auditp.txt
$$ ##AUDIT TRAIL=  $$ (NUMBER, WHEN, WHO, WHERE, WHAT)
(   1,<2007-03-27 11:24:24.38 +100>,<MAYBRIDGE\nmr>,<NMR_250MHZ>,
      <created by zg, POWCHK disabled, PULCHK disabled
       configuration hash MD5:
       49 4B E0 1D 92 C2 6B 37 9F E6 65 BC 52 41 86 1D
       data hash MD5: 64K
       75 19 6D 4A 95 69 DD 08 FD 2E 09 3F E5 A8 94 56>)
(   2,<2007-03-27 11:24:37.36 +100>,<MAYBRIDGE\nmr>,<NMR_250MHZ>,
      <Start of raw data processing
       ef LB = 0.3 FT_mod = 6 PKNL = 1 SI = 32K 
       data hash MD5: 32K
       9E 5D 62 AD FE 6D 27 4A 40 BD D3 CC 10 91 EF 20>)
(   3,<2007-03-27 11:24:39.07 +100>,<MAYBRIDGE\nmr>,<NMR_250MHZ>,
      <apk 
       data hash MD5: 32K
       FE E1 4D F1 96 2F 52 F3 3B BC 00 7C 4B 0E B2 CD>)
(   4,<2007-03-27 11:24:39.85 +100>,<MAYBRIDGE\nmr>,<NMR_250MHZ>,
      <abs ABSG = 5 
       data hash MD5: 32K
       67 8B 42 71 4E A9 F9 8E D4 F1 05 40 5F 74 AD C7>)
$$ ##END=
$$ 
$$ hash MD5
$$ 19 BA B7 C0 B4 3A EA E8 7E 1D 0A 52 63 16 8C A0
##$RELAX= 
##$RELAX= 
##$RELAX= 
##$RELAX= 
##$RELAX= 
##$RELAX= 
##$RELAX= 
$$ Bruker specific parameters
$$ --------------------------
##$DU= <C:\u>
##$EXPNO= 2160
##$NAME= <ADRS>
##$PROCNO= 1
##$TYPE= <nmr>
##$USER= <dgb>
##$AMP= (0..31)
100 100 100 100 100 100 100 100 100 100 100 100 100 100 100 100 100 100 
100 100 100 100 100 100 100 100 100 100 100 100 100 100 
##$AQSEQ= 0
##$AQ_mod= 3
##$AUNM= <au_zg>
##$AUTOPOS= <18 >
##$BF1= 250.13
##$BF2= 250.13
##$BF3= 250.13
##$BF4= 250.13
##$BF5= 500.13
##$BF6= 500.13
##$BF7= 500.13
##$BF8= 500.13
##$BYTORDA= 1
##$CFDGTYP= 0
##$CFRGTYP= 5
##$CHEMSTR= <none>
##$CNST= (0..31)
1 1 145 1 1 1 1 1 1 1 1 1 1 1 1 1 1 1 1 1 1 1 1 1 1 1 1 1 1 1 1 1 
##$CPDPRG= <>
##$CPDPRG1= <>
##$CPDPRG2= <>
##$CPDPRG3= <>
##$CPDPRG4= <mlev>
##$CPDPRG5= <mlev>
##$CPDPRG6= <mlev>
##$CPDPRG7= <mlev>
##$CPDPRG8= <mlev>
##$CPDPRGB= <>
##$CPDPRGT= <>
##$D= (0..31)
0 1 0 0 0 0 0 0 0 0.06 0 0 0 0 0 0 0.0002 0 0 0 0 0 0 0 0 0 0 0 0 0 0 
0 
##$DATE= 1174991063
##$DBL= (0..7)
120 120 120 120 120 120 120 120 
##$DBP= (0..7)
150 150 150 150 150 150 150 150 
##$DBP07= 0
##$DBPNAM0= <>
##$DBPNAM1= <>
$$ [...]
##$SUBNAM7= <"">
##$SUBNAM8= <"">
##$SUBNAM9= <"">
##$SW= 20.6930455092707
##$SWIBOX= (0..15)
0 0 3 0 0 0 0 0 0 0 0 0 0 0 0 0 
##$SW_h= 5175.983436853
##$TD= 65536
##$TD0= 1
##$TE= 683.16
##$TE2= 300
##$TE3= 300
##$TEG= 300
##$TL= (0..7)
0 120 120 120 120 120 120 120 
##$TP= (0..7)
150 150 150 150 150 150 150 150 
##$TP07= 0
##$TPNAME0= <>
##$TPNAME1= <>
##$TPNAME2= <>
##$TPNAME3= <>
##$TPNAME4= <>
##$TPNAME5= <>
##$TPNAME6= <>
##$TPNAME7= <>
##$TPOAL= (0..7)
0.5 0.5 0.5 0.5 0.5 0.5 0.5 0.5 
##$TPOFFS= (0..7)
0 0 0 0 0 0 0 0 
##$TUNHIN= 0
##$TUNHOUT= 0
##$TUNXOUT= 0
##$USERA1= <user>
##$USERA2= <user>
##$USERA3= <user>
##$USERA4= <user>
##$USERA5= <user>
##$V9= 5
##$VALIST= <valist>
##$VCLIST= <CCCCCCCCCCCCCCC>
##$VD= 0
##$VDLIST= <DDDDDDDDDDDDDDD>
##$VPLIST= <PPPPPPPPPPPPPPP>
##$VTLIST= <TTTTTTTTTTTTTTT>
##$WBST= 1024
##$WBSW= 4
##$XGAIN= (0..3)
0 0 0 0 
##$XL= 0
##$YL= 0
##$YMAX_a= 544837
##$YMIN_a= -510877
##$ZGOPTNS= <>
##$ZL1= 120
##$ZL2= 120
##$ZL3= 120
##$ZL4= 120
##$ABSF1= 16.522
##$ABSF2= -4.171173
##$ABSG= 5
##$ABSL= 3
##$ALPHA= 0
##$AQORDER= 0
##$ASSFAC= 0
##$ASSFACI= 0
##$ASSFACX= 0
##$ASSWID= 0
##$AUNMP= <proc_1d>
##$AZFE= 0.1
##$AZFW= 0.1
##$BCFW= 0
##$BC_mod= 0
##$BYTORDP= 0
##$COROFFS= 0
##$CY= 12.5
##$DATMOD= 1
##$DC= 0
##$DFILT= <>
##$DTYPP= 0
##$F1P= 14.0000005364418
##$F2P= -0.99999901652339
##$FCOR= 0.5
##$FTSIZE= 32768
##$FT_mod= 6
##$GAMMA= 0
##$GB= 0
##$INTBC= 1
##$INTSCL= 1
##$ISEN= 128
##$LB= 0.3
##$LEV0= 0
##$LPBIN= 0
##$MAXI= 10000
##$MC2= 0
##$MEAN= 0
##$ME_mod= 0
##$MI= 0
##$NCOEF= 0
##$NC_proc= -4
##$NLEV= 6
##$NOISF1= 0
##$NOISF2= 0
##$NSP= 0
##$NTH_PI= 0
##$NZP= 0
##$OFFSET= 16.522
##$PC= 1
##$PHC0= 219.2975
##$PHC1= 3.678319
##$PH_mod= 1
##$PKNL= yes
##$PPARMOD= 0
##$PSCAL= 4
##$PSIGN= 0
##$REVERSE= no
##$SF= 250.13
##$SI= 32768
##$SIGF1= 0
##$SIGF2= 0
##$SINO= 400
##$SIOLD= 32768
##$SREGLST= <1H.DMSO>
##$SSB= 0
##$STSI= 32768
##$STSR= 0
##$SW_p= 5175.98343685301
##$SYMM= 0
##$S_DEV= 0
##$TDeff= 65536
##$TDoff= 0
##$TI= <Analysis number 999999
Compound Code 99
Book Reference 9
Project Code 9>
##$TILT= no
##$TM1= 0
##$TM2= 0
##$TOPLEV= 0
##$USERP1= <user>
##$USERP2= <user>
##$USERP3= <user>
##$USERP4= <user>
##$USERP5= <user>
##$WDW= 1
##$XDIM= 32768
##$YMAX_p= 339815868
##$YMIN_p= -117102
$$ End of Bruker specific parameters
$$ ---------------------------------
##NTUPLES= NMR SPECTRUM
##VAR_NAME=  FREQUENCY,     SPECTRUM/REAL,   SPECTRUM/IMAG
##SYMBOL=    X,             R,               I
##VAR_TYPE=  INDEPENDENT,   DEPENDENT,       DEPENDENT
##VAR_FORM=  AFFN,          ASDF,            ASDF
##VAR_DIM=   32768,         32768,           32768
##UNITS=     HZ,            ARBITRARY UNITS, ARBITRARY UNITS
##FACTOR=    0.157963299565203, 1,           1
##FIRST=     4132.6476996994, 0,             0
##LAST=      -1043.33573715361, 0,           0
##MIN=       -1043.33573715361, -117102,     0
##MAX=       4132.6476996994, 339815868,     0
$$ Real data points
##PAGE= N=1
##DATA TABLE= (X++(R..R)), XYDATA
$$ [...]
14871b4831r197l13J0087K3346O388m12j9507o372n844l228J6068k1669j0917
14858d6401K1289Q217m562K4071q407P03k0740n44O275K0756J1992p132l15j0148
14844d946k584J4509K4880l1938j4252L297j137k985m845O121p223q031J5234
14831a3900l060j6951K463J0327k5753Q899K8098M404J2802j3660r934j4795P34
14818c0326J6633J3926K539M571Q309K313R634p289k2390Q450J0825O787j5548
14805H434k7877j8648K505J8364L8093J2360j7595j607J5592j8850l951J5600
14793B2420k4406j862j9194J3465j8075l814p934j9498K5519M7754K0616l4018
14781I73J4247R190k437Q773J2793L023k7025p636o470q986j0288K0269m848k960
$$ y = [-24831, -34028, -34341, -24254, -908, 5480, 5068, -14439, -20811, -26655, -29883, -13815, -35484, -46401, -25112, -16895, -21457, 2614, -5793, -5090, -25830, -26374, -20099, 657, 12649, 5517, 5202, -4946, -7530, 6979, 31859, -79, -14331, -11034, -12171, -15156, -20001, -13880, -21103, -29134, -13900, -16960, -33911, -31448, -21121, -46874, -37975, -9877, -5473, 7329, -6331, -16265, -31060, -30326, -13693, 233, 2772, 7343, 15652, 17965, 27599, 20310, -2080, 6370, 17195, 23982, 8434, -19443, -38091, -35586, -17222, 20871, 33231, 15636, 14029, 29621, 10771, 6820, 22420, -1986, -3848, -23042, -9577, -27652, -31466, -39400, -58898, -33379, 14375, 34991, 973, 15220, 24410, 21973, 30746, 43539, 46562, 19537, 11901, 5431, -3555, -13843, 6426, 1578, -1382]
14767a382n875j5508J810K376m494J2883n681n084K032K640J6998J0983r923j1732
14753i957M013Q841m960J498P580J0859j1825k4086K3501K3596p540j0937P267
14740A7850J1071j2301J977r37j4164k8337l1764L744N25K3238K7411j4400j1848
14727b7935Q187J8981q71j2634m411N635J6461J3174r740m659k174k136j6370
14714a8492n652K1472j3504j7346l080r449L8634p460j1331j230k48J0183k0978
14701c8481k2579K8770O577j66P861K3624j5349n170k0368r384J2170K2392J932
14688h171j753K0017j5101l6655J6366O840J4229R222j3637j2412O50J5247J7847
14675A2689k390K23k7450N000N846M480J1440j7620p6149l3171M2017K5287J9649
$$ y = [-1382, -7257, -22765, -20955, -18579, -23073, -10190, -15871, -20955, -18923, -16283, 715, 11698, 1775, -9957, -5944, 2897, -2063, -565, 7015, 17874, 6049, -18037, 5464, 29060, 21520, 10583, 17850, 28921, 16620, 18597, 17660, 3496, -24841, -56605, -52861, -52336, -29098, -1687, -16087, -27935, -19748, -767, -1638, -14272, -18683, -13048, 3413, 16587, 6847, 2188, 14, -2122, -18492, -24144, -2672, -16176, -33522, -36602, -46051, -7417, -14877, -26208, -27438, -27686, -17503, -38481, -61060, -32290, -25713, -25879, -18018, 5606, -9743, -14913, -35281, -44665, -32495, -10103, -8171, -9924, 10093, -5008, -41663, -25297, -18457, -4228, 4994, -8643, -21055, -20405, -5158, 12689, 10299, 10522, -16928, -11928, -6082, -1602, 9838, -7782, -83931, -117102, -75085, -49798, -30149]
14662c0149q284j0084n512K4356O342N90J6597K2861K1691j3857j8381k7520J5369
14649e981L835N66J0400O53j1854j2203P900J7208l13k2729J2677m867K631K1139
14635A9062J3292k3772k828K127j1695N234q745j8788l1627L09K0239M2981O095
14622A1884j7156J4555m953J241k4545j7622J2847o160k8040J043K9451J7052
14610a0403q0j7633K468j3939j3809J0675K1124O832j457k477l931L513j098j3584
14596c3799J9694q285J7002O545j4550k9631j0078J7268K413J6220J4590J6482
14584A3871k039n702j3673K5L961K4519K6234K281k5503N850J2426n964j192M533
14570C9627j1949k4111k7078K76J6005k9468K815O594j0036Q431K3555Q678R9
$$ y = [-30149, -38433, -48517, -54029, -29673, -23331, -22741, -6144, 16717, 38408, 24551, 6170, -21350, -5981, -2146, -1580, 8820, 9473, -2381, -14584, -6684, 10524, 10211, -12518, 159, -4708, -2077, 19062, 32354, 8582, 5754, 7881, -3814, 1420, -7325, -26113, -57740, -57431, -37192, 5789, 11884, -5272, 9283, 4330, 5571, -18974, -36596, -23749, -29909, -57949, -56906, -27455, -10403, -10483, -28116, -25648, -39587, -53396, -42721, -21597, -14765, -16222, -18699, -22630, -19117, -20215, -33799, -14105, -22390, -5388, 1157, -13393, -43024, -53102, -35834, -33421, -17201, -2611, 13871, 11832, 6130, -7543, -7518, -3557, 20962, 47196, 49477, 23974, 29824, 42250, 36286, 35094, 39627, 27678, 3567, -23511, -23235, -7230, -36698, -33883, -27289, -37325, -28894, -5339, 3339, 3438]
14557C438K1849j1124k2116J6270L384j4149j6951j4298J1120q12K2272r55j9788
14544b1860J4261q903M437m084Q577j9358j70j2481N298J192j0746O7R994J0421
14530b3355K7084K718o193J7395L436l904j3207P483J9671J4658k5653l9349o392
14517b5608j5272J6908J3151k353j0099L2581K2322j8437j008Q985K6052j1162
14505C6060j2959j4034J565K3109k1026m0523j5121q970k2207K1178L0899Q772
14493a3257j5443R266P598j1004N739k6247j4298O375K2454K3406r050P638O206
14480f17M178k207J2209m463K7030q572l3078k1133j0067N322M650n072K8347
14467c473K416j7967R692J4379L405k7626N36L3006L200M645k3620j6167j419
$$ y = [3438, 25287, 14163, -7953, 8317, 11701, -2448, -19399, -33697, -22577, -23389, -1117, -2072, -21860, -7599, -16502, -12065, -16149, -7572, -26930, -27100, -39581, -34283, -33091, -43837, -43770, -33776, -23355, 3729, 6447, 254, 17649, 21085, 17181, 3974, 11457, 31128, 45786, 20133, -19216, -25608, -40880, -23972, -10821, -13174, -23273, 9308, 31630, 13193, 12185, 21170, 47222, 36060, 23101, 9067, 10632, 33741, 12715, -27808, -42929, -51899, -74106, -52928, -22029, -13257, -28700, -19434, -11836, -22840, -17101, -43348, -57646, -51271, -28817, -5411, -14461, -6823, -617, 3561, 1354, 13563, 9100, 36130, 27558, -5520, -26653, -36720, -31398, -26748, -31820, -3473, -1057, -19024, -9332, 5047, 8452, -19174, -18638, 14368, 17568, 22213, -1407, -17574, -18993]
14454a8993j0242m826j95K7689K7363j1065m5514n100K6332K9061l639k8023n797
14441b2949J3917o763j9037J2397k715R948j2886J517J4933J0545N168l723L368
14428C720L033k5391l974M3452K5806k0978j0344j8055J445R86k072J7338j190
14415A3776k4043k4987q230K8081K2445m028N720j1250J1842R278q585J1331j0660
14402A0690r013P355R35l25R604K0005k6521k0873q864Q981O76R336l757J8846
14388A7075K7383J440j8031O327j9283l3529k4284Q572K1162K4P597q479k4078
14375c8104J8041N725J5106L1902M885O240R60j2916k5793j4270J0245j3732k9355
14362d1066l1971M478L0231J429J6921J2370J3656k252l075l531O537j482p891
$$ y = [-18993, -29235, -34061, -34256, -6567, 20796, 9731, -35783, -40883, -14551, 14510, 10871, -17152, -22949, -9032, -15795, -34832, -22435, -25150, -15202, -28088, -26571, -11638, -1093, 4075, 352, 3720, 6753, -18638, -22612, 20840, 46646, 25668, 15324, -2731, -1286, -300, -2372, 14966, 13776, -10267, -35254, -43484, -15403, 7042, 3014, 8734, -2516, 9326, 18604, 10019, 21350, 10690, 1677, 9032, 9967, 9642, 19246, 39251, 12730, -8143, -17007, -8026, -7350, 1986, -1771, 17075, 44458, 45898, 27867, 34194, 14911, -18618, -42902, -34330, -13168, -13144, -5547, -14026, -38104, -20063, -14338, 768, 32670, 37555, 43795, 44755, 31839, 6046, -8224, 2021, -11711, -41066, -73037, -68559, -38328, -36899, -19978, -7608, 6048, 3796, 721, -2810, 3727, 2245, -5646]
14349e646J1210j4393M627K1630k6503j5628J4356j3827q276J756J7086J0852
14337b756L4251j3171j3745J2654j6726j9012J5369j612q738N364o357j6514k902
14324c3895O589j0185J66J7026J1798R538l664j1076J3854J7749J0809j962k5089
14311A658k6685P145K0964m825N972L1210p859k7487k4233r012p760m064K5771
14298a9205K4457K0787k619L32J9288r863k4372k7384J2719n465k1424j163Q682
14285b5230p940j5670K3061J9708J6512J7984K2685J1440l0277l0183m036r049
14273a0995j5554j0610J1254Q458K1166Q169L9782p357j5283r20k4205L922R880
14260A7707P854j2939K950j7768K2308J1968k6782J2223J5548j7522j1297j2029
$$ y = [-5646, 5564, -8829, -4202, 17428, -9075, -24703, -10347, -24174, -32450, -30694, -13608, -2756, 31495, 18324, 4579, 17233, 507, -18505, -3136, -4748, -13486, -8122, -14479, -30993, -33895, -27306, -37491, -37325, -20299, -8501, 1037, -2627, -13703, 151, 17900, 28709, 26747, 1658, -25027, -17882, 3082, -1743, 4229, 35439, 27580, 93, -24140, -33152, -40912, -44976, -19205, 5252, 26039, 23420, 23752, 43040, 33177, 8805, -18579, -5860, -11325, -32749, -33912, -25230, -33170, -48840, -25779, -6071, 10441, 28425, 51110, 62550, 32273, 2090, -1946, -10995, -26549, -37159, -25905, -17447, 3719, 11888, 51670, 44313, 29030, 28110, 3905, 7827, 17707, 25561, 12622, 15572, -2196, 20112, 32080, 5298, 17521, 33069, 15547, 4250, -7779]
14248g779j5828m174q315J5502K3198J2424j9423l187j7452J7404J6468K5784
14236C4622R329J702k7228q341J9425K7300j3821k9797P009k5539k2662r59J7158
14223a1802J2625O656j1068l7053j8643J9764O056R77K4812L7240K929M604l4712
14210B385l9687J6208K1181j2346J5570p289o282K970J3350J922n248q374j7025
14197b2665R83K3854p79n987k1331m985k720Q164m728j1881J1722J0671J9323
14184c59K7701l63j8124j8847j04L447O456J4142J029j9197m796j1763L908m384
14170b1254J6221R124q3L2867q504j1310J447k0976k4160j6457J3350J4994Q719
14157f022L59J2272J935K817j5354O2O097j21P776j5048l0004o846r108N207K5275
$$ y = [-7779, -23607, -27781, -36096, -20594, 2604, 15028, -4395, -7582, -25034, -7630, 8838, 34622, 43951, 45653, 18425, 10084, 29509, 56809, 42988, 13191, 20200, -5339, -28001, -28960, -11802, 823, 7479, -3589, -40642, -59285, -39521, -33465, -32488, -7676, 29564, 32493, 37097, 2385, -37302, -21094, 87, -12259, 3311, -3978, -10260, -7290, 6060, 7982, 2734, -5640, -22665, -21682, 2172, 1393, -4594, -25925, -30910, -33630, -25466, -30194, -42075, -30353, -19682, -359, 27342, 26979, 8855, -9992, -10096, -6649, -193, 13949, 14978, -4219, -9015, -20778, -16870, -21254, -5033, 4091, 4008, 36875, 28371, 17061, 18508, -2468, -26628, -43085, -29735, -14741, -6022, -5663, 6609, 8544, 11361, -3993, -3931, 2166, 2045, 9821, -5227, -35231, -42077, -51185, -45978, -20703]
14142b0703K7946n63r486k1651J1304n984K1799q500m3663K2558K735J6663p984
14129a5529o415j601J1185j047j9190k643J2015m929j2299l357O756j5017J4889
14116c7182O331J6595L0312J0783k3277k8716Q750j0744P668n961L2143N609j2163
14103A48m686p84k4639J6969n081q829M201k233J456Q460J4539K2023q809j9419
14089f684o856j1958j5001J8857J7232L3k2536K369J0599m101r962K7713K2998
14076B2703J4613l7522k6765j722j5460j1710L168L875j9527p897N416P361L0824
14063c2643N40O377j3609J4448J2396J4736L6918O876k8826m946M342J0944L528
14050C1081K730j4895j4324J0351L510N663M361Q785O508k5697P853K2936Q163
$$ y = [-20703, 7243, 6680, -2806, -24457, -13153, -19137, 2662, -5838, -49501, -26943, -24208, -7545, -15529, -21944, -23545, -12360, -13407, -32597, -35240, -23225, -28154, -40453, -43810, -37054, -52071, -37182, -30851, -14256, 16056, 26839, 3562, -25154, -16404, -27148, -19480, -25441, 6702, 12311, 148, -4538, -5322, -29961, -12992, -18073, -26902, -22701, -24934, -23478, -15018, -479, 21544, 12735, -6684, -13540, -25498, -40499, -21642, -4410, -4377, -26913, -24544, -13945, -18046, -28008, -295, 22703, 37316, -206, -26971, -28693, -44153, -55863, -52695, -48820, -68347, -76244, -70828, -63467, -32643, -32103, -25726, -39335, -24887, -12491, 2245, 39163, 46039, 17213, 12267, 16609, 27553, 31081, 33811, 18916, 4592, 14943, 18453, 24116, 28477, 37262, 43770, 18073, 25926, 48862, 57025]
14037E7025j7887j5435m0244n409J8382q310K0798K9917Q950k2213j0775k6370
14025a1571R731r37J7065N0831J5126j5585j8956P73j537j8025l5086q832Q257
14012h746K2494K4886n579j4225j3282r967K945r642r378J7943K1717m3039j0993
13999c4866L1861k3993l6196j202Q871N1429L2873l2633r331N422R855m969J5944
13986A3065k113k3458k3148j696M5026o587K692Q076j5719n350J6356r509R457
13973G092j0087r933j810k9494N71J1899j3011k9208J954L7889K6068K2828Q614
13960B3372J4715j223Q222J1720m9076n1102r286l9014K95J6248q743K6988J4197
13947d2687J6096J4293Q491j8625j1136K2915J5273j1021J9965K5352j9644m1160
$$ y = [57025, 39138, 23703, -16541, -21950, -3568, -11878, 8920, 38837, 47787, 25574, 14799, -11571, -1840, -2777, 14288, 65119, 80245, 64660, 45704, 46477, 44940, 26915, -8171, -17003, -8746, 13748, 38634, 33055, 18830, 5548, -4419, -1474, -11116, -20494, -2551, 19166, -23873, -34866, -3005, -26998, -63194, -64396, -55525, -4096, 28777, -3856, -13187, -7765, 2090, -2879, 13065, 10952, -12506, -35654, -37350, 7676, 1089, 3781, 11857, -3862, -9212, 7144, -2365, 7092, -2995, -12928, -14738, -44232, -43661, -31762, -44773, -73981, -72027, -34138, -8070, 14758, 23372, 38087, 36864, 45086, 56806, 7730, -43372, -52658, -91672, -91377, -75129, -83872, -56884, -42687, -26591, -12298, -3807, -22432, -33568, -10653, 4620, -6401, 13564, 38916, 19272, -21888]
13935b1888j4846k3389j3459k5028K4090L4732j0807n610K7246J3045j0450r665
13923c6029J7177j4331K0376J369m16J0300Q49p733J2587P161j2152q6j9737j0640
13909c1305J1222J9969J0156J1547R622m516j5987p281M067k1636P11K9559l9144
13896b3016k593M665J727q522J2196k653L195j3572n546n614L115J6383M6858
13883B6623r721m3666j2985K4850Q124k9390j7027K6396L0957K1467p894J1958
13871B9692q275k8363o979j5378o464R128j7323J3338K5071J0026R460l7322n370
13858b8759K5851J640k0224j658K2738J2952j2465p853m006K103l851Q291n486
13845a0727J9232R073j4064J4486J6766m81k1836Q64q885j8030Q41M833P40Q700
$$ y = [-21888, -36734, -60123, -73582, -98610, -74520, -39788, -50595, -56205, -28959, -15914, -26364, -36029, -18852, -33183, -12807, -11438, -11854, -1554, -705, -8438, 4149, 11310, -842, -928, -20665, -31305, -20083, -114, 10042, 21589, 31211, 26695, 10708, 3427, 7494, -14142, -13431, 16128, -23016, -25609, -20944, -19217, -27739, -15543, -18196, -15001, -28573, -34119, -39733, -36618, -20235, 26623, 16902, -26764, -39749, -14899, -6775, -36165, -53192, -26796, 4161, 25628, 17734, 29692, 21417, -6946, -13925, -29303, -35767, -26639, -43962, -30624, -5553, 4473, 13933, -23389, -28759, -2908, -1268, -21492, -23150, -412, 12540, 75, -7778, -11784, -9681, -13532, -5241, -10727, 8505, 17578, 3514, 18000, 34766, 34285, 12449, 13313, 4428, -13602, -12761, -7928, -7188, 1512]
13831A512J8829j6724l0964j5201J5565o102j4141P947K0065K6383k2726j3674
13819b9231j22K5500P807m610K111K467j1116j7597N214M571l7166o200J1001
13806d7371K0253k0321R302n69k695r411n98M398J4156M9457K6567m7005k6570
13793c0407k4511l265M2600J6326J034j518J6297m295k0498J9900K7107J6346
13781E5116j8993l5946p562J1090J156q416K0026J0243j6818n617j9237k4108
13769c9066l733J4013K4533J1462o860q298q025J190j203m0046J3524J3676K4332
13756d501L4772O571j2963j3659J5210q290j3650K0949L0313k675k9233j9210
13744C634K0328l208n484N337j940L948j0151J2790p91l3239j3519o980K239K7359
$$ y = [1512, 20341, 3617, -27347, -42548, -26983, -33085, -47226, -39279, -19214, 7169, -15557, -29231, -29353, -3853, 3954, -656, 1455, 3922, -7194, -24791, -19577, -15006, -52172, -58372, -47371, -27118, -47439, -38137, -38706, -41401, -50812, -51410, -47012, -32856, 16601, 43168, -3837, -30407, -54918, -58183, -15583, 743, 1777, 259, 16556, 12261, -8237, 11663, 38770, 55116, 36123, 177, -7385, 3705, 4861, -3555, 16471, 26714, 9896, 4279, -14958, -39066, -42799, -28786, -4253, 7209, 349, -7949, -15974, -14784, -15987, -56033, -42509, -28833, -4501, 30271, 36842, 23879, 10220, 25430, 17140, 3490, 24439, 54752, 52077, 22844, 3634, 23962, 20754, 15270, 20607, 18667, 22615, 12464, 25254, 24463, -8776, -22295, -29275, -27036, 323]
13730C23M983q708k3373j91J1300K2179o719o078m587k5378P448L7222q685j2529
13716a2793K3488J2891j0297K721O247k617M825j8460j1082L089J740J1331N093
13703A6176m671R266j7573l1053k4759k978K2001K1918J5037j1274n457L6599
13691B3232N394O373o851j0460j3209l2440J7641M735q66j3731j7022l245r209
13678d9658K9337L4354K412o752k479K568q712l0173k930J8422J6493N656r653
13665a115j3450J3856j2610J0361P002Q744L314J3954J0984Q342j6267l0963k8958
13652b6806J2894K2478j9357M642L5342K7161k4692j0089N160q921K0773J834
13640D0419o682J138j6323k606R115R829L94K453o840j0149j6072M40j2232p723
$$ y = [323, 5306, -3402, -26775, -26966, -15666, 6513, -206, -6284, -10871, -36249, -28801, 8421, -264, -12793, 10695, 23586, 13289, 16010, 22257, 19640, 24465, 6005, -5077, -1988, -248, 11083, 16176, 11505, 20771, 3198, -27855, -52614, -55592, -33591, -11673, 3364, -7910, -13367, 23232, 28626, 34999, 28148, 17688, 4479, -27961, -10320, -5585, -6451, -20182, -37204, -40449, -49658, -20321, 14033, 16445, 9693, 7214, 9782, 1070, -29103, -32033, -13611, 2882, 8538, -1115, -14565, -709, -13319, -2958, 4044, 12788, 16102, 30056, 41040, 49382, 33115, 2152, -26806, -13912, 8566, -10791, -6149, 29193, 56354, 31662, 21573, 26733, 17812, 38585, 40419, 33737, 34875, 18552, 15946, 25061, 34890, 35284, 37737, 30897, 20748, 4676, 5116, -7116, -14839]
13626a4839M500K6504K3496p963l168k032j479k1393K0966J3470o827k4818k9652
13613b3235L379P352K7900K2653J6896q305r689q15j1303k3601J8810o623l3563
13600b0144J6334L0194K884j8420j8756j2381J977J2891j0323L2301L8500r266
13588D5791k5845l7623L153Q702K0173J4497j8748l0128L4391J9731P492o450
13576C5136n559k1803L9133K9355j0004j7922j5057j2849N45j0086J5588M4808
13564G1285J1226k0558l2714L257J112Q145K3161j4730j5808j6043p017j7688
13552f372K5598K2951J7090j6604k565r242l5418R955Q838K0985M9469K2823j2464
13539I5044k1411j3831M263q167n660q183N543J6601L663k1047j3245n259j6067
$$ y = [-14839, -10339, 16165, 39661, 31698, 28530, 26498, 25019, 3626, 24592, 38062, 31235, 6417, -23235, -19856, -12504, 15396, 38049, 54945, 46640, 36951, 36136, 24833, 1232, 20042, 13419, -20144, -3810, 26384, 29268, 10848, -7908, -20289, -18312, -5421, -15744, 16557, 55057, 45791, 19946, -17677, -14524, -5822, 14351, 28848, 10100, -20028, 14363, 34094, 41586, 35136, 29577, 7774, 46907, 76262, 66258, 48336, 33279, 20430, 20975, 10889, 26477, 71285, 82511, 61953, 29239, 32496, 33608, 41753, 64914, 50184, 34376, 18333, 11316, -6372, 19226, 42177, 59267, 42663, 40098, 30856, -4562, 5393, 14231, 35216, 84685, 107508, 95044, 73633, 59802, 64065, 55898, 50238, 42055, 47598, 64199, 67862, 46815, 33570, 28311, 12244]
13526A2244l509J5371J2648L5789K8397j8324k0347o099K0909k308o02J1546O990
13513I2705l1207K21R928n537l879J7306j3074j2165j1653l595K290P723K8529
13500G7592L095j2378j869j6017j3924r269q481R543k3818p032J2359K2938J2389
13487D5128J077q356J0766o854j8824k4812m832Q627P061J8284K0515J0470k1306
13474C6944J7976K2174j6334l5214K848j2090j090J7715K3265J1254o162k5576
13462C5710o627L3525Q828k6972m5727j3321J7577J872O659J7181J1633P138l2801
13449A4675M120j9345l7555l069L6565K1545j646J6777j1694M18R53L659k8140
13436b737r671l783j691K3783J3971K3396n839j2459j9844J161O20n763l49l174
$$ y = [12244, 8735, 24106, 36754, 72543, 100940, 82616, 62269, 56170, 77079, 74771, 74169, 85715, 92705, 61498, 61719, 71647, 66110, 62231, 79537, 66463, 54298, 42645, 39050, 41340, 49063, 77592, 80687, 68309, 66440, 50423, 36499, 27230, 18749, 28292, 4474, -2558, 9801, 32739, 45128, 46205, 37849, 48615, 41761, 22937, -1875, -6707, 1920, 8981, 27265, 47780, 58250, 36944, 54920, 77094, 60760, 25546, 28394, 16304, 15214, 32929, 56194, 67448, 61286, 35710, 29083, 62608, 71436, 44464, -1263, -14584, 2993, 4865, 11524, 28705, 40338, 47476, 14675, 18795, -550, -38105, -41174, -4609, 16936, 15290, 32067, 20373, 20791, 21744, 25403, -2737, -12408, -16191, -17882, 5901, 19872, 43268, 37429, 24970, 5126, 6287, 6907, 1144, 795, -2379]
13422b379n636l0360J1393O039j7108j4691J4673L5469J8752k7527j4713J4221
13410a1867M9363J2599l2382r484J017j3778Q616R311J7533J6644k175j8887l7161
13397a0651J9141K3117m1432m527J2379O642L641j5247p454O86K8800J1347k1634
13384D808L126N94J1245j2450J3426O843k128N527o18O042k157j3244r828k8672
13370a7486k0290k897L834P749J890K209K1776j151k8775J810K2915K7203K1448
13357D0235L797k1109j0455J0504K0855m182k1416q234K448N787j0299j6200J2041
13344C772K6463j590N650j6822j4929j496j5752k3402R433L9711J0148j9933K3011
13331B4264J2789j8679j3494j1358j0947L399Q563j1674J6145j905k879k0577
$$ y = [-2379, -8015, -38375, -26982, -20943, -38051, -52742, -38069, -2600, 16152, -11375, -26088, -11867, 37496, 50095, 17713, 8229, 9246, -4532, 4084, 13395, 30928, 47572, 45397, 26510, -10651, 8490, 31607, -9825, -14352, -1973, 4669, 8310, -6937, -14391, -13705, 15095, 26442, 4808, 7934, 8528, 19773, 7323, 20749, 27592, 25464, 30991, 30373, 36415, 34258, 21014, 11186, -17486, -37776, -40673, -36839, -29090, -27200, -24991, -3215, -4366, -33141, -31331, -8416, 18787, 40235, 44032, 22923, 12468, 22972, 43827, 39645, 18229, 9995, 12443, 18230, 7931, -8269, 3772, 30235, 28645, 34295, 17473, 2544, 1048, -14704, -38106, -28673, 11038, 21186, 1253, 24264, 37053, 18374, 4880, -6478, -17425, -14026, -5463, -17137, -992, -2897, -5776, -26353]
13319b6353J0333k487p639k0475k143j047R052J6904J2335j0532J3735J718j568
13306h167J133J6528J3958P69K33k70K907p300k1675J2055j247R372P562J1644
13292C7502O647j8415j3235K8454n920n621k0626Q270K638k8294O526M421M5J062
13278C454K1504o510K2563j0563k6687k3408j8377j2934K4960K7316J5068L3436
13266D9822l865k5912j7926j546J2464J1774j7234k9024m472L325M414L4270j5923
13253A67J1184L886J0619r115j299l1763p082p389m059J1856L2657J5014K0851
13240D5527j8749l2273m125n671J7451K9695J008k9512j1747K82J8291J0537K4772
13227D5486R138o168K462j2694K0403l683j8391j3710k179k4579n419J3291J9541
$$ y = [-26353, -16020, -18507, -26146, -46621, -48764, -49811, -40759, -23855, -11520, -22052, -8317, -6599, -8167, -7034, 9494, 23452, 24221, 24454, 24184, 27091, 19791, -1884, 10171, 8924, 18296, 25858, 37502, 44149, 25734, 12499, 40953, 35033, 29412, 8786, 17056, 19694, -8600, -2074, 2347, 2392, 3454, 24958, 18448, 41011, 30448, 3761, -19647, -38024, -50958, -25998, 1318, 16386, 49822, 45957, 20045, 2119, 573, 13037, 24811, 7577, -21447, -25919, -22594, -18180, 16090, 167, 11351, 15237, 25856, 16741, 15442, -16321, -23403, -30792, -34851, -22995, 9662, 24676, 45527, 26778, -5495, -9620, -15291, 2160, 31855, 32863, 3351, -8396, -8114, 10177, 20714, 45486, 54624, 48456, 50918, 38224, 58627, 54944, 36553, 22843, 20664, -3915, -9334, 3957, 23498]
13214B3498j06r430j1564L537J2490J1453k763P96M738j4405k3053j5213l406
13201b3428L018K2735R215k3Q75k5847K4332K4637L621l0372n107J550J298O304
13187A2808p80j091J1976j5011m370R084o169j162M006K6135q840j4945l0340
13174a8699j1668K6365K0500J3817r992j8802j7553q347J8473j3994K183P525
13162a0192Q42j3830k765J679J0458R871j2813j6612M524J9322J1937J0724j0194
13149B951j5988J1733J3562k0529J3J6278J1555m783J5047K3378l9q827j7807
13136B6544k7203k0632j0053L915M316P979K8726l491n63J5717j4317o627k6361
13123b2050r919J9248n801l07K2954M223O530m082j5940J0228k864l4729k8195
$$ y = [23498, 23392, 13962, 2398, 5935, 18425, 29878, 27115, 27911, 32649, 18244, -4809, -20022, -23428, -20410, 2325, 11540, 11517, 12392, -13455, 10877, 35514, 39135, 8763, 3656, 5206, 6504, 12808, 12028, 10937, 22913, 7902, 3532, 12616, 6447, 5285, 9291, 35426, 26586, 11641, -18699, -30367, -4002, 16498, 30315, 20323, 1521, -16032, -24379, -5906, -19900, -17717, -10192, -9350, -23180, -25945, -24266, -13808, -3937, -16750, -33362, -28838, -9516, 2421, 13145, 2951, -13037, -1304, 12258, -8271, -8258, 8020, 19575, 14792, 29839, 53217, 53178, 44351, 26544, -659, -21291, -31344, -27429, -23113, -15134, 13592, 10101, 9538, 25255, 10938, 4311, -22050, -31969, -12721, -18522, -18829, 4125, 8348, 14878, 10796, -5144, 5084, 2220, -32509, -60704]
13110f0704L4482K5593P116j8378J6441r426k9130j6976k8315j1170M1067L0985
13098a8415j1601K492j880R397Q671j314K33J2928R831J4656J3202j7123k0182
13085H95q865l729J158J6904q151k3774J5238L8311j0041M052O809J0223k045
13072C6985j9557k9239p087J5988J0494k1072q175L0708J6299J1405j7871j4512
13060D366J9770K1206k0911j1106j3522j5606N163K6090J9822n734j9682k4527
13048a4671j2885n539K1481K3239k2045k6973J1891L6610J6897R604k6110l6801
13036b5302r794j7979J6551L6630K1971K5846L065j0212l4107k261K1315J9692
13024D5415m87j9195k4276l2978j2221J6909J045k2371J1071L5581J4942J4819
$$ y = [-60704, -26222, -629, 6487, -11891, 4550, -4876, -34006, -50982, -79297, -90467, -49400, -18415, -30016, -27524, -29404, -20007, -11336, -12650, -12417, 511, 10342, 24998, 38200, 21077, 895, -7970, -11699, -10541, 6363, -1788, -25562, -10324, 27987, 17946, 21998, 28807, 39030, 36985, 17428, -11811, -18898, -2910, 7584, -13488, -21663, 9045, 25344, 36749, 18878, 4366, 24136, 45342, 24431, 13325, -197, -15803, -10640, 15450, 35272, 29538, 9856, -14671, -27556, -33095, -11614, 11625, -10420, -37393, -25502, 11108, 28005, 37609, 11499, -25302, -35096, -53075, -36524, 106, 22077, 47923, 50988, 40776, 6669, 4408, 25723, 45415, 44928, 25733, 1457, -31521, -43742, -26833, -25788, -48159, -37088, -1507, 13435, 28254]
13012B8254Q467j7984l6926k2763M778j353O831p050P985J5522o850L564K5117
12999G592Q533k186P823n884L926k934r257J0157m866J1017J8526j3336j7734
12986A1377J2611l0287k5269m004K1530L816k7803j1157J5594K5317J782J9594
12974A3101N643j4707K6848J9640k7692p360j6057l356J1155K4813J0665n746
12962C6947j0025j2105j4638k649L4007N296j4185j2943k1930Q275J8740K909
12950A7699j3565k2814l223q174J4823K5528K2172m889k6342q526Q673K1448j628
12937B1182k1773p164k1176j1545N020K2371L0230l444j0571m166p895j1058n262
12924b5251Q556j5340k0620J1184J4658J2998K3955j614j4786j0429J3288n738
$$ y = [28254, 36721, 18737, -18189, -40952, -36174, -37527, -30696, -37746, -29761, -14239, -21089, -17525, 7592, 16125, 13939, 21762, 15878, 19804, 16870, 7613, 17770, 12904, 23921, 42447, 29111, 11377, 23988, -6299, -31568, -35572, -14042, -10226, -38029, -49186, -33592, -8275, -6493, 13101, 18744, 4037, 30885, 50525, 22833, 15473, -584, -3940, 7215, 32028, 42693, 36947, 26922, 14817, 179, -2470, 31537, 36833, 22648, 9705, -12225, -3950, 14790, 17699, 4134, -18680, -21903, -30077, -15254, 10274, 32446, 27557, 1215, -7311, 1362, 22810, 21182, -591, -7755, -28931, -40476, -35456, -13085, 17145, 13701, 3130, -1036, -8931, -19989, -25251, -16695, -32035, -52655, -41471, -26813, -13815, 10140, 8526, -6260, -16689, -3401, -9139]
12912i139j4201J6076q706J7119K6109k3119j9750J4388J6969K534k9588J0580
12900g28q316l3662r378m5j4160O170L3116M0174Q599l7095J4329M037j0580j779
12886i318L391Q144k888J1596O276m273J7126k6820k2302j6060j0176K963K0637
12873b1704R598J7220J2978J4930K548j0103j1178j8879R111j3719R733N273J4975
12860B0783j2525k1337K0158p062j6609r79Q432J8364J8120Q362j4287k9629n523
12847a3732J5958N320k757K387l629K4157J1472k9070k9758r385K2362K4589J3712
12834C1626N296J8960j6277l7156q774j4817P109m733j0750M228K0954J3428k4508
12821a5414j5426p176K4261K2083l591k482j1118j1944j6378Q396J5480j1944
$$ y = [-9139, -23340, -7264, -15970, 1149, 27258, 4139, -15611, -1223, 15746, 18280, -11308, -728, -9044, -42706, -52084, -52129, -66289, -60119, -27003, 13171, 21770, -15325, -996, 3041, -7539, -9318, -5927, 2217, -671, 10925, 17201, 12928, 30054, 3234, -19068, -35128, -45304, -42341, -21704, -12106, 5114, 18092, 33022, 35570, 25467, 14289, -4590, 4521, -9198, 535, 5808, 20783, 8258, -13079, 7079, 17, -16592, -17571, -9139, 9225, 27345, 35707, 21420, -8209, -13732, 2226, 7546, 4789, 7176, 3547, 27704, 39176, 10106, -19652, -29037, -6675, 17914, 31626, 36922, 55882, 39605, 2449, -6325, -21142, -14033, -18766, -29516, -25288, -4334, 9094, -15414, -30840, -38016, -13755, 8328, 4737, 2255, -8863, -20807, -37185, -28789, -13309, -25253]
12809b5253o350P030j1027j1607j3713q945K2724K7801j3162j3586j338K2663
12797b4763K5257K3805k325o534R215q394j5730J0718j1732L203o47k3985N919
12784a5993M1266P806m317j8664J129j0950J2672k7740j2624o508J422J7404J9895
12771D798K9773M840k1398k040J1081J0125o096l5874o65K7657K558k913j0844
12758A1002l0373J007m577k4873J1908Q267J2887o890K6298L6007r794p702l656
12745A9511J622j8295m298K2681R948k3256k4000M1J1835j745K1317J7402J2922
12732D5685P119K148j7741l6934j2604K3181L745m653p781K2668m637L032J7493
12719D0721j1510j1965j1729n417j0128j3921o269o887K589L1903J2983K9714
$$ y = [-25253, -31603, -24573, -35600, -47207, -60920, -69865, -47141, -19340, -32502, -46088, -47426, -24763, 494, 24299, 21974, 15440, 24655, 16261, 531, 11249, -483, 2720, 2073, -21912, -15993, 25273, 33079, 28762, 10098, 11227, 277, 12949, -14791, -27415, -33923, -32501, -15097, 4798, 34571, 39411, 18013, 15973, 27054, 37179, 31083, -4791, -5456, 22201, 24759, 21846, 11002, -19371, -18364, -22941, -47814, -35906, -27639, -14752, -21642, 4656, 40663, 30869, 23167, 19511, 21133, 2838, -1460, 21221, 31169, 7913, -16087, -16046, -4211, -5956, 15361, 32763, 45685, 52804, 54952, 37211, 277, -12327, 10854, 14599, 9946, 2165, 24833, 20196, 23228, 40721, 29211, 17246, 5517, 100, -10028, -23949, -30218, -37105, -34516, -2613, 10370, 40084]
12707D0084j859J315j1758k376L955Q94k5961l5162k480J1170J6336J9951L80
12694A4489J389K7634j7541j2212K3114j239K569r293j6629P785K5219K8190J7869
12681I1344j0695k9210k2831j1508k2346m36J4077M949j7334k1332K1181r494
12669a3635m959k3900M659L3095M1462k875l6981P926K9008o132n47K1035M187
12656E2343k9530k0759M498p49M460J4976N178k1487l0784j5867J1884N618K1239
12643A020J8480k063k4358J6139p659j2453J4281Q38q267Q516J4262j251J3109
12630C0594J3168l1012l9469k9140J4541Q798J4226O489M7794K517l1279l8538
12618c1311J009K5092k6984J7437K5450K299J0952J7482j6619J870k414j9997
$$ y = [40084, 38225, 39540, 27782, 25406, 29361, 30255, 4294, -30868, -33348, -22178, -5842, 14109, 14489, 15878, 43512, 25971, 13759, 36873, 35634, 38203, 28910, 12281, 20066, 45285, 73475, 91344, 80649, 51439, 28608, 17100, -5246, -5682, 8395, 13344, -3990, -25322, -4141, -13635, -18594, -42494, -37835, -4740, 36722, 33847, -3134, 4792, 33800, 27668, 27121, 48156, 52343, 22813, 2054, 6552, 5803, 10263, 25239, 30417, 8930, -21854, -37721, -25837, -20219, 1020, 19500, 17437, -6921, 9218, 1559, -10894, 3387, 4225, -4042, 4474, 18736, 17485, 30594, 43762, 12750, -26719, -55859, -41318, -32520, -18294, -11805, 35989, 38506, 7227, -31311, -30302, -5210, -32194, -14757, 10693, 12992, 23944, 41426, 24807, 26677, 24263, 4266]
12606D266j4150K9568k959j5154K3851m573j8279j4745O567K174J7513K0955j3486
12593B1548J4864K2967J8798k7994k8654j3121j865L835o904Q201o393j9087o718
12580b0523L2687J7225K2970Q586K862q255k9590k5476m129M881M881J5337K208
12567B3664J2550J0802l2557j5282J3130J3993J1417O281J4444J593n031m635
12555E0369J466k4655k638k3426k0962L5575K4137J7550l6109j9087K3941J4745
12543D0906N086j3222J2254q602J0023k5504L70J4986j652l02k674l543r103j6188
12529B835n706J5193k1269j6447K896R166L7367j0936n243J1605P23r9j8912j4715
12515a3542J9259J0387j6403N545K6741J0068P481o262j1178J7927k17j0473l1518
$$ y = [4266, -9884, 19684, 16725, 1571, 25422, 20849, 2570, -12175, -5608, -3434, 14079, 35034, 21548, 36412, 59379, 78177, 50183, 21529, 8408, 6543, 10378, 3474, 11675, 5282, -13805, -20523, 12164, 29389, 52359, 60945, 63807, 55552, 25962, 486, -3643, 1238, 6119, 21456, 23664, 36214, 47016, 14459, -823, 12307, 26300, 37717, 43998, 58442, 60035, 55004, 50369, 51835, 27180, 24542, 1116, -19846, 15729, 39866, 57416, 21307, 2220, 26161, 40906, 45992, 32770, 45024, 36422, 46445, 20941, 21311, 36297, 34645, 34343, 31669, 28126, 19023, 2835, -2871, 12322, -8947, -25394, -22498, -13332, 24035, 13099, 7856, 19461, 20184, 20085, 1173, -13542, 5717, 16104, -299, 5246, 31987, 42055, 49536, 43274, 32096, 50023, 49806, 39333, 7815]
12502G815q598P216J1233k220n989Q235N06j4312O39j066O870l603p559K7891
12488B7058j5407K7474K856j3319o363j1902J0401K194J6537J5471k7881j7168
12476I951j2758k915L4788N5308n332k4106k5403M641K5724K9375r993j3918j6678
12463D8684l2662K0205m794l0591k8184R457L3362J2016j6084j3014r305J0980
12451G0J3676j2195J6515L1825K4942k6403J715J8597k0028N900k6996j737m908
12438B0973J2293J4277p743l9358k081j7731K924L9153J0778J6598L553j8962
12426C4674q520J558K6509p355k5885R398k985k0717m506L4869J3765j0249J7865
12413E8421L891n297q922O93J4463j1000k3769j5818M254J779J0246L6852q055
$$ y = [7815, -783, 6433, 17666, 15446, 9457, 17692, 18198, 3886, 4525, 3459, 10329, 6726, -833, 27058, 11651, 39125, 41981, 28662, 22299, 10397, 20798, 22992, 39529, 55000, 27119, 9951, -2807, -5722, 29066, 84374, 79042, 54936, 29533, 34174, 59898, 89273, 79280, 65362, 48684, 16022, 36227, 31433, 842, -27342, -17885, 15477, 27493, 11409, -1605, -10910, 70, 13746, 1551, 18066, 49891, 74833, 48430, 50145, 68742, 48714, 54614, 27618, 25881, 20973, 33266, 47543, 39800, 442, -1639, -19370, -16446, 22707, 33485, 50083, 53636, 34674, 26154, 27712, 54221, 46866, 20981, 30379, 27394, 6677, 2171, 37040, 50805, 40556, 58421, 62312, 57015, 48093, 48786, 63249, 52249, 28480, 12662, 16916, 18695, 28941, 65793, 57738]
12400E7738j2l1756k2717Q365k710K6379L4034l11k7762j8232l585J2489K3352
12387E5272q015m946p120K4179J3629m732J9954K5903J2351k2827q882l4520k7057
12374C3189K7691o115L875L1331R83m3213K508o035Q634J235k2374j3157m972
12361A3580j7695J6513K5748K5857J4629k8376m697K0067k5356n076P554M449
12349D7197L921p923R878N269l408j2962k7494M095q441k488K5607K1583J7725
12336G2559m853k9252r622K8766K3111n045r048r61j0601J4116j8769j5004J3385
12323D8782j4184k325m7K888j5658O891L9936O564k769j5808J8243O07M615m974
12309G2761r172j5153J396M955p708k993K7056L3124M148m246j8745j4707K2943
$$ y = [57738, 57726, 25970, 3253, 11618, 8908, 35287, 69321, 69010, 41248, 23016, 19431, 31920, 55272, 47257, 42311, 35191, 59370, 72999, 68267, 88221, 114124, 126475, 103648, 94766, 60246, 33189, 60880, 54765, 58640, 89971, 90954, 47741, 50249, 44214, 52848, 54083, 31709, 18552, 13580, -4115, 12398, 38146, 64003, 78632, 50256, 45559, 65626, 40270, 35194, 42748, 47197, 51118, 43195, 53073, 58342, 54934, 41972, 14478, 18573, 10132, 7644, 33251, 54834, 72559, 67706, 38454, 28832, 57598, 80709, 75664, 66616, 65655, 55054, 69170, 50401, 35397, 48782, 34598, 32273, 32226, 35114, 19456, 26347, 66283, 72847, 70078, 54270, 72513, 73120, 77735, 72761, 63589, 48436, 49832, 54787, 47079, 44086, 71142, 104266, 108414, 104168, 85423, 70716, 93659]
12296I3659j152k150R937K5555L964l2189j2633L948L1353j4587q037j8030j718
12283G7920r015O063M144j619l331p974r316p514R663M2282M156r477P901p293
12269I6590o675j1665P754M290j8096N62j7550o207L6845J6592J6775K236j9226
12256A02225r625q629J1177J4665K4165k3133m1990K9903K4287K450k8969m236
12244I2290j7382P187N524K309K398j2055p292J3701J127k3320K6844K1580j9483
12231I3428j0519p383J1067J3073l3j0145k9141K4218L0676P102k3869j8538r34
12218G9002J1612J0754k023J6782j2313K0579P165q85L5378J55j5230j2051l350
12205A35575l10P540j9784J4340J4996j0277L304n048J65M121J1729j3770N020
$$ y = [93659, 92507, 90357, 100294, 125849, 129813, 97624, 84991, 88939, 120292, 105705, 97668, 79638, 77920, 68905, 74968, 79112, 77493, 74162, 66188, 56872, 49358, 59021, 101303, 105459, 95982, 103883, 96590, 89915, 78250, 86004, 90294, 72198, 72760, 55210, 49003, 85848, 102440, 119215, 121451, 102225, 92600, 83971, 95148, 109813, 133978, 110845, 68855, 98758, 123045, 125495, 96526, 92290, 74908, 82095, 87619, 89928, 92326, 80271, 72979, 86680, 87807, 64487, 91331, 112911, 93428, 82909, 75526, 86593, 99666, 99633, 89488, 60347, 84565, 115241, 122343, 98474, 79936, 79002, 90614, 101368, 99345, 116127, 103814, 124393, 131558, 130673, 166051, 166206, 150976, 138925, 135575, 135265, 142805, 123021, 137361, 152357, 142080, 145384, 140336, 140501, 144622, 156351, 142581, 147601]
12192A47601r758k6706l524M5248L6497J1627k9949j4906j5517j2411j4735J9331
12180A32798L7937k2804R344J6358N303j0973j0766J4752K4783m91k74K0315O178
12167B22460k5012j9430j3955J1401Q282L474l710J1830O586J099L104J8168R77
12154B25274J0530L496o580Q395J2896K2924L0965p921j4640K5668L1890M0604
12142C83501K8703j6847k365P973j3291r795r593k8337j5353l517p977J9737m312
12129C28527J690n080M879O75J70l5222j1664K8922M1157J8060m074j799j2386
12116C53855k1348L6517J3292j5229k3354J7721j418J9307K5931L0453L8346L3252
12104E07325K2235K5181J8277M8447P5931P1099N2072L4713K3811j0735m6798
$$ y = [147601, 137843, 111137, 107613, 152861, 189358, 200985, 171036, 156130, 140613, 128202, 113467, 132798, 170735, 147931, 157275, 173633, 178936, 167963, 157197, 171949, 196732, 196241, 195967, 216282, 222460, 197448, 178018, 164063, 175464, 183746, 187220, 183510, 195340, 201926, 203025, 206129, 224297, 225274, 235804, 239300, 232720, 241115, 254011, 276935, 307900, 299979, 285339, 311007, 342897, 383501, 412204, 395357, 392992, 400965, 387674, 377879, 368286, 339949, 324596, 321079, 313102, 332839, 328527, 330217, 325137, 330016, 330691, 330861, 295639, 283975, 312897, 354054, 372114, 368040, 366241, 353855, 332507, 369024, 382316, 367087, 343733, 361454, 360036, 379343, 405274, 435727, 474073, 507325, 529560, 554741, 573018, 621465, 697396, 768495, 820567, 855280, 879091, 868356, 821558]
12093H21558m9038j2596n6987n5455l1575M08k4223l2676k7650k270k1169q345
12081D99982J9056K4838k309J847M810J465l3063J2407K1948J180M552p455j8165
12068E31093P771J1945K0009L7058O466m607L1771M4824N4947M6280M2378M1711
12056H71646N1037N8087L5142M7104O9884J8423j3611k0429l9159m1732l1443
12045A004949k4735l3644l7023r779j5064J254j0670n596r461l900J4643m122
12033H66852j4956P313p471J0959L0159R849N660K152K1809M2926L873P929M3631
12020A030685L7520K0814R270K496J7583N3477L0480R26L5187N3828M7122M8875
12008A388263M0779L1401q958l6170J2242N9926O3j3492j1610K3374K6021L8414
$$ y = [821558, 772520, 759924, 702937, 647482, 615907, 616315, 592092, 559416, 531766, 529496, 508327, 499982, 519038, 543876, 541567, 543414, 548224, 549689, 516626, 529033, 550981, 552161, 556713, 549258, 531093, 538864, 550809, 570818, 607876, 614342, 609735, 641506, 686330, 741277, 787557, 829935, 871646, 922683, 980770, 1015912, 1063016, 1132900, 1151323, 1137712, 1117283, 1078124, 1036392, 1004949, 980214, 946570, 909547, 899768, 884704, 885958, 875288, 869692, 860231, 856331, 870974, 866852, 851896, 859209, 851738, 862697, 892856, 902705, 908365, 910517, 932326, 975252, 979125, 987054, 1030685, 1068205, 1089019, 1098289, 1100785, 1118368, 1171845, 1202325, 1203251, 1238438, 1292266, 1339388, 1388263, 1429042, 1460443, 1451485, 1415315, 1427557, 1487483, 1487546, 1474054, 1462444, 1485818, 1511839, 1550253]
11996A550253L2237J1247J6035J6896L3392J5708M3732M7577K4090J6371N0090
11985A857628P3897N5664M0072N1024M6968N8205L0833M3746L3666O3755P1586
11974B427044L8193M4067L9231O1143P6607N7727O9218Q2012R1149Q3020P1675
11963C141086P3207N4495P5931P9715R3863J14648J19998J20924R5071Q5869J02231
11952D157038J29826J12339J20225J06395R7958J23833R6610J13154J38939J38585
11942E334902J39355J32156J42495J53739J46480R6421J09609J45177J58935J34779
11932F694048R3917J49987J35707J23619J20944J00593J16405J21712Q8721P4380
11922G820033J02689Q4302M2702J9666M7548K9697J7918N3903L7457R392l4649
$$ y = [1550253, 1582490, 1593737, 1609772, 1626668, 1660060, 1675768, 1719500, 1767077, 1791167, 1807538, 1857628, 1931525, 1987189, 2027261, 2078285, 2125253, 2183458, 2214291, 2258037, 2291703, 2355458, 2427044, 2465237, 2509304, 2548535, 2609678, 2686285, 2744012, 2813230, 2895242, 2986391, 3069411, 3141086, 3214293, 3268788, 3344719, 3424434, 3518297, 3632945, 3752943, 3873867, 3968938, 4054807, 4157038, 4286864, 4399203, 4519428, 4625823, 4723781, 4847614, 4944224, 5057378, 5196317, 5334902, 5474257, 5606413, 5748908, 5902647, 6049127, 6145548, 6255157, 6400334, 6559269, 6694048, 6787965, 6937952, 7073659, 7197278, 7318222, 7418815, 7535220, 7656932, 7745653, 7820033, 7922722, 8007024, 8049726, 8069392, 8116940, 8146637, 8164555, 8218458, 8255915, 8265307, 8230658]
11911H230658q748k9475l3978q7605j09073p1784q2013r7190r7059j29817j17864
11900G366052j10963j32795j53846q2322j01193j29764j30239j26853j11102j40312
11890F146663j47280j40538j53000j36285j39356j24627j43597j50042r7477r2336
11880D822125j19501j32667j20975r7593r9653r1546j11667j30488j22831p8271
11870C716933q4572r8523r1315r7970o4159k9586n4323j03840r2267p6547o5610
11859B858221m3754l8909n3577p5181p5612r3006o3979m8375m5324n6454n5716
11848B208334l0549l6387k7461m3199l1126n4296p4137o8780l5180k9440o5331
11837A712448l7149j5399n6824k6447k8476l2525O656k1043l5999k5655l7288
$$ y = [8230658, 8221910, 8192435, 8158457, 8070852, 7961779, 7889995, 7807982, 7710792, 7613733, 7483916, 7366052, 7255089, 7122294, 6968448, 6886126, 6784933, 6655169, 6524930, 6398077, 6286975, 6146663, 5999383, 5858845, 5705845, 5569560, 5430204, 5305577, 5161980, 5011938, 4914461, 4822125, 4702624, 4569957, 4448982, 4351389, 4251736, 4160190, 4048523, 3918035, 3795204, 3716933, 3632361, 3533838, 3442523, 3344553, 3280394, 3250808, 3196485, 3092645, 3000378, 2923831, 2858221, 2814467, 2775558, 2721981, 2646800, 2571188, 2478182, 2414203, 2365828, 2320504, 2264050, 2208334, 2177785, 2141398, 2113937, 2070738, 2039612, 1985316, 1911179, 1842399, 1807219, 1777779, 1712448, 1675299, 1659900, 1603076, 1576629, 1548153, 1515628, 1522284, 1501241, 1465242, 1439587, 1402299]
11826A402299l7622m4184j7785l512j7253j9453l7101l9527k0292l1696j2366
11815A121508k8208k5518k4274k9460j5862m854o959j3159j5569j4516j5460k2662
11803I05007k5938J809L868k4767k8604k090j7529j4817N969J309p866q252m638
11790G83461m694l2154k0211k2242J2847n436l3013m9850k6388J7033R010k54
11778F28109J7665L9881j0149l0633n004j7398k9126k4906k5795n563r644k3139
11766E04298l951J6245j3786l1582O880K1361j2097k2006l158k2815j5295j2153
11754D11941j2404j2457K4492O624r568J1950o660R514l290l9848M678k3687j1857
11741C49428o677j8925J7521O431K2182J3522M180L518k8157m1601K163K5931
$$ y = [1402299, 1364677, 1320493, 1302708, 1299196, 1281943, 1262490, 1225389, 1185862, 1165570, 1133874, 1121508, 1093300, 1067782, 1043508, 1014048, 998186, 993332, 986373, 973214, 957645, 943129, 927669, 905007, 879069, 880878, 884746, 859979, 831375, 829285, 811756, 796939, 802908, 804217, 796351, 788099, 783461, 778767, 746613, 726402, 704160, 717007, 711571, 678558, 628708, 602320, 619353, 628363, 628109, 645774, 685655, 675506, 644873, 639869, 622471, 593345, 568439, 542644, 537081, 527437, 504298, 500347, 516592, 502806, 471224, 478104, 499465, 487368, 465362, 462204, 439389, 424094, 411941, 399537, 387080, 411572, 418196, 408628, 420578, 413918, 423432, 420142, 380294, 384972, 361285, 349428, 342751, 323826, 341347, 347778, 369960, 383482, 387662, 391180, 363023, 321422, 323585, 349516]
11729C49516k0115k4484N760J6598K7099m847l2380k1037j4030J128K8675k9492
11717B82391j9403J7544J2729R385p827k0435j3074L940K1851J120j5826m333
11705B68062M992j5178k1477j2855J910K6362J9650M965j2550L501k1j5508j5798
11692B36055J0327J9610L225N447p581l3442k8685j530m901J3680J9893l1927
11680B00171O90J897J6654K74j829J5807l085k3753k1199L772l322J5193m225
11667A97045l5105M431L3630K3142n037l2936j1377R76J0624k831j7221l549M041
11654A65833P138m067j1319O714P447j1602K625p828l780q272M525j590k0886
11641A24938j1383K8954k932k0686L954J5504J3101j367k8683l509M278J5832
$$ y = [349516, 329401, 304917, 310677, 327275, 354374, 349527, 317147, 296110, 282080, 283208, 311883, 282391, 262988, 280532, 293261, 302646, 294819, 274384, 261310, 265250, 287101, 288221, 272395, 268062, 273054, 257876, 236399, 223544, 225454, 251816, 271466, 276431, 263881, 267382, 267361, 251853, 236055, 246382, 265992, 269217, 274664, 267083, 233641, 204956, 203426, 198525, 212205, 232098, 200171, 200861, 202758, 219412, 219686, 217857, 233664, 230579, 206826, 185627, 189399, 186077, 201270, 197045, 161940, 166371, 200001, 223143, 218106, 185170, 173793, 174769, 185393, 182562, 165341, 161792, 165833, 172971, 168904, 157585, 164299, 171746, 160144, 162769, 154941, 151161, 142889, 147414, 145824, 124938, 113555, 142509, 139577, 118891, 122845, 138349, 151450, 150083, 121400, 117891, 122169, 138001]
11629A38001K4005J4195j3831k3356m780j0115j6079l440J7317L5895r67J6460
11617A73305J9154m1092m0710J3920o77j3831J0009n000J3194N302k1818o034
11605A05722P050O468j7497p010L058M580L0982n332m4608k330K7436j1408q010
11592H9101J3335J3935j2451Q381J674o938J2450j4603j4374J6185l420R666j320
11579A11621o698l628K488J2614k091j4290k2397l776K8130j6007k1119J3500
11567G8347O94Q766N396j786J7350j3405j1280k4036o166J6487J7281R167j0490
11554H6325j2441k1327p540K7061J5570o236R656N930M346k5578j5916l612J3941
11541G0179Q088k634P764O414n902k514L249k582J1766J7873k1961j8773k7333
$$ y = [138001, 162006, 176201, 162370, 139014, 134234, 124119, 108040, 104600, 121917, 157812, 156845, 173305, 192459, 151367, 110657, 124577, 123900, 110069, 120078, 115078, 128272, 133574, 111756, 105722, 112772, 119240, 101743, 94733, 97791, 102371, 133353, 128021, 83413, 81083, 108519, 97111, 89101, 102436, 116371, 103920, 112301, 113975, 107037, 119487, 104884, 90510, 106695, 103275, 112941, 111621, 104923, 101295, 103783, 116397, 114306, 100016, 77619, 73843, 101973, 85966, 64847, 78347, 79041, 87807, 93203, 91417, 108767, 95362, 84082, 60046, 53880, 70367, 87648, 96815, 86325, 73884, 52557, 45017, 72078, 87648, 81412, 91068, 96998, 101344, 75766, 59850, 56238, 70179, 78267, 75633, 83397, 89811, 83909, 81395, 84644, 82062, 93828, 111701, 89740, 70967, 43634]
11528D3634j6245K9394J2852K760o524j1938r341k0319p099o236J8907M320O030
11515D0195o537N801J2036P834r075K8911m718j9101j9230j4508j9742O454K0566
11502B8886M8033K3362l5075m9541j0232J2596j3101j9676J6706K0237M646J5588
11490D2429k866n121P382K2233m018k8294J7838K776K57K207j8023J7638R067
11477F3505J2304l473j7930l1262J5231J8896J663j2696J8208J6944J2426j2489
11465H1327L355P13j8920m428m262o917j0421Q797P41J576N810j6116j2889l4283
11451e917j536M946j9360J7849K9834J7698j8611n746J7871K1007R60l046K315
11438E8264L773J3978j4279k7977J030k6490j1076j3430J0220l429J6447N122
$$ y = [43634, 27389, 56783, 69635, 72395, 65871, 53933, 44592, 24273, 17174, 10938, 29845, 34165, 40195, 33658, 39459, 51495, 59329, 50254, 79165, 74447, 55346, 36116, 21608, 1866, 8320, 28886, 76919, 100281, 65206, 15665, 5433, 18029, 4928, -14748, 1958, 22195, 26841, 42429, 39563, 34442, 41824, 64057, 60039, 31745, 49583, 52359, 52616, 54823, 36800, 54438, 63505, 75809, 72336, 54406, 23144, 38375, 57271, 58934, 46238, 64446, 81390, 93816, 81327, 84682, 85395, 66475, 62047, 57785, 50868, 40447, 49244, 49985, 51561, 57371, 41255, 28366, -5917, -7453, -2507, -21867, -4018, 25816, 43514, 24903, 19157, 37028, 58035, 58995, 55949, 58264, 62037, 76015, 61736, 33759, 34789, 8299, -2777, -16207, -5987, -9416, 7031, 12153]
11426A2153j05R185n769K539K1038j3714M291J6520n216j5446J7264M4151k940
11413H3951l4255l8446n869L2558J5053J2595k0507P606n58N289J2607m457l0201
11400C5366l2292j9547N325J165K687j1750J2561l346N495M3123J1726l6743j1721
11387B049K2569j0275q548j1510J4419M666j6863m268J6555K4611o648k1297J5919
11374B1379K3379p954J1956j3978j1094j1469j8434r454J1944L4944o401j8477
11362F341K4688K6976j8068M257O155J720p450l1302k6994J8999K4760O318p612
11349B8788K5670K2763P12l3417j2016J7384j7089k1770q260P152r739p615K6082
11336A8645R005k4415k7488k644j0992j7558l991J7965J232R708O889J7938j6709
$$ y = [12153, 12048, 21233, 15464, 18003, 39041, 25327, 29618, 46138, 40922, 25476, 42740, 86891, 83951, 49696, 11250, 5381, 37939, 52992, 65587, 45080, 52686, 52128, 57417, 70024, 65567, 35366, 3074, -16473, -11148, -9983, -7296, -19046, -6485, -9831, -4336, 38787, 50513, 13770, 2049, 24618, 14343, 5795, -5715, 8704, 13370, -3493, -7761, 8794, 33405, 26757, 5460, 21379, 44758, 36804, 48760, 34782, 23688, 12219, -6215, -15669, -3725, 31219, 24818, 6341, 31029, 58005, 39937, 44194, 50349, 52069, 44619, 13317, -13677, 5322, 30082, 36400, 28788, 54458, 77221, 77933, 44516, 32500, 49884, 32795, 11025, 2765, 9917, 178, -7437, 18645, 27650, 3235, -24253, -26897, -37889, -55447, -59438, -41473, -40241, -30533, -23644, -5706, -22415]
11323b2415J8783O239L121K0396L158Q88M324N66m95L169r693o543m606l7675
11309b0783K575K2443J6691P111P502K6034P097n052k8724J595J8952q3j4907
11296D0451k40j316m974k9543j3158j839J1364J2484r26q630j7534K3883K0629
11283C0651K3787j8755l3664l4839L1864J3917n096k3111J6866N831J0205n603
11271A2053o237n407J2212K0683r203M464K0187q591k6199m680j830k1167j9496
11258c3211K0539L2691n639J3664Q395j0387j4637P963N82K834J1575m911j2574
11245A6884j4070J1796M274j2066J7k350K4924P160k510O047j0160P029K0594
11232E7569k8173k0764Q266K8016K644k2462p959P663M272P203J4284r55k196
$$ y = [-22415, -3632, 2607, 5728, 26124, 29282, 30170, 34494, 35060, 34565, 37734, 28041, 21498, 16892, -20783, -18208, 4235, 20926, 28037, 35539, 61573, 68670, 63618, 34894, 36489, 55441, 55358, 40451, 40211, 38895, 33921, 4378, -8780, -10619, 745, 13229, 12303, 3673, -13861, 10022, 30651, 54438, 35683, 2019, -32820, -956, 12961, 7865, -15246, 1620, 7451, 17656, 12053, 5816, 409, 12621, 33304, 24101, 28565, 48752, 40161, 13962, 9282, 7452, -13715, -33211, -12672, 20019, 14380, 28044, 36439, 26052, 11415, 19378, 19960, 22794, 34369, 29458, 16884, 2814, 14610, 18884, 6818, 6835, 4485, 29409, 36569, 34059, 40106, 29946, 36975, 57569, 29396, 8632, 16898, 44914, 47558, 25096, 17137, 24800, 29072, 36275, 50559, 49604, 47408]
11219D7408j7816J947l3558o424J0527P586o679J1503j9788q904j981J8445K8857
11206C1123o27l977j1272m351J4408M811J561P762r592k6111p315J1174k1293
11193a3699o309M396J7611M178K4502M4027k2703l0496j1587J3673k391J7318
11181C8520k1090J050n391k4302L828J3411j0852L0347J6410Q385j3498j9700
11169A7118K6283J6546m075k5591l8207k06J9945J2015j244k2968K2924J6J715
11156B4271k2300k842N566R465M0273J1469j791k5609k9028n885o222j8320j3881
11143c4834K1638M398N496Q440m068J8847K8813j9538j9504N326J3519J8360j8576
11130B8317j6480m839k1465r262L1646L3007j6442l238J6619j7912j9796J2969
$$ y = [47408, 29592, 31539, -2019, -8443, 2084, 9670, 2991, 14494, -5294, -14198, -16179, 2266, 31123, 30496, 26519, 15247, 10896, 25304, 30115, 31676, 39438, 29846, 3735, -3580, 7594, -13699, -20008, -15612, 1999, 6177, 30679, 74706, 52003, 21507, 9920, 23593, 21202, 38520, 17430, 18480, 13089, -11213, -7385, 6026, -4826, 25521, 41931, 50316, 36818, 17118, 43401, 59947, 55872, 30281, -7926, -8132, 11813, 23828, 22584, -384, 22540, 22556, 24271, 1971, -871, 4695, 14160, 54433, 65902, 64111, 38502, 9474, 3589, -2633, -20953, -34834, -13196, -8798, -3302, 5138, 1070, 19917, 48730, 29192, 9688, 15014, 28533, 46893, 28317, 11837, 6998, -14467, -23729, 7917, 40924, 24482, 21244, 37863, 19951, 155, 13124]
11118A3124J9415J7202j804j4222k43J0378O262j4235l2841k7307N521l607J3364
11105h993J8832J8406M917Q792l3706l0698M968J8847Q22K5142K2388j6992k0109
11092A2616n664M508P164J277q549R096k838k4096j2617R208O148P09M216o437
11078e259q347N541J4674K5287Q176j4486M998k7478l137K2362m394k9766O608
11065e221J0455J2315M698j0726l165Q955j6484j3466P347K155j2276J9563J2087
11052A6237P339K2311L0896K5167J1885J6336K2233J5720j7114j77R206j6708
11040A43331j0405J5704K5820j7675J4579M3308P1522M8423K624l062m2164n6913
11028B35092j9475J181J2506J2258O1041Q0049N4381L263k0169l5656n3451l7911
$$ y = [13124, 32539, 49741, 47937, 33715, 33472, 43850, 50112, 35877, 3036, -24271, -18750, -22357, -8993, 9839, 28245, 33162, 41954, 8248, -22450, -17482, 1365, 2187, 27329, 49717, 32725, 12616, 6952, 11460, 18624, 19901, 11352, 20448, 17610, -6486, -19103, -9895, -3747, -3038, 1178, -5259, -13606, -8065, 6609, 31896, 40072, 25586, 30584, 3106, -31, 22331, 17937, -11829, -5221, 5234, 17549, 22247, 11521, 8356, 17311, 827, -12639, -5292, -3137, -15413, 4150, 16237, 23576, 45887, 76783, 101950, 113835, 130171, 152404, 168124, 151010, 150833, 160039, 143331, 132926, 148630, 174450, 156775, 171354, 214662, 286184, 334607, 337231, 334169, 292005, 235092, 215617, 216798, 229304, 241562, 302603, 382652, 437033, 440296, 420127, 384471, 331020, 293109]
11016B93109m0514m563J1543o55l533k295K2579M9155J2242k4009p3587o0146
11004A79326l4049j9783q270j8584J7628M649J3024P585J6577J2799j2263l8646
10992A19993l7780l9089P663j0679j6757m792j5522N182J2619l945j4611l658
10980a376K2424N799j5147J5052J2681k3465l0248K3400Q015j1880n160L824j214
10967B705k782k1276K251P799Q267j6059n83q936Q62j8568k7120M892K0553n400
10953e3395Q382L1778M2808K5832O139k9178l5405j9995O961j2759j3005J4393
10941b7444L1672J9823j0571j3842J8218K2073j4895M843K2501o120l9313j5507
10929h562l067r693l337J3839J5214m044j0842j5977j2806N0048L9357k7316n849
$$ y = [293109, 252595, 248032, 259575, 258920, 255387, 253092, 275671, 324826, 337068, 313059, 239472, 179326, 145277, 125494, 117224, 98640, 116268, 120917, 133941, 141526, 158103, 170902, 158639, 119993, 82213, 43124, 50787, 40108, 23351, 18559, 3037, 8219, 20838, 16893, 2282, -1376, 21048, 26847, 11700, 26752, 39433, 15968, -14280, 9120, 17135, 5255, 95, 3919, 2705, -77, -21353, -19102, -11303, -3036, -19095, -19678, -28614, -27752, -46320, -73440, -68548, -47995, -53395, -45013, -13235, 29573, 55405, 61544, 32366, -3039, -23034, -16073, -28832, -41837, -27444, 4228, 24051, 13480, -362, 17856, 39929, 25034, 29877, 52378, 46258, 6945, -8562, -11629, -21322, -24659, -10820, 4394, 350, -10492, -26469, -39275, 10773, 50130, 22814, 16965]
10916A6965j8605M874O99R558k421r365j0174k8941L533K6309K8640K997j3759
10903A0310q750k3547j3826j3384J3369L0741p059j994K306O668J9349k300r54
10890A0929L917Q817N11O863l250L878N113J3522j381Q469Q073j168j357k696
10876F0240N412j5821l0392J3424p377Q080j6922J1567Q400o039n393J4527j0865
10863B8841n901J5693K8070j2162r926q074m621J7796K0848L389j2950p97k1777
10850C8429j9994O911j8778J0775j3910K0620K4063O005J0091J7790K1724J3120
10838A16846p76k7070j3322k9300k4426L25K6050K9732J6070R896k1835n6142
10826B6048l7815P624K3186q305J5495Q965o101J4360k3122J4111n26J634m338
$$ y = [16965, -1640, 3234, 3933, 13491, 11070, 1705, -8469, -37410, -33877, -7568, 21072, 24069, 10310, 1560, -21987, -35813, -49197, -35828, -5087, -12146, -14140, -11834, -5166, 14183, 11883, 10929, 14846, 23663, 24174, 31037, 27787, 31665, 36778, 50300, 48919, 57388, 65461, 64293, 62936, 60240, 65652, 49831, 19439, 32863, 25486, 33566, 16644, 28211, 36611, 30572, 25179, 39706, 28841, 22940, 38633, 66703, 54541, 44615, 36541, 31920, 49716, 70564, 73953, 61003, 60206, 38429, 18435, 25346, 6568, 17343, 3433, 24053, 48116, 54121, 64212, 82002, 103726, 116846, 116070, 89000, 75678, 46378, 21952, 22277, 48327, 78059, 94129, 104025, 82190, 26048, -11767, -4143, 19043, 10738, 26233, 35198, 29097, 43457, 20335, 34446, 33920, 35554, 31216]
10813C1216M48K8580k0582j3115k2689o048M676r095Q777O329K2654J2372M052
10800D7575j5671l6825o784k248K7766k025J5053J2760K3466j6272j5415N455
10788C6835K1960M7r476j1302j0171J267n159j3259j7065q861K292r877N579K583
10774a4607N219K3215J1322k4864Q745J1484k3298k5827n766J3584Q989O660Q778
10761C634o512r986K1116J8310p22j7100j3668j6503K53L1450L1640o653j5643
10748A9616j2636o284M650L464K0209J3181L080M657j3660K9929J4222L331J5113
10735I8872m3207j5002K2117m746j9998L874L9848K7970k3626J1501L4442K0877
10723A52922k5428j9311O075k4186j0903N946j4281J5294Q752K4727J9007J6147
$$ y = [31216, 31664, 60244, 39662, 26547, 3858, -2190, 2486, -6609, 2168, 8497, 31151, 43523, 47575, 31904, -4921, -11705, -13953, 13813, 11788, 26841, 39601, 63067, 46795, 31380, 36835, 58795, 58842, 49366, 38064, 27893, 29160, 24001, 10742, -6323, -15184, -12892, -22769, -17190, -14607, -9388, 13827, 25149, 285, 9030, 20514, -2784, -28611, -34377, -20793, -11804, -5144, 3634, -2878, -12864, 8252, 26562, 25840, 8740, -4928, -21431, -21178, 10272, 41912, 35259, 19616, 6980, 696, 5346, 8810, 29019, 42200, 45280, 49937, 36277, 66206, 80428, 83759, 98872, 55665, 40663, 62780, 58034, 38036, 41910, 81758, 109728, 86102, 97603, 132045, 152922, 127494, 108183, 114258, 90072, 79169, 85115, 70834, 86128, 94880, 119607, 138614, 154761]
10711A54761j1554k7132M723L222j5665J087J3446J4382J5686J016N956J4625
10699A74553n864n7831l0069n923J8274K2603j1003J0709K2004k1009k5628J0216
10687A01032L5545K6103j0081J695P928m822K796r689O45j0810N305J1453L084
10674A60184J6473o518J0895L354J3325J2044J0494K3212K421k2241N483O100
10662B35226J1992N224N659K1185O889o262l885n411K2946Q476K0942M7805J4727
10649C85513N996K7781L9542L2032K6236p438m513J1731L5755M6666M9324Q2507
10637G31132P0197O0914Q1109J03407J26288J97838J92541J26731J17642J40312
10627A948111J94019K05683K58660L69097M80086O66933R25543J323986J804271
$$ y = [154761, 143207, 116075, 120798, 124020, 108355, 109442, 122888, 137270, 152956, 153972, 159928, 174553, 168689, 110858, 80789, 74866, 93140, 115743, 104740, 115449, 137453, 116444, 90816, 101032, 136577, 162680, 152599, 154294, 162222, 157400, 160196, 150507, 151152, 140342, 145647, 157100, 160184, 176657, 170139, 181034, 184388, 197713, 209757, 220251, 243463, 245884, 223643, 229126, 235226, 247218, 252442, 258101, 279286, 286175, 279913, 276028, 270617, 293563, 302039, 322981, 370786, 385513, 391509, 419290, 458832, 490864, 517100, 509662, 505149, 516880, 552635, 599301, 648625, 731132, 801329, 862243, 943352, 1046759, 1173047, 1370885, 1563426, 1690157, 1807799, 1948111, 2142130, 2347813, 2606473, 2975570, 3455656, 4122589, 5048132, 6372118, 8176389]
10618H176389K397566L172047L874145L836612K599457O11245r76051j517621
10610B2173789j125057k21040R35521K364003M098207O217785Q025191P831011
10602E0299410M206070j160533m748844n377101m080533k057218K28930K652542
10594C9962723N403693Q275644J0358825R242439L255461m651679r341332r699111
10586E2806663p626833m969918k402975m1829K259644M425306N669765M466010
10578E4585833R8629n091941p791809p515499n803641l884212k235160q39270
10570B1522930L21399J225484J519354P47641j005464k903292l850528l720913
10562A3856611l025136k315744j712350j234477r28964p01384n70192m59468l29781
$$ y = [8176389, 10573955, 13746002, 17620147, 21456759, 24056216, 24667461, 23691410, 22173789, 21048732, 20827692, 21763213, 24127216, 28225423, 34443208, 42468399, 50299410, 54505480, 53344947, 48596103, 43219002, 39138469, 37081251, 37310181, 39962723, 45366416, 53642060, 64000885, 73243324, 76498785, 71847106, 62505774, 52806663, 45179830, 40209912, 37806937, 37765108, 40024752, 44450058, 50119823, 54585833, 54684462, 49592521, 41800712, 34285213, 28481572, 24597360, 22362200, 21522930, 21844329, 23069813, 24589167, 25336808, 24331344, 21428052, 17577524, 13856611, 10831475, 8515731, 6803381, 5568904, 4639940, 3938556, 3368364, 2908896, 2579115]
10553B579115k83368k47685k07364j75430j54186j33006j23974r8695r4512p5920
10543I84975n7635q9640o5519n7606n1657l0355m3730m2466l3309k770J4925o036
10531E19177j2546k0784m8862j9890R87k4543l4754j9433R053N600j5139k4021
10519C14845J1215J1250k3561k4641j3948M66K2687j1035N365j5031j2650j4796
10507B50166k1329J824j2074n726K4027l4474q851J4922L427r806k0026J1847
10495A93927J2371k0962n99q542l7345l1880R88K1152J6368K9345J2996J3394
10483B01213l2766m2312j8381n22L475l388p640K4203J0737l6549J569J3818p824
10470A05633r52K2166K7677j3785j4712J0104K0322p902j978J3261j4555j732
$$ y = [2579115, 2295747, 2048062, 1840698, 1665268, 1511082, 1378076, 1254102, 1155407, 1060895, 984975, 927340, 837700, 772181, 714575, 662918, 632563, 588833, 546367, 513058, 510288, 525213, 519177, 506631, 485847, 436985, 417095, 418082, 393539, 358785, 339352, 348405, 354005, 338866, 314845, 326060, 337310, 313749, 289108, 275160, 275626, 298313, 287278, 292643, 277612, 264962, 250166, 228837, 230661, 218587, 212861, 236888, 202414, 193563, 208485, 211912, 202106, 182080, 193927, 206298, 185336, 184737, 176195, 138850, 106970, 107958, 129110, 145478, 174823, 187819, 201213, 168447, 126135, 107754, 107232, 110707, 107319, 99679, 123882, 134619, 98070, 99639, 113457, 105633, 104681, 126847, 154524, 140739, 126027, 136131, 156453, 148551, 146573, 159834, 145279, 143547]
10458A43547k7508k3743O71J6031L324K273J0176J3919P684j118o007r707l012
10445A26530k3072l0582O761J4220K012R366K0210O576j1761L329J5174J5213
10433A53976j4753j1386l120J343j8637M408q405K1841j1740j3115n685j3277
10421H1450q528K1358J4975j830k7066Q900N688M50J2361L7981R424k8659l3290
10408I3214m0115j7628K6271P238J9951L6105j7605k2859j7154j0320J0517J3985
10396H1600k046k8491k5194L6359J9553K534R67j5032K6248K2025j2145j9636
10384H6742L024K2241k0711J0360k297j8125k336j7613j0119l937Q930J1049p169
10371F0039J2378R443J0268j6798p399l695k528J3531j9849m677M354j3908J3800
$$ y = [143547, 116039, 92296, 92967, 108998, 112322, 114595, 124771, 138690, 146374, 145256, 139249, 129542, 126530, 103458, 72876, 79637, 93857, 95869, 105235, 125445, 132021, 120260, 123589, 138763, 153976, 139223, 127837, 124717, 126060, 107423, 111831, 103426, 125267, 113527, 100412, 94727, 81450, 72922, 94280, 109255, 107425, 80359, 89259, 94947, 95397, 107758, 145739, 155163, 126504, 93214, 53099, 35471, 61742, 68980, 88931, 125036, 107431, 84572, 67418, 57098, 67615, 81600, 79554, 51063, 25869, 62228, 81781, 84315, 85282, 70250, 96498, 118523, 106378, 86742, 89766, 112007, 91296, 101656, 99359, 81234, 78898, 61285, 51166, 47229, 56159, 67208, 60039, 72417, 81860, 92128, 75330, 67931, 64236, 61708, 75239, 55390, 50713, 55067, 41159, 54959]
10358E4959J3734J1776K457k3816Q85Q796m86r293k838k013j1739j9153K4700
10345D7969p232Q56p657K1754k534k4952l593J0920n961j396L526L3349K0924
10332H5973k7434L0591J4312L132K85l501j0192j7802l7164J448K6618M0j5430
10319E0876m8719n164J8287K2362L712L867R58j7762j7576M591o567q846L1734
10306C1753J0053L340J0511j0078j5651n326K8927K7213J320m957j6010k2046
10294C9049R505L2441j2661j3276l0156q168j5946J585K501r0J4663K0286J1177
10281E0910J9376L7829J9552m330j9004Q918J8049o994k2893L026J202J7292k4363
10268I8570J9740j4811l1526P65J9811k6280k7955l3680N549L1159K1832l36J4052
$$ y = [54959, 68693, 80469, 82926, 59110, 59995, 68791, 68305, 59012, 56174, 54161, 42422, 23269, 47969, 40737, 41593, 33936, 55690, 53156, 28204, 24611, 35531, 29570, 28174, 31700, 65049, 85973, 58539, 89130, 103442, 106574, 106859, 103358, 93166, 75364, 38200, 39648, 66266, 66306, 50876, 2157, -3007, 15280, 37642, 41354, 45221, 46179, 28417, 10841, 15432, 8865, 19, 31753, 41806, 45146, 55657, 45579, 29928, 24602, 53529, 80742, 82062, 77105, 61095, 39049, 48554, 80995, 68334, 55058, 24902, 16734, 788, 2373, 4874, 4784, 19447, 39733, 50910, 70286, 108115, 127667, 123337, 104333, 113251, 131300, 124306, 101413, 104439, 105641, 122933, 98570, 118310, 103499, 71973, 72738, 92549, 66269, 38314, 4634, 10183, 41342, 63174, 62838, 76890]
10255G6890l546L524j4806j3410j2500K835K6368M5175L5481J010k0697l1441
10243I4883n581K0877j1032l4592J8673P640M209n721j6687K5040J1659Q800r302
10230A08866j4224L274K970m1708k3848K264K1858J9151o961K310k6403j0824
10218C6725n664J0974J3473J7500K7449J5319l7189j6956J0655K5875M9464J21
10206A47746k1345j1648m329K3112j0007k024j8418m0771R279O353N024k0226
10194F2746k3700r838J9685K3806K5068R189j9035K456J0610K9268K4363J0435
10182A65053k726j8093K3976M8993j7351j0934j5194o519L1005K384k183K1952
10170B20363M4191J7305L8388L3771J1458P274l3614l0776j6696j0730O210O482
$$ y = [76890, 73344, 76868, 62062, 48652, 36152, 38987, 65355, 110530, 146011, 147021, 126324, 94883, 89302, 110179, 99147, 64555, 83228, 90868, 95077, 89356, 72669, 97709, 109368, 118168, 108866, 94642, 97916, 100886, 59178, 35330, 37594, 59452, 78603, 71642, 73952, 47549, 36725, 31061, 42035, 55508, 73008, 100457, 115776, 78587, 61631, 72286, 98161, 147625, 147746, 126401, 114753, 110424, 133536, 123529, 121505, 103087, 62316, 71595, 77948, 82972, 62746, 39046, 29208, 48893, 72699, 97767, 106956, 87921, 90377, 100987, 130255, 154618, 165053, 162327, 144234, 168210, 217203, 199852, 188918, 173724, 167205, 198210, 200594, 198411, 220363, 264554, 281859, 320247, 354018, 365476, 372750, 339136, 308360, 291664, 280934, 287144, 293626]
10158B93626L2458M2376N0607L6260K3211k9634j9112k0554n3102l5790m685J3640
10146C29301K2987K4632J082K2117J4342L3926k4862l8117l2436k6041J2750k1336
10134C18345l64J5955j4484j073K6570j6942p051p586K0625n486p202j1222Q008
10121C18093J9820M6340J8332J4684J8977J9177L0544L2259J6875M7862P2881
10110F55844N8068O5748J34710J92141K00846J81638J76235Q6928J5725j01629
10100A666254j54639j79023j40891j50515r8424o6717l8618m0491n1882n5094
10090F89960k4502j488K455O91J4264l8313j0526j2214j8229j8548j6118R933
10078E77365j3138k5091j3834K9592Q124k479k4404l9830l972k4912j3475r525
$$ y = [293626, 326084, 368460, 419067, 455327, 478538, 448904, 429792, 409238, 356136, 320346, 315661, 329301, 352288, 376920, 378002, 400119, 414461, 448387, 423525, 385408, 352972, 326931, 339681, 318345, 317981, 333936, 319452, 318379, 344949, 328007, 320956, 313370, 333995, 328509, 321307, 310085, 318093, 337913, 384253, 402585, 417269, 436246, 455423, 485967, 518226, 535101, 582963, 655844, 713912, 779660, 914370, 1106511, 1307357, 1488995, 1665230, 1752158, 1767883, 1666254, 1511615, 1332592, 1191701, 1041186, 942762, 876045, 837427, 796936, 745054, 689960, 665458, 663970, 666425, 667116, 681380, 643067, 632541, 620327, 602098, 583550, 567432, 577365, 564227, 539136, 525302, 554894, 563018, 560539, 536135, 496305, 492333, 467421, 453946, 444421]
10066D44421k256j2019k7201j2258R13j0937J3547J5339l0803m1905p730k0384
10054C08727j8578R241o423j9972K559k1445N113j9251l2222K0474J5220l9615
10042B03828q187J6218j6002k0004N030l7778k0736r273n295K6731j784l338l0381
10029I9029j2731q045j1851n005p595J978P918P006L4712J2401l2392j9031l0276
10016C6118m9745l2118q56j4329K1680J3516j146n335L5953N2173K6921K7302
10004A10134L220l5634j2130J7732J2802J5911M658J3690q8J3463j0506o905m730
9991A21617m925M569L166j2608N992K2998j5m336j5541j5907M075J3631J0843
9978A33559L520q143R877N8163M0952o127j918J1994n650j7763K2051j317l6127
$$ y = [444421, 442165, 430146, 402945, 390687, 391600, 380663, 394210, 409549, 378746, 336841, 329111, 308727, 290149, 299390, 292967, 272995, 275554, 254109, 259222, 239971, 207749, 228223, 243443, 203828, 195641, 211859, 195857, 175853, 180883, 143105, 122369, 113096, 107801, 134532, 132748, 129410, 99029, 86298, 78253, 66402, 61397, 53802, 55780, 63698, 70704, 105416, 117817, 85425, 66394, 36118, -13627, -45745, -46601, -60930, -39250, -25734, -26880, -32215, 3738, 55911, 82832, 110134, 113354, 77720, 65590, 83322, 96124, 112035, 116693, 130383, 130295, 143758, 133252, 126347, 121617, 116692, 121261, 124427, 111819, 117811, 140809, 140794, 136458, 120917, 105010, 109085, 122716, 133559, 137079, 128936, 138813, 196976, 237928, 231801, 229883, 241877, 236227, 218464, 240515, 239198, 203071]
9965B03071J4398J4552j853L1189K0333M209p149J9035m878n288J6748K0888p303
9952C17952M231j2423j2988J3090J2488q847k5246N400Q231k2705j1910J022n559
9939B62736n15L5987L7215L808L081J9897J5458M9398P2776L5022o3034q3059
9927C88770m8246N961j3552k2193l4273j9864N516o620l3388l0104j2615J2473
9915A91865J7873K4888Q666q894k918N397r00N540J6182k954k2622k3163o476
9902B02484K0082l909j8296k4978L0838K6064O119k093J7143k0534k6130l757
9890B03033J2869j1143J1805k786J4939N349j2114J6631j9543j6323R368L6846
9878B48931K3153K5873j896l8838N404k1350O370k8812K4717R514k4952J4524
$$ y = [203071, 217469, 232021, 230168, 261357, 281690, 285899, 278750, 297785, 292907, 287619, 304367, 325255, 317952, 322183, 309760, 296772, 309862, 322350, 313503, 288257, 293657, 301888, 279183, 267273, 268295, 262736, 262221, 298208, 335423, 339231, 342312, 362209, 377667, 427065, 499841, 534863, 471829, 388770, 340524, 346485, 332933, 310740, 276467, 256603, 262119, 255499, 222111, 192007, 179392, 191865, 209738, 234626, 243292, 234398, 231480, 236877, 235977, 241517, 257699, 254745, 232123, 208960, 202484, 222566, 218657, 200361, 175383, 206221, 232285, 238404, 236311, 253454, 232920, 206790, 203033, 215902, 204759, 216564, 213778, 228717, 234066, 221952, 238583, 219040, 202717, 212085, 248931, 272084, 297957, 296061, 257223, 262627, 241277, 247647, 218835, 243552, 253066, 228114, 242638]
9866B42638p14J0659J8437j2374K068J6577q155k7980l2812N216J5802q004q349
9853B13009L3206J0043k4186K5188q318j0920K0746K7469J1000K1391L1801L4154
9841C84583K3696O3445L2674J3315j6188l6522k3638l3839k7034o8536k9216N2624
9829C35364N9446P4707J09789J13417P5359L9664K9739Q598j8663l6479j9220
9818G71721p285l4193l3676l5984Q759J7639M447n386K383j4348K4651n297q200
9805F85231m932K9555N1860k4335j4644J9831J3886o641J1688L9247j526L118
9793H02338K5141J3232J5401L5103K5806J3812K2146J8147K0294R488J0219K0019
9781A031146K2935K9692K2576M7588L6092J8449L2487L6147J9930N9008N3441
$$ y = [242638, 241924, 252583, 271020, 258646, 260714, 277291, 269136, 241156, 208344, 213560, 229362, 221358, 213009, 246215, 256258, 232072, 257260, 248942, 238022, 258768, 286237, 297237, 318628, 350429, 384583, 408279, 471724, 504398, 517713, 501525, 465003, 441365, 407526, 380492, 311956, 282740, 335364, 394810, 469517, 579306, 692723, 768082, 807746, 837485, 846083, 827420, 790941, 771721, 764436, 730243, 696567, 660583, 669342, 686981, 691428, 686042, 688425, 674077, 698728, 693431, 685231, 680299, 709854, 761714, 737379, 722735, 742566, 756452, 749811, 761499, 800746, 799220, 802338, 827479, 840711, 856112, 891215, 917021, 930833, 952979, 971126, 991420, 1000908, 1011127, 1031146, 1054081, 1083773, 1106349, 1153937, 1190029, 1208478, 1240965, 1277112, 1297042, 1356050, 1409491]
9770A409491J4598M7977K9510N9092P9284O0446K3238L0410N1129P6221P8582
9759A959978R3233Q8004O2451P4039O7995O7436J09740J43246J30984J37613J41042
9748C075761J52752J97712K42825K56563K62890L01808K91634L12994L90242M15846
9738E901027M56819M82006M81139N49568N92679O32190P42391P92647Q83865J017557
9728A2531888J136639J312062J529865J736689J909285K081536K287407K516849
9720B7042220K762092L048154L301749L487545L744806M086797M747049N919488
9712E8139900P850708J0760975J5123023K1424731K9928059L9961254M8391743
9705B31580393N0018774L9969513J8247188q518710l0930684m2658803m3431260
$$ y = [1409491, 1424089, 1472066, 1501576, 1560668, 1639952, 1700398, 1723636, 1754046, 1805175, 1881396, 1959978, 2053211, 2141215, 2203666, 2277705, 2345700, 2413136, 2522876, 2666122, 2797106, 2934719, 3075761, 3228513, 3426225, 3669050, 3925613, 4188503, 4490311, 4781945, 5094939, 5485181, 5901027, 6357846, 6839852, 7320991, 7870559, 8463238, 9095428, 9837819, 10630466, 11514331, 12531888, 13668527, 14980589, 16510454, 18247143, 20156428, 22237964, 24525371, 27042220, 29804312, 32852466, 36154215, 39641760, 43386566, 47473363, 52220412, 58139900, 65990608, 76751583, 91874606, 113299337, 143227396, 183188650, 231580393, 281599167, 321568680, 339815868, 331297158, 300366474, 257707671, 214276411]
9698B14276411l7118695k8399334k0308273j3913663r335996o148126m056986
9691I4995338k687110j886156j535755j382817j251564j094518q53641n20996
9683H3782781j85157R4757K69655M70685O21281P23896Q09836Q17234O83915M54995
9673H8543878J39870k57593n87561q70003j088647j205222j246740j213142j148173
9664H1066667j051629r56191q76029q10894p45704o75581o63517p26618q21393
9655G3739111r62711j187223j425251j647058j823547k000216k125943k307021
9647F0260141k510418k528193k433436k301672k135724j962035j778389j617170
9639D2993104j476132j434683j448559j436880j439866j460108j453088j504032
$$ y = [214276411, 177157716, 148758382, 128450109, 114536446, 105200450, 99052324, 94995338, 92308228, 90422072, 88886317, 87503500, 86251936, 85157418, 84303777, 83782781, 83597624, 83692381, 83962036, 84432721, 85054002, 85777898, 86587734, 87404968, 88088883, 88543878, 88683748, 88426155, 87838594, 86968591, 85879944, 84674722, 83427982, 82214840, 81066667, 80015038, 79058847, 78182818, 77371924, 76626220, 75950639, 75287122, 74560504, 73739111, 72776400, 71589177, 70163926, 68516868, 66693321, 64693105, 62567162, 60260141, 57749723, 55221530, 52788094, 50486422, 48350698, 46388663, 44610274, 42993104, 41516972, 40082289, 38633730, 37196850, 35756984, 34296876, 32843788, 31339756]
9631C1339756j567745j606533j617824j628653j598397j577731j500564j403258
9623A8839051j324687j237764j135050j022934r11812q62019q07286p48631o74329
9614A0114539n92942n85359n65032n46346m89461m70155m91656m69187m51084
9605E453317m22577m00342l68133k98164k65331k46022k15877j83635j79173j64582
9595B709481j39919j00654j32096j17633j00486q5179j10266r7783r8811r0634
9585A636020j04596n0378n8831n1761j147L8271L2714O5654M1746L2673J7164
9574A597529k6426q0937q1431p7522n1745l5659k7509L569O946j0582q241Q401
9562A216393Q215k1109m3776k2221k1846m209k407l3005k2728O86K821O035j8831
$$ y = [31339756, 29772011, 28165478, 26547654, 24919001, 23320604, 21742873, 20242309, 18839051, 17514364, 16276600, 15141550, 14118616, 13206804, 12344785, 11537499, 10788868, 10114539, 9521597, 8936238, 8371206, 7824860, 7335399, 6865244, 6373588, 5904401, 5453317, 5030740, 4630398, 4262265, 3964101, 3698770, 3452748, 3236871, 3053236, 2874063, 2709481, 2569562, 2468908, 2336812, 2219179, 2118693, 2033514, 1923248, 1825465, 1726654, 1636020, 1531424, 1481046, 1422215, 1370454, 1369307, 1407578, 1440292, 1505946, 1547692, 1580365, 1597529, 1571103, 1490166, 1408735, 1331213, 1279468, 1243809, 1216300, 1219869, 1226815, 1216233, 1207992, 1216393, 1224608, 1203499, 1159723, 1137502, 1115656, 1111447, 1109040, 1076035, 1053307, 1053993, 1056814, 1062849, 1044018]
9549A044018k6112R007J5856N897K3281K1679N424J7888L8416O4746O4890O2149
9537A347139O4506N7058O1294Q1697J09423J07809R6697P3349N5504J1259K1362
9526B087097J9143K8862L000k0749l2753l8837n1809n9297n6393k3729J0176p081
9514A857630l2467K8197L7649R970o35j628k0143o2961l0455j1152o0163m7614
9502A666228m6487n4727q5569j00337r2055o4196n5106m6104o0337n4719o0487
9491I46104j6326l3142n2433k5535n4345m3483Q41J1361n602J175j2067m7016
9479F69532n2145k1093J08j8225k9473j425j1887l167N855J4309Q355m983k2534
9466E33227k1900j7255o778J645J0146j3213j5730J0786N895J1832k3305n16j2352
$$ y = [1044018, 1017906, 1026913, 1042769, 1048666, 1071947, 1093626, 1099050, 1116938, 1155354, 1220100, 1284990, 1347139, 1411645, 1468703, 1529997, 1611694, 1721117, 1828926, 1925623, 1998972, 2054476, 2065735, 2087097, 2106240, 2135102, 2138102, 2117353, 2084600, 2045763, 1993954, 1934657, 1878264, 1854535, 1864711, 1857630, 1825163, 1853360, 1891009, 1900979, 1900344, 1898716, 1878573, 1815612, 1785157, 1774005, 1713842, 1666228, 1619741, 1565014, 1479445, 1379108, 1287053, 1222857, 1167751, 1121647, 1061310, 1006591, 946104, 929778, 896636, 844203, 818668, 764323, 720840, 721681, 733042, 727440, 728615, 716548, 669532, 617387, 596294, 596402, 578177, 548704, 547279, 535392, 532225, 538080, 552389, 560744, 555761, 533227, 511327, 494072, 487294, 488939, 499085, 485872, 470142, 480928, 486823, 498655, 475350, 474834, 462482]
9453D62482k6596K5498J5283m663k8097l2934j1353P00L788L186L472J4422J6419
9440D41607j8450j2554k888L3810m775j5890K4122K7410J8554n992j7006j88J0366
9427D78126L7272j4700l6234j8987r747J1546K8633Q640K4299K9264K1935J2009
9415E72056k7660K1760O2053L9639M335p413j3553N844j8174q621J5446K9177
9403F74889J1737M6390P165N354L3205M9294J4810K6573L1377L6256L8361J6756
9391I92167J1500j457j7621k0645k5514P726N5229K0336j2577J4556L9160r698
9379A053162l01M6053j543J7015K672J0424K6356L887J3549K8151K0357j1582
9367A208200j4725L6227M1020L1286K3757J7006K0986N2355L0342j3694K7898
$$ y = [462482, 435886, 461384, 476667, 472004, 443907, 410973, 399620, 400320, 404108, 407294, 410766, 425188, 441607, 423157, 410603, 407715, 441525, 436750, 420860, 444982, 472392, 490946, 484954, 467948, 467760, 478126, 515398, 500698, 464464, 445477, 435730, 447276, 475909, 484549, 508848, 538112, 560047, 572056, 544396, 566156, 628209, 667848, 672183, 664770, 651217, 657061, 638887, 630266, 645712, 674889, 686626, 733016, 740181, 745535, 778740, 828034, 842844, 869417, 900794, 937050, 975411, 992167, 1003667, 1002210, 984589, 963944, 938430, 946156, 1001385, 1021721, 1009144, 1023700, 1062860, 1053162, 1052861, 1098914, 1097371, 1114386, 1117058, 1127482, 1153838, 1157725, 1171274, 1199425, 1219782, 1208200, 1193475, 1229702, 1270722, 1302008, 1325765, 1342771, 1363757, 1416112, 1446454, 1432760, 1460658]
9356A460658N8355L9376R3560M6190M2387O0206L0479P2408J03737Q9719J19215
9345B216290J20545J18835J92601K17799K30616K36981L03057L40970L98753M26126
9335D802573M99005N48771O08469O40474P17435P84548P98086Q46260R10945R37968
9325A2094534Q87348Q79392R05951Q18833P50445P05116O69363N65674M94030
9316A8770686M51464M68665M65550M68830N29932O05950O20576O81090P30332
9307B3793075P30800P12839O63979O15945N08146L94214K54961O5684j12913l26323
9297B7300407n76105p89614r22120r16897r14165r19389q62036p46897o52271
9288B0000913n57467n01335m67674m29908m12241m47769m53877m78539n10638
$$ y = [1460658, 1519013, 1558389, 1651949, 1698139, 1740526, 1800732, 1831211, 1903619, 2007356, 2097075, 2216290, 2336835, 2455670, 2648271, 2866070, 3096686, 3333667, 3636724, 3977694, 4376447, 4802573, 5301578, 5850349, 6458818, 7099292, 7816727, 8601275, 9399361, 10245621, 11156566, 12094534, 12981882, 13861274, 14767225, 15586058, 16336503, 17041619, 17710982, 18276656, 18770686, 19222150, 19690815, 20156365, 20625195, 21155127, 21761077, 22381653, 23062743, 23793075, 24523875, 25236714, 25900693, 26516638, 27024784, 27418998, 27673959, 27739643, 27626730, 27300407, 26724302, 25934688, 25012568, 24095671, 23181506, 22262117, 21400081, 20653184, 20000913, 19443446, 18942111, 18474437, 18044529, 17632288, 17184519, 16730642, 16252103, 15741465]
9279A5741465n71524n83953n83928n71495n50057n10697m36975l30113k62609
9270A1340114j83429n0559M9919K02996L15245M38126N84580P41434R11855J116843
9260A5467124J326995J547805J789308J999564K234194K523717K721012K891409
9252C2501128L028693L168910L189784L129053K999520K849359K648942K423469
9244E5938858K181306J976343J836052J733282J724581J788667J930923K136528
9236G1246540K328160K541225K716514K851747K871571K772324K482679K106349
9228I1917109J613359J028909M32669j57383p84352j317093j726084k046214k248832
9219H6712088k269457k128443j930585j623334j270088r63677p07627m55576l35322
$$ y = [15741465, 15169941, 14585988, 14002060, 13430565, 12880508, 12369811, 11932836, 11602723, 11340114, 11156685, 11106126, 11156045, 11359041, 11674286, 12112412, 12696992, 13438426, 14350281, 15467124, 16794119, 18341924, 20131232, 22130796, 24364990, 26888707, 29609719, 32501128, 35529821, 38698731, 41888515, 45017568, 48017088, 50866447, 53515389, 55938858, 58120164, 60096507, 61932559, 63665841, 65390422, 67179089, 69110012, 71246540, 73574700, 76115925, 78832439, 81684186, 84555757, 87328081, 89810760, 91917109, 93530468, 94559377, 94992046, 94834663, 94050311, 92733218, 91007134, 88960920, 86712088, 84442631, 82314188, 80383603, 78760269, 77490181, 76526504, 75818877, 75363301, 75027979]
9210G5027979k90854l39142m26684n51281p03822p88225q35294q39750p56246
9201F9496681n21837k41536O8058K75056L90820N06201P01091J027255J430571
9192G3132360J678619J695921J436635J051919O79281M85870N04135O51800Q89891
9183H2206431J269767J637135J763695J691899J562589J452967J488502J687761
9175I4760746J920882K024372J883746J438028Q53895K28600k78605o65300r89635
9166A01176729j210382j300456j355835j443414j629763j878767k169575k375474
9158H7813063k452846k347253k033943j545691j008195m79208P725M27903Q64126
9149G9245681J293636J707540K068754K443351L071846M051800N449529P168594
$$ y = [75027979, 74737125, 74397983, 73971299, 73420018, 72716196, 71927971, 71092677, 70252927, 69496681, 68974844, 68733308, 68801366, 69076422, 69467242, 69973443, 70674534, 71701789, 73132360, 74810979, 76506900, 77943535, 78995454, 79674735, 80160605, 80664740, 81316540, 82206431, 83476198, 85113333, 86877028, 88568927, 90131516, 91584483, 93072985, 94760746, 96681628, 98706000, 100589746, 102027774, 102881669, 103110269, 102831664, 102166364, 101176729, 99966347, 98665891, 97310056, 95866642, 94236879, 92358112, 90188537, 87813063, 85360217, 83012964, 80979021, 79433330, 78425135, 77945927, 77953652, 78381555, 79245681, 80539317, 82246857, 84315611, 86758962, 89830808, 93882608, 99332137, 106500731]
9141A06500731R196498J1691163J4482144J7092306J8953403J9921012J9983527
9134B17820784J9199818J7632614J5303828J2362978Q903178N135699J266155
9127B97625054k413654n437912p287365p773132p068684n582805l672707j617984
9119B56770811M74960K519621M267852N539665O282150O152213M957487K815632
9111B89780391k13743l880450p731660j1408525j4591338j7104618j8757574j9613257
9103A96479226j9751832j9098127j7771447j5863407j3701244j1632769r853030
9096H8807370q330582p058996o042416n163972m436492l876296l416256l160332
9088D7322028l030803k884115k648798k372413k056781j795611j612986j490377
$$ y = [106500731, 115697229, 127388392, 141870536, 158962842, 177916245, 197837257, 217820784, 237020602, 254653216, 269957044, 282320022, 291223200, 296358899, 297625054, 295211400, 289773488, 282486123, 274712991, 267644307, 262061502, 258388795, 256770811, 257245771, 259765392, 264033244, 269572909, 275855059, 282007272, 286964759, 289780391, 289566648, 285686198, 277954538, 266546013, 251954675, 234850057, 216092483, 196479226, 176727394, 157629267, 139857820, 123994413, 110293169, 98660400, 88807370, 80476788, 73417792, 67375376, 62211404, 57774912, 53898616, 50482360, 47322028, 44291225, 41407110, 38758312, 36385899, 34329118, 32533507, 30920521, 29430144]
9080B9430144j394058j305496j203668j053527q92883q12432p82693q03303q26676
9071B0355408r46409j157045j230710j173793j050505r30311q37877q36620q11510
9062A1380628p70414p68368p09945o61391n98135n42506n01287m21946m13998
9053E992638l84708l20919k84049k39804k26660k20862j81599j19472j33461j32408
9043C748696j54705j26915j04212q9234q3309q0191o1211j06454j09562q0796
9033B752107k3045o6750j05565q3069l5912n5192n3514o9959p6431l2705k3842
9022B126123m0322n6316o9118n9021p3244k8598m4310m6421n0386m5022k8659
9011A584706l8667j0925k994j4780j0730k8425j5960J4892j8272n093J1886l6847
$$ y = [29430144, 28036086, 26730590, 25526922, 24473395, 23580512, 22768080, 21985387, 21182084, 20355408, 19408999, 18251954, 17021244, 15847451, 14796946, 13866635, 13028758, 12192138, 11380628, 10610214, 9841846, 9131901, 8470510, 7872375, 7329869, 6828582, 6406636, 5992638, 5607930, 5287011, 5002962, 4763158, 4536498, 4315636, 4134037, 4014565, 3881104, 3748696, 3593991, 3467076, 3362864, 3273630, 3190321, 3110130, 3048919, 2942465, 2832903, 2752107, 2729062, 2662312, 2556747, 2473678, 2437766, 2382574, 2329060, 2259101, 2182670, 2149965, 2126123, 2085801, 2029485, 1960367, 1901346, 1828102, 1799504, 1755194, 1708773, 1658387, 1613365, 1584706, 1546039, 1535114, 1532120, 1517340, 1506610, 1478185, 1462225, 1477117, 1458845, 1453752, 1465638, 1428791]
8999A428791m3376m8447l9197j4269j3141j4608J9984N82l958j833P106J7070
8987A294704P315k2892P987L4056J311p421k5289j402j0418j8262k7121j7522
8975A215046J0526q454l8458l6922m4694j1140j0403o319J6964j377k6679k1050
8963A037040k0760r91k560k8761k6233J6091R826j2710q6j9170J669J940m195
8950I51100k1238k6829k9381k0805k577M402k9805J2276j5550j1438O577N267
8938H21999L692j2738j2415J0315o204l7396k0019J2301K0960R088j466M300o012
8925G86405P70L3198j340K108J2417K0249J489k4618r845J3017J670j2611j4179
8912H08730k0287j5434j6967K625P115R154K2660J5192j7337j1997L685k9856
$$ y = [1428791, 1385415, 1336968, 1297771, 1283502, 1270361, 1255753, 1275737, 1276319, 1272361, 1270528, 1277634, 1294704, 1302019, 1279127, 1287114, 1321170, 1322481, 1315060, 1289771, 1288369, 1277951, 1259689, 1232568, 1215046, 1225572, 1217118, 1178660, 1141738, 1097044, 1085904, 1075501, 1069182, 1086146, 1084769, 1058090, 1037040, 1016280, 1015289, 1012729, 983968, 957735, 973826, 983652, 970942, 970856, 951686, 953355, 955295, 951100, 929862, 903033, 873652, 852847, 850270, 854672, 824867, 837143, 821593, 810155, 816732, 821999, 825691, 812953, 800538, 810853, 804649, 767253, 747234, 759535, 780495, 789583, 788117, 792417, 786405, 787175, 820373, 819033, 821141, 833558, 853807, 855296, 830678, 820833, 833850, 835520, 822909, 808730, 788443, 773009, 756042, 758667, 765782, 774936, 797596, 812788, 795451, 783454, 787139, 757283]
8900G57283J174j1909j8139j3902N683M334j4822j1273l530o608k7085l0011k3119
8887F08076q147j7141m90m0204l1145k3583J0600M860l766j8872q4O393N891R35
8873D93323j8824j9669Q657J4695n137p990l7794N668L177O595m016o861J2142
8860D43966J4012P656J164K0966K7901K095m19P298J4492P623P033J1502J9837
8847E85126K6764L3476J8647J9848K2235L152J6147K932k1911q245J197J8260
8835G17628J6455L0255J83k1993L3386M4793L7483L3592K7403M119k5236J3575
8823I11643K9289K2195n385j6094l996j3120j8694j0754j5694P661k6374m6549
8811H14128l8229R516j763M405K3563J0581J2882M4755J7810J174j4617k7633
$$ y = [757283, 758457, 746548, 728409, 714507, 720190, 724524, 709702, 698429, 694899, 688291, 661206, 631195, 608076, 599929, 582788, 582298, 542094, 510949, 487366, 497966, 502826, 499060, 480188, 480104, 486497, 492388, 493323, 474499, 454830, 463487, 478182, 473045, 465055, 427261, 432929, 436106, 442701, 438685, 431824, 443966, 457978, 465634, 466798, 487764, 515665, 517760, 517341, 524639, 539131, 546754, 553787, 565289, 585126, 611890, 645366, 664013, 683861, 706096, 709248, 725395, 728327, 706416, 698171, 699368, 717628, 734083, 764338, 764521, 742528, 775914, 820707, 858190, 891782, 919185, 923304, 898068, 911643, 940932, 963127, 957742, 941648, 937652, 924532, 905838, 895084, 879390, 887051, 860677, 814128, 775899, 785415, 783652, 788057, 811620, 822201, 835083, 879838, 897648, 898822, 884205, 856572]
8799H56572l5279k514j2560k6760j4547n647M233k31m907m967j9462n381j2196
8786G16354k8679n664k4523K7458J7240J4852L7331k635o85j0054Q913p423P739
8773G50224J9412J950j1281J9742J4774j966k7082j9226k624K283j1905p856J3115
8760G39560Q00O587r550k0330k0890k8201R569J685m150J3971j6364r120k575
8747F60992K915M896K1493K9405R096M5626L2222K6809K9030O6019O0969Q8257
8735A077729R8091Q5958O8046O1752P0832P6054O8835J1200J0261K458J957q505
8723A624668o420n5461m573o223k463J9862k6070k5139N198J9746M0335M4934
8711A628394J0126k0258J7442P50j1952n1755n5001n8397o7366q2460j02247p0880
$$ y = [856572, 821293, 818779, 806219, 779459, 764912, 759265, 763498, 763267, 758360, 753393, 733931, 728550, 716354, 687675, 682011, 657488, 684946, 702186, 717038, 754369, 751734, 751049, 740995, 749908, 742485, 750224, 769636, 771586, 760305, 780047, 794821, 792855, 765773, 746547, 743923, 746206, 734301, 726445, 739560, 740360, 746947, 737397, 717067, 696177, 667976, 677545, 679230, 675080, 689051, 672687, 663567, 660992, 663907, 668803, 690296, 719701, 728797, 774423, 806645, 833454, 862484, 928503, 989472, 1077729, 1175820, 1261778, 1329824, 1391576, 1462408, 1538462, 1607297, 1618497, 1628758, 1631216, 1633173, 1624668, 1618248, 1562787, 1558214, 1551991, 1549528, 1569390, 1543320, 1518181, 1523379, 1543125, 1583460, 1628394, 1638520, 1618262, 1635704, 1636454, 1624502, 1572747, 1517746, 1459349, 1391983, 1309523, 1207276, 1136396]
8699A136396q4827q6182p2626r3339m9754n2031l1891l0940j9223n5038k4595
8688E35950j0754m7303o2565m1366J3515K3586o222o522k5958k9761j3324j3803
8676C15473q228Q18J1220P808J2401j7421l3389l2359o548j2407p541j5736r354
8663B04737J4340J2802m216j9380J3096J2086l5052N287J3256j1657j8318q080
8651A78901J3904m799K175K2975m3599k6778K0304K885k1472j1316J1839p594
8639A37425k2691K0015K7468N523j3311j3159N163l566p465j346q579k7797j3586
8626H4094j4103l163K4658J6614j9597q699J1892p162M528M992j4116n826j9802
8613E4310k1478J1959L4295K8592J6353j3872J4074J3551l8572p589J3766L4233
$$ y = [1136396, 1051569, 965387, 892761, 799422, 749668, 697637, 665746, 634806, 615583, 560545, 535950, 525196, 477893, 415328, 373962, 387477, 411063, 404841, 398319, 372361, 342600, 329276, 315473, 307245, 308063, 319283, 327091, 339492, 322071, 288682, 256323, 249775, 237368, 229827, 214091, 204737, 219077, 231879, 227663, 208283, 221379, 233465, 198413, 203700, 216956, 205299, 186981, 178901, 192805, 188006, 190181, 213156, 169557, 142779, 163083, 165968, 144496, 133180, 145019, 137425, 114734, 134749, 162217, 167740, 154429, 141270, 146433, 142867, 135402, 134056, 125477, 97680, 84094, 69991, 66828, 91486, 108100, 88503, 79804, 91696, 84534, 89062, 94054, 79938, 74112, 54310, 32832, 44791, 79086, 107678, 124031, 110159, 124233, 137784, 99212, 91623, 105389, 139622]
8601A39622p381j1086K5985o941j5153M894M248m395j9894P550J9946Q018j0034
8588A35379K0414P92j5243K498j9556M696J3526Q120l0220j1251N388L266J3133
8575A30942R184k4423o208K741j6P533j2693j7046l2800k4040M773L1345J5972
8562H5264k350j963R475k486l216K4074J6568J5269j1813k7339r668N343o747
8549I0411K703o580n610J6795J5715K357Q18L5801m024J720j3987J1815J260R54
8535A50148J3142K333K999P51J5826J6544l6908l2831j6593r320q893q842J1634
8522I9990k3401q465R044n035n710j2283k6511L3707K8796p844j1899J288K0541
8509I2218r5l4247n343p476j1177n951k1734L2318Q780k3516L6148K0819o842
$$ y = [139622, 132241, 121155, 147140, 140199, 125046, 129940, 134188, 129793, 109899, 117449, 137395, 145413, 135379, 155793, 156585, 141342, 143840, 124284, 128980, 142506, 150626, 120406, 109155, 114543, 117809, 130942, 140126, 115703, 109495, 112236, 112220, 119753, 107060, 90014, 57214, 33174, 37947, 69292, 85264, 82914, 80951, 90426, 87940, 84724, 108798, 125366, 140635, 128822, 101483, 91815, 97158, 90411, 93114, 86534, 80924, 97719, 113434, 115791, 116609, 152410, 148386, 150106, 136119, 147934, 149194, 150148, 163290, 165623, 168622, 169373, 185199, 201743, 164835, 132004, 115411, 106091, 97198, 88356, 99990, 76589, 68124, 77168, 72133, 66423, 54140, 27629, 61336, 90132, 82288, 70389, 71677, 92218, 92123, 57876, 52533, 45057, 33880, 27929, 6195, 38513, 47293, 23777, 59925, 80744, 73902]
8496G3902K2915L2147K932m0086k2636J6392j4105j6211J8737R163J7568Q240
8484A08958n223l1270N94P966n58l956j6831L101L1567J6217k3985m4116k940
8471C9524L2106Q691j2706j685q715L055j2272j5467L262l623J7934Q93L321k2405
8457C1913K267L7303J5029n941J462j1652j2171j0324p446R157j505k800r413
8444C5879K7771R032j282K1982L3579N72q777j5281j7506k0166K381J152m124
8431F5212M398J2663J0397j4331j2388J5318M283j7279j0566O625K6403K344o585
8418H6494k881L252k4823j2189J1911J6163l2516n984J9477r900k3647o719L8560
8405E7198J1261J3959r349r685Q334j9482l5681R239M6750J1454J2296K431K9001
$$ y = [73902, 96817, 128964, 131896, 91810, 69174, 85566, 71461, 55250, 73987, 83150, 100718, 108958, 103735, 72465, 73059, 81025, 80467, 76511, 59680, 62781, 94348, 110565, 86580, 42464, 39524, 71630, 80321, 67615, 65930, 57215, 60270, 47998, 32531, 35793, 32170, 50104, 50997, 54318, 31913, 34180, 71483, 86512, 80571, 82033, 70381, 58210, 47886, 40440, 49597, 48092, 45292, 35879, 63650, 72682, 71400, 93382, 126961, 127533, 118756, 103475, 85969, 65803, 68184, 69336, 65212, 69610, 82273, 92670, 78339, 65951, 81269, 85552, 68273, 57707, 64332, 90735, 93079, 86494, 83613, 86865, 62042, 49853, 61764, 77927, 45411, 39427, 58904, 49004, 25357, 18638, 57198, 68459, 82418, 73069, 63384, 71718, 52236, 16555, 25794, 72544, 83998, 96294, 98725, 127726]
8392A27726J097j7223l7620R685L1140K1948Q646j8912j6007j3522k6719l3539
8380C6700m107j3336P788K5147m919k8339J2094n176o626j2596j780M495J4619
8367B3964M0079r569o029K701n136O554Q716o725O775j3204O204J5836J5396N376
8353I0938J3935j2059R780K7663L4963J7209M0842R4296K17241L57300N02668
8342A394776K24500l41920m51961l15790j57720r5289p6727n3644k0612j9967
8332H5646k7195n845J0157m189l45J4598K430l9333O544K6982O097M174k053j4931
8318F2737l152J7393K3220q563j6441J3613J2944J0304N494K080J8611K6293K0347
8305A84880K7468L5118Q6580J62385L11668N79236R83483P32028m66917q80611
$$ y = [127726, 128823, 111600, 73980, 83665, 114805, 136753, 145399, 126487, 110480, 96958, 70239, 36700, 32593, 19257, 27045, 52192, 47273, 18934, 31028, 25852, 19226, 6630, 4850, 9345, 23964, 64043, 54474, 48445, 51146, 46010, 52564, 61280, 54555, 61330, 48126, 54330, 70166, 85562, 90938, 104873, 92814, 102594, 130257, 165220, 182429, 223271, 317567, 534808, 892108, 1394776, 1619276, 1277356, 825395, 509605, 351885, 256596, 179869, 126225, 105613, 85646, 58451, 52606, 62763, 58574, 58229, 72827, 75257, 35924, 42468, 69450, 75547, 79721, 77668, 62737, 59585, 76978, 100198, 91635, 75194, 88807, 101751, 112055, 117549, 119629, 138240, 164533, 184880, 212348, 247466, 334046, 496431, 808099, 1387335, 2370818, 3102846, 2635929, 1755318]
8295A755318o72472l58440j77702j21153q1139n9836n4900o2086m2981l1753l955
8284H8901q370J2936L108l5166o633J6231J2179P594q238k4177m590l60L3818
8271H7233m423k5093K7820J7532k1794K559K1037L972p727N474j1162J4968Q6088
8258A96484R0598R0105K17546M29546M43246o8083m13525l57168k31401j24977
8248B72371p5030n5072j7924j7288l1201m1036j9205K0549K2449K9296J3768L293
8236A04970j2k8152l750L571r824L333N012j8143j9237J0264n92o290j1860J1992
8222D1282K6260J7241j8052l0715m466P253J0335R740J4999l2707j8336O216j0942
8209A8108J8388J8252k6678k5552J1424K6758O848R835J4106l5666l4081o43K9363
$$ y = [1755318, 1082846, 724406, 546704, 425551, 344412, 284576, 229676, 167590, 124609, 92856, 88901, 80531, 93467, 96575, 61409, 54776, 71007, 83186, 90780, 82542, 58365, 53775, 53415, 87233, 82810, 57717, 85537, 103069, 81275, 83834, 104871, 108843, 101116, 106590, 95428, 110396, 196484, 287082, 377187, 594733, 1024279, 1467525, 1399442, 985917, 628749, 397348, 272371, 197341, 142269, 124345, 107057, 75856, 34820, 15615, 36164, 58613, 87909, 101677, 104970, 104958, 76806, 73056, 76627, 66803, 70136, 75148, 57005, 37768, 48032, 47440, 41150, 29290, 41282, 67542, 84783, 66731, 36016, 31550, 38803, 49138, 58878, 73877, 41170, 22834, 29050, 18108, 36496, 54748, 28070, 2518, 13942, 40700, 47548, 57383, 71489, 35823, 1742, 1099, 30462]
8196C0462K0646l0265M982m595L602K0316j7082p211N139K0431j4806k4044J0289
8183A7864J2332J1858J1134j1925P191J5772q82k2318n940Q862r426n227K8997
8170E8292j8028p938j6100J7958K9102p987k1286l853O350N270j4507j792r701
8157A5780j4572n590j7184l692j0033J906K2635J6308K0046p737j4926j2283n648
8144a4990j2640J4855J6348P430r336o579j874N978K33j4271J1434K1347J3460
8131C1395l2444L1541J3658j5568l6178k3294L301L4423Q849J6975N971l5835
8119B794j3448o126J9593J9680q244l7482M062k890q495J4706K1977k956J0669
8106A3840Q018l770n083o081j8822L549J6578j8q607J2996K1023P852K1261k150
$$ y = [30462, 51108, 20843, 25825, 21230, 24832, 45148, 28066, 20855, 25994, 46425, 31619, 7575, 17864, 30196, 42054, 53188, 41263, 48454, 64226, 63344, 41026, 35086, 43948, 34522, 29295, 58292, 40264, 32326, 16226, 34184, 63286, 55299, 34013, 30160, 36510, 41780, 27273, 25481, 15780, 1208, -4382, -21566, -25258, -35291, -33385, -10750, 5558, 25604, 17867, 2941, -9342, -14990, -27630, -12775, 3573, 11003, 1667, -4912, -6786, -808, -575, -14846, -3412, 17935, 31395, -1049, 30492, 44150, 28582, -7596, -30890, -27589, 6834, 15683, 32658, 38629, 2794, -10654, -16780, 2813, 22493, 14249, -23233, -19171, -22061, -30556, -15850, 6127, 3171, 13840, 21858, 18088, 13005, 6924, -11898, -8349, 8229, 8211, -396, 12600, 33623, 41475, 62736, 60586]
8092F0586k4804O850j1310j0263J0095k709p871J2558O14m858O031j1051j1397
8079A2471Q928J0138o363k0248k0655J8256J1544J3145P724M541m3984j5233K3124
8066C388J6661J9659R975l615k101k3369q457o043N406o539M611N39j2510J778
8052f17J2189R036J7966K972j3578j6002J6589k53J1441j0676N490J0501K3626
8039F8684j4538k2056r849K6494L264k8917P531k52j1671J6660J6787j3276k2303
8026A6558q413M022M014k842k007j4555M879L1954K6077j125J078q736o684K9853
8012G4073P024j8619j7405l127K2540l0890J1385K2032l708N40j1749l9023J16
7999A3189L0913j2188r936K0092J2212j2512M06J1943o495l596j9058j3732J3933
$$ y = [60586, 35782, 42632, 31322, 21059, 31154, 28445, 20574, 33132, 33746, 28888, 34919, 23868, 12471, 21399, 31537, 25174, 4926, -15729, 2527, 14071, 27216, 34940, 39481, -4503, -19736, 3388, 20049, 39708, 49683, 46068, 43967, 20598, 12141, 6098, 11504, 4965, 9576, 10115, -2395, -617, 11572, 20608, 38574, 41546, 27968, 11966, 28555, 28302, 39743, 29067, 34557, 45058, 68684, 54146, 32090, 22241, 48735, 51999, 23082, 30613, 30361, 18690, 35350, 52137, 38861, 16558, 8145, 12167, 16181, 13339, 11332, -3223, 1656, 33610, 59687, 58562, 59640, 50904, 44220, 74073, 81097, 62478, 45073, 41946, 64486, 33596, 44981, 67013, 63305, 63845, 52096, 13073, 13189, 44102, 31914, 21978, 42070, 54282, 41770, 42176, 54119, 47624, 44028, 24970, 11238, 25171]
7986B5171K0980j5545j3299J7143L8577n485l2818p600O276j2714L665L434R03
7973B8688k3266j8481J243r81k121L228J5648j742k1575k5432Q731K6599K0971
7960A1510N890j994j1573N399J5673K7330K7048j8414k8185j8812J1256J7130
7948D2258r537O206j0271l0946j019K8251J6201q251K0814R204k5511k4791n813
7935F795J1572m744j474L074J3437J3132L2086n637k0342j4980J9660N580n422
7922E2737L1494j3602r242k1023r420N759j1724k7303K2446L5698r850n867k5275
7909A4828j3843m770J8152J5594n786J0586J0576K731o410l782p403R115Q518
7896D8106L9240P995n283j6029P212k0379J505n838M520J171n404j1667p935l159
$$ y = [25171, 46151, 30606, 17307, 34450, 73027, 67542, 34724, 27124, 33400, 20686, 24351, 27785, 28688, 5422, -13059, -11816, -12797, -14918, -11690, 3958, 2216, -19359, -44791, -36060, -9461, 11510, 17400, 15406, 3833, 9232, 24905, 52235, 79283, 60869, 32684, 13872, 25128, 42258, 32721, 38927, 28656, -2290, -3309, 24942, 41143, 32892, 53706, 62910, 37399, 12608, 6795, 18367, 13623, 12149, 15223, 28660, 41792, 73878, 68241, 47899, 32919, 52579, 58159, 52737, 84231, 70629, 61387, 40364, 30944, 36703, 24979, -2324, 20122, 55820, 45970, 40103, 14828, 985, -3785, 14367, 29961, 24175, 34761, 45337, 48068, 41658, 37876, 30473, 39588, 48106, 87346, 95341, 90058, 74029, 81241, 60862, 62367, 56529, 61049, 62220, 56816, 45149, 37214, 34055]
7882C4055j3375K4856p087k1109j2034P739p552L4268K2390J4192k1253k4292
7870C0798j4490M021n184k7093N850L9806r585K4500L170l6774k5950p0L778J9428
7856A2205M0672j4197l4560n510L497K7588J197j2912k7040l8967K2924L3637
7844H534J6660K3215J0272n341j6415M579n586l4082K0461K3752p674M92O540
7831D5407r179m223K2730j2389N564j9732q0L0154j2244L442R729k1889j1729
7818B5561q144l345j0680P645q439R796P154j9282k9858J1111J2039k1848J8116
7805a0174J6636K001l670j9234K2554k067J3016o52j0054j1681j7798J7666J4200
7792A0743q213R593j4924r090M8j846J4968R274j3408R831M21J3338j2287j7003
$$ y = [34055, 20680, 45536, 38449, 17340, 5306, 13045, 5493, 39761, 62151, 76343, 55090, 30798, 16308, 20329, 15145, -11948, -6098, 33708, 24123, 48623, 51793, 15019, -10931, -11001, -7223, 12205, 52877, 38680, 4120, -1390, 2107, 29695, 30892, 17980, -9060, -48027, -25103, 8534, 25194, 48409, 58681, 53340, 36925, 41504, 35918, 1836, 22297, 46049, 38375, 38867, 45407, 36228, 32005, 54735, 42346, 47910, 28178, 28098, 58252, 46008, 49450, 59179, 37290, 25561, 17417, 14072, 3392, 11037, 2598, 12394, 19548, 266, -29592, -18481, -6442, -28290, -10174, 6462, 8463, 4793, -14441, 8113, 6046, 19062, 18410, 8356, -3325, -21123, -3457, 10743, 2530, 12123, -2801, -11891, -11843, -13689, 1279, 10553, -2855, 6976, 7397, 20735, 8448, -8555]
7778h555K8264R830k4859Q336o231l2301j642K8857n437k6264J8190P095Q190
7765C473m119K365O737L170L1496L329N663Q749J168j5113p961k9264l6421R713
7751a7015L9759R888j7101j2552k1795j7617J8021K8250L2593J1545k6607J4008
7739D1377K1222K258P335k9234k8317j4549L7183M555O066j3768j113k5633m589
7726B793j1066N972J4454j8747l3K0833k1310p821J002n647O041L3518L9119o48
7712E8460j5936j3713j2299k8856J867M7853R079j832j8270J988j9446j4677N431
7699c51k987P486j1028l958K4227J5722J4965l6416q725K0340j7005l1366M33
7686b8663J8418K670j9387K0086J8428L8062m457P959k1215j012J3521R007J9340
$$ y = [-8555, 19709, 29539, 4680, 13016, 6785, -25516, -27158, 1699, -3738, -30002, -11812, -4717, 3473, -646, 1719, 8456, 11626, 43122, 46451, 52114, 60863, 62031, 46918, 38957, 9693, -26728, -17015, 22744, 32632, 15531, 2979, -18816, -36433, -18412, 9838, 42431, 53976, 27369, 41377, 62599, 64857, 72192, 42958, 14641, 92, 37275, 41830, 47896, 34128, 33015, 7382, 2793, -8273, -2301, 12153, -6594, -6627, 14206, -7104, -14925, -13923, -19570, -13529, 19989, 59108, 58460, 42524, 28811, 16512, -12344, -10477, 37376, 46455, 44623, 26353, 28341, 8895, -5782, -351, -3338, 4148, -6880, -10838, 13389, 29111, 44076, 7660, -1065, 19275, 2270, -29096, -28663, -10245, -7575, -26962, -6876, 11552, 49614, 45157, 53116, 31901, 30889, 44410, 53417, 72757]
7673G2757P806j6108K059j7970k4567K256J3071k8378j6811Q514j510l963N690
7660B846K2226J8272j4237j813M2447K55l8994m1024K9477j1584n022J7429N50
7647B0828J1261R088o060M68K0832Q928L117k0035m4801o750j886q185J982J0121
7633a092J3319m461o221K1335K6749k3019l5931m844J285j7678k2028o813J3452
7620d5947L6335L4139l1498k6568Q979J2021p45J9128j1475k0643l171J0901J1116
7607g428J3808M505K052k4096q02K5782K122k4973k700K1279L4865j8676j3200
7594A2538J6144M3j022n131j7215j4266Q735J7185P547K2374l5264q898j5215
7581a2445k3389J0586K1756j5026j7369M612K9806o232n708j5201K9827J5115
$$ y = [72757, 80563, 64455, 66514, 48544, 23977, 26233, 39304, 10926, -5885, 2629, 1119, -2844, 2846, 25072, 43344, 29107, 27294, 69741, 69996, 31002, -10022, 19455, 7871, 2849, 20278, 20828, 32089, 41177, 35117, 35585, 56417, 65345, 68462, 48427, 3626, -3124, -5010, -13195, -11213, -1092, 12227, 7766, 1545, 22880, 49629, 26610, -9321, -14165, -12880, -30558, -52586, -59399, -45947, -9612, 24527, -6971, -33539, -24560, -12539, -13284, 5844, -5631, -26274, -29445, -18544, -7428, 6380, 10885, 12937, -11159, -11961, 13821, 15943, -9030, -11730, 9549, 44414, 25738, 12538, 28682, 28725, 27703, 22572, 5357, -8909, -174, 17011, 24558, 46932, 11668, 2770, -12445, -35834, -25248, -3492, -18518, -35887, -31275, -1469, -7701, -13409, -28610, 1217, 16332]
7569A6332J725K623r50N075r782L286O513J4800J673L094K3310j4411l0012k9805
7555f529J8962l886k9918J5214J9956J3616M010o356j9733p214J8878j1886o0
7542E054O332K5388J5113j3967k3499k400o060K681O728M789l7159k2368J2661
7529b6707J6730j1035l058m717j4321r997M3962K686j4651k2378K1724M718Q860
7516h184J071K1521J7307J9809l954q980m3001j0304K9809J3873j0979l024o36
7503A4328l671m695p166M636L3213M256m0676l9513J3048K2234j8733K623J2517
7490g599R765j0978n879q101K2687P477J866K863l709J6820M080L441k0903q519
7476C311K999q66k113j1154r694o236l952o299K3111Q053r543l494j886j7762
$$ y = [16332, 18057, 20680, 19730, 24805, 15023, 18309, 24822, 39622, 41295, 44389, 67699, 53288, 23276, -6529, 12433, 8547, -21371, -6157, 13799, 27415, 31425, 25069, 5336, -1878, 17000, 5114, 5054, 11386, 36774, 51887, 37920, 14421, 12021, 5961, 8642, 15370, 20159, -17000, -39368, -26707, -9977, -21012, -24070, -28787, -43108, -53105, -9143, -6457, -21108, -43486, -21762, -17044, -8184, -7113, 14408, 31715, 51524, 47570, 38590, -4411, -14715, 15094, 28967, 17988, 14964, 14328, 10657, 5962, -1204, 3432, 36645, 40901, 225, -39288, -26240, -4006, -22739, -20116, -7599, 2166, -8812, -14691, -22792, -105, 7372, 9238, 12101, 8392, 25212, 29292, 32733, 11830, 3311, 6310, 5444, 3331, -7823, -17517, -23753, -27705, -34004, -10893, -2840, -12383, -15877, -17763, -35525]
7462c5525M097K9073j954j9904L0063Q284k3966l8905j8641J7769L36J9154N968
7449b4151r39R242Q774K682q763r319J3229o80P518J1872J6377q92O462J0543
7435D1955R70K416k9410l6305p553k953K1100K4620P412J981k012r874j9828j9299
7421b6780j5420J1650K0716L6235P437r278j5987J1590P324L272m4799j6348J0469
7408a9919L5634J6692J6456q564j8960J5708j1931k0596M234j0689k692J7081
7396A2454J9594p102k424l29J1379j5263k5069N846Q148j5336k354p067O946l692
7382a4269M28r278J3082m450M931J3052l798K0439K1445R924o126Q84j7908J5210
7368D3566r597m3351o258J2578q312q454k1015Q479M12J0353J0648n309j6161
$$ y = [-35525, -31428, -2355, -4309, -24213, 5850, 14134, -9832, -48737, -67378, -49609, -49273, -30119, -24151, -25090, -15848, -7074, -4392, -13155, -22474, -9245, -9925, -2407, 9465, 25842, 24950, 31412, 41955, 42925, 45341, 15931, -20374, -27927, -30880, -9780, 14840, 22252, 24233, 22221, 12347, -7481, -26780, -42200, -30550, -9834, 26401, 33838, 24560, 8573, 20163, 27487, 30759, -14040, -30388, -19919, 15715, 32407, 48863, 40299, 21339, 37047, 25116, 4520, 8754, -1935, -4627, 12454, 32048, 24946, 22522, 22193, 33572, 18309, -6760, -914, 7234, -8102, -10456, -17523, -10577, -14269, -13841, -23119, -10037, -14487, -9556, 3496, -302, 20137, 41582, 51506, 45380, 46264, 28356, 43566, 33969, -9382, -15640, -3062, -11374, -19828, -40843, -32364, -31952, -21599, -10951, -16260, -32421]
7355c2421K82k8199J4636l918J3283K7457j5532K243K8047K562m28o76l083J0903
7341A5156l21j7687q456P336J8266q081j8005p747N578J293r849j30M4106r311
7327A2148k1245J1577K270J93k2802N42L5239m29k6935k8685L813J8683J8342
7314B711K5799P50j3554J1634J0606j9138O137L603j5542p374R612m734m097k077
7300D336N567K6822J0550j4941l660j1721j2421k8058K4259J4474L010K746J6138
7287C7101j2949K3300J5797P451p252m847k5371m5727o628J49K728K5024K5343
7274C4119J844J2982O350j5104k4844J3427J0251k3438m8322J8238K9632K8j6329
7261a166k7386k89k735J5993Q740K1723M041J5636o793M579k6755k5474K661J4120
$$ y = [-32421, -32139, -60338, -45702, -49620, -36337, -8880, -24412, -22169, 5878, 8440, 8012, 7336, 4253, 15156, 14835, -2852, -11308, -3972, 14294, 6213, -11792, -19539, -13961, -12668, -22517, -22647, 21459, 12148, -9097, 2480, 4750, 4943, -17859, -17317, 17922, 17493, -9442, -38127, -34314, -15631, 2711, 28510, 29260, 15706, 27340, 37946, 18808, 24945, 28548, 13006, 5632, 15244, 10510, 6413, 4336, 9903, 36725, 47275, 32334, 28674, 16953, 4532, -23526, 733, 15207, 18217, 20963, 37101, 24152, 47452, 63249, 70700, 63448, 58601, 33230, -12497, -19125, -18976, -16248, 8776, 34119, 35963, 48945, 55295, 40191, 15347, 28774, 39025, 15587, -32735, -14497, 15135, 15163, -1166, -28552, -28841, -31576, -15583, -6843, 14880, 18921, 34557, 27764, 32343, 5588, -19886, -17225, -3105]
7247c105p911q435L3140L2097k537k7125L000J3459M971j0735m608P627j8276
7234A1562N374o594j3460K3619K2419J3784k9680k6868R850L0335L349k6240m1879
7221b4429k4978J3145L6246N437j1833J259k692J2895N711j2396k3613K999K3539
7208A290K2125r069j7961j2333j2275k7887j965J8723J9269l591p820K491N150
7195b3853j9519J4729K0988j7039j4758M813j5708j8798J2480K4170J4176j2900
7183c1219J2844J7876J865o0L4456P926l132q003j1082o589n524r24J847J5499
7169B5780K1319o993k0778m070o842j075j4053j696q190J4604O961K2256j0575
7156A6648j4827l8674p057M5863r504k5251P632J4934L3484J0053M22j7106k0867
$$ y = [-3105, -11016, -19451, 13689, 45786, 43249, 16124, 19124, 32583, 37554, 26819, 22211, 29838, 11562, 16936, 10342, -3118, 20501, 42920, 56704, 27024, 156, 10006, 40341, 43690, 17450, -24429, -49407, -36262, -16, 5421, -6412, -5153, -7845, 5050, 10761, -1635, -25248, -22249, 1290, 23415, 14346, -3615, -15948, -28223, -56110, -58075, -39352, -20083, -23674, -31494, -29003, -23853, -43372, -28643, -7655, -24694, -39452, -34639, -50347, -69145, -56665, -32495, -18319, -31219, -18375, -499, 1366, 1306, 35762, 43688, 40556, 32553, 21471, 14882, 9358, 8434, 10281, 25780, 47099, 40106, 19328, 15258, 8416, 7341, -6712, -8408, -16598, -1994, 4967, 27223, 16648, 1821, -36853, -43910, 1953, -7551, -32802, -25170, -10236, 23248, 33301, 33723, 16617, -4250]
7143d250p810j8946j1408O050K3831K311J3337J0964m0661K418R108J7251J9468
7130B1663j1196j224n4941N468P149j2463J0090J1768K3117L2249m1866l7070
7118d7256m16K3308J9815o389p098L4649K7554q478j5053l1833j7762n808m499
7105c9266N442N902L0458K7802n014k8341m6508l457M3242n88j1058q698J7770
7092a2314J4397J0108k3720Q745K4910K608j2922J3931J4740j2154k3224m037
7080A068j9363k1187M545j0407J0210L0058J0553k2042j1804J6492O817k7224
7068c2284k0760K0391J2182N883K4622o912J7441Q784k1950l4700j2319N582L3720
7055c20j3367N852K196l11L6061P824j9638l4093l4296j8688R522k0248j4949
$$ y = [-4250, -12060, -31006, -42414, -36364, -12533, -10222, 3115, 14079, -26582, -24164, -15056, 2195, 21663, 10467, 9243, -45698, -40230, -33081, -45544, -35454, -23686, -569, 31680, -10186, -47256, -47672, -24364, -4549, -10938, -18036, 16613, 44167, 35689, 20636, -11197, -28959, -34767, -39266, -33824, -27922, 2536, 30338, 25324, -3017, -49525, -52982, -9740, -10328, -21386, -30084, -12314, 2083, 12191, -11529, -2784, 22126, 24734, 11812, 25743, 40483, 28329, 5105, 1068, -18295, -39482, -34937, -45344, -35134, -5076, 5477, -16565, -28369, -11877, -5060, -32284, -53044, -32653, -20471, -14588, 10034, 3122, 20563, 29347, 7397, -27303, -39622, -34040, -320, -13687, -7835, -5639, -5950, 30111, 37935, 18297, -15796, -50092, -68780, -59258, -79506, -94455]
7042i4455J8956N9167L0870k719j9476j7197L5889J6330j9016P247R114k26r494
7029A4990j5351J170n804L293K153J8651k9593j8168L8299m034J2593j1579R126
7016A5746J5815k512j4895j4867J2971m825K5507o072k1265q74J1051r931k0248
7003a4399k3286M926J9382M712L559k522j9043k2848l371n810J019R845O088P530
6989c4218J0219O972N781j599m415M071j6174l763r810L0908L0974J040j6521
6976C465m311m634r97M97J0693k514J6420n275l0901R81K1271j7006k4553K168
6962c4696L5648K2537J0054j8023m715o087J2894N585k6598l978j3274l429N226
6949a8856L0048K1980j5499j340p294m254j1054K35O206J588k0835q013J525Q462
$$ y = [-94455, -75499, -16332, 14538, 11819, -7657, -24854, 11035, 27365, 8349, 15596, 24710, 24484, 14990, -361, 809, -4995, -1702, 451, 19102, -10491, -28659, 9640, 5606, 18199, 6620, 15746, 31561, 29049, 14154, -713, 12258, 7433, 32940, 26868, 5603, 4729, 15780, 5849, -14399, -37685, -32759, -13377, -8665, -5106, -7628, -26671, -49519, -52890, -58700, -57681, -47836, -41748, -34218, -23999, -17027, -11246, -12845, -17260, -13189, -29363, -33126, -42936, -12028, 18946, 19986, 3465, -846, -5480, -6477, -5980, 4713, 2199, 18619, 13344, -17557, -16576, 4695, -12311, -36864, -34696, 952, 23489, 33543, 15520, 10805, 4718, 17612, 23197, -3401, -7379, -20653, -24082, -18856, 11192, 33172, 17673, 16333, 9039, 4785, -6269, -6034, 172, 1760, -19075, -27088, -25563, -17101]
6935a7101r140R882Q025n689O397J4795p557k127R540P888K2951O650k033j7638
6921B4843q93j2312k4912J3674j6684J3078K2397q625j7100J0129O559J028j3514
6908b332J7376l016n445k377q174k660O114J9057o713m415j6076j0667K1888J2073
6894A4633j2251j1358N136K3242K0551k5330k5819k5226k207J1656Q699J1982
6882f292j526k8117j9005N0178K2542k0418j6539O845K1764j0897m048j5469k6392
6869d7374K47M1324L3986j1042k1213l0529l134Q059K4861j1993k36J7797j2830
6856a2077j7315m572k4464k942m887R795J3392J8361O566j4795J1110k6385n367
6843e3580J0654J7515Q920l2937K2726K5010M180j8721P691J0927p924K3246J2503
$$ y = [-17101, -26241, -16359, -8334, -14023, -7626, 7169, -388, -2515, 7025, 14913, 37864, 44514, 42481, 24843, 23950, 11638, -13274, 400, -16284, -3206, 19191, 10566, -6534, 3595, 10154, 11182, -2332, 15044, 12028, 6583, 4206, -3968, -6628, -514, 18543, 11830, 7415, -8661, -19328, 2560, 14633, 2382, -8976, -3840, 19402, 39953, 14623, -11196, -36422, -38629, -26973, -18274, -6292, -7818, -35935, -54940, -4762, 17780, -2638, -19177, -12332, 9432, -1465, -5513, -20982, -47374, -47127, -5803, 28183, 17141, -4072, -34601, -37735, -29676, -4815, -16808, -17044, 753, -12077, -29392, -33964, -58428, -61370, -66257, -56462, -43070, -24709, -18143, -32938, -21828, -48213, -53580, -42926, -25411, -16491, -49428, -26702, -1692, 2488, -16233, -8542, 2385, -5539, 17707, 30210]
6830C0210q180j003M218m886J7926J5969j0944r540P817p727l7854m2974k6532
6817g3500Q027K1300J7048n01J4464L99o687r736R906J7827j1684P917n062l267
6803a3549J868j291O14l451L006R57o15p236k1675K80Q748L620J4901J6941J9902
6788B3020j1317J2336j2352m688j3871P498Q605l0724M789K883J0988K698j6263
6775a6398n9N830K3709k2221k2189j4684J2049L6897L6043j1060j2144k5084j6668
6762b5979L158r504J6193k8492j516L2006L2954q553J4218L2049R397l2422m9849
6749a6340o923J3751j4527j0613L086J9245M675j9330M085N835n882J0788N545
6736f605k1538P15J5364j785n615J8602j910J0274q26k1879k2811L2529K1946
$$ y = [30210, 22030, 21027, 25245, 20359, 38285, 54254, 43310, 33770, 41587, 33860, -3994, -46968, -73500, -65473, -44173, -27125, -27626, -13162, -12763, -19450, -29186, -19280, -1453, -13137, -5220, -10282, -13549, -11681, -12972, -12358, -15809, -12803, -11846, -12461, -19697, -41372, -41092, -32344, -28724, -13823, 3118, 23020, 11703, 24039, 11687, 6999, -6872, 626, 9231, -21493, -16704, -13821, -2833, -135, -16398, -16457, -10627, 13082, -9139, -31328, -46012, -33963, 2934, 38977, 27917, 15773, -9311, -25979, -22821, -32325, -16132, -44624, -46140, -14134, 18820, 10267, 24485, 56534, 65931, 33509, -16340, -23263, -9512, -24039, -34652, -31566, -12321, -7646, -26976, -22891, -17056, -22938, -12150, -6605, -28143, -27428, -12064, -13849, -19464, -862, -2772, 7502, 6676, -15203, -38014, -5485, 16461]
6723A6461o997k5212j9845j7736R455R342j2724j4057p547j2525J1709L4166K2013
6710a3497L47p0J378K3594J7669k2683l6177J7449j2242j5601K6157J3224k270
6697b722k9896O489j9229R796j1530k911K4092M195J3268O057J6623k8942r748
6684b4458J68M854K9336J4675k1203l885J6494M488j0441j7367j4560q025K2309
6671g615K5343j464m847P91J3304j6288j1674K2123n433k6135j6729N369k3407
6658d6662P740M9327J7177Q496j3208j3017j2592k1042M950J6999M500n469l59
6645c160m4399p396K3896M7151r922j477q132j6232J6860N0267O28p288K638l031
6631D0403j3970l952J9988o436K309p798p852j242J1265J3752m240r946J2490
$$ y = [16461, 9464, -15748, -35593, -53329, -43874, -34532, -47256, -61313, -68860, -81385, -69676, -35510, -13497, -13150, -13220, -11842, 11752, 29421, 6738, -29439, -11990, -24232, -39833, -13676, -452, -2722, -32618, -26129, -45358, -35562, -47092, -50003, -25911, -21716, -8448, -2391, 14232, -14710, -24458, -24290, -19436, 9900, 24575, 3372, -513, 15981, 20469, 10028, -7339, -21899, -29924, -7615, 17728, 16264, 11417, 12208, 25512, 9224, -2450, 19673, 14240, -11895, -28624, -23255, -46662, -38922, 10405, 27582, 36078, 22870, 9853, -2739, -23781, -18831, -1832, 2668, -2801, -3160, -47559, -54955, -31059, 16092, 6170, 4693, -3439, -19671, -2811, 47456, 48084, 40796, 43434, 40403, 26433, 22481, 42469, 36033, 38342, 30544, 22692, 21450, 32715, 46467, 42227, 32281, 44771]
6618D4771J5021k1700k0722J685L8958J5024l9864k8012J4213O613j2057j0344
6606C586J0591j5071q918J2558R91j2008j2336J4185J079j602j6985K52K5033
6593A355P155J554M423K2224J285q16o026j6354j2776j2300L130J5008m301j6925
6579a3364j3120J359j7120j3460O399K3228K2054K9191j0950j5438q25r139N503
6566e682J1682k4007l410p802K7638l256J0270K0860p850j1412R055J0562J039
6553B7687N70r579j6706k670k709Q061l3536j6322J3190J383J8030K662J5507
6540E568k736l1254J3790j1055j2896j965J7973J5188k3157q475j153j185Q954
6527c2403M949K8913M691k8445k4210J6413K1719J7832Q485J0010k4663j9031
$$ y = [44771, 59792, 38092, 17370, 19055, 58013, 73037, 33173, 5161, 19374, 25987, 13930, 3586, 14177, -894, -9812, 2746, 3737, -8271, -20607, -6422, -5343, -6945, -23930, -23678, 1355, 8510, 10064, 14487, 36711, 37996, 37180, 31154, 14800, 2024, -10276, -7146, 7862, 3561, -13364, -26484, -25125, -42245, -55705, -49306, -26078, -4024, 25167, 14217, -1221, -2046, -11185, -5682, 6000, -18007, -21417, -29219, -1581, -4837, 5433, 26293, 18443, 7031, 16086, 26648, 27687, 28257, 18678, 1972, -698, -3407, 4654, -28882, -45204, -32014, -30631, -12601, -9939, 5568, 2832, -28422, -14632, -25687, -38583, -40548, -22575, -7387, -30544, -39019, -40172, -41357, -32403, -27454, 1459, 6150, -22295, -46505, -30092, -8373, 9459, 17944, 27954, 3291, -15740]
6515a5740n43N88j6684J1891O714O695P041K8724L0966m4335k7545j7163M861
6502b4530L2516P013P68j437k8400p522J0492R670R798j8996j7131K1923k3566
6489b9402k4578l5396m550K2182K8328J8540R720J3072L943j3066j7846N375M8665
6476B4987L8230l6197k3987K3518N153j3299q884j0209L106n644k1453j6229J7587
6463b3321M0994r027l6959o451N767J3952L1969J4496o659q999q873k877r149
6450e137l4111L366K8682R979K340j659r010J7430J5505j5202j5082k2613J6605
6437h907J4597j9504j0525p28L0823j0663j1538J4439M171J2710K315j085L766
6424A9871K1600l673j7653j1122q67o784K751j4793k619K5073K5816j3582n018
$$ y = [-15740, -16283, -15695, -32379, -20488, -13774, -7079, -38, 28686, 59652, 15317, -12228, -29391, -24530, 7986, 14999, 15767, 14330, -14070, -21592, -11100, -1430, 8368, -10628, -27759, -5836, -29402, -53980, -89376, -93926, -71744, -43416, -24876, -15156, -2084, 1859, -11207, -29053, -23678, 24987, 63217, 27020, 3033, 26551, 31704, 18405, 9521, -688, 2418, -3226, -24679, -40908, -23321, 17673, 8646, -28313, -34764, -28997, -15045, 16924, 31420, 24761, 15762, 6889, 4012, -5137, -39248, -35882, -7200, 2779, 5119, 3460, -5550, 11880, 27385, 12183, -2899, -25512, -8907, 5690, -13814, -24339, -25067, 5756, -4907, -16445, -2006, 2165, 14875, 17190, 16105, 19871, 41471, 37798, 20145, 9023, 8156, 1372, 4123, -10670, -13289, 11784, 37600, 24018, 19000]
6411A9000R742j3975k343J2669j9692k3361J2289J8780P542P449j1711j5081k0927
6398a9619K0662K3016J1264j228N338o719P788O335J3731K186l4314j3015o968
6385H457j1486J9957K5961L7048k404l3679k8092n373O741P976R312l3893n507
6372d982o129j3381J5853j3831k103L6018N710K2506k285J412j3231j3278j7181
6359d902j7977k472K4979N87M456O987O187K863J0424j958k8876j2607r865J0278
6345a1896q55Q479M2262M934j4863n32r168j6268n598l528J3454K7271n18k5333
6331G841J9128M754j073r389k3843j7596j3280K0648O798j6818Q536P138J7931
6318A0775P938j7077p061M495p950r84J566k3812j0141J3795J550r811J391K0461
$$ y = [19000, 28742, 14767, 12424, 25093, 5401, -17960, -5671, 13109, 20651, 28100, 16389, 1308, -19619, 1043, 24059, 35323, 34095, 39433, 32714, 40502, 46837, 60568, 62754, 28440, 15425, 8457, -3029, 16928, 42889, 79937, 77533, 43854, 15762, 10389, 17130, 25106, 34418, 525, -4982, -11111, -24492, -8639, -22470, -24573, 11445, 17155, 39661, 37376, 38788, 25557, 12279, -4902, -22879, -25351, -372, 215, 4671, 11658, 17845, 20708, 31132, 29174, 298, -12309, -22174, -11896, -12751, -4272, 37990, 42924, 28061, 27529, 18361, 2093, -3505, -7033, 6421, 33692, 33174, 7841, 26969, 31723, 30650, 21261, -2582, -20178, -33458, -12810, -6012, -22830, -14294, -7156, 10775, 18713, 1636, -5425, -930, -8880, -9864, -8298, -32110, -42251, -28456, -26906, -36717, -35326, -14865]
6304a4865K4795J2343j0858k1913j8303Q13O109K0045J4539j1259j6700j0860
6292b6114J1662L629j1581J08J7882J1997Q524j4371L695j2818k4224O935Q263
6279a6413l805q802J957J1792K0314O523l3171O306n134K457O053M64j7793k5455
6265e4707L2919L3798l2j4214j9736l6984k856L6801J5374j4849O89K8916L336
6252H455n354m39l400K5703j607p130k0178J2582J9648J5529l0022l5498p568
6239b9279J0292J2155M8629o25J754N595m295j1073J0519r091k1337m403k6286
6226a7445j5782J0562J4530J5586l5900J973K2080m731n402n900k4189l206J7988
6213b9836K0227O968j6086J714J3214K761j4644k7277m693L1092L1610j2431j9062
$$ y = [-14865, 9930, 22273, 11415, -10498, -28801, -27988, -21879, -1834, 12705, 1446, -15254, -26114, -14452, -10823, -22404, -22296, -4414, 7583, 16107, 1736, 5431, -7387, -31611, -24676, -16413, -20218, -29020, -27063, -15271, 5043, 11566, -21605, -15299, -20433, -17976, -11923, -11459, -29252, -54707, -21788, 12010, 11978, -2236, -21972, -58956, -61812, -25011, -9637, -24486, -23797, 5119, 8455, 3101, 2662, -738, 24965, 23358, 16228, -3950, 8632, 28280, 43809, 13787, -21711, -29279, -18987, -6832, 41797, 41172, 42926, 48521, 44226, 33153, 43672, 34581, 13244, 8841, -17445, -33227, -22665, -8135, 7451, -28449, -26476, -4396, -9127, -14529, -20429, -44618, -47824, -29836, -9609, -2641, -18727, -17013, -3799, -1038, -15682, -42959, -47652, -16560, 15050, 2619, -16443]
6200a6443K0112R114j3157J6299O967j3248m266j0959l937J6462L1894J079L571
6187D3488O347l4346l6157R964M884J1007o312J9166J6849L177n876q420j4181
6174I590j3488k7402K7729K6703k4698M145P814l354l808n648j6236J7717L2859
6161C1923j015k4571j2840P598j2285k1234J4786j0363k7402P413j5968K0824
6149d3134J1898k2511j0312K3333K7218J0087J4075r795k1538J9892J5756J5116
6137C0085J5903j5142k3404k1180j671m8344k281j5322J415K8019Q396K6166N267
6124a2093j3567m833j598M1546K6132p940k3387l5631j282K8137K133j7011l266
6111b2660M2834L155k1300j260j2558J1797L636j9610k4892l333J3805K5046J5758
$$ y = [-16443, 3669, 12783, -374, 15925, 22892, 9644, 5378, -5581, -9518, 6944, 38838, 39917, 43488, 49835, 15489, -20668, -10704, -5820, 5187, -1125, 18041, 34890, 38067, 32191, 23771, 9590, -3898, -31300, -3571, 23132, -1566, 2579, 10393, 7039, 3231, -2417, -18653, -936, 31923, 30908, 6337, -6503, 1095, -11190, -32424, -17638, -28001, -55403, -47990, -63958, -43134, -31236, -53747, -64059, -40726, -13508, -3421, 10654, 859, -20679, -787, 14969, 30085, 45988, 30846, 7442, -13738, -15409, -63753, -66034, -81356, -79941, -51922, -43526, -17360, -12093, -25660, -30493, -32091, 9455, 35587, 27647, 4260, -31371, -32653, -4516, -2383, -19394, -22660, 20174, 23329, 2029, 769, -11789, 8, 3644, -15966, -40858, -44191, -30386, -5340, 10418]
6098A0418P211J9709n113k7444j4754n529J2893J5417O709k636k5709m785O150
6085g463K492P751J6538J427l0755J0351M930r999Q623j7669J0784j205j5938
6072b0133R57P897q01j5594L0390K3061N649l2536k8936j0660k534K3980K8299
6059I039L211j4194J175M840J7318M927k5309r673o866j7946K3942K0188j5005
6046d353j7704j9927j758K5634K2347k4495m085J0962J0140L026K7882J7670Q647
6033E3986k909j2027O854k5150j9556j8993j3332M48l806p691j7343J5267J7980
6020b6272p269J2587L340R002J5327M538j3933q962J186j160j3012j0265L98J0101
6006b4394J7335R209o245j723p54N827K0116n623r690K7089J5131k8199k5106
$$ y = [10418, 17629, 37338, 32225, 4781, -9973, -15502, -2609, 12808, 19517, 16881, -8828, -13613, -7463, -4971, 2780, 19318, 20745, -10010, 341, 5271, -4728, 3895, -13774, -2990, -4195, -20133, -19176, -11279, -12080, -27674, 2716, 25777, 31426, -1110, -30046, -40706, -43240, -19260, 9039, 12250, -1944, -769, 4071, 21389, 26316, 1007, -8666, -15532, -33478, -9536, 10652, -4353, -22057, -41984, -43742, -18108, 4239, -20256, -24341, -13379, -3239, -213, 27669, 45339, 53986, 51077, 39050, 45904, 20754, 1198, -17795, -31127, -30679, -34485, -42176, -59519, -44252, -26272, -33541, -20954, -17614, -8612, 6715, 11253, -2680, -11642, -10456, -11616, -24628, -34893, -34495, -24394, -7059, 2150, -4095, -5818, -6572, -745, 19371, 13748, 4058, 31147, 46278, 18079, -7027]
5993g027L500j9661QJ8228J1934j2699L0287J9862j1968j5485j3681L867j06r501
5979b442l0459k7158K0600L5560p028p341K0846J6405J9795j7879j1230l296J0301
5966A6674j4214l1709K907J7011N497N76J7593q569m9556j7585K6224L0216j1843
5953a6778j3059M117J825J0782L6837R781q372j171m140j8497j4765l183J1227
5940e396J5424j6769p443q149j8240O098K1644J4787m683k036r011l3199j9803
5927f6776K6847J8674J8627p80k488K623k1609J7082J8551j6493k6644j1867J368
5914d2885J3567K0255p78K3761K8790l516K3592J0854j8666k7594J3010j7301
5902B3089l1530k6890L7876K2515p5j3176k8470K1093P893k14J285n308r531j8657
$$ y = [-7027, -3527, -23188, -23180, -4952, 6982, -5717, 24570, 44432, 32464, 16979, 3298, 7165, 7059, -2442, -32901, -60059, -39459, -3899, -10927, -18268, 2578, 18983, 38778, 20899, 9669, 6373, 16674, 2460, -29249, -26342, -9331, -3834, -3258, 14335, 5766, -43790, -61375, -35151, -4935, -16778, -29837, -25720, -23895, -13113, 23724, 33505, 25133, 23962, 19822, 1325, -13440, -16623, -5396, 10028, -6741, -14184, -22333, -40573, -34475, -12831, 1956, -2727, -4763, -13774, -46973, -66776, -39929, -21255, -2628, -3408, -5896, -3273, -24882, -7800, 10751, -5742, -32386, -44253, -42885, -29318, -9063, -9841, 13920, 42710, 39194, 62786, 73640, 54974, 27380, 40390, 23089, -8441, -35331, 2545, 25060, 24985, 11809, -16661, 4432, 12325, 12111, 13396, 8088, -1443, -20100]
5888b0100j282J40K3671j0167p102m886L085O161J5828L172l4722k9461K0533
5875c5130K3167L315k9489L100j894R574M8174N728j5888k2382o651J766p133
5862b3743n314J2002K0928j348j3930m229K963P921k5487r806J0211P111j8474
5849d1195j935O970l4827Q709M35J5751K5445j5915K4606k6827p09J2081L1556
5836D145K5125r104j4707j4978M963p705O64P952L533j8433J4185J3820j3108
5823c648j4769k485o261K0149k2274j3853K840j2891K5687m80o095J743p044r486
5809d8867j2557P848Q577J3566J0583Q500N914j2674k6646l787L9117M4981M83
5796C5038j7015L87J2789L2045m274m8891l0312K8435r184j0132j3520N671J868
$$ y = [-20100, -21382, -21242, 2429, -7738, -14840, -19726, -16641, -10480, 5348, 8520, -26202, -55663, -35130, -11963, -8648, -38137, -35037, -36931, -27357, 20817, 26545, 10657, -11725, -18376, -16610, -23743, -29057, -17055, 3873, 2525, -11405, -15634, -12671, -4750, -30237, -40043, -29832, -22721, -41195, -43130, -36160, -70987, -62278, -61843, -46092, -20647, -36562, -11956, -38783, -39492, -27411, 4145, 29270, 20166, 5459, -9519, -4556, -12261, -11597, -3645, -112, -18545, -4360, 9460, -3648, -18417, -20902, -27163, -7014, -29288, -43141, -40301, -53192, -27505, -27985, -34080, -32337, -39381, -48867, -61424, -53576, -44999, -31433, -20850, -12350, -6436, -19110, -45756, -49543, -10426, 34555, 35038, 18023, 18410, 31199, 63244, 58970, 10079, -20233, 8202, -982, -11114, -24634, -18963, -17095]
5783a7095O539R309J6814P070O663k6001j5093J6207p017j9807Q144K2669J1208
5770A9610j163Q374q795k652R764P639j209r887r635M660j0190q659k9184j171
5756c2498P790J97o912J3439L076L112k1976r43Q852k7622Q016L1766R857m230
5742h076J271k655J140J451P724j788r726l085J290j0621q542j3475J7320N520
5728b2252N291J7742K6893n726r49J7306m568N868k7671k7183N882K3001J4407
5715B8041j857l6514l4785K4043K0263j1604l000K3768N952j2113J3639K6604
5703D2437q106k3110k171r740r970J86K9197K0792k8763O85o510j0403O64k3622
5689b8434p441J6238K0912J077k5428M186L795J6470J0215N54n753j5146j4407
$$ y = [-17095, -10556, -1247, 15567, 22637, 29300, 3299, -11794, 4413, -2604, -22411, -14267, 8402, 19610, 18447, 26821, 18026, 15374, 25138, 32777, 31568, 21681, 12046, 16706, 6516, -2143, -31327, -32498, -24708, -24511, -31423, -17984, -14908, -11796, -33772, -34715, -25863, -53485, -45469, -13703, -3846, -8076, -6805, -9460, -8320, -6869, 855, -933, -10659, -13744, -12454, -23075, -31617, -45092, -27772, -22252, -16961, 781, 27674, 21948, 20999, 38305, 33737, 39605, 11934, -15249, -9367, 13634, 28041, 26184, -10330, -45115, -21072, -809, -12413, -15413, 8355, 14307, 2194, 15833, 42437, 34331, 11221, 9050, -690, -10660, -10474, 18723, 39515, 10752, 11437, 4927, -5476, -4812, -28434, -35875, -19637, 1275, 2352, -23076, -18890, -15095, 1375, 11590, 12144, 6391, -8755, -23162]
5676b3162J0136l505n610m844J8038j3251j0091L4971K4460J3824R675k2339k3817
5663D485q236Q902q358k8615j1133L908R671K6152K223j8854P429Q101j1930k5142
5649d1397j1086L2864k031L027Q425r257J5755J6309N140n277l4908j8131l484
5636d4051P293K1159J2646N341j2894j6318K7103j0153m079J4130J3475j0774
5624B878j9018j5143L1072J3333q812Q663k3691o716l516J5230K3787K4002J1271
5611E3340m6309j1701K5194l5101k2522J9713Q644J0438k1468r945P114L5189
5599A2586O648m09l9581j590Q694J9302K1074j7917m8282R595j1571j1984J4156
5586c9279K3056o486r279J8115J9945J324J5148O784j0157k8555j5759J4936N802
$$ y = [-23162, -13026, -16531, -22141, -26985, -8947, -22198, -32289, 2682, 27142, 40966, 50641, 28302, 4485, -3751, 5151, -3207, -31822, -42955, -39047, -29376, -3224, -1001, -19855, -12426, -4325, -16255, -41397, -52483, -19619, -21650, -18623, -10198, -19455, -3700, 12609, 17749, 12472, -22436, -40567, -44051, -36758, -15599, -2953, 2388, -10506, -26824, 279, -9874, -13953, 177, 13652, 2878, -16140, -31283, -211, 13122, 4310, 12973, -10718, -17434, -20950, -5720, 18067, 42069, 53340, 7031, -4670, 20524, -14577, -37099, -17386, -8742, 1696, -19772, -29717, -22603, 12586, 19234, 18825, -20756, -22346, -13652, 5650, 26724, 8807, -39475, -29880, -41451, -53435, -39279, -16223, -22709, -31988, -13873, 6072, 7396, 22544, 29328, 19171, -9384, -25143, -10207, -4405]
5573d405Q036j2859P301Q112j2211k1580r864j5064k2890m469L1052L858l43p516
5559e2842K9361O494m138P368j700p104P893J3683K614l874j3455k0823L5223
5546a300o002J0366J9988j6090r521J0927J2229j7509k2408J2478K759P256j2013
5533h840j088j0583P418K8173K8395o686j0905j0644j6472J1934J3790k3351j6434
5520a5293N347J4283K1511j4456J030n527O593k77M272k1713j2349K2694K6258
5507C2373n581k6647j8368j6193j199N5318R334k4708J095j0168m271K074J4776
5494G835J2247J4073l672p586J3500o67Q382n491o269j3568j0820j2340J0508
5481F132L4104J816k5014N709j164Q315j1468j892L279k747p710j1874J0855O314
$$ y = [-4405, 3631, -9228, -1927, 6185, -6026, -27606, -37470, -52534, -75424, -79893, -48841, -44983, -45326, -52842, -23481, -16987, -21125, -13757, -15457, -22561, -14668, -985, 1629, -2245, -15700, -36523, -1300, -7302, 3064, 23052, 6962, -2559, 8368, 20597, 3088, -19320, -6842, -4083, 3173, -8840, -9928, -20511, -13093, 15080, 43475, 36789, 25884, 15240, -1232, 10702, 24492, 1141, -15293, -9946, 4337, 25848, 11392, 12422, 6895, 13488, 13211, 17483, -4230, -16579, 6115, 32373, 26792, 145, -18223, -34416, -35615, 19703, 29037, 4329, 5424, -4744, -9015, -6941, 7835, 20082, 34155, 30483, 22897, 36397, 35730, 44112, 38621, 32352, 18784, 7964, -4376, 6132, 40236, 42052, 17038, 22747, 21583, 29898, 18430, 16538, 19817, 17070, 9360, -2514, 8341, 14655]
5467A4655K222j1984K6920j0227r166M322R705j40k2864N170J7259o812J313j0197
5453A0176r628J8047j853j4328k302k0346n113J8507j3657j5397k873j6017K3174
5440c1610K3290J5548j8695j4109m61j2357j0245J2274J7276Q953m668j6089J7853
5427a3040r080J8788J2959j2632J4022J9089J1481m008l2680j2871k520R573J3285
5414A2366q617k445q415j6335J2828J7914j103j8726J251K3458n661N810j7784
5401e459l8546j8874K7827k623k0997J9693M7970j990o723K0642j7084J041J4886
5388A9763j334j2233k3027q774j7439m603p948r006J6523M857j3033n924J8465
5375d3713K1637J6716L5958L7142j4369n7279l1264O262j4192J0596P916J4877
$$ y = [14655, 16877, 4893, 31813, 21586, 12420, 16742, 26447, 26307, 3443, 8613, 25872, 19060, 20373, 10176, 548, 18595, 16742, 2414, 112, -20234, -25347, -6840, -20497, -35894, -38767, -54784, -31610, -8320, 7228, -11467, -25576, -26037, -38394, -48639, -36365, -19089, -10136, -14804, -30893, -13040, -22120, -3332, 9627, -3005, 11017, 30106, 41587, 37579, 4899, -7972, -10492, -919, 12366, 3749, 1304, -7111, -23446, -10618, 7296, 6193, -12533, -11282, 12176, 6515, 12325, -5459, -44005, -62879, -35052, -37675, -58672, -38979, 8991, 7001, 278, 20920, 3836, 4877, 19763, 18429, 6196, -16831, -25605, -43044, -47647, -55595, -64601, -48078, -43221, -56254, -62178, -43713, -22076, -5360, 30598, 67740, 53371, -3908, -35172, -28910, -43102, -32506, -24590, -9713]
5363i713J7971N408l5389K618K4429o690k4596j3091J8525K087J1358K1825j6206
5350a464m241L619q097j1156N023J4541P701P23o594k397j3324j2775K967r044
5336c4518N57k1164L668k2363K5063N3405K3275j496k1140k6215L075K3681k0417
5323a4589R858o222m7236j1060K9208L9195j5808j1160Q777J391j2782J6157R530
5310d741j917O255j3242j4695P890J0906L971K0092L441r267k3456k2666N677
5297c1752O402k019j6128m700j2447J900K024k046J4538m708P921J8311k861j6375
5283d1940k6568N511K837L8k163J7490J8336K4975L397o125k6406Q792K7499k758
5269B915j6315N116O297j0646J1383Q846l0945n349r913K7124L0412J5980r445
$$ y = [-9713, 8258, 13666, -21723, -19105, 5324, -1366, -25962, -39053, -20528, -18441, -7083, 14742, -1464, -5705, -2086, -10183, -21339, -16316, -1775, 5926, 6649, 55, -2342, -15666, -28441, -25474, -34518, -33961, -55125, -51457, -73820, -48757, 4648, 27923, 26427, 5287, -20928, -17853, 5828, -14589, -4731, -10953, -58189, -69249, -40041, -846, -16654, -27814, -19037, -17646, -30428, -14271, -4741, -6658, -403, -13645, -28340, -20450, -9544, -5573, 14519, 17960, 8693, -14763, -37429, -31752, -25350, -27369, -43497, -48197, -60644, -58744, -56720, -58766, -44228, -48936, -41015, -22704, -25565, -41940, -68508, -62997, -60160, -60122, -62285, -44795, -26459, -1484, 1913, -4212, -30618, -21826, 5673, 2915, -13400, -8284, -1987, -12633, -1250, 7596, -23349, -28698, -38611, -11487, 18925, 34905, 25460]
5256B5460k0417J377l1409n308J584j3446n708n859N341M6079K3966k4141j8031
5243b0512p984J1775L807Q519M040K412j6657K242r037O887R361O455j0367m1544
5229e0603P697K2179J6406o899j9764k5363L0200O963J8383J3290J7940j8547
5217A1882J6599N115j911J9760J0929j4221j0295j330r606J1689J7548k5979o498
5204B3682r392J4361J049l5571K034K1956K1979M535j6608o3r253r466J643o393
5190D493m196p079L8760m615l0768o333N232k0995j2484J2554J3987P622m272
5177h094N606k0748n206K0238K9626J696k1633J3884J8984N751j1234j3428k0174
5164d732j742K6361J5456k1711k3884l8600j6110K52M1919J5819K416R417J0623
$$ y = [25460, 5043, 6420, -24989, -30297, -28713, -42159, -47867, -53726, -48385, -2306, 21660, -2481, -20512, -28496, -16721, -12914, -4395, -355, 2057, -14600, -12358, -21395, -14508, -5147, 1308, -9059, -50603, -42906, -20727, -4321, -11220, -30984, -56347, -26147, -19184, -801, 12489, 30429, 11882, 28481, 33596, 31685, 51445, 62374, 48153, 37858, 36528, 26922, 38611, 56159, 30180, 23682, 14290, 28651, 29700, -5871, -3837, 18119, 40098, 44633, 28025, 27962, 18709, 9243, 10886, 4493, 297, -6782, 31978, 27363, -3405, -9738, -4506, -25501, -37985, -25431, -11444, -3822, -8094, -2488, -23236, -28442, -8204, 21422, 23118, 1485, 15369, 34353, 40104, 28870, 15442, -4732, -6474, 19887, 35343, 13632, -10252, -48852, -64962, -64710, -22791, -6972, -4556, 4861, 15484]
5151A5484l6946l2937o580J1443q965J2129M158J180j175R395j7769l0794N048
5138g6329L2112N047L163K3769N862J1420q915N09p09j1170M467L5884J6908q341
5124C3677k7201k1445P035Q23j4175L691K953J2148L3957k3224l9018J2322o973
5111b5430j879O892l041J2424K03q574q490j2655k8138Q62J1199j1727K9186K8784
5097a0384J1081N441j7950r102K9772j4487j4833r214K0220J258j2654K9295J6466
5084B4909j2941o951q744q76j6259j5812K1663J8742R55m1179q004m761J8065
5071c1193L0716q476J0715J9906q818N308n082J561k087j1129o545l864k762j0893
5057b2643k3181k1344J4668J7279R293p718K755J3479J6849L6826J0429j0151
$$ y = [15484, -21462, -54399, -60979, -49536, -58501, -46372, -42214, -41034, -42209, -32814, -50583, -81377, -76329, -44217, -39170, -36007, -12238, -6376, 5044, -3871, -3362, -4071, -15241, -10774, 25110, 42018, 33677, 6476, -14969, -7934, -7111, -21286, -17595, -14642, -2494, 31463, 8239, -30779, -18457, -25430, -27309, -20417, -23458, -11034, -10831, -19405, -27895, -40550, -68688, -67826, -56627, -68354, -39168, -10384, 697, 6138, -11812, -20914, 8858, -5629, -20462, -29676, -9456, -8198, -20852, 8443, 24909, 11968, 5017, -3727, -4603, -20862, -36674, -15011, 3731, 4686, -36493, -44497, -49258, -31193, -477, -8953, 1762, 21668, 12850, 18158, 13076, 14637, 12550, 1421, -5124, -8988, -11750, -22643, -45824, -67168, -52500, -35221, -25928, -33646, -30891, -17412, -563, 36263, 46692, 36541]
5045C6541P949k0907k1741p452j5153L274K1069J5945j399K31j8217K0592J6695
5032C7427l3629j9219K4776J7902M595l7734j032L011k2487j6087J7503J4196
5020a0778J7252n873m108k2648j0402l488K5136K994n683j0842J2130L4680J821
5007B0191l1310l4298L929K6332J2006p660p638L2300J4271L750n306q054L253
4994B1766j335r281L68j7379m4m180j0368J7793N691K64M563j0268k1879j3803
4980c8092J3252J3351L0273o328n337l0487N212n31J4122P589L479K0296j3344
4967A3455L857o627k5932N343N246J5033k0120j7057P086k175l468j9053J4844
4954b9568J8072K6320j1997k5075R367l84o336M00P953N14M671k287j554L908
$$ y = [36541, 44490, 23583, 1842, -5610, -20763, -17489, 3580, 19525, 18126, 18357, 140, 20732, 37427, 3798, -15421, 9355, 27257, 31852, -5882, -6914, -3903, -26390, -42477, -24974, -10778, 6474, 601, -3507, -26155, -36557, -40045, -14909, -11915, -17598, -28440, -16310, 18370, 20191, -11119, -45417, -41488, -15156, -3150, -10810, -18448, 13852, 28123, 31873, 26567, 18513, 21766, 20431, 11150, 11518, -5861, -5905, -10085, -20453, -2660, 3031, 3295, 7858, -2410, -24289, -38092, -24840, -11489, 18784, 12456, 7119, -23368, -18156, -18687, -4565, 3024, 6503, 26799, 13455, 17312, 10685, -15247, -9904, -4658, 10375, -9745, -26802, -19716, -21891, -25359, -44412, -29568, -11496, 14824, 2827, -22248, -12881, -13265, -19601, -19201, -11248, -10734, -6063, -8350, -9904, -5996]
4940e996J6795K283m5053j4323K7124O824K4733J0118q67j6261j4042R271j2931
4927a2325M701n738J2450J8262K4423q13K548m4388j7917K0288K1849l945l275
4914A6120l1041j3522r247K6049j6322J3499J7741M590M405j0924J152J553j5428
4901a1375L0937J6954J630J961k2340l0154k2540K879J5771k340l2024j9012K2662
4888d6991K731O151J5865o104j1385P268k820j7556J9034j796Q226N657l9020
4875f0740j6502P106L2192J5643j1514J0246L454J0611o397L791J9434L3024J5077
4862E5425j7243l6590j723J8087Q382j5029l0853q401o336j1404j2058p754M7904
4849a7593J5207m960n863N243N719M423J4084J7588k3845n645q251P103K556P252
$$ y = [-5996, 10799, 13082, -31971, -46294, -19170, -12346, 12387, 22505, 21638, 5377, -8665, 606, -12325, -7624, -13362, -912, 17350, 41773, 40960, 43508, -880, -18797, 1491, 23340, 19395, 16120, -14921, -28443, -37690, -11641, -27963, -14464, 3277, 7867, 12272, 1348, 2500, 4053, -11375, 19562, 36516, 38146, 40107, 17767, -12387, -34927, -32048, -16277, -18617, -50641, -69653, -46991, -44260, -38109, -22244, -28348, -39733, -32465, -35285, -52841, -33807, -35603, -27377, -21720, -60740, -77242, -70136, -37944, -22301, -33815, -23569, -20115, -9504, -15901, -12110, 7324, 40348, 55425, 38182, 1592, -131, 17956, 26338, 11309, -19544, -27945, -34281, -45685, -57743, -65497, -17593, -2386, -7346, -13209, -7966, -2247, 2176, 16260, 33848, 10003, 4358, -3893, 3210, 5766, 13018]
4835A3018N818K4870o998Q141j0150l1821J0560J0704J68j6952k8030P245R731
4822c696K9720j28j4102q7j6250k999O352k6562l0072k734K1643L5123R147O802
4808A2157n316J3404n880l1884j0964J6712L080p666j2477j0890J8962L1371k5504
4795a4895j6973J5383n646J9181L9095k2922l6006J0652J6148P893J4998J1477
4783C8385J540k2830R59O767L734o239J4079K0892k4641r406k1630k1726l0580
4770e0696P077K3782P140r600m322Q902r593k9796p26l3956K2516L7217K683q673
4756c8045N738j7887J3167L0613J4995j3986l2341P902M327J251K158k9908O29
4743e1387K7606J166j2580M843l955j7372M520J7258N357n221l972K537n187R848
$$ y = [13018, 18836, 43706, 36708, 44849, 34699, 2878, 13438, 24142, 24310, 7358, -20672, -13427, -3696, 26024, 25896, 11794, 11707, -4543, -7542, -1190, -27752, -57824, -60558, -38915, -3792, 5355, 12157, 6841, 20245, 14365, -17519, -28483, -11771, -8691, -16357, -28834, -39724, -20762, 10609, -14895, -31868, -16485, -22131, -2950, 36145, 13223, -22783, -12131, 4017, 11910, 26908, 38385, 39925, 17095, 18054, 24821, 28555, 22316, 36395, 57287, 32646, 23240, 1610, -20116, -50696, -43619, -19837, -12697, -22297, -26619, -17717, -27310, -57106, -57832, -91788, -69272, -32055, -29372, -38045, -32307, -50194, -37027, -6414, 8581, -5405, -37746, -29844, -25517, -24266, -22108, -52016, -51387, -23781, -22615, -35195, -30352, -34307, -51679, -47159, -29901, -24544, -29765, -33737, -31200, -36387, -26539]
4729b6539J5511K0798K9060O22q458M631k9394l6062m078J2228K6866M840k2141
4716a2116j2021l071R725J5797q221j6503J696R469j0980K9886J3235k5616r894
4703a8614j0630o363m87o476P315K2826p304J2984m293k9580J0252L1842o901
4690e429n734l700J5886j472k5298l9561q785J6313J1469p485L586p458k1662
4677g9330L0728J0120k5461N30j4053K5747K6972q688M070J7911J722k930K351
4664a0311J7310q901k3915j840J1102k0789m420J692m983j8877K2327M878J923
4651c4804J714j9459m388j0846K4267L0662N785N732J5426P775q69k3492j2449
4638a4946j492J5366J907k0780l214J0601J1704k069l7871j9535K3613N706L423
$$ y = [-26539, -11028, 9770, 38830, 39452, 30994, 35625, 6231, -29831, -33909, -21681, 5185, 10025, -12116, -24137, -27208, -17483, -1686, -9907, -26410, -24714, -15245, -26225, 3661, 16896, -8720, -18614, -29244, -35607, -36094, -42570, -35255, -12429, -19733, -6749, -11042, -40622, -30370, 1472, -5429, -11163, -14863, 1023, -449, -25747, -65308, -74093, -57780, -46311, -53796, -50210, -57668, -79330, -48602, -38482, -63943, -63413, -77466, -51719, -24747, -33435, -29365, -11454, -9732, -12662, -10311, 6999, -1902, -25817, -27657, -16555, -37344, -41764, -40072, -45055, -63932, -41605, -36727, -34804, -33090, -52549, -56937, -67783, -43516, -12854, -7069, -1337, 14089, 21864, 20995, -2497, -14946, -16438, -1072, 835, -19945, -23159, -12558, -854, -2923, -40794, -60329, -36716, -31010, -27587]
4625b7587K8692j0948j1389l035n030P707J285l0276J3638K5253j406N485k348
4612i959p77J2279j4844k2467k4442R729K6512J7996k306k76p225q524O486M404
4598a3414j470m593o635j0926k55N719J074p51p396J6628Q596k033k5861J7648
4584b3669O711q868J2229Q12o975K305J5099R74m6179N779J0149J1279K7759L8779
4570D6184N962q961k9240l6000l443n24J6313O602n492R343K132k5616L513K6174
4556F947m575p145K9732j5181n860j4177l2612N001L3395J4047r848j7440r447
4543b7163Q516J52J1603O063l0297j9016r702N424K7449J9692P11k4329Q96J0814
4529a9187p413m968J8610J6592j2297l0502o92L207l2287j5067J287R076o480
$$ y = [-27587, 1105, -9843, -21232, -24267, -29297, -21590, -20305, -50581, -36943, -11690, -13096, -7611, -9959, -10736, 1543, -13301, -35768, -60210, -50481, -23969, -5973, -8279, -8555, -15780, -24304, -17818, -13414, -14884, -19477, -26112, -37038, -37293, -31574, -30500, -31251, -38647, -22019, -13423, -15456, -41317, -23669, -16958, -25826, -13597, -12785, -19760, -17455, -2356, -1382, -47561, -41782, -31633, -20354, 7405, 46184, 52146, 43185, 13945, -22055, -25498, -26022, -9709, -3107, -8599, 744, 2876, -22740, -19227, 6947, 2372, -4773, 24959, 9778, 3918, -10259, -42871, -37870, -4475, 9572, -276, -17716, -27163, -18647, -18495, -6892, -829, -31126, -50142, -59844, -54420, -26971, -7279, -6568, -30897, -30001, -19187, -26600, -31568, -12958, 3634, -8663, -39165, -39857, -36650, -68937, -84004, -82717, -73641, -80121]
4516h0121m571K0874J9072J7217N013O702Q659p352l204J7016L83j769L692l1591
4502b9980P808J6324j4916n734M349L504P655K0288R449j9712J207K1616j682
4489B0176j0817q108p240O01m426m181M0977M6534j5843j7946L477j1689j6501
4476A5014p913K1862J4715q179k0096j0593n209k9950k1737L766K8290L0286k611
4463G645J0731J5606n6225l5460L523J1851J614L2585J4658J05o072N229l149
4450B641r001L063n317q334J952j9718j53K1480R920o908j5024R344m871K2129
4436A203K954o773j9652k8011K5898K2642R508J4812J8043j5925k0420k7852k500
4423b6073r112j3326J0873K1230J2198j4736k7936j8052L7125K9270K2232j0263
$$ y = [-80121, -84692, -63818, -44746, -27529, -22516, -15814, -7155, -14507, -17711, -695, -312, -2081, 1611, -29980, -22172, -5848, -20764, -26498, -22149, -18645, -10990, 9298, 18747, -965, 242, 21858, 20176, 9359, 1251, -5989, -5388, -9814, -13995, 26982, 73516, 57673, 39727, 43204, 31515, 15014, 7101, 28963, 43678, 35499, 15403, 4810, -399, -30349, -52086, -48320, -20030, 10256, 7645, 18376, 33982, -22243, -57703, -54180, -42329, -40715, -8130, 6528, 6633, 561, 5790, 2641, -6360, -3297, -8614, -16948, -14996, -34714, -34867, -13387, -3467, -10375, -25399, -16055, -20926, 1203, 4157, -2616, -22268, -50279, -24381, -1739, 7769, 22581, 40624, 24699, 4279, -23573, -26073, -35185, -48511, -37638, -16408, -4210, -18946, -46882, -64934, -27809, 1461, 23693, 13430]
4411A3430j1213o708J3345L1418J2544n78k0433k165k2865J2271J7587r516k6767
4398C50r554j26k0554k180J8619J820j8868o052K2527m462m4347L728K7901J0102
4384b1096P890m86N657k163K6967R128r526J9256k4428j1544j1978j593K4719
4371A0803o093K41j2625j6537k001J1777J3349R862L779o955j6263J0065R471
4358H873r717l154m440k798K9120J1174j4112k6495j5288J7355K2512J1122L330
4345B7482l0828l1758Q635K0506K7473R599k4300N413O299j8679r616j3913j1452
4332c5139N678J1781J6654J2573j9484j226O917j3695m320j7621j5831J8651Q825
4319b6237N465R632J6385Q874k3190m0178j2385m421J685J834O850M9823J9036
$$ y = [13430, 2217, -4491, 8854, 40272, 52816, 52238, 31805, 29640, 6775, 19046, 36633, 27117, 350, -9204, -9330, -29884, -32064, -13445, -11625, -30493, -36545, -14018, -18480, -62827, -59099, -31198, -21096, -13206, -13692, -8035, -10198, 16769, 25897, 16371, 35627, 11199, -345, -12323, -13916, 10803, 4710, 4951, -7674, -24211, -26212, -14435, -1086, 8776, 12555, 5600, -10663, -598, 8873, -844, -3998, -8438, -11236, 17884, 29058, 14946, -11549, -26837, -9482, 13030, 24152, 27482, -3346, -35104, -26469, -5963, 21510, 31109, 6809, 12222, 18521, -158, -9774, -23687, -35139, -29461, -17680, -1026, 11547, -7937, -9163, -2246, -15941, -20261, -37882, -53713, -35062, -26237, -20772, -11140, 5245, 14119, -9071, -49249, -61634, -66055, -64370, -62536, -55686, -5863, 13173]
4306A3173R857k0862j7706M702J6524J2299m916k5254k6309J7433L9801O528n109
4293B0161m7647l0458l0242k5663K1017L1470R752J7639L425R813M0713K4526
4281D4506p312j9963j1788j734L396N029r017n055l639O07O938J7491l371k2898
4267f810j0136K240o50L860J0588j8369l237k2164n000K4679n87l493j9194M1194
4253g079J6499n260j0495m864M5446L5019o132k2675k4721l1243j4848j2291K520
4240d0124L549K5603n332k2586J428J2511K780K627R800J9179J2358l072j7882
4227H39K9147j5806j3148O713k0888K702K7326m664k4733j3116m600l759O967
4214b7020J5469j6420k5192J1568J2706K0637K929J699L161K077J6458J9824J1731
$$ y = [13173, 23030, 2168, -15538, -10836, 5688, 17987, 13071, -12183, -38492, -21059, 18742, 25270, 20161, -27486, -57944, -88186, -113849, -92832, -61362, -51610, -33971, -30546, -20733, 19980, 44506, 37194, 17231, 5443, 3709, 7105, 12134, 3117, -1938, -5577, -4970, 1968, 19459, 16088, -6810, -16946, -14706, -15356, -11496, -908, -19277, -22514, -44678, -49678, -24999, -25586, -29079, -48273, -7079, 9420, 4160, -6335, -11199, 34247, 69266, 63134, 40459, 15738, -15505, -30353, -42644, -40124, -36575, -10972, -16304, -38890, -37462, -24951, -22171, -19544, -9744, 9435, 21793, 18721, 839, 29986, 14180, 1032, 7745, -13143, -10441, 16885, 12221, -12512, -25628, -30228, -33987, -27020, -11551, -27971, -53163, -41595, -28889, -8252, -5323, -3624, -463, 1614, 18072, 37896, 49627]
4201D9627m170j6653j3507k8022j4483k7590m458K2077L947j6132j3471J7793
4189d5042K6763r83P823J989j4666k207J4694J269P814l1833J353J0856j8283
4176d0453j0479K281J9498o047j545J3159J3748J0056q491j7524K274N553J0697
4163g273J5046j4645r221J5961j0685J9012q839j9818J2231J2193J9624j6694
4151F892j2514r701J5133J4449J6130P315p764P262M118N138j3543l2196j271
4138e52j4754j121J5369J9173J676j1442k3848M446K7671p731J0902M681k7008
4125b538k8714j9022M310J0948q826O414q093n653M685l278q752j0611K2305J9703
4111b7122J8254j450j3423J9019J423j5849J030o700L636P695L2703Q920k7642
$$ y = [49627, 45457, 28804, 15297, -12725, -27208, -54798, -59256, -37179, -33232, -49364, -62835, -45042, -18279, -19262, -11439, -9450, -24116, -26323, -11629, -10360, -2546, -34379, -33026, -22170, -40453, -50932, -48651, -29153, -35200, -36745, -23586, -9838, 218, -8273, -25797, -23523, -17970, -7273, 7773, -6872, -16093, -132, -10817, 8195, -644, -20462, -8231, 3962, 23586, 6892, -5622, -15323, -190, 14259, 30389, 37704, 29940, 37202, 41320, 46458, 32915, 719, -552, -15306, -16427, -1058, 18115, 19791, 8349, -15499, -11053, 16618, 8887, 19789, 24470, -2538, -31252, -50274, -45964, -35016, -43842, -37428, -45521, -51174, -46489, -49767, -58519, -69130, -46825, -27122, -8868, -10318, -23741, -4722, -3299, -19148, -18118, -24818, -21182, -13487, 19216, 28136, 494]
4098D94q797J6326Q76J2627j8905j7893j1439q55j6246r240K0054K545M3342J2398
4084B5287k5067j3706j9865O417J1222N010r688j2993K2893J7401j4759K879O708
4071A739k273j028N957o68k1495q884J5366J3969K831n720o453j4539j7712J2853
4057b6057L423M719j1087K704R614k1773R84K967j6731j782k0212L122l62J1645
4043e8826M7279m862L2244K412k5853J1365P598k4682K95J3538k8011Q823J5386
4030c294j2588J1877R305Q895k1312k50K4075m653J5806M27l2388k2815K232J4347
4016a0336j1027R049P466Q650K5886O060k2750J6597m919j6818K0338p602k8063
4003g469p42J6066J6791p000p118o59o993m498M7K0087J0955k3289k740L2309
$$ y = [494, -8303, 8023, 8899, 21526, 2621, -15272, -26711, -27566, -43812, -53052, -32998, -30453, 12889, 25287, 220, -13486, -33351, -26934, -15712, -10702, -20390, -33383, -10490, 6911, -7848, -4969, 1739, -534, -1562, 4395, 3727, -17768, -26652, -11286, 2683, 5514, -206, -6659, -21198, -38910, -26057, -22634, -17915, -29002, -26298, -16684, -38457, -37473, -34506, -51237, -53019, -73231, -70109, -70471, -58826, -11547, -16409, 15835, 18247, -7606, 3759, 11357, -13325, -13030, 508, -27503, -18680, -3294, -15882, -4005, 5300, 14195, -7117, -7367, 16708, 12055, 27861, 28288, -4100, -26915, -24683, -10336, -21363, -12314, -4848, 3802, 29688, 35748, 12998, 29595, 24676, 7858, 28196, 20594, -7469, -8211, 7855, 24646, 17646, 10528, 9869, 2876, -1622, -1575, 18512, 29467, 6178, 3438, 35747]
3989C5747J5872p71l6421n119j5361O425o846l3038q572J0964K5193M8700K2425
3976E9198k4110l1235J1867J282m292q999M668j2879k7175J6194K0485M541j1462
3963a917K4202K569j7038p459o277J2601L42p032k0813R967j1577j1947J2210
3950b2169j4809J3893l795j3413r423j2789L137M1495L3987R878j7880O698K163
3937A6973l920p848J4245N806j2858k6309l7622j2958j1206r499K1642L3880N61
3924b9113j735J9443O746j7064Q571M830p732o360j5174K7819J5852J1672j2478
3911E277k4845l061k578J7110p423J2674l797K7213K3678R930M171o1404j941
3898d996J7864l4846P744R893k4796J6600K9506k4924j8954k3270m925N547K65
$$ y = [35747, 51619, 50848, 14427, 9308, -6053, 372, -6474, -39512, -48084, -37120, -11927, 36773, 59198, 35088, 3853, 15720, 17002, 12710, 3711, 8379, -4500, -31675, -15481, 5004, 9545, -1917, 22285, 24854, 7816, 357, -5920, 6681, 7023, -9, -20822, -10855, -22432, -34379, -22169, -36978, -23085, -26880, -40293, -49716, -62505, -59368, -17873, 16114, 25992, 8112, 14810, 16973, 13053, 5205, 19450, 25256, 12398, -13911, -51533, -64491, -75697, -85196, -63554, -29674, -29113, -30848, -11405, -4659, -21723, -13152, -8322, -16054, -22414, -37588, -9769, 6083, 17755, 5277, -19568, -22629, -25207, -8097, -15520, -2846, -6643, 20570, 44248, 54178, 58349, -3055, -4996, 12868, -21978, -14234, -4341, -29137, -12537, 16969, -7955, -26909, -50179, -55104, -49557, -49292]
3885d9292k468K5356K1414M208j8232j3550J6209M3691n377l2817k0704k072J4100
3872a9534m682m330J4668j4902j3685J1046K6527K6154J425o427o342K273j4469
3859b278j018j2094o587J4937k0045L83j0493J351R009J1081o29q800j1089k843
3845c9115M9414J6845j968k3665o046J4594j3844j2402N286j351J5943m742K350
3832A299o997m879L221K3084L808j6634l2287l8875K3440K1916J9866M6853j1500
3819C2315j5743j430j0381K0118J6352l4584k0633K1510J7119k7946Q510K0491
3807B5698J065m595j5696j3552J309M203R433K3161l960j7744P349j8864m4416
3794d6609j6756J6922K247K4569L3771J106k3275j0518K2032j8945k6754K1277
$$ y = [-49292, -51760, -26404, -4990, -782, -19014, -32564, -16355, 27336, 21959, -10858, -31562, -33634, -19534, -24216, -28546, -13878, -28780, -42465, -31419, -4892, 21262, 22687, 16260, 9918, 12191, -2278, -3296, -15390, -21977, -7040, -27085, -26702, -37195, -35844, -26835, -15754, -16383, -25183, -36272, -39115, 10299, 27144, 25176, 1511, -4535, 10059, -3785, -16187, -10901, -12252, 3691, -1051, 1299, -5698, -10577, -7356, 15728, 19536, 2902, -29385, -68260, -44820, -22904, -3038, 43815, 32315, 16572, 15142, 4761, 24879, 41231, 6647, -13986, 7524, 24643, -3303, 5207, 25698, 26763, 22168, 6472, -7080, -5771, -1568, 7865, 31026, 27066, 9322, 16671, -2193, -46609, -63365, -46443, -44196, -19627, 14144, 15250, -8025, -18543, 3489, -15456, -42210, -20933]
3782b0933J8512J1219N714k4660j9182j7721M130L1161J1235M749J3050k3105
3770e831j0701N889n971P408Q633j216j2636j7746R923J6651k716J186J0162k456
3756E79J0620j0993O246m795j4667p739n372j4092r657N539J1205R29n514J0086
3742b7625J8367n443l4901J7177K0835N829n236P092J8969J7302j0137j3418J6361
3729B5172K7870K228l2149j8327o438k9117j5468J8083J6629Q603J6368J6803
3717C0257J887j9922p402m4990j7114J0427P328O209L2467K5260p642l5460L118
3704a5577J4502K0434j5474q474J6184m565k0161o464n312N720n547J8255L309
3691c170j8188K036L293R306m301j1595k0115k9855q294K085J926J1296K9143
$$ y = [-20933, -2421, 8798, 14512, -10148, -29330, -47051, -42921, -11760, -525, 4224, 17274, -5831, -16532, -10643, -16614, -9206, -573, -1789, -14425, -32171, -22248, -5597, -8313, -7127, 3035, 579, 11199, 206, 6452, 1657, -13010, -20749, -26121, -40213, -49870, -44331, -33126, -32197, -37711, -27625, -9258, -14701, -49602, -32425, -11590, -5761, -10997, -3905, 15064, 32366, 22229, 8811, 25172, 53042, 55270, 23121, 4794, -1644, -30761, -46229, -28146, -11517, -2914, 13454, 30257, 32144, 12222, 4820, -40170, -57284, -46857, -39529, -33320, -853, 24407, 16765, -18695, -15577, -1075, 19359, 3885, -4589, 11595, 7030, -13131, -19595, -24907, -19187, -24734, -6479, -3170, -21358, -19322, -16029, -6723, -11024, -22619, -42734, -72589, -80883, -78798, -76872, -65576, -36433]
3678c6433P895k995J6619J846j1951J9281L6721Q49K794m0341p0M1150j5927N247
3664B4685o048n952j9778J9086j3003l3293j670K4782K5439K8369j243k7908N160
3651A8626J8779l4155j8889Q430n703K0263K9412j2097k1395p358j9070K3881
3639G24j0123M372J8731J447j3134j1423j4659n780j878L160J7347O215k5005
3626c0006j5126q354K4388K1995JL1744J213j9638j8070o563R879L851L150L872
3612B336Q591J4127k090j992Q615j6239j2734j4015J9865K0908j3023j5412K5698
3599B4635k477n013n910j467n086l3612N126J0040J0312j6045K1917K8569K4136
3586E5125N707j4509j7543j0878o581o708k021j282K547j3767j6276L1833K1298
$$ y = [-36433, -28538, -31533, -14914, -13068, -25019, -5738, 30983, 31832, 34626, -5715, -5785, 35365, 19438, 24685, 18637, 12685, -7093, 11993, -1010, -34303, -35973, -11191, 14248, 42617, 41374, 13466, 18626, 37405, 3250, -15639, -7209, -12912, 7351, 36763, 24666, 3271, -4087, -23157, 724, -9399, -5027, 13704, 15151, 2017, -9406, -24065, -29845, -31723, -28563, -11216, -5001, -30006, -45132, -53486, -29098, -7103, -7102, 24642, 25855, 6217, -11853, -18416, -8537, -4686, -1536, 2336, 10927, 25054, 22964, 20972, 29587, 13348, 614, -13401, 6464, 27372, 14349, -1063, 24635, 22158, 17145, 11235, 9768, 4682, -28930, -23804, -13764, -3452, -19497, 2420, 30989, 55125, 60832, 46323, 28780, 17902, 11321, 4613, 2592, 1310, 3857, -9910, -26186, 5647, 26945]
3573B6945j5931l2031j3177k5203J5355K2132J5836J8911Q687k1426l8070r999
3561d7971L326L096j1915L3607o0m86j7977R903k7018P047J5661k173J1804J9540
3547c616m220k0012m42J9707K2126l22k6647k997K8440m327k0395O890J1692k0414
3533a4537L1891J9627j6615j0034o59j89j8334j7783j4193J3351K8837j7191j7657
3520c3486j842Q461r954J5354K2062l651r516L308M002N685o87p520L132j7225
3506b1877j8852K253o529J4224p03K6808J9150j5657r242j4990L2221L050k4657
3493a4801j0850O069J3071Q481L948l5085k5414J0464K6813M1230J2249k5707
3481A0468l7819l983J2239j2362J4199m72q676L2004P721j7362K01j0071r085
$$ y = [26945, 11014, -21017, -34194, -59397, -44042, -21910, -6074, 12837, 21524, 98, -37972, -47971, -44645, -41549, -53464, -19857, -19917, -20403, -38380, -28477, -55495, -48448, -32787, -34960, -23156, -3616, -7836, -27848, -28290, -8583, 13543, 13221, -13426, -16423, 12017, 7690, -12705, -5815, 5877, -14537, 17354, 36981, 20366, 10332, 9673, 9484, -8850, -26633, -40826, -27475, 1362, -15829, -33486, -35328, -26867, -36821, -21467, 595, -3056, -12572, -9264, -5262, 423, -264, -7784, -4652, -21877, -40729, -38476, -45005, -30781, -31484, -4676, 14474, -1183, -10425, -25415, 6806, 9856, -14801, -25651, -19582, -6511, 1970, 5918, -29167, -54581, -44117, -17304, 23926, 36175, 10468, -27351, -31334, -19095, -31457, -17258, -17730, -26406, 5598, 13319, -4043, -3842, -13913, -22998]
3468b2998K2153Q24r439J4807K5395R903p641k2020l102M472P698k5682q581O814
3454g397p086k0726m508K4045J9688K1169M307j6454m4373j2133K5699J2742J8720
3441A3693J2143k1487l1820m484M2686J5367l4041j8258J0014j2378p437r339
3429d5341N937L8289p889j7304M3780L6476p615l1473j866l611J8266l1402j8783
3416b2536J1340J5382J8004p489l8037n929K2710J3806l5653K67J7506j5175j2647
3403c8451j3740J1870K1568q22J7686k1616n880L1878K645j6705k0653k191Q832
3390b5579j7197M498J2962L1493j8350L777q370p649K7542K7596N69K068k94J705
3376C4771r845N94k806l1529j7750l954l982L1875l614p750m312j3779j4918J0710
$$ y = [-22998, -845, -21, -9460, 5347, 30742, 40645, 33004, 10984, 7882, 12354, 20052, -5630, -14211, -7397, -14483, -35209, -39717, -15672, 4016, 25185, 29492, 13038, -31335, -43468, -17769, -5027, 13693, 25836, 4349, -27471, -31955, 10731, 26098, -7943, -26201, -16187, -28565, -36002, -45341, -39404, -1115, -9004, -26308, 17472, 53948, 46333, 14860, 12994, 9383, 27649, -3753, -22536, -11196, 4186, 22190, 14701, -23336, -29265, -6555, 7251, -28402, -28135, -10629, -25804, -38451, -52191, -40321, -18753, -19575, -1889, -23505, -29385, 2493, 5138, -11567, -32220, -34411, -25579, -42776, -38278, -25316, 6177, -12173, -8396, -16766, -24415, 3127, 30723, 31292, 33360, 33066, 34771, 24926, 25520, 22714, -8815, -26565, -30519, -34501, -2626, -6240, -13990, -18302, -32081, -46999, -36289]
3362c6289M257O915J4018N86o731P903J8194J2510j4765r325N235p600k2264P652
3348a9704q020j8180Q676j0746L332R379Q681O536j4107k208Q262K248n507J785
3334b9573j7632K8316K019J829M575j1594j5764j165J2010P088J5709j9J2750
3321H549n034j3503M54K0524K4309N625j8527q543O097M271J6239K9383j0886
3308E8958j3350j871k5853k6244J3129m830Q788j0618j342K1729J695p27j8115
3295A349k449M122k9564k7740J5268J5472M357N707J6836j1020r147R907k5634
3282c2536K4198J9776j4495L723J2220R610p572p172k0345j0295J0014K3542k2403
3269a1735p714R934q569L3192Q329j2870j5079J3821L324j3447l504J949j3347
$$ y = [-36289, -32032, -25117, -11099, -10513, -17244, -9341, 8853, 21363, 6598, -2727, 2508, -5092, -27356, -19704, -27724, -45904, -37228, -47974, -44642, -35263, -26582, -20046, -34153, -36361, -28099, -25851, -31358, -29573, -47205, -18889, -16870, -15041, -10466, -22060, -37824, -38989, -26979, -19891, -4182, -4201, 8549, 3515, -9988, -9534, 10990, 35299, 40924, 22397, 13854, 19951, 24222, 40461, 69844, 58958, 45608, 43737, 17884, -8360, 4769, -61, 8727, -1891, -3233, 18496, 20191, 19464, 1349, -1100, 3022, -26542, -54282, -39014, -23542, -19185, -13478, 3358, -7662, -16809, -6902, -32536, -8338, 11438, -3057, 666, 12886, 22496, 14924, 7752, -12593, -22888, -12874, 10668, -11735, -19449, -9515, -18084, 15108, 23437, 10567, -4512, 9309, 12633, -814, -4318, -2369, -15716]
3256a5716q401P601Q410j693K430j470j9190p610K1711P651l92Q057J3976Q061
3242B3425j3022K556J3099q17l0161n6979N294n008K3165M0530M169J9859Q201
3229C4311j1624o459o536n108J8247k1357j0969N284k1530q06J7380M6019P009
3216D3861j979o816j4379l990q314J868r236o592N472l6971P849R654J5093l755
3202h235j5403j4469j752K8525J0125J5949J0718j290K892r758Q926j2417j5696
3189a885j104k0348J0134J346k4129j7448K4367J887R849K9704N576m724R735
3176B2960K6555l2928l1179o326K5869M9111J6324k8425m1999J3215K7119j4386
3164B5910k0198k9257N71L3947J0836k3049j9568k1116m197K6280r04q749P042
$$ y = [-15716, -24117, -16516, -8106, -9799, -7369, -8839, -28029, -35639, -13928, -6277, -6669, 1388, 15364, 23425, 10403, 12959, 26058, 25241, -4920, -61899, -56605, -61613, -38448, 2082, 6251, 26110, 34311, 22687, 16228, 9692, 4584, 22831, 1474, -9495, -4211, -25741, -26547, -9167, 36852, 43861, 41882, 35066, 20687, 16697, 8383, 10251, 1015, -5577, -105, -37076, -29227, -19573, -4480, -8235, -23638, -38107, -39859, -11334, -1209, 14740, 25458, 24168, 27060, 17302, 26228, 13811, -1885, -2989, -23337, -13203, -11857, -35986, -53434, -29067, -27180, -17331, 12373, 17949, 13225, 22960, 49515, 16587, -14592, -20918, 4951, 54062, 70386, 41961, -38, 13177, 40296, 25910, 5712, -23545, -22974, 10973, 21809, -1240, -20808, -41924, -46121, -19841, -20745, -29494, -22452]
3151b2452k2984j0164K4969K5518q545l7523j3386J1726R042j850K418j2854P868
3138d8217r321l124K4814K2333J3836k1660j2975J3722J2670n538K1234K0314
3126B8088j5608J0580k8395k0646j0843r166j890K5065O937r416J0413K8957j8000
3113c924k1484P390K8882k3866k4502J2543K8159K1498j6051l134n192k3613r387
3100c2681j0732j7637K586J339J1908N151O665J9490J9822N501k0631q190m451
3087b1860l7360l416L9913J8487j53j023j143j1037J2095K4294O136P834M94m0769
3073g508k8719J6636M279j5629O703k2224j5453J9560L4583J1729J5981k0852
3061i14l6584j2643P557K5390N737k0724j2526m617J8312J2278j4876l682k323
$$ y = [-22452, -45436, -55600, -30631, -5113, -13658, -51181, -64567, -52841, -43799, -45649, -43231, -56085, -48217, -57538, -60662, -35848, -13515, 321, -21339, -34314, -20592, -7922, -13460, 7774, 28088, 12480, 23060, -5335, -25981, -36824, -45990, -47880, -22815, -15878, -25294, -14881, 14076, -3924, -25408, -18018, 10864, -13002, -37504, -24961, 3198, 24696, 8645, 5511, 319, -23294, -32681, -43413, -61050, -58464, -57125, -45217, -40066, -33401, -13911, 5911, 11412, -9219, -17409, -21860, -59220, -62636, -22723, -4236, -4389, -5412, -6555, -17592, -5497, 18797, 24933, 32767, 33261, -7508, -36227, -19591, -15312, -30941, -24238, -46462, -61915, -42355, -7772, 3957, 19938, -914, -37498, -50141, -42584, -17194, -11457, -32181, -44707, -49324, -31012, -18734, -33610, -37292, -39615]
3048c9615J1689m454J6524J5543k1909P97l211q441j9919J2665L237l536K6777
3035a3853j2843k0603J7305K2303K7729o910m599j564l7518k4837J9850K0807
3023a4733j506Q244j3017O083M2189j0803l2897j5253L663L6841Q11J3773J7843
3010D1238j3770M118M656j4812K729r97o292l998j9547j1776j070j6552J3645
2997b2428K435M868q017j1757J157K2749K6361M684o704O513j1974o395k1999
$$ y = [-39615, -27926, -32380, -15856, -313, -22222, -21425, -24636, -33077, -52996, -40331, -37094, -40630, -13853, -26696, -47299, -29994, -7691, 20038, 13128, 8529, 6965, -30553, -55390, -35540, -14733, -16239, -7995, -21012, -14929, 27260, 16457, -16440, -31693, -28030, 8811, 9622, 23395, 41238, 27468, 31586, 36242, 21430, 24159, 23162, 16870, 12872, -6675, -18451, -19521, -36073, -22428, -19993, -15125, -23142, -34899, -33742, -10993, 15368, 20052, 13348, 19861, 7887, 1492, -20507]
$$ [...]
##END NTUPLES=NMR SPECTRUM
##END=
