##TITLE=Analysis number 327481
Compound Code btb 15120
Book Reference 148429
Project Code qc-fl flro3
Chemist Name jom
##JCAMPDX= 6.0         $$ Bruker NMR JCAMP-DX V2.0
##DATA TYPE= NMR SPECTRUM
##DATA CLASS= NTUPLES
##ORIGIN= Bruker BioSpin GmbH
##OWNER= nmr
$$ XWIN-NMR		Version 3.5
$$ Tue Mar 27 10:46:32 2007 GMT Daylight Time (UT+1h)  MAYBRIDGE\nmr@NMR_250MHZ
##.OBSERVE FREQUENCY= 250.131544655141
##.OBSERVE NUCLEUS= ^1H
##.ACQUISITION MODE= SIMULTANEOUS (DQD)
##.ACQUISITION SCHEME= undefined
##.AVERAGES= 16
##.DIGITISER RES= 18
##SPECTROMETER/DATA SYSTEM= dpx250
##.PULSE SEQUENCE= zg30
##.SOLVENT NAME= DMSO
##.SHIFT REFERENCE= (INTERNAL, DMSO, 0, 16.522)
##AUDIT TRAIL= $$ (NUMBER, WHEN, WHO, WHERE, WHAT)
$$ ##TITLE= Audit trail, XWIN-NMR		Version 3.5
$$ ##JCAMPDX= 5.01
$$ ##ORIGIN= Bruker BioSpin GmbH
$$ ##OWNER= nmr
$$ C:\u/data/dgb/nmr/ADRS/2110/pdata/1/auditp.txt
$$ ##AUDIT TRAIL=  $$ (NUMBER, WHEN, WHO, WHERE, WHAT)
(   1,<2007-03-27 10:46:02.82 +100>,<MAYBRIDGE\nmr>,<NMR_250MHZ>,
      <created by zg, POWCHK disabled, PULCHK disabled
       configuration hash MD5:
       49 4B E0 1D 92 C2 6B 37 9F E6 65 BC 52 41 86 1D
       data hash MD5: 64K
       FC AC 63 8D 21 CF 34 70 76 CA C2 ED B6 88 68 FC>)
(   2,<2007-03-27 10:46:21.24 +100>,<MAYBRIDGE\nmr>,<NMR_250MHZ>,
      <Start of raw data processing
       ef LB = 0.3 FT_mod = 6 PKNL = 1 SI = 32K 
       data hash MD5: 32K
       79 73 26 3E 30 36 38 A7 15 9E 14 27 AF 2E 38 32>)
(   3,<2007-03-27 10:46:23.19 +100>,<MAYBRIDGE\nmr>,<NMR_250MHZ>,
      <apk 
       data hash MD5: 32K
       3E D7 36 B4 1F 80 78 C9 98 40 80 34 61 62 42 A4>)
(   4,<2007-03-27 10:46:24.29 +100>,<MAYBRIDGE\nmr>,<NMR_250MHZ>,
      <abs ABSG = 5 
       data hash MD5: 32K
       0E CD 60 B9 57 4B 5F 63 0D F5 A9 84 A2 13 E0 D7>)
$$ ##END=
$$ 
$$ hash MD5
$$ 9D E6 EC 7F 4D 95 21 DB B3 81 D0 D0 0B 4C FA 7C
##$RELAX= 
##$RELAX= 
##$RELAX= 
##$RELAX= 
##$RELAX= 
##$RELAX= 
##$RELAX= 
$$ Bruker specific parameters
$$ --------------------------
##$DU= <C:\u>
##$EXPNO= 2110
##$NAME= <ADRS>
##$PROCNO= 1
##$TYPE= <nmr>
##$USER= <dgb>
##$AMP= (0..31)
100 100 100 100 100 100 100 100 100 100 100 100 100 100 100 100 100 100 
100 100 100 100 100 100 100 100 100 100 100 100 100 100 
##$AQSEQ= 0
##$AQ_mod= 3
##$AUNM= <au_zg>
##$AUTOPOS= <13 >
##$BF1= 250.13
##$BF2= 250.13
##$BF3= 250.13
##$BF4= 250.13
##$BF5= 500.13
##$BF6= 500.13
##$BF7= 500.13
##$BF8= 500.13
##$BYTORDA= 1
##$CFDGTYP= 0
##$CFRGTYP= 5
##$CHEMSTR= <none>
##$CNST= (0..31)
1 1 145 1 1 1 1 1 1 1 1 1 1 1 1 1 1 1 1 1 1 1 1 1 1 1 1 1 1 1 1 1 
##$CPDPRG= <>
##$CPDPRG1= <>
##$CPDPRG2= <>
##$CPDPRG3= <>
##$CPDPRG4= <mlev>
##$CPDPRG5= <mlev>
##$CPDPRG6= <mlev>
##$CPDPRG7= <mlev>
##$CPDPRG8= <mlev>
##$CPDPRGB= <>
##$CPDPRGT= <>
##$D= (0..31)
0 1 0 0 0 0 0 0 0 0.06 0 0 0 0 0 0 0.0002 0 0 0 0 0 0 0 0 0 0 0 0 0 0 
0 
##$DATE= 1174988761
##$DBL= (0..7)
120 120 120 120 120 120 120 120 
##$DBP= (0..7)
150 150 150 150 150 150 150 150 
##$DBP07= 0
##$DBPNAM0= <>
##$DBPNAM1= <>
$$ [...]
##$SUBNAM6= <"">
##$SUBNAM7= <"">
##$SUBNAM8= <"">
##$SUBNAM9= <"">
##$SW= 20.6930455092707
##$SWIBOX= (0..15)
0 0 3 0 0 0 0 0 0 0 0 0 0 0 0 0 
##$SW_h= 5175.983436853
##$TD= 65536
##$TD0= 1
##$TE= 683.16
##$TE2= 300
##$TE3= 300
##$TEG= 300
##$TL= (0..7)
0 120 120 120 120 120 120 120 
##$TP= (0..7)
150 150 150 150 150 150 150 150 
##$TP07= 0
##$TPNAME0= <>
##$TPNAME1= <>
##$TPNAME2= <>
##$TPNAME3= <>
##$TPNAME4= <>
##$TPNAME5= <>
##$TPNAME6= <>
##$TPNAME7= <>
##$TPOAL= (0..7)
0.5 0.5 0.5 0.5 0.5 0.5 0.5 0.5 
##$TPOFFS= (0..7)
0 0 0 0 0 0 0 0 
##$TUNHIN= 0
##$TUNHOUT= 0
##$TUNXOUT= 0
##$USERA1= <user>
##$USERA2= <user>
##$USERA3= <user>
##$USERA4= <user>
##$USERA5= <user>
##$V9= 5
##$VALIST= <valist>
##$VCLIST= <CCCCCCCCCCCCCCC>
##$VD= 0
##$VDLIST= <DDDDDDDDDDDDDDD>
##$VPLIST= <PPPPPPPPPPPPPPP>
##$VTLIST= <TTTTTTTTTTTTTTT>
##$WBST= 1024
##$WBSW= 4
##$XGAIN= (0..3)
0 0 0 0 
##$XL= 0
##$YL= 0
##$YMAX_a= 417825
##$YMIN_a= -421617
##$ZGOPTNS= <>
##$ZL1= 120
##$ZL2= 120
##$ZL3= 120
##$ZL4= 120
##$ABSF1= 16.522
##$ABSF2= -4.171173
##$ABSG= 5
##$ABSL= 3
##$ALPHA= 0
##$AQORDER= 0
##$ASSFAC= 0
##$ASSFACI= 0
##$ASSFACX= 0
##$ASSWID= 0
##$AUNMP= <proc_1d>
##$AZFE= 0.1
##$AZFW= 0.1
##$BCFW= 0
##$BC_mod= 0
##$BYTORDP= 0
##$COROFFS= 0
##$CY= 12.5
##$DATMOD= 1
##$DC= 0
##$DFILT= <>
##$DTYPP= 0
##$F1P= 14.0000005364418
##$F2P= -0.99999901652339
##$FCOR= 0.5
##$FTSIZE= 32768
##$FT_mod= 6
##$GAMMA= 0
##$GB= 0
##$INTBC= 1
##$INTSCL= 1
##$ISEN= 128
##$LB= 0.3
##$LEV0= 0
##$LPBIN= 0
##$MAXI= 10000
##$MC2= 0
##$MEAN= 0
##$ME_mod= 0
##$MI= 0
##$NCOEF= 0
##$NC_proc= -4
##$NLEV= 6
##$NOISF1= 0
##$NOISF2= 0
##$NSP= 0
##$NTH_PI= 0
##$NZP= 0
##$OFFSET= 16.522
##$PC= 1
##$PHC0= 219.909
##$PHC1= 5.690379
##$PH_mod= 1
##$PKNL= yes
##$PPARMOD= 0
##$PSCAL= 4
##$PSIGN= 0
##$REVERSE= no
##$SF= 250.13
##$SI= 32768
##$SIGF1= 0
##$SIGF2= 0
##$SINO= 400
##$SIOLD= 32768
##$SREGLST= <1H.DMSO>
##$SSB= 0
##$STSI= 32768
##$STSR= 0
##$SW_p= 5175.98343685301
##$SYMM= 0
##$S_DEV= 0
##$TDeff= 65536
##$TDoff= 0
##$TI= <Analysis number 999999
Compound Code 99
Book Reference 9
Project Code 9>
##$TILT= no
##$TM1= 0
##$TM2= 0
##$TOPLEV= 0
##$USERP1= <user>
##$USERP2= <user>
##$USERP3= <user>
##$USERP4= <user>
##$USERP5= <user>
##$WDW= 1
##$XDIM= 32768
##$YMAX_p= 434281196
##$YMIN_p= -409155
$$ End of Bruker specific parameters
$$ ---------------------------------
##NTUPLES= NMR SPECTRUM
##VAR_NAME=  FREQUENCY,     SPECTRUM/REAL,   SPECTRUM/IMAG
##SYMBOL=    X,             R,               I
##VAR_TYPE=  INDEPENDENT,   DEPENDENT,       DEPENDENT
##VAR_FORM=  AFFN,          ASDF,            ASDF
##VAR_DIM=   32768,         32768,           32768
##UNITS=     HZ,            ARBITRARY UNITS, ARBITRARY UNITS
##FACTOR=    0.157963299565203, 1,           1
##FIRST=     4132.6476996994, 0,             0
##LAST=      -1043.33573715361, 0,           0
##MIN=       -1043.33573715361, -409155,     0
##MAX=       4132.6476996994, 434281196,     0
$$ Real data points
##PAGE= N=1
##DATA TABLE= (X++(R..R)), XYDATA
$$ [...]
18895 581068 585142 579753 566528 564537 570403 575564 599542 606563 627997 601018 560191 555532 475637
18882 475637 444903 420652 413630 400764 389010 383688 353017 358756 382513 375255 366061 356470 366288
18869 366288 345377 338115 361590 357145 329368 314180 295702 311769 309804 321443 355568 405318
18857 405318 429356 440137 479449 499366 478880 460969 458763 467615 468830 447649 393725 371036
18845 371036 375259 347792 314722 306652 329242 322421 319083 332350 363293 387968 391632 389678 340795
18832 340795 303073 289061 276087 266529 269128 254718 229016 221677 222442 210726 184605 160889
18820 160889 135091 185244 203783 221112 238762 232414 227793 217222 232627 266283 267397 229695
18808 229695 209393 203669 208218 189805 172309 173152 165683 169768 175790 168046 181206 154919 141165
18795 141165 149895 144747 136365 134010 146527 124840 120039 116859 132647 133979 117420 114507 131620
18782 131620 129500 113494 101546 65393 58318 61827 51980 61177 88917 90842 103483 121145 142526
18769 142526 137734 125743 132616 124280 133426 141159 102225 99754 119763 138707 163869 153514 143780
18756 143780 142817 122754 92339 68722 76594 85456 59609 76823 95399 101433 105983 108827 114242
18743 114242 106815 82714 69034 85976 104640 121313 162274 162265 152135 148038 167474 176015 163124
18730 163124 162018 152652 134165 128684 154352 170971 169573 171457 163584 159938 176842 183505 185843
18717 185843 192321 200591 169221 171611 176041 166623 170597 175278 163540 153988 173807 182057 173686
18704 173686 169129 151623 171958 200989 197319 193698 172637 170035 169276 169954 146055 161390 195318
18691 195318 200454 191765 178654 155459 156397 151986 156442 167845 182734 163899 139276 176650 210951
18678 210951 211033 185306 159047 176540 209640 224573 240056 255006 269725 273906 262484 263664
18666 263664 260570 251179 226022 242526 252218 243826 276619 279491 302826 303506 289309 287055 310891
18653 310891 306535 302444 302237 305433 314102 290905 259229 238515 212767 226749 231736 216875 221551
18640 221551 231305 211710 215864 246936 238168 253047 264945 277968 310744 301267 276369 263884
18628 263884 274792 267971 280989 315999 310883 318575 325357 317465 320817 302166 269994 263833 249342
18615 249342 274227 321749 314989 283438 305024 287658 257256 257380 261873 264670 267866 286713 309113
18602 309113 315588 324436 310982 300584 291613 287464 295905 298399 296460 315196 320637 314460 319149
18589 319149 314905 305462 314938 302853 316220 325823 356373 365985 363905 338755 344929 352192 334190
18576 334190 322939 336577 333645 343413 371695 380608 362734 384370 371498 362829 331868 299524
18564 299524 328815 356616 382814 410671 439563 471545 515867 540202 521253 491101 495223 512435
18552 512435 519952 512299 544096 584415 619518 627822 660533 666008 661887 663172 680974 686275 703251
18539 703251 754283 792677 789864 765232 767062 760326 775908 819137 843413 835295 833552 863517
18527 863517 912005 921118 934447 969260 964459 984889 1031429 1059614 1100481 1146661 1147264 1124277
18515 1124277 1128138 1154354 1202101 1230740 1262024 1276238 1314180 1359780 1445234 1564331 1674245
18504 1674245 1797084 1898151 1979472 2057096 2103741 2157979 2219248 2285986 2359727 2506968 2698502
18493 2698502 2979034 3332930 3683595 4038242 4286853 4430030 4611637 4977188 5595272
18484 5595272 6549561 7894658 9582639 11310863 12824795 14083344 14688062 14322817 13179333
18475 13179333 11813182 10767028 10290468 10526004 11474625 13184669 15710406 18568817
18467 18568817 20946641 22118605 21872785 20588536 18998525 17872090 17673081 18628484
18459 18628484 20730468 23738837 27078817 30099127 32262405 33606794 35017075 37220343
18451 37220343 40386717 44328898 48154845 50851111 51680400 50973022 50054926 49950060 50284404
18442 50284404 49565184 46997502 43661397 40972849 39310022 38585279 39063367 40942248
18434 40942248 43700639 46184293 47967512 50073323 54151471 61081378 70526852 81334278
18426 81334278 91621137 98607232 99773905 95306502 88556063 82761724 79533508 80040068
18418 80040068 85639400 97702754 116639445 140867600 166399363 187423148 197320271
18411 197320271 192948771 177980221 158843157 140479048 124775312 111838880 102232048
18404 102232048 97296282 97577686 102001826 108394684 114240720 116166647 112500398 106731288
18396 106731288 104534133 109752988 123400127 143306620 163409771 175908957 177332799
18389 177332799 172050698 166895755 163509115 158077031 148078807 134913459 120886656 108234841
18381 108234841 99352626 95650514 95910454 96075971 92081797 83931994 74818061 67376291
18373 67376291 62301293 59399023 58317560 58230433 58117071 58036917 59400682 63513132 70085741
18364 70085741 77167584 83083769 87221043 89114508 88327352 86630857 87003674 89582370
18356 89582370 90177086 84975996 75192190 63785205 52956895 44184666 38017143 34126948
18348 34126948 31920520 31132409 32046133 35327765 41796912 52132302 64873162 74052669
18340 74052669 72305100 60781466 46921331 36099213 29425125 26104245 25081674 25349132
18332 25349132 25586952 24541824 22124968 19337481 17154531 15852095 15187558 14852116
18324 14852116 14741833 14780758 14606517 13578264 11789458 9862198 8255681 7106278 6273423
18315 6273423 5650505 5138445 4724687 4384158 4097216 3875741 3720550 3574124 3461131
18306 3461131 3355918 3294456 3286937 3349258 3484570 3663085 3750531 3654464 3431630 3267748
18296 3267748 3185557 3181862 3177810 3042153 2814783 2581769 2394203 2288482 2255854 2307706 2398588
18285 2398588 2481930 2488519 2416979 2269620 2060481 1916660 1810065 1759139 1799211 1870919 1930920
18274 1930920 1886009 1709430 1484805 1312904 1206264 1136395 1086721 1017623 939311 892754
18264 892754 855051 832353 838880 838421 818993 806607 783188 756850 752851 733391 698001 677798
18252 677798 665209 648715 660273 676537 678316 639793 604040 579947 562172 564965 532575 525328
18240 525328 570302 607138 596918 557165 554991 576871 578144 576008 540556 477705 444636 457428
18228 457428 483186 482269 462968 471813 469617 464774 459905 441924 415662 386464 347676 328589 339164
18215 339164 348701 338467 337233 333630 323297 340692 322380 346379 353381 372892 391557 395736
18203 395736 366336 342877 329298 329996 333277 313844 281247 281332 269721 256366 246875 285576 308808
18190 308808 345004 365427 353803 342816 299729 268316 266379 278690 275515 258713 268331 290028
18178 290028 266370 249022 251293 243185 245971 265695 241087 223049 235969 259392 243386 220332
18166 220332 240583 258492 258145 251349 236664 246561 243236 255323 250480 260072 222007 184854 182839
18153 182839 201947 189245 198983 204079 212995 219600 236922 222800 213025 207577 205901 231246 201206
18140 201206 176054 154364 142027 145766 144513 157027 163206 166546 152875 137572 172281 195029
18128 195029 179097 185189 139986 117648 125490 129954 162942 161944 142051 118310 120770 120947 124771
18115 124771 130928 123939 150211 169005 157347 156209 145230 132576 133827 132143 120079 113638 128368
18102 128368 114763 118504 96192 96062 78044 57746 66120 63930 71865 60665 54046 45591 44207
18089 44207 45156 43097 49033 23667 19074 42153 67390 52341 49777 48893 15260 3042 7404
18076 7404 5977 33868 72780 82809 81925 80949 86301 93816 99980 87009 87932 101122 65712 55196
18062 55196 66040 79019 101320 111660 98895 83432 75003 69131 60490 47983 40441 3309
18050 3309 -588 422 10582 34395 44083 68373 74732 67267 59914 57109 29552 24939 19786 6642
18036 6642 47306 81533 76613 60833 71814 88050 73369 67812 52080 34560 48741 57250
18024 57250 45576 37377 20691 27537 57838 74022 75889 88848 73441 76146 73756 74813 82968
18011 82968 42626 19299 30461 40565 47809 51075 40195 54360 53855 67535 68344 66595 72402
17998 72402 71793 85529 61731 41768 28332 15876 41794 73742 55746 47101 77264 85191
17986 85191 77656 97325 105697 94640 83277 100330 95168 83043 84035 93514 91538 108643 119786
17973 119786 127313 93265 110191 150942 158530 137272 119591 167528 198875 231683 253519 290822
17961 290822 290724 269178 280552 314398 348330 364997 396357 414848 409814 385442 351072 331111
17949 331111 329888 361366 379508 387510 414014 419689 407580 398265 396330 404370 389894 398594 373698
17936 373698 325904 300839 328648 322616 302505 281820 288739 297810 324072 344187 382997 400057
17924 400057 407992 393227 380292 409633 449154 447081 444305 425978 425197 423589 423606 404599 409218
17911 409218 404823 378877 364595 376908 430345 452292 471220 492987 535384 577052 587427 583974
17899 583974 570204 584263 560296 506114 477641 485305 491262 468909 470397 472656 452627 433494
17887 433494 406186 396184 394787 387511 377859 351350 359935 405417 453497 461810 478028 479895 455234
17874 455234 456809 435326 437345 472762 474032 438924 412152 414910 378184 351539 338039 306055
17862 306055 275258 288098 301292 291265 305505 339684 322582 310400 311327 319506 326989 315364
17850 315364 307523 310945 329633 333248 342390 335483 346428 332567 336239 351042 391221 407618 409398
17837 409398 417982 376500 314096 291370 235747 203563 201286 170616 152662 174774 167766 183994
17825 183994 194576 191035 201562 211749 231707 254502 268799 268940 276748 288852 252508 200650
17813 200650 182132 172160 153280 142396 149178 146487 136700 124471 107898 97057 99558 84457
17801 84457 101653 116995 132059 120132 56551 49590 88227 103906 76602 57611 69406 48938
17789 48938 37622 12428 -1563 7499 7924 31259 39492 47725 53849 58389 51620 48257 35509
17776 35509 49981 59334 29658 17643 26860 8961 -17630 -20232 -30034 -25547 -13648 -8229 -9320
17763 -9320 -15158 -8183 -4392 2027 8578 -10100 9253 21891 29318 25315 40407 20189 16264
17750 16264 29993 45954 42382 18724 19074 23040 31595 32923 -4454 -31400 -35254 14836 33070
17737 33070 12609 -6189 -11533 -19153 -13487 -12178 -5403 2744 -10328 -12632 -8487 -4298 -22945
17724 -22945 -49737 -45855 -13059 -9301 -364 -4700 -153 27422 33022 19727 1043 -6614 -16216
17711 -16216 -24624 -32090 -22375 2448 21915 22443 8594 -9492 -39738 -32781 -10325 -21855 -14489
17698 -14489 -17937 -19581 -20324 -12762 -17539 -34115 -31045 -41957 -28346 25431 46312 28180 28977
17685 28977 38217 62100 26542 2881 -19020 10335 52155 69696 55873 25673 288 -4839
17673 -4839 12100 7895 21233 13204 -6499 17429 8151 1630 9164 -16875 -18433 -15221 -29244
17660 -29244 -21543 12324 24709 20428 18157 153 3439 -7349 2987 35886 28003 11462 -10302
17647 -10302 -6481 21246 34660 39772 48451 39126 36546 37854 10550 2043 18567 15488 9938
17634 9938 29792 35920 29452 30845 29222 235 -17083 7596 44291 71047 47892 30842 27881
17621 27881 47232 9080 -19106 -18017 -12621 -34136 10023 17669 11092 -4741 -3385 8452 -16040
17608 -16040 -28994 -24257 -2283 12149 -8071 -2942 -5368 -30168 -12094 -16706 -10046 -2759 -14401
17595 -14401 -5993 4581 3349 3751 28688 35306 -3694 4254 2323 -13198 -32921 -8733 -2079
17582 -2079 -23187 -19479 -12123 -12827 -21391 -15106 1431 23385 12936 -2586 -20238 -32858 -37583
17569 -37583 -33967 -28408 -22561 -27071 -15127 13967 -6151 -24947 498 5576 4078 -10609 -10550
17556 -10550 10365 -1906 -6535 36191 50585 65168 51659 21232 -2996 15755 3332 4964
17544 4964 6993 -3660 -20757 -10909 4391 -14212 -12800 -5298 -14976 -9364 31879 33057 19065
17531 19065 4629 4911 -2482 -13449 -13322 -47394 -65115 -64012 -72292 -78908 -79453 -73587 -70609 -36593
17517 -36593 -21427 -11397 -41868 -70453 -69972 -50937 -47777 -38994 -25519 -35562 -26580 -17654 -15042
17504 -15042 -20670 -19119 -10789 9169 -4746 -31341 -31032 9517 19874 29968 10635 690 -3084
17491 -3084 4650 3304 4411 -93 8757 6505 -796 -10900 -35915 -16633 -13418 -32168 -29768 -14488
17477 -14488 9278 10347 14224 18658 13375 1093 -16161 -15281 26382 34268 20899 -3403 -18805
17464 -18805 -18170 -10157 -7212 -11075 2204 -17618 -56662 -46152 -8747 -11594 -20940 -9494 -3176
17451 -3176 -11856 -11774 6549 3856 24117 40350 25705 -3953 -13746 3408 11396 14559 18241 7115
17437 7115 -1229 -15470 -19477 -20474 -35165 -31173 -10985 15995 28462 22655 -9106 -30 -4506
17424 -4506 -20748 -51070 -65801 -29765 -14190 -46287 -52449 4129 5887 3964 606 -17425 -19897
17411 -19897 -35623 -11767 10394 14466 18414 -6443 -35365 -28723 -11647 -4650 9074 -14025
17399 -14025 -12216 215 -2913 -11145 -11305 429 -2978 -10011 -18074 -16731 -24783 -37929 -13228 13666
17385 13666 8073 -8502 457 -7325 -31800 -24352 -9843 12570 45426 52189 43652 40037 45975
17372 45975 812 -32112 -37641 -36548 -45105 -38726 -36355 -17193 17139 17171 -7895 -23856 -41528
17359 -41528 -21601 10513 30194 9890 13338 12468 7992 2683 18490 17212 10026 30854 8799
17346 8799 18582 35422 34379 39838 29216 6397 -29819 -43033 -49431 -51504 -51916 -40632 -37610
17333 -37610 -27051 -34399 -44218 -51578 -53603 -62095 -52634 -31217 -17508 286 29581 22143 7223
17320 7223 12138 -11647 -36922 -32336 -33863 -14961 -21744 -29814 -39270 -26723 -36508 -37266 -42642 -17445
17306 -17445 -14697 -35155 -50791 -45676 -32599 -29976 -8580 19357 14033 -850 -42697 -39126 -10235
17293 -10235 8156 37093 41798 17848 -7962 -10836 -11356 8323 -2804 -9196 -4200 18995 12284
17280 12284 7345 8399 -11137 -11737 -7668 -3681 7974 1629 -14243 -28673 -15719 2464 5280
17267 5280 -17289 -25667 -15962 -843 6577 9434 -17717 -49318 -51381 -33035 -37756 -27782 -16814
17254 -16814 1464 -9208 -33972 -60061 -70836 -51826 -28429 -895 8221 9955 -37287 -77515
17242 -77515 -79579 -61555 -28164 -19284 -31390 -32315 -36378 -49088 -37262 1646 -13668 16742 24307
17229 24307 -14021 6939 17264 -23052 -35474 -25945 -17604 -6725 8268 -8899 -4705 15956
17217 15956 14478 33810 53856 31483 17891 -7074 19704 40907 46043 16009 5985 11369
17205 11369 15052 17371 5093 -13993 -24370 -30424 -48872 -24280 -5898 -12592 -33050 -45752
17193 -45752 -59458 -68124 -30013 -8065 -23252 -42233 -19066 -6937 -16189 -8173 -5058 -7447 -32677
17180 -32677 -42098 -48446 -40203 -37291 -34424 -45324 -44369 -38337 -38135 -22782 -47482 -66514 -47296 -17635
17166 -17635 -22034 -46596 -31780 -26690 -30035 -17055 -28476 -14119 1474 -7210 13449 17521 20186
17153 20186 7544 8552 22529 47532 50545 56682 30317 -1255 -2107 -9080 -26682 -18352 -22144
17140 -22144 -21581 -36499 -18666 -2549 -10634 -16440 -24800 -7314 5795 -27259 -50971 -64720 -40585
17127 -40585 -9066 1728 5797 27832 18020 -3675 -1064 33605 21963 12140 7149 1805 9650
17114 9650 4392 18332 42045 31502 986 -24174 -37286 -31900 -37481 -24674 -27924 -4106 5618
17101 5618 3529 -31660 -39050 -21161 -860 -17330 -43319 -51864 -30149 -54221 -55025 -41520 -31978
17088 -31978 -42963 -40449 -30302 -27537 -3881 7084 5300 23040 47229 36546 14373 -8453
17076 -8453 -25816 3544 22702 4913 -5984 -9043 -398 -7262 -35156 -38099 -17372 -415 17928
17063 17928 9391 880 8379 25985 27701 38694 34052 28978 45381 40366 14572 15664 15913 12075
17049 12075 14690 1583 -11202 -1550 -22857 -38558 -62389 -51922 -41852 -47725 -45485 -34225
17037 -34225 -44328 -42575 -40478 -30536 -6758 -2429 -28668 -32967 -30606 -15614 -9739 -42187 -49047
17024 -49047 -7078 20882 -4167 -33427 -52600 -53874 -31315 -8764 -10590 14471 22209 -17323
17012 -17323 -27804 -40576 -43235 -31060 -64581 -48466 -7357 1420 6146 -2868 940 -17807 -21536
16999 -21536 -17707 -12902 -5219 4179 -18122 -23990 -37592 -50084 -50665 -44068 -38657 -28736 -14172 9306
16985 9306 6529 4388 -17827 -23606 -13475 -8296 11124 14850 11958 9010 -2370 -28836 -25065
16972 -25065 -5037 9684 17336 22819 29054 -21287 -51244 -38057 753 -12004 -19548 -32294
16960 -32294 -36570 -35084 -6306 22461 31505 11324 -10907 -13 -2778 -13701 -27680 -27602 10603
16947 10603 9873 20730 41531 37497 29057 40894 45981 32301 11473 14928 -7750 -18116 -18752
16934 -18752 -12933 -28632 -12228 11152 -5672 3195 -8525 -40914 -50061 -41097 -43985 -49627 -57372
16921 -57372 -37095 -27572 -29807 -24048 -33055 -9858 31312 29940 11807 -9226 -21585 -26871 -19235
16908 -19235 8420 14307 35019 34066 10091 1414 1398 -9643 -2342 -9781 8369 -6027 -2471 21480
16894 21480 23400 -3190 -29141 -58731 -69591 -34390 10262 27224 20817 33040 17764 -12368
16882 -12368 -6770 -18212 -22108 -17346 -13217 -22526 -19940 -19153 11153 16573 -4293 -28784 -35397 -30651
16868 -30651 1237 -12919 -43843 -44936 -28609 -32047 -6670 6285 3780 -15767 -47769 -61702
16856 -61702 -26777 -880 -17309 -24794 -23882 -19988 971 11597 21244 23661 53526 54112 39341
16843 39341 37808 34602 23331 -7310 -1768 2367 -11609 -4872 -14433 -16351 7672 -8973 -36454
16830 -36454 -39525 -30262 -7310 9800 22818 19232 -14194 -27882 -11433 -5031 5020 7183 23634
16817 23634 18204 13734 18691 11012 -2323 15302 -1003 -11126 -568 18709 10149 25410 -12662
16804 -12662 -12508 -1277 -45609 -76720 -62020 -59977 -62228 -74653 -90523 -71866 -56012 -62411 -36775
16791 -36775 -33139 -27675 -22414 -33703 -25091 -26006 -10073 -22846 -14 -6529 -11756 -8669 -669 -3627
16777 -3627 -9766 -11433 -2815 -9415 -13790 -3962 -12139 -22264 -2943 -9549 -2423 13785 11199 -31596
16763 -31596 -51188 -19425 3673 9316 11710 2158 -38713 -64432 -51775 -26864 -51798 -42196
16751 -42196 -18824 -22153 -1894 16026 14323 17010 25290 21419 27285 60020 36949 21707 33197
16738 33197 38444 27019 -5138 -35280 -24732 -18986 13849 32588 -5034 1147 -2364 9338
16726 9338 16197 2660 -6098 -1510 -8028 -6618 -7127 11717 27640 -13153 -32225 -17676 -10507
16713 -10507 -11852 -27565 -6523 4450 -8382 -10813 -19166 875 -2224 -27855 -3433 15703
16701 15703 -9139 -23415 -21489 -7937 -12598 -31229 -12353 -24868 -50788 -17988 634 -26209
16689 -26209 -42364 -34574 -4540 -4949 -42043 -52737 -20285 -4908 -6341 -12697 -20263 17518 13980
16676 13980 3537 9587 -26274 -31838 -32297 -22973 -7144 -6274 549 11831 12134 -14528 -21353 -9516
16662 -9516 17217 -3752 -10098 10823 19468 -8155 -16607 -2719 11407 4111 757 -261 -15642
16649 -15642 -28681 -29983 -21994 6080 6081 10470 11863 21793 7459 5698 2060 -11440 -12953 -5113
16635 -5113 -17177 -14300 -3474 -1490 4128 -20383 -18860 -35637 -11821 8778 4904 10067 -21418
16622 -21418 -35328 -51173 -58969 -43911 -26949 -21054 -9701 8393 14954 -11181 -12105 1475 -6577
16609 -6577 3387 6596 -8197 -10314 -9232 5890 24257 28691 21977 13360 7120 24905 46251
16596 46251 41490 24168 -5476 -19830 -12001 -8622 -17447 -20100 -615 1588 -371 -5739 -17711
16583 -17711 -20050 -13444 -3435 7384 14722 4416 -4247 17767 36764 49060 20940 12743 -752
16570 -752 -6421 28568 14634 28519 37473 36549 30517 27705 30436 22441 31810 19387 10108 29091
16556 29091 26342 36571 49119 55934 31056 4692 -30290 -44981 -51270 -28964 -15011 2623
16544 2623 17675 -4182 -20091 -30470 -28028 -54097 -72374 -46314 -13593 2528 -7188 -12676
16532 -12676 -7076 -13883 -19202 -18382 -29157 -26174 -15431 2612 10430 -4122 -35797 -45956 -39326
16519 -39326 -50582 -73952 -78342 -66464 -43550 -18272 -19154 -22161 -23055 -50627 -38902 -17403 -15834
16506 -15834 -37386 -53256 -36664 -19300 -32708 -36821 -23671 -39813 -49290 -46175 -39877 -37480 -21567
16493 -21567 -9378 -5840 -14832 -20895 -26645 -11638 4532 17207 10263 -4773 -14446 -39690 -48537
16480 -48537 -25786 -19625 -40917 -30997 -32798 -27225 -17331 -9703 -18955 -2735 12348 116 11226
16467 11226 2512 -16586 -21826 -43457 -39001 -50781 -41365 -33150 -16869 6972 17770 12313 -18030
16454 -18030 -6643 -3349 -20294 -22124 -37129 -44384 -42386 -27792 -27465 -24465 -34681 -35131 -18869
16441 -18869 -9165 -21175 -45179 -21303 -11506 -15635 -5294 -1762 -28994 -37178 -1531 34630 24367
16428 24367 -1357 -5872 -10705 -24357 -23542 -47269 -36402 -47425 -42935 -22825 875 -449 1237
16415 1237 14970 15289 -3153 -12854 -23913 -12712 -11112 -27590 -12750 -12140 -13036 -1448 -29057
16402 -29057 -26560 -19569 -25854 -20667 -33747 -34795 -30213 -23919 -16145 -25166 -28315 -28048 -31401 -25090
16388 -25090 -51749 -52703 -47247 -49815 -24528 3004 28772 10170 -4609 -14815 -26017 -36688
16376 -36688 -17636 22512 8543 3928 18560 22779 -1017 -18125 -15598 28336 36438 6731
16364 6731 3762 -1129 -7387 2939 4374 -33242 -7659 370 -20481 -36331 -44974 -38573 -21203
16351 -21203 -19103 -15215 -23529 -38547 -46852 -33597 -18840 -42234 -41180 -4796 2444 2766 6145
16338 6145 -3784 -8613 -27034 -29638 -24539 -23079 -58461 -84933 -57505 -32351 -33915 -34437 -50854
16325 -50854 -61949 -45878 -5946 5165 4668 14629 12969 -11524 -44200 -46560 -48229 -54119 -40647
16312 -40647 -26613 -20721 -16472 -13057 -24993 -22301 -33829 -36309 -18843 -28717 -49567 -51495 -20169
16299 -20169 -16017 -27001 -35877 -22828 3767 18502 9829 -18363 -39000 -32008 -34500 -13819 -21514
16286 -21514 -11991 8962 -11637 -26975 -18950 -38184 -31880 -35726 -27958 -23845 -31674 -51802 -64329
16273 -64329 -87080 -72849 -28809 -23573 -30560 -22269 -14746 3586 13730 699 4238 28786 23052
16260 23052 18192 16084 17725 18572 33157 2047 -30866 -11682 -22448 -17914 -2772 -1419 15849
16247 15849 32732 36427 9763 7311 15925 20386 18684 3718 -1756 -4596 4204 224 6943 3504
16233 3504 4274 12510 -1814 -17227 -9976 3262 12074 22738 11540 14244 -6456 -31755 -27984
16220 -27984 -24156 -36452 -65366 -52650 -37376 -1537 29662 27991 4419 -15426 -28563 -21290
16208 -21290 8318 19893 34754 33596 30592 20314 -20678 -16583 -23596 -49958 -41133 -36866 -9311
16195 -9311 -12482 -29949 -28749 -27742 -31185 -15142 -13399 -15337 -20989 -28578 -16799 -23158 -45695 -47382
16181 -47382 -36814 -47761 -42474 -30315 -33026 -9303 7647 -799 -6413 -9171 -6437 -14900 -33668
16168 -33668 -40130 -20671 -10480 -3057 6461 -2334 383 -10637 -32187 -46857 -45062 -40408 -32024
16155 -32024 -14327 -5473 -3467 -14770 -24592 -50578 -67846 -75676 -94180 -64181 -24350 -24098 -10395
16142 -10395 -6638 -29580 -7915 -160 -766 21391 13581 -3841 3120 2644 945 -11216 -24091
16129 -24091 -17228 -8906 -2964 -2830 -11747 19897 34907 64931 80206 60937 28439 34732 25773
16116 25773 -7846 -20160 -13909 -27253 -47133 -47061 -47199 -54763 -69167 -57184 -14321 81 -6009
16103 -6009 -43335 -30829 -24305 -45452 -45879 -39257 -44301 -36883 -10285 -21170 -14734 29331 35602
16090 35602 28904 7498 -8630 -4470 -6080 27553 56458 42237 33276 24280 17537 21119 11488
16077 11488 3832 -10320 6042 43161 26839 5809 -1444 -15151 -14862 -23615 -9101 -32633 -41492
16064 -41492 -40569 -44410 -35423 -22121 -40115 -60053 -43518 -38472 -49588 -38266 -27711 -13701 12162
16051 12162 -4544 8190 14742 -2390 -16303 -27131 -27286 -16587 -10665 6907 13668 20949 16396
16038 16396 2953 3602 10309 1982 -7356 -17077 -37811 -36505 -14777 3636 -122 18960 31381
16025 31381 4603 5388 20623 -9794 -28058 -49581 -37184 -4464 -4712 11457 26397 22245 7578
16012 7578 35767 53022 24613 -12751 -18886 -4674 17204 23439 26931 -6581 -40608 -38382 -34433
15999 -34433 -26267 -34003 -55791 -47591 -46286 -30193 -5423 26626 1163 6549 16508 13880 -15652
15986 -15652 -2232 4824 -19301 -17218 10393 36766 31623 46711 52038 66654 44947 40569 -13421
15973 -13421 -38689 -49774 -58751 -76347 -61371 -16699 11161 -1143 12884 21495 -5547 -10563
15961 -10563 1377 -6465 -36133 -43618 -24160 -1559 10863 9818 20061 10143 -8453 -4729 2605
15948 2605 -21129 -27895 1785 -4894 1629 15894 -11642 609 31075 45572 26840 12622
15936 12622 5853 -9499 -16240 -9036 -14165 -28917 -35774 -32995 -36693 760 3058 -5986 -10865 -9460
15922 -9460 986 21436 17452 -10431 -9419 -13444 6206 18306 19301 11876 -40719 -41302 -13903
15909 -13903 -12103 1497 795 8924 28358 31989 24393 17450 21720 17732 22293 20632 18760 23212
15895 23212 19500 15512 -14913 -43349 -44739 -46108 -27609 -12706 -8726 -21022 -19852 -13087 8460
15882 8460 24259 -2379 -18257 -25492 -50266 -30315 -3724 -2040 -6979 -42681 -43389 -19057 -7673
15869 -7673 -23417 -26122 -40353 -59001 -41169 -26484 -11042 -971 11566 -16949 -23054 -25654
15857 -25654 -17927 -17562 -31672 -21096 -8400 4832 8001 1858 16032 39587 55746 51235 28470
15844 28470 27877 32253 31770 16131 -10109 -34417 -27306 -27190 -20977 -5575 -1584 23274 19675 12387
15830 12387 17413 2430 6739 -1757 11564 31989 -326 -5113 -6761 302 -16964 -39724 -60656
15817 -60656 -72100 -53774 -53046 -36392 -19278 -21792 -44865 -41829 -45811 -56459 -49393 -61640 -50911
15804 -50911 -36238 -23657 -15288 -38479 -40773 -43961 -37295 -24069 -10093 -11758 4759 15345 13360
15791 13360 -10017 -44607 -59223 -43690 -47946 -40780 -52351 -47925 -16228 -21509 -32508 -18919
15779 -18919 -8818 5866 -8851 -17443 -9466 -2507 -9600 -10861 -31490 -25629 -10311 -6326 -10976
15766 -10976 -37319 -33921 -27509 -22984 -8282 -10814 -3169 -6430 -5197 7694 -5045 -14523 -21870
15753 -21870 -10157 3934 -2294 -12750 -24839 -2861 11629 -347 -15770 2183 22043 1926
15741 1926 -15075 -7400 -12031 -30564 -9898 -1835 -11072 -37790 -37910 -39741 -20656 -10978 -27076
15728 -27076 -34883 -30811 -45456 -54428 -41691 -32917 -29644 -28146 -10165 2049 14729 6595 -7086
15715 -7086 -13155 -15342 -22771 -17047 -8944 -1514 -3480 -2659 4864 17880 8302 2959 -6440 -11991 -5913
15700 -5913 8914 15694 12505 23075 5604 9441 3490 7038 3018 -19942 -36392 -46873 -46021
15687 -46021 -37832 5347 38823 55753 39371 33623 43185 63530 63594 47508 6946 -19415 -19362
15674 -19362 -1082 10129 5842 -22021 -32991 -25621 -24605 -14702 -12528 -8809 -15656 -6917 1933
15661 1933 -8649 -4333 14640 21802 2991 -8592 -8143 1906 -6309 5708 18365 10 -8816
15648 -8816 -18529 -30237 -5641 21148 35324 17577 17843 37058 36938 -11453 -33337 -7394 -8066
15635 -8066 -27447 -35562 -52943 -37325 -23712 -24332 30308 45035 14800 -8465 -32283 -48559
15623 -48559 -17929 -2325 -12194 10194 -5957 -38408 -40201 -14370 -23404 -47533 -30547 -29364
15611 -29364 -33250 -14371 23356 28850 25518 33861 46497 39818 13816 15228 -26004 -8527 11655
15598 11655 34800 20671 -17 -9660 -42284 -41770 -50063 -58834 -49393 -43029 -18309 -4248 -7440
15585 -7440 -12863 -30863 -22916 -19317 8680 28385 47671 23761 36751 62808 33063 -10872
15573 -10872 638 6192 40280 53837 54879 77372 79688 64043 77094 89023 77198 66314
15561 66314 74483 72050 66029 41260 56089 83405 98223 139306 162368 153810 144494 156632 151161
15548 151161 139935 144681 117132 119087 138605 147924 150695 162768 162246 143211 136487 133519 121838
15535 121838 143980 138843 149741 170996 163528 147806 146781 159829 147627 143167 156766 156735 167190
15522 167190 144430 139500 168625 168230 138619 141659 139971 122954 112817 114900 112790 114068 97398
15509 97398 65401 57684 90409 95537 78185 72204 100082 105607 79661 64291 55906 31434 29056
15496 29056 32035 26164 39077 40028 31354 25966 7027 -8426 16206 25352 19809 18082 7498
15483 7498 623 27071 14532 7284 -5881 -16293 -29321 -17288 -2891 -40324 -31600 -17207
15471 -17207 935 -12249 -12315 14377 17569 27973 30372 -979 8600 34497 33468 34227 21295
15458 21295 -7235 -2445 3891 -22940 -18008 5883 35794 36842 35339 28338 8380 17384 15286
15445 15286 33003 38866 31071 36856 41203 50073 47721 48073 61890 47812 26377 12761 -3516
15432 -3516 21543 23758 -6310 -29628 -33952 -27506 -24194 -16625 -14047 -8446 -9992 -27713 -44834
15419 -44834 -31907 -16782 4573 -5037 -1293 7142 16585 12799 33407 25248 16801 14800 30540
15406 30540 35479 17349 16035 35594 53577 40480 22985 15604 19394 19636 19482 43587 84799
15393 84799 87368 84478 72417 70474 93813 91198 95714 115880 140497 172694 210374 240621 271063
15380 271063 331656 433324 541565 609044 646874 689747 709814 695439 654519 587614 521570
15369 521570 448557 353652 277034 233677 215995 173381 140774 113916 99923 63433 36520
15358 36520 32483 31665 46644 46153 41176 32845 17942 32229 42842 34151 30616 21104 20310 45530
15344 45530 28872 7818 6630 31879 18675 -16305 -16824 -776 15683 24923 29701 12681 -2744
15331 -2744 775 -3098 21676 13217 -5017 -9737 -28707 -12300 -7074 -15008 -12102 14796 14410 -106
15317 -106 10095 23825 26939 40427 35666 39432 36187 8614 -3131 -5627 22233 51571 56496
15304 56496 66010 68033 63858 64402 44025 16201 29118 28128 39856 43391 27612 4529 -17877
15291 -17877 -35940 -24675 -40116 -30320 3918 2288 17709 6921 20787 24038 25181 14339
15279 14339 -17289 -23391 -5907 22256 18488 35725 40165 9755 -35883 -47489 -20652 -20669 -34484
15266 -34484 -19338 -20262 -28824 -46403 -46493 -31291 -3750 770 -7217 -5714 -14727 3936 19285 38342
15252 38342 75390 62543 40940 34368 21491 13279 27958 27643 27904 20662 9997 16399 25662
15239 25662 5421 7040 22931 46364 55517 58286 51881 38734 37495 33550 36279 70953 78586
15226 78586 44356 40869 48584 39379 58806 56342 43040 26227 12314 23849 42649 66945
15214 66945 89438 108383 93547 99227 104262 95816 108939 118038 100898 81587 42392 37990 24339
15201 24339 32036 57071 41417 30228 43753 46719 25611 7619 17681 29073 9468 19109
15189 19109 26257 17881 6665 -916 4312 -11130 2794 -1335 -1462 19046 21594 -2668 -26732
15176 -26732 -12612 -8408 9064 18767 17263 18704 -4743 2680 21452 18141 36467 33937 71215
15163 71215 81474 98535 116934 109507 93253 117897 103438 51382 20920 56250 69987 62230
15151 62230 54920 67276 57757 53361 36142 21209 49221 64321 66465 78777 95044 80552
15139 80552 46846 65876 85167 87830 90420 72983 67623 49892 35363 15326 9557 27173
15127 27173 5759 6840 26375 28459 41902 28136 30530 54703 37119 24281 49187 31628
15115 31628 33158 46447 18632 7922 18823 33493 52182 44888 69770 86231 74066 68202
15103 68202 81665 92542 88206 96745 87386 76715 75485 66627 45288 54999 52801 40912 51321
15090 51321 49784 59635 85339 76383 77512 97975 112600 106973 119266 159376 152386 129531 145862
15077 145862 180648 164744 166597 159614 142960 117541 105438 111437 138879 133405 99499 61198
15065 61198 40939 32784 32255 31800 20729 25066 28417 46376 49083 15535 -9504 -36962 -51468
15052 -51468 -28634 -18433 -20212 -6381 26156 67240 85540 92336 96125 118398 110669 117896 138524
15039 138524 113642 114550 163627 184488 198219 217744 263710 282547 295886 308227 291684 292502
15027 292502 291684 286321 258293 236704 224689 223896 223218 219894 227238 220045 207363 195021 198545 192178
15013 192178 217944 207203 190567 194030 180262 182600 192041 203733 172556 150789 149270 165251
15001 165251 161856 175666 173944 181744 215995 266798 269921 245405 221836 210411 184248 198622
14989 198622 240501 242289 236280 239382 265993 286516 295315 297477 318497 317483 314945 311212 312599
14976 312599 304512 297541 323508 362882 388908 395438 414270 421709 417037 410828 437345 450262 447928
14963 447928 468299 484288 507587 536669 594860 627872 636433 622313 637451 678260 707546 733299
14951 733299 762864 797700 823885 867556 913143 940168 934287 964721 997257 1047552 1103560 1169357
14939 1169357 1248312 1313276 1367700 1423863 1490398 1570240 1673871 1773086 1885127 2020495 2151771
14928 2151771 2324699 2521190 2727194 2967557 3230618 3529424 3879616 4307407 4790606
14919 4790606 5306820 5937349 6735572 7681309 8818377 10185585 11826825 13826303 16292233
14910 16292233 19332302 23273600 28510050 35478688 44823505 57191494 73068591 92495320
14902 92495320 114447593 136396660 154462677 164605880 164281783 153528046 134848433
14895 134848433 112312858 89879325 70271563 54617487 42713744 33895201 27404818
14888 27404818 22622022 18991716 16110202 13766729 11871266 10267579 8917719 7783974
14880 7783974 6845517 6089449 5475332 4946898 4496352 4070762 3706567 3405618 3148523
14871 3148523 2928502 2746320 2556890 2356443 2205727 2084749 1954725 1828635 1714184
14862 1714184 1614102 1506164 1430909 1378803 1318111 1242299 1177820 1148572 1105043 1043460 1002693
14851 1002693 960661 916459 898277 841778 820463 796240 773010 754498 719947 686930 654982
14840 654982 628763 622484 623027 613992 570209 525086 495999 500292 484067 480532 448483 428121 417475
14827 417475 413617 399472 384973 374985 357232 342963 316412 336761 367726 366879 320806 263749
14815 263749 237836 239310 278425 287270 271155 251365 233759 247535 252059 221142 184847 179554
14803 179554 140884 137214 190960 222787 224401 209170 208199 206017 219659 230480 220478 212272 200458
14790 200458 150889 138866 134666 116092 112218 130542 164252 156542 154292 137474 113511 118794
14778 118794 133458 129862 130795 135738 131894 128802 125196 103503 88951 58916 40184 23171 22176
14765 22176 34321 52639 49737 75365 81725 69227 38870 13585 12012 20068 58473 74532
14753 74532 67136 87563 119094 141402 156484 173599 162799 152259 150043 151364 172321 157055
14741 157055 155000 154024 142198 115419 53764 43563 48019 69831 86634 101105 65785 81912
14729 81912 98330 70476 55097 53775 54605 54733 54935 50026 46036 37441 16913 45994 69573 42079
14715 42079 33511 62570 88576 70902 79774 95439 136299 155783 105481 67119 73527 78143
14703 78143 86639 98956 108665 68067 35774 18861 33911 47735 72964 81360 68174 58587
14691 58587 51591 31960 26824 37913 48416 87691 105387 107798 90701 98968 92959 85126 89329
14678 89329 72912 48122 56737 59815 78732 80425 55841 38804 32957 22021 29128 61788 62062
14665 62062 39237 29216 22965 43152 76109 86631 30383 -9886 -5153 6809 -6521 -6802
14653 -6802 26859 49119 63454 79701 54558 12019 33358 50209 44684 12262 4890 5689 5313
14640 5313 15602 23433 38575 17332 14741 20506 15534 6201 13654 20299 34889 40640 18534
14627 18534 21652 13524 5957 3388 11473 27704 13548 -15161 -3356 20203 34180 23660 -4010
14614 -4010 13620 45756 41617 51172 57436 33016 10353 -9593 29118 20696 -2362 23006 35334
14601 35334 -3066 -19334 -32231 -19848 20129 23829 5326 -25177 -40307 -33593 -41035 -45711
14589 -45711 -37436 -38489 -20866 -15798 -18526 -19900 -31806 -23733 -24433 -28830 -5789 15487 37356
14576 37356 21578 5877 15723 18131 16741 29226 41036 18821 -9722 -16194 -21827 -2537 22031
14563 22031 23365 7515 -21868 -14372 -23523 5177 13370 8064 3960 -868 6581 32490 52494
14550 52494 45681 46295 42189 30335 18352 6636 45962 50666 40479 -2832 -14480 -28614 -14847
14537 -14847 -7584 -26019 -45796 -38393 -35522 -9932 -20220 -33843 -50446 -34275 8420 17758
14525 17758 14149 19916 27422 23632 23260 7585 -21805 -14305 -2459 7503 19833 -1879 -21695
14512 -21695 -37033 -35639 -12861 -6938 2904 24195 16002 6196 -8051 -21535 -36006 -18968 -1402
14499 -1402 -24534 -44694 -31988 -20519 -16796 7620 7477 9194 -1874 -6183 5464 9713 26832
14486 26832 40907 33102 29102 21794 136 -27187 -9609 18643 17703 22170 21804 20699 45261
14473 45261 54317 48019 15503 28257 43605 24834 34219 57239 23706 -292 -1675 35460
14461 35460 77471 92092 136873 193963 252495 334281 407970 442862 467484 471656 418249 337646
14449 337646 286420 245369 187126 118524 63192 51472 53348 69598 50908 39627 44532 74005
14437 74005 71431 78147 76827 70060 48352 36037 72589 99010 105403 128789 171681 208395 237428
14424 237428 245522 302686 363900 423642 524756 571234 602331 648810 667914 639567 584666
14413 584666 531296 442080 372313 331340 278887 225999 189061 136708 99206 99250 83028 35059
14401 35059 -5639 11338 30182 30444 17323 16729 53416 33503 -4256 -4156 11927 9449 -8634
14388 -8634 -10541 -11658 -9250 594 23108 -9992 -28394 -3922 11699 9867 18489 15055 -3848
14375 -3848 -23525 -31724 -16372 -2565 -16401 -27603 8281 -5851 -34533 -20512 -14702 -14533 -10409
14362 -10409 1990 1869 -13977 -39070 -47342 -13018 13368 -5681 14602 19374 2783 -17381
14350 -17381 -30987 -24047 -7602 -8093 -29317 -37206 -27575 -29332 -15834 -7262 9556 4110 -37597
14337 -37597 -45133 -17324 4402 6093 -3684 11829 38405 44848 23944 -700 -8180 7790 25423
14324 25423 21047 -11431 -24878 -21635 -23095 -75 -15968 -55240 -54612 -20669 11326 3724 10600
14311 10600 8313 -2827 -11928 -21598 -27631 -7185 -20785 -18324 -23563 -30312 -24773 -38904 -37788
14298 -37788 -34013 -43377 -59771 -33450 -26287 -29555 -49259 -55973 -38659 7506 13295 -13240 -16087
14285 -16087 -28839 -14993 -3674 12437 16314 35698 -3929 -20624 -32092 -39738 -33192 -34329
14273 -34329 -38809 -25944 -32245 -38088 -22887 -26650 -11437 -353 -20031 -7553 -18 -14423 -11121
14260 -11121 -8792 -21997 -45534 -38549 -32490 -53014 -69375 -40866 -5250 -2291 -10814 -22831 -15726
14247 -15726 -28718 -40444 -22609 7267 9634 -5350 -13849 -36071 -15373 -19769 -17619 -3509
14235 -3509 -17526 -9024 887 12109 13276 2849 -3056 3793 -17838 -25320 -23910 -27769 -7518
14222 -7518 -12418 -6460 -17790 -10481 3840 20512 -5332 -22693 -16741 -1358 -3277 1837 12921
14209 12921 16896 -12971 -38673 -36843 -24625 2650 6500 -12483 -47386 -46168 -43401 -64600 -55444
14196 -55444 -31330 -32305 -36441 -28554 -33282 -23283 -14261 -15797 -19200 1734 4400 -10095 -31990 -21146
14182 -21146 8567 4189 -22685 -11860 -1114 7112 -7037 -2698 -20519 -36335 -48555 -62307
14170 -62307 -64764 -65927 -64735 -53472 -29533 -6949 -13274 -47864 -49329 -43228 -22486 -15759 -24866
14157 -24866 -9594 -6794 -3139 -3360 -14125 9855 9090 -15167 -26065 -21365 -52912 -74752 -63832
14144 -63832 -59255 -25836 -9700 -22396 -25064 -25488 -25271 -16568 2544 27651 19066 12392 13436 4505
14130 4505 11430 10992 352 -15785 -21753 -3788 -15305 -28870 -64404 -115097 -99000 -40190 35739
14117 35739 32511 24604 21457 8957 3558 2279 -15863 3483 -5190 -220 -2206 14220 27508
14104 27508 37502 45460 12317 -23956 -36598 -40439 -72894 -64546 -17145 16271 37349 46396 42528
14091 42528 4457 -10484 -4569 -26577 -54943 -29127 5679 -7707 18001 60985 52155 15490
14079 15490 -19300 -17583 4532 -23897 -41374 4196 17819 31459 45077 9588 15495 18704
14067 18704 -21015 -28846 -7706 -20186 -48269 -63470 -47387 -52932 -57055 -39886 -6940 4218
14055 4218 6602 3311 -40437 -61168 -48001 7907 22879 10501 22164 17492 -19339 -15212 21403
14042 21403 5344 -15072 -5394 -1856 -13308 -32723 -18362 -1149 23311 26039 24394 3481
14030 3481 -23914 -30480 -20138 12372 -8435 -20614 1421 8027 -9358 11095 32598 13385
14018 13385 -10820 -40880 -28293 -11798 -1186 -9975 -11207 -10686 -14595 -10064 -28834 -19197 -15498
14005 -15498 -4879 -22767 -39154 -70339 -85405 -100210 -91929 -49490 -26174 -18051 -15365 -13732
13993 -13732 521 -10133 -7383 -18160 -25416 -14708 -22142 -32515 -37967 -36535 1201 461 -5840
13980 -5840 -11958 -17125 -30165 -15623 -1545 -5375 15824 30907 36016 48225 26446 11630 7443
13967 7443 3803 -19424 -31783 -43669 -37951 3984 20870 31115 24665 -1547 -3918 -22492 -53766
13954 -53766 -56261 -59007 -49821 -27502 -11890 -21260 -1244 -24019 -40802 -42784 -2368 -24552 -37396
13941 -37396 -15084 -13628 -26409 -39832 -46075 -13055 -10191 -27966 -35806 -28315 -18568 -31720 -46845
13928 -46845 -45508 -43531 -18701 -4648 -78 8281 7817 10425 -3924 -6801 12655 -8458 -35561
13915 -35561 -22850 -26742 -36523 -35617 -24426 -26219 -10480 17490 12251 -5608 -26875 -31249 -28945
13902 -28945 -21004 -12630 -18861 -1735 -11178 -6059 -7958 -27937 -17946 -605 -22640 -23167 -30659 -23422
13888 -23422 -27012 -27742 -32364 -18738 4911 11486 3994 20033 23571 16945 1100 680 -4870 -22242
13874 -22242 -14888 -12324 -16007 45 19110 18459 37732 63773 40180 12858 -11425 -19283 -34852
13861 -34852 -21778 -31498 -35797 -46033 -19910 -3375 -14427 -19905 -9422 -15613 -16643 -22193 -52240
13848 -52240 -66760 -58939 -55752 -45474 -25639 -24737 -37560 -33972 -37588 -44130 -18704 672 -2104
13835 -2104 -5867 -8922 -27233 -32259 -15580 -18773 -14544 -2215 -13140 -14452 -18070 -17287 3336 28498
13821 28498 17781 9099 -10750 -26535 -10622 -15175 -20351 -38712 -31733 -8983 6711 -11171
13809 -11171 -14739 -22896 -30455 -14533 2640 10076 30500 25464 8881 18781 11746 -2461 -13187
13796 -13187 560 24744 18740 15312 -7511 -37570 -31273 -14661 -11018 -5012 -8599 -10848 -21613
13783 -21613 -29152 -25253 -3823 25587 21328 -4988 -38197 -53941 -34447 12243 14764 -20740
13771 -20740 -34910 -23599 -3344 1370 -18185 -55608 -42183 -34513 -20229 -15226 -18415 -37149
13759 -37149 -51836 -43231 -20861 -26440 -56574 -90750 -92178 -73062 -74656 -57054 -34590 -10995
13747 -10995 -4409 -12746 19174 20223 7488 7399 -4876 -16024 -14854 -20912 -13572 -21505 -16517 -7227
13733 -7227 -3242 -12993 -7295 24267 15467 -14995 -17809 -13538 -11129 1947 26221 19125 10789 21131
13719 21131 23237 10550 9460 10419 -15880 -16152 -18508 -10080 6916 12021 19996 4432 14082 25388
13705 25388 16327 5099 -22206 -39052 -56332 -36139 -1020 11896 15813 332 -29451 -35174
13693 -35174 -8156 -407 712 4354 27592 22780 -29152 -29119 -27727 -8252 -1949 962 40 8721
13679 8721 15159 10724 -33408 -41221 -50062 -33811 -13611 -29355 -33292 -482 4330 -26011 -40148
13666 -40148 -53074 -47140 -23471 -20782 -27391 -57640 -35040 -6618 -5246 8230 -16291 -20818 -8918
13653 -8918 761 -9215 -26312 -15185 -11521 -19772 -16088 -13818 -2379 -1597 23037 19395 17189 5767
13639 5767 -25567 -33376 -38728 -49793 -58403 -54668 -48402 -38717 -29308 -60372 -54879 -33274 -31494 -34735
13625 -34735 -19910 -24619 -2489 6119 13165 9522 4681 -1252 -10779 -11642 -2074 25828 51540 13875
13611 13875 -14405 -6975 13904 13640 10302 -12515 -11839 21622 26659 30686 5366 -1047 5819 2293
13597 2293 -16746 -23420 -1325 891 -14996 -25145 -17218 -29794 -54797 -20808 -6061 -26267
13585 -26267 -7136 -23118 -63972 -49932 -29724 -14838 -5914 -27175 -33788 -10503 1265 -9376
13573 -9376 -6723 3757 22186 25755 -4762 -3986 -2092 21202 33136 -2257 -20739 -16960 78
13560 78 6410 -2955 -2945 8003 22910 31851 28183 16388 16170 9532 33683 32007 39431 63921 62148
13545 62148 31073 19157 36072 49281 42555 18958 13725 616 11019 31238 15384 -11444
13533 -11444 -7377 802 7790 4151 -1245 -380 11847 39371 16124 -19986 -32673 -17312 -12002
13520 -12002 -4949 -4035 -27057 -38065 -10216 9058 29946 22449 9304 4464 10523 19820 -87
13507 -87 -32982 -24141 -8264 -20027 -32989 -44125 -26601 1811 26741 34417 12584 -19904 -26164
13494 -26164 -9201 12578 46673 55417 39194 29313 20632 -634 -13871 -10499 -5855 -30162 -38742
13481 -38742 -24487 2019 -1552 -2375 -18508 -26414 -23057 -18795 -22917 -2622 -2696 -9155 5465 3354
13467 3354 14872 26557 40141 34678 40081 23067 -18109 -49057 -49431 -58809 -30739 -4307 -7091
13454 -7091 -9837 523 3290 -12458 -14404 -5665 -25224 -14280 12056 29355 5141 2481 -21232
13441 -21232 -40397 -21165 -5015 3985 25872 17712 8139 -18456 -14223 16197 6367 2699 20048
13428 20048 16166 -4915 -9272 -8116 12064 12294 15273 -6605 6780 14866 8198 5132 21740
13415 21740 -7443 -15153 -19512 -3832 -4538 -16369 -20697 -5374 938 15639 -4070 -35891 -8388
13402 -8388 14736 26269 28998 24737 -2288 -29236 -19988 5770 -5162 -8596 -26762 -39574 -42297
13389 -42297 -42663 -18904 9109 15399 -10959 2763 -19898 -20587 -13810 -23041 -31976 -26900 -11599
13376 -11599 -10520 -466 5756 -4840 -20005 -21214 27682 35558 -5098 -27106 -17467 -31362 -41509
13363 -41509 -43253 -31020 -25038 -37332 -36571 -43862 -39622 -22571 -14068 -5537 -19617 -36763 -36297 -35356
13349 -35356 -15153 -24915 3679 10182 10847 15195 15618 21292 19811 -7995 -25290 -50694 -63932
13336 -63932 -50422 -13341 -36827 -43920 -47531 -22412 6759 -1217 -12582 -27634 -14250 16002
13324 16002 44018 42120 38842 52477 2457 -22422 -8698 -13024 -21241 -45830 -39548 -16153 -7162
13311 -7162 7092 -24804 -28742 -24789 -45729 -56554 -43269 -37563 -52862 -47738 -42593 -38414 -32153
13298 -32153 -28312 -20301 -35036 -65207 -64551 -53463 -39270 -36394 -34017 -28191 -29087 -20389 -8368 -33100
13284 -33100 -21697 -16076 -37393 -25426 -10728 2773 -10435 -5352 -4283 -39083 -42751 -24964
13272 -24964 12320 5069 21443 7375 -29877 -14486 -1796 -29399 -39694 -47515 -32632 -6556
13260 -6556 5539 -7566 -27387 -42865 -42699 -37568 -911 4483 6504 8425 47302 49841 27272
13247 27272 7329 3459 -1717 -18597 -8845 -7994 -17264 -32746 -33848 -20965 -7180 25725 25396
13234 25396 -908 -7992 -35705 -25492 22672 25165 25692 17524 -1288 18828 27227 18051 22868
13221 22868 12409 6564 18579 28655 15081 -22762 -35262 -18254 27337 28283 14302 11170
13209 11170 5918 10531 -1563 -2097 8418 14180 29704 4887 -7611 8237 -7261 -17788 6471
13196 6471 10475 9791 22564 29531 25568 18696 15820 13280 -9228 -47796 -54969 -38321 -22079 -17200
13182 -17200 -10253 -2213 3663 23632 34739 17459 702 -16278 -24155 -25669 -3514 16236 7713
13169 7713 7276 33052 41810 2866 -28047 -31411 -6782 10131 25131 30843 19396 4904 15958
13156 15958 97 -3453 -16785 -44810 -46136 -43765 -54081 -54748 -35784 -25176 -3417 14949 4509
13143 4509 8419 -8510 -33380 -38917 -30506 -14695 -29721 -33477 -4776 4821 3487 -2616 14513
13130 14513 33111 41891 18356 3455 15801 15536 3551 -17264 -24733 -10238 20588 38914
13118 38914 38347 55787 47420 45232 37717 25378 18075 30077 28693 8917 5966 -1833 -3406 -1101
13104 -1101 -7476 -17840 -32506 -20005 -17544 -8471 -22425 7915 27917 56678 57230 53982 56558
13091 56558 48017 52610 90104 103381 111955 142357 187433 183996 166259 128329 84398 44245
13079 44245 5813 4695 19872 24759 21459 19303 -11934 -11113 8965 -2116 -4981 7282 4545
13066 4545 5884 9257 16936 2476 1142 8709 9174 3544 -7666 -14621 -10283 -1544 5142 -1758
13052 -1758 24172 23910 17404 34168 47605 57975 89070 129255 197530 269731 348835 481912
13040 481912 606529 676737 633136 486799 330291 230068 160537 79674 31608 18047 26140
13029 26140 28241 -270 -15400 -23923 -10462 -4981 7466 -16959 -37499 -55342 -53276 -34992
13017 -34992 -18694 -23626 -509 -15856 -21647 -5650 -9121 -1993 13738 35563 28112 16577 -15566
13004 -15566 -7467 37966 52652 40588 69841 137179 222316 349424 530343 664157 705038
12993 705038 655182 533483 370746 231799 153570 101134 63883 46251 55488 46434 15371
12982 15371 -4915 3694 3030 12716 23087 44561 45399 25448 11208 10871 33966 44460 46314
12969 46314 27064 19690 26542 9718 5123 -7618 -9017 -4934 12988 17765 -6094 -3676 3779
12956 3779 -8999 24944 48384 58117 113282 181834 219344 231056 227490 207204 138020 77797
12944 77797 43870 32837 15221 15551 21793 42506 49715 34173 40963 36469 35262 32357 19073
12931 19073 26001 29101 2866 5531 20969 15608 27315 34057 23303 15543 9209 17368 32890
12918 32890 36678 23075 5975 6012 34735 -8138 -16165 -16873 -33763 -32523 -31339 -619 2370 546
12904 546 2404 -1041 4545 16399 2843 -5833 16590 35342 13286 -10013 -11000 -11383 22331 62478
12890 62478 63301 15338 -1269 855 2783 9802 19754 615 -3750 -9526 -4424 5660 23152
12877 23152 20665 20670 26714 20211 7682 -5790 -9335 -4578 14230 12010 16585 6619 7246 25011
12863 25011 15148 7595 19769 10870 -666 3779 -417 -13407 703 -2536 -4360 37 -6994
12850 -6994 -27024 -25603 -19203 -10252 -25855 -22538 2117 11734 13839 -878 -53956 -72532 -27247
12837 -27247 -11968 -19331 -21098 -32232 -15035 -14352 -18755 1177 -1413 -12752 -27731 -23891 -36488
12824 -36488 -58836 -48793 -51367 -78241 -86674 -83839 -71683 -36785 -27889 -21757 -35305 -47230 -47113
12811 -47113 -52708 -43391 -28611 -25181 -9232 -31051 -25130 -9255 -34198 -51331 -54619 -44569 5968
12798 5968 20076 48066 46382 18522 -6872 -24555 -19265 2383 2526 1540 27843 37084 42635
12785 42635 30753 10370 9310 -16608 -63080 -73483 -36974 -12112 -20421 12534 12009 33649
12773 33649 10461 -34520 -42802 -18538 -16771 -10779 -4323 -11287 -15212 -26765 -35845 -43651 -57262
12760 -57262 -52889 -37925 -24101 -27815 -17729 23345 34096 8599 5999 25686 25392 -12043 -30152
12747 -30152 -33385 -423 33810 31482 5778 -21274 -36931 -37788 10404 13327 6176 -24088 6213
12734 6213 39787 48477 45643 15734 -36749 -46773 -47991 -54940 -27680 -25229 -28191 -2128 36558
12721 36558 33154 24897 17658 -17383 -41367 -8088 -2573 5802 -3050 -7716 -565 25467 22832
12708 22832 13552 -6044 -22312 -15676 -22098 -17581 -14355 16552 26062 33047 24920 8456 7124
12695 7124 18070 18450 35108 28899 22367 9854 -11526 -6952 12175 -525 5015 3654 -23182
12682 -23182 -14588 -6956 -19912 -27888 -25800 -21913 -28297 -49963 -69323 -58804 -40912 -28108 -12834
12669 -12834 455 5075 2293 -22446 -9962 18937 24678 30365 33841 16871 9466 11914 17448
12656 17448 14162 19714 -5384 -29233 -24848 -27950 -15476 -21217 -43222 -25032 -19294 -18328 1650
12643 1650 2198 -3759 -5493 -3084 16533 11135 -1611 7140 9101 2306 -505 -9823 -32271 -37933
12629 -37933 -51930 -22924 4934 4917 1754 13890 32762 16198 3852 -19201 1264 -1070 -4387
12616 -4387 -6657 -14393 2938 23252 16004 19020 28139 1222 742 17876 7294 1883 9233 -7416
12602 -7416 -26029 -70435 -53964 3732 37882 29521 21242 35812 35961 9495 -1387 14061 27793
12589 27793 21332 19943 -547 2779 35048 70222 36473 20601 13188 18581 32861 21364 -9308
12576 -9308 -26256 -9934 1317 -4542 3517 2012 -10302 -4171 1746 8322 20853 30178 22028
12563 22028 21870 42667 37989 25822 21300 2172 -7878 -11560 2027 -7006 -41212 -31105 -22603
12550 -22603 20291 46782 55949 49664 41447 33065 38187 33538 50208 56097 47112 44178 36397 25885
12536 25885 -1335 9825 22849 4180 -8860 -10699 -881 -2586 -12789 -27409 -17852 -11122 -17971
12523 -17971 -18865 -14396 5815 12619 -6914 -15989 -13711 -3663 15182 27891 21595 3524 21441
12510 21441 12772 14802 8274 5136 -12248 -19086 -7454 -2346 -1123 6109 11698 20612 28022 11632
12496 11632 -1909 -4243 -552 -21387 -12571 3902 9426 30838 86975 81142 30734 -3407 18289
12483 18289 46937 37899 30724 4115 -35370 -19337 -5810 11300 7308 36314 30500 13049
12471 13049 36358 51468 38319 9319 8381 32395 29631 13850 23755 1676 -932 10930 6131
12458 6131 -15113 -13681 3428 2535 12646 42203 50072 45784 55329 49012 36363 13050 18991
12445 18991 29515 51956 48153 57915 65578 68691 58229 29667 22083 -2583 -10684 13553 31812
12432 31812 33966 30524 36809 46280 49736 25225 15103 7976 27105 -2846 -12711 -3905 11454
12419 11454 12576 4907 11064 -1069 -8023 -2691 3993 -15404 -6985 11400 35850 38560 32586
12406 32586 24936 30494 17048 20006 17865 17864 13108 10871 7837 29190 59433 37575 32572 -6572
12392 -6572 -12431 -3728 17546 11945 5163 36378 61409 38338 19226 6598 -13795 -11014 -2414
12379 -2414 13562 14355 14226 17082 -8533 -33247 -15787 15817 40846 56286 47468 38846 30064
12366 30064 33170 9321 -11645 -17645 -1333 21268 44200 43138 23587 36472 22827 -4016
12354 -4016 11541 -6945 -33688 -19966 14405 20649 26864 24607 32092 21253 33639 56301 57976
12341 57976 47345 29554 23589 37472 37553 14795 33525 35523 21616 31514 47738 36008 3181
12328 3181 32229 55232 52033 36918 31584 38207 33931 17810 38830 74625 68777 69293 60946
12315 60946 44438 26661 36745 56237 44313 31060 26609 39440 43655 39905 7702 6695
12303 6695 8862 -15651 -28506 -28618 -8917 17575 36946 32565 7709 -7654 12903 -1334 4485
12290 4485 18735 30237 50331 64822 55696 42660 41680 38675 12881 1223 -6037 -5271 2771
12277 2771 -2159 -12190 -38311 -22849 19153 32534 58237 73460 48421 50584 53607 31967
12265 31967 -1191 -11806 -27541 -9484 12401 5976 9995 8116 12987 7699 12178 38537 56416
12252 56416 71422 79134 95233 82079 58193 16386 24427 36140 44088 36808 20784 15306 14709
12239 14709 16559 19918 28847 45004 58563 63923 49781 49500 64967 50329 25500 33021 43509
12226 43509 35283 41364 42568 18444 801 27618 41770 54558 55254 37251 33667 41925 37802
12213 37802 28971 45506 42826 51788 63439 59807 66716 65996 70834 71999 68769 56267 41484 69325
12199 69325 96538 96330 96496 65396 33114 23587 20355 41261 75951 105919 88013 76447 77473
12186 77473 63973 66541 71328 85728 83397 80685 77953 83103 97307 103027 103861 93462 59556
12173 59556 65446 56044 57770 66655 54397 79982 76970 85429 72369 55692 31102 34589 45226
12160 45226 66585 96604 80619 90690 100718 107219 123071 102011 86405 86386 99299 87244
12148 87244 65360 50224 48548 84405 123671 136222 109965 69665 53178 45041 44186 53838 83659
12135 83659 117223 130377 95238 77524 80678 93283 111312 115134 117745 144216 160413 140321
12123 140321 113609 94513 74130 82448 101181 129308 162212 153559 145819 131703 138677 140573
12111 140573 171237 183455 179160 135686 100654 92623 97086 103169 115518 140570 136471 126862 147340
12098 147340 164748 184331 194309 177502 182673 156592 127273 124659 123281 125250 138594 131483 114863
12085 114863 116650 132513 150788 156615 160772 155086 137856 110154 104214 135865 167726 206278
12073 206278 242308 246925 232593 208244 173704 186428 220355 270587 317057 301715 311824 359826
12061 359826 361285 334800 311086 322360 329496 337249 346542 331401 339384 346565 350227 387747 387847
12048 387847 408612 421270 406875 405473 413015 401952 404986 400704 385499 381903 353821 367567
12036 367567 408395 408230 374993 372021 422307 431704 417628 411888 421434 424389 441450 467226 462609
12023 462609 446995 471755 479016 492898 478091 482140 522725 529815 547397 546193 547734 555068 598474
12010 598474 623999 631309 652717 670163 709789 726477 707561 769946 809705 834071 840720 858243
11998 858243 893223 919493 927910 948590 985625 982483 988228 1020508 1050071 1099340 1163719 1225517
11986 1225517 1277591 1303014 1301986 1334925 1382473 1448630 1525275 1580008 1651120 1739983 1794823
11975 1794823 1837656 1901343 1979772 2079134 2161374 2261912 2360803 2452373 2553801 2678580 2845931
11964 2845931 2991825 3179792 3399393 3583035 3788588 4061709 4366771 4664045 4969422
11955 4969422 5309214 5678466 6128665 6631689 7143989 7710612 8363529 9102360 9939403
11946 9939403 10884082 11994520 13251619 14699979 16371829 18266665 20468398 23010582
11938 23010582 25932231 29250453 32997566 37146762 41606365 46272784 50866689 54954457
11930 54954457 58133204 59983478 60210344 58788228 55990739 52138985 47696944 43087237
11922 43087237 38545697 34307057 30460525 27044279 24055515 21432902 19146970 17180280
11914 17180280 15487546 14019709 12717453 11600908 10607046 9728749 8964007 8301654 7716805
11905 7716805 7206432 6746422 6349152 5959413 5603573 5282879 4988709 4727330 4511064
11896 4511064 4314592 4145394 3967259 3802552 3652351 3485224 3337874 3213224 3092514
11887 3092514 2969334 2833185 2712083 2609631 2506018 2380254 2275612 2137717 2020177
11878 2020177 1918042 1868851 1818549 1739618 1651106 1567713 1500327 1467111 1438410 1369896 1289676
11867 1289676 1234137 1195702 1138916 1088813 1067324 1032141 995355 982216 953925 925016 902193
11856 902193 879507 846016 805394 785641 763337 748637 725990 703045 708030 688985 666012 635077
11844 635077 613125 632557 632831 603929 584189 565991 549811 528997 498467 481633 470362 462978
11832 462978 457133 435126 437387 427604 433982 400027 399228 394838 391296 390135 417260 419980 378429
11819 378429 361566 362818 360797 364114 364122 346168 349216 331598 340818 307224 283091 267903 259428
11806 259428 270356 273196 285582 266480 235791 238247 212897 174348 183326 199310 215977 206021
11794 206021 160070 172771 193421 200241 208538 204803 202445 205754 174541 162779 202935 217013
11782 217013 196883 198025 209612 203542 210746 196344 197755 178021 154546 177702 202518 193225
11770 193225 192370 202440 188306 185270 202394 211781 177528 160255 130016 120284 154866 183550
11758 183550 187806 156539 145675 155794 168387 169388 132499 100791 105291 104240 95436 83351
11746 83351 87022 83785 74537 80322 71589 71317 87889 89059 95553 115538 97430 107454 129784
11733 129784 131705 110772 94207 101897 127989 139987 126109 85608 40710 30059 59313 67320
11721 67320 69699 71349 71418 63021 67653 73401 64426 64406 80598 91408 80932 94315 97304 91792
11707 91792 92974 102620 87963 75417 86783 72416 68474 75872 93520 83523 65099 66263 59194
11694 59194 74941 81413 81392 101402 97359 71874 76755 72435 91623 109111 121259 106108 91665
11681 91665 81728 84624 69095 67312 59993 62900 65516 71949 66896 50138 17698 7591 34220
11668 34220 56270 59110 55035 59873 54037 32194 48318 53448 63649 51625 48001 50238 51029
11655 51029 58733 44710 55665 79262 85464 88117 76450 62367 63558 48295 28858 42540
11643 42540 43576 44249 51186 62811 65260 29357 5534 2577 21657 46833 56507 40100 41638
11630 41638 41368 27847 34195 25981 56829 48466 34689 42133 58931 70001 53816 38239 27106
11617 27106 20185 29340 33030 13926 13386 35611 35614 16736 25341 31044 32891 42470 45147 24053
11603 24053 11874 37455 43656 37958 43267 53290 50763 16615 -17280 -35028 -29993 -14815 8225
11590 8225 39940 6545 23408 27032 23890 27855 44561 75395 58770 31386 19760 10933 -11208
11577 -11208 3416 10930 -7275 1909 25082 38570 29970 40992 25200 -4421 -11105 -16620 -14984
11564 -14984 12836 17301 3682 -2093 -7221 8957 29079 47633 40957 11049 29864 7649
11552 7649 -13024 -1133 -1886 7591 5487 -13539 -22997 -20204 -27332 458 18027 5303 32177
11539 32177 50146 40043 14604 1384 29264 26372 17490 35493 60037 58151 50635 4413
11527 4413 -22368 4940 43233 58383 44180 3960 9072 15802 30979 30334 -6087 14550 35688
11514 35688 41324 37663 52134 38194 10340 16115 19919 5898 -816 6611 28634 26111 -1179
11501 -1179 14686 40561 20442 -3624 7051 24175 16705 31254 38242 49137 37340 20290
11489 20290 4256 6785 -7351 -33878 -30096 -21254 -18244 -9793 2421 -3478 -7097 -11125 -13173
11476 -13173 -11981 -813 10041 31716 29385 497 -8171 -929 -4417 -439 2701 5601 -16598
11463 -16598 -22242 -2614 9520 8720 2262 -19643 1180 18896 18893 16903 15731 19788 9432 14839
11449 14839 23521 31455 38593 35176 24708 26799 14471 -12453 -25540 -3399 7874 -7401 -66487
11436 -66487 -67133 -43215 -14818 17872 53834 29482 3853 -18082 -15765 2687 23260 12400
11424 12400 40781 51706 30434 41890 36587 30926 17792 13847 -6184 -13353 7365 15434 14504
11411 14504 19437 27629 32174 18765 -4221 -30626 -28251 -5565 -9537 -22346 -40137 -36236 -205
11398 -205 14192 -17248 -22192 -10541 -11966 20943 34328 35229 32316 55544 37996 -1767 22366
11385 22366 43169 44208 37224 3144 -1150 14865 13301 19624 31365 29386 36496 28515 18597
11372 18597 43820 47417 56174 40778 -9193 -10528 4276 -5068 -21909 -47574 -52271 -23819 -5377
11359 -5377 268 -485 -12077 9212 24115 4381 12470 13995 701 -10832 -7127 7951 15669
11346 15669 15164 18905 605 -5309 -5924 -5219 -17608 13840 16623 12041 -17677 -29478 -14019 -4153
11332 -4153 6989 4404 -3439 -19014 -15786 2070 15890 -159 -22908 -58935 -61747 -55814 -29159
11319 -29159 -17649 107 8021 18806 19043 -25285 -31188 -25328 -28144 -24754 -21309 5409 23098
11306 23098 17089 2131 -16830 -9950 -4062 1085 16917 -21966 -21629 -5845 15909 6967 2711
11293 2711 2229 2960 -12403 -23736 -33286 -22930 -25654 -30045 -36356 -16427 -17499 -7412 14994 18544
11279 18544 12297 8316 -12689 -26249 -9509 6567 8651 -342 12382 7177 -7553 771 -1014
11266 -1014 15606 28746 23463 20762 -6149 -29470 -34085 -20737 -19493 -11866 -21943 -10420 -15810
11253 -15810 -31473 -50940 -53165 -42763 -41928 -38013 5219 27481 15970 -16216 -7295 -6582 -15144
11240 -15144 -10306 -18046 -21810 -33272 -31559 -28423 -15033 2093 -9725 -5131 -20040 -7248 -16306
11227 -16306 -4886 -6156 -13053 -5985 -4619 -8085 -6054 -17155 -35557 -37247 -20122 6621 -9096
11214 -9096 -31326 -28162 -10693 10045 39339 35939 8034 10463 13369 -2369 -24601 -10076 -6843
11201 -6843 -23265 -359 28795 21198 6641 26086 3213 -8813 -8201 -6563 12392 23330 12806
11188 12806 -17998 -69810 -59068 -8745 -2299 -1351 -13996 -29468 -7862 -15543 -27034 -28599 -21765
11175 -21765 -2021 -10534 -24457 -32001 -20713 -29718 -37615 -6355 16021 9711 -8532 5070 32234
11162 32234 28373 8608 13524 18383 -10608 -10631 -8777 -8916 -1540 -5804 -27784 -40796 3391 -4449
11148 -4449 -26972 -26849 -35092 -25204 -33018 -38492 -41594 -24827 -6160 7092 9023 23940 49276
11135 49276 33562 -5295 -35964 -13482 -9312 -28360 -24786 -19561 -5874 22349 31614 40080 24334
11122 24334 18891 27557 -5881 -19160 6591 31531 46965 8898 -18966 -24771 -21420 -23914 -28674
11109 -28674 -6307 827 28597 62447 58639 18978 16768 -9563 -28084 -25648 -11385 -12403 41760
11096 41760 49287 22775 -12575 -31560 -27273 -31299 -17311 -21492 -7686 26957 38850 18715
11084 18715 18585 15764 19275 38795 70574 66862 34048 -11436 -41949 -37504 -24768 -5385 -14956
11071 -14956 -1094 2348 619 -11854 -41699 -51968 -22445 -30879 -11018 -1335 11972 1678
11059 1678 -7794 -14713 7782 24072 50901 53823 54134 33340 39363 58276 81359 108398 148009
11046 148009 173234 148360 130547 142489 134151 130670 116103 115735 109378 115870 139877 187829 235104
11033 235104 260342 284430 278092 258944 225774 206375 179583 177931 197506 230884 275307 297623
11021 297623 329173 354944 339264 308085 273284 258326 214297 195021 212243 227555 239026
11010 239026 238214 256726 249352 233046 198723 200875 189862 160832 135716 139898 125398 102649
10998 102649 91709 88475 94779 98882 113333 84994 54852 29668 10022 12207 30118 31512
10986 31512 47993 46915 52099 51775 49432 44380 47400 39929 1593 -15750 7067 25302 21091
10973 21091 13287 -14149 -21586 -14189 -11311 -6162 15333 7762 -10069 -5507 16069 -17527 -21793
10960 -21793 -32481 -34262 -19496 -16181 -24541 -12451 8422 -2720 -5679 -1921 -10559 -5694 4821
10947 4821 9399 3222 -21864 -15866 -20109 -20287 -32157 -33081 -23700 -13768 -12770 10894 54418 51004
10933 51004 1197 -13197 -6165 14322 4217 -21250 -26896 -28459 -13907 -11020 10621 9119 -10015
10920 -10015 8745 21825 21724 7726 13713 16234 5867 -15310 -25538 -13835 -13733 24809 36488
10907 36488 19135 3930 15298 16894 -1472 -23213 -10649 -35011 -25718 3122 19168 26042
10895 26042 24242 24758 15377 5590 -17628 -27880 -36751 -61918 -59113 -40064 -48399 -31945 15042
10882 15042 34520 20888 14635 1654 -2792 -17953 -16605 -10293 -32832 -34879 -31214 -20106 12297
10869 12297 26572 12171 -16554 10954 20501 29446 20461 35457 39056 46163 49090 43295 43992
10856 43992 34962 44496 34544 30958 15460 5656 13464 35393 55034 44037 7301 6841 19153
10843 19153 43065 44294 36476 32897 43664 48558 51666 48455 31657 18571 4076 8745 -8510
10830 -8510 -21766 -31897 -28562 -19926 -6128 27451 18822 -4645 -7679 -12675 -3111 13291 2584
10817 2584 774 -8141 16605 41823 57283 60847 46065 33180 37373 50959 34067 19336 -14846
10804 -14846 -11889 23968 37893 15958 -1529 -734 26263 33825 33897 47739 44505 31297 30147
10791 30147 23111 -6842 -7369 -10757 10870 24713 24147 3651 26702 47085 36815 26793 10583
10778 10583 38493 41138 33966 44937 29664 27179 55856 49963 63228 65254 69944 44592 10911
10765 10911 -10305 -30775 -8121 35699 52718 32079 24052 -11698 -22788 -17465 -15183 -9838
10753 -9838 19197 44425 10639 -6710 44318 59146 33277 18875 33106 48216 37967 12823
10741 12823 3861 19474 39687 53665 84117 91488 93004 72656 63179 50431 58718 89074 120336
10728 120336 120359 103188 102224 106786 117023 140123 129932 121236 130346 144878 153862 159511 140090
10715 140090 142656 151148 147870 132184 121309 153186 180284 155491 132243 106483 124840 142529
10703 142529 138256 143484 161408 168877 142118 139801 134290 158227 179590 177909 178835 181050 182437
10690 182437 154918 135207 122692 130766 132425 126482 100615 117446 124658 146045 176485 189781
10678 189781 195754 207071 188076 139678 133319 144130 156094 178529 180600 183246 205420 210882
10666 210882 227953 214882 208664 247262 262407 262012 263449 285711 294765 288569 272726 299725 339330
10653 339330 352116 370952 408269 410746 405475 419055 442542 468923 503744 500047 536219 578313
10641 578313 619204 688177 749445 773098 829060 902085 978556 1050158 1171624 1366270 1552621
10630 1552621 1710077 1882610 2031090 2222814 2444598 2739786 3118209 3655158 4391807
10621 4391807 5338017 6635892 8331201 10593016 13477761 16862280 20225725 22716648
10613 22716648 23715704 23351530 22299480 21437949 21303945 22244740 24524482 28322860 33798928
10604 33798928 40580078 47238186 51437831 51584117 48324044 43787574 39979183 37944050
10596 37944050 37999952 40321114 45108157 52220390 60741253 68401621 71860142 69247042
10588 69247042 61990983 53326493 45884445 40783685 38132018 37783692 39544587 43095496
10580 43095496 47513207 51050158 51486315 47875834 41462965 34546371 28744630 24700226
10572 24700226 22302162 21274028 21331238 22126738 23150269 23640654 22844719 20476304 17174020
10563 17174020 13735312 10727141 8372978 6647785 5371510 4428080 3725503 3215376
10555 3215376 2805945 2453630 2167953 1930531 1751755 1587896 1422986 1283909 1159898
10546 1159898 1049862 979825 926693 881957 810011 760274 707783 669263 623854 569702 546037
10535 546037 534859 534918 496028 462506 425925 427695 388594 353888 336941 320131 307172 289202
10523 289202 293460 284908 278992 280190 247447 238862 206805 200190 214176 245484 234287 202709 229515
10510 229515 238708 228064 200638 179081 174159 177909 173073 185358 198402 204196 171975 130397
10498 130397 128091 113849 117181 128779 126061 98121 86956 97400 112216 103419 77434 80278
10486 80278 86579 88339 91719 116019 109962 109767 93227 95769 106097 103386 89195 75991 79712
10473 79712 71099 68623 65592 48122 48331 38826 60281 80174 89143 81855 71203 57722 53939
10460 53939 20119 32755 51069 45201 48714 58145 73572 86710 86271 73111 54243 34733 49499
10447 49499 53759 71008 92738 67375 51561 68519 98056 111238 126659 129290 137649 128953
10435 128953 103637 86801 60776 55311 62635 53690 69997 104449 107688 70935 66633 79498
10423 79498 86710 78499 65907 55209 99268 114510 131742 100354 79297 79432 60616 60540 68166
10410 68166 57452 43016 49652 38455 28034 -4931 -8295 9140 20089 13827 -1481 847
10398 847 3440 -303 4047 18585 35873 37619 43057 23663 -470 -10399 -24179 -24079 4702 28274
10384 28274 8293 16185 29035 81451 78104 37124 9265 12743 14276 25273 23246 12035 31539
10371 31539 40940 35493 22182 41030 66775 61642 28263 18098 38885 40169 18474 20541 18734
10358 18734 21750 22138 15065 11798 15807 -8646 -6819 20418 49194 24970 7209 14105 28056
10345 28056 38821 68181 47326 23328 -12939 -24161 -32899 7838 35462 73193 78029 78455
10333 78455 79479 65925 44898 49760 35232 36932 43334 22640 -16149 -2320 24002 19700 13046
10320 13046 15638 43998 66931 52923 43997 43190 36804 32206 19658 14794 18401 22061 26639 25896
10306 25896 41630 23625 36291 50375 15416 -37067 -30627 -13480 -11584 -17150 4966 18937
10294 18937 3738 -9490 -26571 -21888 -24248 -31693 -339 -25501 -16478 -337 12159 -9097
10282 -9097 -21424 -31270 -15547 1242 8482 4423 -5347 -13054 -8553 1936 -8765 -33922 -28808
10269 -28808 -20375 -9598 -14608 -23008 -2818 -4525 -38696 -55506 -42973 -27914 -42107 -27030
10257 -27030 9987 9688 3153 1476 10957 22036 30207 59953 67873 20751 -13089 -43547 -61507
10244 -61507 -66427 -67582 -38129 -41601 -65121 -46370 -7362 -2226 2000 -7925 4946 7761 -5169
10231 -5169 -4672 -12 -12793 3443 13576 -828 1622 15457 1967 -3434 -18201 -34233 -45595
10218 -45595 -40143 -12460 16200 63232 69879 60390 53523 27727 6316 4310 -11676 -811 13657
10205 13657 27651 61670 82476 61925 75685 58940 31261 22515 7870 25396 34717 37615
10193 37615 40029 50252 49192 26521 13005 14675 8631 9765 41056 44750 30187 32240 38876
10180 38876 44002 68409 94808 109343 134882 139812 149128 140912 149151 147024 139074 167643 180221
10167 180221 212843 251300 288466 322072 332946 301415 245511 213393 216365 246587 286420 350636
10155 350636 389735 415430 401088 365184 337294 302846 233276 193348 171934 175095 214347 248588
10143 248588 277056 292516 271107 263756 245804 226139 183027 165439 144144 113627 69646 55274
10131 55274 67482 77597 106588 121224 81193 63678 48633 35138 27542 16480 -587 3932
10119 3932 368 -8175 -3667 -8040 10064 17459 35476 41638 49005 20771 11123 -733 2367 -11872
10105 -11872 -5223 35640 26433 21384 7063 -21884 -29127 -7656 22431 20509 -14726 -14062 -22338
10092 -22338 -29670 -4950 19836 1696 -22903 -25681 -16317 1963 -15048 -31980 -17300 31142
10080 31142 9547 -18633 -16712 5573 27809 21959 -1558 1718 28431 36745 53240 42507
10068 42507 13460 29401 26181 16684 6938 15142 28853 -2612 -15865 -6244 1326 13257 5899
10055 5899 -7806 -12555 -3204 14101 1383 -206 -1260 5884 16419 24134 22550 -11031 -50468
10042 -50468 -54815 -57443 -38695 -14247 -25257 -35999 -39591 -18154 -13831 -6198 -14365 -9510 6994
10029 6994 -11231 3772 35697 62198 41709 -9818 -32075 -15459 15434 15163 26189 11607
10017 11607 1859 -10200 7013 37038 26328 34375 43002 41532 44671 51899 38835 31244 50326
10004 50326 43614 35078 29870 10904 4302 4092 -4317 33418 19597 -2513 -5973 -16827 -8391
9991 -8391 -29419 -45740 -28719 -9361 -11112 -22497 -35402 -50016 -21229 15025 27097 37131
9979 37131 7261 -11626 11155 -8357 -37867 -55195 -39932 -26554 -29858 -24234 -11244 4045
9967 4045 -14235 -36999 -9325 19095 14101 -15643 -17356 -2229 402 35078 24915 -5430 -22826
9954 -22826 -3174 17661 12742 5304 10390 4145 -19240 -10587 -10151 -21154 -1575 22287 30106
9941 30106 68606 165280 254630 240759 181989 116244 52911 41834 39793 25480 10123 -5353
9929 -5353 12222 -1493 -3638 6556 21360 36344 11297 -14692 -29222 -33693 -26798 -13562 -10708
9916 -10708 4495 40734 49499 22200 -14229 -18845 2470 -5823 -1720 -11904 154 9516 -24384
9903 -24384 -33202 -13572 -7764 16224 17605 -4693 -1012 -5787 -17274 -40603 -50611 -58189 -57878
9890 -57878 -60196 -60145 -13754 3688 -9761 15272 8085 -2343 -5502 -997 11824 22312 30183
9877 30183 18996 -30420 -41516 -21580 -31193 -20779 1701 -12299 11907 42143 54955 33444
9865 33444 10248 17284 6893 30692 42867 10630 3857 22189 49911 59916 15081 8698
9853 8698 29491 29367 -3385 4892 35894 46497 40015 55694 77397 66988 31872 19351 1042
9840 1042 -3689 -5016 12742 27543 6466 -5033 1769 -19363 -18343 -25114 -26366 -39222 -33686
9827 -33686 -18791 -38771 -38687 -17178 -15134 2682 5769 -20511 -26056 -9078 1970 -3699 11142
9814 11142 7384 19699 56397 67328 74261 61051 67598 88754 90265 73089 64132 48580 53414
9801 53414 70358 83476 89342 80849 72443 90380 137367 189929 276548 382175 516445 771474
9789 771474 1222248 1909732 2754728 3323905 3158960 2436366 1603218 984485 612570 412443
9779 412443 316745 260530 205056 180695 148761 115126 82979 63681 46562 28106 27073 50175
9767 50175 62058 25471 20374 58437 36411 -2894 3115 25060 -425 20821 61240 39551
9755 39551 37797 44457 39957 60133 67321 50189 36251 26050 20527 30134 29911 29537 36643 25964
9741 25964 4889 10672 14431 -2762 -25897 -30476 -8697 1998 9890 -4605 1403 -4328 13960
9728 13960 36171 12629 21313 6376 -16630 -22158 -21337 -27763 -12450 5728 13611 35789 44463
9715 44463 22801 15292 2253 -8409 8969 25120 30898 -5087 -21104 11617 21459 16180 17875
9702 17875 26918 11143 3212 12995 26909 28927 8407 -9366 2394 -7871 -21424 -18816 -13511
9689 -13511 -15119 -16833 -41570 -55037 -42467 -37462 -25944 -12954 14945 4731 4568 23989 14087
9676 14087 -3220 23449 44297 35409 40722 33494 47802 56911 83533 113190 114175 93176 102957
9663 102957 170783 260501 395042 582759 644599 501251 346536 248419 151118 103871 101848
9652 101848 82749 53415 4853 3870 20979 5588 -1975 -3924 13223 39180 53549 16804
9640 16804 847 7261 8879 12886 16172 7927 14372 13363 14106 7702 -10677 -8502 -959 -3767
9626 -3767 24848 27266 23713 13823 40188 34220 9729 27765 23747 34463 34310 8763 -5878
9613 -5878 -7774 7092 10977 4546 10369 11514 32052 46275 44469 32384 17807 23204 34610
9600 34610 30580 34228 55582 44844 14679 6946 14027 25799 30436 36283 38831 45718 27361
9587 27361 14524 31347 36726 49570 52654 62959 37854 30181 39088 39783 43370 60299 28283
9574 28283 21204 19299 29717 29977 -591 15777 30609 35578 42951 65847 28051 17688 30681
9561 30681 18503 -3440 -12845 -9532 5207 11492 -3696 12808 17113 21727 5297 6546 -2334
9548 -2334 17071 28009 12245 7740 7558 7252 -16304 -4600 -1050 -11610 -16805 710 5461 -6174
9534 -6174 2330 8080 1890 -4727 -13677 -13309 -13518 -337 35302 45121 33419 36853 17127 16973 14441
9519 14441 25062 33328 30042 9161 14446 18004 -1149 10080 -2159 -14302 -20939 -14243 -42450
9506 -42450 -25323 4508 20594 22458 23949 18135 16450 1752 21976 -3897 8283 11465 16272
9493 16272 25083 30376 27955 20247 36120 26480 12029 10749 31574 35310 1977 -23518 13612
9480 13612 20623 20089 11906 -7118 5596 12034 26530 50283 41490 9727 7461 50072 63956
9467 63956 42726 10596 -1476 21295 30758 32016 26987 33780 46744 52930 33022 17518 16470
9454 16470 9268 2680 -7122 -8916 9651 27092 17934 31310 33308 48567 55963 27286 -9095
9441 -9095 4195 12742 7246 18774 42307 58572 52752 37823 38159 48138 44230 29743 7341
9428 7341 1592 30282 59201 67591 56059 42546 20150 32122 30397 41842 30110 35144 62878
9415 62878 60711 38664 14846 -731 -5478 14014 32943 49946 54006 37555 35015 31856 21497
9402 21497 14542 45108 76098 57397 25996 16648 -2009 16724 35563 35598 38651 40893 56030
9389 56030 53432 50576 42785 45739 56633 66866 79334 73507 73008 68717 66510 40033 24272 46469
9375 46469 53081 47550 68337 89278 87677 49018 33205 35313 33841 45580 46930 37328 31530
9362 31530 23561 36028 60830 102697 94047 64010 59603 78788 61528 69600 70409 60363 31119
9349 31119 23408 64191 79893 34291 22104 46111 61209 52522 34563 12166 9437 6217 28388
9336 28388 51029 51641 52233 48905 51817 68151 80781 80745 70035 9551 -18003 3809 24236 38735
9322 38735 23907 17440 26924 24159 45695 40260 23200 32121 45125 44573 52554 71459 52364
9309 52364 35386 40761 56249 41314 37207 46900 26868 31969 54954 63488 72920 68819 71213
9296 71213 74249 81559 62999 48087 35360 29925 28237 27838 35419 21080 15083 8429 14030 20402
9282 20402 46656 66439 76546 72179 48119 27729 9325 17611 55042 49429 40519 26018 21935
9269 21935 36738 56496 66316 59113 55420 103418 101113 68775 73682 84744 94076 111519 120652
9256 120652 106761 97838 114708 106130 91937 72332 51970 59434 63278 69565 82699 80674 110509
9243 110509 118363 73543 55289 65421 85761 55937 33618 37756 26409 32392 48076 59494
9231 59494 46290 39535 51349 52894 58174 83294 84752 75692 76122 63906 44659 33515 13099
9218 13099 28023 65288 86107 89572 58773 43223 47437 64793 56939 38354 95139 140491
9206 140491 124920 80699 64017 63186 45195 55889 62310 49762 59592 92328 77376 68760 85618
9193 85618 76299 87296 86429 90991 91200 108628 112630 104078 114314 105766 95390 74138 39639 48966
9179 48966 63306 78480 91356 88219 93244 108888 117454 101185 115886 129372 138031 172584 180704
9166 180704 140851 117480 108283 120713 118905 120674 119371 122183 110260 102645 112911 119334 78326
9153 78326 76737 76811 89845 109683 113550 128590 142633 129718 134101 119517 115469 124519 135426
9140 135426 158972 174181 176576 151412 146887 137184 118856 120082 93087 80841 92362 87639 91670
9127 91670 114674 120379 128742 123150 92722 49910 57073 72262 83300 80571 91645 125797 150641
9114 150641 165160 144876 118518 134771 156282 165744 190232 194379 208996 218323 232989 241130
9102 241130 228299 226529 222641 195368 202513 206712 225674 228627 241111 270677 315609 338396 369953
9089 369953 398695 436601 456413 491718 541339 620509 709373 826779 978515 1151584 1368361
9078 1368361 1600039 1832434 2006267 2081160 2055905 1965976 1854654 1675302 1449928 1232358
9068 1232358 1042556 913323 799947 711597 626709 585830 547457 485786 458160 425486 404371
9057 404371 356823 332059 326311 287756 237191 233522 229401 213905 225703 256328 231733 181756
9045 181756 163248 140731 166316 199518 217252 214292 217798 214810 205605 211793 211421 187613 177030
9032 177030 160916 146743 142902 171772 195943 216292 221721 216363 225555 202933 191661 201396 203806
9019 203806 211652 222439 213582 221014 232790 219854 207805 219449 207486 202572 191054 187782 218765
9006 218765 235127 237604 214582 190066 208505 204449 201270 215889 213589 205431 185564 179405 167371
8993 167371 174019 199562 241467 252295 266033 267832 293528 320264 321152 305003 301265 304263 315719
8980 315719 327631 307908 298325 311530 335723 370931 373745 351294 346289 370967 396263 381694
8968 381694 373604 394532 405848 464928 541287 592785 605236 620779 704317 814355 927722
8957 927722 1072942 1239082 1425076 1628994 1817001 1970466 2053822 2060030 1962879 1864638 1695228
8946 1695228 1514136 1354973 1219618 1093243 1001353 938934 897955 856067 799062 767446 756044
8935 756044 712768 663595 621286 577135 540457 480901 470617 457391 431694 424040 426404 411618
8923 411618 394794 396364 406064 413148 436963 444416 413799 386644 374969 375908 367441 354724 342351
8910 342351 323230 322020 311101 306133 333958 344562 348624 351831 338309 334615 361231 332211 320278
8897 320278 325171 314340 318870 321840 322398 312801 310198 320312 305972 313593 320496 369321 418047
8884 418047 422975 416627 420662 434950 432797 438200 457203 443500 429267 442759 421105 420403 415496
8871 415496 423294 427622 418176 415458 410634 399671 406920 430936 424790 453015 481655 481285 460301
8858 460301 484263 520086 512714 510666 503482 490315 503612 506677 508237 517135 507233 479281 470678
8845 470678 462362 444476 411437 371641 350096 324048 312519 321587 340906 338559 324640 311084
8833 311084 283876 259236 232092 203795 190211 189748 220821 258962 306589 351772 450545 553161
8821 553161 634893 697654 732475 773496 813316 837976 866237 891496 938102 1020789 1106081 1179288
8809 1179288 1244996 1336062 1429231 1476109 1481644 1494846 1511433 1554538 1538552 1469112 1411911 1374533
8797 1374533 1336071 1297226 1296987 1320069 1331675 1318046 1335811 1335653 1332083 1295893 1249797 1219611
8785 1219611 1195804 1193161 1152233 1146601 1160169 1164310 1138086 1131454 1131892 1129896 1170018 1180910 1188732
8772 1188732 1195276 1225891 1234022 1253338 1289451 1285297 1297206 1333952 1386265 1406422 1456542 1479065
8760 1479065 1517520 1556448 1598196 1616742 1663466 1736281 1816983 1891230 1942113 1989825 2070777
8749 2070777 2182060 2278031 2370012 2436835 2464978 2460391 2462103 2438082 2406600 2415838 2453982 2501499
8737 2501499 2562874 2637848 2724784 2798125 2891473 2966929 3058409 3165033 3272931 3386974 3475287
8726 3475287 3602832 3722108 3850122 4008373 4125648 4271963 4421102 4575606 4790835 5039628
8716 5039628 5241234 5488898 5743722 6025812 6323566 6630606 6920869 7265239 7696694 8166964
8706 8166964 8665792 9220371 9833813 10558504 11400373 12312279 13357609 14538856 15893165
8697 15893165 17487821 19334630 21499904 24081501 27099063 30574039 34572050 39099181
8689 39099181 44199921 49944469 56564833 64465020 74230635 86637754 102673491 123500969
8681 123500969 150442595 184773832 227305500 277390320 331609643 382624656 420054646
8674 420054646 434281196 421266599 384563153 333705786 279395311 229220016 186716460
8667 186716460 152580400 125913643 105302967 89385312 76993945 67248589 59478343
8660 59478343 53139165 47738347 42930673 38558762 34529830 30867114 27591617 24744008
8652 24744008 22256888 20101908 18247793 16672810 15340533 14183327 13170420 12320777
8644 12320777 11581497 10909080 10249082 9630966 9092686 8626286 8205179 7825469 7464488
8635 7464488 7172137 6878931 6617249 6399293 6191757 5994562 5785694 5604126 5436578 5313838
8625 5313838 5198930 5062815 4965171 4870686 4786254 4711514 4649953 4595338 4558334 4526546 4508293
8614 4508293 4492519 4457387 4446000 4439595 4426860 4434569 4434130 4441568 4447202 4498319 4569688 4592998 4618857
8601 4618857 4679853 4751877 4831379 4889881 4978409 5087369 5193340 5292935 5392406 5520351 5651128
8590 5651128 5842096 6036376 6244806 6477063 6759074 7045315 7322773 7616452 7942966 8332918
8580 8332918 8745166 9201649 9717211 10275277 10933172 11680171 12517155 13412940 14432000
8571 14432000 15592055 16953238 18498911 20243940 22279495 24707532 27541382 30891038
8563 30891038 34814169 39395528 44728102 50934059 58212867 66834877 77264940 90236619
8555 90236619 106658626 127627040 154277010 187502222 227560612 273159036 320623616
8548 320623616 363589273 394292291 406032286 396069611 366782867 324579250 277246869
8541 277246869 231224872 190469646 156511882 129317725 107991317 91408300 78415296
8534 78415296 68111749 59713712 52679393 46618616 41314314 36665741 32636080 29158605
8526 29158605 26201314 23698825 21583795 19755545 18156151 16730832 15428395 14292136
8518 14292136 13280351 12420103 11648187 10902998 10221887 9604507 9041250 8539959 8084040
8509 8084040 7703856 7330027 6940494 6578718 6283033 6035644 5831360 5663280 5531424 5490284
8499 5490284 5595321 5841335 6069726 5897911 5337134 4719290 4278200 3956033 3740487 3535784
8489 3535784 3368274 3257181 3145990 3052701 2955805 2859222 2780788 2721834 2668804 2623647 2533164
8478 2533164 2443022 2329229 2261560 2236686 2184630 2122477 2084639 2056758 2048871 2039526 2047272 2064443
8466 2064443 2082660 2093463 2122732 2202085 2323982 2466435 2595483 2659844 2626661 2553661 2480216
8455 2480216 2432777 2415371 2450616 2507999 2469398 2240575 1968144 1743850 1595049 1501371 1428897
8444 1428897 1381212 1350871 1311447 1288644 1283485 1286822 1245987 1235716 1249792 1227732 1242415 1273452
8432 1273452 1279674 1304153 1367579 1453696 1552895 1650471 1764655 1887043 1986978 1992658 1934394
8421 1934394 1808007 1655979 1470526 1295183 1160529 1061966 982328 877568 804995 781798
8411 781798 764796 762425 750782 733374 704457 655179 639284 626386 628054 645816 658551 675752
8399 675752 706220 712026 735797 776035 821906 865341 900350 894463 855514 811487 802361 796714
8387 796714 757148 722767 675034 652232 645399 654231 620957 579251 559815 519613 500848 473673
8375 473673 470630 469073 481571 466168 419263 408274 377521 338164 317778 326824 349502 373595
8363 373595 375980 349913 345431 362662 368876 390317 372303 343441 337743 369123 405989 410405 397831
8350 397831 406441 398383 364819 347080 306527 286170 279982 289677 288057 283482 297876 271618 269020
8337 269020 311245 333062 337879 340447 330273 314613 328279 327536 324213 320278 309455 323028 317921
8324 317921 316035 341279 343009 334685 328611 316760 338646 326680 333499 324918 338255 352954 374666
8311 374666 391749 444370 500804 479700 428869 376376 351668 332708 318424 346048 333999 321096
8299 321096 320102 358182 404233 428178 417398 428505 422252 424143 397433 383038 371015 379304 381538
8286 381538 395254 440718 451281 447855 482405 527312 564269 600669 681589 767164 890998 1025354
8274 1025354 1165973 1341701 1541670 1786359 1998845 2163933 2259731 2242518 2141885 1971124
8264 1971124 1751966 1521228 1318871 1169794 1021665 878631 780507 677665 620014 578866
8254 578866 525001 482764 462466 427419 375152 323317 291593 283445 273796 232380 193282 156286
8242 156286 135935 127507 100497 94314 110123 156541 148531 133649 138406 149578 148571 157859 159809
8229 159809 159061 156410 159585 168127 169459 158722 158918 132229 150149 165275 171176 171965 159505 146204
8215 146204 129258 118925 111965 118101 128680 123906 116737 118383 87914 75900 80918 98445 126211
8202 126211 132875 108529 131581 148329 124238 114172 104411 89986 93235 79724 108901 148399
8190 148399 148826 136955 118426 127267 164874 153030 159984 154733 146471 123741 114919 120926 146052
8177 146052 148533 138674 133236 114259 110053 109706 129747 151136 153342 131327 136217 148392 161937
8164 161937 181263 185667 184827 208014 216705 184294 190100 203411 237779 228766 254971 296959 330630
8151 330630 336505 338689 374197 404397 457603 522856 626793 718898 832534 992360 1164238
8140 1164238 1345813 1519986 1708984 1857505 1946124 1921270 1824179 1701153 1548962 1371546
8130 1371546 1183291 1015368 868978 744777 665624 569136 478065 423579 396267 356707 318822
8119 318822 290662 267579 239209 240428 247018 236591 217043 186876 151982 126492 131606 136476
8107 136476 140965 138467 117344 113594 115758 101468 100704 91892 108081 107122 112419 121254 123805 105093
8093 105093 94522 99719 80894 76350 47046 63693 55521 65817 76867 67505 27794 30826 45316
8080 45316 53029 45605 56285 67266 43628 38317 40384 62669 51299 36725 56344 70099 83346
8067 83346 57614 56795 68726 40463 15234 46993 72330 75249 53234 63320 64975 58706 44013
8054 44013 10887 10159 11907 21205 26324 31586 32234 21183 18823 44255 53370 57036 34928 20064
8040 20064 21789 37232 36952 15591 -11442 2366 59203 76721 53296 46103 55488 40152 60106
8027 60106 53243 62820 43486 26964 31211 49950 45356 62764 63860 39082 44176 65076 67470
8014 67470 61420 96677 98345 71803 61507 89865 95538 93230 104978 97607 84708 79982 63907
8001 63907 68728 82391 77853 103379 117095 117080 117608 52076 44271 41338 40935 59172 64485 48562
7987 48562 40017 34574 20778 32008 23504 32622 50886 37310 31257 34298 37346 48363 34591
7974 34591 8231 5668 14257 19773 823 857 26011 28126 48322 63857 62568 38504 49343
7961 49343 65813 76412 95723 89688 82704 60256 35092 42211 57813 52279 46749 66421 41932
7948 41932 12711 2584 3406 22857 45622 45205 11301 6463 5503 -21174 5891 16888 11516
7935 11516 48974 32859 38387 45922 47548 63580 68275 65618 41151 22379 25627 39813 60618
7922 60618 65133 69696 62200 45522 53060 50982 45354 24976 64742 63638 39791 19791 48485
7909 48485 36761 12764 22463 31707 44542 61619 44224 36464 474 5124 16372 14198 -1158
7896 -1158 25321 44257 57036 43460 15014 32692 44906 49500 66361 28934 9590 3895
7884 3895 262 -6109 -5645 -11487 -5309 33822 78565 88613 66354 51786 39972 39265 27245 14330
7870 14330 15829 -2762 6113 12526 23491 24229 34927 38680 37304 51280 76435 84275 48942
7857 48942 20617 18696 30696 31958 21052 37272 29725 36388 29563 31924 39768 72576 69097
7844 69097 34978 49249 59502 51937 23122 15361 34337 42688 41939 34424 4863 -21377 -5139
7831 -5139 23574 36938 48305 -267 -30618 -50090 -14357 14040 25499 28251 19434 22911 16685
7818 16685 11017 -3984 -13271 10668 36096 54532 52002 28610 49258 63364 33572 30458 3331
7805 3331 -23894 -32615 -7289 2064 36351 63600 37541 48659 51362 56363 69198 30812 26489
7792 26489 17449 23263 41787 13499 7914 28423 40530 57161 54291 36996 37463 68208 71435
7779 71435 58851 56515 48497 34471 5875 8395 19017 31098 31144 14199 5237 13221 19996 9846
7765 9846 30184 59924 43733 21118 11661 2449 -9033 10426 26813 31486 35094 40109 45010
7752 45010 49043 60738 46845 41317 17959 14424 10737 14600 5238 -4480 -6353 16671 38023
7739 38023 8723 -742 8703 29820 42412 37412 46279 33037 -15516 -28039 -15253 2069 4718
7726 4718 -3210 17445 33789 56231 54106 48113 14914 6278 29472 27589 18366 -17936 -5022
7713 -5022 8614 9229 13628 1416 10572 45556 56034 54048 34090 7150 -2203 -14718 13881
7700 13881 31981 18811 8229 8635 -6976 -5564 1745 -31679 -43324 -20423 6921 -2696 -5762
7687 -5762 13258 25788 13693 16685 21025 -3951 -3753 -4940 -1728 -18910 -22453 -1772 2869 18513
7673 18513 28631 15915 13585 -9557 -19990 -6686 -27399 -25759 -12593 -48927 -56138 -36586
7661 -36586 -25903 -584 32460 50032 54766 81190 71982 41845 34728 3825 -9746 -28257
7649 -28257 -21545 -15979 15067 42295 20999 15735 -15604 -26271 -24916 -10167 -10145 -13354 -6151 -10714
7635 -10714 -6231 10495 13302 17553 2385 -23888 -32886 -38186 -16694 3016 20796 -1189 1875
7622 1875 6997 15321 21924 22354 23551 26750 27649 30924 22101 22668 -6208 -38400 -2107 11848 20952
7607 20952 19832 7710 -12829 4334 23427 9359 -21961 -34898 -15869 -18214 -33739 -4174
7595 -4174 9781 11862 2275 -28333 -40920 -19436 -11575 587 81 10459 25760 18948 -1791
7582 -1791 -19505 -41484 -20165 -8960 -8569 -14486 -12571 15132 21286 2699 -15421 -20818 -25634
7569 -25634 -10001 6191 -1113 24463 39287 24821 7933 11950 13488 -9812 -13365 -9012 -19351
7556 -19351 -20586 -21434 -10892 21832 49379 43833 12933 5079 -22138 -32514 -45136 -48197 -25586
7543 -25586 2213 36329 47044 33848 17870 -273 -7482 -35550 -34547 -25830 -20310 -9062 15561
7530 15561 46121 39143 27929 10638 -28456 -42470 -25713 4015 -3626 -37142 -24577 5469
7518 5469 5692 11796 12382 3946 7410 33013 52759 28806 13281 15415 7517 7584 5664 -2269 -17942
7503 -17942 -54795 -53586 -46836 -11349 5853 24291 45393 36608 8410 -5812 -33892 -11628
7491 -11628 9676 10412 9574 6464 12054 7839 3443 639 19589 26547 26142 -1331 -2357 34134
7477 34134 50915 40838 21462 -1248 -23831 -39175 -13429 -884 13696 4502 -33580 -34359
7465 -34359 -23470 -17954 -14532 -5771 643 20119 20707 18586 12826 -12321 -41856 -30830 -2713
7452 -2713 14630 -1164 -7880 -19400 -21273 -8835 13201 1697 -1927 4115 8136 -1008 -8815
7439 -8815 4046 -7047 3643 15112 -27835 -39474 -33193 -42560 -10506 11355 15634 -4934 -31337
7426 -31337 -21410 8243 6294 7623 -7774 11611 26055 2046 1045 -16848 -27858 -34411 -36688
7413 -36688 -14074 -23149 -59601 -70618 -53594 -26333 -20027 -8505 20395 31447 36236 6194
7401 6194 -9024 -1750 -14401 -25406 -34118 -25214 -2037 -12428 -21765 30134 28308 24319 35665
7388 35665 34256 7765 11230 -6450 -12077 -12029 7806 6355 -2301 6927 14264 -66 -8103 -8126 -21836
7373 -21836 -6963 -15 -34986 -22068 3216 28929 25673 16108 24808 31204 31204 28503 -5923 -42561
7359 -42561 756 23053 15309 1581 -318 -37259 -25996 6710 14698 10947 23584 15233 18454
7346 18454 6366 -15633 -24362 2733 -6277 -8752 -3062 -5749 -20587 -28838 -14454 -7272 -25089
7333 -25089 -42867 -29558 -16683 -26899 -16371 16572 20318 26744 28948 -3610 -4006 7593 -14424
7320 -14424 -22007 -5157 1031 -31286 -20005 -8219 11002 -4760 -47727 -34240 -12379 619
7308 619 41204 30096 -9397 -33125 -11752 -9462 -19690 -6904 2684 -9634 12317 23369 5251
7295 5251 -3157 8827 19048 9201 14150 2238 -30150 -35345 -29393 -18583 -19487 -2889 11347
7282 11347 -16140 -62966 -61184 -44492 -24403 -15358 3630 9723 6376 -21007 -21830 -22043 -22196 3355
7268 3355 -197 -6382 -35635 -54075 -26397 -25518 -39092 -32239 -15831 4764 18574 24464 26748
7255 26748 44133 45922 11810 -16067 -39045 -50616 -23459 6500 -18261 -41407 -30019 -35826
7243 -35826 -40883 -25072 -27696 -54135 -60077 -52466 -52136 -58735 -67946 -55480 -59780 -47655 -40918 -10692
7229 -10692 5226 27911 18177 -4502 -17404 -45364 -50908 -46438 -18943 8055 14518 -638 -13209
7216 -13209 -23280 -31396 -10481 19385 23269 9672 -13968 -22323 -20095 -4649 21475 14199 4991
7203 4991 9768 -18893 -45882 -32331 -28115 -27559 -30511 -13157 -27146 -35914 -32877 -16764 -15625 -26200
7189 -26200 -29753 -32218 -39050 -22702 -5369 4433 -5735 -15263 -12790 -5118 14820 -8888 -27954
7176 -27954 -28031 -21300 -21395 1146 -8427 2773 -9151 -32089 -41308 -8839 8291 12127 9676 -6073
7162 -6073 -12099 -2282 11399 -14379 -20481 7779 20097 27554 36658 33623 41581 51728 48602 54123
7148 54123 12779 -4839 13270 797 -844 451 -11903 -16912 -16029 -10492 17519 7753 -16364
7135 -16364 -19194 -5312 -38769 -29771 -11198 8605 12810 1189 3750 3684 -21436 -41703 -33376
7122 -33376 -18639 4366 7845 -16623 -31658 -42192 -38359 -16973 -27925 -22745 -29444 -28808 -7150
7109 -7150 8021 6636 7749 38218 25756 -10096 -15512 423 6182 -2129 -10185 -8036 -13003 -48042
7095 -48042 -46383 -23063 2807 -16189 -58153 -61050 -22175 16260 -2927 -25844 -39895 -38819
7083 -38819 -46364 -49914 -35842 -12044 -11026 -18492 17121 31211 30067 7559 343 2602 3889
7070 3889 -371 -701 16304 18951 40588 19262 9826 -3878 -6935 -2527 -1865 -3187 -7075 2079
7056 2079 -11797 -7078 21736 26854 -5536 -20585 -3923 -4699 -116 3709 16461 2814 -13377
7043 -13377 -6164 -1727 7040 5653 -24599 -27946 -25571 19032 48174 27779 -4866 -33150 -25032
7030 -25032 -18419 5102 -3676 12849 31910 15347 -19300 -23941 -22240 -16972 -10110 -11619 -22314
7017 -22314 -10413 -7782 -5908 -13721 -13716 -22182 -57717 -46723 -16888 -18744 -997 13093 9382 22066
7003 22066 9413 -36682 -42722 -23802 -19201 -7041 -16664 -22768 -1527 27583 18241 -5354 -20238
6990 -20238 -32461 -43401 -41621 -26402 -25226 -27663 4336 26379 23500 827 7580 2835 7525
6977 7525 33828 42116 38763 11723 2474 -6165 -11138 -14507 -18371 -38514 -18233 -3768 6434
6964 6434 -4764 -23529 -17041 -4723 -19243 -29867 -29448 -36815 -30281 -21889 -36353 -54219 -57520
6951 -57520 -64404 -58728 -45542 -37198 -34885 -60524 -45418 -27775 -32717 -31499 -31378 -8568 13148
6938 13148 13420 753 -26660 -23335 3766 25433 38715 3535 -18909 -14553 3724 14171 6509
6925 6509 -15499 -14895 14970 -8561 -5715 13148 20352 11990 2701 19335 9267 -8654 -7254
6912 -7254 -884 -27518 -36548 -34831 -33091 -42462 -53331 -39139 -7439 2640 -10037 -26226 -30152
6899 -30152 -7778 -1079 -1997 -8524 -22889 -16610 1288 24243 41696 30413 18433 30977 47441
6886 47441 -1206 -28583 -10144 -674 18503 38024 30390 9576 19430 19308 36526 54093 50620
6873 50620 33303 38907 25205 -5689 -19395 -17676 14394 5331 -12465 -26667 -6268 23340
6861 23340 14794 -13603 -24383 -8839 835 7140 18747 27873 26275 2231 -41061 -30186 -33120
6848 -33120 -655 -6006 -12422 -8326 -7624 -9489 -16042 -5623 3225 -341 18167 35662 2103 3181
6834 3181 -11792 -13021 -28609 -26232 -16152 -627 12788 14039 20617 39807 11327 -12063 -26526
6821 -26526 -18911 -11623 -19903 10312 26173 7349 575 -1739 2298 -13562 -16817 -23140 -35044
6808 -35044 -31615 -3476 11285 -292 -17143 -29856 -26400 -15625 1577 -13664 -22180 -3354
6796 -3354 -8263 -24118 -15436 2200 -4910 -10746 -33327 -10472 -6013 3668 -1572 452 -6520 -9160
6782 -9160 20168 49624 19564 -1628 17358 27682 -1053 -6693 -22778 -18225 -29681 -38871 -24836
6769 -24836 -19552 -29019 -58 11627 -10246 -11968 -320 -10480 9627 -12917 -35153 -28076 -51292
6756 -51292 -85012 -67090 -30049 -31675 -37508 -33156 -22999 -27825 -27299 -13926 -989 8741 1379
6743 1379 -22365 -20301 -27675 -54429 -51116 -28332 2485 9492 21777 31031 23652 24491 23147 8217
6729 8217 16337 28950 22803 37079 19628 3185 -12402 -9046 -10399 4229 783 -17079 -5694
6716 -5694 15161 23129 -4287 -15617 3 7239 6347 -10602 -49090 -81005 -48510 -26686 -34585
6703 -34585 -41532 -55450 -69585 -53385 -8624 -1120 -16165 -13919 -13185 1373 -11089 -26408 -37678
6690 -37678 -34184 -20680 -5584 -31928 -14777 -9405 -32269 -43131 -20853 -12400 -32546 -49956
6678 -49956 -30750 -13368 -30275 -36452 -34663 -39373 -15661 16960 8282 -42699 -63581 -61373 -50827
6665 -50827 -24661 7495 22535 6805 -21614 -62164 -48690 -37075 -50856 -33240 -15560 8608
6653 8608 9116 17434 25501 14534 54235 37016 -13007 -39069 -41935 -16646 9558 47494 84177
6640 84177 82244 71054 49740 10707 -12652 -13363 -30129 -32979 -26095 -20979 -24212 -43602 -43808 -26170
6626 -26170 -10312 1263 6335 -15241 -19107 -5404 8243 28264 24885 13787 -9155 -24226
6614 -24226 -23245 -42226 -19858 -432 -20461 -30953 -2352 11781 17092 4660 -21873 -51639
6602 -51639 -35675 -11515 -25519 -23460 -12500 -10591 -15710 -39980 -41619 -30574 -13784 -17585 -21564
6589 -21564 -19548 -13978 -1359 3626 -1824 -12149 -9570 -11313 2072 14901 20333 31835 13451
6576 13451 4158 2804 508 -9014 -7729 -12166 -873 342 -8151 -1987 18275 6560 -864 573
6562 573 -11540 3429 -4119 5416 120 -3065 140 -2316 -7799 -11980 -3650 -21869 -26004 -29459
6548 -29459 -26243 -9245 -16912 -41997 -64777 -48154 -3505 400 -37624 -34954 1421 -8821 -25502
6535 -25502 -5306 122 5948 -13500 -24338 -9973 -750 -11703 -11578 -12118 -31409 -20834 2311
6522 2311 42301 32791 7634 5298 12391 22840 11950 -34227 -40898 -53569 -67140 -61673 -39008
6509 -39008 13888 17272 13656 20490 12432 14916 14915 13916 1021 -17946 -11840 -10923 -1987 3768 -14617
6494 -14617 -14694 12554 8277 -14269 -31238 -34769 -58384 -32106 -15875 -7170 175 4114 20607
6481 20607 39960 49490 57475 66336 60633 23538 17908 4822 -9285 -14075 -39321 -36096 -11107
6468 -11107 -20041 -21954 11430 4158 -3342 -21888 -6022 26123 -1633 -2896 -12363 -10939 -4142
6455 -4142 7956 1896 -23123 -8301 5763 8958 -8325 23868 62706 92012 73760 33150
6443 33150 15000 1109 -21051 5202 20975 25684 23003 455 -26123 -24514 1838 1560 -14056
6430 -14056 -41478 -21472 -13250 -17124 -1725 -20512 -45797 -49453 -53786 -28828 7606 -7851 7636
6417 7636 -21475 -35268 -26469 -44632 -34537 -13759 12183 -8236 -35885 -31816 -34717 -31466 -51163
6404 -51163 -47082 -54653 -55579 -38322 -36481 -65721 -76574 -63224 -33828 -31199 -43672 -53719 -64378
6391 -64378 -46364 -45519 -73755 -58304 -52755 -54964 -29746 -22570 -9648 -4597 16382 25810 25533 7086
6377 7086 -24176 -34294 -19886 -3090 27669 -7891 -27799 -45871 -25676 -577 4418 -7803
6365 -7803 -9641 -27077 -38848 -46244 -26457 -18831 -22255 -41277 -55126 -56228 -45053 -43306 -41428
6352 -41428 -36326 -29544 -9439 -34402 -44012 -28043 -24624 -9138 15105 10936 4807 13871 5390
6339 5390 32105 14568 -28575 -13177 -1318 -17949 -14877 -11984 855 6203 17718 -2549 13277
6326 13277 14579 22234 35233 41898 11280 -11122 -39799 -41313 -62787 -27208 -20114 -17001 -2309
6313 -2309 -302 -12586 -5494 -2951 -6428 411 -3364 -19924 -32743 -20037 -24334 -25293 -13747 19663
6299 19663 31016 31028 5920 11858 25044 8956 -511 41582 69363 53720 37782 31850 32334
6286 32334 25435 17849 22954 25011 7913 -32291 -45891 -40229 -33361 -15542 12741 41910 55371
6273 55371 39512 21174 44636 68341 41913 35903 3474 -19103 -25403 -27996 -28893 -45894 -36317
6260 -36317 -57375 -76219 -62837 -30959 -10631 -12680 -21176 -49336 -43985 419 22210 -15215
6248 -15215 -33217 -43053 -50169 -26892 -14279 -18150 -37193 -29172 -16169 -8080 -17610 -30543 -6057
6235 -6057 10875 12448 4893 10668 33838 45302 63622 60437 36690 9916 11509 24027 17202
6222 17202 1123 -15639 -26610 -26592 -18365 14453 14326 -6369 7184 -7193 -17144 -19257 -40162
6209 -40162 -26745 -26070 -22270 -20815 -17106 7623 26791 31732 11595 -8616 -11202 -10318 -29890 -38404
6195 -38404 -29140 -13962 -4211 -2443 3403 8707 -4127 -34600 -27902 -8544 -2872 -41596 -51841
6182 -51841 -37368 -41340 -21356 4633 18045 22715 -1611 -1154 -12495 -9191 15486 31772 57047
6169 57047 41193 29075 9777 7157 22017 18546 24896 6114 -1833 8429 38469 35627 26415
6156 26415 12093 -15025 -26149 294 6326 14445 11347 9487 -3195 -5798 -8065 -44356 -45184
6143 -45184 -30592 -4387 -6899 -9639 -29610 -31155 -10106 -8925 -22883 -13215 16442 27306 15074
6130 15074 -3921 -27766 -43219 -36893 -22510 -19027 -10637 2299 -31534 -70393 -58052 -57124 -42839
6117 -42839 -17899 -29084 -54512 -76373 -61605 -27073 -21 -3946 -20038 -35362 -38455 -26551
6105 -26551 -1317 -10318 20426 51595 29435 4646 -11885 -15711 -4439 -18871 -15495 -13643 -5764
6092 -5764 9665 26349 27514 39438 33152 -16452 -30336 -33034 -13638 -10045 -33958 -24701 -8966
6079 -8966 5012 16937 32307 21821 -22599 -12729 -10714 -22636 5350 14172 -986 1648 9353
6066 9353 -4086 -5988 -9555 -1246 2739 12126 -1868 -12374 -14360 6434 22656 11225 -18432
6053 -18432 -21906 -15745 -10094 -11372 -18346 6909 2087 -28556 -46968 -43049 -3839 21279 20270
6040 20270 -9915 -39015 -50727 -42462 -19243 -18146 -26109 -35740 -25125 -3970 3413 11384 22209
6027 22209 28333 51887 6966 -6658 3016 -757 -17972 -16172 -5926 -13216 686 12595 16082
6014 16082 13973 11356 803 -24223 -30612 -29355 -9393 -31044 -43061 -46610 -30131 4346 12198
6001 12198 -9944 -20809 -47822 -73788 -51302 -47291 -43995 -30153 -28663 -34834 -14944 16258 7735
5988 7735 30030 43185 40375 25309 -2949 -14856 -11512 2472 8271 28864 21947 -39401 -42472
5975 -42472 -7372 -14218 11957 -987 7104 34027 55660 42621 -2943 215 -6476 -3279 -17714
5962 -17714 -38489 -32943 -12494 -18053 -3692 2846 -5459 -21930 -36897 -18868 403 12356 13296
5949 13296 2822 16874 34786 24986 13714 -3701 -9648 -2825 -38354 -58705 -41867 -1955
5937 -1955 17316 -4251 -19047 -43828 -77124 -68285 -59753 -53499 -66426 -29523 5704 59722 42078
5924 42078 1815 -8202 -14730 -33133 -39859 -2880 -5586 -686 16375 8128 17756 -11653 -30957
5911 -30957 -33093 -16466 -15365 -8078 20932 26801 12297 329 -18326 -36263 -36753 -36121 -57674
5898 -57674 -64921 -64879 -74147 -52308 -22673 -35770 -50343 -22898 -9785 826 16671 37666 21783
5885 21783 -3835 -11127 -490 -6099 -18166 -12330 10140 6512 -1585 -9389 -24585 -33298 -27470
5872 -27470 -26732 -25585 13335 -818 4998 15976 182 13607 17650 5404 3406 -5023 8073
5859 8073 19179 8391 -8242 -649 22220 36527 16428 10895 12468 16891 10557 32620 46388
5846 46388 52064 35922 -11352 -31078 -37744 -38377 -51232 -55344 -54665 -59281 -54083 -36644 -38991 -53256
5832 -53256 -43866 -32192 -29876 -10342 -3193 5389 18499 13856 17962 14208 29923 24979 33846 42378
5818 42378 33069 17192 -17373 -36024 -30486 -36901 -15608 -3382 8992 12473 -997 -14319 1014
5805 1014 -15084 -37295 -27137 -51879 -42322 -34032 -33664 -45697 -38114 -6772 9475 -1032 -4540
5792 -4540 -18969 -9150 8597 15806 26241 2725 -13386 -2928 -2377 957 -4106 3633 6569 13406
5778 13406 13617 -1901 -28630 -34405 -5879 13173 19087 10825 3948 5755 -2619 12358 10208 31319
5764 31319 21070 -11673 -38228 -58979 -43787 -22283 -13234 -1242 -556 4162 46524 77884 39307
5751 39307 19347 32829 24823 -14952 -9806 -17026 -23114 -18131 -7387 -16851 -2505 22652 26700
5738 26700 11041 14827 -3550 15647 12840 -7673 -57743 -47835 -49515 -32358 -6310 3894 16969
5725 16969 13260 14326 -13296 -15466 -3420 -2776 -50317 -48772 -13205 -22883 -32494 -30920 11652 15465
5711 15465 4829 -14598 -3219 -9987 -10515 -13245 -31252 -30757 -34560 -43902 -33068 -7023 -5338 -21966
5697 -21966 -33967 -15095 -8353 -18826 -5359 14115 25171 26513 7352 -21458 -18405 5080
5685 5080 16924 6508 20385 918 -30722 -48801 -46976 -5138 -2002 -26065 -5708 12472
5673 12472 -7329 2213 -3060 -18692 -31860 -19338 1731 11447 12451 26507 23008 -15346 -24176
5660 -24176 -28812 -9013 28432 27268 -509 -6687 -21921 -43266 -23471 1534 1823 -18142 -12712
5647 -12712 -9393 10033 6841 -4192 -4480 17045 8971 16496 20153 19377 -14256 -23431 -32323 -41324
5633 -41324 -7864 4804 12535 731 -9267 26542 36317 26278 12105 -762 -17455 -32739
5621 -32739 -35140 -38350 -33591 -32877 -38481 -23706 -7796 5702 -16945 -41536 -30421 -506 13403
5608 13403 24176 30572 30193 32096 20112 29483 19803 -18449 -36505 -31530 -25685 -23406 -39103 -39494
5594 -39494 -25957 -17054 -28710 -11036 9688 -2465 -29298 -29038 -34821 -51952 -65589 -50724 -40574
5581 -40574 -31974 -58778 -70194 -38916 -28357 -11706 1707 6093 8986 29 7218 42609 14861
5568 14861 -3031 29155 20207 -8234 -31692 -39155 -8793 11126 43503 79925 50131 28185
5556 28185 22728 17398 4500 3335 -6819 -24472 -26383 -17767 -24531 -27667 -18366 -23843 1408 6705
5542 6705 -3631 -27114 -40560 -8394 -3315 11440 -687 27284 17097 29633 38824 49292
5530 49292 59978 42990 6595 1138 20537 5803 -18953 -37449 -27999 -33114 -5692 14823
5518 14823 43405 76347 72932 45487 -7202 -47995 -65429 -41731 -23921 -29094 -42229 -8896
5506 -8896 18838 26635 21613 -1503 -19995 -13067 9378 4891 5168 23186 -11693 -29129 -19823
5493 -19823 621 10343 -29 -11714 -5537 5919 55 -3527 -15622 -13443 -3037 7230 -10881
5480 -10881 -37512 12477 29439 20076 8476 -10961 -42556 -57044 -54117 -50290 -44685 -28177 -2994
5467 -2994 -6297 -943 -6391 -27829 -36002 -43020 -48364 -52335 -39668 -41811 -24050 -11640 18679 33162
5453 33162 8533 -21543 -51725 -35288 -30994 -23404 -36182 -22677 -32038 -20286 1672 1199 -33975
5440 -33975 -30163 -7211 -52752 -60905 -67366 -55638 -19654 4778 12768 4625 34543 30229 393
5427 393 -7944 2165 6288 -120 -14304 -28980 -12255 8554 16146 27126 35163 33544 40074 41376
5413 41376 36286 18633 -7762 4453 36932 30960 20322 -21420 -41278 -18472 4075 1415
5401 1415 -17076 -42486 -22073 -29853 -36078 -34696 -15664 -3346 6612 21691 17570 -26862 -57142
5388 -57142 -53612 -56703 -48690 -25365 -43860 -58271 -65678 -62255 -50325 -61374 -45288 -20390 -19829
5375 -19829 -17575 -11993 -1744 5550 12099 10867 17427 20087 -8803 -18229 -3187 -14396 -923
5362 -923 -11280 -23891 -9293 -3969 -1562 -3298 -660 14834 5756 -1136 11522 -48 2625 11158
5348 11158 3191 -7392 -21794 -9920 2089 24968 22469 7338 -10899 -7372 798 -29392 -25866
5335 -25866 -30202 -44150 -7009 31147 30609 17180 8508 -26041 -18024 3587 2045 214 -994
5322 -994 19361 36906 24715 26790 21753 28973 38343 1918 -41455 -46429 -34961 -49027 -33900
5309 -33900 19578 47026 24155 -24814 -72593 -70547 -51944 -24879 -3251 32726 50004 35050
5297 35050 14057 10751 27616 22052 201 -25007 -18838 10162 7300 -4311 163 -11940 -36774
5284 -36774 -31444 -16516 20139 32614 15614 10406 -1754 -1533 -2042 2299 4517 -28320 -37789 4113
5270 4113 37279 41277 15616 -3710 -13326 -6119 -1092 3179 -21955 -40611 -48622 -49848 -31331
5257 -31331 -15483 -29726 -46930 -27251 -23714 -8284 -1534 -16526 -7528 -12474 -28211 -31915 -11947
5244 -11947 12213 18844 29838 32881 -10803 -25574 -34329 -66209 -59033 -48044 -26989 -4329 16373
5231 16373 11758 13192 16525 -2887 3114 26937 17079 3809 -13107 -18906 4996 46471 47510
5218 47510 39364 22843 8062 23498 10069 -2873 -25646 -40811 17816 56865 40170 33597
5206 33597 25154 -738 4801 838 5575 20300 60543 43946 -1508 -36549 -24934 -13014 -7566
5193 -7566 -10523 -13578 -23336 -26359 -8650 9609 -18583 -21841 -21396 617 3241 -6228 -31608 -48557
5179 -48557 -44039 -33213 -5777 2733 -9422 2373 5025 -13899 1962 13988 1814 -21721
5167 -21721 -49050 -61591 -72880 -44252 -4077 33476 46519 31008 38166 41736 17924 -13782
5155 -13782 -18607 -12625 -28272 -36978 -36639 -33260 -27923 -11278 -14370 -5535 3680 -9551 -15879 -8028
5141 -8028 13280 -20088 -24651 8609 9698 3606 1176 19248 15639 22527 35708 30554 14694
5128 14694 -2457 -6850 -11112 -26466 12480 47728 34078 12091 17321 -7012 -845 -6081 808
5115 808 -28956 -40980 -26013 -31171 -44611 -22995 -21876 -3926 -13838 -36297 -26834 14262 3310
5102 3310 17686 5641 -6412 3756 -1077 10631 -118 6316 5113 -7242 -24657 -39918 -50266
5089 -50266 -39692 -13339 -41387 -27462 -8762 -2639 6798 19374 55810 59896 26005 7844
5077 7844 13832 5605 -24275 -36064 -9801 -23021 -17056 -14695 -11866 -11386 1742 39996 55539
5064 55539 38020 32527 -8340 -33322 -17612 7702 28496 35393 41087 43803 41251 26849 22317
5051 22317 18354 9091 -5222 -41175 -33733 -9483 19808 46474 40527 35871 32334 14267 7419
5038 7419 26904 19822 -5948 2734 -20563 -42891 -24203 -18147 7418 21063 21836 1481 -15407
5025 -15407 21729 47702 16310 27167 22085 26873 20352 3439 16190 2826 -8360 -11693 7051
5012 7051 44098 34570 1196 8477 7844 -3513 2098 -12152 -9241 -2680 -17198 -32706 -16568
4999 -16568 -3354 -25067 -1047 38789 38388 42374 51800 56547 29018 174 -2195 -9240 -53
4986 -53 33566 44079 11848 -20675 -11823 -47942 -39041 -15334 -2595 -3826 -37819 -42961 -23385
4973 -23385 -11436 -10011 -9254 10287 16272 30545 50645 63318 47014 22364 25261 934 -31136
4960 -31136 -42494 -41569 -46081 -44542 -29172 -13070 -24185 -25057 -34728 -30193 -16185 -8017 -4113 21691
4946 21691 24190 3284 -6910 -29445 -32396 -43208 -25117 3253 22182 27135 6248 -28508
4934 -28508 -36914 -39676 -53114 -49493 -63 24233 15402 -7453 -31999 -29730 1404 19067 30968
4921 30968 10579 3273 10168 15296 15234 -6921 -11055 7487 31237 29745 2513 -15313 4756
4908 4756 26710 4451 2876 -33718 -31430 -7216 6672 1916 14154 26821 5709 -8119 -25122
4895 -25122 -38227 -40694 -48504 -67977 -59068 -39388 922 20597 6870 -22087 -39026 -21267
4883 -21267 -9186 -20618 -2754 -8752 3093 -10818 -15562 -9046 -16069 -16153 -18381 -15427 -4781 -9697
4869 -9697 -12278 -45409 -37389 -40355 -36178 -2099 3977 -9911 -24904 -38755 -23507 -19079 -20967
4856 -20967 -7786 -1574 9144 -8037 4249 34952 21570 13049 5985 25838 55264 59884 12773
4843 12773 -20839 -17530 -55110 -75435 -43344 -13090 4617 -12430 -5329 503 11762 -6068
4831 -6068 -4889 -16626 -10532 1460 11790 6722 -6575 -20755 -16734 -23182 -13212 17060 23971
4818 23971 19092 -9176 -41027 -33175 -17795 -41694 -48444 -25042 8777 16816 3451 -4577 10598
4805 10598 5217 20994 14426 26304 17969 30671 8956 -5959 -10212 -8906 -15177 -8253 16778
4792 16778 13537 -5102 -36971 -36800 -29649 -28733 -30110 941 -10238 -26135 7690 7367 -9950 -6758
4778 -6758 -8314 -11829 -21548 -40421 -25864 -25239 -30568 -16126 -18507 135 27828 26704 1267 8857
4764 8857 -5631 -26797 -26753 -45139 -37074 -29375 -20263 -10441 -24727 -66848 -46584 -22469 -14320 -23877
4750 -23877 -36235 -21921 2959 -13582 -27341 -20700 -24817 -1375 16440 -16262 -28968 -36392
4738 -36392 -45658 -22262 -12762 2565 -2840 -10772 -17709 -16519 -12843 -27024 -43559 -67625 -53968
4725 -53968 -34089 -13243 -2413 -18354 -36000 -16937 -16323 -38393 -54480 -47528 -5178 23551
4713 23551 25520 2439 -2815 -25312 -30289 -24779 5466 12099 14110 23736 44696 36327 16155
4700 16155 -15201 -51902 -67472 -29285 8291 24698 10979 -5730 -18158 -11360 -2335 10945
4688 10945 -13011 -33401 -10265 6491 -20413 -28612 -16222 -59420 -71734 -58079 -19212 -3430
4676 -3430 6421 11672 16097 22217 -12800 -14553 -15979 13049 17150 13648 1233 -11276 -29376 -33645
4662 -33645 -54748 -43733 4888 3766 15296 12699 21944 30268 46786 55977 16135 -4923 -16764
4649 -16764 -4416 -13222 -19950 -4039 -13382 -38665 -41033 -28143 -4882 21788 7844 -17725 -18359
4636 -18359 21109 21447 11670 -2883 -25164 -42010 -39323 24618 45562 19952 -9227 -6038 13464
4623 13464 -12978 -8968 1779 -18978 -22304 -23196 -17106 -16752 -16115 5507 17536 32264 45917 22629
4609 22629 466 -18699 -16105 -23898 -26685 -21385 -21756 -13555 4025 15987 8543 31295 34589 8139
4595 8139 -15272 2513 18781 33522 37943 44144 42414 -2508 -28871 -50936 -36158 -16126 937
4582 937 -28776 -39970 -41489 -39596 -12172 -24491 -44781 -37737 -36879 -26386 -35047 -34025 -42882 -47843
4568 -47843 -51549 -53381 -41703 -34707 -13731 -18866 -14069 3854 -8730 4690 16812 39683 100353
4555 100353 79228 42164 5169 10790 34530 34901 37068 20304 -14450 -9513 -16599 -31307 -34879
4542 -34879 -47961 -38555 -18967 18462 38045 50947 40085 18689 474 5277 -1245 -14519
4530 -14519 -19393 -6443 -832 -2749 -12900 -2890 25551 17134 17166 35492 15305 -378 -18998
4517 -18998 -20906 -33666 -16829 -25742 -50594 -55416 -41882 -20488 7027 6757 7776 -3316 -13197
4504 -13197 -23071 -30865 -34855 -36425 -41452 -40448 -16340 -20189 -24949 12720 25101 32583 -25908 -57672
4490 -57672 -40348 -18290 -2151 -9847 -28080 -8202 16486 17278 15504 1684 -14948 -14556 -1681
4477 -1681 -7983 -18181 -28698 -41507 -35272 -12597 12033 19796 30167 10137 -718 873 18006
4464 18006 -8509 -24917 -6910 11101 6325 -16924 16878 13748 15801 1672 512 9388 -5756
4451 -5756 -29802 -54877 -53225 -39653 -13955 18561 22337 6862 -3498 3903 5764 19158 7677
4438 7677 22823 29714 30010 31367 7545 7271 -20544 -29914 -26624 -11874 -6247 -28344 -39016 -32582
4424 -32582 -34684 -33659 -44348 -27078 15954 48397 21709 10596 -16181 -13467 -2874 -7251 -28927
4411 -28927 -23427 -11420 -14469 -30087 -13060 326 -1293 -879 -6327 -8387 -20164 -25281 -40688
4398 -40688 -43013 -36494 -14801 -2033 7913 16474 -2396 -3481 7959 265 27197 44271 36435
4385 36435 9185 -15694 -4359 -1133 -5863 18847 16709 13907 2898 13199 -6969 -2711 6355
4372 6355 -12214 -24267 -13507 -7935 -13138 -24752 -1990 -1173 27410 23829 3354 -2050 -1804 10348
4358 10348 -2442 -14743 -46220 -53284 -64590 -36297 -7616 12456 32567 30044 5842 5903 20588
4345 20588 6903 -7339 14011 55740 49061 51404 33912 5269 -11750 -12968 -1014 -10836 -18014
4332 -18014 8183 26329 11245 7474 20565 6907 10243 9781 -14756 -19361 -29965 -14385 -848
4319 -848 -4421 -5484 401 -4382 -7796 21213 5455 -14396 -14864 -21143 -6411 10642 -4982 211
4305 211 -21872 -25776 -17827 -2090 -4246 -11235 -3144 -12662 -29591 -39907 -33766 -38092 -20787 -5480
4291 -5480 17340 22347 13152 11523 5394 -8649 -6642 11708 21484 14779 30943 40128 41811 37609
4277 37609 9006 -15687 -33473 -8186 11630 23802 10782 638 -25844 -59501 -69625 -22859
4265 -22859 14238 20693 2408 -10383 -8168 -7324 -24749 -49223 -59126 -48437 -17469 -10014 -10754
4252 -10754 -19619 -18328 -12710 -2870 2655 -162 2001 -987 1118 9968 19242 15735 19949 19127 19595
4237 19595 19855 20331 24818 30157 16679 18158 18800 20575 3223 -9936 10101 7600 -6430 -6939
4223 -6939 31342 12847 -5522 -13148 -11019 -29285 -30225 -12579 -6574 -17611 370 6181 9383
4210 9383 -3541 -25976 -16460 -8731 -26983 -7974 -3139 -21988 -10776 18515 22088 125 -41811
4197 -41811 -44904 -45371 -44655 -51287 -16843 -14970 -26733 -20584 -880 -305 -6942 8859 7161 -8666
4183 -8666 -10142 -26048 -28237 -22404 -16703 6694 12 -28132 -8348 17511 24809 14107 2502
4170 2502 14883 11191 -6438 -19314 -16963 1299 -2924 -211 -8345 -33280 -43718 -44230 -66956
4157 -66956 -38750 21996 5896 -21813 -37898 -67389 -71215 -48141 -32017 -19262 10846 24048
4145 24048 23712 22132 26121 24075 6951 4761 21162 -9594 -35713 -15913 6953 5699 -13464
4132 -13464 -17289 -19137 -26486 -19796 -13918 -5605 1554 -9548 -4062 28599 29013 -3199 -16209 12436
4118 12436 -7619 -21818 -19809 -12918 -21191 -16703 -30210 -27268 -145 10474 1856 -34203 -40911
4105 -40911 -27995 -14254 3943 -20974 -11630 639 14680 -13892 -28557 -8534 -19684 -18511
4093 -18511 -6661 3693 -10600 2703 15780 4164 -1384 3052 16252 9926 -526 5551 -8931
4080 -8931 -9411 63 5783 4371 -10699 3941 10070 15382 22683 23692 9122 19647 7028 -16519
4066 -16519 -19725 7590 6282 -19099 -26880 -25435 -8092 6654 28844 21497 18857 24676 28509
4053 28509 12178 2045 4007 -7833 -16722 -19297 -14781 -502 -13887 -6121 22656 57844 41228
4040 41228 -9060 -50279 -80938 -41326 -5942 -28496 -39219 8780 25114 12550 23799 27536
4028 27536 15988 896 -27829 -55166 -56353 -79810 -90982 -68764 -55443 -30773 -2557 12508
4016 12508 14928 37349 30085 -8572 -13241 -47302 -45808 -16911 -5154 3742 1094 -1696 1850
4003 1850 -5381 14965 15606 12397 58935 63243 35954 16586 -16029 -7759 1458 -13290 -31438
3990 -31438 -34724 -13080 -24766 -48419 -12711 -13199 -11154 -33078 -44488 -49844 -65694 -37287 3475
3977 3475 16164 3361 1945 5558 12420 20053 4947 -24803 -26501 934 -2234 -16026 -40303
3964 -40303 -50993 -61392 -33320 -23277 -50767 -38000 -21458 -6208 -15435 -29557 -26437 -15386
3952 -15386 -4900 5741 7609 13562 2515 -3190 7718 -1951 5496 -6468 -26729 -21590 -27063
3939 -27063 -44177 -36169 -27630 -38090 -70076 -72132 -46508 -36378 -24225 -10626 -15735 -39296 -61226
3926 -61226 -57138 -34274 -17749 -3704 3363 4908 13920 16869 25620 31053 13075 2653 -3580
3913 -3580 1614 -2284 6888 -8713 -10064 10781 -1351 -24304 -10195 -7493 -2234 18978 21809
3900 21809 32702 31991 24224 3946 5536 -12708 -20674 1650 -13082 -27680 -16106 -8703 -5522
3887 -5522 -9751 9374 33071 16145 -20066 -39233 -19538 -19102 -25507 -21098 10025 17120 14697
3874 14697 12490 -144 -10131 -24836 -8172 -1959 -9000 -35776 -42693 -35939 -2317 18357 12322
3861 12322 2954 -6536 1535 -985 -12179 -12902 -20418 -10779 -33344 -20354 -6686 -19187 -23066 -25012
3847 -25012 -18826 -11343 -41008 -34859 5525 -6805 -24929 -20682 -38 -1366 1406 7076 -7395
3834 -7395 -30754 -24278 -21408 901 3560 877 3500 12438 17759 30230 43728 53976 80451
3821 80451 58768 50913 50799 35526 51439 33824 23637 34555 14683 10247 578 -9180 -2867
3808 -2867 2347 -1284 2574 -17231 -20413 -27345 -24254 -47177 -62054 -46279 -33450 -21271 -22803
3795 -22803 -23857 -35365 -26178 12560 23379 4046 12712 13052 44297 23987 -6457 5702 -12973
3782 -12973 -31286 -32279 -35274 -13465 5001 10627 22104 37287 18923 -9146 -28026 -31438 -24937
3769 -24937 -5991 -6646 -2532 -17991 -4105 12648 24432 16259 12162 5590 15471 18885 3080
3756 3080 4050 5976 -8287 -20788 -22011 -6510 -6849 -9295 8889 5818 15662 -12153 -51602 -62447
3742 -62447 -54640 2639 15540 1181 22900 33193 7795 -10338 6438 13484 15115 8483 -4864
3729 -4864 -1510 -14372 -13131 -5134 13724 26907 -5980 13695 14633 5624 16716 7780 -7548
3716 -7548 -1156 26280 20203 31357 22916 24340 16115 10967 2803 -8077 -14988 -21294 -43610 -42106
3702 -42106 -42622 -26908 -19212 -12323 8313 42400 46004 22776 7216 -6332 -4958 -4115 18440
3689 18440 56442 48620 35018 11793 -1027 2171 15492 4687 19106 35498 27839 35725 34645
3676 34645 20947 3416 -4188 -13908 -18747 -33150 -17778 -14165 -28229 -6079 10811 -5340 -19979
3663 -19979 -38276 -13796 4339 15452 20848 26154 24303 28929 13719 -19367 -28863 -11317 -19686
3650 -19686 -28714 -45180 -57663 -42067 -52419 -47801 -43211 -36279 -17953 -14576 -20996 -30975 -1613
3637 -1613 25813 44100 37509 5978 11256 28281 28020 -13324 -12181 -4776 12756 22460 14183 -17481
3623 -17481 -22933 -7959 14710 23635 21074 43417 35854 13308 14332 11107 166 -13207 -35761
3610 -35761 -53195 -56685 -62449 -23531 -14661 -25053 -21268 -15559 -10677 2995 33716 45246 45474
3597 45474 33484 32855 10679 24514 28645 15339 17714 18039 -3168 -15310 20030 45276 16475
3584 16475 -4663 -40067 -26640 -2836 -2602 -2198 6499 558 -12633 -6874 -15178 -17372 -11826 -9302
3570 -9302 -2826 -17145 -8692 -1380 20508 29423 37961 -9629 -18709 -19545 -14985 -24712 -13490 6267
3556 6267 -13920 -680 -2608 -15555 -18550 -15887 -19969 -34969 -39904 -30026 -31978 -43109 -23474
3543 -23474 4071 4501 -6958 -31071 -39601 -7300 9826 -9337 -4571 717 390 3254 -9797
3530 -9797 -26647 -17203 -61 -9972 -16682 -11918 -13266 -38804 -30954 8388 22338 7411 6965 -5422
3516 -5422 3911 3759 -22363 -30694 -43913 -67806 -52090 -9850 -11988 -9193 8815 6944 25370
3503 25370 30668 26009 998 -23256 -15327 9439 -4058 -3905 28041 39405 18984 25900 11012
3490 11012 14770 17545 -9060 -40096 -5454 16457 7572 8735 18653 12779 28483 40789 18139
3477 18139 -12039 -13985 36735 27536 7749 9800 9651 29988 19714 829 -5587 16022 36052
3464 36052 46952 59080 43329 32066 26159 4104 -5181 -11967 -8576 -4563 -3420 -10980 -33149
3451 -33149 -62985 -54835 -37663 -4156 -2234 -21482 -18465 -4615 -12666 -26759 -30014 -18961 -12641
3438 -12641 -28687 -37079 309 46667 39684 -2299 3178 25891 52358 51663 48083 18954 9499
3425 9499 19967 11291 -1622 -36823 -30261 -16092 -8825 -15927 -7053 -15132 -15066 -12820 -31109 -21205
3411 -21205 8048 31272 27483 27773 23191 35557 31970 11284 -5107 4237 13223 18549 8237
3398 8237 -19133 -33417 -35859 -38146 -23435 -32593 -29416 -14419 463 23232 15743 7407 22248
3385 22248 16797 9023 -13744 -10729 -11967 -21606 -45162 -40220 -60907 -42269 -8969 7786 8666
3372 8666 -23989 -7935 10189 28011 15734 39346 47603 24596 -8270 -5080 2312 3333 -6978
3359 -6978 -20476 -12925 1441 16927 36722 45163 39218 1395 -34178 -40270 -28372 -34419 -34342 -32532
3345 -32532 -25972 -28142 -33974 -17415 14474 48666 58644 43755 20621 16136 -2107 -25158 10353
3332 10353 41848 39999 18004 -23901 -32273 -17480 5007 13241 -9493 -24219 -17748 16119 6646
3319 6646 -5802 19133 8125 13842 -1917 -25726 -44028 -24323 -507 7942 -11768 -10160 -24363
3306 -24363 -52432 -64914 -43569 6246 21053 4865 20452 9860 3734 -6290 14107 19080
3294 19080 -3016 9049 16161 12163 22644 25876 15371 16679 -8449 -39664 -39313 -3851 26184
3281 26184 37987 24177 -7134 13695 15205 10456 21569 9576 -23922 -30416 -15796 -19192 -18190
3268 -18190 -37453 -18335 -22478 -19473 -5644 11852 15614 5909 -2332 5689 19587 10946 8470
3255 8470 -2803 -17452 -1017 -12901 -33560 -11259 -12714 -24787 -9382 -1067 14893 24668 33586
3242 33586 46231 27520 -5134 13195 36046 48458 35160 1280 -9158 2190 -20937 -48270
3230 -48270 -39065 -13545 25140 -1077 -652 -30172 -46658 -32994 -4688 21362 38540 53062
3218 53062 68369 51804 34366 371 -21674 -4945 -13931 -17944 -9153 1094 9737 1847 908
3205 908 36828 49523 40443 7054 -33587 -16788 3639 8355 -7833 -22148 -34312 -25170 -9782
3192 -9782 -13329 -18413 -26380 -11038 -24308 -26325 -9575 12865 14692 24192 22414 40916 37478 15702
3178 15702 14018 27720 40238 40822 17346 18762 29550 42140 24901 19069 11913 24797 9076
3165 9076 5375 2019 -26021 -12181 -35961 -15462 -5594 -27160 -19342 -30701 -41540 -31608 -15605
3152 -15605 -462 13240 17321 19734 6358 -5714 -10435 -4296 22870 29335 20331 4890 6261
3139 6261 3312 7717 5878 1576 -20871 -13951 -13204 -40975 -38783 -26611 -2408 17317 -2357 -3128
3125 -3128 -3128 14051 14570 4388 12782 23523 19438 8038 25127 16557 4723 40779 42482 47446
3111 47446 39060 30834 23409 -20276 -59057 -65182 -44715 -41145 -10015 3835 -6217 -34859 -32798
3098 -32798 -15527 -2028 -15119 -13124 -20046 -41349 -84722 -61494 -45742 -40490 -29384 -25633 -32276
3085 -32276 -25534 -12488 -4284 5300 13543 9124 13646 50487 50074 37877 26295 27685 41845 5888
3071 5888 -19443 4182 19641 15802 -3870 -668 -22539 -730 -1074 -2161 -4440 -22791 -27886
3058 -27886 -30750 -19538 6921 14360 39613 37877 33586 27871 -6671 7526 25476 17494 13492
3045 13492 5845 -4669 15932 -8681 -6866 13670 3822 4251 -12583 64 5175 -2576 -7941
3032 -7941 -18232 -13614 -41145 -42450 -38780 -39885 -20417 -28507 -34684 -8683 14033 -2470 -23609
3019 -23609 -14738 -31948 -21616 1747 -3654 6529 10418 -5638 2279 -3054 841 -3429 -36579
3006 -36579 -48313 -71445 -45206 -36438 -30672 -4666 -23939 -28872 -34307 10279 32963 31993 25646
2993 25646 1319 7500 30202 -6464 -17847 4571 25456 42807 31845 20343 -3437 -527
2981 -527 -11985 8567 26221 21232 13671 -12436 9432 28270 30313 5326 -12328 -35248 -28559
2968 -28559 -33537 -34875 -34191 -45916 -41077 -47204 -39598 -18031 -14902 -14745 -7002 -21850 -13591 -18837
2954 -18837 -1215 466 -12847 -21046 -5053 -10677 -8582 -5193 -30481 -20664 -24051 -34522 -47553
2941 -47553 -50708 -41537 -38380 -24459 -11137 10038 -6859 -19314 -16477 -13916 14339 11331 -952
2928 -952 5358 25493 5679 10865 6109 978 7158 -11475 -26080 -18485 -11996 21702 38919 38970
2914 38970 2490 -17090 -26719 -21026 -39864 -42590 -29136 -17451 -1082 1496 -17157 515 34621
2901 34621 38255 39760 30713 21689 5956 8913 17875 10752 17903 13479 31210 11609 -13262 -37622
2887 -37622 -27382 11679 -13302 -16260 -1436 -5134 -19972 -44652 -46149 -20202 -24095 -60121 -75949
2874 -75949 -49593 -9135 15800 -2263 -8518 2513 12473 -9113 -10074 7565 4831 -29514 -43947
2861 -43947 -25569 -8486 -3018 6655 26446 21772 23856 14651 -5763 25071 35091 35162 11615
2848 11615 23478 27640 33145 31408 -1587 -36511 -30216 -7851 -9085 -4447 16320 8673 -9367
2835 -9367 -24274 -25334 -6894 13106 2212 -13665 -11003 -2357 7164 834 -38532 -26785 -16278
2822 -16278 -5982 -2022 26350 21164 48517 14995 -14554 -19104 -18127 5877 3807 -3311 -21419
2809 -21419 -22179 -19947 -22808 5712 16885 1417 -10208 -10403 -8772 -11383 -25271 -7775 944 4394
2795 4394 17933 20903 26301 5444 -17463 -11433 -21372 -13709 -6433 23109 23833 2057 26791 6463
2781 6463 6751 15697 -16201 -20118 12971 12651 3020 6912 32700 40187 47923 28958 26960 16064
2767 16064 26477 29458 12672 -747 5264 17603 49118 35394 -3296 -49960 -53912 -35039
2755 -35039 -10899 15903 14170 1337 22269 37409 47022 9362 3733 -15098 -16543 -6263 9404
2742 9404 -14679 -26641 -17236 -6864 -24661 -30368 -64654 -68503 -35879 -22030 -30670 -21465 -20972
2729 -20972 -32497 -45289 -41497 -1477 -14590 -4434 1279 -14326 -13684 12839 6731 -2635 -1242
2716 -1242 -8928 -9379 -9956 -7100 -7283 2984 -14851 15619 13899 -14970 -18212 -28853 -14098 -239
2702 -239 -8979 1936 19808 22466 17762 7256 -13015 -27630 -43312 -23330 -24169 -4808 9281
2689 9281 6266 -5174 -8152 -9203 -17500 -19120 -22959 -40345 -48126 -50941 -44284 -17502 -4742 -7318
2675 -7318 -20777 -15420 -12982 -4966 -15114 -9382 -6311 10836 32519 36020 35788 30668 24348 26319
2661 26319 76 -3244 6448 -5193 -1532 22779 19327 9335 -31422 -32779 -12543 -14348 -5913
2648 -5913 11125 22008 13039 7203 11901 -4763 432 -7681 -9343 -2202 -16556 -12050 -18529 -21069
2634 -21069 -39907 -55678 -73934 -41831 -2620 9815 20773 40762 18116 -11178 -2050 8310
2622 8310 40959 46614 26747 29441 59706 31103 -21059 -27532 -40519 -63681 -39948 -32321 -11619
2609 -11619 11159 -9945 -49775 -42512 -11914 -5805 -24290 -12337 -22752 -38588 -32967 -823
2597 -823 26059 47299 31876 5572 8844 6369 -14718 -15334 -7449 -1090 1747 19015 -5332 -19569
2583 -19569 -34378 -36531 -6586 41115 68037 40774 -10012 -46452 -64782 -45495 -21730 -5696
2571 -5696 12235 25646 24351 26920 29682 6532 3618 6466 9832 6933 2610 25708 20283 -16239
2557 -16239 171 4029 -10248 -13786 9073 24138 12816 -393 21556 15386 -2226 -43804
2545 -43804 -24043 12451 27241 9691 -23308 -72840 -59244 -40183 -9875 -3788 4724 -7735
2533 -7735 -46043 -40496 -12412 -3873 -19171 -36684 -10814 14997 10836 -15908 -18023 -33556 -12754
2520 -12754 -7231 -38269 -40346 -30395 -32808 -28184 -27379 -11013 -18663 -28231 -49949 -69119 -49226 -29781
2506 -29781 -28170 -24600 -15690 -23985 -36532 -40996 -17073 -20432 -22116 -20360 -16378 -27980 -8905 24727
2492 24727 43737 46992 42141 22170 31126 5026 -1670 -24448 -29306 -4094 743 11599 8813
2479 8813 -23154 -16196 21847 20386 -3226 -19786 -8216 -22653 -19886 -15871 8901 -2673 -5781
2466 -5781 1559 1321 -9159 -21312 -7021 5552 -6334 -14207 -18296 -28357 -28590 -8469 25128
2453 25128 63251 84852 61291 39384 30847 50360 18517 -23022 -42403 -10393 22614 30906
2441 30906 31268 36744 19771 9075 6857 23023 15507 30306 13231 1496 -2453 22975 44579
2428 44579 48347 48104 16989 -9645 -6230 4555 56 -11158 -3495 12489 23726 11707 25725
2415 25725 16882 1927 9961 17957 -5123 15263 45719 59431 47290 11434 -17093 -27806
2403 -27806 18767 42894 46308 14273 -11296 -2865 -3896 15572 17080 17948 5080 1231 23040
2390 23040 34875 32889 -9965 -30937 -16271 -7801 -26656 -26641 -13278 4292 -485 -3558 -6701
2377 -6701 -18318 -6363 -14848 -16002 11279 -5748 -13354 -13982 -10439 -12747 7852 19127 24291 42441
2363 42441 5759 -1240 7874 16347 -17187 -32595 -26708 -42843 -36506 -31691 -16623 8593 -15775
2350 -15775 -30225 13318 27173 19100 -3574 494 34622 41001 31463 5312 -3595 -34435 -44508
2337 -44508 -23331 -3987 -11483 -28975 -29430 3614 6455 -14183 -20491 -934 11378 19849 64415
2324 64415 79899 80542 53254 47763 26558 11745 18929 30632 21889 7817 -4190 -7999 15452
2311 15452 1585 -24668 -37477 -35098 -16517 -25478 -10409 -6753 -3420 3867 -3702 -13460 -1706
2298 -1706 -3799 -18828 -14913 10732 8093 11858 2249 -22090 -23015 121 1648 -6366 -25483 -23731
2284 -23731 -11136 -24020 -16784 13761 12130 10925 12570 28409 23067 -5879 -30530 -18841 -4720
2271 -4720 1209 -22058 -21454 -9876 -697 -1929 11336 30359 30819 24987 -19341 -40328 -42570 -43320
2257 -43320 -27775 -14965 15240 25583 -2932 -1389 22357 11990 8331 14551 -9400 -859 13624
2244 13624 -10656 -25304 -20449 3625 26741 1792 -27683 -33016 -57087 -49730 -42581 -18579 17339
2231 17339 32454 16324 -2191 -2002 -23976 -31202 -46622 -43150 -13987 -16213 -1956 41897 41924
2218 41924 36341 34500 59211 50463 13784 -22606 -20334 -12580 -41797 -64476 -71981 -51726 -55440
2205 -55440 -49614 -21547 -17028 -5269 -13491 -18117 -6115 17831 36828 35686 56417 39901 18072
2192 18072 13345 465 1013 -4933 -7686 -12376 -34214 -36743 -29812 -27031 -39188 -36451 -35934 -36928 -49279
2177 -49279 -44637 -36244 -46075 -43985 -26049 8139 50482 71258 35593 37768 8950 -3757 -6379
2164 -6379 -15737 -30586 -19682 7456 21781 11767 6954 7285 8091 2846 8503 16857 131 -3019
2150 -3019 3406 927 -9520 18380 9216 9357 15038 8358 24900 22028 38447 41975 31310 24770
2136 24770 47560 58025 38543 36924 47265 52605 56858 77346 49793 25737 27643 33418 61049
2123 61049 42189 30433 35360 45259 51666 27893 26917 9342 -14338 -11479 -18327 -7865 -11450
2110 -11450 -2726 -17732 12713 37789 32254 21781 35169 21960 -1671 1231 -1006 -8941 16897
2097 16897 7823 -2607 -9080 -10399 -5519 -17063 -5292 -5732 -23525 -9940 -17331 -13164 -3931 -309
2083 -309 -2487 -8560 -19552 -35710 -25433 11582 16362 12181 -9787 -30124 -16947 -15688 -12556
2070 -12556 -6231 1862 -2477 4450 -8885 -2617 -18209 -22490 -17534 -10280 2521 7228 19743 35543
2056 35543 35263 22988 7490 21992 23069 8507 731 -6853 30059 45559 28103 30021 34613
2043 34613 36499 30413 -3222 -24588 -32146 -26580 -21876 4725 40523 21329 27704 20718 2397
2030 2397 8957 3902 30326 17782 -35939 -35589 4099 21609 5437 -1764 226 -21574 -41415
2017 -41415 -51256 -54397 -44163 -39684 -20076 6941 3658 7346 5985 1168 4205 -7553 7233
2004 7233 25161 27993 23553 -10482 -7431 18694 47224 36125 3076 -8291 -9042 15516 10968
1991 10968 23436 30159 30166 51509 29090 -5399 8863 31060 34233 9417 -21491 -47 17039
1978 17039 14943 -961 11921 7022 -15462 -24540 10677 47040 79220 38749 -16083 -31077
1966 -31077 -12099 -6906 -4047 1768 1386 -11675 -45741 -47584 -22471 -13661 -1235 12579 12788 -437
1952 -437 4871 22071 29115 26637 24016 9398 -27854 -52280 -48655 -38647 -43427 -39174 -47877 -41261
1938 -41261 -67085 -60922 -18085 -9318 -4808 8380 -3166 -8048 -6489 -26948 -17040 11008 7166
1925 7166 29173 64437 95797 91329 87140 54194 28412 20562 28511 39508 20396 -349 -11812
1912 -11812 -27175 -43356 -29723 -13974 -753 -11227 -5234 9499 12042 15180 18229 28454 31275
1899 31275 23251 5427 -3215 -14612 -18566 1975 -11177 -14506 -17676 -44503 -41128 -34895 -33182
1886 -33182 -8752 13517 30685 36278 30715 14142 18341 35994 47359 42140 22776 6166 -713
1873 -713 1214 22728 29688 1267 -14460 2451 6275 -20515 -36422 -6053 4760 -15900 -20919
1860 -20919 -14824 -16460 -22002 -16683 -5594 19645 12815 21977 30503 23820 -6572 -2688 8854 25592
1846 25592 23365 16271 3116 -11585 -29111 -5982 21123 20762 37305 30233 -2362 -16513 -7195
1833 -7195 -12201 -10682 -8163 14780 -207 -18651 -18544 10149 27169 15395 -11482 14112 51744
1820 51744 77281 62742 31720 5137 1222 776 14929 -1141 3460 137 -29776 -41795 -44455
1807 -44455 -36430 -31338 2509 20043 38816 47033 70254 51003 39942 43671 25669 15756 -22151
1794 -22151 -28146 -21458 -24247 -14548 -1120 37581 41993 10431 -11921 -9054 -15689 -20704 -14251 17394
1780 17394 32173 3323 -6840 16384 4727 6605 -4653 -43129 -63546 -90168 -92303 -59382
1768 -59382 -28381 -24453 -23247 -25049 -4952 14510 43131 44990 51318 50117 53993 38282 -69
1755 -69 -7613 14637 -3853 -32076 -20875 -9424 39156 46773 24844 -824 5824 9484 1867
1742 1867 -3772 -4219 515 -15093 -14382 -13799 -24627 -8878 3266 -25980 -22538 525 12173 12675
1728 12675 5450 -14820 374 5626 -27440 -21632 -6322 -5893 -14855 -10130 -1614 15794 11184 -10591
1714 -10591 -25094 -3071 16395 -12470 -24632 -18153 -28475 589 5317 4465 4133 76 -31501
1701 -31501 -29739 -16532 -22201 -35941 -44496 -47501 -34866 -4630 -8781 -8951 11856 11835 8441 1305
1687 1305 21143 18132 -5431 -10758 -11176 -16306 -16102 347 24742 19480 5173 -2654 -4761 -8446
1673 -8446 3282 23130 -35 -7763 -1919 -2283 18362 695 -987 -16346 4418 28239 1841
1660 1841 -1774 3408 20530 31164 11746 7923 35656 36594 21855 16393 3153 4042 28055 45215
1646 45215 46668 28180 22493 34061 47679 39069 10849 21168 25939 33758 51503 41435 26757
1633 26757 3984 -957 -4153 -8108 -5832 -26 -1094 31961 40457 34638 13483 -6236 -15753 -33099
1619 -33099 -66112 -68910 -46238 -20233 -15242 -11162 -12205 -26910 -26651 -23232 -17294 -2715 2786 31869
1605 31869 29825 16781 4862 3988 -5508 2510 4768 10356 5039 -5743 -14345 -14453 -8316 11802
1591 11802 23801 55200 75684 63104 43802 27873 30371 51693 65536 46238 22288 2155
1579 2155 18835 22039 9250 19911 7647 3321 22291 16219 7676 17553 37739 35171 7960
1566 7960 9004 -12541 862 15249 36911 37725 15251 -2436 -8861 -8789 10648 18333 -2481 -29553
1552 -29553 -20531 -388 -12058 -23413 -39770 -28492 -12654 -28732 -36863 -32011 -407 20506
1540 20506 25705 25328 20278 26171 45145 60372 75180 48112 8022 -16476 -8660 6123 -7513
1527 -7513 -21637 -4432 11755 30299 46757 62198 53093 16560 4529 -3914 9420 23858
1515 23858 44306 41550 45358 62631 60029 26396 30279 17121 4224 -4248 10600 39120 22373
1502 22373 -6436 -37105 -41382 -23179 2180 39865 28975 34878 49646 40422 13960 12430 18343
1489 18343 7798 -15384 -11567 16463 7872 -9587 -5011 20149 35831 33561 25530 47795 31373
1476 31373 18729 35218 51383 65159 61971 45951 3737 -7243 4960 8315 134 -7856 -16248
1463 -16248 -6477 -20123 -2070 -10539 -38695 -11720 18278 11803 376 -5 -4086 11625 63506
1450 63506 84159 39430 20553 6934 -16939 -16062 -18083 -13507 7491 7247 -10645 -10416 -937 4685
1436 4685 14328 -11008 -33278 -16047 -6670 -15851 -22477 -58621 -32386 2652 31863 45380 42530
1423 42530 29364 34975 39404 22478 2084 14137 19984 18415 19974 13316 23111 22828 -7447 8306
1409 8306 14697 22092 18338 6780 -14824 -11390 -7850 443 7793 10829 -5347 -30175 -27829 -27126
1395 -27126 -43939 -59319 -7026 29378 42517 43579 24381 6157 14103 18026 22874 -6580 -10529
1382 -10529 21148 14811 3313 4362 -16269 -15097 8465 17662 1717 -9334 -4830 4749 7928
1369 7928 8270 34853 25053 16357 23484 6262 8515 9846 -1371 -19091 -36492 -52652 -45323 -45837
1355 -45837 -45012 -40128 -27699 -5952 6951 6189 9064 5729 4342 -7528 -55334 -55552 -33606 -20417
1341 -20417 -2638 11166 -419 -27353 -25431 -30535 -24381 -24118 -12214 -17129 -2327 54821 61400
1328 61400 32549 22467 7431 -1028 -1749 -21649 -40202 -33087 -34300 -27810 -17524 2017 26551
1315 26551 28573 6645 1595 -30374 -11371 9860 8426 2059 6260 -12357 -28531 -30435 -14719
1302 -14719 -13982 -7372 345 26084 15504 9971 -1711 -5116 -14543 1888 35185 55166 40958
1289 40958 23014 -7515 -12308 -1419 18863 13875 1935 4543 -3535 18920 29502 25883 14651
1276 14651 -19770 -31228 -20676 17131 9079 -19366 -20939 -1289 -1283 -6827 4493 7424 -658 496
1262 496 25745 28768 33079 26317 7287 17854 52547 40812 12159 7031 -18770 -46971 -56264
1249 -56264 -3088 40300 62791 55927 27119 26624 17850 6748 -2203 14734 -2463 -3724 -4502
1236 -4502 5811 38199 40350 21791 31851 40646 29075 26898 25622 23486 17999 -2186 -4750
1223 -4750 -11787 -28380 -14613 -37980 -54694 -28607 -9275 -8979 -14321 -1626 -10827 -23251 -27769
1210 -27769 -44587 -683 -12116 -26889 -11961 28096 59959 60882 54576 46096 21392 -11851 -42209
1197 -42209 -46353 -31653 -4514 -16176 10363 28800 25699 35496 5377 -1281 -7604 -3179 16486
1184 16486 32423 33062 30577 57287 65476 66520 56772 27231 -4505 -15001 -12647 11030 27940
1171 27940 36888 23922 -9228 -11285 9286 8648 -10125 -3621 -7607 17135 54396 30056 10589
1158 10589 18685 34221 32318 36162 55805 39478 11270 8904 4249 17063 22719 50279 44343
1145 44343 16752 1281 -17522 -15361 10485 19297 -23345 -36121 -2182 28672 33195 26937 23298
1132 23298 36008 16682 -17790 4556 17060 -10678 -9622 -7365 -3601 -5128 42284 36519 36263
1119 36263 34511 6081 -11227 -18853 -34818 -12834 -9663 -4751 -6139 1145 -300 -1228 -3136 3668
1105 3668 3359 12469 21240 12541 -9814 -21990 -9075 12631 44554 45068 1478 3762 20775 12355
1091 12355 26252 19794 9295 -8778 -17830 12690 18570 5438 36808 57798 24275 -14713
1079 -14713 -9201 23618 38044 42689 31421 26967 14881 16549 38712 45980 44283 51683 45538
1066 45538 26561 10854 14083 23577 34506 32573 23598 4134 -21817 -11157 10898 4576 4569 19458
1052 19458 36668 56249 68199 70144 70868 61781 30493 14487 41090 48535 27031 -9414 -6581
1039 -6581 14196 3779 8145 16571 8387 -25936 -31760 -8951 -5767 13169 25101 25673 35852
1026 35852 24730 30701 34524 47951 21689 -19615 -51638 -51969 -28790 -15728 7302 29468 21101
1013 21101 15464 12759 2937 2231 12704 47443 28303 14049 17538 25019 21522 39138 31791 48530
999 48530 67527 63733 56792 28377 10380 18067 3330 -12129 -18057 -43515 -17948 -30887 -5948
986 -5948 19906 -4389 -17645 -18954 -17557 -12288 7035 6069 -4908 10317 11709 18689 40734 26751
972 26751 2721 6558 1310 -15848 -5370 -12060 -9750 -15189 -11227 -6573 -16609 -20176 -12952 3567
958 3567 24727 5376 23071 55419 45141 23177 15261 34374 46333 40764 44052 22531 -4297
945 -4297 -20244 1940 27107 21550 788 29393 35875 15487 -5357 -22446 -8862 317 7302
932 7302 46300 41522 53827 46748 28760 50911 57046 49946 52215 50663 18667 -6938 -39802
919 -39802 -42247 -32517 -21524 411 1021 -8271 652 22126 8276 -4784 4311 20549 -13114
906 -13114 -2283 11520 24837 36038 34940 16977 28734 40365 29218 25554 5205 -29143
894 -29143 -32542 -8229 12402 6967 -878 9607 35162 23558 32236 35291 12977 -10099 -2342
881 -2342 -14534 -25671 107 37561 37449 44301 39403 20560 26531 37536 35031 40374 50872 34329
867 34329 18105 30107 23184 11387 -9372 -16698 -12164 -13937 815 -6058 -1266 11764 19922
854 19922 14813 11051 -37974 -51814 -34501 -19909 -13876 -24608 -29367 -15166 -6111 26969 70367
841 70367 55176 14135 -13222 7486 -1138 -44391 -26305 -22259 -16750 -716 -1722 -16383 5864
828 5864 12286 6624 12476 41557 72214 73114 40684 19378 11015 38037 36268 31967 31851 43138
814 43138 32395 39298 37547 14366 8179 -6901 -45993 -39444 -8032 -11226 -38429 -36155 -9598
801 -9598 -2558 7974 10336 15467 7017 5517 23611 19059 25417 16148 16489 -18493 -37319 -29899
787 -29899 -27113 -27848 -24706 -40621 -15401 9244 29028 36512 34322 11786 14109 3804 -10014
774 -10014 -19159 -12963 -1819 14492 24771 21254 18198 19865 -3851 -7307 23389 29396 43507
761 43507 65864 33519 30018 21290 -6026 8980 25681 7016 -23663 -15761 6908 11420 12065
748 12065 13063 29021 3472 -15046 18484 47528 50102 58988 61678 58195 65791 95677 81332
735 81332 63100 56306 46886 51849 41575 24101 45438 48252 41257 29159 15564 2993 22119
722 22119 47082 52761 58824 24725 254 -9108 -19617 -32820 13007 42917 47036 31688 20702
709 20702 28400 32691 33117 27384 23107 7068 -11451 -7209 -11495 -27290 -13730 8145 25491 40278
695 40278 44403 50988 43441 37374 41194 43475 46827 15401 -14121 -25825 -19423 -8688 -16480 -11268
681 -11268 11791 6154 -36552 -42704 -55249 -51096 -33131 -22189 -41733 -54840 -31046 -26881 -23165
668 -23165 -23639 -20971 -16518 -16303 -13219 -16630 -9077 7895 33515 42672 30692 26819 37087 24727
654 24727 23623 -4994 -1885 -11115 14320 68232 56151 13593 10512 11615 6572 323 11355
641 11355 24687 18450 22772 32165 48816 55158 16606 -11454 7442 1801 -29291 -43764 -27500
628 -27500 -15328 -14477 -21230 -29335 -51829 -45067 -19910 -10390 -1850 -13913 -755 21977 15197 4504
614 4504 -19478 -20466 -18245 -30789 -29334 1263 530 -36568 -37736 -20004 9074 32302 54325 38634
600 38634 4296 1389 19514 21978 12662 15762 13726 3024 -1605 2333 15282 25597 44433
587 44433 46737 49990 48603 32016 20398 20574 28896 21480 29768 34072 28200 34128 61486 57631
573 57631 31004 28014 32409 41564 45596 15699 -708 -1502 23520 42151 45254 47627 35947 23576
559 23576 21399 -5030 -28160 -19369 -23089 -2739 19065 27055 2769 -3496 -7340 -4587 -4128 -8340
545 -8340 7746 -6066 -20290 -17846 10263 14268 6598 -10299 -2388 22285 32451 55781 44985
532 44985 17700 8263 9009 15261 -4542 -29035 -44602 -36980 -15644 2234 35045 58474 35416
519 35416 17152 20133 21346 44035 61544 92782 102306 73628 61674 55003 22814 -20171 -14783
506 -14783 13530 43558 24143 14964 31291 7243 12556 5668 -15 35272 29633 8490 14100
493 14100 40493 32470 16158 17360 22628 -10329 -39456 -50678 -22708 15221 11122 11935 3122
480 3122 28685 38126 29804 19033 26606 8412 14336 9195 15350 19470 33074 17343 12645 22531
466 22531 13906 -34738 -50950 -35990 -43016 -44912 -18934 -4214 -3146 18290 12693 25082 27317
453 27317 34228 44093 59074 60136 35136 10273 -7080 -11009 -2403 20956 34466 49727 52607
440 52607 62227 75342 60531 45248 23035 26787 41567 46183 58057 43223 32275 29316 10936
427 10936 10742 2314 9061 10728 31970 39559 42878 31339 8552 2281 19475 37181 55094 39620
413 39620 44374 64012 52514 27865 10926 8561 4426 -11245 -13888 -2500 8063 15520 23954
400 23954 23838 19858 10887 11953 2146 -9585 8440 7493 -8627 -30425 -20010 -22084 -32782 -23099
386 -23099 -14256 -5456 -18195 -27653 -14574 1839 -815 -5083 -8397 11591 31980 21199 -24992
373 -24992 -11353 -20477 -47535 -42631 -35101 -48459 -45226 -26705 -13168 4351 -898 1713 14423
360 14423 50335 23671 55445 75962 59009 46899 45460 35096 16348 6501 19511 18068 26516
347 26516 7196 2555 4023 3029 27548 36103 7208 -2108 8328 11175 21694 19348 15143 13090
333 13090 1083 -27568 -47314 -50862 -31293 -15084 8798 14664 -7212 -24500 -34715 -31853 -5466
320 -5466 9297 19727 46424 55349 57590 64670 66622 51017 21657 16558 13871 10127 19443 21407
306 21407 25499 27285 13813 -5980 -27375 -22182 -2102 14886 11694 19340 558 -2081 -1686 12066
292 12066 28633 18761 38693 54326 55434 48515 50245 50183 50834 36990 32738 37328 18332 4035
278 4035 10311 16018 15809 14266 17848 7151 11407 9570 -2550 18548 35591 38954 36477 31322
264 31322 28690 12751 7988 15919 35506 60729 49979 52576 61153 67916 49709 10334 11379
251 11379 22449 20280 16800 38866 45478 59360 35274 18454 8669 8233 -4085 -20104 -35725
238 -35725 -8723 22576 11790 -17395 2999 11018 -4774 -15233 8346 31471 34555 23722
226 23722 31060 22916 23308 40931 29003 12979 5141 26988 16937 -1760 11457 28272 41417
213 41417 28988 14885 13060 14410 -5946 -28054 -19544 -27467 -23640 -6507 3729 -6666 -7909
200 -7909 -6438 8531 206 -7398 -5296 -8557 -3179 -7849 3881 10523 10477 5619 -16777 -2685 -2785
185 -2785 -11842 -10544 -12417 -19195 -33831 -29354 -22730 -15850 -6914 3072 19189 20887 36058 34524
171 34524 34427 48734 32950 32319 34505 17356 20013 13744 4627 27276 44203 30026 20350 16247
157 16247 2152 -37 23115 17922 -2764 1309 8459 4906 296 12473 21880 28216 33691 41306
143 41306 54848 34947 7153 5932 15500 22465 15835 7346 8387 5843 1605 -305 -6922 -21059
129 -21059 -6335 3312 16267 29674 34767 24715 85 6362 1406 -3132 12634 11385 709
116 709 26034 42019 22904 15818 6691 7866 11944 1851 -3564 7592 7366 -5255 5876 14078
102 14078 27303 23127 5223 111 21337 21057 22404 20942 29466 6220 -12737 10299 4644 27
88 27 12858 33931 35445 12161 -483 12396 7293 12592 19386 31333 47808 32958 41800 58611
74 58611 57774 36537 27146 45322 37974 33440 41159 32945 35867 24215 25925 37321 38937 34335
60 34335 35795 35718 44188 34901 25111 11098 -10200 -10503 11181 9360 14347 22972 15041 33511 48588
45 48588 44652 34641 37865 40877 39716 44213 33856 12245 8760 6108 26962 21215 21884 9721
31 9721 8094 8673 -5989 -11861 -4785 4907 14463 2664 -5199 -1797 -6399 -22303 -17379 -13621 -11358
16 -11358 -1126 25457 36634 20550 10171 17810 52030 38521 28458 29738 18815 -10941 -25411
3 -25411 -18444 -14177 -2601
0 -2601
$$ Imaginary data points
##PAGE= N=2
##DATA TABLE= (X++(I..I)), XYDATA
32767 171628 165636 175486 179445 182977 185356 200856 200621 206138 189576 176741 167043 166296 186205 185125
32753 185125 178559 176790 198370 205327 215693 224746 220814 237591 253976 238633 229290 218446 202389
32740 202389 220965 226886 208048 220149 232644 221389 223408 234110 222184 223280 240541 250713
32728 250713 243693 251746 248883 254200 258393 246751 245080 239565 236060 226659 229688 234402 257472 253140
32714 253140 249049 251362 261357 273808 280105 287415 295492 272614 259340 272562 274695 271868 266846
32701 266846 268703 281770 281831 270143 271234 286196 300049 302127 297901 292854 288140 287665 301624 316088
32687 316088 313985 328375 329963 319563 302389 307721 301697 315182 340845 343644 348547 342986 333589
32674 333589 327880 318096 333976 363476 381535 384886 368790 365363 362966 363448 376723 377787 354950
32661 354950 340973 319874 326569 341184 353086 361390 349177 337064 343595 348046 367188 383155
32649 383155 379905 379123 382029 368653 360878 359524 371054 383105 395114 404915 412831 397398 374311
32636 374311 368461 387330 407903 401248 397059 412564 421430 419304 427889 424081 406382 406931 413310
32623 413310 413979 418863 442295 461376 429311 420392 412548 426106 434474 418050 397324 400015 410439
32610 410439 432113 441338 433533 435245 428276 387622 382750 407431 416884 447050 440651 428741 431599
32597 431599 427057 436436 451236 453476 430756 419000 413807 434802 452237 468778 472124 475425 465340
32584 465340 444419 432435 457137 473063 458235 476205 490742 496775 479968 455761 458454 456152
32572 456152 457051 456428 458296 477516 491858 480353 475742 493509 500451 495755 491653 478727 482049
32559 482049 481566 497759 516746 533028 521930 507967 512413 516614 524362 545191 560367 556651 532955
32546 532955 537106 532521 525868 532031 524550 528357 516859 515566 505642 488287 501511 513360 537102
32533 537102 545467 545296 554139 558655 557332 557935 549459 530275 508707 507679 536499 526230 521758 550912
32519 550912 552809 529863 522243 525127 527053 527225 532716 551382 576415 591192 589350 602068 600134
32506 600134 597138 614364 596313 547785 540545 545886 545585 561111 553290 553960 576076 595081 589408
32493 589408 604234 627287 617488 615429 597818 588246 605039 619639 609480 598420 594722 604342
32481 604342 601787 615042 599255 599067 609987 613774 613441 605973 609773 607538 603265 595625 580825 577079
32467 577079 586958 619086 630396 614563 598369 608441 590461 561580 583102 616149 610865 618052
32455 618052 632957 627318 591284 582429 595690 598777 606862 602502 579298 593512 583817 576709 596202
32442 596202 611560 607451 615762 636871 634860 606044 619385 633830 628466 628970 620300 600048 615444
32429 615444 624488 625719 634183 644093 654761 642239 660039 678142 664199 666360 684622 677422 659801
32416 659801 650053 645438 650259 687128 692929 668010 638274 620245 636950 646257 640444 647497 648292
32403 648292 632692 652629 671110 655199 624924 640686 632544 642366 677145 689824 689606 689165 682511
32390 682511 676773 655961 620704 625818 653754 661469 666942 660687 658429 659224 652823 669515 678965
32377 678965 675509 668398 648654 646948 664794 682978 669313 649028 673891 669643 694599 720075
32365 720075 680180 644783 633531 640972 668051 674116 665195 676540 671041 654040 667382 691909
32353 691909 686519 679981 698119 704676 679170 682933 715197 748223 730868 717077 710002 707278 698756
32340 698756 696164 685835 657409 669120 687024 691749 684709 670355 661929 657758 694446 724016
32328 724016 694447 681705 681905 687227 675439 690210 719780 722662 696583 688434 699391 685728
32316 685728 685884 660911 670397 708367 712450 679475 677233 670359 682276 709705 696441 694673 715565
32303 715565 711542 727166 738477 736873 735373 741295 738480 742261 742405 723155 696019 693252 689719
32290 689719 699820 715249 720562 695672 693021 707031 688662 687901 727126 741952 747938 745166 751879
32277 751879 725876 702708 720354 732833 746966 720962 714143 701021 704858 700687 715635 717474
32265 717474 696511 704999 730457 716307 680160 667545 704107 723278 720054 734775 757945 738768
32253 738768 729538 754423 749881 734926 713102 700863 710733 715807 734361 726307 743489 741502 723930
32240 723930 747351 749572 748414 749770 744153 739365 755516 768014 760808 732424 728447 723408 710818
32227 710818 718180 725468 703288 669792 679867 690132 689953 726574 716239 709427 714927 723535 724868
32214 724868 730413 729170 726322 731120 748786 754557 730992 690034 672447 691529 720922 714244 728114
32201 728114 739116 737282 725670 718437 741315 748019 740465 730599 704292 696662 735577 772236 788249
32188 788249 778214 742890 718238 719214 731834 743919 740021 752914 750808 735361 698017 689176
32176 689176 696983 718906 729892 721273 729652 734908 725219 710333 740973 746313 725019 722934 728901
32163 728901 738550 736444 758403 778820 796746 818974 823093 821956 786368 757787 763597 746104
32151 746104 732697 747871 718867 715918 732042 740669 747097 768018 761724 759695 750017 753125 735967
32138 735967 725427 732020 757789 768947 748318 714477 707642 715507 700471 686966 687360 713580
32126 713580 692385 662989 676009 725571 752480 756497 738004 730049 715307 719294 714018 713100 752132
32113 752132 793747 783783 757612 758796 761478 742213 745634 751968 747413 753736 764244 758707 755714
32100 755714 754428 734083 721880 734328 754141 753433 726168 734630 754027 742085 744114 743820 749990
32087 749990 745530 756854 752176 760109 764289 756339 739872 729024 769588 764129 757080 756012 735474
32074 735474 710430 686973 707066 731025 731462 745077 755920 729431 738462 724580 723642 724931 728746
32061 728746 767236 784572 763977 758620 735969 719824 706029 704102 717877 723488 716140 725623
32049 725623 719394 722076 729665 732293 750847 745398 727697 713594 705951 700221 704506 743228 756404
32036 756404 738113 725863 741121 763956 784538 784941 751359 729648 731729 750315 750987 788119
32024 788119 786272 749354 754722 748435 739472 757861 749201 768898 800524 781455 784544 778531 767269
32011 767269 739445 720412 728249 712640 735332 746632 737396 729912 721407 727300 744608 771604
31999 771604 779518 832936 852656 823521 797793 751293 729396 756527 766348 753867 752604 742826
31987 742826 739175 767157 764240 771524 792584 792513 797373 803264 805543 782106 768001 781631 770502
31974 770502 751369 731975 721573 746548 745355 739320 760243 789179 796093 802506 811299 811694 803221
31961 803221 777620 758796 767136 781356 784484 753152 767921 787994 782400 805329 818612 848027
31949 848027 847646 788715 766326 795108 782167 783152 755010 749661 764525 748268 758230 766649 759709
31936 759709 729417 723199 747902 768002 783992 807969 794296 756978 744977 770271 769231 750682
31924 750682 743328 753238 768182 778309 762921 757684 764225 752933 766804 771383 763779 775540 791179
31911 791179 784978 747546 735634 758335 759089 752390 742731 748251 756483 758296 762416 745085 762099
31898 762099 764960 751712 765995 795254 781703 751733 746150 728671 720995 728888 708091 699327
31886 699327 714540 720378 726894 740897 731864 736741 735729 739819 782344 794814 769437 757755 744961
31873 744961 736316 747497 757075 765962 787138 768324 750376 781208 787990 789069 784940 773882 745998
31860 745998 730820 711130 700853 727227 750699 758552 752850 731677 737314 737509 741177 759458 758110
31847 758110 757930 769545 774405 753479 742577 753982 761849 752505 777952 801617 806459 793250 772035
31834 772035 788615 829969 815521 767427 771744 790685 764779 765669 788885 783215 778839 773194 772995
31821 772995 754640 739935 743105 743065 766975 755043 748546 761139 808743 808973 787523 799747 766842
31808 766842 720780 738343 770627 781209 770258 763772 758670 759163 762368 742751 733193 747776 776224
31795 776224 763190 761894 767728 744669 745962 764336 782626 763669 776107 787097 773072 717882
31783 717882 714589 730844 732495 752538 747602 737753 742521 771011 786854 797285 789947 791780 793625
31770 793625 798603 769046 792776 820779 796061 784998 790734 782410 780311 773448 790574 803644
31758 803644 797206 808613 792439 764240 749248 740101 761872 764630 775900 752485 763512 771996
31746 771996 772979 769161 745356 746198 758454 764721 740009 723090 723679 706633 693285 723359 748933
31733 748933 746885 746209 753752 749395 769380 761898 756684 747260 760243 754504 760304 751383 756678 752722
31719 752722 762735 778041 783998 784332 779363 779156 778236 771163 765643 792316 813976 796661 773473
31706 773473 755542 757512 757623 764492 802980 774291 769268 780991 788254 775033 742124 751984 762995
31693 762995 734684 739332 753072 762061 779897 770934 733038 728906 769416 772275 787804 785134 761463
31680 761463 777485 768401 743274 712963 725739 738968 771023 803425 792431 772105 758325 767151
31668 767151 772706 774077 772260 781773 766192 768049 764198 774689 783268 789250 769583 744302 720929
31655 720929 711600 716018 724444 735599 762172 767611 753647 770381 764727 756962 749393 747502 747001
31642 747001 768371 765228 755828 760615 756433 743742 737999 756732 771173 800117 782980 758582
31630 758582 767027 776074 773367 785921 782191 779779 782100 770657 753151 773143 759969 754594 781330
31617 781330 802557 786062 772970 766578 757957 775386 777095 759394 737765 749353 757321 784886
31605 784886 793073 795318 805786 804232 814648 823436 802760 772259 762921 784725 764464 759678 759606
31592 759606 776133 786022 760872 761262 765765 786947 787427 766038 768447 765742 787520 794609 796922
31579 796922 796777 789992 799976 784965 784797 784158 767881 770854 776393 781710 777620 759464 751100 737356
31565 737356 736082 751315 751973 770181 773095 775205 777802 757820 771444 786851 780966 768588 756302
31552 756302 748866 742360 738849 774813 765980 782466 785355 778458 784030 782343 751002 739035 741295
31539 741295 735626 733484 761652 781416 765200 763063 790164 790916 782406 788736 760909 733241 755119
31526 755119 751620 745273 723811 720407 758631 803846 785132 755074 751548 757438 747301 738271 743013
31513 743013 742655 706892 699086 723430 741024 741101 720110 736123 755040 760174 769179 764007 786664
31500 786664 809607 809425 812592 803564 817557 801326 785291 797990 795211 767420 751202 746260 754186
31487 754186 754040 756836 761670 763417 762306 770877 779138 761100 724294 749192 780693 777499 789781
31474 789781 802748 807619 791338 793149 789456 794000 778331 779997 773678 793014 770585 777662 781279
31461 781279 766386 762269 738409 724455 750743 748820 733696 767428 792371 793090 775891 782234
31449 782234 786128 789906 789416 786838 773562 741900 728177 750419 767077 784532 785603 775709 764017
31436 764017 783059 791640 790924 800934 807614 790542 777300 766004 778789 778584 770919 776673 783202
31423 783202 796603 808440 805873 800568 793349 786782 773648 772525 761641 783320 776583 792319 815440
31410 815440 811920 788383 798316 806051 835457 837861 828893 803491 793097 765977 753651 758154 779224
31397 779224 803650 779665 778186 774632 771753 787152 777550 761045 779371 759439 731361 702709
31385 702709 704094 721100 738560 742834 783585 777433 761212 744873 744753 732145 741324 754894 784420
31372 784420 780327 768248 775471 802040 811144 815981 798849 776040 781538 789306 788588 782438 793209
31359 793209 803775 818237 819983 799569 781997 791675 803456 786823 778467 769098 775349 766124 766637
31346 766637 796088 820860 821931 807664 815625 782595 766848 780198 785571 767680 753257 763091
31334 763091 778577 803743 821266 818920 824988 821093 848938 845237 841294 826472 793574 769553
31322 769553 777680 794371 784451 767781 761003 760141 775344 784982 782364 785169 781364 776819 790060
31309 790060 825312 822141 792041 753237 765782 796440 815628 830481 815316 824036 829453 835530
31297 835530 845720 836850 838787 827532 799237 803501 795613 767366 761199 763124 786257 810457 794765
31284 794765 774398 774475 791900 792769 788471 816382 819090 813087 792320 779820 769754 791918 788084
31271 788084 804617 830579 816591 805037 834118 833634 812178 801206 815017 825918 802298 778451
31259 778451 780091 793565 787276 770817 774727 785705 785026 774341 746191 751550 750134 776838 808211
31246 808211 813036 809869 819258 856183 837709 805723 765726 770027 780925 794802 816726 810722
31234 810722 805146 783415 770800 782375 778087 788933 798525 773479 766672 794378 797417 803242 800412
31221 800412 788996 783861 783065 782945 796327 813852 814957 816284 824494 825445 834180 825570 806289 789067
31207 789067 800826 773163 739938 754604 786397 779958 784660 787325 775993 793411 789128 786536
31195 786536 792001 771018 765917 795340 809696 832278 832760 823144 830723 835064 837083 837898 829804 828999
31181 828999 803261 788943 778610 787799 805225 814568 823836 838677 844584 835254 847015 839764 812568
31168 812568 791684 782965 783683 798008 804073 824882 819101 799519 791716 770013 774224 797313 802782
31155 802782 776690 769564 772016 796508 788737 767057 792099 799492 803441 800370 794504 787179 749531
31142 749531 759793 778968 800559 814185 809588 820453 812824 786087 810065 820719 779251 769805
31130 769805 756647 778838 818874 809898 791058 793427 812944 806364 812709 807449 794604 788388 766426
31117 766426 738803 732184 729649 749257 773079 791680 813340 802497 813742 802867 807300 830596
31105 830596 810911 789189 806667 806190 799297 790686 790196 779257 776700 814372 804276 799899 808132
31092 808132 804166 814567 836378 843782 844677 806269 801962 818385 810559 822967 805745 806898 836037
31079 836037 841957 868928 846730 806424 814932 820153 844418 839908 831124 828955 815807 779592 783233
31066 783233 788747 778418 777557 772031 776834 773508 767170 756708 771305 807580 848704 882196 849211
31053 849211 831943 816501 824871 809951 790499 800349 802590 799527 801869 796737 797006 818460 834048
31040 834048 817081 793682 771607 783199 788685 794748 796414 799950 804564 810121 809769 812668 832158
31027 832158 843073 834398 822437 810268 798568 807675 809752 817534 803028 771161 775083 789387
31015 789387 825621 830491 831751 823101 822078 836558 845411 822222 798132 774319 770439 771552 783974
31002 783974 823876 820529 801379 814632 803506 796851 787368 788971 803175 809141 808174 788118 760513
30989 760513 764379 790122 783993 766352 770019 797759 797505 799449 826860 857095 837429 821651 844908
30976 844908 834135 813189 808961 806511 797395 776723 785002 786041 798225 816865 800464 789750
30964 789750 789333 801771 825209 834832 843356 826417 835935 838545 847319 859529 873140 851389 848387
30951 848387 850214 867264 840953 826159 804913 769898 793292 819018 832507 829684 832056 799592
30939 799592 789696 806073 831498 835860 826489 826609 826874 825922 840361 857790 843727 838450 833675 796994
30925 796994 784155 807319 805393 817815 827249 827047 790502 787132 793005 811300 812825 806490 829118
30912 829118 845195 838982 836928 852928 849796 791005 771808 771583 786747 806456 822587 824926 855195
30899 855195 870730 854863 829793 822350 830531 826227 818433 832175 875639 866778 850864 836826
30887 836826 807643 792350 791924 805979 811568 802343 808932 801349 811164 797014 794590 793534 810920
30874 810920 819829 805433 809600 798523 817885 847265 847355 832150 796603 769722 785460 817343
$$ [...]
##END NTUPLES=NMR SPECTRUM
##END=
