##TITLE=Analysis number 327863
Compound Code cc 00045
Book Reference 206165
Project Code qc fl
Chemist Name jom
##JCAMPDX= 6.0         $$ Bruker NMR JCAMP-DX V2.0
##DATA TYPE= NMR SPECTRUM
##DATA CLASS= NTUPLES
##ORIGIN= Bruker BioSpin GmbH
##OWNER= nmr
$$ XWIN-NMR		Version 3.5
$$ Fri Apr 13 09:26:07 2007 GMT Daylight Time (UT+1h)  MAYBRIDGE\nmr@NMR_250MHZ
##.OBSERVE FREQUENCY= 250.131544655141
##.OBSERVE NUCLEUS= ^1H
##.ACQUISITION MODE= SIMULTANEOUS (DQD)
##.ACQUISITION SCHEME= undefined
##.AVERAGES= 16
##.DIGITISER RES= 18
##SPECTROMETER/DATA SYSTEM= dpx250
##.PULSE SEQUENCE= zg30
##.SOLVENT NAME= DMSO
##.SHIFT REFERENCE= (INTERNAL, DMSO, 0, 16.522)
##AUDIT TRAIL= $$ (NUMBER, WHEN, WHO, WHERE, WHAT)
$$ ##TITLE= Audit trail, XWIN-NMR		Version 3.5
$$ ##JCAMPDX= 5.01
$$ ##ORIGIN= Bruker BioSpin GmbH
$$ ##OWNER= nmr
$$ C:\u/data/dgb/nmr/ADRS/1360/pdata/1/auditp.txt
$$ ##AUDIT TRAIL=  $$ (NUMBER, WHEN, WHO, WHERE, WHAT)
(   1,<2007-04-13 09:25:46.63 +100>,<MAYBRIDGE\nmr>,<NMR_250MHZ>,
      <created by zg, POWCHK disabled, PULCHK disabled
       configuration hash MD5:
       49 4B E0 1D 92 C2 6B 37 9F E6 65 BC 52 41 86 1D
       data hash MD5: 64K
       C8 D3 6F DE 37 74 01 8F 50 86 BF 70 7F B3 83 A9>)
(   2,<2007-04-13 09:25:58.85 +100>,<MAYBRIDGE\nmr>,<NMR_250MHZ>,
      <Start of raw data processing
       ef LB = 0.3 FT_mod = 6 PKNL = 1 SI = 32K 
       data hash MD5: 32K
       C4 8A B9 2D 67 3F BC 28 B3 61 53 77 EA 8B D8 EE>)
(   3,<2007-04-13 09:26:00.49 +100>,<MAYBRIDGE\nmr>,<NMR_250MHZ>,
      <apk 
       data hash MD5: 32K
       39 6B 46 EE 06 A4 ED 09 F9 7D 6A 16 94 D0 11 8B>)
(   4,<2007-04-13 09:26:01.23 +100>,<MAYBRIDGE\nmr>,<NMR_250MHZ>,
      <abs ABSG = 5 
       data hash MD5: 32K
       02 D4 9A A9 73 BF A4 31 86 47 6A EF D9 B0 32 52>)
$$ ##END=
$$ 
$$ hash MD5
$$ 00 F4 62 BF 4E B4 DF 60 CE D4 2B 7F 96 F0 C6 12
##$RELAX= 
##$RELAX= 
##$RELAX= 
##$RELAX= 
##$RELAX= 
##$RELAX= 
##$RELAX= 
$$ Bruker specific parameters
$$ --------------------------
##$DU= <C:\u>
##$EXPNO= 1360
##$NAME= <ADRS>
##$PROCNO= 1
##$TYPE= <nmr>
##$USER= <dgb>
##$AMP= (0..31)
100 100 100 100 100 100 100 100 100 100 100 100 100 100 100 100 100 100 
100 100 100 100 100 100 100 100 100 100 100 100 100 100 
##$AQSEQ= 0
##$AQ_mod= 3
##$AUNM= <au_zg>
##$AUTOPOS= <57 >
##$BF1= 250.13
##$BF2= 250.13
##$BF3= 250.13
##$BF4= 250.13
##$BF5= 500.13
##$BF6= 500.13
##$BF7= 500.13
##$BF8= 500.13
##$BYTORDA= 1
##$CFDGTYP= 0
##$CFRGTYP= 5
##$CHEMSTR= <none>
##$CNST= (0..31)
1 1 145 1 1 1 1 1 1 1 1 1 1 1 1 1 1 1 1 1 1 1 1 1 1 1 1 1 1 1 1 1 
##$CPDPRG= <>
##$CPDPRG1= <>
##$CPDPRG2= <>
##$CPDPRG3= <>
##$CPDPRG4= <mlev>
##$CPDPRG5= <mlev>
##$CPDPRG6= <mlev>
##$CPDPRG7= <mlev>
##$CPDPRG8= <mlev>
##$CPDPRGB= <>
##$CPDPRGT= <>
##$D= (0..31)
0 1 0 0 0 0 0 0 0 0.06 0 0 0 0 0 0 0.0002 0 0 0 0 0 0 0 0 0 0 0 0 0 0 
0 
##$DATE= 1176452745
##$DBL= (0..7)
120 120 120 120 120 120 120 120 
##$DBP= (0..7)
150 150 150 150 150 150 150 150 
##$DBP07= 0
##$DBPNAM0= <>
##$DBPNAM1= <>
$$ [...]
##$SUBNAM6= <"">
##$SUBNAM7= <"">
##$SUBNAM8= <"">
##$SUBNAM9= <"">
##$SW= 20.6930455092707
##$SWIBOX= (0..15)
0 0 3 0 0 0 0 0 0 0 0 0 0 0 0 0 
##$SW_h= 5175.983436853
##$TD= 65536
##$TD0= 1
##$TE= 683.16
##$TE2= 300
##$TE3= 300
##$TEG= 300
##$TL= (0..7)
0 120 120 120 120 120 120 120 
##$TP= (0..7)
150 150 150 150 150 150 150 150 
##$TP07= 0
##$TPNAME0= <>
##$TPNAME1= <>
##$TPNAME2= <>
##$TPNAME3= <>
##$TPNAME4= <>
##$TPNAME5= <>
##$TPNAME6= <>
##$TPNAME7= <>
##$TPOAL= (0..7)
0.5 0.5 0.5 0.5 0.5 0.5 0.5 0.5 
##$TPOFFS= (0..7)
0 0 0 0 0 0 0 0 
##$TUNHIN= 0
##$TUNHOUT= 0
##$TUNXOUT= 0
##$USERA1= <user>
##$USERA2= <user>
##$USERA3= <user>
##$USERA4= <user>
##$USERA5= <user>
##$V9= 5
##$VALIST= <valist>
##$VCLIST= <CCCCCCCCCCCCCCC>
##$VD= 0
##$VDLIST= <DDDDDDDDDDDDDDD>
##$VPLIST= <PPPPPPPPPPPPPPP>
##$VTLIST= <TTTTTTTTTTTTTTT>
##$WBST= 1024
##$WBSW= 4
##$XGAIN= (0..3)
0 0 0 0 
##$XL= 0
##$YL= 0
##$YMAX_a= 402139
##$YMIN_a= -366421
##$ZGOPTNS= <>
##$ZL1= 120
##$ZL2= 120
##$ZL3= 120
##$ZL4= 120
##$ABSF1= 16.522
##$ABSF2= -4.171173
##$ABSG= 5
##$ABSL= 3
##$ALPHA= 0
##$AQORDER= 0
##$ASSFAC= 0
##$ASSFACI= 0
##$ASSFACX= 0
##$ASSWID= 0
##$AUNMP= <proc_1d>
##$AZFE= 0.1
##$AZFW= 0.1
##$BCFW= 0
##$BC_mod= 0
##$BYTORDP= 0
##$COROFFS= 0
##$CY= 12.5
##$DATMOD= 1
##$DC= 0
##$DFILT= <>
##$DTYPP= 0
##$F1P= 14.0000005364418
##$F2P= -0.99999901652339
##$FCOR= 0.5
##$FTSIZE= 32768
##$FT_mod= 6
##$GAMMA= 0
##$GB= 0
##$INTBC= 1
##$INTSCL= 1
##$ISEN= 128
##$LB= 0.3
##$LEV0= 0
##$LPBIN= 0
##$MAXI= 10000
##$MC2= 0
##$MEAN= 0
##$ME_mod= 0
##$MI= 0
##$NCOEF= 0
##$NC_proc= -2
##$NLEV= 6
##$NOISF1= 0
##$NOISF2= 0
##$NSP= 0
##$NTH_PI= 0
##$NZP= 0
##$OFFSET= 16.522
##$PC= 1
##$PHC0= 219.8217
##$PHC1= 5.250372
##$PH_mod= 1
##$PKNL= yes
##$PPARMOD= 0
##$PSCAL= 4
##$PSIGN= 0
##$REVERSE= no
##$SF= 250.13
##$SI= 32768
##$SIGF1= 0
##$SIGF2= 0
##$SINO= 400
##$SIOLD= 32768
##$SREGLST= <1H.DMSO>
##$SSB= 0
##$STSI= 32768
##$STSR= 0
##$SW_p= 5175.98343685301
##$SYMM= 0
##$S_DEV= 0
##$TDeff= 65536
##$TDoff= 0
##$TI= <Analysis number 999999
Compound Code 99
Book Reference 9
Project Code 9>
##$TILT= no
##$TM1= 0
##$TM2= 0
##$TOPLEV= 0
##$USERP1= <user>
##$USERP2= <user>
##$USERP3= <user>
##$USERP4= <user>
##$USERP5= <user>
##$WDW= 1
##$XDIM= 32768
##$YMAX_p= 353613494
##$YMIN_p= -30053
$$ End of Bruker specific parameters
$$ ---------------------------------
##NTUPLES= NMR SPECTRUM
##VAR_NAME=  FREQUENCY,     SPECTRUM/REAL,   SPECTRUM/IMAG
##SYMBOL=    X,             R,               I
##VAR_TYPE=  INDEPENDENT,   DEPENDENT,       DEPENDENT
##VAR_FORM=  AFFN,          ASDF,            ASDF
##VAR_DIM=   32768,         32768,           32768
##UNITS=     HZ,            ARBITRARY UNITS, ARBITRARY UNITS
##FACTOR=    0.157963299565203, 1,           1
##FIRST=     4132.6476996994, 0,             0
##LAST=      -1043.33573715361, 0,           0
##MIN=       -1043.33573715361, -30053,      0
##MAX=       4132.6476996994, 353613494,     0
$$ Real data points
##PAGE= N=1
##DATA TABLE= (X++(R..R)), XYDATA
$$ [...]
15756a6215Q083L317k407L470L302l532Q8K44m753l425M526O134J156m820R05
15741c927R167o65K478K924r579n494k62j362J454M81L543j0352O08K812k543
15726a0717K905l936l072j489j684L917Q455l783o552N585R465K164l901l248
15712e891j343k725l120L321L916L168p0K397M2n915L303K842k309k987P125K385
15696D139l3l568j03n385k059P73P774n454n236N309J146n667O215M186n849k946
15680f758M667N133O88j850n763k347J597M242k163k112O312j638j709m850j1
15665f562m077L710O31J012J091k240K595J457N456K80j331l433o045p176q89
15650a5521N212J327N844k152M298L820K668k654k739n170m838L359J1044r29
$$ y = [-16215, -8132, -4815, -7222, -3752, -450, -3982, -3894, -3650, -8403, -11828, -7302, -1168, -12, -4832, -3927, 5240, 4575, 7053, 9977, 398, -5096, -5358, -6720, -5266, -4785, -1242, -11594, -10986, -8174, -10717, -7812, -11748, -14820, -16309, -17993, -14076, -5621, -9404, -15956, -10371, -906, 1258, -2643, -5891, -7234, -9959, -13079, -9758, -5842, -2674, -2744, -347, -305, -6220, -2917, -75, -2384, -5371, 1754, 4139, 4106, 538, 435, -4950, -7009, -6236, 1538, -3916, -9152, -3843, -2697, -8364, -2149, 2037, -3812, -6758, -2091, 3042, 3730, 1880, -3883, -6230, -4633, -391, -2554, -4666, 1646, 8, -1701, -6551, -6562, -10639, -6929, -6298, -5286, -4195, -6435, -3840, -2383, 3073, 3353, 2022, -1411, -7456, -14632, -15521, -10309, -8982, -3138, -5290, -992, 2828, 5496, 2842, 103, -5067, -9905, -6546, 4498, 3569]
15636C569L10K239m605r66J041q05j258m037K679l405l161P8R96N482j760p389
15620a0992q36N873K167l978N115L639n443o42M320L74k240J091q04k823n058
15605a0237l299M731K253J058M607M124k634m760k643L016K473n730r618K323
15591a4336L516L200M405K246j391l463P170N231l28n237n804n982k46N34M446
15576f039N567k167m070Q732M069j733k541J799j734J092l233p479m385M077J902
15561f143N48K498K078M887j234L902o91o820L808L406J301l714K027m338M22
15546A937Q22O261j067r05m87j254R38L504N33j1180l966m62j8Q25M676k15o651
15529f709J013j817n879j0541r79O104J2666N68k145K667K381N582O42l22n567
$$ y = [3569, 3879, 6118, 1513, 547, 1588, 783, -475, -4512, -1833, -5238, -8399, -8321, -7325, -1843, -3603, -10992, -11828, -5955, -3788, -7766, -2651, 988, -4455, -5097, -777, -403, -2643, -1552, -2356, -5179, -10237, -13536, -8805, -6552, -5494, -887, 3237, 603, -4157, -6800, -3784, -1311, -7041, -16659, -14336, -10820, -7620, -3215, -969, -2360, -5823, 1347, 6578, 6250, 1013, -4791, -10773, -11019, -10485, -6039, -472, -2639, -6709, 2023, 6092, 4359, 1818, 3617, 1883, 2975, -258, -7737, -12122, -8045, -6143, -5595, -3097, -1019, 3868, 2634, 6536, 5845, -975, 2833, 6239, 7540, 3826, 5853, 1515, 1937, 2759, 9020, 7953, 7048, 6561, 5307, 6245, 9749, 10282, -898, -4864, -5326, -5344, -4519, 157, -58, -6709, -5696, -7513, -13392, -23933, -24912, -18808, -6142, -5574, -7719, -5052, -2671, 2911, 3553, 3231, -2336]
15514b336q554p383M012J2590n185K811R229k913l635q77K995n371l040P012P62
15499A17k694o652m509R509J1230K472k499K75j391m03j580J098O50L100m88L034
15483A1269p37o296o440l581L383Q842r662l333O355k824k150J340p09oN295j68
15467E78m166J701n281M817M599k242k786J214J199l679l897K655k888m244J405
15452a1015K091K465n511l005j965M831O844L070n58Q91n187l93j207k971M723
15437f897J834Q97J66M301K765L310P34K775l646p052n567m251K72N38l012p49
15421a3582M778P307R55L199L698n631q207m255l076O507J497M435J884k024L131
15406F16J615j868j459o324j480P020M905J830K343L68n466p662k845J270R617
$$ y = [-2336, -10890, -18273, -14261, -1671, -6856, -4045, 5184, 2271, -1364, -2241, 754, -4617, -7657, -645, 117, -2577, -9229, -13738, -4229, 7001, 9473, 6974, 7249, 5858, 5455, 3875, 4973, 5623, 8723, 8235, 11269, 10532, 4236, -2204, -5785, -2402, 6440, -3222, -6555, -200, -3024, -5174, -3834, -4543, -4549, 746, 578, -3588, -1887, -7168, -2351, 2248, 6, -2780, -1566, -367, -4046, -7943, -5288, -8176, -12420, -11015, -8924, -6459, -11970, -14975, -16940, -12109, -5265, -2195, -2753, -1862, -7049, -7442, -8649, -11620, -6897, -5063, -4166, -4000, 301, 3066, 6376, 7110, 9885, 6239, -813, -6380, -10631, -10359, -9821, -12833, -13582, -8804, -1497, -542, 2657, 6355, 724, -7483, -11738, -14814, -8307, -6810, -2375, -491, -2515, 616, 2231, 363, -1096, -7420, -8900, -1880, 3025, 4855, 7198, 7566, 2100, -5562, -8407, -7137, 2480]
15391B480J0430L32n977o360J06K66p723p12K624p72j643j112J814L841p49J848
15375a307K300m4l052P228K516k789O429r04r959n479L322R94n752L543O613k520
15359A139J445L5J92k313j93M135K537q50m984l754m96n0O111l007P011r80n050
15342I28j096j747m607J608P283l559l318n337o091m5O144M285M39L820j108K640
15326B39K731r200k056K894M41J171l022j727L532N079K295p038j182M972K183
15311A312O95m742l198n85K836P153m90l137M547r45r202p75L588n695L502J914
15295c222j093j02N214p96l650O775N689l790p951j526m543L573O903p50m68R50
15279A213Q55l84M32K568q875k594O30Q27J843J339m241L496k109n463l812M931
$$ y = [2480, 12910, 13242, 7265, 905, 1011, 1277, -6446, -7158, -4534, -5306, -6949, -8061, -6247, -2406, -3155, -1307, 993, 949, -2103, 5125, 7641, 4852, 11281, 10377, 418, -5061, -1739, -745, -6497, -2954, 3659, 1139, 2584, 2619, 2811, 498, 305, 4440, 6977, 6127, 1143, -2611, -3107, -3157, 2954, -53, 6958, 5978, 928, -168, -1915, -6522, -4914, 2369, -1190, -4508, -9845, -15936, -15981, -9837, -5552, -5113, -1293, -2401, 239, 2970, -6230, -8286, -5392, -4951, -3780, -6802, -8529, -4997, 82, 2377, -4661, -5843, -871, 1312, 2007, -2735, -5933, -6518, -3682, 3471, 2981, -156, 4391, 3446, -5756, -6531, -2943, -8638, -5136, -3222, -4315, -4417, 797, 1, -3649, 3126, 8815, 5025, -2926, -4452, -8995, -5422, 1481, 731, 263, 1213, 2068, 1684, 2116, 4684, -4191, -6785, -6155, -5328, -3485, -2146, -6387, -2891, -5000, -10463, -14275, -9344]
15263i344n369M979P75j778r129J881N473K885J821K816J2J414j643j285K502
15248c990K353M965l219j667M757R65N370j28m533k761j525p065m884j584J977
15233a0969J0819M820L622l493o325l639l458k902M091N560j076m836j465O300
15219b951J341k232R6j366k780M120K548k427m288K470K417Q897o27o454l98j318
15203b952l668J621Q586m89j974J895K037j490l729L02j185J923K569k088K855
15188D213j024l591J843O630K730j479N324M053q700p347l981J091K196k35m524
15173b801k188k013Q933Q466l384l431L098R351j500j342r959o625j551K292l30
15158b984K722n476l79O386j217j215O771j615K509N280L561m907l025k392j347
$$ y = [-9344, -14713, -9734, -8959, -10737, -19866, -17985, -12512, -9627, -7806, -4990, -4978, -3564, -5207, -6492, -3990, -1637, 3328, 109, -1558, 3199, 4164, 9534, 9406, 4873, 2112, 587, -6478, -11362, -12946, -10969, -150, 4670, 8292, 4799, -1526, -5165, -8623, -11525, -7434, -1874, -2950, -7786, -9251, -2951, -1610, -3842, -3746, -5112, -7892, -3772, -1224, -3651, -7939, -5469, -3052, 5845, 5218, -1236, -1634, -2952, -6620, -4999, 3587, 3098, 1124, 3019, 5056, 3566, -163, 139, -1046, 877, 3446, 1358, 4213, 3189, -402, 1441, 8071, 10801, 9322, 14646, 18699, 9999, 2652, -1329, -238, 1958, 1723, -2801, -4989, -7002, 1931, 10397, 7013, 3582, 6680, 16031, 14531, 13189, 3230, -3395, -4946, -2654, -2984, -262, -5738, -6117, 269, -948, -2163, 4608, 2993, 5502, 10782, 14343, 9436, 6411, 4019, 2672]
15143B672O718L557j630o717k091j905n011K081M026o60p877K844L670j20m799
15128e242j573j321l746l266O979K238q00l43l954P235Q381K419L885P40k575
15113I057n285Q1L033m175k888l275k338j385l363L80L564L507R30k032K589J628
15097B8r419n781O550M812M484P236J775q021o463l886K191J746J784K86J028
15082a650k065J627K407m009l516L306L854O73k928N136J749j483n89m910M25
15067a973K803q150j0813n93Q280Q414M145l10m24m074n970J972N975L624o63
15052B243q052l409O147Q361J037N48k805J532r2o329j512L169O775j620p890
15037a897O237K972n53L195l181o104j467J0023L325o006o449q040p03L627k68
$$ y = [2672, 9390, 12947, 11317, 4600, 2509, 604, -4407, -2326, 1700, 1040, -6837, -3993, -323, -443, -5242, -6815, -8136, -11882, -15148, -8169, -5931, -6731, -7074, -11028, -3793, 4588, 7007, 10892, 11632, 9057, 3772, 3853, 6886, 2711, -177, -3452, -5790, -7175, -10538, -10158, -6594, -3087, -2157, -4189, -1600, 28, -9391, -15172, -8622, -3810, 674, 7910, 9685, 1664, -4799, -8685, -6494, -4748, -2964, -2678, -1650, -3715, -2088, 319, -3690, -7206, -3900, -46, 627, -2301, 2835, 4584, 3101, 2512, -2398, -1973, 830, -7320, -18133, -18726, -10446, -2032, 2113, 1803, 1379, -2695, -8665, -6693, -718, 2906, 2243, -5809, -9218, -3071, 5290, 6327, 6875, 4070, 5602, 5510, -819, -2331, 838, 7613, 5993, -1897, 4340, 7312, 6759, 9954, 6773, 669, -798, 9225, 12550, 6544, 95, -7945, -8648, -5021, -5289]
15022e289M672K188m727l654j555j277N268K763k857P11J549N972M848L745p689
15007D668p815k771N084J873N660m642m190J758k80k642k221j356l621k815n241
14992a8551L602N913j97l810K238L041l61J431K942K619j85J952P925M023k191
14977A0391n295P67m167j203L57k036n319J330J389k663k498N320Q675j150L000
14962F898J345n290j132k122j905j185q49q686N545K764o140j878K329J25K517
14947g664L777M168n593j290k464l04K755K084N682j27P797k998p594j224k256
14932e251M68J474L134l962m012J46M744K968L814K448n454o09K682j556L046
14917D080J493p223L79j230j056m125N428L512J774M808p57q563o719o225N216
$$ y = [-5289, -617, 1571, -3156, -6810, -8365, -9642, -4374, -1611, -4468, -3757, -2208, 3764, 8612, 12357, 4668, -3147, -5918, -834, 1039, 6699, 2057, -2133, -375, -655, -3297, -5518, -6874, -10495, -13310, -18551, -14949, -9036, -9233, -13043, -10805, -7764, -8125, -6694, -3752, -1133, -1318, 634, 8559, 12582, 10391, 5096, 5863, 1696, 493, 850, -1186, -6505, -5175, -3786, -6449, -8947, -3627, 5048, 3898, 6898, 8243, 2953, 1821, -301, -2206, -3391, -4240, -12926, -7381, -4617, -10757, -12635, -10306, -10181, -7664, -3887, 281, -5312, -6602, -9066, -9370, -6615, -4531, 1151, 1024, 8821, 5823, -1771, -2995, -5251, -4783, -3309, -175, -4137, -8149, -8003, -3259, -291, 3523, 5971, 517, -92, 2590, 1034, 4080, 5573, -1650, -1271, -2501, -3557, -7682, -2254, 1258, 3032, 7840, 7083, -1480, -8199, -14424, -9208]
14902i208Q309j63l572n862j129p12N160Q008N98J07M711M120o58o328j405j942
14886C4l865o931L123n241J917J466k20m53L566K4N064l182m933J817r5K248M772
14869h89M985o289K19J49M407l68n084r250l999M299P51Q73k605N25M031J204
14853g041P191m996m440j771L602l994p301L666L079j082o44N779J965r66l315
14838a0268j383n63j640O933k838o608L676N550R186j582K096l323Q11m138J872
14823b219K046J122j914k302k766l105k945L168m231l406o526M757R080N120l154
14808g275n784K329O886P039o367j0103O357L541k853r40k08K71N701L869P691
14793A0154j793k630l185l584p269n76l692J510R868Q561m459m756o101M155M563
$$ y = [-9208, -899, -1062, -4634, -10496, -11625, -12337, -7177, 831, 1429, 1536, 6247, 10367, 9709, 3381, 1976, 34, -3831, -10762, -7639, -12880, -10963, -9497, -9717, -10170, -6604, -6580, -1516, -4698, -9631, -7814, -7909, -5661, -889, 4096, -2193, -1974, -1825, 2582, 2214, -2870, -12120, -16119, -11820, -11069, -10196, -12801, -12276, -8245, -7041, 150, -4846, -9286, -11057, -7455, -11449, -18750, -15084, -12005, -13087, -13731, -7952, -5987, -6953, -10268, -11651, -12214, -13854, -6921, -9759, -16367, -12691, -7141, 2045, 463, 2559, -764, 47, -4091, -2219, -173, 949, -965, -3267, -6033, -9138, -12083, -8915, -13146, -16552, -23078, -18321, -9241, -4121, -7275, -13059, -10730, -3844, 3195, -3172, -13275, -6918, -3377, -6230, -7170, -7378, -7107, -1406, 2463, 10154, 8361, 5731, 2546, -1038, -8307, -8883, -12575, -11065, -1197, 7364, 2905, -1851, -7952, -3797, 766]
14778G66K025o018j626J17L902K996P617Q06p677q921L439M050J478q50m951n497
14762h344l863M751L686o027K351o340l604O20O45P219P780n931Q4n971L093M109
14746e742M109j054r453j661L239P14j024k314l048K369J995J410J2910N620k839
14731E231k04J025n451J209r90r127M668j374L125n069j213N099N521J064n627
14716b113o633k970r94O27J567j11J090N403p147m518Q04O57P187O252P469m054
14700B516n702J701k679L13M088m269J900l92L952J133l679Q7M920L853j717k911
14684C114J108l900k178L249K811l258K083m479J499M880L452m122K114l484k276
14669F13M346J670m070k691J966K869K53n126l533j3167j720L553J59j202N096
$$ y = [766, 2791, -3227, -4853, -4736, -834, 2162, 9779, 10585, 2908, -6013, -2574, 1476, 2954, 2104, -2847, -8344, -12207, -7456, -3770, -9797, -7446, -13786, -17390, -16770, -16125, -8906, -1126, -7057, -6973, -12944, -9851, -5742, -1633, -2687, -12140, -13801, -10562, -9848, -10872, -13186, -16234, -13865, -11870, -10460, 2450, 8070, 5231, 5027, 6052, 601, 1810, 820, -8307, -3639, -5013, -1888, -6957, -8170, -3071, 2450, 3514, -2113, -8746, -11716, -12710, -12083, -10516, -10627, -9537, -4134, -11281, -15799, -14995, -14338, -7151, -899, 6570, 2516, -3186, -1485, -4164, -3851, 237, -4032, -2132, -2524, 1428, 2561, -1118, -1031, 3889, 7742, 6025, 3114, 4222, 322, -1856, 1393, 4204, 946, 3029, -1450, 49, 4929, 8381, 4259, 6373, 2889, 613, 4959, 6629, 2559, -132, 1834, 4703, 4956, -170, -3703, -16870, -18590, -15037, -14878, -16080, -10984]
14654a0984R255R660K004q132o180J455K717j308l410j339r262n424N546R036
14640f366P630p631q48N822L83n954k45K995m655k281M081N960l54j245l13O79
14624b342K045N382j396q147l864j180K740k113K417o81J779n656l221P998L971
14609b268K942p52L030n691m673j045n904k627Q355k616J32Q770m561J41l869
14594a0636R26L334l478J770J379m85k440M413j711N786Q014K857l723l410k594
14579Bj99k243l011J474q31M325N372j371k429l909j332N924P592m768o592L093
14563A097P368J454p871r069l500l80M755L916k751r93K072k366k752j070O782
14548c308M186K698L59J779J97l062n310k89j526n406O10R172K782K276M908n456
$$ y = [-10984, -1729, 7931, 9935, 1803, -4377, -2922, -205, -1513, -4923, -6262, -15524, -20948, -15402, -6366, 1264, -6367, -7215, -1393, -1010, -6964, -7209, -4214, -8869, -11150, -7069, -1109, -1463, -2708, -3021, -2342, -297, 5085, 3689, -4458, -8322, -9502, -6762, -8875, -6458, -7139, -5360, -11016, -14237, -6239, -2268, 674, -78, 2952, -2739, -7412, -8457, -14361, -16988, -8633, -11249, -11117, -2347, -6908, -6767, -10636, -9710, -6376, -9854, -8084, -6705, -7190, -9630, -5217, -6928, -1142, 6872, 9729, 6006, 2596, 2, -197, -2440, -5451, -3977, -4808, -483, 4889, 3518, 1089, -2820, -4152, 1772, 9364, 4596, -1996, 1097, 8465, 9919, 2048, -7021, -10521, -10901, -6146, -2230, -4981, -5974, -3902, -6268, -9020, -10090, -3308, 878, 3576, 3935, 5714, 5911, 2849, -2461, -2750, -4276, -9682, -9072, 100, 2882, 5158, 10066, 4610]
14532D610l874L926P51m099l502L054j0R68L524L330m975o515O548K578l499J209
14516D024L631J117k715k772j371k68q23L837j023l32J088n99m734q588m817L015
14500a1330P12k058l410K245J212O215L851o056o3O595j184n4O949K289o827n237
14484f151l304L518l945o459n153O748R137P103L148n202k447q58j745M202L090
14469A682l313n117M681Q12j249J500m481M473N715k690O60N5k233K130l302K380
14453A703K377p956j551N308j76K494Q18Q86M57K515m042O947L844q274l613n15
14437A222r368l529q69J76N23P228L896J212k663k406l860Q976O719p167r961
14422i871M82K964j816J418M880M058J713p917L134l545l55N248P091k034m456
$$ y = [4610, 736, 4662, 5413, 1314, -2188, 866, 856, 1824, 5348, 8678, 3703, -2812, 3736, 6314, 2815, 4024, 7655, 8772, 6057, 3285, 1914, 1646, 823, 4660, 3637, 3305, 4393, 3794, -940, -9528, -14345, -11330, -10618, -12676, -16086, -13841, -12629, -6414, -2563, -8619, -8682, -2087, -3271, -3325, 3624, 5913, -914, -6151, -9455, -5937, -9882, -16341, -21494, -14746, -5609, 1494, 4642, -560, -3007, -3865, -5610, -1408, 1682, -1631, -6748, -2067, -1255, -2504, -1004, -5485, -1012, 4703, 2013, 2673, 2728, 495, 2625, -677, 1703, 4080, -3876, -5427, -119, -295, 2199, 3017, 3903, 4360, 6875, 2833, 9780, 13624, 5350, 1737, 1222, -8146, -11675, -12544, -12368, -11845, -4617, -721, 491, -2172, -4578, -8438, 538, 7257, 90, -9871, -9389, -6425, -8241, -6823, -1943, 2115, 3828, -4089, -955, -4500, -4855, 393, 7484, 5450, 994]
14407I94n093J678L046n164l816J873r26o35j342K610J280J429N27M280J96j859
14391i22l420l308n50K780k504m690J159K036m000N24O066M291n647N85K614K394
14375b592L061n922p41k73M251O512k457K217l004k013J321L967J636r923o9O120
14359B091k159k535n429j833l402M638n06Q99j635k309J179L332j515K675K321
14344d188l10j016R209r26m033o761n406K993K644K353N8J106L319J279r74k86
14328i39o792l268N565k522L653K001J267q3K080o4j259l376K23N063Q773N395
14312A5717m811q294j078M690N225m147J140J071k194N862K120m237N351J954
14298A8369r384l046p267K596N913J720J838P52r53K681L156k932m70N582k594
$$ y = [994, -4099, -2421, 625, -4539, -8355, -6482, -7408, -8043, -9385, -6775, -5495, -4066, -3539, 741, 937, -922, -4342, -7650, -8200, -5420, -7924, -12614, -11455, -9419, -13419, -12895, -6829, -2538, -8185, -7600, -4986, -2592, 469, -5453, -6194, -6467, -2216, 4296, 1839, 4056, 1052, -961, 360, 4327, 5963, -3960, -4029, 2091, -68, -2603, -8032, -9865, -13267, -8629, -9135, -8236, -9871, -12180, -11001, -7669, -9184, -6509, -4188, -4498, -5514, 3695, 2769, -1264, -8025, -13431, -10438, -7794, -5441, -5383, -4277, -958, 321, -653, -939, -7731, -10999, -5434, -7956, -4303, -2302, -1035, -1118, 962, 898, -361, -3737, -3514, 1549, 10322, 15717, 10906, 2612, 1534, 6224, 11449, 7302, 8442, 9513, 7319, 13181, 15301, 11064, 16415, 18369, 8985, 5939, -1328, 1268, 7181, 8901, 10739, 11491, 10538, 13219, 16375, 13443, 12973, 18555, 15961]
14283A5961l017n83J392l330j0090M908k258K669K447K5M142l709k913o48J01
14268E097J744P079k594l150n690k919K749J846l145L443O968l479n864o654J0786
14253F217L323k607j898j795k536J013p268M572N181L591o3m488p981k907R197
14238A551O665m794m633m46m281l586j089N825M888L393m785m306J030K440k28
14223b356K579j259k128R27J222m83k199j843J745J81MM97l289K316M396n64N126
14206D872m44j422L302M513k921k341j221K076r188K629n82J381J078l926P42
14191a452O225r84K538m703l782k011M074L270N893J55o373j2168N16M585J058
14176c159L74R03M424K866K426k060K609o117m580K066Q010Q877L027K002p648
$$ y = [15961, 12944, 12361, 13753, 10423, 333, 5241, 2983, 5652, 8099, 8124, 12266, 8557, 5644, 4996, 5097, 6841, 13920, 11326, 8176, 2486, -433, 2316, 4162, 1017, 4460, 11428, 7949, 2085, -4569, 6217, 9540, 6933, 5035, 3240, 704, 1717, -5551, -979, 4202, 7793, 7730, 3242, -4739, -7646, 1551, 8216, 3422, -1211, -1657, -5938, -9524, -10613, -4788, 100, 3493, -1292, -5598, -4568, -2128, -2356, 223, -1036, -3164, -2237, -1015, -1498, -3697, -5540, -3795, -3614, -3610, -3113, -6402, -4086, 310, -254, 4872, 4428, 3006, 6308, 10821, 7900, 5559, 4338, 6414, -2774, -145, -727, 654, 1732, -2194, -1452, 4773, 3789, 6327, 1624, -2158, -4169, -95, 3175, 9068, 9223, 2850, -9318, -8802, -4217, -3159, -2785, -1882, 2542, 5408, 7834, 5774, 8383, 2266, -2314, -248, 7762, 16639, 19666, 21668, 14020]
14161A4020J47K827k849l950j442j780q20K113K887J953j556k998o052p237K962
14146a775J858r537O487O761k394m256n083M930j85m63k914K704j595Q93J3377
14131H808O396K605N255Q483J868K051K71m979o892l321l703K013m315p170K489
14116I859j756q669p531j839K191J532M014N542J431n19k968M47k10o644J375
14101c745O606N23l061K23k026m357q79O126J0352K582M572O339L703K305L054
14086C2317L99Q480P552p174j0162q291q713q960k40k51L984j660o413r64l859
14071c955K280P2l178J028O403P85l115K517r61j379j708L159N387M236k404p698
14055A469j170K729n608L611l98K61J2198Q044J654l205M942J784p143n246l328
$$ y = [14020, 14167, 16994, 14145, 10195, 8753, 6973, 6153, 8266, 11153, 13106, 11550, 8552, 2500, -4737, -1775, 83, -9454, -2967, 3794, 1400, -2856, -7939, -3009, -3194, -3657, -6571, -3867, -5462, -4569, 8808, 15204, 17809, 23064, 31547, 33415, 35466, 35737, 30758, 23866, 20545, 16842, 18855, 14540, 7370, 9859, 8103, -566, -8097, -9936, -7745, -6213, -2199, 3343, 4774, 4255, 1287, 1734, 1524, -5120, -3745, 2861, 3384, 323, 546, -1480, -5837, -6716, -590, 9762, 12344, 16916, 23255, 26958, 29263, 32317, 32716, 41196, 48748, 41574, 31412, 23121, 14408, 5448, 5208, 4957, 8941, 7281, 868, -96, -3955, -1675, -1603, -4781, -3753, 2650, 3435, 320, 2837, 1876, 497, -1211, 1948, 7335, 11571, 9167, 1469, 299, 3028, -2580, 1031, 633, 894, 13092, 21136, 22790, 19585, 24527, 26311, 19168, 13922, 10594]
14040A0594j971n345k872l404L167l221J175O857P016k752j2501J018K370j584
14026a453n697J388j049L014O371M226q053n276K856R43j931J250M425k089J060
14011a5L798n686q10J785n997m848J2884P400j053o393m452k277k776M460N850
13996A870M495n33j2525k361J802K180p32M809j746N388L124q450N96J205k627
13981c505L723K784n5M258r71o378p796q203k080N236O209O8J272K535O61O63
13965a579j930J1884J899k134p206p181j613N513k052m081q681J342R289K834
13951c696k968j220m180L417P234K121J401j642k997J331Q160k081j659K977m140
13936B058q201K782k394m545p729N519P882J838m418L89L948j104q438p30Q050
$$ y = [10594, 8623, 3278, 406, -2998, 169, -3052, -1877, 4980, 11996, 9244, -3257, -2239, 131, -1453, -7150, -5762, -6811, -3797, 2574, 6800, -1253, -6529, -3673, -2730, -4661, -3411, 1014, -1075, -15, 3783, -1903, -2713, -928, -6925, -11773, 1111, 8511, 7458, 1065, -3387, -5664, -8440, -3980, 1870, 6365, 5832, -6693, -9054, -7252, -5072, -5804, -995, -2741, 2647, 5771, -2679, -2083, -878, -3505, 218, 3002, 2947, 7205, 6234, -144, -7940, -16143, -18223, -12987, -6778, -6710, -5438, -2903, -2242, -1579, -3509, 8375, 10274, 8140, 934, -6247, -7860, -2347, -4399, -8480, -17161, -15819, -6530, -3696, -6664, -7884, -12064, -8647, -1413, 708, 2109, 467, -2530, -1199, 6961, 4880, 3221, 6198, 2058, -6143, -3361, -5755, -10300, -18029, -12510, -4628, -2790, -7208, -6819, -2871, -3975, -12413, -13143, -5093]
13921e093P499N926l035J533k500J154O198j4213k333K071J180M644n26r915l1
13906g441o23k774j22L919j234K7L0p4J284J2033J311l603O75l8j290r303p485
13889a4708L519n75L536L848j746J418j87m438M545P711J274m222k167k599n877
13874a0668o15J013N276P43L554M032J590l192l164J9p219k676k961l925M632
13859a3561L231P866K666k877M696J579o552J865j03n35L289N969R43o492m353
13844b369o758j653J790K879Q690J250o377K351J406l322j699M364M610L596J181
13829I939j389n81j4125q605O28P573O842N4k963k093p9l32k377J0k431j304P226
13812d007J2111K337n475m23M018P745o971p115o948l084J736J258K249N898k719
$$ y = [-5093, 2406, 8332, 5297, 6830, 4330, 5484, 11682, -2531, -4864, -2793, -1613, 3031, 2505, -7410, -7441, -8064, -10838, -10960, -7041, -8275, -8248, -8218, -8292, -7008, 5025, 6336, 2733, 3408, 3370, 2080, -7223, -14708, -11189, -11764, -8228, -4380, -6126, -4708, -4895, -9333, -4788, 2923, 4197, -25, -2192, -4791, -10668, -11283, -10270, -4994, -4251, -697, 3335, 4925, 1733, -1431, -1412, -8631, -11307, -14268, -18193, -13561, -10330, -2464, 202, -2675, 2021, 3600, -2952, -1087, -1190, -1725, 1564, 7533, 8476, 1984, -2369, -9127, -10780, -8990, -6111, 2579, 3829, -2548, -197, 1209, -2113, -3812, 552, 5162, 8758, 9939, 8550, 7969, -6156, -14761, -14133, -6560, 282, 336, -2627, -4720, -4799, -5131, -7508, -7498, -9929, -11233, -4007, 8104, 10441, 4966, 4543, 8561, 16306, 9335, 2220, -4728, -7812, -6076, -4818, -2569, 3329, 610]
13797F10n927n345p84l462J933O57l46M064O169J660n51q859J480O628K634p910
13781g349p702J277J463K165J622P021L624o675K343L107l007p016R8k973k257
13766a4259O828O337N70l079l311O66K392R76k933m197r53O041l15J231J608L571
13750A173O490J850o16j744J550o100n201n310K988L570j217N585J633j478K64
13735C437L696k43L23m722p72N497j3375n906J676L650j674p746j173Q608P239
13720a485n2k175M825k454Q81No0k455q29N303j354l827k510j447N739M336L336
13703E777J843n634j228o792m846N777J528l061n119k240j373Q137R247K558K723
13688G297o31L293k719r52m60m636n79j315j393l42M71j686o167J000L064k877
$$ y = [610, -5317, -10662, -11446, -14908, -12975, -12318, -12664, -8600, -2431, -771, -1322, -10181, -8701, -2073, 561, -7349, -15051, -13774, -12311, -10146, -8524, -1503, 2121, -4554, -2211, 896, -2111, -9127, -9029, -12002, -14259, -7431, -1094, -524, -3603, -6914, -6248, -3856, -2880, -5813, -10010, -10963, -4922, -5237, -4006, -2398, 1173, 7663, 9513, 8897, 7153, 8703, 2603, -2598, -7908, -4920, -1350, -2567, 3018, 4651, 3173, 3437, 7133, 6890, 7213, 2491, 1719, 7216, -6159, -12065, -10389, -6739, -8413, -16159, -17332, -8724, -1485, -1537, -3712, 1113, -1341, -460, -455, -515, -2970, -3799, 1504, 150, -3677, -6187, -7634, -1895, 2441, 5777, 7620, 1986, 758, -6034, -10880, -5103, -3575, -6636, -11755, -13995, -15368, -7231, 2016, 4574, 7297, 6666, 9959, 7240, 6288, 5828, 1192, 613, -702, -2095, -2437, -1966, -3652, -9819, -8819, -5755, -8632]
13672h632Q289K695K134L481P264K300l662j2842l850k745l449L281k063m26O866
13657a359K670J380r02J284J582j560K902L050n988j3220n263L925J656J470L420
13642d953k06L718m8P507l454m505n124J038P642k914l408L897L54n35L992K405
13626E406L813l844p176l922M49R315K26o848l736k795l844k25P568O748j107
13611B8m831J157j547l69Q27l24O4o133l377L179M336J171j251q0O332J214l554
13594c158r07r577j265N50O211J161j317L487K319M403m77O010L046o246J695
13579E935k497j2788j1565j607M840L033M084J82K233J531N33K417M337j620p038
13564g990q56J406l500L937l520k989R016J218l453K002O365j826l681o313M172
$$ y = [-8632, -343, 2352, 4486, 7967, 15231, 17531, 13869, 1027, -2823, -5568, -9017, -5736, -7799, -8225, -1359, 1311, 2691, 1789, 3073, 4655, 3095, 5997, 9047, 3059, -10161, -15424, -11499, -9843, -8373, -4953, -5159, -1441, -1489, 6018, 2564, -1941, -7065, -6027, 1615, -1299, -4707, -810, -456, -991, 3001, 5406, 9219, 5375, -1801, -5723, -5274, 4041, 4267, -2581, -6317, -9112, -12956, -13181, -5613, 1135, 28, -4803, -3646, -5193, -5562, -4735, -5059, -4995, -11128, -14505, -11326, -6990, -5819, -7070, -7150, -818, 396, -3158, -4065, -13642, -14907, -14357, -8146, -6985, -8302, -4815, -2496, 1907, 1430, 7440, 10486, 4240, 5935, 3438, -9350, -20915, -22522, -17682, -14649, -10565, -10383, -8150, -6619, -6086, -3669, 668, -952, -7990, -8846, -7440, -10940, -7003, -10523, -13512, -4496, -3278, -6731, -4729, 1636, -190, -3871, -10184, -6012]
13549f012Q303K244K000k032q838k479N379P779P495J577q881k554n45k088J527
13534B875q969n049M853L550j038J147n497l338J011N151P510k316j297k796J333
13519b870O80j664J595m387m421m27k146O431J0417L237n235m525o300k347N687
13504f275P881R04k491K508k60m324n073L506J148J926M948J343m734m955j515
13489e463l485l242Q131N489j710n038l441k631L557L595l003p308N81J476K297
13474a0195P355j238O493O880m934l138j623n359o353K404N703J434Q80j188k639
13459e518l289K852J994l929M535N660j427k637J05K192j329O67K400L12m797
13444b209L491L724m5j090m476k113J251M041J83l794K648M961m62n148j850o827
$$ y = [-6012, 2291, 4535, 6535, 4503, -4335, -6814, -1435, 6344, 13839, 15416, 6535, 3981, 3436, 1348, 2875, -6094, -11143, -6290, -2740, -3778, -2631, -8128, -11466, -10455, -5304, 2206, -110, -1407, -4203, -2870, -2190, -3854, -2259, -6646, -11067, -11494, -13640, -7209, 3208, 6445, 1210, -3315, -9615, -11962, -6275, 1606, 2510, 19, 2527, 2267, -2057, -7130, -3624, -2476, -550, 4398, 5741, 1007, -3948, -5463, -8948, -12190, -4059, 1430, -280, -5318, -8759, -11390, -7833, -4238, -7241, -14549, -13968, -12492, -10195, -2840, -4078, 2415, 9295, 4361, 1223, -400, -5759, -12112, -9708, -4005, -2571, -1691, -2879, -5518, -8807, -5955, -3961, -7890, -3355, 2305, 878, -1759, -1654, 538, -791, -124, 2276, 2588, -2209, 1282, 5006, 4961, 3871, -605, -2718, -1467, 2574, 2757, -1037, 1611, 6572, 6110, 962, -888, -7715]
13428g715P774k34j163K043l627k520O89l051j496O988N177Q98m359P95L50L296
13412C845N004N099L839o87m436K54om703N073m478J946l296l267O680O187o164
13396A0890l210j906k977p572Q81N363M056j839l233m983L974K722L947J798q39
13381G072O319p718j1148q65k31K937O760n269o00m668N112M933o526K53J167
13366b472K684L760p53L066K852j429j863l746J43M936n660j2403K045K785K837
13351c218J947M350K850J483o405k32K545j733Q03l266k897j604l891P654R827
13336H213K805n664k889m722K149L671K516L238k893l638m798r86K3R85l924O108
13320A94M65L70O23k384J555N458L968M001k497m518L699M297j008o964o711n143
$$ y = [-7715, 59, -175, -1338, 705, -2922, -5442, -4753, -7804, -9300, -2312, 2865, 3763, -596, 199, 549, 3845, 8849, 13948, 17787, 17100, 12664, 12918, 12912, 8209, 13282, 8804, 10750, 7454, 4187, 10867, 17054, 10890, 7680, 5774, 2797, -4775, -3894, 1469, 5525, 3686, 453, -4530, -556, 2166, 6113, 7911, 7072, 13391, 5673, -5475, -6340, -6571, -3634, 3126, -2143, -2743, -7411, -2299, 2634, -3892, -3639, -2472, 212, 3972, 3219, 6285, 9137, 7708, 5845, 2099, 2242, 7178, 1518, -10885, -8840, -6055, -3218, -1271, 3079, 5929, 7412, 1007, 775, 3320, 1587, 2390, -876, -3773, -5377, -9268, -1614, 8213, 11018, 5354, 2465, -2257, -108, 3563, 6079, 9317, 6424, 2786, -2012, -2998, -2975, -1990, -5914, 194, 659, 1029, 1652, -732, 823, 6281, 10249, 14250, 11753, 7235, 10934, 15231, 14223, 7259, 548, -4595]
13304d595N60J262J634j724j619O91l812J602J722j697l657L277K628J36N628
13289B036P935L47p482n644m238K573L50o071j510L596L541M827N118o103j456
13274b181L983m75j563J627J484j0546l388R412K107j016J987k024M766N711j696
13259H188j892j326l915k500L11m186k121K845O809j874N531k174o504Q95K684
13244G71P6k298M578L572J961l342n247o432J454M17L741j197R63k477j23j085
13228d668J432j277N11N579J565l70l373K813P059j859j759n887k727L173J781
13213A993p091P03P37L69K48J03J0661M058J0n653j517j67m372j410P666M887
13197A1225k672o001o383o307J985L690n742m816J718J295Q240K075J035q063
$$ y = [-4595, -4035, -2773, -1139, -2863, -4482, -3791, -7603, -6001, -4279, -5976, -9633, -6356, -3728, -3592, 2036, 9971, 10318, 2836, -2808, -7046, -4473, -4123, -10194, -11704, -8108, -4567, 260, 5378, -725, -2181, 1802, 1327, -236, 1391, 2875, -7671, -11059, -1647, 460, -556, 1431, -593, 4173, 9884, 8188, 6296, 4970, 1055, -1445, -1134, -5320, -7441, -4596, 2213, 339, 5870, 3696, -2808, -1913, 771, 847, -1451, 3127, 6699, 8660, 5318, 71, -6361, -4907, -4490, -749, -1946, -983, -3460, -3583, -4668, -3236, -4513, -4002, 1577, 3142, 2772, -601, 2212, 9271, 7412, 5653, -234, -2961, 212, 1993, -5098, -4395, -3658, -3289, -3041, -2938, 7723, 11781, 11791, 6138, 4621, 4454, 82, -1328, 6338, 11225, 8553, 2552, -3831, -10138, -8153, -4463, -10205, -15021, -13303, -12008, -3768, -1693, -658, -8721]
13183h721p971L156m72M743J657M661q52J280M172m111p557k303L245L126n44
13168f491M138K260m474L035M73j353L266j710j211j451r21m096K541L717j775
13153d052j243j231j824o052J614Q698o87M5J154J212R39N692j426n884M20q388
13137a1013k692j83O778O203M356O256l688r958j24N971q01n767j0239M9L064
13122a1788K338L224Q045K952r923k737L494l363j405O491p817r68J425j364l061
13107a4457K71J048Q139M283L235N873K220k238J08q608j1309M29J911o50N831
13092c914J0305p06Q67l541j047n284m88J043o382L25K061Q11q48N45M332O936
13076E015q311m964L392O798k614k462l237P28M273K208L171L16j064N50K839
$$ y = [-8721, -16692, -13536, -14008, -9265, -7608, -2947, -3799, -2519, 1653, -2458, -10015, -12318, -9073, -5947, -6491, -2353, -93, -4567, -1532, -1059, -2412, 854, -856, -2067, -3518, -4439, -8535, -5994, -2277, -4052, -5295, -6526, -8350, -14402, -12788, -4090, -4777, -4732, -3578, -2366, -1427, 4265, 2839, -3045, -2625, -11013, -13705, -13888, -7110, -907, 3449, 9705, 6017, -3941, -4065, 1906, 1105, -4662, -14901, -14852, -11788, -9450, -6226, 1819, 4771, -5152, -7889, -4395, -7758, -9163, -2672, -10489, -11457, -10032, -11396, -14457, -14186, -13138, -4999, -716, 2519, 8392, 10612, 8374, 8482, -126, -11435, -11006, -9095, -9745, -3914, 6391, 5685, 6552, 3011, 1964, -3320, -3808, -2765, -9147, -8822, -6761, -5950, -6798, -6253, -1921, 5015, -3296, -8260, -4868, 1930, -684, -3146, -6383, -5655, -1382, 826, 3997, 4313, 3249, 3799, 6638]
13061F638p637n918P095N77L400N802R92K066q092o955K473j814q20m922N129
13046a986j316K082L343n63l819M401m040m624j453o797N64R322R108j530K312
13031E004k512m801J509p55J964m130L38K221Q65j931L0n430l66m39j858K532
13015g759K45K709r99n435j90L793K031M546j093m001k597J280q03L921r3l424
12999g869Q51L066p751L04N774K655J728O13N330K745m800m145j469M809O9m355
12983b445n194R00n59J1244J927K265P583m03n631m61J49o795m841n367m077M047
12967g658R567O243l606m036P56N483k098k964L724K716r29m968j891M582J851
12952F772L11N536l075j0353p71N003j543k507m928k03M013l63M519Q682l786
$$ y = [6638, -999, -6917, 178, 755, 4155, 9957, 10949, 13015, 4923, -2032, 441, -1373, -2193, -7115, -1986, -3302, -1220, 2123, 1560, -2259, 2142, -1898, -6522, -7975, -14772, -14208, -4886, 4222, 2692, 5004, 2492, -2309, -800, -1555, 409, -3721, -3383, -1162, -297, -2228, -2198, -7628, -7994, -8433, -10291, -7759, -7514, -4805, -5804, -11239, -11429, -7636, -5605, -1059, -2152, -6153, -8750, -7470, -8273, -4352, -4445, -7869, -7018, -3952, -11703, -11399, -5625, -2970, -1242, -629, 4701, 7446, 2646, -1499, -2968, 1841, 1910, -2445, -7639, -6739, -7298, 3946, 5873, 8138, 15721, 15318, 9687, 9226, 9375, 2580, -2261, -7628, -11705, -7658, 1909, 8152, 4546, 510, 1266, 6749, 4651, 1687, 5411, 8127, 7198, 2230, 339, 4921, 6772, 7083, 12619, 9544, -809, -1580, 3423, 1880, -627, -5555, -5758, -1745, -2108, 2411, 11093, 7307]
12937G307q510M666K033m417j23L324N958l080n397j76k241n446j962j712K732
12922g044O718Q416j545L793O589m302j583l067n193O636j546M98k49j988n271
12907H62j61m35K165l856k089K290n13J940K202N84K579m42J354m291K192L674
12891H055n323j048P81j91K185k115k327K648l838k807O154Q79l310j784K445
12876D04j329l993O227L615K35n593n685j442M557l74K499K668J785P65l279K337
12860C397N401l681l434M369M605j318k883m576r523M424P222N079P36q672l870
12845b724M117M58l012q404N74M900P403K538j245j723J505q0j287J247m138j719
12829a590m653O210K362l023K012k966m685r16L145N635R15o303m030K718K678
$$ y = [7307, -1203, 3463, 5496, 1079, 956, 4280, 10238, 7158, 1761, 1585, -656, -6102, -8064, -9776, -7044, -326, 8090, 6545, 10338, 16927, 12625, 11042, 7975, 2782, 9418, 7872, 8370, 8121, 6133, 862, 701, 266, 2431, -1425, -3514, -1224, -1737, 203, 2405, 2989, 5568, 5126, 6480, 2189, 4381, 8055, 2732, 1684, 2465, 2274, 4459, 2344, 17, 2665, -1173, -3980, 2174, 3053, -257, -2041, 404, -925, -4918, 1309, 4924, 5159, -434, -6119, -7561, -3004, -3378, -879, 1789, 3574, 4339, 1060, 3397, 8798, 5117, 1683, 6052, 10657, 9339, 6456, 1880, -7643, -3219, 4003, 9082, 9818, 1146, -2724, 1393, 1851, -1161, -9565, -8991, -4091, 3312, 5850, 4605, 2882, 4387, 4307, 3020, 4267, 129, -1590, -6243, -33, 2329, -694, 1318, -1648, -6333, -7249, -4104, 1531, 2446, -3857, -7887, -5169, -2491]
12814b491J019M67Q272K31q608o667n325O989P787R86j027k30j58r358O684R642
12798H213k078n401n406P20k039m610Q80K783j514J3252L810J893k60l671l328
12783C244j582p14o257l765M312L127n821l451O142L85p059j172K57l689Q454
12768g589L468N62L60J549k509o339m868M615L844K198J327j258O182O365m189
12753C718r233j306r96J014K116K715j755k685n36M654O967M839J454j686o011
12738C269j4382l656P63j875O449O478K226m046J910J350N38P947k580n727N660
12723D324M118k636o38L544P673p722r441N188J630n980l832j299K779j53p207
12708i652J022J269M630K174O726j44n470J108N474P54O60p861n190j715J168
$$ y = [-2491, -1472, -1005, 7267, 7498, -1110, -7777, -13102, -6113, 1674, 2660, 1633, 1403, 1245, -8113, -1429, 8213, 6135, 734, -4672, -3952, -5991, -10601, -9721, -6938, -8452, 4800, 8610, 10503, 10243, 6572, 3244, 1662, 948, -5309, -9074, -4762, -1635, -7456, -10907, -4765, -4380, -11439, -12611, -12354, -16043, -7589, -4121, -3559, -3199, -1650, -4159, -10498, -15366, -10751, -6907, -4709, -3382, -4640, 1542, 7907, 3718, -5515, -6821, -7817, -6803, -4687, -1972, -3727, -6412, -6948, -2294, 4673, 9512, 10966, 9280, 3269, -11113, -14769, -14006, -15881, -9432, -2954, -728, -4774, -2864, -1514, -976, 6971, 4391, -1336, 4324, 8442, 5806, 5168, 8712, 16385, 8663, -778, 4410, 6040, 60, -3772, -5071, -2292, -2445, -9652, -8630, -7361, -2731, -557, 6169, 6025, 555, 1663, 7137, 7891, 8551, 690, -4500, -6215, -5047]
12693e047Q858L294k610q202k86K676m20r49N613N649M19m222K091K044j424o530
12677I54l366j586m628K435J186o618K364K083k778L283O979O24K401l36o131
12662c134j360J0314K131m420p9p454k959L212N808N74M20N408K821k979o716
12647A587j087O992J289l739j0990K019L577j83L364l202P61o177Q94j495p064
12632a3454L135K656N100M065m415n26K101L540P717o75m364J986p249p184L251
12617d316M002m181k902j952O094j620J782Q99J801N403l48N21J29j647j558r4
12601B013m805m209M13J775M919J630n25k576l253o843L69J291L966J359K965
12586a511L952j710J033j142l220j303l256M275Q939M932o035o574K177N605j692
$$ y = [-5047, 3811, 7105, 4495, -3707, -3993, -1317, -1737, -2686, 2927, 8576, 8995, 4773, 6864, 8908, 7484, 954, -2412, -3998, -8626, -6191, -5005, -11623, -9259, -7176, -9954, -6671, 308, 932, 3333, 2997, -3134, -4494, 5820, 7951, 3531, 3452, -4002, -6961, -3749, 2059, 2633, 3053, 8461, 11282, 8303, 1587, 500, 7492, 8781, 5042, -5948, -3929, -352, -535, 2829, -373, 388, -5789, -4895, -6390, -13454, -10319, -7663, -2563, 1502, -2913, -3439, -1338, 2202, 9919, 9244, 4880, 6866, -383, -7567, -4316, -314, -4495, -7397, -9349, -3255, -4875, -3093, -2194, -393, 5010, 4662, 5183, 5312, 3665, 2107, 2013, -2792, -7001, -6588, -4813, 106, 1736, 1211, -1365, -4618, -11461, -11092, -9801, -5835, -4476, -1511, 2441, 731, 1764, 622, -2598, -3901, -7157, -2882, 6057, 10989, 4954, -1620, 557, 6162, 4470]
12571D470j944q65k609j73M513J31p25p07O52O73k986n241K824l99n025O99L97
12554f315j16O699K709n503k528P017P311n304l813j504J702L753L151R15K911
12539A1085l834j797L524o81m412n300Q06L323m131L01M968K672m183R57k89J861
12523D870J7M463k288P22J971r81J701p77k057N238p80j091p845m488K953L750
12507E378L123j003q750n025K172K971L969J973k070k526J718J077p47K025m608
12492c23m876J281M384R87L392p96K640N04o380m255q05R284n960n510j403m738
12476a2574J164L298P30k987k206M350K534q81L574P364M55M679Q096J0006J472
12461B9074J373m74o131j3410r105Q34M576J1893k438j4832k548n57j688M871
$$ y = [4470, 2526, 1661, -948, -1121, 3392, 3523, 2798, 2091, 2743, 3416, 430, -4811, -1987, -2386, -7411, -6712, -6315, -6431, 268, 2977, -2526, -5054, 1963, 9274, 3970, 157, -1347, 355, 4108, 7259, 8174, 11085, 7251, 5454, 8978, 8297, 3885, -1415, -609, 2714, -1417, -1116, 3852, 6524, 2341, 3298, 3009, 4870, 4887, 9350, 7062, 7784, 9755, 8774, 10475, 9698, 7641, 12879, 12099, 11008, 3163, -1325, 1628, 5378, 8501, 7498, -1252, -6277, -4105, -1134, 2835, 4808, 2738, 212, 1930, 3007, 2260, 4285, -323, -5199, -3918, 466, 1453, 4845, 4049, 6689, 7193, 813, -3442, -4247, 5037, -923, -6433, -7836, -12574, -11410, -8112, -7382, -10369, -12575, -8225, -5691, -6572, -2998, 4366, 4821, 9500, 17596, 27602, 29074, 30447, 29973, 23842, 10432, 1327, 2161, 6737, 18630, 16192, 1360, -1188, -1745, -3433, 1438]
12447A438J890O100M042p557j194J687q935P8P091j401l153J605L007o75P22n162
12431d17l265o414j475M958R229N570P88m03p622j0069P857J548o357J290q59
12416e641K629o6J794k355j232O319L111O92r07Q80P2p403j722K814j334k21J341
12399a229L122K311k312K971L662n890j608n542j155J831j4l850R61N610k641
12384c773M0J219K366j391l213O651K177j2890k523K847K29N539M070Q501K087
12369A1936n681J500J85L538n780k680Q93k256K91j377L221q84o164K669M795
12354D206J900k791l223M384j284k317l76L450K483M296k520n510m994m213L504
12339c005j168k77l582j326K489O824M869O733n232r291O395l50n074j9O70L725
$$ y = [1438, 3328, 9428, 13470, 5913, 4719, 6406, -2529, -2451, 4640, 3239, 86, 1691, 4698, 4023, 4745, -417, -3682, -10096, -11571, -6613, 2616, 8186, 8974, 8571, 949, -9120, -1263, 285, -6072, -4782, -5641, -3012, -3078, -1284, -3639, -4871, 1448, 4559, 5251, 4344, 5224, 5296, -2107, -3829, -1015, -2349, -2570, -1229, 1893, 4204, 1892, 4863, 8525, 2635, 1027, -4515, -5670, -3839, -3853, -7703, -6742, -1132, -3773, -3733, -2514, -148, -1539, -4752, 1899, 4076, -8814, -11337, -8490, -8261, -2722, 1348, 9849, 11936, 6255, 7755, 7940, 11478, 5698, 3018, 3911, 1655, 1946, 569, 3790, 2906, -3258, -589, 4206, 6106, 3315, 92, 4476, 3192, 875, 499, 3949, 6432, 10728, 8208, 2698, -2296, -6509, -3005, -4173, -4450, -8032, -9358, -6869, -45, 4824, 11557, 6325, -2966, 3429, 3079, -1995, -2014, -1344, 2381]
12323B381M919q41o665N440L215L67o819l36K270K034k460l255r95N096J327L669
12307I347k98M467n781n728m352p23j649K340K530L945J36O941k209L106J096
12292A3168M993J434k296m113o451n324L874J622j754m238k475K390m63K550r03
12277B014j770K524%k899K894M140P46q727l020J0239J90j298k02N057J159m339
12261F708P143J1624m289j547k378m387L440M898L166j09k055q041N983m123K71
12246A6304K42m903j19M915n453k433N645J823J21p204K131N803l198p792q316
12231b434N598K104K169r18l392k232M774J2007N394r85n74k471m511p441J245
12216H333k61p1K480o20K476P7j515K893m010o248l341M470N257p52L506J025
$$ y = [2381, 7300, 6459, -206, 5234, 8449, 8816, 1997, 1661, 3931, 5965, 3505, 250, -745, 4351, 5678, 9347, 9049, 13516, 7735, 2007, -2345, -3068, -4717, -2377, 153, 4098, 4234, 11175, 8966, 12072, 13168, 18161, 19595, 17299, 13186, 6735, 1411, 5285, 6907, 5153, 915, -1560, 830, 367, 2917, 2014, 244, 2768, 2768, -131, 2763, 6903, 7649, -1078, -4098, 6141, 6331, 5033, 4831, 9888, 11047, 6708, 13851, 25475, 21186, 19639, 17261, 12874, 16314, 21212, 24378, 24269, 22214, 14173, 20156, 16033, 16304, 16546, 11643, 11524, 16439, 10986, 8553, 14198, 16021, 16142, 8938, 11069, 16872, 13674, 5882, -2434, 3164, 5268, 7437, 6519, 3127, 895, 5669, 17676, 23070, 22085, 21511, 19040, 14529, 7088, 8333, 8072, 8001, 10481, 9861, 12337, 12414, 10899, 13792, 9782, 3534, 193, 4663, 9920, 9168, 12674, 13699]
12200A3699k853J522l989J281o661l297K967J3568R996n80n254m806p75J831q719
12185G930l38j082O807n011m260Q65Q11P02N228l489K100O483M791l328l98j470
12169A6341q27N627j997n510l394K901o35m01l297n788M503K820r6Q27m4j94J44
12152A0980K118ml4m457p531J439R060J0582J732j1j820n223l086n79J897n235
12136I828J451N505P533J383n533l481o103J844O74m733q65Q432N256M067M459
12121B9717P251j620j0249p008L840R95k191k17n276o585j248Q341P673j328Q99
12106B2994J640m193l315j565k974K639M817m54k676J1276L510p157J249J146
12092B6937J358K30o321L705M139o598k067q17n934k498J043m646l217J776N774
$$ y = [13699, 10846, 12368, 8379, 9660, 2999, -298, 2669, 16237, 26233, 25653, 20399, 15593, 14818, 16649, 7930, 7592, 6510, 13317, 8306, 4046, 4911, 5722, 6424, 11652, 8163, 10263, 16746, 21537, 18209, 17811, 16341, 15514, 21141, 19144, 13634, 10240, 13141, 12506, 12105, 8808, 3020, 7523, 10343, 10247, 11074, 11030, 10836, 10980, 13098, 13094, 13060, 8603, 1072, 2511, 11571, 22153, 23885, 23874, 22054, 16831, 13745, 13166, 15063, 9828, 11279, 16784, 24317, 25700, 20167, 16686, 10583, 12427, 13101, 8368, 7503, 15935, 21191, 25258, 29717, 36968, 35348, 25099, 18091, 21931, 22926, 20735, 20518, 15242, 8657, 7409, 15750, 23423, 22095, 22994, 24634, 20441, 17126, 15561, 12587, 15226, 20043, 19589, 16913, 28189, 31699, 24542, 25791, 26937, 28295, 28525, 22204, 25909, 30048, 23450, 21383, 20566, 14632, 12134, 13177, 8531, 5314, 7090, 12864]
12077A2864O18O391K497m831J302Q325K321l513k509q874j019M348J511r65N035
12062B3501J626L184P248M710N053K247K076O501O433J443L73n950l8L140R69
12047F2516Q84M832n93K000n146j395Q84m739j019P59m469J728R186k737l771
12032E8920l993r34N034N769J980k596L275L201N522M64m451q116j270J0489O790
12017H0084l521K096J2826M909K283M521L02N67M6l20P08K599N990L992p0L777
12001A20789K202J988L164N793P983L378N978L025K14M355O098L864M301J0645
11987A83777M926O833J3148J0054J950m089M247R854N994Q547J4595P478J2546
11974B79860J5412J2882J1187Q719Q899J5652J9156J7825K6027J7633K1107K2313
$$ y = [12864, 13482, 19873, 22370, 17539, 18841, 27166, 29487, 25974, 23465, 14591, 13572, 17920, 19431, 18466, 23501, 25127, 28311, 35559, 40269, 45322, 47569, 49645, 56146, 62579, 64022, 64395, 58445, 58407, 61547, 62516, 63400, 68232, 67639, 69639, 64493, 63098, 63982, 59243, 58224, 58983, 54514, 56242, 65428, 62691, 58920, 54927, 53993, 59027, 64796, 66776, 64180, 67455, 70656, 76178, 76642, 72191, 64075, 62805, 73294, 80084, 76563, 78659, 91485, 96394, 98677, 103198, 103500, 104067, 104113, 103793, 104501, 107100, 113090, 117082, 117012, 120789, 122991, 124979, 128143, 133936, 141919, 145297, 151275, 154300, 154514, 158869, 164967, 168831, 173132, 183777, 188703, 195536, 208684, 218738, 220688, 216599, 220846, 230700, 236694, 245241, 259836, 267314, 279860, 295272, 308154, 319341, 328060, 336959, 352611, 371767, 389592, 415619, 433252, 454359, 476672]
11962D76672K5826K9293L0735K9632L2591L7584M3324M0522M8080O0016O8548
11951I22823P0353P4886Q5910J01743J07359J20304J36362J54553J83053K09827
11941B167173K35791K77215L27359L86437M51397N45258O59441Q04008R76874
11932F830953J179375J425820J705398J983511K182754K197989J892016J203612
11924B0601428K00004q54812j670258k090953k169704k018542j770841j496545
11916H729777j246086j039136q61892p09991n89653m99664m23346l62776l07110
11907B690123k67870k36737j97361j68538j50940j38872j22075j10749r1657q1025
11897A124299p1472o9627o5275n4975m8619n3227m4577l7949l1999k9887l0386
$$ y = [476672, 502498, 531791, 562526, 592158, 624749, 662333, 705657, 746179, 794259, 854275, 922823, 993176, 1068062, 1153972, 1255715, 1363074, 1483378, 1619740, 1774293, 1957346, 2167173, 2402964, 2680179, 3007538, 3393975, 3845372, 4390630, 5050071, 5854079, 6830953, 8010328, 9436148, 11141546, 13125057, 15307811, 17505800, 19397816, 20601428, 20801432, 19946620, 18276362, 16185409, 14015705, 11997163, 10226322, 8729777, 7483691, 6444555, 5582663, 4872672, 4283019, 3783355, 3360009, 2997233, 2690123, 2422253, 2185516, 1988155, 1819617, 1668677, 1529805, 1407730, 1296981, 1205324, 1124299, 1052827, 983200, 917925, 862950, 814331, 761104, 716527, 678578, 646579, 616692, 586306]
11886E86306l2183k3749l0813k7739k9071j8248j5291r897j2506q859j2079j3173
11874C52698j1288j1361j3429j6237q715o795o149o197j3922r749q529o384n298
11861B28645m653l946j3878j5215j878l008l975m521j0433J66N34O30j166l693
11847A63609o845q701m569j270r753j0256n964l771J302N086k580p687L769J327
11833A13697J503j459l798l955R84m82l250k312l824p260k967K698k603l201L86
11818H4157om194j638j754m427J310P812L528m087q439j554l364J16o643m038
11803E6779l18n100J289j39Q950J889j924L18Q887K466l077p612m064L081K619
11788F4044N542L039K136M675K056q762n64j772n229o435k024K666M591K128l2
$$ y = [586306, 554123, 530374, 499561, 471822, 442751, 424503, 409212, 399315, 386809, 377950, 365871, 352698, 341410, 330049, 316620, 300383, 291668, 284873, 278724, 272527, 258605, 248856, 240327, 233943, 228645, 223992, 220046, 206168, 190953, 189075, 186067, 182092, 177571, 167138, 167304, 167838, 168468, 167302, 163609, 156764, 148063, 143494, 142224, 132471, 122215, 116251, 112480, 113782, 118868, 116288, 108601, 112370, 113697, 115200, 113741, 109943, 105988, 106972, 106490, 103240, 100928, 97104, 89844, 86877, 89575, 86972, 83771, 84157, 84151, 79957, 78319, 76565, 72138, 73448, 81260, 84788, 80701, 72262, 70708, 67344, 67460, 60817, 56779, 56461, 51361, 52650, 52511, 61461, 63350, 61426, 61744, 70631, 73097, 70020, 62408, 58344, 61425, 64044, 69586, 72625, 74761, 79436, 81492, 72730, 72166, 70394, 65165, 58730, 56706, 59372, 63963, 66091, 66059]
11773F6059l820m514k345m35m208l876o410M524K906J836l774J096O45P21k638
11758D5767m429J294L634O089O670J112o193qm877J680J157J570L123k738p012
11743D6839q13N349j576p341p861l851k480j966j526l784m70L428O833J010L87
11728C2178L256l966j1206m418j110K717l223j242j65M797l334K816R271J793
11714B8164l478o582K097P94k872L96j445p52O265O892m38o581j256J758O097
11699B9059J386L96j100N395q18m335J425m458k189j806k955n075n5Q932p42l044
11683B0016L333r27j999k416k266L467o9n10o70m36P0o818K834L291P801K367
11667B7068o07L044k150n295n003j798O56K965j269N694q526l745M647P207K378
$$ y = [66059, 62239, 57725, 55380, 54945, 50737, 46861, 40451, 44975, 47881, 49717, 45943, 47039, 47684, 48405, 45767, 41338, 42632, 46266, 52355, 59025, 60137, 53944, 53936, 49059, 50739, 51896, 53466, 56589, 53851, 46839, 46026, 51375, 49799, 42458, 34597, 30746, 28266, 26300, 24774, 20990, 20520, 23948, 30781, 31791, 32178, 35434, 31468, 20262, 15844, 14734, 17451, 14228, 12986, 12821, 17618, 14284, 17100, 26371, 28164, 24686, 18104, 20201, 20995, 18123, 18519, 17074, 16322, 22587, 29479, 29041, 22460, 21204, 22962, 29059, 30445, 30841, 29741, 35136, 34318, 29983, 31408, 26950, 24761, 22955, 20000, 14925, 14870, 23802, 23060, 20016, 23349, 22422, 20423, 18007, 15741, 19208, 19139, 18629, 17959, 17523, 17593, 10775, 13609, 16900, 24701, 27068, 26461, 29505, 27355, 22060, 17057, 15259, 15915, 18880, 17611, 23305, 14779, 11034, 15681, 22888, 25266]
11652B5266L323K559l416q041n018Q202N871M512J019o355jk56n38j275M62J199
11636B7513P15j16r324n464M924m49MQ295L841N17P62m713J9j888k742M346K668
11619B8908J0681L021l11p721q499l321k275l309L808j14O629M536k772j181M517
11604C2597j616p7P406M91l164p447N91P128L912M304M458J614L60L548J2192
11589F6297J7763J4124J2440J1707J7926K6113J1379J3210J9812J6438P971M897
11577B40077m401n734p847q135n285j0555j2251j2341n669k073o63J883M767k814
11563A68959M17J306O818N273Q385Q059J4519J7417K0487J9037J1616J9549J5615
11550C17457O503M906N982q570j3579j280P856M310J2197J7661J8220L5754M7227
$$ y = [25266, 28589, 31148, 27732, 19691, 14673, 22875, 28746, 33258, 34277, 27922, 27921, 27665, 27127, 25852, 26314, 27513, 28228, 28112, 18788, 13324, 18248, 17799, 17803, 26098, 29939, 30456, 31218, 26505, 26524, 24636, 21894, 26240, 28908, 39589, 42610, 42299, 34578, 26079, 22758, 20483, 17174, 20982, 20868, 27497, 32033, 29261, 28080, 32597, 30981, 30904, 38310, 38801, 35637, 28190, 28781, 35909, 39821, 44125, 48583, 50197, 50557, 54105, 66297, 84060, 98184, 110624, 122331, 140257, 166370, 177749, 190959, 210771, 227209, 235180, 240077, 235676, 229942, 222095, 213960, 208675, 198120, 185869, 173528, 167859, 165786, 165123, 167006, 171773, 168959, 169376, 170682, 177500, 182773, 191158, 199217, 213736, 231153, 251640, 270677, 282293, 301842, 317457, 323960, 328866, 334848, 326278, 312699, 311419, 319275, 323585, 335782, 353443, 371663, 407417, 454644]
11537D54644N5887N9862O0510N9876M8812J6837p243l0691m1513m7988m2249l2174
11525E54570l3096l4225k5124k3325j6414p163l619j318R33J379J2853K0969J8789
11512D65209K8233L4537M0551N0442N9657N7960N4593M4779K9999R868j9786m9003
11500H07039n9846o5762n3192l6742l0305j6393K62J2230K9331L8493M2248M9324
11488G16687M8645L9780J5778j0250k3865l8925n3510m7815m4867m8312l8617
11477E14729k8804j9434j4330j8842j2236m019K817K809J6051J3845J0499K8973
11465D92058L2832L6404M2115N4126N5655N4950M8488K7005J368k3950m9579o7191
11453G04281p4601o9200n2762n1288m3297l9674k9897q490p711L320J2409K545
$$ y = [454644, 510531, 570393, 630903, 690779, 739591, 756428, 749185, 718494, 676981, 628993, 586744, 554570, 521474, 487249, 462125, 438800, 422386, 415223, 411604, 410286, 411219, 412598, 425451, 446420, 465209, 493442, 527979, 568530, 618972, 678629, 736589, 791182, 835961, 865960, 875828, 856042, 807039, 747193, 681431, 628239, 591497, 561192, 544799, 545061, 557291, 586622, 625115, 667363, 716687, 765332, 805112, 820890, 810640, 786775, 747850, 694340, 646525, 601658, 553346, 514729, 485925, 466491, 452161, 433319, 421083, 417064, 419881, 422690, 438741, 452586, 463085, 492058, 524890, 561294, 603409, 657535, 713190, 768140, 816628, 843633, 845001, 821051, 771472, 704281, 629680, 560480, 507718, 456430, 413133, 373459, 343562, 335072, 327361, 330681, 343090, 345635]
11441C45635l765k235l332j3678j6293j1236j6113j5459j9526j6546j5473j0949
11429B01030m246p222r077o352j221O221k125l259l027O823J2494J7063J2546
11416B19648J6650J8988J3847O026P158R220p348j3312k0571k5860l0311k6871
11404A67264j5055j4747j5545j0283j4453j5057o832r301o432k290m747j001m506
11391D7015l562m629O274K265p265j981K325o079o087n72J953L799L952n542l349
11376B8517Q7l587N2Q263k603q95K762m205k355N356O536q89k011l303l327N192
11360C3590J116p760K186L916J856m919m133m621l565j110L704J442j755o76Q21
11345B0092O496k697k204O86J454j426l317j173j372j476M953O350J591J504k199
$$ y = [345635, 341870, 339635, 336303, 322625, 306332, 295096, 278983, 263524, 243998, 227452, 211979, 201030, 196784, 189562, 180485, 174133, 172912, 179133, 177008, 173749, 170722, 177545, 190039, 207102, 219648, 236298, 255286, 269133, 275159, 282317, 291537, 284189, 270877, 250306, 224446, 194135, 167264, 152209, 137462, 121917, 111634, 97181, 82124, 75292, 65991, 59559, 57269, 52522, 51521, 47015, 43453, 38824, 45098, 47363, 40098, 38117, 40442, 34363, 28276, 27704, 29657, 33456, 37408, 31866, 28517, 28604, 25017, 25069, 33332, 30729, 29834, 32596, 28391, 26036, 31392, 37928, 37039, 35028, 31725, 28398, 33590, 34706, 26946, 29132, 33048, 34904, 29985, 25852, 21231, 17666, 16556, 20260, 21702, 19947, 19271, 20092, 26588, 23891, 21687, 22373, 23827, 22401, 19084, 17911, 16539, 15063, 20016, 26366, 27957, 29461, 27262]
11330B7262o39K38J80J675m397p429q42p82J846L229P024Q097M177Q4l531k492
11314C3700q870j719k305L9L712N657j258l960m036j88K513K813J689l46n06m733
11298B2202k850M595L070J643j406o339k461J430p06J454M295J794k310r98J355
11283B4768j660k810j186l349J035K495M976l173L282K877K205j1521n953q261
11269C725l807Q049m80j590j839Q883O495l244m421M014L96m096o41M103L913
11254A9460P008P240m506q70l17p8K063o61J002p115K145Q074K018k201o889L51
11238B6724N469P13K203m679p818J745J950k372J333P913J59p472l844j3J307
11223B3318K83K800k759l113M445l754r024J580M917j279K052K223M191N057J328
$$ y = [27262, 26623, 26861, 27041, 28716, 24319, 16890, 16048, 15266, 17112, 20341, 27365, 35462, 39639, 39723, 36192, 33700, 24830, 23111, 20806, 20845, 24557, 30214, 28956, 24996, 20960, 20772, 23285, 26098, 27787, 27441, 26935, 22202, 19352, 23947, 27017, 28660, 27254, 20915, 18454, 19884, 19178, 20632, 24927, 26721, 24411, 23413, 24768, 23108, 20298, 19112, 15763, 16798, 19293, 24269, 21096, 24378, 27255, 29460, 17939, 11986, 3725, -82, 7967, 7487, 5897, 4058, 12941, 19436, 16192, 11771, 15785, 16181, 12085, 11444, 15547, 19460, 26468, 33708, 29202, 28332, 28015, 27937, 30000, 29339, 30341, 23226, 25371, 33445, 35463, 33262, 26373, 26724, 32193, 32906, 35109, 30430, 22612, 24357, 26307, 23935, 25268, 33181, 33340, 25868, 22024, 22011, 23318, 23601, 26401, 23642, 20529, 24974, 21220, 12196, 13776, 18693, 17414, 19466, 21689, 25880, 30937, 32265]
11208C2265j657J416j437j379j356o199k344K573N731M400l128m654j828N654
11194B8057K329p973o945O72j141J665J784N925M44j981L12Q87l859k455o85J491
11178A8527L875l460n217j819M279P090K715l909l092m046p33J0280M257l536
11164B5211J296R088j917j394m801j0718l997L101O410n105j891l617J870M099
11150A7635O743N538m950p070J234j252j525L113n072l031M104J048o31p61m364
11135A0759O709O817p17m242l390L38N008O93l521l033k735p69J325R698j100
11120B1840P29J230j158k352k644L356M469J833L10l381j506j651m103q970m14
11105G588K674k037M076L655K413l8k466l89p486l33l18K231P010J536P151Q88
$$ y = [32265, 30608, 32024, 30587, 29208, 27852, 21653, 19309, 21882, 27613, 32013, 28885, 24231, 22403, 28057, 30386, 22413, 15468, 16140, 14999, 16664, 18448, 24373, 24817, 22836, 23148, 24035, 20176, 17721, 17036, 18527, 22402, 18942, 13725, 11906, 16185, 23275, 25990, 22081, 18989, 14943, 14210, 24490, 28747, 25211, 26507, 35595, 33678, 32284, 27483, 16765, 12768, 15869, 22279, 17174, 15283, 11666, 13536, 17635, 24378, 29916, 24966, 17896, 19130, 17878, 16353, 19466, 14394, 11363, 15467, 16515, 15884, 15123, 10759, 17468, 24285, 23568, 19326, 15936, 16274, 21282, 21975, 18454, 15421, 12686, 11917, 13242, 22940, 21840, 22569, 23799, 22641, 20289, 17645, 21001, 25470, 27303, 27613, 24232, 22726, 21075, 16972, 8002, 7588, 10262, 8225, 12301, 15956, 18369, 18331, 15865, 15476, 7990, 7657, 7339, 9570, 16580, 18116, 25267, 26155]
11089B6155m454j051N584P78q934O91O596J0359N656q448n023K424J963j48k645
11074B9503r318k537p83N216J402n815M505M866j0025M921K634l560k873p050
11060A1086L941O43j740j854J647J990k616j198L820N138P263P623M835K554L36
11045D3468N828j177k846N26L585J255m47k74j532J777N373K520Q128M126m04
11030F9906r160l353O193K533j740j1514m612Q331R610J4312R520J051j0226j4812
11016F6039j3632j420P740J991J940j877J532J318J338p082p83l264o463k953
11002D4424n221o941L591P566N048L380n321m845J285l410r242p096m075k680
10988A6463N174p63p250J502N743J605k669m401N170L226L38k94l115o060k707
$$ y = [26155, 21701, 20650, 26234, 27012, 18078, 18769, 25365, 35724, 41380, 32932, 27909, 30333, 32296, 32148, 29503, 20185, 17648, 16865, 22081, 23483, 17668, 22173, 27039, 17014, 21935, 24569, 21009, 18136, 11086, 15027, 15670, 13930, 12076, 13723, 15713, 13097, 11899, 15719, 20857, 28120, 35743, 40578, 43132, 43468, 49296, 48119, 45273, 45799, 49384, 50639, 50192, 49918, 48386, 50163, 55536, 58056, 66184, 70310, 69906, 60746, 57393, 63586, 66119, 64379, 52865, 48253, 56584, 66194, 80506, 90026, 91077, 80851, 66039, 52407, 50987, 58727, 60718, 62658, 60781, 62313, 63631, 64969, 57887, 57104, 53840, 47377, 44424, 39203, 32262, 35853, 43419, 48467, 51847, 46526, 41681, 42966, 39556, 30314, 23218, 19143, 16463, 21637, 20874, 13624, 15126, 20869, 22474, 19805, 15404, 20574, 23800, 24138, 23844, 20729, 14669, 11962]
10973A1962K484j676K501M940M374q387j5O43l1M856r217l438O523o51J229L929
10957B0026J49O084O851O724o564K628K779j100l629n97l591n100l422k387L145
10942B1996J217k105l042O228p39p075R098J965k382m922o340L090q54K514J176
10927A9825m070J90J0281L343j024n719k823n015K208P82L158L183l649m652j656
10912A4362J31J173N889r58l65j0359r927L205K794Q57j661L75l277N753M945
10897A2937q245j662L424M031k356l774M929K047p26J62M333l417o519Q92M161
10882A0217J070l859j169J1624Q276j975L67m021o650n969o921M06O517M117n868
10867F162L498k89J590k74L602M378J494O549L022p961k481l48K764l824p73L309
$$ y = [11962, 14446, 12770, 15271, 20211, 24585, 16198, 16183, 16826, 16795, 21651, 12434, 8996, 15519, 14868, 16097, 20026, 20175, 26259, 33110, 39834, 33270, 35898, 38677, 37577, 33948, 33351, 29760, 24660, 21238, 18851, 21996, 23213, 21108, 18066, 24294, 23555, 16480, 25578, 27543, 25161, 20239, 13899, 16989, 16135, 18649, 19825, 15755, 15945, 26226, 29569, 28545, 22826, 20003, 14988, 17196, 17978, 21136, 24319, 20670, 16018, 14362, 14493, 15666, 21555, 20597, 20232, 9873, -54, 3151, 5945, 6802, 5141, 5516, 2239, 7992, 12937, 4692, 3030, 6454, 10485, 8129, 4355, 9284, 11331, 10605, 10767, 15100, 11683, 5164, 6056, 10217, 11287, 7428, 6259, 17883, 26159, 24184, 24551, 20530, 13880, 7911, 990, 1396, 7913, 12030, 6162, 9660, 9371, 10961, 10687, 14289, 18667, 20161, 26710, 29732, 21771, 19290, 18942, 21706, 17882, 17109, 20418]
10851B0418K74j45L672m62q973j93P018N790K818m271N02l42M966M12k913P169
10835C5740N642p13n506L44n590J510L041k410k697j437J540N280n649p651J096
10820B2540J917J1984j269J635K531j149N709L89k930j200l960J407L091k809
10806C7886K5m971p174l784n492J178K624K043J608K929o99L024n708o712j711
10791A5066L702N842j789j693n472Q61n985K650P263J465K589N509m067j774J131
10776B5298o377M792O784r596j2654M784M061N213n819m996O882N580m007K347
10762B2292q51r060n248L58N496o89k451j096j329J228K402k156q710k012L437
10747A611J915L496l55l248p467l928K383l04N493J1641M409j526n401l858J794
$$ y = [20418, 20692, 20547, 24219, 23757, 14784, 14591, 21609, 27399, 30217, 25946, 26448, 26106, 31072, 31484, 28571, 35740, 41382, 40669, 35163, 35507, 29917, 31427, 34468, 32058, 29361, 27924, 29464, 34744, 29095, 21444, 22540, 24457, 36441, 35172, 36807, 39338, 38189, 43898, 44287, 41357, 40157, 36197, 37604, 40695, 37886, 37911, 32940, 25766, 21982, 16490, 17668, 20292, 22335, 23943, 26872, 26173, 29197, 23489, 16777, 15066, 18768, 24610, 22821, 21128, 15656, 16517, 10532, 13182, 20445, 21910, 24499, 30008, 25941, 24167, 25298, 18921, 23713, 30497, 20901, 8247, 13031, 17092, 22305, 16486, 11490, 18372, 23952, 19945, 22292, 21441, 12381, 7133, 7491, 12987, 12298, 9847, 8751, 7422, 8650, 11052, 8896, 186, -1826, 1611, 3526, 7022, 6667, 3419, -4048, -7976, -5593, -5897, -404, 11237, 15646, 14120, 8719, 4861, 6655]
10732F655J172J289l006K839O882L180j077L169o313n456j192R107K467K362q80
10717B1198k768k828k060o87P473O815L297j799J44n008o49J604K480J752K385
10702C1349J273K027k368l867K282M729J586o9l221k660K869M640N662M175p95
10687D7612j2124r883j790J382k153Q96L568L740N253l989k439j935m88K720R321
10672C9691j049N232O95o95m291l302O717J0539P62o38Q983M858l5l989K344n818
10656F0004J768L832L596P509J3035Q432n1j427O400J3210j477j474r711K34R724
10641A13604P579L861P835R946O154M021J9878K8695K6671K7891L3308K6738K2560
10628C38741K5527K1168M0527N2964P2111R3389J16018J58473K19657K95174L87716
$$ y = [6655, 7827, 9116, 6110, 8949, 15831, 19011, 17934, 21103, 14790, 9334, 8142, 17249, 19716, 22078, 21198, 18430, 15602, 13542, 12855, 20328, 27143, 30440, 28641, 28785, 23777, 23128, 24732, 27212, 28964, 31349, 32622, 34649, 32281, 28414, 30696, 35425, 37011, 36942, 33721, 31061, 33930, 38570, 44232, 48407, 47612, 35488, 25605, 23815, 25197, 23044, 23940, 27508, 31248, 36501, 32512, 30073, 28138, 27650, 30370, 39691, 38642, 43874, 44569, 43874, 39583, 36281, 42998, 53537, 54299, 53661, 62644, 67502, 67467, 63478, 65822, 60004, 61772, 65604, 69200, 76709, 89744, 98176, 98125, 96698, 103098, 116308, 114831, 113357, 103646, 103880, 113604, 121183, 125044, 132879, 142825, 148979, 153000, 172878, 201573, 228244, 256135, 289443, 316181, 338741, 364268, 385436, 425963, 478927, 551038, 644427, 760445, 918918, 1138575, 1433749, 1821465]
10617A821465M90597N80138N99390M52291J65094r1754j97594j61019k9434J62757
10607C791931L78119O45936R42385J175556J183853P59734p41o32210q20965o62984
10597F760614l45702K5607M07950Q13838J223341J509180J410190O76907m91641
10588A1990284j363506j539262j257326q43271m34323n5649K98180O16364P96856
10579H208347O74787J12225o70028j170205j212089r78524o73801l92497j70728
10570C727487O7J38953J93541J10241j30308m20660n96579o03347n08892l99811
10560A510692k92775k15819j67431j29008r7873p5088o0241m9790m0511l9579
10550C42577l2716k0585j8303k5192j6524j5979j9803j6197q624n912j5690r072
$$ y = [1821465, 2312062, 2892200, 3491590, 3943881, 4108975, 4017221, 3819627, 3658608, 3629174, 3791931, 4170050, 4815986, 5758371, 6933927, 8117780, 8877514, 8876773, 8244563, 7423598, 6760614, 6414912, 6440519, 6848469, 7662307, 8885648, 10394828, 11805018, 12481925, 11990284, 10626778, 9087516, 7830190, 6986919, 6552596, 6496947, 6795127, 7411491, 8208347, 8883134, 8995359, 8325331, 7155126, 5943037, 4964513, 4290712, 3898215, 3727487, 3727554, 3866507, 4060048, 4170289, 4039981, 3619321, 3022742, 2419395, 1910503, 1510692, 1217917, 1002098, 834667, 705659, 607786, 532698, 472457, 422667, 382156, 342577, 309861, 289276, 270973, 245781, 229257, 213278, 193475, 177278, 168654, 162742, 147052, 137980]
10538A37980q44K095o272j5056n994n046n446r96l919J94J701P768m509k957m242
10523I4457n901r019j033p135k979j881O19k415l229q541%R277O242p522q277
10508E2663m031K776K924j890l093Q31l417L129J345n355n635j248k63k505K167
10493C8398K565N89N223K8k530o365m877K128N855M542k294k49q634l640L29M282
10477C5350Q48n885j560n861j246N519O397o025o330M233N671k565m723L419n70
10462B6672N419L188L700o92K484J343k704j476K194l096n518j811N04M680L179
10447C8066j215P56J642M559j692r161n179N664P297k813N126R39n477p513m586
10432B6413j4J965m413l699k111J531o461n083J253J34R188P925q837j770J31
$$ y = [137980, 137136, 139231, 132959, 117903, 111909, 106863, 101417, 100421, 96502, 96696, 98397, 106165, 101656, 98699, 94457, 88556, 79537, 78504, 71369, 68390, 66509, 67128, 64713, 61484, 52943, 52943, 62220, 68462, 60940, 52663, 48632, 51408, 54332, 52442, 49349, 50180, 46763, 49892, 51237, 45882, 40247, 38999, 38736, 36231, 38398, 40963, 41552, 46775, 46803, 44273, 37908, 33031, 35159, 41014, 45556, 43262, 43013, 34379, 30739, 31068, 35350, 36198, 30313, 28753, 22892, 21646, 27165, 33562, 27537, 21207, 25440, 31111, 28546, 23823, 27242, 26672, 32091, 35279, 38979, 38287, 40771, 42114, 39410, 37934, 40128, 37032, 31514, 29703, 30207, 34887, 38066, 36851, 37607, 39249, 43808, 42116, 32955, 27776, 33440, 40737, 37924, 43050, 43989, 38512, 30999, 26413, 26399, 28364, 23951, 20252, 18141, 19672, 13211, 8128, 9381, 9515, 18703, 26628, 17791, 16021, 16152]
10417A6152j496k625J1802L627k030j1686k559Q78K14j381p58p02m035j555K033
10402E879j927k287Q39p58p64N623j167K371k595j1445R43m93P192R410J802k073
10386A0550m927o968K318J5214Q13r521r775P2Q081O428J308l915m566l44O214
10371A0982j671k346k072K337K685K571k843o564m757K117O364N15L088l299o588
10356E19R67j987l063L935J1034O098k640q118j261N017o314q25M981j662l337
10341C344K687L406M92J842M669M772J067j098k585j803J125O83k960k114n930
10326G597K526N272j0798k914O263j645j841q10L201l496r963p88l043O556Q013
10311D130p074m350M932K706L389q82J816N480M043j026j127J56J031p364p36
$$ y = [16152, 14656, 12031, 23833, 27460, 25430, 13744, 11185, 12063, 12277, 10896, 10138, 9436, 5401, 3846, 5879, 3952, 1665, 2504, 1746, 982, 6605, 5438, 7809, 5214, -6231, -5288, -5781, 1411, 10821, 12623, 10550, 5623, -1345, 973, 16187, 17000, 7479, -2296, -2224, 5857, 12285, 13593, 9678, 5112, 4768, 10982, 9311, 6965, 4893, 7230, 9915, 12486, 9643, 3079, -1678, 439, 6803, 7318, 10406, 7107, 519, 1486, -501, -3564, 371, 11405, 17503, 14863, 6745, 5484, 10501, 4187, 3362, 8343, 6681, 3344, 6031, 9437, 9929, 11771, 16440, 21212, 22279, 21181, 18596, 16793, 17918, 18601, 15641, 13527, 7597, 10123, 15395, 4597, 1683, 7946, 6301, 4460, 3650, 6851, 3355, -6608, -7396, -10439, -3883, 4130, -2944, -7294, -2362, 344, 3733, 2851, 4667, 10147, 14190, 13164, 12037, 12193, 13224, 5860, 5124]
10296E124J587M768J140J446j216J311Q594O53j116P504L081N083N721l855j867
10281C7958J973J139K788J6448J7347K6018M0111L9391M2136M7058O0204N8897
10269C91468M2602Q790p177j2126k1647m0367n1886n8884m4462m0266k7714l5831
10257A02500k9526j7658p272k285j952r312l778o4O11q202q749q663k784N703
10243H569P391p868p877j322K147K849L655P008j851p587j22K686j596q22j985
10228C275k368m08j822j367Q039O137n789q015P069K347m532o008o114j533M203
10213f886Q45M200M430L127R661q985j2074O818K03l855K268M195j059l040J102
10198I50r83nK022q313j69K691M221N204N109L360j964o238j412M952o131n013
$$ y = [5124, 6711, 11479, 12619, 14065, 12849, 14160, 22754, 23407, 22291, 29795, 32876, 37959, 43680, 39825, 37958, 39931, 41070, 43858, 60306, 77653, 103671, 143782, 183173, 225309, 272367, 332571, 391468, 434070, 442860, 435683, 423557, 401910, 361543, 309657, 250773, 206311, 166045, 138331, 102500, 72974, 55316, 48044, 45759, 43807, 34495, 30717, 30653, 31264, 23062, 14313, 5650, 2866, 8569, 15960, 8092, 215, -1107, 1040, 3889, 7544, 14552, 12701, 5114, 4992, 7678, 6082, 5260, 3275, 907, 499, -1323, -2690, 5349, 11486, 5697, -2318, 4751, 7098, 2566, -3442, -9556, -11089, -6886, -6041, -1841, 2589, 5716, 15377, 6392, -5682, 1136, 1339, -2516, -248, 3947, 2888, -152, 950, -33, -38, 1984, -6329, -6498, -3807, 414, 5618, 10727, 14087, 12123, 5885, 4473, 9425, 3294, -1719]
10182a719j603N021J0983M713J735o727L254N316o889K843j067K098P029Q085
10168C3072M893N658K919P230k660n806j757R28k179P31M724p01P718J0014P536
10153G2320K04q137n394p900j2683k917k86k004k724j072J1390Q304%o191k842
10138D0068l141j755m228m438j95Q56M042j700j470M597p043r208o153K939j587
10123A1584J981L922j280l067n423l496J064N52q287n098p1O42o91N240N709p95
10107B486J230o00m90R5K821M869k245l578j450j529r72j056p21K656O38M07j16
10090B445k766o859K884R804M461m493L447K54Q29m964K539q13n388M255k293
10075C342p453N606K113K036m133K851P90l645o730j4060R67Q970L493O377k382
$$ y = [-1719, -3322, 1699, 12682, 17395, 19130, 12403, 15657, 20973, 14084, 16927, 15860, 17958, 24987, 33072, 37965, 43623, 46542, 53772, 51112, 45306, 43549, 44477, 42298, 43029, 47753, 47052, 54770, 64784, 72320, 72524, 64387, 58993, 51093, 38410, 35493, 35207, 33203, 30479, 29407, 40797, 49101, 49101, 42910, 40068, 36927, 35172, 30944, 26506, 26311, 27167, 31209, 29509, 28039, 32636, 25593, 16385, 10232, 13171, 11584, 13565, 17487, 16207, 13140, 7717, 4221, 5285, 5837, -2450, -7548, -7619, -6977, -7668, -2428, 3281, 2486, 3716, 3116, 2626, 2721, 5542, 10411, 8166, 4588, 3138, 1609, 637, -419, -1140, 1516, 2154, 2561, 2445, -321, -7180, -4296, 5508, 9969, 5476, 8923, 9177, 10006, 5042, 7581, 6768, 1380, 5635, 3342, -4111, 1495, 3608, 5644, 1511, 4362, 5152, 1507, -5223, -19283, -18316, -9346, -5853, 524, -1858]
10060a858n514q44R228K080o495N50k154l535M491Q600L269k450K327O566P44
10045A5005n886o796j0520M025j461q020m121P407O696K150P093q64p053O190
10031C845K562M17o39j0699J509L771O823R164j280j1749j304L805L772l016p183
10016b02K34n295j898j686n634q1J141J966l596N67M214Q461M745L509J715o263
10000A897o710P936O213P692j487m793p278m128l126O235m978k414M957k533m089
9985f606N818N794K917o195m657K544k07r00J758Q189O422m717r818k835Q41K252
9969F00j701l638k675m890K917K097n18L091l56J669R89L527J032J302j561K937
9953D822J441o146l641N512k661k676k748m576p87O62O484P408k293J700K640
$$ y = [-1858, -7372, -8216, 1012, 3092, -3403, -2853, -5007, -8542, -4051, 4549, 7818, 5368, 7695, 14261, 15005, 9119, 2323, -8197, -4172, -5633, -13653, -17774, -10367, -3671, -1521, 5572, 4708, -2345, 3845, 6407, 6824, 6185, -4514, -3005, 766, 7589, 16753, 15473, 3724, 2420, 6225, 9997, 6981, -202, 32, -5263, -7161, -8847, -14481, -14562, -13421, -11455, -15051, -14484, -10270, -1809, 2936, 6445, 8160, 1897, -4813, 3123, 9336, 17028, 15541, 10748, 3470, -658, -3784, 2451, -2527, -4941, 16, -2517, -6606, -788, 5006, 7923, 1728, -2929, -385, -592, -1492, 266, 8455, 14877, 10160, 342, -2493, -1652, 600, -1101, -4739, -7414, -12304, -9387, -7290, -7808, -4717, -5073, -3404, -2415, 1112, 2144, 3446, 1885, 4822, 6263, 117, -3524, 1988, -673, -3349, -6097, -10673, -11460, -10798, -4314, 3094, 801, 2501, 5141]
9938E141j096q811m02R719O934L229P506J6792K8589L1715j2201l5445k5182j6250
9924A0238q148l243n424M641N718R97J215j822n959n640l494K103J1293K509p021
9909b037N279N37K175q26r296o409P691J109M157m20j154K211N02L496L882m122
9893F775l669P7l09l323k328J839N166R65P422N05q580l543L104j317o545K621
9877a140L118L09l763k841K770o279j793N280N171O68l344o014k572M130K609
9862c691M682p645P73L222O37M087o464K821P016o50m714Q828L020p514L045K348
9846I801p112n671k460K23l644R68J2609j083Q21p2l662M91J241K495P21j294
9830D372l189N355k709p499m92L759K9J1272M461m199L179n727p951K926l587
$$ y = [5141, 4045, -4766, -5168, 4551, 11485, 14714, 22220, 39012, 67601, 99316, 87115, 51670, 26488, 10238, 2090, -1153, -6577, -1936, 3782, 4779, 5994, 4172, -1787, -7427, -10921, -8818, 2475, 4984, -2037, 3242, 3779, 5954, 5128, -4168, -10577, -2886, -1777, 2380, 1960, 806, 3017, 3519, 7015, 10897, 6775, 3106, 3183, 2874, -449, -2777, -938, 4228, 5193, 12615, 13120, 4540, 997, 4101, 2784, -3761, -1140, 1978, 2287, -1476, -4317, -1547, -7826, -9619, -4339, 832, 1500, -1844, -7858, -10430, -6300, -3691, 991, -6654, -5881, -2659, -2022, 2065, -4399, -1578, 5438, 4788, 74, 8902, 11922, 4408, 7453, 9801, 2689, -2982, -5442, -5219, -8863, -7895, 4714, 3631, 4452, 4380, 718, 1209, 2450, 4945, 5666, 4372, 1183, 6538, 3829, -3670, -4162, -403, -374, 10898, 15359, 11160, 14339, 8612, 661, 3587, 0]
9815@M951n8l106j270q520o116M636N786R95q87M727K467l288p347m760O947K424
9798b419l181Q26k15l036K077J0592M292l219m851N33J545P224R22j1803j3781
9783a4494K24N303Q557k086M679K213j477k911k43K137k041o02J712j919j089
9768b037O691R24l624j996K639J552r26p99l597k476J751K699n210J897L160L598
9752D246J608j380l077n048j416m122J052M704j758k074m178J412P957L594K309
9737C829k419n575J671k05J552n56L294N962N801K171j454n252j360N05p58k20
9721F986k536j927j068K839o98q722m012P143K151k837O613L176J029K767n356
9706E548j818j25K652p191o506K798N603J990j783K306L316Q02K208l257k124
$$ y = [0, 4951, 4893, 1787, 517, -8003, -14119, -9483, -3697, -2702, -3589, 1138, 3605, 317, -7030, -11790, -4843, -2419, -5600, -4774, -4989, -8025, -5948, 4644, 8936, 5717, 866, 1399, 2944, 10168, 11090, -713, -14494, -14270, -8967, -410, -2496, 2183, 4396, 2919, 8, -235, 1902, -139, -741, 971, -948, -2037, 4654, 5578, 1954, -42, 2597, 4149, 3223, 2424, -1173, -3649, -1898, 801, -4409, -2512, 648, 4246, 5854, 4474, 1397, -3651, -5067, -9189, -8137, -3433, -5191, -7265, -11443, -10031, -2074, 1520, 3829, 1410, -4165, -2494, -2699, -1147, -1703, 1591, 7553, 13354, 15525, 14071, 8819, 7459, 7964, 7206, 6986, 4450, 2523, 1455, 4294, 3596, -5126, -9138, -1995, 156, -2681, 3932, 7108, 8137, 10904, 5548, 3730, 3605, 6257, -934, -7440, -4642, 961, 2951, 1168, 3474, 6790, 7592, 9800, 6543, 4419]
9691D419k027L033k240Q07J343K8j527M03P326M29n120k888M675Q996J717n184
9675A4190L482M34m142n915K860K299n593o523j150N769K133k495o039k79M813
9660C844L733M00K44P046J3010J7228J5315J6533n590k6246j4312o302q308r271
9646G324r94k073L98o203r473P993L432R59M593K271R92L781n086N934K425J605
9630A7878O74j467j0348p185n591j139K061r16K138K836k428K396L829M616M38
9615G792j779p068N471N124m956l706P385Q77k942j262j005J920m41Q653K330
9600A6393O207K911p935o918m407J575l849p317M239J096j113L372J03j034q571
9585e248L770N696k228L758J831N29j953q92P594L185l116n602j404o45l56L741
$$ y = [4419, 2392, 5425, 3185, 3992, 5335, 5363, 3836, 4239, 11565, 11994, 6874, 3986, 8661, 17657, 19374, 14190, 17672, 18106, 13964, 8049, 10909, 13208, 7615, 1092, -58, 5711, 7844, 5349, -690, -969, 3844, 7577, 7977, 8221, 15267, 28277, 45505, 60820, 77353, 71763, 45517, 31205, 24903, 16595, 7324, 6330, 4257, 4655, -1548, -11021, -3028, 404, 1363, 5956, 8227, 9219, 13000, 7914, 13848, 16273, 17878, 18552, 17085, 6737, -448, -6039, -7178, -5117, -6033, -3895, -1059, -3487, -1091, 2738, 7354, 7792, 6013, -1055, 4416, 9540, 4584, 878, 8263, 9140, 6198, 4936, 3931, 5851, 5410, 14063, 16393, 22600, 25511, 17576, 10658, 6251, 7826, 3977, -3340, 899, 1995, 882, 4254, 4357, 3323, -5248, -1478, 4218, 1990, 5748, 7579, 8108, 6155, 5263, 12857, 16042, 12926, 7324, 5920, 5275, 4919, 8660]
9569H660j363jK433R859K772j0576n543k641J841L005J352o98j22O662q13o378
9553H449m738m018q4O72k282r79M657Q110M343J490P637p77j1355j4136R42J0187
9537H118O699M585M317j790n972j0006o536K455K392m123j671N436N607K494J140
9522A3145K380k085o56M1m038%N9J792m254o217J285O444M40o775j008J597m570
9505b420l189J121J093p00K999P60L176K198k679K908K531l335j483M446P851
9490A5277j529l034k518r04L82Q143N727L018L254q935n314L69N94m228N11M079
9474A4892M124O988m138J082K005K716o477m490m247L390O140l712J336J904J697
9459B3210K514n256l506m477J864N754O547j518K084L223k836l581j92O140P646
$$ y = [8660, 7297, 7296, 9729, 19588, 22360, 11784, 6241, 3600, 5441, 8446, 9798, 9100, 8978, 15640, 14827, 8449, 3711, -307, -391, 281, -2001, -2980, 1677, 9787, 14130, 15620, 23257, 22480, 11125, -3011, -2069, 8118, 14817, 19402, 23719, 21929, 15957, 5951, -585, 1870, 4262, 139, -1532, 3904, 9511, 12005, 13145, 15525, 13440, 12784, 12825, 8787, 8787, 8846, 10638, 6384, 167, 1452, 7896, 8336, 1561, 553, 2150, -2420, -5609, -4488, -3395, -4095, -1096, -336, 2840, 5038, 2359, 5267, 7798, 4463, 2980, 7426, 15277, 13748, 10714, 8196, 7292, 7674, 15817, 21544, 24562, 27816, 18881, 13567, 13936, 14530, 10302, 10813, 14892, 19016, 26004, 21866, 22948, 24953, 27669, 21192, 16702, 12455, 15845, 21985, 18273, 19609, 21513, 23210, 25724, 20468, 16962, 12485, 14349, 20103, 26650, 25132, 27216, 30439, 27603, 24022, 23830, 29970, 37616]
9444C7616P57k895J067L653o157Q58J84j3110r543P997O173L975p53K325L17K395
9428C4859l187r025p07M017L173q498k969J557R87M764K763j354L178K106J314
9413C2978N825R592K201O08n731j756q126o842r625n566l086L013k236m057L455
9398A0647N491J566Q597R588N567j692M611M699q259m425l848K00N468j481k570
9383C4159P22L729K345J533M128Q643q47N851O721K044p07k827N654Q220L636
9368H3004P444J0832N935J2182J2253R480J2236K5117K0649K2884L1784M0462
9356B94262M9891N5573O2983P9426R7148J05955J17169J24513J08335Q5277O3844
9345A244376K9365J85m8293q1450r9822j11131j11132j10748j00380q8033p3150
$$ y = [37616, 38373, 35478, 36545, 40198, 34041, 34899, 35083, 21973, 12430, 20427, 26600, 30575, 29822, 32147, 32464, 34859, 31672, 22647, 21940, 25957, 29130, 20632, 17663, 19220, 20207, 24971, 27734, 26380, 29558, 31664, 32978, 38803, 48395, 50596, 51204, 45473, 43717, 35591, 28749, 19124, 13558, 10472, 13485, 11249, 7192, 10647, 16138, 17704, 26301, 35889, 41456, 39764, 44375, 49074, 40815, 36390, 32542, 32742, 38210, 36729, 34159, 34881, 38610, 40955, 42488, 46616, 55259, 54412, 60263, 66984, 69028, 68321, 65494, 71148, 79368, 83004, 90448, 101280, 107215, 119397, 131650, 141130, 153366, 178483, 199132, 222016, 253800, 294262, 344153, 399726, 462709, 542135, 639283, 745238, 862407, 986920, 1095255, 1180532, 1244376, 1273741, 1273926, 1225633, 1144183, 1044361, 933230, 822098, 711350, 610970, 522937, 449787]
9334D49787o5234n1800l6441k7589k1543k2701k4191k4177k4098j3087j0243j6047
9322A12636j0270j62q105q081m35k395M589n821p122m730m465K356J915J037l393
9307F7554J186J428l69n052l743O1P512L344j028J213O196O577L075m970m428
9292G8556k130p21J347n533K451K05o139J922j622M777P779K377K573k174j0414
9277G3254q724N32O515K404J3783J0738O111l657j009o501K713O087J637j965
9263A01918L805n601L573J5279q205p046m847j9805k8917l8564k7450n416K1868
9250E92J9670J3288P848l099n671J810R673P848O415L342k153l663j981k695l247
9235D7977O82J633N296J474j214O740J7068J5107J2690J2264K681o430Q488J3680
$$ y = [449787, 384553, 332753, 296312, 268723, 247180, 224479, 200288, 176111, 152013, 138926, 128683, 112636, 102366, 102204, 94099, 86018, 85583, 83188, 87777, 81956, 74834, 70104, 65639, 67995, 69910, 70947, 67554, 68740, 70168, 69799, 64747, 61004, 61065, 68577, 71921, 70893, 72106, 78302, 84879, 87954, 82984, 78556, 76426, 75705, 77052, 71519, 73970, 74175, 68036, 69958, 68336, 73113, 80892, 83269, 85842, 83668, 73254, 64530, 65062, 71577, 73981, 87764, 98502, 104613, 100956, 99947, 93446, 96159, 102246, 103883, 101918, 105723, 100122, 103695, 118974, 110769, 103723, 98876, 79071, 50154, 11590, -15860, -21276, 592, 20262, 33550, 41398, 38299, 32628, 34438, 44111, 51959, 58374, 61716, 59563, 55900, 53919, 51224, 47977, 48659, 50292, 55588, 57062, 55848, 62588, 79656, 94763, 107453, 119717, 122398, 115968, 124456, 138136]
9221A38136R564N224J552j6538k1026M700J2004J176j0591j5349j072J9605J7776
9208A45161J0349j1107o928q300j280J927p61P129R640K2850L1006K8859J9091
9195B47636L34r667k5502l5288m1972k5427p969k204K400N010J252Q0N282P903
9181A21868P907K74j0795j8P330K041M946R614K528N376R207M191J926K82q743
9166A57934k411O59L513J302K755M176j07k425j2672j4337p934n462M772J4740
9152A44503J021j081P085J7756J3375J3765J3754J1034O873l173K648l413p182
9139B16965r098K501M147m032j9631k3354j4616j6319r456L798L622Q230Q87K917
9125A46561k726J4005J4587O696J581l100k586L448M921j178j605Q322j131k516
$$ y = [138136, 147700, 152924, 154476, 137938, 116912, 121612, 133616, 134792, 124201, 108852, 107780, 127385, 145161, 155510, 144403, 137475, 129175, 127895, 129822, 129061, 136190, 145830, 168680, 199686, 228545, 247636, 247970, 238303, 212801, 177513, 135541, 110114, 102145, 99941, 102341, 107351, 108603, 108683, 113965, 121868, 129775, 130049, 119254, 119236, 126566, 128607, 133553, 143167, 145695, 151071, 160278, 164469, 166395, 166677, 157934, 155523, 156182, 159695, 160997, 163752, 167928, 167821, 165396, 152724, 138387, 130453, 124991, 129763, 144503, 145524, 144443, 151528, 169284, 182659, 196424, 210178, 221212, 228085, 224912, 227560, 224147, 216965, 207867, 210368, 214515, 210483, 190852, 167498, 152882, 136563, 127107, 130905, 134527, 142757, 143644, 146561, 143835, 157840, 172427, 179123, 180704, 177604, 175018, 178466, 183387, 182209, 180604, 188926, 187795, 185279]
9111A85279q857j2170j5237j4311q630j1400j4090k5735k7752k4935k1590j4118
9099a3546p121q332L580J3911J4803J1065K37O943J206R82p797n568N141K0834
9085C6338L9619M6891M1987M7176P7932J08965J10572P1266L0090J2445N985J0375
9073F39641J6061K1742L0891J4371k1642l8943m4633k9235k3381j5927j3912j3869
9061E21164o231j0617p240j0133p130k643K945J1228J0317N652Q707L579j965
9048E17633m671J2991J6744J8923K0404J6464J2935Q678R455J5610J7907P643
9036F70716J0264J2049J2476J8030K5631J9494J6561J3948J5209J3997J4772J7095
9024H60242J4979K1077K2246K4132K6251L2496M0603L4113L4031L5646L9260M2167
$$ y = [185279, 176422, 164252, 149015, 134704, 126074, 114674, 100584, 74849, 47097, 22162, 572, -13546, -20667, -28999, -25419, -11508, 3295, 14360, 14597, 21540, 22746, 23728, 15931, 10363, 15504, 36338, 75957, 122848, 164835, 212011, 289943, 398908, 509480, 580746, 610836, 623281, 629266, 639641, 655702, 677444, 708335, 722706, 701064, 662121, 617488, 588253, 564872, 548945, 535033, 521164, 514933, 504316, 497076, 486943, 479813, 477170, 480115, 491343, 501660, 507312, 516019, 519598, 517633, 512962, 525953, 542697, 561620, 582024, 598488, 611423, 620101, 629556, 645166, 663073, 670716, 680980, 693029, 705505, 723535, 749166, 768660, 785221, 799169, 814378, 828375, 843147, 860242, 875221, 896298, 918544, 942676, 968927, 1001423, 1042026, 1076139, 1110170, 1145816, 1185076, 1227243]
9012A227243M2746L7134L6196L9304N6447N2598M9406M8935M8071M2731M7499
9001A728310N9786P4678P5644P5990R1546J00440J06033J18094J18985J21273
8991B670779J37494J46008J41976J51915J65173J75256J88192K14407K35849K55763
8981D482812K73004K97153L23183L60061M06850M46112M94153N59541O35588P29936
8971I008393Q21662R23606J047247J209147J408361J658636J965788K327984K737791
8962B3108615L213776L739777M304717M925578N699001O886122Q771756J1591761
8954G2241103J5618051K1233851K8861760L8528131M8854769N5297246M9342945
8947C29977856K3635638j5088537m5573091n5259903m9838284l9522219k9885579
$$ y = [1227243, 1269989, 1307123, 1343319, 1382623, 1439070, 1491668, 1541074, 1590009, 1638080, 1680811, 1728310, 1788096, 1862774, 1938418, 2014408, 2105954, 2206394, 2312427, 2430521, 2549506, 2670779, 2808273, 2954281, 3096257, 3248172, 3413345, 3588601, 3776793, 3991200, 4227049, 4482812, 4755816, 5052969, 5376152, 5736213, 6143063, 6589175, 7083328, 7642869, 8278457, 9008393, 9830055, 10753661, 11800908, 13010055, 14418416, 16077052, 18042840, 20370824, 23108615, 26322391, 30062168, 34366885, 39292463, 44991464, 51877586, 60649342, 72241103, 87859154, 109093005, 137954765, 176482896, 225337665, 280634911, 329977856, 353613494, 338524957, 292951866, 237691963, 187853679, 148331460, 118445881]
8940A18445881k2368787j6798917j2743326r769785p570415n957682m821432m131833
8932C4283704l737378l432857l090287k696682k328141j985793j694438j450496
8924A3867632j245989j067478r20226q01088o99866o39630n92001n36527m88084
8915F876743m36888l84169l45016l17000k93186k66596k53411k31812k09337j92910
8905C946418j82312j78445j56272j45559j28670j22689j18420j04462r6022r2942
8895B620625r5269r2981r3907q3269q5120q6066q3671p3893o3108n9029n5265
8884A749047m7569m5331m8419m7384m7437l6124l3092l2467l3246k5915k4337
8873A327726l0932k8918l5027l3059l4700l0081l7210l0051k9786k5732k6345
$$ y = [118445881, 96077094, 79278177, 66534851, 56765066, 49194651, 43236969, 38415537, 34283704, 30546326, 27113469, 24023182, 21326500, 18998359, 17012566, 15318128, 13867632, 12621643, 11554165, 10633939, 9832851, 9132985, 8493355, 7901354, 7364827, 6876743, 6439855, 6055686, 5710670, 5393670, 5100484, 4833888, 4580477, 4348665, 4139328, 3946418, 3764106, 3585661, 3429389, 3283830, 3155160, 3032471, 2914051, 2809589, 2713567, 2620625, 2525356, 2432375, 2338468, 2255199, 2170079, 2084013, 2000342, 1926449, 1863341, 1804312, 1749047, 1701478, 1656147, 1607728, 1560344, 1512907, 1476783, 1443691, 1411224, 1377978, 1352063, 1327726, 1296794, 1267876, 1232849, 1199790, 1165090, 1135009, 1097799, 1067748, 1037962, 1012230, 985885]
8862I85885k5617j5387k2023k2379k7918k0782k2928j8056j5171k2018j0604j3188
8850G49814j2360q235m553j2859j9290j4730j0639j6255j5839r943j4506j1163
8838E99442p688j0088j3433j3654j2189k2807j3161q809n260r452j7984j7137
8826D47780j2159n030l650P175Q541p098j9809k2127p578n14J6424L6663M9605
8813D88223M9855M6415L3614K7425J1764L746M009r688j7693j5337p772p205o931
8800F00425L728L525N212J5583P348q281j5671k0592j8710j7302l6687l8045l3465
8787D47068k4427j2980j4307k1014j4418q337q664n731k155J35J14J714K385K630
8773C42013o192q134k584r107r444L647K063j320p788L55l803j6057k5314k4825
$$ y = [985885, 960268, 944881, 922858, 900479, 872561, 851779, 828851, 810795, 795624, 773606, 763002, 749814, 737454, 729219, 724666, 711807, 692517, 677787, 667148, 650893, 635054, 625111, 610605, 599442, 591754, 581666, 568233, 554579, 542390, 519583, 506422, 497613, 492353, 482901, 464917, 447780, 435621, 430591, 426941, 434116, 442657, 435559, 415750, 393623, 386045, 385531, 401955, 438618, 488223, 538078, 584493, 618107, 645532, 657296, 661042, 665051, 655363, 637670, 622333, 614561, 607356, 600425, 604153, 607678, 612890, 628473, 635821, 627540, 611869, 591277, 572567, 555265, 518578, 480533, 447068, 422641, 409661, 395354, 374340, 359922, 351585, 342921, 337190, 335035, 335170, 335284, 336998, 339383, 342013, 335821, 327687, 325103, 315996, 306552, 310199, 312262, 310942, 303154, 303509, 299706, 283649, 258335, 233510]
8759B33510k5082j4381j1185n133j2717j5418j0714j0439r468k621J504K05J4911
8746A32972R233M142O757M898P699P278N422M245j961j3768o986m692k484l372
8732A49383k188J3383J274k766j388R59M814l773j0545j3006R54P094j27L009
8718A47077L390p030p547k228J000N625P838O621M801n80l638p4n481n383n35
8703A43856k252k516k84n271m142k572oo2K742k428J626Q096M665R370L43j223
8687A49942m239J405L825J385L564M371j185j28q481p597l499N66j673o010k408
8672A29838Q812J26j227J686o182K374N678l446r150l799k190P65M294K760L642
8657A33981m358l074j3364m866K446M740p63N175R819l335K43M817L789R067J3131
$$ y = [233510, 208428, 194047, 182862, 177729, 165012, 149594, 138880, 128441, 118973, 116352, 117856, 118061, 132972, 142205, 146347, 153104, 158002, 165701, 172979, 178401, 182646, 180685, 166917, 159931, 155239, 152755, 149383, 147195, 160578, 161852, 159086, 157698, 158657, 163471, 159698, 149153, 136147, 137101, 144195, 144068, 147077, 150467, 143437, 135890, 133662, 134662, 140287, 148125, 154746, 159547, 158967, 155329, 155255, 149774, 144391, 143856, 141604, 139088, 138804, 133533, 129391, 126819, 126813, 126751, 129493, 127065, 128691, 136787, 141452, 150822, 151165, 149942, 145703, 147108, 150933, 152318, 155882, 160253, 159068, 158940, 150459, 142862, 139363, 139929, 138256, 132246, 129838, 138650, 138776, 137549, 139235, 133053, 135427, 141105, 137659, 128509, 124710, 122520, 123285, 127579, 130339, 133981, 129623, 126549, 113185, 108319, 110765, 115505, 114742, 119917, 129736, 126401, 126644, 131461, 135250, 144317, 157448]
8642A57448J4502j504k3972l4752l2255k0767j6901l368j228N078J1445K492j2239
8629D3979l321J2018M474n044K572M995J1912N00P3p495o101j515P729O801M866
8614G6443K050o304p995p60K671L16L015J705n25K805N818J0951M570P724J642
8599A04126r045n079M260L512O39M522M090r05q142m873J0200N611Q926R170J345
8584A28357p441M832J6534J5120J9937K3361L2319M6154N3415O5371L5903q235
8572D25627l9866n4138l1752k1942j5155L565Q156P713J1571r178j2389o749M633
8559B70096J3570J5557J5474L0740M1803N3102N9466P9926Q9120R5336J03749
8548H67939J14532J15136J13992R9274O2371K3046j7406m9009p5104p9788o9383
$$ y = [157448, 171950, 170446, 146474, 111722, 79467, 58700, 41799, 38431, 37203, 42281, 53726, 56218, 43979, 40658, 52676, 57150, 52106, 54678, 59673, 71585, 72085, 72158, 64663, 58562, 57047, 64776, 71577, 76443, 78493, 72189, 64194, 63434, 66105, 66421, 69436, 71141, 70616, 73421, 79239, 90190, 94760, 102484, 104126, 95081, 90002, 94262, 97774, 98413, 102935, 107025, 106120, 97978, 93105, 103305, 108916, 117842, 127012, 128357, 120916, 125748, 142282, 157402, 177339, 200700, 233019, 279173, 332588, 397959, 433862, 425627, 385761, 331623, 299871, 277929, 262774, 266339, 274495, 282208, 293779, 284601, 272212, 265463, 270096, 283666, 299223, 314697, 345437, 387240, 440342, 499808, 579734, 668854, 764190, 867939, 982471, 1097607, 1211599, 1310873, 1373244, 1396290, 1378884, 1329875, 1254771, 1174983, 1105600]
8537A105600n6947n1710m1757l8959p3267r1044q0995n8583l5026p917N514J0210
8525E85119L2710O1894J03530J56818K19492L09462L96554M28542L46736R5182
8515B736039k25587m12088m23740l58862k72803j92750j35610j04038q4109o2010
8505D64442m8774m6614k9567j5928j5942j2911r745j4952r965M944R486J0264
8493B84738P47l980N043J3052R825J0035R514J8167K9926L4759L8398M6004N4103
8480E50331P5464J15862J56382K10170L07249M37498O33719Q67074J021641Q84700
8470E260090K66609n36097r68891r49954p51749n46051l77362k69483j96832j48883
8460G81397j11800p7781o8714n4677m3870k9836k2526l1646k4709j8901j1065
$$ y = [1105600, 1048653, 996943, 955186, 916227, 842960, 751916, 670921, 612338, 577312, 569395, 574909, 585119, 617829, 679723, 783253, 940071, 1159563, 1469025, 1865579, 2294121, 2640857, 2736039, 2510452, 2098364, 1674624, 1315762, 1042959, 850209, 714599, 610561, 526452, 464442, 415668, 369054, 339487, 323559, 307617, 294706, 284961, 270009, 260044, 264988, 274474, 284738, 285485, 281505, 286548, 299600, 309425, 319460, 328974, 347141, 377067, 411826, 450224, 496228, 550331, 625795, 741657, 898039, 1108209, 1415458, 1852956, 2486675, 3353749, 4375390, 5260090, 5526699, 4990602, 4021711, 3071757, 2320008, 1773957, 1396595, 1127112, 930280, 781397, 669597, 591816, 523102, 468425, 424555, 394719, 372193, 340547, 315838, 296937, 285872]
8449B85872q945j1478j146p817n600r29n37k440M306N108J5385K1169J4273K1404
8435C28625K5701L5254N8935P7559R9388J31562J95240K67255L47285M02153L62205
8424B331162J70700j28274l65785m29227l67950k75678k00329j50504j02441p0300
8414D11374n3679n0762m1729k7762k5327k0591j2965j3220j7176l306p485n767
8402A31605j0770r932l302o808k44K875q433l326k467o206J794M449k230j59J397
8387H8243N326n007r308q696n50O108m517p960j531K461J645o512O02O174J716
8372F8194n304M146l59p142O186P71l574m746m248P29k396j993q06l548n942j0414
8356B9554q5J1133m02o811l284P800L100l729j214P01L344N248n05K496j54k898
$$ y = [285872, 276927, 265449, 264303, 256486, 250886, 249957, 249420, 246980, 251286, 256394, 271779, 292948, 307221, 328625, 354326, 389580, 448515, 526074, 625462, 757024, 952264, 1219519, 1566804, 1968957, 2331162, 2501862, 2373588, 2007803, 1578576, 1210626, 934948, 734619, 584115, 481674, 411374, 357695, 306933, 265204, 237442, 212115, 191524, 178559, 165339, 148163, 144857, 137372, 131605, 120835, 110903, 107601, 100793, 100549, 103424, 94991, 91665, 89198, 82992, 84786, 89235, 87005, 86846, 88243, 93569, 88562, 79254, 70558, 70008, 76116, 71599, 63639, 62108, 64569, 66214, 59702, 60304, 66478, 68194, 62890, 67036, 66677, 59535, 65721, 66492, 62918, 58172, 53924, 54653, 52257, 50264, 49458, 45910, 39968, 29554, 29469, 40602, 40200, 33389, 30105, 37905, 41005, 37276, 36062, 36763, 40107, 45355, 44850, 47346, 47192, 44294]
8340D4294o756m312r77K277J2748M747j0326p39K073L240N630k504l067l025l84
8325D2919n231p564j68K013O87J314K872j480k378L43j048j551K010M791N875
8310D3404j918l103k979l739k902o298N848N260k222k993m385o384q747K66M078
8295A3186J2409K236N22k479l941P271M743l825m698J17M445Q76K784p91O861
8280C9716q9p006R77m003j657L053L593N267n30j788j789j119o582m5j643m006
8264B2349j793l90k817k8L450K145J468J0045j403n629p448J000P313L256k809
8249B8709j01O210L08J099L247O99j0891n116L368K477j694j500L10o795k266
8234A8064j46J015k228j085L560l246m087k633K083L094J0065N226n312K575J324
$$ y = [44294, 37538, 33226, 32249, 34526, 47274, 52021, 41695, 40956, 43029, 46269, 51899, 49395, 46328, 43303, 42919, 37688, 30124, 29956, 31969, 32656, 33970, 36842, 35362, 32984, 33327, 32279, 30728, 32738, 37529, 43404, 41486, 38383, 35404, 31665, 28763, 22465, 28313, 33573, 31351, 28358, 23973, 17589, 8842, 9108, 13186, 25595, 27831, 28353, 25874, 21933, 29204, 33947, 30122, 25424, 25541, 29986, 30862, 33646, 32855, 39716, 39627, 32621, 33598, 29595, 27938, 30991, 34584, 39851, 39321, 37533, 35744, 34625, 28043, 27998, 26355, 22349, 20556, 20166, 17349, 17321, 20771, 22916, 24384, 34429, 33026, 27397, 19949, 20949, 28262, 31518, 28709, 28608, 34818, 35126, 36225, 39472, 40171, 29280, 24164, 27532, 30009, 28315, 26815, 27125, 20330, 18064, 17918, 18933, 16705, 15620, 19180, 15934, 11847, 9214, 11297, 14391, 24456, 29682, 24370, 26945, 28269]
8219B8269n081R33j116l979k105K940k305M835J02p207L067j24Q37K862l14M405
8203B6019M234k124J279K912l773q188j507o0L546K386m058l484N09L359M502
8188B5552l863k43K617j909L164M532m002r26m690J294K393m39J0326J5j517p830
8172B4474r257O878l721m925J039K032j17N268Q24m446N427L284J229o414j1074
8157A0501k619K461J607O348k785l29J722J093m715q836J324L67k176K384K094
8142H441K566K758O162j322j1385m541O699N094L179R611m213k479J53n743K23
8127A5203l339j527o57L829N540J887n589K320L743M93n057J994J054P35O649
8112B7278O494j794k439K633j036l340k054J861N605n460m657Q467N826m501n700
$$ y = [28269, 23188, 24121, 23005, 19026, 16921, 19861, 17556, 22391, 22493, 15286, 18353, 18229, 19066, 21928, 21614, 26019, 30253, 28129, 29408, 32320, 28547, 20359, 18852, 18792, 22338, 24724, 20666, 17182, 17691, 21050, 25552, 21689, 21446, 24063, 22154, 25318, 29850, 25848, 24922, 20232, 21526, 23919, 23480, 33806, 33821, 32304, 24474, 15217, 22095, 18374, 13449, 14488, 16520, 16403, 21671, 22495, 18049, 23476, 26760, 27989, 21575, 10501, 7882, 10343, 11950, 18298, 15513, 15184, 16906, 17999, 13284, 4448, 5772, 6139, 3963, 6347, 8441, 11007, 13765, 19927, 18605, 7220, 2679, 9378, 14472, 17651, 27262, 23049, 20570, 20723, 14980, 15203, 11864, 10337, 9680, 13509, 19049, 20936, 15347, 17667, 21410, 21903, 16846, 18840, 19894, 20629, 27278, 33772, 31978, 29539, 32172, 31136, 27796, 25742, 27603, 33208, 27748, 23091, 31558, 37384, 32883, 27183]
8097B7183K627O604J836J040J1851J6781Q264J5590K1779J7660J7071R520m649
8084A53157k2167k9447k4147q216r079p241q692r17k013R10q209j1243P225m56
8070B9465l060M32k26l717j443J0808J4400R997o310J791l486n071k522L044L115
8055D7217p631k693O769k405j222K676P539M993J3118K2847K4413L0832L9917
8042A86370N3759M9617J8824j7839m9715n1437l2017l0782k7212j4730j2068j1703
8030F1067K89m903J85J595m951k265n073n59j358p072r558N055J0541j46Q18Q108
8014E1773m341r798j454k198j692l821M725J454K317o02l940L67K687K1N689J1714
7998E2901J0171O719J6412J8035J9133J3930P296j215q322j3504j8461p495m952
$$ y = [27183, 29810, 36414, 38250, 39290, 51141, 67922, 76186, 91776, 113555, 131215, 148286, 157806, 153157, 130990, 101543, 77396, 69180, 60101, 52860, 44168, 43251, 41238, 42148, 33939, 22696, 29921, 29465, 26405, 26837, 26611, 22894, 21451, 32259, 46659, 56656, 50346, 52137, 48651, 43580, 41058, 44102, 47217, 39586, 36893, 43662, 41257, 40035, 42711, 50250, 55243, 68361, 91208, 115621, 146453, 186370, 240129, 289746, 308570, 290731, 241016, 189579, 157562, 126780, 99568, 84838, 72770, 61067, 61356, 56453, 56638, 58233, 53282, 51017, 45944, 45385, 44027, 36955, 27397, 32452, 42993, 42847, 43665, 51773, 47432, 37634, 36180, 33982, 32290, 28469, 33194, 34648, 36965, 36363, 32423, 32790, 35477, 35498, 41187, 52901, 63072, 69791, 86203, 104238, 123371, 137301, 144597, 143382, 135060, 121556, 103095, 95600, 90648]
7985I0648o009q671j4445j0644m482l538q202O12L835J573l459k110J800j53K923
7970C9678k231k906n667k37J719Q19L773j530J912j356L599M603k022J87R368
7955D9709R577k705j3744m178j202N233j231k60L015J2727N368k564k552m236
7941E2957l393l136p536k968k193J829q46n79M018P85o247j2346j0763K445K469
7926A4496Q76p76N020O944j0589m521l318K244M956J0637J382o908k430O076P036
7911C1125r74K054q509m439n843K636K045O860l185l58r481j999M784N408J648
7896B1772k044J00J053ml610m567q33j44O162p92k355J021j44N015m90m112p117
7879H911n40k373N265N909j084j194j120p001m002K083K824Q52M984K502j008
$$ y = [90648, 84639, 75968, 61523, 50879, 46397, 42859, 34657, 35269, 39104, 40677, 37218, 35108, 36908, 36755, 39678, 37447, 34541, 28874, 28637, 30356, 31175, 34948, 33418, 35330, 33974, 37573, 42176, 40154, 40341, 49709, 59286, 56581, 42837, 38659, 37457, 42690, 41459, 41199, 44214, 56941, 62309, 59745, 57193, 52957, 49564, 46428, 38892, 35924, 33731, 35560, 34714, 34135, 38153, 38938, 32691, 20345, 9582, 12027, 14496, 15372, 14596, 19616, 26560, 15971, 11450, 8132, 10376, 15332, 25969, 27351, 20443, 18013, 24089, 31125, 30151, 32205, 23696, 19257, 13414, 16050, 18095, 24955, 21770, 21412, 11931, 9932, 14716, 20124, 21772, 19728, 19828, 20881, 20877, 17267, 12700, 11867, 11723, 17885, 17093, 14738, 15759, 15615, 20630, 20140, 16028, 8911, 8371, 5998, 11263, 17172, 16088, 14894, 13774, 6773, 2771, 4854, 7678, 8530, 13514, 16016, 15008]
7864A5008j3368m459M630M952J824p954j113r75p63K958N776J437K568L023m807
7849H737K52j512L235m21J565k750p253J640m06m857N479K770O297K644K616l279
7833A4757k978p175k611N498l161J827R471o285k010N545J783l325l087m592N299
7818H956L875P23l421m03k879n910k296R440N431j788j0880l270j143K516P355
7803F306O60m900L611N373m217n8K863m277n471L513N027L013q83n704j565M024
7787G315O554M801j65k567K699l720j189M01J80o10O67N379J214l935n932l521
7771G571n971l421J970m72p28O137L380J905r27k081n028K496P617O704k466m449
7755A2237L369j689m974L58l671O563M643k549m133o507q173J397p97l92O274
$$ y = [15008, 1640, -2819, 1811, 6763, 8587, 633, -480, -1455, -2218, 740, 6516, 7953, 10521, 13544, 8737, 8989, 7477, 10712, 10291, 11856, 9106, 1853, 3493, 3087, -1770, 3709, 6479, 12776, 15420, 18036, 14757, 11779, 4604, 1993, 7491, 4330, 6157, 15628, 9343, 7333, 12878, 14661, 11336, 8249, 3657, 8956, 12831, 13554, 10133, 9730, 6851, 941, -1355, 8085, 13516, 11728, 848, -2422, -3565, -1049, 6306, 6966, 2066, 5677, 11050, 6833, 6775, 9638, 5361, -110, 3403, 8430, 11443, 10560, 4856, 3291, 7315, 13869, 18670, 18505, 15938, 18637, 14917, 13728, 14129, 14309, 13699, 14366, 19745, 20959, 17024, 11092, 7571, 1600, -1821, 149, -323, -1051, 5086, 8466, 10371, 9444, 7363, 2335, 4831, 12448, 19152, 16686, 12237, 15606, 13917, 8943, 9301, 5630, 12193, 16836, 14287, 10154, 3647, -4526, -3129, -3926, -4318, 1956]
7740A956J840k434L771N160l576l914O43P26j547m693K35L609L91J154m64n283
7724b426K423P953M877n247m459k528N376N379K162m543m186L307K801M51j415
7709I925M159o49j649l730k67M358M553j331j500J801J6o451p409k187M077l895
7693a79J498M235N568O163o940n415N003L12m288L615j635k584M309K574p118
7678E118k745K762m70m114J225K431M358O860j944N48m160k721L665N129j145
7663A4797j554n825L965o880k926O713l527n56J011j863Q136P46o129J276L643
7648A1027J501m712j643k816p666K334l352P56M908O064m267n01k170l90R370
7633H443O006L551q390q181l60q83N302N366R35p2j784m738m929L577n53k676
$$ y = [1956, 3796, 1362, 5133, 10293, 6717, 2803, 3446, 4172, 2625, -2068, -1833, 1776, 2167, 3321, 2857, -2426, -3, 7950, 12827, 7580, 3121, 593, 5969, 11348, 13510, 8967, 4781, 8088, 10889, 11340, 9925, 14084, 13435, 11786, 8056, 7789, 12147, 16700, 15369, 13869, 15670, 15686, 9235, 1826, -361, 3716, -179, 1319, 5554, 11122, 17285, 10345, 4930, 9933, 10245, 5957, 9572, 7937, 5353, 9662, 12236, 5118, 2373, 5135, 4665, 551, 1776, 4207, 8565, 15425, 13481, 14029, 9869, 7148, 10813, 15942, 14797, 13243, 7418, 11383, 4503, 1577, 8290, 4763, 4207, 5218, 3355, 11491, 12237, 6108, 7384, 11027, 12528, 7816, 6173, 3357, -4309, -1975, -5327, -4571, 337, 6401, 2134, 1633, -537, -927, 8443, 14449, 18000, 9610, 1429, 1069, 186, 5488, 10854, 11789, 11717, 9933, 5195, 266, 3843, 3290, 614]
7617F14o26j52n180j290Q059K332k315K970K271o2n887J291J734K398j500r63
7601C694j938J065l019k504m378l134N106Q260K014j453J975j603K688K290Q43
7586I906j347o50n208J944n446k279L824K2l89P391N768K18m559o478K75R66M646
7569H604K778k413q65m210n466m494M362M081R65J333J022j673j676Q144R00J399
7553A2791o62P125k095m230K875Q2j497j243o612k833L809J36L468n453n772n200
7537e311N164M491l07K727p481q773k612k132O465P871J55Q420p29k117l323K572
7521E080Q965o534n118k65K409M165K778J728k462K444K258p138r985j130M845
7506B040Q398K859k773l77m68l602K353k333R56p531q1K055k62k899O171M001
$$ y = [614, -12, -164, -5344, -6634, 1425, 3757, 1442, 4412, 6683, 6621, 734, 2025, 3759, 6157, 4657, 3694, 1756, 2821, -198, -2702, -7080, -10214, -5108, 3152, 5166, 3713, 5688, 4085, 6773, 9063, 9906, 8559, 7909, 2701, 4645, -801, -3080, 744, 766, 377, 7768, 13536, 13754, 9195, 2717, 2992, 3958, 8604, 11382, 8969, 8104, 3894, -1572, -6066, -1704, 2377, 3342, 4675, 5697, 4024, 2348, 10492, 11392, 12791, 12129, 19254, 17159, 12929, 15804, 15886, 14389, 13146, 6534, 3701, 7510, 7646, 11114, 5661, -111, -5311, -147, 4344, 4037, 6764, -717, -9490, -12102, -14234, -7769, 102, 257, 8677, 7948, 5831, 2508, 5080, 14045, 7511, 2393, 2128, 4537, 8702, 11480, 13208, 10746, 13190, 15448, 8310, -1675, -2805, 2040, 10438, 13297, 10524, 10147, 9679, 6077, 8430, 6097, 7053, -478, -559, 1496, 1234, -1665, 4506, 8507]
7490H507m370o843J794L975j185O358L146M659p35p381k431l881m028j242n906
7475i563J904N704P718L541L407l438K835l266m633j76o498J070K634l56R25L350
7459E158J658J709R82j795j720k122j02J26M631l637J328m342J787K573L725J034
7443A0993k864J823K26k95p724j1204n324K27J0962N293M373Q89L444r71j610
7428H238j651q322p001L711o133J693N560j046K884K023L776L318k077o518l82
7413a927K071J053O564l50l640p351j85K287j376L347M868k064j0562n976J895
7398a1346P092q3L697k815o246N841O280M798j504K70n097o84K320K838K68o152
7382e23k966K434L966P157r86k218M60J583j459j392J395k54j920J476K915N993
$$ y = [8507, 4137, -2706, -912, 3063, 1878, 8236, 11382, 16041, 15306, 7925, 5494, 1613, -2415, -3657, -9563, -7659, -1955, 5763, 9304, 12711, 9273, 12108, 8842, 4209, 4033, -2465, -1395, 1239, 883, 1808, 5158, 6816, 8525, 9507, 7712, 5992, 3870, 3768, 3894, 8525, 4888, 6216, 1874, 3661, 6234, 9959, 10993, 8129, 9952, 10178, 9883, 2159, -9045, -14369, -14142, -3180, 2113, 6486, 7375, 10819, 9848, 8238, 6587, -1735, -8736, -5025, -11158, -9465, -3905, -4951, -2067, -44, 3732, 7050, 4973, -1545, -1927, 144, 1197, 7761, 7411, 3771, -3580, -3765, -1478, -2854, 493, 5361, 3297, -7265, -13241, -11346, -4254, -4337, -640, -3455, -9701, -3860, 2420, 7218, 5714, 5984, 887, 203, 2523, 5361, 5629, -523, -3489, -1055, 2911, 10068, 9082, 6864, 7324, 8907, 7448, 6056, 7451, 7197, 5277, 6753, 9668, 15661]
7366A5661k467q615j821O734K321m468J028O61K520J324N286J173j0496p500L795
7351E136P066p78L299o467o894K057K069O716J183J699o096k347l380O089k65
7336I087m214N08K711r21l835J458Q896Q030j948m519n83l514o021K049j871o415
7320a102l933m093j76N499K808j656l99j679l265j075j617N803k727N668P345
7305E401j409K494j513o704n587r46l952l274J0508M426K058J076p551N517K601
7290C145l298m265J208M525O273j865n120o324j609K35J323M188L584L070J940
7275G010o539k358O436L267N389N04m559M98l119M675L50j0275k471Q070k281
7260D597M78q1J397J975p887o923L448J1288K7j466J885r032K051j826k762J188
$$ y = [15661, 13194, 4579, 2758, 9492, 11813, 7345, 8373, 9034, 11554, 12878, 18164, 19337, 8841, 1341, 5136, 12202, 11424, 14723, 8256, 1362, 3419, 5488, 12204, 13387, 15086, 8990, 6643, 3263, 9352, 9087, 4873, 5381, 8092, 7171, 3336, 4794, 13690, 21720, 19772, 15253, 14670, 11156, 5135, 7184, 5313, -1102, -5035, -9128, -9304, -3805, -997, -2653, -3052, -4731, -7996, -9071, -10688, -4885, -7612, -1944, 5401, 3992, 6486, 4973, -1731, -7318, -8264, -12216, -15490, -4982, -556, 1502, 2578, -4973, 544, 3145, -153, -4418, -3210, 1315, 7588, 5723, 603, -5721, -7330, -7095, -5772, -1584, 2000, 5070, 7010, 471, -1887, 4549, 7816, 13205, 13709, 9150, 9648, 6529, 11204, 11554, 1279, -1192, 6878, 4597, 5075, 4994, 6391, 8366, 479, -6444, -2996, 8292, 8319, 6853, 8738, -294, 1757, -69, -2831, -1643]
7244a643k797M63Q66l849P345Q715l857n931l458m702n003j475O15M190J4991
7229D470O115j6l786j43j432l789l47l330q025J132j175o68J0155J2244m24j373
7213I608j645o511K516K650J050L929j2269j528M137M116L746K516j0270k988
7199i43N50l537O540j060j607o156l985K301O645Q690M011l713P2m465r140q739
7183a4536M934R382J18P53M4k187l305J491k358l402L003N968Q280k094L995N995
7167A6081m354l507o798q935L686L105O610k50l727P14K169K713q7K74J940k930
7151F704J891l564j1085r180O805M553K116N069q235k890K670J233J519J788L097
7136B491K169m03K316l273n362O378K2j973L335m259K347L199L94m468K76j014
$$ y = [-1643, -4440, -3977, -3111, -6960, 385, 9100, 5243, -688, -4146, -8848, -13851, -15326, -14711, -10521, 4470, 10585, 10569, 6783, 6640, 5208, 1419, 1072, -2258, -10283, -9151, -10326, -10994, -839, 11405, 10981, 9608, 7963, 1452, 3968, 6618, 7668, 11597, -672, -2200, 1937, 6053, 9799, 12315, 2045, -943, -393, -3930, 2610, 1550, -57, -6213, -10198, -7897, -1252, 7438, 11449, 7736, 7808, 3343, -5797, -14536, -9602, -220, -102, 651, 695, -1492, -4797, -3306, -5664, -9066, -6063, -95, 8185, 6091, 10086, 16081, 11727, 8220, 1422, -7513, -3827, -722, 5888, 5638, 1911, 2625, 4794, 7507, 7420, 7694, 9634, 6704, 8595, 5031, -6054, -15234, -8429, -3876, -1760, 3309, -4926, -7816, -5146, -3913, -2394, -606, 2491, 4660, 4257, 6573, 3300, -2062, 4316, 4338, 2365, 5700, 1441, 3788, 6987, 7381, 2913, 3189, 2175]
7120B175l202J2615K792k770n974l207l480O043L612o882r478j234R883O304l86
7105F811J274j713jQ099O515p348p159p21k516J148N26l718P02J203k258m066
7089c222M023m448j0748k37K367M684j251R519Q826m518n361J782K326k638L62
7074A466o67j437N187l071l2N257L546r24k177l554k370J379k806l663K079j625
7058c412o664M906K151R62l314J313L084J542n91l808J499J815N058R27P83J07
7042F358M175J086n941o722o281J871M311O909l00m637j68L406j409m143j376
7027b861M292l163M059o52k38O299r26K731l898J021n055j523n031O073K410k324
7011A214L202l60J7Q190j063l305k66N179L671m489J057m525n547K263J851m130
$$ y = [2175, -1027, 11588, 14380, 11610, 5636, 2429, -1051, 4992, 8604, 1722, -7756, -8990, 893, 7197, 6811, 8085, 6372, 6371, 14470, 20985, 13637, 6478, 5757, 3241, 4389, 4915, 1197, 1899, 3102, 844, -3222, 801, -3647, -14395, -14632, -12265, -7581, -8832, 687, 9513, 4995, -366, 1416, 3742, 1104, 1466, 799, -638, 4549, 1478, 1446, 6703, 10249, 9325, 7148, 3594, 1224, 2603, -203, -3866, -1787, -3412, -10076, -5170, -3019, -2057, -5371, -4058, -974, 568, -23, -3831, -2332, -517, 4541, 5468, 6251, 6358, 10533, 11619, 5678, -1044, -7325, -5454, -1143, 5766, 5466, 829, 661, 4067, 2658, -1485, -2861, 1431, -1732, 2327, 1675, 1437, 7736, 6810, 9541, 5643, 6664, 1609, 86, -4945, 1128, 3538, 1214, 4416, 4056, 4073, 12263, 11200, 7895, 7629, 12808, 16479, 11990, 13047, 8522, 2975, 5238, 7089, 2959]
6995B959J055l730k844N337K993L852j927o226m557M539M588K59K285M064J501
6980A4148n56n285M828J45o047j285L174K368j208q348k309K37N470K310P519
6965A5161K756j314n830r479k659P753l026o912m106L46o7M19Q77M831j698q98
6949c846Q729O994M18r24K72l994J276J804p290n068p810j443k712K097R555L374
6933A432k833j750k51Q741k781q94L652q715n072L554q36l599L50K6q6P402N848
6916D188l832l567l187P79j010m636k29N620N789o429p414K748P028J919K471
6901B38K864l841j0457j902J1311M869R73k523l291q512k709P490R778L325l430
6886D183k803N51m603j735L469K928p01N880R05o809O11L041k906l206l604J028
$$ y = [2959, 4014, 284, -2560, 2777, 5770, 9622, 7695, 1469, -3088, 1451, 6039, 6298, 8583, 12647, 14148, 13592, 8307, 13135, 13280, 7233, 5948, 9122, 11490, 10282, 1934, -375, -138, 5332, 7642, 15161, 17917, 16603, 10773, 1294, -1365, 6388, 3362, -3550, -7656, -7310, -7377, -6958, -6081, -1250, -2948, -3846, 4883, 11877, 12295, 11371, 11643, 7649, 8925, 10729, 3439, -1629, -9439, -10882, -13594, -11497, -1942, 1432, -1401, -3151, -3402, 5339, 2558, 1664, 5316, -3399, -8471, -4917, -5753, -9352, -9002, -8976, -9062, -1660, 4188, 356, -3211, -6398, -5619, -6629, -11265, -11494, -5874, -85, -6514, -13928, -11180, -4152, -2233, 238, 3102, -739, -11196, -13098, -1787, 3082, 4055, 1532, -1759, -10271, -12980, -5490, 4288, 7613, 4183, 1380, 1931, -2672, -4407, -938, 1990, 1289, 7169, 8074, 1265, 1876, 4917, 2011, -1195, -4799, -3771]
6870c771J099O23k703P297J534j457k616j363l907l38N34m240j7k491M50K479
6854h887O765N176Q744k278q179j3586N488P695K857p50Q5K967k946k839P341
6839G653M284m974o734p162P237J324l01j435M999m797M186j201n279N386K700
6824E886M171m293k555O383o598k563L305n331n97K723o645n6N7M87L285M944
6808B603L987L703L710r612N65L927k810P51K28l860R70q9l460q529M350L204
6792c62L698L523N72k450L66j762k874k688r08J815l907Q189R754l43j3641j872
6776b890K578J193Q605m120J88j796l606L275L343j179r219L503p92m344j513
6761f774L562O059n784j662M995O563J923n016q397l630l769Q494M716n632l150
$$ y = [-3771, -2672, -2049, -4752, 2545, 4079, 2622, 6, -1357, -5264, -5602, -5068, -9308, -9325, -11816, -11366, -8887, -2122, 3054, 11798, 9520, 1341, -12245, -6757, 938, 3795, 3045, 3130, 6097, 3151, 312, 7653, 11937, 6963, 229, -6933, 304, 1628, 1327, -108, 4891, 94, 4280, 3079, -2200, 3186, 5886, 10057, 5764, 3209, 9592, 2994, 431, 3736, -1595, -2192, 531, -6114, -6170, -6113, -5626, -2341, 2603, 6590, 10293, 14003, 4391, 4956, 8883, 6073, 6824, 7052, 3192, 4162, 4073, 613, -7916, -3566, -362, 3336, 6859, 7431, 4981, 5347, 3585, 711, -1977, -2885, -1070, -4977, 3212, 12966, 12623, -1018, -2890, -312, 881, 9486, 5366, 5554, 3758, 152, 3427, 6770, 5591, -3628, -125, -917, -5261, -6774, -3212, 2847, -2937, -4599, 396, 6959, 8882, 3866, -4531, -8161, -11930, -3436, 1280, -4352, -7502]
6746g502N111R662k189o475n694n402k312M227L490J501J501J098m88J796J0218
6731H542k703q589m14P85K500N482O251k207n528q303L1O727P782M656k326m71
6715A2215k018L765J464p155J129k419m162l940k041q777j45k731L390J0622L212
6700B409j507J989m373j2664J070N248k155J87K196O142P827K611l056o495j361
6685a932o379n19P119O69L486K834J119O562p53k762m924j0292K000O509K928
6670E665m613p720M351M95M379k545k260j280n963k148j142l402L06N176P583
6655c118Q253M747n553j142j831k189O515J209l934k450R17k176N466m537n6L718
6639C839O58j89q84l609k503L600N334N422J277k677l798L97l102m26J058o584
$$ y = [-7502, -2391, 7271, 5082, -1393, -7087, -12489, -14801, -10574, -7084, -5583, -4082, -2984, -3472, -1676, 8542, 5839, -2750, -3164, -2379, 121, 5603, 11854, 9647, 4119, -4184, -4153, 2574, 10356, 15012, 12686, 12215, 10197, 13962, 15426, 8271, 9400, 6981, 2819, -1121, -3162, -11939, -12084, -14815, -11425, -803, 2409, 902, 2891, -1482, -14146, -13076, -7828, -9983, -9796, -7600, -1458, 6369, 8980, 5924, -571, -1932, -8311, -8830, -1711, -1042, 2444, 5278, 6397, 12959, 12206, 9444, 4520, -5772, -3772, 2737, 5665, 1052, -6668, -2317, -1822, 2557, 12, -2248, -3528, -9491, -11639, -12781, -16183, -15877, -10701, -3118, 5135, 9882, 4329, 3187, 1356, -833, 5682, 6891, 2957, 507, 1424, -752, 4714, 177, 121, 3839, 4497, 4308, 3424, -185, -2688, 912, 6246, 11668, 12945, 10268, 6470, 6867, 3765, 3339, 4397, -2187]
6623b187q415j97P309J072L182Q236J627q403j552K526q69O31L932M998o235j12
6607E543K579L731k089j2143n265N285j697j948L934j075n472k603R79L189J183
6592e869L767k435L83k514k534K017O262J51l118M103N214j441J36K655R608L232
6576A9617p886m644K935L119k722n003q132j828p00L508N093m175n600J643J468
6561c307L589N49j457j249J005N399j289p662j64j724O770M083J730k441m789
6546i57K418O83K500O430l332n014P83j758l795j125P723O439J450k252n840j973
6530B380M729l632L93N1j71R75n85p07j052L566N018m123o041m315K903M080k502
6513I67n159K05Q829J109J306o374r798K906M659k91M617O297M644J882r67n232
$$ y = [-2187, -10602, -10799, -3490, -2418, 764, 9000, 10627, 2224, 672, 3198, 2329, 2960, 6892, 11890, 5655, 5543, 8122, 11853, 9764, -2379, -7644, -2359, -4056, -6004, -2070, -3145, -8617, -11220, -10241, -7052, -5869, -2102, -4537, -4154, -6668, -9202, -7185, -923, -772, -3890, 213, 5427, 3986, 4122, 6777, 16385, 19617, 11731, 7087, 10022, 13141, 10419, 5416, -2716, -4544, -5244, -1736, 3357, -818, -6418, -4775, -3307, 282, 831, -626, -1875, -870, 4529, 3240, -4422, -4586, -6310, 460, 4543, 6273, 3832, -957, 1461, 2144, 4644, 11074, 7742, 2728, 3511, 1753, -2042, -3167, 4556, 10995, 12445, 10193, 4353, 2380, 7109, 3477, 3870, 3921, 3750, 4725, 4140, 3433, 2381, 5947, 10965, 6842, 801, -3514, -611, 3469, 967, -4192, -3987, 4842, 5951, 7257, 883, -8915, -6009, -1350, -1641, 2976, 9273, 13917, 15799, 14832, 9600]
6497I600q175n14L043j533L26k880J439j462k325R22R476J245n310l265Q64J913
6481C364k694l262j35O08L587L484R006l791K261l114m583j1425J258O117N31
6466A212J426P74L374j221J413R14n866N177j082q197k423K703O797L002k085
6451E918k533j244n445m866J300L624J469j933N366m081r778O921L805R23k243
6436b797M678J566m778m293J923J332L150J571r83n369m107p775p56P660J178
6421g800j930L189P058M534r266M863L667l744N11q70M863J377m832N759k624
6406D755l425K38P241r59m346n705r190L725O153N319O472M080k388j1816p691
6391g537r55K71N474M243K11J801q626o795P26N527L249L052j051m439N04M90
$$ y = [9600, 1425, 911, 3954, 2421, 2747, -133, 1306, -156, -2481, -1559, 7917, 9162, 3852, 587, 1451, 3364, 670, -2592, -2727, -2119, 1468, 4952, 13958, 10167, 12428, 9314, 4731, -6694, -5436, 681, 1212, 2638, 3412, 6786, 5565, 6978, 7892, 2026, 7203, 6121, -2076, -4499, -1796, 5001, 8003, 5918, 3385, 2141, -3304, -8170, -6870, -3246, -1777, -3710, 1656, -2425, -12203, -5282, -1477, -554, -2797, 1881, 3447, -1331, -5624, -3701, -2369, 781, 2352, 1369, -4000, -8107, -15882, -16638, -8978, -7800, -9730, -6541, 517, 5051, -4215, 648, 4315, 571, 1082, 212, 5075, 6452, 1620, 7379, 4755, 1330, 1568, 8809, 7850, 3504, -2201, -11391, -7666, -1513, 3806, 10278, 14358, 11970, 154, -7537, -8492, -8221, -2747, 1496, 1707, 3508, -5118, -11913, -11187, -5660, -2411, 641, -410, -4849, -4345, -3855]
6375c855P007J071k983r143K152Q758j115l432k627K111N998l871m541O839M358
6360F727l770K88k590O66L425M445J661J924n188j114L588N389n518n914k698
6345A321M93k774k838j334q22M859J087p276k315J592J418j38l760L738O729P95
6329G75L90l687M82O618L72K77k377Q32M748o34k337n830m718J537M300L816K149
6312F713k753N8M492j412n861l324L175J744l229k205qK701K194k183j479o5j414
6295b856n785o321J947L579P212O301L732l866m983m549m725p450j360Q840M544
6280e740K519l014n260K687Q954O549J97k831j871m010j270N411j507N866L669
6265A0349p240n071N611L915n286j200q45k605M790M90m37J691l267n60k174J618
$$ y = [-3855, 3152, 4223, 1240, -7903, -5751, 3007, 1892, -1540, -4167, -2056, 3942, 71, -4470, 2369, 6727, 2957, 3245, 655, 1321, 4746, 9191, 10852, 12776, 7588, 6474, 10062, 15451, 9933, 4019, 1321, 1814, -960, -3798, -5132, -5954, -1095, -8, -7284, -9599, -8007, -6589, -6727, -10487, -6749, -20, 775, 1165, -2522, -2040, 4578, 4950, 5227, 2850, 3682, 8430, 7796, 5459, -371, -5089, -3552, 748, 4564, 6713, 3960, 4018, 8510, 7098, 1237, -2087, 1088, 2832, -397, -2602, -2610, 91, 2285, 102, -1377, -1442, -2856, -8641, -14962, -13015, -9436, -2224, 4077, 7809, 3943, -1040, -5589, -10314, -17764, -19124, -10284, -5740, -3221, -6235, -11495, -8808, 146, 6695, 6892, 4061, 2190, -1820, -3090, 2321, 814, 6680, 10349, 3109, -1962, 3649, 7564, 2278, 1078, 233, -2372, 2418, 2908, 2471, 4162, 895, 335, -1839, -221]
6249b21p017P34L549N504k673j923n88N486p15O03K613M81j154j61j990p105o07
6232e184K451p624n00M763O331R541k685j712n25p91j62J16O78K83m187P386N042
6215A3221m594K311K105J670m396n705N83l262j370M031j292j118Q61m002l439
6200d396K17P252k73n269K177N621k241k412n72m767o050n41K597K57K990K07
6184e203p4O831m222l521O249n35p590r84R824L854L843k361L876j79q102L013
6168D719k24J422P387n06K48l278n584m065k584j027k84k495N52l123J60K912
6152e770M777N139k683q925j912L936k002j3730J849J7409N206j642o530K27m957
6137i608j816L885N417j766O002k026K303O445k924j238n436R84K125l82k14l27
$$ y = [-221, -7238, -6504, -2955, 2549, -124, -2047, -2635, 2851, 2136, 2739, 5352, 5833, 4679, 4518, 2528, -4577, -5184, -2733, -10357, -10857, -6094, 237, 9778, 7093, 5381, 4856, 4065, 3903, 4019, 4697, 4980, 793, 8179, 13221, 8627, 10938, 13043, 14713, 10317, 4612, 5195, 1933, 563, 4594, 3302, 2184, 3045, -957, -4396, -4179, 3073, 2800, -2469, -292, 5329, 3088, 676, 104, -4663, -10713, -11254, -8657, -8400, -5410, -5203, -5277, 1554, -2668, -6189, 60, -475, -8065, -9049, 775, 4629, 8472, 6111, 9987, 9808, 1706, 4719, 4495, 5917, 13304, 12798, 13046, 9768, 4184, 119, -2465, -3492, -3776, -6271, -5719, -8842, -8682, -5770, -993, 4146, 1463, -7462, -9374, -5438, -7440, -21170, -19321, -1912, 3294, 1652, -4878, -4651, -9608, -11424, -7539, -2122, -3888, 2114, 88, 2391, 8836, 5912, 4674, -762, 222, 2347, 1965, 1751, 1424]
6121A424n026j43j969n90L224M103N902K854O835K449k916j0975n005K762J496
6106D425J58m413m343l321J979K888J177O668l711N18j633p038N519O59N188N36
6090E256O01Q51j638n600J096L955r04M763k513l676M372J702l196o52l908J272
6074A781l758k095o467m664O809J663O648n4l657P190J094N17J379K567j689p810
6058e46l438n403n774P67M772J733mL772m147k251L08k340k341J994Q26r85o854
6041a9911O066J0021N325j504o380n983k155N679P952P92j729J225K830r78m333
6026c083R31o512o753J022P627J0334j064k513l690j055Q207m21p358p218qQ783
6010b771R819k389m808K525K15k345M378j07j358j70J774L267L702n003o373K890
$$ y = [1424, -3602, -3745, -5714, -6304, -3080, 1023, 6925, 9779, 16614, 19063, 16147, 5172, 167, 2929, 4425, 4583, 170, -4173, -7494, -5515, -2627, -1450, 5218, 1507, 2025, 392, -6646, -1127, -468, 4720, 5256, 5857, 6708, 5070, -530, 566, 4521, 3617, 8380, 5867, 2191, 6563, 8265, 5069, 4417, 509, 1781, -1977, -4072, -10539, -15203, -8394, -6731, -83, -137, -3794, 3396, 4490, 5007, 6386, 8953, 7264, -546, -3984, -9387, -15161, -14394, -9622, -7889, -7893, -4121, -8268, -10519, -10211, -12551, -14892, -12898, -12072, -13057, -19911, -13845, -3824, 1501, -3, -6383, -12366, -14521, -8842, -890, -98, -1827, -602, 2228, 1250, -3083, -2152, -8664, -15417, -14395, -6768, 3566, 2502, -11, -3701, -4756, 3451, 3030, -4328, -11546, -11554, -2771, 7048, 4659, -149, 2376, 2591, 246, 4624, 4517, 3159, 2989, 4763, 8030, 11732, 6729, 356, 3246]
5994C246K818K871O416l933m726m799q535q5l61R36k938M997P1L166o171K978
5978d049k588m102N726k811q616J579N534N731Q32J596k367J032n69n620K336
5963f356M277M50P54N327q29m280j206p91K001J942j510L83K84l936k685k273
5947h448J262l138K672L786j695j151O088O838j276K87K06o0j831l173j600n021
5931f254n1J1520j572N0j973n569p086K115J0495M742j224L913o67n299J340L314
5915G794L000l121p458J979K07p830J511L966k022j321O142Q705J220k349o583
5900C840q827J79m84K535K822k914L141K213j550J011N960N3m549L908n575n215
5884c452J888K54m22n889o269m407N61Q935Q564l138l772M944O187N073n388o758
$$ y = [3246, 6064, 8935, 15351, 11418, 6692, 1893, -6642, -6727, -7088, -6152, -9090, -4093, -4022, -856, -7027, -4049, -6637, -10739, -5013, -7824, -16440, -14861, -9327, -3596, -2764, -1168, -3535, -2503, -3072, -8692, -6356, -2079, -1629, -875, 4452, 3623, -657, -1863, -2654, -653, 1289, -221, 162, 446, -3490, -6175, -8448, -7186, -10324, -7652, -3866, -5561, -6712, -624, 6214, 4938, 5225, 5431, 5371, 3540, 367, -1233, -6254, -6305, 5215, 3643, 3693, 1720, -3849, -10935, -8820, 1675, 6417, 5193, 9106, 8439, 3140, 4480, 7794, 10794, 7673, 215, 2194, 2401, -5429, -3918, 48, -1974, -3295, 2847, 11552, 12772, 10423, 3840, -4987, -4808, -5292, -2757, 65, -2849, 292, 2505, 955, 1966, 7926, 7979, 3430, 7338, 1763, -3452, -1564, -1310, -1732, -7621, -13890, -18297, -17736, -8801, -237, -3375, -7147, -2203, 3984, 9057, 3669, -3089]
5868c089k290O03l778k121Q99K348J226L441L200M805m648q247J547N592m977
5853e489K348O417M66l670j1373K656M161k973N420k951K54ll978L42L057K520
5837b796R71m359m310o72K098k72M201M186j108n486l836J181J261P15L970l632
5821g888K513K833p063m455M175P52m238J678M309R002j673k845R0J288j541k215
5805e278K373K749k681L067J731k135l946k974M391L300m928K652J07L58j077
5790b291J038J545O32j731O96n88p80N59K30k559M50M558m455L183Q212q99Q512
5773A6312j650o065J008O605l471m464m112o206p517m355j588N586J664o00Q746
5758a07M713p09K106j465l4j11J26j272o368n132n190O063J534J727n325L111
$$ y = [-3089, -5379, -4776, -8554, -10675, -9776, -7428, -6202, -2761, 439, 5244, 596, -7651, -6104, -512, -5489, -3141, 3276, 3742, 72, -11301, -8645, -4484, -7457, -2037, -4988, -4734, -4737, -8715, -8373, -5316, -2796, -1825, -6184, -10494, -11166, -9068, -9340, -5139, -953, -2061, -7547, -11383, -10202, -8941, -8226, -4256, -7888, -5375, -2542, -9605, -14060, -9885, -9133, -13371, -11693, -7384, 1618, -55, -2900, -2810, -1522, -3063, -5278, -2905, -156, -2837, 230, 1961, -174, -4120, -7094, -2703, 597, -4331, -1679, -1572, -1214, -2291, -1253, 292, 924, -807, -111, -699, -1479, -920, -690, -3249, -2799, 1759, -2696, 487, 8699, 7800, 16312, 14662, 8597, 9605, 16210, 12739, 8275, 4163, -2043, -9560, -13915, -15503, -9917, -8253, -8853, -107, 4606, 3897, 6003, 4538, 4504, 4393, 4519, 3247, -3121, -8253, -13443, -7380, -5846, -4119, -9444, -6333]
5742f333N119K389K113k905m875O192J642j76K357l218J796O360n819o856n46
5727b760k613M360j066J13N587m089n589K712J93P64K285O11K798P533J328l734
5711H433o656m518k521k776J107M828N26J450L298K62M87o272J462P64L29j28
5695G5l958K330N981m172k096O478J882J022K644J727o476N06k275m55j631P40
5679B322J779K570m058K387M926L862l771j1320p66J836l705k593m563M718K084
5664d292M15J488k418j935j874J170K760J588J534K37O376J599l632J326N136
5649I478L53n739j2301K325L16J055P411R25o232k698O301j769K69m741j511K65
5633f293M87j446l913l581k607O231L492K034L308o28l054R22N417l924K72Q165
$$ y = [-6333, -1214, 1175, 3288, 383, -4492, 1700, 3342, 3166, 5523, 2305, 4101, 10461, 4642, -2214, -2760, -5373, -1013, -2079, -1966, 3621, -468, -6057, -3345, -3152, -2388, -103, 508, 3306, 10839, 12167, 8433, 1777, -2741, -5262, -8038, -6931, -2103, -1577, -127, 3171, 3433, 3920, -2352, -890, -126, 203, 75, -3883, -1553, 4428, 256, -1840, 4638, 6520, 7542, 10186, 11913, 5437, 5943, 3668, 3213, 1582, 2322, 4101, 6671, 2613, 5000, 9926, 13788, 10017, -1303, -2069, -233, -3938, -6531, -11094, -6376, -4292, -3877, -2389, -4807, -6742, -8616, -7446, -4686, -3098, -1564, -1327, 5049, 6648, 3016, 4342, 9478, 9831, 4092, -8209, -5884, -5568, -4513, 2898, 3823, -2409, -5107, 1194, -575, -306, -5047, -6558, -6293, -5806, -7252, -11165, -14746, -17353, -11122, -7630, -5596, -2288, -2916, -5970, -5048, 369, -3555, -3283, 4882]
5617D882K612o65j874o87m560n76K354O98L290Q758r71q389j4974K788N8J98M495
5600b563O577K74m423k836r28l220K715Q94m473R746M504p908L056R768M106l224
5584A2065j500J01n151n716n298P34j697m360n55n15L260O791l30K483R74j25
5568A161k463r48p652l547q71K919K444J772J815J74K238M780m874o533K76J142
5552h167p03L569n306n080L909P781j642K644N93m403k182j644J1420P27k581
5537a065L760N368o432k563m515J615M554M667o11r116k178M840J880O647k600
5522D251r509j996K554J896j862M180K450n283l259O022N946K648j015l591j933
5507A499j940m783Q38M199L488K592L998K089l422l898n975m221Q81k091Q27o
$$ y = [4882, 7494, 6829, 4955, 4268, -292, -868, 1486, 2184, 5474, 14232, 13261, 4872, -10102, -7314, -7256, -7058, -2563, 4014, 4288, -135, -2971, -3899, -7119, -4404, -3510, -7983, 1763, 6267, -1641, 1415, 11183, 15289, 12065, 10565, 10666, 5515, -201, -5499, -4765, -6462, -10822, -11377, -11892, -8632, -1841, -2171, 312, 1286, 1161, -1302, -2250, -9902, -13449, -14320, -11401, -8957, -7185, -5370, -5196, -2958, 1822, -3052, -9585, -9309, -8167, -8870, -5301, -10607, -15687, -11778, -3997, -5639, -2995, -2402, -6805, -8987, -10631, 789, 1516, -1065, 2695, 8063, 1631, -932, -5447, -3832, 722, 5389, 4778, -4338, -6516, -1676, 204, 6851, 4251, -5258, -7254, -4700, -2804, -4666, -486, 1964, -3319, -6578, -556, 5390, 8038, 7023, 3432, 1499, -441, -5224, -4386, -187, 3301, 5893, 9891, 11980, 8558, 4660, -1315, -5536, -4655, -6746, -5919, -5925]
5491e925o247j922r0P106M532l630o760l899K896L394r29J453J989j545J900K947
5475d730k163q74M732J84O677R17l42n689q74N222M245j1160o699m582N376P149
5459b611o1p01J181q553j555R325M47o362r95K839J557p637L880R513k479o166
5443h378r58j144J756R017R159k623M44j835p57N379R92r88K58l559j0331k15
5427c783M899O259J843j1219N657L806o886n997M467O443J399M050p399m842l987
5412e290J98m1l618J730J791L249P562J0405j1177p262Q32J395J447K721M085
5397H027J953k31k78p269r028r73R172Q08k198l119p6M647j514K940o1P4p01k920
5379g47Rl432j696l508K56j569R979j36m090L185M397j330m043k262k106J262
$$ y = [-5925, -12172, -14094, -14184, -7078, -2546, -6176, -12936, -16835, -13939, -10545, -11474, -10021, -8032, -9577, -7677, -4730, -6893, -7767, -3035, -2851, 3826, 4743, 4401, -1288, -2162, 3060, 7305, -3855, -10554, -15136, -9760, -2611, -2672, -3373, -2192, -10745, -12300, -2975, -2528, -8890, -9885, -7046, -5489, -13126, -9246, 267, -2212, -8378, -9336, -10480, -8724, 293, 9452, 6829, 7273, 5438, 4681, 10060, 11052, 10064, 10322, 6763, -3568, -3783, 1116, 7375, 9218, -2001, 3656, 7462, 576, -5421, -954, 5489, 6888, 10938, 3539, -1303, -5290, -5092, -5133, -8751, -7021, -5230, -1981, 5581, 15986, 4809, -2453, -1621, -226, 1221, 3942, 8027, 9980, 9749, 9471, 2202, -6826, -7799, 1373, 2181, -17, -3136, -3212, 1435, -79, 2861, 2800, 2874, 2173, -747, -738, -4170, -5866, -9374, -9118, -10687, -708, -844, -4934, -1749, 2648, 1318, -2725, -4987, -7093, -5831]
5363e831M576Q79N083l450l321j7O030L53o031M060L897j827m284m64K514j823
5347C44k643l87j47J0780l943o639J472N815Q727k77k29n101j508J398j410N06
5331F758m636p914L40J994K220J092k626K219j233l932J54K946L126j254o695
5316g441K942j802m769l601N798K47k425J111L534L497L295J61J545M928l867
5301C153k314n654j806k027K765J974O23L756k099N392m64n714J407p486o400
5286a4894J283k155L174P368L367o857j701J294M015M717J170n377m259M65O086
5271b304l011J551M44Q16L46l510j977j477j477J858k583k762Q730L995r221j538
5255a2120k033l693K110L268M396J095J754k912L209J056m398r451M961Q168L534
$$ y = [-5831, -1255, -376, 4707, 1257, -2064, -2081, 3949, 4302, -1729, 2331, 6228, 4401, 117, -347, 2167, 344, -2299, -2686, -2833, 7947, 4004, -2635, -1163, 4652, 13379, 13102, 12873, 7772, 6264, 7662, 6252, 6758, 2122, -5792, -5452, -3458, -1238, -146, -2772, -553, -1786, -5718, -5564, -2618, 508, -746, -7441, -4499, -6301, -11070, -14671, -8873, -8626, -11051, -9940, -6406, -2909, 386, 547, 2092, 7020, 3153, 839, -4815, -6621, -8648, -5883, -3909, -3286, 470, -1629, 3763, 3299, -2415, -1008, -8494, -14894, -13611, -15766, -12592, -5224, -1857, -8714, -10415, -9121, -5106, -389, 781, -4596, -8855, -8390, -2304, -5315, -3764, -3320, -2504, -2158, -5668, -7645, -9122, -10599, -8741, -11324, -14086, -5356, -1361, -10582, -12120, -14153, -17846, -15736, -12468, -8072, -6977, -5223, -8135, -4926, -3870, -8268, -17719, -12758, -4590, -1056]
5240a056m88k263l47j383m034J224M5j703k20K410r32Q036O026N432P511k900
5224A5358o056l584o007p61m45l420K578M500L438K42L015r8k447j371l664j013
5208B65k857l356K527N288P274N9l694N01k756J74l763m088K45L221L71p89j73
5191a551k197j485O313M209K455k180m250K032k962O55J920K139k465j176M149
5176E606l703k286l281P64J32j037m209k001J112j04L979J571O323j251l350j276
5160c011O554O461L627M10l191q585j784K708J332l106m525l562M562J469m539
5145e180o482k299p82n178J1145J1727o26n316J940N033k227m22J454K746P657
5130A3190l061k053o260k723j0140l824j796M173K923K117j163l526j661L138
$$ y = [-1056, -1544, -3807, -4154, -5537, -9571, -8347, -8302, -10005, -10225, -7815, -8747, -711, 5315, 10747, 18258, 15358, 9302, 5718, -289, -1050, -1495, -4915, -2337, 2163, 5601, 5843, 8858, 8760, 6313, 4942, 1278, 265, -2592, -5948, -3421, 1867, 9141, 9200, 5506, 6007, 3251, 3425, -338, -4426, -4181, -960, -589, -1378, -1551, -3748, -5233, 1080, 5289, 7744, 5564, 1314, 3346, 384, 1039, 2959, 5098, 2633, 1457, 5606, 1903, -383, -3664, -2900, -2768, -3805, -8014, -10015, -8903, -9007, -5028, -3457, 2866, 1615, -1735, -3011, 3543, 10004, 13631, 14041, 10850, 2265, 481, 3189, 4521, 1415, -3110, -6672, -2110, -641, -5180, -11662, -13961, -14743, -19921, -8776, 2951, 2325, -2991, -1051, 3982, 1755, 1333, 2787, 5533, 13190, 10129, 8076, 1816, -907, -11047, -14871, -16667, -12494, -9571, -7454, -8617, -12143, -13804, -10666]
5116a0666N421j586j492k000l424O924R39l977j276j042J306k653l272J053O953
5101h792L889j497m945J548K779M671l777o504J606K417N301L476L742M778m192
5086D500m827j293m483K086N842j110K159j37q666J976K370n61o619M040P727
5071C004K986O78J775j968l565j0572o156r43O66M450N888J229N328N02L900k118
5055E084P140O085n656k651j453k781k517J621m585K057j141l854K706J2445m34
5040A2066n693j204p40j286L526k392n329O46Q02J841K576L757l488k769j780
5025E33k995k601n392n100k803J238P049K547K770K658J134k892O714P807M28
5010A1095m95L582m741m535k941o126m647N60J271l202K363J0098J640l365o281
$$ y = [-10666, -5245, -6831, -8323, -10323, -13747, -6823, -5884, -9861, -11137, -12179, -10873, -13526, -16798, -15745, -8792, -4903, -6400, -11345, -9797, -7018, -2347, -6124, -12628, -11022, -8605, -3304, 172, 3914, 8692, 4500, -327, -1620, -6103, -4017, 1825, 715, 2874, 2737, -5929, -3953, -1583, -2144, -8763, -4723, 3004, 5990, 6668, 8443, 6475, 2910, -7662, -13818, -14761, -14095, -9645, -3757, -2528, 2800, 3302, 7202, 5084, 12224, 18309, 12653, 10002, 8549, 5768, 3251, 4872, 287, 2344, 1203, -2651, 55, 12500, 12066, 6373, 5169, 4429, 3143, 6669, 4277, -1052, -406, 396, 2237, 4813, 8570, 5082, 2313, 533, -2462, -5063, -10455, -15555, -18358, -17120, -10071, -7524, -4754, -2096, -962, -3854, 2860, 10667, 11095, 10600, 14182, 9441, 4906, 1965, -4161, -8808, -8248, -6977, -10179, -7816, 2282, 3922, 557, -5724]
4995e724L852L019k497r4m765R0L119j865L743m729O45j916N950L697K218N60
4979E303r684o069L436M441K557J991m150l354k016K633K509o500o841J0560L921
4964a263l216l7O218p711r76p96P530R042m572o304l559k648l82j600L530ko715
4947a3461j105l630M297M215M401o70J08K311J227N665J457J95L334k799p45j277
4931C523l678r702K685P266j126k422k675j497J659m603l29O301L532M229j031
4916B132P06n371j228l935J677r04o71r03K405Q79K776P173L761J595o682n629
4900b219j780M539j760k653m92O356m484k798J0770Q489N228r26r570k189j351
4885E160J325L038l119q97J479m527l173K699K95l758m439o980j399K1K027n73
$$ y = [-5724, -1872, 1147, -1350, -1444, -6209, -6119, -3000, -4865, -1122, -5851, -5206, -7122, -1172, 2525, 4743, 5303, -4381, -10450, -7014, -2573, -16, 1975, -2175, -5529, -7545, -4912, -2403, -8903, -15744, -5184, -1263, -4479, -4516, 1702, -6009, -6985, -7781, -251, 8791, 4219, -2085, -5644, -8292, -8674, -10274, -6744, -6746, -13461, -14566, -18196, -13899, -9684, -5283, -5953, -5845, -3534, -2307, 3358, 4815, 5010, 8344, 5545, 4800, 3523, -155, -9857, -7172, 94, -1032, -3454, -6129, -7626, -5967, -10570, -10899, -4598, -1066, 3163, 2132, 2838, -2533, -3761, -7696, -6019, -6923, -7594, -8497, -6092, -5213, -2437, 4736, 8497, 10092, 3410, -2219, -3999, 540, -1220, -3873, -4365, 1991, -2493, -5291, 5479, 13968, 19196, 18270, 8700, 6511, 5160, 6485, 9523, 6404, 5507, 6986, 2459, -714, 1985, 2280, -1478, -5917, -12897, -14296, -14275, -12248, -12821]
4869a2821O837L024k418j313J730j742j457k493l69M201j110p476M458N584L747
4854a618j027k26J610m28j812n323J311J810r42M492p0J511r13k68J169m510q439
4837a3673L585K498j082m60M890K70q22M932m026p973L71Q521N468k788o335r99
4821g623L735j286l690N747K32K578J605L990L375M463l517m748p635o421L872
4806e323K680k508j598L63R094N032J635J001k884l162P9l988n397m22L948N58
4790h92j609l688K540L266L325J783j327o375L042M441q43J094K146O80q46k181
4774D556m441j764N727K217m938k794k483j421l950k671q28O41J056p53M293O355
4758a198o88l720RJ022K256L798L882m011M23L28j113M413O973J568k945o203
$$ y = [-12821, -5984, -2960, -5378, -6691, -4961, -6703, -8160, -10653, -11022, -6821, -7931, -15407, -10949, -5365, -1618, -2645, -2871, -1261, -1689, -3501, -8824, -7513, -5703, -6645, -2153, -2223, -712, -1625, -1893, -724, -5234, -13673, -10088, -7590, -8672, -9132, -4242, -3972, -4794, 138, -3888, -11861, -11490, -2969, 2499, -289, -6624, -7623, -3888, -5174, -8864, -3117, -2885, -307, 1298, 5288, 8663, 13126, 9609, 4861, -2774, -9195, -5323, -2643, -5151, -6749, -6386, 2708, 7740, 9375, 10376, 7492, 4330, 4409, 421, -4976, -5398, -1450, -892, -2501, -6189, -3649, -383, 2942, 4725, 3398, -2977, 65, 4506, 3663, 4757, 6903, 7583, 6737, 4556, 115, -1649, 4078, 6295, 1357, -1437, -3920, -5341, -9291, -11962, -12790, -12149, -11093, -11846, -7553, -1198, -1886, -5606, -5597, -4575, -2319, 1479, 5361, 1350, 1773, 2101, 988, 5401, 12374, 13942, 10997, 4794]
4742D794l945l273N708N156l1j651m401j893n143L271j061m618M070m762q059
4727a5838J016J1064L811k28O938l649p910n323J200j388j498o953K67Q941O909
4712b641P42Q061o55m946l698N739M220r05j1843m411L746J0008j642l963J747
4697d41r60J470j419l141j385K692N74j966O236m325m643J398K239M12K478K478
4681A697M660k935k685k074Q24J047r209k558K929j073L421M74P90L414o82J310
4665f50N311j446k232K985m745k007l074l994r48l01N779L563O702J086k805n90
4649B634j898l663j891M80J591N132R307n913q601K812O408l635j2344J229O919
4634a433L692m474m304J209O104L19K053R089k237j3488k298J620J97J142L517
$$ y = [4794, 849, -2424, 3284, 8440, 8409, 6758, 2357, 464, -4679, -1408, -2469, -7087, -3017, -7779, -15838, -14822, -3758, 53, -175, 6763, 3114, -4796, -10119, -8919, -10307, -11805, -18758, -18491, -9550, -2641, -1899, 6162, 5507, 561, -3137, 2602, 6822, 5917, -5926, -10337, -6591, 3417, 1775, -2188, -441, -1401, 69, -1350, -4491, -5876, -3184, -2610, -4576, 1660, -2665, -7308, -5910, -3671, -3259, -781, 1697, 6357, 3422, 737, -1337, -513, 534, -8675, -11233, -8304, -9377, -5956, -5482, -4692, -1278, -1960, -650, 4661, 3215, 983, 3968, -777, -2784, -5858, -9852, -10800, -11101, -5322, -1759, 4943, 6029, 3224, 2634, 736, -2927, -4818, -4338, -2747, 2385, 11692, 5779, -2822, -10, 6398, 2763, -9581, -8352, -1433, 2259, -2215, -6519, -5310, 794, 1113, 3166, 12255, 10018, -3470, -5768, -4148, -3951, -2809, 708]
4619G08l889m769k007J319k420P079L496l420o420K905n384j599J406K181K69
4604a0545N074L640K486j901k563L240n904J750K905K89o70j169K242n28j297
4589b951O7L766N16L347m138r172l511J2126O503l615o328n79k882J952k776l701
4573a1376K368J0213L202j583k887q09k690J871K599K346m396r977k390J609N424
4558f476J770M023J589L284P207J560L638m404r169r503n85L834J010m48p217
4543i887J975J0720P281p055m003R74n520n587N962P762j623N560J1499j2905
4529E153j1628n508k89J814M458L232K354j655j819k264l987K296J927r85K284
4514d617j151l24Q56j543L08J15j398m069J943K971M76K853l634k105j671P515
$$ y = [708, -3181, -7950, -9957, -8638, -11058, -3979, -483, -3903, -10323, -7418, -12802, -14401, -12995, -10814, -10545, -5471, -1831, 655, -1246, -3809, -569, -6473, -4723, -1818, -1529, -2199, -3368, -1126, -1654, -2951, -2884, 882, 1398, 4745, 607, -8565, -12076, 50, 6553, 2938, -3390, -3969, -6851, -4899, -7675, -11376, -9008, 1205, 4407, 2824, -63, -872, -3562, -1691, 908, 3254, -1142, -11119, -13509, -11900, -6476, -4706, -683, 906, 4190, 11397, 12957, 16595, 12191, 3022, -6481, -7066, -3232, -2222, -2670, -9887, -7912, 2808, 10089, 3034, -969, 5, -5515, -11102, -5140, 2622, 999, 6559, 18058, 5153, -6475, -11983, -12272, -10458, -6000, -2768, -414, -2069, -3888, -6152, -10139, -7843, -5916, -6901, -4617, -5768, -6092, -5236, -6779, -6471, -6356, -7754, -11823, -9880, -6909, -6433, -3580, -7214, -9319, -10990, -3475]
4498c475K216L067k767k163j843J448j396O697M454n862r42N093K327l199k808
4483H47k835j434J573O234j545q403j720L619M832K311K003J770o150r495K661
4468e732O313r48l351l419P875o63p615j28M881K556l008l239l44M678J247j150
4452b047L359K666k057q885J257N175l04l287J464O730n456l159o78J061J118
4437c043j009j478l466K864k236m151K519O388K231J186m96j707r14J15L211K746
4421B760j783J0093j986j645j853n060n15K600n56p32l317K69m311n159L285L272
4405d638O424o20P7R93n007L507J391o394L88N075J223J153j1708l722n720M810
4389a2768L134J500O344n438j0551N801P122o66n340M644J986L964o70M056k803
$$ y = [-3475, -1259, 1808, -959, -3122, -4965, -3517, -4913, 1784, 6238, 376, -566, 4527, 6854, 3655, 847, -1988, -3422, -1849, 4385, 2840, -5563, -7283, -3664, 1168, 3479, 5482, 7252, 1102, -8393, -5732, 581, -367, -3718, -7137, 738, 75, -7540, -7668, -2787, -231, -3239, -6478, -6822, -2144, -897, -2047, 1312, 3978, 1921, -6964, -5707, -532, -836, -4123, -2659, 4071, -1385, -4544, -5222, -4161, -3043, -4052, -5530, -8996, -6132, -8368, -12519, -10000, -3612, -1381, -195, -691, -2398, -3312, -3197, 14, 2760, 977, 11070, 9084, 7439, 5586, 526, 11, 2611, 2055, 1323, -1994, -1725, -6036, -11195, -7910, -4638, 1786, 1166, 1243, 2236, -2771, 736, 2127, -4267, -3879, 1196, 2419, 3572, -8136, -11858, -17578, -12768, -9634, -8134, -1790, -7228, -17779, -11978, -4856, -5522, -10862, -6218, -4232, -268, -938, 3118, 315]
4374C15m705l893p91L627j211R82P967K723p566l755Q34l61O689j293n967n473
4358a1878j01M669M090q47m02Q42R011l978o247L787L82k143j865O483k585o699
4342g481L089R53j727j135K856O009k899J357l472n844M638J77j42K853M43k774
4326c099j013O93K856j803p644k020L961m60n462o118L613Q495P292K815K223
4311D329j373m937l644k305l99k26J661J001M059L184q027j960j856n010L669
4296a1834O451K647J831J693J381j256k514j930r122L800J0257L476j041K756
4282F595n943j1175p361R741J0149k425n7p563J361K610N18k305L117p311K61
4267i788O81Q082L382k181j128j474j168k153m5j141m787J852R463l22O823n154
$$ y = [315, -4390, -8283, -9074, -5447, -6658, -5676, 2291, 5014, -2552, -6307, -5473, -5834, 855, -438, -6405, -11878, -11979, -7310, -3220, -4067, -4469, -3627, 5384, 1406, -4841, -1054, -672, -2815, -4680, 1803, -782, -7481, -4392, -3439, -5166, -6301, -3445, 2564, -335, 1022, -2450, -8294, -3656, -3479, -3621, -768, -325, -3099, -4112, -3419, -563, -2366, -10010, -12030, -8069, -8529, -13991, -20109, -16496, -8001, -709, 2106, 4329, 2956, -1981, -5625, -7930, -8329, -8555, -6894, -5893, -1834, 1350, -6677, -8637, -10493, -15503, -11834, -5383, -2736, -905, 788, 2169, 913, -1601, -3531, -12653, -8853, 1404, 4880, 3839, 6595, 652, -10523, -17884, -8143, 2006, -419, -476, -8039, -6678, -4068, -3550, -5855, -2738, -10049, -9788, -9107, -1025, 2357, 176, -952, -2426, -3594, -5747, -5792, -6933, -11720, -9868, -405, -727, 6096, 942]
4251I42o620K99K48k1J443K218J985p85j692M124K180J182L894M160n780k807
4235D970k357L56k440r186o07N252M391q64K544N013q339r070o704R450L962L461
4219a68n249Q31Q181O6n498j725M657m93m01L615L40K240j263j0130L326O060
4203D389P89N798O5k432J815p389p537L086K199L433l323l449p512N049P925J220
4187D126Q346K326k228j802r185o966M386L71J089k212r03l001M21O737J0050
4172A1555L875p117p720m445k68n717n095R186Q326J311m04o575k459K203L330
4157a4L592J818N65n032m831o780J698N390l069K256o0Q77k71n150M99L334o63
4140e841r36j0182M380Q127J733p461n853O318q51p98L5l694m269M376o17K768
$$ y = [942, -5678, -5379, -5131, -5152, -3709, -1491, 494, -291, -1983, 2141, 4321, 5503, 9397, 13557, 7777, 4970, 2613, 2969, 529, -8657, -9264, -4012, 379, -485, 2059, 7072, -1267, -10337, -17041, -7591, -3629, -168, -5417, -4586, 3595, 3661, -1837, -3562, 1095, 602, 201, 3816, 4156, 6396, 5133, -4997, -1671, 4389, 5178, 10976, 11041, 8609, 10424, 3035, -4502, -1416, 783, 4216, 893, -2556, -10068, -5019, 2906, 4126, 12472, 14798, 12570, 10768, 1583, -5383, -997, -626, 463, -1749, -2652, -5653, -5232, 1505, 11555, 15430, 8313, 593, -3852, -4120, -9837, -14932, -5746, 2580, 3891, 3487, -3088, -5547, -3344, -14, 3578, 5396, 5961, 929, -3902, -10682, -8984, -3594, -6663, -4407, -4467, -3590, -3861, -9011, -8512, -5178, -5841, -6777, -16959, -12579, -4452, -2719, -10180, -16033, -9715, -10566, -11364, -11329, -15023, -19292, -14916, -15533, -12765]
4124a2765K042n064l00K146K350N680M995J321k252M890k859k448K57k939n77
4109e523j102o27L658j7J566L447J653K658k75p72L085m97k732N692l338j2131
4093e255p467K008R55L95K358j311L572K470l16n173L801J643K074j79n46N205
4077D234j117m935L750L1o96M082L482K9j940j19J770j865k139K518M1o228m546
4060c648j837R73l908q1L769N945L491r74o722l784k122m002J496P623K58j837
4044e360m541j290J000N695K343N135q005p623O569l090l09J702J519N68l718
4029i405j297J0222K779n428j835K179K966M994l579o636k105k051K690K415M630
4014E39m287k369j607k105j283J81k349k371P972K339J978k127l770k255K505
$$ y = [-12765, -10723, -15787, -16087, -13941, -11591, -5911, -916, 405, -1847, 3043, 184, -2264, -2007, -4946, -5523, -6625, -7252, -3594, -3611, -2045, 1402, 3055, 5713, 5438, 4666, 7751, 7254, 4522, 10214, 6876, -5255, -12722, -10714, -9759, -9364, -7006, -8317, -4745, -2275, -2591, -7764, -3963, -2320, -246, -425, -971, 4234, 3117, -1818, 1932, 1963, 1267, 5349, 8831, 8860, 6920, 6801, 8571, 6706, 4567, 7085, 7126, 898, -3648, -5485, -4512, -8420, -8501, -4732, 1213, 4704, 3730, -2992, -6776, -8898, -12900, -11404, -3781, -3523, -5360, -9901, -11191, -10191, -4496, -2153, 2982, -5023, -12646, -6077, -9167, -9476, -7774, -6255, -5687, -9405, -10702, -480, 2299, -3129, -4964, -2785, 181, 5175, 1596, -5040, -7145, -9196, -6506, -4091, 539, -3748, -6117, -7724, -9829, -11112, -10931, -13280, -15651, -7679, -5340, -3362, -5489, -9259, -11514, -9009]
3999i009n95K995j727r66Q65r2O52K20l52L549N069k692K787L096q23l117K70
3982A30L475M800N62j662J010p138j924j749j452n07j686M7P298N019j807n776
3966a360n306p877M815O043P525l84k807p079N371l497j113j133L013Q373P805
3951A2389p926p000o947N105R074n19M219L143k733j956m478o662L8N183K378
3936C308k529o92M793m51o817q372n334l544n74L686J744Q633J2746K033k856
3921E774l700j430j378m09p107L956O687j670k932Q83l044o568K984L487k57m690
3905i414k187M463N965r43k84j93k872J7L778L440L549O795M012n127m938L242
3889I303k875q181n950Q341N891m355m824l794k73P94J5j279J039m759m088J0
$$ y = [-9009, -9604, -6609, -8336, -9302, -8437, -8529, -7877, -7657, -8009, -4460, 609, -2083, 704, 3800, 2977, -140, 130, 3605, 8405, 8967, 7305, 8315, 1177, -747, -2496, -3948, -4455, -6141, -6094, 1204, 6223, 4416, -1360, -6666, -14543, -9728, -3685, 3840, 3456, 649, -6430, -1059, -4556, -5669, -6802, -3789, 4584, 12389, 4463, -2537, -9484, -4379, 4695, 4176, 8395, 11538, 8805, 6849, 2371, -4291, -4253, 930, 3308, 779, 87, 4880, 4429, -2388, -10760, -16094, -19638, -20212, -16526, -14782, -6149, 6597, 8630, 5774, 2074, 644, -734, -1143, -8250, -4294, 2393, 723, -2209, -1326, -4370, -10938, -7954, -4467, -4724, -9414, -11601, -7138, -1173, -2116, -2400, -2593, -5465, -5448, -1670, 1770, 5319, 12114, 16126, 10999, 6061, 9303, 6428, -1753, -7703, 638, 6529, 2174, -2650, -6444, -6717, -5923, -5908, -7187, -6148, -10907, -14995, -14985]
3873a4985j952L732R539k222K072J390l520J281P180m730o009M160R94L073K841
3858B844M454j922n530m878k999N553P429L868M32o337j473R87n91N464K258m640
3842D919k507j42L560p980j871K056K467K80m415k566l076j765K593j047K369
3827g125p16O066J261M721M049p13n709L174k908q807K653L842q079J630L188
3812c473M590N189L4k54L149o092m068j537p493N772M614q969j143K302K766J034
3796c579J0859m763m521j373L19L005k61J07M419m897m918m698R09M799o76j860
3780g129J637P320O531j824n795k115k03J281K569n459j822K654K226M243j888
3765B226o025n82O86M439L323K497l805q777k960K198M421K240J305J569m42Q786
$$ y = [-14985, -16937, -13205, -3666, -5888, -3816, -2426, -5946, -4665, 2515, -2215, -8224, -4064, -3070, 3, 2844, 7298, 5376, -154, -5032, -8031, -2478, 4951, 8819, 9251, 2914, 1441, 2428, 1837, 7301, 9559, 4919, 2412, 2270, 5830, -2150, -4021, -1965, 502, 782, -3633, -6199, -9275, -11040, -8447, -9494, -7125, -7841, -1775, -514, 4207, 8256, 7543, 1834, 5008, 2100, -6707, -4054, -212, -8291, -6661, -3473, 1117, 6306, 6340, 6086, 9235, 3143, -925, -2462, -9955, -4183, 431, -8538, -9681, -7379, -4613, -3579, 7280, 2517, -2004, -3377, -3058, -53, -314, -207, 4212, -685, -5603, -10301, -9392, -4593, -5269, -7129, -5492, 1828, 8359, 6535, 740, -1375, -1578, -297, 2272, -3187, -5009, -2355, -129, 4114, 2226, -3799, -4381, -3695, 744, 4067, 6564, 2759, -6018, -8978, -6780, -2359, -119, 1186, 2755, 2313, 11099]
3749A1099L083q763o332n53l452q55k965k468L401k634l434K086N688R09K802
3734b388k901m568m08J850l125J252M464J583L81l095L187L981j526j759p84m178
3718h034K732N690m627j150k552M808k542R31L22OL102M538K06l98K899n417k084
3701a570m179o080l355O431N762k061J393M614Q11l242M920m657M66j223m05m353
3685f728k876k262k631R376K760k248l571K079M736K102j845J897j678n436L138
3670c187n764R98R697o760n480O955O028K513k531j0725m94N618J0825l031k46
3655D416j432j1048l059J17J426K005Q370J778p601o359K206P482p23j378K469
3640a331K179O893K040l37q705l713k48O6K976n827L788M082l139M84K978J00
$$ y = [11099, 14182, 5419, -913, -1466, -4918, -5773, -8738, -11206, -7805, -10439, -13873, -11787, -6099, -5190, -2388, -5289, -9857, -10265, -8415, -11540, -10288, -5824, -4241, -3860, -6955, -3768, 213, -1313, -3072, -3856, -8034, -5302, 388, -4239, -5389, -7941, -3133, -5675, -4744, -4422, -4416, -1314, 3224, 3430, 3032, 5931, 514, -1570, -5749, -11829, -15184, -8753, -2991, -5052, -3659, 955, 1766, -1476, 3444, -1213, -747, -1970, -2375, -6728, -9604, -11866, -14497, -5121, -2361, -4609, -8180, -6101, -1365, 737, -1108, 789, -889, -6325, -3187, -8951, -7953, 1744, -5016, -10496, -3541, 2487, 5000, 2469, -8256, -8750, -3132, 7693, 4662, 4416, 2984, -8064, -11123, -11006, -9580, -7575, 795, 2573, -5028, -11387, -9181, -1699, -2422, -3800, -1331, 848, 7741, 9781, 9444, 739, -2974, -3222, -3156, -180, -6007, -2219, 1863, -1276, -792, 2186, 2286]
3624B286J679j423l927M482J528l325o936m826N536K556L161R56n91j515m282
3609d641k877m961J45P046q984r85q77M957P453L998J70N029j606l118l559J467
3593a343K079N952J299r606n620l471K548O318N204l911j281k81L972K156o614
3578b599j926O647K764N159J671O739m113j1097r734L038l259m737K401L683O88
3563d675N934l465K057K601J705K564n102L015J265j095q42O387l009j2887o372
3548a1919j538k50R835J092j221L114K074k745J508n692k983P451R67J349l38
3533G04m072n66J572O519L132J763M898k169l444j416M292r649m397K803L68n020
3517d682m035K890M039o17k325J945m145R33K217L006O46k058M149O28j064k640
$$ y = [2286, 3965, 2542, -1385, 3097, 4625, 1300, -5636, -10462, -4926, -2370, 791, 1747, 1156, -359, -4641, -7518, -12479, -12334, -5288, -14272, -15257, -16134, -11177, -3724, 274, 444, 5473, 3867, 749, -2810, -1343, 736, 6688, 7987, -1619, -7239, -10710, -8162, -1844, 3360, -551, -1832, -2113, 1859, 4015, -2599, -4525, 2122, 4886, 10045, 11716, 18455, 14342, 3245, -6489, -3451, -6710, -11447, -9046, -5363, -4675, 1259, -2206, -149, 2452, 4157, 6721, 1619, 4634, 5899, 4804, 3962, 10349, 7340, -5547, -11919, -13457, -13707, -3872, -2780, -4001, -887, 1187, -1558, -50, -5742, -8725, -1274, -307, 1042, 704, -3368, -3934, -2362, 4157, 7289, 9052, 13950, 11781, 8337, 6921, 11213, 1564, -2833, -30, 338, -4682, -8717, -5827, -1788, -2405, -4730, -2785, -6930, -5997, -3780, -774, -128, -2186, 1963, 2591, 1527, -1113]
3501a113j846m041q63o52m067K555l92K391R43j380M67m103M8J858m469O384M856
3484c424R9L223K337N846j795k588k69P17L007J616l669m392k220o130k856P368
3468c130O549l181j12M65J691l01n938p1L337n83m11K668L137J770k020Q6k442
3451A514j4355M66L029J843O350R79k812K053k618k130Q63J13j627L535L37K129
3435c31L013k257N137j183K38K075o30l086L512L100j496q802j465O70n5K067
3419E07Q29O06j385k856m963L426O713r22l206K473j100k59o607K49N745M51L042
3402B743o694J669J250N325K167m987k506k058l40M273m56n254m315k765K942
3387i006M489K723q419r45N111j786J283N375J154k875n890L598L11k570j494
$$ y = [-1113, -2959, -7000, -7863, -8515, -12582, -10027, -10419, -8028, -7085, -8465, -7998, -12101, -12053, -10195, -14664, -8280, -3424, -3325, -102, 2235, 8081, 6286, 3698, 3429, 4146, 7153, 8769, 5100, 708, -1512, -7642, -10498, -3130, 3419, 238, 126, 591, 2282, 1981, -3957, -4028, -691, -1274, -1685, 983, 4120, 5890, 3870, 3956, 1514, -12841, -12375, -9346, -7503, -1153, -174, -2986, -933, -3551, -5681, -4818, -4705, -6332, -2797, -2460, -331, 2682, 425, 5562, 4379, 4617, 6692, 6062, 2976, 6488, 9588, 8092, -710, -2175, -1505, -1560, 507, 1336, 1942, 557, -2299, -7262, -3836, 2877, 1955, -1251, 1222, 122, -137, -6744, -6495, -750, -299, 2743, -3951, -2282, -1032, 4293, 6460, 1473, -1033, -3091, -3431, 842, 386, -4868, -9183, -11948, -9006, -4517, -1794, -10213, -11158, -6047, -7833, -6550, -1175, -21, -2896, -8786, -5188, -4877, -7447, -8941]
3372h941P231Q753M92q284m421N877K157k803J553O239j085L794l169l855n913
3357b375j217J788q30L329K815j391L286L832N394n914j685l89m008n794m711
3342g870j388J173P37j205L905j039K341r667j046Q988M181K236M01N2r7n745
3326d043K030q312j309P486Q241m756l17n86N77r070r632m137J421M700P158L598
3310f951l462J161O50J156o835M872K841L06J507J113J692j40L854M350Q909L291
3294A8314K60l303p688o709q879k19Q139Q95j21J326l741n297M319O147J49j06
3278C486L133o806J012J361K683K861l314l884k794K021M162k188k118J863P04
3263B182l954j070l297k018L949N291O253j526o858P31N589k318m557q42n69J589
$$ y = [-8941, -1710, 7043, 7535, -749, -5170, 707, 2864, 61, 1614, 7853, 6768, 10562, 7393, 3538, -2375, -3592, -1804, -2634, 695, 3510, 2119, 5405, 9237, 14631, 8717, 7032, 6643, 2635, -3159, -7870, -9258, -8085, -7348, -8553, -4648, -5687, -3346, -13013, -14059, -5071, -890, 1346, 1747, 1799, 1702, -4043, -2013, -10325, -11634, -4148, 4093, -663, -980, -1566, -989, -10059, -19691, -23828, -22407, -17707, -10549, -6951, -10413, -9252, -8602, -7446, -14281, -9409, -6568, -6262, -4755, -3642, -1950, -2090, 1764, 6114, 15023, 18314, 18574, 15271, 7583, 874, -8005, -8224, -85, 810, 689, 2015, -1726, -7023, -2704, 3443, 3592, 3486, 6619, -187, 825, 2186, 4869, 7730, 4416, 532, -2262, -241, 3921, 1733, -385, 1478, 2182, -1772, -2842, -6139, -8157, -4208, 1083, 7336, 5810, -1048, -317, 5272, 2954, -1603, -2445, -3014, -1425]
3247a425M635o187Q797O21l538l11j181l484o152j427N749K741N419J197J74m720
3231I08o852m941O149P734m594R84j373J570L38j055k736n493J331k222K553K919
3215d780l047n14O01K575K440O122j28j976N37o162L339J249q745j529M8J183
3199h787J186o19M59J329L137O838j236r626M082L816m693l93l245J318J909q96
3183e421R26l512M541O982L737k790j15p626k884O17j84n484K06N406j339p87
3167g727J186o390K961K505L325L334q48L7N68K264N772m045J16O202l640J95
3151E815r44L245K750m492m070l243j772K727l680k394n00P108N38l27O7O449
3135G277P99n778k491l03o860k661n582j694K537N687j580n617m915m58J5246
$$ y = [-1425, 3210, -2977, 5820, 6441, 2903, 2592, 1411, -2073, -8225, -9652, -3903, -1162, 4257, 5454, 5628, 908, -5944, -10885, -4736, 2998, -1596, -612, -1985, -415, -77, -1132, -3868, -9361, -8030, -10252, -7699, -4780, -7827, -8341, -7740, -5165, -2725, 3397, 3269, 1293, 1830, -4332, -993, 256, -8489, -10018, -9970, -8787, -7601, -8220, -7761, -6432, -3295, 3543, 2307, -7319, -3237, 579, -4114, -4507, -7752, -6434, -4525, -5421, -4495, -8007, -3466, 3516, 7253, 4463, 4348, -3278, -6162, -5545, -5729, -11213, -11007, -5601, -6940, -7727, -6541, -12931, -9970, -7465, -4140, -806, -1654, -1617, -1049, 1215, 6987, 2942, 3058, 9260, 5620, 5815, 4871, 8116, 10866, 6374, 2304, -939, -2711, 16, -3664, -6058, -6558, 550, 1088, 761, 828, 7277, 8076, 2298, -193, -496, -7356, -10017, -15599, -17293, -14756, -9069, -10649, -16266, -21181, -21639, -6393]
3120f393J1773m2L063J111m695Q47j110m244n159l343J691N211L924O372L115
3105A2121n182Q21O62n756m797L480J351K893J068J835l687j79j981l656L431
3090B424O16q44k93k387n021L313L968M10N071m174j600K148k536o150L72O518
3074A835L289m786j0520q92N363N978R34R70L600K157k922k463k368m442m289
3059h556L112P21M175K035n230K124m772l328j817L373r75k245M010o043L656
3044i760N033L083J0256K951j746l37k310k208j582K022l156n451K05l035N018
3029a017O30m854J606K562l373K927K170l838J08j259j859Q402J817q742l941
3014h661K167P684K130j388l568l039M479L530P845l049l839m134M731O695j676
$$ y = [-6393, 5380, 5338, 8401, 9512, 4817, 5664, 4554, 310, -4849, -8192, -6501, -1290, 2634, 9006, 12121, 6939, 7760, 8422, 2666, -2131, 1349, 2700, 5593, 6661, 8496, 4809, 4630, 2649, -1007, 2424, 3040, 2196, 1903, -484, -5505, -2192, 1776, 2186, 7257, 3083, 1483, 3631, 1095, -5055, -4683, 1835, 5124, 338, -10182, -11074, -5711, 267, 1201, 2171, 5771, 7928, 5006, 2543, 175, -4267, -8556, -5444, -4723, -548, 1487, -3743, -1619, -6391, -9719, -11536, -8163, -9138, -11383, -7373, -13416, -9760, -4727, -1644, 8612, 11563, 9817, 9480, 7170, 4962, 3380, 5402, 2246, -3205, -3000, -6035, -1017, -387, -5241, -3635, -1073, -4446, -1519, 651, -3187, -3079, -4338, -6197, 2205, 4022, -4720, -8661, -6494, 1190, 3320, 1932, -1636, -4675, -196, 3334, 11179, 8130, 4291, 157, 4888, 11583, 9907]
2999I907k262l82R99J591m634n379J900N923p70j3877J598M171n672M701Q817
2984F631k795m157L97K532n905o130m056k320M282Q505K190R99j518M064N00o296
2968c077l931P096j567M597L073M207J248p758n692L114O139j0159k694N156p0
2953c18p35J940n657m011J487M771J0211K993J281J233r12j1843j618j391M611
2938B042N342j87l532m750K546j227K226M28m910n088k491k943R011P891Q42j004
2922D196R88J463r347l695L842M406k640k904K887m5l514J149J854J154j83M461
2906D072j553K983l428o647L12N095m027O912J106k297q119m893K427R064l04
2891G03l335m402n902j0090Q714P408l649j795O062j623N798K080m464l454J110
$$ y = [9907, 7645, 7263, 8262, 9853, 5219, -160, 1740, 7663, 6893, -6984, -5386, -1215, -6887, -2186, 6631, 3836, -321, 76, 2608, -3297, -9427, -13483, -15803, -11521, -3016, -826, 173, -1345, 2719, 3219, -3077, -7008, 88, -1479, 3118, 6191, 10398, 11646, 3888, -1804, 1310, 7449, -2710, -5404, -248, -318, -1053, 887, -4770, -8781, -7294, -2523, 7688, 10681, 11962, 13195, 12283, 440, -1178, -2569, 2042, 7384, 7197, 3665, -1085, 1461, 234, 2460, 2888, -2022, -7110, -9601, -12544, -3533, 4358, 5200, 4196, 5184, 6647, -2700, -6395, -2553, 1853, -787, -3691, -804, -849, -4363, -3214, -1360, -206, -389, 4072, 2519, 5502, 2074, -4573, -4261, 834, -3193, 3719, 4825, 2528, -5591, -10484, -8057, 1007, 703, -2632, -7034, -12936, -23026, -14312, -6904, -10553, -12348, -6286, -7909, -2111, -31, -4495, -7949, -6839]
2876f839M274P647l363K123K971j491m915o167L021m11m770m09J21O61P157K823
2860B433K733j135l929r10n05l210m940k610M954K918K343p59j503Q249m604o387
2844f862l611K857m421j790oM6J865L576m203O383Q736L021K175n526n216J156
2828a820n853J556J0552j538m729K357K488O31q754L048K195N678L563o727n399
2813b752M320M947k443m782j526k905J675o2J190L901j581M466M125m212N191
2798I552M457K055N85n064j088l246l627j868J581L043Q20l601k615N100j660
2783D424q015o027J23K896k494L052L483L441K606n555N85J0780M868m204p068
2768B895O062L271p577o590j730K751r23q82K345K497o708j369n341P710L441
$$ y = [-6839, -2565, 5082, 1719, 3842, 6813, 5322, 407, -5760, -2739, -3150, -7920, -8329, -8208, -7547, -390, 2433, 5166, 4031, 102, -808, -1313, -4523, -9463, -12073, -7119, -4201, -1858, -2617, -4120, 4129, -475, -6862, -10473, -7616, -12037, -13827, -13833, -13787, -11922, -8346, -12549, -6166, 2570, 5591, 7766, 2240, -2976, -1820, -7673, -6117, 4435, 2897, -1832, 525, 3013, 3644, -5110, -2062, 133, 5811, 9374, 2647, -2752, 1568, 6515, 4072, -710, -2236, -5141, -3466, -3528, -2338, 1563, -18, 4448, 8573, 4361, 9552, 14009, 16064, 16649, 11585, 10497, 7251, 3624, 1756, 3337, 6380, 7200, 3599, 984, 6084, 4424, -3591, -9618, -9495, -6599, -9093, -6041, -2558, 883, 3489, -2066, -1481, 9299, 14167, 9963, 2895, 8957, 12228, 4651, -1939, -3669, -918, -1841, -2723, -378, 2119, -4589, -5958, -11299, -3589, -148]
2753a48m283P777M569m911j362J429O558p81K21k069l778l1k062m669q014l189
2737a4743M004J27L265J534j511M99O265J0354j063o506l245N799Q803K199o403
2722I378q450k483K311n812o56O990l276K838m616r436O736O050R52j123L544
2707B947P082l341r725n744O377l212m68J1168M946J016n671J700j388k64L994
2692I417J167L410M300j042m295p38p492l092Q254R77k684l689L368j499p292
2677i30r75k734j163N203K151p76m760J277L287o57J894J890J494J788n34r07
2661E548l980m533J220P754J778l256Q43R410J489j0957k174J15J172n04m67N087
2645H545M149M465K4p245q301M382M812j421N231L11m792J005m045k556J350N242
$$ y = [-148, -4431, 3346, 7915, 3004, 1642, 3071, 9629, 8848, 9069, 7000, 3222, 3191, 1129, -3540, -11554, -14743, -10739, -10612, -7347, -5813, -7324, -6825, -560, 9794, 8731, 2225, -1020, 4779, 13582, 15781, 9378, 928, -1555, 756, -5056, -5712, 1278, -1998, 840, -3776, -13212, -6476, -426, 526, -597, 2947, 10029, 6688, -3037, -8781, -2404, -5616, -6084, 5084, 10030, 11046, 5375, 7075, 5687, 5423, 9417, 10584, 13994, 18294, 17252, 12957, 12219, 4727, 1635, 9889, 10866, 8182, 4493, 7861, 6362, -930, -1905, -4639, -5802, -599, 1552, 776, -3984, -2707, 580, -77, 1817, 3707, 5201, 6989, 6455, 5548, 1568, -2965, -1745, 6009, 7787, 4531, 5374, 14784, 16273, 5316, 3142, 3257, 4429, 3925, 3458, 8545, 12694, 17159, 17183, 9938, 1637, 6019, 10831, 9410, 14641, 14952, 10160, 11165, 7120, 4564, 5914, 11156]
2629A1156P67n157j764j587k311N349k555o91M329l887q404o794j0696M914J0382
2614f949Q788k409j0048O83N313R59m82J730N29m246l551L412N990l167r04N938
2598A586l025K371L094n753m051P079L656p812k321M462o971n353L059K734L410
2583c835P961m997J528j961J282l31j761J855j220P904N556N822l797l091r44
2568I971n458L806N055P808M517p681j1597j700q793n537k797K951K493K649L314
2553i99P666k15k716l955R94j186J359K292L160M379N306m483q680k159j8k662
2537a917k230l913l115N423m19m205N10O816J3173N812p451m614j682k982n590
2522f384k637L143J379o55J369m009k538L959J385M53O207l091o82K592K559L828
$$ y = [11156, 11923, 6766, 5002, 3415, 1104, 6453, 3898, 3207, 7536, 3649, -4755, -11549, -22245, -17331, -6949, 1839, -570, -10618, -9935, -4622, -3663, -4145, -2415, -1886, -6132, -9683, -6271, -281, -3448, -4352, 1586, -1439, 932, 4026, -1727, -5778, 1301, 4957, -2855, -5176, -714, -7685, -13038, -9979, -7245, -3835, 4126, -871, 657, -1304, -22, -353, -2114, -259, -1479, 6425, 11981, 17803, 14006, 10915, 9971, 4513, 8319, 13374, 21182, 25699, 18018, 6421, 4721, -4072, -9609, -12406, -9455, -6962, -4313, -999, 6667, 6452, 3736, -219, 775, -411, 948, 3240, 6400, 10779, 16085, 11602, 2922, 763, 745, -1917, -4147, -8060, -11175, -5752, -6171, -10376, -9866, -3050, 10123, 15935, 8484, 3870, 2188, -794, -6384, -9021, -5878, -4499, -5154, -3785, -7794, -10332, -6373, -4988, -4535, 1672, -1419, -2101, 491, 3050, 6878]
2506F878L359l366q056j689j903J314L884J173o887j822P11O508P660J1222j937
2491A7049m067P56m858M771l30q796l662Q193k989p813k16r41N808K896n294M013
2475D520O683J342p739m896j119J627K662N769k753j738k523l562O217p08J584
2460E366P03l973l891m855m013K110R017m008k976L130J151N899p576p660L209
2445h367O420K784m38K209J893Q58r36k457l499j676o844k367Q598Q727K259l851
2429C313m408K301k322p49J767k206j621l700M598L495L596j896r39J431J427
2414D087l61O17P718L681r591n188J236k588j0899l269M696J817Q846O781o048
2399A535K346l620J084J749k16M10l074K521J964o198j862L655l886J579J506
$$ y = [6878, 10237, 6871, -1185, -2874, -4777, -3463, 421, 1594, -5293, -7115, -6404, 104, 7764, 18986, 17049, 12982, 13738, 8880, 13651, 13321, 4525, 863, 9056, 6067, -1746, -1962, -2903, 2905, 5801, 507, 4520, 11203, 12545, 4806, -90, -1209, 418, 3080, 8849, 6096, 4358, 1835, -1727, 4490, 3782, 5366, 6069, 2096, -1795, -6650, -10663, -8553, 464, -3544, -6520, -3390, -2239, 3660, -3916, -11576, -8367, -1947, 837, 399, 2608, 4501, 5359, 4423, 1966, -1533, -3209, -10053, -12420, -3822, 4905, 7164, 3313, -1095, 1206, -1116, -1865, -98, -2304, -3925, -7625, -3027, 468, 4064, 2168, 1229, 2660, 4087, 3726, 4343, 12061, 15742, 6151, 963, 2199, -389, -11288, -14557, -9861, -8044, 802, 7583, 1535, 3881, 261, 1345, 3094, 2878, 3288, 214, 2735, 4699, -1499, -3361, 294, -3592, -2013, -507]
2384e07K558R654m031o716q6m118j208O324M367N884O525n693J767O5j009K679
2368A6455K39j0335O57j735k215l714L48P778k30l944l158L674j358l57K901q67
2352D139m760m32J019J730j266J889k903L481K128p589n674j29j877L052K381
2337d811N744N771N585Q11j784j910k213m057L02o629O023J76m863k713K445L859
2321A736o534M585R359j186o538p954m647Q761L181j025k192K534l206l437M920
2306a643Q10l183m26M60M729J0812L423j112N030q839m590j854j157O336J339
2291A0135K532j0099l467J725K521N674l634J813o08J681J941O7p243j145l209
2276a316j973K808L314j19K941o913p926m21L852N643j105j018l768M041O507
$$ y = [-507, 2051, 11705, 7674, 958, 872, -3246, -4454, 1870, 6237, 12121, 18646, 12953, 14720, 14785, 13776, 16455, 16694, 6359, 7016, 5281, 3066, -648, -300, 7478, 7248, 3304, 146, 3820, 2462, 2105, 5006, 4139, -621, -1053, -34, 1696, 430, 2319, -584, 2897, 5025, -2564, -8238, -8367, -10244, -7192, -4811, 933, 6704, 12289, 13100, 11316, 9406, 7193, 3136, 3438, -3191, 2832, 3008, -1855, -4568, -2123, 1736, -4798, -213, 9146, 7960, 1422, -6532, -11179, -2418, 763, -262, -2454, 80, -3126, -6563, -1643, -833, -4016, -4442, -3982, 747, 11559, 14982, 13870, 18900, 10061, 5471, 3617, 2460, 8796, 10135, 12667, 2568, -899, 826, 3347, 9021, 5387, 7200, 6592, 8273, 10214, 10281, 3038, 1893, -1316, -3289, -481, 2833, 2714, 5655, -1258, -9184, -9605, -5753, -110, -1215, -2233, -6001, -1960, 4547]
2261D547P69o927n272Q38J9j957L730Q67r19L304p51l518j094p24j230L509r41
2244e750l826j917P608j635n260j051J0569M271l000j531l108R17K965L359P16
2229C327l905j181m51L659k198Q60j1155j136O964N198O562J001n943q140Q941
2214B403M080L348p70l220K281L40m235m679r15n188k661N409o02L413p88O108
2198D324k12j702k973J598L87j21N754K859p187k216n50J290O691n508J00m683
2182b149j745J951o41P249N273p778p360k171M580J464j418j683L989j638n441
2167g518Q843N837l531r702j066Q178K687j0323l096L014K860L061M119R40R28
2152E231k216m755J376M347j663l010M193N504K561k45j3036k201K841L625L66
$$ y = [4547, 5316, -1611, -6883, -6045, -6026, -7983, -4253, -3386, -4305, -1001, -1752, -5270, -6364, -7088, -8318, -4809, -5750, -9576, -11493, -3885, -5520, -10780, -11831, -1262, 3009, 9, -1522, -4630, -3713, -748, 2611, 3327, -578, -1759, -2210, 1449, -749, 111, -11044, -12180, -5216, -18, 6544, 7545, 1602, -6538, 2403, 6483, 9831, 9061, 5841, 8122, 8462, 4227, -452, -1367, -6555, -9216, -3807, -4409, -996, -1784, 4324, 4112, 2410, -563, 1035, 1422, 1301, 7055, 9914, 2727, 511, -39, 1251, 7942, 2434, 2534, -2149, -3894, -1943, -2584, 4665, 9938, 2160, -5200, -7371, -2791, -1327, -2745, -4428, -439, -2077, -7518, 1325, 7162, 3631, -6071, -7137, 1041, 3728, -6595, -9691, -6677, -3817, -756, 3363, 4303, 5231, 3015, -1740, -364, 3983, 2320, -690, 3503, 9007, 11568, 11323, -1713, -3914, -1073, 2552, 2918]
2137B918J234K587j968K788j906j341J44Q709K682m971q620k549j709M99l00j424
2121c227j88J331K167m698L777R82l49K016L404K570k494j585m847J374L15l799
2105c251m033j258J124M897n18M405J339o789m064J553M161p31o87J544j613j64
2089d085M76M689P374O083n168p968k770M005k884n283j219k986j580K998M453
2074c865P870M742l925j753n133o839J401K071m044J555J604j214O53J0550J573
2059E246m961o937l858M973N683j490L817L681o767n808L860J327J585K765J0091
2044A3207j29o329J550O534r64r313q010K684K972J164m35j366k825l979L569
2029a670k429m73K274R36m485K957L852j373K146L677j428m920m90k749k406J141
$$ y = [2918, 4152, 6739, 4771, 7559, 5653, 4312, 4456, 13165, 15847, 10876, 2256, -293, -2002, -1503, -1803, -3227, -3415, -2084, 83, -4615, -838, 144, -205, 1811, 5215, 7785, 5291, 3706, -1141, 233, 548, -3251, -7284, -8542, -7418, -2521, -3039, 1366, 2705, -4084, -8148, -6595, -2434, -3165, -3852, -2308, -3921, -4085, -3609, 1080, 8454, 14537, 9369, 1401, -1369, 2636, -248, -5531, -6750, -9736, -11316, -8318, -3865, 4005, 8747, 4822, 3069, -2064, -8903, -7502, -5431, -9475, -7920, -6316, -7530, -6877, 3673, 5246, 285, -6652, -10510, -5537, 146, -1344, 2473, 6154, -613, -6421, -2561, -1234, 351, 3116, 13207, 13078, 6749, 8299, 14833, 13869, 4556, -3454, -770, 2202, 3366, 2931, 1565, -1260, -5239, -1670, -4099, -4572, -2298, -1362, -5847, -2890, 962, -411, 1735, 5412, 3984, -936, -1426, -4175, -6581, -5440]
2013e440n195l313L810l43k05N10M792N085L222r08N596k928k446K028l32k876
1997A057L172O30p217m77p39m804M720N025J132N019k560J019n13k000j03L324
1981F685q206l292m650K024M091L914O248L994k499q929j973q198k617M209N163
1966d036l547j752L089J762K328R944Q536q395o846p489k073L153O82L828Q44
1951B8j476j574K33K599O04R41j513J194J101J080J54l740N25j700j650m791n163
1934a3148L493L927P16k481K328O647J286n496J957k186O056j502O33L449J895
1919G574R52R54o887l312K0N083j718k038l77K681K569j288O504m510n626p054
$$ y = [-5440, -10635, -13948, -10138, -10481, -10686, -10176, -5384, -299, 2923, 2015, 7611, 4683, 2237, 4265, 3933, 1057, 4229, 4859, -2358, -2835, -3574, -8378, -3658, 1367, 2499, 7518, 4958, 5977, 5464, 3464, 3361, 6685, -1521, -4813, -9463, -7439, -3348, 566, 6814, 10808, 8309, -620, -2593, -10791, -13408, -9199, -4036, -7583, -9335, -6246, -4484, -2156, 7788, 16324, 7929, 1083, -6406, -8479, -5326, -4644, -816, 28, -1448, -3022, -2789, -190, 414, 1355, -158, 1036, 2137, 3217, 3371, -369, 156, -1544, -3194, -7985, -13148, -9655, -5728, -5012, -7493, -5165, 1482, 2768, -2728, -771, -2957, 3099, 1597, 2230, 5679, 7574, 8526, 9480, 2593, -719, -699, 4384, 2666, 628, 251, 2932, 5501, 4213, 10717, 6207, 581, -6473]
$$ [...]
##END NTUPLES=NMR SPECTRUM
##END=
