##TITLE=Analysis number 328007
Compound Code cc 02112
Book Reference a
Project Code adrs
Chemist Name stores
##JCAMPDX= 6.0         $$ Bruker NMR JCAMP-DX V2.0
##DATA TYPE= NMR SPECTRUM
##DATA CLASS= NTUPLES
##ORIGIN= Bruker BioSpin GmbH
##OWNER= nmr
$$ XWIN-NMR		Version 3.5
$$ Wed Apr 25 10:03:28 2007 GMT Daylight Time (UT+1h)  MAYBRIDGE\nmr@NMR_250MHZ
##.OBSERVE FREQUENCY= 250.131544655141
##.OBSERVE NUCLEUS= ^1H
##.ACQUISITION MODE= SIMULTANEOUS (DQD)
##.ACQUISITION SCHEME= undefined
##.AVERAGES= 16
##.DIGITISER RES= 18
##SPECTROMETER/DATA SYSTEM= dpx250
##.PULSE SEQUENCE= zg30
##.SOLVENT NAME= DMSO
##.SHIFT REFERENCE= (INTERNAL, DMSO, 0, 16.522)
##AUDIT TRAIL= $$ (NUMBER, WHEN, WHO, WHERE, WHAT)
$$ ##TITLE= Audit trail, XWIN-NMR		Version 3.5
$$ ##JCAMPDX= 5.01
$$ ##ORIGIN= Bruker BioSpin GmbH
$$ ##OWNER= nmr
$$ C:\u/data/dgb/nmr/ADRS/3030/pdata/1/auditp.txt
$$ ##AUDIT TRAIL=  $$ (NUMBER, WHEN, WHO, WHERE, WHAT)
(   1,<2007-04-25 10:03:02.04 +100>,<MAYBRIDGE\nmr>,<NMR_250MHZ>,
      <created by zg, POWCHK disabled, PULCHK disabled
       configuration hash MD5:
       76 6E 9A 78 1E 09 19 81 EC 84 63 8F B0 6A 59 2D
       data hash MD5: 64K
       6D DE 47 47 6F E9 88 79 6B 8C 43 87 15 81 2E 50>)
(   2,<2007-04-25 10:03:17.42 +100>,<MAYBRIDGE\nmr>,<NMR_250MHZ>,
      <Start of raw data processing
       ef LB = 0.3 FT_mod = 6 PKNL = 1 SI = 32K 
       data hash MD5: 32K
       DB F5 C5 FF E3 C8 02 67 A6 FD 47 4C 3D 3C 5B 81>)
(   3,<2007-04-25 10:03:19.21 +100>,<MAYBRIDGE\nmr>,<NMR_250MHZ>,
      <apk 
       data hash MD5: 32K
       41 AB 08 2D 41 C6 1D 04 AC 1A 9C A3 FA CA 9E 89>)
(   4,<2007-04-25 10:03:20.04 +100>,<MAYBRIDGE\nmr>,<NMR_250MHZ>,
      <abs ABSG = 5 
       data hash MD5: 32K
       39 CD ED 8F 75 1D 21 B3 23 95 29 39 57 58 37 98>)
$$ ##END=
$$ 
$$ hash MD5
$$ 93 B8 8A 2F A2 5C 84 BB 1A 3E E8 E3 FB 95 26 EB
##$RELAX= 
##$RELAX= 
##$RELAX= 
##$RELAX= 
##$RELAX= 
##$RELAX= 
##$RELAX= 
$$ Bruker specific parameters
$$ --------------------------
##$DU= <C:\u>
##$EXPNO= 3030
##$NAME= <ADRS>
##$PROCNO= 1
##$TYPE= <nmr>
##$USER= <dgb>
##$AMP= (0..31)
100 100 100 100 100 100 100 100 100 100 100 100 100 100 100 100 100 100 
100 100 100 100 100 100 100 100 100 100 100 100 100 100 
##$AQSEQ= 0
##$AQ_mod= 3
##$AUNM= <au_zg>
##$AUTOPOS= <4 >
##$BF1= 250.13
##$BF2= 250.13
##$BF3= 250.13
##$BF4= 250.13
##$BF5= 500.13
##$BF6= 500.13
##$BF7= 500.13
##$BF8= 500.13
##$BYTORDA= 1
##$CFDGTYP= 0
##$CFRGTYP= 5
##$CHEMSTR= <none>
##$CNST= (0..31)
1 1 145 1 1 1 1 1 1 1 1 1 1 1 1 1 1 1 1 1 1 1 1 1 1 1 1 1 1 1 1 1 
##$CPDPRG= <>
##$CPDPRG1= <>
##$CPDPRG2= <>
##$CPDPRG3= <>
##$CPDPRG4= <mlev>
##$CPDPRG5= <mlev>
##$CPDPRG6= <mlev>
##$CPDPRG7= <mlev>
##$CPDPRG8= <mlev>
##$CPDPRGB= <>
##$CPDPRGT= <>
##$D= (0..31)
0 1 0 0 0 0 0 0 0 0.06 0 0 0 0 0 0 0.0002 0 0 0 0 0 0 0 0 0 0 0 0 0 0 
0 
##$DATE= 1177491780
##$DBL= (0..7)
120 120 120 120 120 120 120 120 
##$DBP= (0..7)
150 150 150 150 150 150 150 150 
##$DBP07= 0
##$DBPNAM0= <>
##$DBPNAM1= <>
$$ [...]
##$SUBNAM7= <"">
##$SUBNAM8= <"">
##$SUBNAM9= <"">
##$SW= 20.6930455092707
##$SWIBOX= (0..15)
0 0 3 0 0 0 0 0 0 0 0 0 0 0 0 0 
##$SW_h= 5175.983436853
##$TD= 65536
##$TD0= 1
##$TE= 683.16
##$TE2= 300
##$TE3= 300
##$TEG= 300
##$TL= (0..7)
0 120 120 120 120 120 120 120 
##$TP= (0..7)
150 150 150 150 150 150 150 150 
##$TP07= 0
##$TPNAME0= <>
##$TPNAME1= <>
##$TPNAME2= <>
##$TPNAME3= <>
##$TPNAME4= <>
##$TPNAME5= <>
##$TPNAME6= <>
##$TPNAME7= <>
##$TPOAL= (0..7)
0.5 0.5 0.5 0.5 0.5 0.5 0.5 0.5 
##$TPOFFS= (0..7)
0 0 0 0 0 0 0 0 
##$TUNHIN= 0
##$TUNHOUT= 0
##$TUNXOUT= 0
##$USERA1= <user>
##$USERA2= <user>
##$USERA3= <user>
##$USERA4= <user>
##$USERA5= <user>
##$V9= 5
##$VALIST= <valist>
##$VCLIST= <CCCCCCCCCCCCCCC>
##$VD= 0
##$VDLIST= <DDDDDDDDDDDDDDD>
##$VPLIST= <PPPPPPPPPPPPPPP>
##$VTLIST= <TTTTTTTTTTTTTTT>
##$WBST= 1024
##$WBSW= 4
##$XGAIN= (0..3)
0 0 0 0 
##$XL= 0
##$YL= 0
##$YMAX_a= 315130
##$YMIN_a= -222595
##$ZGOPTNS= <>
##$ZL1= 120
##$ZL2= 120
##$ZL3= 120
##$ZL4= 120
##$ABSF1= 16.522
##$ABSF2= -4.171173
##$ABSG= 5
##$ABSL= 3
##$ALPHA= 0
##$AQORDER= 0
##$ASSFAC= 0
##$ASSFACI= 0
##$ASSFACX= 0
##$ASSWID= 0
##$AUNMP= <proc_1d>
##$AZFE= 0.1
##$AZFW= 0.1
##$BCFW= 0
##$BC_mod= 0
##$BYTORDP= 0
##$COROFFS= 0
##$CY= 12.5
##$DATMOD= 1
##$DC= 0
##$DFILT= <>
##$DTYPP= 0
##$F1P= 14.0000005364418
##$F2P= -0.99999901652339
##$FCOR= 0.5
##$FTSIZE= 32768
##$FT_mod= 6
##$GAMMA= 0
##$GB= 0
##$INTBC= 1
##$INTSCL= 1
##$ISEN= 128
##$LB= 0.3
##$LEV0= 0
##$LPBIN= 0
##$MAXI= 10000
##$MC2= 0
##$MEAN= 0
##$ME_mod= 0
##$MI= 0
##$NCOEF= 0
##$NC_proc= -5
##$NLEV= 6
##$NOISF1= 0
##$NOISF2= 0
##$NSP= 0
##$NTH_PI= 0
##$NZP= 0
##$OFFSET= 16.522
##$PC= 1
##$PHC0= -65.26583
##$PHC1= 11.93262
##$PH_mod= 1
##$PKNL= yes
##$PPARMOD= 0
##$PSCAL= 4
##$PSIGN= 0
##$REVERSE= no
##$SF= 250.13
##$SI= 32768
##$SIGF1= 0
##$SIGF2= 0
##$SINO= 400
##$SIOLD= 32768
##$SREGLST= <1H.DMSO>
##$SSB= 0
##$STSI= 32768
##$STSR= 0
##$SW_p= 5175.98343685301
##$SYMM= 0
##$S_DEV= 0
##$TDeff= 65536
##$TDoff= 0
##$TI= <Analysis number 999999
Compound Code 99
Book Reference 9
Project Code 9>
##$TILT= no
##$TM1= 0
##$TM2= 0
##$TOPLEV= 0
##$USERP1= <user>
##$USERP2= <user>
##$USERP3= <user>
##$USERP4= <user>
##$USERP5= <user>
##$WDW= 1
##$XDIM= 32768
##$YMAX_p= 444952278
##$YMIN_p= -491300
$$ End of Bruker specific parameters
$$ ---------------------------------
##NTUPLES= NMR SPECTRUM
##VAR_NAME=  FREQUENCY,     SPECTRUM/REAL,   SPECTRUM/IMAG
##SYMBOL=    X,             R,               I
##VAR_TYPE=  INDEPENDENT,   DEPENDENT,       DEPENDENT
##VAR_FORM=  AFFN,          ASDF,            ASDF
##VAR_DIM=   32768,         32768,           32768
##UNITS=     HZ,            ARBITRARY UNITS, ARBITRARY UNITS
##FACTOR=    0.157963299565203, 1,           1
##FIRST=     4132.6476996994, 0,             0
##LAST=      -1043.33573715361, 0,           0
##MIN=       -1043.33573715361, -491300,     0
##MAX=       4132.6476996994, 444952278,     0
$$ Real data points
##PAGE= N=1
##DATA TABLE= (X++(R..R)), XYDATA
$$ [...]
23982D4584r7845L6568M7605O8439n8125K9845R921Q968K5787l7500N894o4632
23970A9509m0290R3103N4820p1926j83865r1210K2782J59788L6078j5199O8398
23959E1988J72030m3428j33834m2278m883M5267j61414q3438N9130L1591J9808
23948h9461j3807o6203m2362M5063J66257J10611P920J0955m5490p6611j7843
23937a0971L5645k6587j15106l3715J754N8065n6307N1480J13771J34711l3222
23926A19518j13030l4808J16060L2749m1410p5091K6965k6039k6286q8573j03472
23915b13417O135N7901R8519R1152M4780R9147K121r3269r9236j4205k7530l2362
23903h0264L167J10004P3915q9376j1011O5158r2541L844P7505m1199N408l1394
$$ y = [44584, -53261, -16693, 30912, 99351, 41226, 71071, 80992, 89960, 115747, 78247, 84141, 19509, -20781, 72322, 127142, 55216, -128649, -219859, -197077, -37289, -1211, -16410, 51988, 224018, 180590, 46756, 4478, -405, 44862, -116552, -199990, -140860, -109269, -89461, -103268, -169471, -211833, -166770, -513, 110098, 118018, 128973, 83483, 6872, -10971, 24674, -1913, -117019, -150734, -148980, -90915, -147222, -95742, 18029, 152740, 119518, 6488, -28320, 87740, 120489, 79079, 3988, 30953, 4914, -21372, -109945, -213417, -207282, -149381, -50862, 40290, 85070, 184217, 186338, 93069, -6167, -20372, -47902, -80264, -77097, 32907, 106822, 17446, 6435, 71593, -20948, -17104, 60401, 19202, 24610, -6784]
23891f784m242l1119P6127n2154o5315p7539K5953K8484O7450P8581k0576n5352
23879c6486J9894J00430l8594r8313l1741J3081J45524J29718J7450p1393j8202
23868A31368k6051n8421j20894j11744O9329N0642p9147m5579m7467o8654P6542
23857b30076J22326P6107k8198K468m7806k131r3126K0844J54042j2490O9659
23846C1619Q9192O8287j8501j38084j63089J3957J63789j1516j3850J18713P8277
23835B18794J3497j26012j25231N0533r0661J15393o448l2735j7082k532J00682
23824I8198m3924j0337J6956j44422l1585R8543R6132P3050K1156q6984j7378
23813F9405l6491m8621m9677P2459N8687j02580N397M1857J52911P7406j73559
$$ y = [-6784, -11026, -42145, 33982, -18172, -83487, -161026, -135073, -106589, -39139, 39442, 18866, -36486, -16592, 83838, 45244, -53069, -84810, -71729, 73795, 203513, 220963, 149570, 131368, 105317, 46896, -73998, -185742, -116413, -65771, -144918, -190497, -237964, -306618, -230076, -107750, -31643, -59841, -57373, -105179, -107310, -200436, -179592, -25550, -38040, 31619, 120811, 189098, 170597, 32513, -130576, -116619, 47170, 35654, 21804, 140517, 218794, 232291, 106279, -18952, 31581, -59080, 56313, 49865, 17130, 48, -2484, 98198, 54274, 43937, 60893, -83529, -115114, -16571, 79561, 152611, 173767, 86783, 69405, 32914, -15707, -65384, 7075, 65762, -36818, -31421, 10436, 163347, 240753, 67194]
23802F7194p4046J2359Q7754q2585k8859j8923j2588J979r3568L2872L9785P9013
23790A0387L4140j8957k0893L8529m881M9053P205j33052r6365j40M7027k9573
23778a17520J3119J12300J14628M4371k1027q5463P2770K2988j02346K9813q967
23767G4666j06706j05113q752Q112J00090L1718L0273j09060k3103K9872j9224
23756i7227r0682j4193J18628N9905L7978o734l7958j8190O7941K6399l3551q4029
23744g1713K0229K5007N5115O018n9708q6500k7150J52351Q6776o0419k9143M3396
23732E4259N4574j771P879O1467K161m7571k3985n5878j04631m7876K3371m7910
23720a25911N6391Q8813K2878j7062n574K4455l516m0646j04816q7841M990N6380
$$ y = [67194, -6852, 5507, 93261, 10676, -18183, -37106, -49694, -47715, -141283, -108411, -68626, 10387, 44527, 25570, 4677, 43206, 38325, 87378, 94583, -38469, -134834, -134974, -87947, -117520, -104401, 7899, 122527, 166898, 145871, 60408, 133178, 156166, 53820, 83633, 74666, -32040, -137153, -145905, -137793, -37703, -5985, 24288, -84772, -107875, -78003, -97227, -187909, -202102, -83474, -23569, 14409, 7675, -30283, -48473, 19468, 45867, 12316, -71713, -51484, -26477, 28638, 34656, -25052, -111552, -138702, 13649, 100425, 40006, 10863, 54259, 108833, 107062, 114941, 176408, 178569, 130998, 107013, 51135, -53496, -101372, -78001, -125911, -69520, 19293, 42171, 25109, 19535, 43990, 40474, -172, -104988, -192829, -187839, -131459]
23708a31459N3307R8096R3876j21694j16769R6161J06456p1806j22538J34069
23698A7699N8308j98073J6808J42947q39l0462J5358l3123J16747j19463N5342
23687D1249J50364j86927o4909L5218M5947l0177R535L1473L6635R5337j9379
23676A44366n3784p7279l0632O5447J4633p3928J4418K0944N4396n8536L1932
23665E1977K2213m9298J9109k7521K2334o0051J7921L4257p023P5186K5739m3033
23653H1810n3705r8448N5548J31204R031p1295r6744J26310k170j3180L727l6391
23641C5697Q5972n806O941j6850n6413n4141p177M0497J0597O4270o4041q2902
23629d3356L485l9986R7213N0454n4706o4108j19800L6000m6691J1240j8739M595
$$ y = [-131459, -78152, 19944, 113820, -7874, -124643, -28482, 77974, 6168, -116370, 17699, 76007, -122066, -105258, 37689, 36850, 6388, 21746, -11377, 105370, -14093, 41249, 191613, 4686, -60223, -25005, 20942, -9235, 300, 31773, 68408, 163745, 144366, 90582, 13303, -17329, 48118, 62751, -11177, 3241, 24185, 78581, 20045, 51977, 74190, 24892, 44001, 16480, 38814, -21237, -3316, 30941, 23918, 99104, 124843, 81810, 28105, -70343, -14795, 116409, 125440, 54145, -42599, 83711, 81541, 68361, 72088, 35697, 121669, 115863, 122804, 105954, 49541, -4600, -11777, 28720, 39317, 103587, 39546, -43356, -39871, -79857, 17356, 67810, 13104, -51004, -170804, -134804, -181495, -170255, -188994, -184399]
23617a84399J00598j7681J0642J06448M8650j40886j07590M4039J25442l3166
23607d7903K5385r1877J5246N5851p2059J5865M7432r4762O4764J85878O2627
23596A66447j35872J6450j9114K5266k9753J4981L6126m165k9212l4149n0160
23585d3155l8202j03666M5608j16121j09072J58644K12976R1909m4183q348P6689
23574A23079J20931k555o9409j5689j13871N3687J1479n6973p0157p5950J42997
23563D7569K1936l851j4404j599k7123N7883r0436j53513N9735J38777J22145
23552A57119k7499m5219k9713P9013N242l764p445k221j035J8072p4989K4419
23540I1980N2191j0452L1701R4526P9251k33728r620J0532l2050L8010q8995j42548
$$ y = [-184399, -83801, -101482, -90840, 15608, 64258, -76628, -184218, -140179, -14737, -47903, -22518, -114395, -99149, -43298, -115357, -99492, -52060, -146822, -82058, 103820, 166447, 30575, 47025, 27911, 53177, 23424, 38405, 74531, 70366, 41154, 7005, -43155, -81357, -185023, -139415, -255536, -364608, -205964, 7012, 98921, 54738, 46390, 123079, 244010, 241455, 172046, 156357, 42486, 96173, 107652, 50679, -19478, -95428, 47569, 69505, 65654, 51250, 49651, 22528, 80411, -10025, -163538, -103803, 34974, 157119, 129620, 84401, 54688, 133701, 138943, 135179, 127734, 125513, 124478, 142550, 67561, 91980, 144171, 133719, 165420, 259946, 339197, 105469, 95849, 106381, 74331, 112341, 23346, -119202]
23528a19202J40761L9296o4962r897j40040m0043P7276Q2443k58l0868q028j6466
23516h9988m0577J5824M2660r0678k2981N9504O7519K796K1907n1577J11301M2737
23504F8447p8052j06190m6816j7907L7481O4096O3111n6320L6570O7376J07204
23493A39000O2371k7511o0994n292j18544j38729P4674J5392o963N4157K5987
23482A3548j1183l2145L8454K1900P5367J5655k0786j39630N416R198p6863O4971
23470c6098O4341q6670r0719J31276k8207j56074L9600J44518j07893o1610n2116
23459b39652l3861P4682j0830M6540o4751q783J15247R3801O5416J03568l0531
23448A10846j09154l2249q933J15242k1790j96832J5661m8275J28178P7716J0997
$$ y = [-119202, 21559, 60855, -4107, -14004, -154044, -194087, -116811, -34368, -34626, -65494, -73522, -89988, -130565, -114741, -72081, -162759, -185740, -126236, -58717, -55921, -34014, -85591, 25710, 68447, -9605, -115795, -162611, -180518, -143037, -78941, -15830, -72150, -35580, 31796, 139000, 201371, 173860, 112866, 107574, -10970, -149699, -75025, -59633, -66596, -12439, 13548, 2365, -29780, 8674, 30574, 105941, 121596, 100810, -38820, -33404, -24206, -101069, -36098, 28243, -58427, -149146, -17870, -46077, -202151, -162551, -18033, -125926, -187536, -239652, -273513, -198831, -209661, -163121, -227872, -236655, -121408, -27607, 37809, 141377, 110846, 1692, -30557, -39490, 75752, 53962, -142870, -127209, -175484, -47306, 30410, 41407]
23437D1407n0013j1922j2985n2045J07416J3030N39O8778o411p0013L6370K2607
23425H6758k1985K5591p3083R054M6214M7823m2907p5211O2583k4961j64342k0679
23413a45145m4548Q1552J25518j2759L8399O8125p3432j85546j16932l3086J36388
23402a61466J50968M0421j67101J5097J08098L4737m0939k556P6657k553k05279
23391a53916r6581J42450J9860M8375R4982n5527k4358l0570k2653R9142M6966
23380F8170n4626n2615N9709j21737j48666K5923M3111J94074K1942L4390o8034
23369A641k0237M8430J6290r908N9975Q398p3661j38465L5540O6340k3470K04061
23357A74934Q5327j47962j03468p9558r0709J6363L3270P9520K6703Q550m2904
$$ y = [41407, -8606, -20528, -33513, -85558, 21858, 34888, 35427, 104205, 97794, 27781, 64151, 86758, 64773, 90364, 17281, 26335, 72549, 120372, 77465, 2254, 64837, 39876, -124466, -145145, -189693, -108141, 17377, 4618, 43017, 111142, 37710, -147836, -264768, -297854, -161466, -10498, 29923, -137178, -122081, -13983, 20754, -20185, -22741, 53916, 51363, -153916, -250497, -108047, -88187, -39812, 55170, -357, -24715, -55285, -77938, 21204, 68170, 13544, -39071, 20638, -101099, -249765, -223842, -180731, 13343, 35285, 69675, 1641, -18596, 29834, 46124, 36216, 96191, 104589, 30928, -107537, -71997, -5657, -29127, 174934, 260261, 112299, 8831, -70727, -161436, -145073, -111803, -32283, -5580, 2970, -39934]
23346c9934K8999k8612n9751N8193J68434p479K6179l1459j05147n6122n2034
23335i8733j18144n6311P8659J18522J3918j09117M1171J58659P1918q1796l6272
23324a7526O0279J8592l9359J00395n5497K4961j0772m4957l4482j62242l7305
23313a97913O7776l6427N2263P6523R5143n0691m6597l4688R807j9314K7170K4773
23301c2175k5585L9477O9339p4681j51830J47806J24905j05928p8710L1456r480
23290f5406n0518L5268O6515q8166J3888p6088p3629L8860N039K1351J5336K2325
23278a35225o2608O1636K6230K8686K00865m9291n5967l9277j0480j04210p885
23267a47526R2634R5410J838O4242L2303l5360p2924J2238N6925K7533o5451r6783
$$ y = [-39934, -10935, -39547, -99298, -41105, 127329, 119850, 146029, 114570, 9423, -46699, -98733, -216877, -273188, -194529, -76007, -62089, -171206, -130035, 28624, 100542, 18746, -17526, 42753, 61345, 21986, 122381, 66884, 91845, 81073, 36116, 1634, -160608, -197913, -130137, -166564, -114301, -37778, 57365, 6674, -39923, -74611, -64804, -84118, -56948, -32175, -57760, -18283, 51056, -23625, -175455, -27649, 97256, -8672, -87382, -55926, -65406, -115924, -80656, -14141, -102307, -88419, -164507, -238136, -199276, -194237, -172886, -157550, -135225, -197833, -136197, -109967, -81281, 119584, 70293, 14326, -24951, -35431, -139641, -147526, -54892, 40518, 42356, 106598, 138901, 103541, 30617, 42855, 99780, 127313, 61862, -34921]
23255c4921J8076j00224k5846j2466P8886l669l5811J43752M4667J6178j23973
23244c5351p0282J30502N6948j8421l0749n8427n4806r2476j63969J3521R7734
23233b25776Q5612j0717M188M6003j1196o2385J9564J43136K9083q5148K8368
23222c9268J6841N5951N3610R6641n2561j23061j63932j61756J2719Q8482Q2832
23211a33502O8828J07950J7655q7996O8857N6469j49990l9803J9487r4730Q6869
23200g9906J9351p9392k8242P7141K1072j2902P5365R3101n1093n9110j5499J7221
23188b2893J32628j8511M2313K7810R461m9729o6061p4966L6141j4576J4153j6196
23176d26l1255J16815O5003j28482o1757J6152N0143m7705j1660k4618J03813
$$ y = [-34921, -16845, -117069, -142915, -155381, -76495, -80164, -115975, 27777, 72444, 88622, -35351, -105633, 24869, 81817, 63396, 32647, -25780, -80586, -173062, -337031, -323510, -225776, -140164, -150881, -146693, -100690, -111886, -174271, -154707, -11571, 17512, -67636, -39268, -22427, 33524, 87134, 183775, 131214, 8153, -155779, -317535, -304816, -216334, -133502, -64674, 43276, 60931, -27065, 41792, 98261, -51729, -91532, -72045, -166775, -79906, -60555, -139947, -168189, -91048, -69976, -82878, -7513, 85588, 34495, -24615, -40114, -22893, 109735, 91224, 133537, 161347, 170808, 121079, 55018, -19948, 16193, 1617, 15770, -426, -31681, 85134, 150137, 21655, -40102, -23950, 26193, -21512, -33172, -57790, 46023]
23165D6023O2510q423n2322k9820j047j6984m6618k0829O7497n7196r2008j01708
23153b50925P5092N7191o4505O0978J43586L6254P2304j06850N5344L896j73671
23142i1306P2487L0187p0027R1079M5205M3064r884P139o8654j5664L7653j4976
23130E6303p3035Q4880p0713n4998J2823l9085Q3596p09o7117o1486k9107k1723
23118a80371O1679Q6347M6517K5261L1907l8341j05552O9229N2124P4770P1237
23107A94807M6429j3959j12968r5054j66765j45581j8465J52367J91606k0753
23097A1664L7929l9806l2379j3055P1475R6786j10008j1237q0478L2141L1218
23086e750o9672o2560p7312o7199J3005O0312P105K4794J01960K46132K2016j02333
$$ y = [46023, 108533, 100110, 47788, 17968, 16921, -63, -46681, -67510, -13, -57209, -149217, -250925, -175833, -118642, -183147, -122169, 21417, 57671, 129975, 23125, 78469, 82365, -91306, -18819, 11368, -58659, 32420, 77625, 120689, 110805, 117944, 49290, 33626, 71279, 56303, -16732, 68148, -2565, -57563, -44740, -83825, -229, -938, -68055, -129541, -158648, -180371, -118692, -32345, 14172, 39433, 71340, 32999, -72553, -3324, 48800, 123570, 194807, 241236, 227277, 114309, 19255, -147510, -293091, -311556, -159189, 32417, 11664, 49593, 9787, -22592, -35647, 35828, 132614, 22606, 11369, -69109, -36968, -5750, -75422, -137982, -215294, -282493, -269488, -209176, -202071, -177277, -75317, 170815, 192831, 90498]
23074I0498n8703j15317j01201j03288J3341m3621O1000R9100l4437O3827J7085
23063a11716M2790P891q0108L9902j5259J19106L0009O1905o6738m4425n4378
23052g1021J1862p4421l9342J2258j6870J37274K2093o4160k1730P6358K1115
23041f584o3483j15955O2967j7505j7975m8354L0775M0511M2880m6026m3943J59758
23029b2934L0236k0172j5205r9008L3054J06802J32175l492O8495o6430r5143
23018D8378q2418J24406L4034o2820j35475J15334M0432p0253K4430l7235j0483
23007a1670K4717K4604P9271k671m1078j00726o0807n6097L9199M5691m83n0428
22995a10478J3408R6736l0935L7902q036j70625q2020R3365o0016k6988J00291
$$ y = [90498, 31795, -83522, -184723, -288011, -274670, -318291, -257291, -158191, -192628, -128801, -111716, -68926, -61035, -141143, -101241, -116500, 2606, 32615, 94520, 27782, -16643, -71021, -59159, -133580, -172922, -160664, -177534, -40260, -18167, -82327, -104057, -27699, -6584, -70067, -186022, -123055, -140560, -158535, -206889, -176114, -135603, -92723, -138749, -182692, -22934, 7302, -12870, -28075, -127083, -94029, 12773, 144948, 141456, 209951, 143521, 48378, -34040, 90366, 124400, 61580, -73895, 41439, 81871, 11618, 36048, -1187, -11670, 13047, 37651, 116922, 114251, 73173, -27553, -88360, -144457, -105258, -59567, -60050, -110478, -97070, -334, -31269, 6633, -1403, -172028, -254048, -160683, -220699, -247687, -147396]
22984a47396Q8844Q3851R076J4731j23425j497O7367Q9178n5797j1795n3074n347
22972d5284r210N8030L3739M6925N2462O2672q629n1814R3371k0530l6609j31011
22960D4112q3952k9168M5602J35920Q6264l8156r4544p1315j52094n8074j5997
22949b31402J26815N0687L0728J06573k3336j93061M4656M5443N1263p2468p8976
22938a43078N5211O5835J33769K9202J27222J9717M0933n2273j88569r8129M7158
22927C6998N7k1298J4067K7642J8319p7666j72937j30091J25951J83780R4795
22916I9617n0211o0171k367j24030N0574m72n4682O5189K3334j14318n3112K6225
22904a94424R206O2089Q0074j2156O0473N0837J41160N1413n0310M0357M0069
$$ y = [-147396, -58552, 25299, 34375, 49106, -74319, -75816, -8449, 80729, 24932, 13137, -39937, -45284, -54494, 3536, 37275, 84200, 136662, 199334, 190705, 138891, 232262, 211732, 175123, 44112, -39840, -69008, -23406, 112514, 198778, 160622, 66078, -5237, -157331, -215405, -231402, -104587, -53900, -23172, 83401, 60065, -132996, -88340, -42897, 8366, -64102, -143078, -87867, -22032, 111737, 140939, 268161, 287878, 328811, 276538, 87969, -10160, 36998, 37055, 15757, 29824, 57466, 75785, -1881, -174818, -304909, -178958, 4822, 99617, 49406, -10765, -13132, -137162, -86588, -87060, -141742, -76553, -53219, -167537, -220649, -194424, -185218, -123129, -43055, -55211, 5262, 56099, 197259, 248672, 198362, 238719, 278788]
22893B78788o1683j5119j13433j57821p9969m5025p9170L5509J28779Q0536P9591
22882E0983m692N2073o0300p7212l9532K7686J2284L1599j01212l562J21253M006
22870A3374j14691p4178n9362o7932J92375O909M3187J7214N0177r0625q8138
22859a71690m7472M7125J57666Q0460p501l6393L9570R1383r7330n9356J0679
22848G141j11481l8172Q4181P5413O297j6992k6760k0855L2738L1711j72198o3613
22836b12590L7015Q1823Q9751J07358M8983k9942k3461m7494j21896l2341k930
22825a05724m2993m8255P241P9605J76936L7966n0308L598j14510m4964j095J4664
22813h7839J50267P5581n5281j04574O6459q7048n8116Q2697m6077l1343L4040
$$ y = [278788, 217105, 201986, 88553, -69268, -149237, -194262, -273432, -237923, -109144, -28608, 50983, 46291, 98364, 38064, -39148, -78680, -50994, -38710, -7111, -108323, -111885, 9368, 13374, -101317, -175495, -234857, -302789, -110414, -103505, -60318, -43104, 7073, -83552, -171690, -219162, -172037, -14371, 66089, 58588, 22195, 61765, 153148, 55818, -3538, 7141, -104340, -142512, -58331, 17082, 23379, 6387, -20373, -41228, -8490, 23221, -148977, -212590, -175575, -93752, -4001, 103357, 152340, 122398, 98937, 51443, -70453, -102794, -105724, -148717, -196972, -189731, -110126, 66810, 104776, 54468, 58066, -56444, -101408, -102503, -87839, 62428, 138009, 82728, -21846, 44613, -42435, -100551, -17854, -63931, -95274, -61234]
22802f1234j0117o5868l5062L5723R5115l3225o7818l1433J7151J81460J4703
22791C9395j47650o9154J08929j6192k5422M4301J28629k0406n5127p8662K705
22780h8654r990M536P9676n8475k3322J05597P4563l5803j18699k9038P621j0399
22768a02387m1657l7443K25494J03004n4406m6869k5628j82491L8039J27701J07519
22757A10876O2697k6860n142r0678r409J57j50174j52415j02258K2529P7406J04191
22745a59080R9986J6758N2028m6790L3993j650j02019j7147J31619J2843j21737
22734a01196L8676J41012M6139P4435J955j13186r3329k3824R5606r1892j06408
22723a32012k3816J7678n0138j56478j7071J14366M3485L563M728n1149J92545
$$ y = [-61234, -71351, -137219, -172281, -136558, -41443, -74668, -142486, -173919, -156768, 24692, 39395, -108255, -177409, -68480, -84672, -110094, -65793, 62836, 42430, -12697, -91359, -88654, -98644, -94108, -14432, -72907, -96229, 9368, 83931, 48128, -70571, -99609, -91988, -102387, -144044, -181487, 44007, 147011, 92605, 45736, 20108, -162383, -124344, 3357, 110876, 173573, 146713, 141571, 50893, 41484, 41641, -108533, -260948, -363206, -340677, -263271, -159080, -59094, -42336, 9692, -37098, -3105, -4755, -106774, -123921, 7698, 20541, -101196, -62520, 78492, 124631, 199066, 201021, 87835, -5494, -29318, 66288, -25604, -132012, -155828, -138150, -188288, -344766, -361837, -247471, -203986, -200423, -195695, -246844, -54299]
22712e4299J32099j07893n6019k0573P7148J2720n9987M2471J7867k7802p1961
22701a16229j9044N0270J1302j7024J0021L2402O03N1262J5600l2304j80691j25462
22689c19294N1093O2284L8128O2928J52129p8715l1287J36372q16K555J21443
22678A96820j23366q7646k0975q4853p3966j3539n2973K1899O7015r442Q2960
22667i8066J8720j15895j1902R1482m111l4976L007K2044L3929m411j26709M6569
22655a80319J26693J40467j959r2850j7430j055J9860M558L1520R1767k1045m0871
22643E9336J12029j25660k02064N8848L5661Q5164O1607J02841o6939p9101l5977
22632E745o5165p218L9448P6713K9913p3922o278r4525l2086q9168n9012p2104
$$ y = [-54299, 77800, -30093, -86112, -106685, -29537, -16817, -76804, -34333, -16466, -44268, -116229, -135273, -85003, -73701, -90725, -80704, -48302, -47699, 3563, 19163, -13141, -193832, -319294, -268201, -205917, -167789, -104861, 47268, -31447, -62734, 73638, 72822, 75377, 196820, 73454, -14192, -35167, -120020, -193986, -207525, -260498, -238599, -171584, -181026, -98066, -79346, -195241, -207143, -115661, -119772, -154748, -151741, -129697, -95768, -100179, -226888, -180319, -53626, 86841, 84882, -7968, -25398, -26453, -6593, -2035, 29485, 121252, 100207, 59336, 171365, 45705, -156359, -97511, -61850, 23314, 84921, 187762, 120823, 41722, 5745, -59420, -66638, -27190, 49523, 79436, 5514, -764, -95289, -127375, -216543, -275555, -347659]
22620c47659L6169J33511N1690n1659l2836J6805Q9399l1161l9856N6171P2731
22609d6695P9125l5379j26015o7437K6700J9031j11544R1988Q1587l8184J3964
22598a12859O3002r0109o896J11994k0149J8964N8516Q763l5647j1389l6236J22444
22586G0398O0748j04536j2754j17810j24989L852k2211J35965J27876j27313j10613
22575b21387J11537j8219j9190J53977Q5413n7123m8572p2249L0530m9228L397
22564a01114K6885j5722O0044J67129k3243m775O141N8513p3955k9296j9304m5987
22552E316k6564J0908p9497P3246J41292K9694j36220j09991j63858L0609J25980
22541i9085N1460K3851m1892o3872k3905Q8977O1925j6343o6294Q3019j7539o1144
$$ y = [-347659, -311490, -177979, -126289, -177948, -210784, -193979, -104580, -135741, -175597, -119426, -46695, 32430, -2949, -128964, -196401, -169701, -150670, -262214, -170226, -88639, -126823, -112859, -49857, -139966, -146862, -34868, -55017, -36053, 22463, 31226, -4421, -15810, -52046, 70398, 131146, 26610, 13856, -103954, -228943, -225091, -247302, -111337, 16539, -110774, -221387, -109850, -128069, -147259, 6718, 92131, 35008, -13564, -85813, -55283, -104511, -101114, -74229, -89951, -29907, 137222, 113979, 109204, 115345, 173858, 99903, 70607, 51303, 5316, -21248, -10340, -89837, -16591, 124701, 154395, 18175, -91816, -255674, -225065, -99085, -47625, -23774, -65666, -129538, -153443, -64466, -2541, -18884, -85178, -2159, -19698, -80842]
22529h0842J27355J88155n9925j34943O4262j124m1636k7668j56332N2798P8900
22518I000l5813O104M2619o0603j5600p748L5580R1167J28461J05221j58872K9684
22506A69200m8371q3717M1801R2570n2368j17951L5746P1885p4012l1966k9889
22495b7072p7176J06102O4930n7457j19044N0830O4346J05911j0572r7927p1943
22484f9072k6750O016O3081m9431K3252L981J6281O2554M3486m6043j03767M0971
22472c5441p293R1746r5944q113k1245p294k18392n85O0879K500J2491R6801l3815
22459a63705q5608j3324O7645J24334J9803Q9663R1994l0453m3311p4466n7927
22448g5355K0655l5179q1846O0373P3711j3530j18314J22754k7614l7148R7478
$$ y = [-80842, 46513, 234668, 174743, 39800, 104062, 102938, 61302, 33634, -122698, -69900, 9000, -26813, -20709, 21910, -38693, -54293, -62041, -26461, 64706, 193167, 298388, 139516, 169200, 120829, 37112, 78913, 171483, 119115, 1164, 36910, 108795, 34783, 2817, -27072, -104248, 1854, 66784, 9327, -109717, -58887, 5459, 111370, 100798, 2871, -69072, -95822, -89806, -26725, -76156, -52904, -48923, -32642, 29912, 73398, 27355, -76412, -35441, -42734, 49012, -46932, -55045, -76290, -83584, -301976, -302561, -241682, -239182, -226691, -129890, -163705, -249313, -262637, -194992, -70658, -50855, 38808, 130802, 100349, 57038, -17428, -75355, -54700, -89879, -171725, -111352, -37641, -51171, -169485, -46731, -74345, -111493, -14015]
22437a4015R1802M86j33839j48127j3922O2744Q7456M5002J10905M923j23763
22426c0348j21640O5324N0724m4664P1106J3039j20126l72O6469k140r076M5453
22414a6251J00683J10202j11681o9476L5765n7359o2159Q9549J26699j17535q7912
22403e9475l8482l3942j0582P9497P5392O1135q7992K01q06m7181o4861l1522
22391a58618k3644l170L5099j3584P728k04946j3167N8782N9832K3680J41311
22380i0697O7256P0046n0037q6734l4093m655L8798M0738Q3898J1544j02856j36588
22368a93380l2948Q601N4992J47133Q1553l7645Q3706P4522n2700K7534n3203
22357A08165k8764k3590k6786m1487R4559M2725J1391q1507o0079J30206J33075
$$ y = [-14015, 77787, 78273, -55566, -203693, -217615, -154871, -67415, -22413, 88492, 93415, -30348, -151988, -86664, -35940, -80604, -9498, 3541, -116585, -116957, -50488, -52628, -61704, -16251, 84432, 194634, 82953, 13477, 49242, -8117, -70276, 19273, 145972, 28437, -59475, -97957, -131899, -142481, -62984, 12408, 73543, -14449, -14248, -15054, -62235, -127096, -158618, -182262, -185432, -150333, -163917, -156189, -361135, -374302, -315520, -255688, -232008, -90697, -23441, 46605, -3432, -90166, -124259, -128914, -90116, -49378, 34520, 46064, -56792, -193380, -226328, -217727, -162735, -15602, 65951, 28306, 112012, 186534, 133834, 161368, 108165, 79401, 55811, 29025, -12462, 82097, 124822, 136213, 54706, -5373, 124833, 257908]
22346B57908j60562j58928r4705n1072L1109P6280o6379K1699L0094N9605l7844
22335i2795P7084P7695R920l0524K511L506N794L6460R8933K5510m4509R8407
22323B67992m1248j2977q2401m3905N0894r0633n9183j01564P583P7543O7875
22312C9976M449j52330L2857R7333N8708j05959j70074J3865m0022K6438J4022
22301a80737J2357m8284M3819J46915P6989j6651j19636R712q6629k9573N7380
22290a34338K8985j34123k6642N8247J11951N3634r3838o3579J72R0886j9497
22279a28142M229J64037J4523k6597M6506o1585o8133l0655q727R1525K0124n0627
22267c3522l0236N8760M027l8299N960j6235j0097L9876l6328P7822k5382p5413
$$ y = [257908, 97346, -61582, -156287, -207359, -176250, -99970, -166349, -144650, -114556, -54951, -92795, -15711, 61984, 71904, 41380, 43891, 47397, 53191, 89651, 188584, 214094, 169585, 267992, 226744, 213767, 131366, 87461, 138355, 47722, -11461, -113025, -105442, -27899, 39976, 44425, -107905, -75048, 22285, 80993, -24966, -195040, -181175, -221197, -194759, -180737, -168380, -216664, -172845, -25930, 51059, 34408, -85228, -75516, -162145, -191718, -134338, -105353, -239476, -266118, -207871, -95920, -42286, -136124, -199703, -199531, -108645, -128142, -123913, 40124, 54647, 28050, 74556, 12971, -55162, -85817, -94544, -3019, 17105, -33522, -63758, -4998, -971, -39270, -33310, -49545, -59642, -19766, -56094, 21728, -3654, -79067]
22255g9067L8807J01906j5402N72K2578o6338l9786Q2792k6388K3644P9816M6711
22243A69845j09341m8397L3933k1726j19917L6100K0939k4218O9529j20274O3118
22232e0409M6474j19382O1876J6641q4523k4985N7445N1833O903r370n1152J51
22220i8498J1271R4134n9341m0493k5384q7537J4420R353m262k7037M2107P823
22208a63444m8474L9956J4483K6996N6099j4956M4556P1828o2150j10540l6122
22197a81768r5513Q6845J64436N4160j4069j4707J10750N0995r1596m1664P726
22186C5595l5317j7344L043J7300o0223J74344N9408j25334j41967P2834Q5768
22175F8107M2160j3345j8760m2773q3664o7931N1654L6955J1394l1105n4776l7543
$$ y = [-79067, -40260, 61646, 46244, 46816, 69394, 3056, -36730, 46062, 19674, 43318, 123134, 169845, 60504, 12107, 46040, 24314, -95603, -59503, -38564, -62782, 6747, -113527, -50409, -3935, -123317, -61441, -44800, -129323, -154308, -96863, -45030, -38127, -47497, -98649, -98498, -87227, 6907, -52434, -92927, -118311, -205848, -191428, -182075, -186337, -213374, -171267, -163444, -211918, -171962, -157479, -130483, -74384, -89340, -44784, 27044, -35106, -145646, -181768, -277281, -190436, -26000, 28160, 14091, -616, 110134, 161129, 69533, 27869, 35595, 278, -17066, -14023, 3277, -56946, 117398, 176806, 51472, -90495, -17661, 68107, 110267, 96922, 78162, 35389, -48275, -116206, -64552, -27597, -16203, -47308, -102084, -139627]
22163a39627R5469M1315n6500J15733Q571k2698L287M8014l5282P5366p4045R141
22151F8744J3276k13073k615Q5568O3834l5181n4539N8169k5784r964P5360m947
22139A8848p4103L7483m5431L2322p9378k4938O8711N3611J8293q5575j22607
22128b02764P8818J28941j1567n5873J23221q2355j51145O5648J3291L7545J71680
22117A15440J03635k4429l8634r0056n3052N4156L2371o1638o4022K9340J18045
22106A21156j18302n6950K5729P003J9040m6903P6648Q8344J4090n5074n8250
22095A6531J00431P1088O31j93307k23632o1654J830P7221K4265m9793k8719J24477
22083a40631k0362k5534L9246P2949M5878j16081K7217R2575k9120n8707K8181
$$ y = [-139627, -44158, -2843, -59343, 56390, 64961, 42263, 45550, 93564, 58282, 133648, 59603, 68744, 82020, -131053, -133668, -48100, 15734, -19447, -73986, -15817, -41601, -51565, 23795, 18848, -55255, -17772, -63203, -30881, -110259, -135197, -66486, -12875, 5418, -80157, -202764, -123946, 4995, -6572, -62445, 60776, -21579, -172724, -107076, -93785, -56240, 115440, 219075, 194646, 156012, 65956, 12904, 67060, 99431, 37793, -26229, 3111, 121156, 2854, -54096, -28367, -21364, -2324, -49227, 27421, 115765, 129855, 74781, 16531, 116962, 188050, 188681, -4626, -228258, -289912, -288082, -210861, -186596, -236389, -265108, -140631, -160993, -186527, -147281, -74332, -28454, -144535, -117318, -24743, -53863, -112570, -84389]
22072h4389K2015J0918J81810P0960j33291k32338M3346J21714k5296R316O9099
22061E3864m9416l8315K0966N9550L0847j14392M5184P466L4176J11600N0534
22050B12064j44227j2809L29p7663j10311k7835n459N9697o0325K3501K9781K2471
22038i0786L2702Q1876n983o8598N3190M9509j02469k3610n7466J18562Q5846
22027G2773M5712Q3513m4651j69754j8454K9163m2502L9352J05041k7387j84277
22016a11471r7871o0006M4827R8683n5387k7355P8034P3770l1836J9341n2178
22005a21449n8361M9929Q1371L7842l2973k9475J57505R0969p8933p4106L3174
21994E5493L3156j00762j81276J4838J29051q2823r863j186j0565J8893O4257
$$ y = [-84389, -62374, -51456, 130354, 201314, 68023, -164315, -120969, 745, -24551, -15235, 53864, 4448, -33867, -12901, 46649, 77496, -36896, 8288, 15754, 49930, 161530, 212064, 67837, 55028, 55357, -22306, -132617, -160452, -165911, -106214, -166539, -143038, -113257, -90786, -58084, 23792, 17809, -50789, 2401, 51910, -50559, -74169, -131635, -13073, 72773, 118485, 201998, 157347, -12407, -30861, -1698, -44200, -4848, 100193, 72806, -111471, -209342, -269348, -224521, -125838, -181225, -208580, -130546, -56776, -88612, -69271, -121449, -179810, -129881, -48510, -10668, -43641, -73116, 84389, 175358, 96425, 22319, 55493, 88649, -12113, -193389, -178551, -49500, -132323, -142186, -143372, -153937, -135044, -70787]
21983g0787l1866J277m6667J8915n852M5842J00606k4027o2441o8338J5517N2749
21971g5072N7046Q4323J15677m7851q9159m4508O0510m1584K3149Q836K0948M5767
21959A18082m9251o4345p86J09628m3066q8592L8773J04795L9451K5829r4556
21948I5962l1252j42515M9024M1765n764k7215j46213p4579J22599M5232j14448
21937a87404q2078P201L8563J16163O6924O8778K9411n4809k2189m1976j00537
21926a61953L9030P5702M652j07961l6561O5604j6662J7873m4604R7643o0949
21915a28186q1314K4875l7953P1828J07606P104Q703L7379k4571j26072n0455
21904a91056R5976J5013M7629K3925Q4402l1978k7881j0320l2891o2114m3205
$$ y = [-70787, -102653, -101376, -148043, -129128, -134980, -89138, 11468, -12559, -75000, -143338, -127821, -75072, -18026, 66297, 181974, 134123, 44964, 456, 60966, 19382, 42531, 51367, 72315, 118082, 68831, 4486, 3700, 113328, 70262, -18330, 20443, 125238, 164689, 190518, 95962, 64710, -77805, -28781, 12984, 7220, -19995, -166208, -240787, -118188, -72956, -187404, -269482, -262281, -223718, -107555, -40631, 28147, 57558, 2749, -19440, -61416, -161953, -122923, -47221, -42569, -150530, -187091, -121487, -138149, -120276, -164880, -67237, -128186, -209500, -184625, -222578, -150750, -43144, -36040, -27337, 10042, -14529, -140601, -191056, -95080, -80067, -32438, -8513, 75889, 43911, 16030, 5710, -27181, -89295, -132500]
21893a32500j686Q7493R0654O7310j10050p8847Q8882J50619N2072k03336l9095
21882b8484K8850M5211l3834l252O2061Q0926j45401J1834L3324k7692j05656
21871h2113j69061K1554J28911L6307l5389J25681j07913j90934J4469r947Q3764
21860a84671J35902P7347j1615N0136J1245q7543n97n5668j10440J24189R487
21849d2228n4227R084K7508R9555Q085J21100M3033o732m8560j1268l1755m8387
21837F5208K915j02440M3357P197n3239j17864J3450L4728n5762J44004M1703
21826B3257l8463l7288J6617O3767j8799j71875O0421J07904P3537o8689N5889
21815F6278J2469j293j11848q9659N6394l8403L751P6236m0279k1321J5535Q8261
$$ y = [-132500, -134186, -46693, 43961, 111271, 1221, -77626, 11256, 161875, 213947, 10611, -28484, 366, 45577, 11743, 8491, 70552, 151478, 6077, 17911, 51235, 23543, -82113, -251174, -229620, -100709, -64402, -99791, 25890, -82023, -272957, -258488, -268435, -184671, -48769, 28578, 16963, 67099, 78344, -9199, -9796, -65464, -175904, -51715, -42228, -96455, -87371, -59863, 39692, 47777, 168877, 211910, 205178, 156618, 145350, 113595, 65208, 68123, -34317, 9040, 16237, -37002, -154866, -141416, -106688, -162450, -18446, 23257, -15206, -52494, -35877, 27890, 9091, -162784, -102363, 5541, 79078, 10389, 66278, 78747, 77454, -34394, -124053, -67659, -106062, -102311, -26075, -66354, -87675, -72140, 16121]
21803A6121J18466j09505j38310o6197P1990o9912j55304n2304Q6368J26331J83152
21792A0896l8355n1344p96J37991J13820J0211k415j10951j06364K2335R6449
21781H1477M3797j00608m5000l2959j7828r9304J034k3752q0422k24Q1638P1978
21769a20173O782k3389o7261M9046J63597L1764m5374o9046K9913R6745R5186
21758A47790O9994m8481j63321p5557l0867J26238M8255Q5219l853j67704k4016
21747c6303n4118K8712n7916J32928R5941j51553k9508R2049L4904R789j45487
21736h0562J6138m599L350O1736k7055l6672j1603L1513J05715o3515j47525Q6623
21724f6456O1762O825L3258n276n0732m8365l8866p821o9404P0269J87849L3629
$$ y = [16121, 134587, 25082, -113228, -179425, -107435, -177347, -332651, -384955, -298587, -172256, 10896, -27459, -78803, -79599, 58392, 172212, 182423, 180008, 69057, -37307, -14972, 81477, 125274, 24666, -20334, -53293, -71121, -170425, -169391, -193143, -273565, -273789, -192151, -120173, -113391, -136780, -204041, -154995, 8602, 40366, -5008, -74054, -44141, 52604, 147790, 217784, 169303, 5982, -69575, -100442, 25796, 74051, 159270, 155417, -12287, -36303, -90421, -61709, -119625, 13303, 109244, -42309, -71817, 20232, 55136, 64925, -80562, -64424, -69023, -65673, -3937, -30992, -67664, -79267, -47754, 57961, -5554, -153079, -66456, -4694, 2131, 35389, 30113, -20619, -68984, -107850, -115671, -185075, -114806, 73043, 106672]
21712A06672O0326j8800j32322q5433r040O139O0770J78593P9027N6345j06289
21701A95988o3105O908p3167j61824r7805O1957K8244M1838J8736J21148N1998
21690A30916n5612l5968L6780k008n5212j63281k6341R7739J13134J1467j5485
21679C6129l6522p6593l8137R5800L2976k2068l5770k1054J4272O869j8580l2236
21667i4914O5432k4347J7562L4077J20181r4260j36412O4047O3349l1771l7757
21656e4813J2263L5416L5319K399N4Q0347j61448q559j59528n7395J15284R229
21644a51432m6613N7504M3384O2978N1084K3031n1955R291l9335q4600Q1293J7859
21632b7511p4738q1708J4551P4762j9739l5572m2642k1940O9205M9698j7777k3881
$$ y = [106672, 166998, 148198, 15876, -69557, -78597, -72458, -11688, 166905, 245932, 302277, 195988, 132883, 139791, 66624, -95200, -193005, -131048, -102804, -60966, -42230, 78918, 130916, 75304, 39336, 76116, 74108, 18896, -144385, -170726, -72987, 40147, 51614, 36129, -393, -76986, -115123, -19323, 13653, -8415, -44185, -65239, -50967, -44098, -62678, -94914, -29482, -53829, -36267, -2190, 117991, 23731, -112681, -48634, 14715, -17056, -54813, -42550, -7134, 28185, 30584, 30638, 110985, -50463, -59022, -218550, -275945, -160661, -151432, -198045, -140541, -97157, -34179, 16905, 39936, -12019, -2728, -42063, -126663, -45370, -27511, -102249, -183957, -169406, -94644, -114383, -149955, -192597, -214537, -145332, -95634, -113411, -137292]
21620a37292m4022K3715L3035N3063J10698L5547k18704p3392M3184L1579K0657
21609a21932n3907P7450J71963j21547r1628Q5744m3816l1164k7663L3885M3998
21598g8617J30801O2507j74370j32786k6298N4580J2399k3077J01539P6934l9055
21587c5443m8907J51622n7618n5967L6724P6673L5436j20036p2476j18493j28215
21576c36700O2892j8176L8474N5736J58754P7983r1224r370p7041P6420J61256
21565I9004J1994l1944p9230m5766k8492j6720N0205P0673p1197m7564p2304J5249
21553a46092n4043j2099J71883J22885K6846L1395l0073o0669r01N5125J31878
21542B36135j02957j87314p1929j9985O4836N5857j68193k6995J98604n1210K9646
$$ y = [-137292, -181314, -157599, -124564, -71501, 39197, 74744, -143960, -217352, -174168, -142589, -121932, -175839, -98389, 73574, -47973, -139601, -53857, -97673, -128837, -156500, -122615, -78617, 52184, 114691, -59679, -192465, -218763, -164183, -151784, -174861, -73322, 3612, -35443, -84350, 67272, 9654, -46313, -9589, 67084, 102520, -17516, -89992, -208485, -336700, -273808, -291984, -253510, -197774, -39020, 38963, -52261, -61631, -138672, -62252, 99004, 110998, 79054, -176, -45942, -74434, -91154, -40949, 29724, -41473, -89037, -161341, -146092, -200135, -212234, -40351, 82534, 109380, 140775, 110702, 50033, 49132, 104257, 236135, 133178, -54136, -126065, -146050, -81214, -25357, -193550, -220545, -21941, -73151, -43505]
21531d3505J06413O2168P7307N7746n7812p6302J06369p7286L6892j19193j66829
21520i4032O084L367l9665j5365P7096N7342j2912L95o871O9532J3559o8546r9168
21507a09184J4475k7217O8765J01604J897L9065k5028J10157j18235k15621q1407
21496b40729m1611k0120Q9928L5385P5500J32379J4174O162p6143n2167J30391
21485E3149J82785K1976o6919j23937l544n4216n5262Q230K4848r371N9195n2838
21473a5904r0493Q0286j371K192j0635L9307J31249l9635q9070N0389k9341j57034
21461a30060r116L4342n116j06742l8834J26417J25721o2149l1256J8697L2281
21450d5815J40190O2421k1302O59K1800J4269K4933k31836l4145J16116M2774
$$ y = [-43505, 62908, 125076, 202383, 260129, 202317, 126015, 232384, 155098, 191990, 72797, -94032, -87948, -84581, -124246, -139611, -62515, -5173, -18085, -17690, -24561, 44971, 58530, -10016, -109184, -94709, -121926, -53161, 48443, 50340, 89405, 64377, 174534, 56299, -159322, -240729, -282340, -302460, -212532, -177147, -101647, 30732, 44906, 51068, -25075, -77242, 53149, 235934, 257910, 190991, 67054, 63510, 9294, -45968, -37738, -12890, -22261, 36934, -15904, -106397, -26111, -27482, -25290, -35925, 3382, 134631, 94996, 5926, 56315, 26974, -130060, -139176, -104834, -109950, -216692, -255526, -129109, -3388, -65537, -96793, -78096, -45815, 94375, 156796, 135494, 136153, 157953, 172222, 197155, -34681, -68826, 47290, 90064]
21439I0064Q4192J03525M5455j75451k43964M0487J19253o4972k8202L1296m2969
21428d1286p3657R0056J04371R1234j1757j06731p1668J23909L2366n1427M1323
21417A26733p3307J2359J11796k5418N2929K2525j34816j47531N1964L723P019
21406G976O2448J07523j37160n006m6036J5362q3130j34189Q1973J59859L1392
21395F1012j64582M2198P4694k0384K0644q364P4278K1427k4151p5288k1807M2806
21383B2483J9867l7998r6900Q9545l8164r2352M4402K7041J04225l6551m5468
21372c9870j29306k3742J40404O7325J983j42360r8127o544K0706o306O7063M5357
21360a03417m3617j36792M8747L7563j3917N991J26154L0262P6111N430n0984
$$ y = [90064, 174256, 277781, 323236, 147785, -96179, -55692, 63561, -1411, -29613, 1683, -41286, -114943, -24887, 79484, 170718, 158961, 52230, -19438, 104471, 136837, 85410, 126733, 53426, 65785, 177581, 152163, 205092, 227617, 92801, -54730, -2766, 957, 7976, 70424, 177947, 40787, 35781, -10255, 5107, -78023, -212212, -130239, 29620, 61012, -103570, -61372, 13322, -7062, 13582, 5218, 79496, 100923, 76772, 1484, -20323, 22483, 42350, 4352, -92548, -3003, -41167, -133519, -89117, -62076, 42149, 5598, -39870, -169176, -192918, -52514, 14811, 16794, -125566, -223693, -230237, -209531, -215837, -148774, -103417, -147034, -283826, -235079, -197516, -211433, -205442, -79288, -49026, 27085, 32515, -18469]
21349a8469k7966O525L236L9350N1729Q8644q5416L0785J891m8984o8309J8899
21337h085K312Q103O7747J1646N209M7975n808m2111o4019j7605q9837j14405
21325a98878M8836l1j14653k4507p315j4109j5919Q6958P7240P0602r362q8355
21313a89493K0877O7152N4710Q85j32613p805N1666O1897k0505j04758L5460L2590
21301a29937N612n434O2550J5789r1903n0282K1446P9573L0071Q7993M3921O7716
21289A37115n4381j9209o9577n3254O6186P3313k1157n5092l2117n5206m3270
21278a26649M2220k7367q664P6590L2002P2732j0368L0366k1068o5760P118K3480
21266B4632J28644M7077K4066q8561q3368J38753m4882j16421J9217k819n8326
$$ y = [-18469, -46435, -39910, -36674, 2676, 54405, 143049, 57633, 88418, 90309, 41325, -26984, -8085, -5773, 2330, 70077, 81723, 86932, 134907, 129099, 86988, 22969, 5364, -84473, -198878, -150042, -150073, -264726, -289233, -296548, -310657, -326576, -239618, -162378, -91776, -101138, -189493, -168616, -101464, -46754, -45869, -178482, -186287, -134621, -72724, -93229, -197987, -162527, -129937, -124325, -129759, -67209, -51420, -143323, -193605, -172159, -92586, -62515, 25478, 69399, 137115, 82734, 63525, -6052, -59306, 6880, 80193, 59036, 3944, -28173, -83379, -126649, -84429, -111796, -120460, -43870, -11868, 60864, 50496, 80862, 59794, -5966, 1152, 24632, 153276, 200353, 224419, 135858, 52490, 191243, 146361, 29940, 49157, 46338, -11988]
21255a1988o6999k3883j12427J9276O6892K2499J517q549R7662J38086J036r7858
21243B5264n9233J45838M5240n0373o8178m5515l1260J6909k8100k0593j2339
21232h2340L9498m9858m6308J37822J3371o5187M84J16138J3574k7119o4513o1455
21220g5893Q3419k2851j17257N8965j1651M6895n3561L3180M2657j13010K3287
21209a05820J36288Q7661p716N8917n700J7483N1527o9381l6064R5129j38281
21198H4043r4605N0603M9045J886j09832l1611P558j10344k6888J33419J93633
21187A46907j3363p5064j03502Q663q2744k2872j4335K4435P5987j14317l9468
21176b09673Q6482O5120O725J14192L8364m3820K3329k1133p6838j7747J782n738
$$ y = [-11988, -78987, -102870, -215297, -196021, -129129, -106630, -105113, -113662, -16000, 122086, 123122, 25264, -33969, 111869, 157109, 106736, 38558, -6957, -38217, -21308, -49408, -70001, -82340, -42842, -92700, -139008, -1186, 12185, -53002, -52518, 63620, 77194, 50075, -14438, -75893, 7526, -15325, -132582, -73617, -85268, -38373, -91934, -58754, -16097, -129107, -105820, 30468, 118129, 110413, 169330, 163630, 181113, 232640, 163259, 127195, 222324, 84043, -10562, 40041, 89086, 90972, -18860, -50471, -42913, -153257, -180145, -46726, 146907, 133544, 58480, -45022, -36359, -119103, -141975, -156310, -131875, -55888, -170205, -209673, -123191, -58071, -51346, 62846, 101210, 57390, 80719, 59586, -17252, -34999, -33217, -38955]
21164c8955J9944j8895j0276Q3486K5234j27573O9731N8285L1560o9552j47839
21153a24850n7133L9145j5821K5878N1400J33764n0158q5604M2503L8766o2664
21142f4774Q033K0973l5540K0358J11368K585j2339k8079M9073l2305l1104r9351
21130i1102N9383p7626M900J03647R258k8733o3142O3508j5948j0295p1321M3564
21118g3907J24123k9996o6291m7536O330k8727r648j8227o1063l5469k860J06860
21106a36411J57501J0654k6974j8888J1853n0975o9473m7087l6162M0077J21093
21095d4792J07482O6794l3440k0135j44102n2434j704m6047R8298J23385J45347
21084A98652L3311o3954j3863p8254j03057m8674M189p1155k8077R1391R7316
$$ y = [-38955, -19011, -37906, -48182, 35304, 60538, -67035, 2696, 60981, 92541, 22989, -124850, -181983, -142838, -158659, -132781, -81381, 52383, 2225, -83379, -40876, -2110, -64774, -56741, -35768, -71308, -50950, 60418, 63003, 50664, 22585, 71658, 39353, 8249, -91102, -31719, -109345, -104445, -798, 8460, -20273, -83415, -19907, -35855, -46150, -117471, -73907, 50216, 20220, -46071, -93607, -87277, -116004, -125652, -143879, -204942, -240411, -243271, -136411, 21090, 31744, 4770, -14118, -2265, -53240, -122713, -169800, -205962, -165885, -44792, 62690, 129484, 96044, 75909, -68193, -120627, -122331, -168378, -70080, 53305, 198652, 231963, 168009, 154146, 75892, -27165, -75839, -71650, -142805, -170882, -79491, 17825]
21073A7825M5048j5379O840q7587j4432N3300M1488l4836l3161p0824L32O5117
21061b6269N1519L8839O3957P4854l6165p0567j3733p2175m4575l5389j9407K4212
21049f4899r455L019O8512J8792K8161r1385o9974P950K332R149Q7372J7705l458
21036C821J0615K1829j0229l8595J10458o5621j36136n5684R4123R5272P7633
21025A07486M3908n3925j17942J7559o4796L1463m52J08693Q9595K0646J547o6242
21013A17540j33563o9278J13006K4405O6898K9907j46273q3706R481n3306J00996
21002b3893J38737k2126o6681O947K7099O12L9334j9238j81021j24729O424J31981
20990h6554p8980j42149L6245J10636J03254O9362k3610K8665q6683N4159J43930
$$ y = [17825, 62873, 47494, 54334, -33253, -47685, 5615, 47103, 12267, -20894, -91718, -91386, -26269, 25250, 64089, 128046, 202900, 166735, 96168, 82435, 10260, -34315, -69704, -89111, -64899, -74354, -71335, -2823, 15969, 44130, -47255, -117229, -109279, -106947, -97798, -10426, 7279, 3821, 14436, 36265, 26036, -12559, 97899, 32278, -103858, -159542, -65419, 29853, 107486, 151394, 97469, -20473, -2914, -67710, -36247, -36699, 71994, 161589, 182235, 183782, 117540, -16023, -85301, 27705, 52110, 119008, 148915, 2642, -81064, -71583, -124889, -23893, 114844, 92718, 26037, 32984, 60083, 60695, 100029, 80791, -100230, -224959, -218535, -86554, -165534, -307683, -271438, -160802, -57548, 11814, -11796, 16869, -69814, -15655, 128275]
20979A28275k6194k2338J7977J3925k7480R266j79886K5062N4333j00006q9777
20968a96843k0053l1007J9806L3707M8085k0655P0633J4847K1177O4976O6450
20957G1123K9470k5797m3517Q7928o2098r7217n4270j9576r136K3107O8880l4028
20945f5131R3034p29J3295l0072n812j82592l1962J93154R1015q0987l6138J8142
20933b4783Q7785J6638o1062K1253K7689j01591j338K2109n356q0941o7808k0002
20921a87407p7483J5873R0716P3188M8782J06465n4195j05788j09894J9758M7890
20910a32095R7081M4579n173n3390J00387J14499j22709j17696m868N5606R4397
20899G0618q4253q0658l4014P0341p9228j595M6807k9507J4015r74O0314J4116
$$ y = [128275, 102081, 79743, 97720, 111645, 84165, 93431, -86455, -61393, -7060, -107066, -196843, -216896, -247903, -228097, -194390, -146305, -166960, -96327, -81480, -60303, 4673, 71123, 100593, 74796, 31279, 119207, 57109, -40108, -94378, -113954, -123090, -99983, -31103, -65131, 27903, 27174, 40469, 10397, 4585, -178007, -209969, -16815, 74200, -6787, -42925, -24783, 63002, 79640, 18578, 39831, 67520, -34071, -35409, -13300, -18656, -99597, -167405, -187407, -264890, -249017, -158301, -85113, -36331, 70134, 15939, -89849, -199743, -179985, -132095, -35014, 9565, 4392, -48998, 51389, 165888, 43179, -74517, -79385, -23779, 70618, -13635, -94293, -128307, -57966, -137194, -138789, -91982, -121489, -107474, -108448, -48134, -34018]
20887c4018Q3076l6453L3933p6473m0557J00021n1072Q243l8386o4969j9584N8532
20875g7707J2318J275M7836j9971Q4351l8378m8769j25194M1959Q5042K1939N3501
20863C8202l0532o4202l3749M7668k7566Q921o9270J0279N4096R283l2645M0342
20851d9173P1707P1081J1703o5031j0516n0174Q031l0185m8609r190J57448R2700
20839A49792n2602j58539n4861M7576L3561J6664m5903j22503j20347k081J09009
20828b00234M4898j2023J42375J65281j35929l0168j8222m0438q2036m5161M8530
20817a63127o6583N9266K1015J58726J8433l2014J9617N5407J02320n8504j77442
20806f2886O2625j8512l3747Q5162n4502o4604n4127Q0005l1100L7390P3397j9659
$$ y = [-34018, 49058, 12605, 46538, -29935, -70492, 29529, -21543, -13300, -51686, -116655, -136239, -77707, -65389, -64114, -16278, -36249, 48102, 9724, -39045, -164239, -122280, -37238, -15299, 38202, 7670, -56532, -90281, -42613, -70179, -61258, -130528, -120249, -66153, -56870, -89515, -49173, 22534, 93615, 105318, 40287, 29771, -20403, -12372, -42557, -91166, -100356, 57092, 149792, 97190, -61349, -116210, -68634, -35073, -18409, -64312, -186815, -307162, -309243, -200234, -155336, -167359, -24984, 140297, 4368, -25800, -44022, -84460, -166496, -211657, -163127, -229710, -170444, -149429, 9297, 27730, -4284, 15333, 70740, 173060, 114556, -62886, -261, -18773, -52520, 32642, -21860, -86464, -140591, -60586, -91686, -54296, 19101, -558]
20794e58n4562q1395m9873Q0983O5272Q0978N2669q5119j89571k2655M2811k6786
20782a87806J15115J37193O8159j17791q3235J3824N9478N0122P2626J48969J02568
20771C79222j10625j01849j39130K5808k3254m9183m9719K081J70341Q7302P102
20760A98096l3689n9545j16300k866j0942R547l8459q8066K0315O5376P7681K3648
20748D4796Q13M2553J03923m4041j04544j7569J2353j06239j1887P1408J392R0893
20736H3851j4301j7896m6555o3875R549O5372J31679M2106n9625m4266J04187
20725A90226j8564r235n188r6895j04155j47194O313q024N6818J11755M8567J04457
20713A28881J5891K3095m7843o0916o9625p459o4587P7338R9948j0942N4641Q386
$$ y = [-558, -55120, -136515, -186388, -105405, -40133, 40845, 93514, 8395, -181176, -203831, -161020, -187806, -72691, 64502, 132661, 14870, -68365, -54541, 4937, 55059, 127685, 276654, 379222, 268597, 166748, 27618, 53426, 30172, -19011, -68730, -66649, 103692, 190994, 198096, 164407, 104862, -11438, -14304, -25246, -15699, -54158, -142224, -121909, -56533, 21148, 44796, 45609, 88162, 192085, 148044, 43500, 25931, 38284, -67955, -79842, -8434, -7042, 83851, 69550, 51654, 5099, -58776, -49227, 16145, 147824, 189930, 130305, 86039, 190226, 171662, 162427, 157239, 60344, -43811, -191005, -184692, -192716, -135898, -24143, 24424, 128881, 144772, 167867, 120024, 59108, -10517, -17976, -82563, -5225, 94723, 83781, 138422, 146808]
20701A46808k3389n9021l6083J2936j5996j23147j0246Q3874Q6828O3638p2440
20690E3762P1036p4041O9119L6214J4276n9197n7027P2873l8113J5614P2270Q0431
20678B57217j0622J4916p0946l3664J6176o4720p5204j91584k9549J14710R1412
20667A8142N2203P2233O8946j1709j59547q2188N2030K8467N988L1291l6087o485
20655C3284L2540k7579j20063n3940N3340J14978J36792n6757n5921M521o688
20644E4507L2805p1878N5053J27281M113n7892J9419K4635L5998J08783L5375
20633C68199p9060p5867L3679J7404m514k208m9783K2948J8241K5914P4372R85
20621C50310N4237J86786p0808m553M6340J08968N3492J64237K3225q1998q0266
$$ y = [146808, 123419, 64398, 28315, 41251, 25255, -97892, -108138, -24264, 62564, 126202, 53762, 124798, 50757, 119876, 156090, 170366, 111169, 54142, 127015, 88902, 104516, 176786, 257217, 246595, 261511, 190565, 156901, 173077, 108357, 33153, -158431, -187980, -73270, 18142, 70345, 142578, 211524, 199815, 40268, -41920, 10110, 38577, 44565, 75856, 39769, 33284, 65824, 38245, -81818, -135758, -82418, 32560, 169352, 112595, 56674, 61195, 54507, 87312, 15434, 70487, 197768, 201881, 143989, 163408, 188043, 224041, 332824, 368199, 289139, 213272, 246951, 264355, 259841, 257633, 207850, 230798, 249039, 274953, 349325, 350310, 404547, 591333, 520525, 515972, 562312, 671280, 724772, 889009, 912234, 830236, 749970]
20610G49970n5708J09680J24975m374k5554N3283j13203r2058j22332p6910L659
20599E51428k1646k1352j14873j52421j2318O493n657m551m9117j4940Q4407k0930
20587B24523p6943l0153l7112J01400j781k4541r0925m5631N3435J40122o1522
20576A50872m1969P3703J3764L2568R7206j78132r6370J82687L173j4109l6917
20565A86476j29538o1826q8Q0076P8523O9825p4437M197k4565k6583J7289j8167
20553A01182k3719K8251L1713m06m3910q1822p5229R6882Q5849M7850o5718p4804
20541B6119o8914J3075L5144K9428M0583J6515j3847M6154P5328j00191j96238
20530i6844K3158Q4552J35649o748j67615J18133O0899l4553j77694N5877N9034
$$ y = [749970, 694262, 803942, 928917, 924543, 898989, 952272, 839069, 747011, 624679, 547769, 551428, 529782, 508430, 393557, 241136, 228818, 235311, 229654, 225103, 175986, 161046, 245453, 224523, 147580, 117427, 80315, 181715, 179934, 155393, 64468, 18837, 72272, 212394, 150872, 108903, 182606, 196370, 228938, 326144, 148012, 51642, 234329, 237502, 223393, 186476, 56938, -4888, -4976, 75100, 153623, 223448, 149011, 153208, 128643, 102060, 119349, 101182, 77463, 105714, 137427, 137021, 93111, 11289, -63940, 32942, 118791, 166641, 100923, 26119, -42795, -29720, 5424, 34852, 75435, 91950, 78103, 124257, 199585, 99394, -96844, -73686, 10866, 146515, 139767, -27848, 90285, 151184, 116631, -61063, -5186, 53848]
20519E3848J05234O7425p7536M102q5828j12309J3308J2202L4056r3703P9424
20508B23R0438j1708m423M3553j775m3781K9377O0189o0225j23286Q2418p143
20496E3857Q3207l627n4850N4121J05023K6356j19126j36059p7217j3288P7096
20485d507l514n780J10258j2798r8444P0323P1584j7318r8930p8842J37848J05634
20473A75514Q3806j8236L816M2308l5147n8524q9341o8874J2867M508l9760k8940
20461a6003O8137p6729j9153m0795J06534J15365N2239l1044k3727m9103j16919
20450c1198j82942n34J73133L8175m6874j9956J28970o34k6773J09627L8704k8960
20438A50738p1445j6364M8830o9633N5856k9294L7420L4624k1364m7602j00143
$$ y = [53848, 159082, 226507, 148971, 153073, 67245, -45064, -31756, -19554, 14502, -79201, 223, 90661, 78953, 74530, 118083, 116308, 72527, 101904, 162093, 101868, -21418, 61000, 53857, 137064, 133437, 78587, 132708, 237731, 264087, 144961, 8902, -68315, -81603, -4507, -8021, -13801, 96457, 83659, -14785, 55538, 127122, 109804, 10874, -67968, 69880, 175514, 259320, 241084, 244900, 287208, 252061, 193537, 104196, 35322, 48189, 52697, 12937, -16003, 52134, -24595, -43748, -84543, 21991, 137356, 189595, 158551, 134824, 85721, -31198, -214140, -214674, -41541, -3366, -50240, -70196, 58774, 58140, 31367, 140994, 179698, 150738, 79293, 62929, 111759, 42126, 97982, 68688, 106108, 140732, 119368, 71766, -28377]
20427b8377k2738l4284m5842p5405m6346J28442J03366O9878J4930M5356j2872
20416I6108m4785O2257j6937p8611p0108j3099K3383k2320O3398k4921m9421m5513
20404a20569K6701K9519O0755O2956O618R4148J8462N7508o9739j82576l0363
20393d6580J8315l2630p289J09655L9984q1454p8664J5410j7526O2690O2871o5627
20381b0845n9827m9556K2766K7902l3465M0782J06124M9783q4938j31156N5895
20370g6535r3313q1893J11823J31594n5768R901Q3734n7693J2142Q1418J000q0402
20358a3992j0323L9995N8715p7200j5375m3100j9876j7139K8288j04017J89Q4860
20346h8975O4048j2045N287O3837K2192j46943K5423m2819L4297M3777J28607
$$ y = [-28377, -51115, -85399, -131241, -206646, -252992, -124550, -21184, 48694, 63624, 108980, 96108, 51323, 113580, 96643, 18032, -52076, -65175, -41792, -64112, -714, -25635, -75056, -120569, -93868, -64349, -3594, 59362, 65980, 160128, 178590, 236098, 166359, -16217, -46580, -28265, -60895, -68184, 41471, 81455, 1, -78663, -63253, -80779, -18089, 44782, -20845, -80672, -130228, -107462, -79560, -113025, -72243, 33881, 83664, -1274, -132430, -76535, -169848, -251741, -139918, -8324, -64092, -54191, 29543, -28150, -16008, 65410, 66410, -13992, -24315, 15680, 74395, -2805, -18180, -61280, -81156, -98295, -70007, -174024, -173835, -88975, -24927, -36972, -31685, 32152, 54344, -92599, -67176, -109995, -75698, -31921, 96686]
20335I6686O8328M6144m517M4780l3833l5719l2065j51995r448q5736p3922J15475
20323e5822J53285n120O5987l61m1425p0454k4809j07282m7722K0381O1883J85455
20311A33996R2654j34695j4407J6300l7404m0744q9910k7705J7454J35555j6683
20300C4411l1334J07711p646n5540L5662K285M3659n4024J23136J53678O1787
20289D13785j17938n9300n9308r9007J685J23152j4131j32288l4810J90233O4143
20278B76216M0212J0260n5151l7508m5797j80077n0044p704J6560J03240Q6672
20267A56879q406k9054l4705j05242K3922O6359L0140J5677j27042m2849M4100
20256a0221J69096J29173r6497j27682J3384p6942q0727j0332K41022J8864r9549
$$ y = [96686, 165014, 211158, 206641, 251421, 217588, 181869, 149804, -2191, -11639, -97375, -171297, -55822, 97463, 92343, 158330, 157969, 116544, 46090, 21281, -86001, -133723, -113342, -51459, 133996, 226650, 91955, 77548, 93848, 56444, 15700, -74210, -101915, -84461, 51094, 34411, 3077, 110788, 103142, 47602, 83264, 85549, 129208, 75184, 198320, 351998, 413785, 295847, 236547, 177239, 78232, 79917, 203069, 188938, 56650, 21840, 212073, 276216, 316428, 326688, 271537, 234029, 188232, 8155, -41889, -49593, -33033, 70207, 156879, 148473, 119419, 84714, -20528, 3394, 69753, 99893, 115570, -11472, -54321, -10221, 158875, 288048, 191551, 63869, 77253, 311, -80416, -90748, 150274, 169138, 69589]
20245F9589j3718P3685J19664P8551j33773n2224J85479o2310r8070j1615j35765
20234A9493k04431K9918O1417J68209m26o5667j41135q304R433M5109o9883n9028
20222b15295N1945R8123R7239P4029N0535K391J08742L231j27964J1478n72Q2874
20210B36756p0589o8981j9053k1837q108K5389K44p7525p5140R0456N6777l7502
20198C0887k4632L3592m7821M1540J4599J762l5734J4360R3200J04044R8157M3107
20186C67061j14090N8518P476j34164j19991J39656J38406l8890o8922j62840
20176G2220k22680J31336R7053M5901K1030q0791p6620Q6324J16238L416m8761
20165A44666j25589M016O1090P5292N8662q3545j05851n6763k0995J6821J52540
$$ y = [69589, 55871, 129556, 249220, 327771, 193998, 141774, 327253, 264943, 166873, 155258, 19493, -184938, -155020, -93603, 74606, 74180, 8513, -132622, -140926, -131493, -86384, -156267, -215295, -163350, -65227, 32012, 106041, 156576, 158967, 267709, 270940, 142976, 154454, 153882, 236756, 166167, 97186, 78133, 56296, 48188, 73577, 73821, -3704, -78844, 11612, 68389, 30887, 6255, 39847, -7974, 33566, 48165, 49927, 14193, 28553, 121753, 225797, 323954, 367061, 252971, 311489, 318965, 184801, 64810, 204466, 342872, 303982, 235060, 72220, -150460, -19124, 77929, 123830, 144860, 64069, -12551, 73773, 190011, 193427, 144666, 19077, 23093, 84183, 159475, 218137, 134592, 28741, -28022, -49017, -32196, 120344]
20154A20344Q381j16198J2046L0869j00314j22963k9115J67933J53359m4787O2445
20143A42000P0020L7225j29565l0719L9457k685M6313l5450k4515K3486P2494
20132B08061N2907j17488K562J55147k1342n9155P471j02030P2622q5291m0830
20121G2634M0674Q5481N1183Q17m1652m8363k2281N6596J1031l9368m4074o1325
20109F1353r623n800J948J68263K135q5279j70587p6114J3401P9503N1647p1155
20097d0308l5217R8636J41468j02846J4610P0255Q8865j00328K2425K2852m409
20086A76003o2512n8784M9142N8140L8835m800j6409j22442o8768l365J17377
20075A02417K1203r920p6692N7053o015p0237o6520j5810K6941k0747Q6780J12844
$$ y = [120344, 128725, 12527, 24573, 55442, -44872, -167835, -196950, -29017, 124342, 79555, 142000, 212020, 249245, 119680, 88961, 128418, 125733, 172046, 136596, 112081, 135567, 208061, 260968, 143480, 146042, 301189, 279847, 220692, 228163, 126133, 198755, 113464, 72634, 113308, 198789, 249972, 250789, 209137, 160774, 138493, 195089, 206120, 166752, 122678, 61353, 51730, 45930, 47878, 216141, 218276, 132997, -37590, -113704, -100303, -20800, 30847, -40308, -75525, 23111, 164579, 61733, 76343, 146598, 235463, 135135, 157560, 180412, 176003, 113491, 54707, 103849, 161989, 200824, 196024, 179615, 57173, -11595, -14960, 102417, 123620, 113700, 37008, 94061, 88046, 17809, -48711, -64521, -37580, -58327, 28453, 141297]
20063A41297L5050j06028o9682m771N3890M8990L7538O2300j8574k9052m2520
20052A08438J8528N5429P6595K5525N5503M5432J3051j07581j37292l9649n2785
20041F1194J19330L9083n5053M6378n4038j38358k9180J31381J51890K5677J60997
20030D59301m6944j40361m2845N24o9804j29795m6365N9156J14461J6125M9803
20019B23256O666j1698l3083J6555j06958j346L8454j22522n5081Q6521N3536
20008I4300K31861j0515q8294j12808q1402j3020p8557J04726J2486J0686L9308
19997A08771K3525L9537O9988j3079j3158j10834k8502N1734O099K1461l4575
19986A20967M9789M1088j5663N201l333j42396P0743P8974J05169r6115j2606
$$ y = [141297, 176347, 70319, 637, -4134, 49756, 98746, 136284, 198584, 180010, 150958, 108438, 126966, 182395, 258990, 284515, 340018, 385450, 398501, 290920, 153628, 113979, 61194, 180524, 219607, 164554, 210932, 156894, 18536, -10644, 120737, 272627, 298304, 459301, 412357, 271996, 229151, 229675, 159871, 30076, -16289, 42867, 157328, 173453, 223256, 229922, 218224, 185141, 201696, 94738, 93392, 131846, 9324, -45757, 40764, 94300, 326161, 315646, 227352, 114544, 33142, 20122, -58435, 46291, 58777, 69463, 108771, 132296, 171833, 241821, 228742, 215584, 104750, 76248, 127982, 134081, 155542, 120967, 170756, 211844, 196181, 201382, 198049, 55653, 126396, 205370, 310539, 214424, 201818]
19975B01818J21904P315q0150M7139j2404j7162n6443n6874J842k275J60051j8303
19963B96458N2037O5385k604J8677O571n4177p8228K7738q340J775n2400j66034
19951A06858L5647P9138Q3471k7340j18191K1588Q2281J1061j7173m5945r436
19940B01959l9821k8085J86738p573j3130r2182J5646L2324l0442p8995J16359
19929B62798P4893j1719j4415o993l2539M2058L3110J3419r4496n2923N4311q792
19917B58712O576J44591L0799l7973l1676j00041n7567j7871O0818j4446o3785
19906A78137K2426M0462k4483o0854P152j8688r3347K2342J71657N9614L3086
19895C37504j36493j06273P6783J7361J35735J35288J7881j09644p6773p9236
$$ y = [201818, 323722, 331037, 250887, 298026, 285622, 268460, 212017, 155143, 156985, 154710, 314761, 296458, 348495, 413880, 411276, 429953, 436524, 382347, 304119, 331857, 323517, 325292, 272892, 106858, 142505, 221643, 305114, 277774, 159583, 181171, 263452, 274513, 257340, 211395, 201959, 162138, 134053, 320791, 313218, 300088, 207906, 223552, 255876, 225434, 146439, 262798, 337691, 325972, 311557, 304564, 272025, 314083, 347193, 360612, 266116, 213193, 267504, 258712, 265288, 409879, 440678, 402705, 371029, 270988, 213421, 195550, 256368, 241922, 178137, 200563, 241025, 216542, 155688, 162840, 144152, 50805, 73147, 244804, 304418, 337504, 201011, 94738, 171521, 188882, 324617, 459905, 477786, 368142, 291369, 212133]
19885B12133p511M3082N618M4223q8073N7701J03606j1266n9055K8393j4757q1733
19873B32361k5936j1193j42900M2693M442M9909R3866p0140n2563k5428Q2653
19862A77764P4384J1828k674o7437Q9456J7004J2526j36308q7190J33347j0400
19851B12300q3484Q2882j2422k4200K431P8461M4298l9729m368J1359k1453J7369
19839B63444l9911O477J7251N1556J2666J38740P6753o7506r8089r9282q1926
19828A80173o5145N1755J5393L9315M2624J13097K9208r7108m0814K4676K7955
19817C21129P2635j2655o6447m190K2384p9525j05306J31605K5687m6634O7557
19806C26240J17913L7682k0678J354M6007M0781l4868l0531m0323M1210O7254
$$ y = [212133, 204622, 247704, 253322, 297545, 209472, 267173, 370779, 359513, 300458, 328851, 314094, 232361, 206425, 195232, 52332, 95025, 99467, 149376, 243242, 173102, 120539, 95111, 177764, 252148, 263976, 261302, 193865, 283321, 300325, 312851, 176543, 89353, 222700, 212300, 128816, 211698, 199276, 175076, 177507, 255968, 300266, 260537, 256169, 267528, 246075, 263444, 223533, 230010, 247261, 298817, 311483, 450223, 526976, 459470, 361381, 262099, 180173, 115028, 166783, 182176, 221491, 264115, 377212, 406420, 309312, 268498, 293174, 321129, 393764, 381109, 314662, 310472, 332856, 253331, 148025, 279630, 305317, 258683, 326240, 444153, 481835, 461157, 462511, 508518, 549299, 514431, 483900, 443577, 484787, 552041]
19795E52041j18968o1635P232o9739j16841o3035M3131J816J58664J91082K24733
19784G48481L251j66504r4157l4954j42018r2809n6870J10808K30012r791j85354
19773C10095j96544l5777N4301O4228J80066l4492P6712j2733l9929m028M3733
19762D05632m904l9545j5133L6557J5331o4401k4234J6172j1660q711J36259J53951
19750E95314m919r2122n5291M8384K0380j35008j02208N4686O204J17560N6008
19739E08988m6120k1109K7100J17197R791J0149j7485o2782J0134p8179l1509
19728D26175j06314O3313O8709o2870L3763K0245j1794R7089p8412K468j01140
19717C51232n6553n3049K4527R2557l7570m1632N9088J0573J11764j4756K1911
$$ y = [552041, 433073, 371438, 378670, 308931, 192090, 129055, 172186, 174002, 332666, 523748, 748481, 751732, 585228, 491071, 456117, 314099, 221290, 164420, 275228, 505240, 495449, 310095, 113551, 77774, 132075, 196303, 376369, 341877, 418589, 405856, 365927, 361899, 405632, 400728, 361183, 346050, 382607, 397938, 333537, 309303, 325475, 313815, 305104, 441363, 595314, 590395, 498273, 442982, 491366, 511746, 376738, 274530, 329216, 335420, 452980, 508988, 462868, 441759, 468859, 586056, 595847, 605996, 588511, 525729, 535863, 457684, 426175, 319861, 383174, 451883, 389013, 422776, 443021, 431227, 528316, 449904, 452372, 351232, 294679, 241630, 266157, 358714, 321144, 279512, 338600, 349173, 460937, 446181, 468092]
19706D68092K8261m9524n8587J1834j1059j9709M1613J04601J6853J873J830q2572
19694D53506m5513Q8292N0229L3716K4615M8868k299Q9297q1165l8957j9234j45137
19682D56218L3021K75334O2073r917J69806M0909M4326J98285K16475K56116K21414
19671A964060Q6111k6292O1005J99276Q1746m7278N8322p7255q2748j75618r7004
19660A944325K7534j803j13626j00819k97786l20097j76089J5032K0093r4698
19650I02066j04011j24098p9314m7J38283L5513r7938J01708P608j41262r4217
19639E44291n1205O6743J70250k1309J0490p3450n4143J0525O2916Q1521O922
19628G53551r819j22548L0453p9400M4101R9654K288k2614k7397O025J0332K2756
$$ y = [468092, 496353, 446829, 388242, 400076, 389017, 369308, 410921, 515522, 532375, 534248, 536078, 453506, 407993, 496285, 546514, 580230, 604845, 653713, 651414, 740711, 659546, 620589, 601355, 456218, 489239, 764573, 826646, 816729, 986535, 1027444, 1071770, 1270055, 1486530, 1742646, 1964060, 2050171, 2023879, 2084884, 2284160, 2365906, 2318628, 2376950, 2299695, 2216947, 2041329, 1944325, 1971859, 1970056, 1856430, 1755611, 1457825, 1137728, 961639, 976671, 996764, 902066, 798055, 673957, 594643, 594596, 732879, 768392, 670454, 772162, 779770, 638508, 544291, 493086, 559829, 730079, 708770, 719260, 645810, 591667, 602192, 665108, 746629, 753551, 743732, 621184, 651637, 572237, 616338, 715992, 718280, 695666, 668269, 674294, 684626, 707382]
19616G07382o256J65293O1512r5737p3773o0689K8790q8049L1779K1105m3886
19605F47471p2951R1266J17842j0831j01044n0377n819Q3278J7632L9456O2047
19594H17970K9977O1912j022m9452Q452O9892r3061O7502j9113q0967J18753l0270
19582I00573j47444m7688n220L8139P2055m164l5917l0517l9219P714L9505P057
19570G54874J11286k7707j25389J04684O5447n1623J29898O167k3336k0966N740
19559I29075M1382M9051N8884o7439j89983n6764L3388N2526L179R7418J37754
19548A088471M2318L0328N0755M8737j11388n1471Q6643L3987r6174k0428k6359
19537A075419p0582j5805O8078N6809k91j80342O2237L6904O1513J0476p3832
$$ y = [707382, 701126, 866419, 927931, 832194, 758421, 697732, 726522, 638473, 670252, 691357, 647471, 574520, 665786, 783628, 772797, 671753, 621376, 615557, 698835, 716467, 755923, 817970, 847947, 909859, 908837, 859385, 867837, 937729, 844668, 912170, 893057, 812090, 930843, 900573, 753129, 705441, 700221, 738360, 810415, 806251, 770334, 739817, 700598, 708312, 747817, 754874, 866160, 838453, 713064, 817748, 883195, 831572, 961470, 967637, 944301, 923335, 929075, 970457, 1019508, 1078392, 1010953, 820970, 764206, 797594, 850120, 853299, 950717, 1088471, 1130789, 1161117, 1211872, 1260609, 1149221, 1097750, 1184393, 1218380, 1122206, 1101778, 1075419, 1004837, 989032, 1057110, 1113919, 1113628, 933286, 995523, 1032427, 1093940, 1104416, 1030584]
19526A030584N2738J84857O2471p1407l7261N1653p799j23821k5781J0729l9347
19515A087616L8326O1562P2637M1784m8276R971P6199k0262J6510j9119L0536
19504A347484M5930k6361n03n4430j15896N3180j5747j00504n0690M4434J29209
19493A256106J41927L7221L8400M0518j30479j7797J55962R9017j3399j5926j27067
19482A464483k4423L3133J33685O4830m2467q6967l6424m2077k2945J07673P165
19471A555666p607M9229Q7779M6729r4741p1552o6697L0597j5097J18471n3684
19460A579093n6416o6791j2998J62669l7256n0707Q8370J24865Q4538m0136K3631
19449A798862N6365j0152L9426N4683m8281P2480M8125q8056k3697M8164q0748
$$ y = [1030584, 1083322, 1268179, 1330650, 1259243, 1221982, 1273635, 1265836, 1142015, 1116234, 1126963, 1087616, 1125942, 1187504, 1260141, 1301925, 1253649, 1263620, 1339819, 1319557, 1336067, 1316948, 1347484, 1393414, 1367053, 1366550, 1312120, 1196224, 1249404, 1233657, 1133153, 1082463, 1126897, 1256106, 1398033, 1435254, 1473654, 1514172, 1383693, 1365896, 1521858, 1620875, 1607476, 1591550, 1464483, 1440060, 1473193, 1606878, 1671708, 1629241, 1542274, 1505850, 1463773, 1440828, 1548501, 1555666, 1548059, 1597288, 1685067, 1731796, 1637055, 1565503, 1498806, 1529403, 1514306, 1632777, 1579093, 1522677, 1455886, 1442888, 1605557, 1568301, 1517594, 1605964, 1730829, 1815367, 1775231, 1798862, 1855227, 1845075, 1884501, 1939184, 1890903, 1963383, 2011508, 1923452, 1899755, 1947919, 1867171]
19438A867171j93832L3830J74296O9463O0709J03517j04325m507Q9579L1046J1488
19427B138435p0117q6395O9734N8885N6457R7463L9829j1910j26347o2547n7387
19416B046100Q5537J74904O2602m3518K2422Q22o5224L9329J89160O0692N9210
19405B632036O3156j9667j08676J6644k1425j4381M2420J21230l4898m1574p1879
19394B562986n6430J32048J97626J58197n841r6087m1058k3224j9497R3446m3797
19383B858369l2913m8600L9425J6468P5483j2300J0178N5288J45689l5181J6908
19372C088814J06557m5016l7820Q3905Q6959N2304j7160K5349R6059J2819K6299
19361C479069N6315J31484Q1571J6368O1988J12799L9841J10487O4532M5570k2690
$$ y = [1867171, 1673339, 1707169, 1881465, 1950928, 2011637, 2115154, 2010829, 2006322, 2095901, 2126947, 2138435, 2068318, 1981923, 2051657, 2110542, 2166999, 2264462, 2304291, 2292381, 2166034, 2103487, 2046100, 2131637, 2306541, 2369143, 2325625, 2348047, 2348869, 2283645, 2322974, 2512134, 2572826, 2632036, 2695192, 2675525, 2566849, 2583493, 2562068, 2547687, 2590107, 2711337, 2676439, 2634865, 2562986, 2506556, 2638604, 2836230, 2994427, 2988586, 2892499, 2851441, 2828217, 2808720, 2902166, 2858369, 2825456, 2776856, 2816281, 2832749, 2908232, 2895932, 2906110, 2961398, 3107087, 3071906, 3088814, 3195371, 3150355, 3112535, 3196440, 3283399, 3335703, 3318543, 3343892, 3439951, 3452770, 3479069, 3535384, 3666868, 3748439, 3764807, 3826795, 3939594, 3979435, 4089922, 4154454, 4200024, 4177334]
19350D177334J13735L05448J57803J96756K10630O3480q2831j34608R3431J81869
19340E283047J18632K71977L53053K58040J25573q93n8180k83417k08697r6443
19330E762692p6275Q9227J44531K20045L9874K0035j27757j95172j84463r8089
19320E594648K7812J14829N2984j10040p1589J14074M4693O0563J08486J62292
19310F098752J21809J25338L9605J03851J49592M7880O1040R2822Q5564J05152
19300G031405Q0661O2171J03246J00826R7575Q0893Q8914J47870J96010K38548
19290H228119M0746J3207P7613R1301J10377K01401J86433J87950R4754J12633
19280I344534J77142R0955J30294J54459K03096K35921J07803J07188J13335J59930
$$ y = [4177334, 4291069, 4596517, 4754320, 4951076, 5161706, 5225186, 5142355, 5007747, 5101178, 5283047, 5401679, 5673656, 6026709, 6284749, 6410322, 6409429, 6351249, 6067832, 5859135, 5762692, 5686417, 5775644, 5920175, 6140220, 6180094, 6200129, 6072372, 5877200, 5692737, 5594648, 5622460, 5737289, 5790273, 5680233, 5608644, 5722718, 5767411, 5827974, 5936460, 6098752, 6220561, 6345899, 6385504, 6489355, 6638947, 6686827, 6747867, 6840689, 6926253, 7031405, 7112066, 7174237, 7277483, 7378309, 7475884, 7556777, 7645691, 7793561, 7989571, 8228119, 8268865, 8282072, 8359685, 8450986, 8561363, 8762764, 8949197, 9137147, 9231901, 9344534, 9521676, 9612631, 9742925, 9897384, 10100480, 10336401, 10444204, 10551392, 10664727, 10824657]
19270A0824657K46015J26597N4733K11732K17778R1660K45988K18769K32999K16086
19260A2687014M40939M25456J11386O9595L69968K99938L84344K06782J73851
19251A5169273K50845M26206M07058L39703L25897L10264L27306L47780M48599
19242A8352931M22593L56912L76551M39722K86497M24370N86162O50252N99163
19233B2495153N93421N98838M47215O54225P44852O35509P06642O34663O48717
19224B8159235P85982Q36873Q56262Q99779P78815Q79431R77783J072932J042753
19215C6289845Q38524J010294R70020J171094J191283J205795J328986J474817
19207D5480658J489505J436030J549535J576729J685456J804917J828595J866568
$$ y = [10824657, 11070672, 11197269, 11252002, 11463734, 11681512, 11773172, 12019160, 12237929, 12470928, 12687014, 13127953, 13553409, 13664795, 13734390, 14104358, 14404296, 14788640, 14995422, 15169273, 15420118, 15846324, 16253382, 16593085, 16918982, 17229246, 17556552, 17904332, 18352931, 18775524, 19132436, 19508987, 19948709, 20235206, 20659576, 21245738, 21895990, 22495153, 23088574, 23687412, 24134627, 24788852, 25533704, 26169213, 26875855, 27510518, 28159235, 28945217, 29782090, 30638352, 31538131, 32316946, 33196377, 34174160, 35247092, 36289845, 37128369, 38138663, 39108683, 40279777, 41471060, 42676855, 44005841, 45480658, 46970163, 48406193, 49955728, 51532457, 53217913, 55022830, 56851425, 58717993]
19199E8717993J785772J991977K231532K111047K160673K306967K369829K592479
19191G6268269K751979K727298K730352K909544K958961K959051L151974L138926
19183I9596354L157598L285971L393691L368784L299741L167326L188566L216934
19175A25674965L103221K988357K998318K830316K675352K512286K198245J837992
19167A46819052J613745J273345J044720P60149N26484J03698k39873p38112j003014
19158A50160194j370138j597407j869320k050653k327118k736174k876226k950936
19150A32382222l071010l008212l163526l142916l278576l408336l412475l299169
19142A06598002l255730l147448l075944l054950k915117k825175k993209k909775
$$ y = [58717993, 60503765, 62495742, 64727274, 66838321, 68998994, 71305961, 73675790, 76268269, 79020248, 81747546, 84477898, 87387442, 90346403, 93305454, 96457428, 99596354, 102753952, 106039923, 109433614, 112802398, 116102139, 119269465, 122458031, 125674965, 128778186, 131766543, 134764861, 137595177, 140270529, 142782815, 144981060, 146819052, 148432797, 149706142, 150750862, 151511011, 152037495, 152141193, 151901320, 151163208, 150160194, 148790056, 147192649, 145323329, 143272676, 140945558, 138209384, 135333158, 132382222, 129311212, 126303000, 123139474, 119996558, 116717982, 113309646, 109897171, 106598002, 103342272, 100194824, 97118880, 94063930, 91148813, 88323638, 85330429, 82420654]
19134H2420654k574693k665624k465281k320676k378455k281041k164796k061272
19126F3508816k021271j942288j775969j721689j692575j623347j561175j510082
19118D9660420j442856j480755j422417j103220j091172j167322j113838j085003
19110C9753837j086457j141834j087658j029249q35263p93064q05067q88978r87386
19101C1098881q79802q09027p21698n90676n91134o44619o22565n04937m68569
19092B5265854n78229m50978l83542l68513l88589k53465q0589M7288j91848n96094
19082B2021295n11451j28618J6295j89384l26374j29398j29301k89119m07925
19073A9926020l16286J1494J57417j87769l21554o9046J50505P2629j39839K4340
$$ y = [82420654, 79845961, 77180337, 74715056, 72394380, 70015925, 67734884, 65570088, 63508816, 61487545, 59545257, 57769288, 56047599, 54355024, 52731677, 51170502, 49660420, 48217564, 46736809, 45314392, 44211172, 43120000, 41952678, 40838840, 39753837, 38667380, 37525546, 36437888, 35408639, 34573376, 33780312, 32975245, 32086267, 31098881, 30219079, 29410052, 28688354, 28097678, 27506544, 26861925, 26239360, 25734423, 25265854, 24687625, 24236647, 23853105, 23484592, 23096003, 22842538, 22761949, 22809237, 22617389, 22021295, 21509844, 21381226, 21397521, 21208137, 20881763, 20752365, 20623064, 20333945, 19926020, 19609734, 19621228, 19778645, 19590876, 19269322, 19200276, 19350781, 19423410, 19283571, 19307911]
19063A9307911L61999P40535O08158K16495M54676O26004N73490L50840M38521
19054B3678629Q01051R72852J066206J067669J394599J842572K696950L915939
19046C7436467N578666Q367836J2808886K0308204L2534330N2668168P7446080
19039B47148637N5356366j6744702k0486508J7018855N2801715J7992085l9447543
19032C13638905j5979942L2924856L9925406l3296094m6740816q189183L0437043
19025C12720175O316309o9787935p5488561n2531456l3051992k0384476j3289055
19018E4503009r223510o517818m883046l894373l084171k458103j827772j581136
19010B1033080j605588j552667j255803r11126q39612q94638p82646o97428q06248
$$ y = [19307911, 19669910, 20410445, 21018603, 21235098, 21689774, 22315778, 22889268, 23240108, 23678629, 24479680, 25452532, 26518738, 27586407, 28981006, 30823578, 33520528, 37436467, 43015133, 51382969, 64191855, 84500059, 117034389, 169702557, 247148637, 302505003, 285760301, 265273793, 282292648, 335094363, 353086448, 313638905, 297658963, 330583819, 370509225, 337213131, 290472315, 282283132, 312720175, 319036484, 249248549, 173759988, 121228532, 88176540, 67792064, 54503009, 45279499, 38761681, 33878635, 29984262, 26900091, 24441988, 22614216, 21033080, 19427492, 17874825, 16619022, 15707896, 14868284, 13973646, 13191000, 12493572, 11687324]
19001A1687324o44872o65020n33500n08026m12488k80697j44649k378L8253J67100
18991H701047m4253k37630j86457j1081J38191j22013k40411l9375O6262k1448
18981H002832l99085j72453Q3083J01768l32343n85372n04580l41667k52679j28030
18971E471474k00795j50723r2725o5579J5332j5125q7621j13138j513m8826n9462
18960D651299k8315j33239j39988k2867j19577j04728Q7071O8778p304Q776p6479
18949D183427l8688K2078L4191q9252j9023L9228Q0139Q0756n6808q6500Q2159
18938D231707K77781J77541R5032K32838M12444M56524M90530N84100P62941P33111
18928H454549M61312L68452L25164M65749L88189J66253p625J6248l1140j09472
$$ y = [11687324, 11042452, 10377432, 9843932, 9335906, 8923418, 8642721, 8498072, 8495694, 8533947, 8701047, 8656794, 8419164, 8232707, 8221626, 8359817, 8237804, 7997393, 7958018, 8024280, 8002832, 7603747, 7431294, 7514377, 7616145, 7283802, 6698430, 6193850, 5852183, 5599504, 5471474, 5270679, 5119956, 5027231, 4961652, 4976984, 4961859, 4874238, 4761100, 4759587, 4710761, 4651299, 4622984, 4489745, 4349757, 4326890, 4207313, 4102585, 4189656, 4258434, 4251130, 4259906, 4183427, 4144739, 4166817, 4201008, 4111756, 4092733, 4131961, 4212100, 4292856, 4236048, 4149548, 4231707, 4509488, 4687029, 4782061, 5014899, 5427343, 5883867, 6374397, 6958497, 7721438, 8454549, 8915861, 9284313, 9609477, 10075226, 10463415, 10629668, 10622043, 10638291, 10607151, 10497679]
18918A0497679j75481k75653l78359n23930n22935p04425p99699o41917n11513
18909E963767m45197l53448m81087l87025j76362r5464k27280k20778k15946j80193
18899C180987o3021o8999j9588j31004j40825n8013j12912l7485J16298j72881
18889B492557j47826j15367R3315P6701o3830Q826L8018M441p0471j2812p6800
18878B226752j8114J08405K6429q917j51679r4438o0960l118p505L3392J6592
18867B066839j26344p8699r2934Q6438J21851J26720j3204j41386q0205j11206
18857A757870r625m5220r446M3394j0958j3300Q774M7168m593l665J5433n9083
18845A716749j263L6219r4006J44458J32328L4605q6655j37576n3998M3949k5292
$$ y = [10497679, 10322198, 10046545, 9668186, 9144256, 8621321, 7916896, 7117197, 6475280, 5963767, 5518570, 5165122, 4684035, 4297010, 4120648, 4025184, 3797904, 3577126, 3361180, 3180987, 3117966, 3048967, 3029379, 2898375, 2757550, 2699537, 2586625, 2549140, 2665438, 2492557, 2344731, 2229364, 2322679, 2399380, 2335550, 2344376, 2382394, 2386835, 2316364, 2303552, 2226752, 2208638, 2317043, 2343472, 2334555, 2182876, 2088438, 2027478, 2024360, 2016855, 2050247, 2066839, 1940495, 1861796, 1768862, 1855300, 1977151, 2103871, 2090667, 1949281, 1869076, 1757870, 1748245, 1703025, 1693579, 1736973, 1726015, 1712715, 1721489, 1768657, 1764064, 1760399, 1775832, 1716749, 1715486, 1751705, 1657699, 1802157, 1934485, 1969090, 1882435, 1744859, 1690861, 1734810, 1709518]
18834A709518l2607M1421P0686M7240J1506l2040m4003p7345N6784j7557J42200
18823A875803J23161m1658k0312l1261O4545m5405r2170l6561l2398K8538O7884
18812A860166l9307l2312M5337o566p6626L8996m4715q1322p3362J3899J34840
18801A739028L9547k2276o7468l0489N3108R8765n5187j12659L3684p158q9752
18790A579143k9084R3862J12654P8871L8108j8126n3825J30394L4573L7293m5567
18779A958296J8922Q4795J9567P9312J61856L17075M50244K08507j95220k46797
18769B856557j13987j63987l3991J79416L37094P13861M95031J23699j87626m79899
18759C726168l64582j08039R6594J26903L81288M22332N68871J90905j27130k11928
$$ y = [1709518, 1676911, 1718332, 1789018, 1836258, 1847764, 1815724, 1771721, 1694376, 1751160, 1733603, 1875803, 1998964, 1957306, 1936994, 1905733, 1970278, 1924873, 1832703, 1796142, 1763744, 1792282, 1860166, 1820859, 1788547, 1833884, 1827318, 1750692, 1789688, 1744973, 1663651, 1590289, 1604188, 1739028, 1778575, 1756299, 1688831, 1658342, 1711450, 1810215, 1755028, 1642369, 1676053, 1668895, 1579143, 1550059, 1643921, 1756575, 1835446, 1873554, 1855428, 1801603, 1931997, 1966570, 2003863, 1958296, 1977218, 2062013, 2081580, 2160892, 2322748, 2639823, 3090067, 3298574, 3103354, 2856557, 2742570, 2578583, 2544592, 2724008, 3061102, 3774963, 4269994, 4393693, 4206067, 3726168, 3361586, 3253547, 3350141, 3477044, 3858332, 4280664, 4849535, 5040440, 4913310, 4701382]
18749D701382q0969r5252K7882K51523M63776M32217M42821M75953J23492k41616
18739F501209j21913M9041M57075P69720Q99523J259658J429371J184217O85927
18730A3113828L11992J15511K54936P71080J010314J315567J958351K477193K552856
18721B3881628K224344K010694K467608L779001N891421R434041J5314077K4954921
18713H9957735M0609485O5284377P5387686k566972o2257981m8879076k4871505
18706A32663749l122010J7169535M1209953P5114659J08322866P3235080L58446
18699D44952278q3452923j05257954p1679191l9742251j5323881L896647K3974438
18692A57367163N0203853N9146221j7068420p1688405n7603992l7554578k2705440
$$ y = [4701382, 4620413, 4525161, 4553043, 4804566, 5268342, 5700559, 6143380, 6619333, 6742825, 6501209, 6379296, 6428337, 6885412, 7655132, 8554655, 9814313, 11243684, 12427901, 13113828, 13425820, 13541331, 13796267, 14567347, 15577661, 16893228, 18851579, 21328772, 23881628, 26105972, 28116666, 30584274, 34363275, 40254696, 49688737, 65002814, 89957735, 130567220, 195851597, 271239283, 268672311, 206414330, 157535254, 132663749, 129541739, 146711274, 187921227, 263035886, 371358752, 444593832, 444952278, 361499355, 256241401, 184562210, 144819959, 129496078, 133392725, 157367163, 207571016, 266717237, 249648817, 177960412, 120356420, 82801842, 60096402]
18685F0096402j4227137r694679p019552n034910l624842k563161j790088j406452
18677A4735581j365705j297846j061433j130530j206535q26006o32979l80259
18669F834288k26970j98902j19238j91774n25061n43901l58860k64088k58235
18660D147259j64805J03572L15194K67126N8362j76513m71527m75461l01063k21979
18650C080165j40377m7450J72521K54895o5582j20718j49425k59744j86615k51449
18640B286221k49619r593J0619J1996n814j3791m9953k04577j56846j07067J3295
18629A524871j38088j03207j0505p9209K2797l6371m1818M854j03703j33058L0341
18618I36904K486j3680m32k0587J01757j0375j5077p8229r3886q1879M2489j7360
$$ y = [60096402, 45869265, 36174586, 29155034, 24120124, 20495282, 17932121, 16142033, 14735581, 13369876, 12072030, 11010597, 9880067, 8673532, 7847526, 7214547, 6834288, 6607318, 6408416, 6289178, 6097404, 5572343, 5028442, 4669582, 4405494, 4147259, 3982454, 4086026, 4401220, 4668346, 4726708, 4550195, 4078668, 3603207, 3302144, 3080165, 2939788, 2892338, 3064859, 3319754, 3254172, 3133454, 2984029, 2724285, 2537670, 2286221, 2036602, 2027009, 2037628, 2049624, 2043810, 2030019, 1980066, 1775489, 1618643, 1511576, 1524871, 1386783, 1283576, 1273071, 1193862, 1216659, 1180288, 1138470, 1143324, 1039621, 906563, 936904, 939390, 925710, 925278, 904691, 1006448, 996073, 980996, 902767, 808881, 727002, 769491, 752131]
18606G52131L7668l9706J1517l4968j3140N2534N0387J06659m5639l8965K4333
18595H62811K6874L2170j26881j10517K3083L7535m0721o8367P5885L1089q7009
18584F55952m5567N6640L9993O0938K4094j8333l7532n556o2399q7310l6352k558
18572E42010J3101N990J53811q088j41379J5019Q5718l5727o0221r6287J7054
18561D91001M6688Q8078P7926j7879j50070j4818J14731P4513L2030l646j8203
18550G20351r63k7665O1081L689j37748L339k3844n9447n3594L2774J8210j5456
18538E20727K1386q88O5984M609p681n6510P2344N5913j47008j33290p4124M5334
18526C66796O3599k2811k3424L9978L7711R2850J14100n8323q8184J0587j23908
$$ y = [752131, 789799, 750093, 761610, 726642, 713502, 766036, 816423, 923082, 877443, 838478, 862811, 889685, 921855, 794974, 684457, 707540, 745075, 704354, 635987, 711872, 742961, 655952, 610385, 667025, 707018, 767956, 792050, 773717, 736185, 730629, 668230, 580920, 544568, 542010, 555111, 561101, 714912, 706824, 565445, 580464, 666182, 630455, 570234, 473947, 491001, 537689, 625767, 703693, 685814, 535744, 520926, 635657, 710170, 742200, 738554, 720351, 719388, 691723, 752804, 756493, 618745, 622084, 598240, 538793, 485199, 517973, 536183, 520727, 542113, 541225, 607209, 611818, 604137, 547627, 619971, 675884, 528876, 395586, 321462, 366796, 430395, 407584, 384160, 424138, 461849, 554699, 668799, 610476, 522292, 532879, 408971]
18515D08971n624l0250q9736K892l8712R894K3550k7759p5679P2642J31560L9766
18503D21515n9184o5914K4528K2017j11248p5076O2973P700J28075J13875k2651
18492D46610p3869j11201j26600L0849K8163L6028J7057j7009M1272j0096p0644
18481A90560N2289o9430N0313R2080p5968J1503k0490k7952M8993Q4693J45661
18470D82252m0212j39194j73516O795L0710o4455q5458m8384J15435J43659J16558
18459C44190J8928j01655m733Q720N9023K3463m4415K1916M4947J1706J6280Q5800
18447D84170j7135j16778n5016K5629N1916m193N9280p769l6652l6758q180j1506
18435C27008j402q0285L1841q9449p0895j6890K5882J55361J25495q2525n406
$$ y = [408971, 403347, 373097, 283361, 286253, 247541, 257435, 280985, 253226, 177547, 250189, 381749, 421515, 362331, 296417, 320945, 342962, 231714, 156638, 219611, 227311, 355386, 469261, 446610, 372741, 261540, 134940, 165789, 193952, 229980, 247037, 230028, 271300, 261204, 190560, 242849, 173419, 223732, 315812, 239844, 251347, 230857, 202905, 251898, 336591, 482252, 442040, 302846, 129330, 136125, 166835, 102380, 16922, -31462, 83973, 227632, 344190, 363118, 261463, 256730, 265450, 324473, 347936, 303521, 325437, 370384, 382090, 398370, 484170, 467035, 350257, 295241, 320870, 372786, 368593, 427873, 420104, 383452, 346694, 338514, 327008, 325606, 245321, 277162, 187713, 116818, 99928, 125810, 281171, 406666, 324141, 318735]
18424C18735J102K9061j04645j95048M9413J82574m0616L7077K3445L1630n0542
18413B82186q4792L577N1308P6832O0249J0570K5762M3325q9172K7824J07655
18402E15324J57800J57025J83692J54573K26328R4115K1662P4171K8033J04043
18392A716766O6159n6494k8689J70814K08853n5387k20231n6374k12783j57754
18382A374880l32343j90024j50845j01495p1264r4256j21059r1609n1560N4690
18372B25115O1767l4394K3884k7353p0927r3863l8367N4424Q4844P2096j7232
18361B39994O0O859q3440j8769n811P7002L4435q018n5622r8622J94818Q7230
18349C70116o7457j32053J432P833N7737L7165Q7244R8850K5381q2796j45433
$$ y = [318735, 319837, 348898, 244253, 49205, 98618, 281192, 240576, 277653, 301098, 332728, 282186, 197394, 200971, 252279, 329111, 389360, 399930, 425692, 469017, 379845, 407669, 515324, 673124, 830149, 1013841, 1168414, 1394742, 1488857, 1510519, 1584690, 1612723, 1716766, 1782925, 1726431, 1697742, 1868556, 2077409, 2022022, 1801791, 1745417, 1532634, 1374880, 1042537, 852513, 701668, 600173, 528909, 434653, 313594, 221985, 170425, 225115, 286882, 252488, 276372, 249019, 178092, 84229, 45862, 100286, 185130, 257226, 239994, 240054, 246913, 163473, 144704, 138893, 215895, 250330, 242312, 186690, 88068, 282886, 370116, 302659, 170606, 172038, 179871, 237608, 274773, 362017, 460867, 486248, 403452, 258019]
18338B58019L6932O3527r7828M6831o4415Q1338J8769r0687J6378k605r5988m9025
18326A21246q6387p7851L1238J12061J16665N7879j22068j21187q5826j7644J39510
18315F7636J57396m774P8430O9806j34670l5760j07716n4673r0286M4800L5969
18304B6158L7880j16101k001P6772O8920L0663m0937Q0631N9918o349n2261j0855
18292A52438M0091j973K7787m3979n8057p2201J17080P827j21919R2530K7863
18281A67487m909j6315J8401O1411O895p9017n0566P0470N9437j4799j5073r4492
18269A08930K1367o3613j54574K8907R3642J14850K4609J1963q037Q543J08609
18258B95196J10486j11007j19014j36375l3932k7749o7160P4563J19913J4402
$$ y = [258019, 294951, 358478, 260650, 307481, 243066, 324404, 343173, 252486, 268864, 266259, 170271, 121246, 34859, -42992, -11754, 100307, 216972, 274851, 152783, 31596, -54230, -71874, 67636, 225032, 220258, 298688, 368494, 233824, 198064, 90348, 35675, -54611, -9811, 26158, 64038, -52063, -54064, 22708, 91628, 122291, 81354, 161985, 221903, 215554, 163293, 152438, 192529, 190556, 218343, 174364, 116307, 44106, 161186, 169013, 47094, 139624, 167487, 162578, 146263, 164664, 226075, 232970, 153953, 103387, 173857, 233294, 218495, 203422, 108930, 130297, 66684, -87890, -58983, 34659, 149509, 174118, 186081, 178044, 186587, 295196, 405682, 294675, 175661, 39286, 5354, -22395, -89555, -14992, 104921, 119323]
18248A19323l3613l8931j00986K0868J7541P1687R0496n2183m1105P5377k754
18237A25720k3846J9167r211k6229K0411M0585m3250L8741L5987Q7132R203q756
18225B65654l1499o3526j8299J3257j6790q1977l9751N1541O1024q88q66k1467
18213A16413l9734m2920o7735j07381K7604k9015P4626K7053k802M5681M6159
18202D7949J14669k0375R4193k6163n9533k0105L2036M7945P5646j77702j18241
18191i681l0587j1935M3592R0956L2277j8322K865o9905N9245L6542j885J9125
18179A42287j7238j6751l9786J400J3312r3148j7927P7571P5820j07081J9357
18168C7816N9267L0928p3735j41180m7513P7680J7613L822n437q752j1769l3557
$$ y = [119323, 85710, 46779, -54207, -33339, -15798, 55889, 146385, 94202, 53097, 128474, 125720, 101874, 121041, 111830, 85601, 106012, 146597, 103347, 142088, 178075, 265207, 274410, 265654, 234155, 170629, 152330, 165587, 148797, 66820, 27069, 78610, 139634, 138746, 137880, 116413, 76679, 33759, -33976, -141357, -113753, -142768, -68142, -41089, -43891, 1790, 47949, 162618, 142243, 236436, 210273, 150740, 130635, 162671, 210616, 286262, 108560, -9681, -40268, -52203, -8611, 82345, 114622, 96300, 99165, 29260, 88505, 125047, 123162, 142287, 125049, 108298, 68512, 69912, 83224, -9924, -27851, 49720, 125540, 18459, 37816, 97083, 128011, 54276, -86904, -134417, -56737, -39124, -35302, -40739, -49491, -61260, -94817]
18156i4817Q744P9900J21079q147J08783N6463j30008m1976m4772K227J17676
18145A75152Q7881j11922P203o9123l2703M6008Q537r8347L1904J30590M9189
18134B24369r9746j67513k5042J40911N0014M8282j11277k17993k2168K4312N9274
18123i6577J4644P2381N5486J12221L1807J0027Q7632K8543J18823J1192j38918
18112C07261n1829M2312K7733j03349K732q9404r7889j1246P7721n4745m4350
18101D947M0361Q4458m9816N1217N5813J729k5717p0197Q512j05384p2827J08132
18089C1228O4543n5734L7777K0796O7484L9091j63176J86P3174P04o8277J180
18077D8976L0104q706Q1009J76912J65917J25712L6671J8297R6346K40295J97850
$$ y = [-94817, -86073, -6173, 114906, 106759, 215542, 272005, 141997, 100021, 55249, 57476, 175152, 263033, 151111, 158314, 89191, 56488, 102496, 111033, 12686, 44590, 175180, 224369, 124623, -42890, -67932, 72979, 122993, 171275, 59998, -157995, -180163, -155851, -96577, -81933, -9552, 45934, 158155, 189962, 199989, 287621, 316164, 434987, 446179, 307261, 255432, 297744, 325477, 222128, 224860, 135456, 37567, 26321, 104042, 49297, 4947, 45308, 129766, 79950, 131167, 186980, 188709, 162992, 92795, 101307, -4077, -76904, 31228, 95771, 40037, 77814, 98610, 166094, 205185, 42009, 42195, 115369, 116073, 47796, 48976, 79080, 70374, 151383, 328295, 494212, 619924, 656595, 674892, 771238, 1011533, 1209383]
18066A209383r1986j77003l2406J19417O9638K00237K15314K41381K05455J04338
18056B063768O914k07850l58470k81037k34007j33991l1892O5100J56468J09363
18046A154366r5973n9441r3149j41770p7404q8771j27569j98687l661r3355j02433
18035G2153q9550R2880N0830L1830M5173K7397K6594o5527r1353q0508p2978M4048
18023i011p1722o2185K0173P7617o3691J7564O1852Q464J5431m2925j3117q877
18011g0427k2118r0616l3256j079l2418K6232k5405R4395J62626L7097q6620J09300
17999F7711J56852j28003j34335m1155j349K1875M2531q5884k5377P7726J7964
17988c1444o0848K8258r284j4692J16644L2221o1371J0760J32093K2828N5428
$$ y = [1209383, 1117397, 940394, 907988, 1027405, 1097043, 1297280, 1512594, 1753975, 1959430, 2063768, 2070682, 1862832, 1504362, 1223325, 989318, 855327, 823435, 888535, 1045003, 1154366, 1058393, 998952, 905803, 764033, 686629, 597858, 470289, 271602, 267941, 174586, 72153, -17397, 75483, 126313, 158143, 203316, 230713, 257307, 191780, 100427, 19919, -53059, -9011, -80733, -142918, -122745, -45128, -108819, -91255, -29403, -20939, -5508, -48433, -61550, -70427, -92545, -183161, -216417, -217496, -249914, -223682, -249087, -154692, 7934, 45031, -41589, 67711, 224563, 96560, -37775, -78930, -80279, -58404, -15873, -101757, -127134, -49408, -31444, -92292, -64034, -73318, -88010, 28634, 60855, -516, 10244, 142337, 165165, 220593]
17977B20593j16864j1208O5724p5067J2190p795p705n9305K7687K3244p1391n3255
17965e3152j9763J2577O1410J0746o7758J5157p7734j20021M3804J73972m154
17954b4916l4823J894k1438j5917j14164N2489R4775J8509R3403O9407m6757n3775
17942A8687k7554l5887P0845m8847n3992m714k4912J26081Q3128M376o4960p9921
17930c7670n6567R0667Q1564J84601l7587l7359j6168j2692M5213M1889j15148
17919A30743j67497j2658m317J00290L3609m9433j00268j05281n3473R8504M4974
17908h4807m6559r91K0914O3376K1710l097O6227p5945q2873L3239N607o3528
17896a46727K9789J5151j0693n4576L6906P4589J5402M5191N1542Q0565L0819
$$ y = [220593, 103729, 92521, 158245, 83178, 95368, 87573, 79868, 20563, 48250, 71494, 103, -53152, -72915, -60338, 1072, 11818, -55940, -40783, -118517, -238538, -194734, -20762, -24916, -59739, -57845, -79283, -95200, -209364, -156875, -62100, -43591, 49812, 119219, 72462, 18687, -8867, -44754, 26091, -22756, -76748, -81462, -106374, 19707, 102835, 107211, 42251, -37670, -94237, -3570, 77994, 262595, 225008, 187649, 171481, 158789, 204002, 245891, 130743, -36754, -49412, -53729, 46561, 80170, 30737, -69531, -174812, -228285, -129781, -84807, -131366, -132357, -111443, -48067, -26357, -29454, 36773, -39172, -122045, -88806, -83199, -146727, -116938, -101787, -112480, -167056, -130150, -55561, -40159, 5032, 56574, 137139, 167958]
17885A67958n8758r8193J727N9957J1890r4158L8730q967L3542n2971j7074j21101
17873a37418q1514O3893P4677Q8549k4443M5725M6232p1374J569j22161r6706
17862b12971N7499J20419l5907q6605q4047Q4306L2963K0004J26560O5587q9077
17851a269q5430j1878n2657j8873k577L7804K2876M3822J18756r544r5331p8502
17839a32803J2931J67869j6327M1046j3031q1316K3510N1835P3389L1803L6146
17828A95052n8845J09037K1570j47860o2151j05515R168r0659m76J64506L7431
17817G1258L3678M1246Q3829j29923j49949m0754J15052P1956R26j5122L6974
17806A19171k5823n7184m8327O5078k4475n7453J2630R2632M5013P904p0825R5685
$$ y = [167958, 109200, 11007, 12734, 72691, 84581, -9577, 29153, 20186, 53728, 757, -16317, -137418, -218932, -155039, -80362, 8187, -16256, 29469, 75701, 4327, 5896, -116265, -212971, -155472, -35053, -70960, -157565, -241612, -157306, -124343, -104339, 22221, 87808, -1269, -86699, -98577, -151234, -170107, -172684, -134880, -112004, -68182, 50574, 41030, -54301, -132803, -119872, 47997, 31670, 72716, 59685, -21631, 1879, 53714, 127103, 158906, 195052, 136207, 245244, 266814, 118954, 56803, -48712, -39544, -130203, -130679, 33827, 71258, 104936, 146182, 230011, 100088, -49861, -90615, 24437, 96393, 97319, 82197, 119171, 93348, 36164, -12163, 52915, 28440, -29013, -16383, 76249, 121262, 129166, 58341, 154026]
17794A54026k231p0282K6476j11991r3907l7364M9613K5790j4101M043n4270J23587
17782f11j395k6913N9158J13348P0299k0397j33353j05886q5113L4350J01371
17771D858j3195o8719q4823J8445q510n6143Q0950L7866Q725M382k3885P8199
17759b1850J3119P5715o2257n3342r4751l6987N7922n2907Q1387p366K8933J29230
17747E6846J15873J2828p1382q0988k3395m5485N3469R3636P9156m0026m5372
17736A05160J0071M684l3990M757L6487l0482r3140p1722k6760R5228J5644p0719
17724e4782J2844Q2206J18804m7192q4238N3114n6713j11857M4214m5464j4544
17713a03608M0078n4144J8181R152m2472O1522O2193k8937n0815L2299K55124
$$ y = [154026, 151795, 81513, 107989, -4002, -97909, -135273, -85660, -59870, -73971, -69928, -124198, -611, -2006, -28919, 30239, 143587, 213886, 193489, 60136, -45750, -130863, -96513, 4858, -8337, -77056, -161879, -143434, -151944, -208087, -127137, -89271, -80546, -76164, -100049, -21850, -8731, 66984, 4727, -48615, -143366, -180353, -122431, -175338, -93951, -101317, -72384, 56846, 172719, 185547, 114165, 33177, 9782, -35703, 17766, 111402, 190558, 150532, 105160, 115231, 119915, 85925, 90682, 127169, 96687, 3547, -68175, -94935, 293, 15937, -54782, -41938, 40268, 159072, 111880, 27642, 80756, 24043, -87814, -43600, -89064, -103608, -63530, -117674, -99493, -90341, -132813, -71291, -9098, -38035, -88850, -56551, 198573]
17702A98573Q9190j08094j52985j05816O5575N6545J8979M6265J46676j5753J4321
17691B53476N1027J33885J39306J72027L03031J34998N3645J5759j0972P8146
17681A324328J42604J08015n3041j90189r1369k7670J45546J74311L8121k1427
17671A549229N710J6963l5283k61929l60543j91784j99760k00071K2512o9514
17661B75530j69434O6470j3221p2849j04260j3869Q5591P5038N254M0396o9083
17650A05563m9414K403M139J085R2601J54483M1836r8565q6321p5799P407m7815
17638E1603P1139J17302J3678k87741j75758j5340l582J30150l620K0263J30545
17627D8639O9978j1654N7986l6231q3577J32669K6804j17057N5683M5595j18244
$$ y = [198573, 287763, 179669, 26684, -79132, -13557, 42988, 61967, 108232, 254908, 239155, 253476, 304503, 438388, 577694, 749721, 1052752, 1187750, 1241395, 1257154, 1246182, 1324328, 1466932, 1574947, 1521906, 1331717, 1240348, 1212678, 1358224, 1532535, 1570656, 1549229, 1554939, 1571902, 1536619, 1274690, 914147, 722363, 522603, 322532, 345044, 275530, 106096, 172566, 159345, 86496, -17764, -31633, 53958, 128996, 134250, 174646, 105563, 56149, 58552, 62691, 63776, 156377, 310860, 352696, 254131, 167810, 92011, 99418, 51603, 122742, 240044, 253722, -34019, -209777, -225117, -228699, -98549, -102169, -81906, 48639, 118617, 106963, 164949, 128718, 45141, 177810, 204614, 87557, 143240, 188835, 70591]
17616G0591j48413K9959P4428k0772o9623n9484MN5210J18121J56496n5948j24750
17604B5819J2669R0572M6414n1212q3315l3006L087O3620o7875J9148l0699l1298
17592c6076m4257L8907Q1001N4859q7066l5693J63867J15210q8477K5541j042
17581A86774j31749j16171J21198J28116m3911j22327r8001m7626j3129L9229
17571i7597J44641r3362N5111m4185j05314M3918K7317k7906l5508P0293J04198
17560D1606P774p3110m1278J447k3550N1139P8964Q9853q4282j4400m259J0362
17548D0266k10711j7975R1421K8104R1716R4200R4360j05110j20710R1193J05918
17537A82672k7663m4050l6118P4623J58164p3708m4498L4929J8871j37556j60528
$$ y = [70591, -77822, -47863, 26565, 5793, -63830, -123314, -123310, -68100, 50021, 206517, 150569, 25819, 38488, 129060, 175474, 124262, 40947, 7941, 11028, 74648, 6773, 25921, -4778, -36076, -80333, -41426, 39575, 94434, 7368, -28325, 135542, 250752, 162275, 187816, 186774, 55025, -61146, 60052, 188168, 144257, 21930, -76071, -123697, -136826, -97597, 47044, -46318, 8793, -35392, -140706, -96788, -69471, -97377, -132885, -62592, 41606, 49380, -23730, -65008, -63561, -87111, -35972, 42992, 132845, 48563, 34163, 29904, 40266, -170445, -188420, -96999, -68895, 22821, 117021, 211381, 106271, -14439, 76754, 182672, 155009, 110959, 74841, 149464, 307628, 233920, 189422, 224351, 243222, 105666, -54862]
17526e4862J1525p2813J3773K4419J32740J48409k7622j05112p4306O3568P4381
17515A34100m3358l462q8018l3447J00320k5479r0263J8853p5534r980n8019J18809
17503e5478R2177k0903K8050P0141O2574k9367n6395r704L6077j6562R05p5048
17491B6467j8231j32265K1330R9543J25208M9212p6173j56024q0590J09730J8318
17480a3475L4542o9009R0272R3571Q1916n4162l205J4144O678j9255j4447o5558
17468H2012l2569o525N7372O2515j00775o7724K6523M1714J0984j00297m7251
17457g4021P0393J8007l6178n901p4403q4128O0401O3658O3108j9024Q2706J66210
17445B30828K365j80650j07582l1369m4193k4834p3196j04878N9106K50354J26575
$$ y = [-54862, -43337, -116150, -102377, -77958, 54782, 203191, 175569, 70457, -3849, 59719, 134100, 90742, 87280, -738, -34185, 66135, 40656, -49607, -30754, -106288, -116268, -174287, -55478, 36699, 15796, 43846, 113987, 176561, 147194, 90799, 81095, 117172, 100610, 101515, 26467, 8236, -124029, -102699, -3156, 122052, 171264, 95091, -60933, -141523, -31793, -13475, 21067, -47942, 42330, 135901, 217817, 163655, 160450, 174594, 181272, 162017, 147570, 82012, 49443, 42918, 100290, 162805, 62030, -5694, 20829, 62543, 73527, -26770, -74021, -3628, 14379, -21799, -27700, -102103, -186231, -125830, -62172, 936, -18088, 64618, 230828, 233193, 52543, -55039, -86408, -130601, -155435, -228631, -333509, -274403, -24049, 102526]
17434A02526q5720o678r7589q4567k5270J7621N489J79561N4016q8764l2531O4423
17422B517L9552m3590r0871k2753L4084J36844J66042L9293j7547j5848p6791
17411A50932l3714L0032j17017m7326l9046L6002K9665j07191j2076R2273L5384
17400A7918J45848J49742j1760r2915j05707J00913M6147o5531j6835O1892L3043
17389B62755k4190j73565J0627R6392P4301J5807m8371r400l7614L453M780J36140
17377C11115K4294J4080K3545l5610k2745m0998n0095q4185k850p1009Q2100O5209
17365B12851n2426k5917j02215k3537R3038n1197J8797K8484N2610m5558q0461
17354B4469O468J9149k7772N0647o5888O547J8534j8867l4821o0183r489j1254
$$ y = [102526, 16806, 10128, -87461, -172028, -197298, -179677, -174188, 5373, 59389, -29375, -61906, 2517, 42069, -1521, -92392, -115145, -81061, 55783, 221825, 261118, 243571, 227723, 150932, 117218, 147250, 30233, -17093, -56139, -20137, 9528, -97663, -109739, -17466, 17918, 163766, 313508, 301748, 208833, 103126, 204039, 250186, 184655, 167820, 229712, 262755, 238565, 65000, 75627, 172019, 246320, 262127, 213756, 204356, 166742, 170195, 174975, 311115, 335409, 349489, 373034, 337424, 314679, 273681, 223586, 139401, 136551, 65542, 147642, 212851, 160425, 134508, 32293, 8756, 101794, 50597, 69394, 97878, 150488, 104930, 24469, 30937, 50086, 22314, 72961, 7073, 13620, 32154, 13287, -21534, -81717, -91206, -102460]
17342a02460M6918Q7487q544m2148M4119m870M9547R4925r776n4496m114k293
17330I4295J14395M4142O649K5473M3158j9734p0943P4381k4663q5392j44838
17319E6923k6966O0159J4107n6151j5614l4256K6773N8200q0672p6283P7414o1850
17307e8216r1137P7412J8797P1047P7236N8673L3567k5896Q772O2973K7909j3900
17295B47237r6900j3568l1506m1180L9488k4737J970J6743M7363P1092o2299N8849
17283B12552K2232o4947q0451J0310M0461j13851Q1167L1165q5814r3599L9156
17272a619J06467L9084J7189J55044J9609j28356q2230j6212M6246N6349k8114
17261A83457N3355J53810J03254j07152k0775J23107J38866P1302j66141j13488
$$ y = [-102460, -55542, 31945, 23401, -18747, 25372, 20502, 70049, 164974, 155198, 100702, 96588, 94295, 208690, 252832, 259481, 284954, 328112, 308378, 237435, 311816, 287153, 201761, 56923, 29957, 90116, 104223, 48072, 32458, -1798, 24975, 83175, 2503, -73780, 3634, -58216, -149353, -71941, -53144, 17903, 95139, 153812, 187379, 161483, 170255, 233228, 261137, 247237, 150337, 136769, 105263, 64083, 103571, 78834, 80804, 97547, 144910, 216002, 153703, 212552, 234784, 169837, 89386, 99696, 140157, 26306, 107473, 138638, 52824, -40775, -1619, 104848, 143932, 161121, 316165, 335774, 207418, 125188, 108976, 155222, 211571, 183457, 236812, 390622, 493876, 386724, 365949, 489056, 627922, 699224, 533083, 419595]
17251D19595j71857O1955N9569m8L3347J33896l6469m7721L7876Q7802n8813j9106
17239E00026k2807n4637M419m3198J24776P5322j357r9263m1145M3028o6646j9622
17227C98896K3003k8514j0878L9992Q4227k0711k6523j1660j6026J52529N8933
17216F43268m6586o9146o6027J7939o3292J05292J14128Q4542M435j44441j07113
17205D72999K0564R7121K2057J2920J46983Q2737L6077p137K4989k6670k6436
17194H56204J00393J270K669J16708l841P460J4239M0683J22768J70757N9551
17183A488861K7881R7870M818j4291J26513J78519K73909L76842L34785K01354
17173C097061J80982J78566K21481K58897K72875K42665J58680J85678K71492
$$ y = [419595, 247738, 309693, 369262, 369214, 402561, 536457, 499988, 452267, 490143, 577945, 519132, 500026, 477219, 422582, 427001, 383803, 508579, 583901, 582544, 483281, 442136, 485164, 418518, 398896, 421899, 393385, 382507, 422499, 506726, 486015, 459492, 447832, 431806, 584335, 643268, 596682, 527536, 461509, 479448, 416156, 521448, 635576, 720118, 724553, 580112, 472999, 493563, 590684, 612741, 625661, 772644, 855381, 891458, 884321, 909310, 882640, 856204, 956597, 957867, 960536, 1077244, 1073403, 1080863, 1095102, 1135785, 1258553, 1429310, 1488861, 1516742, 1614612, 1619430, 1605139, 1731652, 1910171, 2184080, 2560922, 2895707, 3097061, 3278043, 3456609, 3678090, 3936987, 4209862, 4452527, 4611207, 4796885, 5068377]
17164E068377L86609N05225M36455L91551O07802O59964M37108J82506N47930
17155I223527P47492O07272M77700L51052Q92914J508366J720914J777010K093684
17146A9399931K840996M066771N606001P912231J1689521J8154449K8977312M6303226
17138A44950438P1729728P5603801N657647l1729096m277997L5046147L1935161
17131C28915829l8280850n4345944k4224564J3326285N1419969N0604010j9419548
17124C07995187l8749950n717978L0912386J0445190o3816106p3059056n1521765
17117A16487908l2917152k0636738j3349236r001951o702172n368761m048935
17110B4462963l151528k552309k036705j756111j546012j295046p30240m32538
$$ y = [5068377, 5454986, 5960211, 6396666, 6788217, 7396019, 8055983, 8493091, 8675597, 9223527, 9971019, 10578291, 11055991, 11407043, 12299957, 13808323, 15529237, 17306247, 19399931, 22240927, 26307698, 31913699, 39825930, 51515451, 69669900, 98647212, 144950438, 216680166, 292283967, 297941614, 266212518, 261934521, 296980668, 328915829, 290634979, 236289035, 212064471, 225390756, 276810725, 327414735, 307995187, 269245237, 263527259, 294439645, 304884835, 241068729, 168009673, 116487908, 83570756, 62934018, 49584782, 40582831, 33880659, 28511898, 24462963, 21311435, 18759126, 16722421, 14966310, 13420298, 12125252, 11395012, 10962474]
17102A0962474q38450r86737q15691n76949l59781m11931l32697l00675l34231
17093F005332m63391k06954r7983j62499k74807k13212j3665m5460O8106N604
17083D601071j36009p6156k87633k87806k59489j88099k48468j86128j55120k79190
17073B496973j23526O580m8504k02755q8059j60088j47709j19785j05778n8445
17063A448904K06N935n1646n5861j29394r8728m5892o7399M320J0438O0459J9649
17051A100991N5808l7029j08368Q074k2297Q9483O3028m308j28872n9933K6909
17040I83486Q6621J32137j7456k1402M7773O0394N8096O0972n332n8017N7796
17029A385068k2783n7198J38163R2111L4381N5202K29027K36693J89454R9164
$$ y = [10962474, 10124024, 9137287, 8321596, 7744647, 7384866, 6972935, 6640238, 6339563, 6005332, 5541941, 5334987, 5237004, 5074505, 4799698, 4586486, 4572821, 4527361, 4595467, 4601071, 4465062, 4388906, 4101273, 3813467, 3553978, 3365879, 3117411, 2931283, 2776163, 2496973, 2373447, 2380027, 2331523, 2128768, 2040709, 1880621, 1732912, 1613127, 1507349, 1448904, 1449110, 1455045, 1403399, 1347538, 1218144, 1119416, 1073524, 1006125, 1010445, 1020883, 1081342, 1100991, 1156799, 1119770, 1011402, 1019476, 997179, 1086662, 1149690, 1145382, 1016510, 956577, 983486, 1070107, 1202244, 1184788, 1163386, 1211159, 1271553, 1329649, 1390621, 1385289, 1327272, 1385068, 1362285, 1305087, 1443250, 1535361, 1569742, 1624944, 1853971, 2090664, 2280118, 2379282]
17019B379282L08461M42072M79971P06117R23509R46864Q97666P90097O51333
17010H525372O44703L04615r5525j36746j22929k9751q3699j78156j15727N3101
17000H765258Q9074J13751j56207n88067p73114o67298p50885j061545r52477
16991D018490q25736o49577m30763k29838k22459k21057j99208j78735p9548K1331
16981A002900K5608p0432q0371K75J5347p2163k01818o408j8863j18101l3348
16970D42626L9853J07265J99009O5850j09040j17750J6107J0215n1139j15658
16960D87338j08735o3620j8422N1857M4659K2407J46640j4074p7060p3382j03759
16949B93849p5385K7674k6959p3926J6033M918l8399J07217N4758p2869J56002
$$ y = [2379282, 2687743, 3129815, 3609786, 4315903, 5239412, 6186276, 7083942, 7874039, 8525372, 9170075, 9474690, 9379165, 9242419, 9119490, 9089739, 9006040, 8827884, 8712157, 8765258, 8854332, 8968083, 8811876, 8223809, 7450695, 6783397, 6032512, 4970967, 4018490, 3192754, 2543177, 2112414, 1882576, 1660117, 1439060, 1239852, 1061117, 981569, 1002900, 1028508, 958076, 877705, 877980, 893327, 821164, 619346, 612938, 594075, 475974, 442626, 482479, 589744, 788753, 854603, 745563, 627813, 643920, 654135, 602996, 487338, 378603, 314983, 296561, 348418, 393077, 415484, 562124, 548050, 470990, 397608, 293849, 218464, 246138, 219179, 145253, 161286, 166204, 127805, 235022, 289780, 216911, 372913]
16938C72913J10476p5321k16310n5474J9764Q6841P6489m6036J36893Q584q9887
16927C28932n5869l7218L4412l1570K3783J443l4995P6441l1310j33317j58560
16916a7828K0241R1512J44161Q1134K9941m788j01385j115p3071n3904N4418n4538
16904A14778m2889L8722j59050j32637j6460J17673M5171n7076N3199J70054l8724
16893I2761L366J7854R461J13705M722J14011M4520n5098j11535j06612o7831
16882E9324J27208P6962k6340k0216o4248j35839n0461J2282K2652p031Q6412
16871H0705Q1768q1172j03871k2773p317O4395Q7537K7858R645j26788j8520r4283
16859a02816N0419Q1708r6844k033O2305m9556o7154R7260J553o5634N4736Q3984
$$ y = [372913, 483389, 408068, 191758, 136284, 156048, 242889, 319378, 273342, 410235, 418819, 328932, 273063, 235845, 270257, 238687, 262470, 263913, 228918, 305359, 274049, 140732, -17828, 2413, 93925, 238086, 319220, 349161, 344373, 242988, 241873, 168802, 114898, 169316, 114778, 71889, 110611, -48439, -181076, -197536, -79863, -34692, -91768, -38569, 131485, 92761, 96127, 113981, 123442, 237147, 241869, 355880, 400400, 345302, 233767, 127155, 59324, 186532, 263494, 237154, 216938, 152690, 16851, -33610, -21328, 1324, -5707, 80705, 162473, 81301, -22570, -45343, -52660, 11735, 99272, 127130, 136775, 9987, -8533, -102816, -52397, 29311, -67533, -69566, -7261, -56817, -123971, -26711, -25158, -90792, -36056, 47928]
16847D7928J8170j8680j300J45300P9404k973p2635k1447L7764J17817L3512J7870
16835C80730J5500J0049o9633o5068m6807p071K0557L5419l2245m4077K2409K1401
16823B41164K820o6786o6866j3821M8105m5732M2812K5485j42957j35098M6115
16812f4759J77421N2148K4343K3431n7199m3398j1436j5500n2408Q1020J6146
16801A29809m3639M1584N4458j09939p4885J6063J9955J45839j4771J2142r4680
16790H1936j41148O4983J16233j47652o1625J64444r1968r3787l0849R670r547
16779a39310j5058l5798P7091K24141m1771k9311O479K9499l1446K6301j12469
16768d1652r223J6032N2787M2539n4703m7110R5628N6754k2268j70533M10P7552
$$ y = [47928, 66098, 47418, 46118, 191418, 270822, 267849, 195214, 173767, 211531, 329348, 362860, 380730, 396230, 406279, 336646, 271578, 224771, 217700, 238257, 273676, 241431, 197354, 219763, 241164, 243984, 177198, 110332, 96511, 144616, 98884, 141696, 167181, 24224, -110874, -64759, 112662, 164810, 189153, 212584, 155385, 111987, 100551, 85051, 32643, 113663, 129809, 86170, 127754, 182212, 72273, -2612, 13451, 33406, 179245, 164474, 176616, 81936, -59212, 5771, 122004, -25648, -87273, 77171, -14797, -108584, -139433, -129763, -139310, -154368, -190166, -113075, 111066, 69295, 39984, 46463, 75962, 44516, 70817, -41652, -50875, -34843, 17944, 60483, 5780, -41330, 54298, 111052, 88784, -81749, -81339, -3787]
16756c787l6205O4371q0791N3541R6618j1221J0368k9470n5928R9012K3596q5882
16744D4222p8953J8556k3148o2140p1884Q3598J01056m2717m865J17159j8591
16733F2293R119j4174n7961N7410q8649J03329J19911r4134j86175m2110Q4570
16722d6571O3234n4276O6218j19442r8484Q2488J03056p3371m6185j58913J14802
16711a67444J90659R158l7218k30311n9398J70218J44632Q0783K1906o4285r501
16700D9199o6902j91229o5181J69233Q9335P2372N6416j0974n2179m1308L0904
16689C9686L8608L1921p321n1974p5649l2065O8855m7033r5451J24906o4369k615
16677g2501O5197L5304O656j5116j80433k7337R0393O0025p7706k0263M889O0719
$$ y = [-3787, -39992, 24379, -56412, -2871, 93747, 82526, 92894, 63424, 7496, 106508, 130104, 44222, -34731, -16175, -39323, -101463, -173347, -89749, 11307, -31410, -36275, 80884, 62293, 71412, 57238, -723, 56687, -31962, 71367, 191278, 97144, -89031, -131141, -46571, 16663, -37613, 28605, -90837, -189321, -106833, -3777, -77148, -123333, -282246, -167444, 23215, 32373, -4845, -235156, -294554, -124336, 20296, 101079, 122985, 58700, 49199, -17703, -208932, -274113, -104880, -15545, 56827, 113243, 102269, 50090, 8782, 39686, 78294, 110215, 102894, 50920, -24729, -56794, 12061, -34972, -130423, -5517, -69886, -72501, -7304, 28000, 34656, 19540, -160893, -188230, -97837, -37812, -115518, -135781, -130892, -70173]
16665g0173M1711l2637j2639M510K0335K0470k7583K4866N9196k1173p1288P7788
16653A3383J65848P9522o0612j53229n4829n345q2773o5443L7332k3208l1954
16642a81308o852j07611M2890O4460J41547N8517o7879n6962N313Q9558P0508
16631E2181J0913P2399o6654j38194L8254p9693l0953R6895J22172n852j9699
16620E1769k8183l2920Q6747O0715M7742L8812k3012p1328j54472r4178L8372
16609g9936O0410P321R5788Q2666l3161j53480j31294o8074L531J45315J97440
16598A26526O0585j43046Q564O3589M0109m2273l3555J0333M606R4471J05579
16587B95488J06264P4273J47460K48438K84586K45858P2705o0582J176J24070
$$ y = [-70173, -28462, -61099, -73738, -69228, -48893, -28423, -56006, -31140, 28056, 6883, -64405, 13383, 179231, 258753, 198141, 44912, -9917, -15262, -98035, -163478, -126146, -149354, -181308, -188160, -295771, -252881, -188421, -46874, 11643, -56236, -113198, -107885, -18327, 52181, 63094, 135493, 68839, -69355, -31101, -110794, -141747, -44852, 77320, 71468, 51769, 23586, -9334, 77413, 138128, 185870, 224682, 201670, 130342, -24130, -118308, -79936, -19526, -12205, 83583, 166249, 133088, -20392, -151686, -219760, -216229, -70914, 126526, 187111, 44065, 52629, 116218, 156327, 114054, 80499, 90832, 95438, 189909, 295488, 401752, 476025, 623485, 871923, 1156509, 1402367, 1475072, 1414490, 1415666, 1539736]
16577A539736R681j10984j03629j2763L5353O3172m0826q2898r5509J4514M3577
16566A259424l0315r0256k08058j84870r1980j27994q0778r0624l3492k737j44472
16555A73848j07235l1889P060J9587o4093k7299P1429R4884L1162N078o3190k7991
16543H1351J02938p8077M8231J11701K2299j29198j76038j13681K5145L4612O6021
16532d696q1250n384N2614J0190l3008K0488j5768k602J72824J05410q4863j41719
16520g764J0415l833n1139M765O3615L6539J1333o1458n6334j68236j2631J32783
16508a01945K1975L4365N3399J9805q4891l2661J15966m4734m6899P2700R055
16497A6135R7279K7300m5839L9957M7154l3070k8392k08525m6047N2862M2672
$$ y = [1539736, 1549417, 1438433, 1334804, 1322041, 1357394, 1420566, 1379740, 1296842, 1201333, 1215847, 1259424, 1229109, 1138853, 930795, 745925, 653945, 525951, 445173, 354549, 321057, 318320, 173848, 66613, 34724, 41784, 61371, -2722, -30021, 41408, 136292, 167454, 172532, 109342, 81351, 184289, 106212, 154443, 266144, 288443, 159245, -16793, -130474, -105329, -70717, -4696, -85946, -91330, -38716, -28526, -61534, -41046, -56814, -59416, 113408, 218818, 133955, -7764, 2651, -1182, -52321, -47556, 16059, 52598, 63931, 2473, -53861, -222097, -234728, -101945, -79970, -45605, 7794, 27599, -57292, -89953, 26013, -18721, -65620, 7080, 16135, 113414, 140714, 94875, 134832, 181986, 148916, 120524, -88001, -134048, -81186, -38514]
16486c8514j4164J1798Q1059k3179l1837L6976K9113j57532p4951o916Q7716L7871
16474f2560n3654j26041K0097p8120J18482L9572J47501J07790Q0762m7324r9734
16463D6771k8547o9023M424j9743N046l9920O0048j0476k5381K3783P5534O2323
16451H4839O7104m9035j53779J351k4140k8568o586p3772k6558M2204J03408R2949
16439B9417j7283n7377M1932r696M1827o6791n0467j9521J9216l8829k4810N4083
16427i8299p535r3014n3089J32638R2653N5493J30467l376q1169q9922j8785j7962
16415e1900N5881J19378K5519m6650q0836M5752n0797L4333l5197n6779j2041
16404e3337m543m106L0495m8215l1639j07536l9943O8054q652N7310J69726j3093
$$ y = [-38514, -52678, -40880, 40179, 17000, -14837, 22139, 51252, -106280, -181231, -188147, -100431, -62560, -116214, -242255, -222158, -300278, -181796, -142224, 5277, 113067, 193829, 146505, 46771, 18224, -50799, -46375, -66118, -61072, -100992, -40944, -51420, -76801, -53018, 22516, 84839, 151943, 102908, -50871, -49520, -73660, -102228, -108814, -182586, -209144, -166940, -63532, 29417, 12134, -45243, -3311, -13007, 28820, -37971, -88438, -107959, -88743, -127572, -152382, -98299, -105834, -198848, -251937, -119299, -26646, 28847, 159314, 155938, 74769, -15153, -33938, -51900, 3981, 123359, 148878, 102228, 21392, 67144, 16347, 50680, 15483, -41296, -53337, -57880, -61986, -31491, -79706, -111345, -218881, -258824, -190770, -199422, -142112, 27614, 14521]
16392A4521R828o906L9578Q1042o0129j08962j57297o312K1742O3827M2786N5245
16380a1037P507j31805q8432o6296J66594R7142J34769q0876j05570k5341J12907
16369I562K3911K3947o1237o6934n6589n0982M5610j8486L305J79037o6835p8694
16357a14385L8080P4094J9122K3423q9874j06757j7821o1862J8796L1359o1328
16346b47153l7129p0284J6303O2028l8381K3827J06898J07716J41944o5606o1965
16335f1802j09328j148J05721J27090m3986o6416m805j0821K199p097k5772k1347
16323a17512O1725O3455M5245p6642o6102O5955p3037o0933M775O8192N9676p8420
16311a03623j5742K3129r5339l4453J17687q880l6437J2522O3729l9405J03500
$$ y = [14521, 24349, 17443, 57021, 138063, 77934, -31028, -188325, -194637, -172895, -109068, -66282, -11037, -3530, -135335, -223767, -290063, -123469, -26327, 108442, 27566, -78004, -103345, 9562, 33473, 57420, -3817, -70751, -127340, -178322, -132712, -151198, -147893, 31144, -35691, -114385, -76305, -2211, 16911, 40334, -49540, -156297, -174118, -235980, -217184, -185825, -247153, -284282, -354566, -338263, -276235, -314616, -290789, -183891, -76175, 65769, 163, -61802, -171130, -172278, -66557, 60533, 16547, -49869, -54674, -65495, -63296, -70393, -96165, -117512, -55787, 7668, 52913, -23729, -89831, -23876, -96913, -157846, -153071, -84879, -25203, -103623, -119365, -96236, -191575, -226028, -108341, -117221, -153658, -141136, -77407, -116812, -13312]
16300a3312M5347j25272j55824Q2979J15858m7001L1333q2011q5370Q7270K5749
16289a20254R9809P661R118j04347p7624P4710n5757q4280O6199M4261O6647n2017
16277a25874m2821P1121N2386L332J6514J1363L5196o3386K1719N1700R9429j7598
16265A13081r6513k3074o3855J3805n6503J5272N8984P4497Q7618k8338j24354
16254b9380J699N1243k6690o4629l1385J6987M3258J8571M8026o5208K4400q3768
16242i6876P981M6865L6911O9719r8299j27064r1477J8548L8345l3013O52R5689
16230a32019J10122j1997j02415P8168j1380j36732J9253k6498N5797O3319M1815
16219e2567M3056j57420L5918J26525J27545J31699p7458j08787j09911L0765
$$ y = [-13312, 32035, -93237, -249061, -166082, -50224, -97225, -65892, -147903, -233273, -146003, -120254, -20445, -12784, -3666, -108013, -185637, -110927, -166684, -250964, -184765, -140504, -73857, -125874, -168695, -97574, -45188, -41856, -25342, -13979, 21217, -42169, -20450, 31250, 130679, 113081, 16568, -6506, -70361, -56556, -113059, -97787, -38803, 35694, 123312, 94974, -29380, -27681, 23562, -3128, -67757, -99142, -82155, -38897, -20326, 27700, -37508, -13108, -96876, -88895, -42030, -5119, 64600, -33699, -160763, -252240, -233692, -195347, -228360, -227708, -132019, -21897, -33894, -136309, -58141, -69521, -206253, -187000, -213498, -157701, -94382, -52567, -9511, -166931, -131013, -4488, 123057, 254756, 177298, 68511, -41400, -10635]
16209a0635l3461K065q6778J4449N8386r453k7961M7799r7420j13955M5901K3515
16197a87548j518J12641N1856k253j03791m1178r47P6992J21031K6296j47396
16186i5815j13410j0330R9713J25803j27l4266L9742l2559K9564P976M3280j57167
16174i7596n9237J3721k082M8232J5685J3603J2598O067m4067P8044K8506R695
16162B3169n0511j02395m5460K5947Q6729O9013p8309r3372J3687M1895O2018
16151d7589O3328j8440L1467n682k0015p0889R071K6096j5706o4426M1452O7379
16139c954m282M5887M4329j01874l8389R7282Q3591r7612Q952L1510j35708m4746
16127a15014J7138K8319J03404m0856j83467q9366l0228P3162l269J8577r2984
$$ y = [-10635, -44096, -42031, -128809, -114360, -55974, -65427, -93388, -45589, -143009, -256964, -211063, -187548, -189066, -76425, -24569, -26822, -130613, -171791, -172738, -95746, 25285, 51581, -95815, -209225, -219555, -119842, 5961, 5834, -28432, 11310, -21249, 8315, 16291, 59571, -97596, -156833, -143112, -145194, -96962, -81277, -67674, -55076, -49009, -93076, -15032, 13474, 23169, -27342, -129737, -175197, -149250, -62521, 6492, -71817, -165189, -151502, -109607, -47589, 15739, -2701, 28766, 23084, 3069, -67820, -58749, -32653, -48359, -112785, -71333, -3954, -8236, 37651, 81980, -19894, -58283, 38999, 122590, 24978, 33930, 65440, -70268, -115014, -97876, -69557, 33847, -7009, -190476, -279842, -310070, -236908, -240177, -221600, -314584]
16116c14584P0433J66899L2105o5192k6055P9249J05114j1867N5104J03722j08161
16105H6767l9137j02303j69837N273M6750Q6321J46615m1663j27526j7265N5664
16094g0341n7041n7531N4537J00958k8611R699Q503J6126J6401q4553m9753K0131
16082a21475l3977o5430K4247J33584K1728k7111R437p4138M8943l2094n2251
16071a68537k5694k2775n7622J33154k5885J39437R9390n1870j22265l684l5317
16060a41668J141K5319P5212j040j02382J33328J27888j12200m9088N2198L7185
16049D5893L6605r538L7845M7307k2339l3261m93l74L0412l7014j48966n3272
16037a07195Q9889M2060l4238J1215l14L8679Q8464Q830j4256J178j20940l083
$$ y = [-314584, -244151, -77252, -45147, -110339, -136394, -57145, 47969, 36102, 91206, 194928, 86767, 47630, -54673, -224510, -219237, -172487, -86166, 60449, 18786, -108740, -126005, -70341, -127382, -184913, -130376, -29418, -58029, -48330, -39827, -23701, -7300, -91853, -141606, -121475, -155452, -220882, -196635, -63051, -41323, -68434, -58997, -133135, -84192, -116286, -168537, -194231, -217006, -274628, -141474, -167359, -27922, 71468, 19598, -102667, -106351, -141668, -140527, -115208, -39996, -41036, -143418, -10090, 117798, 5598, -43490, 8708, 45893, 82498, 72960, 110805, 158112, 135773, 102512, 102019, 101645, 132057, 95043, -53923, -107195, -17306, 24754, -9484, 1731, 1417, 40096, 128560, 137390, 123134, 124312, 3372, 289]
16025B89K5371j9845o8847J0360J05339N2708p24j20144r7068K1054j3272n0194
16013a54973o1011J04250J07704M1900O9411j40365k4093j0000o3934m8608M1392
16002a38327J6625J02256Q7463R18r5697q2971K5180L5151M5268L6361l774J5964
15990D4417Q687j00924N9690M6285k4648j33066q2714R3281l0372o6926l9182
15979b25472m2778K5116J9500l0705Q4488Q1347K991L2123L6533N019J8265n3980
15967d7553q0765J4497M6510k2616N3856J00705m2827m7296o6717N9780J07380
15956G4954P944K7886m5477q6950j9897j02183k7510m9055O2807J32285l4750
15945e9946N8322R3533o518o7156j08730k263P2634M2428j2217j64869l4247l8483
$$ y = [289, 25660, 5815, -63032, -52672, 52667, 105375, 104651, -15493, -112561, -91507, -104779, -154973, -215984, -111734, -4030, 37870, 107281, -33084, -57177, -67177, -131111, -179719, -138327, -121702, -19446, 68017, 68935, -26762, -109733, -84553, -49402, -4134, 32227, 28453, 44417, 53104, -47820, 11870, 58155, 33507, -99559, -182273, -88992, -119364, -186290, -225472, -268250, -243134, -223634, -254339, -169851, -88504, -85513, -53390, -16857, -11838, 6427, -47553, -128318, -113821, -67311, -89927, -36071, 64634, 21807, -25489, -92206, -32426, 74954, 82898, 110784, 65307, -21643, -41540, -143723, -171233, -220288, -157481, -25196, -59946, -1624, 91909, 85391, 18235, -90495, -92758, -20124, 22304, 10087, -154782, -189029, -227512]
15933b27512O6756m9724K3103O0700Q091N8880p2437p933m4360m5415q8077O6885
15921b51043O3666q4981l0465R062J08548R7610j6936l1499M4187J32451Q1432
15910A22032k24575p0166k6976L6075M5283q413n6731O1357n2967j05661l8659
15899c19401Q4293J73595O2313p8434M3185J0519j10775N9297J07428p590j38863
15888a14433j10442R7994J835j24371o054l1779j6194Q7734J47013Q3633L8033
15877E2969Q4677j5122j29815j40979j7396K4025J22992M3519l2086O174o2847
15866f3889j3931R5243M9013n6674l2176k4670N6828j1039l351Q674J21376J7791
15854A43195j2058n0295l0309n7116q6254N4967O6418r6247J159J042n4464o8608
$$ y = [-227512, -160756, -210480, -187377, -126677, -118586, -59706, -132143, -140076, -184436, -229851, -317928, -251043, -187377, -272358, -302823, -293761, -185213, -87603, -104539, -136038, -91851, 40600, 122032, -102543, -172709, -199685, -163610, -118327, -126740, -183471, -122114, -175081, -280742, -319401, -235108, -61513, 800, -77634, -34449, -23930, -134705, -75408, 32020, 24430, -114433, -224875, -126881, -125046, -249417, -255471, -287250, -303444, -215710, -68697, 14936, 52969, 137646, 122524, -7291, -148270, -165666, -141641, -18649, 24870, -7216, -1042, -63889, -77820, 17423, 66436, 9762, -22414, -47084, 9744, -1295, -4646, 4028, 125404, 143195, 131137, 80842, 50533, -6583, -92837, -37870, 28548, -67699, -66540, -65498, -119962, -188570]
15842a88570N9954O3293J15180J7904K0396R997K0562j0415k6448k8617j494K5671
15830G7413M5307j62218k3572K3916n4651m9589N4468j5884M3796m894l1173J0219
15818h6862J26252J46334o3820j57581j58488m6810L9040K0924J7493m7245j4952
15807b25715r3551J82799J69911j9944n0628j40160l9714J05751J78647j4643
15797E2753o1106J9219k8114j51920j9378L3616J05458j4961m3256J27920L4108
15786E4339j71570l5868p5648K5612J54277N4835l6292R8152J9144L7166j0065
15775A14082j03243K3387n6784o9711k5711J00639R3569k7339n175L7069o3157
15764A7626j10904N0421j8288J05435M9202p3023j56432k2360J14191l7220K8008
$$ y = [-188570, -128616, -65323, 49857, 67761, 88157, 98154, 118716, 108301, 81853, 53236, 51742, 77413, 122720, -39498, -63070, -39154, -93805, -143394, -88926, -104810, -61014, -65908, -97081, -86862, 39390, 185724, 121904, -35677, -194165, -240975, -201935, -181011, -163518, -210763, -225715, -319266, -136467, 33444, 13500, -37128, -177288, -217002, -111251, 67396, 52753, -8353, 10866, -17248, -169168, -188546, -154930, -49472, -64433, -107689, 20231, 54339, -117231, -153099, -228747, -203135, -48858, 5977, -30315, 67837, 86981, 124147, 114082, 10839, 34226, -22558, -92269, -117980, -17341, 76228, 48889, 43714, 80783, 17626, -93278, -42857, -61145, 44290, 93492, 20469, -135963, -158323, -44132, -81352, -53344]
15753e3344k0863K0633m1098J41108N9991n2349L9590K2752j58619k6281n8125
15742a26605O2937R2736j5811j32198J11541M2327j41642j18995o3174n101J0456
15731b83529j0132j68828J20223J58065Q2713o108j2126O1074Q05m1607j7062
15720a16512P6294N3390q7160n7103K0408n71k04221n3530L1405P0602Q5320M1081
15708a40597J01882p1669n6471O3334n8485p259N8200P0761J79935n9686m3759
15697C6186o2165j34191P4689J24559J6301N522l6875p001l2001p9293j14484
15686b08753L3507M0168k9038k7087j2597J61195R9786K8608j06909J8432J83220
15675A80532l0078j25765J8435J4289q7759m2935J13633J3622j00450n0254R471
$$ y = [-53344, -74207, -53574, -94672, 46436, 106427, 54078, 93668, 116420, -42199, -68480, -126605, -63668, 29068, 13257, -118941, -7400, 34927, -106715, -225710, -288884, -293985, -283529, -293661, -462489, -342266, -184201, -101488, -107596, -119722, -58648, -57843, -99450, -116512, -40218, 13172, -73988, -131091, -110683, -111254, -315475, -369005, -337600, -266998, -181678, -140597, -38715, -110384, -166855, -103521, -162006, -169265, -111065, -40304, 139631, 79945, 36186, -25979, -160170, -85481, 39078, 55379, 60901, 24026, 17025, -14976, -94269, -208753, -175246, -135078, -164116, -191203, -203800, -42605, 57181, 85789, -21120, -2688, 180532, 150454, 24689, 43124, 57413, -30346, -73281, 40352, 53974, -46476, -96730, -87259]
15664h7259j9039Q8119Q3044k6591l9497p85M6950k0750n1564k066j10469N1590
15652h8317L242L9241K7474o6255p9502J0962m6935N9460J10729M2693l9619n6246
15640h3073n6308L8724O9796K1302J41894M1143p9117r2776r0579J0809P5775
15629b410J10207n2932j23641O7872Q3752k7212o8426Q61r2880n3834k779M8174
15617a13248N3554P2192k7620l0177J12935o8701n6912m21R6532L884l1874R503
15605A9647j0580M3279L5864q2847k06231j7863J02169K3062j6078m6069j5942
15594a71589J41297J27126p0241j31303K0952J85744l659l0490k6680N510K3005
15583F9672j46739r4737Q2735l3358j9452p917R15j2266R4223Q3904K0833M5562
$$ y = [-87259, -106298, -18179, 64865, 38274, -1223, -2008, 44942, 24192, -27372, -29438, -139907, -88317, -85075, -45834, -18360, -84615, -164117, -153155, -200090, -140630, -29901, 12792, -26827, -83073, -139381, -100657, -30861, -9559, 132335, 173478, 94361, 1585, -88994, -78185, -2410, 107797, 54865, -68776, -904, 82848, 55636, -12790, -11929, -104809, -158643, -161422, -113248, -59694, 12498, -15122, -45299, 67636, -1065, -57977, -58398, 38134, 42018, 10144, 19647, 9067, 52346, 88210, 5363, -200868, -218731, -116562, -93500, -109578, -155647, -171589, -30292, 96834, 26593, -104710, -83758, 101986, 98327, 67837, 41157, 46667, 69672, -77067, -171804, -89069, -122427, -141879, -149796, -148881, -161147, -66924, 16980, 37813, 83375]
15571H3375q7574j44747l2810j615K10030O9574j29673l4582k4092k7851m2295
15560a62260M6706P8727q450j13985L2098M5897k592J42195J7301N3053J03356
15549B32046j11904j12127l952m5507P5884P1436M151K5011j43809j27142l9597
15538a75510r4742j15339M9743J10108J41554q53K5938O2170J8033q2567j41507
15527b02972o9947M4655K11989K3962j2867J15276p7431L453L3143o0621r3259
15516h4619o7513K3854Q066p473K0734j9201N8037q8582l737Q5014p4544p6185
15504b26149k6146J30104M6296J20621K7092K962O241L7954j46967j31012k587
15493a61591K2211K1789r6026J6797N7732K9096J193J2248j3055J39671J16271
$$ y = [83375, -4199, -148946, -181756, -183371, 26659, 96233, -33440, -68022, -92114, -119965, -162260, -115554, -36827, -45277, -159262, -127164, -81267, -83859, 58336, 75637, 128690, 232046, 120142, 8015, 4063, -41444, 34440, 105876, 110027, 135038, -8771, -135913, -175510, -270252, -385591, -335848, -225740, -84186, -85039, -59101, 3069, 21102, -61465, -202972, -272919, -228264, -16275, 7687, -5180, 110096, 32665, 36118, 69261, 8640, -84619, -152132, -128278, -120212, -127685, -106951, -126152, -68115, -156697, -160434, -75420, -149964, -226149, -252295, -122191, -75895, 44726, 71818, 74780, 81021, 118975, -27992, -159004, -161591, -139380, -117591, -213617, -196820, -139088, -109992, -108799, -96551, -109606, 30065, 146336]
15482A46336o260J3849o4481j24385K9325L2836O7202k8243n8516q110K8083q7255
15470e9619J03446j82794j3489J21317K5446K1267n6313l3699o2809Q4387k6633
15459g9493n2399J9185j902p947m9716J08183J43308j34187q5700l1823N7151
15448a15340J09192L3071o9315j10569K2861L7239q856O8050R8559L3660N335
15437A03887l0341l1402j9316N853j37303J4590n0013m1540l8530J4183K5179
15426a84753n9214j08346K1374J02531O468l8528J01791p0750k6439M063Q6916
15415a64887J58000J18441l0909q7756n9012p6833M4961o2503n8503q4975j5215
15404c19191N5865M3372k8859Q8265J10349J2788k1682Q6061r798l9640J6820
$$ y = [146336, 140076, 153925, 89444, -34941, -5616, 27220, 94422, 66179, 7663, -447, 27636, -59619, 43827, -138967, -152456, -31139, -5693, 15574, -40739, -74438, -137247, -52860, -79493, -131892, -112707, -114609, -122556, -172272, -64089, 79219, -54968, -140668, -172491, -115340, -6148, 26923, -42392, -152961, -130100, -92861, -101717, -33667, 64892, 98552, 103887, 73546, 42144, 22828, 28681, -108622, -94032, -144045, -185585, -224115, -209932, -184753, -243967, -352313, -330939, -228408, -221940, -260468, -158677, -229427, -255866, -251803, -164887, -6887, 111554, 80645, -7111, -66123, -142956, -97995, -160498, -219001, -303976, -319191, -263326, -219954, -248813, -160548, -50199, -37411, -59093, 26968, 17170, -22470, -5650]
15393e650L3154p6255K1860N0771n3172J5642P707M167J3503j34941q3172J00170
15381a06216L4070j6234M2237M0854j05717M9089R432o5015l3150M0706K7284
15370h2660J1518k6235m3220O7172L845j9789M376J06113J01781J66j51210j53352
15358a81495M7096R5063M1405l3292M0305q4271l3239J18942j109p6051j03566
15347a70212N3397M8454M5345o4607m0362J15524J00258k0299q9512L6029k304
15336A1711k3387J1806L4461j5429L2167L0303J46195p9197Q4635L8389j89415
15325H2239j83406l8043n2390Q9792J66827P3229n2270q4428q2880j07205N9196
15314a29339j33590P5430J29664l5484j9484O4522n2086l5193n3421P5321J43879
$$ y = [-5650, 27504, -48751, -26891, 23880, -29292, -13650, -5943, -1776, 11727, -123214, -206386, -106216, -72146, -88380, -46143, -5289, -111006, -61917, -52485, -117500, -150650, -109944, -82660, -71142, -97377, -140597, -73425, -69580, -89369, -84993, 21120, 122901, 123067, -28143, -181495, -134399, -39336, 2069, -31223, 9082, -75189, -108428, 10514, 9405, -66646, -170212, -116815, -68361, -23016, -87623, -127985, -12461, 87797, 67498, -22014, 14015, 11711, -11676, 130, 34591, 19162, 51329, 81632, 227827, 148630, 233265, 271654, 82239, -101167, -139210, -191600, -101808, 65019, 138248, 85978, 1550, -81330, -188535, -129339, -262929, -187499, -57835, -93319, -112803, -48281, -100367, -135560, -188981, -113660, 30219]
15303C0219m9810j22210l651O734n7364j0383Q2943O7887K9547K1505M0371K5979
15291F1767l3165j59404J2439L9796r9713Q7092n7072j52224J7013J6708O9013
15280a97750R8338l6769n3616N3506P342j01583m9512p703P2517N3094M9163q6984
15268a99957Q3149Q5598m7925j2420L8471L1432M0677Q2395J8724r429r2447j26641
15256a08373m8613N2181K5107l2042n0531m6433L046L3270M71r672j33625K0882
15244b94332J80844P4787K9942p9396O2708Q8134l5700J0446m7335n8911j3961
15233h2774J43795m3188J3828J40001J7590m4226n6125j16222m9465M2438n635
15222c9983k7778K674K4426O232L7554l1901r59R9319m3889m2006j13125j25274
$$ y = [30219, -19591, -141801, -145452, -138718, -196082, -206465, -123522, -55635, -26088, -4583, 35788, 61767, 28602, -130802, -118363, -78567, -178280, -91188, -148260, -300484, -283471, -266763, -197750, -99412, -136181, -189797, -136291, -128949, -230532, -280044, -287747, -215230, -162136, -112973, -199957, -116808, -31210, -79135, -91555, -53084, -21652, 19025, 101420, 120144, 110715, 18268, -108373, -156986, -104805, -79698, -111740, -162271, -208704, -205658, -172388, -171917, -181589, -315214, -294332, -113488, -38701, -8759, -88155, -25447, 62687, 26987, 37433, -9902, -68813, -82774, 61021, 17833, 31661, 171662, 189252, 145026, 88901, -27321, -76786, -34348, -39983, -67761, -65087, -40661, -34429, 3125, -28776, -29735, 69584, 25695, -16311, -129436, -254710]
15210b54710J3798L1399M4926L6813o2088o0229J73443J18266K7453j50510j8535
15199i9974M2207K5412n2516J18528P1436r6764j22295l5341J15662N2598N1096
15188G0049k1341n236L8637Q8156j54947k08935j2034J40111J51653k4221p2919
15177a1027o2442J3238M1036n6331N6273J18176l4209l8142l3871k8003j58848
15166a94150j39900J14746J25480K904L6276m9308L3082l418j3043n0898M711
15155a33518O853k6541N3J12523K5264k8821l0728J3185m9599m6318j94666K583
15143c49730Q8674J18131J58705r5846j10428R269J07922j8373O3771O4918r2525
15132e5512R6108Q0516j41090N8625J2556k6351k1362L7685n7441p4929q4296
$$ y = [-254710, -240912, -209513, -164587, -127774, -189862, -250091, -76648, 41618, 69071, -81439, -99974, -57767, -32355, -84871, 33657, 105093, 8329, -113966, -149307, -33645, 18953, 70049, 48708, 43472, 82109, 170265, 15318, -193617, -205651, -65540, 86113, 61892, -11027, -73469, -60231, -19195, -75526, -19253, 98923, 64714, 26572, -7299, -35302, -194150, -334050, -219304, -93824, -90920, -54644, -103952, -70870, -74288, -87331, -138229, -133518, -126665, -153206, -153153, -40630, -15366, -44187, -74915, -61730, -111329, -157647, -352313, -349730, -261056, -142925, 15780, -80066, -190494, -181225, -73303, -91676, -27905, 37013, -55512, 40596, 121112, -19978, 38647, 51203, 24852, 3490, 41175, -16266, -91195, -175491]
15121a75491M100N1647o3416P341m015J1829J731J16947J5760l0621m5428L1574
15109g8042m9239l7261J183p45O3281L8936O7079j56628n4986N3185Q2251R1444
15097B0458m0077j13951m8611J58692L5740o1346J7135K8487k2329o3257O8478
15086b0581L9080K9975o0649r656Q0870J64214J975j12073m3492k8778L7935j14812
15074c5992r3908P3502J2075O0804K6829m4647j09376J9221Q3614O7956J24041
15063A84119L6615n3272q2647j44321p7443j24140l0497M703o9938m6808N8773
15052c44856M6950Q9354l4056M7770Q1296l5041N4381J37302J35191j52836j14658
15041h9203N5182L9516K5522k8253k8147j20990j24872k3657j6433R3610M8343
$$ y = [-175491, -171391, -119744, -183160, -175819, -179834, -168005, -166274, -49327, -33567, -64188, -109616, -78042, -127281, -164542, -163359, -164104, -100823, -61887, 5192, -151436, -206422, -153237, -70986, 20458, -19619, -133570, -182181, -23489, 12251, -49095, -31960, -3473, -25802, -89059, -20581, 18499, 48474, -12175, -21831, 59039, 223253, 225228, 113155, 69663, 40885, 78820, -35992, -129900, -56398, -44323, 16481, 43310, -1337, -110713, -91492, -7878, 60078, 184119, 220734, 167462, 84815, -59506, -136949, -261089, -291586, -286883, -356821, -403629, -344856, -297906, -208552, -242608, -194838, -113542, -148583, -94202, 43100, 178291, 25455, -89203, -34021, 5495, 31017, 2764, -25383, -146373, -271245, -294902, -311335, -217725, -169382]
15030a69382m3809p1900J1742k7090m917R8746O6073M8971J3007R4634J10278
15019A26353n2842j92458m4183P6528J10029M9031k249o3480m7261k3578l6718
15008a00828n8600J6519R1137q7217l9401R1667Q1834K104k0337q4529J0250J5594
14996h1807N6599j2631L73m1800r9558q7263R3131J14257r847j03616k6290Q4843
14984a13609k1361Q4707R1680J18499N2417o3178m9838m9813O1736l5034m7162
14973B9044M792M1608Q6667M4557L6440m7619j20518n3661k1338K1355j0618q029
14961B680L9801K4492Q0575q8616o0401k8293q6951q7064L2194K4093j9402p2626
14949b39518o7345R1674P8791l9162J52784J28148o9189K8476O7223l8039r3778
$$ y = [-169382, -213191, -285091, -273349, -300439, -305356, -206610, -140537, -91566, -78559, 16075, 126353, 73511, -118947, -163130, -86602, 23427, 72458, 70209, 6729, -40532, -64110, -100828, -159428, -142909, -51772, -138989, -178390, -86723, -4889, -2785, -23122, -107651, -97401, -81807, -25208, -37839, -37466, -79266, -178824, -266087, -172956, -58699, -68546, -172162, -198452, -113609, -134970, -50263, 41417, 159916, 212333, 149155, 99317, 49504, 111240, 76206, 29044, 33836, 75444, 162111, 206668, 243108, 195489, 74971, 21310, -28, 21327, 10709, 2680, 42481, 66973, 147548, 58932, -1469, -29762, -116713, -203777, -171583, -147490, -166892, -239518, -306863, -215189, -136398, -175560, -22776, 105372, 36183, 64659, 131882, 93843, 65]
14938F5q4185k6910J36245q5543K8716O840k0972j2832J15429J3034o4879r5747
14926i0739o8460p3551m6725J29179P0827j2540j9369M7298o234L6611P7508m8454
14914d649j09942K2806O1679M2787M3860n8177j00438j09061L4160M0672m356
14903a40659o5436M2941O4706O5547O2670K0995l4020J3863o5392N481P2541k355
14891D0882k1138j30041j04253k2978N0421O2911K9297j9460Q312L5230Q0753
14880I936K8932m3949Q3405l8838J2804J479P2822l0L3543l7272n0901K502O309
14867H0742p1537j1703L0029k3345l7079J9041r2396j37160kK8767L9473J5881
14855a59289J77293M5215k9917k0444M929J7551j61160m2266M304m4436M9709
$$ y = [65, -84120, -111030, 25215, -60328, -31612, -24772, -45744, -58576, 56853, 69887, 5008, -90739, -159199, -232750, -279475, -150296, -79469, -92009, -111378, -64080, -70314, -33703, 43805, -4649, -114591, -91785, -30106, 12681, 56541, -1636, -102074, -211135, -176975, -136303, -140659, -206095, -163154, -98448, -32901, 29769, 50764, 16744, 30607, -34785, -29304, 43237, 40882, 19744, -110297, -214550, -237528, -187107, -124196, -94899, -114359, -106047, -70817, 9936, 38868, -5081, 78324, 39486, 52290, 53769, 126591, 126561, 160104, 122832, 71931, 74433, 80742, 9205, -2498, 27531, 4186, -32893, -13852, -106248, -243408, -243410, -214643, -175170, -159289, 18004, 63219, 33302, 12858, 17787, 35338, -125822, -168088, -163784, -208220, -158511]
14844a58511L6887l1886J6134n7651K4415P3236j0499m7375j8789L3840J4326
14833a25873n3227j4183L1763R079n3696J32925R4481j19799r4650l0690J7045
14822b06825J4219L6707R857M7879Q9151O1627k5577p8904o373J4503M8054J4977
14810A9295R356k8478K3674n5490j69531o1026o2751P5536K9633R4704R6389N6354
14798B7665Q916m9656J20862L9428j109L219j19124r731k449j2596o2487k4799
14786h1861M4574k50K9632K1552J12167K275r4791j05633l5902p6485m727P2228
14774a17221L6545M6017k4960J459j9297Q6543m678q0274j13016j3414J9822L5876
14762a46598J21628K3123J005p0353N6990q693K7285J09091p2548J1846k3645
$$ y = [-158511, -121624, -153510, -137376, -195027, -170612, -97376, -107875, -155250, -174039, -140199, -125873, -179100, -193283, -161520, -152441, -206137, -73212, 21269, -98530, -193180, -223870, -206825, -192606, -155899, -146042, -98163, -9012, 52615, 27038, -51866, -58239, -43736, 4318, 19295, 28651, 173, 23847, -31643, -201174, -262200, -324951, -249415, -219782, -125078, -28689, 27665, 36581, -13075, 107787, 147215, 146106, 149325, 30201, 20470, 18021, 5425, -57062, -81861, -37287, -37537, -7905, 13647, 125814, 128089, 33298, -72335, -108237, -184722, -189449, -117221, -80676, -34659, -59619, -58160, -77457, 9086, 4408, -75866, -188882, -202296, -182474, -146598, -24970, -1847, -842, -71195, -14205, -22898, 4387, 113478, 40930, 52776, 29131]
14751B9131P7079J1979j65330o7148L0270M8578O5097J42350M6348n2006J2033
14740A78381m3437j8993j27980n8940p435j21598J21514J34477O980k24231j15989
14729b77251k7058k8463J05954O7243m9371O0722K6433J0730J45758j0512j1446
14718A2739k0236k8906R2015M5464j05912k0652M9344m9923r137J0395O0895n3496
14706a7410j7242R238M6291K208j52670L9763L9180R5859j34717j06190J22266
14695g3424P5235k2694j54266j37360J15419P6725L0080r6860m9483o3165m2374
14684c42167J62252J28630J47496N816J127o6817r8160J9362p286k152P2785P0300
14672I1186j32619o6219J01005l8966q8327l9850J56293j7215n7904K3166N5810
$$ y = [29131, 106210, 118189, -47141, -114289, -84019, -35441, 29656, 172006, 218354, 166348, 178381, 134944, 115951, -12029, -70969, -78404, -200002, -78488, 55989, 62969, -161262, -277251, -304309, -332772, -226818, -159575, -208946, -148224, -121791, -111061, 34697, 24185, 12739, -7497, -36403, 55612, 101076, -4836, -25488, 23856, -26067, -35204, -24809, 36086, -17410, -34652, -25414, 20877, 23085, -129585, -89822, -50642, 45217, -89500, -195690, -73424, 1811, -20883, -175149, -312509, -197090, -120365, -90285, -187145, -236628, -299793, -342167, -179915, -51285, 96211, 102027, 103154, 36337, -61823, -42461, -49747, -51899, 20886, 91186, -41433, -107652, -6647, -45613, -133940, -173790, -17497, -34712, -92616, -69450, -13640]
14661a3640L2908q1117j0783K7095P0346K9741q6068m9721J05422o1397p8644
14650a15858j06349n1816j2892J15546J34264K7141Q1495M9274l2306K1285r8049
14639A1735q4002J14814N5851m4434J4090L921j64372o8684N5332J7084M089N281
14627g9295N063Q0446J30352M5275j57942q0131K4451n0361K7161q3336n850N0646
14615i3521J31497J23263j203m3049m4373l7077o7763L4466l7711o5311J08925
14604H143N1207o6779n0918l6336p8055m0519J44248J60875n0667j61062o693
14593a26556K79669Q1772j49672o8302O3713J5698R860O0121O9350N6494o2288
14582B29859k9942k5728p6188o4732m6744j216o976j00772L5005p795K2488O7230
$$ y = [-13640, 19268, -61849, -72632, -45537, 24809, 54550, -31518, -81239, 24183, -37214, -115858, -222207, -274023, -286915, -171369, -37105, -9964, 71531, 120805, 88499, 109784, 11735, -72267, 42547, 98398, 53964, 68054, 71975, -92397, -161081, -105749, -88665, -84576, -79295, -74232, 6214, 136566, 181841, 23899, -56232, -31781, -82142, -54981, -138317, -144167, -93521, 37976, 161239, 160036, 116987, 72614, 35537, -32226, 2240, -35471, -100782, 8143, 59350, -7429, -58347, -94683, -172738, -213257, -69009, 91866, 41199, -119863, -126556, 153113, 234885, 85213, 16911, 80624, 96322, 106182, 166303, 235653, 292147, 229859, 199917, 174189, 98001, 33269, -13475, -14691, -21667, -122439, -87434, -95229, -72741, -5511]
14570e511M3480j22685O9461Q1195K9838n929k4056l7938j23732j39881J9682
14559b16076O8536K0797K3366Q655k9897j2378k1784K1650L9149j7816L1930o9770
14547a53638K1933J21400J6982l6449m0173q2198p0184J34094J46584l6054m7475
14536b5178M3871m3552j04574l2858P871l4172P6368N4949Q9820j3364q4910j40401
14524b06130P5916n472m6454L9973k3966P9833M5228o2973P0623M3186K8508q9795
14512e1523l4304l5586N3631N4620j13455n1642j7574O6025P9212n2842r4724
14501a98162K0218N9813O8147p1970m4890l3609O5257J31479P5300j05436p9222
14490a13075P0424J32417p6983j26877M3021M1101r9219K9879R0828P4310j72343
$$ y = [-5511, 37969, -84716, -15255, 65940, 95778, 89849, 65793, 27855, -95877, -235758, -216076, -147540, -126743, -103377, -94722, -124619, -136997, -158781, -137131, -97982, -115798, -83868, -153638, -131705, -10305, 6677, -29772, -69945, -152143, -222327, -88233, 58351, 22297, -25178, 18693, -24859, -129433, -162291, -154420, -188592, -112224, -57275, 32545, 19181, -65729, -206130, -130214, -135686, -182140, -142167, -166133, -86300, -41072, -104045, -33422, 9764, 38272, -51523, -85827, -121413, -67782, -13162, -126617, -178259, -195833, -129808, -50596, -103438, -198162, -177944, -118131, -49984, -121954, -166844, -200453, -135196, -3717, 71583, -33853, -113075, -42651, 89766, 12783, -114094, -71073, -29972, -129191, -99312, -8484, 65826, -106517]
14479a06517m1847J6692r3274o244O2346P4483K7703L9084M9378q011j7506M672
14467I59Q0343J3780k4803l7830n5205L3827R1633k4720k4205k8945j2970m1647
14455b9783J3445Q1663m9783m0119J55355k2380j56663q1105k9411j7808J4149
14444a62440O426J23833R3336J62929j44612r721O9851L5401j20615p3251L0230
14433A1367L4266j03488m8528J34097j043r810J61739R4355l8030p3737J5394
14422A76582j41265l7424J087M0444L8335q0716j35149J30212M1416R4293O3771
14411A91586k7735j93343r3687M9995R985q1941k7924N076m0534N5512N5904R8080
14399I74M2325K9950j06422l1479l2818r0453p3696J83044J09400M9316m7074
$$ y = [-106517, -148364, -131672, -224946, -231190, -168844, -94361, -66658, -27574, 21804, 13793, -3713, 959, 81302, 95082, 70279, 32449, -22756, 11071, 102704, 77984, 53779, 24834, 11864, -29783, -16338, 65325, 15542, -24577, 130778, 108398, -48265, -129370, -158781, -176589, -162440, -156014, -32181, 61155, 224084, 79472, 69751, 139602, 175003, 54388, -18863, 11367, 45633, -57855, -106383, 27714, 26671, 16861, 178600, 272955, 234925, 161188, 176582, 35317, -2107, -1020, 39424, 77759, -2957, -138106, -7894, 33522, 127815, 191586, 163851, -29492, -123179, -73184, -63199, -145140, -173064, -167988, -208522, -153010, -97106, 974, 43299, 73249, -33173, -64652, -97470, -187923, -261619, -78575, 30825, 80141, 33067]
14388C3067l0747K4816N9506r461K9574j8448l0002L3367k9444j7796N3487m717
14376I3202K8854l759j5601j26379q3766m5936o5159P0038M5345P797n0200J5966
14364a29598M9377N0310j4570J66851L9575p232k1787n9398j25742n4481o4821
14353a71516l7166O4954J09309M6858J7364m1634n9531l3262K3551R5060O0687
14342G4674j2430r1748j8569L77k6046J17383Q8896m6355n4783o2110k5600r159
14330f5470R3640P4553j9487j10080l3095J9308k7967K6867m2543j06299M3583
14319a46990Q8438M4324m7222q3392P8441Q5800r810m1848K055L3645J20185J6074
14307A39700q7094j2275o8387j50041l5773M4005J29318J00494j5646K2032n9066
$$ y = [33067, 2320, 27136, 86642, 77181, 106755, 88307, 58305, 91672, 62228, 44432, 97919, 93202, 122056, 118297, 102696, -23683, -107449, -153385, -218544, -148506, -103161, -95364, -145564, -129598, -80221, -29911, -44481, 122370, 161945, 154713, 132926, 73528, -52214, -106695, -171516, -208682, -143728, -34419, 12439, 29803, -11831, -71362, -104624, -81073, 13987, 74674, 62244, -29504, -48073, -47696, -73742, 43641, 132537, 86182, 31399, -30711, -56311, -65470, 28170, 102723, 83236, -26844, -59939, -40631, -68598, -41731, -84274, -190573, -146990, -58552, -14228, -61450, -144842, -66401, 19399, 9589, -32259, -30204, 3441, 123626, 139700, 52606, 40331, -28056, -178097, -213870, -169865, -40547, 59947, 44301, 66333, 7267]
14296G267l5152O9450k968r1369M4114M6193j4949n2421k4570m721n3269L6705
14284g5690N300n6042J6858Q6498J15641N5091L4807K1171n1177j4566o6736j48855
14272g7700m6631K3554k7390o9061O7651K581k1914L5185n2551M441O1383L6404
14260f4048k2017K2154K6591J756O4588O1321r807o528j18428j47289O3060Q0888
14248d7759L1525k3420J3912M808L5703o6497p2091Q058N5664R8066p0040L4703
14236B632j1972r3486j4012K0453r2109O9653L3830J13956J14530M6676m9075
14225A41076j71076j6630L7943J8114N0502l5375l1263r1157O8447k4773L8002
14214a6190K355L0227r1606j113l4874j58869N6347J05261K7554l5726n65N552
$$ y = [7267, -27885, 41565, 38597, -52772, -8658, 37535, 22586, -29835, -54405, -59126, -112395, -75690, -70390, -126432, -109574, -23076, 92565, 147656, 182463, 203634, 152457, 137891, 71155, -77700, -124331, -100777, -128167, -197228, -129577, -126996, -148910, -113725, -166276, -161835, -100452, -64048, -86065, -63911, -37320, -35564, 29024, 90345, 80538, 74010, -44418, -191707, -128647, -47759, -16234, -39654, -25742, -20934, 14769, -51728, -123819, -115761, -60097, 37969, -32071, 2632, -9340, -102826, -116838, -96385, -188494, -118841, -85011, 28945, 143475, 190151, 141076, -30000, -46630, -8687, 9427, 59929, 24554, -6709, -97866, -29419, -54192, -16190, -13835, 16392, -75214, -76327, -111201, -270070, -213723, -108462, -80908, -116634, -117199, -111647]
14202a11647N9952L8478P273L9235n7706n4710O0946R5946r755r4332n8738p3786
14190a58844N5195J01830J3963K0430l4098p5441p6407M2920J31671L3690j66791
14179a11882j1401N6805J789q9215J263k6973J2575O8592O9220J3112n5090J5881
14167e5324J89278J18686r6499j1549K6164M8966l8423j84406j31989r2403P2777
14156a54722Q6044K1357J07738K1343q234n7656p9984l7736m184N6551j0118k2904
14144h2505Q3608m3529r962Q9554P42Q3892k9517q6868j47789l7497M5739M0058
14132i4074p5137q8135j19721o9263J02569J87586Q392K3807J80299J0783p8479
14121a1373K3319K1546N5576k5857n9331N6035p826o3688J16678M7321j6113j00757
$$ y = [-111647, -51695, -13217, -5944, 33291, -24415, -79125, -18179, 77767, 68012, -26320, -85058, -158844, -103649, -1819, 12144, 32574, -1524, -76965, -153372, -110452, 21219, 54909, -111882, -123283, -66478, -64689, -153904, -152641, -179614, -167039, -98447, -29227, -16115, -71205, -55324, 133954, 252640, 156141, 144592, 170756, 219722, 181299, -3107, -135096, -227499, -154722, -68678, -47321, 60417, 81760, 73526, 15870, -64114, -101850, -106034, -49483, -59601, -82505, 1103, -42426, -52388, 37166, 37908, 121800, 92283, 5415, -142374, -179871, -134132, -94074, -169211, -257346, -377067, -446330, -343761, -156175, -147783, -123976, 56323, 67106, -11373, 11946, 33492, 89068, 63211, 3880, 59915, 52089, -11599, 105079, 152400, 136287, 35530]
14109C5530o2740J6525M3499J18164k6790j71641J9517M1379o410N6430K3557
14098H7020k8854j24460N3969M0838q1004j00724j5825p3234M7277N5074M0872
14087i9051M5460N1681L577J5598l3416j8640K4791k2791n1668P2889k6502J3095
14075b4977J3756N2721L3529j11693p4117l3386R6820L3876J6411R341k2835m2585
14063e3139o7008J11220K19963K4637q2572j5742J2142l772k8334p9826l8727
14052a158o0826Q7060L5741j8581J9711L311K6253P0620K4171m4507k6303j99078
14040h3586K1588R2926n6750k16554j0666L1796J11879O7043o0517M5878j6098
14029g3061r3321J8504K3726k35O0790J03326j87147O707K0633N4085M4553o1445
$$ y = [35530, -27210, -10685, 32814, 150978, 124188, -47453, -27936, 13443, 7033, 63463, 87020, 58166, -66294, -12325, 28513, -52491, -153215, -169040, -242274, -194997, -139923, -99051, -53591, -1910, 1667, 17265, -16151, -34791, -10000, -32791, -84459, -11570, -38072, -24977, -11221, 41500, 75029, -36664, -110781, -144167, -47347, -13471, 2940, 12281, -10554, -53139, -120147, -8927, 211036, 235673, 153101, 137359, 149501, 145729, 117395, 37569, -1158, -61984, 25076, 60817, 42236, 61947, 65258, 91511, 162131, 186302, 141795, 115492, -83586, -61998, 30928, -25822, -242376, -253042, -221246, -109367, -42324, -102841, -56963, -73061, -166382, -147878, -124152, -124387, -63597, 39729, -147418, -140711, -120078, -65993, -21440, -82885]
14017h2885j11335O9041R7160m8717K4747l03L8482K3667j06122k3893P9912M3855
14005C609p2536l0053M6852l4675J37817L4977j48644q3898j43567L9322J67978
13994h2818K06668K2819j26680M7808P1491q0409o7563L1370j8780r2629O6491
13983b2232L2135J23267K6658r7628r0123L113j7907O0077J0934o9873K9610K8974
13971A7005o8289j0602Q3405R640n3797J42672R5563p4965n3431l9370m1181l0649
13959b3999M3006R2179n7608Q556K4369j9338Q354m5859M6541q0752m4964n1160
13947a00675p992M5700M183M4499p53J25853P2001j40897m4350J9068p701j4550
13935e614L5691P8213M1565j11138Q046N6209m775o6821P8698M8826K4420l8842
$$ y = [-82885, -194220, -125179, -28019, -76736, -51989, -52292, -13810, 9857, -96265, -120158, -40246, 3609, -68927, -98980, -52128, -86803, 51014, 85991, -62653, -146551, -290118, -250796, -82818, 123850, 146669, 19989, 67797, 139288, 58879, -8684, 22686, 3906, -88723, -22232, 9903, 133170, 159828, 62200, -27923, -24810, -42717, 17360, 28294, -41579, -11969, 17005, -51284, -61886, 21519, 31159, -22638, 120034, 215597, 140632, 87201, 47831, 6650, -23999, 19007, 111186, 53578, 62134, 86503, 67165, 75519, 29660, 76201, -4551, -49515, -100675, -108667, -62967, -58784, -14285, -15038, 110815, 182816, 41919, -2431, 16637, 8936, -5614, 30077, 108290, 149855, 38717, 46763, 102972, 98197, 31376, 110074, 158900, 183320, 144478]
13923A44478p6092L24j64494o0819Q4255r4767J41565M3080J10O8798l8765l8528
13911I145L2575K2518K8820m8551K9673K14862J3761k17926k29926j17855k9940
13900b92844J36724J93470M039l5957J0931n4163K6441M4262j6475r667m8653
13889d1892M4011m2661m0152l2019N5440p9386j24437Q0800O4012M4452O2487
13878i345p2938J6435P6145N1100J10300j7230k05355j07280N8617M3343K5050
13867c1158P7061K6728l0117K1485O0311M4052K5388o8346r5711J2564L4798J78119
13855B55174J41141j2176o996n0142r8664n7112K1115L6285o5295m0238l709l2171
13843H7212n3456M3826j8130j41452l2997M7381j5377r1306J9047N7919J57401
$$ y = [144478, 68386, 68710, -95784, -156603, -72348, -167115, -25550, 17530, 17640, 86438, 47673, 9145, 41720, 64238, 93058, 44507, 74180, 289042, 302803, 84877, -145049, -262904, -292844, -156120, 37350, 41389, 5432, 16363, -37800, -11359, 32903, 16428, 6761, -41892, 2119, -40542, -80694, -112713, -57273, -136659, -261096, -180296, -116284, -71832, -9345, -82283, -65848, 10297, 61397, 171697, 154467, -50888, -158168, -99551, -56208, -31158, 45903, 72631, 42514, 63999, 124310, 168362, 193750, 125404, 29693, 42257, 77055, 255174, 396315, 384139, 377143, 327001, 228337, 171225, 192340, 228625, 163330, 123092, 119383, 87212, 33756, 77582, 59452, -82000, -114997, -67616, -82993, -174299, -155252, -97333, 60068]
13832F0068N4730j28669j12300q2223P1822O6657m4695k6727J6506l1775N7944
13821i8662J25593j6724m3065o9901N6555J14674P2017j0014M758m0744j64435
13810f9948j0056J34954R3193j5640r9831n0709j0182j6988k5727K3063L5523
13799a2348o6643O9188J46797R1947l3231m9621r7180o9030J05606J614q916p110
13787G1073l2469p8726k8169J16087P6408l11j69156m5548K2939j9566k6903K6006
13775h8335J23862J8264l846j26436m9256J09257p5295n5642o4049O1680J392
13764a48404K4903Q8683K0092l0955L2464l991n7212P6783n3518m6250o1372m1873
13752b00650K383R236J35234M931M6091M9155L9942m9422K9765k9545o665m1070
$$ y = [60068, 114798, -13871, -126171, -208394, -136572, -69915, -114610, -141337, -124831, -156606, -98662, 26931, 10207, -32858, -102759, -46204, 68470, 140487, 130473, 135231, 94487, -69948, -80004, 54950, 148143, 132503, 32672, -18037, -28219, -45207, -70934, -47871, -12348, -78991, -9803, 136994, 228941, 195710, 146089, 48909, -20121, 85485, 87099, 78183, 71073, 38604, -40122, -68291, 47796, 124204, 123893, -45263, -90811, -67872, -87438, -114341, -88335, 35527, 53791, 49945, -76491, -125747, -16490, -91785, -147427, -211476, -149796, -148404, -123501, -34818, -14726, -45681, -13217, -17208, -74420, 2363, -51155, -97405, -158777, -200650, -198267, -189031, -53797, -48866, -2775, 46380, 86322, 36900, 66665, 37120, 30455, -10615]
13740a0615J30028J08108l2923k14051r5865k1489Q5108O8597J12497r7593j34693
13729a02891l2486L881Q9705M7062k6538j05859o6779M7954R2701P6299K3060
13718D6109q298j16053j29731j8112j2192p348L1645J32021L0422r7935L206l3623
13706a79889p3162J72784M4807j30927r0574o5364P0355O9439J04639K2963m3079
13695i8008J05518L0916j8434J816j8416j06406L7456n276J194J4435p1139P8213
13683d8131N5680n1278q8221q451K1406j6116l0297R5461K1297L377R813K9413
13671f047P7091L5484n7468q6402L3463P1826q164r0843j00057O6367J899p1307
13659a34158O4567M3415l7225j66270Q5768Q4354J21904m5489k3713P5982j16868
$$ y = [-10615, 119413, 227521, 194598, -19453, -115318, -136807, -51699, 16898, 129395, 31802, -102891, -135377, -131496, -41791, 5271, -21267, -127126, -193905, -145951, -53250, 23049, 46109, 37811, -78242, -207973, -226085, -238277, -245625, -213980, -81959, -51537, -149472, -146266, -179889, -253051, -80267, -35460, -166387, -256961, -322325, -251970, -182531, -77892, -54929, -98008, 7510, 38426, 19992, 21808, 3392, -103014, -65558, -70834, -69640, -55205, -126344, -48131, 7549, -43729, -131950, -140401, -118995, -135111, -165408, -69947, -48650, -45273, -35460, -6047, 71044, 106528, 49060, -37342, -3879, 67947, 59783, -31060, -131117, -64750, -62851, -134158, -69591, -26176, -63401, -229671, -143903, -59549, 62355, 16866, -6847, 69135, -47733]
13648d7733r7135L1723O4188r887q4544j470J09846J93491p937m7966n8252o7527
13636b3203J35051L6707N175n7067n9306m7196J2960j8134o8971q1121N0906m0707
13624a54906k5888K8219J44994L8488J0315N4916O7988p6282j26220m6288o65
13613h5329m0235j37521j5867R5067J18802O6438J49565k9831M4392K4279j77588
13602A2172l8957M2481O8867O6620K6140J8097p2993j02722j36288Q6771J83920
13591A54108K9168M6140r8237m4751M1793j32859O695M7458J33669J3682q8600
13580A08266J0806n7257n0253R8544n4188j0522j02835n1340N8086P6437P2366
13569I8110P6737L3382o4435j25812l7867L0395N792o2942L9990L8569M3426l9381
$$ y = [-47733, -144868, -113145, -48957, -58844, -143388, -144858, -35012, 158479, 150542, 102576, 44324, -23203, 111848, 148555, 153730, 96663, 37357, -9839, 3121, -15013, -83984, -165105, -114199, -154906, -180794, -152575, -7581, 30907, 41222, 96138, 164126, 87844, -38376, -84664, -85329, -125564, -263085, -278952, -183885, -65083, 1355, 150920, 121089, 165481, 189760, 12172, -26785, 15696, 84563, 151183, 177323, 195420, 122427, 19705, -116583, -29812, 154108, 183276, 229416, 131179, 86428, 128221, -4638, 2057, 49515, 183184, 196866, 108266, 119072, 61815, 11562, 110106, 55918, 45396, -57439, -108779, -50693, 25744, 98110, 174847, 208229, 143794, 17982, -19885, 10510, 16302, -46640, -6650, 31919, 75345, 35964]
13557C5964J23623Q4203L6072K7521n0083j39799o5109l0475q967J0307j39734
13546a16477q4605m614l6508L407R2004J09043M7694O7615j39356k5706O9663
13535a7840j8420J6469o944k0906l5518j2561M2111L4659q8499o454O9798N7089
13523A2984P796N9311J18598m7016q5295k4298M7365J1454j14146K4937O2613
13512G4303m2145j19786N1774j6420J21302n9487j22232M1517J81660j9385m5675
13501D5426M2075J27681j190l9523j6572n0803o706p12k2489o456k9261J6060
13489E7530L8592Q635j05668J7584J03531K42R974L379j03657L0662j1634j48717
13477i9547n5801p7566M2605J04959N6700J06818r44j23412l5127q9477M1974
$$ y = [35964, 159587, 243790, 279862, 307383, 257300, 117501, 52392, 21917, 12950, 23257, -116477, -201082, -205696, -242204, -238797, -146793, -37750, 9944, 77559, -61797, -87503, -17840, -36260, -19791, -26735, -47641, -83159, -95720, -53609, -18950, -107449, -113903, -44105, 12984, 20780, 80091, 198689, 151673, 66378, 42080, 89445, 100899, -13247, 11690, 74303, 32158, -87628, -35854, -52274, 69028, 9541, -112691, -71174, 110486, 91101, 45426, 87501, 215182, 213992, 174469, 157897, 107094, 100388, 99676, 77187, 70731, 41470, 57530, 96122, 104757, -911, 16673, 120204, 120446, 130420, 133799, 30142, 60804, 49170, -99547, -155348, -232914, -190309, -85350, -28650, 78168, 77224, -46188, -81315, -170792, -128818]
13466a28818O3209m5358k6816M467K22222Q0146j20336p3242l8650K240K887j6983
13454g5032L9587J00431P609l5534k4739j3501J3034P3877N6564M4707J1322N4546
13442B52871m659o8158j06010j3581K7612Q3943P8295L800o5711j64373j03084
13431g9055J12205R3754p4792m121N0231O2049Q412j0980n5567j1681m215r4260
13419h020q4871n3147K3581Q2446K1112l9553j08480q5317K3162M5097O7506J8242
13407i8242K9842J1816J5036L2133o0602o3287N3815k2k1307L969J57102J82745
13395B42998q2042j12045m2047k7236M1776R9258l1892O901o4730l2673N7455
13384E5723J7195N6202j4637j19165o4291O4039m3617q774Q3932j8036M4391K2997
$$ y = [-128818, -65609, -110967, -137783, -133316, 88906, 169052, 48716, -24526, -63176, -60936, -58049, -75032, -35445, 64986, 72595, 37061, 12322, -1179, 11855, 85732, 142296, 187003, 198325, 252871, 248212, 180054, 74044, 60463, 88075, 172018, 250313, 254113, 188402, 24029, -79055, 33150, 126904, 52112, 47991, 98222, 160271, 168683, 157703, 102136, 90455, 86240, -8020, -92891, -146038, -122457, -40011, -18899, -58452, -166932, -252249, -229087, -183990, -116484, -98242, -68400, -56584, -41548, -9415, -70017, -133304, -79489, -79511, -100818, -96849, 60253, 242998, 160956, 48911, 6864, -20372, 21404, 120662, 88770, 95671, 30941, -1732, 55723, 72918, 129120, 114483, -4682, -68973, -4934, -48551, -57325, 26607, 8571, 52962, 75959]
13372G5959N6530r2325n5176j7286K0564L0815M3491l589j05625J7991R3427M719
13360F9495M2110Q4416o3749j33300k6818m8149o9877Q96O9151K083O0282j9727
13348c3187j2920J35639P4236q2486l2191R2987l7588p5068J8312J4920O9897
13337A32551n6651j6995L9502Q247P4854M2144Q6744o1530r3883j20043j25561
13326i0621K7679Q7779J2813K6230p8034j02093l3434J64259J286q1427l979L3400
$$ y = [75959, 132489, 40164, -15012, -32298, -11734, 19081, 62572, 58983, -46642, -28651, 64776, 69495, 111605, 196021, 132272, -1028, -27846, -75995, -145872, -144976, -75825, -73742, -13460, -33187, -46107, 89532, 163768, 81282, 49091, 142078, 104490, 29422, 47734, 62654, 132551, 75900, 58905, 98407, 106654, 181508, 223652, 310396, 248866, 154983, 34940, -90621, -62942, 24837, 37650, 63880, -14154, -116247, -149681, 14578, 15864, -65563, -69542, -36142]
$$ [...]
##END NTUPLES=NMR SPECTRUM
##END=
