##TITLE=Analysis number 326900
Compound Code cc 07426
Book Reference 449/198
Project Code adrs
Chemist Name davee
##JCAMPDX= 6.0         $$ Bruker NMR JCAMP-DX V2.0
##DATA TYPE= NMR SPECTRUM
##DATA CLASS= NTUPLES
##ORIGIN= Bruker BioSpin GmbH
##OWNER= nmr
$$ XWIN-NMR		Version 3.5
$$ Thu Mar  1 09:56:53 2007 GMT Standard Time (UT+0h)  MAYBRIDGE\nmr@NMR_250MHZ
##.OBSERVE FREQUENCY= 250.131544655141
##.OBSERVE NUCLEUS= ^1H
##.ACQUISITION MODE= SIMULTANEOUS (DQD)
##.ACQUISITION SCHEME= undefined
##.AVERAGES= 16
##.DIGITISER RES= 18
##SPECTROMETER/DATA SYSTEM= dpx250
##.PULSE SEQUENCE= zg30
##.SOLVENT NAME= CDCl3
##.SHIFT REFERENCE= (INTERNAL, CDCl3, 0, 16.522)
##AUDIT TRAIL= $$ (NUMBER, WHEN, WHO, WHERE, WHAT)
$$ ##TITLE= Audit trail, XWIN-NMR		Version 3.5
$$ ##JCAMPDX= 5.01
$$ ##ORIGIN= Bruker BioSpin GmbH
$$ ##OWNER= nmr
$$ C:\u/data/dgb/nmr/ADRS/10/pdata/1/auditp.txt
$$ ##AUDIT TRAIL=  $$ (NUMBER, WHEN, WHO, WHERE, WHAT)
(   1,<2007-03-01 09:56:25.71 +000>,<MAYBRIDGE\nmr>,<NMR_250MHZ>,
      <created by zg, POWCHK disabled, PULCHK disabled
       configuration hash MD5:
       49 4B E0 1D 92 C2 6B 37 9F E6 65 BC 52 41 86 1D
       data hash MD5: 64K
       96 4C 29 DA 78 49 B8 59 73 A2 CD 0E AC F7 D1 87>)
(   2,<2007-03-01 09:56:41.38 +000>,<MAYBRIDGE\nmr>,<NMR_250MHZ>,
      <Start of raw data processing
       ef LB = 0.3 FT_mod = 6 PKNL = 1 SI = 32K 
       data hash MD5: 32K
       1A CE C7 90 39 9D AA 12 1E 72 08 38 08 23 89 13>)
(   3,<2007-03-01 09:56:43.33 +000>,<MAYBRIDGE\nmr>,<NMR_250MHZ>,
      <apk 
       data hash MD5: 32K
       96 B7 02 B3 15 BE 2E B4 3C 72 23 08 DF 7E 96 A2>)
(   4,<2007-03-01 09:56:44.22 +000>,<MAYBRIDGE\nmr>,<NMR_250MHZ>,
      <abs ABSG = 5 
       data hash MD5: 32K
       20 C3 7A 7A 8E 7A EF 2B 98 FE D9 FB B7 BB 47 EB>)
$$ ##END=
$$ 
$$ hash MD5
$$ 79 4D 97 1E 21 24 FB E9 99 22 C7 39 2A 7D F8 C2
##$RELAX= 
##$RELAX= 
##$RELAX= 
##$RELAX= 
##$RELAX= 
##$RELAX= 
##$RELAX= 
$$ Bruker specific parameters
$$ --------------------------
##$DU= <C:\u>
##$EXPNO= 10
##$NAME= <ADRS>
##$PROCNO= 1
##$TYPE= <nmr>
##$USER= <dgb>
##$AMP= (0..31)
100 100 100 100 100 100 100 100 100 100 100 100 100 100 100 100 100 100 
100 100 100 100 100 100 100 100 100 100 100 100 100 100 
##$AQSEQ= 0
##$AQ_mod= 3
##$AUNM= <au_zg>
##$AUTOPOS= <53 >
##$BF1= 250.13
##$BF2= 250.13
##$BF3= 250.13
##$BF4= 250.13
##$BF5= 500.13
##$BF6= 500.13
##$BF7= 500.13
##$BF8= 500.13
##$BYTORDA= 1
##$CFDGTYP= 0
##$CFRGTYP= 5
##$CHEMSTR= <none>
##$CNST= (0..31)
1 1 145 1 1 1 1 1 1 1 1 1 1 1 1 1 1 1 1 1 1 1 1 1 1 1 1 1 1 1 1 1 
##$CPDPRG= <>
##$CPDPRG1= <>
##$CPDPRG2= <>
##$CPDPRG3= <>
##$CPDPRG4= <mlev>
##$CPDPRG5= <mlev>
##$CPDPRG6= <mlev>
##$CPDPRG7= <mlev>
##$CPDPRG8= <mlev>
##$CPDPRGB= <>
##$CPDPRGT= <>
##$D= (0..31)
0 1 0 0 0 0 0 0 0 0.06 0 0 0 0 0 0 0.0002 0 0 0 0 0 0 0 0 0 0 0 0 0 0 
0 
##$DATE= 1172742984
##$DBL= (0..7)
120 120 120 120 120 120 120 120 
##$DBP= (0..7)
150 150 150 150 150 150 150 150 
##$DBP07= 0
##$DBPNAM0= <>
##$DBPNAM1= <>
$$ [...]
##$SUBNAM7= <"">
##$SUBNAM8= <"">
##$SUBNAM9= <"">
##$SW= 20.6930455092707
##$SWIBOX= (0..15)
0 0 3 0 0 0 0 0 0 0 0 0 0 0 0 0 
##$SW_h= 5175.983436853
##$TD= 65536
##$TD0= 1
##$TE= 295.16
##$TE2= 300
##$TE3= 300
##$TEG= 300
##$TL= (0..7)
0 120 120 120 120 120 120 120 
##$TP= (0..7)
150 150 150 150 150 150 150 150 
##$TP07= 0
##$TPNAME0= <>
##$TPNAME1= <>
##$TPNAME2= <>
##$TPNAME3= <>
##$TPNAME4= <>
##$TPNAME5= <>
##$TPNAME6= <>
##$TPNAME7= <>
##$TPOAL= (0..7)
0.5 0.5 0.5 0.5 0.5 0.5 0.5 0.5 
##$TPOFFS= (0..7)
0 0 0 0 0 0 0 0 
##$TUNHIN= 0
##$TUNHOUT= 0
##$TUNXOUT= 0
##$USERA1= <user>
##$USERA2= <user>
##$USERA3= <user>
##$USERA4= <user>
##$USERA5= <user>
##$V9= 5
##$VALIST= <valist>
##$VCLIST= <CCCCCCCCCCCCCCC>
##$VD= 0
##$VDLIST= <DDDDDDDDDDDDDDD>
##$VPLIST= <PPPPPPPPPPPPPPP>
##$VTLIST= <TTTTTTTTTTTTTTT>
##$WBST= 1024
##$WBSW= 4
##$XGAIN= (0..3)
0 0 0 0 
##$XL= 0
##$YL= 0
##$YMAX_a= 226754
##$YMIN_a= -234211
##$ZGOPTNS= <>
##$ZL1= 120
##$ZL2= 120
##$ZL3= 120
##$ZL4= 120
##$ABSF1= 16.522
##$ABSF2= -4.171173
##$ABSG= 5
##$ABSL= 3
##$ALPHA= 0
##$AQORDER= 0
##$ASSFAC= 0
##$ASSFACI= 0
##$ASSFACX= 0
##$ASSWID= 0
##$AUNMP= <proc_1d>
##$AZFE= 0.1
##$AZFW= 0.1
##$BCFW= 0
##$BC_mod= 0
##$BYTORDP= 0
##$COROFFS= 0
##$CY= 12.5
##$DATMOD= 1
##$DC= 0
##$DFILT= <>
##$DTYPP= 0
##$F1P= 14.0000005364418
##$F2P= -0.99999901652339
##$FCOR= 0.5
##$FTSIZE= 32768
##$FT_mod= 6
##$GAMMA= 0
##$GB= 0
##$INTBC= 1
##$INTSCL= 1
##$ISEN= 128
##$LB= 0.3
##$LEV0= 0
##$LPBIN= 0
##$MAXI= 10000
##$MC2= 0
##$MEAN= 0
##$ME_mod= 0
##$MI= 0
##$NCOEF= 0
##$NC_proc= -3
##$NLEV= 6
##$NOISF1= 0
##$NOISF2= 0
##$NSP= 0
##$NTH_PI= 0
##$NZP= 0
##$OFFSET= 16.522
##$PC= 1
##$PHC0= 235.5022
##$PHC1= -5.004067
##$PH_mod= 1
##$PKNL= yes
##$PPARMOD= 0
##$PSCAL= 4
##$PSIGN= 0
##$REVERSE= no
##$SF= 250.13
##$SI= 32768
##$SIGF1= 0
##$SIGF2= 0
##$SINO= 400
##$SIOLD= 32768
##$SREGLST= <1H.CDCl3>
##$SSB= 0
##$STSI= 32768
##$STSR= 0
##$SW_p= 5175.98343685301
##$SYMM= 0
##$S_DEV= 0
##$TDeff= 65536
##$TDoff= 0
##$TI= <Analysis number 999999
Compound Code 99
Book Reference 9
Project Code 9>
##$TILT= no
##$TM1= 0
##$TM2= 0
##$TOPLEV= 0
##$USERP1= <user>
##$USERP2= <user>
##$USERP3= <user>
##$USERP4= <user>
##$USERP5= <user>
##$WDW= 1
##$XDIM= 32768
##$YMAX_p= 316017470
##$YMIN_p= -216965
$$ End of Bruker specific parameters
$$ ---------------------------------
##NTUPLES= NMR SPECTRUM
##VAR_NAME=  FREQUENCY,     SPECTRUM/REAL,   SPECTRUM/IMAG
##SYMBOL=    X,             R,               I
##VAR_TYPE=  INDEPENDENT,   DEPENDENT,       DEPENDENT
##VAR_FORM=  AFFN,          ASDF,            ASDF
##VAR_DIM=   32768,         32768,           32768
##UNITS=     HZ,            ARBITRARY UNITS, ARBITRARY UNITS
##FACTOR=    0.157963299565203, 1,           1
##FIRST=     4132.6476996994, 0,             0
##LAST=      -1043.33573715361, 0,           0
##MIN=       -1043.33573715361, -216965,     0
##MAX=       4132.6476996994, 316017470,     0
$$ Real data points
##PAGE= N=1
##DATA TABLE= (X++(R..R)), XYDATA
$$ [...]
27429E4259j9187Q310K4764J1976j1833K0543L3217l0029j9281k8136K6598J8204
$$ 54259 35072 43382 68146 80122 68289 88832 122049 92020 72739 44603 71201 89405
27417H9405l1246J7842p686j6097k1780j1796n70j105J7868l385j7980J4502k1081
$$ 89405 58159 76001 68315 52218 30438 18642 18072 16967 34835 31450 13470 27972 6891
27404F891n540M0404K9339K7645q620J9558j5489m458J2664j3826o8738l9742
$$ 6891 1351 41755 71094 98739 90119 109677 94188 89730 102394 88568 19830 -19912
27392a9912k5711M7006J2155n2906p0413m2870M9716M8264J5412j5841J1300o032
$$ -19912 -45623 1383 13538 -39368 -109781 -152651 -102935 -54671 -39259 -55100 -43800 -49832
27380d9832Q981k8398j9210L2067m167J2843L0103N0009k1351l1661q35l170k3840
$$ -49832 -40851 -69249 -88459 -56392 -60559 -47716 -17613 32396 11045 -20616 -21451 -24621 -48461
27367d8461l8339R409p961J0070K8690M116J324j5470k0561q126p899N2869K1975
$$ -48461 -86800 -77391 -85352 -75282 -46592 -42476 -41152 -56622 -77183 -85309 -93208 -40339 -18364
27354a8364M6725J0310L0872J9359n417k6721k550j3573l2956k8477k1404k9795
$$ -18364 28361 38671 69543 88902 83485 56764 54214 40641 7685 -20792 -42196 -71991
27342g1991p355Q8304L1425k0974L551k2911r95j3648q2556k4415O5569M4518
$$ -71991 -79346 8958 40383 19409 22960 49 -946 -14594 -97150 -121565 -55996 -11478
27330a1478R125L529j3858M2213j4842k9041k448N6258j9247n1585M2085J1349
$$ -11478 -2353 1176 -12682 29531 14689 -14352 -16800 39458 20211 -31374 10711 22060
27318B2060m8631J2911L1727m0014l04l3465O044R901j4311j9818J7702O037L7765
$$ 22060 -26571 -13660 18067 -21947 -22251 -55716 -49672 -39771 -54082 -73900 -56198 -50161 -12396
27305a2396N865m9429K3839N1158K1266p6114J7749k0428k76J3428M0310j6133
$$ -12396 -6531 -55960 -32121 19037 40303 -35811 -18062 -38490 -38766 -25338 14972 -1161
27293a161o3310K065K3776l6461J614L6421K6275K438k153Q471K0873k2829j5675
$$ -1161 -64471 -62406 -38630 -75091 -73477 -37056 -10781 -8343 -10496 -2025 18848 -3981 -19656
27280a9656M4280K3236J3391k594q1729p1926O302L1243K1996k297M301M8222
$$ -19656 24624 47860 61251 58657 -23072 -94998 -88696 -57453 -35457 -37754 -33453 14769
27268A4769M2722k050n9662J554J712J805L8371l0927m5403m657K4260Q133L0677
$$ 14769 57491 55441 -4221 -2667 -955 850 39221 8294 -37109 -41766 -17506 -9373 21304
27255B1304L4680J1743n3611l009o793n548o75q17M361K726l9472R289L244L419
$$ 21304 55984 67727 14116 11107 4314 -1234 -1909 -2726 1635 4361 -35111 -25822 -22578 -19159
27241a9159J294N6144M2856k2175n1664j8765l648O242K7601j6655J4961J6632
$$ -19159 -17865 38279 81135 58960 7296 -11469 -15117 -8875 18726 2071 17032 33664
27229C3664l2959k0287J8211Q497L355j0701L350J916k5277N906N0504N9684L1685
$$ 33664 705 -19582 -1371 7126 10481 -220 3130 5046 -20231 -14325 36179 95863 127548
27216A27548m4698q2104L424J3327l5233l3379j731L9157k6985r369L3997K3889
$$ 127548 82850 746 4170 17497 -17736 -51115 -52846 -13689 -40674 -50043 -16046 7843
27204G843M1470J8059j4722l4834m0077J3804K8884n308l3442j4085p808N030
$$ 7843 49313 67372 52650 17816 -22261 -8457 20427 15119 -18323 -32408 -40216 -35186
27192c5186l1265K0250L224j7334J7923K7446r482l9952J4901L4503J4884l1675
$$ -35186 -66451 -46201 -42977 -60311 -42388 -14942 -24424 -64376 -49475 -14972 -88 -31763
27180c1763O6669L6993k9300j5078k8065J5260j1848k8544l3622j3500o617L6662
$$ -31763 34906 71899 42599 27521 -544 14716 2868 -25676 -59298 -72798 -79415 -42753
27168d2753J2109j9256k6727J7977O8504m2420l2010K0434R681M0383L3896k8113
$$ -42753 -30644 -49900 -76627 -58650 9854 -32566 -64576 -44142 -34461 5922 39818 11705
27156A1705o9526J1806Q845j0497K9341M909q037o738o708M570m0568O307J7461
$$ 11705 -57821 -46015 -37170 -47667 -18326 -13417 -21454 -28192 -34900 -30330 -70898 -64591 -47130
27143d7130J7997J9878k1603j3361k1368P8178O2646n0961k8705J1250P533j1212
$$ -47130 -29133 -9255 -30858 -44219 -65587 12591 75237 24276 -4429 6821 14354 3142
27131C142k3588N554O548k7546j0809m415q289N2838o588L508j9433j8784K0766
$$ 3142 -20446 -14892 -8344 -35890 -46699 -51114 -59403 -6565 -13153 -9645 -29078 -47862 -27096
27118b7096J247k043k777O3874J2248n0360n5411k4598N9596M3790j7301L481
$$ -27096 -25849 -27892 -30669 33205 45453 -4907 -60318 -84916 -25320 18470 1169 4650
27106D650l8294l4331O922N7291K7546J3685J4005k7910k9978K5976n58r513L038
$$ 4650 -33644 -67975 -61053 -3762 23784 37469 51474 23564 -6414 19562 19004 9491 12529
27093A2529J6274j2546N1264o7471n1070K3803K6655J5805j4399j2934j2255Q572
$$ 12529 28803 16257 67521 50 -51020 -27217 -562 15243 844 -12090 -24345 -15773
27081a5773K1354M3624n7299n439O486j7008l0154j1409m181L2590J6183J9406
$$ -15773 5581 49205 -8094 -13533 -7047 -24055 -54209 -65618 -69799 -37209 -21026 -1620
27069a620j135M7811P165m648m8253m116N7879l0145l6497p699N8187p236n0676
$$ -1620 -2755 45056 52221 47573 -680 -4796 53083 22938 -13559 -21258 36929 29693 -20983
27056b0983j9581k4826K8640N8984K186j3875K8K4413k727j2576l5240j0631K7373
$$ -20983 -40564 -65390 -36750 22234 24420 10545 10573 34986 32259 19683 -15557 -26188 1185
27043A185O810J1245j8952o666M0317J1785o7499L1011L9197m835j0717o6859
$$ 1185 7995 19240 288 -6378 33939 45724 -21775 9236 48433 43598 32881 -33978
27031c3978K6451M9097k3461J6671j0887m9311j6580l4254J4593J8765n342J401
$$ -33978 -7527 41570 18109 34780 23893 -25418 -41998 -76252 -61659 -42894 -48236 -46835
27019d6835L3671M7978N813m1747m213J3194j6381O2390K1170m4903o0653M804
$$ -46835 -13164 34814 40627 -1120 -5333 7861 -8520 53870 75040 30137 -30516 -25712
27007b5712N3575M4116K3914o8465o6880N9085L6702o3317o2966M9664M2316n6270
$$ -25712 27863 71979 95893 27428 -39452 19633 56335 -6982 -69948 -20284 22032 -34238
26995c4238l789K4802n979J8223j8154q1704k1931K2004J7080j2122M9662P9637
$$ -34238 -38027 -13225 -19204 -981 -19135 -100839 -122770 -100766 -83686 -95808 -46146 33491
26983C3491L1456n7732o7066k3092L6252N3576R2549k643m2304J2935j7648m6446
$$ 33491 64947 7215 -59851 -82943 -46691 6885 99434 96791 54487 67422 49774 3328
26971C328o8870l418k6994J1472N2020M1039J0203J4089O051M4701j3618p4447
$$ 3328 -65542 -68960 -95954 -84482 -32462 8577 18780 32869 38920 83621 70003 -4444
26959d444j8460p202K2362K7755J3157J8398m6606o5959J3413p917K8282L7361
$$ -4444 -22904 -30106 -7744 20011 33168 51566 4960 -60999 -47586 -55503 -27221 10140
26947A0140k6660L7984r00k1104K248L3917m9009R93L030n037J1732M4268L148
$$ 10140 -16520 21464 20564 -540 1708 35625 -13384 -12391 -9361 -14398 -2666 41602 44750
26934D4750m9269p747J4252j3069N691l0623l7519J474J8236Q4472K9435j2335
$$ 44750 -4519 -12266 1986 -11083 -5392 -36015 -73534 -72060 -53824 30648 60083 47748
26922D7748M9193r638p4238K3265k2207L1056P547m6772m9398r689M0010J5292
$$ 47748 96941 87303 13065 36330 14123 45179 52726 5954 -43444 -53133 -13123 2169
26910B169n376K2554L0178k9330L876L3606K4833R296j0461k1897l1703l9189
$$ 2169 -3207 19347 49525 20195 24071 57677 82510 91806 81345 59448 27745 -11444
26898a1444m0239L3044K5992K484r950J024r132j4719j1325N903j6648M3736O734
$$ -11444 -51683 -18639 7353 9837 -113 911 -8221 -22940 -34265 -28362 -45010 -1274 5460
26885E460m1031K3121J5966p523M2879K6098j8793k8793J3148L57n6559L8672
$$ 5460 -35571 -12450 3516 -4007 38872 64970 46177 17384 30532 30889 -25670 13002
26873A3002M7071m11j370P921k230l4430j2742j8828j5217j7207K5410L339M9836
$$ 13002 60073 59662 58292 66213 63983 29553 16811 -2017 -17234 -34441 -9031 -5692 44144
26860D4144M829m8068L942N0913M1539o214k7029k9777k7504K6144J3279K0317
$$ 44144 48973 905 4847 55760 97299 91085 64056 34279 6775 32919 46198 66515
26848F6515K0808N256n4648j766J0441q181j6339M9839j4768J4597k4076n0479
$$ 66515 87323 92579 37931 36165 46606 38425 22086 71925 57157 71754 47678 -2801
26836b801k0540J2947L6573m2006m4118j395J5846l6544l6145N4946N5097J7843
$$ -2801 -23341 -10394 26179 -15827 -59945 -61340 -45494 -82038 -118183 -63237 -8140 9703
26824I703k4321j602K7615K2153J2798j7610K981k871M5004P0030j541o435m6102
$$ 9703 -14618 -16220 11395 33548 46346 28736 31717 28846 73850 143880 142339 135904 89802
26811H9802j4581N08J73J9151k7292q235k0836p488m9003K4967P3705k9855o0000
$$ 89802 75221 75729 75902 95053 67761 59526 38690 31202 -17801 7166 80871 51016 -8984
26798h984J2848q228K8536J4754k9354J0823J1180Q74l7852n5393J9078M5608
$$ -8984 3864 -4364 24172 38926 9572 20395 31575 32449 -5403 -60796 -41718 3890
26786C890J5281k9365M8567j663k8099P526k1676K6416K2019K1422l0613m3255
$$ 3890 19171 -10194 38373 36710 8611 16137 -5539 20877 42896 64318 33705 -9550
26774i550k7740J7842N056J1164j4737K7520k9534J0226J8587L7612j5302K3108
$$ -9550 -37290 -19448 -14392 -3228 -17965 9555 -19979 -9753 8834 46446 31144 54252
26762E4252n9174m0651N6508L7608M2498M0922j5748R642J8604l8404k0612Q159
$$ 54252 -4922 -45573 10935 48543 91041 131963 116215 125857 144461 106057 85445 93604
26750I3604J4105k827m3053k7309l4100n1800j8162J0926L0502M1203K616l9995
$$ 93604 107709 104882 61829 34520 420 -51380 -69542 -58616 -28114 13089 15705 -24290
26738b4290q978M6298L4582j1705P414k4802K0434j9081K399n7598p4703K4549
$$ -24290 -33268 13030 47612 35907 43321 18519 38953 19872 22271 -35327 -110030 -85481
26726h5481L8458J0336J8569m305m9343K0716N475M9158N5289l8016l2330P0860
$$ -85481 -47023 -36687 -18118 -22423 -71766 -51050 -45575 3583 58872 20856 -11474 59386
26714E9386P7259k8066J1670k8454m6035q2916l5288K7784M9320m1609Q45K4986
$$ 59386 136645 108579 120249 91795 45760 -37156 -72444 -44660 4660 -36949 -36104 -11118
26702a1118N6104m4163k616J0428j8834n9031m0232M2154P0582j1791m0687k8609
$$ -11118 44986 823 -1793 8635 -10199 -69230 -109462 -67308 3274 -8517 -49204 -77813
26690g7813M5961M2538N4371K0858J2432j2363O590j0698l2812K0158q482l8024
$$ -77813 -31852 10686 65057 85915 98347 85984 92574 81876 49064 69222 60740 22716
26678B2716n5623L0126J246q865L1746L0634n7542p193P232q049K7803o1300O809
$$ 22716 -32907 -2781 -1535 -10400 21346 51980 -5562 -12755 -5523 -13572 14231 -47069 -40260
26665d0260J6597K1775l3214q6384r5479N464M3712J2367J7620O5129Q218q3692
$$ -40260 -23663 -1888 -35102 -121486 -216965 -211501 -167789 -155422 -137802 -72673 -64455 -148147
26653a48147l8768L5793L7766K8807R466P5535K5871n0631l3551M5113M4966o849
$$ -148147 -186915 -151122 -113356 -84549 -75083 452 26323 -24308 -57859 -12746 32220 25371
26641B5371J4687O646p6436j8704j6964o365P6926K845K1430M7486q362K583l4776
$$ 25371 40058 46704 -29732 -48436 -65400 -71765 5161 8006 29436 76922 68560 71143 36367
26628C6367l6644k3266k3954L0806L3586j3372l6357J7464l025L0204m15K2765
$$ 36367 -277 -23543 -47497 -16691 16895 3523 -32834 -15370 -18395 11809 11394 34159
26616C4159j4445L033L567J368K447r504j8113j6863j5936m2824l0455l7928L1821
$$ 34159 19714 22747 26314 27682 30129 20625 2512 -14351 -30287 -73111 -103566 -141494 -109673
26603a09673N9831p37k5013j2671J9483L8813j2429j7593K1933N769K6638J6495
$$ -109673 -49842 -50579 -75592 -88263 -68780 -29967 -42396 -59989 -38056 -32287 -5649 10846
26591A0846M5349j5537k4429J3709p020p5450j4363P7281O3795o930k4523j2816
$$ 10846 56195 40658 16229 29938 22918 -52532 -66895 10386 74181 67251 42728 29912
26579B9912K0491l5091j316l1678L7589k8930k4318l200k7131J9477q014M470
$$ 29912 50403 15312 13996 -17682 19907 -9023 -33341 -36541 -63672 -44195 -52209 -47739
26567d7739P4077K9616J0417l4766J8024j2780n1711k5036l9251Q005P3883K6701
$$ -47739 26338 55954 66371 31605 49629 36849 -14862 -39898 -79149 -71144 2739 29440
26555B9440K5601M2401j5411J4763m9136l0271k1730J0858J1393J8674k5074q382
$$ 29440 55041 97442 82031 96794 47658 17387 -4343 6515 17908 36582 11508 3126
26543C126j8041j2797l9993j0630L7417L2165O006l6602k2298K113j9847j3898
$$ 3126 -14915 -27712 -67705 -78335 -40918 -8753 -2747 -39349 -61647 -59534 -79381 -93279
26531i3279Q5201O5757k854j8351m4373M3024J4355K7742M3964n377J836J760
$$ -93279 -8078 57679 54825 36474 -7899 35125 49480 77222 121186 115809 117645 119405
26519A19405l8878k5946L5967K1067m6378n2577j351L2563o384l3378j1995m2226
$$ 119405 80527 54581 90548 111615 65237 12660 11309 43872 37488 4110 -7885 -50111
26507e0111J6097J6189J0476l6626K6075M3409K5458N0777j3845o0090n6088K752
$$ -50111 -34014 -17825 -7349 -43975 -17900 25509 50967 101744 87899 27809 -28279 -25527
26495b5527J3717K4809r932K3206p475J5401j9577J2504M3565n7244p325J1327
$$ -25527 -11810 12999 3067 26273 18798 34199 14622 27126 70691 13447 6122 17449
26483A7449K7380m4719o0626K380L6768L3929j9771k8880R921J2258J6688J7540
$$ 17449 44829 110 -60516 -58136 -21368 12561 -7210 -36090 -26169 -13911 2777 20317
26471B0317l4920n357J4687L0686j2790J7667l7106O3115L8942k9119o0781n4942
$$ 20317 -14603 -19960 -5273 25413 12623 30290 -6816 56299 95241 66122 5341 -49601
26459d9601K6260J3392k7455j6931O4498J1580p2829j3756J6490K6561J6225K754
$$ -49601 -23341 -9949 -37404 -54335 10163 21743 -51086 -64842 -48352 -21791 -5566 -2812
26447b812o991p559M6055j6533m1025m180m192L378K7091n315O211O84n2029L7980
$$ -2812 -9803 -17362 28693 12160 -28865 -33045 -37237 -33859 -6768 -12083 -5872 -5188 -57217 -19237
26433a9237L2097j1007M0867R731K1476l8071o3249j1223K7956k391K2468n3699
$$ -19237 12860 1853 42720 52451 73927 35856 -27393 -38616 -10660 -13051 9417 -44282
26421d4282k2722M386J7345K0415j8069o49R864Q548j9695j4545r177p032r569
$$ -44282 -67004 -62618 -45273 -24858 -42927 -43576 -33712 -25164 -44859 -59404 -68581 -75613 -85182
26408h5182j3654L6021M9500J2105n001L3795l0371m0927k9222L1935k231l222
$$ -85182 -98836 -62815 -13315 -1210 -6211 27584 -2787 -43714 -72936 -41001 -43232 -46454
26396d6454J1316l2461k4979M3444J6884K6624P718n083J4581K2597l5612L1603
$$ -46454 -35138 -67599 -92578 -49134 -32250 -5626 2092 -2991 11590 34187 -1425 30178
26384C0178q415p2619k7933L743J1290L5820l6970o173K2796K76l0392j569o417
$$ 30178 21763 -50856 -78789 -75046 -63756 -27936 -64906 -71079 -48283 -48007 -78399 -79968 -86385
26371h6385R623L0296M2723M004Q671j1184q147k1109J8347J664r362L1503M6987
$$ -86385 -76762 -46466 -3743 261 8932 -2252 -10399 -31508 -13161 -11497 -20859 10644 57631
26358E7631j1299k5381k1072L0377n4340q381j7930l4365O0425L8267j0131L303
$$ 57631 46332 20951 -121 30256 -24084 -32465 -50395 -84760 -24335 13932 3801 7104
26346G104j7784j1968J3571O9064J5177j0926m0730j9976k9780n5230J9288K7662
$$ 7104 -10680 -22648 -9077 59987 75164 64238 23508 3532 -26248 -81478 -62190 -34528
26334c4528n65j336j4304L2429j3936J3334j0656L7351J1912J7937l5200m1687
$$ -34528 -35093 -36429 -50733 -18304 -32240 -18906 -29562 7789 19701 37638 2438 -39249
26322c9249l5547M0177J624K0270M5528M42K0J0341N1940O3188L965j5932n1716
$$ -39249 -74796 -34619 -32995 -12725 32803 33245 33265 43606 95546 158734 162699 146767 95051
26309I5051R929L1791k5696L166M026l4434N868M0941j8656n9822k3240k9048
$$ 95051 104980 136771 111075 114241 118267 83833 89701 130642 111986 52164 28924 -124
26297a24j3123N1153L0653p8564m3643N961K2181J2498K1560k5976j2521k683
$$ -124 -13247 37906 68559 -10005 -53648 -47687 -25506 -13008 8552 -17424 -29945 -32628
26285c2628q058j5137k7L7595N9477J148k6530p117m0978j4491J5263k0148K4821
$$ -32628 -40686 -55823 -55850 -18255 41222 42370 15840 8723 -32255 -46746 -31483 -51631 -26810
26272b6810J4343k7642J1269J2340L930j4780l3704n406n41r889J8615N6306J0928
$$ -26810 -12467 -40109 -28840 -16500 -12570 -27350 -61054 -66460 -67001 -76890 -58275 -1969 8959
26259H959n0975l5565L92k1486O0591R8591J3666l0094m8813K4278R813j9660
$$ 8959 -42016 -77581 -77189 -98675 -38084 60507 74173 44079 -4734 19544 29357 9697
26247I697k5876k0798m696r764r125J6982L3154l6507r0678r629L9213j6190J2852
$$ 9697 -16179 -36977 -41673 -51437 -60562 -43580 -10426 -46933 -137611 -147240 -108027 -124217 -111365
26234a11365M3024q969J2623O5673O924j9146K3927K5196o072J4421k2079l6117
$$ -111365 -68341 -77310 -64687 986 7910 -11236 12691 37887 31815 46236 24157 -11960
26222a1960j1234K5626O2915q742k0260J6895j8430m3068m2895j3197J7961K4923
$$ -11960 -23194 2432 65347 56605 36345 53240 34810 -8258 -51153 -64350 -46389 -21466
26210b1466M0889M8962m336m1839p0002j1812L4836k1554j3128R680J7332M504
$$ -21466 19423 68385 64049 22210 -47792 -59604 -24768 -46322 -59450 -49770 -32438 -27934
26198b7934o514o2253J5156L3898M4471N547J0861O701L0039n9444m2594N9296
$$ -27934 -34448 -96701 -81545 -47647 -3176 2371 13232 19933 49972 -9472 -52066 7230
26186G230O6149k3064j4173j5590J3880l992P905n7662k6200r61K4879m493K3449
$$ 7230 73379 50315 36142 20552 34432 30440 38345 -19317 -45517 -46478 -21599 -26092 -2643
26173b643J3160R95J8256K3683j2045m7368l9616M3463M0569l3841o7507J855
$$ -2643 10517 11512 29768 53451 41406 -5962 -45578 -2115 38454 4613 -62894 -61039
26161f1039K8918M5649M6574j3015k8451o23m497k0151l085P440n0255o851M6493
$$ -61039 -32121 13528 60102 47087 18636 18013 13516 -6635 -9720 -2280 -52535 -59386 -12893
26148a2893M1780K8393j4903j8597k0242J9020p50J4033q052k2464j4184k9560
$$ -12893 28887 57280 42377 23780 3538 22558 21808 35841 27789 5325 -8859 -38419
26136c8419j5477k1358R970K3317R5353L6078q3198K2587M9598l2193m118l9140
$$ -38419 -53896 -75254 -65284 -41967 53386 89464 6266 28853 78451 46258 42140 3000
26124C000K4467M097K4132j1497m3571J0351q038k8599l564K4470l1785m0300
$$ 3000 27467 31564 55696 44199 628 10979 2941 -25658 -29222 -4752 -36537 -76837
26112g6837J6410J9915J9050K4960N4130O909j5845M321l2027q341j3337k2302
$$ -76837 -60427 -40512 -21462 3498 57628 64537 48692 53013 20986 12645 -692 -22994
26100b2994n750P760L2890o485n409K1180K0345j3881l0194j2486J2582M2463
$$ -22994 -28744 -20984 11906 5421 12 21192 41537 27656 -2538 -15024 -2442 40021
26088D0021l3357n0699k4286K7255M922J460j8119o268N0677J7071K2126M9655
$$ 40021 6664 -44035 -68321 -41066 -36144 -34684 -52803 -59071 -8394 8677 30803 80458
26076H0458K9726o810L779k4935j1014K1842J2720m895m5948n1727k3128j2151
$$ 80458 110184 103374 107153 82218 71204 93046 105766 100871 54923 3196 -19932 -32083
26064c2083M725K340L2737J5539j8385m045P3473J3122k4189m0604n0984j8969
$$ -32083 -27358 -25018 7719 23258 4873 828 74301 87423 63234 22630 -28354 -47323
26052d7323J0705J2495k0864K0622K0929k3701l461L0256N4304o438J989k1400
$$ -47323 -36618 -24123 -44987 -24365 -3436 -27137 -30598 -342 53962 47524 49513 28113
26040B8113J5100n894j7329k5829j9229J0081J093j7772j0880M2983Q407j8957
$$ 28113 43213 37319 19990 -5839 -25068 -14987 -13894 -31666 -42546 437 8844 -10113
26028a0113L9642J1946m2573m4214L951K7989l122l8156l7543j0431Q4382J7610
$$ -10113 29529 41475 -1098 -45312 -41361 -13372 -16494 -54650 -92193 -102624 -18242 -632
26016f32M025q595J9660l9691K438O6440N3224M5980p6785n5994l4523k1439L553
$$ -632 3393 -5202 14458 -25233 -22795 43645 96869 142849 66064 10070 -24453 -45892 -42339
26003d2339K3331N1434L3639k2849k1026M0215j3494o9017M9927k7520q986K721
$$ -42339 -19008 32426 66065 43216 22190 62405 48911 -20106 29821 2301 -6685 -3964
25991c964R804J046L4059N577L1758j3470m6685L4805m437q380k4316m1574k0627
$$ -3964 5840 6886 40945 46522 78280 64810 18125 52930 48493 40113 15797 -25777 -46404
25978d6404M7799j6612J2576k8387r780K3300K1622N5536l7170L080L9747Q573
$$ -46404 1395 -15217 -2641 -31028 -40808 -17508 4114 59650 22480 25560 65307 73880
25966G3880q5766J8942K7203R220l7529k6710k9733l2719p577N8042j2238r387
$$ 73880 -11886 7056 34259 43479 5950 -20760 -50493 -83212 -90789 -32747 -44985 -54372
25954e4372N1952K7614j9965q293K4833l0636J3833J6967m1703K0977R837l4236
$$ -54372 -2420 25194 5229 -3064 21769 -8867 4966 21933 -19770 1207 11044 -23192
25942b3192j0413M2173K2632p482l8004j7224q018k1930M7700K6563l3901Q155
$$ -23192 -33605 8568 31200 23718 -14286 -31510 -39528 -61458 -13758 12805 -21096 -12941
25930a2941K0873K5125r611k4507m2826J208K2701K9927J2734k0669k4247P4295
$$ -12941 7932 33057 23446 -1061 -43887 -42679 -19978 9949 22683 2014 -22233 52062
25918E2062K9896j8393l922k0592o6466m3127L5913N2067j7390j5236K6464q803
$$ 52062 81958 63565 59643 39051 -27415 -70542 -34629 17438 48 -15188 11276 2473
25906B473J7589O554J1830J1503N182j2492J0732q7J5934j7783n3269m2477K6920
$$ 2473 20062 26616 38446 49949 55131 42639 53371 53284 69218 51435 -1834 -44311 -17391
25893a7391N685r535n677k3674L1785k2121m2152q375J8904J4039n96K9371J1933
$$ -17391 -11706 -21241 -26918 -50592 -18807 -40928 -83080 -91455 -72551 -58512 -59108 -29737 -17804
25880a7804m7416K985L1279J354N7604Q962l6837l9361Q214L3973J6296J8137
$$ -17804 -65220 -62235 -30956 -29602 28002 36964 127 -39234 -31020 2953 19249 37386
25868C7386j8216K066r181j07085n1351R4148M4741K1451N08k4645k1040N6663
$$ 37386 19170 21236 12055 -95030 -146381 -52233 -7492 13959 14467 -10178 -31218 25445
25856B5445J0835j3568K238j4776k4778K9873m168L0625L4084m5945l9085M8629
$$ 25445 36280 22712 24950 10174 -14604 15269 11101 41726 75810 29865 -9220 39409
25844C9409J1418p333M7721J6364l7022K694L119m1415m5216l973j8898J5457
$$ 39409 50827 43494 91215 107579 70557 73251 76370 34955 -10261 -14234 -33132 -17675
25832a7675J0233j0158Q46k1462k9414k5100L1066M0712k4943j298L1872j0094
$$ -17675 -7442 -17600 -16754 -38216 -67630 -92730 -61664 -20952 -45895 -47193 -15321 -25415
25820b5415k6988Q716N7919M8288J4447k7478k4405j8459J1303L1957j9417P152
$$ -25415 -52403 -43687 14232 62520 76967 49489 25084 6625 17928 49885 30468 37620
25808C7620r6829O909L7202M2055L3709J2779m4715n7150j2947M9420j9137j3380
$$ 37620 -59209 -52300 -15098 26957 60666 73445 28730 -28420 -41367 8053 -11084 -24464
25796b4464K5063K7628J5491p560l6473K9225M3296K434L0334j1013l5436n1840
$$ -24464 599 28227 43718 36158 -315 28910 72206 74640 104974 93961 58525 6685
25784F685n5833J5115r855K4979J2871p096L6792J512k964o051N388P901L5063
$$ 6685 -49148 -34033 -43888 -18909 -6038 -13134 23658 25170 22206 16155 21543 29444 64507
25771F4507M938p5466p150J2826j7440J7712L056M5560L009j05064p3715m656
$$ 64507 69445 -6021 -13171 -345 -17785 -73 2983 48543 51552 -53512 -127227 -131883
25759a31883L8619P6637O1713K6358j6518o4865J0449M742j5034M2123k542l4602
$$ -131883 -93264 -16627 45086 71444 54926 -9939 510 5252 -9782 32341 29799 -4803
25747d803L4503K4230q1704N72M2342M0620M774j3160m3177M481L6890N822o0669
$$ -4803 29700 53930 -27774 -27202 15140 55760 60534 47374 4197 8678 45568 51390 -9279
25734i279J8484L4102J5193J7300k2959l1416j0463Q83K908l7726n4729J6895
$$ -9279 9205 43307 58500 75800 52841 21425 10962 11845 14753 -22973 -77702 -60807
25722f0807L0175J974L3029L1791K1974O31p911q711k8450k4095L5431p702j8624
$$ -60807 -30632 -28658 4371 36162 58136 58767 50856 42145 13695 -10400 25031 17329 -1295
25709a295j0897K0256K3027L6047l6244k4490k0058l73k7281l6566j087K941J8107
$$ -1295 -12192 8064 31091 67138 30894 6404 -13654 -14027 -41308 -77874 -78961 -76020 -57913
25696e7913L652J9121L2407K8944l9380n9566L8521m0243L2501J7946j8649p816
$$ -57913 -54261 -35140 -2733 26211 -13169 -72735 -34214 -74457 -41956 -24010 -42659 -50475
25684e0475k48K8780J5496J5165J0665O411j9172m7426l9491q515O241L2172K6167
$$ -50475 -50723 -21943 -6447 8718 19383 25794 6622 -40804 -80295 -88810 -82569 -50397 -24230
25671b4230l6326L8977j32j6561K654l5852M630N1299m131j8584K3283Q872O8748
$$ -24230 -60556 -21579 -21711 -38272 -35618 -71470 -66840 -15541 -19672 -38256 -14973 -6101 62647
25658F2647J0898K4075J4210j7916l1402j0634j0666l18j2419K0979m2839N255
$$ 62647 73545 97620 111830 93914 62512 51878 41212 40894 28475 49454 6615 11870
25646A1870N8676n6139l402k3215n935k5199l2983N2576L8875m3813k0844J096
$$ 11870 70546 14407 11005 -12210 -18145 -43344 -76327 -23751 15124 -28689 -49533 -48437
25634d8437M0548m8138o2946l0656N9824N1604L7519k6626j3508k3889Q165K9551
$$ -48437 -7889 -56027 -118973 -149629 -89805 -38201 -682 -27308 -40816 -64705 -56540 -26989
25622b6989j0734m2962L7422N4502r271k1780O352m7486J4094K3292K4354L7783
$$ -26989 -37723 -80685 -43263 11239 1968 -19812 -13460 -60946 -46852 -23560 794 38577
25610C8577J9462p3692k4349o10M8315j5578n6772m344q888r608K1716K2709J0237
$$ 38577 58039 -15653 -40002 -40612 7703 -7875 -64647 -68991 -77879 -87487 -65771 -43062 -32825
25597c2825K756K8459N4328l2860n0858j8442J1285K0030l56J5515o819L3951
$$ -32825 -30069 -1610 52718 19858 -31000 -49442 -38157 -18127 -18483 -2968 -9787 24164
25585B4164J3995P205l9495q639J1303J2224J294J7402l0637n2676l6003L1660
$$ 24164 38159 45364 5869 -2770 8533 20757 22051 39453 8816 -43860 -79863 -48203
25573d8203k139p637O3035J3367k9683O2610r177j2463J2058m8457l2101K9017
$$ -48203 -50342 -57979 5056 18423 -11260 51350 42173 29710 41768 -6689 -38790 -9773
25561i773J1164m0788J7396k3992o831n03M3666L747j1246k3018K463m2871k1027
$$ -9773 1391 -39397 -22001 -45993 -52824 -53327 -9661 -5914 -17160 -40178 -37715 -80586 -101613
25548a01613l2510K8261q023O3878N6739m5192m0937j3437q240N3079J9540P657
$$ -101613 -134123 -105862 -113885 -50007 6732 -38460 -79397 -92834 -101074 -47995 -28455 -20798
25536b0798K0973r788j1475O215J8726j4699J979l464n66n3162l5846p236M7433
$$ -20798 175 -9613 -21088 -14873 3853 -10846 -8867 -12331 -12897 -66059 -101905 -109141 -61708
25523f1708P3620q936k6909l9771k218N4197N1912l4533N808L4767l299R580j673
$$ -61708 11912 2976 -23933 -63704 -65922 -11725 40187 5654 11462 46229 42930 52510 50837
25510E0837N4818J0266m8591l5241m272L6497J7922k4103m2443r615m1273p314
$$ 50837 105655 115921 67330 32089 27817 64314 82236 58133 15690 6075 -35198 -42512
25498d2512m614N4075M3380k540j5789l1178p586m3842l2765l920N2626Q5506
$$ -42512 -47126 6949 50329 47789 32000 822 -6764 -50606 -83371 -87291 -34665 50841
25486E0841M5929k1214r3580l5400Q620M1389L1861L6520k3622n0135m1164L1766
$$ 50841 96770 75556 -18024 -53424 -44804 -3415 28446 64966 41344 -8791 -49955 -18189
25474a8189K8314l0165j581P9593J3379o4105J2454J7684l4487m2336j3580l272
$$ -18189 10125 -20040 -21621 57972 71351 7246 19700 37384 2897 -39439 -53019 -56291
25462e6291M1793M4169J0365K8095k0802j7498K1778k3215j5605k2014l04M6818
$$ -56291 -14498 29671 40036 68131 47329 29831 51609 28394 12789 -9225 -9529 37289
25450C7289R4672J7265k7801o2361l2729q92j00337j7735M2187N8353J944n0715
$$ 37289 131961 149226 121425 59064 26335 25443 -74894 -92629 -50442 7911 9855 -40860
25438d0860m9805K8024m2770l4465k860L3914Q6612j9003L34J9989k724J8266
$$ -40860 -90665 -62641 -105411 -139876 -142736 -108822 -22210 -41213 -40879 -20890 -23614 -5348
25426e348K3306L4501R622j6609k1019n8466o5532K4787J6417m2869K9586K9499
$$ -5348 17958 52459 62081 45472 24453 -34013 -99545 -74758 -58341 -101210 -71624 -42125
25414d2125L535N1166N1568Q806l7164J6166o164q521o896k5661j9553M493L0318
$$ -42125 -38590 12576 64144 72950 35786 51952 45788 37267 30371 4710 -14843 -10350 19968
25401A9968O037J3084n560l6605k543J2470j6160m4660K5756K0139j4642l856
$$ 19968 26005 39089 33529 -3076 -5619 6851 -9309 -53969 -28213 -8074 -22716 -26572
25389b6572j449N0199M0734k9933j4296M329o228l4393J8077k5075k512K7264
$$ -26572 -28021 22178 62912 32979 18683 23012 16784 -17609 468 -24607 -27119 145
25377A45J1578N3323k5883k8408K7363j8019J1115j9592m5278K3335K5092k0969
$$ 145 11723 65046 39163 10755 38118 20099 31214 11622 -33656 -10321 14771 -6198
25365f198j4017j2279L6526l9548p187l1987p835R489M9264j2008k2485J4779
$$ -6198 -20215 -32494 4032 -35516 -42703 -74690 -82525 -73036 -23772 -35780 -58265 -43486
25353d3486k4651J417j4926J5799M3147j0399m7737M6062N2876j9607J1540P858
$$ -43486 -68137 -66720 -81646 -65847 -22700 -33099 -80836 -34774 18102 -1505 10035 17893
25341A7893R026k1602l8171k0485K1704K9820J5120J2262J4815L3000K2901n2392
$$ 17893 26919 5317 -32854 -53339 -31635 -1815 13305 25567 40382 73382 96283 43891
25329D3891j7447j3289k3130j006M2177L2367J5262j023J414n2357j9345N6604
$$ 43891 26444 13155 -9975 -10981 31196 63563 78825 77802 79216 26859 7514 64118
25317F4118N1203r926j8984l6520m16k5153J6425K2074M0367l8155l2050k9525
$$ 64118 115321 105395 86411 49891 49475 24322 40747 62821 103188 65033 32983 3458
25305C458l2213Q006M0535J7319J620l112N1524n4960o1950k5020J6536K1168
$$ 3458 -28755 -20749 19786 37105 38725 35613 87137 32177 -29773 -54793 -38257 -17089
25293a7089K8472L4237L3157N240j8081k5297j5822k0153J4609K1073j2269p349
$$ -17089 11383 45620 78777 84017 65936 40639 24817 4664 19273 40346 28077 20728
25281B0728R724L6383J0871j3094J8683J545l5701r837J2221m1227k9860J8394
$$ 20728 30452 66835 77706 64612 83295 84840 49139 39302 51523 10296 -19564 -1170
25269a170j5721J0914l7570k6167n411K3481L1738k0785K9644k6246K2644M9878
$$ -1170 -16891 -5977 -43547 -69714 -75125 -51644 -19906 -40691 -11047 -37293 -14649 35229
25257C5229m2063r9428l1475L7126O1529M1448J7291m227r07m8587l1681L2471
$$ 35229 -6834 -106262 -137737 -100611 -39082 2366 19657 15430 14523 -34064 -65745 -33274
25245c3274K2476j403J6290J9504J9052k0373n6843M262K7665N2393j8213k1326
$$ -33274 -10798 -12201 4089 23593 42645 22272 -34571 -30309 -2644 49749 31536 10210
25233A0210m936k9492L4247M2537k005m7185j673J5154j9513J159o441j7839k1284
$$ 10210 5274 -24218 10029 52566 50561 3376 1703 16857 -2656 -1497 -7938 -25777 -47061
25220d7061O5227P3448j2819p075j240m9808l260o932l1228L359J9759O2770K036
$$ -47061 18166 91614 78795 71720 70480 20672 17412 10480 -20748 -17389 2370 65140 67176
25207F7176l2035j0536k4526j6330l3570N6190J4879j2412n2886j2786L2312M1751
$$ 67176 35141 24605 79 -16251 -49821 6369 21248 8836 -44050 -56836 -24524 17227
25195A7227K5711N3878l3409n5063N949M8247j9888J6211k802l1064K2611o212
$$ 17227 42938 96816 63407 8344 14293 62540 42652 58863 56061 24997 47608 41396
25183D1396j1632j6037j5843J2657j3133j5288J5235O615K4023O29q72j3430j9352
$$ 41396 29764 13727 -2116 10541 -2592 -17880 -2645 3970 27993 28622 27750 14320 -5032
25170e032J2009J5853J9615P012n0825l664K3445J6592n0093k6989k5687j7730
$$ -5032 6977 22830 42445 49457 -1368 -5032 18413 35005 -15088 -42077 -67764 -85494
25158h5494N0764L1650O264n858k0193p1320N834J04820J5252j43n841l3327J3485
$$ -85494 -34730 -3080 3184 -2674 -22867 -94187 -88353 16467 31719 31576 25735 -7592 5893
25145E893M8407j2547n5066j4825M5545k1390j9671L1822n5357k9149J3808M2140
$$ 5893 54300 41753 -13313 -28138 17407 -3983 -23654 8168 -47189 -76338 -62530 -20390
25133b0390L7732J5335J2392K626j9148M1972R238j7451k3880m9624k4213r005
$$ -20390 17342 32677 45069 47695 28547 70519 79757 62306 38426 -11198 -35411 -44416
25121d4416J1854K2909N283J4434k4543O463J4382l683l0749m1057L5796K8631
$$ -44416 -32562 -9653 -4370 10064 -14479 -8016 6366 2683 -28066 -69123 -33327 -4696
25109d696j7229m0789J6404K9471l3682K3981P1471L945K0495J0801k8038l2075
$$ -4696 -21925 -62714 -46310 -16839 -50521 -26540 44931 48876 69371 80172 52134 20059
25097B0059m0502L4286j563l8540K1406j4224P258N2014J9898k3582k7322j4547
$$ 20059 -20443 13843 12280 -26260 -4854 -19078 -11820 40194 60092 36510 9188 -5359
25085e359L6402J57k8302K0446J6004N699P445o950j1681l0279l662J272k878
$$ -5359 31043 31200 2898 23344 39348 45047 52492 45542 33861 3582 -80 1192 -1686
25072a686k0948j6535K9463M8732k0691l5121O8795J4774j3358l1037l4281J3734
$$ -1686 -22634 -39169 -9706 39026 18335 -16786 52009 66783 53425 22388 -11893 1841
25060A841M8374K2554j563m4465o6774j8890K9676N753n844O193P41j0669j0619
$$ 1841 50215 72769 71206 26741 -40033 -58923 -29247 -23494 -29338 -23145 -22404 -33073 -43692
25047d3692L6992m889K0124m4907j028M215J6151l2579j1920L1040J7027l1842
$$ -43692 -6700 -11589 8535 -36372 -37400 -33185 -17034 -49613 -61533 -30493 -13466 -45308
25035d5308k2141K486j2673O1501L9228m1115L2605l6453p5239Q735K3861j34
$$ -45308 -67449 -64963 -77636 -16135 23093 -18022 14583 -21870 -97109 -88374 -64513 -64647
25023f4647K6213L0823N7054l8823k2150J8358l6572k8870j1732K0213j9991P620
$$ -64647 -38434 -7611 49443 10620 -11530 6828 -29744 -58614 -70346 -50133 -70124 -62504
25011f2504P0883N4946r297k7312K1879L8397m8059l1488J4082J4098J8526j7953
$$ -62504 8379 63325 54028 26716 48595 86992 38933 7445 21527 35625 54151 36198
24999C6198j3925N647N120K48k8258M0864J5675m8665L517j5948k419j1376l7622
$$ 36198 22273 27920 33040 33288 5030 45894 61569 12904 16421 473 -1946 -13322 -50944
24986e0944N8047K3805K7136m220o0722Q969L0299k8823K0560O1689J5282n0719
$$ -50944 7103 30908 58044 53824 -6898 2071 32370 3547 24107 85796 101078 50359
24974E0359m7628k7312P566k0597L1063M9328K3841j5251J1922m3371k6643L6389
$$ 50359 2731 -24581 -17015 -37612 -6549 42779 66620 51369 63291 19920 -6723 29666
24962B9666k0069n085L0819q899J4608M4410k6322m7896l999J8931j9378j951
$$ 29666 9597 4512 35331 26432 41040 85450 59128 11232 7233 26164 6786 4835
24950D835l9822L2734J7081j8233n4036p437N7388o297J0644J7528J5175j6331
$$ 4835 -34987 -2253 14828 -3405 -57441 -64878 -7490 -13787 -3143 14385 29560 13229
24938A3229j5406j8958K11O2689J6415k1924l3133r424l8775j2602J5412J9837
$$ 13229 -2177 -21135 -20924 41765 58180 36256 3123 -6301 -45076 -57678 -42266 -22429
24926b2429M7786k4410o4085N4819M505n45M6017J1233J3954N206k7228l272m3196
$$ -22429 25357 947 -63138 -8319 -3814 -4359 41658 52891 66845 72051 44823 41551 -1645
24913a645k359o754j8745L0261k929n1745P668M5760j0334l7549k2673O5669K5540
$$ -1645 -4004 -10758 -29503 758 -2171 -53916 -46248 -488 -10822 -48371 -71044 -5375 20165
24900B0165k9867J2090K5166k5590n4168l5388M4338O6851L5262m0183K547M2285
$$ 20165 -9702 2388 27554 1964 -52204 -87592 -43254 23597 58859 18676 21223 63508
24888F3508n0387J0238l0508J0088L2681j9229p820l7265l4821l573L4319Q901
$$ 63508 13121 23359 -7149 2939 35620 16391 8571 -28694 -63515 -67088 -32769 -23868
24876b3868M1443O1159j4043K0630j9834k0561j8103l0154k8314p362J9452K8108
$$ -23868 17575 78734 64691 85321 65487 44926 26823 -3331 -31645 -39007 -19555 8553
24864H553Q955o5404l4749J4491L1700q92o562J3110j9325M649m6514J6591L4082
$$ 8553 17508 -47896 -82645 -68154 -36454 -37346 -43908 -30798 -50123 -45474 -91988 -75397 -41315
24851d1315M9756r232R555j057P149O3098j4209j3190P068J0638l2113L674O5
$$ -41315 8441 -791 8764 7707 14856 77954 63745 50555 57623 68261 36148 39822 39887
24838C9887J2624R19p86k8989k2024k9801l5174J9280P284L4501N9559j6949n4071
$$ 39887 52511 53430 52644 23655 1631 -28170 -63344 -44064 -36780 -2279 57280 40331 -13740
24825a3740j0897J4594j4991k9372M4929L0865L0891j2531m0669l1710j1672n266
$$ -13740 -24637 -10043 -25034 -54406 -9477 21388 52279 39748 -921 -32631 -44303 -49569
24813d9569k2047m6127L2968L2713l6102j7660L0398L3689Q331L4402M5600l7268
$$ -49569 -71616 -117743 -84775 -52062 -88164 -105824 -75426 -41737 -33406 996 46596 9328
24801I328n8340j651P043J4124k7838O843m931N6468j4271L2110J6484m9290J8200
$$ 9328 -49012 -50663 -43620 -29496 -57334 -50491 -55422 1046 -13225 18885 35369 -13921 4279
24788D279K6082L3588J1988n3458n1718M4L9382k0093M667K3019j0084j0252k3854
$$ 4279 30361 63949 75937 22479 -29239 -29195 10187 -9906 -5239 17780 7696 -2556 -26410
24775b6410L1623J8932m3134l02L7090k148K4145l3022n9278L1470J6223J8323
$$ -26410 5213 24145 -18989 -19291 17799 15651 39796 6774 -52504 -21034 -4811 13512
24763A3512j1719K475k3857l2507J9101J4072K1418n9765n5038M9336K3547j2517
$$ 13512 1793 4268 -19589 -52096 -32995 -18923 2495 -57270 -112308 -62972 -39425 -51942
24751e1942J6847K1276J984m643o494N223K0451K971l544J1696j2705k7480P6510
$$ -51942 -35095 -13819 -11835 -16478 -22972 -17749 2702 5673 2129 13825 1120 -26360 50150
24738E0150K8069l7943j0833L4220n5739l7834K4399L2779r618n7268k3904O106
$$ 50150 78219 40276 29443 63663 7924 -29910 -5511 27268 17650 -39618 -63522 -57416
24726e7416k0049K5802K7132J9908k7832K1142J2761q451N4411M2122q042q6199
$$ -57416 -77465 -51663 -24531 -4623 -32455 -11313 1448 -7003 47408 89530 81488 -4711
24714d711l7042p1976n825K4797N0812Q9397j9365m4042m0893O1855P9645j7300
$$ -4711 -41753 -113729 -119554 -94757 -43945 45452 26087 -17955 -58848 3007 82652 65352
24702F5352j4117j1249J7133m581K4991J741p1838n1230k5026P723L7925J6587
$$ 65352 51235 39986 57119 52538 77529 79270 7432 -43798 -68824 -61101 -23176 -6589
24690f589K907J9410J079j1177o843L7105j4895q252K9963J5757j130j2979L9270
$$ -6589 -3682 15728 16807 5630 -1213 35892 20997 12745 42708 58465 57335 44356 83626
24677H3626L946o2246l0790j2507J2239M1641l141j4265N1517J049l7704l9395
$$ 83626 87572 25326 -5464 -17971 -5732 35909 32768 18503 70020 71069 33365 -6030
24665f030M726J7970K7429k5694k1815m170M3556j5905J1859N018m0116j2597
$$ -6030 -1304 16666 44095 18401 -3414 -7584 35972 20067 31926 36944 -3172 -15769
24653a5769j0216J8984J290p713M2478r186m5564l9037l6241k4828M1352P0515
$$ -15769 -25985 -7001 -5711 -13424 29054 19868 -25696 -64733 -100974 -125802 -84450 -13935
24641a3935O614m701l9799n2010O9463K6245J4288K484q448K5731j0167k7559
$$ -13935 -7321 -12022 -51821 -103831 -34368 -8123 6165 8649 201 25932 15765 -11794
24629a1794O855K503k7371o520P3885j3542n2058k330O811P07k9195r838j3972
$$ -11794 -4939 -2436 -29807 -36327 37558 24016 -28042 -30372 -23561 -22854 -52049 -61887 -75859
24616g5859r869J0439k0418P0746R6333Q173J1563l7453n4083M1231k8079k9779
$$ -75859 -85728 -75289 -95707 -24961 71372 79545 91108 53655 -428 40803 12724 -17055
24604a7055R1577K103m4686k6867L1980m7099P112L1028O398k7860N930j0001
$$ -17055 74522 76625 31939 5072 37052 -10047 -2935 28093 34491 6631 12561 2560
24592B560J8953N376m0720m31k3771K3612R149L836J3354j4714R650P173l597
$$ 2560 21513 26889 -13831 -14262 -38033 -14421 -5272 -1436 11918 -2796 6854 14027 10430
24579A0430r602K6743K1822n7600j1187q721l1102k71J126R572K6367K6325J7627
$$ 10430 828 27571 49393 -8207 -19394 -28115 -59217 -59488 -58362 -48790 -22423 3902 21529
24566B1529p217K0170o0857o9124K5173N9959l0167P544m412k6745O94Q666K2575
$$ 21529 14312 34482 -26375 -95499 -70326 -10367 -40534 -32990 -37402 -64147 -63453 -54787 -32212
24553c2212J0526L0814o987m3328l3008M0004R0227K333l8960k484J687n1911
$$ -32212 -21686 9128 2141 -41187 -74195 -34191 56036 58369 19409 16925 18612 -33299
24541c3299j9249k407o3135l3000J5763L5483J3321j4716J7776L8507L231J4859
$$ -33299 -52548 -54955 -118090 -151090 -135327 -99844 -86523 -101239 -83463 -44956 -41725 -26866
24529b6866k6249o0974l1128M3912M2297M6402O632O422M9523l7138j8385r290
$$ -26866 -53115 -114089 -145217 -101305 -59008 -12606 -5974 448 49971 12833 -5552 -14842
24517a4842j7982R078o268j39q100K6620K0809n722J9101L1275k0047o2646J0037
$$ -14842 -32824 -23746 -30014 -30153 -38253 -11633 9176 3454 22555 53830 33783 -28863 -18826
24504a8826L8220J4366k657m4945n9133L3228P1257J0058m7820l3931L3969N5923
$$ -18826 19394 33760 31103 -13842 -72975 -39747 31510 41568 -6252 -40183 -6214 49709
24492D9709Q2342k1339j10997o444L2448L0093R740k5146l2434Q271l4747k8156
$$ 49709 132051 110712 -285 -6729 25719 55812 65552 40406 7972 16243 -18504 -46660
24480d6660L5891L4567L906o4433M820K8222J4373k605K3442l1642k0150k2661
$$ -46660 -10769 23798 27704 -36729 -31909 -3687 10686 8081 31523 -119 -20269 -42930
24468d2930j7627K6968j4202R29O95K8995J9844L8735L2069l0475o0538L420o116
$$ -42930 -60557 -33589 -47791 -46862 -46167 -17172 2672 41407 73476 43001 -17537 -14117 -20233
24455b0233K8522m4469k66O1193L4971n754K8792K5088l2523n822o2370l186m303
$$ -20233 8289 -36180 -36446 24747 59718 53964 82756 107844 75321 69499 7129 3943 -360
24442c60J2357N608k6372k510L743j5017K0662M1219p535m0947L0154K2107R596
$$ -360 11997 17605 -8767 -11277 -7534 -22551 -1889 39330 31795 -9152 21002 43109 52705
24429E2705k7173m0185k4659o306J101J8421J2964K4775j3881m1979K1529n5107
$$ 52705 25532 -14653 -39312 -45618 -44517 -26096 -13132 11643 -2238 -44217 -22688 -77795
24417g7795L3779M9909k9271q0911K6720M8309J0575K9361r859J3960K7523l9905
$$ -77795 -44016 5893 -23378 -104289 -77569 -29260 -18685 10676 817 14777 42300 2395
24405B395k5828J0069J3589M9943J5642J120J4459l7364n0973M1685p889P892
$$ 2395 -23433 -13364 225 50168 65810 66930 81389 44025 -6948 34737 26848 34740
24393C4740K1757J5100k7360m9422j2609k6265n448L7890J0503O2169K0110m4593
$$ 34740 56497 71597 44237 -5185 -17794 -44059 -49507 -11617 -1114 61055 81165 36572
24381C6572L3347M9542j5615n840l9611J347l4562k5665K1651j1870k8855L176
$$ 36572 69919 119461 103846 98006 58395 59742 25180 -485 21166 9296 -19559 -16383
24369a6383K2499k3526q859J4493N4924K2746j9498K7612L97l9423m6858k9856
$$ -16383 6116 -17410 -26269 -11776 43148 65894 46396 74008 74405 34982 -11876 -41732
24357d1732K9412K8387o2788k2084o689L7754n988L9508R0171j8353m6957q1565
$$ -41732 -12320 16067 -46721 -68805 -75494 -37740 -43728 -4220 85951 67598 20641 -60924
24345f0924K1836Q3818J8231L8448R041O408l8304r8863k7456O8252N1020p709
$$ -60924 -39088 44730 62961 101409 110450 116858 78554 -20309 -47765 20487 71507 63798
24333F3798R803k5815j212r994K2214k501p2202J1346N1851M0601n3693o8390
$$ 63798 73601 47786 46574 36580 58794 56293 -15909 -4563 47288 87889 34196 -34194
24321c4194L223J355l697J8784J7492N682K3163J2808n4018l163l352J8188j3382
$$ -34194 -30971 -29616 -33313 -14529 2963 8645 31808 44616 -9402 -12565 -15917 2271 -11111
24308a1111k2172k8858L0403M9239m5243j4262N8624p535j5192K3396l62l4414
$$ -11111 -33283 -62141 -31738 17501 -27742 -42004 16620 9085 -6107 17289 16927 -17487
24296a7487l253R546M1937K4002m9785m9422k7199j4021L7052O7289M2697j2758
$$ -17487 -20740 -11194 30743 54745 4960 -44462 -71661 -85682 -48630 18659 61356 48598
24284D8598r695M1095O885m5051L288q2360p0673r055J4716J141K4162P258j5100
$$ 48598 38903 79998 86883 41832 45120 -37240 -107913 -116968 -102252 -101111 -76949 -69691 -84791
24271h4791Q6562P1776j15k6811j2979k9791j5722K682m2971j1537j6436P257
$$ -84791 1771 73547 73432 46621 33642 3851 -11871 -9189 -52160 -63697 -80133 -72876
24259g2876M3800N4239j4684J4245J3395L496J1491j1510J4301L6135k8755l3256
$$ -72876 -29076 25163 10479 24724 38119 41615 53106 41596 55897 92032 63277 30021
24247C0021m0809k3412J849j0664J8959m563M034M1724j4925m0605j2166J9325
$$ 30021 -10788 -34200 -32351 -43015 -24056 -28619 -24585 17139 2214 -38391 -50557 -31232
24235c1232K4036Q067j5785P924l9445k2442L3465k6322L9511L2590o746k4674
$$ -31232 -7196 871 -14914 -6990 -46435 -68877 -35412 -61734 -22223 10367 3621 -21053
24223b1053k7547P919O486l3451j5020M4846N1308l5591l5246j7717M5189M1631
$$ -21053 -48600 -40681 -34195 -67646 -82666 -37820 13488 -22103 -57349 -75066 -29877 11754
24211A1754m370N120j2241J8493m1458j5338j8152j2821J601K1674r300O0765
$$ 11754 7384 12504 263 18756 -22702 -38040 -56192 -69013 -67412 -45738 -55038 5727
24199E727N5713j3661k8623k9692J2766L724J3052N9818j0407o3925N797N0660
$$ 5727 61440 47779 19156 -10536 2230 5954 19006 78824 68417 4492 10289 60949
24187F0949k5848n3791K9230J2823m3703j4864j9450n1205l0642r498K8919K4442
$$ 60949 35101 -18690 10540 23363 -20340 -35204 -54654 -105859 -136501 -145999 -117080 -92638
24175i2638J610L9536K7904k9477J5489M7536O566K5264J6613k9954m6646k3753
$$ -92638 -91028 -51492 -23588 -53065 -37576 9960 16526 41790 58403 28449 -18197 -41950
24163d1950o151j0273l567j3706J2773K3281l0292K4211j5202M045j4096N1920
$$ -41950 -48101 -58374 -61941 -75647 -62874 -39593 -69885 -45674 -60876 -56831 -70927 -19007
24151a9007M5513J3264m1309j8578L2841m0500j8526N6316J6737m7938k1786M7547
$$ -19007 26506 39770 -1539 -20117 12724 -27776 -46302 10014 26751 -21187 -42973 4574
24139D574M9228J3752J5154k7804k5145J279j8660l931j7275m3317J351P795k4370
$$ 4574 53802 67554 82708 54904 29759 31038 12378 8447 -8828 -52145 -50794 -42999 -67369
24126f7369j4315N5777O4252k7348k4564j1114l5685j9504K3035p387N8223K4505
$$ -67369 -81684 -25907 38345 10997 -13567 -24681 -60366 -79870 -56835 -64222 -5999 18506
24114A8506m4666j0411m8080k883N4892K6281N5776j0459m6386J2560k2015L750
$$ 18506 -26160 -36571 -84651 -87534 -32642 -6361 49415 38956 -7430 5130 -16885 -13135
24102a3135J4639Q846J7892p914l8849l9048J2953N3806O5590M2574n989j1473
$$ -13135 1504 10350 28242 20328 -18521 -57569 -44616 9190 74780 117354 111365 99892
24090I9892k2472k2004o731l691j6174M0328l679k0672p212L3718l2871l0560
$$ 99892 77420 55416 48685 44994 28820 69148 65469 44797 37585 71303 38432 7872
24078G872N997j2478L804j2890j4947O589L9195j1967k2553K0953L5290M9851
$$ 7872 13869 1391 5195 -7695 -22642 -16053 23142 11175 -11378 9575 44865 94716
24066I4716o367l0371j4741r502j9779J5344K1975m4182N106l9710L24K256J5504
$$ 94716 88349 57978 43237 33735 13956 29300 51275 7093 12199 -27511 -27187 -24931 -9427
24053i427J5934M077J3143m6462J5040J3564j5156k7674J6629L9017j5123o3548
$$ -9427 6507 10584 23727 -22735 -7695 5869 -9287 -36961 -20332 18685 3562 -59986
24041e9986Q296M8933N966j2733m8267n39N8245R095o616m1779k4623l803N3758
$$ -59986 -51690 -2757 3209 -9524 -57791 -58330 -85 9010 2394 -39385 -64008 -67811 -14053
24028a4053L3246l2462N432L7192n2232J564L2123M0078l9047k6440R397L310
$$ -14053 19193 -13269 -7837 29355 -22877 -21313 10810 50888 11841 -14599 -5202 -1892
24016a892o581j4965j6112L636m3001m38L0627M2198k0670o2566M0913N7109j5178
$$ -1892 -8473 -23438 -39550 -35914 -78915 -79353 -48726 -6528 -27198 -89764 -48851 8258 -6920
24003f920k052n994K1119R824k6852l2952J5488o759n380J6746L1359K9064l9386
$$ -6920 -8972 -14966 6153 15977 -10875 -43827 -28339 -35098 -40478 -23732 7627 36691 -2695
23990b695L7379J4581j9784J2762J1435L9308k7159k3295R841M4063j5874l5015
$$ -2695 34684 49265 29481 42243 53678 92986 65827 42532 52373 96436 80562 45547
23978D5547k5088j8362Q92k9281k011J9902R886J2998M3922j771J9255k7538j8338
$$ 45547 20459 2097 2989 -26292 -28303 -8401 1485 14483 58405 56634 75889 48351 30013
23965C0013j5422k5913O9165K4143l1492j3578j4990K6384k784l5764o5191M99
$$ 30013 14591 -11322 57843 81986 50494 36916 21926 48310 45526 9762 -55429 -54930
23953e4930J4295J7477m8075p3543N2105O9763J9361j9166p1196m0319k1394O8809
$$ -54930 -40635 -23158 -71233 -144776 -92671 -22908 -3547 -22713 -93909 -134228 -155622 -86813
23941h6813K8307L4085M8352M4400J341k4500r856p76p898M1086K36m4349l5405
$$ -86813 -58506 -24421 23931 68331 69672 45172 35316 34540 26642 67728 67964 23615 -11790
23928a1790p740L1556J5681L747m35o2791j2316m5550M08K492j529o816m596L9432
$$ -11790 -19530 12026 27707 31454 31019 -31772 -44088 -89638 -89230 -86738 -88267 -95083 -99679 -60247
23914f0247L1804J2143r573l138L2444K6412J8115m3088J2735K0041q71j0561
$$ -60247 -28443 -16300 -25873 -29011 3433 29845 47960 4872 17607 37648 36777 26216
23902B6216L950J0240n112J816p508j8202o3147j9419N3320L0017J3180K4547
$$ 26216 30166 40406 35294 37110 29602 11400 -51747 -71166 -17846 12171 25351 49898
23890D9898K725O0424K1787p7536r5619l0308m70J7551L2534P765p464Q7j8670
$$ 49898 52623 113047 134834 57298 -38321 -68629 -69099 -51548 -19014 -11249 -18713 -18626 -37296
23877c7296L1325J9935J529j1755l6106K7442N650N0358Q569k7725q6046k5939
$$ -37296 -5971 13964 15493 3738 -32368 -4926 724 51082 59651 31926 -54120 -80059
23865h0059L8796N5486J0394j3292k5737k8568J3433K184l880K3777M0452j5721
$$ -80059 -41263 14223 24617 11325 -14412 -42980 -29547 -27363 -31243 -7466 32986 17265
23853A7265m4338k2960K380P277P2592L3014Q980p7131l2871K2736N178l4885
$$ 17265 -27073 -50033 -47653 -40376 32216 65230 74210 -2921 -35792 -13056 -7878 -42763
23841d2763k9986L5844N611L750J9201j8007J8999P643p525L71m5601J7474j339
$$ -42763 -72749 -36905 -31294 -27544 -8343 -26350 -7351 292 -7233 -6862 -52463 -34989 -36328
23828c6328M302O97P925M5340L4412j2456J0638l6729l9302o1743L3784j6653
$$ -36328 -32026 -31329 -23404 21936 56348 43892 54530 17801 -21501 -83244 -49460 -66113
23816f6113l3362N0345L9423J880o039N827M0968k3526L0252K4189r131n5119
$$ -66113 -99475 -49130 -9707 -7827 -13866 -8039 32929 9403 39655 63844 54713 -406
23804d06o1112k6889N4369L5928m1917j5029J8700K1360L2648J6787j4792l7048
$$ -406 -61518 -88407 -34038 1890 -40027 -55056 -36356 -14996 17652 34439 19647 -17401
23792a7401j253R193m67L3112q445K1454K1449J1215K2001M812j9104q862l1523
$$ -17401 -18654 -9461 -9928 23184 14739 36193 57642 68857 90858 95670 76566 67704 36181
23779C6181L2558J3541q6839m3076l9384J6350M6698q398J857K8583N958N1750
$$ 36181 68739 82280 -4559 -47635 -87019 -70669 -23971 -32369 -30512 -1929 4029 55779
23767E5779q432l2144k4071K149L1984L7315L2872n5658k3343m1880o7013O349
$$ 55779 47347 15203 -8868 -6719 25265 62580 95452 39794 16451 -25429 -92442 -86093
23755h6093K6147J8271M169M507L7711L8533K5014q0218j7444K8491O3361j7857
$$ -86093 -59946 -41675 -37506 -32999 4712 43245 68259 -11959 -29403 -912 62449 44592
23743D4592k2720l1721m7143j0291J6496m6361R83O2662j1606k8309L1368L3588
$$ 44592 21872 -9849 -56992 -67283 -50787 -97148 -96165 -33503 -45109 -73418 -42050 -8462
23731h462J5699J1061m3081m8793K0090N6429O5395J4039j9302j6181n5675k2357
$$ -8462 7237 18298 -24783 -73576 -53486 2943 68338 82377 63075 46894 -8781 -31138
23719c1138j3093K6353K0215r436l0243L730k3293L0582N1539L5614K6956m9992
$$ -31138 -44231 -17878 2337 -7099 -37342 -33612 -56905 -26323 25216 60830 87786 37794
23707C7794l5836l6404J6049K7893L25R22j6813p592j4985K3312J3173O361K6103
$$ 37794 1958 -34446 -18397 9496 9821 10743 -6070 -13662 -28647 -5335 7838 14199 40302
23694D0302L5l8937m3459j6992J5555J2970l0666J7832J098J943J9390j5289M2512
$$ 40302 40337 1400 -42059 -59051 -43496 -30526 -61192 -43360 -42262 -40319 -20929 -36218 6294
23681F294J3259j4429M6144P395j1528m7813K4765K1019l1126k1612m7673l3585
$$ 6294 19553 5124 51268 58663 47135 -678 24087 45106 13980 -7632 -55305 -88890
23669h8890J4341k397K2583M8621K1530J9719j044p2513N582J7701k6890k282
$$ -88890 -74549 -76946 -54363 -5742 15788 35507 34463 -38050 -32468 -14767 -41657 -43939
23657d3939N89M4740O3893k0262k1093M970k742K0183J5997j8341l5068Q085m3541
$$ -43939 -43350 1390 65283 45021 23928 28898 26156 46339 62336 43995 8927 17012 -26529
23644b6529l7985m199J7942P890j4280k8863l6693q349K3951J1910M9014L7604
$$ -26529 -64514 -68713 -50771 -42881 -57161 -86024 -122717 -131066 -107115 -95205 -46191 -8587
23632h587K0460L0857o6055j2952J2294l80J0142K6106L6480L447K5092M3902
$$ -8587 11873 42730 -23325 -36277 -23983 -24363 -14221 11885 48365 51812 76904 120806
23620A20806n9343j1550J0191O410r477r3984m1834J0109L3933M3934P5596j0195
$$ 120806 61463 49913 60104 66514 57037 -36947 -78781 -68672 -34739 9195 84791 74596
23608G4596k5028j7805p364k1455k3646j4437J1525K3175K9049q510j0338K6560
$$ 74596 49568 31763 24399 2944 -20702 -35139 -23614 -439 28610 20100 9762 36322
23596C6322J0790k6680L2808j9778k4794q026r242l8929K3558O9874j1441J2247
$$ 36322 47112 20432 53240 33462 8668 642 -8600 -47529 -23971 45903 34462 46709
23584D6709J1382m8371k961K5451j6814l9791L0014n603J9826J0668K7670l6252
$$ 46709 58091 9720 6759 32210 15396 -24395 5619 16 19842 30510 58180 21928
23572B1928l9205j048M6240L695o9962o0801N86O5695M6683l5896m3227k6124
$$ 21928 -17277 -18325 27915 31610 -38352 -99153 -98567 -32872 13811 -22085 -65312 -91436
23560i1436j5902l3030J1518J6387K7620N1326k2212p662J8518J797J8316K7178
$$ -91436 -107338 -140368 -128850 -112463 -84843 -33517 -55729 -63391 -44873 -43076 -24760 2418
23548B418j2906p23O42q291K0388P221J853M5407j209N976L5363J2348l6484l8933
$$ 2418 -10488 -11211 -10569 -18860 1528 8749 10602 56009 54800 60776 96139 108487 72003 33070
23534C3070p531L5130p184o7168n396l6108k9065j2923M4257k628j3770P892L0050
$$ 33070 25539 60669 53485 -13683 -19079 -55187 -84252 -97175 -52918 -55546 -69316 -61424 -31374
23521c1374n6991K7812L4716K9337j425J3139j8717K6448k4707o6303J2289N9965
$$ -31374 -88365 -60553 -25837 3500 2075 15214 -3503 22945 -1762 -68065 -55776 4189
23509D189K0205k354j7394j1222N139k0033O676j4330J1694l907M4581N1416l9427
$$ 4189 24394 22040 4646 -6576 -1437 -21470 -14794 -29124 -17430 -21337 23244 74660 35233
23496C5233q293l4890n0173J2280J3075o178K2828K1328O5384K9952m0566m9230
$$ 35233 26940 -7950 -58123 -45843 -32768 -38946 -16118 5210 70594 100546 59980 10750
23484A0750l513J2875L643L026k565n1101m0296J5101P0885J4965m2058k3014
$$ 10750 7237 20112 23755 26781 24216 -26885 -67181 -52080 18805 33770 -8288 -31302
23472c1302O2609R284K2116l896J6084q424m3642l2702n0584j0897J8678M8977
$$ -31302 31307 40591 62707 58811 74895 66471 22829 -9873 -60457 -71354 -52676 -3699
23460c699j8817j8901M4144M8594k0264M854Q727l0529k5663J3810P287m702K8073
$$ -3699 -22516 -41417 2727 51321 31057 35911 44638 14109 -11554 2256 9543 4841 32914
23447C2914m910k3336n0932J108j0486j7625K8409j3921j4510J0459j2890n3234
$$ 32914 28004 4668 -46264 -45156 -55642 -73267 -44858 -58779 -73289 -62830 -75720 -128954
23435a28954J6732j1261l1278P9O6387L1648k3937J0959j722m2523P742L5839
$$ -128954 -112222 -123483 -154761 -154682 -88295 -56647 -80584 -69625 -71347 -113870 -106128 -70289
23423g0289J8056Q410K2416K1995k2573K824Q64j7985l5198J8837J4692k8370
$$ -70289 -52233 -43823 -21407 588 -21985 -19161 -18297 -36282 -71480 -52643 -37951 -66321
23411f6321J4936m830p969J5351J5288J2812J1405K1718J1742J7678L9278j0368
$$ -66321 -51385 -56215 -64184 -48833 -33545 -20733 -9328 12390 24132 41810 81088 70720
23399G0720m4366j4577L176M192j8119l4104j9898L3124J2719m7762q509M0460
$$ 70720 26354 11777 14953 19145 1026 -33078 -52976 -19852 -7133 -54895 -63404 -22944
23387b2944j3499k3637K5225L1068J5276k4444K353m0597M0375L3991m6380M323
$$ -22944 -36443 -60080 -34855 -3787 11489 -12955 -10602 -51199 -10824 23167 -23213 -18890
23375a8890L3506K7081l1426m8677j5808J5799J3123m5157K9562J4262j4015K0197
$$ -18890 14616 41697 10271 -38406 -54214 -38415 -25292 -70449 -40887 -26625 -40640 -20443
23363b0443O0490M1592k1292n1642m0203l104P38Q462K7327O3312L210n4388l3686
$$ -20443 40047 81639 60347 8705 -31498 -34602 -33864 -25402 1925 65237 68447 14059 -19627
23350a9627j1155M6050n929n035J7879j0728j7828l8387k5485j7357J9445Q0966
$$ -19627 -30782 15268 9339 4304 22183 11455 -6373 -44760 -70245 -87602 -68157 12809
23338A2809K1231o5106j3930K3457J942K2948O612j0121j5274k0329J6021N6050
$$ 12809 34040 -31066 -44996 -21539 -19597 3351 9963 -158 -15432 -35761 -19740 36310
23326C6310j0639Q080J1114k5301l3487K0929Q123J4568K7423j6653q616l7782
$$ 36310 25671 33751 44865 19564 -13923 7006 15129 29697 57120 40467 31851 -5931
23314e931l0309J1148K8702J8077N4400r88Q199j4229l0926L3517J3659o4776
$$ -5931 -36240 -25092 3610 21687 76087 75099 83298 69069 38143 71660 85319 20543
23302B0543p089j3658K6485L0855K784o5956k786N2846N4489j6799j5815K3153
$$ 20543 13454 -204 26281 57136 59920 -6036 -8822 44024 98513 81714 65899 89052
23290H9052j3933k179J1359n5462k5608K0143O0695k1427k2863M0134j543k3758
$$ 89052 75119 72940 84299 28837 3229 23372 84067 62640 39777 79911 78368 54610
23278E4610l6527m5435J6101M1996K7298J3236k6898J023J9823j8341O356K9244
$$ 54610 18083 -27352 -11251 30745 58043 71279 44381 45404 65227 46886 53242 82486
23266H2486J1912m6152K696k4785K9562m168j9342o0774n0993J4870K9046L9850
$$ 82486 94398 48246 50942 26157 55719 51551 32209 -28565 -79558 -64688 -35642 4208
23254D208n5529M1543N0601L3161N431K856j499j4942k005j7383o0966p831N6269
$$ 4208 -51321 -9778 40823 73984 79415 82271 80772 65830 63825 46442 -14524 -22355 33914
23241C3914J5264m8102o7900k9528l87j3738k7146J2194M5671N2712K1983l0090
$$ 33914 49178 1076 -66824 -96352 -96739 -110477 -137623 -125429 -79758 -27046 -5063 -35153
23229c5153n088O3268k5864m1766J4339K5171j6111k6111Q981M4939j461N013
$$ -35153 -40241 23027 -2837 -44603 -30264 -5093 -21204 -47315 -38334 6605 5144 10157
23217A0157O557j677J4328k4184m4260M8232N4570K3377K9902L8964l3392m9336
$$ 10157 16714 15037 29365 5181 -39079 9153 63723 87100 117002 155966 122574 73238
23205G3238q217J1531K5420J1149k6286m7881j3958n4648J5199K4929j5957M7538
$$ 73238 65021 76552 101972 113121 86835 38954 24996 -29652 -14453 10476 -5481 42057
23193D2057K9426j6800k7738n557j667n8444l6938K3246N7076K2707k3179o071
$$ 42057 71483 54683 26945 21388 19721 -38723 -75661 -52415 4661 27368 4189 -1882
23181a882N8611Q866p2346o3958N1975K7306N4481J2042o2473j5029M122L596
$$ -1882 56729 65595 -6751 -70709 -18734 8572 63053 75095 12622 -2407 1715 5311
23169E311M518r122l1395k0594K9980K4895K7439k1955m1911K6891P3619K439
$$ 5311 9829 707 -30688 -51282 -21302 3593 31032 9077 -32834 -5943 67676 70115
23157G0115q855P100j1700l8362j687k7442l6893K5339L5126J5349J6601R846
$$ 70115 61260 68360 56660 18298 16611 -10831 -47724 -22385 12741 28090 44691 54537
23145E4537j6053j5669r792n3844J6908O4243K4968k8074j4176p3223k5533O9468
$$ 54537 38484 22815 13023 -40821 -23913 40330 65298 37224 23048 -50175 -75708 -6240
23133f240P1089n6845m6174l27k0151M4619R184l2606k2016j4348R262L8854O104
$$ -6240 64849 8004 -38170 -38497 -58648 -14029 -4845 -37451 -59467 -73815 -64553 -25699 -19595
23120a9595j7757J90L1170J7239M5580m305p335j7182O734j0046m5777o225K5292
$$ -19595 -37352 -37162 -5992 11247 56827 52522 45187 28005 34739 24693 -21084 -27309 -2017
23107b017m2450j941j17j4687O7794K7202m1319r7J3890o400J3646m4743k6061
$$ -2017 -44467 -46408 -46525 -61212 6582 33784 -7535 -7632 6258 -142 13504 -31239 -57300
23094e7300j7734R678J1591N386Q7650M1364K9515l053j3351l7536m2855L502
$$ -57300 -75034 -65356 -53765 -48379 39271 80635 110150 107097 93746 56210 13355 16857
23082A6857K0781O214P558K0106L6894k0182k5871q127k0733O0341k3264k2806
$$ 16857 37638 43852 51410 71516 108410 88228 62357 54230 33497 93838 70574 47768
23070D7768P584k0930l6679J1346M786J6082j5149R447P95j3186P981L7690l2838
$$ 47768 55352 34422 -2257 9089 13875 29957 14808 24255 25050 11864 19845 57535 24697
23057B4697j5227K9223l0026K682M3680k5347j533K6660k050J530N137l3924k1578
$$ 24697 9470 38693 8667 11349 55029 29682 28149 54809 52759 54289 59426 25502 3924
23044C924K717n99L2513m514k8050o1115j1328M5552L7109k094m1455l6330m971
$$ 3924 6641 6042 38555 34041 5991 -55124 -66452 -20900 16209 14115 -27340 -63670 -68641
23031f8641k783N416K3127J7811k6716k646J0025q926j4531l4747L6960P9298
$$ -68641 -71424 -66008 -42881 -25070 -51786 -54432 -44407 -53333 -67864 -102611 -65651 13647
23019A3647M5704j9679j0841J4195m0838k3458J8934J6898j2765Q773r062j1651
$$ 13647 59351 39672 28831 43026 2188 -21270 -2336 14562 1797 10570 1508 -10143
23007a0143m0625n162M3922N5918k1377k5721M3548j4842m0530L824K0538L8088
$$ -10143 -50768 -55930 -12008 43910 22533 -3188 40360 25518 -15012 -11188 9350 47438
22995D7438Q36m5495j7953L4213K7256Q108L0579n567l6727n916j9880L7364m4320
$$ 47438 48274 2779 -15174 19039 46295 54403 84982 79415 42688 36772 16892 54256 9936
22982I936n0072l5400j6531K8553Q7622j974Q927K0574k7953o0760k1107l1272
$$ 9936 -40136 -75536 -92067 -63514 24108 22134 31061 51635 23682 -37078 -58185 -89457
22970h9457J6614M3430N2430K325q437n5866L8541J7096N073O1071k6337m1872
$$ -89457 -72843 -29413 23017 25342 16905 -38961 -420 16676 21749 82820 56483 14611
22958A4611l3327j0741K9476M9290j1037o304n687k6082m7110j1204n2427K2904
$$ 14611 -18716 -29457 19 49309 38272 31968 26281 199 -46911 -58115 -110542 -87638
22946h7638N9156J3274k5847L7714m809p538O036o51j5981M440M501R965N9078
$$ -87638 -28482 -15208 -41055 -3341 -8150 -15688 -9652 -10303 -26284 -21844 -17343 -7378 51700
22933E1700N813K7333K2228j2495q296m147k4990m4115k86k4363m9726j2721K2696
$$ 51700 57513 84846 107074 94579 86283 82136 57146 13031 12745 -11618 -61344 -74065 -51369
22920e1369K556J9288M8351M2084J6435J1601j7562m97L769k0902m954J7802L594
$$ -51369 -48813 -29525 18826 60910 77345 88946 71384 70887 74656 53754 48800 66602 70196
22907G0196R839l7766l3657k1074k6155M7402J2268n0k0176j5523L399N8229j1311
$$ 70196 80035 42269 8612 -12462 -38617 8785 21053 21003 827 -14696 -11297 46932 35621
22894C5621J0184k793J6196m7249l3430K926Q050J8099L1104N360k8622j0210
$$ 35621 45805 43012 59208 11959 -21471 -18545 -10495 7604 38708 44068 15446 5236
22882E236L5607Q058K4243K2366j3445k346j2406j1860J1359k679m0529j8233
$$ 5236 40843 48901 73144 95510 82065 79719 67313 55453 66812 64133 23604 5371
22870E371K2463k4035l6170M794J5350l5356K5311K4088K8371j5820o8180m883
$$ 5371 27834 3799 -32371 -27577 -12227 -47583 -22272 1816 30187 14367 -53813 -58696
22858e8696J8683K4153M4302L3663m7128p1566l5734L0839N964L9526O8638p1706
$$ -58696 -40013 -15860 28442 62105 14977 -56589 -92323 -61484 -55520 -15994 52644 -19062
22846a9062p8518J5015P5603N5672K2552k4022n0624j7174L6649Q96l7332q515
$$ -19062 -97580 -82565 -6962 48710 71262 47240 -3384 -20558 16091 16987 -20345 -28860
22834b8860L2679j0842O174L2523K8711L3081Q396j2856j9949J1364k1630j0526
$$ -28860 3819 -7023 -849 31674 60385 93466 101862 89006 69057 80421 58791 48265
22822D8265m4978n7696r479J8012L1433R442J1492q705j4629M247K4945L7116
$$ 48265 3287 -54409 -63888 -45876 -14443 -5001 6491 -2214 -16843 -12596 12349 49465
22810D9465j7597p7864m1140M8653L1043n253P516p090k9148p703L1820L4766
$$ 49465 31868 -45996 -87136 -38483 -7440 -12693 -5177 -12267 -41415 -49118 -17298 17468
22798A7468L473o7261j0892P2922L6819k3151m4258j5219M650k6693j1591M7151
$$ 17468 20941 -46320 -57212 15710 52529 29378 -14880 -30099 -25449 -52142 -63733 -16582
22786a6582Q2471n722n0225L5023J3907O26k2246l6164l6559k9149J6568P456
$$ -16582 65889 60167 9942 44965 58872 59498 37252 1088 -35471 -64620 -48052 -40596
22774d0596J3575O2811m4184j02570L901N9363J6404m390L0500k8869j8009O1187
$$ -40596 -27021 35790 -8394 -110964 -107063 -47700 -31296 -35686 -5186 -34055 -52064 9123
22762I123J9126J9403R65j1954l9322m8504O332o714P525O134K8497M5290K1863
$$ 9123 28249 47652 48617 36663 -2659 -51163 -44831 -51545 -44020 -37886 -9389 35901 57764
22749E7764K653j4292j9188N702J1678n2988l3293K2697J1821K6683J2685n0199
$$ 57764 60417 46125 26937 32639 44317 -8671 -41964 -19267 -7446 19237 31922 -18277
22737a8277K1872J1382J3366k2411j3300o198J9272K0437j7959M1465M2236k2930
$$ -18277 3595 14977 28343 5932 -7368 -13566 5706 26143 8184 49649 91885 68955
22725F8955o1360n0522r17K8249M083L3975K236J5273l1662n242R443l565j3904
$$ 68955 7595 -42927 -43844 -15595 -11512 22463 24699 39972 8310 3068 12511 8946 -4958
22712d958k9908J3599J3066L3099k3576l7962j9801K6413K7943K3840L6243J7312
$$ -4958 -34866 -21267 -8201 24898 1322 -36640 -56441 -30028 -2085 21755 57998 75310
22700G5310k5225m036o918k302m831M650j7609M4804R902o696l23J8459j0330
$$ 75310 50085 46049 39131 36829 31998 36648 19039 63843 73745 67049 66726 85185 74855
22687G4855k2222J766l7394o7873O254Q6171l446p297j9685J1177q414K817L242
$$ 74855 52633 54399 17005 -50868 -44614 41557 38111 30814 11129 22306 13892 16709 19951
22674A9951l4014p4791p803K4017L2660K2441K285K6304J370j3186J344M4306
$$ 19951 -14063 -88854 -96657 -72640 -39980 -17539 -15254 11050 12420 -766 578 44884
22662D4884o318O29j9087k9816q339L0438J8085r265p282l12l2959r223J0354
$$ 44884 38566 39195 20108 -9708 -18047 12391 30476 21211 13929 13617 -19342 -28565 -18211
22649a8211J6028Q02k3421K9284O1065L8646K2890M0153n1102o7831j3429k4012
$$ -18211 -2183 -1381 -24802 4482 65547 104193 127083 167236 116134 48303 34874 10862
22637A0862n3482k909K3598L7312N1204K6163m2263J2416r001m4516k8864n4189
$$ 10862 -42620 -45529 -21931 15381 66585 92748 50485 62901 53900 9384 -19480 -73669
22625g3669j260L2020j8292K6329k6605P054K5626M4831j0442J8561k6020m1442
$$ -73669 -74929 -42909 -61201 -34872 -61477 -54423 -28797 16034 5592 24153 -1867 -43309
22613d3309p3021J7808N0913N796N2620l0801n7922l0741k1374k9130K8696N9331
$$ -43309 -116330 -98522 -47609 -41813 10807 -19994 -77916 -108657 -130031 -159161 -130465 -71134
22601g1134O8192O8431L700K7631j4638k7449j4334L7237j6139j6263k0117j1150
$$ -71134 -2942 65489 69189 96820 82182 54733 40399 77636 61497 45234 25117 13967
22589A3967n145k355K559o2767j1917P7777k2268n2154K596L9389l1944k8943
$$ 13967 8822 6467 9026 -53741 -65658 12119 -10149 -62303 -59707 -20318 -52262 -81205
22577h1205q562J7958j783J299O644J1884J6072k1445J9754J7783J5420J3353
$$ -81205 -89767 -71809 -73592 -72293 -65649 -53765 -37693 -59138 -39384 -21601 -6181 7172
22565G172N7417J7210j3194J5491L1528j5802Q78q448l8961k3399k2979N1946
$$ 7172 64589 81799 68605 84096 115624 99822 100700 92252 53291 29892 6913 58859
22553E8859j8551q9748Q401K7812p453L4942o215j0049k6168J759K3892K3981
$$ 58859 40308 -49440 -41039 -13227 -20680 14262 8047 -2002 -28170 -26411 -2519 21462
22541B1462K5086L2008J3782k3112l7678J7774Q959o741J6782J6815l9277l5993
$$ 21462 46548 78556 92338 69226 31548 49322 58281 51540 68322 85137 45860 9867
22529I867n0353k6734K7271j1617m977N0530L1250n43k9453m165P2573Q134Q841
$$ 9867 -40486 -67220 -39949 -51566 -56543 -6013 25237 24694 -4759 -8924 63649 71783 80624
22516H0624J3298n6604k4935M8705M824L8778j39o6016k3947M7381j7403n4599
$$ 80624 93922 37318 12383 61088 65912 104690 104551 38535 14588 61969 44566 -10033
22504a0033J922m823k838k6007Q621K3338Q722M5364J1468N709j5961O318j4373
$$ -10033 -8111 -12934 -15772 -41779 -33158 -9820 -1098 44266 55734 61443 45482 51800 37427
22491C7427j7232k678P863K111k576l7713j9067L5101J0862k4806j3088p683N9944
$$ 37427 20195 17517 25380 27491 24915 -12798 -31865 3236 14098 -10708 -23796 -31479 28465
22478B8465J6814l8489j4995L5566J5948K9011n09l2662l0229O956j2603k3116
$$ 28465 45279 6790 -8205 27361 43309 72320 71811 39149 8920 15876 3273 -19843
22466a9843k4786J8319K0152o000P224j3538J9054J5479J7577N3118r499p457
$$ -19843 -44629 -26310 -6158 -12158 -4934 -18472 582 16061 33638 86756 77257 69800
22454F9800J045k6341j4357J4336J7644J9848Q999j9047n2670o163L4814J5489
$$ 69800 70845 44504 30147 44483 62127 81975 90974 71927 19257 13094 47908 63397
22442F3397l0399J2829L1710k8603J3608K7407k9125n1106j7068O7515m698j763
$$ 63397 32998 45827 77537 48934 62542 89949 60824 9718 -7350 60165 55467 53704
22430E3704L5529l5446m2139J2668R612P192K0306K9423m744m615j0349j1072
$$ 53704 89233 53787 11648 24316 33928 41120 61426 90849 86105 81490 71141 60069
22418F0069l4401k7749J9208P573k5744j010k1399j0896j46M9989J6325j9590
$$ 60069 25668 -2081 17127 24700 -1044 -2054 -23453 -34349 -34495 15494 31819 12229
22406A2229l0610N6306M7398J03j28K5313l3296l0005n171j5027n1645k6864K3703
$$ 12229 -18381 37925 85323 85426 85298 110611 77315 47310 42139 27112 -24533 -51397 -27694
22393b7694L0478K252J5718k7124K5845N6302K8905m5604O30j8569L7550m813
$$ -27694 2784 5036 20754 -6370 19475 75777 104682 59078 59708 41139 78689 73876
22381G3876M507l4766j2905j4203K7758m274m1297j4891O0984j8753l9718l474
$$ 73876 78383 43617 30712 16509 44267 39993 -1304 -16195 44789 26036 -13682 -17156
22369a7156M3040J498J4866O123J6216K6581N0639l2683k9711k7958l9644J9644
$$ -17156 25884 27382 42248 48371 64587 91168 141807 109124 79413 51455 11811 31455
22357C1455L9463L9568l8878L0433J0586j0407l2456J4271O140L3988K3010k633
$$ 31455 70918 110486 71608 102041 112627 102220 69764 84035 90175 124163 147173 144540
22345A44540K099p3989k9807j7466M9085J4101o1541l9232K3776R615m2485O7437
$$ 144540 146639 72650 42843 25377 74462 88563 27022 -12210 11566 21181 -21304 46133
22333D6133M2829j340n270k3858k0711Q4428R0927Q5186L0624J75J3385P9523
$$ 46133 88962 87622 82352 58494 37783 122211 213138 298324 328948 329123 342508 422031
22321D22031O9744L67m4255N0541R6162Q3741K8018M8227l5576q6157r6702j44889
$$ 422031 491775 492142 447887 498428 594590 678331 706349 754576 719000 632843 536141 391252
22309C91252q9416l7036k6248M697m6375j7982M6338l6955j2626J1191L1698o3332
$$ 391252 301836 264800 238552 243249 196874 178892 225230 188275 175649 186840 218538 155206
22297A55206p6048l3956K6240L5612J69K2625m5285n6162k5626m6093N8005K9823
$$ 155206 79158 45202 71442 107054 107223 129848 84563 28401 2775 -43318 14687 44510
22285D4510K0185L8930j8884n4145K2095O4467J1065l6778l7640m815L0767j1118
$$ 44510 64695 103625 84741 30596 52691 117158 128223 91445 53805 48990 79757 68639
22273F8639m3721l0058k2720M3407L5202J9031L2938l7107l3837R938o806k55
$$ 68639 24918 -5140 -27860 15547 50749 69780 102718 65611 31774 41712 34906 34651
22261C4651M529J1812j5966K316K020n3747k7362L4959O1872j1511j5929L1011
$$ 34651 39180 50992 35026 37342 39362 -14385 -41747 -6788 55084 43573 27644 58655
22249E8655n060n5l181K6161M1597j4624j5851M3739l6346m3932J8845k8905j3855
$$ 58655 53595 53540 50359 76520 118117 103493 87642 131381 95035 51103 69948 41043 27188
22236B7188l7968j6551J0032N9987K9157k4479K5421L2111k4519M8953O5154j0501
$$ 27188 -10780 -27331 -17299 42688 71845 47366 72787 104898 80379 129332 194486 183985
22224A83985r1257l4112J7467k7429k3653K3655K0766M0047J1495K8454P41l1776
$$ 183985 92728 58616 76083 48654 25001 48656 69422 109469 120964 149418 150159 118383
22212A18383k5088m576M7042M4106J6071L0995j3642m435O7791Q0665P1820N8932
$$ 118383 93295 88719 135761 179867 195938 226933 213291 208856 276647 357312 429132 488064
22200D88064O5465J13680O7359J18627Q2291J7744q6916j68584j85484p2615K2041
$$ 488064 553529 667209 734568 853195 935486 953230 866314 697730 512246 439631 461672
22189D61672o378l426K964J2878P5771M6279R377K0822P7300P6524O1107J03818
$$ 461672 455294 451868 454832 467710 543481 589760 599137 619959 697259 773783 834890 938708
22177I38708Q327j14989j45463j54972j12174q2182n9296j6770K6910k6896j88
$$ 938708 947035 832046 686583 531611 419437 337255 277959 261189 288099 261203 261015
22166B61015l7025J5403j5671J965m7185p780K3188j7586r424N1223J4417o9453
$$ 261015 223990 239393 223722 225687 178502 170722 193910 176324 166900 218123 232540 163087
22154A63087n0387J5531l076J0061N815O575n7137j8352N5029l8605K0677M8225
$$ 163087 112700 128231 125155 135216 141031 147606 90469 72117 127146 88541 109218 157443
22142A57443k4944j08392J3773L6018J7518k081j0465K06K4769J181j1328l0321
$$ 157443 132499 24107 37880 73898 91416 89335 78870 79076 103845 105026 93698 63377
22130F3377L4617N3741l6907K395M0647K9426J4733q7647n7669k983L9941j2898
$$ 63377 97994 151735 114828 117223 157870 187296 202029 114382 56713 53730 93671 80773
22118H0773Q094o0888O228J6911k1921K3611K3138m4091M2707l7410k055J6113
$$ 80773 88867 27979 34207 51118 29197 52808 75946 31855 74562 37152 35097 51210
22106E1210J4134O849R69J9747l364k7196r418m734N373L9090J8236Q88o7603
$$ 51210 65344 72193 73162 92909 89545 62349 52931 48197 53570 92660 110896 111784 44181
22093D4181k0872R589k742Q569K1566l5137K2595L4922K5239K730R287j5631k6734
$$ 44181 23309 32898 30156 38725 60291 25154 47749 82671 107910 110640 119927 104296 77562
22080G7562r439j3728Q2912M3582r609j7204l6414n2007K8791k221L2140K1835
$$ 77562 68123 54395 137307 180889 171280 154076 117662 65655 94446 92225 124365 146200
22068A46200o070m3672n5810r368J3740M8368Q170n647n8188k642M3925j6698
$$ 146200 140130 96458 40648 31280 45020 93388 101558 95911 37723 35081 79006 62308
22056F2308n2520M1841L4708l0997j3861M801J4153K1338L0148K5969l7331J8600
$$ 62308 9788 51629 86337 55340 41479 46280 60433 81771 111919 137888 100557 119157
22044A19157j2607L582J8126k1987P210o207l2014l1212r498N750M1828L6568
$$ 119157 106550 110132 128258 106271 113481 107274 75260 44048 34550 40300 82128 118696
22032A18696Q505q477j0645n3927p134L3086Q543Q998l3713O447M9122j8095P812
$$ 118696 127201 118724 108079 54152 47018 80104 88647 97645 63932 70379 119501 101406 109218
22019A09218M7860k076M8850L481J0934j3451o2883J6692L803K287N2887o7653
$$ 109218 157078 155002 203852 207333 218267 204816 141933 158625 162428 164715 217602 149949
22007A49949l5723k4322l2830K0740R910m572L1656P1173J3654m5044o8547L1480
$$ 149949 114226 89904 57074 77814 87724 83152 114808 185981 199635 154591 86044 117524
21995A17524j9077J9747R383Q299J2057k9761k3094j8439j7528J216K5975q024
$$ 117524 98447 118194 127577 135876 147933 118172 95078 76639 59111 60327 86302 78278
21983G8278O7526K7746n6393K058J0248q363j0496j6938k6696N297L5637l9615
$$ 78278 145804 173550 117157 119215 129463 121100 110604 93666 66970 72267 107904 68289
21971F8289l0580J0721M0075L5301K7555K9200K8935l1363r085k3366n527l977
$$ 68289 37709 48430 88505 123806 151361 180561 209496 178133 169048 145682 140155 136178
21959A36178Q845J526K0872O192j5984l643p095m637J6727k9040Q55K6151L973
$$ 136178 145023 146549 167421 173613 157629 153986 146891 142254 158981 129941 130796 156947 160920
21946A60920J425K2264K4909k3473K7464Q886M3692j3753k6945n6854J9278L8615
$$ 160920 162345 184609 209518 186045 213509 222395 266087 252334 225389 168535 187813 226428
21934B26428k9381j7946m2517K0165J7644K3976M4124l0985o169O5335k3766J9727
$$ 226428 197047 179101 136584 156749 174393 198369 242493 211508 205339 270674 246908 266635
21922B66635J6537q344l4124l4078M7690J7379N0793O7142m780k3557J08k3503
$$ 266635 283172 274828 240704 206626 254316 271695 322488 389630 384850 361293 361401 337898
21910C37898k3211k5059r013M2100M282M314N4646P949O200M8123P258m5980k1878
$$ 337898 314687 289628 280615 322715 326997 331311 385957 393906 400106 448229 455487 409507 387629
21897C87629k7547m8706k5572j2286o0625l1050n5169N1599K6523j4584k8165
$$ 387629 360082 311376 285804 273518 212893 181843 126674 178273 204796 190212 162047
21886A62047M5530O4573M7737j1987k8356m5222m0144l5731L7382K4575k9168
$$ 162047 207577 272150 319887 307900 279544 234322 194178 158447 195829 220404 191236
21875A91236m6402J9425M5915J7726p146P025j9958L71J8673k3166J2160K5553
$$ 191236 144834 164259 210174 227900 220754 227779 207821 208192 226865 203699 215859 241412
21863B41412k1823M7615L1430p448p033J6262j466J2369L0381J895L0356M0567
$$ 241412 219589 267204 298634 291186 284153 300415 298949 311318 341699 343594 373950 414517
21851D14517k9705k1800l6308k657J15451K2999k5491l0356q2512p9664J9260
$$ 414517 384812 363012 326704 324047 439498 462497 437006 406650 324138 244474 263734
21840B63734Q6800J2499J2390k2318n535l7219p4084O0119O6484K2668l1881k4007
$$ 263734 350534 363033 375423 353105 347570 310351 236267 296386 362870 385538 353657 329650
21828C29650M182J8398L471j0312n921l7677P363K4349M1861n1260n8534p659
$$ 329650 333832 352230 355701 345389 339468 301791 309154 333503 375364 324104 265570 257911
21816B57911m1066k4301L5778J5042j959O5134J15786R830m9721k3659k5695L6988
$$ 257911 216845 192544 228322 243364 241405 306539 422325 432155 382434 358775 333080 370068
21804C70068N0811J9055J5623L2056J4198M148K4099L8223M5452O7948K802o5122
$$ 370068 420879 439934 455557 487613 501811 505959 530058 568281 613733 681681 684483 619361
21792F19361j0514R349Q402K4703l2887r9769n6574j9758J4528N69J1474L9721
$$ 619361 608847 618196 626598 651301 618414 518645 462071 442313 456841 457410 468884 508605
21780E08605j2173n1703M276r494j2171N19K4533K2168J3433P187M5997M9057
$$ 508605 496432 444729 449005 439511 427340 427859 452392 474560 487993 495180 541177 590234
21768E90234N842l2957L7047M3944J8830k3336m3677k1983O8365K6142l0053O983
$$ 590234 596076 563119 600166 644110 662940 639604 595927 573944 642309 668451 638398 645381
21756F45381K9640L8804N113q7677m3458k9616l5384j3453J594p70j8233J0164
$$ 645381 675021 713825 718938 631261 587803 558187 522803 509350 510944 510174 491941 502105
21744E02105O5216Q3958P4399L6227P2353N6736j3093M4554J14100O4729J4967
$$ 502105 567321 651279 725678 761905 834258 890994 877901 922455 1036555 1101284 1116251
21733A116251N1659N2033O3240Q0991N5893N2539J0724N8628Q7655N163N636M3014
$$ 1116251 1167910 1219943 1283183 1364174 1420067 1472606 1483330 1541958 1629613 1634776 1640412 1683426
21721A683426K8271J092n4526m7965o485q282J2448l1319L0917J41226R8616J54321
$$ 1683426 1711697 1712789 1658263 1610298 1603813 1595531 1607979 1576660 1607577 1748803 1847419 2001740
21709B001740J35242J09080M5703O9622R3588P7344J51289Q7838J29331J55995
$$ 2001740 2136982 2246062 2291765 2361387 2454975 2532319 2683608 2771446 2900777 3056772
21699C056772J68763K14346K31612K63503K80271K92368K88155K26455J48837
$$ 3056772 3225535 3439881 3671493 3934996 4215267 4507635 4795790 5022245 5171082
21690E171082J56276J29811J63967K46234L56502M73569O37122Q22121J030060
$$ 5171082 5327358 5457169 5621136 5867370 6223872 6697441 7334563 8156684 9186744
21681I186744J274772J604219J968379K437844L030544L692014M420443N200104
$$ 9186744 10461516 12065735 14034114 16471958 19502502 23194516 27614959 32815063
21673C2815063O170642P262382Q413349R373648R645131R173529Q606888Q933440
$$ 32815063 38985705 46248087 54661436 64035084 73680215 82853744 91460632 100394072
21665A00394072J0536792J1529830Q089896j561752j3580037k0774395k0484767
$$ 100394072 110930864 122460694 130550590 128988838 115408801 94634406 74149639
21658G4149639j5855113j1110264p740511n489692m022591k983526k258888j789485
$$ 74149639 58294526 47184262 39443751 33954059 29931468 26947942 24689054 22899569
21650B2899569j663420j606400j531023j500019j371767j169508j097075r20180
$$ 22899569 21236149 19629749 18098726 16598707 15226940 14057432 12960357 12040177
21642A2040177p00493n73381m82056l81122k34333j76836j93023o9424m0278j6900
$$ 12040177 11339684 10766303 10284247 9903125 9668792 9491956 9298933 9229509 9189231 9172331
21632I172331o2220j27178q9041J0731J07730Q6569o9579j32823j9396J33518
$$ 9172331 9110111 8982933 8893892 8904623 9012353 9098922 9029343 8896520 8877124 9010642
21622I010642L07529M39694N83205O76566Q48685R53451J128443J213327J393828
$$ 9010642 9318171 9757865 10341070 11017636 11866321 12819772 13948215 15161542 16555370
21613A6555370J803006K447138L169589L873278M784244O055643P476285Q984179
$$ 16555370 18358376 20805514 23975103 27848381 32632625 38688268 46164553 55148732
21605E5148732J0827425J3228001J6523414K0268855K2938167K2725297J8761909
$$ 55148732 65976157 79204158 95727572 115996427 138934594 161659891 180421800
21598A80421800J4553521J7804221L0662917M2297788L0277223j7020039o2069391
$$ 180421800 194975321 212779542 243442459 285740247 316017470 298997431 236928040
21591B36928040o9707437m7700779k8167573j7031417j0970740p633154n566797
$$ 236928040 167220603 119519824 91352251 74320834 63350094 55716940 50150143
21584E0150143m012680k983860k590181k748473l107426l245640k999283k541925
$$ 50150143 46137463 43153603 40563422 37814949 34707523 31461883 28462600 25920675
21576B5920675k151245k008911j992037j907249j728967j516233j277149j004628
$$ 25920675 23769430 21760519 19768482 17861233 16132266 14616033 13338884 12334256
21568A2334256q64213p99037o45556o07068o21808n27841l96189l04327m37453
$$ 12334256 11470043 10671006 10025450 9418382 8796574 8268733 7872544 7568217 7130764
21559G130764n59203n79383n13877l81348l47010l17627k80625k02567j78800
$$ 7130764 6571561 5992178 5478301 5096953 4749943 4432316 4151691 3949124 3770324
21550C770324k07620k16774j64158j59171k24873j31494j59678k18889j66178
$$ 3770324 3562704 3345930 3181772 3022601 2797728 2666234 2506556 2287667 2121489
21541B121489j40428j74060j85018j16277o9249r8933j14316o4796o3380n5874
$$ 2121489 1981061 1807001 1621983 1505706 1436457 1337524 1223208 1158412 1095032 1039158
21531A039158m4382j1581m0227j8002L630k5832k7746j5449l0613l7354o5368
$$ 1039158 994776 983195 942968 924966 928596 902764 875018 859569 828956 791602 726234
21520G26234p8281n447k0346q294L3033j0953p0k9361j2607L0979l296m1081j0085
$$ 726234 647953 642506 622160 613866 646899 635946 635876 606515 593908 624887 621591 580510 570425
21507E70425M220m5255n0812m3175K5304M8071n304n2816k6991J4843l4820Q526
$$ 570425 574645 529390 478578 435403 460707 508778 503474 450658 423667 438510 403690 412216
21495D12216L8922m162o14p929n2444p473J2167K5895L1525N0913j0869m3966
$$ 412216 451138 446976 446362 438433 385989 378516 390683 416578 448103 499016 488147 444181
21483D44181n1893j561K7168J6228k674L5789L3700k5514o8863l3105n9175p7223
$$ 444181 392288 390727 417895 434123 431449 467238 500938 475424 406561 373456 314281 237058
21471B37058r0937r9442n4670n3379Q620N0231K3108J6260N4425L8479j3090Q111
$$ 237058 146121 46679 -7991 -61370 -52750 -2519 20589 36849 91274 129753 116663 124774
21459A24774J7010N3490K8191J8511Q310j7841J4246R853J1791L7402K3169Q755
$$ 124774 141784 195274 223465 241976 250286 232445 246691 256544 268335 305737 328906 337661
21447C37661K1943n3328J6499O3232k5565r124M9773L25q0014l0534k6483j4644
$$ 337661 359604 306276 322775 386007 360442 351318 401091 401416 321402 290868 264385 249741
21435B49741j5306j0931L470p5089j3435J3811j0658M1075j928k2776L7640N4320
$$ 249741 234435 223504 226974 151885 138450 152261 141603 182678 180750 157974 195614 249934
21423B49934J5086m9660n8634k4903j9809J1355j7323j7492P2667l247k3486l0535
$$ 249934 265020 215360 156726 131823 112014 123369 106046 88554 161221 157974 134488 103953
21411A03953J6453l100N6112J2434j8391k7548j914m414M477J4794j2495N997
$$ 103953 120406 117306 173418 185852 167461 139913 137999 133585 138062 152856 140361 146358
21399A46358N1335R3564J08987M5259J8563J9551L5858K5250K9402p2997j16805
$$ 146358 197693 291257 400244 445503 464066 483617 519475 544725 574127 501130 384325
21388C84325q6740m4678k7937j7670m2400m0592Q259o5k9345J3305k1754j0546
$$ 384325 297585 252907 224970 207300 164900 124308 132567 132502 103157 116462 94708 84162
21376H4162Q162k2n521J062L0567m782p6934k5850P7295j109o247l3949l1288
$$ 84162 92324 92302 86781 87843 118410 113628 36694 10844 88139 87030 80783 46834 15546
21363A5546k6962L5333J9991k0978M9750k1862k4997o181j8176k3935k5173K9894
$$ 15546 -11416 23917 43908 22930 72680 50818 25821 19640 1464 -22471 -47644 -17750
21351a7750K3492L6776n415k0412m577K083Q165k6964q90J84J9770K5390Q837
$$ -17750 5742 42518 37103 16691 12114 14197 22362 -4602 -5492 -5308 14462 39852 48689
21338D8689j9804m2734N539L1792L517R782j104o5073j9126M4541K7645K636r878
$$ 48689 28885 -13849 -8310 23482 26999 36781 35677 -29396 -48522 -3981 23664 26300 16422
21325A6422m2229O533N4824J6011j0567m8032k759L7668j6293M6411J9385l6296
$$ 16422 -25807 -19274 35550 51561 40994 -7038 -9797 27871 11578 57989 77374 41078
21313D1078N2113K1222Q956o185O418n0870o066K9612j5015k4053l1101k1347
$$ 41078 93191 114413 123369 117184 123602 72732 66666 96278 81263 57210 26109 4762
21301D762j294K1198K6000J2487j5709j8656k4292l3076L5717M3165m1004p6362
$$ 4762 3468 24666 50666 63153 47444 28788 4496 -28580 7137 50302 9298 -67064
21289f7064l3677l6079k6346m998J7878O4132L0243K514N0272Q068k527m502j289
$$ -67064 -100741 -136820 -163166 -168164 -150286 -86154 -55911 -53397 -3125 4943 2416 -2086 -3375
21276c375j5724M1333l1688j920m901L5329k2918m6108p762P8885N1444N3885
$$ -3375 -19099 22234 -9454 -11374 -16275 19054 -3864 -49972 -57734 21151 72595 126480
21264A26480p600n5743j7404n706o0640r907J1047K0068J2635J8132m231Q71q917
$$ 126480 118880 63137 45733 40027 -20613 -30520 -19473 595 13230 31362 27131 28002 19085
21251A9085j449r517n0274p746R175J2846J261j2698m9301J4491O3588L5607n266
$$ 19085 17636 8119 -42155 -49901 -40726 -27880 -26619 -39317 -88618 -74127 -10539 25068 19802
21238A9802j9583j4747j7683N937L675K9958k5517l1580N5640J5965k6330L741
$$ 19802 219 -14528 -32211 -26274 -22599 7359 -18158 -49738 5902 21867 -4463 -722
21226g22J0538R1996L068m1494m0633j8227o053N656M0103P425j0360k1600L5304
$$ -722 9816 101812 104880 63386 22753 4526 -1527 4129 44232 51657 41297 19697 55001
21213E5001k4739l3245L170J7782J6474j6819k2600K9976k838L748K6987p1708
$$ 55001 30262 -2983 187 17969 34443 17624 -4976 25000 22162 25910 52897 -18811
21201a8811l4296k7499N2853J530R538N5180J67k8657m0998J1217p102L10r378
$$ -18811 -53107 -80606 -27753 -26223 -16685 38495 38662 10005 -30993 -19776 -26878 -26568 -35946
21188c5946K2477l654k2654j7553K2237P9723K8430k612j6953k5315J6308n279
$$ -35946 -13469 -17123 -39777 -57330 -35093 44630 73060 70448 53495 28180 44488 39209
21176C9209n5343k4451R2841K9859n0056m6909k6250m1194O4692L0000M737o399
$$ 39209 -16134 -40585 52256 82115 32059 -14850 -41100 -82294 -17602 12398 17135 10736
21164A0736J6061L7012R562m7222J4701k8193j6727O8886L6407k6932j2445k0802
$$ 10736 26797 63809 73371 26149 40850 12657 -4070 64816 101223 74291 61846 41044
21152D1044l0058j3707l2968J677K7180J8561J3346M5825J971k2528m258J5658
$$ 41044 10986 -2721 -35689 -34012 -6832 11729 25075 70900 72871 50343 46085 61743
21140F1743p09o2563l2515k7980J8920q218k2736r122L655r529N1078K4405K5786
$$ 61743 61034 -1529 -34044 -62024 -43104 -51322 -74058 -83180 -79525 -89054 -37976 -13571 12215
21127A2215j4028p9898l4172L9712J3067k1370j4175j5318L0282J6994K1479j1902
$$ 12215 -1813 -81711 -115883 -76171 -63104 -84474 -98649 -113967 -83685 -66691 -45212 -57114
21115e7114O2088Q8700l2468k8170k2804k0717j7724K7008P434L1298K3506o4061
$$ -57114 4974 93674 61206 33036 10232 -10485 -28209 -1201 6233 37531 61037 -3024
21103c024q8503K4986j3J0246m166J8020j0002l000P8410P724L021j1086k8230
$$ -3024 -91527 -66541 -66554 -56308 -60474 -42454 -52456 -55456 22954 30678 33699 22613 -5617
21090e617k014m163l3395O338M8294J3359j7615p5583l178P3644N8669K9220k0930
$$ -5617 -7631 -11794 -45189 -38851 9443 22802 5187 -70396 -73574 70 58739 87959 67029
21077F7029n7892j9321N7484l3604l5973j1533p19J82K4452M2544j3993J032k1549
$$ 67029 9137 -10184 47300 13696 -22277 -33810 -34529 -34347 -9895 32649 18656 19688 -1861
21064a861l4148J4287k3265l7653j3491L1627k183J4717m984M5776o685J3316
$$ -1861 -36009 -21722 -44987 -82640 -96131 -64504 -66687 -51970 -56954 -11178 -17863 -4547
21052d547O037r646j3260J2599k5620j2976P425J3942L6543j0222M39N143K1647
$$ -4547 1490 -8156 -21416 -8817 -34437 -47413 -39988 -26046 10497 275 714 5857 27504
21039B7504Q151l6317l0646L7133J305j3910k3765P329J4821Q541J4801r936K587
$$ 27504 35655 -662 -31308 5825 7130 -6780 -30545 -23216 -8395 146 14947 5011 7598
21026G598M8923M345j1991K7960l451N8831J16334O7412j0204k4693L3190M5084
$$ 7598 56521 60866 48875 76835 73384 132215 248549 315961 305757 281064 314254 359338
21014C59338L9496M3411R4117P2011Q6592J45086J27654J29223J29089J05680
$$ 359338 398834 442245 536362 608373 694965 840051 967705 1096928 1226017 1331697
21004A331697J13915K1123q9255j82165k03419k08276j22948r5239o6326J2601
$$ 1331697 1445612 1466735 1377480 1195315 991896 783620 660672 565433 499107 511708
20994E11708O5887J2927Q631L7844P1806K8572O9594Q0612m114l8698q0285j17315
$$ 511708 577595 590522 599153 636997 708803 737375 806969 887581 883467 844769 764484 647169
20982F47169j68909j14284p7756l0318l2152Q7371M781q0759o0128m4057k1062
$$ 647169 478260 363976 286220 255902 223750 311121 315902 235143 175015 130958 109896
20971A09896j2129l4269j8309J064j8236R483l1447j3143o861p07k3503J1807
$$ 109896 97767 63498 45189 46253 28017 37500 6053 -7090 -13951 -14658 -38161 -26354
20959b6354n659J138j6448L3601P2327J6503K727L8626l0270m2411j5299n2295
$$ -26354 -32013 -30875 -47323 -13722 58605 75108 77835 116461 86191 43780 28481 -23814
20947b3814k0533K0447k1040n6571L6835M414K7303M208n5202L8059L2225J731
$$ -23814 -44347 -23900 -44940 -101511 -64676 -60262 -32959 -28751 -83953 -45894 -13669 -11938
20935a1938J5434M2439R275n3089N257r234m5666j6867J2448N7637j6323k9071
$$ -11938 3496 45935 55210 2121 7378 -1856 -47522 -64389 -51941 5696 -10627 -39698
20923c9698k3313K7495K3931M5202O0220m6753r2419m194L8556M4283J3431r109
$$ -39698 -63011 -35516 -11585 33617 93837 47084 -45335 -49529 -10973 33310 46741 37632
20911C7632l740K2783l1304j4497j4994J7195M4157n1172k6523O165q130o526
$$ 37632 33892 56675 25371 10874 -4120 13075 57232 6060 -20463 -14298 -22428 -28954
20899b8954O1646M0817K7165K50n7822n4531n3174K3302J7229j1041r704L1170
$$ -28954 32692 73509 100674 100924 43102 -11429 -64603 -41301 -24072 -35113 -44817 -13647
20887a3647N0985M216k4536l9096k9525l2570l4470o570K8970J1884k9222m393
$$ -13647 37338 41554 17018 -22078 -51603 -84173 -118643 -125213 -96243 -84359 -113581 -117974
20875a17974K2173M7847M9129N307l4902L5320L9546p1615K1155o191R480L4650
$$ -117974 -95801 -47954 1175 6482 -28420 6900 46446 -25169 -4014 -10205 -725 33925
20863C3925k804l8884o5012r519L5153L0581l18K1510j6584j9611j8429K809L0069
$$ 33925 31121 -7763 -72775 -82294 -47141 -16560 -16878 4632 -11952 -31563 -49992 -47183 -17114
20850a7114J0408l1580O6285m8k0374N5776L0888k4212k1075k3754l8159l1294
$$ -17114 -6706 -38286 27999 27951 7577 63353 94241 70029 48954 25200 -12959 -44253
20838d4253j754J7926k9375p612K5975k6989J1062n7451j3613L7528k0389J2161
$$ -44253 -46007 -28081 -57456 -65068 -39093 -66082 -55020 -112471 -126084 -88556 -108945 -96784
20826i6784K0641L4666L6770k0964l921l203J3183n0602L964N5932J3009p482
$$ -96784 -76143 -41477 -4707 -25671 -29592 -32795 -19612 -70214 -66250 -10318 2691 -4791
20814d791k1164j6311n335j0768L6303K7879o746J0118N7456l904l0877M506j0424
$$ -4791 -25955 -42266 -47601 -58369 -22066 5813 -933 9185 66641 62737 31860 36366 25942
20801B5942k0720J023l5439l6865K4581K2905M0333r090m3675K7228N8216p0644
$$ 25942 5222 6245 -29194 -66059 -41478 -18573 21760 12670 -31005 -3777 54439 -16205
20789a6205l4524M5390o545K4851K6535m6908m6532j5145L9624j6165K3084J5769
$$ -16205 -50729 -5339 -11884 12967 39502 -7406 -53938 -69083 -29459 -45624 -22540 -6771
20777f771K1436L8523K0078l8933k8838n3660m5736j7648L6274l2464L994K4419
$$ -6771 14665 53188 73266 34333 5495 -48165 -93901 -111549 -75275 -107739 -103745 -79326
20765g9326J2329J6902J5415k0467J0111R412L2L3399K0010K4850j315l5133j4946
$$ -79326 -66997 -50095 -34680 -55147 -45036 -35624 -35592 -2193 17817 42667 41352 6219 -8727
20752h727O077q01l5911m2838m908J1944j5679K992l0671o22P2019O9461L2217
$$ -8727 -2650 -3451 -39362 -82200 -87108 -75164 -90843 -87851 -118522 -119144 -47125 22336 54553
20739E4553n868l8322k3029l726m6168k1818K9937K3344P0588O125k0819r68r858
$$ 54553 48685 10363 -12666 -16392 -62560 -84378 -54441 -31097 39491 45616 24797 23829 13971
20726A3971N8859J1636j2401m3712J4035j2184l9524J8267l2060K4737j2820L516
$$ 13971 72830 84466 72065 28353 42388 30204 -9320 8947 -23113 1624 -11196 -7680
20714g680J5153K2904j6683J1116Q317j7430q291l2733K6524J3159N460p168K3297
$$ -7680 7473 30377 13694 24810 33127 15697 7406 -25327 1197 14356 19816 12648 35945
20701C5945j0267J8994j3198K4875K2063K7338p2966o3680J9592K1049M8615j5354
$$ 35945 25678 44672 31474 56349 78412 105750 32784 -30896 -11304 9745 58360 43006
20689D3006K6507l317K5586l7772n3210n9469J9101P27j9456q870L5255L3659
$$ 43006 69513 66196 91782 54010 800 -58669 -39568 -38841 -58297 -67167 -31912 1747
20677A747n873N5773P3164l4859m4431o465M9680n614l9677k0787r8012m0347
$$ 1747 -4126 51647 124811 89952 45521 39056 88736 83122 43445 22658 -75354 -115701
20665a15701M9545P9359Q242m843m959J2971j8706l820j3779J9891j1083k0806
$$ -115701 -66156 13203 21445 16602 11643 24614 5908 2088 -11691 8200 -2883 -23689
20653b3689n5872L1144M1872N2840j6060o2532l3962K5572j212k8069p7898p22
$$ -23689 -79561 -48417 -6545 46295 30235 -32297 -66259 -40687 -41899 -69968 -147866 -148588
20641a48588O5902O7040J8704n4559j724K7765l302L1509L8598m0546k9516k1534
$$ -148588 -82686 -15646 3058 -51501 -53225 -25460 -28762 2747 41345 799 -28717 -50251
20629e0251J2217L0003M9357l8176j2265J5867l3185j3795J8532J307J1458K3574
$$ -50251 -38034 -8031 41326 3150 -9115 6752 -26433 -40228 -21696 -20389 -8931 14643
20617A4643p70j0554p993l5374k9431R780k9232p040P589o1418K2049K9722J1819
$$ 14643 13873 3319 -4674 -40048 -69479 -59699 -88931 -95971 -88382 -149800 -127751 -98029 -86210
20604h6210J6452N2030j2334l6235L2328j4426l7100n067k2848N6666K2246j4949
$$ -86210 -69758 -17728 -30062 -66297 -33969 -48395 -85495 -90562 -113410 -56744 -34498 -49447
20592d9447M5792k704j5080j0809l1291O900M5232J500l2489l5791j7835R439
$$ -49447 -3655 -6359 -21439 -32248 -63539 -56639 -11407 -9907 -42396 -78187 -96022 -86583
20580h6583L8075N7101P9535m2539m5068K1644L5531K5446J7664j4589k4632l2434
$$ -86583 -48508 8593 88128 45589 521 22165 57696 83142 100806 86217 61585 29151
20568B9151J6107J0359l0440P528K4613K2194p3483m2487j3928j1708K8301K6384
$$ 29151 45258 55617 25177 32705 57318 79512 6029 -36458 -50386 -62094 -33793 -7409
20556g409J2862L0901k570l1462O7174K9948n7216l5812L5675K828J9031r390
$$ -7409 5453 36354 33784 2322 69496 99444 42228 6416 42091 44919 63950 54560
20544E4560j2773K2908k423l9066m1690k4113n663J2971R695l0563L5891j4149
$$ 54560 41787 64695 62272 23206 -18484 -42597 -48260 -35289 -25594 -56157 -20266 -34415
20532c4415J7075M6135N7527o231j2615o275m4293M798j2219K694J7591j2020
$$ -34415 -17340 28795 86322 80091 67476 61201 16908 21706 9487 12181 29772 17752
20520A7752m6850k0424R220l5076j4331N3029L9622l3136n998j1410M6364K5436
$$ 17752 -29098 -49522 -40302 -75378 -89709 -36680 2942 -30194 -36192 -47602 -1238 24198
20508B4198M880L0993j4554k4716j2917m1211m9021o673K7839J9017O8669L7226
$$ 24198 29078 60071 45517 20801 7884 -33327 -82348 -89021 -61182 -42165 26504 63730
20496F3730M907J6284l6021o7392n2236M4622M8945r897j4253R83r254l4109n2482
$$ 63730 68637 84921 48900 -18492 -70728 -26106 22839 12942 -1311 -328 -9582 -43691 -96173
20483i6173j1616O9550M6882J7567L7242M784n422j107n6256p1547j7176N8997
$$ -96173 -107789 -38239 8643 26210 63452 68236 62814 61707 5451 -66096 -83272 -24275
20471b4275P8680M123p607n5758j7053j7621K9531l655j7378K9051o018q251K3625
$$ -24275 54405 58528 50921 -4837 -21890 -39511 -9980 -13635 -31013 -1962 -7980 -16231 7394
20458G394L7484m0959n2898J0876q107M2633k907j5572o532m982L516r987K9756
$$ 7394 44878 3919 -48979 -38103 -46210 -3577 -6484 -22056 -28588 -33570 -30054 -40041 -10285
20445a0285l0536J4861l4313k0376q971L5155Q5971L908n3869n0304L2516L8904
$$ -10285 -40821 -25960 -60273 -80649 -89620 -54465 31506 35414 -18455 -68759 -36243 2661
20433B661K6687j8541k8110q975L2543K7683K178P503K2454o634j0356M2818m6718
$$ 2661 29348 10807 -17303 -26278 6265 33948 36126 43629 66083 59449 49093 91911 45193
20420D5193k7668R05k4134j6921J710r595k5482L0568M4809n4375q016Q7419N7460
$$ 45193 17525 18430 -5704 -22625 -20915 -30510 -55992 -25424 19385 -34990 -43006 44413 101873
20407A01873M097l1977o8985j2147R945k786L5495j3608k1068K49J7691N1052
$$ 101873 105970 73993 5008 -7139 2806 20 35515 21907 839 1088 18779 69831
20395F9831k0626q938k9830k5709o63J5147L0010m115k5513J4859K9996M1893
$$ 69831 49205 40267 10437 -15272 -15935 -788 29222 25107 -406 14453 44449 86342
20383H6342J3826n5327q5974l1801m1526L1945O7168J0980J9936K6058l7347k4072
$$ 86342 100168 44841 -41133 -72934 -114460 -82515 -15347 -4367 15569 41627 4280 -19792
20371a9792P185J4422J4099l5524k6051m2492m453L4241L1151J3805l2622m7195
$$ -19792 -12607 1815 15914 -19610 -45661 -88153 -92606 -58365 -27214 -13409 -46031 -93226
20359i3226J207K1493K7009J0967M2083N2926m2668k9213p3089r933K3840P898
$$ -93226 -92019 -70526 -43517 -32550 9533 62459 19791 -9422 -82511 -92444 -68604 -60706
20347f0706K569p921k8567J0827o473M1408N2394j1126j8028n4078J8078J7713
$$ -60706 -58137 -66058 -94625 -83798 -90271 -48863 3531 -7595 -25623 -79701 -61623 -43910
20335d3910M0240k8358J6796M1693N698k8013K6025P561p370o5312p8490j7879
$$ -43910 -3670 -32028 -15232 26461 32159 4146 30171 37732 30362 -34950 -113440 -131319
20323a31319L0189N2907K2732j5399K5212L6680M2948j1627m0746k9982Q745L6040
$$ -131319 -101130 -48223 -25491 -40890 -15678 21002 63950 52323 11577 -18405 -9660 26380
20311B6380n291M501j1138l4519L8995J4775j9322J8073J1324K9428n2620p5131
$$ 26380 21089 25590 14452 -20067 18928 33703 14381 32454 43778 73206 20586 -54545
20299e4545p1642j2891K1618O2542N3578J8316K1001l340m6723k2734q622M6357
$$ -54545 -126187 -139078 -117460 -54918 -1340 16976 37977 34637 -12086 -34820 -43442 2915
20287B915J9191j8498k4149K7457q043J5864N177J3167k6943k8174K339K8115
$$ 2915 22106 3608 -20541 6916 -1127 14737 19914 33081 6138 -22036 -19697 8418
20275H418Q263j0301k9959l281M1669N444L652j9607m1030K6238j4367k5414k8996
$$ 8418 16681 6380 -23579 -26860 14809 20253 23905 4298 -36732 -10494 -24861 -50275 -79271
20262g9271k2131M280J5383L6958q638l4056j5286N3010J4578J0767l0585j5773
$$ -79271 -101402 -97122 -81739 -44781 -53419 -87475 -102761 -49751 -35173 -24406 -54991 -70764
20250g0764J8676J2192j4438M1484K388J7900J8829J5246M5164j8067j6053j5907
$$ -70764 -52088 -39896 -54334 -12850 -10462 7438 26267 41513 86677 68610 52557 36650
20238C6650o6309o124k6617n5288M4459k318k02J2357K3213M2280N5080J0919
$$ 36650 -29659 -35783 -62400 -117688 -73229 -75547 -75749 -63392 -40179 2101 57181 68100
20226F8100n176l7170l8298n0192J3016N6497j6707k0624K5016k0479k4662M8261
$$ 68100 62924 25754 -12544 -62736 -49720 6777 -9930 -30554 -5538 -26017 -50679 -2418
20214b418K8722L0968K3928j9389o2859m5153j079M057J4686Q821k2127l6528
$$ -2418 26304 57272 81200 61811 -1048 -46201 -47280 -43223 -28537 -19716 -41843 -78371
20202g8371J2947L043K7454L995M011l7669m5234O7224O5237J2681J981k0942
$$ -78371 -65424 -62381 -34927 -30932 -26921 -64590 -109824 -42600 22637 35318 37299 16357
20190A6357O542K2207m839k9580k3998o6979j7401J1574l3843l928M5987j4894
$$ 16357 22899 45106 40267 10687 -13311 -80290 -97691 -86117 -119960 -123888 -77901 -92795
20178i2795J6455L0609N089k7643k6662l837K7927L8245J1592j3421o6973j1579
$$ -92795 -76340 -45731 -40642 -68285 -94947 -98784 -70857 -32612 -21020 -34441 -101414 -112993
20166a12993K5177K0943L3092j3003m0368j2451j3067J9932K5503l011K0716J0936
$$ -112993 -87816 -66873 -33781 -46784 -87152 -99603 -112670 -92738 -67235 -70246 -49530 -38594
20154c8594n9791L430k1138O3006O4811K4799J8349k3655o9234k0909J7141n071
$$ -38594 -98385 -94955 -116093 -53087 11724 36523 54872 31217 -38017 -58926 -41785 -46856
20142d6856L7941K0279l0635k798K9665L5237r266k9936k7772p1544m932P1236
$$ -46856 -8915 11364 -19271 -22069 7596 42833 33567 3631 -24141 -95685 -100617 -29381
20130b9381L2338K3218j5583k8265L392M6199J0037n4304j7921k2517J8858l7734
$$ -29381 2957 26175 10592 -17673 -14281 31918 41955 -12349 -30270 -52787 -33929 -71663
20118g1663o579M5012M8206J7488M5262l0195p0179M3545J3906m230j3205k9123
$$ -71663 -78242 -33230 14976 32464 77726 47531 -22648 20897 34803 30573 17368 -11755
20106a1755l5000Q547j9220J029N4634L1629l0305J5973J2190l3596K388K5679
$$ -11755 -46755 -38208 -57428 -56399 -1765 29864 -441 15532 27722 -5874 -3486 22193
20094B2193l3024o561m4050j1711M3785K1308Q657j778m3151J6914j5371j2907
$$ 22193 -10831 -17392 -61442 -73153 -29368 -8060 597 -1181 -44332 -27418 -42789 -55696
20082e5696L4448J1118j883m956J8041P261j2810j0991m832M024K8006n420k4452
$$ -55696 -21248 -10130 -12013 -16969 1072 8333 -4477 -15468 -20300 -16276 11730 6310 -18142
20069a8142K7380J9241p489j7272o0198J9564N1880k066j7296P0146K7171j192
$$ -18142 9238 28479 20990 3718 -56480 -36916 14964 12898 -4398 65748 92919 91727
20057I1727j2420n803J1566k3214m1491l9309k2549q067L2997J1851N4910l253
$$ 91727 79307 73504 85070 61856 20365 -18944 -41493 -49560 -16563 -4712 50198 46945
20045D6945J714n3667q371L650N3692P474J6729l5355n0689r277j3687N4874l4501
$$ 46945 48659 -5008 -13379 -9729 43963 51437 68166 32811 -17878 -27155 -40842 14032 -20469
20032b0469j9439K8513N650K1617M1880J0608o8467p6155k0265N301l4404M727
$$ -20469 -39908 -11395 -5745 15872 57752 68360 -107 -76262 -96527 -91226 -125630 -120903
20020a20903N5761M8202K8268j8547k5500j0230j1858m938L8512L2817j3163j7624
$$ -120903 -65142 -16940 11328 -7219 -32719 -42949 -54807 -59745 -21233 11584 -1579 -19203
20008a9203l35J4224J3583j1953J6342M3196Q076n4726k9193j7387K3613J1664
$$ -19203 -19538 -5314 8269 -3684 12658 55854 63930 9204 -19989 -37376 -13763 -2099
19996b099O5757j7720m3636k941R07j6902K6765M9942M8026K600n8039l0630J732
$$ -2099 63658 45938 2302 -639 268 -16634 10131 60073 108099 110699 52660 22030 23762
19983B3762K1429k7476m5561K5511M734L4315o370k8728n0186K6439J09791L0489
$$ 23762 45191 17715 -27846 -2335 2399 36714 30344 1616 -48570 -22131 87660 118149
19971A18149n6806k4226j1254K5288K3457o6156L718J2877k2311Q911p6739m6691
$$ 118149 61343 37117 25863 51151 74608 8452 12170 25047 2736 11647 -65092 -111783
19959a11783L4724N5108M9297q512k6658l9545k1094K6965l6470j3530L5645M5911
$$ -111783 -77059 -21951 27346 18834 -7824 -47369 -68463 -41498 -77968 -91498 -55853 -9942
19947i942N883J2548j9528K1669n0671K5940L1140l6020K0001r132n0892K375
$$ -9942 -4059 8489 -11039 10630 -40041 -14101 17039 -18981 1020 -8112 -59004 -56629
19935e6629M6609K6893N5770m5099n0550K6940K9567J7133j0133o1145L7263N0139
$$ -56629 -10020 16873 72643 27544 -23006 3934 33501 50634 40501 -20644 16619 66758
19923F6758k3941k9980K3156J012K7486n964K525o7783n458L1806k6319j6451
$$ 66758 42817 12837 35993 37005 64491 58527 61052 -6731 -12189 19617 -6702 -23153
19911b3153j683J7969j4710L5224L1219j6515k3116J1433M263K1726L4259j9782
$$ -23153 -24836 -6867 -21577 13647 44866 28351 5235 16668 20931 42657 76916 57134
19899E7134r355k1380K2196l7405k1958N3194R084q268k0143k2482j8878L3013
$$ 57134 47779 26399 48595 11190 -10768 42426 51510 43242 23099 617 -18261 14752
19887A4752j2033m0413L0527M0346j9334j1426L763M324K8697l0397k6791L8876
$$ 14752 2719 -37694 -7167 33179 13845 2419 6182 10506 39203 8806 -17985 20891
19875B0891L5776n259J8990l8309k5074K835j3547j603L9625N7212p0516n8607
$$ 20891 56667 51408 70398 32089 7015 9850 -3697 -5300 34325 91537 21021 -37586
19863c7586J5534Q4589o779O155N488N3867k1970j6235j3376k360o123k511K8339
$$ -37586 -22052 62537 55758 61913 67401 121268 99298 83063 69687 67327 61204 58693 87032
19850H7032j323R484K0476m0703l5429j4617o3518k7427k4550O4570O6577K8971
$$ 87032 85709 95193 115669 74966 39537 24920 -38598 -66025 -90575 -26005 40572 69543
19838F9543k0015m2464P710J1346K0753j6151o107l1562K5480l0041l4640L0936
$$ 69543 49528 7064 14774 26120 46873 30722 24615 -6947 18533 -11508 -46148 -15212
19826a5212N0155j4075m8715p1476P257L1098M5789L0690K6289M2565L2214p3469
$$ -15212 34943 20868 -27847 -99323 -92066 -60968 -15179 15511 41800 84365 116579 43110
19814D3110j9316R66o4013m1910O4977m383K1009K8449l536m152j3361L4825J1729
$$ 43110 23794 24760 -39253 -81163 -16186 -20569 440 28889 25353 21201 7840 42665 54394
19801E4394k1821M813P752P2456K7158k0867k5957M3295k7140o5275k9342m2327
$$ 54394 32573 37386 45138 117594 144752 123885 97928 141223 114083 48808 19466 -22861
19789b2861r032K7461K952L5269l3413r613K368k0542P324J1463J6486N3891K8352
$$ -22861 -31893 -4432 -1480 33789 376 -9237 -6869 -27411 -20087 -8624 7862 61753 90105
19776I0105L2558l1297m0585j3239l7378j8739L2991L6881J8052j685p919P36
$$ 90105 122663 91366 50781 37542 164 -18575 14416 51297 69349 67664 59745 60481
19764F0481P314k727l3633j8712L7619q525n683K8563j394l9842k7375R566N5639
$$ 60481 67795 65068 31435 12723 50342 41817 36134 64697 63303 23461 -3914 5652 61291
19751F1291L757M477M1508j1868k2011N1722m121o1688q476P559L5921k676l2366
$$ 61291 65048 69525 111033 99165 77154 128876 124755 63067 54591 62150 98071 95395 63029
19738F3029K287n2845k7020L7998L7906K2387K1128k047J4600m235j3364J2630
$$ 63029 65316 12471 -14549 23449 61355 83742 104870 102823 117423 113188 99824 112454
19726A12454R644m510k8942n3468k6158L2145M5231J9285J4055J4996j4361k1597
$$ 112454 122098 117588 88646 35178 9020 41165 86396 105681 119736 134732 120371 98774
19714I8774l2731J1580k7497L4535P5971J0717n5147K807N8928J4811j0890p877
$$ 98774 66043 77623 50126 84661 160632 171349 116202 119009 177937 192748 181858 173981
19702A73981l165K0367J3823q609m659k7014J772L540R436k4316j6374K6171n0108
$$ 173981 170816 191183 205006 196397 191738 164724 166496 170036 179472 155156 138782 164953 114845
19689A14845m8835J2398N7421K8945M2090J8851l4016j6467K3865P773j0523M1128
$$ 114845 66010 78408 135829 164774 206864 225715 191699 175232 199097 206870 196347 237475
19677B37475L3001j0346m7764J1481K5722k3624k4150j9562Q819J8132q729k7800
$$ 237475 270476 260130 212366 223847 249569 225945 201795 182233 191052 209184 200455 172655
19665A72655k4481l5374j6212M3451N9556K1667k1626k2076J543j4547K589k292
$$ 172655 148174 112800 96588 140039 199595 221262 199636 177560 179103 164556 167145 164853
19653A64853Q526q256j9500L2862M8016M1307o1695p45P085K5906J9782K7859
$$ 164853 173379 165123 145623 178485 226501 267808 206113 205368 212453 238359 258141 286000
19641B86000j7082k4174l1091m1509j7483J1000Q967N457L5197K9641n7463m1055
$$ 286000 268918 244744 213653 172144 154661 165661 174628 180085 215282 244923 187460 146405
19629A46405L1611N3727M995K3466K1709j4766M282m3178l2260J6599M6954k2295
$$ 146405 178016 231743 236738 260204 281913 267147 271429 228251 195991 212590 259544 237249
19617B37249o3909k7869K6891L1845J5730K9798O121m5952l8233M518r847n0868
$$ 237249 173340 145471 172362 204207 219937 249735 255856 209904 171671 176189 166342 115474
19605A15474J416L8258M2325K6197m1855k8003K7376J5603n4216M4096Q974l4598
$$ 115474 116890 155148 197473 223670 181815 153812 181188 196791 142575 186671 195645 161047
19593A61047r89K7381J5441n6804n1142J1094p02L9790J4677j2535l4021K5186
$$ 161047 160058 187439 202880 146076 94934 106028 105326 145116 159793 147258 113237 138423
19581A38423P7660J093m8979r686k0850m7553J1773J1831O945J0123m876l1942
$$ 138423 216083 217176 168197 158511 137661 90108 101881 113712 120657 130780 125904 93962
19569I3962J6450k8246M5397l8151m6503r76r739L665j2947J9956L3182M9913
$$ 93962 110412 82166 127563 89412 42909 41933 32194 35859 22912 42868 76050 125963
19557A25963j0812k1828k2038J4612K9916K8654J0578j5305j9470k9867k5414
$$ 125963 115151 93323 71285 85897 115813 144467 155045 139740 120270 90403 64989
19546F4989k577J12q550J4011N1803L3084n1162K040L6228n813n8251j3581N8988
$$ 64989 62412 62524 53974 67985 119788 152872 101710 103750 139978 134165 75914 62333 121321
19533A21321L4922k2294l5920o408j5566l5065M467P144J6199R637R40j0269L994
$$ 121321 156243 133949 98029 91621 76055 40990 45457 52601 68800 78437 79377 69108 73102
19520G3102L2661J380j5655o0659k3580M598J7548p168k1564L9797n887l6794
$$ 73102 105763 107143 91488 30829 7249 11847 29395 22227 663 40460 34573 -2221
19508b221J1443m479o645K3762j4279k3901K011O344j878l5610p380M4310L5053
$$ -2221 9222 4743 -1902 21860 7581 -16320 -14309 -7965 -9843 -45453 -52833 -8523 26530
19495B6530K5186N0466j1299l7217j1959j9725k717j8996J7526N14l7385j7779
$$ 26530 51716 102182 90883 53666 41707 21982 19265 269 17795 18309 -19076 -36855
19483c6855M4199j0549j7824j072K7455K7555j680K7803J690o1346M4788o017
$$ -36855 7344 -3205 -21029 -22101 5354 32909 31229 59032 60722 -624 44164 38147
19471C8147k3139J5771Q375k8546O403L4553M0337j3728k5760l5590j7394L4942
$$ 38147 15008 30779 39154 10608 17011 51564 91901 78173 52413 16823 -571 34371
19459C4371j3400n2321Q883K7476L3908Q200m805L2597J071o3265n4185J8338
$$ 34371 20971 -31350 -22467 5009 38917 47117 42312 74909 75980 12715 -41470 -23132
19447b3132M7889P3767M0545J7154m9683l0815k2151L111K4605j2614k4138K0249
$$ -23132 24757 98524 139069 156223 106540 75725 53574 56685 81290 68676 44538 64787
19435F4787L7968L7273l1986n1322o592j6480k9504J2817k568l3863K1299M6374
$$ 64787 102755 140028 108042 56720 50128 33648 4144 16961 14393 -19470 1829 48203
19423D8203j133L0181k2780q5490J5257O8140l0829j1405M70M1403j7080j5100
$$ 48203 47070 77251 54471 -31019 -15762 52378 21549 10144 10614 52017 34937 19837
19411A9837J2233o5912n7824J0072K7095J4772J9391L9218K4230k7921K4200j9427
$$ 19837 32070 -33842 -91666 -81594 -54499 -39727 -20336 18882 43112 15191 39391 19964
19399A9964L2336J08K2237O655k5221M419J7101k7772l0899l7726M4247J479j153
$$ 19964 52300 52408 74645 81300 56079 60498 77599 49827 18928 -18798 25449 26928 25775
19386B5775M1114J1336k4106L4730n9680l7765j4836J4121J8137M6882J4547m2994
$$ 25775 66889 78225 54119 88849 29169 -8596 -23432 -9311 8826 55708 70255 27261
19374B7261o0286J1107M0460J7720j1323J2944r867J9203o751M291L5791K3352
$$ 27261 -33025 -21918 18542 36262 24939 37883 28016 47219 40468 44759 80550 103902
19362A03902p390k7738k7021O141O701K8945m2539j3634K3720J6559o8757N108
$$ 103902 96512 68774 41753 47894 54595 83540 41001 27367 51087 67646 -1111 3997
19350C997J6582l2580k5792k6803k6032q21O2364O0500j9499o1408l342K9248
$$ 3997 20579 -12001 -37793 -64596 -90628 -91449 -29085 31415 11916 -49492 -52834 -23586
19338b3586M1262j0056l3983J5790L9851L85n675J9720J0507n0321m1789K1477
$$ -23586 17676 7620 -26363 -10573 29278 29663 23988 43708 54215 3894 -37895 -16418
19326a6418q256J5441K2218J4483j2087k0471N6945L9259K1305l3256k8698o434
$$ -16418 -24674 -9233 12985 27468 15381 -5090 51855 91114 112419 79163 50465 44031
19314D4031p31K1368K0549M3775j3604j3395l2852l7424k6542O884J9408L5263
$$ 44031 43300 64668 85217 128992 115388 101993 69141 31717 5175 12059 31467 66730
19302F6730r426j5900j0660J5031M159o5999o4497q703Q1356J1336j2854J7175
$$ 66730 57304 41404 30744 45775 49934 -16065 -80562 -89265 -7909 3427 -9427 7748
19290G748L121K2571P289n393R344j7141j6124r497k8234j4158P6139Q375k2548
$$ 7748 10869 33440 40729 35336 44680 27539 11415 1918 -26316 -40474 35665 44040 21492
19277B1492o051J2961k3569j9224J3418K3687k8736j286r247o836K0543K9533
$$ 21492 15441 28402 4833 -14391 -973 22714 -6022 -7308 -16555 -23391 -2848 26685
19265B6685K6742j4203m3694j1432L4444j6082n4699n5104K4137O1350L1325K2488
$$ 26685 53427 39224 -4470 -15902 18542 2460 -52239 -107343 -83206 -21856 9469 31957
19253C1957n989k8075q792O0151Q2817m4862n8574L250m364p5076l2444j0339
$$ 31957 25968 -2107 -10899 49252 132069 87207 28633 31883 27519 -47557 -80001 -90340
19241i0340j5754j8634M5409M7364M426o346p964N0215N292K382p007L1456J0025
$$ -90340 -106094 -124728 -79319 -31955 -27529 -33875 -41839 8376 13668 16050 9043 40499 50524
19228E0524Q890K8036m0314j0411j6696k7216l515l1054K2912L2516j2242k0318
$$ 50524 59414 87450 47136 36725 20029 -7187 -10702 -41756 -18844 13672 1430 -18888
19216a8888K4864K933j2094L8014j0482L953L2232k4081N7906J0899m5928q373
$$ -18888 5976 8909 -3185 34829 24347 28300 60532 36451 94357 105256 59328 50955
19204E0955K408k1061k1575P654Q168J221l010K1544l0971J5704L999K5364k1820
$$ 50955 53363 32302 10727 18381 26549 27770 24760 46304 15333 31037 35036 60400 38580
19191C8580m4729j2153J3091J4869J6596l9332m4628l1882M6337J9818l0922M713
$$ 38580 -6149 -18302 -5211 9658 26254 -13078 -57706 -89588 -43251 -23433 -54355 -49642
19179d9642j4828K7909K0427K5014L5162R131r012l4515m4411k6736N7782J7415
$$ -49642 -64470 -36561 -16134 8880 44042 53173 44161 9646 -34765 -61501 -3719 13696
19167A3696n1823m8786j4998Q9352J5280n025p1412k5765L5052N2209K2768K3155
$$ 13696 -38127 -86913 -101911 -12559 2721 -2304 -73716 -99481 -64429 -12220 10548 33703
19155C3703m912K0585K6558o3765o6034J4247J1889M3136J3925L4949L9118m1079
$$ 33703 28791 49376 75934 12169 -53865 -39618 -27729 15407 29332 64281 103399 62320
19143F2320m8139o6820l6115K9965N7544M2976j3211j6632L6814q530n318q0069
$$ 62320 14181 -52639 -88754 -58789 -1245 41731 28520 11888 48702 40172 34854 -45215
19131d5215l5937N6166p64L0959M2475n336j6137j0283L4021J676j0608J4034
$$ -45215 -81152 -24986 -25750 5209 47684 42348 26211 15928 49949 51625 41017 55051
19119E5051l261K437j9174M976r368j5046J5849j3596J3487j003k6185k5498j4442
$$ 55051 51790 54227 35053 40029 30661 15615 31464 17868 31355 30352 4167 -21331 -35773
19106c5773m4891L2707Q6964k9338n5283K3182R267O421J1621l3423o313k2105
$$ -35773 -80664 -47957 39007 9669 -45614 -22432 -13165 -6744 4877 -28546 -34859 -56964
19094e6964K3596P816j0874O819n7558j9406l042j9407J7709O7594J5725L886
$$ -56964 -33368 -25552 -36426 -29607 -87165 -106571 -109613 -129020 -111311 -43717 -27992 -24106
19082b4106M659J8978K6299j6377j2839J614l2664j393L321p059l8079K9980K1165
$$ -24106 -19447 -469 25830 9453 -3386 -1772 -34436 -35829 -32508 -39567 -77646 -47666 -26501
19069b6501J7643N786k5082l1720k4186n48J832N4668M5669J3048J1019K8111
$$ -26501 -8858 -3072 -28154 -59874 -84060 -84608 -82776 -28108 17561 30609 41628 69739
19057F9739l2547p530j1305k6280m5323k8221J5539m414K4518J4740M4666O139
$$ 69739 37192 29662 18357 -7923 -53246 -81467 -65928 -70342 -45824 -31084 13582 19721
19045A9721L0154J8213l9660j6660K3037R929j8563k1510J0709K7443K4546k3790
$$ 19721 49875 68088 28428 11768 34805 44734 26171 4661 15370 42813 67359 43569
19033D3569n166q613l2448n0431o285L9447L8395k4631P428M5485J3061J0279
$$ 43569 38403 29790 -2658 -53089 -59374 -19927 18468 -6163 1265 46750 59811 70090
19021G0090r0822j6640K7623k875m0290q227R266N5395K7414J6232j1052m8694
$$ 70090 -20732 -37372 -9749 -12624 -52914 -61141 -51875 3520 30934 47166 36114 -12580
19009a2580m733K3010m3608l234M8721J6593M4603r061O467L704m0997l8612k8255
$$ -12580 -17313 5697 -37911 -41145 7576 24169 68772 59711 66178 69882 28885 -9727 -37982
18996c7982R79j63J7076K1404o088J3020Q604m0515l1528J5958J2314J5064L8006
$$ -37982 -37003 -37166 -20090 1314 -4774 8246 16850 -23665 -55193 -39235 -26921 -11857 26149
18983B6149n3706k1454K3229N7336N3220m445p5598j5604K3883M45l022o615P39
$$ 26149 -27557 -49011 -25782 31554 84774 80329 4731 -10873 13010 13455 10433 3818 4557
18970D557r707j2111l1801J5658J6696L3243k0735o2764J0221N0646l64k8732
$$ 4557 -5150 -17261 -49062 -33404 -16708 16535 -4200 -66964 -56743 -6097 -6461 -35193
18958c5193J7814R8339k2976o3582l2327j8099O9896m0839p3841l4777K8569j2864
$$ -35193 -17379 80960 57984 -5598 -37925 -56024 13872 -26967 -100808 -135585 -107016 -119880
18946a19880N316j874P0421L379K1647J4611j2505j5263M2876P7239l1128P598
$$ -119880 -114564 -116438 -46017 -42638 -20991 -6380 -18885 -34148 8728 85967 54839 62437
18934F2437K9485J0215p9851n4325k954j3170K3670j5436l45l8734k299k5120
$$ 62437 91922 102137 22286 -32039 -34993 -48163 -24493 -39929 -40274 -79008 -81307 -106427
18922a06427l653M4312M8913M0291l684K6747j6984J0974J2119J2953l4929j9449
$$ -106427 -110080 -65768 -16855 23436 19752 46499 29515 40489 52608 65561 30632 11183
18910A1183N2324P1949q206o4799m6669n3257l0743j2467J9948N7412K1069k1442
$$ 11183 63507 135456 127250 62451 15782 -37475 -68218 -80685 -60737 -3325 17744 -3698
18898c698Q650J0014m5165l7060M715K9702O723k8392L5921r643l8979m8715J6642
$$ -3698 4952 14966 -30199 -67259 -62544 -32842 -26119 -54511 -18590 -28233 -67212 -115927 -99285
18885i9285O8155K9147K0984m0496L6959L285K729k0061j5451J7328Q656M4902
$$ -99285 -31130 -1983 19001 -21495 15464 18749 21478 1417 -14034 3294 11950 56852
18873E6852j6328k1779O5408p778o3925J433k7962K1597j3050q584j3910l0940
$$ 56852 40524 18745 84153 76375 12450 13883 -14079 7518 -5532 -14116 -28026 -58966
18861e8966L1580M7458o205n4298Q6609L6607o109L1623K6309k1644n0428m5284
$$ -58966 -27386 20072 13867 -40431 46178 82785 76676 108299 134608 112964 62536 17252
18849A7252J244K5904N3932j7420k8923l4431J7291K095J0529M794L0168k9108
$$ 17252 18496 44400 98332 80912 51989 17558 34849 36944 47473 52267 82435 53327
18837E3327K4348o4664o4801J1716L6804R989j3452L9123J9769m2544m5415L4316
$$ 53327 77675 13011 -51790 -40074 -3270 6719 -6733 32390 52159 9615 -35800 -1484
18825a484J1238q431k4729N2564K6477q782l2368L302k9721k0077n3673k3560
$$ -1484 9754 1323 -23406 29158 55635 46853 14485 17787 -11934 -32011 -85684 -109244
18813a09244K4488M0188J3301R924J633J3543M0589m655O481j8671P268M2388
$$ -109244 -84756 -44568 -31267 -21343 -19710 -6167 34422 29767 36248 17577 24845 67233
18801F7233Q143l4609m0422J1689N0583K1521l2254J9484l512k0678j54l2722
$$ 67233 75376 40767 345 12034 62617 84138 51884 71368 67856 47178 47024 14302
18789A4302k8475j229J7567K2923J3038l4391r070K8791M3665m471L2957Q038
$$ 14302 -14173 -15402 2165 25088 38126 3735 -5335 23456 67121 62650 95607 103645
18777A03645n781J2517k2540J1234m7998l6295N4662O2743K1813J9974P0246Q1143
$$ 103645 97864 110381 87841 99075 51077 14782 69444 132187 154000 173974 244220 325363
18765C25363L3983J2113j20557j23405m2335l3441m613J4389k8333n881K5009
$$ 325363 359346 371459 250902 127497 85162 51721 47108 61497 33164 27283 52292
18754E2292m1441o1163j1402K0975P3760R778m6287J2687p957m085M0546l9691
$$ 52292 10851 -50312 -61714 -40739 33021 42799 -3488 9199 1242 -2843 37703 -1988
18742a988l7484R978j3759j722K1839K6282l3465L058L2556O47Q641j6827k7443
$$ -1988 -39472 -29494 -43253 -44975 -23136 3146 -30319 -27261 5295 5942 14583 -2244 -29687
18729b9687K1105l91J4802L9633j7364P773j6870l959n236K6596o358m1408n026
$$ -29687 -8582 -8973 5829 45462 28098 35871 19001 15042 9806 36402 30044 -11364 -16390
18716a6390O3679L1434J5181m5609o1289k2762J9423R079m9197m1287l074o166
$$ -16390 47289 78723 93904 48295 -12994 -35756 -16333 -7254 -56451 -97738 -100812 -106978
18704a06978k7048J3552L0756L7696P4823L1503Q556l9886n5553k5377j478J5777
$$ -106978 -134026 -120474 -89718 -52022 22801 54304 62860 22974 -32579 -57956 -59434 -43657
18692d3657L6764K2637q01n6401L0890N6403K9237J355n942L7289j0703l4743
$$ -43657 -6893 15744 14943 -41458 -10568 45835 75072 76427 70485 107774 97071 62328
18680F2328l8636m130l9959n5028j7752O0828K2849j1722m765K6589Q612J3714
$$ 62328 23692 19562 -20397 -75425 -93177 -32349 -9500 -21222 -25987 602 9214 22928
18668B2928j9683J8498J2594k2925l8521k864o725k273j996J5361k9253L3512
$$ 22928 3245 21743 34337 11412 -27109 -29973 -36698 -38971 -40967 -25606 -54859 -21347
18656b1347q3024m4516R1925M6818j9507l4524N699J0574O341Q444R046K9329
$$ -21347 -104371 -148887 -56962 -10144 -29651 -64175 -58476 -47902 -41561 -33117 -24071 5258
18644E258J3353p623M1882K6855m4673n3948m1518K179M1240M9903O0207j481
$$ 5258 18611 10988 52870 79725 35052 -18896 -60414 -58235 -16995 32908 93115 91634
18632I1634m3059p0283n302k1421N913l1404k8138j128P096J8205M6051L2383
$$ 91634 48575 -21708 -27010 -48431 -42518 -73922 -102060 -103188 -96092 -77887 -31836 547
18620E47O625J6884J5529j0432m1942J3775M9913J5462L906p5518o1755P9648
$$ 547 7172 24056 39585 29153 -12789 986 50899 66361 70267 -5251 -67006 12642
18608A2642j7605k487j9174J3244L9970m9195l1257l7869l8477M0495N0546K8117
$$ 12642 -4963 -7450 -26624 -13380 26590 -22605 -53862 -91731 -130208 -89713 -39167 -11050
18596a1050m594k4671P521M5559J2672m0727q9573j9038O7295N2219m379K9220
$$ -11050 -15644 -40315 -32794 12765 25437 -15290 -104863 -123901 -56606 -4387 -8766 20454
18584B0454P410o7452k6674L0025J9799k0061N64J2008K4234N869k0828j3185
$$ 20454 27864 -39588 -66262 -36237 -16438 -36499 -35935 -23927 307 6176 -14652 -27837
18572b7837M378L618L9477o1188k9759Q687L2766j4514j2819J6156J1045l7555
$$ -27837 -23459 -19841 19636 -41552 -71311 -62624 -29858 -44372 -57191 -41035 -29990 -67545
18560f7545K4776M3156k7768q904n749k4738j7933Q690o159r986k9181M2875M8120
$$ -67545 -42769 387 -27381 -36285 -42034 -66772 -84705 -76015 -82174 -92160 -121341 -78466 -30346
18547c0346J3970k5372j6475J9849j537m108K7127J4324k656k8944l4229j6405
$$ -30346 -16376 -41748 -58223 -38374 -39911 -44019 -16892 -2568 -5224 -34168 -68397 -84802
18535h4802O9196L3840l5254J8493K0802N986k7211n1009J8691M3752K4525J2221
$$ -84802 -15606 18234 -17020 1473 22275 28261 1050 -49959 -31268 12484 37009 49230
18523D9230q283L2265j2262p115k3571j9915k5669l4759k6346k003J8680K5092
$$ 49230 40947 73212 60950 53835 30264 10349 -15320 -50079 -76425 -78428 -59748 -34656
18511c4656J3491L334q775K3849o1303m8723L0046Q5304Q695o152m600k9319J7863
$$ -34656 -21165 -17831 -26606 -2757 -64060 -112783 -82737 2567 11262 5110 510 -28809 -10946
18498a0946L1681j2598O5776K9763o3769o0300j3699j1504k969K1888k6441j5675
$$ -10946 20735 8137 73913 103676 39907 -20393 -34092 -45596 -48565 -26677 -53118 -68793
18486f8793J0706l0480J8695O9217O0607k858p1676k5275N599K1377J1302k6024
$$ -68793 -58087 -88567 -69872 -655 59952 57094 -14582 -39857 -34258 -12881 -1579 -27603
18474b7603j3291j1268l6122k5928M6048O1793j8312l2213K8591M3918J9055k4261
$$ -27603 -40894 -52162 -88284 -114212 -68164 -6371 -24683 -56896 -28305 15613 34668 10407
18462A0407J862K0892j0967m8760m4580L9702K2910q912M2732M2711j5319J969
$$ 10407 12269 33161 22194 -26566 -71146 -31444 -8534 -17446 25286 67997 52678 54647
18450E4647L8636m7865k2697k5761m310l0473n4530K2081M9630O7239j5368n1166
$$ 54647 93283 45418 22721 -3040 -7350 -37823 -92353 -70272 -20642 46597 31229 -19937
18438a9937r790O6918L05p3414P4567K6783l9033k3056l2017J290K8803L1015
$$ -19937 -29727 37191 37496 -35918 38649 65432 26399 3343 -28674 -27384 1419 32434
18426C2434J0980M4272J0913j0431k1735o7836k8952J6307p731O7181K5756n226
$$ 32434 43414 87686 98599 88168 66433 -1403 -30355 -14048 -21779 45402 71158 65932
18414F5932m3129l1410j313O649o4720k8496K7797O7291N3849Q692l7079o276
$$ 65932 22803 -8607 -9920 -3271 -67991 -96487 -68690 -1399 52450 61142 24063 17787
18402A7787K4165o3184n529K8401R260j0496n366N6283J4423k0193J5173Q886
$$ 17787 41952 -21232 -26761 1640 10900 404 -4962 51321 65744 45551 60724 69610
18390F9610j8253K4328P510l3217q069m907M5705p660l2603O555m8395j3057M085
$$ 69610 51357 75685 83195 49978 41909 37002 82707 75047 42444 48999 604 -12453 -8368
18377h368Q00P429l1597o8338l4818O1211J5687j7024N3337r589p70K8231K2081
$$ -8368 -7568 -139 -31736 -100074 -134892 -73681 -57994 -75018 -21681 -31270 -32040 -3809 18272
18364A8272O039L7084P536L4172Q322j2865j8884p9128m159R860M3631L7158K2891
$$ 18272 24311 61395 68931 103103 111425 98560 79676 548 -3611 6249 49880 87038 109929
18351A09929J5341M1848M2967n9330n7171k7836O752K4167K021J2220p7029l3682
$$ 109929 125270 167118 210085 150755 93584 65748 72500 96667 98688 110908 33879 197
18339A97Q818L7209p790j0639O3047K189J5763j882l0740m1616J255K0460k2722
$$ 197 9015 46224 38434 27795 90842 93031 108794 106912 76172 34556 35811 56271 33549
18326C3549l164P804l6232k0199l2589O7888K3742O203J7891K943M676l1145l5790
$$ 33549 30385 38189 1957 -18242 -50831 17057 40799 47002 64893 67836 72512 41367 5577
18313E577K579J7326j8060j3726o547n0476r87K7128j956Q400O2271M0789j1260
$$ 5577 8156 25482 7422 -6304 -12851 -63327 -64314 -37186 -39142 -30742 31529 72318 61058
18300F1058m5850J0470M0055m855k7670L239l3678J9726J4031m3633N1477N3772
$$ 61058 15208 25678 65733 60878 33208 36447 2769 22495 36526 -7107 44370 98142
18288I8142k7266k7031j7514k6125L6709L0864o473K8398m64J3865l1429k2164
$$ 98142 70876 43845 26331 206 36915 67779 61306 89704 89240 103105 71676 49512
18276D9512j9994q742j3270J0492L9720L270q283o337j0650L68K8361p907M008
$$ 49512 29518 20776 7506 17998 57718 60988 52705 46368 35718 36086 64447 56540 60548
18263F0548j0570r883k9139k1712K8028Q719j5524j8474J9573N4138L2598m8184
$$ 60548 49978 40095 10956 -10756 17272 25991 10467 -8007 11566 65704 98302 50118
18251E0118j4766J4296J3906K6619M7323N2988l1602j7082n395J588n032J5771
$$ 50118 35352 49648 63554 90173 137496 190484 158882 141800 136405 137993 132961 148732
18239A48732J6441J5266n113Q23n0451L1535O3786L5581n3926o1843k4328p5607
$$ 148732 165173 180439 175326 176149 125698 157233 221019 256600 202674 140831 116503 40896
18227D0896k7904J0122k052O004L2663L9673l2874n5598j482L8622L6963M5622
$$ 40896 12992 23114 21062 27066 59729 99402 66528 10930 9448 48070 85033 130655
18215A30655K535j113K6157o402k120m845j4312K2884K6693J9801L4930l8373
$$ 130655 133190 132077 158234 151832 149712 144867 130555 153439 180132 199933 234863 196490
18203A96490o9229M883J8150R98L1454j992J532m6690j6720J490j7695O4098L7229
$$ 196490 127261 132144 150294 151292 182746 180754 182286 135596 118876 120366 102671 166769 203998
18190B03998j4255m1577j2160K6594J6429M4443m2170K2722j6628J8591L8327
$$ 203998 189743 148166 136006 162600 179029 223472 181302 204024 187396 205987 244314
18179B44314M1547n3339l6807j3475M3581M4463J8225N265m0602k357Q190n0661
$$ 244314 285861 232522 195715 182240 225821 270284 288509 293774 253172 250815 259005 208344
18167B08344o810L7408l1251j8978O208N6650J4800L5498N3838N745O86m863N9283
$$ 208344 201534 238942 207691 188713 194921 251571 266371 301869 355707 361452 362138 357275 416558
18154D16558J3093n707l1803K3325L9025M028M8046K9610n9084p444J27155J30139
$$ 416558 429651 423944 392141 415466 454491 458519 506565 536175 477091 469647 596802 726941
18142G26941L489j0386K3805j8227R0330Q6452Q4887N6595K9037O0286R0893J05367
$$ 726941 730430 720044 743849 725622 815952 902404 987291 1043886 1072923 1133209 1224102 1329469
18130A329469J59264J21598K46894K86872L12278L87476M83554O62352Q60216
$$ 1329469 1488733 1610331 1857225 2144097 2456375 2843851 3327405 3989757 4849973
18121D849973J047258J330571J708526J974717K335366K813314L577532M526743
$$ 4849973 5897231 7227802 8936328 10911045 13246411 16059725 19637257 24164000
18113B4164000N074104M708031L177864J685935L792405Q398347J1646030O738327
$$ 24164000 29238104 33946135 37123999 38809934 42602339 51000686 62646716 69385043
18105F9385043j2210487k0390886j2665004o735348l763497k343967j558306j061192
$$ 69385043 57174556 36783670 24118666 17383318 13619821 11275854 9717548 8656356
18097H656356p28347m79058l96610l95647n97414p02259o20217n52632m91665
$$ 8656356 7928009 7448951 7052341 6656694 6059280 5357021 4736804 4184172 3692507
18088C692507l72046l46761l41949k37877k02572k27179k03999j66350j41248
$$ 3692507 3320461 2973700 2631751 2393874 2191302 1964123 1760124 1593774 1452526
18079A452526j40134p3323j00328j15066j12449q0697r0903p7008n9347o2686
$$ 1452526 1312392 1239069 1138741 1023675 911226 830529 739626 662618 603271 540585
18069E40585j6784J2823n3106r3095m8833N0770N2752M488l5644k4047l1083m5995
$$ 540585 523801 536624 483518 390423 341590 392360 445112 449600 413956 389909 358826 312831
18057C12831m8960l7510k8863j8260j5599m1718l2615l3298L954N5352R127k093
$$ 312831 263871 226361 197498 179238 163639 121921 89306 56008 59962 115314 124441 122348
18045A22348r807p8162r2334P27N5705K7745K1012j9344l1502n5819l3792N8296
$$ 122348 112541 34379 -57955 -57228 -1523 26222 47234 27890 -3612 -59431 -93223 -34927
18033c4927N4985N391q640m1223K5858k549j8900k0805L5092r110j6660K5075
$$ -34927 20058 25449 16809 -24414 1444 -1105 -20005 -40810 -5718 -14828 -31488 -6413
18021f413l7094l9246K0566J636K8293p477l4406J872K2650O423l3519k4068Q267
$$ -6413 -43507 -82753 -62187 -60551 -32258 -39735 -74141 -72269 -49619 -43196 -76715 -100783 -92516
18008i2516K0847j6716M104J0881J8941K1057K9095j7082r3713R660Q4669K1412
$$ -92516 -71669 -88385 -84281 -73400 -54459 -33402 -4307 -21389 -115102 -105442 -20773 639
17996F39m8601o5927l4026l679J8424O9938O1471j8483o1930J6896M39N2275J03447
$$ 639 -47962 -113889 -147915 -151594 -133170 -63232 -1761 -20244 -82174 -65278 -64839 -12564 90883
17983I0883m2992m4665j6850l8436n9392J7K7776M914M3706L6221j2286J9882
$$ 90883 47891 3226 -13624 -52060 -111452 -111435 -83659 -78745 -35039 1182 -11104 8778
17971H778p7717q890K5963L765N790L6112L768r803n658j9187M5589R3461K38
$$ 8778 -68939 -77829 -51866 -48101 -42311 -6199 -2431 -12234 -17892 -37079 8510 101971 102209
17958A02209r1076n7259L443j8663P048M2784k3077k6237R273k9768J7884R246
$$ 102209 11133 -46126 -42683 -61346 -54298 -11514 -34591 -60828 -51555 -81323 -63439 -54193
17946e4193l99Q0120L2220j3721k9753J3434L3097l3331K6011l7150J813K5198
$$ -54193 -54592 25528 57748 44027 14274 27708 60805 27474 53485 16335 18148 43346
17934D3346k0274p436j3150J790J9495M4706m5225M723m857K8928L6379l4487
$$ 43346 23072 15636 2486 4276 23771 68477 23252 27975 23118 52046 88425 53938
17922E3938l5308N65j823L8519n9054j3734M0069P982k4134l4928j1563M9661
$$ 53938 18630 19195 17372 55891 -3163 -16897 23172 31154 7020 -27908 -39471 10190
17910A0190L3257k340p7763K6164K7066P60Q719m2096o2229l464J7405M907L448
$$ 10190 43447 41107 -36656 -10492 16574 17334 26053 -16043 -78272 -81736 -64331 -59424 -55976
17897e5976k1368R754K6555K0798o446K635k9350l241Q5136L6241r5994j3610
$$ -55976 -77344 -67590 -41035 -20237 -26683 -24048 -53398 -56639 28497 64738 -31256 -44866
17885d4866M709M1707O6342K7586j0480K8237l4786k3841R138N8581O4847j5219
$$ -44866 -40157 1550 67892 95478 84998 113235 78449 54608 63746 122327 187174 171955
17873A71955o2935j10942m6187o325q327M8136M7339k3901j5889k1422m7792J5670
$$ 171955 109020 -1922 -48109 -54434 -62761 -14625 32714 8813 -7076 -28498 -76290 -60620
17861f0620N9356k7131j5395m3754l5208L8159J6778j876K7532J7370j6054M0914
$$ -60620 -1264 -28395 -43790 -87544 -122752 -84593 -67815 -69691 -42159 -24789 -40843 71
17849G1l1590m1537J7640J8895O0228J8573k5756J2288J5186k1505j2250L1548
$$ 71 -31519 -73056 -55416 -36521 23707 42280 16524 28812 43998 22493 10243 41791
17837D1791l4540l4625j567k0008L7284n035L730k907O944q224r133j7039R756
$$ 41791 7251 -27374 -28941 -48949 -11665 -16700 -12970 -15877 -8933 -17157 -26290 -43329 -33573
17824c3573Q278L0123P793l9835k6532L9374O1114P0226j5928l6184j763k7340
$$ -33573 -25295 4828 12621 -27214 -53746 -14372 46742 116968 101040 64856 63093 35753
17812C5753j9532M4621J6489k6392o1692l9407j3252J3995O638l11m758k3272
$$ 35753 16221 60842 77331 50939 -10753 -50160 -63412 -49417 -42779 -43090 -47848 -71120
17800g1120j3586R4992L5012m47l3916l9423o4018K6994o693j7628j6252Q036
$$ -71120 -84706 10286 45298 44851 10935 -28488 -92506 -65512 -72205 -89833 -106085 -98049
17788i8049M5708J8394j1788K2250k0448l9534J6352K2270L002j5308k0111k1952
$$ -98049 -52341 -33947 -45735 -23485 -43933 -83467 -67115 -44845 -41843 -57151 -77262 -99214
17776i9214n041M6390j546L1410K1518J2912N0325p761M429j1384R485J6869p2813
$$ -99214 -104255 -57865 -59411 -28001 -6483 6429 56754 48993 53422 42038 51523 68392 -4421
17763d421l0424M130j3739k4111l1215o203M8768M1781k2460N47O221K0083K1113
$$ -4421 -34845 -30715 -44454 -68565 -99780 -105983 -57215 -15434 -37894 -37347 -31126 -11043 10070
17750A0070l861J2498J1238L3934K6929n9880n1243P768k3734k8068o688Q647
$$ 10070 6209 18707 29945 63879 90808 30928 -20315 -12547 -36281 -64349 -71037 -62390
17738f2390k4597K3845J05225K2881n5893j3029k3281n0574j9301K7762P5235
$$ -62390 -86987 -63142 42083 64964 9071 -3958 -27239 -77813 -97114 -69352 5883
17727E883j8928k2433J5311l606r979k9078o036J1396K3040K0674m11L6318j206
$$ 5883 -13045 -35478 -20167 -23773 -33752 -62830 -68866 -57470 -34430 -13756 -14167 22151 20945
17714B0945m6205k8165j6153l6291L1M3854N1509p358j1660j9864j0059j1932
$$ 20945 -25260 -53425 -69578 -105869 -105838 -61984 -10475 -17833 -29493 -49357 -59416 -71348
17702g1348l0608K700l9306j7818O7707M5289n2023k8192K3901k0745M0973r326
$$ -71348 -101956 -99256 -138562 -156380 -88673 -43384 -95407 -123599 -99698 -120443 -79470 -88796
17690h8796k1252K3142K0569j9419M5903J2257J4676J5711K1070J0919O782m1094
$$ -88796 -110048 -86906 -66337 -85756 -39853 -27596 -12920 2791 23861 34780 41562 468
17678D68l125K9375j2792j4263k4430J254n104k746L8242n0397k7405L8453n2771
$$ 468 -2657 26718 13926 -337 -24767 -23513 -28617 -31363 6879 -43518 -70923 -32470 -85241
17665h5241p3885M9035O5873K8682M0366K1924o907p920K7010N3258j9620k7115
$$ -85241 -159126 -110091 -44218 -15536 24830 46754 39847 31927 58937 112195 92575 65460
17653F5460p3134q6100J4485K7027j258l523M4004M6522M1558J669r879K4754
$$ 65460 -7674 -93774 -79289 -52262 -53520 -57043 -13039 33483 75041 76710 66831 91585
17641I1585o2631m6982m6483j612M0210j755j7130p506K582L0699O8758K2017
$$ 91585 28954 -18028 -64511 -66123 -25913 -27668 -44798 -52304 -49722 -19023 49735 71752
17629G1752m4436j6456k4659k1869J3875N1823j4492m6806L9666N761j0545j0053
$$ 71752 27316 10860 -13799 -35668 -21793 30030 15538 -31268 8398 14159 3614 -6439
17617f439J5335K1904J5962r1411m7650M038O925L8891o257M3308N9031l3565
$$ -6439 8896 30800 46762 -44649 -92299 -88261 -81336 -42445 -48702 -5394 53637 20072
17605B0072l7907n2254J5085K3449k870p806j9861j3748m548K5954l4471M9302
$$ 20072 -17835 -70089 -55004 -31555 -34425 -42231 -62092 -75840 -80388 -54434 -88905 -39603
17593c9603R033n084L9753j5848n2651m7153R539P8524L5549J4870j3970o9919
$$ -39603 -30570 -35654 4099 -11749 -64400 -111553 -102014 -23490 12059 26929 12959 -56960
17581e6960l0805n8603L495P1449J6449K2862L6625l986l6274J2454N0229M1139
$$ -56960 -87765 -146368 -142873 -71424 -54975 -32113 4512 526 -35748 -23294 26935 68074
17569F8074k6598o3141k6642P084K2618j0903l244j0585M8388J1481j7801j6506
$$ 68074 41476 -21665 -48307 -41223 -18605 -29508 -32752 -43337 5051 16532 -1269 -17775
17557a7775J7264J8058k8010m8199J8195Q3981L5119m2952m1763n8397k5896R444
$$ -17775 -511 17547 -10463 -58662 -40467 43514 78633 35681 -6082 -64479 -90375 -80931
17545h0931K5825J4394L3818K4612N062J5567J1324R994L850k638m0474k5208
$$ -80931 -55106 -40712 -6894 17718 22780 38347 49671 59665 63515 60877 20403 -4805
17533d805l7400n000J498P544j782L4612j92j1909j2681L298k7311o413j1480
$$ -4805 -42205 -47205 -45707 -38163 -39945 -5333 -5525 -17434 -30115 -26817 -54128 -60541 -72021
17520g2021M1053K0001K4534l1373l3360o097K8321p259O404k4379n0612j6215
$$ -72021 -30968 -10967 13567 -17806 -51166 -57263 -28942 -36201 -29797 -54176 -104788 -121003
17508a21003L2148J2584l3428k122J2576K639J1445l524L5956R439q118R737j0381
$$ -121003 -88855 -76271 -109699 -111821 -99245 -96606 -85161 -88685 -52729 -43290 -51408 -41671 -52052
17495e2052m7146J3531N1081L8333m6323l483J9575P358J6240Q956M1188l8399
$$ -52052 -99198 -85667 -34586 3747 -42576 -46059 -26484 -19126 -2886 6070 47258 8859
17483H859l2494n213N5311K204k0631M311k9589m3623P210L702n188N2913J4724
$$ 8859 -23635 -28848 26463 28667 8036 12347 -17242 -60865 -53655 -49953 -55141 -2228 12496
17470A2496j9077o9262j3103K1349j6220j4985K1690M0438L6219k2165l3577m7906
$$ 12496 -6581 -75843 -88946 -67597 -83817 -98802 -77112 -36674 -455 -22620 -56197 -104103
17458a04103P7235O9546j0169P771k7658J0906j2026J8449L2344J0518L4933J02160
$$ -104103 -26868 42678 32509 40280 12622 23528 11502 29951 62295 72813 107746 209906
17446B09906M4897j9150k2100q511O8092P0042K6062o4130j04728n9653j8570
$$ 209906 254803 235653 213553 205042 273134 343176 369238 305108 200380 140727 122157
17435A22157n7586k9143n655j2096Q637L99j5896K9111Q300m3174m6798r627J8619
$$ 122157 64571 35428 29773 17677 26314 26713 10817 39928 48228 5054 -41744 -51371 -32752
17422c2752K3037O881k3886m4661L5995L0975K9349m2600l6070P425J4440l9758
$$ -32752 -9715 -2834 -26720 -71381 -35386 -4411 24938 -17662 -53732 -46307 -31867 -71625
17410g1625L0969J7337k4259L3265R406n8643M2585l3311k4396L4328N0572k8476
$$ -71625 -40656 -23319 -47578 -14313 -4907 -63550 -20965 -54276 -78672 -44344 6228 -22248
17398b2248k5257J3888j8489k6160K741J4868L4052p866L2021J1670J9548k2097
$$ -22248 -47505 -33617 -52106 -78266 -75525 -60657 -26605 -34471 -2450 9220 28768 6671
17386F671o7236p1792R790M9445j684J3250N8513O327J0552J9810O793J8686l9305
$$ 6671 -60565 -132357 -122567 -73122 -74806 -61556 -3043 3284 13836 33646 40439 59125 19820
17373A9820j5481j2860j7444q43J7262p022J4910k5941P105q462j8189J1369J6763
$$ 19820 4339 -8521 -25965 -26808 -9546 -16568 -1658 -27599 -20494 -28956 -47145 -35776 -19013
17360a9013N9457L4193p641k0548k1559o5636J8025J5633N782J4994p32K5922
$$ -19013 40444 74637 66996 46448 24889 -40747 -22722 -7089 -1307 13687 12955 38877
17348C8877l8022q8390l8280J0418L4527L8838J1718N2543j2897n246j9499k5370
$$ 38877 855 -87535 -125815 -115397 -80870 -42032 -30314 22229 9332 4086 -15413 -40783
17336d0783J499L1082j9475k3006m6059J636R0492J1935m738J0939P135l4844
$$ -40783 -39284 -8202 -27677 -50683 -96742 -95106 -4614 7321 2583 13522 20657 -14187
17324a4187n900j0135j6582L7675L6602k9693L157j0429K9112M21k0600K9892
$$ -14187 -20087 -30222 -46804 -9129 27473 -2220 937 -9492 19620 20041 -559 29333
17312B9333L78L5783L7324l4846k7342O680l6189o1889l281k8209J877L4232q142
$$ 29333 29711 65494 102818 67972 40630 47310 11121 -50768 -54049 -82258 -80381 -46149 -54291
17299e4291J2005K0134J0238q572l8124K7448K6356m1605l3465R056j3045l8734
$$ -54291 -42286 -22152 -11914 -20486 -58610 -31162 -4806 -46411 -79876 -70820 -83865 -122599
17287a22599K2670P421j3801O831L3503M5032M363k4107L985K7287k9310j9863
$$ -122599 -99929 -92508 -106309 -99478 -65975 -20943 -16580 -40687 -36702 -9415 -38725 -58588
17275e8588J3953j9793J7348J3904k2825L8443J1045q288R381L4361J3519k7518
$$ -58588 -44635 -64428 -47080 -33176 -56001 -17558 -6513 -14801 -5420 28941 42460 14942
17263A4942j7048j5213k3220L3383J8676k2312m4255m041l4328j7278K977L8643
$$ 14942 -2106 -17319 -40539 -7156 11520 -10792 -55047 -59088 -93416 -110694 -107717 -69074
17251f9074P3350l1771l0703K8984K887l1148n9424M0209O8470L5965l1204o9252
$$ -69074 4276 -27495 -58198 -29214 -26327 -57475 -116899 -76690 -8220 27745 -3459 -72711
17239g2711l1357J9022J9588L1832M4798M600l0220K1383m3978k1651k5047K710
$$ -72711 -104068 -85046 -65458 -33626 11172 15772 -14448 6935 -37043 -58694 -83741 -81031
17227h1031j1107j5913J6730O6074R359r291j8361n0150M046O0584k510M2476
$$ -81031 -92138 -108051 -91321 -25247 -15888 -25179 -43540 -93690 -89644 -29060 -31570 10906
17215A0906j3153n6287P481M4185j6691k2131j6210L067j5498m649N7783J3204
$$ 10906 -2247 -58534 -51053 -6868 -23559 -45690 -61900 -58833 -74331 -78980 -21197 -7993
17203g993K0384M7492r821o5093m7338k039N173P116O42j026K5892L9451l3180
$$ -7993 12391 59883 50062 -15031 -62369 -64408 -59235 -52119 -51477 -52503 -26611 12840 -20340
17190b0340l1431j5899K1786L5526J1062R515J5980j7180k9922M5407O4965l4043
$$ -20340 -51771 -67670 -45884 -10358 704 10219 26199 9019 -20903 24504 89469 55426
17178E5426l5618k1294j4800M1348M781j9196n7366j02K422K0931K7240k330o333
$$ 55426 19808 -1486 -16286 25062 29843 10647 -46719 -46821 -44399 -23468 3772 1442 -4891
17165d891J2656k1619O1705M931K573K2265M835l3500p3445n993J3900M8200j7022
$$ -4891 7765 -13854 47851 52782 55355 77620 82455 48955 -24490 -30483 -16583 31617 14595
17152A4595q895k6993l6129l4865J7887K7576K7302N7514k858j05667m7125M1775
$$ 14595 5700 -21293 -57422 -92287 -74400 -46824 -19522 37992 35134 -70533 -117658 -75883
17140g5883J0036j5412k8711M8901Q4354M457m4381k8867k411k5381j1717K3302
$$ -75883 -65847 -81259 -109970 -61069 23285 27742 -16639 -45506 -47917 -73298 -85015 -61713
17128f1713J6543J9926j8407M1005L2206K0508k0821k1749J8409M8940m6710l0188
$$ -61713 -45170 -25244 -43651 -2646 29560 50068 29247 7498 25907 74847 28137 -2051
17116b051m7938J0006M9125j0583N237k0842k3608k2747L5101K5387l386K4818
$$ -2051 -49989 -39983 9142 -1441 3796 -17046 -40654 -63401 -28300 -2913 -6299 18519
17104A8519P172l8455k1862L7511l4858K1623N8058j0383k9380l0746O1279j6644
$$ 18519 25691 -12764 -34626 2885 -31973 -10350 47708 37325 7945 -22801 38478 21834
17092B1834l8399m5324q3927J622N7268M0218k3848K8881k6327j2568K8443J2926
$$ 21834 -16565 -61889 -145816 -144194 -86926 -46708 -70556 -41675 -68002 -80570 -52127 -39201
17080c9201j5166K8715j4810J914K7105k1881K2138k3038J279j9297r51P401l3954
$$ -39201 -54367 -25652 -40462 -38548 -11443 -33324 -11186 -34224 -32945 -52242 -53193 -45792 -79746
17067g9746K8292O1385K5991j277j915j4937M5676k858m9115k6722m8330m0259
$$ -79746 -51454 9931 35922 34645 32730 17793 63469 60611 11496 -15226 -63556 -103815
17055a03815M500L0199N4263n3544r33L1905L6281L4572m85m3319k4156K7077
$$ -103815 -99315 -69116 -14853 -68397 -69330 -37425 -1144 33428 32943 -10376 -34532 -7455
17043g455L175M9228L3273k7137l9827l2089k5447M6210m5459l4247j0833j4041
$$ -7455 -4280 44948 78221 51084 11257 -20832 -46279 -69 -45528 -79775 -90608 -104649
17031a04649N2128L6897p388k3978k8232l4948J2051M5886j3446k402O4841M0787
$$ -104649 -52521 -15624 -23012 -46990 -75222 -110170 -98119 -52233 -65679 -68081 -3240 37547
17019C7547l5233l5672n297O5815M0256m3456j6244K5228j6498M7658O4427j8119
$$ 37547 2314 -33358 -38655 27160 67416 23960 7716 32944 16446 64104 128531 110412
17007A10412p5976k8383j2007k4679m1393O615q84l1184P2689O3081K6710K8241
$$ 110412 34436 6053 -5954 -30633 -72026 -65411 -66295 -97479 -24790 38291 65001 93242
16995I3242k4858j6544l0202J2379J2160p9174p2735K632L9744J108j4019j5017
$$ 93242 68384 51840 21638 34017 46177 -32997 -105732 -103100 -63356 -62248 -76267 -91284
16983i1284K8453R336o5792m229P6165N2564K4957m4631n6479n314M4726J3133
$$ -91284 -62831 -53495 -119287 -123516 -47351 5213 30170 -14461 -70940 -76254 -31528 -18395
16971a8395k9402L2291M8870M1350J1857j6535k8778l899m9168j4918K0917n966
$$ -18395 -47797 -15506 33364 74714 86571 70036 41258 37359 -11809 -26727 -5810 -11776
16959a1776n2511N5950M3555n2436m6906K1697L3266k589L94p097k4642j9489
$$ -11776 -64287 -8337 35218 -17218 -64124 -42427 -9161 -11750 -11356 -18453 -43095 -62584
16947f2584k9469N3366K4725j8055L0508m355q957J0680m55o4344M204K4817L3075
$$ -62584 -92053 -38687 -13962 -32017 -1509 -5864 -14821 -4141 -4596 -68940 -64736 -39919 -6844
16934f844O577j918k8208n3143J8873j5314O77j2861J3913J701L4033K268K3333
$$ -6844 -267 -2185 -30393 -83536 -64663 -79977 -79300 -92161 -78248 -76547 -42514 -40246 -16913
16921a6913P4277J0805k520L016l6703k6546J779M4353k0497k5288J3870R105
$$ -16913 57364 68169 65649 68665 31962 5416 7195 51548 31051 5763 19633 28738
16909B8738k6919J2814k4183q282J1542J2437k530m3533m0713m215K2285M5523
$$ 28738 1819 14633 -9550 -17832 -6290 6147 3617 -39916 -80629 -84844 -62559 -17036
16897a7036J8731J7963M3908R781p5822o2252r40J1386P654K349o798O769K921
$$ -17036 1695 19658 63566 73347 -2475 -64727 -65667 -54281 -46627 -44278 -51076 -44307 -41386
16884d1386k2527m655N11l875J9683M8826J5236k8207l9081J534k5849j6614j2774
$$ -41386 -63913 -68568 -68057 -71932 -52249 -3423 11813 -16394 -55475 -53941 -79790 -96404 -109178
16871a09178P266J8609R995M7012K9111K432L193j0154k9145K1268M293k6822
$$ -109178 -101912 -83303 -73308 -26296 2815 5247 8440 -1714 -30859 -9591 -5298 -32120
16859c2120Q310O4145K4908j9690J08k0197n6438o0625m9232M4703L01L2285N8376
$$ -32120 -23810 40335 65243 45553 45661 25464 -30974 -91599 -140831 -96128 -95827 -63542 -5166
16846e166J8746j6486j973M1350j7468l0572l0159l7657N3925L174J3844M1704
$$ -5166 13580 -2906 -4879 36471 19003 -11569 -41728 -79385 -25460 -22286 -8442 33262
16834C3262L303J043m6103m6614N560K1301j8420M7525O0223j5975k4476q753
$$ 33262 36565 37608 -8495 -55109 -49549 -28248 -46668 857 61080 45105 20629 11876
16822A1876j7779j5454m686m9035R474L053N8638N2461M3248K9000J8051n3196
$$ 11876 -5903 -21357 -26043 -75078 -65604 -62551 -3913 48548 91796 120796 138847 85651
16810H5651l4054j7281k9226j5392L6423J2873k555n6337r785O663O5543J7571
$$ 85651 51597 34316 5090 -10302 26121 38994 36439 -19898 -29683 -23020 42523 60094
16798F0094m4161n3262l0112M2954k270j203J1247j0612j1905k3667m1998k704
$$ 60094 15933 -37329 -67441 -24487 -26757 -27960 -16713 -27325 -39230 -62897 -104895 -107599
16786a07599j4826N8069M3772k486m062K0870O5932J3667r823K57K2129j0314
$$ -107599 -122425 -64356 -20584 -23070 -27132 -6262 59670 73337 63514 63771 85900 75586
16774G5586m3418n2364K1140J8282k9234n0111j7498M2168r678M6493K7259L2631
$$ 75586 32168 -20196 944 19226 -10008 -60119 -77617 -35449 -45127 1366 28625 61256
16762F1256j1789p491N182K1389m848J4439j8137o336J3637k623L2538k2998k960
$$ 61256 49467 41976 47158 68547 63699 78138 60001 53665 67302 64679 97217 74219 71259
16749G1259m1200n7858k4604k346k8516Q854n770L3138n986L1187L0842J2777
$$ 71259 30059 -27799 -52403 -54749 -83265 -74411 -80181 -47043 -53029 -21842 9000 21777
16737B1777J5741J1433j1498o499J534L1218n8164l5346m0620k89M111N0318O0352
$$ 21777 37518 48951 37453 30954 32488 63706 5542 -29804 -70424 -70713 -66602 -16284 44068
16724D4068J159M9346m4761l1246n6290l9103J6652R4099N8868l586k356o4762
$$ 44068 45227 94573 49812 18566 -37724 -76827 -60175 33924 92792 89206 86850 22088
16712B2088o3900k6098K2241M9128m7903m9585L3152J5424J3060p542J3783o958
$$ 22088 -41812 -67910 -45669 3459 -44444 -94029 -60877 -45453 -32393 -39935 -26152 -33110
16700c3110J610J0461J9987M277p0983L010J9430n661M266l8836K7309Q946l2834
$$ -33110 -31500 -21039 -1052 3225 -67758 -64748 -45318 -50979 -46713 -85549 -58240 -49294 -82128
16687h2128J7418M340j9201L2913R73m0543L5037L9728J0208j8025J760k0856
$$ -82128 -64710 -60370 -79571 -46658 -45685 -86228 -51191 -11463 -1255 -19280 -17520 -38376
16675c8376k8070J4133k512n683K0388L6210L902k5350j9781J6119o756q95J7039
$$ -38376 -66446 -52313 -54825 -60508 -40120 -3910 -8 -25358 -45139 -29020 -35776 -36671 -19632
16662a9632J4475j40j1645k7901K1681J2951J7684m1257j7276j1165K41M1593
$$ -19632 -5157 -5297 -16942 -44843 -23162 -10211 7473 -33784 -51060 -62225 -61984 -20391
16650b0391J1393L3634M941m4493j9510J450J8951k869L615P41P689j1904K1446
$$ -20391 -8998 24636 29577 -14916 -34426 -32976 -14025 -16894 -13279 -12538 -4849 -16753 4693
16637D693L348l0610J3454O5619P681l4838k232m6498j6096r618j8685J87k4011
$$ 4693 8041 -22569 -9115 56504 64185 29347 27115 -19383 -35479 -45097 -63782 -63595 -87606
16624h7606J569J2253k568J9136m7276l7329M7559O3561L1203j7435l6402m4946
$$ -87606 -86037 -73784 -76352 -57216 -104492 -141821 -94262 -30701 502 -16933 -53335 -98281
16612i8281l3692M0724J6361K984l21O676M3612N9063M0366m46j3585k1459O613
$$ -98281 -131973 -91249 -74888 -71904 -72225 -65549 -21937 37126 77492 77046 63461 42002 48615
16599D8615l8507j5421j3160l063L5820l485o8577m2209q745L5234J6121K0555
$$ 48615 10108 -5313 -18473 -21536 14284 10799 -57778 -99987 -108732 -73498 -57377 -36822
16587c6822L6273r241K1370L5336k8384j5526k2662j3533M9694l9262q9868j8506
$$ -36822 -549 -9790 11580 46916 18532 3006 -19656 -33189 16505 -22757 -112625 -131131
16575a31131J06843J14305n921l5241l4718m4830M3942J6910k806l3735j3891
$$ -131131 -24288 90017 84096 48855 14137 -30693 13249 30159 27353 -6382 -20273
16564b0273P949J0440L6292j3073J643P2706R024r4264n8487m572P7043k3539
$$ -20273 -12324 -1884 34408 21335 22978 95684 104708 10444 -48043 -52615 24428 889
16552H89j6032l8074N498k2501J795J5167K8905k4932P480K7653L7982j5621l2813
$$ 889 -15143 -53217 -47719 -70220 -68425 -53258 -24353 -49285 -41805 -14152 23830 8209 -24604
16539b4604l657N9836K8191K6817N2643k7031o4001O93m4909q4740q048M480M3834
$$ -24604 -28261 31575 59766 86583 139226 112195 48194 48887 3978 -80762 -88810 -84330 -40496
16526d0496K7460j3082J5186l0524j2810O4500L8711l1605k6467l3076k5485L3685
$$ -40496 -13036 -26118 -10932 -41456 -54266 10234 48945 17340 -9127 -42203 -67688 -34003
16514c4003M9962O3052K1144l7775k8505m5201l369L7012O790J2122K9144l9576
$$ -34003 15959 79011 100155 62380 33875 -11326 -14695 22317 29107 41229 70373 30797
16502C0797l8265K6916K1809L6667J345n4523k8752L2772p831k7435k3877l4699
$$ 30797 -7468 19448 41257 77924 79269 24746 -4006 28766 20935 -6500 -30377 -65076
16490f5076m6457M8316N2148k121m799N7306M7256k7418l2827m7285P187K9475
$$ -65076 -111533 -63217 -11069 -13190 -17989 39317 86573 59155 26328 -20957 -13770 15705
16478A5705l4721L0287L7228m7359j08213r064M4582L0472P5966k2073o9504m6048
$$ 15705 -19016 11271 48499 1140 -107073 -116137 -71555 -41083 34883 12810 -56694 -102742
16466a02742j630O2338Q731k2422J1525j7674J5012K7805l0749k22j5010R968
$$ -102742 -104372 -42034 -33303 -55725 -44200 -61874 -46862 -19057 -49806 -50028 -65038 -55070
16454e5070M3220o7334j3394M2331J6717k3227k3665J2426M472l684r928n2266
$$ -55070 -11850 -79184 -92578 -50247 -33530 -56757 -80422 -67996 -63524 -67208 -77136 -129402
16442a29402M7444L3156m215L8531K7724M1803K6106J5025p16k8455R07K1549
$$ -129402 -81958 -48802 -53017 -14486 13238 55041 81147 96172 95456 67001 67908 89457
16430H9457k5767j9123m530j7607j9685L451Q632J5110j6055p3613l3606O5113
$$ 89457 63690 44567 40037 22430 2745 6196 14828 29938 13883 -59730 -93336 -28223
16418b8223N1103K5926l7012k5318j1540M298l3580K4467J5119K1307m2844j4043
$$ -28223 22880 48806 11794 -13524 -25064 -20766 -54346 -29879 -14760 6547 -36297 -50340
16406e0340N0313o783q705k3488j3569M051K6645K8069p879m2689p080L8577L0227
$$ -50340 -27 -6810 -15515 -39003 -52572 -48521 -21876 6193 -1686 -44375 -51455 -12878 17349
16393A7349L9915k867J1958m5074J3643j1795O247k1004R56k5482J9317J6772
$$ 17349 57264 54397 66355 21281 34924 23129 29376 8372 9328 -16154 3163 19935
16381A9935l5800N5357M8862o0102l0575J4231k2432M6489j5813q3475o9958J8442
$$ 19935 -15865 39492 88354 28252 -2323 11908 -10524 35965 20152 -63323 -133281 -114839
16369a14839L010L6352j2258j4104L2263o977L689J9623k1756M3607Q2212K4451
$$ -114839 -111829 -75477 -87735 -101839 -69576 -76553 -72864 -53241 -74997 -31390 50822 75273
16357G5273P094m0709n1177k0519N157J1181L067k0193J0873L4536l0901l3057
$$ 75273 82367 41658 -9519 -30038 -24881 -13700 -10633 -30826 -19953 14583 -16318 -49375
16345d9375j2293n2063O9961M6154l607K8998n044j786l4648j5126o168J3798
$$ -49375 -61668 -113731 -43770 2384 -1223 27775 22731 20945 -13703 -28829 -34997 -21199
16333b1199J9460L6769N0892K8447j3395q4610n1924K400M6499K4062K189l7820
$$ -21199 -1739 35030 85922 114369 100974 16364 -35560 -33160 13339 37401 39590 1770
16321A770k3647j5203O3950O2728j5058q981k0419l3874Kj8783j1170j2792J189
$$ 1770 -21877 -37080 26870 89598 74540 65559 45140 11266 11268 -7515 -18685 -31477 -30288
16308c0288P2454J0931k8243p4607j7147N2514N382l5524l5390J9365L5878K0982
$$ -30288 42166 53097 24854 -49753 -66900 -14386 -9004 -44528 -79918 -60553 -24675 -3693
16296c693J5056l1045o1083J7669N0122k0392J0018P2707N0027l3197q4666k6086
$$ -3693 11363 -19682 -80765 -63096 -12974 -33366 -23348 49359 99386 66189 -18477 -44563
16284d4563n156K1734K4596j2387P187Q391N934K8908N2135k1580m8033k9756
$$ -44563 -49719 -27985 -3389 -15776 -8589 -198 5736 34644 86779 65199 17166 -12590
16272a2590m1867m106J3154M9707l4028l5628O065N6023J3789o8206m0157K9634
$$ -12590 -54457 -58563 -45409 4298 -29730 -65358 -59293 -3270 10519 -57687 -97844 -68210
16260f8210K1185K9359J393K5788K9615k0268P854l6627n4502n677n14L9559L9393
$$ -68210 -47025 -17666 -16273 9515 39130 18862 26716 -9911 -64413 -70090 -70604 -31045 8348
16247H348j2369m6665M0251N7343m1079m9183K1533K461l9015n5280Q259P827
$$ 8348 -4021 -50686 -10435 46908 5829 -43354 -21821 -19360 -58375 -113655 -105396 -97569
16235i7569L2449J5590J5785m0502r201j0650M2262J862R73L643M0196N9117L3666
$$ -97569 -65120 -49530 -33745 -74247 -83448 -94098 -51836 -49974 -49001 -45358 -5162 53955 87621
16222H7621n0914l3406K224k9916q9795q558L2886N8388k0849Q901K4887J0671
$$ 87621 36707 3301 5525 -24391 -114186 -122744 -89858 -31470 -52319 -43418 -18531 -7860
16210g860J2898M791J9792m640L625J6840M101k5683k9832K9214N4525J6282k5536
$$ -7860 5038 9829 29621 24981 28606 45446 49547 23864 -5968 23246 77771 94053 68517
16197F8517J14K993k9739l6746L4237L8083o3014k0271m03J5319o8778k0634N391
$$ 68517 68631 71624 41885 5139 39376 77459 14445 -5826 -6229 9090 -59688 -80322 -74931
16184g4931p185k2322N4417K2339m4858L2126K2534k3596J247K7383K0071K8568
$$ -74931 -82116 -104438 -50021 -27682 -72540 -40414 -17880 -41476 -40229 -12846 7225 35793
16172C5793n802j1928K5358l1069n724N974K6059l2691J565k6374L2358K6597
$$ 35793 29991 18063 43421 12352 6628 12602 38661 5970 7535 -18839 13519 40116
16160D0116q585l0485j154J6271j5409p161O039K4593j4196n9901J4575K8778
$$ 40116 31531 1046 -108 16163 754 -6407 -368 24225 10029 -49872 -35297 -6519
16148f519l4818m261J9261M6439j0807l8479R757L5747m732l7995j2540Q937K1007
$$ -6519 -41337 -45598 -26337 20102 9295 -29184 -19427 16320 11588 -26407 -38947 -30010 -9003
16135i003j5625M0079O4719K1591R239k4518n1335n8416l2930K6749K6028K7511
$$ -9003 -24628 15451 80170 101761 111000 86482 35147 -23269 -56199 -29450 -3422 24089
16123B4089j0190J4378o1525p6126J6607O6790L8036K182m5913K1206M3340j6546
$$ 24089 13899 28277 -33248 -109374 -92767 -25977 12059 14241 -31672 -10466 32874 16328
16111A6328o7726n3090N452o225N9390L718K1337m9623r5020N4510P0948M520
$$ 16328 -51398 -104488 -99036 -105261 -45871 -42153 -20816 -70439 -165459 -110949 -40001 -35481
16099c5481K2448L3361l3851J054P49J0674J1948l5346K675J0256r26J6668J5198
$$ -35481 -13033 20328 -13523 -12469 -11720 -1046 10902 -24444 -21769 -11513 -12439 4229 19427
16086A9427K264m7435j4129N1985N2490k3513L1066j8317m6319N046M1002K4479
$$ 19427 21691 -25744 -39873 12112 64602 41089 72155 53838 7519 12565 53567 78046
16074G8046j3538l6733J2603P467l0425n2797J7383o3829P23O4816J1J0968n6919
$$ 78046 64508 27775 40378 47845 17420 -35377 -17994 -81823 -81100 -16284 -16273 -5305 -62224
16061f2224k7799R186L0267J6955J4637J7716N49k6650J7666J8465r511L3834
$$ -62224 -90023 -80837 -50570 -33615 -18978 -1262 -713 -27363 -9697 8768 -743 33091
16049C3091l6966m1692K5308K1050l6072q223P9324l0219n2152m2504j1867N9770
$$ 33091 -3875 -45567 -20259 791 -35281 -43504 35820 5601 -46551 -89055 -100922 -41152
16037d1152L7490M442K71o1060O360P0421J8792j5073n9859q3217j3371P0655
$$ -41152 -3662 780 1051 -60009 -53649 16772 35564 20491 -39368 -122585 -135956 -65301
16025f5301O8689K9709o489n3641j9631J4223l0619J8053J3521j068N9716K7550
$$ -65301 3388 33097 26608 -27033 -46664 -32441 -63060 -45007 -31486 -32554 27162 54712
16013E4712O042k0199Q58k3958J6325j3729l8160K480M3821J2384l7388l7701
$$ 54712 60754 40555 41413 17455 33780 20051 -18109 -15629 28192 40576 3188 -34513
16001c4513l0525K3202P758N122J9954L6044M440O063l4141N936J0498O145p859
$$ -34513 -65038 -41836 -34078 -28956 -9002 27042 31482 37545 3404 9340 19838 25983 18124
15988A8124n952J3924l2639l4157o661N412K3830M0320l5329n2293L650K3793
$$ 18124 12172 26096 -6543 -40700 -47361 -41949 -18119 22201 -13128 -65421 -61771 -37978
15976c7978n6720K8075O2850K6850l3127j0229L579K312L3437k7827j8911L615
$$ -37978 -94698 -66623 -3773 23077 -10050 -20279 -16700 -14388 19049 -8778 -27689 -24074
15964b4074K2493k1732K0719p939k3392j4117R449K8279M9184m057k5943K2321
$$ -24074 -1581 -23313 -2594 -10533 -33925 -48042 -38593 -10314 38870 34813 8870 31191
15952C1191K1431k8069p24L0789J1752k5627k4423k6752j0606J7376J0549j605
$$ 31191 52622 24553 23829 54618 66370 40743 16320 -10432 -21038 -3662 6887 5282
15940E282l0034J8006J9918k0836o4989J6061N5838P030k5305j4351j3389n9835
$$ 5282 -24752 -6746 13172 -7664 -72653 -56592 -754 6276 -19029 -33380 -46769 -106604
15928a06604Q065N0628L1220n41o961K3462J3039K6244r661m5987p173l0264L3530
$$ -106604 -98539 -47911 -16691 -17232 -24193 -731 12308 38552 28891 -17096 -24269 -54533 -21003
15915b1003r678j8464k7461K5778M5640M0815M0575m1198m6827J03J7989K9866
$$ -21003 -30681 -49145 -76606 -50828 -5188 35627 76202 35004 -11823 -11720 6269 36135
15903C6135j8562k3058N501O500J2303J29l8483j558J4788K6789j9948j6562m4769
$$ 36135 17573 -5485 16 6516 18819 18948 -19535 -21093 -6305 20484 536 -16026 -60795
15890f0795K0602J0019o475M7240k6819k5422j6699j4256J2757P955j9487L5121
$$ -60795 -40193 -30174 -36649 10591 -16228 -41650 -58349 -72605 -59848 -51893 -71380 -36259
15878c6259P069q956q268M7732j4418m1391O029K9067l2232o4937j2811R5732
$$ -36259 -29190 -38146 -46414 1318 -13100 -54491 -48462 -19395 -51627 -116564 -129375 -33643
15866c3643J5553K2252j4572J2491N031j1787Q276j5661Q216J468l1904l2121
$$ -33643 -18090 4162 -10410 2081 7112 -4675 3601 -12060 -3844 -2376 -34280 -66401
15854f6401J3886N166k7801n4722J986J8730M6127Q0983J8147m1672j2437k1338
$$ -66401 -52515 -47349 -75150 -129872 -127886 -109156 -63029 17954 36101 -5571 -18008 -39346
15842c9346J4934m555J7130J6734j3730q501N487K9028o944q278j6762k7668m6270
$$ -39346 -24412 -28967 -11837 4897 -8833 -17334 -11847 17181 10237 1959 -14803 -42471 -88741
15829h8741l9734R125Q0787L2625J259K565J1935k4708L011J4755K2173M406r2680
$$ -88741 -128475 -119350 -38563 -5938 -4679 -2114 9821 -14887 -11876 2879 25052 29458 -63222
15816f3222m6907j8970N638O5905O7496k691m653n426n0992K8194o706l3692Q718
$$ -63222 -110129 -129099 -123461 -57556 9940 7249 2596 -2830 -53822 -25628 -32334 -66026 -57308
15803e7308K902l169J2797J3476L8076m2394N642N435K7972L4442O871q7042n5293
$$ -57308 -54406 -57575 -44778 -31302 6774 -35620 -29978 -24543 3429 37871 44742 -42300 -97593
15790i7593L7275J3148J5274K4598m822o627M9018l6026j6096M0268N517j5469
$$ -97593 -60318 -47170 -31896 -7298 -12120 -18747 30271 -5755 -21851 18417 23934 8465
15778H465k9185j6312J8189K9345J4676p944n4862M9111M1648l5748m3549j1948
$$ 8465 -20720 -37032 -18843 10502 25178 17234 -37628 11483 53131 17383 -26166 -38114
15766c8114m550R541j4488J1767L6058J6122j8095m0809P1965M7492j3193j8430
$$ -38114 -42664 -33123 -47611 -35844 214 16336 -1759 -42568 29397 76889 63696 45266
15754D5266m178M956K2723p191k3250K747o3795l4935M3133J5711p661O18J0699
$$ 45266 41088 46044 68767 61576 38326 41073 -22722 -57657 -14524 1187 -6474 -5856 4843
$$ [...]
##END NTUPLES=NMR SPECTRUM
##END=
