##TITLE=Analysis number 327816
Compound Code cc 09502
Project Code adrs
Chemist Name fudan
##JCAMPDX= 6.0         $$ Bruker NMR JCAMP-DX V2.0
##DATA TYPE= NMR SPECTRUM
##DATA CLASS= NTUPLES
##ORIGIN= Bruker BioSpin GmbH
##OWNER= nmr
$$ XWIN-NMR		Version 3.5
$$ Wed Apr 11 15:35:50 2007 GMT Daylight Time (UT+1h)  MAYBRIDGE\nmr@NMR_250MHZ
##.OBSERVE FREQUENCY= 250.131544655141
##.OBSERVE NUCLEUS= ^1H
##.ACQUISITION MODE= SIMULTANEOUS (DQD)
##.ACQUISITION SCHEME= undefined
##.AVERAGES= 16
##.DIGITISER RES= 18
##SPECTROMETER/DATA SYSTEM= dpx250
##.PULSE SEQUENCE= zg30
##.SOLVENT NAME= CDCl3
##.SHIFT REFERENCE= (INTERNAL, CDCl3, 0, 16.4394)
##AUDIT TRAIL= $$ (NUMBER, WHEN, WHO, WHERE, WHAT)
$$ ##TITLE= Audit trail, XWIN-NMR		Version 3.5
$$ ##JCAMPDX= 5.01
$$ ##ORIGIN= Bruker BioSpin GmbH
$$ ##OWNER= nmr
$$ C:\u/data/dgb/nmr/ADRS/970/pdata/1/auditp.txt
$$ ##AUDIT TRAIL=  $$ (NUMBER, WHEN, WHO, WHERE, WHAT)
(   1,<2007-04-11 15:35:30.69 +100>,<MAYBRIDGE\nmr>,<NMR_250MHZ>,
      <created by zg, POWCHK disabled, PULCHK disabled
       configuration hash MD5:
       49 4B E0 1D 92 C2 6B 37 9F E6 65 BC 52 41 86 1D
       data hash MD5: 64K
       3A C0 83 D7 4A 19 C8 E9 C7 AD BC 87 CD 84 B3 09>)
(   2,<2007-04-11 15:35:42.99 +100>,<MAYBRIDGE\nmr>,<NMR_250MHZ>,
      <Start of raw data processing
       ef LB = 0.3 FT_mod = 6 PKNL = 1 SI = 32K 
       data hash MD5: 32K
       F3 36 6C BC AF 2B E0 2A 32 C9 1D 90 38 C5 E3 7C>)
(   3,<2007-04-11 15:35:44.86 +100>,<MAYBRIDGE\nmr>,<NMR_250MHZ>,
      <apk 
       data hash MD5: 32K
       95 DE 97 5C 1A 7B A5 B9 4A 5C 8E 5C D2 91 C4 F7>)
(   4,<2007-04-11 15:35:45.56 +100>,<MAYBRIDGE\nmr>,<NMR_250MHZ>,
      <abs ABSG = 5 
       data hash MD5: 32K
       A1 96 B0 5E A2 70 CC CD 75 76 92 20 D7 5B F7 71>)
$$ ##END=
$$ 
$$ hash MD5
$$ 38 D4 2A D7 F6 0E F8 6C 2D 0B 98 6B 43 48 77 ED
##$RELAX= 
##$RELAX= 
##$RELAX= 
##$RELAX= 
##$RELAX= 
##$RELAX= 
##$RELAX= 
$$ Bruker specific parameters
$$ --------------------------
##$DU= <C:\u>
##$EXPNO= 970
##$NAME= <ADRS>
##$PROCNO= 1
##$TYPE= <nmr>
##$USER= <dgb>
##$AMP= (0..31)
100 100 100 100 100 100 100 100 100 100 100 100 100 100 100 100 100 100 
100 100 100 100 100 100 100 100 100 100 100 100 100 100 
##$AQSEQ= 0
##$AQ_mod= 3
##$AUNM= <au_zg>
##$AUTOPOS= <37 >
##$BF1= 250.13
##$BF2= 250.13
##$BF3= 250.13
##$BF4= 250.13
##$BF5= 500.13
##$BF6= 500.13
##$BF7= 500.13
##$BF8= 500.13
##$BYTORDA= 1
##$CFDGTYP= 0
##$CFRGTYP= 5
##$CHEMSTR= <none>
##$CNST= (0..31)
1 1 145 1 1 1 1 1 1 1 1 1 1 1 1 1 1 1 1 1 1 1 1 1 1 1 1 1 1 1 1 1 
##$CPDPRG= <>
##$CPDPRG1= <>
##$CPDPRG2= <>
##$CPDPRG3= <>
##$CPDPRG4= <mlev>
##$CPDPRG5= <mlev>
##$CPDPRG6= <mlev>
##$CPDPRG7= <mlev>
##$CPDPRG8= <mlev>
##$CPDPRGB= <>
##$CPDPRGT= <>
##$D= (0..31)
0 1 0 0 0 0 0 0 0 0.06 0 0 0 0 0 0 0.0002 0 0 0 0 0 0 0 0 0 0 0 0 0 0 
0 
##$DATE= 1176302129
##$DBL= (0..7)
120 120 120 120 120 120 120 120 
##$DBP= (0..7)
150 150 150 150 150 150 150 150 
##$DBP07= 0
##$DBPNAM0= <>
##$DBPNAM1= <>
##$DBPNAM2= <>
##$DBPNAM3= <>
$$ [...]
##$SUBNAM7= <"">
##$SUBNAM8= <"">
##$SUBNAM9= <"">
##$SW= 20.6930455092707
##$SWIBOX= (0..15)
0 0 3 0 0 0 0 0 0 0 0 0 0 0 0 0 
##$SW_h= 5175.983436853
##$TD= 65536
##$TD0= 1
##$TE= 683.16
##$TE2= 300
##$TE3= 300
##$TEG= 300
##$TL= (0..7)
0 120 120 120 120 120 120 120 
##$TP= (0..7)
150 150 150 150 150 150 150 150 
##$TP07= 0
##$TPNAME0= <>
##$TPNAME1= <>
##$TPNAME2= <>
##$TPNAME3= <>
##$TPNAME4= <>
##$TPNAME5= <>
##$TPNAME6= <>
##$TPNAME7= <>
##$TPOAL= (0..7)
0.5 0.5 0.5 0.5 0.5 0.5 0.5 0.5 
##$TPOFFS= (0..7)
0 0 0 0 0 0 0 0 
##$TUNHIN= 0
##$TUNHOUT= 0
##$TUNXOUT= 0
##$USERA1= <user>
##$USERA2= <user>
##$USERA3= <user>
##$USERA4= <user>
##$USERA5= <user>
##$V9= 5
##$VALIST= <valist>
##$VCLIST= <CCCCCCCCCCCCCCC>
##$VD= 0
##$VDLIST= <DDDDDDDDDDDDDDD>
##$VPLIST= <PPPPPPPPPPPPPPP>
##$VTLIST= <TTTTTTTTTTTTTTT>
##$WBST= 1024
##$WBSW= 4
##$XGAIN= (0..3)
0 0 0 0 
##$XL= 0
##$YL= 0
##$YMAX_a= 291882
##$YMIN_a= -315340
##$ZGOPTNS= <>
##$ZL1= 120
##$ZL2= 120
##$ZL3= 120
##$ZL4= 120
##$ABSF1= 16.43945
##$ABSF2= -4.253723
##$ABSG= 5
##$ABSL= 3
##$ALPHA= 0
##$AQORDER= 0
##$ASSFAC= 0
##$ASSFACI= 0
##$ASSFACX= 0
##$ASSWID= 0
##$AUNMP= <proc_1d>
##$AZFE= 0.1
##$AZFW= 0.1
##$BCFW= 0
##$BC_mod= 0
##$BYTORDP= 0
##$COROFFS= 0
##$CY= 12.5
##$DATMOD= 1
##$DC= 0
##$DFILT= <>
##$DTYPP= 0
##$F1P= 14.0000005364418
##$F2P= -0.99999901652339
##$FCOR= 0.5
##$FTSIZE= 32768
##$FT_mod= 6
##$GAMMA= 0
##$GB= 0
##$INTBC= 1
##$INTSCL= 1
##$ISEN= 128
##$LB= 0.3
##$LEV0= 0
##$LPBIN= 0
##$MAXI= 10000
##$MC2= 0
##$MEAN= 0
##$ME_mod= 0
##$MI= 0
##$NCOEF= 0
##$NC_proc= -3
##$NLEV= 6
##$NOISF1= 0
##$NOISF2= 0
##$NSP= 0
##$NTH_PI= 0
##$NZP= 0
##$OFFSET= 16.43945
##$PC= 1
##$PHC0= -123.9539
##$PHC1= 5.446819
##$PH_mod= 1
##$PKNL= yes
##$PPARMOD= 0
##$PSCAL= 4
##$PSIGN= 0
##$REVERSE= no
##$SF= 250.130020647867
##$SI= 32768
##$SIGF1= 0
##$SIGF2= 0
##$SINO= 400
##$SIOLD= 32768
##$SREGLST= <1H.CDCl3>
##$SSB= 0
##$STSI= 32768
##$STSR= 0
##$SW_p= 5175.98343685301
##$SYMM= 0
##$S_DEV= 0
##$TDeff= 65536
##$TDoff= 0
##$TI= <Analysis number 999999
Compound Code 99
Book Reference 9
Project Code 9>
##$TILT= no
##$TM1= 0
##$TM2= 0
##$TOPLEV= 0
##$USERP1= <user>
##$USERP2= <user>
##$USERP3= <user>
##$USERP4= <user>
##$USERP5= <user>
##$WDW= 1
##$XDIM= 32768
##$YMAX_p= 345477720
##$YMIN_p= -169123
$$ End of Bruker specific parameters
$$ ---------------------------------
##NTUPLES= NMR SPECTRUM
##VAR_NAME=  FREQUENCY,     SPECTRUM/REAL,   SPECTRUM/IMAG
##SYMBOL=    X,             R,               I
##VAR_TYPE=  INDEPENDENT,   DEPENDENT,       DEPENDENT
##VAR_FORM=  AFFN,          ASDF,            ASDF
##VAR_DIM=   32768,         32768,           32768
##UNITS=     HZ,            ARBITRARY UNITS, ARBITRARY UNITS
##FACTOR=    0.157963299565203, 1,           1
##FIRST=     4111.99979542559, 0,            0
##LAST=      -1063.98364142742, 0,           0
##MIN=       -1063.98364142742, -169123,     0
##MAX=       4111.99979542559, 345477720,    0
$$ Real data points
##PAGE= N=1
##DATA TABLE= (X++(R..R)), XYDATA
$$ [...]
24930b7019j0289K1279K9866k4946l6396L7598R606P556m834O477O554j1425l1029
$$ -27019 -37308 -16029 13837 -11109 -47505 -9907 -301 7255 2421 8898 15452 4027 -27002
24917b7002m126N567j4477j4724M9984J1649k4876k0314K2079L5774r913j9467
$$ -27002 -31128 -25561 -40038 -54762 -4778 6871 -18005 -38319 -16240 19534 9621 -9846
24905i846Q179J680J6797O813r83J6678j9180k7680L0805K1634r644j1510j5224
$$ -9846 -1667 13 16810 23623 22640 39318 20138 -7542 23263 44897 35253 23743 8519
24892H519k6759K988l279k8189k4180K0624M045n0135J5847K3368K5758J3072
$$ 8519 -18240 -15252 -18531 -46720 -70900 -50276 -46231 -96366 -80519 -57151 -31393 -18321
24880a8321L4932P007L279M0437J6024k8905l0363p162K644Q829j9770k6047k2480
$$ -18321 16611 23618 26897 67334 83358 54453 24090 16928 19572 28401 8631 -17416 -39896
24867c9896j8680K8473M3241j1352j7673L8085N8751k1556n1022m3648K5200K4298
$$ -39896 -58576 -30103 13138 1786 -15887 22198 80949 59393 8371 -35277 -10077 14221
24855A4221O817M892k5902r101K6240J9221K1001l3743j8248L3321j5509q1274
$$ 14221 21038 25930 28 -9073 17167 36388 57389 23646 5398 38719 23210 -58064
24843e8064k782N2899M130q530m7973K7354L5249j8111L555j4887J6445M5249
$$ -58064 -60846 -7947 -3817 -12347 -60320 -32966 2283 -15828 -12273 -27160 -10715 34534
24831C4534J8423J3943n3566j0406K3700j2928l8938O881j1452k0057n647P070
$$ 34534 52957 66900 13334 2928 26628 13700 -25238 -18357 -29809 -49866 -55513 -48443
24819d8443r717K7471L993j2460j2352J7269O589O923L9581K7599l0262p0695
$$ -48443 -58160 -30689 -26696 -39156 -51508 -34239 -27650 -20727 18854 46453 16191 -54504
24807e4504o947K5007J0196k1175K7407O3595j5050l1087j4702Q098r104k8076
$$ -54504 -61451 -36444 -26248 -47423 -20016 43579 28529 -2558 -17260 -9162 -18266 -46342
24795d6342K5588L6047r889O020p580n453P648k8484j5689L4064J765k940j0576
$$ -46342 -20754 15293 5404 11424 3844 -1609 6039 -22445 -38134 -4070 -2305 -5245 -15821
24782a5821l5898L8505M4916J2903j6322K622k0898O250j312J9457J3141P170
$$ -15821 -51719 -13214 31702 44605 28283 30905 10007 16257 14945 34402 47543 54713
24770E4713J7379j5388k6331j024j7256r292p838m165K185K4780J7776M215k2253
$$ 54713 72092 56704 30373 29349 12093 2801 -5037 -9202 -7017 17763 35539 39754 17501
24757A7501k7084k419l1486K473O241J1642K9912J2041k1846K5819L3456K7815
$$ 17501 -9583 -12002 -43488 -41015 -34774 -23132 6780 18821 -3025 22794 56250 84065
24745H4065k0036l633L6218n4565n1339n1858j2028O9141J00321J6821n0496m0030
$$ 84065 64029 60396 96614 42049 -9290 -61148 -73176 -4035 96286 113107 62611 22581
24733B2581k9570j1522q190j686q635k1679J8731O0322p302Q566L0879l4021q3530
$$ 22581 -6989 -18511 -26701 -28387 -37022 -58701 -39970 20352 13050 21616 52495 18474 -65056
24720f5056n006J9326N241L3552L994r658o265j8177j4695K4730K2182l761K3386
$$ -65056 -70062 -50736 -45495 -11943 -7949 -17607 -23872 -42049 -56744 -32014 -9832 -13593 9793
24707I793N784l2839k1084J2514j0000k7635J8006r319P799J1429M6384K1876
$$ 9793 15577 -17262 -38346 -25832 -35832 -63467 -45461 -54780 -46981 -35552 10832 32708
24695C2708L780L0656l4652j9682j2014j7570o559k2521J5021L5687K9050j6473
$$ 32708 36488 67144 32492 12810 796 -16774 -23333 -45854 -30833 4854 33904 17431
24683A7431j8283J3296k9467J2134q009j6766Q756j7651J8404K2803j6017k3864
$$ 17431 -852 12444 -17023 -4889 -12898 -29664 -20908 -38559 -20155 2648 -13369 -37233
24671c7233j0891M7489J2334k8934J0498N2484l2540k1645k4485j4726L6900p937
$$ -37233 -48124 -635 11699 -17235 -6737 45747 13207 -8438 -32923 -47649 -10749 -18686
24659a8686q574K6260J9317m2748l5937J0470n978K516L830p403k969M5862N0210
$$ -18686 -27260 -1000 18317 -24431 -60368 -49898 -55876 -53360 -49530 -56933 -59902 -14040 36170
24646C6170o1386k8750J7832K0419K9959J5950K2092l246k0172J1836M806K70
$$ 36170 -25216 -53966 -36134 -15715 14244 30194 52286 49040 28868 40704 45510 45780
24634D5780j4091k9815M0913q705k6913j5587N359P889m527o786l5336l0210K1221
$$ 45780 31689 1874 42787 34082 7169 -8418 -3059 4830 303 -6483 -41819 -72029 -50808
24621e0808J9229n807n719K6204l517J7519K8254M5086J5106m0665n1047l2147
$$ -50808 -31579 -37386 -43105 -16901 -20418 -2899 25355 70441 85547 44882 -6165 -38312
24609c8312L2730P933o7R898J4483k8944M204J2197j8376J8040l2630k4821j1985
$$ -38312 -5582 2351 2284 12182 26665 -2279 1925 14122 -4254 13786 -18844 -43665 -55650
24596e5650k500K8215M4769N4070o1342o9891k2120j3894L4583J5250n583j2338
$$ -55650 -58150 -29935 14834 68904 7562 -62329 -84449 -98343 -63760 -48510 -54093 -66431
24584f6431p052K76j7140J9298J1844K735M6594K3544j823J9798l5631n2891J6808
$$ -66431 -73483 -73207 -90347 -71049 -59205 -56470 -9876 13668 11845 31643 -3988 -56879 -40071
24571d0071P662P168L9656J4479k6972k558m5133l0158M0254J2351k9129k4122
$$ -40071 -32409 -25241 14415 28894 1922 -636 -45769 -75927 -35673 -23322 -52451 -76573
24559g6573k1822O355k7279j3718J2733R521L7567R8691N3387k930k5439o368
$$ -76573 -98395 -92040 -119319 -133037 -120304 -110783 -73216 25475 78862 75932 50493 44125
24547D4125K8529k9500k7641r416p7191n0665L8594j1239j2072R513K5998L1330
$$ 44125 72654 43154 15513 6097 -71094 -121759 -83165 -94404 -106476 -96963 -70965 -39635
24535c9635L9949J5259k800L4737L0850m50l5745m2251n5551P789J2962n41r888
$$ -39635 314 15573 12773 47510 78360 77910 42165 -86 -55637 -47848 -34886 -35427 -45315
24522d5315P809K4045J0278r350j9117L6795l984J7800R372L103j0855n2224p043
$$ -45315 -37506 -13461 -3183 -12533 -31650 5145 1161 18961 28333 31436 20581 -31643 -38686
24509c8686l2803p164L123J6756O309m0280p226r404L6013J0308k575O211o307
$$ -38686 -71489 -78653 -75530 -58774 -52465 -92745 -99971 -109375 -73362 -63054 -65629 -59418 -65725
24496f5725N0303L8845j1120j145j0412J4607J1899M6802m138m0292j5350m058
$$ -65725 -15422 23423 12303 11158 746 15353 27252 74054 69916 29624 14274 10216
24484A0216R664j2640k900j7426J5703k031q26K5183j617R974l7228k5307j8822
$$ 10216 19880 7240 4340 -13086 2617 586 -240 24943 23326 33300 -3928 -29235 -48057
24471d8057m1163K2830O6173L7469l6237p751o8920j3662M4727L1346N337k7427
$$ -48057 -89220 -66390 -217 37252 1015 -6736 -75656 -89318 -44591 -13245 -7908 -35335
24459c5335j5716k3548J1310k0068K0655J0757k131k8739k5228N3355M8774N4770
$$ -35335 -51051 -74599 -63289 -83357 -62702 -51945 -54076 -82815 -108043 -54688 -5914 48856
24447D8856M9239m8252l9673l4539K0907k484j1337K2162k9218q919N0988j1413
$$ 48856 98095 49843 10170 -24369 -3462 -5946 -17283 4879 -24339 -33258 17730 6317
24435F317r554j5049j3112O417m690O737K6073J4995J6538l2392j4435J1087J1453
$$ 6317 -3237 -18286 -31398 -24981 -29671 -22934 3139 18134 34672 2280 -12155 -1068 10385
24422A0385l3232k6090M0305j5845L778J192J0474J6249o126j3158L711o3262
$$ 10385 -22847 -48937 -8632 -24477 -20699 -19507 -9033 7216 1090 -12068 -8357 -71619
24410g1619O69p145k6054K4390N1561N3344j802k4845p013j5788q24K5286j6674
$$ -71619 -70950 -78095 -104149 -79759 -28198 25146 23344 -1501 -8514 -24302 -25126 160 -16514
24397a6514K0750J480j2615J8494K3141J0756l9326l4045l5287L4754K0516j3838
$$ -16514 4236 5716 -6899 11595 34736 45492 6166 -27879 -63166 -28412 -7896 -21734
24385b1734J4976J0884m5366O778Q107o574R52m11L113J6832q92m7934q086L5495
$$ -21734 -6758 4126 -41240 -34462 -26355 -32929 -31977 -32388 -29275 -12443 -13335 -61269 -69355 -33860
24371c3860L2506K7829K4005r952j0010J6872m0686l0778J8667r937j4328L279
$$ -33860 -1354 26475 50480 40528 30518 47390 6704 -24074 -5407 -15344 -29672 -26393
24359b6393L3913L516k1562O899M2251p903m3325j8057O797N00J9428M7108k3613
$$ -26393 7520 11036 -10526 -3627 38624 30721 -12604 -30661 -23864 -23364 -3936 43172 19559
24346A9559l2475J6395K0113l1420j1368j1383J9655j0689K1710K4439n623K390
$$ 19559 -12916 3479 23592 -7828 -19196 -30579 -10924 -21613 97 24536 18913 21303
24334B1303l3784k2554k0027K8489L0663k6109k1462K5016M4334M0368o357o8823
$$ 21303 -12481 -35035 -55062 -26573 4090 -22019 -43481 -18465 25869 66237 59880 -8943
24322h943k7871J6694K9200j831n6652J3780K6796J5539o577k4385J3976L9905
$$ -8943 -36814 -20120 9080 7249 -49403 -35623 -8827 6712 135 -24250 -10274 29631
24310B9631K0937K4757O49j2550J3056q2907k3028J8716L50j9020L0216k1953
$$ 29631 50568 75325 75974 63424 76480 -6427 -29455 -10739 -10389 -29409 807 -21146
24298b1146m1656k487N844J4136K7608l299n097J0898J1189j5536P252K2894L8555
$$ -21146 -62802 -65289 -59445 -45309 -17701 -21000 -26097 -15199 -4010 -19546 -12294 10600 49155
24285D9155q547k6973r973n107k6723J4395n860o2138J1234J6022J2849n22M1621
$$ 49155 40608 13635 3662 -1445 -28168 -13773 -19633 -81771 -70537 -54515 -41666 -42188 -567
24272e67l937K1633k4443J4050J59K817K5027k5892l8108O280K9575J3081j197
$$ -567 -4504 17129 -7314 6736 6895 9712 34739 8847 -29261 -22981 6594 19675 18478
24259A8478j8869l2830j5508j1281K3374M428j4638L7388P800m4765J0955K8106
$$ 18478 -391 -33221 -48729 -60010 -36636 -32208 -46846 -9458 -1658 -46423 -35468 -7362
24247g362J4792P629K6966j9253j7600K6519o624k6242j9303J6746N0304N241
$$ -7362 7430 15059 42025 22772 5172 31691 25067 -1175 -20478 -3732 46572 51813
24235E1813j8058J528N567k1012j9815q943M8011j1761K066L1835q142J195k9987
$$ 51813 33755 35283 40850 19838 23 -8920 39091 27330 29396 61231 53089 54284 24297
24222B4297J9484L359k0084p53M516l4264J9506K8563p269m0693m1043J4348N2173
$$ 24297 43781 47140 27056 26303 30819 -3445 16061 44624 37355 -3338 -44381 -30033 22140
24209B2140k8403o6092K4089K5256r805J9686K6176m518k7087l9187O254K3808
$$ 22140 -6263 -72355 -48266 -23010 -32815 -13129 13047 8529 -18558 -57745 -51491 -27683
24197b7683k631k3935l2320L9986K2108l902L2476M0088q279k8837k6800k2702
$$ -27683 -30314 -54249 -86569 -46583 -24475 -28377 4099 44187 35908 7071 -19729 -42431
24185d2431j363J0744N5219n966l8916K629l884L5495L271P277M5221m9633n7540
$$ -42431 -43794 -33050 22169 16203 -22713 -20084 -23968 11527 14798 22075 67296 17663 -39877
24172c9877K0948J0554k408m3796J0470O29k0852q691J7258L6872J4762O104L5298
$$ -39877 -18929 -8375 -10783 -54579 -44109 -43480 -64332 -73023 -55765 -18893 -4131 1973 37271
24159C7271k4370K4163K4511N265j8892L834k5617l1387L992o0390j4644K5197
$$ 37271 12901 37064 61575 66840 47948 51782 26165 -5222 -1230 -61620 -76264 -51067
24147e1067J5865j0116j4273J4191L5494P003K4547N698R413J2999k1848n71J4124
$$ -51067 -35202 -45318 -59591 -45400 -9906 -2903 21644 27342 36755 49754 27906 27335 41459
24134D1459k7748k2888L0348J2115j351j0581J5552k5166p9466o765N5399Q282
$$ 41459 13711 -9177 21171 33286 31935 21354 36906 11740 -67726 -74491 -19092 -10810
24122a0810j5690k3363q100M3290K3941k0539j6581K2779m394k855Q099k2149
$$ -10810 -26500 -49863 -57963 -14673 9268 -11271 -27852 -5073 -9467 -12322 -4223 -26372
24110b6372J386J2009m643J1237J4677J9518l3570k9226m5454J6894J0836k0277
$$ -26372 -24986 -12977 -17620 -6383 8294 27812 -5758 -34984 -80438 -63544 -52708 -72985
24098g2985K2506J4514q556o39K079k2097L7674j5100J2792M2018L6372k5122
$$ -72985 -50479 -35965 -44521 -45160 -43081 -65178 -27504 -42604 -29812 12206 48578 23456
24086B3456k6518N325K3683k8380o355J1465q440j0562j1193j7513p430j952J9966
$$ 23456 -3062 2263 25946 -2434 -8789 2676 -5764 -16326 -27519 -45032 -52462 -54414 -34448
24073c4448q425j5045o242p176k6548J3091r989N1522L6488j8861K167p463m2948
$$ -34448 -42873 -57918 -64160 -71336 -97884 -84793 -94782 -43260 -6772 -25633 -23466 -30929 -73877
24060g3877J0577L882L275p492Q031J4545j7074J8825K1636k1657j2576j0259
$$ -73877 -63300 -59418 -56143 -63635 -55604 -41059 -58133 -39308 -17672 -39329 -51905 -62164
24048f2164m383M988j9775L4921J3206j6200j1180J264O269J5158r181K6100p040
$$ -62164 -66547 -61559 -81334 -46413 -33207 -49407 -60587 -59323 -53054 -37896 -47077 -20977 -28017
24035b8017J0712L6689L561k0283R632J3437k8877o132J1273K43R703M025j6319
$$ -28017 -17305 19384 22945 2662 12294 25731 -3146 -9278 1995 2238 11941 15966 -353
24022c53K0267K005o530n4725k3632j3656J8213M3501L2080N7532J7302m7252
$$ -353 19914 21919 15389 -39336 -62968 -76624 -58411 -14910 17170 74702 92004 44752
24010D4752m8430m4089l4350P121m582j5638N080n003K5369L2193K3136l748N696
$$ 44752 -3678 -47767 -82117 -74996 -79578 -95216 -90136 -95139 -69770 -37577 -14441 -18189 -12493
23997a2493O510k5653p268J2819o107L9792O1035k4713k9571l8784m601j6541
$$ -12493 -5983 -31636 -38904 -26085 -32192 7600 68635 43922 14351 -24433 -29034 -45575
23985d5575K0414N7677J720j4449j3269j6813k5173M7358J5484j7111l1900M7079
$$ -45575 -25161 32516 34236 19787 6518 -10295 -35468 11890 27374 10263 -21637 25442
23973B5442o633l9019j5712k5454L5766K5319m4008K5458O0995k3129Q635Q6275
$$ 25442 18809 -20210 -35922 -61376 -25610 -291 -44299 -18841 42154 19025 27660 113935
23961A13935o383j2209j7815j9148m3512o984L6483p35l0591k5763l5383M3520
$$ 113935 107552 95343 77528 58380 14868 7884 44367 43632 13041 -12722 -48105 -4585
23949d585K7161P437m1021k7786l3571O727M8369L4204l0226j9912Q228k0948
$$ -4585 22576 30013 -11008 -38794 -72365 -65638 -17269 16935 -13291 -33203 -24975 -45923
23937d5923M718L4031J2356R535l297l809k400j3254k0648l8053J9723J8145k8782
$$ -45923 -41205 -7174 5182 14717 11420 7611 5211 -8043 -28691 -66744 -47021 -28876 -57658
23924e7658K8755Q477R28J6941k2340k1321j3460K4966M5142j9929m7687j1824
$$ -57658 -28903 -20426 -19498 -2557 -24897 -46218 -59678 -34712 10430 -9499 -57186 -69010
23912f9010K8448K0195l3345J4623j5975l4666k222N9932L3157k7515m7137K0256
$$ -69010 -40562 -20367 -53712 -39089 -55064 -89730 -91952 -32020 1137 -26378 -73515 -53259
23900e3259l1825j5607j214J2919L7071J5618N108j0987J4827j0366q534J2200
$$ -53259 -85084 -100691 -101905 -88986 -51915 -36297 -31189 -42176 -27349 -37715 -46249 -34049
23888c4049k408J1856K4265n411J9844L191M477k739K096k2410k7429K7967J0833
$$ -34049 -36457 -24601 -336 -5747 14097 17288 21765 19026 21122 -1288 -28717 -750 10083
23875A0083m0601L2273O975n54m2987k4405k4267P183L7378O320R354o899m5254
$$ 10083 -30518 1755 8730 8176 -34811 -59216 -83483 -76300 -38922 -32602 -23248 -30147 -75401
23862g5401K3865O3060J8704j8189l5121o237o993N9751L2387K3738k698k7378
$$ -75401 -51536 11524 30228 12039 -23082 -29319 -36312 23439 55826 79564 76866 49488
23850D9488j3101l69l5116J146j5667L6779K2645j9021j5328k4147k9971L8930
$$ 49488 36387 36018 902 2048 -13619 23160 45805 26784 11456 -12691 -42662 -3732
23838c732L5190K0493p528o160K359K34m5196q279k5124k0170K96J7513J5177
$$ -3732 31458 51951 44423 38263 40622 40856 -4340 -12619 -37743 -57913 -57617 -40104 -24927
23825b4927k4200l4265J6143p280R175n332k6853K9209R854L974R145l64N3857
$$ -24927 -49127 -83392 -67249 -74529 -65354 -70686 -97539 -68330 -58476 -54502 -45357 -45721 8136
23812H136M604J2069r902k1695J0713p948j6452m6333m0101J1363O9021L9892
$$ 8136 12740 24809 14907 -6788 3925 -4023 -20475 -66808 -106909 -95546 -26525 13367
23800A3367J7764l5312l735L5761L289J7506L358l3882j4021R824M3316l0637
$$ 13367 31131 -4181 -7916 27845 31134 48640 51998 18116 4095 13919 57235 26598
23788B6598m5200q024L124Q035j3003L3535R394Q147m6680l5328J6955M893M3620
$$ 26598 -18602 -26626 -23502 -15467 -28470 5065 14459 22606 -24074 -59402 -42447 -37554 6066
23775F066j2992L0816J0638j6685l4228j230N327K3759j9986o185l326J0719q792
$$ 6066 -6926 23890 34528 17843 -16385 -17615 -12288 11471 -8515 -14700 -18026 -7307 -16099
23762a6099j9293q785K1522N423m7624m7777O8371M5724k1862J1956j1638r023
$$ -16099 -35392 -44177 -22655 -17232 -64856 -112633 -44262 1462 -20400 -8444 -20082 -29105
23750b9105k9318L7171q104K1939n0714k8489K7103L2867R547m093O029M83M3250
$$ -29105 -58423 -21252 -29356 -7417 -58131 -86620 -59517 -26650 -17103 -21196 -15167 -14684 28566
23737B8566N497L540J8744P564m013M4150m130M215k4449l0937J1161L593k3339
$$ 28566 34063 37603 56347 63911 59898 104048 99918 104133 79684 48747 59908 63501 40162
23724D0162m6928k6668K375M500l6458J5822L3512K6539r146r306m535J6623O244
$$ 40162 -6766 -33434 -31059 -26559 -63017 -47195 -13683 12856 3710 -5596 -10131 6492 12736
23711A2736j8211k5265M270l0345k4143K2208j6J2142j3245m011J9565P133j7037
$$ 12736 -5475 -30740 -26470 -56815 -80958 -58750 -58766 -46624 -59869 -63880 -44315 -37182 -54219
23698e4219k661L6493k7771j3447k3166r425M073L1601L7854L4465m8094j9512
$$ -54219 -56880 -20387 -48158 -61605 -84771 -94196 -90123 -58522 -20668 13797 -34297 -53809
23686e3809M0931J8103l3127j3867j5206j17K1140R92j6667l3627K836K0047O1623
$$ -53809 -12878 5225 -27902 -41769 -56975 -57092 -35952 -34960 -51627 -85254 -82418 -62371 -748
23673g48M4204L8j672p5997m4875J0395K3612L3787k9978m4582K7472J2151j8435
$$ -748 43456 43494 41822 -34175 -79050 -68655 -45043 -11256 -41234 -85816 -58344 -46193 -64628
23660f4628k338K7470K6873J7611k8116o6553l8328n254Q7114O3209O809l2702
$$ -64628 -66966 -39496 -12623 4988 -23128 -89681 -128009 -133263 -46149 17060 23869 -8833
23648h833K2446j1826j4114Q339P111j2765K1625m556K6312n54m1054M434Q601
$$ -8833 13613 1787 -12327 -3988 3123 -9642 11983 7427 33739 33185 -7869 -3435 5166
23635E166J9517l6924l9367k9585J5812J3617m700l2663J4083K6151m068r330
$$ 5166 24683 -12241 -51608 -81193 -65381 -51764 -56464 -89127 -75044 -48893 -52961 -62291
23623f2291L8555J5997N658l402l078k4270r607j4149P936K9028j7200l7335K0343
$$ -62291 -23736 -7739 -2081 -5483 -8561 -32831 -42438 -56587 -48651 -19623 -36823 -74158 -53815
23610e3815J9076R982P051J1277J5584n0229K3702K2109j3174k6611R183M9346
$$ -53815 -34739 -24757 -17706 -6429 9155 -41074 -17372 4737 -8437 -35048 -25865 23481
23598B3481O79m239l4687k9698k8605M2377N2302m25j5962k4227J1326r607k697
$$ 23481 24160 19921 -14766 -44464 -73069 -30692 21610 21185 5223 -19004 -7678 -17285 -19982
23585a9982J9592N797r578j622j8227p032J8741o491P197k5636P185L5226k2102
$$ -19982 -390 5407 -4171 -5793 -24020 -31052 -12311 -18802 -11605 -37241 -30056 5170 -16932
23572a6932j9367K5586m5146r152P425J574l4623J2528L3079j5632k810q940p775
$$ -16932 -36299 -10713 -55859 -65011 -57586 -56012 -90635 -78107 -45028 -60660 -63470 -72410 -80185
23559h0185K3566J4473J0074m997K0530J1547M395K3181O096j6948j5900m1365
$$ -80185 -56619 -42146 -32072 -37069 -16539 -4992 -597 22584 28680 11732 -4168 -45533
23547d5533K2889K7847O533L949j1645l4010k5412j047j228L1745K8842p735k625
$$ -45533 -22644 5203 11736 15685 4040 -29970 -55382 -56429 -57657 -25912 2930 -4805 -7430
23534g430j4461K1526k4473K9504L8601K4366k4726k0437J7504J8129o1173n8910
$$ -7430 -21891 -365 -24838 4666 43267 67633 42907 22470 39974 58103 -3070 -61980
23522f1980r217L2677M0256k1533p349J5765J1098K2657o0q3960p356r728j5522
$$ -61980 -71197 -38520 1736 -19797 -27146 -11381 -283 22374 22314 -61646 -69002 -78730 -94252
23509i4252M45K3502M0633K5788K983L9360q01j3216k4172j7024L5369K3841m6687
$$ -94252 -93807 -70305 -29672 -3884 -901 38459 37658 24442 270 -16754 18615 42456 -4231
23496d231m3115K4129J4690J4141J4619L9167L2476l3959k8227J2190j0505n79
$$ -4231 -47346 -23217 -8527 5614 20233 59400 91876 57917 29690 41880 31375 30796
23484C0796J2520k7199j7669K3649R329P194k4961l0667q141l7O959K9304j5475
$$ 30796 43316 16117 -1552 22097 31426 38620 13659 -17008 -25149 -25186 -18227 11077 -4398
23471d398j6515o606L3056J6744k3248N2991L9686r244m213l0377p5566p981J6134
$$ -4398 -20913 -27519 5537 22281 -967 52024 91710 82466 78253 47876 -27690 -35671 -19537
23458a9537l1851l3471M949O1461l264O716m0869r053O354j4428k7404K0788P518
$$ -19537 -51388 -84859 -79910 -18449 -21713 -14997 -55866 -64919 -58565 -72993 -100397 -79609 -72091
23445g2091j0066j8938O422Q962L2715L1889k387j8410J0626L9140N182n5059
$$ -72091 -82157 -101095 -94673 -85711 -52996 -21107 -23494 -41904 -31278 7862 13044 -42015
23433d2015J0825R047M2440J8283J2360N202j7967P76J1222j9740P678M16l592
$$ -42015 -31190 -22143 20297 38580 50940 56142 38175 38951 50173 30433 38111 38527 34935
23420C4935j1602J3389j0549J204k0479K4782j6081m9731O712k1495J9255R006
$$ 34935 23333 36722 26173 27377 6898 31680 15599 -34132 -27420 -48915 -29660 -20654
23408b0654O122j9162k4944O7838L3289m2962J050K3434l5344K517l5624N532
$$ -20654 -14532 -33694 -58638 9200 42489 -473 577 24011 -11333 -8816 -44440 -38908
23396c8908N3642n72m0704k5896n570L2048J1282k53o52m541k687K6759J9144
$$ -38908 14734 14162 -26542 -52438 -58008 -25960 -14678 -14931 -15583 -20124 -22811 3948 23092
23383B3092n1076m0635k374K5661J7355K4740j3177L0510K9700k5641k2852j7532
$$ 23092 -27984 -68619 -70993 -45332 -27977 -3237 -16414 14096 43796 18155 -4697 -22229
23371b2229J1808l3070R246K2124J6941q746j6253l4673J2292J4699K4902J4798
$$ -22229 -10421 -43491 -34245 -12121 4820 -3926 -20179 -54852 -42560 -27861 -2959 11839
23359A1839k175l6325l4043k1560j5740J543J6875L1342o880Q094K2074L398K8362
$$ 11839 9664 -26661 -60704 -82264 -98004 -96461 -79586 -48244 -55124 -47030 -24956 -21558 6804
23346F804K6057l1634K1648l895j7083l322j3926k1128J218Q053k6157j3804Q259
$$ 6804 32861 1227 22875 18980 1897 -1425 -15351 -36479 -35261 -27208 -53365 -67169 -58910
23333e8910M687K3693J4735o788k0300k34J6637R945q518m602J720L0111n407
$$ -58910 -54223 -30530 -15795 -22583 -42883 -43117 -26480 -16535 -25053 -29655 -27935 2176 -3231
23320c231l654K4899N656K9625j0110J8396L9080r903J455q1591n3876l656L1707
$$ -3231 -6885 18014 23670 53295 43185 61581 100661 90758 92213 10622 -43254 -46910 -15203
23307a5203K3901r31j4226J9759N324j6707J9234j98j5762m4698O705r162j5482
$$ -15203 8698 7767 -6459 13300 18624 1917 21151 20953 5191 -39507 -32802 -41964 -57446
23294e7446M0373K2570j4495j2366K8881K2963n316m3773J999J2665O437M4811
$$ -57446 -17073 5497 -8998 -21364 7517 30480 25164 -18609 -16610 -3945 2492 47303
23282D7303J8658J0295J521k4916K962k9896m6409J7067k125l5505m0262l997
$$ 47303 65961 76256 77777 52861 55823 25927 -20482 -3415 -5540 -41045 -81307 -85304
23270h5304L1488L1907p32K2883J5442N25k8427J3552J7271K0652k8899K0400
$$ -85304 -53816 -21909 -22641 242 15684 16209 -12218 1334 18605 39257 10358 30758
23258C0758L60k9179k3906K5029l63O7607l7012n0269L4199L4479R473L498L3937
$$ 30758 31118 1939 -21967 3062 2699 70306 33294 -16975 17224 51703 61176 64674 98611
23245I8611n999n0164n3047j3817N1918K6662j6480j6452p007p1043j3651R432
$$ 98611 92612 42448 -10599 -24416 27502 54164 37684 21232 14225 -56818 -70469 -61037
23233f1037J2449K6416R717L1834O334k0648l3673N78q658K1320r773k7070J1977
$$ -61037 -48588 -22172 -12455 19379 25713 5065 -28608 -28030 -36688 -15368 -25141 -52211 -40234
23220d0234M347r280K5274N963J5493L3350j4304n4421q174O2861L886k0851j1419
$$ -40234 -35887 -45167 -19893 -13930 1563 34913 20609 -33812 -41986 20875 24761 3910 -7509
23207g509L738Q745K0884l6285l6455J3407j6011P201M6471k5219l0283J2742
$$ -7509 -3771 4974 25858 -10427 -46882 -33475 -49486 -42285 4186 -21033 -51316 -38574
23195c8574M9284K259k8081m9734J0037L3808J2625J2260l8373l5963l7812j4516
$$ -38574 10710 12969 -15112 -64846 -54809 -21001 -8376 3884 -34489 -70452 -108264 -122780
23183a22780N8018Q1366L0765m6220m6411j0270M2832J9861j8295J1947K7226
$$ -122780 -64762 16604 47369 1149 -45262 -55532 -12700 7161 -11134 813 28039
23172B8039K9350q53k9851J5439l176l0550k0537k6699q99J3784J5125J6919K7971
$$ 28039 57389 56536 26685 42124 38948 8398 -12139 -38838 -39737 -25953 -10828 6091 34062
23159C4062k810l2944l0261K4461n979J4782J8367l8577m1514J8043L4904Q27
$$ 34062 31252 -1692 -31953 -7492 -13471 1311 19678 -18899 -60413 -42370 -7466 -6639
23147f639m4145N42k3735j1003K3385L928K4625K048M2422K6582M535J3183k2650
$$ -6639 -50784 -50242 -73977 -84980 -61595 -57667 -33042 -30994 11428 38010 42545 55728 33078
23134C3078n495j7655j707k248m7865l7312j436J7795N0650k2113P948R374p586
$$ 33078 27583 9928 8221 5973 -41892 -79204 -80640 -62845 -12195 -34308 -26360 -16986 -24572
23121b4572J9020m312o543J9364L644K7122m3189k3814L7996R337k6239n803l917
$$ -24572 -5552 -9864 -16407 2957 6601 33723 -9466 -33280 4716 14053 -12186 -17989 -21906
23108b1906k7742k1878j2870J0896K347K9586M4321M1127J3192L0761j8091k3891
$$ -21906 -49648 -71526 -84396 -73500 -71153 -41567 2754 43881 57073 87834 69743 45852
23096D5852O85J095o2694k8190J4138L7421O058m0192l1847J6594J7932j9764
$$ 45852 46537 47632 -15062 -43252 -29114 8307 14365 -25827 -57674 -41080 -23148 -42912
23084d2912K312k375q822J0712L5339O459L2214L8527Q314k7279n0895l6981P546
$$ -42912 -40600 -42975 -51797 -41085 -5746 713 32927 71454 79768 52489 1594 -35387 -27841
23071b7841K2915k2593n5923o709L5723L5522L3199M3809K533k2621M4498o4293
$$ -27841 -4926 -27519 -83442 -90151 -54428 -18906 14293 58102 60635 38014 82512 18219
23059A8219o4031l5178j3348J7750K4872M9132J7257m662K2161M65j3885n6220
$$ 18219 -45812 -80990 -94338 -76588 -51716 -2584 14673 10011 32172 32637 18752 -37468
23047c7468J3819J9242k3976O645K2019n9167O549J0335l509k0957M376M7886
$$ -37468 -23649 -4407 -28383 -21738 281 -58886 -52337 -42002 -45511 -66468 -62092 -14206
23035a4206M2174Q466n8497n4670K547K3684L2740j0357l3261p003K8368p287
$$ -14206 27968 36434 -22063 -76733 -74186 -50502 -17762 -28119 -61380 -68383 -40015 -47302
23023d7302j0516L2432k6345N225L7320L1353j2851l6900l0398P594n798J7483
$$ -47302 -57818 -25386 -51731 -46506 -9186 22167 9316 -27584 -57982 -50388 -56186 -38703
23011c8703O8480J5823O891o005K462j271o294k2479m711K9053J012m298l489
$$ -38703 29777 45600 52491 46486 48948 47677 41383 18904 14193 43246 44258 39960 36471
22998C6471J5378k6702o9965k0737j7233L0192K8637J135j0475k6683J2494K1226
$$ 36471 51849 25147 -44818 -65555 -82788 -52596 -23959 -22824 -33299 -59982 -47488 -26262
22986b6262J6839k7247l1318L7463L2970j3018K7369Q022l6018l7503L2588j309
$$ -26262 -9423 -36670 -67988 -30525 2445 -10573 16796 24818 -11200 -48703 -16115 -17424
22974a7424k3625L5190J1402j1518J672q789j0652L1940K7649k0109j4015j0975
$$ -17424 -41049 -5859 5543 -5975 -4303 -13092 -23744 8196 35845 15736 1721 -9254
22962i254q007m3329R693M680L8834k1094Q678L838j5464l282K6252J0624l2768
$$ -9254 -17261 -60590 -50897 -46217 -7383 -28477 -19799 -15961 -31425 -34707 -8455 2169 -30599
22949c0599k5168Q500L0432O668R345j1577J0268J7574k6173l3217r605J1315
$$ -30599 -55767 -47267 -16835 -10167 -822 -12399 -2131 15443 -10730 -43947 -53552 -42237
22937d2237K7211O266l8513j2081K3015K793k3276J1747K1193M4393L3780l1120
$$ -42237 -15026 -8760 -47273 -59354 -36339 -33546 -56822 -45075 -23882 20511 54291 23171
22925B3171l0353J7446L2992k3852j2493j1165N676J8598o541j535o79P477q411
$$ 23171 -7182 10264 43256 19404 6911 -4254 1422 20020 13479 11944 11265 18742 10331
22912A0331m8088l7450k7495J8743M0534j3008m091K0597J0111k865M4847M997
$$ 10331 -37757 -75207 -102702 -83959 -43425 -56433 -60524 -39927 -29816 -32681 12166 17163
22900A7163l5094k8157K9172N5045j4685k0952k2404J0292R81j8101l643k0319
$$ 17163 -17931 -46088 -16916 38129 23444 2492 -19912 -9620 -8639 -26740 -30383 -50702
22888e0702L2834K4847q411J5031O187L4028M396j4405l0981M1386K15l1184l7285
$$ -50702 -17868 6979 -1432 13599 19786 53814 58210 43805 12824 54210 54425 23241 -14044
22875a4044l0501m7329N1334k38K2019L4039J8227j126l3956k6994r39L8569M8125
$$ -14044 -44545 -91874 -40540 -40778 -18759 15280 33507 32381 -1575 -28569 -29508 9061 57186
22862E7186n3685k9138L2182K146k7596j8291j4120M478R493K0623K5196J1367
$$ 57186 3501 -25637 6545 8691 -18905 -37196 -51316 -46838 -37345 -16722 8474 19841
22850A9841O429k7125p774j7802l871o119n1387J1962M6375K5912L9693j0723
$$ 19841 26270 -855 -8629 -26431 -30302 -36421 -87808 -75846 -29471 -3559 36134 25411
22838B5411k9160n2261J0147M3171M694j0054m605r606j6830Q325L295J5332L4088
$$ 25411 -3749 -56010 -45863 -2692 2002 -8052 -12657 -22263 -39093 -30768 -27473 -12141 21947
22825B1947K3926j5538n2523j841k2600l5305L1638N6966N8781K6220k4180o891
$$ 21947 45873 30335 -22188 -24029 -46629 -81934 -50296 6670 65451 91671 67491 60600
22813F0600j6845p507K1626j2808r463K1659J1786l3697l0820K271o0023n3201
$$ 60600 43755 36248 57874 45066 35603 57262 69048 35351 4531 6802 -53221 -106422
22801a06422N2727j4600k0531K3619O4830p92k1000L7967p837l5019j8873Q560
$$ -106422 -53695 -68295 -88826 -65207 -377 -1169 -22169 15798 7961 -27058 -45931 -37371
22789c7371K4965L6476J4827k0078k9529Q177K6772J691j1170Q698P917l5261
$$ -37371 -12406 24070 38897 18819 -10710 -2533 24239 25930 14760 23458 31375 -3886
22777c886j8104j8076l1393l031K6960J8307L1933L3237o55l9061l3117K8680
$$ -3886 -21990 -40066 -71459 -74490 -47530 -29223 2710 35947 35292 -3769 -36886 -8206
22765h206M6572L3954K150m8185m0107J8136k3089J9907J6481l1364p296k3k642
$$ -8206 38366 72320 74470 26285 -13822 4314 -18775 1132 17613 -13751 -21047 -21070 -23712
22752b3712K8164j5559m4540m6288L3155L3192M3340J7764O414j0140l8206L462
$$ -23712 4452 -11107 -55647 -101935 -68780 -35588 7752 25516 31930 21790 -16416 -12954
22740a2954L6644k59L6300P924J4179j9836l0775m7075L3577L3104k1380j5862
$$ -12954 23690 23431 59731 67655 81834 61998 31223 -15852 17725 50829 29449 13587
22728A3587j1815k7036J4366K4113j6267R976J515r225J2319j9362k6985L4134
$$ 13587 1772 -25264 -10898 13215 -3052 6924 8439 -786 11533 -7829 -34814 -680
22716f80l224r249N270Q660l4868l99K3696M5722k8432l9714m156J0186P671K7041
$$ -680 -3904 -13153 -7883 777 -34091 -34490 -10794 34928 6496 -33218 -37374 -27188 -19517 7524
22702G524O1198L10n1037l7114J976J4726Q131K5592m127j0320K1529j7166j1939
$$ 7524 68722 69032 17995 -19119 -17143 -2417 5714 31306 27179 16859 38388 21222 9283
22689I283k7679k1747l830K6682L1075J2909k7910m781k8954j9841o14l9041J6781
$$ 9283 -18396 -40143 -43973 -17291 13784 26693 -1217 -5998 -34952 -54793 -55407 -94448 -77667
22676g7667J4653L8576L1134M984l0793J4810j3915m7678K8467N5622K5463l7159
$$ -77667 -63014 -24438 6696 11680 -19113 -4303 -18218 -65896 -37429 18193 43656 6497
22664F497j3921K789l9546l6879l089L1708P7488K8001l3471k8115j0713o137
$$ 6497 -7424 -4635 -44181 -81060 -84149 -52441 25047 53048 19577 -8538 -19251 -25388
22652b5388J1716M2016O011m9407J7456l9413l2474L3822Q294M2016r257j3835
$$ -25388 -13672 28344 34355 -15052 2404 -37009 -69483 -35661 -27367 14649 5392 -8443
22640h443N51K4369k1890j524n085l068K0183L3601k5137k302J0743Q097l0040
$$ -8443 -7892 16477 -5413 -6937 -12022 -15090 5093 38694 13557 11255 21998 30095 55
22627E5j5764l2517J0908R431r128N416J5778K6087N565J2042k8612J8466m1957
$$ 55 -15709 -48226 -37318 -27887 -37015 -31599 -15821 10266 15831 27873 -739 17727 -24230
22614b4230J0702M214N883M098L704J234j7736m7992m354p736K4691L0991J1764
$$ -24230 -13528 -9314 -3431 667 4371 5605 -12131 -60123 -64477 -72213 -47522 -16531 -4767
22601d767k857M8922R949K1542k871o1175k4181M041j8874J9763O5646R198j7969
$$ -4767 -7624 41298 51247 72789 69918 8743 -15438 -11397 -30271 -10508 55138 64336 46367
22588D6367J5397J6977j2863k9015m1550m4908L6332L1588k1734J7544J3917m1096
$$ 46367 61764 78741 65878 36863 -4687 -49595 -13263 18325 -3409 14135 28052 -13044
22576a3044l6435K3755K8135M8161R383l4052j3494J8330k7587j0047M1873m9543
$$ -13044 -49479 -25724 2411 50572 59955 25903 12409 30739 3152 -6895 34978 -14565
22564a4565p2453j6413j633M0284N1886j3815j6032L475L446L196j900j5279N2638
$$ -14565 -87018 -103431 -105064 -64780 -12894 -26709 -42741 -39266 -35820 -32624 -34524 -49803 2835
22551B835L4649l7454m6147j3905K9118M2567l6662m5604M3126L2425m996p701
$$ 2835 37484 30 -46117 -60022 -30904 11663 -24999 -70603 -27477 4948 -48 -7749
22539g749l8358J8234K6622q929Q864K9381L536M488l0124k6826J0360n918L6303
$$ -7749 -46107 -27873 -1251 -10180 -1316 28065 31601 36089 5965 -20861 -10501 -16419 19884
22526A9884p482K5307K9301l7516j9901j0990L2607J0686j1800K43l3693l4921
$$ 19884 12402 37709 67010 29494 9593 -1397 31210 41896 30096 30339 -3354 -38275
22514c8275J3183k1839o648N544q730q842J7667J3343K8412j9420M4670k5694
$$ -38275 -25092 -46931 -53579 -48035 -56765 -65607 -47940 -34597 -6185 -25605 19065 -6629
22502f629q332K3272J2892j2654k2392j8783K6932J514j3871k4683l842J0972
$$ -6629 -14961 8311 21203 8549 -13843 -32626 -5694 -4180 -18051 -42734 -46576 -35604
22490c5604J0488M289M980J0037J2939m0351n0532l601J2148O283N8912K3960
$$ -35604 -25116 -20827 -15847 -5810 7129 -33222 -83754 -87355 -75207 -68924 -10012 13948
22478A3948j7646o911k8763o1940j6753N6417L3396L1990n529j3992j9473Q632
$$ 13948 -3698 -10609 -39372 -101312 -118065 -61648 -28252 3738 -1791 -15783 -35256 -26624
22466b6624J5369p841r193J8081N1282J2342L937o4830n699Q189j5265j7853J6772
$$ -26624 -11255 -19096 -28289 -10208 41074 53416 57353 -7477 -13176 -4987 -20252 -38105 -21333
22453b1333M2432K3259k828l2209l123k323J2252l76j1050l0336j5080J3923N360
$$ -21333 21099 44358 41530 9321 6198 3875 16127 15751 4701 -25635 -40715 -26792 -21432
22440b1432L1704J0687j778O174L07Q614m4352j5125J0325j2428j7540L4125K7075
$$ -21432 10272 20959 19181 25355 25662 34276 -10076 -25201 -14876 -27304 -44844 -10719 16356
22427A6356j0450j5891J5254J6276K4727J0093k0596k4080J269o573l8429j3058
$$ 16356 5906 -9985 5269 21545 46272 56365 35769 11689 12958 6385 -32044 -45102
22415d5102J0815M060k9529l9376k409N1678N1393K0843k6059k3074k8656J1974
$$ -45102 -34287 -30227 -59756 -99132 -101541 -49863 1530 22373 -3686 -26760 -55416 -43442
22403d3442J3609J2593K5973M1853k6986m8056J9939J3183J4597j9304j206K7123
$$ -43442 -29833 -17240 8733 50586 23600 -24456 -4517 8666 23263 3959 2753 29876
22391B9876k5186l7779k0087J4818M41j7951k7103K3589J3386k0064L5317j1696
$$ 29876 4690 -33089 -53176 -38358 -37917 -55868 -82971 -59382 -45996 -66060 -30743 -42439
22379d2439O221L5537K195M4977J6681n1056j8948l6922k5604P608J9243j218
$$ -42439 -36218 -681 1514 46491 63172 12116 -6832 -43754 -69358 -61750 -42507 -43725
22367d3725K1978L9858L729m0047k1019L0861Q410m5195p914J471q51J058j3891
$$ -43725 -21747 18111 21840 -18207 -39226 -8365 45 -45150 -53064 -51593 -52444 -51386 -65277
22354f5277J4742L43o417N94m607K2250r932k7488Q927Q053K1063L5041j8442
$$ -65277 -50535 -50192 -56609 -56015 -60622 -38372 -48304 -75792 -66865 -58812 -37749 -2708 -21150
22341b1150k5076q622Q433j8084l0286J3551J5809M1384Q976J535o607m3474j294
$$ -21150 -46226 -54848 -46415 -64499 -94785 -81234 -65425 -24041 -15065 -13530 -20137 -63611 -64905
22328f4905L2235N438l7956N619J0408J0569K7725k4836l7330l7151K0275M2764
$$ -64905 -32670 -27232 -65188 -59569 -49161 -38592 -10867 -35703 -73033 -110184 -89909 -47145
22316d7145j3423q334M1129L8971O082k848J2961M2330k6748p9850k2935k0438
$$ -47145 -60568 -68902 -27773 11198 17280 14432 27393 69723 42975 -36875 -59810 -80248
22304h0248m600J2483M7490J945o472J9050l4107l5311N4326M4682o146j0234
$$ -80248 -84848 -72365 -24875 -22930 -29402 -10352 -44459 -79770 -25444 19238 13092 2858
22292B858J7801r118J5823m2884n038N5614K764j9489k8415J664k0442Q093Q502
$$ 2858 20659 11541 27364 -15520 -20558 35056 37820 18331 -10084 -8420 -28862 -20769 -12267
22279a2267j8221j8591j0890K773L9417L5517P145K6186N001o3079k8564n282
$$ -12267 -30488 -49079 -59969 -57196 -17779 17738 24883 51069 56070 -7009 -35573 -40855
22267d0855P952J5856K6719n56l5669k2579Q126K4424M2649k5419J0714K2828
$$ -40855 -32903 -17047 9672 9116 -26553 -49132 -41006 -16582 26067 648 11362 34190
22255C4190j1213N308J5486j6663L948J588N1o113m9336K3634R674L1746L063
$$ 34190 22977 28285 43771 27108 31056 32644 32695 26582 -22754 880 10554 42300 45363
22242D5363j8182p992L8470K1617n5167l1639j1982j0572o593J9640L3972k2534
$$ 45363 27181 19189 57659 79276 24109 -7530 -19512 -30084 -36677 -17037 16935 -5599
22230e599j530L0529J533R482J7606m021n559k7251q398L9982L006L114o31Q6
$$ -5599 -7129 23400 24933 34415 52021 48000 42441 15190 6792 46774 49780 52894 52263 52349
22216E2349k1363m409j7367Q03J2708l6496m5217P969j597L9256J5999J8293j3684
$$ 52349 30986 26577 9210 10013 22721 -13775 -58992 -51023 -52620 -13364 2635 20928 7244
22203G244l2410K4841J5714K658m1523l5246J9890k939L806L1496L9698k1798
$$ 7244 -25166 -325 15389 18047 -23476 -58722 -38832 -41771 -37965 -6469 33229 11431
22191A1431J0425l282J2350k6226L2067j7947l9974n6058K5770Q2101L8104k1754
$$ 11431 21856 18574 30924 4698 36765 18818 -21156 -77214 -51444 30657 68761 47007
22179D7007k1556m0852J4513J2238J2956L503K5298p453l4407l9271J2947O681
$$ 47007 25451 -15401 -888 11350 24306 27809 53107 45654 11247 -28024 -15077 -8396
22167h396m7156j8121K2986K7092K8824K31j1830k854l4601j3201J2656n04k9845
$$ -8396 -55552 -73673 -50687 -23595 5229 5460 -6370 -9224 -43825 -57026 -44370 -44874 -74719
22154g4719K5013J8849J3655K5188j6189l3413L5706N1911O332m8112j6407L501
$$ -74719 -49706 -30857 -17202 7986 -8203 -41616 -5910 46001 52333 4221 -12186 -8685
22142h685J1148m6098l6715M2949J8657L1982j880J2020l4934l9442r248J6532
$$ -8685 2463 -43635 -80350 -37401 -18744 13238 11358 23378 -11556 -50998 -60246 -43714
22130d3714K130p584L7059j3634J376j132J8399P896j1873K134j4739n2993k4557
$$ -43714 -41584 -49168 -12109 -25743 -24367 -25499 -7100 796 -11077 -8943 -23682 -76675 -101232
22117a01232K8158K5021K0339J8490J8552l918m4457O521K7637n7600l8985K8216
$$ -101232 -73074 -48053 -27714 -9224 9328 5410 -39047 -32526 -4889 -62489 -101474 -73258
22105g3258L6245O785j6330j362j7183p154j27J5276J3104J52k0132J887J0781
$$ -73258 -37013 -30228 -46558 -47920 -65103 -72257 -72384 -57108 -44004 -43852 -63984 -62097 -51316
22092e1316k1124M7812K7281Q23k1652o258M3428R470m6116J315J3144N968K0779
$$ -51316 -72440 -24628 2653 3476 -18176 -24434 18994 28464 -17652 -16337 -3193 2775 23554
22079B3554n0605J8728M4211J8389k0732n7087k7888J4129K1283n301J5648L1522
$$ 23554 -27051 -8323 35888 54277 33545 -23542 -51430 -37301 -16018 -21319 -5671 25851
22067B5851N34j1026j6599j9227P943K0527P109K4660m511k8466o275K7679l8267
$$ 25851 26385 15359 -1240 -20467 -12524 8003 15112 39772 35261 6795 520 28199 -10068
22054a0068l5545M056J788j8214j4865p281K0032K7399K6284P299l9292j5343
$$ -10068 -45613 -41557 -39769 -57983 -72848 -80129 -60097 -32698 -6414 885 -38407 -53750
22042e3750K9828P824K9162J2931J9894k5254l2490J5508M1701L3549k2818k9867
$$ -53750 -23922 -16098 13064 25995 45889 20635 -11855 3653 45354 78903 56085 26218
22030B6218N733o537k8181k60J9511j8117m6767Q307J2975m3629J5067P2418N8013
$$ 26218 31951 25414 -2767 -3027 16484 -1633 -48400 -40093 -27118 -70747 -55680 16738 74751
22017G4751j9633M915j091l292l4854j966N1211l0136l7031l2441K8397L0442
$$ 74751 55118 60033 58942 55650 20796 18830 70041 39905 2874 -29567 -1170 29272
22005B9272k6459J0990K086J3451j4773M2758J1329k2456L538M2729m1604l2549
$$ 29272 2813 13803 15889 29340 14567 57325 68654 46198 49736 92465 50861 18312
21993A8312k2942J9015j1156K9327J8539J651Q240k5794k980K4466l5489L13L2873
$$ 18312 -4630 14385 3229 32556 51095 52746 60986 35192 32212 56678 21189 21502 54375
21980E4375j2668j394O732l999L9572K4778N739L780j782m6297L9007Q946j9828
$$ 54375 41707 40313 47045 43046 82618 107396 113135 116915 115133 68836 107843 116789 96961
21967I6961M6878Q6550P362K8429m255m1301R194Q825j4003j6293R507K0252M5566
$$ 96961 143839 230389 237751 266180 261925 220624 229818 238643 224640 208347 217854 238106 283672
21954B83672m0533N387K6444k2856O692J9671k8075L8277M7092P371p708K702
$$ 283672 243139 248526 274970 252114 258806 278477 250402 288679 335771 343142 335434 338136
21942C38136m2776J2347N0328J2216L6366j2752r305L0544K6119L6294R4213R8000
$$ 338136 295360 307707 358035 370251 406617 393865 384560 415104 441223 477517 571730 669730
21930F69730L6064j3528N7200M0224L6993N8265J10294R6610O6645J19092J50140
$$ 669730 705794 692266 749466 789690 826683 884948 995242 1091852 1158497 1277589 1427729
21919A427729J85735K14785K00702K35418L33990L52897L29492L97991L91570
$$ 1427729 1613464 1828249 2028951 2264369 2598359 2951256 3280748 3678739 4070309
21910D070309K20869J50065J70636R5562j2986o5399p8452r8664j33720n3435
$$ 4070309 4291178 4441243 4611879 4707441 4694455 4629056 4550604 4451940 4318220 4264785
21900D264785J4555R5243J26060J11449M9675m1978j10526j19770j95788k77034
$$ 4264785 4279340 4374583 4500643 4612092 4661767 4619789 4509263 4389493 4193705 3916671
21890C916671l01266l66867m16339l63123l59353k63983j99157j81828j76967
$$ 3916671 3615405 3248538 2832199 2469076 2109723 1845740 1646583 1464755 1287788
21881A287788j66405j56395o3860q1877o9632o8556o1561o2929l5011m4409k3296
$$ 1287788 1121383 964988 901128 819251 749619 681063 619502 556573 521562 477153 453857
21870D53857m3885o0750k137P110J8242J8843k0450m1900o3979j5692k8295n6331
$$ 453857 409972 349222 347085 354195 372437 391280 370830 328930 264951 249259 220964 164633
21858A64633m5834N624M9606j0121m6664l5929K4393K1865o2192j6472j3322J6317
$$ 164633 118799 124423 174029 163908 117244 81315 105708 127573 65381 48909 35587 51904
21846E1904K2465J5025K5205p592M932R605o120n361k1261k3108j5551j0660j4448
$$ 51904 74369 89394 114599 107007 111939 121544 115424 110063 88802 65694 50143 39483 25035
21833B5035P41L1865K1463l534n9672l12L7116p835o310L783M014r242J6514K8830
$$ 25035 25776 57641 79104 75570 15898 15586 52702 44867 38557 42340 46354 37112 53626 82456
21819H2456K3677k8264j54q090l3690l4881j18p767J5198M2895l6329m3559k2132
$$ 82456 106133 77869 77715 69625 35935 1054 936 -6831 8367 51262 14933 -28626 -50758
21806e0758J8335L9445L2449k9579l9368K4269P374K5800j9438m274N2130l958
$$ -50758 -32423 7022 39471 9892 -29476 -5207 2167 27967 8529 4255 56385 52427
21794E2427r616k0187o8954j5313K2661M964M1643L7529j4729O796m093l3902
$$ 52427 42811 22624 -46330 -61643 -38982 -34018 7625 45154 30425 37221 33128 -774
21782g74j2113L3463L2570k6728l2032k0975K0916K3353j7587J1552J638j5826
$$ -774 -12887 20576 53146 26418 -5614 -26589 -5673 17680 93 11645 13283 -2543
21770b543l7275J7666J3819K616K6746K7541j4786m9612j3722k5178l7020K796
$$ -2543 -39818 -22152 -8333 -5717 21029 48570 33784 -15828 -29550 -54728 -91748 -88952
21758h8952j2492j3479L0763N7326O7498k3860l0084j4414J5912J6580L792k0173
$$ -88952 -101444 -114923 -84160 -26834 40664 16804 -13280 -27694 -11782 4798 8590 -11583
21746a1583p511J3206j6550m820L5153K1289j5904Q093N183k78l9102k8760n004
$$ -11583 -19094 -5888 -22438 -27258 7895 29184 13280 21373 26556 26278 -12824 -41584 -46588
21733d6588J7740P127m1588K688J2171r127L9155J6398J4259r171o794L1397J2357
$$ -46588 -28848 -21721 -63309 -60621 -48450 -57577 -18422 -2024 12235 3064 -3730 27667 40024
21720D0024l605j7423K5159M9091K171k136l4525l2225k0357q746l4310O725j6120
$$ 40024 36419 18996 44155 93246 95417 93281 58756 26531 6174 -2572 -36882 -30157 -46277
21707d6277k4505K7006K9797K0125J4980Q97K36Q339K7756k2575o541M6652l1827
$$ -46277 -70782 -43776 -13979 6146 21126 22023 22259 30598 58354 35779 29238 75890 44063
21694D4063n291j9481k1369j4873M0527K7352k4073j6557k265j9388q91l7220
$$ 44063 38772 19291 -2078 -16951 23576 50928 26855 10298 8033 -11355 -12246 -49466
21682d9466j0860k39O2800J1856j8826J1763Q623n3250j5081j5514K5593n632
$$ -49466 -60326 -60565 2235 14091 -4735 7028 15651 -37599 -52680 -68194 -42601 -48233
21670d8233j6946K5712M1919J8106m0240j4833J5843k3525J862J6268k9539J6208
$$ -48233 -65179 -39467 2452 20558 -19682 -34515 -18672 -42197 -40335 -24067 -53606 -37398
21658c7398K6977j248l4981L3897L7684k2184L8912j2116p591p04N3120J5874
$$ -37398 -10421 -11669 -46650 -12753 24931 2747 41659 29543 21952 21248 74368 90242
21646I0242j9684p2127m7425J8281q641M659K5771M0240M974o362j1380j6358
$$ 90242 70558 -1569 -48994 -30713 -39354 -34695 -8924 31316 36290 29928 18548 2190
21634B190j4322j8446q307J0278j3437l1075Q394L2309O7718J6177j6834n6661
$$ 2190 -12132 -30578 -38885 -28607 -42044 -73119 -64725 -32416 35302 51479 34645 -22016
21622b2016j4810N165l143K7118k6043q173J0368K602j5349J6945l3006K0528
$$ -22016 -36826 -31661 -34804 -7686 -33729 -41902 -31534 -28932 -44281 -27336 -60342 -39814
21610c9814l1625l4065K3616P2962J2990o4167k5202K2299j5604k4849O223N0159
$$ -39814 -71439 -105504 -81888 -8926 4064 -60103 -85305 -63006 -78610 -103459 -97236 -47077
21598d7077P8234j4269j9091J0975k3040J9978J6837K2647K2k2353l8601j3931
$$ -47077 31157 16888 -2203 8772 -14268 5710 22547 45194 45216 22863 -15738 -29669
21586b9669M623j7066J1083P971j5659K6603k4322l8464n195L5749J8389K0330
$$ -29669 -25046 -42112 -31029 -23058 -38717 -12114 -36436 -74900 -80095 -44346 -25957 -5627
21574e627K7881l1347J407j342n305r253m3616J4105M3604J6599k2046l0443n36
$$ -5627 22254 -9093 -7686 -9028 -14333 -23586 -67202 -53097 -9493 7106 -14940 -45383 -45919
21561d5919M3601K7784m534P450n8688k3411n975O0737q255j000J8894k2033k0614
$$ -45919 -2318 25466 20932 28382 -30306 -53717 -59692 1045 -7210 -8210 10684 -11349 -31963
21548c1963j9529k4813M0732N1996N528k0623P615p110N821O624k8443k9371K0225
$$ -31963 -51492 -76305 -35573 16423 21951 1328 8943 1833 7654 14278 -14165 -43536 -23311
21535b3311l543j252r503k7718o427K8561j2044j3029J1666K4437R556N868k0653
$$ -23311 -26854 -28106 -37609 -65327 -71754 -43193 -55237 -68266 -56600 -32163 -22607 -16739 -37392
21522c7392k5954L8268K4004k3861p694j203j588J4866K3654J0689k1708J4255
$$ -37392 -63346 -25078 -1074 -24935 -32629 -33832 -35420 -20554 3100 13789 -7919 6336
21510F336L3869J5521K1040n4396n0928k3241J4033L1202M5873J0534m5737n2979
$$ 6336 40205 55726 76766 22370 -28558 -51799 -37766 -6564 39309 49843 4106 -48873
21498d8873L6063N3528K4439l4511m639l7516j2464K2548P459k5111J5460k8155
$$ -48873 -12810 40718 65157 30646 26007 -11509 -23973 -1425 6034 -19077 -3617 -31772
21486c1772n582K0169N2462J0099j8423n2377l228n468L951M4272K4148n76k176
$$ -31772 -37354 -17185 35277 45376 26953 -25424 -28652 -34120 -30169 14103 38251 37675 35499
21473C5499j9586m2021p397J8752J6581j4030l106l41l038O361J4760r543j4036
$$ 35499 15913 -26108 -33505 -14753 1828 -12202 -15308 -15649 -18687 -12326 2434 -7109 -21145
21460b1145k6277L1272K5744n473l707J1391J4068r540j3786K985l51J3678j6338
$$ -21145 -47422 -16150 9594 4121 414 11805 25873 16333 2547 5532 5181 18859 2521
21447B521k1224l732L0302P955L657r569K869J9418l719m2197J6490L9398k0425
$$ 2521 -18703 -22435 7867 15822 19479 9910 12779 32197 28478 -13719 2771 42169 21744
21434B1744m9902k57K1093K3732L2877K539J1434n9771o9423k2557K8638M6280
$$ 21744 -28158 -28415 -7322 16410 49287 51826 63260 3489 -65934 -88491 -59853 -13573
21422a3573L3520k9483M823L2532K2054j5973p116j6974k4942m124k4751k599
$$ -13573 19947 -9536 -4713 27819 49873 33900 26784 9810 -15132 -19256 -44007 -46606
21410d6606J5921o238N1334K3736m3848k0131q241J841j3616l658j9599J0785
$$ -46606 -30685 -36923 14411 38147 -5701 -25832 -34073 -32232 -45848 -49506 -69105 -58320
21398e8320N534j682K0024M2105M5819j5581k4755K1327J2512j0915j8355M566
$$ -58320 -52786 -54468 -34444 7661 53480 37899 13144 34471 46983 36068 17713 22279
21386B2279J1504l2339k4729L4960M1964M3885m8018l5596k9929K5076O872N702
$$ 22279 33783 1444 -23285 11675 53639 97524 49506 13910 -16019 9057 15929 21631
21374B1631l0934j243K1169J6900j0734L6116J997k1753p51j9047L9544j2624
$$ 21631 -9303 -10546 10623 27523 16789 52905 54902 33149 32398 13351 52895 40271
21362D0271l2153J4405k9443m7930j8049L0987K0275K0029n859J6603L5870m1275
$$ 40271 8118 22523 -6920 -54850 -72899 -41912 -21637 -1608 -7467 9136 45006 3731
21350C731n8307j3694M6514M8063l0070J6217N6795M0758L0514k9732l1057j5792
$$ 3731 -54576 -68270 -21756 26307 -3763 12454 69249 110007 140521 110789 79732 63940
21338F3940K6524J5699m3035r8968O787L5592j4389k4056J8857L2601J4763P845
$$ 63940 90464 106163 63128 -35840 -29053 6539 -7850 -31906 -13049 19552 34315 42160
21326D2160r751p493l3459o0228r742Q453L0886M1581j7060j1496j6886R092M918
$$ 42160 32409 24916 -8543 -68771 -78513 -70060 -39174 2407 -14653 -26149 -43035 -33943 -29025
21313b9025k3193k7653J5774k48l538j732J1572N1464L5828k557j9022n2378O220
$$ -29025 -52218 -79871 -64097 -64345 -67883 -69615 -58043 -6579 29249 26692 7670 -44708 -38488
21300c8488L1527k0361Q360M3851J3702l8103m0766j7118K0983K2259k0290l154
$$ -38488 -6961 -27322 -18962 24889 38591 488 -40278 -57396 -36413 -14154 -34444 -37598
21288c7598M6644P013j6758k8991J7880j302k9558K4063J5629J3781M607k6724
$$ -37598 9046 16059 -699 -29690 -11810 -13112 -42670 -18607 -2978 10803 15410 -11314
21276a1314m2736R590L5787j1081j6912K9733j514k8722R678J7644l79K2949k6720
$$ -11314 -54050 -44460 -8673 -19754 -36666 -6933 -8447 -37169 -27491 -9847 -10226 12723 -13997
21263a3997o2971j8381K6868K7086L4343n993k1284J0222j1962J1756O1341J8390
$$ -13997 -76968 -95349 -68481 -41395 -7052 -13045 -34329 -24107 -36069 -24313 37028 55418
21251E5418m1936P522L5161J6238m1785J7528K2881J6476j0127k0604N456o184
$$ 55418 13482 21004 56165 72403 30618 48146 71027 87503 77376 56772 62228 56044
21239E6044L009J6932k2669l7473l0987j3745k7347J3263M1689K0673j0693l889
$$ 56044 59053 75985 53316 15843 -15144 -28889 -56236 -42973 -1284 19389 8696 4807
21227D807P727N668j0671l948N823L1583M0864J845M2891L1363j4169m7504l7135
$$ 4807 12534 18202 7531 3583 9406 40989 81853 83698 126589 157952 143783 96279 59144
21214E9144j3000K6906l3585l8796J2424M2604m3584k3650K0582N467J0483j4219
$$ 59144 46144 73050 39465 669 13093 55697 12113 -11537 9045 14512 24995 10776
21202A0776O021J0134l6135K4709R733L220R741J1126m8706m0275j5375Q558N4293
$$ 10776 16797 26931 -9204 15505 25238 28458 38199 49325 619 -39656 -55031 -46473 7820
21189G820k4808j7515K7068l3165J2562M4195O387l468k4499l4617J8018P0674
$$ 7820 -16988 -34503 -7435 -40600 -28038 16157 22544 19076 -5423 -40040 -22022 48652
21177D8652L2517l2110q744k4281j0375l3283o137k470j5571M8123L4088r655
$$ 48652 81169 49059 40315 16034 5659 -27624 -33761 -36231 -51802 -3679 30409 20754
21165B0754J1392K1133l0873j8264N586K7151P814m3220l5324p907K0296k2735
$$ 20754 32146 53279 22406 4142 9728 36879 44693 1473 -33851 -41758 -21462 -44197
21153d4197m435O7198P3381J6177j9443o1823l2212J2148N17k892K04K5153P933
$$ -44197 -48632 18566 91947 108124 88681 26858 -5354 6794 7311 4419 4623 29776 37709
21140C7709l3550m553J6205k2190k5836k5720l8790M956J9555K4355J1355j072
$$ 37709 4159 -394 15811 -6379 -32215 -57935 -96725 -91769 -72214 -47859 -36504 -37576
21128c7576J8959J2812L0489m3060k2794J0086n3223J1168M2215K0813K8066N2965
$$ -37576 -18617 -5805 24684 -18376 -41170 -31084 -84307 -73139 -30924 -10111 17955 70920
21116G0920J967j4494k0658N119k352k0500k7418m0655K6653L4250K9284L2163
$$ 70920 72887 58393 37735 42854 40502 20002 -7416 -48071 -21418 12832 42116 74279
21104G4279j8808m5380o6099M0187O9725N3979l5081m4437k6486j3736J959J3527
$$ 74279 55471 10091 -56008 -15821 53904 107883 72802 28365 1879 -11857 -9898 3629
21092C629L6202K6434k8887m58J1850k1031j4976l9090K073K3896k4444j6715
$$ 3629 39831 66265 37378 36920 48770 27739 12763 -26327 -24254 -358 -24802 -41517
21080d1517M6044M8673m149P838Q773o1924L517k209k5017j501K2397O5631o0138
$$ -41517 4527 53200 49051 56889 65662 3738 7255 5046 -19971 -21472 925 66556 6418
21067F418O840N4827q791O725o6466n1187k5595r80O2800N4741n1170m0390j2783
$$ 6418 13258 68085 59294 66019 -447 -51634 -77229 -78209 -15409 39332 -11838 -52228 -65011
21054f5011K8290K3315L901j7474K2246k1633j6391J5361l5576o511N622j8589
$$ -65011 -36721 -13406 -9505 -26979 -4733 -26366 -42757 -27396 -62972 -69483 -63861 -82450
21042h2450M0295K6810j5756n7635J337J2195J5919K942J1440o939m8K3898K0238
$$ -82450 -42155 -15345 -31101 -88736 -87399 -75204 -59285 -56343 -44903 -51842 -51890 -27992 -7754
21029g754K931K1320P395l611J1520j6530K0613J451m7165K9273N10K4935O3702
$$ -7754 -4823 16497 23892 20281 31801 15271 35884 37335 -9830 19443 19953 44888 108590
21016A08590J6251m9985j5576j6692l1150J7128k7026j3215k6517J0024N4409
$$ 108590 124841 74856 59280 42588 11438 28566 1540 -11675 -38192 -28168 26241
21005B6241m3793n462M3244j637l2676j5614L0829N609k2925L7916K5991m3973
$$ 26241 -17552 -23014 20230 18593 -14083 -29697 1132 6741 -16184 21732 47723 3750
20993C750n1499j3179K8757Q823j0890k2318J4866K6017M6598J6935k5785r473
$$ 3750 -47749 -60928 -32171 -23348 -34238 -56556 -41690 -15673 30925 47860 22075 12602
20981A2602l2998n780L3473k227l989M2536j4404L0603k203p0091j5476J6767
$$ 12602 -20396 -26176 7297 5070 1081 43617 29213 59816 57613 -12478 -27954 -11187
20969a1187R370k7746M2446j8510l395N951J0985j237k170j1642M909l0322k1996
$$ -11187 -1817 -29563 12883 -5627 -9022 -3071 7914 6677 4507 -7135 -2226 -32548 -54544
20956e4544L2431o459L5490L4198pl2170j2779q688M1614K8246L5745k7663l9165
$$ -54544 -22113 -28572 6918 41116 41109 8939 -3840 -12528 29086 57332 93077 65414 26249
20943B6249K4197j4317K6121J8487l7490n7983l2268L0260j7155l3616K9878L1681
$$ 26249 50446 36129 62250 80737 43247 -14736 -47004 -16744 -33899 -67515 -37637 -5956
20931e956m9607J6485M1796N757N1218K684J1211k6668m2254l0760L546N5558
$$ -5956 -55563 -39078 2718 8475 59693 62377 73588 46920 4666 -26094 -22548 33010
20919C3010l8492k9516J355K9598J5677O016n9445O2251O0191l0601l9634P694
$$ 33010 -5482 -34998 -33643 -4045 11632 17648 -41797 20454 80645 50044 10410 18104
20907A8104J4786K1047M0908l1233n2090k2637J0113L1558j4239k2642n19K2254
$$ 18104 32890 53937 94845 63612 11522 -11115 -1002 30556 16317 -6325 -6844 15410
20895A5410l0494k7025M0542K9892L8834J6099j3751j1285k0250o5003q756K3897
$$ 15410 -15084 -42109 -1567 28325 67159 83258 69507 58222 37972 -27031 -35787 -11890
20883a1890L0990N0147M5042q896m4556k0934l3372K5478k029K149j4242l7621
$$ -11890 19100 69247 114289 105393 60837 39903 6531 32009 29980 32129 17887 -19734
20871a9734L8840K2926L567k8722m548q906k2960n161J0585j2163L4182L9387
$$ -19734 19106 42032 45599 16877 12329 3423 -19537 -24698 -14113 -26276 7906 47293
20859D7293L6641m0041n5402k9925J4258j0118K8883k4683l8982j5807j9192M66
$$ 47293 83934 43893 -11509 -41434 -27176 -37294 -8411 -33094 -72076 -87883 -107075 -106609
20847a06609L1041O9800K1058k0807J0591K0795q3285L872N8594K6163O928k2388
$$ -106609 -75568 -5768 15290 -5517 5074 25869 -57416 -53544 5050 31213 38141 15753
20835A5753n1722l1782N3359N8098J4289N208j456J3103m0482k9240k9872O828
$$ 15753 -35969 -67751 -14392 43706 57995 63203 61747 74850 34368 5128 -24744 -17916
20823a7916J3120P378j9777K022k0815m1042P572M3921K5167K4847J0701K3873
$$ -17916 -4796 2582 -17195 -15173 -35988 -77030 -69458 -25537 -370 24477 35178 59051
20811E9051l061l7150p1009j2784Q806J9569J3394J7409j9456k4097L7574L8963
$$ 59051 55990 18840 -52169 -64953 -56147 -36578 -23184 -5775 -25231 -49328 -11754 27209
20799B7209k9256J5218l92J2523q893j2964n823J6660q113k8043o2083K4852Q0101
$$ 27209 -2047 13171 12779 25302 16409 3445 -2378 14282 6169 -21874 -83957 -59105 20996
20786B0996j5350k3524K3826L1945j2512k85j143m096J8489J9280j0661O272n771
$$ 20996 5646 -17878 5948 37893 25381 25096 23953 19857 38346 57626 46965 53237 47466
20773D7466p0990j1167J860K1704r998J2634K0039K3566J1588j0749j99N658l7890
$$ 47466 -23524 -34691 -32831 -11127 -21125 -8491 11548 35114 46702 35953 35754 41412 3522
20760C522j2553R48l184p049J8832j2045J0433L8590m555j9758j4158R940O539
$$ 3522 -9031 -8083 -11267 -18316 516 -11529 -1096 37494 32939 13181 -977 8963 15502
20747A5502K2623K8352k6070j9497J6124K678J7205L34J2995N94q638o0931k2039
$$ 15502 38125 66477 40407 20910 37034 39712 56917 57251 70246 70840 62202 1271 -20768
20734b0768k1239J5476m744L7450J9538J1117j1693k2691L2026j8918n2068m0864
$$ -20768 -42007 -26531 -31275 6175 25713 36830 25137 2446 34472 15554 -36514 -77378
20722g7378M2491j735K0360L0687j630M984J8438k0659J3547J8755j5459L996
$$ -77378 -34887 -36622 -16262 14425 12795 17779 36217 15558 29105 47860 32401 36397
20710C6397N996l1316k214K3093p511J798p564M982j0805j6824k8995n6423O303
$$ 36397 42393 11077 8863 31956 24445 26243 18679 23661 12856 -3968 -32963 -89386 -83083
20697h3083M5285K5468J4314L121k040L0834K5781j3677K8167m822o114L916K3111
$$ -83083 -37798 -12330 1984 5105 3065 33899 59680 46003 74170 69348 63234 67150 90261
20684I0261j7357j2451J7309L1800j2048j1998K7296j9099o1099k832K640J7498
$$ 90261 72904 60453 77762 109562 97514 85516 112812 93713 32614 29782 32422 49920
20672D9920r35R344K4736l2684j9039k8094m4440m8691K6952L7099R180q42k1392
$$ 49920 48985 58329 83065 50381 31342 3248 -41192 -89883 -62931 -25832 -16652 -17494 -38886
20659c8886Q264L0908L4963n788Q880K7077L6664P278n3039l5101j6672K2159
$$ -38886 -30622 286 35249 29461 38341 65418 102082 109360 56321 21220 4548 26707
20647B6707J8359J4230J2881k6590j1377K7976J2036k0962k1383q910k8326l58
$$ 26707 45066 59296 72177 45587 34210 62186 74222 53260 31877 22967 -5359 -5717
20635e717o221K8197L5592K590j3648k441m934j8145m6681l644K7756k5572O088
$$ -5717 -11938 16259 51851 54441 40793 38352 33418 15273 -31408 -35052 -7296 -32868 -26780
20622b6780K5635N0807N47m370j7152Q457K4373j2986M031K3267J5034N285Q946
$$ -26780 -1145 49662 50209 45839 28687 37144 61517 48531 52562 75829 90863 96148 105094
20609A05094l2738J1813J1995r308o7813j963N0634n33l1011l0068J8630j1740
$$ 105094 72356 84169 96164 86856 19043 17080 67714 67181 36170 6102 24732 12992
20597A2992l5305P443J9452M570J4187K8757K1998m8723m7905J546O554K3045
$$ 12992 -22313 -14870 4582 9152 23339 52096 74094 25371 -22534 -20988 -14434 8611
20585H611L6510J0277k8534j2641L5161n533p893j4005j253j8o332K3439N195
$$ 8611 45121 55398 26864 14223 49384 43851 35958 21953 20700 20682 14350 37789 42984
20572D2984k6824J7673J5064l3263j7387k0509K9158o00L151M1748L0015k1653
$$ 42984 16160 33833 48897 15634 -1753 -22262 6896 6296 9447 51195 81210 59557
20560E9557j0475j6267l3548P32N8397J2090k7684p170K4663K457j2832R10O445
$$ 59557 49082 32815 -733 -1 58396 70486 42802 35632 60295 62752 49920 50830 57275
20547E7275K1612k6412k9655p760k0951p556K8307K1278P93l5405j5936K5707
$$ 57275 78887 52475 22820 15060 -5891 -13447 14860 36138 36931 1526 -14410 11297
20535A1297K1205j5779K3387K4506l1570k7366j034J3199q68J0981J4922j3535
$$ 11297 32502 16723 40110 64616 33046 5680 4646 17845 16977 27958 42880 29345
20523B9345J186J2153M97L653O66k3819m6485K218K1748o5704m4786O7062L2397
$$ 29345 30531 42684 43181 46834 47500 23681 -22804 -20586 1162 -64542 -109328 -42266 -9869
20510i869J9841L117l451J8645O415L6218k1780J700j4185q0088J8291L2155j452
$$ -9869 9972 13089 9638 28283 34698 70916 49136 50836 36651 -43437 -25146 7009 5557
20497E557l7806p839M9327J4114K6509n1899k4736K3106P441L2019J5519J6042
$$ 5557 -32249 -40088 9239 23353 49862 -2037 -26773 -3667 3774 35793 51312 67354
20485F7354p849J2700l9263l7214m195m4542p297N2159K6220L018m1537K0777
$$ 67354 59505 72205 32942 -4272 -8467 -53009 -60306 -8147 18073 21091 -20446 331
20473C31J5441k6788O8389M9547l1921m0680m8096q061L7196J5355R662J4870
$$ 331 15772 -11016 57373 106920 74999 34319 -13777 -21838 15358 30713 40375 55245
20461E5245k941j5189L8258l4430o83L6536j897j9168M49n802K958l0075L3710
$$ 55245 52304 37115 75373 40943 40260 76796 74899 55731 56180 50378 53336 23261 56971
20448E6971L0759n9736J9016K9015J3309m422J4126L6564k0446k7578l762K4417
$$ 56971 87730 27994 47010 76025 89334 84912 99038 135602 115156 87578 83816 108233
20436A08233J9462J1427m3070k1929J7813l0546K5187J8808k3628k1203j1977
$$ 108233 127695 139122 96052 74123 91936 61390 86577 105385 81757 60554 48577
20425D8577j8471R281J7754K9760J684j0810k1770l0264n164J8587J6800L3881
$$ 48577 30106 39387 57141 86901 88585 77775 56005 25741 20577 39164 55964 89845
20413H9845k271p831M2562j6460O226j56K301P060j9979o2726K0199p476N856
$$ 89845 87574 79743 122305 105845 112071 111915 114216 121276 101297 38571 58770 51294 57150
20400E7150K264O838M9754r976n0418j6827j9290J4971J951l458J4642K1190J8378
$$ 57150 59414 66252 116006 106030 55612 38785 19495 34466 36417 32959 47601 68791 87169
20387H7169J7370k7867k8986K3444K4151k5325n3881n2640J5712M2278K929J2922
$$ 87169 104539 76672 47686 71130 95281 69956 16075 -36565 -20853 21425 24354 37276
20375C7276J011j5425m0373j1337K6109k3608k054L917J3724M3568M2107Q68L893
$$ 37276 38287 22862 -17511 -28848 -2739 -26347 -28401 -24484 -10760 32808 74915 75783 79676
20362G9676r098m9751m8744N7587K5842M47J7473N906r643p09k1205m5088k444
$$ 79676 70578 20827 -27917 29670 55512 55959 73432 79338 69695 68986 47781 2693 249
20349B49J2470j6243j6156L1999L1399K3948m1226k417m342k6325l3121K8710
$$ 249 12719 -3524 -19680 12319 43718 67666 26440 24023 19681 -6644 -39765 -11055
20337a1055K8253K2837L6778N3210N172m6596r402K6840R769q774j7293j6783
$$ -11055 17198 40035 76813 130023 135195 88599 79197 106037 115806 107032 89739 72956
20325G2956q230Q333K7105n928L2321K2678J6200j4189L7942l900l859l3990k6599
$$ 72956 64726 73059 100164 94236 126557 149235 165435 151246 189188 185288 181429 147439 120840
20312A20840q3368J0127L1634O016K4448j464l1369p070P189k4639O70P672K1041
$$ 120840 37472 47599 79233 85249 109697 108233 76864 69794 76983 52344 53014 60686 81727
20299H1727J1000k521q147j7763k1684J7149l6031J5228K2083J711J4757o0839
$$ 81727 92727 90206 82059 64296 42612 59761 23730 38958 61041 62752 77509 16670
20287A6670j7163L6303K2994K7515L0926m866k3693M026k6697l408K9779K5497
$$ 16670 -493 35810 58804 86319 117245 112379 88686 92712 66015 62607 92386 117883
20275A17883M7471q709J1753j7890J1241j630n461k9113K337M1514L2598k4610
$$ 117883 165354 156645 168398 150508 161749 160119 154658 125545 127882 169396 201994 177384
20263A77384j2364l8474l9349j3953j2547j1183K6475J9043p23j2075m54j8356
$$ 177384 165020 126546 87197 73244 60697 49514 75989 95032 94309 82234 81780 63424
20251F3424k0118L1302k2374q930J9722J3388p663J3185N0514l698k492q815J6331
$$ 63424 43306 74608 52234 43304 63026 76414 68751 81936 132450 128752 126260 117445 133776
20238A33776J2669l6000j8847K9646j6038l6107j553L2013p501k8281J0606J4292
$$ 133776 146445 110445 91598 121244 105206 69099 67546 99559 92058 63777 74383 88675
20226H8675M9838j9649m4135K5408L5119m0906r937M8009k4756K1507J8408o9115
$$ 88675 138513 118864 74729 100137 135256 94350 84413 132422 107666 129173 147581 78466
20214G8466m8179J3497M6903J9719L182J0801N735O160Q127Q741l4220j0646j6023
$$ 78466 30287 43784 90687 110406 113588 124389 130124 136284 144411 153152 118932 108286 92263
20201I2263l7112l2569L996P710L8742l9348K0162J1678P473L0784M679k9445
$$ 92263 55151 22582 26578 34288 73030 33682 53844 65522 72995 103779 108458 79013
20189G9013j870k0643L861L4860O835p946J2105J8725q222O19K3657K619k6585
$$ 79013 77143 56500 60361 95221 102056 94110 106215 124940 116718 117337 140994 143613 117028
20176A17028l4116L447L0169P968j4233J2164L0343k4586K541M3445O1634N0105
$$ 117028 82912 86359 116528 124496 110263 122427 152770 128184 130725 174170 235804 285909
20164B85909O0727O3837J55624K44576K64061Q5009p2098j97320k17288j88079
$$ 285909 346636 410473 566097 810673 1074734 1159743 1087645 890325 673037 484958
20154D84958j13224n8514k0084j8599O698m2014n835M1493L8922Q620J30724J73335
$$ 484958 371734 313220 293136 274537 281235 239221 233386 274879 313801 322421 453145 626480
20142F26480K60860K44987J50371o7452k21982k53976j88493o5780q4535r1616
$$ 626480 887340 1132327 1282698 1215246 993264 739288 550795 485015 400480 308864
20132C08864k4575r663K9241j1142l8509j6071j6404n0199j9532j1921n4191k9882
$$ 308864 284289 274626 303867 292725 254216 238145 221741 171542 152010 140089 85898 56016
20120E6016N924m5963n3611P3874O3891J6155L097N2924o734L718n86k6371l3478
$$ 56016 61940 15977 -37634 36240 100131 116286 119383 172307 165573 169291 168705 142334 108856
20107A08856J1691K7185J0433m6805p6875K2052K5167k4086J145L8110K7969m1409
$$ 108856 120547 147732 158165 111360 34485 56537 81704 57618 58763 96873 124842 83433
20095H3433J5105K2440m999K5402M715l3400j1986J9612M1303j5081k409J0255
$$ 83433 98538 120978 115979 141381 146096 112696 100710 120322 161625 146544 144135 154390
20083A54390J5294K7403j2995l6166m3862k7519N238M6786P066N236j7415R674
$$ 154390 169684 197087 184092 147926 104064 76545 81783 128569 135635 140871 123456 133130
20071A33130l2014j7414O261m838L5701J2653P797K0770k4220n888l9051J6947
$$ 133130 101116 83702 89963 85125 120826 133479 141276 162046 137826 131938 92887 109834
20059A09834P786J0009l0318q577n713P644K3372l2563K8320M7625M3226o960
$$ 109834 117620 127629 97311 88734 83021 90665 114037 81474 109794 157419 200645 193685
20047A93685j4502J2237O122R27l9756k1918l7587k6321M302K6372K2707O562
$$ 193685 179183 191420 197542 198469 158713 136795 99208 72887 77189 103561 126268 132830
20035A32830j892o085J4088k310k5107J9307l6133J6023K0424K0405j9908j3876
$$ 132830 130938 124853 138941 136631 111524 130831 94698 110721 131145 151550 131642 117766
20023A17766j8975r45p187m872L8348N0121Q617P415m7059l9356K5554M647j4307
$$ 117766 98791 97846 90659 85787 124135 174256 182873 190288 143229 103873 129427 134074 119767
20010A19767k0561L6318O083L852K1122l985k1413Q784q939J2328L3611k8638
$$ 119767 99206 135524 141607 145459 166581 162596 141183 149967 141028 153356 186967 158329
19998A58329m8246l6685j3615K0631J0862O447K0325J9878m2365l2979k836K2964
$$ 158329 110083 73398 59783 80414 91276 97723 118048 137926 95561 62582 59746 82710
19986H2710k3616L2910M2611J7436k2560k073K9859J9207J0136k5060m9380q845
$$ 82710 59094 92004 134615 152051 129491 127418 157277 176484 186620 161560 112180 103335
19974A03335N3686K5683p4966J022m1024J5885Q1056K0843j5162j7426k334R14
$$ 103335 157021 182704 107738 108760 67736 83621 164677 185520 170358 152932 150598 151512
19962A51512J1799l678j4031l5005k852K2074l9930K7201M299l990n801J2092
$$ 151512 163311 159633 145602 110597 107745 129819 89889 117090 121389 117399 111598 123690
19950A23690K98j2181K9387R624q675j0355k4504l2547J8861n51n1298K894N942
$$ 123690 123988 111807 141194 150818 142143 131788 107284 74737 93598 93047 41749 44643 50585
19937E0585L6846J7203p267r906n750L0109r638l5835P444K5614M942Q459J2754
$$ 50585 87431 104634 97367 87461 81711 111820 102182 66347 73791 99405 104347 112806 125560
19924A25560k2821K4750O5214J5419j2848m3714j9305L5766j2707k9169J5184
$$ 125560 102739 127489 192703 208122 195274 151560 132255 168021 155314 126145 141329
19913A41329K0720J8320m4519k8455Q542L2338L6736p655l9176m5721j7285m568
$$ 141329 162049 180369 135850 107395 115937 148275 185011 177356 138180 92459 75174 70606
19901G0606P947k3008K2112L9805K7269k643l5933k0868J2183k02j2670m273K3065
$$ 70606 78553 55545 77657 117462 144731 142088 106155 85287 97470 97268 84598 80325 103390
19888A03390J0850J1506J5029O727n320M4128n032p714m88L1157l681J9350K3627
$$ 103390 114240 125746 140775 147502 142182 186310 181278 173564 173076 204233 200552 219902 243529
19875B43529l7568k4073l1116K0259K1714L0154K3817p1420j2987L6646J8576
$$ 243529 205961 181888 150772 171031 192745 222899 246716 175296 162309 198955 217531
19864B17531p8r345k9401l5639k0042R209K2710J0479R505O406o022r195j782
$$ 217531 217453 208108 178707 143068 123026 132235 154945 165424 174929 181335 175313 166118 164336
19851A64336K8464l776K3746J3837j2419l291l1511j2665p703l4481l8269j125
$$ 164336 192800 189024 212770 226607 214188 210897 179386 166721 159018 124537 86268 85143
19839H5143L5440L3714o62j2449P400K1964N450j8738J1706J072j2206M480j849
$$ 85143 120583 154297 153635 141186 148586 170550 176000 157262 168968 170040 157834 162314 160465
19826A60465L4989q609q18J3936l844n482j1880l5771O582j2411K8415O34L4450
$$ 160465 195454 186845 186027 199963 196119 190637 178757 142986 149568 137157 165572 166206 200656
19813B00656M394p583k5061k9073j9209J2075K4192M4479M6730K1278j2978l4892
$$ 200656 205050 197467 172406 143333 124124 136199 160391 204870 251600 272878 259900 225008
19801B25008l0312M3248M3292k6372n9422l687L2312J489j3956N1034j7786m4278
$$ 225008 194696 237944 281236 254864 195442 191755 224067 225556 211600 262634 244848 200570
19789B00570J7914l5787k2227Q674J0969l1934l9149M98J7106L1025j5417m962
$$ 200570 218484 182697 160470 169144 180113 148179 109030 109528 126634 157659 142242 137280
19777A37280P706l466N6830K7240l150J7556J596r908k8276K945K9618j168k8221
$$ 137280 144986 141520 198350 225590 222440 239996 241592 231684 203408 206353 235971 234803 206582
19764B06582k3927j9877k290O13j3788J5108o532m5696j3133K8031Q7005K8799
$$ 206582 182655 162778 160488 161101 147313 162421 155889 110193 97060 125091 212096 240895
19752B40895J7084o904L6050R306j8664m0693K1028J8668J549L0460J9721q686
$$ 240895 257979 251075 287125 296431 277767 237074 258102 276770 278319 308779 328500 319814
19740C19814m6942k7228k6798l7333o876L4838m07k440K6491M0204k2110l7636
$$ 319814 272872 245644 218846 181513 174637 209475 209068 206628 233119 273323 251213 213577
19728B13577j4828O506m471N776L4578N7035j3477p666j3502l3325o452L0327
$$ 213577 198749 205255 200784 206560 241138 298173 284696 277030 263528 230203 223751 254078
19716B54078K295j1504q389K610j1253K4589L7259O0748O4830l2096M2367N2450
$$ 254078 256373 244869 236480 239090 227837 252426 289685 350433 415263 383167 425534 477984
19704D77984N7559J35028K49826M53647K93349j74017l48714k69788j15972n0483
$$ 477984 535543 670571 920397 1374044 1667393 1493376 1144662 874874 758902 708419
19694G08419q327j8694l4526J1508O1208M8616K9417R6787J85385K32483K25310
$$ 708419 700092 681398 646872 658380 719588 768204 797621 894408 1079793 1312276 1537586
19683A537586L91570P42748N09114j88021m21557k02736L7597J10465J92033K86393
$$ 1537586 1929156 2671904 3181018 2992997 2571440 2368704 2406301 2516766 2708799 2995192
19673B995192M03121N09489N16277M46563L33501K07581M7474j12643k22246l62126
$$ 2995192 3398313 3907802 4424079 4870642 5204143 5411724 5459198 5346555 5124309 4762183
19663D762183m45477m63031m09321k70408k14242j71174o8240n147N8895R3832
$$ 4762183 4316706 3853675 3444354 3173946 2959704 2788530 2720290 2715143 2774038 2867870
19653B867870K22152L23241M26609N29663N05110M19094L31809J29987K0511r0201
$$ 2867870 3090022 3413263 3839872 4369535 4874645 5293739 5625548 5755535 5776046 5685845
19643E685845k81796m47253n76346n77661n27958m68801l82528l60394k74073
$$ 5685845 5404049 4956796 4380450 3802789 3274831 2806030 2423502 2063108 1789035
19634A789035j87479j30082j08075r4253r8132j5790j0896n2362m169M1318L0519
$$ 1789035 1601556 1471474 1363399 1269146 1171014 1155224 1144328 1091966 1087797 1129115 1159634
19623A159634Q41j0464k3786n5109m6533q127K2175J1152J3200N3144L9911M4979
$$ 1159634 1160475 1150011 1126225 1071116 1024583 1016456 1038631 1049783 1062983 1116127 1156038 1201017
19611A201017P8748J03138J98062L57418M49398M81251L54813Q2637k20866m33365
$$ 1201017 1279765 1382903 1580965 1938383 2387781 2869032 3223845 3306482 3085616 2652251
19601B652251l73799k59972j87177q5119l7399j0003O1605Q4863Q6036J25765
$$ 2652251 2278452 2018480 1831303 1746184 1708785 1698782 1760387 1845250 1931286 2057051
19591B057051K93041M26574K99009K85399L82769L52767J83233r1271k55909k01256
$$ 2057051 2350092 2776666 3075675 3361074 3743843 4096610 4279843 4188572 3932663 3731407
19581C731407r3712K3209J41865K68023L52499M05849M31980M45625N83344P81843
$$ 3731407 3637695 3660904 3802769 4070792 4423291 4829140 5261120 5706745 6290089 7071932
19571G071932J013421J071143J089973J355990J858597K498846L290560M497770
$$ 7071932 8085353 9156496 10246469 11602459 13461056 15959902 19250462 23748232
19563B3748232O395287R332626J4042464K1848423L3738885M6474358M3276580
$$ 23748232 30143519 39476145 53518609 75367032 109105917 155580275 198856855
19556A98856855Q990957l0237474m3878871l6524999k4692235j5727245r994242
$$ 198856855 207847812 177610338 133731467 97206468 72514233 56786988 46792746
19549D6792746o359321l745887j620568K85499K357923M888572Q509938J3949580
$$ 46792746 40433425 36687538 35066970 35352469 37710392 42598964 51108902 65058482
19541F5058482K2584548L5493007M9093478M5089651P654838l4488022m8840800
$$ 65058482 87643030 123136037 172229515 217319166 224974004 190485982 141645182
19534A41645182m0684268k7897867j8336249j2313119q737275o488049m829213
$$ 141645182 100960914 73063047 54726798 42413679 33676404 27188355 22359142
19527B2359142l536089k693046k108743j702779j323498r69789q80616r81000
$$ 22359142 18823053 16130007 14021264 12318485 10994987 10025198 9144582 8163582
19519H163582q38015o29025n14916l93281l50554l05281k61072j49010l2359Q0787
$$ 8163582 7325567 6696542 6181626 5788345 5437791 5132510 4871438 4722428 4690069 4770856
19509D770856M5675r3621k12714j48160M5962J35180N6458k46582n55155n61944
$$ 4770856 4816531 4722910 4510196 4362036 4407998 4543178 4599636 4353054 3797899 3235955
19499C235955l13196j45774j29045j45537j04539j030Q4546J87136K72585J97966
$$ 3235955 2922759 2776985 2647940 2502403 2397864 2396834 2481380 2668516 2941101 3139067
19489C139067K7274j55207j20943K0382J6053r7936k65268l63770l11839k20168
$$ 3139067 3166341 3011134 2890191 2910573 2926626 2828690 2563422 2199652 1887813 1667645
19479A667645j40331p0019q1429j05929j2791k2196j8358k5737m2642l8261J8418
$$ 1667645 1527314 1457295 1375866 1269937 1257146 1234950 1216592 1190855 1148213 1109952 1128370
19468A128370k1214l6878n4321l3575m1352k4820m6178k8524R867k8980l1744
$$ 1128370 1107156 1070278 1015957 982382 941030 916210 870032 841508 851375 822395 790651
19457G90651m2829j4885j54k5189L843J6834j414j3223J0435p008l8250k7838
$$ 790651 747822 732937 732783 707594 711437 728271 726857 713634 724069 717061 678811 650973
19445F50973k6320j6231J3520j7059k5490P37m4620R582J3764l368j5565q381
$$ 650973 624653 608422 621942 604883 579393 580130 535510 545092 558856 555488 539923 531542
19433E31542L878R410L4924j9556m015M5688M6441K5231K0057N112L394l2702
$$ 531542 535420 544830 579754 560198 556183 601871 648312 673543 693600 698712 702106 669404
19421F69404n9070k9401k6028l7009r485M333L5056P642L5443K048O012l674j6216
$$ 669404 610334 580933 554905 517896 508411 512744 547800 555442 590885 592933 598945 595271 579055
19408E79055j0056N907K1509K3664Q787N128l5563l5897m0491j7102m4387J3925
$$ 579055 568999 574906 596415 620079 628866 633994 598431 562534 522043 504941 460554 474479
19396D74479N9283o705J064q713O837K6048L0182m6651q6119l7603M4997K3191
$$ 474479 533762 527057 528121 519408 526245 552293 582475 535824 449705 412102 457099 480290
19384D80290m4168L86M7754L750j7758L166n7683k3981K8844K1442p3724n7281
$$ 480290 436122 436508 484262 488012 470254 473420 415737 391756 420600 442042 368318 311037
19372C11037q547P648J112j2597J2214n933J2033K2487J2971K6869J5016k2701
$$ 311037 302490 310138 311250 298653 310867 304934 316967 339454 352425 379294 394310 371609
19360C71609k6843L7365N9487O8289k6664o7060l6815m1725j8210k6768m0256
$$ 371609 344766 382131 441618 509907 483243 416183 379368 337643 319433 292665 252409
19349B52409L0783j3944n5041n0064L5330R2878M2860k4900n127L6701N4674M0030
$$ 252409 283192 269248 214207 164143 199473 292351 335211 310311 305184 341885 396559 436589
19337D36589m7108j6460n6947n4936j2417K9803q700m1470M0878K1567l6044o0857
$$ 436589 389481 373021 316074 261138 248721 278524 269824 228354 269232 290799 254755 193898
19325A93898m5288J5521N9486N8675M2586j9166l769J2008J4779j4381L4879r450
$$ 193898 148610 164131 223617 282292 324878 305712 301943 313951 328730 314349 349228 339778
19313C39778M8796O4084K5668r228l3093q0690j0177N689l8782l5834k2863q920
$$ 339778 388574 452658 478326 469098 436005 355315 345138 350827 312045 276211 253348 244428
19301B44428m0814M5005Q4057R7660L8647j7821j9228M8107R7430N1292L2265
$$ 244428 203614 248619 332676 430336 468983 451162 431934 480041 577471 628763 661028
19290F61028o7867p9203o2331k1733k6601m7260r4072p7380n42K4288l294K7368
$$ 661028 593161 513958 451627 429894 403293 356033 261961 184581 184039 208327 205033 232401
19278B32401K7946K6873K4479j629M6195K7464k7180m3971P396N9508K3272m5823
$$ 232401 260347 287220 311699 310070 356265 383729 356549 312578 319974 379482 402754 356931
19266C56931k3460o4380l7771m1905K6529j5545o651k210k2091k9158k7169O15
$$ 356931 333471 269091 231320 189415 215944 200399 193748 191538 169447 140289 113120 113735
19254A13735Q9201M8035j8074k3671J0426o6462J806N0655R903n8254p7900r922
$$ 113735 202936 250971 232897 209226 219652 153190 154996 205651 215554 157300 79400 69478
19242F9478J03968N9829K6782P112L9971k5560l0118K7680J7221j4595K1065J8846
$$ 69478 173446 233275 260057 267169 307140 281580 251462 279142 296363 281768 302833 321679
19230C21679j6939m3599J5058J49o3881j9407K5874R7245P6483L6852r523n680
$$ 321679 304740 261141 276199 276348 212467 193060 218934 316179 392662 429514 419991 414311
19218D14311l6494l0520n7531n0379k9645r32L7983K7955J6308M7792M0705r794
$$ 414311 377817 347297 289766 239387 209742 208810 246793 274748 291056 338848 379553 369759
19206C69759l7018l8371l0477K267k6311M031J3859J0168K4947K5331K0045J9803
$$ 369759 332741 294370 263893 266160 239849 243880 257739 267907 292854 318185 338230 358033
19194C58033J4497J3196O43m4379r6064q006N7274p967l0488p2734m0311K5341
$$ 358033 372530 385726 386369 341990 245926 237920 295194 287227 256739 184005 143694 169035
19182A69035K7408J8736L509J7693K8922o39n868K6738K0204L0590J4761J173
$$ 169035 196443 215179 218688 236381 265303 264664 258796 285534 305738 336328 351089 352262
19170C52262j8130K2010J4881K0461Q466j6493k5638J1954L258j6676P664J931
$$ 352262 334132 356142 371023 391484 399950 383457 357819 369773 373031 356355 364019 365950
19158C65950M4715K2132j0812P74K6658K6270o059L6495m584j0255L0162K9221
$$ 365950 410665 432797 421985 422759 449417 475687 469628 506123 501539 491284 521446 550667
19146E50667M0797R0199J55010J52906J11084J05316L7743o7292j22476n9381
$$ 550667 591464 681663 836673 989579 1100663 1205979 1243722 1176430 1053954 994573
19136I94573l7635k0233J32133J23495J61596J21115J16444M5912J17930K88759
$$ 994573 956938 936705 1068838 1192333 1353929 1475044 1591488 1637400 1755330 2044089
19126B044089M98994Q20764Q01623J99383k5408K04331N52868O25152J43859k26374
$$ 2044089 2543083 3363847 4165470 4364853 4339445 4543776 5096644 5721796 5865655 5639281
19116E639281q685K96146N29647Q69045J287092J765892K216522L039865M602478
$$ 5639281 5630596 5926742 6456389 7325434 8612526 10378418 12594940 15634805 20237283
19107B0237283P331871J1648868J8685668L3748970P0027164J20724098O3073798
$$ 20237283 27569154 39218022 57903690 91652660 161679824 282403922 345477720
19100C45477720o9191398j04574465o8725093l4265051j8345809j1066831p282153
$$ 345477720 276286322 171711857 102986764 68721713 50375904 39309073 32026920
19093C2026920m724500k593755q75419O69769K543372N211692R164983J5995022
$$ 32026920 27302420 24708665 23833246 24503015 27046387 32258079 41423062 57418084
19085E7418084L0838894O4702287J11009751N6171969o6535772r7622646o3030896
$$ 57418084 88256978 152959265 263969016 320140985 253605213 155982567 92951671
19078I2951671l1000622j7236788j1306581p969880n691193m042774k827186j951349
$$ 92951671 61951049 44714261 33407680 25437800 19746607 15703833 12876647 10925298
19070A0925298j518687j179483r34605p36612m82676k71762k8968K56141j7562
$$ 10925298 9406611 8227128 7292523 6555911 6073235 5801473 5772505 6028646 6011084
19061F011084m68608k75248L9901l79285p50113o73399n02122l17075k47648j51543
$$ 6011084 5542476 5267228 5307129 4927844 4177731 3504332 3002210 2685135 2437487 2285944
19051B285944j49097q4589n1903r8093p7799j18473q8617o0703o6188l8540n7662
$$ 2285944 2136847 2052258 2000355 1902262 1824463 1705990 1617373 1556670 1490482 1451942 1394280
19040A394280m5502j1628K9149N2359J6756Q448R333k7505j2497L1692k3256l6263
$$ 1394280 1348778 1337150 1366299 1418658 1435414 1443862 1453195 1425690 1413193 1444885 1421629 1385366
19028A385366M4373N3389N0202R6535J23701J21070J16760J54923L03302L86505
$$ 1385366 1429739 1483128 1533330 1629865 1753566 1874636 1991396 2146319 2449621 2836126
19018B836126M76629M80315N19778L48973K9639k18732k67752k17082j95510j85208
$$ 2836126 3312755 3793070 4312848 4661821 4691460 4472728 4204976 3987894 3792384 3607176
19008C607176j28131J0655J55207K30060L07863L68381L24201J52121j8477j64018
$$ 3607176 3479045 3489700 3644907 3874967 4182830 4551211 4875412 5027533 5009056 4845038
18998D845038k10726m0648L8011J24973J47693O3960r3299k67932l91591l79028
$$ 4845038 4634312 4593664 4631675 4756648 4904341 4968301 4875002 4607070 4215479 3836451
18988C836451l57575k04175j33758j01961j2426J47119K38411K25197J68905K1880
$$ 3836451 3478876 3274701 3140943 3038982 3026556 3173675 3412086 3637283 3806188 3828068
18978C828068j92207l68386m19997m30224l57364k68550k10795j62152j04147
$$ 3828068 3635861 3267475 2847478 2417254 2059890 1791340 1580545 1418393 1314246
18969A314246j01740r8670r3497m1254p8319j25183o8132m9034m8197J3869O0380
$$ 1314246 1212506 1113836 1020339 979085 900766 775583 707451 658417 610220 624089 684469
18958F84469q393n614l073j325M3350P3771R3429J01288N7306J13062K06026K55761
$$ 684469 676076 670462 667389 666064 709414 783185 876614 977902 1035208 1148270 1354296 1610057
18946A610057K12142q498k51025l25676k52401j02457N003j6284q7577q8925n9750
$$ 1610057 1822199 1813701 1562676 1237000 984599 882142 887145 870861 783284 694359 634609
18935F34609l6981K5266M0463J6363L2229J30977K19081K11934J45523l4562j98450
$$ 634609 597628 622894 663357 679720 711949 842926 1062007 1273941 1419464 1384902 1186452
18924A186452k11344j39877j13040q2168p0608l6457l6932o2809m1003k6337o6111
$$ 1186452 975108 835231 722191 640023 569415 532958 496026 433217 392214 365877 299766
18913B99766n7518m258j9218K74K2317K0967n1026L926O3415Q3981M8517N5526
$$ 299766 242248 237990 218772 219046 241363 262330 211304 215230 278645 362626 411143 466669
18901D66669O338o5314j03827l7820m8443m8415k8580M0761K6632n2980j266m090
$$ 466669 473007 407693 303866 266046 217603 169188 140608 181369 208001 155021 153755 149665
18889A49665K1254M2870k6724J7667L7971M9168N0997j1415l2591K6838p1300
$$ 149665 170919 213789 187065 204732 242703 291871 342868 331453 298862 325700 254400
18878B54400n2548O429N473L5489L4522L4681j5093n1786K9907K1701l0075k156
$$ 254400 201852 208281 213754 249243 283765 318446 303353 251567 281474 303175 273100 270944
18866B70944n2861k9049M0529L4874P639j1732J2403N973k1830l180k8017k418
$$ 270944 218083 189034 229563 264437 272076 260344 272747 278720 256890 253710 225693 223275
18854B23275k2474k874M316j8475m22K2324k8467R490j736l4772K8266Q255k1842
$$ 223275 200801 197927 202243 183768 183346 205670 177203 186693 184957 150185 178451 186706 164864
18841A64864R392L4531Q77J0225N3840j0444k0045K4904K2616q085L6312j1777
$$ 164864 174256 208787 209664 219889 273729 263285 243240 268144 290760 282675 318987 307210
18829C07210L1716O591J5603O8971L3053K210o1157m7839l5187n158n5389l7355
$$ 307210 338926 345517 361120 430091 463144 465354 404197 356358 321171 316013 260624 223269
18817B23269K0893K3049j9115K9758L9340l973j8429K6439J8882J6370J1268N0102
$$ 223269 244162 267211 248096 277854 317194 313221 294792 321231 340113 356483 367751 417853
18805D17853o649k6717n1064k9544k8646k4927o2073m210L1150j7459l5182l9127
$$ 417853 411204 384487 333423 303879 275233 250306 188233 184023 215173 197714 162532 123405
18793A23405q4644K2355K5623J6444K6318K2895J8279k0320p544j7965K254k1439
$$ 123405 38761 61116 86739 103183 129501 152396 170675 150355 142811 124846 127100 105661
18781A05661K5414N0944j1150J1915J5748m4886j00877n8465p975O5602Q1123
$$ 105661 131075 182019 170869 182784 198532 153646 52769 -5696 -13671 51931 133054
18770A33054R7792P0262Q4517J54503R2616n3660j25283q6160q1739o1184o297
$$ 133054 230846 301108 385625 540128 632744 579084 453801 367641 285902 224718 218421
18759B18421j7669k7071n0509l1499J3569L2472J2123J7862j8143J280J3809N734
$$ 218421 200752 173681 123172 91673 105242 137714 149837 167699 149556 150836 164645 170379
18747A70379J416l0138n038J172O158L749l4914j9353j157J7640J7235m255k466
$$ 170379 171795 141657 136619 137791 143949 147698 112784 93431 92274 109914 127149 122894 120428
18734A20428K392K4358l8216p1703N207N0772J5172j4708M6987J6373J4491l1170
$$ 120428 122820 147178 108962 37259 42466 93238 108410 93702 140689 157062 171553 140383
18722A40383n4200J7863J9614K8786J709k9283j5269K514L709R607n275O01O447
$$ 140383 86183 104046 123660 152446 154155 124872 109603 112117 115826 125433 120158 120759 127206
18709A27206J7189k0648m5645j2455L0190m4339J8239M660L6214L4683m553j031
$$ 127206 144395 123747 78102 65647 95837 51498 69737 74397 110611 145294 140741 139710
18697A39710j1871o0935k4804k772L0021r435K2290J6401j771J2520q39K185k897
$$ 139710 127839 66904 42100 39328 69349 59914 82204 98605 96834 109354 108515 110700 107803
18684A07803l3620j4339M0628J8703m857R428j301n678K7639N576l8494n3118
$$ 107803 74183 59844 100472 119175 114318 123746 122445 116767 144406 149982 111488 58370
18672E8370J8609J9468K2930L003L621M1371R519l8752J0578M294j1501j499j062
$$ 58370 76979 96447 119377 122380 126001 167372 176891 138139 148717 153011 141510 140011 138949
18659A38949m913j3134M3974k7754m3917P592J1972K3416m2994k412K2255K5957
$$ 138949 134036 120902 164876 137122 93205 100797 112769 136185 93191 90779 113034 138991
18647A38991O1974P1522p416l9918o0496o3139q6417p1525M7812J1823j3902J6477
$$ 138991 200965 272487 265071 225153 164657 101518 15101 -56424 -8612 3211 -10691 5786
18635E786L7373K8142L9999j4953j8597L5262J5751q10L8520j0022j0476k7752
$$ 5786 43159 71301 111300 96347 77750 113012 128763 127953 166473 156451 145975 118223
18623A18223p0300k4234K3071L7914k455k2973j966J3401L776J3600K9565p59
$$ 118223 47923 23689 46760 84674 82219 59246 57280 70681 74457 88057 117622 116863
18611A16863P25p326j8293J0831n837J114R647K0132L7062K3737n8812l1262M238
$$ 116863 117588 110262 91969 102800 96963 98077 107724 127856 164918 188655 129843 98581 102819
18598A02819j5076o707l1192Q191K9615J3870q822q594k2446L0692K3600K1287
$$ 102819 87743 81036 49844 58035 87650 101520 92698 84104 61658 92350 115950 137237
18586A37237k6235n4522p419k8488k885K6580K1539J9410M2521R310k1872L4418
$$ 137237 111002 56480 49061 20573 17688 44268 65807 85217 127738 137048 115176 149594
18574A49594K0218K680Q834L6574J453L2440p714K7058m031O2218O2532Q1024
$$ 149594 169812 172492 181326 217900 219353 251793 244079 271137 267106 329324 391856 472880
18562D72880Q7694M9250J23571K19828K32368L11836N49715Q77460J222249J343671
$$ 472880 560574 609824 733395 953223 1185591 1497427 2047142 2924602 4146851 5490522
18552E490522O75489n76927j275098j209201q89875n39513l02720l01163k23071
$$ 5490522 6166011 5589084 4313986 3104785 2214910 1675397 1372677 1071514 848443
18543H48443j24292q9819j09700q2982p8061o5005J6500l3065m7550j8507p033
$$ 848443 724151 634332 524632 441650 363589 298584 315084 282019 234469 215962 208929
18532B08929j9841K7333j3578K4301j8549l8871m6940P649J0313L065L8548K7485
$$ 208929 189088 216421 202843 227144 208595 169724 122784 130433 140746 143811 182359 209844
18520B09844n0871k9681o162j2013j0199Q327O591M938L6087L7691J0606J6959
$$ 209844 158973 129292 123130 111117 100918 109245 115836 120774 156861 194552 205158 222117
18508B22117j7933j2667r141J3790L6291j3020n897Q0719O1548J16977J92468
$$ 222117 204184 191517 182376 196166 232457 219437 213540 294259 355807 472784 665252
18497F65252L97049O30022K37653l51292m90206l16224j85377j27118j33733m1753
$$ 665252 1062301 1692323 1929976 1578684 1088478 772254 586877 459759 326026 284273
18487B84273k6712m8717K45J9732L3364L8893O7167O3348J65284L51073N61745
$$ 284273 257561 208844 209089 228821 262185 301078 368245 431593 596877 947950 1509695
18476A509695K66431l30381n06984l21897j53945p8384p1304j08700n6720q920
$$ 1509695 1776126 1445745 938761 616864 462919 384535 313231 204531 147811 138891
18466A38891J1071J4096j2523n3453l2045L417j1586J4884L5651q037M6076R479
$$ 138891 149962 164058 151535 98082 66037 69454 57868 72752 108403 100366 146442 155921
18454A55921m749N4189N5485N5455Q3955J34606J37989N5308r1406j85432j13109
$$ 155921 151172 205361 260846 316301 400256 534862 672851 728159 636753 451321 338212
18443C38212r4445j9853k1927k3627M487K6410J3594J261l8610M091L5782M804
$$ 338212 243767 223914 201987 178360 182847 209257 222851 224112 185502 189593 225375 230179
18431B30179N5310O9319P0620R3702J11460Q073r7132j29703p7656l0279l4426
$$ 230179 285489 354808 425428 519130 630590 638663 541531 411828 334172 303893 269467
18420B69467q2008o3655J3666q414l2745k660k1528M6o311J29k80J947M4891K7040
$$ 269467 187459 123804 137470 129056 96311 93651 72123 72169 65858 65987 65707 67654 112545 139585
18406A39585p4958j5972j5822j281K3579J0801N28l7013j4033J5447L1816L0809
$$ 139585 64627 48655 32833 31552 55131 65932 66460 29447 15414 30861 62677 93486
18394I3486J9824r269J3251j6707j2135k9474l567j5207j8059K2116J3087K2962
$$ 93486 113310 104041 117292 100585 88450 58976 55409 40202 22143 44259 57346 80308
18382H0308K6780j2274k3267Q511K5904K9891k7167j4003L0012L3121j2239L0235
$$ 80308 107088 94814 71547 80058 105962 135853 108686 94683 124695 157816 145577 175812
18370A75812J794j2844j3299J4008k0345m1148k6585o776J4201K1583L8494m6509
$$ 175812 177606 164762 151463 165471 145126 103978 77393 70617 84818 106401 144895 98386
18358I8386k8638n41j9188k546M1455N431j0593p092j6843P523n968J1214K4724
$$ 98386 69748 69207 50019 47473 88928 94359 83766 76674 59831 67354 61386 72600 97324
18345I7324j2642l450K9697k2152o9662j4131l281k089m2420j2531J8604L0480
$$ 97324 84682 81232 110929 88777 19115 4984 1703 -386 -42806 -55337 -36733 -6253
18333f253K0398J0465Q520K5743K2541l6209J2612J9216l2475k8751R612k3214
$$ -6253 14145 24610 33130 58873 81414 45205 57817 77033 44558 15807 25419 2205
18321B205k5911n188P306j0809L1253N4856j5982K049O448r447K0901J8307k187
$$ 2205 -23706 -28894 -21588 -32397 -1144 53712 37730 39779 46227 36780 57681 75988 73801
18308G3801l1466j973M6695J7733K7289J2412l0488k6380Q705J068J9618J4350
$$ 73801 42335 40362 87057 104790 132079 144491 114003 87623 96328 97396 117014 131364
18296A31364K4792J7162o5717p1101j4960K6372j1250l9812o885M6655j696l5717
$$ 131364 156156 173318 107601 36500 21540 47912 36662 -3150 -10035 36620 34924 -793
18284g93q957K7104l1637n9710l8408o762P1016J01896M704m0287j3581j2450
$$ -793 -9750 17354 -14283 -73993 -112401 -119163 -48147 53749 58453 18166 4585 -7865
18272g865l3267j3461l173j4622J8674K5925M9775K4894K8838l1248j0747l9788
$$ -7865 -41132 -54593 -57766 -72388 -53714 -27789 21986 46880 75718 44470 33723 -6065
18260f065K6241J4363n46K1322J0455k804J4911k8187m6447l5326J5504r304M7633
$$ -6065 20176 34539 33993 55315 65770 62966 77877 49690 3243 -32083 -16579 -25883 21750
18247B1750L6748R4267K0410m4717j8878n95j3221j9148l5265R768K2423J6520
$$ 21750 58498 152765 173175 128458 109580 108985 95764 76616 41351 51119 73542 90062
18235I0062L3105K1856J674j145K0949j4520l8398k1394o3219k1124N809M6787
$$ 90062 123167 145023 146697 145552 166501 151981 113583 92189 28970 7846 13655 60442
18223F0442P9514M2953K139m4046j9423K3901J6921l2794j203j4667n3260q597
$$ 60442 139956 182909 185048 141002 121579 145480 162401 129607 128404 113737 60477 51880
18211E1880L2139K666k8227k8346O373K4316l7410p37K8017M030K3509l94O507
$$ 51880 84019 86685 58458 30112 36485 60801 23391 22654 50671 54701 78210 77816 84323
18198H4323Q118o0434o088l78j7723M550k021j4174l2836M190N8136o675j4484
$$ 84323 92441 32007 25919 25541 7818 12368 10347 -3827 -36663 -32473 25663 18988 4504
18185D504j5883J6025j0196l1868M6518K4763N151l9894K1773J6572J1298L5071
$$ 4504 -11379 4646 -5550 -37418 9100 33863 39014 -880 20893 37465 48763 83834
18173H3834P221l8807o2142q494M3434J7934J074M975L3177n589k0403k045K8449
$$ 83834 91055 52248 -9894 -18388 25046 42980 44054 49029 82206 76617 56214 54169 82618
18160H2618P2295M0391l2709l0568j6109k2497l2248k470J5734Q901R329J608
$$ 82618 154913 195304 162595 132027 115918 93421 61173 58703 74437 83338 92667 94275
18148I4275j0989J3587L5151k7673O88L5881q468J3880M699L2251P5950J8156
$$ 94275 83286 96873 132024 104351 105039 140920 132452 146332 151031 183282 259232 277388
18136B77388j580k718O332K8749K6611J3673P2782R0856J04579J41187Q2864J7398
$$ 277388 275808 273090 279422 308171 334782 348455 421237 512093 616672 757859 840723 858121
18124H58121K8715J35121J91550J38148K07064L32059M15024N29243O97745R38571
$$ 858121 886836 1021957 1213507 1351655 1558719 1890778 2305802 2835045 3532790 4471361
18114D471361J443869K373745L930923P208670J4709141L0619702L6520638k353752
$$ 4471361 5915230 8288975 12219898 19428568 34137709 64757411 101278049 98924297
18106I8924297l2135862k8684006j5266479p662193m219070k641852j912941j414017
$$ 98924297 66788435 38104429 22837950 15175757 10956687 8314835 6401894 4987877
18098D987877j006436o89042n22564m25096m07413k81683j54941j64902j47938
$$ 4987877 3981441 3292399 2769835 2344739 1937326 1655643 1500702 1335800 1187862
18089A187862j27996r7078j09605o1291m3777k5265l6979q9604o2364j9188l2157
$$ 1187862 1059866 962788 853183 791892 748115 722850 685871 596267 533903 514715 482558
18078D82558l9577k1630j5134J9399k590m9832l2884l2959j2740k5460N2381k7051
$$ 482558 442981 421351 406217 425616 423026 373194 340310 307351 294611 269151 321532 294481
18066B94481l4275j1113j5589q069k6138j4287M1784L0534l6091l7660n094R324
$$ 294481 260206 249093 233504 225435 199297 185010 226794 257328 221237 183577 178483 187807
18054A87807K7141J642l0682m9634j6769K6154j1974J9298n591j2882J8854L905
$$ 187807 214948 216590 185908 136274 119505 145659 133685 152983 147392 134510 153364 157269
18042A57269n757m435J628L668J4586J7838R926J3843k0327l2175j0659k3743
$$ 157269 151512 147077 148705 152373 166959 184797 194723 208566 188239 156064 145405 121662
18030A21662j339J560j7123l4222J3579J2172j6678l3395K1068L8120L1002j837
$$ 121662 120323 121883 104760 70538 84117 96289 79611 46216 67284 105404 136406 134569
18018A34569k9558n0816j4628q530q644J3256M6239L8013n5088J9790K3179M5346
$$ 134569 105011 54195 39567 31037 22393 35649 81888 119901 64813 84603 107782 153128
18006A53128q889m456j5535k254k5069j2735J5780k76L9010k8985l6300n851N2191
$$ 153128 144239 139783 124248 121994 96925 84190 99970 99694 138704 109719 73419 67568 119759
17993A19759p518L2365l8959k9340J3335l308Q9k7029n8675M916L4690L1671j685
$$ 119759 112241 144606 105647 76307 89642 86334 86423 59394 719 5635 40325 71996 70311
17980G0311R92L3561N09R516j1223p0453j391M194o50k5566j7059K0822K4316
$$ 70311 71303 104864 105373 114889 103666 33213 31822 36016 35366 9800 -7259 13563 37879
17967C7879P751J4081O0927K1855m618k5728m5148k2231K3388l5124m2496K1639
$$ 37879 45630 59711 120638 142493 137875 112147 66999 44768 68156 33032 -9464 12175
17955A2175N2603M4173J5371K719m030j4872j061J878k3753p35R23m121k6465
$$ 12175 64778 108951 124322 127041 123011 108139 107078 108956 85203 84468 85391 81270 54805
17942E4805k560l319K1643q584m4777j6196k522N072J1600K8698L2849j3581j0708
$$ 54805 52245 48926 70569 61985 17208 1012 -1510 3562 15162 43860 76709 63128 52420
17929E2420K4473J8252p803j0188l5386m4571k7303P215L288k7365o098J3684
$$ 52420 76893 95145 87342 77154 41768 -2803 -30106 -22891 -19603 -46968 -53066 -39382
17917c9382n935N5424K7767P207L1383K3611L2543j2939o821j7277m2948k6151
$$ -39382 -45317 10107 37874 45081 76464 100075 132618 119679 112858 95581 52633 26482
17905B6482N0369N0961L342q830l2514O132J0849K1947k164J4246R785p1201o4261
$$ 26482 76851 127812 131154 122324 89810 95942 106791 128738 126574 140820 150605 79404 15143
17892A5143n798J0555K4618K2813p203k1608K6716k2928J472l6715N693K9106
$$ 15143 9345 19900 44518 67331 60128 38520 65236 42308 43780 7065 12758 41864
17880D1864k1412K7594N8613M3731Q834k7293K196m8107l6267L4556l585K1641
$$ 41864 20452 48046 106659 150390 159224 131931 134127 86020 49753 84309 80724 102365
17868A02365j2067j9539J2443J0725J2734L0717k0458l2968q732j6037l3484n7910
$$ 102365 90298 70759 83202 93927 106661 137378 116920 83952 75220 59183 25699 -32211
17856c2211N336k0123J8771M4793K4060n1086L232L2241K2925l5041j7003O2558
$$ -32211 -26875 -46998 -28227 16566 40626 -10460 -7228 25013 47938 12897 -4106 58452
17844E8452M2742r399K178Q514L5951P104k1334j6138J1634J9736M505l4442j6723
$$ 58452 101194 91795 93973 102487 138438 145542 124208 108070 119704 139440 143945 109503 92780
17831I2780K4143j6059k9862l3577k4335j189n199K9349J5457O31R747r651K5980
$$ 92780 116923 100864 71002 37425 13090 11901 6702 36051 51508 52139 61886 52235 78215
17818G8215m5807k0048j4124o074r016L740R673J7254K4905k0436L1M9587l8741
$$ 78215 32408 12360 -1764 -7838 -16854 -13114 -3441 13813 38718 18282 18313 67900 29159
17805B9159J2868N997o25J6539k6769l5435j1705k4014r202K5761J288P245N807
$$ 29159 42027 48024 47399 63938 37169 1734 -9971 -33985 -43187 -17426 -16138 -8893 -3086
17792c086J409J397J4120M2939Q928j3726k9369p00j2145l0312k6639K290n064
$$ -3086 -1677 -280 13840 56779 65707 51981 22612 21912 9767 -20545 -47184 -44894 -49958
17779d9958K8363Q5627L4757l9283m3088l9268K6502L3997k353k8178j4266j3482
$$ -49958 -21595 64032 98789 59506 16418 -22850 3652 37649 35296 7118 -7148 -20630
17767b0630J6316J0007k0112K3229K7068J7518r52j8141K969j523n013l3815K3668
$$ -20630 -4314 5693 -14419 8810 35878 53396 52444 34303 37272 35749 30736 -3079 20589
17754B0589J2871R417L8524N939j5063j7115m6307O40o404M760j9381L272K4562
$$ 20589 33460 42877 81401 87340 72277 55162 8855 9495 3091 7851 -11530 -8258 16304
17741A6304J5268j3682n171j809j7461J8153J1847k3261k7092J2257P0777L5743
$$ 16304 31572 17890 12719 10910 -6551 11602 23449 188 -26904 -14647 56130 91873
17729I1873N1587k3326l0966j9797j5492R734L1295J7566j0986m1463l3518n4185
$$ 91873 143460 120134 89168 69371 53879 63613 94908 112474 101488 60025 26507 -27678
17717b7678m2835L2341K3378L1028m486q995J1118J7452n093q865o2611j0415
$$ -27678 -70513 -38172 -14794 16234 11748 2753 13871 31323 26230 17365 -45246 -55661
17705e5661M7530L8636K9557K4407K0m8976k1748L307L4157M59k294k3036j9672
$$ -55661 -8131 30505 60062 84469 84489 35513 13765 17072 51229 51688 49394 26358 6686
17692F686k797j0236Q026J9706K3547p414k0211j8737j1653k9272L4936O4631
$$ 6686 3889 -6347 1679 21385 44932 37518 17307 -1430 -13083 -42355 -7419 57212
17680E7212j42k3191k64K0978l7093j3504m0384r50L0358K5339J622l1565J0287
$$ 57212 57070 33879 33615 54593 17500 3996 -36388 -37338 -6980 18359 19981 -11584 -1297
17667a297K6035p605J0931j8868j3204M6712q376q471j857L684K3412L7478j5840
$$ -1297 24738 17133 28064 9196 -4008 42704 34328 25857 24000 27684 51096 88574 72734
17654G2734J2490K4618l8884l4464M7593j0134o375m3356l902N6818N486m8850
$$ 72734 85224 109842 70958 36494 84087 73953 67578 24222 20320 77138 82624 33774
17642C3774l7673L6389L7743l6458n2832L0012L3089j0032O301j0449l089L612
$$ 33774 -3899 32490 70233 33775 -19057 10955 44044 34012 40313 29864 26775 30387
17630C0387k540l9737l6446J0918J08280J2654j532K5423J1080l5183o7311K506
$$ 30387 27847 -11890 -48336 -37418 70862 83516 81984 107407 118487 83304 15993 18499
17618A8499K4961p688j2410p056l2421j9999j4179p141l1531K2669J3878J537
$$ 18499 43460 35772 23362 16306 -16115 -36114 -50293 -57434 -88965 -66296 -52418 -50881
17606e0881J5426L4914J4448Q351J9039M6112k3634l8606j1147n014M0328l028
$$ -50881 -35455 -541 13907 22258 41297 87409 63775 25169 14022 9008 49336 46308
17594D6308n8606k6509J6852K3583j7633K8948l1382k6110M69K7695N5398J7538
$$ 46308 -12298 -38807 -21955 1628 -16005 12943 -18439 -44549 -44080 -16385 39013 56551
17582E6551K1424l6603j7071r070p998J0713K2790J9775k2013k8064j4011J3737
$$ 56551 77975 41372 24301 15231 7233 17946 40736 60511 38498 10434 -3577 10160
17570A0160K3563p744O393J0128j4275l7844j9832k7438j037L7740oK4610M9867
$$ 10160 33723 25979 32372 42500 28225 -9619 -29451 -56889 -57926 -20186 -20192 4418 54285
17557E4285j3534k2434K1141L3379j0731n0414l5510J4238j3867L991K6605P914
$$ 54285 40751 18317 39458 72837 62106 11692 -23818 -9580 -23447 -19456 7149 15063
17545A5063r282j9632j8309K7690N4691J0265N307j9087J1538J8824j9509k7387
$$ 15063 5781 -13851 -32160 -4470 50221 60486 65793 46706 58244 77068 57559 30172
17533C0172q719q501J0232L362k2829j8622P165L130j409j103q2112m3180O8702
$$ 30172 21453 12952 23184 26546 3717 -14905 -7740 -4610 -6019 -7122 -89234 -132414 -63712
17520f3712O1315K8346k4472k6965m188K4068j6282m060L5929J9757p306k6901
$$ -63712 -2397 25949 1477 -25488 -29676 -5608 -21890 -25950 9979 29736 22430 -4471
17508d471j8029j1225L2021L4653k86J1270j9717r09j2856n492L2388r874n112
$$ -4471 -22500 -33725 -1704 32949 32663 43933 24216 23307 10451 4959 37347 27473 22361
17495B2361j962L133J2580k6234J2580M2041Q690o929j0247J0489J7111j2273
$$ 22361 20399 23532 36112 9878 22458 64499 73189 66260 56013 66502 83613 71340
17483G1340m1067j6529m912M0256K1235l5006l9100j6627j3170o144K3407J5888
$$ 71340 30273 13744 8832 49088 70323 35317 -3783 -20410 -33580 -39724 -16317 -429
17471d29k9671m0714k1039K0209J1203k3980M8903L6316K7519K7949l8092o861
$$ -429 -30100 -70814 -91853 -71644 -60441 -84421 -35518 798 28317 56266 18174 11313
17459A1313p650p788M85M0218K1111m503J3334k4622P940J2656l7887j0755k424
$$ 11313 3663 -4125 -3640 36578 57689 53186 66520 41898 49838 62494 24607 13852 11428
17446A1428J6446L1345L8179J48078J98982R5739j22840j60117j29456q8846l5139
$$ 11428 27874 59219 97398 245476 444458 540197 417357 257240 127784 38938 3799
17435C799K9048L9106n627l7090j1506k414P143M4487J8904j9212k0683p733j0924
$$ 3799 32847 71953 66326 29236 17730 15316 22459 66946 85850 66638 45955 38222 27298
17422B7298k8213m949j8114O962J9630L1164j2183j590J2484m190m9974j2211
$$ 27298 -915 -5864 -23978 -17016 2614 33778 21595 20005 32489 28299 -21675 -33886
17410c3886M8094M5836o5526j0799J1315J7540J3018k1129K0154j78Q575R734
$$ -33886 14208 60044 -5482 -16281 -4966 12574 25592 4463 24617 24439 33014 42748
17398D2748n929P729Q874m6339J2659K1064k4672K0372K6537J3899k5742l1322
$$ 42748 36819 44548 53422 7083 19742 40806 16134 36506 63043 76942 51200 19878
17386A9878j9729K8642J9826N3312J837l6052j4226j9557j5981l1260j4538N0787
$$ 19878 149 28791 48617 101929 103766 67714 53488 33931 17950 -13310 -27848 22939
17374B2939J1237k2609k7719J4361k4475m8940M9202P3627J4205K168m3259J4004
$$ 22939 34176 11567 -16152 -1791 -26266 -75206 -26004 47623 61828 63996 20737 34741
17362C4741k0935l6705j0458L5638o072O725q238l4693K8895L5144P257l4954
$$ 34741 13806 -22899 -33357 2281 -3791 2934 -5304 -39997 -11102 24042 31299 -3655
17350c655J9343O721j1096K3076N880m1604n735l150j1235k8221m151l97J7336
$$ -3655 15688 22409 11313 34389 40269 -1335 -7070 -10220 -21455 -49676 -53827 -54224 -36888
17337c6888K8523j8596K1385L0644K5526O094m592l673k806j9961l5117j4203
$$ -36888 -8365 -26961 -5576 25068 50594 56688 52096 48423 45617 25656 -9461 -23664
17325b3664r156j4106K3902L9576L6553j8275n893l2708o0964K1342J2119R150
$$ -23664 -32820 -46926 -23024 16552 53105 34830 28937 -3771 -64735 -43393 -31274 -22124
17313b2124N3732m29j8146O879R876p110j988k5646K263n988N080K4825N3845
$$ -22124 31608 31179 13033 19912 29788 22678 20690 -4956 -2693 -8681 -3601 21224 75069
17300G5069j5100J3204L5461k6214n7461k9512k5570K4674k89n740k590K5139
$$ 75069 59969 73173 108634 82420 24959 -4553 -30123 -5449 -5738 -11478 -14068 11071
17288A1071O7807k2896j03032o469M1945K7m0650j6393L5107Q314j8170K8209
$$ 11071 78878 55982 -47050 -53519 -11574 -11547 -52197 -68590 -33483 -25169 -43339 -15130
17276a5130m750j6957O451L0993L3493J2431Q819l5746j9565l7183k5119K0431
$$ -15130 -19880 -36837 -30386 607 34100 46531 55350 19604 39 -37144 -62263 -41832
17264d1832K3315k958Q960O1870K3649j8998P001J804l3p609k4179M040j9656
$$ -41832 -18517 -21475 -12515 49355 73004 54006 61007 62811 62778 55169 30990 35030 15374
17251A5374l6712j9536l5141k262L1507K4429j2530l8674j699M8835N4913p563
$$ 15374 -21338 -40874 -76015 -78277 -46770 -22341 -34871 -73545 -75244 -26409 28504 20941
17239B0941l3450k5108L0206l188j6025Q144L8884L64K4475j9096q850l5013k4840
$$ 20941 -12509 -37617 -7411 -10599 -26624 -18480 20404 20768 45243 26147 17297 -17716 -42556
17226d2556K2010J7151k5734K19K0895j2031j7054n331L679N4119L2551L5444
$$ -42556 -20546 -3395 -29129 -28910 -8015 -20046 -37100 -42431 -38752 15367 47918 83362
17214H3362j2210k5738l185l5485N4792J2249k1986K2009K3905l8871p406J1596
$$ 83362 71152 45414 42229 6744 61536 73785 51799 73808 97713 58842 51436 63032
17202F3032J2617m6375k8630L7773j6848j3582K8893j4514n369J0196k2915j5098
$$ 63032 75649 29274 644 38417 21569 7987 36880 22366 16997 27193 4278 -10820
17190a0820k244N25j9955J2615k51K6822J1396l5605j5097q65K7676L0960l7840
$$ -10820 -13064 -12539 -32494 -19879 -20130 6692 18088 -17517 -32614 -33479 -5803 25157 -12683
17177a2683J3039K6616k9388n824M988J2557J9453J3200l1572l4018Q141j7222
$$ -12683 356 26972 -2416 -8240 -3252 9305 28758 41958 10386 -23632 -15491 -32713
17165c2713L2881J6495j2894L095M5111k1235J759k5061j6230L6382L1570J9878
$$ -32713 168 16663 3769 6864 51975 30740 32499 7438 -8792 27590 59160 79038
17153G9038o710l6160j2919K6717l505r839q720m2233J2271J4723j9508M532M6528
$$ 79038 72328 36168 23249 49966 46461 36622 27902 -14331 -2060 12663 -6845 -2313 44215
17140D4215k064n2957k1476M1187l2039l3024k5311j8284L8995k4348K196Q0142
$$ 44215 42151 -10806 -32282 8905 -23134 -56158 -81469 -99753 -60758 -85106 -82910 -2768
17128b768K8975l3180j0523K1905j5948L8314L5283J7965j272m1922j150l720
$$ -2768 26207 -6973 -17496 4409 -11539 26775 62058 80023 78751 36829 35679 31959
17116C1959m0782K4549L2054p614J5176j3858j6725k0622m0467J3319N5458P007
$$ 31959 -8823 15726 47780 40166 55342 41484 24759 4137 -36330 -23011 32447 39454
17104C9454k5565k525P503J7245l0248o2218j2228O9785J6454k7582M6308P077
$$ 39454 13889 11364 18867 36112 5864 -56354 -68582 1203 17657 -9925 36383 43460
17092D3460m6520l6208p238J3704M0053o147O5153K0359l8870l8303l0909K0013
$$ 43460 -3060 -39268 -46506 -32802 7251 1104 66257 86616 47746 9443 -21466 -1453
17080a453J9898J0451K5767M2715L463r474m3228l0723k3754l4017J820j611J2518
$$ -1453 18445 28896 54663 97378 100841 91367 48139 17416 -6338 -40355 -38535 -40146 -27628
17067b7628j7946m31l4105k0548k170K1453J5219N8141N3862k4539j4540j9589
$$ -27628 -45574 -46005 -80110 -100658 -102828 -81375 -66156 -8015 45847 21308 6768 -12821
17055a2821K5602j1408J9175K6496k0840k6754L2596j2710m0000j3237j763K1126
$$ -12821 12781 1373 20548 47044 26204 -550 32046 19336 -20664 -33901 -35664 -14538
17043a4538j2205L000J3244J2085m039K7507k71m0865r525l230l434j0054J7355
$$ -14538 -26743 -23743 -10499 1586 -2453 25054 24783 -16082 -25607 -28837 -32271 -42325 -24970
17030b4970Q5244l1233k1531L7882J8392N952j8200j5908J856j1288k9025r460
$$ -24970 60274 29041 7510 45392 63784 69736 51536 35628 37484 26196 -2829 -12289
17018a2289j3929l3991k7314m422M0395P0616J3591k1198o1434J1712O1067j0595
$$ -12289 -26218 -60209 -87523 -91945 -51550 19066 32657 11459 -49975 -38263 22804 12209
17006A2209O269m8818j9416K9776K8175j8528P130K7634L797J9931l9715q908
$$ 12209 18478 -30340 -49756 -19980 8195 -10333 -3203 24431 28228 48159 8444 -464
16994d64J5037J8450n6656k5385J2803K7993j1833J5247j0560n642p473M696L541
$$ -464 14573 33023 -23633 -49018 -36215 -8222 -20055 -4808 -15368 -21010 -28483 -23787 -20246
16981b0246n283j2021L4135J9067j2561k9253j8257K7378K8265N453k4265J694
$$ -20246 -25529 -37550 -3415 15652 3091 -26162 -44419 -17041 11224 16677 -7588 -5894
16969e894j2377J715P571j9674P017J2292M0918j9778j9734J6328l5636P097L7242
$$ -5894 -18271 -16556 -8985 -28659 -21642 -9350 31568 11790 -7944 8384 -27252 -20155 17087
16956A7087m1138k8745j1541L0703j116N615L4596J0678j0328R876m530k6861
$$ 17087 -24051 -52796 -64337 -33634 -34750 -29135 5461 16139 5811 15687 11157 -15704
16944a5704j1513J2209R50j4371J0426Q837K945k4600l387K7711q242K6265K764
$$ -15704 -27217 -15008 -14058 -28429 -18003 -9166 -6221 -30821 -34208 -6497 -14739 11526 14290
16931A4290l5072j0075j3238N189N388K7291J911k4619N382O950q82K5587L5809
$$ 14290 -20782 -30857 -44095 -38906 -33518 -6227 -4316 -28935 -23553 -16603 -17485 8102 43911
16918D3911j4723k9102J0049N2592J287m7766j6125L3937n893k7971l622O386
$$ 43911 29188 86 10135 62727 64014 16248 123 34060 28167 196 -3426 2960
16906B960m4077K3569M5017M0791J01k6519q832j1649n86k264L5385K4246j6480
$$ 2960 -41117 -17548 27469 68260 68361 41842 33010 21361 20775 18511 53896 78142 61662
16893F1662l1210k8546J4635N4762K758p2219n9251n6845K9689Q0346J8357k8726
$$ 61662 30452 1906 16541 71303 74061 1842 -57409 -114254 -84565 -4219 14138 -14588
16881a4588k110L19k9587k6681J4395K0458p558K7255m5889N000L8458N1393K4376
$$ -14588 -16698 -16379 -45966 -72647 -58252 -37794 -45352 -18097 -63986 -58986 -20528 30865 55241
16868E5241K7554P230n9876j6644K7785R263k3916k6321K5533J4167J6237M34
$$ 55241 82795 90025 30149 13505 41290 50553 26637 316 25849 40016 56253 56687
16856E6687l9644k3911k4959P039N105L8737J4984R010k9274N945J0263J904k051
$$ 56687 17043 -6868 -31827 -24788 -19683 19054 34038 43048 13774 19719 29982 31886 29835
16843B9835Q009Q93k0261n9719l0956N420N0492k443O339J3487j2167n844J7669
$$ 29835 37844 38737 18476 -41243 -72199 -66779 -16287 -18730 -12391 1096 -11071 -16915 754
16830G54J3371K711l6587o3074p616J2724K8261l2509K8115N0806K4506J8288
$$ 754 14125 16836 -19751 -82825 -90441 -77717 -49456 -81965 -53850 -3044 21462 39750
16818C9750j1754k1714p676L4513L147j5843k7738J6118o791j3125L130K4506
$$ 39750 27996 6282 -1394 33119 36266 20423 -7315 8803 2012 -11113 -7983 16523
16806A6523M781n060K21J7644J0489j0490l8248l0972L0679J7576L4763N4163
$$ 16523 21304 16244 16465 34109 44598 34108 -4140 -35112 -4433 13143 47906 102069
16794A02069l5127k9716P783k115p3895o3748J164q061J9090M3432K4217J2236
$$ 102069 66942 37226 45009 42894 -31001 -94749 -93585 -101646 -82556 -39124 -14907 -2671
16782b671J5615j568J2468k6099M099l598m4763J3435N1420L1763j9927J0856
$$ -2671 12944 11376 23844 -2255 1844 -1754 -46517 -33082 18338 50101 30174 41030
16770D1030K7024J091j0741o5052k3659j5555K0340R053M3058J9036r376n2498
$$ 41030 68054 69145 58404 -6648 -30307 -45862 -25522 -16469 26589 45625 36249 -16249
16758a6249m305r502J1330o793L4580L5134k6641k8945p037l3151O109O3965Q586
$$ -16249 -20554 -30056 -18726 -25519 9061 44195 17554 -11391 -18428 -51579 -45470 18495 27081
16745B7081l2691J9426o93L1523k765m0161k8838j9539j5277J0787K5601J1440
$$ 27081 -5610 13816 13123 44646 41881 1720 -27118 -46657 -61934 -51147 -25546 -14106
16733a4106l2934L1481J0184m537j3966R941J7013m652J5423L7981R694r5088
$$ -14106 -47040 -15559 -5375 -9912 -23878 -13937 3076 -1576 13847 51828 61522 -33566
16721c3566q733L1146k0363m601M0159L9804j1892k4152K9952L9663k842m6506
$$ -33566 -42299 -11153 -31516 -36117 4042 43846 31954 7802 37754 77417 74575 28069
16709B8069L5546K6030J7551l3933l1362L0540K4449L6525n686m7002n4414m321
$$ 28069 63615 89645 107196 73263 41901 72441 96890 133415 127729 80727 26313 21992
16697B1992J9447j1011o7436k3413K4544N318k5591J5634N1236j0242M836K5530
$$ 21992 41439 30428 -37008 -60421 -35877 -30559 -56150 -40516 10720 478 5314 30844
16685C0844l563J3137j1857n265n405L1074j2208n017l255j0994j8472K0151l952
$$ 30844 27281 40418 28561 23296 17891 48965 36757 31740 28485 17491 -981 19170 15218
16672A5218l2880L2824l365l4080P114j4256K1291K6299L0021k2200n7787K3954
$$ 15218 -17662 15162 11797 -22283 -15169 -29425 -8134 18165 48186 25986 -31801 -7847
16660g847N5245J480q286k0688R172k2095l481k9370M0996N6961L8586m2307l2020
$$ -7847 47398 48878 40592 19904 29076 6981 3500 -25870 15126 72087 110673 68366 36346
16647C6346k4021k3524k804J9433j6417k5598N9239L3382R323J1778m1643k7444
$$ 36346 12325 -11199 -14003 5430 -10987 -36585 22654 56036 65359 77137 35494 8050
16635H050P478n507l203j832j7741j8101l4992P883J7383L859J3526P828j2794
$$ 8050 15528 10021 6818 4986 -12755 -30856 -65848 -57965 -40582 -36723 -23197 -15369 -28163
16622b8163M983J1924k7635k9149J2788K6598M3815k0885l9335L319K3455o469
$$ -28163 -23180 -11256 -38891 -68040 -55252 -28654 15161 -5724 -45059 -41740 -18285 -24754
16610b4754L5065m451q715L3969J2351m1104j1568k6608k6338J6862j870K2576
$$ -24754 10311 5860 -2855 31114 43465 2361 -9207 -35815 -62153 -45291 -47161 -24585
16598b4585J6837N2222J8234k1133k1125K6954J7480p033n7489k0965J1921J7281
$$ -24585 -7748 44474 62708 41575 20450 47404 64884 57851 362 -20603 -8682 8599
16586H599L405L820L0704J6391N521n76k6748j3688m48j851J9680j7790J7626
$$ 8599 12004 15824 46528 62919 68440 67864 41116 27428 26980 25129 44809 27019 44645
16573D4645K0019j4391k771m292j2901n284O225O259L289N916k3527m321M2405
$$ 44645 64664 50273 47502 43210 30309 25025 31250 37509 40798 46714 23187 18866 61271
16560F1271k1995p3814j744L7789K0893K9179j5107l8530j3648J0125J8715K6807
$$ 61271 39276 -34538 -36282 1507 22400 51579 36472 -2058 -15706 -5581 13134 39941
16548C9941Q872m6671o1214R912J6984K3647L0915k8730J227N0341k0512l912
$$ 39941 48813 2142 -59072 -49160 -32176 -8529 22386 -6344 -5117 45224 24712 20800
16536B0800L9504M8641R673k9453o6537l6521j0751k689k277o419L3073j037j7713
$$ 20800 60304 108945 118618 89165 22628 -13893 -24644 -27333 -29610 -36029 -2956 -3993 -21706
16523b1706k6615J2778m641J4298j3839N28J2186J3349J599n1420J0755N8450
$$ -21706 -48321 -35543 -40184 -25886 -39725 -39197 -27011 -13662 -12063 -63483 -52728 5722
16511E722J3558M352m220J923L1954R742k1989l9728l0652o1415m036N7088J9949
$$ 5722 19280 23632 19412 21335 53289 63031 41042 1314 -29338 -90753 -94789 -37701 -17752
16498a7752o252P745K6936J4488K6656M4791K253k1369l6369j3951l225o467r17
$$ -17752 -24004 -16259 10677 25165 51821 96612 98865 77496 41127 27176 23951 17484 16567
16485A6567l1297K093j5854J4666L6142j1654k849k6682k101l168K5776J8272
$$ 16567 -14730 -12637 -28491 -13825 22317 10663 7814 -18868 -20969 -24137 1639 19911
16473A9911j4111j0401k1721M505N349k022l762k9120K8227J0649n912Q87k3121
$$ 19911 5800 -4601 -26322 -21817 -16468 -18490 -22252 -51372 -23145 -12496 -18408 -17521 -40642
16460d0642k6163j6484K4510j857l069L3552L2438j6400k2628N6500K1496n3266
$$ -40642 -66805 -83289 -58779 -60636 -63705 -30153 2285 -14115 -36743 19757 41253 -12013
16448a2013q123m3647J6887K3827N732P840l4381M8491K322l6244M863K2101K3764
$$ -12013 -20136 -63783 -46896 -23069 -17337 -9497 -43878 4613 6935 -29309 -24446 -2345 21419
16435B1419r872Q002L260l061n845j9168j4675N7557J7823o7814m5329J3148K8629
$$ 21419 11547 19549 22809 19748 13903 -5265 -19940 37617 55440 -12374 -57703 -44555 -15926
16422a5926J2942M249K586J0512K033J3790n0278j2049L0639k0888j1244O1932
$$ -15926 -2984 1265 3851 14363 16396 30186 -20092 -32141 -1502 -22390 -33634 28298
16410B8298j3146k07K327m6064L004J0279j6482R763Q607m1442l9119m770M6249
$$ 28298 15152 14945 17272 -28792 -25788 -15509 -31991 -22228 -13621 -55063 -94182 -98952 -52703
16397e2703L2371M753k773j5218K65J5321L2431j325j2212L263j4065k595L0199
$$ -52703 -20332 -15579 -18352 -33570 -33305 -17984 14447 13122 910 4173 -9892 -12487 17712
16384A7712m302N083J4445k5989j9729j3754M0217j634P443L5089k054k7832j6897
$$ 17712 13410 18493 32938 6949 -12780 -26534 13683 12049 19492 54581 52527 24695 7798
16371G798N064j899J6047K4395l3935p487K2900R781j4697O704J4161K0966Q724
$$ 7798 12862 10963 27010 51405 17470 9983 32883 42664 27967 34671 48832 69798 78522
16358G8522m0918k2260k412J6185Q567j8109J3529l4549j5215N957L0012M654
$$ 78522 37604 15344 12932 29117 37684 19575 33104 -1445 -16660 -10703 19309 23963
16346B3963J8709p556K0153n347k4978p844Q923N121j9257k0330j9045J7995o386
$$ 23963 42672 35116 55269 49922 24944 17100 26023 31144 11887 -8443 -27488 -9493 -15879
16333a5879O0265L0324m3873P686m0217K1811j3731M608j7533J7913R024k2978
$$ -15879 44386 74710 30837 38523 -1694 20117 6386 10994 -6539 11374 20398 -2580
16321b580K4162k5695k775M0077J0495k9476l8330j2631O538Q84k91J9373J5145
$$ -2580 21582 -4113 -6888 33189 43684 14208 -24122 -36753 -30215 -29331 -29622 -10249 4896
16308D896l0221L433p01L458m7081p462P512Q46P545j2667M2721K7942q948p916
$$ 4896 -25325 -21892 -22593 -19135 -66216 -73678 -66166 -65320 -57775 -70442 -27721 221 -8727 -16643
16294a6643M6507m036l578j5J7744l3765m9531P179L4096j7500o683K5837L0420
$$ -16643 29864 25828 22250 22235 39979 6214 -43317 -36138 -2042 -19542 -26225 -388 30032
16281C0032P474k8296J1619j7489n933r588P285K4504r511m252L5203L352k1139
$$ 30032 37506 9210 20829 3340 -2593 -12181 -4896 19608 10097 5845 41048 44400 23261
16268B3261l165K9103l2018R237N3750k91o2061m9899J2757q409l851J191N78
$$ 23261 20096 49199 17181 26418 80168 79877 17816 -32083 -19326 -27735 -31586 -30395 -29817
16255b9817O278J1094L5475J9270m5071j5152P933o160M8796N5825j3184j2898
$$ -29817 -23539 -12445 23030 42300 -2771 -17923 -9990 -16150 32646 88471 75287 62389
16243F2389n084J161j1082j8774L2815l9695l7665l3615J1191o138M6365J4721
$$ 62389 57305 58466 47384 28610 61425 21730 -15935 -49550 -38359 -44497 1868 16589
16231A6589m8874k9095J8948K1070j3599j0572m94l7406J6047M7023K1027l6153
$$ 16589 -32285 -61380 -42432 -21362 -34961 -45533 -46027 -83433 -67386 -20363 664 -35489
16219c5489J9604J074O915N123J1710L2015j4393l8503l843J960k8414J143K2302
$$ -35489 -15885 -14811 -7896 -2773 8937 40952 26559 -11944 -15787 -13827 -42241 -41098 -18796
16206a8796p859J1297k518k1274k4687J3315K5698K3180Q641m2265k023Q412k9611
$$ -18796 -26655 -15358 -17876 -39150 -63837 -50522 -24824 -1644 6997 -35268 -37291 -28879 -58490
16193e8490M8479J9233n987L2430J7877m9126l4744K3102K6277J5786K7568M758
$$ -58490 -10011 9222 3235 35665 53542 4416 -30328 -7226 19051 34837 62405 67163
16181F7163p5287l6913K500M0298N5553k045l7946K3367k4974l7662J8681P145
$$ 67163 -8124 -45037 -42537 -2239 53314 51269 13323 36690 11716 -25946 -7265 -120
16169a20L0656N898k8309L880K33Q369J5719M1781o0329k6766M067N639l64Q420
$$ -120 30536 36434 8125 12005 12238 20607 36326 78107 17778 -8988 -4921 718 354 8774
16155H774N7708K4454j9554J7470k8311n7382N115j880J3256M398K8829N061j0754
$$ 8774 66482 90936 71382 88852 60541 3159 8274 6394 19650 24048 52877 57938 47184
16142D7184k3935L936k5579k7259M441N6330r879o378K3228j0246L96k7873l5815
$$ 47184 23249 27185 1606 -25653 -21212 35118 25239 18861 42089 31843 32239 4366 -31449
16129c1449r97L6427N3970J4482Q534j1811j7186j1403j8265n138k2940l0335
$$ -31449 -32446 3981 57951 72433 80967 69156 51970 40567 22302 17164 -5776 -36111
16117c6111K7242M6812P986k1926p851j8603p158j6790N574J7901J4070j2940
$$ -36111 -8869 37943 45929 24003 16152 -2451 -9609 -26399 -20825 -2924 11146 -1794
16105a794j2189J2262M8069j760r030k7727j2934K1594L4184j3129j6462J7678
$$ -1794 -13983 -1721 46348 44588 35558 7831 -5103 16491 50675 37546 21084 38762
16093C8762j5780l9534l7328j7856j7927M4798L7935Q840k46M0554K1302N568
$$ 38762 22982 -16552 -53880 -71736 -89663 -44865 -6930 1910 1664 42218 63520 69088
16081F9088Q99o060j4491k9341m498J360p799L503L462N8554J2160l6538k0065
$$ 69088 69987 63927 49436 20095 15597 16957 9158 12661 16123 74677 86837 50299 30234
16068C0234p1k9779k2773O242O882J8209m254l4044l5877n817J7541M533K1906
$$ 30234 30163 384 -22389 -16147 -9265 8944 4690 -29354 -65231 -71048 -53507 -48974 -27068
16055b7068p480l0802K6519P221K7277K2590K1592R288k4953m1463l192K4543
$$ -27068 -34548 -65350 -38831 -31610 -4333 18257 39849 49137 24184 -17279 -20471 4072
16043D072N8711j5164j2275r559k1772n924J8957r388j3616J7779L8922j3488
$$ 4072 62783 47619 35344 25785 4013 -1911 17046 7658 -5958 11821 50743 37255
16031C7255j3099O0305k7634n9706j3551J431L958L6605p133l7656j3948K5757
$$ 37255 24156 84461 56827 -2879 -16430 -14999 -11041 25564 18431 -19225 -33173 -7416
16019g416R791l696N663k395J7947K6573j3284k9110n317j5662j9038J1893N3322
$$ -7416 2375 -1321 4342 1947 19894 46467 33183 4073 -1244 -16906 -35944 -24051 29271
16006B9271K6029k3056O155K8307k4258k7543M010j5687j1831J3930j0399k4413
$$ 29271 55300 32244 38399 66706 42448 14905 18915 3228 -8603 5327 -5072 -29485
15994b9485L54j212j9652K5594P494K5893J520Q89P441J7870l1722k5812J2314
$$ -29485 -29131 -30343 -49995 -24401 -16907 8986 10506 11395 18836 36706 4984 -20828 -8514
15981h514j204K9451J8651l1392j218K0191p120L906P062K186M298L069m4924
$$ -8514 -9718 19733 38384 6992 5774 25965 18845 22751 29813 31999 36297 39366 -5558
15968e558l357K7010J3107m984K7137k1537n0266k1081n110N47J4337J4015J4021
$$ -5558 -8915 18095 31202 26218 53355 31818 -18448 -39529 -44639 -44092 -29755 -15740 -1719
15955a719J2566J9858R380l2581k7635l1324J9779K7447K8239k1584k2601K1537
$$ -1719 10847 30705 40085 7504 -20131 -51455 -31676 -4229 24010 2426 -20175 1362
15943A362M6744J9096k6038J7203r923j6821P387K2857j0314j6418k0507j0233
$$ 1362 48106 67202 41164 58367 48444 31623 39010 61867 51553 35135 14628 4395
15931D395J6897J3612j7213l520K4727J7957J080K4254K2944J2370n0780l3028
$$ 4395 21292 34904 17691 14171 38898 56855 57935 82189 105133 117503 66723 33695
15919C3695k881P963Q999l0950k7546j6983K2612M7213k224m082Q933k4586K4053
$$ 33695 30814 38777 47776 16826 -10720 -27703 -5091 42122 39898 35816 44749 20163 44216
15906D4216k0296O860j8947n200j0867k2058k3501K7088M3639P1642L54l5944
$$ 44216 23920 30780 11833 6633 -4234 -26292 -49793 -22705 20934 92576 92930 56986
15894E6986j9286M320j9441m2896k2678J1146N099p538J1475P787K9815q545K6557
$$ 56986 37700 42020 22579 -20317 -42995 -31849 -26750 -34288 -22813 -15026 14789 6244 32801
15881C2801J0860r962J7184j1681j8251o5164j7122K911J1125K8238j841j8518
$$ 32801 43661 33699 50883 39202 20951 -44213 -61335 -58424 -47299 -19061 -20902 -39420
15869c9420l2376K639k5219j2192L3708M5126L8941M446n0747p114n755K978J6238
$$ -39420 -71796 -69157 -94376 -106568 -72860 -27734 11207 15653 -35094 -42208 -47963 -44985 -28747
15856b8747M4324L0551k187K632M64L2798o612K6855J6733j7080j5113l9092l2099
$$ -28747 15577 46128 43941 46573 47037 79835 73223 100078 116811 99731 84618 45526 13427
15843A3427j8829J6727r781k2568L4331O1828J8357k8301l4911p405l2992j488
$$ 13427 -5402 11325 1544 -21024 13307 75135 93492 65191 30280 22875 -10117 -11605
15831a1605P524K9716M2450l1945l6882o751Q204m4574k9249J4861M0510P0602
$$ -11605 -4081 25635 68085 36140 -742 -7493 711 -43863 -73112 -58251 -17741 52861
15819E2861j2338p2700j7269N3427M8203J035j1834k3862m2508k3184R229J8206
$$ 52861 40523 -32177 -49446 3981 52184 53219 41385 17523 -24985 -48169 -38940 -20734
15807b0734K6032K0298j6227l4463M1427P359K5301K0354P495N450m5409k1868
$$ -20734 5298 25596 9369 -25094 16333 23692 48993 69347 76842 82292 36883 15015
15795A5015j7381j0533J5275J874J331J2579p63J2990P275j0921l7046k5056J2496
$$ 15015 -2366 -12899 2376 4250 5581 18160 17397 30387 37662 26741 -10305 -35361 -22865
15782b2865L0799Q844P399k0250k7977l5584r951n372J3187K344k1219n440N7857
$$ -22865 7934 16778 24177 3927 -24050 -59634 -69585 -74957 -61770 -59426 -80645 -86085 -28228
15769b8228K9836k8780m5292J0843m481N168Q866K2330N5267k3828l0922m8946
$$ -28228 1608 -27172 -72464 -61621 -66102 -60934 -52068 -29738 25529 1701 -29221 -78167
15757g8167L7979J9404L8069L554j1824R060m4136j5824M0471J379K4978j4804
$$ -78167 -40188 -20784 17285 20839 9015 18075 -26061 -41885 -1414 -35 24943 10139
15745A0139j632J4492L0320L9911m4066l2802j2906j1200n747K4539K350K345
$$ 10139 8507 22999 53319 93230 49164 16362 3456 -7744 -13491 11048 13398 15743
15733A5743n691J0726l737j9757p160K2744j8251j7948j4267R769Q424J4731L4162
$$ 15743 10052 20778 17041 -2716 -9876 12868 -5383 -23331 -37598 -27829 -19405 -4674 29488
15720B9488L776N364M105K4216k198m4677m3932J9875r400L53L8943J8918r229
$$ 29488 33264 38628 42733 66949 64751 20074 -23858 -3983 -13383 -13030 25913 44831 35602
15707C5602j5090K784K3497K60j427j7652j9227l8438J0669O0096K2111k8677
$$ 35602 20512 23296 46793 47053 45626 27974 8747 -29691 -19022 41074 63185 34508
15695C4508R651J7096m4639K0040O0665l0367J0812o4333K118L757m644j4090
$$ 34508 44159 61255 16616 36656 97321 66954 77766 13433 15551 19308 14664 574
15683E74K9054J6863Q07n157K7328k3631k4364j4014K2999j063J4513r11K7235
$$ 574 29628 46491 47298 42141 69469 45838 21474 7460 30459 29396 43909 42998 70233
15670G0233J6196k8487k0181q587k1622k028l215Q308P054P917J2598k7799k9700
$$ 70233 86429 57942 37761 29174 7552 5524 2309 10617 17671 25588 38186 10387 -19313
15657a9313j2448P005J782K702j7162q859l0764j6982M3182L0934K5469O944j1169
$$ -19313 -31761 -24756 -22974 -20272 -37434 -46293 -77057 -94039 -50857 -19923 5546 12490 1321
15644A321n2054j4054L6324J4927k3423L084N8856K4847p348l4968l8502l5374
$$ 1321 -50733 -64787 -28463 -13536 -36959 -33875 24981 49828 42480 7512 -30990 -66364
15632f6364K0941O4432n0003j1226L2526L6892Q410K5994k9694n553J9487l2367
$$ -66364 -45423 19009 -30994 -42220 -9694 27198 35608 61602 31908 26355 45842 13475
15620A3475l1632K6006Q550n1304l2323J7270J9634L4994q833K3241O737j2027
$$ 13475 -18157 7849 16399 -34905 -67228 -49958 -30324 4670 -4163 19078 25815 13788
15608A3788j2515o51j1638k2535k6073l7222j7372L4657N7778J4958Q982L9510
$$ 13788 1273 622 -11016 -33551 -59624 -96846 -114218 -79561 -21783 -6825 2157 41667
15596D1667n6806j2794q815N476L8875k0810m5993m8547Q230j2442M3315K4046
$$ 41667 -15139 -27933 -36748 -31272 7603 -13207 -59200 -107747 -99517 -111959 -68644 -44598
15584d4598K1813M579M2499L0667K0312k7033k7037Q709M9328K7810J2230l2740
$$ -44598 -22785 -18206 24293 54960 75272 48239 21202 29911 79239 107049 119279 86539
15572H6539k5486l2654k8366J2875k0443j528N147o41k7857k267J3670K8518j282
$$ 86539 61053 28399 33 12908 -7535 -9063 -3916 -4557 -32414 -34681 -21011 7507 6225
15559F225p018j8689q161K1498L1945P359o384M957m0788j5464K4146M4251l8778
$$ 6225 -793 -19482 -27643 -6145 25800 33159 26775 31732 -9056 -24520 -374 43877 5099
15546E099q441J0343K7936M4547L260q223j9713l5457M9222Q722k1079m4635K2610
$$ 5099 -3342 7001 34937 79484 82744 74521 54808 19351 68573 77295 56216 11581 34191
15533C4191L3772L9359p213l6450q378l0212k9852k6339L230J4631k1139K2409
$$ 34191 67963 107322 100109 63659 55281 25069 -4783 -31122 -27892 -13261 -34400 -11991
15521a1991l682j8421K0770R644K5695J5363M128j6823j8248m0406J975J4212
$$ -11991 -15673 -34094 -13324 -3680 22015 37378 41506 24683 6435 -33971 -31996 -17784
15509a7784l0923J1479J5197L632L1982L9454R284l6370k8722k4485K7890Q109
$$ -17784 -48707 -37228 -22031 -18399 13583 53037 62321 25951 -2771 -27256 634 8743
15497H743j3778L4817N7475n609l8299j705K2875k4342n9868K4807L933j4974
$$ 8743 -5035 29782 87257 81648 43349 41644 64519 40177 -19691 5116 9049 -5925
15485e925J921K4875L5677l9888l7238L2561K6588M599M735k888J1823j9753j7963
$$ -5925 -4004 20871 56548 16660 -20578 11983 38571 43170 47905 45017 56840 37087 19124
15472A9124j4271o754m2089L2143K5016m8650k1360k6514J902K1243p951J1408
$$ 19124 4853 -1901 -43990 -11847 13169 -35481 -56841 -83355 -81453 -60210 -68161 -56753
15460e6753N233K9794J6904M078j251J6682j4476q966l8936n3566N916k025N6249
$$ -56753 -51520 -21726 -4822 -744 -1995 14687 211 -8755 -47691 -101257 -95341 -97366 -41117
15447d1117L6242k1027N275k9030L2311M6415K7430l4711j5225K0852L6785K5945
$$ -41117 -4875 -25902 -20627 -49657 -17346 29069 56499 21788 6563 27415 64200 90145
15435I0145k7066k1948j2597Q082j7402m8137j3228J2024j1319j7220l489r305
$$ 90145 63079 41131 28534 36616 19214 -28923 -42151 -30127 -41446 -58666 -62155 -71460
15423g1460L549J7589L1157K7224J5202m3467k4634J3628N7137R541l1140O563
$$ -71460 -67911 -50322 -19165 8059 23261 -20206 -44840 -31212 25925 35466 4326 10889
15411A0889J4134l2562k6219m3214j6111K6631J9210M391R307M7187M1049L7211
$$ 10889 25023 -7539 -33758 -76972 -93083 -66452 -47242 -42851 -33544 13643 54692 91903
15399I1903l0585m1223k3885J7623l7442k1442j6237k1985L9226r619q427J4440
$$ 91903 61318 20095 -3790 13833 -23609 -45051 -61288 -83273 -44047 -53666 -62093 -47653
15387d7653N640K7943K0781J1669L245k3772J7188J6640M842j4092J402k0734
$$ -47653 -42013 -14070 6711 18380 21625 -2147 15041 31681 36523 22431 23833 3099
15375C099l2100L1910j8888j8009J7593j7697l962J6795L5755l4807n4865O1743
$$ 3099 -29001 2909 -15979 -33988 -16395 -34092 -38054 -21259 14496 -20311 -75176 -13433
15363a3433O0491k3246l4194j7297M9223M8014L8286m2580m6552L0473J4803q634
$$ -13433 47058 23812 -10382 -27679 21544 69558 107844 65264 18712 49185 63988 55354
15351E5354m7994l2747L4313J165J3759j4105o7135M6652J6868J0235n050l1114
$$ 55354 7360 -25387 8926 10091 23850 9745 -57390 -10738 6130 16365 11315 -19799
15339a9799m437M5912J558j1328j0689j9335J2994J8884K4386J0221K4220M232
$$ -19799 -24236 21676 23234 11906 1217 -18118 -5124 13760 38146 48367 72587 76819
15327G6819k9720Q700k7404m382N920m5670J3021N6804J5102q611J2145k0078
$$ 76819 47099 55799 28395 24013 29933 -15737 -2716 54088 69190 60579 72724 52646
15315E2646k1086K438j8492j4921J7752R627P244j4983j4131M877K5327r583l5546
$$ 52646 31560 33998 15506 585 18337 27964 35208 20225 6094 10971 36298 26715 -8831
15302h831J4275K7425K9434J7184k9475K923p100l1823m0848J1044k6810R390
$$ -8831 5444 32869 62303 79487 50012 52935 45835 14012 -26836 -15792 -42602 -33212
15290c3212K2639n035L3570R571j8658k6534j3336l5467n617n03N231J4566O3876
$$ -33212 -10573 -15608 17962 27533 8875 -17659 -30995 -66462 -72079 -72582 -67351 -52785 11091
15277A1091j0100l8121k576R040j2184P052K1396K9143K3940o750Q446j5094J2029
$$ 11091 991 -37130 -39706 -30666 -42850 -35798 -14402 14741 38681 31931 40377 25283 37312
15264C7312j0599m113n9000l4456L4103L5899K0363k1134O627r639l2125j3449
$$ 37312 26713 22600 -36400 -70856 -36753 -854 19509 -1625 5002 -4637 -36762 -50211
15252e0211P2151O9177j4773j6323n2911l5208K333j220m794N2284M330j1428
$$ -50211 21940 91117 76344 60021 7110 -28098 -25765 -26985 -31779 20505 24835 13407
15240A3407N375j2209l0037J5238K3808j8111k8622J9941k0020j3290J230K7756
$$ 13407 18782 6573 -23464 -8226 15582 -2529 -31151 -11210 -31230 -44520 -43290 -15534
15228a5534N258l3666p399j3575l472K3448L4404O036J2891K5900k0292l070K0703
$$ -15534 -10276 -43942 -51341 -64916 -68388 -44940 -10536 -4500 8391 34291 13999 10929 31632
15215C1632L1376J1590k2471j7371K4030r722k3619K9735J8941r565l5543M958
$$ 31632 63008 74598 52127 34756 58786 49064 25445 55180 74121 64556 29013 33971
15203C3971k0923l8981P528M4736J4294j7337k3293l6124q487J4235K1689K093
$$ 33971 13048 -25933 -18405 26331 40625 23288 -5 -36129 -44616 -30381 -8692 -6599
15191f599j0723l276L2822N9372j1155j4097L27o9987o2101R30K3183L8596P416
$$ -6599 -17322 -20598 12224 71596 60441 46344 46671 -23316 -85417 -84487 -61304 -22708 -15292
15178a5292K3713K4692K0614j631j7159j1019j1416Q101O7106J2916p542k0248
$$ -15292 8421 33113 53727 52096 34937 23918 12502 20603 87709 100625 93083 72835
15166G2835n7133p3873j2784J9748L0195k0270K1758J6634K5273K6819Q423J1394
$$ 72835 15702 -58171 -70955 -51207 -21012 -41282 -19524 -2890 22383 49202 57625 69019
15154F9019K4956m0975o9497m0328r265Q13K0510K0785L9379J5631R184q597k8843
$$ 69019 93975 53000 -16497 -56825 -66090 -65277 -44767 -23982 15397 31028 40212 31615 2772
15141B772j1714k829j0592j3628m034L859K2039L0835N245n5894N046k1513j4130
$$ 2772 -8942 -11771 -22363 -35991 -40025 -36166 -14127 16708 21953 -33941 -28895 -50408 -64538
15128f4538k1978n543L4700j1127K1458L2359O178j7585m8137K9667R8176K023
$$ -64538 -86516 -92059 -57359 -68486 -47028 -14669 -8491 -26076 -74213 -44546 53630 55653
15116E5653k4884m4878J1006L1198M0535j8998n6320k0653k0534K77M1884K0459
$$ 55653 30769 -14109 -3103 28095 68630 49632 -6688 -27341 -47875 -47598 -5714 14745
15104A4745l0174L431J4327j8635k2899K6581J3655m0512j3520K4419N9544J8398
$$ 14745 -15429 -11998 2329 -16306 -39205 -12624 1031 -39481 -53001 -28582 30962 49360
15092D9360L2151O152j1264l5026k6350l8802K8925K0929p761l831n50J2761J7207
$$ 49360 81511 87663 76399 41373 15023 -23779 5146 26075 18314 14483 13933 26694 43901
15079D3901l7233o636K235o132o074M774J0830J5683l5926J0800r176n153j1292
$$ 43901 6668 32 2267 -3865 -9939 -5165 5665 21348 -14578 -3778 -12954 -18107 -29399
15066b9399l0180J1284K5988L7109L9872p5518k1949Q892K9873K5872m857j7412
$$ -29399 -59579 -48295 -22307 14802 54674 -20844 -42793 -33901 -4028 21844 16987 -425
15054d25k8301L000M304M797p937J4132O22k0025j7637K213K1672M1793M29K189
$$ -425 -28726 -25726 -21422 -16625 -24562 -10430 -9808 -29833 -47470 -45257 -23585 18208 18637 20826
15040B0826k448J9170j6234k708n4877k9738L4941J1121J661l4384L674J2759
$$ 20826 18378 37548 21314 18606 -36271 -66009 -31068 -19947 -18286 -52670 -48996 -36237
15028c6237J8276l7983n589k817j566N187k051O567K3640N940R704K6866J5139
$$ -36237 -17961 -55944 -61533 -64350 -65916 -60729 -62780 -56213 -32573 -26633 -16929 9937 25076
15015B5076J3472O3442k0078j2930N647k321j822Q302o0658l6615J1210J7411
$$ 25076 38548 101990 81912 68982 74629 72308 70486 78788 18130 -18485 -7275 10136
15003A0136J8161K9967Q989K4944L777k6153k2296r510m2009l2393m078o664N7597
$$ 10136 28297 58264 67253 92197 95974 69821 47525 38015 -3994 -36387 -40465 -47129 10468
14990A0468k5247K0904J3954j5730M441l8433j9452K9828J8706m9J1372J4724
$$ 10468 -14779 6125 20079 4349 8790 -29643 -49095 -19267 -561 -610 10762 25486
14978B5486p599R57K7100N80l9797j0295j0463J4590K0246Q411k4385L3527O614
$$ 25486 17887 18844 45944 46524 6727 -3568 -14031 559 20805 29216 4831 38358 44972
14965D4972m4027L790q190L8044J8371j7571k0281o6214k883M3871M5981p358
$$ 44972 945 4735 -3455 34589 52960 35389 15108 -51106 -53989 -10118 35863 28505
14953B8505j9017P791l987k9775K4247l9208R38K4835k9683o5518J2212N7785
$$ 28505 9488 17279 13292 -16483 7764 -31444 -30506 -5671 -35354 -100872 -88660 -30875
14941c0875O1914J0253J1274K8488q5751p3555N4491P8385L1998m521n681o7824
$$ -30875 31039 41292 52566 81054 -4697 -78252 -23761 54624 86622 82101 76420 8596
14929H596n3482J7501L5155L0231J8111m0569j7641J1708l67p914j7631j2455
$$ 8596 -44886 -27385 7770 38001 56112 15543 -2098 9610 9243 1329 -16302 -28757
14917b8757J1194R780K8784p144n3660k6503M9447L7953l059L799j0305j4130
$$ -28757 -17563 -7783 21001 13857 -39803 -66306 -16859 21094 18035 21834 11529 -2601
14905b601O635J4298L737j3137L899J2937k7806l744J5446J10R496J6926J6506
$$ -2601 4034 18332 22069 8932 12831 25768 -2038 -5782 9664 9774 19270 36196 52702
14892E2702o1768r413L4017K0153l1957J0608P6401M1994k9584n0204q093L4477
$$ 52702 -9066 -18479 15538 35691 3734 14342 90743 132737 103153 52949 44856 79333
14880G9333J3286P703j1271l9102m1268P187L6058l8494k1612n278j381P226K2455
$$ 79333 92619 100322 89051 49949 8681 15868 51926 13432 -8180 -13458 -14839 -7613 14842
14867A4842q247j3919j9156M6007k8679k3504L3585M524j6815n864K5815J2061
$$ 14842 6595 -7324 -26480 19527 -9152 -32656 929 5453 -11362 -17226 8589 20650
14855B0650n720l610l769p840P69l341n0293n058J7921K6690L0649q602l0472
$$ 20650 14930 11320 7551 -289 480 -2861 -53154 -58212 -40291 -13601 17048 8446 -22026
14842b2026l4407k7313M040M267j2485O0116K3521j4223k7078k8952J2841l330
$$ -22026 -56433 -83746 -79706 -75439 -87924 -27808 -4287 -18510 -45588 -74540 -61699 -65029
14830f5029k004K7077L3037m3053r395j2364j8458J8513P1422M7243k7473k9417
$$ -65029 -67033 -39956 -6919 -49972 -59367 -71731 -90189 -71676 -254 46989 19516 -9901
14818i901k521j2469J7880J5355l7093J563q762n462K2216J2161N965J2806j2122
$$ -9901 -12422 -24891 -7011 8344 -28749 -27186 -35948 -41410 -19194 -7033 -1068 11738 -384
14805c84l536j2337l671L1631L0214n042k8267j7757R590R397j9534R432Q990
$$ -384 -3920 -16257 -19928 11703 41917 36875 8608 -9149 441 9838 -9696 -264 8726
14792H726j1793M517K5671N334l1611k0536N7010N1956j8071o5366j3023k8445
$$ 8726 -3067 1450 27121 32455 844 -19692 37318 89274 71203 5837 -7186 -35631
14780c5631q719K8060J2662O7o83l9822J0125l4740k5113K6563K7453J4873J9232
$$ -35631 -44350 -16290 -3628 -3561 -4244 -44066 -33941 -68681 -93794 -67231 -39778 -24905 -5673
14767e673J2843O8330J3165o0071k0035L329l142J177p693j5153P957P863N661
$$ -5673 7170 75500 88665 28594 8559 11888 8746 9923 2230 -12923 -4966 2897 8558
14754H558P45J354j534J1781j3597k2700l9293k876K6802J3009j4124K3467J6533
$$ 8558 9303 10657 9123 20904 7307 -15393 -54686 -57562 -30760 -17751 -31875 -8408 8125
14741H125k408o642k5943R12K5286j5995L2353J065k6884J4977P227q162k0320
$$ 8125 5717 -925 -26868 -25956 -670 -16665 15688 16753 -10131 4846 12073 3911 -16409
14728a6409j7278j4920J0R616j2842J9743j775M229R883k10l6935l915L8058N138
$$ -16409 -33687 -48607 -48597 -38981 -51823 -32080 -33855 -29626 -19743 -19953 -56888 -60803 -22745 -17607
14714a7607j2700J5308M67K7043N3524P653k3321l4910k0473K1171K0536j0601
$$ -17607 -30307 -14999 -14532 12511 66035 73688 50367 15457 -5016 16155 36691 26090
14702B6090J7027p311k6854L710K0857k8504q493L4735L4708j6441m8364n1072
$$ 26090 43117 35806 8952 12662 33519 5015 -3478 31257 65965 49524 1160 -49912
14690d9912J3694M5623l715j4656J9649J0890k8178l0866j6806K9646M5413N37
$$ -49912 -36218 9405 5690 -8966 10683 21573 -6605 -37471 -54277 -24631 20782 21319
14678B1319l304m2947k2234J5642N0861M299m7992j5686L9854j5254j1268M8359
$$ 21319 18015 -24932 -47166 -31524 19337 23636 -24356 -40042 -188 -15442 -26710 21649
14666B1649K2624K6188m00j6760j4773m2188m9167l9279L1730P327J2065k1225
$$ 21649 44273 70461 70061 53301 38528 -3660 -52827 -92106 -60376 -53049 -40984 -62209
14654f2209l2509K4609M2590L2594J4625k713k1043p914k31m5997j0186J6509
$$ -62209 -94718 -70109 -27519 5075 19700 16987 -4056 -11970 -12201 -58198 -68384 -51875
14642e1875K3258L4693M719l503k486M162L8079J4233k7498r274o11J5475m6222
$$ -51875 -28617 6076 10795 7292 4806 8968 47047 61280 33782 24508 23897 39372 -6850
14629f850j7560p298j651J9897l4396j6071l1106k6586M9351R776L0702J4637
$$ -6850 -24410 -31708 -33359 -13462 -47858 -63929 -95035 -121621 -72270 -62494 -31792 -17155
14617a7155j2978O230L2094k4866L3395N7674K0490l4204p9267m711o755J3628
$$ -17155 -30133 -23903 8191 -16675 16720 74394 94884 60680 -18587 -23298 -30053 -16425
14605a6425N5148K2413J5127j935q180m1378o2390Q500R118J9355K440j6902k2184
$$ -16425 38723 61136 76263 74328 66148 24770 -37620 -29120 -20002 -647 1793 -15109 -37293
14592c7293r219l9693M7088J0732k4694Q134J6887K4029J1851K4029K6049J5339
$$ -37293 -46512 -86205 -39117 -28385 -53079 -44945 -28058 -4029 7822 31851 57900 73239
14580G3239l855j6243j5739j1623k0651J4836j1901k746k3227k7914J9742J9239
$$ 73239 69384 53141 37402 25779 5128 19964 8063 5317 -17910 -45824 -26082 -6843
14568f843J0944K0587P054j3055k9583K7068l0502j8378J9936J2602K5367L1499
$$ -6843 4101 24688 31742 18687 -10896 16172 -14330 -32708 -12772 -170 25197 56696
14556E6696l7825m6820m0086j5581M145q346L1504K2941L7672K0079j0175l2629
$$ 56696 18871 -27949 -68035 -83616 -79471 -87817 -56313 -33372 4300 24379 14204 -18425
14544a8425J2682m800l9813K0204L2806K5088k3089r672P076K121j7450l095j210
$$ -18425 -5743 -10543 -50356 -30152 2654 27742 4653 -5019 2057 4178 -13272 -16367 -17577
14531a7577K2004k1717l6868k1511K8952O833J4876J5488L8608r303J0809j7955
$$ -17577 4427 -17290 -54158 -75669 -46717 -39884 -25008 -9520 29088 19785 30594 12639
14519A2639l4660J8002j2808r776m904l6427n34L4029j3868r958L4783L093m5129
$$ 12639 -22021 -4019 -16827 -26603 -31507 -67934 -68468 -34439 -48307 -58265 -23482 -20389 -65518
14506f5518k1924J9796K6086L3918M450J3686j5775J788j3316k8481j3068J698
$$ -65518 -87442 -67646 -41560 -7642 -3192 10494 -5281 -3493 -16809 -45290 -58358 -56660
14494e6660n756N5223M4451K7072k2444o413j2409n697l5845M90J2794J4151J9787
$$ -56660 -62416 -7193 37258 64330 41886 35473 23064 17367 -18478 -17988 -5194 8957 28744
14481B8744K0503k7501k9699R658J0037j1181Q291J12n093j3230K9682l5215l4343
$$ 28744 49247 21746 -7953 1705 11742 561 8852 8964 3871 -9359 20323 -14892 -49235
14468d9235K9337K7427l0352P377N1996L6243q960L9241l4433q0198k0838J8107
$$ -49235 -19898 7529 -22823 -15446 36550 72793 63833 103074 68641 -11557 -32395 -14288
14456a4288J8612J1253j3417m601K4353O970j1774l094J9166p105L55J8553K6287
$$ -14288 4324 15577 2160 -2441 21912 28882 17108 14014 33180 26075 26430 44983 71270
14443G1270J9767k6315m6179j7519J7783k8138k9272K2511M1046l4213m952L2518
$$ 71270 91037 64722 18543 1024 18807 -9331 -38603 -16092 24954 -9259 -14211 18307
14431A8307j8468l530J9980J6120k4378j4483k870J4435J876n3775j4429N5705
$$ 18307 -161 -3691 16289 32409 8031 -6452 -9322 5113 6989 -46786 -61215 -5510
14419e510r28j2157N1270j8313K4843L3259k9477j2886k8338j2422M0366K2514
$$ -5510 -6438 -18595 32675 14362 39205 72464 42987 30101 1763 -10659 29707 52221
14407E2221l2260l547J9571J5701q284q2530K1987K5996m8586J1498J5710M9310
$$ 52221 19961 16414 35985 51686 43402 -39128 -17141 8855 -39731 -28233 -12523 36787
14395C6787M3783m4573m1644l7964j6457R637L4010J1241J7183L7904R823o3445
$$ 36787 80570 35997 -5647 -43611 -60068 -50431 -16421 -5180 12003 49907 59730 -3715
14383c715k3942P7453L4656m3837p5075L808J8940k0879l163j6929q09L9172L5020
$$ -3715 -27657 49796 84452 40615 -34460 -30652 -11712 -32591 -35754 -52683 -53492 -14320 20700
14370B0700j3122K6183j2179q21L8218K9504j0893n3633m0377o638j8678j5465
$$ 20700 7578 33761 21582 20761 58979 88483 77590 23957 -16420 -23058 -41736 -57201
14358e7201K5707J3574j9191J0792J0194P686j2323j4244K9675J5l8914J3743
$$ -57201 -31494 -17920 -37111 -26319 -16125 -8439 -20762 -35006 -5331 -5316 -44230 -30487
14346c0487o448L5412K5058l2822k0913K26k9489K666N058J6935J9931k6277l0784
$$ -30487 -36935 -1523 23535 -9287 -30200 -29974 -59463 -56797 -51739 -34804 -14873 -41150 -71934
14333g1934L1472k0169M981J8828P1271P603n054J403j8925J1067L671O514L5383
$$ -71934 -40462 -60631 -55650 -36822 34449 42052 36998 38401 19476 30543 34214 40728 76111
14320G6111k2966k9435j1732j3134j3730M1290Q138l0046M368J7986n6036P538
$$ 76111 53145 23710 11978 -1156 -14886 26404 34542 4496 8864 26850 -29186 -21648
14308b1648N0845j444j9482j0268j0478k1216J3734L5600L2434j1624m7714k9779
$$ -21648 29197 27753 8271 -1997 -12475 -33691 -19957 15643 48077 36453 -11261 -41040
14296d1040L936O0262O018j2378j0390l3387o931M6606M1509M2270k8105p8864
$$ -41040 -37104 23158 29176 16798 6408 -26979 -33910 12696 54205 96475 68370 -10494
14284a0494m6771K3021J5986K6570N9082L4190l2220n3172k115L5471O813k5874
$$ -10494 -57265 -34244 -18258 8312 67394 101584 69364 16192 14077 49548 56361 30487
14272C0487n636j8984m8593j0162K0034r020l5911J5419L8973L357j0800K7624
$$ 30487 24851 5867 -42726 -52888 -32854 -41874 -77785 -62366 -23393 -20036 -30836 -3212
14260c212k409m1723m491l041j4544J5116N2163M9801J7469q648j0074n5826P396
$$ -3212 -5621 -47344 -51835 -54876 -69420 -54304 -2141 47660 65129 56481 46407 -9419 -2023
14247b023K4457o84k7387R460J8061J1828k5693K389l9070J1930j7295j0939R652
$$ -2023 22434 21750 -5637 3823 21884 33712 8019 10408 -28662 -16732 -34027 -44966 -35314
14234c5314k0251j1758J6256K2131k16M4604O613l2832j705J6531K5586P651K7253
$$ -35314 -55565 -67323 -51067 -28936 -29152 15452 22065 -10767 -12472 4059 29645 37296 64549
14221F4549k5767j6984J7235p881m745m0931k1986k3306M9263L4158J1991l6324
$$ 64549 38782 21798 39033 31152 26407 -14524 -36510 -59816 -10553 23605 35596 -728
14209g28l5084r644K1488L9702L5858m1092m9282J975j1057K4159o8R081K7397
$$ -728 -35812 -45456 -23968 15734 51592 10500 -38782 -36807 -47864 -23705 -23773 -14692 12705
14196A2705j4399j0605k0121K2477p589K8163o426l8416J9959K4118J1300J9930
$$ 12705 -1694 -12299 -32420 -9943 -17532 10631 4205 -34211 -14252 9866 21166 41096
14184D1096j6748k5395N5575L0406n9003k1050j2976l376m692j6005k8258k834
$$ 41096 24348 -1047 54528 84934 25931 4881 -8095 -11471 -16163 -32168 -60426 -63260
14172f3260j5078K6818O5622r667J9296J3479l5601j8377J464N380N708k1713
$$ -63260 -78338 -51520 14102 4435 23731 37210 1609 -16768 -15304 -9924 -4216 -25929
14160b5929m120j9328k390j1493N995q483L046K7627N2472m492K0522Q709K4529
$$ -25929 -30049 -49377 -51767 -63260 -57265 -65748 -62702 -35075 17397 12905 33427 42136 66665
14147F6665m1420J7032J0348l7994j224L1464R99o043k1187k2600k5798l6447
$$ 66665 25245 42277 52625 14631 13407 44871 45870 39827 18640 -3960 -29758 -66205
14135f6205J4917R770J8836n821N418j798o965J9951J0962m1411J992L312j5444
$$ -66205 -51288 -41518 -22682 -28503 -23085 -24883 -31848 -11897 -935 -42346 -40354 -37042 -52486
14122e2486P519L8450K4099M8164j2634k2444R0j7204L1236Q818p4586l0101M0312
$$ -52486 -44967 -6517 17582 65746 53112 30668 30758 13554 44790 53608 -20978 -51079 -10767
14109a0767K8578K4101k1683l6451k0533O557K5018J4069j2265L1391K1085k0999
$$ -10767 17811 41912 20229 -16222 -36755 -30198 -5180 8889 -3376 28015 49100 28101
14097B8101l1694O073J0636Q602q887r42M0002O4684j9539m9256k4730k3061j1946
$$ 28101 -3593 2480 13116 21718 12831 11889 51891 116575 97036 47780 23050 -11 -11957
14084a1957L7371M4219l5109l7501J2097j0837j358J9767M0680q481k2065K177
$$ -11957 25414 69633 34524 -2977 9120 -1717 -3075 16692 57372 48891 26826 29003
14072B9003j1235m1146j2339N0663M8927L0806K0449k3870n8255l3069k6951K4019
$$ 29003 17768 -23378 -35717 14946 63873 94679 115128 91258 33003 -66 -27017 -2998
14060b998J95m285k3782j0984K2651M5531K3591o74k4415Q119K6179k7728m2136
$$ -2998 -2803 -7088 -30870 -41854 -19203 26328 49919 49245 24830 32949 59128 31400 -10736
14047a0736j6737j3677j6389K8069J7339K1884R362l9322L517n551L148O2124
$$ -10736 -27473 -41150 -57539 -29470 -12131 9753 19115 -20207 -16690 -22241 -19093 43031
14035D3031k134l6021l2481o923L0499Q891j6526l214Q947J3904q582J0225J2963
$$ 43031 40897 4876 -27605 -34528 -4029 4862 -11664 -14878 -5931 7973 -609 9616 22579
14022B2579r613J1280l1334m1942j0270L498J1450J8171M3924j9160l9566L0579
$$ 22579 12966 24246 -7088 -49030 -59300 -55802 -44352 -26181 17743 -1417 -40983 -10404
14010a0404M2410L4577N45j9131k943j4064j6410K701J1147o3838m8014j0372
$$ -10404 32006 66583 67128 47997 45054 30990 14580 17281 28428 -35410 -83424 -93796
13998i3796J5526N7827j0925q832k9115J1091j4866J4325J3832J7895l7561l5065
$$ -93796 -78270 -20443 -31368 -40200 -69315 -58224 -73090 -58765 -44933 -27038 -64599 -99664
13986i9664L9500J6609p814J1834K2816O1751r397j2496K5368k4823o6648p3340
$$ -99664 -60164 -43555 -51369 -39535 -16719 45032 35635 23139 48507 23684 -42964 -116304
13974a16304o576K7604K8642M6922L2166k9437n418j9552K4197l366j3104j8347
$$ -116304 -122880 -95276 -66634 -19712 12454 -16983 -22401 -41953 -17756 -21122 -34226 -52573
13962e2573Q549j3062K9190M3718K3053j4693K367j7931j2766m463m6041n11L2955
$$ -52573 -44024 -57086 -27896 15822 38875 24182 26549 8618 -4148 -8611 -54652 -55163 -22208
13949b2208L9501k3020l9763L1791L7237m4201k9080j6223n661K2576K7073M0273
$$ -22208 17293 -5727 -45490 -13699 23538 -20663 -49743 -65966 -71627 -49051 -21978 18295
13937A8295J6122j642k3729O260j3350K718Q212L3042K2978j6771L8175J1893
$$ 18295 34417 32775 9046 15306 1956 4674 12886 45928 68906 52135 90310 102203
13925A02203K4334m6462k0881K3921n3156j2691j511k1938m99j0639J6258j1461
$$ 102203 126537 80075 59194 83115 29959 17268 15757 -6181 -6680 -17319 -1061 -12522
13913a2522k1619M3360O2435R254k1361l4704r923j4028o120r171o171L505K3204
$$ -12522 -34141 9219 71654 80908 59547 24843 14920 892 -5228 -14399 -20570 -17065 6139
13900F139K9129J4842j1947m8043k0543J1510L2993o445j1531j2458J3870J0493
$$ 6139 35268 50110 38163 -9880 -30423 -18913 14080 7635 -3896 -16354 -2484 8009
13888H009K412M4810q621n7655K0048O131k0514J1951l5672q689L2699J1557J6412
$$ 8009 10421 55231 46610 -11045 9003 15134 -5380 6571 -29101 -37790 -5091 6466 22878
13875B2878J0850k7303L297j693p181K8453J8890K9091m7785j6450L3223j1898
$$ 22878 33728 6425 9722 8029 848 29301 48191 77282 29497 13047 46270 34372
13863C4372l114J2733P46Q744l1285j9250l6556l8211J0410L3328L8391J0016
$$ 34372 31258 43991 44737 53481 22196 2946 -33610 -71821 -61411 -28083 10308 20324
13851B0324J5198K7954M3398k7838m7853j9639l1629k1223J8238N2378j062k5045
$$ 20324 35522 63476 106874 79036 31183 11544 -20085 -41308 -23070 29308 28246 3201
13839C201j1898m761k4750J6982L1821r653j5046M4478K7638j595m1752l3629
$$ 3201 -8697 -13458 -38208 -21226 10595 942 -14104 30374 58012 56417 14665 -18964
13827a8964Q187L2219J5589M3425J8402R516K0348j9741j8746o5740m430J1278
$$ -18964 -10777 21442 37031 80456 98858 108374 128722 108981 90235 24495 20065 31343
13815C1343k3345l1445j974J6465M4795O115J3024j4153L7901J8820n5913j7941
$$ 31343 7998 -23447 -25421 -8956 35839 41954 54978 40825 78726 97546 41633 23692
13803B3692r991K8175J7162n088l2367M454l8632m8721J5133L4248q530M0734
$$ 23692 13701 41876 59038 53950 21583 26037 -12595 -61316 -46183 -11935 -20465 20269
13791B0269n869k0347K4771J212j4988o119j0558k8423J552N4957J8473o308k074
$$ 20269 14400 -5947 18824 20036 5048 -1071 -11629 -40052 -38500 16457 34930 28622 26548
13778B6548m574o842j3816n69M02m411J2724J9211J3665m018l2430K768N3741
$$ 26548 21974 15132 1316 747 1149 -3262 9462 28673 42338 38320 5890 8658 62399
13765F2399N8771J6595l4190o6632o7314q324k1360J0549r704L5285M4211k6647
$$ 62399 121170 137765 103575 36943 -30371 -38695 -60055 -49506 -59210 -23925 20286 -6361
13753f361m776K8739M446k7846O0J9309n5912k3065K484P287J9782K0102k0019
$$ -6361 -11137 17602 22048 -5798 -5738 13571 -42341 -65406 -62922 -55635 -35853 -15751 -35770
13740c5770J3534Q213J2689J8234L874j680l8678m6071q924J3700L4228N4650
$$ -35770 -22236 -14023 -1334 16900 20774 19094 -19584 -65655 -74579 -60879 -26651 27999
13728B7999K6304l156m657n3440K2609N5707K1125k8826j6453l5570k3279M378
$$ 27999 54303 51147 46490 -6950 15659 71366 92491 63665 47212 11642 -11637 -7259
13716g259q800M874l3538l925K9813M8948m965J578j4897j3653K4705M2786L1088
$$ -7259 -16059 -11185 -44723 -48648 -18835 30113 25148 26726 11829 -1824 22881 65667 96755
13703I6755k6212j0483k9986l993l3471n1674R73J4772J7697K7627N128K4594
$$ 96755 70543 60060 30074 26081 -7390 -59064 -58091 -43319 -25622 2005 7133 31727
13691C1727K8042k7851k7585N60N363K6170J4969k7406j8848j4090m0341J3549
$$ 31727 59769 31918 4333 4893 10256 36426 51395 23989 5141 -8949 -49290 -35741
13679c5741K3598M548l7230k6411N7612J0648p522J6779m949j5807j3912K1491
$$ -35741 -12143 -7595 -44825 -71236 -13624 -2976 -10498 6281 1332 -14475 -28387 -6896
13667f896K022N229L729L2525m007k9328M743R596K1361j7860J8257J7071n0738
$$ -6896 -4874 355 4084 36609 32602 3274 8017 17613 38974 21114 39371 56442 5704
13654E704n983n2367k4056L32Q727J2527K5295J1318M2224L499k3256M384p804
$$ 5704 -279 -52646 -76702 -76370 -67643 -55116 -29821 -18503 23721 27220 3964 8348 544
13641E44r674J2127J2157p912m0494J9599K9928K5224m5855j8746J6144L0569
$$ 544 -9130 2997 15154 7242 -33252 -13653 16275 41499 -4356 -23102 -6958 23611
13629B3611K360j6717k4726k796j9324k4048K0705N4140P936m3083l82l525K156
$$ 23611 25971 9254 -15472 -18268 -37592 -61640 -40935 13205 21141 -21942 -22324 -25849 -23693
13616b3693K3951K6542K1693n1966Q047K8641l3589m6724J4372M4060j9891j1592
$$ -23693 258 26800 48493 -3473 4574 33215 -374 -47098 -32726 11334 -8557 -20149
13604b0149m1745o831K3462K6390M372J6844m642J9847K1487j4956J5903O468
$$ -20149 -61894 -68725 -45263 -18873 -14501 2343 -2299 17548 39035 24079 39982 46450
13592D6450q218k3587j2338k3721O287k7955r97M011R582J0232N962j421K0300
$$ 46450 38232 14645 2307 -21414 -15127 -43082 -44079 -40068 -30486 -20254 -14292 -15713 4587
13579D587K4037k9117K3728J2097j6218P664J2411j9940k4366o877L8152m61l0757
$$ 4587 28624 -493 23235 35332 19114 26778 39189 19249 -5117 -11994 26158 25697 -5060
13566e060j1083K3604j0430k2596o327k0512k7571j5343K3504j7009r74O0791
$$ -5060 -16143 7461 -2969 -25565 -31892 -52404 -79975 -95318 -71814 -88823 -89797 -29006
13554b9006L0772j6530q359r543k2756K4656K2217j901J3013p516k4420q084R463
$$ -29006 1766 -14764 -23123 -32666 -55422 -30766 -8549 -10450 2563 -4953 -29373 -37457 -27994
13541b7994J0523j2926K1673L5898R865J8031j1780j8900l5558k0194K3239J5953
$$ -27994 -17471 -30397 -8724 27174 37039 55070 43290 24390 -11168 -31362 -8123 7830
13529G830n7319j3452N3207L4749N727q972j3446l3202M494j2247r876k1829l0510
$$ 7830 -49489 -62941 -9734 25015 30742 21770 8324 -24878 -20384 -32631 -42507 -64336 -94846
13516i4846K799K598j0559o688K3156K9542M1650r93m189j1004n1452j2505N2524
$$ -94846 -92047 -89449 -100008 -106696 -83540 -53998 -12348 -13341 -17530 -28534 -79986 -92491 -39967
13503c9967K4947L4165L5193J677k0179o053Q244j7220k1603J9410J1147L1222
$$ -39967 -15020 19145 54338 56015 35836 29783 38027 20807 -796 18614 29761 60983
13491F0983J3463o868k9631n5938m921K4160L892q221J2454k1065k2736j047L979
$$ 60983 74446 67578 37947 -17991 -22912 1248 5140 -3081 9373 -11692 -34428 -35475 -31496
13478c1496J4281M360J4426P487P48L844J0012J5890L4449j1602l3269k3129r226
$$ -31496 -17215 -12855 1571 9058 9806 13650 23662 39552 74001 62399 29130 6001 -3225
13465c225J9372J3158R844j2734k8457N377L827k3829J1302J5074P056K0982J743
$$ -3225 16147 29305 39149 26415 -2042 3335 7162 -16667 -5365 9709 16765 37747 39490
13452C9490J8136j1214L489j9423r13r716j1771N79K605l0625k1153j145L2578
$$ 39490 57626 46412 49901 30478 29565 19849 8078 8657 11262 -19363 -40516 -41661 -9083
13439i083L0161k359o979j8390n131j3859J1566m9920k484K3114K699J89j6131
$$ -9083 21078 18719 11740 -6650 -11781 -25640 -14074 -63994 -66478 -43364 -40665 -40476 -56607
13426e6607k6092K828J4247K5380q50l523J0930Q756L5963K0311r50k3555l8154
$$ -56607 -82699 -79871 -65624 -40244 -41094 -44617 -33687 -24931 11032 31343 30393 6838 -31316
13413c1316L394j3077L3575Q1101l0135m9389P383k896j4572R707q278k4848j054
$$ -31316 -27922 -40999 -7424 73677 43542 -5847 1536 -1360 -15932 -6225 -14503 -39351 -40405
13400d0405p325M662L9386j0631J611M0291M3025n3116j0399l4471m6261m6587
$$ -40405 -47730 -43068 -3682 -14313 -12702 27589 70614 17498 7099 -27372 -73633 -120220
13388a20220K8316L1726O0580J9513m9702k4747O110q983K6602j5985j4450K3952
$$ -120220 -91904 -60178 402 19915 -29787 -54534 -48424 -57407 -30805 -46790 -61240 -37288
13376c7288K3280L1392N4159R943o1547j3625K2038n3231j0745J0547N8569O4637
$$ -37288 -14008 17384 71543 81486 19939 6314 28352 -24879 -35624 -25077 33492 98129
13364I8129m7587l8707j2290J3523j5188k6318K3076M8146q735k1258j8786K7939
$$ 98129 50542 11835 -455 13068 -2120 -28438 -5362 42784 34049 12791 -5995 21944
13352B1944J0997j5632m407n881k0282p6375k7412J0912L2205J2889l4737J0157
$$ 21944 32941 17309 12902 7021 -13261 -89636 -117048 -106136 -73931 -61042 -95779 -85622
13340h5622M5345Q053L3831Q673j3539m1126Q637J1534K120J6835r090k858l1376
$$ -85622 -40277 -32224 1607 10280 -3259 -44385 -35748 -24214 -22094 -5259 -14349 -17207 -48583
13327d8583k1976J128N1727N509o5902m7775J245M5324J9348M1124K0888k0036
$$ -48583 -70559 -69431 -17704 -12195 -78097 -125872 -124627 -79303 -59955 -18831 2057 -17979
13315a7979L6028M4335j7755l6577k8115M7458R836J0237L2355P010j0689l1126
$$ -17979 18049 62384 44629 8052 -20063 27395 37231 47468 79823 86833 76144 45018
13303D5018k1489j0125j8614l9832M4477N3495q556l5087j6843r657M942j8952
$$ 45018 23529 13404 -5210 -45042 -565 52930 44374 9287 -7556 -17213 -12271 -31223
13291c1223K9501j4576K683K0980K442K8947J405j8301J4182j2121m6503l654
$$ -31223 -1722 -16298 -13615 7365 9807 38754 40159 21858 36040 23919 -22584 -26238
13279b6238P0319K912j9517n8701j8109J5886K9468m3010j1722K5622Q839k224
$$ -26238 44081 46993 27476 -31225 -49334 -33448 -3980 -46990 -58712 -33090 -24251 -26475
13267b6475j1941m2894j0490J066J0047J0274j4171K8896K8123J9339J470Q498
$$ -26475 -38416 -81310 -91800 -90734 -80687 -70413 -84584 -55688 -27565 -8226 -6756 1742
13255A742J8599J8850L935j1848k8507J8754J526l7182j3854R067J8698K7225
$$ 1742 20341 39191 43126 31278 2771 21525 23051 -14131 -27985 -18918 -220 27005
13243B7005K6722j1010l7393j4521j2003k6727k875L0204L478M9171K9019J1102
$$ 27005 53727 42717 5324 -9197 -21200 -47927 -50802 -20598 -17120 32051 61070 72172
13231G2172R075l0356o7910k9465J8980J0883K0014M9020K228l2254j9583j3423
$$ 72172 81247 50891 -17019 -46484 -27504 -16621 3393 52413 54641 22387 2804 -10619
$$ [...]
##END NTUPLES=NMR SPECTRUM
##END=
