##TITLE=Analysis number 327379
Compound Code cc 11501
Project Code adrs
Chemist Name stores
##JCAMPDX= 6.0         $$ Bruker NMR JCAMP-DX V2.0
##DATA TYPE= NMR SPECTRUM
##DATA CLASS= NTUPLES
##ORIGIN= Bruker BioSpin GmbH
##OWNER= nmr
$$ XWIN-NMR		Version 3.5
$$ Fri Mar 23 11:18:31 2007 GMT Standard Time (UT+0h)  MAYBRIDGE\nmr@NMR_250MHZ
##.OBSERVE FREQUENCY= 250.131544655141
##.OBSERVE NUCLEUS= ^1H
##.ACQUISITION MODE= SIMULTANEOUS (DQD)
##.ACQUISITION SCHEME= undefined
##.AVERAGES= 16
##.DIGITISER RES= 18
##SPECTROMETER/DATA SYSTEM= dpx250
##.PULSE SEQUENCE= zg30
##.SOLVENT NAME= DMSO
##.SHIFT REFERENCE= (INTERNAL, DMSO, 0, 16.522)
##AUDIT TRAIL= $$ (NUMBER, WHEN, WHO, WHERE, WHAT)
$$ ##TITLE= Audit trail, XWIN-NMR		Version 3.5
$$ ##JCAMPDX= 5.01
$$ ##ORIGIN= Bruker BioSpin GmbH
$$ ##OWNER= nmr
$$ C:\u/data/dgb/nmr/ADRS/1780/pdata/1/auditp.txt
$$ ##AUDIT TRAIL=  $$ (NUMBER, WHEN, WHO, WHERE, WHAT)
(   1,<2007-03-23 11:18:02.11 +000>,<MAYBRIDGE\nmr>,<NMR_250MHZ>,
      <created by zg, POWCHK disabled, PULCHK disabled
       configuration hash MD5:
       49 4B E0 1D 92 C2 6B 37 9F E6 65 BC 52 41 86 1D
       data hash MD5: 64K
       DF AD 61 0D 6D EF F0 FE D1 72 AB C9 ED D3 0A 03>)
(   2,<2007-03-23 11:18:21.30 +000>,<MAYBRIDGE\nmr>,<NMR_250MHZ>,
      <Start of raw data processing
       ef LB = 0.3 FT_mod = 6 PKNL = 1 SI = 32K 
       data hash MD5: 32K
       9A EA 38 E8 65 5F 54 32 01 EF 46 6D D1 71 85 C5>)
(   3,<2007-03-23 11:18:23.07 +000>,<MAYBRIDGE\nmr>,<NMR_250MHZ>,
      <apk 
       data hash MD5: 32K
       F8 35 E6 88 24 E9 E4 7A 65 63 11 98 BD C7 AD CE>)
(   4,<2007-03-23 11:18:23.75 +000>,<MAYBRIDGE\nmr>,<NMR_250MHZ>,
      <abs ABSG = 5 
       data hash MD5: 32K
       AC 0A D8 51 D4 B5 9A C9 6E B8 10 0B D7 CC B5 B1>)
$$ ##END=
$$ 
$$ hash MD5
$$ 75 77 91 FD F6 F0 EF 9D 9C 40 86 95 A4 49 1E EA
##$RELAX= 
##$RELAX= 
##$RELAX= 
##$RELAX= 
##$RELAX= 
##$RELAX= 
##$RELAX= 
$$ Bruker specific parameters
$$ --------------------------
##$DU= <C:\u>
##$EXPNO= 1780
##$NAME= <ADRS>
##$PROCNO= 1
##$TYPE= <nmr>
##$USER= <dgb>
##$AMP= (0..31)
100 100 100 100 100 100 100 100 100 100 100 100 100 100 100 100 100 100 
100 100 100 100 100 100 100 100 100 100 100 100 100 100 
##$AQSEQ= 0
##$AQ_mod= 3
##$AUNM= <au_zg>
##$AUTOPOS= <24 >
##$BF1= 250.13
##$BF2= 250.13
##$BF3= 250.13
##$BF4= 250.13
##$BF5= 500.13
##$BF6= 500.13
##$BF7= 500.13
##$BF8= 500.13
##$BYTORDA= 1
##$CFDGTYP= 0
##$CFRGTYP= 5
##$CHEMSTR= <none>
##$CNST= (0..31)
1 1 145 1 1 1 1 1 1 1 1 1 1 1 1 1 1 1 1 1 1 1 1 1 1 1 1 1 1 1 1 1 
##$CPDPRG= <>
##$CPDPRG1= <>
##$CPDPRG2= <>
##$CPDPRG3= <>
##$CPDPRG4= <mlev>
##$CPDPRG5= <mlev>
##$CPDPRG6= <mlev>
##$CPDPRG7= <mlev>
##$CPDPRG8= <mlev>
##$CPDPRGB= <>
##$CPDPRGT= <>
##$D= (0..31)
0 1 0 0 0 0 0 0 0 0.06 0 0 0 0 0 0 0.0002 0 0 0 0 0 0 0 0 0 0 0 0 0 0 
0 
##$DATE= 1174648680
##$DBL= (0..7)
120 120 120 120 120 120 120 120 
##$DBP= (0..7)
150 150 150 150 150 150 150 150 
##$DBP07= 0
##$DBPNAM0= <>
##$DBPNAM1= <>
##$DBPNAM2= <>
##$DBPNAM3= <>
$$ [...]
##$SUBNAM7= <"">
##$SUBNAM8= <"">
##$SUBNAM9= <"">
##$SW= 20.6930455092707
##$SWIBOX= (0..15)
0 0 3 0 0 0 0 0 0 0 0 0 0 0 0 0 
##$SW_h= 5175.983436853
##$TD= 65536
##$TD0= 1
##$TE= 683.16
##$TE2= 300
##$TE3= 300
##$TEG= 300
##$TL= (0..7)
0 120 120 120 120 120 120 120 
##$TP= (0..7)
150 150 150 150 150 150 150 150 
##$TP07= 0
##$TPNAME0= <>
##$TPNAME1= <>
##$TPNAME2= <>
##$TPNAME3= <>
##$TPNAME4= <>
##$TPNAME5= <>
##$TPNAME6= <>
##$TPNAME7= <>
##$TPOAL= (0..7)
0.5 0.5 0.5 0.5 0.5 0.5 0.5 0.5 
##$TPOFFS= (0..7)
0 0 0 0 0 0 0 0 
##$TUNHIN= 0
##$TUNHOUT= 0
##$TUNXOUT= 0
##$USERA1= <user>
##$USERA2= <user>
##$USERA3= <user>
##$USERA4= <user>
##$USERA5= <user>
##$V9= 5
##$VALIST= <valist>
##$VCLIST= <CCCCCCCCCCCCCCC>
##$VD= 0
##$VDLIST= <DDDDDDDDDDDDDDD>
##$VPLIST= <PPPPPPPPPPPPPPP>
##$VTLIST= <TTTTTTTTTTTTTTT>
##$WBST= 1024
##$WBSW= 4
##$XGAIN= (0..3)
0 0 0 0 
##$XL= 0
##$YL= 0
##$YMAX_a= 292208
##$YMIN_a= -269315
##$ZGOPTNS= <>
##$ZL1= 120
##$ZL2= 120
##$ZL3= 120
##$ZL4= 120
##$ABSF1= 16.522
##$ABSF2= -4.171173
##$ABSG= 5
##$ABSL= 3
##$ALPHA= 0
##$AQORDER= 0
##$ASSFAC= 0
##$ASSFACI= 0
##$ASSFACX= 0
##$ASSWID= 0
##$AUNMP= <proc_1d>
##$AZFE= 0.1
##$AZFW= 0.1
##$BCFW= 0
##$BC_mod= 0
##$BYTORDP= 0
##$COROFFS= 0
##$CY= 12.5
##$DATMOD= 1
##$DC= 0
##$DFILT= <>
##$DTYPP= 0
##$F1P= 14.0000005364418
##$F2P= -0.99999901652339
##$FCOR= 0.5
##$FTSIZE= 32768
##$FT_mod= 6
##$GAMMA= 0
##$GB= 0
##$INTBC= 1
##$INTSCL= 1
##$ISEN= 128
##$LB= 0.3
##$LEV0= 0
##$LPBIN= 0
##$MAXI= 10000
##$MC2= 0
##$MEAN= 0
##$ME_mod= 0
##$MI= 0
##$NCOEF= 0
##$NC_proc= -4
##$NLEV= 6
##$NOISF1= 0
##$NOISF2= 0
##$NSP= 0
##$NTH_PI= 0
##$NZP= 0
##$OFFSET= 16.522
##$PC= 1
##$PHC0= 217.9352
##$PHC1= 9.957383
##$PH_mod= 1
##$PKNL= yes
##$PPARMOD= 0
##$PSCAL= 4
##$PSIGN= 0
##$REVERSE= no
##$SF= 250.13
##$SI= 32768
##$SIGF1= 0
##$SIGF2= 0
##$SINO= 400
##$SIOLD= 32768
##$SREGLST= <1H.DMSO>
##$SSB= 0
##$STSI= 32768
##$STSR= 0
##$SW_p= 5175.98343685301
##$SYMM= 0
##$S_DEV= 0
##$TDeff= 65536
##$TDoff= 0
##$TI= <Analysis number 999999
Compound Code 99
Book Reference 9
Project Code 9>
##$TILT= no
##$TM1= 0
##$TM2= 0
##$TOPLEV= 0
##$USERP1= <user>
##$USERP2= <user>
##$USERP3= <user>
##$USERP4= <user>
##$USERP5= <user>
##$WDW= 1
##$XDIM= 32768
##$YMAX_p= 344216747
##$YMIN_p= -299118
$$ End of Bruker specific parameters
$$ ---------------------------------
##NTUPLES= NMR SPECTRUM
##VAR_NAME=  FREQUENCY,     SPECTRUM/REAL,   SPECTRUM/IMAG
##SYMBOL=    X,             R,               I
##VAR_TYPE=  INDEPENDENT,   DEPENDENT,       DEPENDENT
##VAR_FORM=  AFFN,          ASDF,            ASDF
##VAR_DIM=   32768,         32768,           32768
##UNITS=     HZ,            ARBITRARY UNITS, ARBITRARY UNITS
##FACTOR=    0.157963299565203, 1,           1
##FIRST=     4132.6476996994, 0,             0
##LAST=      -1043.33573715361, 0,           0
##MIN=       -1043.33573715361, -299118,     0
##MAX=       4132.6476996994, 344216747,     0
$$ Real data points
##PAGE= N=1
##DATA TABLE= (X++(R..R)), XYDATA
$$ [...]
29901 -30213 -76333 -36227 21241 3143 -55852 -65472 -41402 -28649 -64205 -22483 -10527 -50939
29889 -50939 -52274 -31049 47173 -2114 35889 91806 81397 42945 959 -3174 -30111 -87471
29877 -87471 -46296 27026 73760 30749 -27513 -29422 -19840 -9183 -38145 -100990 -118123 -94647
29865 -94647 -9657 45168 15910 27966 19331 22208 12911 -68853 -90645 -49683 -85990 -86407 7344
29852 7344 113009 115411 77737 22495 -46581 -76625 -70440 -54617 -69218 7702 48079 61208
29840 61208 13620 36599 130358 129097 102326 64691 49766 83596 106289 20927 -48965 -65139
29828 -65139 2819 62694 72306 28128 -20717 -65616 -126508 -22867 14443 -24833 -66620 -13805
29816 -13805 23876 23737 -23407 -67683 -28670 -67367 -94857 -8382 67793 40605 -9506 18319
29804 18319 18020 25574 14711 -21252 -50286 -23222 -2894 -45510 -39528 -13534 -42062 -7767
29792 -7767 30450 -39483 -89577 -67907 -63767 -66401 -11134 53923 103350 126296 99272 30180
29780 30180 -18640 372 35634 -5556 -43448 -30823 15634 69215 128697 112939 58507 53065
29768 53065 35047 73829 54859 -19072 -80909 -34971 -1735 -16724 -93181 -149307 -111600 -72177
29756 -72177 -31984 -5123 1416 21884 -31334 -67013 -61522 -53569 -55503 -9226 -29661 -28836 -29999
29743 -29999 -61321 -47009 -47196 -59105 9316 59861 52212 56870 72874 76622 99755 91285 104107
29730 104107 80814 110816 114745 56307 -8165 -53742 -55735 -28764 31115 78600 118240 67990
29718 67990 -11870 -40752 -45969 -34495 -65531 -63312 -46477 -41619 -43644 -6269 7772 36545
29706 36545 20283 -44279 -33220 -44141 -75539 -19780 5992 -18144 -65935 -83886 -66078 4365
29694 4365 -36074 -65118 -5109 82069 93308 14089 -8312 -21567 -10339 48210 83317 47778
29682 47778 23904 -42334 -74406 -94922 -76895 -42294 -4587 9515 -15 47142 57279 14099
29670 14099 -29941 -46416 -26748 -80610 -60349 -77733 -76090 -52286 -51967 -24145 -41461 -35850
29658 -35850 41801 91317 133304 55885 58767 85281 45865 -150 49764 45389 39836 9751
29646 9751 22720 -4579 -15393 -10843 -55729 -21231 32682 40483 56766 48238 14845 -10285
29634 -10285 -62485 -35451 7852 48568 43790 9836 -26952 -33061 -47237 -3993 107185 82235
29622 82235 52876 55614 10933 -18121 -32692 -72501 -74629 -36008 -31415 -20073 -2601 -49072
29610 -49072 -896 -9386 42472 58200 21245 -7434 -60781 -136376 -181022 -166470 -57974 -35626
29598 -35626 -12775 -24849 -7171 -2713 56298 70301 -19980 12662 14526 -104105 -134580 -91100
29586 -91100 -52752 -44657 -28462 -25558 -48662 -110171 -134303 -117103 -44265 71147 103318 124585
29574 124585 150480 81182 112117 170334 182696 233419 177004 129207 110755 55995 19825
29563 19825 6339 -19634 -71682 -99124 -136612 -130105 -63350 -32791 733 -12285 -21060 -22258
29551 -22258 -19121 66252 104015 74899 47482 32243 2092 -50159 -117998 -61343 -37596 -56319
29539 -56319 -76917 -1116 -3747 -47472 -39691 25536 22499 -111716 -117172 -117127 -133031 -68834 16902
29526 16902 -6491 24276 80119 23166 -15277 -51987 -61389 -25542 38305 74382 61653 -8578
29514 -8578 -33182 -23633 -87892 -88232 -53188 -55789 -87522 -58183 -22221 -35576 130 1962 34896
29501 34896 17492 -37420 -79363 -62902 -72454 -136155 -141360 -84846 5059 -1725 -56294 -63152
29489 -63152 -19833 49277 124786 142484 106474 67717 85165 52271 62301 66747 50845 69309
29477 69309 15413 12755 62901 54406 79930 46159 -42408 -94818 -12046 8529 38761 80137
29465 80137 44987 12862 3736 -7755 -11523 -60151 -62734 -84081 -149872 -121199 -77870 -78895
29453 -78895 8569 -19491 -11924 -8368 2880 -5878 -72107 -35333 45800 72109 63388 80632
29441 80632 96272 59636 -17859 -39417 -27912 -12851 -25002 -10876 -56909 -13991 49697 77110
29429 77110 66180 6107 -82721 -152243 -147833 -89572 -65855 -58591 5833 2599 12628 69074
29417 69074 80879 22808 65268 59831 33700 69562 98201 92049 41376 58982 85453 83616
29405 83616 72168 105138 128632 91169 71955 56162 7897 13625 -31828 -96547 -130336 -161750
29393 -161750 -130067 -53680 28484 3388 -11376 2320 -74240 -55980 -36378 -38915 -50491 -94401
29381 -94401 -108643 -49220 -49621 -10021 -5637 -71044 -23475 -4759 59834 32015 -11750 -40024
29369 -40024 -45621 -36322 -33005 8869 33717 11825 -82266 -92637 -31807 -8795 1913 21969
29357 21969 -1057 -15935 -33352 -18183 -16432 -80249 -104002 -139122 -71237 2081 653 41856
29345 41856 72818 120618 86811 61346 63446 59728 -8773 -79670 -87433 -20838 31025 -24603
29333 -24603 -43652 -17848 41274 60558 63394 -4793 -77367 -57835 12287 19481 16166 7419
29321 7419 -8011 31114 56713 20860 -4149 -32427 -27962 -12199 -17123 -8422 -52974 -53007 -60955
29308 -60955 -64366 -1506 52338 -21551 -52873 -9871 26953 95060 105865 77443 43063 -5033
29296 -5033 -9813 -35508 -45050 -80859 -61977 -95119 -88667 -58270 -6286 -70518 -114272 -114098 -55361
29283 -55361 -15980 28428 33582 51584 -23054 -77508 -65797 -61778 -90418 -118666 -96730 -17306
29271 -17306 48317 1314 -92267 -98662 -18026 39905 21443 21784 71163 103819 105977 111661 89542
29258 89542 99920 101423 88448 74512 34297 25400 43524 2549 -37510 -19357 -47720 -57295
29246 -57295 -25075 48810 63170 37575 -15917 9636 65165 93997 61157 26708 35976 67726
29234 67726 71281 25691 21641 26769 95593 187777 141686 123104 110835 102018 72152 111003
29222 111003 116073 99872 17461 -77614 -43394 -36153 -8736 -25851 -77936 -75705 -72083 16887
29210 16887 48899 19506 61541 42426 -38791 -34433 8066 -10044 30981 56382 77478 98767
29198 98767 112276 48806 49191 17052 16342 64358 57810 19356 33946 21229 -7646 355 -20381
29185 -20381 -58581 -38393 -29218 -44038 -65886 -5918 40467 87584 119697 53126 4677 3456
29173 3456 8192 1043 -17064 997 44109 38571 42822 35318 35840 42812 76757 149321 130307
29160 130307 24046 -55669 27108 28742 -64038 -57972 -38771 -4755 44613 59307 26054 98906
29148 98906 93415 27916 -18146 19094 12529 -39217 -33037 41851 61107 16060 39440 63359
29136 63359 77771 81150 77776 43386 -2761 2794 -15782 -9755 -17967 231 12858 -19134 -10527
29123 -10527 -1579 3124 -24974 -48450 -72697 -48805 27376 5644 -17415 2506 27360 33031
29111 33031 7449 42327 75697 61018 -18887 -42575 -32133 -32793 -82416 -56950 -51712 -124649
29099 -124649 -102785 -65210 -18841 13944 41526 1861 -2767 -22273 22862 -9493 -11593 -3447
29087 -3447 -40145 -21358 33581 -49034 -94066 -72005 -41803 -45515 -21560 12917 36812 47332
29075 47332 -8494 -34607 1863 9000 -26619 -47108 12488 15745 -3408 66737 66752 54291 -6528
29062 -6528 -37353 -48740 -90626 -62398 -89475 -82901 -67468 -30293 7467 -8665 2907 8482
29050 8482 -50300 -62568 9283 58171 86089 80458 63099 81767 42426 65147 97832 14258
29038 14258 2987 101362 132263 86398 60637 62470 120653 151514 120260 77851 26291 -12466
29026 -12466 -35505 -35469 23289 88012 84178 75422 106374 46016 36812 67047 51231 13197 24648
29013 24648 73105 89749 87922 121923 150098 101175 68531 -26848 -34687 -98913 -117202 -82701
29001 -82701 -124590 -95030 -52722 -59654 -90682 -55055 -34824 4018 510 -49787 -104765 -18931
28989 -18931 4481 28510 15383 -30161 -57715 -107631 -94177 -45023 -10755 7856 -26482 -31004
28977 -31004 -26567 15621 84874 124720 91377 77943 21136 -42067 -3841 -31969 -25355 -6243
28965 -6243 2079 62775 22444 -21296 -31531 -61944 -38520 -40706 -50385 -73734 -88815 -53712
28953 -53712 -1086 27883 31180 53584 22572 -21507 -76612 -92255 -84077 -83329 -53068 -47381 -14125
28940 -14125 47769 120409 182839 142978 118211 100382 51003 14776 14033 11081 -39202 -30186
28928 -30186 37763 58777 81598 71815 21046 -4327 45446 2433 -15419 26414 -11137 27283
28916 27283 37111 8464 7730 -4532 21194 68914 62595 65587 92291 87532 53927 39152 91777
28903 91777 94415 88887 75888 55979 31404 2527 55871 124634 127975 62266 60797 61480 62380
28890 62380 73064 28124 11726 -37782 -7007 37369 23014 68670 2328 -47898 -70975 -33395
28878 -33395 -6207 24622 38238 27488 45359 75502 174977 208272 98197 75261 27973
28867 27973 17721 8765 -53498 -90070 -52270 -42538 -9962 -4215 -2852 17551 29442 7325
28855 7325 55894 13807 -19134 14827 46694 9123 -4354 18938 -32829 -28355 4552 21288
28843 21288 43166 67306 82017 83260 38659 103482 124871 23219 -26376 -58431 -52793 19959
28831 19959 162795 137508 134279 78944 74184 63830 13149 -42735 -142406 -105940 -20072 61890
28819 61890 45233 44845 97263 136890 132257 79988 157249 164023 132677 64841 25462 -70662
28807 -70662 -70602 -5992 38229 -28384 -73456 -49486 37528 29874 -2861 -17537 -67551 15215
28795 15215 -4838 -27576 -2639 2408 71864 99902 39818 67311 80158 99591 138358 184460
28783 184460 129395 33212 -68600 -31218 57922 72197 45831 2233 24878 69902 145232
28772 145232 221431 234447 205208 165958 85220 -21647 -13969 -25560 -40457 48156 110243
28761 110243 23390 -13666 -49513 -48162 -7822 45344 59135 32450 18044 2949 -30600 79328
28749 79328 99213 126754 101176 56998 45515 29821 -11660 -21571 -73308 -55824 -44482 -14179
28737 -14179 49911 23332 25219 -23870 -44142 -17457 9730 17188 -11911 10088 70245 64181
28725 64181 67906 55048 -12061 34527 128689 121176 57866 88926 138488 66258 77925 126717
28713 126717 147948 140683 116603 143168 126803 94120 17836 -5032 5248 -5961 26098 49555
28701 49555 73489 72265 41746 24127 14471 4964 -21783 -37361 1722 68564 35544 26515
28689 26515 61560 -782 7156 45041 100931 78855 20299 44045 112637 114178 116903 112240
28677 112240 70161 51242 92655 120975 123883 109482 94388 104517 72188 72798 29345 -25155
28665 -25155 -40505 -90534 -58841 23431 65655 110335 105879 204077 195151 138865 79772 75259
28653 75259 51948 55636 32256 14671 100894 164731 169181 202650 208322 169545 185810 241163
28641 241163 210556 108886 119169 161776 163188 222134 192716 110551 58894 68912 82147
28630 82147 119000 122802 125656 116939 89991 47640 45190 15320 34916 55375 98302 72794
28618 72794 39521 21089 -10236 -16452 -4092 47731 62550 33487 80414 114856 114738 97052
28606 97052 147494 158922 229363 151952 106557 130281 112267 52928 64640 83920 96005 121000
28594 121000 91277 16469 30846 4381 -19091 1018 90333 151573 131976 97819 40048
28583 40048 50025 76706 60985 67572 65463 19201 -1477 28298 43702 43026 43415 15729 -6336
28570 -6336 10775 30257 49353 30009 24482 -2341 -31207 -31268 -2888 25003 30555 -21641 -60328
28557 -60328 -13730 41018 63557 10111 22492 75969 81959 27719 19336 79713 76045 32425
28545 32425 55159 130377 148740 93891 63696 70333 127382 176191 142482 179923 161761 115915
28533 115915 71259 -618 -25209 -34238 17151 6372 6247 -23031 -328 38473 7505 -8558
28521 -8558 -18096 -47399 -13204 24282 55379 100325 173893 140873 91899 89806 100238 144596
28509 144596 120388 112080 90651 22588 8004 68540 172614 258665 216701 196609 180922
28498 180922 104779 24428 -5306 -20308 26649 131520 102011 130483 114750 9584 -21469
28487 -21469 62647 102234 110883 69321 88213 79128 88073 132641 183574 123802 121881 172535
28475 172535 85243 32304 -4082 26543 22783 49041 81794 103224 87272 81685 80287 79356
28463 79356 98576 64343 130293 149182 119091 122779 96217 112221 116340 163775 81866 66763
28451 66763 62247 82755 49810 -10919 20402 91957 79083 88409 73685 59778 27155 80608
28439 80608 111910 59917 55456 91040 126351 100293 98253 91027 82606 91396 39528 17537 140816
28426 140816 139426 120570 64740 82956 85087 59384 79913 103783 137377 136764 120540 133381
28414 133381 156992 134009 125327 121275 81436 109550 84716 48257 8610 22825 14993 44502
28402 44502 82472 76104 30746 -33003 41827 109307 136587 145053 89777 74381 35720 24800
28390 24800 73803 162490 94256 51446 26886 56524 62397 56499 31944 18355 4764 6044
28378 6044 66990 48857 50611 60137 39693 3525 46403 26539 63112 103662 150171 184631
28366 184631 221750 172627 183005 125256 94112 135788 170849 159770 167470 103169 71743 78564
28354 78564 104141 141207 130563 113587 145141 152899 143442 121797 157475 146347 194427 151883
28342 151883 88711 177329 214355 262960 236018 158403 121883 114148 118362 67516 8530 -36908
28330 -36908 668 63136 123219 159292 111991 137419 150830 176758 198220 156659 112365 98626
28318 98626 130229 147597 54817 17490 42352 20210 56718 103776 122447 115612 114706 106321
28306 106321 95742 147015 99231 76899 30142 50055 101439 117821 148387 176654 204499
28295 204499 181412 114805 60669 113059 148990 182988 242265 278645 318152 240547 237216 220138
28283 220138 175626 163553 211006 279458 294740 247369 270605 267949 272663 236170 160669 133103
28271 133103 157123 158212 146856 136006 87662 128754 104598 84104 112843 138754 193498 224531
28259 224531 241866 212415 183133 133767 165335 213157 192306 172920 182631 152057 72576 115584
28247 115584 136543 95145 69872 101804 113137 89316 137096 137310 132338 206135 283331 237361
28235 237361 199288 218835 172043 186747 268380 269132 182736 148756 171170 169860 175243 241221
28223 241221 254758 247801 284767 305349 289331 278644 195316 180230 191974 159878 206695 224946
28211 224946 237045 265667 245753 212000 205531 226572 203214 168567 144678 172169 182345 202636
28199 202636 242352 187717 131929 108205 129852 151895 187020 225660 243360 202025 197868 198047
28187 198047 207607 195522 214069 208385 211564 269605 305026 226556 164089 173259 256294 335236
28175 335236 334439 273932 211401 175258 196337 241075 246661 220455 254259 298795 289078 218418
28163 218418 205060 241676 211177 261197 265689 276510 259824 260460 228854 226248 213160 199732
28151 199732 175412 155466 132315 159434 191719 187608 181905 197160 220148 257191 259559 211468
28139 211468 219634 242469 276139 264805 278054 248045 231262 120936 78227 202117 282176
28128 282176 280157 252234 197196 232482 282692 273865 282817 233725 264946 332910 344815 280315
28116 280315 214423 251923 314618 273235 275574 278967 213833 177835 131523 182925 267620 292290
28104 292290 236253 233922 283036 269878 258148 214695 262503 280260 313978 373938 367388 369912
28092 369912 353078 349269 326248 324602 313214 302522 282322 306554 394413 388065 356445 292713
28080 292713 324223 374852 281877 231475 279321 265888 283146 275330 288374 338733 415166 366171
28068 366171 328635 373348 382684 359184 351241 309199 313344 335700 383817 387803 345872 267116
28056 267116 265494 323176 379720 429584 439556 432926 390506 336432 302384 345413 367304 344835
28044 344835 338583 338860 395812 408123 385807 362567 396131 386591 384779 367048 409096 424269
28032 424269 416293 383642 375326 443037 485258 463406 438634 382623 354079 316782 368361 416564
28020 416564 420603 391601 303826 268852 343268 356854 368487 396780 357669 338171 314651 242468
28008 242468 231063 239334 316696 357314 411932 526288 522022 501407 436840 387368 413523 380911
27996 380911 391022 377992 369999 317046 333240 449096 524334 456333 368774 397627 395700 470857
27984 470857 434222 356797 335053 314545 382957 387675 337871 349561 367485 327619 381163 417824
27972 417824 448898 482429 463116 428179 419743 427605 455928 422694 421174 421320 380749 402148
27960 402148 460186 523491 554586 563904 573044 554954 521425 530103 522522 529893 567338 583691
27948 583691 597134 557497 557219 527527 569191 610036 610020 525984 500167 509234 533045 487248 522695
27935 522695 541565 549542 509225 506476 518350 595988 607306 572380 525836 475833 459790 422310
27923 422310 519262 602103 598925 562626 513390 456930 486716 456371 423103 452483 516903 581173
27911 581173 552815 544213 526015 579305 587247 548769 538642 540498 586466 597838 658582 663846
27899 663846 627761 599801 584833 608478 600519 610709 565017 557811 608022 683902 666197 651163
27887 651163 621784 698395 746212 709754 638200 593150 607469 650253 679710 697493 715265
27876 715265 709214 599578 561436 589720 632822 660769 588665 609681 647717 702049 721450
27865 721450 688196 657035 683955 700872 784110 813928 807764 738055 714998 657473 673049 730217
27853 730217 795845 821103 781916 717464 719383 813452 876342 813361 779588 822052 829769 830743
27841 830743 840221 760378 729010 738432 710105 799122 799182 764711 859956 951379 857466 775582
27829 775582 794653 810781 850710 899688 854579 869577 884115 873456 909162 893661 926600
27818 926600 932576 898212 891177 926184 979107 886854 906923 894267 878793 863267 885284 898037
27806 898037 913015 931446 978958 979953 1060170 1046359 969760 910192 937809 937905 1003652 1089336
27794 1089336 1059826 1036109 1100357 1095230 1065378 1025670 1028735 1000341 1017967 1063543 1062154 1077218
27782 1077218 1111296 1098904 1103471 1160126 1169595 1129076 1137320 1128956 1196676 1230675 1196009 1157689
27770 1157689 1177364 1198633 1159879 1174753 1147909 1202523 1233351 1231875 1257214 1265868 1305952 1325288
27758 1325288 1334286 1277443 1259367 1252915 1254397 1307431 1327690 1305981 1307358 1305486 1377921 1358326
27746 1358326 1333437 1324042 1324679 1319012 1323156 1409211 1520865 1567622 1513049 1483816 1473346 1469161
27734 1469161 1490867 1520878 1519572 1485301 1462852 1462277 1514599 1533286 1577502 1587629 1584252 1580335
27722 1580335 1583926 1561723 1574991 1574702 1585028 1626214 1627321 1569666 1588118 1607813 1681313 1714787
27710 1714787 1690625 1708562 1740276 1778697 1806413 1765833 1780512 1792202 1780863 1773508 1790506
27699 1790506 1789897 1765180 1853148 1930155 1914276 1934877 1944976 1990470 2030958 2064050 2019600 2006429
27687 2006429 2042035 2005206 2015083 2054837 2018131 2026023 2022236 2020723 2035623 2097807 2128837 2154913
27675 2154913 2126424 2203335 2236940 2268573 2246442 2176988 2216858 2304190 2342197 2306607 2289850
27664 2289850 2317564 2387634 2432952 2460350 2484827 2458292 2404756 2375049 2330619 2342743 2382113
27653 2382113 2494315 2545023 2550825 2555662 2591761 2636810 2615541 2614246 2682806 2750389 2796197 2773497
27641 2773497 2767596 2734583 2750575 2815690 2817880 2841000 2897316 2908944 2861614 2867550 2816171 2788099
27629 2788099 2750018 2797692 2961484 3095174 3215754 3207882 3230754 3213147 3238763 3247079 3236747
27618 3236747 3244742 3255553 3257477 3262306 3296968 3330691 3380119 3405885 3450162 3508037 3589683 3684881
27606 3684881 3660788 3576567 3524617 3575774 3651459 3714977 3748347 3737963 3724028 3760616 3738777
27595 3738777 3751070 3809511 3850251 3876329 3862017 3860476 3914997 3994201 4049203 4018792 4015166 4039066
27583 4039066 4071833 4095657 4174548 4254109 4313271 4245424 4223487 4321406 4319664 4354956 4427833
27572 4427833 4476444 4461275 4479549 4541899 4633334 4667061 4677908 4644136 4658928 4701296 4648757
27561 4648757 4661339 4727399 4802592 4870092 4926061 4911986 4817855 4785994 4844879 4979438 4977923
27550 4977923 5012320 5061373 5066550 5119697 5181293 5147336 5144306 5179338 5228223 5234898 5190869 5244455
27538 5244455 5353242 5415583 5486447 5518829 5440269 5413775 5456736 5496902 5500771 5580200 5594137
27527 5594137 5638768 5701885 5732601 5694937 5658324 5685004 5723974 5670527 5672786 5708255 5722330
27516 5722330 5741503 5757227 5792100 5780387 5801987 5835816 5857235 5822949 5892905 5903440 5821755
27505 5821755 5794442 5855211 5876439 5857357 5865891 5900268 5947959 5925186 5911081 5878788 5845952
27494 5845952 5824128 5816159 5880969 5924540 5830953 5777579 5834661 5945409 5940772 5930348 5914886
27483 5914886 5902592 5885212 5835800 5866654 5905097 5903363 5879978 5841506 5855863 5888015 5909694
27472 5909694 5836581 5762788 5744256 5670930 5668103 5689696 5658554 5730352 5842210 5889928 5831606
27461 5831606 5708900 5706992 5730096 5682556 5610641 5561324 5575337 5551132 5492673 5476708 5445766
27450 5445766 5466545 5509844 5462333 5393426 5420025 5438965 5345343 5251174 5250241 5274604 5208575 5175836
27438 5175836 5196321 5181505 5145428 5076903 5027131 5027887 5044595 5050697 5045689 5045309 5016946 4965259
27426 4965259 4921051 4918690 4890679 4871375 4834102 4795849 4713467 4661634 4607432 4527676 4540258
27415 4540258 4559084 4550259 4524756 4550728 4509482 4418049 4461244 4458836 4402774 4362493 4279703 4232696
27403 4232696 4226775 4214783 4166978 4143714 4125683 4146896 4161570 4123552 4089669 4076901 4023860
27392 4023860 3982929 3900755 3824697 3810217 3811906 3815800 3778782 3716610 3712973 3728313 3742926 3719885
27380 3719885 3669826 3666173 3630294 3566070 3595589 3636801 3586542 3572837 3560000 3527397 3491778
27369 3491778 3467002 3380854 3393733 3403649 3433754 3380261 3337735 3326291 3326206 3279374 3233484 3215327
27357 3215327 3180937 3155583 3175098 3193301 3132607 3128481 3122404 3052359 2955193 2897378 2903585 2925756
27345 2925756 2873866 2788854 2774658 2765128 2741195 2739133 2757748 2701108 2699685 2668543 2649161 2676334
27333 2676334 2629581 2573554 2506496 2454428 2416476 2477462 2476765 2470921 2450408 2373373 2445416 2476805
27321 2476805 2439001 2431611 2372313 2354059 2312926 2291609 2336600 2299449 2254149 2264028 2295963 2261381
27309 2261381 2196884 2258737 2263355 2232111 2210930 2104127 2082754 2128736 2139420 2117020 2109665
27298 2109665 2119240 2083370 2061221 2013784 2008532 2006439 2045902 2054810 2078965 2093145 2061832 2034187
27286 2034187 2024489 2006026 1961044 1927170 1910349 1914634 1885806 1905050 1993552 1962742 1844711
27275 1844711 1811993 1808637 1739089 1696780 1714720 1713639 1688166 1706949 1641700 1514540 1508664 1540887
27263 1540887 1608269 1628514 1689916 1679653 1654596 1609286 1564693 1537980 1608722 1654396 1665347
27252 1665347 1619966 1565772 1506333 1449865 1435280 1388377 1438589 1443940 1380064 1352216 1359163 1426986
27240 1426986 1497421 1485718 1426187 1435805 1390815 1389499 1369626 1256895 1291938 1328065 1347661
27229 1347661 1361947 1376061 1366457 1350532 1308690 1326772 1299578 1232973 1201919 1204417 1209955 1157438
27217 1157438 1175346 1259584 1324481 1275572 1209917 1159713 1127863 1129599 1150493 1163274 1153169
27206 1153169 1141044 1113121 1090768 1110590 1155969 1122319 1153997 1128554 1066725 1076842 1098039
27195 1098039 1022445 970867 957398 942748 970240 991316 995008 1035355 1080976 1073950 1032409 1042898
27183 1042898 1062187 1009821 1004573 980939 988494 987075 972930 987450 948116 976726 957495 914604
27171 914604 861858 830519 815040 858126 846174 868088 912229 921114 853117 798799 839783 813032
27159 813032 807527 830995 891716 899209 870413 834951 821371 791122 762776 787935 798425 773150
27147 773150 746768 793667 800909 775794 793673 790949 792874 786459 759175 772250 799173 814916
27135 814916 779088 751460 748967 733583 718621 702984 693403 723178 727548 705534 636748 584035
27123 584035 586631 622768 677193 677855 662439 638889 652272 650711 649699 656441 690808 786898 810220
27110 810220 739569 698685 770197 806322 753602 774552 732873 695782 669505 710371 741364
27099 741364 724403 716137 667446 670003 622471 615574 685455 677361 646255 636599 736723 737569 608323
27086 608323 608081 544990 576797 584853 602515 693504 645809 607125 608620 597707 669415 706647
27074 706647 641880 606866 651287 666451 701077 687043 599686 568650 563562 556790 589431 617243
27062 617243 532472 508939 550733 532667 532868 514272 459065 445198 539787 537253 537833 522260
27050 522260 498609 530814 525722 526094 537151 409297 380980 370694 331654 409653 476107 530602
27038 530602 517294 496438 473063 430701 432590 479886 494314 546047 546001 536300 489318 482207 476592
27025 476592 494420 433813 311065 302328 296230 258220 253886 326391 455166 532853 488058 434580
27013 434580 423685 438561 530954 542223 480875 508646 539268 532086 466925 460852 438182 424914
27001 424914 458481 441734 410831 381842 359120 334072 345677 364519 384771 411203 440016
26990 440016 382027 316411 304634 384373 390134 402313 423481 466095 429167 381458 437356 456016
26978 456016 436144 394738 358822 388228 338901 323024 362007 387166 369871 357153 382238
26967 382238 373696 416100 467969 504922 583784 561577 464416 481049 444023 478328 427522 434080
26955 434080 443555 449501 408695 416509 401491 408746 451368 450534 381495 355295 469306 491650
26943 491650 480344 420712 345885 335299 320965 292422 342392 365862 357013 335074 350532 329114
26931 329114 362651 407116 397796 374549 342502 281862 237919 246110 321889 298896 359322 384964
26919 384964 308417 234773 219919 219219 238549 265660 319954 329369 248627 222772 287617 380161
26907 380161 349587 329162 309451 293113 279354 304993 290481 287632 318792 382512 451906 430551
26895 430551 364933 326816 365639 377720 302272 282048 273264 234528 250892 197760 165698 146077
26883 146077 141987 186443 163027 131851 140948 195712 245446 283788 325088 378477 338930 305803
26871 305803 321604 305459 221986 239235 238991 210960 256183 266069 203275 198172 275806 314713
26859 314713 235080 189987 213458 251610 255432 264541 331590 323865 256229 245586 263113 260552
26847 260552 228209 220228 185782 172079 201734 226692 269780 257296 200729 212594 130883 20942
26835 20942 95385 178706 180226 150056 160207 192184 244387 247826 232319 200227 215940 272245
26823 272245 261931 232908 162489 124211 142910 182408 161101 148965 207629 203643 151433 127784
26811 127784 163662 219696 169735 209988 191093 163556 209953 221202 199498 140271 127057
26800 127057 137078 214632 293812 267431 270455 200646 211443 205890 176273 197872 174930 115164
26788 115164 38273 40033 102930 150390 137429 132641 151715 183260 268284 316859 245826 185234
26776 185234 137094 167905 153535 112292 98403 96269 127113 192711 223478 235266 236665 247859
26764 247859 227468 209576 180206 255129 200817 113679 33939 88775 125129 197776 218005
26753 218005 265199 256513 257683 232893 169047 168803 181124 197810 156893 153552 137600 108393
26741 108393 126413 132299 153684 180307 157978 172666 180294 144276 143926 145715 171723 207148
26729 207148 188036 197157 210867 166171 142259 223705 281926 268190 221527 268582 279800 215377
26717 215377 150849 125707 159826 163553 124388 147286 178275 202372 146248 134291 164151 189920
26705 189920 183709 157193 196112 254618 250933 233596 204200 163465 156762 126399 171190 208981
26693 208981 211745 209713 188513 158888 165581 202789 185449 239334 250995 163604 162723 150007
26681 150007 152826 169469 193617 163430 124574 94287 144787 206868 263703 253475 249258 253101
26669 253101 234567 200811 142273 117805 111293 92927 105124 106297 148058 153388 150087 209373
26657 209373 223444 215304 214397 235014 251979 224454 204267 266137 284244 210136 165314 145724
26645 145724 87931 108194 176955 138575 63676 109749 164150 167690 84605 94557 97982 52101
26633 52101 70119 114266 152605 170534 194706 157433 124317 72258 52599 42024 97317 143108
26621 143108 146437 141597 164360 188853 230510 268609 244977 191813 214904 165468 92538 100284
26609 100284 100875 94061 58727 93857 119334 125480 92095 33659 54392 93982 142070 88742
26597 88742 108098 103513 104086 71857 9736 -11491 43941 59272 120086 192774 187302 130627
26585 130627 149400 136267 115872 153647 125512 142481 154163 171323 102655 73779 79671 156202
26573 156202 221116 193568 170128 200306 203215 219049 179159 85151 -23107 -88215 -42503
26562 -42503 68450 139359 109373 82965 139480 115413 114835 141262 105265 59451 24842 55357
26550 55357 131958 133251 58722 40628 82822 180126 182288 112842 78438 98235 69734 167198
26538 167198 195007 229032 192294 157797 161239 128707 78867 23404 78810 99491 84524 104951
26526 104951 132784 74141 50417 110804 168726 102933 -646 -4705 49779 69948 107026
26515 107026 97999 119481 169236 133365 29384 30107 97925 152291 150581 93630 23032 64421
26503 64421 94768 22447 18312 92481 155630 204230 214060 193340 170784 151631 133835 153283
26491 153283 163502 179959 188514 121219 105120 130934 163788 167505 190967 127495 112203 139938
26479 139938 117872 65166 68633 56884 98071 144717 121761 149943 212910 165249 121839 80371
26467 80371 32348 118409 196846 184112 130124 146531 183275 154562 195235 261541 250438 214671
26455 214671 150320 162806 191940 131755 88024 56903 19913 20587 17538 72553 92324 121403
26443 121403 134266 34594 -3190 5418 1058 6744 2808 23770 47099 69748 80519 30695
26431 30695 6879 16411 45936 46037 16256 4908 24057 13052 77188 76975 86904 50420 82227
26418 82227 89030 106456 138718 182369 183677 112983 73766 28356 55981 35349 40464 80992
26406 80992 88758 77318 76747 58553 29118 25586 42807 42649 43977 -5972 -28944 -28693 -4216
26393 -4216 21550 93519 134577 107892 97560 97572 123796 85102 96470 139234 95728 46288
26381 46288 -16393 -36112 -13365 77396 144695 185558 169868 141581 78908 17193 29977 47900
26369 47900 73638 70630 76642 70704 46005 15904 80948 125978 127356 107394 96889 103163 96512
26356 96512 99437 115013 104646 75024 36347 38162 37989 7419 55174 115271 78728 1064
26344 1064 17134 77553 62173 67911 106334 153673 179920 141060 61296 59203 143756 103763
26332 103763 31505 -10700 14934 -1719 -21954 63946 80521 61124 49687 39238 10478
26321 10478 59497 69510 52235 50435 37845 44976 102791 93128 53061 87972 94226 70023
26309 70023 59415 7922 -13603 25486 70278 18131 5444 56878 91032 169409 203347 113688
26297 113688 62649 93004 71596 104706 143050 141307 195475 168155 116635 71307 72318 90852
26285 90852 56918 36757 89341 54322 18249 15320 22032 1796 -6417 25808 27881 6905
26273 6905 -34753 -41827 -38766 -35520 -69309 -71499 -5563 -11424 -5106 22965 37944 21239 -48607
26260 -48607 -30095 -27816 -21663 -25501 -9530 40869 87074 144684 127474 120109 138942 158849
26248 158849 124880 153925 141640 95729 55120 1434 24072 48099 1197 19945 60271
26237 60271 66279 29908 27396 35210 40545 53521 48658 -2849 -73673 32099 76997 85933 42099
26224 42099 12979 -28494 -58755 -68478 -9970 39491 66200 36274 -10376 -13464 -5101 18386
26212 18386 38816 37923 35372 24840 60726 60987 22961 -19732 -13746 -27080 -30576 -16413 20213
26199 20213 63160 110440 133089 49166 47437 102460 99073 16643 33557 11432 -25809 -16309
26187 -16309 -30140 12444 -10713 -29029 -5667 67219 125160 32212 15943 -16386 -81304 -109516
26175 -109516 -19346 56957 17298 -63683 -45864 -66672 -85454 -81261 -50737 -43074 -111768 -87309
26163 -87309 -56144 -97198 -131518 -98209 -41595 40587 53129 85474 120164 84046 92657 38493
26151 38493 17864 97480 127786 140689 124317 76162 114479 135685 113728 65561 12272 12968
26139 12968 56417 115041 97320 46090 35856 63233 56845 106716 165082 187720 122551 48159
26127 48159 -6389 35638 56167 22577 85089 133923 107644 80538 64422 -5121 -35515 -29566
26115 -29566 -10899 -29178 -53430 -58011 -14195 37736 53107 68082 161930 152533 121488 -6526
26103 -6526 -59096 8977 60544 13338 35724 38912 7723 -28112 -37455 12121 18109 7723
26091 7723 28661 52515 23002 4203 84422 64388 14227 35208 12704 10056 61015 65146
26079 65146 30469 -28963 -84524 -88448 -66601 3226 32143 54170 949 47851 54687 54487
26067 54487 73130 340 538 16762 97920 83464 45287 53576 57964 37093 -25144 -40034
26055 -40034 -11650 719 -30080 -16700 -45512 -22382 -36694 -29029 -10844 -14448 -23758 -105213
26043 -105213 -57762 -15662 -38422 -31743 10063 38031 9677 -46967 -81379 -94623 9219
26032 9219 34464 -22508 -38497 -24978 20409 33972 25913 37325 36285 6895 -32944 -21279
26020 -21279 -8102 28351 22921 -20022 -121638 -81933 -68153 -95088 -54121 639 24482 9347
26008 9347 12582 47014 -4616 -25771 -16600 -13380 31658 -12044 -9719 -6190 46980 88740 92495
25995 92495 115728 126851 102901 -19699 -53147 -96396 -45375 15528 87941 126450 103391
25984 103391 80823 65586 18829 -1832 11641 5294 37488 57411 69997 184328 204028
25973 204028 176218 135585 113900 51053 19066 41670 7204 -44255 -21523 28529 29089 27788
25961 27788 4449 -28868 66855 107660 120621 20112 -38124 39117 60154 27901 32013 -6801
25949 -6801 62584 112032 93289 69645 37238 42915 57552 63531 62705 71561 25913 5893 22748
25936 22748 30518 -25183 -84282 -71784 -71848 -74787 -50403 -100149 -85311 -72033 -34784 -47686 -92072
25923 -92072 -43391 13535 -11040 -44405 1005 -1 37185 60416 98503 100108 137136 108826
25911 108826 52326 21661 53592 -13530 -36715 -49157 -421 18154 -476 10964 16027 53010
25899 53010 83604 46717 3939 -10953 -53765 -34792 76780 180486 160132 110878 66349
25888 66349 -21847 -14869 1934 -22453 -16745 27051 36117 25827 -16596 -35854 -9153 -60113
25876 -60113 7424 7206 33045 26057 1855 52038 88251 78967 18216 -60972 -141549 -152811
25864 -152811 -98398 -37447 -94672 -110203 -37073 -19879 -40946 -24186 -42596 -89685 -83918 -45325
25852 -45325 7417 102426 64888 37296 -25245 -50767 -51146 -37588 39268 107999 77743 24364
25840 24364 22924 -38438 -10357 51623 59619 26948 -1344 -14830 -9414 27281 7679 -10461
25828 -10461 760 -2398 -15759 -89270 -78736 -107985 -104636 -38968 -15786 14331 63622 120620
25816 120620 112761 81288 93512 127684 193480 164409 82255 74088 45902 14401 44176 1660
25804 1660 -72856 -104865 -89831 -53791 -33928 -37985 4300 -9047 48257 98317 88793 110158
25792 110158 29465 8504 9470 73528 106439 67608 59553 39375 15280 13711 14210 82249 127109
25779 127109 142186 93962 62917 74318 55730 41163 4941 -41891 -116199 -159960 -76923
25768 -76923 -44755 2564 31264 16342 -19121 -32929 -71327 -62363 -43700 -12129 48296 81754
25756 81754 99261 60858 -3371 -52506 -30687 9396 21895 11474 -2898 13996 45703 -24346
25744 -24346 -41200 37064 106091 111515 33094 11210 38647 29330 40790 26159 -60007 -109098
25732 -109098 -80006 -35964 -40042 -15957 44812 16193 -34870 46057 74139 27574 -16634 15310
25720 15310 63103 45848 -23034 -64398 -31884 12864 42900 54728 5784 -82266 -114059 -20247
25708 -20247 -29665 16874 17481 5634 48451 46519 17990 14149 42163 101611 80358 70938 6891
25695 6891 -19214 20444 104305 59533 64640 72086 42900 38381 -33421 -51519 -55765 -93105 -101032
25682 -101032 -90827 -115856 -99566 -9124 51805 41729 14996 40024 -26347 -14050 19233
25671 19233 32996 -53818 -97813 -88187 -49709 -57789 -37190 42676 29984 8143 91071 71041
25659 71041 -21999 -3121 38663 98203 92521 105765 136048 102110 70282 78033 32017 2416
25647 2416 -1804 -17740 13363 35711 26623 4901 8088 -5940 -98 5658 4499 13645 4845
25634 4845 33454 51259 58531 7184 11076 -26689 -87702 -133819 -145463 -150879 -77404 -124622
25622 -124622 -161878 -92164 -17144 -14643 -54624 -111283 -98617 -37264 25839 9321 4526 20072
25610 20072 47943 35908 14421 -34635 -67178 -74407 -77407 -63365 -50419 -43459 -41591 -5621
25598 -5621 -29841 -21765 -3156 34745 43982 33310 13020 -19706 -17033 -9224 99969 68909
25586 68909 58306 32106 -22725 -3900 33604 32196 41835 98341 167143 144673 38195 -16917
25574 -16917 -9802 -3467 -10457 22651 45317 40107 4974 -92628 -89938 -52527 21302 12358 -86301
25561 -86301 -111563 -134594 -10878 13532 -52873 -37417 -35738 -36640 -52389 -24940 24522 -60939
25549 -60939 -46101 -90317 -32543 17673 37253 15407 79810 141464 109791 51313 -2340 25399
25537 25399 15449 11298 38928 90490 57089 75824 86447 69892 -45886 -137756 -100409 -66304
25525 -66304 -92679 -48142 11484 23643 -5891 -52074 -53729 40576 59454 22434 16043 24819
25513 24819 18096 8581 113192 88192 23383 -13577 -5010 -7891 -14240 2526 23762 20854 11583
25500 11583 63783 8139 -25234 26190 68659 74004 68377 -28552 -17517 -2111 47462 -25704
25488 -25704 -9816 51323 86282 45896 35104 24157 15514 26625 28890 -5940 -3754 70744
25476 70744 71431 17308 -55605 -106977 -42735 8539 -32442 -39573 -2917 -7086 811 7352 -4173
25463 -4173 -12888 6875 22855 20956 72794 117718 76271 36453 88831 104662 10833 -11720
25451 -11720 -72016 -101802 -78166 -79079 -50064 -43094 -131748 -110717 -44312 -2252 -28818 -22103
25439 -22103 -9867 -12380 -81851 -127919 -107968 -53158 -41420 -44916 -67716 -25565 19273 54671
25427 54671 26240 2686 49448 30115 42471 73744 45300 30424 42128 57219 2983 -6227
25415 -6227 -18967 -55437 -73587 -44248 -49687 -61857 -46452 -29081 -34271 -24640 10457 -12146
25403 -12146 -31822 -58382 -46198 -57035 -53829 -31098 -22691 -26816 14614 25944 -3923 -60446
25391 -60446 -57321 -85466 -38718 -17094 -25917 -2428 -13048 22831 52858 65498 78446 65748
25379 65748 21458 6169 5945 31437 83003 73502 32194 33307 44164 68369 75682 19399 71842
25366 71842 61519 -21432 -67806 -75825 -47707 -40394 -18240 18204 1422 -12971 -2950 35898
25354 35898 56226 54065 -14743 -53316 -100464 -108414 -3607 8175 -69753 -73681 -65185 -99936
25342 -99936 -71931 -45688 -96885 -94353 -30135 -31633 -7664 677 18208 -18610 -14198 11603
25330 11603 25727 -21339 -88432 -105603 -58998 -78229 -56097 -44647 -42418 -60502 -52939 -68931
25318 -68931 -69345 -90068 -75493 1873 87351 91209 74058 11380 -69515 -67688 -22988 3499
25306 3499 -49552 -75401 -47071 -8428 34913 21941 -27297 -24042 27212 -51806 -63987 -93912
25294 -93912 -66036 -40015 -88140 -64474 -26381 -42114 -44629 -113447 -114209 -49894 -78210 -118813
25282 -118813 -35167 68155 109351 111057 61851 30993 43263 63788 18684 25823 -20373 -16013
25270 -16013 9746 68184 47999 47065 72765 97355 107834 115943 96318 90895 92577 33853 18964
25257 18964 -24030 1352 -60369 -27783 -13105 8483 50684 -6550 -10115 -10970 -64268 -79570
25245 -79570 -8766 13210 -39171 -70793 -53350 -51764 -73816 -133020 -152376 -142045 -92146 2611
25233 2611 68931 61647 48590 75478 85357 60311 16106 -45237 -4331 84533 56192 -29452
25221 -29452 -64654 -4621 57581 80540 -31396 -48757 56865 91364 -6703 -22690 8062
25210 8062 3003 -4996 -25007 -19585 45387 12057 -40277 -88244 -107375 -49812 -76292 -49937
25198 -49937 -87871 -84742 -52463 -88915 -75951 -52440 -3934 -63342 -61404 -25492 21224 73124
25186 73124 146287 94101 13641 -37019 17767 -4736 -5771 56402 54281 75950 109723 49832
25174 49832 -12912 -80392 -31326 29908 9648 20187 39324 31580 40909 3166 -21252 955
25162 955 -134270 -150134 -83619 -24442 4968 1786 -24898 34084 74849 -2778 16051 9392
25150 9392 15617 89570 57016 52721 32285 987 63851 89413 26486 33345 105457 113895 46990
25137 46990 -17052 -17724 4444 -40104 -43920 -63363 -117798 -109576 -97895 -82256 -42584 -21058
25125 -21058 4726 42936 75008 51835 14186 -652 8017 40871 14590 -9743 14247 35622
25113 35622 42408 65426 98350 121825 13095 -10931 -45257 -12792 -17205 -48201 -15956 13399
25101 13399 -92 59840 106224 51378 30291 42254 48390 5286 8568 -30069 -51846 -49067
25089 -49067 -116961 -73437 -32194 17071 89535 120865 73450 18117 -26502 -33091 -18039 -2190
25077 -2190 -14393 -38842 -35833 -82172 -100899 -44304 54533 42440 -18313 38135 73475 87096
25065 87096 53665 -21875 1382 90096 84765 50277 61696 34194 -1376 -21810 -40582 -23336
25053 -23336 -11424 3688 39241 53524 66448 48504 569 -33811 -36989 -50257 -1013 36623
25041 36623 49188 66359 16191 70565 47775 28302 -6678 -60761 -91307 -28912 -25580 35565
25029 35565 16036 -19447 -2292 12524 -7831 16203 37329 61249 53362 20701 -32643 -24155
25017 -24155 -17289 7996 -2166 -81612 -129057 -65881 34220 66995 68117 60899 97786 103769
25005 103769 54889 33365 -19115 5555 45514 63612 58436 -10985 -89678 -120759 -91191 -53736
24993 -53736 23843 71251 19420 19121 30917 10630 3331 -19248 -113424 -137900 -77566 31971
24981 31971 29712 -18724 -2017 -11965 -69036 -87626 -57573 -48087 -48689 -21732 62277 89881 143888
24968 143888 67082 -16015 42576 103380 17996 -79757 -74107 -44277 -43498 -48127 -20346 14364
24956 14364 -47655 -36565 -20202 10420 2416 -81137 -5419 57029 26042 -32383 7275 -23995
24944 -23995 -19846 715 38233 40897 51643 84974 85793 47154 30553 -35003 -48332 -7348
24932 -7348 -55224 -147906 -133076 -55782 -51769 -57187 -21399 -14408 -16635 22379 48693 6965 2618
24919 2618 49762 38274 5775 -95385 -45084 -5930 14480 29225 55373 -12335 -58839 -27114
24907 -27114 -22218 -20908 21231 45619 30855 17480 35183 27800 14735 5219 -52845 -18049
24895 -18049 -39807 -30877 -39172 -74920 -43439 4885 -36638 5785 62010 48973 -16163 -83062
24883 -83062 -25657 20743 13888 39788 134705 165423 130993 16096 -101461 -103138 -20442 36950
24871 36950 97682 144370 84730 19801 11968 10678 -11565 -21005 -3857 38452 75525 35306
24859 35306 2663 -37656 17983 32345 23237 -8842 -23019 -53489 -67777 -128886 -83362 -43367
24847 -43367 3936 8986 16520 -14494 -93017 -105243 -111298 -54329 -13059 -5948 -21699 -4671
24835 -4671 -26220 -52021 -36078 -49556 -10878 -5755 -5654 -36038 -30220 -16193 -7334 38451 44094
24822 44094 -6890 -77836 -75206 -48902 -73986 -108814 -111703 -59590 -54223 -30180 -64113 -90710
24810 -90710 -90619 -101737 -64552 -44502 -40637 -92380 -66400 -30299 -39938 -110304 -98103 -89290 -91507
24797 -91507 -78480 -68387 -99590 -90447 -109836 -151116 -133103 -102796 -45673 -16803 -23550 25959
24785 25959 -9424 -19502 -103532 -123986 -35619 57862 143989 176198 120732 67751 95013 88293
24773 88293 128862 159480 137519 47060 31796 72833 79217 54967 27764 36056 4484 -36953
24761 -36953 -66486 -96104 -74893 9913 99087 73534 109928 112407 39860 -18015 -43509 -48076
24749 -48076 -52124 23349 118652 118303 98743 109049 78702 12995 -842 44731 3339 -90449
24737 -90449 -73322 -18743 -479 -13374 26320 72666 856 -59131 -28107 -1795 4843 44850
24725 44850 3262 -84710 -27676 -65043 -67330 -47698 -15813 -10262 8292 31676 29643 -39139
24713 -39139 -22266 8109 48193 104760 152855 94379 59733 48575 -76579 -156196 -208809
24702 -208809 -194207 -157871 -48402 8839 -16360 -34060 -23825 -24641 33867 38731 -40287 5440
24690 5440 35842 -17294 -57469 -57439 -21424 8013 28217 9806 4587 26333 -4093 26370 6042
24677 6042 -33629 -44152 -48240 -54339 -62992 -64885 -118223 -143087 -133068 -56024 20389 -17777 25097
24664 25097 74511 103169 91682 63005 68772 38628 20804 30270 30433 4669 2727 -21690 -16502
24651 -16502 -32701 -31344 6274 8746 -31016 -77170 -23396 36505 29191 13899 29820 2607
24639 2607 49790 98963 112776 29677 -35051 -33046 -92836 -102118 -93734 -38579 11051 99100
24627 99100 80530 29706 -42187 -70018 -13585 1382 21350 21185 28235 21875 14885 25661 52251
24614 52251 43449 -6926 -76582 -133553 -155612 -184877 -172685 -109473 -14182 56672 39634 53896
24602 53896 36654 35321 14033 -16733 -45958 -45825 4986 17776 14320 9531 12109 58521 61814
24589 61814 125928 125888 53159 -27842 32863 48587 24043 16110 -1015 -14272 17751 -9270
24577 -9270 -7393 -114243 -73729 8371 11251 2540 11049 26716 -15973 -23316 43909 67607 73723
24564 73723 -1068 -22750 -24053 72803 98840 64252 23742 5907 10860 -54707 -103474 -80119
24552 -80119 -81041 -93762 -48514 -23376 -2411 23015 36605 63852 33126 92090 69239 -12432
24540 -12432 -19192 11395 42858 53420 -13915 -19151 -7466 -19642 23772 102801 91547 43809
24528 43809 17533 -71816 -43652 24307 -10995 -18577 -13538 -10455 -25470 -4233 -24851 14778
24516 14778 113151 121330 54728 -24233 -4586 54212 114773 113085 55531 -423 -77286 -77055
24504 -77055 -24776 -41891 -52127 -59884 3831 -19420 -45876 -41892 -11614 7649 -17553 -12571
24492 -12571 8738 1018 -15720 20770 -41241 -25071 -1790 -71172 -122490 -131244 -109003 -71626
24480 -71626 -14970 -10753 -19542 -39103 -48264 -129959 -148766 -109725 -60409 1440 30636 10359
24468 10359 1381 -11621 -38499 -17293 1147 -34464 -87472 -96076 -64982 -55534 -83158 -47609
24456 -47609 38834 26010 -32954 -67477 -770 8044 -23875 -37366 -73747 -71699 -38806 -82730
24444 -82730 -75685 -42576 -21004 3171 22917 14888 6454 -6437 -15089 2247 -55776 -127090
24432 -127090 -108240 -36645 -7797 8608 57680 58806 34914 -4636 -5537 -24381 -50749 -73788
24420 -73788 -22635 -24193 -99938 -80435 6127 36769 45394 32739 25780 894 -5577 42749
24408 42749 107247 95034 -2687 -29218 -20132 48974 13920 -5658 21317 13058 25433 1380
24396 1380 -12841 -66915 -116649 -134427 -134787 -165874 -133918 -87782 -110538 -174943 -211103 -152528
24384 -152528 -128750 -146302 -97113 -84050 -86673 -25084 27517 -7081 -46832 -19109 -15758 69265
24372 69265 138554 67191 55159 36387 13420 38508 81543 38027 -52989 -89192 -79194 -41304
24360 -41304 -17145 20911 44676 61829 127720 152821 30025 -49105 -44076 -25966 -42908 -54195
24348 -54195 -72921 -86401 -32355 -5199 23179 24427 -13049 26992 42953 -768 16466 56766
24336 56766 13141 -59546 -90459 -71424 -75502 -83148 -42580 -3082 -24374 129 -28998 -85019
24324 -85019 -49681 -62371 -110756 -104533 -73335 -41618 -2767 -3300 7660 52741 79883 71572
24312 71572 20475 -12835 -58978 -42058 -8899 26522 12912 21174 25979 82032 93140 77945
24300 77945 36121 -14236 31614 14081 -27189 10045 58932 75605 93826 120973 105994 98524
24288 98524 9157 24016 79461 48045 14064 -43995 -96136 -36676 -4094 -78578 -80689 -11837
24276 -11837 34468 -21611 -88626 -91640 -12393 38214 29584 1663 -74613 -30677 -7474 -20976
24264 -20976 -30683 15892 71130 55320 56040 32348 75908 113232 48775 15487 -66087 -41794
24252 -41794 19123 52748 57108 32123 1501 27082 70128 54186 1673 -29801 3665 620
24240 620 14940 11777 -1641 47178 42888 63271 94945 47623 42036 14494 -41299 -53994 -73165
24227 -73165 -53825 -96836 -82023 -84784 -113202 -87311 -50926 -57289 -41089 38265 41686 -8774
24215 -8774 -53949 -29256 -73832 -94727 -118029 -59552 -2381 -56608 -45326 -2900 52110 18255
24203 18255 -414 19422 27144 9343 3548 28579 -26664 -51310 19905 46223 -7876 -119118
24191 -119118 -188670 -167645 -53793 -53779 -86520 -44509 -24805 -30677 -18476 -44935 -96155 -73488
24179 -73488 -13816 39217 10485 24139 26323 -10335 -19262 -41106 -60280 -19149 15382 52982
24167 52982 60582 21164 -55312 -56927 -58160 -71831 -124125 -37624 4401 -44866 -34127 -25043
24155 -25043 32103 10337 -85398 -95124 -65144 -37656 76595 80861 18884 3066 -17859 -124754
24143 -124754 -126867 -107901 -142553 -164968 -167803 -203209 -198454 -85507 -14345 -67405 -104856 -72689
24131 -72689 -106673 -94464 -69312 -35821 5797 16368 21583 43973 33842 15475 -46050 -57329
24119 -57329 -44514 -59733 -60178 -11511 40232 -14869 -26568 -19980 -36950 -27886 29076 72991
24107 72991 86118 107173 25993 -27937 -3527 9422 -63624 -62537 -25128 -14470 -15775 -67542
24095 -67542 -97578 -37708 28681 81538 116097 98496 37927 31661 30251 -20221 -44440 958
24083 958 89244 99242 120015 143316 73972 64504 74505 6156 8635 23371 20530 -3675 -63371
24070 -63371 -85117 -125208 -112434 -59846 -84065 -113218 -63849 -1632 45425 -23316 -35191 4140
24058 4140 18260 15846 31539 38232 41808 47998 79238 38684 -24779 -8402 18068 11766 4075
24045 4075 18726 32269 40981 37052 73390 96811 66148 -28168 -30372 11973 -27918 -5224
24033 -5224 27322 51404 -5951 -34921 -82059 -98204 -28292 -39827 -45019 -34899 -13945 47880
24021 47880 36530 -13322 -17791 -15743 -27457 -44857 -47701 -50866 -11789 -7307 -30646 -47148 7930
24008 7930 2330 -30060 -33859 -20586 -25834 21880 57357 54919 31307 15201 51230 25737 -13097
23995 -13097 -21535 -41089 -50868 -1319 67252 132658 77904 8972 -6598 -22458 -10057 -89275
23983 -89275 -123447 -120724 -120281 -116664 -129423 -112725 -95995 15685 22239 -56303 -24956 11688
23971 11688 927 -16775 -34825 -26504 -58304 -39478 -30996 16317 25901 -35048 -28393 2965
23959 2965 27169 -6235 -14846 207 16860 43345 5975 -48530 -70877 -44192 1157 9724
23947 9724 -23183 -28166 20969 48642 12833 -39035 -58856 -58369 23798 70338 21579 -12555
23935 -12555 -1053 29187 31678 25964 19108 4418 16877 32281 16426 54090 12014 21481
23923 21481 47019 8162 103399 118980 117552 32466 47129 56675 24587 5680 -10206 -24322
23911 -24322 -25894 9249 17761 4963 15935 -2443 -41396 -15808 24702 -51460 -110812 -111758
23899 -111758 -132685 -112050 -110269 -151932 -132826 -136699 -193248 -177481 -181100 -149305 -145770 -116001
23887 -116001 -97576 -150998 -131646 -67454 -22600 -31857 -28793 43966 52171 16315 -35290 -42072
23875 -42072 6044 -35635 -50942 -1301 30399 31406 39432 92333 49940 40822 14128 6090
23863 6090 -15128 -24017 -51891 -159551 -192938 -75659 -55181 -71618 16059 133208 112783
23852 112783 22610 -517 -17817 -46658 -34866 -352 17950 28565 22886 13709 -13300 -2172
23840 -2172 34955 82617 90303 57915 40006 2257 -91853 -119899 -127738 -118885 -107732 -79011
23828 -79011 -47026 -43158 -46108 -41277 -49073 -84680 -24396 -11790 -53203 -81907 -51845 -30352
23816 -30352 -6850 -1160 -227 -8289 775 -13286 45184 76014 13834 -24530 -32151 -43876 -93668
23803 -93668 -115174 -57695 8595 -13492 32173 32604 -50241 -64212 -58009 -60424 -71365 -51564
23791 -51564 -44485 -35409 1556 24636 28660 33343 8864 23993 21042 1035 -53948 -109237 -87557
23778 -87557 -35294 -28808 23907 74453 73680 20557 -13556 -32672 -14510 -36613 -121962 -189939
23766 -189939 -110122 22258 65254 42503 23315 43796 23642 -14406 -17348 33543 57481
23755 57481 24161 -1120 24062 39554 37981 46190 72244 33133 -87574 -85008 -48806 -318
23743 -318 15603 14063 58452 54540 -9653 -86679 -55075 -6330 -22663 -54907 -104816 -104268 -75475
23730 -75475 -68449 -71688 -33781 -35106 -25119 26985 43607 76241 86125 48551 4263 -14919 -12887
23717 -12887 -24615 -61093 -23945 47281 51573 -11856 -38544 -88769 -120066 -99769 -65380 -19719
23705 -19719 23232 28935 48599 25496 38462 -39905 -57736 66 -2632 -60394 -74986 -58733
23693 -58733 -71206 -148271 -105602 -56590 -80768 -34759 39408 45226 55140 -1460 -7311 -41111
23681 -41111 -32973 5255 -10497 -10843 18370 28157 49408 121504 106888 70619 -4105 43099
23669 43099 60064 33611 44223 58950 64827 4442 20968 31565 33360 -6409 -25539 -56354
23657 -56354 -17562 68747 11445 -21019 -8080 -17563 -36738 -11667 61182 47441 8777 -35930
23645 -35930 -102005 -109469 -43440 38771 592 -78066 -76830 -42750 -14299 -7662 50887 97246
23633 97246 111250 108418 99727 38230 55288 40502 -37787 -104934 19944 54429 31701 11130
23621 11130 -11439 10629 20459 12105 9163 -32075 -103265 -38545 -3304 -144 -10317 -38408
23609 -38408 -123264 -131094 -93579 -117458 -64801 -64844 -48100 16092 -1522 -34066 30163 36860 21
23596 21 22147 71017 13834 -95295 -146005 -113604 -25646 -8332 -39214 -42395 30958 139956
23584 139956 172124 118825 83239 86403 -12805 24334 11296 12299 66768 82022 43667 31265
23572 31265 20940 39374 52189 51506 13080 -43931 -60062 -97041 -57746 -59423 -111260 -135330
23560 -135330 -143978 -58377 -2962 -40639 -76361 -33850 -10164 -31121 -43513 -94200 -131698 -70569
23548 -70569 -21583 6836 -46375 -115697 -97517 -77675 -83859 -107356 -24875 40759 41028 10349
23536 10349 45985 -10257 -33755 -10953 36934 19348 8004 28385 30261 39181 62493 106505
23524 106505 84934 35192 17226 6491 -286 33932 63365 21959 -30275 -56079 -116101 -99944
23512 -99944 -60491 -66869 -55685 -67443 -47379 6666 -23050 -104997 -112774 -119920 -59945 28707
23500 28707 32827 54688 89366 73352 7911 -22957 43252 28934 22815 -53829 -142172 -83172
23488 -83172 -40148 -9415 257 -23078 -4967 -1699 -21167 13813 -40091 -139677 -114860 -56351
23476 -56351 -29973 -31670 -62729 -94333 -82425 -67685 -79661 -93604 -143580 -78563 -46530 -80648
23464 -80648 -104502 -68312 28294 72661 44208 -9426 -52193 -45722 -78848 -63120 -34652 -31525
23452 -31525 -58091 -7325 -31907 -90034 -106354 -111685 -107462 -45528 765 -11894 -86249 -127459
23440 -127459 -85848 -42635 -21057 -34341 -16952 -13102 20763 28321 73981 38266 36721 -33349
23428 -33349 -38227 3767 794 7021 -24547 -36540 -54705 -72489 -56025 -43182 -56255 -50268
23416 -50268 -24095 -96143 -77181 1960 17774 20152 18671 29908 23052 -2480 8895 -27918
23404 -27918 -51604 -24344 -26508 -43276 -58695 -70520 -69690 -56208 -43442 -133452 -149325 -122505
23392 -122505 -136142 -67766 -10513 39513 26659 -59979 -53515 -62198 -97379 -136863 -171170 -136798
23380 -136798 -121440 -88583 -14737 1887 -28924 -23175 1192 50906 24006 -11283 1707 -30755
23368 -30755 -56711 -70257 -132647 -112643 -68961 -43386 -126203 -137082 -64686 -40598 -56842 -60217
23356 -60217 -8760 67728 49335 -39356 -73260 -9540 25054 40868 -27869 -9066 43620 51298
23344 51298 32223 60514 21596 15093 35527 87805 120864 58065 12211 7471 15060 47812
23332 47812 22228 5118 13829 29188 13200 -48166 9926 67750 151318 138522 103350 -8776
23320 -8776 -96200 -124818 -77405 14945 -38353 -63830 -50362 -12723 -45410 -113457 -116050 -67571
23308 -67571 -50219 -31667 -40995 -32477 -35246 22343 11651 -69706 -66889 12926 28411 -12804
23296 -12804 -64066 -96976 -62512 -29831 -40695 -60167 -8569 37046 46653 -16272 -54194 -8034
23284 -8034 -44956 -44767 32699 33221 -5073 -54222 -77562 11682 73484 48585 -4190 5886 -25543
23271 -25543 -37985 -109772 -175493 -122655 -112313 -138455 -126164 -104023 -39075 -41868 -33428 35080
23259 35080 36580 -16852 -71905 -87536 -62684 -39657 -103683 -144788 -87905 -39146 -39498 -47031
23247 -47031 -5175 44815 34033 -51153 -110872 -133314 -128147 -6438 70235 72755 80640 92690
23235 92690 95826 98783 30532 61912 31623 9119 -12032 -22781 25507 60669 47786 8233
23223 8233 -50500 -37775 -41185 54280 50037 36521 64460 59104 55892 -9212 -72442 -78329 -104005
23210 -104005 -128497 -88290 -29997 -49722 -103786 -141678 -136436 -141987 -40962 36018 107739 133903
23198 133903 89413 18968 -53594 -154756 -145845 -117955 -49470 -47971 -17747 -11216 -33034 6541
23186 6541 -14277 -96145 -69031 -24574 -16637 -7757 72269 131349 66432 26238 72135 73619
23174 73619 20859 -25484 19553 21369 -31113 37880 41000 16409 24809 -14973 -16893 -24706 -52272
23161 -52272 -51336 -8596 -25734 -11025 -14988 -32172 5966 48488 20678 -25404 -59572 -91591
23149 -91591 -139671 -163827 -35111 26735 -11542 24515 21388 -59932 -62715 -37382 -52314 -21070
23137 -21070 36378 27599 13121 5309 26396 22097 -10591 3452 -2084 10393 -909 -2602 -43857
23124 -43857 -74182 -92445 -89748 -84457 -49159 -57225 -5659 14119 -73074 -109355 -79830 -87713
23112 -87713 -96112 -38019 32563 69465 44243 30661 37712 -23085 -44183 1634 -33714 -81929
23100 -81929 -79146 22071 -50707 -77148 -16698 71263 102675 62590 92978 96670 2249 -41353
23088 -41353 -24649 -12575 -38426 -34328 -50279 -22152 -67683 -95238 -99972 -72763 -96463 -79224
23076 -79224 -102665 -36870 -24021 -16901 27172 46083 -13905 -16375 -93610 -128280 -72097 -37161
23064 -37161 -16156 -93757 -144100 -103174 -44489 -198 29921 -61636 -167769 -252745 -298827
23053 -298827 -260191 -251693 -213212 -136572 -99573 -142476 -159666 -115025 -68716 -16524 -25121 -66860
23041 -66860 -64739 -78536 -90134 -99075 -110784 -165736 -116510 -90396 -58590 -108555 -131565 -85497
23029 -85497 -24434 -15205 5160 55234 89401 100626 119319 75029 48689 3230 -13199 -10552
23017 -10552 -15638 -4690 57807 92697 89653 40350 51687 48933 34123 23572 -11073 -58147
23005 -58147 -66427 -6183 5409 -16068 26757 23204 29823 23875 40434 -30580 -55183 -16324
22993 -16324 -52427 -41204 -68781 3757 -21264 -66752 -49285 -25690 31921 6906 9537 -8230
22981 -8230 -2267 -13283 -2473 9788 18517 -30993 32129 45618 2177 -87396 -152449 -168801
22969 -168801 -173389 -112797 882 71823 70252 63689 117349 107304 80749 33730 17258 10695
22957 10695 7930 -14897 4448 38700 27312 8520 -3400 -13491 -178 19203 34596 -11092
22945 -11092 -107477 -52998 -46925 -28433 -2201 -70811 -73337 -138331 -155028 -84115 -87963 -124091
22933 -124091 -121654 -122544 -91130 -76549 -57660 29301 58220 8393 -42109 1748 76950 29238
22921 29238 -33042 51833 3466 -59226 -92726 -97572 -52532 -12332 -26437 -33154 -1343 22670
22909 22670 719 40228 88184 23566 -18650 -42031 -48733 -31706 -36115 13709 93133 87811
22897 87811 101314 35886 53192 -39003 -73679 -137088 -151167 -74902 -93618 -127301 -70591 -10948
22885 -10948 33108 21441 16032 -3140 -33030 -57838 -107130 -18032 74981 39771 3138 -64704
22873 -64704 -76608 -46588 -23685 -50016 -71964 -37810 -91142 -90518 -82084 793 56705 -4866
22861 -4866 -42940 -2048 -59571 -112914 -62931 -32482 -72126 -69192 -61334 -28328 30905 52675
22849 52675 13078 -3427 8988 11988 -12984 -35228 -32015 -24599 -82064 -124042 -131255 -55440
22837 -55440 -12738 -24823 -88526 -128733 -109324 -105773 -129520 -71441 -103493 -56537 24678 -22897
22825 -22897 -59921 -42905 17476 -28594 -111917 -86967 -73281 16753 75803 84969 144676 138211
22813 138211 106337 107777 88872 69156 41680 30969 49926 657 -17164 -90439 -75847 -137927
22801 -137927 -145181 -41351 -1028 -35487 12953 45721 10798 -46879 -7175 21466 45735
22790 45735 33936 -46819 -71881 -51897 -50764 -8303 -17401 -25831 -96252 -64724 -50493 -61235
22778 -61235 -27531 -35985 -65406 -36781 -2590 79372 101544 130337 113570 124289 112417 117892
22766 117892 113604 83553 39409 44998 -544 -29467 -42894 -54112 -50720 -20977 9818 59512
22754 59512 16762 -28192 -53070 -58674 10403 -2618 -19606 42654 24684 -24807 -92798 -54776
22742 -54776 -142097 -148804 -103400 -116124 -132542 -125223 -118691 -63284 10640 -30958 -21500 32491
22730 32491 46801 14190 8672 80695 100306 41283 19574 -36611 -35597 -137191 -119138 -46110
22718 -46110 55625 74416 51289 13479 -12397 -86030 -55593 -31165 -19394 -61847 -82929
22707 -82929 -78867 -2788 14390 -17746 -49698 -17553 25742 42678 32423 -6325 -16393 -44614
22695 -44614 -77542 -43735 28141 22850 13349 -25117 -34965 -65151 -110060 -106707 -77598 -5710
22683 -5710 37615 81894 113871 81637 29096 -1518 -39487 -68189 -34086 32308 53299 54677
22671 54677 14913 6330 79240 58899 3135 11346 12944 -57055 -81746 -5903 37455 31750
22659 31750 -7825 -45530 -72130 -54462 -3388 32798 -3563 -102420 -36032 -27062 -25601 33958
22647 33958 92075 106070 55329 56125 18983 -1467 -63455 -59535 -26689 -37956 -25278 -32644
22635 -32644 -96004 -103363 -66953 -27042 4161 -38471 -2718 -52618 -61034 -49277 -53262 -204
22623 -204 18263 12301 11700 21634 -3216 -29031 -66678 -58670 -107483 -135552 -136491 -113999 -100049
22610 -100049 -90838 -61429 -48023 16748 12149 -26822 10991 -18473 -44677 -494 4047 23677
22598 23677 44458 54745 -7047 -68519 -32379 19924 34883 7578 -21156 28284 34232 41052
22586 41052 76638 28081 -27912 -50537 -65881 -28502 8033 -4482 -7192 20242 33102 35125
22574 35125 -765 -61211 -131118 -92744 -91684 -106796 -139762 -149946 -135783 -115007 -162213 -134093
22562 -134093 -88273 -67264 -74546 -44686 -112164 -127310 -52696 -28334 -27320 -25581 -33195 -40123
22550 -40123 -5142 -41038 -62227 -52514 16175 103342 118570 88106 44774 -11355 -83486 -13507
22538 -13507 -11464 -66922 -131330 -112280 -93993 -58495 -97065 -113689 -92013 -87954 -117560 -87964
22526 -87964 39512 19963 18944 39383 26453 13328 -38831 -80838 -118986 -148686 -150754 -116663
22514 -116663 -122493 -22076 21896 -4136 -59076 -82276 -53093 -84070 -88880 -135682 -186632 -211799
22502 -211799 -128466 -76774 -44854 -68121 -68593 -102426 -114415 -59794 -48810 43252 104270 51707
22490 51707 -5708 8750 47709 136760 88818 86758 135263 143219 70790 31562 60299 77366
22478 77366 101953 34481 -16994 5038 34901 50390 93864 46282 53629 96879 106719 106937
22466 106937 14117 21791 42024 49316 88336 120244 111481 58707 22430 5498 -2086 -26803
22454 -26803 -43238 -45158 -25039 -27547 -8668 -52858 -46997 -36286 -28221 -49885 -81234 -47535
22442 -47535 -31004 -33040 30056 72873 50245 -9902 -46892 -52605 -53451 -41883 -18779 36505
22430 36505 37424 -11996 -19068 -41951 -73462 -99481 -112630 -73944 -21699 -1433 -11681 -688
22418 -688 35111 4259 -66824 -152543 -188383 -78730 39545 36473 -29833 -87179 -53309 -45297
22406 -45297 11153 -1433 -34453 -114764 -134736 -118384 -77417 -29391 -31974 -30876 21900 18694
22394 18694 -40871 -40159 -92185 -76173 -88894 -35357 45962 54390 18592 -29486 -51602 -22894
22382 -22894 -53575 -113066 -124249 -109344 -53138 -69296 -103149 -20179 -44024 -115960 -120010 -55166
22370 -55166 10266 -25542 -9929 18569 54143 67847 -14055 -29568 29302 5505 -60098 -77444
22358 -77444 -83357 -26878 -69100 -124226 -94283 -54472 -64762 -47540 -77056 -79636 -25908 -49542
22346 -49542 -35213 18673 4076 -34327 -117074 -170110 -173137 -181003 -144344 -69705 -16433 -51424
22334 -51424 -57661 -60784 -99464 -28954 54321 60077 -1944 -50807 -11427 42033 22191 17499
22322 17499 46407 76656 76253 84663 14746 -67941 -75735 -11734 -1406 12198 -43303 -34680 31960
22309 31960 81273 23734 -20413 -34895 17399 19998 -27590 -34233 -62585 -80406 -21629 -15945
22297 -15945 -53802 -29119 -82099 -143090 -139784 -61969 20898 15009 -29554 -121457 -130891 -120945
22285 -120945 -33711 8585 26310 54189 50586 31288 -1640 -88289 -111177 -128797 -61285 -39683
22273 -39683 26580 -36491 894 33636 18049 47654 17477 -3934 89899 85376 2268 -12240
22261 -12240 3396 18139 27790 21441 10530 62213 52173 19417 -4664 -24756 -66186 -103776
22249 -103776 -50462 5138 -13441 -77929 -99023 -23143 43083 63203 31344 -451 -40288
22238 -40288 -39472 -50621 -16981 6977 11991 35850 35848 1875 -29139 -56678 -31180 9254 -26732
22225 -26732 -91896 -83060 -54106 -57180 -22416 -37431 -20472 -37369 -43955 -55536 -49071 -30099
22213 -30099 -761 43983 -9044 -14068 -13535 -26014 -793 27866 68875 115216 68640 6770
22201 6770 -90189 -160589 -113845 -79033 -26615 45643 97318 64681 3183 -62583 -87785 -122250
22189 -122250 -108653 -92515 -64956 18499 77657 47103 20641 25858 49657 29647 18251 -34988
22177 -34988 -44679 -23210 5240 23622 31259 16774 -31238 3516 -65040 -74166 -53194 -20905
22165 -20905 -25241 -74033 -103833 -121332 -97685 -108092 -123101 -57651 -43084 -1962 -1161 -24439
22153 -24439 -48790 -13800 46036 12722 -27845 -74423 -93422 -34553 22518 13558 14276 -40345
22141 -40345 -88854 -113862 -61663 -25935 -56696 -45294 -16579 17893 40181 8363 -15045 -13555
22129 -13555 86514 84631 81733 23608 -17486 -16553 -26447 -56895 -64571 -81114 -132220 -138740 -80382
22116 -80382 -39365 27103 51489 -92106 -136448 -73155 -45090 -26942 6124 15242 37457 73602
22104 73602 105856 67110 59946 11527 3793 -28418 28134 57713 -3566 -39849 -49278 -54878
22092 -54878 -35690 -21583 47520 39142 6530 53726 98505 61034 22667 -4216 -21378 -23406
22080 -23406 29800 25013 11086 49511 8173 -44062 -63715 -91272 -78841 19987 65829 23710
22068 23710 -18447 41444 29087 73575 115113 102179 16924 -13377 48030 34216 17625 67496
22056 67496 82727 49546 27815 17300 -1630 -33509 -42728 -58790 -16245 42509 84040 -49829
22044 -49829 -112835 -61729 13823 -19975 -18449 -26738 -12243 18595 5659 -27718 -85003 -114000
22032 -114000 -168227 -117026 -58634 -54856 -79096 -55690 13411 -26806 -73488 -53893 -44320 -69700
22020 -69700 -109955 -149102 -92030 -37314 77966 111319 76832 23748 -10227 -8135 13014 -6593
22008 -6593 -39074 -41057 -81309 -101926 -41965 -10605 -19764 4361 -15383 -79030 -106179 -105735 -66607
21995 -66607 -9817 21007 -12136 -29254 -73058 -82554 -93497 -107086 -91412 -90548 -48376 21879
21983 21879 24598 19125 68125 141687 100609 68155 73801 84216 122037 85207 71849 70007
21971 70007 52214 -45742 -31031 -32169 -83070 -86269 -102755 -107132 -73440 -31216 -21290 34521
21959 34521 75199 79802 42302 13286 -26648 -20692 -2533 -53816 -101009 -148626 -155294 -112891
21947 -112891 -99542 -47658 -62947 -75757 -68803 -44971 -43279 -31497 -48440 -120957 -133530 -57243
21935 -57243 -24524 -15616 -39587 -59948 -72440 -61754 -58911 -89110 -84578 -51410 -37678 -34000
21923 -34000 -43085 -11674 -10196 17042 114587 50845 -11046 -115413 -139761 -107902 -18893 50393
21911 50393 40068 40702 22835 8848 -33801 -123942 -184106 -192073 -115683 -54993 16105 19653
21899 19653 -27670 26400 50931 -5578 -23158 -32281 -70913 -130174 -137262 -106364 -123439 -49461
21887 -49461 16289 -6478 7031 -23641 -16096 11013 74968 30401 -4198 -49320 -87407 -107136
21875 -107136 -86910 -43118 9350 8857 -24282 -80845 -24311 -14719 -8192 34338 51452 62236
21863 62236 -14152 -92891 -124129 -45070 -28773 -59041 -60770 7352 -15890 -45514 -55782 -49780
21851 -49780 -84435 -74448 -10085 1252 8808 15144 4584 -38364 -16896 20163 89708 169713
21839 169713 172594 180915 130016 139646 139831 103732 40124 -29238 -98297 -87678 -47106 -39249 -63017
21826 -63017 -109342 -74718 -43127 -45587 -56398 -29248 -21798 72004 51083 20099 -3682 -14963
21814 -14963 -9629 -42149 -47068 -24757 -2584 -68768 -55815 -66226 -72558 -41458 -30458 -75595
21802 -75595 -41401 -23207 8522 -39746 -39750 -33743 -15126 -53476 -81083 -10203 -7956 -28448 -21544
21789 -21544 -92712 -116533 -110269 -71254 31106 -34765 -30401 -51768 -86803 -79982 -51139 -8553
21777 -8553 -14898 9483 1949 15248 14459 -81571 -147608 -123653 -35766 -22095 -17591 -25453 -93158
21764 -93158 -103482 -62793 -37245 -59097 -12216 13808 27917 11668 34853 40786 10517 44563
21752 44563 15246 14285 -9629 999 7956 9121 11322 26087 54131 51127 62461 43809 6210
21739 6210 -9546 -20334 -33756 -33744 -47324 28431 72655 82357 19038 -93719 -70984 -43195
21727 -43195 -16539 -46471 -50305 -120725 -75663 -6920 71723 80161 46773 55014 35903 41509
21715 41509 -7297 -3637 -44248 -91035 -84358 -30127 45532 33347 -34246 -106334 -132163 -104983
21703 -104983 -62823 -20532 61249 69192 19319 -27533 -44398 -47345 -56533 -99200 -149021 -147577
21691 -147577 -138024 -150026 -128399 -86916 -10874 42802 17319 -33121 21548 48598 66616 111081
21679 111081 130022 52909 -18898 -14026 16324 -41153 -67484 -77482 -9280 7985 -40462 -46174
21667 -46174 -16540 -60135 -80980 -72543 -51686 3612 97775 90696 58675 -30671 -65634 -30959
21655 -30959 -21719 -71323 -62997 -62916 -39606 -74018 -114807 -146544 -122822 -68935 -49912 -76015 -117000
21642 -117000 -137380 -80964 -11929 5727 44739 86050 95270 75332 72734 55753 -48787 -48605
21630 -48605 29387 29736 -26246 -30096 -90777 -107292 -103078 -80201 -109884 -86794 -93333 -112984 -77241
21617 -77241 -74178 -40534 -13185 25159 21568 -30850 -32431 -40093 4485 -46947 -82396 -139378
21605 -139378 -167456 -143045 -93374 -25982 -26813 -51472 -64764 -41737 -26430 -48072 -40572 -16705
21593 -16705 -22520 -47558 -65627 -49734 4080 63851 117404 56184 15287 -20360 -25931 -22836
21581 -22836 45173 31125 14552 -47658 -134287 -194693 -109608 -49869 18074 -6880 -2819 21891
21569 21891 37364 11729 -262 4655 -5265 15678 -48412 -50009 -73605 -33598 80919 60517
21557 60517 21220 1780 -20132 -42656 -14918 29933 55188 -58 25309 90804 45042 25873
21545 25873 43730 39149 -31337 -11302 15606 22211 33109 13072 -53526 -82643 -65669 -44087
21533 -44087 -4043 33143 22856 54586 40303 -26851 -46147 -5546 -22611 -7000 18671 63900
21521 63900 63396 5060 -65640 -104492 -44148 -17801 -14475 14823 24453 51454 67789 41487
21509 41487 21293 -17140 -55030 -61325 -87504 -118992 -160135 -130916 -138912 -133469 -82708 -33188
21497 -33188 -46411 -103865 -115345 -117361 -145482 -148827 -144945 -86975 -57516 -40515 9661 -35426
21485 -35426 -45823 17833 -12421 -114478 -159591 -153807 -106981 -72731 -49342 -36418 -76139 -89065
21473 -89065 -2103 -34713 -88182 -93010 -110271 -108888 -63516 -24802 -31395 -24295 -77527 -51813
21461 -51813 -24744 -37951 -45697 -56550 -37780 10800 -24226 -62122 -59286 -103222 -84286 -34855
21449 -34855 -91262 -159998 -150275 -117414 -55058 -107389 -197254 -177812 -103191 -54862 -129872 -161656
21437 -161656 -86758 -57162 -11836 -25959 19505 55167 -56124 -99033 -70036 -71150 -14168
21426 -14168 11099 32213 47957 111660 98213 87047 47146 -4449 15528 -21360 -10176 6316
21414 6316 -39110 -87048 -100891 -36455 -39949 -28653 -24245 -34496 -89571 -78299 -67631 -33187
21402 -33187 -15843 17427 36001 29762 46122 77591 45902 -12294 -40541 -41473 -104011 -94038
21390 -94038 -13550 -135 -3981 -41496 -36599 -31654 27262 86163 106236 100737 90923 71626 47503
21377 47503 25242 10097 27497 -55525 -75043 -39459 -8641 -85198 -111975 -65184 13235 -48724
21365 -48724 -122984 -94150 -94637 -171384 -175688 -149232 -76966 -57540 -28886 -6206 -22620 -3299
21353 -3299 -16043 -62258 -8063 -16839 -38903 -416 4909 2397 -18626 -61656 -69744 -113730 -143179
21340 -143179 -152811 -38535 -32075 -23013 46200 5601 -18118 6665 -66292 -113991 -117072 -50922
21328 -50922 -2031 35021 54048 5951 -21883 36375 71028 110527 90748 46719 28936 24637
21316 24637 72475 30875 -21579 -11557 -26505 16039 -35549 -32658 36735 47900 -18347 -51452
21304 -51452 -95823 -108080 -44272 -51904 -22064 -73746 -71197 -28491 350 35734 -52457 -170725
21292 -170725 -151708 -90828 -88174 -67357 -35789 -48132 -12812 -13539 -20927 -35420 -34377 -20421
21280 -20421 -38798 -29079 23861 38296 -40679 -94925 -132698 -99637 -73783 -80298 -112964 -56272
21268 -56272 10381 -2229 -50595 -81530 -75247 -86979 -88178 -96891 -59723 -2968 -36711 -45329
21256 -45329 -10935 -19445 -38190 -47146 -38445 46097 3906 -37402 -13694 60754 34295 -4205
21244 -4205 -28853 -62138 -45542 -10171 50576 7941 -58046 -79012 -59703 -52528 -44091 -22109
21232 -22109 -76216 -67800 -20038 53541 60223 37310 8731 -31254 -87539 -114541 -127849 -87772
21220 -87772 -100984 -113662 -173085 -172912 -122472 -69365 -48155 -83775 -108086 -66492 -83697 -55098
21208 -55098 -90490 -30693 -10239 -38590 -11794 35556 50908 79520 6533 -80319 -57161 -25086
21196 -25086 -27478 19454 6981 3056 7699 24453 20861 6813 9692 4147 20854 7508 -38233
21183 -38233 -44550 -54571 -37951 -5200 14588 4377 -62766 -112807 -36385 32095 -15649 -5837
21171 -5837 -13103 -25311 -36360 -55517 -74634 -64855 -81085 -116971 -100441 -94855 -100602 -57023 -24310
21158 -24310 10385 41643 34025 -5252 34196 85131 45893 -10805 -70611 -29781 -53428 -90076
21146 -90076 -66630 -85350 -80981 -56237 -5678 7994 -2360 35963 3125 -333 -37860 -105659
21134 -105659 -89651 -69745 2039 26542 -3202 -5659 31401 -21890 -91205 -82963 -55599 -20212
21122 -20212 2833 -6838 -32579 -11579 -2144 -41181 -33741 13781 61536 92024 19608 -24268
21110 -24268 -12439 -64811 -65377 -50044 -4740 -54323 -138479 -142707 -60933 -43610 -120938 -169735
21098 -169735 -134147 -77256 -34949 -20252 -27816 -6221 -76531 -89846 -59336 -50989 -87147 -131370
21086 -131370 -114247 -58778 -46934 -81662 -63675 -82469 -150680 -103206 -124490 -140894 -159845
21075 -159845 -128528 -84980 -172474 -154970 -73740 -28435 -66219 -92929 -109137 -69969 -16614
21064 -16614 23296 37445 15561 27090 33473 4824 26568 -61726 -100244 -97343 -126784 -107536
21052 -107536 -59627 -5537 24945 -33797 -72769 -53934 -36741 -30481 -8832 9097 58698 83842
21040 83842 118468 96416 67975 71137 80635 26609 -16728 -56285 -68619 -44523 -55611 -52382
21028 -52382 -56050 -119696 -148697 -191069 -129861 -63364 -29304 -32254 -37039 -33672 -61528 -100043
21016 -100043 -113454 -120024 -119721 -9460 -44496 -122497 -131760 -102377 -69166 -87788 2227 70115
21004 70115 34522 -1502 43957 94204 81343 50387 45080 80703 108196 58517 -10092 5129
20992 5129 -27011 -2524 84190 101573 30366 -44965 -58482 -48541 -38167 -18054 43415 50496
20980 50496 -43836 -35651 19702 -41697 -83192 -75216 -103556 -119507 -53903 -69895 -52852 -48674
20968 -48674 -46629 -106133 -149352 -158257 -93395 9096 53652 56947 40267 48708 78706 20580
20956 20580 -39266 22429 77604 33844 -80592 -133153 -96931 -91100 -103524 -41459 -65544 -100022
20944 -100022 -81260 -48930 18246 -40915 -51633 -103103 -163728 -109431 -77671 -77131 -55758 -101796
20932 -101796 -158680 -183570 -155196 -91600 -75086 -27157 29914 24262 -8536 54330 49646 30284
20920 30284 15979 -9595 16134 56281 81191 130357 102667 109556 89585 4991 -19446 50680
20908 50680 117114 161706 83040 68417 52255 6753 -73056 -126163 -123251 -77222 -54543 -91453
20896 -91453 -104824 -84700 -33410 -25679 -28259 -71738 -107580 -70329 -46819 -74542 -78939 -30436
20884 -30436 -82487 -88412 -66582 1804 -7613 -64098 -108041 -105591 -67502 -56090 -11467 -52716
20872 -52716 -60566 -9899 -10014 -81707 -67662 -109475 -137302 -131570 -117622 -93621 -91159 -40605 16687
20859 16687 17812 5894 31888 31355 -9318 21975 -9395 -78157 -85896 -100875 -65139 5761
20847 5761 30682 -871 -69439 -114498 -60004 -28766 -75453 -75471 -39370 -102289 -118404 -99586
20835 -99586 -77105 5966 62004 6353 -47423 -18046 -5430 -42012 -36380 -48341 -40572 -82551
20823 -82551 -69909 -89313 -113077 -83510 -41727 18389 12746 25198 -15588 -29102 -25667 -43533
20811 -43533 -73700 -20382 5393 95395 47993 -19118 -75329 -57114 5200 72075 29803 6284
20799 6284 -52747 -56018 -49470 -75703 -50160 -87662 -122103 -140674 -130786 -116253 -126731 -114740
20787 -114740 -113646 -46504 -13286 -98036 -115260 -130184 -176873 -142342 -97200 -68569 -54864 -34780
20775 -34780 -47341 -44173 -140596 -190636 -226160 -156737 -74792 -40130 -28128 41579 52033 73706
20763 73706 123587 57582 39589 36097 53487 25174 18332 21927 -45119 -40688 22338 36478
20751 36478 -16339 -55895 -109078 -110014 -99234 -50839 -59528 -89145 -85251 -60205 -77293 -28166
20739 -28166 75988 83942 -14986 -66091 -82439 -134178 -96793 -53664 -56695 -21569 -20880 17559
20727 17559 -2677 -70546 -72057 -85781 -135696 -195006 -175088 -190010 -167394 -99635 -46235 -41031
20715 -41031 -40121 -75450 -18278 39601 33478 -72777 -64583 -46657 -59919 -74987 -99947 -129370
20703 -129370 -103381 -125659 -104867 -19014 9170 -13602 -32896 -28052 -45357 -103381 -42799 -10170
20691 -10170 -1766 -1822 -28608 -18108 48727 60955 56610 22295 -26677 -116831 -103983 -114030 -167475
20678 -167475 -161103 -93109 -60002 -6577 23694 -8056 -25257 -34278 -34868 -28338 -6011 4045
20666 4045 22624 -6328 37697 70039 23220 -18363 -54082 -43659 -11967 44375 57706 82132
20654 82132 87100 67661 -27482 -43248 10812 54483 47145 45621 52179 -13891 -57041 -45491
20642 -45491 -4782 -28288 -41809 -70424 -30738 16536 35682 55392 105434 68518 -39464
20631 -39464 -96628 -129592 -136575 -110094 -147360 -88358 -42534 -49475 -73556 -151712 -187408 -177553
20619 -177553 -134885 -140814 -124624 -62601 -48640 10085 20016 41776 82549 95461 144818 99201
20607 99201 34858 -4021 30931 4107 55432 70714 48126 87901 53852 -9004 -39860 -39778
20595 -39778 -44328 -32056 -54257 -14504 4969 100882 170983 272839 386071 471131 593237
20584 593237 705328 942531 1226803 1331764 1306940 1102334 837811 644610 551512 433621
20574 433621 336072 294356 196904 72049 43833 11878 -2245 16331 -18943 45673 91207
20563 91207 52252 27538 50944 80266 85396 35505 69590 110849 78357 64337 59684 26568
20551 26568 6893 38256 78507 65243 36450 -78106 -113445 -106118 -78034 -59913 -17094 -20293
20539 -20293 -10278 -14771 5166 -72500 -180275 -170759 -45476 1456 -46640 -115108 -116803 -89236
20527 -89236 -83460 -89786 -154835 -112800 -60635 -21195 -65989 -34622 -29793 -25073 -3546 -77952
20515 -77952 -112279 -143029 -92634 -13534 -24320 -46350 -29450 -58321 -26818 11011 60713 42922
20503 42922 67754 56854 -54145 -124459 -123437 -102673 -91081 -76458 -116422 -70598 -45325 4789
20491 4789 20776 6044 -426 -10210 -37176 -52575 -34408 -47928 -60147 -7052 48120 50048
20479 50048 57659 -175 -85579 -49019 -28112 -26039 24208 118235 128229 -7879 -42607 -54302
20467 -54302 -77775 -90367 -89376 -65969 -70412 -40712 -5742 -48649 -64014 -87858 -53566 -25848
20455 -25848 -13585 -53701 -74085 -11210 -12257 -2421 -21539 -68043 -16598 13668 4006 -10285
20443 -10285 -38853 -71325 -90991 -100901 -157761 -196052 -163553 -149587 -77065 10204 25222 31098
20431 31098 14258 -27906 -49691 -59560 -69316 -76750 -29974 -11162 11580 25362 73494 113912
20419 113912 62381 14244 10763 -2275 -2190 14292 -18975 -66867 -37676 -21351 -38463 -101587
20407 -101587 -170973 -117783 -37516 41444 53349 20209 32118 -4804 -42123 -8924 -22205
20396 -22205 -70681 -80878 -63074 -44050 -19820 -36660 -26468 -25018 -37054 -57646 -73159 -136270
20384 -136270 -151523 -91140 -40405 71409 24462 -37581 -24741 -19647 -31794 -45367 -40472 21340
20372 21340 41160 19470 56309 72537 101526 171471 184753 121065 47134 2243 -34496 -66290
20360 -66290 -22211 -36458 -57544 -90911 -53473 7739 1067 27914 103498 110068 114308 49500
20348 49500 -36682 -70744 -45208 -10883 14930 -4686 -26469 30848 36417 50412 48696 -31286
20336 -31286 -42139 62000 70521 23407 16116 34303 29358 -3018 53509 5495 -63210 2296
20324 2296 11787 -53891 -97384 -57260 5799 70076 55291 -46982 -83133 -98269 -104717 -114124
20312 -114124 -54872 -53035 -20178 902 13319 -41335 -101910 -125453 -126965 -61795 -122211 -124336
20300 -124336 -75414 7468 60264 8069 7633 109 1140 -4917 -17136 -17659 -26021 -50188 -91518
20287 -91518 -158504 -210106 -181991 -116328 13201 35449 96216 136204 99293 132620 71754
20276 71754 8493 -1104 -5743 -29821 -23667 -50624 -87531 -30607 -19747 39246 61691 -26125
20264 -26125 -50341 -38312 -25145 -67089 -12270 48685 116734 111018 54552 118621 98016 46581
20252 46581 23818 80230 98528 20290 -58727 -112948 -72616 -7838 1778 64170 121633 209275
20240 209275 201430 57916 53231 108677 69601 -39931 -7903 2727 34230 64626 85368
20229 85368 93071 94014 90052 114449 56120 8876 37934 -7978 -51219 18273 108136 151147
20217 151147 140433 96365 32267 75113 71205 30983 -37554 -49788 29321 50372 -18822 2506
20205 2506 56026 54409 141772 88279 63734 16402 720 -50939 40359 116192 62643 66228
20193 66228 79459 50298 30994 3986 -12193 -36201 -33961 -43446 -17832 13361 36061 50801
20181 50801 -1498 -5457 41281 51277 47397 68143 108126 126346 117916 158614 162298 134225 131991
20168 131991 199157 192813 167387 164127 148866 117090 75887 120242 110160 97334 -5844 30699
20156 30699 42401 47518 56475 63730 -3230 -76513 -67188 4327 31997 10055 -41488 -33279 -32706
20143 -32706 -14102 18861 48051 10046 -14626 -20701 -5552 29201 43737 60996 68511 45859
20131 45859 10523 -39717 -34235 -120349 -126937 -96260 -49585 -56536 -57301 6639 14890 1343 -1795
20118 -1795 75184 55287 45498 57876 40206 49917 -9093 -12676 64845 49002 21198 -5942
20106 -5942 -2613 -6957 83322 124935 110656 116892 70327 37391 67409 135944 130099 130283 93083
20093 93083 152965 212289 140492 40457 114865 149208 115908 115372 83535 67549 64485 45117
20081 45117 74417 127715 129511 121346 136868 65254 31287 79948 85861 26347 -32735 -9636
20069 -9636 34736 47928 78905 124283 114316 122294 139654 162921 194399 143361 156860 165845
20057 165845 245634 204819 86052 115062 118708 91369 138230 142434 127815 137879 131589 144911
20045 144911 175067 195005 211597 260686 245128 219412 180338 179476 159347 172261 139295 99747
20033 99747 116986 176801 187819 237348 281474 267907 282524 283457 350990 358946 342394 351440
20021 351440 394672 361746 377177 458718 538047 525053 524093 545998 593856 618172 626668 621871
20009 621871 652297 697994 729123 757559 844070 867470 925258 1006598 1034352 1106998 1242160
19998 1242160 1364871 1519138 1611431 1885302 2253826 2749980 3407448 3877643 3898063 3708114
19988 3708114 3594799 3596265 3793410 4223800 4738499 5445494 6367609 7538217 8749637
19979 8749637 9835803 10935020 12478423 14769333 18305801 23413859 31028140 43110009
19971 43110009 63308256 97167810 150797201 227217291 309415533 344216747 302078649
19964 302078649 213233135 135763824 88241450 61074004 44466667 33392454 25811880
19957 25811880 20511812 16779226 14102829 11968045 10401526 9362228 8678913 8193713
19949 8193713 7481710 6521007 5566034 4902473 4550554 4423350 4410196 4534814 4643615 4400148
19939 4400148 3820431 3154761 2649395 2370037 2156979 1981477 1833934 1710552 1576248
19930 1576248 1521852 1413779 1283732 1222654 1162162 1080321 1028614 973460 926626 870016 823131
19919 823131 796001 777731 760433 848078 872584 794178 782040 731355 696292 636572 598923
19908 598923 596011 589784 550069 456796 420197 375600 384690 369918 355294 369187 395549 371460
19896 371460 371443 367782 367657 428754 463242 448309 401157 343847 277614 331809 336114 263340 219054
19883 219054 246221 284094 296265 244258 237232 213568 145646 211957 210877 229569 251397 192345
19871 192345 153368 164977 219145 251272 257277 274650 244848 182024 142041 138882 128254 111847
19859 111847 66149 70888 116902 59365 96567 130730 70347 100410 122418 138508 111672 110043
19847 110043 141310 164135 123760 100486 174037 157001 135950 160125 57382 35410 127716
19836 127716 180982 208723 233026 154710 190976 140723 119789 159808 100261 100135 98146 133540
19824 133540 243921 246453 202260 120390 68825 82305 80797 123611 212816 134931 109977 101926
19812 101926 56416 754 71985 99301 133249 163959 168225 207791 147569 98999 78179 127077
19800 127077 161977 182990 208012 242914 226921 164868 145732 114131 128030 123139 137474 115349
19788 115349 149070 115242 74201 53031 56434 7476 13349 76557 89205 41913 -16927 -121833
19776 -121833 -84708 688 -14616 -56594 -27995 -49166 -713 49434 30186 20830 -337 1919
19764 1919 -15273 -27569 -69744 -47355 -18645 99095 124890 65042 22535 61070 48511 -36437
19752 -36437 -79047 -90397 -99563 -71940 -24251 56809 45599 24283 39558 -22315 -38808 9330
19740 9330 -10124 832 -24565 -21464 16578 -9522 9890 52330 80753 52624 18325 -4255
19728 -4255 27846 -10146 46924 115074 115299 37795 47565 24876 93240 124827 91549 -4410
19716 -4410 -12363 -37826 -67340 -21428 -40605 -29447 -5589 87 45822 64767 12855 -10354
19704 -10354 -34143 -134644 -198618 -196166 -107796 1840 -25398 -82422 -79500 -109330 -125399 -131921
19692 -131921 -78709 40430 56904 70828 56785 74795 90726 74014 53366 68986 121874
19681 121874 149527 163458 104279 -8309 -7922 43514 14561 45126 40916 52246 30167 32727
19669 32727 59264 5003 -33314 -66783 -7202 26610 50486 54456 28722 86207 8282 -61775
19657 -61775 11286 102837 64578 27933 77511 83315 111708 99501 106253 40110 40651 35750 62596
19644 62596 58394 56508 -14741 -70354 -63256 -5323 24484 -32400 -92846 -30448 10835 35277
19632 35277 86315 140559 58849 679 63478 78392 25340 -7542 19060 37920 48064 14879
19620 14879 -20295 57514 109689 31616 -18270 -25313 -71781 -46387 -59822 28221 49409 4357
19608 4357 45630 115912 110809 132240 151847 112157 84166 70762 77136 68640 106254 127644
19596 127644 85464 -39225 -50649 108 -7356 -70862 -55912 -90444 -62589 -77715 -92352
19585 -92352 -5939 1390 38684 45826 3511 22039 24307 25426 97870 76430 64820 97276
19573 97276 132724 153885 111645 102565 162384 275234 360713 409361 378538 388246 326403 298379
19561 298379 262512 299415 319540 313239 358510 339008 298289 285148 248304 211384 184176 113319
19549 113319 17510 13531 59652 51877 34349 86705 103504 35534 45819 -18021 -69534 14814
19537 14814 71207 187915 256748 296073 322050 384545 428850 359893 402954 418988 394309
19526 394309 348535 296001 289208 239404 218371 192713 172490 118734 100527 120106 78042 35149
19514 35149 49818 87579 122826 143343 74685 -13349 -13476 -33800 -79230 -32925 21735 32048
19502 32048 20628 -7328 40760 52895 5892 -39349 -58846 -55016 -27847 59970 67584 63182
19490 63182 -18174 -55372 -28029 -33911 -28575 12217 -10551 -19958 -70347 -31696 -39672 -59992
19478 -59992 -67209 -22071 31864 11627 -62122 -66210 -33149 48255 90259 122440 114484 99170
19466 99170 45915 63469 103763 118729 103003 69604 48356 19660 62329 144139 121474 90974
19454 90974 100855 102134 85869 154701 244733 298735 332434 360832 402327 308746 225421 271351
19442 271351 430465 451702 402322 339746 173895 150843 151697 162980 151356 142708 116711 148975
19430 148975 211902 266848 291883 328806 345881 375639 391745 373007 321683 210699 284849
19419 284849 384472 370826 408955 427702 366356 275412 220199 245827 227010 235505 276187 219065
19407 219065 232617 250501 248869 195447 188109 200498 207106 220159 260309 310794 336911 485460
19395 485460 768449 1187676 1658558 2217641 2342855 1938039 1575237 1482248 1734312 2212081
19385 2212081 2837075 3119855 2455992 1570284 1032811 740177 528546 384418 325731 346251
19375 346251 410416 449633 577822 785826 1048621 1461944 2036378 2708180 2772440 2097268
19365 2097268 1611542 1584263 1854982 2397751 3041666 3209977 2457978 1645334 1152443 917658
19355 917658 727959 588954 507662 481247 519154 520482 530555 615300 847516 1087516 1292975
19344 1292975 1381499 1340806 1170823 933060 729979 577319 509431 404722 310829 338333
19334 338333 350014 445636 564518 644806 938528 1393130 1942888 2619081 3034428 2647183
19324 2647183 1968547 1518604 1478874 1779691 2278782 2660711 2297732 1514016 977373 702605
19314 702605 560902 456431 396915 370028 316246 280090 301979 284699 278239 290331 314891
19303 314891 345409 354973 359131 479074 686763 927060 1300248 2003809 2900934 3266022
19293 3266022 2654642 1873465 1498130 1503164 1845162 2355343 2693171 2279582 1552607 1007422
19283 1007422 723004 584524 434416 292217 265288 219316 220665 244693 231169 213105 119142
19272 119142 82612 66763 42845 120771 193393 175157 105818 44840 42842 67498 70585 53757
19260 53757 -10890 944 38874 93759 58621 41301 69548 18285 -47307 -42536 -13702 69137
19248 69137 97894 78491 91873 46869 40253 44893 84498 78301 43337 75068 96485 47739
19236 47739 12794 37096 63213 107003 69174 41170 25174 32004 56882 76865 114318 116213
19224 116213 77961 53970 29735 49029 101636 101736 85883 100108 -2502 -30844 23759 -24870
19212 -24870 -33413 18016 44471 36184 852 -14120 -24479 -11441 10054 43142 63935 33200
19200 33200 -28744 -7294 50267 152079 118762 28784 51472 110670 145115 158255 138883
19189 138883 98844 87443 108826 125228 116450 38805 24970 30960 63029 53988 30717 31027
19177 31027 40873 119751 108696 107436 118891 107035 102348 123746 116413 126944 167220 152783
19165 152783 127586 96196 69835 39152 10647 64470 163802 170685 163781 150434 158854 123474
19153 123474 100862 39541 55430 76822 32604 17778 58713 51466 3736 21784 21733 88897
19141 88897 169669 174056 121455 140046 164757 164040 106635 81395 15127 24139 18859 9059 47065
19128 47065 64596 91982 89212 131893 178651 325038 321447 311057 253076 348705 483031 691624
19116 691624 1035429 1497800 2085421 2655649 2521035 1904284 1392799 1249812 1445062 1902927
19106 1902927 2499929 3021178 2804368 1988061 1359775 915220 673391 592580 627501 533261
19096 533261 505624 620772 825914 1027737 1432501 2033277 2713904 2823311 2152871 1572750
19086 1572750 1342685 1450343 1878520 2435333 3074325 3074735 2257924 1469519 961178 711403
19076 711403 528805 390981 338517 372963 374993 307687 303404 319557 293855 297474 280822 262356
19064 262356 205031 106775 138864 185974 174804 111129 119518 114924 188291 284169 325245 300231
19052 300231 272078 284945 314526 282516 252022 246786 240450 241828 278122 223497 208429 239515
19040 239515 265076 221487 190898 190193 225335 253210 316374 312703 328413 341190 322362 303707
19028 303707 345875 406531 431896 377979 340241 312683 397669 437732 499329 550760 592198
19017 592198 676677 808502 985434 1274111 1622312 2162419 2844314 3236147 2897909 2283747
19007 2283747 1917066 1941424 2251168 2724857 3318166 3609389 3148977 2540767 2108502 1877273
18997 1877273 1710895 1677936 1745522 1880733 2038387 2154941 2215583 2358150 2526322 2630218
18987 2630218 2791905 3011184 3350615 3888154 4545316 5362475 6411635 7766328 9467573
18978 9467573 11239974 12779255 15351426 20259352 28727744 41898684 59559488 76279960
18970 76279960 81696040 73532166 61032678 55752802 61245312 76190883 94979439 103065561
18962 103065561 91926195 67432246 44990861 31001312 23134383 18420626 15319561
18955 15319561 13167487 11768424 11005096 10656214 10504035 10538187 10668305 11016831 11740070
18946 11740070 13033687 15243109 18669850 24175604 33294503 47267697 65801864 82532191
18938 82532191 86809935 77695852 65438675 61851832 69642881 86783703 106526261 113954332
18930 113954332 101407116 76053830 53417218 39552394 32448125 29680855 30139717
18923 30139717 34320389 43687702 59524877 81405766 103763308 109607655 91928731
18916 91928731 70583570 59511956 59953094 69407637 83816557 92068571 80586880 58633458
18908 58633458 41439052 31280690 25523764 22179943 20296858 19745713 20439507 22621224
18900 22621224 26982682 34970721 48774084 69745167 96449743 118312242 113913579
18893 113913579 88233602 66405165 57648037 60314081 70901438 83620882 85057556
18886 85057556 68434031 47515017 32506208 23388825 17771811 14112725 11636966 9923061
18878 9923061 8666260 7639586 6831371 6199319 5713827 5273377 4773175 4272952 3841239
18869 3841239 3500395 3259526 3098405 3019480 3026810 2911318 2767060 2631852 2445295 2229169
18859 2229169 2029170 2019119 2049799 1962547 1897136 1823250 1683698 1526465 1413009 1335188
18849 1335188 1260294 1142518 1066198 1037910 1054300 1026656 982244 979092 1008983 1013186 943839
18838 943839 900076 848281 831846 804865 731735 705219 639044 631697 649853 651806 652791 650658
18826 650658 636876 632611 615256 633753 534020 547825 596088 613386 604876 568452 627619 601992
18814 601992 537008 556528 553497 542390 561721 541650 502515 525102 513109 444238 418359 356821
18802 356821 340836 427564 463759 402013 437865 462752 454290 430211 376561 357271 360334 345459
18790 345459 330610 365785 368030 284146 208064 217547 278905 313500 242969 214177 245869 298730
18778 298730 330951 352485 336987 266504 228613 257259 321088 295450 269653 246368 302774
18767 302774 305742 211997 179021 230405 250512 209724 197441 238496 262084 221273 196671 233116
18755 233116 295289 340892 327503 298381 204294 109887 124746 145950 147560 186813 204904 154874
18743 154874 141836 75638 86261 241855 259220 219699 190526 140959 107461 109468 80924
18732 80924 78897 148929 141557 136964 141613 156795 218635 198342 222925 197239 164330 134372
18720 134372 88050 118431 119043 107709 114076 131682 72606 17729 -17736 -16254 21086 35110
18708 35110 55870 80314 58790 14382 5965 33991 24295 -77 25603 37496 65437 81620
18696 81620 67138 86449 129255 185947 168563 177239 161368 152450 140079 87894 61002 55555
18684 55555 42453 -44269 -35497 33398 83838 160899 221697 187813 131179 120092 96985 159071
18672 159071 134557 33873 24944 1167 36323 95805 98009 89148 128531 127586 58465 45000
18660 45000 101047 121826 85363 37100 59219 94267 139557 108302 59713 31285 61076 98037
18648 98037 55695 41796 57030 38448 40140 72053 104647 83301 59902 80924 119066 83349
18636 83349 19903 22602 51575 73343 38623 -25824 -29977 -30218 -32083 -40110 -29135 -12842 15387
18623 15387 26029 -13787 -1134 21846 110662 122798 160273 154550 102769 75658 47243 36646
18611 36646 83876 70077 -8866 -21993 -45099 -3442 68703 111718 -7649 -11917 -35783 -69678
18599 -69678 -56339 19047 135975 145728 161879 189978 220411 242333 264261 248441 196776 188667
18587 188667 115049 184043 257573 317941 337455 291648 295890 319040 299989 197147 148928
18576 148928 213138 220931 202571 165260 217285 247005 218522 150117 114345 109404 113313 161974
18564 161974 176660 214362 277192 259162 269899 322573 405444 367026 358750 350012 310362 406245
18552 406245 455347 441101 429903 371407 276560 246791 200758 202535 162046 132688 141584 131733
18540 131733 86091 78574 58171 64858 140246 70567 24741 42243 74936 115198 152684 161781
18528 161781 187379 289117 331013 312046 300208 306024 203578 142463 113656 131510 39254
18517 39254 54419 53602 55315 54144 -24563 -59726 -37302 -46556 28801 51222 29410 4507 88250
18504 88250 135936 133335 155433 85463 49793 15077 35421 31805 20030 43198 31453 19593
18492 19593 40967 62510 56880 -17633 -4714 -54654 -58938 -2702 1397 39483 61600 67109
18480 67109 1465 -23107 -50013 -15302 -11143 26666 103684 113870 86288 102879 55756 32996
18468 32996 13544 37799 16799 25748 24919 63891 60021 113756 110135 57590 -38079 -112200 -156322
18455 -156322 -112560 -19407 77172 70967 -76863 -70300 -2044 -964 24477 7178 26945 34944
18443 34944 42961 4802 -56622 -54974 -5007 67561 51023 13667 1769 4609 36741 53740
18431 53740 -7597 -3129 18301 30234 87033 73449 96305 178647 145150 101179 48104 62369
18419 62369 36034 44055 44721 -39842 -109922 -65047 -12409 -88555 -136564 -51099 -51101 -142071 -158019
18406 -158019 -106642 -108660 -91721 -47584 -13342 -13815 45342 76532 99718 100773 50324 72389
18394 72389 82039 55834 48916 28041 63140 106825 124794 170257 246226 283509 302044 383418
18382 383418 408740 364645 333059 305789 365279 433857 481317 537449 479237 420902 475650
18371 475650 429200 389830 447966 578948 579472 547898 516212 561706 584597 630393 754767
18360 754767 858037 882776 831098 763472 728397 670982 617780 544214 536417 466365 451317
18349 451317 433209 380196 287964 268781 284120 273972 306112 293036 313410 358235 386040
18338 386040 409963 435823 392253 435543 398660 307453 301938 337492 384435 412699 395171 423176
18326 423176 418164 362165 331464 233615 172083 108084 68108 77415 38071 36284 36484 -11448
18314 -11448 -9903 -67704 -41812 37429 95497 58241 94549 146061 181508 147616 92586 100840
18302 100840 65751 58477 25188 30047 117955 149044 112458 73876 68345 81523 12581 46200
18290 46200 124760 89226 120974 165521 159324 146817 92670 150460 152797 113964 129391 47836
18278 47836 40577 72459 54549 37506 108876 79684 76836 90625 107985 76965 46001 47570
18266 47570 58933 119379 132220 147294 63765 -15754 -62523 -64049 56385 85996 40237 3154
18254 3154 9637 16728 37986 -20397 12685 66943 83002 97393 165964 151117 82776 90326
18242 90326 113777 93425 161572 157877 157804 151551 166946 226869 219925 294007 273059 365236 677971
18229 677971 1274618 1988548 2706270 2838781 2062585 1219800 688922 417130 294600 274189
18219 274189 274074 272568 228481 230857 191428 172489 202021 228175 264055 282181 332770 410936
18207 410936 614124 911226 1351451 2000655 2650046 2676267 2032072 1515584 1278781 1400661
18197 1400661 1742494 2262103 2795511 2730712 2072343 1407565 976545 718159 541721 461072
18187 461072 399100 312326 249476 228967 235587 193007 215674 274343 297123 316022 383200 472375
18175 472375 601401 901553 1372727 1992008 2599954 2558318 1866857 1255534 767512 553372
18165 553372 499414 381243 279130 228678 259714 257837 260688 238039 218569 100395 8756
18154 8756 37437 37981 37870 81293 73697 99125 80026 105522 169825 201599 157127 79228 15598
18141 15598 45497 53478 18144 -33580 -16185 132599 189641 170588 176211 231023 206614 164882
18129 164882 219982 271003 233117 279389 299096 298539 347182 372439 354274 416393 543892 791719
18117 791719 1200086 1831538 2601357 3106052 2637462 1736739 1054525 787226 641313 580766
18107 580766 504875 461305 378847 313461 266772 223700 298081 430222 505749 583534 724655
18096 724655 873588 1061545 1387669 1870245 2572113 3167908 2961547 2291722 1804113 1598561
18086 1598561 1602223 1892721 2379691 3004636 3381177 2982901 2263938 1865697 1716815 1711723
18076 1711723 1586725 1328231 1229049 1254248 1335487 1404861 1471091 1612593 1725021 1880652
18066 1880652 2041999 2278299 2592371 2881439 3224062 3854834 4800933 5618160 5696669 5465643
18056 5465643 5694750 6412623 7641221 9441465 12204565 16797549 24735207 38284311
18048 38284311 58449681 83735830 102819934 92007159 63337744 40791938 27605927
18041 27605927 20061081 15614212 12772772 10888882 9662228 8913697 8591069 8500838 8654121
18032 8654121 9059929 9859892 11204473 13341218 16738818 22341557 31748559 46618596
18024 46618596 67111433 89894540 99801363 84060022 62074304 48963412 46310563
18017 46310563 52951041 67434070 86826288 99313442 86878774 61338790 41110388
18010 41110388 28675954 21370347 16877133 13878174 11723616 10205646 9171723 8517281
18002 8517281 8212005 8210168 8438300 8929695 9942921 11762457 14734300 19699962 28452969
17993 28452969 42614387 62418482 84623692 92241340 72201773 46830153 30012964
17986 30012964 20554464 15012323 11470991 9148104 7483759 6222680 5221209 4529804
17978 4529804 3995807 3519866 3128038 2784799 2525157 2366785 2264878 2231657 2132839 1996280
17968 1996280 1954216 1853706 1782821 1711192 1611568 1546977 1489020 1477144 1556737 1554112 1375041
17957 1375041 1092556 964643 908349 881135 792296 687860 623971 558099 612310 572270 523939
17946 523939 565579 581909 532652 586606 593456 547452 527036 533838 594811 631794 639129 576659
17934 576659 546325 486403 416446 394317 380812 301416 284904 274458 306429 300939 314788 390578
17922 390578 353479 269863 221823 197385 213021 263404 265211 231129 282778 288467 325707 346968
17910 346968 295875 247745 223460 193450 181736 130693 121477 164968 195684 254807 227742 192435
17898 192435 222984 270166 267781 227125 213728 188838 248759 256527 194472 175104 174044 249357
17886 249357 284479 190510 111512 135617 180585 185047 200753 183580 167179 137133 73498 75499
17874 75499 67359 117558 180274 180416 91685 28055 2785 57431 156431 233599 226411 123679
17862 123679 119719 115549 93732 87635 112961 142006 155226 161537 130733 132175 68955 39265
17850 39265 41117 16717 -39882 77681 109310 5046 -20178 87575 143738 140538 118194
17839 118194 151438 155179 183518 197798 108747 25035 30121 127074 140512 139820 123899 147939
17827 147939 160268 147018 89332 98207 58751 35490 74585 107260 136948 89251 33549 89121
17815 89121 87131 86903 64787 8657 25020 79099 137559 136527 161224 94332 -24702 -63846
17803 -63846 -75067 -89869 -97865 -86871 11020 12763 37890 91422 30634 -7209 41729 35922
17791 35922 -1708 790 5235 28790 31133 50287 55108 43542 39769 -45114 -63546 -14672 -29396
17778 -29396 -41624 18540 11368 -17959 -7263 28921 58762 25656 -23632 -40852 -35672 -78438
17766 -78438 -63165 -69533 -16463 -13361 0 -1150 75975 121534 33782 30058 34123 131039 205956
17753 205956 115858 -1870 31926 52663 42016 -839 42121 10227 14541 68616 72120 28363
17741 28363 -9091 -44970 -13661 -10819 -21324 34594 21751 46565 56562 71785 16883 44977
17729 44977 71515 -30624 -71363 -20583 -47211 -26387 24995 -511 25124 35201 17857
17718 17857 -22637 -59057 -28147 42926 68345 103173 111817 55264 -31456 -22211 51416 108438
17706 108438 120449 63227 24771 -32293 -86761 -64540 -81676 -85999 -87692 -113244 -90031 -21998
17694 -21998 -22210 -82369 -108788 -50707 -62887 -113347 -113805 -81587 -47011 19409 -3144 47206
17682 47206 157576 136445 114281 55365 -8053 -48038 -66946 18667 90430 52395 14986
17671 14986 44126 49229 29679 10440 -207 30933 57186 125012 153393 198597 178947 165667
17659 165667 161755 158273 104714 87353 103531 143429 138070 74809 64524 75705 61261 91869
17647 91869 103420 97917 121882 98677 38748 165 6711 -54178 -45229 -24290 -29859 7250
17635 7250 -13342 42756 69839 59146 43365 34484 -21665 -11884 3014 -14243 2671 55722
17623 55722 48921 86419 141566 185458 118946 34539 -39107 -23786 -15734 -43169 -26818 35177
17611 35177 79722 58174 52654 4038 52883 14320 -45857 -2693 49865 98369 113779 105354
17599 105354 58213 3400 -38070 -15619 40292 27620 -29854 -7240 32309 21113 3214
17588 3214 -30276 -88210 -62482 -22821 21609 -43802 -46195 -5105 77997 79109 -17614 13016
17576 13016 31242 -39975 13101 25917 35554 89028 145041 81708 6462 19721 -18994 -45055
17564 -45055 -48276 8306 61093 66114 68560 99249 44103 49540 102937 145680 148440 73973 32436
17551 32436 43082 2261 -71487 -50692 -14971 -18777 -90547 -76299 11503 19781 28130 37335
17539 37335 33372 -10185 -107257 -122622 -47569 10665 22358 -9298 -58549 -42518 -63245 -55174
17527 -55174 -84399 -51073 2904 35970 29438 54705 46637 10172 -33528 -39355 -28364 16969
17515 16969 70474 87975 112765 144473 194701 165888 161001 183074 135742 148669 203379 257716
17503 257716 269509 236438 263856 258890 212142 171699 123066 85134 67289 74955 80395 71978
17491 71978 84321 75089 105702 117915 150154 146915 162465 159444 153388 225305 227970 212406 254040
17478 254040 268019 267368 222064 200641 170391 236698 318946 355878 324815 306759 209804 187988
17466 187988 186539 162957 108971 33136 60871 181231 160567 109011 -4123 -22838 -6514
17455 -6514 31251 160328 229206 234269 231453 252734 316600 239702 208812 232567 247426 277546
17443 277546 255499 187937 110362 143838 173155 159068 127123 93150 36092 -17007 -3260
17432 -3260 4282 14797 -8707 -40665 -34850 -19457 -44351 -106005 -82103 -84541 -56844 -15139
17420 -15139 6658 -14844 -19746 52636 40814 49904 86206 117269 30933 -28553 -71319 -86646
17408 -86646 -72108 -49442 -28073 -3308 6194 -24611 23684 69730 -24562 -39042 -22816 -67514
17396 -67514 -71995 -55959 -99991 -149182 -78439 20991 -7047 -28531 -19174 13188 876 52997
17384 52997 34253 8329 -28114 5643 25412 32696 -7527 14173 42166 42057 55815 38950
17372 38950 -6787 -42503 -43805 -61107 1329 -40406 -18290 -9225 -57764 -3176 21790 -15667
17360 -15667 -68162 -159045 -103071 -34796 -23309 31959 103619 89705 55922 22103 -56453 -36082
17348 -36082 48593 71647 44709 -11443 -33219 -74520 -124941 -191095 -163886 -103220 -44890 -46774
17336 -46774 16997 76437 60552 46513 31799 19443 -6159 -77274 -71130 -60008 -32923 -71240
17324 -71240 -172465 -147872 -103116 -41266 3743 42694 -8714 -101986 -39429 -19810 -33946
17313 -33946 -15913 33349 64675 45021 -64357 -61296 -32132 -24877 -52096 -79692 -28718 39649
17301 39649 62548 40205 -32328 -127239 -93073 -73141 -37179 -42625 -37109 32760 66283 33940
17289 33940 3639 1267 -33972 42928 80563 76201 85739 59064 7552 17541 100327 22619
17277 22619 -21850 7072 -21167 3860 66121 33347 -23571 -46984 4607 19353 -18123 -40276
17265 -40276 -10708 56560 36515 -28746 -34155 -16452 53359 67159 49655 13938 -20886 -17407
17253 -17407 -2588 -11112 -4644 -54742 -92281 -111363 -93862 -88996 -130374 -123884 -49896 7760
17241 7760 41473 -38245 -65965 -23471 60681 132478 93458 51894 4566 14663 72406 70027
17229 70027 19969 15041 38121 48931 62937 56555 -19082 -47570 -13778 40108 30714 -21034
17217 -21034 -37138 -15557 -12932 -67166 -78483 -106393 -126587 -106748 -71088 -92324 -104563 -98004
17205 -98004 -120676 -66184 -88630 -60211 -24599 -15670 -59468 -50718 -17470 -58479 -62867 -46364
17193 -46364 -88353 -119218 -40713 30147 11813 5784 -14668 -10222 -1207 42284 35714 -27435
17181 -27435 -57821 -27047 -9920 38866 -9905 -63865 -69670 -21693 16318 20896 -19490 -81857
17169 -81857 -148465 -93955 -77504 -76287 -30055 -40837 -64115 -102231 -123861 -142835 -139580 -151531
17157 -151531 -123596 -69433 10277 12484 -24482 586 -7707 33076 26808 3534 1453 37411
17145 37411 90408 94816 68806 69845 -16257 -56387 -20723 19539 44288 73113 84247 72062
17133 72062 859 -27773 -1126 -34750 11804 -13503 -25442 21675 8694 -43349 -34743 -56077
17121 -56077 -32850 -16044 -38115 -76554 -57320 -63550 -19746 -13808 -55039 -41633 16233 13083
17109 13083 -41976 -55216 -114102 -125085 -90699 -25459 -24379 -1224 -7459 -26935 -44369 -49955
17097 -49955 -104824 -135332 -122758 -50261 -16314 61046 66246 24170 -4129 35671 59051 33430
17085 33430 -7098 -30995 -93420 -42444 45607 74229 55921 -25371 46870 112536 82734 54770
17073 54770 61404 75084 68493 11024 26461 76 -14236 -86248 -118842 -78028 -36741 -40691
17061 -40691 -87294 -112921 -113684 -101867 -64243 -85226 -92253 -103337 -157925 -165257 -105699 -63834
17049 -63834 -47778 -35176 -65376 -75232 -125964 -69137 58761 35494 -27050 -42421 -86766 -48577
17037 -48577 -58912 -139073 -151823 -152808 -165584 -131994 -89471 -85749 -112708 -92867 -47159 -37302
17025 -37302 -60197 -54951 -49863 -99415 -40207 43222 90830 83301 -10502 -19253 -12212 -11293 16453
17012 16453 47823 69896 -27257 -6937 -1470 -48832 -80751 -112467 -118737 -114443 -165233 -174792
17000 -174792 -125822 -161739 -125761 -53237 -46563 47274 118830 86915 9626 -100611 -168944
16989 -168944 -116510 -48061 -6770 29394 57681 37864 21417 -4926 -52578 -67252 -76343 -84807
16977 -84807 -108504 -89105 -60684 -38056 -84087 -173891 -153189 -72717 -90131 -108280 -92938 -74286
16965 -74286 -139651 -136165 -147115 -131532 -27369 -581 -23103 38556 -857 -90329 -93518 -80654
16953 -80654 -60348 -18360 -84616 -61979 -5736 -9262 4436 -29206 2804 20441 36263 56118
16941 56118 38051 -42325 14503 49306 15831 12119 31781 22380 16925 52156 29488 15001
16929 15001 -27059 -12122 32272 5501 -40807 -18978 7376 2405 -7387 -12083 15805 4953
16917 4953 -2903 16945 14780 39913 119143 117264 72668 33870 10013 -6219 84559 40770
16905 40770 -1481 -82793 -95557 -59996 -153719 -173320 -109229 -71661 -79907 -64169 -22906 26147
16893 26147 15326 -13903 -39315 -73267 -27453 41436 52904 7531 -79395 -144516 -112839 -84260
16881 -84260 -83216 -9975 37189 -17015 -75310 -64843 -79280 -81580 -52287 -24778 16583 65946
16869 65946 96735 141817 158511 160304 90630 -21499 -64883 -37716 -26949 -89027 -83564 -62234
16857 -62234 -23268 -6479 28772 43992 -45107 -121110 -102047 -12634 27397 18345 21627 13528
16845 13528 -20175 -6208 26317 39606 55909 21501 -51330 -62913 -45488 -19297 -37601 -71733
16833 -71733 -66775 -39705 13376 4345 -11652 -34742 -79365 -146845 -111036 -18292 -4373 -48826
16821 -48826 -72326 -25061 68793 127302 63136 2812 38328 106269 60192 78519 82174 -84522
16809 -84522 -109895 -51051 8396 -35049 -20064 -61077 -56686 -40633 -65465 -83088 -52331 -65416
16797 -65416 -99885 -35148 -67209 -16266 39844 -14095 -131903 -109569 -39735 2702 -35921
16786 -35921 -16049 32916 -12298 -30204 -64330 -92836 -26440 67198 62982 -49810 -12194 6079
16774 6079 -47901 -51626 -70187 -124892 -112179 -111391 -112113 -67087 -38956 -31938 -31438 -132529 -99162
16761 -99162 -80062 -88042 -52894 -38967 -13594 -9111 -12199 -13375 22480 -10100 -72401 -39430
16749 -39430 -62443 -47854 -17237 9015 18178 12866 32280 -15343 -28143 6312 18298 56061
16737 56061 33791 -34802 -62790 -154364 -191056 -184157 -134500 -155534 -166419 -148941 -100862 -80127
16725 -80127 -44492 33732 14561 30075 23183 12157 95957 62200 1384 -70355 -109863 -83650
16713 -83650 -60095 -49132 24779 37964 43462 29490 48765 33111 21690 37693 7109 5209
16701 5209 -21952 -52999 -38099 -6607 11830 22594 49893 21766 50866 60265 6661 -22291
16689 -22291 -8495 23178 50519 -16109 9686 3788 -11063 59793 22539 19481 38706 12096
16677 12096 -35187 -65856 -67830 -115331 -136500 -82851 -16291 -55516 -47755 64351 89504 122145
16665 122145 1452 -52544 -33975 7155 -20738 -25630 49844 33350 22410 57467 67641
16654 67641 43743 71331 -2133 -90309 -135929 -159002 -137352 -148800 -149288 -106357 -74191 -122791
16642 -122791 -144382 -163645 -122478 -27278 -81111 -94187 -76663 31637 83748 -29547 -87955
16631 -87955 -94458 -73367 -30557 4360 -10511 -73419 -4292 58690 -12672 -23713 -66837 -95774
16619 -95774 -110993 -98987 -58236 -28965 -42411 -92063 -56962 -86256 -132534 -82759 -37688 56699
16607 56699 29581 -42779 -51461 -6702 29629 25010 97904 60496 -18232 -41898 -34594 -27720
16595 -27720 -16575 39054 36163 14675 235 25817 -12081 -3311 -47465 -91235 -100731 -68298
16583 -68298 -37333 -44085 -87560 -101704 -96012 -67516 -66414 -34820 59921 36940 -22714 -76400
16571 -76400 -42206 -11746 -49891 -120979 -150805 -104116 -62277 -113652 -68859 -97551 -70683 -9784
16559 -9784 -31787 -101360 -180305 -196175 -126011 -73510 -77202 -105758 -145763 -169216 -149778 -76407
16547 -76407 11055 -55615 -86691 -75389 -25532 2129 -22248 -53621 5651 37759 72416 40725
16535 40725 -75430 -91208 -49040 -74242 -165695 -126405 -136528 -95612 -73342 -71486 -62663 -44460
16523 -44460 -67103 -155061 -196079 -114948 -130463 -123156 -81688 -20399 -12981 -38073 -15737 23725
16511 23725 25040 -41062 -45677 49648 60586 66337 34565 10156 -56705 -119035 3032 67678
16499 67678 33790 -17861 -34634 2684 -36382 -42045 -64467 -78364 -97663 -82797 -78262 -44370
16487 -44370 -485 -47195 -127310 -108647 -77483 39479 43729 15777 42146 87574 14013 -41983
16475 -41983 43533 90091 79906 67935 116889 78087 -23519 -12967 23534 69617 27279
16464 27279 6788 68079 24330 -10624 -6816 -17938 -61084 -75762 -104620 -116172 -19500 64877
16452 64877 62961 63074 30446 28868 62438 62053 98078 33563 -7633 -90980 -73645 22034 34952
16439 34952 71792 76670 29778 45398 6983 -22343 -34407 -54824 -50090 -16210 -45950 -41299
16427 -41299 19976 8773 -37414 -40488 -33270 -67169 -67104 -69387 -22770 10934 -49795 -54364 -33783
16414 -33783 -59474 -50719 30486 91263 112251 104620 43822 8439 61064 38060 9361 -87742
16402 -87742 -103991 -119946 -139109 -160507 -100066 -52816 -56541 -38806 -66409 -66912 -35694 -47049
16390 -47049 -34299 -28983 -7630 -39217 -47243 3676 -51322 -15654 19199 11254 47072 43492
16378 43492 55902 44274 -15185 -39307 -43069 -27925 -23753 -47237 7421 -13138 -93889 -199671
16366 -199671 -200737 -125139 -45878 -34293 -52897 -80371 -20739 12928 10915 31632 37455 61579
16354 61579 21395 -10478 -21820 -39952 -49788 -3970 34289 -30484 -87420 -48624 -17743 -23617
16342 -23617 -60967 -101007 -14903 13834 29450 34402 44450 24081 -21132 21248 -49941 -95546
16330 -95546 -23252 -1082 -19386 41032 77130 39643 46269 23227 43586 -7680 -35753 27855
16318 27855 -13229 -8573 -6461 18428 -15251 -14641 34015 17491 -48244 -76450 -86258 -34231 -23305
16305 -23305 -32959 -41888 -40138 -45214 -29093 -68675 -48286 31857 108195 79860 14318 -21732
16293 -21732 -2525 -60449 -47166 19423 5535 -54318 -115505 -76627 -24860 -21226 -7310 -22910
16281 -22910 -57786 -103380 -30852 14151 59418 17693 -53873 -85813 -23473 -61652 -96461 -82238
16269 -82238 -23054 -16948 -27057 -74122 -95146 -154402 -162836 -83403 -99353 -77622 -56463 -22531
16257 -22531 -39698 -76110 -55621 -64133 -88230 -34419 -31079 -10019 10817 60881 53580 -66132
16245 -66132 -111907 -116556 -74578 -63554 -14448 39268 32055 2311 -25313 28594 39249 6104
16233 6104 -29849 16508 42994 -40876 -104538 -100965 -101693 -38515 7431 45181 16275 -57448
16221 -57448 -77358 -51557 959 47268 6568 -20945 -11272 -37250 -148588 -97444 1024 -30995
16209 -30995 -25845 2443 -7829 3127 -13559 -10896 -9421 -23196 -35004 6258 -13713 -10030
16197 -10030 -75700 -118834 -149306 -109164 -92141 -76853 -71749 -122625 -132624 -66966 -20523 -75592
16185 -75592 -106772 31201 -10265 -88418 -54691 -87926 -77947 -42395 -114124 -159234 -198070 -145726
16173 -145726 -93803 -96357 -49584 35048 60141 34336 38603 20292 -29484 -23517 78501 79010
16161 79010 56250 55641 41409 4649 20231 15767 32372 33208 30773 50316 -12728 -74907 -170775
16148 -170775 -60009 98203 136910 54874 10283 26331 -9444 -7951 -27230 28203 61955
16137 61955 23919 -17361 -41074 -78287 -129877 -119858 -134745 -82791 -14545 -24491 -30907 -69094
16125 -69094 -25251 46875 28081 -68565 -67517 -8487 19348 29935 29169 -8511 35778 3218
16113 3218 -17772 -24444 24712 25791 29749 27802 19401 16774 73792 106620 97253 45569 -19537
16100 -19537 -18911 -44847 -64202 -90350 -78241 -74553 -28808 109282 115241 30897 8832 -438
16088 -438 16416 -25457 -87395 -67872 -88326 -117657 -38286 14339 25767 -44468 -38895 8509
16076 8509 -28752 -64337 -6078 39533 65631 18238 -38579 -19047 31238 38448 -17529 -48693
16064 -48693 -18367 -7515 14104 36417 74797 60795 -7960 18222 14373 2467 14023 10978
16052 10978 -37304 -43388 -67624 -76684 19355 47690 34602 5353 -75400 -121212 -113760 -64092
16040 -64092 6883 -9990 -79126 -48703 -100717 -78801 -30201 320 -29837 -37509 22403 19426
16028 19426 19693 44976 17127 -9698 -22563 -65583 -24328 39799 58794 39156 61330 49325
16016 49325 25569 62255 67998 144846 97959 55258 36445 10545 -12676 5795 342 -219
16004 -219 -32136 -117351 -101875 -153150 -178894 -84222 20965 116562 67862 -5775 -40314 -46776
15992 -46776 -51094 -19238 -46330 -38292 888 -11514 48712 70763 71387 132056 161791 177784
15980 177784 150797 110566 82770 72613 62440 25393 31008 43044 50844 41286 52164 59017
15968 59017 58350 64189 34219 -22103 -28991 -66123 -107072 -121205 -70927 -8532 -15645 -51353 -78754
15955 -78754 -53844 -50070 -10123 37337 19835 -11528 -662 53939 58715 97107 96047 62233
15943 62233 37372 37979 -11599 -56881 -8010 7697 -44048 -40392 -15251 -14372 15182 -32190 -42380
15930 -42380 21584 96021 72707 103020 49623 -10398 -92305 -99951 -67340 -32055 -30700 12705
15918 12705 -33192 -74186 -46606 -52751 51738 152288 143447 81422 85076 29329 -82706 -87022
15906 -87022 -56004 -59727 -67106 -126864 -135084 -54577 -56864 -60518 -32789 7794 -1296 -81081 -52013
15893 -52013 44901 90180 51288 70440 80554 18803 -6280 27726 36159 -6742 -44552 -36868
15881 -36868 -71809 -116516 -91783 7681 1228 14354 -24489 -35338 -3923 34204 26211 -43875
15869 -43875 -118433 -135641 -163733 -67148 -1289 36519 23206 24449 -47077 -71339 -48601 -76959
15857 -76959 -106774 -50109 -96995 -68633 -48487 31870 54060 9931 39322 18734 -39905 -76019
15845 -76019 -81936 -41315 52969 83667 47532 2345 -49216 -81514 -88541 -27999 -22390 -95169
15833 -95169 -157622 -172777 -107417 -83317 -30868 -32403 -10569 -1973 -1207 -27405 -66213 -86029
15821 -86029 -79058 -16908 -45205 -44257 10505 27782 43586 44409 -13682 -86546 -133708 -86715 -86404
15808 -86404 -139515 -114065 -114624 -128146 -187245 -115258 16675 70052 39380 -17366 46912 117703
15796 117703 93460 71686 -2708 1440 -76282 -70416 29347 23846 -14740 -21205 21443 34888
15784 34888 58739 107667 95781 9192 -63180 -67051 -57408 -58317 -57047 -73444 -18067 59030 83551
15771 83551 94523 98022 10566 -50090 -63365 -71849 -64171 -19917 -9113 -3420 -22981 -57794
15759 -57794 -15111 -3294 2632 -15443 -5316 -31066 -9126 -2892 25093 -17098 -84847 -120944
15747 -120944 -117829 -88059 -15523 20563 24680 6708 4931 -12600 -52963 -14513 25015 52050
15735 52050 31757 28542 8355 516 14366 12865 28825 45343 10040 -22328 -37569 -59665
15723 -59665 -25463 -36354 -43557 -46536 -39408 -31800 -58497 -14406 10360 1154 -702 40010 52834
15710 52834 550 -755 33640 578 -56105 10308 43637 -67378 -71658 -22049 -2852 20269
15698 20269 20955 22244 -26917 -92989 -131827 -94849 -50692 -3659 -18094 -69438 -61832 -27120
15686 -27120 41105 31189 28152 28467 6665 1726 28620 67922 20736 -4107 -25559 -43625 8544
15673 8544 103686 33093 1523 4117 15933 60918 98487 95842 48130 -44824 -65401 -106123
15661 -106123 -83240 -54878 -50403 13244 95105 85756 70366 15112 4165 73552 42855 -27617
15649 -27617 -96091 -62441 -74438 -28908 16713 -39526 12395 47843 -628 -71481 -55756 -5181
15637 -5181 -28537 22281 66592 23030 19903 -8761 -90845 -79820 -42757 -43262 -48916 -40828 25990
15624 25990 43352 66642 -3667 -61437 14649 28878 70691 106376 95092 35886 41333 -7058
15612 -7058 -50795 38825 99050 17278 -39181 -72141 -29370 599 -24166 -41515 -53865 -61573
15600 -61573 -39961 -27033 25977 74170 50737 -15253 32935 4023 -60244 -12727 45916 40579
15588 40579 31895 39971 -35795 -151621 -164702 -126163 -103797 -87107 -54985 8342 48170 9634
15576 9634 -66374 -122161 -149367 -83405 -59759 -79398 -67176 -51085 -112530 -98946 -61861 -57843
15564 -57843 -22794 19318 30298 -8536 10150 34796 15751 -48937 -37858 8064 -32274 -74711
15552 -74711 -41980 6868 8597 1934 103955 126148 48128 -3471 -34234 -46133 -62553 -62504
15540 -62504 -12698 68355 72779 17330 -30390 -13914 -8363 -23126 -96376 -86321 6456 2490
15528 2490 -4591 -26224 -65838 -111445 -115632 -113096 -61279 -18801 -33347 -31978 -42392 -29982 -43428
15515 -43428 -62780 -88696 -126734 -159568 -138401 -83188 -49755 -9853 5967 57647 -6808 40801
15503 40801 73061 58897 61045 58519 39597 8070 -9066 34603 57417 35192 26241 -48448
15491 -48448 -47925 26201 67784 46757 5646 -25054 -27575 -26295 -24605 -24838 -64366 -58784 -7076
15478 -7076 -12774 -44100 -36867 -13979 -11522 38540 70082 97697 31296 -3621 17023 55629
15466 55629 66895 40635 12152 -26973 -19885 50060 117537 102013 15256 -24324 -53947 -94546
15454 -94546 -59612 6900 17719 78082 72162 69232 -9601 -75226 -118495 -126883 -139810 -129149
15442 -129149 -107815 -41111 31656 -1235 -123496 -193149 -128795 -46839 -40391 -25466 -3579
15431 -3579 35405 29002 -7126 -21262 -1045 -16217 -11598 -15949 -35835 42173 46457 68647 68208
15418 68208 31345 28826 7340 5756 1190 33299 -5437 -17268 -25025 -79900 -98884 -56641
15406 -56641 -61462 -119149 -83916 -38747 -71191 -46279 2284 28566 53910 84262 25558 -31778
15394 -31778 -80269 -51535 -37249 -21604 -27653 -21888 -23909 -10914 -4786 37646 50990 12392
15382 12392 -15019 -62208 -78069 -45117 27780 14195 17152 115288 91020 3873 -53661 -91290
15370 -91290 -67719 -40913 -78151 -61353 -87790 -52925 -55328 -12701 34072 69120 58334 -13244
15358 -13244 -58749 -48672 -35918 -38106 -38512 -17626 4415 5854 -49316 -81884 -50808 -20139
15346 -20139 -60301 -115434 -102179 -20616 22680 34909 56530 66731 76125 68338 -4916 2076
15334 2076 -2730 -31070 -79353 -72884 -54022 -44141 38398 -4928 18111 74950 52521 40620
15322 40620 6915 -15548 -20987 -36141 -8334 -22300 -14502 8813 33554 16595 22176 13007
15310 13007 -32322 -51220 -25889 -31358 -26100 -87631 -102502 -58721 61571 47540 11525 6710
15298 6710 -35342 -124428 -177480 -158578 -154839 -26739 50208 -1595 -37775 -98129 -31830 -15836
15286 -15836 -50561 -1941 67709 39945 -39662 -132769 -89870 -48584 -24740 20447 80974 135637
15274 135637 62084 27256 52647 26586 -28068 -46577 -58860 -43783 -22905 7413 15263 -82806
15262 -82806 -47170 -9553 34449 4927 18038 27954 -3196 25815 24316 -43242 -110184 -160390
15250 -160390 -170482 -43620 -5188 19957 72437 85842 53256 -14395 -49607 -15559 -102202
15239 -102202 -164095 -148345 -60667 -40402 -81733 -153967 -198823 -118490 -78859 -83979 -18163 -34669
15227 -34669 -144364 -129018 -56850 -75115 -41171 28217 18473 -45389 -79243 -96187 -86508 -89833
15215 -89833 -108221 -56385 -36579 -21886 -54844 -53390 -64250 -89468 -118593 -193508 -192028 -127311
15203 -127311 -93195 -32922 41172 24531 10526 -28486 -59037 -59822 -6118 -23457 -125633 -170731
15191 -170731 -114239 -65255 -8925 36035 72071 63045 77258 29888 8850 -4354 902 -5859
15179 -5859 -55144 -40515 -58219 -49567 -87524 -174964 -176771 -43692 21396 -11511 -85261 -103470
15167 -103470 -80435 -50238 -74349 -76087 -44815 -31381 -45861 -56449 -26282 43528 49062 27112
15155 27112 -22167 1839 -16296 44491 65633 2736 -1798 29327 -17515 -12413 56366 91958
15143 91958 116872 91062 138698 100073 84355 32507 93777 69355 83160 93684 66255 43776
15131 43776 57546 16865 -17185 -41416 -108823 -147379 -164728 -166962 -97697 -83379 -19474 35891
15119 35891 26798 47441 90909 78425 68855 17592 39118 26569 -9647 -56855 -6339 53320
15107 53320 32741 -29666 -70408 -46664 -84616 -49302 -21569 30193 -10799 -78197 -47212 -38248
15095 -38248 -20934 -15474 23958 80273 63878 15669 -32637 -10898 8466 35969 8510 47143
15083 47143 71151 17350 59014 100061 41886 -55232 -54573 -77216 -109664 -64474 -72055 -68862
15071 -68862 -85399 -117838 -174673 -132306 60957 121547 9848 -84593 -50708 24785 27512
15060 27512 17215 14834 -25519 -60286 -109430 -81997 -19239 -38068 -34244 -55074 1640 -10426
15048 -10426 -66790 -14205 32119 -13929 844 30883 31889 -38806 -117127 -98352 -37716 -42936
15036 -42936 -43182 14638 -6858 -69867 -69900 -61813 4831 10508 -2285 -32684 -37909 -18111 -40759
15023 -40759 -34396 -34655 -7393 68766 110842 102492 35174 -26475 -27294 25786 9892 -29235 9830
15010 9830 7253 -45034 -14467 -24493 -143530 -155140 -40879 35543 32387 15232 -27296 10066
14998 10066 33285 -686 16983 36640 8791 21825 -13600 54835 89424 24075 50148 9502
14986 9502 -17483 -45554 -95253 -55889 4307 10493 -5842 -39959 -66429 -81444 -117133 -86518
14974 -86518 -27462 3072 -56680 -121707 -114102 -23630 -8985 -10256 49733 68609 36810 3452
14962 3452 -10118 18939 72826 18949 2473 -22221 -36909 2668 55128 5395 17015 -21961
14950 -21961 -49413 -61025 -60291 -65175 -66000 -88528 -97850 -121389 -46913 -17703 -47353 -50730 -68103
14937 -68103 -110109 -103703 -85116 -86939 -127153 -52037 -89471 -99219 -423 48489 16770 -39492
14925 -39492 -61886 11539 -26678 -94680 -69257 -114740 -147702 -138378 -125543 -35788 83090 123962
14913 123962 25592 11967 -2988 5943 67610 66838 -7652 30131 -40124 5946 51878 66651
14901 66651 48474 38772 -3943 -13673 -11621 -15483 -65246 -23191 6391 43710 13605 -75053
14889 -75053 -47724 13642 16587 23707 31039 -18903 -8498 -18842 -76662 -92131 -62182 -45181
14877 -45181 -24331 -16375 -42778 -60836 -33113 15298 22453 1454 -75373 -108642 -55042 -45979
14865 -45979 -152755 -143612 -84544 -31031 -50876 -31846 5719 -40690 -38162 -58696 -70448 -156189
14853 -156189 -170207 -132543 -100616 -39997 -54030 -109827 -140073 -141007 -72705 -15305 35943 4354
14841 4354 -7787 -10478 19496 58549 43193 41467 16622 -13912 7646 7257 -13238 2706 46694
14828 46694 79271 64787 39222 39828 -5351 -81361 -162292 -102698 -27928 66299 86930 64990
14816 64990 43513 41083 9323 -12205 14232 -15842 -13058 3601 -8415 -3986 -51409 -89627
14804 -89627 -98434 -47484 -55759 -95971 -74219 -81410 -42052 27831 -14901 -76861 -53901 -81615
14792 -81615 -61472 -66902 -64485 -54084 -22051 -29460 14067 84111 16798 7694 26600 50722
14780 50722 54693 48373 -41986 -61416 -32683 -34300 -57797 -42573 18730 -8761 -50992 -32087
14768 -32087 29390 12685 -59293 -96713 -71571 -22515 -5464 -8018 -10779 -37597 -49178 -25760
14756 -25760 -41324 -26341 -36281 -33253 48222 71347 1966 -27857 17666 59421 84576 2043
14744 2043 -48305 -88425 -99548 -68797 -86885 -71411 2533 64664 78457 43076 48802 37556
14732 37556 5388 -2587 -22741 2741 15271 -24606 -60274 -47738 -56334 -59141 -55320 -37519
14720 -37519 66625 96891 67814 3933 -68632 -105813 -49263 -15040 -8673 -35858 -20219 166
14708 166 -37852 -57040 -17584 18826 10942 18743 -10227 -1730 -40467 9139 25153 -22968 44908
14695 44908 99747 173407 177756 127199 36274 -72812 -141031 -116359 -20175 -19898 -69495 -58414
14683 -58414 -84808 -78627 -63444 -61214 -38011 -27541 -149465 -208878 -120767 -24060 40885 36927
14671 36927 45362 -7305 -60463 -88062 -44514 -40179 -50552 -122622 -156046 -79541 -35460 -10254
14659 -10254 -49620 -3097 28467 -27005 -65504 -2588 45008 29014 -74497 -77551 -56161 -15968
14647 -15968 33981 -4092 15312 -59587 -112758 -45054 -37057 -84418 -110511 -159918 -185649 -142072
14635 -142072 -33401 31822 10662 -65228 -41196 -6738 -25453 41894 70959 87430 67734
14624 67734 37901 68123 75262 51749 28937 -23307 -72610 -89087 -104512 -103697 -68148 -40069
14612 -40069 -103876 -162598 -119426 -31908 32824 54701 43940 75742 73397 -27984 -36589 -27725
14600 -27725 13792 591 40788 101474 91224 48017 -1077 -21511 -22813 -23362 -51761 -35347
14588 -35347 67573 164016 119294 14731 -13645 -70211 -95443 -63814 -26038 -42393 -22963
14577 -22963 54159 64100 41385 83501 71379 78638 49079 -12619 4522 -17168 -43319 -29207
14565 -29207 -210 9744 20038 30136 100242 127595 93735 8477 -21058 -2267 -72251 -78425
14553 -78425 -54679 -104784 -115842 -123500 -102742 -10606 5155 -28269 -32250 -52979 -75327 -75859
14541 -75859 -50873 6799 -37827 -124970 -50282 18117 30248 -42743 -26734 -4709 -17622 -34166
14529 -34166 -107209 -81609 -31835 -43730 -76792 -4037 54507 15980 -76679 -81635 -46641 -41360
14517 -41360 -11611 -34122 -18070 -24928 18010 89454 124349 92206 10475 -39380 -9795 -27830
14505 -27830 -36418 28930 19031 -1003 1077 38569 54957 26826 78322 86138 57815 26536
14493 26536 -9890 -50487 -25033 -5693 -35063 -75415 -60829 -58567 -28475 -108701 -194701 -124235
14481 -124235 -45338 31747 17189 33939 39316 -4572 -44273 -54770 -50088 -40387 -42661 -30608
14469 -30608 -75655 -90748 -38186 33100 22865 -2782 -44148 -50560 -118959 -77572 -53268 -85948
14457 -85948 -42647 -54900 -23537 34377 50882 45234 13570 37311 82593 69015 93704 136970
14445 136970 139161 123438 124327 62253 -16985 -6534 -15743 -26943 -6049 -75298 -146721 -70440
14433 -70440 -35233 -7426 1433 3909 77336 100581 100291 115876 86793 48639 80754 99396
14421 99396 148705 111243 46785 74721 84251 68190 39852 15508 -13843 -31487 -82572 -65384
14409 -65384 -43194 -15466 -47336 -72852 -60162 -21547 10964 90951 50080 210 -44554 -78595
14397 -78595 -106073 -78620 -72389 -38032 2695 4314 -26497 -2316 15708 16049 -3813 14788
14385 14788 23113 46306 36691 87760 44424 18866 -26448 -94126 -89209 -66279 -23647 39874
14373 39874 55565 7955 36402 143201 156216 149274 90729 39977 26517 109800 97752 53114
14361 53114 74116 48656 -7007 6319 6108 15044 40212 96873 95137 134966 101734 36677
14349 36677 77140 111769 88458 59547 84025 -27032 -55849 61452 22238 -4705 -10867
14338 -10867 -21638 -96519 -99770 -58870 -40273 -69243 -56508 -101560 -159220 -182891 -135391 -47244
14326 -47244 6010 25435 -7142 27821 16727 -21548 -38136 -51798 10914 19567 21345 24459
14314 24459 62838 25626 -66889 -137304 -96735 -34442 -31530 -19238 -39259 8719 27231 43998
14302 43998 31893 23705 60338 5479 -31411 -27236 -10042 -76721 -156528 -158208 -112778 -24252
14290 -24252 10598 -34319 -116786 -112692 -32643 -46896 -11493 5179 -1342 8781 -11488 -93676
14278 -93676 -69953 -23417 -31369 -36470 -57636 -95096 -44127 -69311 -33627 -79556 -103888 -70341
14266 -70341 8168 46558 50280 48071 59725 141902 108832 97780 27751 -67105 -114033 -41416
14254 -41416 52839 46135 45679 29329 2528 60592 145797 142018 55326 -27823 -58948 -46548
14242 -46548 -49503 -14912 23885 52592 58984 97223 92638 83450 24014 13796 -34442 -18709
14230 -18709 29219 24869 46106 41484 20896 36198 53308 49985 14252 -40378 -99601 -111956
14218 -111956 -38850 -47957 -55980 -34896 -15856 23555 46621 -11811 -26139 37297 16885 -2544
14206 -2544 45661 54780 -10356 -82490 -102207 -44420 28045 81224 42597 996 7535 -18650
14194 -18650 -105159 -121265 -85269 -15507 -2568 -29421 -55425 -84011 -88060 -123767 -64623 -11125
14182 -11125 -112077 -150692 -126113 -115828 -93756 -54628 -9346 -20902 -57731 -41151 -31893 -71676
14170 -71676 -66933 -6095 -5576 -46828 -20272 110 102275 122543 96059 69116 84041 72564
14158 72564 26694 32150 -32494 -82825 -80021 -35707 -57305 -48099 -32070 -20593 -12960 -21182 -9955
14145 -9955 -29597 -59246 -7156 9460 68239 6801 -21765 -20920 -31827 -12468 2588 -28101
14133 -28101 -21422 7180 98267 160441 120394 92157 30708 88501 147605 140663 89116 43275
14121 43275 74112 104570 7681 -59058 -30809 -21479 -17246 16283 -23508 -71677 -101218 -127127
14109 -127127 -118145 -120161 -117284 -101080 -50558 -13823 16425 68247 68836 3133 -36294 -74053
14097 -74053 -36815 49123 99136 38636 -3684 -45552 -53569 -1921 7443 -67167 -177502 -148829
14085 -148829 -61862 -84343 -121651 -144942 -104454 -85926 -53020 -46618 -67815 -131428 -126813 -153106
14073 -153106 -136778 -125518 -159238 -146549 -112686 -74432 -57800 -29422 -16322 2741 17953
14062 17953 26536 8758 9241 8716 -60775 -48334 -32716 -9770 -21094 23388 88236 70504 67791
14049 67791 91950 13119 5956 -10124 -83130 -94801 -60565 -12057 -2999 -66538 -22885 10360
14037 10360 59369 82386 -9382 -53611 -81609 -85094 -32287 -13296 -65425 -73220 -34393 -29861
14025 -29861 -15290 -5298 67804 127565 122826 50404 -24887 16563 64579 50185 40250 20285
14013 20285 -85894 -108408 -125300 -86528 -25145 17199 65919 85735 -16592 -77960 -14703
14002 -14703 64029 65097 75619 80560 41608 21049 23747 78750 120630 26319 14213 -24941
13990 -24941 16418 14426 -24638 33484 105238 94520 89393 96525 85777 88582 121712 167944
13978 167944 103994 81084 -29 17524 14295 -79836 -134678 -125683 -96359 -38114 -47064 -90919
13966 -90919 -130378 -78900 8823 79395 61841 -8744 -20748 -26797 -51387 -16866 -27356 -9043
13954 -9043 -66811 -131885 -132721 -113467 -108959 -63284 -104099 -89633 -5391 27891 70979 122312
13942 122312 108071 107793 73028 88207 129074 37444 -49522 -52958 14649 -17475 52204 66160
13930 66160 66558 69001 22440 -12290 -111205 -107663 -86786 -49338 14821 20496 15664 -4855 -43586
13917 -43586 -36145 18126 32016 1019 -22334 13414 50089 121282 66673 23081 37424 -16998
13905 -16998 12992 65011 86510 31943 26051 14181 54042 86984 33972 -65646 -84088 -14884
13893 -14884 -6766 -38171 -108549 -121688 -44509 27546 -16167 -58997 -47780 -40821 -25219 28959
13881 28959 65680 96367 119248 106627 120743 65656 11032 -15847 -2678 -29780 -25837 -2572
13869 -2572 -3518 34127 -22490 -34024 -62652 -99051 -132907 -99025 -112404 -104830 -90354 -61168
13857 -61168 -74852 -50287 -29592 -34778 19481 44161 174655 144470 49050 -17183 -22798 -102786
13845 -102786 -33411 50568 60098 49482 11873 8 -28496 -27260 -17848 1803 -7934 33794
13833 33794 47869 16756 -40195 -90325 -28337 53195 36092 54021 38014 65568 55591 41886
13821 41886 35560 31485 95494 110516 70344 46679 7950 -12460 -12117 16007 13875 -2157 -8422
13808 -8422 41874 77314 26091 -19799 -60338 -70370 -66346 -86467 -45375 18732 9764 12184
13796 12184 41438 53127 80687 66794 59488 55991 18014 -24378 -32454 -69654 -104660 -54561
13784 -54561 -8582 -6820 -8137 20531 -4065 -59428 19664 29961 48840 27497 45301 79170
13772 79170 71950 104913 83284 40119 21617 -25187 -109847 -62568 -6417 -6121 -35689 -46128
13760 -46128 -74831 -62098 -28444 -20131 -23514 -8307 -2698 -50397 -82254 -55081 7431 34313
13748 34313 25135 76853 41462 22499 -44964 -48968 -47770 -74606 -73399 -23355 1091 -20603
13736 -20603 -35887 -22259 32461 30746 35566 -6596 -31963 14298 60016 31180 777 61248
13724 61248 118337 115291 119360 109003 95967 19035 -2760 -39655 -50442 -6756 -3222 5893
13712 5893 58318 45968 50001 60834 40955 40853 56198 32384 75560 57874 92571 151493
13700 151493 196032 113797 76253 61142 51833 72894 55307 39719 68890 95814 46600 527
13688 527 -7858 74157 80317 24850 30642 64324 53220 75264 -1274 -76755 -57589 -21291 59738
13675 59738 84790 75215 87084 116979 114282 80741 112571 152609 126083 142724 119804 146205
13663 146205 106665 71130 65050 68388 103458 121091 55192 59724 98878 32304 41946 95483
13651 95483 81145 36733 62212 118494 125443 149681 163175 97955 46129 66693 76093 114955
13639 114955 207269 192076 125312 117884 101345 143391 97429 56174 31298 95747 136160 95091
13627 95091 -4111 -100286 -84174 -15101 -36367 57726 165258 116857 47091 4112 13540 26063
13615 26063 -8994 6872 6581 14073 -15215 796 28700 83687 91074 94929 98726 37162 26236
13602 26236 25862 -55860 -24498 -56978 -25447 10718 -16729 -30797 -14972 -10086 -22252 -9140
13590 -9140 -50917 -31101 37752 40444 -30277 13993 115810 69169 2528 -27887 -116152 -45957
13578 -45957 -14018 30646 19798 2435 45615 71391 43230 1771 -21523 -24334 -75592 -75409
13566 -75409 -80124 -76791 -40292 -34612 19170 -2417 6978 7458 -6306 2831 55751 65675 85402
13553 85402 33848 10970 5431 12126 15980 36805 13717 16214 67754 89478 60616 91563
13541 91563 68293 -56721 -74043 -51203 -72298 -43409 -6086 28666 -653 -25596 -64196
13530 -64196 -34271 14751 90540 159189 164925 133566 84431 7101 -27757 35728 16043 -44212
13518 -44212 3006 73111 54637 47051 59330 -7869 -21355 -14232 21149 -35388 -69142 -33598
13506 -33598 6952 53544 58608 68392 37785 -6902 -25535 36351 13829 -22681 38518 14674
13494 14674 38236 103053 77585 21982 55352 32689 -15241 -57947 -14608 -1779 -2689 22644
13482 22644 29113 91544 136291 139419 144789 66958 38453 70813 11067 -3618 -38082 -30455
13470 -30455 -6982 -4619 -26859 -42112 -80394 -114473 -128708 -110169 -25100 21231 -6915 -71328
13458 -71328 -43134 -25845 -12112 21134 48098 74377 -8595 -77873 -141224 -133310 -30922 18187
13446 18187 14745 -55193 -30077 69309 60751 23256 -20189 -6013 96315 114038 22326 378
13434 378 2287 1159 -5771 37136 16426 21987 12562 21 -51817 -43498 -9694 26285 23092
13421 23092 7815 -10823 60226 65932 90815 60513 58039 58979 70086 74280 96775 80997 49772
13408 49772 10036 4338 11797 -15723 68841 105230 11930 -56015 -63130 -17133 -33778 -66341
13396 -66341 -66758 -66755 -76657 32130 65164 30572 -19668 -33709 -25441 32818 63286 52022 46351
13383 46351 19305 17239 40801 45538 21151 21554 29867 37627 32106 37586 -13966 -7300 55721
13370 55721 28922 30607 18885 -64688 -38477 186 29108 78275 83006 45465 -13446 12467
13358 12467 37830 50857 79515 62323 53003 57505 39525 20444 -26005 -64320 -73201 -50112
13346 -50112 -44176 -45312 -51346 -101966 6298 26756 -16517 -57689 -21152 -54720 -40334 2550
13334 2550 -56826 -87601 -59712 -84701 -140561 -52936 15387 45616 134414 97039 53925 40029
13322 40029 118020 152776 172824 115624 96072 104404 44131 29480 56543 77755 73951 58836
13310 58836 65445 -24113 -62691 -15319 60529 60292 9759 -25187 -458 36863 2283 7855
13298 7855 36750 30847 83983 139187 148167 160705 134613 98119 74814 87985 69700 91484
13286 91484 93249 96214 105465 162302 138174 109469 103497 143620 154091 105706 113738 98345 88115
13273 88115 107523 154555 109766 171844 234180 182192 68396 34523 61630 87391 81132 87955
13261 87955 100530 96149 72921 24237 49010 -31132 -16859 11959 21796 25873 27228 68764
13249 68764 50310 85339 123825 74171 20937 -15863 80980 120367 138293 137738 83841 97448
13237 97448 153707 172241 154655 117505 76638 -23368 -102071 -26831 25190 11936 33506
13226 33506 38517 14798 38914 52847 2888 -2784 7904 1697 27047 -975 -50126 -11993
13214 -11993 76281 11392 65770 89592 86853 117262 151982 131127 120728 169526 171178 107307
13202 107307 55438 -25490 -10057 85592 141577 126060 121198 110825 99282 62047 33131 -9565
13190 -9565 -106155 -172855 -154905 -141130 -61430 -29080 68049 68879 -11948 -31751 -17538 2534
13178 2534 -14430 -52669 -65940 -50119 33543 71247 46198 34059 79200 70307 66961 100645
13166 100645 122110 107979 42601 -14188 56044 61763 100437 107167 70929 17823 48211 75686
13154 75686 106869 114086 162674 134231 158040 140142 46521 29946 61584 76303 121762 89322
13142 89322 30085 15009 -9668 1290 16927 21998 2348 -12260 67639 81707 -948 -3277
13130 -3277 13204 15906 -1749 4512 7509 21314 18001 -52889 -10101 9550 26585 75183 51585
13117 51585 3358 -36190 -53735 -26220 22987 50791 25855 55719 94695 120996 125560 168492
13105 168492 219141 225868 177226 161096 108380 9571 29970 50897 59014 95365 117219 119624
13093 119624 101405 26780 3325 -7423 33876 30814 -33026 26572 101760 110819 118194 36451
13081 36451 -121213 -110272 4913 69084 83055 88503 55974 35901 90193 41507 -29359
13070 -29359 -22384 -4593 24434 22754 -11093 38876 77276 106673 81725 43597 4098 -24833
13058 -24833 43551 47307 32006 31009 -13930 55053 85012 76747 37439 61967 88882 85967 57399
13045 57399 75845 82797 137913 75636 29495 5402 58111 87402 137891 106664 29658 -8262
13033 -8262 12257 36550 48249 74715 116887 90738 79393 126894 119611 75491 94660 195859
13021 195859 227860 269672 247132 172463 125333 98974 104086 113971 -12165 -72970 -45990 -5024
13009 -5024 -22368 -18 34147 20474 -6303 51188 87163 51193 20360 -14912 -51625 -83645
12997 -83645 -57651 19342 48070 55437 34602 23303 58974 97552 94092 99201 161871 142561
12985 142561 109820 108185 147139 110925 52163 54046 102806 104428 204391 145519 65993 48453
12973 48453 26840 56575 12273 -83277 22926 69775 59160 93436 43439 16469 36287
12962 36287 63314 39061 1314 25120 6028 -21130 -37291 13732 15580 26072 46560 57933
12950 57933 45712 108596 128938 33555 -9440 32302 73532 104959 93192 139489 117309 122769
12938 122769 135434 134680 169379 220420 217728 166052 122218 72165 68660 18072 -10689 35536
12926 35536 34777 52372 38286 69527 127452 138160 76796 2373 -457 50414 118392 163513
12914 163513 211013 195420 154903 191502 176982 142272 84363 47416 96749 121451 104201
12903 104201 31606 50353 127360 95772 -13275 -26866 25848 31080 43216 46348 12963 46855
12891 46855 58938 34593 53329 83753 95980 123826 98342 124149 169620 160318 118724 129206
12879 129206 155664 175063 179115 181950 176496 160394 134516 122007 102414 63187 72825 40096
12867 40096 19795 30407 88991 124451 84339 72580 65417 92781 230626 258973 203417 111601
12855 111601 55061 40078 10538 35636 92273 64309 22071 28871 -6910 9677 39609 34501
12843 34501 -1076 -36933 -110285 -83007 -51440 -85684 -68488 18378 108564 79896 90297 129487
12831 129487 129101 128430 126527 66688 53620 124826 187802 148238 145636 130432 103865 124603 154633
12818 154633 101288 189768 185627 192408 197112 178173 190317 228115 219543 142991 147001 159871
12806 159871 165321 188817 209609 203744 130726 59230 75055 113259 177040 167053 186719 222996
12794 222996 220076 183562 96611 71511 137441 164762 111306 128932 178360 189677 227772 271044
12782 271044 226607 236166 269498 226082 118841 121938 148431 185300 160490 150062 184895 259187
12770 259187 272660 224267 173648 123661 125678 166264 140886 69691 93830 41981 -58833
12759 -58833 -65352 13022 72094 80290 157405 122901 31234 -16963 57384 118787 128278 197272
12747 197272 240017 219471 152155 143780 230089 185659 125635 134186 157180 95866 110953 148321
12735 148321 111959 118305 163503 191104 220122 175565 99290 51884 80522 92762 127444 131381
12723 131381 120542 154214 144286 84672 78469 65246 95519 82970 98571 131966 209931 239659
12711 239659 225411 184072 162149 123532 70752 23035 56021 105441 149923 167458 167214 205690
12699 205690 268962 223680 204532 181247 225128 212931 203599 191326 123627 179529 243197 258540
12687 258540 183339 164223 162801 135199 188237 258913 241315 154987 75755 122266 171271 244273
12675 244273 221260 172969 138334 77068 106451 174062 164870 189988 158689 162167 193169 213548
12663 213548 192509 231970 218099 183397 159309 105273 160288 209694 240685 183670 168251
12652 168251 224013 230845 157715 200157 264527 200622 166305 164817 115697 126300 125850 124606
12640 124606 156146 170126 242556 290494 249660 208908 190500 165638 168818 167732 176955 144098
12628 144098 137861 188991 199861 206550 235464 216416 204964 173295 166416 160137 123403 129432
12616 129432 135730 149026 121034 145362 178106 200383 212244 228367 207542 229970 214782 217001
12604 217001 238341 226176 220442 223682 222926 180513 153203 177605 206573 187889 160824 184439
12592 184439 197245 241929 317746 317101 301888 253879 160938 110339 216303 298133 289235 259296
12580 259296 248270 244168 244720 234776 259674 228867 209805 238902 267047 256405 285479 318146
12568 318146 331398 288897 283743 298046 309199 278194 268644 239492 208272 167263 208895 242493
12556 242493 282564 297315 341047 347166 320293 334864 262577 241932 227535 259581 327588 395786
12544 395786 421507 396712 344541 342296 349081 290412 277852 295852 318922 368366 292112 235549
12532 235549 259871 290354 333407 314413 231010 182121 197673 247214 275677 331800 287449
12521 287449 337240 323139 295879 336085 340459 311171 350286 365542 332432 374690 358509 300126
12509 300126 257795 213428 223486 213087 260942 278431 294794 341358 390446 450455 422330
12498 422330 372197 302985 351810 335891 283976 283717 370011 315768 296919 332920 365252 408913
12486 408913 387423 400649 362689 388874 358424 324233 314865 256052 309594 317299 290147 313990
12474 313990 313496 302792 293456 341500 389593 334362 296424 326636 307113 306617 313766 349163 383194
12461 383194 365923 329241 319506 316051 308827 351563 398038 402977 413646 345481 331265 295793
12449 295793 344698 345425 303832 294933 307774 326642 286212 302532 331898 372776 333868 326654
12437 326654 381718 411897 401049 433509 448831 436577 447808 399614 415983 443568 463247
12426 463247 451738 434846 438614 437780 487515 575116 553865 551652 543038 447130 344383 317614
12414 317614 383923 448529 387146 384364 431805 456936 436007 421113 389173 346185 370432 449935
12402 449935 584362 606671 540825 535760 514470 494541 426048 403093 412003 481317 548274 529801
12390 529801 490673 419487 442439 526087 527764 502097 498788 506514 529994 493233 474617 447785
12378 447785 481021 414881 445544 482907 474420 422885 423012 451028 502925 466480 511974 517538
12366 517538 514050 522181 516594 530821 492341 560651 642267 643412 565252 559405 578635 542708
12354 542708 473580 462229 456108 461781 526301 520678 553432 588894 555642 538039 576418 575282
12342 575282 558554 529549 523761 544145 564658 572858 536113 554347 564309 586145 582176 625643
12330 625643 609081 631816 663596 690143 668628 650641 624794 606355 664556 665306 639435 599639
12318 599639 562438 579578 576688 613991 637923 647657 625064 650660 669326 713746 696228 662675
12306 662675 652854 608157 539343 560940 639420 664382 717302 750726 698814 708492 749836 788854
12294 788854 784319 761194 725367 760619 766655 778292 791837 796142 770764 801385 851003 856460
12282 856460 855507 820972 795390 759002 717262 633651 621335 678697 671017 752125 742441 756392
12270 756392 830472 807480 811843 876189 948992 970247 926237 922361 940735 910633 954883 933042
12258 933042 845446 869367 906868 901577 943462 866673 818979 905458 980140 1019406 967835 1025924
12246 1025924 1042591 1008339 1016184 979839 932770 939049 922322 1000324 1077443 1063523 1030964 1038634
12234 1038634 1057546 1048334 1060977 1025412 983103 961265 1001026 1070672 1108770 1099422 1033829 1066135
12222 1066135 1101063 1083859 1038730 1065927 1055333 978194 983380 1078961 1132873 1090841 1029923
12211 1029923 1047270 1103720 1138462 1136256 1103826 1084923 1088296 1152204 1170561 1276269 1235096
12200 1235096 1183296 1230248 1296257 1301832 1253974 1226956 1242411 1290181 1279905 1256940 1268012
12189 1268012 1232413 1209091 1201955 1284822 1299190 1309771 1371507 1413857 1438194 1439064 1421360 1509504
12177 1509504 1573444 1600792 1527695 1517567 1545317 1598229 1655443 1601852 1561840 1542150 1537951
12166 1537951 1509104 1515180 1544899 1574724 1628972 1577672 1513412 1544352 1563320 1596260 1555469
12155 1555469 1560776 1620954 1697246 1722157 1714852 1732578 1756787 1775658 1821561 1839891 1818375 1775563
12143 1775563 1763933 1782317 1818112 1826240 1863285 1906845 1928972 1930280 1977618 1994042 1975596 1959961
12131 1959961 1953577 1986560 1979833 1978216 2030112 2066357 2000721 2001147 1989966 2046657 2062134 2008234
12119 2008234 1968817 2020863 2067900 2102237 2217730 2233897 2239549 2224172 2289217 2251103 2287619
12108 2287619 2348732 2326760 2345107 2392873 2332230 2366663 2414035 2492460 2543842 2547413 2521125
12097 2521125 2537646 2576245 2601267 2624917 2616229 2702107 2621927 2573495 2609279 2659580 2621495
12086 2621495 2633072 2735902 2813207 2845384 2815660 2774043 2815706 2839079 2864146 2854405 2867299
12075 2867299 2907454 2936022 2970031 3022068 3012754 3011749 3070750 3111409 3136522 3190164 3230788 3229240
12063 3229240 3301024 3289205 3299501 3359707 3423479 3448181 3455432 3491152 3505194 3550977 3578249
12052 3578249 3572020 3600147 3663212 3699006 3663944 3681585 3762784 3809897 3840923 3904000 3861127
12041 3861127 3840170 3885213 3912541 3880641 3933358 3962992 3988721 4045252 4069161 4121156 4207457
12030 4207457 4228017 4271690 4336203 4385125 4354550 4310393 4373067 4480632 4570899 4649665 4664373
12019 4664373 4698250 4756249 4734275 4748995 4793643 4798731 4836348 4857946 4840787 4866159 4940636
12008 4940636 4980669 4988696 4967283 5031507 5099061 5091869 5109444 5150072 5198757 5252922 5352916 5439459
11996 5439459 5453926 5373004 5419023 5495796 5476016 5448823 5406333 5470331 5519833 5618595 5708329
11985 5708329 5680950 5696375 5749764 5781210 5795012 5790615 5818250 5841086 5964444 6039990 6033042
11974 6033042 6002612 6024799 6006684 5984903 6069907 6190140 6268783 6331364 6333500 6263137 6241800
11963 6241800 6293071 6332998 6355098 6429292 6456415 6408621 6355259 6398297 6421399 6481419 6478701
11952 6478701 6537039 6651662 6654498 6648989 6621565 6618460 6639073 6690746 6748423 6780287 6777280 6769064
11940 6769064 6703574 6632650 6621625 6662723 6685940 6707319 6711587 6698188 6698657 6755181 6771085 6777196
11928 6777196 6708905 6643672 6738870 6701719 6633432 6649702 6701985 6749264 6749596 6710728 6687488 6688875
11916 6688875 6763250 6765349 6747005 6669863 6598016 6600933 6647690 6630142 6624417 6626242 6548220 6508281
11904 6508281 6477435 6492452 6554296 6538427 6512341 6513669 6506202 6425844 6352587 6379419 6416234 6397854
11892 6397854 6412316 6384239 6343061 6349085 6301933 6233767 6175697 6180023 6136274 6058997 5967787 5918252
11880 5918252 5895080 5911008 5891708 5829565 5825388 5827208 5732974 5706824 5708104 5653653 5645180 5649282
11868 5649282 5596286 5533487 5469898 5396980 5384983 5355590 5354180 5309025 5307016 5246644 5192688 5215457
11856 5215457 5209218 5205998 5164742 5061662 5059844 5083932 4992359 4910341 4843368 4864180 4848819 4861231
11844 4861231 4839096 4779438 4749603 4696913 4666516 4624702 4596927 4614102 4534737 4487575 4397515
11833 4397515 4334289 4339437 4341823 4350167 4333676 4266829 4239763 4238888 4222041 4140921 4057044 3952984
11821 3952984 3972926 4026084 4058423 4009730 3948122 3898534 3861884 3800697 3804413 3754378 3699371
11810 3699371 3659637 3657492 3630281 3593337 3657840 3658516 3542730 3534789 3505707 3473352 3518179 3497305
11798 3497305 3421592 3425949 3439259 3421463 3353856 3308995 3332440 3310951 3278759 3315870 3311467 3230786
11786 3230786 3194248 3180609 3080827 3020065 3032547 2987866 2976476 2999226 2980476 2920937 2926536
11775 2926536 2860661 2779140 2805147 2813800 2733622 2667360 2753155 2796012 2753616 2765272 2687426
11764 2687426 2591358 2567140 2533659 2506526 2527837 2502724 2443160 2453722 2398713 2384330 2371711
11753 2371711 2352195 2323981 2303513 2395130 2343788 2250425 2224908 2273955 2296838 2324632 2269918
11742 2269918 2215603 2270610 2255643 2228731 2162430 2194903 2166047 2162522 2163416 2132568 2091878 2126441
11730 2126441 2130846 2041375 1976194 2021877 2001673 1941991 1894127 1884206 1897515 1925675 1964423 1960323
11718 1960323 1924355 1901034 1880976 1813361 1814156 1814448 1811252 1803958 1810760 1820210 1785728 1684808 1649514
11705 1649514 1688797 1700440 1655295 1601933 1635348 1693661 1748507 1712863 1691272 1641807 1619773
11694 1619773 1608277 1602699 1574288 1559591 1518759 1513673 1483637 1461811 1491502 1514611 1446755 1453959
11682 1453959 1454031 1453063 1455034 1453199 1411497 1411258 1447062 1396836 1364919 1335897 1344713 1297568 1396135
11669 1396135 1396247 1366342 1382859 1369573 1339359 1395071 1350367 1273936 1284932 1322706 1381605 1330694
11657 1330694 1250711 1207704 1234128 1277058 1257045 1279591 1278730 1289557 1300641 1290264 1206152 1140551
11645 1140551 1125304 1122677 1079234 1039876 1106592 1091784 1047362 1107070 1133748 1120482 1134944
11634 1134944 1179142 1120031 1024611 1021376 1101150 1144787 1167611 1155537 1191791 1193692 1173521 1130756
11622 1130756 1065344 948127 940924 962952 986500 943946 903502 882189 880258 883692 876969 912756
11610 912756 887487 849404 868483 932506 1003166 993898 958003 998269 992737 942355 907453 896942
11598 896942 884084 889416 863035 789020 844956 883330 851744 843793 819696 830448 802867 802126
11586 802126 742731 795698 842710 776606 739478 758554 815224 788112 823627 805594 730976
11575 730976 701850 661788 650218 716411 770958 772378 685085 597746 579368 649791 699287 749410
11563 749410 741978 672625 684636 697295 677935 720839 647604 570203 633992 783832 797468
11552 797468 818377 725767 689085 684445 692198 755863 755879 671927 591761 638472 692703 683179 620341
11539 620341 612771 573220 593639 632821 652836 681129 715304 728597 702782 781072 789561 756504
11527 756504 693612 714492 712531 723258 701576 721260 687843 660423 727459 761407 707204 714271
11515 714271 636541 603705 614532 613435 658562 672951 654838 651783 675048 615100 544879 513404
11503 513404 487585 471180 488601 478346 490161 534527 519895 488590 501326 548617 546608 534554
11491 534554 463065 443511 457681 396955 396165 451567 515189 565192 550311 576689 534239 581005
11479 581005 574192 525475 462317 414392 374487 391531 467987 537382 535693 517623 522503 518212
11467 518212 483553 463599 468260 435418 440445 504081 475740 442045 405165 377828 445229 472804
11455 472804 421360 391011 456505 448561 485291 495051 502117 477910 488174 432336 390452 356537
11443 356537 426721 487302 546687 524830 501038 508926 446606 430253 386905 365405 338941 308507
11431 308507 345215 422401 352272 326711 328129 354564 363094 404660 407278 398464 367209 385997
11419 385997 415397 426879 406827 360623 345477 398413 399804 413737 439113 364024 357210 421831
11407 421831 381376 371317 365253 326747 274039 252321 236057 292708 327568 319012 275669 315325
11395 315325 375083 352978 290896 353604 415286 403684 344943 316316 314350 361195 276619 249605
11383 249605 229667 152110 264146 365053 356559 363076 340085 284887 301174 341634 274048
11372 274048 271286 367460 346755 213203 178391 217987 195352 200009 249043 247003 233362 298044
11360 298044 311962 292651 280942 293154 324135 346907 310401 259432 297058 237762 191226
11349 191226 260932 262932 212842 233537 260833 312628 346085 301630 256863 202944 221701 242962
11337 242962 217700 177752 180407 207171 223873 182947 220653 285439 289382 367958 347661 348046
11325 348046 286658 207457 170786 173185 180391 162259 154579 168399 192683 138046 155877 162338
11313 162338 184538 183998 168534 200957 238642 254699 253129 256247 284100 299298 258028 282050
11301 282050 286635 253969 213517 169256 182650 230344 232290 255550 302501 296122 273136 278256
11289 278256 172489 86962 71601 87776 103534 87308 96131 148554 174837 227545 257985
11278 257985 275962 326698 350936 310069 318697 304506 308725 277789 229037 268959 236008 143333
11266 143333 126108 82227 54356 54948 74691 104959 110186 84448 144998 241087 248061 211937
11254 211937 204893 178549 87486 89020 136260 152169 191098 195826 200202 196878 206980 208559 139930
11241 139930 90786 134990 139600 64887 79839 113831 154608 128693 96243 152541 139608 167489
11229 167489 133193 104098 178471 163228 131442 153537 163592 147884 108487 132941 143770
11218 143770 85788 33484 71991 76437 121214 128682 105045 77870 74860 53100 42817 51396
11206 51396 93509 205896 259182 265964 210758 155601 103566 112001 138974 156846 182879 207689
11194 207689 110571 54582 66242 76527 78637 92262 109988 130195 112129 68163 95780 157264
11182 157264 144801 148086 195510 232537 238611 231711 190780 150588 105398 50721 36923 38620
11170 38620 86211 150085 146420 170533 110982 108295 120025 121098 159848 176732 146759 106077
11158 106077 100062 42871 52157 101486 192738 151578 118665 42708 42289 32546 31693 82691 100146
11145 100146 58215 49628 42359 62229 67869 77936 116347 54660 14328 -6235 -88582 -74605
11133 -74605 23016 97927 44863 78468 92739 49562 53888 120777 145089 207168 202892 99042
11121 99042 70005 90088 47226 98350 126644 93395 44164 25973 40996 95461 132095 148217
11109 148217 145220 124245 74183 66003 31050 12042 13174 49486 8946 8414 53999 90629
11097 90629 147497 139226 75130 38523 82315 118612 60621 35041 33449 -35879 9137 74092
11085 74092 137898 138245 129413 162133 249251 260946 207201 84206 15710 33648 53227 96134
11073 96134 97897 55805 47085 69037 91045 50790 66500 64596 37846 44681 101862 35819
11061 35819 5009 5062 36663 105130 167027 146082 131220 116197 83719 150569 201591 251470
11049 251470 260124 251386 270111 272747 249187 318398 380684 422450 476514 478509 401941 377321
11037 377321 420772 447120 532561 611369 686071 759502 855991 870263 771109 657077 546966
11026 546966 518093 569157 650383 817187 1056466 1122060 1087926 987455 844894 785105 774943
11015 774943 676903 597330 596564 632931 626207 648846 792527 857794 819698 683333 497666
11004 497666 388259 344509 371388 391412 373071 361352 389938 423203 451180 360419 249478
10993 249478 246517 241303 191564 139981 119938 131688 90577 98622 115788 66135 -30083 -58355
10981 -58355 -51284 -2219 -30968 6792 63806 51022 39777 45313 40743 77514 86434 94612 106522
10968 106522 120005 107974 74613 88108 94111 18171 128 -10282 -4840 60601 117002 139811
10956 139811 116843 31856 28058 10560 -24622 -45492 -52779 -66910 -101957 -7653 26964 52399
10944 52399 147645 151364 31077 39350 13501 -89986 -85923 -30415 34503 20875 64573 77668
10932 77668 15714 -56572 -79730 -31055 46819 57053 72000 80759 43721 -13841 -29545 -26656
10920 -26656 -21644 -75594 -66343 -21770 -18761 8562 -33237 -44152 -45061 -42185 80279 100289 50044
10907 50044 25406 -9472 -8728 6428 -9010 -25280 -34982 -44439 -32887 -19461 -41095 9200
10895 9200 94750 105169 76829 46997 23132 -27979 -37246 25482 67091 54844 77462 64018
10883 64018 63838 65002 32912 58696 28368 -3090 -38278 -16154 -28594 -10958 22616 83757
10871 83757 107206 135488 115627 91966 66086 112808 140151 68387 139615 151226 67187 70674
10859 70674 35774 9015 29895 23928 19930 40243 61886 39560 10505 -2696 53564 125216
10847 125216 180622 218402 139189 99482 56659 23599 4189 -6143 -3930 -25128 -12455 -23756
10835 -23756 -21078 34025 49725 58502 10510 -54293 -27856 6866 27576 7583 49852 62504
10823 62504 29981 28223 903 -64193 28753 119133 73126 36386 17210 -29989 -51764 -20825
10811 -20825 -52882 -84600 -127646 -114567 -168961 -151909 -98779 -74332 -66496 -60144 -66671 -79417
10799 -79417 -140147 -94940 -37853 -23456 -22576 12001 41201 22962 -70737 -73508 -33756 -36233
10787 -36233 -84070 -36426 30380 77000 55688 -25346 -37497 -51003 -43630 25449 1896 9429
10775 9429 -74210 -55873 -66455 -108670 -83224 -68572 -61967 -36993 -35642 -39055 -76122 -71477 -52012
10762 -52012 -157455 -149720 -154922 -144685 -30772 -97389 -63391 -56302 -61064 -75730 -79688 -166799
10750 -166799 -212456 -177945 -117792 -86100 -68565 -52491 -5762 -81528 -169286 -115456 -107259 -67819
10738 -67819 33045 23882 9438 4246 -16439 7001 -18624 1135 -37558 -110158 -105788 -41914
10726 -41914 23676 50784 60255 56131 19263 -1022 94411 126619 32924 23562 26275 60980
10714 60980 43176 -44869 -11285 -7520 -30900 -128924 -188376 -232814 -220972 -113098 -140165 -143783
10702 -143783 -117121 -106994 -108457 -171008 -153954 -86005 -48262 -15714 -713 -31847 -111994 -178489
10690 -178489 -202767 -200854 -137437 -59613 -73331 -140231 -113370 -36057 -55884 -88609 -65778 -36457
10678 -36457 -50187 -31638 -5653 25313 16930 -12959 3142 7440 -34840 -124046 -151499 -85173
10666 -85173 -62895 -48452 1647 38782 63766 27972 38956 63148 51167 81368 125122 169747
10654 169747 205793 217620 196165 219434 257575 333082 331045 289105 287767 356245 475112 475426
10642 475426 481730 537239 607912 725704 855059 963080 1099326 1265611 1528563 1862390
10632 1862390 2178132 2557192 2913413 3156406 3473985 3928530 4447614 5076124 5899452
10623 5899452 7097034 8671285 10894643 14012738 18350536 24081895 31357878 39981144
10615 39981144 48590367 55113021 57667485 56383928 53333962 50840097 50248071 52416635
10607 52416635 58013080 67752203 81845291 99278381 116646927 127865895 128163653 119019328
10599 119019328 106812969 96963477 91738708 91960366 98031795 110486476 129019351 151323388
10591 151323388 171768166 181810858 175141716 155561206 132827726 113962873 101311247
10584 101311247 94893845 94344408 99171742 108561407 120277185 130015474 131854688 122561766
10576 122561766 105515208 87598317 73125008 63131087 57349470 54927712 55192300 57380066
10568 57380066 60216057 61789493 59984318 54050852 45412263 36561537 29005526 23161552
10560 23161552 18810932 15552715 13103627 11234071 9828087 8711526 7817406 7110093
10552 7110093 6478244 5881178 5322942 4922651 4559448 4249534 4015068 3769605 3507750
10543 3507750 3303103 3164543 3039154 2876784 2730908 2549490 2461081 2399715 2287714 2156446
10533 2156446 2058874 2017017 1943534 1861418 1765511 1726382 1727263 1694001 1649217 1592784 1530773 1462890
10521 1462890 1421960 1397457 1306024 1298217 1252680 1240333 1296897 1287271 1247242 1182817 1150598 1212494
10509 1212494 1194792 1110156 1029389 1044627 1039737 1005032 975358 928490 894013 911731 949110
10498 949110 974597 944534 849588 831936 883783 900556 864419 831732 805885 821123 878784
10487 878784 859657 813516 791272 790229 790188 824768 873815 894497 847035 802938 872467 853678
10475 853678 776340 752872 763840 760784 718656 784368 764042 725158 689618 690210 739559 714611
10463 714611 735101 738598 749700 699411 694109 711495 682077 635522 692335 710714 723673 693430
10451 693430 611130 558209 559810 639915 612819 618259 648599 614421 628807 673108 687783 733417
10439 733417 766860 723285 587779 552053 595083 516051 557897 579789 545528 544844 525064 495927
10427 495927 528328 503277 483927 496468 453245 435923 433741 478768 434852 405671 371767 336101
10415 336101 354591 384793 366794 328029 407694 468020 512710 515977 475790 506946 509418 367589
10403 367589 333589 356283 280669 309939 343115 292663 316873 345178 263389 231209 280694
10392 280694 326960 311082 212542 186998 229965 241485 217807 250591 273690 261463 295231
10381 295231 297981 275653 299226 268355 223742 222715 161587 97589 127510 225493 199437 163319
10369 163319 173636 237235 171713 150188 237448 302116 211642 166210 218914 250353 269936
10358 269936 302239 322679 324113 319326 295015 246847 265832 295848 359602 389879 381695 354761
10346 354761 322020 268019 253941 250272 215446 195292 220197 224326 203480 282796 325540 379377
10334 379377 356640 340726 230638 182023 198806 234084 235084 294775 321591 295237 226945
10323 226945 266013 292108 223577 213206 142409 117272 207635 230109 242791 219946 180558
10312 180558 187270 268745 278014 261597 282479 230714 221419 200218 199147 161488 121778 127324
10300 127324 129874 116652 180296 183788 220745 224583 240602 208819 160092 181151 186243 232584
10288 232584 238798 167041 102239 171692 193329 177510 132566 79330 98521 209199 175692
$$ [...]
##END NTUPLES=NMR SPECTRUM
##END=
