##TITLE=Analysis number 327974
Compound Code cc 12310
Project Code adrs
Chemist Name aci
##JCAMPDX= 6.0         $$ Bruker NMR JCAMP-DX V2.0
##DATA TYPE= NMR SPECTRUM
##DATA CLASS= NTUPLES
##ORIGIN= Bruker BioSpin GmbH
##OWNER= nmr
$$ XWIN-NMR		Version 3.5
$$ Mon Apr 23 13:23:19 2007 GMT Daylight Time (UT+1h)  MAYBRIDGE\nmr@NMR_250MHZ
##.OBSERVE FREQUENCY= 250.131544655141
##.OBSERVE NUCLEUS= ^1H
##.ACQUISITION MODE= SIMULTANEOUS (DQD)
##.ACQUISITION SCHEME= undefined
##.AVERAGES= 16
##.DIGITISER RES= 18
##SPECTROMETER/DATA SYSTEM= dpx250
##.PULSE SEQUENCE= zg30
##.SOLVENT NAME= CDCl3
##.SHIFT REFERENCE= (INTERNAL, CDCl3, 0, 16.522)
##AUDIT TRAIL= $$ (NUMBER, WHEN, WHO, WHERE, WHAT)
$$ ##TITLE= Audit trail, XWIN-NMR		Version 3.5
$$ ##JCAMPDX= 5.01
$$ ##ORIGIN= Bruker BioSpin GmbH
$$ ##OWNER= nmr
$$ C:\u/data/dgb/nmr/ADRS/2830/pdata/1/auditp.txt
$$ ##AUDIT TRAIL=  $$ (NUMBER, WHEN, WHO, WHERE, WHAT)
(   1,<2007-04-23 13:22:50.75 +100>,<MAYBRIDGE\nmr>,<NMR_250MHZ>,
      <created by zg, POWCHK disabled, PULCHK disabled
       configuration hash MD5:
       49 4B E0 1D 92 C2 6B 37 9F E6 65 BC 52 41 86 1D
       data hash MD5: 64K
       53 5C 27 CA 8C 8B B9 4A B7 EF 7E B6 26 BB 06 FF>)
(   2,<2007-04-23 13:23:03.48 +100>,<MAYBRIDGE\nmr>,<NMR_250MHZ>,
      <Start of raw data processing
       ef LB = 0.3 FT_mod = 6 PKNL = 1 SI = 32K 
       data hash MD5: 32K
       A2 30 E8 8A AC 7B 1E 10 BC 1F 66 C8 A3 59 9C 9E>)
(   3,<2007-04-23 13:23:05.29 +100>,<MAYBRIDGE\nmr>,<NMR_250MHZ>,
      <apk 
       data hash MD5: 32K
       EF 25 DC AC 81 05 8C D3 52 7C 47 2D 4D 4E D9 B5>)
(   4,<2007-04-23 13:23:06.06 +100>,<MAYBRIDGE\nmr>,<NMR_250MHZ>,
      <abs ABSG = 5 
       data hash MD5: 32K
       77 96 E0 A9 3F E2 79 CA 05 27 72 30 21 F8 A5 A7>)
$$ ##END=
$$ 
$$ hash MD5
$$ 88 17 44 3B 03 7D 7D 5C BE 1F 31 5C 16 0D 07 82
##$RELAX= 
##$RELAX= 
##$RELAX= 
##$RELAX= 
##$RELAX= 
##$RELAX= 
##$RELAX= 
$$ Bruker specific parameters
$$ --------------------------
##$DU= <C:\u>
##$EXPNO= 2830
##$NAME= <ADRS>
##$PROCNO= 1
##$TYPE= <nmr>
##$USER= <dgb>
##$AMP= (0..31)
100 100 100 100 100 100 100 100 100 100 100 100 100 100 100 100 100 100 
100 100 100 100 100 100 100 100 100 100 100 100 100 100 
##$AQSEQ= 0
##$AQ_mod= 3
##$AUNM= <au_zg>
##$AUTOPOS= <30 >
##$BF1= 250.13
##$BF2= 250.13
##$BF3= 250.13
##$BF4= 250.13
##$BF5= 500.13
##$BF6= 500.13
##$BF7= 500.13
##$BF8= 500.13
##$BYTORDA= 1
##$CFDGTYP= 0
##$CFRGTYP= 5
##$CHEMSTR= <none>
##$CNST= (0..31)
1 1 145 1 1 1 1 1 1 1 1 1 1 1 1 1 1 1 1 1 1 1 1 1 1 1 1 1 1 1 1 1 
##$CPDPRG= <>
##$CPDPRG1= <>
##$CPDPRG2= <>
##$CPDPRG3= <>
##$CPDPRG4= <mlev>
##$CPDPRG5= <mlev>
##$CPDPRG6= <mlev>
##$CPDPRG7= <mlev>
##$CPDPRG8= <mlev>
##$CPDPRGB= <>
##$CPDPRGT= <>
##$D= (0..31)
0 1 0 0 0 0 0 0 0 0.06 0 0 0 0 0 0 0.0002 0 0 0 0 0 0 0 0 0 0 0 0 0 0 
0 
##$DATE= 1177330969
##$DBL= (0..7)
120 120 120 120 120 120 120 120 
##$DBP= (0..7)
150 150 150 150 150 150 150 150 
##$DBP07= 0
##$DBPNAM0= <>
##$DBPNAM1= <>
##$DBPNAM2= <>
##$DBPNAM3= <>
$$ [...]
##$SUBNAM7= <"">
##$SUBNAM8= <"">
##$SUBNAM9= <"">
##$SW= 20.6930455092707
##$SWIBOX= (0..15)
0 0 3 0 0 0 0 0 0 0 0 0 0 0 0 0 
##$SW_h= 5175.983436853
##$TD= 65536
##$TD0= 1
##$TE= 683.16
##$TE2= 300
##$TE3= 300
##$TEG= 300
##$TL= (0..7)
0 120 120 120 120 120 120 120 
##$TP= (0..7)
150 150 150 150 150 150 150 150 
##$TP07= 0
##$TPNAME0= <>
##$TPNAME1= <>
##$TPNAME2= <>
##$TPNAME3= <>
##$TPNAME4= <>
##$TPNAME5= <>
##$TPNAME6= <>
##$TPNAME7= <>
##$TPOAL= (0..7)
0.5 0.5 0.5 0.5 0.5 0.5 0.5 0.5 
##$TPOFFS= (0..7)
0 0 0 0 0 0 0 0 
##$TUNHIN= 0
##$TUNHOUT= 0
##$TUNXOUT= 0
##$USERA1= <user>
##$USERA2= <user>
##$USERA3= <user>
##$USERA4= <user>
##$USERA5= <user>
##$V9= 5
##$VALIST= <valist>
##$VCLIST= <CCCCCCCCCCCCCCC>
##$VD= 0
##$VDLIST= <DDDDDDDDDDDDDDD>
##$VPLIST= <PPPPPPPPPPPPPPP>
##$VTLIST= <TTTTTTTTTTTTTTT>
##$WBST= 1024
##$WBSW= 4
##$XGAIN= (0..3)
0 0 0 0 
##$XL= 0
##$YL= 0
##$YMAX_a= 477803
##$YMIN_a= -511238
##$ZGOPTNS= <>
##$ZL1= 120
##$ZL2= 120
##$ZL3= 120
##$ZL4= 120
##$ABSF1= 16.522
##$ABSF2= -4.171173
##$ABSG= 5
##$ABSL= 3
##$ALPHA= 0
##$AQORDER= 0
##$ASSFAC= 0
##$ASSFACI= 0
##$ASSFACX= 0
##$ASSWID= 0
##$AUNMP= <proc_1d>
##$AZFE= 0.1
##$AZFW= 0.1
##$BCFW= 0
##$BC_mod= 0
##$BYTORDP= 0
##$COROFFS= 0
##$CY= 12.5
##$DATMOD= 1
##$DC= 0
##$DFILT= <>
##$DTYPP= 0
##$F1P= 14.0000005364418
##$F2P= -0.99999901652339
##$FCOR= 0.5
##$FTSIZE= 32768
##$FT_mod= 6
##$GAMMA= 0
##$GB= 0
##$INTBC= 1
##$INTSCL= 1
##$ISEN= 128
##$LB= 0.3
##$LEV0= 0
##$LPBIN= 0
##$MAXI= 10000
##$MC2= 0
##$MEAN= 0
##$ME_mod= 0
##$MI= 0
##$NCOEF= 0
##$NC_proc= -3
##$NLEV= 6
##$NOISF1= 0
##$NOISF2= 0
##$NSP= 0
##$NTH_PI= 0
##$NZP= 0
##$OFFSET= 16.522
##$PC= 1
##$PHC0= 236.6102
##$PHC1= -7.772502
##$PH_mod= 1
##$PKNL= yes
##$PPARMOD= 0
##$PSCAL= 4
##$PSIGN= 0
##$REVERSE= no
##$SF= 250.13
##$SI= 32768
##$SIGF1= 0
##$SIGF2= 0
##$SINO= 400
##$SIOLD= 32768
##$SREGLST= <1H.CDCl3>
##$SSB= 0
##$STSI= 32768
##$STSR= 0
##$SW_p= 5175.98343685301
##$SYMM= 0
##$S_DEV= 0
##$TDeff= 65536
##$TDoff= 0
##$TI= <Analysis number 999999
Compound Code 99
Book Reference 9
Project Code 9>
##$TILT= no
##$TM1= 0
##$TM2= 0
##$TOPLEV= 0
##$USERP1= <user>
##$USERP2= <user>
##$USERP3= <user>
##$USERP4= <user>
##$USERP5= <user>
##$WDW= 1
##$XDIM= 32768
##$YMAX_p= 260089705
##$YMIN_p= -54078
$$ End of Bruker specific parameters
$$ ---------------------------------
##NTUPLES= NMR SPECTRUM
##VAR_NAME=  FREQUENCY,     SPECTRUM/REAL,   SPECTRUM/IMAG
##SYMBOL=    X,             R,               I
##VAR_TYPE=  INDEPENDENT,   DEPENDENT,       DEPENDENT
##VAR_FORM=  AFFN,          ASDF,            ASDF
##VAR_DIM=   32768,         32768,           32768
##UNITS=     HZ,            ARBITRARY UNITS, ARBITRARY UNITS
##FACTOR=    0.157963299565203, 1,           1
##FIRST=     4132.6476996994, 0,             0
##LAST=      -1043.33573715361, 0,           0
##MIN=       -1043.33573715361, -54078,      0
##MAX=       4132.6476996994, 260089705,     0
$$ Real data points
##PAGE= N=1
##DATA TABLE= (X++(R..R)), XYDATA
$$ [...]
$$ plain form
24648 12086 21034 18088 9580 6128 -3152 1285 17987 18287 -6609 -15969 -23373 -19899 -22934 -33808
24634 -33808 -26397 -13957 -2858 306 948 -1130 -614 4968 4538 4390 -4905 -13560 -14709 -9659 1673
24619 1673 10963 6834 1440 -5067 -348 -2934 -9109 -3984 -7645 -17538 -31946 -16184 15768 25948
24605 25948 29072 23417 2139 -2630 1124 5176 6061 4367 355 -10002 -20142 -2967 11434
24592 11434 14718 8355 1084 -9170 -23399 -35760 -27174 -9495 -7433 -8392 -726 -9302 2869
24579 2869 11386 7191 -3131 -12647 -13528 -18009 -21652 -14420 -5668 -5694 -15117 -19179 -17569 -11155 -12277
24564 -12277 -21068 -7732 4210 11542 7079 9936 2050 -1097 788 4768 15244 25317 28746
24551 28746 21389 24762 19741 11147 4504 -5829 -6863 8078 13954 19999 12273 -3678 7071
$$ packed form
24648A2086Q948k946q508l452r280M437J6702L00k4896r360p404L474l035j0874
24634c3808P411J2440J1099L164O42k078N16N582m30j48r295q655j149N050J1332
24619A673R290m129n394o507M719k586o175N125l661r893j4408J5762L1952J0180
24605B5948L124n655k1278m769L754M052Q85j694m012j0357j0140J7175J4401
24592A1434L284o363p271j0254j4229j2361Q586J7679K062r59P666q576J2171
24579B869Q517m195j0322r516q81m481l643P232Q752k6r423m062J610O414j122
24564a2277q791J3336J1942P332m463K857p886l147J885L980J0476J0073L429
24551B8746p357L373n021q594o643j0333j034J4941N876O045p726j5951J0749
$$ plain form
24538 7071 -3017 -2857 16274 20241 14832 -111 -644 -3730 -11089 6902 10523 11945 10784 -351
24524 -351 -3086 -7781 -9140 -9274 -22540 -29116 -26252 -27884 -4910 3177 4990 835 881 1734 2618 7817
24508 7817 14931 17010 4886 5130 6335 7637 -724 -9906 -11631 -9376 4063 2978 -2527 -3590
24494 -3590 3316 -10909 -7628 2596 4305 6458 -440 -18430 -27170 -25468 -29903 -18806 -7734
24481 -7734 -8397 -16378 -16055 -2640 5109 15258 14407 21200 20409 19990 17946 13992 7540 1385 7529
24466 7529 17881 27654 26938 27726 25147 23049 20123 18977 30054 13186 335 3058 9180 7610
24452 7610 8764 13440 5931 -1623 2803 4787 -6990 -2137 2237 634 -1497 19273 27802 12443
24438 12443 -2654 -5260 -4047 -2940 -8320 -8850 -675 -1717 3540 5075 -1673 -2450 3284 -872 -5053
$$ packed form
24538G071j0088J60J9131L967n409j4943n33l086p359J7991L621J422j161j1135
24524c51k735m695j359j34j3266o576K864j632K2974Q087J813m155M6Q53Q84N199
24508G817P114K079j2124K44J205J302q361r182j725K255J3439j085n505j063
24494c590O906j4225L281J0224J709K153o898j7990q740J702m435J1097J1072
24481g734o63p981L23J3415P749J0149q51O793p91m19k044l954o452o155O144
24466G529J0352R773p16P88k579k098k926j146J1077j6868j2851K723O122j570
24452G610J154M676p509p554M426J984j1777M853M374j603k131K0770Q529j5359
24438A2443j5097k606J213J107n380n30Q175j042N257J535o748p77N734m156m181
$$ plain form
24423 -5053 -5055 -14531 -18645 -21519 -15522 -15652 -11408 -8159 -593 -3482 -21798 -11664 -8804 9316 17750
24408 17750 7321 -1706 577 7340 677 343 8608 10629 7287 3197 21552 30914 22835 10216
24394 10216 2035 8300 8996 10463 12894 8605 -3835 -18530 -12725 3503 923 -6750 -4787 -586
24380 -586 -1598 1844 2860 7662 12309 11834 -684 -7352 -1771 5203 9415 18495 27675 16207 5903
24365 5903 5964 5853 5333 -3505 -2974 -1344 -5178 -1775 -1125 -9996 -23092 -31101 -17825 -12516 -18955 -14840
24349 -14840 -19540 -23421 -14578 -8678 -5695 -3613 -8087 -10233 -2012 -8 3526 -10003 -6890 1768
24335 1768 -11924 -12113 -4125 -4164 -16704 -23922 -18079 -13383 -11694 406 -1981 -6333 -5595 2258 -14347
24320 -14347 -23223 -22271 -13880 -399 235 4197 3724 15709 16961 937 -8132 -13329 -4301 -119
$$ packed form
24423e053kr476m114k874N997j30M244L249P566k889j8316J0134K860J8120Q434
24408A7750j0429r027K283O763o663l34Q265K021l342m090J8355R362q079j2619
24394A0216q181O265O96J467K431m289j2440j4695N805J6228k580p673J963M201
24380e86j012L442J016M802M647m75j2518o668N581O974M212R080R180j1468j0304
24365E903O1j11n20q838N31J630l834L403O50q871j3096q009J3276N309o439M115
24349a4840m700l881Q843N900K983K082m474k146Q221K004L534j3529L113Q658
24335A768j3692j89P988l9j2540p218N843M696J689J2100k387m352P38P853j6605
24320a4347q876R52Q391J3481O34L962m73J1985J252j6024r069n197R028M182
$$ plain form
24306 -119 592 1977 3305 -3743 -5527 730 -59 10866 21782 25260 29190 24219 26962 21714 30118
24291 30118 35128 29804 25656 18205 10718 -2775 -17012 -15073 -5964 921 1636 8399 -366 -16578
24277 -16578 -25917 -21542 -17549 -14478 -6802 -4344 -15883 -16092 -7774 -11115 -26949 -24841 -23044 -16902
24263 -16902 -14635 -14538 -16059 -9735 -16586 -7040 -2599 -1397 2494 10186 9260 13978 5168 -14278 -14723
24248 -14723 -20814 -21960 -26852 -27381 -9743 -8902 -6801 -9274 -17881 -9841 1287 3111 -4978 -12730
24234 -12730 -7903 -3191 11457 20553 25753 17599 4753 -10117 -7548 -4873 -733 10823 3803
24221 3803 -3490 -7901 3205 16576 18749 13752 12902 14169 18443 19663 20387 19345 20993 25841 13721
24206 13721 4769 16271 16891 15074 243 -11367 -16328 -38467 -34177 -10566 -4868 -6858 -1973
$$ packed form
24306a19P11J385J328p048j784O257p89J0925J0916L478L930m971K743n248Q404
24291C0118N010n324m148p451p487j3493j4237J939R109O885P15O763q765j6212
24277a6578r339M375L993L071P676K458j1539k09Q318l341j5834K108J797O142
24263a6902K267R7j521O324o851R546M441J202L891P692r26M718q810j9446m45
24248a4723o091j146m892n29J7638Q41K101k473q607Q040J1128J824q089p752
24234a2730M827M712J4648R096N200q154j2846j4870K569K675M140J1556p020
24221C803p293m411J1106J3371K173m997q50J267M274J220P24j042J648M848j2120
24206A3721q952J1502O20j817j4831j1610m961k2139M290K3611N698j990M885
$$ plain form
24193 -1973 -12091 -9563 -14467 -15258 -8059 -10866 -15465 -23436 -21931 -10577 -11904 -27179 -21866 -15389
24179 -15389 -7761 -11641 -9518 -9591 -23617 -18410 -9528 -947 8121 7467 1544 9165 16490 13897 18254
24164 18254 8536 894 7741 -345 -11016 -17873 -9844 3695 17258 8090 -6976 -17533 -5303
24151 -5303 11452 7315 2646 -9287 -5928 123 -12463 -11512 -18848 -22803 5482 16686 7772 8502
24137 8502 17073 11808 16357 9864 8880 8266 -6444 -2675 -203 4248 12321 6568 2641 623 -477
24122 -477 -4813 -14538 -9553 9241 18595 12200 11374 5919 593 -8055 -4095 -9715 -10447 -9563 -15186
24107 -15186 -15394 -7613 -18869 -16844 -4686 5653 2648 15501 3645 -13764 -18496 -17248 -15041
24094 -15041 -8623 -22017 -13721 8409 10114 -8849 -19975 -20935 -20243 -10477 -7382 -14322 -30788 -12033
$$ packed form
24193a973j0118K528m904p91P199k807m599p971J505J1354j327j5275N313O477
24179a5389P628l880K123p3j4026N207Q882Q581R068o54n923P621P325k593M357
24164A8254r718p642O847q086j0671o857Q029J3539J3563r168j5066j0557J2230
24151e303J6755m137m669j1933L359O051j2586R51p336l955K8285J1204q914P30
24137H502Q571n265M549o493r84o14j4710L769K472M451Q073n753l927k018j100
24122d77m336r725M985J8794R354o395q26n455n326q648L960n620p32Q84n623
24107a5186k08P781j1256K025J2158J0339l005J2853j1856j7409m732J248K207
24094a5041O418j3394Q296K2130J705j8963j1126r60O92R766L095o940j6466J8755
$$ plain form
24080 -12033 -54 2075 -405 -10189 -13471 -17148 -17774 -7593 -2149 -8085 -22467 -23574 -14429 -12624
24066 -12624 -4649 13145 20514 10849 6145 10136 -3136 -21228 -15153 -1250 2925 -4415 -24719
24053 -24719 -18780 -11250 -15434 -531 5190 -8768 -18886 -12756 -8421 1218 16274 4356 -2127
24040 -2127 640 4194 10584 4844 -2922 -6108 -19007 -10576 -7441 -12079 -10206 -7409 -13141 -25645
24026 -25645 -21005 6346 -4987 -12935 -6759 3084 8177 -8208 -34138 -31169 -17192 -1364 -12442
24013 -12442 -22970 -23100 -22307 -30734 -36486 -28627 -16027 -6632 -282 -8431 -12228 -4028 3595 1522
23999 1522 -15001 -12726 -7325 -2920 2508 3717 3822 11479 31931 23578 20154 17501 27898 43063
23985 43063 42630 22463 -2413 -10853 -10192 -6341 8166 12941 -1803 -4383 -2911 -10243 -9918 -12288
$$ packed form
24080a2033J1979K129k480r784l282l677o26J0181N444n936j4382j107R145J805
24066a2624P975J7794P369r665m704L991j3272j8092O075J3903M175p340k0304
24053b4719N939P530m184J4903N721j3958j0118O130M335R639J5056j1918o483
24040b127K767L554O390n740p766l186j2899Q431L135m638J873K797n732j2504
24026b5645M640K7351j1333p948O176R843N093j6385k5930K969J3977J5828j1078
24013a2442j0528j30P93q427n752P859J2600R395O350q149l797Q200P623k073
23999A522j6523K275N401M405N428J209J05P657K0452q353l424k653J0397J5165
23985D3063m33k0167k4876q440O61L851J4507M775j4744k580J472p332L25k370
$$ plain form
23971 -12288 -25543 -32249 -19561 -18596 -17230 -15758 -13655 -18862 -7180 -2092 -3449 -5042 -8788 -1027
23957 -1027 9550 -983 -5988 -11916 -22136 -17873 -6160 -127 -9307 -15823 -7765 2426 13627
23944 13627 14036 8503 4573 -409 3255 6536 -7913 -7574 -6623 -10882 -3671 -10148 -15579 -17206 -8595
23929 -8595 6095 -710 -884 7512 -5384 -2254 1102 -4490 -8378 -7703 -10101 -3238 -9944 4048
23915 4048 8557 13798 16865 18211 3484 -18732 -20644 -16232 -20220 -28743 -17482 -16604 -18242 -21135
23901 -21135 -20754 -34280 -39746 -27197 -16012 -13480 -5474 -254 2764 3206 4854 -5910 -6096 2693
23887 2693 16507 9964 397 -8036 6564 12429 19210 14132 -2712 10523 24611 22382 5831
23874 5831 18681 21942 27400 19861 3192 -1232 -2755 10 -4262 -12695 -12598 -7665 3333 11618
$$ packed form
23971a2288j3255o706J2688R65J366J472K103n207J1682N088j357j593l746P761
23957a027J0577j0533n005n928j0220M263J1713O033r180o516Q058J0191J1201
23944A3627M09n533l930m982L664L281j4449L39R51m259P211o477n431j627Q611
23929h595J4690o805j74Q396j2896L130L356n592l888O75k398O863o706J3992
23915D048M509N241L067J346j4727k2216j912M412l988q523J1261Q78j638k893
23901b1135L81j3526n466J2549J1185K532Q006N220L018M42J648j0764j86Q789
23887B693J3814o543r567q433J4600N865O781n078j6844J3235J4088k229j6551
23874E831J2850L261N458p539j6669m424j523K765m272q433R7M933J0998Q285
$$ plain form
23860 11618 1913 -6218 -13045 -5012 12428 17111 -4886 -16930 -5908 2467 -4329 -4491 -4394 -9269
23846 -9269 -14074 -12265 -1454 -7637 -20502 -25944 -14205 -13378 -10370 -12319 1525 -4058 -6382 -6030
23832 -6030 -3439 -5124 5710 9773 13314 -351 -13406 -12538 -4587 15724 14691 -6229 -10939 -6710
23818 -6710 -2624 -12659 -26239 -29353 -38525 -24611 -7538 729 3562 -7651 -13804 -19491 -15532
23805 -15532 -11442 -467 3439 -8475 -2567 -511 -2674 -5863 -15326 -27390 -35850 -34750 -17592
23792 -17592 -9717 -21999 -25247 -2404 6961 3456 -736 -5954 -7800 -16285 -16525 -10858 -6823 -12498
23778 -12498 -29795 -32242 -5220 7049 1310 -3338 -2874 -10645 -6948 -8836 -17226 -12800 -5040 -1577
23764 -1577 279 4200 11966 12652 8721 18298 10711 4348 6669 8433 -2972 -208 -6491 -15323 -27779
$$ packed form
23860A1618r705q131o827Q033J7440M683k1997j2044J1022Q375o796j62R7m875
23846i269m805J809J0811o183j2865n442J1739Q27L008j949J3844n583k324L52
23832f030K591j685J0834M063L541j3665j3055Q68P951K0311j033k0920m710M229
23818f710M086j0035j3580l114r172J3914J7073Q267K833j1213o153n687L959
23805a5532M090J0975L906j1914N908K056k163l189r463j2064q460J100J7158
23792a7592P875j2282l248K2843R365l505m192n218j846q485k40N667M035n675
23778a2498j7297k447K7022J2269n739m648M64p771L697j888q390M426P760L463
23764a577J856L921P766O86l931R577p587o363K321J764j1405K764o283q832j2456
$$ plain form
23749 -27779 -19124 -8050 -3306 -12623 -7890 -197 -5146 -12160 -12849 -5169 -6501 3284 6250 -3720
23735 -3720 -5260 3310 -4555 -7816 -3660 -9884 -14061 -22394 -30926 -33864 -24094 -11096 -734 1574
23721 1574 -103 -6957 1296 17669 21886 27341 11687 13391 5099 3302 4871 9521 20893 25049
23707 25049 6757 -11704 -17428 -12269 -10120 -17142 -7764 851 6445 -7855 -12598 -13163 -9224 -5987
23693 -5987 3590 22043 27372 17090 5391 4302 630 -6189 1117 4010 7933 15099 17365 11571
23679 11571 9022 8378 -7523 -8651 531 -3429 -11346 -9860 -16102 -6979 5934 14889 16653 12259
23665 12259 12884 17287 10340 9019 7957 8821 8085 -2740 -3631 -11744 -15863 -6222 2050 6366 15743
23650 15743 14576 13922 23368 14927 10569 11416 15733 3057 -2932 -3246 -7796 -8703 -3529 4015 7789
$$ packed form
23749b7779Q655J1074M744r317M733P693m949p014o89P680j332R785K966r970
23735c720j540Q570p865l261M156o224m177q333q532k938R770J2998J0362K308
23721A574j677o854Q253J6373M217N455j5654J704q292j797J569M650J1372M156
23707B5049j8292j8461n724N159K149p022R378Q615N594j4300m743n65L939L237
23693e987R577J8453N329j0282j1699j089l672o819P306K893L923P166K266n794
23679A1571k549o44j5901j128R182l960p917J486o242R123J2913Q955J764m394
23665A2259O25M403o947j321j062Q64p36j0825q91q113m119R641Q272M316R377
23650A5743j167o54R446q441m358Q47M317j2676n989l14m550r07N174P544L774
$$ plain form
23635 7789 -8152 -7980 -5642 2603 -1460 3134 3930 -8440 -16591 -2530 8806 15371 26501 23258
23621 23258 16476 9577 24471 19314 8552 13755 17188 21809 9434 -7902 -14820 -12455 -12032 -15428
23607 -15428 2063 8623 766 -4031 -20225 -22583 -31217 -28738 -28471 -12411 -11829 -15050 -18354 -20982
23593 -20982 -20504 -27106 -20003 3593 24951 32788 20463 18213 14399 -624 -3840 407 9779 8011
23579 8011 9320 5985 48 -2603 4512 -3686 4600 9105 -1514 -3331 -2682 -9502 -6682 -19612
23565 -19612 -41128 -48652 -45981 -30252 -16042 -17889 -11879 -628 -425 -5120 -9087 -15385 -5800 -8717
23551 -8717 -25280 -42278 -27055 -10404 -1474 -14500 -31376 -17365 -12334 -19556 -15860 -153 5979
23538 5979 6355 -49 -3344 -10931 -7135 -2456 2824 -2636 -1491 10682 30930 25573 16356 11722
$$ packed form
23635G789j5941J72K338Q245m063M594P96j2370q151J4061J1336O565J1130l243
23621B3258o782o899J4894n157j0762N203L433M621j2375j7336o918K365M23l396
23607a5428J7491O560p857m797j6194k358q634K479K67J6060N82l221l304k628
23593b0982M78o602P103K3596K1358P837j2325k250l814j5023l216M247R372j768
23579H011J309l335n937k651P115q198Q286M505j0619j817O49o820K820j2930
23565a9612k1516p524K671J5729J4210j847O010J1251K03m695l967o298R585k917
23551h717j6563j6998J5223J6651Q930j3026j6876J4011N031p222L696J5707O132
23538E979L76o404l295p587L796M679N280n460J145J2173K0248n357r217m634
$$ plain form
23524 11722 15740 26430 16520 13445 13246 13077 17177 13119 11339 4845 -11985 -20334 -18662 -13088
23510 -13088 -4919 -9694 -7713 -1441 -7645 -5284 -257 3616 14156 899 -6608 2517 9204 6104
23496 6104 4365 7968 18364 17358 2593 -14301 -3847 -294 -2093 -30 15427 13106 2732
23483 2732 452 -2383 4086 9860 7912 2673 -401 13277 4866 322 -4217 -5171 1720 18404
23469 18404 11624 315 -12464 -14158 -8536 -12325 -10736 -1479 -1103 -11208 -12598 -11785 -5312 -10934
23455 -10934 -15002 -21676 -16132 -6731 417 -6455 -17609 -23331 -9520 6857 17779 9 -10778
23442 -10778 -10207 -13203 -8518 -18536 -17827 -14070 -9859 -6882 -11238 -13781 -15394 838 -5321 -29465
23428 -29465 -23786 -5064 8069 -2185 -16196 -5393 8176 19091 11244 14669 1231 -4883
$$ packed form
23524A1722M018J0690r910l075j99j69M100m058j780o494j6830q349J672N574
23510a3088Q169m775J981O272o204K361N027L873J0540j3257p507R125O687l100
23496F104j739L603J0396j006j4765j6894J0454L553j799K063J5457k321j0374
23483B732k280k835O469N774j948n239l074J3678q411m544m539r54O891J6684
23469A8404o780j1309j2779j694N622l789J589R257L76j0105j390Q13O473n622
23455a0934m068o674N544R401P148o872j1154n722J3811J6377J0922j7770j0787
23442a0778N71k996M685j0018P09L757M211K977m356k543j613J6232o159k4144
23428b9465N679J8722J3133j0254j4011J0803J3569J0915p847L425j3438o114
$$ plain form
23416 -4883 -5981 -8436 -9352 1964 779 2035 -5694 -6338 11428 12848 4134 -2114 -6711 -18809
23402 -18809 -21754 -14691 2241 -1448 -14910 -17760 -15638 -15695 -12984 -24987 -29755 -8301 -3188 -10710
23388 -10710 -14139 -13190 -14994 -15379 -4651 -16893 -25487 -21529 -19117 -14613 -2490 -2883 -23 11488
23374 11488 22975 29387 23028 17398 13104 3436 -9379 -4160 5811 3602 -4987 -20950 -17352 -14862
23360 -14862 -3913 11624 6549 -13413 -507 8927 10345 8797 15910 21277 19963 9883 3132
23347 3132 6987 22388 23998 4265 -3251 -2967 -7783 -15850 -5402 628 4261 -4222 -18550 -24538
23333 -24538 -22180 -16691 -12984 -23875 -14914 -9898 1091 6703 -1454 7679 4203 1442 357 -8591
23319 -8591 -14411 -9776 -11874 -7282 -6154 -2427 -11948 -9240 5510 7408 5754 9073 7625 -4410
$$ packed form
23416d883j098k455r16J1316j185J256p729o44J7766J420q714o248m597j2098
23402a8809k945P063J6932l689j3462k850K122n7K711j2003m768K1454N113p522
23388a0710l429R49j804l85J0728j2242q594L958K412M504J2123l93K860J1511
23374A1488J1487O412o359n630m294r668j2815N219R971k209q589j5963L598K490
23360a4862J0949J5537n075j9962J2906R434J418j548P113N367j314j0080o751
23347C132L855J5401J610j9733p516K84m816q067J0448O030L633q483j4328n988
23333b4538K358N489L707j0891Q961N016J0989N612q157R133l476k761j085q948
23319h591n820M635k098M592J128L727r521K708J4750J898j654L319j448j2035
$$ plain form
23305 -4410 791 3191 3323 180 -7013 -6029 -7048 -3154 -1045 -15786 -18019 -3025 -4490 -5365 -10346
23290 -10346 -6931 -3945 -9597 -16039 -7278 3185 1527 -1072 658 -6738 -8776 -11007 -8161 -4636
23276 -4636 -7482 -6165 4130 6295 -11956 -7435 -15570 -20685 -16197 -16662 676 1299 -2571 -7975
23262 -7975 -11848 -7096 2470 5109 -4509 -9964 -2847 13976 5808 -10651 -14553 -18681 -24108 -25004
23248 -25004 -25451 -14774 -22290 -12247 1493 -8554 -5848 6030 -1205 8365 4578 -4160 -10880
23235 -10880 -13052 -23441 -35632 -37034 -22799 -17301 -14776 -22491 -23214 -14596 -16613 -8602 -6592 -6263
23221 -6263 -13466 576 10383 -2795 -5649 -2672 -14109 -25138 -25365 -9640 -5464 -8733 -14253 -24990
23207 -24990 -24354 -14037 -4270 -3211 874 11639 4034 -4108 -8246 -15624 -19403 -19982 -14694 -9539
$$ packed form
23305d410N201K400J32l143p193R84j019L894K109j4741k233J4994j465q75m981
23290a0346L415K986n652o442Q761J0463j658k599J730p396k038k231K846L525
23276d636k846J317J0295K165j8251M521q135n115M488m65J7338O23l870n404
23262g975l873M752R566K639r618n455P117J6823q168j6459l902m128n427q96
23248b5004m47J0677p516J0043J3740j0047K706J1878p235R570l787q738o720
23235a0880k172j0389j2191j402J4235N498K525p715p23Q618k017Q011K010L29
23221f263p203J4042R807j3178k854K977j1437j1029k27J5725M176l269n520j0737
23207b4990O36J0317R767J059M085J0765p605q142m138p378l779n79N288N155
$$ plain form
23193 -9539 -10770 -17844 -35118 -36807 -23770 -27997 -20900 -20576 -13265 -7686 -4568 -3447 728 3866
23179 3866 7191 16581 10828 -8837 -16683 -17358 -24347 -31293 -24404 -17247 -17985 -9454 -2949 -3569 -14846
23164 -14846 -17996 -13692 -4452 8055 22926 18769 7988 1266 -96 -4631 -4538 9107 18919 26195
23150 26195 35070 28921 24825 19251 11940 17853 19980 26813 10934 3409 2983 -4324 -5755 -11385
23136 -11385 -8769 -5474 -15785 -22883 -16665 -9936 1615 3391 11271 21948 21972 25752 38178 25943
23122 25943 4161 6013 1853 -1793 2479 -13575 -11416 -4047 8688 -3304 -17903 -19788 -16852
23109 -16852 -8179 -13783 -20010 -21686 -4498 -5941 -12124 -469 -1795 -2528 -4725 -12870 -18727 -30477
23095 -30477 -25142 -21914 -20683 -2268 12433 4287 -2328 8010 -5599 -13757 2353 3177 -1206
$$ packed form
23193i539j231p074j7274j689J3037m227P097L24P311N579L118J121M175L138
23179C866L325R390n753j9665p846o75o989o946O889P157p38Q531O505o20j1277
23164a4846l150M304R240J2507J4871m157j0781o722j362m535R3J3645R812P276
23150B6195Q875o149m096n574p311N913K127O833j5879p525m26p307j431n630
23136a1385K616L295j0311p098O218O729J1551J776P880J0677K4L780J2426j2235
23122B5943k1782J852m160l646M272j6054K159P369J2735j1992j4599j885K936
23109a6852Q673n604o227j676J7188j443o183J1655j326p33k197q145n857j1750
23095c0477N335L228J231J8415J4701q146o615J0338j3609q158J6110Q24m383
$$ plain form
23082 -1206 8664 6468 -7772 -16491 -10223 -6004 -16307 -12439 -10687 -5646 -2003 -11878 -6671 7926
23068 7926 3731 -4338 -1097 4728 3282 5191 16537 17397 15590 469 -6213 -7091 -6318 -8535 -7466
23053 -7466 2146 -14704 -24481 -15726 -11668 -17963 -18763 -16923 -6685 1297 -834 -1711 -490 1991 19173
23038 19173 23552 8766 2775 -2631 -5456 -7581 -6754 4578 5577 5293 11766 15869 19585 3671
23024 3671 -5029 -52 4832 4605 3213 831 140 -19549 -32946 -30644 -32288 -22552 -1467 8374
23010 8374 12085 10607 15450 10757 1331 -11633 -6189 -13122 -7777 8022 3720 -2480 -1862 2986
22996 2986 3621 74 -10116 -11310 -7465 -1153 11980 5973 2217 5850 6050 9192 14814 10474 364
22981 364 -2031 3918 2898 345 -4396 6198 2921 -9600 -25544 -40007 -40909 -36199 -28006 -19437
$$ packed form
23082a206R870k196j4240q719O268M219j0303L868J752N041L643r875N207J4597
23068G926m195q069L241N825j446J909J1346Q60j807j5121o682q78P73k217J069
23053g466R612j6850r777Q755M058o295q00J840J0238P982k131q77J221K481J7182
23038A9173M379j4786n991n406k825k125Q27J1332R99k84O473M103L716j5914
23024C671q700M977M884k27j392k382o91j9689j3397K302j644R736K1085R841
23010H374L711j478M843m693r426j2964N444o933N345J5799m302o200O18M848
22996B986O35l547j0190j194L845O312J3133o007l756L633K00L142N622m340j0110
22981C64k395N949j020k553m741J0594l277j2521j5944j4463r02M710Q193Q569
$$ plain form
22967 -19437 -16785 -19261 -18550 -18742 -27360 -17107 -8037 2309 5531 5514 13811 17880 15039 11691 16385
22952 16385 6137 -10473 -17409 -26787 -35405 -24258 -25032 -31110 -33802 -29384 -25609 -8907 -16891 -4848
22938 -4848 3753 -1449 -12626 -19391 -25742 -22609 -24729 -30476 -23604 -6252 -3635 -15945 -5465 2357
22924 2357 -407 -1182 1592 774 2898 1395 -15789 -4928 3969 -2806 -20327 -15704 -7123 -6284 -745
22909 -745 2651 -3267 -3842 -14133 -13848 -7215 -15397 -22520 -25066 -24649 -10069 -3833 -14810 -22747 -26263
22894 -26263 -24387 -14786 -5269 -6061 -20357 -27503 -21568 -21326 -26374 -25084 -24826 -13514 -10928 -11137 -11065
22879 -11065 -4143 -8458 -6139 499 5590 4768 -6532 -9391 1564 3741 4161 5757 1945 10981
22865 10981 10286 6482 6551 3297 -18328 -19692 -23589 -34783 -36913 -17559 -13907 -12309 -6806 2074
$$ packed form
22967a9437K652k476P11j92q618J0253R070J0346L222j7Q297M069k841l348M694
22952A6385j0248j6610o936r378q618J1147p74o078k692M418L775J6702p984J2043
22938d848Q601n202j1177o765o351L133k120n747O872J7352K617j2310J0480P822
22924B357k764p75K774q18K124j503j7184J0861Q897o775j7521M623Q581Q39N539
22909g45L396n918n75j0291K85O633q182p123k546M17J4580O236j0977p937l516
22894b6263J876R601R517p92j4296p146N935K42n048J290K58J1312K586k09P2
22879a1065O922m315K319O638N091q22j1300k859J0955K177M20J596l812R036
22865A0981o95l804O9l254k1625j364l897j1194k130J9354L652J598N503Q880
$$ plain form
22851 2074 5279 -1090 -10481 -24679 -25089 -16684 -16051 -18229 -8864 -8323 -18201 -21237 -28620 -33230 -30995
22836 -30995 -20283 -8958 4109 2458 -4961 -5805 8223 19175 6573 -3066 -2102 5846 660
22823 660 -7673 -3280 4303 -8779 -22895 -12856 2156 -5209 -14288 -18181 -9760 2025 -5562 -10466
22809 -10466 -19146 -7605 -8687 -7727 -12705 -29201 -36190 -31734 -17115 -14788 -22512 -43085 -33588 -21629
22795 -21629 -12070 -556 1203 14737 26806 12949 13514 -2687 -15134 -659 13007 10857 -2165
22782 -2165 -7452 -10642 -18189 -12721 -12248 -4079 -4978 -2922 -14394 -22220 -10898 -2958 -16409 -26036
22768 -26036 -24546 -24795 -24273 -18807 -17763 -8362 -18381 -28659 -13525 5014 20079 32716 30590
22755 30590 25633 17321 1556 -9548 -6236 -2905 8753 -2795 -6172 -909 -7320 -13293 -11945
$$ packed form
22851B074L205o369r391j4198m10Q405O33k178R365N41r878l036p383m610K235
22836c0995J0712J1325J3067j651p419q44J4028J0952j2602r639R64P948n186
22823F60q333M393P583j3082j4116J0039J5012p365r079l893Q421J1785p587m904
22809a0466q680J1541j082R60m978j6496o989M456J4619K327p724k0573R497J1959
22795b1629R559J1514J759J3534J2069j3857N65j6201j2447J4475J3666k150j3022
22782b165n287l190p547N468M73Q169q99K056j1472p826J1322P940j3451r627
22768b6036J490k49N22N466J044R401j0019j0278J5134J8539J5065J2637k126
22755C0590m957q312j5765j1104L312L331J1658j1548l377N263o411n973J348
$$ plain form
22742 -11945 -21194 -27384 -24205 -9431 -10533 -11915 -22100 -24345 -24502 -12310 1557 2418 5395 -778
22728 -778 -11729 -8579 10859 7117 2358 2204 -5369 -14894 -10182 1473 -5174 -8278 -13485 -13541 -20220
22713 -20220 -27008 -24522 -13851 -982 488 7819 -7143 -14500 -846 9643 5473 -3081 -12798
22700 -12798 -10751 -12272 -11520 -16201 -15714 -13964 -5693 -6942 -23195 -34558 -24638 -21690 -19661 -29115
22686 -29115 -17945 -15436 -24873 -25614 -18657 -21376 -5845 9816 22696 33839 26797 6372 3112
22673 3112 -15990 -37895 -44547 -31977 -19064 -4324 6962 13354 8211 10020 16860 24784 19798
22660 19798 3618 -9846 -14358 -15350 -16429 -12535 -13871 -5136 8812 4182 -4493 10627 9382 1256
22646 1256 -3901 -17990 -22973 2509 15280 9553 3624 -2582 -8238 -2586 -2133 468 -6779 -11939
$$ packed form
22742a1945r249o190L179J4774j102j382j0185k245j57J2192J3867Q61K977o173
22728g78j0951L150J9438l742m759j54p573r525M712J1655o647l104n207n6o679
22713b0220o788K486J0671J2869J470P331j4962p357J3654J0489m170q554r717
22700a2798K047j521P52m681M87J750Q271j249j6253j1363R920K948K029r454
22686b9115J1170K509r437p41O957k719J5531J5661J2880J1143p042k0425l260
22673C112j9102k1905o652J2570J2913J4740J1286O392n143J809O840P924m986
22660A9798j6180j3464m512r92j079L894j336Q735J3948m630q675J5120j245q126
22646A256n157j4089m983K5482J2771n727n929o206n656N652M53K601p247n160
$$ plain form
22632 -11939 -7980 5025 -2065 -8408 -17588 -25547 -15364 3096 2373 -5413 -2998 -9826 5528 7307
22618 7307 -6247 726 -8508 -8510 1232 -4208 -9566 -14236 -14556 -17954 -30084 -36915 -25504 -1897 1929
22603 1929 951 -3449 -4518 -14287 -17111 -13650 -7210 1637 6805 15905 1715 -923 4516 8129 5213
22588 5213 -1876 -12382 -10316 -6249 5163 -360 -11178 -19655 -19256 -7098 -1691 3548 6954 11518
22574 11518 -2999 -7684 -5690 5204 6159 11359 726 -3251 -8825 -6633 -630 -16371 -25801 -18569
22560 -18569 -12576 -4942 2112 -6762 -17891 -6506 1630 -3804 6205 8062 8211 5270 16147 23376
22546 23376 21261 12037 5516 5510 7493 -401 -2135 2869 3975 11919 16258 5241 -5777 -6961 -4424
22531 -4424 -6214 -7390 4013 -4235 -11018 -22225 -22542 -11753 -17423 -24259 -17385 -1268 -2804 -9869
$$ packed form
22632a1939L959J3005p090o343r180p959J0183J8460p23p786K415o828J5354J779
22618G307j3554O973r234kR742n440n358m670l20l398j2130o831J1411K3607L826
22603A929r78m400j069r769k824L461O440Q847N168R100j4190k638N439L613k916
22588E213p089j0506K066M067J1412n523j0818q477L99J2158N407N239L406M564
22574A1518j4517m685J994J0894R55N200j0633l977n574K192O003j5741r430P232
22560a8569N993P634P054q874j1129J1385Q136n434J0009J857J49k941J0877P229
22546B3376k115r224o521oJ983p894j734N004J106P944M339j1017j1018j184K537
22531d424j790j176J1403q248o783j1207l17J0789n670o836O874J6117j536p065
$$ plain form
22517 -9869 -3551 -2095 -12236 -15494 -4903 -11768 -19218 -21813 -23612 -27848 -14048 -4972 14991 25066
22503 25066 14261 4134 -1552 6245 23641 841 2615 18348 14079 1507 -4072 -12692 -12833
22490 -12833 -17093 -19660 -27053 -19104 -14192 -13282 -17227 -16186 -8621 -11897 -16153 -6114 3560 -6393
22476 -6393 -12780 -13650 -18200 -17818 -10541 -7317 -18440 -25559 -30665 -33868 -28908 -35864 -33254 -18078 -12747
22461 -12747 -10251 -3086 9346 14579 7302 4875 8602 13841 11447 10728 7680 20326 7642 -1901
22447 -1901 -1483 -9885 -17602 -15566 -13129 1925 8405 6739 7956 10948 5307 6289 5013 7335 1709
22432 1709 -813 7439 6712 512 -5913 -7433 -2774 -8640 -8642 -125 -5753 -3828 -7320 1244 5469 -5703
22416 -5703 -23320 -21565 -12214 -14735 -13527 -12652 -7838 -9980 -9034 -3568 -6927 -14523 -14910 -24787 -25318
$$ packed form
22517i869O318J456j0141l258J0591o865p450k595j799m236J3800R076J9963J0075
22503B5066j0805j0127n686P797J7396k2800J774J5733m269j2572n579q620j41
22490a2833m260k567p393P949M912R10l945J041P565l276m256J0039R674r953
22476f393o387q70m550L82P277L224j1123p119n106l203M960o956K610J5176N331
22461a2747K496P165J2432N233p277k427L727N239k394p19l048J2646j2684r543
22447a901M18q402p717K036K437J5054O480j666J217K992n641R82j276K322n626
22432A709k522Q252p27o200o425j520M659n866kQ517n628J925l492Q564M225j1172
22416e703j7617J755R351k521J208Q75M814k142R46N466l359p596l87r877n31
$$ plain form
22401 -25318 -6238 5836 14338 22625 25909 34503 35884 16036 -5150 -13193 -9930 -7367 -14347
22388 -14347 -20981 -16632 -7487 -10033 -5159 10685 16828 19834 15729 4993 -14021 -8143 -2074 -12701
22374 -12701 -26196 -26840 -21380 -23532 -33011 -32154 -23893 -17996 -18645 -13112 -13669 -21233 -25226 -17609 -20638
22359 -20638 -9375 3712 10952 -2117 -5947 -11448 -7777 5390 13930 19015 26933 12836 -1781
22346 -1781 -4377 -305 -7479 -14741 -8313 -1852 -566 12049 14840 3034 10911 -6435 -19140 -32815
22332 -32815 -17529 -11777 -17149 -20998 -16032 -16535 -6654 -6617 -11212 -8067 -14459 -21276 -10943 1548
22318 1548 3147 5801 13626 12965 10990 16734 3193 6757 12318 5906 -4915 -12901 -5837 -9066
22304 -9066 -7621 5734 -2203 -8111 -6351 -13058 -12457 -12345 -11456 -4351 -6257 -4793 1599 -16461 -19230
$$ packed form
22401b5318J9080J2074Q502Q287L284Q594J381j9848k1186q043L263K563o980
22388a4347o634M349R145k546M874J5844O143L006m105j0736j9014N878O069j0627
22374a2701j3495o44N460k152r479Q57Q261N897o49N533n57p564l993P617l029
22359b0638J1263J3087P240j3069l830n501L671J3167Q540N085P918j4097j4617
22346a781k596M072p174p262O428O461J286J2615K791j1806P877j7346j2705j3675
22332c2815J5286N752n372l849M966n03R881L7m595L145o392o817J0333J2491
22318A548J599K654P825o61j975N744j3541L564N561o412j0821p986P064l229
22304i066J445J3355p937n908J760o707O01J12Q89P105j906J464O392j8060k769
$$ plain form
22289 -19230 -16337 -12194 -18418 -13918 -3410 -17556 -31903 -14075 -8574 -16022 -12443 -18 -347
22276 -347 -10426 -14758 -13661 -17547 -2303 -10378 -25833 -21531 -17315 -17664 -18045 -25258 -26113 -25851 -12918
22261 -12918 -8003 -9843 -14985 -19888 -18662 -5432 11165 10769 -5760 -13733 -22378 -13317 -12129 -13617
22247 -13617 -18800 -17527 -5309 10037 4864 8549 19747 9746 589 -2400 10859 11889 72
22234 72 -152 3143 11284 14802 8903 -1155 3775 11601 15863 24620 13722 607 -18084 -18035 -6074
22219 -6074 4796 888 575 -6109 -15522 -8815 -15031 -11636 -13344 -7284 4469 576 -4509 -19701
22205 -19701 -28375 -15529 3698 8710 12990 9696 -8194 -22960 -32070 -27111 -20264 -4432 5153
22192 5153 937 9832 7456 17570 18546 11085 -1253 -16074 -32266 -50111 -48022 -33877 -42268
$$ packed form
22289a9230K893M143o224M500J0508j4146j4347J7828N501p448L579J2425l29
22276c47j0079m332J097l886J5244q075j5455M302M216l49l81p213q55K62J2933
22261a2918M915j840n142m903J226J3230J6597l96j6529p973q645R061J188j488
22247a3617n183J273J2218J5346n173L685J1198j0001r157k989J3259J030j1817
22234G2k24L295Q141L518n899j0058M930P826M262Q757j0898j3115j8691M9J1961
22219f074J0870l908l13o684r413O707o216L395j708O060J1753l893n085j5192
22205a9701q674J2846J9227N012M280l294j7890j4766r110M959O847J5832R585
22192E153m216Q895k376J0114R76p461j2338j4821j6192j7845K089J4145q391
$$ plain form
22179 -42268 -51719 -38493 -25935 -17487 -15317 -12010 -8181 -9497 -10822 -26220 -38541 -28592 -38567
22166 -38567 -39477 -32548 -8318 -9148 -28496 -23325 -3191 -5486 1003 11706 2977 -9244 -7513 -11238
22152 -11238 -17490 -9916 4621 8330 -1254 -19359 -22987 -19968 -25832 -28508 -22174 -12228 -3721 12485
22138 12485 4399 13044 4145 -9176 -12493 -15494 -2627 -9408 -3036 19274 19928 7978 4559 4694
22124 4694 9689 20203 13570 -2893 2899 12738 -4264 -24322 -16991 -9222 -13188 -4615 -2280 -9688
22110 -9688 -7832 4863 -5017 -13906 -8580 3384 7281 5702 591 -7155 -9172 -9629 -13076 -6692
22096 -6692 -2537 7641 -3296 -13812 -11503 -13988 -13196 -23738 -27313 -19364 -19926 -17232 -633 2812
22082 2812 -7559 -10796 -2171 -5491 -21439 -24510 -17075 -5325 -893 -5386 -16294 -18658 -11261 1674
$$ packed form
22179d2268r451J3226J2558Q448K170L307L829j316j325j5398j2321R949r975
22166c8567r10O929K4230q30j9348N171K0134k295O489J0703q729j2221J731l725
22152a1238o252P574J4537L709r584j8105l628L019n864k676O334R946Q507J6206
22138A2485q086Q645q899j3321l317l001J2867o781O372K2310O54j1950l419J35
22124D694M995J0514o633j6463N792R839j7002k0058P331P769l966Q573K335p408
22110i688J856J2695r880q889N326J1964L897j579n111p746k017m57l447O384
22096f692M155J0178j0937j0516K309k485P92j0542l575P949n62K694J6599L445
22082B812j0371l237Q625l320j5948l071P435J1750M432m493j0908k364P397J2935
$$ plain form
22068 1674 3276 2845 -5820 -8413 -13818 1928 9755 440 13520 13509 14812 2789 -10422 -794
22054 -794 7190 -2817 -10861 -13807 -15915 -27023 -16224 -9723 -8820 -5509 3940 -10218 -36574 -41401
22040 -41401 -38968 -22139 -1777 3227 -1434 -3030 3528 7263 11810 8654 8783 4683 -85 16677
22026 16677 14436 11206 9639 4468 -930 462 -1409 -8546 -22524 -22359 -21236 -20885 -26645 -30635 -18957
22011 -18957 -7785 -16945 -18728 -16311 -15033 2365 -1449 -2026 4388 -12184 -13787 -10994 -8891 -2888
21997 -2888 9014 12360 5957 3020 12138 -3144 -15495 -19010 -18548 -12261 -17367 -17032 -10199 -18111
21983 -18111 -12468 -8672 -15626 -10306 -8667 -22970 -15177 176 22551 18823 6593 -7834 -3691
21970 -3691 2993 12576 25041 17505 7415 2116 2941 5229 -1542 -4386 -142 -19031 -23428 -6603
$$ packed form
22068A674J602m31q665k593n405J5746P827r315J3080j1J303j2023j3211R628
22054g94P984j0007q044k946k108j1108J0799O501R03L311R449j4158k6356m827
22040d1401K433J6829K0362N004m661j596O558L735M547l156J29m100m768J6762
22026A6677k241l230j567n171n398J392j871p137j3978J65J123L51n760l990J1678
22011a8957J1172r160j783K417J278J7398l814n77O414j6572j603K793K103O003
21997b888J1902L346o403k937R118j5282j2351l515M62O287n106L35O833p912
21983a8111N643L796o954N320J639j4303P793J5353K2375l728j2230j4427M143
21970c691O684R583J2465p536j0090n299Q25K288o771k844M244j8889m397J6825
$$ plain form
21956 -6603 -4260 -4722 -14723 -28182 -30865 -19741 1493 14281 6638 3453 3026 -384 6823 8388
21942 8388 -13423 -21357 -18658 -16967 -14519 -7772 -6597 -10980 -5516 2798 -5732 -18614 -13742 1102
21928 1102 11743 11500 22395 14472 3155 -6615 -12597 -10783 -21409 -28691 -23899 -16502 -18876 -23286
21914 -23286 -18801 -10348 -226 1241 3869 2396 1280 10155 11907 -7929 -15914 -17594 -20882 -21044
21900 -21044 -17448 -15427 -13347 -14389 -12651 -14953 -19805 -13385 -12223 -21383 -23437 -20996 -13067 -10895
21886 -10895 -9046 -5114 -1191 1440 -1312 573 2391 -5577 -7857 -5051 -12572 -30117 -18030 -7201
21872 -7201 -12732 -16220 -17494 -15231 -10663 -7650 -20755 -11900 -274 2154 190 3299 13310 19835
21858 19835 5536 10048 17541 13749 3676 13533 6881 -9130 -21409 -18256 -9612 -2852 9373
$$ packed form
21956f603K343m62j0001j3459k683J1124K1234J2788p643l185m27l410P207J565
21942H388k1811p934K699J691K448O747J175m383N464Q314q530j2882M872J4844
21928A102J0641k43J0895p923j1317r770n982J814j0626p282M792P397k374m410
21914b3286M485Q453J0122J467K628j473j116Q875J752j9836p985j680l288j62
21900b1044L596K021K080j042J738k302m852O420J162r160k054K441P929K172
21886a0895J849L932L923K631k752J885J818p968k280K806p521j7545J2087J0829
21872g201n531l488j274K263M568L013j3105Q855J1626K428j964L109J0011O525
21858A9835j4299M512P493l792j0073R857o652j6011j2279L153Q644O760J2225
$$ plain form
21845 9373 8243 -13380 -20913 -12472 -6235 -6721 -16862 -8483 -3008 -3484 -9361 -12073 -14716 -16862 -11355
21830 -11355 -8346 -10547 -3295 -2321 -8074 -11455 -18971 -29378 -23915 -19940 -8593 -1410 4477 8371
21816 8371 -609 -11990 -17331 -11552 -1952 3078 823 1689 -10513 -32719 -24592 -14821 -11128 -318
21802 -318 10462 11203 5889 935 -5641 -19087 -8531 17637 9425 -8703 -14489 -5402 -5942 2564
21788 2564 314 -6965 -10624 -9802 2403 3876 -3895 -9575 -7739 -1343 -5248 -17359 -16694 -13970 -10432
21773 -10432 -19863 -8539 -8438 -9566 -203 -8483 -9660 -8668 1795 12660 2621 9426 1111 -3692
21759 -3692 -10820 1833 -588 -5630 1458 4766 504 -2630 -5079 -10111 -10543 -6480 2402 11515 7953
21744 7953 9323 20471 23988 10912 897 -7139 -10292 -2869 5952 -7391 -17848 -19369 -14074
$$ packed form
21845I373j130k1623p533Q441O237m86j0141Q379N475m76n877k712k643k146N507
21830a1355L009k201P252R74n753l381p516j0407N463L975J1347P183N887L894
21816H371q980j1381n341N779R600N030k255Q66j2202k2206Q127R771L693J0810
21802c18J0780P41n314m954o576j3446J0556K6168q212j8128n786R087n40Q506
21788B564k250p279l659Q22J2205J473p771n680J836O396l905j2111O65K724L538
21773a0432r431J1324J01j128R363q280j177R92J0463J0865j0039O805q315m803
21759c692p128J2653k421n042P088L308m262l134k449n032m32M063Q882R113l562
21744G953J370J1148L517j3076j0015q036l153P423Q821j3343j0457j521N295
$$ plain form
21731 -14074 -4136 -12220 -7423 -5388 6222 8865 19577 12271 11593 3737 5282 6038 -3058 -2395 -1978
21716 -1978 -6778 1050 6326 16278 12255 9515 6737 -7853 -11697 -9585 -3238 -5821 -6641 -13232 -501
21701 -501 10405 11718 27844 32757 29630 20364 16018 17760 19846 26185 29537 25147 10083 5841
21687 5841 -830 6912 4192 4710 6824 3694 6641 12057 18541 15116 20265 10959 10335 6709 10186
21672 10186 10729 13729 -3357 -10849 -1474 -4725 -2010 -491 7515 14190 -1076 -17426 -25594 -20240
21658 -20240 -13668 -13545 -12078 12934 22439 21181 16377 12644 20785 16502 11918 17158 17698 6318
21644 6318 -8422 -27473 -19104 -9707 -5815 -3472 -661 6839 384 -10615 -15362 -22030 -7828 -263
21630 -263 -6907 -20139 -30363 -18896 -786 1024 3013 2332 2516 2757 6741 3629 7423 3305 -6478
$$ packed form
21731a4074R938q084M797K035J1610K643J0712p306o78p856J545P56r096O63M17
21716a978m800P828N276R952m023k740k778j4590l844K112O347k583q20o591J2731
21701e01J0906J313J6126M913l127r266m346J742K086O339L352m390j5064m242
21687E841o671P742k720N18K114l130K947N416O484l425N149r306o24l626L477
21672A0186N43L000j7086p492R375l251K715J519Q006O675j5266j6350q168N354
21658b0240O572J23J467K5012R505j258m804l733Q141m283m584N240N40j1380
21644F318j4740j9051Q369R397L892K343K811P500o455j0999m747o668J4202P565
21630b63o644j3232j0224J1467J8110J810J989o81J84K41L984l112L794m118r783
$$ plain form
21615 -6478 -3991 -9852 -12744 -4218 -278 11088 15262 9218 -640 -7387 -18838 -15657 140 -7812
21601 -7812 -29003 -29166 -24230 -23193 -21625 -23630 -28352 -24548 -9975 -1805 8653 3887 61 -268
21587 -268 -3791 5841 1668 -1115 -2882 -8103 -15585 -9899 -7135 -12213 -24727 -19558 -13173 8998
21573 8998 18524 18232 8629 12273 3207 4159 5205 4356 3653 1953 -5266 2446 8245 18283 8583
21558 8583 -2156 -21585 -22237 -24438 -16250 -4701 1110 -6760 -13549 -9719 -2871 5659 1241 -12204
21544 -12204 -23420 -9059 -10384 -12009 1543 -12475 -19371 -12636 -3935 -2118 -2431 -2108 -10709 -22302
21530 -22302 -13526 -9973 -10913 -11799 -16054 -11628 -12422 7413 12295 20529 29777 25053 23916 28625 15717
21515 15717 3900 7484 2951 10450 6833 4509 -2336 3038 2751 -3635 -1445 4079 803 9369
$$ packed form
21615f478K487n861k892Q526L940J1366M174o044r858o747j1451L181J5797p952
21601g812k1191j63M936J037J568k005m722L804J4573Q170J0458m766l826l29
21587b68l523R632m173k783j767n221p482N686K764n078j2514N169O385K2171
21573H998R526k92r603L644r066R52J046q49p03j700p219P712N799J0038r700
21558H583j0739j9429o52k201Q188J1549N811p870o789L830O848Q530m418j3445
21544a2204j1216J4361j325j625J3552j4018o896O735Q701J817l13L23q601j1593
21530b2302Q776L553r40q86m255M426p94J9835M882Q234R248m724j137M709j2908
21515A5717j1817L584m533P499l617k324o845N374k87o386K190N524l276Q566
$$ plain form
21501 9369 8549 4141 13308 21534 10865 -2729 -3019 -4545 -13336 -4878 443 3000 4099 -856 -1725
21486 -1725 6079 4855 9792 -2009 876 -2171 -16397 -22264 -19290 -22466 -27586 -30012 -24751 -34486
21472 -34486 -34643 -22578 -17615 -11856 721 15621 9985 -2128 -14708 -11527 -10896 -24728 -36034
21459 -36034 -29212 -19555 779 7897 -5817 -20521 -25828 -20350 -18635 -14274 -15975 -2486 9208
21446 9208 -20993 -29321 -10935 -12532 -14681 -2762 -684 1982 2420 -3841 4721 7590 12647 -525
21432 -525 -9881 13106 20323 -2455 -11911 -13926 -18335 -14444 -19005 -12325 -7153 4260 -6173 -11570
21418 -11570 11046 14489 27945 34750 32884 21356 18018 13056 6359 -1877 -3661 4541 15633
21405 15633 29374 18368 24229 23127 3384 -7560 -21504 -16551 -10116 -2342 -6235 -11445 -11967
$$ packed form
21501I369q20m408R167Q226j0669j3594k90j526q791Q458N321K557J099m955q69
21486a725P804j224M937j1801K885l047j4226n867K974l176n120k426N261r735
21472c4486j57J2065M963N759J2577J4900n636j2113j2580L181O31j3832j1306
21459c6034O822R657K0334P118j3714j4704n307N478J715M361j701J3489J1694
21446I208l0201q328J8386j597k149J1919K078K666M38o261Q562K869N057j3172
21432e25r356K2987P217k2778r456k015m409L891m561O680N172J1413j0433n397
21418a1570K2616L443J3456O805j866j1528l338m962o697q236j784Q202J1092
21405A5633J3741j1006N861j102j9743j0944j3944M953O435P774l893n210n22
$$ plain form
21392 -11967 -9759 -17554 -17217 -21392 -22957 -18306 -23355 -31506 -12468 6908 22899 25831 4903 -3579
21378 -3579 -1343 45 -16954 -22764 -11140 -9024 -5539 -4196 -15642 -20009 -6267 423 8952 19161
21364 19161 9532 -3820 533 -3528 -2819 -8388 -22184 -19835 -8602 -12167 -25858 -31254 -24136 -14181
21350 -14181 -12730 -26886 -27147 -18331 7361 8165 -3989 -9387 -13805 -16842 -15494 -15390 -14220 -15553
21336 -15553 -26184 -20478 -17913 -28384 -35663 -27310 -8077 7173 12616 19172 26973 27347 11938
21323 11938 2735 -5111 3874 -21 -9372 315 1315 -1044 -13091 -19727 -16956 -21185 -17459 -22740
21309 -22740 -25625 -27599 -19304 -19003 -22209 -24228 -17701 -19680 -11306 -184 17082 8684 3824 8492
21295 8492 14073 10040 14890 20 -4688 3209 -483 6868 19883 7389 -9628 -21934 -26687
$$ packed form
21392a1967K208p795L37m175j565M651n049q151J9038J9376J5991K932k0928q482
21378c579K236J388j6999n810J1624K116L485J343j1446m367J3742O690Q529J0209
21364A9161r629j3352M353m061P09n569j3796K349J1233l565j3691n396P118R955
21350a4181J451j4156k61Q816K5692Q04j2154n398m418l037J348J04J170j333
21336a5553j0631N706K565j0471p279Q353J9233J5250N443O556P801L74j5409
21323A1938r203p846Q985l895r351R687J000k359j2047o636K771m229L726n281
21309b2740k885j974Q295L01l206k019O527j979Q374J1122J7266q398m860M668
21295H492N581m033M850j4870m708P897l692P351J3015j2494j7017j2306m753
$$ plain form
21282 -26687 -23863 -21015 -15478 -10993 -9013 -5470 8945 12594 -694 -9829 -2993 4933 6721 11042
21268 11042 3291 1345 -2344 -16785 -22302 -26223 -16482 -6163 8269 4505 -6935 -16520 -27452
21255 -27452 -21155 -16410 -16283 -17998 -13969 -12453 -15679 -11666 -11087 -14814 -3153 -7577 -8580 -2950 4354
21240 4354 1905 -2609 4056 -9749 -15753 -12785 -1 -5222 -3550 -4181 2227 -14351 -18386 6426
21226 6426 577 2653 14218 -2054 -5894 -8683 -22495 -17853 -8957 -4856 -7328 -16241 -8715 1607
21212 1607 -3251 -5478 15835 7553 -13940 -12637 -3609 -8064 -8653 -12570 -14191 -8247 306 12840
21198 12840 5306 13722 21935 4647 5738 -1379 -14927 -15974 -24275 -18084 -17151 -32335 -25843 -15331
21184 -15331 -10883 -19346 -35846 -28768 -12171 -9909 -15237 -24466 -16521 -14021 -18337 -19207 -15247 -24992
$$ packed form
21282b6687K824K848N537M485J980L543J4415L649j3288r135O836P926J788M321
21268A1042p751j946l689j4441n517l921R741J0319J4432l764j1440r585j0932
21255b7452O297M745J27j715M029J516l226M013N79l727J1661m424j003N630P304
21240D354k449m514O665j3805o004K968J2784n221J672o31O408j6578m035K4812
21226F426n849K076J1565j6272l840k789j3812M642Q896M101k472q913P526J0322
21212A607m858k227K1313q282k1493J303R028m455n89l917j621N944Q553J2534
21198A2840p534Q416Q213j7288J091p117j3548j047q301O191R33j5184O492J0512
21184a5331M448q463j6500P078J6597K262n328r229P945K500m316q70L960r745
$$ plain form
21170 -24992 -13572 -3340 -15852 -15220 2308 24729 29799 24078 4208 668 -79 4679 -4690
21157 -4690 4289 -1440 -11639 -11102 -9183 -18375 -18655 -9358 -15033 -2093 -2475 6559 5176 7958 10870
21142 10870 1417 -9801 -24916 -18703 -9505 -14099 -6804 -9533 -14182 961 3391 -382 -7206 -15636
21128 -15636 -24575 -23340 -28232 -23149 -9946 -13221 -10375 -4274 -7308 -1488 -11151 -19324 -23150 -7890
21114 -7890 12556 20425 18325 11359 10100 6189 -736 -296 6859 -11084 -22160 -10820 -9509 -11159
21100 -11159 2436 6904 513 -5062 -14197 -31489 -23441 621 -9226 -17839 4034 11749 6463
21087 6463 2075 8454 2475 13006 2480 -14539 1961 259 -7169 -2663 5344 15608 -3038
21074 -3038 -17278 -22852 -31288 -23897 -15958 -7039 -13216 -10869 -3864 -2452 3366 10150 1227 2604
$$ packed form
21170b4992J1420J0232j2512O32J7528K2421N070n721j9870l540p47M758r369
21157d690Q979n729j0199N37J919r192k80R297n675J2940l82R034j383K782K912
21142A0870r453j1218j5115O213R198m594P295k729m649J5143K430l773o824q430
21128a5636q939J235m892N083J3203l275K846O101l034N820r663q173l826J5260
21114g890K0446P869k100o966j259l911o925M40P155j7943j1076J1340J311j650
21100a1159J3595M468o391n575r135j7292Q048K4062r847q613K1873P715n286
21087F463m388O379n979J0531j0526j7019J6500j702p428M506Q007J0264j8646
21074c038j4240n574q436P391P939Q919o177K347P005J412N818O784q923J377
$$ plain form
21060 2604 9570 2518 -5886 -17156 -18568 -17151 -14504 -3466 7130 11915 2192 -6975 -16538 -16999
21046 -16999 -8525 1964 2004 2386 573 -12234 -23234 -22238 1050 -15251 -26620 -22866 -21773 -17414
21032 -17414 72 5619 239 2900 1086 -12040 -7143 217 -7871 -20956 -22775 -26333 -31723 -29383
21018 -29383 -8951 2252 -8294 -835 -6632 -6219 -12223 -18902 -16718 -16191 -19025 -25276 -17097 -6197
21004 -6197 258 -1070 -6535 -6244 6422 28 -4195 -5206 -6147 -2896 6248 4191 1828 -4048 -15393
20989 -15393 -26643 -24657 -17541 -7807 1924 -3324 -10914 -26059 -21120 -2346 -2392 -22271 -26266 -23176
20975 -23176 -21660 -14092 -9778 -20469 -19269 -5164 -2552 -8779 -18962 -21867 -31617 -35690 -37701 -33535
20961 -33535 -20155 -7006 12949 22010 10125 4188 5086 -2044 -13952 -33534 -36995 -31179 -14182
$$ packed form
21060B604O966p052q404j1270j412J417K647J1038J0596M785r723r167r563m61
21046a6999Q474J0489M0L82j813j2807j1000R96K3288j6301j1369L754J093M359
21032a7414J7486N547n380K661j814j3126M897P360q088j3085j819l558n390K340
21018b9383K0432J1203j0546P459n797M13o004o679K184N27k834o251Q179J0900
21004f197O455j328n465K91J2666o394m223j011r41L251R144k057k363n876j1345
20989a5393j1250J986P116R734R731n248p590j5145M939J8774m6j9879l995L090
20975b3176J516P568M314j0691J200J4105K612o227j0183k905r750m073k011M166
20961c3535J3380J3149J9955R061j1885n937Q98p130j1908j9582l461N816J6997
$$ plain form
20948 -14182 -6286 -5560 -5045 -624 9562 14388 7251 10639 14997 12529 3182 -13023 -20669 -24539
20934 -24539 -20188 -17490 -25964 -32740 -29978 -20244 -12174 -1115 568 -19732 -25735 -37142 -43435 -34453
20920 -34453 -31374 -21696 -15355 -26863 -24256 -10515 -6849 -4096 -11984 -18793 -8008 -4624 10162
20907 10162 19333 4917 -4691 9281 2749 -7170 -3352 807 5242 3749 1524 4228 8424 7303
20893 7303 2004 -17782 -35109 -25378 -8419 2270 2926 8360 13364 17382 7978 515 148 -583
20879 -583 6728 5609 17917 16538 12717 15600 17760 22441 19577 15924 24259 10489 7919 13224
20865 13224 26702 39434 21169 13057 9228 -4622 -16555 -13358 -9765 -23252 -27584 -22347 -35032
20852 -35032 -33756 -30635 -29337 -10926 -8417 -1661 9416 -9754 -23480 -13088 -15036 -11349 -12217
$$ packed form
20948a4182P896P26N15M421J0186M826p137L388M358k468r347j6205p646l870
20934b4539M351K698q474o776K762R734Q070J1059J683k0300o003j1407o293Q982
20920c4453L079R678O341j1508K607J3741L666K753p888o809J0785L384J4786
20907A0162R171j4416r608J3972o532r919L818M159M435j493k225K704M196j121
20893G303n299j9786j7327R731J6959J0689O56N434N004M018r404p463l67p31
20879e83P311j119J2308j379l821K883K160M681k864l653Q335j3770k570N305
20865A3224J3478J2732j8265q112l829j3850j1933L197L593j3487m332N237j2685
20852c5032J276L121J298J8411K509O756J1077j9170j3726J0392j948L687q68
$$ plain form
20839 -12217 -5603 -8224 -14507 -4083 -8056 -18194 -26656 -20762 -9070 -4767 -2306 -12040 -17056 -12519
20825 -12519 -10062 -624 16183 26851 7260 3467 10570 14699 10001 1319 -2368 -2826 -1763 -1272
20811 -1272 -6240 -12716 -23443 -8210 1688 -2993 -3351 -292 2372 8872 9864 1984 -8050 -15957
20797 -15957 -14992 -13434 -5640 -5168 -7756 -7260 -7752 -5987 -10556 -18717 -22492 -20931 -10350 -185 779
20782 779 3423 9196 8673 3236 -1260 -1834 3079 -10380 772 6868 1060 -12117 -8457 -4195 10009
20767 10009 21862 13255 7045 10586 10949 -2664 -9944 -4642 -7691 -12396 -470 2652 -8368 -11824
20753 -11824 -13985 -14044 -17622 -17080 -4774 -2357 -4522 -17942 -35808 -37103 -22566 -9976 -1247 -5046
20739 -5046 -2299 -5248 -9741 6067 9793 -660 -823 -11544 -8899 -3703 8807 9420 10294 5810
$$ packed form
20839a2217O614k621o283J0424l973j0138q462N894J1692M303K461r734n016M537
20825a2519K457R438J6807J0668j9591l793P103M129m698q682l687m58J063M91
20811a272m968o476j0727J5233R898m681l58L059K664O500R92p880j0034p907
20797a5957R65J558P794M72k588M96m92J765m569q161l775J561J0581J0165R64
20782G79K644N773n23n437m496n74M913j3459J1152O096n808j3177L660M262J4204
20767A0009J1853q607o210L541L63j3613p280N302l049m705J1926L122j1020l456
20753a1824k161n9l578N42J2306K417k165j3420j7866j295J4537J2590Q729l799
20739e046K747k949m493J5808L726j0453j63j0721K645N196J2510O13Q74m484
$$ plain form
20725 5810 6128 9789 -9056 -8440 -7772 -11698 -15258 -14077 -7692 2591 -13236 -8378 -3789 -1447 -18558
20710 -18558 -23891 -13740 -1484 5049 1047 -2240 -17008 -10986 2698 -5578 -15516 -5185 617
20697 617 -677 2521 14585 -1469 -609 -11608 -7440 -3596 -5543 -10529 -2536 3566 10623 1671
20683 1671 5637 22318 18098 13828 15467 26679 30806 35129 33796 20222 10090 8775 8192 3514
20669 3514 -2875 -18103 -19668 -13468 -2645 -3933 -10682 -6999 -3356 -14664 -10329 -11701 -5006 -2885
20655 -2885 -1397 -4880 1723 7960 13685 6999 -8886 1039 -221 -860 -10631 -4241 -4063 -5055 -3210
20640 -3210 9451 14502 -54 -4827 -14952 -25506 -22556 -15210 -11888 -11081 -5042 1106 -3179 -6161
20626 -6161 4132 -5963 -11522 -8807 -10620 -18391 -1958 30105 16165 -3972 -6099 -9425 -9934
$$ packed form
20725E810L18L661j8845O16O68l926l560J181O385J0283j5827M858M589K342j7111
20710a8558n333J0151J2256O533m002l287j4768O022J3684q276r938J0331N802
20697F17j294L198J2064j6054Q60j0999M168L844j947m986P993O102P057q952
20683A671L966J6681m220m270J639J1212M127M323j333j3574j0132j315n83m678
20669C514o389j5228j565O200J0823j288o749L683L643j1308M335j372O695K121
20655b885J488l483O603O237N725o686j5885R925j260o39r771O390J78r92J845
20640c210J2661N051j4556m773j0125j0554K950P346L322Q07O039O148m285k982
20626f161J0293j0095n559K715j813p771J6433L2063j3940k0137k127l326n09
$$ plain form
20613 -9934 -18298 -16694 -16029 -9496 -3252 4983 -8785 -25427 -29415 -20228 -19324 -25646 -36998 -19071
20599 -19071 -10027 -7505 -8885 -16396 -9966 11618 13908 8628 5217 12087 14203 10186 -2247 -879
20585 -879 6268 1679 -4925 -8903 -10238 860 1150 2375 -2108 1078 -8512 -7516 7515 11919 10998
20570 10998 -3501 -5902 -4812 -12681 284 -3320 -1517 9617 6791 3219 8062 -16008 -16272 4251
20556 4251 -1894 -4886 -8756 -24084 -13905 -2625 10513 -548 -6164 -4107 -7433 -14304 -7019
20543 -7019 2548 -2432 -14725 -14305 -322 5666 6319 847 -4863 -21270 -10164 3621 -6491 -17221
20529 -17221 -23467 -29175 -10480 -10090 -18164 -6234 -6473 -11362 -12175 -4626 2526 3913 -11026 -28695
20515 -28695 -16237 9668 21571 25176 17266 21105 21998 19846 16002 7624 5281 -1055 -10626 -12613
$$ packed form
20613i934q364J604O65O533O244Q235j3768j6642l988R187R04o322j1352J7927
20599a9071R044K522j380p511O430K1584K290n280l411O870K116m017j2433J368
20585h79P147m589o604l978j335J1098K90J225m483L186r590R96J5031M404r21
20570A0998j4499k401J090p869J2965l604J803J1134k826l572M843k4070k64K0523
20556D251o145k992l870j5328J0179J1280J3138j1061n616K057l326o871P285
20543g019R567m980j2293M20J3983N988O53n472n710j6407J1106J3785j0112j0730
20529a7221o246n708J8695L90q074J1930k39m889q13P549P152J387j4939j7669
20515b8695J2458K5905J1903L605p910L839Q93k152l844q378k343o336r571j987
$$ plain form
20501 -12613 1872 -900 -2370 6693 14323 11196 14251 15121 20965 9564 -7447 -6501 2558 10056
20487 10056 10942 470 5398 6671 19278 21136 3823 -20296 -23292 3072 17911 20415 5784
20474 5784 -18582 -19972 -13222 6546 8669 7885 8562 15065 20255 6779 10172 11485 2124 4100
20460 4100 2168 3795 6800 9197 13878 25310 16783 18682 32833 29227 26253 16481 11238 1504
20446 1504 -5016 -914 6313 22622 14812 1828 5705 4127 6471 15933 6151 4734 11954 21730
20432 21730 7999 -5511 -11575 -15357 -12691 -2414 20387 24344 18331 25244 24018 10458 -3913
20419 -3913 -851 -8647 -15785 -8290 5072 8100 3531 9606 9125 14504 6979 15318 18446 12701 13745
20404 13745 2457 -411 -3685 -10886 -12408 -8493 10889 38253 24571 16958 14342 7183 11488
$$ packed form
20501a2613J4485k772j470R063P630l127L055Q70N844j1401j7011R46R059P498
20487A0056Q86j0472M928J273J2607J858j7313k4119k996K6364J4839K504j4631
20474E784k4366j390O750J9768K123p84O77O503N190j3476L393J313r361J976
20460D100j932J627L005K397M681J1432q527J899J4151l606k974r772n243r734
20446A504o520M102P227J6309p810j2984L877j578K344R462r782j417P220R776
20432B1730j3731j3510o064l782K666J0277K2801L957o013O913j226j3560j4371
20419c913L062p796p138P495J3362L028m569O075m81N379p525Q339L128n745J044
20404A3745j1288k868l274p201j522L915J9382K7364j3682p613k616p159M305
$$ plain form
20391 11488 -8905 -29221 -34775 -3004 4625 -1883 -4108 -4838 1529 10124 -1318 9881 15008
20378 15008 8312 -4479 -5323 1425 2048 538 -1908 -716 6781 1660 -1611 2067 7949 2017 -8235
20363 -8235 7370 15831 -7916 -24574 -12784 -1760 -5545 -19393 -25490 -24435 -33551 -36027 -19849
20350 -19849 1232 2852 1417 -10470 -21666 -13316 -14127 -14550 -8957 3379 2860 8120 -7554 -13027
20336 -13027 -7546 -8216 -4341 1566 -4463 -16678 -14682 4213 11863 10285 273 -24635 -30449 -36608
20322 -36608 -24947 -16978 -13519 -17684 -19849 -18607 -15950 -3370 -1223 16541 36808 17827 898
20309 898 3093 -19175 -27555 -4918 13345 10711 2408 -2982 -12834 -7490 9485 17437 15579 10133
20295 10133 22818 18176 2814 -6655 -762 11084 17886 29241 27682 13014 15100 4756 118
$$ packed form
20391A1488k0393k0316n554L1771P629o508k225p30O367Q595j1442J1199N127
20378A5008o696j2791q44O748O23j510k446J192P497n121l271L678N882n932j0252
20363h235J5605Q461k3747j6658J1790J1024l785j3848o097J055r116k476J6178
20350a9849K1081J620j435j1887j1196Q350q11m23N593J2336n19N260j5674n473
20336a3027N481o70L875N907o029j2215J996J8895P650j578j0012k4908n814o159
20322c6608J1661P969L459m165k165J242K657J2580K147J7764K0267j8981j6929
20309H98K195k2268q380K2637J8263k634q303n390r852N344J6975P952j858n446
20295A0133J2685m642j5362r469N893J1846O802J1355j559j4668K086j0344m638
$$ plain form
20282 118 3252 18501 20486 14087 1763 -454 6649 7095 11373 10321 4578 9820 7830 6474 9368
20267 9368 8455 -1667 2266 14067 14193 -4528 -5065 1198 6658 11062 566 2837 10761 9798 30241
20252 30241 37905 28049 28024 28724 18290 5996 -659 -13036 -12741 -16140 -10411 1551 -2204 -7864
20238 -7864 -6363 -6527 -6273 -5604 1667 1227 -1366 7409 15357 515 -346 7447 10346 5694 11889 22322
20222 22322 16284 5746 1492 12142 17532 26248 27465 17423 -626 -2335 -7614 -599 -521 8369
20208 8369 13436 5606 -737 2545 8513 2438 -3495 6798 8904 2796 5234 9892 19424 20608
20194 20608 16459 9300 16423 28081 19012 2404 -4860 -8760 -10228 -10804 -14231 -10565 -12009 -12310
20180 -12310 -13202 -10411 -7853 624 784 3341 10271 19111 13631 -3538 -19073 -12151 8107 15112
$$ packed form
20282A18L134J5249J985o399j2324k217P103M46M278j052n743N242j990j356K894
20267I368r13j0122L933J1801J26j8721n37O263N460M404j0496K271P924r63K0443
20252C0241P664r856k5P00j0434j2294o655j2377K95l399N729J1962l755n660
20238g864J501j64K54O69P271m40k593Q775P948j4842q61P793K899m652O195J0433
20222B2322o038j0538m254J0650N390Q716J217j0042j8049j709n279P015P8Q890
20208H369N067p830o343L282N968o075n933J0293K106o108K438M658R532J184
20194B0608m149p159P123J1658r069j6608p264l900j468n76l427L666j444l01
20180a2310q92K791K558Q477J60K557O930Q840n480j7169j5535O922K0258P005
$$ plain form
20166 15112 21739 14450 1179 -9690 -6268 -1565 3008 6848 12871 -233 -7667 -20829 -19720
20153 -19720 -12013 -4784 4394 13222 24379 15549 -3803 -15862 -9105 4447 1882 3664 5909
20140 5909 -1495 -8436 1887 3936 13898 13177 788 12599 22780 23768 27384 35484 21935 7289
20126 7289 6731 12560 20142 18079 18892 8697 -5042 -6444 -12192 -6374 3509 -1803 -2196 -5965 -2968
20111 -2968 -3261 -7314 -6015 5341 4658 -8436 -16505 -12349 -2385 15384 21385 24416 27851 38801
20097 38801 40684 20395 2198 -5418 12822 10104 3075 2088 637 19463 27794 32575 27501 15456
20083 15456 9292 18126 20625 27042 12092 10565 255 -6108 -4925 1090 3267 18286 32810
20070 32810 35595 26764 10850 8019 10775 3199 -9072 -8136 7979 12536 17594 21644 19860 19159
$$ packed form
20166A5112O627p289j3271j0869L422M703M573L840O023j3104p434j3162J109
20153a9720P707P229R178Q828J1157q830j9352j2059O757J3552k565J782K245
20140E909p404o941J0323K049R962p21j2389J1811J0181R88L616Q100j3549j4646
20126G289n58N829P582k063Q13j0195j3739j402n748N818R883n312l93l769K997
20111b968k93m053J299J1356o83j3094q069M156R964J7769O001L031L435J0950
20097C8801J883k0289j8197p616J8240k718p029r87j451J8826Q331M781n074j2045
20083A5456o164Q834K499O417j4950j527j0310o363J183O015K177J5019J4524
20070C2810K785q831j5914k831K756p576j2271R36J6115M557N058M050j784p01
$$ plain form
20056 19159 21397 22084 20745 14819 11373 6972 382 4250 16497 26051 14713 -304 3850 13272
20042 13272 14476 9973 7862 -6484 1563 6947 14246 29492 21548 1929 -4724 1209 8626 7978
20028 7978 9635 20385 26613 29717 17426 8115 3175 1529 9358 10866 11869 22425 18665 10810
20014 10810 -363 -9631 -3714 -14844 -23089 -20805 -21760 -11742 8356 8086 2691 10473 9475 1150
20000 1150 5042 2365 2452 12602 17932 17449 17478 10840 9357 23554 31100 29350 21702 13755 6659
19985 6659 4915 -3238 -2130 -1167 -11313 -17258 -2862 3455 616 6403 13790 4196 1661 -3796
19971 -3796 -6867 -9243 1586 2074 -4683 12704 21755 25994 8761 460 601 4767 2095 1885 4616
19956 4616 -4928 -6376 13739 21111 22277 18382 25463 15451 20067 9290 180 -6033 -3757 111
$$ packed form
20056A9159K238O87j339n926l446m401o590L868J2247R554j1338j5017M154R422
20042A3272J204m503k111j4346Q047N384P299J5246p944j9619o653N933P417o48
20028G978J657J0750O228L104j2291r311m940j646P829J508J003J0556l760p855
20014A0810j1173r268N917j1130q245K284r55J0018K0098k70n395P782r98q325
20000A150L892k677Q7J0150N330m83K9o638j483J4197P546j750p648p947p096
19985F659j744q153J108R63j0146n945J4396O317k839N787P387r594k535n457
19971c796l071k376J0829M88o757J7387R051M239j7233q301J41M166k672k10K731
19956D616r544j448K0115P372J166l895P081j0012M616j0777r110o213K276L868
$$ plain form
19942 111 7430 24696 23520 24605 19322 19151 21664 18225 12464 12071 2775 4424 7307 8002 9007
19927 9007 3914 23467 29654 20116 24919 31650 21100 18017 16006 16246 7830 16331 16044 9614 8020
19912 8020 12178 6103 15485 9930 12099 10824 22029 34066 37279 37567 14660 -5270 -4869 -6127
19898 -6127 -9265 -6459 2540 9629 21748 33468 38775 50703 55706 43444 42515 23097 7771
19885 7771 21493 28155 27316 14520 15322 35923 37064 18234 7917 21846 24592 15046 20277 12116
19871 12116 23197 19307 15422 11133 11920 4729 1517 -554 -11143 -6791 -324 4857 23164 26387
19857 26387 28588 14364 10814 17466 12562 756 402 10342 14086 12243 17486 30497 28536 15872
19843 15872 4953 667 -789 -11281 -16384 -1747 11842 19376 12286 11692 2385 -7927 -1583
$$ packed form
19942A11P319J7266j176J085n283j71K513l439n761l93r296J649K883O95J005
19927I007n093J9553O187r538M803O731j0550l083k011K40q416Q501k87o430j594
19912H020M158o075R382n555K169j275J1205J2037L213K88k2907j9930M01j258
19898f127l138K806Q999P089J2119J1720N307J1928N003j2262r29j9418j5326
19885G771J3722O662q39j2796Q02K0601J141j8830j0317J3929K746r546N231q161
19871A2116J1081l890l885m289P87p191l212k071j0589M352O467N181J8307L223
19857B6387K201j4224l550O652m904j1806l54R940L744j843N243J3011j961j2664
19843A5872j0919m286j456j0492n103J4637J3589P534p090n94r307j0312O344
$$ plain form
19830 -1583 8535 10474 8798 7813 -351 -5318 -604 8417 -1428 833 5488 12826 13215 12593 1378
19815 1378 6144 11825 20459 17085 7377 -411 1797 -4419 6041 14624 14079 12861 8623 16172 23679
19800 23679 12262 6665 899 -4768 8745 13838 11551 -5248 -12572 -3641 10149 -1216 5244
19787 5244 6102 572 6935 9784 18285 19664 3981 -3613 -9742 -7575 -3313 7345 19829 19202
19773 19202 12324 12 13697 21343 9708 9036 27745 28655 21142 16668 12860 8147 2762 5002
19759 5002 8155 17292 23418 29056 24673 23180 23692 24010 952 -8094 -1523 12476 22990 27813
19745 27813 27336 29871 13252 9392 13567 28487 33406 30847 34556 40094 42345 50882 52836 56356
19731 56356 51638 29310 31832 34603 36553 29899 21268 25716 32907 30819 43346 42111 63775 66247
$$ packed form
19830a583J0118J939j676r85q164m967M714R021r845K261M655P338L89o22j1215
19815A378M766N681Q634l374r708p788K208o216J0460Q583n45j218m238P549P507
19800B3679j1417n597n766n667J3513N093k287j6799p324Q931J3790j1365O460
19787E244Q58n530O363K849Q501J379j5683p594o129K167M262J0658J2484o27
19773A9202o878j2312J3685P646j1635o72J8709R10p513m474l808m713n385K240
19759E002L153R137O126N638m383j493N12L18k3058r046O571J3999J0514M823
19745B7813m77K535j6619l860M175J4920M919k559L709N538K251Q537J954L520
19731E6356m718k2328K522K771J950o654q631M448P191k088J2527j235K1664K472
$$ plain form
19717 66247 58505 44547 29591 16508 22040 25261 23268 29528 54232 64745 61690 52695 39342
19704 39342 36030 34710 23518 24348 28620 26487 43400 51261 41261 40303 45700 56623 53053 47733
19690 47733 53363 39890 42232 51234 60977 60670 71070 72957 60252 47763 28364 37596 67811
19677 67811 87115 71908 69373 68594 84325 88852 60533 47049 53406 54210 45785 41823 39232 37071
19663 37071 48280 57495 62555 63289 50449 53802 44319 38819 40492 36019 32032 30077 40059 48314
19649 48314 48885 45800 48829 53616 49444 40745 39811 57712 67321 80806 90595 84760 70581 80285
19635 80285 97872 110254 104961 94175 93263 89307 88450 90624 100568 124134 132399 141352 142538 156407
19621 156407 172453 190694 208580 205233 225433 264874 304453 344472 387684 447059 467405 463828
$$ packed form
19717F6247p742j3958j4956j3083N532L221j993O260K4704J0513l055q995j3353
19704C9342l312j320j1192Q30M272k133J6913P861j0000r58N397J0923l570n320
19690D7733N630j3473K342R002R743l07J0400J887j2705j2489j9399R232L0215
19677F7811J9304j5207k535p79J5731M527k8319j3484O357Q04q425l962k591k161
19663C7071J1209R215N060P34j2840L353r483n500J673m473l987j955R982Q255
19649D8314N71l085L029M787m172q699r34J7901R609J3485R789n835j4179R704
19635H0285J7587J2382n293j0786r12l956q57K174R944K3566Q265Q953J186J3869
19621A56407J6046J8241J7886l347K0200L9441L9579M0019M3212N9375K0346l577
$$ plain form
19609 463828 473785 539697 625175 662959 654418 632878 594374 566870 534958 486848 462549 451430
19597 451430 404362 369390 379406 424615 458486 428024 343727 248640 187003 155882 137607
19586 137607 131208 123571 116809 115303 133759 151762 159037 152600 146943 152941 167481 184591 213083
19573 213083 237680 243933 221370 223578 244196 276877 308248 346288 373704 409919 492244 604365
19561 604365 713982 740965 717256 688179 652292 631813 660917 702104 717491 680780 628582
19550 628582 599833 599671 579105 530147 465178 395888 356442 339488 310405 245663 181890 133581
19538 133581 108825 108731 107951 94233 87351 75472 84355 91815 109168 133327 132333 112228 114566 110712
19524 110712 96015 87793 101177 110189 123889 131928 131037 139626 137953 141727 137066 128308 119438 115304
$$ packed form
19609D63828R957O5912Q5478L7784q541k1540l8504k7504l1912m8110k4299j1119
19597D51430m7068l4972J0016M5209L3871l0462q4297r5087o1637l1121j8275
19586A37607o399p637o762j506J8456J8003P275o437n657N998J4540J7110K8492
19573B13083K4597O253k2563K208K0618L2681L1371L8040K7416L6215Q2325J12121
19561F04365J09617K6983k3709k9077l5887k0479K9104M1187J5387l6711n2198
19550F28582k8749j62k0566m8958o4969o9290l9446j6954k9083o4742o3773m8309
19538A33581k4756r4p80j3718o882j1879Q883P460J7353K4159r94k0105K338l854
19524A10712j4697q222J3384R012J3700Q039q91Q589j673L774m661q758q870m134
$$ plain form
19510 115304 113072 118771 124926 110263 98108 97843 76529 66625 75062 69852 76708 72156 56044
19497 56044 57033 47412 41710 20379 16916 24868 23526 18538 4843 3394 -3034 4469 -425 878
19483 878 10916 10590 -944 -541 14268 2449 9706 14751 25107 25207 32163 21704 6250 12805
19469 12805 30280 35016 34948 28207 30741 31890 19713 27967 40549 48014 48903 33622 32654 37061
19455 37061 45442 49583 36395 35264 34742 31734 31982 29024 31486 34274 30316 18172 26337 35047
19441 35047 35355 24631 19612 39901 48252 54798 65328 64745 49396 45636 52978 48664 45335 43134
19427 43134 43422 47959 42459 35376 25073 28008 40166 45539 58771 65516 59310 45401 36891 30443
19413 30443 42412 52265 61524 68744 67796 71459 58320 54259 62328 50529 43504 40512 49399 49007
$$ packed form
19510A15304k232N699O155j4663j2155k65k1314r904Q437n210O856m552j6112
19497E6044R89r621n702k1331l463P952j342m988j3695j449o428P503m894J303
19483H78J0038l26j1534M03J4809j1819P257N045J0356J00O956j0459j5454O555
19469A2805J7475M736o8o741K534J149j2177Q254J2582P465Q89j5281r68M407
19455C7061Q381M141j3188j131n22l008K48k958K462K788l958j2144Q165Q710
19441C5047L08j0724n019K0289Q351O546J0530n83j5349l760P342m314l329k201
19427D3134K88M537n500p083j0303K935J2158N373J3232O745o206j3909q510o448
19413C0443J1969R853R259P220r48L663j3139m061Q069j1799p025k992Q887l92
$$ plain form
19399 49007 56984 69171 58171 52243 50855 58619 72097 74590 73119 67618 62525 52530 59118 66959
19385 66959 66887 69922 77717 74150 66864 80335 83790 84067 75267 70228 90005 116509 120090 114034
19371 114034 111178 119357 124328 112188 102860 105969 121172 127654 131625 134990 142870 149511 146992 136435
19357 136435 131477 132950 142093 140590 148310 146911 161275 167760 155470 139120 131377 130038 121103
19344 121103 107659 93419 110719 131564 138388 132338 140460 131655 127262 124022 117845 124751 117687
19331 117687 107970 121504 122384 125256 129946 144191 150999 137372 137983 141446 134985 126622 119676 125075
19317 125075 136469 135011 114639 114577 139964 146119 150212 139240 119697 120265 136806 154305 164660
19304 164660 169827 160218 167431 167242 168184 168435 168583 162065 143863 129562 139116 152225 161118 153012
$$ packed form
19399D9007P977J2187j1000n928j388P764J3478K493j471n501n093r995O588P841
19385F6959p2L035P795l567p286J3471L455K77q800n039J9777K6504L581o056
19371A14034k856Q179M971j2140r328L109J5203O482L971L365P880O641k519j0557
19357A36435m958J473R143j503P720j399J4364O485j2290j6350p743j339q935
19344A21103j3444j4240J7300K0845O824o050Q122q805m393l240o177O906p064
19331A17687r717J3534Q80K872M690J4245O808j3627O11L463o461q363o946N399
19317A25075J1394j458k0372o2K5387O155M093j0972j9543N68J6541J7499J0355
19304A64660N167r609P213j89R42K51J48o518j8202j4301R554J3109Q893q106
$$ plain form
19290 153012 140380 131642 117992 109225 106548 108396 102952 82491 81859 82441 82855 71366 71956 79617
19276 79617 99657 104811 106983 106267 106100 92776 71621 72758 74234 81312 96125 107065 112552 117744
19262 117744 108656 99637 115481 120737 122553 106377 104421 111997 114823 118496 118560 127417 131621 138299
19248 138299 127273 117532 121265 136117 151081 159909 169909 172384 156207 175541 181965 196868
19236 196868 216656 232338 252849 264188 268108 269706 276296 273431 274882 270997 275228 292491 302922
19223 302922 303279 329716 356952 377224 378247 355754 327563 321856 311212 312863 309575 295640 289342
19210 289342 293681 310116 315390 322219 329406 342634 341534 334430 359663 392453 415582 467688 530559
19197 530559 579391 614139 657071 713418 772710 849218 965659 1037857 1011081 1019586 1105361
$$ packed form
19290A53012j2632q738j3650q767k677J848n444k0461o32N82M14j1489N90P661
19276G9617K0040N154K172p16j67j3324k1155J137J476P078J4813J0940N487N192
19262A17744r088r019J5844N256J816j6176j956P576K826L673O4Q857M204O678
19248A38299j1026r741L733J4852J4964Q828J0000K475j6177J9334O424J4903
19236A96868J9788J5682K0511J1339L920J598O590k865J451l885M231J7263J0431
19223C02922L57K6437K7236K0272J023k2493k8191n707j0644J651l288j3935o298
19210B89342M339J6435N274O829P187J3228j100p104K5233L2790K3129N2106O2871
19197E30559M8832L4748M2932N6347N9292P6508J16441P2198k6776Q505Q5775
$$ plain form
19186 1105361 1239734 1363797 1399758 1393433 1445940 1565662 1713289 1876039 2076025 2333576
19176 2333576 2639100 2997099 3454982 4088072 4787925 5068526 4961164 5163099 5857191
19167 5857191 6675363 6574988 5618109 5094359 5230402 5740235 5941882 5481602 4555401
19158 4555401 3873557 3727398 3988329 4343948 4139512 3628421 3304781 3124347 3019316
19149 3019316 2971948 3092557 3423303 3839545 3931636 3586824 3321574 3397144 3739620 4114302
19139 4114302 4016940 3563095 3304560 3302796 3472337 3743449 4118690 4622472 5228750 5705475
19129 5705475 5910455 6093096 6577822 7338181 7836577 7580016 7068356 7030669 7412158 7858189
19119 7858189 7960254 7975234 8305650 8944544 9920936 11207735 12398719 13216690 14420211
$$ packed form
19186A105361J34373J24063L5961o325N2507J19722J47627J62750J99986K57551
19176B333576L05524L57999M57883O33090O99853K80601j07362K01935O94092
19167E857191Q18172j00375r56879n23750J36043N09833K01647m60280r26201
19158D555401o81844j46159K60931L55619k04436n11091l23640j80434j05031
19149C019316m7368J20609L30746M16242R2091l44812k65250P5570L42476L74682
19139D114302r7362m53845k58535j764J69541K71112L75241N03782O06278M76725
19129E705475K04980J82641M84726P60359M98396k56561n11660l7687L81489M46031
19119G858189J02065J4980L30416O38894R76392J286799J190984Q17971J203521
$$ plain form
19110 14420211 16463045 19188747 21648275 23414770 25658135 28849626 32981264 37273936
19102 37273936 40749162 44236591 49229831 56236137 64574518 74051030 87323120 106848312
19094 106848312 131752358 141636599 120267279 99955758 93859181 91349233 81558655
19087 81558655 72442512 69891699 72680336 81679547 93839175 93454247 78893026 62044179
19079 62044179 44628756 31589347 24298546 20451595 18388212 17394892 16898567 16298191
19071 16298191 15624737 15279064 15356637 15482699 15329954 15006109 14855346 15188890 16034224
19062 16034224 17371170 19254490 21814071 24925681 28384123 32215867 36160304 39898387
19054 39898387 43513473 47421775 52629995 59995324 69813713 83259665 101954417 123430154
$$ packed form
19110A4420211K042834K725702K459528J766495K243365L191491M131638M292672
19102C7273936L475226L487429M993240P006306Q338381R476512J3272090J9525192
19094A06848312K4904046R884241k1369320k0311521o096577k509948r790578
19087H1558655r116143k550813K788637Q999211J2159628l84928j4561221j6848847
19079F2044179j7415423j3039409p290801l846951k063383r93320m96325o00376
19071A6298191o73454l45673P7573J26062j52745l23845j50763L33544Q45334
19062A6034224J336946J883320K559581L111610L458442L831744L944437L738083
19054C9898387L615086L908302N208220P365329R818389J3445952J8694752K1475737
$$ plain form
19046 123430154 135113261 131468173 117389192 101142204 94214131 96765228 104304489
19039 104304489 109921388 112979883 120364868 134364629 136226371 121502955 97219900
19032 97219900 68187252 47832467 37427583 31675798 26151419 20868034 17410551 15488525
19024 15488525 14622671 14377671 14262870 13962457 13153882 12187081 11421183 11190485 11517146
19015 11517146 11940768 11859857 11251381 10550820 10066303 9772861 9189341 8035791 6641781
19006 6641781 5465409 4551089 3822959 3314480 2988455 2779416 2661943 2591423 2540995 2549897
18996 2549897 2594487 2619289 2639220 2631420 2585126 2531978 2434060 2310731 2207945 2132197 2117073
18985 2117073 2161767 2214757 2218333 2188871 2206279 2268133 2438658 2658258 2798514 2831210 2748174
$$ packed form
19046A23430154J1683107l645088j4078981j6246988o928073K551097P539261
19039A04304489N616899L058495P384985J3999761J861742j4723416k4283055
19032I7219900k9032648k0354785j0404884n751785n524379n283385l457483j922026
19024A5488525q65854k45000j14801l00413q08575r66801p65898k30698L26661
19015A1517146M23622q0911o08476p00561m84517k93442n83520j153550j394010
19006F641781j176372r14320p28130n08479l26025k09039j17473p0520n0428Q902
18996B549897M4590K4802J9931p800m6294n3148r7918j23329j02786p5748j5124
18985B117073M4694N2990L576k9462J7408O1854J70525K19600J40256L2696q3036
$$ plain form
18974 2748174 2458956 2107860 1943413 1929485 1886861 1720199 1563323 1491378 1471515 1386352
18964 1386352 1227386 1091515 1017567 973971 915624 819347 744736 694074 651920 634194 640833
18953 640833 656297 664365 679549 683692 688727 703253 704308 719649 749404 783848 803414 845188
18941 845188 876200 874124 839977 807850 778989 779684 809509 852461 860601 848075 867665 892005
18929 892005 879180 834382 818865 819875 801445 798228 797395 784582 746743 728498 723188 704668
18917 704668 641537 581333 546756 511280 491635 487791 466541 448715 437413 438366 456331 492247
18905 492247 521059 539974 560323 582302 589631 601531 633742 666715 712974 756106 834343 939464
18893 939464 1016686 1037573 1089169 1190390 1277390 1250280 1166734 1160875 1220970 1247502 1195636
$$ packed form
18974B748174k89218l51096j64447j3928m2624j66662j56876p1945j9863q5163
18964A386352j58966j35871p3948m3596n8347r6277p4611n0662m2154j7726O639
18953F40833J5464Q068J5184M143N035J4526J055J5341K9755L4444J9566M1774
18941H45188L1012k076l4147l2127k8861O95K9825M2952Q140j2526J9590K4340
18929H92005j2825m4798j5517J010j8430l217q33j2813l7839j8245n310j8520
18917G04668o3131o0204l4577l5476j9645l844k1250j7826j1302R53J7965L5916
18905D92247K8812J8915K0349K1979P329J1900L2211L2973M6259M3132P8237J05121
18893I39464P7222K0887N1596J01221Q7000k7110q3546n859O0095K6532n1866
$$ plain form
18882 1195636 1131103 1079793 1067304 1050433 1028013 993850 999508 1031266 983183 880355 810576
18871 810576 796929 784703 765708 782625 833061 890060 992922 1125290 1204417 1163816 1134259
18860 1134259 1167049 1219612 1283266 1285293 1205599 1102390 1058807 1027139 979118 948501 964527
18849 964527 1021637 1117501 1192329 1227125 1284817 1306569 1221396 1101237 1052258 1072352 1125786
18838 1125786 1210042 1320848 1501222 1685829 1737375 1709833 1736121 1863019 1913760 1764463
18828 1764463 1618458 1534996 1490006 1451017 1330423 1204998 1061852 930755 875000 859819
18818 859819 876672 910877 984108 1080468 1191537 1285894 1360001 1351421 1219442 1063813 992200
18807 992200 1001940 1089314 1207350 1309919 1336107 1329684 1341034 1340530 1279140 1100972 909502
$$ packed form
18882A195636o4533n1310j2489j6871k2420l4163N658L1758m8083j02828o9779
18871H10576j3647j2226j8995J6917N0436N6999J02862J32368P9127m0601k9557
18860A134259L2790N2563O3654K027p9694j03209m3583l1668m8021l0617J6026
18849I64527N7110R5864P4828L4796N7692K1752q5173j20159m8979K0094N3434
18838A125786Q4256J10806J80374J84607N1546k7542K6288J26898N0741j49297
18828A764463j46005q3462m4990l8989j20594j25425j43146j31097n5755j5181
18818H59819J6853L4205P3231R6360J11069R4357P4107q580j31979j55629p1613
18807I92200R740Q7374J18036J02569K6188o423J1350n04o1390j78168j91470
$$ plain form
18796 909502 783605 715142 663917 600233 551887 534897 524344 541168 559494 562290 572533
18785 572533 627227 687646 748180 798829 871944 939955 944278 935061 870522 785914 765310 774439
18773 774439 822495 902884 989752 1012941 990927 933307 904551 887812 833744 758131 619295
18762 619295 472864 388050 362453 342698 317709 293999 279012 289355 299469 306875 298128 306747
18750 306747 343279 368604 367458 356799 341343 322477 306172 290738 294501 287684 268798 246631
18738 246631 239416 240864 239846 248949 265283 262536 261380 258135 257059 244261 235593 234817 227368 220873
18724 220873 225738 207037 192846 179991 166609 162990 169060 172871 175877 187824 184733 173536 160007
18711 160007 160922 170982 177073 163294 175183 193051 218350 217241 205697 195151 202386 214105
$$ packed form
18796I09502j25897o8463n1225o3684m8346j6990j0553J6824J8326K796J0243
18785E72533N4694O0419O0534N0649P3115O8011M323r217o4539q4608k0604R129
18773G74439M8056Q0389Q6868K3189k2014n7620k8756j6739n4068p5613j38836
18762F19295j46431q4814k5597j9755k4989k3710j4987J0343J0114P406q747Q619
18750C06747L6532K5325j146j0659j5456j8866j6305j5434L763o817j8886k2167
18738B46631p215J448j018R103J6334k747j156l245j076j2798q668p76p449o495
18724B20873M865j8701j4191j2855j3382l619O070L811L006J1947l091j1197j3529
18711A60007R15J0060O091j3779J1889J7868K5299j109j1544j0546P235J1719
$$ plain form
18699 214105 213092 214280 223464 234154 238841 245621 260915 260795 250263 261942 281201 291724 293207
18686 293207 281947 281197 274123 285000 284114 278486 276684 292211 312672 319101 295355 287233 274853
18673 274853 260194 267771 260363 260484 262809 276866 270385 266185 254430 249912 248082 255851 243557
18660 243557 245823 254455 258634 266025 265840 257841 258356 269966 281326 289995 305938 302900 299889 288226
18646 288226 259143 238332 243163 237899 233423 247507 244337 225698 222778 219852 225463 219277 209137
18633 209137 192213 189942 199840 210702 229744 247416 255915 282017 279250 284780 283958 291973 304907
18620 304907 322454 337699 355724 357886 357621 358531 350251 352706 364981 370573 356262 346576 339095
18607 339095 341351 340325 339558 337548 331784 312099 301743 316531 331553 334306 338752 344642 356212
$$ packed form
18699B14105j013J188R184J0690M687O780J5294j20j0532J1679J9259J0523J483
18686B93207j1260p50p074J0877q86n628j802J5527K0461O429k3746q122j2380
18673B74853j4659P577p408J21K325J4057o481m200j1755m518j830P769j2294
18660B43557K266Q632M179P391j85p999N15J1610J1360Q669J5943l038l011j1663
18646B88226k9083k0811M831n264m476J4084l170j8639k920k926N611o186j0140
18633B09137j6924k271R898J0862J9042J7672Q499K6102k767N530q22Q015J2934
18620C04907J7547J5245J8025K162k65R10q280K455J2275N592j4311r686p481
18607C39095K256j026p67k010n764j9685j0356J4788J5022K753M446N890J1570
$$ plain form
18594 356212 380874 403189 422293 431348 418733 424811 447731 473976 496450 524905 552580 586158
18582 586158 612927 659562 700864 708070 688688 694156 715815 736896 755207 766335 800583 831103
18570 831103 859706 846713 804719 767607 739256 735887 763753 811103 865457 892639 899765 937169
18558 937169 963379 995341 1029157 1059674 1122358 1226280 1355916 1494131 1621677 1709176 1753442
18547 1753442 1789707 1847308 1946801 2115073 2335285 2567130 2823574 3124840 3540235 4096542
18537 4096542 4765516 5482101 6281775 7168078 7996695 8769788 9760989 11124973 12951396
18528 12951396 15269350 18344519 22821184 28505826 30797262 25854061 21140426 19381058
18520 19381058 19041125 18526511 18859237 21287641 25305764 27004271 20857823 13468403
$$ packed form
18594C56212K4662K2315J9104R055j2615O078K2920K6245K2474K8455K7675L3578
18582E86158K6769M6635M1302P206j9382N468K1659K1081J8311J1128L4248L0520
18570H31103K8603j2993m1994l7112k8351l369K7866M7350N4354K7182P126L7404
18558I37169K6210L1962L3816L0517O2684J03922J29636J38215J27546Q7499M4266
18547A753442L6265N7601R9493J68272K20212K31845K56444L01266M15395N56307
18537D096542O68974P16585P99674Q86303Q28617P73093R91201J363984J826423
18528A2951396K317954L075169M476665N684642K291436m943201m713635j759368
18520A9381058l39933n14614L32726K428404M018123J698507o146448p389420
$$ plain form
18512 13468403 9207028 7012763 5880808 5269440 4899649 4715279 4676872 4701602 4723508
18503 4723508 4808765 4946722 5097102 5255819 5447502 5676518 6009133 6503693 7194590 8175626
18493 8175626 9549195 11227675 12999560 14877326 16965081 19251086 21589570 23989461
18485 23989461 26558478 29831820 34481112 40947830 50092742 62791390 74851332 71952130
18477 71952130 58625039 49876933 46655112 48155671 53121918 53393453 43467572 34145798
18469 34145798 30420652 31138176 34838116 37422577 31919705 22493681 15888551 12249923
18461 12249923 10228756 8985188 8178149 7647162 7399771 7440898 7687105 7864789 7859229
18452 7859229 7981693 8434236 9172736 10105993 11231932 12567579 14016570 15471588 17002991
$$ packed form
18512A3468403m261375k194265j131955o11368l69791j84370l8407K4730K1906
18503D723508Q5257J37957J50380J58717J91683K29016L32615M94560O90897R81036
18493H175626J373569J678480J771885J877766K087755K286005K338484K399891
18485B3989461K569017L273342M649292O466718R144912J2698648J2059942k899202
18477G1952130j3327091q748106l221821J500559M966247K71535r925881r321774
18469C4145798l725146P17524L699940K584461n502872r426024o605130l638628
18461A2249923k021167j243568q07039n30987k47391M1127K46207J77684n560
18452G859229J22464M52543P38500R33257J125939J335647J448991J455018J531403
$$ plain form
18443 17002991 18782682 20994177 23802424 27417315 32114450 38181311 44656460 48468790
18435 48468790 49035735 49895490 51983009 56369719 64426991 73277648 75126575 69715615
18427 69715615 66399660 68008859 73639162 83344849 97878671 117367596 136788213 143315941
18419 143315941 139738721 139870924 146655314 152592435 159248638 179973830 217167690 249984477
18411 249984477 256886011 260089705 253562054 196776227 130458609 91832624 72151418
18404 72151418 61296561 53936912 48434332 43844611 38759049 32226666 25507432 20275310
18396 20275310 17005922 14940651 13541154 12609939 12019598 11700945 11604548 11695574 11925303
18387 11925303 12243533 12720544 13444477 14226355 15022317 16027921 17311197 18914867 20936617
$$ packed form
18443A7002991J779691K211495K808247L614891M697135O066861O475149L812330
18435D8468790N66945Q59755K087519M386710Q057272Q850657J848927n410960
18427F9715615l315955J609199N630303R705687J4533822J9488925J9420617O527728
18419A43315941l577220J32203O784390N937121O656203K0725192L7193860L2816787
18411B49984477O901534L203694o527651n6785827o6317618l8625985j9681206
18404G2151418j0854857p359649n502580m589721n085562o532383o719234n232122
18396B0275310l269388k065271j399497r31215n90341l18653r6397R1026K29729
18387A1925303L18230M77011P23933P81878P95962J005604J283276J603670K021750
$$ plain form
18378 20936617 23600334 27141423 31955987 38288865 44358717 47071300 48211615 49300203
18370 49300203 49259420 49756958 50925314 49377032 47928327 47427380 45182949 44940107 48762738
18361 48762738 53605601 54069063 48057210 42520501 36631722 26950766 19004148 14138068
18353 14138068 11013295 8989571 7732283 6912191 6327662 5919784 5679085 5607689 5630739
18344 5630739 5646867 5724861 5904916 6211616 6527643 6794861 7173104 7744369 8428172 9159008
18334 9159008 9939630 10798349 11911622 13453765 15591223 18593385 22519152 26251950
18326 26251950 28023276 27469786 25538208 25158338 25254454 23273174 21605523 21681576 23003331
18317 23003331 26114701 30649991 32724972 30049509 26794363 23459996 18456509 13400320
$$ packed form
18378B0936617K663717L541089M814564O332878O069852K712583J140315J088588
18370D9300203m0783M97538J168356j548282j448705n00947k244431k42842L822631
18361D8762738M842863M63462o011853n536709n888779r680956p946618m866080
18353A4138068l124773k023724j257288q20092n84529m07878k40699p1396K3050
18344E630739J6128P7994J80055L06700L16027K67218L78243N71265O83803P30836
18334I159008P80622Q58719J113273J542143K137458L002162L925767L732798
18326B6251950J771326n53490j931578l79870R6116j981280j667651P6053J321755
18317B3003331L111370M535290K074981k675463l255146l334367n003487n056189
$$ plain form
18309 13400320 9878234 7820349 6693150 6139779 5937501 5967953 6157985 6451856 6821673
18300 6821673 7270421 7760157 8288460 8949275 9922947 11339366 13427014 16441692 20221944
18291 20221944 22794421 22280764 19283979 15817460 14479648 15134259 16895561 17814853
18283 17814853 17238111 15806591 14912825 15526241 16035505 15060927 12893675 10344023 8795040
18274 8795040 8274968 8443668 9181564 10585828 12669348 14415773 14090544 12512423 10983898
18265 10983898 9992604 9191573 8025944 7102422 6751898 6835678 7256605 7961039 9020774
18256 9020774 10400981 11553279 11998787 12418030 12433039 12120969 12213622 11843813 11050866
18247 11050866 10070545 9906805 10201394 9665229 8323754 6479188 4942117 4129247 3642827
$$ packed form
18309A3400320l522086k057885j127199n53371k02278L0452J90032K93871L69817
18300F821673M48748M89736N28303O60815R73672J416419K087648L014678L780252
18291B0221944K572477n13657k996785l466519j337812O54611J761302R19292
18283A7814853n76742j431520q93766O13416N09264r74578k167252k549652j548983
18274H795040n20072J68700P37896J404264K083520J746425l25229j578121j528525
18265A0983898r91294q01031j165629r23522l50524Q3780M20927P04434J059735
18256I020774J380207J152298M45508M19243J5009l12070R2653l69809p92947
18247A1050866r80321j63740K94589n36165j341475j844566j537071q12870m86420
$$ plain form
18238 3642827 3271460 3021039 2883490 2868121 2964124 3157414 3454195 3870679 4362682 4700050
18228 4700050 4785338 4677394 4725924 5002102 5163453 5313911 5275117 4819866 4323257 3964913
18218 3964913 3391709 2631733 2077219 1770633 1647175 1609934 1652738 1756325 1841060 1832127
18208 1832127 1789327 1664970 1460477 1348555 1339861 1404686 1505566 1584455 1558868 1453140
18198 1453140 1360542 1351123 1430269 1573187 1593520 1366550 1166666 1077952 1093408 1185608 1315183
18187 1315183 1329948 1082399 821902 662310 571324 500032 460262 430335 420989 416520 414876
18176 414876 419935 414700 423441 420748 411109 407260 401243 396184 385185 375721 376299 371021 366036 365448
18162 365448 369082 358915 366172 374336 398816 446419 488534 494679 437230 376155 334175 317980
$$ packed form
18238C642827l71367k50421j37549j5369R6003J93290K96781M16484M92003L37368
18228D700050Q5288j07944M8530K76178J61351J50458l8794m55251m96609l58344
18218C964913n73204p59976n54514l06586j23458l7241M2804J03587Q4735q933
18208A832127m2800j24357k04493j11922q694O4825J00880P8889k5587j05728
18198A453140r2598r419P9146J42918K0333k26970j99884q8714J5456R2200J29575
18187A315183J4765k47549k60497j59592r0986p1292l9770k9927r346m469j644
18176D14876N059n235Q741k693r639l849o017n059j0999r464N78n278m985n88
18162C65448L634j0167P257Q164K4480M7603M2115O145n7449o1075m1980j6195
$$ plain form
18150 317980 313277 329039 329946 343207 329351 304542 310293 331403 346460 337505 324319 321231 328199
18137 328199 343905 360404 370216 377263 398239 415705 441004 473774 528490 578504 652292 753258
18125 753258 867892 1006460 1176694 1393667 1688819 2100337 2597507 3091435 3575482 4102726
18115 4102726 4648439 5058037 5357124 5806671 6537684 7733107 9497855 12257090 16750433
18106 16750433 22187065 21314861 13007332 7148878 4343585 2930609 2140557 1645502
18098 1645502 1310166 1081181 930004 813380 717771 640904 568120 516123 464514 424234
18088 424234 397904 375729 352697 337711 320672 317293 311263 313902 314638 276083 241732 234997 226504
18075 226504 231047 223641 213914 211391 217175 231850 233938 228189 226594 204777 184137 171698 175577
$$ packed form
18150C17980m703J5762R07J3261j3856k4809N751K1110J5057q955j3186l088O968
18137C28199J5706J6499R812P047K0976J7466K5299L2770N4716N0014P3788J00966
18125G53258J14634J38568J70234K16973K95152M11518M97170M93928M84047N27244
18115D102726N45713M09598K99087M49547P31013J195423J764748K759235M493343
18106A6750433N436632q72204q307529n858454k805293j412976p90052m95055
18098A645502l35336k28985j51177j16624r5609p6867p2784n1997n1609m0280
18088D24234k6330k2175k3032j4986j7039l379o030K639P36l8555l4351o735q493
18075B26504M543p406r727k523N784J4675K088n749j595k1817k0640j2439L879
$$ plain form
18062 175577 180325 165027 162272 166170 168124 152397 151276 148745 129857 116201 120990 126420 134918
18049 134918 145348 139348 132902 132272 131507 145535 143460 149280 147069 136887 125184 116672 123919 136469
18035 136469 145540 139433 117378 113886 122794 138829 149624 141723 139019 150506 151935 148890 158737
18022 158737 164893 162738 159450 156606 147268 143090 164213 178606 187867 190230 180976 194665 224196
18009 224196 239191 270967 313258 328846 290630 252110 234098 249401 287773 302341 252822
17998 252822 180573 144916 137074 134426 125948 123814 133694 135138 131027 114626 114006 120278 120205 124934
17984 124934 115421 105851 106361 115368 121477 119630 111374 109919 119888 115075 108025 120400 131201 138162
17970 138162 140003 135894 150416 164931 185836 206809 238618 282841 329460 355491 339798 304702
$$ packed form
18062A75577M748j5298k755L898J954j5727j121k531j8888j3656M789N430Q498
18049A34918J0430o000o446o30p65J4028k075N820k211j0182j1703q512P247J2550
18035A36469R071o107k2055l492Q908J6035J0795p901k704J1487J429l045R847
18022A58737O156k155l288k844r338m178K1123J4393R261K363r254J3689K9531
18009B24196J4995L1776M2291J5588l8216l8520j8012J5303L8372J4568m9519
17998B52822p2249l5657p842k648q478k134R880J444m111j6401o20O272p3M729
17984A24934r513r570N10R007O109j847q256j455R969m813p050J2375J0801O961
17970A38162J841m109J4522J4515K0905K0973L1809M4223M6619K6031j5693l5096
$$ plain form
17958 304702 306647 332271 377493 434790 433378 338194 240488 196903 185680 180364 165703 122671
17946 122671 81904 50583 36663 56596 54364 49649 30261 14909 12545 23275 20060 29846
17934 29846 40538 53264 47329 50302 61182 74462 71954 52703 45711 60863 71008 89286
17922 89286 100510 115050 131076 132178 144093 165047 182139 200914 235540 272593 333333 392640
17910 392640 417518 409759 372500 315003 297013 331292 369363 356856 287568 223675 172323 117817
17898 117817 70768 52309 53185 40848 39783 39961 37010 31108 25849 39348 50760 56475 54446
17885 54446 55828 60645 62092 56816 64100 65753 76903 74317 64949 81680 97800 118377 125533
17872 125533 121426 137085 157296 167831 200476 230821 253479 275205 286647 307587 303756 298434
$$ packed form
17958C04702J945K5624M5222N7297j412r5184r7706m3585j1223n316j4661m3032
17946A22671m0767l1321j3920J9933k232m715j9388j5352k364J0730l215R786
17934B9846J0692J2726n935K973J0880J3280k508j9251o992J5152J0145J8278
17922H9286J1224J4540J6026J102J1915K0954J7092J8775L4626L7053O0740N9307
17910C92640K4878p759l7259n7497j7990L4279L8071j2507o9288o3893n1352n4506
17898A17817m7049j8459Q76j2337j065J78k951n902n259J3499J1412N715k029
17885E4446J382M817J447n276P284J653J1150k586r368J6731J6120K0577P156
17872A25533m107J5659K0211J0535L2645L0345K2658K1726J1442K0940l831n322
$$ plain form
17860 298434 323414 366936 378497 379243 378395 359480 327720 310488 293478 258044 223605 229786
17848 229786 223223 218770 213391 186424 157457 134702 109186 84170 69938 62549 53363 59399 57907
17835 57907 42477 47292 49363 42833 29753 33179 49615 64476 75535 92123 104709 132287
17823 132287 158765 196608 243446 296938 348762 398771 441911 509816 607007 675004 739168
17812 739168 825641 933458 1079639 1275471 1431636 1431477 1343005 1240234 990236 675739
17802 675739 457680 327703 243898 191315 166358 143829 128897 114132 102008 86609 75262
17791 75262 63808 53602 50469 63256 87364 81160 63110 48856 50670 46241 47618 33711 27935
17778 27935 45814 47748 53503 59605 69483 70255 58426 42643 34967 41450 54373 69812 88667
$$ packed form
17860B98434K4980M3522J1561P46q48j8915l1760j7232j7010l5434l4439O181
17848B29786o563m453n379k6967k8967k2755k5516k5016j4232p389r186O036j492
17835E7907j5430M815K071o530j3080L426J6436J4861J1059J6588J2586K7578
17823A32287K6478L7843M6838N3492N1824N0009M3140O7905R7191O7997O4164
17812G39168Q6473J07817J46181J95832J56165j59q8472j02771k49998l14497
17802F75739k18059j29977q3805n2583k4957k2529j4932j4765j2124j5399j1347
17791G5262j1454j0206l133J2787K4108o204j8050j4254J814m429J377j3907n776
17778B7935J7879J934N755O102R878P72j1829j5783p676O483J2923J5439J8855
$$ plain form
17765 88667 100873 79876 62753 60231 65118 74433 94136 107096 121103 108063 102300 95668 85799
17752 85799 90027 110444 121017 123021 116428 105467 86102 75385 78159 69929 73959 75788 74181
17739 74181 70201 73189 65057 51083 40465 35333 39249 49327 63548 77901 74063 67382 65566
17726 65566 64510 58681 41087 25557 21217 15734 29544 37185 38697 53785 68413 76069 81328
17713 81328 86825 78398 67886 77713 87249 81391 73283 49860 40025 22317 7399 22948 17456
17700 17456 14718 19785 20866 29483 27560 20427 23361 16148 16944 20197 24180 27083 32045 34234 33199
17685 33199 22541 11585 -2930 -12655 -9080 1109 4162 11270 11859 20857 9389 8843 10931 13822
17671 13822 5495 1373 1534 -2651 -11021 -8548 -1732 3426 14473 26761 11481 5665 6575 16402
$$ packed form
17765H8667J2206k0997j7123k522M887R315J9703J2960J4007j3040n763o632r869
17752H5799M228K0417J0573K004o593j0961j9365j0717K774q230M030J829j607
17739G4181l980K988q132j3974j0618n132L916J0078J4221J4353l838o681j816
17726F5566j056n829j7594j5530m340n483J3810P641J512J5088J4628P656N259
17713H1328N497q427j0512R827R536n858q108k3423r835j7708j4918J5549n492
17700A7456k738N067J081Q617j923p133K934p213P96L253L983K903M962K189j035
17685C3199j0658j0956j4515r725L575J0189L053P108N89Q998j1468n46K088K891
17671A3822q327m122J61m185q370K473O816N158J1047J2288j5280n816R10R827
$$ plain form
17657 16402 17465 15717 9554 6849 26133 36055 28908 10674 965 -6969 -6417 -408 2399 -1201
17643 -1201 3652 -3840 -20761 -470 9160 4554 2188 -2305 9056 6015 13604 14850 -662 -7028
17629 -7028 -1346 3836 2168 6497 11894 3699 2095 12301 27654 18939 -709 -6921 -9806 2411
17615 2411 8787 12239 3803 -1634 3172 7759 10342 23995 29773 21805 9055 1805 6845 855
17601 855 18664 42154 41715 21148 3788 -6325 -8656 7611 13506 22484 33517 23893 14127
17588 14127 15407 -7677 4928 9188 1317 -2227 -11766 -10046 -3333 11228 15636 16856 11511 8575
17574 8575 -593 231 -5705 -255 16281 22421 31300 30067 31803 27880 26217 15965 14690 16035
17560 16035 16110 13988 14863 7216 16072 13369 7708 12390 7590 -353 6390 20779 23397 12997 7420
$$ packed form
17657A6402J063j748o163k705J9284R922p147j8234r709p934N52O009K807l600
17643a201M853p492j6921K0291R630m606k366m493J1361l041P589J246j5512o366
17629g028N682N182j668M329N397q195j604J0206J5353q715j9648o212k885J2217
17615B411O376L452q436n437M806M587K583J3653N778p968j2750p250N040n990
17601H55J7809K3490m39k0567j7360j0113k331J6267N895Q978J1033r624r766
17588A4127J280k3084J2605M260p871l544r539J720O713J4561M408J220n345k936
17574H575r168Q24n936N450J6536O140Q879j233J736l923j663j0252j275J345
17560A6035P5k122Q75p647Q856k703n661M682m800p943O743J4389K618j0400n577
$$ plain form
17545 7420 9115 18421 8699 5781 4514 4532 3045 1302 -3728 1 -442 6556 8956 5901 3785
17530 3785 -7002 -23784 -24020 -3134 11990 20742 14387 -494 2102 6246 19092 33117 23282
17517 23282 24170 25272 15445 6223 -9934 -10793 -10140 4785 19345 17659 11900 8413 2980 -7624
17503 -7624 -9151 -5161 2244 3218 18461 31551 31647 15245 12681 23080 19450 10110 14142 21138
17489 21138 16536 4983 3232 208 8492 15214 7348 -1418 9475 23435 13477 8291 17329 30884
17475 30884 30058 10618 9543 1709 4651 6823 -10027 -18982 -1759 -1837 2097 10387 3962 -10311
17461 -10311 -16082 4871 21577 21866 20140 27598 23785 12763 4448 5789 20757 23795 18266 22564
17447 22564 34935 38876 42523 41813 51216 63452 81729 111917 116196 75833 43227 25564 20910
$$ packed form
17545G420J695R306r722k918j267J8j487j743n030L729m43O998K400l055k116
17530C785j0787j6782k36K0886J5124Q752o355j4881K596M144J2846J4025r835
17517B3282Q88J102r827r222j6157q59O53J4925J4560j686n759l487n433j0604
17503g624j527L990P405R74J5243J3090R6j6402k564J0399l630r340M032O996
17489B1138m602j1553j751l024Q284O722p866q766J0893J3960r958n186R038J3555
17475C0884q26j9440j075p834K942K172j6850q955J7223p8L934Q290o425j4273
17461a0311n771K0953J6706K89j726P458l813j1022q315J341J4968L038n529M298
17447B2564J2371L941L647p10R403J2236J8277L0188M279m0363l2606j7663m654
$$ plain form
17434 20910 18513 7726 -8884 -20143 -21565 -19895 -19156 -6402 2415 3425 -6197 -6600 3422 14065
17420 14065 24949 20076 7565 -1912 4854 14598 10012 10910 13022 18321 19174 4810 -9648 4577
17406 4577 7329 9406 17103 5587 7564 11367 8422 20058 33949 31457 7666 -2070 -2577 5132
17392 5132 3236 -7983 -17958 -13456 -4510 9354 5005 11834 5033 3729 2648 15809 21915 11933
17378 11933 -3325 -2145 -11822 -11768 5862 16940 6030 -2658 -2244 -10976 -21392 -25670 -18174 2817
17364 2817 19262 24736 26233 17980 12827 7285 -12024 -20313 -10843 20002 26558 14485 17802 6795
17350 6795 1017 15226 19519 16766 19658 23146 20807 16635 38045 56214 50763 29147 21329 33162
17336 33162 35306 16276 17150 13249 17564 22638 42845 44137 37755 36460 36237 35769 23829 7303
$$ packed form
17434B0910k397j0787j6610j1259j422J670P39J2754Q817J010r622m03J0022J0643
17420A4065J0884m873j2511r477O766R744m586Q98K112N299Q53j4364j4458J4225
17406D577K752K077P697j1516J977L803k945J1636J3891k492k3791r736n07P709
17392E132j896j1219r975M502Q946J3864m349O829o801j304j081J3161O106r982
17378A1933j5258J180r677N4J7630J1078j0910q688M14q732j0416m278P496K0991
17364B817J6445N474J497q253n153n542j9309q289R470L0845O556j2073L317j1007
17350F795n778J4209M293k753K892L488k339m172K1410J8169n451k1616p818J1833
17336C3162K144j9030Q74l901M315N074K0207J292o382j295k23m68j1940j6526
$$ plain form
17322 7303 -8616 -10644 6586 22192 24206 4320 3863 22219 24939 20769 12427 -6641 -14523
17309 -14523 -5159 2710 6828 345 772 -3698 -1197 -3388 -6496 -793 3981 5810 11889 4402 -1194
17294 -1194 -10758 -10093 -9409 -9732 4317 9569 13771 18376 23733 29762 27196 21236 14236 16378 37092
17279 37092 39907 28561 6904 2033 10572 3578 2545 17312 19229 7587 1439 3940 27160
17266 27160 32049 8020 -9372 9631 33411 24237 6942 7277 9508 5030 12417 3895 -13155
17253 -13155 -9820 151 -7847 -9285 -12489 -22848 -16713 -17703 -21475 -17818 -9819 -7760 -11000 -19132
17239 -19132 -14517 -10584 4708 11577 22569 10733 19154 23681 11427 10353 7378 -5108 3357
17226 3357 5860 -13455 -24328 -19995 -18088 -2341 11464 12411 3089 -10022 -19255 -23325 1770
$$ packed form
17322G303j5919k028J7230J5606K014j9886m57J8356K720m170q342j9068p882
17309a4523R364P869M118o483M27m470K501k191l108N703M774J829O079p487n596
17294a194r564O65O84l23J4049N252M202M605N357O029k566n960p000K142K0714
17279C7092K815j1346k1657m871Q539o994j033J4767J917j1642o148K501K3220
17266B7160M889k4029j7392J9003K3780r174j7295L35K231m478P387q522j7050
17253a3155L335R971p998j438l204j0359O135r90l772L657P999K059l240q132
17239a9132M615L933J5292O869J0992j1836Q421M527j2254j074k975j2486Q465
17226C357K503j9315j0873M333J907J5747J3805R47r322j3111r233m070K5095
$$ plain form
17213 1770 17462 7111 13064 23895 19163 15615 9263 3498 -5807 -11476 -13523 -7144 -2389 6623
17199 6623 10622 12323 2309 1046 7538 10065 10910 396 -2742 -20986 -19898 -11681 -6381 -8105
17185 -8105 -10845 -17034 -20665 -7604 2597 -9460 -23957 -33162 -27527 -15091 -2770 -1977 -20419
17172 -20419 -27571 -23715 -18506 -17056 -13419 -22610 -10491 1063 -6569 -8371 -5291 -5972 -10532 -21206
17158 -21206 -21286 -20502 -7347 -9465 -8087 -6762 1122 1889 12689 18314 15156 19650 21550 18784 -1207
17143 -1207 482 -959 -14180 -17654 -15770 -25006 -11640 1591 3071 -8686 -8553 -14145 -27538 -28080
17129 -28080 -20911 -11353 -1008 3015 -1558 2991 -3294 3558 8527 -9885 -11675 -399 -17599
17116 -17599 -29581 -30490 -22339 -11201 -1395 75 -276 -2784 -17138 -12513 -3082 -6025 -10813 -15351
$$ packed form
17213A770J5692j0351N953J0831m732l548o352n765r305n669k047O379M755R012
17199F623L999J701j0014j263O492K527Q45j0514l138j8244J088Q217N300j724
17185h105k740o189l631J3061J0201j2057j4497r205N635J2436J2321P93j8442
17172b0419p152L856N209J450L637r191J2119J1554p632j802L080o81m560j0674
17158b1206q0P84J3155k118J378J325P884P67J0800N625l158M494J900k766j9991
17143a207J689j441j3221l474J884r236J3366J3231J480j1757J33n592j3393n42
17129b8080P169R558J0345M023m573M549o285O852M969j8412j790J1276j7200
17116a7599j1982r09Q151J1138R806J470l51k508j4354M625R431k943m788m538
$$ plain form
17102 -15351 -11866 1897 15254 13846 7820 15439 18843 7491 -6510 -7795 6865 -4877 -8658
17089 -8658 -188 -12605 -11619 -13962 -22073 -34384 -39136 -22360 -5209 -2837 -14052 -15410 3435
17076 3435 13433 6033 -1829 5367 9936 -3286 1645 8491 8209 16668 26187 24534 14435 9914
17062 9914 8924 8989 9737 7336 6588 348 -9275 -1690 1669 -16597 -10971 -11445 -1279 6716 1575 11706
17046 11706 5569 -12901 -1069 6927 4641 -2877 7255 -1018 -4823 4544 12451 18345 7669
17033 7669 -8002 -13646 -3469 5743 9834 13813 1755 -2960 -1254 -6786 -12533 -13479 -4689 4862
17019 4862 16609 26248 23064 10201 9959 7644 2843 13199 29603 27730 16938 -195 -8849
17006 -8849 -13353 -10799 4471 2279 -2943 -7449 -3514 -2685 4510 19866 20680 8084 6364 -2377
$$ packed form
17102a5351L485J3763J3357j408o026P619L404j1352j4001j285J4660j1742l781
17089h658Q470j2417R86k343q111j2311m752J6776J7151K372j1215j358J8845
17076C435R998p400p862P196M569j3222M931O846k82Q459R519j653j0099m521
17062I914r90O5P48k401p48o240r623P585L359j8266N626m74J0166P995n141J0131
17046A1706o137j8470J1832P996k286p518J0132q273l805R367P907N894j0676
17033G669j5671n644J0177R212M091L979j2058m715J706n532n747r46Q790R551
17019D862J1747R639l184j2863k42k315m801J0356J6404j873j0792j7133q654
17006h849m504K554J5270k192n222m506L935Q29P195J5356Q14j2596j720q741
$$ plain form
16992 -2377 6782 13949 4101 -1015 -6967 -7084 4202 -5467 -23211 -21350 -29312 -19038 -11914 -3583
16978 -3583 -1378 -6109 -13487 -4181 -3436 -5361 -12610 -17362 -4696 1639 -3425 1501 12910 21550
16964 21550 12109 7023 5226 15844 20626 1971 4281 18775 18138 12315 10109 6937 12394 20819
16950 20819 20391 14273 16949 2775 -11327 -16847 3902 21238 28203 15636 -3378 -942 9192
16937 9192 19852 14070 510 -19015 -34863 -24644 -5242 -1548 9839 12645 7187 -5969 -12042
16924 -12042 -16018 -9864 519 3084 9016 22587 17335 671 -6533 -6454 -445 3451 -1295 -3538
16910 -3538 -3511 3082 -7995 -6535 -819 8727 15744 17701 2260 -9085 -17676 -3748 5410 1265
16896 1265 -979 -6502 -3636 7993 16166 23611 28417 18496 5539 14559 8978 11721 16137 12869
$$ packed form
16992b377R159P167r848n116n952j17J1286r669j7744J861p962J0274P124Q331
16978c583K205m731p378R306P45j925p249m752J2666O335n064M926J1409Q640
16964B1550r441n086j797J0618M782j8655K310J4494o37n823k206l172N457Q425
16950B0819m28o118K676j4174j4102n520K0749J7336O965j2567j9014K436J0134
16937I192J0660n782j3560j9525j5848J0219J9402L694J1387K806n458j3156o073
16924a2042l976O154J0383K565N932J3571n252j6664p204P9O009L896m746k243
16910c538K7O593j1077J460N716R546P017J957j5441j1345q591J3928R158m145
16896A265k244n523K866J1629Q173P445M806r921j2957R020n581K743M416l268
$$ plain form
16882 12869 1856 -10653 -6129 -15215 -16453 -19266 -23182 -23855 -17172 -1100 13140 2567 -12302
16869 -12302 -8456 -11702 -17443 -11106 -5333 -5493 -15860 -20219 -31656 -29187 -35159 -43672 -24093 -2632
16855 -2632 1405 10736 14501 5886 -4868 -6751 -8353 -10477 -1108 1978 -18934 -23074 -18390 -18875
16841 -18875 -21179 -21126 -25961 -11029 -654 5293 11418 8353 12500 10881 -6315 -11849 -17060 -4219
16827 -4219 -6332 -16111 -26211 -15763 -1925 -1277 -155 -12317 -9693 -2253 -629 -7638 5554 18804
16813 18804 9731 8600 1565 -4854 -10599 8914 25848 21678 7229 -11316 -26427 -24544 -24367
16800 -24367 -5049 -3679 -8440 -19069 -17808 -6218 3194 9945 7622 2482 -3376 826 12725
16787 12725 15025 10878 8034 5246 235 4124 -6611 -20728 -26246 -23266 -15624 -7392 2129 10155
$$ packed form
16882A2869j1013j2509M524r086j238k813l916o73O683J6072J4240j0573j4869
16869a2302L846l246n741O337N773j60j0367m359j1437K469n972q513J9579K1461
16855b632M037R331L765q615j0754j883j602k124R369L086k0912m140M684m85
16841a8875k304N3m835J4932J0375N947O125l065M147j619j7196n534n211J2841
16827d219k113r779j0100J0448J3838O48J122j2162K624P440J624p009J3192J3250
16813A8804r073j131p035o419n745J9513J6934m170j4449j8545j5111J883J77
16800b4367J9318J370m761j0629J261J1590R412O751k323n140n858M202J1899
16787A2725K300m147k844k788n011L889j0735j4117n518K980P642Q232R521Q026
$$ plain form
16773 10155 16708 9729 1429 7191 21456 24269 16507 -8569 -7588 11712 5799 -2538 -7019 -2288
16759 -2288 1240 -6592 -23673 -16713 -1140 590 -2774 -163 917 -1867 -4633 -48 1981 -3788
16745 -3788 -13637 -24617 -24458 -24731 -18283 -11775 -22248 -29378 -13633 -18143 -26247 -20603 -14103 -2488
16731 -2488 5594 -5247 -13582 -8526 -7518 -1461 -7024 3520 -763 -3966 8321 1964 -5876 4117
16717 4117 -1937 633 -15124 -10022 -2122 -4215 -10989 -15785 -17497 -3292 6361 722 -1778 13217
16703 13217 14156 -608 -8847 -16258 -23714 -22307 -16788 -21331 -21574 -22368 -7833 4557 977 -2988
16689 -2988 -6809 -10724 -9571 -15629 -21930 -19780 -12030 -9197 -10804 -11961 -4620 -3646 -7307 -21860 -19473
16674 -19473 -6397 -6025 -9180 -12975 -19535 -18007 -14078 2148 8683 4707 -2094 -2291 -1734 -7757 -16323
$$ packed form
16773A0155O553o979q300N762J4265K813p762k5076R81J9300n913q337m481M731
16759b288L528p832j7081O960J5573J730l364K611J080k784k766M585K029n769
16745c788r849j0980J59k73O448O508j0473p130J5745m510q104N644O500J1615
16731b488Q082j0841q335N056J008O057n563J0544m283l203J2287o357p840R993
16717D117o054K570j5757N102P900k093o774m796j712J4205R653n639k500J4995
16703A3217R39j4764q239p411p456J407N519m543k43p94J4535J2390l580l965
16689b988l821l915J153o058o301K150P750K833j607j157P341R74l661j4553K387
16674a9473J3076L72l155l795o560J528L929J6226O535l976o801j97N57o023q566
$$ plain form
16659 -16323 -21609 -27118 -13209 4141 4517 6311 5825 3215 4740 2415 -870 4369 -1195 -5517
16645 -5517 -3320 -1745 -12772 -22143 -28160 -26712 -8277 -941 -13105 -12473 -4755 12804 25579 28101
16631 28101 24109 2788 -896 4891 -2962 -1116 8117 15583 13109 -1598 1942 13340 12042 12302
16617 12302 5234 2239 -3279 1332 3015 2108 -1335 5451 18289 26508 18588 2713 3484 7650
16603 7650 12011 15236 17507 13504 15999 4480 14338 19346 24041 20469 16015 10849 9520 13824
16589 13824 15297 9670 3031 3093 -2218 -9948 -10584 -3131 -4657 -7176 -2715 -925 -2472 22380 36649
16574 36649 33491 36188 26101 9657 2126 -639 -8480 -18922 -11202 -5636 -20942 -29501 -26417
16561 -26417 -16871 -21220 -35278 -17155 6118 11718 12978 22380 10745 -21121 -24579 -12060 -8775
$$ packed form
16659a6323n286n509J3909J7350L76J794m86k610J525k325l285N239n564m322
16645e517K197J575j1027r371o017J448J8435P336j2164O32P718J7559J2775K522
16631B8101l992k1321l684N787p853J846R233P466k474j4707L540J1398j298K60
16617A2302p068k995n518M611J683r07l443O786J2838Q219p920j5875P71M166
16603G650M361L225K271m003K495j1519R858N008M695l572m454n166j329M304
16589A3824J473n627o639O2n311p730o36P453j526k519M461J790j547K4852J4269
16574C6649l158K697j0087j6444p531k765p841j0442P720N566j5306q559L084
16561b6417R546m349j4058J8123K3273N600J260R402j1635l1866l458J2519L285
$$ plain form
16548 -8775 -536 9156 7889 -15073 -15141 -3536 3994 -850 7249 26464 31220 14831 16922 14264
16534 14264 25622 34878 28419 18068 5811 -7607 -11366 -4547 -8022 -13086 -17651 -14105 -18955
16521 -18955 -26318 -28292 -13518 -9867 -16091 -11380 -19046 -18353 -6163 993 -1216 -10206 -8986 -11119
16507 -11119 -4334 -4529 -3292 -11051 1039 7126 3436 -1987 -10858 -13189 -7484 -15385 -20743 -23804
16493 -23804 -17111 -8892 -577 17416 27556 11062 -3263 -6087 -4346 11759 20260 13637 -1188
16480 -1188 5668 9767 19013 18893 -501 -9575 -14223 -5793 7537 11354 13925 11795 7654 -2170
16466 -2170 -3515 -9297 -6853 -2492 -4616 -542 8592 14729 22975 25190 19554 3382 3801 -1657 -9878
16451 -9878 -2106 11605 11836 2081 -5882 -2741 1195 -9905 -19330 -9146 1262 -3551 -8466 -12500
$$ packed form
16548h775Q239R692j267k2962o8J1605P530m844Q099J9215M756j6389K091k658
16534A4264J1358R256o459j0351j2257j3418l759O819l475n064m565L546m850
16521a8955p363j974J4774L651o224M711p666O93J2190P156k209q990J220k133
16507a1119O785j95J237p759J2090O087l690n423q871k331N705p901n358l061
16493b3804O693Q219Q315J7993J0140j6494j4325k824J741J6105Q501o623j4825
16480a188O856M099R246j20j9394r074m648Q430J3330L817K571k130m141r824
16466b170j345n782K444M361k124M074R134O137Q246K215n636j6172M19n458q221
16451i878P772J3711K31r755p963L141L936j1100r425J0184J0408m813m915m034
$$ plain form
16437 -12500 -12095 -1051 6453 17153 16402 14909 5995 137 2275 -2106 -16151 -17821 -8772 -3935
16423 -3935 -7748 -9276 -21671 -33847 -30034 -17935 -14087 -19177 -30092 -19523 -11652 -10581 -13887
16410 -13887 -12091 -12220 -21822 -33571 -34399 -28323 -17851 -23290 -18383 -10977 3080 7324 10580 8833
16396 8833 -8066 -18925 -23933 -18051 -4240 7222 7542 1217 -10331 -5054 -2144 -4659 -4103 -2708
16382 -2708 -754 -1276 2350 3597 2292 -964 -8169 -16651 -3604 5798 -239 -1631 -13389 -19097
16368 -19097 -8898 -10969 -15335 -25445 -28415 -20437 -11601 9097 9674 4246 13366 17428 15957 16667
16354 16667 6175 -1068 -2996 -198 6996 3963 6806 7407 -2775 -10410 -2297 2278 2121 -13108
16340 -13108 -20014 -21221 -20336 -9375 -732 4506 4395 -5189 -6577 -1344 -2755 -3819 -4219 -14541 -14752
$$ packed form
16437a2500M05J1044P504J0700p51j493q914n858K138m381j4045j670R049M837
16423c935l813j528j2395j2176L813J2099L848n090j0915J0569P871J071l306
16410a3887J796j29r602j1749q28O076J0472n439M907P406J4057M244L256j747
16396H833j6899j0859n008N882J3811J1462L20o325j1548N277K910k515N56J395
16382b708J954n22L626J247j305l256p205q482J3047R402o037j392j1758n708
16368a9097J0199k071m366j0110k970P978Q836K0698N77n428R120M062j471P10
16354A6667j0492p243j928K798P194l033K843O01j0182p635Q113M575j57j5229
16340a3108o906j207Q85J0961Q643N238j11r584j388N233j411j064m00j0322k11
$$ plain form
16325 -14752 -10695 -9205 -659 10545 4144 -1395 3599 9066 4260 -8764 -8080 -5558 541 5488
16311 5488 3001 2468 -7 -3365 4303 25004 21686 19163 25401 15396 4582 -2442 2012 609
16297 609 9351 5188 -2109 -14946 -7887 -2652 -9163 -3236 7577 15095 7790 -2089 -8332 -1104
16283 -1104 755 -7267 -11775 -17483 -21006 -22855 -5773 6226 -2230 -1082 13537 21926 12169 2296
16269 2296 -1165 -4768 -8538 -19888 -28237 -24165 -19220 -2898 -25 3315 17421 7705 -8581 -11201
16255 -11201 9833 18916 11695 13582 14650 8875 1315 -12623 -28032 -36095 -40875 -38466 -26812
16242 -26812 -11642 -6376 -11966 -12159 -1862 -394 -1731 4747 4450 -1218 -8927 -13987 -20490 -26409
16228 -26409 -22285 -25652 -16590 -13549 -11951 -18190 -13105 -9857 -17537 -21882 -10893 -9103 -20132 -25898
$$ packed form
16325a4752M057J490Q546J1204o401n539M994N467m806j3024O84K522O099M947
16311E488k487n33k475l358P668K0701l318k523O238j0005j0814p024M454j403
16297F09Q742m163p297j2837P059N235o511N927J0813P518p305r879o243P228
16283a104J859q022m508n708l523j849J7082J1999q456J148J4619Q389r757r873
16269B296l461l603l770j1350q349M072M945J6322K873L340J4106r716j6286k620
16255a1201K1034R083p221J887J068n775p560j3938j5409q063m780K409J1654
16242b6812J5170N266n590j93J0297J468j337O478k97n668p709n060o503n919
16228b6409M124l367R062L041J598o239N085L248p680m345J0989J790j1029n766
$$ plain form
16214 -25898 -19950 -21294 -18208 -15542 -3006 -10943 -19371 -21878 -25381 -18825 -16713 -14062 -28206 -30156
16200 -30156 -10619 -22496 -22299 -9679 -10539 -13694 -15114 -16842 -8144 -5998 -3058 -1909 -7604 -1248
16186 -1248 7896 22294 15539 -6787 -11760 -13522 -12111 -12978 -20623 -33229 -25102 -15559 -20911 -23751
16172 -23751 -19263 -13284 -7740 -12767 -29010 -30472 -14695 -5440 -6860 -9880 -16421 -23271 -34187 -34732
16158 -34732 -41275 -31676 -28791 -33780 -26156 -17348 -11301 -3581 -6869 -25532 -24944 -4319 7331 19102
16144 19102 12142 15448 12982 19009 18025 15710 14219 2524 -9052 -10626 -1853 12348 23315 18710
16130 18710 13680 2427 -4095 -8491 -6067 -5882 -6619 2416 3988 -4913 -4396 -4223 15370 24443 3757
16115 3757 -8584 -25666 -38514 -24344 -17123 -15535 -16024 -30314 -31381 -29781 -26408 -17486 -4339
$$ packed form
16214b5898N948j344L086K666J2536p937q428k507l503O556K112K651j4144j950
16200c0156J9537j1877J97J2620q60l155j420j728Q698K146K940J149n695O356
16186a248R144J4398o755k2326m973j762J411q67p645j2606Q127R543n352k840
16172b3751M488N979N544n027j6243j462J5777R255j420l020o541o850j0916n45
16158c4732o543R599K885m989P624Q808O047P720l288j8663N88K0625J1650J1771
16144A9102o960L306k466O027r84k315j491j1695j1576j574Q773J4201J0967m605
16130A8710n030j1253o522m396K424J85p37R035J572q901N17J73J9593R073k0686
16115C757j2341j7082j2848J4170P221J588m89j4290j067J600L373Q922J3147
$$ plain form
16102 -4339 1015 -730 -9395 -8658 558 15713 27599 23747 11666 12187 19809 20313 4136 -18329
16088 -18329 -18464 -8608 407 -689 -2793 -13541 -18587 -17723 -19475 -10660 6452 913 3661 -1528
16074 -1528 763 4959 -17 2278 -10472 -8743 4422 5521 4592 -2864 2157 12435 5929 -2819
16060 -2819 -13613 -16339 -19356 -21681 -14956 -2005 -10988 -24372 -13882 2906 12120 21140 16507
16047 16507 2023 -9679 -10523 -17714 -8125 -6166 -17070 -29753 -27465 -7049 939 15187 10702
16034 10702 3964 3303 19434 27532 30854 23350 15131 18621 2357 -10656 6577 5061 -4099 -12213
16020 -12213 -11939 -9377 -12025 -20905 -21691 -24737 -28035 -12818 -2959 -2880 -739 768 454 -14416 -19855
16005 -19855 -13887 -9878 539 13653 23368 24143 8896 5769 16831 29440 21545 5577 15889
$$ packed form
16102d339N354j745q665P37R216J5155J1886l852j2081N21P622N04j6177k2465
16088a8329j35R856R015j096k104j0748n046Q64j752Q815J7112n539K748n189
16074a528K291M196m976K295j2750J729J3165J099r29p456N021J0278o506q748
16060b819j0794k726l017k325O725J2951q983j3384J0490J6788R214R020m633
16047A6507j4484j1702q44p191R589J959j0904j2683K288K0416P988J4248m485
16034A0702o738o61J6131Q098L322p504q219L490j6264j3013J7233j516r160q114
16020a2213K74K562k648q880p86l046l298J5217R859P9K141J507l14j4870n439
16005a9855N968M009J0417J3114R715P75j5247l127J1062J2609p895j5968J0312
$$ plain form
15992 15889 24202 38726 12901 -5264 2377 1606 -8411 -6299 -4016 -10961 -18062 -19305 -12488 -10658
15978 -10658 -19739 -18365 -15001 -8852 -7569 -6015 -6123 -6955 -5148 -4023 -10105 -10246 -4451 8045 2769
15963 2769 -202 3394 2347 4998 2593 2861 11177 11010 8277 7630 3077 9674 -8784 -21949 -19581
15948 -19581 -11659 -5197 -3500 -3835 -2979 3409 3798 866 -12646 -15931 -13416 -23293 -17050 -12690 -2026
15933 -2026 -5570 -3926 -5042 526 6945 6441 9516 11330 4502 -2430 -497 6552 2114 1712 -4680
15918 -4680 -5376 -10627 -1313 -5364 -20515 -23084 -6057 -4133 -4923 -6869 -4011 6519 553 -10685
15904 -10685 -4577 14090 6993 -1137 5186 747 -504 -687 3749 1116 23 -9976 -6085 -3946
15890 -3946 5299 10051 10968 23943 19404 5592 6478 -1198 947 -5667 -14813 236 -5944 -24237
$$ packed form
15992A5889Q313J4524k5825j8165P641p71j0017K112K283o945p101j243O817J830
15978a0658r081J374L364O149J283J554j08q32J807J125o082j41N795J2496n276
15963B769k971L596j047K651k405K68Q316j67k733o47m553O597j8458j3165K368
15948a9581P922O462J697l35Q56O388L89k932j3512l285K515r877O243M360J0664
15933b026l544J644j116N568O419n04L075J814o828o932J933P049m438m02o392
15918d680o96n251R314m051j5151k569J7027J924p90j946K858J0530n966j1238
15904a0685O108J8667p097q130O323m439j251j83M436k633j093r999L891K139
15890c946R245M752R17J2975m539j3812Q86p676K145o614r146J5049o180j8293
$$ plain form
15876 -24237 -20518 -21684 -17614 -17664 -26746 -23169 -26427 -31388 -24125 -14423 -8667 -14028 -8884 -8835 -2211
15861 -2211 1227 11384 10626 12495 17862 9610 -5987 -10291 -1511 7763 4518 3449 -4636 1721
15847 1721 1512 5124 -6651 -2174 8226 15332 7778 -2942 -6232 -14326 -9759 8059 20816 8720
15833 8720 2076 3655 -5448 -9109 -10838 -23823 -36509 -41228 -25379 -8004 -7110 -9459 -4046 8674
15819 8674 11674 17403 9702 1604 2182 -5553 -9039 -13293 4451 11710 12368 11155 14050 8848 -8125
15804 -8125 -14780 -3598 9619 15493 4563 -8487 -7282 1719 1319 -4522 -3015 -9870 -15142 -8375
15790 -8375 -2615 -15741 -26248 -14933 -12278 -17339 -5554 5587 8732 14742 10440 6749 15622
15777 15622 7084 1544 -3170 -7445 -12913 -12463 -14427 -7290 9799 9894 9489 5746 10656 7377 -3781
$$ packed form
15876b4237L719j166M070n0r082L577l258m961P263R702N756n361N144M9O624
15861b211L438J0157p58J869N367q252j5597m304Q780R274l245j069q085O357
15847A721k09L612j1775M477J0400P106p554j0720l290q094M567J7818J2757j2096
15833H720o644J579r103l661j729j2985j2686m719J5849J7375Q94k349N413J2720
15819H674L000N729p701q098N78p735l486m254J7744P259O58j213K895n202j6973
15804h125o655J1182J3217N874j0930j3050J205R001m00n841J507o855n272O767
15790h375N760j3126j0507J1315K655n061J1785J1141L145O010m302l691Q873
15777A5622q538n540m714m275n468M50j964P137J7089R5m05l743M910l279j1158
$$ plain form
15762 -3781 -9976 -12314 -6065 3389 2911 -14683 -7954 3564 1235 -576 8065 -4771 -10791 -6538
15748 -6538 -4134 -6433 -4880 -2515 -10730 -11210 -10437 -7434 2293 893 784 1416 -10971 -14139 -2738
15733 -2738 3099 -2098 -12892 -9450 -28486 -29944 -29681 -12999 -10522 -9517 -19642 -14491 1394 7148
15719 7148 1951 4376 -3977 -17371 -9371 17186 14034 -8368 -24972 -23730 -11924 -3311 -5509
15706 -5509 -9308 -1549 5373 -6308 -14834 -10993 -7686 -15102 -12277 -1696 -1174 -3711 138 -475 -5399
15691 -5399 -14468 -30122 -32633 -32448 -17617 -13619 -13902 8284 2235 -8852 469 -1862 -9885 -14764
15677 -14764 -19656 -16370 -26408 -18196 -7841 9629 9413 -9635 -7279 -13373 -22776 -33127 -24508
15664 -24508 -15188 -6715 -8068 -9605 -22433 -29621 -25197 -13974 -20877 -29166 -17308 2172 4820
$$ packed form
15762c781o195k338O249R454m78j7594O729J1518k329j811Q641j2836o020M253
15748f538K404k299J553K365q215m80P73L003R727j400j09O32j2387l168J1401
15733b738N837n197j0794L442j9036j458K63J6682K477J005j0125N151J5885N754
15719G148n197K425q353j3394Q000K6557l152k2402j6604J242J1806Q613k198
15706e509l799P759O922j1681q526L841L307p416K825J0581N22k537L849o13m924
15691e399r069j5654k511J85J4831L998k83K2186o049j1087R321k331q023m879
15677a4764m892L286j0038Q212J0355J7470k16j9048K356o094r403j0351Q619
15664b4508R320Q473j353j537j2828p188M424J1223o903q289J1858J9480K648
$$ plain form
15651 4820 568 3783 -7516 -5580 -9565 -3773 4684 4596 4022 -1321 10230 15296 17146 10700 5162
15636 5162 9308 6616 -6662 -25384 -40510 -35713 -18775 -8335 8703 -757 -10515 -13739 -10954
15623 -10954 -30353 -37659 -22589 -7306 2782 1574 2180 -3106 -10298 -15455 -12714 2343 5179
15610 5179 -9904 -8913 8864 10775 11820 2185 -775 -13333 -31348 -36855 -33632 -15006 3281
15597 3281 9501 17945 19641 13368 13172 16316 2961 -7762 -8528 -642 8226 10837 -8231 -10370
15583 -10370 -12523 5441 10582 3483 -2524 7461 4841 -10045 -1379 2203 -12174 -10290 -6044 -17421
15569 -17421 -24881 -22552 -1739 10318 13394 22939 13276 7545 -3400 -1324 97 -1445 5402 12550
15555 12550 8468 -6884 -8077 -4266 6610 1616 -131 3690 -1800 5632 4027 1 12841 4462
$$ packed form
15651D820m252L215j1299J936l985N792Q457q8n74n343J1551N066J850o446n538
15636E162M146k692j3278j8722j5126M797J6938J0440J7038r460r758l224K785
15623a0954j9399p306J5070J5283J0088j208O06n286p192n157K741J5057K836
15610E179j5083R91J7777J911J045r635k960j2558j8015n507L223J8626J8287
15597C281O220Q444J696o273j96L144j3355j0723p66P886Q868K611j9068k139
15583a0370k153J7964N141p099o007R985k620j4886Q666L582j4377J884M246j1377
15569a7421p460K329K0813J2057L076R545r663n731j0945K076J421j542O847P148
15555A2550m082j5352j193L811J0876m994j747L821n490P432j605m026J2840q379
$$ plain form
15541 4462 -10527 -16980 -9843 -2728 -4794 -7053 4552 11152 6432 7721 28794 31940 25803 26923
15527 26923 33234 30820 21247 5672 331 -3909 -5208 -6168 -14090 -12442 3410 14435 1655 -18758
15513 -18758 -28716 -15441 -11897 -15274 -19620 -9849 1433 -6323 -7796 -22242 -22916 -9425 -1650 7472
15499 7472 8757 -6073 219 -500 -10269 -6928 -14318 -11982 -7876 -565 -388 845 5786 4536 3337
15484 3337 11875 14389 8293 6694 13912 10027 1678 -88 -8490 158 -3461 -9590 -20810 -15998
15470 -15998 -361 9499 7158 -2221 3215 6417 8785 6663 16678 16132 13051 -4636 -12888 -692
15456 -692 7608 8217 -4481 -2245 9284 14855 16351 5704 -3297 8360 4982 -811 -12509 -16639
15442 -16639 -15241 -6070 -11035 -13176 -1556 185 -1743 -6595 -11542 -15967 -16159 -16869 -20265 -10786 -14081
$$ packed form
15541D462j4989o453P137P115k066k259J1605O600m720J289K1073L146o137J120
15527B6923O311k414r573j5575n341m240j299r60p922J648J5852J1025j2780k0413
15513a8758r958J3275L544l377m346R771J1282p756j473j4446o74J3491P775R122
15499G472J285j4830O292p19r769L341p390K336M106P311J77J233M941j250j199
15484C337Q538K514o096j599P218l885q349j766q402Q648l619o129j1220M812
15470a5998J5637R860k341r379N436L202K368k122J0015n46l081j7687q252J2196
15456f92Q300O09j2698K236J1529N571J496j0647r001J1657l378n793j1698m130
15442a6639J398R171m965k141J1620J741j928m852m947m425j92p10l396R479l295
$$ plain form
15427 -14081 -16793 -22396 -24861 -19444 -19355 -13166 -25090 -34037 -19260 -10337 731 -5733 -3574 -12517
15413 -12517 -22250 -40221 -33490 -10614 -2055 -9096 -17683 -23366 -20073 -4249 -3759 -8913 -9993 -2074
15399 -2074 -2238 6191 13146 5694 4844 8230 9472 9597 5553 2102 704 -5828 -9413 -8914 -885 6372
15383 6372 5283 13230 14225 3655 -16327 -31584 -36413 -28625 -23121 -30879 -40111 -36857 -32852 -27328
15369 -27328 -20430 -11492 -1816 -2953 -313 8168 13738 4801 1930 -1829 -742 1523 7755 372
15355 372 -4932 -6619 -6116 2361 -5643 -18855 -22573 -16378 -7077 1899 5545 -11551 -13977 -6648 -5191
15340 -5191 -7607 -4614 -13795 -6939 -2150 -999 14960 17292 13666 19868 19271 15843 23564 32210 27747
15325 27747 7145 -13011 -18143 -9992 -4622 -9120 259 163 12831 16419 1083 -2048 6767 17581
$$ packed form
15427a4081k712n603k465N417Q9O189j1924q947J4777Q923J1068o464K159q943
15413a2517r733j7971O731K2876Q559p041q587n683L293J5824M90n154j080P919
15399b074j64Q429O955p452q50L386J242J25m044l451j398o532l585M99Q029P257
15383F372j089P947R95j0570j9982j5257m829P788N504p758r232L254M005N524
15369b7328O898Q938R676j137K640Q481N570q937k871l759J087K265O232p383
15355C72n304j687N03Q477q004j3212l718O195R301Q976L646j7096k426P329J457
15340e191k416K993r181O856M789J151J5959K332l626O202n97l428P721Q646m463
15325B7747k0602k0156n132Q151N370m498R379r6J2668L588j5336l131Q815J0814
$$ plain form
15311 17581 39363 32969 13372 8835 16526 7205 -13332 -27009 -29645 -22253 -15064 -15566 -1910
15298 -1910 2521 15048 20581 13308 4749 -13908 -21981 -17678 -9129 -11334 -15158 -5564 -2178 -2906
15284 -2906 -7275 -249 -4073 -4944 -6384 -6229 -4812 7198 5969 -7052 -5161 -5645 -9746 -2115 8337
15269 8337 5693 -8547 -7561 -5320 -12019 -8677 5556 20819 18440 17983 8123 12296 23057 24002
15255 24002 19451 18262 2944 -9127 -2906 -8174 -14115 -12145 6134 6527 917 -9473 -19289 -25771
15241 -25771 -15157 -11590 -6373 -11834 -11861 -6622 -4351 3648 -2001 -10498 -8571 -11692 -5261 4724 -8006
15226 -8006 -25209 -30858 -21384 -27153 -26519 -26613 -14441 -11259 -4789 -11080 -16383 -8032 -23394 -39200
15212 -39200 -31941 -31577 -26971 -25052 -36765 -37255 -18138 -858 12582 2920 1254 5002 4188 9553
$$ packed form
15311A7581K1782o394j9597m537P691r321k0537j3677k636P392P189n02J3656
15298a910M431J2527N533p273q559j8657q073M303Q549k205l824R594L386p28
15284b906m369P026l824q71j440J55J417J2010j229j3021J891m84m101P631J0452
15269H337k644j4240R86K241o699L342J4233J5263k379m57r860M173J0761R45
15255B4002m551j189j5318j2071O221n268n941J970J8279L93n610j0390r816o482
15241b5771J0614L567N217n461k7N239K271P999n649q497J927l121O431R985j2730
15226h006j7203n649R474n769O34r4J2172L182O470o291n303Q351j5362j5806
15212c9200P259L64M606J919j1713m90J9117J7280J3440r662j666L748q14N365
$$ plain form
15198 9553 -7606 -8003 -1598 7337 5067 10582 21640 26197 18147 10005 -3053 -12501 -9953 -16061
15184 -16061 -11290 950 -7851 -2258 -1839 -946 -7679 8974 12121 15532 14394 10114 11421 11828 6820
15169 6820 7010 2772 4030 2124 -12153 -23407 -14615 -15478 -17149 -15109 -16256 -22652 -16670 -16743 -17288
15154 -17288 -8967 -16809 -14888 -6267 -12971 -9117 -707 14965 21059 14829 -280 -7920 -6345 2367
15140 2367 13075 5984 2091 -389 -8619 -10804 595 9737 12886 20388 21212 8617 10969 16464
15126 16464 10755 -571 -12659 -21258 -16561 4203 4602 1388 1097 9666 8408 2820 11789 -5131
15112 -5131 -16566 -2387 9082 5096 8606 9903 4395 1067 10788 5184 14466 10612 9177 7289
15098 7289 -9852 -16403 -20237 -14738 -15685 -19663 -7878 -1536 7497 4973 -9766 558 11713 20790
$$ packed form
15198I553j7159l97O405Q935k270N515J1058M557q050q142j3058r448K548o108
15184a6061M771J2240q801N593M19Q93o733J6653L147L411j138m280J307M07n008
15169F820J90m238J258j906j4277j1254Q792q63j671K040j147o396N982p3n45
15154a7288Q321p842J921Q621o704L854Q410J5672O094o230j5109p640J575Q712
15140B367J0708p091l893k480q230k185J1399R142L149P502Q24j2595K352N495
15126A6464n709j1326j2088q599M697K0764L99l214k91Q569j258n588Q969j6920
15112e131j1435J4179J1469l986L510J297n508l328R721n604R282l854j435j888
15098G289j7141o551l834N499r47l978J1785O342R033k524j4739J0324J1155R077
$$ plain form
15084 20790 25921 14659 -1975 -4061 2420 -2267 -15377 -15336 -12573 -12411 -8717 3436 13414 1388
15070 1388 -2189 3255 11561 2743 -11045 -3339 12259 9244 -12298 -9280 -6164 -6421 -13404 -20322
15056 -20322 -13809 -4956 12770 21865 20228 36912 33206 12666 11493 7649 3663 -6503 3306
15043 3306 14901 9742 7688 -2406 -2612 4039 12315 5368 12699 27280 6456 -9625 -9193 -9578
15029 -9578 -10062 -5590 -3596 -3490 -10347 -21362 -13871 -13973 -20565 -25702 -7350 19543 22034 10470
15015 10470 4234 5910 7415 10129 4800 -848 527 9239 554 -13150 -8252 6265 4608 211
15001 211 -245 2580 3159 -6094 -19174 -20832 -29596 -14054 -4208 4590 -2425 -4792 8064 -5543
14987 -5543 -18539 -25261 -27385 -32380 -30445 -10904 -796 6908 -1439 3654 18148 21097 -874
$$ packed form
15084B0790N131j1262j6634k086O481m687j3110M1K763J62L694J2153R978j2026
15070A388l577N444Q306q818j3788P706J5598l015k1542L018L116k57o983o918
15056b0322O513Q853J7726R095j637J6684l706k0540j173l844l986j0166R809
15043C306J1595n159k054j0094k06O651Q276o947P331J4581k0824j6081M32l85
15029i578m84M472J994J06o857j1015P491j02o592n137J8352K6893K491j1564
15015A0470o236J676J505K714n329n648J375Q712q685j3704M898J4517j657m397
15001B11m56K825N79r253j3080j658q764J5542R846Q798p015k367J2856j3607
14987e543j2996o722k124m995J935J9541J0108P704q347N093J4494K949k1971
$$ plain form
14974 -874 -20201 -9198 -12729 -23214 -30978 -17735 -6658 11011 11094 6441 -4533 -5778 -7878 -22591
14960 -22591 -19128 -25134 -11095 6573 8448 -8151 -5131 4150 -3636 -16409 -14209 -13743 -20455 -19816
14946 -19816 -14788 -18226 -16446 -17575 -15979 -2216 3171 9109 5193 -2928 2600 -910 -4489 -5574
14932 -5574 -9501 -20816 -18480 -15488 -6830 476 6033 5308 3688 1509 -5851 -1925 7307 14192 11888
14917 11888 20287 16948 -5056 -15969 3545 17141 8312 8911 12692 7198 6496 3907 1879 6944
14903 6944 9529 2900 -941 -718 -9387 -8256 -2295 -11122 -17351 -9982 -20006 -9194 -4322 602
14889 602 18659 10302 4135 6254 1380 -3954 -22064 -31307 -16203 4756 26894 22295 17782 13022
14875 13022 -5058 7609 11759 14162 16052 18658 7502 -15261 -20988 -13577 -2929 8957 6689
$$ packed form
14974h74j9327J1003l531j0485p764J3243J1077J7669Q3m653j0974j245k100j4713
14960b2591L463o006J4039J7668J875j6599L020R281p786j2773K200M66o712O39
14946a9816N028l438J780j129J596J3763N387N938l916q121N528l510l579j085
14932e574l927j1315K336K992Q658P306N557p25j620k179p360L926R232O885k304
14917A1888Q399l339k2004j0913J9514J3596q829N99L781n494p02k589k028N065
14903F944K585o629l841K23q669J131N961q827o229P369j0024J0812M872M924
14889F02J8057q357o167K119m874n334j8110r243J5104K0959K2138m599m513m760
14875A3022j8080J2667M150K403J890K606j1156k2763n727P411J0648J1886k268
$$ plain form
14862 6689 14907 26829 25472 24762 21969 13791 20520 13296 9038 11835 13061 11858 3930 15596
14848 15596 9450 3915 -3366 -1458 -8841 -2441 576 7033 3714 823 -3727 -16829 -22947 -23435
14834 -23435 -12821 -6106 4220 -1251 -14133 -11744 11737 7852 -2231 -10027 -6256 -10362 -8245
14821 -8245 -2318 -2840 -8431 -9145 -6531 -11398 -11826 -15627 -2058 12263 -4698 -15358 -804 3834
14807 3834 -8256 -14022 -12731 -6798 -13462 -16522 -9645 -1005 -1728 3645 1321 -10221 -12177 2531
14793 2531 -2382 -17710 -18686 -13927 -10592 -1444 -5566 -8341 -19225 -13326 -12142 -6634 2211 5802
14779 5802 12132 13440 20263 21218 22697 14323 10627 6632 -937 -1411 2028 -12293 -14670 -1648 13626
14764 13626 14909 20120 32796 23730 4873 -10076 -19666 -9325 7923 13790 10655 10499 12152
$$ packed form
14862F689Q218J1922j357p10k793q178O729p224m258K797J226j203p928J1666
14848A5596o146n535p281J908p383O400L017O457l319k891m550j3102o118m88
14834b3435J0614O715J0326n471j2882K389K3481l885j0083p796L771m106K117
14821h245N927n22n591p14K614m867m28l801J3569J4321j6961j0660J4554M638
14807C834j2090n766J291N933o664l060O877Q640p23N373k324j1542j956J4708
14793B531m913j5328r76M759L335R148m122k775j0884N899J184N508Q845L591
14779E802O330J308O823R55J479q374l696l995p569m74L439j4321k377J3022J5274
14764A3626J283N211J2676r066j8857j4949r590J0341J7248N867l135j56J653
$$ plain form
14751 12152 -1826 -10991 -9205 -3167 -4283 -7568 -5767 -19479 -22085 -20164 -20877 -11177 -2239 3138
14737 3138 9393 12247 9873 -381 -12332 -9150 -4572 -4077 -6733 -5747 -9076 -6302 -3773 6826
14723 6826 10761 8197 1426 1823 1672 13589 11164 9028 -5855 -15169 -20018 -3994 -5492 5173
14709 5173 10745 -4612 -15944 -22052 -20487 -3787 3404 83 -1890 -7936 -4026 9387 13722 5029
14695 5029 -9999 -11859 -16295 -11045 -12742 -4673 8176 4865 -6561 -538 16434 13736 7511 7214
14681 7214 5077 6674 4138 6145 4704 12136 21233 19147 11108 10615 16243 21039 7946 5661 7231
14666 7231 -4664 -2750 -559 -1121 4531 5060 2539 12133 5214 -6010 -15322 -16523 -16086 -26921 -23666
14651 -23666 -8516 -6988 -7980 -9402 -13205 -11783 -3063 3046 18060 10239 4091 -3753 -5552 6308
$$ packed form
14751A2152j3978r165J786O038j116l285J801j3712k606J921p13R700Q938N377
14737C138O255K854k374j0254j1951L182M578M95k656R86l329K774K529J0599
14723F826L935k564o771L97j51J1917k425k136j4883r314m849J6024j498J0665
14709E173N572j5357j1332o108J565J6700P191l321j973o046L910J3413M335q693
14695E029j5028j860m436N250j697Q069J2849l311j1426O023J6972k698o225k97
14681G214k137J597k536K007j441P432R097k086q039m93N628M796j3093k285J570
14666G231j1895J914K191n62N652N29k521R594o919j1224r312j201M37j0835L255
14651b3666J5150J528r92j422l803J422Q720O109J5014p821o148p844j799J1860
$$ plain form
14637 6308 2197 -6213 -6287 736 9072 8172 -2830 2730 9103 -3859 -20352 -12123 -9724 -2144 4052
14622 4052 5771 5205 2867 -2882 649 16174 12166 7080 -3233 -14231 -14500 -137 3939 7791
14608 7791 845 -11382 -9049 -13233 -7466 -4663 -19483 -34100 -28138 -6766 -1242 -2188 4450 9939
14594 9939 10267 5053 -1788 -8804 -9407 -6263 5814 11556 11255 18599 25870 30969 22835 15833 4668
14579 4668 2182 970 -5885 -15107 -12667 -880 867 798 -4354 -10554 -11557 -13174 -11396 -7298 -17298
14564 -17298 -19005 -13162 -12128 -18478 -14519 2134 -1820 -2915 -58 -17739 -16356 -4698 -5384 -14470
14550 -14470 -20484 -8852 -6689 -5572 -67 6908 12595 9908 15154 2461 -6312 -1178 -5250 -1731
14536 -1731 3944 4540 13180 6072 -13511 -24897 -18377 -17715 -13130 -6266 -4359 -4614 -1547 -6069 -7423
$$ packed form
14637F308m111q410p4P023Q336r00j1002N560O373j2962j6493Q229K399P580O196
14622D052J719n66k338n749L531J5525m008n086j0313j0998k69J4363M076L852
14608G791o946j2227K333m184N767K803j4820j4617N962K1372N524r46O638N489
14594I939L28n214o841p016o03L144J2077N742l01P344P271N099q134p002j1165
14579D668k486j212o855r222K440J1787J747o9n152o200j003j617J778M098j0000
14564a7298j707N843J034o350L959J6653l954j095K857j7681J383J1658o86r086
14550a4470o014J1632K163J117N505O975N687k687N246j2693q773N134m072L519
14536a731N675N96Q640p108j9583j1386O520O62M585O864J907k55L067m522j354
$$ plain form
14521 -7423 -466 -17103 -14071 -5215 -3608 -796 -1954 -4559 -7113 -7176 -9643 -7431 -2304 3364 2074
14506 2074 10427 6111 866 -18116 -36541 -37677 -34170 -23171 -16111 -9790 13873 16903 13053 8085
14492 8085 10344 4189 16710 20372 21543 7216 -6318 -19659 -31720 -24841 568 6834 -1923
14479 -1923 -3359 740 3973 -2195 -14563 -10524 -18157 -22622 -31769 -32333 -18529 10658 14132 12043
14465 12043 8687 9655 21259 27336 19054 23937 20939 17917 15632 -3323 -16426 -5194 -13853 -18832
14451 -18832 -25218 -38138 -18172 -4482 1794 3020 1938 -2598 3534 83 -11206 -10316 6308
14438 6308 8126 11707 12494 25970 9044 16809 25144 11913 5734 -5483 -12650 -18440 -17148 -23727
14424 -23727 -22911 -6199 -6063 -9225 -12342 -7883 6349 -1952 -4898 -4689 2094 13035 13812 7920 9783
$$ packed form
14521g423O957j6637L032Q856J607K812j158k605k554o3k467K212N127N668j290
14506B074Q353m316n245j8982j8425j136L507J0999P060O321K3663L030l850m968
14492H085K259o155J2521L662J171j4327j3534j3341j2061O879K5409O266q757
14479a923j436M099L233o168j2368M039p633m465r147n64J3804K9187L474k089
14465A2043l356R68J1604O077q282M883k998l022k285j8955j3103J1232q659m979
14451a8832o386j2920J9966J3690O276J226j082m536O132l451j1289Q90J6624
14438F308J818L581P87J3476j6926P765Q335j3231o179j1217p167n790J292o579
14424b3727Q16J6712J36l162l117M459J4232q301k946K09O783J0941P77n892J863
$$ plain form
14409 9783 7748 1851 -4190 -9304 -8160 -2008 -6399 -14080 -21552 -20814 -26005 -8088 5444 21325
14395 21325 26581 22573 20530 23958 25761 21034 10272 -4298 -10031 -17298 -18780 -8870 4847 6392
14381 6392 357 1903 -639 -6995 -2339 -15738 -19943 -19605 -6438 5755 5101 -1856 -4040 -13269
14367 -13269 -11557 -1148 1067 1300 -1959 5932 8189 -252 -2044 9274 17529 21217 10254 -775
14353 -775 5937 15318 23274 22715 740 -2091 9040 355 3396 7950 -639 2666 11099 8059 610
14338 610 -2094 -1374 -11788 -18165 -4207 11112 12023 5998 -1697 -6127 2174 9472 9326 11971 12604
14323 12604 6992 13012 15134 15414 6511 372 17066 31840 24529 6519 -15059 -14187 -14888 -15689
14309 -15689 -11690 -20542 -31721 -27887 -17543 -14341 -20881 -22888 -1182 4895 11694 14398 1473
$$ packed form
14409I783k035n897o041n114J144O152m391p681p472P38n191J7917J3532J5881
14395B1325N256m008k043L428J803m727j0762j4570n733p267j482R910J3717J545
14381F392o035J546k542o356M656j3399m205L38J3167J2193o54o957k184r229
14367a3269J712J0409K215K33l259P891K257q441j792J1318Q255L688j0963j1029
14353g75O712R381P956n59k1975k831J1131q685L041M554q589L305Q433l040p449
14338F10k704P20j0414o377J3958J5319R11o025p695m430Q301P298j46K645O33
14323A2604n612O020K122K80q903o139J6694J4774p311j8010k1578Q72p01q01
14309a5689L999q852j1179L834J0344L202o540k007K1706O077O799K704j2925
$$ plain form
14296 1473 -6704 -16469 -9646 -17434 -15724 -13737 -15563 3095 692 -4888 -4351 -6971 -16358 -10607 -5881
14281 -5881 11776 16886 17519 13709 11956 1297 -2017 1186 -4957 -16092 -11139 -9064 3272 7015
14267 7015 15813 18716 18996 19963 18245 3566 1647 -4538 -5975 -2259 -11756 -11501 -179 -4524 -5918
14252 -5918 -1022 3149 11914 23009 15935 3235 -2203 -8016 4810 16114 6267 -3023 3914 4461
14238 4461 14060 18649 1380 -17147 -4021 13811 12718 5893 8418 20477 21820 11228 2653
14225 2653 -9440 -11031 -4171 8908 10420 1695 -1033 -9148 -3228 13299 11977 20584 31037 29228
14211 29228 20683 -5514 -12567 -8542 -3170 -3271 6012 10227 17274 4680 -8333 -7909 -12161 -3243
14197 -3243 3902 8457 11985 2842 1730 3566 9205 16561 11682 -4214 -9815 -770 -4790 -3518
$$ packed form
14296A473q177r765O823p788J710J987j826J8658k403n580N37k620r387N751M726
14281e881J7657N110O33l810j753j0659l314L203o143j1135M953K075J2336L743
14267G015Q798K903K80R67j718j4679j919o185j437L716r497K55J1322m345j394
14252e918M896M171Q765J1095p074j2700n438n813J2826J1304r847r290O937N47
14238D461R599M589j7269j8527J3126J7832j093o825K525J2059J343j0592q575
14225B653j2093j591O860J3079J512q725k728q115N920J6527j322Q607J0453j809
14211B9228q545k6197p053M025N372j01R283M215P047j2594j3013M24m252Q918
14197c243P145M555L528r143j112J836N639P356m879j5896n601R045m020J272
$$ plain form
14183 -3518 178 -1880 -1651 4177 2833 -3678 -1599 -5163 -2228 -256 4803 8846 15163 20457 7676
14168 7676 -4025 210 4364 -4983 -9594 -4065 -10240 -2241 11951 8761 16766 26655 19222 9005
14154 9005 3861 -330 -4634 -1089 -9917 -22030 -19766 -12654 -14097 -13407 -2879 5934 751 -7047
14140 -7047 -6738 -4717 8483 18575 9925 1753 2795 -1147 -7166 -2923 -7146 -9141 -5571 -13721
14126 -13721 -15252 -5993 -9986 -8819 -9981 -5016 4315 10741 12692 -5252 -17893 -8990 -6022 -5643
14112 -5643 -8783 -9814 -2090 7990 13155 13530 18150 20522 16403 17644 15098 20392 15901 9792 6048
14097 6048 7218 -7066 -1896 6846 -1089 1433 -7178 -18423 -7795 1439 8932 5672 -3666 -5423
14083 -5423 -12328 -20829 -17349 -11543 -23129 -10736 10373 9249 20390 35559 35326 36580 27566 12795
$$ packed form
14183c518L696k058K29N828j344o511K079l564K935J972N059M043O317N294j2781
14168G676j1701M235M154r347m611N529o175P999J4192l190Q005R889p433j0217
14154I005n144m191m304L545q828j2113K264P112j443O90J0528Q813n183p798
14140g047L09K021J3200J0092q650q172J042l942o019M243m223j995L570q150
14126a3721j531R259l993J167j162M965R331O426J951j7944j2641Q903K968L79
14112e643l140j031P724J0080N165L75M620K372m119J241k546N294m491o109l744
14097F048J170j4284N170Q742p935K522q611j1245J0628R234P493l260r338j757
14083e423o905q501L480N806j1586J2393K1109j124J1141J5169k33J254r014j4771
$$ plain form
14069 12795 -392 -6014 -4487 -5189 -13470 -24544 -21891 -15223 -12368 -16036 -13770 -16718 -19583 -20219
14055 -20219 -20749 -28887 -17570 -7122 -3887 -25 -253 984 7269 -6097 -12110 -19951 -18704 -4668
14041 -4668 -2857 6729 5025 -5081 -6272 421 -141 -11242 10674 9570 -13603 -27627 -22374 -14656
14027 -14656 -887 11804 19365 20575 23728 18659 17979 11726 4932 -6084 -9778 -7673 -14062 -3293
14013 -3293 -5706 -14308 -13524 -16145 -21806 -14635 -14275 -16066 -11574 -10661 -2672 10950 -2983 -11276 -16435
13998 -16435 -16808 -21402 -14922 -6309 2490 8451 1965 -6427 -11223 -13204 -5833 4384 9384 210
13984 210 -6885 -17503 -2356 -1599 7246 3071 -5198 -8782 -8216 -8203 -3834 3854 7244 2403 -3055
13969 -3055 -6381 -15015 -9348 -16298 -23934 -20284 -13455 -5122 -7045 -8182 -5752 -8677 -8007 1575 5510
$$ packed form
14069A2795j3187n622J527p02q281j1074K653O668K855l668K266k948k865o36
14055b0219n30q138J1317J0448L235L862k28J237O285j3366o013p841J247J4036
14041d668J811R586j704j0106j191O693n62j1101K1916j104k3173j4024N253P718
14027a4656J3769J2691P561J210L153n069o80o253o794j1016l694K105o389J0769
14013c293k413q602P84k621n661P171L60j791M492R13P989J3622j3933q293n159
13998a6435l73m594O480Q613Q799N961o486q392m796j981P371J0217N000r174
13984B10p095j0618J5147P57Q845m175q269l584N66J3M369P688L390m841n458
13969c055l326q634N667o950p636L650O829Q333j923j137K430k925O70R582L935
$$ plain form
13954 5510 20457 31867 30127 16756 1874 216 -6931 -15566 306 26802 21478 20239 13366
13941 13366 -5814 -21852 -23295 -3572 10304 -2133 -5848 -8593 2591 8029 1606 11695 22834
13928 22834 24713 9679 -4216 -1629 -7404 -14504 -22235 -8893 5691 5649 15321 23593 14979 6171
13914 6171 7052 -6697 -314 20650 29815 18777 3698 -3210 2915 4915 142 -8960 -18682 -7510
13900 -7510 -5851 1768 594 -12234 -22252 -21198 -12120 -4708 -7138 -10382 -843 -2072 -16465 -6833
13886 -6833 -127 -10114 -2395 -3651 -12333 -17723 -10561 -1695 3473 -7491 -4812 -4608 -8236 -6422 16533
13871 16533 29087 30751 27807 27243 14490 15263 17509 15560 6680 -13048 -14826 -5792 7458 10222
13857 10222 1184 -5124 -14435 -9316 -13954 -16579 -14223 3714 7963 2363 9159 2044 9487 1658
$$ packed form
13954E510J4947J1410j740j3371j4882j658p147q635J5872K6496n324j239o873
13941A3366j9180j6038j443J9723J3876j2437l715k745J1184N438o423J0089J1139
13928B2834J879j5034j3895K587n775p100p731J3342J4584m2R672Q272q614q808
13914F171Q81j3749O383K0964R165j1038j5079o908O125K000m773r102r722J1172
13900g510J659P619j174j2828j0018J054R078P412k430l244R539j229j4393R632
13886f833O706r987P719j256q682n390P162Q866N168j0964K679K04l628J814K2955
13871A6533J2554J664k944n64j2753P73K246j949q880j9728j778R034J3250K764
13857A0222r038o308r311N119m638k625K356J7937M249n600O796p115P443p829
$$ plain form
13843 1658 -7670 -8623 -10497 -2925 2572 -2130 1521 16993 27357 17193 1758 -2117 7296 4311
13829 4311 -4374 -455 -2826 -11746 -13 -5153 -10344 -9767 -6096 -7731 -5458 -3084 3607 4171 -5080
13814 -5080 -12343 -19626 -11495 -13637 -9542 -3752 1418 1308 291 -4609 -5261 -12306 -10402 -9582 -2108
13799 -2108 -12264 -23989 -13457 -1837 -1994 -637 -14483 -23741 -17864 -19801 -1230 -358 -5279 -5501
13785 -5501 -4213 -7135 -12549 -9490 -14214 -884 3274 -1932 844 8877 6552 -4459 -15242 -20943
13771 -20943 -27827 -18859 -10698 -10173 -6837 -4010 -7201 -2177 -2803 -2464 1042 -22334 -26873 -15946 -886
13756 -886 2294 -2076 -2151 7248 2440 -5669 2657 19392 21029 13513 9060 5170 -7230 -10490 -14519
13741 -14519 -12113 -1547 14366 20553 5018 -10326 -8829 8073 24295 29650 23155 10554 13374
$$ packed form
13843A658r328r53j874P572N497m702L651J5472J0364j0164j5435l875R413k985
13829D311q685L919k371q920J1733n140n191N77L671j635K273K374O691N64r251
13814e080p263p283Q131k142M095N790N170j10j017m900o52p045J904Q20P474
13799b108j0156j1725J0532J1620j57J357j3846r258N877j937J8571Q72m921k22
13785e501J288k922n414L059m724J3330M158n206K776Q033k325j1011j0783n701
13771b0943o884Q968Q161N25L336K827l191N024o26L39L506k3376m539J0927J5060
13756h86L180m370p5R399m808q109Q326J6735J637p516m453l890j2400l260m029
13741a4519K406J0566J5913O187j5535j5344J497J6902J6222N355o495j2601K820
$$ plain form
13728 13374 11368 14030 16370 12152 -914 -9110 -4912 4744 12306 5407 9862 12939 3816 6207
13714 6207 11157 6332 -5616 -11538 -6752 14543 15981 21763 17371 18146 18055 2758 -8700 -18043
13700 -18043 -15401 -11363 -10380 -2956 -8007 -2252 2130 19911 27742 15641 9211 8386 604 19479
13686 19479 22410 15605 16844 12620 -3251 -10191 921 12542 21282 39484 39810 25587 14259
13673 14259 2240 4942 7787 11168 9026 7661 4706 -7775 -2095 4401 15036 11705 5608 11498
13659 11498 19219 19375 15973 4609 -5974 -4847 -13571 -23206 -15556 -12232 -21659 -20196 -12071 -22228
13645 -22228 -24563 -12296 1921 -5958 -9250 3588 -16245 -29263 -10590 2832 -2839 -8358 -8246
13632 -8246 -11217 -13041 -14144 -13828 -24966 -20756 -19222 -16597 -13048 -17863 -29023 -18845 -11482 -274
$$ packed form
13728A3374k006K662K340m218j3066q196M198R656P562o899M455L077r123K391
13714F207M950m825j1948n922M786K1295J438N782m392P75r1j5297j1458r343
13700a8043K642M038R83P424n051N755M382J7781P831j2101o430q25p782J8875
13686A9479K931o805J239m224j5871o940J1112J1621Q740J8202L26j4223j1328
13673A4259j2019K702K845L381k142j365k955j2481N680O496J0635l331o097N890
13659A1498P721J56l402j1364j0583J127q724r635P650L324r427J463Q125j0157
13645b2228k335J2267J4217p879l292J2838j9833j3018J8673J3422n671n519J12
13632h246k971j824j103L16j1138M210J534K625L549m815j1160J0178P363J1208
$$ plain form
13618 -274 -607 -351 -11177 -4191 -13007 -16349 -5809 -1127 1421 2663 1720 -3484 3336 10663 16256
13603 16256 4157 628 9729 12584 10694 7727 15271 17241 16000 21543 17418 7426 24225 24162
13589 24162 23337 8855 8003 17926 19619 17187 19305 26473 19033 14372 14263 16907 13350 6210 15665
13574 15665 21698 16602 12635 7767 6577 -1116 9690 6695 6399 17356 4584 -9298 -14893 -11418
13560 -11418 -3470 5751 7222 9430 9716 8911 14526 12740 15719 8442 15967 23818 20434 25346 15969
13545 15969 9318 1650 -14467 -12193 -8513 -2016 9865 14447 11688 10560 5400 10727 5865 16559
13531 16559 15303 11029 -2574 10793 5761 -4857 -2348 -1258 6422 13242 18978 29285 27759
13518 27759 25251 28516 23682 16097 22557 9656 4714 6763 3128 -463 11974 11721 7150 11918
$$ packed form
13618b74l33K56j0826O986q816l342J0540M682K548J242r43n204O820P327N593
13603A6256j2099l529R101K855j890k967P544J970j241N543m125r992J6799o3
13589B4162q25j4482q52R923J693k432K118P168p440m661j09K644l557p140R455
13574A5665O033n096l967m868j190p693J0806k995k96J0957j2772j3882n595L475
13560a1418P948R221J471K208K86q05N615j786K979p277P525P851l384M912r377
13545A5969o651p668j6117K274L680O497J1881M582k759j128n160N327m862J0694
13531A6559j256m274j3603J3367n032j0618K509J090P680O820N736J0307j526
13518B7759k508L265m834p585O460j2901m942K049l635l591J2437k53m571M768
$$ plain form
13504 11918 12522 5656 314 -2815 -12827 -12730 -6543 4563 12339 2610 -7239 -18589 -24510 -23026
13490 -23026 -11660 11836 9542 2199 16630 25040 19402 10352 4693 12512 13111 -2031 -17808
13477 -17808 -24532 -19247 -8561 -2835 2861 1498 -8182 -12595 -7543 -7538 -393 4720 8360 12108 9518
13462 9518 5719 10796 7291 11696 16321 11793 5442 7657 14441 19877 25234 20056 15581 18141 27077
13447 27077 20666 6073 10495 11240 7545 -167 9614 17642 17517 41756 48196 43300 24541 23021
13433 23021 19175 8065 3073 -11350 -8710 -707 -5726 -12170 -12133 -17389 -28066 -34349 -36714 -28164
13419 -28164 -17551 -17501 -8428 -8793 -15951 -3409 821 7645 7752 6510 7581 5373 7152 18734 20530
13404 20530 12258 9666 14866 14092 18065 18370 9412 9336 17102 10379 9654 5121 3701 8620 7232 -3537
$$ packed form
13504A1918O04o866n342l129j0012R7O187J1106P776r729r849j1350n921J484
13490b3026J1366K3496k294p343J4431Q410n638r050n659P819N99j5142j5777
13477a7808o724N285J0686N726N696j363r680m413N052NP145N113L640L748k590
13462I518l799N077l505M405M625m528o351K215O784N436N357n178m475K560Q936
13447B7077o411j4593M422P45l695p712R781Q028j25K4239O440m896j8759j520
13433B3021l846j1110m992j4423K640Q003n019o444L7n256j0677o283k365Q550
13419b8164J0613N0R073l65p158J2542M230O824J07j242J071k208J779J1582J796
13404B0530q272k592N200p74L973L05q958p6P766o723p25m533j420M919j388j0769
$$ plain form
13388 -3537 -8768 -14516 -12575 -15418 -12564 -6553 -7333 -16823 -14158 7744 6998 3024 6150 14138 14917
13373 14917 -6601 -18716 -6687 10527 14050 1923 -1685 -3934 -4267 -5667 -7433 -6690 -715 -313
13359 -313 14487 15376 6751 4829 1933 -5753 -14962 -14317 -17131 -4291 16278 17139 3417 3171 7491
13344 7491 4748 -11438 -8235 -5414 4751 6272 -2867 -5286 -5661 173 -1612 1630 8184 6555
13330 6555 12347 5294 -512 -8783 -30254 -29517 -11179 7165 15813 18927 16084 16001 -831 -16249
13316 -16249 -19061 -12829 -9663 -11699 -19586 -23019 -16667 -6174 -9900 -12297 -10837 -12515 -5864 1104
13302 1104 7386 24207 17118 13962 10322 -3564 2382 8675 10698 5968 1792 -4072 -14755 -23356
13288 -23356 -15476 4786 11348 2917 -11370 -10725 -5524 -2765 -898 4514 7890 10137 -14056 -29441
$$ packed form
13388c537n231n748J941k843K854O011p80r490K665K1902p46l974L126P988P79
13373A4917k1518j2115J2029J7214L523j2127l608k249l33j400j766P43N975M02
13359c13J4800Q89q625j922k896p686r209O45k814J2840K0569Q61j3722k46M320
13344G491k743j6186L203K821J0165J521r139k419l75N834j785L242O554j629
13330F555N792p053n806q271k1471P37J8338J8344Q648L114k843q3j6832j5418
13316a6249k812O232L166k036p887l433O352J0493l726k397J460j678O651O968
13302A104O282J6821p089l156l640j3886N946O293K023m730m176n864j0683q601
13288b3356P880K0262O562q431j4287O45N201K759J867N412L376K247k4193j5385
$$ plain form
13274 -29441 -35822 -38440 -54078 -40192 -30096 -14963 -15580 -9039 -489 11163 15791 8768 7655
13261 7655 8546 2879 -3396 -7054 2765 15861 12825 7414 4745 -1133 -3603 -429 -1344 -6406 -10399
13246 -10399 669 10079 472 -2828 1055 2787 3594 1415 -8974 224 12073 -3598 -3278 -9676
13232 -9676 -8953 1584 10279 16371 19484 8849 6752 -2461 -16508 -9740 -11393 -13171 -4428 10866
13218 10866 15333 6996 6894 16840 22587 19026 14869 15080 28275 36883 24992 16944 8914 11143
13204 11143 12439 14141 5162 4434 4767 10963 -4633 -14867 -25654 -31437 -19534 6883 11882 7326
13190 7326 -1036 -5912 -13246 1594 -2448 6636 12068 12778 8481 4439 -5069 -4869 -13956 -14311 -20039
13175 -20039 -12483 -6145 10542 18096 4133 -208 7442 12197 1749 -296 10690 10865 -12947
$$ packed form
13274b9441o381k618j5638J3886J0096J5133o17O541Q550J1652M628p023j113
13261G655Q91n667o275l658R819J3096l036n411k669n878k470L174r15n062l993
13246a0399J1068R410r607l300L883J732Q07k179j0389R198J1849j5671L20o398
13232i676P23J0537Q695O092L113j0635k097r213j4047O768j653j778Q743J5294
13218A0866M467q337j02R946N747l561m157K11J3195Q608j1891q048q030K229
13204A1143J296J702q979p28L33O196j5596j0234j0787n783J1903K6417M999m556
13190G326q362m876p334J4840m042R084N432P10m297m042r508K00r087l55n728
13175b0039P556O338J6687P554j3963m341P650M755j0448k045J0986J75k3812
$$ plain form
13162 -12947 -921 7584 12962 4195 9800 8993 -3991 -5936 8370 15260 10241 6947 4406 4874
13148 4874 -6269 1257 5829 6907 4080 8263 14007 13911 9424 8201 13357 9032 2617 -5144 -14687
13133 -14687 -12101 -8833 -15434 -23285 -29838 -12220 771 -3816 -6406 -6557 -7573 -11015 -10137 234
13119 234 18032 12781 -739 -3673 -9109 -4703 -10071 -1352 -5642 -2849 2538 9831 17713 26296
13105 26296 31893 27055 21387 10681 15316 16628 17094 12896 900 -6986 -1285 2788 49 -7229
13091 -7229 -13413 -15790 -11337 -9841 -2785 3866 7905 9201 3898 7960 26034 24486 4969 -1154
13077 -1154 -6499 -4346 5658 10142 10811 13579 17869 13897 3529 3612 14588 17110 28058 19090
13063 19090 -12562 -28133 -16872 -6286 395 4774 -2760 -14894 -5615 -258 1345 11171 22309
$$ packed form
13162a2947J2026Q505N378q767N605q07j2984j945J4306O890n019l294k541M68
13148D874j1143P526M572J078k827M183N744r6m487j223N156m325o415p761r543
13133a4687K586L268o601p851o553J7618J2991m587k590j51j016l442Q78J0371
13119B34J7798n251j3520k934n436M406n368Q719m290K793N387P293P882Q583
13105B6296N597m838n668j0706M635J312M66m198j1996p886N701M073k739p278
13091g229o184k377M453J496P056O651M039J296n303M062J8074j548j9517o123
13077a154n345K153J0004M484O69K768M290l972j0368Q3J0976K522J0948q968
13063A9090l1652j5571J1261J0586O681M379p534j2134R279N357J603R826J1138
$$ plain form
13050 22309 8501 9639 8640 5442 5688 -4968 -7907 -9530 3928 7383 801 -6448 -9066 -16613
13036 -16613 -24508 -20475 -5636 9711 16622 22281 11494 12335 8966 1500 4081 1685 3559 -4484
13022 -4484 -20793 -9301 -246 9083 4623 2820 -2106 -7200 8392 23386 20423 5441 -2962
13009 -2962 -6515 6898 18243 16695 6879 -9055 -14083 -7142 210 9204 18950 752 -5221 3066
12995 3066 7284 7249 6163 -6125 -13878 -6968 -2811 -1475 -11412 -4773 -8888 -7020 -5535 -9962 -8071
12980 -8071 -7851 -7730 -18155 -17398 -5779 1305 -8326 -8328 -877 5620 13630 10602 2191 -7403 -14616 -10651
12964 -10651 -5308 4193 4202 -6116 2173 8656 11373 -9590 -10713 -14000 2200 1840 -1146 -3960 -15626
12949 -15626 -23265 -28262 -24262 -36886 -36000 -31723 -15743 -13537 -1202 -6025 -5949 -6927 852 -1445 -9322
$$ packed form
13050B2309j3808J138r99l198K46j0656k939j623J3458L455o582p249k618p547
13036a6613p895M033J4839J5347O911N659j0787Q41l369p466K581k396J874q043
13022d484j6309J1492R055R329m460j803m926n094J5592J4994k963j4982q403
13009b962l553J3413J1345j548r816j5934n028O941P352Q994R746j8198n973Q287
12995C066M218l5j086j2288p753O910M157J336r937O639m115J868J485m427J891
12980h071K20J21j0425P57J1619P084r631kP451O497Q010l028q411r594p213L965
12964a0651N343R501Rj0318Q289O483K717k0963j123l287J6200l60k986k814j1666
12949a5626p639m997M000j2624Q86M277J5980K206J2335m823P6r78P779k297p877
$$ plain form
12934 -9322 -8737 -15717 -6294 4711 15164 19224 5285 -7956 -9612 -2347 -9107 -9018 -7041 2299
12920 2299 12411 30714 45096 54790 67239 64358 58668 72706 72247 75825 94541 109509 115995
12907 115995 131656 155832 191222 230263 253331 254511 263191 289580 294162 288749 273563 251882
12895 251882 237423 222280 195376 156970 120234 105161 79141 69813 49293 20203 12375 7471
12883 7471 5543 -15 -3416 -2853 -13909 -6735 4708 13053 16291 11002 -526 -6602 -8782 -564
12869 -564 697 2617 16457 17214 7284 -12187 -9089 -4092 1766 11915 13780 6429 10559 8737
12855 8737 -2820 -15621 -8050 -7702 -3542 22 -510 4234 1783 476 5662 592 4082 -1503 1369
12840 1369 3847 7984 19061 10121 -823 878 3872 191 -4046 -11168 -19244 -21318 -16865 -15755
$$ packed form
12934i322N85o980R423J1005J0453M060j3939j3241j656P265o760Q9J977R340
12920B299J0112J8303J4382R694J2449k881n690J4038m59L578J8716J4968O486
12907A15995J5661K4176L5390L9041K3068J180Q680K6389M582n413j5186k1681
12895B51882j4459j5143k6904l8406l6736j5073k6020r328k0520k9090p828m904
12883G471j928n558l401N63j1056P174J1443Q345L238n289j1528o076k180Q218
12869e64J261J920J3840P57r930j9471L098M997N858J0149J865p351M130j822
12855H737j1557j2801P571L48M160L564n32M744k451j307N186n070L490n585K872
12840A369K478M137J1077q940j0944J701K994l681m237p122q076k074M453J110
$$ plain form
12826 -15755 -17349 -16759 -10041 -2604 7134 17465 18364 9293 2752 2623 5368 -9045 -25182 -29278
12812 -29278 -23041 -19770 -10646 -19773 -19061 -11962 -10782 -16918 1518 910 3821 5533 4676 712 -8825
12797 -8825 -11930 2186 8510 11043 20955 20675 405 -13952 -13583 -5873 -4547 -7648 1480 -1172
12783 -1172 -7048 -1852 -11538 -15197 -26124 -21419 -9820 -10126 -15914 -14457 -20472 -18985 -11523 -1666
12769 -1666 -6972 -1957 5120 -7198 -11734 -22723 -25985 -17193 -11065 -13962 -25934 -24405 -8195 4595
12755 4595 4521 5800 -5031 -5397 3128 -268 4917 5905 14249 13645 2742 1825 3611 3517 -3362 -9888
12739 -9888 -9158 3391 2198 -5641 -9359 -4984 -10321 -12140 -5538 -1632 5562 8859 11560 10005 1603
12724 1603 -1108 6582 9972 13102 9497 -11172 -8734 997 6667 3631 8642 1169 1876 -10903
$$ packed form
12826a5755j594N90O718P437R738J0331Q99r071o541j29K745j4413j6137m096
12812b9278O237L271R124r127P12P099J180o136J8436o08K911J712q57l964r537
12797h825l105J4116O324K533R912k80k0270j4357L69P710J326l101R128k652
12783a172n876N196r686l659j0927M705J1599l06n788J457o015J487P462R857
12769a666n306N015P077j2318m536j0989l262Q792O128k897j1972J529J6210J2790
12755D595p4J279j0831l66Q525l396N185R88Q344o04j0903r17J786r4o879o526
12739i888P30J2549j193p839l718M375n337j819O602L906P194L297K701j555q402
12724A603k711P690L390L130l605k0669K438R731N670l036N011p473P07j2779
$$ plain form
12710 -10903 -14218 -10483 -7590 -5833 558 7471 2951 9365 11222 6821 5207 7216 4723 10374
12696 10374 7047 5367 12846 7365 18843 7840 -5765 -9997 -9831 -4427 -1704 -6281 -3235 -1698
12682 -1698 12898 21780 31815 28342 10445 -9538 -20792 -9183 -7647 2199 7732 4367 16343
12669 16343 19756 35088 32076 -3004 -6426 -16521 -19510 -30821 -23225 -8784 -18080 -13755 -13107
12656 -13107 -16231 6 -4014 -8076 -17763 -6347 -4266 -5901 8960 28614 24063 19828 11479
12643 11479 4156 311 7309 14504 19824 20120 19267 25026 40798 37977 33590 40429 69796 105722
12629 105722 135861 163676 134694 81919 42471 18389 11684 961 -3884 -5553 -4012 -17097
12617 -17097 -22017 -15990 -7385 -3941 2207 -4812 -9078 -5408 8627 16195 5679 871 6347 12833
$$ packed form
12710a0903l315L735K893J757O391O913m520O414J857m401j614K009k493N651
12696A0374l327j680P479n481J1478j1003j3605m232J66N404K723m577L046J537
12682a698J4596Q882J0035l473j7897j9983j1254J1609J536R846N533l365J1976
12669A6343L413J5332l012l5080l422j0095k989j1311P596J4441r296M325O48
12656a3107l124J6237m020m062r687J1416K081j635J4861J9654m551m235q349
12643A1479p323l845O998P195N320K96q53N759J5772k821m387O839K9367L5926
12629A05722L0139K7815k8982n2775l9448k4082o705j0723m845j669J541j3085
12617a7097m920O027Q605L444O148p019m266L670J4035P568j0516m808N476O486
$$ plain form
12603 12833 5144 4317 5992 -1830 -7665 8294 14415 19430 11073 -3377 847 14919 4541 -8395
12589 -8395 3018 10397 4840 16149 10235 -9023 -1618 8239 16444 24070 13008 -1812 -15747
12576 -15747 -5649 12697 15202 4201 -4643 3427 2042 -8332 -11014 -19394 -13145 -23131 -21304
12563 -21304 -23088 -13547 -7306 -13276 -7809 3924 8103 153 -10064 -15787 -19128 216 8456 -1697
12549 -1697 15205 23701 13999 8102 6669 2071 -1042 -5392 -15987 -20668 -19432 -8101 8351 8275
12535 8275 7747 1414 728 -2095 -7876 -5763 8281 5232 -3843 -1203 -47 -18199 -32234 -22685
12521 -22685 -8792 -16459 -20448 -17639 -9218 -15118 -25801 -23674 -19493 -11427 -4101 -10536 -11939 6213
12507 6213 5030 -8238 9081 28520 36872 32802 11133 974 -9543 -12763 4974 4141 1613
$$ packed form
12603A2833p689q27J675p822n835J5959O121N015q357j4450M224J4072j0378j2936
12589h395J1413P379n557J1309n914j9258P405R857Q205P626j1062j4820j3935
12576a5747J0098J8346K505j1001q844Q070j385j0374k682q380O249r986J827
12563b1304j784R541O241n970N467J1733M179p950j0217n723l341J9344Q240j0153
12549a697J6902Q496r702n897j433m598l113m350j0595m681J236J1331J6452p6
12535H275n28o333o86k823n781K113J4044l049r075K640J156j8152j4035R549
12521b2685J3893p667l989K809Q421n900j0683K127M181Q066P326o435j403J8152
12507F213j183j3268J7319J9439Q352m070k1669j0159j0517l220J7737q33k528
$$ plain form
12494 1613 -4770 -18112 -34371 -33294 -8310 15760 6331 -14590 -25716 -18931 -5858 5141 19093
12481 19093 21771 8939 6538 7890 7540 6266 6307 -4334 -14309 -5190 4417 -7145 -13820 -8221
12467 -8221 -237 -10235 114 17446 24263 23567 16243 11949 12187 1522 -1700 594 7579 15289
12453 15289 18110 2592 -1103 1574 1049 -2652 -7105 -10608 -11326 -25057 -13481 -16155 -5519 13107
12439 13107 19011 7756 -1797 -2185 10164 7394 10663 18906 22396 13462 -2135 -27639 -19745 -3182
12425 -3182 4101 591 -346 962 1657 9567 18990 15318 16168 17684 11069 14009 6562 -14997 -14201
12410 -14201 -21253 -28384 -15029 -10929 -10269 -560 -8206 -6902 5112 16321 16822 3905 -13931 -20764
12396 -20764 -15266 -8867 4082 9163 320 -3780 51 -10690 -16931 -3158 2253 4830 -8609
$$ packed form
12494A613o383j3342j6259J077K4984K4070r429k0921j1126O785J3073J0999J3952
12481A9093K678j2832k401J352l50j274M1j0641r975R119R607j1562o675N599
12467h221P984r998J0349J7332O817o96p324m294K38j0665l222K294O985P710
12453A5289K821j5518l695K677n25l701m453l503p18j3731J1576k674J0636J8626
12439A3107N904j1255r553l88J2349k770L269Q243L490q934j5597k5504P894J6563
12425c182P283l510r37J308O95P910R423l672Q50J516o615K940p447k1559P96
12410a4201p052p131J3355M100O60R709p646J304J2014J1209N01j2917j7836o833
12396b0764N498O399J2949N081q843m100L831j0741o241J3773N411K577j3439
$$ plain form
12383 -8609 -20979 -19078 -6518 -11488 -6682 -6730 -18495 -12262 -12683 -17992 -18870 -5826 897 -4275 2630
12368 2630 9051 15 -12949 984 16001 8196 -626 1671 -4686 -12577 4147 -203 -18960
12355 -18960 -16947 -19054 -14544 -17618 -16879 -7156 -8678 -13201 -15064 -28321 -25490 -24070 -17868 -9939
12341 -9939 -12204 -19812 -20120 4134 18344 19135 13909 9024 15523 8518 3371 -5483 2600 6624 8238
12326 8238 -4522 -18019 -22955 -27780 -24096 -18199 -9598 -6333 7172 6041 -3390 -5751 -10573 -1522
12312 -1522 2082 5738 -1107 -5304 -18644 -28578 -23304 -16478 -15550 -30771 -26500 -19635 -15155 -12215
12298 -12215 -13344 -16595 7011 18642 14919 4741 2148 5852 10478 18016 10558 -7293 -14704
12285 -14704 -20321 -9788 3339 10101 850 -882 -165 -5495 -14764 -15720 -17642 -18372 -3608 11242
$$ packed form
12383h609j2370J901J2560m970M806m8j1765O233m21n309q78J3044O723n172O905
12368B630O421r036j2964J3933J5017p805q822K297o357p891J6724m350j8757
12355a8960K013k107M510l074P39R723j522m523j863j3257K831J420O202P929
12341i939k265p608l08K4254J4210P91n226m885O499p005n147q854Q083M024J614
12326H238j2760j3497m936m825L684N897Q601L265J3505j131r431k361m822R051
12312a522L604L656o845m197j3340r934N274O826R28j5221M271O865M480K940
12298a2215j129l251K3606J1631l723j0178k593L704M626P538p458j7851p411
12285a4704n617J0533J3127O762r251j732P17n330r269r56j922p30J4764J4850
$$ plain form
12271 11242 5584 -12639 -24885 -28157 -17872 -14265 -2370 6434 8121 5701 -3393 633 653 -3873
12257 -3873 98 9208 16498 18992 19787 16398 4652 8922 9103 13570 11490 7410 -6723 1402 21984
12242 21984 27163 14540 63 -8928 -593 -107 -6831 -12281 -13027 -14824 -17875 -21443 -37139 -32295
12228 -32295 -12340 -5668 -8933 -4338 -9130 -1614 -13865 -17264 -5924 -14796 -18627 -17970 -6660 4450
12214 4450 -4019 -12603 -15896 -17171 -15913 -8000 -3137 3271 283 16264 19152 13781 9801 4867
12200 4867 9124 -4333 -11334 -13795 -2080 6690 1653 1228 -3738 -18213 -17145 -20785 -15423 -15533
12186 -15533 -27218 -33674 -17676 -5859 1467 -8189 8710 9520 12132 -399 -12359 -16274 -5317
12173 -5317 344 5982 -6548 -18482 -19372 -3972 9800 14362 1571 1639 7883 8254 6025 5460 14708
$$ packed form
12271A1242n658j8223j2246l272J0285L607J1895Q804J687k420r094M026K0m526
12257c873L971R110P290K494P95l389j1746M270J81M467k080m080j4133Q125K0582
12242B1984N179j2623j4477q991Q335M86o724n450p46j797l051l568j5696M844
12228c2295J9955O672l265M595m792P516j2251l399J1340q872l831O57J1310J1110
12214D450q469q584l293j275J258P913M863O408k988J5981K888n371l980m934
12200D867M257j3457p001k461J1715Q770n037m25m966j4475J068l640N362j10
12186a5533j1685o456J5998J1817P326r656J6899Q10K612j2531j1960l915J0957
12173e317N661N638j2530j1934q90J5400J3772M562j2791O8O244L71k229n65R248
$$ plain form
12158 14708 12580 4636 2298 3839 -12711 -15826 219 14253 15013 11797 12121 10859 10322 8834
12144 8834 8255 3628 4770 8713 -733 -11522 2565 -3304 -9347 -8966 -6287 -21515 -14301 1317
12130 1317 10323 -9139 -15435 -9946 -16328 -26221 -31451 -21619 -8166 -8382 -6512 -16488 -23396 -14053
12116 -14053 -9624 -9211 -12243 -30178 -34649 -25230 -6983 1733 2795 5949 8085 1333 -7330 -6701
12102 -6701 5753 1106 12728 18327 12057 6108 9457 7191 6376 16530 17691 6831 -10356 -9732
12088 -9732 -1525 -3818 -4836 -3836 -10816 -23210 -6282 7240 9175 7958 -1021 -6014 -12850 -17017
12074 -17017 -4253 -1954 2903 2730 -3737 -9087 -2813 -946 14281 2953 -1514 2108 -6946 -5330
12060 -5330 10353 14559 7402 -19068 -29637 -31306 -18088 -14001 -10389 -6507 -15953 414 8971
$$ packed form
12158A4708k128p944k338J541j6550l115J6045J4034P60l216L24j262n37j488
12144H834n79m627J142L943r446j0789J4087n869o043L81K679j5228P214J5618
12130A317R006j9462o296N489o382r893n230R832J3453k16J870r976o908R343
12116a4053M429M13l032j7935m471R419J8247Q716J062L154K136o752q663O29
12102f701J2454m647J1622N599o270n949L349k266q15J0154J161j0860j7187O24
12088i732Q207k293j018J000o980j2394J6928J3522J935j217q979m993o836m167
12074a7017J2764K299M857j73o467n350O274J867J5227j1328m467L622r054J616
12060e330J5683M206p157k6470j0569j669J3218M087L612L882r446J6367Q557
$$ plain form
12047 8971 13521 15078 17984 8393 3038 7412 -8209 -15358 -4623 461 9013 11610 12775 12902
12033 12902 6796 -5757 5128 13502 8641 11584 13183 16852 12755 -1308 9495 4547 -4646
$$ packed form
12047H971M550J557K906r591n355M374j5621p149J0735N084Q552K597J165J27
12033A2902o106j2553J0885Q374m861K943J599L669m097j4063J0803m948r193
$$ [...]
##END NTUPLES=NMR SPECTRUM
##END=
