##TITLE=Analysis number 327746
Compound Code cc 21913
Book Reference 235781 a
Project Code adrs flro3
Chemist Name jom
##JCAMPDX= 6.0         $$ Bruker NMR JCAMP-DX V2.0
##DATA TYPE= NMR SPECTRUM
##DATA CLASS= NTUPLES
##ORIGIN= Bruker BioSpin GmbH
##OWNER= nmr
$$ XWIN-NMR		Version 3.5
$$ Tue Apr  3 13:13:04 2007 GMT Daylight Time (UT+1h)  MAYBRIDGE\nmr@NMR_250MHZ
##.OBSERVE FREQUENCY= 250.131544655141
##.OBSERVE NUCLEUS= ^1H
##.ACQUISITION MODE= SIMULTANEOUS (DQD)
##.ACQUISITION SCHEME= undefined
##.AVERAGES= 16
##.DIGITISER RES= 18
##SPECTROMETER/DATA SYSTEM= dpx250
##.PULSE SEQUENCE= zg30
##.SOLVENT NAME= CDCl3
##.SHIFT REFERENCE= (INTERNAL, CDCl3, 0, 16.522)
##AUDIT TRAIL= $$ (NUMBER, WHEN, WHO, WHERE, WHAT)
$$ ##TITLE= Audit trail, XWIN-NMR		Version 3.5
$$ ##JCAMPDX= 5.01
$$ ##ORIGIN= Bruker BioSpin GmbH
$$ ##OWNER= nmr
$$ C:\u/data/dgb/nmr/ADRS/360/pdata/1/auditp.txt
$$ ##AUDIT TRAIL=  $$ (NUMBER, WHEN, WHO, WHERE, WHAT)
(   1,<2007-04-03 13:12:40.38 +100>,<MAYBRIDGE\nmr>,<NMR_250MHZ>,
      <created by zg, POWCHK disabled, PULCHK disabled
       configuration hash MD5:
       49 4B E0 1D 92 C2 6B 37 9F E6 65 BC 52 41 86 1D
       data hash MD5: 64K
       01 C4 00 FD 3F B0 C3 47 7E 38 A7 67 D9 71 DA 2A>)
(   2,<2007-04-03 13:12:53.04 +100>,<MAYBRIDGE\nmr>,<NMR_250MHZ>,
      <Start of raw data processing
       ef LB = 0.3 FT_mod = 6 PKNL = 1 SI = 32K 
       data hash MD5: 32K
       14 F6 5E 1F 31 81 16 04 41 47 8D A0 57 CF 8C B7>)
(   3,<2007-04-03 13:12:54.83 +100>,<MAYBRIDGE\nmr>,<NMR_250MHZ>,
      <apk 
       data hash MD5: 32K
       91 8A 4C 17 18 EE 12 06 A6 0D 0B A6 C2 C0 ED 68>)
(   4,<2007-04-03 13:12:55.63 +100>,<MAYBRIDGE\nmr>,<NMR_250MHZ>,
      <abs ABSG = 5 
       data hash MD5: 32K
       B9 AB F9 27 54 AE E8 93 B5 D0 1D E9 5A 17 F0 ED>)
$$ ##END=
$$ 
$$ hash MD5
$$ 50 1D D9 6A 8F 4C 1B 7B 10 57 DD 15 E1 90 66 0D
##$RELAX= 
##$RELAX= 
##$RELAX= 
##$RELAX= 
##$RELAX= 
##$RELAX= 
##$RELAX= 
$$ Bruker specific parameters
$$ --------------------------
##$DU= <C:\u>
##$EXPNO= 360
##$NAME= <ADRS>
##$PROCNO= 1
##$TYPE= <nmr>
##$USER= <dgb>
##$AMP= (0..31)
100 100 100 100 100 100 100 100 100 100 100 100 100 100 100 100 100 100 
100 100 100 100 100 100 100 100 100 100 100 100 100 100 
##$AQSEQ= 0
##$AQ_mod= 3
##$AUNM= <au_zg>
##$AUTOPOS= <11 >
##$BF1= 250.13
##$BF2= 250.13
##$BF3= 250.13
##$BF4= 250.13
##$BF5= 500.13
##$BF6= 500.13
##$BF7= 500.13
##$BF8= 500.13
##$BYTORDA= 1
##$CFDGTYP= 0
##$CFRGTYP= 5
##$CHEMSTR= <none>
##$CNST= (0..31)
1 1 145 1 1 1 1 1 1 1 1 1 1 1 1 1 1 1 1 1 1 1 1 1 1 1 1 1 1 1 1 1 
##$CPDPRG= <>
##$CPDPRG1= <>
##$CPDPRG2= <>
##$CPDPRG3= <>
##$CPDPRG4= <mlev>
##$CPDPRG5= <mlev>
##$CPDPRG6= <mlev>
##$CPDPRG7= <mlev>
##$CPDPRG8= <mlev>
##$CPDPRGB= <>
##$CPDPRGT= <>
##$D= (0..31)
0 1 0 0 0 0 0 0 0 0.06 0 0 0 0 0 0 0.0002 0 0 0 0 0 0 0 0 0 0 0 0 0 0 
0 
##$DATE= 1175602359
##$DBL= (0..7)
120 120 120 120 120 120 120 120 
##$DBP= (0..7)
150 150 150 150 150 150 150 150 
##$DBP07= 0
##$DBPNAM0= <>
##$DBPNAM1= <>
$$ [...]
##$SUBNAM7= <"">
##$SUBNAM8= <"">
##$SUBNAM9= <"">
##$SW= 20.6930455092707
##$SWIBOX= (0..15)
0 0 3 0 0 0 0 0 0 0 0 0 0 0 0 0 
##$SW_h= 5175.983436853
##$TD= 65536
##$TD0= 1
##$TE= 683.16
##$TE2= 300
##$TE3= 300
##$TEG= 300
##$TL= (0..7)
0 120 120 120 120 120 120 120 
##$TP= (0..7)
150 150 150 150 150 150 150 150 
##$TP07= 0
##$TPNAME0= <>
##$TPNAME1= <>
##$TPNAME2= <>
##$TPNAME3= <>
##$TPNAME4= <>
##$TPNAME5= <>
##$TPNAME6= <>
##$TPNAME7= <>
##$TPOAL= (0..7)
0.5 0.5 0.5 0.5 0.5 0.5 0.5 0.5 
##$TPOFFS= (0..7)
0 0 0 0 0 0 0 0 
##$TUNHIN= 0
##$TUNHOUT= 0
##$TUNXOUT= 0
##$USERA1= <user>
##$USERA2= <user>
##$USERA3= <user>
##$USERA4= <user>
##$USERA5= <user>
##$V9= 5
##$VALIST= <valist>
##$VCLIST= <CCCCCCCCCCCCCCC>
##$VD= 0
##$VDLIST= <DDDDDDDDDDDDDDD>
##$VPLIST= <PPPPPPPPPPPPPPP>
##$VTLIST= <TTTTTTTTTTTTTTT>
##$WBST= 1024
##$WBSW= 4
##$XGAIN= (0..3)
0 0 0 0 
##$XL= 0
##$YL= 0
##$YMAX_a= 569935
##$YMIN_a= -402306
##$ZGOPTNS= <>
##$ZL1= 120
##$ZL2= 120
##$ZL3= 120
##$ZL4= 120
##$ABSF1= 16.522
##$ABSF2= -4.171173
##$ABSG= 5
##$ABSL= 3
##$ALPHA= 0
##$AQORDER= 0
##$ASSFAC= 0
##$ASSFACI= 0
##$ASSFACX= 0
##$ASSWID= 0
##$AUNMP= <proc_1d>
##$AZFE= 0.1
##$AZFW= 0.1
##$BCFW= 0
##$BC_mod= 0
##$BYTORDP= 0
##$COROFFS= 0
##$CY= 12.5
##$DATMOD= 1
##$DC= 0
##$DFILT= <>
##$DTYPP= 0
##$F1P= 14.0000005364418
##$F2P= -0.99999901652339
##$FCOR= 0.5
##$FTSIZE= 32768
##$FT_mod= 6
##$GAMMA= 0
##$GB= 0
##$INTBC= 1
##$INTSCL= 1
##$ISEN= 128
##$LB= 0.3
##$LEV0= 0
##$LPBIN= 0
##$MAXI= 10000
##$MC2= 0
##$MEAN= 0
##$ME_mod= 0
##$MI= 0
##$NCOEF= 0
##$NC_proc= -4
##$NLEV= 6
##$NOISF1= 0
##$NOISF2= 0
##$NSP= 0
##$NTH_PI= 0
##$NZP= 0
##$OFFSET= 16.522
##$PC= 1
##$PHC0= 80.87949
##$PHC1= 5.312703
##$PH_mod= 1
##$PKNL= yes
##$PPARMOD= 0
##$PSCAL= 4
##$PSIGN= 0
##$REVERSE= no
##$SF= 250.13
##$SI= 32768
##$SIGF1= 0
##$SIGF2= 0
##$SINO= 400
##$SIOLD= 32768
##$SREGLST= <1H.CDCl3>
##$SSB= 0
##$STSI= 32768
##$STSR= 0
##$SW_p= 5175.98343685301
##$SYMM= 0
##$S_DEV= 0
##$TDeff= 65536
##$TDoff= 0
##$TI= <Analysis number 999999
Compound Code 99
Book Reference 9
Project Code 9>
##$TILT= no
##$TM1= 0
##$TM2= 0
##$TOPLEV= 0
##$USERP1= <user>
##$USERP2= <user>
##$USERP3= <user>
##$USERP4= <user>
##$USERP5= <user>
##$WDW= 1
##$XDIM= 32768
##$YMAX_p= 369446151
##$YMIN_p= -97102
$$ End of Bruker specific parameters
$$ ---------------------------------
##NTUPLES= NMR SPECTRUM
##VAR_NAME=  FREQUENCY,     SPECTRUM/REAL,   SPECTRUM/IMAG
##SYMBOL=    X,             R,               I
##VAR_TYPE=  INDEPENDENT,   DEPENDENT,       DEPENDENT
##VAR_FORM=  AFFN,          ASDF,            ASDF
##VAR_DIM=   32768,         32768,           32768
##UNITS=     HZ,            ARBITRARY UNITS, ARBITRARY UNITS
##FACTOR=    0.157963299565203, 1,           1
##FIRST=     4132.6476996994, 0,             0
##LAST=      -1043.33573715361, 0,           0
##MIN=       -1043.33573715361, -97102,      0
##MAX=       4132.6476996994, 369446151,     0
$$ Real data points
##PAGE= N=1
##DATA TABLE= (X++(R..R)), XYDATA
$$ [...]
$$ plain form
18489 1227099 1284299 1364062 1437246 1451652 1421367 1366133 1308570 1266137 1259850 1272788 1318417
18478 1318417 1417933 1590108 1853031 2233797 2714004 3155202 3411831 3491288 3464449 3427693
18468 3427693 3414427 3369489 3233546 3013891 2771174 2615912 2555952 2646948 2806655 2973384
18458 2973384 3103866 3141353 3049881 2876164 2632194 2388339 2193051 2071248 2020159 2027664
18448 2027664 2096003 2243440 2434965 2627733 2760581 2805884 2769084 2684481 2575824 2451950
18438 2451950 2341308 2303378 2342509 2462881 2591208 2590319 2457486 2228310 1991852 1826356
18428 1826356 1726276 1672563 1675906 1683352 1686058 1699386 1696342 1665957 1623977 1568087 1522371 1464558
18416 1464558 1419942 1379316 1359499 1344671 1345755 1351886 1369991 1401038 1446360 1515092 1594171 1660986
$$ packed form
18489A227099N7200P9763P3184J4406l0285n5234n7563m2433o287J2938M5629
18478A318417R9516J72175K62923L80766M80207M41198K56629P9457k6839l6756
18468C427693j3266m4938j35943k19655k42717j55262n9960R0996J59707J66729
18458B973384J30482L7487r1472j73717k43970k43855j95288j21803n1089P505
18448B027664O8339J47437J91525J92768J32848M5303l6800q4603j08657j23874
18438B451950j10642l7930L9131J20372J28327q89j32833k29176k36458j65496
18428A826356j00080n3713L343P446K706J3328l044l0385m1980n5890m5716n7813
18416A464558m4616m0626j9817j4828J084O131J8105L1047M5322O8732P9079O6815
$$ plain form
18404 1660986 1707167 1716285 1699392 1670712 1628550 1595634 1576277 1558392 1577614 1617998 1672947
18393 1672947 1745408 1830879 1924162 1991563 2030503 2061489 2090784 2103806 2105258 2124972 2159281
18382 2159281 2217561 2270771 2339963 2441388 2555777 2706505 2885537 3109616 3382750 3719895
18372 3719895 4169594 4767615 5570235 6717769 8390348 10871307 14513289 19423963 25184916
18363 25184916 30987358 35640705 38514944 39089858 37297263 33573638 28722471 23718463
18355 23718463 19536536 16460718 14417672 13033756 12035334 11266628 10627468 10090796 9649644
18346 9649644 9283307 8949056 8649231 8386742 8174308 7988518 7848462 7733228 7652219 7590281
18336 7590281 7553217 7542522 7559519 7599060 7674903 7812214 8010636 8273315 8640066 9142002
$$ packed form
18404A660986M6181R118j6893k8680m2162l2916j9357j7885J9222M0384N4949
18393A672947P2461Q5471R3283O7401L8940L0986K9295J3022J452J9714L4309
18382B159281N8280N3210O9192J01425J14389J50728J79032K24079K73134L37145
18372C719895M49699N98021Q02620J147534J672579K480959L641982M910674N760953
18363B5184916N802442M653347K874239N74914j792595l723625m851167n004008
18355B3718463m181927l075818k043046j383916r98422p68706o39160n36672m41152
18346I649644l66337l34251k99825k62489k12434j85790j40056j15234q1009o1938
18336G590281l7064j0695J6997L9541P5843J37311J98422K62679L66751N01936
$$ plain form
18326 9142002 9816008 10722188 11919972 13519316 15716295 18813802 23263686 29603140
18318 29603140 38217939 48939268 61188865 74143572 87172198 98925692 107816683
18311 107816683 112957759 114324039 111736486 106201274 99538626 93001493 87683035 83817337
18303 83817337 81768073 81106286 80945262 80970846 81160872 81669727 83556668 87442166 92474282
18294 92474282 97004830 101035041 105411829 109473625 111593169 111198769 108992490 105678133
18286 105678133 101963915 98106715 94149549 90903456 89270105 88551313 87688427 86888762
18278 86888762 86255271 84804748 81744715 77417572 72205855 66942932 62288927 58670221
18270 58670221 56802778 58162893 64122368 74928913 88666108 100802840 107125891 106771404
$$ packed form
18326I142002O74006R06180J197784J599344K196979L097507M449884O339454
18318B9603140Q614799J0721329J2249597J2954707J3028626J1753494Q890991
18311A07816683N141076J366280k587553n535212o662648o537133n318458l865698
18303H3817337k049264o61787j61024K5584J90026N08855J886941L885498N032116
18294I2474282M530548M030211M376788M061796K119544l94400k206279l314357
18286A05678133l714218l857200l957166l246093j633351p18792q62886p99665
18278H6888762o33491j450523l060033m327143n211717n262923m654005l618706
18270E8670221j867443J360115N959475J0806545J3737195J2136732O323051l54487
$$ plain form
18262 106771404 100692695 91078721 79784849 67916866 56266207 46242707 38579123
18255 38579123 33138656 29267152 26407837 24130718 22144619 20304269 18597721 16994469
18247 16994469 15483893 14084177 12814768 11719382 10782607 9997587 9330202 8727301 8196738
18238 8196738 7739877 7302842 6873229 6450985 6033508 5657183 5322241 5020567 4742018
18229 4742018 4507372 4304527 4133608 3977817 3822843 3697684 3601402 3524713 3473388 3441320
18219 3441320 3379534 3303328 3235119 3165826 3108913 3042387 2971753 2924796 2881223 2833771 2802292
18208 2802292 2799703 2812813 2851295 2904892 2935511 2966440 2990277 2996119 3047850 3124422 3231045
18197 3231045 3371176 3541598 3738635 3956662 4205725 4506369 4858199 5273944 5772634
$$ packed form
18262A06771404o078709r613974j1293872j1867983j1650659j0023500p663584
18255C8579123n440467l871504k859315k277119j986099j840350j706548j603252
18247A6994469j510576j399716j269409j095386r36775p85020o67385o02901n30563
18238H196738m56861m37035m29613m22244m17477l76325l34942l01674k78549
18229D742018k34646k02845j70919j55791j54974j25159r6282p6689n1325l2068
18219C441320o1786p6206o8209o9293n6913o6526p0634m6957m3573m7452l1479
18208B802292k589J3110L8482N3597L0619L0929K3837N842N1731P6572J06623
18197C231045J40131J70422J97037K18027K49063L00644L51830M15745M98690
$$ plain form
18188 5772634 6404880 7206122 8165525 9327417 10792035 12811792 15713321 19813233 25129202
18179 25129202 31182451 37468620 43392552 47642928 50109107 51597360 52606353 54431278
18171 54431278 57503073 61368395 65629771 68621112 69611624 69193930 67346957 65153242
18163 65153242 63630956 62461130 61168814 60092463 59350032 58968898 59283247 60034354 60394337
18154 60394337 58946453 55460031 50081293 43259027 36621611 30937540 26480144 23257303
18146 23257303 20961918 19295860 18061336 17147716 16458327 15857135 15268906 14657850 14027038
18137 14027038 13486811 13109077 12953309 13078443 13583188 14609404 16356081 18936484 22119509
18128 22119509 25589930 29094153 31795455 33037691 33202038 32422868 31335345 30886225
$$ packed form
18188E772634O32246Q01242R59403J161892J464618K019757K901529M099912N315969
18179B5129202O053249O286169N923932M250376K466179J488253J008993J824925
18171E4431278L071795L865322M261376K991341R90512m17694j846973k193715
18163F5153242j522286j169826j292316j076351p42431l81134L14349P51107L59983
18154F0394337j447884l486422n378738o822266o637416n684071m457396l222841
18146B3257303k295385j666058j234524r13620o89389o01192n88229o11056o30812
18137A4027038n40227l77734j55768J25134N04745J026216J746677K580403L183025
18128B2119509L470421L504223K701302J242236J64347p79170j087523m49120
$$ plain form
18120 30886225 31156066 32151124 33899165 35754447 37356393 38920747 40311245 41796104
18112 41796104 43798890 46140059 49163567 52497699 52659027 50033119 45919756 40924181
18104 40924181 37701088 35334398 32844179 29934430 26438023 22909697 19742073 17044913
18096 17044913 14970910 13396180 12096660 11015819 10097514 9326749 8651270 8020886 7419603
18087 7419603 6875729 6380428 5946290 5557697 5205093 4909939 4653975 4424756 4228542
18078 4228542 4068541 3952640 3884300 3844128 3828555 3819324 3831418 3853093 3907593 3969232 4050249
18067 4050249 4129697 4249453 4412033 4593674 4811012 5060582 5349933 5696993 6115931 6633034
18057 6633034 7260877 8095282 9250373 10891224 13273760 16629450 20864721 25235463
$$ packed form
18120C0886225K69841R95058J748041J855282J601946J564354J390498J484859
18112D1796104K002786K341169L023508L334132J61328k625908m113363m995575
18104D0924181l223093k366690k490219k909749l496407l528326l167624k697160
18096A7044913k074003j574730j299520j080841r18305p70765o75479o30384o01283
18087G419603n43874m95301m34138l88593l52604k95154k55964k29219j96214
18078D228542j60001j15901o8340m0172j5573r231J2094K1675N4500O1639Q1017
18067D050249P9448J19756J62580J81641K17338K49570K89351L47060M18938N17103
18057F633034O27843Q34405J155091J640851K382536L355690M235271M370742
$$ plain form
18049 25235463 29368783 33820338 38760109 43385715 46637740 49406386 52146395 55454683
18041 55454683 59123967 62847847 66049171 68846251 71044860 72599266 72292839 70826325
18033 70826325 68592154 65410039 61930671 58618589 55485260 51608920 47346982 42978042
18025 42978042 38472095 34293104 30479797 26878926 23692900 21271608 19543156 18319865
18017 18319865 17477681 16928946 16562418 16266193 15941460 15537031 15042092 14544578 14230920
18008 14230920 14313041 14941503 16196606 18118912 20532760 22870053 25092480 27706542
18000 27706542 30801922 33668555 35458378 36884272 38264960 40320397 42637468 44709347
17992 44709347 46379924 48323225 50501326 52038854 52169614 51053309 49795023 48223943
$$ packed form
18049B5235463M133320M451555M939771M625606L252025K768646K740009L308288
18041E5454683L669284L723880L201324K797080K198609J554406l06427j466514
18033G0826325k234171l182115l479368l312082l133329l876340m261938m368940
18025D2978042m505947m178991l813307l600871l186026k421292j728452j223291
18017A8319865q42184n48735l66528k96225l24733m04429m94939m97514l13658
18008A4230920Q2121O28462J255103J922306K413848K337293K222427K614062
18000B7706542L095380K866633J789823J425894J380688K055437K317071K071879
17992D4709347J670577J943301K178101J537528J30760j116305j258286j571080
$$ plain form
17984 48223943 46282376 44023134 41814944 39742964 37300280 34554543 31530169 28451984
17976 28451984 25617444 22790868 19919943 17163796 14967867 13327366 12036777 11001412
17968 11001412 10160254 9434781 8769492 8165524 7624896 7141020 6697387 6300123 5966757
17959 5966757 5726823 5616140 5624643 5693212 5668143 5463466 5127221 4734501 4431294 4220727
17949 4220727 4102335 4039952 4039107 4112139 4282915 4597273 5017609 5397889 5625563 5630326 5388675
17938 5388675 4972701 4551600 4198819 4005237 3945159 3955013 4022526 4160159 4379377 4710842
17928 4710842 5142026 5494989 5670587 5754054 5829664 6096551 6605123 7187249 7624004 7820417
17918 7820417 7768476 7616601 7532098 7636091 7970628 8492209 9209972 10198998 11538775 13244835
$$ packed form
17984D8223943j941567k259242k208190k071980k442684k745737l024374l078185
17976B8451984k834540k826576k870925k756147k195929j640501j290589j035365
17968A1001412q41158p25473o65289o03968n40628m83876m43633l97264l33366
17959E966757k39934j10683Q503O8569k5069k04677l36245l92720l03207k10567
17949D220727j18392o2383q45P3032J70776L14358M20336L80280K27674M763k41651
17938E388675m15974m21101l52781j93582o0078R854O7513J37633K19218L31465
17928D710842M31184L52963J75598Q3467P5610K66887N08572N82126M36755J96413
17918G820417n1941j51875q4503J03993L34537N21581P17763R89026J339777J706060
$$ plain form
17908 13244835 15218684 17277622 19459673 21903175 25066386 29654268 36644862 47484499
17900 47484499 64402075 90009402 123447948 152716247 161920447 154119657 133208690
17893 133208690 109974418 94627839 86414448 83315834 85466272 94910361 113951334
17886 113951334 144931545 186883030 230015547 260901906 269601982 253198128 218225074
17879 218225074 178623798 143573560 118748342 104807227 99260579 100538579 107713323
17872 107713323 120989092 142226274 169892358 191850001 192300566 174560788 142858358
17865 142858358 109157364 85290310 69934298 59676629 52527240 47533647 43952258
17858 43952258 41203079 38900261 36656262 33917670 30714276 27495874 24593954 22138283
$$ packed form
17908A3244835J973849K058938K182051K443502L163211M587882O990594J0839637
17900D7484499J6917576K5607327L3438546K9268299R204200p800790k0910967
17893A33208690k3234272j5346579q213391l098614K150438R444089J9040973
17886A13951334L0980211M1951485M3132517L0886359Q700076j6403854l4973054
17879B18225074l9601276l5050238k4825218j3941115n546648J278000P174744
17872A07713323J3275769K1237182K7666084K1957643M50565j7739778l1702430
17865A42858358l3700994k3867054j5356012j0257669p149389m993593l581389
17858D3952258k749179k302818k243999k738592l203394l218402k901920k455671
$$ plain form
17850 22138283 20128755 18507376 17237271 16236022 15399712 14682070 13961510 13113269 12128043
17841 12128043 11044542 9954530 8975618 8137595 7436268 6818806 6284997 5803655 5375939
17832 5375939 4981267 4606442 4259384 3932397 3626401 3338099 3091482 2872425 2684054
17823 2684054 2534309 2401276 2259486 2125224 1991182 1859362 1733745 1626726 1537025 1458111
17813 1458111 1370450 1290787 1236338 1199942 1172936 1152746 1145760 1121988 1089179 1078565 1084713 1099984
17801 1099984 1125194 1159168 1185690 1217066 1253336 1307307 1382560 1477033 1586387 1655619 1675356
17790 1675356 1662852 1622581 1562255 1468624 1373391 1295217 1234220 1175048 1120321 1092185 1070112
17779 1070112 1057138 1045963 1028885 1010153 993014 979988 953655 916066 888298 845319 782606
$$ packed form
17850B2138283k009528j621379j270105j001249q36310p17642p20560q48241r85226
17841A2128043j083501j090012r78912q38023p01327o17462n33809m81342m27716
17832E375939l94672l74825l47058l26987l05996k88302k46617k19057j88371
17823B684054j49745j33033j41790j34262j34042j31820j25617j07019q9701p8914
17813A458111q7661p9663n4449l6396k7006k0190o986k3772l2809j0614O148J5271
17801A099984K5210L3974K6522L1376L6270N3971P5253R4473J09354O9232J9737
17790A675356j2504m0271o0326r3631r5233p8174o0997n9172n4727k8136k2073
17779A070112j2974j1175j7078j8732j7139j3026k6333l7589k7768m2979o2713
$$ plain form
17768 782606 740155 700082 673151 653031 631381 627679 636109 653954 677952 698041 698913 692834
17756 692834 669559 627209 585439 542454 521466 521104 522799 528062 539768 576267 621153 670374
17744 670374 724325 754068 729303 675829 609599 577170 577056 547549 508471 483503 483439 467478
17732 467478 435023 405259 412262 417933 406688 389745 381844 389564 377826 372831 367077 365781 364507
17719 364507 355747 344774 339455 318072 305932 306483 293848 280679 283460 287527 288670 291042 264144
17706 264144 251138 239286 225721 223591 226338 227427 227522 234105 222456 194103 183682 173258 163544
17693 163544 156943 158775 147200 124984 125329 140636 152723 157205 148587 127793 118087 96120 86605
17680 86605 94094 103421 121374 120175 134477 151629 167570 196715 207008 214754 252023 269466
$$ packed form
17768G82606m2451m0073k6931k0120k1650l702Q430J7845K3998K0089Q72o079
17756F92834k3275m2350m1770m2985k0988l62J695N263J1706L6499M4886M9221
17744F70374N3951K9743k4765n3474o6230l2429j14k9507l9078k4968o4j5961
17732D67478l2455k9764P003N671j1245j6943p901P720j1738m995n754j296j274
17719C64507q760j0973n319k1383j2140N51j2635j3169K781M067J143K372k6898
17706B64144j3006j1852j3565k130K747J089R5O583j1649k8353j0421j0424r714
17693A63544o601J832j1575k2216L45J5307J2087M482q618k0794r706k1967r515
17680H6605P489R327J7953j199J4302J7152J5941K9145J0293P746L7269J7443
$$ plain form
17668 269466 284607 301066 313401 332486 347610 350500 333814 342527 343418 329620 323612 326568 322313
17655 322313 322526 338729 353994 368581 377223 373591 368356 363183 346454 329282 310026 289643 257530
17642 257530 228626 203096 173177 154666 160454 160819 165397 168758 163519 156849 136241 130283 134037
17629 134037 120692 113528 109139 108183 115611 122483 138324 158613 167453 205390 238231 261149 276069
17616 276069 271180 262567 268561 251516 248228 256699 255973 237907 242723 251345 241119 244004 249472 243202
17602 243202 238725 244399 237863 231784 238736 244542 252732 262114 245002 215088 188286 166910 139156
17589 139156 115882 97670 88043 88431 90417 80362 72263 61129 56314 46003 48098 41045 35605
17576 35605 48064 51364 42057 23032 17110 23232 26161 33422 40814 31296 32793 39629 31017 21437
$$ packed form
17668B69466J5141J6459J2335J9085J5124K890j6686Q713Q91j3798o008K956m255
17655C22313K13J6203J5265J4587Q642l632n235n173j6729j7172j9256k0383l2113
17642B57530k8904k5530k9919j8511N788L65M578L361n239o670k0608n958L754
17629A34037j3345p164m389r56P428O872J5841K0289Q840L7937L2841K2918J4920
17616B76069m889q613N994j7045l288Q471p26j8066M816Q622j0226K885N468o270
17602B43202m477N674o536o079O952N806Q190R382j7112k9914k6802k1376k7754
17589A39156k3274j8212r627L88J986j0055q099j1134m815j0311K095p053n440
17576C5605J2459L300r307j9025n922O122K929P261P392r518J497O836q612r580
$$ plain form
17562 21437 13677 7891 19586 23615 35125 54670 62838 63747 62005 62886 66677 71425 73503 86442
17548 86442 105847 121993 135011 157035 176275 195688 204904 214122 236566 248613 251334 265563
17536 265563 301793 325281 330429 347156 365167 380486 365440 339085 328420 316321 281736 247315
17524 247315 227435 232095 221074 204269 196580 192107 177413 155688 134209 113329 89189 76223
17512 76223 82308 75737 68975 60721 56560 59656 67901 64190 57863 64828 71324 71950 87571 97173
17498 97173 117808 137836 152507 169152 168649 163889 180338 207693 230407 252983 270531 285402
17486 285402 286078 283274 294646 305390 296426 277523 258856 247982 238981 220943 200401 186899
17474 186899 194413 191613 163554 138737 127711 123988 120520 108030 92724 90022 86844 85439 80828
$$ packed form
17562B1437p760n786J1695M029J1510J9545Q168R09j742Q81L791M748K078J2939
17548H6442J9405J6146J3018K2024J9240J9413R216R218K2444J2047K721J4229
17536B65563L6230K3488N148J6727J8011J5319j5046k6355j0665j2099l4585l4421
17524B47315j9880M660j1021j6805p689m473j4694k1725k1479k0880k4140j2966
17512G6223O085o571o762q254m161L096Q245l711o327O965O496O26J5621R602
17498I7173K0635K0028J4671J6645n03m760J6449K7355K2714K2576J7548J4871
17486B85402O76k804J1372J0744q964j8903j8667j0874r001j8038k0542j3502
17474A86899P514k800k8059k4817j1026l723l468j2490j5306k702l178j405m611
$$ plain form
17461 80828 72316 54187 42678 45325 36299 23334 12609 7210 901 -1253 12909 28720 35545
17448 35545 37117 40161 51152 52701 39136 37811 75784 105028 103242 88088 70178 45596 18161
17435 18161 4862 -1788 -6069 -5218 8267 8639 -422 -4054 -17688 -22280 -15852 -8531 -5685 -5801
17421 -5801 -11406 -22856 -21745 -24659 -29748 -27378 -4140 3401 -8781 -25506 -35592 -31537 -13795
17408 -13795 -18074 -34135 -41299 -42566 -42145 -41779 -45644 -48925 -39913 -36078 -31150 -11060 3441 -4167
17394 -4167 -10634 -21453 -25011 -23240 -17557 -24576 -13716 20 -7476 -20373 -19602 -12785 -18050 -20419
17380 -20419 -11600 -16398 -29524 -37913 -30188 -23563 -17422 -14004 -23631 -22493 -27714 -42148 -24589 -19750
17366 -19750 -11884 -16245 -5335 -13258 -11666 -6930 -8819 -6208 -6782 -14490 -13338 -9449 -6515 -5570 1804
$$ packed form
17461H0828q512j8129j1509K647r026j2965j0725n399o309k154J4162J5811O825
17448C5545J572L044J0991J549j3565j325L7973K9244j786j5154j7910k4582k7435
17435A8161j3299o650m281Q51J3485L72r061l632j3634m592O428P321K846j16
17421e801n605j1450J111k914n089K370K3238P541j2182j6725j0086M055J7742
17408a3795m279j6061p164j267M21L66l865l281R012L835M928K0090J4501p608
17394d167o467j0819l558J771N683p019J0860J3736p496j2897P71O817n265k369
17380b0419Q819m798j3126q389P725O625O141L418r627J138n221j4434J7559M839
17366a9750P866m361J0910p923J592M736j889K611n74p708J152L889K934R45P374
$$ plain form
17351 1804 -821 -9074 -7822 -5796 8070 11460 8723 15948 17961 18135 17765 21356 22596 24601 18495
17336 18495 12509 9606 10493 16646 30088 40512 47155 35107 36397 39546 47911 48436 41338 50422
17322 50422 52588 72003 87005 113493 151026 194694 258095 338158 414581 441218 419559 378478
17310 378478 328713 294067 288817 320277 350298 401202 510167 647192 820874 977933 1078391
17299 1078391 1098441 1038613 926240 813128 693224 587798 527182 520786 565669 643352 765294
17288 765294 952039 1161764 1313670 1329257 1198266 989090 770757 604037 519218 481841
17278 481841 439339 413394 431836 465986 533602 599144 640700 633168 577410 482113 395087 336979
17266 336979 287480 250115 254442 273394 303294 328237 360824 412002 477060 546677 603024 622179
$$ packed form
17351A804k625q253J252K026J3866L390k737P225K013J74l70L591J240K005o106
17336A8495n986k903Q87O153J3442J0424O643j2048J290L149Q365N25p098R084
17322E0422K166J9415J5002K6488L7533M3668O3401Q0063P6423K6637k1659m1081
17310C78478m9765l4646n250L1460L0021N0904J08965J37025J73682J57059J00458
17299A078391K0050n9828j12373j13112j19904j05426o0616o396M4883P7683J21942
17288G65294J86745K09725J51906J5587j30991k09176k18333j66720q4819l7377
17278D81841m2502k5945J8442L4150O7616O5542M1556p532n5758r5297q7026n8108
17266C36979m9499l7365M327J8952K9900K4943L2587N1178O5058O9617N6347J9155
$$ plain form
17254 622179 598920 554232 498544 474405 469034 490814 529660 573107 640026 725615 806341 878526
17242 878526 921699 936977 925489 898390 889697 892845 939110 1014662 1082333 1105195 1085780 1052118
17230 1052118 1049399 1065790 1088099 1065381 1010845 940745 889272 877823 938802 1021927 1071864
17219 1071864 1059209 983278 870476 769858 718104 708225 726182 739611 747235 743703 769893
17208 769893 843870 925383 956632 907863 810364 699289 600185 539849 489997 459311 425450
17197 425450 401178 391114 368665 341826 318042 291679 278271 272818 251619 230191 211878 199495
17185 199495 178420 157784 155511 142943 126341 115355 120162 119958 96441 102103 111078 117991 116124
17172 116124 113481 115236 112338 128326 137227 140880 153501 146717 162524 170268 179184 187462 195513
$$ packed form
17254F22179k3259m4688n5688k4139n371K1780L8846M3447O6919Q5589Q0726P2185
17242H78526M3173J5278j1488k7099q693L148M6265P5552O7671K2862j9415l3662
17230A052118k719J6391K2309k2718n4536p0100n1473j1449O0979Q3125M9937
17219A071864j2655p5931j12802j00618n1754r879J7957J3429P624l532K6190
17208G69893P3977Q1513L1249m8769r7499j11075r9104o0336m9852l0686l3861
17197D25450k4272j0064k2449k6839k3784k6363j3408n453k1199k1428j8313j2383
17185A99495k1075k0636k273j2568j6602j0986M807k04k3517N662Q975O913j867
17172A16124k643J755k898J5988Q901L653J2621o784J5807P744Q916Q278Q051
$$ plain form
17159 195513 195298 194635 198691 206241 215127 225568 238597 248201 249141 241218 226414 231437 242122 234959
17145 234959 216529 208438 195983 197799 210509 200995 202574 218052 249252 268154 286791 302552
17133 302552 298232 281140 272006 247089 232624 225476 222076 245558 263832 272813 287097 286502 270628
17120 270628 263550 254394 241081 234969 233463 227960 221937 210872 190902 198552 217299 226066 216563
17107 216563 202432 196600 181023 152505 144170 142891 120709 111612 102550 93333 81809 54625 46505
17094 46505 43401 30783 36828 57155 69948 69266 77249 79198 83444 76463 57238 41822 42178 42571
17080 42571 25279 24156 30273 36714 30511 30662 43495 50401 50976 43874 47750 39763 31358 27285
17066 27285 27925 31438 35944 54034 56289 71299 71094 63779 61831 62891 73739 94319 112002 125430
$$ packed form
17159A95513k15o63M056P550Q886J0441J3029R604R40p923j4804N023J0685p163
17145B34959j8430q091j2455J816J2710r514J579J5478L1200J8902J8637J5761
17133C02552m320j7092r134k4917j4465p148l400K3482J8274Q981J4284n95j5874
17120B70628p078r156j3313o112j506n503o023j1065j9970P650J8747Q767r503
17107B16563j4131n832j5577k8518q335j279k2182r097r062r217j1524k7184q120
17094D6505l104j2618O045K0327J2793o82P983J949M246o981j9225j5416L56L93
17080D2571j7292j123O117O441o203J51J2833O906N75p102L876p987q405m073
17066B7285O40L513M506J8090K255J5010k05p315j948J060J0848K0580J7683J3428
$$ plain form
17052 125430 120676 130712 142312 141309 131542 133376 128279 132179 136720 127699 109765 113104 120766
17039 120766 147440 156187 152331 146959 142930 139248 145223 139485 144189 159362 174536 192664 195739
17026 195739 207771 215863 215857 218595 220104 207338 200538 195862 205503 236133 247756 241988 249234 274723
17012 274723 290360 302195 318649 317382 329369 336345 339865 347904 356075 352029 362054 372162 379970
16999 379970 391939 397025 398391 391180 369170 337779 323248 315084 292111 284606 287620 284543 282721
16986 282721 263711 257903 257905 243838 241761 248544 257391 242241 215630 187452 179961 188859 183774 178121
16972 178121 165810 154226 150523 149993 144099 142242 139772 152522 176746 204895 232049 237654 244105
16959 244105 257010 256302 253898 233253 232242 237850 240084 261647 292654 311960 343848 367701 403333
$$ packed form
17052A25430m754J0036J1600j003r767J834n097L900M541r021j7934L339P662
17039A20766K6674Q747l856n372m029l682N975n738M704J5173J5174J8128L075
17026A95739J2032Q092oK738J509j2766o800m676R641L0630J1623n768P246K5489
17012B74723J5637J1835J6454j267J1987O976L520Q039Q171m046J0025J0108P808
16999C79970J1969N086J366p211k2010l1391j4531q164k2973p505L014l077j822
16986B82721j9010n808Kj4067k077O783Q847j5150k6611k8178p491Q898n085n653
16972A78121j2311j1584l703n30n894j857k470J2750K4224K8149K7154N605O451
16959B44105J2905p08k404k0645j011N608K234K1563L1007J9306L1888K3853L5632
$$ plain form
16946 403333 422330 424061 420643 406655 367972 349698 335237 326623 318879 298247 309033 329084
16934 329084 344073 370589 385124 380585 361945 316643 304908 305052 292216 258305 239456 229369
16922 229369 217496 214689 209400 200554 192135 181168 182052 180581 182056 179391 172690 162331 168973 176070
16908 176070 187503 195343 190257 180140 184756 213264 228196 238975 256650 263642 284589 302415
16896 302415 318085 328475 328121 329296 322090 306128 284866 258286 250702 258497 261676 260744 290169
16883 290169 311656 300936 306358 308547 310535 297736 285479 267460 250234 238472 240902 234711
16871 234711 231831 246671 251581 254335 264010 269639 256806 249386 246373 249838 242731 240918 255027
16858 255027 265532 273857 287167 291608 278993 282187 297549 304305 312209 316289 318816 297864 294706
$$ packed form
16946D03333J8997J731l418j3988l8683j8274j4461q614p744k0632J0786K0051
16934C29084J4989K6516J4535m539j8640m5302j1735J44j2836l3911j8849j0087
16922B29369j1873k807n289q846q419j0967Q84j471J475k665o701j0359O642P097
16908A76070J1433P840n086j0117M616K8508J4932J0779J7675O992K0947J7826
16896C02415J5670J0390l54J175p206j5962k1262k6580p584P795L179r32K9425
16883B90169K1487j0720N422K189J988j2799j2257j8019j7226j1762K430o191
16871B34711k880J4840M910K754R675N629j2833p420l013L465p107j813J4109
16858B55027J0505Q325J3310M441j2615L194J5362O756P904M080K527k0952l158
$$ plain form
16845 294706 292971 300731 320806 340402 347572 358912 368440 388512 423353 446241 465952 492574
16833 492574 494403 480963 445535 421375 405840 398582 385313 399286 417083 461418 513330 552446
16821 552446 600176 646513 659537 649614 627845 591340 567481 547377 524613 515199 538896 575917
16809 575917 617106 672021 709329 735421 767740 772893 750775 731805 731069 715628 719954 736230
16797 736230 749061 758345 768636 789525 815826 839911 856231 877152 876089 891383 911360 907288
16785 907288 911268 927695 954295 960481 966215 978921 993974 1021749 1029086 1039888 1071436 1112266
16773 1112266 1143901 1177669 1194411 1203381 1219903 1225896 1217908 1224775 1244027 1261855 1281785 1311773
16761 1311773 1354455 1384816 1404479 1429552 1462998 1509958 1556673 1607231 1680421 1745923 1817759
$$ packed form
16845B94706j735P760K0075J9596P170J1340R528K0072L4841K2888J9711K6622
16833D92574J829j3440l5428k4160j5535p258j3269J3973J7797M4335N1912L9116
16821E52446M7730M6337J3024r923k1769l6505k3859k0104k2764r414K3697L7021
16809E75917M1189N4915L7308K6092L2319N153k2118j8970p36j5441M326J6276
16797G36230J2831R284J0291K0889K6301K4085J6320K0921j063J5294J9977m072
16785I07288L980J6427K6600O186N734J2706J5053K7775P337J0802L1548M0830
16773A112266L1635L3768J6742Q970J6522N993p988O867J9252J7828J9930K9988
16761A311773M2682L0361J9663K5073L3446M6960M6715N0558P3190O5502P1836
$$ plain form
16750 1817759 1877333 1935486 1982006 2036533 2103292 2189698 2289811 2402308 2515414 2626166
16740 2626166 2722296 2841728 3030346 3261372 3542686 3892581 4336766 4875280 5545817 6269243
16730 6269243 6913601 7399190 7652687 7734353 7824071 8059679 8529696 9245038 10208620 11417429
16720 11417429 12821555 14377192 16109477 17997526 20109480 22578910 25720595 30119480
16712 30119480 36646901 46595221 61822371 84417769 114614396 145431015 162585504
16705 162585504 161239330 145825773 123050678 104084593 92701104 87530936 87887976
16698 87887976 94909559 110229900 135376031 170144959 209232450 242914603 260451452
16691 260451452 254826327 228819598 192344000 156146446 128229829 110968733 102629630
$$ packed form
16750A817759N9574N8153M6520N4527O6759Q6406J00113J12497J13106J10752
16740B626166R6130J19432J88618K31026K81314L49895M44185N38514O70537P23426
16730F269243O44358M85589K53497Q1666Q9718K35608M70017P15342R63582J208809
16720A1417429J404126J555637J732285J888049K111954K469430L141685M398885
16712C0119480O527421R948320J5227150K2595398L0196627L0816619J7154489
16705A62585504j346174j5413557k2775095j8966085j1383489n170168L57040
16698H7887976P021583J5320341K5146131L4768928L9087491L3682153J7536849
16691B60451452n625125k6006729l6475598l6197554k7916617j7261096q339103
$$ plain form
16684 102629630 101208208 105467949 115040321 130883654 152760154 173916168 181243875
16677 181243875 170843782 146982222 116700864 91357010 74113889 62626391 54732696
16670 54732696 49200038 45179399 42028157 39384639 36931341 34289157 31357181 28304630
16662 28304630 25444860 22919115 20720127 18857937 17319771 16076605 15020587 14070733
16654 14070733 13230500 12405592 11532238 10595951 9608656 8644100 7788367 7065974 6489092
16645 6489092 5995720 5576795 5184654 4803028 4428226 4074219 3729837 3412182 3136056
16636 3136056 2891388 2680336 2483489 2319006 2178982 2050031 1940643 1824076 1699223
16627 1699223 1574197 1458352 1355889 1258885 1171825 1095057 1039908 994206 941635 888516 850732
$$ packed form
16684A02629630j421422M259741R572372J5843333K1876500K1156014P327707
16677A81243875j0400093k3861560l0281358k5343854j7243121j1487498p893695
16670E4732696n532658m020639l151242k643518k453298k642184k931976l052551
16662B8304630k859770k525745k198988j862190j538166j243166j056018r49854
16654A4070733q40233q24908q73354r36287r87295r64556q55733p22393n76882
16645F489092m93372m18925l92141l81626l74802l54007l44382l17655k76126
16636C136056k44668k11052j96847j64483j40024j28951j09388j16567j24853
16627A699223j25026j15845j02463r7004q7060p6768n5149m5702n2571n3119l7784
$$ plain form
16616 850732 813093 770333 728292 687353 680210 678407 663662 662616 637515 605463 581258 568010
16604 568010 547262 536050 530755 516151 513971 511534 485461 469859 459236 434161 427473 415243
16592 415243 402923 392603 389618 385162 386905 407087 426335 426476 427234 428294 427226 431374 425181 394843
16578 394843 356170 351822 356637 342734 335143 333755 340759 360486 380787 389484 408286 420599 413352
16565 413352 365407 318292 287635 275166 282140 292210 304030 312186 322635 337606 339558 339363
16553 339363 339299 334119 316394 286309 270938 274688 270029 282548 286358 289748 298712 298579 296431 285906
16539 285906 280193 275865 274532 266343 254006 241368 235812 223090 218714 228092 227138 219867 226616 221482
16525 221482 220433 204474 176443 154561 140162 120147 101512 92786 94597 116658 130420 111458
$$ packed form
16616H50732l7639m2760m2041m0939p143j803j4745j046k5101l2052k4205j3248
16604E68010k0748j1212n295j4604k180k437k6073j5602j0623k5075o688j2230
16592D15243j2320j0320k985m456J743K0182J9248J41P58J060j068M148o193l0338
16578C94843l8673m348M815j3903p591j388P004J9727K0301Q697J8802J2313p247
16565D13352m7945m7115l0657j2469O974J0070J1820Q156J0449J4971J952j95
16553C39363o4n180j7725l0085j5371L750m659J2519L810L390Q964j33k148j0525
16539B85906n713m328j333q189j2337j2638n556j2722m376R378r54p271O749n134
16525B21482j049j5959k8031k1882j4399k0015j8635q726J811K2061J3762j8962
$$ plain form
16513 111458 114557 125749 114250 101838 101761 104831 95452 67921 45064 37189 33454 28548 30871
16500 30871 39257 46478 50821 53535 51219 42292 19280 15126 237 -838 15312 13199 11143 14701
16486 14701 21391 25315 23182 29884 41295 37920 31837 28569 15160 4841 1991 8828 13232 12626
16472 12626 12427 6898 11082 3291 -13438 -15510 -20582 -1952 17635 15277 11025 7584 13491 28808
16458 28808 36840 35013 24951 23204 31504 23925 8525 -3181 -20309 -25453 -31509 -33802 -31583
16445 -31583 -15041 -7755 -4952 -5011 9010 18524 18171 17135 13656 15293 12385 14031 19121 1768
16431 1768 -453 -6602 -11145 -16846 -28514 -25620 -17280 -14261 -11977 -6021 -6219 844 4073 -14347
16417 -14347 -29811 -41107 -44184 -40553 -32760 -29314 -25038 -39151 -39422 -26181 -29358 -43754 -40900
$$ packed form
16513A11458L099J1192j1499j2412p7L070r379k7531k2857p875l735m906K323
16500C0871Q386P221M343K714k316q927k3012m154j4889j075J6150k113k056L558
16486A4701O690L924k133O702J1411l375o083l268j3409j0319k850O837M404o06
16472A2626j99n529M184p791j6729k072n072J8630J9587k358m252l441N907J5317
16458B8808Q032j827j0062j747Q300p579j5400j1706j7128n144o056k293K219
16445c1583J6542P286K803n9J4021R514l53j036l479J637k908J646N090j7353
16431A768k221o149m543n701j1668K894Q340L019K284N956j98P063L229j8420
16417a4347j5464j1296l077L631P793L446M276j4113k71J3241l177j4396K854
$$ plain form
16404 -40900 -31797 -20939 -20015 -10757 -22858 -44121 -52485 -55975 -60825 -64509 -64978 -53012 -41514 -41329
16390 -41329 -46823 -47074 -44353 -40081 -42792 -54933 -71698 -75552 -77226 -88271 -74899 -57120 -39002
16377 -39002 -37928 -50971 -61480 -65213 -64720 -55260 -54992 -66427 -75638 -80070 -77001 -64588 -49125 -33452
16363 -33452 -35320 -51583 -55127 -53808 -42509 -46527 -43701 -28881 -18257 -23737 -32422 -29511 -26898
16350 -26898 -36546 -36844 -29658 -28981 -33847 -46770 -50234 -46746 -47162 -45641 -38850 -34117 -37195 -36717 -31949
16335 -31949 -30531 -25087 -45578 -57907 -64243 -51967 -44925 -39887 -39035 -43777 -40186 -47953 -67020 -78609
16321 -78609 -75277 -56792 -38982 -38156 -42999 -50160 -38637 -38251 -39044 -41847 -41772 -49602 -52305 -66065 -48706
16306 -48706 -50427 -65485 -70929 -78859 -66181 -49857 -27078 -12170 -20866 -29951 -48471 -48566 -55240
$$ packed form
16404d0900R103J0858R24R258j2101k1263q364l490m850l684m69J1966J1498J85
16390d1329n494k51K721M272k711j2141j6765l854j674j1045J3372J7779J8118
16377c9002J074j3043j0509l733M93R460K68j1435r211m432L069J2413J5463J5673
16363c3452j868j6263l544J319J1299m018K826J4820J0624n480q685K911K613
16350b6898r648k98P186O77m866j2923l464L488m16J521O791M733l078M78M768
16335c1949J418N444k0491j2329o336J2276P042N038Q52m742L591p767j9067j1589
16321g8609L332J8485J7810Q26m843p161J1523L86p93k803P5p830k703j3760J7359
16306d8706j721j5058n444p930J2678J6324K2779J4908q696r085j8520r5o674
$$ plain form
16293 -55240 -60006 -69672 -83409 -87353 -86721 -80677 -59299 -51475 -45590 -55604 -54476 -47616 -46376 -48373
16279 -48373 -41371 -34620 -31118 -32212 -45083 -65977 -60125 -55411 -49327 -49162 -61754 -53902 -52407 -45326
16265 -45326 -33833 -36661 -33673 -20997 -23022 -23313 -26038 -40750 -57165 -51065 -44176 -49301 -50714 -53657
16251 -53657 -47631 -42599 -66393 -76231 -74228 -74701 -66445 -57334 -63572 -65205 -56550 -55790 -51167 -50875 -63794
16236 -63794 -68380 -65851 -61015 -43212 -50170 -67391 -67308 -64614 -66219 -56937 -57995 -58344 -63229 -69847 -72056
16221 -72056 -75200 -61176 -54996 -58008 -63579 -73867 -79444 -83632 -78706 -66053 -62776 -58922 -53183 -65274
16207 -65274 -70006 -74487 -59261 -48844 -49508 -51381 -48346 -52471 -43767 -45933 -50249 -63112 -69745 -62627
16193 -62627 -56801 -51341 -43673 -33660 -29823 -42613 -45144 -42229 -26978 -26065 -20051 -10832 -8638 -1431
$$ packed form
16293e5240m766r666j3737l944O32O044K1378P824N885j0014J128O860J240j997
16279d8373P002O751L502j094j2871k0894N852M714O084J65j2592P852J495P081
16265d5326J1493k828K988J2676k025k91k725j4712j6415O100O889n125j413k943
16251e3657O026N032k3794r838K003m73Q256R111o238j633Q655P60M623K92j2919
16236f3794m586K529M836J7803o958j7221Q3K694j605R282j058l49m885o618k209
16221g2056l144J4024O180l012n571j0288n577m188M926J2653L277L854N739j2091
16207f5274m732m481J5226J0417o64j873L035m125Q704k166m316j2863o633P118
16193f2627N826N460P668J0013L837j2790k531K915J5251R13O014R219K194P207
$$ plain form
16179 -1431 20597 31224 55514 97984 153570 240284 326407 396149 422845 396065 345379 288560
16167 288560 247660 228159 223755 231862 271782 330037 405677 513732 617865 689873 713672
16156 713672 689636 640700 587345 549399 562103 601405 621992 624043 613091 602714 598942 626525
16144 626525 661954 674262 648565 600655 588868 599291 640725 716754 770552 765420 707367 616572
16132 616572 506495 415920 357714 321122 287380 271012 289204 320653 360219 423217 456521
16121 456521 443790 397211 329883 249693 188163 137927 108025 91898 89822 83418 69458 59642
16109 59642 44264 28059 14836 9806 13993 9783 -7310 -13136 -19839 -32704 -19976 -19747 -27814
16096 -27814 -22827 -22002 -36749 -34048 -27197 -37824 -46999 -57704 -62156 -52726 -43418 -38930 -53200 -51533
$$ packed form
16179a431K2028J0627K4290M2470N5586Q6714Q6123O9742K6696k6780n0686n6819
16167B88560m0900j9501m404Q107L9920N8255P5640J08055J04133P2008K3799
16156G13672k4036m8936n3355l7946J2704L9302K0587K051j0952j0377l772K7583
16144F26525L5429J2308k5697m7910j1787J0423M1434P6029N3798n132n8053r0795
16132F16572j10077r0575n8206l6592l3742j6368J8192L1449L9566O2998L3304
16121D56521j2731m6579o7328q0190o1530n0236k9902j6127k076o404j3960r816
16109E9642j5378j6205j3223n030M187m210j7093n826o703j2865J2728K29q067
16096b7814M987Q25j4747K701O851j0627r175j0705m452R430R308M488j4270J667
$$ plain form
16082 -51533 -52346 -57297 -71044 -72051 -57075 -56321 -62803 -64089 -51762 -54642 -65505 -62329 -63935 -63453
16068 -63453 -81776 -81427 -66058 -53538 -54731 -63605 -77566 -79056 -77571 -63984 -63211 -69977 -68011 -72778
16054 -72778 -71760 -66964 -63354 -56352 -52743 -67357 -65166 -64606 -73318 -78449 -66716 -58312 -54341 -66243
16040 -66243 -72693 -64434 -71896 -71063 -83768 -92727 -90134 -81092 -75185 -66711 -52215 -60173 -65836 -62143
16026 -62143 -76223 -82720 -80768 -87591 -74983 -63546 -59275 -64473 -56100 -62364 -64876 -78874 -70768
16013 -70768 -69414 -65742 -63167 -64385 -64262 -58608 -49156 -61906 -63797 -59491 -63983 -51726 -55359 -59224
15999 -59224 -48192 -47979 -51037 -66184 -76801 -81915 -89166 -81850 -75751 -64597 -54468 -53649 -61701 -65698
15985 -65698 -69270 -68735 -57666 -59689 -62514 -72354 -71486 -75035 -71301 -68100 -58044 -67198 -77527 -78182
$$ packed form
16082e1533q13m951j3747j007J4976P54o482j286J2327k880j0863L176j606M82
16068f3453j8323L49J5369J2520j193q874j3961j490J485J3587P73o766J966m767
16054g2778J018M796L610P002L609j4614K191N60q712n131J1733Q404L971j1902
16040f6243o450Q259p462Q33j2705q959K593R042N907Q474J4496p958n663L693
16026f2143j4080o497J952o823J2608J1437M271n198Q373o264k512j3998Q106
16013g0768J354L672K575j218J23N654R452j2750j891M306m492J2257l633l865
15999e9224J1032K13l058j5147j0617n114p251P316O099J1154J0129Q19q052l997
15985f5698l572N35J1069k023k825r840Q68l549L734L201J0056r154j0329o55
$$ plain form
15971 -78182 -72449 -63789 -72033 -77172 -81925 -73040 -63984 -50200 -52934 -52891 -64506 -75885 -60689 -66105
15957 -66105 -70878 -47247 -38145 -46290 -53314 -55422 -51541 -55551 -59206 -68660 -85486 -78975 -57818 -43677
15943 -43677 -59792 -73446 -65556 -59712 -60148 -57617 -62364 -55083 -60095 -48549 -44522 -43650 -63272 -66867
15929 -66867 -57607 -65147 -67562 -70472 -82012 -87924 -84628 -70805 -71337 -76110 -78383 -77481 -68213 -58528
15915 -58528 -44601 -35696 -38134 -46936 -79188 -81720 -76835 -78060 -66151 -56876 -58599 -62936 -77442
15902 -77442 -75796 -78630 -69476 -57000 -56060 -61558 -65799 -62034 -60735 -65546 -65702 -67401 -55568 -49907
15888 -49907 -51873 -52994 -59395 -69191 -73454 -69789 -82231 -83250 -58611 -50922 -57481 -46253 -38372 -38557
15874 -38557 -48573 -55295 -67763 -64244 -55249 -49575 -56811 -66604 -68929 -69096 -72665 -68952 -61811 -48010
$$ packed form
15971g8182N733Q660q244n139m753Q885R056J3784k734M3j1615j1379J5196n416
15957f6105m773K3631R102q145p024k108L881m010l655r454j6826O511K1157J4141
15943d3677j6115j3654P890N844m36K531m747P281n012J1546M027Q72j9622l595
15929f6867R260p540k415k910j1540n912L296J3823n32m773k273R02R268R685
15915e8528J3927Q905k438q802l2252k532M885j225J1909R275j723m337j4506
15902g7442J646k834R154J2476R40n498m241L765J299m811j56j699J1833N661
15888d9907j966j121o401r796m263L665j2442j019K4639P689o559J1228P881j85
15874c8557j0016o722j2468L519Q995N674p236r793k325j67l569L713P141J3801
$$ plain form
15860 -48010 -45241 -54717 -54616 -47532 -39959 -47219 -72027 -70146 -53591 -70912 -76260 -71162 -72464 -70449
15846 -70449 -54157 -55671 -48624 -49194 -60086 -66769 -59106 -61381 -58948 -71030 -67968 -64444 -62114 -64115
15832 -64115 -56943 -41160 -41519 -57319 -57511 -59003 -65883 -53668 -42768 -43866 -54335 -63903 -57284 -56707
15818 -56707 -63132 -66596 -45686 -45971 -47177 -44839 -41417 -42845 -53177 -51772 -47505 -56950 -67407 -73871
15804 -73871 -68435 -73131 -69955 -65719 -65952 -67749 -67793 -73597 -71757 -70997 -81992 -83577 -74429 -69295 -63877
15789 -63877 -60148 -61477 -69953 -70446 -71294 -68371 -71745 -75851 -78259 -62684 -60130 -59175 -57048 -41228 -42424
15774 -42424 -47055 -51635 -58807 -69514 -77234 -85799 -80575 -65546 -60469 -50818 -50440 -50295 -48824 -58208
15760 -58208 -58109 -62677 -59075 -56575 -58092 -61797 -57268 -54800 -55867 -58663 -57073 -48464 -49269 -55212 -52345
$$ packed form
15860d8010K769r476J01P084P573p260k4808J881J6555j7321n348N098j302K015
15846g0449J6292j514P047n70j0892o683P663k275K433j2082L062L524K330k001
15832f4115P172J5783l59j5800j92j492o880J2215J0900j098j0469r568O619N77
15818e6707o425l464K0910k85j206K338L422j428j0332J405M267r445j0457o464
15804g3871N436m696L176M236k33j797m4n804J840P60j0995j585R148N134N418
15789f3877L729j329q476m93q48K923l374m106k408J5575K554R55K127J5820j196
15774d2424m631m580p172j0707p720q565N224J5029N077R651L78J45J471r384
15760e8208R9m568L602K500j517l705M529K468j067k796J590Q609q05n943K867
$$ plain form
15745 -52345 -56865 -52854 -48268 -42507 -39691 -41770 -37978 -43341 -46387 -43780 -40642 -29860 -39025 -58430
15731 -58430 -66636 -77856 -73630 -66217 -56992 -52165 -53697 -61412 -63136 -63317 -72803 -72310 -70979 -61155 -50960
15716 -50960 -51422 -52024 -53264 -53695 -53544 -60888 -49168 -40363 -50208 -51879 -52931 -59750 -70746 -79766 -61623
15701 -61623 -53460 -56603 -49714 -41882 -46718 -50229 -60748 -75465 -71339 -63425 -59569 -55641 -43128 -39249
15687 -39249 -36332 -43803 -56429 -70692 -66898 -57828 -56116 -53775 -53787 -61999 -64502 -66805 -60047 -41414
15673 -41414 -39682 -59767 -70370 -64826 -54080 -42649 -40216 -40309 -46837 -52997 -45259 -35100 -43935 -50330
15659 -50330 -55590 -63793 -72597 -67066 -65809 -61845 -63869 -61549 -60286 -58730 -62924 -54175 -51762 -52481 -51333
15644 -51333 -62862 -72213 -67913 -67145 -71914 -61135 -63169 -71397 -65420 -63600 -68739 -80473 -69324 -51586
$$ packed form
15745e2345m520M011M586N761K816k079L792n363l046K607L138J0782r165j9405
15731e8430q206j1220M226P413R225M827j532p715j724j81r486M93J331R824J0195
15716e0960m62o02j240m31J51p344J1720Q805r845j671j052o819j0996r020J8143
15701f1623Q163l143O889P832m836l511j0519j4717M126P914L856L928J2513L879
15687c9249K917p471j2626j4263L794R070J712K341j2q212k503k303O758J8633
15673d1414J732k0085j0603N544J0746J1431K433r3o528o160P738J0159q835o395
15659e0330n260q203q804N531J257L964k024K320J263J556m194Q749K413p19J148
15644e1333j1529r351M300P68m769J0779k034q228N977J820n139j1734J1149J7738
$$ plain form
15630 -51586 -58203 -58771 -59806 -57219 -49281 -48595 -58424 -62855 -57135 -52041 -58747 -58439 -47257 -41070 -43944
15615 -43944 -62548 -73339 -72349 -84502 -77303 -66258 -77365 -81004 -61354 -52073 -52066 -45093 -50703 -44002
15601 -44002 -41861 -46962 -32852 -34857 -47132 -58319 -53639 -47626 -60701 -62881 -43199 -42718 -44921
15588 -44921 -49978 -53245 -55800 -43422 -34045 -45057 -43614 -41404 -43686 -50739 -53191 -59574 -48754 -37171
15574 -37171 -55132 -64551 -57481 -61470 -59556 -53836 -52924 -58238 -63998 -62048 -66518 -61857 -50807 -47784
15560 -47784 -50014 -47727 -45843 -42477 -46989 -40386 -38010 -33372 -47030 -50173 -48819 -51252 -33981 -22264
15546 -22264 -29127 -25973 -54534 -78652 -76493 -65277 -61127 -36213 -22500 -32027 -53917 -70211 -85162
15533 -85162 -82774 -59113 -37347 -30653 -39370 -49136 -53585 -48326 -48082 -51644 -50655 -57321 -52757 -53323 -44524
$$ packed form
15630e1586o617n68j035K587P938O86r829m431N720N094o706L08J1182O187k874
15615d3944j8604j0791R90j2153P199J1045j1107l639J9650R281PO973n610O701
15601d4002K141n101J4110k005j2275j1187M680O013j3075k180J9682M81k203
15588d4921n057l267k555J2378R377j1012J443K210k282p053k452o383J0820J1583
15574c7171j7961r419P070l989J914N720R12n314n760J950m470M661J1050L023
15560d7784k230K287J884L366m512O603K376M638j3658l143J354k433J7271J1717
15546b2264o863L154k8561k4118K159J1216M150K4914J3713r527k1890j6294j4951
15533h5162K388K3661K1766O694q717r766m449N259K44l562R89o666M564n66Q799
$$ plain form
15518 -44524 -39425 -23708 -33078 -48269 -43719 -43075 -56941 -67437 -77577 -90049 -97102 -91386 -88043
15505 -88043 -66959 -47001 -17490 -17936 -20177 -33738 -51739 -62641 -62046 -69911 -70053 -65550 -59789 -55322
15491 -55322 -48980 -49235 -40307 -36326 -34210 -38255 -45212 -59715 -73368 -71440 -74687 -66031 -61170 -70865
15477 -70865 -72238 -66976 -47333 -27930 -45840 -58736 -62442 -68599 -78147 -68098 -47571 -60818 -70892
15464 -70892 -89715 -83981 -85285 -72998 -60568 -56806 -53376 -66276 -67054 -69770 -76167 -87958 -84212
15451 -84212 -69087 -54406 -32856 -24213 -44431 -67550 -81396 -75098 -61399 -63780 -69636 -70593 -53142
15438 -53142 -52586 -59693 -67533 -55742 -52051 -51829 -59461 -62904 -53734 -44724 -52243 -49351 -45807 -38482 -42605
15423 -42605 -47423 -67116 -82693 -74055 -62434 -57189 -48413 -46697 -51824 -51421 -42638 -37736 -50655 -49517
$$ packed form
15518d4524N099J5717r370j5191M550O44j3866j0496j0140j2472p053N716L343
15505h8043K1084J9958K9511m46k241j3561j8001j0902N95p865j42M503N761M467
15491e5322O342k55Q928L981K116m045o957j4503j3653J928l247Q656M861r695
15477g0865j373N262J9643J9403j7910j2896l706o157r548J0049K0527j3247j0074
15464g0892j8823N734j304J2287J2430L762L430j2900p78k716o397j1791L746
15451h4212J5125J4681K1550Q643k0218k3119j3846O298J3699k381n856r57J7451
15438e3142N56p107p840J1791L691K22p632l443R170R010p519K892L544P325m123
15423d2605m818j9693j5577Q638J1621N245Q776J716n127M03Q783M902j2919J138
$$ plain form
15409 -49517 -45019 -47317 -46219 -55958 -50265 -32255 -29644 -31118 -31128 -33664 -40029 -47161 -53298 -56195 -53144
15394 -53144 -55168 -54288 -49031 -35873 -42951 -50751 -39394 -29335 -33859 -43249 -44313 -51229 -53462 -44685
15380 -44685 -49224 -62040 -57291 -59845 -58007 -59942 -48687 -50824 -51429 -65109 -78783 -74412 -71838 -73134
15366 -73134 -67062 -56689 -45343 -43778 -39393 -39911 -45221 -37764 -39573 -45678 -41277 -45751 -61569 -56677
15352 -56677 -44046 -30054 -32242 -56361 -56474 -48062 -49492 -50224 -53202 -53839 -57909 -63309 -58446 -47189
15338 -47189 -49475 -60754 -60927 -42787 -37407 -51539 -64238 -58952 -50276 -46509 -45810 -50968 -47188 -35721
15324 -35721 -39712 -51098 -57683 -46135 -45005 -50356 -48902 -30392 -31147 -50439 -51759 -60959 -36143
15311 -36143 -31891 -38790 -54949 -48241 -52770 -41275 -32774 -39630 -44666 -42511 -42022 -54010 -63197 -50464
$$ packed form
15409d9517M498k298J098r739N693J8010K611j474j0k536o365p132o137k897L051
15394e3144k024Q80N257J3158p078p800J1357J0059m524r390j064o916k233Q777
15380d4685m539j2816M749k554J838j935J1255k137o05j3680j3674M371K574j296
15366g3134O072J0373J1346J565M385n18n310P457j809o105M401m474j5818M892
15352e6677J2631J3992k188k4119j13Q412j430p32k978o37m070n400M863J1257
15338d7189k286j1279j73J8140N380j4132j2699N286Q676L767O99n158L780J1467
15324c5721l991j1386o585J1548J130n351J454J8510p55j9292j320r200K4816
15311c6143M252o899j6159O708m529J1495Q501o856n036K155M89j1988r187J2733
$$ plain form
15297 -50464 -46971 -42576 -44639 -47303 -42579 -30246 -32553 -35640 -28923 -28468 -38512 -31907 -24596 -28227
15283 -28227 -44198 -46019 -45218 -41535 -43451 -50738 -51180 -47063 -47002 -36812 -34060 -32796 -35263 -46084 -60723
15268 -60723 -64541 -64923 -57653 -63155 -51079 -34382 -23995 -23983 -30951 -23379 -32950 -37792 -23260 -12282
15254 -12282 -17974 -44143 -67487 -73773 -74077 -73669 -61958 -55697 -66643 -65013 -46240 -30832 -28753
15241 -28753 -43143 -41987 -24554 -21981 -16973 -7913 -24860 -31725 -44516 -39695 -40396 -58247 -64127
15228 -64127 -63128 -69072 -66589 -57453 -38889 -30223 -34151 -39342 -43868 -50353 -45166 -45116 -49221 -53984 -48074
15213 -48074 -62117 -75524 -66019 -61431 -69373 -70817 -60758 -56305 -48321 -46045 -42180 -55428 -61826
15200 -61826 -61590 -64201 -62592 -61654 -53197 -50197 -46137 -41406 -42670 -44829 -52444 -62402 -56022 -39426 -28448
$$ packed form
15297e0464L493M395k063k664M724J2333k307l087O717M55j0044O605P311l631
15283b8227j5971j821Q01L683j916p287m42M117O1J0190K752J264k467j0821j4639
15268f0723l818l82P270n502J2076J6697J0387J2o968P572r571m842J4532J0978
15254a2282n692k6169k3344o286l04M08J1711O261j0946J630J8773J5408K079
15241b8753j4390J156J7433K573N008R060j6947o865j2791M821p01j7851n880
15228f4127R99n944K483R136J8564Q666l928n191m526o485N187N0m105m763N910
15213d8074j4043j3407R505M588p942j444J0059M453P984K276L865j3248o398
15200f1826K36k611J609R38Q457L000M060M731j264k159p615r958O380J6596J0978
$$ plain form
15185 -28448 -31672 -49630 -53574 -42318 -42375 -46429 -58583 -49821 -34638 -25239 -25577 -38831 -45515 -46583
15171 -46583 -39941 -33329 -40783 -45959 -46524 -38080 -38806 -42070 -51703 -58503 -65854 -64712 -53427 -38762
15157 -38762 -28429 -33900 -42737 -40029 -42318 -45046 -34640 -25153 -33534 -40320 -48595 -51882 -65475 -63254
15143 -63254 -62257 -60452 -67460 -68995 -74259 -69885 -59985 -50698 -53049 -34138 -18291 -22453 -38552 -32158
15129 -32158 -19504 -21858 -19904 -26222 -17553 -12532 -20828 -25332 -34536 -38087 -38760 -36320 -44024 -43636 -35154
15114 -35154 -25056 -32845 -40282 -47084 -44448 -18944 -7448 -7740 -13255 -14124 -23903 -30600 -36486 -35523
15100 -35523 -28336 -24833 -27766 -26166 -21153 -30334 -40959 -50177 -49570 -45486 -45351 -49247 -55931 -68692
15086 -68692 -60925 -48353 -46613 -55709 -62912 -56582 -54725 -49115 -55211 -51898 -46524 -48228 -44343 -31152
$$ packed form
15185b8448l224j7958l944J1256n7m054j2154Q762J5183R399l38j3254o684j068
15171d6583O642O612p454n176n65Q444p26l264r633o800p351J142J1285J4665
15157c8762J0333n471q837K708k289k728J0406R487q381o786q275l287j3593K221
15143f3254R97J805p008j535n264M374R900R287k351J8911J5847m162j6099O394
15129c2158J2654k354J954o318Q669N021q296m504r204l551o73K440p704L88Q482
15114c5154J0098p789p437o802K636K5504J1496k92n515q69r779o697n886R63
15100c5523P187L503k933J600N013r181j0625r218O07M084J35l896o684j2761
15086f8692P767J2572J740r096p203O330J857N610o096L313N374j704L885J3191
$$ plain form
15072 -31152 -30163 -43187 -46376 -43397 -33904 -43418 -43410 -32612 -39992 -30551 -30566 -34336 -30213 -28638 -23930
15057 -23930 -31940 -31820 -24681 -24603 -41162 -42554 -48735 -42838 -32315 -39767 -52670 -33834 -31517 -34427
15043 -34427 -31974 -34709 -52281 -46930 -37315 -36382 -31119 -19187 -33657 -55384 -54564 -58079 -63431 -67162
15029 -67162 -67119 -58470 -48288 -48496 -49086 -56450 -58466 -61532 -50380 -35702 -42763 -44108 -31280 -46620
15015 -46620 -54953 -54450 -64100 -59524 -38028 -25017 -31028 -37161 -42334 -49664 -52356 -41727 -44142 -56152
15001 -56152 -48535 -47146 -63535 -64605 -50261 -48946 -43649 -50887 -53618 -53157 -48009 -47465 -57875 -57934 -55559
14986 -55559 -56584 -63634 -64709 -53388 -55996 -42451 -35554 -29850 -18321 -15341 -37904 -43697 -38652
14973 -38652 -37466 -25065 -12695 -7214 -4152 -15799 -15977 -13614 -18994 -24772 -40723 -56663 -44555
$$ packed form
15072c1152R89j3024l189K979R493r514QJ0798p380R441j5l770M123J575M708
15057b3930q010J20P139P8j6559j392o181N897J0523p452j2903J8836K317k910
15043c4427K453k735j7572N351R615R33N263J1932j4470k1727Q20l515n352l731
15029f7162M3Q649J0182k08n90p364k016l066J1152J4678p061j345J2828j5340
15015d6620q333N03r650M576K1496J3011o011o133n173p330k692J0629k415j2010
15001e6152P617J389j6389j070J4344J315N297p238k731M61N148N44j0410n9K375
14986e5559j025p050j075J1321k608J3545O897N704J1529K980k2563n793N045
14973c8652J186J2401J2370N481L062j1647j78K363n380n778j5951j5940J2108
$$ plain form
14960 -44555 -34216 -16675 -13825 -21788 -25720 -7189 13999 12260 266 -15773 -26592 -19170 -23604
14947 -23604 -35018 -42108 -53513 -49564 -40084 -34060 -32623 -36662 -36758 -26679 -27156 -28066 -45060 -52335
14933 -52335 -40784 -33864 -37351 -45726 -53312 -51152 -48073 -59832 -78899 -79127 -79719 -65272 -58918 -60347
14919 -60347 -62603 -63016 -42648 -28402 -23134 -25281 -35267 -35645 -37763 -39316 -27668 -18888 -26243 -40962
14905 -40962 -44666 -50958 -51107 -53282 -45677 -54934 -46043 -24901 -41277 -48991 -38076 -32076 -25162 -34106
14891 -34106 -45572 -45267 -43731 -58023 -61009 -47249 -34665 -36190 -33898 -31613 -28898 -35314 -26016 -32786
14877 -32786 -43493 -48579 -39047 -33346 -37493 -41830 -44251 -41605 -34354 -28627 -53810 -71776 -60667
14864 -60667 -37040 -30671 -27398 -12101 -17163 -22179 -13407 -11635 -6123 -18290 -30620 -33322 -36797
$$ packed form
14960d4555J0339J7541K850p963l932J8531K1188j739j1994j6039j0819P422m434
14947b3604j1414p090j1405L949R480O024J437m039r6J0079m77r10j6994p275
14933e2335J1551O920l487q375p586K160L079j1759j9067k28n92J4447O354j429
14919f0347k256m13K0368J4246N268k147r986l78k118j553J1648Q780p355j4719
14905d0962l704o292j49k175P605r257Q891K1142j6376p714J0915O000O914q944
14891c4106j1466L05J536j4292k986J3760J2584j525K292K285K715o416R298o770
14877c2786j0707n086R532N701m147m337k421K646P251N727k5183j7966J1109
14864f0667K3627O369L273J5297n062n016Q772J772N512j2167j2330k702l475
$$ plain form
14851 -36797 -41415 -40133 -39177 -38130 -29231 -34799 -33179 -25121 -21511 -20048 -35694 -49133 -49022 -46791
14837 -46791 -39435 -35197 -37463 -29942 -32892 -22087 -29344 -38532 -37518 -29187 -26022 -36490 -41145 -37193
14823 -37193 -29201 -27893 -15891 -6225 -32576 -51282 -38659 -21684 -29537 -41069 -31947 -23446 -24541
14810 -24541 -20098 -24559 -27634 -30038 -28905 -18026 -10796 -16750 -19073 -28483 -33145 -29065 -24893 -31131
14796 -31131 -34411 -38132 -38702 -13083 -2024 -4785 -16926 -25155 -21755 -27626 -31145 -28677 -29616 -16635
14782 -16635 -8423 -11219 -9308 -11733 -15398 -15214 -10298 -13334 -17217 -19902 -10888 -5582 -18064 -23049
14768 -23049 -16174 -15423 -24346 -12200 -11253 -17289 -21281 -26621 -15431 -13201 -17902 -10183 -6728 -12618
14754 -12618 -1646 -3977 -22151 -30532 -23761 -13740 -5427 -10151 -23692 -35986 -23698 -22177 -18347
$$ packed form
14851c6797m618J282R56J047Q899n568J620Q058L610J463j5646j3439J11K231
14837d6791P356M238k266P521k950J0805p257r188J014Q331L165j0468m655L952
14823c7193P992J308J2002R666k6351j8706J2623J6975p853j1532R122Q501j095
14810b4541M443m461l075k404J133J0879P230n954k323r410m662M080M172o238
14796c1131l280l721n70K5619J1059k761j2141q229L400n871l519K468r39J2981
14782a6635Q212k796J911k425l665J84M916l036l883k685R014N306j2482m985
14768b3049O875P51q923J2146R47o036l992n340J1190K230m701P719L455n890
14754a2618J0972k331j8174q381O771J0021Q313m724j3541j2294J2288J521L830
$$ plain form
14741 -18347 -15557 -19114 -13649 -22181 -18555 -19134 -15529 -8656 -16884 -27322 -8600 -11855 -25545 -19535
14727 -19535 -23698 -30844 -31310 -32512 -16480 5201 -2993 -25401 -24129 -17727 -22753 -25048 -24449 -27424
14713 -27424 -40192 -38050 -47737 -40968 -43271 -45766 -36535 -33073 -37481 -33378 -27035 -20815 -13419 -17060
14699 -17060 -18533 -17208 -16354 -31508 -34246 -20816 -23903 -13686 -5884 -14690 -19672 -29034 -37387 -39659
14685 -39659 -53007 -47634 -47958 -49429 -67324 -66867 -49754 -40175 -35587 -28695 -27604 -18313 -17201 -11029
14671 -11029 -22489 -32516 -35082 -26396 -28036 -32801 -22219 -22697 -15402 -21879 -28219 -36314 -35462 -23644
14657 -23644 -15614 -3870 3687 -10587 -17651 -16990 -13483 -22113 -20686 -21427 -28520 -48064 -41856 -43814
14643 -43814 -35421 -32891 -35510 -24370 -19446 -29393 -25568 -15985 -14117 -25143 -31410 -26991 -22566 -31315
$$ packed form
14741a8347K790l557N465q532L626n79L605O873q228j0438J8722l255j3690O010
14727a9535m163p146m66j202J6032K1681q194k2408J272O402n026k295N99k975
14713b7424j2768K142r687O769k303k495R231L462m408M103O343O220P396l641
14699a7060j473J325Q54j5154k738J3430l087J0217P802q806m982r362q353k272
14685c9659j3348N373l24j471j7895M57J7113R579M588O892J091R291J112O172
14671a1029j1460j0027k566Q686j640m765J0582m78P295o477o340q095Q52J1818
14657b3644Q030J1744P557j4274p064O61L507q630J427p41p093j9544O208j958
14643d3814Q393K530k619J1140M924r947L825R583J868j1026o267M419M425q749
$$ plain form
14629 -31315 -33927 -37601 -34580 -40130 -28274 -39309 -35360 -26951 -22833 -40217 -52958 -42584 -25514
14616 -25514 -20543 -25230 -30873 -22649 -23686 -31962 -47778 -36289 -35015 -43622 -40326 -38571 -36698 -30630
14602 -30630 -27901 -21004 -11267 -3562 -14173 -21463 -20475 -29740 -42513 -37462 -35237 -35510 -37516 -41388
14588 -41388 -33935 -29940 -30329 -35396 -38214 -28275 -21758 -23257 -24373 -8964 -18820 -43065 -38752 -28770
14574 -28770 -30247 -17914 -8480 -7999 -10118 -11296 -28614 -34539 -33132 -31547 -31176 -21474 -4813 -10993
14560 -10993 -15695 -23912 -31525 -30241 -33743 -37765 -32217 -19911 -31404 -30259 -26627 -28570 -20773 -13939
14546 -13939 -20031 -25204 -15022 -8905 -23475 -16340 -10935 -17379 -22126 -28654 -25013 -12961 -14289 -7229
14532 -7229 -5963 -8656 -22360 -32762 -43827 -40327 -48267 -40357 -28416 -29077 -29850 -25245 -31740 -38538
$$ packed form
14629c1315k612l674L021n550J1856j1035L949Q409M118j7384j2741J0374J7070
14616b5514M971m687n643Q224j037q276j5816J1489J274q607L296J755J873O068
14602c0630K729O897R737P705j0611p290R88r265j2773N051K225k73k006l872
14588d1388P453L995l89n067k818R939O517j499j116J5409r856k4245M313R982
14574b8770j477J2333R434M81k119j178j7318n925J407J585L71R702J6661o180
14560a0993m702q217p613J284l502m022N548J2306j1493J145L632j943P797O834
14546a3939o092n173J0182O117j4570P135N405o444m747o528L641J2052j328P060
14532g229J266k693j3704j0402j1065L500p940P910J1941o61p73M605o495o798
$$ plain form
14518 -38538 -32128 -28297 -28979 -40458 -41649 -37728 -33823 -37290 -28951 -12663 7884 8830 -12346 -14053
14504 -14053 -25051 -38674 -26069 -3986 -3728 -16947 -23482 -29560 -32923 -37248 -26004 -4408 7730
14491 7730 3614 -12351 -23288 -17486 -5222 -18802 -20774 -12038 -5777 -13113 -7227 -2543 -18162
14478 -18162 -26155 -15443 -16831 -19452 -18962 -13729 -6972 -7337 -16741 -24826 -17915 -11622 -14039 -11963 -10665
14463 -10665 -4595 -8728 -4383 3720 -12156 -17166 -11592 68 6257 7685 6188 6032 -3908 -16019
14449 -16019 -13380 -7345 -6390 -887 796 -400 -1249 -11271 -8668 -6321 -6275 -15475 -4637 4253 797
14434 797 -12198 -20217 -5917 -8621 -11918 -1491 -7460 -5722 3313 14645 15486 1339 7736 28621
14420 28621 24400 18975 6148 5741 14068 18830 11929 2191 13475 20200 18884 12522 2544 -1448
$$ packed form
14518c8538O410L831o82j1479j191L921L905l467Q339J6288K0547R46k1176j707
14504a4053j0998j3623J2605K2083K58j3219o535o078l363m325J1244K1596J2138
14491G730m116j5965j0937N802J2264j3580j972Q736O261p336N886M684j5619
14478a8162p993J0712j388k621M90N233O757l65r404q085O911O293k417K076J298
14463a0665O070m133M345Q103j5876n010N574J1660O189J428j497j56r940j2111
14449a6019K639O035R55N503J683j196q49j0022K603K347M6r200J0838Q890l456
14434G97j2995q019J4300k704l297J0427n969J738R035J1332Q41j4147O397K0885
14420B8621m221n425j2827m07Q327M762o901r738J1284O725j316o362r978l992
$$ plain form
14406 -1448 11200 14266 3777 -5945 7391 19215 19578 35109 42752 35265 33994 24788 3588
14393 3588 -2993 5957 8205 12921 25227 31473 41824 47606 36351 31987 35528 49842 65382
14380 65382 78405 91442 101816 116340 144491 154120 174735 182471 175762 215219 265447 309483
14368 309483 345044 410424 478113 563349 699301 841689 1012219 1197813 1390407 1588816
14358 1588816 1787181 1958700 2088265 2204058 2314586 2394987 2432521 2455094 2465063 2456965 2426521
14347 2426521 2374880 2301029 2180852 2035357 1871134 1684074 1490208 1324519 1179257 1043511
14337 1043511 912562 831811 749346 681596 618012 553486 503876 452669 418820 391906 356602
14326 356602 319343 291362 273822 243235 216344 213379 197547 187940 162724 132061 118367 108622
$$ packed form
14406a448J2648L066j0489r722J3336J1824L63J5531P643p487j271r206k1200
14393C588o581Q950K248M716J2306O246J0351N782j1255m364L541J4314J5540
14380F5382J3023J3037J0374J4524K8151R629K0615P736o709L9457N0228M4036
14368C09483L5561O5380O7689Q5236J35952J42388J70530J85594J92594J98409
14358A588816J98365J71519J29565J15793J10528Q0401L7534K2573R969q098l0444
14347B426521n1641p3851j20177j45495j64223j87060j93866j65689j45262j35746
14337A043511j30949q0751q2465o7750o3584o4526m9610n1207l3849k6914l5304
14326C56602l7259k7981j7540l0587k6891k965j5832r607k5216l0663j3694r745
$$ plain form
14314 108622 84475 84451 97816 105723 108453 109080 109385 103422 88131 77708 68859 50987 34068 174
14300 174 -12449 -6410 -829 -10114 -16965 -10445 1051 13282 20266 16143 6614 8365 13613 16881
14286 16881 30504 45543 59923 42526 25613 30590 34870 43268 46948 38958 44003 59991 70688
14273 70688 79866 73313 64249 61134 60075 55654 41511 33007 43862 42651 35742 27497 17163 19673
14259 19673 28725 15853 3242 3889 -3678 -8733 3393 15141 18864 23984 22503 26766 12682
14246 12682 -8024 -6538 1356 3539 4030 -7368 -17499 -2403 -4336 -11407 -18498 -23073 -25582 -26105
14232 -26105 -20663 -7767 -6343 -8090 -5745 17001 12491 -2011 -7307 -10002 -11735 -26621 -24986
14219 -24986 -9453 -7990 -16357 -13869 -7129 -1558 6323 -5109 -14401 -11370 882 9495 10749 18209
$$ packed form
14314A08622k4147k4J3365P907K730O27L05n963j5291j0423q849j7872j6919l3894
14300A74j2623O039N581r285o851O520J1496J2231O984m123r529J751N248L268
14286A6881J3623J5039J4380j7397j6913M977M280Q398L680p990N045J5988J0697
14273G0688R178o553r064l115j059m421j4143q504J0855j211o909q245j0334K510
14259A9673R052j2872j2611O47p567n055J2126J1748L723N120j481M263j4084
14246A2682k0706J486P894K183M91j1398j0131J5096j933p071p091m575k509n23
14232b6105N442J2896J424j747K345K2746m510j4502n296k695j733j4886J635
14219b4986J5533J463q367K488O740N571P881j1432r292L031J2252Q613J254P460
$$ plain form
14205 18209 1365 -19812 -26149 -38723 -33239 -24669 -26263 -32025 -34208 -39387 -32387 -18520 3552
14192 3552 15195 6985 808 4001 1305 3955 -947 -3289 4600 6758 -7190 -16497 -14079 -19328
14178 -19328 -16639 -7658 -6186 -10080 -9758 -11557 -11264 3953 3442 -2653 -228 2105 9938 -5672 -30879
14163 -30879 -36458 -30525 -20327 -20012 -18967 -28942 -39123 -34045 -23119 -11624 2974 12085 6739
14150 6739 5718 -4174 -1429 5281 7918 5211 -460 -8138 -10657 5153 6841 -509 -8149 -17596
14136 -17596 -1470 22895 20742 11852 4503 5161 3826 3581 6039 -706 8792 27330 18302 10125
14122 10125 1597 849 -3317 -3547 3381 -823 -2839 -4846 3420 12528 7551 5921 -3286 -103 -5234
14107 -5234 -11887 -10551 -12110 -16740 -13512 10302 16024 14569 5401 -15717 -13531 -12923 -9297 11390
$$ packed form
14205A8209j6844k1177o337j2574N484Q570j594n762k183n179P000J3867K2072
14192C552J1643q210o177L193k696K650m902k342P889K158j3948r307K418n249
14178a9328K689Q981J472l894L22j799K93J5217n11o095K425K333P833j5610k5207
14163c0879n579N933J0198L15J045r975j0181N078J0926J1495J4598R111n346
14150F739j021r892K745O710K637k707n671p678k519J5810J688p350p640r447
14136a7596J6126K4365k153q890p349O58j335k45K458o745R498J8538r028q177
14122A0125q528p48m166k30O928m204k016k007Q266R108m977j630r207L183n131
14107e234o653J336j559m630L228K3814N722j455r168k1118K186O08L626K0687
$$ plain form
14093 11390 23022 34396 35746 25721 11317 4003 -992 -5942 3629 7813 23133 53347 83834
14080 83834 105523 111846 94116 87089 91462 93439 85195 81510 77159 77524 70950 69339 67942 61478
14066 61478 48505 48821 50073 50479 56841 58611 43897 35771 32374 28719 28527 19846 2455 15416
14052 15416 19874 18868 28240 36760 38830 49317 58283 64694 77347 78111 81444 107457 129990 153453
14038 153453 142169 123968 93847 63836 47210 47806 38401 19851 17401 29370 40660 45874
14026 45874 52302 64398 81249 86855 79005 52316 34013 28262 15916 -2043 -8868 -14525 5765
14013 5765 14702 7209 13693 23619 27292 26788 29477 26970 28069 22060 24517 23704 11696 -1626 3943
13998 3943 -2100 -8555 -4945 -14122 -5766 -4646 -3668 8425 13007 14309 20037 21670 20566 9719
$$ packed form
14093A1390J1632J1374J350j0025j4404p314m995m950R571M184J5320L0214L0487
14080H3834K1689O323j7730p027M373J977q244l685m351L65o574j611j397o464
14066F1478j2973L16J252M06O362J770j4714q126l397l655j92q681j7391J2961
14052A5416M458j006R372Q520K070J0487Q966O411J2653P64L333K6013K2533K3463
14038A53453j1284j8201l0121l0011j6626N96r405j8550k450J1969J1290N214
14026D5874O428J2096J6851N606p850k6689j8303n751j2346j7959o825n657K0290
14013E765Q937p493O484R926L673n04K689k507J099o009K457q13j2008j3322N569
13998C943o043o455L610r177Q356J120R78J2093M582J302N728J633j104j0847
$$ plain form
13984 9719 3068 -5048 -10642 -20654 -19320 -13957 -9706 -8809 -7831 -8300 -18844 -19741 -27560 -31063 -13754
13969 -13754 9639 16734 4164 -649 -3154 5425 7294 11764 5520 2129 -5380 -14388 -25016 -33566
13955 -33566 -21934 -13290 -17440 -6443 -11667 -11567 5016 25938 26494 31921 31714 16095 61 -6347
13941 -6347 -10509 -11491 -10753 -19243 -33984 -20222 -17931 -15425 -1546 13108 16558 6732 572 3357
13927 3357 9344 7588 2737 -10938 -12908 -1938 4983 6811 11753 11127 13572 13727 4323 9646 13040
13912 13040 12452 5353 13706 13649 13145 21371 31944 8931 -686 8178 16605 26974 29220 25907 12430
13897 12430 1616 -2289 -726 -2438 2164 -173 -2045 14418 9034 3860 -5524 -7069 -7478 -2717
13883 -2717 2483 16301 23077 19095 -455 -8288 13335 27558 15375 993 2161 2120 736 7570
$$ packed form
13984I719o651q116n594j0012J334N363M251Q97R78m69j0544q97p819l503J7309
13969a3754K3393P095j2570m813k505Q579J869M470o244l391p509r008j0628q550
13955c3566J1632Q644m150J0997n224J00J6583K0922N56N427k07j5619j6034o408
13941f347m162r82P38q490j4741J3762K291K506J3879J4654L450r826o160K785
13927C357N987j756m851j3675j970J0970O921J828M942o26K445J55r404N323L394
13912A3040n88p099Q353n7n04Q226J0573k3013r617Q864Q427J0369K246l313j3477
13897A2430j0814l905J563j712M602k337j872J6463n384n174r384j545m09M761
13883b717N200J3818O776l982j9550p833K1623J4223j2183j4382J168m1j384O834
$$ plain form
13869 7570 4529 -5532 4545 11113 9410 13781 13569 10976 5513 13853 19086 11687 11383 8661 6550
13854 6550 3724 3236 6166 13923 -3918 -8515 -1344 4676 17880 15883 26377 23275 21305 25543
13840 25543 25847 26703 31432 29173 21013 29078 35405 42798 36659 42937 31146 25471 23002 31260 47039
13825 47039 45925 31028 24902 25973 23655 20390 7343 -6814 -15355 -3452 11696 7687 13673
13812 13673 26554 33732 23566 14320 26292 34508 30298 30089 36616 47625 49258 47703 42163 24825
13798 24825 42047 56577 86384 107301 98515 79999 79483 75200 51433 42190 36072 29117 30186
13785 30186 25237 25969 42101 55308 52010 47067 47412 35899 31600 39730 31314 33765 42278 40405
13771 40405 36524 31178 28683 26297 31472 26052 8881 13225 19385 29426 35462 42639 52911 36918
$$ packed form
13869G570l041j0061J0077O568j703M371k12k593n463Q340N233p399l04k722k111
13854F550k826m88K930P757j7841m597P171O020J3204j997J0494l102j970M238
13840B5543L04Q56M729k259q160Q065O327P393o139O278j1791n675k469Q258J5779
13825D7039j114j4897o126J071k318l265j3047j4157q541J1903J5148m009N986
13812A3673J2881P178j0166r246J1972Q216m210k09O527J1009J633j555n540j7338
13798B4825J7222J4530K9807K0917q786j8516n16m283k3767r243o118o955J069
13785C0186m949P32J6132J3207l298m943L45j1513m299Q130q416K451Q513j873
13771D0405l881n346k495k386N175n420j7171M344O160J0041O036P177J0272j5993
$$ plain form
13757 36918 19405 24785 20884 19493 20973 19709 5066 3188 7633 7251 9108 21845 19769 11440
13743 11440 20587 22556 19404 15929 19916 37174 44388 48269 57000 71258 68671 63451 50393 50370
13729 50370 64987 62446 59551 59919 63580 69317 80174 83886 103346 109171 92058 84957 84831 92245
13715 92245 98686 96717 101963 104741 103982 90057 92878 85009 88573 82928 83825 71704 56268 74835
13701 74835 83123 73498 47127 45743 54312 60392 60487 58867 51739 40386 36833 26079 22064 24621
13687 24621 27510 24531 21669 31093 34702 34575 44616 43609 42137 41499 20422 13210 8970 21775
13673 21775 39114 53265 51120 37394 33567 29756 43327 54813 66995 49238 37628 40187
13661 40187 33681 26942 27228 23475 6476 -4440 2594 16527 26306 26976 32032 33427 44024 43755
$$ packed form
13757C6918j7513N380l901j391J480j264j4643j878M445l82J857J2737k076q329
13743A1440R147J969l152l475L987J7258P214L881Q731J4258k587n220j3058k3
13729E0370J4617k541k895L68L661N737J0857L712J9460N825j7113p101j26P414
13715I2245O441j969N246K778p59j3925K821p869L564n645Q97j2121j5436J8567
13701G4835Q288r625k6371j384Q569O080R5j620p128j1353l553j0754m015K557
13687B4621K889k979k862R424L609j27J0041j007j472o38k1077p212m240J2805
13673B1775J7339J4151k145j3726l827l811J3571J1486J2182j7757j1610K559
13661D0187o506o739K86l753j6999j0916P034J3933R779O70N056J395J0597k69
$$ plain form
13647 43755 33171 27691 26647 18468 10006 22103 15672 23822 28741 32424 39688 52812 50837 29558
13633 29558 27395 39695 39188 29553 20885 9992 11069 12723 13383 21158 26547 19101 15172 26526
13619 26526 34958 36097 33522 35812 37284 29298 41138 53484 56291 57551 57756 45560 59518 70499
13605 70499 80499 85513 76432 51712 42286 42269 38557 36774 41494 45999 39174 35324 20974 24041
13591 24041 23489 40905 50277 51128 66198 74861 76310 61114 63066 57852 56151 58870 54937 33108
13577 33108 21800 24971 26001 30564 25579 26586 23845 11417 20821 41479 41073 51316 57972 48913
13563 48913 49885 37531 32055 47199 45361 29341 41531 41071 36555 42789 51023 52955 49383 39203
13549 39203 45112 54524 56955 52986 58956 62219 55417 49709 51125 58665 51272 41290 39157 47220
$$ packed form
13647D3755j0584n480j044q179q462J2097o431Q150M919L683P264J3124j975k1279
13633B9558k163J2300n07r635q668j0893J077J654O60P775N389p446l929J1354
13619B6526Q432J139k575K290J472p986J1840J2346K807J260K05j2196J3958J0981
13605G0499J0000N014r081k4720r426j7l712j783M720M505o825l850j4350L067
13591B4041n52J7416R372Q51J5070Q663J449j5196J952n214j701K719l933k1829
13577C3108j1308L171J030M563m985J007k741j2428R404K0658m06J0243O656r059
13563D8913R72j2354n476J5144j838j6020J2190m60m516O234Q234J932l572j0180
13549C9203N909R412K431l969N970L263o802n708J416P540p393r982k133Q063
$$ plain form
13535 47220 53251 54355 45466 43340 37418 41547 26614 12464 18150 36001 52195 55969 55702 51118
13521 51118 49912 40375 47059 50933 33251 26399 26618 17348 14407 15408 20511 14632 6454 12712
13507 12712 19966 28808 24028 25326 32255 25145 16636 9064 28324 42800 38758 25356 30653 43535
13493 43535 50284 49841 58603 48773 31023 33133 25607 11298 13392 37286 63237 55981 40937
13480 40937 29475 23134 28660 36491 23123 27294 40793 50094 43635 35498 43976 52588 59341 57746
13466 57746 50045 50965 53241 54185 59540 41454 30519 36760 39492 28558 21257 15850 17825 24148
13452 24148 22981 24463 24945 25328 25662 30051 18672 25339 35717 34144 19669 15588 13734 24489
13438 24489 30054 31002 28500 32743 47096 57617 53940 48156 48328 53590 49881 50101 48424 45336 46132
$$ packed form
13535D7220O031J104q889k126n922M129j4933j4150N686J7851J6194L774k67m584
13521E1118j206r537O684L874j7682o852K19r270k941J001N103n879q178O258
13507A2712P254Q842m780J298O929p110q509p572J9260J4476m042j3402N297J2882
13493D3535O749m43Q762r830j7750K110p526j4309K094K3894K5951p256j5044
13480D0937j1462o341N526P831j3368M171J3499R301o459q137Q478Q612O753j595
13466E7746p701R20K276R44N355j8086j0935O241K732j0934p301n407J975O323
13452B4148j167J482M82L83L34M389j1379O667J0378j573j4475m081j854J0755
13438B4489N565R48k502M243J4353J0521l677n784J72N262l709K20j677l088P96
$$ plain form
13423 46132 42224 39781 35000 35803 44936 47326 44962 31752 40451 43128 30943 27337 31086 41959
13409 41959 49460 55684 55429 45585 43872 51396 65222 69462 67692 59972 48144 52799 66615 79105
13395 79105 76364 67698 51918 40674 46696 56506 51270 36322 33067 38709 43516 51391 49645 45386
13381 45386 54959 71263 75330 70641 57882 52930 51629 54805 63929 71567 68955 58313 59024 56960
13367 56960 47920 43816 53032 49440 47754 54851 55782 48736 56562 68178 82716 69872 71153 63816
13353 63816 58344 61949 67859 71772 42899 38517 60929 67095 64739 76684 82938 78623 79066 80203
13339 80203 70918 63842 76572 84311 82274 77823 69278 69290 63482 58897 67063 73218 72690 81870 77384
13324 77384 84973 83637 79554 84730 81523 70016 63525 79954 66170 69935 91507 107309 111117
$$ packed form
13423D6132l908k443m781Q03R133K390k364j3210Q699K677j2185l606L749J0873
13409D1959P501O224k55r844j713P524J3826M240j770p720j1828M655J3816J2490
13395G9105k741q666j5780j1244O022R810n236j4948l255N642M807P875j746m259
13381D5386R573J6304M067m689j2759m952j301L176R124P638k612j0642P11k064
13367E6960r040m104R216l592j686P097R31p046P826J1616J4538j2844J281p337
13353F3816n472L605N910L913k8873m382K2412O166k356J1945O254m315M43J137
13339H0203r285p076J2730P739k037m451q545J2n808m585Q166O155n28R180m486
13324G7384P589j336m083N176l207j1507o491J6429j3784L765K1572J5802L808
$$ plain form
13311 111117 113590 115046 105310 80356 81973 80708 72453 63095 66923 68944 71990 85659 90539 90626
13297 90626 81409 90460 99735 103367 97764 89030 84216 83323 82083 72001 70084 81247 87957 94013
13283 94013 98078 106984 123199 141935 143955 136997 139667 139735 143808 152704 170824 196996 218477 224965
13269 224965 243764 278630 344283 434411 531208 677483 865359 1085459 1312925 1553018
13259 1553018 1779822 1959350 2076307 2129448 2112558 2006093 1839767 1645258 1430997 1216864
13249 1216864 1030954 872678 760455 690725 630902 568158 515146 475730 439433 398911 365808
13238 365808 338267 324031 301664 270688 251355 229301 210619 198450 202879 190077 169012 163632
13226 163632 155876 143749 137535 144538 157160 152640 145122 126722 116952 124553 132163 138449 127098
$$ packed form
13311A11117K473J456r736k4954J617j265q255r358L828K021L046J3669M880Q7
13297I0626r217R051R275L632n603q734m814q93j240j0082j917J1163O710O056
13283I4013M065Q906J6215J8736K020o958K670O8M073Q896J8120K6172K1481O488
13269B24965J8799L4866O5653R0128R6797J46275J87876K20100K27466K40093
13259A553018K26804J79528J16957N3141j6890j06465j66326j94509k14261k14133
13249A216864j85910j58276j12223o9730n9823o2744n3012l9416l6297m0522l3103
13238C65808k7541j4236k2367l0976j9333k2054j8682j2169M429j2802k1065n380
13226A63632p756j2127o214P003J2622m520p518j8400r770P601P610O286j1351
$$ plain form
13213 127098 125801 133985 134492 135794 138530 130964 127018 125111 114815 124784 127065 123325 118096 107402
13199 107402 93421 100805 101343 92053 76849 83139 81389 62801 65479 81352 78241 82162 81583 79986
13185 79986 83891 92561 95412 89877 87874 100842 107580 100434 94915 83981 82615 96528 101091 99869
13171 99869 101337 99951 109024 110110 105177 99125 89672 83745 78839 68520 66357 65550 68726 67670
13157 67670 54734 54163 71721 81946 86880 95068 88888 82459 94014 112051 133715 134388 121750
13144 121750 112563 119059 122686 125705 135560 132077 126383 127119 141517 165759 168915 170278 172476 167223
13130 167223 153807 139997 149831 157950 149810 153878 160050 161026 154868 146276 143977 147277 149366 144821
13116 144821 151647 150593 133808 122505 120238 122790 141925 144229 135277 136994 161372 175973 168404
$$ packed form
13213A27098j297Q184N07J302K736p566l946j907j0296R969K281l740n229j0694
13199A07402j3981P384N38r290j5204O290j750j8588K678J5873l111L921n79j597
13185G9986L905Q670K851n535k003J2968O738p146n519j0934j366J3913M563j222
13171I9869J468j386R073J086m933o052r453n927m906j0319k163q07L176j056
13157F7670j2936n71J7558J0225M934Q188o180o429J1555J8037K1664O73j2638
13144A21750r187O496L627L019R855l483n694P36J4398K4242L156J363K198n253
13130A67223j3416j3810R834Q119q140M068O172R76o158q592k299L300K089m545
13116A44821O826j054j6785j1303k267K552J9135K304q952J717K4378J4601p569
$$ plain form
13103 168404 168686 152858 145340 157442 166941 163808 171023 187833 209834 237948 261086 292988 310064
13090 310064 331369 355612 387133 400205 427480 444285 445399 427334 408927 385558 348950 323603
13078 323603 297457 275054 243656 221524 230506 239398 238508 235383 220470 199354 186355 190504 188116
13065 188116 201509 206788 212204 214234 214654 220366 240114 229521 213548 184359 184551 185251 191923 187932
13051 187932 183573 176897 165406 159256 162565 179524 192930 195912 203399 208749 224726 253898 253678
13038 253678 257519 268590 276600 265416 257118 244705 234093 229830 213233 211853 208705 201670 201694
13025 201694 198575 193118 207938 223448 225184 218672 218392 227899 235678 251598 262819 265638 271351
13012 271351 270139 279459 292384 294011 293849 291420 286878 291838 292595 293658 285433 280084 258119 249762
$$ packed form
13103A68404K82j5828p518J2102R499l133P215J6810K2001K8114K3138L1902J7076
13090C10064K1305K4243L1521J3072K7275J6805J114j8065j8407k3369l6608k5347
13078C23603k6146k2403l1398k2132Q982Q892q90l125j4913k1116j2999M149k388
13065A88116J3393N279N416K030M20N712J9748j0593j5973k9189J92P00O672l991
13051A87932m359o676j1491o150L309J6959J3406K982P487N350J5977K9172k20
13038B53678L841J1071Q010j1184q298j2413j0612m263j6597j380l148p035K4
13025B01694l119n457J4820J5510J736o512k80R507P779J5920J1221K819N713
13012B71351j212R320J2925J627j62k429m542M960P57J063q225n349k1965q357
$$ plain form
12998 249762 258971 285187 308586 301629 306448 325971 323806 320758 321240 331129 335691 338188 341824 341218
12984 341218 345607 341952 351153 362321 368197 372151 378674 396520 409148 404842 399336 400896 418278
12971 418278 437203 460815 475139 499307 530978 571455 627289 672381 707606 733322 769285
12960 769285 784486 786284 774912 735409 702018 661124 627406 613372 593576 590140 586647 592503
12948 592503 603419 621232 640035 669824 698565 715671 737007 739545 749355 789486 810265 831095
12936 831095 851984 861538 868178 883945 916282 948882 967781 984308 1003697 1029026 1040295 1046026
12924 1046026 1044343 1054287 1073550 1085867 1089430 1100151 1134538 1171394 1188265 1222061 1256483 1288805
12912 1288805 1323296 1356204 1391190 1465020 1563351 1681258 1809361 1950376 2099156 2242694
$$ packed form
12998B49762R209K6216K3399o957M819J9523k165l048M82R889M562K497L636o06
12984C41218M389l655R201J1168N876L954O523J7846J2628m306n506J560J7382
12971D18278J8925K3612J4324K4168L1671M0477N5834M5092L5225K5716L5963
12960G69285J5201J798j1372l9503l3391m0894l3718j4034j9796l436l493N856
12948E92503J0916J7813J8803K9789K8741J7106K1336K538R810M0131K0779K0830
12936H31095K0889R554O640J5767L2337L2600J8899J6527J9389K5329J1269N731
12924A046026j683R944J9263J2317L563J0721L4387L6856J6871L3796L4422L2322
12912A288805L4491L2908L4986P3830R8331J17907J28103J41015J48780J43538
$$ plain form
12902 2242694 2344631 2421975 2482758 2479535 2454891 2423334 2368073 2297740 2235627 2174266 2125031
12891 2125031 2093368 2089791 2096048 2084159 2089544 2104423 2101308 2113871 2125158 2143772 2178455 2214925
12879 2214925 2275591 2352863 2453197 2562580 2685482 2823875 2959277 3097722 3240809 3390484
12869 3390484 3545448 3725236 3928108 4132669 4368496 4642156 4950122 5298185 5699758
12860 5699758 6164727 6676665 7265654 7960045 8793560 9800103 11013486 12458255 14151043
12851 14151043 16107574 18311601 20841885 23741409 27089532 31055978 35861071 42000826
12843 42000826 50276318 62100814 79460444 104321084 137140852 175695460 217663885
12836 217663885 260771265 301985352 335648337 358493592 369446151 368091206 355339092
$$ packed form
12902B242694J01937P7344O0783l223k4644l1557n5261p0333o2113o1361m9235
12891B125031l1663l577O257j1889N385J4879l115J2563J1287J8614L4683L6470
12879B214925O0666P7272J00334J09383J22902J38393J35402J38445J43087J49675
12869C390484J54964J79788K02872K04561K35827K73660L07966L48063M01573
12860E699758M64969N11938N88989O94391Q33515J006543J213383J444769J692788
12851A4151043J956531K204027K530284K899524L348123L966446M805093O139755
12843D2000826Q275492J1824496J7359630K4860640L2819768L8554608M1968425
12836B17663885M3107380M1214087L3662985K2845255J0952559j354945j2752114
$$ plain form
12829 355339092 331635380 300722595 264938996 228915072 194714995 164140069 138428668
12822 138428668 118140878 103525633 92817603 84344942 77137108 70622022 64426066
12815 64426066 58462570 52763489 47406108 42409070 37834918 33770671 30221697 27149119
12807 27149119 24501950 22208089 20207624 18435016 16852112 15432108 14126160 12941808
12799 12941808 11873869 10897082 10007622 9196950 8468359 7805217 7189461 6623142 6128350
12790 6128350 5686056 5295470 4952861 4640605 4318233 4040332 3795151 3564996 3335624
12781 3335624 3110582 2862042 2606383 2359164 2121116 1905981 1718433 1560072 1435824
12772 1435824 1323050 1220010 1128538 1054129 996909 958808 935205 907571 872102 841279 818812
$$ packed form
12829C55339092k3703712l0912785l5783599l6023924l4200077l0574926k5711401
12822A38428668k0287790j4615245j0708030q472661p207834o515086o195956
12815F4426066n963496n699081n357381m997038m574152m064247l548974l072578
12807B7149119k647169k293861k000465j772608j582904j420004j305948j184352
12799A2941808j067939r76787q89460q10672p28591o63142o15756n66319m94792
12790F128350m42294l90586l42609l12256l22372k77901k45181k30155k29372
12781C335624k25042k48540k55659k47219k38048k15135j87548j58361j24248
12772A435824j12774j03040r1472p4409n7220l8101k3603k7634l5469l0823k2467
$$ plain form
12761 818812 792083 770376 732631 697548 661103 621988 582680 549693 532466 522080 515414 502939
12749 502939 488702 473977 478137 472802 469029 461076 452815 449173 435326 416897 402398 399579 398199
12736 398199 375935 349792 345072 333038 335093 340209 340901 345597 353317 352479 346598 349396 355803 346477
12722 346477 328949 336392 345621 346998 358140 363469 385619 421741 442238 480696 522483 541221
12710 541221 555630 566699 576344 578305 555468 513593 476018 439371 393522 356588 340221 313916
12698 313916 296929 278182 283683 287411 284084 282229 280164 286296 302056 310714 319491 314476 315596
12685 315596 339415 361656 376703 377176 366064 347519 324360 311665 317690 325340 301606 292972
12673 292972 314143 323328 310537 292110 292863 292165 285196 291629 298658 299641 284851 264367 243694
$$ packed form
12761H18812k6729k1707l7745l5083l6445l9115l9308l2987j7227j0386o666j2475
12749E02939j4237j4725M160n335l773p953q261l642j3847j8429j4499k819j380
12736C98199k2264k6143m720j2034K055N116O92M696P720q38n881K798O407r326
12722C46477j7528P443R229J377J1142N329K2150L6122K0497L8458M1787J8738
12710E41221J4409J1069R645J961k2837m1875l7575l6647m5849l6934j6367k6305
12698C13916j6987j8747N501L728l327j855k065O132J5760Q658Q777n015J120
12685C15596K3819K2241J5047M73j1112j8545k3159j2695O025P650k3734q634
12673B92972K1171R185j2791j8427P53o98o969O433P029R83j4790k0484k0673
$$ plain form
12660 243694 235804 234046 222869 222136 212546 193176 184221 171071 161240 149818 137906 130367 127739
12647 127739 119004 116553 118352 131469 125744 132109 155522 164830 166318 173650 186603 191366 181095
12634 181095 163777 140429 106779 95867 89443 81630 96668 97225 99233 108080 119335 137623 162045
12621 162045 166798 182579 202730 250384 278345 313617 390597 493828 636488 762340 857415
12610 857415 946954 1015466 1065534 1078129 1048157 981516 897356 799429 693356 609928 546268
12599 546268 493618 465279 456423 486383 541109 626219 721166 812524 905092 986646 1055190 1098072
12587 1098072 1098777 1055797 977346 886438 790328 703316 616889 554739 498989 445397 407988 375085
12575 375085 344812 309730 267494 218630 181271 165254 142411 128040 120054 112672 118203 119931
$$ packed form
12660B43694p890j758j1177p33r590j9370q955j3150r831j1422j1912p539k628
12647A27739q735k451J799J3117n725O365K3413R308J488P332J2953M763j0271
12634A81095j7318k3348l3650j0912o424p813J5038N57K008Q847J1255J8288K4422
12621A62045M753J5781K0151M7654K7961L5272P6980J03231J42660J25852R5075
12610H57415Q9539O8512N0068J2595k9972o6641q4160r7927j06073q3428o3660
12599E46268n2650k8339q856K9960N4726Q5110R4947R1358R2568Q1554O8544M2882
12587A098072P05m2980p8451r0908r6110q7012q6427o2150n5750n3592l7409l2903
12575C75085l0273l5082m2236m8864l7359j6017k2843j4371p986p382N531J728
$$ plain form
12563 119931 113989 110333 99052 101062 102074 96021 91441 95150 99042 92606 82069 69972 77167
12550 77167 89954 73324 74498 79887 83612 87090 84859 75526 69070 70896 75023 81892 67207 49161
12536 49161 29232 31265 37529 27695 11692 17911 20124 15521 14259 19555 17776 7387 -7069
12523 -7069 -16466 -10505 1093 -848 647 21541 18572 14214 21299 23069 36397 34984 32448 39759
12509 39759 56856 57923 54137 48201 46295 54233 58430 57339 43556 32376 40165 44452 34975 31837
12495 31837 37294 36634 60632 65948 67232 62465 65786 63336 62668 55073 47869 50443 60437 53961 55878
12480 55878 64216 63286 50381 64459 60835 41791 33573 30821 54762 69752 57671 49440 49898
12467 49898 58937 69062 62200 58371 54968 55314 35774 39340 39596 35199 46433 52637 56042 50902
$$ packed form
12563A19931n942l656j1281K010J012o053m580L709L892o436j0537j2097P195
12550G7167J2787j6630J174N389L725L478k231r333o456J826M127O869j4685j8046
12536D9161j9929K033O264r834j6003O219K213m603j262N296j779j0389j4456
12523g069r397N961J1598j941J495K0894k969m358P085J770J3328j413k536P311
12509C9759J7097J067l786n936j906P938M197j091j3783j1180P789M287r477l138
12495C1837N457o60K3998N316J284m767L321k450o68p595p204K574R994o476J917
12480E5878Q338r30j2905J4078l624j9044q218k752K3941J4990j2081q231M58
12467D9898R039J0125o862l829l403L46j9540L566K56m397J1234O204L405n140
$$ plain form
12453 50902 42293 38758 42854 45223 51708 68972 83488 89178 97940 105950 108466 109033 119165 128834
12439 128834 127820 127558 128260 122507 112790 127623 157502 174030 200702 213898 233702 271661 346374
12426 346374 447312 581189 768682 986607 1173447 1291538 1273782 1149533 1017246 919622
12416 919622 862996 847504 857354 883374 945783 1017177 1127237 1294106 1532625 1828771 2129915
12405 2129915 2405872 2628239 2779784 2884528 2950290 2969816 2933243 2812729 2610838 2388619
12395 2388619 2172279 1995719 1859114 1779132 1761868 1812194 1932149 2145769 2458803 2823512
12385 2823512 3109184 3206616 3106472 2809474 2427685 2081586 1794027 1598552 1472538 1377863
12375 1377863 1331761 1317539 1338044 1376506 1390492 1379739 1339002 1273825 1182298 1108917 1043414
$$ packed form
12453E0902q609l535M096K369O485J7264J4516N690Q762Q010K516N67J0132R669
12439A28834j014k62P02n753r717J4833K9879J6528K6672J3196J9804L7959P4713
12426C46374J00938J33877J87493K17925J86840J18091j7756j24249j32287r7624
12416I19622n6626j5492R850K6020O2409P1394J10060J66869K38519K96146L01144
12405B129915K75957K22367J51545J04744O5762J9526l6573j20514k01891k22219
12395B388619k16340j76560j36605p9982j7264N0326J19955K13620L13034L64709
12385B823512K85672R7432j00144k96998l81789l46099k87559j95475j26014r4675
12375A377863m6102j4222K0505L8462J3986j0753m0737o5177r1527p3381o5503
$$ plain form
12364 1043414 1006738 990966 969337 931034 888516 837436 786138 749731 721146 711289 720264 742291
12352 742291 787614 868443 998789 1177064 1325302 1381328 1286127 1096500 894431 720592
12342 720592 598492 519690 456875 397395 362084 339431 307768 296032 277806 247907 233148
12331 233148 216636 210616 205955 187014 153414 146115 139392 127730 121173 128387 121715 90419 68746
12318 68746 63492 61652 61934 71504 65795 46481 45328 46931 60030 42798 37602 46559 56650 53601
12304 53601 42647 37271 50406 52869 41989 34114 29764 25520 21682 29778 23393 19723 16373 21401
12290 21401 12461 18020 14161 16522 13148 6276 17556 18974 6642 3611 -4415 -8094 -7067 -1992
12276 -1992 12057 13813 14165 11301 18035 10849 -1807 -17943 -15242 -6478 -17550 -17719 -16363 -8615
$$ packed form
12364A043414l6676j5772k1629l8303m2518n1080n1298l6407k8585r857Q975K2027
12352G42291M5323Q0829J30346J78275J48238N6026r5201j89627k02069j73839
12342G20592j22100p8802o2815n9480l5311k2653l1663j1736j8226k9899j4759
12331B33148j6512o020m661j8941l3600p299o723j1662o557P214o672l1296k1673
12318F8746n254j840K82R570n709j9314j153J603J3099j7232n196Q957J0091l049
12304E3601j0954n376J3135K463j0880p875m350m244l838Q096o385l670l350N028
12290B1401q940N559l859K361l374o872J1280J418j2332l031q026l679J027N075
12276a992J4049J756L52k864O734p186j2656j6136K701Q764j1072j69J356P748
$$ plain form
12262 -8615 -4602 -10408 -22743 -26901 -14732 -6085 -9053 -18961 -24078 -19134 -19441 -22177 -13399 -12237
12248 -12237 -10679 -9448 -15507 -22522 -10274 -3487 -1169 -3107 -14568 -10953 -21213 -22829 -10266
12235 -10266 -11970 -15016 -16987 -6368 -10239 -19358 -25082 -23120 -29473 -42998 -50143 -43998 -32267 -16507
12221 -16507 -21166 -21160 -7065 98 -5792 -14292 -17341 -30273 -33847 -26817 -22935 -20191 -29431 -29464 -34225
12206 -34225 -35084 -37446 -33759 -25860 -28204 -35273 -37032 -34285 -37909 -44752 -47704 -44906 -31861 -10324
12192 -10324 8818 7505 6163 -322 -14710 -24971 -23868 -25983 -24769 -8782 -17448 -18739 -16277
12179 -16277 -14284 -13999 -20100 -29100 -36078 -31873 -28376 -34015 -35195 -29907 -27824 -29769 -27029 -20265 -30833
12164 -30833 -31814 -13569 -16344 -16699 -7199 -9503 -13442 -3574 10154 21760 15993 -4782 -16493 -19824
$$ packed form
12262h615M013n806j2335m158J2169Q647k968r908n117M944l07k736Q778J162
12248a2237J558J231o059p015J2248O787K318j938j1461L615j0260j616J2563
12235a0266j704l046j971J0619l871r119n724J962o353j3525p145O145J1731J5760
12221a6507m659OJ4095P163n890q500l049j2932l574P030L882K744r240l3m761
12206c4225q59k362L687P899k344p069j759K747l624o843k952K798J3045K1537
12192a0324J9142j313j342o485j4388j0261J103k115J214J5987q666j291K462
12179a6277J993K85o101r000o978M205L497n639j180N288K083j945K740O764j0568
12164c0833r81J8245k775l55R500k304l939R868J3728J1606n767k0775j1711l331
$$ plain form
12150 -19824 -17343 -18971 -21763 -20338 -21761 -29750 -35945 -26701 -14839 -22471 -37187 -44380 -32819 -22541
12136 -22541 -21053 -11408 -8193 87 1498 -6768 -22934 -25071 -27015 -22354 -21617 -17511 -27487 -39760
12122 -39760 -47223 -46847 -39478 -32345 -21630 -18028 -9458 -2989 -5761 -776 -12410 -24153 -31999 -18195
12108 -18195 -14423 -15660 -13006 -17315 -25811 -7337 5582 7062 4301 -1810 -10682 -16564 -17661 -13408
12094 -13408 -14285 -21849 -22869 -22138 -26805 -29088 -21207 -21849 -22461 -28028 -21824 -780 -2436 -14487 -8425
12079 -8425 -7452 -4420 -5744 -6334 -11158 -14997 -19361 -8781 -4000 -17966 -29793 -28140 -25994 -24060
12065 -24060 -15976 -52 14636 29440 59269 63924 43971 33129 16402 2251 6836 -3550
12053 -3550 -9302 -3172 -4399 -10055 -8841 -18776 -30972 -25553 -21562 -19041 -18469 -7616 -12354 -15673
$$ packed form
12150a9824K481j628k792J425j423p989o195R244J1862p632j4716p193J1561J0278
12136b2541J488R645L215Q280J411q266j6166k137j944M661P37M106r976j2273
12122c9760p463L76P369P133J0715L602Q570O469k772M985j1634j1743p846J3804
12108a8195L772j237K654m309q496J8474J2919J480k761o111q872n882j097M253
12094a3408q77p564j020P31m667k283P881o42o12n567O204K1044j656j2051O062
12079h425R73L032j324n90m824l839m364J0580M781j3966j1827J653K146J934
12065b4060Q084J5924J4688J4804K9829M655j9953j0842j6727j4151M585j0386
12053c550n752O130j227n656J214r935j2196N419L991K521N72J0853m738l319
$$ plain form
12039 -15673 -18658 -15845 -16633 -14910 -25770 -27626 -25643 -28461 -22754 -21303 -40512 -47936 -36822 -20837
12025 -20837 -31734 -18023 -16697 -22871 -11747 -3403 -9059 -17766 -16001 -5715 -4759 -10150 -10428 -12873
12011 -12873 -4506 6717 2861 -7732 -9473 -6768 -1981 1618 -5114 2847 18846 16048 2485
11998 2485 -9434 -31135 -38451 -34015 -40889 -46068 -28424 -17294 -35461 -43851 -33433 -23375 -27079
11985 -27079 -37484 -28620 -26793 -26367 -25010 -27750 -29197 -32549 -18436 -25065 -36868 -27594 -15283 -17119
11971 -17119 -29367 -37526 -43639 -36512 -30047 -22873 -22570 -22966 -22620 -12801 -6589 8025 8276 2413 -1063
11956 -1063 -1159 -4619 -2567 -200 106 2418 4600 8201 7566 4157 -2860 -5060 -6857 -13169 -8943 1444
11940 1444 15828 10938 3314 12638 33919 53852 72695 85724 78218 48618 13248 222 -8670
$$ packed form
12039a5673k985K813p88J723j0860j856J983k818N707J451j9209p424J1114J5985
12025b0837j0897J3711J326o174J1124Q344n656q707J765J0286R56n391k78k445
12011a2873Q367J1223l856j0593j741K705M787L599o732P961J5999k798j3563
11998B485j1919k1701p316M436o874n179J7644J1130j8167q390J0418J0058l704
11985b7079j0405Q864J827M26J357k740j447l352J4113o629j1803R274J2311j836
11971a7119j2248q159o113P127O465P174L03l96L46R819O212J4614K51n863l476
11956a063r6l460K052K367L06K312K182L601o35l409p017k200j797o312M226J0387
11940A444J4384m890p624R324K1281J9933J8843J3029p506k9600l5370j3026q892
$$ plain form
11927 -8670 -10447 -11162 -12819 -6343 11412 13282 4637 -4038 -16473 -6977 -253 -1410 3176 3348 15448
11912 15448 18873 45567 71364 78223 79035 69456 46526 30490 14449 4946 -989 -12091 432
11899 432 11109 20466 2873 -1933 3687 10759 633 -10351 -12759 -14747 -24332 -22194 -12737 -18540
11885 -18540 -14488 -11640 -9057 -11579 -12120 -8055 -8065 -9981 -23885 -26832 -4493 10436 -7354 -19630
11871 -19630 -8889 -10511 -24716 -32246 -36080 -20761 -12374 -3220 7762 8721 1919 6693 13537 7855
11857 7855 -2908 -16270 -17661 -10054 -28046 -34664 -23290 -8921 -17733 -33077 -27735 -8422 -706
11844 -706 7420 -5789 -10820 -2965 1433 10735 1682 -4025 -5246 2184 5904 12574 16373 13582 11124
11829 11124 4776 -8410 -4917 3980 16825 15871 11644 11331 -2306 -14677 -27512 -29305 -21923 -19047
$$ packed form
11927h670j777p15j657O476J7755J870q645q675j2435R496O724j157M586J72J2100
11912A5448L425K6694K5797O859Q12r579k2930j6036j6041r503n935j1102J2523
11899D32J0677R357j7593m806N620P072j0126j0984k408j988r585K138R457n803
11885a8540M052K848K583k522n41M065j0j916j3904k947K2339J4929j7790j2276
11871a9630J0741j622j4205p530l834J5319Q387R154J0982R59o802M774O844n682
11857G855j0763j3362j391P607j7992o618J1374J4369q812j5344N342J9313P716
11844g06Q126j3209n031P855M398R302r053n707j221P430L720O670L799k791k458
11829A1124o348j3186L493Q897J2845r54m227l13j3637j2371j2835j793P382K876
$$ plain form
11815 -19047 -22409 -18385 -17984 -17175 -8352 -14474 -27695 -15066 -11458 -10743 -13820 -21582 -21220 -9163 -7270
11800 -7270 -11212 -2066 -3411 -22022 -31510 -28344 -29480 -32532 -25072 -17255 -13675 -12693 -12215 -26934 -35807
11785 -35807 -24752 -23561 -22041 -16877 -25713 -32070 -31652 -32005 -34426 -28578 -18075 -10380 -2380 5393
11771 5393 -14485 -32033 -14274 2721 2572 -3524 -10846 -8003 -18415 -22605 -29688 -33918 -34818 -27814
11757 -27814 -17474 -8363 -13230 -21207 -18138 -17858 -24105 -27998 -22769 -13799 -10549 1119 -3013 -16767
11743 -16767 -35988 -31185 -27491 -14331 -14894 -19189 -26699 -28560 -19453 -5956 -5036 -2298 -3441 -13089
11729 -13089 -20108 -24605 -23254 -22751 -32299 -20980 -5310 -12704 -16531 -2857 -1854 4830 1963 -12817
11715 -12817 -17459 -12788 -8266 2175 5199 15366 23338 29726 35614 54316 81225 113552 131103
$$ packed form
11815a9047l362M024M01Q09Q823o122j3221J2629L608P15l077p762L62J2057J893
11800g270l942R146j345j8611r488L166j136l052P460P817L580R82M78j4719q873
11785c5807J1055J191J520N164q836o357M18l53k421N848J0503P695Q000P773
11771E393j9878j7548J7759J6995j49o096p322K843j0412m190p083m230r00P004
11757b7814J0340R111m867p977L069K80o247l893N229Q970L250J1668m132j3754
11743a6767j9221M803L694J3160n63m295p510j861R107J3497R20K738j143r648
11729a3089p019m497J351N03r548J1319J5670p394l827J3674J003O684k867j4780
11715a2817m642M671M522J0441L024J0167P972O388N888J8702K6909L2327J7551
$$ plain form
11702 131103 132033 130726 99306 74577 66853 51759 44780 47942 39772 25227 30620 29871 8481
11689 8481 9720 -7523 -14489 -20052 -16023 -2050 5371 -5923 -13785 -13265 -12132 -11907 408 -2326
11675 -2326 -15939 -13828 -2142 6435 17854 23673 18953 3055 4242 23663 43687 69620 103431
11662 103431 141838 181568 251520 311258 366769 413100 405559 348218 295377 241441 179742 132005
11650 132005 105214 87713 72810 73588 89603 98709 89773 88493 104145 104259 85458 57362 37220
11637 37220 13115 -5277 -7602 -4453 -1679 8229 18549 26226 25402 24904 21326 14620 12614 12564 21728
11622 21728 37347 40975 59186 68339 81699 118087 162779 213239 271396 339826 381953 385931
11610 385931 355664 300992 248358 210005 179899 151172 125723 108385 101280 84521 62006 41049
$$ packed form
11702A31103R30j307l1420k4729p724j5094o979L162q170j4545N393p49k1390
11689H481J239j7243o966n563M029J3973P421j1294p862N20J133K25J2315k734
11675b326j3613K111J1686Q577J1419N819m720j5898J187J9421K0024K5933L3811
11662A03431L8407L9730O9952N9738N5511M6331p541n7341n2841n3936o1699m7737
11650A32005k6791j7501j4903P78J6015R106q936j280J5652J14j8801k8096k0142
11637C7220k4105j8392k325L149K774R908J0320P677q24m98l578o706k006n0R164
11622B1728J5619L628J8211R153J3360L6388M4692N0460N8157O8430M2127L978
11610C85931l0267n4672n2634l8353l0106k8727k5449j7338p105j6759k2515k0957
$$ plain form
11598 41049 45110 46755 41549 49934 56493 41743 33742 18481 11724 14443 22490 15199 19415 13758
11584 13758 11417 17068 9977 -3762 -259 4767 15329 17514 5538 2328 7487 21665 44389
11571 44389 51668 60933 78756 92648 106593 112723 112363 98198 76057 47754 30849 30919 36992
11558 36992 48220 50287 37207 37429 24612 14087 6984 -5951 -12981 -12627 -9139 -4261 -4416 -3686
11544 -3686 -11826 -3659 1668 -6013 -14830 -15695 -8487 -15216 -15733 -15564 -18712 -14531 -22500 -15001 -10654
11529 -10654 -30623 -37126 -42484 -43347 -37147 -31262 -33647 -30223 -34378 -31156 -21139 -21519 -38898 -42656
11515 -42656 -34816 -33356 -25631 -19545 -16565 -17761 -30742 -27317 -38446 -36886 -39093 -49903 -57723 -58002
11501 -58002 -48671 -31671 -27126 -29528 -22080 -30075 -26183 -16756 -7942 -6968 -3934 -7287 -10564 -17331
$$ packed form
11598D1049M061J645n206Q385O559j4750q001j5261o757K719Q047p291M216n657
11584A3758k341N651p091j3739L503N026J0562K185j1976l210N159J4178K2724
11571D4389P279R265J7823J3892J3945O130l60j4165k2141k8303j6905P0O073
11558C6992J1228K067j3080K22j2817j0525p103j2935p030L54L488M878j55P30
11544c686q140Q167N327p681q817q65P208o729n17J69l148M181p969P499M347
11529a0654j9969o503n358q63O200N885k385L424m155L222J0017l80j7379l758
11515d2656P840J460P725O086K980j196j2981L425j1129J560k207j0810p820k79
11501e8002R331J7000M545k402P448p995L892R427Q814R74L034l353l277o767
$$ plain form
11487 -17331 -17025 -24570 -25202 -19109 -7999 872 617 10588 10454 14628 13643 3118 -5695 -12468 -17742
11472 -17742 -23526 -30313 -21382 -14325 -2944 509 -12392 -26293 -45672 -44973 -36112 -30904 -21172 -15701
11458 -15701 -2005 -3852 -13557 -15884 -8212 -7740 -17968 -24079 -22570 -18436 -21105 -11721 -26404 -38340
11444 -38340 -41711 -37590 -34012 -30389 -29628 -28982 -32823 -44785 -51707 -42244 -16165 -9243 -17660 -19983
11430 -19983 -14032 -18009 -15973 -11068 -13455 -16439 -9061 -6011 -9519 -16893 -23989 -22365 -17084 -9681
11416 -9681 -1401 -2273 -4092 -2171 -13884 -6046 416 1790 -9429 -10895 -9724 -5791 -6546 -17072
11402 -17072 -20973 -35756 -44014 -40081 -42843 -42490 -41330 -33629 -22251 -24377 -34353 -30347 -37238 -42542
11388 -42542 -27700 -17148 -12785 -16687 -34749 -24888 -15555 -20828 -27895 -19358 -13765 -10363 -15815 -16675
$$ packed form
11487a7331L06p545o32O093J1110Q871k55R971j34M174r85j0525q813o773n274
11472a7742n784o787Q931P057J1381L453j2901j3901j9379O99Q861N208R732N471
11458a5701J3696j847r705k327P672M72j0228o111J509M134k669R384j4683j1936
11444c8340l371M121L578L623P61O46l841j1962o922R463K6079O922q417k323
11430a9983N951l977K036M905k387k984P378L050l508p374p096J624N281P403
11416i681Q280q72j819J921j1713P838O462J374j1219j466J171L933p55j0526
11402a7072l901j4783q258L933k762L53J160P701J1378k126r976M006o891n304
11388d2542J4842J0552M363l902j8062R861R333n273p067Q537N593L402n452q60
$$ plain form
11374 -16675 -15514 -9240 -4456 -1676 -11159 -22492 -23839 -18695 -2723 -4724 -3312 -9518 -18435 -19034
11360 -19034 -11866 -19583 -24368 -34197 -40103 -35683 -33706 -33100 -43093 -31828 -41547 -46736 -28104 -23845
11346 -23845 -17553 -10313 -333 3322 -1373 -4848 -19730 -24747 -23606 -19277 -14445 -21291 -22288 -31969
11332 -31969 -30242 -40166 -51540 -56214 -42148 -39878 -38729 -43891 -42445 -31648 -31461 -36753 -35088 -36693
11318 -36693 -33454 -31866 -33918 -38856 -35568 -27105 -29066 -24232 -18992 -11620 6618 671 -9623 -8923
11304 -8923 -5199 -2727 -3419 -5856 -9216 -26858 -31215 -25729 -38923 -38674 -32904 -30251 -26484 -31198 -32207
11289 -32207 -31082 -35558 -25932 -21029 -20464 -4838 1655 16831 25134 18822 -3526 -24813 -30848 -28990
11275 -28990 -17310 -6809 1800 -915 -15779 -12344 -11015 -11772 -9614 -12364 -13240 -12674 -6717 -11564
$$ packed form
11374a6675J161O274M784K780r483j1333j347N144J5972k001J412o206q917n99
11360a9034P168p717m785r829n906M420J977O06r993J1265r719n189J8632M259
11346b3845O292P240R980L655m695l475j4882n017J141M329M832o846r97r681
11332c1969J727r924j1374m674J4066K270J149n162J446J0797J87n292J665j605
11318c6693L239J588k052m938L288Q463j961M834N240P372J8238n947j0294P00
11304h923L724K472o92k437l360j7642m357N486j3194K49N770K653L767m714j009
11289c2207J125m476R626M903N65J5626O493J5176Q303o312k2348k1287o035J858
11275b8990J1680J0501Q609k715j4864L435J329p57K158k750q76N66N957m847
$$ plain form
11261 -11564 -12679 -5826 2811 2543 2133 6329 5653 15999 26284 8076 -14079 -21903 -17379 -6649
11247 -6649 -9689 -10750 -15279 -12189 -3254 -7981 -13927 -9482 -10461 -17721 -7447 -7086 -9761 -9859 -9236 -4337
11231 -4337 2078 4502 428 -10535 -13364 -20790 -28427 -26649 -15202 -16371 -17574 -34535 -28937 -19611
11217 -19611 -23448 -17994 -8780 -2698 -4798 -10069 -10803 -30356 -42602 -60525 -61391 -58600 -37336 -28841
11203 -28841 -24374 -13803 -20220 -40188 -40589 -32180 -28669 -35036 -37951 -37043 -26249 -16357 -26792 -26696
11189 -26696 -29750 -28346 -25956 -33858 -37757 -36285 -34689 -38799 -38453 -24123 -21846 -30149 -31983 -26649
11175 -26649 -8891 -2462 -14133 -6604 -3270 10169 18211 7091 8344 8248 497 -5974 -4558 5199
11161 5199 -4110 -13173 -13153 -3359 4464 -10520 -21469 -12907 -5112 -12065 -19703 -34297 -39421 -33533
$$ packed form
11261a1564j115O853Q637k68m10M196o76J0346J0285j8208k2155p824M524J0730
11247f649l040j061m529L090Q935m727n946M445r79p260J0274L61k675r8O23M899
11231d337O415K424m074j0963k829p426p637J778J1447j169j203j6961N598R326
11217a9611l837N454R214O082k100n271p34j9553j2246j7923q66K791K1264Q495
11203b8841M467J0571o417j9968m01Q409L511o367k915R08J0794R892j0435R6
11189b6696l054J404K390p902l899J472J596m110L46J4330K277q303j834N334
11175b6649J7758O429j1671P529L334J3439Q042j1120J253r6p751o471J416R757
11161E199r309r063K0R794P823j4984j0949Q562P795o953p638j4594n124N888
$$ plain form
11147 -33533 -17603 -11176 -14196 -17713 -17695 -3322 -2656 -4036 790 -17176 -29984 -30163 -32171 -32886 -21624
11132 -21624 -19099 -10943 -4016 -17188 -17140 -14251 -14536 -20490 -17436 -12927 -6688 4847 8984 -6935
11118 -6935 -16201 -27483 -33566 -35268 -29833 -16104 -617 -8867 -2466 -1488 3651 2613 -6557 -17056
11104 -17056 -18792 -2807 8795 -4231 -3682 -7066 -16228 -649 13729 4900 -7121 -12982 -11291
11091 -11291 2798 18533 20142 8100 -139 -677 -6353 -21555 -14706 -12608 -10564 -27571 -31282
11078 -31282 -31953 -30064 -31179 -32150 -27496 1301 7222 12832 4916 7284 -1420 -8824 -8816 -7485 -15950
11063 -15950 -27448 -35278 -27942 -8977 1020 7201 -6180 -14674 -23941 -26849 -23134 -11913 -8452
11050 -8452 -2568 -689 3374 -11694 -25861 -27523 -37738 -38001 -11893 3257 -7834 -18264 -14855
$$ packed form
11147c3533J5930O427l020l517J8J4373O66j380M826j7966j2808j79k008p15J1262
11132b1624K525Q156O927j3172M8K889k85n954L054M509O239J1535M137j5919
11118f935r266j1282o083j702N435J3729J5487q250O401R78N139j038r170j0499
11104a7056j736J5985J1602j3026N49l384r162J5579J4378q829j2021n861J691
11091a1291J4089J5735J609j2042q239n38n676j5202O849K098K044j7007l711
11078c1282o71J889j115r71M654K8797N921N610p916K368q704p404QJ331q465
11063a5950j1498p830P336J8965R997O181j3381q494r267k908L715J1221L461
11050h452N884J879M063j5068j4167j662j0215k63K6108J5150j1091j0430L409
$$ plain form
11037 -14855 1120 1385 -4050 -18997 -17690 -16153 -17331 -10705 -20791 -19565 -6704 -8180 -14351 -15091
11023 -15091 -15254 -23652 -18395 -5063 -267 4048 2844 -2571 -19629 -20606 -12382 -17436 -18315 -31429
11009 -31429 -18716 -10499 -18737 -5910 1206 -3238 -1217 1566 1888 6201 9003 -9032 -13735 -1059
10995 -1059 -1881 3868 13361 5934 -4195 -3889 -11644 -16045 -13360 -11405 -14640 -10848 -20604 -11813 -6679
10980 -6679 -15500 -22476 -17326 -16914 -10587 -216 6298 -457 -4628 -6463 -21731 -32320 -26764 -18223
10966 -18223 -20133 -14896 -6335 -10542 -7843 -9803 -12034 -11100 -13076 -10763 -7862 -1129 1033 4859 8487
10951 8487 -4411 -11700 -7062 2883 1653 -6922 -8633 -8248 -1497 -7120 -3537 2907 -1771 -5071 7784
10936 7784 10894 5967 -1216 -2256 -3762 -8494 -19086 -27822 -22556 -13394 4853 7882 -3901 -15657
$$ packed form
11037a4855J5975K65n435j4947J307J537j178O626j0086J226J2861j476o171p40
11023a5091j63q398N257J3332M796M315j204n415j7058r77Q224n054q79j3114
11009c1429J2713Q217q238J2827P116m444K021K783L22M313K802j8035m703J2676
10995a059q22N749R493p427j0129L06p755m401K685J955l235L792r756Q791N134
10980f679q821o976N150M12O327J0371O514o755m171j835j5268j0589N556Q541
10966a8223j910N237Q561m207K699j960k231R34j976K313K901O733K162L826L628
10951H487j2898p289M638R945j230q575j711L85O751n623L583O444m678l300J2855
10936G784L110m927p183j040j506m732j0592q736N266R162J8247L029j1783j1756
$$ plain form
10922 -15657 -20158 -13329 -3479 -11455 -3270 -3736 2066 -937 6049 11917 10438 5152 3780 12292 23172
10907 23172 25477 13882 10392 -227 -4045 7312 6352 11865 13912 6407 6514 10904 17207 17719
10893 17719 20422 23092 16288 25653 39554 30085 15411 13276 12751 12354 5254 702 6614 8947
10879 8947 -82 11812 15829 15855 13356 3358 3458 9787 10650 3930 -3840 162 10199 18808 19580
10864 19580 2497 2039 -4811 -3176 -5875 3850 5031 3118 -2713 -15536 -10946 9727 19108 20340
10850 20340 20414 30876 16665 889 10266 16990 13258 12125 7354 1785 -532 2515 919 2158
10836 2158 758 -9565 -483 1353 -1493 3834 8947 19850 19152 2041 15183 17044 11382 10336
10822 10336 -7173 -12809 -17406 -7153 1178 -12691 -19842 -7638 -3729 -15853 -14632 -6255 5004
$$ packed form
10922a5657m501O829R850p976Q185m66N802l003O986N868j479n286j372Q512J0880
10907B3172K305j1595l490j0619l818J1357r60N513K047p505J07M390O303N12
10893A7719K703K670o804R365J3901r469j4674k135n25l97p100m552N912K333
10879H947r029J1894M017K6k499r998J00O329Q63o720p770M002J0037Q609P72
10864A9580j7083m58o850J635k699R725J181j913n831j2823M590K0673R381J232
10850B0340P4J0462j4211j5776R377O724l732j133m771n569k317L047j596J239
10836B158j400j0323R082J836k846N327N113J0903o98j7111J3142J861n662j046
10822A0336j7509n636m597J0253Q331j3869p151J2204L909j2124J221Q377J1259
$$ plain form
10809 5004 13670 13816 15686 4397 -11912 -8090 -2041 6633 -7432 -18095 -5701 -42 -8440 -1148
10795 -1148 -5077 -18432 -18394 -3905 819 -954 -9556 -13125 -6077 -7595 -5633 -7091 -20500 -18420
10781 -18420 -11557 -9299 -14739 -18907 -14359 -2895 8642 10654 228 488 1918 2942 8302 2131
10767 2131 -17363 -16366 -14236 -14087 -2152 14950 16472 339 -7379 -4479 -15223 -26875 -7460
10754 -7460 -6150 -13064 -7591 933 -7703 -12359 -17137 -12242 -8972 10971 28530 10574 -52 -18570
10740 -18570 -25687 -10276 8764 11402 5939 -2089 5278 22188 17745 6644 10277 14443 5798
10727 5798 3002 1212 -3 -4651 -13885 -9708 -1261 1931 8253 6285 -8649 -25463 -31931 -24098
10713 -24098 -15402 -13333 -11929 -12675 -16667 -18313 -18942 -28700 -21458 -9087 -8081 -16406 -14862 -8106 -7472
$$ packed form
10809E004Q666J46J870j1289j6309L822O049Q674j4065j0663J2394N659q398P292
10795a148l929j3355L8J4489M724j773q602l569P048j518J962j458j3409K080
10781a8420O863K258n440m168M548J1464J1537K012j0426K60J430J024N360o171
10767B131j9494R97K130J49J1935J7102J522j6133p718K900j0744j1652J9415
10754g460J310o914N473Q524q636m656m778M895L270J9943J7559j7956j0626j8518
10740a8570p117J5411J9040K638n463q028P367J6910m443j1101L633M166q645
10727E798k796j790j215m648r234M177Q447L192O322j968j4934j6814o468P833
10713b4098Q696K069J404p46l992j646o29r758P242J2371J006q325J544O756O34
$$ plain form
10698 -7472 -8335 -10502 -9481 -5221 -6130 -8925 -13292 -8027 -9512 -5100 7348 18236 16979 15084 22454
10683 22454 20881 13860 16421 2580 -8777 -2540 12244 7277 -761 5479 15778 19336 15419
10670 15419 13990 9970 5160 15871 23677 27295 17137 14330 20684 21757 16122 16095 15592 3830
10656 3830 3795 15428 16792 16252 11466 17063 12984 271 -1782 -10591 -1878 5867 3470 6218 5909
10641 5909 -187 -6071 -130 6511 8960 18159 17201 -3077 -7623 1743 6930 -4584 6531 12336
10627 12336 -517 -8265 -961 11813 8125 2470 -557 -6177 -8678 -3007 5095 4916 5184 7906
10613 7906 9645 10527 4639 18546 35695 35370 38415 25639 1910 -5782 -238 8270 5782 2977
10599 2977 8036 21170 21719 13216 17932 10988 -890 -7737 -8316 5478 12616 14934 8190 -117
$$ packed form
10698g472q63k167J021M260r09k795m367N265j485M412J2448J0888j257j895P370
10683B2454j573p021K561j3841j1357O237J4784m967q038O240J0299L558l917
10670A5419j429m020m810J0711P806L618j0158k807O354J073n635k7n03j1762
10656C830l5J1633J364n40m786N597m079j2713k053q809Q713P745k397K748l09
10641E909o096n884N941O641K449R199r58k0278m546R366N187j1514J1115N805
10627A2336j2853p748P304J2774l688n655l027n620k501N671Q102j79K68K722
10613G906J739Q82n888J3907J7149l25L045j2776k3729p692N544Q508k488k805
10599B977N059J3134N49q503M716o944j1878o847n79J3794P138K318o744q307
$$ plain form
10585 -117 1033 -7663 -10782 -4704 4598 -10278 -15798 -15598 -24781 -10399 -6301 -5181 -4304 -431 -1233
10570 -1233 1208 6642 3674 283 -9448 -8672 -5926 -2974 -4223 3384 10198 25658 30117 25752 45768
10555 45768 58727 63904 67457 88447 131684 166253 167834 153539 118916 83319 70395 45743
10543 45743 21385 18328 25399 31508 28408 22718 16226 3495 -3198 2372 20050 15986 8729 18056
10529 18056 19416 19202 19478 18198 36794 49100 48418 38755 39141 45282 37422 19248 22795 36855
10515 36855 47325 45759 48941 41135 40140 40507 31394 21888 14857 10572 7663 16327 9867 6424 13546
10500 13546 24949 27853 21965 21066 17310 14934 8119 -4926 -11172 -12792 -6277 -9094 1234 2171
10486 2171 6379 -2964 -11459 313 -1012 6103 18280 22108 19483 15475 13002 12819 7328 9804
$$ packed form
10585a17J150q696l119O078R302j4876n520K00r183J4382M098J120Q77L873q02
10570a233K441N434k968l391r731P76K746K952j249P607O814J5460M459m365K0016
10555D5768J2959N177L553K0990M3237L4569J581j4295l4623l5597j2924k4652
10543D5743k4358l057P071O109l100n690o492j2731o693N570J7678m064p257R327
10529A8056J360k14K76j280J8596J2306o82r663L86O141p860j8174L547J4060
10515C6855J0470j566L182p806r95L67r113r506p031m285k909Q664o460l443P122
10500A3546J1403K904n888q99l756k376o815j3045o246j620O515k817J0328R37
10486B171M208r343q495J1772j325P115J2177L828k625m008k473j83n491K476
$$ plain form
10472 9804 26508 33915 16305 8114 6727 8726 15464 26372 22904 14610 -3407 -10191 -754 23862
10458 23862 36397 33656 21429 18256 18730 25695 23304 12609 11077 10986 16487 22603 27381 26540 26550
10443 26550 34961 48030 55900 52972 49465 47805 60497 71514 95202 100307 91094 102308 121752
10430 121752 108276 87005 81052 69481 53181 52870 60771 63366 52456 39237 44628 36103 30715
10417 30715 24176 25449 34828 27790 14881 6515 15854 5333 -5108 -7947 5915 896 19103
10404 19103 31253 32765 32867 41181 37430 37622 46750 40835 22574 3889 4696 8713 18225 16810
10390 16810 25457 32454 23655 12875 4640 5291 11058 12665 10344 10828 12269 1305 -8108 10719
10376 10719 20212 22029 31670 33469 31727 32366 36290 28842 17825 41351 53253 39954 27936
$$ packed form
10472I804J6704P407j7610q191j387J999O738J0908l468q294j8017o784R437K4616
10458B3862J2535k741j2227l173M74O965k391j0695j532r1N501O116M778q41J0
10443B6550Q411J3069P870k928l507j660J2692J1017K3688N105r213J1214J9444
10430A21752j3476k1271n953j1571j6300l11P901K595j0910j3219N391q525n388
10417C0715o539J273R379p038j2909q366R339j0521j0441k839J3862n019J8207
10404A9103J2150J512J02Q314l751J92R128n915j8261j8685Q07M017R512j415
10390A6810Q647O997q799j0780q235O51N767J607k321M84J441j0964r413J8827
10376A0719R493J817R641J799j742O39L924p448j1017K3526J1902j3299j2018
$$ plain form
10363 27936 20381 23757 34981 36632 42885 23842 4465 -4582 -4139 -3663 -4875 -504 5424 7400
10349 7400 11361 24811 27224 21921 24622 17885 12477 15543 24739 26686 19046 12293 16358 34285
10335 34285 37472 27412 23743 24050 17165 19378 28916 15857 6975 9791 6343 3521 12724 23359
10321 23359 32408 45229 49101 35912 25643 27439 36198 40209 33175 25581 18825 19342 26229 29093
10307 29093 27570 16453 5994 2693 -10292 -5529 11540 16083 14925 12116 7666 6731 26518
10294 26518 33739 18559 12037 1767 13457 25140 34914 33815 21940 17847 27048 28360 35328
10281 35328 28943 32721 29266 26294 18396 25236 31732 28813 26210 34772 27592 26092 5369 10245
10267 10245 23859 27060 23236 12058 17323 31342 29816 28687 15399 7394 8122 20023 21329
$$ packed form
10363B7936p555L376J1224J651O253j9043j9377r047M43M76j212M371N928J976
10349G400L961J3450K413n303K701o737n408L066R196J947p640o753M065J7927
10335C4285L187j0060l669L07o885K213R538j3059q882K816l448k822R203J0635
10321B3359R049J2821L872j3189j0269J796Q759M011p034p594o756N17O887K864
10307B9093j523j1117j0459l301j2985M763J7069M543j158k809m450r35J9787
10294B6518P221j5180o522j0270J1690J1683R774j099j1875m093R201J312O968
10281C5328o385L778l455k972p898O840O496k919k603Q562p180j500k0723M876
10267A0245J3614L201l824j1178N265J4019j526j129j3288q005P28J1901J306
$$ plain form
10254 21329 17109 35301 39482 40649 35122 36630 30634 38607 30644 26839 20613 19007 24813 23714
10240 23714 28190 38075 25810 14749 16070 24510 30269 30151 29625 19506 15443 13958 4153 -3208
10226 -3208 12020 16646 19618 14262 19847 14364 11701 15005 8241 5938 8713 567 -7769 4889
10212 4889 17937 12609 22559 37485 49081 40133 25673 33403 48099 57888 46159 42257 42700
10199 42700 39411 47577 46755 51359 54242 45591 48378 47427 42046 40054 43611 54065 60452 42547
10185 42547 22656 25541 31898 36912 37207 25031 26582 30346 32676 41778 35184 21408 19635 7259
10171 7259 7293 8089 -4712 -212 13069 14374 4026 -9904 -1484 13992 7628 13117 18809 29531
10157 29531 30079 38822 45594 42168 38548 38224 17781 4297 4979 10198 19595 26648 29940 24036 31145
$$ packed form
10254B1329m220J8192M181J167n527J508n996P973p963l805o226j606N806j099
10240B3714M476R885j2265j1061J321Q440N759j18n26j0119m063j485r805p361
10226c208J5228M626K972n356N585n483k663L304o764k303K775q146q336J2658
10212D889J3048n328R950J4926J1596q948j4460P730J4696R789j1729l902M43
10199D2700l289Q166q22M604K883q651K787r51n381j992L557J0454O387j7905
10185D2547j9891K885O357N014K95j2176J551L764K330R102o594j3776j773j2376
10171G259L4P96j2801M500J3281J305j0348j3930Q420J5476o364N489N692J0722
10157B9531N48Q743O772l426l620l24k0443j3484O82N219R397P053L292n904P109
$$ plain form
10142 31145 31613 12435 26099 45921 55267 50037 40271 42971 38914 31331 29120 23035 20009 17871
10128 17871 19409 28776 41428 48755 45202 45119 54138 42831 57695 71765 65983 45937 23210
10115 23210 28691 29380 19971 19671 35073 44362 55021 54538 46078 36664 32494 22163 24827 34547
10101 34547 41400 35781 28702 29104 35699 47983 47551 38900 45166 40547 50782 61196 61737 61856 49373
10086 49373 41219 35872 30960 41721 48712 51933 47189 36910 32449 28605 40514 48182 43702 45153
10072 45153 36603 28643 34131 48013 52416 51814 51546 44522 35855 45688 46606 51220 64474 59796 63696
10057 63696 73262 77074 85051 87525 81073 83806 76896 65636 50254 40518 43188 49609 52408 54354
10043 54354 45163 50401 46381 52875 64169 68688 71704 54755 49976 45987 58083 62749 73975
$$ packed form
10142C1145M68j9178J3664J9822R346n230r766K700m057p583k211o085l026k138
10128A7871J538R367J2652P327l553q3R019j1307J4864J4070n782k0046k2727
10115B3210N481O89r409l00J5402R289J0659m83q460r414m170j0331K664R720
10101C4547O853n619p079M02O595J2284m32q651O266m619J0235J0414N41J19j2483
10086D9373q154n347m912J0761O991L221m744j0279m461l844J1909P668m480J451
10072D5153q550p960N488J3882M403o02k68p024q667R833R18M614J3254m678L900
10057F3696R566L812P977K474o452K733o910j1260j5382r736K670O421K799J946
10043E4354r191N238m020O494J1294M519L016j6949m779l989J2096M666J1226
$$ plain form
10030 73975 66471 52407 47015 58537 85175 88394 89451 87245 90287 78086 67512 51837 52844
10017 52844 50479 53038 66519 75670 84395 95585 107936 111318 119745 114977 112719 100578 96453
10004 96453 88249 68704 67207 60069 67151 82407 79792 82430 94471 91666 78980 68273 67454
9991 67454 74484 86170 105816 121954 125645 126425 132304 134955 132778 132741 119184 132230 143927 178001
9977 178001 199308 218672 235929 224870 208263 185058 169179 153156 154701 168452 170264 157229
9965 157229 148978 145073 134303 114355 94460 87606 75870 75316 78615 73887 61272 48740 53706
9952 53706 48905 47834 58863 71609 66559 59229 64565 51364 48815 45463 43001 60791 62736 60536
9938 60536 71358 66848 63965 56177 51969 49615 46430 60285 57021 50348 46441 65385 72517 60638
$$ packed form
10030G3975p504j4064n392J1522K6638L219J057k206L042j2201j0574j5675J007
10017E2844k365K559J3481R151Q725J1190J2351L382Q427m768k258j2141m125
10004I6453q204j9545j497p138P082J5256k615K638J2041k805j2686j0707q19
9991F7454P030J1686J9646J6138L691P80N879K651k177l7j3557J3046J1697L4074
9977A78001K1307J9364J7257j1059j6607k3205j5879j6023J545J3751J812j3035
9965A57229q251l905j0770j9948j9895o854j1736n54L299m728j2615j2532M966
9952E3706m801j071J1029J2746n050p330N336j3201k549l352k462J7790J945k200
9938F0536J0822m510k883p788m208k354l185J3855l264o673l907J8944P132j1879
$$ plain form
9924 60638 59754 66686 61347 47465 45619 60859 63311 58637 64540 78186 80120 76975 71591 67049
9910 67049 74345 65396 65617 59984 70887 69382 66062 70664 79792 74554 78970 82488 81845 81482 72409
9895 72409 71201 80041 88481 86929 80585 81162 79872 68152 71048 71374 78579 89480 76602 56210
9881 56210 49656 59142 74328 80986 91387 99161 99065 87151 81166 70772 60280 66085 82603 79098
9867 79098 72066 62165 64342 74111 85937 87083 84859 92661 110526 121439 117090 105569 100367 90808
9853 90808 94338 102472 112594 107248 104497 105132 116722 107588 91670 92584 100056 96719 94880 103692
9839 103692 117227 102369 92510 96507 105092 116407 133754 149287 157242 146049 138194 127486 111128
9826 111128 109685 105121 94433 76136 86126 99755 89107 84897 87089 101835 117322 107681 98715
$$ packed form
9924F0638q84O932n339j3882j846J5240K452m674N903J3646J934l145n384m542
9910F7049P296q949K21n633J0903j505l320M602R128n238M416L518o43l63r073
9895G2409j208Q840Q440j552o344N77j290j1720K896L26P205J0901j2878k0392
9881E6210o554R486J5186O658J0401P774r6j1914n985j0394j0492N805J6518l505
9867G9098p032r901K177R769J1826J146k224P802J7865J0913m349j1521n202r559
9853I0808L530Q134J0122n346k751O35J1590r134j5918R14P472l337j839Q812
9839A03692J3535j4858r859L997Q585J1315J7347J5533P955j1193p855j0708j6358
9826A11128j443m564j0688j8297R990J3629j0648m210K192J4746J5487r641q966
$$ plain form
9813 98715 98750 99228 89963 87379 83643 85720 88847 84127 97851 91089 93013 97241 88808 97554 93428
9798 93428 96450 104550 107377 100058 87080 91072 90835 84328 81271 79410 90755 102366 112506 113326
9784 113326 108124 113240 111233 113175 103047 91352 96924 107377 109217 104474 102358 87824 85195
9771 85195 72921 64246 79840 82210 78406 95956 107730 114369 100002 102538 99519 98753 92644 86020
9757 86020 93011 94457 98193 105770 116365 110481 107614 95049 96957 100367 103861 104513 111843 112618 114566
9742 114566 115158 111060 107885 94032 91099 92553 89279 90238 99911 111444 108425 96266 112397 127217
9728 127217 129205 135073 144886 157929 179159 188730 217189 255064 282402 286781 300569 316876 323798
9715 323798 317053 310739 295519 268606 246762 226571 205851 188740 176521 168247 165699 165517 167326
$$ packed form
9813I8715L5M78r265k584l736K077L127m720J3724o762J924M228q433Q746m126
9798I3428L022Q100K827p319j2978L992k37o507l057j861J1345J1611J0140Q20
9784A13326n202N116k007J942j0128j1695N572J0453J840m743k116j4534k629
9771H5195j2274q675J5594K370l804J7550J1774O639j4367K536l019p66o109o624
9757H6020O991J446L736P577J0595n884k867j2565J908L410L494O52P330P75J948
9742A14566N92m098l175j3853k933J454l274R59R673J1533l019j2159J6131J4820
9728A27217J988N868R813J3043K1230R571K8459L7875K7338M379J3788J6307O922
9715C23798o745o314j5220k6913k1844k0191k0720j7111j2219q274k548j82J809
$$ plain form
9702 167326 166769 153911 148486 138896 131666 136190 137969 134026 117837 100643 104607 119498 118384 125468
9688 125468 126387 113313 123852 131398 130918 133653 126108 138668 137888 137593 123779 116382 117089 124379 123240
9673 123240 124518 136836 133960 134342 133767 144154 136940 118951 115771 114663 121311 121476 110537 112710
9659 112710 120121 134409 135490 131118 128668 128872 131314 120730 121794 137946 136549 138389 141331 144331
9645 144331 152781 160476 165773 164039 166265 163216 155188 145201 127645 124443 124056 122815 132070 143436
9631 143436 148222 144169 140466 143110 134385 128469 122515 123584 136723 128560 132279 133883 136754 134143
9617 134143 159549 172680 176070 170259 159003 156594 161466 155217 150149 147392 130903 132105 136546
9604 136546 142178 155511 163929 171777 169834 163074 158272 152319 144030 152817 152311 145888 154634 157246
$$ packed form
9702A67326n57j2858n425r590p230M524J779l943j6189j7194L964J4891j114P084
9688A25468R19j3074J0539P546m80K735p545J2560p80k95j3814p397P07P290j139
9673A23240J278J2318k876L82n75J0387p214j7989l180j108O648J65j0939K173
9659A12710P411J4288J081m372k450K04K442j0584J064J6152j397J840K942L000
9645A44331Q450P695N297j734K226l049q028r987j7556l202l87j241R255J1366
9631A43436M786m053l703K644q725n916n954J069J3139q163L719J604K871k611
9617A34143K5406J3131L390n811j1256k409M872o249n068k757j6489J202M441
9604A36546N632J3333Q418P848j943o760m802n953q289Q787n06o423Q746K612
$$ plain form
9590 157246 153980 162093 161180 153945 147357 158075 167525 165721 158701 153669 149555 151734 149538 150679
9576 150679 152574 153633 153971 144260 150176 151000 147708 157256 160828 170516 166479 153910 163936 170893
9562 170893 176743 160736 146516 159981 162077 165446 174104 182787 178794 172101 165910 160460 154124 150890
9548 150890 155396 166409 185703 197025 195336 190720 187199 183716 181114 192040 200894 192044 184701
9535 184701 189197 180122 193261 212310 207183 188785 181995 179689 184233 197371 209143 208526 205752
9522 205752 202750 195577 183446 178475 181598 170910 169320 170462 173690 187025 196858 210581 204991
9509 204991 195513 184380 183383 198201 201754 203614 212464 208894 210964 211357 205453 204914 209425 213110 213393
9494 213393 207684 202363 207275 211504 207936 216488 227818 230304 223893 214172 210587 227932 240976 229167
$$ packed form
9590A57246l266Q113r13p235o588J0718R450j804p020n032m114K179k196J141
9576A50679J895J059L38r711N916Q24l292R548L572R688m037j2569J0026O957
9562A70893N850j6007j4220J3465K096L369Q658Q683l993o693o191n450o336l234
9548A50890M506J1013J9294J1322j689m616l521l483k602J0926Q854q850p343
9535A84701M496r075J3139J9049n127j8398o790k306M544J3138J1772o17k774
9522B05752l002p173j2131m971L123j0688j590J142L228J3335R833J3723n590
9509B04991r478j1133r97J4818L553J860Q850l570K070L93n904n39M511L685K83
9494B13393n709n321M912M229l568Q552J1330K486o411r721l585J7345J3044j1809
$$ plain form
9480 229167 221296 233359 229630 232898 240245 234236 224383 219171 218748 225559 240804 250436 240869 250463
9466 250463 245778 236656 235791 221019 226025 225945 227970 226052 229038 224364 216761 221575 230006 249620 257106
9451 257106 261490 266989 275581 262086 274874 274205 251848 247131 245199 235027 242716 245868 237078 242873
9437 242873 245411 244076 245379 246260 249657 256769 252126 261165 266191 268707 272332 272440 279038 281935 276482
9422 276482 272615 261290 249162 254354 260829 266823 279825 291412 298969 293732 293206 296183 309437
9409 309437 317284 301611 290182 296747 290746 287725 283537 287204 289359 304166 309660 316787 316033 305293
9395 305293 312287 316392 318841 322095 314176 295394 303377 332254 330383 314243 305081 318038 326103
9382 326103 320470 329216 330347 333041 347970 352306 349733 337257 333286 341805 347255 344847 344517 350598
$$ packed form
9480B29167p871J2063l729L268P347o009r853n212m23O811J5245R632r567R594
9466B50463m685r122q65j4772N006q0K025j918K986m674p603M814Q431J9614P486
9451B57106M384N499Q592j3495J2788o69k2357m717j932j0172P689L152q790N795
9437B42873K538j335J303Q81L397P112m643R039N026K516L625J08O598K897n453
9422B76482l867j1325j2128N192O475N994J3002J1587P557n237n26K977J3254
9409C09437P847j5673j1429O565o001l021m188L667K155J4807N494P127p54j0740
9395C05293O994M105K449L254p919j8782P983K8877j871j6140r162J2957Q065
9382C26103n633Q746J131K694J4929M336k573j2476l971Q519N450k408l30O081
$$ plain form
9368 350598 357894 348546 351701 359360 360334 364284 379373 378528 362384 362276 369681 371302 376027 374821 380119
9353 380119 398059 410802 415209 404772 405001 407011 399941 396506 393344 388461 392567 406266 418353
9340 418353 420955 421205 416081 421823 431976 436774 443028 447973 459209 471184 490784 506128 513253
9327 513253 532221 545099 555814 545662 534568 532335 525045 512204 518080 518936 513260 514166 514176 515197
9313 515197 529542 546563 549640 544713 542848 535477 548529 563717 579038 594243 613984 626676
9301 626676 621736 621060 638929 657839 681202 705300 734394 784024 861169 970786 1103734 1275756
9289 1275756 1479271 1667162 1771415 1774476 1687217 1539681 1380612 1243359 1157634 1127441
9279 1127441 1126501 1141586 1181290 1256145 1352167 1473530 1587711 1688527 1776848 1819185 1815883
$$ packed form
9368C50598P296r348L155P659R74L950J5089q45j6144j08P405J621M725j206N298
9353C80119J7940J2743M407j0437K29K010p070l435l162m883M106J3699J2087
9340D18353K602K50n124N742J0153M798O254M945J1236J1975J9600J5344P125
9327E13253J8968J2878J0715j0152j1094k233p290j2841N876Q56n676R06J0J021
9313E15197J4345J7021L077m927j865p371J3052J5188J5321J5205J9741J2692
9301F26676m940o76J7869J8910K3363K4098K9094M9630P7145J09617J32948J72022
9289A275756K03515J87891J04253L061q7259j47536j59069j37253q5725l0193
9279A127441r40J5085L9704P4855R6022J21363J14181J00816Q8321M2337l302
$$ plain form
9268 1815883 1798356 1788056 1764161 1728261 1696345 1663074 1640576 1649280 1664166 1668988 1704593 1770229
9256 1770229 1881476 2060240 2345973 2733107 3182999 3591546 3810059 3769491 3500395 3075683
9246 3075683 2658479 2334195 2125584 2011399 1950881 1913834 1904430 1909459 1912953 1940882 2001698
9235 2001698 2061083 2077658 2110464 2136777 2163172 2167521 2139519 2048461 1931297 1812766 1702976
9224 1702976 1611535 1533227 1477993 1440023 1452219 1498083 1556667 1667123 1799601 1953590 2081484
9213 2081484 2137899 2108183 1977731 1805971 1649780 1520687 1427553 1375378 1326772 1290402 1270357
9202 1270357 1249888 1240299 1233109 1233967 1233196 1224087 1209675 1201282 1199305 1208574 1214332 1211635 1208225 1223377
9188 1223377 1236357 1239739 1246229 1248387 1236540 1236321 1239985 1258954 1275208 1276832 1300985 1330168 1355036
$$ packed form
9268A815883j7527j0300k3895l5900l1916l3271k2498Q704J4886M822L5605O5636
9256A770229J11247J78764K85733L87134M49892M08547K18513m0568k69096m24712
9246C075683m17204l24284k08611j14185o0518l7047r404N029L494K7929O0816
9235B001698N9385J6575L2806K6313K6395M349k8002r1058j17164j18531j09790
9224A702976r1441p8308n5234l7970J2196M5864N8584J10456J32478J53989J27894
9213B081484N6415k9716j30452j71760j56191j29093r3134n2175m8606l6370k0045
9202A270357k0469r589p190Q58p71r109j4412q393j977R269N758k697l410J5152
9188A223377J2980L382O490K158j1847k19L664J8969J6254J624K4153K9183K4868
$$ plain form
9175 1355036 1372634 1380308 1403760 1415746 1417792 1413925 1411186 1414098 1428511 1452432 1454095 1461422 1478767
9162 1478767 1496441 1510630 1529917 1556014 1562179 1554998 1554222 1553910 1570801 1605934 1622429 1650765 1676126
9149 1676126 1693407 1716442 1745626 1780093 1791526 1801450 1823259 1850730 1877352 1908629 1935371 1961679
9137 1961679 1981534 2003524 2032925 2068482 2101514 2122834 2151919 2175563 2218899 2259500 2280639
9126 2280639 2305730 2328862 2365314 2411276 2453386 2491309 2531122 2551640 2590594 2634543 2679994
9115 2679994 2708195 2741889 2778785 2818334 2845129 2881089 2924835 2981978 3045679 3094914 3145169
9104 3145169 3199884 3264402 3320260 3364060 3419136 3467018 3520029 3582567 3642265 3710029 3780372
9093 3780372 3841524 3911313 3985480 4052322 4125481 4206148 4273292 4351435 4448195 4522997 4609092
$$ packed form
9175A355036J7598P674K3452J1986K046l867k739K912J4413K3921J663P327J7345
9162A478767J7674J4189J9287K6097O165p181p76l12J6891L5133J6495K8336K5361
9149A676126J7281K3035K9184L4467J1433R924K1809K7471K6622L1277K6742K6308
9137A961679J9855K1990K9401L5557L3032K1320K9085K3644M3336M0601K1139
9126B280639K5091K3132L6452M5962M2110L7923L9813K0518L8954M3949M5451
9115B679994K8201L3694L6896L9549K6795L5960M3746N7143O3701M9235N0255
9104C145169N4715O4518N5858M3800N5076M7882N3011O2538N9698O7764P0343
9093C780372O1152O9789P4167O6842P3159Q0667O7144P8143R6760P4802Q6095
$$ plain form
9082 4609092 4711490 4800839 4899421 4997715 5108342 5214057 5310419 5408046 5527006 5655737
9072 5655737 5774507 5887970 6012952 6150481 6290921 6435858 6594834 6759789 6934059 7099609
9062 7099609 7270211 7460165 7658017 7860494 8065971 8280468 8491512 8735781 9001520 9258912
9052 9258912 9539333 9838779 10140575 10427876 10736498 11070611 11426113 11795421 12180209 12597821
9042 12597821 13024576 13484450 13988271 14517240 15052346 15612777 16229060 16894896 17573087
9033 17573087 18295067 19074324 19896550 20762544 21686527 22667760 23705772 24832416 26039030
9024 26039030 27323012 28696326 30169238 31746944 33432857 35225815 37154963 39230445
9016 39230445 41476921 43887702 46476497 49256077 52221967 55404161 58817959 62452025
$$ packed form
9082D609092J02398Q9349R8582R8294J10627J05715R6362R7627J18960J28731
9072E655737J18770J13463J24982J37529J40440J44937J58976J64955J74270J65550
9062G099609J70602J89954J97852K02477K05477K14497K11044K44269K65739K57392
9052I258912K80421K99446L01796K87301L08622L34113L55502L69308L84788M17612
9042A2597821M26755M59874N03821N28969N35106N60431O16283O65836O78191
9033A7573087P21980P79257Q22226Q65994R23983R81233J038012J126644J206614
9024B6039030J283982J373314J472912J577706J685913J792958J929148K075482
9016C9230445K246476K410781K588795K779580K965890L182194L413798L634066
$$ plain form
9008 62452025 66305291 70381711 74660181 79150772 83822021 88654131 93577414 98534788
9000 98534788 103417281 108159815 112641133 116757714 120385214 123421646 125760326 127322888
8992 127322888 128102233 128051850 127198681 125600127 123326349 120471037 117155309 113460585 109511502
8983 109511502 105384842 101150083 96896844 92636577 88406354 84267492 80258407 76381120
8975 76381120 72643844 69060626 65602486 62298977 59160096 56182260 53347643 50665778
8967 50665778 48122049 45711286 43426947 41276549 39254693 37332457 35507801 33803968
8959 33803968 32203116 30690637 29275757 27934625 26654139 25437015 24281278 23199661
8951 23199661 22175797 21206749 20300667 19432138 18601488 17816415 17096297 16407970 15745673
$$ packed form
9008F2452025L853266M076420M278470M490591M671249M832110M923283M957374
9000I8534788M882493M742534M481318M116581L627500L036432K338680J562562
8992A27322888P79345n0383q53169j598554k273778k855312l315728l694724l949083
8983A09511502m126660m234759m253239m260267m230223m138862m009085l877287
8975G6381120l737276l583218l458140l303509l138881k977836k834617k681865
8967E0665778k543729k410763k284339k150398k021856j922236j824656j703833
8959C3803968j600852j512479j414880j341132j280486j217124j155737j081617
8951B3199661j023864r69048r06082q68529q30650p85073p20118o88327o62297
$$ plain form
8942 15745673 15126901 14528585 13977771 13460136 12946245 12464868 12017107 11574332 11144682
8933 11144682 10758316 10406241 10057114 9723666 9395652 9082930 8782484 8506742 8247640
8924 8247640 7990164 7729481 7506913 7284353 7075874 6870048 6695234 6514943 6339626 6175816
8914 6175816 6004209 5837045 5687664 5552195 5410698 5258979 5133790 5023579 4913290 4801336
8904 4801336 4688504 4560527 4447163 4342961 4244027 4158551 4081180 4008803 3936447 3856675 3781086
8893 3781086 3701771 3634964 3565623 3493274 3426617 3351483 3294702 3233525 3163848 3114974 3075247
8882 3075247 3031606 2976446 2920561 2877754 2837472 2807257 2769635 2717911 2680030 2628825 2590217
8871 2590217 2559982 2512171 2459760 2415222 2369691 2330690 2302480 2265136 2228962 2199391 2174899
$$ packed form
8942A5745673o18772n98316n50814n17635n13891m81377m47761m42775m29650
8933A1144682l86366l52075l49127l33448l28014l12722l00446k75742k59102
8924H247640k57476k60683k22568k22560k08479k05826j74814j80291j75317j63810
8914F175816j71607j67164j49381j35469j41497j51719j25189j10211j10289j11954
8904D801336j12832j27977j13364j04202r8934q5476p7371p2377p2356p9772p5589
8893C781086p9315o6807o9341p2349o6657p5134n6781o1177o9677m8874l9727
8882C075247m3641n5160n5885m2807m0282l0215l7622n1724l7881n1205l8608
8871B590217l0235m7811n2411m4538m5531l9001k8210l7344l6174k9571k4492
$$ plain form
8860 2174899 2144796 2102824 2082426 2050397 2011905 1982544 1958135 1944583 1917116 1891891 1867703
8849 1867703 1833930 1806550 1797042 1762118 1734108 1720540 1706977 1690341 1665044 1642230 1609000 1578800
8837 1578800 1558722 1560437 1546832 1527626 1498435 1474680 1456397 1436077 1415696 1394965 1377987 1357465
8825 1357465 1343092 1331385 1305154 1283720 1258905 1243196 1237809 1225311 1202456 1180215 1164599 1138460
8813 1138460 1110467 1103638 1102079 1085238 1067615 1058546 1051619 1045566 1031458 1011707 998650 979064
8801 979064 969478 968015 944873 934846 934227 930228 915263 900078 877282 864009 848330 845417 850287
8788 850287 859833 855591 835732 810916 801957 801045 801328 793825 784446 774921 763590 761672 754740 746484
8774 746484 740164 733293 726671 724233 705781 684316 677215 674781 661824 661070 656070 655804 661668 670249
$$ packed form
8860B174899l0103m1972k0398l2029l8492k9361k4409j3552k7467k5225k4188
8849A867703l3773k7380r508l4924k8010j3568j3563j6636k5297k2814l3230l0200
8837A578800k0078J715j3605j9206k9191k3755j8283k0320k0381k0731j6978k0522
8825A357465j4373j1707k6231k1434k4815j5709n387j2498k2855k2241j5616k6139
8813A138460k7993o829j559j6841j7623r069o927o053j4108j9751j3057j9586
8801I79064r586j463k3142j0027o19l999j4965j5185k2796j3273j5679k913M870
8788H50287R546m242j9859k4816q959r12K83p503r379r525j1331j918o932q256
8774G46484o320o871o622k438j8452k1465p101k434j2957p54n000k66N864Q581
$$ plain form
8760 670249 674817 656712 629328 625683 629680 626182 618054 616293 629442 629548 609067 588573 589274 588797
8746 588797 592239 597946 588241 576420 577983 571331 555844 554713 560077 557272 547587 544609 536246 522787
8732 522787 519789 526589 521597 510080 514803 531555 544870 552307 541659 531064 522251 503283 502443
8719 502443 500232 500732 498149 484473 474107 482017 480936 475968 470414 472877 477795 479302 471535 470505
8705 470505 480830 474273 465793 465337 491479 500003 487635 478033 467229 461620 455010 465998 468795
8692 468795 465187 450953 442606 447922 447249 436526 433019 442455 433842 420435 427667 434932 444389 460113
8678 460113 450986 444679 436752 429256 438849 456710 468497 460570 463267 480270 500055 515161 527349
8665 527349 545103 565476 590617 613789 647495 695074 746729 811918 891130 1006061 1145981
$$ packed form
8760F70249M568j8105k7384l645L997l498q128j761J3149J06k0481k0494P01m77
8746E88797L442N707r705j1821J563o652j5487j131N364k805r685k978q363j3459
8732E22787k998O800m992j1517M723J6752J3315P437j0648j0595q813j8968q40
8719E02443k211N00k583j3676j0366P910j081m968n554K463M918J507p767j030
8705D70505J0325o557q480m56K6142Q524j2368r602j0804n609o610J0988K797
8692D68795l608j4234q347N316o73j0723l507R436q613j3407P232P265R457J5724
8678D60113r127o307p927p496R593J7861J1787p927K697J7003J9785J5106J2188
8665E27349J7754K0373K5141K3172L3706M7579N1655O5189P9212J14931J39920
$$ plain form
8654 1145981 1272388 1343323 1355862 1350252 1342301 1338689 1347589 1355681 1377739 1369585 1331709 1271936
8642 1271936 1199706 1106740 1022889 941050 874299 814694 769294 732042 691867 653178 618224
8631 618224 581054 561990 538225 502380 479348 475817 472091 469645 455064 443123 438499 432569 432261
8618 432261 446654 458511 476816 503819 552839 614412 723303 890654 1080808 1244143 1281751
8607 1281751 1220853 1059594 879535 749793 643604 580253 529970 484222 455599 436763 413906
8596 413906 408175 393357 382981 375232 355322 341090 333980 333693 337261 327376 313029 290414 282242
8583 282242 303916 303391 288804 275041 268475 266698 255774 240064 235619 243175 241624 258476 275798
8570 275798 296256 324462 353479 407083 468082 532914 585626 627038 620522 567610 481998 403998
$$ packed form
8654A145981J26407P0935J2539n610p951l612Q900Q092K2058q154l7876n9773
8642A271936p2230r2966q3851q1839o6751n9605m5400l7252m0175l8689l4954
8631F18224l7170j9064k3765l5845k3032l531l726k446j4581j1941m624n930l08
8618D32261J4393J1857J8305K7003M9020O1573J08891J67351J90154J63335L7608
8607A281751o0898j61259j80059j29742j06189o3351n0283m5748k8623j8836k2857
8596D13906n731j4818j0376p749j9910j4232p110k87L568r885j4347k2615q172
8583B82242K1674n25j4587j3763o566j777j0924j5710m445P556j551J6852J7322
8570B75798K0458K8206K9017N3604O0999O4832N2712M1412o516n2912q5612p8000
$$ plain form
8558 403998 360655 329623 312617 298423 281876 273038 263682 258486 241648 213064 201594 204620
8546 204620 200441 200318 193349 185014 183724 172855 166560 164891 166158 166180 170518 170313 163448 169256 165546
8531 165546 167879 162348 148983 148484 152666 166491 162453 159253 153856 153469 146091 127140 125332 119811
8517 119811 119192 120981 114464 120083 124670 119299 130586 135768 125060 115269 112938 109278 107673 123923
8503 123923 141641 148047 148658 143390 140372 128607 114734 105049 104740 108668 104511 98580 93716 105756
8489 105756 111427 130063 126490 116371 106406 100302 93404 101433 94750 88807 92349 101803 94064 77910
8475 77910 76140 80520 80713 83671 77483 81796 84010 79881 76778 69911 77682 83522 91625 99532 89193
8460 89193 84273 84946 91515 92350 111643 125802 134738 134814 128760 122661 106583 106540 106525 103126 95777 84929
$$ packed form
8558D03998m3343l1032j7006j4194j6547q838r356n196j6838k8584j1470L026
8546B04620m179j23o969q335j290j0869o295j669J267K2M338k05o865N808l710
8531A65546K333n531j3365m99M182J3825m038l200n397l87p378j8951j808n521
8517A19811o19J789o517N619M587n371J1287N182j0708r791k331l660j605J6250
8503A23923J7718O406O11n268l018j1765j3873r685l09L928m157n931m864J2040
8489A05756N671J8636l573j0119r965o104o898Q029o683n943L542R454p739j6154
8475G7910j770M380J93K958o188M313K214m129l103o867P771N840Q103P907j0339
8460H9193m920O73O569Q35J9293J4159Q936P6o054o099j6078m3j5l399p349j0848
$$ plain form
8444 84929 72123 76573 89504 92351 87901 85885 99036 100018 92939 83206 75196 65557 79198 79857
8430 79857 79270 83271 73695 75382 76370 74529 60715 49078 48758 53868 66300 83099 97407 95069
8416 95069 91311 81635 69470 70091 83265 79339 74936 77860 84577 86073 93574 89740 79806 88783
8402 88783 99074 99336 89615 79679 69900 50985 55474 62392 69167 65046 64525 72091 59110 49040
8388 49040 52513 57703 48877 62820 49884 44124 40445 38764 50910 63357 57530 47034 40643
8375 40643 51633 46716 36264 32292 33645 46651 47748 41885 40820 52498 61662 59089 57998 56380
8361 56380 46188 33140 13353 25624 32087 32676 25684 38911 58425 58197 47151 50778 52406
8348 52406 50807 38507 45641 60145 64492 55302 45648 45382 49669 46541 49027 51108 47201 61838
$$ packed form
8444H4929j2806M450J2931K847m450k016J3151R82p079r733q010r639J3641O59
8430G9857n87M001r576J687R88j841j3814j1637l20N110J2432J6799J4308k338
8416I5069l758r676j2165O21J3174l926m403K924O717J496P501l834r934Q977
8402H8783J0291K62r721r936r779j8915M489O918O775m121n21P566j2981j0070
8388D9040L473N190q826J3943j2936n760l679j681J2146J2447n827j0496o391
8375D0643J0990m917j0452l972J353J3006J097n863j065J1678R164k573j091j618
8361E6380j0192j3048j9787J2271O463N89o992J3227J9514k28j1046L627J628
8348E2406j599j2300P134J4504M347r190r654k66M287l128K486K081l907J4637
$$ plain form
8334 61838 68136 64775 48943 45287 35308 43641 51086 49335 35939 26258 27621 27824 39254 50159
8320 50159 55179 50815 52960 53604 32733 31463 42814 48813 52403 40077 36160 36929 36987 27848 19165
8305 19165 13907 29743 40194 45542 32130 23968 18603 28401 26681 25724 32828 50850 65772 68469
8291 68469 59912 52472 49485 49939 44253 39589 48504 51321 42312 39054 32837 38486 51131 46226 57478
8276 57478 63776 66892 64029 54433 57110 61986 74383 68971 51950 40256 31847 27687 23387 22872
8262 22872 21474 7608 9384 13329 18549 30522 33805 21655 35391 46442 47509 49868 55003
8249 55003 47334 41953 38049 35430 39492 53737 57031 49128 31989 23301 27146 37982 39278 31302
8235 31302 17563 15503 17989 9118 -9061 -9172 -5928 2214 20243 30030 23426 16614 27595 32562
$$ packed form
8334F1838O298l361j5832l656r979Q333P445j751j3396r681J363K03J1430J0905
8320E0159N020m364K145O44k0871j270J1351N999L590j2326l917P69N8r139q683
8305A9165n258J5836J0451N348j3412q162n365R798j720r57P104J8022J4922K697
8291F8469q557p440k987M54n686m664Q915K817r009l258o217N649J2645m905J1252
8276E7478O298L116k863r596K677M876J2397n412j7021j1694q409m160m300n15
8262B2872j398j3866J776L945N220J1973L283j2150J3736J1051J067K359N135
8249E5003p669n381l904k619M062J4245L294p903j7139q688L845J0836J296p976
8235C1302j3739k060K486q871j8179j11L244Q142J8029R787o604o812J0981M967
$$ plain form
8221 32562 35491 32074 27226 27567 13460 9504 22423 21404 20056 23790 17406 16591 13695 19922 36093
8206 36093 42395 34464 25193 23195 24660 23543 38677 38196 29666 29842 29194 25193 21015 20266 15019
8191 15019 11645 21110 19574 21001 25023 29947 22418 25225 23983 12851 20084 25899 21023 20355 21046
8176 21046 27150 30158 32895 39553 31843 3932 -11409 -9447 -13091 -1161 8826 12359 23193 25450
8162 25450 18357 26478 23767 18782 19566 26328 22118 28545 28468 25410 28163 31690 41433 42432 34262 36491
8146 36491 42318 40506 24511 3842 4865 3014 14633 30503 28776 24100 24685 11280 -5730
8133 -5730 3209 14263 15192 22807 29602 29486 26308 17529 16274 17708 309 5452 17716 16237 12812
8118 12812 17786 12340 9602 24291 25578 24053 33404 32910 39342 43795 35402 19370 12550 13934
$$ packed form
8221C2562K929l417m848L41j4107l956J2919j019j348L734o384q15k896O227J6171
8206C6093O302p931r271j998J465j117J5134m81q530J76o48m001m178p49n247
8191A5019l374R465j536J427M022M924p529K807j242j1132P233N815m876o68O91
8176B1046O104L008K737O658p710k7911j5341J962l644J1930R987L533J0834K257
8162B5450p093Q121k711m985P84O762m210O427p7l058K753L527R743R99q170K229
8146C6491N827j812j5995k0669J023j851J1619J5870j727m676N85j3405j7010
8133e730Q939J1054R29P615O795j16l178q779j255J434j7399N143J2264j479l425
8118A2812M974n446k738J4689J287j525R351m94O432M453q393j6032o820J384
$$ plain form
8104 13934 18533 21418 28216 51675 63090 62175 59864 57593 71826 79977 83503 78332 82168 78707
8090 78707 89778 88102 71251 70819 84731 86503 80097 76609 67670 48700 60878 70588 79987 85954
8076 85954 79511 77989 76993 76090 75536 71538 74433 70168 68108 81898 88766 93102 102300 107340 110113
8061 110113 107537 108024 108504 129972 135326 139519 158905 182453 190196 198517 215168 215214 197130 182362
8047 182362 181027 181032 175353 162663 149785 139967 134299 141216 146991 145505 142253 124929 100332 84752
8033 84752 92661 88546 98460 101399 99818 89453 85469 90624 97910 96995 90744 96576 88751 90570 104355
8018 104355 115557 113257 118590 122552 138566 151462 159454 175919 173462 169785 160569 169230 165889
8005 165889 162403 166932 167710 168489 166713 165461 160375 161055 151633 128456 113620 117603 103690 98906
$$ packed form
8104A3934M599K885O798K3459J1415r15k311k271J4233Q151L526n171L836l461
8090G8707J1071j676j6851m32J3912J772o406l488q939j8970J2178R710R399N967
8076H5954o443j522r96r03n54l998K895m265k060J3790O868M336R198N040K773
8061A10113k576M87M80K1468N354M193J9386K3548P743Q321J6651M6j8084j4768
8047A82362j335Nn679j2690j2878r818n668O917N775j486l252j7324k4597j5580
8033H4752P909m115R914K939j581j0365l984N155P286r15o251N832p825J819J3785
8018A04355J1202k300N333L962J6014J2896P992J6465k457l677r216Q661l341
8005A65889l486M529P78P79j776j252n086O80r422k3177j4836L983j3913m784
$$ plain form
7991 98906 98342 97333 86706 79344 75541 73170 78903 82425 90100 83117 67809 75385 81925 87601
7977 87601 87742 90427 98328 109302 97002 99897 98015 90051 96438 98971 91405 92109 85732 73536
7963 73536 77536 88250 96590 101092 90344 86101 68158 58100 50617 49902 51764 39782 26084
7950 26084 34600 28634 25684 25919 21390 34985 45275 46561 43932 47095 43435 26340 10823 16262
7936 16262 23218 25347 11334 2573 7964 13227 26922 42738 31820 31084 19926 14832 11988 22533
7922 22533 34485 35324 34033 33237 35512 31649 17272 -6102 -6179 -2871 4982 22896 28633 24415 27792
7907 27792 43295 35706 28565 24683 17761 7908 9950 13462 3634 12763 26757 17154 9669 9623 9424
7892 9424 6188 3253 8028 6626 8033 7091 10960 4754 -936 -7256 -15892 -19694 -22162 -21829 -22732 -16309
$$ packed form
7991I8906n64j009j0627p362l803k371N733L522P675o983j5308P576O540N676
7977H7601J41K685P901J0974j2300K895j882p964O387K533p566P04o377j2196
7963G3536M000J0714Q340M502j0748m243j7943j0058p483p15J862j1982j3698
7950B6084Q516n966k950K35m529J3595J0290J286k629L163l660j7095j5517N439
7936A6262O956K129j4013q761N391N263J3695J5816j0918p36j1158n094k844J0545
7922B2533J1952Q39j291p96K275l863j4377k3374p7L308P853J7914N737m218L377
7907B7792J5503p589p141l882o922r853K042L512r828R129J3994r603p485m6j99
7892I424l236k935M775j402J407r42L869o206n690o320q636l802k468L33r03O423
$$ plain form
7876 -16309 -9951 -12327 -21230 -18035 -3415 2477 -9917 -8006 -16656 1456 15647 4378 -10805
7863 -10805 -279 18563 26913 41862 47254 39174 13500 1298 8123 12929 13693 3657 3344 226
7849 226 -6885 -2096 9471 -688 -1244 -5303 -12563 -16487 -12420 -9651 -13019 -23191 -22699 -27126 -25673
7834 -25673 -21558 -12078 1257 8214 11277 11262 12374 17551 20475 10260 5865 3247 11984 14610 9039
7819 9039 1616 -4288 -20881 -12395 -30395 -32674 -28700 -30039 -23612 -24360 -21898 -40221 -53382 -35476
7805 -35476 -30439 -23335 -14312 -5468 -4816 902 6854 10994 7577 4085 -4944 11560 8990 -7900
7791 -7900 -5550 -1799 -7506 3461 15816 19981 20089 27408 24481 17070 19356 3959 -4816 267
7777 267 -2824 -19221 -31011 -34429 -40041 -42988 -28420 -23192 -23399 -9845 2621 12038 23642 23238
$$ packed form
7876a6309O358k376q903L195J4620N892j2394J911q650J8112J4191j1269j5183
7863a0805J0526J8842Q350J4949N392q080k5674j2202O825M806P64j0036l13l118
7849B26p111M789J1567j0159n56m059p260l924M067K769l368j0172M92m427J453
7834b5673M115R480J3335O957L063j5J112N177K924j0215m395k618Q737K626n571
7819I039p423n904j6593Q486j8000k279L974j339O427p48K462j8323j3161J7906
7805c5476N037P104R023Q844O52N718N952M140l417l492r029J6504k570j6890
7791g900K350L751n707J0967J2355M165J08P319k927p411K286j5397q775N083
7777B67l091j6397j1790l418n612k947J4568N228k07J3554J2466R417J1604m04
$$ plain form
7763 23238 16268 7800 -5745 -9464 -11379 -7852 705 -7353 -21094 -28124 -23045 -14898 -26800 -32663
7749 -32663 -30883 -32103 -18274 -9137 -5925 -8428 3341 4520 -10447 -12960 -14758 -11367 7389 2254
7735 2254 -12569 -1910 5050 3642 4279 -3468 -2682 9423 8858 5690 6586 -6351 -30965 -32403 -17137
7720 -17137 -10180 -12886 -16740 -7540 -8541 -7714 2459 1013 -8602 -16271 -16888 -18938 -15983 -19748 -5427
7705 -5427 -4625 41 -4820 -18194 -17190 -15980 -11092 -6151 -21313 -34732 -25640 -13851 -4875 -9622
7691 -9622 -14755 -27331 -29305 -21158 -18351 -30713 -28513 -13380 -1597 2182 -4626 -1065 -6634 -14337
7677 -14337 -8570 -8172 -8121 -12382 -14806 1515 1659 3055 1078 5797 -426 -5206 -2254 2466 6832
7662 6832 403 -6691 -4300 -7499 2944 6324 4443 -5845 -7244 -3681 7872 -8668 -28831 -24332
$$ packed form
7763B3238o970q468j3545l719j915L527Q557q058j3741p030N079Q147j1902n863
7749c2663J780j220J3829R137L212k503J1769J179j4967k513j798L391J8756n135
7735B254j4823J0659O960j408O37p747P86J2105n65l168Q96j2937k4614j438J5266
7720a7137O957k706l854R200j001Q27J0173j446r615p669o17k050K955l765J4321
7705e427Q02M666m861j3374J004J210M888M941j5162j3419R092J1789Q976m747
7691i622n133j2576j974Q147K807j2362K200J5133J1783L779o808L561n569p703
7677a4337N767L98N1m261k424J6321J44J396j977M719o223m780K952M720M366
7662F832o429p094K391l199J0443L380j881j0288j399L563J1553j6540k0163M499
$$ plain form
7648 -24332 -23090 -37680 -40043 -34194 -27065 -21623 -20564 -17801 -3714 11078 8371 6288 11933 -10043
7634 -10043 -18010 -11226 1075 4827 6001 17728 10452 -1116 -9159 2476 16301 3552 1080
7621 1080 -9971 -10737 -17238 -16472 -6093 2830 7237 -8045 -10157 -5320 -10105 -21169 -15816 -9592
7607 -9592 -3629 -3993 1475 4997 -399 -5695 -1037 -3788 -22931 -22224 -1555 -4335 -6577 -12893 -13137
7592 -13137 -14354 -10186 -23983 -33502 -38990 -20747 -12301 -23485 -24845 -20527 -3024 10567 -1402
7579 -1402 -3801 10781 2903 -21011 -29522 -22669 -15524 -11337 -11052 -13458 -8570 -4230 -7735 -6817 -6304
7564 -6304 -9445 -3566 -3818 5989 13913 22608 26222 26560 36572 33926 22989 14461 9233 -5359 -10763
7549 -10763 -865 6177 -3759 3759 13312 3948 -5110 -4997 4808 -10599 -33633 -31972 -13175 896
$$ packed form
7648b4332J242j4590k363N849P129N442J059K763J4087J4792k707k083N645k1976
7634a0043p967O784J2301L752J174J1727p276j1568q043J1635J3825j2749k472
7621A080j1051p66o501P66J0379Q923M407j5282k112M837m785j1064N353O224
7607i592N963l64N468L522n396n296M658k751j9143P07K0669k780k242o316k44
7592a3137j217M168j3797r519n488J8243Q446j1184j360M318J7503J3591j1969
7579a402k399J4582p878k3914q511O853P145M187K85k406M888M340l505R18N13
7564f304l141N879k52R807P924Q695L614L38J0012k646j0937q528n228j4592n404
7549a0763R898P042r936P518R553r364r058J13R805j5407k3034J661J8797J4071
$$ plain form
7535 896 -955 -7563 -9434 -7641 1861 7996 327 3904 17505 -4651 -30430 -31188 -30602 -28833 -17341
7520 -17341 -17285 -28309 -37111 -40014 -34301 -27322 -21474 -20310 -20208 -18833 -22548 -18015 -10450 -1971 -13344
7505 -13344 -16404 -12306 -5980 -1368 -17150 -16228 -10439 -13957 -22391 -22803 -30470 -30065 -13473 12524 16469
7490 16469 13214 17391 18143 8686 -4384 -15313 -9219 145 -11865 -24260 -23784 -27371 -20113 -19977
7476 -19977 -19527 -17936 -8057 -4163 -5820 -14836 -20983 -26809 -30776 -18684 -20738 -10082 -3463 -6687
7462 -6687 -11508 -16975 -19186 -17914 -22291 -20243 -16652 -8082 -1401 7515 6993 3628 -3982 -16298 -25546
7447 -25546 -23643 -16401 -5829 -3964 -8974 -804 49 -8395 -23192 -20030 -7109 5074 3580 7665
7433 7665 14225 -3359 -19684 -30283 -16130 -14798 -20475 -17791 -5728 -1890 -5261 1209 -13044
$$ packed form
7535H96j851o608j871J793R502O135p669L577J3601k2156k5779p58N86J769J1492
7520a7341N6j1024q802k903N713O979N848J164J02J375l715M533P565Q479j1373
7505a3344l060M098O326M612j5782R22N789l518q434m12p667M05J6592K5997L945
7490A6469l255M177P52r457j3070j0929O094R364j2010j2395M76l587P258J36
7476a9977M50J591R879L894j657r016o147n826l967J2092k054J0656O619l224
7462f687m821n467k211J272m377K048L591Q570O681Q916n22l365p610j2316r248
7447b5546J903P242J0572J865n010Q170Q53q444j4797L162J2921J2183j494M085
7433G665O560j7584j6325j0599J4153J332n677K684J2063L838l371O470j4253
$$ plain form
7420 -13044 -16434 -13863 -17338 -27506 -30758 -34392 -30700 -28970 -21018 -10068 -13415 -16631 -14960 -1164
7406 -1164 -3754 6897 8489 19073 22893 8498 -364 1050 4250 2023 1983 -625 -12255 -33319
7392 -33319 -49071 -38846 -29788 -8362 -7610 -12297 -12666 5487 16170 -2691 -4713 -7596 -827 4542
7378 4542 1289 -4363 -3752 -11898 -1753 -4830 5510 2591 -5216 1494 -6656 -33138 -45574 -38668
7364 -38668 -37143 -39139 -34359 -15968 -15856 -11693 -2086 10194 9233 10281 18649 22121 19685 6970
7350 6970 6094 5650 -4126 -13228 -21053 -21146 -25792 -31303 -22855 -16067 -25941 -28724 -29860 -25291 -32780 -24513
7334 -24513 -12513 168 8886 21812 16928 3718 -14279 -26082 -26426 -13832 -11287 -4868 -11769
7321 -11769 -21186 -11673 -14470 -14685 -15625 -16134 -19542 -15656 -22655 -18118 -15238 -5045 11657 10417 4668
$$ packed form
7420a3044l390K571l475j0168l252l634L692J730P952J0950l347l216J671J3796
7406a164k590J0651J592J0584L820j4395q862J414L200k227m0k608j1630k1064
7392c3319j5752J0225R058K1426P52m687l69J8153J0683j8861k022k883O769N369
7378D542l253n652O11q146J0145l077J0340k919p807O710q150k6482j2436O906
7364c8668J525j996M780J8391J12M163R607J2280r61J048Q368L472k436j2715
7350F970q76m44r776r102p825r3m646n511Q448O788r874k783j136M569p489Q267
7334b4513J2000J2681Q718J2926m884j3210j7997j1803l44J2594K545O419o901
7321a1769r417R513k797k15r40n09l408L886o999M537K880J0193J6702j240n749
$$ plain form
7306 4668 5568 4653 -1467 2630 72 -11233 -14158 -6975 3944 -4905 -16879 -29413 -39360 -46639
7292 -46639 -26996 -19594 -29619 -19086 -11847 -16626 -25270 -26701 -23175 -11755 -7744 -4542 -5248 -2234
7278 -2234 -12176 -11122 -19683 -13730 -7711 -12993 -17108 -10070 -2610 -13825 -23364 -21654 -22073 -28366 -27633
7263 -27633 -30096 -42901 -28324 -3672 511 -4505 -3218 -13496 -32029 -28025 -23692 -12430 -7572
7250 -7572 -14564 -12122 -11723 -27966 -10538 -1913 -6084 -15107 -21840 -37495 -42179 -45499 -32831 -24992
7236 -24992 -16540 -19544 -12083 -14985 -29325 -32456 -34459 -30981 -24453 -13821 -6865 -16346 -26084 -24039
7222 -24039 -19581 -21664 -20933 -24711 -27988 -28467 -20733 -25805 -26406 -40850 -51590 -49549 -38133 -22452
7208 -22452 -20349 -20775 -17212 -11840 -593 13074 19614 -804 -2307 -1770 -13282 -22104 -18737 -12263
$$ packed form
7306D668R00r15o120M097k558j1305k925P183J0919q849j1974j2534r947p279
7292d6639J9643P402j0025J0533P239m779q644j431L526J1420M011L202p06L014
7278b234r942J054q561N953O019n282m115P038P460j1215r539J710m19o293P33
7263b7633k463j2805J4577K4652M183n016J287j0278j8533M004M333J1262M858
7250g572o992K442L99j6243J7428Q625m171r023o733j5655m684l320J2668P839
7236b4992Q452l004P461k902j4340l131k003L478O528J0632O956r481r738K045
7222b4039M458k083P31l778l277m79P734n072o01j4444j0740K041J1416J5681
7208b2452K103m26L563N372J1247J3667O540k0418j503N37j1512q822L367O474
$$ plain form
7194 -12263 -6958 -19168 -13117 -8433 -9362 -20384 -15566 -7151 -6144 -5178 -1332 -6981 -19997 -19058 -529
7179 -529 11004 5416 534 1907 5842 2094 -14652 -20382 -4919 -467 12304 13676 -16569 -21010
7165 -21010 -16346 -16833 -31001 -29825 -35502 -35223 -20450 -14304 -6241 -13437 -23651 -15045 -14340 -7356 -8603
7150 -8603 -12819 -27251 -30942 -28846 -22232 -13167 -14445 -11782 -8652 -7643 -12694 5176 29436 23231
7136 23231 -1287 -9528 -10219 -19063 -18912 -7784 -7506 -11324 -13350 -4534 -1804 -15417 -33996 -39249
7122 -39249 -21885 -11341 -9380 -13050 -3239 -11292 -24926 -27022 -20959 -15114 -13329 -18315 -27059 -24261
7108 -24261 -29991 -31502 -22167 -9295 2108 -21094 -28754 -30287 -15593 -17939 -27418 -41267 -35549
7095 -35549 -18589 -1918 -6546 -8241 -9299 -11223 -14793 -26491 -31016 -30932 -23347 -23432 -18612 -15212 -22374
$$ packed form
7194a2263N305j2210O051M684r29j1022M818Q415J007R66L846n649j3016R39J8529
7179e29J1533n588m882J373L935l748j6746n730J5463M452J2771J372l0245m441
7165b1010M664m87j4168J176n677K79J4773O146Q063p196j0214Q606P05O984j247
7150h603m216j4432l691K096O614R065j278K663L130J009n051J7870K4260o205
7136B3231k4518q241o91q844J51J1128K78l818k026Q816K730j3613j8579n253
7122c9249J7364J0544J961l670R811q053j3634k096O063N845J785m986q744K798
7108b4261n730j511R335J2872J1403k3202p660j533J4694k346r479j3849N718
7095c5549J6960J6671m628j695j058j924l570j1698m525Q4P585q5M820L400p162
$$ plain form
7080 -22374 -26397 -26660 -24195 -31734 -36278 -30854 -21313 -3936 10413 11276 9226 4524 2468 2309 -484
7065 -484 -12811 -18805 -22013 -4010 18407 2605 -16843 -12465 -5187 2219 9472 -585 -4697 2066
7051 2066 15162 11891 -2427 -4999 -7195 -6098 -14874 -3931 7466 4672 -6431 -8538 -8861 -17367
7037 -17367 -17255 -3865 -4784 -7318 -20273 -30311 -23371 -18587 -8884 -13439 -26403 -28225 -21287 -11532
7023 -11532 -4338 -6818 -7305 -6502 -13980 -14823 -11692 -17208 -14412 -22638 -16844 -326 -1600 -5334 6283
7008 6283 8967 18931 18298 3089 -14617 -17799 -16875 -19308 -8827 76 3918 9391 1125 -8862 -8978
6993 -8978 -3983 -6691 -9447 9677 23672 20625 9704 990 -13613 -14785 -12986 -18144 -21593 -27585
6979 -27585 -11376 4252 9858 -12441 -25396 -29250 -28572 -17532 -9482 -13050 -17859 -16336 -21551 -15236
$$ packed form
7080b2374m023k63K465p539m544N424R541J7377J4349Q63k050m702k056j59k793
7065d84j2327n994l208J8003K2417j5802j9448M378P278P406P253j0057m112O763
7051B066J3096l271j4318k572k196J097q776J0943J1397k794j1103k107l23q506
7037a7367J12J3390r19k534j2955j0038O940M784R703m555j2964j822O938R755
7023a1532P194k480m87Q03p478q43L131n516K796q226N794J6518j274l734J1617
7008F283K684R964o33j5209j7706l182R24k433J0481Q903L842N473q266r987j16
6993h978M995k708k756J9124J3995l047j0921q714j4603j172J799n158l449n992
6979b7585J6209J5628N606k2299j2955l854O78J1040Q050l568m809J523n215O315
$$ plain form
6965 -15236 -19171 -9933 -14296 -20325 -26972 -29778 -21956 -15998 -20194 -10893 3255 8932 8306 12894 17829
6950 17829 13383 9253 4502 497 8563 11964 -4753 -30189 -30502 -20719 -16048 -5227 -3557 -9675
6936 -9675 -13436 -4783 11450 1698 -10418 -6233 -8008 -26838 -29747 -33822 -32312 -27271 -21105 -25850
6922 -25850 -20617 -8558 -7843 -3577 -7188 -23294 -25744 -26833 -21954 -24616 -11403 -6256 -10561 -20796
6908 -20796 -33108 -33784 -22915 -16341 -19986 -22437 -25139 -28611 -23455 -19592 -20258 -22737 -24601 -19777 -16794
6893 -16794 -14711 -9201 -23379 -29099 -16940 -17143 -14360 -14823 -14177 -8768 -15489 -25076 -29271 -21192 -7363
6878 -7363 -6324 -10286 3482 11109 12672 10647 11867 2769 -4367 2793 9764 7829 -4286 -4191 12283
6863 12283 13749 7135 3756 15062 28145 30281 36448 50148 39740 11209 14777 25239 34202
$$ packed form
6965a5236l935R238m363o029o647k806P822N958m196R301J4148N677o26M588M935
6950A7829m446m130m751m005Q066L401j6717k5436l13R783M671J0821J670o118
6936i675l761Q653J6233r752j2116M185j775j8830k909m075J510N041O166m745
6922b5850N233J2059P15M266l611j6106k450j089M879k662J3213N147m305j0235
6908b0796j2312o76J0869O574l645k451k702l472N156L863o66k479j864M824K983
6893a6794K083N510j4178n720J2159k03K783m63O46N409o721r587m195Q079J3829
6878g363J039l962J3768P627J563k025J220r098p136P160O971j935j2115R5J6474
6863A2283J466o614l379J1306J3083K136O167J3700j0408k8531L568J0462Q963
$$ plain form
6850 34202 32090 27266 16887 9134 -1567 926 8257 16026 15503 23913 7882 -6191 -3610 -15662
6836 -15662 -5709 1066 4170 -6389 -9296 -9881 -5229 -6854 -18387 -22563 -25242 -10554 -10390 -12200
6822 -12200 -11936 -7280 -6137 -2176 -9509 -11746 4705 138 8032 283 -16823 -17856 -7156 -3465
6808 -3465 2384 -826 -4211 -508 6113 1084 -15096 -5835 3396 11369 -1981 -16170 -14983 -5598
6794 -5598 5813 -4686 -8313 2330 25979 37169 27427 21826 12147 7163 14255 27653 20386
6781 20386 9286 6254 5264 6070 8135 6513 6812 -541 -11399 -23585 -28777 -17769 -2199 5318
6767 5318 -4639 -16680 -19966 -22595 -19535 -17967 -21232 -21872 -12070 -9483 -5992 1589 -231 -6021 -6351
6752 -6351 -14118 -14559 -587 12127 25029 29564 17437 -9077 -11208 -18747 -26025 -24295 -16917 -18593
$$ packed form
6850C4202k112m824j0379p753j0701K493P331P769n23Q410j6031j4073K581j2052
6836a5662R953O775L104j0559k907n85M652j625j1533m176k679J4688J64j810
6822a2200K64M656J143L961p333k237J6451m567P894p749j7106j033J0700L691
6808c465N849l210l385L703O621n029j6180R261R231P973j3350j4189J187R385
6794e598J1411j0499l627J0643K3649J1190r742n601r679m984P092J3398p267
6781B0386j1100l032r90Q06K065j622K99p353j0858j2186n192J1008J5570P517
6767E318r957j2041l286k629L060J568l265o40R802K587L491P581j820n790l30
6752f351p767m41J3972J2714J2902M535j2127k6514k131p539p278J730P378j676
$$ plain form
6738 -18593 -19749 -23508 -26029 -13040 -9464 -11906 -10763 -9825 -20479 -17754 -5441 -20540 -24839 -18749
$$ packed form
6738a8593j156l759k521J2989L576k442J143R38j0654K725J2313j5099m299O090
$$ [...]
##END NTUPLES=NMR SPECTRUM
##END=
