##TITLE=Analysis number 327482
Compound Code cc 22101
Book Reference 240727
Project Code adrs flro3
Chemist Name jom
##JCAMPDX= 6.0         $$ Bruker NMR JCAMP-DX V2.0
##DATA TYPE= NMR SPECTRUM
##DATA CLASS= NTUPLES
##ORIGIN= Bruker BioSpin GmbH
##OWNER= nmr
$$ XWIN-NMR		Version 3.5
$$ Tue Mar 27 10:54:18 2007 GMT Daylight Time (UT+1h)  MAYBRIDGE\nmr@NMR_250MHZ
##.OBSERVE FREQUENCY= 250.131544655141
##.OBSERVE NUCLEUS= ^1H
##.ACQUISITION MODE= SIMULTANEOUS (DQD)
##.ACQUISITION SCHEME= undefined
##.AVERAGES= 16
##.DIGITISER RES= 18
##SPECTROMETER/DATA SYSTEM= dpx250
##.PULSE SEQUENCE= zg30
##.SOLVENT NAME= DMSO
##.SHIFT REFERENCE= (INTERNAL, DMSO, 0, 16.522)
##AUDIT TRAIL= $$ (NUMBER, WHEN, WHO, WHERE, WHAT)
$$ ##TITLE= Audit trail, XWIN-NMR		Version 3.5
$$ ##JCAMPDX= 5.01
$$ ##ORIGIN= Bruker BioSpin GmbH
$$ ##OWNER= nmr
$$ C:\u/data/dgb/nmr/ADRS/2120/pdata/1/auditp.txt
$$ ##AUDIT TRAIL=  $$ (NUMBER, WHEN, WHO, WHERE, WHAT)
(   1,<2007-03-27 10:53:50.22 +100>,<MAYBRIDGE\nmr>,<NMR_250MHZ>,
      <created by zg, POWCHK disabled, PULCHK disabled
       configuration hash MD5:
       49 4B E0 1D 92 C2 6B 37 9F E6 65 BC 52 41 86 1D
       data hash MD5: 64K
       DA 0F 3D 08 C8 92 9C B4 14 BC CA C6 FF 43 55 28>)
(   2,<2007-03-27 10:54:07.18 +100>,<MAYBRIDGE\nmr>,<NMR_250MHZ>,
      <Start of raw data processing
       ef LB = 0.3 FT_mod = 6 PKNL = 1 SI = 32K 
       data hash MD5: 32K
       63 C5 4C 35 A6 18 B5 46 25 B4 95 49 F2 68 06 09>)
(   3,<2007-03-27 10:54:08.88 +100>,<MAYBRIDGE\nmr>,<NMR_250MHZ>,
      <apk 
       data hash MD5: 32K
       79 64 34 F2 05 98 4F D6 64 83 E5 27 34 4E 9D FC>)
(   4,<2007-03-27 10:54:09.64 +100>,<MAYBRIDGE\nmr>,<NMR_250MHZ>,
      <abs ABSG = 5 
       data hash MD5: 32K
       14 BF 75 FB 63 40 6F 62 AD 2C 76 B6 1B D1 15 42>)
$$ ##END=
$$ 
$$ hash MD5
$$ D8 BB 44 0C 50 64 CD 78 75 43 44 A2 FD 9F EC 50
##$RELAX= 
##$RELAX= 
##$RELAX= 
##$RELAX= 
##$RELAX= 
##$RELAX= 
##$RELAX= 
$$ Bruker specific parameters
$$ --------------------------
##$DU= <C:\u>
##$EXPNO= 2120
##$NAME= <ADRS>
##$PROCNO= 1
##$TYPE= <nmr>
##$USER= <dgb>
##$AMP= (0..31)
100 100 100 100 100 100 100 100 100 100 100 100 100 100 100 100 100 100 
100 100 100 100 100 100 100 100 100 100 100 100 100 100 
##$AQSEQ= 0
##$AQ_mod= 3
##$AUNM= <au_zg>
##$AUTOPOS= <14 >
##$BF1= 250.13
##$BF2= 250.13
##$BF3= 250.13
##$BF4= 250.13
##$BF5= 500.13
##$BF6= 500.13
##$BF7= 500.13
##$BF8= 500.13
##$BYTORDA= 1
##$CFDGTYP= 0
##$CFRGTYP= 5
##$CHEMSTR= <none>
##$CNST= (0..31)
1 1 145 1 1 1 1 1 1 1 1 1 1 1 1 1 1 1 1 1 1 1 1 1 1 1 1 1 1 1 1 1 
##$CPDPRG= <>
##$CPDPRG1= <>
##$CPDPRG2= <>
##$CPDPRG3= <>
##$CPDPRG4= <mlev>
##$CPDPRG5= <mlev>
##$CPDPRG6= <mlev>
##$CPDPRG7= <mlev>
##$CPDPRG8= <mlev>
##$CPDPRGB= <>
##$CPDPRGT= <>
##$D= (0..31)
0 1 0 0 0 0 0 0 0 0.06 0 0 0 0 0 0 0.0002 0 0 0 0 0 0 0 0 0 0 0 0 0 0 
0 
##$DATE= 1174989228
##$DBL= (0..7)
120 120 120 120 120 120 120 120 
##$DBP= (0..7)
150 150 150 150 150 150 150 150 
##$DBP07= 0
##$DBPNAM0= <>
##$DBPNAM1= <>
$$ [...]
##$SUBNAM7= <"">
##$SUBNAM8= <"">
##$SUBNAM9= <"">
##$SW= 20.6930455092707
##$SWIBOX= (0..15)
0 0 3 0 0 0 0 0 0 0 0 0 0 0 0 0 
##$SW_h= 5175.983436853
##$TD= 65536
##$TD0= 1
##$TE= 683.16
##$TE2= 300
##$TE3= 300
##$TEG= 300
##$TL= (0..7)
0 120 120 120 120 120 120 120 
##$TP= (0..7)
150 150 150 150 150 150 150 150 
##$TP07= 0
##$TPNAME0= <>
##$TPNAME1= <>
##$TPNAME2= <>
##$TPNAME3= <>
##$TPNAME4= <>
##$TPNAME5= <>
##$TPNAME6= <>
##$TPNAME7= <>
##$TPOAL= (0..7)
0.5 0.5 0.5 0.5 0.5 0.5 0.5 0.5 
##$TPOFFS= (0..7)
0 0 0 0 0 0 0 0 
##$TUNHIN= 0
##$TUNHOUT= 0
##$TUNXOUT= 0
##$USERA1= <user>
##$USERA2= <user>
##$USERA3= <user>
##$USERA4= <user>
##$USERA5= <user>
##$V9= 5
##$VALIST= <valist>
##$VCLIST= <CCCCCCCCCCCCCCC>
##$VD= 0
##$VDLIST= <DDDDDDDDDDDDDDD>
##$VPLIST= <PPPPPPPPPPPPPPP>
##$VTLIST= <TTTTTTTTTTTTTTT>
##$WBST= 1024
##$WBSW= 4
##$XGAIN= (0..3)
0 0 0 0 
##$XL= 0
##$YL= 0
##$YMAX_a= 315190
##$YMIN_a= -477071
##$ZGOPTNS= <>
##$ZL1= 120
##$ZL2= 120
##$ZL3= 120
##$ZL4= 120
##$ABSF1= 16.522
##$ABSF2= -4.171173
##$ABSG= 5
##$ABSL= 3
##$ALPHA= 0
##$AQORDER= 0
##$ASSFAC= 0
##$ASSFACI= 0
##$ASSFACX= 0
##$ASSWID= 0
##$AUNMP= <proc_1d>
##$AZFE= 0.1
##$AZFW= 0.1
##$BCFW= 0
##$BC_mod= 0
##$BYTORDP= 0
##$COROFFS= 0
##$CY= 12.5
##$DATMOD= 1
##$DC= 0
##$DFILT= <>
##$DTYPP= 0
##$F1P= 14.0000005364418
##$F2P= -0.99999901652339
##$FCOR= 0.5
##$FTSIZE= 32768
##$FT_mod= 6
##$GAMMA= 0
##$GB= 0
##$INTBC= 1
##$INTSCL= 1
##$ISEN= 128
##$LB= 0.3
##$LEV0= 0
##$LPBIN= 0
##$MAXI= 10000
##$MC2= 0
##$MEAN= 0
##$ME_mod= 0
##$MI= 0
##$NCOEF= 0
##$NC_proc= -4
##$NLEV= 6
##$NOISF1= 0
##$NOISF2= 0
##$NSP= 0
##$NTH_PI= 0
##$NZP= 0
##$OFFSET= 16.522
##$PC= 1
##$PHC0= 216.4897
##$PHC1= 12.42865
##$PH_mod= 1
##$PKNL= yes
##$PPARMOD= 0
##$PSCAL= 4
##$PSIGN= 0
##$REVERSE= no
##$SF= 250.13
##$SI= 32768
##$SIGF1= 0
##$SIGF2= 0
##$SINO= 400
##$SIOLD= 32768
##$SREGLST= <1H.DMSO>
##$SSB= 0
##$STSI= 32768
##$STSR= 0
##$SW_p= 5175.98343685301
##$SYMM= 0
##$S_DEV= 0
##$TDeff= 65536
##$TDoff= 0
##$TI= <Analysis number 999999
Compound Code 99
Book Reference 9
Project Code 9>
##$TILT= no
##$TM1= 0
##$TM2= 0
##$TOPLEV= 0
##$USERP1= <user>
##$USERP2= <user>
##$USERP3= <user>
##$USERP4= <user>
##$USERP5= <user>
##$WDW= 1
##$XDIM= 32768
##$YMAX_p= 394106198
##$YMIN_p= -210221
$$ End of Bruker specific parameters
$$ ---------------------------------
##NTUPLES= NMR SPECTRUM
##VAR_NAME=  FREQUENCY,     SPECTRUM/REAL,   SPECTRUM/IMAG
##SYMBOL=    X,             R,               I
##VAR_TYPE=  INDEPENDENT,   DEPENDENT,       DEPENDENT
##VAR_FORM=  AFFN,          ASDF,            ASDF
##VAR_DIM=   32768,         32768,           32768
##UNITS=     HZ,            ARBITRARY UNITS, ARBITRARY UNITS
##FACTOR=    0.157963299565203, 1,           1
##FIRST=     4132.6476996994, 0,             0
##LAST=      -1043.33573715361, 0,           0
##MIN=       -1043.33573715361, -210221,     0
##MAX=       4132.6476996994, 394106198,     0
$$ Real data points
##PAGE= N=1
##DATA TABLE= (X++(R..R)), XYDATA
$$ [...]
21905e6080k7363n3189M917O1938l0129K6724J5338m4779q84P6554J11619j6996
$$ -56080 -83443 -136632 -131715 -69777 -99906 -73182 -57844 -102623 -103507 -26953 84666 67670
21893F7670q9202n1185m1464P648R0206L8637l6348n2670l0512l1410K0112M7701
$$ 67670 -21532 -72717 -114181 -106533 -16327 22310 -14038 -66708 -97220 -128630 -108518 -60817
21881f0817N27k6821k0588j8388L7862m213J5893n356j0424L9995Q545k3738M2138
$$ -60817 -60290 -87111 -107699 -126087 -88225 -92438 -76545 -81901 -92325 -52330 -43785 -67523 -25385
21868b5385K4011K5300M7833k3251k3298k9776K0606j5058k5102J5691Q5261L6439
$$ -25385 -1374 23926 71759 48508 25210 -4566 16040 982 -24120 -8429 76832 113271
21856A13271l6298l1998l1983K7828R245k7856J9126j7538k898q609N97J5662
$$ 113271 76973 44975 12992 40820 50065 22209 41335 23797 20899 12290 12887 28549
21844B8549K9292j5260j2895l1952K4531j1383J8092k5017o0254p3687J0542Q4189
$$ 28549 57841 42581 29686 -2266 22265 10882 28974 3957 -56297 -129984 -119442 -35253
21832c5253L2405J6231l5196k4242j8297L4647N4911k0206o3097Q396m597l16
$$ -35253 -2848 13383 -21813 -46055 -64352 -29705 25206 5000 -58097 -49701 -54298 -54614
21820e4614K3246M0744l3399k8977J2218M3730o935r440K459n3762J6186M0996
$$ -54614 -31368 9376 -24023 -53000 -40782 2948 -3987 -13427 -10968 -64730 -48544 -7548
21808g548R51m9715r0090m197P2517K5122Q617L1759k2255J7026J4173k9548K5910
$$ -7548 -6597 -56312 -146402 -150599 -78082 -52960 -44343 -12584 -34839 -17813 -3640 -33188 -7278
21795g278M244l2114o0050l4320j5150m379N1759K7015P510k8843n495K6697J6448
$$ -7278 -3034 -35148 -95198 -129518 -144668 -149047 -97288 -70273 -62763 -91606 -97101 -70404 -53956
21782e3956k1314R987N4579m6113k504L1680L350k2267j6878l8428k4875L8268
$$ -53956 -75270 -65283 -10704 -56817 -59321 -27641 -24291 -46558 -63436 -101864 -126739 -88471
21770h8471N8381L0094P6489k2146n6579n21J3434K7545J4121l7942k4425l8400
$$ -88471 -30090 4 76493 54347 -2232 -2753 10681 38226 52347 14405 -10020 -48420
21758d8420k885N0481M5147n7386l5638j4399K4411P3659j187k1275J7105J5479
$$ -48420 -51305 -824 44323 -13063 -48701 -63100 -38689 34970 33783 12508 29613 45092
21746D5092m3038n3261l6570l216P166k2841K8851J1731Q300L2448N9434J6064
$$ 45092 2054 -51207 -87777 -90993 -83827 -106668 -77817 -66086 -57786 -25338 34096 50160
21734E0160l2853m6339m7486j1980K0041M5040L227m6695j8126m4220N6551O8956
$$ 50160 17307 -29032 -76518 -88498 -68457 -23417 -20190 -66885 -85011 -129231 -72680 -3724
21722c724J3726l2021Q711j5898k4931m068j3728j6205j0850j2838m3576q891
$$ -3724 10002 -22019 -13308 -29206 -54137 -58205 -71933 -88138 -98988 -111826 -155402 -164293
21710a64293L3159O8677J5429K0165L7220j1596k0326o971j7020l6938j7211K4051
$$ -164293 -131134 -62457 -47028 -26863 10357 -1239 -21565 -28536 -45556 -82494 -99705 -75654
21698g5654R970K1522j0889j7594k7589j9891M9706J0771N040j5263N580L7914
$$ -75654 -65684 -44162 -55051 -72645 -100234 -120125 -70419 -59648 -54608 -69871 -64291 -26377
21686b6377L079K4543O0342J942Q478J6689l4471m5606j2988j8011p896L3389
$$ -26377 -23298 1245 61587 63529 72007 88696 54225 8619 -4369 -22380 -30276 3113
21674C113O6880l678k6750M25k8944l3520j1083l7456P299k4022j1187P906P362
$$ 3113 69993 66315 39565 39990 11046 -22474 -33557 -71013 -63714 -87736 -98923 -91017 -83655
21661h3655R33R334l4832o4471Q8112K2644l7336L7075J140N3508O068m8338P870
$$ -83655 -82722 -73388 -108220 -172691 -84579 -61935 -99271 -62196 -61056 -7548 -1480 -49818 -41948
21648d1948r019K2179k071l8276K363L8637K1061m9805m2420K4943l2004Q502
$$ -41948 -50967 -28788 -30859 -69135 -66772 -28135 -7074 -56879 -99299 -74356 -106360 -97858
21636i7858O6013J0659m1917l0016j7272M2848L6250o123k3022M5892o62m76N1756
$$ -97858 -31845 -21186 -63103 -93119 -110391 -67543 -31293 -37416 -60438 -14546 -15208 -15684 36072
21623C6072m8603n3249j57m0990k9608O3229J376N9114M9551k8786L6295n819
$$ 36072 -12531 -65780 -65937 -106927 -136535 -73306 -71930 -12816 36735 7949 44244 38425
21611C8425r5677J2232J7660L8337l8368k7423M997P030J153K6835o382R683L5162
$$ 38425 -57252 -45020 -27360 10977 -27391 -54814 -49817 -42787 -41634 -14799 -21181 -11498 23664
21598B3664l7443j0994Q774O654M2873J9906J2638j2038j1499J3283j262m0564
$$ 23664 -13779 -24773 -15999 -9345 33528 53434 66072 54034 42535 55818 54556 13992
21586A3992p6874N117L5958L1047j2251j0580Q983j936N9746L722O667j983l0464
$$ 13992 -62882 -57765 -21807 9240 -3011 -13591 -4608 -6544 53202 56924 63591 61608 31144
21573C1144m5822k0013k2386K824K2926P212K7802k2164k6090L685J7043j3699
$$ 31144 -14678 -34691 -57077 -54253 -31327 -24115 3687 -18477 -44567 -40882 -23839 -37538
21561c7538L907M2787K2697L248m7023p5672L6569O7891K9710L3663O4068k0707
$$ -37538 -33631 9156 31853 35101 -11922 -87594 -51025 16866 46576 80239 144307 123600
21549A23600p4400m8741l7756L3701l632k5656j5200J00030l0224l8754m5254
$$ 123600 49200 459 -37297 -3596 -7228 -32884 -48084 51946 21722 -17032 -62286
21538f2286j6299K3721m6887l084K3128J9291n583M7624K8503J0352m155L4958
$$ -62286 -78585 -54864 -101751 -104835 -81707 -62416 -67999 -20375 8128 18480 14325 49283
21526D9283N723K2622r238k367N536p4155o8852J0287P852n481N2663L6962J0315
$$ 49283 55006 77628 68390 66023 71559 -2596 -71448 -61161 -53309 -58790 -6127 30835 41150
21513D1150k5952n7529j2460n37J0951J1002m434r080J9511L1497o458p405k9295
$$ 41150 15198 -42331 -54791 -55328 -44377 -33375 -37809 -46889 -27378 4119 -2339 -9744 -39039
21500c9039J8149K0241k8727m7717O4916J816l8498l7832P901J8125K4575m10
$$ -39039 -20890 -649 -29376 -77093 -12177 -10361 -48859 -86691 -78790 -60665 -36090 -36500
21488c6500l4743J4762L085R35l0053j7885l1948l0092N362O4956K6157o322k3554
$$ -36500 -71243 -56481 -53396 -52461 -82514 -100399 -132347 -162439 -157077 -92121 -65964 -72286 -95840
21475i5840K0662R085o24j430n666r6715K5188Q7750K1767j6074N409K9910K3139
$$ -95840 -75178 -66093 -66717 -68147 -73813 -170528 -145340 -57590 -35823 -51897 -46488 -16578 6561
21462F561k4373L8706M4209j7807l447k9463k0690j6773m7432j6997K0685k9036
$$ 6561 -17812 20894 65103 47296 43849 14386 -6304 -23077 -70509 -87506 -66821 -95857
21450i5857j3416l6200j7235M8453N3672J0650p418J8897k4264l7190K9072M0812
$$ -95857 -109273 -145473 -162708 -114255 -60583 -49933 -57351 -38454 -62718 -99908 -70836 -30024
21438c0024K2260K4604o635l7262p353m221J8890K7941j4981J6601M649K4094
$$ -30024 -7764 16840 10205 -27057 -34410 -38631 -19741 8200 -6781 9820 14469 38563
21426C8563r154o3170M5924N7818k9430l9112r911K4916j7551J6898J7479P738
$$ 38563 29409 -33761 12163 69981 40551 1439 -8472 16444 -1107 15791 33270 41008
21414D1008l1892K9248j0633m6682l2970j8776n509N3680q68l0925l1593L2018
$$ 41008 9116 38364 27731 -18951 -51921 -70697 -76206 -22526 -23394 -54319 -85912 -53894
21402e3894L1419K6862N463j55K090k1026l6693l7246l0685O195M3152K2334J5796
$$ -53894 -22475 4387 9850 9695 11785 -9241 -45934 -83180 -113865 -107670 -64518 -42184 -26388
21389b6388J8485M889K0973N0513k7035q1984j5483l571o0222m2254J6233L2422
$$ -26388 -7903 -3014 17959 68472 41437 -40547 -56030 -59601 -119823 -162077 -145844 -113422
21377a13422k3661J2482J8954K5299j5683J6307M6087K3578J953J8918o44K9121
$$ -113422 -137083 -124601 -105647 -80348 -96031 -79724 -33637 -10059 -8106 10812 10168 39289
21365C9289o6879J0627L8816l8349k8496p177j1240J4009N8189j1600K3440j4958
$$ 39289 -27590 -16963 21853 -16496 -44992 -52169 -63409 -49400 8789 -2811 20629 5671
21353E671K0378J1328n9398j3603l2539l2856J4959J1972K3996K7160j7733o2945
$$ 5671 26049 37377 -22021 -35624 -68163 -101019 -86060 -74088 -50092 -22932 -40665 -103610
21341a03610j1246K1976K9044L116m0221k7494k2555K6902N8632O2772l3854m9346
$$ -103610 -114856 -92880 -63836 -60720 -100941 -128435 -150990 -124088 -65456 -2684 -36538 -85884
21329h5884K1814j9539m5900J5061P141L2532j0346k5038L7318N8190J9637J2155
$$ -85884 -64070 -83609 -129509 -114448 -107307 -74775 -85121 -110159 -72841 -14651 4986 17141
21317A7141j4258J7280l947n7866q6242M6443M8971M4971K1913j7574K284J6275
$$ 17141 2883 20163 16216 -41650 -127892 -81449 -32478 12493 34406 16832 19116 35391
21305C5391O971k5131Q945K8137m8617K1773n783q0852K0297L3205j8401K8590
$$ 35391 42362 17231 26176 54313 5696 27469 21686 -59166 -38869 -5664 -24065 4525
21293D525m4131n5536J9804L4980j0640J5694k9341L3119L1049O1221J8328l8501
$$ 4525 -39606 -95142 -75338 -40358 -50998 -35304 -64645 -31526 -477 60744 79072 40571
21281D0571K4919k8956p6851j2130j7155m156j4014j359N5907K0758n9109O933
$$ 40571 65490 36534 -40317 -52447 -69602 -73758 -87772 -89131 -33224 -12466 -71575 -64642
21269f4642R4549j2388j2845N0l7360l8273K5775N2974N9056L2410l330p4490
$$ -64642 29907 17519 4674 4724 -32636 -70909 -45134 7840 66896 99306 95976 21486
21257B1486n6272J2511M5248p065j2288O456L4171l6964k8788Q379j1914P340
$$ 21486 -34786 -22275 22973 15908 3620 10076 44247 7283 -21505 -13126 -25040 -17700
21245a7700k4504p356M026j8129j7749J9696N1265L849K2135m5118l2470j3266
$$ -17700 -42204 -49560 -45534 -63663 -81412 -61716 -10451 -6602 15533 -29585 -62055 -75321
21233g5321k0430k4470N1292M5679l7433j3928Q742L2965L1556l2585Q336M1169
$$ -75321 -95751 -120221 -68929 -23250 -60683 -74611 -65869 -32904 -1348 -33933 -25597 15572
21221A5572n1513l8838m029K4646L9077M1360N2466m5404k203P718o6582m2541
$$ 15572 -35941 -74779 -78808 -54162 -15085 26275 78741 33337 31134 38852 -27730 -70271
21209g0271m7093J8799R248J0840K9441K5788j1788k0621k1653K9150J3538j975
$$ -70271 -117364 -98565 -89317 -78477 -49036 -23248 -35036 -55657 -77310 -48160 -34622 -36597
21197c6597j9353k3607m997N3636P4768m3109o9076K891j5962q345M4806j515
$$ -36597 -55950 -79557 -84554 -30918 43850 741 -68335 -65444 -81406 -89751 -44945 -46460
21185d6460j1761P510N5336k0497n4807K3525o273M290N6716L0097K1234n5366
$$ -46460 -58221 -50711 4625 -15872 -70679 -47154 -53427 -49137 7579 37676 58910 3544
21173C544n1814p398K1897n866K8765j7831K5583L855o9913j8665L2583L256J5953
$$ 3544 -48270 -55668 -33771 -39637 -10872 -28703 -3120 735 -69178 -87843 -55260 -52004 -36051
21160c6051J9626M7666K6219o436N309j28k6835L1493j3715j4011j9793p2808
$$ -36051 -16425 31241 57460 51024 56333 56205 29370 60863 47148 33137 13344 -59464
21148e9464j3417J6422K6938P513K3478j8330k2020L83K8164L9440k9559l9960
$$ -59464 -72881 -56459 -29521 -22008 1470 -16860 -38880 -38497 -10333 29107 -452 -40412
21136d0412j5806j7144M0878M1247J9261M058k7553n9236O716j6962n2165j9095
$$ -40412 -56218 -73362 -32484 8763 28024 32082 4529 -54707 -47991 -64953 -117118 -136213
21124a36213K155j6148P089M8794J6862k8314M7666J6876K9195M9413n4435l4107
$$ -136213 -134058 -150206 -143117 -94323 -77461 -105775 -58109 -41233 -12038 37375 -17060 -51167
21112e1167N4886j4346m3071j3357K9574j4506k8864P6049K4875J4429M0755p0935
$$ -51167 3719 -10627 -53698 -67055 -37481 -51987 -80851 -4802 20073 34502 75257 4322
21100D322J275O1706P415p6179j6553m0163k6884L1875O4533J7616p4631l8113
$$ 4322 5597 67303 74718 -1461 -18014 -58177 -85061 -53186 11347 28963 -45668 -83781
21088h3781J9208k810n511M8411J111k5608m2689J1202j2264O195P0025K8187
$$ -83781 -64573 -67383 -72894 -24483 -23372 -48980 -91669 -80467 -92731 -86536 -16511 11676
21076A1676K9507l0874q3917n2465J2442M9438M6123K6527K8310L1106j9854r0644
$$ 11676 41183 10309 -73608 -126073 -113631 -64193 -18070 8457 36767 67873 48019 -42625
21064d2625n2920K0186m055n7163P726J2026M1818j0633p618K6509j8301J0368
$$ -42625 -95545 -75359 -79414 -136577 -128851 -116825 -75007 -85640 -93258 -66749 -85050 -74682
21052g4682M139q35p070j3085K0409R239L0209k4815J8979l7264k9417j4831O2252
$$ -74682 -70543 -71378 -78448 -91533 -71124 -61885 -31676 -56491 -37512 -74776 -104193 -119024 -56772
21039e6772L6730k4390K5137J5240j6209j0054m9683o541J6275M6714O769l0463
$$ -56772 -20042 -44432 -19295 -4055 -20264 -30318 -80001 -86542 -70267 -23553 -16784 -47247
21027d7247L0439J6928l3295O88K9311K4874j408l2422L7865L053k0801l4872
$$ -47247 -16808 120 -33175 -32487 -3176 21698 20290 -12132 25733 28786 7985 -26887
21015b6887l3510O350Q068k4323L32M8927l5012k8279M6676N111M2805O5655K5407
$$ -26887 -60397 -54047 -45979 -70302 -69970 -21043 -56055 -84334 -37658 -32547 10258 75913 101320
21002A01320m8226m9034J6992m3791j6136P4911N113p0126l4154J4626k0022K3952
$$ 101320 53094 4060 21052 -22739 -38875 36036 41149 -28977 -63131 -48505 -68527 -44575
20990d4575J6234j621o919K616l805K7137L981l042l4791k4108r668N0327p110
$$ -44575 -28341 -29962 -36881 -34265 -38070 -10933 -6952 -9994 -44785 -68893 -78561 -28234 -35344
20977c5344l2083k8578p511J1666L3610M8015M7259K1011n0885q3655j9516L061
$$ -35344 -67427 -96005 -103516 -91850 -58240 -10225 37034 58045 7160 -76495 -96011 -92950
20965i2950L1894J2906K1485J357K0806o675J8697M3848k2092k2482j4977J0413
$$ -92950 -61056 -48150 -26665 -25308 -4502 -11177 7520 51368 29276 6794 -8183 2230
20953B230k8310j2927R454k749J9914k3812l9985p818K6846P8346Q076n4552M348
$$ 2230 -26080 -39007 -29553 -32302 -12388 -36200 -76185 -84003 -57157 21189 29265 -25287 -20939
20940b0939k0338m2805J0484M8612P64J2936K1875L7662j8357m3224k4175J0710
$$ -20939 -41277 -84082 -73598 -24986 -24222 -11286 10589 48251 29894 -13330 -37505 -26795
20928b6795k4889j8164K2374k2663m2736N067R1311K5588N810m8662j7562K3986
$$ -26795 -51684 -69848 -47474 -70137 -112873 -107806 -16495 9093 14903 -33759 -51321 -27335
20916b7335k7740J5694K2423K4861j9560l6993j949M3680O8859L2303l2226L979
$$ -27335 -55075 -39381 -16958 7903 -11657 -48650 -50599 -6919 61940 94243 62017 65996
20904F5996m6076j173j7300o6524m1655L3578N7429j6568j4864j6684K3817J4032
$$ 65996 19920 18747 1447 -65077 -106732 -73154 -15725 -32293 -47157 -63841 -40024 -25992
20892b5992o8806K8955J02787j1796l7634J4730J3087m7332o796L7750l9063m9649
$$ -25992 -94798 -65843 36944 25148 -12486 2244 15331 -32001 -38797 -1047 -40110 -89759
20880h9759k5044p927L4023P1435J0849J8485K631m5167J7762k0419l2620P566
$$ -89759 -114803 -122730 -88707 -17272 -6423 12062 14693 -30474 -12712 -33131 -65751 -58185
20868e8185j1003L5226R210L3383J4008k8378j0492l028j3187Q35K3108J225O2733
$$ -58185 -69188 -33962 -24752 8631 22639 -5739 -16231 -19259 -32446 -31611 -8503 -7278 55455
20855E5455O838J718k9421k8533M209P722K2238l5195l1663k4840J7484K792P6783
$$ 55455 62293 64011 34590 6057 10266 17988 40226 5031 -26632 -51472 -33988 -31196 45587
20842D5587K0584j7596j5883k8141M3591J3325m1115o5006p6304M5936N8991M4245
$$ 45587 66171 48575 32692 4551 48142 61467 20352 -44654 -120958 -75022 -16031 28214
20830B8214L68l7548k1436o299L0511N374R812N923k0094O7251l6530p272q540
$$ 28214 28582 -8966 -30402 -36701 -6190 -816 8996 14919 -5175 62076 25546 18274 9734
20817I734k505p606l2856j6658l773K9440n123n4331p6999m0701N7414Q1167P3200
$$ 9734 7229 -377 -33233 -49891 -53664 -24224 -29347 -83678 -160677 -201378 -143964 -62797 10403
20804A0403J4989N350o2679l9921J370K4092K0323M9092K443J8426n2628j6055
$$ 10403 25392 30742 -31937 -71858 -70488 -46396 -26073 23019 25462 43888 -8740 -24795
20792b4795n2374J1389K7869j1326J1387j9156L2746r596m3551N1120J2508P36
$$ -24795 -77169 -65780 -37911 -49237 -37850 -57006 -24260 -33856 -77407 -26287 -13779 -13043
20780a3043p448l659M2407l0091k3291k6700K842J2911J7701K7448l7484J033
$$ -13043 -20491 -24150 18257 -11834 -35125 -61825 -58983 -46072 -28371 -923 -38407 -37374
20768c7374o989K1865k2732K3843m4277j3997R2123K709n0133L041M4744J1511
$$ -37374 -44363 -22498 -45230 -21387 -65664 -79661 12462 15171 -34962 -31921 12823 24334
20756B4334l0116k1885l769n7005J7902M9964K2130L7611K6342n3008j0565j2881
$$ 24334 -5782 -27667 -31436 -88441 -70539 -20575 1555 39166 65508 12500 1935 -10946
20744a0946N783M1459J5413k6558K883j9415k4368n2626m867M0354k7129O770
$$ -10946 -5163 36296 51709 25151 28034 8619 -15749 -68375 -73242 -32888 -60017 -53247
20732e3247K6663l2972j7939j9901O5060k792j6666M3158M0784R666k651L2305
$$ -53247 -26584 -59556 -77495 -97396 -32336 -35128 -51794 -8636 32148 41814 39163 71468
20720G1468k5760o8724P650K9829K6227k7959l0527L7878l5873o5915l6858M1190
$$ 71468 45708 -23016 -15366 14463 40690 12731 -17796 20082 -15791 -81706 -118564 -77374
20708g7374K0489j5000P426M512J8045N4789o358l9437n6623l4661Q491N2523
$$ -77374 -56885 -71885 -64459 -59947 -41902 12887 6529 -32908 -89531 -124192 -115701 -63178
20696f3178P3658K7617o835L009J7725J3061j4521p7285J2248M2332P649J5193
$$ -63178 10480 38097 31262 34271 51996 65057 50536 -26749 -14501 27831 35480 50673
20684E0673m7324m6818m4484j0947M1571M8077N3965P768m4757k414l1222r483
$$ 50673 3349 -43469 -87953 -98900 -57329 -9252 44713 52481 7724 5310 -25912 -35395
20672c5395J0874l1456j1547k7099L5782O4419K1032k7880o3372J3448j8902l5808
$$ -35395 -24521 -55977 -67524 -94623 -58841 5578 26610 -1270 -64642 -51194 -70096 -105904
20660a05904j6849j5842N6092J090J739L8989K3717j0156K8371o1019n8834J3882
$$ -105904 -122753 -138595 -82503 -81413 -79674 -40685 -16968 -27124 1247 -59772 -118606 -104724
20648a04724N3960M6467N2186k1541l7758j672K5339O3439k8629k5893J9787k0804
$$ -104724 -50764 -4297 47889 26348 -11410 -13082 12257 75696 47067 21174 40961 20157
20636B0157j1537N1532j4910k5001k396p952l869K3040L6534k9886r084o0976
$$ 20157 8620 60152 45242 20241 17845 9893 6024 29064 65598 35712 26628 -34348
20624c4348l0230K320O3026M8664n5534o8367p477L5798N5993J7275l6362k5243
$$ -34348 -64578 -62258 768 49432 -6102 -74469 -81946 -46148 9845 27120 -9242 -34485
20612c4485J1854l5575k1466L3591J7950o317J8966q701n622m1813m9786P947
$$ -34485 -22631 -58206 -79672 -46081 -28131 -34448 -15482 -24183 -29805 -71618 -121404 -113457
20600a13457L1083L3490p415j3084l1714P497K7471M3920N534K2825O2787J296
$$ -113457 -82374 -48884 -56299 -69383 -101097 -93600 -66129 -22209 -16675 6150 68937 70233
20588G0233J853o6195k1067K6548R416m0976q62J2120K6717k3134l3372j607m1990
$$ 70233 72086 5891 -15176 11372 20788 -20188 -21050 -8930 17787 -5347 -38719 -40326 -82316
20575h2316l9919M127K9398K0159L0752Q851j6267K5094R963J7693k1648j3053
$$ -82316 -122235 -118108 -88710 -68551 -37799 -28948 -45215 -20121 -10158 7535 -14113 -27166
20563b7166k5101N854K9145K582J9009j2247m790j5739m4585L042L2532K2837
$$ -27166 -52267 -46413 -17268 -14686 4323 -7924 -12714 -28453 -73038 -69996 -37464 -14627
20551a4627l429k2872k6906l4413N8028O9610j5222j0629j3117m9204N853J2209
$$ -14627 -18056 -40928 -67834 -102247 -44219 25391 10169 -460 -13577 -62781 -56928 -44719
20539d4719K4200L8240J9506l7408k8708n845k5622J4008p820J2560O0905k1035
$$ -44719 -20519 17721 37227 -181 -28889 -34734 -60356 -46348 -54168 -41608 19297 -1738
20527a738k9887j7444j2547L7838j674k5538K5763j0829m7308L6089j7708k0733
$$ -1738 -31625 -49069 -61616 -23778 -25452 -50990 -25227 -36056 -83364 -47275 -64983 -85716
20515h5716N851J9132K528K8200O5600M397r1279L0464J8016p6238P866M0476
$$ -85716 -79865 -60733 -58205 -30005 35595 39992 -51287 -20823 -2807 -79045 -71179 -30703
20503c0703L5310K0119m3002O0806N4675l1408k7015O1058j776p8125m6306q035
$$ -30703 4607 24726 -18276 42530 97205 65797 38782 99840 98064 19939 -26367 -34402
20491c4402O429j120l7057l2748J1858K4026L7272P1545j4323J061K8729l1204
$$ -34402 -27973 -29093 -66150 -98898 -87040 -63014 -25742 45803 31480 32541 61270 30066
20479C0066k0714k3392n6745r241R907K3008J9813N5110k2629m5788K3457J5463
$$ 30066 9352 -14040 -70785 -80026 -70119 -47111 -27298 27812 5183 -40605 -17148 -1685
20467a685n193N8174k0208J3603L335k7865j1292m4283o0479o783L2305J9843
$$ -1685 -6878 51296 31088 44691 48026 20161 8869 -35414 -95893 -102676 -70371 -50528
20455e0528m4908k3366N8944K1348j1838L205M0835K3026N4225Q416j0961j3826
$$ -50528 -95436 -118802 -59858 -38510 -50348 -47143 -6308 16718 70943 79359 68398 54572
20443E4572m9141n2820j4057K9329j6260N308L3358M0891L9754q593M795o377
$$ 54572 5431 -47389 -61446 -32117 -48377 -43069 -9711 31180 70934 62341 67136 60759
20431F0759j7291k2139j8041q0972m2787K6291K5799R628N6557L8255n2332p697
$$ 60759 43468 21329 3288 -77684 -120471 -94180 -68381 -58753 -2196 36059 -16273 -23970
20419b3970J2360m2417k7722K3568L2630o012n1531K0442N8246n46n124J2755
$$ -23970 -11610 -54027 -81749 -58181 -25551 -31563 -83094 -62652 -4406 -4952 -10076 2679
20407B679k4089j3560l1539M9567O7040K5283j7170m9043J7439L781j1362J0365
$$ 2679 -21410 -34970 -66509 -16942 50098 75381 58211 9168 26607 30388 19026 29391
20395B9391j2954k7997L902k2706L2179L2638l161o451O982L0430J9561n2345
$$ 29391 16437 -11560 -7658 -30364 1815 34453 31292 24841 31823 62253 81814 29469
20383B9469o5230m6292J1774O1923L8694l372K4187K7464J5263q1044n4546k1227
$$ 29469 -35761 -82053 -70279 -8356 30338 26966 51153 78617 93880 12836 -41710 -62937
20371f2937k4970j5065N8811L8696k0892M035k0648J5484J5267L9430R823p884
$$ -62937 -87907 -102972 -44161 -5465 -26357 -22322 -42970 -27486 -12219 27211 37034 29150
20359B9150j2832n6034j062J884K4986M0937L1274m0355n0181r950j4131L4604
$$ 29150 16318 -39716 -40778 -38894 -13908 27029 58303 17948 -32233 -42183 -56314 -21710
20347b1710K2129K5293j9875k7907l6636m969J1238K3369M9213M6546j9124J0395
$$ -21710 419 25712 5837 -22070 -58706 -63675 -52437 -29068 20145 66691 47567 57962
20335E7962K9219J6075k1175m5372l7150m9753k9736m40N3107l527N4397L1697
$$ 57962 87181 103256 82081 36709 -441 -50194 -79930 -80370 -27263 -30790 23607 55304
20323E5304J0633q0050q1932J4212K8137j5302p831j6016M2335O4166K2390k199
$$ 55304 65937 -14113 -96045 -81833 -53696 -68998 -76829 -92845 -50510 13656 36046 33847
20311C3847j9496m678k820j4823K886j4203l6027n9948K361K0882L6787j1591
$$ 33847 14351 9673 6853 -7970 -5084 -19287 -55314 -115262 -112901 -92019 -55232 -66823
20299f6823J6736J2790l666N4986K5334L1242L0600j5852j0081L4495l4655r5413
$$ -66823 -50087 -37297 -40963 14023 39357 70599 101199 85347 75266 109761 75106 -20307
20287b0307j2791Q717l1478k5414j1496L8017L297k4520J3815M089j1436M0081
$$ -20307 -33098 -24381 -55859 -81273 -92769 -54752 -51455 -75975 -62160 -58071 -69507 -29426
20275b9426k054k7131K5912n810L6406K8327k9277K9469m804l7730o866N1997
$$ -29426 -31480 -58611 -32699 -38509 -2103 26224 -3053 26416 21612 -16118 -22984 29013
20263B9013N131k4616j4885L725n429l8490r659M1233q024P26l3555m530N8216
$$ 29013 34144 9528 -5357 -1632 -7061 -45551 -55210 -13977 -22001 -21275 -54830 -59360 -1144
20250a144L8055n3072n9375L3791L5697q491n7024p1052k6702M672L1946L1900
$$ -1144 36911 -16161 -75536 -41745 -6048 -14539 -71563 -142615 -169317 -164645 -132699 -100799
20238a00799L1719M1069L4248M3673M1674l660l8892l6986j6616m079j7415N3415
$$ -100799 -69080 -28011 6237 49910 91584 87924 49032 12046 -4570 -8649 -26064 27351
20226B7351L3778J552j0777l8688k1388j106j7375n435J2913J8965J1783p093
$$ 27351 61129 62681 51904 13216 -8172 -9278 -26653 -32088 -19175 -210 11573 4480
20214D480M936J8275L64o958M332M0707K843k4470J068K5396K2038Q736j7984
$$ 4480 9416 27691 28055 21097 25429 66136 68979 44509 45577 70973 93011 101747 83763
20201H3763m5074j11084n423P4219K7822l4179j8838K9213j1201k8427K611N4292
$$ 83763 38689 -72395 -77818 -3599 24223 -9956 -28794 419 -10782 -39209 -36598 17694
20189A7694K8129l5695o4330m6590l082k7671L4232M3364N8573M4068n532m257
$$ 17694 45823 10128 -54202 -100792 -103874 -131545 -97313 -53949 4624 48692 43160 38903
20177C8903K406j6020M649j3916J8276L0959J9037k3759o6758K920K3913J5257
$$ 38903 41309 25289 29938 16022 34298 65257 84294 60535 -6223 -3303 20610 35867
20165C5867l3384m9414k8459k9500q283L1888M0678K2705n682j8854L9459J3061
$$ 35867 2483 -46931 -75390 -104890 -113173 -81285 -40607 -17902 -23584 -42438 -2979 10082
20153A0082k6988M2958K3869n3029P161P4159j896l7956m845n092L7697N753l7273
$$ 10082 -16906 26052 49921 -3108 4053 78212 76316 38360 33515 28423 66120 71873 34600
20140C4600n605M845P701l5630m9086o043J0199m988M385L2318o030N0587J740
$$ 34600 28995 33840 41541 5911 -43175 -49218 -39019 -44007 -39622 -7304 -13334 37253 38993
20127C8993l3610l4620M0591M1152J0941l7805j0092J784l450j3139j365L1661
$$ 38993 5383 -29237 11354 52506 63447 25642 15550 17334 13884 745 -620 31041
20115C1041j5318o049M6247L0447l5024l4045M4640n1432k7419j2387l2958J899
$$ 31041 15723 9674 55921 86368 51344 17299 61939 10507 -16912 -29299 -62257 -60358
20103f0358j8854K4673P2678J0242O710o718J7066J3407J1239o426k2765m9234
$$ -60358 -79212 -54539 18139 28381 35091 28373 45439 58846 70085 63659 40894 -8340
20091h340l6672k0931L5193K9947L853l8692J6986N8781L3610k0807L0053R018
$$ -8340 -45012 -65943 -30750 -803 3050 -35642 -18656 40125 73735 52928 82981 91999
20079I1999N577J065k9837m1957R919j0100M2719L9237J3840o9076m8666Q498
$$ 91999 97576 98641 68804 26847 36766 26666 69385 108622 122462 53386 4720 13218
20067A3218n484M5779j25J1931j5916o275K3995O3273p457n5164j1632k8584J8562
$$ 13218 7734 53513 53388 65319 49403 43128 67123 130396 122939 67775 56143 27559 46121
20054D6121j2642O751q857J0816m431m0248K2953p829K8912J6568P93j6516r577
$$ 46121 33479 40230 31373 42189 37758 -2490 20463 12634 41546 58114 58907 42391 32814
20041C2814m997j2311M2852N2847k6064m5271m2533l9056K2188l4179P328L0348
$$ 32814 27817 15506 58358 111205 85141 39870 -2663 -41719 -19531 -53710 -46382 -16034
20029a6034M6422M5482P025K5197m230J6673j5699m5186k5917j1090N4417j1108
$$ -16034 30388 75870 82895 108092 103862 120535 104836 59650 33733 22643 77060 65952
20017F5952j8124L6726J0276l2250m0690J5497K1238m9716j1544q296k2114k030
$$ 65952 47828 84554 94830 62580 21890 37387 58625 8909 -2635 -10931 -33045 -35075
20005c5075J8123k164L022K3141j8645K570m1761j1969L1730J5672M5316P048
$$ -35075 -16952 -19116 -16094 7047 -11598 -9028 -50789 -62758 -31028 -15356 29960 37008
19993C7008K3253n146l156N3820R788l693l3924j3732k9994K7485M4941n365l1999
$$ 37008 60261 55115 51959 105779 115567 111874 77950 64218 34224 61709 106650 101285 69286
19980F9286p7555k8385k9248K2853J3857K5614r071M432n2599K5027O9114l0111
$$ 69286 -8269 -36654 -65902 -43049 -29192 -3578 -12649 -8217 -60816 -35789 33325 3214
19968C214m0147N3284m5064N5485K6783q741l1543l674O0094m548o8922O9653
$$ 3214 -36933 16351 -28713 26772 53555 44814 13271 9597 69691 65143 -3779 65874
19956F5874M7071q246o2950m2594J9559O1647j5326r462l9557n3011K1008L5448
$$ 65874 112945 104699 41749 -845 18714 80361 65035 55573 16016 -36995 -15987 19461
19944A9461J6369j919l2407K0570K3553L1620K7480K5954J9844m0405o6712l9787
$$ 19461 35830 33911 1504 22074 45627 77247 104727 130681 150525 110120 43408 3621
19932C621j8680p4517k4102K1587J5075P861Q0472n193J3626J9585m0197j6554
$$ 3621 -15059 -89576 -113678 -92091 -77016 -69155 11317 6124 19750 39335 -862 -17416
19920a7416K6832J7619K5169J6264L3232m794n4404k7069J9673j2189l0791K7136
$$ -17416 9416 27035 52204 68468 101700 96906 42502 15433 35106 22917 -7874 19262
19908A9262O7420r579L872Q479J2608R9J9651K3956j0693r9706k1229N1294M4067
$$ 19262 86682 77103 80975 89454 102062 102161 121812 145768 135075 35369 14140 65434 109501
19895A09501L390j3372k2238m9874j8595J8062m7411n5714O3947O395k2813J0371
$$ 109501 112891 99519 77281 27407 8812 26874 -20537 -76251 -12304 -5909 -28722 -18351
19883a8351K8689J9108L3857n642p1499o7786o0692L8572Q5429Q6759m094n8515
$$ -18351 10338 29446 63303 57661 -13838 -81624 -142316 -103744 -18315 68444 64350 5835
19871E835l7769k4164M1537J3207K2713p955N813j7181K9732m159r742j5583k8332
$$ 5835 -31934 -56098 -14561 -1354 21359 13404 19217 2036 31768 27609 17867 2284 -26048
19858b6048P751O2249O192M604p308l2747l6117J414r047L1951Q494K0812k2207
$$ -26048 -18297 43952 50144 54748 47440 14693 -21424 -20010 -29057 2894 11388 32200 9993
19845I993j8257j6921l1596Q058m5298o300j4238K1286L6531J0134Q4925M5445
$$ 9993 -8264 -25185 -56781 -48723 -94021 -100321 -114559 -93273 -56742 -46608 38317 83762
19833H3762k279J5247l042m0882o487J4056q575K134l137m3252O96M3663L0431
$$ 83762 81483 96730 93688 52806 46319 60375 51800 53934 50797 7545 8241 51904 82335
19820H2335j8322j6352K1872r644O843k8359n063P4263m4010k9321j4917o844
$$ 82335 64013 47661 69533 59889 66732 38373 33310 107573 63563 34242 19325 12481
19808A2481K5780o477j3475n1571P913J4615L0362N6585o287k4109K1423j0824
$$ 12481 38261 31784 18309 -33262 -25349 -10734 19628 76213 69926 45817 67240 56416
19796E6416l64l3655j8168o11j7194K9175L8387J1843m5903j422j5860M1587L5503
$$ 56416 56052 22397 4229 3618 -13576 15599 53986 65829 19926 18504 2644 44231 79734
19783G9734j1666k0342k6839k0225j783p227O468j1111K6741N4824r22Q512J8947
$$ 79734 68068 47726 20887 662 -1121 -8348 -1880 -12991 13750 68574 67652 76164 95111
19770I5111j8998m0591N3838M3371J4026j395J338k5265m3378k357K0484P2795
$$ 95111 76113 35522 89360 132731 146757 145362 146700 121435 78057 75700 96184 168979
19758A68979N1935L4932Q0535L9140N7188P9362Q4239J23469J35149J08718n2204
$$ 168979 220914 255846 336381 375521 432709 512071 596310 719779 854928 963646 911442
19747I11442j95797k05646j18354q2702j35346l3406J3743k3688l3680k9873L5615
$$ 911442 715645 509999 391645 308943 173597 140191 153934 130246 96566 66693 102308
19736A02308P570R997R541J1287k1532m1633N794K8501K0498K4435L4167K3487
$$ 102308 109878 119875 129416 140703 119171 77538 83332 111833 132331 156766 190933 214420
19724B14420k230M7176N0314Q9153P8628O9910J27477J48568N9554O2226n0613
$$ 214420 212190 259366 309680 398833 477461 547371 674848 823416 882970 945196 894583
19713H94583j11303j94897j73479j06736j12817k8495J8151l4129j5280j7157
$$ 894583 783280 588383 414904 308168 195351 166856 185007 150878 135598 118441
19703A18441N965l2582J759k0192p957j2785K634o0677n0000O5108P9481P45l9598
$$ 118441 124406 91824 93583 73391 65434 52649 55283 -5394 -55394 9714 89195 89940 50342
19690E0342j1296k6862k4441L3359M133Q460L8240N2116l7531p765o123r264J8289
$$ 50342 39046 12184 -12257 21102 25235 33695 71935 124051 86520 78755 72632 63368 81657
19677H1657k5552p8262k1404L4878N3694P281M1209J6107L1436K138o7629k4337
$$ 81657 56105 -22157 -43561 -8683 45011 52292 93501 109608 141044 143182 75553 51216
19665E1216M1840q532l7483P110k0582k3633L5006J8572j6057K1612L090O400
$$ 51216 93056 84524 47041 54151 33569 9936 44942 63514 47457 69069 72159 78559
19653G8559j5860m0944K119j1116j3061k2146J6718L4760M763J8424J6695J3654
$$ 78559 62699 21755 23874 12758 -303 -22449 -5731 29029 33792 52216 68911 82565
19641H2565p2927K4557q208J7223L1529j4932l0299p759l4129o3999l2772L9345
$$ 82565 9638 34195 25987 43210 74739 59807 29508 21749 -12380 -76379 -109151 -69806
19629f9806O0129Q4176L2849l0199P006M8271l9178j5386m6401o0831J2969L2770
$$ -69806 -9677 74499 107348 77149 84155 132426 93248 77862 31461 -29370 -16401 16369
19617A6369Q898K2562j2182L1342K0548K288n0393l8417n005K7747O4398L107
$$ 16369 25267 47829 35647 66989 87537 89825 39432 1015 -3990 23757 88155 91262
19605I1262j909J2218M3663n6986o1573l4042j3528m339J6345n726K056J563J3976
$$ 91262 89353 101571 145234 88248 26675 -7367 -20895 -25234 -8889 -14615 -12559 -10996 2980
19592B980K6420K8564M1383l9768m8498j868J6849L3502Q328r485K0261J6911
$$ 2980 29400 57964 99347 59579 11081 9213 26062 59564 67892 58407 78668 95579
19580I5579j9567P218M413k2224l9569O149M8638j678j6123P484k7180k423q283
$$ 95579 76012 83230 87643 65419 25850 31999 80637 78959 62836 70320 43140 40717 32434
19567C2434P537R830k9355L0694J1274j8098L5675l6100k76k5815M6825M3195
$$ 32434 39971 49801 20446 51140 62414 44316 79991 43891 43615 17800 64625 107820
19555A07820J3624j5375O250l9660L0546L1329j8831k2386l1010O2556j1938l2548
$$ 107820 121444 106069 112319 72659 103205 134534 115703 93317 62307 124863 112925 80377
19543H0377K9306j8139n2996K729K5650L5769K4200M8393l3341q9632j6498K8934
$$ 80377 109683 91544 38548 41277 66927 102696 126896 175289 141948 52316 35818 64752
19531F4752J6281L4932j8554k6598J0891J7500K6293k1928n041K4989M7480k5576
$$ 64752 81033 115965 97411 70813 81704 99204 125497 103569 98528 123517 170997 145421
19519A45421l2000j4471k2941o903M8132r97J1971o7989k4715N9125K6977o2198
$$ 145421 113421 98950 76009 69106 117238 116241 128212 60223 35508 94633 121610 59412
19507E9412r0125n124J0356l7173q824L5498L5121J1332N749k7566N7293J3342
$$ 59412 -30713 -35837 -25481 -62654 -71478 -35980 -859 10473 16222 -11344 45949 59291
19495E9291n8402P958M0431l826J3849L1385k3639k61n823l1716j295l2500K5471
$$ 59291 889 8847 49278 45452 59301 90686 67047 66786 60963 29247 27952 -4548 20923
19482B0923K6509J6848K7055N02L5097j254K2547l970o203l0438m6722N109M1834
$$ 20923 47432 64280 91335 91837 126934 125680 148227 144257 138054 107616 60894 66003 107837
19469A07837m154q507N016O4450N3668p936m839p176R942o6146n492j0510r835
$$ 107837 103683 95176 100192 164642 218310 210374 205535 198359 208301 142155 136663 126153 116318
19456A16318K0645k6711M6393P5281M966k6722p0255k2415l0597j2754M758L4039
$$ 116318 136963 110252 156645 231926 236892 210170 139915 117500 86903 74149 78907 112946
19444A12946k4548M918K0386K1663j9185m250L1482m4609O852L0364l1520l7953
$$ 112946 88398 93316 113702 135365 116180 111930 143412 98803 105655 136019 104499 66546
19432F6546k0979j114P579R149L0257P6230Q702k3159q081j5006J4356p418J6402
$$ 66546 45567 44453 52032 61181 91438 167668 176370 153211 145130 130124 144480 137062 153464
19419A53464L2918K955O349p744L5090L3967m8616m0220o859o885J1874O466o196
$$ 153464 186382 189337 195686 187942 223032 256999 208383 168163 161304 154419 166293 172759 166563
19406A66563M1006K0808L6713l5072j4738o3945j008k644m899K1283M2464Q106
$$ 166563 207569 228377 265090 230018 215280 151335 150327 147683 142784 164067 206531 214637
19394B14637l5001K5660p622k3792k2158l1207m0543L947M0538M3279K0901J8684
$$ 214637 179636 205296 197674 173882 151724 120517 79974 83921 124459 167738 188639 207323
19382B07323p8099J1249O3875k6523o150K5230k1799q242K1280m9886k569N0733
$$ 207323 129224 140473 204348 177825 171675 196905 175106 166864 188144 138258 135689 186422
19370A86422M1209L8464l4486l1654k754K3731m3069L5571P9039j3393J6393N3812
$$ 186422 227631 266095 231609 199955 197201 220932 177863 213434 292473 279080 295473 349285
19358C49285L9677K3797q7220l6081J8235N4370P2099L4042k8994j22109r6298
$$ 349285 388962 412759 325539 289458 307693 362063 434162 468204 439210 317101 220803
19347B20803l6595L65K1184J6022J6177P171j6052l8850k9698k6682K1325l8967
$$ 220803 184208 184573 205757 221779 237956 245127 229075 190225 160527 133845 155170 116203
19335A16203L7444Q5208J8005n0035l9206J4313P4908K8906m6583K6631K9719
$$ 116203 153647 238855 256860 206825 167619 181932 256840 285746 239163 265794 295513
19324B95513j1711M855j5424M3850J25671Q0738L128q5488p2116r0067k8269p1271
$$ 295513 283802 288657 273233 317083 442754 523492 526620 441132 369016 278949 250680 179409
19312A79409j8490K2319o104N683K7245n4981k9654J6867j7060j691N5092M067
$$ 179409 160919 183238 177134 182817 210062 155081 125427 142294 125234 123543 178635 182702
19300A82702l4474o3677K3756K9887j4542m949M016O9414O8759M0408J6551K8757
$$ 182702 148228 84551 108307 138194 123652 118703 122719 192133 260892 301300 317851 346608
19288C46608J8161P0728N508J5470k7768q3004r9230n9681P9115Q6978L0242N5315
$$ 346608 364769 435497 441005 456475 428707 345703 246473 186792 265907 352885 383127 438442
19276D38442J41512L1846q5549k05073j75255p0143n1218J24384K00181K37723
$$ 438442 579954 611800 526251 321178 145923 75780 24562 148946 349127 586850
19266E86850K31084K78619L78610M93466O45563R35234Q19295m42400j224444
$$ 586850 817934 1096553 1475163 1968629 2614192 3549426 4368721 3926321 2701877
19257B701877r43857m76825k08992r8815n7839n8074q010l9887p6980j77619j28842
$$ 2701877 1758020 1281195 1072203 973388 915549 857475 849465 809578 732598 554979 426137
19246D26137N8472R4270J07112Q5743O3284k1806j86249k33696k31770j9602J05959
$$ 426137 484609 578879 685991 771734 835018 813212 626963 393267 161497 141895 247854
19235B47854J72116J38728K29273K61829K84665M23986O53844P76928J044197
$$ 247854 419970 558698 787971 1049800 1334465 1758451 2412295 3189223 4233420
19226D233420P39051p00372j386422r84886n37724k41481r7225q5713p7668k5627
$$ 4233420 4972471 4272099 2885677 1900791 1363067 1121586 1024361 938648 860980 835353
19216H35353n3591p13J1369j9596l3206J3438J9565N2266R443q077l1796P0427
$$ 835353 781762 781049 792418 772822 739616 753054 772619 824885 834328 826251 794455 864882
19204H64882Q3292j9667K1898P5612N2730O8094K7902K9194K6050J4845N4362
$$ 864882 948174 928507 950405 1026017 1078747 1146841 1174743 1203937 1229987 1244832 1299194
19193A299194L8420Q3067J61845J46616J54775J99421K71912L75697K74348j52194
$$ 1299194 1337614 1420681 1582526 1729142 1883917 2083338 2355250 2730947 3005295 2853101
19183B853101l23875l28313r0640J15459R9135J08064J70725J22219J45281K57209
$$ 2853101 2529226 2200913 2110273 2225732 2324867 2432931 2603656 2725875 2871156 3128365
19173C128365K78706L38737M50858M28239N29762O42069Q44185J099231J212447
$$ 3128365 3407071 3745808 4196666 4624905 5154667 5796736 6640921 7740152 8952599
19164H952599J022672Q48271J096364J668196K550344L772841N739599Q940856
$$ 8952599 9975271 10823542 11919906 13588102 16138446 19911287 25650886 34591742
19156C4591742J3737513K0143614K8508754L9187775N3964524N8852361k74728
$$ 34591742 48329255 68472869 96981623 136169398 190133922 248986283 248711555
19149B48711555o9894370o9180794m0778108k1749415j2247967p850017n407064
$$ 248711555 178817185 109636391 68858283 47108868 34860901 27010884 21603820
19142B1603820l717504k456418j577139j020763m81464n9509J27850o9971j72263
$$ 21603820 17886316 15429898 13852759 12831996 12350532 12291023 12418873 12348902 12176639
19133A2176639L1052M21104P16270N60507M77682P99576J575273K611057M146390
$$ 12176639 12207691 12628795 13345065 13905572 14383254 15182830 16758103 19369160 23515550
19124B3515550O503239J0084399J5463360K2651882L1811869M3432891N9399272
$$ 23515550 30018789 40103188 55566548 78218430 110030299 153463190 212862462
19117B12862462N7633391j4571344p9299265o9707833l9813493k1351637j2238801
$$ 212862462 270495853 255924509 176625244 106917411 67103918 45752281 33513480
19110C3513480p980774n568519l821426k636719j850596j321482r39697n64807
$$ 33513480 25532706 19964187 16142761 13506042 11655446 10333964 9394267 8829460
19102H829460n15584r17609j127457r68010p41623n74569m31628l00422k85586
$$ 8829460 8313876 7396267 6268810 5300800 4559177 3984608 3552980 3252558 2966972
19093B966972k11556j33886j83557k10024n4247J9131r272K5309R8450J77259
$$ 2966972 2755416 2621530 2437973 2227949 2173702 2192833 2183561 2208870 2307320 2484579
19083B484579K31985j8072m38100n19905l49142k51477j23635r6007m8475q718
$$ 2484579 2716564 2698492 2260392 1740487 1391345 1139868 1016233 920226 871751 863033
19073H63033m9467o5249m0287m9246p005k8417l5605l4660o2372k829L2161J26
$$ 863033 813566 748317 708030 658784 651779 623362 587757 553097 490725 487896 520057 520183
19061E20183k6186k8442M7504K9265P134l3750K930m721j1212l4277K2195k4172
$$ 520183 493997 465555 513059 542324 549458 515708 518638 513917 502705 468428 490623 466451
19049D66451k1840p9059n6545N485P632Q621j1168P532J7370m471o5800N323Q9544
$$ 466451 444611 365552 309007 314492 322124 330745 319577 327109 344479 340008 274208 279531 369075
19036C69075O1556K3566j6974M6371M696P7089R471r6019j05275j79326j64178
$$ 369075 430631 454197 437223 483594 488290 565379 574850 478831 373556 194230 30052
19025C0052J0353P0807J34527M3876N6506L2710k3966j70312j05208l5671O709
$$ 30052 40405 111212 245739 289615 346121 378831 354865 184553 79345 43674 50383
19014E0383L7992O4604M5132N7164k419m7833K033M7922L0117M9783L4225J5324
$$ 50383 88375 152979 198111 255275 252856 205023 207056 254978 285095 334878 369103 384427
19002C84427k941j0902J2824L1446M7787P9237K4980l6618j35140k96586j33834
$$ 384427 381486 370584 383408 414854 462641 541878 566858 530240 395100 98514 -35320
18991c5320j6265M6381J10006M0313J32820R9944r3688j73087o0513m0553k3131
$$ -35320 -51585 -5204 104802 145115 277935 377879 284191 111104 50591 10038 -13093
18980a3093M401M2958M8509M8436k7597m2941j3542O9520J0654l7193J7670L6854
$$ -13093 -8692 34266 82775 131211 103614 60673 47131 116651 127305 90112 107782 144636
18968A44636K2135m4563K9515O3447k1733o21L841m2881o6795o1538J0169K0579
$$ 144636 166771 122208 151723 215170 193437 192816 196657 153776 86981 25443 35612 56191
18956E6191j9422L1863L5274p009j9961k5677L9917m457j9916J7810o2677l5793
$$ 56191 36769 68632 103906 96897 76936 51259 91176 86719 66803 84613 21936 -13857
18944a3857K2413M8040K6065O094J7687m5257N1427r234n4220j7533m7941j3711
$$ -13857 8556 56596 82661 88755 106442 61185 112612 103378 49158 31625 -16316 -30027
18932c0027P189N669L4128Q4705J4613q3054o7982l427M9758m9340L1124J14146
$$ -30027 -22838 -17169 16959 101664 116277 33223 -34759 -38186 11572 -37768 -6644 107502
18920A07502M420n3148n4046M0127M6603q10m5109M915n2944k4388l5857k0455
$$ 107502 111922 58774 4728 44855 91458 90648 45539 50454 -2490 -26878 -62735 -83190
18908h3190L2923j5907k873K6027R3579j8298m9288n4987J8794R3898L9297K5274
$$ -83190 -50267 -66174 -69047 -43020 50559 32261 -17027 -72014 -53220 40678 79975 105249
18896A05249k4502l7502P81l754j5113K9856l927k8188l5874m21L9109j2881j0831
$$ 105249 80747 43245 44026 40272 25159 55015 51088 22900 -12974 -13395 25714 12833 2002
18883B002J5169J9672k7809J538M5697L161Q799M3403k9749j6569j2733l4586
$$ 2002 17171 36843 9034 10572 56269 59430 68229 111632 81883 65314 52581 17995
18871A7995J9916M9733L1211n2027l6736j6355o787L2794N9341K9498k1944q1288
$$ 17995 37911 87644 118855 66828 30092 13737 6950 39744 99085 128583 106639 25351
18859B5351l6747K2695j2211M2594L4874k6946n7029K6838n77j8543J9415m0890
$$ 25351 -11396 11299 -912 41682 76556 49610 -7419 19419 18842 299 19714 -21176
18847b1176K2365N5896P594K6537j8001K170N063m2440k3686l020R971K1617L2458
$$ -21176 1189 57085 64679 91216 73215 75385 80448 38008 14322 11302 21273 42890 75348
18834G5348r16l9087l1207K3493M3653r228j4894m2542M7892j1603J4211j1375
$$ 75348 74432 35345 4138 27631 71284 62056 47162 4620 52512 40909 55120 43745
18822D3745J6323K7712n5994l556O0716m2388k2489n2842p3738J9962O7979J3002
$$ 43745 60068 87780 31786 28230 88946 46558 24069 -28773 -102511 -82549 -14570 -1568
18810a568l7636K4845R1727L768q5520m5607j7626j9854M5037M6895k9458J7043
$$ -1568 -39204 -14359 77368 81136 -4384 -49991 -67617 -87471 -42434 4461 -24997 -7954
18798g954k4240L449M2815J3973j0248l5727j0907J1107R940l5263m6318M5468
$$ -7954 -32194 -28745 14070 28043 17795 -17932 -28839 -17732 -7792 -43055 -89373 -43905
18786d3905R1884K8094j3626j1099J154R730j6505M945K2104J3080l9074l9102
$$ -43905 47979 76073 62447 51348 52502 62232 45727 50672 72776 85856 46782 7680
18774G680L4288O5926J8247l3458Q14m0720k0752m0626J8565O1095k1808n0923
$$ 7680 41968 107894 126141 92683 93497 52777 32025 -8601 9964 71059 49251 -1672
18762a672k6923o728J1208L2565K9337j5255J2565K7302K0318j7806p2540n530
$$ -1672 -28595 -35323 -24115 8450 37787 22532 35097 62399 82717 64911 -7629 -13159
18750a3159J603M5323L7817J5381L6293o670J8355l6159n169l884n0383k3435
$$ -13159 -11556 33767 71584 86965 123258 116588 134943 98784 93615 89731 39348 15913
18738A5913K4342k1820n3178j1390O7887M9053K0913K9521l5796k8591n9299r146
$$ 15913 40255 18435 -34743 -46133 21754 70807 91720 121241 85445 56854 -2445 -11591
18726a1591M9993L5824j255J6045L2207J9665J3667j0247R9470j4363j6935j3354
$$ -11591 38402 74226 72971 89016 121223 140888 154555 144308 243778 229415 212480 199126
18714A99126M7225j2765m0445n425J0710p3992k9923M692K0756j7412k5156J5436
$$ 199126 246351 233586 193141 187716 198426 124434 94511 99203 119959 102547 77391 92827
18702I2827P3324L0298k1014k4891n1495l5998j0069k4788j3525O235N6647N4760
$$ 92827 166151 196449 175435 150544 99049 63051 52982 28194 14669 20904 77551 132311
18690A32311K0244m8996k8207m2379R1596O8605P370n158k1867J5025M6733O0487
$$ 132311 152555 103559 75352 32973 124569 193174 200544 195386 173519 188544 235277 295764
18678B95764P5736M6962P3627J22766Q6962J12099J34802J48498K2255j10163
$$ 295764 371500 418462 492089 614855 701817 813916 948718 1097216 1119471 1009308
18668A009308j18074j32923j22538j09240j07346m8083M0718M7952L0599k7042
$$ 1009308 891234 758311 635773 526533 419187 371104 411822 459774 490373 463331
18658D63331q9258k9345K0065k5614j7462K6940k7574j5504k8537j9243L170M3064
$$ 463331 374073 344728 364793 339179 321717 348657 321083 305579 277042 257799 260969 304033
18646C04033P92n5804N5791Q6057P7053O4150N5845J15311J11960M9058n1410
$$ 304033 304825 249021 304812 390869 467922 532072 587917 703228 815188 864246 812836
18635H12836j17048j34956r0159o3017q0658p8256p5945L352l0458L83L2159k5070
$$ 812836 695788 560832 470673 407656 326998 248742 172797 176149 145691 146074 178233 153163
18623A53163Q351j9442l1623j2990o9818l9646k9810J8545O2348O6929K3710k3325
$$ 153163 161514 142072 110449 97459 27641 -12005 -41815 -23270 39078 106007 129717 106392
18611A06392P200k2131j537m986m658j1572m5865K0728Q235k4609J5555o159l0422
$$ 106392 113592 91461 89924 84938 80280 68708 22843 43571 51806 27197 42752 36593 6171
18598F171L0470L0340M9624K1442k5462K3998p856l3512k5227J2856K4164J6556
$$ 6171 36641 66981 116605 138047 112585 136583 128727 95215 69988 82844 107008 123564
18586A23564J1488r076k0360M189M3315K6066M4161O372m369k1990O1490L0917
$$ 123564 135052 125976 105616 109805 153120 179186 223347 229719 225350 203360 264850 295767
18574B95767p5967n1171L7212K3557K3977L1520K131j8070j6524J5018M388j308
$$ 295767 219800 168629 205841 229398 253375 284895 287026 268956 252432 267450 271838 270530
18562B70530N1482N7623L9357N9331O8929L6382Q3476J08994L6369N7254O1666
$$ 270530 322012 379635 418992 478323 547252 583634 667110 776104 812473 869727 931393
18551I31393N3519K450N570O5870K10376J73055J79552J61634J13154J17903K02898
$$ 931393 984912 987362 992932 1058802 1269178 1442233 1621785 1783419 1896573 2014476 2217374
18540B217374J64169o7477l26951m25509l35102j75947j08378m4827M7149Q9546
$$ 2217374 2381543 2314066 1987115 1561606 1226504 1050557 942179 897352 944501 1034047
18530A034047J38453J81887J73229J51779Q5485m2335j54165k67315k34313m3214
$$ 1034047 1172500 1354387 1527616 1679395 1764880 1722545 1568380 1301065 1066752 1023538
18520A023538K2093K7826O2883k881R7384J75647J32899K06122J01925o8828k77182
$$ 1023538 1045631 1073457 1136340 1133459 1230843 1406490 1539389 1745511 1847436 1778608 1501426
18509A501426l32944k71308j75374j21783r1716l7833n3131j0436q2859q8557
$$ 1501426 1168482 897174 721800 600017 508301 470468 417337 406901 324042 235485
18499B35485n9041p5314M4334K7375L4974L3352k4820J4527M916J2446k1328j3857
$$ 235485 176444 101130 145464 172839 207813 241165 216345 230872 235788 248234 226906 213049
18487B13049J0555K374k2697K5233M415m5058J6054J8590M4573J6354k4933m2405
$$ 213049 223604 225978 203281 228514 232929 187871 203925 222515 267088 283442 258509 216104
18475B16104J3553k0550K283n1557k1959L2562n619J3364m2499k7274q751K6102
$$ 216104 229657 209107 211390 159833 137874 170436 164817 178181 135682 108408 99657 125759
18463A25759Q424k1872j9442K1187L2095k9232l2359l399K5229K7129L6583L6623
$$ 125759 134183 112311 92869 114056 146151 116919 84560 81161 106390 133519 170102 206725
18451B06725M9462j9657k9322P973Q737L8913M605j5299k0624m5094m366k1199
$$ 206725 256187 236530 207208 215181 223918 262831 267436 252137 231513 186419 182053 160854
18439A60854k5156J7243K1849j838R991K7268l0370k6165J7399O1371j306n5723
$$ 160854 135698 152941 174790 172952 182943 210211 179841 153676 171075 232446 231140 175417
18427A75417k3995j4603n050P013k4451M5111L3267P233j3786j8697O0992r495
$$ 175417 151422 136819 131769 138782 114331 159442 192709 199942 186156 167459 228451 218956
18415B18956J5334J1309m7211L5178M7661p5471n8174j8827l6393R405M0301j3438
$$ 218956 234290 245599 198388 233566 281227 205756 147582 128755 92362 101767 142068 128630
18403A28630o503K3849M0806Q6317m257r625K8229k1325k4326l9653m1533K2299
$$ 128630 122127 145976 186782 273099 268842 259217 287446 266121 241795 202142 160609 182908
18391A82908K0707L0944j1035j2441j1101N8047J7429j0707M048j3120j3938P582
$$ 182908 203615 234559 223524 211083 199982 258029 275458 264751 268799 255679 241741 249323
18379B49323M8058J9872q1117o1384j1288K3360K8868j756R673K8812O422L1378
$$ 249323 297381 317253 236136 174752 163464 186824 215692 213936 223609 252421 258843 290221
18367B90221L8864k668q8711j9143K3105J7188J5011n1456K8687P0469K5163m4052
$$ 290221 329085 326417 237706 218563 241668 258856 273867 222411 251098 321567 346730 302678
18355C02678p9895k3908n402L2939M2540L4200k13n3341J177P271J9254L7179
$$ 302678 222783 198875 193473 226412 268952 303152 302939 249598 250775 258046 277300 314479
18343C14479r415l3934j0000R976L0819n897O503l7760K4325j2200n7049K1773
$$ 314479 305064 271130 261130 271106 301925 296028 302531 264771 289096 276896 219847 241620
18331B41620J0814M3143M2453L4800k8003q5573n0832l8230N2115L8116j0576
$$ 241620 252434 295577 338030 372830 344827 259254 208422 170192 222307 260423 249847
18320B49847J4654m3991n61J9485k6727m110Q632L0547R8745J6941k6412M433
$$ 249847 264501 220510 219949 239434 212707 208597 217229 247776 346521 363462 337050 341483
18308C41483K657m9716k5049L1330M8960M2399L3377J3871R3749K0038K4362o5264
$$ 341483 344140 294424 269375 300705 349665 392064 425441 439312 533061 553099 577461 512197
18296E12197m5082p7307l7342K2890k9602m8393k5516l211K0239J0735L5845J7399
$$ 512197 467115 389808 352466 375356 345754 297361 271845 268634 288873 299608 335453 352852
18284C52852k40L384r6530r1934m1797L4764L1453O124L942L8965P0677k7778
$$ 352852 352612 355996 259466 167532 125735 160499 191952 198076 202018 240983 311660 283882
18272B83882k7562N4006O1897L3482P0980J27914J09795J66108J11695p5751j41633
$$ 283882 256320 310326 372223 405705 476685 604599 714394 880502 992197 916446 774813
18261G74813j29082j09241j85957p7791N1275J01670P2357J32765O3225n4178
$$ 774813 645731 536490 350533 272742 324017 425687 498044 630809 694034 639856
18251F39856j86240k33560j76570j06348K8583J12302J20524R8212N2288L2299
$$ 639856 453616 220056 43486 -62862 -34279 78023 198547 296759 349047 381346
18241C81346M027N827j07J1139J1755l7049K851P2265Q9716O9329O7487L6136
$$ 381346 385373 391200 391093 402232 413987 376938 379789 452054 541770 611099 678586 714722
18229G14722N2406j0551n2986o0549j49631k2953J29603J19963N7918Q2359Q9981
$$ 714722 767128 756577 703591 643042 493411 470458 600061 720024 777942 860301 950282
18218I50282j9313j81959k73252j19604J3888N1342Q8486J29059Q0413K5117J2795
$$ 950282 930969 749010 475758 356154 370042 421384 509870 638929 719342 744459 757254
18207G57254J7132K0352M514N8341J32964J69153J44084J29966K81725L82736
$$ 757254 774386 794738 799252 857593 990557 1159710 1303794 1433760 1715485 2098221
18197B098221N14340P15563R81717R57928k34164j268307j109961o11914l56392
$$ 2098221 2612561 3328124 4309841 5267769 5033605 3765298 2655337 2043423 1687031
18188A687031j91990n1210m8635m4019p80K623k1558q21M2698M283k863N3227
$$ 1687031 1495041 1443831 1395196 1351177 1350397 1353020 1331462 1330641 1373339 1377622 1374759 1427986
18176A427986J21857M6477O3687J7995L6138J28716J07842M8945R8582J31994
$$ 1427986 1549843 1596320 1660007 1678002 1714140 1842856 1950698 1999643 2098225 2230219
18166B230219J59869L08253M57995O38962Q17624J090149Q05116m40071j169312
$$ 2230219 2390088 2698341 3156336 3795298 4612922 5703071 6508187 6068116 4898804
18157D898804q08469k84213m4993N1280L05154M75089N08829N47422K34218l3982
$$ 4898804 4090335 3806122 3761129 3812409 4117563 4592652 5101481 5648903 5883121 5849139
18147E849139J23900M03329O16633O69414P20621P91517J044361J375342J894695
$$ 5849139 5973039 6376368 6993001 7662415 8383036 9174553 10218914 11594256 13488951
18138A3488951K525426L590424M999351O907697J0383225J6296912K4452032L4087750
$$ 13488951 16014377 19604801 24604152 31511849 41895074 58191986 82644018 116731768
18130A16731768M5520781N9930454M9960855k2706536p6953948o5279774l7816493
$$ 116731768 162252549 222183003 272143858 249437322 172483374 107203600 69387107
18123F9387107k1041269j2462077p743958m954184l154357j979622j461139j358628
$$ 69387107 48345838 35883761 28139803 23185619 20031262 18051640 16590501 15231873
18115A5231873j394140j134532o69770k18078K11769M30532O00828O83529O93679
$$ 15231873 13837733 12703201 12033431 11815353 12027122 12457654 13058482 13742011 14435690
18106A4435690R97156J356220J794548K797908M350042O484610J0194223J6169531
$$ 14435690 15432846 16789066 18583614 21381522 25731564 32216174 42410397 58579928
18098E8579928K4078759L3338309M4731613N8095546L9932326l4025599p4808716
$$ 58579928 82658687 115996996 160728609 218824155 258756481 224730882 149922166
18091A49922166n7296665l2375088j8177492j0915026o984613m648057l204680
$$ 149922166 92625501 60250413 42072921 31157895 24173282 19525225 16320545
18084A6320545k301111j862967j700282j379972r49364o99149n25895m41816l51536
$$ 16320545 14019434 12156467 10456185 9076213 8126849 7427700 6901805 6459989 6108453
18075F108453k92693k29242k36541j20986l97486o65046n70858l52959j09069
$$ 6108453 5815760 5586518 5349977 5228991 4831505 4166459 3595601 3242642 3133573
18066C133573o6936q6698k03269k70257l03451l20093k03318j54966q0966j05419
$$ 3133573 3066637 2979939 2776670 2506413 2202962 1882869 1679551 1524585 1443619 1338200
18056A338200j22360M9336J57963M8478K6504J8468K8507j02770k18340j34442
$$ 1338200 1215840 1265176 1423139 1471617 1498121 1516589 1545096 1442326 1223986 1089544
18046A089544j16870q2049J15988J39640N1146L325j2558J0061N0309M3982M0752
$$ 1089544 972674 890625 1006613 1146253 1197399 1200724 1188166 1198227 1248536 1292518 1333270
18035A333270O8627N6018j2635k4654k2494J4402J3270J1709p1837r6403K1027
$$ 1333270 1401897 1457915 1445280 1420626 1398132 1412534 1425804 1437513 1365676 1269273 1290300
18024A290300O4464j95n0713J5840M9852p459o978M7862R4423J02640N9480P6305
$$ 1290300 1354764 1354569 1303856 1319696 1369548 1362089 1355111 1402973 1497396 1600036 1659516 1735821
18012A735821P2265R3342J19547J61200R6361l4030q7004j39710j64202r0348
$$ 1735821 1808086 1901428 2020975 2182175 2278536 2244506 2157502 2017792 1853590 1763242
18002A763242P7988J28662K51761J88943J75468R5239n928K4210o921R7479R9829
$$ 1763242 1841230 1969892 2221653 2410596 2586064 2681303 2675375 2699585 2692664 2790143 2889972
17991B889972J66828K26711J70314J30718J32750K36406K41218L46102N10479
$$ 2889972 3056800 3283511 3453825 3584543 3717293 3953699 4194917 4541019 5051498
17982E051498O47722P40410Q33660R37375Q02185N06955N04240L39924j3812j50424
$$ 5051498 5699220 6439630 7273290 8210665 9012850 9519805 10024045 10363969 10350157 10199733
17972A0199733R9979M54609Q58318J392611J988024K538288K965923L348128L705214
$$ 10199733 10299712 10754321 11612639 13005250 14993274 17531562 20497485 23845613 27550827
17963B7550827L503674L008558M386156P965002J3273341K0459281K9173186L9597606
$$ 27550827 31054501 34063059 38449215 46414217 59687558 80146839 109320025 148917631
17955A48917631N2607148N6214128J1416226m7927733n5220233l3113018j8348737
$$ 148917631 201524779 257738907 269155133 221227400 166007167 132894149 114545412
17948A14545412j1159066k840619P969092K0583865L5047191N1846423O9670406
$$ 114545412 103386346 100545727 108514819 129098684 164145875 215992298 285662704
17941B85662704P0217696L8225798p590653m5337901p0445913p3819912n3465290
$$ 285662704 355880400 394106198 386515545 341177644 270731731 196911819 143446529
17934A43446529l0444159j4318659k494889P886329J8106479K5773064L1548105
$$ 143446529 113002370 98683711 96188822 104075151 122181630 147954694 179502799
17927A79502799M1743666M6080597K091903o1062639p1015090m6983641k6698178
$$ 179502799 221246465 267327062 269418965 208356326 137341236 90357595 63659417
17920F3659417j5586502r879216o593682m463129k980503k094766j787409j833805
$$ 63659417 48072915 38193699 31600017 27136888 24156385 22061619 20274210 18440405
17912A8440405j926787j918417j774158j461504j060807p09476l70457p9061m5745
$$ 18440405 16513618 14595201 12821043 11359539 10298732 9589256 9218799 9139738 9093993
17903I093993l09934m67390m48996l93668o01602p28987p85759o97555n74785
$$ 9093993 8784059 8316669 7867673 7474005 6872403 6143416 5357657 4660102 4085317
17894D085317l83240k73056k51122k38648j76977j64643j25689j49206j68342
$$ 4085317 3702077 3429021 3177899 2939251 2762274 2597631 2471942 2322736 2154394
17885B154394j15518m4020j2495o9913p9977p8895k2812m1838q0773P309o2432
$$ 2154394 2038876 1994856 1982361 1912448 1832471 1753576 1730764 1688926 1608153 1615462 1553030
17874A553030r9624q8466m6794n3202m9011K1212P4902l8108p5519k2736q3300
$$ 1553030 1453406 1364940 1318146 1264944 1215933 1237145 1312047 1273939 1198420 1175684 1092384
17863A092384k1154k0036l0723k6855p3193l9411k3948k036j0540L109k3395J856
$$ 1092384 1071230 1051194 1020471 993616 920423 881012 857064 855028 844488 847597 824202 826058
17851H26058Q206k3501l2543o5252o119O59n7151J8762O9219J999r668k4004J6161
$$ 826058 834264 810763 778220 712968 706849 707508 650357 669119 738338 740337 730669 706665 722826
17838G22826O0302M2854K4280P8326Q0297K2486n6632j12413j98625j53673k0219
$$ 722826 783128 825982 850262 928588 1008885 1031371 974739 862326 663701 510028 489809
17827D89809M0414Q3268J32684J11168Q2188L0346n1551k4814m5835o5955j70241
$$ 489809 530223 613491 746175 857343 939531 969877 918326 893512 847677 781722 611481
17816F11481k25033j39488m5565J512J24846J84358J35531K0763l1128n1212l8254
$$ 611481 386448 246960 201395 202907 327753 512111 647642 668405 637277 586065 547811
17805E47811m4862r0742m1746j03756j51923l0688N1932O3560M0424M2636J0649
$$ 547811 502949 412207 370461 266705 114782 84094 136026 199586 240010 282646 293295
17794B93295j8807j02660j06024j148M7977R5461R3347L5708l185l1254m7509
$$ 293295 274488 171828 65804 64656 112633 208094 301441 337149 333964 302710 255201
17783B55201l0589l0564j6593J4960K9708l3836K761L9571M6522N5322l5534m5572
$$ 255201 224612 194048 177455 192415 222123 188287 191048 230619 277141 332463 296929 251357
17771B51357r726P943l6669l5683j0702j1608m1240K4458J3347O3523L581j7686
$$ 251357 241631 249574 212905 177222 166520 154912 113672 138130 151477 215000 218581 200895
17759B00895l8106L408K8236l1346l4918j006L7769K1928k4604l3m8727r1533
$$ 200895 162789 166197 194433 163087 128169 127163 164932 186860 162256 162223 113496 21963
17747B1963l2037M3417J8345J1966K0823k996j4914j3587Q186k6731n5942j0363
$$ 21963 -10074 33343 51688 63654 84477 81481 66567 52980 61166 34435 -21507 -31870
17735c1870l190p049k4951N4736L7654j643K0152j6151L8452o462o7141O240K8898
$$ -31870 -35060 -42109 -67060 -12324 25330 23687 43839 27688 66140 59678 -7463 -1223 27675
17722B7675k1064J5816J4568q901m031j8022J5998K8924l2149k6266n7192m581
$$ 27675 6611 22427 36995 28094 24063 6041 22039 50963 18814 -7452 -64644 -69225
17710f9225o323M0208J2485N1043O854j3461r180J8052J8133o3100j02M5872J1889
$$ -69225 -75548 -35340 -22855 28188 35042 21581 12401 30453 48586 -14514 -14616 31256 43145
17697D3145J4935J7792j0964m4828J507N184k9670M7184M0828j1936K4531j6392
$$ 43145 58080 75872 64908 20080 21587 26771 -2899 44285 85113 73177 97708 81316
17685H1316p1033J753P551Q185J0760r01J51K7016J1440O117q391o8230k1116
$$ 81316 10283 12036 19587 27772 38532 37631 37782 64798 76238 82355 73964 5734 -15382
17672a5382j5298P6526L0979p821l568J934m7632o6399L7460Q6177j2359o2276
$$ -15382 -30680 45846 76825 69004 65436 67370 19738 -46661 -9201 76976 64617 2341
17660B341k6521m1738j0536l533P952j00N718l2009N8046O5771M5655m2378j9525
$$ 2341 -24180 -65918 -76454 -79987 -72035 -72135 -66417 -98426 -40380 25391 71046 28668 9143
17647I143k5388K1870J1006m2160o860J9633L4585o17m3768o622l471l0245P142
$$ 9143 -16245 5625 16631 -25529 -32389 -12756 21829 21212 -22556 -29178 -32649 -62894 -55752
17634e5752L0066l8446l2323N291j9829N4752K5551K2097N8940R533m232j4337
$$ -55752 -25686 -64132 -96455 -91164 -110993 -56241 -30690 -8593 50347 59880 55648 41311
17622D1311n4843k90L2141J4525O38o0826j8646J0357J6009O3984l2823K0132
$$ 41311 -13532 -13822 18319 32844 33482 -27344 -45990 -35633 -19624 44360 11537 31669
17610C1669k392L5438L2666l497J6064l8050n5916M5024L3621R119M7974m1610
$$ 31669 29277 64715 97381 93884 109948 71898 15982 61006 94627 103746 151720 110110
17598A10110K8366l2311l506J4390L5524J6537L3044j6080o8626r8375r194R8990
$$ 110110 138476 106165 102659 117049 152573 169110 202154 186074 117448 19073 9879 108869
17586A08869P4968J24640J57153R9775O4470O8725J39612P8550N790j03806k34311
$$ 108869 183837 308477 465630 565405 629875 698600 838212 916762 922552 818746 584435
17575E84435j67894j34580j59565N408J4544J3315P29j3730o1893L3830K3502
$$ 584435 416541 281961 122396 127804 142348 155663 156392 142662 80769 114599 138101
17564A38101K9823K0779l1794l4248j9366j734K9550K0132N1486j5613J787L8455
$$ 138101 167924 188703 156909 122661 103295 101561 131111 151243 202729 187116 188903 227358
17552B27358J7331M1664N9257J39122J21255O8220J39523N8074m4586j43448j36589
$$ 227358 244689 286353 345610 484732 605987 674207 813730 871804 827218 683770 547181
17541E47181j66889j34091m8380K555m6762J2801l6436N218R374n070j2509L8517
$$ 547181 380292 246201 197821 200376 153614 166415 129979 135197 144571 139501 126992 165509
17529A65509J177p508l7576o0922m2459j3186o49L5550o7927k8363J5667M8962
$$ 165509 166686 159178 121602 60680 18221 5035 4386 39936 -27991 -56354 -40687 8275
17517H275M2475q792j1515m978o372k389l9540K500M2725j5552J7637o792J7955
$$ 8275 50750 41958 30443 25465 19093 16704 -22836 -20336 22389 6837 24474 17682 35637
17504C5637J5479K55J8880J315k4760M699j1067K333M8557Q662j3830m4921k1661
$$ 35637 51116 51371 70251 71566 46806 51505 40438 42771 91328 99990 86160 41239 19578
17491A9578M34J0798j8828j8083n7731K6753l122k6978J2678q580J9815K8768
$$ 19578 20012 30810 11982 -6101 -63832 -37079 -40201 -67179 -54501 -63081 -43266 -14498
17479a4498q940r564P999M3255M0419p064n8275k3131L7810L2036r232m3890j7402
$$ -14498 -23438 -33002 -25003 18252 58671 51607 -6668 -29799 8011 40047 30815 -13075 -30477
17466c0477j6688k2228O0740M5883k477k7975J743l49P335k0619j572j1522j4992
$$ -30477 -47165 -69393 -8653 37230 34753 6778 8521 8172 15507 -5112 -6684 -18206 -33198
17453c3198j5145P290M2809j6987m6845N9090M9870j1885m9470l7353M116p262
$$ -33198 -48343 -41053 1756 -15231 -62076 -2986 46884 34999 -14471 -51824 -47708 -54970
17441e4970k1480P3314j660K7034J4139Q598K0779J5917m3644n7036j5265K3518
$$ -54970 -76450 -3136 -4796 22238 36377 44975 65754 81671 38027 -19009 -34274 -10756
17429a0756N1635k0667l8860o600J8766L676R222Q8681K8386n0475n3738j5816
$$ -10756 40879 20212 -18648 -25248 -6482 -2806 6416 95097 123483 73008 19270 3454
17417C454l6053l6661j4305M5496n04m7557l1116l3783M6152J1566k4913L9635
$$ 3454 -32599 -69260 -83565 -38069 -38573 -86130 -117246 -151029 -104877 -93311 -118224 -78589
17405g8589R7861O3354l4306n4965n5236l5300O6008J7061O506P0857M474l4590
$$ -78589 19272 82626 48320 -6645 -61881 -97181 -31173 -14112 -7606 63251 67725 33135
17393C3135m0481O691L6513L9114m3394o7842K2333N865L618N0570K9211m8529
$$ 33135 -7346 -655 35858 74972 31578 -36264 -13931 -8066 -4448 46122 75333 26804
17381B6804l9939R017L0520k8086j9893J2719M1173M5859Q94N776m02l2024r195
$$ 26804 -13135 -4118 26402 -1684 -21577 -8858 32315 78174 79068 84844 84442 52418 43223
17368D3223K5847L7311M8125L7889O4487J35025J36399J31828Q2106l5919r9190
$$ 43223 69070 106381 154506 192395 256882 391907 528306 660134 742240 706321 607131
17357F07131r9012r5517j0124O6381M6483N4683J54914K36157J96925J49576J22132
$$ 607131 508119 412602 402478 468859 515342 570025 724939 961096 1158021 1307597 1429729
17346A429729j2824o9651j15288j47013j78542j36755j19430k1888Q4948J56347
$$ 1429729 1416905 1347254 1231966 1084953 906411 769656 650226 628338 713286 869633
17336H69633J16014J84104K47741J45908L1513j60434l20942k98125j78838j08321
$$ 869633 985647 1169751 1417492 1563400 1594913 1434479 1113537 815412 636574 528253
17326E28253o9852R724L5266m8129p853J4447P3241O7388p1056n1486p6463n4506
$$ 528253 458401 468125 503391 455262 447409 461856 535097 602485 531429 479943 403480 348974
17314C48974q6269j12965m5231o2713J836j3859K8449m2659o3259p251M8774K7049
$$ 348974 262705 149740 104509 41796 43632 29773 58222 15563 -47696 -54947 -6173 20876
17302B0876Q894l8510Q035J8968O2925M5131j0769j6192o969m1357K600o3128
$$ 20876 29770 -8740 -705 18263 81188 126319 115550 99358 92389 51032 53632 -9496
17290i496p7330k8124J1244L0243j8676L7116L9199n0506m7784K8932O3920j3477
$$ -9496 -86826 -114950 -103706 -73463 -92139 -55023 -15824 -66330 -114114 -85182 -21262 -34739
17278c4739n231j1069l4342J4531j330k6658M8235L6577M0495P3535m3070j07404
$$ -34739 -39970 -51039 -85381 -70850 -72180 -98838 -50603 -14026 26469 100004 56934 -50470
17266e0470l8240L4465L1286L9542J4613M1944n8884o1738L707K198l5005K2448
$$ -50470 -88710 -54245 -22959 16583 31196 73140 14256 -47482 -43775 -41577 -76582 -54134
17254e4134J7667k300j0614l255l6313N012L4343k1561J8348N6085L8276k6743
$$ -54134 -36467 -38767 -49381 -52636 -88949 -83937 -49594 -71155 -52807 3278 41554 14811
17242A4811p8034J4574j5083J2100l8036O464N9366J8727J1408p7691l617K8051
$$ 14811 -63223 -48649 -63732 -51632 -89668 -83204 -23838 -5111 6297 -71394 -75011 -46960
17230d6960J7435N303q769J699j6869K6249j4576K511J6877j0693J4j8230K9308
$$ -46960 -29525 -24222 -32991 -31292 -48161 -21912 -36488 -33977 -17100 -27793 -27779 -46009 -16701
17217a6701K3630P291o0878k4753K944k1061l3128J3579K9503L1710M651j5429
$$ -16701 6929 14220 -46658 -71411 -68467 -89528 -122656 -109077 -79574 -47864 -43213 -58642
17205e8642M9535K0792m415N1507J4055l9155n8163k5476J9955L6659k6387l1705
$$ -58642 -9107 11685 7270 58777 72832 33677 -24486 -49962 -30007 6652 -19735 -51440
17193e1440p359J3622P4113J738n7344j811R227j1276N466J0254J3105Q223j3385
$$ -51440 -58799 -45177 28936 30674 -26670 -28481 -19254 -30530 -25064 -14810 -1705 6518 -6867
17180f867N2960M5076m0320n9490P662K2620j3527j9443J0326M53k5396j9097
$$ -6867 46093 91169 50849 -8641 -979 21641 8114 -11329 -1003 -550 -25946 -45043
17168d5043r278M7565K8985J5517K3554l3900J8996L5535k1141j9163L007J6341
$$ -45043 -54321 -6756 22229 37746 61300 27400 46396 81931 60790 41627 44634 60975
17156F0975k6856n0774J4128K6279K8485J6909k5362j1858J0672k3789J9673R210
$$ 60975 34119 -16655 -2527 23752 52237 69146 43784 31926 42598 18809 38482 47692
17144D7692k8028J2065J5907J910J9943R796l2497k6951J7046M780K9741k6491
$$ 47692 19664 31729 47636 49546 69489 79285 46788 19837 36883 41663 71404 44913
17132D4913l1033k654M0678m5460J5003R7711P1258M6896M0456n0466r4536l118
$$ 44913 13880 11226 51904 6444 21447 119158 190416 237312 277768 227302 132766 129648
17120A29648k1348q8362p8055K093M3221J8966L7877k9597M8761J3184J7228N1375
$$ 129648 108300 19938 -58117 -56024 -12803 6163 44040 14443 63204 76388 93616 144991
17108A44991L9435k1900J5094O2261K7269n5961m9077J0062Q0542O249l3844m5895
$$ 144991 184426 162526 177620 239881 267150 211189 162112 172174 252716 258965 225121 179226
17096A79226m6223k8170k9853j5678K728M3032J9330l127l5595j536k3576n6905
$$ 179226 133003 104833 74980 59302 62030 105062 124392 121265 85670 84134 60558 3653
17084C653l9756R548P4138J8936l097J988M2022j2103k1524o702k5543J8468K2178
$$ 3653 -36103 -26555 47583 66519 63422 65410 107432 95329 73805 67103 41560 60028 82206
17071H2206M7391l6866n2425k2527m1262k8300J2083N3185m1904l5559j9473P644
$$ 82206 129597 92731 40306 17779 -23483 -51783 -39700 13485 -28419 -63978 -83451 -75807
17059g5807L8050L1958J566k0018K8859J07625k877q3479m7845j9255k8274N3903
$$ -75807 -37757 -5799 -4233 -24251 4608 112233 109356 25877 -21968 -41223 -69497 -15594
17047a5594O470q68M6133l4211k7776N498k7792R513K7482j7572l8008J6444K1453
$$ -15594 -9124 -9992 36141 1930 -25846 -20348 -48140 -38627 -11145 -28717 -66725 -50281 -28828
17034b8828l4957j1336P0883K9361J4499j6577P534n07p2424j5621K4872M5218
$$ -28828 -63785 -75121 -4238 25123 39622 23045 30579 30072 -42352 -57973 -33101 12117
17022A2117L9469L1818k7880K709k2853k5797K9271K9701j015k7352k3178k9445
$$ 12117 51586 83404 55524 58233 35380 9583 38854 68555 67540 40188 17010 -12435
17010a2435n7951P511N1208N3959K0732k0959J8011J6291L972m351P177N1600
$$ -12435 -70386 -62875 -11667 42292 63024 42065 60076 76367 80339 75988 83165 134765
16998A34765l0949p7316m0613K921M9083N6251l7903K922o288K1167K223J5454
$$ 134765 103816 26500 -14113 -11192 37891 94142 56239 59161 52873 74040 76263 91717
16986I1717p459l0053M0361P3445L5448N7475K5258P0191R0587P8744R2076m2700
$$ 91717 84258 54205 94566 168011 203459 260934 286192 356383 446970 525714 617790 575090
16974E75090o0643n3500m7480o839l1285O232K6550O3074R4736Q9580J25403P9435
$$ 575090 514447 460947 413467 406628 375343 381575 408125 471199 565935 655515 780918 860353
16962H60353L5918J5882r804N414o0578L1120N5113M0676k032l5938n5170k3332
$$ 860353 896271 912153 902349 907763 847185 878305 933418 974094 972062 936124 880954 857622
16950H57622O6783J2577J8792m8282k7296j7567L0835O3458P5343J04028J4983
$$ 857622 924405 936982 955774 907492 880196 862629 893464 956922 1032265 1136293 1151276
16939A151276o8225k16350k10410j49646r8334j14532n2857J5725N1271R5313
$$ 1151276 1083051 866701 656291 506645 408311 293779 240922 256647 307918 403231
16929D03231J02395J06949O3397J4853j16752j73372j00292l7145j4653l2284
$$ 403231 505626 612575 675972 690825 574073 400701 300409 263264 248611 216327
16919B16327k659l3218q0988j0778l6175l8002J0255L7733l811m6776j1197O9108
$$ 216327 213668 180450 99462 88684 52509 14507 24762 62495 58684 11908 711 69819
16907F9819p905n2989K5149O730n5244n0408j1151n8898j2858K5769Q4385Q9865
$$ 69819 61914 8925 34074 40804 -14440 -64848 -75999 -134897 -147755 -121986 -37601 52264
16895E2264j6018l8400q574J2770J4388M351j4750n8986j604J3240Q4730Q879
$$ 52264 36246 -2154 -10728 2042 16430 20781 6031 -52955 -54559 -41319 43411 52290
16883E2290j021l4099m9394K6083J7654K261k5257P614k022L4753N498m3135j5713
$$ 52290 51269 17170 -32224 -6141 11513 13774 -11483 -3869 -5891 28862 34360 -8775 -24488
16870b4488J0854K539L7266Q195k7964k3679K0139Q581J8368J0984j3684K8669
$$ -24488 -13634 -11095 26171 34366 6402 -17277 2862 11443 29811 40795 27111 55780
16858E5780K5346m431k4136m704K4724j7544l2576K472m1386k1373l7752M443
$$ 55780 81126 76695 52559 47855 72579 55035 22459 24931 -16455 -37828 -75580 -71137
16846g1137M1235M2460N6379k758P64N879Q003l9352m9512m5222J220p429K3526
$$ -71137 -29902 12558 68937 66179 66943 72822 80825 41473 -8039 -53261 -52041 -59470 -35944
16833c5944M5417L2847l2636m3475j1472N0712J0424J9260K2202O789L483j48
$$ -35944 9473 42320 9684 -33791 -45263 5449 15873 35133 57335 64124 67607 67459
16821F7459K1538l8364k6359O161K634L4564l0967o3966k2324R614M1714M8683
$$ 67459 88997 50633 24274 30435 33069 67633 36666 -27300 -49624 -40010 1704 50387
16809E0387K7273J6966O478p7089p9544j8041R445L1540L4156L9062K5733k718
$$ 50387 77660 94626 101104 24015 -55529 -73570 -64125 -32585 1571 40633 66366 63648
16797F3648n7237j4910j0468j3157m185j19O396j0778j8265L1259L0037L9385
$$ 63648 6411 -8499 -18967 -32124 -36309 -36428 -30032 -40810 -59075 -27816 2221 41606
16785D1606K1641L1134j3565n8469L291L6412N309l1633l3983m2765m3316K5738
$$ 41606 63247 94381 80816 22347 25638 62050 67359 35726 1743 -41022 -84338 -58600
16773e8600O2989J4074j9377M5630K8561k079r41j7478R527M3223J5590n8428
$$ -58600 4389 18463 -914 44716 73277 71198 70257 52779 62306 105529 121119 62691
16761F2691j1954J601K1916k1493J1464J4379k1553J0010j9243m9133M561l106
$$ 62691 50737 52338 74254 52761 64225 78604 57051 67061 47818 -1315 3246 140
16749A40j9352J2624L4114k3741l3814m3686J6327J4510Q8899L0430j623J3261
$$ 140 -19212 -6588 27526 3785 -30029 -73715 -57388 -42878 46021 76451 74828 88089
16737H8089R397l4647K5676P325k8437Q005j3374R912k8608k5059O0076N6332
$$ 88089 97486 62839 88515 95840 67403 75408 62034 71946 43338 18279 78355 134687
16725A34687K3433K8345J3021p5820l3713M722j7671r125J8643m722l567L0468
$$ 134687 158120 186465 199486 123666 89953 94675 77004 67879 86522 81800 78233 108701
16713A08701O043J1214j4375M435k9776J446J99L1208K9568M5925k1114N27o316
$$ 108701 114744 125958 111583 116018 86242 87688 87887 119095 148663 194588 173474 174001 167685
16700A67685k2853j8543J4327J4127K466J0200k2625n1440j9193J3515O1602N1648
$$ 167685 144832 126289 140616 154743 157209 167409 144784 93344 74151 87666 149268 200916
16688B00916M5646M0466N475P936l359L5599o7425l2880j0572n9023k0709P1284
$$ 200916 246562 287028 292503 300439 297080 332679 265254 232374 221802 162779 142070 213354
16676B13354N8490m5268j1601M033O075J8966J1072k1755j4318N8269J6754N3408
$$ 213354 271844 226576 214975 219008 225083 244049 255121 233366 219048 277317 294071 347479
16664C47479M2269L3620m9800q4378p3903o1910Q546J4635J7142k4869q7370k7115
$$ 347479 389748 423368 373568 289190 215287 153377 161923 176558 193700 168831 81461 54346
16652E4346J0452L9686O9048L0841J1106k3936J7292P9802k820n3056K8122K3760
$$ 54346 64798 104484 173532 204373 215479 191543 208835 288637 285817 232761 260883 284643
16640B84643K660k6479p9642k2041L091K8254l585m0815j375N005J4459L6900
$$ 284643 287303 260824 181182 159141 162232 190486 186901 146086 144711 149716 164175 201075
16628B01075N7450L5317L0293K697l7424k4206J3116n3068j2952k747l3084P621
$$ 201075 258525 293842 324135 326832 289408 265202 278318 225250 212298 209551 176467 184088
16616A84088L8103L5503K7866k6362p8122o5477j2074O7362O6031N4618j3384
$$ 184088 222191 257694 285560 259198 181076 115599 103525 170887 236918 291536 278152
16605B78152l6826l2153K4083K8024m3151p6119P977p058r999J2349M9915o232
$$ 278152 241326 209173 233256 261280 218129 142010 149987 142929 132930 145279 195194 188962
16593A88962k3726J8473N7437m8450m5071n9369k1386n99M9014J648j3227k0464
$$ 188962 165236 183709 241146 192696 147625 88256 66870 66271 115285 116933 103706 83242
16581H3242Q718o679j8107L5667Q5566R6563P900l1673m3600q506m3491N8366
$$ 83242 91960 85281 67174 102841 188407 284970 292870 261197 217597 209091 165600 223966
16569B23966J9535M263k6968L1036M7076P7666N8822M1746m9780k5873r8368l7519
$$ 223966 243501 247764 220796 251832 298908 376574 435396 477142 427362 401489 303121 265602
16557B65602J02912O0827N2888J10096R4855J8466r0833j31604o4884p6043q7831
$$ 265602 368514 429341 482229 592325 687180 705646 614813 483209 418325 342282 254451
16546B54451m0738J4113J7400N6793Q3211J54921J84107Q8330o3361k28292j93313
$$ 254451 213713 227826 245226 302019 385230 540151 724258 812588 749227 520935 327622
16535C27622j55863j33599j0098L7467K4902O6198J23866J31067N7863N1122O3615
$$ 327622 171759 38160 28062 65529 90431 156629 280495 411562 469425 520547 584162
16524E84162K2243j38127k08562q2712K1819M1066P2299O1521K8917L1689J4998
$$ 584162 606405 468278 259716 177004 198823 239889 312188 373709 402626 434315 449313
16513D49313L6862Q7736N8876p813k5566L2322K307j8464J4396O0638J4832q97
$$ 449313 486175 573911 632787 624974 599408 631730 634037 615573 629969 690607 705439 704542
16501G04542j6555k615P3586P1415L4663l5285K9150N8957J510L5028N1451O2073
$$ 704542 687987 685372 758958 830373 865036 829751 858901 917858 919368 954396 1005847 1067920
16489A067920L1502K4677N6203K5585O4993O7412K7340P1617N4335K868j9515
$$ 1067920 1099422 1124099 1180302 1205887 1270880 1338292 1365632 1437249 1491584 1494452 1474937
16478A474937P0407Q4978Q1680J18780J22157P4532J10382J68902J45891J27711
$$ 1474937 1545344 1630322 1712002 1830782 1952939 2027471 2137853 2306755 2452646 2580357
16468B580357K22399K02494K35818L03113M43227O83973R16914J103000J068755
$$ 2580357 2802756 3005250 3241068 3544181 3987408 4671381 5588295 6691295 7760050
16459G760050K70614n00060m01004P8099M06515O69197Q84669J030528R20511
$$ 7760050 8030664 7530604 7129600 7207699 7614214 8283411 9168080 10198608 11119119
16450A1119119J036866J077139R94246R41825P57628L28435J03737m250M22018
$$ 11119119 12155985 13233124 14227370 15169195 15926823 16255258 16358995 16354745 16776763
16441A6776763J208628J983783K533218L019139L723316N063816P427732J1276381
$$ 16776763 17985391 19969174 22502392 25521531 29244847 34308663 41736395 53012776
16433E3012776J7318966K5295353L3951953M3967037N5194550M3315419j4586444
$$ 53012776 70331742 95627095 129579048 173546085 228740635 272056054 257469610
16426B57469610n6663710m8654001k8173803j7023738q363545K242847J3818024
$$ 257469610 200805900 152151899 123978096 106954358 98590813 100833660 114651684
16419A14651684K6361705M0597299N6415040O6539787N5157483K3672708j6203996
$$ 114651684 141013389 181610688 238025728 304565515 359722998 383395706 367191710
16412C67191710n4469993p5065446o6240064m2898444k3004538r289978J283172
$$ 367191710 312721717 237656271 171416207 128517763 105513225 96223247 97506419
16405I7506419J1241179K0268237K5972605L2506001M2605202L2239249k3481200
$$ 97506419 108747598 129015835 154988440 187494441 230099643 262338892 238857692
16398B38857692o5693625n8518092l6416863k1452844j3123193q438282n720628
$$ 238857692 173164067 114645975 78229112 56776268 43653075 35214793 29494165
16391B9494165l923714k808445k158035j718471j612364j735367j720210j425596
$$ 29494165 25570451 22762006 20603971 18885500 17273136 15537769 13817559 12391963
16383A2391963j084022p50631n62924m30883k53269k83586m61297n61765m52792
$$ 12391963 11307941 10557310 9994386 9563503 9310234 9026648 8565351 8003586 7550794
16374G550794l62100n37562o54529o14067o11918m98373l37747l38275k91742
$$ 7550794 7188694 6651132 5996603 5382536 4770618 4272245 3934498 3596223 3304481
16365C304481k14119j24291r3111j18108j78612j71612j50554r3636j12932l1686
$$ 3304481 3090362 2966071 2872960 2754852 2576240 2404628 2254074 2160438 2047506 2015820
16355B015820p0660m3910q4221n9213m2562n8027n3815p8767m9405o6714n8370
$$ 2015820 1945160 1901250 1817029 1757816 1715254 1657227 1603412 1524645 1475240 1408526 1350156
16344A350156k0447k155q661m6358k6545n3493m8522o042j9125p8447l0488J0267
$$ 1350156 1329709 1327554 1318893 1272535 1245990 1192497 1143975 1137933 1118808 1040361 1009873 1020140
16332A020140j0672p7305l4384K024q1697l2210K4982J1993j9280j2344k6049
$$ 1020140 1009468 932163 897779 899803 818106 785896 810878 822871 803591 791247 765198
16321G65198k6881K5753L2376J2897K4253k0519p394m176L3979M796j8428K4287
$$ 765198 738317 764070 796446 809343 833596 813077 805683 801507 835486 840282 821854 846141
16309H46141O9298R4318P8368o3164j57703j83473j13272L2658N4583O3975O5725
$$ 846141 915439 1009757 1088125 1024961 867258 683785 570513 603171 657754 721729 787454
16298G87454J20489J00702k8666m2880l9538m4001j16450j64884j41435j33662
$$ 787454 907943 1008645 979979 937099 897561 853560 737110 572226 430791 297129
16288B97129n5586O6107J42262J41299N6068j6370j408k4893k4584n5356p9390
$$ 297129 241543 307650 449912 591211 647279 630909 629501 604608 580024 524668 445278
16277D45278q3836j26637q9093P2105Q0975J10059j5882J4284K2854l8392p0271
$$ 445278 361442 234805 145712 217817 298792 408851 392969 407253 430107 391715 321444
16266C21444o6365j927K1253Q7847N5245M2948m977n1435r735L4404k4574o2726
$$ 321444 255079 253152 274405 362252 417497 460445 455468 404033 394298 428702 404128 341402
16254C41402m4584k8567m970L7349q792k6090K5087l9029j3131R735j0612k3743
$$ 341402 296818 268251 263281 300630 291838 265748 290835 251806 238675 248410 237798 214055
16242B14055J0861O2045O8592M2208q0963q8486m4155O704N5615l1256N134J4985
$$ 214055 224916 286961 355553 397761 316798 228312 184157 190861 246476 215220 220354 235339
16230B35339l4543r4067L0494O3305K3216L0895l6864m7089j7358M364k5195m629
$$ 235339 200796 106729 137223 200528 223744 254639 217775 170686 153328 157692 132497 127868
16218A27868P121J7054J3088m6959j0566J7421J451J2362q5451o2750J9919M5258
$$ 127868 134989 152043 165131 118172 107606 125027 126478 138840 53389 -9361 10558 55816
16206E5816N016k18l991l1244l7219Q672J9888N6645l2810p507J5270K2550M508
$$ 55816 60832 60614 56623 25379 -11840 -3168 16720 73365 40555 33048 48318 70868 75376
16193G5376K9747K4744J1183m9087k7138k1723l6605k516k6198q454j0258K6471
$$ 75376 105123 129867 141050 91963 64825 43102 6497 3981 -22217 -30671 -40929 -14458
16181a4458N0940N2917L8954k7938q0441m3328N475M9357J9199J6557m846R20
$$ -14458 36482 89399 128353 100415 19974 -23354 -17879 31478 50677 67234 62388 63308
16169F3308N2522k3429j1669j1589j2236R418K155K394j2228J2702n278J5039
$$ 63308 115830 92401 80732 69143 56907 66325 68480 70874 58646 71348 66070 81109
16157H1109K6165N67r795m6031J8861L0175J224n4226N4207P369l683J7304n983
$$ 81109 107274 107841 98046 52015 70876 101051 102275 48049 102256 109625 105942 123246 117263
16144A17263j7171j4810m499L5264J0282J9547M019J6271m0330l0824l333j080
$$ 117263 100092 85282 80783 116047 126329 145876 149895 166166 125836 95012 91679 90599
16132I0599P691m3961j3927K2002k5095q841k5209k14N2024j7094j7611J1985
$$ 90599 98290 54329 40402 62404 37309 28468 3259 3045 55069 37975 20364 32349
16120C2349k7700l4363k0804K0868k0511o1818l861N984J5559L9872N0099k0415
$$ 32349 4649 -29714 -50518 -29650 -50161 -111979 -115840 -109856 -94297 -54425 -4326 -24741
16108b4741J6357P8156L3369o7039j3804j1054K3014j7523q472L6138O691l7466
$$ -24741 -8384 69772 103141 36102 22298 11244 34258 16735 8263 44401 51092 13626
16096A3626K984k733J8989j0960k2255r109J7983J6813L489L205j3551o7694J0809
$$ 13626 16610 13877 32866 21906 -349 -9458 8525 25338 28827 32032 18481 -49213 -38404
16083c8404M4822l0559R42M7120K0441k886M4526o143o5867Q291K382L9115j4090
$$ -38404 6418 -24141 -23199 23921 44362 41476 86002 79859 13992 22283 24665 63780 49690
16070D9690k2353L7048L885l2848r5712n4948M4132Q2706J2843l35k1653j4028
$$ 49690 27337 64385 68270 35422 -60290 -115238 -71106 11600 24443 24108 2455 -11573
16058a1573k4838M0949Q836r279n0144R235J545l7629P3979N302j581K917l4012
$$ -11573 -36411 4538 13374 4095 -46049 -36814 -35269 -72898 1081 6383 4802 7719 -26293
16045b6293k2275p368N4849k590q060N1901K3133q376k9029j6871k0360k3453
$$ -26293 -48568 -55936 -1087 -3677 -11737 40164 63297 54921 25892 9021 -11339 -34792
16033c4792K177N424J0492l7846M674N0393O7686m3354l8152J6270J8183K3584
$$ -34792 -32615 -27191 -16699 -54545 -49871 522 68208 24854 -13298 2972 21155 44739
16021D4739j6931l3928m221K6454M372J5642N4112p750p3593K6405L3216j6450
$$ 44739 27808 -6120 -10341 16113 20485 36127 90239 82489 8896 35301 68517 52067
16009E2067M312j513j5562J1419j5125l3229m0930n8028o0942N1667P8257O0454
$$ 52067 56379 54866 39304 50723 35598 2369 -38561 -96589 -157531 -105864 -27607 32847
15997C2847L3613K550K179j8439L905o2791O904J9093K440m9258k3433L3504J8298
$$ 32847 66460 69010 71189 52750 56655 -6136 768 19861 22301 -26957 -50390 -16886 1412
15984A412m7300r623M2395O1884M0847l8800j2584K7278K5277k9573p9041k0201
$$ 1412 -45888 -55511 -13116 48768 89615 50815 38231 65509 90786 61213 -17828 -38029
15972c8029N8062P2206M1473l3379j733m5856k160M0960N105l9512q1186l5381
$$ -38029 20033 92239 133712 100333 98600 52744 50584 91544 96649 57137 -24049 -59430
15960e9430J1474L761k0157L0404J7256J7060m2663k087M1108j3210n7185K4412
$$ -59430 -47956 -44195 -64352 -33948 -16692 368 -42295 -44382 -3274 -16484 -73669 -49257
15948d9257K8177k8572o0749N4124K4735k6973L0103K2218n6700K7167O3038J6518
$$ -49257 -21080 -49652 -110401 -56277 -31542 -58515 -28412 -6194 -62894 -35727 27311 43829
15936D3829r0366J5589K4398M0943j230m4087k1224N4481l793k4866J4975M8092
$$ 43829 -46537 -30948 -6550 34393 33163 -10924 -32148 22333 18540 -6326 8649 56741
15924E6741K5343J378j7832k4120J2306r427l582J3778l268L7266K4542J9742
$$ 56741 82084 83462 65630 41510 53816 44389 40807 54585 51317 88583 113125 132867
15912A32867k5384J6350J7597M9255q029n9010j6373j2304L6823R5577l2569k6870
$$ 132867 107483 123833 141430 190685 182656 123646 107273 94969 131792 227369 194800 167930
15900A67930Q3221M2073J32669J09781O7401R4255M9115q5143j17465p8294o1498
$$ 167930 251151 293224 425893 535674 603075 697330 746445 661302 543837 465543 404045
15889D04045k5800K3838L4526J06257J64450J31109R2054N3384P1275L3253r2733
$$ 404045 378245 402083 436609 542866 707316 838425 930479 983863 1055138 1088391 995658
15878I95658q0089o4038O028m4574L2321J09986m1907l1310m7067o2856N0836
$$ 995658 915569 851531 857559 812985 845306 955292 913385 882075 835008 772152 822988
15867H22988M1837L1378K1588n3884k313K7877Q7283J10208N8324r8573j81642
$$ 822988 864825 896203 917791 863907 861594 889471 976754 1086962 1145286 1046713 865071
15856H65071j97923j88130j35066l3700P47J022n743O9960R5976P5678L1068M7548
$$ 865071 667148 479018 343952 310252 310999 312021 306278 376238 472214 547892 578960 626508
15844F26508K6868r7553j51687j42816n5204m7691j5312j8188k2403j3022n477
$$ 626508 653376 555823 404136 261320 206116 158425 143113 124925 102522 89500 84023
15833H4023q1409K7216O3636j2308k5504n7465j1425p8p0668J4949M3985j2028
$$ 84023 2614 29830 93466 81158 55654 -1811 -13236 -13314 -83982 -69033 -25048 -37076
15821c7076J54L5787L4205o0642m1526k0274n232j716N1661k3309n0648J9142
$$ -37076 -36922 -1135 33070 -27572 -69098 -89372 -94604 -96320 -44659 -67968 -118616 -99474
15809i9474N2395q150J3213l269k3235m3104R9354M6899l1995l3451K5366P3372
$$ -99474 -47079 -55229 -42016 -45285 -68520 -111624 -12270 34629 2634 -30817 -5451 67921
15797F7921k5n7854l2191j8227N00J3778M3390P901l0815j8082J2548J9282Q862
$$ 67921 67896 10042 -22149 -40376 -39876 -26098 17292 25193 -5622 -23704 -11156 8126 16988
15784A6988L1822M3872k938k1427j3230k7792J6959J1891j7401M10r773k7124
$$ 16988 48810 92682 89744 68317 55087 27295 44254 56145 38744 39154 29381 2257
15772B257l6939j356L9963K2245j6800k1278J5886L3598l0589n9952k6913O0918
$$ 2257 -34682 -36038 3925 26170 9370 -11908 3978 37576 6987 -52965 -79878 -18960
15760a8960M5449K0590M279k7873n9294m3827O5483L1419J3435J144J6572k6248
$$ -18960 26489 47079 51358 23485 -35809 -79636 -14153 17266 30701 31845 48417 22169
15748B2169l0784l6201j8142P644k7831j503J5611J3776k1387o609q915N1824
$$ 22169 -8615 -44816 -62958 -55314 -83145 -84648 -69037 -55261 -76648 -83257 -92172 -40348
15736d0348Q9544j4160l9077Q298J0482J478J5630m6758J4110k8433j1307M5266
$$ -40348 49196 35036 -4041 4257 14739 16217 31847 -14911 -801 -29234 -40541 4725
15724D725K9471n2999m693N9788J4384r520L491j3840j3131M5139N9974l6840
$$ 4725 34196 -18803 -23496 36292 50676 41156 44647 30807 17676 62815 122789 85949
15712H5949n8196j5933m4530K6547P889K114n8286j4910R218k915M2706J9934
$$ 85949 27753 11820 -32710 -6163 1726 3840 -54446 -69356 -60138 -63053 -20347 -413
15700d13p60j2460J3243M3308L4706j1647k8380o9735J8300M3206l5878l0123
$$ -413 -1173 -13633 -390 42918 77624 65977 37597 -32138 -13838 29368 -6510 -36633
15688c6633K3175m2149o1765J1336K1024N4091M2366l3036J3376K3516m8833p397
$$ -36633 -13458 -55607 -117372 -106036 -85012 -30921 11445 -21591 -8215 15301 -33532 -40929
15676d0929j0310M130J8927l293k5784Q870M1652m221m8513l2999M2009Q5511
$$ -40929 -51239 -47109 -28182 -31475 -57259 -48389 -6737 -10958 -59471 -92470 -50461 35050
15664C5050k4343m8597J3057n261J1704L217m6638l9181N4367J7131Q842k6363
$$ 35050 10707 -37890 -24833 -30094 -18390 -15173 -61811 -100992 -46625 -29494 -20652 -47015
15652d7015j2475l5582n519K3043L9698J8752P809j7628L1182L0068n3723n8186
$$ -47015 -59490 -95072 -100591 -77548 -37850 -19098 -11289 -28917 2265 32333 -21390 -79576
15640g9576P013K3577J0222O913N4058k8120k9184l5872J6726O338l2509l257
$$ -79576 -72563 -48986 -38764 -31851 22207 -5913 -35097 -70969 -54243 -47905 -80414 -83671
15628h3671L0142L2860n270N702K4964K2789k1405o3114J9043Q533J2619J8377
$$ -83671 -53529 -20669 -25939 -20237 4727 27516 6111 -57003 -37960 -29427 -16808 1569
15616A569M7371j4745m1350r501l1717l5833L0195K5215J9750J6505n757l7823
$$ 1569 48940 34195 -7155 -16656 -48373 -84206 -54011 -28796 -9046 7459 1702 -36121
15604c6121k5891j5018n714k322M4067L8364P880l1628K1194P13l4427k384j4719
$$ -36121 -62012 -77030 -82744 -85066 -40999 -2635 5245 -26383 -5189 -4476 -38903 -41287 -56006
15591e6006J8389K8261k5295j5887M415k2144J2996k5774k6490j8707O7499Q7916
$$ -56006 -37617 -9356 -34651 -50538 -46123 -68267 -55271 -81045 -107535 -126242 -58743 29173
15579B9173L9790l0513l2587l0971l6062k4598J3636P539K2370L4933K3201N1495
$$ 29173 68963 38450 5863 -25108 -61170 -85768 -72132 -64593 -42223 -7290 15911 67406
15567F7406l5444m6270p274n4931m8233K4583Q0670J4277j3186M1903J6888k2402
$$ 67406 31962 -14308 -21582 -76513 -124746 -100163 -19493 -5216 -18402 23501 40389 17987
15555A7987j5999J8817R687k4350k2744J5516k8000m3819N740n342L5009L7227
$$ 17987 1988 20805 30492 6142 -16602 -1086 -29086 -72905 -67165 -72507 -37498 -271
15543b71j2924m5471j7955J8751J7721K3388M8265K5731k9109m4786K4589N6752
$$ -271 -13195 -58666 -76621 -57870 -40149 -16761 31504 57235 28126 -16660 7929 64681
15531F4681m788k595p738k9197K585K6986j3539l484L3114r173n924m4098k4320
$$ 64681 59893 57298 49560 20363 22948 49934 36395 32911 66025 56852 50928 6830 -17490
15518a7490k2269k9280l8715j5505O1743M3828O680j5298m3278j3382K465P040
$$ -17490 -39759 -69039 -107754 -123259 -61516 -17688 -11008 -26306 -69584 -82966 -80501 -73461
15506g3461o3473k40N7608J8905l4638J2473L0697L1302M0866m751L392n117l0702
$$ -73461 -136934 -137174 -79566 -60661 -95299 -82826 -52129 -20827 20039 15288 18680 13563 -17139
15493a7139k0561l3212J0915L1149j0387O451Q647l274K5438J8479m8388M0126
$$ -17139 -37700 -70912 -59997 -28848 -39235 -32784 -24137 -27411 -1973 16506 -31882 8244
15481H244J6557k4188k5980l6422L0682R0695l9100p7972q621n988L6048K3770
$$ 8244 24801 613 -25367 -61789 -31107 59588 20488 -57484 -66105 -72093 -36045 -12275
15469a2275k482o402K1678m8314m7905M3323j4909J3547K3111L0449j0871m2076
$$ -12275 -14757 -21159 519 -47795 -95700 -52377 -67286 -53739 -30628 -179 -11050 -53126
15457e3126K6116q509k4829l0957o468r380O4076K3169k5916j4K5737j002m0368
$$ -53126 -27010 -35519 -60348 -91305 -97773 -107153 -43077 -19908 -45824 -45838 -20101 -21103 -61471
15444f1471l4920o79L6062J1941j9491k403K4394O0709n369J806N1537n5033m925
$$ -61471 -96391 -97070 -61008 -49067 -68558 -70961 -46567 14142 8773 10579 62116 7083 2158
15431B158l4506j8578K8975j3829J4490K5849l444j8967j3599m2344l3510J6620
$$ 2158 -32348 -50926 -21951 -35780 -21290 4559 1115 -17852 -31451 -73795 -107305 -90685
15419i0685j677K1719N510N3139L3686L422l9970R995q739q4l5091M0288J0362
$$ -90685 -92362 -70643 -65133 -11994 21692 25114 -14856 -4861 -13600 -13684 -48775 -8487 1875
15406A875L1275K6971K4605k0883k308J7246p1478q1491q601K9324K2832j7258
$$ 1875 33150 60121 84726 63843 61535 78781 7303 -74188 -82789 -53465 -30633 -47891
15394d7891K8371M589P501K264N9752J3643m0567o2541q5229o621J9902O7974
$$ -47891 -19520 -14931 -7430 -5166 54586 68229 27662 -34879 -120108 -126729 -106827 -38853
15382c8853k4940L7512K8767k6008M746J3278P537m2910n7236N3568M2571l3217
$$ -38853 -63793 -26281 2486 -23522 -18776 -5498 2039 -40871 -98107 -44539 -1968 -35185
15370c5185r828n333L299J5894R153l1408j2875L7490k3046l4088K7740M5414
$$ -35185 -45013 -50346 -47047 -31153 -22000 -53408 -66283 -28793 -51839 -85927 -58187 -12773
15358a2773L9720M5258o9762n7683j6312M3031j0261o841p837l8041j4580M5132
$$ -12773 26947 72205 2443 -55240 -71552 -28521 -38782 -45623 -53460 -91501 -106081 -60949
15346f0949N8256k367J9257O374l426n902k8180j9267r240J7130L1359j1472l2918
$$ -60949 -2693 -5060 14197 20571 17145 11243 -16937 -36204 -45444 -28314 3045 -8427 -41345
15333d1345J0730R447L5209r577j7320p8554K8447P4526m9073j5535j0469l7200
$$ -41345 -30615 -21168 14041 4464 -12856 -91410 -62963 11563 -37510 -53045 -63514 -100714
15321a00714j7652L3902m0141K8511R5299L3871K2682j5014j5813Q144j1176P048
$$ -100714 -118366 -84464 -124605 -96094 -795 33076 55758 40744 24931 33075 21899 28947
15309B8947k1067K3936K8149l0394k206J2247l8427o2533J2393M0190Q401O53
$$ 28947 7880 31816 59965 29571 27365 39612 1185 -61348 -48955 -8765 -364 289
15297B89j789m6654j9730k1249j4553J7238L3136K7664O423j56r712J7942K3827
$$ 289 -1500 -48154 -67884 -89133 -103686 -86448 -53312 -25648 -19225 -19381 -29093 -11151 12676
15284A2676l514j038k6862o865l8684k6547J6782J8188L6017O5000O1102l5288
$$ 12676 9162 8124 -18738 -25603 -64287 -90834 -74052 -55864 -19847 45153 106255 70967
15272G0967q2279m2515N4322p3462L5459K6927m4552j0579L349J9561k4193k7095
$$ 70967 -11312 -53827 495 -72967 -37508 -10581 -55133 -65712 -62363 -42802 -66995 -94090
15260i4090J5383K2154l1270n149K7795o369J8497K4594p7100o5163M4026J0076
$$ -94090 -78707 -56553 -87823 -92972 -65177 -71546 -53049 -28455 -105555 -170718 -126692 -116616
15248a16616K3579P210J4734O6244k3136J1985n722K7755r423l0756L919M9809
$$ -116616 -93037 -85827 -71093 -4849 -27985 -16000 -21722 6033 -3390 -34146 -30227 19582
15236A9582J9126N271m2161j4661L8740k0303n128o8628k9973J9797R144K5715
$$ 19582 38708 43979 1818 -12843 25897 5594 466 -68162 -98135 -78338 -69194 -43479
15224d3479R052M1588J6725l440o9864k8759J1346J4797M7995L466o643l313o285
$$ -43479 -34427 7161 23886 20446 -49418 -78177 -66831 -52034 -4039 -573 -7216 -10529 -16814
15211a6814Q275n177R538m459j2609K0558p831o454m413j6911n1917J1474J9001
$$ -16814 -8539 -13716 -4178 -8637 -21246 -688 -8519 -14973 -19386 -36297 -88214 -76740 -57739
15198e7739J5445q757M576L6968j3705O719K4127k0666Q738m1424J3960J5147
$$ -57739 -42294 -51051 -46475 -9507 -23212 -16493 7634 -13032 -4294 -45718 -31758 -16611
15186a6611k668O670L1804k9760k3020k5669J764L2519P701o8888k9758l6113
$$ -16611 -19279 -12609 19195 -10565 -33585 -59254 -57490 -24971 -17270 -86158 -115916 -152029
15174a52029K93J1577J6430Q7323K0139Q345J4554j2669L6585K5524j8273Q496
$$ -152029 -151736 -140159 -123729 -36406 -16267 -7922 6632 -6037 30548 56072 37799 46295
15162D6295l859Q88K1484n8188J780k8022k5877R292j468M3690J08348j8149r5556
$$ 46295 42436 43324 64808 6620 8400 -19622 -45499 -36207 -37675 6015 114363 96214 658
15149F58l1879k7986k5137k9287M6645P250M7694R626J0575P05k6766n1305K4207
$$ 658 -31221 -59207 -84344 -113631 -66986 -59736 -12042 -2416 8159 8864 -17902 -69207 -45000
15136d5000L463K024j5520l0075j4799L3562j1993K7775O3032J9289Q375k8437
$$ -45000 -41537 -39513 -55033 -85108 -99907 -66345 -78338 -50563 12469 31758 40133 11696
15124A1696p1414m485J4921K8180o756K5737M3695o513m4926J0704J1991J0749
$$ 11696 -59718 -64203 -49282 -21102 -27858 -2121 41574 35061 -9865 839 12830 23579
15112B3579k851L1939L9409k4042P143r697q099n9679j5195K1862M1766J6779
$$ 23579 20728 52667 92076 68034 75177 65480 57381 -2298 -17493 4369 46135 62914
15100F2914o8775p6589j9056R616J01085J581l1752k6183J3110J2345K6831q2
$$ 62914 -5861 -82450 -101506 -91890 9195 10776 -20976 -47159 -34049 -21704 5127 5045
15088E045l2413O766L0230L9725J7989k1201M4999r497k7469l4096j5718n7853
$$ 5045 -27368 -20602 9628 49353 67342 46141 91140 81643 54174 20078 4360 -53493
15076e3493n8761P0720N1940J1091k0790l8299K0243J3922l1197J4254J3828m9874
$$ -53493 -112254 -41534 10406 21497 707 -37592 -17349 -3427 -34624 -20370 -6542 -56416
15064e6416k0221R380M4242N1885j1612K5032O0906n199J8971n0597m1399j7666
$$ -56416 -76637 -67257 -23015 28870 17258 42290 103196 97997 116968 66371 24972 7306
15052G306l2228l0613M3016L0896n6764j3833l415J4898l289K2898m3144k5658
$$ 7306 -24922 -55535 -12519 18377 -38387 -52220 -55635 -40737 -44026 -21128 -64272 -89930
15040h9930p309Q7658l1016o0968k6118o970K1575L4401N9006P3400q266q006
$$ -89930 -97239 -9581 -40597 -101565 -127683 -134653 -113078 -78677 -19671 53729 45463 37457
15028C7457m1837J5239M54k323m1462k0434j7727K9207O1185J55k067j3365L1078
$$ 37457 -4380 10859 11313 8990 -32472 -52906 -70633 -41426 19759 19914 17847 4482 35560
15015C5560o657m2472m743j4614Q719P543K6639K0134l0488l9176K134k5128N1422
$$ 35560 28903 -13569 -18312 -32926 -24207 -16664 9975 30109 -379 -39555 -37421 -62549 -11127
15002a1127Q110K141J5252j7671k603m823N3172K6516l179n2012m9852r060K1566
$$ -11127 -3017 -876 14376 -3295 -5898 -10721 42451 68967 65788 13776 -36076 -45136 -23570
14989b3570l5703J365J7851k8694j5953M848J0771M7059L9207J1292n4363L5371
$$ -23570 -59273 -57908 -40057 -68751 -84704 -79856 -69085 -22026 17181 28473 -25890 9481
14977I481O624k2366K4835k0627k4598J4486N4669J3967k4480J8613k6131k4877
$$ 9481 16105 -6261 18574 -2053 -26651 -12165 42504 56471 31991 50604 24473 -404
14965d04p5857j6773J0818M9172N3477M883l9447l2484K5614L1768j3678o783
$$ -404 -76261 -93034 -82216 -33044 20433 25316 -14131 -46615 -21001 10767 -2911 -9694
14953i694J2129K0306l3318o393m1478J3862J7171N924K6443M1657n6106o0127
$$ -9694 2435 22741 -10577 -16970 -58448 -44586 -27415 -21491 4952 46609 -9497 -69624
14941f9624j9107M5308M9147j3224k7275m3813k3558j0916L4978P5812K3839j6297
$$ -69624 -88731 -43423 5724 -7500 -34775 -78588 -102146 -113062 -78084 -2272 21567 5270
14929E270j3877j0158j9413l9353n6639j969K5295K787R871P9155M0561K2232
$$ 5270 -8607 -18765 -38178 -77531 -134170 -136139 -110844 -108057 -98186 -19031 21530 43762
14917D3762q364m5530j7999M8349J4096L8587l0727j3663K1804L219k791L6449
$$ 43762 35398 -10132 -28131 20218 34314 72901 42174 28511 50315 53534 50743 87192
14905H7192J6022k7220J4649J2n2792l3094j0632K5053L0122j2900j0816q764
$$ 87192 103214 75994 90643 90655 37863 4769 -5863 19190 49312 36412 25596 16832
14893A6832K7236m472k6575N4981N7630j5893p7148n1100K5447m3578k630O0030
$$ 16832 44068 39596 13021 68002 125632 109739 32591 -18509 6938 -36640 -39270 20760
14881B0760L524n6031p939k3165k1222M395O2454P234K67p715k6726j0054m3594
$$ 20760 24284 -31747 -39686 -62851 -84073 -79678 -17224 -9990 -9723 -17438 -44164 -54218 -97812
14868i7812k8669j3996J5344M0338N7393R744o854J1228L783K9223P658l8488
$$ -97812 -126481 -140477 -125133 -84795 -27402 -17658 -24512 -13284 -9501 19722 27380 -11108
14856a1108j2878k4936j0741m634L0518r260j7355J0208M2078R244m781q8541
$$ -11108 -23986 -48922 -59663 -64297 -33779 -43039 -60394 -50186 -8108 1136 -3645 -92186
14844i2186k5402N242J6363N2024P3233k1992n2560J9294O8345K1613P12k1653
$$ -92186 -117588 -112346 -95983 -43959 29274 7282 -45278 -25984 42361 63974 64686 43033
14832D3033q34k8470O2376K5076N4700n5011j625q7317p1448K6236J1050O892
$$ 43033 42199 13729 76105 101181 155881 100870 99245 11928 -59520 -33284 -22234 -15342
14820a5342o078l1489j3470l0674M0014J6223Q807K8412l523o4888o722O0117
$$ -15342 -21420 -52909 -66379 -97053 -57039 -40816 -32009 -3597 -7120 -72008 -78730 -18613
14808a8613M9679m5700l7947k9630j7235L0569M5204m625k3891p19J9886L5773
$$ -18613 31066 -14634 -52581 -82211 -99446 -68877 -23673 -28298 -52189 -52908 -33022 2751
14796B751R622j8789l3720q873m2354J1812J2840J1165O4555M4416m9690n2143
$$ 2751 12373 -6416 -40136 -49009 -91363 -79551 -66711 -55546 9009 53425 3735 -48408
14784d8408j3812M5420J6373L9112O1662m871q4361l4377k7042k6191j452L9460
$$ -48408 -62220 -16800 -427 38685 100347 95476 11115 -23262 -50304 -76495 -77947 -38487
14772c8487p856M708K5835L0423n118k9843j0158k3495J9865J307k0406l6753
$$ -38487 -46343 -41635 -15800 14623 9505 -20338 -30496 -53991 -34126 -32819 -53225 -89978
14760h9978j1327J9052M1051N1937j6292n7137m938N5345M5880o1817j2535l702
$$ -89978 -101305 -82253 -41202 10735 -5557 -62694 -67632 -12287 33593 -28224 -40759 -44461
14748d4461n4891l0203L9883R969L352M0959K6840J9300q791p4011j7285K4180
$$ -44461 -99352 -129555 -89672 -79703 -76351 -35392 -8552 10748 1957 -72054 -89339 -65159
14736f5159K7270r808l6960L3039k8981O806Q1609K1877J0288l938j2379p1915
$$ -65159 -37889 -47697 -84657 -51618 -80599 -73793 7816 29693 39981 36043 23664 -48251
14724d8251n9509K612N1559M8596K0138K2641j4608l0048L6869N9452l7310L192
$$ -48251 -107760 -105148 -53589 -4993 15145 37786 23178 -6870 29999 89451 52141 55333
14712E5333K9621l3945k5050K2905L416m0557l1303K036M2804m7539k813O3682
$$ 55333 84954 51009 25959 48864 52280 11723 -19580 -17544 25260 -22279 -25092 38590
14700C8590J5134j8496o9764M9878O3488j6445k720k8915j9007m4743J492Q4419
$$ 38590 53724 35228 -34536 15342 78830 62385 59665 30750 11743 -33000 -31508 52911
14688E2911k1956m1777j5321j3201m1757L9731P1977l4235k6575l2923n9873L7895
$$ 52911 30955 -10822 -26143 -39344 -81101 -41370 30607 -3628 -30203 -63126 -122999 -85104
14676h5104Q3414j5284j7224L3188J5546o946l3249k0117K7884N1325m4889m7951
$$ -85104 -1690 -16974 -34198 -1010 14536 7590 -25659 -45776 -17892 33433 -11456 -59407
14664e9407q698N1603L686J8686k765m1801N3072L7197l5099m1548l5042n189
$$ -59407 -68105 -16502 -12816 5870 3105 -38696 14376 51573 16474 -25074 -60116 -65305
14652f5305L412j7692j8583O520L0544L0904J6867M3800P490l5530J571k1467
$$ -65305 -61893 -79585 -98168 -91648 -61104 -30200 -13333 30467 37957 2427 3998 -17469
14640a7469J7226J0336Q210k7190k5087J4760J2865K6760K8176l1472k185n934
$$ -17469 -243 10093 18303 -8887 -33974 -19214 -6349 20411 48587 17115 14930 8996
14628H996j5178m3287l7337J2074J7042l0543L0909P6238k462k7897K7886r459
$$ 8996 -6182 -49469 -86806 -74732 -57690 -88233 -57324 18914 16452 -11445 16441 6982
14616F982P091l8648m5716M1485k6548m012K4125O162j0399P139l0343J8788O1545
$$ 6982 14073 -24575 -70291 -28806 -55354 -59366 -35241 -29079 -39478 -32339 -62682 -43894 17651
14603A7651k6699J5209N2125J9211m221p9510p5438m181J3563K2808L1211P559
$$ 17651 -9048 6161 58286 77497 73276 -6234 -81672 -85853 -72290 -49482 -18271 -10712
14591a0712Q891O99j5989M1835K6769l7775m4547Q398K4492J1278l5346M950J4798
$$ -10712 -1821 -1122 -17111 24724 51493 13718 -30829 -22431 2061 13339 -22007 -17057 -2259
14578b259j0282o2981k8190K1554J5792k5280j5665p186K5277k629J2909N9047
$$ -2259 -12541 -75522 -103712 -82158 -66366 -91646 -107311 -114497 -89220 -91849 -78940 -19893
14566a9893M5844o8040m7484L1896k8410k8468K9525L6599J6104j8860J9524j5213
$$ -19893 25951 -42089 -89573 -57677 -86087 -114555 -85030 -48431 -32327 -51187 -31663 -46876
14554d6876j3698J2563m6366J5485N8524O8804P54l7749l3393k2705l1045M0482
$$ -46876 -60574 -48011 -94377 -78892 -20368 48436 49190 11441 -21952 -44657 -75702 -35220
14542c5220M0962l0432r431m419n8093P495L12k225K5211J3538k5345J9737K4998
$$ -35220 5742 -24690 -34121 -38540 -96633 -89138 -88826 -91051 -65840 -52302 -77647 -57910 -32912
14529c2912P827q04m038q895M0750L9586N3409j2209o0915k7905l445j5752L4698
$$ -32912 -25085 -25889 -29927 -38822 1928 41514 94923 82714 21799 -6106 -9551 -25303 9395
14516I395m0256m7850L5955M3073k6013k599K3517M749L7570m3319K931k3369
$$ 9395 -30861 -78711 -42756 317 -25696 -28295 -4778 -29 37541 -5778 -2847 -26216
14504b6216o97P2870L9382n451k2959o6522j3618K0792O8108L5488l2998l1633
$$ -26216 -26913 45957 85339 79888 56929 -9593 -23211 -2419 65689 101177 68179 36546
14492C6546j491L0469k355q133m6659j4083l914M0643L0605k4206o9367o0758
$$ 36546 35055 65524 63169 55036 8377 -5706 -9620 31023 61628 37422 -31945 -92703
14480i2703k7108K2471m337K9897N0498J1888j004l8342m7796l874R2374K9932
$$ -92703 -119811 -97340 -101677 -71780 -21282 -9394 -10398 -48740 -96536 -100410 -8036 21896
14468B1896q993j671R49K230L4597k0596o779k4347o487k632K5753m3228m7459
$$ 21896 12903 11232 12181 14411 49008 28412 21633 -2714 -9201 -11833 13920 -29308 -76767
14455g6767k9508R206M7120j169l83K3956M2541m6078k3153j9158o230j4831J9226
$$ -76767 -106275 -97069 -49949 -51118 -51501 -27545 14996 -31082 -54235 -73393 -79623 -94454 -75228
14442g5228J0473j0241j39Q9009K2358j4955k4513n8377k8461l2977N4070N4777
$$ -75228 -64755 -74996 -75135 13874 36232 21277 -3236 -61613 -90074 -123051 -68981 -14204
14430a4204m1438m798J9412N2136K6498L653j5046N7030L1948M3538k8102j23755
$$ -14204 -55642 -60440 -41028 11108 37606 41259 26213 83243 115191 158729 130627 6872
14418F872o3025j5276m6385k4129N5495O1406J4580l6542J8123j0999o732L7238
$$ 6872 -56153 -71429 -117814 -141943 -86448 -25042 -10462 -47004 -28881 -39880 -46612 -9374
14406i374j7011j2976L6406j435J399j4438j2814j7988J2947K3344j1674P371
$$ -9374 -26385 -39361 -2955 -4390 -2991 -17429 -30243 -48231 -35284 -11940 -23614 -16243
14394a6243p028J8755l5061n718k809K6496M7443n2302j1122n8629Q251M9604
$$ -16243 -23271 -4516 -39577 -45295 -48104 -21608 25835 -26467 -37589 -96218 -87967 -38363
14382c8363k0019K5717R4414K1369n0621J6099j6358m8134j3766M2554l760k500
$$ -38363 -58382 -32665 61749 83118 32497 48596 32238 -15896 -29662 12892 9132 6632
14370F632J481K1784K0986J9020l2778r026n9392m0619j3645N7733K672l8120
$$ 6632 8113 29897 50883 69903 37125 28099 -31293 -71912 -85557 -27824 -25152 -63272
14358f3272j9409L7054L8130M2388j7560m1433L00K7L2470J2638j6991q779O2937
$$ -63272 -82681 -45627 -7497 34891 17331 -24102 -23802 -23775 8695 21333 4342 -4437 58500
14345E8500N3560k9812o8548j3249n2475l8528M5414L9254Q048j9566j5207O07
$$ 58500 112060 82248 13700 451 -52024 -90552 -45138 -5884 2164 -17402 -32609 -32002
14333c2002o2695o030N110J8344Q824J2271N249j7044L3383K6083J967N3961p076
$$ -32002 -94697 -100727 -95617 -77273 -68449 -56178 -50929 -67973 -34590 -8507 -6540 47421 40345
14320D0345k6167l6137N3660Q77j4233k3253k4662K8986k1043L902M202j0273
$$ 40345 14178 -21959 31701 32578 18345 -4908 -29570 -584 -21627 -17725 -13523 -23796
14308b3796K1397J5179J6624p668l9951m110J0939k2536k586L5637J4237n396
$$ -23796 -2399 12780 29404 21736 -18215 -22325 -11386 -33922 -36508 -871 13366 7970
14296G970J4810p337l0591Q944R527k2988K0241K828l5720k1872j4768R121n153
$$ 7970 22780 15443 -15148 -6204 3323 -19665 576 3404 -32316 -54188 -68956 -59835 -64988
14283f4988L170P9547l068m5860K2361j8149O673P3892R1254J5137m2846n4345
$$ -64988 -61818 17729 14661 -31199 -8838 -26987 -20314 53578 144832 159969 117123 62778
14271F2778J5386O353m8732m5279j137R927l1004J4722j2899O247L5250K4045
$$ 62778 78164 84517 35785 -9494 -10631 -704 -31708 -16986 -29885 -23638 11612 35657
14259C5657q3501m5311M0838o185n5772P7132J3805q603l5131m5034o721j2630
$$ 35657 -47844 -93155 -52317 -58502 -114274 -37142 -23337 -31940 -67071 -112105 -118826 -131456
14247a31456N1417N2860j6451N994j6747K7185J5282J3532J3283k4240o141M5743
$$ -131456 -80039 -27179 -43630 -37636 -54383 -27198 -11916 1616 14899 -9341 -15482 30261
14235C0261o4889l0747J1972l5191j342L8465N335L0567J5810N123j6850j6568
$$ 30261 -34628 -65375 -53403 -88594 -89936 -51471 -46136 -15569 241 5364 -11486 -28054
14223b8054O621N1490k251P379K3132o9938j584j3293j1218J3006o569J666R617
$$ -28054 -21433 30057 27806 35185 58317 -11621 -13205 -26498 -37716 -24710 -31279 -29613 -19996
14210a9996m370n4315k0487k4830m5452L7124K0092N16L3279O0143K0219k1260
$$ -19996 -24366 -78681 -99168 -123998 -169450 -132326 -112234 -111718 -78439 -18296 1923 -19337
14198a9337m0420K8314N0065l5658l5410L0349P8623k126j4332l4446k3732j5793
$$ -19337 -59757 -31443 18622 -17036 -52446 -22097 56526 54400 40068 5622 -18110 -33903
14186c3903m389K0379K218n0189J9717j1428k5907Q234J7935J7155L6143M6577
$$ -33903 -38292 -17913 -15695 -65884 -46167 -57595 -83502 -75268 -57333 -40178 -4035 42542
14174D2542j9384j7078l062l6612m1580j0459M3608J2603q726M079j6030k2391
$$ 42542 23158 6080 3018 -33594 -75174 -85633 -42025 -29422 -38148 -34069 -50099 -72490
14162g2490M6599J9105J0903j4362k3908J535J5041k3722l2669j8225k1141M0918
$$ -72490 -25891 -6786 4117 -10245 -34153 -32618 -17577 -41299 -73968 -92193 -113334 -72416
14150g2416K4224l5812L5584P809N0887K7555k8634l1809P546K7930K6256M5319
$$ -72416 -48192 -84004 -48420 -40611 10276 37831 9197 -22612 -15066 12864 39120 84439
14138H4439j3298n9733L881J3044k9930q092m0830L784l218K1501M2720K9067
$$ 84439 71141 11408 15289 28333 -1597 -9689 -50519 -46735 -49953 -28452 14268 43335
14126D3335l5846m0418L3002J7501l5630j8686M6603K8489l3221P764N3499m3261
$$ 43335 7489 -32929 73 17574 -18056 -36742 9861 38350 5129 12893 66392 23131
14114B3131n9149j658K7349l7333k2129N2166O5144L688O004m461k4552k1280
$$ 23131 -36018 -37676 -10327 -47660 -69789 -17623 47521 51209 57213 52752 28200 6920
14102F920l8562k367K3231J5986k4514k522j2442M8347K2837j5294K2716k0256
$$ 6920 -31642 -34009 -10778 5208 -19306 -21828 -34270 14077 36914 21620 44336 24080
14090B4080k2240q197o42n369L8386m743M6725K8564M5970r931l3456l4946j7203
$$ 24080 1840 -6357 -6999 -12368 26018 21275 68000 96564 142534 132603 99147 64201 46998
14077D6998J6064j6937o8335l4038J1283Q669K6957M9017J7440l1394j1311j2638
$$ 46998 63062 46125 -22210 -56248 -44965 -36296 -9339 39678 57118 25724 14413 1775
14065A775j687J3095L433q847K3490m424L0129J0762k1496p3466k3448J4084L1080
$$ 1775 88 13183 16616 7769 31259 26835 56964 67726 46230 -27236 -50684 -36600 -5520
14052e520l6903N569L6142N2834k404n4634m7972m8082m3939K1400L2510O2496
$$ -5520 -42423 -36854 -712 52122 49718 -4916 -52888 -100970 -144909 -123509 -90999 -28503
14040b8503M0260p848K4846Q280M453j7804N404o701Q471K4968j8745m5119O9658
$$ -28503 11757 3909 28755 37035 41488 23684 29088 22387 30858 55826 37081 -8038 61620
14027F1620K2914o1077j0039k3775N926m9761K3917L876k354Q017J0067J9250
$$ 61620 84534 23457 13418 -10357 -4431 -54192 -30275 -26399 -28753 -20736 -10669 8581
14015H581l882n337j0155J6370j3872l0923K919P962L233K6644j8083p0516R584
$$ 8581 4699 -638 -10793 5577 -8295 -39218 -36299 -28337 -25104 1540 -16543 -87059 -77475
14002g7475K4227m629K3273L7895J8112Q619j0901j9746J658L7228O3148j9546
$$ -77475 -53248 -57877 -34604 3291 21403 30022 19121 -625 1033 38261 101409 81863
13990H1863n6271J6334M8938l142k5927J5495l093J2305K39N362m1197j7186m6565
$$ 81863 25592 41926 90864 87722 61795 77290 74197 86502 86741 92103 50906 33720 -12845
13977a2845K8336K3675j1417k0886j5156p2788n1130K2338K0652M3256N1243J7061
$$ -12845 15491 39166 27749 6863 -8293 -81081 -132211 -109873 -89221 -45965 5278 22339
13965B2339K1289l2224j7475k4584l761J2967M5753L939k2448N680n079j2431
$$ 22339 43628 11404 -6071 -30655 -34416 -21449 24304 28243 5795 11475 6396 -6035
13953f035L1272j7907l5717J9630j3688n20k5815l2661N5188O0013k059o3249
$$ -6035 25237 7330 -28387 -8757 -22445 -22965 -48780 -81441 -26253 33760 31701 -31548
13941c1548m9903n888O8192N484j315M3542L6812K8876j5886l8356k5138o550
$$ -31548 -81451 -87339 -19147 -13663 -14978 28564 65376 94252 78366 40010 14872 8322
13929H322L619o9526m4824n501k857N2426j3089J8682Q632K4158J3988J0504m6398
$$ 8322 11941 -57585 -102409 -107910 -110767 -58341 -71430 -52748 -44116 -19958 -5970 4534 -41864
13916d1864J1044N730M616M5856Q724J0135K6776j5376R517K6222l2957k0318
$$ -41864 -30820 -25090 -20474 25382 34106 44241 71017 55641 65158 91380 58423 38105
13904C8105J8921j8513r6705n0032M6792M0175J1869J5786K749l0364Q808M2833
$$ 38105 57026 38513 -58192 -108224 -61432 -21257 -9388 6398 9147 -21217 -12409 30424
13892C0424L8383n1454J6127K3418p3172N478j5k1214J973R873J6515M3264M5357
$$ 30424 68807 17353 33480 56898 -16274 -10796 -10811 -32025 -30052 -20179 -3664 39600 84957
13879H4957L042l7174p2236l3848K7880k1270l6702K2053M2845j0588K6132R610
$$ 84957 87999 50825 -21411 -55259 -27379 -48649 -85351 -63298 -20453 -31041 -4909 4701
13867D701o934L0030J1058k3953n1579p17K4522k8555j4751q104L2155N7823K5530
$$ 4701 -2233 27797 38855 14902 -36677 -37394 -12872 -41427 -56178 -64282 -32127 25696 51226
13854E1226L7190K2069j5379J0633r676k1196o552J1097r1955q7042n235K0561
$$ 51226 88416 110485 95106 105739 96063 74867 68315 79412 -12543 -99585 -104820 -84259
13842h4259K4880O3178L9920l6186L1830k3765l8878K0652K2924j3601j8496k5221
$$ -84259 -59379 3799 43719 7533 39363 15598 -23280 -2628 20296 6695 -11801 -37022
13830c7022K0497K3357L993J0716K1483K2719K7751O268l8279m2115J4302p33
$$ -37022 -16525 6832 10825 21541 43024 65743 93494 99762 61483 19368 33670 32937
13818C2937P81J1542q353J8808j475j0541L7162L8467J4330k2997m0917n0417
$$ 32937 33718 45260 36907 55715 54240 43699 80861 119328 133658 110661 69744 19327
13806A9327j8266K1147n0768q9718m7591L1592N7366O1462N1153j355k4069k5067
$$ 19327 1061 22208 -28560 -118278 -165869 -134277 -76911 -15449 35704 34349 10280 -14787
13794a4787j6864Q43K8064n112M0825k578j948l4809J9611L1471O105K9251j237
$$ -14787 -31651 -30808 -2744 -7856 32969 30391 28443 -6366 13245 44716 50821 80072 78835
13781G8835k0234M7951Q019k5028m1717q416m0771k8282J3232L6927J2313k6577
$$ 78835 58601 106552 114571 89543 47826 39410 -1361 -29643 -16411 20516 32829 6252
13769F252L2131N2861j1624n1901n1088o8046O29O6702K7539n0975j2486O0488
$$ 6252 38383 91244 79620 27719 -23369 -91415 -90786 -24084 3455 -47520 -60006 482
13757D82M3953k6032j2255L9045m4097m915L6836k5267j1166J3742n894k896L4836
$$ 482 44435 18403 6148 45193 1096 -3819 33017 7750 -3416 10326 4432 1536 36372
13744C6372l0131q1162q697K6502N5973M2440r0123j6479K4523L4565M1636k6423
$$ 36372 6241 -74921 -83618 -57116 -1143 41297 -48826 -65305 -40782 -6217 35419 8996
13732H996m1252N9058M9878l0774j7529O72Q187l9660j567Q0893L5998p1496l0726
$$ 8996 -32256 26802 76680 45906 28377 29049 37236 -2424 -3991 76902 112900 41404 10678
13719A0678J8355Q3840N7009k1384o5813p6773p840l4390l37J5926P2715l7720
$$ 10678 29033 112873 169882 148498 82685 5912 -1928 -36318 -36655 -20729 51986 14266
13707A4266j9565N944K803M910L5719j0876M7160M607j4126M1964q584k7270K895
$$ 14266 -5299 645 3448 8358 44077 33201 80361 84968 70842 112806 104222 76952 79847
13694G9847N472k8014J2920J0361M927l6748j8779M1084L9249L651o9935M0660
$$ 79847 85319 57305 70225 80586 85513 48765 29986 71070 110319 113970 44035 84695
13682H4695k8156k3696M4413N0414J1369l2338k3166l5484k5909L016K7162k0615
$$ 84695 56539 32843 77256 127670 139039 106701 83535 48051 22142 25158 52320 31705
13670C1705p9833k0715N524K8784L2205L5260J9376K7728l7537J100Q064k142
$$ 31705 -48128 -68843 -63319 -34535 -2330 32930 52306 80034 42497 43597 51661 49519
13658D9519R820k0892M8027l5915J5442L9530l3297l6202l0608P013K4721j7921
$$ 49519 59339 38447 86474 50559 66001 105531 72234 36032 5424 12437 37158 19237
13646A9237m9158k4119K0875L2822k5014J8904k9854J237J7987k074K5932j584
$$ 19237 -29921 -54040 -33165 -343 -25357 -6453 -36307 -35070 -17083 -19157 6775 5191
13634E191j3235L6938m431n605k5743J704l7984O51L9246M3714M4731r667l9494
$$ 5191 -8044 28894 24463 18858 -6885 -5181 -43165 -42514 -3268 40446 85177 75510 36016
13621C6016K8195k4579l4339J7538l4802K6310J6471m239J3049L5889K3441j2168
$$ 36016 64211 39632 5293 22831 -11971 14339 30810 26571 39620 75509 98950 86782
13609H6782M3172j2126j9046m0985l1495M484L2884J5944m476K7107K8422o669
$$ 86782 129954 117828 98782 57797 26302 30786 63670 79614 75138 102245 130667 123998
13597A23998l6053k9289Q301k3736N6161K226l7115j2438n875M3996n0262K925
$$ 123998 87945 58656 66957 43221 99382 101608 64493 52055 46180 90176 39914 42839
13585D2839J4482K39k7929n537j7043k5793N3787M8943j1806l2695m1252J4447
$$ 42839 57321 57560 29631 24094 7051 -18742 35045 83988 72182 39487 -1765 12682
13573A2682K6113l3782O0104J7597N192m6133n7540J9293K9040L0661n8982k987
$$ 12682 38795 5013 65117 82714 87906 41773 -15767 3526 32566 63227 4245 1258
13561A258O5011m99p8996m7940j3586J9413q571L9807M3802j9484J693l8273J0433
$$ 1258 66269 65770 -13226 -61166 -74752 -55339 -63910 -24103 19699 215 1908 -36365 -25932
13548b5932N4022J188K3525l4093n5459K3328k5851l01N6167j797m04l6953k6236
$$ -25932 28090 29278 52803 18710 -36749 -13421 -39272 -39573 16594 14797 14393 -22560 -48796
13535d8796K2716N1095O2107k7654l143K7604j7200L05J040J4474m6021p616K0958
$$ -48796 -26080 25015 87122 59468 56325 83929 66729 67034 68074 82548 36527 28911 49869
13522D9869q518l2174l0964M168j292J6444J0044K4038M016O721l8729j6003N9476
$$ 49869 41351 9177 -21787 -17619 -18911 -2467 7577 31615 35631 42352 3623 -12380 47096
13509D7096o978o6818R805O1405O9051j9745J62n406k2082r543M692m0547o007
$$ 47096 40118 -26700 -16895 44510 113561 93816 93978 88572 66490 56947 61639 21092 15085
13496A5085J3723J2347k0353K248N84q276j345K8070L3448l2168j0508m0298l7341
$$ 15085 28808 41155 20802 23050 23634 15358 14013 42083 75531 43363 32855 -7443 -44784
13483d4784L1430J9455m091J8227O3024M655O36q852j780K6229j4555l7346k3712
$$ -44784 -13354 6101 2010 20237 83261 87916 88552 79700 77920 104149 89594 52248 28536
13470B8536R555j0072L3106J5225K3929K1542k1062K2845O218j512o554j8226
$$ 28536 38091 28019 61125 76350 100279 121821 100759 123604 129822 128310 121756 103530
13458A03530n935j664o8601N888L2810j5464m6328k6873L5591L7472m5435l9320
$$ 103530 97595 95931 27330 33218 66028 50564 4236 -22637 12954 50426 4991 -34329
13446c4329j7606K3365K8053O3819K3627J0504J806J585j4284J1815j6465J95
$$ -34329 -51935 -28570 -517 63302 86929 97433 99239 100824 86540 98355 81890 82085
13434H2085r855k0056K2463j26n475k385l3663m7529J2502J5428O8686M5083j5056
$$ 82085 72230 52174 74637 74511 69036 66651 32988 -14541 -2039 13389 82075 127158 112102
13421A12102k2424l7202m588L106m921j2723o849k8941P6241O3276L0957L2916
$$ 112102 89678 52476 47888 50994 46073 33350 26501 -2440 73801 137077 168034 200950
13409B00950j6726k5168j2847p547m3164n9836m674Q3398L6716M2542k7346m4830
$$ 200950 184224 159056 146209 138662 95498 35662 30988 114386 151102 193644 166298 121468
13397A21468l4914n74J4848Q0139J2251n4918K0110j4912m707N1688N400J1032
$$ 121468 86554 85980 100828 180967 193218 138300 158410 143498 138791 190479 195879 206911
13385B06911O593M7j0669o4279q6542n0968l7565m4662L8161N9093M3602N801
$$ 206911 213504 213551 202882 138603 52061 1093 -36472 -81134 -42973 16120 59722 65523
13373F5523k0448O4816K7056J4148p2067k7225N8232K600j6173m3209r636N4265
$$ 65523 45075 109891 136947 151095 79028 51803 110035 112635 96462 53253 43617 97882
13361I7882R863M0130P409q440L8889p6985j09810m0092J9621L928r60R091M1631
$$ 97882 107745 147875 155284 146844 185733 108748 -1062 -41154 -21533 -17605 -18565 -9474 32157
13348C2157J1506L1060M6880L5760j5956k0790Q369J727J5027j9414O63N5338
$$ 32157 43663 74723 121603 157363 141407 120617 128986 130713 145740 126326 126989 182327
13336A82327j1148k1097j8252O3236J5769o5025o1227J80Q4055N2170k1907o185
$$ 182327 171179 150082 131830 195066 210835 145810 84583 84763 168818 220988 199081 192896
13324A92896j3738p503n544k0907l8027n11M3504L2070J8848J5058k9444O105
$$ 192896 179158 171655 166111 145204 107177 106666 150170 182240 201088 216146 186702 192807
13312A92807n4578q6226o437K9578p760m519K0N4905K7346L4273n9192m6474Q962
$$ 192807 138229 52003 45566 75144 67384 62865 62885 117790 145136 179409 120217 73743 82705
13299H2705K0729J7655l202L1387J0513N165j8221L7339j3344k6948J4191K448
$$ 82705 103434 121089 117887 149274 159787 164952 146731 184070 170726 143778 157969 160417
13287A60417j0494k5943l6330K3879J9529j1878M5229L8995j2003R79J667m0446
$$ 160417 149923 123980 87650 111529 131058 119180 164409 203404 191401 192380 194047 153601
13275A53601j8623J7470l51p0378k2863M1200Q6470K0482n5578m0378m9692l1822
$$ 153601 134978 152448 152097 81719 58856 100056 186526 207008 151430 111052 61360 29538
13263B9538L2003j1045q602J1250K4922N8239j7091m4944L074N1182N8496M03
$$ 29538 61541 50496 41894 53144 78066 136305 119214 74270 77344 128526 187022 187425
13251A87425M890L911m2133l1923m1728j011L8731M0552n53m0457J4377L5503
$$ 187425 192315 196226 154093 122170 80442 79431 118162 158714 158161 117704 132081 167584
13239A67584L9992O646l3821J0846J6420L887L0032K2509q226J1077n4400m02
$$ 167584 207576 214222 180401 191247 207667 211554 241586 264095 255869 266946 212546 212144
13227B12144l0288n946K1040J9437l7545j4478J0012l5238K0325R881m430j8k6527
$$ 212144 181856 175910 196950 216387 178842 164364 174376 139138 159463 169344 164914 164896 138369
13214A38369j0193J9556j785l0052R932O3541J5164o5174K36l7653m7935K0713
$$ 138369 128176 147732 145947 115895 125827 189368 204532 139358 139594 101941 54006 74719
13202G4719J7721L2533J0546n2484k0723M1871N4354L0163K3983J0978k8403o0665
$$ 74719 92440 124973 135519 83035 62312 104183 158537 188700 212683 223661 195258 134593
13190A34593m6129j55Q763L1432J1529J3960q569K3486R874q7334J3455J7785
$$ 134593 88464 88309 97072 128504 140033 153993 145424 168910 178784 91450 104905 122690
13178A22690K9419M7818J6216n8357j6342K0872J9961k935p093J3125m074O709
$$ 122690 152109 199927 216143 157786 141444 162316 182277 179342 172249 185374 181300 188009
13166A88009K5513K1826P300n2848k134n609j7826q9932M8384M5146q702K2603
$$ 188009 213522 235348 242648 189800 187666 182057 164231 74299 122683 167829 159127 181730
13154A81730J1232k0123L1886j2100l8511M9J1660O8125L2116j8157q2785k3471
$$ 181730 192962 172839 204725 192625 154114 154163 165823 233948 266064 247907 165122 141651
13142A41651j5720l1210O1106P5591K1119k7817n1751K2630N928j4664p1047p342
$$ 141651 125931 94721 155827 231418 252537 224720 172969 195599 201527 186863 115816 108474
13130A08474J1379L5315j8696r921L3928q871K4148L4151j8537L1152N539p0892
$$ 108474 119853 155168 136472 126551 160479 151608 175756 209907 191370 222522 228061 157169
13118A57169J6616L9232j1335R767K7263J2555o100m2235J2726P8027J6657j8679
$$ 157169 173785 213017 201682 211449 238712 251267 245167 202932 215658 293685 310342 291663
13106B91663n9154L8969J0171l396j1597j0636n0911J4384M730J0741M5674j4147
$$ 291663 232509 271478 281649 278253 266656 256020 205109 219493 224223 234964 280638 266491
13094B66491p1523o2222M943N2202k6168M7196J1078k9833q827j9137L4046K9405
$$ 266491 194968 132746 137689 189891 163723 210919 221997 192164 183337 164200 198246 227651
13082B27651N387J7524P010l4317q576O621M85J5797N3849k9847q6139P485K16
$$ 227651 233038 250562 257572 223255 214679 221300 221785 237582 291431 261584 175445 182930 183146
13069A83146o0457L1551N5089O4870k480n7290o0909j8479O9O0363M9325j8998
$$ 183146 122689 154240 209329 274199 271719 214429 153520 135041 135110 195473 244798 225800
13057B25800j2915l0652n578M2088O4636o6526r8907n8435N3348P4861K8654j1322
$$ 225800 212885 182233 176655 218743 283379 216853 117946 59511 112859 187720 216374 205052
13045B05052l0682k3050p760L8518j4193J6831k3891n2927L8279J5911L6074K3654
$$ 205052 174370 151320 143560 182078 167885 184716 160825 107898 146177 162088 198162 221816
13033B21816k5288o0894j6996Q0350O2289k073m0525j1723k389k3811k9000m0615
$$ 221816 196528 135634 118638 198988 261277 259204 218679 206956 204567 180756 151756 111141
13021A11141J1935L1391J6456N8652r795K717N066j2962l2532L125l487J1507
$$ 111141 123076 154467 170923 229575 219780 222497 227563 214601 182069 185194 181707 193214
13009A93214K2467m5770m8813M5534P1099k1130N1981L0427l5922l0877q388l4510
$$ 193214 215681 169911 121098 166632 237731 216601 268582 299009 263087 232210 223822 189312
12997A89312j6605q361o55J9435N4773O9j5036o578j9901k9080l3923n3182O2516
$$ 189312 172707 164346 163691 183126 237899 237968 222932 216354 196453 167373 133450 80268 142784
12984A42784k2790j454L6883J6166m6454k998M4691J8252K1736k003K0318M2236
$$ 142784 119994 118540 155423 171589 125135 122137 166828 185080 206816 204813 225131 267367
12972B67367m218J2358l7585k2969j3286l5514l242K698l0719j5643L4324M3127
$$ 267367 263149 275507 237922 214953 201667 166153 162911 165609 134890 119247 153571 196698
12960A96698l9179l9527m6037N734L5404R4231P544k5158J436k8053q234j7099
$$ 196698 157519 117992 71955 77689 113093 207324 214868 189710 191146 163093 154859 137760
12948A37760L2236j2116m1954l4303L9277J0930k1207o5254K0311O9245k0731
$$ 137760 169996 157880 115926 81623 120900 131830 110623 45369 65680 134925 114194
12937A14194L3524M4442K6109M269j6580J4457N2903j4738O527m2697n7565k6104
$$ 114194 147718 192160 218269 222538 205958 220415 273318 258580 265107 222410 164845 138741
12925A38741J1277N0852r068p6006o1808K9435J4937P404N2031Q3413r065m0857
$$ 138741 150018 200870 191802 115796 53988 83423 98360 105764 157795 241208 232143 191286
12913A91286m2983r4428K3788N2205K2222K5146m8675l2330j7619j1904O1809
$$ 191286 148303 53875 77663 129868 152090 177236 128561 96231 78612 66708 128517
12902A28517m8213l284M6918M2116l6513l7640L5513k235J8594J3339k2568L231
$$ 128517 80304 77020 123938 166054 129541 91901 127414 125179 143773 157112 134544 137775
12890A37775K5617N1549m031j0168q905O9025P684p3214k1308m6540M935N7792
$$ 137775 163392 214941 210910 200742 191837 260862 268546 195332 174024 127484 132419 190211
12878A90211k302J2089p3992o0169K5305J01165Q070j014j6800N969M8263p1108
$$ 190211 187909 199998 126006 65837 91142 192307 200377 199363 182563 188532 236795 165687
12866A65687l4434K8670Q5346p172r1461q8387J1690N0706J387L0688J359O207
$$ 165687 131253 159923 245269 238097 146636 58249 69939 120645 122032 152720 154079 160286
12854A60286l1230n4164M3086M170m9807p455J8892K4407o822M3956K6163K587
$$ 160286 129056 74892 117978 122148 72341 64886 83778 108185 101363 145319 171482 174069
12842A74069m0374j8473l9275O425L7335j1153j503n4345l2339N5030J9956L9199
$$ 174069 133695 115222 75947 82372 119707 108554 107051 52706 20367 75397 95353 134552
12830A34552O7519J0348M380J8273n0935j5794k0932j8883j2938L2685K1409L8936
$$ 134552 202071 212419 216799 235072 184137 168343 147411 128528 115590 148275 169684 208620
12818B08620K625J3867n0363k4772l0723N1860J0053k1440j9065j8572K0696O414
$$ 208620 211245 225112 174749 149977 119254 171114 181167 159727 140662 122090 142786 149200
12806A49200J8745J4703O7994j5019m1627o5349p3366j6476L9149P6036Q060K773
$$ 149200 167945 182648 250642 235623 193996 128647 55281 38805 77954 153990 162050 164823
12794A64823J0815r756K3025P655k1507K375J4616k3113k1181M5565M9827j9208
$$ 164823 175638 165882 188907 196562 175055 177430 192046 168933 147752 193317 243144 223936
12782B23936k6415K1241L1276k9389p888K9065k5695p600k7865j9294k4962j4183
$$ 223936 197521 218762 250038 220649 212761 241826 216131 208531 180666 161372 136410 122227
12770A22227r961K4515L4101K3070m5456m3920j3192M7650R606k8886m7232K892
$$ 122227 112266 136781 170882 193952 148496 104576 91384 139034 148640 119754 72522 75414
12758G5414p31N2639J5220J8595J2770M9604K8171l0365n400m865m2504J6377
$$ 75414 74683 127322 142542 161137 173907 223511 251682 221317 215917 211052 168548 184925
12746A84925j3879j3494j6621Q942J5934J9871J3543j1622k4289m4501p189J8083
$$ 184925 171046 157552 140931 149873 165807 185678 199221 187599 163310 118809 111620 129703
12734A29703q446j9342n9217N0044M9903J0970L7819l0540n888L9239K1715J4574
$$ 129703 121257 101915 42698 92742 142645 153615 191434 160894 155006 194245 215960 230534
12722B30534j916j6185o0553K5979J4157J7734k8166n5014o2O0214P710L9936
$$ 230534 228618 212433 151880 177859 192016 209750 181584 126570 126508 186722 194432 234368
12710B34368l34k9322l2332l0070r182L373K9603J0679J3555k3278O3429L2330
$$ 234368 234034 204712 172380 142310 133128 136501 166104 176783 190338 167060 230489 262819
12698B62819j895r7374m9563j985N147L3959L4926M7214K587m3860p349k5146
$$ 262819 260924 163550 113987 112002 117149 151108 186034 233248 235835 191975 184626 159480
12686A59480K6098Q326j4611J3475J065J1893k1738j3479K0178p353K069r530
$$ 159480 185578 193904 179293 192768 193833 205726 183988 170509 190687 183334 185403 175873
12674A75873j649l4335m3482j3295J0104J3210M1918j9595K7761L6585J0402j3728
$$ 175873 174224 139889 96407 83112 93216 106426 148344 128749 156510 193095 203497 189769
12662A89769j6917J245J9932j7451k4727j7722J0108R187L2000p502j9582K6947
$$ 189769 172852 174097 194029 176578 151851 134129 144237 153424 185424 177922 158340 185287
12650A85287O761k037M5386N0485j1448R069o159J3278m4266n5833J0011N0420
$$ 185287 192048 190011 235397 285882 274434 283503 277344 290622 246356 190523 200534 250954
12638B50954r683J4136K1417M7913K706K0622J9345O665K109m5120K8634k1365
$$ 250954 241271 255407 276824 324737 327443 348065 367410 374075 376184 331064 359698 338333
12626C38333k7765L3614J144J9410k1706o8374j3797M0939J2081J6253k0159l3231
$$ 338333 310568 344182 345326 364736 343030 274656 260859 301798 313879 330132 309973 276742
12614B76742k4081k2663M816N9594J9583m6855J6899L8345J765N6502k0968N7088
$$ 276742 252661 229998 234814 294408 313991 267136 284035 322380 324145 380647 359679 416767
12602D16767M8371p2696J4211r766j8407K0740j9692l700P495J7825M0533Q91
$$ 416767 465138 392442 406653 396887 378480 399220 379528 375828 383323 401148 441681 442572
12590D42572M5326l896k0385K4668P0952Q2844J4886J0271N0382J19397R5650
$$ 442572 487898 484002 463617 488285 559237 642081 656967 667238 717620 837017 932667
12579I32667O6041J29020J50820J54318K07669L01060M41828O10348R87345J449240
$$ 932667 998708 1127728 1278548 1432866 1640535 1941595 2383423 2993771 3981116 5430356
12569E430356J996470K803532L690911M539693L920246o11006n095758n386667
$$ 5430356 7426826 10230358 13921269 18460962 22381208 21770202 16674444 11287777
12561A1287777l599308k184905j378169r38918o40549l89841k70012k75397k17292
$$ 11287777 7688469 5503564 4125395 3186477 2545928 2156087 1886075 1610678 1393386
12552A393386q9230j07788j01345o3091r4477p8899q0838n7227n1592m1195j930
$$ 1393386 1304156 1196368 1095023 1031932 937455 858556 777718 720491 668899 627704 625774
12541F25774L5413l2973n289R912j0606m7231l1593m1761m5097L875o773k602
$$ 625774 661187 628214 622925 632837 622231 575000 543407 501646 456549 460424 453651 451049
12529D51049M1636q778m9551q609L054k4044l2331m2877k7157O6281K9238R079
$$ 451049 492685 483907 434356 425747 428801 404757 372426 329549 302392 368673 397911 406990
12517D06990K21j3640K927l01K1890O4047J8223J0099R557o3836j7568n481P347
$$ 406990 407211 393571 396498 396197 418087 482134 500357 510456 520013 456177 438609 433128 440475
12504D40475J7637j7826l5405L864L0399J8477j9305p856J0351k1363O117r684
$$ 440475 458112 440286 404881 408745 439144 457621 438316 430460 440811 419448 425565 415881
12492D15881k0988K0224j6988p970K2997Q697l80o6800m3534M60O0850j3135l0995
$$ 415881 394893 415117 398129 390159 413156 421853 421473 354673 311139 311599 372449 359314 328319
12479C28319K1843O360l6746J1620J4840Q189N208n5078Q2056K5121m9122J9531
$$ 328319 350162 356522 319776 331396 346236 354425 359633 304555 386611 411732 362610 382141
12467C82141L1230m44p55o988j0675J7738k3069j2008R830P154P6190L8779n6721
$$ 382141 413371 412927 412172 405184 394509 412247 389178 377170 387000 394154 470344 509123 452402
12454D52402L7875n0644n8981k864K6313L7915N351J9611J9437K9175k6731k8722
$$ 452402 490277 439633 380652 377788 404101 442016 447367 466978 486415 515590 488859 460137
12442D60137K0544p341J2510J0211M3706K2080P605M9536Q316m2094k890P732
$$ 460137 480681 473340 485850 496061 539767 561847 569452 618988 627304 585210 582320 590052
12430E90052m6135m7353q886K926m778L4351M3013l2707L853L0786j3989j8936
$$ 590052 543917 496564 487678 490604 485826 520177 563190 530483 534336 565122 551133 532197
12418E32197M5941k4577n0655k9246n207K452j7487K3189M4946P1536m5102k1968
$$ 532197 578138 553561 502906 473660 468453 470905 453418 476607 521553 593089 547987 526019
12406E26019j7267j7089M8236j4795r7143p591O4334p701L3689J5330l2767o0121
$$ 526019 508752 491663 539899 525104 427961 420370 484704 477003 510692 526022 493255 433134
12394D33134q626N1441L1803j3576J5032J7695L9152L5017O540j7635j4115L893
$$ 433134 424508 475949 507752 494176 509208 526903 566055 601072 607612 589977 575862 579755
12382E79755p151K9685k3486k8203k1317l3588J4029K2531n130O435M6252p712
$$ 579755 572604 602289 578803 550600 529283 495695 509724 532255 527125 533560 579812 572100
12370E72100l0969m3830k2562L8281L8512K0128k0335R594j596K856M221K2686
$$ 572100 541131 497301 474739 513020 551532 571660 551325 560919 559323 562179 566400 589086
12358E89086L1849N043n7005J0335O4786L2023L218O332o4661j8494j9352Q174
$$ 589086 620935 625978 568973 579308 644094 676117 679335 685667 621006 602512 583160 591334
12346E91334K8392N7470L4684l7183k2723J9421m1770p332P479K9548l471q686
$$ 591334 619726 677196 711880 674697 651974 671395 629625 622293 629772 659320 655849 647163
12334F47163K3396k7420m1397k4587K4299M6331R548J7597k7058K687j3304j464
$$ 647163 670559 643139 601742 577155 601454 647785 657333 674930 647872 650559 637255 635791
12322F35791M9079k0164m41K4547J5340k2862L277J4006q500J8717K5394l8886
$$ 635791 684870 664706 664265 688812 704152 681290 684567 698573 690073 708790 734184 695298
12310F95298j802N4379P6442L0634j4758l1344m0530k6527k7825K6650O2651k770
$$ 695298 693496 747875 824317 854951 840193 808849 768319 741792 713967 740617 803268 800498
12298H00498p421j0211m1436n2296J2034P4692J1106p1701L181J4794k3934P404
$$ 800498 793077 782866 741430 689134 701168 775860 786966 715265 718446 733240 709306 716710
12286G16710J3897m678l1466K6166L3998J2985J9481j4831N4366j467K1982j2563
$$ 716710 730607 725929 694463 720629 754627 767612 787093 772262 826628 825161 847143 834580
12274H34580l2130k2044l4933K965N8340J7982J8614N7169j0511m4805j9620j8005
$$ 834580 802450 780406 745473 748438 806778 824760 843374 900543 890032 845227 825607 807602
12262H07602K9921O4348l4081K1904N6149j2879K6033J8144l8364l7538k400j0089
$$ 807602 837523 901871 867790 889694 945843 932964 958997 977141 938777 901239 898839 888750
12250H88750q922r736J664K7052j8802m3448M74O2365L0334O879J9733M5326K0590
$$ 888750 879828 870092 871756 898808 880006 836558 837032 899397 929731 936610 956343 1001669 1022259
12237A022259j154J4502m8839K1000J0190J7180k078Q490O6192J8640r7632k6270
$$ 1022259 1021105 1035607 986768 1007768 1017958 1035138 1033060 1041550 1107742 1126382 1028750 1002480
12225A002480J0052K2521K5563R774L0783J0047j5741K7159M3234k6373K355N4534
$$ 1002480 1012532 1035053 1060616 1070390 1101173 1111220 1095479 1122638 1165872 1139499 1141854 1196388
12213A196388M0952l9320l7994K2143L2635M245k7124k4503l6972j9161M1971
$$ 1196388 1237340 1198020 1160026 1182169 1214804 1219049 1191925 1167422 1130450 1111289 1153260
12202A153260j5977K0282N2882n91j7001N5715R036K2527k6058k5204p621L6416
$$ 1153260 1137283 1157565 1210447 1209856 1192855 1248570 1257606 1280133 1254075 1228871 1221250 1257666
12190A257666k3335l6923R953J7026L3276N4487L8025Q861L494k704n3005L9034
$$ 1257666 1234331 1197408 1207361 1224387 1257663 1312150 1350175 1359036 1362530 1359826 1306821 1345855
12178A345855K5352j5576l4913N5569O5699J0109k0363k1715k919l1067M8130
$$ 1345855 1371207 1355631 1320718 1376287 1441986 1452095 1431732 1410017 1407098 1376031 1424161
12167A424161J8977l3l857O3971L0409k0662j5889N509p29J3932N555R956j4399
$$ 1424161 1443138 1443105 1439248 1503219 1533628 1512966 1497077 1502586 1501857 1515789 1521344 1531300 1516901
12154A516901K3456L2717q347K5170l225j3070j5319j8675J2107J04987N201M4214
$$ 1516901 1540357 1573074 1564727 1589897 1586672 1573602 1558283 1539608 1551715 1656702 1661903 1706117
12142A706117M3255m6343o820Q77L1984L4094O315l208l1506n9642K0147J8040
$$ 1706117 1749372 1703029 1696209 1697086 1729070 1763164 1769479 1766271 1734765 1675123 1695270 1713310
12130A713310N3493K3434j0256m0J7417P146L9872O1093L0163J8754M644k7520
$$ 1713310 1766803 1790237 1779981 1779941 1797358 1804504 1844376 1905469 1935632 1954386 1959030 1931510
12118A931510j0040J7135K0172K5918K0319K151O1094p081M5672N5827L3079o2146
$$ 1931510 1921470 1938605 1958777 1984695 2005014 2007165 2068259 2061178 2106850 2162677 2195756 2133610
12106B133610K8307J9062M5405L381o0109j9323n579P2073k1532K6019K8206N7319
$$ 2133610 2161917 2180979 2226384 2229765 2169656 2150333 2144754 2216827 2195295 2221314 2249520 2306839
12094B306839N5151M9753P9099k0095o3270j3925O455L9209Q2296M6528P007r813
$$ 2306839 2361990 2411743 2490842 2470747 2407477 2393552 2400007 2439216 2521512 2568040 2575047 2565234
12082B565234K1040k8691n389M2098L6241k0192l8804p1124k2477M6790J0415
$$ 2565234 2586274 2557583 2552194 2594292 2630533 2610341 2571537 2500413 2477936 2524726 2535141
12071B535141P396N7128L4137N947M7511P9601L6089k0428K8369Q8920M047k3303
$$ 2535141 2542537 2599665 2633802 2639749 2687260 2766861 2802950 2782522 2810891 2899811 2903858 2880555
12059B880555k9177K4443K1826R217n2851L1694J05731r438Q720J245j3424j4745
$$ 2880555 2851378 2875821 2897647 2906864 2854013 2885707 2991438 2982000 2990720 2991965 2978541 2963796
12047B963796K0923R6072J6384l1208O081K263L250O848J9926J6054L2984O9788
$$ 2963796 2984719 3080791 3097175 3065967 3072048 3074311 3077561 3084409 3104335 3120389 3153373 3223161
12035C223161M7109L2832m9304o6791Q628J07391R875j9087J2874J7799N449M1665
$$ 3223161 3270270 3303102 3253798 3187007 3195635 3303026 3312901 3293814 3306688 3324487 3329936 3371601
12023C371601N5574o792J1896K9075L6432l3535j2508N6248M5103L1373N5557
$$ 3371601 3427175 3420383 3432279 3461354 3497786 3464251 3451743 3507991 3553094 3584467 3640024
12012C640024K6500N3421L1079O202P497j1905k8876K4477K1754m0923J3856M6620
$$ 3640024 3666524 3719945 3751024 3757226 3764723 3752818 3723942 3748419 3770173 3729250 3743106 3789726
12000C789726Q6489k8739m8954k1366K8869P8933J6406l312M1117J654n2078K2850
$$ 3789726 3876215 3847476 3798522 3777156 3806025 3884958 3901364 3898052 3939169 3940823 3888745 3911595
11988C911595M7620m3533k7840J2770M2762K9433R9279J6654n3878j0954M062
$$ 3911595 3959215 3915682 3887842 3900612 3943374 3972807 4072086 4088740 4034862 4023908 4027970
11977D027970j3968k4527p061M7240L2742P830P87L2330O159Q164Q8520M3421
$$ 4027970 4014002 3989475 3982414 4029654 4062396 4070226 4071013 4103343 4109502 4117666 4206186 4249607
11965D249607r125l6601l3807l8718L1580k000L7385L9647k1574L7612p266P465
$$ 4249607 4240482 4203881 4170074 4131356 4162936 4160936 4198321 4237968 4216394 4254006 4246740 4254205
11953D254205M495l7203l0852k2833L2831J7909M7512l7931k8391K4447L5055
$$ 4254205 4258700 4221497 4190645 4167812 4200643 4218552 4266064 4228133 4199742 4224189 4259244
11942D259244q12l4529R245j8834O501m6083m6688J8956O8096k9724l673j2954
$$ 4259244 4258432 4223903 4233148 4214314 4220815 4174732 4128044 4147000 4215096 4185372 4181699 4168745
11930D168745m230P4991O276j3333k7933m1030j5401L1215k5537o900j6747l8644
$$ 4168745 4164515 4239506 4245782 4232449 4204516 4163486 4148085 4179300 4153763 4146863 4130116 4091472
11918D091472p185K8197l1948m990j8825J4450Q1389J5495k7227m3657r4547n6124
$$ 4091472 4084287 4112484 4080536 4075546 4056721 4071171 4152560 4168055 4140828 4097171 4002624 3946500
11906C946500Q990P751k502l9819K333N0194k872O517l8333p3376J8453k9480
$$ 3946500 3955490 3963241 3960739 3920920 3923253 3973447 3970575 3977092 3938759 3865383 3883836 3854356
11894C854356j609K6660j7349m4849j3927L2940l2802m334k6373j6204j6045j1507
$$ 3854356 3852747 3879407 3862058 3817209 3803282 3836222 3803420 3799086 3772713 3756509 3740464 3728957
11882C728957M178q288j5560j05646N556L2400k5962k2978m5081p9685k1840L4029
$$ 3728957 3733135 3724847 3709287 3603641 3609197 3641597 3615635 3592657 3547576 3467891 3446051 3480080
11870C480080J7243n4201l2364K9919j1558j7565J1348k0006l5548L607k0783
$$ 3480080 3497323 3443122 3410758 3440677 3429119 3411554 3422902 3402896 3367348 3370955 3350172
11859C350172k3137L8672o4066l0331l8331k6048m0071l7562k3732k5750p472
$$ 3350172 3327035 3365707 3301641 3271310 3232979 3206931 3166860 3129298 3105566 3079816 3072344
11848C072344J0126k8266p5167k3504M0139K5504j5667j3744M150l3905K72k2649
$$ 3072344 3082470 3054204 2979037 2955533 2995672 3021176 3005509 2991765 2995915 2962010 2962282 2939633
11836B939633l5703l6375l0491j0769J2835k8877p1651k7228R026m806k8059n0831
$$ 2939633 2903930 2867555 2837064 2826295 2839130 2810253 2738602 2711374 2720400 2715594 2687535 2636704
11824B636704l8393K4808R831p362j9035l1776L995L509n5966p6936k1639m6628
$$ 2636704 2598311 2623119 2632950 2625588 2606553 2574777 2578772 2582281 2526315 2449379 2427740 2381112
11812B381112K438p463p140j132l6197j2846J6129j0240o2010K3021J5068M99
$$ 2381112 2383550 2376087 2368947 2367815 2331618 2318772 2334901 2324661 2262651 2285672 2300740 2301239
11800B301239N857K0085k1024q2083J6355l465q8429n9861j1859J9323J8960K5703
$$ 2301239 2307096 2327181 2306157 2224074 2240429 2236964 2148535 2088674 2076815 2096138 2115098 2140801
11788B140801M0208l8223j2263j448O488j4749o5382k8122M0910j6141j3767j4250
$$ 2140801 2181009 2142786 2130523 2129075 2135563 2120814 2055432 2027310 2068220 2052079 2038312 2024062
11776B024062l5782j9067L1026J2872r074p7554m4498m15M5696J1319o9013j7781
$$ 2024062 1988280 1969213 2000239 2013111 2004037 1926483 1881985 1881570 1927266 1938585 1869572 1851791
11764A851791N371k3273k3579R328K1500p2535k7k3739J5000l1330K620K942j9940
$$ 1851791 1857162 1833889 1810310 1819638 1841138 1768603 1768576 1744837 1759837 1728507 1731127 1734069 1714129
11751A714129k0700J2844J2103K1947m0563o3629o0639l007Q176o3873k1794N908
$$ 1714129 1693429 1706273 1718376 1740323 1699760 1636131 1575492 1572485 1580661 1516788 1494994 1500902
11739A500902J2283k357R054J8297j8900L4675O5102K1441l6699n5748Q07l6398
$$ 1500902 1513185 1510828 1519882 1538179 1519279 1553954 1619056 1640497 1603798 1548050 1548857 1512459
11727A512459m1732j3086K0853j7127j0096O367k7833N24L191J8330q433K0419
$$ 1512459 1470727 1457641 1478494 1461367 1451271 1457638 1429805 1430329 1433520 1451850 1443417 1463836
11715A463836j0141l9420k6037J0216L4635m7358p399O1987j6396o8424l7350
$$ 1463836 1453695 1414275 1388238 1398454 1433089 1385731 1378332 1440319 1423923 1355499 1318149
11704A318149O8089k99o3539l3131J3214j5255j3054k1173K0066J5160J2026J4948
$$ 1318149 1386238 1385939 1322400 1289269 1302483 1287228 1274174 1253001 1273067 1288227 1300253 1315201
11692A315201Q029m4242r13K4879l4295j9896L1127m8153m0035L1113k072M048
$$ 1315201 1323230 1278988 1278075 1302954 1268659 1248763 1279890 1231737 1191702 1222815 1220743 1224791
11680A224791p060M199K1344O5020O4984Q347J6043M5345N4701L5880N1282R378
$$ 1224791 1217731 1221930 1243274 1308294 1373278 1381625 1397668 1443013 1497714 1533594 1584876 1594254
11668A594254N2702M5341R5197J09539J32090J34685J69801K41617L11359L61717
$$ 1594254 1646956 1692297 1787494 1897033 2029123 2163808 2333609 2575226 2886585 3248302
11658C248302N02796O52513Q76590J237126J751736K472101L282722M168549M783520
$$ 3248302 3751098 4403611 5280201 6517327 8269063 10741164 14023886 18192435 22975955
11649B2975955M300042J516209k833302n448015n215624l960862k680025j806407
$$ 22975955 27275997 28792206 25958904 20510889 15295265 11334403 8654378 6847971
11641F847971j296688r38741o66927m90850l75393k61178k83510k39353k15346
$$ 6847971 5551283 4612542 3945615 3454765 3079372 2818194 2534684 2295331 2079985
11632B079985j85075j15521o7358o1603n5322k8354m5401n2403M036o5720o6826
$$ 2079985 1894910 1779389 1712031 1650428 1595106 1566752 1521351 1468948 1472984 1407264 1340438
11621A340438o8501n8047l0945l6777M1250K7929o1136n9209j6432m5276m5410
$$ 1340438 1271937 1213890 1182945 1146168 1187418 1215347 1154211 1095002 1078570 1033294 987884
11610I87884o5699o1595j8268J4850M8197J6184m689l1998L8237r922k9167o94
$$ 987884 922185 860590 842322 857172 905369 921553 916864 884866 923103 913181 884014 883320
11598H83320K768L1871o0330j4627l677N2580j3579k7813k522r155l1802j3475
$$ 883320 886088 917959 857629 843002 839325 891905 878326 850513 847991 838836 807034 793559
11586G93559K8690j1732j0568m5019o1837k2580q252K0684J3975o5880o1975Q044
$$ 793559 822249 810517 799949 754930 693093 670513 662261 682945 696920 631040 569065 577109
11574E77109K6894K6043O5634K3719l1485j8193k2014r144j0315q353k0232n8809
$$ 577109 604003 630046 695680 719399 687914 669721 647707 638563 628248 619895 599663 540854
11562E40854R746O0304L3471n4436m7998K7455k3493o347L2879j0391j1194j6149
$$ 540854 550600 610904 644375 589939 541941 569396 545903 539556 572435 562044 550850 534701
11550E34701J1503J8254L949O774K8396P300q1056j2052j6522K3542M1236j8390
$$ 534701 546204 564458 568407 575181 603577 610877 529821 517769 501247 524789 566025 547635
11538E47635l0183J8715J5040O9158K2880n9715j2400j0428k687J0073m4548j9306
$$ 547635 517452 536167 551207 620365 643245 583530 571130 560702 558015 568088 523540 504234
11526E04234M884K9354j3043l383k243r283K5339J6904L754q017m1930m2438M6516
$$ 504234 509118 538472 525429 522046 519803 510520 535859 552763 556517 548500 506570 464132 510648
11513E10648J9978n5987m3555p238K0341M6526J7165j3375j9784j4846K8025L4764
$$ 510648 530626 474639 431084 423846 444187 490713 507878 494503 474719 459873 487898 522662
11501E22662k8143k7307r109j1306m4355L381P1707k9988l0447l4895j3780L0528
$$ 522662 494519 467212 458103 446797 402442 405823 477530 447542 417095 382200 368420 398948
11489C98948L5251M5573r330j0611l318l5690n4920M475q35N5761p459L4730q382
$$ 398948 434199 479772 470442 459831 456513 420823 365903 370378 369543 425304 417845 452575 444193
11476D44193k4255J2505Q865n0650n8603O745O1824J9025J2935J6473m3997J2417
$$ 444193 419938 432443 441308 390658 332055 338800 400624 419649 432584 449057 405060 417477
11464D17477k6689m0888k2402m3449K5613K7427N1801O681k6788R695K2337j1646
$$ 417477 390788 349900 327498 284049 309662 337089 388890 395571 368783 378478 400815 389169
11452C89169J8714M4497o8588n7194j7696q710N4234K3318l6434J4466K0735M675
$$ 389169 407883 452380 383792 326598 308902 300192 354426 377744 341310 355776 376511 381186
11440C81186J5622o173j5038J1328n0863m4662j9637m725k2983J9626J6643j7419
$$ 381186 396808 390635 375597 386925 336062 291400 271763 267038 244055 263681 280324 262905
11428B62905n0098j1613P906J8106K4025K7232Q423k0701k334o4687k8515R7486
$$ 262905 212807 201194 209100 227206 251231 278463 286886 266185 263851 199164 170649 268135
11416B68135O7364R891L4044m018j3751k3134k6449K3766j9989k0615J54K4867
$$ 268135 335499 345390 379434 375416 361665 338531 312082 335848 315859 295244 295398 320265
11404C20265K045l3895k7076K548J552l4471N0171M4818K1269p60L585O305O472
$$ 320265 322310 288415 261339 263887 265439 230968 281139 325957 347226 346466 350051 356356 362828
11391C62828P699o4454l7470l3777N5318K0135J1277j1795J2596J2342K9204m6032
$$ 362828 370527 306073 268603 234826 290144 310279 321556 309761 322357 334699 363903 317871
11379C17871n9020J0264J3346P750J17k8562M773J0474o950m2418j9720K8366
$$ 317871 258851 269115 282461 290211 290328 261766 266539 277013 270063 227645 207925 236291
11367B36291J5217K2654K9448m4964n2M074j786J8256J6277K2365n4560o1559
$$ 236291 251508 274162 303610 258646 258594 262668 260882 279138 295415 317780 263220 201661
11355B01661N2233J0929l1235k9023k3916K7889O3102K9300k1092K53l7718J0910
$$ 201661 253894 264823 233588 204565 180649 208538 271640 300940 279848 280101 242383 253293
11343B53293p19n3000m9996J7724l832o059q02K3927K7960N1431K1086K7552J0162
$$ 253293 252574 199574 149578 167302 163470 157411 156609 180536 208496 259927 281013 308565 318727
11330C18727j5304m2683l2694l2709n4800n3724K8250R731P907J7245J4434Q1135
$$ 318727 303423 260740 228046 195337 140537 86813 115063 124794 132701 149946 164380 245515
11318B45515K5640j0141j4529m8307m4548N7877m382j2194j661Q489j718m4263
$$ 245515 271155 261014 246485 198178 153630 211507 207125 194931 193270 201759 200041 155778
11306A55778k680K0798P214P282J1645J0351J3071k1523p0206m1099L5672M1546
$$ 155778 153098 173896 181110 188392 200037 210388 223459 201936 131730 90631 126303 167849
11294A67849l7281j1829L2824N3385N6379L9860q138m7014j09732p1296J6591
$$ 167849 130568 118739 151563 204948 261327 301187 293049 246035 136303 65007 81598
11283H1598K2111K9963L0997k5851J0976L5282M848m5709j1981Q866M3924j8162
$$ 81598 103709 133672 164669 138818 149794 185076 189924 144215 132234 141100 185024 166862
11271A66862l7230M4585J8166J8480J00020m1245q7718p3034l8728M1323N8011
$$ 166862 129632 174217 192383 210863 310883 269638 181920 108886 70158 111481 169492
11260A69492L8131L3689r096m6831m691j4352q026N0443M8761l2415Q296Q466
$$ 169492 207623 241312 232216 185385 180694 166342 158316 208759 257520 225105 233401 241867
11248B41867l3794j4228n9014p810q445j7185J890L2538Q0928J5938J7555k8p6930
$$ 241867 208073 193845 134831 127021 118576 101391 103281 135819 216747 232685 250240 250212 173282
11235A73282l2647J3833M205K9720m1441j0658R772L9663J2364j499J9489K69
$$ 173282 140635 154468 158673 188393 146952 136294 146066 185729 198093 196594 216083 216352
11223B16352l3151p3267j1440N0495R811j9669j7608j9271N2449L3473l5255N82
$$ 216352 183201 109934 98494 148989 158800 139131 121523 102252 154701 188174 152919 153501
11211A53501O0149K9855o9437p085L261P5052M3140m2549k0448m2941L1395j5551
$$ 153501 213650 243505 174068 166983 170244 245296 288436 245887 225439 182498 213893 198342
11199A98342n646l8948k3478j0353n5856K4222K2273N2976K2679L296K7267n0933
$$ 198342 192696 153748 130270 119917 64061 88283 110556 163532 186211 189507 216774 165841
11187A65841k6572N285M1841j3289m1054n1397m589K0629K3700K375K0431K1189
$$ 165841 139269 144554 186395 173106 132052 80655 76066 96695 120395 122770 143201 164390
11175A64390j6037n2581J7436m0780L0713j3761m2545m0564L4922O3877M2056
$$ 164390 148353 95772 113208 72428 103141 89380 46835 6271 41193 105070 147126
11164A47126J53j0894m7126m140J7550j2355j2927J5464q111j9970Q039K7112
$$ 147126 147279 136385 89259 85119 102669 90314 77387 92851 84740 64770 72809 99921
11152I9921K8644L1019J1022l7540k8068n0668m6575O6050N9945J2726n1836J3740
$$ 99921 128565 159584 170606 133066 104998 54330 7755 73805 133750 146476 94640 108380
11140A08380N9663k1893p5818k2718j1941P5844M1154r3757j3289K7621J5980
$$ 108380 168043 146150 70332 47614 35673 111517 152671 58914 45625 73246 89226
11129H9226n556J3644L3671J6853j7659p493m1496l474q591J4829J8659j3768
$$ 89226 83670 97314 130985 147838 130179 122686 81190 77716 69125 83954 102613 88845
11117H8845j2313j4799L6625L1062m6703l8814L6013J7726J5733K5091K0771k4811
$$ 88845 76532 61733 98358 129420 82717 43903 79916 97642 113375 138466 159237 134426
11105A34426j0383o133J3662q380k7420J5939j1514L4704J2779m3886J1o553q740
$$ 134426 124043 117910 131572 123192 95772 111711 100197 134901 147680 103794 103805 97252 88512
11092H8512J6022P485j5194q354m3842l4185L18J3318J2565O8016N2517o8307
$$ 88512 104534 112019 96825 88471 44629 10444 10762 24080 36645 104661 157178 88871
11080H8871j4867o3160M7351O3252m1874n1877M4853K6790m7408K5189o9q9204
$$ 88871 74004 10844 58195 121447 79573 27696 72549 99339 51931 77120 77051 -12153
11068a2153O693J2748K6944J6923k3528M8158O38j7617M4656M1588m0230N164
$$ -12153 -5460 7288 34232 51155 27627 75785 76423 58806 103462 145050 104820 109984
11056A09984J9101L3483K3351Q263K3984N3134k990m5309k7496K5380O3702m1559
$$ 109984 129085 162568 185919 194182 218166 271300 268310 223001 195505 220885 284587 243028
11044B43028M2162L7574K4991q172j0065L443K9338K0416j1201J2561J13076R2080
$$ 243028 285190 322764 347755 339583 329518 332961 362299 382715 371514 384075 497151 589231
11032E89231P6157L6045l9448o7267m9702n8715l664M801Q930P6200Q0898J04029
$$ 589231 665388 701433 661985 594718 545016 486301 482637 487438 496368 572568 653466 757495
11020G57495M313k4550j7819o8497n0382m4183o6977P386J14598M8993j1105k0802
$$ 757495 761808 737258 719439 650942 600560 556377 489400 496786 611384 660377 649272 628470
11008F28470m284n4736p4070n6573k9834l4441k3842k4835m4721J775L3329J8146
$$ 628470 624186 569450 495380 438807 408973 374532 350690 325855 281134 282909 316238 334384
10996C34384J5972l7802q4870q2180o6017O586M3404J7382l7924K507o9828m925
$$ 334384 350356 312554 227684 145504 79487 86073 129477 146859 108935 111442 41614 36689
10984C6689K7227n260o2671j2340j6753m688O4014L9868M1862J213k3762m3526
$$ 36689 63916 58656 -4015 -16355 -33108 -37796 26218 66086 107948 109161 85399 41873
10972D1873q1775j6893N2436N3419N836M9060j2301n2463m7755L6432N8141n5591
$$ 41873 -39902 -56795 -4359 49060 54896 103956 91655 39192 -8563 27869 86010 30419
10960C0419l2379l7444L2440L0378j2805j9075j2379N439J9999l742n5263n76
$$ 30419 -1960 -39404 -6964 23414 10609 -8466 -20845 -15406 4593 851 -54412 -54988
10948e4988L0476N9364P0767L0032l0007l5768m6909l5835P1005k3251k1797J6987
$$ -54988 -24512 34852 105619 135651 105644 69876 22967 -12868 58137 34886 13089 30076
10936C0076p8117m065O0743N3317l5155k7186k2575R371K5749j3311l0187j1837
$$ 30076 -48041 -52106 8637 61954 26799 -387 -22962 -13591 12158 -1153 -31340 -43177
10924d3177J3505n341k843L6313L7333O7622j4373l282J4977p046N46K4115K0791
$$ -43177 -29672 -35013 -37856 -1543 35790 103412 89039 85757 100734 93688 94234 118349 139140
10911A39140l6178j8122l2559j2077r605L712r084K7474m3452N7161N5504k7344
$$ 139140 102962 84840 52281 40204 30599 34311 25227 52701 9249 66410 121914 94570
10899I4570L708n5328l6898p685j7234J5840K6881N2497J4456k2011n655k3096
$$ 94570 98278 42950 6052 -1633 -18867 -3027 23854 76351 90807 68796 63141 40045
10887D0045J0268O5271N8690L3319p7301r2034j3272J2721K4859K830M1964r374
$$ 40045 50313 115584 174274 207593 130292 38258 24986 37707 62566 65396 107360 97986
10875I7986K8020j2910k3426K7601K9290m9397j9967K2099m703l2923K896M4441
$$ 97986 126006 113096 89670 117271 146561 97164 77197 99296 94593 61670 64566 109007
10863A09007K8539k2924k9564m0734l2L1715p529n698J9377N3761m331P499J4172
$$ 109007 137546 114622 85058 44324 44292 76007 68478 62780 82157 135918 131587 139086 153258
10850A53258j3944r1156q325j1317N0840P7491k1880q2353J2958K1831J109K7308
$$ 153258 139314 48158 39833 28516 79356 156847 134967 52614 65572 87403 88512 115820
10838A15820m427k3774p003J4560j2792k8720n9919j410O0940J4125J6861L2320
$$ 115820 111393 87619 80616 95176 82384 53664 -6255 -7665 53275 67400 84261 116581
10826A16581j0620l1865k7486J1944k5491J1286k551j5474L6364l1505l570j4057
$$ 116581 105961 74096 46610 58554 33063 44349 41798 26324 62688 31183 27613 13556
10814A3556O889k620m0908J6574J4241K408K5071J9404K5173K738n27j1760k7183
$$ 13556 20445 17825 -23083 -6509 7732 10140 35211 54615 79788 82526 81999 70239 43056
10801D3056j9370J2262j8445J9291l9159j9487J7455N1313O194k0651n3529l8229
$$ 43056 23686 35948 17503 36794 -2365 -21852 -4397 46916 53110 32459 -21070 -59299
10789e9299O1601L0717J2083k9949j7828J2685O8735J6073p1620L929M4334l9286
$$ -59299 2302 33019 45102 15153 -2675 10010 78745 94818 23198 27127 71461 32175
10777C2175m4870j0088J8471j0756n90o8199n569L9049J5247q047k966L2478L4465
$$ 32175 -12695 -22783 -4312 -15068 -15658 -83857 -89426 -50377 -35130 -43177 -46143 -13665 20800
10764B0800n047J8516k4924l717l0578K2399P610j7455p056j9234J6408N172J3512
$$ 20800 15753 34269 9345 5628 -24950 -2551 5059 -12396 -19452 -38686 -22278 -17106 -3594
10751c594J3966K2866l5755l1856L3668L7380m1562k1412p035n1561o297K4835
$$ -3594 10372 33238 -2517 -34373 -705 36675 -4887 -26299 -33334 -84895 -91192 -66357
10739f6357N5547M9501O3500k6317q2601m8305j269K2327k8254N3865P9400K1173
$$ -66357 -10810 38691 102191 75874 -6727 -55032 -56301 -33974 -62228 -8363 71037 92210
10727I2210L7262L6703K8503l2246o6793r7794l3342n0540o367R9094M4728M7587
$$ 92210 129472 166175 194678 162432 95639 -2155 -35497 -86037 -92404 6690 51418 99005
10715I9005O3226K536m2920m8150j03317n7193l7816j10N3854P0150N6958L5246
$$ 99005 162231 164767 121847 73697 -29620 -86813 -124629 -124739 -70885 -735 56223 91469
$$ [...]
##END NTUPLES=NMR SPECTRUM
##END=
