##TITLE=Analysis number 327484
Compound Code cc 22909
Book Reference 241899
Project Code adrs flro3
Chemist Name jom
##JCAMPDX= 6.0         $$ Bruker NMR JCAMP-DX V2.0
##DATA TYPE= NMR SPECTRUM
##DATA CLASS= NTUPLES
##ORIGIN= Bruker BioSpin GmbH
##OWNER= nmr
$$ XWIN-NMR		Version 3.5
$$ Tue Mar 27 11:09:03 2007 GMT Daylight Time (UT+1h)  MAYBRIDGE\nmr@NMR_250MHZ
##.OBSERVE FREQUENCY= 250.131544655141
##.OBSERVE NUCLEUS= ^1H
##.ACQUISITION MODE= SIMULTANEOUS (DQD)
##.ACQUISITION SCHEME= undefined
##.AVERAGES= 16
##.DIGITISER RES= 18
##SPECTROMETER/DATA SYSTEM= dpx250
##.PULSE SEQUENCE= zg30
##.SOLVENT NAME= CDCl3
##.SHIFT REFERENCE= (INTERNAL, CDCl3, 0, 16.4531)
##AUDIT TRAIL= $$ (NUMBER, WHEN, WHO, WHERE, WHAT)
$$ ##TITLE= Audit trail, XWIN-NMR		Version 3.5
$$ ##JCAMPDX= 5.01
$$ ##ORIGIN= Bruker BioSpin GmbH
$$ ##OWNER= nmr
$$ C:\u/data/dgb/nmr/ADRS/2140/pdata/1/auditp.txt
$$ ##AUDIT TRAIL=  $$ (NUMBER, WHEN, WHO, WHERE, WHAT)
(   1,<2007-03-27 11:08:43.00 +100>,<MAYBRIDGE\nmr>,<NMR_250MHZ>,
      <created by zg, POWCHK disabled, PULCHK disabled
       configuration hash MD5:
       49 4B E0 1D 92 C2 6B 37 9F E6 65 BC 52 41 86 1D
       data hash MD5: 64K
       06 83 D3 A1 4B 14 3C 54 F1 BE 75 7A 81 77 83 99>)
(   2,<2007-03-27 11:08:54.93 +100>,<MAYBRIDGE\nmr>,<NMR_250MHZ>,
      <Start of raw data processing
       ef LB = 0.3 FT_mod = 6 PKNL = 1 SI = 32K 
       data hash MD5: 32K
       78 37 DC 2B 06 46 99 25 07 BF BC C9 5C 74 9E CF>)
(   3,<2007-03-27 11:08:56.61 +100>,<MAYBRIDGE\nmr>,<NMR_250MHZ>,
      <apk 
       data hash MD5: 32K
       30 B1 3C AD D9 CD 2D 55 E8 7A A3 10 35 44 A0 E8>)
(   4,<2007-03-27 11:08:57.32 +100>,<MAYBRIDGE\nmr>,<NMR_250MHZ>,
      <abs ABSG = 5 
       data hash MD5: 32K
       5E 6C BA 4D CD 6B E8 9E 1C 1B 55 59 7C D5 72 EB>)
$$ ##END=
$$ 
$$ hash MD5
$$ A6 C9 98 ED 74 04 D0 10 D8 B4 D0 A6 BD E6 76 28
##$RELAX= 
##$RELAX= 
##$RELAX= 
##$RELAX= 
##$RELAX= 
##$RELAX= 
##$RELAX= 
$$ Bruker specific parameters
$$ --------------------------
##$DU= <C:\u>
##$EXPNO= 2140
##$NAME= <ADRS>
##$PROCNO= 1
##$TYPE= <nmr>
##$USER= <dgb>
##$AMP= (0..31)
100 100 100 100 100 100 100 100 100 100 100 100 100 100 100 100 100 100 
100 100 100 100 100 100 100 100 100 100 100 100 100 100 
##$AQSEQ= 0
##$AQ_mod= 3
##$AUNM= <au_zg>
##$AUTOPOS= <16 >
##$BF1= 250.13
##$BF2= 250.13
##$BF3= 250.13
##$BF4= 250.13
##$BF5= 500.13
##$BF6= 500.13
##$BF7= 500.13
##$BF8= 500.13
##$BYTORDA= 1
##$CFDGTYP= 0
##$CFRGTYP= 5
##$CHEMSTR= <none>
##$CNST= (0..31)
1 1 145 1 1 1 1 1 1 1 1 1 1 1 1 1 1 1 1 1 1 1 1 1 1 1 1 1 1 1 1 1 
##$CPDPRG= <>
##$CPDPRG1= <>
##$CPDPRG2= <>
##$CPDPRG3= <>
##$CPDPRG4= <mlev>
##$CPDPRG5= <mlev>
##$CPDPRG6= <mlev>
##$CPDPRG7= <mlev>
##$CPDPRG8= <mlev>
##$CPDPRGB= <>
##$CPDPRGT= <>
##$D= (0..31)
0 1 0 0 0 0 0 0 0 0.06 0 0 0 0 0 0 0.0002 0 0 0 0 0 0 0 0 0 0 0 0 0 0 
0 
##$DATE= 1174990122
##$DBL= (0..7)
120 120 120 120 120 120 120 120 
##$DBP= (0..7)
150 150 150 150 150 150 150 150 
##$DBP07= 0
##$DBPNAM0= <>
##$DBPNAM1= <>
$$ [...]
##$SUBNAM7= <"">
##$SUBNAM8= <"">
##$SUBNAM9= <"">
##$SW= 20.6930455092707
##$SWIBOX= (0..15)
0 0 3 0 0 0 0 0 0 0 0 0 0 0 0 0 
##$SW_h= 5175.983436853
##$TD= 65536
##$TD0= 1
##$TE= 683.16
##$TE2= 300
##$TE3= 300
##$TEG= 300
##$TL= (0..7)
0 120 120 120 120 120 120 120 
##$TP= (0..7)
150 150 150 150 150 150 150 150 
##$TP07= 0
##$TPNAME0= <>
##$TPNAME1= <>
##$TPNAME2= <>
##$TPNAME3= <>
##$TPNAME4= <>
##$TPNAME5= <>
##$TPNAME6= <>
##$TPNAME7= <>
##$TPOAL= (0..7)
0.5 0.5 0.5 0.5 0.5 0.5 0.5 0.5 
##$TPOFFS= (0..7)
0 0 0 0 0 0 0 0 
##$TUNHIN= 0
##$TUNHOUT= 0
##$TUNXOUT= 0
##$USERA1= <user>
##$USERA2= <user>
##$USERA3= <user>
##$USERA4= <user>
##$USERA5= <user>
##$V9= 5
##$VALIST= <valist>
##$VCLIST= <CCCCCCCCCCCCCCC>
##$VD= 0
##$VDLIST= <DDDDDDDDDDDDDDD>
##$VPLIST= <PPPPPPPPPPPPPPP>
##$VTLIST= <TTTTTTTTTTTTTTT>
##$WBST= 1024
##$WBSW= 4
##$XGAIN= (0..3)
0 0 0 0 
##$XL= 0
##$YL= 0
##$YMAX_a= 335023
##$YMIN_a= -399315
##$ZGOPTNS= <>
##$ZL1= 120
##$ZL2= 120
##$ZL3= 120
##$ZL4= 120
##$ABSF1= 16.45313
##$ABSF2= -4.240042
##$ABSG= 5
##$ABSL= 3
##$ALPHA= 0
##$AQORDER= 0
##$ASSFAC= 0
##$ASSFACI= 0
##$ASSFACX= 0
##$ASSWID= 0
##$AUNMP= <proc_1d>
##$AZFE= 0.1
##$AZFW= 0.1
##$BCFW= 0
##$BC_mod= 0
##$BYTORDP= 0
##$COROFFS= 0
##$CY= 12.5
##$DATMOD= 1
##$DC= 0
##$DFILT= <>
##$DTYPP= 0
##$F1P= 14.0000005364418
##$F2P= -0.99999901652339
##$FCOR= 0.5
##$FTSIZE= 32768
##$FT_mod= 6
##$GAMMA= 0
##$GB= 0
##$INTBC= 1
##$INTSCL= 1
##$ISEN= 128
##$LB= 0.3
##$LEV0= 0
##$LPBIN= 0
##$MAXI= 10000
##$MC2= 0
##$MEAN= 0
##$ME_mod= 0
##$MI= 0
##$NCOEF= 0
##$NC_proc= -3
##$NLEV= 6
##$NOISF1= 0
##$NOISF2= 0
##$NSP= 0
##$NTH_PI= 0
##$NZP= 0
##$OFFSET= 16.45313
##$PC= 1
##$PHC0= 237.6869
##$PHC1= 4.728787
##$PH_mod= 1
##$PKNL= yes
##$PPARMOD= 0
##$PSCAL= 4
##$PSIGN= 0
##$REVERSE= no
##$SF= 250.130017223685
##$SI= 32768
##$SIGF1= 0
##$SIGF2= 0
##$SINO= 400
##$SIOLD= 32768
##$SREGLST= <1H.CDCl3>
##$SSB= 0
##$STSI= 32768
##$STSR= 0
##$SW_p= 5175.98343685301
##$SYMM= 0
##$S_DEV= 0
##$TDeff= 65536
##$TDoff= 0
##$TI= <Analysis number 999999
Compound Code 99
Book Reference 9
Project Code 9>
##$TILT= no
##$TM1= 0
##$TM2= 0
##$TOPLEV= 0
##$USERP1= <user>
##$USERP2= <user>
##$USERP3= <user>
##$USERP4= <user>
##$USERP5= <user>
##$WDW= 1
##$XDIM= 32768
##$YMAX_p= 297496851
##$YMIN_p= -201537
$$ End of Bruker specific parameters
$$ ---------------------------------
##NTUPLES= NMR SPECTRUM
##VAR_NAME=  FREQUENCY,     SPECTRUM/REAL,   SPECTRUM/IMAG
##SYMBOL=    X,             R,               I
##VAR_TYPE=  INDEPENDENT,   DEPENDENT,       DEPENDENT
##VAR_FORM=  AFFN,          ASDF,            ASDF
##VAR_DIM=   32768,         32768,           32768
##UNITS=     HZ,            ARBITRARY UNITS, ARBITRARY UNITS
##FACTOR=    0.157963299565203, 1,           1
##FIRST=     4115.42187088888, 0,            0
##LAST=      -1060.56156596413, 0,           0
##MIN=       -1060.56156596413, -201537,     0
##MAX=       4115.42187088888, 297496851,    0
$$ Real data points
##PAGE= N=1
##DATA TABLE= (X++(R..R)), XYDATA
$$ [...]
16175c8761K7757N74L3061m3567l289j1718J4729P890K4378l2125j8425n289Q152
16162c6633K0183R845K530K9583j0443K2636J101M3220J1197J3355j6798o2939
16150B6837l4160j2862J3518R653K1057l7326J3092k8699n492L6922r968k3660
16138c1088j9115O157K2128L9089L536l4518N520j6206Q774L2609O786J3537M869
16125D2078j7067k2337J1487K4605K166m3305j772k2866o0996J596N2049N2199
16113A7837j9781l8079l0777p282L6553L5569M8399j7783K20J1140j3726j85l4635
16100a2530p253M351K1038m3231N955j7608o640Q001j5087J6719M5929j9837L829
16087a6364J2778j8504J7150L0657L0992k1419j3433j0088Q026O775R629k4215
$$ plain form
16175 -38761 -11004 -10430 22631 -20936 -24225 -35943 -21214 -13324 11054 -21071 -39496 -44785 -36633
16162 -36633 -16450 -6605 -4075 25508 15065 37701 38802 82022 93219 106574 89776 26837
16150 26837 -7323 -20185 -6667 2986 24043 -13283 -191 -28890 -34382 2540 -7428 -31088
16138 -31088 -50203 -44046 -21918 17171 20707 -13811 -8291 -24497 -15723 16886 23672 37209 42078
16125 42078 25011 2674 14161 38766 40932 -2373 -4145 -27011 -88007 -86411 -34362 17837
16113 17837 -1944 -40023 -70800 -78082 -41529 -5960 42439 24656 24876 36016 22290 22105 -12530
16100 -12530 -19783 -15432 5606 -37625 -31670 -49278 -55918 -47917 -63004 -46285 -356 -20193 -16364
16087 -16364 -3586 -22090 -4940 25717 56709 35290 21857 11769 19795 26570 36199 11984
16075A1984j7067k7587K1085K9322J0524k9598K2075P207J01N812r646O045o926
16062B3331k2936j2600l413k2213j6999K2270k981m8488n97J4945L9946M2982
16050A3247p181m1146O972j146j4346Q611J3887J3920M9563j4032o0155k8577
16038f0383K4295M5792k37k4763J7814r764L6353Q23q527k887k4878q438J2001
16025b799J106M0364j0428k3296J340J8929L8524p315n2506J2693Q619j713o442
16012A7076q661L7313j2993p9732K6225j4078m5505N1K7014M9347J3039p023j7633
15999a5560J8149K9109K2286m3561q5939j4701J5674p35J0629Q647N4562L9678
15987C8238k064j4949j1096j9339k4183L2732j2784n0280M782J5412j1734Q499
$$ plain form
16075 11984 -5083 -32670 -11585 17737 28261 -1337 20738 27945 28046 33858 24212 30257 23331
16062 23331 395 -12205 -15618 -37831 -54830 -32560 -35541 -84029 -84626 -69681 -29735 13247
16050 13247 6066 -35080 -28108 -29254 -43600 -34989 -21102 -7182 42381 28349 -31806 -60383
16038 -60383 -36088 9704 9467 -15296 2518 -7246 29107 29930 21403 18516 -6362 -14800 -2799
16025 -2799 -1693 38671 28243 4947 6287 25216 63740 56425 3919 16612 25231 23518 17076
16012 17076 8415 45728 32735 -46997 -20772 -34850 -80355 -80304 -53290 -3943 9096 2073 -15560
15999 -15560 2589 31698 53984 10423 -75516 -90217 -74543 -75278 -64649 -56002 -1440 38238
15987 38238 36174 21225 10129 -9210 -33393 -661 -13445 -63725 -58943 -43531 -55265 -46766
15975d6766L883p09M2594L2399l0186l1498J3107K7416N0936l5387l576L2607
15963E4820J1716l7589k9975l1554j2492J4945j0574j3275J0620r666o783K2569
15951c7238p507j9871K301P717k655M4210J4969j3945Q820l8264m9510R022N2710
15938b9241N2335J8391l3194l4054J031k1001J0410J7006K5458K1243M1381j8374
15926E1391m3083k3741K6772K5918O580k8240k4721M7073N2506o2157r971k567
15914A5760j2371K1158j2184K3431K0084K0861m064q710l3677m4699k1437L9108
15902C260M4010r440n565j7023j5220M897Q00M97J9182J645J6688k8150J0463
15889B6044L4794r744k6306L0459l90m3839j471L860j6081l1544k4332l741J1226
$$ plain form
15975 -46766 -42883 -43592 -998 31401 1215 -30283 -17176 10240 61176 25789 22213 54820
15963 54820 66536 28947 -1028 -32582 -45074 -30129 -40703 -53978 -43358 -53024 -59807 -37238
15951 -37238 -44745 -64616 -62315 -54598 -57253 -13043 1926 -12019 -3199 -41463 -90973 -81951 -29241
15938 -29241 23094 41485 8291 -25763 -24732 -45733 -35323 -18317 7141 28384 69765 51391
15926 51391 8308 -15433 11339 37257 43837 15597 -9124 37949 90455 28298 18327 15760
15914 15760 3389 24547 12363 35794 55878 76739 72675 63965 30288 -14411 -35848 3260
15902 3260 47270 37830 32265 15242 22 4919 5719 6216 25398 27043 43731 15581 26044
15889 26044 60838 51094 24788 55247 54857 11018 9547 13407 -2674 -34218 -58550 -62291 -51065
15876e1065O15J9365P066j0938j751Q814r709K2386K5828R042l6744k3517M862
15863c5746l3967K086r39M3504o154k6861N4285K565j3993J58k1550k7937k257
15850f6806Q242k7256K43M9580K348j4242L1846R092k3364N99K5463n1078l1049
15837h6382j2116o861L6367L4392K130l4m2141o223L0548L1528J5188J6094k6297
15824a3807m4396M0793J3854L6313j1859j1787j161K4907K898n9512j5451J9708
15812a9500j1892J6478K1569J9137k6551n6208L0410M1863k7310j9319K290K7259
15800a774K5843J5244k7961m8481k3280N5002J0588P16J983k6818J8760K0109
15788A9931k2406j5557p164n400j2422L1870o51n627r769P945J7830M0219K6438
$$ plain form
15876 -51065 -50450 -31085 -24019 -34957 -36708 -27894 -37603 -15217 10611 19653 -17091 -40608 -35746
15863 -35746 -69713 -67627 -68566 -25062 -31216 -58077 -3792 -1227 -15220 -15062 -36612 -64549 -66806
15850 -66806 -58564 -85820 -85577 -35997 -33649 -47891 -16045 -6953 -30317 -29718 -4255 -55333 -86382
15837 -86382 -98498 -105359 -68992 -34600 -32470 -32504 -74645 -80868 -50320 -18792 -3604 12490 -13807
15824 -13807 -58203 -17410 -3556 32757 20898 9111 7950 32857 35755 -23757 -39208 -19500
15812 -19500 -31392 -14914 6655 25792 -759 -56967 -26557 15306 -12004 -31323 -29033 -1774
15800 -1774 24069 39313 11352 -37129 -60409 -5407 5181 5897 7880 -18938 -178 19931
15788 19931 -2475 -18032 -25196 -30596 -43018 -11148 -11799 -17426 -27195 -19250 -1420 38799 65237
15775F5237l5426J8423K6568J5057n8907l0850k0680K7569M518m0470k186K0092
15763a1055J2672l8002j7233l0528k8261Q278P3286N7991l3205p410q0132K818
15751i0781Q9060K5371j0180j7506j6608m293K569K2611J5890k8621k4243j7060
15739e3791L885K0885L459J3207N120k0956k2107L6281j2359k7917K5098K4349
15727d846J2483j2651J4157J5940j4781k2406K5603J6574k5677m1293j6653J6827
15715c6723L3605o800n2332l276J1175L7295L0539l4032P538k1133k2729K7885
15703b8988o594M3268L1526l2086n9773k6069l566M3682K6376m55J586R501k1449
15690b3041l7036m8969j6074L8712P1124K1502K2984J378k289n6235k0125J0058
$$ plain form
15775 65237 29811 48234 74802 89859 30952 102 -20578 6991 11509 -28961 -31147 -11055
15763 -11055 1617 -36385 -53618 -84146 -112407 -104129 -30843 27148 -6057 -13467 -93599 -90781
15751 -90781 -1721 23650 13470 -4036 -20644 -24937 -22368 243 16133 -12488 -36731 -53791
15739 -53791 -49906 -29021 -25562 -12355 -7235 -28191 -50298 -14017 -26376 -54293 -29195 -4846
15727 -4846 7637 -5014 9143 25083 10302 -12104 13499 30073 4396 -36897 -53550 -36723
15715 -36723 -3118 -9918 -62250 -65526 -54351 -17056 13483 -20549 -13011 -34144 -56873 -28988
15703 -28988 -35582 7686 39212 7126 -52647 -78716 -82282 -38600 -12224 -12679 -11093 -1592 -23041
15690 -23041 -60077 -109046 -125120 -86408 -15284 6218 29202 30580 28291 -27944 -48069 -38011
15678c8011O315j0229n463K0927q37P743K467l5137M1636J7855l7162q0255j4116
15665a24267N4369K977j6171J9731J1511K2053M506l1202j5191K4169P080k3951
15653f4386K5613K0875J764k326J5162m725k4517K370j888K5557N461j105k2158
15640b4303K5785J9587j5724M596p259j0479j4057r394L0800J140j7385L608J2038
15627a047J0481j4799M8423l4152o4369K3654M4851L140L0183j6753o1796j8197
15615e0381R716k0651K1793K983J0710M1394J3055j1673k0472n3437n041K5363
15603c6641R53m062J7293k3131j0848Q41j6701J0113k0091j5186L9743J1151L500
15590d3066K6033J9274k1538p587K4577R070k5739K0759K0053J4875m1053l9163
$$ plain form
15678 -38011 -31696 -41925 -47388 -26461 -27298 -19555 -17088 -52225 -10589 7266 -29896 -110151 -124267
15665 -124267 -69898 -66921 -83092 -63361 -51850 -29797 -25291 -56493 -71684 -47515 -40435 -64386
15653 -64386 -38773 -17898 -16134 -18460 -3298 -8023 -32540 -30170 -32058 -6501 -1040 -2145 -24303
15640 -24303 1482 21069 5345 9941 2682 -7797 -21854 -31248 -448 692 -16693 -13085 -1047
15627 -1047 9434 -5365 43058 8906 -55463 -31809 13042 16182 46365 29612 -32184 -50381
15615 -50381 -40665 -61316 -39523 -36540 -25830 15564 28619 16946 -3526 -56963 -62004 -36641
15603 -36641 -35688 -39750 -22457 -45588 -56436 -55595 -72296 -62183 -82274 -97460 -57717 -46566 -43066
15590 -43066 -17033 2241 -19297 -26884 -2307 6763 -18976 1783 21836 36711 -4342 -43505
15578d3505L2554o33k9815K7252J0080j4437M6569j2900m2228k5576l028P1241
15566A5574N291j3418J9439o129m5184n512n177J1691N423J5046k923J6901k9480
15553a8458l141K6065K1993K6949l927j9825K812O6J5444k0765m6009k9559n465
15540e3820L5140J3979j4540m8011N003L0415R034l4445l1399K3529k99q181J0981
15527f2614M2371K080k549j1297K4080j4444l5243j2597K0606J5053l3081N435
15515f2200J6203N1806j4092j4756j8940Q128N037K264k2101O911K8358k7372
15503d0754K6714J1666J2526k3799k6874K5459m18l562r325j5130l0213K1131
15491e2579L9288j1602J7718L6582j4699M633j7680K9268q708P744l184j7016
$$ plain form
15578 -43505 -10951 -11584 -41399 -14147 -4067 -18504 28065 15165 -27063 -52639 -55667 15574
15566 15574 20865 7447 26886 20757 -24427 -29939 -35116 -23425 -18002 -2956 -5879 11022 -18458
15553 -18458 -21599 4466 26459 53408 49481 29656 32468 32534 47978 27213 -18796 -48355 -53820
15540 -53820 -18680 -4701 -19241 -67252 -62249 -31834 -22800 -57245 -88644 -65115 -65414 -73595 -62614
15527 -62614 -20243 -18163 -20712 -32009 -7929 -22373 -57616 -70213 -49607 -34554 -67635 -62200
15515 -62200 -45997 5809 -8283 -23039 -41979 -33851 -28814 -26550 -48651 -41740 -13382 -40754
15503 -40754 -14040 -2374 10152 -13647 -40521 -15062 -15480 -19042 -28367 -43497 -73710 -52579
15491 -52579 -13291 -24893 -7175 29407 14708 19341 1661 30929 22221 29965 26781 9765
15479I765j8881N735j9777j5294Q677R383J376J2262K1391j6464J6802P698R010
15466C1683m1546L7645K898j9685J8931j7566N0353k7076k8029j428Q383K4942
15454C9505m1194k6410J947J5115j0508Q192n962L7877K6219K2780l0246l3423
15442C892L604M5664K8105M997l1538j6733n6569p0113j7151L3579L1916j0160
15430e0507j0618m934L314O4331J1935J4696M9365J77n1640l7863N359J7121M077
15417A4813n8984k7103p472K7044J3031q287Q866J4066k5065j0187L9917J9336
15405b5j6238n4602J1905M7355o866k8208j1463j2494P810P209k0209l6547Q372
15392a04001M0303K044L5350P8769k090m2642k2406K7270l7007j5553J1750K370
$$ plain form
15479 9765 -9116 -3381 -23158 -38452 -29775 -20392 -19016 -6754 14637 -1827 14975 22673 31683
15466 31683 -9863 27782 30680 10995 29926 12360 62713 35637 7608 6180 14563 39505
15454 39505 -1689 -28099 -26152 -11037 -21545 -13353 -19315 18562 44781 67561 37315 3892
15442 3892 7496 53160 81265 86262 54724 37991 -18578 -88691 -105842 -72263 -40347 -50507
15430 -50507 -61125 -66059 -62745 1586 13521 28217 77582 77759 26119 -11744 -6385 10736 14813
15417 14813 -44171 -71274 -78746 -51702 -38671 -46958 -38092 -24026 -49091 -59278 -19361 -25
15405 -25 -16263 -70865 -58960 -11605 -18471 -46679 -58142 -70636 -62826 -55617 -75826 -112373 -104001
15392 -104001 -63698 -61654 -26304 52465 50375 7733 -14673 12597 -24410 -39963 -28213 -25843
15380b5843L6226K3325k2388K3266J7300j7460j9242p968K9121k7628p241R691
15368A1159k1075n4954k6378l1967o443q03N2603J7347K2503P2340o1334j6896
15356d3898l756j851k6452L1439R817J8602j0050Q273k1143k5230j5764L9954
15344d0059L9059j3745k4897k6486J7237o361K1361K1437L3142o83j3967l6199
15332c0161k3468j1499J8318l220k5875J803j6322N826M0106N293j0501K7714
15320b1986N8379n386l147j9003J29Q836L2589L1503m8048l2084n2523P286j5615
15307e9070J683r067O2183K9109l05m9117p065L017q2k261R211j5343l0845L941
15293f4011K0782L2862L5819j160M186k330l0271K9947J0150m6837J4334J8124
$$ plain form
15380 -25843 10383 33708 11320 34586 51886 34426 15184 7216 36337 8709 1468 11159
15368 11159 -9916 -64870 -91248 -123215 -129658 -130461 -77858 -60511 -38008 34332 -27002 -43898
15356 -43898 -47654 -49505 -75957 -44518 -34701 -16099 -26149 -17876 -39019 -64249 -80013 -40059
15344 -40059 -1000 -14745 -39642 -66128 -48891 -55252 -33891 -12454 20688 20005 6038 -30161
15332 -30161 -53629 -65128 -46810 -50030 -75905 -74102 -90424 -84598 -44492 -39199 -49700 -21986
15320 -21986 36393 31007 27860 8857 8986 17822 50411 81914 33866 1782 -50741 -43455 -59070
15307 -59070 -57387 -66454 -4271 24838 24533 -24584 -31649 -28632 -28714 -30975 -21764 -37107 -67952 -64011
15293 -64011 -43229 -10367 25452 24292 28478 26148 -4123 25824 35974 -10863 3471 21595
15281B1595o919n483m3256j8992M883p990k699M7498O3036J7125l6329q444K3268
15268D7293k382k4967n7161n4951M2866l241k7621J8309L5170K0786k3966m8097
15256g7962L5813M5361r957k1866R931J230J3635L8995j4807M546K810J4012L5288
15243G7029n0688m6555p419N4795L7429k6362n3395l6230o441k3234M3261J2700
15231b5110K1531K7273l819j3702J6062j1251L1037J251l2718j8012k6282k6980
15219f0720j304K1863M5242L4984k221l3735k1519j9741r044k2798J3313l4159
15207h9839M0035L7748M3462J0597l3479j1510j2271k5247l0530q420K2685J7263
15195c9506K4572Q629j7484k5087K2685L4498L4516j6409j8881m6359k6063m528
$$ plain form
15281 21595 14676 9193 -34063 -53055 -48172 -56162 -58861 -11363 51673 68798 32469 24025 47293
15268 47293 44911 19944 -37217 -92168 -49302 -52543 -80164 -61855 -26685 -5899 -29865 -77962
15256 -77962 -42149 3212 -6745 -28611 -18680 -17450 -3815 35180 20373 24919 27729 41741 77029
15243 77029 26341 -20214 -27633 27162 64591 38229 -15166 -51396 -57837 -81071 -37810 -25110
15231 -25110 -3579 23694 19875 6173 22235 10984 42021 43272 10554 -7458 -33740 -60720
15219 -60720 -62024 -40161 5081 40065 37844 4109 -17410 -37151 -46195 -68993 -55680 -89839
15207 -89839 -49804 -12056 31406 42003 8524 -2986 -15257 -40504 -71034 -79454 -56769 -39506
15195 -39506 -14934 -6305 -23789 -48876 -26191 8307 42823 26414 7533 -38826 -64889 -69417
15183f9417l6449P282J3865r89K9624K1312J1330P700j0553J1199K5586N466L72
15170A6328J6801P727P246m016l5573p195P444m7656k6117j0130L8405N801J2189
15157a8746j8835L165J8022o802L137l0464l3540J4427K141j4151o730Q200R530
15144g0646L4061K7390k7341j8646o360n647L2478n2313O034O1545L4212j2708
15132B059j1364p298K6725K0511N216J979k7110j8884Q789r466K986L6055k1272
15119H926j5908j2600m411R671J5249J9830J1283l775j9596m4741j1867O7726
15107A9787M353k3371J575K0513L8139j4348j381k7221k3764k5065J2721J2713
15095e349j3844M27N728M2913L4233n6149m1552K3378M8721J892Q913l4699j7280
$$ plain form
15183 -69417 -105866 -98584 -84719 -85708 -56084 -34772 -23442 -15742 -26295 -15096 10490 15956 16328
15170 16328 33129 40856 48102 44086 8513 1318 8762 -38894 -65011 -75141 -36736 -30935 -18746
15157 -18746 -37581 -34416 -16394 -23196 -20059 -50523 -84063 -69636 -67495 -81646 -88376 -80176 -70646
15144 -70646 -36585 -9195 -36536 -55182 -61542 -67189 -34711 -87024 -80990 -19445 14767 2059
15132 2059 -9305 -16603 10122 30633 35849 37828 10718 -8166 623 -8843 -5857 30198 8926
15119 8926 -6982 -19582 -23993 -14322 927 20757 32040 28265 8669 -36072 -47939 19787
15107 19787 24140 769 2344 22857 60996 46648 45267 18046 -5718 -30783 -18062 -5349
15095 -5349 -19193 -18766 -13038 29875 64108 7959 -33593 -10215 38506 40398 49311 14612 -2668
15082b668L762j5588k1038R49p776l3490L121N9965N6487K0025j0561J7986R99
15069G2173k4353p318J0090R100k8575P349k350j6920J4846k0792k5800J1755
15057g95m045k3202m6718j9489L8749o094L8072O6014J9161K6899J2314k1454
15045G9412k9985R87k048j5430J922n511q599R517q573k1551k0833K7791K6308
15032C3407J2213p617L374j7543m2934r412J0045P1j0748K4689k3886m3882M415
15019f7808M3483O1491J2034p2825k1000K7331j9583j4195L0760P532M504K8229
15007A9953O7116l1475l1619l2784k9169M2774L7562k8211k2183L8152M06k3453
14995G069n065J3202J5249k9468l4459J5530R210L309K9527L6766j7633R384J4031
$$ plain form
15082 -2668 1094 -14494 -35532 -34583 -42359 -75849 -72728 -12763 43724 63749 53188 71174 72173
15069 72173 47820 40502 50592 59692 31117 38466 36116 19196 34042 13250 -12550 -795
15057 -795 -4840 -28042 -74760 -94249 -55500 -61594 -23522 42492 61653 88552 100866 79412
15045 79412 49427 50414 48366 32936 34858 29347 20748 30265 21692 141 -20692 7099 33407
15032 33407 45620 38003 41377 23834 -19100 -28512 -18467 -18396 -29144 -4455 -28341 -72223 -67808
15019 -67808 -24325 37166 49200 -23625 -44625 -17294 -36877 -51072 -20312 -12780 -8276 19953
15007 19953 87069 55594 23975 -8809 -37978 4796 42358 14147 -8036 30116 30522 7069
14995 7069 2004 15206 30455 987 -33472 -17942 -8732 -5423 24104 60870 43237 52621 66652
14982F6652j902j2453j6468j1884j0767l289K7962j3766j5824j9780j6867J5279
14970a3107L3538P302j6447M33j8451m2131K7335K5136K6803m399j5091k7816
14958a6895n4440N192K314j3820J7395k7381j5046N8826J5084r083m5518k2698
14946a06070K6083K3684N5072K6860l4330J9934K1516l2951K561m908K8586k866
14934B3171k0014j5181j2165o425M1798K1127n6674k8879j6944j59J8646M2648
14922i051j2329m1554k7128L8205L9749O6039J0303k419n3389o269N500l106J31
14909D682O07K733j8235l0920j6589N710O909K268J2999J5397J9633p587k8405
14896c0798n3944M4899K0461q635J6281o163n370N9070o571n2395l6647k4891
$$ plain form
14982 66652 64750 52297 35829 23945 13178 9889 37851 24085 8261 -11519 -28386 -13107
14970 -13107 20431 27733 11286 11719 -6732 -48863 -21528 3608 30411 26012 10921 -16895
14958 -16895 -71335 -66143 -63829 -77649 -60254 -87635 -102681 -43855 -28771 -37854 -83372 -106070
14946 -106070 -79987 -56303 -1231 25629 -8701 11233 32749 -202 2359 -2549 26037 23171
14934 23171 3157 -12024 -24189 -30614 11184 32311 -24363 -53242 -70186 -70345 -51699 -9051
14922 -9051 -21380 -62934 -90062 -51857 -12108 53931 64234 61815 8426 2157 7657 4551 4682
14909 4682 5289 8022 -10213 -41133 -57722 -52012 -45103 -42835 -29836 -14439 5194 -2393 -30798
14896 -30798 -84742 -39843 -19382 -28017 -11736 -17899 -23269 35801 29230 -23165 -59812 -84703
14884h4703m511K5270J0547M619N176o784k1644K2372L1005j4492LL2982J4167
14871A4007J6053n5412l7575k1558J4311L9312k424m2762p414K6574J3280k3658
14859f7266M7791K9966j22k6706k1720m2427O1446K931J1000L0292P14j0142j232
14846A4525k8714n73M431K5181r761k4835K867j3389J1537K6528J3116M1072j3
14833F1972l9322m7367j1582M3832J7446K9610j5302l1953j541n734L2430p108
14821B5381j7624l8838l7353j5173K5619R785J392M8573l145j9631j6675k0693
14809e8382j5834p86j9769L3501N3771L0730p2437p900K4559p157J6508O342K1957
14796E103M366j2699m068L1756K0820L61m0781m4482k1933J878K569K5780k35
$$ plain form
14884 -84703 -89214 -63944 -53397 -48778 -43602 -50386 -72030 -49658 -18653 -33145 -33142 -160 14007
14871 14007 30060 -25352 -62927 -84485 -70174 -30862 -33286 -76048 -83462 -56888 -43608 -67266
14859 -67266 -19475 10491 10369 -16337 -38057 -80484 -19038 -16107 -5107 25185 25899 15757 14525
14846 14525 -14189 -14762 -10331 14850 5089 -19746 -16879 -30268 -18731 7797 20913 61985 61972
14833 61972 22650 -24717 -36299 7533 24979 54589 39287 7334 5793 59 32489 25381
14821 25381 7757 -31081 -68434 -83607 -57988 -48203 -46811 1762 -1383 -21014 -37689 -58382
14809 -58382 -74216 -75002 -94771 -61270 -7499 23231 -49206 -57106 -32547 -39704 -23196 -16854 5103
14796 5103 9469 -3230 -7298 24458 45278 45639 4858 -39624 -61557 -59679 -57110 -31330 -31565
14783c1565L2972K2556J1080L3433j4018p3005j9197L3553J8964m567K6004l7696
14771a486m934L59r553L886J5407r563L773K2430l8901j3548K1134k3540l128
14758c7664J6932Q783N2814J280j4979k0313j2940p768j3687j8503j7971L4606
14746b9410L6688N94j0758k203j4523l3189j3272l571k083n503J8344M4542K5906
14733A1562K1653J9817l3162l042J4398K1221m9450k154j0725j131m3442k8146
14721h2601J3677J0946k8726R451K5128k3487M5218J4082j2279L0559R246L5397
14709D6611o698j6238L028j603L337l6704K7835J3964j6586l934j1053j1802j7403
14696b7246J926j5432J4103J0028k8639k5749L969K2681m1630L8075N7633R328
$$ plain form
14783 -31565 1407 23963 35043 68476 54458 -18547 -37744 -4191 14773 10206 36210 -1486
14771 -1486 -6420 -6061 -15614 -11728 3679 -5884 -2111 20319 -18582 -32130 -10996 -34536 -37664
14758 -37664 -20732 -11949 40865 42145 27166 6853 -6087 -13855 -27542 -46045 -64016 -29410
14746 -29410 7278 7872 -2886 -5089 -19612 -52801 -66073 -69644 -71727 -77230 -58886 -14344 11562
14733 11562 33215 53032 19870 16828 31226 52447 2997 843 -9882 -11013 -54455 -82601
14721 -82601 -68924 -57978 -86704 -77253 -52125 -75612 -30394 -16312 -28591 1968 11214 46611
14709 46611 39913 23675 26703 25100 28437 -8267 19568 33532 16946 13012 1959 -9843 -27246
14696 -27246 -25320 -40752 -26649 -16621 -45260 -71009 -67040 -44359 -85989 -47914 9719 19047
14684A9047r196j483k4434j8256j414K1240m322k5309J9044k721M5800R461j0274
14671A7183J467l9249o43K3883J6715J7707j8431j8116J4124l1509j1546L373
14659b5042L1814L5772l1648l5597j1717K1386O007K1464K2957j1285k7551m3019
14647d6459l6612N6112J8544K6828M7668N094o99K9911J8052l0455l3975k9287
14635B4722N173L2303p021j5109L7161P406n6479l9891P0738Q3521K0113J9992
14623A82629K7602L7059K4389J7739J1788M5915K108l9432J048r082o6606j6304
14611B18853J8711O61l1849o8719r0647j9140L9540N2666r891J5595J0395L3710
14599A69885J2200j8235J689k0742n525R071J8245M1397l520p658M7732L2933
$$ plain form
14684 19047 9851 8368 -16066 -34322 -35736 -14496 -18818 -44127 -25083 -27804 17996 27457 17183
14671 17183 18650 -20599 -21242 2641 19356 37063 18632 516 14640 -16869 -28415 -25042
14659 -25042 6772 42544 10896 -24701 -36418 -15032 -9025 12439 35396 24111 -3440 -46459
14647 -46459 -83071 -26959 -8415 18413 66081 71175 70476 100387 118439 87984 54009 24722
14635 24722 29895 62198 55177 40068 77229 84635 28156 -11735 59003 142524 162637 182629
14623 182629 210231 247290 271679 289418 301206 347121 349229 309797 310845 301763 235157 218853
14611 218853 237564 238225 206376 137657 47010 27870 67410 120076 110185 125780 136175 169885
14599 169885 182085 163850 165539 144797 139272 148343 166588 207985 204465 196807 244539 277472
14587B77472J6764k3228l0198j531M1881r78j9720K5333n777n1971o2776o6465
14575I8806l660O681j927j5341j5464n1089J3815K5966k2018j1172J668K5733
14563E1998j4424k0181o748K9641k235n6321j7151K4188j2765J0387k2805k7066
14551f3482j762J8528O883j2388L9975L2194p759O21r29l2469J0093j3819r959
14538c4273j4267J6485L1932j3068J601m44j5444M8972j35Q598J3188J1966q048
14525D7063l9523n6304J4932K3694m998J3104K308N259L4308k1988Q29R212l0616
14512b720J8862J4566j1132q924R950K7041l2797k3768Q341L8081M6m1255j6832
14499b0541N0750J3955k6640k2548n861l4711J456J0518j5935l0553K4226J7074
$$ plain form
14587 277472 294236 271008 240810 239279 281160 280182 260462 285795 280018 228047 165271 98806
14575 98806 95146 101827 99900 84559 69095 18006 31821 57787 35769 24597 26265 51998
14563 51998 37574 17393 10645 40286 38051 -18270 -35421 -11233 -23998 -13611 -36416 -63482
14551 -63482 -65244 -46716 -39833 -52221 -12246 19948 12189 12810 11881 -20588 -10495 -24314 -34273
14538 -34273 -48540 -32055 -123 -13191 -11590 -12034 -27478 21494 21359 29957 43145 55111 47063
14525 47063 7540 -48764 -33832 -10138 -15136 -2032 276 5535 39843 17855 18684 27896 -2720
14512 -2720 16142 30708 19576 10652 20602 47643 14846 -8922 -581 37500 37546 -3709 -20541
14499 -20541 30209 44164 17524 -5024 -10885 -45596 -44140 -33622 -49557 -80110 -55884 -38810
14487c8810J0182n797K1563P712J0958l675j4363O6Q67k6449l9354L1336l615
14474d9379P92j0227J4676O6825K4137J8736m0107l484L9119j5443K2790M7914
14462A16349j1918m0961j9876k7212J1172L8494j3716q464m7191K803J0999K8623
14450C9102N4449l1818P74J0816l125m2486j2927L5589o522j070k3974j3243o248
14437f83J6172L351J1413K3007l0595R460L7749O0085L367j3733m125M783K3740
14424A43991k8252l242K5783j6653k7311J1758j1682k2547J370Q683l4291J8533
14412F6140k4725j2624P215l937K573K7746K2876K3133j5396K6773k7572m0212
14400E1990k7270j5818N383J1140l836k566K8357M2065K5020J820m210M093l8240
$$ plain form
14487 -38810 -28628 -34425 -12862 -5150 5808 2133 -12230 -12164 -11297 -37746 -77100 -45764 -49379
14474 -49379 -48587 -58814 -44138 22687 46824 65560 25453 21969 61088 45645 68435 116349
14462 116349 104431 63470 43594 16382 27554 66048 52332 43868 -3323 -520 10479 39102
14450 39102 93551 61733 62507 73323 70198 27712 14785 50374 43852 42782 18808 5565 -683
14437 -683 15489 18840 30253 53260 22665 32125 69874 129959 133326 119593 115468 120251 143991
14424 143991 115739 112497 138280 121627 94316 106074 94392 71845 73215 81898 47607 66140
14412 66140 41415 28791 36006 32069 34642 62388 85264 108397 93001 119774 92202 51990
14400 51990 24720 8902 14285 25425 21589 19023 47380 89445 114465 116285 112075 116168 77928
14387G7928l2629J8421r918j5813O441L0894O365O804K3585j1180j670m4592k503
14374E2133O114l4887l5667j6595n714M3830K8384N9181L8702K124m1077r5226
14362A302m6179M6781R402j8129K3909O831r333J1312O272J7827L2069l3096k283
14349D6685P682O084k8493P934O249J8355O386j6123M869M318l7877m0114j9093
14336c3138K9068l9121J7980L8054M2378l1317k9309j3243p271L35L7177L4159
14324D5752j9681k8726M465K123J3669M2676j2875j9385M8411M1054J3344m083
14312A26744m484j8446k9959M5908O729q222K5306L221o0062K3301J2633R696
14300A32365O750q213K6489k8269K78L6465k9235l9970k2624J0569M9236L4454
$$ plain form
14387 77928 45299 63720 53802 37989 44430 75324 81689 88493 112078 100898 99228 54636 52133
14374 52133 58247 23360 -12307 -28902 -34616 9214 37598 96779 135481 137605 96528 1302
14362 1302 -44877 1904 11306 -6823 17086 23917 14584 25896 32168 49995 82064 48968 46685
14349 46685 54367 60451 31958 39892 46141 64496 70882 54759 59628 63946 26069 -14045 -33138
14336 -33138 -4070 -43191 -25211 12843 55221 23904 -5405 -18648 -25919 -25584 11593 45752
14324 45752 26071 -2655 1810 3933 17602 60278 47403 28018 76429 117483 130827 126744
14312 126744 122260 103814 73855 119763 126492 118270 143576 146797 86735 110036 122669 132365
14300 132365 139115 130902 157391 129122 129400 165865 136630 96660 74036 84605 133841 168295
14288A68295J8857m8910m9116n1801K1532L0141J0810K6247l718j8251m0039j7601
14276D6446K6937N6714O3468k762o4730l1526N3876m686k7132l5421Q98P1432
14264A53514M831m479k8403l1955j9368J4989J2004M6840O2026J7099j3843l2798
14252A80457p0930J8072L4706j124J4651J4043k4268l1757j9661J3782J889p522
14240A22338N331Q407J2726J2140J126J8638J3273K3504J7098K3088M0856N27
14228B99052Q98K609J0232M663k9563J8468N6097P8845l600M971Q558K0275K3495
14215D95000O6860L3004M5712L8285O9795R0733M9854J26120J30285P3833J15841
14204A335322J37808J04346J85328J55110J62782K03978K68343K51962K54637
$$ plain form
14288 168295 187152 138242 89126 37325 58857 88998 99808 126055 122337 104086 64047 46446
14276 46446 73383 130097 193565 190803 126073 94547 148423 143737 116605 81184 82082 153514
14264 153514 158345 153866 125463 93508 74140 89129 101133 147973 209999 227098 213255 180457
14252 180457 109527 127599 162305 161181 175832 189875 165607 133850 114189 127971 129860 122338
14240 122338 127669 136076 148802 160942 162068 180706 193979 217483 234581 257669 298525 299052
14228 299052 299950 302559 312791 317454 287891 306359 362456 441301 437701 442672 451230 471505 495000
14215 495000 561860 594864 640576 678861 748656 839389 889243 1015363 1145648 1219481 1335322
14204 1335322 1473130 1577476 1762804 1917914 2080696 2284674 2553017 2804979 3059616
14195C059616K70238K78375L29180L59440M11348M46658M70646M85775N79778
14186F691054N64964O06875O81469P68831Q40749R39909J119126J173365J326175
14177A4712517J590763J814608K096043K405024K847615L158239L366775L594212
14169C5585796L794845L808632L579914L035740K236429J342468N39413k37853
14161E3685384q82641j561096k184723k725469l087735l099283k856055k513179
14153C4775203k145788j744877j385222j065232p17621m37110k95367q4689O6937
14144B6966234K97199N59355P51655R70953J195625J511372J773640J977628K285307
14135C8288968K471871K502867K567619K459939K176367J629422P85404j88389
$$ plain form
14195 3059616 3329854 3608229 3937409 4296849 4708197 5154855 5625501 6111276 6691054
14186 6691054 7256018 7862893 8544362 9313193 10153942 11093851 12212977 13386342 14712517
14177 14712517 16303280 18117888 20213931 22618955 25466570 28624809 31991584 35585796
14169 35585796 39380641 43189273 46769187 49804927 52041356 53383824 53923237 53685384
14161 53685384 52802743 51241647 49056924 46331455 43243720 40144437 37288382 34775203
14153 34775203 32629415 30884538 29499316 28434084 27716463 27279353 26983986 26899297 26966234
14144 26966234 27263433 27822788 28574443 29545396 30741021 32252393 34026033 36003661 38288968
14135 38288968 40760839 43263706 45831325 48291264 50467631 52097053 52882457 52694068
14127E2694068j124424j907064k575420l109012l598712m099405m336834m306193
14119B7637004m043444l545230l012038k507635k102374j713244j404091j151410
14111H157538r13446q12261o99270n36748n29581m24245l68264l46910l09663
14102C217150k27946j92471k30273j58011r6935j09896j04501j32961j35617j06271
14092A722268p5379p3456m9742m9514o0309n7207m6006m3860r2337l9019j209
14081A134230j7531J3631l0287l6957l3897K4373Q769k9071n0209n6854j8349
14070I07848j6802J5987l6090k871j1029n2222j7189J1610M345J9190M250n922
14058H21105j2342j4165k2001l6675m111p3J3080Q954j475n06q935J2104k9604
$$ plain form
14127 52694068 51569644 49662580 47087160 43978148 40379436 36280031 31943197 27637004
14119 27637004 23593560 20048330 17036292 14528657 12426283 10713039 9308948 8157538
14111 8157538 7244092 6431831 5732561 5195813 4666232 4241987 3873723 3526813 3217150
14102 3217150 2989204 2796733 2566460 2408449 2311514 2201618 2097117 1964156 1828539 1722268
14092 1722268 1646889 1573433 1523691 1474177 1413868 1356661 1310655 1266795 1174458 1135439 1134230
14081 1134230 1116699 1130330 1100043 1063086 1029189 1053562 1062331 1033260 983051 926197 907848
14070 907848 891046 907033 870943 868072 857043 804821 787632 799242 803587 822777 827027 821105
14058 821105 808763 794598 772597 735922 731811 731738 744818 753772 752297 751791 742856 754960 725356
14045G25356j9579L2923K028J1171k0230m2244o1221j0457k8137j0242n4178K6222
14033E51412q616k1732j2406j1448o277R845j5363q230j3769j2219M52m391k6481
14020D20777k2186L5398N868l1213k0835K4164q655N446m261O929m4430l9212
14008C27790J1578l2300k7068K3160n323p333J9940j6177l4302O021j148J654
13996B66492j4694J1318J8006J2597j6471n335l9464j7480j0015l4192K5120q883
13984A86999O691K1803k8303k1453M5422L4794j8571k9449k7726j3249J8011l5387
13972A39582n3429p521K4013k5078L1619L9151J7720J4035j0252k5431M5609k7585
13960A62433l0130M2889J6677o005K9702J8587n354n4181k6371J6196J3996k733
$$ plain form
14045 725356 705777 738700 740728 751899 731669 689425 628204 617747 589610 579368 525190 551412
14033 551412 542796 521064 508658 497210 490933 500778 485415 477185 463416 451197 451649 447258 420777
14020 420777 398591 433989 439857 408644 387809 411973 403318 408764 404503 411432 367002 327790
14008 327790 339368 307068 280000 303160 297837 290504 310444 294267 259965 265986 264838 266492
13996 266492 251798 263116 281122 293719 277248 271913 232449 214969 204954 170762 195882 186999
13984 186999 193690 215493 187190 165737 211159 245953 227382 197933 170207 156958 174969 139582
13972 139582 86153 78632 102645 77567 109186 148337 166057 180092 169840 144409 190018 162433
13960 162433 132303 175192 191869 185864 215566 234153 228799 174618 148247 164443 178439 175706
13948A75706j9554J0884L9537p760m929k2242J2144J4810k1540j097k6819k4812
13936A24328J2591K7672J1687J5850j0999p477Q25J4305j4725k0554l1428K2363
13924A44438k4771J1116n713J1629K1358k7409q799j635L881N5251J0547l9147
13912A50746j0230M4748J1033p1098j8479L5517k2291k8374j1740K119M8263K8385
13900A58599M189k1100J974L7691M6881m4206k8754O220K044l1608Q640M8035
13888A88605J612n5717l2055l8856k5911j235J2126j4401K269R434n223k7187
13876A3461P774N5337L2872k147j9884m37j9740k6524J5075m254K5154j1669M5644
13863A10662J4336k8821l5963N280N2451k3624k7336j3559J1081L525K7186J3444
$$ plain form
13948 175706 156152 167036 206573 198813 193884 171642 183786 198596 177056 175959 149140 124328
13936 124328 136919 164591 176278 192128 181129 173652 174477 188782 174057 153503 122075 144438
13924 144438 119667 130783 125070 136699 158057 130648 121849 120214 124095 179346 189893 150746
13912 150746 140516 185264 196297 125199 106720 142237 119946 91572 79832 81951 130214 158599
13900 158599 162788 141688 143662 181353 228234 184028 155274 161494 163538 131930 140570 188605
13888 188605 190217 134500 102445 63589 37678 36443 48569 34168 36437 45871 40648 13461
13876 13461 21235 76572 109444 107297 87413 86976 67236 40712 55787 51533 76687 65018 110662
13863 110662 124998 96177 60214 65494 117945 94321 66985 53426 64507 68032 95218 108662
13851A08662J5868k454l0082J4668k8492j5445P776K1332J913j0871m1963N667
13839D6579N820R893m4375j3399J7333L1930J414K4372J6949K9773j7427m3048
13827F5814M608Q675n773k1189k8941K3643M299J7056J2723J0822q888K0147K4669
13814A27665K128k5037o279L6208p7418n5824J7680L1594K3693L939l3488r604
13802C5257j6745R130M4553J6952k2535Q392L440L011o491Q945j7332l2247L390
13789C7720m4482M6632N3920n0207n1441K7524L7551J5799l333k8875l7298J4663
13777A8173L0815n826K10K7327l5289k839J8592O73Q75J1594k9897k804L4885
13764F6489k339J458r083K2939j4559l4792J6778l020J8589m711n3908P07J5758
$$ plain form
13851 108662 124530 122076 91994 106662 78170 62725 70501 91833 93746 82875 40912 46579
13839 46579 52399 62292 17917 4518 21851 53781 55195 79567 96516 126289 108862 65814
13827 65814 70422 79097 73324 52135 23194 46837 51136 68192 80915 91737 82849 102996 127665
13814 127665 129793 104756 98477 134685 57267 1443 19123 50717 74410 78349 44861 35257
13802 35257 18512 27642 72195 89147 66612 75004 78444 81455 74964 83909 66577 34330 37720
13789 37720 -6762 39870 93790 43583 -7858 19666 57217 73016 69683 40808 3510 18173
13777 18173 48988 43162 43372 70699 35410 32571 51163 51836 52711 64305 34408 31604 66489
13764 66489 64150 65608 56525 79464 64905 30113 46891 43871 62460 57749 3841 4548 20306
13751B0306j0208j400K3504j931J5767n9j5523J1041M685L2342k497q119l1825
13738C6083J7479M6112j6669L5322K0727J4589J0798k2922k0985K340k4635Q383
13726A06622J7350O106l189k3419j396n6033p3001J8009P7812L1828Q723M9393
13714A58805k0154k8271q138k95M9624O4478l8957J5203J412M5477M3318L3161
13702C15663L7657J0141p9189m2809O8363M4316O671n0459l9046o0043L4778K4195
13690B70238k4763l4469l878j924j3850k078J8995J7110J7066j0410k5268k3093
13678A83676j2599j3327p225N3179J5974l5293Q224L5037M2696K6345o174o89
13666B89824m090j849K0572k6859k2516P453j263m4603o0661j5264P737j3256
$$ plain form
13751 20306 10098 8698 32202 30271 46038 45979 30456 41497 46182 78524 76027 67908 36083
13738 36083 53562 99674 83005 118327 139054 153643 164441 141519 120534 122874 98239 106622
13726 106622 123972 130078 126889 103470 102074 46041 -26960 -8951 68861 100689 109412 158805
13714 158805 138651 110380 102242 101947 151571 216049 177092 192295 193707 239184 282502 315663
13702 315663 353320 363461 284272 241463 309826 354142 360813 310354 271308 211265 246043 270238
13690 270238 245475 211006 207128 205204 191354 189276 208271 225381 242447 232037 206769 183676
13678 183676 171077 157750 150525 203704 219678 184385 192609 227646 270342 296687 290513 289824
13666 289824 285734 283885 304457 277598 255082 262535 261272 216669 156008 140744 148481 135225
13654A35225j2341k1719l3421L7011M5815l2105p1328k7553J5494K822K8745l0976
13642C5669j5729J7687j7518L4831o612m3130m5864j2677l735L9398L5035J8838
13630C6193K0773J668K0550n174k2636n3815j8268J7493K4562K4094m964k6255
13618A4221l0246k5564K3294K0835k6921k2851J4882M0796j0420K6883O308K954
13606C4171k1391l9141k6831K9977K937L9491L6431p973k2190l293j0394n2799
13594d1005o776L1444L7089P349j1903K1035j377j9030J4052K2892j776j1590
13582D0404J6077N646j1048k0090k0983K5340k524N6230J7674j2602o937j6818
13570G0369J0440l1715k4471p003n196k3372k0692K1718m727k0889N3234M2495
$$ plain form
13654 135225 122884 101165 67744 104755 150570 118465 47137 19584 35078 37900 66645 35669
13642 35669 19940 37627 20109 54940 48328 5198 -40666 -53343 -57078 -17680 17355 36193
13630 36193 56966 58634 79184 74010 51374 -2441 -20709 -3216 21346 45440 40476 14221
13618 14221 -16025 -41589 -18295 2540 -24381 -47232 -32350 8446 -1974 24909 31217 34171
13606 34171 12780 -26361 -53192 -23215 -20278 19213 55644 47671 25481 22188 11794 -41005
13594 -41005 -47781 -16337 20752 28101 16198 37233 35856 16826 30878 53770 51994 40404
13582 40404 56481 62127 51079 30989 10006 35346 32822 89052 106726 94124 87187 70369
13570 70369 80809 49094 24623 17620 12424 -10948 -31640 -9922 -14649 -35538 17696 60191
13558F0191m019k0584k1848m243k8478M619R54P236N837J32j4200M133M744k0353
13544b5879O321j9638r890N6698r010m8934r380J6433P1980K1277o7550l1915
13532d9487m518P008l38l0884K3444L6514N3982K2436m9262l5353N4017M1035
13520F8594l4556J0486K6543l1554l9053J562j6464l636L3830N255j0102J6214
13508B7119j713p033M652k2118N057Q35L9455j5489k4009P358J6744L83Q898k3251
13494A6888k6289k3362j6022M5529L3902K3877j7663m8555l8004r915m834L5654
13482b8794J0101n147J8210J241O424j6284k1135R481J0884m015n029K4086P693
13469G716Q915j463J4638K3202n431j5183L582Q969K1143k9030o4659p675o632
$$ plain form
13558 60191 56172 35588 13740 9497 -18981 -14362 -13408 -6172 -335 -203 -14403 -10270 -5526 -25879
13544 -25879 -19558 -39196 -49086 7612 -1398 -50332 -59712 -43279 28701 49978 -17572 -49487
13532 -49487 -54005 -46997 -47335 -78219 -54775 -18261 35721 58157 8895 -26458 27559 68594
13520 68594 34038 44524 71067 39513 460 2022 -14442 -18078 15752 21007 10905 27119
13508 27119 25406 18373 23025 907 5964 6799 46254 30765 6756 14114 30858 31241 40139 16888
13494 16888 -9401 -32763 -48785 -3256 30646 54523 36860 -11695 -49699 -59614 -64448 -28794
13482 -28794 -18693 -23840 -5630 -4389 2035 -14249 -35384 -25903 -15019 -19034 -24063 23 7716
13469 7716 16631 15168 29806 53008 47577 32394 35976 44945 66088 37058 -27601 -35276 -41908
13456d1908K3820J6862K226o973m33k0643K6205K5917L807J474M7423J0777l2251
13443E6303l0229j213q442k9930j8712r075L2386m414l531l7480M777O6488O0939
13430G7867k6396m0113l1224j4748r02N194P639Q399O189m1103j3761N3626K0583
13417A1250J0405o606J708q61N475L9324o191m7953j2945R335j804k2044n887
13404b6794N0574l1649l590K1389j1286K9654N7870k6547k7741j249J0379K1016
13392F2026n4277l4462O372j3988k1385j283O3291j8459m8852K9500L591O5257
13380C7331O796O189j2112n395o856q827O833k0471J7569M518J1318J0518j7400
13367C0011j5139m5154m6928L783k643Q861M1037K3393l9770L6540K7033J006
$$ plain form
13456 -41908 -18088 -1226 1000 -5973 -6406 -27049 -844 25073 28880 30354 77777 88554 56303
13443 56303 26074 24861 16419 -13511 -32223 -41298 -8912 -13326 -16857 -54337 -49560 16928 77867
13430 77867 51471 11358 -19866 -34614 -35516 -30322 -22683 -14284 -8095 -49198 -62959 -9333 11250
13417 11250 21655 15049 16757 15896 21371 60695 54504 6551 -6394 2941 1137 -20907 -26794
13404 -26794 23780 -7869 -11459 9930 -1356 28298 86168 59621 31880 30631 41010 62026
13392 62026 7749 -26713 -20341 -34329 -55714 -56997 6294 -12165 -61017 -31517 -27926 37331
13380 37331 44127 50316 38204 32809 25953 17126 23959 3488 21057 25575 36893 47411 30011
13367 30011 14872 -30282 -77210 -73427 -76070 -67209 -26172 -2779 -42549 -6009 21024 22030
13355B2030L5529j0765o0402O057j5612j6759L5009j2350j5918L2584Q534J725
13343I662n661o3317J6864P287k1189K1627j57N448J2075L3104l5836k7674L7287
13330a0480J7961o690k2591j4191l6752J150O5040J1827k8998p89n850j4360J8064
13317b6659j4617j7223Q821J8953N8928n545m2306J1291J5811J1614j4295o31
13305D142l2963j7392J7564j30j5238m740m5422n695L4578O0079K1574j4808P379
13292H928k5109j945L6467P345j2372M583K0733M114j9128j0956m1197k4298M5436
13279g399O9147j9961n0971r894r141J5820M4839L2037r540n5513k8231K4301
13267d506p074M813j440j2183N694J7732k445k7319l1331k7695L3336m426J3057
$$ plain form
13355 22030 57559 46794 -13608 -7551 -23163 -39922 -4913 -17263 -33181 -597 7937 9662
13343 9662 4001 -59316 -42452 -35165 -56354 -34727 -34884 -29436 -17361 15743 -20093 -47767 -10480
13330 -10480 7481 791 -21800 -35991 -72743 -71593 -6553 5274 -23724 -24513 -30363 -44723 -26659
13317 -26659 -41276 -58499 -49678 -30725 28203 22658 -19648 -8357 7454 19068 4773 4142
13305 4142 -28821 -46213 -28649 -28779 -44017 -48757 -94179 -99874 -65296 -5217 16357 1549 8928
13292 8928 -16181 -18126 18341 25686 13314 17897 38630 42744 23616 12660 -28537 -52835 -7399
13279 -7399 61748 41787 -9184 -19078 -28219 -12399 32440 64477 54937 -576 -28807 -4506
13267 -4506 -11580 -6767 -8207 -20390 -14696 3036 591 -26728 -58059 -85754 -52418 -56844 -43787
13254d3787N3017L4993L5325J8047k8144m7810P42k298J8600k4136k3657m4596
13242e3704l3808M5058J6176L2171J6954J4751k6333K58j2333P040l4844m623
13230c3237K6192J0528p296L1749o24k7898m1081l0459n0073J2761L0110N2128
13218b7200J3470k5350J570L2677l1091J341l50P0302K3340j7706l1289k4860
13206a5146j0432K7115K9356L8832M2526J0777K8467j4240Q004K4955k3651m047
13194A42516K4788M6443J9770M3370P035J8800K8242R6047O7959N7536Q1503J08694
13182G42703J71908J40188J69762J63861J48004K1431j77208k27439k45916k79454
13172F27840k08761j67635o7855j0357m0923m5208n845k7907q544L2945K7683
$$ plain form
13254 -43787 9230 44223 79548 97595 69451 21641 22383 20085 38685 14549 -9108 -53704
13242 -53704 -87512 -42454 -26278 5893 22847 37598 11265 11523 -810 6230 -28614 -33237
13230 -33237 -7045 3483 -3813 27936 27312 -586 -41667 -72126 -122199 -109438 -79328 -27200
13218 -27200 -13730 -39080 -37510 -4833 -35924 -34583 -34933 35369 58709 41003 9714 -15146
13206 -15146 -25578 1537 30893 69725 112251 123028 151495 137255 145259 170214 146563 142516
13194 142516 167304 213747 233517 276887 283922 302722 330964 427011 494970 552506 634009 742703
13182 742703 914611 1054799 1224561 1388422 1536426 1557857 1380649 1153210 907294 627840
13172 627840 419079 251444 183589 173232 132309 87101 81256 53349 44805 77750 105433
13161A05433l6226l4105k2554m3140N0382L3017j7379k1187k1904m958L5819j1714
13149A1484k7966J2210j29l338R160r540J7444p206K13j1174K2403m433m2003
13136c2875n5537k601j4665L9809j7075M5105N645J7345K4384m964k8962M7205
13124B2814K1353O716j6336l8785j452K0067j0342m8147P376K9771L827P91k038
13111d385J0120K3825P352k7852k1770K9214k2765n8234q484K9631J3035J088
13099b9225n1691K92M3286r397J3798k9010l853N6520J0598K0221L6028p158P557
13086E7966l8310m544J6875j913K746j1290k994K013m5603k9663J5887k487k5785
13073f7102J8850j3790j5568J3685J9514l201k196p775J8103L9090L570j541m7694
$$ plain form
13161 105433 69207 35102 12548 -30592 19790 52807 35428 14241 -7663 -12621 23198 11484
13149 11484 -16482 -4272 -4401 -7739 1421 -8119 9325 2119 2332 -8842 13561 9128 -32875
13136 -32875 -88412 -91013 -105678 -65869 -82944 -37839 -32194 -14849 9535 4571 -24391 22814
13124 22814 44167 50883 34547 -4238 -5690 14377 4035 -44112 -36736 -6965 -3138 -2347 -4385
13111 -4385 5735 29560 36912 9060 -12710 16504 -6261 -64495 -72979 -43348 -30313 -29225
13099 -29225 -80916 -80624 -37338 -46735 -32937 -61947 -65800 -9280 1318 21539 57567 50409 57966
13086 57966 19656 15112 31987 30074 32820 21530 18536 20549 -25054 -54717 -38830 -41317 -67102
13073 -67102 -48252 -62042 -77610 -63925 -44411 -47612 -49808 -57583 -39480 -390 3180 1639 -46055
13060d6055j3692J5756J6424m108l9785L0610J3993o439l1327k3419M2767L1242
13048a4033K3569k2123M1184L8495N1768N3635J234l8349k3628J3996J0104J1381
13036A47233k0377J1155j3117o4998m454O777L1714j0196j2819J4517M098m2000
13024D7533J7339L6251Q00l4607j0143J3917O2986k057m9553n0423J4682L9793
13012H6518r331r871O1956K5211l4549l0686K5825J533J2228l4412o397K3068
13000A11093J6193M8628N3662J666p590k3303o7033l1236K4619J9721K907O043
12988A55370J2856j3180l4401j8608J0246m2949o075k5879K2688m2622m0625K550
12976b0629P358N0871K3823l0761l3830O684L4557O178p315L470J38r128Q019
$$ plain form
13060 -46055 -59747 -43991 -27567 -31675 -71460 -40850 -26857 -33296 -64623 -88042 -45275 -14033
13048 -14033 9536 -12587 28597 67092 118860 172495 173729 135380 111752 125748 135852 147233
13036 147233 126856 138011 124894 59896 55442 62219 93933 83737 70918 85435 89533 47533
13024 47533 64872 101123 101923 67316 57173 71090 134076 132019 82466 32043 46725 86518
13012 86518 77187 67316 129272 154483 119934 89248 115073 116606 128834 94422 88025 111093
13000 111093 127286 175914 229576 231242 223652 200349 133316 102080 126699 146420 149327 155370
12988 155370 168226 155046 120645 102037 112283 69334 63259 37380 60068 17446 -23179 -20629
12976 -20629 -13271 37600 61423 30662 -3168 3516 38073 44251 36936 40406 40544 31416 39435
12963C9435l2633k7150k0604O868m05J0926K0932N1439J8859p663j182l0416l0238
12950a832J8318J1406l523J0165J1230n2378K7822Q690k6097J4640K8455m6791
12938A05q647q990L6989o193m1950m66J2776N4650L2636n573J3112l4573k951
12925D0925M599N433o7289k6741K3190L1151k172q729j3337K0151P773J5848j1765
12912A9037R359j061N9075K6926K3570l7404L930L8666J1866M558K3830K4721
12900B07073K0986k8537k2417K5990J2628O667L5461N7790N4281L7555K245k7077
12888C82645o7886j0488p478K8401K2191m5025j6181N4025P422k6504p232K5885
12876C39775k6278k9948J9538N1627N0871O541K8264J0733L2977k1546m8077k3190
$$ plain form
12963 39435 6802 -20348 -40952 -34084 -34489 -23563 -2631 48808 67667 60004 58822 28406 -1832
12950 -1832 16486 27892 24369 34534 45764 -6614 21208 29898 3801 18441 46896 105
12938 105 -8542 -17532 19457 13264 -28686 -29152 -16376 38274 70910 65337 78449 43876 40925
12925 40925 45524 50957 -16332 -43073 -19883 11268 9096 367 -12970 7181 14954 30802 19037
12912 19037 28396 27335 86410 113336 136906 99502 103432 142098 153964 158522 182352 207073
12900 207073 228059 199522 177105 203095 215723 222390 257851 315641 369922 407477 409722 382645
12888 382645 314759 304271 296793 325194 347385 302360 286179 340204 347626 321122 313890 339775
12876 339775 313497 283549 303087 354714 405585 412126 440390 451123 484100 462554 414477 391287
12864C91287j16824j35088o9476o4070j17308p4126j128j4804L2487M7214K220
12853a19616L6173K5412J0079L5767R227J9599P6139k7567k2674J4279j6210k7933
12841A2675L405l8739J2887J9528M4316J9464o080r839p255M236M207L6265K5405
12828A20475L4487L1933J0673K0468l9359m0313J3022K4637L3134M4569K9095
12817B82821K6622m545K3527R065P701K7952K0111Q825j1064j6487L6679J8375
12805D29582q039L1819J2591M127M9071Q2255O5825J9586L4922P4154N1553J10661
12793I58107P3728K6444R5051O8524P6148R7650O9245R9194J30283J05823J48788
12782A948985K39589K97298L14270K93842L09675M27008M78393M82559N28990
$$ plain form
12864 391287 274463 139375 69899 5829 -111479 -185605 -186733 -201537 -169050 -121836 -119616
12853 -119616 -83443 -58031 -47952 -12185 -2958 16641 92780 65213 42539 56818 40608 12675
12841 12675 16080 -22659 -9772 9756 54072 73536 67456 57617 50362 54598 58805 95070 120475
12828 120475 154962 186895 197568 218036 178677 138364 151386 176023 209157 253726 282821
12817 282821 309443 304898 328425 337490 345191 373143 393254 402079 391015 374528 411207 429582
12805 429582 421543 453362 465953 470080 519151 601406 667231 686817 721739 795893 847446 958107
12793 958107 1031835 1058279 1153330 1221854 1298002 1395652 1464897 1564091 1694374 1800197 1948985
12782 1948985 2188574 2485872 2800142 3093984 3403659 3830667 4309060 4791619 5320609
12773E320609O36109O95369O85892P96823Q75134R50143J063931J186674J267618
12764A3478302J397508J561115J624164J678410J719080J671415J548307J535707
12756B6214008J600020J758127K115223K558307L139183M058442N455069P613724
12748E4512103J0784384J4997869J9493123K3194681K5406397K6733703K9297865
12741B04420125L2908744L3655375K4507732K004875k4999005m7492572n6982652
12734A68022622n0523797l7003312k4015061j4951233r567735o450155m698331
12727B0812998l567686k770655k164054j685031j248253r41827p96359o40162
12719F998971n57265n34710n00391l80214l14391l02318k98819k61649k39715
$$ plain form
12773 5320609 5956718 6652087 7337979 8134802 9009936 9960079 11024010 12210684 13478302
12764 13478302 14875810 16436925 18061089 19739499 21458579 23129994 24678301 26214008
12756 26214008 27814028 29572155 31687378 34245685 37384868 41443310 46898379 54512103
12748 54512103 65296487 80294356 99787479 122982160 148388557 175122260 204420125
12741 204420125 237328869 270984244 295491976 297496851 272497846 225005274 168022622
12734 168022622 117498825 80495513 56480452 41529219 31961484 25511329 20812998
12727 20812998 17245312 14474657 12310603 10625572 9377319 8435492 7639133 6998971
12719 6998971 6441706 5906996 5406605 5026391 4712000 4409682 4110863 3849214 3609499
12710C609499k08188k10947j74336j47208j45159r6797j11769j12347q9918r5956
12700B216874q3579p1448l6499k3258o8728l8059J8389P784j557l966m8777n9710
12688A807466j13004r2027n2770q6232r8780l5214n1669n8217j3420m194k0901
12677A181038j1594J3233J7416j6777j8624p7646q8913k8952o814k1998m0953
12666H99416K200l452n4112k6982k8004o327J58K7129O2199j3385l4700m279J1064
12653H30925j8768m5452K2449L9999M6311o0920l7785n330k1278l2263j0733l4323
12641F72832J8614K4019L1378m936K866K376L3670k4690l3238k6315j1349M1474
12629G26701J854j1987J718j7163l1503j8538K7903K3788K8574O2414M8196M2316
$$ plain form
12710 3609499 3401311 3190364 3016028 2868820 2723661 2626864 2515095 2402748 2312830 2216874
12700 2216874 2133295 2061847 2025348 2002090 1933362 1895303 1913692 1921476 1919919 1915953 1867176 1807466
12688 1807466 1694462 1602435 1549665 1463433 1364653 1329439 1277770 1219553 1206133 1201939 1181038
12677 1181038 1169444 1182677 1200093 1183316 1164692 1087046 998133 969181 962367 940369 899416
12666 899416 901616 898164 844052 817070 789066 782739 782897 810026 872225 858840 824140 819861 830925
12653 830925 812157 766705 789154 829153 875464 814544 776759 771429 750151 717888 707155 672832
12641 672832 691446 715465 746843 741907 744773 747149 780819 756129 722891 696576 685227 726701
12629 726701 728555 716568 718286 701123 669620 651082 678985 702773 731347 793761 841957 884273
12617H84273K8171m9044q2629j28337j59398j65310j25310n1021m5303M1398J3774
12606A61264R3367K6770L2994J3324K8060L3851l1619k4169k211O399J2881k3047
12594C27864j7108n802n2937m0948l8782j5504J7548j0321j5961m788M6703K2833
12582B12797L9365j5611l0289K6072J6669j8903n773O5932N2309k335j5628k3040
12570C01565l5599j7160J4312M0541K131m6060j9941k5106L0542K4187J2926J3404
12558B95742o860q709J1017J5013K650L6829J7891j5643o3268l0325N396J2567
12546B72300n5854R745J1965K9547J0666j452R352j1494N731j383L804n8422l8364
12533A86141l699N3246K7917k5192P9573m735l7734p908j6325J3124j4399l0259
$$ plain form
12617 884273 912444 863400 780771 652434 493036 327726 202416 151395 106092 147490 161264
12606 161264 254631 281401 314395 327719 355779 389630 358011 333842 331631 338030 350911 327864
12594 327864 310756 304954 252017 211069 172287 156783 174331 164010 148049 143261 189964 212797
12582 212797 252162 236551 206262 232334 249003 230100 224327 290259 342568 340233 324605 301565
12570 301565 265966 248806 263118 303659 305790 259730 239789 214683 245225 269412 282338 295742
12558 295742 288882 280173 291190 306203 308853 345682 363573 347930 284662 254337 259733 272300
12546 272300 216446 226191 238156 267703 278369 276917 286269 274775 280506 279123 282927 224505 186141
12533 186141 182442 235688 263605 238413 317986 313251 275517 267609 251284 264408 250009 219750
12521B19750k5421K525L12P011l5100j1080j2244k1865J7818L3207J4468J6322
12509B05703O556N4213P100l7338k1818l330O1238j22O618N1144M2204J1510K7053
12496D10731L8781N8407N635j4079j1678l4049j6848n5412l8456j819K2046L1539
12484C94798q263J5115j4463j5339m802J7788J5598k502l0050K1697j2949k1264
12472C55364O6156O6951J5350L6810M0138l1240n5488k1722J0503J0794L3270
12461E26886O6704L7714L5246K2378M5987J4024K0383k8396o6005j00084q3754
12450D91083j3649J8276J7240l9353o7870o630J3538p041m5441J8609o129j4374
12438C58259k630l8611j308l341l1529k0194J8109O5039J7072L8903k307J1896
$$ plain form
12521 219750 194329 196854 197166 204177 169077 157997 145753 123888 141706 174913 189381 205703
12509 205703 212259 266472 273572 236234 214416 211086 272324 272202 278820 329964 372168 383678 410731
12496 410731 449512 507919 513554 499475 487797 453748 436900 381488 343032 341213 363259 394798
12484 394798 386535 401650 387187 371848 367046 384834 400432 397930 367880 389577 376628 355364
12472 355364 421520 488471 503821 540631 580769 549529 494041 472319 482822 493616 526886
12461 526886 593590 631304 666550 688928 734915 748939 769322 740926 674921 574837 491083
12450 491083 477434 495710 512950 473597 405727 399097 412635 405594 360153 378762 372633 358259
12438 358259 355629 317018 315710 312369 280840 260646 278755 343794 360866 399769 397462 409358
12426D09358J3737q635j5747R709l4726J5528N1670K7043m6711k9999O131j8789
12414C78569q9096l6855k6784k1981J5789L0040j8628m26n3126k7666J4410K4460
12402A88706J0461j3735j990M787J6329k8329J1880k7391J0800j9302j895R626
12390A59947j9813L4274L4847K9600J3407n0265j171R105K4780M5833Q528K1693
12378C10765n0612m2329m7465k1520O7887L6011J7447j9261P504O4864j2530n0979
12366B59782K3722O8569K5730N9981R8410J09721Q9824R0428J25796J10562J67600
12355A230125J43761J34661M4414j15530k19252k29516k52419j94559j30298p0155
12345C41232q6171m7025Q414o6597J6895M5303m3197p7045m9829K1328M386L9925
$$ plain form
12426 409358 423095 414460 398713 408422 373696 389224 440894 467937 421226 391227 397358 378569
12414 378569 289473 252618 225834 203853 219642 249682 231054 230628 177502 149836 164246 188706
12402 188706 199167 185432 183442 188229 204558 176229 188109 160718 171518 152216 150321 159947
12390 159947 140134 174408 209255 238855 252262 201997 200826 209931 234711 280544 289072 310765
12378 310765 260153 217824 170359 148839 216726 252737 270184 250923 258427 323291 310761 259782
12366 259782 283504 352073 377803 437784 536194 645915 735739 826167 951963 1062525 1230125
12355 1230125 1373886 1508547 1552961 1437431 1218179 988663 736244 541685 411387 341232
12345 341232 255061 208036 216450 149853 166748 212051 168854 91809 41980 63308 67694 107619
12333A07619K7042M1762K2619m9388j8442K9055j7247j7033K1668K6092J6959
12322A90706L7392K933j9197R761k5933m0391J7307J0155K6764L7771K2443j9356
12310B50355j435L3139L5142q07J039J6707J9462N7098L1352P7980J32729J44431
12298G97192J42292J49519J56444J74759J68189P6705j8557j51700l05879l07063
12288H81901k40766k03571j05755q1253k3419K2413j2975k8724j5218p961o45
12277A84027j587k4058o5342o2829j4085r469q790K7793L219k9292j7626K8478
12265A0439M5149j3364N6520J5315m2728k265j4231n94J1257K2544j6760P559
12253G8841L677J4550n4912m0231k94M9808O6224J3109k1346K50j3057k602k664
$$ plain form
12333 107619 134661 176423 199042 149654 131212 160267 143020 125987 147655 173747 190706
12322 190706 228098 231031 211834 221595 195662 155271 172578 182733 209497 247268 269711 250355
12310 250355 248920 282059 317201 316394 317433 334140 353602 410700 442052 520032 652761 797192
12298 797192 939484 1089003 1245447 1420206 1588395 1665100 1646543 1494843 1188964 881901
12288 881901 641135 437564 331809 250556 227137 249550 236575 207851 192633 184672 184027
12277 184027 182440 158382 93040 30211 16126 6657 -2133 25660 28879 -413 -18039 10439
12265 10439 55588 42224 98744 114059 71331 69066 54835 54241 65498 88042 71282 78841
12253 78841 82518 97068 42156 1925 1631 51439 117663 130772 109426 109676 96619 94017 91353
12240I1353J658k6821L282k121k5600r266J7096l946k2378j1765k0109N0333r116
12227C2600L434J4787J1306K1302J4585L4810l8800j4899K2920J1712k6063M403
12215I2097l1606Q259L808O657k7086Q35N5387j3255k834K2180J620m3521k3306
12202D9235J2601J8165l200L91j8706K0006K2647J6798K0989j6672m5627r411
12190F7216M305j277J1696m514J1307J9344m367k2603k1289N139r863k3494k113
12177B9487L387k192k7497M5591L6606O488j112j4150J0890L5838l4311o0019
12165B9006j8449J3789j9777j5415J0699N0360O2744l3433l2079r751J8939L408
12153F0041o66k9473l0367O1073J7238O022Q128l1203L1293J1807j3926K9724
$$ plain form
12240 91353 93011 66190 69472 67351 41751 32485 49581 45635 23257 11492 -8617 41716 32600
12227 32600 36034 50821 62127 83429 98014 132824 94024 79125 102045 113757 87694 92097
12215 92097 60491 68750 72558 79215 52129 52964 108351 95096 92262 114442 116062 72541 49235
12202 49235 61836 80001 76801 77192 58486 78492 101139 117937 138926 122254 76627 67216
12190 67216 71521 70244 81940 77426 88733 108077 103710 81107 59818 64957 55094 31600 29487
12177 29487 32874 30682 3185 48776 85382 91870 90758 76608 87498 123336 89025 29006
12165 29006 10557 24346 4569 -10846 -147 50213 112957 79524 47445 37694 56633 60041
12153 60041 59375 29902 -465 60608 77846 83868 91996 60793 92086 103893 89967 119691
12141A19691Q965q0253n3780K94K8219L6825k1315l9641n396n338L9127q833o848
12128A1717K6626K5943Q457l5487j0443N890j4239p357K6265K7018o453N342l4706
12115B8573M38M4314o654j7965M1081J5717l0196k5167L172r691k1029R24j6976
12102F541L294J539j1386N64J8792k5636n4474n760K2593L1282O725r064P131
12089g859K0671M7345J3664K8445K033j3654l9679N296j351J759K325k8968k8559
12076A468K8287L3290K6993L8911k5073j5701j7302l4623l989k926k1992K090
12064I433J8864J3775R890J2064j7504j2645J5905m7962o544K8993j7179j3921
12052f831j7270Q93L207L1698N1795J4285p225l5970J7150N4122r624q731k4538
$$ plain form
12141 119691 128656 48403 -5377 -5083 23136 59961 38646 -995 -6391 -11729 27398 18565 11717
12128 11717 38343 64286 72743 37256 26813 32703 18464 11107 37372 64390 57937 63279 28573
12115 28573 29011 73325 66671 48706 89787 105504 75308 50141 53313 43622 22593 23517 6541
12102 6541 9835 11374 -12 552 19344 -6292 -60766 -66526 -43933 -12651 -5926 -14990 -7859
12089 -7859 12812 60157 73821 102266 104299 90645 50966 56262 54911 56670 58995 30027 1468
12076 1468 29755 63045 90038 128949 103876 88175 70873 36250 32261 29335 7343 9433
12064 9433 28297 42072 51962 64026 46522 33877 49782 1820 -4724 24269 7090 -6831
12052 -6831 -24101 -23208 -20001 11697 63492 77777 70552 34582 51732 105854 96230 87499 62961
12039F2961n9120m805L2385N808j4992r123j1422M900R949J8491J0123k3832R15
12026B2238M2394k0633M4705k0454l4813P03L2032j5680L220P294k2794k7940
12014A0272k7808N6472K2614p802k5171l0991k1647K3012M8749K5306k0637k1253
12002C1116j5077m5321o506J3587J3225k8558Q248J7415J7814K5483O3982k6289
11990F9119m6518O31k083K467j7880N090K996k5334L2015M5272M7024N944k5860
11977I2883p0778l724k331n646m79K8615J1879k70j4844m7437l5385K76N856M4162
11963B777K6694N390J2526l8368l2123L9135N145j9916k9803K7722M619K9806
11951C3604J4921o843l2755K1831J6328N924K9367L7466L730m3294m4901k5123
$$ plain form
12039 62961 3841 -964 31421 37229 22237 13114 1692 6592 16541 35032 45155 21323 22238
12026 22238 64632 43999 88704 68250 33437 34140 66172 50492 53712 61006 38212 10272
12014 10272 -17536 38936 61550 53748 28577 -2414 -24061 -1049 47700 73006 52369 31116
12002 31116 16039 -29282 -35788 -22201 -8976 -37534 -29286 -11871 5943 31426 95408 69119
11990 69119 22601 23232 21149 23616 5736 10826 13822 -11512 20503 65775 112799 118743 92883
11977 92883 22105 18381 16050 10404 9925 38540 50419 50149 35305 -12132 -47517 -47241 -41385 2777
11963 2777 29471 34861 47387 9019 -23104 16031 21176 1260 -28543 -821 3798 33604
11951 33604 48525 41682 8927 30758 47086 53010 82377 119843 123573 80279 35378 10255
11939A0255j2628J1796J3221J0063J5114K1476o9j9904j1409M551k6877l9760
11927b4171N2833J3150n4264k6114K4483k5404k5345J9874O2690m04j9412K6711
11915B4627K6697Q986j7197m850l671J2600K7261M499n2342l7894L6629j1603
11903A3742k5167l1991J2686M2839j2063l2965J0603j431l6011k5122J8697J9497
11891d6686J7699L5509L7773N720P608m1731l303j9901l2112m27N0678p0592m1663
11878a01428K4796Q666J9301K6491L6335K9726K1037J2408k2593p6997k2189k6770
11866g1217M4630j202K904N1992P053k8509j5177k3526k3527K4039k3056k0654
11854g6250K8902O7423N7133r431n7941l2692n833K9975j3976Q923Q046J8789
$$ plain form
11939 10255 -2373 9423 22644 32707 47821 69297 69228 49324 37915 42466 15589 -24171
11927 -24171 28662 41812 -12452 -38566 -14083 -39487 -64832 -44958 17732 17328 -2084 24627
11915 24627 51324 60310 43113 38263 34592 47192 74453 78952 26610 -11284 25345 13742
11903 13742 -11425 -43416 -30730 12109 46 -32919 -22316 -23747 -59758 -84880 -66183 -46686
11891 -46686 -28987 6522 44295 50015 57623 15892 12589 -7312 -39424 -39851 10827 -59765 -101428
11878 -101428 -76632 -67966 -48665 -22174 14161 43887 64924 77332 54739 -22258 -44447 -71217
11866 -71217 -26587 -27789 -24885 27107 34160 5651 -9526 -33052 -56579 -32540 -55596 -76250
11854 -76250 -47348 20075 77208 67777 9836 -22856 -28689 1286 -12690 -3767 4279 23068
11842B3068K6992m517q035k1553n649O297N5022N1868k8585k5213n97k8467k4681
11829A5950L6701p838o1809j8766K848j1679L7821J8490J6136k1070k5158J1756
11817f618o805M1190J7587j603k8473k513p970r69M24J6737J0402j7181L0955
11804D5163J6430k7146J2180J9403j4292l8516L549L8532k4855m640J3217K1029
11792F0054r848m3449K6585K3755r584N38l5188k099j2596L013j3894R910l702
11779f505K2840k1295k7464J394p440K6869J9668k2134P222M5829O67l8884j9522
11766a8755L0803J4855K6715N3011J3211q843k6858m3146J8973p709o645j8971
11754B6641o056j3185m207j974K2512p065L4864P811J1290M1609l7251m1147k8904
$$ plain form
11842 23068 50060 45543 37508 15955 10306 16603 71625 123493 94908 69695 69098 40631 15950
11829 15950 52651 44813 -16996 -35762 -32914 -44593 -6772 11718 27854 6784 -18374 -6618
11817 -6618 -13423 27767 45354 43751 15278 12765 4795 3826 4250 20987 31389 14208 45163
11804 45163 61593 34447 46627 66030 51738 13222 16771 55303 30448 25808 39025 60054
11792 60054 50206 6757 33342 57097 47513 48051 12863 10764 -1832 1181 -12713 -2803 -6505
11779 -6505 16335 -4960 -32424 -31030 -38470 -11601 8067 -14067 -6845 38984 39651 767 -18755
11766 -18755 12048 26903 53618 106629 119840 110997 84139 40993 59966 52257 45612 26641
11754 26641 20585 7400 3193 1219 23731 16666 51530 59341 70631 112240 74989 33842 4938
11741D938p303L3888M3620P799n4684m3012N641K0041J7520m1968k4871L3821
11729d570k1562M569M2571m4243k8968K8537K2056N7843Q615m8849j7241L1766
11717C0524k7247k74L0291N30l8908N866M2023J5139k7720J4751P332o965k8521
11704A6821j2211K8035j2077P699M2716l4549J219L0835O359l8662n9991J4368
11692i438p707K3199M1653L9507K285m0576l4358r539j700j5043m105j445j2684
11679b9951K4264J5101r804J6729Q210j287l2271J551k0147J2587L357l0464j6431
11666e8556J2297J7949N2165M5861j4186P260n5275n1663j6511L0525M056j8682
11654d4760R642K9672J1324k1973j2192L2859K9044J8440N767J6896k9457n5853
$$ plain form
11741 4938 -2365 31523 75143 82942 28258 -14754 -9113 10928 28448 -13520 -38391 -4570
11729 -4570 -26132 -21563 21008 -23235 -52203 -23666 -1610 56233 64848 15999 -1242 30524
11717 30524 3277 3003 33294 33824 -5084 782 42805 57944 30224 44975 52307 45342 16821
11704 16821 4610 32645 20568 28267 70983 36434 37653 68488 74847 36185 -23806 -9438
11692 -9438 -17145 6054 47707 87214 89499 48923 14565 5026 3326 -11717 -15822 -17267 -29951
11679 -29951 -5687 9414 -390 16339 24549 23262 -9009 -7458 -27605 -15018 -11661 -42125 -58556
11666 -58556 -46259 -28310 23855 69716 55530 62790 7515 -44148 -60659 -30134 -26078 -44760
11654 -44760 -35118 -5446 5878 -16095 -28287 4572 33616 52056 57823 74719 45262 -10591
11642a0591J2338J9707L5813j659n927K9931N643m4952o2205l7142L0336O2610
11630C3902K8365r711k9361l9481p120P941L5422J7253k5344r901p808n86O093
11617c36L6615J8897J1137j0905j8692j9551j7132j5074K4874N0945N037l6475
11605B9340m3751n5171J2461J7918J3204K3702J8664k6837K6333j621K6504J6860
11593E7606J546j605j5014j8156K7833n136p3291J2994K6418m2982k0223m55O4197
11580A3732J632R246K6418j7556k6976l9171m071L6609j0398j8726L8726p337
11568B128l9640K0947J0117p373N3627K6455J1273l8356k2768J1306j974q99k9606
11555d763N957O715K0241k0930o476J6183K1163K0914n136l130j9143J6362J9378
$$ plain form
11642 -10591 1747 21454 57267 55608 49681 79612 85255 40303 -21902 -59044 -28708 33902
11630 33902 62267 52556 23195 -16286 -23406 -15465 19957 37210 11866 1965 -5843 -6429 -336
11617 -336 36279 55176 66313 55408 36716 17165 33 -15041 9833 60778 65815 29340
11605 29340 -14411 -69582 -57121 -39203 -25999 -2297 16367 -10470 15863 14242 40746 57606
11593 57606 59152 57547 42533 24377 52210 47074 -26217 -13223 13195 -29787 -50010 -50465 13732
11580 13732 15364 24610 51028 33472 6496 -32675 -36746 -137 -10535 -29261 9465 2128
11568 2128 -37512 -16565 -6448 -13821 39806 66261 77534 39178 16410 27716 25742 24843 -4763
11555 -4763 1194 7909 28150 7220 744 16927 38090 59004 53868 50738 31595 47957 67335
11542F7335J6595k7448m6698l0140Q02K4253m4280J356q333L1300K4356n167k688
11529A243K3346l2510k4059K7669K3495Q420p176j8255k6202L5932J9625K1616
11517E3144K0786J8349k8000m0744q6616m9225N4190N6478M7238L2196k3224m5220
11505I352j3826o69J6337k6560n0483J28N8213L1728o591k9382p067L4267L0717
11492D6164l5705k5205N682n2620n533L5469L3583n642k743K780k390j5778o396
11479b8334O336j9610l612K3620L7419k4772J3624N1227J7761n2165k8742l5474
11467d2722k8587K6910M4189j253j3764L2492K7514m7720j1591J5297K117r147
11455f265Q534m2243l5028M8138K6500r374l2292K7850L4579M191n186L4068K3677
$$ plain form
11542 67335 83930 56482 9784 -20356 -19554 4699 -39581 -38225 -46558 -15258 9098 3931 1243
11529 1243 24589 -7921 -31980 -4311 19184 27604 20428 2173 -24029 11903 31528 53144
11517 53144 73930 92279 64279 23535 -63081 -112306 -58116 -1638 45600 77796 54572 9352
11505 9352 -4474 -5143 11194 -15366 -65849 -65721 -7508 24220 17629 -11753 -18820 15447 46164
11492 46164 10459 -14746 -9064 -61684 -67217 -31748 1835 -3807 -6550 -3770 -6160 -21938 -28334
11479 -28334 -21998 -41608 -45220 -21600 15819 -8953 4671 55898 73659 21494 -7248 -42722
11467 -42722 -71309 -44399 -210 -1463 -15227 17265 44779 -2941 -14532 765 2882 -6265
11455 -6265 2269 -39974 -75002 -26864 -364 -9738 -42030 -14180 20399 24590 19404 53472 77149
11442G7149k2814l3327m309o2951o2070l464L7839J7067J7093M3800L71L0761
11430C5145K8329N831k7409p604o240m2982j8771M6619k8744L293J2632K2708
11418B2807k0826o0091k4453M7229J3283L4753J639J8366K8257p650L4007M3006
11406A30327O792K2167K3932j1617k8083j7355k5418m6485m0460R981M1317o298
11394E8800m1945j7870O115Q299j7301L572j5404M035N4211K107o2939j1362L0403
11381G21J0737l0391J3566K1623K9504J6509K8133J2092j9010J987j9012n3336
11369A3123n2589l1782j7493p141P0787M6679L5771N648l0972O472k7646l2737
11357b1880L651M3472k4003k8268K18L8987M1748K7092j1326j9114m2107m3402
$$ plain form
11442 77149 54335 21008 16699 -46252 -108322 -111786 -73947 -56880 -39787 4013 4384 35145
11430 35145 63474 69305 41896 34292 28052 -14930 -33701 12918 -15826 -12533 99 22807
11418 22807 1981 -58110 -82563 -35334 -22051 12702 14341 32707 60964 53314 87321 130327
11406 130327 137119 159286 183218 171601 143518 126163 100745 54260 13800 23781 65098 58800
11394 58800 16855 -1015 5100 13399 -3902 -330 -15734 -11699 42512 44619 -18320 -29682 721
11381 721 11458 -18933 -5367 16256 45760 62269 90402 102494 83484 85471 66459 13123
11369 13123 -39466 -71248 -88741 -95882 -25095 21584 57355 63003 32031 38503 10857 -21880
11357 -21880 -18229 25243 1240 -27028 -26810 12177 53925 81017 69691 50577 8470 -34932
11345c4932N979J3285o193K0575m9020k6213N1212K9667j1695j0825o117M6981
11333B2704J8351m5791J6556j9809k7527L5874L5285K7133l8582o0654m1372L540
11321g4292K7939L224K8226L9510L4815K3381J3593j9356j119M9294k6459j6860
11309H1896k4342n975L1912R500J2817p6218q9309k082O0365k0258j0208K463
11297b9439m4599q960J7445J9681M0512K4706j0181J756M524j8160k0631j0379
11285c3725L4054J5103J2007l3724K587J7576M6485M116k6977m8394m5215J3676
11273d2431L0715L0876J5099K0110N9290J959m5275K4677L8706j2712l8672k6256
11261E6086L7626J6729M205j8641m8420o1691K8317L2198P544J0284j5733o5668
$$ plain form
11345 -34932 -28953 -15668 -21861 -1286 -50306 -76519 -25307 4360 -7335 -18160 -24277 22704
11333 22704 41055 -4736 11820 -7989 -35516 358 35643 62776 24194 -36460 -77832 -74292
11321 -74292 -46353 -43129 -14903 24607 59422 82803 96396 77040 75921 125215 98756 81896
11309 81896 57554 51579 83491 92991 105808 29590 -59719 -61801 -1436 -21694 -31902 -29439
11297 -29439 -74038 -82998 -65553 -45872 -5360 19346 9165 10921 15445 -2715 -23346 -33725
11285 -33725 329 15432 27439 -6285 -3698 13878 60363 64479 37502 -10892 -56107 -42431
11273 -42431 -11716 19160 34259 54369 113659 115618 70343 95020 133726 121014 82342 56086
11261 56086 93712 110441 114646 96005 47585 -14106 14211 46409 53953 64237 48504 -17164
11249a7164o3705l1772L424J6078M8105J7038L2637J0933J9612J392l1151K2950
11237B8377L0597j243m8402p348n050l9613R633L4398K2270l4887M075K615n770
11224a0348l3205K81L2127L0392J2125m5672J019J0506M3250k675n427m4554k6699
11211c8880j0857K7812j4095q547o63J0286j4180k831M926J0849O7l3047L849
11198f5311R616K98N6250M0166K1597j3193l6394k5126K696O135J2534m1774K3764
11185h742q582R587j038k5914j7982K782R859m633K4708M2400K0613l828r038
11172C0192l2130j9396n449n95L2197K8573J7942L2770N005l8915k4244l2579
11160f629m422j7713j3689l4207K352J3457O7153K6195k47j1988n6204N476L8565
$$ plain form
11249 -17164 -80869 -112641 -109217 -93139 -45034 -27996 4641 15574 35186 36578 5427 28377
11237 28377 58974 57731 9329 1981 -3069 -42682 -33049 1349 23619 -11268 -7193 -4578 -10348
11224 -10348 -43553 -43272 -11145 19247 31372 -14300 -13281 -2775 40475 37800 32373 -12181 -38880
11211 -38880 -49737 -21925 -36020 -44567 -45230 -34944 -49124 -51955 -47029 -36180 -36113 -69160 -65311
11198 -65311 -55695 -55397 853 41019 62616 49423 13029 -12097 -9401 -3266 9268 -32506 -8742
11185 -8742 -17324 -7737 -8775 -34689 -52671 -49889 -40030 -44663 -19955 22445 43058 39230 30192
11172 30192 -1938 -21334 -26783 -27378 4819 33392 51334 84104 89109 50194 25950 -6629
11160 -6629 -11051 -28764 -42453 -76660 -74308 -60851 6302 32497 32250 20262 -35942 -30466 8099
11147H099M5855j5349j1759k7452l903L620L271m7k9230j5819k6473K4056N3305
11134H174j1227j5428N5495k540l1935j6062m335L9450k5868J4244M982J854J613
11121A8417l9121j3899l2613K5592M2882o782J8772K7367K9340k4418l9620l5311
11109b9394j3075J2989j270L01l733j6328L0437l7143l2760K5798K9444m8749
11097h3483k3553K0925J8066M6250L9989k7183n439j2697l90n136q032j7032K5291
11084c2424K7059L977j6000N3949K4275j5519l6416l3204j9183J0499o570n1018
11072i0575K4053L1696K9994J4592k3596Q754k1016q818r669P510J4729K8825
11060F479j2051q854K9182L2119k479k741l7757o2109P807L4331J7386l4317K0816
$$ plain form
11147 8099 53954 38605 26846 -606 -4509 -889 2382 2335 -26895 -42714 -69187 -45131 8174
11134 8174 -3053 -18481 37014 34474 2539 -13523 -17858 21592 -4276 9968 14950 16804 18417
11121 18417 -20704 -34603 -67216 -41624 1258 -5524 13248 40615 69955 45537 5917 -29394
11109 -29394 -42469 -29480 -30750 -30449 -34182 -50510 -20073 -57216 -89976 -64178 -34734 -83483
11097 -83483 -107036 -86111 -68045 -21795 18194 -8989 -14428 -27125 -27515 -32651 -40683 -57715 -32424
11084 -32424 -5365 -1388 -17388 36561 60836 45317 8901 -24303 -43486 -32987 -39557 -90575
11072 -90575 -66522 -34826 -4832 9760 -13836 -5082 -26098 -34916 -44585 -37075 -22346 6479
11060 6479 -5572 -14426 14756 46875 44396 41655 3898 -58211 -50404 -16073 1313 -33004 -12188
11047a2188K2417K868K327r884l1958J8333J3373L1178k2306k6519r042j1294
11035c2695J6593L2806J4222k7067m692n210l5552r4J8075n974K0977L7202j2290
11022A6301K8610K4851N98k0462o6445l735N1432R611j4293k1509p281m1251l3392
11009g6965o362P260K0404K5772j9433k416R752R809J0859j2705k574O1738M7169
10996G2308K43n2156n191K492J3808j3107m8977j187q927l9291L0622K7655q002
10983b9710J502N2184M3786j0643l2407j56K6298l7685l9845o935J425N9745L2310
10970E9869j539n8670l6247j4984M099R395J191m3287L0572M4138L5544P524k7316
10957A0289r063N650J1000m654M800K6965k9101J3865p935j2133K2580K7412K2192
$$ plain form
11047 -12188 10229 13097 15424 5540 -26418 -8085 5288 36466 14160 -12359 -21401 -32695
11035 -32695 -16102 16704 30926 3859 -833 -6043 -41595 -41689 -23614 -29588 -8611 28591 16301
11022 16301 44911 69762 70360 49898 -16547 -20282 31150 40761 26468 4959 -2322 -43573 -76965
11009 -76965 -83327 -76067 -55663 -29891 -49324 -51740 -41988 -32179 -21320 -34025 -36599 25139 72308
10996 72308 72551 20395 15204 17696 31504 18397 -30580 -31767 -40694 -79985 -49363 -21708 -29710
10983 -29710 -28208 23976 67762 57119 24712 24556 50854 13169 -26676 -33611 -32186 27559 59869
10970 59869 58330 -340 -36587 -51571 -47472 -38077 -36886 -80173 -49601 -5463 30081 37605 10289
10957 10289 1226 6876 17876 13222 18022 44987 15886 29751 21816 9683 32263 59675 81867
10944H1867m2265p9179j2620J7953m082J3523j0166M7617N8101L9871N949m8249
10932F8320k6130K6826J3296j3255O2593O584j5214j3479J8775j9515o9378j4807
10920B4616k1374j7209J1888r524L9379J6195J5237J3945n101l0890N883P730
10908E0775K1293k8474n606K6710j8966J5533L6442P5935M228l7088K4147j2966
10896A51963m2515m0833k4102l7549o169k1884R82j7416r686K6258L1816L1882
10884D2747j0710n8595l0179l488K4231L6585J8783R781j660K2731m3950r022
10872b746M149l296J828l9116k5002m352j2964K3253N3705L5485J9473J0397j4760
10859D6054L0767J8319k3805j7147m309l2411l0810k9261J305K4042R251O917
$$ plain form
10944 81867 39602 -39577 -52197 -34244 -38326 -24803 -34969 12648 70749 110620 116569 68320
10932 68320 42190 69016 82312 69057 131650 138234 123020 109541 128316 108801 39423 24616
10920 24616 3242 -13967 -2079 -11603 27776 43971 59208 73153 68052 37162 43045 50775
10908 50775 72068 43594 37988 64698 45732 61265 97707 173642 177870 140782 164929 151963
10896 151963 109448 68615 44513 6964 795 -21089 -20107 -37523 -47209 -20951 10865 42747
10884 42747 32037 -26558 -56737 -60225 -35994 591 19374 29155 27495 50226 6276 -2746
10872 -2746 1403 -1893 -65 -39181 -64183 -68535 -81499 -58246 -4541 30944 50417 60814 46054
10859 46054 76821 95140 71335 54188 49879 17468 -13342 -42603 -41298 -17256 -8005 -1088
10847a088L0968l374k1997J0815K8891R095K5218K7682J6676j5184M4296J8556
10835A70554K994p100k6135k3256k2700L6165M8676j1672P21j8640l4840L1259
10823A46026P1344K8660J5414L2014N012L2018P4864R6399J12051J32882K01530
10812I48214J67584J65058J70120J47496K8270p2983j86111k60024k54179k18956
10802F34489j63003j28516r1097p3740o4792n767K3123j860p182l3173o7989m2758
10790b2265J6287M4724J5487p541J3783m720J5398j9594j2585k8709j9493m13
10778i641K5457K1484K651n116k1865J7265j796l8968k4241l2055o718J3457o267
10765f6353L0935N0790k6389l938j8953j3024J5649J9627k9290k4114P581J1205
$$ plain form
10847 -1088 29880 26506 4509 15324 44215 53310 78528 106210 122886 107702 151998 170554
10835 170554 173548 166448 140313 117057 94357 130522 179198 167526 168247 149607 114767 146026
10823 146026 217370 246030 261444 293458 298470 330488 405352 501751 613802 746684 948214
10812 948214 1115798 1280856 1450976 1598472 1626742 1553759 1367648 1107624 853445 634489
10802 634489 471486 342970 251873 178133 113341 107574 130697 128837 121655 88482 20493 -22265
10790 -22265 -5978 38746 54233 46692 60475 55755 71153 51559 38974 10265 -9228 -9641
10778 -9641 15816 37300 39951 34835 12970 30235 28439 -10529 -34770 -66825 -73543 -60086 -66353
10765 -66353 -35418 15372 -11017 -14955 -33908 -46932 -31283 -11656 -40946 -65060 -57479 -46274
10753d6274j7607L193J5186j2092J3457K2907O381l9783l2362K5558O798J2790
10741d1848k4414K2127J3467l378j8437m976J7016J6923K4309j132k5492j3031
10729c8866k488N062K0846P695p391k3042o288j3974J5157N26P03J2860P971K2935
10715A706J8908O640l3423j6152K7329M5801M7633R004o120j5419j7571r042m0328
10702A8966L5531M3427J2233j5113p788R252l8262k494P936m9648j9284q726K8489
10689A4519M8059K0141K5712k7572j9327m3450K1183K3014m7095L3059N1077J2456
10677A11776J0997n0527J2107N190j656J1524m675J8129M8362K1041n769M608
10665A81107l847K4376K9044J891k6678k6245J9249L2979l4981q913K615p885
$$ plain form
10753 -46274 -63881 -60688 -45502 -57594 -44137 -21230 -14849 -54632 -86994 -61436 -54638 -41848
10741 -41848 -66262 -44135 -30668 -34046 -52483 -57459 -40443 -23520 789 -343 -25835 -38866
10729 -38866 -41354 -36292 -15446 -7751 -15142 -38184 -44472 -58446 -43289 -42763 -42060 -29200 -21229 1706
10715 1706 20614 27254 -6169 -22321 5008 50809 98442 107446 101326 85907 68336 59294 18966
10702 18966 54497 97924 110157 95044 87256 96508 58246 55752 63688 14040 -5244 -13970 14519
10689 14519 62578 82719 108431 80859 61532 18082 39265 62279 15184 48243 99320 111776
10677 111776 122773 72246 84353 89543 87887 99411 94736 112865 161227 182268 176499 181107
10665 181107 177260 201636 230680 232571 205893 179648 198897 231876 196895 187982 190597 182712
10653A82712k0288P682K5619j2578m1977n4224l2452j2561K1755K846J152j777
10641F5909k8621l1016p652J6359O5130J693q763k306j9964k8167P049J7046K2325
10628F9022J2764k6581k9230N931J9179l890l1228k3890O53J4083Q496k3990r204
10615a7885N918j5120L5351J3078K928P993J4122p1042O203L7267l1146j3320
10603b5653J0940L0826K860j4941L7488K6235k3667k2053j8275j977Q663M5792
10591E6238R725J606P365L0637N127j2451j0759P261k2430j3335k1809j1812L7010
10578F2373L8169J1405K0695J960j2529N5829m0884k6122K2252N6415K7139j2815
10566B03887K4246P9106J4807m7530k5351N4628L0175K590l4014j9463L1504m040
$$ plain form
10653 182712 162424 170106 195725 183147 141170 86946 54494 41933 63688 66534 67686 65909
10641 65909 37288 6272 -1380 14979 80109 81802 73039 70733 50769 22602 29651 46697 69022
10628 69022 81786 55205 25975 31906 51085 47195 15967 -7923 -7270 6813 15309 -8681 -17885
10615 -17885 -11967 -27087 8264 21342 24270 32263 46385 -24657 -18454 18813 -12333 -25653
10603 -25653 -14713 16113 18973 4032 41520 67755 44088 22035 3760 1783 10446 56238
10591 56238 65963 67569 74934 105571 110698 98247 87488 94749 72319 58984 37175 25363 62373
10578 62373 100542 111947 132642 134602 122073 177902 137018 110896 133148 189563 216702 203887
10566 203887 228133 307239 322046 274516 249165 303793 333968 336558 302544 283081 314585 310545
10554C10545K7504L6458m2677k2717O624j2357k6546j4427J3304Q513j6941K2232
10542B89515L5571L9751P2131N3760q116j4052L9086k8413j0901k0648l6522p1099
10530C40063r3951j07339m9979n4640o1529K0450K6148J2712L8423M0340J7071
10519A27769L7897k504O9802K3051l2439j373n800N230m3415L587O897L9121j2930
10506B14893l4465k8425l1143k858k5630L186L2689M2343q554o906L6844j8625
10494A73349J0905J2636M3666k6417k5921L2346p66Q306J7612N3341J3995l1331
10482B81721j2885O2385K322M1643L3622J3048l1982K5618M5850j4263J6320R534
10470D72933M5366K9738L8331P6949M5094K5712P4498J11825L3307K5017Q2271
$$ plain form
10554 310545 338049 374507 331830 309113 315737 303380 276834 262407 275711 284224 267283 289515
10542 289515 325086 364837 436968 490728 482612 468560 507646 479233 468332 447684 411162 340063
10530 340063 246112 138773 88794 34154 -27375 -6925 19223 31935 70358 110698 127769
10519 127769 165666 163162 232964 256015 223576 222203 216403 221633 178218 181805 188702 227823 214893
10506 214893 180428 152003 120860 118002 92372 95558 128247 170590 162036 155130 191974 173349
10494 173349 184254 196890 240556 214139 188218 220564 219798 228104 245716 299057 313052 281721
10482 281721 268836 331221 333543 375186 408808 421856 389874 415492 461342 447079 463399 472933
10470 472933 518299 548037 586368 663317 708411 734123 808621 920446 953753 978770 1061041
10459A061041J02103J05330P6181Q5934J43146J01743P8349J43588K11840K41381
10449B350636K30669K52829L22548L74393M23679M87973M73956N56587O59105
10440F132375O99902P17338P92208R23207J033392J145113J287590J381628J529788
10431A5642541J684821J796795J877906J846080J697803J493430J362373J383427
10423B8785176J564618J903945K462084L061447L959604N339657P373956J0302765
10415F4753252J4216896J8590795K2378986K4804894K6422182K8951136L2377437
10408B32495578L2881226K4326421L067911k2875421m4845338n5212082n0178786
10401A19659509l7606657k4766210j5396590r627225o249913m396642l347320
$$ plain form
10459 1061041 1163144 1268474 1344655 1430589 1573735 1675478 1753827 1897415 2109255 2350636
10449 2350636 2581305 2834134 3156682 3531075 3954754 4442727 4916683 5473270 6132375
10440 6132375 6832277 7549615 8341823 9265030 10298422 11443535 12731125 14112753 15642541
10431 15642541 17327362 19124157 21002063 22848143 24545946 26039376 27401749 28785176
10423 28785176 30349794 32253739 34715823 37777270 41736874 47076531 54450487 64753252
10415 64753252 78970148 97560943 119939929 144744823 171167005 200118141 232495578
10408 232495578 265376804 289703225 292771136 269895715 225050377 169838295 119659509
10401 119659509 82052852 57286642 41890052 32262827 26012914 21616272 18268952
10394A8268952k687904k222823j757629j364698r82639o73810n72820m54672l40978
10385G210979l25160l71524m50651n00139n03240n10457m14814l93006l16663
10376C425325j91115j71087k03632j12798p1020o8051o8504r2279j14986j00425
10366B231428j00393j00973r0591j21217j04218o0209o0235l7464k8758n7658
10356A469712p2965n1555n9341o9272l2475m1105j7062K4588o2663o4936l3119
10345I89807L2320L8788k4801p481J546r045n9197j15294o1208R65J0649l0547
10333G66502k9396k9385k7380J2289M0997M832k9596R496L6889J8377p028j7493
10321G49104m4333k2032p858K7690k399l6654m4038K211p515J667k8580J937J0315
$$ plain form
10394 18268952 15581048 13358225 11600596 10235898 9253259 8579449 8006629 7551957 7210979
10385 7210979 6885819 6514295 6063644 5563505 5060265 4549808 4134994 3741988 3425325
10376 3425325 3234210 3063123 2859491 2746693 2675673 2607622 2539118 2446839 2331853 2231428
10366 2231428 2131035 2030062 1939471 1818254 1714036 1653827 1593592 1556128 1527370 1469712
10356 1469712 1396747 1345192 1285851 1216579 1184104 1142999 1125937 1150525 1087862 1022926 989807
10345 989807 1022127 1060915 1036114 1028633 1030179 1021134 961937 846643 785435 786400 797049 766502
10333 766502 737106 707721 680341 692630 733627 738459 708863 718359 755248 773625 766597 749104
10321 749104 704771 682739 674881 702571 700172 663518 619480 621691 614176 615843 587263 589200 599515
10308E99515J1493j5740L6801J2966r232j4754j4077l7504k9730M804O391K2285
10296E73218K385k9711l4436O3876M4679Q520J6385J8671j1398r645J9234J2740
10284F74518m5102p6213j59164j67360j65886r6165k1799j4137K1831O7739J6270
10273C4532K798K5546N3969L6776N1696J0267k4144m1045K111j9104k2575n754
10261A05073o609N120k6996j9358m664j4395K757J2659Q742K6056K0223O6593
10249A75201L3442J5894L3095K4641k6839j8500r541K6947J3128k1559q2962K9816
10237A92763J5333Q725N5964L7983m4902l9255l3183j7147l2076k460N4901M9278
10225B45924J0404J9444m0583o7560O107J8726J7678M7183L320j3410K0796K8697
$$ plain form
10308 599515 611008 595268 632069 645035 635803 621049 606972 569468 539738 544542 550933 573218
10296 573218 575603 545892 511456 575332 620011 628531 644916 663587 652189 642544 661778 674518
10284 674518 629416 553203 394039 226679 60793 -35372 -57171 -71308 -49477 18262 34532
10273 34532 37330 62876 116845 153621 205317 215584 191440 150395 152506 133402 110827 105073
10261 105073 98464 103584 76588 57230 52566 38171 40928 53587 62329 88385 108608 175201
10249 175201 208643 224537 257632 282273 255434 236934 227393 254340 267468 245909 162947 192763
10237 192763 208096 216821 272785 310768 265866 226611 193428 176281 144205 141745 196646 245924
10225 245924 256328 275772 235189 167629 173736 192462 210140 257323 260643 247233 268029 296726
10213B96726N257K5317j2999L0494M505j857j5430Q945Q619n9782r867j2060o358
10200B61510K178q165j9995j8896J8103L227j9921k3663k6372K8770L2650j0780
10188B18646J9846J9240m4293p846K3975j2368k6075R161M7335K3396K2577N2769
10176C46363k0711n0878k7855j326M6612p834j9356K395K0285j9775L1527O778
10164C06225l9975j81j5966q77N255J7119J4454Q019N494k8048n5827j7015Q531
10151B07208j5420J374K9622r727K915Q837q582j976J4186j064J6460J2623K2969
10138B79425j575n4542j8460K9322L2674l3010q951L6488L8828R176K4231J3700
10126C47306l3218j4277K0871l909m0823R082l363m4995l1941J7056N6589L4117
$$ plain form
10213 296726 301983 327300 314301 344795 349300 347443 332013 340958 349577 289795 279928 267868 261510
10200 261510 263688 255523 235528 216632 234735 237962 218041 194378 168006 196776 229426 218646
10188 218646 238492 257732 213439 205593 229568 217200 191125 200286 247621 271017 293594 346363
10176 346363 325652 274774 246919 245593 292205 284371 265015 267410 287695 267920 299447 306225
10164 306225 266250 266069 250103 249226 254481 271600 286054 294073 299567 271519 215692 198677 207208
10151 207208 191788 193162 222784 213057 215972 224809 216227 214251 228437 227373 243833 256456 279425
10138 279425 277850 223308 204848 234170 266844 233834 224883 261371 300199 309375 333606 347306
10126 347306 314088 299811 320682 316773 275950 285032 281669 236674 204733 221789 278378 312495
10114C12495l4996m3564q102j1350O0936M6053L0231L9893l1983j6844J9285N52
10102C62606K1499L3893L5671P1783N4469k1448k5816L9843O9308q189k3136J7127
10090F27610N1416L5016K0792M6045O1341L8034n1750k9958q673M1386M0908J4095
10078H86262O0162r144n54O1884L6543P0462J02607J02345J25131J44500N5395
10067A635593N2255J03232Q4328M8032J01182J39220J71141J68337J69292J28826
10057B801438J77996J89569K36107K63917K87165L06907L18301L54923M05090
10048E341413N31589N24742N46936O48285O85683P38307P37937N58310N37258
10039A0850460N50178N62041M29290L39056J78731l2043k11350k79744m12624
$$ plain form
10114 312495 277499 233935 225833 214483 275419 321472 351703 391596 359613 342769 362054 362606
10102 362606 384105 417998 453669 525452 579921 558473 532657 572500 641808 633619 610483 627610
10090 627610 679026 714042 734834 780879 842220 880254 828504 798546 789873 831259 872167 886262
10078 886262 946424 937280 936726 998610 1035153 1105615 1208222 1310567 1435698 1580198 1635593
10067 1635593 1687848 1791080 1875408 1923440 2024622 2163842 2334983 2503320 2672612 2801438
10057 2801438 2979434 3169003 3405110 3669027 3956192 4263099 4581400 4936323 5341413
10048 5341413 5873002 6397744 6944680 7592965 8278648 9016955 9754892 10313202 10850460
10039 10850460 11400638 11962679 12391969 12731025 12909756 12877713 12666363 12386619 11973995
10030A1973995m47475l59955m42912m52520l29075k44528j61543j33551q3014
10021I319422l1582P6644J22196J29531K09973K93179L55833M39138M73280N64691
10011A1952305P02983Q27250R68789J149964J268975J359477J491322J600516
10003B1321581J640740J533189J357985J082424O14319M2200o68274j247439j620667
9994B4056058j860738j957761j921868j717699j535269j379906j125014r75734
9986A1582069q38882p08650m92689m31519l55684l10205j58553j39125q4107p925
9976H054730m022J1643J01097K19794K44418K20445K74215L35268M29873M38917
9966A0326378L87367L53738L86007L16394J57367O8183m9569k42853m15031o29378
$$ plain form
10030 11973995 11526520 11166565 10723653 10271133 9942058 9697530 9535987 9402436 9319422
10021 9319422 9287840 9364484 9486680 9616211 9826184 10119363 10475196 10914334 11387614 11952305
10011 11952305 12655288 13482538 14451327 15601291 16870266 18229743 19721065 21321581
10003 21321581 22962321 24495510 25853495 26935919 27550238 27592438 26924164 25676725 24056058
9994 24056058 22195320 20237559 18315691 16597992 15062723 13682817 12557803 11582069
9986 11582069 10743187 10034537 9541848 9110329 8754645 8444440 8285887 8146762 8062655 8054730
9976 8054730 8050708 8062351 8163448 8383242 8627660 8848105 9122320 9457588 9887461 10326378
9966 10326378 10713745 11067483 11453490 11769884 11927251 11995434 11945865 11703012 11287981 10658603
9956A0658603p85495q57103r05556q86205q53786p70525o08128n21554m95683
9947C974568m16328l28297k97202k43569j99084j96005j37740j40844j49565j68549
9937A697385j08860n8598q8048p2671p8962j19709p8802k1488p5276n3646l1703
9926I09622m4625l6952J0316J0158n062m3933l3605r427l701O73k2330m5870n0225
9913F35039o0109j9546j133k8408k756K4619J069p5083l7062L8632K6242n3510
9901D47994o969J3456l452k5595P288l6702m9828N197K0045J1521P027R472L6416
9888D35870J7271l8054l6372L1139L9657j5285j7730m3903j8216k7554o1815o642
9876B58366L3705M799j5545j5919l6703j0486J1445l5388k3347J6698J750L0213
$$ plain form
9956 10658603 9873108 9016005 8110449 7224244 6370458 5599933 4991805 4470251 3974568
9947 3974568 3558240 3229943 2932741 2689172 2490088 2294083 2156343 2015499 1865934 1697385
9937 1697385 1588525 1529927 1441879 1369208 1290246 1170537 1091735 1070247 994971 941325 909622
9926 909622 864997 828045 838361 848519 843457 799524 765919 756492 752791 753464 731134 685264 635039
9913 635039 574930 555384 554251 525843 523087 547706 548775 473692 436630 475262 501504 447994
9901 447994 441025 454481 451029 425434 432722 396020 346192 351389 371434 382955 389982 399454 435870
9888 435870 453141 415087 378715 409854 449511 434226 416496 372593 354377 326823 265008 258366
9876 258366 292071 296870 281325 265406 228703 218217 229662 194274 170927 187625 189375 219588
9864B19588N417L956l475j423j6248K9018k3797Q851J007J5270j3199o073L6814
9851B55706M1207k3150k8184j8844l4601n2598K2425L312K1166L8695K7597p01
9839B52030n8045n5564K8808o913j9703R755L9090q422m4906m4562k1368J9153
9827H9353K2353k730k6046m0267J6024J5486j7496M2092L5715j5958l2038J8312
9815A04800Q726J9352j7896k1206J0601l286j2378K0166m8861j2176P12J187L0367
9802H0108J4357R920J0076j6251l288L030J754R894j4426l2848K0137O2388k0487
9789A24364J6820j1716l4615N771j8170j27M8325k6572p862J2731J0654Q679j7102
9776A11180q822r556j5879J1941j4027N309l515m528k5158K7927L3421M658Q65
$$ plain form
9864 219588 225005 228961 225486 224063 207815 236833 213036 221887 222894 238164 224965 218892 255706
9851 255706 296913 273763 245579 226735 192134 139536 161961 165273 186439 225134 252731 252030
9839 252030 193985 138421 167229 160316 140613 150368 189458 181036 136130 91568 70200 89353
9827 89353 111706 108976 82930 42663 58687 74173 56677 98769 134484 118526 86488 104800
9815 104800 113526 132878 114982 93776 104377 101091 88713 108879 60018 47842 48554 49741 80108
9802 80108 94465 104385 114461 98210 94922 97952 99706 109600 95174 62326 82463 144851 124364
9789 124364 141184 129468 94853 100624 82454 82327 130652 104080 96218 108949 119603 128282 111180
9776 111180 102358 92802 76923 88864 74837 80146 76631 72103 46945 74872 108293 112951 113816
9763A13816L7534j3362l1791k8566M183L024l6470K5271M2550k8501j2590L9284
9751A14382L3605l0451j8839N449P707k0625m973J2607j228k078J2449p373L7665
9738A38297n100j2912q293K2810l7889R199l230J5064J490j3710j165k5724n84
9725G8253j4027K9169J3334K1945k1010J4744j8505J7421J0842J7009j2177l4736
9713A02262l3264O350j9547j5469l569p844l9558L9695Q8374N455k8863l6758
9701E7264l6500j1273K3363K4316R481k5799k3816K410M4245r85n9861Q654J6334
9688B7833J1262k977L5096J2038J1865L482j6246K6556J1611J5860k4935K5814
9676A37259K1566Q510m2158p1805l555M5974K6546r387j2993l870j7232K8860
$$ plain form
9763 113816 151350 137988 106197 77631 81814 84838 48368 73639 116189 87688 75098 114382
9751 114382 147987 117536 98697 104146 111853 91228 86255 98862 97634 95556 108005 100632 138297
9738 138297 133197 120285 111992 134802 96913 106112 102882 117946 119436 105726 104561 78837 78253
9725 78253 64226 93395 106729 128674 107664 122408 103903 121324 132166 149175 136998 102262
9713 102262 68998 75348 55801 40332 36763 28919 -10639 29056 117430 122885 94022 57264
9701 57264 20764 9491 32854 57170 66651 40852 17036 19446 63691 62706 2845 11499 27833
9688 27833 39095 36118 71214 83252 95117 98599 82353 108909 120520 136380 111445 137259
9676 137259 158825 167335 125177 53372 49817 95791 122337 112950 99957 96087 78855 107715
9664A07715j8156Q215J2100J5831j4179j4300p706L6568K4033k0402M37p873k5844
9651I6439k7289O075K1853N296k5817K562P332k0409l3263j0459k2362k3653o802
9638c0497L0213K3066M0551N2803m066j5289r89k8323M4730L4518N283m1613J4292
9625A24679j3366K8835k2419m9914j9303K4506K0977k65m0906k7856j3910O675
9613A7733K0421J289M4783J9679r254m7026n3139R22K9256J0781J6460J2463K1862
9600H6230m6621k67L9153N0918L0383m0371r140L0103j4184k1606l9083K846L1073
9587I9434K8978l325o0713K2485J0888N6752j0676k4202j841K3106r097R536J2064
9574A53389j0798k5145k4760k0240J5046J3429K9640m3212m5831j9023K4268K4481
$$ plain form
9664 107715 89559 97774 109874 125705 111526 97226 89520 126088 150121 129719 130156 122283 96439
9651 96439 69150 75225 97078 102374 76557 79119 86451 66042 32779 22320 -42 -23695 -30497
9638 -30497 -284 22782 63333 116136 112070 96781 95792 67469 112199 146717 152000 110387 124679
9625 124679 111313 140148 117729 67815 48512 73018 93995 93730 52824 24968 11058 17733
9613 17733 38154 39443 84226 103905 94651 47625 -5514 -4592 24664 35445 51905 64368 86230
9600 86230 39609 39342 78495 129413 159796 119425 110285 140388 126204 104598 65515 68361 99434
9587 99434 128412 125087 64374 86859 97747 154499 143823 119621 117780 140886 131789 141325 153389
9574 153389 142591 117446 92686 72446 87492 100921 130561 87349 41518 22495 46763 71244
9562G1244J0486K3425K3118k8467j7690O2737K9270l203j6005K237J9109j3597
9550A62664l6497k0124j9625j9659J6421J8484L250j2272L0433M7767q811K4796
9538A86827l357Q005M332j1172j2776j882n526j1571r144j025J0452K7723L5860
9525B16746j9758j9842L035J6627k1791L4791k0790j6508L4189J805k3999Q55
9513A85360J8268q590k3740l0325l1312k0425J1484J5982j8323J1429k8379L453
9501H4882O2296J7730j7085R716P317j3061k4801j4507l3017M9966M0886j9768
9489A50554n2360j3872m367J3837L6131J9180j1937k3571M613q836k6777O872
9477H9467K3057K2027j2970k6546j8020J3999J2357n876n792M234M200L311L5874
$$ plain form
9562 71244 81730 105155 128273 99806 82116 144853 174123 170920 154915 157152 176261 162664
9550 162664 126167 106043 86418 66759 83180 101664 104914 92642 123075 170842 162031 186827
9538 186827 183470 191475 195807 184635 171859 169977 164451 152880 143736 142711 153163 180886 216746
9525 216746 196988 177146 180181 196808 175017 209808 189018 172510 206699 208504 184505 185360
9513 185360 203628 195038 171298 140973 109661 89236 100720 116702 98379 109808 81429 84882
9501 84882 147178 164908 147823 157539 164856 151795 126994 112487 79470 129436 170322 150554
9489 150554 98194 84322 79955 93792 129923 149103 137166 113595 118208 109372 82595 89467
9477 89467 112524 134551 121581 95035 77015 91014 103371 97495 91703 95937 100137 103448 139322
9464A39322k5439K711K0552N1050p783k0934J7187N2911j9569k5878j4177k2571
9452A47382k543J4513K7258J9453k8630l8123K7077n21k1188k8205M460r75M1013
9439A60971K7297j5485k9288k6677R40L1130L0146K4074m7144m6072P445L4852
9427A52189J1900J7525K4727q295l4251J5058L7721K9846k5815k5017j4987l0419
9415A50182N302J1045K0302o576j7345J8290O02K5948j2468K6225L761n3967k5971
9402A45330M871K6930J8489j1660k9710m4602m15K1867J2408J6337j7163l1362
9390A11320J7619L5331N2002j9883k4578N5522J2806j5255k9386L0404M0766O813
9378B73481j8306n7432m4172P66K0281K0241R266n03J3350K5630M6850J7190n1748
$$ plain form
9464 139322 113883 116594 137146 188196 180413 159479 176666 229577 210008 184130 169953 147382
9452 147382 144839 159352 186610 206063 177433 139310 166387 165866 144678 116473 120933 119958 160971
9439 160971 188268 172783 143495 116818 117758 148888 179034 203108 155964 109892 117337 152189
9427 152189 164089 181614 206341 198046 163795 178853 216574 246420 220605 195588 180601 150182
9415 150182 155484 166529 186831 180255 162910 181200 181802 207750 195282 221507 225268 171301 145330
9402 145330 150201 177131 195620 183960 154250 109648 109233 131100 143508 159845 142682 111320
9390 111320 128939 164270 216272 196389 171811 227333 240139 224884 195498 225902 266668 273481
9378 273481 255175 197743 153571 154337 174618 194859 204125 203622 216972 242602 289452 306642 254894
9365B54894n9119K0312O0329P984j0321m291j3814k1016j6097m0435j4987Q2198
9353B45637N0625L6177o126K7043J9946N20r560K1092l3389m2441k8031q728N1141
9340C23906O1936J4969O282J9868M6288m799J2443M1241n336k7928L1939J5767
9328E36576M5298M5791k2068N582M8627J2749L1265L6714N9618N7569K4427L8449
9316I20597P4213L3488M9291N5421M1229J1009O0964J0568j5756J1487J1299L1246
9304A295056N8110M3743L6308R6680Q6546J16419N2733R0677J46697R9484M5320
9293B167773O7684J01463Q2557Q6713J37458J38547J14742J34983J69564J94618
9283C396102K17309K76513K61303K70403K35456K22970K56885K95982K41817J71783
$$ plain form
9365 254894 195775 216087 276416 284400 274079 269788 255974 234958 218861 178426 163439 245637
9353 245637 296262 332439 326313 353356 373302 373822 364262 385354 351965 309524 281493 272765 323906
9340 323906 385842 400811 407093 426961 473249 468450 480893 522134 516798 488870 520809 536576
9328 536576 581874 627665 605597 611179 659806 672555 703820 740534 800152 857721 882148 920597
9316 920597 994810 1028298 1077589 1133010 1174239 1185248 1246212 1256780 1241024 1252511 1263810 1295056
9304 1295056 1353166 1396909 1433217 1529897 1616443 1732862 1785595 1876272 2022969 2122453 2167773
9293 2167773 2235457 2336920 2419477 2506190 2643648 2782195 2896937 3031920 3201484 3396102
9283 3396102 3613411 3889924 4151227 4421630 4657086 4880056 5136941 5432923 5674740 5846523
9273E846523J84754J79259K80614K93050L14070L45388M18205M11976L63971M42946
9263I080756M51798M25011L92803L25539L38355L21577K12345P1128k9318j28082
9253A1461912j94010k77668l80666m36749m14108m67957n18976n41387n04865
9244G725526m53696m84418m37740l95759l34501l56561l48461l65980l26699l49484
9234C872227k65528k03791j99769k22092k03182j24799j42928j21191j40460j35425
9224B113062j29758r1846j05047q3624n1268m9163j16106q3992k8954l6134m8094
9213A289076p0521q0051n0840l3835n2239k624p039l9858M869n9077p0404m1787
9201G85670j6862j9838l820j1443p818r175m7767m1146k271k6109p2588m5917
$$ plain form
9273 5846523 6031277 6210536 6491150 6784200 7098270 7443658 7861863 8273839 8637810 9080756
9263 9080756 9532554 9957565 10350368 10675907 11014262 11335839 11548184 11619312 11589994 11461912
9253 11461912 11267902 10990234 10609568 10172819 9758711 9290754 8771778 8230391 7725526
9244 7725526 7271830 6787412 6349672 5953913 5619412 5262851 4914390 4548410 4221711 3872227
9234 3872227 3606699 3402908 3203139 2981047 2777865 2653066 2510138 2388947 2248487 2113062
9224 2113062 1983304 1891458 1786411 1702787 1651519 1602356 1486250 1402258 1373304 1337170 1289076
9213 1289076 1218555 1138504 1087664 1053829 1001590 998966 991927 952069 956938 897861 827457 785670
9201 785670 768808 748970 745150 733707 725889 716714 668947 627801 625530 599421 526833 480916
9189D80916P643k4874l5144k3004P93Q080J3585L5430J0835J9301L7183n2764
9177D77980k7175p260j8993j0308m5849l7795J3363j2661M6128M0216N264j7333
9165D05577l0196m1947l9832j9690L9853k4503n0903P628J4013K932j9038n413
9153B38481O4101N773P572J461j6845k3679m584k3733j3907K8471K6872j7515
9141B72468j9722l6624k937m1011R155L9849n61k0168o354k0935k4894l1158q610
9128A08498L1368K4392J8839j7337k4177j5508k3939K6148J985N2541N3176j7100
9116B18886k7681k5693o063J19m3517J5444J4256l6901l5002J7214O2000L357
9104A56419j6144j2492l4635J1754K6540J4206k3426j6969n016R272L6275K44
$$ plain form
9189 480916 488559 463685 428541 405537 406330 414410 427995 463425 474260 493561 530744 477980
9177 477980 450805 443545 424552 414244 368395 330600 343963 331302 377430 417646 422910 405577
9165 405577 375381 333434 293602 273912 313765 289262 238359 245987 260000 262932 243894 238481
9153 238481 302582 308355 315927 317388 300543 276864 272280 248547 234640 263111 289983 272468
9141 272468 252746 216122 213185 172174 181329 221178 220617 200449 194095 173160 148266 117108 108498
9128 108498 139866 164258 183097 165760 141583 126075 102136 128284 130269 182810 235986 218886
9116 218886 191205 165512 159449 159568 116051 131495 145751 108850 73848 91062 153062 156419
9104 156419 140275 127783 93148 104902 131442 145648 122222 105253 100237 109509 145784 146028
9092A46028M146J3247P981m7738k6058J3348J504l8004J8916K9521k1236m3830
9080E7825k2975k896M2092J6608M070j5879k8716k652o155N867J3195R382k8108
9067D1658j7306J7510J6402J3412L577K4069J8952k7986n60R45p27l0484q27J8034
9053G6669P061J0695J5919j7478k094j1880P924l6812n1535L146K5144J2491P190
9040D6440l1827r11M8554L2738J4458K6638m6528l4193J173M2199L2267k5464
9028A05544o1299N446L348J959N859n7289K564K2453M728k4563m8356q827L9199
9015i234M9513N1758K5412l3035j4599P678r086J1305K2741j809m3082j2902K484
9002D7144K8134R047J891k4756l7897J141M0018K2870l0548m1791J4494K8572
$$ plain form
9092 146028 150174 163421 171402 123664 97606 110954 112458 74454 93370 122891 101655 57825
9080 57825 34850 31954 74046 90654 94724 78845 50129 47477 41322 47189 60384 69766 41658
9067 41658 24352 41862 58264 71676 75253 99322 118274 90288 89728 90673 89946 59462 58635 76669
9053 76669 83730 94425 110344 92866 90772 78892 86816 50004 -1531 1615 26759 39250 46440
9040 46440 14613 13702 62256 94994 109452 136090 89562 55369 56542 98741 131008 105544
9028 105544 44245 49691 53039 54998 60857 3568 6132 28585 33313 8750 -39606 -48433 -9234
9015 -9234 40279 92037 117449 84414 69815 77493 68407 79712 102453 100644 57562 44660 47144
9002 47144 75278 84325 86216 61460 23563 24704 64722 87592 57044 15253 29747 58319
8990E8319k9097l107o652j5842k0269Q199K6604J1190J2689L2572J8575J6684
8978A09865k7529n2037j6198K9798K0451J3389m5106N687M2314k8333j8925l2368
8966A008J3873J8367K6099N6234k9421O136P536l106l2888m1856j0300K4300K2675
8953E8657K2523L1920L9573k7432l5762K933k3029q393J4879J7583p27m9129L3481
8940G7077k299k9745P00K4986J7604L1274j4615J3271l1639n9078j8223L0883
8928D0196k9191m6537K9702M0579R109J4486j4867k1191k4748J6840k659k1386
8916i667m777o159k0886l175R895K4762O489l9751K0117K5520L868m894j056j9319
8902a9033O206J9339K6673l49K8301n821l633J651J3087Q475L6956m879n901m7603
$$ plain form
8990 58319 29222 26115 19463 3621 -16648 -8449 18155 29345 42034 74606 93181 109865
8978 109865 82336 30299 14101 43899 64350 77739 32633 38320 80634 52301 33376 1008
8966 1008 14881 33248 59347 115581 86160 92296 99832 96726 63838 21982 11682 35982 58657
8953 58657 81180 113100 152673 125241 89479 92412 69383 60990 75869 93452 92725 43596 77077
8940 77077 74778 45033 45733 70719 88323 119597 104982 118253 86614 27536 9313 40196
8928 40196 11005 -35532 -5830 34749 43858 58344 43477 22286 -2462 14378 11719 -9667
8916 -9667 -14444 -20603 -41489 -44664 -34769 -10007 -3518 -43269 -23152 2368 6236 1342 286 -19033
8902 -19033 -12827 6512 33185 32836 61137 55316 51683 53334 66421 74896 111852 106973 101072 53469
8888E3469m0095L6011N679j2167K1250K0579k3986j0971J9459j1837J2106P786
8876G7283j4535m8524O321L194q915j3563L0794J6846l9005k4029m261N0959M8033
8863H0598L3218j3880k3554l8524j783K2866j1204n262p19M6901k6999k4107K1755
8850E9306K6581n0115j4964j3516J6436J4400M9526q424l5101O040J7739L2807
8838A00715m0062k5193P193M500O938K6196j3659m9586K1209K5545M499J4077
8826H2372J7368L9821j0546k1258k3258k210j0061m8986k8063L8483K2829q016
8814D8475k8572k4942l0j36K3979J0750k8702K9173M8341J3943l5435Q858l5798
8801B9904l6038n1808K4688M8746M8754j0552m7472K6291Q395J3496K682n0894
$$ plain form
8888 53469 13374 49385 55064 42897 64147 84726 60740 49769 69228 57391 69497 77283
8876 77283 62748 14224 20545 23739 14824 1261 32055 48901 9896 -14133 -18394 32565 80598
8863 80598 113816 99936 76382 37858 36075 58941 47737 42475 41756 88657 61658 37551 59306
8850 59306 85887 35772 20808 7292 23728 38128 87654 79230 44129 50169 67908 100715
8838 100715 60653 35460 42653 47153 54091 80287 66628 17042 38251 63796 68295 82372
8826 82372 99740 139561 129015 107757 84499 82289 72228 23242 -4821 33662 56491 48475
8814 48475 19903 -5039 -5069 -5205 18774 29524 822 29995 78336 92279 56844 65702 29904
8801 29904 -6134 -57942 -33254 15492 64246 53694 6222 32513 40908 54404 57086 6192
8789F192q816K3175j301r28j5576m888l674J7999J4128P748j5279m6204K3866
8776c558M6265k4649k9026j4777Q834j2965l116K6576J3595N847k2111l3810j0040
8763e2935p335J1073K3453P9817J0708j0418p294j538k87K6695J8647k5376j5369
8750D9841q313j6049j5388J3590K6832m5435l206m485l9150q84J9366J5569L8006
8737C0294l360o4499j2124N540J8589K8638M432m1898o303M2751K0742m3941J1773
8724i366K1668K473N3076k0884m4082m3887K8579K9747N394K4034K13J1427J5046
8711G3438K5750N592m2556m3832l0709L0279M3620N128j2984l501J252J1302K4070
8698H6849K3415m9365k4284k0185J763M863k9084k0565R403M8444O0805K4394
$$ plain form
8789 6192 -2624 20551 19250 18322 2746 -2142 -5816 12183 26311 34059 18780 -27424 -3558
8776 -3558 42707 18058 -10968 -25745 -16911 -29876 -32992 -6416 7179 13026 -9085 -42895 -52935
8763 -52935 -60270 -49197 -25744 54073 64781 54363 47069 45531 45244 71939 90586 65210 49841
8750 49841 41528 25479 10091 23681 50513 5078 1872 -2613 -41763 -42647 -23281 -7712 30294
8737 30294 26934 -37565 -49689 -44149 -25560 3078 7510 -34388 -40691 2060 22802 -21139 -9366
8724 -9366 12302 14775 67851 46967 2885 -41002 -12423 17324 22718 46752 46965 58392 73438
8711 73438 99188 104780 62224 18392 -12317 17962 61582 66710 53726 50225 51477 62779 86849
8698 86849 110264 60899 36615 16430 18193 23056 -6028 -26593 -17190 31254 92059 116453
8686A16453j0496J8090l4986m4072l6510L3016P647l6155l0933L150O6540j1373
8674D0371j4751j1225J6153P493J0841o211j5062k92j4017k5236J3487J5774n6335
8661c9010k3342O653J9956J4370M41J8977J1527L3930l1713k9943k9366k7902
8649g5422K4526L9576L8889k2649m2954N8355K5276j7156O547J0874j4126K654
8637C4390K1698M946M164J2904k0319o341R13K4016o828j9950J9835k9809l2136
8624G483j5074m299K0456K5854L3658p387K376J9213j2468J6863k5084l4053J8191
8611D5729L8424j911q862K9248O714l8321m0038J4418L2715L692K028J8900L6171
8598A38907m680M0652M2118M1978M11j0031k0590n0284j455K4031l8138k3841
$$ plain form
8686 116453 105957 124047 89061 44989 8479 41495 49142 12987 -17946 -14796 51744 40371
8674 40371 25620 14395 30548 38041 48882 42671 27609 27317 13300 -11936 1551 17325 -39010
8661 -39010 -62352 -55699 -35743 -21373 -20932 -1955 9572 43502 11789 -18154 -47520 -75422
8649 -75422 -50896 -11320 27569 4920 -38034 20321 45597 28441 34988 45862 31736 34390
8637 34390 56088 61034 65198 78102 57783 51442 52355 76371 69543 49593 69428 39619 7483
8624 7483 -7591 -11890 8566 34420 68078 60691 63067 82280 69812 86675 61591 27538 45729
8611 45729 84153 82242 73380 102628 109342 71021 30983 45401 78116 81808 83836 102736 138907
8598 138907 134227 174879 216997 258975 259386 249355 228765 178481 177026 201057 162919 139078
8586A39078l1465K9190O1306K6785p7047o8951J0971Q119J0157k5023l1183M6100
8574I8037J3940j6743k2770j336m7946j5295P836J1176R957K0109L9451r322J7303
8561A04397M204j8150k7885j9932J5707J6795K2636j970l1653k7409Q793j9364
8549B6169L6736L9044J878n2896k4408M7081K9701L87m9732k2985J9835m0657
8537A0153n535J754p788J0304J4023J0346J3422r262k4625m3392j0659L5744N0905
8524D5390K016p639j3911K2166j4743n386j509k029L1981m1943n0831K2701j7131
8511c0868m793O4420L5386j094J4075P22l6001j8010l8275p514Q612P555R536
8498C751K0380L8597J8771k7169k9067M106l2102l2451m049J3622J3323p900J7685
$$ plain form
8586 139078 107613 136803 198109 224894 147847 78896 89867 97986 108143 83120 51937 98037
8574 98037 111977 95234 72464 71128 23182 7887 15723 26899 36856 56965 96416 87094 104397
8561 104397 108601 90451 62566 42634 58341 75136 97772 95802 64149 36740 45533 26169
8549 26169 62905 101949 103827 50931 26523 73604 103305 103692 53960 30975 50810 10153
8537 10153 4618 6372 -1416 8888 22911 33257 46679 37417 12792 -30600 -41259 -5515 45390
8524 45390 47406 39767 25856 48022 33279 27893 26384 24355 56336 14393 -36438 -13737 -30868
8511 -30868 -35661 28759 64145 63051 77126 77848 41847 23837 -14438 -21952 -13340 -5785 3751
8498 3751 24131 62728 81499 54330 25263 29369 -2733 -35184 -39233 -25611 -12288 -20188 -2503
8485b503J9224p091K0411j616j4638j562L3348j1529L2749K9105q5359n7097j2502
8472e9060J4524J6874K583J7334r272J1317j4627M533K9107K3114J9120j2774
8460D2773P254J03p4423m4866M0704k684O933N1802K3715J9016j3090J7978L2418
8447A07633k3719k2352L463j2741Q865k9973J1841r666N510j3980j5179N0967
8435F0669L4464m6578k1300o282N6932M2960j3440k9603j8957r307k3096K2001
8423D8463L3885m2414j7464j5787J5232K7513j0918l5653k2339J6350q249p906
8411a9287J9586L2927o556R703M1849J101j2182O51l7019o1129l459p98J7739
8398a6874J0486j1929J134L8713j6621m5201r489L6136N1553J8302j0026j1067
$$ plain form
8485 -2503 16721 9630 30041 28425 13787 12225 45573 34044 66793 95898 10539 -46558 -59060
8472 -59060 -44536 -27662 -25079 -7745 -17017 -5700 -20327 -15794 13313 36427 55547 42773
8460 42773 50027 50130 -24293 -69159 -28455 -31139 -24206 27596 51311 70327 57237 75215 107633
8447 107633 83914 61562 65025 52284 61149 31176 43017 33351 38861 24881 9702 60669
8435 60669 95133 48555 27255 20973 77905 120865 107425 77822 58865 49558 26462 48463
8423 48463 82348 39934 22470 6683 21915 49428 38510 2857 -19482 -3132 -11381 -19287
8411 -19287 299 33226 26670 36373 78222 79323 67141 67792 30773 -30356 -33815 -34613 -16874
8398 -16874 -6388 -18317 -17183 21530 4909 -40292 -49781 -13645 37908 56210 46184 35117
8386C5117j8361q861k2578l4527L8454J8057J6922m1310j3273N132K6326K1397
8374B2495J3359j6401q054m7609k2711J6195N3513O0140L610k5295m0788n3700
8362d5246k456L7094K6786l0451K3650L6770R821N1l9008m8358k4258L3873J7061
8349d671o230l753K8485L5892k9352n0719r522o885j8148P075Q902k938k1080
8336g2944l1959k3440K5387N1361J0875O07N1843n418l6432K4324L496j8279L4225
8323A3646K166p646O495j6381K5062J1204k6342L819L4754k4024j8020k3100j3055
8310c1422J8184L2900K1044l1994o928m3491J5267J9284L6566r515j1734j0113
8298a952R997L4159R117m3524m1949K2025N4714K0259O985J3303J329k9993m0820
$$ plain form
8386 35117 16756 7895 -14683 -49210 -10756 7301 24223 -17087 -30360 -25228 1098 22495
8374 22495 35854 19453 11399 -36210 -58921 -42726 10787 70927 74537 49242 8454 -45246
8362 -45246 -47702 -10608 16178 -14273 9377 46147 55968 56019 17011 -31347 -55605 -21732 -4671
8349 -4671 -10901 -14654 13831 49723 20371 -30348 -39870 -46755 -64903 -57828 -48926 -51864 -72944
8336 -72944 -104903 -128343 -102956 -51595 -40720 -40113 11730 6312 -30120 -5796 -2300 -20579 13646
8323 13646 15812 8166 14661 -1720 23342 34546 8204 12023 46777 22753 4733 -18367 -31422
8310 -31422 -13238 19662 40706 8712 1784 -41707 -26440 -7156 29410 19895 8161 -1952
8298 -1952 8045 42204 51321 7797 -34152 -12127 42587 62846 69831 83134 84463 54470 13650
8285A3650k0611l430J6781L6093N979m8552J508J1850K8334j1040m480l4092k6080
8272c4090Q589J3655p345k1027r426K171M6925L7463q443k3633j1162k007r537
8259a7867O715L9066J0070J412K595k3218m490L2229L6160m415l1013j9345j6346
8246A1553K5328n2894J8695j3692j2667j5575k0058j1862J7888r315k3278L9008
8234d6869M9742J1631m348l1553p465R330j6912j4513m2596j5995O6748O0028
8222A7228O822J7618j6520m4787k9342J2960M3199N5941m700m424J7552j3117
8210E8430k3513k1686m5J7313l3404l5827j1018J6562l5434k7943K4986M5103
8198b6476K9834r351j8318K9249M7527j0925K6048j3951M1039L831l5056l2564
$$ plain form
8285 13650 -6961 -10391 6390 42483 48462 -90 1418 13268 41602 30562 26082 -8010 -34090
8272 -34090 -25501 -11846 -19191 -40218 -49644 -47473 -548 36915 28472 4839 -6323 -8330 -17867
8259 -17867 -11152 27914 37984 39396 41991 18773 14283 46512 82672 78257 47244 27899 11553
8246 11553 36881 -16013 2682 -11010 -23677 -39252 -59310 -71172 -53284 -62599 -85877 -46869
8234 -46869 2873 14504 10156 -21397 -28862 -19532 -36444 -50957 -93553 -109548 -42800 17228
8222 17228 24050 41668 25148 -19639 -48981 -36021 7178 63119 58419 53995 71547 58430
8210 58430 34917 13231 13186 30499 -2905 -38732 -49750 -33188 -68622 -96565 -71579 -26476
8198 -26476 3358 -5993 -24311 4938 52465 41540 67588 53637 94676 98507 63451 30887
8186C0887j0953j3197n776M8260J9351m3833j2045J0875L1745k9585M2820N712
8174G4261j0762m4615k0421M3847K2962J6067j1130O922K9986o140l3328n2489
8162A5160l3602k0145L0134L4339N524l1071o797Q429m4988k8588P472J8667N8474
8149A3008P035k4160p219k9396m0256j6083M6522N0510J8730l7077k7904L8360
8137g930K9523o42J6895k4794j6491J0766m7339k1292L6637J3269M373Q936K2465
8124B4376o0991l380J2212q425K922L3837M238J2988m824K6287K767j5525l912
8111B2570R52J1476j5908J6866P777R457l1092o551L0107m01o0707l4207J4487
8098c5174P2243J4685j0036j582J542K7344k547l7235k435J1710M0723j6777l5520
$$ plain form
8186 30887 19934 6737 961 49221 68572 24739 12694 23569 55314 25729 68549 74261
8174 74261 63499 18884 -1537 42310 65272 81339 70209 77131 107117 100977 67649 15160
8162 15160 -18442 -38587 -8453 25886 31410 339 -6458 1971 -43017 -71605 -64133 -45466 13008
8149 13008 20043 -4117 -11336 -40732 -80988 -97071 -50549 -39 18691 -18386 -46290 -7930
8137 -7930 21593 20951 37846 13052 -3439 7327 -40012 -61304 -24667 -11398 -7025 1911 24376
8124 24376 -36615 -39995 -27783 -36208 -33286 551 4789 17777 12953 39240 42007 26482 22570
8111 22570 23522 34998 19090 35956 43733 53190 22098 15547 45654 45253 -15454 -49661 -35174
8098 -35174 37069 51754 41718 40136 41678 69022 66475 29240 26805 38515 79238 62461 26941
8085B6941l741j8893n3022O530P3277P469k1353m1654N7705P644P225K2035j0556
8072E9607r812k9354R350l4702k9116L703J6634L6612O410N349M8238K057l1591
8059E3385l3194M166l9917k1889L900L0396L1636N0302P693j3819m0922Q673L212
8046D3622J5730m3079m3820o055O0270J9135k0262J3863P112J5707r026J3198
8034F6395k5896J68M8300J8416j1831n3874l9876l0288L7445L1591L8256J2176
8022I0982l0777l8904N786j4246R557J3487J9499l398K7853J1466q12p072l0973
8009E2448m0700k1923K2517M1626L6243N539j6843K1361l824j3166K0284r983
7997I3579q682k7168j9925L4320K6297K1712N805L3821n2785k6207q205l6174
$$ plain form
8085 26941 23200 4307 -48715 -42185 31092 38561 17208 -24446 33259 40903 48128 70163 59607
8072 59607 49795 20441 29791 -4911 -34027 -30324 -13690 22922 29332 34681 82919 84976 53385
8059 53385 20191 24357 -15560 -37449 -33549 -3153 28483 78785 86478 72659 31737 40410 43622
8046 43622 59352 16273 -27547 -33602 26668 45803 25541 39404 46516 62223 53197 66395
8034 66395 40499 40667 88967 107383 95552 41678 1802 -28486 8959 40550 78806 90982
8022 90982 60205 21301 27087 12841 22398 35885 55384 51986 79839 91305 90493 83421 52448
8009 52448 11748 -10175 12342 53968 90211 95750 78907 100268 96444 83278 103562 93579
7997 93579 84897 57729 37804 72124 98421 120133 125938 159759 106974 80767 72562 36388
7985C6388l5333l8175M746N7718O5429n0570k4992M1536K4251q510m5632k7242
7973c86K6133j816o781K062k470K5145L1214K4613k287j1353j8656k6782K5221
7960F3857K0312N389J30p63j483m378j52K547q636K3467k728l1803j7613p328
7946D0818L3867L266J1579J5417M544l4250n219r742M599O256l4606k9317L000
7933A0212K9260K0533J1504k7451J8200J5050J4924k3809k5419k5614j0894M8734
7921E5230M2449j308M223n9654m4328j0379K312l547O6683M8185l3647L8928j742
7908A03405l6101m6203k774K4402l4217o203K8503L6967j3785j8086J0849m4591
7896B166o3519r842J7654K1001J2378l306M5614k091L689l2134K9203N4551l4588
$$ plain form
7985 36388 1055 -37120 -32374 25344 90773 40203 15211 56747 80998 72488 26856 -386
7973 -386 25747 23931 17150 19212 16742 41887 73101 97714 95427 84074 65418 38636 63857
7960 63857 84169 89558 89688 88925 87442 83064 82912 85459 76823 100290 97562 65759 48146 40818
7946 40818 74685 77951 89530 104947 109491 75241 70022 60280 64879 71135 36529 7212 10212
7933 10212 39472 60005 71509 44058 62258 77308 92232 68423 43004 17390 6496 55230
7921 55230 97679 96371 100594 40940 -3388 -13767 -11455 -15002 51681 99866 66219 105147 103405
7908 103405 67304 21101 18327 42729 8512 2309 30812 67779 53994 35908 46757 2166
7896 2166 -61353 -71195 -53541 -32540 -20162 -23468 22146 20055 23744 -8390 20813 75364 40776
7883D0776q28M342J0099R882k3789J3783k5354n4647j8036P406M9624k1954j0641
7870a9337j036K3566J1528k2900L171N7744L3406j7916j6718j6735J3213N009
7858E2995j6026K2511R888l6038J8425o934m0492M1897J6689J4705J1033l7796
7846E0857k8287r836k0420k098q687K688L3945p832j8987k933j0746k2239J8535
7833b6040l0284r501n537j5910J6648J276P895N034K6962j3933l29M466r45J3009
7819b7189Q660J3640L4999k2942j2116N9713N610j9534m1512o599Q803m1684J2595
7806b7556N7924J7129l4291J206j3166k4421l4902K483L1101o327J1089J9974
7794B43J8652O150R920p098R499J8693o0762k4162J7166L7636K2096l4535P0l5496
$$ plain form
7883 40776 39948 44290 54389 64271 40482 54265 28911 -25736 -43772 -36366 13258 -8696 -19337
7870 -19337 -20373 3193 14721 -8179 -5008 52736 86142 68226 51508 34773 47986 52995
7858 52995 36969 59480 69368 33330 51755 44821 4329 46226 62915 77620 88653 50857
7846 50857 22570 12734 -7686 -9784 -18471 -15783 18162 10330 -8657 -11590 -22336 -44575 -26040
7833 -26040 -56324 -65825 -71362 -87272 -70624 -69348 -61453 -56419 -29457 -43390 -43719 -39253 -40198 -27189
7819 -27189 -18529 -4889 30110 7168 -4948 54765 60375 40841 -671 -7270 1533 -40151 -27556
7806 -27556 30368 47497 13206 14412 1246 -23175 -58077 -55594 -24493 -30820 -19731 243
7794 243 18895 25045 34965 27867 37366 56059 -4703 -28865 -11699 25937 48033 13498 13568 -21928
7780b1928L152N295J3823R422q773l0475j880M7255J5988k8078N875p457K9429
7767C1648k6251n0215J9877M800K715k7072j0251n10l1647j6829K3228N7837J8250
7754d420k0687k2626P975O5505K1003j9198l011k3883j903j6848j8425N502L535
7741b7481j9611q746K8807N311l4509j4538K3178j042O76K5464K4938j0189k7789
7728c5531j2123P064k0536o500l2945M6478M2433N2060o9m2885m7965o0381O2606
7715d8294O1434q843M489J1878N772n101n523p168k3708J1337j561j129J1619
7702E202j9821m0343J9622J5946k1875j7634L3026M6242j7052K63J6741J2110
7690C2427m4572l1515j6551L6601j6209k2298J770J9862K4365M2582j8987j2441
$$ plain form
7780 -21928 -18776 -13481 342 9764 991 -29484 -31364 15891 31879 3801 9676 2219 31648
7767 31648 5397 -44818 -24941 -20141 -17426 -44498 -54749 -55259 -86906 -103735 -80507 -22670 -4420
7754 -4420 -25107 -47733 -39758 25747 46750 27552 24541 658 -1245 -18093 -36518 -31016 -27481
7741 -27481 -47092 -55838 -27031 -21720 -56229 -70767 -47589 -48631 -47955 -22491 2447 -7742 -35531
7728 -35531 -47654 -40590 -61126 -67626 -100571 -54093 -11660 40400 40331 -2554 -50519 -110900 -48294
7715 -48294 13140 4297 8786 20664 26436 21335 15812 8644 -15064 -3727 -5288 -6417 5202
7702 5202 -14619 -54962 -35340 -19394 -41269 -58903 -25877 20365 3313 3576 20317 32427
7690 32427 -12145 -43660 -60211 -23610 -39819 -62117 -60347 -40485 -16120 26462 7475 -4966
7678d966m805J715k961l0882j5980K1451M0744J6760J9757J5696k3890j2966M709
7665B4382j1083j4467M9869L988j9020Q891O451q332M1969k2778n3185q7438m6141
7652a26894L3724O2124p015j2091j1717J3038J0056j1990p2531J5516Q1884L1166
7640E270n018j0402K8261M773k2571l1900q27l448L0382K2286p53j8686p791K5649
7626A5225J8370k6022k8819M146K1167l182k0005l5861K4204L3409J8642L112
7614B4386l416N679j3851l1741j5979J7096l3839o378J5948j2735M1564L5415
7602B2149K0387J8297j9171j1222O686J6522m5285k6594P782N0400l5596l410
7590I45N096L1870l7555m5030K8731N1392l1484l8941L1435O9l7184k7743k3964
$$ plain form
7678 -4966 -9771 -8056 -11017 -41899 -57879 -36428 4316 21076 40833 56529 32639 19673 24382
7665 24382 13299 -1168 48701 52689 33669 42560 49011 40679 82648 59870 6685 -80753 -126894
7652 -126894 -93170 -31046 -38061 -50152 -61869 -48831 -38775 -50765 -123296 -107780 -25896 5270
7640 5270 252 -10150 18111 22884 313 -31587 -32414 -35862 -5480 16806 16053 -2633 -10424 15225
7626 15225 33595 7573 -21246 -17100 4067 885 -19120 -54981 -30777 2632 21274 24386
7614 24386 20970 26649 12798 -18943 -34922 -17826 -51665 -58043 -42095 -54830 -13266 22149
7602 22149 42536 60833 41662 30440 37126 53648 8363 -18231 -10449 39951 4355 945
7590 945 6041 37911 356 -44674 -15943 35449 3965 -34976 -3541 -3472 -40656 -68399 -92363
7577i2363L0502L3789K0083l4335l7714l204L3403O97M360j295l570N8199p678
7564H74j1322k5376O958K5969J0822o6979p171M3441M4292j4612l3181j0715n2966
7551h9966j4695N7177L6930P010K0886m2790k4292K2909j833P194K6243k3165
7539a8392M7359L7775m3144l6192J6219l5059l2327m314J8382J3843J2582O526
7527a6742j9813j9866J8068K4806N404j505j3718j5403o535J2788N0321k4630
7515f825k1911n880L2277L0359R949R09n664J773J6235o360j2636k6173p8010
7502g1957m4519J7474J6867M2184J4509k7271r322L1125J3735J7668l902k6465
7490b9874o182J985j3997J7519R702J9906p746M870J7900l570o139l6519J4598
$$ plain form
7577 -92363 -61861 -28072 -7989 -42324 -80038 -83242 -49839 -49142 -44782 -46077 -49647 8552 874
7564 874 -10448 -35824 -28866 -2897 7925 -59054 -66225 -22784 21508 6896 -26285 -37000 -89966
7551 -89966 -104661 -47484 -10554 -3544 17342 -25448 -49740 -26831 -28664 -21470 4773 -18392
7539 -18392 28967 66742 23598 -12594 3625 -31434 -63761 -68075 -49693 -35850 -23268 -16742
7527 -16742 -36555 -56421 -38353 -13547 -8143 -9648 -23366 -38769 -45304 -32516 17805 -6825
7515 -6825 -28736 -34616 -2339 28020 37969 38878 33214 34987 51222 44862 32226 6053 -71957
7502 -71957 -116476 -99002 -82135 -39951 -25442 -52713 -62035 -30910 -17175 493 -3409 -29874
7490 -29874 -36056 -34071 -48068 -30549 -20847 -941 -8687 -3817 14083 10513 4374 -32145 -17547
7477a7547n045K7955K3543m4126J5168P881k2189l160j2517J9723K4422l0572
7465a6464k8238j2420l366M3621M3817r913m0339L24j7759O9058K7384o1182l8460
7452d3937k0813k2943o968J1489L0718j3051j1165R219J3438K9214k2413j6276
7440f3488J026L2465K0791O349Q315Q03L906j5147k0649K928J2086L1056K0794
7427D1235n182k9764k0146k5256K6026Q355L6223m5068m8784K6782p065K4415
7415a8229Q133K4998j5641m0433k865k0473j9956L8233L1541L319O4800L3962
7403H7389m2470l1259m389m6939n6812J6609K1961J3998K1073M0586j1515j7945
7391i713k8614J4110p618O872M3632K8289K7228j5642p684R606m6112m0094l5070
$$ plain form
7477 -17547 -22592 5363 28906 -15220 -52 7829 -14360 -17520 -30037 -10314 14108 -16464
7465 -16464 -44702 -57122 -60488 -16867 26950 17037 -23302 -22978 -40737 28321 55705 -5477 -43937
7452 -43937 -64750 -87693 -94661 -83172 -52454 -65505 -76670 -67451 -54013 -24799 -47212 -63488
7440 -63488 -62462 -29997 -9206 -2857 5458 6261 10167 -4980 -25629 -22701 -10615 20441 41235
7427 41235 36053 6289 -13857 -39113 -13087 -4732 31491 -13577 -62361 -35579 -42644 -18229
7415 -18229 -10096 14902 -739 -41172 -44037 -64510 -84466 -46233 -14692 -11373 53427 87389
7403 87389 44919 13660 9271 -37668 -94480 -77871 -55910 -41912 -20839 19747 8232 -9713
7391 -9713 -38327 -24217 -31835 -24963 18669 46958 74186 58544 50860 60466 14354 -25740 -60810
7378f0810M488o710m990P914J8696K905J4453K7190l287q418j5079O07M0629L851
7364B1439k129J2403l9210j1635P505K478M645Q075r922n723J4614N67l2601J9372
7350a0122K7544J1998N647k7398J4693K6540j0202o87K6646j5384l9122j6829
7338f676j855R257K5294K0081K5482l136J0144l6841P089m1982r5327j704M3027
7325d7147P1261J1396k4741N364N058L681k869p848j3003L097K945k8156n1176
7312g2138K7290M5516J9660M625k2306K3185R55k9751l7628J8559k3298j8980
7300f4311j1828N983J7343j0234m297L2897J0660K8842j0446L8087P69j0211J0053
7287C3307k1170k9643P358J2250K3002m241l1747n042J8402J6823l0944j1328
$$ plain form
7378 -60810 -56322 -63032 -68022 -60108 -41412 -38507 -24054 3136 -151 -8569 -23648 -23041 17588 21439
7364 21439 19310 31713 -7497 -19132 -11627 -9149 -4504 3571 -6351 -12074 2540 3107 -29494 -10122
7350 -10122 17422 29420 35067 7669 22362 48902 38700 38013 64659 49275 10153 -6676
7338 -6676 -8531 726 26020 46101 71583 68447 78591 41750 48839 6857 -88470 -90174 -47147
7325 -47147 24114 35510 10769 16133 21191 24872 22003 14155 1152 4249 7194 -20962 -72138
7312 -72138 -44848 668 20328 24953 2647 25832 26787 -2964 -40592 -22033 -45331 -64311
7300 -64311 -76139 -70156 -52813 -63047 -67344 -34447 -23787 5055 -5391 32696 33465 23254 33307
7287 33307 12137 -17506 -10148 2102 25104 20863 -10884 -15926 2476 19299 -11645 -22973
7275b2973o425k2795P2484K3001l4584J3588P052k6126J1670o715J1824L4126
7263E4127J6679k0014n3300R049K3130m5212q858k496j683q80r390q698k2134
7250f9680K2874M9596M8720J7959m7903m0865j3581K5323J9988R947p1785K2158
7238b7249L2849J5776p237m2308k8182K3009L3746j1652k5100l7283M0838N8161
7226B5368j7215k9304j7555K3086J9064l5382j4515Q268L2354K1831k3914n275
7214a3189N927J6251N745m358l1001j2079J1046J2061J7396J5606j7142K0024
7202B6287j772j1104L8573k152j8868K0293P768l127m460O864l4683n5616r737
7189d1734J5043K3656L801j6642j0923N6055J5988n6554k6890L031K1848M840
$$ plain form
7275 -22973 -29398 -52193 20291 43292 8708 22296 29348 3222 14892 8177 20001 54127
7263 54127 70806 50792 -2508 6541 29671 -15541 -24399 -26895 -28578 -29458 -38848 -47546 -69680
7250 -69680 -46806 2790 51510 69469 21566 -19299 -32880 -7557 12431 22378 -49407 -27249
7238 -27249 5600 21376 14139 -28169 -56351 -33342 404 -11248 -36348 -73631 -32793 25368
7226 25368 8153 -21151 -38706 -15620 3444 -31938 -46453 -38185 -5831 16000 -7914 -13189
7214 -13189 -7262 8989 14734 10376 -20625 -32704 -21658 -9597 7799 23405 6263 26287
7202 26287 24515 13411 51984 49832 30964 51257 59025 55898 51438 58302 23619 -31997 -41734
7189 -41734 -26691 -3035 766 -15876 -26799 29256 45244 -11310 -38200 -35169 -13321 -8481
7177h481j756j3486M122K004n816K7185j0262n3686K935J7840L7874k6347m0516
7164f8390J5782M4250O9956r53m1035o6387L049L7314N7885Q715k4964k2083L326
7151A6465j4587J3037r434j8160J845N0769j6595l1395m1393M2281N0903l7098
7139F638n5827j1626J9665r502K5539M0997K1066L6561j9598R730l2192K8211
7127E9662j880o0544n0099L7229K5236o182j2057p214j1201L7982m8940j3308
7115e1316K2890m786j003M975o74J0537K2575L0613L358k237j2592Q386k2732
7102G994J0993K7715k5180k7997m270n7776L8725l2313J5669O9592l5985O093
7090f740M6590j1953K0804K0580m137j4778j1803O51k3944m0558J9624j5128j4730
$$ plain form
7177 -8481 -10237 -23723 -19601 -17597 -23413 3772 -6490 -60176 -57241 -39401 -1527 -27874 -68390
7164 -68390 -52608 -8358 61598 60645 19610 -46777 -43728 -6414 51471 60186 35222 13139 16465
7151 16465 1878 14915 5481 -12679 -10834 39935 23340 -8055 -49448 -7167 43736 6638
7139 6638 -49189 -60815 -41150 -50652 -25113 15884 36950 73511 53913 63643 31451 59662
7127 59662 57782 -2762 -52861 -15632 9604 3422 -8635 -15849 -27050 10932 -38008 -51316
7115 -51316 -28426 -33212 -34215 -29240 -29914 -19377 3198 33811 37169 34932 22340 30726 7994
7102 7994 18987 46702 21522 -6475 -10745 -68521 -29796 -62109 -46440 23152 -12833 -6740
7090 -6740 39850 27897 48701 69281 65144 50366 38563 39214 15270 -25288 -5664 -20792 -35522
7077c5522J0432p926j2826k3080k3176O3353K0627k0272K1609L9415M946k2982
7065A4598m7966K1847n852k2309J8146L202Q292o400j634n2801j8187M0450L7060
7052a1554M733J5546n034m6992m372L8968R262P469m8384m6141J01N6738O2448
7039C2788j444k9406O221K1022j1461j0486j6912j7979J817J8185l209l1906L0321
7026a2449L0876M0699k4877k9274j6389N7782J474m1620j4994n3710k4923j7140
7014a04545N9836K9155k2036K003l143o442J0682N495K1810L3035J7729k3818
7002A9761m0257q569M0742j0390n9082l0057M3414L4650m121O436j0768j3374
6990c1615J5965k0996m569K144j5820O997M091k8874n3204j0929O8651L7706p180
$$ plain form
7077 -35522 -25090 -33016 -45842 -68922 -92098 -28745 -8118 -28390 -6781 32634 37580 14598
7065 14598 -33368 -11521 -17373 -39682 -21536 -18334 -10042 -16442 -18076 -70877 -89064 -48614 -11554
7052 -11554 -6821 8725 3691 -43301 -47673 -8705 557 8026 -40358 -86499 -86398 -29660 32788
7039 32788 31344 1938 8159 29181 17720 7234 -9678 -27657 -25840 -7655 -10864 -42770 -12449
7026 -12449 18427 59126 34249 4975 -11414 46368 47842 6222 -8772 -62482 -87405 -104545
7014 -104545 -44709 -15554 -37590 -35587 -38730 -45172 -34490 -28995 -7185 25850 43579 19761
7002 19761 -20496 -29065 11677 1287 -57795 -87852 -44438 -9788 -13909 -7473 -18241 -31615
6990 -31615 -15650 -36646 -41215 -39071 -54891 -47894 -43803 -72677 -125881 -136810 -68159 -30453 -37633
6977c7633J5572L130n597m239k2342j8699r480J6113k2628k2683N6675L7767J3816
6964b28n870m2718m185P0133K9205n2427j5035J3067k4685l6763k7287O0298M4068
6951G573J2352J1435m1k0641Q933l0167J9133q493m5757K1919R821k0577K3322
6938a1188K9061K2396N565l7001n6010K8491j630j5037n520J9524L0826j0196
6926g19P553O739j7751q031Q662m629J9486k410K2890K0021O781L6675J1021l6275
6912G0013l3318n898R217K0876j6979o9335r996n437j9476L236J8584k8737r973
6899g7223M3611J9783q803J0367J854J7257M0373k4615j6676j3043J3398j4721
6887h438m284m2674J5085J0565j5067l6429Q206L1259K2488M482j7614q80L6637
$$ plain form
6977 -37633 -22061 -18931 -24528 -28767 -51109 -69808 -79288 -63175 -85803 -108486 -51811 -14044 -228
6964 -228 -6098 -48816 -53001 17132 46337 -6090 -21125 -8058 -32743 -69506 -96793 -36495 7573
6951 7573 19925 31360 31319 10678 19611 -10556 8577 84 -45673 -23754 -13933 -34510 -11188
6938 -11188 17873 40269 45834 8833 -47177 -18686 -20316 -35353 -40873 -21349 9477 -719
6926 -719 6834 13573 -4178 -12209 -3547 -8176 11310 8900 31790 51811 58592 95267 106288 70013
6912 70013 36695 30797 40014 60890 43911 -25424 -35420 -40857 -60333 -57097 -38513 -67250 -77223
6899 -77223 -33612 -13829 -22632 -12265 -10411 6846 47219 22604 5928 -7115 6283 -8438
6887 -8438 -12722 -55396 -40311 -29746 -44813 -81242 -73036 -41777 -19289 -14807 -32421 -33301 3336
6874C336K3638j4733K3610L780J843K3291r768l6262l0350j0986N366J2248k2001
6861b6988o024r665j7501m267N6529l502k4738j1263N2364l490l681m657r17m0633
6847d8433L0616L243M378N0522J6313j2900j5787K1049J3908J4719m1461l0679
6835E488Q488j3484k6589m5055O860O3072M2750N9944R691L4388L7051j67M040
6822A86477m644J5047n013J4578j2629q4133o6635J2643R345L9835q240p0458
6810B6173j3744L631Q656j3465m3023J9496M5463j4660j9197Q828q001j5001K120
6797a2724L3484J9369J1399l1267r530J2565L7868J2886p180r926m7474K3577
6785C3047l163k4508R026P3839L4793L2720J4312l4856k6952k3534j6941j0593
$$ plain form
6874 3336 26974 12241 35851 39631 41474 64765 54997 18735 -11615 -22601 -17235 -4987 -26988
6861 -26988 -33012 -42677 -60178 -64445 -7916 -11418 -36156 -47419 4945 1455 -2226 -6883 -7800 -48433
6847 -48433 -17817 -14574 -10196 40326 56639 43739 27952 49001 62909 77628 36167 5488
6835 5488 13976 492 -26097 -71152 -64292 -1220 41530 101474 111165 145553 182604 182437 186477
6822 186477 181833 196880 191867 206445 193816 109683 43048 55691 65036 104871 96631 26173
6810 26173 12429 16060 24716 11251 -31772 -12276 33187 18527 -670 8158 157 -14844 -12724
6797 -12724 20760 40129 51528 20261 10731 23296 61164 74050 66870 56944 9470 33047
6785 33047 29884 5376 14402 88241 123034 155754 170066 135210 108258 84724 67783 57190
6773E7190j4282J9758K5317J5989j2685k4975n930J3118Q199L2269j9865J4510
6761A08613K8992L9037M2754j3353J6995K8454L2861K8261j0372N1782N6245M890
6749D15159q867P094M1241R7464O3783K5595N0636Q3585L2933J6372j9666K3758
6737H29087M3260L5291K152m9417m6212k846M3488Q2134M7377O8551J38724J51762
6725A343351J16863J89303L48202N01083N90838O76107O49322N65918N98720Q23021
6715F402728Q96601M12017q45630j787117j682769j118080o78580m28219k81289
6706H89662j49512j80234p5475n8860m8713n0042k1094J384j7133K8063P9784
6695C97830o3153m8567O305J1533K7380k971n2458n6688m9130m0279K4394J3896
$$ plain form
6773 57190 42908 62666 87983 103972 91287 66312 60382 73500 81699 113968 94103 108613
6761 108613 137605 176642 219396 206043 223038 251492 284353 312614 302242 354024 410269 415159
6749 415159 406292 413386 454627 552091 615874 641469 692105 775690 808623 824995 805329 829087
6737 829087 872347 907638 909790 860373 814161 811315 854803 936937 984314 1052865 1191589 1343351
6725 1343351 1460214 1649517 1997719 2498802 3089640 3765747 4415069 4980987 5579707 6402728
6715 6402728 7299329 7711346 6865716 5078599 3395830 2277750 1599170 1170951 889662
6706 889662 740150 559916 484441 425581 376868 326826 305732 307116 289983 318046 397830
6695 397830 334677 286110 292415 303948 331328 328357 275899 219211 170081 129802 154196 168092
6683A68092j4572m904k8507o0652l8916q014l4596J1384L3355O708o215L2041
6671E5204J7917k3035l186m141J3800k9912k7607L837L4172P334k5038L297p26
6658B1916n5997K885L0115P031J7936K1914j752m8692J618K9522j927m0135P735
6645g831M9193n625l2269j0654n604k1841k1847L8489L5824J3633K535L3897j7948
6632D9952n9927j7089j2418K1465R445k705l3346k4446J5113K460M109L1297J4902
6619a188K0418j570k8455j4061L5400L4228J7717n2931m8997L8209K622k7415
6607b6023L5050M0866J9135R982j2313o1355l1932L4760k045j9764o84J553p766
6594b0536j1788l7135j7274J5709n647J9359K6515L495K4628j0334k4979n881
$$ plain form
6683 168092 153520 148616 120109 59457 20541 12527 -22069 -10685 22670 29378 23163 55204
6671 55204 73121 50086 46900 42759 56559 26647 -960 2877 37049 44383 19345 22642 21916
6658 21916 -34081 -31196 -1081 5950 23886 45800 44048 -4644 -3026 26496 24569 -15566 -7831
6645 -7831 41362 35737 3468 -7186 -12790 -34631 -56478 -17989 17835 31468 34003 67900 49952
6632 49952 -9975 -27064 -39482 -18017 -8572 -11277 -44623 -69069 -53956 -51496 -47387 -16090 -1188
6619 -1188 19230 17660 -10795 -24856 10544 44772 62489 9558 -39439 -1230 1392 -26023
6607 -26023 9027 49893 69028 79010 66697 5342 -26590 8170 6125 -13639 -14323 -12770 -20536
6594 -20536 -32324 -69459 -86733 -71024 -76671 -57312 -30797 -27302 -2674 -13008 -37987 -43868
6582d3868N727O723K8959j5254k7710R839p481N768J0652J8223k776j0909j9295
6569d1402j3445K2578J7666j2922L298K7884J3170o162N659k4711k2354n377K7797
6556h321J2437l4815p665l047j2371j8645J0223K8038K9568M633J853P89Q83L0042
6542C3602j4099l9376j3549L6074K9738J5165k6049m5693l4211K0404k0878k3127
6530h1999K9554L5522M239j4214j0822j8100Q746O8100L7370J613m5155n4513
6518c9659k7175n379J1145L6427J6442L9289m1738k8033k433J2121j7506l049
6506d9548J6689k8880l2625j3867K5763M4466r000n7654K2328m597r413L47M3638
6493e2353P5168J7082P161j7255j192j5366n5298J7741J9486M0552O702j4228
$$ plain form
6582 -43868 -38141 -31418 -2459 -17713 -45423 -35584 -43065 -37297 -26645 -8422 -11198 -22107 -41402
6569 -41402 -54847 -32269 -14603 -27525 -24227 3657 16827 10665 16324 -8387 -30741 -36118 -8321
6556 -8321 4116 -30699 -38364 -41411 -53782 -72427 -62204 -34166 -4598 35 1888 2677 3560 33602
6542 33602 19503 -19873 -33422 2652 32390 47555 21506 -24187 -58398 -37994 -58872 -81999
6530 -81999 -52445 -16923 -12684 -26898 -37720 -55820 -47074 21026 58396 60009 14854 -39659
6518 -39659 -66834 -72213 -61068 -24641 -8199 31090 -10648 -38681 -41114 -28993 -46499 -49548
6506 -49548 -32859 -61739 -94364 -108231 -82468 -38002 -47002 -104656 -82328 -86925 -96338 -95991 -52353
6493 -52353 22815 39897 47058 29803 28611 13245 -42053 -24312 -4826 35726 42428 28200
6481B8200p213j3910K8813j0842J254l7423Q893N9264j2047k607L2886J5344K818
6468I3430k0080j5357J0098o974l9039k0460J2758P874l3822j5469k889j834J4081
6455a7683K323K9804J1209k7295K3733j2200J6126J8178l7413k5379j8607L441
6443c3763p826r066K4318l4891k6462N915J0998L8661J3362m4714K6380K5776
6431a1312P704L065K7140m5269K3547K4029Q417l5251n9913M204L7983K7356k09
6418A1491k4571n192j4441j4547m1301N989N9512M8620K7772l0522p8808n2560
6406a08558J3239L5165P93P256o135n890J3360J695O925k2964j709O332L2085
6393b8406L0495J0839j3250Q27L304o981l4453k149j7801J253J8790L6691j7232
$$ plain form
6481 28200 20987 7077 35890 25048 26302 -11121 -2228 57036 44989 42382 75268 90612 93430
6468 93430 73350 57993 68091 61117 22078 1618 14376 22250 -11572 -27041 -29930 -31764 -17683
6455 -17683 -15360 14444 25653 -1642 22091 9891 26017 44195 6782 -18597 -37204 -33763
6443 -33763 -41589 -50655 -26337 -61228 -87690 -81775 -70777 -32116 -18754 -63468 -37088 -11312
6431 -11312 -3608 -543 26597 -18672 4875 28904 37321 2070 -57843 -53639 -15656 11700 11491
6418 11491 -13080 -18272 -32713 -47260 -88561 -82572 -23060 25560 53332 22810 -55998 -108558
6406 -108558 -95319 -60154 -59361 -52105 -58240 -64130 -50770 -49075 -42150 -65114 -66823 -60491 -28406
6393 -28406 2089 12928 -322 505 3809 -3172 -37625 -39774 -57575 -56322 -37532 -841 -18073
6380a8073j4010J0076N687q591l896k2803J0156K2114J4136n889m106q66p136
6367b3201J5863J0078J7018p4288n5980K2071J5532K0632L1328o31j2736M3281
6355H967M248j8872k5686Q724l1521r144J7698K1379O239O240m4842o722K9496
6342c3796K8483p294k851l139K2047J5517j2585k0208J7501j1614n2331L3128
6330b7142J4113N032j3885m090L4607j7862K0101J4918O424m353k6360k063q019
6317h579J3129k3574m2182K3449K2902K3931q154p637L6741j900o9708l914K5494
6304b0002P4174q302m6720k0858l783K1930K8028j3032l3811K748Q022L460j1
6291h157j9950j163N481J2322q129j2393R482n155L3288K8326j7583m8705j0498
$$ plain form
6380 -18073 -32083 -22007 -16320 -24911 -28807 -51610 -41454 -19340 -5204 -11093 -15199 -16065 -23201
6367 -23201 -7338 2740 19758 -54530 -110510 -88439 -72907 -52275 -20947 -21578 -34314 8967
6355 8967 13215 -5657 -31343 -22619 -54140 -63284 -45586 -24207 -17968 -11728 -56570 -63292 -33796
6342 -33796 -5313 -12607 -15458 -18597 3450 18967 6382 -13826 3675 -7939 -60270 -27142
6330 -27142 -13029 -7997 -21882 -25972 8635 -9227 10874 25792 32216 27863 1503 -560 -8579
6317 -8579 4550 -19024 -61206 -37757 -14855 9076 922 -6715 30026 28126 -41582 -45496 -20002
6304 -20002 54172 45870 -850 -21708 -25491 -3561 24467 11435 -22376 -19628 -11606 -8146 -8157
6291 -8157 -28107 -29270 -23789 -11467 -19596 -31989 -22507 -27662 5626 33952 16369 -32336 -42834
6278d2834J3588j1850j1043l2530l849L2436k626k9223j2111M7204K3248R672
6266a9918L7301J3688k3381p9949l0253J8871J5129M119K437j6104L3935L9857
6254d268k5237J7660m060m6105q075k1435L6269R542J5859k3806K5202r677j8416
6241e6547m752J063L7715L7348j9596r158l2138k8219K9283M4445R607j1503m6971
6228d9423j995J8385O0789J4855m3989J8897K6204L0601n690l6757j5735j3071
6216C071j1402n6701n4628J5310J3884K5548J7745J2965J2946J1980J0921l2131
6204c0492k212K432k950o066k467j6698j5620M1726L3008K4424j7532j824k7254
6191b1525k509P909K512m214L9947j1975r149J5662L6040J322J2465N185q189
$$ plain form
6278 -42834 -29246 -41096 -52139 -84669 -88518 -56082 -58708 -87931 -100042 -52838 -29590 -19918
6266 -19918 17383 31071 7690 -72259 -102512 -83641 -68512 -64393 -61956 -78060 -44125 -4268
6254 -4268 -29505 -11845 -15905 -62010 -70085 -91520 -55251 -45709 -29850 -53656 -28454 -38131 -56547
6241 -56547 -61299 -60236 -22521 14827 -4769 -13927 -46065 -74284 -45001 -556 9051 -2452 -49423
6228 -49423 -51418 -33033 27756 42611 -1378 17519 43723 74324 68634 31877 16142 3071
6216 3071 -8331 -65032 -119660 -104350 -90466 -64918 -47173 -34208 -21262 -9282 1639 -30492
6204 -30492 -32704 -30272 -33222 -39288 -41755 -58453 -74073 -32347 661 25085 7553 5729 -21525
6191 -21525 -24034 -16125 -13613 -17827 22120 10145 996 16658 52698 54020 66485 71670 63481
6178F3481m3249k4644N046J5467L0200j8414J9391p191o0313j5758L8030J1436
6166A3482j5344m4857P98J5090o193o389j063L7940K2894m4325j5705J6693L8183
6153A1204m791l6316j3816K1845k3180j9044O342k5970m03L9746J7212k6219Q832
6140d4558m295q541o659K1802M0207k772j1953K652Q886P573J1205m285k5536
6127a6274k5162k8603L0839P0648l5892j3658j197r699m3641n75J8980J7987m6865
6114h3112q918M6875N3828L2604K5948k9059l3584n5722k8807L9878J7420j1324
6102c3973j3545o903l722M5753K1995k0763K1928n058k906m1293l6540K7044O587
6089d1396L9066N5872K0962k1183L459r390m9893K1715l6714n3065J0142p745
$$ plain form
6178 63481 20232 -4412 634 16101 46301 27887 47278 40087 -20226 -35984 2046 13482
6166 13482 -1862 -46719 -45921 -30831 -37024 -43413 -44476 -6536 16358 -27967 -43672 -26979 11204
6153 11204 6413 -29903 -43719 -21874 -45054 -64098 -57756 -83726 -84129 -44383 -27171 -53390 -44558
6140 -44558 -48853 -57394 -64053 -42251 -2044 -4816 -16769 -14117 -5231 2342 13547 9262 -16274
6127 -16274 -41436 -70039 -39200 31448 -4444 -18102 -19299 -28998 -72639 -73214 -54234 -36247 -83112
6114 -83112 -92030 -45155 8673 41277 67225 38166 4582 -51140 -79947 -40069 -22649 -33973
6102 -33973 -47518 -54421 -58143 -12390 9605 -11158 10770 5712 2806 -38487 -75027 -47983 -41396
6089 -41396 -2330 53542 74504 53321 56780 47390 -2503 19212 -17502 -70567 -60425 -68170
6077f8170L0139J2272m6100k8806L6889K8602J0069K5208O00K585J617l128J9696
6064B1473p459j5258l6550k9234J1243P1923L1232L737k9612l4174Q317j4566
6052a8928n926k2533J6625J063K0588L5756l468j7852j6510J275K8033N6589Q214
6039H2926l3946n888J2025J7698k234L406m0393n4950k6287q210j5555M4892K7098
6026E82o789J2357L7219r450l3538k7157k9806K2611O3036K0611l3805k3834J2123
6013D160J2395k1128l2509M981K6170r330k0152q6951m0805o377M2855M7726J3432
6000f5533J0167J9222k7045l258m578J2273L0660K9213K1168L1602j4414j7321
5988B2156j4476j7425j4861J5070j0127n936N618l4525R276L1979j0797J5242
$$ plain form
6077 -68170 -38031 -25759 -71859 -100665 -63776 -35174 -25105 103 703 3288 4905 1777 21473
6064 21473 14014 -1244 -37794 -67028 -55785 16138 47370 51107 21495 -12679 -4362 -18928
6052 -18928 -24854 -47387 -30762 -29699 -9111 26645 23177 5325 -11185 -9910 18123 74712 82926
6039 82926 48980 43092 55117 72815 70581 73987 33594 -21356 -47643 -55853 -71408 -26516 582
6026 582 -6207 6150 43369 33919 381 -26776 -56582 -33971 29065 49676 15871 -7963 4160
6013 4160 16555 -4573 -37082 -32101 -5931 -15261 -35413 -122364 -163169 -169546 -126691 -78965 -65533
6000 -65533 -55366 -36144 -63189 -66447 -71025 -58752 -28092 1121 22289 53891 39477 22156
5988 22156 7680 -9745 -24606 -9536 -19663 -25599 -19981 -54506 -45230 -13251 -24048 -8806
5976h806j0563J150m286n4691P24M2933N03l620l4421Q760K2660M7681Q988m8381
5962c1369j4950j4001J8725Q298J16p939O437M782J5013J3857k554k865K5599
5949A9149L720o1355j5483L842j0905J9888K1711Q623r167j6172j3234L889L365
5936d2129k312J1168k5064j4541K2091J9395J3328Q561j6591K0670P931l1097
5924b8590O179K8615m887j3808l7258j9683L0753j9256K0360L5601j16L7326J5274
5911E0510k4269k0218J0533j0008j59j1966l5047p7524L148L9997K6151L5359
5899a3493K7241K952n3817q336L3463M7680N3594J4373l5803j7869L4300j4758
5887F9527l9015j1356J1080l6180k7725j4933N1965O0816r863k1970K4429L2995
$$ plain form
5976 -8806 -19369 -18219 -22505 -77196 -76472 -33539 -33036 -36656 -71077 -62317 -39657 8024 17012 -31369
5962 -31369 -46319 -60320 -41595 -33297 -33181 -41120 -34683 -29901 -14888 -1031 -3585 -6450 19149
5949 19149 22869 -38486 -53969 -50127 -61032 -41144 -19433 -10810 -19977 -36149 -49383 -45494 -42129
5936 -42129 -44441 -33273 -58337 -72878 -50787 -31392 -18064 -9503 -26094 -5424 2507 -28590
5924 -28590 -22411 6204 1317 -12491 -49749 -69432 -38679 -57935 -37575 -1974 -2090 35236 50510
5911 50510 26241 6023 16556 6548 6389 -5577 -40624 -118148 -115000 -75003 -48852 -13493
5899 -13493 13748 16700 -37117 -45453 -11990 35690 89284 103657 67854 49985 84285 69527
5887 69527 30512 19156 30236 -5944 -33669 -48602 3363 64179 54316 32346 56775 89770
5875H9770k6541m1856N491K406k4290j9070L0323q23k9321k1521N3743L3681K3
5862E2015j1352o0514k5060M4061J1021m8004n757K0430k1532l5263j2376K3421
5850f8910O666L3068K3916J0290l8904m3315L782K7352j2620q149K5895L3300
5838g629K9780J1648l4364K1161J4554p1442J5661K8931l0522J1721k9744K578
5826c7667O6167J5833n682j5442j3592k3234j3837K5208N09l3017o897L37q057
5813d9371R001K3487N1117j5199k8147K6609r96Q619k5403J4871L3582J766k4565
5800B5371o2383j6572m1421L8805O7855K5938l6482m4750J9839M6099J4724M100
5788D1123J1819K83j0170J4460l9822r814n2125K751L5955j811l602k3087K1028
$$ plain form
5875 89770 63229 21373 26864 29270 4980 -14090 16233 15410 -13911 -35432 18311 51992 52015
5862 52015 40663 -19851 -44911 -850 10171 -37833 -43590 -23160 -44692 -79955 -92331 -68910
5850 -68910 -62244 -29176 -5260 5030 -33874 -77189 -73407 -46055 -58675 -66824 -40929 -7629
5838 -7629 22151 33799 -565 20596 35150 -36292 -20631 8300 -22222 -10501 -40245 -37667
5826 -37667 28500 44333 38651 23209 9617 -13617 -27454 -2246 -1737 -34754 -41651 -41314 -49371
5813 -49371 -40370 -16883 34234 19035 -9112 17497 16501 25120 -283 14588 48170 49936 25371
5800 25371 -37012 -53584 -95005 -56200 11655 37593 1111 -43639 -23800 22299 37023 41123
5788 41123 52942 53225 43055 57515 17693 7879 -44246 -41495 -5540 -7351 -10953 -34040 -13012
5775a3012K6304p188L4766O281M451p288n5907P523l528j1748r642L3227j560
5762B679o794L59p862k608J6460j2921p90L5593J0594L950L5609k3862l1664M7
5748A8790k99J0140m1364j6770L5227m083n5327R580N2430l5040k660j9690j5805
5735f4871r520J9612N3488L789P182J2133l8091j3729N1804k6417j7159K004l8886
5722e8661R962K3514J6216K7294J555j6022q533P072j3107j0574l9308J7590L3200
5709i802J581K4774N0398p820r098k4762k3486n1291j4656j679m73J8482K9882
5696a7950r964M022M9038n1918l0480K3765j967K9436J5557n2804j1094M5713
5684h646O242l2862k5478L0874K0875j1479M5384j2130J1342J6660k3296j5614
$$ plain form
5775 -13012 13292 6104 40870 47151 51602 44314 -11593 -4070 -7598 -19346 -28988 4239 2679
5762 2679 -4115 -3756 -11618 -14226 2234 -10687 -11477 24116 34710 38660 74269 50407 18743 18790
5748 18790 18491 28631 -12733 -29503 5724 1641 -53686 -44106 8324 -26716 -29376 -49066 -64871
5735 -64871 -74391 -54779 -1291 2498 9680 21813 -16278 -30007 21797 -4620 -21779 -19775 -58661
5722 -58661 -48699 -25185 -8969 18325 19880 3858 -4675 2397 -10710 -21284 -60592 -43002 -9802
5709 -9802 -8221 16553 66951 59131 50033 25271 1785 -49506 -64162 -65841 -66314 -47832 -17950
5696 -17950 -27914 -23892 25146 -26772 -57252 -33487 -35454 -6018 9539 -43265 -54359 -8646
5684 -8646 -2404 -35266 -60744 -29870 -8995 -20474 24910 12780 24122 40782 17486 1872
5672A872p985q493K8322K8325n6172n5075q451J1571J2787K1737p219J7052N3214
5659C1485j0592O995M66R465l6590l2491J2560K6418l1768j6929m397m9M5781
5646C54M4284N137m1783j7997k4736J6458j852j3725l2364N8023r875l5265K755
5633e0586J282q48n114J394M732m159R267R694O05j1081N415Q697N2875j6673
5619E500O711J9211J1647J8731j5693k4531m5534k0953k6846m292o06M0048J9653
5606a6954L0344J3972K0110p052l418L64k9201k3357M091k1360j3650Q6770K4416
5593F5075m4381l1513k3314J8482L6801j7217n0928K1395M4438k3575m3015j6015
5581f3767j5895l548K8119N3897J3337l8953J2414N700k4499L986l700M5291J1730
$$ plain form
5672 1872 -6113 -14606 13716 42041 -14131 -69206 -77657 -66086 -53299 -31562 -38781 -21729 31485
5659 31485 20893 27888 28354 37819 1229 -31262 -18702 7716 -24052 -40981 -45378 -45427 354
5646 354 44638 49775 7992 -10005 -34741 -18283 -20135 -33860 -66224 -8201 -18076 -53341 -50586
5633 -50586 -49304 -50152 -55266 -53872 -49140 -53299 -44032 -34338 -33733 -44814 -39399 -30702 22173 5500
5619 5500 12211 31422 43069 61800 46107 21576 -23958 -44911 -71757 -76049 -76655 -36607 -16954
5606 -16954 13390 27362 47472 40420 37002 37366 8165 -15192 -11101 -32461 -46111 40659 65075
5593 65075 20694 -10819 -34133 -15651 21150 3933 -46995 -25600 18838 -4737 -47752 -63767
5581 -63767 -79662 -83210 -55091 -1194 12143 -26810 -14396 -8696 -33195 -29209 -32909 12382 24112
5568B4112K476l3423j9318N3280p838l5313j5547o467m528j8822K3029r268r462
5555e7089N5529N6841k4857m5877l3909J47J4451K5737m871j6392k6437K0357
5543c6370J3248p075P749q432j7710j934Q212L360J2896m468J8180n975k3910
5530d2229Q372k0085L2138M6897j0958m9300K511P2744J3810l9997J7967J0944
5518D2814n5632j1450L2011k2400j793Q141K4265R715K6533O154m6394L636k9956
5505a4356L272O973p178l015R281L488j9098j8571L4275M2518M166k6463l1429
5492a6137j8649M5817R37l7038m7m002j7600k1522J7506J3959K5336M2986j9398
5479A2148k4582J7100p361n782l3498o0523j6436O1576L3904K8341N541O271l903
$$ plain form
5568 24112 26588 -6835 -26153 27127 19289 -16024 -31571 -38038 -42566 -61388 -38359 -47627 -57089
5555 -57089 -1560 55281 30424 -15453 -49362 -49215 -34764 -9027 -13898 -30290 -56727 -36370
5543 -36370 -23122 -30197 -22448 -30880 -48590 -50524 -42312 -38952 -26056 -30524 -12344 -18319 -42229
5530 -42229 -33857 -53942 -21804 25093 14135 -35165 -32654 40090 53900 13903 31870 42814
5518 42814 -12818 -24268 7743 -14657 -16450 -8309 15956 25671 52204 58358 11964 15600 -14356
5505 -14356 -11084 -4111 -11289 -14304 -5023 -1535 -20633 -39204 -4929 37589 41755 15292 -16137
5492 -16137 -34786 11031 11968 -25070 -25117 -29119 -46719 -68241 -50735 -36776 -11440 31546 12148
5479 12148 -12434 4666 -2695 -8477 -41975 -102498 -118934 -57358 -23454 4887 10428 16699 12796
5466A2796m8286k3670K6737K7452K831K6066K3974j2151l9048j0643L4622o438
5454A4242M6053j4352j8212n3224k6918N2531J7679j7931J6168J97j8287j2986
5442a5040j4819j7807R598k307l3938j2535M392L9197J313J4556L0619J744J2795
5429A7768o123l158j2486q25m0451m7993L8041K0655Q866N49L1242N600r353l690
5415a358j403J244k0082k3939J4372J8304l614p372J8646K3674K768J9620K4496
5402F5356r097M931l4866k4431m998J8991r872l1238K0831L0114Q815L3937p905
5389F0568j9224R764k1717k1446R36p273j1040L6748K7239Q046l6444l0503l0548
5376c4894P437M0363K0375m1662j54k5807j4769L1046K2343k1986k1148K5495
$$ plain form
5466 12796 -35490 -59160 -32423 -4971 -2140 23926 47900 35749 -3299 -13942 20680 14242
5454 14242 60295 45943 27731 -25493 -52411 120 17799 -132 16036 16233 -2054 -15040
5442 -15040 -29859 -47666 -38068 -40375 -74313 -86848 -82456 -43259 -41946 -27390 3229 4973 17768
5429 17768 11645 8487 -3999 -4824 -45275 -93268 -55227 -34572 -25706 -25157 6085 11685 2332 -1358
5415 -1358 -2761 -1517 -21599 -45538 -31166 -12862 -16476 -23848 -5202 18472 21240 40860 65356
5402 65356 56259 61190 26324 1893 -3105 15886 6014 -25224 -4393 25721 34536 68473 60568
5389 60568 41344 51108 29391 7945 8881 1608 -9432 27316 54555 62601 26157 -4346 -34894
5376 -34894 -27457 12906 33281 -8381 -8535 -34342 -49111 -18065 4278 -17708 -38856 -13361
5364a3361N3932M1480m4689p4008J6259K8405P738j7872l975j9040l2035q388
5352f5554M6305n011J8705J7490j2719J9756N7279m1403p0520j9844k8537j7601
5340a01654L7824N5097j4891n925J87N6323M2324q812m5160k0584M279K4262j1842
5327A1428P800k2628l4628m1115L7697J8847J1979k743r287j3875O472J4422k5405
5314d1036k2756L515O299k8595N0690K1194m050o268K5496M2795m072k4517M393
5301B3088m9033l3038j165J8703L6518M3828J8854J1780l199Q702o077k2360q0000
5288c3399j5208R758k8806K2050K0649J801m148M864L2747P724J3781j4733k8748
5275a1668r301m0166j2904L6945n3847K6375M2834m953L9874J0591R523J7305
$$ plain form
5364 -13361 40571 82051 37362 -36646 -20387 8018 15756 -2116 -6091 -25131 -57166 -65554
5352 -65554 -19249 -24260 -5555 11935 -784 18972 76251 34848 -35672 -55516 -84053 -101654
5340 -101654 -63830 -8733 -23624 -29549 -29362 26961 69285 60473 15313 -5271 -992 23270 11428
5327 11428 19228 -3400 -38028 -79143 -41446 -22599 -10620 -13363 -22650 -36525 -30053 -15631 -41036
5314 -41036 -63792 -60277 -53978 -82573 -31883 -10689 -14739 -21007 4489 47284 43212 18695 23088
5301 23088 -25945 -58983 -60148 -41445 -4927 38901 57755 69535 66336 75038 68961 46601 -33399
5288 -33399 -48607 -38849 -67655 -45605 -24956 -23155 -27303 -22439 10308 18032 31813 17080 -11668
5275 -11668 -20969 -61135 -74039 -37094 -90941 -64566 -21732 -26685 13189 23780 33303 50608
5263E0608k6689N509r122k9410r439M5028L3325l3872m9185p885N595k1515q788
5250e5840J1522J9300J1390k8567K4911K9306p344K0041J2143n5751o2464N0917
5238c0436N2013k1068l2202K4143K5641M990k8754K804l6747J5398M5576p489
5226A3869j4384K843N0636K7134o184l8619m9813k0834l594l712J5674K0605k4478
5213c0857J4181K5673N2208k3604l4999j2587M7928l2838M52o109o431k3265k7458
5200e7706J3184K209K917L537J8379l0719J9190K9027o325j8309J6337M624J7177
5187A3522N156K3786m440j5773m8476l4191N6976J6898l3982j8097j1805j4021
5175f4447J0832Q678P5570M541k9050L316l5738j8902k2741L6742N5993j6590
$$ plain form
5263 50608 23919 29428 20306 -9104 -18543 26485 59810 25938 -23247 -31132 -25537 -47052 -55840
5250 -55840 -44318 -25018 -13628 -42195 -17284 12022 4678 24719 36862 -18889 -81353 -30436
5238 -30436 21577 509 -31693 -7550 18091 23081 -5673 -2869 -39616 -24218 21358 13869
5226 13869 -515 2328 52964 80098 73914 35295 -14518 -35352 -38946 -42658 -26984 -6379 -30857
5213 -30857 -16676 8997 61205 37601 2602 -9985 37943 5105 5557 -552 -6983 -30248 -57706
5200 -57706 -44522 -42313 -39396 -35859 -17480 -48199 -29009 18 -6307 -24616 -8279 -3655 13522
5187 13522 18678 42464 38024 22251 -26225 -60416 -3440 13458 -20524 -38621 -50426 -64447
5175 -64447 -53615 -44937 30633 35174 6124 9440 -26298 -45200 -67941 -31199 24794 8204
5163H204l3902L4306N127L3916O322j6623j5062j3813k2097k6222l7949K3259
5151e4534L8857o09Q676J4139M870O808P754J221J7155j4857m2858j5181J9659
5138h900P279n668J0054J0690Q69l1052k3259Q292M1125K0672K4612J519l4906
5125B1327k9216M3781J4218j6996j5934j7151K5487L4272l6301j0229N061m2718
5113b4399j9618J2825m597R610q067J4888j2770j9538J5322k8918r259J6461k3379
5100h1439N080M8813L7972L739L539j675n4320l5414K7069M4733K22K485K754
5087C558O451j7725K2426k5544J7672O617K5015R718K5941J0091l87J0521M829
5074I9183n7757m0456J2283j9075K4401L9674j817j389j9853q682k0422k3337
$$ plain form
5163 8204 -25698 8608 13735 47651 53973 37350 22288 8475 -13622 -39844 -77793 -54534
5151 -54534 -15677 -16286 -7610 6529 11399 18207 25961 27182 44337 29480 -13378 -28559 -8900
5138 -8900 -1621 -7289 2765 13455 14324 -16728 -39987 -31695 9430 30102 54714 56233 21327
5125 21327 -7889 35892 50110 33114 17180 29 25516 59788 23487 13258 18319 -24399
5113 -24399 -44017 -31192 -35789 -26179 -34246 -19358 -32128 -51666 -36344 -65262 -74521 -58060 -81439
5100 -81439 -76359 -27546 10426 14165 17704 16029 -38291 -73705 -46636 -1903 -1681 804 3558
5087 3558 10009 -7716 14710 -10834 6838 13455 38470 48188 74129 84220 83833 94354 99183
5074 99183 41426 970 13253 -5822 18579 58253 56436 55047 35194 26512 6090 -17247
5062a7247M7124J1555K608J3014J163m0555l6231j3340M7714J5279K123j0681
5050B2526l0953Q470L6400p5360n7057M4197J6041N4104N2148O616l978l3551
5038C9603k2835L5330k2606J230k5576k5649N27j2948M503O144K013N2623k799
5025B9560n0104k5375L7344j8624L078R703K6705J8024m0246l2593J9148O8638
5013D5258K2931l7320o7075m8740j2762P7721m143L2584L6438l7638J2957j7023
5001C188o2395n902J9909M0177n309m0057K73K8728J5161K7682l6698m3817L1621
4988b7439R019k2939M2607J4584r698j5538k8184m6364k931M2645k1177r700k7187
4975a02302r96j0034l2650J890K0450L1346L6633J747J6074L3369m3611k381j3065
$$ plain form
5062 -17247 29877 41432 44040 57054 58217 17662 -18569 -31909 15805 31084 33207 22526
5050 22526 -8427 43 36443 -38917 -95974 -51777 -35736 18368 70516 77132 73154 39603
5038 39603 16768 52098 29492 30722 5146 -20503 -19976 -32924 -28421 -22277 -20264 32359 29560
5025 29560 -20544 -45919 -8575 -27199 -24121 -14418 12287 30311 -9935 -42528 -23380 45258
5013 45258 68189 30869 -36206 -84946 -97708 -19987 -24130 8454 44892 7254 20211 3188
5001 3188 -59207 -65109 -45200 -5023 -10332 -50389 -50116 -21388 -6227 21455 -15243 -59060 -27439
4988 -27439 -18420 -41359 1248 15832 6134 -9404 -37588 -83952 -86883 -44238 -65415 -75115 -102302
4975 -102302 -103298 -113332 -145982 -144092 -123642 -92296 -55663 -53916 -37842 -4473 -48084 -50465 -63530
4962f3530l8030L4199L2588j6601K9813L1274K6309j1343m9258j9918K2496L940
4950a8061O958L982p8033K6245M4682R058k3072o8802j6478M3005K4242J8048
4938b8226j3357j5399K0090K6661J047J5719o838R40K4531m148m7332K874J6000
4925g438j5175n510p493l8868k4101N898J8277L3603L4315O295k5846j0591l799
4912d0433j2421q954j0787J8406J9756J4110j2899M411l553j4283O2074R1405
4900A06832J9745o7627p2968J3373M4132k6249l0561O54J3033R767K7805j6862
4888B1074j0414k1872j0731R893R577N003k3608j6645j6014r123n240K8981K2249
4875a6870j5474j6991r416L6230J1843l7478R661j474R340J9882J4478q082J2159
$$ plain form
4962 -63530 -101560 -67361 -34773 -51374 -21561 9713 36022 24679 -24579 -44497 -22001 -18061
4950 -18061 -11103 -7121 -85154 -58909 -14227 -5169 -28241 -97043 -113521 -70516 -46274 -28226
4938 -28226 -41583 -56982 -36892 -10231 -9184 6535 -303 637 25168 21020 -26312 -23438 -7438
4925 -7438 -22613 -28123 -35616 -74484 -98585 -92687 -74410 -40807 -6492 -197 -26043 -36634 -40433
4912 -40433 -52854 -61808 -72595 -54189 -34433 -20323 -33222 -28811 -32364 -46647 15427 106832
4900 106832 126577 58950 -14018 -645 43487 17238 -13323 -12669 364 10131 37936 21074
4888 21074 10660 -11212 -21943 -12050 -2473 2530 -21078 -37723 -53737 -62860 -68100 -39119 -16870
4875 -16870 -32344 -49335 -58751 -22521 -10678 -48156 -38495 -39969 -30629 -10747 3731 -4351 7808
4862G808l0471l8050p78N9304J9911J4276j3408j6860R597M330k2304k4619J7016
4849a4248O6002l21l6607J3589m3682N589N6583J4944l2274j8202k3480j5023
4837b7130K224k1820q65M013M407o815O723N1707J7510R715P14k7578n8270N2128
4823F663J025K5092J8957P389M9982m2452m9630k6500j5673L1923j4775l188J5762
4810D575k7615K5186P049k816p726J963k198k6663K8968J0074j2377J1759j6260
4797f081j8484p791p622J0527O565R390m1637j373K34M9753M7291M6622k374m1554
4783D3466q206N1575K6801o9791l9015L4452L7315r917m6835j1158k1823j281
4771a4417J9025j3519l0236J9150K9780O714j3239k9917N329J1657J0297k2332
$$ plain form
4862 7808 -22663 -60713 -61491 -2187 17724 32000 18592 1732 11329 15659 -6645 -31264 -14248
4849 -14248 51754 51433 14826 28415 -15267 -9678 46905 61849 29575 11373 -12107 -27130
4837 -27130 -24906 -46726 -47591 -43578 -39171 -45986 -39263 12444 29954 39669 40383 12805 -45465 6663
4823 6663 7688 32780 51737 59126 109108 66656 17026 -9474 -25147 6776 -7999 -11187 4575
4810 4575 -23040 2146 9195 6379 -1347 616 -1582 -28245 723 10797 -1580 10179 -6081
4797 -6081 -24565 -32356 -39978 -29451 -22886 -13496 -55133 -56506 -56272 -6519 40772 87394 85020 43466
4783 43466 35260 86835 113636 43845 4830 39282 76597 66680 19845 8687 -13136 -14417
4771 -14417 4608 -8911 -39147 -19997 9783 16497 3258 -26659 -21330 -9673 624 -21708
4759b1708k0808n871r27L8189J193K5226K53l761K2883K2752k6477j3903n802
4746A1239r676k882J5086l3656j2031N1478K6122l1558k4328J7300N0396l6224
4734B1266m3410J2743j6177m8177J75L4884J4805J827K9588K6776m1706K5626
4722A8220o733k872K7207J1463k55p2003k1210N208q029K1553j255j5614J9062
4709b5258K9940m304m6424k3344J0216l6668j0210J5578M1565P316J480Q100m0284
4696g2297j9051K3517L2482J2510p428r45j0974j262M6471M553k4615k5132k7795
4683f9966K4695M0066J2512m620K6423j095j5094K9732J1765k1587j5880M5676
4671F2627o0118n2826N1534p033N819K1525n9785l9624R774J9346J3105l1813
$$ plain form
4759 -21708 -42516 -48387 -49314 -11125 -9932 15294 15547 11786 34669 57421 30944 17041 11239
4746 11239 1563 -1319 13767 -19889 -31920 19558 45680 14122 -10206 7094 57490 21266
4734 21266 -22144 -9401 -25578 -73755 -73580 -38696 -23891 -22064 7524 34300 -7406 18220
4722 18220 11487 8615 35822 47285 47030 -24973 -46183 -40975 -49004 -27451 -28706 -44320 -25258
4709 -25258 4682 378 -46046 -69390 -59174 -95842 -106052 -90474 -48909 -41593 -40113 -32013 -72297
4696 -72297 -91348 -67831 -35349 -22839 -30267 -31212 -42186 -43448 3023 7576 -17039 -42171 -69966
4683 -69966 -45271 -5205 7307 2687 29110 28015 12921 42653 54418 32831 16951 62627
4671 62627 2509 -50317 1217 -5816 3 21528 -38257 -77881 -68107 -48761 -35656 -67469
4659f7469K724J1767J7300J8738k8291j0874K52L3824M710j3640J9684k6776j2620
4646e0671R894k7594k0592K9833M3397L4209M3351J0152o3865m3921j112K105
4634c4814L9338J2421l690j0579R591m6280l9654J7753L8065m92k1255K432k6773
4621f3937J8071J6053Q178k7443O884K8619N4487j1832n4345K6071K1815N005
4609B7626p753Q455L7460p612k5227l1097k7935l4726J1608M5565J4812K8682
4597C9858k2863j9885J8385j7009K5700L1459j677n6248n0069J0266n548l6364
4585h3995P938J8450K1704L1486o696o06j5471j0149J6424M7377j5845R197m372
4572A5442J022J5887k008q488r631n9602k3358m171J2434j010M874K8764K9896
$$ plain form
4659 -67469 -64745 -52978 -35678 -16940 -45231 -56105 -55853 -22029 -17319 -30959 -11275 -38051 -50671
4646 -50671 -40777 -68371 -88963 -59130 -15733 18476 61827 71979 8114 -35807 -36919 -34814
4634 -34814 4524 16945 13255 2676 12267 -34013 -73667 -55914 -17849 -18341 -39596 -37164 -63937
4621 -63937 -45866 -29813 -21635 -49078 -42194 -13575 40912 29080 -25265 806 22621 27626
4609 27626 19873 28328 65788 58176 32949 1852 -26083 -60809 -49201 -3636 11176 39858
4597 39858 16995 -2890 15495 -1514 24186 55645 53968 -2280 -52349 -42083 -47631 -83995
4585 -83995 -76057 -57607 -35903 -4417 -11113 -11719 -27190 -37339 -20915 26462 10617 19814 15442
4572 15442 16464 32351 30343 21855 12224 -47378 -70736 -74907 -62473 -63483 -58609 -29845 51
4559E1N803Q743K325j8589k7219P712J4921P945L2766l0336R657L3654K2711m6721
4545B3423k342Q118k478O229M722l8143k3347J0946K557p469k5479K7854q754
4532b4163J1748n092m2559K9931n493l0886J3941L9334M9666l9253p181L352j8626
4519b5281J4762N6678k4807o7264R544L9175L6631J4355L795j4954l7038N2950
4507E8546L0737n8886k6235J4556K4117j0428l9904K643k182k8952j1643Q585
$$ plain form
4559 51 5854 14597 16922 -1667 -28886 -21174 -6253 1692 34458 4122 13779 47433 70144 23423
4545 23423 21081 29199 26721 32950 37672 -471 -23818 -12872 -10315 -17784 -43263 -15409 -24163
4532 -24163 -12415 -17507 -60066 -30135 -35628 -66514 -52573 -13239 36427 -2826 -10007 -6655 -25281
4519 -25281 -10519 46159 21352 -45912 -36368 2807 39438 53793 57588 42634 5596 58546
4507 58546 89283 30397 4162 18718 42835 32407 -7497 -4854 -7036 -35988 -47631 -39046
$$ [...]
##END NTUPLES=NMR SPECTRUM
##END=
