##TITLE=Analysis number 327255
Compound Code cc 23814
Book Reference 486/126
Project Code adrs
Chemist Name simons
##JCAMPDX= 6.0         $$ Bruker NMR JCAMP-DX V2.0
##DATA TYPE= NMR SPECTRUM
##DATA CLASS= NTUPLES
##ORIGIN= Bruker BioSpin GmbH
##OWNER= nmr
$$ XWIN-NMR		Version 3.5
$$ Fri Mar 16 12:41:27 2007 GMT Standard Time (UT+0h)  MAYBRIDGE\nmr@NMR_250MHZ
##.OBSERVE FREQUENCY= 250.131544655141
##.OBSERVE NUCLEUS= ^1H
##.ACQUISITION MODE= SIMULTANEOUS (DQD)
##.ACQUISITION SCHEME= undefined
##.AVERAGES= 16
##.DIGITISER RES= 18
##SPECTROMETER/DATA SYSTEM= dpx250
##.PULSE SEQUENCE= zg30
##.SOLVENT NAME= CDCl3
##.SHIFT REFERENCE= (INTERNAL, CDCl3, 0, 16.442)
##AUDIT TRAIL= $$ (NUMBER, WHEN, WHO, WHERE, WHAT)
$$ ##TITLE= Audit trail, XWIN-NMR		Version 3.5
$$ ##JCAMPDX= 5.01
$$ ##ORIGIN= Bruker BioSpin GmbH
$$ ##OWNER= nmr
$$ C:\u/data/dgb/nmr/ADRS/1090/pdata/1/auditp.txt
$$ ##AUDIT TRAIL=  $$ (NUMBER, WHEN, WHO, WHERE, WHAT)
(   1,<2007-03-16 12:40:51.85 +000>,<MAYBRIDGE\nmr>,<NMR_250MHZ>,
      <created by zg, POWCHK disabled, PULCHK disabled
       configuration hash MD5:
       49 4B E0 1D 92 C2 6B 37 9F E6 65 BC 52 41 86 1D
       data hash MD5: 64K
       06 C2 CC CC 7E 05 E4 3B 29 BA 9F 7F D8 6B 20 74>)
(   2,<2007-03-16 12:41:07.30 +000>,<MAYBRIDGE\nmr>,<NMR_250MHZ>,
      <Start of raw data processing
       ef LB = 0.3 FT_mod = 6 PKNL = 1 SI = 32K 
       data hash MD5: 32K
       93 3B 82 7B 89 3E 52 8E 81 CF 69 39 62 07 39 99>)
(   3,<2007-03-16 12:41:12.05 +000>,<MAYBRIDGE\nmr>,<NMR_250MHZ>,
      <apk 
       data hash MD5: 32K
       ED E1 D6 13 68 C9 17 D1 05 CD 3E BB 4B F5 88 18>)
(   4,<2007-03-16 12:41:13.77 +000>,<MAYBRIDGE\nmr>,<NMR_250MHZ>,
      <abs ABSG = 5 
       data hash MD5: 32K
       87 74 5C 7A D7 3C 91 71 A0 7C BA AE 9A F1 F2 77>)
$$ ##END=
$$ 
$$ hash MD5
$$ 97 BE 94 A1 FA 32 D0 59 3C 96 F1 C9 A4 6F 3D 88
##$RELAX= 
##$RELAX= 
##$RELAX= 
##$RELAX= 
##$RELAX= 
##$RELAX= 
##$RELAX= 
$$ Bruker specific parameters
$$ --------------------------
##$DU= <C:\u>
##$EXPNO= 1090
##$NAME= <ADRS>
##$PROCNO= 1
##$TYPE= <nmr>
##$USER= <dgb>
##$AMP= (0..31)
100 100 100 100 100 100 100 100 100 100 100 100 100 100 100 100 100 100 
100 100 100 100 100 100 100 100 100 100 100 100 100 100 
##$AQSEQ= 0
##$AQ_mod= 3
##$AUNM= <au_zg>
##$AUTOPOS= <29 >
##$BF1= 250.13
##$BF2= 250.13
##$BF3= 250.13
##$BF4= 250.13
##$BF5= 500.13
##$BF6= 500.13
##$BF7= 500.13
##$BF8= 500.13
##$BYTORDA= 1
##$CFDGTYP= 0
##$CFRGTYP= 5
##$CHEMSTR= <none>
##$CNST= (0..31)
1 1 145 1 1 1 1 1 1 1 1 1 1 1 1 1 1 1 1 1 1 1 1 1 1 1 1 1 1 1 1 1 
##$CPDPRG= <>
##$CPDPRG1= <>
##$CPDPRG2= <>
##$CPDPRG3= <>
##$CPDPRG4= <mlev>
##$CPDPRG5= <mlev>
##$CPDPRG6= <mlev>
##$CPDPRG7= <mlev>
##$CPDPRG8= <mlev>
##$CPDPRGB= <>
##$CPDPRGT= <>
##$D= (0..31)
0 1 0 0 0 0 0 0 0 0.06 0 0 0 0 0 0 0.0002 0 0 0 0 0 0 0 0 0 0 0 0 0 0 
0 
##$DATE= 1174048850
##$DBL= (0..7)
120 120 120 120 120 120 120 120 
##$DBP= (0..7)
150 150 150 150 150 150 150 150 
##$DBP07= 0
##$DBPNAM0= <>
##$DBPNAM1= <>
$$ [...]
##$SUBNAM7= <"">
##$SUBNAM8= <"">
##$SUBNAM9= <"">
##$SW= 20.6930455092707
##$SWIBOX= (0..15)
0 0 3 0 0 0 0 0 0 0 0 0 0 0 0 0 
##$SW_h= 5175.983436853
##$TD= 65536
##$TD0= 1
##$TE= 683.16
##$TE2= 300
##$TE3= 300
##$TEG= 300
##$TL= (0..7)
0 120 120 120 120 120 120 120 
##$TP= (0..7)
150 150 150 150 150 150 150 150 
##$TP07= 0
##$TPNAME0= <>
##$TPNAME1= <>
##$TPNAME2= <>
##$TPNAME3= <>
##$TPNAME4= <>
##$TPNAME5= <>
##$TPNAME6= <>
##$TPNAME7= <>
##$TPOAL= (0..7)
0.5 0.5 0.5 0.5 0.5 0.5 0.5 0.5 
##$TPOFFS= (0..7)
0 0 0 0 0 0 0 0 
##$TUNHIN= 0
##$TUNHOUT= 0
##$TUNXOUT= 0
##$USERA1= <user>
##$USERA2= <user>
##$USERA3= <user>
##$USERA4= <user>
##$USERA5= <user>
##$V9= 5
##$VALIST= <valist>
##$VCLIST= <CCCCCCCCCCCCCCC>
##$VD= 0
##$VDLIST= <DDDDDDDDDDDDDDD>
##$VPLIST= <PPPPPPPPPPPPPPP>
##$VTLIST= <TTTTTTTTTTTTTTT>
##$WBST= 1024
##$WBSW= 4
##$XGAIN= (0..3)
0 0 0 0 
##$XL= 0
##$YL= 0
##$YMAX_a= 443280
##$YMIN_a= -566727
##$ZGOPTNS= <>
##$ZL1= 120
##$ZL2= 120
##$ZL3= 120
##$ZL4= 120
##$ABSF1= 16.44197
##$ABSF2= -4.251202
##$ABSG= 5
##$ABSL= 3
##$ALPHA= 0
##$AQORDER= 0
##$ASSFAC= 0
##$ASSFACI= 0
##$ASSFACX= 0
##$ASSWID= 0
##$AUNMP= <proc_1d>
##$AZFE= 0.1
##$AZFW= 0.1
##$BCFW= 0
##$BC_mod= 0
##$BYTORDP= 0
##$COROFFS= 0
##$CY= 12.5
##$DATMOD= 1
##$DC= 0
##$DFILT= <>
##$DTYPP= 0
##$F1P= 14.0000005364418
##$F2P= -0.99999901652339
##$FCOR= 0.5
##$FTSIZE= 32768
##$FT_mod= 6
##$GAMMA= 0
##$GB= 0
##$INTBC= 1
##$INTSCL= 1
##$ISEN= 128
##$LB= 0.3
##$LEV0= 0
##$LPBIN= 0
##$MAXI= 10000
##$MC2= 0
##$MEAN= 0
##$ME_mod= 0
##$MI= 0
##$NCOEF= 0
##$NC_proc= -3
##$NLEV= 6
##$NOISF1= 0
##$NOISF2= 0
##$NSP= 0
##$NTH_PI= 0
##$NZP= 0
##$OFFSET= 16.44197
##$PC= 1
##$PHC0= 230.2421
##$PHC1= 5.445058
##$PH_mod= 1
##$PKNL= yes
##$PPARMOD= 0
##$PSCAL= 4
##$PSIGN= 0
##$REVERSE= no
##$SF= 250.130020015416
##$SI= 32768
##$SIGF1= 0
##$SIGF2= 0
##$SINO= 400
##$SIOLD= 32768
##$SREGLST= <1H.CDCl3>
##$SSB= 0
##$STSI= 32768
##$STSR= 0
##$SW_p= 5175.98343685301
##$SYMM= 0
##$S_DEV= 0
##$TDeff= 65536
##$TDoff= 0
##$TI= <Analysis number 999999
Compound Code 99
Book Reference 9
Project Code 9>
##$TILT= no
##$TM1= 0
##$TM2= 0
##$TOPLEV= 0
##$USERP1= <user>
##$USERP2= <user>
##$USERP3= <user>
##$USERP4= <user>
##$USERP5= <user>
##$WDW= 1
##$XDIM= 32768
##$YMAX_p= 525591297
##$YMIN_p= -202142
$$ End of Bruker specific parameters
$$ ---------------------------------
##NTUPLES= NMR SPECTRUM
##VAR_NAME=  FREQUENCY,     SPECTRUM/REAL,   SPECTRUM/IMAG
##SYMBOL=    X,             R,               I
##VAR_TYPE=  INDEPENDENT,   DEPENDENT,       DEPENDENT
##VAR_FORM=  AFFN,          ASDF,            ASDF
##VAR_DIM=   32768,         32768,           32768
##UNITS=     HZ,            ARBITRARY UNITS, ARBITRARY UNITS
##FACTOR=    0.157963299565203, 1,           1
##FIRST=     4112.63049159899, 0,            0
##LAST=      -1063.35294525402, 0,           0
##MIN=       -1063.35294525402, -202142,     0
##MAX=       4112.63049159899, 525591297,    0
$$ Real data points
##PAGE= N=1
##DATA TABLE= (X++(R..R)), XYDATA
$$ [...]
23238 17081 18797 16566 15971 -771 -14148 -29714 -13686 16561 38802 45110 44911 34982 29955
23225 29955 40537 39571 45128 43304 24613 27499 28986 15819 10834 13552 12836 8301 7497 5469
23211 5469 -4532 -14534 -7310 -6671 -18100 -12471 464 605 2613 9910 10662 6230 11237 41806
23197 41806 31349 19164 10478 -288 -4313 3530 7764 27914 20328 14571 25836 24684 16649
23184 16649 5995 8824 12073 6075 -4918 -9318 -9867 8670 30483 34649 26418 4875 -13898
23171 -13898 -4999 -2162 6697 10960 6744 -4731 -19997 -32336 -20666 -19905 -21170 339 8598
23158 8598 3308 -3844 3712 21133 -8513 -18683 -241 22341 12642 8676 -27451 -28055 -8919
23145 -8919 8173 7956 -9000 -11012 -5399 -10340 -18081 -27357 -17299 -23477 -31429 -43446 -35169 -21143
23131 -21143 -15346 -11304 -4044 7098 10188 -2324 -2797 12468 27854 8559 -5230 -16428 -20107
23118 -20107 -18549 -19960 -17535 -13641 -21334 -31082 -21734 -18051 -16913 -5888 -14897 -17550 -18405 -12510
23104 -12510 657 -7172 -14948 -23174 -13068 -11274 -6526 -3950 10047 20144 28620 36517 26758
23091 26758 25657 19180 -2524 -17670 -3031 -14408 -16279 -6387 -9596 -7219 28523 16099 7238
23078 7238 9839 -4120 -306 -1747 10263 16275 20575 15079 5691 3442 -219 -17644 -27232 -18905
23064 -18905 1956 11290 27684 33223 14191 27879 54198 36319 13746 2463 -6825 -11682
23052 -11682 -2254 21781 27303 15977 8523 146 10628 6283 -5228 -15460 -11327 -7149 -18391
23039 -18391 -15958 -10751 -16219 -4001 12380 20010 10627 -10710 -19360 -43997 -41068 -19745 -1770
23026 -1770 -7031 -12480 -1534 -10530 -20617 -9167 -3742 9680 27601 37237 49177 50325 26330
23013 26330 8476 8016 36949 38603 27252 5840 -7468 -11268 -4834 -2364 1620 -3606 -17201
23000 -17201 -32628 -33005 -27672 -14618 -4616 -6521 15011 20854 10469 -1513 13401 5003 2644
22987 2644 14227 16122 6028 5862 6863 9794 -17513 -8018 1221 -1708 -10700 -2202 -21104 -27541
22973 -27541 -23363 -19070 -9687 -11755 -4466 8807 10438 -10865 -7563 -21874 -9214 -7342 -8431
22960 -8431 -5586 -2578 12194 -3840 -6475 -4643 -4115 -2744 -1652 -15342 -19880 -9615 -6163 -17747
22946 -17747 -20683 -13965 -1265 -7012 -22163 -6650 3354 -9986 -5224 1116 15431 21096 32026
22933 32026 19878 6391 12223 -7582 -19831 -25863 -35682 -36672 -36808 -38752 -30356 -16606 -29268
22920 -29268 -9421 9222 31144 20830 -9466 -30673 -23841 -36986 -39115 -26395 -26191 -28658 -20976
22907 -20976 -15893 -3332 5434 26444 9726 -17417 -37064 -33024 -34060 -14420 -6057 792 -8240
22894 -8240 -8086 -12529 -11563 1186 7564 -7018 -16801 -25354 -30032 -15188 -11043 -388 -3991 -22674
22880 -22674 -2203 13834 8114 18342 32474 31561 10478 -13267 1061 5947 14321 -3303 -11399
22867 -11399 -16890 -3952 -19437 814 -3610 -2114 25676 24262 -4328 -7675 -2358 1805 -8417
22854 -8417 8513 15284 14768 -6294 -14733 -16180 -30165 -28057 -27155 -29276 -41285 -31657 -30939 -22969
22840 -22969 -17364 -19603 -24788 -15473 7026 7858 20386 17175 222 -16781 -27121 -24650 -17515
22827 -17515 -19610 -16207 9327 24146 23912 5587 12520 20358 20945 -6503 -35046 -39197 -24766
22814 -24766 -19744 -10230 -3243 -32677 -36654 -39666 -27849 3503 26790 34237 28849 24686 21658
22801 21658 8097 6422 -1385 -13098 1244 18305 17383 11974 11439 -182 10941 8245 4251
22788 4251 -9866 -7683 3268 -2741 -12990 -20946 -16016 7018 8814 -6127 -7311 5649 6976
22775 6976 1239 -12673 -17232 -13490 -17517 3160 5691 6064 -5735 -10551 -21784 -35419 -34070 -35822
22761 -35822 -20634 -6298 -832 -5097 -25017 -25302 -8646 -13174 -18941 -28390 -21357 -2774 6454
22748 6454 -4714 -5606 -10126 -10969 -650 4456 3178 -5553 -22512 -22089 -22671 -21267 -17726 -16217 9251
22733 9251 23539 30538 24146 21106 8932 13059 13893 10138 6945 17811 2269 -21816 -17425 -18626
22719 -18626 -16239 -771 -16148 -21040 -2410 12818 8301 -3636 -10371 -15664 -15968 10041 24077
22706 24077 16013 10419 5071 -9432 -23811 -385 23380 19961 -179 -19596 -26718 -4680 707
22693 707 7215 6044 413 6527 9661 7400 22317 5752 -7480 -14857 -12277 -8645 -4645 243
22679 243 -6271 -21375 -33249 -3720 1246 -25969 -37764 -41501 -33617 -19875 -5599 951 5202
22666 5202 -1984 -13747 -25450 -5142 8311 10219 181 -1463 -2203 17232 9812 71 -8754
22653 -8754 -7658 2256 2216 -14173 -6848 16524 4328 1905 -20143 -25294 -4674 -11932 -9711 16110
22639 16110 29722 25007 4706 -5079 -6506 -14408 -19641 -15675 -10985 -23593 -26145 -16352 -3003
22626 -3003 557 22292 20963 16757 18649 -3148 -21285 -26281 -15585 -9001 -42925 -50229 -33010
22613 -33010 -12993 -6615 -18150 -23852 -28984 -33117 -13635 6004 3832 -2140 -15612 -24289 -30035
22600 -30035 -41319 -36818 -9980 -13542 -11854 -9313 -8132 -10811 -7900 10439 -14467 -31750 -2388
22587 -2388 12183 16824 21853 22712 19663 12619 14260 12699 7907 -4280 -15090 -8755 -19899 -34016
22573 -34016 -39359 -26201 -255 15817 20996 10933 3198 -4261 -368 11240 2661 -20246 -26775
22560 -26775 -26590 -18513 -72 606 11366 11797 16953 17543 2843 -10672 -18741 -30632 -35634 -21678
22546 -21678 -19839 -9618 1917 -7847 -19770 -10882 -16871 -22319 -19143 -12851 8336 23353 10433
22533 10433 -6027 13062 20440 7859 2310 4270 6881 9913 19131 22415 10949 11695 14362 8192
22519 8192 12411 19090 18595 7314 451 6842 8111 21069 21058 21338 13661 -4244 -17394 -14309 -16024
22504 -16024 -10848 -10013 -13831 -11955 3645 17671 -1304 4 11261 9708 -1572 -18384 -37509
22491 -37509 -28093 -10693 -3015 11535 28154 30873 29321 23245 41066 38888 11114 -8787 -5301
22478 -5301 -16273 -2622 -2626 -14811 -7808 3285 13115 -2992 -9405 -831 -329 4292 -2236 -2885 -1723
22463 -1723 16240 24595 25227 8907 3846 7042 17258 -1525 -19725 -29755 -27492 -19212 -7447
22450 -7447 -30059 -32181 -17024 -8064 -1290 6533 12922 10998 2630 -6280 -5889 -8859 -22108 -15045
22436 -15045 4143 10625 18673 34631 32064 19604 13879 3102 15076 20776 6977 -7645 -16698
22423 -16698 -9803 873 -16392 -35482 -18117 -10177 36 -8556 -31419 -35373 -22105 -19555 410
22410 410 -4924 -22937 -24570 -5806 -8663 -35701 -46204 -34920 -19216 -27455 -29685 -10634 -8502
22397 -8502 11521 28825 32141 36158 30717 8284 16909 35231 22623 6327 17770 34179 29944
22384 29944 11124 10735 24550 14529 -7635 -12313 -23741 -21476 -32222 -12684 1704 12326
22372 12326 5218 -12954 -14050 -1001 -5184 -14328 -27590 -18990 -16574 -2626 1770 -19745 -46798
22359 -46798 -28984 -2685 -4831 -1117 3203 3947 10965 7299 -9017 -2796 -843 -7921 -8009 -6951
22345 -6951 9107 12511 736 -861 4940 -720 5622 -9986 -9966 -1708 1958 -14149 -30117 -28770
22331 -28770 -22652 -48365 -58219 -38109 -17688 -3627 -21715 -26566 -17440 -1798 -15667 -19741 -36525
22318 -36525 -42385 -52855 -61409 -42164 -22647 -20787 -16247 -6147 -13420 -31818 -46736 -43988 -26374
22305 -26374 -987 16792 12860 587 3800 -26528 -57802 -45199 -27731 -11095 -10946 -6204 -4536
22292 -4536 -1355 -1131 -6355 -11878 -11336 -15520 -18298 -24409 -24409 -25332 -14717 -5525 -3206 3442 -853 -19205
22276 -19205 -18493 -9059 -12031 -23358 -42011 -55871 -51606 -35187 -10532 -5847 -10747 -25941 -11903
22263 -11903 -3511 -3142 -550 11516 2094 -9824 -16188 -1931 7833 -7614 -22280 -13444 -9067
22250 -9067 13407 22872 28181 30578 29548 9641 -22186 -26875 -30770 -37768 -38925 -48956 -36184
22237 -36184 -26075 -18206 -13339 -20695 -28817 -24053 648 16592 16867 -8398 -17599 -30047 -18742
22224 -18742 1060 -10752 -13608 -10130 -16954 -10283 -3104 679 10675 6290 -12243 -17713 -18922 -29191
22210 -29191 -27384 -33582 -39453 -19932 -17368 -29533 -31897 -21754 -9981 -17991 -39471 -39201 -28382
22197 -28382 -42946 -46652 -6787 -4257 -22194 -23969 -11285 -10837 -9270 -16730 -23604 -26409 -13728
22184 -13728 -1267 -5017 -18372 -17672 -20263 -27287 -21964 6773 25793 40126 32636 19136 8402
22171 8402 -3801 -11735 -7525 7207 10769 -9725 -26340 -11962 9667 23728 24695 12734 10229
22158 10229 3316 -1722 -8453 -13538 -12718 -16905 -16124 -11550 -2243 8492 11527 19784 32121 38531
22144 38531 18219 -9984 -26660 -36268 -13669 8003 11699 -6084 -25784 -37498 -52159 -33405
22132 -33405 -10657 -5701 -5837 -11386 -6932 7849 954 12576 -5558 -13455 -7114 -14886 -16772 -23789
22118 -23789 -30430 -27152 -10904 -4157 -1345 -11352 -11159 -5084 12051 -3358 -5361 9465 20526
22105 20526 20411 17693 27057 12047 -4774 -30284 -31729 -22961 -13284 -17180 -11895 -12975 26 -12297
22091 -12297 -10894 -757 11398 18386 27941 23352 10683 -1241 -18411 -35925 -28291 -4340 3337
22078 3337 -7678 -6784 -5618 8840 -8590 -23034 -12013 2901 -3515 -4475 -4304 -1956 10491 37567
22064 37567 26723 -3905 7172 19062 7231 -28111 -36905 -28126 -13230 -19538 -32592 -22660
22052 -22660 -126 8756 8653 26812 25206 21643 11436 3933 -10608 -15013 -16366 -18200 -6728
22039 -6728 9270 -2308 -30027 -22846 -19250 -22528 -21845 -30811 -26426 -12363 -25928 -50683 -40469
22026 -40469 -47633 -52543 -52011 -50811 -31456 -8393 -5292 9811 10107 -7616 -9491 -5373 5192 6852
22012 6852 7732 377 14220 11794 5358 -8065 -35675 -36016 -18343 6599 24343 39173 44856
21999 44856 29972 8706 -3938 -10148 -26490 -25042 -31684 -29960 -8368 -14310 -18537 -38140 -17585
21986 -17585 -4191 9490 5191 5762 2343 1378 7488 1668 -5991 4095 2820 -19844 -14158 -25044
21972 -25044 -15219 -10915 -15653 7988 20635 -13637 -30175 -36222 -14643 -1914 9205 -3044
21960 -3044 -11355 -126 17849 20540 8911 11471 8386 4161 17675 8964 -11099 -23158 -8386
21947 -8386 21651 12954 8134 11073 11758 5628 -11041 -1529 -1939 8495 -3607 -13987 -5148 -1303
21933 -1303 -14970 -16192 -14102 4316 13598 4596 -11714 -8875 1491 -6684 -4040 -7271 -14273 -17278
21919 -17278 -17981 -38034 -46509 -44487 -27058 -40375 -40034 -25065 -16564 -12315 441 -8032 -3604 -20610
21905 -20610 -11021 -8679 -11593 -12797 -6980 -12698 2119 3965 -7351 1409 -23279 -56280 -55271
21892 -55271 -35756 -27688 -16578 -966 7909 12938 -5221 -4556 1013 -494 -11212 -10606 4723
21879 4723 131 -11589 -16733 9326 15633 1944 -2754 -6442 -17177 -21153 -12336 -198 24613
21866 24613 27080 34134 29010 4252 -10690 -4738 -4256 -5826 -3472 6737 -9991 -20992 -25317
21853 -25317 -24164 -73 2079 3890 1927 -16321 -26418 -39655 -20718 -11954 -8771 -10037 -357
21840 -357 14491 15458 28883 45105 25445 -10300 -14512 -11147 2653 2830 -3792 -12894 -34444 -59543
21826 -59543 -51123 -32461 -27136 -35943 -51277 -41123 -33585 -31386 -3218 5112 1239 12041 14144
21813 14144 2683 -5146 6229 3662 2745 -957 -8598 -15916 11870 23126 20807 7754 -4017
21800 -4017 916 3315 10745 -4173 -11766 -13483 -5623 -7806 -7951 -17274 -32497 -15085 -16732 -15921
21786 -15921 -9972 -29152 -24192 14500 17186 5771 4217 5242 -1997 -3022 9450 326 -11162
21773 -11162 -2776 -1754 -3004 -9944 -10840 -5864 -14562 -23738 -29304 -27678 -42048 -42682 -37844 -26019
21759 -26019 -16294 -17063 -26003 -28374 -13648 2763 6737 9140 12169 2061 6054 13774 6431 3437
21745 3437 -171 -4486 -21111 -22604 -39465 -41759 -16868 2852 -6711 -31902 -24279 -9368 5310
21732 5310 6943 8575 363 -13779 -21111 -13229 -20061 -38049 -25549 -3865 13648 16641 8114
21719 8114 741 -10070 -19545 -21687 -20798 -13461 -9361 -9298 5385 8353 3827 -15296 -10319 19578
21705 19578 21692 13085 16867 12373 -48 18591 16792 203 12379 21327 5823 11007 10056
21692 10056 8469 -18392 -38867 -33474 -32639 -18051 -8855 -19029 -14003 -7101 -9501 -5585 -25696
21679 -25696 -26411 -3839 -1641 3598 17081 14388 15964 5612 -2362 11256 11935 11326 15405 4980
21665 4980 -6653 -7484 -20633 -27316 -11218 16831 5385 6419 3003 -5859 -27449 -33005 -17890
21652 -17890 2905 11460 1233 -15185 -10200 -4028 -4746 -18200 -25105 -26721 -36848 -51627 -37290
21639 -37290 -37387 -25230 -18654 -10473 13492 -4371 1140 2021 2307 4693 5353 3934 12174 11557 13508
21624 13508 13318 13968 29028 20478 -1238 -22805 -55562 -32357 -28038 -37195 -44139 -39766 -37974 -38121
21610 -38121 -40342 -32692 -6783 -23454 -27263 -28015 -29848 -23242 -18874 -10269 950 3765 -5288 -1185
21596 -1185 -5967 300 3635 5835 -278 1170 -6749 -25446 -23754 -13691 -13652 -28419 -29368 -21575 -14968
21581 -14968 -4972 -7639 -9432 2123 -6189 -11401 -12635 1495 -506 13982 6409 -14208 -31578
21568 -31578 -25441 -7643 -1253 -14682 588 6003 9716 -10829 -38374 -42474 -30966 -22745 -27270
21555 -27270 -23189 -34675 -25687 -6263 3132 4938 6637 -15956 -17426 -9444 747 -5801 -13254
21542 -13254 -21137 -17769 -19089 -11620 -5112 -16938 -12410 -1067 8172 27326 30591 16818 25529
21529 25529 5877 383 -3109 -1750 9786 19224 -2934 -28442 -24483 -11536 -6584 5684 19534
21516 19534 -11252 -16546 -6792 -30740 -22892 -8284 -6201 -8022 -386 -10492 -28191 -27716 -33676
21503 -33676 -9266 11106 2234 -5895 3320 10389 11845 13209 13022 -3224 -21671 -18315 5863
21490 5863 1359 -14689 -22248 -33031 -15132 -29134 -33708 -16675 5881 12968 10775 19303 6949
21477 6949 8824 5562 -891 -26288 -27469 -25562 -24964 -26623 -29362 -10987 -2067 3432 -9182 3824
21463 3824 -1936 -9039 -14385 -36572 -52359 -49303 -31621 -21205 -10707 -31004 -42605 -15195 -13812
21450 -13812 -15169 -1001 -2204 -13393 -6017 6119 12904 3309 -9496 -32011 -35291 -12227 6524
21437 6524 12633 23937 18904 17154 23834 15852 943 -24223 -23567 -16452 -21773 -17651 -16844 -21960
21423 -21960 -19736 -14075 -8324 -20416 -7765 10817 18800 -13333 -10062 5691 3644 15267 23410
21410 23410 9182 15020 14042 11543 6354 7704 7743 18599 14530 -5116 -15390 -4863 6074 -772
21396 -772 -1250 -1681 -4365 -8780 -7390 -12669 -9091 -2748 13132 21793 -16073 -44206 -46207 -20177
21382 -20177 -13648 -4976 2710 5725 -15537 -14459 -15259 -14458 -7777 -4793 -4599 -11365 -16793 -10679 -6098
21367 -6098 461 11903 6394 7752 12780 5566 -11440 -7890 3180 5903 -12314 -26041 -21852
21354 -21852 -3648 9115 -2924 -18776 -13820 -2073 8249 10217 144 -14899 -13987 11371
21342 11371 18694 -10928 -11656 -31321 -35144 -44129 -37674 -17922 -12614 -1771 -12886 -10001 -11041
21329 -11041 -20304 -27768 -32405 -38225 -17419 7180 23500 37509 34401 17833 -11214 -33147 -30227
21316 -30227 -12852 -1049 1437 -3432 -8360 -24676 -25281 -8707 -8328 -13623 -4264 14081 -1074
21303 -1074 -241 1365 4296 24674 32260 19960 22137 -8646 -27556 -26486 -12722 -16345 -34237
21290 -34237 -41446 -43525 -32850 -25326 -22352 -13860 13428 -1357 -5657 11310 32168 20280 -353
21277 -353 2996 14024 -12609 -19697 -20268 -22948 -28492 -23351 -12646 -24497 -37476 -37774 -33588 -41468
21263 -41468 -45933 -33554 -31696 -24538 -8178 -19966 -33488 -27507 -20505 -23522 -15995 -451 -5729
21250 -5729 -8668 -21648 -33301 -28480 -45869 -19474 411 -10452 -10168 -25954 -35759 -28070 -16462
21237 -16462 -20214 -18529 -11863 -79 13834 23050 13517 5941 1444 2216 12294 15733 14812 2578
21223 2578 2376 -1355 -11136 -4825 11992 877 -15835 -10971 -7132 -3230 -18378 -25859 -20098 -12714
21209 -12714 -12613 -23143 -28585 -15669 -3292 -11099 -20304 -19613 -26921 -13238 -13700 -23439 -28507 -19050
21195 -19050 -12475 -14960 -34066 -28592 -25233 -14153 -14394 -23739 -12712 -14921 -22409 -32811 -36929 -34818
21181 -34818 -15287 22308 22042 14222 -10066 -14072 1691 784 2608 -4503 -7780 1008 8379 14147
21167 14147 16918 22523 32598 19018 -4704 -15930 -24863 -18288 -23631 -26442 -16109 -16512 -3960
21154 -3960 1428 5186 11348 909 9792 13072 -15531 -13315 -12665 -15116 -1861 884 17038 23523
21140 23523 -2653 -10453 -1477 15734 406 -18691 -23808 -28278 -28427 -18196 -18388 -22577 -20978 -27751
21126 -27751 -25116 -14851 -20020 -6566 1008 -4891 7396 32794 30499 31506 15893 8155 13876
21113 13876 8028 20006 2869 -8471 11877 19022 1635 -5727 12993 11959 15516 10166 12443
21100 12443 13009 -359 -9794 -19947 -38731 -44436 -65644 -48467 -22640 -11032 -7889 -20019 -17617
21087 -17617 1968 18522 20807 -1609 -8212 3141 -1302 -12547 -15899 -38739 -43650 -24877 -5278
21074 -5278 -25833 -44289 -30591 -1216 7804 17075 13863 3357 -7053 -6046 -8445 -13327 -3953
21061 -3953 -10600 -16734 -17262 7251 1955 -4958 -6051 3586 -48 1555 3584 5594 -5621 2913
21047 2913 10295 9218 17504 2748 13304 10855 5640 -6373 -21493 -18792 -11201 -16006 -15169 -32459
21033 -32459 -43557 -32076 -6238 -1245 -9989 -17571 -10946 -5249 -2241 6631 3507 1742 9427 11884
21019 11884 -2010 -8847 -11723 4256 7641 -3325 -12300 -18817 -29372 -24553 -3427 10323 14578
21006 14578 21844 30921 38596 23911 -547 -15172 -24043 -10409 1785 12003 8689 -9861 -25849
20993 -25849 -34581 -18681 -7104 3434 8893 -3474 -14840 -11115 -4363 128 10258 12250 11692
20980 11692 2060 -6896 -23139 -31785 -21969 -20083 -12132 14689 18060 -11818 -21802 -22773 -14918 -2003
20966 -2003 -416 5854 1625 -8659 -25395 -38861 -37460 -26610 -7589 -10891 -15006 -17666 5578
20953 5578 10338 -14654 -32079 -35034 -6616 5706 15643 -15943 -39361 -9924 9689 1113 -9985
20940 -9985 -941 -6588 7704 19920 8333 -15296 -9867 -19466 -21055 -9610 2366 -1722 -15382
20927 -15382 10823 15319 -5788 9082 21063 14388 18451 26945 23965 14161 -342 -11589 -39718
20914 -39718 -63251 -53391 -27637 -7867 291 -14129 -13458 -12759 3527 -988 -21615 -39833 -38924
20901 -38924 -19896 -5026 5477 -1700 -19577 -31044 -23241 -13980 -8744 -18632 -42819 -32033 -10295
20888 -10295 6860 13046 -5028 -14526 -22352 -9352 3171 7516 18375 31427 25615 27964 10969
20875 10969 -14326 -15030 -11983 -4017 -4470 -18143 -25865 -38078 -45009 -41493 -18316 -13386 -15268 -12655
20861 -12655 -15412 -12990 -19526 -10263 20620 37708 35977 22371 13546 10521 10335 7452 12458 21961
20847 21961 12774 -6681 -15463 -19150 -2344 7814 -5109 -13042 -10171 -17669 -7031 12357 -5990
20834 -5990 -13557 -16437 -22723 -22946 -12699 -230 6976 5091 78 12047 12281 21909 1269 -2102
20820 -2102 -6635 -3003 -7939 616 -187 -7365 -1473 1312 -13886 -12175 6769 14731 -3464 -8835
20806 -8835 -19079 -18273 -24919 -18919 6504 5933 2040 -757 -14752 -12731 -7035 -23933 -25756 -8001
20792 -8001 -1749 -7963 -17460 -975 3142 -2246 9957 17265 19585 16047 22697 21551 13031 26892
20778 26892 30232 11852 7297 14520 20407 7105 -14649 -28033 -36542 -32031 -16299 -14213 -10116
20765 -10116 -12772 -22939 -20481 -15714 -9462 -23509 -21013 -9170 3745 22818 29661 22971 20213
20752 20213 22076 2673 -15472 -20610 -27505 -17700 3037 -3902 -21324 -13809 -11820 -7650 -21574
20739 -21574 -35582 -35073 -24340 -19424 -40986 -57532 -42834 -13409 4959 933 -5908 -14872 -20792
20726 -20792 -11876 -11831 -16895 -33591 -34867 -11829 -4018 -6563 -5154 -468 -10268 -7800 -11831 6560
20712 6560 16756 10251 -7491 -15107 -14410 -29123 -31541 -32742 -36333 -38583 -31737 -22673 -17166 -18300
20698 -18300 -14749 -2260 -3306 -23080 -18107 -40369 -55967 -46872 -41414 -27594 -15468 -6345 -3683
20685 -3683 -14689 -20165 -6435 -4562 6781 21937 21559 -7086 -22980 -35284 -27078 -27624 -28375 -14899
20671 -14899 -2717 1738 13332 26043 29353 15555 -12508 -17575 -10292 -3341 1270 933 2102
20658 2102 -1164 -4037 -8909 -23826 -20113 -17839 -21463 -14588 -6049 -16457 -35062 -41387 -42067 -41321
20644 -41321 -20764 -8108 -771 4821 -666 -5185 -16425 -26645 -16774 -20031 -27507 -25166 -29990
20631 -29990 -28636 -14611 -27593 -27634 -8226 -4655 -9587 12216 11492 5924 3518 -15192 -12306 11981
20617 11981 18070 7675 -9159 -21312 -24202 -18348 -4999 10229 17202 20265 4544 5010 473
20604 473 -13217 -7289 -3969 -2940 2266 -1741 -9181 2650 4967 -13376 -16837 -3137 -1850 -17135
20590 -17135 -10114 1987 7777 1691 -7435 -10314 -19128 -19357 -28715 -27397 -24470 -27042 -27637 -28352 -29505
20575 -29505 -29720 -21077 -23605 -3745 17632 9216 -3826 -14134 2716 5934 -10200 -22344 -30484
20562 -30484 -37507 -39408 -43484 -22732 -5064 -9803 -13511 -29352 -23016 -5789 -18432 -426 25919
20549 25919 22938 -12187 -22036 -7186 -1948 6550 3265 9745 6337 -13974 -17171 -29212 -40244
20536 -40244 -34796 -10567 -13690 -2897 7388 34 -892 2290 473 2359 2290 7488 11556 11688 4746
20521 4746 3025 -989 -9306 -6990 -21735 -40933 -43454 -36940 -33117 -27695 -8948 -6859 1196 -5427
20507 -5427 -13401 -9093 -12475 -16187 -16491 -15253 -13316 -28897 -39635 -21810 -12263 -12490 -9359 2833
20493 2833 -5905 -23426 -28179 -6920 -12625 -34312 -22556 -12782 -3016 -450 -15504 -13151 13996
20480 13996 35978 28007 13536 -2214 157 15316 11670 1220 8625 12173 -5742 3842 15179
20467 15179 18269 -7568 -20094 -40480 -43239 -35820 -27327 7082 23983 21201 21601 20266 24585
20454 24585 27501 31554 9130 14125 13531 12254 -2335 -14495 -1317 17600 6605 -5018 2343
20441 2343 -7993 -861 -730 -4758 13194 20794 6716 -7638 3732 -5230 -15225 -3855 8809
20428 8809 9951 9747 -23078 -17709 -26696 -53041 -56678 -42557 -17242 -19422 -33688 -39368 -33399 -31193
20414 -31193 -31551 -32342 -38080 -29033 -34336 -42102 -34977 -15422 -15381 -14947 322 12464 1970 -16657
20400 -16657 -29940 -27949 -24049 -29479 -24270 -14768 -14280 -25956 -30301 -22419 -14870 12323 16604 7193
20386 7193 1892 -9604 2460 -3063 16854 12847 5845 13253 20911 31119 18362 17830 -2832
20373 -2832 -5604 9511 13487 22878 20087 5694 -11630 -13947 -7016 -28116 -41498 -41903 -33583 -19810
20359 -19810 6590 -1853 -31352 -52484 -43056 -21421 9734 14683 3402 2487 12037 6250 -2548
20346 -2548 12953 16969 19572 10402 -14144 -21073 -25349 -28254 -17799 -9891 -28276 -25385 -32907 -32852
20332 -32852 -38641 -48285 -24255 -11340 -5016 -27963 -26400 -14368 -15433 7117 19958 20510 20759
20319 20759 29130 14428 10175 5424 -14293 -22549 3330 2313 -5927 2428 3262 4396 -10019 -9974
20305 -9974 -7619 -8155 1899 -2989 -11637 11694 26890 19982 -8413 -28801 -22248 -3680 -6194
20292 -6194 -8751 4007 -11256 -28571 -24870 -36426 -24506 -15549 -21523 -21597 -21363 -13037 -6741 -10153
20278 -10153 -9356 -14988 -13224 -12678 -12717 -10193 -12707 -18058 -20273 -20805 -15583 -11640 -1640 -8501 -5225
20263 -5225 -6793 -11868 -1266 -10459 -12702 -15387 -13612 -12165 -11333 -20078 -35915 -30714 -41826 -50274
20249 -50274 -23655 -9231 -9906 -31322 -31812 -23615 -7411 -12475 -15100 -9919 -10269 -4211 6303 9772
20235 9772 -2288 -18494 -17754 -17424 -5062 -8222 3404 11913 16279 851 -15784 -16778 -27066 -25266
20221 -25266 -16775 -12287 -30185 -25683 -34697 -42247 -17824 2416 -5037 12943 27420 24817 12287
20208 12287 3987 -1887 -14292 -19293 -16208 -18476 -31303 -27690 -21141 -8100 6747 14188 -8450
20195 -8450 -17924 -23668 -34750 -14879 2269 -4642 -893 105 -9881 -1487 6619 1272 -5204 -10022
20181 -10022 17459 33861 10421 -16333 -29756 -27589 -21662 -18227 -30918 -22490 -15411 -37030 -34302
20168 -34302 -28143 -39828 -52974 -29904 -21304 -23275 -7245 -4097 10950 23893 21240 -268 -17167
20155 -17167 -18626 -17213 -16489 232 -5647 -6288 11248 -996 8952 444 -20649 -15722 -21173 -12761
20141 -12761 -1664 -11784 -19591 -13222 -460 -2947 -25487 -21212 -7876 -16015 -22062 -56 4608
20128 4608 3355 788 6335 -2779 -14504 -21026 -28028 -14884 -15893 -24164 -30313 -6013 5848 17350
20114 17350 10480 11425 5187 377 7429 16503 12551 6104 -2846 710 4747 28635 31929 16995
20100 16995 4370 2833 -22042 -40345 -43221 -25445 -7202 -16032 -20875 -21505 -10334 -22460 -17391
20087 -17391 -12696 -7467 -15251 -8262 -2497 -26173 -25513 -23884 -30905 -43974 -41364 -34243 -42854 -47864
20073 -47864 -39157 -32112 -29954 -27878 -40185 -29786 -13689 -9478 -8650 -12932 -15404 -19195 -36880 -34250
20059 -34250 -52301 -17053 -685 -2683 -1578 -25270 -20546 -7813 -57 19464 26967 27633 13290
20046 13290 17743 17330 2165 7521 14451 24603 15649 6675 8900 2611 -6992 -19171 -13133 10295
20032 10295 34664 42629 18621 4705 -8774 -10557 4190 12631 21755 14690 8549 7399 -16495
20019 -16495 -23966 -16263 -10581 12900 5350 4242 22454 17851 -2556 -25561 -16982 -9073 -33408
20006 -33408 -14608 7045 2433 -9424 -11193 -19433 -15687 -19174 -7332 -7799 -14320 -25941 -25747 -22275
19992 -22275 -21795 -18810 -6999 6935 20282 -6128 -14103 -15553 -28622 -18205 -11232 -25514 -10486
19979 -10486 6322 2598 -8182 -8298 3266 -6512 -20921 -36964 -28916 -20000 -29997 -32602 -29771
19966 -29771 -19432 -18991 -20033 -15020 -14390 -16899 -12187 -4268 1237 929 2853 12656 3386 -31135 -29650
19951 -29650 -21675 -22804 -26030 -17655 -8704 -1425 -3113 -6941 6030 -297 1035 6471 -1895 -22275
19937 -22275 -36540 -36180 -27821 -19816 -14012 -10975 -3609 -18603 -34952 -15234 -18398 -29361 -29789 -27217
19923 -27217 -16270 -8048 -5671 -14011 -12324 2467 15405 14557 14032 16187 2004 -5755 -20131 -5334
19909 -5334 2408 7180 -4226 -21244 -8327 1151 -9172 -13320 -17373 -23297 -29339 -18562 -15201
19896 -15201 -8451 -29303 -20449 -4717 -6529 1593 -9226 3962 6447 -4498 -14451 -25481 -40387
19883 -40387 -30377 -21628 -11564 -337 1060 -1173 2698 -5540 -17615 -14414 -4503 -14875 -32929
19870 -32929 -30596 -8416 -2665 -4585 -9240 -229 -18564 -14703 -6292 -1710 8634 7281 5918 15115
19856 15115 18496 17932 22272 6060 -7890 84 1981 -13766 -25329 -15146 11607 -1310 -14065
19843 -14065 -26589 -19665 -17165 -30845 -24273 -2652 -4177 -28713 -14942 5187 15793 1748
19831 1748 -10207 -10380 20679 27063 12485 10256 17127 12260 -5314 5289 7714 -8331 -11818
19818 -11818 -2041 10588 29098 16047 -15234 -23770 -22716 -11866 3864 9821 13055 -6644 -1917
19805 -1917 2614 1749 1523 5816 -9972 -12341 -12465 -6631 -2843 -1471 -295 -6805 7910 23404 27512
19790 27512 33794 30373 21676 13701 18369 770 -3281 -8874 -9129 -18807 -14117 1696 -22556 -35783
19776 -35783 -33545 -32956 -45199 -47754 -40377 -32799 -21572 -17988 -20453 -6008 -13079 -11955 -1783 15905
19762 15905 19023 896 -7607 -8903 -11721 -19219 -9738 -13476 -13887 -5089 -2419 6011 -8766 -8778 -17536
19747 -17536 -17193 -16534 -9983 4633 -5838 -3253 8722 7135 -6432 -1417 -8804 -16870 -10722 -7971
19733 -7971 -8964 -18085 -25511 -22370 -23575 -9697 2812 1651 4910 42088 49070 43340 18546 7641
19719 7641 7414 10514 11461 11459 -8511 -15068 -27704 -47648 -59312 -66375 -36781 -14523 -11722 -14175
19705 -14175 -22188 -24215 -2814 15598 5073 -9453 -4138 -4338 -12843 -10503 -22781 -5870 -2848
19692 -2848 16015 14653 -873 -2969 14685 26056 37770 38534 14281 -4990 -5488 6630 5379
19679 5379 -10072 2728 17775 26579 2131 -30075 -16848 -4598 1457 -831 -5349 2662 12102
19666 12102 33611 30671 12163 7009 -5190 -19086 -21514 -19768 -17293 -8216 11547 12580 22462
19653 22462 24244 16120 4411 -8918 3201 4159 14166 17344 -6677 -11166 -13814 -17649 -22631
19640 -22631 -14774 2134 -3526 -7383 -8419 -17930 2407 -3813 -26723 -28869 -34408 -34975 -42736 -36880
19626 -36880 -28602 -22801 4469 26867 39225 39788 35582 27327 12142 -27945 -37209 -17291 -25427
19613 -25427 -31786 -18420 -9203 -20092 -14979 -19853 -15137 21397 33535 33042 27769 19331 12649 13416
19599 13416 13946 11209 8775 9591 10302 -10193 -10208 1718 -5906 2295 14414 13242 -2430 -16068
19585 -16068 -2688 9544 5978 8755 19490 22163 27264 37053 24814 13635 7911 -6377 -17660
19572 -17660 -28370 -22117 -23414 -11562 -6295 -4947 -12304 -18505 -13036 -3554 1500 7815 9684 31967
19558 31967 39699 26511 26997 19501 2327 -8791 9206 28107 15564 13406 4295 136 -3122
19545 -3122 -7067 -23389 -16996 1912 10076 15223 10908 7191 -8149 -12003 -10960 -14437 -20722 -20553
19531 -20553 -22481 -33906 -53704 -52431 -44924 -22310 -11376 -10914 3910 15047 10313 -117 -9073
19518 -9073 -4458 -788 10201 24293 12725 -6303 -17878 -4872 -1509 -10590 -26305 -39349 -40612
19505 -40612 -39440 -18701 -3157 -8292 -492 6456 9888 20671 1004 -9580 -2242 -4997 -16993
19492 -16993 -20165 6861 11032 7901 2893 5785 -5388 -9716 -21086 -17737 -17234 6242 29257
19479 29257 23630 26497 20315 15483 16780 -2154 -168 -1377 -5361 15202 28969 31055 24759 5614
19465 5614 -4728 -12465 2806 13034 16305 -2509 -15633 -14212 -7973 -5989 -4498 -2248 -15839
19452 -15839 -8560 5089 -3286 -3647 -8952 -13525 10952 11369 22327 33735 32117 22124 7994 9420
19438 9420 7349 -1770 -1745 10601 7459 14126 14106 8367 17362 -12728 -23940 -6682 405 -3883 -5531
19423 -5531 2788 12473 24336 22324 25128 11082 7626 232 1720 -5042 -18972 -22711 -8050 -7632
19409 -7632 -4843 -849 3589 2956 6807 2659 8809 13041 12957 8111 10274 18689 13397 -13145 -8820
19394 -8820 3722 -6018 -5869 -17509 -1942 8941 7559 14967 12524 -7126 1864 3166 12093 18929
19380 18929 21882 1585 -17375 -13204 -7454 4462 16653 8728 -3723 -12048 -17685 -27810 -32533
19367 -32533 -6015 15190 20568 6672 -6678 -14211 -14357 -9976 -4153 -2424 10720 11925 -3663
19354 -3663 -13182 -22124 -25615 -22063 -4913 14506 22007 6987 -9257 -4668 -818 3492 3008 -15302
19340 -15302 -22345 -26198 -26300 -20465 -564 -10931 2115 18394 29601 22643 24303 22159 29042
19327 29042 28357 15031 3639 -17306 -4532 26235 16038 28139 43490 26976 1814 -3208
19315 -3208 -15216 -667 9062 -12371 -22786 -27908 -13949 -8183 9115 11120 -10626 -24177 -18184
19302 -18184 -13347 -9439 -2878 2314 -210 7540 24653 40652 25448 13481 19642 26669 32751
19289 32751 16169 13015 10836 25602 25903 12017 7733 18261 11020 3864 9114 14132 13197 10701
19275 10701 -975 15080 -4465 -13259 -12165 -12558 -23843 -23534 -14989 -13590 -2908 6616 -7072
19262 -7072 -18081 -15852 -8440 2026 9275 14402 -11768 -6893 3615 16005 36387 34828 6918
19249 6918 4184 9706 8873 -3668 7332 13167 26133 24224 34314 30699 32127 33977 61001 67830
19235 67830 65301 74584 70686 65343 68333 61951 59629 77541 76003 83720 89756 82711 71010 54118
19221 54118 53237 19408 8310 13380 19231 35494 46626 51183 23643 -850 -12711 -11566 -7580
19208 -7580 715 -3934 9956 29347 17638 11871 14718 18687 16652 18680 38272 52260 45359
19195 45359 29783 8722 -1841 22421 45650 69249 71230 47295 46445 41943 68826 72578 57767
19182 57767 35018 36812 30487 34981 33245 45394 69916 72352 70031 87690 110496 141816 168959
19169 168959 193172 215485 221129 267354 299502 296579 284653 260670 223476 191844 171915 155108
19157 155108 179997 235548 279075 330214 385646 413484 401555 336055 288634 240477 202579
19146 202579 195714 213664 256981 285288 295256 275675 238834 199489 167380 137192 114560 112992
19134 112992 107418 106494 95906 97566 103843 86281 74885 75925 78273 91723 104891 109649 134019
19121 134019 162258 172307 163121 161625 150470 139184 139634 148682 154412 203509 279677 341613 362858
19108 362858 384641 394300 396744 417517 432543 384442 333025 313681 282882 253752 273214 293724
19096 293724 300628 284250 260072 220041 179193 135312 120434 138532 143821 142489 120875 89271
19084 89271 65435 45754 40163 20347 5513 1946 5196 22683 41883 55796 19900 -4070
19072 -4070 9316 31200 23776 -10624 -17289 -11187 -380 2290 -14173 -1317 21005 20799 3052
19059 3052 19 -4084 -8066 -13374 11476 31914 45508 27956 18847 15823 3785 127 4458
19046 4458 6549 43241 56495 51855 52015 52682 41099 19009 2719 1149 2144 5447 11955 11839
19032 11839 25792 40581 40597 20708 34952 52769 58162 66252 59851 68814 74490 45146 22462
19019 22462 17901 17920 28229 35586 33432 24043 27669 42470 61425 60858 62158 89174 93181 92932
19005 92932 111451 108915 106483 107172 110909 102070 100103 83836 99382 107104 111028 117892 85351 86422
18991 86422 109999 100014 91237 72180 74756 78918 74777 52096 47954 56174 66867 52737 44980
18978 44980 44741 51855 64604 80237 68840 45445 36766 45797 48716 21782 6813 7500 19926
18965 19926 41978 27551 35628 48624 66783 51917 45287 43071 51569 45198 29362 38353 45682
18952 45682 31062 18664 32587 21561 20885 30930 32522 29801 27464 39573 31087 18697 15330
18939 15330 19500 29364 19843 10518 43915 72284 72201 88296 99864 100979 104065 105743 100109 66609
18925 66609 55737 56281 78854 88318 97102 86439 96288 123701 129989 142881 148489 162263 149774
18912 149774 126486 121194 103837 79809 66147 42495 21335 28664 58847 65654 60093 52015
18900 52015 56722 62178 46993 56939 56490 39746 25932 35313 31986 44981 59504 64509 55175
18887 55175 68410 63431 31591 30794 55408 68923 73239 80475 97128 110921 119137 120967 118513
18874 118513 109217 80730 92583 84272 69730 69907 71140 90789 108076 97501 78951 102753
18862 102753 140870 157548 152247 154513 172814 148768 125258 88646 72135 78879 85729 81015
18850 81015 56662 45080 31497 51939 65056 73165 71531 66042 72354 55613 49628 26909 31934
18837 31934 50780 43165 27019 44628 52970 58170 60181 82825 94523 90576 81903 91373 91719
18824 91719 81188 76269 65762 61302 58802 79409 85160 77201 73859 72812 82319 108274 118771
18811 118771 120537 110411 106102 112413 116696 107893 123304 126670 129890 133220 143274 164364 177719
18798 177719 229060 266734 301417 369938 437764 514684 554969 535122 521191 496102 449897
18787 449897 393446 338575 317576 318650 330158 360179 410287 475684 515958 548076 538962 507328
18775 507328 462131 391934 320941 269884 254522 220594 233279 293012 348161 355556 332486 314179
18763 314179 289381 258499 227925 214839 207220 216128 208967 211496 230013 242103 259374 286472
18751 286472 303014 347437 381489 420901 449972 470545 481289 481982 495122 496649 534882 624032
18739 624032 710727 796268 850287 889334 902722 888387 837071 768093 693774 622155 592896
18728 592896 564544 540752 515614 509990 513446 516413 524483 528256 514557 500991 497662 505670 502224
18715 502224 482811 462758 448967 439418 444457 452894 477421 531875 570978 591957 602451 621847
18703 621847 658457 703383 770980 814387 860234 936649 1042735 1144999 1226866 1347635 1539513
18692 1539513 1777455 2034507 2271497 2426111 2544551 2708776 2971338 3359603 3895332
18683 3895332 4615182 5597860 7123236 9465867 12291979 13745815 13188606 12064924 10892322
18674 10892322 9691268 9016386 9156707 10084760 11822654 14564043 18640046 24619960
18666 24619960 33648350 47870775 70747786 100069631 117396721 114994500 105223947
18659 105223947 93582949 78327643 61187489 47164078 37578445 30924364 27196090
18652 27196090 26853141 29819308 35508272 40350248 39484097 34285113 28335533 22245097
18644 22245097 16629415 12573404 9983344 8344001 7320894 6749066 6462551 6412376 6559724
18635 6559724 6751004 6783750 6625671 6405573 6314716 6385738 6691094 7340574 8464209 10181406
18625 10181406 12681762 16399634 22032484 30002288 37824262 40276918 37653089 33963926
18617 33963926 30451864 27884318 27938350 31552624 39444482 51887921 65979690 80053914
18609 80053914 98708561 121445224 133563176 121643512 98807963 77046340 55785865
18602 55785865 37856350 26338506 19762454 15945780 13597049 12152807 11451488 11396862
18594 11396862 11974793 13346922 15489826 16686504 15415324 13057635 10766489 8487650
18586 8487650 6528315 5242199 4436914 3882265 3522388 3324919 3196368 3030246 2790906
18577 2790906 2516963 2215083 1928292 1682575 1489231 1342292 1252901 1185536 1124827 1088210
18567 1088210 1062808 1003756 940619 907254 868974 820055 793002 788200 785113 783853 767457 731396
18555 731396 683192 614738 563810 526436 505970 509654 508840 486160 487793 483887 502212 510357 509130
18542 509130 504818 488380 480471 470757 445554 417917 380726 360501 352746 324201 323843 335575 336581
18529 336581 326837 333490 335319 326147 336451 341475 324780 320669 340002 337663 311759 286312 277812
18516 277812 292031 281079 246262 225036 214265 217188 235402 243479 235193 248710 272246 288663
18504 288663 287739 293908 292146 282162 265805 240264 241709 242614 238081 257991 260891 256951 275225 303870
18490 303870 322242 319242 300200 291631 291466 298236 300664 296280 307903 302585 280630 270685 246547
18477 246547 242051 240309 252190 284129 294874 317753 349842 406932 488279 582311 687838 838439
18465 838439 979357 1019926 942705 811880 673085 551841 481177 456051 452679 510203 619315
18454 619315 762019 910088 949725 883107 754542 622458 510321 409127 315269 252855
18444 252855 214864 193243 171512 154863 139349 132747 134746 131462 115724 105516 110027 114346
18432 114346 119144 121662 132133 137342 139511 122506 98999 88179 87609 83112 107098 125421 125512
18419 125512 137338 135815 105947 110974 122771 135035 137586 134583 124704 115034 99109 93992 97335
18406 97335 86769 67647 74213 86766 87923 89192 69586 70956 71571 71175 85262 93894 91151 80990
18392 80990 82676 71265 73156 73164 83738 88037 67913 86302 105252 118699 117234 99430 93820
18379 93820 95157 84503 108265 118299 110674 97685 99260 106236 97398 79076 72827 74826 109034
18366 109034 129129 124821 133680 148647 170032 167447 125363 102389 85326 79512 81913 78787 72966
18353 72966 88211 108882 134921 146980 145700 147725 151135 161317 170295 172984 166788 166460 168914
18340 168914 169895 157591 139676 133687 142122 141874 136061 136978 152058 161092 147500 148940 162110 173687
18326 173687 181888 188891 168986 144930 155849 161864 148223 136620 139522 122629 104198 121072
18314 121072 140782 131154 123587 105718 104519 117895 125783 118999 104465 94405 113132 108288 101175
18301 101175 123327 120764 120144 144610 154194 154400 141207 116657 115931 115290 113854 123232 116672 126965
18287 126965 148482 168498 171256 160115 147187 149143 144848 138491 151568 157149 174083 177300 192961
18274 192961 188140 198139 200437 215425 233624 217386 220623 242293 258392 248134 250064 269534
18262 269534 279506 285578 286922 312979 335247 363751 382293 393520 418716 430016 440599 455951
18250 455951 497854 545755 574628 601008 648242 694934 765565 853591 998584 1172491 1368347
18239 1368347 1542161 1671631 1747211 1767435 1729192 1709696 1694740 1729293 1820505 1970352 2208155
18228 2208155 2547379 2998515 3532400 4179025 4914587 5805808 6925036 8431941 10562179
18219 10562179 13659385 18321185 25342206 35184421 47426333 60849668 71389004 76894302
18211 76894302 76818184 69779319 59087751 47994841 38094599 31208823 27755385 27706837
18203 27706837 31238941 38428238 48736897 61106495 72290202 78451068 79388683 73275241
18195 73275241 61841107 49076701 36776920 26585197 19214407 14188134 10968617
18188 10968617 8917362 7573248 6630888 5874974 5236512 4676175 4188775 3751642 3368082
18179 3368082 3050934 2808552 2637025 2517459 2444596 2386017 2321242 2274849 2232825 2127882
18169 2127882 2035295 1934012 1808800 1662446 1504193 1403102 1335204 1286534 1280318 1255055
18159 1255055 1203418 1131300 1052947 1001259 968007 919726 846160 768334 704391 638394 583791
18148 583791 549994 518376 506082 505544 511834 537663 547176 545476 550399 551613 553419 540411 550178
18135 550178 563830 534029 521562 516897 514172 526320 518965 539917 605366 676313 737838 802869
18123 802869 900770 1031976 1179927 1343311 1530173 1796004 2178063 2731994 3547288 4767838
18113 4767838 6527939 9147434 13268891 20480598 31681528 38108932 33369236 26612462
18105 26612462 20918871 14302182 8861973 5838826 4276506 3371580 2808033 2416678
18097 2416678 2091662 1835396 1613108 1424907 1254795 1078343 967011 886209 831750 744647
18087 744647 659469 585789 540319 497897 445565 411710 386522 377785 376387 372471 368155 370159
18075 370159 347728 298538 270465 255787 241724 212799 209222 197060 185693 169967 152448 142917
18063 142917 139375 134340 147071 153553 169494 188906 194443 194526 170712 156619 162627 175955 197676
18050 197676 204632 183881 174192 171198 162138 153255 147771 155353 165971 217322 272091 316663 393756
18037 393756 508788 696089 943241 1088821 1073343 982911 870603 740464 604405 499678
18027 499678 411749 351585 307385 296536 325561 361289 407407 421462 384823 317097 246923
18016 246923 206364 188990 164329 149728 140113 132311 123250 119888 129645 115931 114345 125910 129206
18003 129206 107543 100234 103953 115013 115278 131385 168227 213053 255011 323039 382878 396634
17991 396634 367525 344625 346455 337869 343180 380738 461192 596735 723161 849998 1013556
17980 1013556 1193181 1242106 1104630 893814 690652 501977 347758 240413 205562 187762
17970 187762 174713 169248 181325 188293 185895 206686 216439 215828 201126 191739 160794 144517 125365
17957 125365 107876 102384 91684 74580 56220 41381 44685 71513 82534 73234 75555 69747
17945 69747 71728 65833 91646 73889 48573 29985 38487 57525 66257 62877 67537 61537 59991
17932 59991 50911 41875 27979 34915 36724 41653 38199 30205 40582 57173 49806 38731 48752
17919 48752 49812 43243 40465 43188 20541 11443 15169 19215 3468 -7859 5106 19188 27376
17906 27376 35395 26846 21742 28164 24755 30326 29189 26925 26121 17331 16293 9222 18172 24654 22781
17891 22781 36184 53914 44476 39058 38367 45899 50551 52901 38124 14138 26082 15938 12948
17878 12948 23340 30366 28381 25302 12999 13320 25081 6027 16735 36212 27231 31818 32749
17865 32749 33947 34147 30525 32706 27945 18702 9142 -13777 -14864 3904 -3097 7664 4375 -3371
17851 -3371 5777 13018 17621 14763 16605 28127 37910 45323 47911 38854 12070 23531 44178 51029
17837 51029 41559 29656 15035 18839 19022 30269 38147 51714 43668 20648 9666 29518 36723
17824 36723 34371 14706 -6752 -7282 3803 17770 12166 12208 8131 25285 38119 20878 12787
17811 12787 11068 17136 25402 41675 34950 36963 31591 28720 32573 45569 47122 36534 36790 25789
17797 25789 28827 43037 52593 44802 46968 56009 40271 42044 40844 52003 42480 24777 11609
17784 11609 2505 -2489 -3091 13745 40108 47082 62078 56799 73565 89765 94026 91630 80479
17771 80479 74178 78110 81226 81540 89417 94645 95847 98380 104413 118325 150922 171770 205830 268306
17757 268306 324316 374189 407659 378336 304848 251216 224839 210089 184296 178636 168015 168541
17745 168541 197492 223034 243936 271005 296850 353105 394045 380014 360373 317461 288442
17734 288442 288675 292227 289205 252162 225801 196797 160163 126606 86023 69003 85959 91252
17722 91252 86418 73677 62933 58652 63450 66659 74239 82830 102471 121477 136568 140551 136094
17709 136094 122548 107934 83765 69156 77071 97779 133361 180190 235533 302765 345867 352038
17697 352038 337811 301471 253198 237611 239755 233924 248381 280271 288472 268957 238569 216876
17685 216876 230681 282386 314751 292575 264529 243571 205638 170467 134269 125572 122110 118890
17673 118890 115912 105939 87484 89590 88723 82479 63385 46450 43147 38797 30998 29915 32005 41622
17659 41622 37015 31906 28293 36549 31053 37733 18211 23150 33094 35902 29423 22592 16215 30087
17645 30087 32894 9222 6154 19635 16334 13723 28598 39796 34902 43177 55669 65657 69424
17632 69424 74070 92071 99562 135827 189421 257436 330054 388703 429143 439330 410079 353056
17620 353056 301446 267283 234978 205575 193396 193203 195670 258359 324775 350873 381499 387785
17608 387785 370803 332116 276736 207614 147490 132055 112234 94923 62560 62733 58463 52647
17596 52647 59288 50657 21585 4598 -4069 2046 17349 28988 35175 40952 48360 54651 51792
17583 51792 41393 33907 31423 32930 30124 12287 13988 3934 2769 9471 13500 7861 18736
17570 18736 34037 33269 14424 -2898 8208 12997 14536 21545 39647 42267 34362 33860 28414 29064
17556 29064 38531 21202 -399 266 -12229 -11193 13865 23917 26768 27222 35536 44079 41751 24605
17542 24605 3126 18259 22519 13384 6413 946 1856 19770 29402 59516 60329 48822 41279 39690
17528 39690 42382 26284 30466 38512 38093 43716 38082 40368 39702 31057 29080 16371 13544 28161
17514 28161 36539 43877 53308 73739 111943 126340 121402 101586 89990 79643 62243 46614
17502 46614 34853 32137 30874 30833 38988 43052 38422 40616 38031 34795 44322 30761 3197 13404
17488 13404 25207 41593 53672 47451 25395 13714 -2880 13149 35333 60098 48064 35183
17476 35183 32534 35766 38115 45333 52002 52313 57733 73009 102522 118281 113200 105101 99901 106601
17462 106601 105548 104018 104886 74065 36223 59525 96055 133471 146626 151495 143002 141826 138462
17449 138462 125668 106546 73121 71509 101604 117280 153665 207069 208626 192870 182742 144918
17437 144918 101350 72376 55406 66490 72107 51940 51451 61689 56744 53502 55216 47311 43515
17424 43515 43160 32790 20358 11935 3520 21754 27194 32866 63772 95177 91417 72104 56494
17411 56494 42244 50062 52513 63013 75756 85823 82548 86696 93999 89259 78618 75236 71752
17398 71752 88706 92555 87249 77404 71758 78369 77061 78554 79733 75467 96998 127555 140252
17385 140252 153815 171864 173309 188348 211006 219739 188232 157081 126390 116180 108315 104327
17373 104327 125673 144633 148070 145339 137706 134365 121081 119149 121421 102994 96956 112696 138419
17360 138419 152862 139979 140127 142924 151449 144173 128548 138077 137380 149403 159677 156081 163010
17347 163010 171735 162858 162149 174828 194034 202301 201753 201332 207814 214647 236857 289857 355275 423991
17333 423991 533608 692114 768994 736203 680470 626911 564914 495858 412819 363183 348489
17322 348489 372423 424212 485927 560430 680107 790949 819214 766952 686084 608354 550524
17311 550524 509665 494878 491184 498933 508366 530138 543003 536112 526686 545027 571312 597803
17299 597803 637357 676616 729223 790034 884959 1014455 1214669 1516618 1867211 2083940
17289 2083940 2125864 2096659 2035634 1938855 1851673 1861460 1964783 2195922 2550900 2967360 3456014
17278 3456014 3942002 4442617 5073930 5959187 7316039 9456118 12482120 14876153 14799014
17269 14799014 13407773 12044157 10749080 9946400 10046439 10951751 12674928 15427459
17261 15427459 19587265 25579529 34407366 48036991 70039516 101383321 126359434
17254 126359434 128880118 118558843 105365625 88837013 69990089 53928336 42791682
17247 42791682 35025935 30245020 28722329 30356818 35066413 40900667 42450653 38169704
17239 38169704 32027208 25821708 19897265 15384440 12432642 10464015 9176036 8353918
17231 8353918 7700742 7139987 6696944 6382900 6192543 6134910 6207718 6400573 6648085 6950966
17221 6950966 7452065 8301877 9601961 11558141 14493920 18974443 25749197 33983845
17213 33983845 38850187 37782493 34424698 31198446 28547226 27929312 30494155 36750982
17205 36750982 47015409 59351012 71694990 87446792 107717050 123441664 118649499
17198 118649499 98215462 77114641 56962356 39132851 27211365 20287286 16189889
17191 16189889 13658909 12029977 10995201 10452473 10485171 11271662 12938041 14631922 14446854
17182 14446854 12664821 10698509 8708943 6842632 5537479 4764911 4217709 3710487
17174 3710487 3246912 2859930 2527530 2261786 2019650 1815790 1629619 1503008 1401069
17165 1401069 1322616 1270761 1220178 1200975 1177896 1130863 1099233 1090315 1060977 1027812 975386
17154 975386 909283 826595 770940 726030 655841 594159 559032 542377 511171 471766 463790 452781
17142 452781 432768 419868 417218 406620 391058 401434 410836 419650 427074 416286 387303 366654
17130 366654 352088 342593 309551 279087 270098 279536 285906 281073 288104 296937 302748 305500 296398
17117 296398 271822 272657 263864 244532 218831 227095 246527 231659 217142 226924 229042 225528 213415
17104 213415 220239 229389 230046 226504 227910 218131 203116 206491 202612 199424 223499 210905 181842
17091 181842 185930 189190 192274 200019 198720 196103 197181 179361 183490 189085 185869 194195 196430 201995
17077 201995 189688 203723 206048 203523 188740 182178 217692 254041 278042 308098 331335 323379
17065 323379 311691 306135 261942 219651 200045 179489 141322 121074 128926 134950 140972 127863
17053 127863 105759 92308 80918 74771 87999 95793 90788 103362 104640 119691 141552 138001
17041 138001 135466 120611 128733 145775 148419 157543 152569 145163 145802 145949 148493 145238 129183 108672
17027 108672 120556 138510 127959 128886 157044 178218 183389 203842 208295 211576 232762 259189
17015 259189 301342 306718 295568 278850 248969 221491 207163 174217 140436 131307 115821 91315
17003 91315 98065 98969 96437 103919 93026 90877 94901 100045 84220 77735 98168 98319 94280 90504
16989 90504 91943 106946 134728 153671 154220 154010 171539 213990 218508 191027 154506 155469 126333
16976 126333 95526 101553 100006 102314 103392 90905 101683 88266 69621 63980 86401 105703
16964 105703 121027 103586 88039 83723 94409 83023 79152 75187 70725 58916 76076 82156
16952 82156 76927 86873 96819 100237 104365 98993 97721 96841 105083 95694 71999 68183 49271 37674
16938 37674 60965 74070 65950 71920 116187 157665 163242 167720 174649 172114 155670 140219 130610
16925 130610 135056 120830 112490 99776 86036 78940 91349 94816 104790 119860 141578 171016
16913 171016 168291 179113 191420 202208 175331 171440 179889 171510 147416 124110 102489 94432
16901 94432 111020 127121 147774 144272 153817 167405 158492 145365 130118 103940 84643 87754
16889 87754 96865 98215 107225 101807 103527 107049 126425 134285 118160 100751 101002 82627 69453
16876 69453 79713 86498 104587 122729 130845 117841 131181 138325 133188 122244 132195 132565 129089
16863 129089 112820 111830 113210 120201 149388 144452 151893 147548 141515 153565 173619 182182 174843
16850 174843 175862 174724 173939 173465 182355 181381 169016 177183 204523 239036 243731 241462 233946 258199
16836 258199 291990 282613 274486 269251 259252 265320 262223 281784 301633 307483 322248 343570 380536
16823 380536 399468 410538 433709 447754 477943 510919 525482 551340 578950 631826 703202
16812 703202 757689 835211 964649 1107455 1270984 1409440 1482668 1533420 1616191 1712502 1866988
16801 1866988 2063660 2256725 2468922 2693922 2948518 3303419 3726554 4177316 4737278
16792 4737278 5437810 6372767 7764460 9764159 12644520 16785862 22697846 31511565
16784 31511565 45291260 66742484 91147237 99022308 87580724 72323435 56879802
16777 56879802 41454150 30434504 24761495 22851368 23598661 26735593 32814465 43235892
16769 43235892 60602528 84322994 98608461 91331010 75546229 59734723 43046686
16762 43046686 29095703 20209124 14940896 11649461 9460760 7956678 6886684 6103164
16754 6103164 5573878 5247103 4972665 4636621 4245557 3833140 3454668 3081368 2707694
16745 2707694 2438904 2263424 2144313 2021692 1914128 1840142 1807423 1750700 1616933 1485619
16735 1485619 1359125 1215518 1099943 1025859 989282 957962 922295 899238 848628 778585 701136
16724 701136 626994 569815 534481 532528 554600 585026 621829 648322 651305 647853 618207 602432
16712 602432 593436 625753 622268 610660 586583 540509 467141 408381 370398 349874 342507 337968
16700 337968 326654 319067 324299 355735 413445 477050 528920 544833 524765 451019 402928 343657
16688 343657 297843 260633 240947 227378 206324 186636 179870 176468 169387 174776 161123 160323 156779
16675 156779 168648 209343 280130 309913 275633 233974 209959 183453 163237 135483 119071
16664 119071 115826 153008 184822 200215 211336 235339 248600 252795 229334 197672 171382 131868
16652 131868 110841 83962 91769 108475 104282 115151 114569 132182 150159 133231 120339 106915
16640 106915 75166 69768 80354 68077 69507 80244 109966 113478 101905 86157 82025 80435
16628 80435 83621 85374 63228 58633 53670 45974 46175 39766 31196 46803 43274 22785 25070 26410
16614 26410 43034 51502 43277 44645 61143 64833 48377 25617 30508 50839 57493 53444 35715
16601 35715 35368 36930 36859 34059 17833 13106 28700 44783 52642 47275 47077 55622 51741 53891 48805
16586 48805 36346 36442 23392 4969 1156 14534 16577 15395 -6915 1544 6801 -3010 6024 9218
16572 9218 16595 16728 99 -13765 -15885 -18227 -1639 7496 14041 27238 39098 32719 8809
16559 8809 1853 826 8687 19399 50755 51816 35043 13700 9921 19339 8477 18738 8388
16546 8388 3801 4144 10898 29457 36524 21168 204 18397 40966 59370 48542 42245 46988
16533 46988 42501 34245 24020 28063 43541 57077 62093 39836 20742 17649 25638 40421 64301
16520 64301 48551 20408 15366 27881 44365 52340 46580 37437 46852 32440 33500 37070 30982
16507 30982 22264 -877 -20939 -12985 2469 14493 37503 43725 29193 34015 33833 34066 65731
16494 65731 68333 47726 50064 54827 37769 26076 30692 36542 43065 34115 42584 58019 47302
16481 47302 36080 44416 53036 55577 57409 58790 74859 98320 118216 147432 181585 204630 263554
16468 263554 389380 540699 731847 877930 849984 720909 577645 433296 354778 303353
16458 303353 285817 315981 405752 574882 778448 882873 823628 683519 537145 385116
16448 385116 279803 192208 123689 101497 95232 95339 84757 71326 66589 59257 31001 36141
16436 36141 36969 16499 17390 24725 29105 32648 31631 23417 17594 7196 15973 26575 9499 -3410
16422 -3410 5736 -12406 -22858 -17023 3908 16090 4442 -2498 -6453 -2701 2165 20074 22753
16409 22753 11598 17162 14036 4913 465 6625 13661 10739 -7765 -15224 -9182 -3262 -6051 -3562
16395 -3562 11778 20414 -174 3580 21085 3973 3362 -4409 -15034 -25513 -13395 7329 13148
16382 13148 -319 -10453 -20872 3691 32662 38269 30077 26065 4579 -6326 3361 -1294 963
16369 963 -2171 -15596 -15556 -15480 -19671 -8617 -775 9292 29421 8219 2057 9816 -2018 -12784
16355 -12784 -7753 -29118 -33842 -40106 -37251 -30169 -25343 -24199 -15164 955 7103 -33644 -48852
16342 -48852 -41536 -24884 -30260 -44340 -23612 959 7875 -5338 -15802 -24930 -16573 -10697 -26899
16329 -26899 -33621 1502 24158 31222 40225 37407 15799 -10077 -4190 -16807 -18106 5378 12001
16316 12001 3801 -17722 -19759 -34523 -19169 1501 -3261 -12577 -10382 -15369 -14013 -22663 -36905
16303 -36905 -26268 -11019 -8904 -18668 -31150 -42169 -27267 -10711 859 -11087 -13417 -5789
16291 -5789 -4816 -24302 -9385 -14831 -22862 -15011 -17103 14499 25056 4110 -16799 -23152 -33792
16278 -33792 -33415 -26645 -23932 -9076 4702 5639 -27107 -20772 11621 2144 -11332 -7143 -21322
16265 -21322 -19988 -2158 -7284 1506 9008 182 -4771 12862 49374 45041 4715 -17560 -20306
16252 -20306 -25694 -34524 -17232 -14479 2556 18398 12313 13779 12116 11767 15237 8210 621 9205
16238 9205 24637 27191 34059 39906 35240 41875 77298 126175 146899 176369 258237 351106 468730
16225 468730 528892 469973 393749 321660 233165 169787 131031 117700 129681 158255 194200
16214 194200 241558 305903 402837 490366 486115 432112 337165 252529 195196 146016 110621 70544
16202 70544 56938 55539 56411 57854 39126 5147 22162 16951 14520 6618 6508 7758 -5343 78
16188 78 12703 -2726 5269 6816 1399 -6242 -20582 -12656 -4339 -8316 19219 18680 17212 13938
16174 13938 10798 -10466 1827 -3503 -9461 -13477 -4196 -1992 -9049 -13380 -19575 -12647 -2216 -2359
16160 -2359 -7024 -13005 -17034 -21361 -26139 -32614 -25161 -30970 -13643 -16515 -8569 -5128 -11947 -2823
16146 -2823 -4032 -11832 -9306 13563 25448 18827 33422 20886 14411 -1290 -2198 -18176 -18746 -14454
16132 -14454 -14647 -18498 -17036 2686 5776 -1142 -23513 -19511 -8292 3379 8100 -1826 -6736 -15780
16118 -15780 -31579 -37987 -22832 -12342 -9666 8408 23947 16307 -13274 -16943 5730 4451 8772
16105 8772 10328 21988 14101 -14988 -10056 -3291 -10602 -1052 13143 17356 21199 17217 -2198 -12694
16091 -12694 -30958 -31971 -9783 -11962 -31706 -26465 -1493 -14991 -27658 3452 11554 9791 -12700
16078 -12700 -14598 -2083 885 1207 16480 16342 3296 -239 1368 32938 29536 -4625 -7514 -106
16064 -106 -18967 -31901 -30013 -9792 6781 8616 -22627 -26346 -7381 7837 10657 494 -16713
16051 -16713 -25146 -11281 16612 15938 8535 -12775 -25353 -23372 -19808 -25964 -19747 -20978 -26882 -29500
16037 -29500 -44528 -38565 -34636 -27231 -18906 -2762 11557 2358 5010 5419 7614 25262 22819 26671
16023 26671 14448 -13490 -5383 8606 25752 25640 16849 13832 4309 5792 6717 1776 -5504 9337
16009 9337 13098 13270 21713 12921 -2044 -12998 -18373 -16795 -21616 -17724 -18027 -6196 5448 -2907
15995 -2907 -25940 -33942 -45576 -41907 -36583 -13210 -3747 -6570 -24577 -28951 -4884 -6618 -16877
15982 -16877 -22973 -27668 -31321 -18459 -21102 -13780 -1570 14201 6005 -23022 -22579 -20498 -29629 -29278
15968 -29278 -18810 -8823 -17711 -26350 -15411 -21894 -26787 -33389 -20036 -9434 -15546 -8003 4504
15955 4504 11792 4767 4778 7735 -3556 -5480 -17992 -22935 -20749 -18888 -9948 -10800 -21287 -26669 -21948
15940 -21948 -26472 -38383 -5765 1670 3061 12310 -6077 -19052 -22599 -2811 24046 21120 16798
15927 16798 7402 1964 3813 -2379 -9174 -3779 -9371 -21981 -33943 -42176 -37081 -26066 9836
15914 9836 -1872 -18238 -22140 -15117 -12373 -3643 4226 2864 -7204 8395 6134 -3329 -8829 1578
15900 1578 1599 378 3681 -5243 -13710 4971 23223 27927 29444 28402 14132 -3366 -15955 -7354
15886 -7354 -236 -11556 7455 22075 6020 -15443 -11484 177 -9851 -9859 7617 -3 -11761
15873 -11761 -15812 -13382 -540 3211 -9221 -641 7962 11876 2435 12179 23777 15125 1010
15860 1010 -4325 -5850 5993 13961 3107 3352 20984 7453 -1935 16498 24496 9753 -11523
15847 -11523 -16014 -7008 -13979 -4676 11574 13487 -3927 9831 4985 -2355 1634 9219 16595 14138
15833 14138 20300 28635 22685 1366 -1817 -8154 1849 -7295 -18092 -6269 -5857 11514 13627
15820 13627 8779 -10330 -16157 -11608 3327 -562 4331 -9180 -1954 2578 2079 867 -421 3990
15806 3990 2991 -12934 -7050 -6335 -15072 -27066 -23508 -20922 -11842 -13003 -20462 -31335 -32239 -16413
15792 -16413 -9728 -14057 -2436 -5410 -7555 -16308 -5209 6045 4667 -961 922 -8349 -10337 -7569
15778 -7569 7760 10202 -5507 -16169 1734 2094 -15723 -28466 -14324 -15820 -11797 -22544 -15525
15765 -15525 -3911 -13071 -37300 -19630 -21588 -19379 -33303 -23824 -7531 -5572 -12714 3246 12509
15752 12509 -1190 -11510 -21397 -9922 -10137 -2762 -21319 -18606 12390 24069 9029 8384 1495
15739 1495 832 -8922 -31653 -24545 -33387 -42051 -20209 -1567 1537 -671 -11844 -5798 23480 24170
15725 24170 447 -3534 -14190 -35116 -49765 -48185 -35312 -19955 -6941 -11057 -15119 6531
15713 6531 13775 16092 18356 9072 5136 4493 35632 35200 4798 -18822 -31092 -11632 13963 16413
15699 16413 8184 5317 -3185 -16177 -9473 -13546 -2527 -12967 -2316 -5362 -25407 -35853 -38594
15686 -38594 -47295 -46034 -33539 -23425 -30389 -26217 -104 1070 -8022 -19624 -21146 -8323 -1465
15673 -1465 -4270 -15505 -14319 2074 1319 16972 18183 -1083 1656 6220 1727 7927 -5293 -339
15659 -339 -3087 3863 21802 28023 14648 11602 28524 10963 -4523 -8749 3593 441 5618
15646 5618 1297 8799 23240 32343 24136 15072 5135 -19506 -16129 -26583 -26663 -10009 -7439 -16379
15632 -16379 -17783 -7508 1409 -1416 -3788 -3572 2118 1571 -262 -17668 -10930 9063 20866 3148
15618 3148 873 -8269 -13356 -2806 4494 2185 -16588 -24189 -17572 -36194 -31267 -31893 -42913 -34000
15604 -34000 -32330 -42753 -44223 -24902 -30438 -20350 -2504 16654 41265 23313 762 -1866
15592 -1866 -1605 -8952 -21997 -34721 -27861 -32107 -5268 -2943 -26282 -18792 -11293 -19192 -35839 -23013
15578 -23013 -22913 -19555 -17886 -24270 -18646 -1362 -16317 -26192 -21481 -7483 20106 22992 19664 -3882
15564 -3882 1280 5085 -2608 9947 20650 22188 -1673 -12146 -10222 -2651 -24520 -26160 -6132
15551 -6132 11453 14453 13633 1593 -5866 10678 19487 37315 38264 39867 35242 11018 9325 10715
15537 10715 1554 -13232 -21839 -16265 -16165 -38972 -46942 -40826 -26199 -15140 -5074 10110 15683
15524 15683 18407 26200 22104 14740 15229 2784 -4136 -1906 6033 11225 5565 -392 17312 17656
15510 17656 8703 -3525 -18248 -18618 -13063 -7938 -7149 692 9891 23186 20817 9978 21877 9651
15496 9651 2722 -4113 -7683 -10821 -643 11170 -321 -19536 -22012 -16388 -15327 -15952 -5519 5913
15482 5913 10341 24905 23788 16469 38252 29509 -1427 -36390 -51391 -60898 -49291 -17215 13801
15469 13801 -768 -5994 -796 -5850 -6380 -3881 -25551 -27782 -33163 -50931 -51166 -33492 -21296 -17362
15455 -17362 -24411 -13049 -4323 -11995 -24114 -20429 -6923 24316 30392 5189 -6827 -26912 -53602
15442 -53602 -55609 -38759 -41100 -25375 -33643 -43328 -46708 -21969 -2963 -6961 -6880 4308 3504 -16481
15428 -16481 -25827 -25605 -15475 -14858 -8443 6882 16134 7717 -4730 -14771 -21164 -35086 -38521 -37406
15414 -37406 -22522 -15544 -15717 -18387 -4890 -14950 -27711 -27090 -27768 -28225 -23023 -17291 19046 38079
15400 38079 32657 12257 17698 21870 8102 -11899 -17021 -28416 -40931 -27716 -12835 -803
15388 -803 -6609 -27322 -13734 4635 22020 4764 -191 6246 7570 -2401 -17235 -22453 -6060
15375 -6060 7422 -59 6893 -6667 -27723 -8269 13625 5953 -4612 1197 -10588 -13467 12355
15362 12355 -4534 -14406 -19609 -14001 -24020 -24841 -17248 -13898 -6206 -1271 3541 -8502 -15042 -1745
15348 -1745 -5748 -7219 8374 21367 16833 17926 17140 8040 2937 19308 26996 40831 40105 32340
15334 32340 31121 40917 44400 33790 25220 17358 -8298 -6619 -14719 -30497 -24138 -20776 -19084 497
15320 497 16750 7150 167 3268 -7044 -11248 -16240 -8804 -4498 -11437 -22863 -30564 -36580 -15452
15306 -15452 6255 -15081 -28754 -38633 -30208 -26432 -25404 -13594 901 12676 10044 -2934 -514
15293 -514 3045 -11474 -15304 -19786 -6873 -1023 -5880 -6205 191 2325 -1664 -4265 -823 939 11401
15278 11401 22858 14425 -7658 -7520 -14945 -24780 -28355 -23802 -15030 -13658 -20832 -16747 -19628 -9203
15264 -9203 16304 37101 35460 2038 -13992 -3711 10650 4569 -30576 -34603 -26670 -31612 -44228
15251 -44228 -31225 4634 22627 16924 4331 -2660 7780 7175 -1513 -8655 -2205 -18775 -26576
15238 -26576 -37720 -32365 -32638 -32577 -32728 -17513 -10766 -565 -9136 -8528 -19557 -24512 -3847 -5746
15224 -5746 -13805 -11708 -17870 -42693 -37314 -27293 -15440 -29744 -48044 -28428 -18601 -21852 -15246
15211 -15246 -6034 -4975 -13933 -16273 -5499 3595 -642 -14559 -19319 -37093 -53909 -31984 -18167
15198 -18167 -8808 -6885 2931 10400 7962 10215 593 -360 -140 6542 -1221 -16414 -14646 -3291
15184 -3291 6360 12252 12577 1660 -26532 -48438 -54851 -34482 -19045 -10476 -36167 -41046 -38930
15171 -38930 -24591 -2649 8369 15222 23254 20129 24865 15350 18739 14421 2375 -3437 -18917
15158 -18917 -14373 -14485 -25009 -25321 -21545 -26923 -26844 -13630 1818 9843 6368 -703 -19373 -10135
15144 -10135 13476 26910 37155 48821 35302 -721 -3659 7288 -2969 -232 1679 -14539
15132 -14539 -2163 -14739 -20389 -13520 -30881 -46344 -31495 -10651 6141 8393 3100 -17688
15120 -17688 -25454 -23428 -8142 3897 1459 -480 -721 -4522 -3026 -3078 4542 1776 -787 1966 -2570
15105 -2570 -3659 20501 26995 33068 34866 -5210 -6454 2035 10654 14774 6504 -11401 -19506 -12713
15091 -12713 9233 16250 3269 1375 979 -4817 -6750 20851 43204 53694 34163 10418 -5664
15078 -5664 -10700 -43033 -28621 -14747 -24643 -22991 -6542 4155 2694 -1664 16777 20571 -8797
15065 -8797 -23734 -15209 -27957 -24367 -4583 11986 11416 -15268 -38220 -52234 -42137 -38283 -41219
15052 -41219 -18900 -3340 -1507 -4493 -18076 -17050 -23236 -21943 2876 766 -8992 -9947 -11201 -4912
15038 -4912 -9031 -8195 -19027 -33097 -21915 -16396 -10508 3172 8567 -5611 -8687 426 -18713
15025 -18713 -36779 -20858 795 13603 12075 10366 -10525 -13269 -26677 -6555 18970 20170
15013 20170 16850 -3051 -3330 11469 17766 12717 3227 -6090 12075 34256 40623 42099 41467 39837
14999 39837 48373 73990 120208 153381 196212 272268 376438 540554 769962 1115822 1667879
14988 1667879 2637874 4074612 4750923 4076539 3211560 2403431 1527266 931174 607831
14979 607831 427169 323960 260576 229044 209205 189404 163158 146216 130110 116851 118675
14968 118675 93259 68619 65936 57804 54389 58238 52045 39148 40489 31680 23491 16463 14576
14955 14576 13773 12446 20034 20813 20201 15577 -20672 -27250 -25440 -28364 -27388 -20012 -24949 -16447 1024
14940 1024 -954 -528 12476 3406 -11339 10314 14198 2795 -5579 -20813 -23003 -26664 -6557
14927 -6557 4883 -14613 -6028 8680 -709 -8674 6700 10806 12188 14054 11817 17287 226
14914 226 -11784 -19643 -30626 -46893 -32793 -3706 2746 9354 -358 6030 21684 4828 -9216
14901 -9216 -18537 -18690 -17038 -9708 2867 5330 1576 8275 -10497 -25676 -12388 3557 20406
14888 20406 32860 37777 34287 39333 28304 8550 -10376 -18781 -2548 -3724 12780 16735 -2623
14875 -2623 -10041 3370 -4242 -19179 -27127 -24146 -18451 -14000 -18544 -20959 -26022 -16844 -17858 -31272
14861 -31272 -23478 -5756 -9787 -14397 -12693 -21101 -23263 -31149 -29714 -14875 -1398 -10500 -15440 -9909
14847 -9909 12938 25289 30361 21400 16920 17611 17412 6462 -10572 -27196 -22269 -18929 -30607 -41121
14833 -41121 -37898 -14857 -12279 -7919 11428 9799 16200 6525 7949 7932 1259 -3015 7546 16653
14819 16653 -2716 2600 12916 18057 29807 27872 3521 3082 17675 14145 -304 -11249 -21937
14806 -21937 -23925 -13595 -12535 -7987 -11086 -13638 -20461 -10602 -8983 -8458 -3477 -5747 11929 15277
14792 15277 8850 7726 -6413 -10102 9065 20011 26042 24747 17703 18043 5936 -14237 -13839 -24150
14778 -24150 -14297 -3888 6565 2539 4995 16524 122 3541 7634 4928 8939 26092 14989
14765 14989 4954 11156 10232 3438 -21070 -45097 -39749 -21614 8272 22577 9876 10011 58
14752 58 -16376 -32436 -31065 -31126 -38822 -45376 -36244 -34989 -41021 -34438 -28880 -33267 -32340 -36795 -32422
14737 -32422 -14514 10473 -4560 -20024 -22405 -24827 -5033 4857 7200 7756 10582 4011 -3584
14724 -3584 -8972 -12480 -33328 -28320 -22972 -30418 -21496 -12187 -19356 -25178 -14128 -10394 -5397 4482
14710 4482 -6329 -13338 -14175 -11547 -17322 -16947 -14274 -28301 -28591 -11237 7084 16060 5911 -2645
14696 -2645 -8272 -28384 -26245 -7894 -10324 7206 22114 20845 7971 1107 13363 4168 -24924
14683 -24924 -21287 -10253 -1217 -6052 -19673 -6777 -2389 -8917 -19533 -13691 -8931 2753 -8253
14670 -8253 -12160 6131 9995 -13603 -21712 -29530 -27453 -17309 -17233 -20662 -16508 -200 -3033 -7178
14656 -7178 -12327 -14980 -12116 -23481 -41473 -15432 -1799 -2576 18391 22263 12243 -1523 -5499
14643 -5499 -8471 -8744 -12098 9375 21308 27348 20495 -6164 -22065 -21620 -15741 1166 -5168 -20353
14629 -20353 -16326 -7500 9414 7163 6842 18361 11242 19900 24378 12604 -9422 -15975 -2691
14616 -2691 2930 10462 11799 11045 41947 24457 12746 25800 17400 3620 5539 3925 13728 3311
14602 3311 -7033 2030 17108 21473 11084 7846 17528 6892 7034 20304 28232 15701 15603 -5192
14588 -5192 -9286 -22014 -25007 -15763 -13415 -11044 -18982 -6138 9834 10262 2037 -9003 -3445 1008
14574 1008 -7055 88 3496 -10620 -4075 -6291 -10754 2396 15584 5907 -10957 -7444 -5957 -1691
14560 -1691 -1912 13416 9428 6388 1817 -39 -1580 14689 31238 5525 -27886 -36593 -12647
14547 -12647 5983 -4585 -13607 -6159 2252 4183 -8814 -11175 5444 3622 13583 19008 20733
14534 20733 6680 -5902 1791 -11281 -11868 266 11179 -437 -19612 -13714 -10796 -12774 -11481
14521 -11481 780 18351 35006 32128 24028 1955 -5353 3245 10967 24303 12661 7343 16961
14508 16961 -7026 -16414 -12538 -34920 -24327 -14037 -14475 -14079 -2776 5015 10453 1689 3255 -5820
14494 -5820 -11573 -8160 8771 6444 10886 18305 22943 19438 17130 16610 17262 30971 21571 4057
14480 4057 -5610 6034 24285 35882 25539 3320 -4642 -161 -10820 -30244 -16071 1317
14468 1317 9280 -5528 -11080 -11643 -1920 13220 10391 -6794 -19687 -24163 -33704 -25742 -12120 4382
14454 4382 150 10120 9436 4084 -5815 -12631 -10473 -16957 -25803 -8109 -4588 -2348 546 16970
14440 16970 27821 21927 45278 43253 40737 48011 56281 55557 29715 15855 28977 38691 40906
14427 40906 23253 9294 6063 28244 29565 13808 9814 16879 34364 33766 35800 33025 28214
14414 28214 28747 31261 18056 16795 15766 14080 40004 53174 29343 14627 2529 12945 11781
14401 11781 7311 -1792 4130 6046 5123 3372 -10218 -12126 8664 7441 -893 5922 25520 40840
14387 40840 45497 35367 32984 33773 30359 22267 25534 32891 24469 21776 17120 -8936 3282 20032
14373 20032 15727 1136 8874 25821 23394 25641 28908 25461 19671 9814 9014 15424 31416 29290
14359 29290 30996 30386 11678 10648 37785 30005 22419 18682 24436 34072 39417 40616 31515 34021
14345 34021 29910 22043 12463 3276 2196 -8870 -16105 -2680 1894 -1051 13153 14007 -7589 -19376
14331 -19376 -16042 -19974 -32695 -27364 -18860 3462 19667 23732 30238 16134 24124 26981 20803
14318 20803 32303 31194 30894 18892 20729 10183 1918 -3892 -8911 -10207 10038 20965 26141
14305 26141 35997 46795 53633 51100 41515 32991 45579 22255 1754 5868 24692 26671 24559
14292 24559 16950 4678 12847 26813 16305 -16206 -17983 6675 11253 19798 20222 15405 4635
14279 4635 -11757 -107 16577 -3992 -17184 23922 42050 35867 30956 29596 45507 48543 26946
14266 26946 18553 14072 12191 8419 17144 13731 8143 -1840 -1131 -24958 -45413 -21437 -6308 13630
14252 13630 15849 16412 26083 24486 32032 26099 -1514 -23532 -15533 278 11482 8180 -5216
14239 -5216 -11777 -614 26864 30604 37527 44993 26949 19124 22985 20479 -8983 3070 9464
14226 9464 -11191 -848 9497 6252 3982 -2533 39 4384 -5175 -11245 -6746 -2812 1650 8102
14212 8102 32371 60321 53348 41317 18626 9039 15139 15101 2511 -72 15884 12025 2391 8405
14198 8405 27686 8761 12133 18398 24941 17622 8586 16684 -5528 -10297 -19338 -19900 2964 4205
14184 4205 -18236 -4062 19295 5750 11190 17574 28372 28482 32999 23930 6697 -4103 -16165
14171 -16165 -26299 -11775 11331 21548 10449 35707 26838 7878 2183 -10964 -14212 -8422
14159 -8422 -1917 23904 27989 29967 16831 -772 -925 -8414 -27487 -43685 -38428 -33362 -36016 -36995
14145 -36995 -29702 -28022 -29611 -18782 -1188 14092 25116 32680 33799 43570 36593 42020 67024
14132 67024 59365 38486 20618 22044 36422 49047 25845 1071 -7295 -930 6799 21657 19262
14119 19262 3080 4921 4249 5344 1359 -748 -11946 1927 -4167 -2408 3933 21290 23236 21045
14105 21045 10158 -6728 -9020 -3962 2066 9229 7090 -7247 -10387 -4585 -20819 -31661 -21574
14092 -21574 -8498 -3992 10842 20425 23964 12341 28052 35018 29659 27465 32892 30338 19171
14079 19171 13207 15010 5275 -12997 -18134 -5560 684 4644 -1255 4258 27707 28224 12980 26701
14065 26701 41682 53176 57759 40798 15397 19955 25071 27276 20990 20659 32290 37493 39289
14052 39289 33163 24810 23505 13494 20071 43804 56078 75487 75590 54006 43157 50576 28103
14039 28103 29059 26774 21614 6430 8294 19583 47191 41304 43093 52398 62012 64257 63022 50771
14025 50771 30632 23211 20638 27178 15504 -1927 2923 11630 9614 8301 -7941 -15563 1335
14012 1335 19924 23020 33886 34972 24037 16864 48619 63883 41243 37090 27329 15199 21701
13999 21701 19589 14317 19336 15941 26302 13863 948 2178 14236 12843 4930 -1748 2853
13986 2853 11866 17273 14323 9155 21318 35752 50414 60909 45370 29624 33914 32995 27921
13973 27921 30933 23756 25927 22786 30679 48833 50150 31010 39346 60521 67060 66282 62369 66678
13959 66678 81724 87534 94570 82906 54522 51245 54955 63797 91792 106883 115649 126271 114007
13946 114007 102992 96218 82833 71731 64420 71627 87117 91802 97880 91589 82942 79787 105193
13933 105193 98721 98786 97025 87359 74731 64789 67345 63557 82990 80978 84163 73193 55485 39141
13919 39141 21669 18584 19328 46867 70306 68794 77938 66075 35219 37917 31720 41596 55723
13906 55723 64566 47506 58835 60565 54590 40656 43195 66175 61373 38701 24149 13622 16448
13893 16448 15450 19166 24814 28610 34206 26635 15163 27536 28448 22230 15725 1627 -13126 -6217
13879 -6217 8095 19616 17976 30602 45241 40835 40941 39026 39914 35592 15722 -2813 -856 -4730
13865 -4730 -6353 -119 -12008 1810 27093 22734 11742 677 6948 -6256 -1217 5055 15315
13852 15315 32437 25875 29770 30795 14190 -8098 -18654 -1545 22864 32373 35155 28082 24638
13839 24638 25320 45206 43454 25521 18650 -9196 -18225 -10678 -3226 -11279 -9889 -5875 -1074 -1531
13825 -1531 7916 14682 25489 29754 32568 37527 35673 30112 34941 31988 16740 21429 38039 26744
13811 26744 11370 3746 3267 3774 7009 -1340 -2087 -7289 -3219 10248 19081 9495 9639 32786 42563
13796 42563 56547 47516 20087 8182 17085 3953 9386 33156 34867 -220 3382 16085 38382
13783 38382 20448 18976 22073 5585 -4541 21401 32784 16559 5579 5833 9219 30799 50097
13770 50097 41219 27319 11874 -701 834 10386 29497 37853 52864 61204 31949 36336 38985
13757 38985 21479 21428 13587 22204 26546 10298 -4362 -6128 -997 12289 10704 18005 34032 21805
13743 21805 19517 14399 -2646 819 18535 19419 34268 23673 20335 17696 9215 2375 5992 5024
13729 5024 5835 2204 -17167 -21038 -14248 4753 24941 20126 15105 2945 99 -12003 -17561 -3558
13715 -3558 -11342 -19937 -3845 1940 -11993 13373 31452 23924 16224 8196 9131 23591 30799 13947
13701 13947 -6812 -13073 10926 22394 13522 3680 9510 46395 68343 64695 42901 21285 22656
13688 22656 27202 28536 31371 29257 26619 18229 25888 23151 20817 16678 5000 13405 29280 21535
13674 21535 9079 20381 27015 42952 13408 -356 7596 23219 25089 15017 16491 26434 32656
13661 32656 21847 25851 23272 3971 17364 28495 15020 26310 41042 32690 40121 46861 56233
13648 56233 59459 59568 51766 50069 46237 58197 61296 43990 17641 7295 6440 13727 23128 10555
13634 10555 6238 2449 -5636 -8649 18706 12375 14655 30521 41993 31057 39886 54861 65230
13621 65230 65476 63922 50643 45102 39574 35327 44279 40115 41383 32879 15531 30753 48365 42240
13607 42240 49100 58636 42687 61484 53729 50410 37612 27975 40310 48550 34966 33597 39677
13594 39677 45324 47075 58491 37972 36343 56350 46336 35116 24351 22172 22648 20479 11087
13581 11087 11129 3247 -406 4695 19528 41892 45281 53269 36104 27639 8718 722 2299 123
13567 123 21566 49465 49468 38706 32590 29011 38907 24601 19769 15449 27468 49546 65590 85101
13553 85101 84140 70378 77090 78949 70058 55739 48461 46441 38320 34942 43592 36911 40616 38982
13539 38982 21275 15650 16139 17657 28370 35143 39306 38241 28738 42846 42991 29356 41493 46883
13525 46883 52818 56616 49346 49941 48043 32504 30417 49008 44863 56832 50962 37846 37647 37509
13511 37509 35550 42513 48961 45043 48228 59617 58255 55560 49307 57908 54894 40938 40370 28730
13497 28730 15145 36468 40143 40325 37513 49133 50933 35750 33780 38459 35152 31341 36045 31042
13483 31042 19840 12929 20572 31095 41824 36108 37084 43688 53525 54880 56366 47210 30312 16100
13469 16100 -5044 3015 29458 49166 59570 51215 42077 25696 26586 26084 50831 53859 32769
13456 32769 13912 19001 34249 39182 25930 13202 13055 12526 9714 10470 1150 16598 32557 52853
13442 52853 60389 48273 21212 31065 48321 36328 23408 19461 37940 59933 35277 22180
13430 22180 23718 28371 44771 29757 24892 35072 35248 28453 5840 8318 35610 38992 34753
13417 34753 37698 47377 50654 57631 59063 60163 42173 25086 25993 61811 53015 57510 48987 53987
13403 53987 56265 40435 42017 53756 49381 55718 64070 72489 67678 61280 46077 36350 32136 34492
13389 34492 46296 60505 60239 52198 66148 61465 38226 17262 24651 32273 26532 50477 47951
13376 47951 56885 77224 52718 13002 -925 4633 24403 45530 62777 59342 57355 56873 48668
13363 48668 60964 45757 27993 34681 48646 62740 70714 89482 94928 81715 66156 57802
13351 57802 64723 68236 45861 44260 59652 69883 67006 67509 56753 63693 62987 57033 60136 63590
13337 63590 85537 94534 85002 88365 100246 106023 83925 59869 48657 50795 82229 67644 53483
13324 53483 72230 74449 74083 65508 52084 52872 52635 67078 72764 77253 90045 95850 83146 72099
13310 72099 71226 80025 89575 87076 96943 104609 105692 87769 61321 49261 62062 58174 64274 81960
13296 81960 69437 70647 99517 102245 87501 68913 69234 68237 82130 82298 87576 85379 77019 74015
13282 74015 60640 52618 63100 72948 80100 74109 94174 95766 96033 95796 92683 104317 111105 120378
13268 120378 139853 136854 134035 129604 145828 155836 153374 131544 112320 103849 106703 120015 143571
13255 143571 164094 154706 175711 201069 234848 296511 368939 499836 671381 890934 1241445
13244 1241445 1757630 2328060 2716869 2842265 2627901 2120038 1602675 1172841 814272
13235 814272 577429 446976 357116 304234 266111 239544 197735 206085 201297 185825 166428
13224 166428 168992 162297 167433 153559 138312 125849 126943 124458 123114 107644 104521 112792 100987
13211 100987 113900 122920 126421 128401 132890 149288 134076 124630 126625 124580 119419 108022 111593
13198 111593 108127 96098 101721 106396 104464 114210 108540 92367 87381 97609 108639 103462 77397
13185 77397 85731 96782 106454 108712 93788 97403 118523 138777 144174 156662 153718 158157 133556
13172 133556 120985 118642 117495 115384 113890 108033 116209 123760 132735 136546 132796 136947 130526 115654
13158 115654 95452 88036 89192 93829 117049 123971 122864 127154 136394 149565 142701 134516 115674
13145 115674 102695 101057 96401 107466 102996 95955 87148 88349 88186 92809 94500 113003 122671 124660
13131 124660 147973 166546 153599 151479 155445 156136 147356 124812 109954 111591 122758 111813 100610
13118 100610 118726 124181 102797 113308 139890 152789 144024 116984 112249 115089 128048 133122
13106 133122 135583 116812 116880 105434 97147 102822 94117 92390 105262 114598 106056 97168 88914 99482
13092 99482 115452 131285 150365 153458 147159 148642 145567 139254 138905 134878 116438 110972 123318
13079 123318 144489 152783 138060 134082 166361 181413 192137 187812 189863 208804 211958 192668
13067 192668 195903 201279 190506 203586 233314 250299 293992 352575 438206 521083 564819 572353
13055 572353 525068 473131 405123 320835 269170 246770 224082 218385 219797 236925 214130 204332
13043 204332 207417 216446 194276 170512 163982 162492 138261 151447 170012 176633 179122 184464 196958
13030 196958 197675 203573 203572 213376 230042 236819 232809 217732 238010 239954 255385 263141 257199 247104
13016 247104 231702 233084 233371 211618 200553 220503 271426 288610 280377 267167 273219 289095
13004 289095 295297 290594 288793 280760 271032 261890 245117 241562 225167 215763 220245 222454 214986 198603
12990 198603 182828 170631 174134 202332 205636 221803 249410 253631 243829 235619 222954 248045
12978 248045 272215 266203 259286 258124 274610 285107 291044 298487 323941 336592 358577 351315 331352
12965 331352 310079 291148 285718 278238 283704 298766 301055 314921 323746 336326 367678 381586
12953 381586 378682 370796 361900 344795 334591 333344 319125 312969 311007 308297 300094 326045 347135
12940 347135 384260 451468 506108 585257 646955 679362 712699 743232 764215 761752 752408 720749
12928 720749 640330 519024 427430 390351 388056 398745 412397 420589 413325 411473 419701 428235
12916 428235 436736 434393 448077 470839 511067 546385 572863 603904 615074 628764 650944 672741
12904 672741 655624 637620 617313 591063 580062 563600 545183 544258 578532 595179 594105 588220
12892 588220 610208 616176 613883 596335 577885 566805 580678 601917 625183 662541 701346 719743
12880 719743 730280 731276 729107 736695 753144 794428 822353 825208 830399 866388 893613 902108 905610
12867 905610 914862 916697 949750 1012507 1079903 1140931 1182627 1213939 1191582 1183400 1186357 1192293
12855 1192293 1188022 1171744 1207827 1250154 1301290 1376472 1473161 1551138 1596037 1638104 1707451
12844 1707451 1796232 1910706 2066585 2226633 2362813 2491714 2595859 2700273 2811153 2902084
12834 2902084 3053191 3252001 3484264 3750965 4062909 4412932 4805427 5223498 5715331
12825 5715331 6331875 7097753 8093744 9330006 10705799 12109343 13557452 15130847 17105072
12816 17105072 19847257 23815952 29495116 37456486 48372211 63308919 83903766 113194795
12808 113194795 156842919 225593604 328921219 438706174 506347977 525591297 480260225
12801 480260225 383998611 287494790 204873054 139576657 97504494 72630819 57047678
12794 57047678 46358740 38397443 32257349 27437039 23561650 20338839 17701250 15530256
12786 15530256 13745945 12311946 11109882 10082968 9200637 8420562 7726928 7105094 6544261
12777 6544261 6058350 5667950 5308652 4979818 4707042 4425271 4138290 3891546 3687715
12768 3687715 3522074 3435129 3441180 3537653 3714978 3865299 3903879 3806160 3582908 3286034
12758 3286034 2990375 2750023 2602892 2512950 2462129 2458408 2491728 2522203 2483302 2387831 2224461
12747 2224461 2038639 1865670 1714160 1618698 1578242 1562213 1526457 1486807 1466721 1435749 1402746
12736 1402746 1392139 1412631 1440165 1493118 1549794 1646577 1762512 1917064 2137330 2478218
12726 2478218 3015288 3886632 5251920 6525537 6591416 5753504 4825825 3860142 2955421
12717 2955421 2338582 1971273 1751134 1613025 1526528 1447041 1390805 1363798 1337327 1322595
12707 1322595 1296901 1249540 1233265 1212149 1181774 1188785 1201077 1197822 1193628 1197175 1196140 1176638
12695 1176638 1173866 1187100 1231636 1278061 1302876 1312888 1330008 1342845 1360967 1397663 1412330
12684 1412330 1446404 1492872 1520647 1542726 1555912 1495413 1396743 1324152 1240008 1167916 1176451
12673 1176451 1185145 1181308 1185158 1211080 1257592 1294123 1318748 1360417 1358215 1337754 1319754 1304953
12661 1304953 1300375 1267153 1251262 1261500 1278772 1261083 1248119 1254387 1259031 1269550 1290115 1306105
12649 1306105 1309080 1326045 1326551 1347726 1368945 1377449 1397910 1404739 1391279 1402342 1393510 1372508
12637 1372508 1369919 1388268 1411770 1462744 1506677 1530355 1524509 1506462 1505392 1529840 1549956 1579826
12625 1579826 1605160 1630550 1651045 1648781 1666003 1701467 1722450 1747298 1784863 1797572 1789746 1792286
12613 1792286 1809158 1837559 1857949 1856294 1871659 1884508 1879938 1878522 1883980 1886641 1893330 1921689
12601 1921689 1953770 1987880 2025984 2063584 2105106 2135505 2165626 2184075 2215629 2247779 2276343
12590 2276343 2321183 2369884 2404579 2444422 2481118 2519097 2548840 2575435 2619805 2670262 2711483
12579 2711483 2750026 2784456 2847912 2916478 2981008 3041994 3100484 3162626 3200443 3247057 3303013
12568 3303013 3352959 3402063 3466347 3522837 3564478 3617133 3690032 3749388 3827842 3926285 4016509
12557 4016509 4101381 4180526 4257595 4355823 4447254 4561961 4679050 4790475 4890786 5012448
12547 5012448 5112899 5193808 5319775 5452428 5598757 5713903 5836796 5983203 6145607 6307362
12537 6307362 6481523 6640445 6806990 6992858 7196331 7409726 7634660 7849287 8064639
12528 8064639 8318149 8585886 8834345 9105461 9403692 9705586 10012427 10339278 10695949
12519 10695949 11072037 11428232 11765938 12098631 12468651 12877157 13305871 13763348 14242092
12510 14242092 14742472 15250640 15777263 16338966 16944010 17556554 18184834 18842702 19525311
12501 19525311 20201283 20893249 21642218 22418772 23231530 24031570 24830417 25666635 26539757
12492 26539757 27426530 28312907 29203151 30086893 30950208 31802512 32637226 33438789 34180039
12483 34180039 34901142 35569254 36163931 36685392 37144386 37536617 37836805 38055319 38177398
12474 38177398 38194185 38120083 37973273 37738895 37403993 36969287 36431046 35866396 35217316 34514103
12464 34514103 33796033 33039356 32234558 31392970 30519965 29634925 28781705 27914477 27050189
12455 27050189 26201579 25371729 24544142 23733876 22933337 22150029 21373062 20624475 19927356
12446 19927356 19253144 18584420 17937592 17317144 16725302 16146386 15582033 15062885 14564927
12437 14564927 14071190 13613082 13158343 12721373 12322787 11929876 11542605 11176899 10836987
12428 10836987 10504121 10168178 9836659 9545388 9269298 8999483 8723644 8449213 8198041
12419 8198041 7971095 7760551 7551605 7328267 7129968 6931026 6739516 6575117 6422170
12410 6422170 6255353 6091798 5922111 5758380 5621351 5497555 5363121 5240100 5122314
12401 5122314 5010771 4899793 4771489 4674942 4591374 4481519 4372937 4281410 4198541 4117704
12391 4117704 4013113 3909694 3814954 3737192 3678021 3622471 3555434 3506203 3447238 3381880 3332754
12380 3332754 3279331 3218746 3162209 3104395 3056635 3006410 2968176 2932105 2883951 2856635 2833810
12369 2833810 2807469 2791522 2809648 2836650 2920825 3063248 3271317 3643762 4172436 4692378
12359 4692378 4972241 4965296 4596862 4040791 3516484 3068776 2728365 2490748 2335746 2223030
12349 2223030 2129179 2060164 2013896 1989826 1932917 1863386 1810599 1780756 1759472 1738141 1711476
12338 1711476 1691314 1674914 1640260 1597982 1575448 1558758 1537294 1533128 1507875 1476804 1443045
12327 1443045 1438833 1424860 1398794 1371268 1344155 1334424 1321592 1311301 1288213 1265622 1245051 1226942
12315 1226942 1217375 1188982 1171586 1134939 1116937 1119236 1142075 1126650 1097849 1078960 1067108 1066522
12303 1066522 1063692 1045302 1022246 1018960 1028570 1032790 1010684 998942 973473 949414 968153 967785
12291 967785 945499 926400 919595 913486 894040 891554 894517 890603 886177 879928 889560 891985 860622
12278 860622 828619 833207 831722 828690 824303 787826 763194 752139 754085 758243 754885 753863 729441
12265 729441 729053 735170 729263 715649 706698 689825 676191 668517 673824 668599 662315 646147 641171
12252 641171 637990 638573 641693 648307 631938 614415 605124 605502 619529 619652 595341 578904 568261
12239 568261 564250 555575 535994 531708 553601 569385 567712 564733 545089 532489 532006 532146 540029
12226 540029 533690 519513 517881 504807 516737 520401 507408 487324 486573 511045 511572 502468 494285
12213 494285 485922 483856 480018 468332 442574 429294 416057 420792 422988 414620 410352 431540 445826
12200 445826 439432 422495 400091 394497 400781 402606 402905 414973 414373 420758 404113 391066 379409
12187 379409 367098 370124 367331 358179 373117 394855 417156 415554 399215 400164 399683 392532 385573
12174 385573 384834 381164 358001 348294 353755 360519 356060 336716 327342 339096 338567 330224 328652 344098
12160 344098 356105 352352 357333 328685 299428 306434 310799 298599 302305 309050 303008 302603 320599
12147 320599 332863 313640 294518 307743 325058 331210 328535 327019 313692 301611 305869 300936
12135 300936 302619 293166 287202 290520 288971 285990 283969 287618 292520 289735 273045 273566 258147 255554
12121 255554 250025 238600 239999 232289 221311 234672 249730 249379 248566 244046 239361 239082 246445 260725
12107 260725 257312 257619 244956 223137 216628 217674 218714 223397 220755 233583 241775 242182 238443 244910
12093 244910 245313 227477 220442 229285 233208 233124 226245 242794 221156 219921 229180 245481 237911 221974
12079 221974 209367 198306 192350 195369 187118 182131 182239 199802 200492 197639 186093 186652 198298 184784
12065 184784 161191 173450 171921 169671 174410 189068 182017 166304 171614 171750 183793 205710 225251
12052 225251 219358 173730 163967 176266 169128 166104 161226 169690 175871 182628 205463 213902 189514
12039 189514 191580 197816 197571 178775 143681 164992 178645 142870 122037 139654 159689 146093
12027 146093 146659 154939 149067 132921 144701 144331 138948 118701 110920 120786 128824 127231 134859 122729
12013 122729 125582 136021 137837 160786 152725 135034 134048 133468 124031 126908 128095 112607 104224 124703
11999 124703 136325 147498 144946 149636 144086 141162 117341 124193 127733 122368 102284 95581 98075
11986 98075 103619 120775 114928 113440 120041 116636 100298 97305 107067 113007 98399 77155 76134
11973 76134 77050 73535 77053 86289 76166 81443 88958 104070 108965 103560 110956 89964 86694 80014
11959 80014 74172 81434 86841 84199 98862 88764 94549 110102 121444 114230 95810 99998 100118
11946 100118 101042 115937 103703 102817 103321 95442 84082 74752 77973 94389 112023 114898 122826 113233
11932 113233 103065 108009 101150 92313 82796 80052 99194 109526 98512 82941 88946 112071 92685
11919 92685 62590 56959 62868 73384 73910 66354 70117 72897 90756 116032 119361 102986 98184
11906 98184 113283 101119 87647 86469 98355 83721 86027 89090 94894 103168 114000 133082 135678
11893 135678 113846 89884 82543 80037 76157 74019 73720 78462 52980 28009 45425 77372 87998
11880 87998 106654 89078 72289 55906 57516 76862 59447 53513 43497 37413 50862 37182
11868 37182 50105 65208 85493 99928 84060 77369 93886 104732 98542 108512 113810 109486 109939
11855 109939 96265 94476 78967 70885 69353 76533 72974 76293 88508 84976 85885 78445 70885 80692
11841 80692 90121 77190 58281 50792 34267 32272 30031 35181 30497 33524 19247 23415 22784 31368
11827 31368 30037 45837 43151 32025 22207 51030 65679 74049 85783 84165 82104 84565 86274
11814 86274 65349 51908 55706 66857 71108 62306 71186 66491 46481 42437 60647 59666 54002
11801 54002 57605 45841 38353 30735 31813 46370 52172 68064 71459 76675 59799 62829 56929
11788 56929 34187 28748 46195 52465 55955 46651 37352 43122 38843 33802 24617 6866 17233
11775 17233 20159 28584 49209 51433 41084 15500 10363 4098 21468 42686 39583 24518 12887
11762 12887 27926 51991 54269 52334 57759 64049 67888 64555 79413 68325 39620 19768 8814
11749 8814 19586 32841 45047 49359 34965 49535 67409 76173 64314 40238 29403 42067
11737 42067 45806 45676 33468 35934 31673 32536 39618 59312 60969 41317 42285 35744 24053 28705
11723 28705 33278 32129 38629 41033 44024 57006 55750 48296 39606 39173 61397 67929 48258 32208
11709 32208 24843 32583 35306 21716 15980 28382 30952 195 -5254 3330 -11241 -9164 13162
11696 13162 26323 37124 32496 25664 4668 -6117 -9368 -3738 15338 25271 20897 27026 39161
11683 39161 40282 48235 45109 50388 45418 40431 44478 39486 37341 38022 31208 26998 33495 21597
11669 21597 24155 44039 41544 36326 39976 66558 44397 21641 26051 9265 -3024 -1452 15626
11656 15626 18703 44573 62775 59109 26862 -8865 -4935 30103 46086 39369 46713 53681 61284
11643 61284 59708 52854 23876 22221 25061 31799 17802 10622 10040 483 2529 31828 36112 51230
11629 51230 47425 29634 21216 23558 33437 40073 42054 28867 3637 -240 21217 39357 34044
11616 34044 45292 48942 51833 52791 35093 29732 33547 18104 2599 7818 26959 23604 39880
11603 39880 58930 59141 58662 56833 22915 13213 31146 21773 13732 25419 24648 28834 51810 56447
11589 56447 48604 40653 42955 33056 16384 19296 12096 13915 13098 -15829 -9759 33159 41836 19039
11575 19039 16706 29784 39384 36651 22719 28135 24418 16820 19801 24491 11498 20675 25164 40923
11561 40923 22068 13657 22274 27918 31080 34867 39661 34202 22562 22304 17344 13612 12518 16169
11547 16169 3712 -11015 -10386 10980 2357 3841 -13249 -7888 2618 -9415 -16248 -6040 20004
11534 20004 33476 36791 33685 19481 13295 19956 37847 54892 23184 8122 2182 3877 4225
11521 4225 21253 35194 28202 32478 36487 28678 14396 6512 -3880 11796 19647 24937 32126
11508 32126 35874 46747 33891 23314 14610 14411 1692 -6051 -5828 -924 -792 -7683 -12879 -4282
11494 -4282 -10360 7923 137 13392 27638 30362 11121 12780 5028 -6788 -1162 13431 27324
11481 27324 32566 24488 29237 19977 20973 35049 47436 42682 29272 34143 45267 35966 26821 11550
11467 11550 15528 20166 24365 27117 26994 24780 23883 23949 40127 42307 39223 35215 13487 2850 173
11452 173 9181 6657 15083 -892 -11179 -1016 -3969 519 3746 16960 23144 25133 32359 44574
11438 44574 12459 13657 44030 41528 36943 40856 42282 11267 -1173 11662 21866 26973 22732
11425 22732 13076 24317 40319 29015 27936 11388 -6149 -8798 12699 29212 193 3852
11413 3852 27513 19358 5308 2241 2213 17233 20989 28724 29827 14670 -8539 -175 10832 -2775
11399 -2775 -6636 5939 36434 50942 33360 24358 4690 -20283 -5156 20925 28160 34099 20667
11386 20667 6688 22797 35704 21396 3248 10866 14437 5374 14379 16984 17750 4518 -3087
11373 -3087 4789 7913 15005 14147 11817 11680 6693 2441 13101 20143 21936 28592 1529 -15421
11359 -15421 -129 16757 37612 46790 35653 8026 7424 12173 -8956 -26249 -16996 2033 9798
11346 9798 6449 -1981 17198 40074 27232 12728 9803 17842 27450 15410 -15339 -12468 13754
11333 13754 22326 38162 32963 45212 52992 49364 52255 60765 50115 42580 55848 41377 19436
11320 19436 6621 8249 15438 25367 33796 36757 19806 15435 28079 28555 32170 17944 4205
11307 4205 3717 -4735 -544 14710 7058 10268 14171 23535 10727 17050 24069 22014 13228 20603
11293 20603 19952 3667 1175 14082 9781 14245 2551 -17510 -15400 1036 -2770 -2643 -16088
11280 -16088 7284 21138 1392 -13088 -7636 -1353 2105 21236 26062 23437 40408 43734 29649
11267 29649 31902 41773 58412 75714 92594 101679 106968 114356 93948 76110 67687 60756 37933
11254 37933 13839 16661 7205 10338 1066 14942 23442 16876 8963 2479 6372 -10215 -17496 -16523
11240 -16523 -14828 8285 29465 28887 21233 12309 -5731 -5934 -3388 7649 -5512 -5745 3087 6785
11226 6785 8437 10307 8211 17968 29848 17569 13123 11370 12554 14404 11639 -274 2169 23484
11212 23484 40383 38217 32908 28439 8029 -4871 794 3511 12793 20456 29264 43952 50537
11199 50537 38174 17733 4199 4940 17662 22319 12837 11764 3539 -3949 -9181 -4106 18561
11186 18561 42850 37840 14908 4318 -5386 -1646 14373 20842 22520 23071 28458 29286 5245 1574
11172 1574 -1409 -11139 -13827 -2313 24079 52552 93545 111211 102442 103227 128823 153737 137944
11159 137944 97325 58931 29207 5220 -15555 -21672 -20709 -14729 5157 11174 -1459 -30170
11147 -30170 -25077 -661 -12824 -18402 16640 36781 21863 14085 28037 1261 -12093 -15619
11135 -15619 -9732 -7730 -1424 21917 17801 10884 -3580 -21025 -24072 -11979 -8192 -7929 -1382 -3284
11121 -3284 -8864 -28475 -32226 -18814 -16817 -17007 -22114 6694 23266 3631 -12912 2807 17041
11108 17041 10885 2470 -7139 -7741 4846 22576 22235 20796 22596 11804 8673 5959 -11200 -3006
11094 -3006 -642 13439 14307 6242 -2405 -3463 -23944 -37358 -38682 -14074 -11418 178 16858
11081 16858 14865 13511 -12655 -20712 -22823 -2228 -6501 -6863 -9696 -27266 -31990 -12138 -4007 -21518
11067 -21518 -31604 -8751 5993 5141 10116 -9057 -19416 -2027 27998 33715 17019 8643 10644
11054 10644 18758 11801 -3132 -6250 -14403 -13864 16736 19443 10568 6983 15491 15328 8286 13061
11040 13061 29480 20404 -2415 1739 9444 17609 12079 1591 -1159 3598 -9970 -9420 -7375 477
11026 477 5416 3309 8178 17811 17550 -3451 -18420 -11414 -1938 1874 -13236 -26390 -13104 -13363
11012 -13363 -21723 -12446 5794 4704 4832 11012 20000 8337 2629 3265 3967 9602 10070 10417 12162
10997 12162 -1091 7462 16082 31649 30109 22692 10178 6892 -5606 -22591 -23793 -8459 11811
10984 11811 16042 23262 31225 13039 -188 -8547 4414 1124 6956 -740 7255 -8280 -18811
10971 -18811 -2042 2531 -14374 -12087 -17958 -12029 3669 22437 1570 -9768 -27798 -21173 -4193
10958 -4193 -3957 -3929 -3931 -8526 -17856 -28689 -31355 -22570 -22367 -12942 -4742 -3892 -13949 -16550 -25906 -22456
10942 -22456 -5866 -2853 4825 9300 10876 18141 -100 -19586 -16424 -32817 -18833 674 3114
10929 3114 4770 15776 11030 10653 27265 8760 -13281 -15383 -984 15072 19756 26910 41586
10916 41586 46385 17852 -3882 9842 -8375 -2812 6155 -1669 -19740 -36400 -53173 -43595 -13457
10903 -13457 -7791 -17785 -18171 -10459 -7148 -18078 -24776 -22182 -21142 -15604 2825 5934 12616 17924
10889 17924 8065 -6895 6996 5103 1353 1936 12857 18336 10338 765 339 -7463 -6683 1161
10875 1161 12862 19174 18839 8679 -2684 14912 26255 24472 36077 35826 12371 -1093 -7528
10862 -7528 -24243 -18252 -2345 6877 -15620 -4531 12832 15316 13633 1333 -10885 -16829 8452
10849 8452 26901 41997 30819 12859 -4534 -6998 1979 -4109 -18250 -15638 -2717 -16103 -23009
10836 -23009 -8495 -5362 -11646 -20727 -25132 -23904 -9777 -5129 -11350 -6501 -16261 6802 24745
10823 24745 29465 19233 23054 -172 -16181 -1716 19834 9898 4202 10881 1157 -10085 3964
10810 3964 15658 10570 7806 8600 802 -7480 -1987 -13909 -20496 4295 6048 -13665 -15539 -21369
10796 -21369 -12815 -14830 -17433 380 10427 6281 3047 14449 11821 8131 2202 -17070 2891
10783 2891 24781 15829 4480 652 -6039 -3966 -16578 -16790 -2655 1657 19840 35061 38123
10770 38123 39959 42401 51700 38534 2207 -9419 -13826 -14621 -6434 -992 2615 28203 7529
10757 7529 -5548 -12320 -8222 14816 22419 8696 2030 -12148 -17717 -16492 -9963 4691 -244
10744 -244 -6571 22 -8515 12912 16139 2645 -17166 -18631 -26229 -26088 -6690 11149 12029 3752
10730 3752 10967 3999 -1573 -6451 6137 5340 1700 -6121 -103 -8583 -25367 -7975 11732 9745
10716 9745 -6758 -10833 -10749 -1758 3689 7642 -1042 -10660 -21512 -23651 -30453 -34018 -33309 -9190 -6137
10701 -6137 -19349 -23759 -19727 -2573 16217 20817 15497 22383 14858 1158 5905 -2273 9783
10688 9783 3751 27 -10149 -11109 -8283 -3626 219 -20825 -8345 -164 -7434 -5343 -12155 -3200
10674 -3200 -3741 -9586 -6470 17981 27667 40134 34009 11379 -7381 -8834 -11133 -12723 -24827 -29585
10660 -29585 -13276 -9551 -12474 -3285 13845 10770 1844 -8616 -7679 60 -835 -23599 -43119 -16451
10646 -16451 -1444 8418 7379 6672 7851 -2096 -19743 -27521 -8800 -7400 -3427 -18374 -28380
10633 -28380 -32614 -40962 -42009 -14948 14948 11245 -6968 -2987 -3649 139 6229 1229 -7764 5412
10619 5412 12157 20426 18535 11348 26376 34632 39960 15580 -6847 -9785 -7535 3154 21268
10606 21268 19652 -7771 -19273 -4245 4901 -6989 12482 11537 -5808 2423 14474 5081 -1825
10593 -1825 -25429 -15031 -18727 -23947 -12194 -17428 -9910 4862 23652 28983 28699 27281 4510
10580 4510 -7636 -3834 -6621 -16628 -25835 -37869 -30383 -10442 -17168 -6238 -10928 -5724 -7802
10567 -7802 3412 19506 21719 11490 9900 21602 12825 2646 -2618 3928 8914 20800 29722
10554 29722 19416 18639 6679 -8228 -14783 -13247 1050 9089 20613 14775 7703 22957 23134
10541 23134 -890 -12280 -21018 -25859 -29753 -28682 -13466 -8034 -5863 -4229 14877 17827 -18173
10528 -18173 -31074 -34419 -24807 -7831 -9897 1876 10741 13652 28381 10209 -19710 -20086 -4722
10515 -4722 7677 -390 -1874 6472 17513 7999 22981 25564 23481 23172 22647 23658 15386 17883
10501 17883 32323 33549 4615 -7860 8527 12730 27218 37213 28317 9270 5048 15562 24429
10488 24429 20693 10147 7116 5641 -7876 -13807 -7181 -1999 -689 -5548 10973 1234 12568
10475 12568 25011 17521 -15395 -14295 -8537 -20735 -16249 -2730 4533 -6771 -15538 -25205 -17010
10462 -17010 -22818 -32132 -18661 -18383 -8686 629 -5807 -13920 -36234 -32101 -20660 -10643 3717
10449 3717 -8866 -9066 -14473 -5111 -1590 -23706 -18271 17911 28621 10016 9142 27307 10176
10436 10176 -6880 -9844 14972 18146 23854 26066 37906 28830 13824 10651 4998 10036 1779
10423 1779 1295 266 3166 -8869 1962 26576 27261 12400 19615 23877 22333 14868 -1506 9869
10409 9869 7629 11571 2591 -1235 20386 30469 18609 24470 43435 35065 26094 28266 25686 18877
10395 18877 11921 18225 44827 42938 19911 6155 -78 1096 12876 35843 42314 28655 24672
10382 24672 16235 22473 10960 12973 19068 27224 34195 27679 24492 20806 32117 52119 23958
10369 23958 -1484 9008 21129 8601 5772 12129 18519 16262 18551 14968 15695 18409 8874 14673
10355 14673 7166 6182 3347 19869 35187 11319 -2920 -6236 -1161 -4382 -14154 -13157 7216 4625
10341 4625 -4713 -16308 -10815 -11424 -13116 -697 7801 6296 17346 10716 15798 -690 -27544 -21271
10327 -21271 -5803 -4953 -6717 1931 -2834 -7241 -3650 2152 1895 1082 15587 38850 54031 26115
10313 26115 18521 3271 -9058 -13816 -15876 -5123 7032 21673 43128 27841 8890 22164
10301 22164 27057 24255 21578 12299 9648 11366 25108 21765 5740 16433 3294 -15893 -4179
10288 -4179 16263 5467 3404 11637 1653 -1919 -9915 -5493 6854 -9160 -19143 -3008 -4255
10275 -4255 -10926 -11006 -12508 -19048 -9242 -11178 7967 29597 27844 31672 10898 10986 17586 25606 27986
10260 27986 13433 1700 -15309 -40224 -43602 -20665 -422 -18056 -19662 -8188 -26452 -37137
10248 -37137 -35425 -31915 -32513 -25127 -5907 15331 16360 19056 12688 10764 32464 35207 8965 -18569
10234 -18569 -27717 -22568 -20212 -24851 -22522 -19451 -26354 -26612 -5608 -11266 -26681 -46435 -36285 -30988
10220 -30988 -18822 -23657 -16542 -14782 -13974 -8707 8210 -565 -4623 -12772 -19164 -29812 -49369 -33374
10206 -33374 -17893 435 7187 25780 24664 24885 30498 30859 8513 30667 34336 16350 -9142
10193 -9142 -17532 -16852 1672 14117 6113 -7522 -14774 -25601 -12363 16420 20870 33208 32579
10180 32579 21324 17870 14675 3048 911 20223 41225 20562 1561 -206 28956 40380
10168 40380 37393 45268 40548 38764 29989 37500 45231 61543 45635 29499 26277 21457 22951 25703
10154 25703 32775 47341 46199 54038 50920 47251 51588 60515 48589 33013 35349 26551 24676 10330
10140 10330 3037 -8459 -25724 -5776 680 11830 26812 23349 14527 33221 32451 11975 3711
10127 3711 -3756 5316 7115 -5657 -20395 -25356 -36832 -17823 -19090 -23725 -14006 1974 18720
10114 18720 36069 25968 3158 9620 26844 34538 31527 13745 15427 16531 21220 36759 58749
10101 58749 93197 101896 78137 65420 68895 45974 45033 56000 72350 72997 50502 44291 54583
10088 54583 73935 73611 78940 106996 127159 118479 116758 120342 107946 81669 79741 97563 100665
10075 100665 78101 57209 53529 54501 57437 72621 79778 83519 89755 79249 69296 79979 86505
10062 86505 71828 49610 34497 23970 38301 39645 52176 41635 37581 52542 58585 52063
10050 52063 54671 68923 63103 85551 131618 190377 256107 383014 603130 1013538 1552111
10039 1552111 1650610 1241785 903047 646363 414763 275525 197800 155937 129209 106701
10029 106701 81704 56416 33974 26440 34984 18043 16222 9262 18954 31212 30568 10003 23347
10016 23347 39803 32956 20084 30669 40497 46067 51186 39772 36416 45607 42039 60406 55897
10003 55897 39120 43376 18229 4881 7349 10602 9452 21955 32198 25241 29404 18321 9292
9990 9292 -1264 -4031 17677 16484 16694 10096 1323 4400 17507 25270 39242 41469 53504 49970
9976 49970 39226 38912 59529 51545 45104 22969 14203 35067 33974 22516 18245 6601 12470
9963 12470 15347 4306 -7982 -9934 10042 20497 14842 2768 -202 -11615 -2044 16429 14614
9950 14614 12063 16346 19731 22871 37948 35154 1511 -3458 -2501 -9209 -6732 -10210 2430 -2344
9936 -2344 -14787 -717 6212 -7454 1306 2122 8373 15411 9270 8953 13083 31812 27773 24793
9922 24793 12902 13802 19856 36304 25250 17860 25448 17027 -2400 -6229 -13810 -5689 2880 1133
9908 1133 -2065 1156 12071 20307 12820 4602 2558 6464 20321 14528 -1152 -2662 -8120 -1650
9894 -1650 4239 23932 36204 15206 6493 1343 8614 11576 5935 20985 25974 30609 33843 18189
9880 18189 808 -12708 15373 44031 68437 61436 79661 85848 73729 64851 51194 35468
9868 35468 22740 26866 18199 730 -6732 1517 -3171 814 2026 11831 6578 7740 2081 23333
9854 23333 31955 35663 19024 12285 24434 42913 67359 77254 67206 44549 16336 4166 8722
9841 8722 -17922 -18944 -12376 11648 20928 31150 42963 44197 48552 39738 39783 29695 28292 30800
9827 30800 23235 15867 9047 3120 18871 33181 30846 31807 46869 59253 44714 31906 19492
9814 19492 13345 26049 45072 44702 45663 47666 43552 35451 40065 35150 39342 32795 35992 49048
9800 49048 34980 27887 38528 80542 84676 69926 56364 26503 29932 46628 39928 31373 31897
9787 31897 31653 33564 19711 3941 22239 49792 54313 37261 37246 44986 42724 40015 53582 72625
9773 72625 79304 47885 48784 52181 43269 35995 35167 38792 38871 41297 40585 22239 18532 39761 36723
9758 36723 35407 36728 55187 60365 55779 46841 43312 50933 60191 83491 69807 64215 67837 49834
9744 49834 38907 52149 54519 46339 51398 62823 71822 72448 64197 55855 43587 32747 25048 25479
9730 25479 26065 27634 39515 51188 60793 73265 83684 75195 72096 78984 78769 66100 59151 61864
9716 61864 70269 69041 59394 57135 37853 46520 62574 65261 70448 70011 68577 66837 68856 58540
9702 58540 72083 82341 82502 83199 94158 93093 87802 84059 94192 86886 86337 87241 92799 78373
9688 78373 66314 67265 77875 83253 95635 114482 125397 116063 110094 98435 85070 80561 79753
9675 79753 87936 93094 99970 96014 101160 88809 99882 120065 113460 104946 111219 108419 122655 107268
9661 107268 102712 80577 78553 96681 89846 82316 95543 127293 133251 133676 128648 107197 96402
9648 96402 103656 117181 122504 116234 117185 117607 138695 146941 142876 123541 104821 99871 107473 132105
9634 132105 144208 143206 139548 161774 169871 169736 157751 163721 172895 186975 176236 159809 158696
9621 158696 151259 151484 157068 176837 189767 178121 186702 178397 161226 172952 186177 183571 182419
9608 182419 189774 197293 201649 203356 206990 205646 210848 220777 224426 236444 226610 219709 235631 241472
9594 241472 227584 223761 235187 246900 232448 226066 233684 222069 234305 233968 237109 245152 253096
9581 253096 252667 249798 249157 263761 273073 250385 245563 252720 269943 265840 263109 269290 281451 274186
9567 274186 277057 283702 289451 293609 282183 279827 280353 277027 276231 272209 265357 273776 286187 302837
9553 302837 311202 307017 309014 313884 318667 312232 311273 299464 305169 322632 339812 341617 336539 332083
9539 332083 312312 302085 310946 300128 306256 321148 317224 312204 318897 315119 321455 336129 321913
9526 321913 316324 331007 331757 328355 316617 314784 305783 306528 297814 281957 295502 295235 290969 269023
9512 269023 247867 268487 289623 301554 301531 285801 283736 294569 294387 279069 286373 288156 274981
9499 274981 280060 287270 303175 297901 279053 294457 291235 276688 262267 260733 258466 250025 240902
9486 240902 220418 206783 223381 248309 245222 238929 235208 222344 197369 188504 192244 211226 214001
9473 214001 209113 204098 194977 209586 199011 190325 193268 175129 170177 180750 184761 170278 171038
9460 171038 168502 163620 162001 151047 139189 149618 148135 143692 147297 157712 151622 149350 137294
9447 137294 139953 166520 168980 178199 160798 163056 147669 133548 133951 132605 121175 106949 106780
9434 106780 132057 119304 131223 136498 128555 117094 103854 100612 89643 87442 95305 109834 113008
9421 113008 102436 90876 94315 100365 96171 86970 87399 87827 93943 94657 89765 88359 90997 88049 69821
9406 69821 85689 94038 90543 80003 58356 69587 78498 72356 62170 65320 54582 35563 29148
9393 29148 46039 56549 53056 60731 73589 58243 58484 63199 57972 47938 55698 57082 58604 43461
9379 43461 40727 40289 44398 43288 40254 14118 13179 22029 31018 35567 32471 27567 33141 35557 31696
9364 31696 36850 56927 48377 23402 21105 29110 62308 66753 57649 48361 60600 60247 50903 39600
9350 39600 59639 53352 46927 51830 36219 17704 17695 35739 51136 53996 57504 69092 56213 59296
9336 59296 73454 58396 38093 57524 82770 67957 42112 48382 40774 33539 39310 29284 36110
9323 36110 45873 47215 56008 51229 45663 35942 49647 57145 60085 52741 41429 17992 3311 28742
9309 28742 39308 40919 41803 39337 30498 7588 11916 18078 18831 16452 20073 15895 5089 13162
9295 13162 42326 48303 50509 58703 57472 47921 35596 16335 18602 34180 30187 29488 27369 20424
9281 20424 26200 24534 12086 -9669 -12493 1942 2401 5128 14529 11920 6380 481 -6674 -3078
9267 -3078 -10447 -6093 2674 11158 18043 24617 28888 6845 -3587 -11943 -6205 -1985 -3595 -6630
9253 -6630 4623 21450 10130 -13102 7611 27828 31471 37898 36170 23059 9966 5905 935
9240 935 -6832 348 10980 29207 36924 22306 3345 -6056 5770 24934 28363 16971 11728
9227 11728 10004 5337 2498 4787 17647 18833 5716 15122 20028 20282 12353 6368 25794 36617
9213 36617 38838 44562 33909 25962 22434 25703 15577 6698 8081 34389 28451 15333 16032 20430
9199 20430 21481 22895 31733 37306 21604 16612 11254 11868 24236 16793 21164 12573 -5932 -4552
9185 -4552 16992 30555 32479 32968 22967 24109 14154 3155 12304 18415 26097 55180 68299 50602
9171 50602 34851 35554 28172 6673 16204 34922 54933 55053 61048 61367 47800 30194 12946 17811
9157 17811 6250 16370 37500 51087 58930 49151 33659 10579 22931 26825 20269 3540 6512
9144 6512 21716 22058 35040 47452 36462 22124 18554 21463 20146 23071 23803 12385 6417 34445
9130 34445 44757 23141 5305 20701 25288 2297 -17525 -7234 -12959 7735 26768 8824
9118 8824 21551 46524 54262 46275 41389 52435 66446 69729 52638 54957 54995 58880 47536 51827
9104 51827 47760 50905 42150 44530 48373 41588 13573 -15183 -6769 11884 36174 50966 50578 55845
9090 55845 60112 55301 90830 118422 106802 88420 80260 56909 46993 44604 34048 22680 8739
9077 8739 1572 9356 27610 31607 18026 19836 27089 16352 -3712 -17675 -14733 -4798 10329
9064 10329 18768 29048 21454 205 4139 3484 5772 13625 14566 25696 26004 21498 23129 13410 8850
9049 8850 7627 13429 13274 -5888 -4295 -1344 20301 39429 42563 36234 20788 11900 18250 22994
9035 22994 30811 34256 40886 65501 46877 32049 37394 39588 23317 16539 13535 10152 31104
9022 31104 34492 36429 39975 53259 55298 61587 80550 87523 67343 52631 57437 59975 59182 42174
9008 42174 32692 68116 83428 82435 67111 32664 31123 54525 55688 62107 45738 24080 3844
8995 3844 -11719 -9192 1604 10809 1630 -9095 7277 52356 45737 23349 26979 15749 11182
8982 11182 13333 10853 -5088 -6964 -13252 -22383 -19088 -19875 -5442 -3544 -2145 9322 9179 13003
8968 13003 2215 -6073 -4170 19058 22732 20183 -7599 -15202 -4147 11435 15080 21818 24913
8955 24913 33170 14746 -10264 -9117 -4815 -5115 -7683 11214 22823 37092 50308 47772 45110
8942 45110 36538 33122 32985 45298 43775 39030 53183 67834 76987 68291 31194 723 101 3452
8928 3452 -9579 -16198 -3517 11031 27120 24766 4783 -12139 -17239 -23509 -26907 -10177 -7632
8915 -7632 -1738 8576 4853 11936 24071 2265 -22523 -16966 556 6653 -12027 -6407 8699
8902 8699 27617 34028 13785 -3876 -16529 3176 5418 4270 117 2467 15219 30270 53358
8889 53358 42983 22614 -2954 -12043 -17596 -28545 -34046 -10604 3203 7243 7147 3566 12346 40569
8875 40569 46666 35030 31224 30889 23451 38851 28020 27281 22706 38652 35218 38626 18157 25956
8861 25956 39782 39499 20302 17286 3708 10287 18734 13390 -944 4381 84 4743 23881 20538
8847 20538 11171 14411 20868 29002 21306 11829 27817 46700 38906 1911 -1609 8321 6648 12840
8833 12840 27873 35238 27613 6184 17683 25949 36912 61452 68814 52511 25438 16200 9691
8820 9691 16065 18479 179 4451 3036 -4022 560 -5969 -25910 -14730 -8846 1461 8885 8436
8806 8436 -13266 -23842 -21906 683 14174 14677 18011 13324 11238 16231 5086 5871 8181 3981
8792 3981 3112 26217 30988 17056 -2575 -7154 -9736 -1029 13935 16278 19096 8425 -4045 1669
8778 1669 16072 35891 38902 38721 16221 -17464 -18248 -16558 -23392 -26292 -19246 -14554 -9952 -13565
8764 -13565 2011 1997 -15138 -9034 -6072 -4391 7670 12661 25206 28574 12889 6571 11276 -3216
8750 -3216 -19547 -5729 4480 8548 27528 22471 10849 12133 11088 9541 3611 4512 11950 1770
8736 1770 3751 7661 3137 34 10552 14134 5781 19856 18112 24400 26746 17065 -298 24107
8722 24107 34243 43161 48992 41784 43353 27972 22895 25399 23145 31447 22884 13999 3275 14697
8708 14697 35689 54664 53466 45999 17416 4470 11963 1842 -14948 -8806 -6279 -6671 10276
8695 10276 17108 27246 14725 4762 19668 17690 6601 12179 22937 33958 30839 25578 16644
8682 16644 3342 13956 4506 -7158 9719 -20048 -47609 -44029 -47106 -29655 -27886 -30296 -21872
8669 -21872 7175 -958 -5115 -4478 16002 44048 43511 28015 10451 -1011 10652 4922 -852
8656 -852 -4022 -930 -18285 -15734 -10183 -9615 6561 10448 22564 49152 37740 19839 10008 7689
8642 7689 -12923 -19893 4018 31127 37725 38960 27034 19967 23276 17162 6571 18522 51535
8629 51535 57133 50555 59819 57393 45579 41965 43774 61106 58530 72271 77825 90176 96504 89006
8615 89006 88810 81296 74372 74372 68825 79604 101686 101031 103888 108098 111611 122691 135115 147645 148797
8600 148797 135258 116643 111324 108608 101029 68613 47734 73310 112875 114743 96376 72371
8588 72371 67201 77993 77259 54857 48425 33350 23504 42845 53937 58974 81558 98138 83540
8575 83540 79468 78990 78970 111029 138536 147488 140063 146101 191063 244827 299754 346602 413070 511249
8561 511249 594670 659225 693587 703362 679167 622481 543524 440079 360097 300286 242816 213990
8549 213990 219110 213417 194107 156307 133798 130649 122213 110493 101732 95668 88161 96847 109039
8536 109039 120177 127386 142140 161888 179191 177078 173644 194134 197537 213350 249186 296098
8524 296098 362048 443320 514822 599797 679440 705620 679668 611341 525123 443772 360111 288179
8512 288179 244343 201491 164934 126665 124619 124744 106468 100164 91063 87923 71914 64262 56666
8499 56666 54287 48430 33737 31244 41926 50366 43672 40747 35064 29529 37325 15848 -1000 11455
8485 11455 4309 9476 16755 15937 31345 42980 43501 28785 -2013 5713 10524 27279 29629 11109
8471 11109 2662 22131 32222 45215 62951 48255 36883 41886 14184 -2664 -8864 -26599
8459 -26599 -32337 -22852 -6959 11526 17109 30324 32665 37004 31963 12871 5123 -6447 -16536
8446 -16536 -17274 -2123 -8343 -41396 -50347 -38090 -1553 20419 -804 -20343 -14908 -22814 -15678
8433 -15678 -18501 -22021 -19754 -25071 -3335 1862 -5028 1286 7223 20993 19486 39197 39760 22949
8419 22949 6385 5718 745 10478 5588 -7942 -14256 -11319 -23665 -20218 -10876 -11736 -2053 2758
8405 2758 -14475 -18858 -4888 -7163 -6478 -7745 -13537 -4860 -7495 -10810 -17723 -18295 -12373 -26264 -28475
8390 -28475 -31845 -43606 -50666 -46698 -29077 -14015 -13009 8832 -6074 -22473 -18822 -21432 -20553
8377 -20553 -22159 -31290 -12892 -4465 5411 5788 7102 22645 11567 -3342 -6159 3785 307 528
8363 528 6939 -3960 13208 25163 31847 21562 579 -5442 -694 -4334 -24695 -20976 -29749 -29642
8349 -29642 -42039 -35677 -30238 -23383 -31976 -21054 -8181 -12838 -21767 -12404 -9319 -22122 -8847
8336 -8847 -227 -11153 -27837 -29309 -11729 8270 2842 5993 -530 8576 5512 5996 9897 -1233
8322 -1233 -1663 14824 4974 -7142 -31989 -28278 -844 12180 6670 2220 15110 22835 34042
8309 34042 33260 9777 -614 -9832 -12485 -29531 -38801 -22987 -23520 -20575 -6345 -13275 -37018 -37058
8295 -37058 -30894 -28354 1006 11934 3244 -11334 -16423 -4606 -17445 -28953 -36079 -31059 -28757
8282 -28757 -6910 2374 -4546 -3794 3191 12526 1694 -9850 -3951 -8489 -19159 5404 11306 6010
8268 6010 -12529 -26010 -22300 -21409 -26061 -19403 -32247 -7531 14144 2849 8868 -8927 -9504 -4809
8254 -4809 734 21100 15404 6411 -734 3850 -3245 10359 16940 -7337 -15851 -24166 -26487 -10257
8240 -10257 11794 12516 9329 17575 24720 21130 14153 2382 6369 -13680 -22774 -4833 9218 13355
8226 13355 20697 10779 -7301 -11299 -10687 -21732 -14644 -5764 -7475 -3694 -1717 3776 545 -9790
8212 -9790 -19795 -9949 5178 -1362 -4718 12378 15679 6986 4740 -17545 -11225 -2788 14442 9167
8198 9167 15169 10054 6265 -11163 -16686 422 9035 7603 -1742 11983 5559 3418 3776 10729
8184 10729 14765 30198 19954 1692 9039 -3507 984 2795 -5245 -5558 -3783 -9011 -4052 -12785
8170 -12785 -10045 -9916 -7246 -12395 -19307 -26078 -28562 -10231 669 -3464 -37903 -48360 -27856 -30919
8156 -30919 -6616 18257 7577 2598 11451 21475 19108 12517 9911 13322 15607 4293 -3678
8143 -3678 19741 21941 12324 5312 7698 18221 15055 -3656 -16223 9249 26549 17362 -11592
8130 -11592 -34729 -21526 2407 11749 14382 2358 -6427 -9855 10244 11300 1794 -11238 -13904
8117 -13904 -9927 3205 106 -7341 -5823 -5703 -13823 -7710 6385 37 -2177 -11276 -29417 -23592
8103 -23592 2237 2830 22530 29013 11865 6452 3409 1410 -1881 14624 20704 15067 5723 -8405
8089 -8405 -1413 3017 12311 11321 8161 33956 45922 26412 13602 4561 -5383 -3213 3975 -266
8075 -266 2219 16466 26092 28527 20029 1636 8169 28966 30759 16802 1580 -4510 -10133 -3850
8061 -3850 1874 10807 6468 8123 16968 20001 16411 29389 31647 19174 16452 10510 12481 14688
8047 14688 7196 4124 5530 11154 11478 -954 -8011 -7505 -14501 -27295 -28950 -23340 -10367 7700
8033 7700 -2329 -12466 -2298 -36 -512 -396 18819 31443 28130 25791 30885 36512 51934 32858
8019 32858 29755 43711 24704 13573 13889 21718 35416 20716 23271 24272 16114 6480 -5601
8006 -5601 -57 689 11720 12872 4711 5414 10074 1384 9202 15912 8289 -3630 -1249 6023 4593
7991 4593 11993 -12028 -9167 -18402 -9478 15099 5391 -12792 -23461 -3275 11794 32494 33057
7978 33057 29700 35215 43438 37179 28629 25859 15256 9978 9778 28302 43204 36257 35659 27116
7964 27116 25203 33737 22136 18630 26809 23248 13054 15120 13692 3106 -5270 -1361 1523 -4757
7950 -4757 -2410 15213 21970 29600 25005 -2023 1353 9800 7828 8754 17409 21399 11057 21448
7936 21448 26738 26637 17733 22901 17692 13702 8933 -2455 -12683 -1918 5192 12350 15571 10937
7922 10937 6654 9085 23514 4354 -20328 -20790 -17486 -16814 -35478 -30852 -17280 -10408 -15331 -13139
7908 -13139 -12530 -11212 -2651 9322 4494 5421 -3307 -23163 -22078 -38194 -31236 -18185 -11997 -13584
7894 -13584 -19810 -18596 -22039 -49011 -48013 -40583 -26285 -10148 9462 29101 15778 -4399 -7061
7881 -7061 -15394 -2114 2532 -7328 638 -11541 10277 17340 -5372 -38992 -66921 -54006 -26689
7868 -26689 -151 21015 16011 -6958 -1035 10067 5262 -4345 -30885 -41214 -11276 6914 -322
7855 -322 -9269 5917 32113 31701 16459 11063 11456 15641 -5173 -19842 -20329 -20177 -28055 -40395 -31896
7840 -31896 -23453 -27390 -39082 -42428 -39013 -39769 -26187 -1769 10946 1965 -11431 -15810 -20516 -24943
7826 -24943 -12012 -8980 -14095 -7922 4437 32348 25194 15140 10791 -3866 -10154 1403 2688
7813 2688 1547 -3419 -562 -4454 -24501 -42511 -32977 -12507 680 -17008 -29170 -16252 3252
7800 3252 -898 -18476 -44662 -31102 -1105 6958 -2192 -14588 -10587 -2350 -2387 10041 1586 2817
7786 2817 6141 -11572 -29335 -23058 -3082 8126 15151 19420 12662 -683 -5503 -1053 2763 -26467
7772 -26467 -30455 -16788 -30742 -32756 -21274 -12088 -7124 -14050 -20201 -23961 -32129 -29794 -17950 -10568
7758 -10568 -13477 -11989 -22759 -8182 -6899 -23971 -43308 -24823 -21988 -38102 -27768 -18149 -18248
7745 -18248 -14141 -4219 -10979 -18598 -11903 1140 -2709 -25184 -30151 -16690 -22505 -30347 -20852 -25210
7731 -25210 -17182 -19449 -20099 -13314 -14365 -13 -22946 -40244 -25264 -36006 -44286 -33448 -10967
7718 -10967 -3181 -17326 -15253 -16139 -8805 4371 15687 24220 23942 4370 -21516 -37522 -35465 -32171
7704 -32171 -32985 -14979 13839 15637 5975 -8054 -6533 -13493 -23848 -26816 -2456 -12287 -29628
7691 -29628 -28717 -35130 -33486 -31916 -40701 -50520 -52376 -42655 -25066 -13412 -17427 -27595 -38920 -17486
7677 -17486 -11215 -12934 -14904 6197 8821 -14052 -15167 -19941 -23651 -18489 -22387 -26839 -11135 7810
7663 7810 12865 -13636 -36735 -38398 -34481 -6014 12236 -4824 -7803 2371 -6106 2682 4255
7650 4255 828 -16184 -27366 -38474 -10498 15338 42553 38604 44062 34561 21426 14165 1015
7637 1015 8418 17913 17266 11414 13008 17752 7101 14186 15044 16413 -2801 -29057 -28048 -17504
7623 -17504 -18810 -25600 -14982 2434 943 2655 -3206 -20993 -23922 -31540 -34883 -15288 -12337 -22706
7609 -22706 -8905 -3965 -17502 -17544 -9634 -12992 -28443 -33144 -25190 -16344 -25195 -37771 -13309 241
7595 241 1845 -3340 -29764 -15470 -154 -17918 -45412 -34933 -11449 -27072 -54348 -48941 -47895
7582 -47895 -64051 -47454 -32963 -47698 -55642 -43431 -33833 -31116 -25369 -20762 -8065 -710 -10863
7569 -10863 -8302 12280 23057 6459 4127 31566 37415 22232 -17414 -26546 -19689 -18947 -8900
7556 -8900 -15730 -26643 -40902 -41176 -22893 -35700 -41315 -26682 -6124 1372 6294 1187 13682
7543 13682 738 -9442 -18224 -22493 -6688 6877 1292 7824 14119 17234 28780 27566 8780
7530 8780 7260 -10511 -19632 -30681 -45578 -28073 -40709 -30776 -9444 -8801 -7404 -1457 -3604 1490
7516 1490 14844 -8424 -11506 -190 7411 11460 2193 -3536 -11703 -21563 -18139 -28192 -32734 -12597
7502 -12597 3704 2519 -13700 346 1170 8479 12655 1808 6040 18380 15697 7150 -6173
7489 -6173 -1873 -15391 -2205 1786 -4388 -12088 -20675 13428 -7518 -33491 -33436 -33402 -35101 -6638
7475 -6638 9646 -8080 -28633 -27956 -31977 -41284 -39994 -26712 -14616 -15889 -21483 -36192 -28663 -24390
7461 -24390 -24457 -20296 3381 11866 -2632 -3956 5339 15414 19287 5968 -11714 -31727 -44005
7448 -44005 -38834 -19173 -14582 -10786 5694 12991 10070 -13354 -26135 -14221 -11172 -14034 -5046
7435 -5046 2128 4316 -13829 -21495 -3157 380 -2345 -90 -6413 -11116 -11198 -24163 -44866 -37292
7421 -37292 -31072 -12148 2490 628 -8254 912 19823 16495 -5384 -13227 -8684 -1719 -4597 -8389
7407 -8389 -20136 -29595 -32444 -28819 -4557 -9505 -17498 -2742 935 -8580 4416 2269 4627 -4615
7393 -4615 -20489 -18547 -4701 6409 25744 -8799 -29656 -37004 -35583 -36961 -20698 -5696 3253
7380 3253 -13612 -1967 -12112 -10607 -11680 -10470 -4609 -30063 -27365 -10431 -27869 -12280 14161
7367 14161 23491 17591 12398 9165 -1624 -5881 322 -11494 -17117 -40411 -61552 -49548 -30804
7354 -30804 -14030 -692 8677 -3685 -16049 -3388 -677 -11614 -27887 -43380 -41755 -28754
7342 -28754 -11253 -9605 -10892 -16300 -8500 -532 -5852 -21201 -22355 -20875 -12341 -4292 -19213 -41434
7328 -41434 -39829 -36909 -22773 -14166 11396 34863 33007 16774 14442 7623 2143 8967 20741
7315 20741 9340 -977 -16289 -28858 -21177 -24564 -24432 -25659 -15361 -5146 985 -1899 -3875
7302 -3875 -21855 -43841 -43925 -4823 4864 5692 -6951 -20654 -33099 -37175 -27405 -18927 -5098 -14109
7288 -14109 -9940 -3952 -7995 -3662 9939 16960 10115 -2071 -18299 -21469 -12608 -13861 -26343 -23065
7274 -23065 -4476 12538 15625 28058 18453 7565 -3415 -12916 -17625 -15076 -20767 -12855 -17848
7261 -17848 -26184 -29999 -26415 -27095 -22159 -29228 -29989 -31834 -42149 -42188 -26620 -19865 -29726 -32623 -11799
7246 -11799 -12265 -14804 -22032 -42102 -45605 -25609 -20566 -24136 -24699 -22444 -37043 -39411 -47567 -40470
7232 -40470 -16904 -16443 -25814 -19344 -6786 -19037 -2916 -5433 -16998 -21455 -41885 -27219 -470
7219 -470 -454 -19231 -13714 -17361 -12425 -20232 -26699 2828 16272 20480 21416 -1029 -12344 7163
7205 7163 7796 -1579 -8580 -6832 -3665 -7960 -439 -10324 -29381 -15436 -17021 -25630 -29359 -24521 -17880
7190 -17880 -7700 -17254 -16665 2992 4480 -23728 -16783 2883 14970 33681 34499 27450 12739
7177 12739 -20038 -26628 -22733 -14317 -23273 -39939 -34512 -16812 -9699 -10198 -28612 -32278 -23858 -10040
7163 -10040 -19637 -24837 -40732 -46180 -35323 -31136 -16625 -11573 -33037 -29028 -8891 -13192 -18879
7150 -18879 -13047 -8041 -14940 -9754 -17622 -31665 -18345 -14899 -2654 1996 471 -3907 -13125 -12625
7136 -12625 -11598 -10222 -6191 6996 5148 5963 5029 -3833 -16424 -8336 11778 35548 32569 19568
7122 19568 2349 -5077 522 -1051 8104 7558 -6242 -7087 -18238 -16626 -8968 -7192 -13418 -6126
7108 -6126 -12414 -35077 -47932 -39112 -14107 -19196 -15086 -10737 -3457 -3850 -775 -4849 -16130 -7856
7094 -7856 -11354 -6364 -14838 -8989 -11928 -5306 6092 8887 -19743 -34832 -27814 -21662 -13842 -4379
7080 -4379 -2257 -367 -4429 -10317 -4791 7812 4844 -589 -5821 5480 20300 20175 13048 7588
7066 7588 -4162 -7403 -21406 -27755 -28233 -33614 -31291 -6619 -5329 -4953 5626 -15084 -27496 -30036
7052 -30036 -19875 -10821 6334 7257 18766 9718 8774 368 -1448 -12378 -5076 -17977 -16783 -11235
7038 -11235 -17689 -15519 -10977 8343 21913 22310 14137 -565 -9997 -18547 -2890 -6882 -107 1861
7024 1861 -4252 -5553 4868 -1711 2401 -8348 -24165 -35830 -38584 -28426 -30096 -12570 1519
7011 1519 -1231 -17252 -18105 -12348 -8869 -9586 8707 23880 23809 11203 13605 28318 33189 26823 10632
6996 10632 -3756 -17468 -20477 -23270 -14394 -30727 -47922 -37050 -8939 -7656 3867 7813 2382
6983 2382 -7676 -20471 -11302 -1620 -16018 -14466 -6320 -92 -11929 -26616 -23112 -27173 -17669 -8290
6969 -8290 -26 13233 8027 17909 16242 5551 -15415 -22357 -26035 -36729 -36851 -35811 -34758 -28797
6955 -28797 -17088 -6532 -6522 -21766 -32440 -22129 -17473 -13181 -1099 13820 6182 -7903 -125
6942 -125 -10961 -22573 -23171 -31671 -21862 2899 -1 16442 29250 15508 -10489 -22075 -26921
6929 -26921 -18236 -8345 1379 17754 15261 8299 15917 20730 16706 8017 -15842 -29099 -20840 -7105
6915 -7105 -13550 -3204 6270 11015 5633 -14180 -17124 -14308 -6658 -9671 -24231 -343 15991 17555
6901 17555 156 -10637 -6341 399 7093 -15479 -28174 -26424 -26710 -27394 -36803 -35359 -11866 6008
6887 6008 18723 16984 13133 -971 -1960 -3951 -4469 -4840 1879 -9672 -10952 -3391 415 7330 2064
6872 2064 3253 15849 5842 9126 11215 2890 3939 6920 11046 6582 5448 3593 -14300 -12460
6858 -12460 -9054 -9939 2176 -11710 -21504 -8031 -13415 -45798 -44735 -44376 -38087 -48075 -42933 -20661
6844 -20661 -9206 2246 -7379 -32998 -33243 -13360 -5245 285 4500 12257 13116 -10924 -13631 -20878
6830 -20878 -17071 -17833 -14901 -155 14902 22216 19622 -591 -32359 -36942 -38512 -26423 -11851
6817 -11851 -8508 -20814 -17922 -5648 -12977 -12654 -23468 -42206 -39595 -25352 -20178 -26791 -19953 -23144
6803 -23144 -23493 -4948 -8284 5663 8248 -18180 -23384 -10151 -9189 -9694 -10494 -3223 -5290 -11739 -18645
6788 -18645 -7837 -8208 -14641 -9727 -7863 5257 14841 20485 11765 5169 -11479 -4171 11881 16853
6774 16853 24369 17600 -13669 -22818 -32212 -40208 -25466 -24606 -17927 -20816 -22248 -29493 -18766 -13956
6760 -13956 -18328 -10845 4972 20055 2644 -27198 -34052 -31824 -16032 9822 28530 19056 7742
6747 7742 -5423 -10416 -4013 -1936 -5298 10369 976 12115 46658 72684 90707 129012 172794
6734 172794 224243 317757 370381 342512 291702 235664 187011 148012 96304 79946 63647 43845
6722 43845 38147 40589 24496 20217 -239 -31633 -45282 -49139 -22943 -9976 -27881 -36953 -31255
6709 -31255 -12687 -12314 -10576 16879 25369 26634 27051 12185 5382 -5559 -7141 -18586 -32426 -48352
6695 -48352 -68816 -59835 -47921 -36487 -30103 -36439 -19228 7450 7392 5627 -10925 -1261 23784
6682 23784 7419 46 3790 -3568 -12106 -7694 -17505 -38305 -38952 -36295 -27346 -11666 -19627 -9717
6668 -9717 2077 7468 29692 40789 24608 30044 28569 30528 11984 18692 20927 5362 2858
6655 2858 14195 15073 13028 18354 12213 7986 -6615 -18098 -12238 7973 9751 1289 -12469 -24029
6641 -24029 -20776 -24197 -11967 1252 7341 4118 -10702 -43503 -51560 -31724 -16685 -3694 -684
6628 -684 -3126 -16160 -16827 -27344 -25905 -8421 5523 1615 5198 10160 -7273 -12505 -4611 -8313
6614 -8313 -15326 2983 5101 -4433 2574 9445 12113 20897 16855 -4406 -16230 -11981 -20545 -5161
6600 -5161 -2281 6141 9678 21351 21492 4826 -11890 -24511 -22961 5440 9883 -19687 -31258
6587 -31258 -12236 -14481 -19741 -18808 -17582 -42650 -68498 -54178 -25934 -2689 -4304 -3609 -163 -98
6573 -98 12551 -4036 -10229 -21627 -22716 -25204 -25916 -28501 -29581 -41705 -47343 -48383 -30912 -2186
6559 -2186 14555 5820 -1461 -9862 -15734 -20443 -21397 -7493 5844 8566 6247 1745 5725 -13260
6545 -13260 -23167 -11877 641 6038 6452 14587 30190 7567 -13042 -17703 -37828 -8780 1095
6532 1095 -19253 -25164 -25748 -37828 -35156 -30084 -14975 -1336 1255 -15071 -18736 -14048 -16085 -19624
6518 -19624 -34448 -13687 21108 9518 -4623 -10642 -9884 -13235 -398 -2267 -13035 -12797 658
6505 658 19869 35909 9956 3990 5299 8002 9215 9638 -14642 -25872 -26482 -34277 -29081 -26250
6491 -26250 -20882 -13546 -7339 -16967 -11215 -6496 -11703 -10331 -544 3756 -17981 -35617 -19782 -15437
6477 -15437 6883 11250 8446 21793 13426 3702 -17455 -10446 -9229 -3689 -10836 939 22034
6464 22034 31788 12908 -16104 -31252 -26309 -7299 -7549 1542 -9630 -5275 867 9134 -6531
6451 -6531 -30267 -31601 -32526 -32858 -40182 -45088 -38704 -41319 -29674 -18214 -24337 -10236 -18911 -27217
6437 -27217 -20631 2445 6555 925 1597 -23350 -19090 -26248 -24340 -284 4848 4944 7841 4905 -17197
6422 -17197 -29975 -16887 -16947 -19491 -3623 13583 21830 -710 69 6548 6246 -23279 -26413 -24287
6408 -24287 -12826 -7283 -6315 -22009 -50117 -50768 -26525 -10207 -29026 -43045 -40664 -26337 -7505
6395 -7505 -11544 -10797 -9568 -12947 -19007 -39370 -31392 -13804 -9140 -21021 -31084 -40194 -44444 -36089
6381 -36089 -14488 -85 -1388 -6260 -8456 -17464 -23184 -11196 -6794 -12756 -29699 -8655 4752
6368 4752 -14918 -15946 11400 440 1225 21549 17133 4592 -4487 -16223 -15368 693 6454 1181
6354 1181 1015 -6018 -11552 -17152 -19432 -6065 4741 -7704 -7113 -7717 -7469 -1343 7391 -2166 -459
6339 -459 -12039 -11417 -14192 -8644 6246 5233 -2056 -13368 -21715 -20569 -7935 15640 27414 17259
6325 17259 8305 -22754 -50620 -35507 -10422 -7159 7814 24130 21787 8330 7389 45 66 -19655
6311 -19655 -28279 -39649 -26533 -30372 -26428 8111 21660 16730 -2203 -8204 139 4882 -3019
6298 -3019 -8138 -28076 -28046 -22742 -104 11479 -6098 -1108 22312 1823 4511 23974 15732 15042
6284 15042 5113 1619 -9 -1921 -2939 -12290 -3204 22620 23329 3760 -29904 -25718 -9393 -18441
6270 -18441 -17360 -12738 -18278 -13234 -12142 -6250 -7037 -17689 -29628 -14109 19132 17736 -8613 -424
6256 -424 -13599 -39901 -36076 -40843 -49474 -40143 -28363 -39933 -40812 -26554 -15982 -22167 -33919 -17048
6242 -17048 -26354 -23983 -9865 -1750 10074 12660 6644 2461 5917 7679 -5550 -17497 -21042 -23041
6228 -23041 -13786 -5975 2643 15086 9677 -12303 -24146 -15562 -5017 -4051 -6198 -7759 -21024 -27681
6214 -27681 -22340 -23892 -45834 -38281 -16360 -19688 -27733 -23015 -19632 -27811 -18389 8351 21624 17760
6200 17760 -1959 -2630 412 -11328 -2437 3877 -4781 -6073 5196 15342 3748 -13441 -38174
6187 -38174 -43776 -23615 -26574 -18083 -1600 -1058 -10442 -17419 -24866 -34006 -35965 -21490 -16786 -11225
6173 -11225 -11001 -7007 -8935 -4308 6677 1034 -18440 -11917 -15189 -26844 -25826 -3654 -10520 -21329
6159 -21329 -30404 -47725 -36337 -19149 -3203 7890 9722 -15817 -25488 257 5980 4154 -2276
6146 -2276 -3426 -5268 -12694 -7986 -70 -5451 -1834 -8578 -12224 -18339 -23768 -16128 -12446 -7893 -113
6131 -113 -11838 -17335 -20505 -15518 -1936 -3776 -8098 -8306 -25606 -36045 -36362 -30836 -9209 -14758
6117 -14758 -4176 7013 8195 -5758 -9056 4410 3917 2677 -3222 -17527 -19887 -29109 -34501 -28211
6103 -28211 -27044 -25478 -24442 -23358 -27308 -42907 -30905 -26313 -23772 -14551 -19412 -19416 -21291 -24143 -33860
6088 -33860 -37087 -43938 -39854 -36855 -18818 -7788 -3198 2567 15113 13284 18939 9420 2958 -2225
6074 -2225 -18150 -18914 -14563 -1514 -10257 -17995 -26993 -30608 -14741 -8057 -4350 12765 15934 11078
6060 11078 14620 978 -10883 -15670 12633 12152 2922 -870 -1768 -12240 -4585 -6075 -8298 -739
6046 -739 -6848 -10556 -5497 -2673 -3575 4104 -3123 9339 7752 2515 7457 -3034 -11795 -4188 1830
6031 1830 1203 -23058 -34644 -28254 -18537 -18130 -3181 -15541 -19853 -18546 -16760 -1480 12293 5499
6017 5499 -2776 -27903 -2883 7722 7116 -5595 5902 39409 18639 -7802 -20523 -5277 13086
6004 13086 17266 10828 -17015 -30629 -38334 -54921 -55957 -34661 -675 6718 -13468 -12999 -16073
5991 -16073 -6310 -7644 -13132 -4007 -10931 -17084 -13369 -7083 -4146 -12486 -22181 -11267 10240 17509
5977 17509 -8943 -28722 -22759 -26358 -16317 -4040 458 -2100 -9688 -13996 -3750 -1349 -4762
5964 -4762 5058 1058 -6387 -14222 -20946 -19467 -16244 -5482 -2692 -14004 -20518 -6822 -1780 7447
5950 7447 1769 -6799 -7859 -20877 -32457 -30309 -10696 7685 -4599 -6220 4114 5360 6773
5937 6773 30651 25186 12794 17366 8014 -9308 4528 30627 29898 18684 -5126 -4248 -3732 6298
5923 6298 -5743 -8660 2091 -3110 -13383 1498 -4380 -9820 -10058 -9005 -19293 -13344 -8662 -14603
5909 -14603 -10649 -15524 -20399 -25352 -28992 -24009 -17593 -10827 -8854 -16961 -15095 -2407 2452 -17680
5895 -17680 -10495 -7486 -8845 2650 9199 8847 12978 10020 -624 12816 6233 -5801 -18479 -2925
5881 -2925 -108 -12861 -10687 13345 28550 18584 22275 9248 -2180 -15315 -21657 -6789 17263
5868 17263 19719 -11179 -17120 -20100 -37173 -37425 -18585 -5319 -21672 -17861 -11727 8762 17008
5855 17008 6438 -18372 -16195 -8190 -12035 724 6796 6573 -1722 -14712 -11120 -19764 -15241 -7653
5841 -7653 -1033 6988 10533 4434 302 -531 -4468 -5662 -15407 -14413 -13953 -8881 -22158 -28025 -22358
5826 -22358 -25048 -2925 12149 14402 11358 18910 22988 16193 15540 9444 14447 21710 19023 13600
5812 13600 14539 14018 -5761 -13615 -6948 -16206 -6537 -3404 -3847 -54 4480 21519 7678 15458 29692
5797 29692 30250 24665 27537 14173 155 -9966 -20458 -16557 -26008 -33719 -39042 -44467 -42103 -29873
5783 -29873 -15689 44 -7009 -18975 -27051 -21032 -10420 -1925 9272 11159 4144 -733 11594
5770 11594 30323 34081 13225 -9671 -15462 -20647 -43575 -51876 -33768 -5082 8584 12301 17741
5757 17741 5161 10042 11747 8352 943 9414 5116 -3878 -14647 -12681 -1461 -513 -11290 5992
5743 5992 1618 2704 8370 5288 9728 -3578 -9375 -22530 -19245 -15601 -4867 2456 -11699 -8327
5729 -8327 837 2089 -9105 -18778 -14663 10407 24244 -6104 -27208 -19074 -5913 -810 -15742
5716 -15742 -21459 -12166 7846 -2228 -24338 -39162 -52318 -55543 -34702 -23223 -5273 -10381 -19151
5703 -19151 -4142 11825 3993 -5810 -17339 -7971 -2492 9421 9850 18443 13965 -818 -26388
5690 -26388 -20415 -8962 -9822 -13074 -11362 -11212 -15701 -6174 3525 -7351 -12188 -12081 -3622 11742 15106
5675 15106 -475 4293 14212 13448 16235 17373 12307 -15794 -37009 -40289 -28117 -26765 -29368 -42923
5661 -42923 -37660 -18802 -17870 -8044 -11548 267 5453 -2434 -10958 2300 -4516 -18766 -28252 -7019
5647 -7019 6878 17845 32665 33617 29973 21045 5463 5679 11091 5083 3292 3588 10552 20855
5633 20855 28546 7520 -25310 -37948 -44999 -48171 -38807 -24342 -10050 -11779 -17353 -1033 10201
5620 10201 -1986 -6015 -7307 -7612 -20802 -24516 -26720 -15983 1846 31785 13661 -2502 -17027
5607 -17027 -17334 -14772 -12442 -6583 -1413 -4247 -16209 -18300 -17437 -10812 6008 11716 -6115 -4472
5593 -4472 -5556 -13674 -26874 -35442 -31266 -19993 -7342 3445 8486 12518 32806 39539 12285
5580 12285 -16616 -5482 11630 8574 27861 27282 11108 -10327 -8545 3620 -2712 -15858 -8955
5567 -8955 -7963 5990 2270 1848 9033 10454 -5191 -9292 -1933 -5407 -10260 -8515 1778 17928
5553 17928 11448 10701 12035 6744 -13233 -21961 -12476 11926 27494 17344 13339 21241 13150 6112
5539 6112 -5460 -15174 -28007 -33766 -15572 -17643 -10690 240 10752 14339 19604 29270 15484
5526 15484 5990 13456 21617 23402 9617 -14173 -18453 -27734 -19209 -1626 16053 15630 7178 -168
5512 -168 -15355 -21795 -19446 -15622 -22820 -17739 -5772 -7331 -15799 -28277 -28342 -21329 -17164 -23181 -14496
5497 -14496 -13763 -28026 -9680 -10193 -3212 -2615 1012 18344 3786 6883 14925 10812 8949 7177
5483 7177 9175 19395 30248 22918 17252 17692 30660 15315 7624 15950 28092 39459 26709
5470 26709 -8850 -19142 3013 21381 6702 17331 13789 888 14799 23145 3167 -15075
5458 -15075 -6833 -8236 -10603 -20728 -28911 -41806 -32949 -20564 -30559 -28017 -11213 6137 374
5445 374 -18987 -22334 -27417 -23358 -21038 -33674 -25793 -20198 -19658 -28816 -28150 -12245 -1323 4693 -5354
5430 -5354 -12966 -8814 -7757 -5288 -12535 -28927 -30547 -23331 -23323 -19184 -9466 -13473 -6395 -4387 -27475
5415 -27475 -20506 -1726 -1114 -17958 -13077 -16995 3197 14299 15487 15891 18894 10848 3818 -5316
5401 -5316 8595 5847 -6397 -26196 -17638 -17060 -18006 -20753 -30061 -17183 -5997 -7286 -6435 -17979
5387 -17979 -16123 -9753 -11602 -12721 2832 -6897 11773 19862 -2966 -6835 -2149 -9192 -13349 -3821
5373 -3821 -4436 -38369 -39443 -30052 -19944 -36730 -38343 -19369 -31213 -37931 -38875 -24489 -26602 -40475
5359 -40475 -19804 -6427 5895 17183 14995 -6409 -15008 -4104 19480 15956 11697 25670 20664
5346 20664 7658 6159 9821 12790 18324 19156 4804 -4939 -12987 -15588 -35444 -38833 -32512 -19307
5332 -19307 -2743 7881 -1685 -4458 1751 -16173 -27387 -15511 -8037 -10418 -11964 -22778 -22486
5319 -22486 -5943 -3885 4980 -8129 -8115 -1120 -10640 -10440 -3790 10222 12614 1527 -14968 -33683
5305 -33683 -39806 -28606 -19824 -25437 -34221 -43710 -49274 -29851 2100 432 -3036 -1092 -27764 -50266
5291 -50266 -39324 -7101 6947 10462 11141 -9238 -32103 -32210 -30086 -25179 -22682 -8007 2127
5278 2127 3958 -3650 -4581 -9676 -10863 -3062 -17502 -24948 -29017 -34323 -14525 4170 2943 2821 -5564
5263 -5564 -552 -3627 5467 1955 -1297 -8981 -20498 -22793 -19520 -18776 602 492 2305 2857 -3754
5248 -3754 -4782 -9143 -14856 -39666 -31134 -13538 -7543 -7902 -18676 -21234 -23369 -19638 -28674 -26397
5234 -26397 -34104 -21574 -7204 -20409 -25158 -19989 -22932 -19717 -4760 -6932 -26581 -26957 -9285
5221 -9285 -6606 -5039 -22257 -20303 5793 28822 36330 24906 6144 8535 -8799 -30145 -44925
5208 -44925 -41319 -39347 -33071 -29706 -32807 -27897 2436 -4767 -6072 -1699 9719 11493 17705 26146
5194 26146 20380 28672 36139 19397 8352 14382 17413 25049 26540 11736 -8573 -1917 8852
5181 8852 14303 7312 2876 -14953 -25119 -23518 -11076 4684 825 -16282 -23606 -27584 -26044 -15678
5167 -15678 3211 9544 -1320 6143 18017 20751 16214 -6919 3131 -2940 -4610 -1435 3000
5154 3000 13932 -2050 -6843 -4031 -9572 -8534 -8973 -18412 -22443 -26608 -6992 -2168 -1440 -7758 -3213
5139 -3213 -3268 -8021 -14215 -10816 -30876 -37147 -24891 -5886 -6512 -20522 -17652 -16542 -25159 -5649
5125 -5649 7808 -1147 -2260 -17721 -15527 -21451 -21509 -14329 -14845 -14543 -18757 -27729 -22200 -10848 -4876
5110 -4876 -8812 -4453 6975 9553 7060 -13826 -37100 -40250 -8087 8193 -3159 -16218 -16051
5097 -16051 -10681 -3628 11264 17419 6979 -2669 -2655 -3063 -15944 -21791 -15682 -5069 -4203 -10464 -11124
5082 -11124 -3894 -3223 16635 18833 13883 8597 -11579 765 4036 1725 -18898 -40908 -30097
5069 -30097 -18367 -15845 -25876 -17913 349 9657 -1077 -14138 -4243 1311 -17247 -17614 -1238
5056 -1238 -7190 -1737 7028 -161 -12314 -17468 -7967 -13679 -11070 -3534 16016 41312 44987 21385
5042 21385 11222 -1484 -26055 -23007 -22201 -18437 -9614 -7817 -19166 -7881 -21240 -37072 -36640
5029 -36640 -44004 -37916 -29055 -16980 -17751 -26505 -7732 12075 10980 12613 -2209 -361 734 -1724
5015 -1724 -3635 -5477 -23923 -22508 -19912 -30502 -37339 -19433 -20226 -12481 834 -8041 -42724 -44719
5001 -44719 -30622 -14615 3776 13661 -1533 9620 16470 8845 25087 25878 15374 4165 -178
4988 -178 1645 3973 -1018 -22 3693 873 -969 -1153 7755 20445 21024 35644 24354 8124 16399
4973 16399 26962 21392 7776 -8415 -18745 -6567 6193 6968 3677 13152 -6108 -1200 -15919
4960 -15919 -47734 -41034 -31597 -20150 -17265 -21099 -20166 -20303 -20366 -10966 -23276 -27962 -20709 -25469 -18661
4945 -18661 -16554 -12001 -10759 -22762 -18309 -22562 -29479 -25310 -15486 -9558 -35605 -25347 3056 18187
4931 18187 14823 -11138 -17012 -10588 -2296 2433 -7438 -3785 -14776 -33239 -38551 -18884 -17599 -24476
4917 -24476 -29976 -11156 1477 -7650 -6018 -6633 -787 8952 -16704 -30618 -15733 -4751 10938
4904 10938 37343 44040 28706 22963 15874 -16367 -16587 3098 -11423 -15366 -11358 -514 15972
4891 15972 -12222 -18693 -7091 2145 17110 32616 31999 16847 14557 33299 35436 10192 5682
4878 5682 20280 22602 4500 11719 29103 23386 9845 -6280 -45958 -42695 -37706 -34461 -16301
4865 -16301 -30185 -32477 -19652 -17447 -11071 9689 -887 -38023 -42954 -18888 -19041 -15624 -25015
4852 -25015 -16628 -21490 -16514 -17191 -37721 -31816 -20752 -23279 -35403 -21776 999 -4840 -27541
4839 -27541 -44539 -26937 -14885 -22375 -34026 -34492 -26394 -14672 -23491 -23893 -6302 1400 6690 2730
4825 2730 1343 18906 15956 2177 -10461 -7808 -1690 15458 18064 -6343 681 -2351 -14230
4812 -14230 -10321 -236 23542 21125 5011 -21307 -27548 -18390 -18483 -17673 -4028 16192 19027 4644
4798 4644 -15971 -9986 6167 864 -2387 12573 16969 12293 749 -6381 -5445 -9442 -5332 -713
4784 -713 -10709 -11870 1021 3806 -5991 2546 6090 -169 -12242 -8852 -10776 -9195 -1502 2797 11950
4769 11950 -8904 -10399 7253 -4767 -384 6003 6144 -13710 -13597 4283 25981 24309 6651
4756 6651 -8885 -2884 3371 -9440 -32078 -29612 -13280 -17595 -12225 58 14071 17821 -13863
4743 -13863 -31005 -4158 4825 -6364 -16190 -22929 -2937 10198 -10807 -24064 -12115 -3901 1185
4730 1185 -1097 -1693 -3727 -1450 6524 9221 1039 7910 766 -8004 -25996 -45130 -24588 -12591
4716 -12591 -4709 -5693 -3837 7743 2282 9057 3459 -7084 4669 8750 2733 5825 14358 -4573
4702 -4573 -26135 2147 8991 5367 -4204 2874 -2032 -21183 -21212 -12336 -10187 2411 20407 11685
4688 11685 -4193 21000 27718 7847 10364 -1216 192 8614 10264 20669 4574 -22690 -40408
4675 -40408 -29840 -17785 -6689 -3918 20203 8184 6426 32464 22569 3823 4812 -137 -4803
4662 -4803 -14563 -7599 -1636 22406 35148 23512 7375 9854 -1435 -20906 -4460 22204 11366
4649 11366 757 8570 2710 -15651 -4827 -1692 6203 -1147 -8456 557 15966 18022 19760 7103
4635 7103 792 1900 3998 10573 4123 -3279 1748 -175 -13198 -11200 -105 -10876 -39248 -30697
4621 -30697 -20423 7029 6766 31866 20791 2796 9827 25246 32901 17037 8520 15823 28053
4608 28053 26214 12274 -5941 -11991 8610 17897 8463 7423 11586 5268 13163 22899 10886 -26
4594 -26 -13738 -28983 -15975 -11641 -8736 -17040 -31180 -32869 -38026 -22691 -13467 -33628 -32352 -18848
4580 -18848 9809 9475 6349 8230 2679 6299 -4109 -5676 -10406 -19245 -9787 -1885 -9038 -24735
4566 -24735 -34489 -23668 -15766 1789 8383 -1697 -1597 10073 -7067 -10013 -612 -1304 11220 10694
4552 10694 -10925 -19657 -11379 3999 10234 19375 32646 20917 6142 12193 17805 21948 25013
4539 25013 11746 -6886 -862 7635 1495 2223 11604 9956 5404 4096 5627 -9962 -6251 10880
4525 10880 4893 6095 8886 -20528 -24433 -26457 -15892 -3239 2657 19049 13337 3662 -10348
4512 -10348 -37134 -20983 -7827 10513 29973 41490 19737 -12032 -26816 -14656 -2756 -15694
4500 -15694 -27302 -50240 -54373 -41922 -23176 -15609 -3907 1253 32111 25056 2863 -744 9461
4487 9461 22537 21620 -3718 -34104 -33733 -19692 -34808 -6458 9162 -10612 -26361 -32192 -17656
4474 -17656 -12245 -576 -744 -7248 -18386 -3404 12233 14157 8701 6671 14290 11363 -21854 -23169
4460 -23169 -14878 -18051 -10743 -20024 -29659 -16996 -1561 -2217 -3863 15153 -4058 -14456 -3506
4447 -3506 -3422 -22759 -24804 -8158 -14644 -22391 -20280 -8793 -113 -12791 -16973 5732 27764 34837
4433 34837 40354 41178 19141 8161 -277 -142 3987 1397 10250 28341 9515 -19576 -6708 8737
4419 8737 2483 16254 27353 25301 32178 18545 17535 33056 31448 32346 14554 -4268 -6820 -8900
4405 -8900 -4406 -5312 -11739 -30132 -43256 -34526 -18501 9899 14614 3695 22382 15806 -3089
4392 -3089 -24414 -20464 -25755 -20146 -8717 1741 5182 7029 8773 20261 15056 -5964 2293 -8032
4378 -8032 -24102 -25440 -19259 -8190 -15505 -15301 -20635 -26487 -16114 -19131 -10442 1207 1810 7155
4364 7155 -2568 -1151 -3624 -3277 -1405 9315 13333 16070 30094 32322 11723 2675 7698 -563
4350 -563 -8882 1940 -20704 -17665 -18314 -39871 -55044 -61373 -42204 -21584 -13085 -16115 -1541 -13760
4336 -13760 -15277 -2489 -10920 -7224 -7662 -5320 1748 1810 -6453 -10345 12413 27064 32009 26892 35963
4321 35963 21383 -8824 -20833 -23499 -13016 -12235 -13366 639 -14721 -25134 -22096 -3855 -3078
4308 -3078 -9307 -16282 -22432 -30421 -16767 -15148 -19183 -17107 -11959 10682 16210 -133 -5186 -22103
4294 -22103 -15667 -28425 -39902 -38851 -31242 -11658 2838 -2479 4894 -10627 -20716 -15108 -3872
4281 -3872 -10347 -7370 589 -5924 -11671 1138 -13358 2902 16722 29757 18384 22465 11313
4268 11313 -6612 -6542 -12988 -2470 -15573 -21847 -24628 -9314 -5879 -2420 10163 25187 23475 17718
4254 17718 21548 8847 1252 12226 22498 7016 -2138 9407 15620 31119 34727 26031 32158
4241 32158 25491 12129 8623 1357 14303 18871 21122 21608 21883 15759 11743 9051 2325 10149 12433
4226 12433 -7812 9045 24478 12150 27641 22235 -6362 -17024 -3032 8457 5826 2502
4214 2502 9887 13042 10745 18776 -6822 -447 24850 31502 18609 16333 2951 -13838 -6930 6297
4200 6297 -1106 -11706 -848 13415 -3 -7818 -7554 19394 23872 25761 21617 7917 -1721 -19933
4186 -19933 -32297 -18231 -4176 1676 -10700 -15960 335 -1765 -11112 -10383 -1846 4981 -6486
4173 -6486 395 -3784 -4106 -20992 -15918 3940 12055 21867 21743 21816 -181 -5986 -7411 -21135 -10331
4158 -10331 -1703 1737 13258 17884 19836 -1762 -14896 -19302 -17889 -10926 -4002 4448 -5215 -11854
4144 -11854 -9204 -3035 -2307 4196 31569 27851 15963 3066 -14832 -3044 21034 14627 -5659
4131 -5659 -7655 -3853 -6156 1230 9237 15062 8531 -1085 -5517 -1877 -3653 7388 14672 3420
4117 3420 2178 -6304 -24293 -9223 5074 -1099 -14984 -22245 -22563 -22160 -10775 85 6370 -490
4103 -490 4741 4943 -4930 -15424 -36248 -31812 -9574 -14088 -24488 -25068 -37072 -35292 -14675 -4541
4089 -4541 -1958 -19760 -29034 -26507 -25517 -11981 10228 23713 14907 9972 3404 2468 -13763 -17523
4075 -17523 -22761 -11660 -4433 -7488 -5430 13891 25939 8578 -6668 -4882 4803 9216 545
4062 545 -1031 1942 7495 3860 -859 -8695 -2894 8769 20856 30035 18603 -4505 -17343 -4664
4048 -4664 -3498 -6631 -14285 -11596 21867 11785 -15729 -20148 -16526 -13490 -5254 -24390 -32563 -41978
4034 -41978 -26543 8700 22148 13271 27384 32052 36920 29964 12225 4857 -845 8150 2902
4021 2902 -2279 -790 2826 -7226 -14663 -5621 -3511 -4122 -2935 10795 15725 10007 1841 -13888
4007 -13888 1068 -1124 -3896 -3080 -6915 -4200 9180 24375 15141 -2312 1147 1196 20255 33201
3993 33201 41289 38017 29779 13289 9019 7668 3865 8947 16655 5085 -155 7509 9937 3205
3979 3205 388 7831 17714 25510 23430 26445 29906 25351 7587 4537 4184 6363 5169 4835 -6187
3964 -6187 -19314 -7199 4968 -4223 -6056 -9326 -24588 -37819 -36438 -36092 -26407 -14935 -9874 -18834
3950 -18834 -35043 -18790 -37658 -42508 -34274 -28015 -11980 -7224 2171 25947 28518 27984 20996 9443
3936 9443 10856 20040 12936 21002 23638 32845 29604 9186 14766 20753 18915 -7517 -14497 -22722
3922 -22722 -24642 -25038 -16167 -216 16386 9692 14852 8178 -15992 5284 8846 -9570 -14119 13027
3908 13027 11131 -4281 -15491 -16201 -8554 -12990 -19561 -10974 -15648 -23808 -28628 -8666 -3349 3111
3894 3111 -7261 -10487 14490 21298 13587 4580 29594 36649 1359 -1387 10355 7741 8387 3588
3880 3588 -2407 -1304 -11440 -5381 300 -2832 2062 2610 2698 4547 15170 40340 40162 29550 9464
3865 9464 5189 -1471 610 -3730 -2432 -8454 -8520 -13388 -10855 -13916 -25412 -22241 -5323 -34 -10390
3850 -10390 -10866 -18265 -40463 -40734 -21669 -16691 -5113 6353 14282 -4460 -18826 -27117 -18904 -9389
3836 -9389 -12027 -27443 -31081 -28289 -21705 -27500 -20281 -14394 -12760 2221 6342 18137 20056 1448
3822 1448 -7607 -3420 -9049 -10785 -1268 15721 14606 -11598 -10961 10869 15713 -1058 -26826 -36971
3808 -36971 -37123 -28779 -18526 7902 2220 -4594 -636 14070 14376 -13165 -29730 -33796 -45267 -11342
3794 -11342 -5811 673 19986 12113 7171 585 -7283 6631 13431 14085 7002 477 9787 3082
3780 3082 -24415 -33213 -34531 -25207 -11892 -3574 -20781 -11030 -1905 -7544 4120 8687 12130 21518
3766 21518 11092 1258 -17255 -21546 -23452 -2152 -21352 -22807 -8175 3896 15516 13639 10180
3753 10180 5734 5289 14634 168 -19777 -14547 -3030 6509 -3485 4769 5641 1514 17712 49309
3739 49309 53862 39673 18661 -9575 -22352 -24930 -6650 5912 -664 -27410 -26162 -7252 -532
3726 -532 -18923 -11091 -8600 -7458 -235 21853 12620 -5255 -415 -1819 -8580 34 6364 4353
3712 4353 7443 5325 1487 -523 -9588 -8904 -21590 -8662 -1181 -16190 -13819 -448 -12002 -30207
3698 -30207 -44659 -35792 -9221 7112 8586 17067 15840 14477 6228 18859 27670 16880 22657
3685 22657 30443 10236 20071 21724 23472 22685 26365 4239 495 2022 6649 16983 10628 13360
3671 13360 12583 11851 14645 18470 16846 2426 2374 13705 21969 9877 5768 14114 12693 15619 16525
3656 16525 22790 23486 28343 28025 13324 9252 8798 5875 -1895 -3548 -9378 -2257 -7268 -10093 -7670
3641 -7670 14004 17904 5156 9608 22729 -1691 -5182 -13782 -28363 -12988 1655 -4982 8213
3628 8213 -5487 -12227 -11455 5847 15185 -7116 -27435 -7996 6642 25935 31938 18243 -15893
3615 -15893 -23598 -8605 -3531 9083 12541 -1416 9964 9937 -5976 3331 18643 18907 19439 17045
3601 17045 10481 -4915 -11912 -8943 5239 -3551 1315 2966 13963 29838 31411 32487 25137 14136
3587 14136 30724 21363 13016 16312 32416 22368 45498 41089 24417 9064 3898 -3874 -10475
3574 -10475 -18300 -6557 -204 16088 18641 19570 25852 22024 8315 -961 5111 -2309 -12548 -1018
3560 -1018 6969 3923 1479 -9826 -7767 -18835 -29500 -20958 -25520 -24248 -18180 -12210 -1787 -7093
3546 -7093 -3353 -4135 13232 34758 37948 25372 -2488 -21222 -19006 -10487 -10340 -12902 -25231 -19834
3532 -19834 -138 -8391 -8916 19088 32002 27226 36463 23625 11557 -9309 -8895 -3106 3216 -5752
3518 -5752 6975 1232 13028 6025 -14169 -8356 -9038 4667 9731 21959 18680 14283 -5002 -12381
3504 -12381 -7757 -8557 -6880 -1003 15128 23445 22482 10615 13966 8594 166 -4934 -4563 10150 29416
3489 29416 37442 29443 31515 34487 31649 20267 19329 12306 -7439 -28408 -34070 -9948 8720 5073
3475 5073 -282 787 10086 -584 -5373 4759 14687 29281 34453 22400 29632 11168 5565 -642
3461 -642 9843 4476 19984 28065 18041 17075 16928 10999 -5119 -4016 -12212 -25436 -27038 -26019
3447 -26019 -10585 2468 12636 13218 16310 22748 5053 8400 2468 -14564 56 8428 -2728
3434 -2728 -18369 8996 16911 15366 -5071 -18403 -6792 -9648 -7373 11553 9777 3401 -3892
3421 -3892 -3307 -7531 1341 15315 10147 -4392 512 21041 21910 17133 30194 25634 14916 3632
3407 3632 -5239 -24720 -24640 -13690 -8414 -2320 4964 2707 -6676 8017 25285 13272 17655 14879
3393 14879 2843 3013 -3428 -543 -7909 -32403 -27550 -7555 -4049 -6328 -26507 -16763 -9204 -14228
3379 -14228 5761 2698 -13456 -18328 6848 2427 -10972 -22123 -7864 4069 5468 -323 -18702
3366 -18702 -25749 -22572 -4091 11088 -4184 -7002 -6511 2853 -4044 -17973 -23966 -4138 12067
3353 12067 11245 -3363 7684 7169 -922 19288 11969 -5449 -5494 -101 10725 24076 41694 32687
3339 32687 4580 -5748 -12479 -15307 -17023 -18100 -11722 -4644 10106 19390 3360 -11510 -8255
3326 -8255 3377 4940 5267 13716 12948 16385 26381 6591 9590 12866 -479 13473 20541 2345
3312 2345 -15152 -20571 -23583 -13033 -14801 -9331 -7317 -7687 3261 13098 12130 20427 24468 22602 15760
3297 15760 9031 8845 6168 8085 5559 3085 3868 -2092 -8463 -17436 -15546 6515 26428 28355 21556
3282 21556 8573 1661 -524 -19200 -23111 -13821 1032 16844 21573 25400 26876 37366 23257
3269 23257 11557 12180 9574 14164 14235 5382 3398 -2422 -8530 1613 4155 7890 16458 742 19237
3254 19237 23784 18826 15575 9439 5405 -4519 -3453 8220 23222 12721 1883 -6683 1554 -6945
3240 -6945 -29004 -41783 -30006 -9487 1712 -363 -5517 -18080 -15719 -14121 -8557 7344 7107
3227 7107 32519 21067 25914 34000 17614 16056 8478 -5613 7294 -6540 163 2251 -8810
3214 -8810 -25538 -28497 -22120 -29215 -38161 -17633 -7713 -10798 -25764 -23757 -13920 -12515 -21671 -12216
3200 -12216 -11445 -19198 -17459 -8131 -8781 -10097 7428 23591 21202 2009 -20614 -31496 -30169 -20287
3186 -20287 -6761 19557 21648 13433 1183 5357 -3231 -25476 -16256 -10137 3854 8113 -11357
3173 -11357 -33436 -24469 -5808 -14725 -11160 -10047 2308 9287 2309 4669 -8838 -14683 -22925 -5142
3159 -5142 26193 14860 13372 14205 20879 38451 47475 23442 8594 18572 26801 9906 6247 34560
3145 34560 22612 4201 16530 25646 13230 18261 1383 -9274 642 12179 17000 21075 22571
3132 22571 19107 13996 9136 26212 33398 27027 47388 62262 41702 13340 17538 13477 23885
3119 23885 30635 30472 19360 17964 16375 11464 -12111 -17912 -10341 9877 25466 26606 24587 1339
3105 1339 -19607 -11084 3792 21215 25916 18434 -7321 -8739 -11396 -3477 11817 774 -11693
3092 -11693 -5080 -3891 -2770 9144 2303 -4396 -11556 -32690 -26871 -24701 -20649 -11192 -6262 -11505
3078 -11505 -13978 -7508 -5032 3379 -14596 -11314 -5301 944 -1090 -3988 -13246 -21032 -7223 -9657
3064 -9657 -14409 -6857 -3307 -319 -4684 -18332 -34918 -35698 -28467 -36862 -40493 -24178 383 28484
3050 28484 27036 10615 10938 -5836 -18890 -13785 -8457 1407 270 -7498 -6063 -1909 4537 -8644
3036 -8644 -18819 -27421 -16760 -19867 -23636 -6962 4013 7012 18692 15409 1806 8974 22226
3023 22226 4350 -870 4132 2769 -22032 -43540 -40953 -6465 21777 31379 17265 4905 -1504
3010 -1504 4170 3988 12073 18651 31151 32752 43654 46308 21968 10594 1113 590 -3884 -22823
2996 -22823 -23081 -26198 -24242 6257 1945 -20049 -34694 -46580 -52506 -47170 -30790 -17387 -19938
2983 -19938 -21497 -28725 -7760 -6972 -7439 -12795 -9661 -2613 1826 6071 -3663 -19788 -6168 -7263
2969 -7263 -15123 -21848 -15651 -2583 11195 30757 22410 -3062 -11897 5504 10148 -3711 -27726
2956 -27726 -28602 -13453 -267 -8773 -9142 -1462 8017 6805 -7545 -3776 12078 17583 10732 18483
2942 18483 3101 11010 15968 2499 -266 5133 -360 -11180 -11938 -3084 -4642 4211 3901 6313
2928 6313 20054 23350 31436 39516 34698 34406 48186 40931 24953 12263 11709 8113 -158 -13302
2914 -13302 -6889 6919 2389 -7079 -7568 20340 29855 31906 30582 27457 12448 5436 7963 3556
2900 3556 10435 19453 11223 9297 3275 -17179 -15436 298 9726 3083 8078 15534 24308 33330
2886 33330 22842 3059 -3242 14392 -928 -10612 -7191 -7039 1305 6600 11274 -4161 -715 4449
2872 4449 7242 10218 -3270 -14681 -7418 18212 23557 -3248 -21542 -18135 -4155 8189 20625
2859 20625 3820 -16252 -1902 18367 20744 15822 33242 31902 6958 -12500 -9090 -6043 5978
2846 5978 14513 -8315 -4499 14559 25452 17400 15471 23105 9648 10654 5719 -8706 -10166 -18621
2832 -18621 -32459 -37189 -26758 -13998 -2402 -3369 -1043 2460 8920 4722 7050 31280 31589 37575
2818 37575 30784 30932 20064 11166 25356 14987 -6893 -8607 17495 25337 11421 -1921 -4412
2805 -4412 -27628 -26078 -14666 -11642 -24976 -28486 -12697 4769 20539 5224 1277 5151 1566
2792 1566 1047 2762 10652 18603 30440 27316 -971 -6306 4783 -2920 3280 5433 13687 6344
2778 6344 24404 30394 23574 15452 13008 14938 32453 31622 15584 1370 7426 2420 -2200 -11412
2764 -11412 -6639 4707 -13234 -31542 -16911 -5008 6917 2150 -33291 -31759 -23331 -16198 3978
2751 3978 -19555 -19419 -8071 -17410 -24113 -30000 -38610 -22652 -115 -1049 7122 13047 1417 -8605
2737 -8605 -6748 -5616 -7668 -7815 -7817 -14773 -21557 -30392 -18514 6645 27139 45113 51578 47849 35573
2722 35573 28511 1148 -17231 -23871 -3339 489 18057 21238 15560 11031 6480 -4114 6888
2709 6888 -2045 -12319 13323 22568 25338 25789 16530 17921 18155 31603 5736 -12930 -11106 -11206
2695 -11206 -3569 972 13343 19399 18763 951 11034 29570 46331 36116 17293 6062 22521
2682 22521 22931 8969 -18576 -34437 -24171 -18176 -11512 -12018 463 -9394 -8098 4668 4210 -17312
2668 -17312 -33858 -16911 -4210 4488 -4647 -16917 -31558 -31794 -27823 -15538 -6745 -11617 -9059
2655 -9059 -10830 -10322 2509 18308 9106 3508 16130 27503 33523 42216 41004 36001 25699 11423
2641 11423 -12152 -14040 -2925 15207 15044 2214 -12069 -19383 -18926 -21724 -14091 7661 9462 -80
2627 -80 -2120 9703 18435 27370 27322 19906 -7535 -12888 -15921 -3266 394 -2471 -7742 -20303 -10286
2612 -10286 4988 -3081 -19653 -24471 -8163 -612 89 16280 12958 11064 7120 21565 18100 -630
2598 -630 -7596 -8451 -331 2647 6414 949 17773 25768 30966 40016 34505 19137 -5793 3510 11377
2583 11377 16889 19532 16618 12122 -17024 -22389 -8290 -6007 13972 35756 22455 11117 13969
2570 13969 6517 -5725 732 7560 977 -14404 -9474 -16563 3416 24205 28963 5274 -12562
2557 -12562 -21400 -6276 -799 -8312 -20514 -39134 -51853 -41675 -30067 -31620 -16787 -12197 -27663
2544 -27663 -29998 -22993 -9231 16063 26052 11585 -1225 4782 -11064 -25554 -7002 17072 33018
2531 33018 35136 23066 32730 24010 7425 -402 16605 14193 10284 -1664 -11648 -12433 -11192 -20428
2517 -20428 -26264 -11400 -709 -7557 -12408 -1155 515 8317 18369 34057 19216 -9755 -18892
2504 -18892 -15592 -14609 -19038 -17743 -23983 -19046 -39492 -48493 -24050 -854 10889 4956 313 -1593
2490 -1593 9648 15473 1049 -7941 -14393 -12240 2185 4874 -10814 -10494 -11066 -18931 -6593 10716
2476 10716 8867 -9747 -9191 -3861 5124 -1390 -7646 -5307 -22726 -22975 -14786 -6435 -3947 -18268
2462 -18268 -30297 -39121 -30966 -11643 9608 5941 -13301 -2694 17383 17058 21466 11973 11446 9878
2448 9878 11088 7508 531 9185 -1713 -397 7951 -2342 -5377 -9764 6425 13619 24307 31480
2434 31480 29460 21167 23048 32882 14443 -8555 -15062 -38933 -38027 -1679 -3501 2000 4655 16516
2420 16516 24783 24419 11249 -1533 -3654 15324 19157 22184 11980 9948 -12819 -19611 -28069 -26759
2406 -26759 -28285 -21795 -12915 -7859 -23564 -25517 -17179 -15317 -15036 -14998 -20035 -14 15028 10810 9522
2391 9522 11661 14131 -2779 697 -3234 3773 3891 11788 19643 3993 3773 -2249 7021 13159 22425
2376 22425 14673 -1303 -22616 -1776 10955 -2054 -15291 -16141 348 7657 12509 11329 8921
2363 8921 20538 9504 -13989 -33268 -27473 -7094 528 -2706 -23391 -39270 -41160 -27077 -18804
2350 -18804 -9492 -4632 -13116 -19271 -24975 -41123 -35118 -15203 -4836 9404 8692 4170 23382 26752
2336 26752 33573 39264 33797 36919 30205 29994 19901 16969 -3210 -27646 -30349 -13545 5776 9349
2322 9349 3435 30 12601 17202 -8893 -6821 -57 -3006 -15305 -37460 -34741 -2822 8256
2309 8256 -2940 1500 12336 -925 13666 16580 17013 14447 2702 -1571 12817 16906 21585 14967
2295 14967 23030 18696 22640 6613 -14534 -11200 -25201 -26050 -219 22380 23955 23298 23652 24277
2281 24277 -2326 -8638 -1620 12507 11170 3627 -7535 6261 8362 10820 7337 15845 13945 13417
2267 13417 5165 -3159 -4352 1907 2754 4591 14083 24208 27123 25050 32872 10204 -5261 -1830
2253 -1830 3535 12151 9872 22277 27092 3293 -5065 -9209 6681 4608 1534 17838 32678 24561
2239 24561 21962 24982 17756 20778 28531 29108 13848 5566 -2173 -10820 -15666 -10667 -13652 -31535
2225 -31535 -12852 20 2211 9102 6577 24316 11159 6006 2774 -788 16352 27987 19102
2212 19102 7648 1365 9947 -652 -28282 -10574 -13 1872 23159 19279 -80 -12311 -7349
2199 -7349 -8267 -17121 -24079 -15574 -17230 -14959 -14765 -1126 7260 -5928 -2788 -2127 -7553 -4147 -1214
2184 -1214 -11580 -8362 -11684 -3481 3575 4956 4941 -787 -23067 -22940 -34266 -26637 592 21404
2170 21404 31975 31281 22395 15678 5791 604 -13238 -17378 177 19399 5546 782 -5408 381
2156 381 -8026 -16685 -19599 -24211 -20692 6989 11117 -4623 -4246 -7103 -9495 3271 18064 32935
2142 32935 31266 19654 31197 23878 -1503 -1964 19609 17547 36692 28536 13774 -8897 -3967
2129 -3967 7677 5388 1924 -13945 -5742 6261 10358 5578 -4632 -31133 -24990 -8084 -692
2116 -692 -725 6954 7207 19286 16147 4402 -7757 -295 18007 20490 5478 -1708 5686 -10854
2102 -10854 -10008 2528 -7960 -167 20376 12312 8174 1159 5295 -4611 -21533 -14298 4765 10507
2088 10507 18196 24842 38698 27217 360 -10647 -14900 -17979 -15463 -7634 937 16204 13523
2075 13523 -3791 -4495 1023 697 -702 4439 11528 4976 9172 7324 6475 14109 17105 15633 19891
2060 19891 -4879 -19527 -18149 -2009 19571 15153 14123 11792 6535 -962 -3452 1898 20391
2047 20391 44497 54834 36474 35442 33951 35504 47398 44516 33499 23483 29885 26031 22758
2034 22758 554 -35274 -40230 -35083 -27084 -26093 -16993 -8414 9650 34916 28936 9930 19230 5451
2020 5451 -7060 -906 2827 3112 -8567 -6044 -5213 11545 25988 23151 45657 43540 26529 4579
2006 4579 -8352 -6154 -21594 -15409 -20401 -26373 -37485 -25137 -17173 -7202 -20259 -20679 -9500 -13362
1992 -13362 -7355 3404 23007 12643 -23629 -47541 -32454 -6905 -135 -25830 -42055 -17128
1980 -17128 9543 -2407 -17538 1128 -4057 -8923 20518 33301 12413 -8227 4572 28997
1968 28997 22468 2980 -5216 21456 29508 31740 45481 38675 19076 16697 19740 34410 12405
1955 12405 4354 9479 17229 15399 -968 -5297 -1945 3400 1227 -5177 7422 31538 34565 7331
1941 7331 -13608 -11249 -1128 -10800 -20892 -14247 -13952 -17754 -8896 22578 20124 -1381 -24584 -31619
1927 -31619 -40637 -20411 -8045 -2359 8458 -3047 -12758 -18966 -13084 3035 31644 34488 22508
1914 22508 5685 -18569 -28753 -24373 4587 17938 24952 11910 -22719 -14822 5992 -904 2739
$$ [...]
##END NTUPLES=NMR SPECTRUM
##END=
