##TITLE=Analysis number 327483
Compound Code cc 24118
Book Reference 242255
Project Code adrs flro3
Chemist Name jom
##JCAMPDX= 6.0         $$ Bruker NMR JCAMP-DX V2.0
##DATA TYPE= NMR SPECTRUM
##DATA CLASS= NTUPLES
##ORIGIN= Bruker BioSpin GmbH
##OWNER= nmr
$$ XWIN-NMR		Version 3.5
$$ Tue Mar 27 11:02:00 2007 GMT Daylight Time (UT+1h)  MAYBRIDGE\nmr@NMR_250MHZ
##.OBSERVE FREQUENCY= 250.131544655141
##.OBSERVE NUCLEUS= ^1H
##.ACQUISITION MODE= SIMULTANEOUS (DQD)
##.ACQUISITION SCHEME= undefined
##.AVERAGES= 16
##.DIGITISER RES= 18
##SPECTROMETER/DATA SYSTEM= dpx250
##.PULSE SEQUENCE= zg30
##.SOLVENT NAME= DMSO
##.SHIFT REFERENCE= (INTERNAL, DMSO, 0, 16.522)
##AUDIT TRAIL= $$ (NUMBER, WHEN, WHO, WHERE, WHAT)
$$ ##TITLE= Audit trail, XWIN-NMR		Version 3.5
$$ ##JCAMPDX= 5.01
$$ ##ORIGIN= Bruker BioSpin GmbH
$$ ##OWNER= nmr
$$ C:\u/data/dgb/nmr/ADRS/2130/pdata/1/auditp.txt
$$ ##AUDIT TRAIL=  $$ (NUMBER, WHEN, WHO, WHERE, WHAT)
(   1,<2007-03-27 11:01:35.83 +100>,<MAYBRIDGE\nmr>,<NMR_250MHZ>,
      <created by zg, POWCHK disabled, PULCHK disabled
       configuration hash MD5:
       49 4B E0 1D 92 C2 6B 37 9F E6 65 BC 52 41 86 1D
       data hash MD5: 64K
       60 D1 BB 50 82 E1 67 5B EA 7E B5 02 08 FB EF 27>)
(   2,<2007-03-27 11:01:50.69 +100>,<MAYBRIDGE\nmr>,<NMR_250MHZ>,
      <Start of raw data processing
       ef LB = 0.3 FT_mod = 6 PKNL = 1 SI = 32K 
       data hash MD5: 32K
       0F EB D4 D8 37 F0 B4 20 DD A4 C7 69 76 73 4A 69>)
(   3,<2007-03-27 11:01:52.30 +100>,<MAYBRIDGE\nmr>,<NMR_250MHZ>,
      <apk 
       data hash MD5: 32K
       6E 5D 1E EE 29 8A FF 4A 56 35 EE D7 F9 40 74 8B>)
(   4,<2007-03-27 11:01:53.02 +100>,<MAYBRIDGE\nmr>,<NMR_250MHZ>,
      <abs ABSG = 5 
       data hash MD5: 32K
       37 AD 5A D5 42 6C F6 FC F8 FB 5B 21 67 0E 2E 74>)
$$ ##END=
$$ 
$$ hash MD5
$$ 34 ED 31 28 16 E1 D0 AA 6B FA BC A2 59 A6 21 D5
##$RELAX= 
##$RELAX= 
##$RELAX= 
##$RELAX= 
##$RELAX= 
##$RELAX= 
##$RELAX= 
$$ Bruker specific parameters
$$ --------------------------
##$DU= <C:\u>
##$EXPNO= 2130
##$NAME= <ADRS>
##$PROCNO= 1
##$TYPE= <nmr>
##$USER= <dgb>
##$AMP= (0..31)
100 100 100 100 100 100 100 100 100 100 100 100 100 100 100 100 100 100 
100 100 100 100 100 100 100 100 100 100 100 100 100 100 
##$AQSEQ= 0
##$AQ_mod= 3
##$AUNM= <au_zg>
##$AUTOPOS= <15 >
##$BF1= 250.13
##$BF2= 250.13
##$BF3= 250.13
##$BF4= 250.13
##$BF5= 500.13
##$BF6= 500.13
##$BF7= 500.13
##$BF8= 500.13
##$BYTORDA= 1
##$CFDGTYP= 0
##$CFRGTYP= 5
##$CHEMSTR= <none>
##$CNST= (0..31)
1 1 145 1 1 1 1 1 1 1 1 1 1 1 1 1 1 1 1 1 1 1 1 1 1 1 1 1 1 1 1 1 
##$CPDPRG= <>
##$CPDPRG1= <>
##$CPDPRG2= <>
##$CPDPRG3= <>
##$CPDPRG4= <mlev>
##$CPDPRG5= <mlev>
##$CPDPRG6= <mlev>
##$CPDPRG7= <mlev>
##$CPDPRG8= <mlev>
##$CPDPRGB= <>
##$CPDPRGT= <>
##$D= (0..31)
0 1 0 0 0 0 0 0 0 0.06 0 0 0 0 0 0 0.0002 0 0 0 0 0 0 0 0 0 0 0 0 0 0 
0 
##$DATE= 1174989694
##$DBL= (0..7)
120 120 120 120 120 120 120 120 
##$DBP= (0..7)
150 150 150 150 150 150 150 150 
##$DBP07= 0
##$DBPNAM0= <>
##$DBPNAM1= <>
$$ [...]
##$SUBNAM7= <"">
##$SUBNAM8= <"">
##$SUBNAM9= <"">
##$SW= 20.6930455092707
##$SWIBOX= (0..15)
0 0 3 0 0 0 0 0 0 0 0 0 0 0 0 0 
##$SW_h= 5175.983436853
##$TD= 65536
##$TD0= 1
##$TE= 683.16
##$TE2= 300
##$TE3= 300
##$TEG= 300
##$TL= (0..7)
0 120 120 120 120 120 120 120 
##$TP= (0..7)
150 150 150 150 150 150 150 150 
##$TP07= 0
##$TPNAME0= <>
##$TPNAME1= <>
##$TPNAME2= <>
##$TPNAME3= <>
##$TPNAME4= <>
##$TPNAME5= <>
##$TPNAME6= <>
##$TPNAME7= <>
##$TPOAL= (0..7)
0.5 0.5 0.5 0.5 0.5 0.5 0.5 0.5 
##$TPOFFS= (0..7)
0 0 0 0 0 0 0 0 
##$TUNHIN= 0
##$TUNHOUT= 0
##$TUNXOUT= 0
##$USERA1= <user>
##$USERA2= <user>
##$USERA3= <user>
##$USERA4= <user>
##$USERA5= <user>
##$V9= 5
##$VALIST= <valist>
##$VCLIST= <CCCCCCCCCCCCCCC>
##$VD= 0
##$VDLIST= <DDDDDDDDDDDDDDD>
##$VPLIST= <PPPPPPPPPPPPPPP>
##$VTLIST= <TTTTTTTTTTTTTTT>
##$WBST= 1024
##$WBSW= 4
##$XGAIN= (0..3)
0 0 0 0 
##$XL= 0
##$YL= 0
##$YMAX_a= 239798
##$YMIN_a= -348520
##$ZGOPTNS= <>
##$ZL1= 120
##$ZL2= 120
##$ZL3= 120
##$ZL4= 120
##$ABSF1= 16.522
##$ABSF2= -4.171173
##$ABSG= 5
##$ABSL= 3
##$ALPHA= 0
##$AQORDER= 0
##$ASSFAC= 0
##$ASSFACI= 0
##$ASSFACX= 0
##$ASSWID= 0
##$AUNMP= <proc_1d>
##$AZFE= 0.1
##$AZFW= 0.1
##$BCFW= 0
##$BC_mod= 0
##$BYTORDP= 0
##$COROFFS= 0
##$CY= 12.5
##$DATMOD= 1
##$DC= 0
##$DFILT= <>
##$DTYPP= 0
##$F1P= 14.0000005364418
##$F2P= -0.99999901652339
##$FCOR= 0.5
##$FTSIZE= 32768
##$FT_mod= 6
##$GAMMA= 0
##$GB= 0
##$INTBC= 1
##$INTSCL= 1
##$ISEN= 128
##$LB= 0.3
##$LEV0= 0
##$LPBIN= 0
##$MAXI= 10000
##$MC2= 0
##$MEAN= 0
##$ME_mod= 0
##$MI= 0
##$NCOEF= 0
##$NC_proc= -4
##$NLEV= 6
##$NOISF1= 0
##$NOISF2= 0
##$NSP= 0
##$NTH_PI= 0
##$NZP= 0
##$OFFSET= 16.522
##$PC= 1
##$PHC0= 220.6891
##$PHC1= 11.39934
##$PH_mod= 1
##$PKNL= yes
##$PPARMOD= 0
##$PSCAL= 4
##$PSIGN= 0
##$REVERSE= no
##$SF= 250.13
##$SI= 32768
##$SIGF1= 0
##$SIGF2= 0
##$SINO= 400
##$SIOLD= 32768
##$SREGLST= <1H.DMSO>
##$SSB= 0
##$STSI= 32768
##$STSR= 0
##$SW_p= 5175.98343685301
##$SYMM= 0
##$S_DEV= 0
##$TDeff= 65536
##$TDoff= 0
##$TI= <Analysis number 999999
Compound Code 99
Book Reference 9
Project Code 9>
##$TILT= no
##$TM1= 0
##$TM2= 0
##$TOPLEV= 0
##$USERP1= <user>
##$USERP2= <user>
##$USERP3= <user>
##$USERP4= <user>
##$USERP5= <user>
##$WDW= 1
##$XDIM= 32768
##$YMAX_p= 518308366
##$YMIN_p= -1321135
$$ End of Bruker specific parameters
$$ ---------------------------------
##NTUPLES= NMR SPECTRUM
##VAR_NAME=  FREQUENCY,     SPECTRUM/REAL,   SPECTRUM/IMAG
##SYMBOL=    X,             R,               I
##VAR_TYPE=  INDEPENDENT,   DEPENDENT,       DEPENDENT
##VAR_FORM=  AFFN,          ASDF,            ASDF
##VAR_DIM=   32768,         32768,           32768
##UNITS=     HZ,            ARBITRARY UNITS, ARBITRARY UNITS
##FACTOR=    0.157963299565203, 1,           1
##FIRST=     4132.6476996994, 0,             0
##LAST=      -1043.33573715361, 0,           0
##MIN=       -1043.33573715361, -1321135,    0
##MAX=       4132.6476996994, 518308366,     0
$$ Real data points
##PAGE= N=1
##DATA TABLE= (X++(R..R)), XYDATA
$$ [...]
17482F577930J050923J837527K942061M542828N974917N578281K953431k57751
$$ 6577930 7628853 9466380 12408441 16951269 22926186 28504467 31457898 31200147
17474C1200147O6930K469145L000433P82708j264148j193141j945270l439472
$$ 31200147 31267077 33736222 36736655 37519363 36255215 35062074 33116804 29677332
17466B9677332k581863l12921M38783k689094n957318n505214l757751k454210
$$ 29677332 27095469 26782548 27221331 24532237 18574919 13069705 9311954 6857744
17458F857744j609413j023420o65801m67740l97516k90142k98541l08227j65737
$$ 6857744 5248331 4224911 3559110 3091370 2693854 2403712 2105171 1796944 1631207
17449A631207j36798k7491l2267o9127o8177j47166j22052q3262n2899n5903m4711
$$ 1631207 1494409 1466918 1434651 1365524 1297347 1150181 1028129 944867 891968 836065 791354
17438G91354j10226J247m3497l3906o1133m7704K1302N397l5879q4386j3963M9668
$$ 791354 681128 682375 638878 604972 543839 496135 517437 522834 486955 402569 388606 438274
17426D38274k6727o5839N9962k5697k1056k5093o3464m5049K5140J0838M8746
$$ 438274 411547 345708 405670 379973 358917 333824 270360 225311 250451 261289 310035
17415C10035k3763j9540k5137m8098m2463j7897R206K5268K4248O1679L9097k2011
$$ 310035 286272 266732 241595 193497 151034 133137 142343 167611 191859 253538 292635 270624
17403B70624p675o4206j2010L6872L3320Q443j7615m9687K3038J8157J9548P2583
$$ 270624 262949 198743 186733 223605 256925 265368 247753 198066 221104 239261 258809 331392
17391C31392k7677p3459l4831R619L4820L3392M0865q0497l3026J2915j9721R403
$$ 331392 303715 230256 195425 205044 239864 273256 314121 233624 200598 213513 193792 203195
17379B03195J5178k9096P9077L6656m2347l9231j26035l7099J07223r227m6237
$$ 203195 218373 189277 268354 305010 262663 223432 97397 60298 167521 158294 112057
17368A12057q633m3088L5967L9296J28467J06523L1083l812j34448o3789j7999
$$ 112057 103424 60336 96303 135599 264066 370589 401672 397860 263412 199623 181624
17357A81624o8974j2653L2660q8853J5571J4801j6954N6372Q0397M8684P9568
$$ 181624 112650 99997 132657 43804 59375 74176 57222 113594 193991 242675 322243
17346C22243l1850j5474N484l1855l7902K3017l6628l8262m2487n5699m9321L3694
$$ 322243 290393 274919 280403 248548 210646 233663 197035 158773 116286 60587 11266 44960
17334D4960N6579J5674J5114k7229k5649L2224l4696J8997Q375l6125q2859m0024
$$ 44960 101539 117213 132327 105098 79449 111673 76977 95974 104349 68224 -14635 -54659
17322e4659N6322R899r851O7565j9925j3721p0351l6332L2504L5060M1671m8670
$$ -54659 1663 11562 1711 69276 49351 35630 -34721 -71053 -38549 -3489 38182 -10488
17310a0488n1074R0288L6092k7717n0208J2406M4057k8061O1075Q7161j8161K1891
$$ -10488 -61562 28726 64818 37101 -13107 -701 43356 15295 76370 163531 145370 167261
17298A67261p6433r1330L4469k0051k7328n561L4656o7425J1861Q0574Q1815O790
$$ 167261 90828 -502 33967 13916 -13412 -18973 15683 -51742 -39881 40693 122508 129298
17286A29298m9021l6769l1093L0981n2550l7947M3069j3863l6276L5479L9834
$$ 129298 80277 43508 12415 43396 -9154 -47101 -4032 -17895 -54171 -18692 21142
17275B1142L8177M5052n0246K209M5042j6857k5370k2795k1055Q366M7191m3734
$$ 21142 59319 104371 54125 56334 101376 84519 59149 36354 15299 23665 70856 27122
17263B7122j44p3478m0927M2678N3556o8343o610Q0624J4598n3256J1017l1897
$$ 27122 26978 -46500 -87427 -44749 8807 -59536 -66146 14478 29076 -24180 -13163 -45060
17251d5060n7047l3840N3623j0612j5506J2486L414k4683l4151p980R2463Q2749
$$ -45060 -102107 -135947 -82324 -92936 -108442 -95956 -92542 -117225 -151376 -159356 -66893 15856
17239A5856Q921O0383r477k2759l2941j29115m6473J300p6674q6319Q0691J68511
$$ 15856 24777 85160 75683 52924 19983 -109132 -155605 -154305 -230979 -317298 -236607 -68096
17227f8096N3780J07890P428n4620o3470L4801n873l9938Q787M048k0366r3274
$$ -68096 -14316 93574 101002 46382 -17088 17713 11840 -28098 -19311 -15263 -35629 -128903
17215a28903J0731O5244L8673M4408l1707j5404O7302k9244O7059O8120m2195
$$ -128903 -118172 -52928 -14255 30153 -1554 -16958 50344 21100 88159 156279 114084
17204A14084l2161o8987j27321j198L9856J5450J9463o81L1947K8846N7265m27
$$ 114084 81923 12936 -114385 -115583 -75727 -60277 -40814 -41495 -9548 19298 76563 76136
17192G6136K4135K9379M8569P8450p8561l0422k6630m3875k0775k5743J2758K8955
$$ 76136 100271 129650 178219 256669 178108 147686 121056 77181 56406 30663 43421 72376
17180G2376n2903l2546q5164L0140L0043N7597K6665l1349k4554P6844Q0091k233
$$ 72376 19473 -13073 -98237 -68097 -38054 19543 46208 14859 -9695 67149 147240 145007
17168A45007p7790q6074k0406P5948O2321j0995N4580O5275L7952r9475o8623
$$ 145007 67217 -18857 -39263 36685 99006 88011 142591 207866 245818 146343 77720
17157G7720m7306L1595j9233m4628L2005K1405L5204M6284j7426j2426O3744J28336
$$ 77720 30414 62009 42776 -1852 30153 51558 86762 133046 115620 103194 166938 295274
17145B95274o6876m0606p264k1208J3156m0188M689Q234j78273q0921J3663L0780
$$ 295274 228398 187792 180528 159320 172476 132288 136977 145211 -33062 -113983 -100320 -69540
17133f9540N8708K3990k5475m4346J8323r5037K8985K086o696J7820J43486O7996
$$ -69540 -10832 13158 -12317 -56663 -38340 -133377 -104392 -102306 -109002 -91182 52304 120300
17121A20300l1339j20026K8464K083N704N6270m9748m5943K9464q192m4857K5110
$$ 120300 88961 -31065 -2601 -518 5186 61456 11708 -34235 -4771 -12963 -57820 -32710
17109c2710J148R869j1631N360l670K497K957m8554J06436J7605q0914K2343p580
$$ -32710 -31562 -21693 -33324 -27964 -31634 -29137 -26180 -74734 31702 49307 -31607 -9264 -16844
17096a6844j0607L4327M8607R7760l5942p9814j23938p6107Q7354k0289R247M3441
$$ -16844 -27451 6876 55483 153243 117301 37487 -86451 -162558 -75204 -95493 -86246 -42805
17084d2805l2265J165M8711K4123k0353m399R3933L3206p2397q6243k8450j9500
$$ -42805 -75070 -73905 -25194 -1071 -21424 -25823 68110 101316 28919 -57324 -85774 -105274
17072a05274k9400Q6269m243L7939O8732m8501j9100k0629n4094j2975k0718k3052
$$ -105274 -134674 -48405 -52648 -14709 54023 5522 -13578 -34207 -88301 -101276 -121994 -145046
17060a45046j7551J713K1295r813O806J11223J37037n0061j39721q097k1866J09123
$$ -145046 -162597 -160884 -139589 -149402 -142596 -31373 105664 55603 -84118 -92215 -114081 -4958
17048d958k4044o5464L7585p5971N7228Q9791m8067r1937l0794K9648P5711N3073
$$ -4958 -29002 -94466 -56881 -132852 -75624 14167 -33900 -125837 -156631 -126983 -51272 1801
17036A801O4984k1178k9943J21624o947r9382q140K8064k3238l6322N0114P713
$$ 1801 66785 45607 15664 137288 130341 30959 22819 50883 27645 -8677 41437 49150
17024D9150q2653j3548R2188J06462j7299p8919k7729K8681M8975M2208O2424
$$ 49150 -33503 -47051 45137 151599 134300 55381 27652 56333 105308 147516 209940
17013B09940N1815k4913l8242K783p642J7764l2255l4970J04096M7793m4576r5116
$$ 209940 261755 236842 198600 201383 193741 211505 179250 144280 248376 296169 251593 156477
17001A56477j18603n5107p9098m3012J31054J4443K7200L7229j9612n0013j4816
$$ 156477 37874 -17233 -96331 -139343 -8289 6154 33354 70583 50971 958 -13858
16990a3858Q1389j6245J4331O9552r4967r8582k3010Q4138M973J0137k8793o664
$$ -13858 67531 51286 65617 135169 40202 -58380 -81390 2748 7721 17858 -10935 -17599
16978a7599k7175J3607l7970l6226J0325L5806l1311m4922Q2656j4522j674O6694
$$ -17599 -44774 -31167 -69137 -105363 -95038 -59232 -90543 -135465 -52809 -67331 -69005 -2311
16966b311R5611J13679l4638n5417k4340N9960j3232M0227J8298K80Q2808m4254
$$ -2311 93300 206979 172341 116924 92584 152544 139312 179539 197837 198117 280925 236671
16954B36671o9493n0410n8674k4125j7101L5258l7811L6372N3655l6335n0205
$$ 236671 167178 116768 58094 33969 16868 52126 14315 50687 104342 68007 17802
16943A7802p1344k5655J0685K7303N2372J12145L9981m4349L0544n7107q3869
$$ 17802 -53542 -79197 -68512 -41209 11163 123308 163289 118940 149484 92377 8508
16932H508j5861L8712P0419q4793l4419M7695J13370m7265q9303j8285J2919R3314
$$ 8508 -7353 31359 101778 16985 -17434 30261 143631 96366 7063 -11222 1697 95011
16920I5011n827p1462j6233K2100m7795L2354R0549N6864o2276J5420J4368j01778
$$ 95011 89184 17722 1489 23589 -24206 8148 98697 155561 93285 108705 123073 21295
16908B1295j11614K4786J15932O3697p0531o2257L2804O3686J3934o3770n1291
$$ 21295 -90319 -65533 50399 114096 43565 -18692 14112 77798 91732 27962 -23329
16897b3329l4640k0742k2709o5353M6109K4273n8296N7629J7016J4688K050n5777
$$ -23329 -57969 -78711 -101420 -166773 -120664 -96391 -154687 -97058 -80042 -65354 -63304 -119081
16885a19081o5290Q4119Q2894J2446j08452o9710m1757K1265R2263Q4286K8567
$$ -119081 -184371 -100252 -17358 -4912 -113364 -183074 -224831 -203566 -111303 -27017 1550
16874A550m7295m0909J6514J32171j8824p5118o8135m1569j5391L2683N8316L8168
$$ 1550 -45745 -86654 -70140 62031 43207 -31911 -100046 -141615 -157006 -124323 -66007 -27839
16862b7839o2163J05610M2771K3280o836J9755K0140J6070m3758q0886m9501K187
$$ -27839 -90002 15608 58379 81659 74823 94578 114718 130788 87030 6144 -43357 -41170
16850d1170k6280m1699J0196k247n5377j5689P5042Q9658M7856Q11r2949j0273
$$ -41170 -67450 -109149 -98953 -101200 -156577 -172266 -97224 -7566 40290 41101 -51848 -62121
16838f2121N4927j00279L5398Q0114L663K379j09317n1328K650l933m7748j7177
$$ -62121 -7194 -107473 -72075 8039 11702 14081 -95236 -146564 -143914 -147847 -195595 -212772
16826b12772P0065Q0563k1144m7412k2081M3644q8241j3453Q7525J07489k1618
$$ -212772 -142707 -62144 -83288 -130700 -152781 -109137 -197378 -210831 -123306 -15817 -37435
16815c7435r4183Q9706J7165l326m0952j06639J8648J4577J9810R206P9040M9892
$$ -37435 -131618 -41912 -24747 -28073 -69025 -175664 -157016 -142439 -122629 -113423 -34383 15509
16803A5509k2601l1245m9431q488n0415k6212R8286P5500n3116l3911O6954O5431
$$ 15509 -7092 -38337 -87768 -96256 -146671 -172883 -74597 903 -52213 -86124 -19170 46261
16791D6261J212q5944L1267O2600p7371J6565J2221J6365j08300m8012L7386j1178
$$ 46261 47473 -38471 -7204 55396 -21975 -5410 6811 23176 -85124 -133136 -95750 -106928
16779a06928J9045l3887P5429k67n2264q0703n0318n2139Q90M9374P8026Q3398
$$ -106928 -87883 -121770 -46341 -46608 -98872 -179575 -229893 -282032 -281142 -231768 -153742 -70344
16767g0344j3103N531q313j34371J05426M9712o0842L3666P8273l2583p7558l3815
$$ -70344 -83447 -77916 -86229 -220600 -115174 -65462 -126304 -92638 -14365 -46948 -124506 -158321
16755a58321M2931j8428q2336N7123Q6358j1379r3466n360Q3549M7641J9611n7300
$$ -158321 -115390 -133818 -216154 -159031 -72673 -84052 -177518 -182878 -99329 -51688 -32077 -89377
16743h9377L0056j4610o3494M2444J00427k0639K550J5506k1755m7752K1877j3085
$$ -89377 -59321 -73931 -137425 -94981 5446 -15193 -12643 2863 -18892 -66644 -44767 -57852
16731e7852k7174n1679K6867J2957J412j4972P9354N0633k8892M9536K6659m0482
$$ -57852 -85026 -136705 -109838 -96881 -95469 -110441 -31087 19546 -9346 40190 66849 26367
16719B6367q2578J2997m1253j4813q9640n5418j5188j127r671M7650N169M3971
$$ 26367 -56211 -43214 -84467 -99280 -188920 -244338 -259526 -260653 -270324 -222674 -217505 -173534
16707a73534Q1811l9992K1821k8206l7325L8899p5911O059N3939j5189L6730k3997
$$ -173534 -91723 -131715 -109894 -138100 -175425 -136526 -212437 -206378 -152439 -167628 -130898 -154895
16695a54895J2055K9500L282j8776l0396Q0319p3175o2849O7932M7601K0446J61893
$$ -154895 -142840 -113340 -110058 -128834 -159230 -78911 -152086 -214935 -147003 -99402 -78956 82937
16683H2937j2955k9979n3997r8282j6783J9627P3181l9095q1361l2745K837k2881
$$ 82937 69982 40003 -13994 -112276 -129059 -109432 -36251 -75346 -156707 -189452 -186615 -209496
16671b09496j954J7759L7166R2825O9430J2060k2703J2168K4028m1307l2325j6711
$$ -209496 -211450 -193691 -156525 -63700 5730 17790 -4913 7255 31283 -10024 -42349 -59060
16659e9060p8747K5214L1575P6599k2471l5737l5878L1832J7150j2018R618K5955
$$ -59060 -137807 -112593 -81018 -4419 -26890 -62627 -98505 -66673 -49523 -61541 -51923 -25968
16647b5968K1279J7822L2347P466q1753k0351R9589R6715n2912r2088q5265K5989
$$ -25968 -4689 13133 45480 52946 -28807 -49158 50431 147146 94234 2146 -83119 -57130
16635e7130j8242J3483q0271L4186j0459K8733Q7255n2746l5182k1513N0151K9736
$$ -57130 -75372 -61889 -142160 -107974 -118433 -89700 -2445 -55191 -90373 -111886 -61735 -31999
16623c1999P2626J9698l0131m5405k5261l7741l242N3791p4917N7054R4850k1710
$$ -31999 40627 60325 30194 -15211 -40472 -78213 -81455 -27664 -102581 -45527 49323 27613
16611B7613j5763k2632m3636r3k8404Q0151K2873k0703J10330M3207r5533j04717
$$ 27613 11850 -10782 -54418 -54511 -82915 -2764 20109 -594 109736 152943 57410 -47307
16599d7307l1319j062n2602N2367L0072K0290m1346k6214l2189O1534P264k0745
$$ -47307 -78626 -79688 -132290 -79923 -49851 -29561 -70907 -97121 -129310 -67776 -60512 -81257
16587h1257j02150n900O0312J0065Q2158J4456r3051m6519L2625L7721N9168N8292
$$ -81257 -183407 -189307 -128995 -118930 -36772 -22316 -115367 -161886 -129261 -91540 -32372 25920
16575B5920L3963o1015p2094j14982L0543J25679k128k439m5060n6676k8910N9149
$$ 25920 59883 -1132 -73226 -188208 -157665 -31986 -34114 -36553 -81613 -138289 -167199 -108050
16563a08050j0172n51k5784k3148K3605J5931j085q4572K9930P5547O3595k2019
$$ -108050 -118222 -118773 -144557 -167705 -144100 -128169 -129254 -213826 -183896 -108349 -44754 -66773
16551f6773J2099M7820m6004m0146K515K4677K7333L8015l7918l4292L6190L0457
$$ -66773 -54674 -6854 -52858 -93004 -90489 -65812 -38479 -464 -38382 -72674 -36484 -6027
16539f027l4031M850m1486o1285R728j1302P7155P9449R4585K0990o8972j4312
$$ -6027 -40058 -35208 -76694 -137979 -128251 -139553 -62398 17051 111636 132626 63654 49342
16527D9342R500j13219o7700K1267k9786k0548P4556M604l8748O5310M0133r77
$$ 49342 58842 -54377 -122077 -100810 -130596 -151144 -76588 -71984 -110732 -45422 -5289 -6266
16515f266N9850K330q1911j5184J6060o4842n707J6412O7724J1938j8706N676
$$ -6266 53584 55914 -25997 -41181 -25121 -89963 -95670 -79258 -11534 404 -18302 -12626
16503a2626j7369m5777o630q32K4321l2975N0470P7437L7360M4780m2085j12283
$$ -12626 -29995 -75772 -82402 -83234 -58913 -91888 -41418 36019 73379 118159 76074 -36209
16491c6209M2734M5608m6870J571N323P773J2798n1324k5464P8771M479j9304
$$ -36209 6525 52133 5263 6834 12157 19930 32728 -18596 -44060 34711 39190 19886
16479A9886j12396O7626R5490l2252k1767m0352p6345q3313m1670N8327M2839
$$ 19886 -92510 -24884 70606 38354 16587 -23765 -100110 -183423 -225093 -166766 -123927
16468a23927J8805O6752R389J8965P294J140p331j9713K4087j7344K4756l5369
$$ -123927 -105122 -38370 -28981 -10016 -2722 -1582 -8913 -28626 -4539 -21883 2873 -32496
16456c2496p6096m867L4804j6148m008L4696M2189l155k1272J8003N8864j8892
$$ -32496 -108592 -113459 -78655 -94803 -98811 -64115 -21926 -25081 -46353 -28350 30514 11622
16444A1622j48913o944j3785k4036l5858r538P8179J8680l3204L7845O4501P2682
$$ 11622 -137291 -144235 -158020 -182056 -217914 -227452 -149273 -130593 -163797 -125952 -61451 11231
16432A1231p729k8969j0845K1481R131Q068p4845K91J7631j8538m5763n0644n6577
$$ 11231 3502 -25467 -36312 -14831 -5700 2368 -72477 -72186 -54555 -73093 -118856 -169500 -226077
16419b26077K9881j6937p92J4755N370P7639R7908j8132n7774K8605J18582O7330
$$ -226077 -196196 -213133 -213925 -199170 -193800 -116161 -18253 -36385 -94159 -65554 53028 120358
16407A20358r5596j79458m7160M6652N7889M2965M5180m3490r4622k9936L6837
$$ 120358 24762 -154696 -201856 -155204 -97315 -54350 -9170 -52660 -147282 -177218 -140381
16396a40381P7097K3072Q375k2593l8947k4987L1303L5324m8716j6495N0359k3662
$$ -140381 -63284 -40212 -31837 -54430 -93377 -118364 -87061 -51737 -100453 -116948 -66589 -90251
16384i0251m7235L3203J04793J4465k4892k5569L0952M8786r3833p3822q8841
$$ -90251 -137486 -104283 510 14975 -9917 -35486 -4534 44252 -49581 -123403 -212244
16373b12244l060K6348P2741J19070J1038l2539k0843q9639j1046P4879r369r4561
$$ -212244 -215304 -188956 -116215 2855 13893 -18646 -39489 -129128 -140174 -65295 -74664 -169225
16361a69225n6506R027L5125P0892o958l5321J7862Q4058J6402p63m761r455N5831
$$ -169225 -225731 -216704 -181579 -110687 -117645 -152966 -135104 -51046 -34644 -35407 -40168 -49623 6208
16348F208N7586K0642q9391j38744m1583J4224L3213O2795O2130n174n4009M8538
$$ 6208 63794 84436 -4955 -143699 -185282 -171058 -137845 -75050 -12920 -18094 -72103 -23565
16336b3565k9721L7413m4605p8023o8023m2016o926N5379P4458P952k3259n0394
$$ -23565 -53286 -15873 -60478 -138501 -206524 -248540 -255466 -200087 -125629 -117677 -140936 -191330
16324a91330N7907M1345R867L1685L3160K6303n8157o0093n7171K4973o055o5773
$$ -191330 -133423 -92078 -82211 -50526 -17366 8937 -49220 -109313 -166484 -141511 -147566 -213339
16312b13339O6184M6705j8878l1701L7475M046M6886J6388p1026J6389L3371j8193
$$ -213339 -147155 -100450 -119328 -151029 -113554 -109508 -62622 -46234 -117260 -100871 -67500 -85693
16300h5693k3146o0711l8891N0343K8904n564k1804l3000O139N684J18559J53100
$$ -85693 -108839 -169550 -208441 -158098 -129194 -134758 -156562 -189562 -183423 -177739 -59180 93920
16288I3920k0082o8164O1056l6437q6842l8983N4134l235J8805P067m9388L7833
$$ 93920 73838 5674 66730 30293 -56549 -95532 -41398 -44633 -25828 -18761 -68149 -30316
16276c0316K3761l9398m8503M1584K7444J8622j37877m9443O8372P5718K0198
$$ -30316 -6555 -45953 -94456 -52872 -25428 -6806 -144683 -194126 -125754 -50036 -29838
16265b9838q5789J8617N5178K9171l3650r270K1658J5098J453m0537k6017j5692
$$ -29838 -115627 -97010 -41832 -12661 -46311 -55581 -33923 -18825 -17372 -57909 -83926 -99618
16253i9618O2630O4006j003j28141n1252m6918j1108M5334K0093m1162R4149P3802
$$ -99618 -36988 27018 26015 -102126 -153378 -200296 -211404 -166070 -145977 -187139 -92990 -19188
16241a9188m618L548l3985j34149j7398M3990J25894J1812J9364K9830n9394l3569
$$ -19188 -23806 -20258 -54243 -188392 -205790 -161800 -35906 -24094 -4730 25100 -34294 -67863
16229f7863q3912q5486j8445R3280J46345J5913K6503q1909q8796K6641N9304
$$ -67863 -151775 -237261 -255706 -162426 -16081 -168 26335 -55574 -144370 -117729 -58425
16218e8425N181N0905M4916o1659O2409L2811k4318r7791N323n8322l5978O3803
$$ -58425 -53244 -2339 42577 -19082 43327 76138 51820 -45971 -40648 -98970 -134948 -71145
16206g1145j7603j7281n4744n721Q8124J07349L6123K1305n0042n4323k18K2666
$$ -71145 -88748 -106029 -160773 -166494 -78370 28979 65102 86407 36365 -17958 -18176 4490
16194D490n125o3244n8989m6762l8341M5898M3635l4157L3617K2863N7377k0629
$$ 4490 -635 -63879 -122868 -169630 -207971 -162073 -118438 -152595 -118978 -96115 -38738 -59367
16182e9367n6238k8452l1423N2911Q6200J00943j8022n0899M4729n0161k3123
$$ -59367 -115605 -144057 -175480 -122569 -36369 64574 46552 -4347 40382 -9779 -32902
16171c2902J0043Q5201p095j2062j8088m5622L6116N8052q7477n4460P854J8866
$$ -32902 -22859 62342 55247 43185 25097 -20525 15591 73643 -13834 -68294 -60440 -41574
16159d1574m101n3977p7654M3742J698N1772M3095N9186j7759N3184R4714K5365
$$ -41574 -45675 -99652 -177306 -133564 -131866 -80094 -36999 22187 4428 57612 152326 177691
16147A77691R998r7931n5604L1852n5444j14659k9291l5525K7530k7516K4635
$$ 177691 187689 89758 34154 66006 10562 -104097 -133388 -168913 -141383 -168899 -144264
16136a44264J9414M0462J00693L3324n9341r3314m332Q4314k5225j00407j3479
$$ -144264 -124850 -84388 16305 49629 -9712 -103026 -107358 -23044 -48269 -148676 -162155
16125a62155L8979J6939l0030q7898j07711L211N5624M2580J0242j0201J04944
$$ -162155 -123176 -106237 -136267 -224165 -331876 -328665 -273041 -230461 -220219 -230420 -125476
16114a25476L1895J7110o4167N257P890J6698M2872N2869J09234n2737r4445o1744
$$ -125476 -93581 -76471 -140638 -135381 -127491 -110793 -67921 -15052 94182 41445 -53000 -114744
16102a14744M8011L6315K3304O3763L947n3951k0062r5249j6485j10539j6969
$$ -114744 -66733 -30418 -7114 56649 60596 6645 -13417 -108666 -125151 -235690 -252659
16091b52659O4340Q2572P2582o6218j38K510M4710j1657o5500n4761N6331P539
$$ -252659 -188319 -105747 -33165 -99383 -99521 -97011 -52301 -63958 -129458 -184219 -127888 -120349
16079a20349p3954O151J0171p7562K3588P1611L065J3702J08920R354k9362J2453
$$ -120349 -194303 -188152 -177981 -255543 -231955 -160344 -157279 -143577 -34657 -25303 -54665 -42212
16067d2212N4224o4268l5975O0869j7436o4569j678J2884m1243J701N7156J7556
$$ -42212 12012 -52256 -88231 -27362 -44798 -109367 -111045 -98161 -139404 -137703 -80547 -62991
16055f2991K0420K9027O1087J8619J23935l1285j00439o1319L0580k4978q5389
$$ -62991 -42571 -13544 47543 66162 190097 158812 58373 -2946 27634 2656 -82733
16044h2733k4089R3590J01725J242n7332o7667q246R338m6723m9382l2095j3513
$$ -82733 -106822 -13232 88493 89735 32403 -35264 -43510 -34172 -80895 -130277 -162372 -175885
16032a75885K3014M5r1716K3927m949J03322O5948N3251R727l1322P0290K8353
$$ -175885 -152871 -152826 -244542 -220615 -225564 -122242 -56294 -3043 6684 -24638 45652 74005
16020G4005m4653n6246k3553N3604q468L8542K4934K4794k4716q8827j4287K5834
$$ 74005 29352 -26894 -50447 3157 -5311 33231 58165 82959 58243 -30584 -44871 -19037
16008a9037R885P0131M9738m3247J353k1508l8021J3917J5533r9269K4759j4054
$$ -19037 -9152 60979 110717 67470 68823 47315 9294 23211 38744 -60525 -35766 -49820
15996d9820j51910N8100O1642N2226L1751k4537j3447M171K3746J9418J6248M544
$$ -49820 -201730 -143630 -81988 -29762 1989 -22548 -35995 -31824 -8078 11340 27588 32132
15984C2132o4550k8859J8837m0633j02422J0226j6l4688P259k2101J5481O7049
$$ 32132 -32418 -61277 -42440 -83073 -185495 -175269 -175285 -209973 -202714 -224815 -209334 -142285
15972a42285K5951P2875J37923N4240j50281j55090j0295N0912L9203J665J3976
$$ -142285 -116334 -43459 94464 148704 -1577 -156667 -166962 -116050 -76847 -75182 -61206
15961f1206O9335j3071n8870K1622L5512n176q0208o2095l3164n3334K7978K2495
$$ -61206 8129 -4942 -63812 -42190 -6678 -11854 -92062 -154157 -187321 -240655 -212677 -190182
15949a90182O0820m3677K1840Q2342O5485O0208n3475o8630n9484j08635k6769
$$ -190182 -129362 -173039 -151199 -68857 -3372 56836 3361 -65269 -124753 -233388 -260157
15938b60157J6322j5591J01468Q7419n934P9473L5017n1784o4338K4921N6545
$$ -260157 -243835 -259426 -157958 -70539 -76473 3000 38017 -13767 -78105 -53184 3361
15927C361O2571n3341O565p3558l5445K7050L9980L5489p226l4266O2N0039P4012
$$ 3361 65932 12591 19156 -54402 -89847 -62797 -22817 12672 5446 -28820 -28758 21281 95293
15914I5293P4604o1594o6631N6183j3322j77861j85129O2095K6323Q463N5622
$$ 95293 169897 108303 41672 97855 84533 -93328 -278457 -216362 -190039 -181576 -125954
15903a25954J5022l588j825j0794K5584m946M5559J02882p9745J1314J1007j9169
$$ -125954 -110932 -114520 -116345 -127139 -101555 -106501 -60942 41940 -37805 -26491 -15484 -34653
15891c4653j1383q1240k3542j2435J14501M5199l9008k3933L4060J44135K26r8450
$$ -34653 -46036 -127276 -150818 -163253 -48752 -3553 -42561 -66494 -32434 111701 111927 13477
15879A3477j17539m3447R0437J7470N792n216J0470k7660o9698m5319M6565M0905
$$ 13477 -104062 -147509 -57072 -39602 -33810 -39026 -28556 -56216 -125914 -171233 -124668 -83763
15867h3763m3695K0828J08484O5252J0605p7834m8168r1358o044k212l16Q2673
$$ -83763 -127458 -106630 1854 67106 77711 -123 -48291 -139649 -145693 -147905 -148221 -65548
15855f5548j4753j0168m2071N8656N020p9925j7931J4598Q364j5113j2290J6399
$$ -65548 -80301 -90469 -132540 -73884 -68864 -148789 -166720 -152122 -143758 -158871 -171161 -154762
15843a54762Q2056N4381j0830O9518L6969m0002l8037L8495N6827o117j18736
$$ -154762 -72706 -18325 -29155 40363 77332 37330 -707 37788 94615 88498 -30238
15832c0238j9246n9311P253P2431K9385K6828R236J4362j00857o3466L19L8792
$$ -30238 -49484 -108795 -101542 -29111 274 27102 36338 50700 -50157 -113623 -113304 -74512
15820g4512N8686K3450J1384q7694j2400m6890n7091p9473P4561K1907l2517K221
$$ -74512 -15826 7624 19008 -68686 -81086 -127976 -185067 -264540 -189979 -168072 -200589 -198368
15808a98368K9243K5907R8287L8843J8398l1396m9043l7623K4306N6436M4188
$$ -198368 -169125 -143218 -44931 -6088 12310 -19086 -68129 -105752 -81446 -25010 19178
15797A9178m2776n4128l1497m5402J0056M5984K6387j27322L0888l662J2307l843
$$ 19178 -23598 -77726 -109223 -154625 -144569 -98585 -72198 -199520 -168632 -172294 -159987 -163830
15785a63830O691q9134K3520P0447l0964O1345N4827N8726O0464o86n2721j6975
$$ -163830 -157139 -246273 -222753 -152306 -183270 -121925 -67098 -8372 52092 51406 -1315 -18290
15773a8290k4093m4161M211M2130J0789r620n4792M5619K6477K4265J0048n0803
$$ -18290 -42383 -86544 -82333 -40203 -29414 -39034 -93826 -48207 -21730 2535 12583 -38220
15761c8220k4490m6154n4414l1988L9085O0666q5563J8152j836J2311Q8520J29136
$$ -38220 -62710 -108864 -163278 -195266 -156181 -95515 -181078 -162926 -164762 -152451 -63931 65205
15749F5205J13947Q7614k9566j10707m4633N561j24609j27259q7607k8746Q4474
$$ 65205 179152 266766 237200 126493 81860 87421 -37188 -164447 -252054 -280800 -196326
15738a96326J09949J2921J2220K2944R0429k3932l1820P1912m4359l8263J9696
$$ -196326 -86377 -73456 -61236 -38292 52137 28205 -3615 68297 23938 -14325 5371
15727E371L2807m19j16149J5655j0132l3077N7731J5418k4095m5988J3507J6221
$$ 5371 38178 37759 -78390 -62735 -72867 -105944 -48213 -32795 -56890 -102878 -89371 -73150
15715g3150J4428k8527m3717o3645O6746O6934j1483P4429P0556l7527m1609K929
$$ -73150 -58722 -87249 -130966 -194611 -127865 -60931 -72414 2015 72571 35044 -6565 -3636
15703c636K3591Q152L1409o9155q5775q195J769J4005j0880K0901O7848J1808
$$ -3636 19955 28107 59516 -9639 -95414 -103609 -101840 -87835 -98715 -77814 -9966 1842
15691A842m4718n5011K0545J7523l7419m0541n011Q1717N4645N4995n0732o754
$$ 1842 -42876 -97887 -77342 -59819 -97238 -137779 -142790 -61073 -6428 48567 -2165 -8919
15679h919J3176n8178J558J7674J1488j3743M5494k1359m2570L4644O0536o6273
$$ -8919 4257 -53921 -52363 -34689 -23201 -36944 8550 -12809 -55379 -20735 39801 -26472
15667b6472N3716k6084j00867J318L5218M6512M0448R7293p389p3710m1395l7695
$$ -26472 27244 1160 -99707 -98389 -63171 -16659 23789 121082 113693 39983 -1412 -39107
15655c9107k2240m2930m1191O7567J5612n1447K772j8826N6449J3519j3000q546
$$ -39107 -61347 -104277 -145468 -77901 -62289 -113736 -110964 -129790 -73341 -59822 -72822 -81368
15643h1368K730j3522p9295N8557J02713J03714K0185n4149l4808O925J9273r3403
$$ -81368 -78638 -92160 -171455 -112898 -10185 93529 113714 59565 24757 31682 50955 -42448
15631d2448j28387n2477N5635P3322Q889j0027K4080M0933k7739m1119k0039l7947
$$ -42448 -170835 -223312 -167677 -94355 -85466 -95493 -71413 -30480 -58219 -99338 -119377 -157324
15619a57324L1674l6613L9924J0477J2804m130j9978j7603M1059k5889L2395K5479
$$ -157324 -125650 -162263 -122339 -111862 -99058 -103188 -123166 -140769 -99710 -125599 -93204 -67725
15607f7725L7318K5710M5939J4505K5561m6579k8064k7681q5175p921L5051k7818
$$ -67725 -30407 -4697 41242 55747 81308 34729 6665 -21016 -106191 -114112 -79061 -106879
15595a06879R36J9852o1141m1073j375M7902M4848o913m6079l4953N8978O4760
$$ -106879 -105943 -86091 -147232 -188305 -189680 -141778 -96930 -103843 -149922 -184875 -125897 -61137
15583f1137J7853k1186j03332m1244N3998m025P8923P377M1299j6863K2811N2659
$$ -61137 -43284 -64470 -167802 -209046 -155048 -159073 -80150 -72773 -31474 -48337 -25526 27133
15571B7133j1209l7886m1518L8837k7556o2711l0504J3819J0766J0944K2907N1457
$$ 27133 15924 -21962 -63480 -24643 -52199 -114910 -145414 -131595 -120829 -109885 -86978 -35521
15559c5521k4336J9108M9692m1487p585N455j8454r579j1575K4156o1364k0056
$$ -35521 -59857 -40749 8943 -32544 -40129 -34674 -53128 -62707 -74282 -50126 -111490 -131546
15547a31546K2283l6883M0956P3778O0386k4034J6511P243j21216r970O187M2531
$$ -131546 -109263 -146146 -105190 -31412 28974 4940 21451 28694 -92522 -102492 -96305 -53774
15535e3774L3527K5551l9299R462J2329n552j4800o2036j0237L0363Q6354K6568
$$ -53774 -20247 5304 -33995 -24533 -12204 -17756 -32556 -94592 -104829 -74466 11888 38456
15523C8456K9535L4788P767J4833n4424N3563j0635m814Q213j08891m0489j9834
$$ 38456 67991 102779 110546 125379 70955 124518 113883 109069 117282 8391 -32098 -51932
15511e1932m9484l594M1248o398P0935p254P6749j01351r8953O0395p505N6315
$$ -51932 -101416 -105010 -63762 -70160 775 -6479 70270 -31081 -130034 -69639 -77144 -20829
15499b0829J9652p2448j5753l6867j4815l9893k7403K8315O9841Q8918L8722m2289
$$ -20829 -1177 -73625 -89378 -126245 -141060 -180953 -208356 -180041 -110200 -21282 17440 -24849
15487b4849l4755J7753L2547K614K477p6247K4378L7904l4620K5231L466L1779
$$ -24849 -59604 -41851 -9304 -6690 -4213 -80460 -56082 -18178 -52798 -27567 -24101 7678
15475G678j8990n039j2221l641o828J3732k8447k1832L9166p956K1856M1335k887
$$ 7678 -11312 -16351 -28572 -32213 -39041 -25309 -53756 -75588 -36422 -44378 -22522 18813 15926
15462A5926p5496K0686J5074l6737j3403N27j8971J8634M5249j18936k3617N8750
$$ 15926 -59570 -38884 -23810 -60547 -73950 -73423 -92394 -73760 -28511 -147447 -171064 -112314
15450a12314O9817K6453n0030l2082m642J3409j9370J6536k1678M884N2043m892
$$ -112314 -42497 -16044 -66074 -98156 -102798 -89389 -108759 -92223 -113901 -109017 -56974 -61866
15438f1866N2710j5309m6088O159P2379K6192q3491K723O5737j2479K1530J6375
$$ -61866 -9156 -24465 -70553 -64394 7985 34177 -49314 -46591 19146 6667 28197 44572
15426D4572N3633k6137o2669k9011m3375J1158k9522m5826j215P6847P6922K9722
$$ 44572 98205 72068 9399 -19612 -62987 -51829 -81351 -127177 -128392 -51545 25377 55099
15414E5099m5313n9634l5384O0630N710j24776K6522J6046p7445P294O097q544
$$ 55099 9786 -49848 -85232 -24602 -18892 -143668 -117146 -101100 -178545 -171251 -165154 -173698
15402a73698o0634P6590J88875O7163n290j3818j19878r9579N4586k2854Q39O312
$$ -173698 -234332 -157742 31133 98296 93006 79188 -40690 -140269 -85683 -108537 -107698 -101386
15390a01386N6604J5373M2664k8158k7695l228p8516K0455L4590k5288R4083m5809
$$ -101386 -44782 -29409 13255 -14903 -42598 -45826 -124342 -103887 -69297 -94585 -502 -46311
15378d6311p0550M8537l4581p4563m2113k8084O6155j0452J6796J2995J8097M2948
$$ -46311 -116861 -68324 -102905 -177468 -219581 -247665 -181510 -191962 -175166 -162171 -144074 -101126
15366a01126P1858m379K1611Q087n8876n0J0144M5895M9439p860J5765J6570l1042
$$ -101126 -29268 -33647 -12036 -3949 -62825 -62875 -52731 -6836 42603 34743 50508 67078 36036
15353C6036o0130o53l5910l5824M6781P4092l8171k6964P182l4091L0891P4363
$$ 36036 -24094 -24747 -60657 -96481 -49700 24392 -13779 -40743 -33561 -67652 -36761 37602
15341C7602K5922p1572j00426N259K7324r3996j8784R8543N7206O7315l4989P43
$$ 37602 63524 -8048 -108474 -103215 -75891 -169887 -188671 -90128 -32922 34393 -596 147
15329A47M7648o2333J109o775M1128j405p3034o4079L5418O5414j0359r0118O405
$$ 147 47795 -14538 -13429 -20204 20924 19519 -53515 -117594 -82176 -16762 -27121 -117239 -110834
15316a10834K9829o985p470l8631J6030O4430o6383K6318J3796j2739l987M7689
$$ -110834 -81005 -87990 -95460 -134091 -118061 -53631 -120014 -93696 -79900 -92639 -96626 -48937
15304d8937o8959j2321R2831P5033k499r5925K062N6899m9930o0350N085m3755
$$ -48937 -117896 -130217 -37386 37647 35148 -60777 -58715 -1816 -51746 -112096 -107011 -150766
15292a50766m1513J23227P8671k9015j09647M696P9706J06531k5080k6974r41
$$ -150766 -192279 -69052 9619 -19396 -129043 -124347 -44641 61890 36810 9836 8895
15281H895o7473O331n4785M4507Q7961R7175L2937k8532n7013L5503k2165j2403
$$ 8895 -58578 -52247 -107032 -62525 25436 122611 155548 127016 70003 105506 83341 70938
15269G0938J0900m5592m2775k837m4715k886P3286m7585p9803N3837J8294J0180
$$ 70938 81838 36246 -6529 -9366 -54081 -56967 16319 -31266 -111069 -57232 -38938 -28758
15257b8758O9698l6837o0751l8210l7197L6583N7186Q325J9018L2024o2947o4713
$$ -28758 40940 4103 -56648 -94858 -132055 -95472 -38286 -29961 -10943 21081 -41866 -106579
15245a06579L6511k9186P6752L0302M0318K1761m8114N314r1956P663M8170n1863
$$ -106579 -70068 -99254 -22502 7800 48118 69879 21765 27079 -64877 -57214 -9044 -60907
15233f0907q8592l6975K9157L7035k776L8468M8159J0355L1009p535K0927l8760
$$ -60907 -149499 -186474 -157317 -120282 -123058 -84590 -36431 -26076 4933 -2602 18325 -20435
15221b0435m2316p2575O9113m3314o9010K5065M7892J5340k208m8678K9186Q4349
$$ -20435 -62751 -135326 -66213 -109527 -178537 -153472 -105580 -90240 -92448 -141126 -111940 -27591
15209b7591M4155k3392k4934K4470j29094K0931R3160J00191J4992j09337q1471
$$ -27591 16564 -6828 -31762 -7292 -136386 -115455 -22295 77896 92888 -16449 -97920
15198i7920M7653N5328n1762l1621o19N9432N7648r96p261m0058j4276P778J7402
$$ -97920 -50267 5061 -46701 -78322 -78941 -19509 38139 37143 29882 -10176 -24452 -16674 728
15185G28r3126j6225O0042N7000J6486p13l7043M9557L2253n1484j09391j7312
$$ 728 -92398 -108623 -48581 8419 24905 24192 -12851 36706 68959 17475 -91916 -109228
15173a09228K0552l4959N7202k4392K9519m2070m2911M7730K0770J987K1037j0001
$$ -109228 -88676 -123635 -66433 -90825 -61306 -103376 -146287 -98557 -77787 -75800 -54763 -64764
15161f4764L4596o6963L2341M5597r1723q1080J5033R0976l2230N885M6816k6121
$$ -64764 -30168 -97131 -64790 -19193 -110916 -191996 -176963 -85987 -118217 -112332 -65516 -91637
15149i1637M9062L4271m1675l114N7109p0834m6281M4366O2928P0414O2224r1428
$$ -91637 -42575 -8304 -49979 -53093 4016 -66818 -113099 -68733 -5805 64609 126833 35405
15137C5405r1985Q868N2533N0501L3990m2240p8077m8486K2647J3941n3194k4483
$$ 35405 -56580 -47712 4821 55322 89312 47072 -31005 -79491 -56844 -42903 -96097 -120580
15125a20580q421J4590K4289M9915K8203j723J06960m477j4527O499m4795n1252
$$ -120580 -129001 -114411 -90122 -40207 -12004 -13727 93233 88756 74229 80728 35933 -15319
15113a5319q043L4404J9649j07919l2091j9580l1321P8674O3769M8801m070q227
$$ -15319 -23362 11042 30691 -77228 -109319 -128899 -160220 -81546 -17777 31024 26954 18727
15101A8727L8174M7540k1993p2802k2469Q9649O370k6518k0877l3844M7022L4717
$$ 18727 56901 104441 82448 9646 -12823 76826 83196 56678 35801 1957 48979 83696
15089H3696j749N7160k2808l1404L396l9385K6479P3920J00275N6403J01968J22179
$$ 83696 81947 139107 116299 84895 88291 48906 75385 149305 249580 305983 407951 530130
15077E30130J86035J00838M7360M19J6934m7200q4133Q5244Q7633J05072j40457
$$ 530130 716165 817003 864363 864782 881716 834516 750383 835627 923260 1028332 887875
15066H87875j67763j77566j55654j40647k5194j2537q0683k6076N8063M0962O807
$$ 887875 720112 542546 386892 246245 221051 208514 127831 101755 159818 200780 207587
15055B07587r1043j43222l9194J568R2493o053m1317l2827k7750m937k9056L4473
$$ 207587 116544 -26678 -65872 -64304 28189 22136 -19181 -52008 -79758 -84695 -113751 -79278
15043g9278N6160N3776M0712j1071n5288r5711K1526k162l7632J9029K3726N2034
$$ -79278 -23118 30658 71370 60299 5011 -90700 -69174 -71336 -108968 -89939 -66213 -14179
15031a4179N8499n41J5247o8050k3286j0662P5985N3836m4297m1973k4165m3989
$$ -14179 44320 43779 59026 -9024 -32310 -42972 33013 86849 42552 579 -23586 -67575
15019f7575m142J9134L3569J3031q888o4064P8665M9708l1735O127m6214J7614
$$ -67575 -71717 -52583 -19014 -5983 -14871 -78935 -270 49438 17703 23830 -22384 -4770
15007d770J17378r295p9061o9157j7021M6898M8519o2651j08854J716P506O715
$$ -4770 112608 103313 24252 -44905 -61926 -15028 33491 -29160 -138014 -136298 -128792 -122077
14995a22077K5763J01395n2211m3530J11617M9912j47183n6624O6160L9578O3843
$$ -122077 -96314 5081 -47130 -90660 20957 70869 -76314 -132938 -66778 -27200 36643
14984C6643J7154R9934P4331m3614j12996j07716n321K6788Q767K8914O2076K1710
$$ 36643 53797 153731 228062 184448 71452 -36264 -41585 -14797 -6030 22884 84960 106670
14972A06670Q927q7312j19820j2657Q9463R870j9888l4302M4926J5391k0794K9685
$$ 106670 115597 28285 -91535 -104192 -14729 -4859 -24747 -59049 -14123 1268 -19526 10159
14960A0159J7210o9381m6307j1188P4100K798p072O9569q0580j8136m056k2849
$$ 10159 27369 -42012 -88319 -99507 -25407 -22609 -29681 39888 -40692 -58828 -62884 -85733
14948h5733l168J5117K5124P8349j2929K1662M7306J9722L1797o2217j5181o8851
$$ -85733 -88901 -73784 -48660 29689 16760 38422 85728 105450 137247 75030 59849 -9002
14936i002l031O1979l2805p4175m4029N5686J04822M4919q8333o5681k8471O9600
$$ -9002 -12033 49946 17141 -57034 -101063 -45377 59445 104364 16031 -49650 -78121 -8521
14924h521N1953k9311K136l6244l1381M1490L2008L5279p0495M784K7934l4327
$$ -8521 43432 14121 16257 -19987 -51368 -9878 22130 57409 -13086 -8302 19632 -14695
14912a4695o7243q9605M3911l348l6555m394L1419O8702K6918O7102L0671p0636
$$ -14695 -81938 -171543 -127632 -130980 -167535 -171929 -140510 -71808 -44890 22212 52883 -17753
14900a7753n2649j7090O4977m5863j1581J1725j6206l9363N3544L7490k187M1357
$$ -17753 -70402 -87492 -22515 -68378 -79959 -68234 -84440 -123803 -70259 -32769 -34956 6401
14888F401N6157R6688M3671Q472l8242r2061o3612K3819Q12o839j2460R23J3213
$$ 6401 62558 159246 202917 211389 173147 81086 17474 41293 42105 35266 22806 23729 36942
14875C6942Q56m6427j7869M7148K9692M8601j8418L9158k7914O646O5755J5601
$$ 36942 37798 -8629 -26498 20650 50342 98943 80525 119683 91769 98415 164170 179771
14863A79771j1953n5294m8841L3582k277n9829O0663n3306p2066p383L9307O1613
$$ 179771 167818 112524 63683 97265 94988 35159 95822 42516 -29550 -36933 2374 63987
14851F3987k5101m795P8210J655j14543o5202J1190K6628L0972K576N785k0169
$$ 63987 38886 34091 112301 113956 -587 -65789 -54599 -27971 3001 5577 11362 -8807
14839h807m5594j2694J15713N9760R524l4339l5608m4869m3255K5982L4173m470
$$ -8807 -54401 -67095 48618 108378 117902 83563 47955 3086 -40169 -14187 19986 15516
14827A5516n9006j01733J9143L5690n5049m3628L8690N7275O3165l6806r1792
$$ 15516 -43490 -145223 -126080 -90390 -145439 -189067 -150377 -93102 -29937 -66743 -158535
14816a58535k4910p59k0074J04744K2956o4478J9467O9340l290L3112K8957l1894
$$ -158535 -183445 -184204 -204278 -99534 -76578 -141056 -121589 -52249 -55539 -22427 6530 -25364
14804b5364N163q067n512n7750p5604K9126Q0022N9638M8865L338k5395j5524
$$ -25364 -20201 -28268 -33780 -91530 -167134 -138008 -57986 1652 50517 53855 28460 12936
14792A2936m2074o7653r0172K2489N5948L1107O0456J0779J6683m2225O6300P1958
$$ 12936 -29138 -96791 -186963 -164474 -108526 -77419 -16963 -6184 10499 -31726 34574 106532
14780A06532j28274o6142L8575M0578n4865o9739N7376K7847O3699Q9739L6628
$$ 106532 -21742 -87884 -49309 -8731 -63596 -133335 -75959 -48112 15587 105326 141954
14769A41954M9761j1463k7781N1010k2249j20817p1367k3288M1698N961L915M3400
$$ 141954 191715 180252 152471 203481 181232 60415 -10952 -34240 7458 13419 17334 60734
14757F0734j7321P7033N7648P1640O3028M551j37877j25822n2759r677K1326N4137
$$ 60734 43413 120446 178094 249734 312762 317313 179436 53614 855 -8822 12504 66641
14745F6641O4361N9456m936R5905K8738q963M683j00395j04289q3423N5354O6620
$$ 66641 131002 190458 185522 281427 310165 301202 305885 205490 101201 17778 73132 139752
14733A39752L9946j5236r247n8110o4726j19939j85920r7323R197L4780J29194
$$ 139752 179698 164462 155215 97105 32379 -87560 -273480 -370803 -361606 -326826 -197632
14722a97632M2113L984J056o0508j26643L696J47979J89358J24972O1000R4955
$$ -197632 -155519 -151535 -150479 -210987 -337630 -333934 -185955 3403 128375 189375 284330
14711B84330p5229P348k5478n3331N4741Q2301M3329n1947j3336R7357q978n9577
$$ 284330 209101 216449 190971 137640 192381 274682 318011 266064 252728 350085 341107 281530
14699B81530j4619k4723k5124q3603j8600M9898J05027k4120p6245k6991N0473
$$ 281530 266911 242188 217064 133461 114861 164759 269786 245666 169421 142430 192903
14688A92903J9426J2924P152Q360j4379K7925n2518l2813K2504L3525P3159K086
$$ 192903 212329 225253 232405 240765 226386 254311 201793 168980 191484 225009 298168 300254
14676C00254J3972M4346L9874n4750q5850j7997J16107M7322n678K8722J30088
$$ 300254 314226 358572 398446 343696 257846 239849 355956 403278 397600 426322 556410
14665E56410k9906j09092l3078L7699P6823J9004l5135l1256L4938J77897N5257
$$ 556410 526504 417412 384334 422033 498856 517860 482725 451469 486407 664304 719561
14654G19561m0322j4788K7633P2321Q6093q4589R5315P3564N7867k076L5187J25339
$$ 719561 679239 664451 692084 764405 850498 765909 861224 934788 992655 990579 1025766 1151105
14642A151105J04079l700K8687Q7610O8098N7087J17906J30837K8223J3870J48445
$$ 1151105 1255184 1251484 1280171 1367781 1435879 1492966 1610872 1741709 1769932 1783802 1932247
14631A932247J41165J46510J04224O2119K45618L28471L17361K65961K88211N28811
$$ 1932247 2073412 2219922 2324146 2386265 2631883 2960354 3277715 3543676 3831887 4360698
14621D360698N47293N88131Q20891J027238J114357J164614J190371J193420J411278
$$ 4360698 4907991 5496122 6317013 7344251 8458608 9623222 10813593 12007013 13418291
14612A3418291J857076K643953L650745M970807O825146R608355J3898337K0254520
$$ 13418291 15275367 17919320 21570065 26540872 33366018 42974373 56872710 77127230
14604G7127230K8366848L4704907L1445576J3544063r044377j9888009j5262180
$$ 77127230 105494078 140198985 171644561 185188624 176144247 156256238 140994058
14597A40994058l158769R990818J9113869J6781659j488754k4499824l5469610
$$ 140994058 137835289 147826107 166939976 183721635 182232881 157733057 122263447
14590A22263447l2224187k3594728j5946668j0852398p713278n695878m391425
$$ 122263447 90039260 66444532 50497864 39645466 31932188 26236310 21844885
14583B1844885l367444k384977j723945j348841j178151j184685j163810j190334
$$ 21844885 18477441 16092464 14368519 13019678 11841527 10656842 9493032 8302698
14575H302698j119337q58376p31925n31002m07999m56642l53415l16164j67693
$$ 8302698 7183361 6324985 5593060 5062058 4654059 4197417 3844002 3527838 3360145
14566C360145k67785k80248k58114j64440j39718j50354j61233j85834j04265
$$ 3360145 3092360 2812112 2553998 2389558 2249840 2099486 1938253 1752419 1648154
14557A648154k5289r6444l6518l2862q3718j00921k7932j774j12098n6828r6783
$$ 1648154 1622865 1526421 1489903 1457041 1373323 1272402 1244470 1242696 1130598 1073770 976987
14546I76987l9663j5852P2800r0715j28934j0790L0500K0579j9861l1801o1125
$$ 976987 937324 921472 994272 903557 774623 763833 794333 814912 795051 763250 702125
14535G02125r676J0475o2904O537l008J1522l696l6316n7100o4552p4579m3368
$$ 702125 692449 702924 640020 646557 643549 655071 651375 615059 557959 493407 418828 375460
14523C75460M0322J2113j3423J2128O0977Q0968j8241n7057K772M9029q7903q5576
$$ 375460 415782 427895 414472 426600 487577 568545 550304 493247 496019 545048 457145 371569
14511C71569n4383M0584k956p3713j1542n565l8521k3846L0386M0683o4054M214
$$ 371569 317186 357770 354814 281101 269559 263994 225473 201627 232013 272696 208642 212856
14499B12856J5070N5529O5260k8088k7362o0560o688K2964M4464n1488k2132m2483
$$ 212856 227926 283455 348715 320627 293265 232705 226017 248981 293445 241957 219825 177342
14487A77342o5045n0479k4941k1532k3820k7346M2455J29658J37153J56556Q4880
$$ 177342 112297 61818 36877 15345 -8475 -35821 6634 136292 273445 430001 514881
14476E14881K4636r0574o1432m1504P9943J25018J51978J16451o5p6696j44674
$$ 514881 539517 448943 387511 346007 425950 550968 702946 819397 819332 742636 597962
14465E97962j43403o7442q4725l3034N5569l8889k7797O4642R293l166l6310q3761
$$ 597962 454559 387117 302392 269358 324927 286038 258241 322883 332176 329010 292700 208939
14453B08939o8932K3138O7261K3048m7314p5511m9443l8234O2491R0484L5236
$$ 208939 140007 163145 230406 253454 206140 130629 81186 42952 105443 195927 231163
14442B31163M6990l3791J8493p4025p7112o3572O8121P1412n500j17229o1502
$$ 231163 278153 244362 262855 188830 111718 48146 116267 187679 182179 64950 3448
14431C448K9065M2063J9955N969O1150j4966p0358m0591L3335K8247M3150l5413
$$ 3448 32513 74576 94531 100500 161650 146684 76326 35735 69070 97317 140467 105054
14419A05054p9418j42981J01167K06275N4224o0555p1296k5532k0921m2441K0672
$$ 105054 25636 -117345 -16178 190097 244321 183766 112470 86938 66017 23576 44248
14408D4248n3488K9090J8877n914O6399K9067p7804n4012n634L1971J6287N1517
$$ 44248 -9240 19850 38727 32813 99212 128279 50475 -3537 -9171 22800 39087 90604
14396I0604J8377n1107N8332l5417P4554K4980L1314j4111j2653k9235r4806j4046
$$ 90604 108981 57874 116206 80789 155343 180323 211637 197526 184873 155638 60832 46786
14384D6786L5294J110L9920q2136k1964M8284P0062L7209M0526P8964m0624L3675
$$ 46786 82080 83190 123110 40974 19010 67294 137356 174565 215091 294055 253431 287106
14372B87106J06000L3046Q893J17141J86003J20347P4540q2840k71043j37961
$$ 287106 393106 426152 435045 552186 738189 858536 933076 850236 579193 441232
14362D41232Q050J25609K12673K34902J30280L1628q0309p7450j13688j08753
$$ 441232 449282 574891 787564 1022466 1152746 1184374 1104065 1026615 912927 804174
14352H04174r6750o6757l6277m627k493l5997k2009l9851j8011k8918j38011q3990
$$ 804174 707424 640667 604390 599763 597270 561273 539264 499413 481402 452484 314473 230483
14340B30483q172p4256p5182M1941N3894N511k6142q1250r0885P185N4140R2698
$$ 230483 222311 148055 72873 114814 168708 174219 148077 66827 -24058 -16873 37267 129965
14328A29965k446l2144N0370n4121P3942J1873j02253n4593J221L6715o8466q745
$$ 129965 127519 95375 145745 91624 165566 177439 75186 20593 21814 58529 -9937 -18682
14316a8682O1740L7322N9250Q1676q2096r9408o3057l5668O4141R4081M5790O660
$$ -18682 43058 80380 139630 221306 139210 39802 -23255 -58923 5218 99299 145089 151749
14304A51749j07507m540k378j1451M6643N2513O7997Q7183p5805q0936Q076l6823
$$ 151749 44242 39702 37324 25873 72516 125029 193026 280209 204404 123468 131544 94721
14292I4721M8310J3132j3672o6443m3423p527P508J7248k8016p4521k6117L0015
$$ 94721 143031 156163 142491 76048 32625 25098 32606 49854 21838 -52683 -78800 -48785
14280d8785p175O9322o2164j4132O4143L529j34893J28178O2472l8849j3700n5240
$$ -48785 -55960 13362 -48802 -62934 1209 4738 -130155 -1977 60495 21646 7946 -47294
14268d7294J7711L4052k7417L7641J7605M5069J2972L1421l9436k8183k2955n4475
$$ -47294 -29583 4469 -22948 14693 32298 77367 90339 121760 82324 54141 31186 -23289
14256b3289m0482j2368l5996K6164J646J1167M7004L669k340P2026P7085K0176
$$ -23289 -63771 -76139 -112135 -85971 -84325 -73158 -26154 -22485 -24825 47201 124286 144462
14244A44462o7396j25018J179Q6565Q1538n4716p3626J00475R9580m0371o4115
$$ 144462 77066 -47952 -46773 39792 121330 66614 -7012 93463 193043 152672 88557
14233H8557n1075n9049P833M155O9874Q4259L4529q3500j00647m1609K0589R054
$$ 88557 37482 -21567 -13734 -9579 60295 144554 179083 95583 -5064 -46673 -26084 -17030
14221a7030o602l7964K9464p008K79R220L7664M4250L6531J6409k7193M3560k6489
$$ -17030 -23632 -61596 -32132 -39140 -38861 -29641 8023 52273 88804 105213 78020 121580 95091
14208I5091N2723J3523m2634p4322l7458l1836J079k0126k8869K8309M9582J4879
$$ 95091 147814 161337 118703 44381 6923 -24913 -23834 -43960 -72829 -44520 5062 19941
14196A9941k7375J2776P6078L4645q0451j1071j0330K2102P3235o6244p9226j8126
$$ 19941 -7434 5342 81420 116065 35614 24543 14213 36315 109550 43306 -35920 -54046
14184e4046l1216P5475Q2453Q1795M8000j0953o66J0024l6191p7922P6913J38
$$ -54046 -85262 -9787 72666 154461 202461 191508 190842 200866 164675 86753 163666 163804
14172A63804m9619L7404r3274O986M992j280L1531k6356K2299O715o8355m6643
$$ 163804 114185 151589 58315 65301 70293 69013 100544 74188 96487 103202 34847 -11796
14160a1796j4543N5416j6699j9721N0820M1321m7547j3807j8005J4081K0126J03532
$$ -11796 -26339 29077 12378 -7343 43477 84798 37251 23444 5439 19520 39646 143178
14148A43178J970J3400p0773m4137N824j2797k7656K919L6390Q484p323n1017
$$ 143178 145148 158548 87775 43638 49462 36665 9009 11928 48318 56802 49479 -1538
14136a538K6846K1770p6253L7765Q0789M7447J0474K797n3844L5073Q4214J26835
$$ -1538 25308 47078 -29175 8590 89379 136826 147300 150097 96253 131326 215540 342375
14124C42375J00550O0842J42434J29127J8996k0665N5198l1344n033P6187L6020
$$ 342375 442925 503767 646201 775328 794324 773659 828857 797513 792480 868667 904687
14113I04687J9369k3296m4789q2580j33901j21860j94782m2137n3209o6572J4554
$$ 904687 924056 900760 855971 773391 639490 517630 322848 280711 227502 160930 175484
14102A75484p375N0824j45059n9144n9249k0244Q7537j9861K7623j8164m4488
$$ 175484 168109 218933 73874 14730 -44519 -64763 22774 2913 30536 12372 -32116
14091c2116P9376M0210R3909N9145q5649q9287l917r4548m3098L5714n5512j4039
$$ -32116 47260 87470 181379 240524 154875 65588 61671 -32877 -75975 -40261 -95773 -109812
14079a09812P6569K8809O6100k9643k2449M2272k4531K2213K5543j0888J8521
$$ -109812 -33243 -4434 61666 32023 9574 51846 27315 49528 75071 64183 82704
14068H2704j0313r9107n7748j8567j0135R9282m045m185l8066J11405K7694j9863
$$ 82704 72391 -26716 -84464 -103031 -113166 -13884 -17929 -22114 -60180 51225 78919 59056
14056E9056l782o194o4484K8394p322N6326p1994m0852j6486N6118N0082N7456
$$ 59056 55274 49080 -15404 12990 5668 61994 -10000 -50852 -67338 -11220 38862 96318
14044I6318m6188J4550J576p5974m052J15511m7764j01312q025l1723l7093n306
$$ 96318 50130 64680 66256 -9718 -13770 101741 53977 -47335 -55360 -87083 -124176 -129482
14032a29482j3531M644J48856N9483r9962K2386N2192K7331o0466l8493R5231
$$ -129482 -143013 -138369 10487 69970 -29992 -7606 44586 71917 11451 -27042 68189
14021F8189P1713K2210m3225J1282j6280m2256q6385K752M112K1964j25305l1813
$$ 68189 139902 162112 118887 130169 113889 71633 -14752 -12000 -7888 14076 -111229 -143042
14009a43042R3495O3576p8488n3297l5317l0260L3595R6358L0741M1764j9593
$$ -143042 -49547 14029 -64459 -117756 -153073 -183333 -149738 -53380 -22639 19125 -468
13998d68K2594J0222O035K6044L2880O1589J08373q1350j78901k9023N3581M2357
$$ -468 22126 32348 38383 64427 97307 158896 267269 185919 7018 -22005 31576 73933
13986G3933L304L4356L5179K2320o7528l7933O1286L2829l7279n9971k4847m3715
$$ 73933 77237 111593 146772 169092 101564 63631 124917 157746 120467 60496 35649 -8066
13974h066m0918j14133O9062P1998l2620k8840J9088L3217O5590M4645J5734k7488
$$ -8066 -48984 -163117 -94055 -22057 -54677 -83517 -64429 -31212 34378 79023 94757 67269
13962F7269K3865L4380K8711n7685n5893M507O2068Q65L2629M8547k4263j03823
$$ 67269 91134 125514 154225 96540 40647 45154 107222 108087 140716 189263 165000 61177
13950F1177r2940K5765N5221n954m8928M9066P4478M2979m17p0031k6188M6704
$$ 61177 -31763 -5998 49223 43269 -5659 43407 117885 160864 160447 90416 64228 110932
13938A10932J6732o9959m4228j8421P9785J5343J222o796P1300n2588k3708p8415
$$ 110932 127664 57705 13477 -4944 74841 90184 91406 84610 155910 103322 79614 1199
13926A199n3129L1390K697l0982J6514R541j5340n2089j1545K7455K4398K2527
$$ 1199 -51930 -20540 -17843 -48825 -32311 -22770 -38110 -90199 -101744 -74289 -49891 -27364
13914b7364l2999j41840P804Q8412L3565K4376l3644o0678k5402R9339O2840l373
$$ -27364 -60363 -202203 -194399 -105987 -72422 -48046 -81690 -142368 -167770 -68431 -5591 -8964
13902h964k2522m8433M7668o75l8928L274P2374Q883M053l5760P4942P4885q1242
$$ -8964 -31486 -79919 -32251 -32926 -71854 -68580 3794 12677 16730 -19030 55912 130797 49555
13889D9555q0725l8821K5481l3343k2296k5485M4143Q9167o717P4462r0859q9555
$$ 49555 -31170 -69991 -44510 -77853 -100149 -125634 -81491 7676 959 75421 -15438 -104993
13877a04993M0170j4589N193L9291M3128k1964o5832L222R6684K1659K647p74
$$ -104993 -64823 -79412 -74219 -34928 8200 -13764 -79596 -76374 20310 41969 44616 43842
13865D3842k0480n461m8527j2780j2968j0837K8408l8687o5235l0446O2429j5867
$$ 43842 23362 17901 -30626 -43406 -56374 -67211 -38803 -77490 -142725 -173171 -110742 -126609
13853a26609k7174J09672R0358o641M0380J3427n7316L9729P7711n9772k2263
$$ -126609 -153783 -44111 46247 39606 79986 93413 36097 75826 153537 93765 71502
13842G1502J1683k1869k1251K5039m532p667N4047O0814m4076k1584P6836M7713
$$ 71502 83185 61316 40065 65104 60572 52905 106952 167766 123690 102106 178942 226655
13830B26655j18002q3499Q7196L286p4396p226n9405r6215l6654J4531P4456K4683
$$ 226655 108653 25154 112350 115636 41240 34014 -25391 -121606 -158260 -143729 -69273 -44590
13818d4590q7206o120J10303O7294j5140P2602Q1538j8608L8671q6225j11908
$$ -44590 -131796 -137916 -27613 39681 24541 97143 178681 160073 198744 112519 611
13807F11q121l720j7897K4383Q4491l2768n1379M6836N5285n232p866L7088r227
$$ 611 -7510 -11230 -29127 -4744 79747 46979 -4400 42436 97721 92489 84623 121711 112484
13794A12484l6597M8017L6954o7838M932j906j21044j5950M0201l9864m1300k9031
$$ 112484 75887 123904 160858 93020 97952 96046 -24998 -40948 -747 -40611 -81911 -110942
13782a10942p421L8168l3990P2271K6139l1151R7034O0087l3516j6992L8660o6229
$$ -110942 -118363 -80195 -114185 -41914 -15775 -46926 50108 110195 76679 59687 98347 32118
13770C2118j61092l4265N3617Q0705J06339j5477m3595j8072m5564K3390N1901
$$ 32118 -128974 -163239 -109622 -28917 77422 61945 18350 278 -45286 -21896 30005
13759C0005J8119m96n696j2947n5707K5933k3847k5539N181O3306N0129p691N5244
$$ 30005 48124 47628 41932 28985 -26722 -789 -24636 -50175 -44994 18312 68441 60750 115994
13746A15994j04065o9406Q7679J17649K4666p406p4053o3410q710K2164n3087
$$ 115994 11929 -57477 30202 147851 172517 165111 91058 27648 18938 41102 -11985
13735a1985j1197J21280R4071j3706j44301o0451k8732O5039M3870M7400q317
$$ -11985 -23182 98098 192169 178463 34162 -26289 -55021 10018 53888 101288 92971
13724I2971j07904M207L1398m831P9141m1625p2202o059j6842K274o2527j3079
$$ 92971 -14933 -10726 20672 15841 94982 53357 -18845 -24904 -41746 -39472 -101999 -115078
13712a15078r206o3904R6613J09326O220J5537p7024K2864l9953o6714k3769K8455
$$ -115078 -124284 -188188 -91575 17751 23971 39508 -37516 -14652 -54605 -121319 -145088 -116633
13700a16633L4267Q8360J2924r233k9646l2456N554J967M9947Q6314P7978l6044
$$ -116633 -82366 5994 18918 9685 -19961 -52417 -46863 -44896 5051 91365 169343 133299
13688A33299o6702N9222p500L0425k1119n3924n3568l1376j1100K6297k9937m2210
$$ 133299 66597 125819 118319 148744 127625 73701 20133 -11243 -22343 3954 -25983 -68193
13676f8193o8688j8646N5636O4930J8625K3094M0734m8448j5588n3679p3937K8407
$$ -68193 -136881 -155527 -99891 -34961 -16336 6758 47492 -956 -16544 -70223 -144160 -115753
13664a15753j4464R746K8042P8394K6176J7320q0103r6192O2558K2560O5973N2336
$$ -115753 -130217 -120471 -92429 -14035 12141 29461 -50642 -146834 -84276 -61716 4257 56593
13652E6593m1143Q221n7694N7839P2583k6751r8295q7674J9651M9038q687l835
$$ 56593 15450 23671 -34023 23816 96399 69648 -28647 -116321 -96670 -47632 -56319 -60154
13640f0154j39o115K8255n3666L653K4114p0086P0949m571j3278J508K3277N5569
$$ -60154 -60293 -66408 -38153 -91819 -88166 -64052 -134138 -63189 -67760 -81038 -79530 -56253 -684
13627f84o512J9550O890M8127k7982r1631Q492J993M3649M1815o7743k3420o1151
$$ -684 -7196 12354 19244 67371 39389 -52242 -43750 -41757 1892 43707 -24036 -47456 -108607
13614a08607o1902N7109N2727M7877M138L0625l4609O374k033l3341L2401m712
$$ -108607 -170509 -113400 -60673 -12796 -8658 21967 -12642 -6268 -8301 -41642 -9241 -13953
13602a3953j5778k4905j218L3827k5310l2765m2485L3262K7869L9255J6636j7578
$$ -13953 -29731 -54636 -55854 -22027 -47337 -80102 -122587 -89325 -61456 -22201 -5565 -23143
13590b3143L7550k4496j8109R5415P2799M2620p7352n4197n9298J8901N8520R7349
$$ -23143 14407 -10089 -28198 67217 140016 182636 105284 51087 -8211 10690 69210 166559
13578A66559M6747j13921j95085N1200N2600k0671J2645N2908J07824m7695j7911
$$ 166559 213306 99385 -95700 -44500 8100 -12571 74 52982 160806 113111 95200
13567I5200l7403O9882j5680K4909L7120m4054q1602l2178N7901O0616J1303L3933
$$ 95200 57797 127679 111999 136908 174028 129974 48372 16194 74095 134711 146014 179947
13555A79947p3109j15232J1431K9534M8389o2914n2723M4497j91Q744K824n3252
$$ 179947 106838 -8394 3037 32571 80960 18046 -34677 9820 9629 18373 21197 -32055
13543c2055j7627M2505M2410Q0961j7285M1745M4786j056p2031k1272N5964l3873
$$ -32055 -49682 -7177 35233 116194 98909 140654 185440 184384 112353 91081 147045 113172
13531A13172j7329r310k0152J2106o7432k4516L4324p8452M0336K9081J4938Q3717
$$ 113172 95843 86533 66381 78487 11055 -13461 20863 -57589 -17253 11828 26766 110483
13519A10483M7047l8691j0947L5401l5528l0660P344j166k5494k2025j6292J3015
$$ 110483 157530 118839 107892 143293 107765 77105 84449 83283 57789 35764 19472 32487
13507C2487M5773N1323N3575n4359l6351j9229m5873l9232r908J26396P1163M522
$$ 32487 78260 129583 183158 128799 92448 73219 27346 -11886 -21794 104602 175765 180287
13495A80287J5918p9389j84189n8846K2549K178J844Q9362Q4922O7594J3655n898
$$ 180287 196205 116816 -67373 -126219 -103670 -101492 -99648 -10286 74636 142230 155885 149987
13483A49987J214K6317j04121n3702L6685M4530n9421o9201j9978L1650N9524
$$ 149987 151201 177518 73397 19695 56380 100910 41489 -27712 -47690 -16040 43484
13472D3484K5819N1350k0212r7873K6673O846j36781j0911J03715R5347K4199
$$ 43484 69303 120653 100441 2568 29241 36087 -100694 -111605 -7890 87457 111656
13461A11656l9432o6998O0618L9802m4942l3941J4054K2874q9116M5424P1245
$$ 111656 72224 5226 65844 105646 60704 26763 40817 63691 -25425 19999 91244
13450I1244m3643p1539j146J24677M1419l7107O9822M1595j9020n1394j2693J1512
$$ 91244 47601 -23938 -25084 99593 141012 103905 173727 215322 196302 144908 132215 143727
13438A43727j1526j0330O6007O431j04427R399L0436j0640l227m8428J1689Q0220
$$ 143727 132201 121871 187878 194309 89882 99281 129717 119077 115850 67422 79111 159331
13426A59331J2801J7730L711n0625p6931j25320o2174L5543M5368O0838K2383
$$ 159331 172132 189862 193573 142948 66017 -59303 -121477 -85934 -40566 20272 42655
13415D2655M9486k3885m4888o1484O568m3763L7387M6840k5698k1102k991J0182
$$ 42655 92141 68256 23368 -38116 -31548 -75311 -37924 8916 -16782 -37884 -40875 -30693
13403c0693M5653J13129K5836l8629j4861N0982q298n8190p2367L3105L0153m6048
$$ -30693 14960 128089 153925 115296 100435 151417 143119 84929 12562 45667 75820 29772
13391B9772j42137R418N7095n4821K9214K7704o581N816m7328J4148J28476J8539
$$ 29772 -112365 -102947 -45852 -100673 -71459 -43755 -50336 -44520 -91848 -77700 50776 69315
13379F9315j0828k9694P1013R5428o5862j62049j7351Q6859k251k7954l3004L6269
$$ 69315 58487 28793 99806 195234 129372 -32677 -50028 36831 34580 6626 -26378 9891
13367I891M9418l4316o3077O004L5732L9525L0478j2884n546J1695m1190n4316
$$ 9891 59309 24993 -38084 -32080 3652 43177 73655 60771 55225 66920 25730 -28586
13355b8586K0114J3325K4525J6844n4196k17k9682J4983M4568k0382j9030j7383
$$ -28586 -8472 4853 29378 46222 -7974 -8191 -37873 -22890 21678 1296 -17734 -35117
13343c5117p8547p864L8437N0760L1192L2698p2912r7405L3754P7527J9219q451
$$ -35117 -113664 -121528 -83091 -32331 -1139 31559 -41353 -138758 -105004 -27477 -8258 -16709
13331a6709n2987k148p7241l300M4480J27469J0302o0871L0638k3640k054K059
$$ -16709 -69696 -71844 -149085 -152385 -107905 19564 29866 -31005 -367 -24007 -26061 -24002
13319b4002l8461M0258L870j0961j6411K2035K3335j5249K613l667K497j0566
$$ -24002 -62463 -22205 -18335 -29296 -45707 -23672 -337 -15586 -12973 -16640 -14143 -24709
13307b4709O7061K9019J316l1439l4218q454n9609p209L1167j475J3629P1739
$$ -24709 42352 71371 72687 41248 7030 -1424 -61033 -68242 -37075 -38550 -24921 46818
13295D6818j1695n0605q1580K4916P1042M1761k4059L9819Q699l0091j5031K3404
$$ 46818 35123 -15482 -97062 -72146 -1104 40657 16598 56417 65116 35025 19994 43398
13283D3398O6630j4571j22621m6520J13880K9813j67964m3844J10091Q8626q9946
$$ 43398 110028 95457 -27164 -73684 40196 70009 -97955 -141799 -31708 56918 -33028
13272c3028r5296P0679J21158O4759n321j5580o0111k9564N1536l813l1897m9899
$$ -33028 -128324 -57645 63513 128272 122951 107371 47260 17696 69232 65419 33522 -16377
13260a6377l4377K8915r163N7028O633m6612O307M0907O2853r068j29605N1042
$$ -16377 -50754 -21839 -31002 26026 32659 -13953 -7646 33261 96114 87046 -42559 8483
13248H483J23341j1200q2438M4778N1670o9001p8377O8891J0729l9370l5654m2963
$$ 8483 131824 120624 38186 82964 134634 65633 -12744 56147 66876 27506 -8148 -51111
13236e1111k776L8907P4568N0773j6343l0492L3830L1891l0481k2380Q415m6729
$$ -51111 -53887 -14980 59588 110361 94018 63526 97356 129247 98766 76386 84801 38072
13224C8072n413J166M3637O0049Q4801l5393j0988Q246m043N0759o5011n6927
$$ 38072 32659 33825 77462 137511 222312 186919 175931 184177 180134 230893 165882 108955
13212A08955p8813l235J0758J5666L2705K7977j4552o5092M5458j4189n8710K6068
$$ 108955 30142 26907 37665 53331 86036 114013 99461 34369 79827 65638 6928 32996
13200C2996o4316k6750M0503m6168K3153Q4005L2959o734L3873R6959P710R276
$$ 32996 -31320 -58070 -17567 -63735 -40582 43423 76382 69648 103521 200480 208190 217466
13188B17466q8830m507k4519O1463Q2740K9321J33854K47263J90774N5845k12949
$$ 217466 128636 124129 99610 161073 243813 273134 406988 654251 845025 900870 687921
13177F87921k88889k32207j00013l7207p674j1768K2276m242M5418o3244L45m0375
$$ 687921 399032 166825 66812 29605 21931 10163 32439 28197 73615 10371 10716 -29659
13165b9659o677m9544P309N3340L0388O0466J43163M1556K59L7760K8289l5010
$$ -29659 -36336 -85880 -78571 -25231 5157 65623 208786 250342 250601 288361 316650 281640
13153B81640J5125R9738J55555K23225M08231N35930O21451J84245m41733o32156
$$ 281640 296765 396503 552058 775283 1183514 1719444 2340895 2525140 2083407 1451251
13143A451251m71935l24640k03102j45554l6873M934Q399o9458p8170k6927o534
$$ 1451251 979316 654676 451574 306020 269147 274081 282480 213022 134852 107925 101391
13132A01391j2499M8682P3878k2283p9119r6062j5502N9526K1652Q9427J26898
$$ 101391 88892 137574 211452 189169 110050 13988 -1514 58012 79664 169091 295989
13121B95989J604L9496J18206K26418K77646K88376M86797N76854K36618l67060
$$ 295989 297593 337089 455295 681713 959359 1247735 1734532 2311386 2548004 2180944
13111B180944o74077m48011l44352j80868j35609j12711p6036K9293P717m5725
$$ 2180944 1506867 1058856 714504 533636 398027 285316 209280 238573 246290 200565
13101B00565j79936l7746J4917O0658K1378k3753O5896M0777m0914m1588p4680
$$ 200565 20629 -17117 -2200 58458 79836 56083 121979 162756 121842 80254 5574
13090E574K8637R6360Q798l6348p9759N5099J63272J84345J88089K11093J48095
$$ 5574 34211 130571 139369 103021 23262 78361 241633 425978 614067 825160 973255
13079I73255j23262k36145k57268j74787m6602k5497k4303M2607j08005J9447
$$ 973255 849993 613848 356580 181793 135191 109694 85391 127998 19993 39440
13069C9440O6521K8001k8273o860R7257j1573r8653o3652p754k0823q064M3205
$$ 39440 105961 133962 105689 98829 196086 184513 85860 22208 14454 -6369 -14433 28772
13057B8772N3911M2525q5921q2935j0716k3603K7849J07497K0446O5161K404n348
$$ 28772 82683 125208 39287 -43648 -54364 -77967 -50118 57379 77825 142986 145390 140042
13045A40042n3241j6376j6902N3210R964n0247K5116k7693l0524L1551P2926l8656
$$ 140042 86801 70425 53523 106733 116697 66450 91566 63873 33349 64900 137826 99170
13033I9170n2544K2018k0724n8777k3342j1531J5448m4527m2521J01589R4658
$$ 99170 46626 68644 47920 -10857 -34199 -45730 -30282 -74809 -117330 -15741 78917
13022G8917J0703l3590p0896M6960M5137l1460n7708L1371J14281r3865J9134
$$ 78917 89620 56030 -14866 32094 77231 45771 -11937 19434 133715 39850 58984
13011E8984l7901o0606l1695q4454L0329J3122O6077M0120o3793k8656N1521Q7682
$$ 58984 21083 -39523 -71218 -155672 -125343 -112221 -46144 -6024 -69817 -98473 -46952 40730
12999D0730O5729q2785r2632l7550j9767J7770m632K7937P1099R3304L0750l0027
$$ 40730 106459 23674 -68958 -106508 -126275 -108505 -113137 -85200 -14101 79203 109953 79926
12987G9926j02966q9846M1725J4212J7245L226j0826m2893N3222J30452o5356
$$ 79926 -23040 -112886 -71161 -56949 -39704 -36478 -47304 -90197 -36975 93477 28121
12976B8121r3668n4727k1546L2861J27754M2271k8846m2714Q454L8151k1628r4009
$$ 28121 -65547 -120274 -141820 -108959 18795 61066 32220 -10494 -2040 36111 14483 -79526
12964g9526Q118O3799J0468P0462L3792l9328o7256k0513K4998j8493O1369O6345
$$ -79526 -71408 -7609 2859 73321 107113 67785 529 -19984 5014 -13479 47890 114235
12952A14235K1863l4175L0320j528J1061j10548r2934j9542M477n8913M6429P1750
$$ 114235 136098 101923 132243 130715 141776 31228 -61706 -81248 -76771 -135684 -89255 -17505
12940a7505N5284K6651P1954k0850j16284R199J5142J3952L6294K5760o5723l8653
$$ -17505 37779 64430 136384 115534 -750 8449 23591 37543 73837 99597 33874 -4779
12928d779j20o130o7931o891J17156R8323o4470k8220O7942O6612P58l2614j23186
$$ -4779 -4899 -11029 -78960 -85851 31305 129628 65158 36938 104880 171492 172250 139636 16450
12915A6450l986k2589r2291O3248M1633l9066J655k6277M3415l3840q098P9337
$$ 16450 12464 -10125 -102416 -39168 2465 -36601 -34946 -61223 -17808 -51648 -59746 19591
12903A9591L1819J9904p9545P8546L7134n7426J9687j8671l7257p9021P06L0290
$$ 19591 51410 71314 -8231 70315 107449 50023 69710 51039 13782 -65239 -64533 -34243
12891c4243M2046M9262l4658l5660k5958K6210L3836l0281k0034N1900L8936n6318
$$ -34243 7803 57065 22407 -13253 -39211 -13001 20835 -9446 -29480 22420 61356 5038
12879E038K7680L4757k1285m5423M4299N5458l8781p2160n4063l3220m8063j5528
$$ 5038 32718 67475 46190 767 45066 100524 61743 -10417 -64480 -97700 -145763 -161291
12867a61291J28473j6955P0907P156k4403l174j0831n5684J1617P8053K7323M5488
$$ -161291 -32818 -49773 21134 28290 3887 713 -10118 -65802 -54185 23868 51191 96679
12855I6679J7185q7416n3084l2582O4256j0894k8262M3816k9689o4706K1915L1806
$$ 96679 113864 26448 -26636 -59218 5038 -5856 -34118 9698 -19991 -84697 -62782 -30976
12843c0976k2344K3468M7869N5305P143m1604K7503k6796o2040R603n2569r587
$$ -30976 -53320 -29852 18017 73322 80465 38861 66364 39568 -22472 -12869 -65438 -75025
12831g5025N3133M0304n3844m4843k2551k7050O1379M375Q5197N0754P280R4255
$$ -75025 -21892 18412 -35432 -80275 -102826 -129876 -68497 -64122 21075 71829 79109 173364
12819A73364n0856r4888l8171M5970M4101m665l7047j4496j28508J7628J9946
$$ 173364 122508 27620 -10551 35419 79520 74855 37808 23312 -105196 -87568 -67622
12808f7622M4646P0066j8437O2745P663q0460o6692m9107J1252J7923j3740R8666
$$ -67622 -22976 47090 28653 91398 99061 18601 -48091 -97198 -85946 -68023 -81763 16903
12796A6903M8388q9729K2511N737k0155j6830p2752P3655P546M2524O1125p257
$$ 16903 65291 -24438 -1927 3810 -16345 -33175 -105927 -32272 -24726 17798 78923 71666
12784G1666n3933o5368J6313P417o9147n53K6557M0569N6693N3895l5646n0207
$$ 71666 17733 -47635 -31322 -23905 -93052 -93605 -67048 -26479 30214 84109 48463 -1744
12772a744M1099j7578j80838N0957J24710J3100o0017J1899l6307J897k8865n3546
$$ -1744 39355 21777 -159061 -108104 16606 29706 -30311 -18412 -54719 -52822 -81687 -135233
12760a35233n2220L5344N2683J07991O0337k7120J8200k3313j1620k7402j0729
$$ -135233 -187453 -152109 -99426 8565 68902 41782 59982 36669 25049 -2353 -13082
12749a3082k8581K90p3799j8575j8846R727L7824N6499Q774m8175O7692O5195
$$ -13082 -41663 -41373 -115172 -133747 -152593 -142866 -105042 -48543 -39769 -87944 -20252 44943
12737D4943m1299m5050j1253P489P4195k5324j3660j6229Q85O8071p5098K404
$$ 44943 3644 -41406 -52659 -45170 29025 3701 -9959 -26188 -25303 42768 -32330 -29926
12725b9926O1617n37Q82Q170M4576P0826r6162o556L71r2745l8664M1121J29777
$$ -29926 31691 31154 32036 40206 84782 155608 59446 52890 53261 -39484 -78148 -37027 92750
12712I2750J3259j20856k3751N2329K5631k6386J60K3579k2758J0801p4339j7251
$$ 92750 106009 -14847 -38598 13731 39362 12976 13136 36715 13957 24758 -49581 -66832
12700f6832O9743P4270n5948k3483q225k41L7274p7041q0216n8939M6797N5338
$$ -66832 2911 77181 21233 -2250 -10475 -10716 26558 -50483 -130699 -189638 -142841 -87503
12688h7503q751K4161n0467J8736j0022l4244K5532J7638J02106J661j6175o911
$$ -87503 -96254 -72093 -122560 -103824 -113846 -148090 -122558 -104920 -2814 -1153 -17328 -24239
12676b4239J8492o648l5069L9456k412M8272M6300o3068q8224j84Q1185K7742
$$ -24239 -5747 -12395 -47464 -8008 -10420 37852 84152 21084 -67140 -67324 13861 41603
12664D1603q8133o1948L4472Q7952O7743P5462j8784l4153n0638n6664p1202o846
$$ 41603 -46530 -108478 -74006 13946 81689 157151 138367 104214 53576 -3088 -74290 -81136
12652h1136j4508J19598L0070L0401o572j0978K8449K3762Q701q7925r6480J7457
$$ -81136 -95644 23954 54024 84425 77853 66875 95324 119086 127787 39862 -56618 -39161
12640c9161j0406j7096n6304J4709M9196L5140r318L3910k3231j18963M7050J14977
$$ -39161 -49567 -66663 -122967 -108258 -59062 -23922 -33240 670 -22561 -141524 -94474 20503
12628B0503P7140P9789l1246m897q3616M273q4507Q4358m234m9676q6977K5803
$$ 20503 97643 177432 146186 141289 57673 61946 -22561 61797 57563 7887 -79090 -53287
12616e3287P206K1192n2789k5744N9007Q7030R4153k8872l7774j1435k3787l6423
$$ -53287 -46081 -24889 -77678 -103422 -44415 42615 136768 107896 70122 58687 34900 -1523
12604a523K9168O1730O0581K9415k325k5439p3466k0581P5389M514j7574r0489
$$ -1523 27645 89375 149956 179371 177046 151607 78141 57560 132949 137463 119889 29400
12592B9400k5750P7824K0265N551L174j2338P0507J6865n4012o8425m9177P995
$$ 29400 3650 81474 101739 107290 110464 98126 168633 185498 131486 63061 13884 21879
12580B1879O2393M3186K0497l1772O4851O5812M636l3055p2410j4148n2626j4432
$$ 21879 84272 127458 147955 116183 181034 246846 251482 218427 146017 131869 79243 64811
12568F4811N8940J17777O8840m4569p3406j21977l9066j9580K9651P4624k0308
$$ 64811 123751 241528 310368 265799 192393 70416 31350 11770 41421 116045 95737
12557I5737L5413j8705j14228o1826o7064K932P2898O7863Q0487Q5226n0941j03220
$$ 95737 131150 112445 -1783 -63609 -130673 -127741 -54843 13020 93507 178733 127792 24572
12545B4572M1645N8179n3027P884j3131J1688r6281j2575J2527O0002j3865m0075
$$ 24572 66217 124396 71369 79253 66122 77810 -18471 -31046 -18519 41483 27618 -12457
12533a2457k8868K9844L9541q807O0500L7523l2037o1442k1213P3263K2345k7906
$$ -12457 -41325 -11481 28060 19253 79753 117276 85239 23797 2584 75847 98192 70286
12521G0286k7239N2632J4995P325n7167l8597R1316N2630K0286p7873j05679j5777
$$ 70286 43047 95679 110674 117999 60832 22235 113551 166181 186467 108594 2915 -12862
12509a2862Q7k9211L0069Q6619l1382L6637j1050J3537m9143K18O8704n5858m0766
$$ -12862 -12775 -41986 -11917 74702 43320 79957 68907 82444 33301 33519 102223 46365 5599
12496E599j82l6764M0975K2852P3761n237l0112k4356o0676m3571M6090J20029
$$ 5599 5417 -31347 9628 32480 106241 101004 70892 46536 -14140 -57711 -11621 108408
12484A08408k5833n3430p3502l7172N2792O4339L623L6675M4386N826l7126j3949
$$ 108408 82575 29145 -44357 -81529 -28737 35602 39225 75900 120286 126112 88986 75037
12472G5037N0664k0227l1583r7457m1540J11447M9554K6014J4217o5142J09680
$$ 75037 125701 105474 73891 -23566 -65106 46341 95895 121909 136126 70984 180664
12461A80664J16024N8450M6871R453K0730K0484J2149N5658K5050O6371J3700
$$ 180664 296688 355138 402009 411462 432192 452676 464825 520483 545533 611904 625604
12450F25604L2137J7434O516m5287p8611P471k1544o2658p0920J5452K8353L732
$$ 625604 657741 675175 681691 636404 557793 565264 543720 481062 410142 425594 453947 457679
12438D57679o1253n457n7279p8734o1886n8970m6870J6364q995q6468l9582O3479
$$ 457679 396426 390969 333690 254956 193070 134100 87230 103594 94599 8131 -31451 32028
12426C2028M4802K5413m1865N452J217j424j1516N6517L1552l1197J1735q9208
$$ 32028 76830 102243 60378 65830 67047 65623 54107 110624 142176 110979 122714 33506
12414C3506n9565P3850n9774j2605J7704k5429j6372l412N2233K6906K0267N5515
$$ 33506 -26059 47791 -11983 -24588 -6884 -32313 -48685 -52097 136 27042 47309 102824
12402A02824k3743k0801O3336R2198O933J6565J1096j8106q1318p5520J2199k1008
$$ 102824 79081 58280 121616 213814 220747 237312 248408 230302 148984 73464 85663 64655
12390F4655P2520J31034Q0813m6820j19945L0128J6427m5176m9903P450m873K3737
$$ 64655 137175 268209 349022 302202 182257 212385 228812 183636 133733 141183 136310 160047
12378A60047n0359j01201M7610J539r5761k946M0987l4955j2195K660K5854K4813
$$ 160047 109688 8487 56097 57636 -38125 -41071 -84 -35039 -47234 -44574 -18720 6093
12366F093M5058j7055Q6433K6394o7762m8788O6329k382k0502Q956O9524J6216
$$ 6093 51151 34096 120529 146923 79161 30373 96702 94320 73818 82774 152298 168514
12354A68514k961K5833m5862n1733j2251n1574L8253R9473j4581p2912q6508P4498
$$ 168514 165553 191386 145524 93791 81540 29966 68219 167692 153111 80199 -6309 68189
12342F8189J11908j8745r6022r1265j1625O1166l0068R1162O5096K3517o0703
$$ 68189 180097 161352 65330 -25935 -37560 23606 -6462 84700 149796 173313 112610
12331A12610J205k9294N6256O3430m1732o1806l0943L8839N3146K2406k9968l911
$$ 112610 113815 84521 140777 204207 162475 100669 69726 108565 161711 184117 154149 150238
12319A50238J5166o7190m8217J6997L2602k2612j689j0009k8671k7734j7550N3954
$$ 150238 165404 98214 49997 66994 99596 76984 75295 65286 36615 8881 -8669 45285
12307D5285O2461l0598L2071j614K0271k7620R668k4821j13439p902o6299L6489
$$ 45285 107746 77148 109219 107605 127876 100256 109924 85103 -28336 -36238 -102537 -66048
12295f6048Q1565Q2530K1529M662o5808j10158P9971J24113M5011r418P99j0410
$$ -66048 15517 98047 119576 124238 58430 -51728 28243 152356 197367 187949 188748 178338
12283A78338K4962n860R0886oM2413Q3978J67256J58877J6506j69452k42642k12562
$$ 178338 203300 197440 288326 288320 330733 414711 581967 740844 757350 587898 345256 132694
12271A32694r9287n9922L0706O8229K9360k7176n1367n9894K8329L4838L675J5109
$$ 132694 33407 -26515 4191 72420 101780 74604 23237 -36657 -8328 26510 30185 45294
12259D5294L0643l5925j5246j2688J1972j8681J5535N8381k0110N8326m3k5666
$$ 45294 75937 40012 24766 12078 24050 5369 20904 79285 59175 117501 117458 91792
12247I1792m9401m7340l5148L1863J19419L8360n1798q1156o8267L498K4665k0144
$$ 91792 42391 -4949 -40097 -8234 111185 149545 97747 16591 -51676 -48178 -23513 -43657
12235d3657p2629J5610J0627P2423k828M1643j8953o9369m2428L7715R273l2625
$$ -43657 -116286 -100676 -90049 -17626 -20454 21189 2236 -67133 -109561 -71846 -62573 -95198
12223i5198o8231M6734K6882J4071J0791K5203N6282K7060n7132j8529J8406l8605
$$ -95198 -163429 -116695 -89813 -75742 -64951 -39748 16534 43594 -13538 -32067 -13661 -52266
12211e2266R3233q001l7336K6875O611k6407k6051M5356M0961J9154k6205k135
$$ -52266 40967 32966 -4370 22505 29116 2709 -23342 22014 62975 82129 55924 53789
12199E3789L0913l9689R351o087q6035o7208M754R4490M8852P1404j3917p2575
$$ 53789 84702 45013 54364 48277 -37758 -104966 -100212 -5722 43130 114534 100617 28042
12187B8042p8431m023R8488J4092J00494N4962r5285p9090q740j4108R232N0981
$$ 28042 -50389 -54412 44076 58168 158662 213624 118339 39249 30509 16401 25633 76614
12175G6614J7960j7539o1260l4961R0933P4868L4806j0330p7966m4421k9023L6461
$$ 76614 94574 77035 15775 -19186 71747 146615 181421 171091 93125 48704 19681 56142
12163E6142Q42j7957N1506O5731L2709O484m7003q2634q3652n2077Q8794P1336
$$ 56142 56984 39027 90533 156264 188973 195457 148454 65820 -17832 -69909 18885 90221
12151I0221J0249j2947l6388k7550k467L0714K5470M7976o2768n2352k5796J1778
$$ 90221 100470 87523 51135 23585 21118 51832 77302 125278 62510 10158 -15638 -3860
12139c860l9854K1672P7039N2133O9885M9064q1159r3150P256o1161n5231O4471
$$ -3860 -43714 -22042 54997 107130 177015 226079 144920 51770 59026 -2135 -57366 7105
12127G105J9831N256m7864J157j168m5605J9897M6311K2707P8950P4081l6792
$$ 7105 26936 32192 -15672 -14515 -15683 -61288 -41391 4920 27627 106577 180658 143866
12115A43866L9159L5m8209o1303o330J9681j277K5282R984l4248Q6770K1303k9214
$$ 143866 183025 183060 134851 73548 67218 86899 85622 110904 120888 86640 173410 194713 165499
12102A65499j08116o2984P0277K7735N186L7793N6068K4036j9606m590l986o6890
$$ 165499 57383 -5601 64676 92411 97597 135390 191458 215494 195888 191298 187312 120422
12090A20422l9100L0224L1261M9365M9792q1114l7058J3480L9729l6470p4544
$$ 120422 81322 111546 142807 192172 241964 160850 123792 137272 177001 140531 65987
12079F5987n3538K6189N2198P353l9269K7437l6663L0697m640N0673j281N469
$$ 65987 12449 38638 90836 98189 58920 86357 49694 80391 75751 126424 125143 130612
12067A30612q365o854p3789K2199L5820N5137M8363K6511m8042l5428k0339J2499
$$ 130612 122247 115393 41604 63803 99623 154760 203123 229634 181592 146164 125825 138324
12055A38324o4086j03982J43934J38625K2533M5542m8940j53415r1759J10324
$$ 138324 74238 -29744 114190 252815 275348 320890 271950 118535 26776 137100
12045A37100j0341j09959j25931k3873R3348P7647k64038n16419m24426j54243
$$ 137100 126759 16800 -109131 -133004 -39656 37991 -226047 -742466 -1166892 -1321135
12035a321135J40951M24501L86415K36134K30295J17962M5760m8972L831k8179
$$ -1321135 -1180184 -755683 -369268 -133134 97161 215123 260883 211911 215742 187563
12025A87563l877Q7358q2827j7055n1054o471K6475o77Q5277L071m044k4222n961
$$ 187563 183686 271044 188217 171162 120108 113637 140112 139435 224712 227783 223739 199517 193556
12012A93556j5492L3767J7174j24195l7035N0079m238o666K124k2281k566L9225
$$ 193556 178064 211831 229005 104810 67775 117854 113616 106950 109074 86793 84227 123452
12000A23452M3421L3741M1147N2226k1293P1581J06321M1590l6546j03905L1126
$$ 123452 166873 200614 241761 293987 272694 344275 450596 492186 455640 351735 382861
11989C82861Q0092n6457k9744k1602o671K6630N281L8615k6312k3230O468N505
$$ 382861 462953 406496 376752 355150 348479 375109 380390 419005 392693 369463 375931 381436
11977C81436J8857K3279M1442j4740j2969J4065R310N9096L6267P2507J6078K4747
$$ 381436 400293 423572 465014 450274 437305 451370 460680 519776 556043 628550 644628 669375
11965F69375J01554M5516M21J2077K8968K463K8225P9542Q4597P0782O3381J02179
$$ 669375 770929 816445 816866 828943 857911 860374 888599 968141 1052738 1123520 1186901 1289080
11953A289080J55599N1136K4372N6807Q5117J55534Q4143M4655J45744J41194
$$ 1289080 1444679 1495815 1520187 1576994 1662111 1817645 1901788 1946443 2092187 2233381
11943B233381J48829R8230P3029J36211K45300K76824L31416L24991K96095L12703
$$ 2233381 2382210 2480440 2553469 2689680 2934980 3211804 3543220 3868211 4164306 4477009
11933D477009M12336M62598O78102P45330Q20317J041471J170382J395448J736374
$$ 4477009 4889345 5351943 6030045 6775375 7595692 8637163 9807545 11202993 12939367
11924A2939367K175817K759639L473618M659705O283588Q779240J2755621J9278156
$$ 12939367 15115184 17874823 21348441 26008146 32291734 41070974 53826595 73104751
11916G3104751K9948544M7071829P3603817J09826486J31274701N3478238r2927171
$$ 73104751 103053295 150125124 223728941 333555427 464830128 518308366 425381195
11909D25381195j32887780r7212710o0432707l7427021k4148507j6332846j1582583
$$ 425381195 292493415 195280705 134847998 97420977 73272470 56939624 45357041
11902D5357041q363981o194603m752904l686315k913547k384408j996666j648110
$$ 45357041 36993060 30798457 26045553 22359238 19445691 17061283 15064617 13416507
11894A3416507j303242j021711r02989o50507n01779m09352l08381k86985j78776
$$ 13416507 12113265 11091554 10188565 9538058 9036279 8626927 8318546 8031561 7852785
11885G852785M4016J21226K56806L48868N26997O32952O02450O71460P27347O47967
$$ 7852785 7896801 8018027 8274833 8623701 9150698 9783650 10386100 11057560 11784907 12432874
11875A2432874N04839J78490k80737o63701j014924j035261r69850j007413r98538
$$ 12432874 12937713 13116203 12835466 12171765 11156841 10121580 9151730 8144317 7145779
11866G145779r22469p90287o99998o08578n18899l55623l46833l33525k83119
$$ 7145779 6223310 5433023 4733025 4124447 3605548 3249925 2903092 2569567 2286448
11857B286448k32860j75278p5905j19182j17531j45059p1336k9543l1632j200
$$ 2286448 2053588 1878310 1802405 1683223 1565692 1420633 1349297 1319754 1288122 1286922
11847A286922m5105r9252j18935N5566m1469j31671l0910L6825r437n3129k0568
$$ 1286922 1241817 1142565 1023630 1079196 1037727 906056 875146 911971 902534 849405 828837
11836H28837Q135j04974k0663m8014l0647O8381L2805n0136m238J08825n303m8959
$$ 828837 836972 731998 711335 663321 632674 701055 733860 683724 679486 788311 783008 734049
11824G34049j19377k0134L2275L2846q1839p2681k262Q4609r1694j0434J9878
$$ 734049 614672 594538 626813 659659 577820 505139 502877 587486 495792 485358 505236
11813E05236n8357q303R789J3997j6251q7512p2916M9619P789J06620K0409j34185
$$ 505236 446879 438576 448365 462362 446111 358599 285683 335302 343091 449711 470120 335935
11801C35935k6541J2836M3019n7762q1427p0265m9569M613J3553l4115J0885K50793
$$ 335935 309394 322230 365249 307487 226060 155795 106226 110839 124392 90277 101162 351955
11789C51955M54874N43453L75921J17819k41926m52309k70523p1407j09052M1059
$$ 351955 806829 1350282 1726203 1844022 1602096 1149787 879264 807857 698805 739864
11779G39864m4978m0502j01117O508J14932r8514k38869q6810M7857L5216n9638
$$ 739864 694886 654384 553267 559775 674707 576193 337324 250514 298371 333587 273949
11768B73949L4436k3097O729O0531j6337l518M4155p2872m163k2029j8005p0043
$$ 273949 308385 285288 292017 352548 336211 332693 376848 303976 299813 277784 259779 189736
11756A89736m0981r9878L5596M4899p9510K1567N2913J9397O0318L4552k3800
$$ 189736 148755 48877 84473 129372 49862 71429 124342 143739 204057 238609 214809
11745B14809L4737L1807J2492j2517l0933o8451K7452J7550m3262q1824n8205
$$ 214809 249546 281353 293845 281328 250395 181944 209396 226946 183684 101860 43655
11734D3655n4987L8145J54605M7784o7879n8720p349J9835o3665k7317O3840N0560
$$ 43655 -11332 26813 181418 229202 161323 102603 95254 115089 51424 24107 87947 138507
11722A38507l6787m4232n0040J04853p069q1768q6906M9781J65508O9855l6982
$$ 138507 101720 57488 7448 112301 105232 23464 -63442 -13661 151847 221702 184720
11711A84720j225O530m0474o9360m3232J7506K2204O1589R7494N6451q590p732
$$ 184720 183495 190025 149551 80191 36959 54465 76669 138258 235752 292203 283613 275881
11699B75881l5617n6574J05323R4038j1800m8899K5458k0519p0864N8036J0131
$$ 275881 240264 183690 289013 383051 371251 322352 347810 327291 256427 314463 324594
11688C24594p5358l569K2372k2628m0297l5043k93O3144K7768l5595p2568k0272
$$ 324594 249236 245667 268039 245411 205114 170071 169778 232922 260690 225095 152527 132255
11676A32255Q8225J05952k3747m8686J7263N3483N7948J32964J29777J60672M44614
$$ 132255 220480 326432 302685 253999 271262 324745 382693 515657 645434 806106 1250720
11665A250720O12056R27083J447887K341061L356618J724608k331016l273196
$$ 1250720 1862776 2789859 4237746 6578807 9935425 11660033 9329017 6055821
11657F055821k058107j212035p94957n38753l13703j51991j53270r0551j50869
$$ 6055821 3997714 2785679 1990722 1451969 1138266 986275 833005 742454 591585
11648E91585j3211l956j23448j2479J8722j3946j4792O000L8890L8426J09696
$$ 591585 578374 574418 450970 438491 457213 443267 428475 434475 473365 511791 621487
11637F21487J44822Q0365J36785J77861L96231N41510P54686J320502K125363
$$ 621487 766309 846674 983459 1161320 1557551 2099061 2853747 4174249 6299612
11628F299612L177489K439687j622871l509541k500627j523485q51215m76968
$$ 6299612 9477101 11916788 10293917 6784376 4283749 2760264 1909049 1432081
11620A432081k83199k12732r2954j16197j26945j31436j2274O084n5680m7870
$$ 1432081 1148882 936150 843196 726999 600054 468618 456344 462428 406748 358878
11610C58878O4018r2408j33778Q368n8132L7605J27868L0150o5390n9204J2899
$$ 358878 422896 330488 196710 205078 146946 184551 312419 342569 277179 217975 230874
11599B30874k410O0816p927k8390l093p3997l2236l825N1029K8579l8085J0565
$$ 230874 228464 289280 281353 252963 249870 175873 143637 139812 190841 219420 181335 191900
11587A91900M1562j0345q1736m4722M686K446O0052J7803l7172l2210j064l0587
$$ 191900 233462 223117 141381 96659 101345 103791 163843 181646 144474 112264 111200 80613
11575H0613l9520M0558j7963K6551L0399j0623O8476k9979l0765j1860l1526l5878
$$ 80613 41093 81651 63688 90239 120638 110015 178491 148512 117747 105887 74361 38483
11563C8483O893J8453r261L7795l7135P2763K5118P3943m3835n8965r5963k3174
$$ 38483 45376 63829 54568 92363 55228 127991 153109 227052 183217 124252 28289 5115
11551E115j0393n723P5477L1958O6942r5542j5433n7399o2037M0062R8912M3427
$$ 5115 -5278 -11001 64476 96434 163376 67834 52401 -4998 -67035 -26973 71939 115366
11539A15366k0603n1797J6897j329M012J20470P3260k9623o7383p7225l8187N9819
$$ 115366 94763 42966 59863 58534 62546 183016 256276 226653 159270 82045 43858 103677
11527A03677k3169n2812K048N2398K7638r526K2980j1209m7156n3892l9591L1555
$$ 103677 80508 27696 29744 82142 109780 100254 123234 112025 64869 10977 -28614 2941
11515B941k5331K7725N2802K3145n5299L1148n0028j1937o6593O463K9044O7299
$$ 2941 -22390 5335 58137 81282 25983 57131 7103 -4834 -71427 -64964 -35920 31379
11503C1379L7648K0950l3705o0112L544J9226r659L3379j9383j6854o850k652
$$ 31379 69027 89977 56272 -3840 -296 18930 9271 42650 23267 6413 -437 -3089
11491c089J2714k2175J20395O6707q157m5260k5156n3924J0106J1383P6373o8419
$$ -3089 9625 -12550 107845 174552 166395 121135 95979 42055 52161 63544 139917 71498
11479G1498l8663K433l0833l8191O633o118O2098J609K3926n0469m4864N4060
$$ 71498 32835 35268 4435 -33756 -27123 -33241 28857 30466 54392 3923 -40941 13119
11467A3119k7763n6471K6101J4266M9492M7498J5236J9118j7975J2082o0003L6671
$$ 13119 -14644 -71115 -45014 -30748 18744 66242 81478 100596 82621 94703 34700 71371
11455G1371o242m5928l5581M6352J02435L9473j3711j9076j6698q0894l9456k4356
$$ 71371 65129 19201 -16380 29972 132407 171880 158169 139093 122395 41501 2045 -22311
11443b2311O5201N1103L6932o2091k6839N0470n558M6432o787M0187l4273o3494
$$ -22311 42890 93993 130925 68834 41995 92465 86907 133339 126552 166739 132466 68972
11431F8972n4239j8816j10976k5112K802J2590N21M6789K900K645R091J3313J23891
$$ 68972 14733 -4083 -115059 -140171 -137369 -124779 -124258 -77469 -74569 -71924 -62833 -49520 74371
11418G4371J5158j11847q7130N5261R8687m9806M77O8259o5812j5095j0120k3309
$$ 74371 89529 -22318 -109448 -54187 44500 -5306 -4829 63430 -2382 -17477 -27597 -50906
11406e0906K2185M7632J00594j6793k5676O49p8340J5931p3565m8196O6740J38173
$$ -50906 -28721 18911 119505 102712 77036 77685 -655 15276 -58289 -106485 -39745 98428
11394I8428K2835O4L0722o0509o1081k4557M0527q3482m99l6399O1284l4391m3784
$$ 98428 121263 121327 152049 91540 30459 5902 46429 -37053 -37552 -73951 -12667 -47058 -90842
11381i0842O9813Q2252K0212L8754m91p624m2771J4014p3958p2777L9727J17026
$$ -90842 -21029 61223 81435 120189 119698 112074 69303 83317 9359 -63418 -23691 93335
11369I3335P272j15073O222N1663k7647O473l1207k1351J06757l2526m0305k6555
$$ 93335 100607 -14466 -8244 43419 15772 22245 -8962 -30313 76444 43918 3613 -22942
11357b2942n6926O7113J42353q7302k6057M0355l7825l2876O4445m7587q0920
$$ -22942 -79868 -12755 129598 42296 16239 56594 18769 -14107 50338 2751 -78169
11346g8169j02359N0047O0573K9755Q1707j9264J273P176o1049l0834m4O9528
$$ -78169 -180528 -130481 -69908 -40153 41554 22290 23563 30739 -30310 -61144 -61188 8340
11334H340L9274M0566r152l1464k1480m9846n1449P3815P5854K6926j0174k1230
$$ 8340 47614 88180 79028 47564 26084 -23762 -75211 -1396 74458 101384 91210 69980
11322F9980l3431l2061k5979J5546O4311k8215K8543Q203q7160o0021k380m369
$$ 69980 36549 4488 -21491 -5945 58366 30151 58694 66897 -20263 -80284 -82664 -87033
11310h7033M7955k435L6258j8092n4927m3596l7758k0691L4019P202Q0331M363
$$ -87033 -39078 -41513 -5255 -23347 -78274 -121870 -159628 -180319 -146300 -139098 -58767 -54404
11298e4404L1589K5428l4931O587l2382q0685M4971O0245M7331R589n3700n1233
$$ -54404 -22815 2613 -32318 -25731 -58113 -138798 -93827 -33582 13749 23338 -30362 -81595
11286h1595k5872R8059j2861l1243M9873Q1941O0726J9019M8196j12719r0234
$$ -81595 -107467 -9408 -22269 -53512 -3639 78302 139028 158047 206243 93524 3290
11275C290j1196n007K1860N263o6128K0258N820M4101N2682O9341N5286n4867
$$ 3290 -7906 -12913 8947 14210 -51918 -31660 -25840 18261 70943 140284 195570 140703
11263A40703q7684m1143k7907j8123k8417j0051k7393j0361J7136N9255M1031
$$ 140703 53019 11876 -16031 -34154 -62571 -72622 -100015 -110376 -93240 -33985 7046
11252G046m0876P1479M5780M7807r8237r1261j5178J2549J3082p939j14402J4554
$$ 7046 -33830 37649 83429 131236 32999 -58262 -73440 -60891 -47809 -55748 -170150 -155596
11240a55596k0436Q9005J01752Q1665m3551p3525o1586Q8410J11860q0842j06034
$$ -155596 -176032 -87027 14725 96390 52839 -20686 -82272 6138 117998 37156 -68878
11229f8878O2035O2623M1368j00449j36858l6327M4049O0717K9883R7359J09702
$$ -68878 -6843 55780 97148 -3301 -140159 -176486 -132437 -71720 -41837 55522 165224
11218A65224n2515q5273L8240j1221p425m139N8120J22290J89783P5505L4009
$$ 165224 112709 27436 65676 54455 47030 42891 101011 223301 413084 488589 522598
11207E22598L11335N72998N07354J57493j2014n2621l41606n77404l72631j92760
$$ 522598 833933 1406931 1914285 2071778 2059764 2007143 1665537 1088133 715502 522742
11197E22742j40416p0341q6503m7322k074L0057j3441o2517K6656p7651m1236
$$ 522742 382326 311985 225482 178160 176086 206143 192702 130185 156841 79190 37954
11186C7954K5210N9982k0864K9377O8720K6220r4762n1938J4916j8051k177N6793
$$ 37954 63164 123146 102282 131659 200379 226599 131837 79899 94815 76764 74587 131380
11174A31380l1189l9403o1545j18525M3608R4591N8686o5611K4706n759J276r712
$$ 131380 100191 60788 -757 -119282 -75674 18917 77603 11992 36698 30939 32215 22503
11162B2503l2839j5081J0825R3005J9431j040j7193p6731m3811j3165k6779p327
$$ 22503 -10336 -25417 -14592 78413 97844 96804 79611 2880 -40931 -54096 -80875 -88202
11150h8202L0186O6653J7175l4187p3785k0479K1250Q0175L0489M3325P2901l5585
$$ -88202 -58016 8637 25812 -8375 -82160 -102639 -81389 -1214 29275 72600 145501 109916
11138A09916j27637m0935P704J14127o8139P726N7642L2450j0430j4762j1406
$$ 109916 -17721 -58656 -50952 63175 -4964 2762 60404 92854 82424 67662 56256
11127E6256k4272n0417j9599j3367k0119k140K8263j0046j763l0165M7294J8193
$$ 56256 31984 -18433 -38032 -51399 -71518 -73658 -45395 -55441 -57204 -87369 -40075 -21882
11115b1882j1683r1029l0462J3104O0369O4138p86L2773K643j5764k785N701l7935
$$ -21882 -33565 -124594 -155056 -141952 -81583 -17445 -18231 14542 17185 1421 -1364 4337 -33598
11102c3598m840O1559n4629r9179K2745l451K1032K9234M1395J30600k7894M390
$$ -33598 -38438 23121 -31508 -130687 -107942 -111393 -90361 -61127 -19732 110868 82974 87364
11090H7364j479j7578j04p1394m8965k3699M7623j4304M2251L196l0019m8655
$$ 87364 85885 68307 68203 -3191 -52156 -75855 -28232 -42536 -285 2911 -27108 -75763
11078g5763K4417P4307N080K8733K8582R0461K3886o8074j7943l7869n136K6375
$$ -75763 -51346 22961 28041 56774 85356 175817 199703 131629 113686 75817 70681 97056
11066I7056M0824k1210M4442n000q1753L132M9773m9492J7935N9901L8490Q301
$$ 97056 137880 116670 161112 156112 74359 77491 127264 77772 95707 155608 194098 202399
11054B02399j55444r8976P8876j0898r416Q1706Q8469P3884P1208O3050Q7273
$$ 202399 46955 -52021 26855 15957 6541 88247 176716 250600 321808 384858 472131
11043D72131K6666j10092j19665Q2217L2546o4730J14873J70524J25500J47994
$$ 472131 498797 388705 269040 351257 383803 319073 433946 604470 729970 877964
11033H77964J80087M5690J6648n8698q4392j03025q9968m7078l39K6933J96578
$$ 877964 1058051 1103741 1120389 1061691 977299 874274 784306 737228 736889 763822 960400
11022I60400K22727J50277Q2448j08753j27176j68314j62948j35638j32492N6896
$$ 960400 1183127 1333404 1415852 1307099 1179923 1011609 848661 713023 580531 637427
11012F37427P2781j0736J25449J88192L2468j06912k10273k9026l8934j45923
$$ 637427 710208 699472 824921 1013113 1045581 938669 728396 699370 660436 514513
11002E14513o5075q7544m5691N2823P5832K6497m9158l7369L8719l3251o9702
$$ 514513 449438 361894 316203 369026 444858 471355 422197 384828 423547 390296 320594
10991C20594j38185q8161K5838m5589m9060o7139m9295r1906j296J21663R4584
$$ 320594 182409 94248 120086 74497 25437 -41702 -90997 -182903 -184199 -62536 32048
10980C2048r135r47l1873J6092L9649l5742l3976k5912J7360M6684J0632J4859
$$ 32048 22913 21966 -9907 6185 45834 10092 -23884 -49796 -32436 14248 24880 39739
10968C9739k3822J0370O6218q81p165J5684P088L1431L7233Q8023J26067J78642
$$ 39739 15917 26287 92505 91624 84459 100143 107231 138662 175895 263918 389985 568627
10956E68627J03604J76027M54599L28145m5485o7179K8160R8738j74887m51358
$$ 568627 672231 848258 1302857 1631002 1585517 1518338 1546498 1645236 1470349 1018991
10946A018991l21071k39813j50303p9249l3573j9391J5278L7985p9776j26436
$$ 1018991 697920 458107 307804 228555 194982 175591 190869 228854 149078 22642
10936B2642n9801L1053J60503P0554k4969j72397k8299L1676j9594J3461k8237
$$ 22642 -37159 -6106 154397 224951 199982 27585 -714 30962 11368 24829 -3408
10925c408l4033J6718R837P0124K3345m9364m3072J0857K4764m2423Q974P840
$$ -3408 -37441 -20723 -10886 59238 82583 33219 -9853 1004 25768 -16655 -7681 159
10913A59j3043K5863n232K4166k0852n4379j8655p3500l0872N4486K5176j8282
$$ 159 -12884 12979 7747 31913 11061 -43318 -61973 -135473 -166345 -111859 -86683 -104965
10901a04965L0858Q5006n380j29114k9785R1646N099n9479P623M7222l9223l2551
$$ -104965 -74107 10899 5519 -123595 -153380 -61734 -56635 -116114 -108491 -61269 -100492 -133043
10889a33043K6371O3649R8658j302k2303j083J8080j7375k4888M3101O2756P760
$$ -133043 -106672 -43023 55635 54333 32030 30947 49027 31652 6764 49865 112621 120381
10877A20381P343R168M874p2929n9934n5211M9199R8027n6620P7440l4765J7414
$$ 120381 127724 136892 141766 68837 8903 -46308 2891 100918 44298 121738 86973 104387
10865A04387j9604k4758l5179K4997J45003P7646r6246J8505l376j04234L812
$$ 104387 84783 60025 24846 49843 194846 272492 176246 194751 191375 87141 90953
10854I0953l282L8316P339k0645m3911J4065j4794L4436m2481o5048l706M3731
$$ 90953 87671 125987 133326 112681 68770 82835 68041 102477 59996 -5052 -8758 34973
10842C4973P1631R70l0404q1317o804N0754J16j2684m005O0812n7955k8780O3944
$$ 34973 106604 107574 77170 -4147 -10951 39803 39919 27235 23230 84042 26087 -2693 61251
10829F1251k7285j8274J8225M055n3899l3534P6670L5970L8687m6221j56573J2567
$$ 61251 33966 15692 33917 37972 -15927 -49461 27209 63179 101866 55645 -100928 -88361
10817h8361n3090J1148P1520P0403K356j8652l2488n351Q129J7192J3186N2174
$$ -88361 -141451 -130303 -58783 11620 13976 -4676 -37164 -42515 -34386 -17194 -4008 48166
10805D8166k0724j6744p8668J4683P6846R458l3043o7710l6885O2683N1182o933
$$ 48166 27442 10698 -67970 -53287 23559 33017 -26 -67736 -104621 -41938 9244 2311
10793B311N0185o7700k9077P6360N8509j4656K6428n7753r7250J2510j0334p438
$$ 2311 52496 -15204 -44281 32079 90588 75932 102360 44607 -52643 -40133 -50467 -57905
10781e7905J7486J8943q1619p5k0258j5866O6109Q0233L2402K1179n3653o9203
$$ -57905 -40419 -21476 -103095 -103170 -123428 -139294 -73185 7048 39450 60629 6976 -62227
10769f2227K0056O3012P3161l0716o1504m6735j0441J8021j9287j0553J14526
$$ -62227 -42171 20841 94002 63286 1782 -44953 -55394 -37373 -56660 -67213 47313
10758D7313m522J5058J34335M403J2027j5390p4625j32273M979P8384K7918q510
$$ 47313 42791 57849 192184 196587 208614 193224 118599 -13674 -8695 69689 97607 89097
10746H9097o4590K4889o543J0868M2200L903r6039j3033j5448l5362J7722J7993
$$ 89097 24507 49396 42853 53721 95921 99824 3785 -9248 -24696 -60058 -42336 -24343
10734b4343k4254R3724Q4883j5341n9429q9394j21029p2298n3649K7747L5518
$$ -24343 -48597 45127 130010 114669 55240 -34154 -155183 -227481 -281130 -253383 -217865
10723b17865L4577N3908R1355M4511q907l3842j53185j88891j01259j11439K6033
$$ -217865 -183288 -129380 -38025 6486 -2421 -36263 -189448 -378339 -479598 -591037 -565004
10712e65004J66071J98486J41461k5273K9229R6697Q763n6323j85605j58022K1777
$$ -565004 -398933 -200447 -58986 -84259 -55030 41667 50430 -5893 -191498 -349520 -327743
10701c27743J14244J07351J42553J9493K7269j9884P1544M9060n475j23893q0423
$$ -327743 -213499 -106148 36405 55898 83167 63283 134827 183887 178412 54519 -25904
10690b5904Q3108J3600q4544N9248M7612O6999K793L502J9104R803j3776L2817
$$ -25904 57204 70804 -13740 45508 93120 160119 162912 166414 185518 195321 181545 214362
10678B14362j07067M6237P4260J19817k0744o5432p199P4772k2285Q678j6870
$$ 214362 107295 153532 227792 347609 326865 261433 254234 329006 306721 315399 298529
10667B98529j0169K9132M8018M325k8800J2487N908j618m9970k3043M2582L5898
$$ 298529 288360 317492 365510 369835 341035 353522 359430 357812 307842 284799 327381 363279
10655C63279N7796K4364k9011O3369M8637L0480L4818J05051N7571O4182K7995
$$ 363279 421075 445439 416428 479797 528434 558914 593732 698783 756354 820536 848531
10644H48531N5628J01319J17007Q7623J16087p227P1921J60619K42253L16716
$$ 848531 904159 1005478 1122485 1210108 1326195 1318968 1390889 1551508 1793761 2110477
10634B110477L11906L96874N02555M82296M79672L40631K31579L65161O20671
$$ 2110477 2422383 2819257 3321812 3804108 4283780 4624411 4855990 5221151 5841822
10625E841822P99272J013621J464619K032329K764477L762608N373617P131112
$$ 5841822 6641094 7654715 9119334 11151663 13916140 17678748 23052365 30183477
10617C0183477R158691J1364932J2030749R141455K890926k821730m955374l886167
$$ 30183477 39342168 50707100 62737849 71879304 74770230 71948500 66993126 63106959
10609F3106959j161515K553430O917353J1909822J7905295K3625916K4766107
$$ 63106959 61945444 64498874 71416227 83326049 101231344 124857260 149623367
10602A49623367J6148706q50913j4387885j7676615j3742360p155963J04983P695028
$$ 149623367 165772073 164921160 150533275 132856660 119114300 111958337 112063320 119758348
10594A19758348J5669692K3949603L0648969L0108823J5029765j0681428k8817821
$$ 119758348 135428040 159377643 190026612 220135435 235165200 224483772 195665951
10587A95665951l1365222k5040087j6375263q110482o18347O224276J2634528
$$ 195665951 164300729 139260642 122885379 114774897 114156550 120380826 133015354
10580A33015354J6997466J5316258L752721j3357663k4112529k4411071j8912756
$$ 133015354 150012820 165329078 169081799 155724136 131611607 107200536 88287780
10573H8287780j2574009p100659k766615P62492L306037M636362L158887j852788
$$ 88287780 75713771 68613112 65846497 66608989 69915026 74551388 77710275 75857487
10565G5857487q146532j1878529j1894507r798506p410497n344551l920371k863921
$$ 75857487 67710955 55832426 43937919 34139413 26728916 21384365 17463994 14600073
10557A4600073k184858j660157j303972r72009q40875p88614o94419o08974m82544
$$ 14600073 12415215 10755058 9451086 8479077 7638202 6849588 6155169 5546195 5063651
10548E063651m41103l81720k95392k91115k56051j61603j61098j47186j56055
$$ 5063651 4622548 4240828 3945436 3654321 3398270 3236667 3075569 2928383 2772328
10539B772328j93798l6878o9817j40955j69584j12558j15897o960m3880l8198
$$ 2772328 2578530 2541652 2471835 2330880 2161296 2048738 1932841 1925881 1882001 1843803
10529A843803l5257j41409r9906j2446o4559m5546n3513l8673K4107o277P978
$$ 1843803 1808546 1667137 1567231 1554785 1490226 1444680 1391167 1352494 1376601 1370324 1378302
10518A378302j1817j11188n4768k3559q9022J0241j399n9217l297o597O6443K702
$$ 1378302 1366485 1255297 1200529 1176970 1087948 1098189 1096790 1037573 1034276 1027679 1094122 1096824
10506A096824k011o6257o1870l6489p8497J8055l8295L8538J9569m2073p5307
$$ 1096824 1094813 1028556 966686 930197 851700 869755 831460 869998 889567 847494 772187
10495G72187o0675K571M6625r060n616m0170O9615L5792j073r1033k1545L522
$$ 772187 711512 714083 760708 751648 746032 705862 775477 811269 810196 719163 697618 701140
10483G01140l0805Q3n806j5138N1589J91648J06113o2476j51376l6673j17252
$$ 701140 670335 670418 664612 649474 701063 892711 998824 936348 784972 748299 631047
10472F31047J1257N2075l7679K0026K09336R3396J15927M5358l1764j04788j68639
$$ 631047 642304 694379 656700 676726 886062 979458 1095385 1140743 1108979 1004191 835552
10461H35552r9530l8581j04230k0093N1291J47392J00224N4814k1987m9478j54190
$$ 835552 736022 697441 593211 573118 624409 771801 872025 926839 904852 855374 701184
10450G01184j72824l7672P608J10043M4706n5163p0757Q3810L9898M8519j7086
$$ 701184 528360 490688 498296 608339 653045 597882 527125 610935 650833 699352 682266
10439F82266o6707p6558q4262l9844j9128R041K1883O2267k0089r8479k9123m8519
$$ 682266 615559 539001 454739 414895 395767 404808 426691 488958 468869 370390 341267 292748
10427B92748k1053L392L5759K2840p6885m9961Q1204O4650L9746q6075n3811k2228
$$ 292748 271695 275087 310846 333686 256801 206840 288044 352694 392440 306365 252554 230326
10415B30326j7404l4649J10097J10210M60K5885l4654j00889l8196p8133n5308
$$ 230326 212922 178273 288370 398580 399040 424925 390271 289382 251186 173053 117745
10404A17745N3507J28284R5920k680r121l9066r7856p1581j9186r1602J5050J58388
$$ 117745 171252 299536 395456 392776 383655 344589 246733 175152 155966 64364 79414 237802
10392B37802J05479L4905p222k5033o6313m6657N5865j2563j18929M4760M9173
$$ 237802 343281 378186 370964 345931 279618 232961 288826 276263 157334 202094 251267
10381B51267K7631N6082M2424m9351Q903m426L0093L7931K2428o0011j9008m3261
$$ 251267 278898 334980 377404 328053 336956 332530 362623 400554 422982 362971 343963 300702
10369C00702o0991M3586N3393n1413K978O199J8947P0975L2458j24126q2333L7684
$$ 300702 239711 283297 336690 285277 288255 294454 313401 384376 416834 292708 210375 248059
10357B48059J4128q2173l8351l0421N5674J05636K6746o8355m5231K732p732N7530
$$ 248059 262187 180014 141663 111242 166916 272552 299298 230943 185712 188444 180712 238242
10345B38242q1427o3960K209J694M8649J46769L7601l7651J0414M9040P0284r804
$$ 238242 156815 92855 95064 96758 145407 292176 329777 292126 302540 351580 421864 412060
10333D12060K4695p5360o2766m1445n9750j6018q955j0507k9847j9941Q9235k1543
$$ 412060 436755 361395 298629 257184 197434 181416 172461 161954 132107 112166 201401 179858
10321A79858q831M0623L8263m6181n6409j4234O7463J8506o671L2320L5762P8417
$$ 179858 171027 211650 249913 203732 147323 133089 200552 219058 212387 244707 280469 358886
10309C58886Q1520K3193M6863J8932j7295j45470r0959j07668l2573K3237K5960
$$ 358886 440406 463599 510462 529394 512099 366629 275670 168002 135429 158666 184626
10298A84626l5942j1878R1348J3816K2195P9017r4005m9609q800j2640k7479N6501
$$ 184626 148684 136806 228154 241970 264165 343182 249177 199568 190768 178128 150649 207150
10286B07150P372j2198k0002m355n8523J9568l2104K8900L5375R9172J21602j058
$$ 207150 214522 202324 182322 177967 119444 139012 106908 135808 171183 270355 391957 390899
10274C90899k011k2945o6736M293K1597L6132K171q4440o6029M7161N5196L8337
$$ 390899 388888 365943 299207 303500 325097 361229 363400 278960 212931 260092 315288 353625
10262C53625K3348n8843p3873p101j4629K6089l2505j1695N0053o3483m4020O3688
$$ 353625 376973 318130 244257 237156 222527 248616 216111 204416 254469 190986 146966 210654
10250B10654r6716K1155M1966q139L746J5392P8206N5921j9026r4157N580j5629
$$ 210654 113938 135093 177059 168920 172666 188058 266264 322185 303159 209002 214582 198953
10238A98953j9553r1098L1764j411l6606J5830Q667j37539M709P7905L4210k8971
$$ 198953 179400 88302 120066 118655 82049 97879 106546 -30993 -26284 51621 85831 56860
10226E6860l9197J1720J25420O2973j0654m0891N4495q634m8898l299O561q8536
$$ 56860 17663 29383 154803 217776 207122 166231 220726 212092 163194 159895 166456 77920
10214G7920l4870L2233P5823P746J15084Q3148j4376l2277l5855n5466j03917
$$ 77920 43050 75283 151106 158852 273936 357084 342708 310431 274576 219110 115193
10203A15193j1711K5710O6740N5915k8540q578o1639o5295M5903P1174J3751N149
$$ 115193 103482 129192 195932 251847 223307 214729 153090 87795 133698 204872 218623 223772
10191B23772n3702l1670M7278l1089j3982K0436P075L2104J02022J397k0563J4003
$$ 223772 170070 138400 185678 154589 140607 161043 168118 200222 302244 303641 283078 297081
10179B97081J01123L9766k2083o2953j9360N8152n5904R8257K8720J1721J04547
$$ 297081 398204 437970 415887 352934 333574 391726 335822 434079 462799 474520 579067
10168E79067M9294J76294J76102J31515r1852j42249p9458n6696L9688J5660P5315
$$ 579067 628361 804655 980757 1112272 1020420 878171 798713 742017 781705 797365 872680
10157H72680J02970J63509J49204J37194R572j21049j74829j15261j34184j68355
$$ 872680 975650 1139159 1288363 1425557 1435129 1314080 1139251 1023990 889806 721451
10147G21451K7308M3051J10530J73074J3045j2180P036m8843j87634j64542r3084
$$ 721451 748759 791810 902340 1075414 1088459 1076279 1083315 1034472 846838 682296 589212
10136E89212r4763n3665N5695N8583N5649j4320L135q5573n6790o1600q0327l0241
$$ 589212 494449 440784 496479 555062 610711 596391 599526 513953 457163 395563 315236 284995
10124B84995O6300K6057R38p4382l0933k8047o4426n9543m0883q0147Q9040O5874
$$ 284995 351295 377352 378290 303908 272975 244928 180502 120959 80076 -71 88969 154843
10112A54843j8541o8630L8285k429o228M654L8449P2376k5045o0600l4720j8779
$$ 154843 136302 67672 105957 103528 97300 101954 140403 212779 187734 127134 92414 73635
10100G3635M2653J11061Q8513m1205K3073n7475j03475j6456N9957O299K0006
$$ 73635 116288 227349 315862 274657 297730 240255 136780 120324 180281 186580 206586
10089B06586l0954o5674j2263J07928N751o9285o1164j1543R412M3740O2234j6033
$$ 206586 175632 109958 97695 205623 211374 142089 80925 69382 78794 122534 184768 168735
10077A68735k7006K2640m8993n3771N0888O526k9653r892m5542O189J41583L2258
$$ 168735 141729 164369 115376 61605 112493 119019 89366 79474 33932 40121 181704 213962
10065B13962k075m7546p5078M0576n7389L8392O839n5235o6081M4563J2356k583
$$ 213962 211887 164341 89263 129839 72450 110842 117681 62446 -3635 40928 53284 50701
10053E0701J743J9507N7135J4971R291j6482O959k9879q0025l1559Q8613n870
$$ 50701 52444 71951 129086 144057 153348 136866 143825 113946 33921 2362 90975 85105
10041H5105J09l0329n875J8154L8167M5778o7502j1457Q770N0713P3525k0474
$$ 85105 85214 54885 49010 67164 105331 151109 83607 72150 80920 131633 205158 184684
10029A84684l6887n7123m8463q6363M0676L360O5332m808K9416O0165k8145j1383
$$ 184684 147797 90674 42211 -44152 -3476 -116 65216 60408 89824 149989 121844 110461
10017A10461n4724l7424O0092K2297N9328l9018Q331n9969r3092K8440O0505L3308
$$ 110461 55737 18313 78405 100702 160030 121012 129343 69374 -23718 4722 65227 98535
10005I8535J325k5865K8956j1196J4858o2799l6193J06070N7052m6650K6655k1851
$$ 98535 99860 73995 102951 91755 106613 43814 7621 113691 170743 124093 150748 128897
9993A28897r3013K0818J7573P923n7777r391L1085m9482j1823J11149K5618j43674
$$ 128897 35884 56702 74275 82198 24421 15030 46115 -3367 -15190 95959 121577 -22097
9981b2097k7758L9026k12j31604k448R2464R2687n9382K6331N754m8562J322J6133
$$ -22097 -49855 -10829 -11041 -142645 -145093 -52629 40058 -19324 7007 12761 -35801 -34479 -18346
9968a8346K5205P22m8502M6673k042J03769L5752n816j0030l7040n3569N1390
$$ -18346 6859 7581 -40921 5752 3710 107479 143231 137415 127385 90345 36776 88166
9956H8166k767r5278J7273L2069N9160N0847J9959n4769o5587l9788o833j9295
$$ 88166 85399 -9879 7394 39463 98623 149470 169429 114660 49073 9285 2452 -16843
9944a6843l8471k1047J4514j4838l6131j4809K2993O2784K7611K4421m7976j12194
$$ -16843 -55314 -76361 -61847 -76685 -112816 -127625 -104632 -41848 -14237 10184 -37792 -149986
9932a49986J10956K29713J20976q5800j45410p3334n7663n1Q8437O0051j06380
$$ -149986 -39030 190683 311659 225859 80449 7115 -50548 -50599 37838 97889 -8491
9921h491L1703m259P1326J71963J38222J94204K04009j19950k98614k15667k3021
$$ -8491 23212 18953 90279 262242 400464 594668 798677 678727 380113 164446 141425
9910A41425L7291J8842L705m1003j49864r1260J06531L8962n0452r0701L345Q2358
$$ 141425 178716 197558 201263 160260 10396 -80864 25667 64629 14177 -76524 -73179 9179
9898I179P6902R8809M3882j8872j01701m4204p0589K951L2510J2929K7621m4715
$$ 9179 86081 184890 228772 209900 108199 63995 -6594 -3643 28867 41796 69417 24702
9886B4702L4430M2329p234k9906m9200n2557M400N3528L4122j4467L5360m3417
$$ 24702 59132 101461 94227 64321 15121 -37436 -33036 20492 54614 40147 75507 32090
9874C2090m9997N3205K6040p6960k978l546L3694L1463k0256m5862j35768J6136
$$ 32090 -17907 35298 61338 -15622 -18600 -22146 11548 43011 22755 -23107 -158875 -142739
9862a42739M1716K3436J29827O4553j09691L82M5342L218m9466l1710m9066L1754
$$ -142739 -101023 -77587 52240 116793 7102 7484 52826 56044 6578 -25132 -74198 -42444
9850d2444M2753l3234n6901J02385j7635k4874L5437K2882k1566l8940q3143K0063
$$ -42444 309 -32925 -89826 12559 -5076 -29950 5487 28369 6803 -32137 -115280 -95217
9838i5217R8570N8018J3507r200k8564N7271o913m7306o3656o180j1366k917M6169
$$ -95217 3353 61371 74878 65678 37114 94385 87472 40166 -23490 -29670 -41036 -43953 2216
9825B216Q1236K9510j573J9138k5774L727P761k2948k2320k7128K0815J48P081
$$ 2216 83452 112962 111389 130527 104753 108480 116241 93293 70973 43845 64660 64808 71889
9812G1889k9959k7244O3937L9543l5927N8914R7120J1945J20345K99063J74610
$$ 71889 41930 14686 78623 118166 82239 141153 238273 250218 370563 669626 844236
9801H44236J8053o9899j23436k03469j96476p8733n0452j06147j6013J8255J05842
$$ 844236 862289 792390 668954 465485 269009 190276 139824 33677 17664 35919 141761
9790A41761L7578o0392o7612L6260L5411j376o5745j0996M2767M510k2448q6179
$$ 141761 179339 118947 51335 87595 123006 121630 55885 44889 87656 92166 69718 -16461
9778a6461p2170L7673k9880N3709M260j6425K5056L1974j9373L7903k6217Q5285
$$ -16461 -88631 -50958 -80838 -27129 -22869 -39294 -14238 17736 -1637 36266 10049 95334
9766I5334O2297K5986N9255j01969r1376o1433O628L4570N7311p9988n7060L0833
$$ 95334 157631 183617 242872 140903 49527 -11906 -5278 29292 86603 6615 -50445 -19612
9754a9612R7098K0663l770m421R672J3780j5354n6262Q1060O363k1872N3561j3541
$$ -19612 77486 98149 94379 89958 99630 113410 98056 41794 122854 129217 107345 160906 147365
9741A47365p1499o8332l8148J6447l456l0056M1814M6567R520P395P916K2754
$$ 147365 75866 7534 -30614 -14167 -17623 -47679 -5865 40702 50222 57617 65533 88287
9729H8287o433O9939N4956m1823k1673j3103k8158k426k9640Q150L702l8994l939
$$ 88287 81854 151793 206749 164926 143253 130150 101992 99566 69926 78076 81778 42784 38845
9716C8845m3448L0187k0735l3361M7785N2335N8761r72o9037J6108J742m3397
$$ 38845 -4603 25584 4849 -28512 19273 71608 130369 129397 60360 76468 78210 34813
9704C4813M9554p0828m7270k4672N6269L9847M7608m0942q2269m8125J7747M3104
$$ 34813 84367 13539 -33731 -58403 -2134 37713 85321 44379 -37890 -86015 -68268 -25164
9692b5164L1089j1011j8137M6587P9155J5140k8457q3114k1362O3953j4833l1880
$$ -25164 5925 -5086 -23223 23364 102519 117659 89202 6088 -15274 48679 33846 1966
9680A966m715P6714k6208o7741K2968K0279j8811j6349k1989L6428L224m7569
$$ 1966 -2749 73965 47757 -19984 2984 23263 4452 -11897 -33886 2542 5766 -41803
9668d1803L8862k25L300L2763J7422L9198R1680R6918M174p1053P726K0182J2605
$$ -41803 -2941 -3166 134 32897 50319 89517 181197 278115 282289 211236 218962 239144 251749
9655B51749J19961J90044L48192O00428K59232m88360n75152l44323k21119j22652
$$ 251749 371710 561754 909946 1510374 1769606 1281246 706094 361771 140652 18000
9645A8000j1747o6034k762P8203R5445M1150m0906o4437n0308j5095p545P6410
$$ 18000 6253 -59781 -62543 15660 111105 152255 111349 46912 -3396 -18491 -26036 50374
9633E0374N5283p7957q59R6386L6792l0216l4892J0460K9567o3791k0376J8840
$$ 50374 105657 27700 26841 123227 160019 129803 94911 105371 134938 71147 50771 69611
9621F9611R6129l1729n8056r914K8686p2729r8273L7781O5269M0971J6978L2747
$$ 69611 165740 134011 75955 66041 94727 21998 -76275 -38494 26775 67746 84724 117471
9609A17471j6805M8275J1587p3668k7608q790j12543J0856Q8985J29601k4773
$$ 117471 100666 148941 160528 86860 59252 50462 -62081 -51225 37760 167361 142588
9598A42588j14842J0172r5300L3213J10885L0313k0828n19Q866m6633K8435m090
$$ 142588 27746 37918 -57382 -24169 86716 117029 96201 95682 104548 57915 86350 82260
9586H2260o9606N1319J804m552N0879R318M1038J6933r1801q5814L7697m1125
$$ 82260 12654 63973 65777 61225 112104 121422 162460 179393 87592 1778 39475 -1650
9574a650r750l0410m5660N4602Q092J5838J52920M4142q0422k5687L3949p4263
$$ -1650 -11400 -41810 -87470 -32868 -24776 -8938 143982 188124 107702 82015 115964 41701
9562D1701k1051p36k8646O939n9938m7300K2054Q6256l8065l8864L1847n1031
$$ 41701 20650 19914 -8732 -1793 -61731 -109031 -86977 -721 -38786 -77650 -45803 -96834
9550i6834l2981n3954Q5361P4600N5926L8715Q227o7905n5735m6891R0537M6556
$$ -96834 -129815 -183769 -98408 -23808 32118 70833 79060 11155 -44580 -91471 -934 45622
9538D5622p5039N1388k0888L6537M915k7773Q4464M7202k0108r013J6394j35425
$$ 45622 -29417 21971 1083 37620 42535 14762 99226 146428 126320 117307 133701 -1724
9526a724j8388k0265O3984k1047n8454O3218J56252k8629l1410K087o2663o504
$$ -1724 -20112 -40377 23607 2560 -55894 7324 163576 134947 103537 105624 42961 36457
9514C6457J23604O7044o5594k4524j3511j5839l6660q1661k3036P6484M7489m5844
$$ 36457 160061 227105 161511 136987 123476 107637 70977 -10684 -33720 42764 90253 44409
9502D4409R2469K1666o2888p2260j18399q9058j2947M2609j4710L6704N5244P6420
$$ 44409 136878 158544 95656 23396 -95003 -184061 -197008 -154399 -169109 -132405 -77161 -741
9490g41R376O911N0254O4582m1499q4561j1998p006L7384k5818r3393n4945k3093
$$ -741 8635 15546 65800 130382 88883 4322 -7676 -14682 22702 -3116 -96509 -151454 -174547
9477a74547l0378R7914L6857P6173o132p7070J2092l2311k2499O5126M7386q198
$$ -174547 -204925 -107011 -70154 6019 -113 -77183 -65091 -97402 -119901 -54775 -7389 -15587
9465a5587k4640M2906L8930o489p7304j0013Q2525M3261m6557m4558r410j3252
$$ -15587 -40227 2679 41609 35120 -42184 -52197 30328 73589 27032 -17526 -26936 -40188
9453d0188j2385P5845j8139J464q2923K4453M5407J8748P4366k7757l1156J0378
$$ -40188 -52573 23272 5133 6597 -76326 -51873 -6466 12282 86648 58891 27735 38113
9441C8113O6411m4394j05254p483l5439J9093L5324m0198J5233L1727L3791l8685
$$ 38113 104524 60130 -45124 -52607 -88046 -68953 -33629 -73827 -58594 -26867 6924 -31761
9429c1761m2837L5949J59138K5569l7209j23125M0584L9945M550l2054L7416J2739
$$ -31761 -74598 -38649 120489 146058 108849 -14276 26308 66253 70803 38749 76165 88904
9417H8904J9337j0190J3340L5352J3519q990m8509K4402O2544N667Q0730M3641
$$ 88904 108241 98051 111391 146743 160262 151272 102763 127165 189709 195376 276106 319747
9405C19747j6379K3979K3055m3384p0879j47489r1965j999N9616M2510j6632k7506
$$ 319747 303368 327347 350402 307018 236139 88650 -3315 -5314 54302 96812 80180 52674
9393E2674j4956J572M012l3084K3608M3423o1362j05843M3753K307o5403P3734
$$ 52674 37718 39290 43302 10218 33826 77249 15887 -89956 -46203 -43896 -109299 -35565
9381c5565Q1477j300q2119M1328L7846k863O230q264P523k364N4236J490j1727
$$ -35565 45912 44612 -37507 3821 41667 38804 45034 36770 44293 41929 96165 97655 85928
9368H5928J08705J7123j21170O00j7670k7677K2489M5716m3376m6468R132J0043
$$ 85928 194633 211756 90586 91186 73516 45839 68328 114044 70668 24200 33332 43375
9356D3375m3848l6241o723l1346M062M8728k0836N854o0056j6452P4644L1062
$$ 43375 -473 -36714 -43437 -74783 -70721 -21993 -42829 -36975 -97031 -113483 -38839 -7777
9344g777k8661Q6694l0921n7747q229j1323N6946J0332P08O984M850j9410o4539
$$ -7777 -36438 50256 19335 -38412 -46641 -57964 -1018 9314 10022 17006 21856 2446 -62093
9331f2093K5396m589J714M7887Q7869L2219n8212J5313o4632p0857k3821k3541
$$ -62093 -36697 -41286 -39572 8315 96184 128403 70191 85504 20872 -49985 -73806 -97347
9319i7347k1098l6971L7233K9960n765Q4150K330l4236l2831r682m7573k4486
$$ -97347 -118445 -155416 -118183 -88223 -93988 -9838 -7508 -41744 -74575 -84257 -131830 -156316
9307a56316Q8455K1245J3125Q2812J9469N263l5509l8629l7398l9296r1152L5603
$$ -156316 -67861 -46616 -33491 49321 68790 74053 38544 -85 -37483 -76779 -167931 -132328
9295a32328j5783O4977Q1505n9117n3796O210M9702K6898k6610N4495l0527o0192
$$ -132328 -148111 -83134 -1629 -60746 -114542 -108332 -58630 -31732 -58342 -3847 -34374 -94566
9283i4566N2187J06124K0290q332j6146J2432l2855j8431m9469j6167l0705N5105
$$ -94566 -42379 63745 84035 75703 59557 71989 39134 20703 -28766 -44933 -75638 -20533
9271b0533J18460L9201j08767n4223l8394n3263m2648P6545R0369J6347k4090
$$ -20533 97927 137128 28361 -25862 -64256 -117519 -160167 -83622 6747 23094 -996
9260i96K5836J5317j378l6867k210L0783Q012J2480p7751j3850P6140R885k8034
$$ -996 24840 40157 38779 1912 -298 30485 38497 50977 -26774 -40624 35516 45401 17367
9247A7367l0408o142l4378o6031L8428R9223J8757m3785L5475L1714J5686j1381
$$ 17367 -13041 -19183 -53561 -119592 -81164 18059 36816 -6969 28506 60220 75906 64525
9235F4525O3606q1616n7452P7109M2908l0025o3029J280k6549l2051p1725N1656
$$ 64525 128131 46515 -10937 66172 109080 79055 16026 17306 -9243 -41294 -113019 -61363
9223f1363O3264J19337J4853o7578r1976M226m0863n2121n4903M3816Q0318k7866
$$ -61363 1901 121238 136091 68513 -23463 -19237 -60100 -112221 -167124 -123308 -42990 -70856
9211g0856L0933L2104j0369j17274M1448P1191m5428n923M6667n2645l9033J8930
$$ -70856 -39923 -7819 -18188 -135462 -94014 -22823 -68251 -74174 -27507 -80152 -119185 -100255
9199a00255N73j9690K9834L5377P0495R5729j0276J1889J29K0481L9706m934j09598
$$ -100255 -99682 -119372 -89538 -54161 16334 112063 101787 113676 113805 134286 173992 169058 59460
9186E9460p2346k0787j2024M2867M5977M9030J9522o6186p0948j8482K151O3196
$$ 59460 -12886 -33673 -45697 -2830 43147 92177 111699 45513 -25435 -43917 -41766 21430
9174B1430Q4285O2371p1453n9777P1513j5847o1174j630p13o6425p9922L350l0166
$$ 21430 105715 168086 96633 36856 108369 92522 31348 29718 29005 -37420 -117342 -113992 -144158
9161a44158K6852M0133J3937n2406J7165K2679K8943O5680J2350L4533J3861N1594
$$ -144158 -117306 -77173 -63236 -115642 -98477 -75798 -46855 18825 31175 65708 79569 131163
9149A31163j7997L6998J2898o0317L8460q1174l7090p714m2149J1856Q8451L3262
$$ 131163 113166 150164 163062 102745 141205 60031 22941 15227 -26922 -15066 73385 106647
9137A06647j6248m0879n4424J7709n0025K4126M8690L4207M5284q363K642p3427
$$ 106647 90399 49520 -4904 12805 -37220 -13094 35596 69803 115087 106724 109366 35939
9125C5939j03895J7805M3448J11790k2497n9159j124O4790o254p6034o9016j0910
$$ 35939 -67956 -50151 -6703 105087 82590 23431 22307 87097 80843 4809 -64207 -75117
9113g5117Q969M5353l4248J10805L4402p405n4951n8093J5050m930M5738j787
$$ -75117 -66148 -20795 -55043 55762 90164 82759 27808 -30285 -15235 -20165 25573 23786
9101B3786M1625N3531J1799p8701m747K8960n3569L6550k9737l6748Q8438Q6876
$$ 23786 65411 118942 130741 52040 47293 76253 22684 59234 29497 -7251 81187 168063
9089A68063J39871O0285p0358j39349j02565j13644O512P3535M4264m7143r42
$$ 168063 307934 368219 297861 158512 55947 -57697 -51185 22350 66614 19471 18529
9078A8529J8092j3663N4766q958q9636K796j0120K7210O4637q5891k1288N3966
$$ 18529 36621 22958 77724 68766 -20870 -18074 -28194 -984 63653 -22238 -43526 10440
9066A0440N5502j9789M7514K480l9695k4369r603k7277k9154O5716k5848P793
$$ 10440 65942 46153 93667 96147 56452 32083 22480 -4797 -33951 31765 5917 13710
9054A3710O2397L5492n3493J0950J889l0492o8324m7346L8359J8080J0117j4033
$$ 13710 76107 111599 58106 69056 70945 40453 -27871 -75217 -36858 -18778 -8661 -22694
9042b2694n9422N2015O0620L6728m5648N2683J6140P104k0206j10648l5968K5107
$$ -22694 -82116 -30101 30519 67247 21599 74282 90422 97526 77320 -33328 -69296 -44189
9030d4189Q088Q904L4014M2992m340j8185L107m3629l9181q3282O3899K8720k2050
$$ -44189 -36101 -27197 6817 49809 45469 27284 30391 -13238 -52419 -135701 -71802 -43082 -65132
9017f5132L8095L529K6942M876J2821N6658L5048J6955q131q1613j45094j48881
$$ -65132 -27037 -23508 3434 8310 21131 77789 112837 129792 121661 40048 -105046 -253927
9005b53927m170R3355N9244J19395R9o9381n0511J1338O5882L2786J9687R2000
$$ -253927 -258097 -164742 -105498 13897 13996 -55385 -105896 -94558 -28676 4110 23797 115797
8993A15797L5452l6069j2968J3168n9683J4707j9507j4591j623o0142N4812K1747
$$ 115797 151249 115180 102212 115380 55697 70404 50897 36306 34683 -25459 29353 51100
8981E1100j5761L370p0158l328L3864M1128J2105p324r322k6604J6227l4966k0918
$$ 51100 35339 38709 -31449 -34777 -913 40215 52320 44996 35674 9070 25297 -9669 -30587
8968c0587J9534M0625k200J6655l7640m2925K6038K7881q9914P8335k1103j12417
$$ -30587 -11053 29572 27372 44027 6387 -36538 -10500 17381 -72533 5802 -15301 -127718
8956a27718N6391O4474O1079L7323M8621L0421j9990j06525p8834j13451j8572
$$ -127718 -71327 -6853 54226 91549 140170 170591 150601 44076 -34758 -148209 -166781
8945a66781J1161l3627Q8942J10373O39m7021n219L1880R2284k9777o0569n3844
$$ -166781 -155620 -189247 -100305 10068 10707 -36314 -41533 -9653 82631 52854 -7715 -61559
8933f1559K2587o602K0727Q597o2253K4845L576L2057M798L0264q2446k2413M2997
$$ -61559 -38972 -45574 -24847 -16250 -78503 -53658 -50082 -18025 -13227 17037 -65409 -87822 -44825
8920d4825K8052M5673L7552M6653j8271J6374J68N0890m5756r448M2437j3256
$$ -44825 -16773 28900 66452 113105 94834 111208 111376 162266 116510 107062 149499 136243
8908A36243K3135l5600j56417q0691j2469J6135k7277K8246q835l0652J42631
$$ 136243 159378 123778 -32639 -113330 -125799 -109664 -136941 -108695 -117530 -148182 -5551
8897e551J69955J7148j6462n4064j70963J666J18814K5482N2022n8685l2250J505
$$ -5551 164404 181552 165090 111026 -59937 -58271 60543 86025 138047 79362 47112 48617
8885D8617m5567o1998o8583J7324J1190l7965l0763P2318Q1623K9470m0250m1050
$$ 48617 3050 -58948 -127531 -110207 -99017 -136982 -167745 -95427 -13804 15666 -24584 -65634
8873f5634P8618J09531M0086q5472j19928O9874O1681J0562J1666k5448l3147
$$ -65634 12984 122515 162601 77129 -42799 27075 88756 99318 110984 85536 52389
8862E2389q0957N1022J2032j0441O434J19622k6529m2527L4734j2648j00819l2191
$$ 52389 -28568 22454 34486 24045 30479 150101 123572 81045 115779 103131 2312 -29879
8850b9879k088M0129m0726l3775P735R8094Q5394k692j3010o6445j26749M1603
$$ -29879 -31967 8162 -32564 -66339 -58604 39490 124884 122192 109182 42737 -84012 -42409
8838d2409N5464J3806k4704j6449p9252J02756N054l0938K2954Q2354K0182r1500
$$ -42409 13055 26861 2157 -14292 -93544 9212 14266 -16672 6282 88636 108818 17318
8826A7318P509k7l3542N569j840j06073j03969J24020M8258N521J6984m3710p1075
$$ 17318 24827 24800 -8742 -3173 -5013 -111086 -215055 -91035 -42777 -37256 -20272 -63982 -135057
8813a35057L7424k0487J3952J04736J04949m8686m4992O08M0843M450j1336P729
$$ -135057 -97633 -118120 -104168 568 105517 56831 11839 12447 53290 57740 46404 54133
8801E4133k5654n6863K1363O9315n4458n8508L5509K8078N639K6237J7385m350
$$ 54133 28479 -28384 -7021 62294 7836 -50672 -15163 12915 18554 44791 62176 57826
8789E7826K573o551q2938k6525K8273M9787J943K0037l8150K7920M9900j2694
$$ 57826 60399 53848 -29090 -55615 -27342 22445 24388 44425 6275 34195 84095 71401
8777G1401n1288M8215R705k6848q2894k8942o6498k0467Q5177L2733q3136M56
$$ 71401 20113 68328 78033 51185 -31709 -60651 -127149 -147616 -62439 -29706 -112842 -112386
8765a12386Q0248L6402l3100N101O2873P1241K4763j34505n7762L6823K7840K59
$$ -112386 -32138 4264 -28836 -23735 39138 110379 135142 637 -57125 -20302 7538 7797
8753G797M7862Q081J3414M1857l2084j0529k5194l7048R939o3151m2986l9641
$$ 7797 55659 63740 77154 119011 86927 76398 51204 14156 24095 -39056 -82042 -121683
8741a21683L6138K9358P1985N9682q407o8131l8577k573J0607l9871L7475K2744
$$ -121683 -85545 -56187 15798 75480 67073 -1058 -39635 -42208 -31601 -71472 -33997 -11253
8729a1253M17j7218M7756o9531o4461K3343J7648O3695K1087J09287k229o1802
$$ -11253 -10836 -28054 19702 -49829 -114290 -90947 -73299 -9604 11483 120770 118541 56739
8717E6739l5012N2338K7027l7188m781o6658p864J8863j9334M091K2769k9081
$$ 56739 21727 74065 101092 63904 59123 -7535 -15399 3464 -15870 -11779 10990 -18091
8705a8091l2071j2329M6375l0713m7610L7150M639l2629j7840l4629Q6034N5843
$$ -18091 -50162 -62491 -16116 -46829 -94439 -57289 -52650 -85279 -103119 -137748 -51714 4129
8693D129l339j6043P8016M8473L3443p6259m0133m9538l5357J8719J06481m8878
$$ 4129 790 -15253 62763 111236 144679 68420 28287 -21251 -56608 -37889 68592 19714
8681A9714o4059L253K070O4507J11469N1557j2895l9917j4411P6923l616K5179
$$ 19714 -44345 -41092 -39022 25485 136954 188511 175616 135699 121288 198211 194595 219774
8669B19774l9882k6470N807j2046k3825l3711j3762K3858k2597l274O529O9714
$$ 219774 179892 153422 159229 147183 123358 89647 75885 99743 77146 73872 80401 150115
8657A50115j1289n5873R884L7140N3531l5914q5671j5821K050L557n623L8754
$$ 150115 138826 82953 92837 129977 183508 147594 61923 46102 48152 51709 46086 84840
8645H4840l4060p3021J5319K5811L2134Q0152J289j0029o8413N08k5860m3770
$$ 84840 50780 -22241 -6922 18889 51023 131175 132464 122435 54022 54530 28670 -15100
8633a5100j2393j7421O5358L4748q959m8793O206n1093R0484J7822k7639R105
$$ -15100 -27493 -44914 20444 55192 46233 -2560 3646 -47447 43037 60859 33220 42325
8621D2325m8077N3786l5390O191j0206J3203k3903o3987J726P2142P313L2776
$$ 42325 -5752 48034 12644 18835 8629 21832 -2071 -66058 -64332 7810 15123 47899
8609D7899m7185m4655n4893m5142J20512L5052J4976k5789L8121Q635o6993m9548
$$ 47899 714 -43941 -98834 -143976 -23464 11588 26564 775 38896 47531 -19462 -69010
8597f9010N1930o823q2736j8648k9809O7982R3015J17234M0009o1215k1609K9323
$$ -69010 -17080 -23903 -106639 -125287 -155096 -87114 5901 123135 163144 101929 80320 109643
8585A09643k5003k4480q4203L4235j7181m841k6183k2899j7575O141L6172O7975
$$ 109643 84640 60160 -24043 10192 -6989 -11830 -38013 -60912 -78487 -72346 -36174 31801
8573C1801N0348k2261p4996l8565m2988o677P7848K8406l5275j4023O5281O4682
$$ 31801 82149 59888 -15108 -53673 -96661 -103338 -25490 2916 -32359 -46382 18899 83581
8561H3581J3278k624k6725j05362o2332M6695M5334M899L5285J531m465J8454
$$ 83581 96859 94235 67510 -37852 -100184 -53489 -8155 -3256 32029 33560 29095 47549
8549D7549m0863k8158O1921m0629k8943P7041P7166l8733j07743q3424o8500N2434
$$ 47549 6686 -21472 40449 -180 -29123 47918 125084 86351 -21392 -104816 -173316 -120882
8537a20882J07527Q892m8707M015o661K2910j9298K6815N3863Q8810O147M419
$$ -120882 -13355 -4463 -53170 -49155 -55816 -32906 -52204 -25389 28474 117284 123431 127850
8525A27850K9500J0252M892l4762o2726n6737o6667k1914N9867m0803k1366J1425
$$ 127850 157350 167602 172494 137732 75006 18269 -48398 -70312 -10445 -51248 -72614 -61189
8513f1189P7131J02259K0504o4147K027K1498L484J802q95m3642N7133k300n5974
$$ -61189 15942 118201 138705 74558 76585 98083 101567 103369 102474 58832 115965 113665 57691
8500E7691n2976m3670R201P7597L8214K7749Q0406p2441q1985R651K6034m9424
$$ 57691 4715 -38955 -29754 47843 86057 113806 194212 121771 39786 49437 75471 26047
8488B6047l6362K5281k74R5472m088j8907Q2948N886m6724m2804K3364k2963n4615
$$ 26047 -10315 14966 14692 110164 106076 87169 170117 176003 129279 86475 109839 86876 32261
8475C2261o2281j9361k1836J8418M7397j8936K6757l271k427n2550l0353J2399
$$ 32261 -30020 -49381 -71217 -52799 -5402 -24338 2419 -852 -3279 -55829 -86182 -73783
8463g3783L5644Q370p7437N79k1602Q3382R2477J9075k5784L1276K1311N8973
$$ -73783 -38139 -29769 -107206 -106627 -128229 -44847 47630 66705 40921 72197 93508 152481
8451A52481M4063n8788o3267m1302O1319j8216m4345k02k3420j9559L7240o972
$$ 152481 196544 137756 74489 33187 94506 76290 31945 31743 8323 -11236 26004 19032
8439A9032m5783R7274L9854N329k6441j4671K8264j1040k0617J9609p659k7847
$$ 19032 -26751 70523 110377 115706 89265 74594 102858 91818 71201 90810 83151 55304
8427E5304L5321Q23m2165k4576k7702L3647l6445k5901R5693K9422o8202J4116
$$ 55304 90625 91448 49283 24707 -2995 30652 -5793 -31694 63999 93421 25219 39335
8415C9335K4664l4367o8268L9493L3280N4991J5184K1925o6167m3310J6746N8172
$$ 39335 63999 29632 -38636 857 34137 89128 104312 126237 60070 16760 33506 91678
8403I1678m8891p3482M4213N0760n7816N4713L3040p440J861n3085o8269M2043
$$ 91678 42787 -30695 13518 64278 6462 61175 94215 86775 88636 35551 -32718 9325
8391I325N3882l3487q2745j31367J7851Q9406M7753L6615p8214m1785O1380R9295
$$ 9325 63207 29720 -53025 -184392 -166541 -77135 -29382 7233 -70981 -112766 -51386 47909
8379D7909O8590p4332p9883q5021O5481j7903j642J9332O3767J869O746M8856
$$ 47909 116499 42167 -37716 -122737 -57256 -75159 -76801 -57469 6298 8167 14913 63769
8367F3769K7607l7926N762j01577O242K8562P6472m6231m9354n7300l6914j6921
$$ 63769 91376 53450 59212 -42365 -36123 -7561 68911 22680 -26674 -83974 -120888 -137809
8355a37809J0713j955p5485p1751O8284J25917K6617o5578j9330J21725N8789
$$ -137809 -127096 -129051 -204536 -276287 -208003 -82086 -55469 -121047 -140377 -18652 40137
8344D0137o8707Q715M406m7149n1598O8603M4545k3180K6630j0226Q47N7750n1755
$$ 40137 -28570 -19855 -15449 -62598 -114196 -45593 -1048 -24228 2402 -7824 -6977 50773 -982
8331i82q0886p9078P6201J25893J3677j4936j5901L3170m2787j5116m7828Q094
$$ -982 -81868 -160946 -84745 41148 54825 39889 23988 57158 14371 -745 -48573 -40479
8319d0479N5919m7761J1763m920P773O57J1046n447k6781l9350l8985P2660P0929
$$ -40479 15440 -32321 -20558 -25478 -17705 -17048 -6002 -11449 -38230 -77580 -116565 -43905 27024
8306B7024p2989o808l6910O260L7164Q9694J9787J4675j0883q789m9451k2614
$$ 27024 -45965 -52773 -89683 -83423 -46259 43435 63222 77897 67014 58225 8774 -13840
8294a3840l7862P6494m5217J1996K8727K9855K2085k5487q986m836k9234k1216
$$ -13840 -51702 24792 -20425 -8429 20298 50153 72238 46751 37765 32929 3695 -17521
8282a7521J5657N5535L6791k1668m5879m1972k4477N2615L7870l281k0119J9852
$$ -17521 -1864 53671 90462 68794 22915 -19057 -43534 9081 46951 43670 23551 43403
8270D3403K9087l4864l7757M7376j21o0802m1986l7061j8851M1507O0052l0815
$$ 43403 72490 37626 -131 47245 47124 -13678 -55664 -92725 -111576 -70069 -10017 -40832
8258d0832k2213M5547k9057l7254J8751m7936K9206k5888j6377J10307J12668
$$ -40832 -63045 -17498 -46555 -83809 -65058 -112994 -83788 -109676 -126053 -15746 96922
8247I6922n3451p1662L3976P7747L0392k7504j64026l2228K5569m190L1779L1352
$$ 96922 43471 -28191 5785 83532 113924 86420 -77606 -109834 -84265 -88455 -56676 -25324
8235b5324O1030J3630O4100O4728Q90j1038r3672o2503M3093l8093m2702n0509
$$ -25324 35706 49336 113436 178164 179054 168016 74344 11841 54934 16841 -25861 -76370
8223g6370k0292k878O9077N2711l0214M9355K3510j0760q8039m5879M9524J8202
$$ -76370 -96662 -99540 -30463 22248 -7966 41389 64899 54139 -33900 -79779 -30255 -12053
8211a2053r545n6662o5505N2719j7510n8139J8964M0734L9561J7428k4154K3532
$$ -12053 -21598 -78260 -143765 -91046 -108556 -166695 -147731 -106997 -67436 -50008 -74162 -50630
8199e0630L3202l8836O0629R7532m4495r8779k3161Q225L0476N1161p0417l5753
$$ -50630 -17428 -56264 4365 101897 57402 -41377 -64538 -56313 -25837 25324 -45093 -80846
8187h0846n0321L8014k5632M5693p1215q309K113K5392l139M3918J9980Q4928
$$ -80846 -131167 -93153 -118785 -73092 -144307 -152616 -150503 -125111 -128250 -84332 -64352 20576
8175B0576L008P61l3419K3823o2609o7398J4585J5087J664K3653l2554J0766P2559
$$ 20576 23584 24345 -9074 14749 -47860 -115258 -100673 -85586 -83922 -60269 -92823 -82057 -9498
8162i498R4552R758r9514r7554Q9753K7470l1681M3308l6466M6653O1567K499
$$ -9498 85054 94812 -4702 -102256 -12503 14967 -16714 26594 -9872 36781 98348 100847
8150A00847o7276q0460q186M6948l1886R88k6133M6858M3585j2769m8228R688
$$ 100847 33571 -46889 -55075 -8127 -40013 -39025 -65158 -18300 25285 12516 -35712 -26024
8138b6024L3318l3723K6698L5279k1378n0179p9242L3635J19441k2921p2448o2727
$$ -26024 7294 -26429 269 35548 14170 -36009 -115251 -81616 37825 14904 -57544 -120271
8126a20271L9846M062o5684K8608O2299O3550o909k9956N5369m3103l4913Q258
$$ -120271 -80425 -76363 -142047 -113439 -51140 12410 5501 -24455 30914 -12189 -47102 -38844
8114c8844k5440q2785N030M1957J00193O8833o7765n4241m5712M1611O6375p191
$$ -38844 -64284 -147069 -142039 -100082 111 68944 1179 -53062 -98774 -57163 9212 2021
8102B021p391k8250j836O9919O3141n4204k5800M5746O79o4093m4861Q763k507
$$ 2021 -5370 -33620 -35456 34463 97604 43400 17600 63346 64025 -68 -44929 -36166 -38673
8089c8673N6820N9503L235n2345n1631j09209J12922Q9755j6112q2131J3175K0938
$$ -38673 18147 77650 80885 28540 -23091 -132300 -19378 70377 54265 -27866 -14691 6247
8077F247k5371K7891R6734m3171n1381K3598M1242q2085o1184O3468M7198m7250
$$ 6247 -19124 8767 105501 62330 10949 34547 75789 -6296 -67480 -4012 43186 -4064
8065d064n5995J2771M762N308J0904K951N4294M2064N559k2207m573M4782K0424
$$ -4064 -60059 -47288 -42526 -37218 -26314 -23363 30931 72995 78554 56347 51774 96556 116980
8052A16980J2394p2721n3035j7764n6395o025N8459J4770q717k4587r0337O4877
$$ 116980 129374 56653 3618 -14146 -70541 -76566 -18107 -3337 -12054 -36641 -126978 -62101
8040f2101K0617m2254N1377K6806K4146R159j3917J2647o3289l0873L1823J2669
$$ -62101 -41484 -83738 -32361 -5555 18591 27750 13833 26480 -36809 -67682 -35859 -23190
8028b3190Q2586J05323M003J0161o9762n313K8398m7107k3038j04675K9551k7845
$$ -23190 59396 164719 168722 178883 109121 103808 132206 85099 62061 -42614 -13063 -40908
8016d0908J2306J07341N4573j8069m6798R4176k0461o4327p7625o4677R3529N2425
$$ -40908 -28602 78739 133312 115243 68445 162621 142160 77833 208 -64469 29060 81485
8004H1485n802j1929m7981P0105N0951n6609R201K3380o466m4083j04121j7843
$$ 81485 75683 63754 15773 85878 136829 80220 89421 112801 106335 62252 -41869 -59712
7992e9712J19575O6391m6475J4285o4094o4001J13403q851j01109k3897J7092
$$ -59712 59863 126254 79779 94064 29970 -34031 79372 70521 -30588 -54485 -37393
7981c7393j1207m8566p382l508k4138N3580K8662J7320p5651N6089J27898M1102
$$ -37393 -48600 -97166 -104548 -108056 -132194 -78614 -49952 -32632 -108283 -52194 75704 116806
7969A16806l8072r5671p1074L1517L5388M6366N6147P89k6956l3314K0356K167
$$ 116806 78734 -16937 -88011 -56494 -21106 25260 81407 82196 55240 21926 42282 44449
7957D4449q3819k3650K2901O8708M2542l2747n6784P6727K9817p6917p5095R861
$$ 44449 -39370 -63020 -40119 28589 71131 38384 -18400 58327 88144 11227 -63868 -54007
7945e4007n954j1161m0968J8347J09868L6827l3725o8893p0830P219N4948Q9636
$$ -54007 -59961 -71122 -112090 -93743 16125 52952 19227 -49666 -120496 -113277 -58329 31307
7933C1307m3413o6770l2225K4081K4932l132l6337N2220j2657k2374k9498L3776
$$ 31307 -12106 -78876 -111101 -87020 -62088 -65220 -101557 -49337 -61994 -84368 -113866 -80090
7921h0090q954j3013L1761N3974K2687P6416l872o4697m0702p6112J5926O7695
$$ -80090 -89044 -102057 -70296 -16322 6365 82781 78909 14212 -26490 -102602 -86676 -18981
7909a8981L6243M3944J04595o1440j03997p8603O3341L6834q5252q884O3601K1868
$$ -18981 17262 61206 165801 104361 364 -78239 -14898 21936 -63316 -72200 -8599 13269
7897A3269k3629L6832l706k9420N5679K8854k8939j09062n3495j4395L1201L2156
$$ 13269 -10360 26472 22766 -6654 49025 77879 48940 -60122 -113617 -128012 -96811 -64655
7885f4655m4571q3766m5616p1559K2845K7293M7248O1236L5542n3304N5611P3475
$$ -64655 -109226 -192992 -238608 -310167 -287322 -260029 -212781 -151545 -116003 -169307 -113696 -40221
7873d0221L1110L6186r7135K3695k6120p7312k7042J621K6970J32826P2966p8282
$$ -40221 -9111 27075 -70060 -46365 -72485 -149797 -176839 -175218 -148248 -15422 57544 -20738
7861b0738j02229j11693Q0778j4426N2363k4564K1223m994O2914J20238Q5949
$$ -20738 -122967 -234660 -153882 -168308 -115945 -140509 -119286 -124280 -61366 58872 144821
7850A44821l8163j31969k9831M1402m5667K7491K2567K9605l9152L8981k0971
$$ 144821 106658 -25311 -55142 -13740 -59407 -31916 -9349 20256 -18896 20085 -886
7839h86j8159P288L9936J9378k1702Q2908O0074j34338n100j8314o3341P772N3385
$$ -886 -19045 -11757 28179 47557 25855 108763 168837 34499 29399 11085 -52256 -44484 8901
7826H901N0015o7531m6765n3628L5161m940l4500o6472N2436L4931n1599K6771
$$ 8901 58916 -8615 -55380 -109008 -73847 -78787 -113287 -179759 -127323 -92392 -143991 -117220
7814a17220R1196J8622l3023l7101k0851J6626J7181N96O0155N5806k2236l5888
$$ -117220 -26024 -7402 -40425 -77526 -98377 -81751 -64570 -63974 -3819 51987 29751 -6137
7802f137O070O1465m1322N2832J2647j01667n0472j8174l2851j2495R2403K8451
$$ -6137 -67 61398 20076 72908 85555 -16112 -66584 -84758 -117609 -130104 -37701 -9250
7790i250N7039M9901N1453n6133l3030j06339o6155J9994Q3786R4081P3493o6775
$$ -9250 47789 97690 149143 93010 59980 -46359 -112514 -92520 -8734 85347 158840 92065
7778I2065p1116n6059q2334J6209N6794L163n6048N8N5879J18203M5548J7360
$$ 92065 20949 -35110 -117444 -101235 -44441 -41278 -97326 -97268 -41389 76814 122362 139722
7766A39722o7950l8381L9144o1346r2066J2157N2468P558k7572o4310N5710n795
$$ 139722 71772 33391 72535 11189 -80877 -68720 -16252 -8694 -36266 -100576 -44866 -50661
7754e0661Q8859Q6814Q473q6827m0321q7995O280J12833N4097o3206k6360j8272
$$ -50661 38198 125012 133485 46658 6337 -81658 -75378 37455 91552 28346 1986 -16286
7742a6286r960K8209N3303l3363k6437k8078P3601N9670J0117L3572n1595r4293
$$ -16286 -26246 1963 55266 21903 -4534 -32612 40989 100659 110776 144348 92753 -1540
7730a540P0947J4718m3023o9373o330k3618n8646k5247P3162O3963N9701N9434
$$ -1540 69407 84125 41102 -28271 -34601 -58219 -116865 -142112 -68950 -4987 54714 114148
7718A14148P6861J8672j08025k5437r5667o9786j6193L5438P7095k0800r8514
$$ 114148 191009 209681 101656 76219 -19448 -89234 -105427 -69989 7106 -13694 -112208
7707a12208k2103L8462R9819n365j1296R479K9244l5476O309P5088q582N0786
$$ -112208 -134311 -95849 3970 -1395 -12691 -3212 26032 -9444 -3135 71953 63371 114157
7695A14157J5359j11418p8174j4160K7002L9411J6962P488q2649l9124J17862
$$ 114157 129516 18098 -60076 -74236 -47234 -7823 9139 16627 -66022 -105146 12716
7684A2716j1412l1193J5871O1265O3004k1213o1135j5555j85J9631k8808J1506
$$ 12716 1304 -29889 -14018 47247 110251 89038 27903 12348 12163 31794 2986 14492
7672A4492O8258J4380n2897p1268o9525m6292N5753P0641P1970k0151j14087o7747
$$ 14492 82750 97130 44233 -27035 -96560 -142852 -87099 -16458 55512 35361 -78726 -146473
7660a46473L2738R7303O5003J06332l4431l9854K1206r2768k4555p504O9406N5982
$$ -146473 -113735 -16432 48571 154903 120472 80618 101824 9056 -15499 -23003 46403 102385
7648A02385N929n8703K4099O2326K7965p3795m1140j5076q4733K7615R8828o5709
$$ 102385 108314 49611 73710 136036 164001 90206 49066 33990 -50743 -23128 75700 9991
7636I991r2884o8431P2096M0305Q5854M3794m7741o0179N0222o1358P178L7489
$$ 9991 -82893 -151324 -79228 -38923 46931 90725 42984 -17195 33027 -28331 -21153 16336
7624A6336J4888l6826J5354M2151p759m7609J3479o4117j0533O155J8069l05L5561
$$ 16336 31224 -5602 9752 51903 44144 -3465 10014 -54103 -64636 -58481 -40412 -40717 -5156
7611e156n6456N9516M4788J5763k3893l4351K6453K2399R068K3398p4964m1683
$$ -5156 -61612 -2096 42692 58455 34562 211 26664 49063 58131 81529 6565 -35118
7599c5118P0161k2416m5771J1089J0736Q208J1118j1560J0336J1003j38132J3549
$$ -35118 35043 12627 -33144 -22055 -11319 -3111 8007 -3553 6783 17786 -120346 -106797
7587a06797Q1865N7716O3079O1194m0430r1345k9981J9666q432j35p9183o404
$$ -106797 -24932 32784 95863 157057 116627 25282 -4699 14967 6535 6400 -72783 -79187
7575g9187k3516K684J16904M4908k6654m2657k889L6830J8665l0810L2475k0489
$$ -79187 -102703 -100019 16885 61793 35139 -7518 -10407 26423 45088 14278 46753 26264
7563B6264k5067J24968O5785n7757o7570k8839O7317k9220m8888k5817k5187J8284
$$ 26264 1197 126165 191950 134193 66623 37784 105101 75881 26993 1176 -24011 -5727
7551e727J1192m6018m6308R7609J1012j5833J1306L1362m4004L379L8885Q1276
$$ -5727 5465 -40553 -86861 10748 21760 5927 17233 48595 4591 7970 46855 128131
7539A28131j7145o4865k2405m9347j8522m1491K0990L8771O0266r4378p9736O0670
$$ 128131 110986 46121 23716 -25631 -44153 -85644 -64654 -25883 34383 -59995 -139731 -79061
7527g9061K1816L0965n5738k5103L3556K0254l0241J02192N5838L8549K3540j07863
$$ -79061 -57245 -26280 -82018 -107121 -73565 -53311 -83552 18640 74478 113027 136567 28704
7515B8704m3850J4735M4377L2659p8989q7741J3453J01392j3469k4668J4640M1522
$$ 28704 -15146 -411 43966 76625 -2364 -90105 -76652 24740 11271 -13397 1243 42765
7503D2765k2424k9643l5397J1634O3848L2457n4559n7183M4859j4698o6624q3271
$$ 42765 20341 -9302 -44699 -33065 30783 63240 8681 -48502 -3643 -18341 -84965 -168236
7491a68236k301J28448L2323L2932l9981n2296j4241K572O4165O5951k6342l7044
$$ -168236 -170537 -42089 -9766 23166 -16815 -69111 -83352 -80780 -16615 49336 22994 -14050
7479a4050l2774j2125k307p9845K4087Q6289k7345N4097K3598k6066L66l0291
$$ -14050 -46824 -58949 -61256 -141101 -117014 -30725 -58070 -3973 19625 -6441 -6075 -36366
7467c6366M9038j0238q0327J2488j1694r276p926r5516M4765N5252L2n08l6883
$$ -36366 12672 2434 -77893 -65405 -77099 -86375 -94301 -189817 -145052 -89800 -89768 -90276 -127159
7454a27159Q0784J16333J460n8306l6088P5236K9587q1487n3009M7952N627l9843
$$ -127159 -46375 69958 71418 13112 -22976 52260 81847 360 -52649 -4697 930 -38913
7442c8913p838K181K0795J6011p2675K2133m180Q4896J32461m1406n8620j31079
$$ -38913 -46751 -44570 -23775 -7764 -80439 -58306 -62486 22410 154871 113465 54845 -76234
7430g6234k1761k4106K7987J29294O8066k4677q6065p3121r2819m8302q337n1478
$$ -76234 -97995 -122101 -94114 35180 103246 78569 -7496 -80617 -173436 -221738 -230075 -281553
7418b81553M3810q478l2240L760P7289K8790n426M0687O5980q0359l948Q9371
$$ -281553 -237743 -246221 -278461 -274701 -197412 -168622 -174048 -133361 -67381 -147740 -151688 -62317
7406f2317O2557Q1722L9607J3209q4466L0197L2693j2111J489l3069k9031k7264
$$ -62317 240 81962 121569 134778 50312 80509 113202 101091 102580 69511 40480 13216
7394A3216l2448L0439N0447p877K1386O2056l8575Q032o0873j04367j08545K168
$$ 13216 -19232 11207 61654 53777 75163 137219 98644 106676 45803 -58564 -167109 -164941
7382a64941P4449J24130K5144o6901p4328L1135P6166Q756k9355j6269O502l3266
$$ -164941 -90492 33638 58782 -8119 -82447 -51312 24854 33610 4255 -12014 -5512 -38778
7370c8778J1249M4579P029j6465M7522M1442k0902n2114p0241n8488J7636M9579
$$ -38778 -27529 17050 24079 7614 55136 96578 75676 23562 -46679 -105167 -87531 -37952
7358c7952o6104M740J31945O2394K587k9847L6632Q5538m0154j81153m0007j3953
$$ -37952 -104056 -99316 32629 95023 97610 67763 104395 189933 149779 -31374 -71381 -85334
7346h5334L4921j925j0891J2473m6651j2064J2119k1637j4724k1338Q4726O9500
$$ -85334 -50413 -52338 -63229 -50756 -97407 -109471 -97352 -118989 -133713 -155051 -70325 -825
7334h25O7310P0432l4971M163n8000O979L0199k0271K9945l0127n0354l2415l8299
$$ -825 66485 136917 101946 106109 48109 55088 85287 65016 94961 64834 14480 -17935 -56234
7321e6234l8136k4982p099J01184O0651k8681K2940O317p8865j15450M0875J08379
$$ -56234 -94370 -119352 -126451 -25267 35384 6703 29643 35960 -42905 -158355 -117480 -9101
7309i101N1202K9250m6812k7593j3127Q4567j2735J3664J2013k1950l627M690
$$ -9101 42101 71351 24539 -3054 -16181 68386 55651 69315 81328 59378 55751 60441
7297F0441n7482M5951K2276O7733M5305m4761o553q4333p2932O3448J4585n5143
$$ 60441 2959 48910 71186 138919 184224 139463 132910 48577 -24355 39093 53678 -1465
7285a465l9297l937o4789l4463m743K6713l0776J7308M8973L5266R108k7480p1917
$$ -1465 -40762 -44699 -109488 -143951 -148694 -121981 -152757 -135449 -86476 -51210 -42102 -69582 -141499
7272a41499J5645k5419j7789L4406j21k837l2461J2166k0372J05685O3461K2724
$$ -141499 -125854 -151273 -169062 -134656 -134777 -137614 -170075 -157909 -178281 -72596 -9135 13589
7260A3589Q853j0581O6084o0235R359k3732O639P2937l0358n6763o8607n1715
$$ 13589 22442 11861 77945 17710 27069 3337 9976 82913 52555 -4208 -72815 -124530
7248a24530K440Q2797R9427j387k5050m707k0780n5664N0608k7065n4682j4229
$$ -124530 -122090 -39293 60134 58747 33697 28990 8210 -47454 3154 -23911 -78593 -92822
7236i2822P540k2790M9640N1202J9026n4891m5557l2651k8529P8196L7831o5335
$$ -92822 -85282 -108072 -58432 -7230 11796 -43095 -88652 -121303 -149832 -71636 -33805 -99140
7224i9140j639N9618p5645j2625k5051M7247J07197j425o5589l0163O121R783
$$ -99140 -100779 -41161 -116806 -129431 -154482 -107235 -38 -1463 -67052 -97215 -91094 -81311
7212h1311M8848L6207K1068J13838K7005k3651k04346l3499O8015n6166k9210
$$ -81311 -32463 3744 24812 138650 165655 142004 -62342 -95841 -27826 -83992 -113202
7201a13202N5592J6189R82r93k6330o930M0123N529J8190j6324Q945j34167J0870
$$ -113202 -57610 -41421 -40439 -41432 -67762 -74692 -34569 -29040 -10850 -27174 -18229 -152396 -141526
7188a41526J33836O8169p8032m8046j8831J8579O289M5954O8092n5141N365K3199
$$ -141526 -7690 60479 -17553 -65599 -84430 -65851 -59562 -13608 54484 -657 4708 27907
7176B7907P407q2820j1504N0492l2679o8330j32289J4825O9656R392L834N4574
$$ 27907 35314 -47506 -59010 -8518 -41197 -109527 -241816 -226991 -157335 -147943 -144109 -89535
7164h9535L667P937K4193Q8361N8384n3426l7126q0589m1250o3510l9062R3902
$$ -89535 -85868 -77931 -53738 34623 93007 39581 2455 -78134 -119384 -182894 -221956 -128054
7152a28054K7306J4333K3751L3912m7664R124q232m5851P1640J9034m6894K8802
$$ -128054 -100748 -86415 -62664 -28752 -76416 -67292 -75524 -121375 -49735 -30701 -77595 -48793
7140d8793J32490J12178l5943n3622p0146J428N3830l9355N9702l4773j29570
$$ -48793 83697 195875 159932 106310 36164 37592 91422 52067 111769 76996 -52574
7129e2574l3135p1182J49201P3986j05043K5506L4647K610J48686P807q9013j19799
$$ -52574 -85709 -156891 -7690 66296 -38747 -13241 21406 24016 172702 180509 91496 -28303
7117b8303m908K1408K9784k4247j5025K326p6403K7844M938m5112m3215N7879
$$ -28303 -33211 -11803 17981 -6266 -21291 -18965 -95368 -67524 -62586 -107698 -150913 -93034
7105i3034q404k2749m6695L0347l3544J9311J30542n0769J5396J4729m381P3654
$$ -93034 -101438 -124187 -170882 -140535 -174079 -154768 -24226 -74995 -59599 -44870 -49251 24403
7093B4403L1372n9419m1401k7911Q43M2626m1585n1653k2549o0692m6761J39340
$$ 24403 55775 -3644 -45045 -72956 -72113 -29487 -71072 -122725 -145274 -205966 -252727 -113387
7081a13387P4853k1304m7378m1597O85R7049P8181j7133m7361n4379M4026J14072
$$ -113387 -38534 -59838 -107216 -148813 -148128 -51079 27102 9969 -37392 -91771 -47745 66327
7069F6327k5262L7671Q962n5782m1319n4826m2608p7911J29511R4074k9540r8792
$$ 66327 41065 78736 87698 31916 -9403 -64229 -106837 -184748 -55237 38837 9297 -89495
7057h9495r701r1956m4976Q7185J5300j9580K6678K8876N1407j0125q532p1397
$$ -89495 -99196 -191152 -236128 -148943 -133643 -153223 -126545 -97669 -46262 -56387 -64919 -136316
7045a36316K3268K7697m3550L553o020n2646Q924O556P9081o1643J6737Q7078
$$ -136316 -113048 -85351 -128901 -125348 -131368 -184014 -175090 -168534 -89453 -151096 -134359 -47281
7033d7281O4573j1979p3581K3690Q2145Q9050j2070p0805q7765p1844N4285P187
$$ -47281 17292 5313 -68268 -44578 37567 126617 114547 43742 -44023 -115867 -61582 -54395
7021e4395J7039J7691J17674J14029J8423n0162l3372j8003n0762k6338n8242
$$ -54395 -37356 -19665 98009 212038 230461 180299 146927 128924 78162 51824 -6418
7010f418J9119q9836r2722L8976J6254K6790Q989J0758k034O4371M1087n7319
$$ -6418 12701 -77135 -169857 -130881 -114627 -87837 -78848 -68090 -70124 -5753 35334 -21985
6998b1985m2783l1849p71N6560K6531o2992n7443M5724K7122o7288l4049O607
$$ -21985 -64768 -96617 -97388 -40828 -14297 -77289 -134732 -89008 -61886 -129174 -163223 -156616
6986a56616P7561j3630l877K1542K1914K505J0659Q2615l9165j6879K1655r3754
$$ -156616 -79055 -92685 -96562 -75020 -53106 -50601 -39942 42673 3508 -13371 8284 -85470
6974h5470m3070R1964M2698P461k8250p2598l23M8584l409n3844j0026K7132L563
$$ -85470 -128540 -36576 6122 13583 -14667 -87265 -87588 -39004 -42413 -96257 -106283 -79151 -75588
6961g5588n6150l2584O3038L2268o3438Q604Q4912l6052l6940J09559N3554P851
$$ -75588 -131738 -164322 -101284 -69016 -132454 -123850 -38938 -74990 -111930 -2371 51183 59034
6949E9034J1610l9331K126K525j6224l9531q2735M2714O2081m754q3464J3043
$$ 59034 70644 31313 33439 35964 19740 -19791 -102526 -59812 2269 -2485 -85949 -72906
6937g2906Q7748j0358q5758k834Q6432n893j00150o3131J2233R5757K6789j78
$$ -72906 14842 4484 -81274 -84108 2324 -3569 -103719 -166850 -154617 -58860 -32071 -32249
6925c2249k2352P2871N4270q3689q9084L8670L2231R8194l5290r6738J5235L1731
$$ -32249 -54601 18270 72540 -11149 -100233 -61563 -29332 68862 33572 -63166 -47931 -16200
6913a6200J4136o2685n3497J3586j7880j3660Q9334J22574j3895j5019K983l5832
$$ -16200 -2064 -64749 -118246 -104660 -122540 -136200 -46866 75708 61813 46794 49777 13945
6901A3945r1m212J0459L2399q6651o5899K7839o6330m7946Q3508L0452K9226K8103
$$ 13945 13854 9642 20101 52500 -34151 -100050 -72211 -138541 -186487 -102979 -72527 -43301 -15198
6888a5198r5407j7592l3438R8161r669p6020L0870Q943P5652j1379l6787k3788
$$ -15198 -110605 -128197 -161635 -63474 -73143 -149163 -118293 -109350 -33698 -45077 -81864 -105652
6876a05652N9164K9011Q3576q234o6098l8484j1744k4678n598P3703P0021O9367
$$ -105652 -46488 -17477 66099 57865 -8233 -46717 -58461 -83139 -88737 -15034 54987 124354
6864A24354J1728j089m1886j14576m6753L497k9613o20K7688J082N7367l8764
$$ 124354 136082 134993 93107 -21469 -68222 -64725 -94338 -94958 -67270 -66188 -8821 -47585
6852d7585M8079n7385n7823L0571k1017J6760l2760k2707J11345J01845q1395
$$ -47585 494 -56891 -114714 -84143 -105160 -88400 -121160 -143867 -32522 69323 -12072
6841a2072l4479P3576k8884m6805k9513L0068J17943N51p6276Q2016Q4600j02971
$$ -12072 -46551 27025 -1859 -48664 -78177 -48109 69834 70385 -5891 76125 160725 57754
6829E7754o1329K6466N011r6049o2168Q2767M3352L3884M0456m6372n2643r362
$$ 57754 -3575 22891 27902 -68147 -130315 -47548 -4196 29688 70144 23772 -28871 -38233
6817c8233p6223k7354j1342M2608P0685R0160j8374j7078J9951J0180m3461r0211
$$ -38233 -114456 -141810 -153152 -110544 -39859 50301 31927 14849 34800 44980 1519 -88692
6805h8692j229K3879K6655m3182m26J10153J2966J7268P574l2097l7050p6406
$$ -88692 -89921 -66042 -39387 -82569 -82995 27158 40124 57392 64966 32869 -4181 -80587
6793h0587m2499R0007N325k3936l8339P3315M27j6446j4989R198J9384l0785o3629
$$ -80587 -123086 -33079 -27754 -51690 -90029 -16714 -16287 -32733 -47722 -38524 -19140 -49925 -113554
6780a13554M087m5100o4570J9103M2787R1924O1614l3853k3666K4511k7586J3624
$$ -113554 -109467 -154567 -219137 -200034 -157247 -65323 -3709 -37562 -61228 -36717 -64303 -50679
6768e0679M2429J3237n6242M9804L6295q8431J3916J0549l205n0845M5515J10581
$$ -50679 -8250 4987 -51255 -1451 34844 -53587 -39671 -29122 -32327 -83172 -37657 72924
6756G2924N8847M0061j5179r4662j17227n0411P2827J20442j7718q2449k6105
$$ 72924 131771 171832 156653 61991 -55236 -105647 -32820 87622 69904 -12545 -38650
6745c8650m47k6823K3110M0565K3633n1596K1141O3235J7212r0171j707M456k48
$$ -38650 -39097 -65920 -42810 -2245 21388 -30208 -9067 54168 71380 -18791 -20498 -16042 -16290
6732a6290J5390M4895n7220p609K1133M6813k3510k1126l3825j09240l7932J8971
$$ -16290 -900 43995 -13225 -20834 299 47112 23602 2476 -31349 -140589 -178521 -159550
6720a59550K9105l9882M5809P6863O8435l2827o1624r306J4571L8056O773J728
$$ -159550 -130445 -170327 -124518 -47655 20780 -12047 -73671 -82977 -68406 -30350 -23577 -21849
6708b1849M2017m4229p173J7909j0652m583j5414n6504J1550L6221k9262k9085
$$ -21849 20168 -24061 -31234 -13325 -23977 -28560 -43974 -100478 -88928 -52707 -81969 -111054
6696a11054J102J30480L4931M3231l1203n6725l500J9017K4408L3342k8892o9810
$$ -111054 -109952 20528 55459 98690 67487 10762 7262 26279 50687 84029 55137 -14673
6684a4673j5894m342P929R2254p8239p4082N2364m9394p985L583O834L8654K9435
$$ -14673 -30567 -34909 -26980 65274 -12965 -87047 -34683 -84077 -92062 -88479 -81645 -42991 -13556
6671a3556m425m330m863l1272P4570l6962n3480L2281n436L991K7180J12984N9799
$$ -13556 -17981 -22311 -27174 -58446 16124 -20838 -74318 -42037 -47473 -43482 -16302 96682 156481
6658A56481j724p0936q0026P2840K61K3775l6007p5383m3005J3195N3754m877
$$ 156481 154757 83821 3795 76635 76896 100671 64664 -10719 -53724 -40529 13225 8348
6646H348K8822l461k4187j32407k2508N0232l2529k0918M8477O2169R9605j5188
$$ 8348 37170 33709 9522 -122885 -145393 -95161 -127690 -148608 -100131 -37962 61643 46455
6634D6455L8234L5623J019k4786l7706l1850Q4840r238j34403O289K7474O0625
$$ 46455 84689 120312 121331 96545 58839 26989 111829 102591 -31812 -25523 1951 62576
6622F2576L1099j4677q132j7132M1075J0915m6212N016n1477L8913K7584l1752
$$ 62576 93675 78998 70866 53734 94809 105724 59512 64528 13051 51964 79548 47796
6610D7796K0348m7340J0263J19456M3283p6585p8624o401j06057m3605q227M5965
$$ 47796 68144 20804 31067 150523 193806 117221 38597 32196 -73861 -117466 -125693 -79728
6598g9728P5711J0584k9816L6210m4755m0106p3581n6058N4002M824j4964J2545
$$ -79728 -4017 6567 -23249 12961 -31794 -71900 -145481 -201539 -147537 -142713 -157677 -145132
6586a45132o3002o7709m0512M1002N8364J48264O6166n6104l1789p0848O5454
$$ -145132 -208134 -275843 -316355 -275353 -216989 -68725 -2559 -58663 -90452 -161300 -95846
6575i5846L8660o3694n6021P0556Q5856k9582o7408L855Q7646j1434m0374N8465
$$ -95846 -57186 -120880 -176901 -106345 -20489 -50071 -117479 -113624 -25978 -37412 -77786 -19321
6563a9321L1767j2159o187J8285K7886o0402n8472j8081Q0741J2118Q1765J8842
$$ -19321 12446 287 -5900 12385 40271 -20131 -78603 -96684 -15943 -3825 77940 96782
6551I6782p2734n8818l2667k4069m299K3856J7407K599r7340l6747O9367K1382
$$ 96782 24048 -34770 -67437 -91506 -95805 -71949 -54542 -51943 -149283 -186030 -116663 -95281
6539i5281m4808R509l2748L1511K6304N4463J830O1238l4985j5239L2451r0775
$$ -95281 -140089 -130580 -163328 -131817 -105513 -51050 -49220 12018 -22967 -38206 -5755 -96530
6527i6530p8453N5647K2537R0874q546j1804P0760l2721l9081j1312L1374L385
$$ -96530 -174983 -119336 -96799 -5925 -14471 -26275 44485 11764 -27317 -38629 -7255 -3870
6515c870n0440N2816m0947k2678J4296M787M4936n7620n9802j8058L7498P2644
$$ -3870 -54310 -1494 -42441 -65119 -50823 -46036 -1100 -58720 -118522 -136580 -99082 -26438
6503b6438K4224L7038m7800r49J1043L9826o5358m4460l2162L3509j0817J2731
$$ -26438 -2214 34824 -12976 -13925 -2882 36944 -28414 -72874 -105036 -71527 -82344 -69613
6491f9613K2562q45M9367K9322m6114n8200o3250R5300R2306j2654k6839K6730
$$ -69613 -47051 -47896 1471 30793 -15321 -73521 -136771 -41471 50835 38181 11342 38072
6479C8072j4676o0248l6548l7946o1212K1158K451K5785J6823l5830p4513L3277
$$ 38072 23396 -36852 -73400 -111346 -172558 -151400 -148949 -123164 -106341 -142171 -216684 -183407
6467a83407J28294Q6097l3349L0231L3067K2762j0570J6294N219r2863r8079Q7524
$$ -183407 -55113 30984 -2365 27866 60933 83695 73125 89419 94638 1775 -96304 -8780
6455h780O6843P7541l8718p9752r335J6493L2740L1817l2607k9237j2592m9023
$$ -8780 58063 135604 96886 17134 7799 24292 57032 88849 56242 27005 14413 -34610
6443c4610L8256K0325N5385J3636l4312J3781M0250l1331j34956j37719q2112
$$ -34610 3646 23971 79356 92992 58680 72461 112711 81380 -53576 -191295 -273407
6432b73407L1863J38459J19265m2742j2953j9955M8695q790q2027k8766K5499
$$ -273407 -241544 -103085 16180 -26562 -39515 -59470 -10775 -19565 -101592 -130358 -104859
6421a04859L7702O0652K6180r1757o8318j2279k4773Q3820J11964O5248k7750
$$ -104859 -67157 -6505 19675 -72082 -140400 -152679 -177452 -93632 18332 83580 55830
6410E5830P8819K6529k5474n9821n8483o1478P527q144p178K6474K3850n992N6852
$$ 55830 134649 161178 135704 75883 17400 -44078 -36551 -44695 -51873 -25399 -1549 -7541 49311
6397D9311L4105J4511q0097n9203L6520q690j01163O611L4038m2473o6713l4687
$$ 49311 83416 97927 17830 -41373 -4853 -13543 -114706 -108095 -74057 -116530 -183243 -217930
6385b17930J1105R9994j241m9249q581K3995O0214N7158J7724M7071M3804m3739
$$ -217930 -206825 -106831 -108072 -157321 -165902 -141907 -81693 -24535 -6811 40260 84064 40325
6373D0325J402J3550o5653m1955k417j1605J1830N7302m041o8648j30967k0423
$$ 40325 41727 55277 -10376 -52331 -54748 -66353 -54523 2779 -1262 -69910 -200877 -221300
6361b21300N6142L9209j2053j4123N1131O7810Q9701k4659m0302o71j3180K2133
$$ -221300 -165158 -125949 -138002 -152125 -100994 -33184 56517 31858 -8444 -9115 -22295 -162
6349a62J06693j7133j01595k9940K3996O77L2410m7757p8202l0348m215N9983
$$ -162 106531 89398 -12197 -42137 -18141 -17464 14946 -32811 -111013 -141361 -145576 -85593
6337h5593N2791J6438p350n6234M9233J20482o2671o0504k0462l0795L2586J03309
$$ -85593 -32802 -16364 -23714 -79948 -30715 89767 27096 -33408 -53870 -84665 -52079 51230
6325E1230L2168J5231o3551j7486p7332m9889m5847L8270P7125M0717j4739P669
$$ 51230 83398 98629 35078 17592 -59740 -109629 -155476 -117206 -40081 636 -14103 -6434
6313f434q2995L2495P2373K2543K7449n9695j0261M6664n386k192k9736n0573
$$ -6434 -89429 -56934 15439 37982 65431 5736 -4525 42139 36753 34561 4825 -45748
$$ [...]
##END NTUPLES=NMR SPECTRUM
##END=
