##TITLE=Analysis number 327302
Compound Code cc 24809
Project Code adrs
Chemist Name endeavour
##JCAMPDX= 6.0         $$ Bruker NMR JCAMP-DX V2.0
##DATA TYPE= NMR SPECTRUM
##DATA CLASS= NTUPLES
##ORIGIN= Bruker BioSpin GmbH
##OWNER= nmr
$$ XWIN-NMR		Version 3.5
$$ Tue Mar 20 12:01:12 2007 GMT Standard Time (UT+0h)  MAYBRIDGE\nmr@NMR_250MHZ
##.OBSERVE FREQUENCY= 250.131544655141
##.OBSERVE NUCLEUS= ^1H
##.ACQUISITION MODE= SIMULTANEOUS (DQD)
##.ACQUISITION SCHEME= undefined
##.AVERAGES= 16
##.DIGITISER RES= 18
##SPECTROMETER/DATA SYSTEM= dpx250
##.PULSE SEQUENCE= zg30
##.SOLVENT NAME= CDCl3
##.SHIFT REFERENCE= (INTERNAL, CDCl3, 0, 16.522)
##AUDIT TRAIL= $$ (NUMBER, WHEN, WHO, WHERE, WHAT)
$$ ##TITLE= Audit trail, XWIN-NMR		Version 3.5
$$ ##JCAMPDX= 5.01
$$ ##ORIGIN= Bruker BioSpin GmbH
$$ ##OWNER= nmr
$$ C:\u/data/dgb/nmr/ADRS/1340/pdata/1/auditp.txt
$$ ##AUDIT TRAIL=  $$ (NUMBER, WHEN, WHO, WHERE, WHAT)
(   1,<2007-03-20 12:00:52.06 +000>,<MAYBRIDGE\nmr>,<NMR_250MHZ>,
      <created by zg, POWCHK disabled, PULCHK disabled
       configuration hash MD5:
       49 4B E0 1D 92 C2 6B 37 9F E6 65 BC 52 41 86 1D
       data hash MD5: 64K
       DB 6F 05 EC 2B 10 9A A7 08 65 53 60 9E 88 37 27>)
(   2,<2007-03-20 12:01:03.28 +000>,<MAYBRIDGE\nmr>,<NMR_250MHZ>,
      <Start of raw data processing
       ef LB = 0.3 FT_mod = 6 PKNL = 1 SI = 32K 
       data hash MD5: 32K
       75 5E C2 62 3F 46 82 9A 34 FE A1 11 66 49 C0 B1>)
(   3,<2007-03-20 12:01:04.93 +000>,<MAYBRIDGE\nmr>,<NMR_250MHZ>,
      <apk 
       data hash MD5: 32K
       C6 12 08 49 DC B5 72 64 C5 FD 41 57 7E BD BA 0C>)
(   4,<2007-03-20 12:01:05.70 +000>,<MAYBRIDGE\nmr>,<NMR_250MHZ>,
      <abs ABSG = 5 
       data hash MD5: 32K
       93 5D 73 27 E6 F3 91 CE 7B 9E 7D 21 E5 FA F0 E5>)
$$ ##END=
$$ 
$$ hash MD5
$$ DE 37 D5 2B 47 17 3D 4B 2E EB 92 3C 5F 19 CC 1A
##$RELAX= 
##$RELAX= 
##$RELAX= 
##$RELAX= 
##$RELAX= 
##$RELAX= 
##$RELAX= 
$$ Bruker specific parameters
$$ --------------------------
##$DU= <C:\u>
##$EXPNO= 1340
##$NAME= <ADRS>
##$PROCNO= 1
##$TYPE= <nmr>
##$USER= <dgb>
##$AMP= (0..31)
100 100 100 100 100 100 100 100 100 100 100 100 100 100 100 100 100 100 
100 100 100 100 100 100 100 100 100 100 100 100 100 100 
##$AQSEQ= 0
##$AQ_mod= 3
##$AUNM= <au_zg>
##$AUTOPOS= <13 >
##$BF1= 250.13
##$BF2= 250.13
##$BF3= 250.13
##$BF4= 250.13
##$BF5= 500.13
##$BF6= 500.13
##$BF7= 500.13
##$BF8= 500.13
##$BYTORDA= 1
##$CFDGTYP= 0
##$CFRGTYP= 5
##$CHEMSTR= <none>
##$CNST= (0..31)
1 1 145 1 1 1 1 1 1 1 1 1 1 1 1 1 1 1 1 1 1 1 1 1 1 1 1 1 1 1 1 1 
##$CPDPRG= <>
##$CPDPRG1= <>
##$CPDPRG2= <>
##$CPDPRG3= <>
##$CPDPRG4= <mlev>
##$CPDPRG5= <mlev>
##$CPDPRG6= <mlev>
##$CPDPRG7= <mlev>
##$CPDPRG8= <mlev>
##$CPDPRGB= <>
##$CPDPRGT= <>
##$D= (0..31)
0 1 0 0 0 0 0 0 0 0.06 0 0 0 0 0 0 0.0002 0 0 0 0 0 0 0 0 0 0 0 0 0 0 
0 
##$DATE= 1174392051
##$DBL= (0..7)
120 120 120 120 120 120 120 120 
##$DBP= (0..7)
150 150 150 150 150 150 150 150 
##$DBP07= 0
##$DBPNAM0= <>
##$DBPNAM1= <>
##$DBPNAM2= <>
$$ [...]
##$SUBNAM7= <"">
##$SUBNAM8= <"">
##$SUBNAM9= <"">
##$SW= 20.6930455092707
##$SWIBOX= (0..15)
0 0 3 0 0 0 0 0 0 0 0 0 0 0 0 0 
##$SW_h= 5175.983436853
##$TD= 65536
##$TD0= 1
##$TE= 683.16
##$TE2= 300
##$TE3= 300
##$TEG= 300
##$TL= (0..7)
0 120 120 120 120 120 120 120 
##$TP= (0..7)
150 150 150 150 150 150 150 150 
##$TP07= 0
##$TPNAME0= <>
##$TPNAME1= <>
##$TPNAME2= <>
##$TPNAME3= <>
##$TPNAME4= <>
##$TPNAME5= <>
##$TPNAME6= <>
##$TPNAME7= <>
##$TPOAL= (0..7)
0.5 0.5 0.5 0.5 0.5 0.5 0.5 0.5 
##$TPOFFS= (0..7)
0 0 0 0 0 0 0 0 
##$TUNHIN= 0
##$TUNHOUT= 0
##$TUNXOUT= 0
##$USERA1= <user>
##$USERA2= <user>
##$USERA3= <user>
##$USERA4= <user>
##$USERA5= <user>
##$V9= 5
##$VALIST= <valist>
##$VCLIST= <CCCCCCCCCCCCCCC>
##$VD= 0
##$VDLIST= <DDDDDDDDDDDDDDD>
##$VPLIST= <PPPPPPPPPPPPPPP>
##$VTLIST= <TTTTTTTTTTTTTTT>
##$WBST= 1024
##$WBSW= 4
##$XGAIN= (0..3)
0 0 0 0 
##$XL= 0
##$YL= 0
##$YMAX_a= 364017
##$YMIN_a= -422595
##$ZGOPTNS= <>
##$ZL1= 120
##$ZL2= 120
##$ZL3= 120
##$ZL4= 120
##$ABSF1= 16.522
##$ABSF2= -4.171173
##$ABSG= 5
##$ABSL= 3
##$ALPHA= 0
##$AQORDER= 0
##$ASSFAC= 0
##$ASSFACI= 0
##$ASSFACX= 0
##$ASSWID= 0
##$AUNMP= <proc_1d>
##$AZFE= 0.1
##$AZFW= 0.1
##$BCFW= 0
##$BC_mod= 0
##$BYTORDP= 0
##$COROFFS= 0
##$CY= 12.5
##$DATMOD= 1
##$DC= 0
##$DFILT= <>
##$DTYPP= 0
##$F1P= 14.0000005364418
##$F2P= -0.99999901652339
##$FCOR= 0.5
##$FTSIZE= 32768
##$FT_mod= 6
##$GAMMA= 0
##$GB= 0
##$INTBC= 1
##$INTSCL= 1
##$ISEN= 128
##$LB= 0.3
##$LEV0= 0
##$LPBIN= 0
##$MAXI= 10000
##$MC2= 0
##$MEAN= 0
##$ME_mod= 0
##$MI= 0
##$NCOEF= 0
##$NC_proc= -5
##$NLEV= 6
##$NOISF1= 0
##$NOISF2= 0
##$NSP= 0
##$NTH_PI= 0
##$NZP= 0
##$OFFSET= 16.522
##$PC= 1
##$PHC0= 231.9674
##$PHC1= 8.423087
##$PH_mod= 1
##$PKNL= yes
##$PPARMOD= 0
##$PSCAL= 4
##$PSIGN= 0
##$REVERSE= no
##$SF= 250.13
##$SI= 32768
##$SIGF1= 0
##$SIGF2= 0
##$SINO= 400
##$SIOLD= 32768
##$SREGLST= <1H.CDCl3>
##$SSB= 0
##$STSI= 32768
##$STSR= 0
##$SW_p= 5175.98343685301
##$SYMM= 0
##$S_DEV= 0
##$TDeff= 65536
##$TDoff= 0
##$TI= <Analysis number 999999
Compound Code 99
Book Reference 9
Project Code 9>
##$TILT= no
##$TM1= 0
##$TM2= 0
##$TOPLEV= 0
##$USERP1= <user>
##$USERP2= <user>
##$USERP3= <user>
##$USERP4= <user>
##$USERP5= <user>
##$WDW= 1
##$XDIM= 32768
##$YMAX_p= 392997690
##$YMIN_p= -568504
$$ End of Bruker specific parameters
$$ ---------------------------------
##NTUPLES= NMR SPECTRUM
##VAR_NAME=  FREQUENCY,     SPECTRUM/REAL,   SPECTRUM/IMAG
##SYMBOL=    X,             R,               I
##VAR_TYPE=  INDEPENDENT,   DEPENDENT,       DEPENDENT
##VAR_FORM=  AFFN,          ASDF,            ASDF
##VAR_DIM=   32768,         32768,           32768
##UNITS=     HZ,            ARBITRARY UNITS, ARBITRARY UNITS
##FACTOR=    0.157963299565203, 1,           1
##FIRST=     4132.6476996994, 0,             0
##LAST=      -1043.33573715361, 0,           0
##MIN=       -1043.33573715361, -568504,     0
##MAX=       4132.6476996994, 392997690,     0
$$ Real data points
##PAGE= N=1
##DATA TABLE= (X++(R..R)), XYDATA
$$ [...]
23472f8107L2584n938J9923m3032L2530K5089L5194p9168q6950O8773q1181j38816
$$ -68107 -35523 -41461 -21538 -64570 -32040 -6951 28243 -50925 -137875 -69102 -150283 -289099
23460b89099J49895O3079j35096L7310J23979O7331p1568q9726R32m1525R9324
$$ -289099 -139204 -76125 -211221 -173911 -49932 17399 -54169 -143895 -142963 -184488 -85164
23449h5164J66893Q3649o0079j44790Q2653l597n0136k6517k1982k1817O9806
$$ -85164 81729 165378 105299 -39491 43162 39565 -10571 -37088 -59070 -80887 -11081
23438a1081N0755Q5847m9337j49659J14737J51576O8719p174r8001j73760j97014
$$ -11081 39674 125521 76184 -73475 41262 192838 261557 254383 156382 -17378 -214392
23427b14392P967P0687N3143K4529N0398l370K111j9906o7350q3916L4051n7411
$$ -214392 -206425 -135738 -82595 -58066 -7668 -11038 -8927 -28833 -96183 -180099 -146048 -203459
23415b03459K5182J04211R7411R4431J15504j17241n5847r0951M4237M1758L7508
$$ -203459 -178277 -74066 23345 117776 233280 116039 60192 -30759 13478 55236 92744
23404I2744j99685R187O2413l5349j15583L4039Q8742J27529N2752p4107m7143
$$ 92744 -106941 -97754 -35341 -70690 -186273 -152234 -63492 64037 116789 42682 -4461
23393d461M6645J19699l9100j07828p1018m4513l6651J1616p928j60745N0952
$$ -4461 42184 161883 122783 14955 -56063 -100576 -137227 -125611 -133539 -294284 -243332
23382b43332N1467K6619J0001J5708j4781p3162j51726J30597K32585J39298l0977
$$ -243332 -191865 -165246 -155245 -139537 -154318 -227480 -379206 -248609 -16024 123274 92297
23371I2297n5749q9150r4766R246M1580l3163J07821M7260L5246q5533o5069R9259
$$ 92297 36548 -52602 -147368 -138122 -96542 -129705 -21884 25376 60622 -24911 -89980 9279
23359I279O9614k2395M8877o1382q3268M1728r6070L2883N3485j55195L8808P1444
$$ 9279 78893 56498 105375 43993 -39275 2453 -93617 -60734 -7249 -162444 -123636 -52192
23347e2192J0388j67986n6453J18658p7170J21169Q9087P9270m4855j43813k1209
$$ -52192 -41804 -209790 -266243 -147585 -224755 -103586 -14499 64771 19916 -123897 -145106
23336a45106j2743K20718Q2983p9904k36223j74601N3592L6913J49738J05852
$$ -145106 -157849 62869 145852 65948 -170275 -344876 -291284 -254371 -104633 1219
23326A219m4293r8561r9913L8031J8681q2450j6883N5904M0077Q19r218l9838
$$ 1219 -43074 -141635 -241548 -203517 -184836 -267286 -284169 -228265 -188188 -187369 -196587 -236425
23314b36425L0179J49417o906L3021J48350L892M8953N2727p4021j03987j41675
$$ -236425 -206246 -56829 -63735 -30714 117636 121528 170481 223208 149187 45200 -96475
23303i6475o9703N4875O8637m3336k7475J32313l2842n1941P039l8930K9105j25338
$$ -96475 -166178 -111303 -42666 -86002 -113477 18836 -14006 -65947 -58908 -97838 -68733 -194071
23291a94071o4687l7767n3531o0698J24558R5535J13879J80470M4026k2936o3483
$$ -194071 -258758 -296525 -350056 -410754 -286196 -190661 -76782 103688 147714 124778 61295
23280F1295N852L9876J62939P8541j4000q7637j32901j20847O3209R4067n4384
$$ 61295 67147 107023 269962 348503 334503 246866 113965 -6882 56327 150394 96010
23269I6010j8145p7721o8039L3049J38451j36531P0069J84441k847l5033o6127
$$ 96010 77865 144 -67895 -34846 103605 -32926 37143 221584 218737 183704 117577
23258A17577o9911k6223q0313p3420M9403P2815K633r6251M0667M5737J30092
$$ 117577 47666 21443 -58870 -132290 -82887 -10072 -7439 -103690 -63023 -17286 112806
23247A12806J9075j552j27798J5402j04327N1894N2562P3993q5979p2824j76093
$$ 112806 131881 130329 2531 17933 -86394 -34500 18062 92055 6076 -66748 -242841
23236b42841o780M4508L0842J70008K02569l6832m0426K0693j1329O329l7563
$$ -242841 -249621 -205113 -174271 -4263 198306 161474 121048 141741 130412 136741 99178
23225I9178j62685m294O3900J22127j1348k8330o0762j75722j95142L0238M0745
$$ 99178 -63507 -67801 -3901 118226 106878 78548 17786 -157936 -353078 -322840 -282095
23214b82095J49744p5628P7059Q6870j02194M2794J02101L0242o5966K8848J21857
$$ -282095 -132351 -207979 -130920 -44050 -146244 -103450 -1349 28893 -37073 -8225 113632
23203A13632P5175n6663r4393o2184J09545R5271j53753j37904P2391N8300J71491
$$ 113632 188807 132144 37751 -24433 85112 180383 26630 -111274 -38883 19417 190908
23192A90908J08292k09083j66832o4263J50794N4444R7779K964j37885j34572
$$ 190908 299200 90117 -76715 -140978 9816 64260 162039 165003 27118 -107454
23182a07454l2267J48358P1512q5651k23920O2754J10067N7926j1179K1630J4341
$$ -107454 -139721 8637 80149 -5502 -229422 -166668 -56601 1325 -9854 11776 26117
23171B6117l8912j26975j11313l9089K32901l061M579J17874J3565n9333Q1438
$$ 26117 -12795 -139770 -251083 -290172 -57271 -60332 -55753 62121 75686 16353 97791
23160I7791n0720o7616j1027o8839J6423J30680O7936J8291O784j55959k92983
$$ 97791 47071 -20545 -31572 -100411 -83988 46692 114628 132919 139703 -16256 -309239
23149c09239m879J47319P9891J35880N9518j06582k1237J94089j19992k03889
$$ -309239 -314118 -166799 -86908 48972 108490 1908 -19329 174760 54768 -149121
23139a49121p9529m9158n3015L1811o0971O3516J11950Q2260q3010P3860J07161
$$ -149121 -228650 -277808 -330823 -299012 -359983 -296467 -184517 -102257 -185267 -111407 -4246
23128d246J09375N1788n378o8569j10491j29033K138O9786J28173P3485m2540
$$ -4246 105129 156917 151539 82970 -27521 -156554 -154416 -84630 43543 117028 74488
23117G4488j14304q5595R6772R8443k1617J7791N5488k06125l5778K6021P2272
$$ 74488 -39816 -125411 -28639 69804 48187 65978 121466 -84659 -120437 -94416 -22144
23106b2144N7550m9817j35743J57498J24905j26877n0968K2459J46179L1265k5557
$$ -22144 35406 -14411 -150154 7344 132249 5372 -45596 -23137 123042 154307 128750
23095A28750K7768o8599j25267O8019p677k69820j60701J32066J51120J08404
$$ 128750 156518 87919 -37348 30671 22994 -246826 -407527 -275461 -124341 -15937
23085a5937J2475j02874Q5202K1354L9273l2501p9532J22653J09968n9100j50595
$$ -15937 -3462 -106336 -21134 220 39493 6992 -72540 50113 160081 100981 -49614
23074d9614m9660O4851P5925K1595l8077n7830J04027J81030K4885n3991j14793
$$ -49614 -99274 -34423 41502 63097 25020 -32810 71217 252247 277132 223141 108348
23063A08348r6329n5576Q2899J67135J42893n0057j32822j01315o1975p9413p7363
$$ 108348 12019 -43557 39342 206477 349370 299313 166491 65176 3201 -76212 -153575
23052a53575j8381k4288r242O8700J21813O7248m3814l0853m8028M2439q1467
$$ -153575 -171956 -196244 -205486 -136786 -14973 52275 8461 -22392 -70420 -27981 -109448
23041a09448J65538K36035N2280m9621j97675j41364K7472o3019M0715P6662m7770
$$ -109448 56090 292125 344405 294784 97109 -44255 -16783 -79802 -39087 37575 -10195
23030a0195M135n4298P4797J205k0638J75454m2391m8120k8935r6900R4902J43232
$$ -10195 -6060 -60358 14439 15644 -4994 170460 128069 79949 51014 -45886 49016 192248
23018A92248n9531j30743j8153K5576o5140R8532L2546l9251P1230j1213j787
$$ 192248 132717 1974 -16179 9397 -55743 42789 75335 36084 107314 96101 94314
23007I4314N7329j1934m1968n8117q822q609m9177q5687o1941J59080J34367O6242
$$ 94314 151643 139709 97741 39624 30802 22193 -26984 -112671 -174612 -15532 118835 185077
22995A85077o6086r1238R1140l8635j9697O7971j9436O1292M7967j037R015L0614
$$ 185077 118991 27753 118893 80258 60561 128532 109096 170388 218355 217318 226333 256947
22983B56947p3942n047n7094J21529J31614m099j14000j10244k12641j2958J33860
$$ 256947 183005 177958 120864 242393 374007 369908 255908 145664 -66977 -79935 53925
22972E3925n249j00883r186n7386k7271Q9463n3096K9763J3999J25582J36179
$$ 53925 48676 -52207 -61393 -118779 -146050 -56587 -109683 -79920 -65921 59661 195840
22961A95840j22214k99976o7597M9903L78J00592K0945o0815j5924n1066l1431
$$ 195840 73626 -226350 -293947 -244044 -243666 -143074 -122129 -182944 -198868 -249934 -281365
22950b81365N6651M1337J3767j52638K1382R4743M9278r7420n0728M3309J78184
$$ -281365 -224714 -183377 -169610 -322248 -300866 -206123 -156845 -254265 -304993 -261684 -83500
22939h3500j31372O9327m4748o8269P944m6048n8517K9078J62118Q9029J66294
$$ -83500 -214872 -145545 -190293 -258562 -250618 -296666 -355183 -326105 -163987 -74958 91336
22928I1336J49958m8563j53796q965O0724j45353r778O9832q477K0251n4491l113
$$ 91336 241294 192731 38935 29970 90694 -54659 -64437 5395 -3082 17169 -37322 -40435
22916d0435O0010J55181M2505j30307j38461M2871Q7956J05157O7122j32016p0148
$$ -40435 19575 174756 217261 86954 -51507 -8636 79320 184477 251599 119583 49435
22905D9435m2057P36Q8290q895j36251Q3393j84l6869J60750l0788n3738N0532
$$ 49435 7378 8114 96404 87509 -48742 34651 34467 -2402 158348 127560 73822 124354
22893A24354l1954n8038q7740Q2732J08961j45125n3451Q743J5307J62206R7434
$$ 124354 92400 34362 -53378 29354 138315 -6810 -60261 -51518 -36211 125995 223429
22882B23429j2150q9610l323J8926l901r799o6332j40984J05589q9409j02044
$$ 223429 211279 121669 118346 137272 133371 123572 57240 -83744 21845 -67564 -169608
22871a69608K378p2193J22043P5952J5839N7577m4994r4592O3202J8664p0071
$$ -169608 -167230 -239423 -117380 -41428 -25589 31988 -13006 -107598 -44396 -25732 -95803
22860i5803M292p4923Q5337k5427j73896o8961J14966Q5983p4423Q4078R9209
$$ -95803 -91511 -166434 -81097 -106524 -280420 -349381 -234415 -148432 -222855 -138777 -39568
22849c9568L8607m5894J09083N7577n1000r8111M5355N7204J20069p9602r6530
$$ -39568 -961 -46855 62228 119805 68805 -29306 16049 73253 193322 113720 17190
22838A7190K9894j31546l1396o3256p242m307j20891j21719N2499P1651J17703
$$ 17190 47084 -84462 -115858 -179114 -186356 -190663 -311554 -433273 -380774 -309123 -191420
22827a91420J09126P9800n8816k1031J9336m8988j7091J30325l2245j17294l1136
$$ -191420 -82294 -2494 -61310 -82341 -63005 -111993 -129084 1241 -31004 -148298 -179434
22816a79434j12010K1939J8635M6343P2765M5818o731o1785l0094P2506N5388
$$ -179434 -291444 -269505 -250870 -204527 -131762 -85944 -92675 -154460 -184554 -112048 -56660
22805e6660j0714P2064k63107j54114q1061J43033P7088Q4113R5057L6530m2559
$$ -56660 -67374 4690 -258417 -412531 -493592 -350559 -273471 -189358 -94301 -57771 -100330
22794a00330j08386j7061P325q0487m947k4653J22956K91317J68175K62k30423
$$ -100330 -208716 -225777 -218452 -298939 -303886 -328539 -205583 85734 253909 254171 23748
22783B3748j03646M2580R7052l356p0799K1035O121J45872j8712k00891j20191
$$ 23748 -79898 -37318 59734 56378 -14421 6614 12735 158607 139895 -60996 -181187
22772a81187J51369P8957N726p9027J7964n3207l8243q1742l1586J50677m4237
$$ -181187 -29818 49139 54865 -24162 -6198 -59405 -97648 -179390 -210976 -60299 -104536
22761a04536l1666k4214j12665J02364J10674P3131Q7987J8097J2429k11129m4654
$$ -104536 -136202 -160416 -273081 -170717 -60043 13088 101075 119172 131601 -79528 -124182
22750a24182J41679K4838j17753R7658Q8356L5295O511q1253l7550J1713P7654
$$ -124182 17497 42335 -75418 22240 110596 145891 152402 71149 33599 45312 122966
22739A22966K3494k4151o8240m3567J6362j197p9576J61162Q1152j32125J1930
$$ 122966 146460 122309 54069 10502 26864 25667 -53909 107253 188405 56280 68210
22728F8210j8107m4241O2512q2830r5827J1303P7686O7131P5519J36Q988p1809
$$ 68210 50103 5862 68374 -14456 -110283 -98980 -21294 45837 121356 121492 130480 58671
22716E8671K6786r3436j22067n481n477J04364j63315o3769l7628N4335J14252
$$ 58671 85457 -7979 -130046 -135527 -141004 -36640 -199955 -263724 -301352 -247017 -132765
22705a32765n8758n0435L9958O0068N4292J07541j65o2243q318L3699k4353P0146
$$ -132765 -191523 -241958 -202000 -141932 -87640 19901 19736 -42507 -50825 -17126 -41479 28667
22693B8667J6721q3086K2057n3785n0643l9276P9253Q299k1861M8536M5757K2481
$$ 28667 45388 -37698 -15641 -69426 -120069 -159345 -80092 -71793 -93654 -45118 639 23120
22681B3120L0985M1659l9882K7735K7760q7142j44033L8859J23198q3137L3728
$$ 23120 54105 95764 55882 83617 111377 24235 -119798 -80939 42259 -40878 -7150
22670g150P6240Q5886n4748k19051k3160Q1351J28175P3373q6743m2889m7467
$$ -7150 69090 154976 100228 -118823 -141983 -60632 67543 140916 54173 11284 -36183
22659c6183m2345R706n9559j10106O4987Q8628K5015p3497K6984m2971K3620M3779
$$ -36183 -78528 -68822 -128381 -238487 -173500 -84872 -59857 -133354 -106370 -149341 -125721 -81942
22647h1942J08756j04639J03957K2957J66327J20539j05105j52491k4874K8148
$$ -81942 26814 -77825 26132 49089 215416 335955 230850 78359 53485 81633
22637H1633J18190J47208p5743k3692j0090j57375j10736n0567M6623M0570J01639
$$ 81633 199823 347031 271288 247596 237506 80131 -30605 -81172 -34549 6021 107660
22626A07660M9764L7542m836p4545j5462j58834N3070K7983J2580J6682K6580
$$ 107660 157424 194966 190130 115585 100123 -58711 -5641 22342 34922 51604 78184
22615G8184P7887k2632j43051P6146N8951J2342n5851p7352l0196p7793j58553
$$ 78184 156071 133439 -9612 66534 125485 137827 81976 4624 -25572 -103365 -261918
22604b61918J7026K26318J8725r668P9747j26291o8789R293Q183j8281P6379M0219
$$ -261918 -244892 -18574 151 -9517 70230 -56061 -124850 -115557 -107374 -125655 -49276 -9057
22592i057J1696k4643r7140N2709n580p074j14754m8420k5889P5170J2049M753
$$ -9057 2639 -22004 -119144 -66435 -72015 -79089 -193843 -242263 -268152 -192982 -180933 -176180
22580a76180J05195M7797O2044o3234k8705l7162j30944j1805L2322L3355J20325
$$ -176180 -70985 -23188 38856 -24378 -53083 -90245 -221189 -232994 -200672 -167317 -46992
22569d6992J66421N9871n4103P5132o1958j26261k01970L770Q9421Q1748k5219
$$ -46992 119429 179300 125197 200329 138371 12110 -189860 -186090 -96669 -14921 -40140
22558d0140l5758p4540K0003J60238k2961P0624J16854m3434j56711M2942J64252
$$ -40140 -75898 -150438 -130435 29803 6842 77466 194320 150886 -5825 37117 201369
22547B01369j2920j08621l2678Q2708P3012m0901j13349m2139L0750L2188K4671
$$ 201369 188449 79828 47150 129858 202870 161969 48620 6481 37231 69419 94090
22536I4090K5451k6778k4842j53435j17898R1034J53271q7813Q7608m3199L6552
$$ 94090 119541 92763 67921 -85514 -203412 -112378 40893 -46920 40688 -2511 34041
22525C4041J3185M1797n7939m710q2432o7920L2874n0439O144N6739J8378m3306
$$ 34041 47226 89023 31084 26374 -56058 -123978 -91104 -141543 -135399 -78660 -60282 -103588
22513a03588r8079J54752J45398j2634R3424P292n2970k9429q6043m7431l3785
$$ -103588 -201667 -46915 98483 85849 179273 186565 133595 104166 18123 -29308 -63093
22502f3093o5116J25038J69851q2604n7307l9830J1868l7195r4025r7960R5454
$$ -63093 -128209 -3171 166680 84076 26769 -13061 -1193 -38388 -132413 -230373 -134919
22491a34919N9869K5002m4567j45279L983n9830M3129L8253P6353k9550N3354
$$ -134919 -75050 -50048 -94615 -239894 -235911 -295741 -252612 -214359 -138006 -167556 -114202
22480a14202P6956N6075K20971J03908J4714j5219j20196j38239j36919o0069
$$ -114202 -37246 18829 239800 343708 358422 343203 223007 84768 -52151 -112220
22470a12220R9198K759M9779M6133k6895J0881k14847n219L6337Q9853n7964j41912
$$ -112220 -13022 -10263 39516 85649 58754 69635 -145212 -150431 -114094 -24241 -82205 -224117
22458b24117j0028L7988R9227K6967k1442K8900r0844j40947K1327J29950J78084
$$ -224117 -234145 -196157 -96930 -69963 -91405 -62505 -153349 -294296 -272969 -143019 35065
22447C5065P44k80217p6433R6092J8541r001J7303k3447m2771K4574J03932N6224
$$ 35065 35809 -244408 -320841 -224749 -206208 -215209 -197906 -221353 -264124 -239550 -135618 -79394
22435g9394Q700O514o3739N3785M2216l106L0066J18815n5784m7591O0640m8387
$$ -79394 -70694 -64180 -127919 -74134 -31918 -35024 -4958 113857 58073 10482 71122 22735
22423B2735j03928J563K5784M7058J07094l6835o7733m2074o0362p4998J12142
$$ 22735 -81193 -79630 -53846 -6788 100306 63471 -4262 -46336 -106698 -181696 -69554
22412f9554k3867Q6385M7552P6698k3096j14170R771Q171J24335r6973k7724q5653
$$ -69554 -93421 -7036 40516 117214 94118 -20052 -10281 -2110 122225 25252 -2472 -88125
22400h8125l7110m0236J32002j1263Q9536M851P351J5160k8571j29623K0720R0091
$$ -88125 -125235 -165471 -33469 -44732 44804 49655 57006 72166 43595 -86028 -65308 24783
22388B4783m5268q8583J00013l2526k7721K8652L0166J5462j1927J05707O624
$$ 24783 -20485 -109068 -9055 -41581 -69302 -40650 -10484 4978 -6949 98758 105382
22377A05382p7578l0056o5711M4883J8142j7846J8961m8043J19990L9392o3509
$$ 105382 27804 -2252 -67963 -23080 -4938 -22784 -3823 -51866 68124 107516 44007
22366D4007r1202j49287O860J28284j61010L951J22752R648J4828l5620o6555
$$ 44007 -47195 -196482 -189622 -61338 -222348 -218397 -95645 -85997 -71169 -106789 -173344
22355a73344N9448J5740K1316M2392l0394q9160j39458r374R5330P8821M0017
$$ -173344 -113896 -98156 -76840 -34448 -64842 -154002 -293460 -302834 -207504 -128683 -88666
22344h8666K4753k6896L198O2277N0570r4315Q527j25369L7860P0605K4389q4008
$$ -88666 -63913 -90809 -87611 -25334 25236 -69079 -60552 -185921 -148061 -77456 -53067 -137075
22332a37075o2496J18199N0161J52163p288r8270o2368L8745j2831n9220N2117
$$ -137075 -199571 -81372 -31211 120952 113664 15394 -46974 -8229 -21060 -80280 -28163
22321b8163o09J78860n1281j01097N9100Q5062P2593J27865K377m305r2435p3591
$$ -28163 -28772 150088 98807 -2290 56810 141872 214465 342330 344707 340402 247967 174376
22309A74376k20449q7583L9435M5370P6947K1361j16715l5009L9506L1257p9546
$$ 174376 -46073 -133656 -94221 -48851 28096 49457 -67258 -102267 -62761 -31504 -111050
22298a11050N8159J63315J3071j84251j15679J50665M1023L4474J3730j14987
$$ -111050 -52891 110424 123495 -60756 -176435 -25770 15253 49727 63457 -51530
22288e1530j11046r3383J67691K28168M9365l2115o2911j8377j99272l4341k3960
$$ -51530 -162576 -255959 -88268 139900 189265 157150 94239 75862 -123410 -157751 -181711
22277a81711O6050J80568p414K194j0356O9695n0185j2857K5309J28482J6445
$$ -181711 -115661 64907 57493 59687 49331 119026 68841 55984 81293 209775 226220
22266B26220j18562Q31p7456j36322o1981L3880K8225o4298o7863k762Q3517J68181
$$ 226220 107658 108489 31033 -105289 -167270 -133390 -105165 -169463 -237326 -240088 -156571 11610
22254A1610Q0781l8225P854j4055j30502o3714P0858Q997n9988J8814N464j30626
$$ 11610 92391 54166 62020 47965 -82537 -146251 -75393 -66396 -126384 -107570 -102106 -232732
22242b32732m787R5129M563m363M1431J86002q0540j05926J17977q9239J08942
$$ -232732 -237519 -142390 -137827 -142190 -100759 85243 4703 -101223 16754 -72485 36457
22231C6457M2351M1765j5601q8463m7791Q8786j79022j04769J53141J29218J04299
$$ 36457 78808 120573 104972 16509 -31282 57504 -121518 -226287 -73146 56072 160371
22220A60371j11725m0049j3520j6871J60j66399l1466j1388M7765J02750J45032
$$ 160371 48646 8597 -4923 -21794 -21634 -188033 -219499 -230887 -183122 -80372 64660
22209F4660m4521p1762m8735L3899k0147j57277j4138J95567J8358L6437J0046
$$ 64660 20139 -51623 -100358 -66459 -86606 -243883 -258021 -62454 -44096 -7659 2387
22198B387O1622j7402j5324J1411p0632o4568L2701J90934l8090L3420L7225j03600
$$ 2387 64009 46607 31283 42694 -27938 -92506 -59805 131129 93039 126459 163684 60084
22186F0084l1689L334j19256P0693l7550r5817o4041M6704J19982M0911R3306
$$ 60084 28395 31729 -87527 -16834 -54384 -150201 -214242 -167538 -47556 -6645 86661
22175H6661j17969p1624N3864p9504m9199J46191R2766J09883p805j8668R3499
$$ 86661 -31308 -102932 -49068 -128572 -177771 -31580 61186 171069 163264 144596 238095
22164B38095q8746k15732l7680j00804M5476K24153K4974m8078L1497J7380R6439
$$ 238095 149349 -66383 -104063 -204867 -159391 64762 89736 41658 73155 90535 186974
22153A86974Q1566j14471j44927K7809j05010k2131j25262J8701J87519K18062
$$ 186974 268540 154069 9142 36951 -68059 -90190 -215452 -196751 -9232 208830
22143B08830j9755q8246j7365r3752r1047q134m2369R421O7064j4183M4066l0823
$$ 208830 189075 100829 83464 -10288 -101335 -109469 -151838 -142417 -75353 -89536 -45470 -76293
22131g6293J61335K8626Q1k8804j37046r1115n282J11811J77482P7410j28015
$$ -76293 85042 113668 113749 84945 -52101 -143216 -148498 -36687 140795 218205 90190
22120I0190j37237q3904k1270K6038n3266J6139L4737K7368L5546j1971l6768
$$ 90190 -47047 -130951 -152221 -126183 -179449 -163310 -128573 -101205 -65659 -77630 -114398
22109a14398J56480k6851M1337j048n9890l5865p2040l3081O2303m3774J0080
$$ -114398 42082 15231 56568 55520 -4370 -40235 -112275 -145356 -83053 -126827 -116747
22098a16747J44719J19466p6402Q594O9841K1375j35418p4888J611Q0035J35212
$$ -116747 27972 147438 71036 79630 149471 170846 35428 -39460 -37849 42186 177398
22087A77398m1893J12699o2804o2896o3755l9303j20272J95059J25233k6395q4856
$$ 177398 135505 248204 185400 122504 58749 19446 -100826 94233 219466 193071 108215
22076A08215o402n9033k9586L1993O3459q9371j2923m8652k6015m1206m6653l1885
$$ 108215 101813 42780 13194 45187 108646 19275 6352 -42300 -68315 -109521 -156174 -188059
22064a88059N9040Q6038K24013P2801p9003j7676o5537j41278k5239r4009k1585
$$ -188059 -129019 -42981 181032 253833 174830 157154 91617 -49661 -74900 -168909 -190494
22053a90494J90963L3688q1071m6906O5066L3791r968n6611m823P2878J7331K30
$$ -190494 469 34157 -46914 -93820 -28754 5037 -4931 -61542 -66365 6513 23844 24074
22041B4074k2956j15070n319J55825R181o2245l6346k3M5155M1426j1826l2120
$$ 24074 1118 -113952 -119271 36554 45735 -16510 -52856 -52879 -7724 33702 21876 -10244
22029a0244q1558m4621l8588p6546P5683R7545k8615q6329j6885J34902k6976
$$ -10244 -91802 -136423 -175011 -251557 -175874 -78329 -106944 -193273 -210158 -75256 -102232
22018a02232K5546M5275Q215O6896J1005o6086j2391Q0461N723N4130n0063j40490
$$ -102232 -76686 -31411 -23196 43700 54705 -11381 -23772 56689 62412 116542 66479 -74011
22006g4011j5795Q256j8029J59782L5286j61436N488J15128k7352j46507j41976
$$ -74011 -89806 -81550 -99579 60203 95489 -65947 -60459 54669 27317 -119190 -261166
21995b61166r8808M3926K0886J06249K07906m0300N8764J6408l4253M9250L2562
$$ -261166 -359974 -316048 -295162 -188913 18993 -21307 37457 53865 19612 68862 101424
21984A01424J06936j3151p6352j27541o7755m6216n857N7949k8292k2598O7699
$$ 101424 208360 195209 118857 -8684 -76439 -122655 -128512 -70563 -98855 -121453 -53754
21973e3754m1398R9514M5997J393O3172n6202r5865L0881m7746j00715M9568O6055
$$ -53754 -95152 4362 50359 51752 114924 58722 -37143 -6262 -54008 -154723 -105155 -39100
21961c9100N6906n132J6568j36629O2011j6859n4920j3868r3795P8911K72501
$$ -39100 17806 12674 29242 -107387 -45376 -62235 -117155 -131023 -224818 -145907 126594
21950A26594L7339m9499j21692q3259j18991Q5644R4405K0626J22843P7263L0760
$$ 126594 163933 114434 -7258 -90517 -209508 -123864 -29459 -8833 114010 191273 222033
21939B22033j01109j58226K6794k446j40708q0642N336K18223O6845j01556K0348
$$ 222033 120924 -37302 -10508 -12954 -153662 -234304 -228968 -10745 56100 -45456 -25108
21928b5108J20703l988R042l3132m2083J22104N4861o7650j34341o8130J4076
$$ -25108 95595 91607 100649 67517 25434 147538 202399 134749 408 -67722 -53646
21917e3646l7988j16376k1106j6932J21115N4024O8744O0822N0879J19220K5675
$$ -53646 -91634 -208010 -229116 -246048 -124933 -70909 -2165 58657 109536 228756 254431
21906B54431n8544r7828O6223j24104r7316K2137M6527N4697O300J9662N8183
$$ 254431 195887 98059 164282 40178 -57138 -35001 11526 66223 72523 92185 150368
21895A50368j30j42596p600J21583l9818j28981m6278J59177N0166q571j6624
$$ 150368 150238 7642 42 121625 81807 -47174 -93452 65725 115891 107320 90696
21884I0696o0542m8480l3483K283L5624M4617M1850K5470l3705k6503j57966p8366
$$ 90696 30154 -18326 -51809 -49526 -13902 30715 72565 98035 64330 37827 -120139 -198505
21872a98505J48823J41672J7738J21417j06312K0901k04750r6406N6322O5318
$$ -198505 -49682 91990 109728 231145 124833 145734 -59016 -155422 -99100 -33782
21862c3782K5574j30053O0088m0811j0773J04Q2070L3044j9616J17314Q5340O8037
$$ -33782 -8208 -138261 -78173 -118984 -129757 -129653 -47583 -14539 -34155 83159 168499 236536
21850B36536R9789j26909o0272P1166o1415j00551j33174J5717J73959R0490j02923
$$ 236536 336325 209416 149144 220310 158895 58344 -74830 -59113 114846 205336 102413
21839A02413j4871p2629o9405j39905J5193K0062L0151O1893K695M3320k770K7635
$$ 102413 87542 14913 -54492 -194397 -179204 -159142 -128991 -67098 -64403 -21083 -23853 3782
21827C782n6566l6997J2540l5269j00265O6963k5041N0201M330j6483Q2541J06966
$$ 3782 -52784 -89781 -77241 -112510 -212775 -145812 -170853 -120652 -116322 -132805 -50264 56702
21815E6702O8095J04899j42031l8654M1119J59933j351k35844O3875l7667K941
$$ 56702 124797 229696 87665 49011 90130 250063 248712 12868 76743 39076 42017
21804D2017j17489P434O7471N1912J03707O299L0914q4281j39447k4369M3326
$$ 42017 -75472 -68038 -567 51345 155052 161351 192265 107984 -31463 -55832 -12506
21793a2506M0935r208J8490j56786j03991Q9809k4252n7176Q4156J07981J56956
$$ -12506 28429 19221 37711 -119075 -223066 -133257 -157509 -214685 -130529 -22548 134408
21782A34408j05578j4772P9034o9451o270M6790r9407K0819j4474N5160j3662
$$ 134408 28830 14058 93092 23641 17371 64161 -35246 -14427 -28901 26259 12597
21771A2597J5684K25121M2037j12224k04859Q1O7083m3958n7637p3013O1321N9618
$$ 12597 28281 253402 295439 183215 -21644 -21563 45520 1562 -56075 -129088 -67767 -8149
21759h149K3517j54775k9735J20039n6163O371L9328j09080m157P3119J28867
$$ -8149 15368 -139407 -169142 -49103 -105266 -98895 -59567 -168647 -172804 -99685 29182
21748B9182R3499j40120O9647J99122l6482j17028l1369K7678O511M9451n3226
$$ 29182 122681 -17439 52208 251330 214848 97820 66451 94129 100640 150091 96865
21737I6865j74957M3605P1736M4174M3033Q866j84701r642p6496p2781k0000r2918
$$ 96865 -78092 -34487 37249 81423 124456 133322 -51379 -61021 -137517 -210298 -230298 -323216
21725c23216J41924J01454n3616o0415N1190J35643J5699J4734P3241l5221n8492
$$ -323216 -181292 -79838 -133454 -193869 -142679 -7036 8663 23397 96638 61417 2925
21714B925J1806J07183J28186j9200L4749k5999j46774j72338j5136L714M6888
$$ 2925 14731 121914 250100 230900 265649 239650 92876 -79462 -94598 -90884 -43996
21703d3996p6326k33L6617N3419L6198j31456j47587n6587R011J46088o821j6711
$$ -43996 -120322 -120555 -83938 -30519 5679 -125777 -273364 -329951 -320940 -174852 -181673 -198384
21691a98384p173M5036J51983P9904o8733J19904j3767J22496j37390o0189Q407
$$ -198384 -205557 -160521 -8538 71366 2633 122537 108770 231266 93876 33687 42094
21680D2094j7711L4501m5551J2356p4726j7496l5208o3506N8104J30670R2907
$$ 42094 24383 58884 13333 25689 -49037 -66533 -101741 -165247 -107143 23527 116434
21669A16434M1725N738o0452j8244J40005J5084m4815k2614J3102O4782p2157
$$ 116434 158159 163897 103445 85201 225206 240290 195475 172861 185963 250745 178588
21658A78588K6311j24254r3491k3645n299M4836m6315O6852J675M9654J43408
$$ 178588 204899 80645 -12846 -36491 -41790 3046 -43269 23583 25258 74912 218320
21647B18320o8005j00897r2675n7414l1871p2341J67986J39565L7120l0793j11239
$$ 218320 150315 49418 -43257 -100671 -132542 -204883 -36897 102668 139788 108995 -2244
21636b244m1061K3972j02413o5579J557J18836J9735p7768K7246p831J39233M0674
$$ -2244 -43305 -19333 -121746 -187325 -185768 -66932 -47197 -124965 -97719 -105550 33683 74357
21624G4357j02083l2329P3950m7876k6772k5786L3452l8360Q5155n1280l2432
$$ 74357 -27726 -60055 13895 -33981 -60753 -86539 -53087 -91447 -6292 -57572 -90004
21613i0004K6684K2783M5645o6700O649j0035p5086k8838j05961l4317k4501j00064
$$ -90004 -63320 -40537 5108 -61592 -54943 -64978 -140064 -168902 -274863 -309180 -333681 -433745
21601d33745N6423J69144J13393N2890p0664p2221R7259m8998j31596k763J47590
$$ -433745 -377322 -208178 -94785 -41895 -112559 -184780 -87521 -136519 -268115 -270878 -123288
21590a23288J36098K5931j29565j07447o4985P4537J01197r1440P5052R9559J1097
$$ -123288 12810 38741 -90824 -198271 -263256 -188719 -87522 -178962 -103910 -4351 6746
21579F746R489j1921j39098N520l9819K17313O2202o007q208j5387o2531Q810
$$ 6746 16235 4314 -134784 -129264 -169083 48230 110432 104425 96217 80830 18299 27109
21567B7109Q7096L6791j47260l6629J88813k2926j27708o9391o3920L1460R1883
$$ 27109 114205 150996 3736 -32893 155920 132994 5286 -64105 -128025 -96565 -4682
21556d682n0639k2274K4695j35485J4356M5397M897Q8324J03439k0331o2763M0476
$$ -4682 -55321 -77595 -52900 -188385 -174029 -128632 -123735 -35411 68028 47697 -15066 25410
21544B5410q2692j5757L308L4822O8522J3653J6452N2886j96832r1236O5250M4581
$$ 25410 -57282 -73039 -69731 -34909 33613 47266 63718 116604 -80228 -171464 -106214 -61633
21532f1633J60843j2574j53436j43951M542J26230P7169N9969m8895j24831p91
$$ -61633 99210 86636 -66800 -210751 -206209 -79979 -2810 57159 8264 -116567 -117358
21521a17358p0146R015J7362p1913R8989j488k3141j31699J860J76670L3711j6841
$$ -117358 -187504 -178489 -161127 -233040 -134051 -135539 -158680 -290379 -288519 -111849 -78138 -94979
21509i4979j01537M934P4652O4791L3562n5669j7424J7240q6061J8447P7260j12142
$$ -94979 -196516 -191582 -116930 -52139 -18577 -74246 -91670 -74430 -160491 -142044 -64784 -176926
21497a76926k871J4256Q7104J00492Q258l3762q0193n8895M4454K1324N9929J1039
$$ -176926 -179797 -165541 -78437 22055 30313 -3449 -83642 -142537 -98083 -76759 -16830 -5791
21485e791J5570o5957p1696k2500K1936p57J10447j6023r8857Q1106Q8549N6729
$$ -5791 9779 -56178 -127874 -150374 -128438 -129195 -18748 -34771 -133628 -52522 36027 92756
21473I2756N548j4132K8410N3317j19018J8987j13914l025N9144Q115p3304r0487
$$ 92756 98304 84172 112582 165899 46881 65868 -48046 -51071 8073 16188 -57116 -147603
21461a47603j0029O9792r116m9717q118j24465j22068R6603J75224m4472n6432
$$ -147603 -157632 -87840 -96956 -146673 -154791 -279256 -401324 -304721 -129497 -173969 -230401
21450b30401J03020O2969k0461p7871O3955J2954k2494J09082N3955O1309P0875
$$ -230401 -127381 -64412 -84873 -162744 -98789 -85835 -108329 753 54708 116017 186892
21439A86892k5433n7428k03014p872q0161k2423l5176K4040J46410N7498p4011
$$ 186892 161459 104031 -98983 -106855 -187016 -209439 -244615 -220575 -74165 -16667 -90678
21428i0678q309R2909N1361j18164o7567R7376J06267q1857p4634M2634p822q0489
$$ -90678 -98987 -6078 45283 -72881 -140448 -43072 63195 -18662 -93296 -50662 -58484 -138973
21416a38973j54642k4152J65050J11803n233o5762j19260L459M6857O648j2119
$$ -138973 -293615 -317767 -152717 -40914 -46147 -111909 -231169 -227710 -180853 -174205 -186324
21405a86324L3381M4346K0545n3483l467P946M9241m7146N9492L9404N0214O210
$$ -186324 -152943 -108597 -88052 -141535 -145002 -137056 -87815 -134961 -75469 -36065 14149 20359
21393B0359M269q1018l3271L528k0539n7768K9453k5398r1208o4517J06426J39273
$$ 20359 24628 -56390 -89661 -86133 -106672 -164440 -134987 -160385 -251593 -316110 -209684 -70411
21381g0411m51J317j9933j34894L6113J13013J31606n7441M1775n6137o2477Q355
$$ -70411 -70862 -69545 -89478 -224372 -188259 -75246 56360 -1081 40694 -15443 -77920 -69565
21369f9565K323P7695m5312q2549N1018R1766j33537m1512R2419p0567J39965
$$ -69565 -67242 10453 -34859 -117408 -66390 25376 -108161 -149673 -57254 -127821 12144
21358A2144J79971l8051j03724P539O937M5244n3762m5285k456m5816J5665o947
$$ 12144 192115 154064 50340 57879 64816 110060 56298 11013 8557 -37259 -21594 -28541
21346b8541j10925M6754K35935M9848r2985l7558o9665N794O9958l5828Q0537
$$ -28541 -139466 -92712 143223 193071 100086 62528 -7137 -1343 68615 32787 113324
21335A13324j5608l3200J33318m5569o5569r663Q4166J8342j42395j8447K0137
$$ 113324 97716 64516 197834 152265 86696 77033 161199 179541 37146 18699 38836
21324C8836N096r1583j13708K5800j19171K31558K6843j06978j1051N3626M9058
$$ 38836 43932 -47651 -161359 -135559 -254730 -23172 3671 -103307 -114358 -60732 -11674
21313a1674K553M0029M4370L3921l7808j47826m6160N1293n1801N7326J3130l441
$$ -11674 -9121 30908 75278 109199 71391 -76435 -122595 -71302 -123103 -65777 -52647 -56088
21301e6088p273K9700K9963L2394L8374k854O642p2832q9828r8128M7069n5820
$$ -56088 -63361 -33661 -3698 28696 67070 64216 70858 -1974 -91802 -189930 -142861 -198681
21289a98681j6089Q1337N6141L5306O5747P9870l2695K8613O2589j0129k0023
$$ -198681 -214770 -133433 -77292 -41986 23761 103631 70936 99549 162138 152009 131986
21278A31986J14833j40469p9148k8894n0778M410k4969q559J27382R4492j40421
$$ 131986 246819 106350 27202 -1692 -52470 -48060 -73029 -81588 45794 140286 -135
21267a35O5613k26L7781n7115m2293J7506p9593k1672j41221o7431J73370J47930
$$ -135 65478 65252 103033 45918 3625 21131 -58462 -80134 -221355 -288786 -115416 32514
21255C2514L9275N180O2268m9650k03727p448O7503P0103k6456l7874j24346p569
$$ 32514 71789 76969 139237 89587 -114140 -121588 -54085 16018 -10438 -48312 -172658 -180227
21243a80227J49080j05569r3252K21255N0941j01591j7318M1487m9927j15521
$$ -180227 -31147 -136716 -229968 -8713 42228 -59363 -76681 -35194 -85121 -200642
21233b00642J2345J7809l7424L3503Q6768m6555k6631m2028P5187J05526o0013
$$ -200642 -188297 -170488 -207912 -174409 -87641 -134196 -160827 -202855 -127668 -22142 -82155
21222h2155j97162l574O4623j4161o1357R1697J04967O9067j26394p2195O8907
$$ -82155 -279317 -282891 -218268 -232429 -293786 -202089 -97122 -28055 -154449 -226644 -157737
21211a57737O7506K9225J0482M4792o8063M7542O7594q2511p9951M4034R94l652
$$ -157737 -90231 -61006 -50524 -5732 -73795 -26253 41341 -41170 -121121 -77087 -76093 -79745
21199g9745N5944q5751L2808k7653m681J16968p9184l8178J01866J5775j03075
$$ -79745 -23801 -109552 -76744 -104397 -109078 7890 -71294 -109472 -7606 8169 -94906
21188i4906o4901J14099j7093m8007l8983p7564j6087K13123O7999j13121r0155
$$ -94906 -159807 -45708 -62801 -110808 -149791 -227355 -243442 -30319 37680 -75441 -165596
21177a65596Q0224j6725J6725K8692J18243M1252n5568j110N1095j22608j53898
$$ -165596 -85372 -102097 -85372 -56680 61563 102815 47247 46137 97232 -25376 -179274
21166a79274L1281r385J81898J29668m8429r3648j32802l5927Q3680J0214q8535
$$ -179274 -147993 -157378 24520 154188 105759 12111 -120691 -156618 -72938 -62724 -151259
21155a51259n9974J33569J1220o8585J14704J15668j01882p9109o2411M7438R3592
$$ -151259 -211233 -77664 -66444 -135029 -20325 95343 -6539 -85648 -148059 -100621 -7029
21144g029m3886p1758J50069P1155N6966j31068j01783q0692O542Q056J9485L7677
$$ -7029 -50915 -122673 27396 98551 155517 24449 -77334 -158026 -151484 -143428 -123943 -86266
21132h6266r778q8770J4145k9623J38598J06912j07098r2511M7445O1770J03404
$$ -86266 -96044 -184814 -170669 -200292 -61694 45218 -61880 -154391 -106946 -45176 58228
21121E8228k3588o795l7092k14J47000k792k08222j19876o8102L4801N7916J10643
$$ 58228 34640 27845 -9247 -9461 137539 134747 -73475 -193351 -261453 -226652 -168736 -58093
21109e8093l9068M4861j22790l8237N6926J32926J1204r6633J3398r7120K1490
$$ -58093 -97161 -52300 -175090 -213327 -156401 -23475 -12271 -108904 -95506 -192626 -171136
21098a71136R2608J31692K5217j17756o4044O6633J5956l3948m0990K9128n850
$$ -171136 -78528 53164 78381 -39375 -103419 -36786 -20830 -54778 -95768 -66640 -72490
21087g2490q372j27024k607L8078r2655m750K79596J11930P6338R5848p9475o6932
$$ -72490 -80862 -207886 -210493 -172415 -265070 -269820 9776 121706 198044 293892 214417 147485
21075A47485k0888m697K4545j9526L2380J32315J0481j19101m8115l8419q2290
$$ 147485 126597 121900 146445 126919 159299 291614 302095 182994 134879 96460 14170
21064A4170J0990o2507l4041J6483m8623J36013j4204j20844j0972L17P7953P6388
$$ 14170 25160 -37347 -71388 -54905 -103528 32485 18281 -102563 -113535 -113218 -35265 41123
21052D1123r4940j22090m7417o8671K4320R1278Q1125J12463k4901p6234l3786
$$ 41123 -53817 -175907 -223324 -291995 -267675 -176397 -95272 17191 -7710 -83944 -117730
21041a17730l8518O6748P5172M7233j07939J6184j8391M3870p431R7459j7284
$$ -117730 -156248 -89500 -14328 32905 -75034 -58850 -77241 -33371 -40802 56657 39373
21030C9373j5568j07465j79169l8161Q732Q3012N1713L8909k1639M0357p428K781
$$ 39373 23805 -83660 -262829 -300990 -292258 -209246 -157533 -118624 -140263 -99906 -107334 -104553
21018a04553l1348N8182Q6016j41917k00760P3225K03187N7966o4454K7654R3960
$$ -104553 -135901 -77719 8297 -133620 -334380 -261155 -57968 -2 -64456 -36802 57158
21007E7158K1716J1872n3931K57j18319o7656J37013K1745J6085k4574J02424
$$ 57158 78874 90746 36815 37072 -81247 -148903 -11890 9855 25940 1366 103790
20996A03790R7505J21497o6673k14033k3757L6133j54656l5060J81203K7311J0649
$$ 103790 201295 322792 256119 42086 18329 54462 -100194 -135254 45949 73260 83909
20985H3909j39733j30230J280o6687N8086O4002K6482L1673O009M6370N1444l5621
$$ 83909 -55824 -186054 -184774 -251461 -193375 -129373 -102891 -71218 -65209 -18839 32605 -3016
20973c016j23602K4996Q8021J08380K8615K139J3686O0647M2102n4164r9844r8377
$$ -3016 -126618 -101622 -13601 94779 123394 125533 139219 199866 241968 187804 87960 -10417
20961a0417R9771J3610j95496j45760N7447M6108O8002Q9807O6014Q149N5661
$$ -10417 89354 102964 -92532 -238292 -180845 -134737 -66735 23072 89086 97235 152896
20950A52896J28589j67316r1890k8631N1344N2014l6392n0245K0032J0939J00099
$$ 152896 281485 114169 22279 -6352 44992 97006 60614 10369 30401 41340 141439
20939A41439K9635O9783K1596l3970j80778j89960k24901P6518R3870J45139J1117
$$ 141439 171074 240857 262453 228483 47705 -142255 -367156 -290638 -196768 -51629 -40512
20928d0512j8907M3195j52046q5137Q8387O5822j5271K23535L4410Q0067o4894
$$ -40512 -59419 -16224 -168270 -253407 -165020 -99198 -114469 109066 143476 223543 158649
20917A58649k46196L2407R9829J13483l7651q7107O4943M0417p1383j25099J72062
$$ 158649 -87547 -55140 44689 158172 120521 33414 98357 138774 67391 -57708 114354
20906A14354r2406l6282J23255M3593r0645m0008o426L8184J58432k3220r3390
$$ 114354 21948 -14334 108921 152514 61869 21861 15435 53619 212051 188831 95441
20895I5441p4724k9861J18821J27396r1588j18834J5286K421n5610R771O332n8590
$$ 95441 20717 -9144 109677 237073 145485 26651 41937 44358 -11252 -1481 4851 -53739
20883e3739J33426l4879m5680R2205K5753o0762q3060j04352L7972M4490M1485
$$ -53739 79687 44808 -872 91333 117086 56324 -26736 -131088 -93116 -48626 -7141
20872g141L0940j20243o473j5769Q1813M584r7507N6276q2976r2736Q8946J45199
$$ -7141 23799 -96444 -102917 -118686 -36873 -32289 -129796 -73520 -156496 -249232 -160286 -15087
20860a5087P5768K1040j50057o3275O6567O1614J08030j8574k1563K65852o3104
$$ -15087 60681 81721 -68336 -131611 -65044 -3430 104600 86026 64463 330315 267211
20849B67211k7081l7203m2219r1379q8355J9834l7089q0840m8552j00091Q6379
$$ 267211 240130 202927 160708 69329 -19026 808 -36281 -117121 -165673 -265764 -179385
20838a79385J60795L6362k3650j4565r1140j00365J66455L2451j14935k0865J31375
$$ -179385 -18590 17772 -5878 -20443 -111583 -211948 -45493 -13042 -127977 -148842 -17467
20827a7467N8026K9770j79857j42872K9725J35623P0949l2655k1012J05176L5017
$$ -17467 40559 70329 -109528 -252400 -222675 -87052 -16103 -48758 -69770 35406 70423
20816G0423P5985J659j14946k5525N8598k8062J2675m7990n1689n2047j14088
$$ 70423 146408 148067 33121 7596 66194 38132 50807 2817 -48872 -100919 -215007
20805b15007K4200J11070N6564p1599m3680P4277L6261N4693j1241n5901Q3736
$$ -215007 -190807 -79737 -23173 -94772 -138452 -64175 -27914 26779 15538 -40363 43373
20794D3373p683j16180k4472M4245R6431R4860o4042P4043J5884q6530o5442m5382
$$ 43373 35690 -80490 -104962 -60717 35714 130574 66532 140575 156459 69929 4487 -40895
20782d0895j6666m5574M8604J10097m5918K6110n5422o3555K0534J67038J03744
$$ -40895 -57561 -103135 -54531 55566 9648 35758 -19664 -83219 -62685 104353 208097
20771B08097l4439r0776l8761j9514K7878J02531l1119k2194j12506j39097J1389
$$ 208097 173658 82882 44121 24607 52485 155016 123897 101703 -10803 -149900 -138511
20760a38511J42913P4277M3072k2997j55687j55723q055M0052J34981o167l4773
$$ -138511 4402 78679 121751 98754 -56933 -212656 -220711 -180659 -45678 -51845 -86618
20749h6618M8352M1615l1721r8407K4207K1792L4120L1447m023j5511M7684Q7172
$$ -86618 -38266 3349 -28372 -126779 -102572 -80780 -46660 -15213 -19236 -34747 12937 100109
20737A00109m7952m8694k7350L5430l9713q7246P7203P8635R9358M1127m7373
$$ 100109 52157 3463 -23887 11543 -28170 -115416 -38213 40422 139780 180907 133534
20726A33534l9212R429k1038k9013l400j4389j09943o526K1465J20261p0253j26901
$$ 133534 94322 103751 82713 53700 50300 35911 -74032 -80558 -59093 61168 -9085 -135986
20714a35986N5437L723R9232J6992J0043R6896K8501q7673m1885j35755o2063
$$ -135986 -80549 -76826 22406 39398 49441 146337 174838 87165 45280 -90475 -152538
20703a52538L6793J53823l07n6723p6432J6992o9560k9035N3872O1090p268q3799
$$ -152538 -115745 38078 37771 -18952 -95384 -78392 -147952 -176987 -123115 -62025 -69293 -153092
20691a53092J8088J01074J50554J26818J6232n5955j82331k0139m4788o2510m7810
$$ -153092 -135004 -33930 116624 243442 259674 203719 21388 1249 -43539 -106049 -153859
20680a53859R2286J17781j30166L853N7889k4037n942p1908p7246R7686J9217
$$ -153859 -61573 56208 -73958 -70105 -12216 -36253 -42195 -114103 -191349 -93663 -74446
20669g4446J12065J41549O679j6811k9286n6138q7367p0033J3713j65274p5027
$$ -74446 37619 179168 185847 169036 139750 83612 -3755 -73788 -60075 -225349 -300376
20658c00376J33770K45262O4642K1001q6453p2268r7172O1027J26821Q1200j09588
$$ -300376 -166606 78656 143298 164299 77846 5578 -91594 -30567 96254 177454 67866
20647F7866p1670p6551j40162j6432r0378L2459K0025O6477Q1859j4087j5596
$$ 67866 -3804 -80355 -220517 -236949 -327327 -294868 -274843 -208366 -126507 -140594 -156190
20636a56190n1840r0375K4388Q6710J1490p4262m7421o4894j4172K16229P9847
$$ -156190 -208030 -298405 -274017 -187307 -175817 -250079 -297500 -362394 -376566 -160337 -80490
20625h0490p0453J317j11838n8122K3130L6954J23077J70675j550k1568p215j0172
$$ -80490 -150943 -149626 -261464 -319586 -296456 -259502 -136425 34250 32700 11132 3917 -6255
20613f255j12710q0009R2492J24020P6854N6567k0295K7361R4355k5035j39696
$$ -6255 -118965 -198974 -106482 17538 94392 150959 130664 158025 252380 227345 87649
20602H7649j58677N1236J31433N3285l5281p9437l5245K310O587Q1532L5917p3402
$$ 87649 -71028 -19792 111641 164926 129645 50208 14963 17273 23860 105392 141309 67907
20590F7907m5886j33811n1598R9581n012j5750O4819n2478M6435J64813q8746
$$ 67907 22021 -111790 -163388 -63807 -68819 -84569 -19750 -72228 -25793 139020 50274
20579E0274l9210K883m7330o8958K8376P0268k9196k8810j27708k4081J62106
$$ 50274 11064 13947 -33383 -102341 -73965 -3697 -32893 -61703 -189411 -213492 -51386
20568e1386L866J4884o8882P9661J21828j2101p2893j35850N3353J37275P6206
$$ -51386 -47520 -32636 -101518 -21857 99971 87870 14977 -120873 -67520 69755 145961
20557A45961P6274o2347N80K8344M1114j42175n6499j05397j61713j3520M951
$$ 145961 222235 159888 160468 188812 229926 87751 31252 -74145 -235858 -249378 -244427
20546b44427p5331N0715R5008K3489P8460P5049j17936j19568M4847K00059O8154
$$ -244427 -319758 -269043 -174035 -150546 -72086 2963 -114973 -234541 -189694 10365 78519
20535G8519o810J09956l7434o1874M0693p2933j53388p3504L9714Q5562r4952
$$ 78519 71709 181665 144231 82357 123050 50117 -103271 -176775 -137061 -51499 -146451
20524a46451r8101K6798O6566Q5298J0046N8751n4806j00500M6450J74572r5191
$$ -146451 -244552 -217754 -151188 -65890 -55844 2907 -51899 -152399 -105949 68623 -26568
20513b6568k11408l5654O294L4033Q3383n2195J63584J41207J46183q031j42817
$$ -26568 -237976 -273630 -267336 -233303 -149920 -202115 -38531 102676 248859 240828 98011
20502I8011j41062K3889Q7171N9494K3061j76421J1219Q7180J8296N2137l5667
$$ 98011 -43051 -19162 68009 127503 150564 -25857 -14638 72542 90838 142975 107308
20491A07308j06760j16340k11153j0297J55937n8474J8297Q4232R2064Q2346q5593
$$ 107308 548 -115792 -326945 -337242 -181305 -239779 -221482 -137250 -45186 37160 -48433
20480d8433j04765j1874q0833n9670M9670K6736Q2887R6036m0430j85118m7774
$$ -48433 -153198 -165072 -245905 -305575 -255905 -229169 -146282 -50246 -90676 -275794 -323568
20469c23568J09361O8395n1553O3963j9881O3291O7631k0288l2862l5036J7264
$$ -323568 -214207 -145812 -197365 -133402 -153283 -89992 -22361 -42649 -75511 -110547 -93283
20458i3283J01929q9204j40318k8117Q7218N5666j937m4286J14041R4406n4592
$$ -93283 8646 -80558 -220876 -248993 -161775 -106109 -108046 -152332 -38291 56115 1523
20447A523J8295N0724l4338l2852K3398p3837n5888P1500J23184j694l7167o9567
$$ 1523 19818 70542 36204 3352 26750 -47087 -102975 -31475 91709 90015 52848 -16719
20435a6719n9577K0692K14983J6637k0993j2082L5806o6617j11934P2718J65151
$$ -16719 -76296 -55604 159379 176016 155023 142941 178747 112130 196 72914 238065
20424B38065o2797O9347R5748P1222p4265q8482o2031j03118j31321J2181O6022
$$ 238065 175268 244615 340363 411585 337320 248838 186807 83689 -47632 -35451 30571
20413C0571m1656J498R696q2969r7110M3296J57123J37073J438j60952m8234J13375
$$ 30571 -11085 -9587 109 -82860 -179970 -136674 20449 157522 158960 -1992 -50226 63149
20401F3149J93162M5611j01790o6842j99093j03091j3247K5237O8532J99975R5887
$$ 63149 256311 301922 200132 133290 -65803 -168894 -182141 -156904 -88372 111603 207490
20390B07490l5260k43149j07136Q975N0550J45457k5756j01075Q4330R0277k7878
$$ 207490 172230 -70919 -178055 -169080 -118530 26927 1171 -99904 -15574 74703 46825
20379D6825n5880l9749J5356j03400r7536K9340L7204K4596K7544J18439m7164
$$ 46825 -9055 -48804 -33448 -136848 -234384 -205044 -167840 -143244 -115700 2739 -44425
20368d4425l2128l0231k1433l6571J42470L6143m4216J2430k9131j72918J91973
$$ -44425 -76553 -106784 -128217 -164788 -22318 13825 -30391 -17961 -47092 -220010 -28037
20357b8037Q5602N0191N3259j29060j02010l9314J0163Q4254q7694j40665P4885
$$ -28037 57565 107756 161015 31955 -70055 -109369 -99206 -14952 -102646 -243311 -168426
20346a68426J24326q9176m9435O5649M8700Q849J7767P5327K4509p0013K0659
$$ -168426 -44100 -133276 -182711 -117062 -68362 -59513 -41746 33581 58090 -11923 8736
20335H736r5042L1182L9027j09948j1631R7442J12152J20171n3040j40591P0520
$$ 8736 -86306 -55124 -16097 -126045 -137676 -40234 71918 192089 139049 -1542 68978
20324F8978m6688o4174j01409q2189J46221L1958M6444j9193k6813L5987q4826
$$ 68978 22290 -41884 -143293 -225482 -79261 -47303 -859 -20052 -46865 -10878 -95704
20313i5704L1657l634m5545P2967L8704m2920o3795p3253R7906j5051j9012M4963
$$ -95704 -64047 -67681 -113226 -40259 -1555 -44475 -108270 -181523 -83617 -98668 -117680 -72717
20301g2717J63650k3498n7130j2870L6910K3779R929m5707L0880K7229j44024
$$ -72717 90933 67435 10305 -2565 34345 58124 68053 22346 53226 80455 -63569
20290f3569l9597J3226R1431J27355K7388J927p9954j42299J3964J5479M4754
$$ -63569 -103166 -89940 1491 128846 156234 158161 78207 -64092 -50128 -34649 10105
20279A0105k7203O2092j8436J4369k2316k9774K1221K2000N6093k4494l7300K3360
$$ 10105 -17098 44994 26558 40927 18611 -11163 10058 32058 88151 63657 26357 49717
20267D9717J10517K9791j50198j4619j2499R4865O3008k19440l5969j7550m5014
$$ 49717 160234 190025 39827 25208 12709 107574 170582 -48858 -84827 -102377 -147391
20256a47391o0396K01300M8938r982N7224k6697k6657r7N7704J81692n5695K8555
$$ -147391 -207787 -6487 42451 32469 89693 62996 36339 36242 93946 275638 219943 248498
20244B48498q7477r47k4023n2964m4762n3602Q0832j14684n0960O7490N5435N1305
$$ 248498 161021 160074 136051 83087 38325 -15277 65555 -49129 -100089 -32599 22836 74141
20232G4141l223n32j01646l2960M5779k1256l6538k0779J28819J17618L8561j28644
$$ 74141 70918 70386 -31260 -64220 -18441 -39697 -76235 -97014 31805 149423 187984 59340
20220E9340n7629Q1710j839J2521J97802R7592j75431k52267j34764P7537K15779
$$ 59340 1711 83421 81582 94103 291905 389497 214066 -38201 -172965 -95428 120351
20209A20351N4180k16904p731J12231m0828K753j01941k29677j4105P0316J46007
$$ 120351 174531 -42373 -50104 62127 21299 24052 -77889 -307566 -321671 -251355 -105348
20198a05348K4088O6094o498m0478k7326Q6960j46882j56425R412J86176O2706
$$ -105348 -81260 -15166 -21664 -62142 -89468 -2508 -149390 -305815 -296403 -110227 -47521
20187d7521P7125N8854k02632p3844L4746j9544L4739J09258N3187P5250J2963
$$ -47521 29604 88458 -114174 -188018 -153272 -172816 -138077 -28819 24368 99618 112581
20176A12581O860r0173j54100k610J02099k1185o0200O736L6404p7635k47J02922
$$ 112581 119441 29268 -124832 -127442 -25343 -46528 -106728 -99992 -63588 -141223 -141470 -38548
20164c8548J76309J17161r1626p1293j04180K2577p14j61319q0982J47372J22123
$$ -38548 137761 254922 163296 92003 -12177 10400 9686 -151633 -232615 -85243 36880
20153C6880M7624m6692l2271N385M2093L5660P0072p6426m1511k939J4546J6831
$$ 36880 84504 37812 5541 10926 53019 88679 158751 82325 40814 37875 52421 69252
20141F9252j9492n0106q9596k6451j3256J2917M8455n1894o2182J06482J49672
$$ 69252 49760 -346 -89942 -116393 -129649 -116732 -68277 -120171 -182353 -75871 73801
20130G3801p7179k0777k5608M4335k5311p6715j62220p0580n7688J15120j4098
$$ 73801 -3378 -24155 -49763 -5428 -30739 -107454 -269674 -340254 -397942 -282822 -296920
20119b96920O107J42435K3720O5022K07373L4989k03248L4280P6956m9004j3106
$$ -296920 -290813 -148378 -124658 -59636 147737 182726 -20522 13758 90714 41710 28604
20108B8604N826m8361L1940k8100n1465j67169j47513m1747j096J44328J12054
$$ 28604 34430 -13931 18009 -10091 -61556 -228725 -376238 -417985 -419081 -274753 -162699
20097a62699K6504J26196Q5004q398p0849K5087J05016l2753k1264m7862j57897
$$ -162699 -136195 -9999 75005 66607 -4242 20845 125861 93108 71844 23982 -133915
20086a33915o5266q9596K4008K6715N8703o7644m4413l7637Q5537J10245M740
$$ -133915 -199181 -288777 -264769 -238054 -179351 -246995 -291408 -329045 -243508 -133263 -128523
20075a28523Q2449K10315O3233o8555j00658p6223J14609P8006j17310k7725N7147
$$ -128523 -46074 164241 227474 158919 58261 -17962 96647 174653 57343 29618 86765
20064H6765l6494k5610J51172M8087r7019r5963o4989q2810o6764R4399J60557
$$ 86765 50271 24661 175833 223920 126901 30938 -34051 -116861 -183625 -89226 71331
20053G1331l0970K9881O3021n5795N7537j00359m2925J14283J02498o4176m7406
$$ 71331 40361 70242 133263 77468 135005 34646 -8279 106004 208502 144326 96920
20042I6920q7313j3447r0455N3225q9222M2314N9564L967Q9036J5265o189n7248
$$ 96920 9607 -3840 -94295 -41070 -130292 -87978 -28414 -24447 64589 79854 73665 16417
20030A6417r7906J3568L1152L1974J4325p4910q5806n9986O9606R1399j53163
$$ 16417 -81489 -67921 -36769 -4795 9530 -65380 -151186 -211172 -141566 -50167 -203330
20019b03330M002M4488Q2228J2157L3012K15876N7270k9211n3793J1827k06520
$$ -203330 -199328 -154840 -72612 -60455 -27443 188433 245703 216492 162699 174526 -31994
20008c1994j24181J42283K9395q5382J3943K0263n1771N3249N2378K0238r632
$$ -31994 -156175 -13892 15503 -69879 -55936 -35673 -87444 -34195 18183 38421 28789
19997B8789l8160L6046k5054o7945L7234q8954j868Q0235J49976l2960j14567
$$ 28789 -9371 26675 1621 -66324 -29090 -118044 -119912 -39677 110299 77339 -37228
19986c7228M0439O816n1641K4166R8865p8671m0871n8879j1303l2919j0429O8137
$$ -37228 3211 10027 -41614 -17448 81417 2746 -38125 -97004 -108307 -141226 -151655 -83518
19974h3518m9769r1928l9876N5618J11320L6242l8357o8288M3659J18739N2111
$$ -83518 -133287 -225215 -265091 -209473 -98153 -61911 -100268 -168556 -124897 -6158 45953
19963D5953j05243R3498J64198m121p5993n7568J51581K3134j29524N9531r2660
$$ 45953 -59290 34208 198406 194285 118292 60724 212305 235439 105915 165446 72786
19952G2786m9746l3747j1310o6672j1435m4173q5562M9137J19265J47363n8054
$$ 72786 23040 -10707 -22017 -88689 -100124 -144297 -229859 -180722 -61457 85906 27852
19941B7852k30782n9792k8936J00615m1389j1423P3126J53088K07295N4934n2132
$$ 27852 -202930 -262722 -291658 -191043 -232432 -243855 -170729 -17641 189654 244588 192456
19930A92456k257J20781J00808p5612n3061k37957j27704k2936J8880K2109J8821
$$ 192456 190199 310980 411788 336176 283115 45158 -82546 -105482 -86602 -64493 -45672
19919d5672K3397J10975M3193p0600j119o3043O6024R0706r2q6061m9315L949
$$ -45672 -22275 88700 131893 61293 60174 -2869 63155 153861 153769 67708 18393 22342
19907B2342p5706j47429l9614j5377J7351R6176J35497O7461m7632p405l8199
$$ 22342 -53364 -200793 -240407 -255784 -238433 -142257 -6760 60701 13069 5664 -32535
19896c2535M5616J00048M6865p9310k0999l9196o6582l8149N6054m4041j6129
$$ -32535 13081 113129 159994 80684 59685 20489 -46093 -84242 -28188 -72229 -88358
19885h8358J18175j1747j84280J0966J48744l5369m5987O7255N5087J01083r8523
$$ -88358 29817 18070 -166210 -155244 -6500 -41869 -87856 -20601 34486 135569 37046
19874C7046m9626M0047r025j00702J9215L2041r1693J16447P4136k6091j20374
$$ 37046 -12580 27467 18442 -82260 -63045 -31004 -122697 -6250 67886 41795 -78579
19863g8579m5869J97255M7660p4492o0734q4437n2675j4966O6420J44245o5487
$$ -78579 -124448 72807 120467 45975 -14759 -99196 -151871 -166837 -100417 43828 -21659
19852b1659o7148N1288m0486L5354j1831L455J23965R7426N4921o8535m5690N0972
$$ -21659 -88807 -37519 -78005 -42651 -54482 -51027 72938 170364 225285 156750 111060 162032
19840A62032N6905L95q908r0080j33716n7997K3778q20O2504Q3249L256n8552
$$ 162032 218937 219332 210424 120344 -13372 -71369 -47591 -48411 14093 97342 100598 42046
19828D2046j18799j0948j8083R4495J10251l6534j70912K3968R8985n2388P3541
$$ 42046 -76753 -87701 -105784 -11289 98962 62428 -108484 -84516 14469 -37919 35622
19817C5622J54228K9187j31746p0770M9009P0954J9571j32382J7587J01931N8009
$$ 35622 189850 219037 87291 16521 65530 136484 156055 23673 41260 143191 201200
19806B01200J5669j7889o6899j04051o8730O3576L0119j02640m1536k6869K6567
$$ 201200 216869 198980 132081 28030 -40700 22876 52995 -49645 -91181 -118050 -91483
19795i1483m3082J02801N14K230n4427r5344Q4909J34971L2185r4725m950L8536
$$ -91483 -134565 -31764 -31250 -29020 -83447 -178791 -93882 41089 73274 -21451 -26401 12135
19783A2135j62548J32108J75043P0281j78392j49939N4630Q6587l9508R9518j5820
$$ 12135 -150413 -18305 156738 227019 48627 -101312 -46682 39905 397 99915 84095
19772H4095p5732J19688J5079j3724P9376n7558p4252m368O8823J50325M6770
$$ 84095 8363 128051 143130 129406 208782 151224 76972 72604 141427 291752 338522
19761C38522l5965n7353J03848j8875j73213o0969N6336J11695o2926k6940Q5938
$$ 338522 302557 245204 349052 330177 156964 95995 152331 264026 201100 174160 260098
19750B60098N1509Q1046m7181P9752l0449K6141N9642n5570N4388K5613J49154
$$ 260098 311607 392653 345472 425224 394775 420916 480558 424988 479376 504989 654143
19739F54143K24212J8989j88216k33229j5563m7826l9565j02898m9677j66487
$$ 654143 878355 897344 709128 475899 460336 412510 372945 270047 220370 53883
19729E3883k4315N5329J70631P3949m7300p5110r781k2875q8446K9963p9599o883
$$ 53883 29568 84897 255528 329477 282177 207067 197286 174411 85965 115928 36329 29446
19717B9446O2462l6016m6704m0928l1067J3928M9034N7746N3591J01995n6621
$$ 29446 91908 55892 9188 -31740 -62807 -48879 155 57901 111492 213487 156866
19706A56866j95310N3361J68004J8345q5847j60794m9024K691J779o102N2657
$$ 156866 -38444 14917 182921 201266 115419 -45375 -94399 -91708 -89929 -96031 -43374
19695d3374M6664p0398O9288Q9110p1222j7760J21277r0653N1897r3755j68869
$$ -43374 3290 -67108 2180 91290 20068 2308 123585 32932 84829 -8926 -177795
19684a77795O330N8884J18970j7112k8395J00191K6291P0241o7068k1657J17574
$$ -177795 -171465 -112581 6389 -10723 -39118 61073 87364 157605 90537 68880 186454
19673A86454j1803m069m1489l1845q1706L9469J196l8298l6817L328K4851n5283
$$ 186454 174651 170582 129093 97248 15542 55011 56207 17909 -18908 -15580 9271 -46012
19661d6012k7382J13003R862L8040p9228J03680K19848J6569J5061j65407k26266
$$ -46012 -73394 39609 49471 87511 8283 111963 331811 348380 363441 198034 -28232
19650b8232l2585o2422j6550J78948J34018j6506L0773k0847k9578O4769J9154
$$ -28232 -60817 -123239 -139789 39159 173177 156671 187444 166597 137019 201788 220942
19639B20942j07258j43895j05671L0172Q9072K6218J07924j3630Q107Q9239p1135
$$ 220942 113684 -30211 -135882 -105710 -16638 9580 117504 103874 111981 201220 130085
19628A30085p2667n108K5486M4396K5358J6796O9337J38005K58656P2921O120
$$ 130085 57418 52310 77796 122192 147550 164346 233683 371688 630344 703265 709385
19617G09385K16083J63790J50123L7498k6928k4685j69616r7680p2426j02413
$$ 709385 925468 1089258 1239381 1276879 1249951 1225266 1055650 957970 885544 783131
19607G83131J6575j69231j81960j15252q0090o120M0360j3292q2159n8680M3519
$$ 783131 799706 630475 448515 333263 253173 247053 287413 274121 191962 133282 176801
19596A76801l9796j18566o1459J58758J33223r433n8605k5703K07985O1363r5541
$$ 176801 137005 18439 -43020 115738 248961 239528 180923 155220 363205 424568 329027
19585C29027j47704r5134j66824L0867P8207M4970j9706K1114K0724J75255P5107
$$ 329027 181323 86189 -80635 -49768 28439 73409 53703 74817 95541 270796 345903
19574C45903n6549p5752O4552l8996R0230R4821n6778L7247Q4334Q4026J10803
$$ 345903 289354 213602 278154 239158 329388 424209 367431 404678 489012 573038 683841
19563F83841K07639K42843J18520R6921O313j58569j06624l1881j25251j79435
$$ 683841 891480 1134323 1252843 1349764 1356077 1197508 1090884 1059003 933752 754317
19553G54317j49805q3182j06025o3511J482m8213k10818o1529L24L268M8416m0167
$$ 754317 604512 521330 415305 351794 353276 305063 94245 32716 33040 36308 84724 44557
19541D4557j9009m0433o498K06499R4864k19832j26286n329J75315J23762R5078
$$ 44557 25548 -14885 -21383 185116 279980 60148 -66138 -71467 103848 227610 322688
19530C22688q5647j9213L5756K8837J13919O276r1587j04299j38357J01284P9449
$$ 322688 237041 217828 253584 282421 396340 402616 311029 206730 68373 169657 249106
19519B49106l5524L0020j178J9817q3312K4612J07479J39358L5481j01118M8931
$$ 249106 213582 243602 242424 262241 178929 203541 311020 450378 485859 384741 433672
19508D33672J99539K25943J28094J41873K15077O7822j08938J250J79195J37135
$$ 433672 633211 859154 987248 1129121 1344198 1412020 1303082 1304332 1483527 1620662
19498A620662l2528l3725j43727J1405J6235r435J4545j51934j40941L6483k0906
$$ 1620662 1588134 1554409 1410682 1422087 1438322 1428887 1443432 1291498 1150557 1187040 1166134
19487A166134o4447k03368j40859j42781j6737J6662j13875O3234o7351j73863
$$ 1166134 1101687 898319 757460 614679 597942 614604 500729 563963 496612 322749
19477C22749l2919m4526p0075j93861n2773J1232J35095J03773K1348n8832j807
$$ 322749 289830 245304 175229 -18632 -71405 -60173 74922 178695 200043 141211 139404
19466A39404L4497k2282J82260l1563r5708p9016J01078J7282Q9664k7932j5941
$$ 139404 173901 151619 333879 302316 206608 127592 228670 245952 335616 307684 291743
19455B91743q0603m9514j10057K8883J69555m344k3649q0127J47539l7416M945
$$ 291743 211140 161626 51569 80452 250007 245663 222014 141887 289426 252010 256955
19444B56955K6915p8984j76649o2350q904P5501J51550O3640k4884j37478M2298
$$ 256955 283870 204886 28237 -34113 -43017 32484 184034 247674 222790 85312 127610
19433A27610k3374j9163j37545p8551Q6975L5918l1354l5107M3844J48437P0975
$$ 127610 104236 85073 -52472 -131023 -44048 -8130 -39484 -74591 -30747 117690 188665
19422A88665J5156j90989j3129R801m7587O4355N0637P6722J24459K3699m9187
$$ 188665 203821 12832 -297 9504 -38083 26272 76909 153631 278090 301789 252602
19411B52602m4470J02455N7377K1831n1630j61745N1933q767p9890M0514Q8560
$$ 252602 208132 310587 367964 389795 338165 176420 228353 219586 139696 180210 268770
19400B68770Q094q5875j68165j63130N0980L4744N3037O5751L8877p6829M5097
$$ 268770 276864 190989 22824 -140306 -89326 -54582 -1545 64206 103083 26254 71351
19389G1351L5257j2395J25033J08037o6845q9354N832j40560m2709R2282N8303
$$ 71351 106608 94213 219246 327283 260438 171084 176916 36356 -6353 85929 144232
19378A44232O0987L8332r5191o836P1281L9547l2839l9248K2942Q942l2261r6173
$$ 144232 205219 243551 148360 141524 212805 252352 219513 180265 203207 212149 179888 83715
19366H3715o9508j09918Q4832n2654J02806M0788J3814J33411K5220o8804J0151
$$ 83715 14207 -95711 -10879 -63533 39273 80061 93875 227286 252506 183702 193853
19355A93853k4735J5897J93136R4860j3970k16988q0532P421j09941m6672K9142
$$ 193853 169118 185015 378151 473011 459041 242053 161521 168942 59001 12329 41471
19344D1471k5421q496J15747L5365p701Q8377N0291k3802O3596o2770q7688k0853
$$ 41471 16050 7554 123301 158666 150965 239342 289633 265831 329427 266657 178969 158116
19332A58116P5655m1022R1523K6496j49798m8303p814j08920Q0052J09791q2338
$$ 158116 233771 192749 284272 310768 160970 112667 104853 -4067 75985 185776 103438
19321A03438q6774p3885l274J11760J94109P3088l6777p8515q9125q3288k8101
$$ 103438 16664 -57221 -60495 51265 245374 318462 281685 203170 114045 30757 2656
19310B656k3228j4250M9061N9088M7939L6547p124L8461N8555k3420K1068k9511
$$ 2656 -20572 -34822 14239 73327 121266 157813 150689 189150 247705 224285 245353 215842
19298B15842O359o1699K146J2537j58137k134J7051L5584J27957j220M3446J904
$$ 215842 222201 160502 162648 175185 17048 14914 31965 67549 195506 194286 237732 239636
19286B39636J60927q8943n6220r2858N8058l6787j20874o4583O6355K23368Q9902
$$ 239636 400563 311620 255400 162542 220600 183813 62939 -1644 64711 288079 377981
19275C77981k3029o8093m8829m3224J8752M9524q1258O7594J18605m5232o3130
$$ 377981 354952 286859 238030 194806 213558 263082 181824 249418 368023 322791 259661
19264B59661J107j92949n3235K10566Q6692K4936L2577m9495j9553P007n692N2069
$$ 259661 260768 67819 14584 225150 311842 336778 369355 319860 300307 307314 301622 353691
19252C53691j9711Q0728j28735L3907N112N5385N6484o8546j94985j8761N1019
$$ 353691 333980 414708 285973 319880 324992 380377 436861 368315 173330 154569 205588
19241B05588R9912N6725J7524j7960n863J72418M6427J0568j2665m0445R693j8057
$$ 205588 305500 362225 379749 361789 355926 528344 574771 585339 572674 532229 541922 523865
19229E23865j62940j50347m4348K95026K31626o3844q9691O9602J55753k2696
$$ 523865 360925 210578 166230 461256 692882 629038 539347 608949 764702 742006
19219G42006j19434k40129j38826k4707J75378K7493j14286L178O1573O2078K4078
$$ 742006 622572 382443 243617 218910 394288 421781 307495 310673 372246 434324 458402
19208D58402K7718N1010m8604j87963q873K0809M1416j483j3526l2781r3492N2087
$$ 458402 486120 537130 488526 300563 291690 312499 353915 352432 338906 306125 212633 264720
19196B64720R5031o5525j12728R2463J00261J45644M6726k5754J4755L4398P5562
$$ 264720 359751 294226 181498 273961 374222 519866 566592 540838 555593 589991 665553
19185F65553j16126j27285J53579J32580N5719o8156k2998J7238K5240M1717L9923
$$ 665553 549427 422142 575721 708301 764020 695864 672866 690104 715344 757061 796984
19174G96984J32503R8272R362J24639j4543O6498O0122q6317J763n5807p3540
$$ 796984 929487 1027759 1037121 1161760 1147217 1213715 1273837 1187520 1189283 1133476 1059936
19163A059936L880K7178r0546n8623M7004n576Q82O3255J76734k4651k6821J08820
$$ 1059936 1063816 1090994 1000448 941825 988829 983253 984135 1047390 1224124 1199473 1172652 1281472
19151A281472m249j166P4994p4639q4375P2582J88096O416q4747L1566J10794
$$ 1281472 1277223 1276057 1351051 1276412 1192037 1264619 1452715 1459131 1374384 1405950 1516744
19140A516744K76840J78480R642J19092J09463K31588Q8058K02839K96599K13961
$$ 1516744 1793584 1972064 1981706 2100798 2210261 2441849 2529907 2732746 3029345 3243306
19130C243306K63187M66004L53367L58886K76828L01228O97997O75883N85512
$$ 3243306 3506493 3972497 4325864 4684750 4961578 5262806 5960803 6636686 7222198
19121G222198P28125Q10145P97162R41742J124021J334246J576511J970630K778302
$$ 7222198 7950323 8760468 9557630 10499372 11623393 12957639 14534150 16504780 19283082
19112A9283082L627331M893093P165489J1040391J6347405K0482984K2305919
$$ 19283082 22910413 27803506 34968995 46009386 62356791 82839775 105145694
19105A05145694K0376680J7374636J8551220J8854790J6768398O397471o337152
$$ 105145694 125522374 142897010 161448230 180303020 197071418 203468889 197131737
19098A97131737j3571580j6801509j6026346j8557350k2014096k3092133k1595236
$$ 197131737 183560157 166758648 150732302 132174952 110160856 87068723 65473487
19091F5473487j6613665j1507445p555653m962297l348206k365502j785059j454218
$$ 65473487 48859822 37352377 29796724 24834427 21486221 19120719 17335660 15881442
19083A5881442j218816r06892m32255p8876J74711Q9020o0551j24945J769l71893
$$ 15881442 14662626 13755734 13323479 13244603 13419314 13508334 13447783 13322838 13324607 12952714
19073A2952714m06730m82287m73641j45895J63968J39081L12671O34360Q85209
$$ 12952714 12545984 12063697 11590056 11444161 11608129 11747210 12059881 12694241 13579450
19064A3579450J363472J649049J910521K722670L633724M723973O599604R888160
$$ 13579450 14942922 16591971 18502492 21225162 24858886 29582859 36182463 46070623
19056D6070623J5197912K0906727K4177711K4484019K0757192K0663667K2370831
$$ 46070623 61268535 82175262 106352973 130836992 151594184 172257851 194628682
19049A94628682K1663808J4373318q87462j1945022j7486474j7768504j8322053
$$ 194628682 216292490 230665808 229778346 217833324 200346850 182578346 164256293
19042A64256293k3558444k6579857k7198639k2973167j6712067j1251084p198333
$$ 164256293 140697849 114117992 86919353 63946186 47234119 35983035 28784702
19035B8784702m408901k690967j477685n98377k99680k45081l48369j23381N9562
$$ 28784702 24375801 21684834 20207149 19608772 19309092 19064011 18715642 18592261 18651823
19026A8651823M4087J7759j88848r5005L06246N24375N64310O63171J114690J616904
$$ 18651823 18695910 18713669 18524821 18429816 18736062 19260437 19824747 20487918 21602608 23219512
19016B3219512K119149L044556M315373N907935Q659990J2648058J6209153J7232018
$$ 23219512 25338661 28383217 32698590 38606525 47266515 59914573 76123726 93355744
19008I3355744J6960404J8847918K4161352K6955808K1766508J2091611P260630
$$ 93355744 110316148 129164066 153325418 180281226 202047734 214139345 221399975
19001B21399975J0451144J3995750R654173j5063o355026k949780N110752O476671
$$ 221399975 231851119 245846869 255501042 255485979 249130953 246181173 251291925 257768596
18993B57768596j791633j1447593j3846508j0000330r489832j5982370k3776025
$$ 257768596 255976963 244529370 230682862 220682532 211192700 195210330 171434305
18986A71434305k6234990k3017815j9560625j7937857j6837489j4587170j1344790
$$ 171434305 145199315 122181500 102620875 84683018 67845529 53258359 41913569
18979D1913569p818028n029269l619405k906541k250566j569513j007651j251726
$$ 41913569 34095541 29066272 25446867 22540326 20289760 18720247 17712596 16460870
18971A6460870j529051j252600j080807q58036r70662r90465j099979r04279p36866
$$ 16460870 14931819 13679219 12598412 11740376 10769714 9779249 8679270 7774991 7038125
18962G038125p29808p19646o94634m14304k45048k76564m31496k34201l20709
$$ 7038125 6308317 5588671 4894037 4479733 4234685 3958121 3526625 3292424 2971715
18953B971715j82767K5352m1326k17010l53112j72343j32451o6329J1997l7160
$$ 2971715 2788948 2814300 2772974 2555964 2202852 2030509 1898058 1831729 1843726 1806566
18943A806566j64334o4979k6543M0525k365M952k2857j13191L9887j00562j62423
$$ 1806566 1642232 1577253 1550710 1591235 1588870 1593822 1570965 1457774 1497661 1397099 1234676
18932A234676q2816L3650J20059j16935j2651J4528j4331o3505L7740J25386K3874
$$ 1234676 1151860 1185510 1305569 1188634 1175983 1190511 1176180 1112675 1150415 1275801 1299675
18921A299675j03093j55459j10373j5783L1596n7857j8056O0445n7098k3298j44351
$$ 1299675 1196582 1041123 930750 914967 946563 888706 870650 931095 873997 850699 706348
18910G06348J45277P8705k60275r9542n0280L7934N4601r1439m372R8164N5593
$$ 706348 851625 930330 670055 570513 520233 558167 612768 521329 516957 615121 670714
18899F70714N1209k7884q6382j58348p1259O5018M2771L5849o0868m6817l3937
$$ 670714 721923 694039 607657 449309 378050 443068 485839 521688 460820 414003 380066
18888C80066O5359J10799o5565q7153q481r5481j08837K0482n469Q9366J3551
$$ 380066 445425 556224 490659 403506 395025 299544 190707 211189 205720 295086 308637
18877C08637Q3816k57094n7833O8157N4890J13187J52114n0748q1919j0784J14954
$$ 308637 392453 135359 77526 145683 200573 313760 465874 415126 333207 322423 437377
18866D37377M2666K7351M6315o9076q9345L5836M3147L0014M1088j0489J21398
$$ 437377 480043 507394 553709 484633 395288 431124 474271 504285 545373 534884 656282
18855F56282k9425j07086j09009j03539o7288J83920K16032q8451j15549n9445
$$ 656282 626857 519771 410762 307223 239935 423855 639887 551436 435887 376442
18845C76442M1412P5553K89278R8819j27194j95210j32627j29893j9140J28973
$$ 376442 417854 493407 782685 881504 754310 559100 426473 296580 277440 406413
18835D06413k1004M465Q628j05885r4498M1128J4210M8579M739r9334L1094J72770
$$ 406413 385409 389874 398502 292617 198119 239247 253457 302036 306775 207441 238535 411305
18823D11305J42606n8273o2755r3238m8232L1878J5093q0285j4518N6084q0637
$$ 411305 553911 495638 432883 339645 291413 323291 338384 258099 243581 299665 219028
18812B19028j3450j43634o9810J91004J07058j5010N383o88K008K1644P4816o1131
$$ 219028 205578 61944 -7866 183138 290196 275186 280569 279881 281889 303533 378349 317218
18800C17218l1262J24645l7023l7096K31167K14539J39914R3882L8433J65178
$$ 317218 285956 410601 373578 336482 567649 782188 922102 1015984 1054417 1219595
18790A219595J48865L2402r6922j07543q4676j84956l8303O8293O1503O2060K64795
$$ 1219595 1368460 1400862 1303940 1196397 1111721 926765 888462 956755 1018258 1080318 1345113
18779A345113J85270N9822k0769r9387O8157J9548J42307J98286j48932r0954
$$ 1345113 1530383 1590205 1569436 1470049 1538206 1557754 1700061 1898347 1749415 1658461
18769A658461J29795L21274N02509L65089m48403n22934m16460m41913k88356
$$ 1658461 1788256 2109530 2612039 2977128 2528725 2005791 1589331 1147418 859062
18760H59062j11098j09425Q13M2650j32395o7551r9682l0974o9049J31554R3588
$$ 859062 747964 638539 639352 682002 549607 482056 382374 351400 282351 413905 507493
18749E07493k3851J54041N4901j05676l6705M0725J76605J83282K22119L24929
$$ 507493 483642 637683 692584 586908 550203 590928 767533 950815 1172934 1497863
18739A497863L76484J57985J13332L6243N0005j08536q7990k07620l22343k11651
$$ 1497863 1874347 2032332 2145664 2181907 2231912 2123376 2035386 1827766 1505423 1293772
18729A293772Q1628r6683j99372j41105q9210l9677m4886o3373j40881j09895
$$ 1293772 1375400 1278717 1079345 938240 849030 809353 764467 701094 560213 450318
18719D50318m3925J8885Q2072j8879j10632n1677k06219R536J82957J77026l850
$$ 450318 406393 425278 507350 488471 377839 326162 119943 129479 312436 489462 485612
18708D85612O9483Q3701o093p7069j4684p7518m9664p5896Q4503J8630J1231n1275
$$ 485612 555095 638796 632703 555634 540950 463432 413768 337872 422375 441005 452236 400961
18696D00961k00142k4090Q0155P5562o58j8917N467N1380J30389N2993j17694
$$ 400961 200819 176729 256884 332446 331788 312871 318338 369718 500107 553100 435406
18685D35406L4745N23j53336q8554J0813M0474o0189j45657j02903j6439M3475
$$ 435406 470151 470674 317338 228784 239597 280071 219882 74225 -28678 -45117 -1642
18674a642K17467J13948J59661J1834Q780L5060p8348K5926P890j48587n3033
$$ -1642 215825 329773 489434 501268 510048 545108 466760 492686 500576 351989 298956
18663B98956J10109r344K2518p4436m5254k1845j8046l6608k2547N9897J00788
$$ 298956 409065 399721 422239 347803 302549 280704 262658 226050 203503 263400 364188
18652C64188L5741P904k7755j7605M3706M5312j48095j56244p4114J44564j4943
$$ 364188 399929 407833 380078 362473 406179 451491 303396 147152 73038 217602 202659
18641B02659Q4299P2663K616K5095k5305N6425k0470j0163N2685m9034K0618j15768
$$ 202659 286958 359621 362237 387332 362027 418452 397982 387819 440504 391470 412088 296320
18629B96320k2534p2407K0080P188j5193M9790P0295J0710j25969k0980l4759
$$ 296320 273786 201379 221459 228647 213454 263244 333539 344249 218280 197300 162541
18618A62541P0756J77081j380q2075l8792j05988L7175J6799N604n1298p2705
$$ 162541 233297 410378 408998 326923 288131 182143 219318 236117 241721 190423 117718
18607A17718q5467L4996J59884M9089j24939O1114Q4014r677j03483J26783J78476
$$ 117718 32251 67247 227131 276220 151281 212395 296409 286732 183249 310032 488508
18596D88508K200R798K2454l1598R8101J51279J75048J35385L0670o9843J40129
$$ 488508 490708 500506 522960 491362 589463 740742 915790 1051175 1081845 1012002 1152131
18585A152131Q6643M7036n0101j84754o2954j8879J76413j4114j22782q3999j40352
$$ 1152131 1238774 1285810 1235709 1050955 988001 969122 1145535 1131421 1008639 924640 784288
18574G84288P2088m9083M9726R108P888N6581r233N0645P8398q3733k12551k82752
$$ 784288 856376 807293 857019 866127 874015 930596 921363 972008 1050406 966673 754122 471370
18562D71370j23410q0861J3263K3839j49492J92860J42790q4445j21781Q9432
$$ 471370 347960 267099 280362 304201 154709 347569 490359 405914 284133 373565
18552C73565J35015L2740j25020m4955J40454O795J7817K05750K05808l1538J9175
$$ 373565 508580 541320 416300 371345 511799 518594 536411 742161 947969 916431 935606
18541I35606J36002R2728J09785J17621K59012J32967J24557M2626R7876K60834
$$ 935606 1071608 1164336 1274121 1391742 1650754 1783721 1908278 1950904 2048780 2309614
18531B309614J04964j02310j08842k38369q1067r6182j79577n3820r0025q9909
$$ 2309614 2414578 2312268 2203426 1965057 1883990 1787808 1608231 1554411 1464386 1374477
18521A374477j38385r9852N7711P6698o2158p5644k3135q2297q9175L4034K55286
$$ 1374477 1236092 1136240 1193951 1270649 1208491 1132847 1109712 1027415 938240 972274 1227560
18510A227560K5721J1241r8353M0991J29149J90592K39282J73400R667P7506J30639
$$ 1227560 1253281 1264522 1166169 1207160 1336309 1526901 1766183 1939583 1949250 2026756 2157395
18499B157395J80889K81583J09057O9353J55661J10524K30825R4673J1190K05829
$$ 2157395 2338284 2619867 2728924 2798277 2953938 3064462 3295287 3389960 3401150 3606979
18489C606979K72975J81266K55504K62124L54276K55666J60612R4837L3333O0777
$$ 3606979 3879954 4061220 4316724 4578848 4933124 5188790 5349402 5444239 5477572 5538349
18479E538349j49647l99010k46710j31452P2645L99368M89541P86872J215853
$$ 5538349 5388702 4989692 4742982 4611530 4684175 5083543 5573084 6359956 7575809
18470G575809J378567J427596J319990J273586J023337R52549J110771J702875
$$ 7575809 8954376 10381972 11701962 12975548 13998885 14951434 16062205 17765080
18462A7765080K465242L290863M475406N965304P598411J0610835J6968051K9334989
$$ 17765080 20230322 23521185 27996591 33961895 41560306 52171141 69139192 98474181
18454I8474181M6533148N1691558L3233540J5165067P964022j3218992m1294138
$$ 98474181 145007329 196698887 229932427 245097494 253061516 239842524 198548386
18447A98548386n0661582m4184124l2449484k0603750j2374068p726220n048864
$$ 198548386 147886804 103702680 71253196 50649446 38275378 30549158 25500294
18440B5500294l130516j750286p59336J83624Q97205J271710J160417O35059M82778
$$ 25500294 22369778 20619492 19860156 20043780 20940985 22212695 23373112 24008171 24490949
18431B4490949M50671O28413J068140K082701L341218M902318O834223Q876240
$$ 24490949 24941620 25570033 26638173 28720874 32062092 36964410 43798633 52674873
18423E2674873J2127199J8243061L0728397N2053527P0641478N9863978L0304747
$$ 52674873 64802072 83045133 113773530 165827057 236468535 296332513 326637260
18416C26637260J5759213q34622l9356306o7375786o7353440n3601898l6342284
$$ 326637260 342396473 341561851 302205545 234829759 167476319 113874421 77532137
18409G7532137k2394013j3592108q773214o031372m156996k724820j900648j439448
$$ 77532137 55138124 41546016 32772802 26741430 22584434 19859614 17958966 16519518
18401A6519518j210683j161025j153550j187598j138299j164908r89169j048027
$$ 16519518 15308835 14147810 12994260 11806662 10668363 9503455 8514286 7466259
18393G466259q07287n22409m15119l85066p569M9918L798j68896j25001j67989
$$ 7466259 6658972 6136563 5721444 5336378 5328809 5378727 5382525 5213629 5088628 4920639
18383D920639l80724m98027m28130k61468k83230l36132j83353j83368j00987
$$ 4920639 4539915 4041888 3613758 3352290 3069060 2732928 2549575 2366207 2265220
18374B265220j0368j91204L2549j69185m3027n5997j8982P9169J42530J05833
$$ 2265220 2254852 2063648 2096197 1927012 1883985 1827988 1809006 1888175 2030705 2136538
18364B136538M3066J31165j5813N3445O1860M4815k5271J0305o9807k6798o0060
$$ 2136538 2179604 2310769 2294956 2348401 2410261 2455076 2429805 2440110 2370303 2343505 2283445
18353B283445N6771l0850o1338j19534j10424P277q1048j39324P5611J3426j11075
$$ 2283445 2340216 2309366 2248028 2128494 2018070 2025347 1944299 1804975 1880586 1894012 1782937
18342A782937j37499l0589J27439J07479J21634L4931k3573j24647j5590N8060
$$ 1782937 1645438 1614849 1742288 1849767 1971401 2006332 1982759 1858112 1842522 1900582
18332A900582J77769K75047K03528K07764J78923J78215K56122K76524L90473
$$ 1900582 2078351 2353398 2556926 2764690 2943613 3121828 3377950 3654474 4044947
18323D044947J76658L7810J90551P1849L0158J95161K87121L63254K52376K92288
$$ 4044947 4221605 4259415 4449966 4521815 4551973 4747134 5034255 5397509 5649885 5942173
18313E942173M24381L44622L87856M28320O13420P37848Q68238R85757J432086
$$ 5942173 6366554 6711176 7099032 7527352 8140772 8878620 9746858 10732615 12164701
18304A2164701J917890K247735K670995L451607M576869O263121R346432J3354452
$$ 12164701 14082591 16330326 19001321 22452928 27029797 33292918 42639350 55993802
18296E5993802J5439768J6412369K0606608K0828748J1269755O179791N522989
$$ 55993802 71433570 87845939 108452547 129281295 140551050 146730841 152253830
18289A52253830l531147j0480325p347639l829972k691589J336746Q846538Q720692
$$ 152253830 148722683 138242358 130894719 127064747 124373158 125709904 134556442 143277134
18281A43277134P55304n25144k758702j3227116j8560038j7622576j7629018j6458845
$$ 143277134 144032438 143507294 140748592 127521476 108961438 91338862 73709844 57250999
18273E7250999j2896110r466936o631771m232806k648895j703232j124334o64526
$$ 57250999 44354889 34887953 28256182 24023376 21374481 19671249 18546915 17882389
18265A7882389l72420m17163o1115L99025N70683M09447O56527O61408O24649
$$ 17882389 17509969 17092806 17031691 17430716 18001399 18410846 19067373 19728781 20353430
18256B0353430P48803R87505J328549J803368K530192L252951M255882N374230
$$ 20353430 21102233 22089738 23418287 25221655 27751847 31004798 35260680 40634910
18248D0634910P155224R662406J3075607J8544446K4972652L2467341M7945613
$$ 40634910 47790134 57452540 70528147 89072593 114045245 146512586 194458199
18241A94458199O9304015O9330168M3870166J6035142q632358j1393452J836349
$$ 194458199 263762214 333092382 376962548 392997690 384365332 372971880 374808229
18234C74808229L51876j9386965m3894002m7724440l5840656k8533271k1029737
$$ 374808229 375160105 355773140 311879138 264154698 228314042 199780771 178751034
18227A78751034j2404457j4543890k0573901j9690152j8140052j7262551j4269937
$$ 178751034 166346577 151802687 131228786 111538634 93398582 76136031 61866094
18220F1866094j0785923p400263m905000k778540j184148j03775P09913J504430
$$ 61866094 51080171 43679908 38774908 35996368 34812220 34708445 35418358 36922788
18212C6922788K672649M071438O087877R685937J6720199K8761496L9345982L4744327
$$ 36922788 39595437 43666875 49754752 59440689 76160888 104922384 144268366 179012693
18204A79012693J7606207k184801q571119K169630O202351l569987k1796984l7223828
$$ 179012693 196618900 194434099 185862980 188032610 194234961 190664974 168867990 131644162
18196A31644162l6868133k8663357j9314742j1824280p285902m797351l295443
$$ 131644162 94776029 66112672 46797930 34973650 27687748 22890397 19594954
18189A9594954k533180j918080j284645r27687p48943n55377p00555o16180m61087
$$ 19594954 17061774 15143694 13859049 12931362 12182419 11627042 10926487 10310307 9849220
18180I849220l29076k26779l43779o02378o08030n67612k63966l06685n97602
$$ 9849220 9520144 9293365 8949586 8347208 7739178 7171566 6907600 6600915 6003313
18171F003313l30113l44253l15910j87687j11951j22285r0053J11191K29576L49580
$$ 6003313 5673200 5328947 5013037 4825350 4713399 4591114 4501061 4612252 4841828 5191408
18161E191408N44645N11143N40945O90112J365958K368968L903309M754281M063810
$$ 5191408 5736053 6247196 6788141 7478253 8844211 11213179 15116488 19870769 23934579
18152B3934579K582203R89070m32092j383345j589998j875247k711643l027657
$$ 23934579 26516782 27505852 27073760 25690415 24100417 22225170 19513527 16485870
18144A6485870k935103k834142k112844j369093q21537n33812m76078j97435k26944
$$ 16485870 13550767 10716625 8603781 7234688 6413151 5879339 5403261 5205826 4978882
18135D978882j82989p0340m7816l8928k3571J8268K21392M26794L82637K66650
$$ 4978882 4795893 4725553 4677737 4638809 4615238 4633506 4854898 5281692 5664329 5930979
18125E930979L07482O26957P87555R08897J240049J822074K535318L063797L556523
$$ 5930979 6238461 6865418 7652973 8561870 9801919 11623993 14159311 17223108 20779631
18116B0779631M191278N080061O417715Q598470J2992038K3338900M6237974Q1865722
$$ 20779631 24970909 30050970 36468685 45067155 58059193 81398093 127636067 209501789
18108B09501789P1166296j6947861o2432997o3536994n1440608l1249206j7049094
$$ 209501789 280668085 263720224 201287227 137750233 86309625 55060419 38011325
18101C8011325r791934o302519m301927l091577k172740j570729j299733j110960
$$ 38011325 28219391 21916872 17614945 14523368 12350628 10779899 9480166 8369206
18093H369206r55855p51473n59615o94481o40591m82677l94871k08959k34325
$$ 8369206 7413351 6661878 6102263 5407782 4767191 4284514 3889643 3680684 3446359
18084C446359k80304j72952l20085k90241r6655j76478m8328K8105k63091j54374
$$ 3446359 3166055 2993103 2673018 2382777 2286122 2109644 2061316 2089421 1826330 1671956
18074A671956P868j4981j88137j06342j29617p7323l7644l1392j08860l9581P7065
$$ 1671956 1679824 1664843 1476706 1370364 1240747 1163424 1125780 1094388 985528 945947 1023012
18063A023012L0687q9067o1502J8024j699N2527Q8189j00946l6364k9071K3039
$$ 1023012 1053699 964632 903130 921154 919455 971982 1060171 959225 922861 893790 916829
18052I16829P9788j19419j35479j38334J0337l2305r890k0331P523J03648R5484
$$ 916829 996617 877198 741719 603385 613722 581417 571527 551196 558719 662367 757851
18041G57851j47410N4375O407j59902m3677l1014L9486J48212R1764K3023k23593
$$ 757851 610441 664816 671223 511321 467644 436630 476116 624328 716092 739115 515522
18030E15522K701L6681N4923r1262o7767l6608L3138K6795O639J06558P1356r7039
$$ 515522 518223 554904 609827 518565 450798 414190 447328 474123 480762 587320 658676 561637
18018E61637n2789O1640J9768j74436P3700o3290r5830L8460l5160p918k4266
$$ 561637 508848 570488 590256 415820 489520 426230 330400 368860 333700 325782 301516
18007C01516N965n252J52349P2299R6343K20031J41501J40866q1211j90699j33382
$$ 301516 307481 302229 454578 526877 623220 843251 984752 1125618 1044407 853708 720326
17996G20326j26610K2520L1605M5187Q2495R7193L8162p556J6328k01066k83014
$$ 720326 593716 616236 647841 693028 775523 872716 910878 903322 919650 718584 435570
17985D35570r3161j34863j15267K59043J47599N7617L1398j06279j77386R811
$$ 435570 342409 207546 92279 351322 498921 556538 587936 481657 304271 314082
17975C14082J65521O1804l5815P4245o7488j54435j17573n7246Q3346J66154p3369
$$ 314082 479603 541407 505592 579837 512349 357914 240341 183095 266441 432595 359226
17964C59226j01602R235j7591n3198J77721p5908n7071J24938k4847j43834K607
$$ 359226 257624 266859 249268 196070 373791 297883 240812 365750 340903 197069 199676
17953A99676M8107j65194o0079R6675Q8787L7181k0355j19025M8228r5587J4059
$$ 199676 247783 82589 22510 119185 207972 245153 224798 105773 154001 58414 72473
17942G2473J44189L8089j09574n0365Q957J29090j4160l0705J97266N6412o9421
$$ 72473 216662 254751 145177 94812 103769 232859 218699 187994 385260 441672 372251
17931C72251p2884K9019l8287Q7427R9903K6535j39489j84165n5643J00326J30809
$$ 372251 299367 328386 290099 377526 477429 503964 364475 180310 124667 224993 355802
17920C55802L7150j17285r3702P5750M2059o8072p7543M6339J04527k4490M7667
$$ 355802 392952 275667 181965 257715 299774 231702 154159 200498 305025 280535 328202
17909C28202N7428L6532q395J03163k9113j46143j48057K4902r0299n5648P2523
$$ 328202 385630 422162 413767 516930 487817 341674 193617 218519 128220 72572 145095
17898A45095j8448L3298R935L4860m3806o719m5158o8079l6750J22860J55112
$$ 145095 126647 159945 169880 204740 160934 154215 109057 40978 4228 127088 282200
17887B82200m3427j29233k742k1593q735K6135P0318M4361L2488M6420j33194
$$ 282200 238773 109540 106798 85205 76470 102605 172923 217284 249772 296192 162998
17876A62998p9771O6118J07842k5757m4639J53644R1488o8081K0226J19983k4661
$$ 162998 83227 149345 257187 231430 186791 340435 431923 363842 384068 504051 479390
17865D79390J95992M30645M75998J28174J39225J9111j75259k37302l14677k98880
$$ 479390 675382 1106027 1582025 1710199 1849424 1868535 1693276 1455974 1141297 842417
17855H42417k87089j22133j2078r7040k38574j47771L1377K15883L116K1741P9366
$$ 842417 555328 433195 421117 324077 85503 -62268 -30891 184992 188108 209849 289215
17844B89215J08616O288n5591j73558o929J0427j4877l7114M6315L8952q986P3444
$$ 289215 397831 404119 348528 174970 168041 178468 163591 126477 172792 211744 202758 276202
17832B76202R7798O3872J49769L31565L09358J01589Q9791M0732j25765l01899
$$ 276202 374000 437872 587641 919206 1228564 1330153 1419944 1460676 1334911 1033012
17822A033012k37616k12065j84951n9103R3132r1297j11999p0002p1579j75216
$$ 1033012 795396 583331 398380 339277 432409 341112 229113 159111 87532 -87684
17812h7684K7180J09702M922r0630k7544l0855n2298J74063K64941J8162q4101
$$ -87684 -60504 49198 54120 -36510 -64054 -94909 -147207 26856 291797 309959 225858
17801B25858j51579J5990J40036M0802k8871K5394N6577j4012q9908j13312M5638
$$ 225858 74279 90269 230305 271107 242236 267630 324207 310195 220287 106975 152613
17790A52613J55861J75143R3267O5221N1704R5243J05596l5697j74857j55153
$$ 152613 308474 483617 576884 642105 693809 789052 894648 858951 684094 528941
17780E28941J8464M2645J17161R0571m5563q7240L8475j9620j73573n0629N0147
$$ 528941 547405 590050 707211 797782 752219 664979 703454 683834 510261 459632 509779
17769E09779n8865m1641K5574n2360l7237q3267r2057j18204r3878l4355K7995
$$ 509779 450914 409273 434847 382487 345250 261983 169926 51722 -42156 -76511 -48516
17758d8516K1844J07597p0076M1982R3563k9537p933q9934j20169J6633l8950
$$ -48516 -26672 80925 10849 52831 146394 116857 108924 18990 -101179 -84546 -123496
17747a23496Q0939J57302J96603j1449j96441o8606N6857N9654j8842J06007p590
$$ -123496 -42557 114745 311348 299899 103458 34852 91709 151363 132521 238528 230938
17736B30938J45331J88727Q1467L4267J48752q6431j03083j37851P6419J9707
$$ 230938 376269 564996 646463 680730 829482 743051 639968 502117 578536 598243
17726E98243l1658P5723L15945J02848j47131j09375l6209j5422k65382k53952
$$ 598243 566585 642308 958253 1061101 913970 804595 768386 752964 487582 233630
17716B33630j5032J05600o9989J20524J18054k8031j893J21075o6860j21043p7603
$$ 233630 218598 324198 254209 374733 492787 464756 462863 583938 517078 396035 318432
17705C18432Q8583K88832L40320K43978J5360o2827Q8317R8600k6643j51768k11750
$$ 318432 407015 695847 1036167 1280145 1295505 1232678 1320995 1419595 1392952 1241184 1029434
17694A029434k71930k08735k33940m8135J5276n2798K9919k07443P143J20988
$$ 1029434 757504 548769 314829 266694 281970 229172 259091 51648 58791 179779
17684A79779J4467k06106M3691J84442q1121j54140N8285L9150r0390n6647P7538
$$ 179779 194246 -11860 31831 216273 135152 -18988 39297 78447 -11943 -68590 8948
17673H948J54474l9306K08943L79512K58415R1297O6962k2635j34331o9357P6368
$$ 8948 163422 124116 333059 712571 970986 1062283 1129245 1106610 972279 902922 979290
17662I79290Q1740N5772k51695l52783k86673j01571P8950k2849M0911K8715j39949
$$ 979290 1061030 1116802 865107 512324 225651 124080 203030 180181 221092 249807 109858
17651A09858j36892n4161O5271R9894n7298P5036J16416j3113P1151p1803j28058
$$ 109858 -27034 -81195 -15924 83970 26672 101708 218124 205011 276162 204359 76301
17640G6301R7967j2085j28511j10560M1140k0238J38358N6061j47023p7206J36057
$$ 76301 174268 162183 33672 -76888 -35748 -55986 82372 138433 -8590 -85796 50261
17629E0261o3506j7126J66914R3330m3411p1372p5968O5867O0391m0190j39229
$$ 50261 -13245 -30371 136543 229873 186462 115090 39122 104989 165380 125190 -14039
17618a4039o0404n9248r618j3795N5377Q1342O4523J2670J5393J11778o7847j38136
$$ -14039 -74443 -133691 -143309 -157104 -101727 -20385 44138 56808 72201 183979 116132 -22004
17606b2004q3989J00335j9324n4419j43182p8623J11536Q7102J90708r4429p8363
$$ -22004 -105993 -5658 -24982 -79401 -222583 -301206 -189670 -102568 88140 -6289 -84652
17595h4652p3843j26047K6460J025J2042J9739K9765n8253O594L6398J09959N6964
$$ -84652 -158495 -284542 -258082 -257057 -245015 -225276 -195511 -253764 -247170 -210772 -100813 -43849
17583d3849l8220N105k8979J4331O3664N0142L0185P249M4963k5518k7195K2483
$$ -43849 -82069 -76964 -105943 -91612 -27948 22194 52379 59628 104591 79073 51878 74361
17571G4361l9917q5830r4694l5171M9294J10264m6636L2063Q799J3625l4919l6212
$$ 74361 34444 -51386 -146080 -181251 -131957 -21693 -68329 -36266 -27467 -13842 -48761 -84973
17559h4973q1680o448J08020L3509l8042R209R2503O7739J9955R4656o7746p3452
$$ -84973 -166653 -173101 -65081 -31572 -69614 -60405 32098 99837 119792 214448 146702 73250
17547G3250m3244r1698P9229m5437L5295j27724m2731M1093J25578n0539r4204
$$ 73250 30006 -61692 17537 -27900 7395 -120329 -163060 -121967 3611 -46928 -141132
17536a41132j23885N6983k5387M2969R3422Q1884j3244q533m730m75L0841J35165
$$ -141132 -265017 -208034 -233421 -190452 -97030 -15146 -28390 -36923 -41653 -42128 -11287 123878
17524A23878K5018L0932j4047j26515N281m7756j50745p0182K9059L4672j10815
$$ 123878 148896 179828 165781 39266 44547 -3209 -153954 -224136 -195077 -160405 -271220
17513b71220J33018L1671k556N2286J36787l4273N6295L4661j38378j80164n7088
$$ -271220 -138202 -106531 -109087 -56801 79986 45713 102008 136669 -1709 -181873 -238961
17502b38961P3939J56265j995M3378n4792j04253J2086Q5392N405n5467R4196
$$ -238961 -165022 -8757 -10752 32626 -22166 -126419 -114333 -28941 -23536 -79003 15193
17491A5193q0776k16529L0741M080K0981j2017J85085J41816m6386q6173P96J70191
$$ 15193 -65583 -282112 -251371 -247291 -226310 -238327 -53242 88574 42188 -43985 -43189 127002
17479A27002K4186m1611n6776K305q4415J232L0824J22049l6969j45209L404J70345
$$ 127002 151188 109577 52801 55106 -29309 -28077 2747 124796 87827 -57382 -53978 116367
17467A16367J06179J1258L6324k28980j06275m989j9722J6768K0020k9033O2701
$$ 116367 222546 233804 270128 41148 -65127 -70116 -89838 -73070 -53050 -82083 -19382
17456a9382o3248K0158K0486m6068m0552J58744L8527n7199J36619N5812K4755
$$ -19382 -82630 -62472 -41986 -88054 -128606 30138 68665 11466 148085 203897 228652
17445B28652K1300L45245L96765M01518O3046m19346l11346k84673r4610K675
$$ 228652 249952 595197 991962 1393480 1456526 1037180 725834 441161 346551 349226
17435C49226j53911k00326k51066j17787O5775Q3872Q0136P7745R8691J68789
$$ 349226 195315 -5011 -256077 -373864 -308089 -224217 -144081 -66336 32355 201144
17425B01144P2138r0980j65220P4916P2167j098r7410j09364o4712J0130m4457
$$ 201144 273282 182302 17082 91998 164165 163067 65657 -43707 -108419 -98289 -142746
17414a42746j70555r7792J11528Q0840J67000M5623k3572o467M7510p1872r3460
$$ -142746 -313301 -411093 -299565 -218725 -51725 -6102 -29674 -36141 11369 -60503 -153963
17403a53963O9169P1552P2691j82156O0962J2246r2756k4171o4876Q0718P6849
$$ -153963 -84794 -13242 59449 -122707 -61745 -49499 -142255 -166426 -231302 -150584 -73735
17392g3735k4638K6115l6270k4004n202L5960K51638R8379o8672o9241P4146m8796
$$ -73735 -98373 -72258 -108528 -132532 -137734 -101774 149864 248243 179571 110330 184476 135680
17380A35680j7237K5533q4948J307j7199n7519N6515k0553M363L0699O0631J27823
$$ 135680 118443 143976 59028 60335 43136 -14383 42132 21579 25942 56641 117272 245095
17368B45095j4394j46822k2065o6703q2155l434j45854l153J16276J54927k1480
$$ 245095 230701 83879 61814 -4889 -87044 -90478 -236332 -239485 -123209 31718 10238
17357A0238l2262p1151j60685J8911J90361k9070l4907N038l7906N6733m8356
$$ 10238 -22024 -93175 -253860 -234949 -44588 -73658 -108565 -103527 -141433 -84700 -133056
17346a33056l5889l93J02944J13317R7540m5234j4764j33466n972j1053j03381
$$ -133056 -168945 -169338 -66394 46923 144463 99229 84465 -49001 -54973 -66026 -169407
17335a69407J27812J57427J1339k22528m3345K7067N8233o741q6065p7341J44107
$$ -169407 -41595 115832 127171 -95357 -138702 -111635 -53402 -60143 -146208 -223549 -79442
17324g9442n020j1179j5069K2026j7521N9608M0415L665J49679n2314j02034m1354
$$ -79442 -84462 -95641 -110710 -88684 -106205 -46597 -6182 -2517 147162 94848 -7186 -48540
17312d8540j5711M6714N8360k2659j13069k5032j4139j5112k3237J6790J26302
$$ -48540 -64251 -17537 40823 18164 -94905 -119937 -134076 -149188 -172425 -155635 -29333
17301b9333P839R041K1549J7669j2163L8383J64567J9228p4529m7597k9779J7377
$$ -29333 -21494 -12453 9096 26765 14602 52985 217552 236780 162251 114654 84875 102252
17289A02252K7482J07054r1590j31503o9982K9476J08441R1303K6769n5807j12331
$$ 102252 129734 236788 145198 13695 -56287 -26811 81630 172933 199702 143895 31564
17278C1564q5147q0913N5995Q3269R7090L6495j3644o0186r8321j57108j52177
$$ 31564 -53583 -134496 -78501 4768 101858 138353 124709 64523 -33798 -190906 -343083
17267c43083L0791J21814N182P626m103j09266R2351K91479O4558l4670P293k29184
$$ -343083 -312292 -190478 -185296 -177670 -181773 -291039 -198688 92791 157349 122679 129972 -99212
17255i9212l0757N7158R1692J20449N1947m619k7153q5940k06756M3121J09452
$$ -99212 -129969 -72811 18881 139330 191277 186658 159505 73565 -133191 -90070 19382
17244A9382Q5379l2128q4608o7524l9583Q4090N0217n2256j884O1288m6547j12261
$$ 19382 104761 72633 -11975 -79499 -119082 -34992 15225 -37031 -38915 22373 -24174 -136435
17232a36435J8668L0572N3330P7373n6354o5625K8074j9523K4068P7262j24639
$$ -136435 -117767 -87195 -33865 43508 -12846 -78471 -50397 -69920 -45852 31410 -93229
17221i3229R8175Q029r5217j4250p4671j14732O8857J59638J6293p4722j3141
$$ -93229 4946 12975 -82242 -96492 -171163 -285895 -217038 -57400 -41107 -115829 -128970
17210a28970N3719K7765K2590m7014O3619N6610P7680l2317j41271q7257o5497
$$ -128970 -75251 -47486 -24896 -71910 -8291 48319 125999 93682 -47589 -134846 -200343
17199b00343K1859J75344Q4062j9395R216r7749p0281l3734k7292J11437Q6616
$$ -200343 -178484 -3140 80922 61527 70743 -27006 -97287 -131021 -158313 -46876 39740
17188C9740k6907q0642l1886l9360J1033K9542J05485J9079P730M8180K5676J26409
$$ 39740 12833 -67809 -99695 -139055 -128022 -98480 7005 26084 33814 81994 107670 234079
17176B34079m9475j51999l5133R6834Q8910j096j4808k3530J6915j20405p2016
$$ 234079 184604 32605 -2528 94306 183216 182120 167312 143782 160697 40292 -31724
17165c1724p1588j05571N3717O2172q0623m6402m6241j19759k9480R2822K5696
$$ -31724 -103312 -208883 -155166 -92994 -173617 -220019 -266260 -386019 -415499 -322677 -296981
17154b96981o7502K8793j45767R7242J92532O6392O739j12433P8652K5988m8990
$$ -296981 -364483 -335690 -481457 -384215 -191683 -125291 -118552 -230985 -152333 -126345 -175335
17143a75335j7424N7235L6333P0947N0144M4217l9131L6633K1973j26794j786
$$ -175335 -192759 -135524 -99191 -28244 21900 66117 26986 63619 85592 -41202 -42988
17132d2988P6177M6880J37000L489k62625m5436L5230n8395L7253j20797K5340
$$ -42988 33189 80069 217069 220558 -42067 -87503 -52273 -110668 -73415 -194212 -168872
17121a68872m6691p1165J89063J38919m277o9340r5312j2336Q0445N9437P5656
$$ -168872 -215563 -286728 -97665 41254 36977 -32363 -127675 -140011 -59566 -129 75527
17110G5527n8318k34654l9503j5111n9794o806Q0141J40065J44104k9990L9659
$$ 75527 17209 -217445 -256948 -272059 -331853 -338659 -258518 -118453 25651 -4339 35320
17099C5320R4917J9183q871j07934j56395l0537j12761J78301J44325M0930n4313
$$ 35320 130237 149420 140549 32615 -123780 -154317 -267078 -88777 55548 96478 42165
17088D2165j77844j50679o4636J81186J27050Q550j40198j04299N6178J31080
$$ 42165 -135679 -286358 -350994 -169808 -42758 -34208 -174406 -278705 -222527 -91447
17078i1447J64538q2262n3275M9014J05543J18132J5565M461p2227p1270j0143
$$ -91447 73091 -9171 -62446 -13432 92111 210243 225808 230269 158042 86772 76629
17067G6629o5908j9008N0883j00891m2050j539o497Q4754o7598J39483P0828j39577
$$ 76629 10721 -8287 42596 -58295 -100345 -101884 -108381 -23627 -91225 48258 119086 -20491
17055b0491j89522J0952J89816j8508n1583P915N9357r4053P568Q8612o5467m6254
$$ -20491 -210013 -199061 -9245 -27753 -79336 -71421 -12064 -106117 -98549 -9937 -75404 -121658
17043a21658O9631K1634M2939J29064R25o8675j4815L4984j1281l2723K2303p3944
$$ -121658 -52027 -30393 12546 141610 142535 73860 59045 94029 82748 50025 72328 -1616
17031a616k0444o4984j07664R6938J13502q8132o110l2140J3300O9169k5089k5126
$$ -1616 -22060 -87044 -194708 -97770 15732 -72400 -78510 -110650 -97350 -28181 -53270 -78396
17019g8396p2708L9491K7471Q7252L1741n6947K2300K2823o1734m161O810n483
$$ -78396 -151104 -111613 -84142 3110 34851 -22096 204 23027 -38707 -42868 -36058 -41541
17007d1541n2051Q3153N5890J30458N1968j52510q4r4667l3601r2565N6672p3822
$$ -41541 -93592 -10439 45451 175909 227877 75367 75283 -19384 -52985 -145550 -88878 -162700
16995a62700j1600N4509K781N8494L3055J0399j17934p2131j959O1525j0232l5846
$$ -162700 -174300 -119791 -117010 -58516 -25461 -15062 -132996 -205127 -207086 -145561 -155793 -191639
16983a91639M8041J50564L3420O8842N8515j9499M6465j7256j5019N9417L5308
$$ -191639 -143598 6966 40386 109228 167743 148244 194709 177453 162434 221851 257159
16972B57159p8780j56797l3322K7815k3565K1265K0683j01602j04876j6606J21106
$$ 257159 178379 21582 -11740 16075 -7490 13775 34458 -67144 -172020 -188626 -67520
16961f7520O3858L4394j53312J33804l058n4875J5611J1643R6394J09254J25675
$$ -67520 -3662 30732 -122580 11224 8166 -46709 -31098 -19455 76939 186193 311868
16950C11868k00462r1188p7894m1933P8429l0262l2531j75805R6331J92407o7006
$$ 311868 111406 20218 -57676 -99609 -21180 -51442 -83973 -259778 -163447 28960 -38046
16939c8046q9580p8952L0486Q1411q8046N3471K2029L7050l7533J4505Q736l3623
$$ -38046 -127626 -206578 -176092 -94681 -182727 -129256 -107227 -70177 -107710 -93205 -84469 -118092
16927a18092J06396R5860O5711j08620j09185l8921J27988J155j7478q2604N4215
$$ -118092 -11696 84164 149875 41255 -67930 -106851 21137 22292 4814 -77790 -23575
16916b3575j7458P3607r491p194J5210j37463j2057p6613n837n9980l8986M7231
$$ -23575 -41033 32574 23083 15889 31099 -106364 -118421 -195034 -200871 -260851 -299837 -252606
16904b52606J52974J21295R999l1725k0660Q8082J66128m2280l4953k9956j31072
$$ -252606 -99632 21663 31662 -63 -20723 67359 233487 191207 156254 126298 -4774
16893d774k2526J11617J28067N6743r6560m1002j25632j55288r225M3195Q8083
$$ -4774 -27300 84317 212384 269127 172567 131565 5933 -149355 -158580 -115385 -27302
16882b7302j16230P8757n6937m3178N5258J30021o4991j23063P9118R8021k1087
$$ -27302 -143532 -64775 -121712 -164890 -109632 20389 -44602 -167665 -88547 9474 -11613
16871a1613m2544J6742p3840l9361N7917J03723n5872L1792m3903k7107M224M4963
$$ -11613 -54157 -37415 -111255 -150616 -92699 11024 -44848 -13056 -56959 -84066 -79842 -34879
16859c4879m6358p9678l9199J40933K2762K7608m849p4881q546K7521K0206p6464
$$ -34879 -81237 -160915 -200114 -59181 -36419 -8811 -13660 -88541 -97087 -69566 -49360 -125824
16847a25824j0008J48897Q6257j52L6272j03174k03316Q964K1150M5024J52006
$$ -125824 -135832 13065 99322 99170 135442 32268 -171048 -162084 -140934 -95910 56096
16836E6096P6782r7971K8108k2069n8274J01826R2381m3962p8133q8133q321R1868
$$ 56096 132878 34907 63015 40946 -17328 84498 176879 132917 54784 -33349 -41670 50198
16824E0198K1273n0670j05966P3864N8793r483l2180K8876J52071P5205p3589
$$ 50198 71471 20801 -85165 -11301 47492 38009 5829 34705 186776 261981 188392
16813A88392r6286o1312q8440j40833j4942P5640N7187N3713j39004o8658J35349
$$ 188392 92106 30794 -57646 -198479 -213421 -137781 -80594 -26881 -165885 -234543 -99194
16802i9194J28113N777N636M6659l1089k8637m4790M871m6162O0661J7287q9193
$$ -99194 28919 34696 40332 86991 55902 27265 -17525 -12654 -58816 1845 19132 -70061
16790g0061j7986k498l8440p820k7282J61323J69939j25063j10047k9389o6169
$$ -70061 -88047 -90545 -128985 -136805 -164087 -2764 167175 42112 -67935 -97324 -163493
16779a63493Q6064j2811j63430J4309L7353J59927O7550o9845O0566J4796O9566
$$ -163493 -77429 -90240 -253670 -239361 -202008 -42081 25469 -44376 16190 30986 100552
16768A00552j3580j80366L6898N6093p7419l4527J78114m8966k34353L5011K22237
$$ 100552 86972 -93394 -56496 -403 -77822 -112349 65765 16799 -217554 -182543 39694
16757C9694J55595m8482j28640N1640j29786j58878J78404P4040o9194N5055J01052
$$ 39694 195289 146807 18167 69807 -59979 -218857 -40453 33587 -35607 19448 120500
16746A20500k6428j01386O2769j03888o4079k7110J36263L6738k43622O6248K79689
$$ 120500 94072 -7314 55455 -48433 -112512 -139622 -3359 33379 -210243 -143995 135694
16735A35694Q1534k6898m2215n8881n2912M0652m8780q9290n680N3124N9704j35010
$$ 135694 217228 190330 148115 89234 36322 76974 28194 -61096 -66776 -13652 46052 -88958
16723h8958j40755L7364K1488r4131k8949P9270R4549R1863l5049M8344l257q4214
$$ -88958 -229713 -192349 -170861 -264992 -293941 -214671 -120122 -28259 -63308 -14964 -18221 -102435
16711a02435N0362K05206N8261j89843q0861L9596q4133K2100o0730M2166N9694
$$ -102435 -52073 153133 211394 21551 -59310 -19714 -103847 -81747 -142477 -100311 -40617
16700d0617m5571J5893M1293l8415Q1745N9375J0931k73N0671l5622m3999m4633
$$ -40617 -86188 -70295 -29002 -67417 14328 73703 84634 84361 135032 99410 55411 10778
16688A0778p0272K2569o9038j1309p6378M1476k9394j22025J06194Q8331k1531
$$ 10778 -59494 -36925 -105963 -117272 -193650 -152174 -181568 -303593 -197399 -109068 -130599
16677a30599n089j830J932L4954M8972k0856J6775J10825k09273j0083J81403
$$ -130599 -135688 -137518 -135586 -100632 -51660 -72516 -55741 55084 -154189 -164272 17131
16666A7131Q4838j12763j12226j121p0438l7568M0702K3185J24927O8544J51173
$$ 17131 101969 -10794 -123020 -124141 -194579 -232147 -191445 -168260 -43333 25211 176384
16655A76384J8142q6727k1993p61Q6532k832p9772j00331j19493m5570M9632m6607
$$ 176384 194526 107799 85806 85045 171577 168745 88973 -11358 -130851 -176421 -126789 -173396
16643a73396k104N5575P909r3180k2083Q9617p2868m5298m6251P2428o757O1677
$$ -173396 -175500 -119925 -112016 -205196 -227279 -137662 -210530 -255828 -302079 -229651 -236408 -174731
16631a74731j021m2504J94051j1202l1983n6076n0305j8432k0104J66001P8890
$$ -174731 -175752 -218256 -24205 -35407 -67390 -123466 -173771 -192203 -212307 -46306 32584
16620C2584k9187N6420n4656p1069l3115P0708l9623J82308K03533K5068j79619
$$ 32584 3397 59817 5161 -65908 -99023 -28315 -67938 114370 317903 342971 163352
16609A63352m5308q9995j32885n1427J5543P6172j3037P8028l2076l7345r564
$$ 163352 118044 28049 -104836 -156263 -140720 -64548 -77585 443 -31633 -68978 -78542
16598g8542k7084N0444N2412N7017J1542J23987J21633j06916r2711o1564n2493
$$ -78542 -105626 -55182 -2770 54247 65789 189776 311409 204493 111782 50218 -2275
16587b275j33453j02229J5815q8386L754J36830J05368l6416J40331N4501m6788
$$ -2275 -135728 -237957 -222142 -310528 -306774 -169944 -64576 -100992 39339 93840 47052
16576D7052q3735K9024n4352j22175m2094N2604J08342j8688J3859Q9290n2855
$$ 47052 -36683 -7659 -62011 -184186 -226280 -173676 -65334 -84022 -70163 19127 -33728
16565c3728j03339K2049O8991M8102r0002l5200O1636K8487o0326j28998R6721
$$ -33728 -137067 -115018 -46027 2075 -87927 -123127 -61491 -33004 -93330 -222328 -125607
16554a25607M7031p4187L197q6785L399J7920N7445J21718N0814l6480l7058o8861
$$ -125607 -78576 -152763 -149566 -236351 -232952 -215032 -157587 -35869 14945 -21535 -58593 -127454
16542a27454Q8073J40659q1796K3321Q4625m5922p8764p9692N276M5038j1009
$$ -127454 -39381 101278 19482 42803 127428 81506 2742 -76950 -71674 -26636 -37645
16531c7645L1230j0201j6745O8374k9095k15132p57J78279J84807k3265K8679
$$ -37645 -6415 -16616 -33361 35013 5918 -209214 -209971 -31692 153115 129850 158529
16520A58529N6069k0134O4733j01k24438r5834J07317o7020k0655j52648O8535
$$ 158529 214598 194464 259197 259096 34658 -61176 46141 -20879 -41534 -194182 -125647
16509a25647r9848n1752P3450k672k0777k960J28306J27803R97M5826P2811J7807
$$ -125647 -225495 -277247 -203797 -206469 -227246 -230206 -101900 25903 26900 72726 145537 163344
16497A63344m3366j20549j5078N9979N716j1410q4394l8089k4517J32219N5437
$$ 163344 119978 -571 -15649 44330 50046 38636 -45758 -83847 -108364 23855 79292
16486G9292J74556j402j61311P0509l0442m4532P2676P3321p3419j38600q0151
$$ 79292 253848 252446 91135 161644 131202 86670 159346 232667 159248 20648 -59503
16475e9503L7205P207n0733m6250J30791O7585j04225p5939N5680J2692Q3854
$$ -59503 -22298 -15091 -65824 -112074 18717 86302 -17923 -93862 -38182 -25490 58364
16464E8364K5150j60208o9663L7805K0289K6995r3238M2727N7127j5978j0006
$$ 58364 83514 -76694 -146357 -108552 -88263 -61268 -154506 -111779 -54652 -70630 -80636
16453h0636r5371m6338J818M9832J04879J38895N5399j68023j6721n645O3655
$$ -80636 -176007 -222345 -220527 -170695 -65816 73079 128478 -39545 -56266 -61911 1744
16442A744L4089j18290q5225R1513O0060j20091r9283K3880L3860Q1335J28820
$$ 1744 35833 -82457 -167682 -76169 -16109 -136200 -235483 -211603 -177743 -96408 32412
16431C2412J39431m0884j11029m9259J17839L2642n7859J2842J03359M8252m3533
$$ 32412 171843 130959 19930 -29329 88510 121152 63293 76135 179494 227746 184213
16420A84213j39409O0061m6704p6867j46907P6120O6997m4174q6812j57030P8361
$$ 184213 44804 104865 58161 -18706 -165613 -89493 -22496 -66670 -153482 -310512 -232151
16409b32151N5347K724K8498J22125l286n831O8826L7470m8324K4371K3746L4631
$$ -232151 -176804 -174080 -145582 -23457 -26743 -32574 36252 73722 25398 49769 73515 108146
16397A08146o9130o8643k0795K3211M0324o8615K5110k3986m6335J54695J47763
$$ 108146 39016 -29627 -50422 -27211 13113 -55502 -30392 -54378 -100713 53982 201745
16386B01745O415j45335j11533m6975P202k4848l6986L251m123L0172L2752K2613
$$ 201745 208160 62825 -48708 -95683 -88481 -113329 -150315 -147064 -151187 -121015 -88263 -65650
16374f5650j861k6515n9758M6639J20277K832P578q4773O8018M4941j23497j6731
$$ -65650 -67511 -94026 -153784 -107145 13132 15964 23542 -61231 6787 51728 -71769 -88500
16362h8500k5607K6154M5317K3902P1933m2076j05588j12487K03518K29284j38217
$$ -88500 -114107 -87953 -42636 -18734 53199 11123 -94465 -206952 -3434 225850 87633
16351H7633j53725r7032j9573O7506P1461j6083l9877K7337j4686k4772L6615
$$ 87633 -66092 -163124 -182697 -115191 -43730 -59813 -99690 -72353 -87039 -111811 -75196
16340g5196o5865j8089l2876r288J77070P4298o7794K8538l2623J33119M4334
$$ -75196 -141061 -159150 -192026 -201314 -24244 50054 -17740 10798 -21825 111294 155628
16329A55628j24099o2665r7597j0617N4722J07954J50112j613m3902q8273l1236
$$ 155628 31529 -31136 -128733 -139350 -84628 23326 173438 171825 127923 39650 8414
16318H414L2630o864p9364j57160O6839q530n715L8752L9901M4546J46996N7778
$$ 8414 41044 34180 -45184 -202344 -135505 -144035 -149750 -110998 -71097 -26551 120445 178223
16306A78223J8718K0399p3400K6148j32956r7834L5055l5686m8850j376J02674
$$ 178223 196941 217340 143940 170088 37132 -60702 -25647 -61333 -110183 -111559 -8885
16295h885k2446o8594R4715K0128M9799j05639k10514M6598p3204O0674J00155
$$ -8885 -31331 -99925 -5210 14918 64717 -40922 -251436 -204838 -278042 -217368 -117213
16284a17213K0142R3408r0509j3359k2488q2842J30904P3388j6687N8936j34225
$$ -117213 -97071 -3663 -94172 -107531 -130019 -212861 -81957 -8569 -25256 33680 -100545
16273a00545o7788K179K2936P8080M5850J9094n2445r7956L8007L3195J15437
$$ -100545 -168333 -166154 -143218 -65138 -19288 -194 -52639 -150595 -112588 -79393 36044
16262C6044j1969k0700k1061k1194Q7313L13206l955j06886o3445Q254J2813J31486
$$ 36044 24075 3375 -17686 -38880 48433 361639 357684 250798 187353 195607 208420 339906
16250C39906l0500K5689p870o8570m1066m874P9115N5074r7729m7866n5851j22858
$$ 339906 309406 335095 327225 258655 217589 212715 291830 346904 249175 201309 145458 22600
16238B2600o2570l2026K368N7204j3750J7072k3527M6636j27952M9634K17761
$$ 22600 -39970 -71996 -69628 -12424 -26174 -9102 -32629 14007 -113945 -64311 153450
16227A53450J88340Q10j85350j00225M6265O4057k1144r5312m4719N142M6061
$$ 153450 341790 342600 157250 57025 103290 167347 146203 50891 6172 11314 57375
16216E7375m0866R0442o011n4027K2108j70794n3207M5534J33402R1239j32841
$$ 57375 16509 106951 100940 46913 69021 -101773 -154980 -109446 23956 115195 -17646
16205a7646q8130N9444M9163l2129k83o2627J56986L3961n7451o0243J63725J04321
$$ -17646 -105776 -46332 2831 -29298 -29581 -92208 64778 98739 41288 -18955 144770 249091
16193B49091j36950N9933m6336n1581n186J30100J424L1751j51711k24l484N0867
$$ 249091 112141 172074 125738 74157 68971 199071 200495 232246 80535 80311 76827 127694
16181A27694J02354n0970j10295j6429J6035K2403K3453j90636O3707L6620j303
$$ 127694 230048 179078 68783 52354 68389 90792 114245 -76391 -12684 23936 22633
16170B2633K5012K863Q1030N152j77285K8833O6467O82J05459n7848q4561J350
$$ 22633 47645 50508 131538 136690 -40595 -11762 54705 55387 160846 102998 18437 19787
16158A9787o164j76194N0966L5827j9793j05408q927m3470P8279j9451j4110J19736
$$ 19787 13623 -162571 -111605 -75778 -95571 -200979 -209906 -253376 -175097 -194548 -208658 -88922
16146h8922N624p7105o256J18957J77377J5795j08327k8250k0059j01011Q627
$$ -88922 -83298 -160403 -166659 -47702 129675 145470 37143 8893 -11166 -112177 -103550
16135a03550Q2290J2286N4201j0287n5903L7454J6524o5448J8069K6556j29768
$$ -103550 -21260 -8974 45227 34940 -20963 16491 33015 -32433 -14364 12192 -117576
16124a17576l0579P641j7611P8611J68334L1478k0409l8274r7081j06185m6263
$$ -117576 -148155 -140514 -158125 -79514 88820 120298 99889 61615 -35466 -141651 -187914
16113a87914n0024J2867J41666J43494Q1100J7758k6838p4375m8013q4352m7701
$$ -187914 -237938 -225071 -83405 60089 141189 158947 132109 57734 9721 -74631 -122332
16102a22332k1891N5674j839O5693O551j73260j6230j426l3821M7347K2464K07141
$$ -122332 -144223 -88549 -90388 -24695 -18144 -191404 -207634 -209060 -242881 -195534 -173070 34071
16090C4071J25563q4352o9001n2879j1829J07206j2828j16887k7384M5450l9436
$$ 34071 159634 75282 6281 -46598 -58427 48779 35951 -80936 -108320 -62870 -102306
16079a02306k1630j6830M6415R2717J0097j16256M7987J03088r5481N6501j5244
$$ -102306 -123936 -140766 -94351 -1634 8463 -107793 -59806 43282 -52199 4302 -10942
16068a0942P6103N5442r2454n6811M9987O6227M9074q7518k7309j6482L9442p5898
$$ -10942 65161 120603 28149 -28662 21325 87552 136626 49108 21799 5317 44759 -31139
16056c1139l4571J27354p28J34180J66349r446j96629j8453P8453j38028r8707
$$ -31139 -65710 61644 60916 195096 361445 351999 155370 136917 215370 77342 -21365
16045b1365k8855m0029R7056k7859J21729O1983o5556L9125j17187j59932k6082
$$ -21365 -50220 -90249 6807 -21052 100677 162660 97104 136229 19042 -140890 -166972
16034a66972L9077L0061J19458M9934j13919o9474n4375n6270N1787N9776J0339
$$ -166972 -127895 -97834 21624 71558 -42361 -111835 -166210 -222480 -170693 -110917 -100578
16023a00578n5593L3649J2279p3437k2489L1294R3546L3722m8927O1384Q9777
$$ -100578 -156171 -122522 -110243 -183680 -206169 -174875 -81329 -47607 -96534 -35150 54627
16012E4627M7808m6522K5900N464n718q3888k1460j1909p5186N1343J02636j37975
$$ 54627 102435 55913 81813 87277 81559 -2329 -23789 -35698 -110884 -59541 43095 -94880
16000i4880j06742J06244O9490J00209M5799q5795J1461P2980l2247m5425L7546
$$ -94880 -201622 -95378 -25888 74321 120120 34325 45786 118766 86519 41094 78640
15989G8640J22979J2251K549j25123k7705o0801J9012n0152R7868L5898P9247
$$ 78640 201619 213870 216419 91296 63591 2790 21802 -28350 69518 105416 184663
15978A84663K919j65917j71279r956J89411L51k8882J49694n2513m9792J6046
$$ 184663 187582 21665 -149614 -159570 29841 30192 1310 151004 98491 48699 64745
15967F4745n7224j9690L5911j050k8065p6315r8303O0634J09984M1698j5350n2676
$$ 64745 7521 -12169 23742 22692 -5373 -81688 -179991 -119357 -9373 32325 16975 -35701
15955c5701K6455L3245j29164J16139q3772k9126L7757O5540k28108O6164O4669
$$ -35701 -9246 23999 -105165 10974 -72798 -101924 -64167 1373 -226735 -160571 -95902
15944i5902M3667J39203M9535M5575J25633r8291k06839O881R1208n2105j7965
$$ -95902 -52235 86968 136503 182078 307711 209420 2581 9462 100670 48565 30600
15933C0600O606J7317j24635Q8776J04329k8852J10532p4520j16918q9403J62488
$$ 30600 37206 54523 -70112 18664 122993 94141 204673 130153 13235 -76168 86320
15922H6320O7666j8625l6164k37401q3768p7994j03371J8564K05521J33256P8792
$$ 86320 153986 135361 99197 -138204 -221972 -299966 -403337 -384773 -179252 -45996 32796
15911C2796J20604k2395L0079r2166Q6510O8887j81977p395O2521l0586j46747
$$ 32796 153400 131005 161084 68918 155428 224315 42338 34943 97464 66878 -79869
15900g9869K0937O0980J43706R0330j46127l9830J05050n6426j79524J34878R5516
$$ -79869 -58932 2048 145754 236084 89957 50127 155177 98751 -80773 54105 149621
15889A49621J7799j36269j66450R9521N0350j1631K6236J24766p2815r3108k3574
$$ 149621 167420 31151 -135299 -35778 14572 2941 29177 153943 81128 -11980 -35554
15878c5554L1663O7140p3449n4054L3419O3417J6474J2413j3046q6800J10834
$$ -35554 -3891 63249 -10200 -64254 -30835 32582 49056 61469 48423 -38377 72457
15867G2457J2802J14305n6615j30946k2379n6317k0726K5639K9439l2903j06970
$$ 72457 85259 199564 142949 12003 -10376 -66693 -87419 -61780 -32341 -65244 -172214
15856a72214n2858k3489M0129J91913J2995p2338P665J9518J21517P7115K4063
$$ -172214 -225072 -248561 -208432 -16519 -3524 -75862 -68197 -48679 72838 149953 174016
15845A74016j7182k3128j1214n7073o6826J61247L9235m5259R243Q2433P8780
$$ 174016 156834 133706 122492 65419 -1407 159840 199075 153816 163059 245492 324272
15834C24272j18664n5442k0853J0513N1187J17096n7757j02604l6819k3068j5867
$$ 324272 205608 150166 129313 139826 191013 308109 250352 147748 110929 87861 71994
15823G1994r647j12141q5146k9809J16036Q6878J22937o6128m515k3302O7297
$$ 71994 62347 -49794 -134940 -164749 -48713 38165 161102 94974 90459 67157 134454
15812A34454O8477L0933q5931K0588r6589m3159K2272r703M9599o7422j24563
$$ 134454 202931 233864 147933 168521 71932 28773 51045 41342 90941 23519 -101044
15801a01044P3766j3628o4237J18169J49134m5334O802o8925p5615k7616o9202
$$ -101044 -27278 -40906 -105143 13026 162160 116826 123628 54703 -20912 -48528 -117730
15790a17730k3039m948r6328o9607J06527j1741J49861q245j6868K16756J00459
$$ -117730 -140769 -145717 -242045 -311652 -205125 -216866 -67005 -75250 -92118 124638 225097
15779B25097l1330j44636j51080L3099R6366M7494j09562j04717L5026Q9818q9434
$$ 225097 193767 49131 -101949 -68850 27516 75010 -34552 -139269 -104243 -14425 -103859
15768a03859J107o6174Q157M4308O4325j6596k764N9079O7002L1318O5898L483
$$ -103859 -102752 -168926 -160769 -116461 -52136 -68732 -71496 -12417 54585 85903 151801 155284
15756A55284j76583j67630r5011k8881J52645R6815l243m3619k4264o5373J6751
$$ 155284 -21299 -188929 -283940 -312821 -160176 -63361 -66604 -110223 -134487 -199860 -183109
15745a83109O3585J66571J21614n9454o2052o3240l4951Q241J0274j14356J3552
$$ -183109 -119524 47047 168661 109207 47155 -16085 -51036 -42795 -32521 -146877 -133325
15734a33325l577J10404J19434q0752j60939L0558O2174n972m6213m2631J54667
$$ -133325 -136902 -26498 92936 12184 -148755 -118197 -56023 -61995 -108208 -150839 3828
15723C828J35571k2790o1060k8705j7626J30539o5788L3720m6517O2721m6930
$$ 3828 139399 116609 55549 26844 9218 139757 73969 107689 61172 123893 76963
15712G6963k483O9857j66631j59614J03615N9947N987m6930J13885L8478J3115
$$ 76963 74480 144337 -22294 -181908 -78293 -18346 -12359 -59289 54596 93074 106189
15701A06189q5002o0520l544m602j34294p0092K1413J42860J08542O3259n1340
$$ 106189 21187 -39333 -42877 -47479 -181773 -251865 -230452 -87592 20950 84209 32869
15690C2869P2536J26966j8438m3069q6837p5243M6702m4427q633J6740q1876K7503
$$ 32869 105405 232371 213933 170864 84027 8784 55486 11059 2426 19166 -62710 -35207
15678c5207M1971l9968N3464J11281j53436j16567L0104Q7904N2635l6148m6989
$$ -35207 6764 -33204 20260 131541 -21895 -138462 -108358 -20454 32181 -3967 -50956
15667e0956J37928l3814l2071J1665k8545L2797O8816p3564m8634J30956o2005
$$ -50956 86972 53158 21087 32752 4207 37004 105820 32256 -16378 114578 52573
15656E2573r4879L4203L6421Q0095l4647j67303N1473O8450m4862j2264J09838
$$ 52573 -42306 -8103 28318 108413 73766 -93537 -42064 26386 -18476 -30740 79098
15645G9098M201q2213j5489K21617M9477k00431o0286J08608P3354l6325l0781
$$ 79098 83299 1086 -14403 207214 256691 56260 -4026 104582 177936 141611 110830
15634A10830L078O052j36568P2486O1599k3545k3685P3509m3578k00680J2032
$$ 110830 113908 119960 -16608 55878 117477 93932 70247 143756 100178 -100502 -88470
15623h8470J405j9178m6032K2452J01751N4824o2831o0169p4178J77453M3608
$$ -88470 -87065 -106243 -152275 -129823 -28072 26752 -36079 -96248 -170426 7027 50635
15612E0635o4670m0145N3123J07821P6552j44726l7928L9026J7324N8362M2972
$$ 50635 -14035 -54180 -1057 106764 183316 38590 662 39688 57012 115374 158346
15601A58346j23757q8475P4543M4122q1275k4595p8151o8809k2391M6862O0058
$$ 158346 34589 -53886 20657 64779 -16496 -41091 -119242 -188051 -210442 -163580 -103522
15590a03522k2767j00071m5685J6212L4978K7833J67743M9174j62829j44383n1175
$$ -103522 -126289 -226360 -272045 -255833 -220855 -193022 -25279 23895 -138934 -283317 -334492
15579c34492J07089O7660K2704k9241J41240J09731r5795k1109o563j8153J5777
$$ -334492 -227403 -159743 -137039 -166280 -25040 84691 -11104 -32213 -38776 -56929 -41152
15568d1152M9142J41080Q1896p4148j46490n8060j06574l2384N6971L6844k7930
$$ -41152 7990 149070 230966 156818 10328 -47732 -154306 -186690 -129719 -92875 -120805
15557a20805j09964m2239N9172Q5487R2509J90100J9390j83477k4166K9784r8976
$$ -120805 -230769 -273008 -213836 -128349 -35840 154260 173650 -9827 -33993 -4209 -103185
15546a03185N2385J0007k04378J9792N3487O9466M1126j2634J13944J39996N4186
$$ -103185 -50800 -40793 -245171 -225379 -171892 -102426 -61300 -73934 40010 180006 234192
15535B34192q6175q6361n4397k3502j09469j08789P6171J02595J58474K1251J8584
$$ 234192 148017 61656 7259 -16243 -125712 -234501 -158330 -55735 102739 123990 142574
15524A42574Q80q941k4340j37575n4937K8503p2432j55966l9750N0620J41261
$$ 142574 143454 134513 110173 -27402 -82339 -53836 -126268 -282234 -321984 -271364 -130103
15513a30103J07950O6682p0917o304K4505J02180N3478m8802n9069j13610n5056
$$ -130103 -22153 44529 -26388 -32692 -8187 93993 147471 98669 39600 -74010 -129066
15502a29066J27206M1952j60088k1201K7186m2302J9983J43452N9303n5015N0579
$$ -129066 -1860 40092 -119996 -141197 -114011 -156313 -136330 7122 66425 11410 61989
15491F1989j10857j14908l5942J15520L0702j25819J29991M3676Q5206J06916
$$ 61989 -48868 -163776 -199718 -84198 -53496 -179315 -49324 -5648 79558 186474
15481A86474R815r7914n9605P442K8016j9867j00144m385J63296j16141j52041
$$ 186474 196289 98375 38770 46212 74228 54361 -45783 -50168 113128 -3013 -155054
15470a55054J57915M6260m9129r3079K02215K43126k5223j20811j09549L2517
$$ -155054 2861 49121 -8 -93087 109128 352254 327031 206220 96671 129188
15460A29188R7763K4105r8680j55474q6227O3976N6568j9731k3432K7376M5392
$$ 129188 226951 251056 152376 -3098 -89325 -25349 31219 11488 -11944 15432 60824
15449F0824k8759p1605L7019M0759o7370J6442L3954J3783r0236p5958P6158J40655
$$ 60824 32065 -39540 -2521 38238 -29132 -12690 21264 35047 -55189 -131147 -54989 85666
15437H5666O2538n8307p0108l4439J21747K3891j7681J0312j23917p0979N3281
$$ 85666 148204 89897 19789 -14650 107097 130988 113307 123619 -298 -71277 -17996
15426a7996J38443p128j54496P5440n685O327J39886J6263r1583l4187n6192l4914
$$ -17996 120447 113319 -41177 34263 28578 34905 174791 191054 99471 65284 9092 -25822
15414b5822K6467K6515J0730M7410M6040j28470o8127M5095r1333j4529O4190
$$ -25822 645 27160 37890 85300 131340 2870 -65257 -20162 -111495 -126024 -61834
15403f1834J04414j15603n1568Q2123l8880K3502M7342j94641l177Q4199K5375
$$ -61834 42580 -73023 -124591 -42468 -81348 -57846 -10504 -205145 -208322 -124123 -98748
15392i8748j00984m9792J08791J08676P8557K6160p1669l3677j44511j52721k0917
$$ -98748 -199732 -249524 -140733 -32057 46500 72660 991 -32686 -177197 -329918 -350835
15381c50835K4113R5554J27808L7406J03560J16425m0307o0479j03809n1495K8038
$$ -350835 -326722 -231168 -103360 -65954 37606 154031 113724 53245 -50564 -102059 -74021
15370g4021j7201p5623R116N2843j4737P1218N3897l5670m8958N8597m1123J9422
$$ -74021 -91222 -166845 -157729 -104886 -119623 -48405 5492 -30178 -79136 -20539 -61662 -42240
15358d2240O5130k5386o7777j41309M9291J26890k8440k4576l6215k0785J06654
$$ -42240 22890 -2496 -70273 -211582 -162291 -35401 -63841 -88417 -124632 -145417 -38763
15347c8763O2042j2086p5864o6662J3063k4264j56524q3286J66741J83858R3027
$$ -38763 23279 11193 -64671 -131333 -118270 -142534 -299058 -382344 -215603 -31745 61282
15336F1282l5611J44712P3532r1114l3137p1677n2945j33862o1584J32696M5108
$$ 61282 25671 170383 243915 152801 119664 47987 -4958 -138820 -200404 -67708 -22600
15325b2600N4430J45831Q8797l0255l4628N7912L2843n9236j95404j33048j07378
$$ -22600 31830 177661 266458 236203 201575 259487 292330 233094 37690 -95358 -202736
15314b02736N6416O2317o964J02320M6876J34788J7204j07908j44200J8010q254
$$ -202736 -146320 -84003 -90967 11353 58229 193017 210221 102313 -41887 -23877 -32131
15303c2131J05595k3498r3482j03439n2085K9538O8885k2815m1182Q9802J35451
$$ -32131 73464 49966 -43516 -146955 -199040 -169502 -100617 -123432 -164614 -74812 60639
15292F0639j03184K813j24841j95481K75571J15229m0194P8859J24681j23357
$$ 60639 -42545 -39732 -164573 -360054 -84483 30746 -9448 69411 194092 70735
15282G0735j9067L4594K6786j32618o3723k0530P9936J8702J8181j4734J64o8996
$$ 70735 51668 86262 113048 -19570 -83293 -103823 -23887 -5185 12996 -1738 -1574 -70570
15270g0570j13916R493J38929L1309N52l555l9747j64592M9246n912k554Q8515
$$ -70570 -184486 -174993 -36064 -4755 -4203 -7758 -47505 -212097 -162851 -168763 -171317 -82802
15258h2802R6133K9618l891p3532N1785J23919r0747o2814Q6368O1540p9377j41863
$$ -82802 13331 42949 39058 -34474 17311 141230 50483 -12331 74037 135577 56200 -85663
15246h5663R810q5267J3173K2289l4417L2045J48007k3647r0815m100O9032m2621
$$ -85663 -75853 -161120 -147947 -125658 -160075 -128030 19977 -3670 -94485 -98585 -29553 -72174
15234g2174J01841p173L5166J5475j26960L5159J23399j2771j09920k3155J06604
$$ -72174 29667 22494 57660 73135 -53825 -18666 104733 91962 -17958 -41113 65491
15223F5491J46806q9255q8678J0908o880o7146o8008N3810J4809K1533K32j14619
$$ 65491 212297 123042 34364 45272 38392 -28754 -96762 -42952 -28143 -6610 -6378 -120997
15211a20997P7224R4453J03080J06340r5161q8646N2118p2534j84717n3647K9769
$$ -120997 -43773 50680 153760 260100 164939 76293 128411 55877 -128840 -182487 -152718
15200a52718R6765l852N2521l6897r3953l312j12673q9072j5454O2365J10623
$$ -152718 -55953 -59805 -7284 -44181 -138134 -141446 -254119 -343191 -358645 -296280 -185657
15189a85657M8984P9465l7829k0705j3999J29872J10680O4802o7497k6776n0045
$$ -185657 -136673 -57208 -95037 -115742 -129741 131 110811 175613 108116 81340 31295
15178C1295j391J09010j110l7368M9372N422r5318k15136l3783L0776J21019N01
$$ 31295 29904 138914 137804 100436 149808 155230 59912 -155224 -189007 -158231 -37212 -36711
15166c6711L8180m4396O9124l693O0745P9250r7751o8968N2046j17459j30235
$$ -36711 1469 -42927 26197 22504 83249 162499 64748 -4220 47826 -69633 -199868
15155a99868J49723K8279k8525Q3455j4554j17045o8126k0314J35586J33155q2545
$$ -199868 -50145 -21866 -50391 33064 18510 -98535 -166661 -186975 -51389 81766 -779
15144g79n6321o228J0293J08466M0979o8312k2955N1200L3643j55782l8387R9261
$$ -779 -57100 -63328 -53035 55431 96410 28098 5143 56343 89986 -65796 -104183 -4922
15132d922J26802R0655K2660j46686r2498q6799o5906N5534r355n3295J77539
$$ -4922 121880 212535 235195 88509 -3989 -90788 -156694 -101160 -110515 -163810 13729
15121A3729J29496r2350k9110k6172M9556m3374p0673K8896k101K5465k6865l9603
$$ 13729 143225 50875 21765 -4407 45149 1775 -68898 -40002 -42103 -16638 -43503 -83106
15109h3106P6594L1293p737l0950L9536q3721k150k5288m5963J395P5251R1995
$$ -83106 -6512 24781 17044 -13906 25630 -58091 -60241 -85529 -131492 -130097 -54846 37149
15097C7149J02723J30039J2894j69009j2700l4254j01327L0932Q123m357m114
$$ 37149 139872 269911 282805 113796 101096 66842 -34485 -3553 4570 213 -3901
15086c901J04127l8835k2328N2627p6976j26456N502L7902P1961k7084m1873r430
$$ -3901 100226 61391 39063 91690 14714 -111742 -106240 -68338 3623 -23461 -65334 -74764
15074g4764J7859M1088J21162J53473n4098j60613j33803k4089Q4403K1393q204
$$ -74764 -56905 -15817 105345 258818 204720 44107 -89696 -113785 -29382 -7989 -16193
15063a6193N7874O4850L357q763o8821q0061K8018L1386Q6861J11538o0978j8849
$$ -16193 41681 106531 109888 101125 32304 -47757 -19739 11647 98508 210046 149068 130219
15051A30219j10384n4541p3623j6689M6742n2050J25172J05402j56124j28173
$$ 130219 19835 -34706 -108329 -125018 -78276 -130326 -5154 100248 -55876 -184049
15041a84049O0721J38499l3844L1681J9502j7269m9701J05580R2027l196j7724
$$ -184049 -123328 15171 -18673 13008 32510 15241 -34460 71120 163147 159951 142227
15030A42227k5670j8638m7784p8013l4008P683n638j149j1053p0506Q0486M1261
$$ 142227 116557 97919 50135 -27878 -61886 -54203 -59841 -60990 -72043 -142549 -62063 -20802
15018b0802N4648Q9485o2785o9439k5876J17323j04140n9426P9646p797O0320
$$ -20802 33846 123331 60546 -8893 -34769 82554 -21586 -81012 -1366 -9163 51157
15007E1157j1580O6387p4881m9683J01465R6504O5557P0807J463J9597N215j95828
$$ 51157 39577 105964 31083 -18600 82865 179369 244926 315733 317196 336793 342008 146180
14995A46180r4223Q6216k8964r4477p4243N8233k0749l3856o078J60177O7941
$$ 146180 51957 138173 109209 14732 -59511 -1278 -22027 -55883 -61961 98216 166157
14984A66157j09731n2708q754n460J70967L2723j37063o9047O0971m2191r0424
$$ 166157 56426 3718 -5036 -10496 160471 193194 56131 -12916 48055 5864 -84560
14973h4560j1778p4510k8934M7906R0040o7018Q0070Q5113p9289p9515Q3326j30187
$$ -84560 -96338 -170848 -199782 -151876 -61836 -128854 -48784 36329 -42960 -122475 -39149 -169336
14961a69336p3540O8200Q6224p1624p3364K12324J61035M4586j04686p1518j07323
$$ -169336 -242876 -174676 -88452 -160076 -233440 -21116 139919 184505 79819 8301 -99022
14950i9022J1673J53958j48847J5050J26476K3585q9544M6756j7510o1034q0758
$$ -99022 -87349 66609 -82238 -67188 59288 82873 -6671 40085 22575 -38459 -119217
14939a19217L3718J19299J18337l4897K7009j5940j11482q339K5566J05354M4516
$$ -119217 -85499 33800 152137 117240 144249 128309 16827 8488 34054 139408 183924
14928A83924K2490K4224l3449j02854M0268j04846j17153l101L2289j6470K547
$$ 183924 206414 230638 197189 94335 134603 29757 -87396 -90497 -58208 -74678 -72131
14917g2131n0310N533J03845K9329j2438O7175r7001o7143K5450O9803j8373J20055
$$ -72131 -122441 -116908 -13063 16266 3828 71003 -25998 -93141 -67691 2112 -16261 103794
14905A03794k5570j34763k2156J17219k1366j25255M3860N289P7634m417r3462
$$ 103794 78224 -56539 -78695 38524 17158 -108097 -64237 -58948 18686 14269 -79193
14894g9193J7806l2042Q2537J10521l3714j34520p2375J87194J66926O7078q7985
$$ -79193 -61387 -93429 -10892 99629 65915 -68605 -140980 46214 213140 280218 192233
14883A92233p2276j32584L3599n0554k7534j63492K1640R4121N7817K4544j09827
$$ 192233 119957 -12627 20972 -29582 -57116 -220608 -198968 -104847 -47030 -22486 -132313
14872a32313p0224r5889R739J61655Q4288K7556n519j9354K8192N5603P445r2013
$$ -132313 -202537 -298426 -288687 -127032 -42744 -15188 -20707 -40061 -11869 43734 51179 -40834
14860d0834j20709N9516Q1332k4487k0188l3315N7627O4347j5615J1555J36188
$$ -40834 -161543 -102027 -20695 -45182 -65370 -98685 -41058 23289 7674 19229 155417
14849A55417J72226P2556j12310p6815j64877k27564j39714J24063k9854K5893
$$ 155417 327643 400199 287889 211074 46197 -181367 -321081 -197018 -226872 -200979
14839b00979J61564J87634L2872n3002m8368n3579P080m677k5329p1024K0688
$$ -200979 -39415 148219 181091 128089 79721 26142 33222 28545 3216 -67808 -47120
14828d7120J02019l3786O643J2030o7412m4514l2384J16594L9234p1097j2338
$$ -47120 54899 21113 27756 39786 -27626 -72140 -104524 12070 51304 -19793 -32131
14817c2131O5065P3584j6660q8643j7157L4856M182J7207n9278J05033L5835m1850
$$ -32131 32934 106518 89858 1215 -15942 18914 23096 40303 -18975 86058 121893 80043
14805H0043j22537O4652K32336J04142p2876k23625j15438k8850l4451P1006Q9153
$$ 80043 -42494 22158 254494 358636 285760 62135 -53303 -82153 -116604 -45598 43555
14794D3555O3297L5382p0679r5586o701P567Q968j9019L9240j2046J8481K3634
$$ 43555 106852 142234 71555 -24031 -30732 -23165 -14197 -33216 6024 -6022 12459 36093
14782C6093J20785J3673l9448l594k9729l4524J688o0306p556K3287L0540j246
$$ 36093 156878 170551 131103 127509 97780 63256 64944 4638 -2918 20369 50909 49663
14770D9663o6536p7308r4589j14790L1667P9267P3598L32360J03630j97387j34087
$$ 49663 -16873 -94181 -188770 -303560 -271893 -192626 -119028 213332 316962 119575 -14512
14759a4512j8247n3428k8594Q9531q781o9945J9907j14091l0709J55421J18429
$$ -14512 -32759 -86187 -114781 -25250 -34031 -103976 -84069 -198160 -228869 -73448 44981
14748D4981p7894j48088P9164J06615j00682n6352n5472J83170k1749k16476p6241
$$ 44981 -32913 -181001 -101837 4778 -95904 -152256 -207728 -24558 -46307 -262783 -339024
14737c39024J09798J36297K1019J26581l047o147j01658j33091P0213Q3899R3389
$$ -339024 -229226 -92929 -71910 54671 51624 45477 -56181 -189272 -119059 -35160 58229
14726E8229l1098o9157m9662J51309j07227m7250j841N9795K0703L7128J3747
$$ 58229 27131 -42026 -91688 59621 -47606 -94856 -96697 -36902 -16199 20929 34676
14715C4676J43065K2226l6189n7800N7906L9963Q7542Q0212J56584J21091J31432
$$ 34676 177741 199967 163778 105978 163884 203847 291389 371601 528185 649276 780708
14704G80708N9218P9864j1673j5340K30395J6719J09905l4482P4557J05256j69521
$$ 780708 839926 919790 908117 892777 1123172 1139891 1249796 1215314 1289871 1395127 1225606
14693A225606M8197R161r0711Q1599M4871j4408j75051l1341j3280J01763O2057
$$ 1225606 1273803 1282964 1192253 1273852 1318723 1304315 1129264 1097923 1084643 1186406 1248463
14682A248463p1937j28455j21360J22338P4582J28154J65362m3445J2841O2546
$$ 1248463 1176526 1048071 926711 1049049 1123631 1251785 1417147 1373702 1386543 1449089
14672A449089o4837l5198N7696N9816K9898k11447k35813N3639K8644J03011k00001
$$ 1449089 1384252 1349054 1406750 1466566 1496464 1285017 1049204 1102843 1131487 1234498 1034497
14661A034497k55517l0507J13000O2979k8954n9410j35090l1183l8239j49339
$$ 1034497 778980 748473 861473 924452 895498 836088 700998 669815 631576 482237
14651D82237j00944j89303j22006R4310J4831m5130Q2483j9991K9912Q4378j19865
$$ 482237 381293 191990 69984 164294 179125 133995 216478 196487 226399 310777 190912
14640A90912j46985k7827J5845p8253k5147J4384K3106k7502K5510J22350Q2822
$$ 190912 43927 16100 31945 -46308 -71455 -57071 -33965 -61467 -35957 86393 169215
14629A69215l4239j0622K0923R1337m5547j8037n5120n3626K9154J8250m8219
$$ 169215 134976 124354 145277 236614 191067 173030 117910 64284 93438 111688 63469
14618F3469j2125K1941J3732J51157J01821n8430N5498K206j73573J1780J3225
$$ 63469 51344 73285 87017 238174 339995 281565 337063 339269 165696 177476 190701
14607A90701j10192O0754q5861o8993M3217j1107o2127J35877P8543p2974J2909
$$ 190701 80509 141263 55402 -13591 29626 18519 -43608 92269 170812 97838 110747
14596A10747O100j32583q5783J68308o0292p5478l9647M5240O5313M9906k2441
$$ 110747 116847 -15736 -101519 66789 6497 -68981 -108628 -63388 1925 51831 29390
14585B9390m5496p2457J10666Q6224m9427K7734m7700p8263N5020J67161m2256
$$ 29390 -16106 -88563 22103 108327 58900 86634 38934 -39329 15691 182852 140596
14574A40596l3193m8358R6958R43j50790O3995J26776j8349q1889j28801O3800
$$ 140596 107403 59045 156003 156946 6156 70151 196927 178578 96689 -32112 31688
14563C1688J04811k4647l2958j8975J2298J8246p0561J20743P0143n3073n2306
$$ 31688 136499 111852 78894 59919 72217 90463 19902 140645 210788 157715 105409
14552A05409k647j0970O403J5725m7457N8612P7972J3299j2669J8711L4380j14313
$$ 105409 102762 91792 98195 113920 66463 125075 203047 216346 203677 222388 256768 142455
14540A42455J37980j09505j4087j08060J8062l7966j17847n3971J07227J1568
$$ 142455 280435 170930 156843 48783 66845 28879 -88968 -142939 -35712 -24144
14530b4144K0054K0986M6592m7466k2026O9067J3564n5604k1437l2419j5703P7845
$$ -24144 -4090 16896 63488 16022 -6004 63063 76627 21023 -414 -32833 -48536 29309
14518B9309N6052q0856K7805k2620L7330J35019n2474j03372O9856J6822J8387
$$ 29309 85361 4505 32310 9690 47020 182039 129565 26193 96049 112871 131258
14507A31258j7292o7594n6485k4712M3256J02058R3475J23965M2923m2300r1766
$$ 131258 113966 46372 -10113 -34825 8431 110489 203964 327929 370852 328552 236786
14496B36786L7074k2355k9853k9601N1813J25325j16355r2319J11346J2056q9975
$$ 236786 273860 251505 221652 192051 243864 369189 252834 160515 271861 283917 193942
14485A93942K3618J50708q7149j18256j073j47501j152J21266N8993J9541P2280
$$ 193942 217560 368268 281119 162863 161790 14289 13137 134403 193396 212937 285217
14474B85217Q9918O3477R7947o2417r455p7737O8839J27003m1021k5197j00807
$$ 285217 375135 438612 536559 474142 464687 386950 455789 582792 541771 516574 415767
14463D15767p2404q1831J73381N8122m2336l1720l2899j26266l6031L6903p7204
$$ 415767 343363 261532 434913 493035 450699 418979 386080 259814 223783 260686 183482
14452A83482m2912m1094m954J17939m741k6924o676J4986l5558M6058P1864Q4708
$$ 183482 140570 99476 94522 212461 207720 180796 174120 189106 153548 199606 271470 356178
14440C56178l9456r5978m3671J6764J03510p2509N4286N8207J2352o4031m4355
$$ 356178 316722 220744 177073 193837 297347 224838 279124 337331 349683 285652 241297
14429B41297j24678M2021M1049j01336J1857J13644K600K2956K96J45076o4357
$$ 241297 116619 158640 199689 98353 110210 223854 226454 249410 249706 394782 330425
14418C30425Q179N3552r5610o4043p2639J6108l8490J30710n052j06221j08428
$$ 330425 338604 392156 296546 232503 159864 175972 137482 268192 263140 156919 48491
14407D8491P631K2450L7405P8414l804N8650J7958r8726k06060j29589R346J76192
$$ 48491 56122 78572 115977 194391 190587 249237 267195 168469 -37591 -167180 -157834 18358
14395A8358J08483M3925N9669q2587q4959J09428L0897j09788j13761j59824L4686
$$ 18358 126841 170766 230435 147848 62889 172317 203214 93426 -20335 -180159 -145473
14384a45473J19167O1086L6891J09443j481N8650K2680R0825J12205M2602R9164
$$ -145473 -26306 34780 71671 181114 179633 238283 260963 351788 463993 506595 605759
14373F05759j5693p9414j72916P9203J4377K57607Q3975j81870n6822K24211K02954
$$ 605759 590066 510652 337736 416939 431316 688923 772898 591028 534206 758417 961371
14362I61371j43611j57395J8994M8698Q2607L4824Q302l6690j18616N4919J16338
$$ 961371 817760 660365 679359 728057 810664 845488 853790 817100 698484 753403 869741
14351H69741Q9234k1075p8273J11482L3350n5809J6109N4415O8999J9331m8302
$$ 869741 958975 937900 859627 971109 1004459 948650 964759 1019174 1088173 1107504 1059202
14340A059202P7319P2573N1716N9372J3847L2762r9449r1761j5919j9049O6R221
$$ 1059202 1136521 1209094 1260810 1320182 1334029 1366791 1267342 1175581 1159662 1140613 1140679 1149900
14328A149900O234L9139K9006O8840j06168k485J41437J42700J25515J01012O6887
$$ 1149900 1156134 1195273 1224279 1293119 1186951 1184466 1325903 1468603 1594118 1695130 1762017
14317A762017q8041R6296O4427J4563L8778O0468J00863J2940P1745P5186J61645
$$ 1762017 1673976 1770272 1834699 1849262 1888040 1948508 2049371 2062311 2134056 2209242 2370887
14306B370887K46555Q4989Q4867L9995J37878K45251J42540q1584K12080K89668
$$ 2370887 2617442 2702431 2787298 2827293 2965171 3210422 3352962 3271378 3483458 3773126
14296C773126L97425K78705J40349K78423K27570J72860K34290L78708L86745
$$ 3773126 4170551 4449256 4589605 4868028 5095598 5268458 5502748 5881456 6268201
14287F268201L08498L31649N54710M99008N64711P98542P97315O62462P62951
$$ 6268201 6576699 6908348 7463058 7962066 8526777 9325319 10122634 10785096 11548047
14278A1548047R03993J266104J297302J209965J412248J600806J881931K118077
$$ 11548047 12452040 13718144 15015446 16225411 17637659 19238465 21120396 23238473
14270B3238473K510792K809074L135485L744019M065543M303552N032178N829758
$$ 23238473 25749265 28558339 31693824 35437843 39503386 43806938 48839116 54668874
14262E4668874O513167P260141Q013836Q954391J0007677J1029612J1923836J2621584
$$ 54668874 61182041 68442182 76456018 85410409 95418086 106447698 118371534 130993118
14254A30993118J3258571J3579604J3567796J3271251J2422366J1174220R749538
$$ 130993118 144251689 157831293 171399089 184670340 197092706 208266926 218016464
14247B18016464Q019420O037755M117760K418907R79332m64107j598656k514235
$$ 218016464 226035884 232073639 236191399 238610306 239589638 239125531 237526875 235012640
14239B35012640k778655k953422l080476k830929k262731j496852j042913n40129
$$ 235012640 232233985 229280563 226200087 223369158 221106427 219609575 218566662 218026533
14231B18026533R6212J052750J830525K155992K524350L073169L243181L196280
$$ 218026533 218122745 219175495 221006020 223162012 225686362 228759531 232002712 235198992
14223B35198992K940897K411603J494720J60559j376005k765019m639805o679047
$$ 235198992 238139889 240551492 242046212 242206771 240830766 238065747 233425942 226746895
14215B26746895q461213j0195763j1503686j2562630j3403695j3637850j3632172
$$ 226746895 218285682 208089919 196586233 184023603 170619908 156982058 143349886
14208A43349886j3356971j2777234j1777068j0911401r976064q826353p827074
$$ 143349886 129992915 117215681 105438613 94527212 84551148 75724795 67897721
14201F7897721p102500o167712n442134m915329m401339l967461l272928k905833
$$ 67897721 60795221 54627509 49185375 44270046 39868707 35901246 32628318 29722485
14193B9722485k705971k417600k094922j954283j717663j602551j352569j177712
$$ 29722485 27016514 24598914 22503992 20549709 18832046 17229495 15876926 14699214
14185A4699214j137911j059307q67886p14347p29020p24490n61440n79470n76111
$$ 14699214 13561303 12501996 11634110 10919763 10190743 9466253 8904813 8325343 7749232
14176G749232n52662m70195k30105l31119l79176k55400k33635k65064k40981
$$ 7749232 7196570 6726375 6496270 6165151 5785975 5530575 5296940 5031876 4790895
14167D790895n3398k47652k42192k03257l03639k11458r6852q39j02706k06886
$$ 4790895 4737497 4489845 4247653 4044396 3740757 3529299 3432447 3431608 3328902 3122016
14157C122016k24662k61641j51050j17818q2064l3740q7022N0945q8754j81913
$$ 3122016 2897354 2635713 2484663 2366845 2284781 2251041 2164019 2214964 2126210 1944297
14147A944297k04006k056J06517l9993p9627n9715j03265j72142J8749M7388Q9651
$$ 1944297 1740291 1738235 1844752 1804759 1725132 1665417 1562152 1390010 1408759 1456147 1545798
14136A545798J3389o4636q5248r3502j1098p05J13932O2918n3365j48944j74931
$$ 1545798 1559187 1494551 1409303 1315801 1304703 1303998 1417930 1480848 1427483 1278539 1103608
14125A103608m2217J02331O7535j77068j29741j03066j6670N9153J20021J26341
$$ 1103608 1061391 1163722 1231257 1054189 924448 821382 804712 863865 983886 1110227
14115A110227O3456J7799p2710l3851J08024r037n7588j47767n4012L7554o3866
$$ 1110227 1173683 1191482 1118772 1084921 1192945 1183908 1126320 978553 924541 962095 898229
14104H98229J20383J78774q5648k7003K6169j44280r8277j15115j31817J19973
$$ 898229 1018612 1197386 1111738 1084735 1110904 966624 868347 753232 621415 741388
14094G41388Q6713J822k819o1573J29835L751l8548p3750k0038O2711j5665P758
$$ 741388 828101 829923 827104 765531 895366 899117 860569 786819 766781 829492 813827 821585
14082H21585j2303Q219m5154n7384p227o3883r2483N1164J43389L9462j62895
$$ 821585 809282 817501 772347 714963 707736 643853 551370 602534 745923 785385 622490
14071F22490j67717J77244M9240j86802q1573J34936K02819J2341n5144M4157
$$ 622490 454773 632017 681257 494455 412882 547818 750637 762978 707834 751991
14061G51991O1656l2989o6010j46840m2971l3546N6679J66032R7581J70148K18508
$$ 751991 813647 780658 714648 567808 524837 491291 547970 714002 811583 981731 1200239
14050A200239Q5946m9488o1780j39060j91051q1460M0841J23140L5600m2050J747
$$ 1200239 1286185 1236697 1174917 1035857 844806 763346 804187 927327 962927 920877 922624
14039I22624j54068r3775J32770J03281q5686J4702J29072j7403l5965K2006k9676
$$ 922624 768556 674781 807551 910832 825146 839848 968920 951517 915552 937558 907882
14028I07882N1941J26075K46268q57n3737R4249K58674J35970J07632J93526M8351
$$ 907882 959823 1085898 1332166 1331309 1277572 1371821 1630495 1766465 1874097 2067623 2115974
14017B115974J07754K70682K36840L09317J92194K4020J39692J47343K19651R6352
$$ 2115974 2223728 2494410 2731250 3040567 3232761 3256781 3396473 3543816 3763467 3859819
14007C859819l1344l7415K0222R1650N8760p9456r8932j28269P8351L8037k57150
$$ 3859819 3828475 3791060 3811282 3902932 3961692 3882236 3783304 3655035 3733386 3771423 3514273
13996C514273l05760J9328j3399J61242J17486K8912P025q006j40275n5942r0333
$$ 3514273 3208513 3227841 3214442 3375684 3493170 3522082 3529107 3521101 3380826 3324884 3234551
13985C234551l7151q0068P3308K32465K44937J8998l4436Q5062n265M587l1347
$$ 3234551 3197400 3117332 3190640 3423105 3668042 3687040 3652604 3737666 3732401 3736988 3705641
13974C705641l4733l3598l15033k97637j53748j19484k40333k74179j68191j20945
$$ 3705641 3670908 3637310 3322277 3024640 2870892 2751408 2511075 2236896 2068705 1947760
13964A947760j21522j96375k73753q0235r165n9070j06134j14477k8663L5482
$$ 1947760 1826238 1629863 1356110 1275875 1266710 1207640 1101506 987029 958366 993848
13954I93848j27237q9052l0997N1496J09102r0557j01768K9254n7342j63728J9674
$$ 993848 866611 777559 746562 798058 907160 816603 714835 744089 686747 523019 542693
13943E42693P8104k8007j3458J14382J13149j76619k28297r0031j09881P0045
$$ 542693 620797 592790 579332 693714 806863 630244 401947 311916 202035 272080
13933B72080n8027o9080j2419K49225M2857j05789n4877J06623o3229n0467o5711
$$ 272080 214053 144973 132554 381779 424636 318847 263970 370593 307364 256897 191186
13922A91186K2186J03829M4937k7726j44117K8008P9044j7966p7541m7078J82722
$$ 191186 213372 317201 362138 334412 190295 218303 297347 279381 201840 154762 337484
13911C37484l8882N4591J3065p4518l343l2816m4768J46069L2953p7818k5452
$$ 337484 298602 353193 366258 291740 288397 255581 210813 356882 389835 312017 286565
13900B86565J31294n8784p5697l1792j51804L0881J23919J11736l5047j74517
$$ 286565 417859 359075 283378 251586 99782 130663 254582 366318 331271 156754
13890A56754n680J64153J06981j06942N1265K7814q4533J70363j08252j91915
$$ 156754 151074 315227 422208 315266 366531 394345 309812 480175 371923 180008
13880A80008k0055K6122R7667Q9863L4006K9818n578q3660p9994j27326l2660
$$ 180008 159953 186075 283742 373605 407611 437429 431851 348191 268197 140871 108211
13869A08211L1132J1666l2046p0013p4276J06304J59815j7394p2441O1778M7867
$$ 108211 139343 151009 118963 48950 -25326 80978 240793 223399 150958 212736 260603
13858B60603j43696p0954J49775M0262j80784N2109L6963r2549r6836N5225J12613
$$ 260603 116907 45953 195728 235990 55206 107315 144278 51729 -45107 10118 122731
13847A22731J05954J87283q0211r4265J3202N5651k8019q6013P4743J02515j69807
$$ 122731 228685 415968 335757 241492 254694 310345 282326 196313 271056 373571 203764
13836B03764j73193p1948M1141Q7885M4281O7324J16309j02179r8228L8587J798
$$ 203764 30571 -41377 -236 87649 131930 199254 315563 213384 115156 153743 155541
13825A55541J0939N6318l6869N9658J4763p3740m4335L1951N4958J58349j586
$$ 155541 166480 222798 185929 245587 260350 186610 142275 174226 229184 387533 385947
13814C85947j18382p8183l8702l8409r1574P7548J97191J98171n3025j09264K065
$$ 385947 267565 189382 150680 112271 20697 98245 295436 493607 440582 331318 333383
13803C33383Q5815J32574j0524J06689K11796J54094O5945M9516L5314J33578
$$ 333383 419198 551772 541248 647937 859733 1013827 1079772 1129288 1164602 1298180
13793A298180K29603o5943k0878N2161r669j936N2171j20661j31398r0636K0775
$$ 1298180 1527783 1461840 1440962 1493123 1483454 1481518 1533689 1413028 1281630 1190994 1211769
13782A211769K8001N8513p5827q5292J5659J13069J20227j6907j15653K0499O8114
$$ 1211769 1239770 1298283 1222456 1137164 1152823 1265892 1386119 1369212 1253559 1274058 1342172
13771A342172O4856n8214m5657o8560J03543k3854q3942o6469p440J12805M4704
$$ 1342172 1407028 1348814 1303157 1234597 1338140 1314286 1230344 1163875 1156435 1269240 1313944
13760A313944j93554j25978j03876P6007J40911m1414k36593l5414N1594j5536
$$ 1313944 1120390 994412 890536 966543 1107454 1066040 829447 794033 845627 830091
13750H30091m7889O10l5238j57634k44961j52586N2035M9257R154O4980K3837
$$ 830091 782202 782812 747574 589940 344979 192393 244428 293685 302839 367819 391656
13739C91656l2727k1863j83427j7439J70567N2844J4839m1274q5284j20851r8577
$$ 391656 358929 337066 153639 136200 306767 359611 374450 333176 247892 127041 28464
13728B8464J4602J33121J16617j43988M9687p4697m4939q1053m5938N0445L8408
$$ 28464 43066 176187 292804 148816 198503 123806 78867 -2186 -48124 2321 40729
13717D0729q8841P4399O5377p477J16663R7637p2500j38850j26131r431P9588
$$ 40729 -48112 26287 91664 84187 200850 298487 225987 87137 -38994 -48425 31163
13706C1163J73244n1635j83873m0084N1696j00372M6226Q7447K16127J853j56301
$$ 31163 204407 152772 -31101 -71185 -19489 -119861 -73635 13812 229939 231792 75491
13695G5491j7682j9894J477P9944P6498N8714m7532j18878l6560o2356P9788K6655
$$ 75491 57809 37915 39392 119336 195834 254548 207016 88138 51578 -10778 69010 95665
13683I5665O8715Q0760M5836l5022j33662l968N1510k1840R602l2566j09943O181
$$ 95665 164380 245140 290976 255954 122292 118324 169834 147994 157596 125030 15087 21268
13671B1268J7605L001o6094l8043L812L8887p502Q4097n3020j7211J930N5933
$$ 21268 38873 41874 -24220 -62263 -58451 -19564 -27066 57031 4011 -13200 -11270 44663
13659D4663l3378j2282K2632p9630n5322p7995j48442J0197O1058J76765J58120
$$ 44663 11285 -997 21635 -57995 -113317 -191312 -339754 -329557 -268499 -91734 66386
13648F6386P3623J43485p8308k4671l7161O6067n2995j99827P5855J43370K7538
$$ 66386 140009 283494 205186 180515 143354 209421 156426 -43401 32454 175824 203362
13637B03362m06J20988j32112m9130K7170j5035O8656O7583k8467j31826o0086
$$ 203362 202956 323944 191832 142702 169872 154837 223493 291076 262609 130783 70697
13626G0697M7616J35867r7041j01794j3194n4841K7589N4933P0070J00788n0313
$$ 70697 118313 254180 157139 55345 42151 -12690 14899 69832 139902 240690 190377
13615A90377o3433j09695q5584q5164J5884J7754K09212J35412n859j19958j38886
$$ 190377 126944 17249 -68335 -153499 -137615 -119861 89351 224763 218904 98946 -39940
13604c9940m7365N3965J43789J03262O9423j01543j28276r8493j08027L1307p3719
$$ -39940 -87305 -33340 110449 213711 283134 181591 53315 -45178 -153205 -121898 -195617
13593a95617L5209j159R6412K24581R2107p2213j07641j11783j27687Q5037R6592
$$ -195617 -160408 -161567 -65155 159426 251533 179320 71679 -40104 -167791 -82754 13838
13582A3838o3983q1454R6795p3673j22624J08664M7813o219k734j638j3131p4933
$$ 13838 -50145 -131599 -34804 -108477 -231101 -122437 -74624 -80843 -83577 -85215 -98346 -173279
13570a73279Q8805J06986O6800j19005q3265j4869Q1897m7573o6353O8542J10740
$$ -173279 -84474 22512 89312 -29693 -112958 -127827 -45930 -93503 -159856 -91314 19426
13559A9426P7095n2221J3964j5306K0044j14869J13831n527j6045j9807o1753
$$ 19426 96521 44300 58264 42958 63002 -51867 61964 56437 40392 20585 -41168
13548d1168K1535K01897R209r4634M6619O9176j01065j10994k3509P2155N8871
$$ -41168 -19633 182264 191473 96839 143458 212634 111569 575 -22934 49221 108092
13537A08092P334N0973q4466j21396L5329M1120j55037q3042j8514Q9375m939
$$ 108092 115426 166399 81933 -39463 -4134 36986 -118051 -201093 -219607 -130232 -135171
13526a35171M638Q2337R6962P8003m4223L8045k8469r1754m5917N8998J767k2136
$$ -135171 -130533 -48196 48766 126769 82546 120591 92122 368 -45549 13449 15216 -6920
13514f920j09891l9018M8636J6307O5792R9601K4941R98j25707j51536R6840J34977
$$ -6920 -116811 -155829 -107193 -90886 -25094 74507 99448 100446 -25261 -176797 -79957 55020
13502E5020q8441R5550P8135P4j64780L77N0404j6938q858k6557k05196m2007
$$ 55020 -33421 62129 140264 140338 -24442 -24065 26339 9401 543 -26014 -231210 -273217
13490b73217K1236P3170J20974n7263L81J321M67J41833Q1384p9967p339M1476
$$ -273217 -251981 -178811 -57837 -115100 -114719 -113398 -112931 28902 110286 30319 22980 64456
13478F4456m7916J367N9918k3669M1626l6412r5349n6374Q6313o5643p5894L7041
$$ 64456 16540 17907 77825 54156 95782 59370 -35979 -92353 -6040 -71683 -147577 -110536
13466a10536P8425r275l6422q602M1249o8771J37969J21468o3260j14948P8156
$$ -110536 -32111 -41386 -77808 -86410 -45161 -113932 24037 145505 82245 -32703 45453
13455D5453L8671j7632l7326J13882J0425j1935j5780o9867N9893N5382j73999
$$ 45453 84124 66492 29166 143048 153473 141538 125758 55891 115784 171166 -2833
13444b833j56270P8838J19617J6088K0402J53519R363n0796j64205j58136m2299
$$ -2833 -159103 -80265 39352 55440 75842 229361 238724 187928 23723 -134413 -176712
13433a76712M9593l6802k7932Q682j6132M4293Q5748K9483L8430P2817l0790p9475
$$ -176712 -127119 -163921 -191853 -183171 -199303 -155010 -69262 -39779 -1349 71468 40678 -38797
13421c8797o7851J44725Q9486q4394j25425K9717J33928N383O9529O0426p5017
$$ -38797 -106648 38077 127563 43169 -82256 -52539 81389 86772 156301 216727 141710
13410A41710Q057m7244M8958P448K8754n65j86690j7928M0729m3719m2672N2870
$$ 141710 149767 102523 151481 158929 187683 187118 428 -17500 23229 -20490 -63162 -10292
13398a0292O2636L4306j4351Q1664P6541j7601q2546p3727N9664j7547j75224
$$ -10292 52344 86650 72299 153963 230504 212903 130357 56630 116294 98747 -76477
13387g6477p8279Q5108J52712J90309j3424o0394j10390r890J09881r6696j5964
$$ -76477 -154756 -69648 83064 273373 259949 199555 89165 79275 189156 92460 76496
13376G6496L7437R969r5118j52799l7475J2099J0977P4156j11552Q3202P2012
$$ 76496 113933 123902 28784 -124015 -161490 -149391 -138414 -64258 -175810 -92608 -20596
13365b0596O5660J1541o2249q9137n862J72105p9905k1805Q3454k5727K2758J62910
$$ -20596 45064 56605 -5644 -94781 -100643 71462 -8443 -30248 53206 27479 50237 213147
13353B13147n5041k4011P392L1469J3212k6353j90336K7462J61381P5023O1632
$$ 213147 158106 134095 141487 172956 186168 159815 -30521 -3059 158322 233345 294977
13342B94977q9274r1335r8080k078Q2426q8074p7340K4787o4426o0180Q0435P7771
$$ 294977 205703 114368 16288 14210 96636 8562 -68778 -43991 -108417 -168597 -88162 -10391
13330a0391K6959j1763o4578R4571J21762O828j32822p4970N5408j42828q6262
$$ -10391 16568 4805 -59773 34798 156560 163388 30566 -44404 11004 -131824 -218086
13319b18086J55491Q1948J1116j36277k4574Q7341L1831Q5698j14825j59852N8075
$$ -218086 -62595 19353 30469 -105808 -130382 -43041 -11210 74488 -40337 -200189 -142114
13308a42114J27024N48L176j04075k0093J47703L8151j9350M6013j1888K0119
$$ -142114 -15090 -14542 -11366 -115441 -135534 12169 50320 30970 76983 65095 85214
13297H5214R0418l7938k4870r3510j6263K489N9122k277j6586M74o7529Q6871
$$ 85214 175632 137694 112824 19314 3051 5540 64662 62385 45799 46273 -21256 65615
13285F5615K6364r0958J38650N6107L7233l505j0657J9117J5268p5710j67533
$$ 65615 91979 1021 139671 195778 233011 229506 218849 237966 253234 177524 9991
13274I991m739j6549l7154J9704M3104m761o1632j7157J28567k7582L4n8725m5241
$$ 9991 5252 -11297 -48451 -28747 14357 9596 -52036 -69193 59374 31792 31826 -26899 -72140
13261g2140N0940k8216l396O3617j6932Q4769j2492m8940k4369j88399J86534
$$ -72140 -21200 -49416 -52812 10805 -6127 78642 66150 17210 -7159 -195558 -9024
13250i024R2616l596N145J0987k4895m5097j06304p3705m932N0609R1451J19742
$$ -9024 83592 79996 85141 96128 71233 26136 -80168 -153873 -158805 -108196 -16745 102997
13238A02997o4616p8027J04636p4125N1500J7566j38428j2468L9016K268j61320
$$ 102997 38381 -39646 64990 -9135 42365 59931 -78497 -90965 -51949 -49681 -211001
13227b11001N6165J37374K2101j13620Q8447m0097L0929J004O3420M4896l5848
$$ -211001 -154836 -17462 4639 -108981 -20534 -60631 -29702 -28698 34722 79618 43770
13216D3770p5157P1383N2339R7096l5888k1055r5566Q0595J56619Q4491N5563
$$ 43770 -31387 39996 92335 189431 153543 132488 36922 117517 274136 358627 414190
13205D14190J31492o5233j54890j19589j55454j64812m56P646n6947K1019n0174
$$ 414190 545682 480449 325559 205970 50516 -114296 -114752 -107106 -164053 -143034 -193208
13194a93208J05740J1850N909J8898J518J6046J19953J71580j09331j44190J47549
$$ -193208 -87468 -75618 -69709 -50811 -49293 -33247 86706 258286 148955 4765 152314
13183A52314P4954p7090m4602o7130J2592N8100l7937j23585p09J15660o3728
$$ 152314 227268 150178 105576 38446 51038 109138 71201 -52384 -53093 62567 -1161
13172a161n9090k0220L172J20782N5558J11224J27441p2633R6748K75353K41817
$$ -1161 -60251 -80471 -77299 43483 99041 210265 337706 265073 361821 637174 878991
13161H78991L74119M90180M00750J9465k56803l27286l98637n10141l04265K9268
$$ 878991 1253110 1743290 2144040 2163505 1906702 1579416 1180779 670638 366373 395641
13151C95641j28130j64297p8495O7295K3528R9347L4216k5274q9384L1995J5027
$$ 395641 267511 103214 24719 92014 115542 214889 249105 223831 134447 166442 181469
13140A81469k6694n5276O784j08343J08387P076j00238J3814p7327J7433K11652
$$ 181469 154775 99499 106283 -2060 106327 113403 13165 26979 -50348 -32915 178737
13129A78737P1658k1672o9991j38094m2777R9975J7301J67622P8626R8262J62815
$$ 178737 250395 228723 158732 20638 -22139 77836 95137 262759 341385 439647 602462
13118F02462K82524K09934L44550M05872L43959R226k97841n30786m61246k74875
$$ 602462 884986 1094920 1439470 1845342 2189301 2198527 1900686 1369900 908654 633779
13108F33779j38804j53399j28944k9187r5164m4541J59518k1498O931P0522p6941
$$ 633779 494975 341576 212632 183445 88281 43740 203258 181760 188691 259213 182272
13097A82272j77259r8473M3343j3765m0188M3509k4889O4221O9161r5024j52901
$$ 182272 5013 -93460 -50117 -63882 -104070 -60561 -85450 -21229 47932 -47092 -199993
13086a99993J2919O9038M0595j26891O6293J65984p1643r7942M9234K86297J76487
$$ -199993 -187074 -118036 -77441 -204332 -138039 27945 -43698 -141640 -92406 193891 370378
13075C70378N1166k9975q1750J18826K38834J3465n2949n8392o1784j05126k20425
$$ 370378 421544 391569 309819 428645 667479 680944 627995 569603 507819 402693 182268
13064A82268j72667N8439N3143p6314P1314L5819j1397O5932k8958J9169O447
$$ 182268 9601 68040 121183 44869 116183 152002 140605 206537 177579 196748 203195
13053B03195q6299l5471K8557P6500k4090j31641k7241j81627q6560J6300J43347
$$ 203195 116896 81425 109982 186482 162392 30751 3510 -178117 -264677 -248377 -105030
13042a05030J29293O6404J5785N28M250R3816l0717o8952j8531m0470L8836n237
$$ -105030 24263 90667 106452 106980 111230 205046 174329 105377 86846 46376 85212 79975
13030G9975K7176n7421j51163Q2581k2060M4822J24928M7263j6146n6490k24802
$$ 79975 107151 49730 -101433 -18852 -40912 3910 128838 176101 159955 103465 -121337
13019a21337k4495J68167P1277j7045p5811l752k9683L3844K9590J5353J6874
$$ -121337 -145832 22335 93612 76567 756 -2996 -32679 1165 30755 46108 62982
13008F2982j23189j02518n3976L9711J46647R1458r4426m6122J64100J25386P3494
$$ 62982 -60207 -162725 -216701 -176990 -30343 61115 -33311 -79433 84667 210053 283547
12997B83547l8964p2302q2952K2287R7617J32673j36232m6883n717j9235k9205
$$ 283547 244583 172281 89329 111616 209233 341906 205674 158791 153074 133839 104634
12986A04634J37330j00334k14162m9227O0902J8053N7261K9634r8291j10862J45802
$$ 104634 241964 141630 -72532 -121759 -60857 -42804 14457 44091 -54200 -165062 -19260
12975a9260N9693p3168r6266J0381J87148L5384p5953m6877k0876J51919j0666
$$ -19260 40433 -32735 -129001 -118620 68528 103912 27959 -18918 -39794 112125 101459
12964A01459j46911r5074r6782j40127j24279J74705J83140k2773J02345K9524
$$ 101459 -45452 -140526 -237308 -377435 -501714 -327009 -143869 -166642 -64297 -34773
$$ [...]
##END NTUPLES=NMR SPECTRUM
##END=
