##TITLE=Analysis number 326936
Compound Code cc 30011
Project Code adrs
Chemist Name af chempharm
##JCAMPDX= 6.0         $$ Bruker NMR JCAMP-DX V2.0
##DATA TYPE= NMR SPECTRUM
##DATA CLASS= NTUPLES
##ORIGIN= Bruker BioSpin GmbH
##OWNER= nmr
$$ XWIN-NMR		Version 3.5
$$ Fri Mar  2 11:09:05 2007 GMT Standard Time (UT+0h)  MAYBRIDGE\nmr@NMR_250MHZ
##.OBSERVE FREQUENCY= 250.131544655141
##.OBSERVE NUCLEUS= ^1H
##.ACQUISITION MODE= SIMULTANEOUS (DQD)
##.ACQUISITION SCHEME= undefined
##.AVERAGES= 16
##.DIGITISER RES= 18
##SPECTROMETER/DATA SYSTEM= dpx250
##.PULSE SEQUENCE= zg30
##.SOLVENT NAME= CDCl3
##.SHIFT REFERENCE= (INTERNAL, CDCl3, 0, 16.522)
##AUDIT TRAIL= $$ (NUMBER, WHEN, WHO, WHERE, WHAT)
$$ ##TITLE= Audit trail, XWIN-NMR		Version 3.5
$$ ##JCAMPDX= 5.01
$$ ##ORIGIN= Bruker BioSpin GmbH
$$ ##OWNER= nmr
$$ C:\u/data/dgb/nmr/ADRS/160/pdata/1/auditp.txt
$$ ##AUDIT TRAIL=  $$ (NUMBER, WHEN, WHO, WHERE, WHAT)
(   1,<2007-03-02 11:08:44.43 +000>,<MAYBRIDGE\nmr>,<NMR_250MHZ>,
      <created by zg, POWCHK disabled, PULCHK disabled
       configuration hash MD5:
       49 4B E0 1D 92 C2 6B 37 9F E6 65 BC 52 41 86 1D
       data hash MD5: 64K
       C4 A2 B0 F4 C2 61 DD F2 79 08 7F 9C D9 3B EB 15>)
(   2,<2007-03-02 11:08:56.63 +000>,<MAYBRIDGE\nmr>,<NMR_250MHZ>,
      <Start of raw data processing
       ef LB = 0.3 FT_mod = 6 PKNL = 1 SI = 32K 
       data hash MD5: 32K
       31 27 8E 32 4E 81 48 64 0A 5A 61 D5 48 34 21 F2>)
(   3,<2007-03-02 11:08:58.27 +000>,<MAYBRIDGE\nmr>,<NMR_250MHZ>,
      <apk 
       data hash MD5: 32K
       C8 56 3E D8 6A 1E 8A 51 88 64 4F F3 7A 80 75 E1>)
(   4,<2007-03-02 11:08:59.11 +000>,<MAYBRIDGE\nmr>,<NMR_250MHZ>,
      <abs ABSG = 5 
       data hash MD5: 32K
       F7 EE B0 16 64 A2 51 E7 D5 1C 2C 72 8E D8 1D 98>)
$$ ##END=
$$ 
$$ hash MD5
$$ E5 DA 18 19 EA 03 C0 5E 14 9B 3F 03 0A 15 B9 72
##$RELAX= 
##$RELAX= 
##$RELAX= 
##$RELAX= 
##$RELAX= 
##$RELAX= 
##$RELAX= 
$$ Bruker specific parameters
$$ --------------------------
##$DU= <C:\u>
##$EXPNO= 160
##$NAME= <ADRS>
##$PROCNO= 1
##$TYPE= <nmr>
##$USER= <dgb>
##$AMP= (0..31)
100 100 100 100 100 100 100 100 100 100 100 100 100 100 100 100 100 100 
100 100 100 100 100 100 100 100 100 100 100 100 100 100 
##$AQSEQ= 0
##$AQ_mod= 3
##$AUNM= <au_zg>
##$AUTOPOS= <37 >
##$BF1= 250.13
##$BF2= 250.13
##$BF3= 250.13
##$BF4= 250.13
##$BF5= 500.13
##$BF6= 500.13
##$BF7= 500.13
##$BF8= 500.13
##$BYTORDA= 1
##$CFDGTYP= 0
##$CFRGTYP= 5
##$CHEMSTR= <none>
##$CNST= (0..31)
1 1 145 1 1 1 1 1 1 1 1 1 1 1 1 1 1 1 1 1 1 1 1 1 1 1 1 1 1 1 1 1 
##$CPDPRG= <>
##$CPDPRG1= <>
##$CPDPRG2= <>
##$CPDPRG3= <>
##$CPDPRG4= <mlev>
##$CPDPRG5= <mlev>
##$CPDPRG6= <mlev>
##$CPDPRG7= <mlev>
##$CPDPRG8= <mlev>
##$CPDPRGB= <>
##$CPDPRGT= <>
##$D= (0..31)
0 1 0 0 0 0 0 0 0 0.06 0 0 0 0 0 0 0.0002 0 0 0 0 0 0 0 0 0 0 0 0 0 0 
0 
##$DATE= 1172833723
##$DBL= (0..7)
120 120 120 120 120 120 120 120 
##$DBP= (0..7)
150 150 150 150 150 150 150 150 
##$DBP07= 0
##$DBPNAM0= <>
##$DBPNAM1= <>
##$DBPNAM2= <>
$$ [...]
##$SUBNAM7= <"">
##$SUBNAM8= <"">
##$SUBNAM9= <"">
##$SW= 20.6930455092707
##$SWIBOX= (0..15)
0 0 3 0 0 0 0 0 0 0 0 0 0 0 0 0 
##$SW_h= 5175.983436853
##$TD= 65536
##$TD0= 1
##$TE= 295.16
##$TE2= 300
##$TE3= 300
##$TEG= 300
##$TL= (0..7)
0 120 120 120 120 120 120 120 
##$TP= (0..7)
150 150 150 150 150 150 150 150 
##$TP07= 0
##$TPNAME0= <>
##$TPNAME1= <>
##$TPNAME2= <>
##$TPNAME3= <>
##$TPNAME4= <>
##$TPNAME5= <>
##$TPNAME6= <>
##$TPNAME7= <>
##$TPOAL= (0..7)
0.5 0.5 0.5 0.5 0.5 0.5 0.5 0.5 
##$TPOFFS= (0..7)
0 0 0 0 0 0 0 0 
##$TUNHIN= 0
##$TUNHOUT= 0
##$TUNXOUT= 0
##$USERA1= <user>
##$USERA2= <user>
##$USERA3= <user>
##$USERA4= <user>
##$USERA5= <user>
##$V9= 5
##$VALIST= <valist>
##$VCLIST= <CCCCCCCCCCCCCCC>
##$VD= 0
##$VDLIST= <DDDDDDDDDDDDDDD>
##$VPLIST= <PPPPPPPPPPPPPPP>
##$VTLIST= <TTTTTTTTTTTTTTT>
##$WBST= 1024
##$WBSW= 4
##$XGAIN= (0..3)
0 0 0 0 
##$XL= 0
##$YL= 0
##$YMAX_a= 285034
##$YMIN_a= -285861
##$ZGOPTNS= <>
##$ZL1= 120
##$ZL2= 120
##$ZL3= 120
##$ZL4= 120
##$ABSF1= 16.522
##$ABSF2= -4.171173
##$ABSG= 5
##$ABSL= 3
##$ALPHA= 0
##$AQORDER= 0
##$ASSFAC= 0
##$ASSFACI= 0
##$ASSFACX= 0
##$ASSWID= 0
##$AUNMP= <proc_1d>
##$AZFE= 0.1
##$AZFW= 0.1
##$BCFW= 0
##$BC_mod= 0
##$BYTORDP= 0
##$COROFFS= 0
##$CY= 12.5
##$DATMOD= 1
##$DC= 0
##$DFILT= <>
##$DTYPP= 0
##$F1P= 14.0000005364418
##$F2P= -0.99999901652339
##$FCOR= 0.5
##$FTSIZE= 32768
##$FT_mod= 6
##$GAMMA= 0
##$GB= 0
##$INTBC= 1
##$INTSCL= 1
##$ISEN= 128
##$LB= 0.3
##$LEV0= 0
##$LPBIN= 0
##$MAXI= 10000
##$MC2= 0
##$MEAN= 0
##$ME_mod= 0
##$MI= 0
##$NCOEF= 0
##$NC_proc= -3
##$NLEV= 6
##$NOISF1= 0
##$NOISF2= 0
##$NSP= 0
##$NTH_PI= 0
##$NZP= 0
##$OFFSET= 16.522
##$PC= 1
##$PHC0= 228.4898
##$PHC1= 7.481823
##$PH_mod= 1
##$PKNL= yes
##$PPARMOD= 0
##$PSCAL= 4
##$PSIGN= 0
##$REVERSE= no
##$SF= 250.13
##$SI= 32768
##$SIGF1= 0
##$SIGF2= 0
##$SINO= 400
##$SIOLD= 32768
##$SREGLST= <1H.CDCl3>
##$SSB= 0
##$STSI= 32768
##$STSR= 0
##$SW_p= 5175.98343685301
##$SYMM= 0
##$S_DEV= 0
##$TDeff= 65536
##$TDoff= 0
##$TI= <Analysis number 999999
Compound Code 99
Book Reference 9
Project Code 9>
##$TILT= no
##$TM1= 0
##$TM2= 0
##$TOPLEV= 0
##$USERP1= <user>
##$USERP2= <user>
##$USERP3= <user>
##$USERP4= <user>
##$USERP5= <user>
##$WDW= 1
##$XDIM= 32768
##$YMAX_p= 569580098
##$YMIN_p= -110612
$$ End of Bruker specific parameters
$$ ---------------------------------
##NTUPLES= NMR SPECTRUM
##VAR_NAME=  FREQUENCY,     SPECTRUM/REAL,   SPECTRUM/IMAG
##SYMBOL=    X,             R,               I
##VAR_TYPE=  INDEPENDENT,   DEPENDENT,       DEPENDENT
##VAR_FORM=  AFFN,          ASDF,            ASDF
##VAR_DIM=   32768,         32768,           32768
##UNITS=     HZ,            ARBITRARY UNITS, ARBITRARY UNITS
##FACTOR=    0.157963299565203, 1,           1
##FIRST=     4132.6476996994, 0,             0
##LAST=      -1043.33573715361, 0,           0
##MIN=       -1043.33573715361, -110612,     0
##MAX=       4132.6476996994, 569580098,     0
$$ Real data points
##PAGE= N=1
##DATA TABLE= (X++(R..R)), XYDATA
$$ [...]
14856A4253l0640J2188J8166j4861k743l968L9306p7o211j4061j9412j3581j3813
14843c5454R6J4425Q022J6796J7714K497P094n144m418J862p357k2384l7211l993
14829d7455K9109o445L319J5603J0198k359M011R599J6489L2637j2393n5822R758
14816F249O62L138K0834j6090K7951J759K377K763l618k4257j209L4721M1730
14803I7010J5653m8712l7350J2384m037p477K4357l4783j2507P272j9295p217
14791a4702K805j4079L0175K3559M117j4734o915j0624k894n656J0194K7670M875
14778C3791j2924j2093j7151L456J4678P048N339L709J756k0321j0781O0425l075
14765E3857k6438j4254p363J9274p117j6921r276j0759k538O623K6497R811j6626
$$ y = [14253, -16387, -4199, 13967, -894, -3637, -7605, 31701, 31624, 25413, 11352, -8060, -21641, -35454, -35358, -20933, -12911, 3885, 21599, 24096, 31190, 26046, 21628, 23490, 16133, -6251, -43462, -47455, -18346, -24791, -21472, -5869, 4329, 1970, 5981, 15580, 32069, 64706, 52313, -3509, 6249, 6911, 10049, 30883, 14793, 42744, 44503, 46880, 49643, 46025, 21768, 20559, 55280, 97010, 112663, 63951, 26601, 38985, 34948, 27471, 51828, 17045, 4538, 11810, -7485, -14702, -11897, -25976, 4199, 27758, 31875, 17141, 10226, -398, -3292, -8948, 1246, 28916, 33791, 20867, 8774, -8377, -4921, 9757, 16805, 22144, 25853, 27609, 7288, -3493, 56932, 53857, 27419, 13165, 5802, 25076, 17959, 1038, -8238, -18997, -21535, -14912, 11585, 21396, 4770]
14752D770k5269J274M061j3668K0251K2384l973k2844j2684l834L2696K0224j3048
14739A0340j0781K2313k3893j0347n159L1007M80j9467n357j7631J0222R759K7784
14726A9270P107k925l6838j0907L0971K0270k0800J1146j5844k8961M806K588
14714b0117L274j4660j2345J5781K4751R387l699k2991J1422J8408K4649K2484
14702E6344K0819k5378l3736k7732k3497j4474J9209K2475n76k3393p038m057
14690d1034R749j165k5076J8941J8106n9267j0666L0222M4472K6479J0656L088
14678B4505L425J811j4125k1436P442P831j9723k4854j0489r457L0748O110r30
14665a9142k3811k4801Q598N021j395J9335L3608k1787j7535K6694N0334K060
$$ y = [4770, -20499, -19225, -15164, -28832, -8581, 13803, 9830, -13014, -25698, -29532, 3164, 23388, 10340, -441, 21872, -2021, -12368, -17527, 13480, 13960, -5507, -10864, -28495, -18273, -8514, 19270, 26377, 23452, -13386, -24293, 6678, 26948, 6148, 17294, 1450, -27511, -22705, -20117, -16843, -31503, -43848, -28067, -3316, 6071, 2372, -20619, -9197, 9211, 33860, 56344, 77163, 51785, 18049, -9683, -33180, -47654, -28445, -5970, -6546, -29939, -36977, -41034, -31285, -32450, -57526, -38585, -20479, -79746, -90412, -60190, -15718, 10761, 21417, 24505, 27930, 29741, 15616, -5820, 1622, 9453, -10270, -35124, -45613, -55070, -24322, -18212, -19142, -42953, -67754, -59156, -54135, -55530, -36195, -2587, -24374, -41909, -15215, 35119, 37179]
14653C7179k3227k146k359N474l315M077n075l820k120o3070O566K9591L1282
14640I037j4861j7611j5770K5197J8740L681p575j5043k0144K7728k0236K312
14628b4545l240L4087K188J0186M024j2189j562n831Q742J3432Q05J0798J4313
14615E1208p384m1177k8161k7923j1285K6319L850K3115n440J1638L4476n835
14603B3401P2j8624j5421q600K6380p611N179n591l406J6873L894O760J5944J0319
14589D9569o384o876K6849l384k1250k0109K847n337j6751j06L6481J1221l847
14576D2923k1061o249k4316j9043m9087J9720M4935J6419L503j2836j1018r159
14564b5269K7337K731k9626j1440J471K6988L5659Q836k5800Q273r209R395K3959
$$ y = [37179, 13952, 11806, 9447, 14921, 11606, 15683, 10608, 6788, 4668, -58402, -51836, -22245, 9037, -5824, -23435, -39205, -14008, 4732, 8413, 838, -14205, -34349, -6621, -26857, -24545, -27785, 6302, 8490, 18676, 22700, 10511, 8949, 3118, 11860, 25292, 26097, 36895, 51208, 43824, 2647, -25514, -53437, -64722, -38403, -34553, -11438, -16878, -5240, 29236, 23401, 23473, 4849, -10572, -19172, 7208, -403, 4776, -815, -4221, 12652, 16546, 23306, 39250, 49569, 43185, 36309, 63158, 59774, 38524, 18415, 21262, 15925, -826, -932, 35549, 46770, 42923, 21862, 15613, -8703, -27746, -76833, -57113, -12178, 4241, 7744, -5092, -16110, -25269, 2068, 4799, -24827, -36267, -34796, -7808, 27851, 36687, 10887, 19160, 9951, 19346, 43305]
14551D3305n669p428k2614j529k2507j8280J0916M0707K486K258K0361k0396m2010
14538b0400M933j3629J4978L1432J6446J3699j7953l1131m5763j0927P190K4934
14526b6191O539J1048k503r844r09M404J2905N398j8731J373Q788K4021J3161
14513B9459k3369K4030N493j9104j3087j1244K00k217j0835K4821J901r125J0941
14500G864K8424L697k6517N775N163R83k7299j9380K3425j5186m24J4864j9658
14487a8269n890P495J7110q545l325l073J2236J9101m735R051M609p424J2624
14474C0965O954k5330j757M3143J2394l5088l1756j534P293K506m8929k4505L282
14461f2362J0245J3974L928J1827j0279r203n430J0651k055k6695n438M4776m99
$$ y = [43305, 37636, 30208, 7594, 6065, -16442, -34722, -23806, 16901, 19387, 21645, 42006, 21610, -20400, -15467, -29096, -14118, 17314, 33760, 47459, 29506, -1625, -47388, -58315, -51125, -26191, -19652, -8604, -11107, -20951, -21860, -17456, -4551, 847, -17884, -16511, -7723, 16298, 29459, 6090, 30120, 35613, 16509, 3422, -7822, -7622, -9839, -20674, 4147, 6048, -3077, 7864, 36288, 39985, 13468, 19243, 24406, 25389, -1910, -21290, 2135, -13051, -13475, 1389, -18269, -24159, -16664, 446, -8099, -11424, -14497, -2261, 16840, 12105, 21156, 25765, 18341, 30965, 37919, 12589, 10832, 53975, 66369, 31281, -475, -2009, 5284, 7790, -41139, -65644, -62362, -52117, -38143, -34215, -22388, -32667, -41870, -47300, -36649, -38704, -65399, -70837, -26061, -26560]
14448b6560k485J4964J3774M074J9201J2509k5213o722K7806j2774j9140j8691
14436a9257j5681k3663J6028K3379K054j279j0637J1869J9573p890l938k8764
14424c8206K1989K6939J2331j2651j2858P207k2454k7704J5882K1298M266j0873
14412a4834p13O125J599K1489j5655o243j303J7401R146P933j5348O488k4811
14399h726k0646J3241J7212k6493k0566J5228J3244K9440J7901J4363l2655j6389
14387d846k013J3334r411j5000j2880J1078J6697L909J7363j1737l0803m609J1342
14374a7576M5173J5489j5917j950j9994j3225R629p053O332J7319J3148j2199
14362A9176j7747m3172j9444K7681L7250M465j0724Q02K7955K3262r424K460N274
$$ y = [-26560, -29045, -14081, -307, 3767, 22968, 35477, 10264, 3542, 31348, 18574, -566, -19257, -34938, -58601, -42573, -19194, -17140, -18419, -29056, -17187, 2386, -5504, -9442, -38206, -16217, 10722, 23053, 10402, -2456, 4751, -17703, -45407, -29525, -8227, -3961, -14834, -15547, -9422, -7823, 13666, -1989, -8232, -9535, 7866, 17012, 24945, 9597, 16085, -8726, -29372, -16131, 1081, -25412, -45978, -30750, -17506, 11934, 29835, 44198, 11543, -4846, -6859, 6475, -2936, -17936, -30816, -19738, -3041, 868, 18231, 6494, -24309, -28918, -17576, 27597, 43086, 27169, 25219, 5225, -8000, 1629, -5424, 908, 18227, 31375, 19176, 1429, -41743, -61187, -33506, 3744, 8209, -2515, -1713, 26242, 49504, 40080, 42540, 47814]
14349D7814l2386l4172K8158K5743j9551q320l7085k1537p624K4278J2110o31
14337b3203J6738k6208l5789j4914K4329L2402K3729k0836k5951J1754L9761J1966
14325A3778j2330l0435J3842M5971J6053j5613r706l577L6534l81n661j001k5555
14312B1919p933l0810j4796q027l1048R569N741L9466m849J038M727k615L682
14299a3936n978K146j6038k4169J2842K0135K2078l433J4987J99k8191L280K7561
14286A1483J2671J0279O003J4940p413q104k2015J1156j5032J1320L162j6912
14274A1538j8152J3335J3010j729j0394K535J4179j3058K675n85j668l5579j519
14261b5412l927K0601K1000Q984k4738j6357m159L1984J8933j9712r210K1458
$$ y = [47814, 15428, -18744, 9414, 35157, 15606, 7286, -29799, -51336, -58960, -34682, -22572, -23203, -6465, -32673, -68462, -83376, -59047, -26645, -2916, -23752, -49703, -37949, 1812, 13778, 1448, -28987, -15145, 30826, 46879, 31266, 21560, 17983, 54517, 54136, 48475, 47474, 21919, 13986, -16824, -31620, -39647, -70695, -61126, -55385, -15919, -20768, -19730, -15003, -17618, -13936, -19914, -17768, -33806, -57975, -45133, -24998, -2920, -6353, 8634, 8833, -19358, -16078, 11483, 24154, 34433, 40436, 55376, 47963, 39859, 17844, 29000, 13968, 25288, 28450, 11538, -6614, 6721, 19731, 18002, 7608, 10143, 24322, 11264, 13939, 13354, 11686, -23893, -25412, -29339, -8738, 12262, 21246, -3492, -19849, -24008, 7976, 26909, 7197, -2013, 19445]
14249A9445j0701j738J4496j8130j753j1161J1915j407L02j2548l2307M036L6790
14236b761M3102o78k9210r461q915J0076L4570M035O453l5259l720Q816k5568
14223h520K1479K7360m0233l7092K3889L4338J2169q415j0979j041L5113M498
14211E2566o1946o948P927j3767q980L8628N8933K1551j789l0530l0236j019N708
14198C0098K69j5202j0716K4423N710j5904m2545M874L8595L1506j5364l661K2699
14185E4782K0988k6381K740k0100k2689l9884M138J173J666J7387J9106j3945
14173a019j0722R877j1909O699M0490J473j603j6661j4174l5549J6378L3014M271
14160B0565m685q934m2963n011O791l929M749Q507m0042J124K225K4066K6177
$$ y = [19445, 8744, 7006, 21502, 3372, 1619, -9542, 2373, 966, 1268, -11280, -43587, -39551, -2761, 40341, 39663, 10453, 992, -7923, 2153, 36723, 40758, 47211, 11952, 8232, 17048, -8520, 12959, 40319, 86, -37006, -13117, 21221, 33390, 24975, 13996, 12955, 48068, 52566, -9380, -16328, -8401, -22168, -31148, 7480, 66413, 87964, 86175, 55645, 25409, 24390, 30098, 30367, 15165, 4449, 28872, 34582, 18678, -23867, -18993, 19602, 51108, 35744, 32083, 54782, 75770, 49389, 52129, 32029, 9340, -30544, -26406, -25233, -23567, -6180, 12926, -1019, -11741, -1864, -13773, -7074, 33416, 34889, 33286, 16625, 2451, -33098, -16720, 16294, 20565, 15880, 6946, -36017, -41028, -34237, -38166, -33417, -24910, -64952, -63828, -61603, -37537, -11360]
14147a1360k3886N577Q647m473L9403P064p270j6756j4129k4324j2983K1589L654
14134b9247K5571L289l69j6894p501K2619N197J1545j5734M787l836j4205N372
14121i406j6122l123J0160q12l288L8717K4769J0907k9239j6750O596J6151j0609
14108A7951l4507J0349L665k0083J500L2576k2132K32K6557R260K3703K3463k1767
14095E0767k2049l8047l9557j6862K3211M8135K496l983M550J3688k9386j4015
14083b1052L2156K2734M0676R371l8408n5003O129j144J6057J6972l165n805J3980
14070C3498j3813r259r125j0806J2352k864L2056m168j994J1056J9387J3906m573
14057F5653k4282j8912l0018j5042j7970N775j1506N5060L4193K629j4251l172
$$ y = [-11360, -35246, -29669, -21022, -25495, 13908, 20972, 13702, -3054, -17183, -41507, -54490, -32901, -29247, -3676, -387, -756, -17650, -25151, -2532, 2665, 14210, -1524, 3263, -573, -14778, -9406, -25528, -28651, -18491, -19303, -22591, 16126, 40895, 51802, 22563, 5813, 12409, 28560, 17951, -16556, -6207, -2542, -22625, -21125, 11451, -10681, -10449, 16108, 25368, 49071, 72534, 50767, 28718, -9329, -48886, -65748, -42537, 5598, 8094, 4111, 8661, 22349, -7037, -21052, 11104, 33838, 74514, 83885, 45477, -9526, -3397, -4541, 11516, 28488, 25323, 19518, 33498, 19685, 10426, 1301, -9505, 2847, -17, 32039, 27871, 25877, 36933, 56320, 70226, 65653, 41371, 22459, -7559, -22601, -40571, -34796, -46302, 8758, 42951, 45580, 31329, 28157]
14045B8157l190n734J2847P498l2901m9894j7064M058L4248J7205J5184J5675
14033B6089k0917L0816J3007q211l1879n793R586J6148k3479j5065Q481m461o450
14020a2128N339k097K0073K7524j5481N196J3294k0899j0405P217m242k9235j7498
14007c3342k4125O196J8878J2688j6679J3853J5801J686M506K1891k191J1535
13995C0697p236K2562j2093r823j6947j743K1539k308k0615j8225Q517J9757J7508
13982C1590p298r536j7555j5675J5467K4340K9591L416l7197k8984j543j5461
13970b8845m927j2122J8220j211j3287J0342L0881p510k2337k3267M4875M4834
13958C5646m549l1957p837r127J8332R675N892J692l6087k4876l655l822L5406
$$ y = [28157, 24967, 19233, 32080, 39578, 6677, -43217, -60281, -56223, -21975, -4770, 10414, 26089, 5172, 35988, 48995, 40784, 8905, 3112, 12698, 28846, 5367, -9698, -1217, -5678, -12128, -6789, -8886, 11187, 38711, 23230, 28426, 41720, 20821, 10416, 17633, 13391, -15844, -33342, -57467, -51271, -32393, -19705, -36384, -22531, -6730, -5044, -538, 21353, 19162, 30697, 23461, 46023, 33930, 24107, 7160, 5417, 26956, 24648, 4033, -14192, -5675, 14082, 31590, 24292, 14756, -2799, -18474, -3007, 21333, 50924, 54340, 17143, -11841, -13384, -28845, -33772, -45894, -27674, -28885, -42172, -31830, -949, -8459, -30796, -54063, -9188, 35646, 31097, -860, -8697, -17824, 508, 10183, 16075, 17767, -18320, -43196, -46851, -50673, -15267]
13945a5267L4458M706m999k1831j1461J3237p496J9706L3941L1181p566k5957
13933D2652k3238j2476j8861q523R854M678j619k9345J4772K6053p980j3849k7659
13920d5541m859R740J7583K7327K2206j9261o0544j4252L1108k0794J0423K9650
13908a7214K0943J967j6427n761j2805M644J0925N102j4327J5603Q664n994J1611
13895F931k7486p319M0977K1089J0507j5190j8613j8191Q693o572J8564l8533
13883b5143j0143L3323O005J896m157l3039k7145M4867O936J2336L1615j6312
13871B1039K7382r777k2203O193J4723j4303j6516m749M702J0385j7263o380m246
13858a1013J2573N004j3088L7043l586l0641l1735j2173L685K0428J0725k0885
$$ y = [-15267, 19191, 23897, 18898, -2933, -14394, -1157, -8653, 11053, 44994, 76175, 68609, 42652, 19414, 6938, -11923, -20446, -10592, -5914, -7533, -36878, -22106, 3947, -4033, -17882, -45541, -50400, -40660, -23077, 4250, 26456, 7195, -53349, -67601, -36493, -57287, -46864, -17214, 3729, 5696, -10731, -16492, -29297, -24653, -13728, -8626, -22953, -7350, 1314, -4680, 6931, -20555, -27874, 13103, 34192, 44699, 29509, 10896, -7295, 1398, -5174, 13390, -25143, -35286, -1963, 4042, 5938, 1781, -31258, -58403, -13536, -6600, 5736, 37351, 21039, 48421, 38644, 16441, 22634, 37357, 23054, 6538, 1789, 6491, 16876, -387, -6767, -11013, 1560, 6564, -6524, 30519, 26933, -3708, -35443, -47616, -43931, -23503, -12778, -33663]
13846c3663j4244p622M395J2079q789J0651K6871k0991j3854J3642R867L430K4870
13833F642j6872R87o740J6694j168j731K3030K3543m05r289K743j2835k6j8195
13819F378J2650J4316j7854k3420p443J6394O516J5563p23k2715P828j635j8459
13806a2604J575K3145n729j0703n021r415m477J0414Q151p938J5476L95N699j3911
13792d943j1902j1090k0594k952L0617L9810K3766j8648r169j2625k5319K4270
13780A221K6088j2092o928J2243k7650R957q432k6695k4637O926o010K692J2044
13767d1273K4758K3229K2700K1974J277k7293l3085m454q74K698k7623m1336K573
13754g6729J8730j0500O462k816J7190K1105K311M686j3780j6578m077K0582j1995
$$ y = [-33663, -47907, -55529, -51134, -39055, -47844, -37193, -10322, -31313, -45167, -31525, -21658, -18228, 6642, -10230, -9243, -15983, 711, -457, -2188, 20842, 44385, 43980, 34691, 37434, 24599, 24573, 6378, 19028, 33344, 15490, -7930, -15373, 1021, 7537, 23100, 22377, -338, 7490, 5855, -12604, -11029, 12116, 6387, -4316, -9337, -18752, -23229, -12815, -4664, -12602, 2874, 3269, 8968, -4943, -16845, -27935, -48529, -51481, -20864, 18946, 42712, 24064, 14895, 2270, -23049, 1221, 27309, 15217, 8289, 20532, -7118, 2839, -5593, -32288, -56925, -49999, -56009, -53317, -41273, -16515, 6714, 29414, 51388, 52665, 25372, -7713, -12167, -13041, -10343, -37966, -79302, -76729, -57999, -68499, -62037, -64853, -47663, -26558, -24247, -19561, -33341, -49919, -53996, -33414, -45409]
13741d5409k1896J3762J8121K5592N805j158l724o352R620K4528r701j310K8937
13728C6815M984r931k3159J794L9509O513l6933l050R161j9926k4714j3628Q736
13715b3829L699J1195j1518n574J2521K8913o993L134k0638j239J7838j7937q245
13702a8673L454j4225K105j7836K463L0099J636j7308j8047J8881J8229R628K4827
13689B5233J5247k2941j9512N473K3360J5501j4990J1076l161n710M270q620r284
13676A5942o552k0552Q599M576j7497j1677J0588L569j2239j1014J1506K8781
13664D030L9328K479j0615l5050l128k0902j3873j6814J870j88j0491J3047M3147
13651g160L466j1830k4742R188K3307O826J7780M186l447m70j7321k1376j1758
$$ y = [-45409, -67305, -53543, -35422, -9830, -4025, -5183, -8907, -15259, -5639, 18889, 9188, 7878, 36815, 41799, 31868, 8709, 10503, 50012, 56525, 19592, 16542, 25703, 5777, -18937, -32565, -23829, -20130, -8935, -20453, -26027, -13506, 15407, 8414, 11548, -9090, -10329, 7509, -10428, -18673, -15219, -29444, -27339, -45175, -42712, -12613, -10977, -28285, -46332, -27451, -9222, 406, 25233, 40480, 17539, -1973, 3500, 26860, 42361, 27371, 38447, 35286, 29576, 33846, 25226, 15942, 9390, -11162, -2563, 2013, -15484, -27161, -16573, -13004, -25243, -36257, -24751, 4030, 43358, 45837, 35222, 172, -2956, -23858, -37731, -54545, -52675, -52863, -63354, -50307, -7160, -3694, -15524, -40266, -31078, -7771, -945, 16835, 21021, 17574, 17104, -217, -21593, -33351]
13638c3351q109K1183K053J0660J0692Q704p39R337P900j3830k7525l2824K267
13625d3582J6840m630j6255N021L7741N626l417n089p670l7265J3247M4257j007
13612C817j3546n758J7067j6971q147K0038k760k9299n88O52r08K870M9409J1735
13598B7611j4334k0420k2428L6954L1324k4310j3459l8800K231M4264M8780P414
13586F4827p778j6560j0668o759j6911K0546k4736n896k513m5173k0413p250Q747
13573g0537J2439j326K1100K6393J177k2800j8763J1104J6733j0525J2243K9100
13561F338q282o660l523j7667m0024m619J1655K1052L2647J1073n817r157L0463
13548A7479N440O038l0052j1487n433J353J1239R592K0007J784o366q473k0428
$$ y = [-33351, -41460, -20277, -18224, -7564, 3128, 11832, 11093, 20430, 28330, 14500, -13025, -45849, -43582, -26742, -31372, -47627, -42606, -4865, 761, -2656, -7745, -15415, -52680, -39433, 4824, 3817, -9729, -15487, 1580, -15391, -23538, -3500, -6260, -35559, -36147, -35495, -36403, -33533, 15876, 27611, 13277, -7143, -29571, 7383, 38707, 14397, 938, -37862, -35631, 8633, 57413, 64827, 57049, 40489, 29821, 23062, 6151, 26697, 1961, -3935, -6448, -51621, -72034, -79284, -70537, -58098, -59424, -38324, -11931, -10754, -33554, -52317, -41213, -24480, -35005, -22762, 6338, -1944, -8604, -12127, -29794, -69818, -74437, -62782, -41730, -9083, 1990, -3827, -12984, 17479, 22919, 28957, -1095, -12582, -18015, -16662, -5423, 4169, 24176, 25960, 19594, 11121, -9307]
13535i307j1152M4333M76k9966k5424K0114L2567j851k9746Q76J4039n980m06
13522a427J300J8287q866l8459N697J2231J5838j908l802j4665Q891p699q327
13509b2909J016n998K3674J3642j6584J7537J5888p365n303j2067k594K0091m110
13496A4918J298K859n7J0377k0146K912j2982k9829m2503p198L7746K1504P015
13483a4086J1710j9328j0340M0820P447R977J063N100j2565j8138k5442J7665
13471f117K1058j0882r42R18m342o135J0390J0430j6978m140m552r097k25J5792
13457d822J838L1424r266k8777k989j0983k3774q564J4426K2181K5408K3805o249
13444B3658j0335Q532r67j2218j6209k484k335r422j5812r803K3888L312K2048
$$ y = [-9307, -20459, 23874, 24350, -5616, -31040, -10926, 21641, 19790, -9956, -9080, 4959, -1021, -1427, -127, 18160, 9294, -29165, -23468, -11237, 4601, 2693, -1109, -15774, -6883, -14582, -22909, -21893, -27891, -4217, 9425, -7159, 10378, 26266, 18901, 13598, 1531, -1063, 19028, 14918, 16216, 19075, 19018, 29395, 9249, 12161, -821, -30650, -73153, -80351, -42605, -21101, -14086, -2376, -21704, -32044, 8776, 16223, 26200, 27263, 32363, 19798, 1660, -23782, -6117, 14941, 4059, 3117, 4035, -307, -6442, 3948, 14378, -2600, -6740, -11292, -20389, -20614, -4822, -2984, 28440, 19174, -9603, -12592, -23575, -47349, -55913, -41487, -19306, 6102, 29907, 23658, 13323, 21855, 20888, 8670, -7539, -10023, -12358, -21780, -37592, -47395, -23507, -20195, 1853]
13431A853L1376N337P156l152j8226j7887J140q476J5026j7186R780m9491k3656
13418f6406J2272L6178K6001j4319j0278Q765O248r130L8220L823Q222J4563j8705
13405C5454k8281J1829M679J8873n310k0537J500j0329k9678k6726J8656J2395
13393a7475J0624K0467N745K71L222l4251J3882J430o813k025K3231j6186j1953
13380i831L891O608J3305J1793K503R886R207j4247n760j6488n487J6996j4376
13367H000k5200j9805p162n503K2108m838J775L6992j5450k0508L984l1939m307
13354f1853L4218l357R429J4679K5780J1874l1893l9244J3438K5436P72J3905
13342A3184P655K4293M030j0833o16j2893j8456k3950q495L438k768Q85j5556
$$ y = [1853, 33229, 38566, 45722, 42570, 24344, 6457, 7597, -879, 14147, -3039, 6741, -42750, -66406, -54134, -17956, 8045, -6274, -16552, -7787, -1539, -10669, 27551, 31374, 39596, 54159, 35454, 7173, 19002, 23681, 42554, 37244, 16707, 18207, 7878, -21800, -48526, -29870, -17475, -6851, 13616, 19361, 19632, 22854, -11397, 2485, 3915, -2898, -4923, 18308, 2122, -9831, -5940, 668, 13973, 25766, 28269, 38155, 47362, 33115, 27355, 10867, 5380, 22376, 8000, -17200, -37005, -44167, -49670, -27562, -32400, -30625, 6367, -9083, -29591, -25607, -57546, -61853, -27635, -30992, -21563, -6884, 18896, 30770, -1123, -40367, -26929, -1493, -721, 13184, 20839, 45132, 49162, 38329, 37713, 24820, 6364, -17586, -26081, -22643, -25411, -24526, -40082]
13329d0082R609K4461M872J9776o241p60R548j5772N154K3642k7921O498M5738
13316E8522J7730k0992l342R854N890k2396l6434k9778j0707k2p160k5912J301
13303f3446K4903M9889K1298Q250j0339m1082n479o673J5984J9010J1249m283
13291A9281L234Q15j3778k957p906J3026R429J6156J4827j1449l0754k7038L3541
13278A6427J1572j131j2629r954J2569r6k9700j1873l727J726R97K1149J3824
13265I154j3050k2123P937L2822J5743j7552j8551J512K5147n826j4865m062P030
13252C316j4579j9210p509N519j4327p17L375R876L0272J3501o892p08K8395K2653
13238E2965k0716J329j14r003K330j9566l4944r253R64L724L1706J3337J1765
$$ y = [-40082, -30473, -6012, -1140, 18636, 12395, 11635, 21183, 5411, 10565, 34207, 6286, 12784, 58522, 76252, 55260, 51918, 61772, 67662, 45266, 8832, -20946, -31653, -31675, -38835, -64747, -63446, -38543, 11346, 32644, 40894, 30555, -10527, -16006, -22679, -6695, 12315, 23564, 19281, 22515, 23330, 9552, 6595, -1311, 11715, 21144, 37300, 52127, 40678, 9924, -17114, 16427, 27999, 26868, 14239, 4285, 16854, 16758, -12942, -24815, -28542, -26816, -25819, -4670, 9154, -3896, -26019, -18082, 14740, 30483, 12931, -5620, -4108, 21039, 15213, 348, -3714, 3316, -11263, -30473, -37982, -32463, -46790, -47507, -44132, -34256, -3984, 9517, 2625, 1917, 30312, 52965, 32249, 33578, 33464, 24461, 26791, 7225, -27719, -36972, -36008, -32284, -578, 12759, 24524]
13225B4524J9731j8800j9453k0339j6517L072J2044o899j8042j2204l517K3401
13213c2999j4219o470L1085P293J1831j7809j3212k179J1258J2924j6818j2378
13201d1693m067K5423M4887n281m333j9474J547J7863j7381m96l216J5155o94
13188H240K665P755k2164k5707J6412K0748l991R593l131M842p609K624N261j0571
13174D967p128l960L3736j0550j1841p048K391r340L3265J0319p04r414j7260
13161G433j3183J2022J0687j6754k045o290j2465K5133J8226k5058j4584k0448
13149c7326o130L1831n589R863q56j0824n622J0049L136K822k0363j2370O27J6324
13135b4428j1182L6820K8425m215j3144j4554k1886M740K5533J3967p872O765
$$ y = [24524, 44255, 25455, 6002, -14337, -30854, -27782, -15738, -22637, -40679, -52883, -56400, -32999, -47218, -53688, -22603, -15310, -3479, -21288, -34500, -36679, -25421, -12497, -29315, -41693, -45760, -20337, 24550, 19269, 14936, -4538, -2991, 14872, -2509, -3005, -6221, 8934, 8240, 10905, 18660, -3504, -29211, -12799, 7949, 3958, 13551, 10420, 15262, 7653, 10277, 15538, 4967, -2161, -6121, 27615, 17065, 5224, -1824, 567, -8773, 24492, 34811, 34107, 24693, 7433, -5750, 6272, 16959, 205, -1840, -8130, -20595, 4538, 22764, -2294, -16878, -37326, -43456, -11625, -17214, -7351, -8207, -19031, -24653, -14604, -11468, -8646, -29009, -41379, -40752, -24428, -35610, 1210, 29635, 25420, 12276, -2278, -24164, -19424, 6109, 20076, 12204, 18969]
13123A8969N65n966L0108Q909j2402n2711J2593J4502J4393K2159J5219k6782
13111C9556l0904J6457l5k2542k5659J3291O513L3288K3203K0292N837m197j3422
13098F1678k1535p538q46k7973j6821m886j7761j1588K6885K8055k8542o462J1421
13085a5913Q949j2623j0201M899J3334J007j6445n84m942J971K1888J9902l042
13072H200k9977k624K9753P827j4454k8196L129J5131o932j2285J5178J2707K2231
13059A9688j8971j7493j4278K3865K7640N289p298j7984M3824J3405k5417k7871
13047D399K638J0003J5566j1233k5764J376k3050n489K4096K8655J7432j1282
13035B7347N633k0741j5361j8618N989P030O965J4139j673j1122l6126j4994J571
$$ y = [18969, 19534, 13568, 43676, 52585, 40183, -12528, 65, 14567, 28960, 51119, 66338, 39556, 8652, 25109, 25074, 2532, -23127, -9836, -3323, 29965, 53168, 73460, 79297, 75100, 61678, 40143, 32605, 31759, 3786, -13035, -17921, -35682, -47270, -20385, 7670, -20872, -27334, -15913, -6964, -19587, -29788, -24889, -11555, -10548, -26993, -27577, -32519, -30548, -8660, 11242, 8200, -21777, -24401, 5352, 13179, -1275, -29471, -26342, -11211, -18143, -30428, -15250, -2543, 19688, 717, -16776, -31054, -7189, 20451, 25740, 18442, 458, 44282, 57687, 32270, 4399, 7037, 17040, 32606, 21373, -4391, -3015, -26065, -31554, -7458, 21197, 38629, 27347, 32980, 12239, -3122, -21740, -15751, -8721, -1756, 12383, 10710, -412, -36538, -51532, -49961]
13022d9961J1676N389j5634J9651L1189J0282K0722K6528j0491M276J2772k8383
13010C8016j7273l2882j2966M0534J7518N009j9003l2424m480j9014K1597J9604
12998D236J2104K1047J6260Q299j9325l6051j9451q931J7092K102j2107J462K0865
12985G602J9191J0334m1390k5538J3755k825Q515j12O59Q622K419p96j0528K6280
12971A6188m89j7286P177O722j9360j3183J5353J3624J9166J1177n297o033q430
12958A9329J8956J9824o3179o7961l367P110N3507J357L1218l778j145j2366l2015
12945c2510j8532j7075K774K3561Q892p037J9365K913p751k0696K5828K3628r535
12932f175J5715R437k1551j215k0636P366L4290J1461l029K26n497l7329K7921
$$ y = [-49961, -38285, -32896, -48530, -28879, 2310, 12592, 33314, 59842, 49351, 53627, 66399, 38016, 20743, -12139, -25105, 15429, 32947, 37956, 18953, -13471, -17951, -36965, -15368, 4236, 16340, 37387, 53647, 61946, 42621, 6570, -12881, -21812, -4720, -2618, -14725, -13263, 7602, 26793, 37127, -4263, -29801, -16046, -18871, -10356, -10468, -9809, -1187, 1232, 436, -10092, 16188, 15699, -1587, 5590, 12312, -7048, -20231, -4878, 8746, 27912, 39089, 33792, 27759, 19329, 38285, 58109, -5070, -73031, -76398, -69288, -15781, -14424, 16794, 13016, 11871, -495, -32510, -51042, -68117, -65343, -41782, -32890, -39927, -20562, -17649, -25400, -46096, -20268, 3360, -6175, 9540, 18977, -2574, -3789, -24425, -17059, 17231, 28692, 25663, 25889, 20392, -16937, 10984]
12919A0984L800k1690j1482j6780L5447J1074J854n449q362j3101j8076n222J7042
12906a9961K4682j5476m2691n374P490K6229J4267j442r996m363l436J5891m68
12893a4648m765L571l193j5755n625R998L2382K0776j8018l256M4r518j4172J2388
12879i791M379K7492j535M772j823J1812O654l2786j4117k194k3997k736k0732
12866e4602K2120O646L5554O331l3834l09J5588j0280J6143N4343K481l4272j7270
12853H639R404M5400j6618k5427J1250j3574j3690N1629K387l4550o552k298R288
12840B5288k208j0492j5910L932P606p930m6765Q614k2597j2094K6420K2529p795
12827c1402L2722J9361q578K3169m390k8909P452K4914q387l8878j4605J321k3947
$$ y = [10984, 14784, -6906, -18388, -35168, 279, 11353, 13207, 7758, -604, -13705, -31781, -37003, -19961, 4721, -10755, -53446, -58820, -51330, -25101, -10834, -12276, -22272, -26635, -30071, -14180, -14648, -19413, -15842, -19035, -34790, -40415, -30417, 1965, 22741, 4723, 1467, 1511, -8007, -22179, -9791, -5412, 22080, 20545, 25317, 23494, 35306, 41960, 9174, -4943, -7137, -31134, -33870, -54602, -32482, -25836, 9718, 16049, -17785, -18094, -2506, -12786, 3357, 57700, 60181, 25909, 8639, 18043, 63443, 46825, 21398, 32648, 19074, 5384, 57013, 59400, 24850, 18298, 16000, 25288, 23080, 12588, -3322, 610, 8216, 286, -46479, -37865, -60462, -72556, -46136, -23607, -31402, 1320, 20681, 12103, 35272, 30882, 1973, 9425, 34339, 25952, -12926, -27531, -26210, -50157]
12814e0157P731M9228R629n966l0164n266Q226O359J4179O598K1736o14J4799
12801D6318m406J350Q02k3846k6108j1519l354j8954o059R597M113j2163M426
12788c9803L0341K721K2648J5128p78r343n119K868j2195q26J0827R54J0852J1905
12774D0180L179J0439k8176k6694j2532l13k043m403L897P192L1180j5874P157
12761A3189M0180M4134j535k4973p238j4073k0705j3513l656k1728j588M1336
12749B9830n30M6454p013l2800r904K8825R573p203k0175j0189J45O777J4393
12736D8183L4282M2998k202l0236k6038J0376J6722J9732K1940K5442K7196K1883
12724B10278j6395l0579o036J2294J555j7091o604q393j3797k1929k6990J5163
$$ y = [-50157, -42426, 6802, 16431, 10465, -19699, -24965, -16739, -10380, 3799, 10397, 32133, 31519, 46318, 41912, 43262, 44064, 20218, -5890, -17409, -20763, -39717, -45776, -36179, -32066, -44229, -39803, -9462, -6741, 15907, 31035, 30257, 20914, 15795, 18663, 6468, 5642, 16469, 17423, 28275, 40180, 43359, 53798, 25622, -1072, -13604, -13917, -15960, -20363, -16466, -9274, 21906, 6032, 13189, 53369, 97503, 95968, 70995, 63757, 49684, 28979, 15466, 11810, -9918, -11506, 29830, 29300, 75754, 68741, 35941, 26037, 54862, 64435, 57232, 37057, 26868, 27013, 33790, 48183, 82465, 125463, 123261, 93025, 66987, 77363, 94085, 113817, 135757, 161199, 188395, 210278, 193883, 163304, 157268, 169562, 171117, 154026, 147422, 139029, 125232, 103303, 76313, 91476]
12712I1476K2176Q35J0110j2049J6482Q174J0403J024m273j2894J5225L7479Q667
12699A92835K4563J5125j4900j7589n985J5381Q436o553J7926N821m2592l4838
12687A57630L1914Q638j0605K0408P415m029K0224l2191m1202j7949l0025j7135
12675I3093n561j9514k0661k1789l0739J2235L8815J9979q60O5519M3074k5191
12663A48400J0445L0582O847j8463j260N463l2978m2065J6853q97l5139j8136
12651F9652l4052n372J2812K246n725q633K145J616J0888j4720k1849J3619P375
12638C0002j1417j9491M050J8533k318J9741k2029k5448n634P360k848L0727M5049
12625F6277j2794k7056j9603j4074N916m806j5512p195J2892r953J7794K1117
$$ y = [91476, 113652, 114487, 124597, 112548, 129030, 137204, 147607, 148631, 144358, 131464, 146689, 184168, 192835, 217398, 232523, 217623, 200034, 194049, 209430, 217866, 211313, 229239, 235060, 192468, 157630, 189544, 198182, 187577, 207985, 215400, 211371, 231595, 199404, 158202, 140253, 110228, 93093, 87532, 68018, 47357, 25568, -5171, 7064, 45879, 65858, 64998, 130517, 173591, 148400, 158845, 189427, 196274, 177811, 176551, 182014, 149036, 106971, 123824, 122927, 87788, 69652, 35600, 30228, 43040, 45286, 39561, 30928, 33073, 34689, 45577, 30857, 9008, 22627, 30002, 18585, -906, 3144, 21677, 19359, 39100, 17071, -8377, -14011, -6651, -9499, 21228, 66277, 53483, 26427, 6824, -7250, -1334, -6140, -21652, -28847, -15955, -25908, -8114, 13003]
12613A3003J2992k008K9736M552j7832l383K1283N422q451j7468j843J6208r439
12600D2772j459j3527k4590L892m450K4722K4481L824k6860j5166M556r917n14
12587G764j2264J0393L472n125J790L275j098J4312K487k5600j3867J879O476
12574f106j0641m70J5430P162R638K0364m015j7981j501p771M520J9390q123Q888
12560B8784q056l776k6934K0632K351k3646P027N416k1219m429M490j8484L2782
12547e062N409j4800J8945K4746J350N762J9727n840K8985K4427k1275o480j365
12534G4529k2018K1882j1443m1478k0861N850m524n763K584J0933L3433J4280
12522E7404j8406m8182L862J0901J229J3828K0001j2669j0814K2501r621k251
$$ y = [13003, 25995, 23987, 53723, 58275, 40443, 37060, 58343, 63765, 55314, 37846, 36003, 52211, 42772, 41313, 27786, 3196, 7088, 2638, 27360, 51841, 55665, 28805, 13639, 18195, 8278, 7764, -4500, 5893, 9365, 4240, 6030, 9305, 8207, 22519, 25006, -594, -14461, -12582, -6106, -16747, -17217, -1787, 5375, 15013, 35377, 31362, 13381, 11880, 4109, 8629, 28019, 19896, 28784, 20728, 16952, -9982, 10650, 13001, -10645, -3618, 1798, -19421, -23850, -19360, -37844, -5062, 347, -14453, 4492, 29238, 30588, 36350, 56077, 50237, 79222, 103649, 82374, 75894, 74529, 52511, 74393, 62950, 21472, 611, 6461, 1937, -3826, -1242, 9691, 43124, 57404, 38998, -9184, -5322, 5579, 6808, 20636, 40637, 27968, 17154, 39655, 30034, 27783]
12510B7783P672P129j1380J5341p333n21K8454L529j1793K3488J3804q045k2297
12497F5831j9759J0710k910l9416j6818L635l5721k2725L2199K179L799K7809
12485H813J2236M197R664Q063K3796J0499l4968K866J1444k197K5423l7363k031
12472D0442K191J880J6694j9692k4883J7528J7985j6818J4476m381k6999K5586
12460D4009j4507j8299m294J8887K1332Q889j529j525j7460P05J7793k5376J5096
12447D3721J4751j8441j63N041J5589K6590K514J850j5977r893O547p041o320
12434E8768J0431J0502k686p303r183N547N53O979r802k7076j6667q775R382J3976
12420C4646K7659K0693n200K0243L4512K7952O922K8103J4817k5423j4560J6848
$$ y = [27783, 35455, 42584, 31204, 46545, 39212, 38691, 67145, 70674, 58881, 82369, 96173, 88128, 65831, 46072, 56782, 53872, 14456, -2362, 1273, -34448, -57173, -24974, -22795, -18996, 8813, 21049, 25246, 34910, 42973, 66769, 77268, 42300, 45166, 56610, 54413, 79836, 42473, 40442, 42633, 44513, 61207, 41515, 16632, 34160, 52145, 35327, 49803, 45422, 18423, 44009, 29502, 11203, 6909, 25796, 47128, 56017, 54488, 52963, 35503, 36208, 54001, 28625, 43721, 58472, 40031, 39868, 44909, 60498, 87088, 89602, 91452, 75475, 65582, 72129, 65088, 58768, 69199, 79701, 77015, 69712, 60529, 66076, 66629, 73608, 63806, 36730, 20063, 11288, 20670, 34646, 62305, 82998, 77798, 98041, 132553, 160505, 167427, 195530, 210347, 184924, 170364, 187212]
12408A87212j8751j231k0795o564k1242r26k0950K4971M488K6794P939l4940p059
12395A18946J3190k991J753j831J2784l1282j6557P018l1946R622N1529P921k8726
12382A09430J2997J0437J7079O0043K9425k0142q219O009j3820L778k2840K089
12370A86266K5630j5339J9908J4407o158k3724k3905r958R999J9911J8480k4452
12358A91065M59J6239N002p54O269K7276L9128K3252J643K9140J9464R953j0265
12345C57871J3038P697k1480j0946k1882J5603N1260J9444L2316L4638J3982k589
12333D88952K1201J6713J6691J3890Q299K0441J9357K0209N8777P9285O4318N9985
12321H88118O5214Q3358J12399J38028J21599J18685Q9193N3191M0048L9938L1758
$$ y = [187212, 168461, 167230, 146435, 139871, 118629, 117703, 96753, 121724, 126212, 153006, 160945, 126005, 118946, 132136, 129145, 130898, 129067, 141851, 110569, 94012, 101030, 69084, 78706, 130235, 138156, 109430, 122427, 132864, 149943, 209986, 239411, 219269, 211050, 217059, 203239, 207017, 184177, 186266, 211896, 196557, 216465, 230872, 224714, 200990, 177085, 167127, 177126, 197037, 215517, 191065, 191524, 207763, 212765, 212011, 218280, 245556, 284684, 307936, 309579, 338719, 358183, 368136, 357871, 370909, 378606, 357126, 346180, 324298, 339901, 391161, 410605, 442921, 477559, 491541, 488952, 510153, 526866, 543557, 557447, 565746, 586187, 605544, 625753, 684530, 763815, 828133, 888118, 953332, 1036690, 1149089, 1287117, 1408716, 1527401, 1616594, 1669785, 1709833, 1749771, 1781529]
12310A781529J2391L8355R5775J45224J36555J54374K03232K62533L10420L78364
12300C518752M44950N25590O37450P85282R70500J182902J438882J833247K334323
12291A3671878K824611L383637L757939L719277L088282J765294J36198j435397
12283C0911719k499956k968569k900258k596141k152535j717669j238944q07906
12275A4029741m21263j04830K21468N00656P83028R25639R46037R35121R67888
12266A8783485J024455J250506J558246J779367J887619J907823J828286J839155
12258C1858942J903620K021906K054573J763832J087163M3716j017727j848742
12250C7867283k230652k246799j955185j601318j148604q29505p62862q19736
$$ y = [1781529, 1793920, 1832275, 1928050, 2073274, 2209829, 2364203, 2567435, 2829968, 3140388, 3518752, 3963702, 4489292, 5126742, 5912024, 6882524, 8065426, 9504308, 11337555, 13671878, 16496489, 19880126, 23638065, 27357342, 30445624, 32210918, 32347116, 30911719, 28411763, 25443194, 22542936, 19946795, 17794260, 16076591, 14837647, 14029741, 13608478, 13503648, 13725116, 14225772, 15008800, 15934439, 16880476, 17815597, 18783485, 19807940, 21058446, 22616692, 24396059, 26283678, 28191501, 30019787, 31858942, 33762562, 35784468, 37839041, 39602873, 40690036, 40733752, 39716025, 37867283, 35636631, 33389832, 31434647, 29833329, 28684725, 27855220, 27092358, 26272622]
12242B6272622j044207j281946j334932j224889j002733q24408p35946p20860
12234A8102701p49161p30968o32803l72465j2566L78149Q91327J463294K022202
12225B0359710K731745L381394L806279L761870L060011J567875m25889k321732
12217C5921263l627070m166593m146669l749486l216425k672610k153442j713530
12209A0475438j416654j200178r91989q29895o84819o00348m82302l99910l17150
12200C552193l10693k68046k50039k06552j64984j38086j45353j55339j18581
12191A794520j15529j09156n3838r0360q7148q9704q7202o9005n2431j2837n7516
12180I69794m2282m9965o2998m7371l5102k4065j474l5498m819K3147j0650n8225
$$ y = [26272622, 25228415, 23946469, 22611537, 21386648, 20383915, 19559507, 18823561, 18102701, 17353540, 16622572, 15989769, 15617304, 15604738, 15982887, 16874214, 18337508, 20359710, 23091455, 26472849, 30279128, 34040998, 37101009, 38668884, 38242995, 35921263, 32294193, 28127600, 23980931, 20231445, 17015020, 14342410, 12188968, 10475438, 9058784, 7858606, 6866617, 6036722, 5351903, 4751555, 4269253, 3869343, 3552193, 3241500, 2973454, 2723415, 2516863, 2351879, 2213793, 2068440, 1913101, 1794520, 1678991, 1569835, 1515997, 1425637, 1338489, 1248785, 1161583, 1092578, 1040147, 1027310, 969794, 927512, 877547, 814549, 767178, 732076, 708011, 706537, 671039, 666220, 689367, 678717, 620492]
12168F20492n0523j9144j3975P946L621j8888j5823k3867o875J4883K1834n2182
12156D67499o2045j5662J689l003l97Q189k0498j9990k026l7679j4177K6881j7164
12143C11617k5268j4959K6504o403o313J1811L0026L1078k7146k0613j8073j2744
12131B79517j9172J2278Q764J6854n465l5607n739P5J7588n467J0329j36k1616
12118B52203L395J0736k9676k3188k1003j377M797l834j553M1509o426J8392N5649
12105B99624J8875m5539k8773j4268R088j6758j0419L5863K9219K3304K1619j9412
12093C02423j8707L695O313K2210m374k3834m4789k8204j6809k472j8434R544
12081A86562O257k6970k0750j0983j6747P365j489j3551j7102r565J6204J6773
$$ y = [620492, 569969, 550825, 536850, 544796, 548417, 529529, 513706, 489839, 482964, 497847, 519681, 467499, 405454, 389792, 391481, 388478, 388081, 396270, 375772, 355782, 353756, 316077, 301900, 328781, 311617, 286349, 271390, 297894, 291491, 285178, 296989, 327015, 358093, 330947, 310334, 292261, 279517, 260345, 272623, 281387, 298241, 292776, 257169, 251430, 251505, 269093, 263626, 273955, 273819, 252203, 255598, 266334, 236658, 213470, 192467, 191090, 195887, 192053, 190500, 232009, 225583, 243975, 299624, 318499, 272960, 244187, 229919, 239007, 222249, 211830, 247693, 276912, 300216, 321835, 302423, 283716, 287411, 293724, 315934, 311560, 287726, 242937, 214733, 197924, 195452, 177018, 186562, 192819, 165849, 145099, 134116, 117369, 124734, 123245, 109694, 92592, 83027, 99231, 116004]
12069A16004N504j8169J5725J2199K726l2174j2087j3181q456K0501Q130R397
12057A06119J7468J2858j3507j3688k8666j5621Q288K9771J0577j1279n465J0929
12045A07784o011N414j963j541Q641p798n108k104j1169j954O687K1927n396o526
12031A00883l7358l2962N65K728J961l845n816J49K7802L7154L0223p121k0983
12018I3380L425M887K0590j5856j9164J4233p281J144J1852N686O062k6802l017
12005H9139l929j9880L3366L6854p567m97r62N2842n619k0404j3841n325K3407
11992A57584K9458P778j9451K397m256J4981P089l0287Q803J5278M9623K1543
11980B60540k2356j562J5791K018o458j1657j8516l861k3419l0171o136R08p643
$$ y = [116004, 121508, 103339, 119064, 131263, 133989, 101815, 89728, 76547, 68091, 88592, 96722, 106119, 123587, 136445, 122938, 109250, 80584, 64963, 73251, 103022, 113599, 102320, 96855, 107784, 101773, 107187, 105224, 103683, 112324, 104526, 99418, 97314, 86145, 84191, 90878, 112805, 107409, 100883, 63525, 30563, 31128, 33856, 35817, 31972, 26156, 26305, 54107, 91261, 121484, 114363, 93380, 96805, 101692, 122282, 106426, 87262, 101495, 94214, 95358, 107210, 112896, 118958, 92156, 89139, 85210, 65330, 98696, 135550, 127983, 127486, 126524, 179366, 173747, 153343, 139502, 134177, 157584, 187042, 194820, 175369, 177766, 173510, 188491, 195580, 165293, 174096, 189374, 238997, 260540, 238184, 236622, 252413, 254431, 247973, 236316, 217800, 213939, 190520, 160349, 154213, 155121, 147478]
11967A47478K2313p077J7469J6808j3985j9785p682q963L1067O531L0584K2714
11955B37472j6554l6519j8748j3917q168L4329P0014J7830q108J0887O789k021
11943B73286k9865K042j5662l3427k2821j6472j5753j8338K6654K4206m335n1310
11931A18205Q150K3471j5783l0610n773K359K4402j4232L696J5621P773r268J2228
11918A40239L6254J1944n937Q87J6507l587k1839j7209j2120k2118l0792j6625
11906G5604j5847L725N029J2445j1817j9010p104k428N515J9257k9390k1155j4150
11893F74O968M269o124l970j4055K4534K4517L1099o206l5655k915K4435K3611
11880G1182j0860o458P087M955K2669J978j4060j5695J1294J3958p247j6675n95
$$ y = [147478, 169791, 162714, 180183, 196991, 183006, 163221, 155539, 146576, 177643, 184174, 214758, 237472, 220918, 184399, 165651, 151734, 143566, 177895, 247909, 265739, 257631, 268518, 275307, 273286, 243421, 245463, 229801, 196374, 173553, 157081, 141328, 122990, 149644, 173850, 169515, 118205, 126355, 149826, 134043, 103433, 97660, 100019, 124421, 110189, 113885, 129506, 137279, 128011, 140239, 176493, 188437, 182500, 183387, 199894, 196307, 174468, 157259, 145139, 123021, 92229, 75604, 59757, 63482, 68511, 80956, 69139, 50129, 43025, 40597, 46112, 65369, 35979, 14824, 674, 7642, 11911, 5787, 1817, -12238, 12296, 36813, 67912, 61706, 26051, 23136, 47571, 71182, 60322, 53864, 60951, 65906, 88575, 90553, 76493, 60798, 72092, 86050, 78803, 62128, 61533]
11867F1533j9030o457J152p035M870j8911j102N911j8964P884M5100J0923K1248
11854H7122k8767k7622K2801L6166Q165J1859N285K629L4984k888k6486q604J9459
11841A34103K4377M571M055j0153j0206j8310j7070J4419r736K1941K8317k1754
11829A44554q435R156L4305O5l4193j1263k3529J246K2901K4761R50J3256K0350
11816A94124K1588j125n986M6164M8783j3585j2839j1304l1718q799k1450J3692
11804B17545M187k9732l3201j4963L4153M992l074j3739J558J9302P7M393m208
11791A87290m368l452l9979j2435K0317j7237j965R077J2285L4299K3097K3816
11779B30745K2005J5262K178J7737l614l6683j6939j3073j1489m618r78k3102
$$ y = [61533, 42503, 36046, 37198, 30163, 35033, 16122, 15020, 20931, 1967, 9851, 54951, 65874, 87122, 58355, 30733, 53534, 89700, 97865, 109724, 115009, 117638, 152622, 149734, 123248, 114644, 134103, 158480, 163051, 167106, 156953, 146747, 128437, 111367, 125786, 116050, 137991, 166308, 144554, 136119, 145275, 179580, 179645, 145452, 134189, 110660, 111906, 134807, 159568, 160518, 173774, 194124, 215712, 214587, 208601, 254765, 303548, 289963, 277124, 265820, 234102, 225303, 203853, 217545, 221732, 192000, 158799, 143836, 177989, 182981, 179907, 166168, 167726, 187028, 187105, 191498, 187290, 182922, 179470, 139491, 127056, 147373, 130136, 128171, 137248, 149533, 183832, 206929, 230745, 252750, 268012, 270190, 287927, 284313, 247630, 230691, 217618, 206129, 201511, 200533, 177431]
11767A77431l8097k5682j0499r166o370k7360l653L7996R922k4806L733j9873
11755F3576L556P491j0964m034O486j2099o712j0503J5547j5239j0941L0568O978
11742F3710M61j4684k576K0796M0893L1779j9701N1m087q465L5594k428l1410
11729A09933K24j6256p178r588k7173N521L9329p072j9072j1703O348M6380K7899
11716A37592j5223k2257j7278j5198j2675Q449J9294L7362N453l956k2516N219
11704A04266k078J7375M335j0813L433n603l1220l0939L1752L6138M3575J135
11692A61356m1525R600K67J633K8762K1384L2667L6656L3613k4807j1351O7102
11680C15357N7476j8633n4222l8409m602L1148r703l1851l25K753Q946j4907q094
$$ y = [177431, 139334, 113652, 103153, 93987, 87617, 60257, 56604, 94600, 104522, 79716, 83449, 63576, 67132, 74623, 63659, 59625, 66111, 54012, 47300, 36797, 52344, 37105, 26164, 56732, 63710, 64171, 49487, 46911, 67707, 108600, 140379, 120678, 120729, 116642, 108177, 143771, 141343, 109933, 110157, 93901, 86723, 77135, 49962, 55483, 94812, 87740, 68668, 56965, 63313, 109693, 137592, 122369, 100112, 82834, 67636, 54961, 63410, 82704, 120066, 125519, 121563, 99047, 104266, 102188, 119563, 123898, 113085, 116518, 110915, 79695, 48756, 80508, 116646, 160221, 161356, 119831, 129431, 129698, 131331, 160093, 181477, 214144, 250800, 284413, 259606, 248255, 315357, 372833, 354200, 299978, 261569, 256967, 288115, 278412, 246561, 246236, 248989, 257935, 243028, 234934]
11667B34934m1523P726K0889j326l129n121L128K0870L3990M952K888j8362k0883
11654B39033o536O446K1265l4608j9960K2279R298O731k5551K8533M2254k196
11642B86988r809k4220M571J8301n795L5146J8502j7919N695n785K8042K0005
11630C53722j1109J1185O386J2701P596M462J7612n417l658L777K1265M3909L9382
11617E01813L0888L9262J661J1546N3748M0895N113M0071M9418Q2306J03779J05370
11605A065870O7917L3389L9982O1971O4870M7553J6234l065k7618j2066l025M294
11593A356306N493K486O038N6210O0017N7982N9271N3502M0177Q9421J18879J28229
11581B034011J43591J63106J54809J41453K00558K33808K46742L14928K94348
$$ y = [234934, 193411, 201137, 222026, 220700, 217571, 212450, 215578, 236448, 270438, 275390, 278278, 259916, 239033, 232497, 238943, 260208, 225600, 205640, 227919, 237217, 243948, 218397, 246930, 289184, 286988, 277179, 252959, 257530, 275831, 270036, 305182, 323684, 305765, 311460, 305675, 333717, 353722, 342613, 353798, 360184, 372885, 380481, 384943, 402555, 397138, 393480, 397257, 418522, 462431, 501813, 532701, 571963, 573624, 585170, 638918, 679813, 684926, 724997, 774415, 856721, 960500, 1065870, 1133787, 1167176, 1207158, 1269129, 1333999, 1381552, 1397786, 1394721, 1367103, 1355037, 1352012, 1356306, 1361799, 1364285, 1370323, 1426533, 1486550, 1544532, 1603803, 1657305, 1697482, 1786903, 1905782, 2034011, 2177602, 2340708, 2495517, 2636970, 2837528, 3071336, 3318078, 3633006, 3927354]
11572C927354L89850M54257M63694N97851O82553P91441R33174J117114J336830
11563A0694118J592526J928414K248642K552196K799863K930366K848110K464824
11555C0059059J694213P33388l24024j347830k035773k380323k354295k108969
11547B1935446j749634j385265r71307o20346l30383r355K78022M69346N88636
11538A8205160P15011P58051Q37499Q99002R68577R84226R20705Q51250P83732
11529B5923213P32700P62374R35842J178538J426013J610383J598556J320212
11521C5487831Q74688K74953l56828q40037j186347j348038j414409j439868j494681
11512B8557264j566766j576693j542291j455911j328075j217459j123023j022054
$$ y = [3927354, 4317204, 4771461, 5235155, 5833006, 6515559, 7307000, 8240174, 9357288, 10694118, 12286644, 14215058, 16463700, 19015896, 21815759, 24746125, 27594235, 30059059, 31753272, 32486660, 32162636, 30814806, 28779033, 26398710, 24044415, 21935446, 20185812, 18800547, 17829240, 17208894, 16878511, 16869156, 17147178, 17616524, 18205160, 18920171, 19678222, 20515721, 21414723, 22383300, 23367526, 24288231, 25139481, 25923213, 26655913, 27418287, 28354129, 29532667, 30958680, 32569063, 34167619, 35487831, 36362519, 36637472, 36280644, 35440607, 34254260, 32906222, 31491813, 30051945, 28557264, 26990498, 25413805, 23871514, 22415603, 21087528, 19870069, 18747046, 17724992]
11504A7724992r34428q12933o64424m58814k55178R862K61604N72129R39933J300220
11494A7682963J604471J882153J997080J940843J534615Q59332M4311q80317j684213
11485B4981238k204703k408095k408787k249223j992462j733713j512895j268239
11477I203121j077265r26184p65363o48787n73613m71406m26784l78844l34120
11468C600755k95327k82561k38018j81726j86999j64137j21147j16007j11721
11459A903112j09555r8628p3123p7458r1640o9328l5941o4950q2583o7278n0506
11448A082122m3677o7511o987P395k5097l0140k1814m3535k0346l3684n4678l8882
11436G03166Q777j7608n6675m0090J3938n495l4630k6519k3355q338J7841K6257
$$ y = [17724992, 16790564, 15977631, 15313207, 14854393, 14599215, 14609077, 14870681, 15442810, 16382743, 17682963, 19287434, 21169587, 23166667, 25107510, 26642125, 27501457, 27545768, 26665451, 24981238, 22776535, 20368440, 17959653, 15710430, 13717968, 11984255, 10471360, 9203121, 8125856, 7199672, 6434309, 5785522, 5211909, 4740503, 4313719, 3934875, 3600755, 3305428, 3022867, 2784849, 2603123, 2416124, 2251987, 2130840, 2014833, 1903112, 1793557, 1694929, 1621806, 1544348, 1452708, 1383380, 1347439, 1282489, 1199906, 1132628, 1082122, 1038445, 970934, 963947, 971342, 946245, 916105, 894291, 850756, 830410, 796726, 742048, 703166, 711943, 694335, 637660, 597570, 611508, 606013, 571383, 544864, 521509, 513171, 531012, 557269]
11424E57269J5936m6891l3360J5972k5490l2461k922l4005o582J0047q011M65
11412D09967k2811o48k948j4613o841q463m607Q376k3944k1311k7302J412O316
11399B92583k425J8933J8372L6097N321k1586k1902k2845k207j0276j0561O617
11387B86121q58j2101p074j9120J9007J1336O798r86k2176k0091J0997K063J0788
11374B64704N828k5030k2033k9676Q853J1097m084q341L6107j5061Q68k722j1840
11361B08670L2367J4549l9393k2200J3204J83j1862k7847K1761L683K6209k7001
11349A92323k1986l631m048L4431m138m1933j5687j930K6996L4121n24j6727n7459
11336A19808k6727j5409L3332k8796k2089K7348K096J5144K367k567L402L540
$$ y = [557269, 573205, 526314, 492954, 508926, 483436, 450975, 448053, 414048, 407466, 417513, 409502, 409967, 387156, 386508, 383560, 368947, 362106, 353643, 349036, 357412, 333468, 312157, 284855, 286267, 292583, 290158, 309091, 327463, 363560, 368881, 347295, 325393, 302548, 300341, 290065, 279504, 286121, 285263, 273162, 266088, 246968, 265975, 277311, 284109, 283123, 260947, 240856, 251853, 253916, 264704, 270532, 245502, 223469, 193793, 202646, 213743, 209659, 201318, 237425, 222364, 223232, 220510, 208670, 241037, 255586, 216193, 193993, 207197, 207380, 195518, 167671, 189432, 193115, 219324, 192323, 170337, 166706, 162658, 197089, 192951, 151018, 135331, 133401, 160397, 194518, 193994, 177267, 119808, 93081, 77672, 111004, 82208, 60119, 87467, 89563, 104707, 107074, 104507, 107909, 111449]
11324A11449q900O619K816N95L3516n15k5191k3894l6345K6843J1855J6621j249
11311A14220k078p93J461k398j4154L927O666k3445j1376j5779q619J4176L3757
11298I5565q14k473k3299j0871J0492J688m9K0084j1819j8206n561N706L1357
11285I1800J8076j4321j6407P61M286j8924K3874K3444q739j1598K830k3544Q800
11272H0338k850q367l1799P403J4159j6482R160J7811j1725J049Q515j2090l6923
11259A8199K0652L2631N074k2834K5597J8467k830%J203j32k7044j4218L2964
11246H7729J6654j9951q206j4801j0775l507j286r56K3337P919k8288j2069l3601
11233B199j8470p64j7947L6507K6865R778K8526j7216q937o013J3899J8321j9473
$$ y = [111449, 102549, 109168, 111984, 112579, 146095, 145580, 120389, 96495, 60150, 86993, 98848, 115469, 114220, 112142, 111349, 112810, 110412, 96258, 100185, 106851, 83406, 72030, 56251, 47632, 61808, 95565, 94751, 92278, 68979, 58108, 68600, 70288, 70239, 90323, 78504, 60298, 54737, 60443, 91800, 109876, 95555, 79148, 79909, 84195, 65271, 89145, 112589, 103850, 92252, 95082, 71538, 80338, 77488, 69121, 37322, 44725, 58884, 42402, 51562, 69373, 57648, 58697, 67212, 55122, 18199, 38851, 71482, 76556, 53722, 79319, 97786, 94956, 94956, 96159, 96027, 68983, 54765, 87729, 104383, 84432, 76226, 61425, 50650, 47143, 45857, 44901, 68238, 76157, 47869, 35800, 2199, -16271, -17035, -34982, 1525, 28390, 38168, 66694, 49478, 40541, 34528, 48427, 66748, 47275]
11220D7275p338p603J3574O312j1535J0024L9182L1107n146L65k428l5391m2809
11207C5589m825K6177K2946m684j6992j005K1000p585l3572j3857K1335Q81P691
11194E3099j8098l2411j9413K1178L4197L880j3892k56m403L654q717J1619Q355
11181C8792J8360J7785j9171l3219j3522Q862J8129K099J3444P865p925k2745
11169B8754J2141L977N825k7241o074p526J2042L0066J9440m6K9281l0515k3459
11156D6665K83J1440Q786m724k6711j8921R949O91J7751k8440n793K6885k5403
11143A2458K7009L3979R927r162j5305K925K1860j0707j6064N952p008J8237r862
11130F4239J6363Q475j9344j515J3872j248K0951J7600L5744N9014j2356L329
$$ y = [47275, 39937, 32334, 45908, 52220, 40685, 50709, 89891, 120998, 115852, 116217, 113789, 78398, 35589, 30764, 56941, 79887, 75203, 58211, 57206, 78206, 70621, 37049, 23192, 44527, 45408, 53099, 35001, 2590, -16823, 4355, 38552, 42432, 28540, 28284, 23881, 27535, 18818, 30437, 38792, 57152, 74937, 55766, 22547, 9025, 17887, 36016, 38115, 51559, 59424, 51499, 28754, 40895, 44872, 50697, 23456, 17382, 9856, 21898, 51964, 71404, 71358, 100639, 70124, 46665, 46948, 58388, 67174, 62450, 35739, 16818, 26767, 27458, 45209, 16769, 10976, 37861, 12458, 39467, 73446, 83373, 74211, 58906, 61831, 83691, 72984, 56920, 62872, 55864, 74101, 64239, 80602, 89077, 69733, 68218, 82090, 80842, 101793, 119393, 155137, 214151, 201795, 205124]
11118B05124O609l4282k9466n49J2043m09k5118j6479l2452Q440M3245n149o204
11105A25353L898j8270n067j1125J3477L7499j2288j3449k8533L1461M9120K4706
11093A96782J1910r728j1805j7310P021L168l741n093p502r594Q620J9154j2826
11080A69056J6337j1528K1890r467j2490k193k2197J5L321j1173m7820l6073k363
11067E5315M5917j2712j8630k4287l447L5778L7942J1992j4535M009R702j1313
11055A15731L305J2384O100j6767q338J4165M356k2065k9721j0293j511k3770
11043D3576l3334p833j746J1870J7954J1680J1735l4739k6305N527l39p512J4758
11030E292k676M062K1520j1814j0709O893R82j766O587L6436M887m5677m422L4439
$$ y = [205124, 211733, 177451, 147985, 147436, 159479, 159070, 133952, 117473, 85021, 93461, 136706, 131557, 125353, 129251, 110981, 105914, 94789, 108266, 145765, 133477, 120028, 91495, 122956, 172076, 196782, 208692, 198964, 187159, 169849, 176870, 180038, 176297, 171204, 163702, 154108, 162728, 181882, 169056, 185393, 173865, 195755, 186288, 173798, 171605, 149408, 149423, 152744, 141571, 93751, 57678, 55315, 101232, 88520, 69890, 45603, 42156, 77934, 115876, 127868, 113333, 117342, 127044, 115731, 119036, 131420, 137520, 120753, 112415, 126580, 130936, 108871, 79150, 68857, 67346, 43576, 10242, 2409, 663, 12533, 30487, 42167, 53902, 19163, -7142, -1615, -1954, -9466, 5292, 2616, 6678, 28198, 16384, 5675, 12568, 13550, 11784, 18371, 54807, 59694, 14017, 9595, 44034]
11016D4034k1736j5594j1171N148l322O688j770J4979L6990q116n3405j1609j8833
11003c7717r235K1140J5342J2780K1503N48k9641O577J7181O975m4260q173L1756
10990D776N219k347r700k5940N015N2012J5034j8269K714j1229l58J5848j7799
10977A4976j6733j7440J8185Q561J0417J6803J2265j1838j6261o466q819P817
10965A1467J3106l842n550P677K5321J913k8j3078l3831j4409J9995J4296j4038
10952H999o892j2323o01K0083K8041L382j4233j0838n043j3395q387k1064j8721
10939e0992K1029J8780K3083J9156k6451l6533J45L86m560K374M2607K8710m1804
10926d070j2659J397R489J7823j0006J3374L6527J5365p912j5548m0053k3336
$$ y = [44034, 22298, 6704, -4467, 681, -2641, 4047, 2277, 17256, 54246, 46130, -7275, -18884, -37717, -46952, -25812, -10470, 2310, 23813, 24361, -5280, 1297, 18478, 25453, -18807, -26980, 4776, 9995, 7648, -2052, -27992, -22977, 29035, 44069, 25800, 28514, 17285, 16927, 32775, 14976, -1757, -19197, -1012, 7549, 17966, 34769, 47034, 35196, 18935, 12469, 3650, 11467, 24573, 20731, 15181, 22858, 48179, 50092, 50064, 36986, 3155, -11254, 8741, 23037, 8999, 2107, -10216, -10817, 9266, 37307, 40689, 26456, 15618, 10575, -2820, -11207, -32271, -50992, -29963, -11183, 11900, 31056, 4605, -31928, -31783, -31397, -35957, -33583, 9024, 37734, -4070, -16729, -15332, -5843, 11980, 1974, 15348, 51875, 67240, 59328, 43780, 3727, -19609]
10914a9609m839L581K3635N327k5126k4335J4925M277J3955Q240q318L2672J0454
10901C4839j7358l2215o806J3086q69l2480J1998J6804m44k0417l901K9165j194
10888i792j603K875O734J3395Q537n749l1627n956q108m018M3971l9798l0108
10875f1247j4554K1268J5197P144n435J4631j2762j4528j1903L4009L6227j474
10863F573m444J1782o093r894k2349J6257J1936Q19J3708l379l2179M58K3705
10850F900K9666J6230L65J3780j9445n6212j0658J2855K5604J4448p892j3007
10838A2634Q236p729J159j2559J0674J7387m648k9359k0758m428k6177J5911l21
10825c9978q906O137R582K0483L138J2004J0070k3068l110r346j8682o090K5117
$$ y = [-19609, -24448, -20867, 2768, 8095, -17031, -41366, -26441, -22164, -8209, 31, -8287, 24385, 34839, 17481, -14734, -21540, -8454, -9323, -41803, -29805, -13001, -13445, -33862, -37763, -8598, -9792, -11395, -8520, -1786, 11609, 20146, 14397, -17230, -23186, -31294, -35312, 8659, -31139, -61247, -75801, -54533, -39336, -32192, -37627, -22996, -35758, -50286, -62189, -28180, 8047, 6573, 2129, 13911, 7818, -2076, -24425, -8168, 3768, 4587, 18295, 14916, -17263, -16805, 6900, 36566, 52796, 53161, 66941, 47496, -8716, -19374, -6519, 19085, 33533, 25641, 12634, 20870, 13141, 14300, 1741, 12415, 29802, 25154, -4205, -24963, -29391, -55568, -39657, -39978, -48884, -42747, -33165, -12682, -9544, 2460, 12530, -10538, -13648, -22994, -41676, -47766, -22649]
10812b2649L4587k3056r066J9796l756J2392K7273J0834J428k9152k2706l6210
10800d0285Q129K5447J7955l2768r640K6870K3112j112j4574k3899m35R682J132
10787a0386J2339M1510M759j8476k1742K286l862k4923j4620J6320J7631L9753
10775D0589m5499n7616M0473Q739j8942M19K0497J3146J9830R088l3519k8223
10763c1018k0001J9607L7463J6211J5854k9232Q915K0148j2793m617m814k1969
10751f246J3885j5567m650m402J1438j914r206j978k4967j487K6625r41j1252
10738c0662k829K0499R710J9853J1954r779o985k6615k2618L3465j1263j8336
10726c3606J6880n712k0561m152j870K237K1520J8547J688L833J5761L487l1006
$$ y = [-22649, 11938, -11118, -20184, -388, -4144, 8248, 35521, 46355, 47783, 18631, -4075, -40285, -32156, -6709, 11246, -21522, -31162, -4292, 18820, 17708, 3134, -20765, -21200, -11518, -10386, 1953, 43463, 48222, 29746, 8004, 10290, 6428, -18495, -33115, -16795, 836, 40589, -4910, -62526, -22053, -13314, -32256, -31837, -11340, 1806, 21636, 30724, -2795, -31018, -51019, -31412, 6051, 22262, 38116, 8884, 17799, 37947, 25154, 20537, 15723, -6246, 7639, -7928, -12578, -16980, -5542, -7456, -16662, -18640, -43607, -45094, -18469, -19410, -30662, -33491, -12992, -3282, 16571, 28525, 18746, 11761, -14854, -37472, -4007, -15270, -33606, -16726, -22438, -42999, -47151, -49021, -46784, -25264, -6717, -5029, -1196, 14565, 18052, -12954]
10713a2954M44R057k0577k5613K5019J5893o232r086J141J2084J6153M4319N026
10700E4674k7388j0051K7409R421m0341l9733j1029J9008J0001j4077j0105M470
10688b7741J9952M46k418k6798n92K2807L0590k1888l1321K3021L1968J502N115
10675B4643l063l1147k0570j3549J6598J3358m540K0445Q256j3603M645K4341
10663B5814n555k6791m4475l6356P612L0718M4429j4165J8729J0943l858j9915
10651a2870J401M171j6257j8799O035N909j034J709k0849r79M35P020J2539j052
10637c2621J2108j5824j5669J1040N560j4765Q677J2375K6434k0941J0828K8616
10625A5818q49j7336k1394j9501J7875O609m344K2392K7683l7569j7592L8889
$$ y = [-12954, -12510, -3453, -24030, -49643, -24624, -8731, -14963, -24049, -22908, -10824, 5329, 49648, 54674, 27286, 17235, 44644, 54065, 13724, -26009, -37038, -18030, -8029, -22106, -32211, -27741, -7789, -7343, -9761, -36559, -37151, -14344, 16246, -5642, -36963, -13942, 18026, 19528, 24643, 21580, -9567, -30137, -43686, -27088, -13730, -18270, 2175, 10431, -3172, 1473, 25814, 20259, -6532, -51007, -87363, -79751, -49033, -4604, -18769, -40, 10903, 7045, -12870, -11469, -7298, -23555, -42354, -36319, -30410, -31444, -29735, -50584, -51563, -51128, -44108, -31569, -32621, -20513, -36337, -52006, -40966, -35406, -50171, -41494, -29119, -2685, -23626, -12798, 15818, 14969, -2367, -23761, -43262, -25387, -18778, -23122, -730, 26953, -10616, -28208, 10681]
10613A0681J694n866M327p468j2894k013j7826j4165J5087J2300R894o536k4317
10600c7102R958q742n861J520j534K8099L5299K462j6309q607K1497J8121k7540
10587A1261m7526n066L792J7548Q795Q997Q545p151k138j4949J2302k041n15j0324
10573a8470k419j1980j5551K2415p524P28M2251N622k4410k2533P406N840K9829
10560A1204J1500J2002n996r888n436Q319n070K4543j01l364K74j9342J2457J8296
10546D9398j4656j3000J816J1341m272P883n941q820j6364j7063O980j8958m460
10533b6116q006j3929K7179O691j2218O39J4780j4774j1589O713O363O850L0214
10520A2797L3868j9438m8724M30p132p272p472N026n638K4336L0242J9078J8050
$$ y = [10681, 12375, 6509, 10836, 3368, -9526, -11539, -29365, -43530, -28443, -16143, -6249, -12785, -37102, -27144, -35886, -41747, -40227, -41761, -13662, 21637, 24099, 7790, -817, 20680, 38801, 11261, -36265, -41331, -37539, -19991, -11196, -2199, 6346, -805, -2943, -17892, -5590, -7631, -8146, -18470, -20889, -32869, -48420, -26005, -33529, -32801, 9450, 15072, -9338, -31871, -24465, -18625, 11204, 22704, 34706, 28710, 18822, 13386, 21705, 16635, 41178, 41077, 37713, 37987, 18645, 31102, 49398, 34742, 21742, 23558, 34899, 30627, 38510, 32569, 23749, 7385, -9678, -2698, -21656, -26116, -34122, -48051, -20872, -14181, -26399, -25760, -10980, -25754, -37343, -30630, -24267, -17417, 12797, 46665, 27227, -21497, -21067, -28199, -35471, -42943, -37917, -43555, -19219, 11023, 30101, 48151]
10507D8151j141k9019k7334K0979J1863k6805j5605r630j9022R133j1829j435
10495e1694P988K1584K1707J7750j2439j9998M584l214P033L230K2828K4839j0606
10482C3592J5142J3761l7682l5756P803J4843k4671K1783P785J342L0733j2020
10470C6655k3675J0587o718k6851R970o366j8037O897J3014l195r109J2652k5225
10457b9401K693K9621j072k7100j6017K0451K5975j9385N490J3613K3683l562
10445B4989J2187J2986n525l4791k2217k3469m740J9463R071k804O415l50o617
10432a5402K6244j397l1078J0779J4860J587J5508l56Q659k4452n37n697K2071
10419B0789p027k3091k53j8681j5658Q266J7432k7792n519M154J902R805n118
$$ y = [48151, 47010, 17991, -9343, 11636, 23499, -3306, -18911, -28541, -47563, -38430, -50259, -51694, -43706, -22122, -415, 17335, 4896, -15102, -10518, -13732, -6699, -3469, 19359, 44198, 33592, 48734, 62495, 24813, -10943, -3140, 11703, -12968, 8815, 16600, 17942, 48675, 36655, 12980, 23567, 16849, -10002, -32, -6398, -24435, -17538, -4524, -7719, -16828, -4176, -29401, -26708, 2913, 1841, -25259, -41276, -20825, 5150, -14235, -8745, 4868, 28551, 24989, 37176, 50162, 44637, 9846, -12371, -35840, -40580, -21117, -12046, -14850, -8435, -8785, -15402, 10842, 9445, -21633, -10854, 4006, 5593, 21101, 20745, 29404, 4952, 4415, -1282, 20789, 13762, -9329, -9582, -28263, -43921, -35655, -18223, -46015, -51534, -47380, -45478, -35673, -40791]
10406d0791k0693k9827J1936N4364K1335j7401k3430J9060M0206L1118P25j1072
10394C5530n4J5481J7204j6671j7647N867L9407J6208j8823l9643p490K807n013
10381B7163j462j0819k5196k052j7108j6544j2878J3969n267J1445n600J3645
10369c0704J5860j2085J6138M3522K0226j2870k3320l324r471j0003J7613R055
10357B0637K551K0068l273j2736K4801l134p907J2814K212l6905L577J3326j7913
10344A8118l7008J8654J8129l0P978p021l2567o946p157j4270L8M1937q932k6581
10330c5658j2195J4801J2923J6137m027j2068j726o455j0986L1394j4925J5718
10318g067J7891j5850j923r789K4798k159L760M054j5464O361J5078J2768J0862
$$ y = [-40791, -61484, -91311, -79375, -25011, -3676, -21077, -44507, -25447, 14759, 45877, 46602, 35530, 35476, 50957, 68161, 51490, 33843, 39710, 79117, 95325, 76502, 36859, 29369, 32176, 27163, 25701, 14882, -10314, -12366, -29474, -46018, -58896, -44927, -50194, -38749, -44349, -30704, -14844, -26929, -10791, 32731, 52957, 40087, 16767, 13443, 3972, -6031, 11582, 20637, 23188, 43256, 39983, 27247, 52048, 48914, 41007, 53821, 56033, 19128, 22705, 36031, 18118, -18890, -236, 17893, 17863, 25841, 18820, -13747, -20693, -27850, -42120, -42082, -145, -9077, -35658, -47853, -33052, -20129, -3992, -8019, -20087, -21813, -28268, -39254, -7860, -22785, -7067, 10824, -5026, -6949, -16738, 8060, 5901, 9661, 13715, -1749, 4612, 19690, 32458, 43320]
10305D3320j8950k3189l1148k560J5553K4707J5244k2614n393j5553q615j7171
10293d6369J5730R654L2828k9387l0423n460K0927M2751M2527K1045j0518n844
10281E7461q07l5177j9620j9503J1307J4166J828j9846j973K0428M144k3014L60
10268a0246j4301j0435K1340q309J29n964j2873j0398j0321l834K6266J7654K080
10255a9212J1718J5598J3022j6279K3J496l613j7044k0276k3191j6581j088m214
10242g9641J9434J1796q112J9618M2086j1097j5073K7934R334j1099M769k7634
10230a7685O384K4144q228j3430k1425K070m100l791M190J9972J1784j4942n34
10217a5591K1652J2510l2025l5227J8570K5907k314Q909J3632j2701j2264j5817
$$ y = [43320, 24370, 1181, -29967, -32527, -16974, 7733, 22977, 363, -5030, -20583, -29198, -46369, -30639, -20985, 11843, -17544, -47967, -53427, -32500, 10251, 52778, 73823, 63305, 57461, 56654, 21477, 1857, -17646, -6339, 7827, 9655, -10191, -12164, 8264, 12408, -10606, -10246, -24547, -34982, -13642, -21951, -21822, -27786, -40659, -51057, -61378, -65212, -38946, -21292, -19212, -7494, 8104, 21126, 4847, 4870, 6366, 2753, -14291, -34567, -57758, -74339, -75427, -79641, -60207, -48411, -56523, -36905, 5181, -5916, -20989, 6945, 16279, 5180, 9949, -17685, -11301, 12843, 4615, -8815, -30240, -28170, -32270, -36061, -31871, -11899, -115, -15057, -15591, 6061, 18571, -13454, -48681, -30111, -4204, -6518, 2391, 16023, 3322, -8942, -24759]
10205b4759P289K8906k458j7199M403L0525K5347j1249l7690M37O923J3452j4966
10192H961j4361q949K2595o040j4827k8320k310L4040K0656j6689j3913J0289
10180h868J885n811j7523J7919k2103R864k6183p730l001k1297K1123J7775R117
10167c4833o505J6082K7465k1567k4309M804K5156o46p56K57k1258l948P830K4053
10153h175K7042O466m996m5224J5550L2911K8268n406m3341j9771N218n780J1316
10140e922J3366j7578K3279L0682r775j6358j4082j6837R049k6194k3039j1899
10128f5308L9508L2935k1042k9955J2458P22k2499K1780l463J5109K4748k0609
10116a5616j3297L2233O136K1116j1022J1556k7867l6907L3732K8047j3007k2865
$$ y = [-24759, -17470, 11436, 8978, -8221, -3818, 26707, 52054, 40805, 3115, 3552, 10475, 23927, 8961, -5400, -14349, 8246, 2206, -12621, -40941, -43251, -9211, 11445, -5244, -19157, -8868, -6983, -12794, -30317, -12398, -34501, -24637, -50820, -58550, -61551, -82848, -61725, -43950, -34833, -41338, -25256, 2209, -19358, -43667, -38863, -13707, -14353, -15109, -14852, -36110, -40058, -32228, -8175, 18867, 25333, 20337, -24887, -9337, 23574, 51842, 46436, 3095, -16676, -11458, -17238, -5922, 7444, -10134, 13145, 43827, 34052, 17694, 3612, -13225, -4176, -30370, -53409, -65308, -25800, 7135, -13907, -43862, -31404, -30682, -53181, -31401, -34864, -19755, 4993, -15616, -28913, 3320, 9456, 30572, 19550, 31106, 3239, -33668, 64, 28111, 15104, -7761]
10104g761k4460N890J7648j2403K2856K1681J3783R876l1694K9310j681k9957
10092A3088l2276k3491j9253k6685p913K4369J3727q898K989K6833J3964J7451
10080f095O30J2678K575P734N800j5175k1390k8164J8820M3545L6758K0414n0019
10067B8111l3412k4053l1491O098K9677K196J0569K943K376r776j1697k043O825
10054b3677K7064K6540J8308p81m4064l3232l559j2784O411j276M2602J6275N334
10041B3161J511l1497k5354J832L0754J2468N725J988l2557q911K6746k9365l5407
10028e8906J5287j3976j1469M996J7487P597K012L3963J9751m4173j9503N799
10016d1135O252L041N018j3047N944n019l411J4702R794K7071J1821J4075m1447
$$ y = [-7761, -32221, -26331, -8683, -21086, 1770, 23451, 37234, 47110, 15416, 44726, 43045, 13088, -19188, -42679, -61932, -88617, -96530, -72161, -58434, -67332, -64343, -37510, -23546, -6095, -5465, 7213, 9788, 17522, 23322, 8147, -13243, -41407, -22587, 20958, 57716, 78130, 28111, -5301, -29354, -60845, -54747, -25070, -22874, -12305, -9362, -6986, -16762, -28459, -30502, -23677, 3387, 29927, 48235, 47454, 3390, -29842, -33401, -46185, -39774, -41050, 1552, 17827, 23161, 24672, -6825, -32179, -30347, 407, 12875, 18600, 20588, -11969, -20880, 5866, -23499, -58906, -43619, -57595, -69064, -64068, -46581, -38984, -36972, -3009, 16742, -27431, -46934, -41135, -34883, -31842, -26824, -39871, -33927, -38946, -42357, -27655, -17861, 9210, 21031, 35106, -6341]
10003f341j3810m336j192K8599J2331k8688m9n13p820l5083k393K9746M1745j0802
9989A394k7727o113K736o279j4070p852J3941K4074N643j3368m5773p52O672K3412
9975d4062K3339l1685k213K2538J1585L6121R475k7339m2098L052P985l939M0345
9962C104L9388J7392k8486j4029K0417o771P52k4447j3288K0785K7175j3333k1742
9949F917p681q153l4051P795O518Q678r8J0162N567J0664P783k7957N572k089
9935a0373j2522L2937K6791k5844m738K2601N194l1219l3354J8095K6087K110
9923A5765k0764O65j1112k5928j015J9446J4559K1399O323k5465P572K5721K308
9910B9474p514k3620m2411O976L8556K4901n849k0817P214L898q702Q937K3220
$$ y = [-6341, -20151, -24487, -25679, 2920, 15251, -13437, -13486, -13999, -21819, -56902, -59295, -29549, 12196, 1394, -26333, -32446, -29710, -35989, -50059, -57911, -43970, -19896, -14253, -27621, -73394, -74146, -67474, -44062, -20723, -52408, -54621, -32083, -20498, 15623, 25098, -2241, -44339, -41287, -33302, -37241, 3104, 42492, 59884, 31398, 17369, 37786, 31015, 31767, 7320, -5968, 14817, 41992, 28659, 6917, -764, -8917, -42968, -35173, -28655, -19977, -20075, -9913, -4346, 6318, 14101, -13856, -8284, -10373, -22895, 10042, 36833, 10989, 6251, 28852, 34046, 2827, -30527, -12432, 13655, 15765, -4999, -4334, -15446, -41374, -42389, -22943, -8384, 13015, 19338, -6127, 1445, 27166, 29474, 21960, -1660, -44071, -37095, 1461, 26362, 20513, -304, 6910, 10808, 2106, 11043, 34263]
9897C4263m999k0834o05l7258N131O206J8149K308O939j2732J2026J9247K337
9884C0178j6816j4608M189k0895R276L1902k855k0287q997Q860j3568j5306J2066
9871a6861J0772K707k4146K7448k437j9364j2015p548J2975J6301J4480j0079
9859g767K6313J4186J1901q11k6832l5966o457J9097M333k0530J4424k947m418
9846a5474j3738k8905j7254k016K3036Q629K5096L3300l539Q964K983q590k4526
9833a2034q970o614j1906k0348L2125M0309r240l1272R027J7494P452J0455k365
9820A4113P945K1107J3639k302l7139k4795Q994K037l5483J0259k8265K0533K5181
9807d176K582m247k6959J3898n932J860J7323o559j1693p644l0806l299j1019
$$ y = [34263, 29264, 8430, 7825, -29433, -24302, -18096, 53, 2361, 9300, -3432, 8594, 27841, 30178, 13362, -1246, 2943, -17952, -8676, 23226, 20371, 84, -8913, -53, -13621, -28927, -16861, -6089, -3382, -27528, -80, -2517, -21881, -33896, -41444, -28469, -12168, 2312, -7767, 18546, 32732, 44633, 43822, 16990, -18976, -25433, -6336, -2003, -22533, -8109, -11056, -15474, -29212, -58117, -75371, -77387, -54351, -45722, -20626, 12674, 9135, 18099, 21082, 12492, -12034, -21004, -27618, -39524, -59872, -27747, 12562, 3322, -27950, -18923, -1429, 6023, 16478, 14113, 22058, 43165, 56804, 54502, 17363, -7432, 1562, 3599, -31884, -21625, -49890, -29357, -4176, -1594, -5841, -32800, -18902, -24834, -22974, -5651, -12210, -23903, -31547, -62353, -65652, -76671]
9794g6671j0718J8976L5802N159J0493K9289M690O169K607l4398j7677p303k322
9781c5904L920o391K9378J109n811O365J7048L6981k2119r247j4411J0022j3719
9768b779J1485J3602J4183m857k3484r885l0829o097L4848k873k0159j6666J3097
9755c0414K1200J9482R19l0288M178Q064J0805J1669j0441n854k048l4354Q590
9742b8492N600J8687j1721l4013j3767J7638J8248K3337J0425j2607l349J5524
9730E510q281j5432k7119n870K4325L3909o071K29j925J4372P105P569m1084O678
9716f085J5558M486k4855N07J2839M52J4237l0014j4022M894K7766p021q272j1364
9702b0894k4620P810L843M415J0109J2326O560K005O363J0986J7491j2466k5053
$$ y = [-76671, -87389, -68413, -32611, -27452, -16959, 12330, 17020, 23189, 25796, -8602, -26279, -33582, -35904, -31984, -38375, -8997, -7888, -13699, -7334, 9714, 46695, 24576, 15329, 918, 10940, -2779, 8706, 22308, 36491, 31634, 8150, -1735, -32564, -38661, -3813, -6686, -26845, -43511, -30414, -9214, 10268, 11187, -19101, -14923, -6859, 3946, 15615, 5174, -680, -2728, -37082, -28492, -22892, -4205, -15926, -49939, -63706, -46068, -27820, -4483, 5942, -6665, -10014, 5510, -2771, -18203, -45322, -51192, -26867, 7042, 971, 1200, -725, 13647, 20752, 28321, -12763, -6085, 9473, 13959, -10896, -10389, 2450, 2902, 17139, -12875, -26897, -22003, 5763, -1258, -9530, -20894, -45514, -37704, -33861, -29446, -19337, -7011, -451, 1554, 7917, 18903, 36394, 23928, -1125]
9689a125j7582m376K011j9260m232j8276m45J0570K7685q480k4360R703k3173
9676g1340j0403L2060J719K4763O2786O152j5013L703K1790k4069m7283Q336q135
9663a4934j327n248j5423l1195K0941M4485Q154J99l555O829n7l058K7665m1053
9649g577n3238j5578J9886J9081j3282k5934q237K232J6603K2638J0608J9462
9637a3336k723k4809o45J3901J0301K2683K1465n985J994J3187j7241k2664k6544
9624c0416J0840k0144j7688J2564J9880J3294k7786J2089p735j1778k1300K5861
9612d2319J8047P305k3289J7313K0546j4186l1226r358r071j8376m230K0852J3526
9599e4466M095J4312K7825r673r945J1777k2024M707J7397l905J7689K2193J2857
$$ y = [-1125, -18707, -23083, -21072, -40332, -44564, -62840, -63285, -52715, -25030, -33510, -57870, -48167, -71340, -81743, -49683, -47964, -23201, 39585, 45737, 30724, 34427, 56217, 32148, -15135, -6799, -14934, -16261, -21509, -36932, -68127, -47186, -2701, 5453, 5652, 2097, 8926, 8869, 5811, 33476, -7577, -60815, -76393, -56507, -37426, -50708, -76642, -84879, -82647, -66044, -43406, -32798, -13336, -16059, -40868, -41513, -27612, -17311, 5372, 26837, 20852, 22846, 36033, 18792, -3872, -30416, -19576, -39720, -57408, -44844, -24964, -11670, -39456, -27367, -35102, -46880, -68180, -42319, -24272, -16967, -40256, -22943, -2397, -16583, -47809, -57167, -66238, -84614, -88844, -67992, -54466, -50371, -36059, -8234, -17907, -27852, -16075, -38099, -33392, -15995, -19900, -2211, 19982, 32839]
9586C2839K4767J5200Q648n9936k5315j6119j4318k801P084r721L6148k2053q57
9573b6434M027k371q251L30K9891m463l68K6375j5886k4473P422r909l1527j0237
9559f5874K636N309J0728k11L1623K5042j5969j5422O941K2227Q44p961k1554
9546b1641k979Q209J2157R710p358l1689N888K2759l591J5360q981k4297J7645
9533h808K2356j2586j4530L973L9386J4178k1259j2824J7557k3624k8712J1947
9521a2946K6255P727l8368K04J4690P886k0213R05q639J6095J3033j990R417j8468
9507d412L821j9333J8677K2390r230j1022J104P911L145j3537q535l6446j9712
9494f5179L3258L1912Q740L901j0284j3086j6446R719J4575o965n553J9870j5084
$$ y = [32839, 57606, 72806, 81454, 21518, -3797, -19916, -34234, -37035, -29951, -39672, -3524, -25577, -26434, -22407, -24778, -33029, -32699, -2808, -7271, -7639, 18736, 2850, -21623, -14201, -24110, -55637, -65874, -63238, -57929, -47201, -47412, -15789, 9253, -6716, -22138, -15197, 7030, 7874, -87, -21641, -24620, -16411, -4254, 5456, -1902, -33591, -27703, -4944, -8535, 6825, -2156, -26453, -8808, 13548, 962, -13568, -9595, 29791, 43969, 22710, 9886, 27443, 3819, -24893, -12946, 13309, 21036, -17332, -17128, -2438, 5448, -14765, -13860, -22499, -6404, 6629, 4639, 14056, -4412, -591, -19924, -1247, 21143, 11913, 891, 1995, 9906, 13051, -486, -9021, -45467, -65179, -31921, -9, 8731, 12632, 2348, -10738, -27184, -17465, -2890, -9855, -15408, 4462, -10622]
9481a0622R88K3703k4480m965J2514R955j1219K6908o463l1452q978P223M703
9468a2185o29n653r36j3340k591o87L3248j7797k498J6885m907L302M710q030
9454a1108j6465Q727J9603j2551M220K66j0485l9599O866M0684O271k7172j8201
9441d8944j1278J3715P422J404q89N016L4059M7017k4413m6546k8526m98K7564
9428b4897L7484j1138r350n463j3906o253j1240l291K7749J2519j3683l5245j5578
9415g2292L9705J9428j289K5650N758J495j4036j3237l999N417j7992p854J9568
9402a3678L1809J2403O50N205j3824l2317J5646o533n369J1496J1047J6864j9992
9389A3407J3785L8761k5567j6667k7438j1797j1997j08J3866O256J07k057j9212
$$ y = [-10622, -9634, 14069, -10411, -15376, -2862, 7093, -4126, 22782, 16319, -15133, -24111, -16888, -12185, -12814, -18467, -19403, -32743, -35334, -36021, -2773, -20570, -23068, -6183, -11090, -7788, -3078, -11108, -27573, -18846, 757, -11794, -7574, -7308, -17793, -57392, -50526, -9842, -3571, -30743, -48944, -60222, -46507, -39085, -37681, -38570, -33554, 505, 47522, 23109, -23437, -51963, -52461, -24897, 12587, 1449, -7901, -13364, -27270, -33523, -44763, -48054, -20305, -7786, -21469, -56714, -72292, -32587, -13159, -14448, 11202, 16960, 18455, 4419, -8818, -12817, -7400, -25392, -33246, -13678, 18131, 30534, 31184, 36389, 22565, -9752, 5894, -639, -6008, 5488, 16535, 33399, 13407, 27192, 65953, 40386, 23719, -3719, -15516, -27513, -27621, -13755, -7499, -7392, -9449, -28661]
9376b8661j690J7418K8981N633r331M0342J8285l149p515J2760J6710K3201N8942
9363A71926M4950K0155N2642M4309J00466J02475O6655J48198J81842J88147K07604
9352A329369J70248R7167M2964J9515k2201j18013j79966k11437j74426j57119
9342G96101j74897j13730n2477p0640n1453o5912m5589l6198j0176m1748o555
9331A26726J2680k989r268l4403j6311J4935k0029R650K897k9061q549j5975k720
9318B7583j9029k0752J9025J0176j258o399J7023o654j9860K3710J4707j4892
9306B3380j2241k0669o624P61J9747J6255l0634k1221k6024j0172K0626N3097
9294F281L3797k7145l9629N629l542O763O602j1067l467J2165K2904j4826o35
$$ y = [-28661, -30351, -12933, 16048, 21681, 12350, 52692, 70977, 67828, 60313, 73073, 89783, 112984, 171926, 216876, 237031, 289673, 333982, 434448, 536923, 603578, 751776, 933618, 1121765, 1329369, 1499617, 1596784, 1639748, 1659263, 1637062, 1519049, 1339083, 1127646, 953220, 796101, 621204, 507474, 454997, 384357, 332904, 266992, 221403, 185205, 175029, 133281, 126726, 139406, 136417, 127149, 92746, 76435, 91370, 71341, 80991, 83888, 54827, 46278, 30303, 27583, 8554, -12198, 6827, 17003, 15745, 9346, 26369, 19715, -145, 23565, 38272, 23380, 11139, -9530, -16154, -15393, 4354, 20609, -10025, -31246, -57270, -67442, -46816, 6281, 40078, 12933, -26696, -21067, -24609, -17846, -11244, -22311, -25778, -13613, 9291, -5535, -6170]
9281f170K288k593J0718j3029r134J3504r036O525J7549j7136m4470l3171M463
9268g9692K106J3772j0221J2518L003P527N502K43L2273Q276J6212j542J1784
9255B1761l3113k6039M21J5245o172j9243J1238O263J5132L872k6006J5565J531
9242a9545J809J8418j1328j5359J3961r255k8161j3277M1331K9993K7332J1948
9230D7867l6386k2082q478L3059K5225j5326k8400J9996o561L574J5316j535N466
9217C1735K179q248M781k203L655J6620M0109L4134L0929J4564K4724P0951Q4938
9204C48868K9584m1063p1024q1497o7790m3269o206p058o96P4M727l2418o1225
9191b8993j7269K9162j0672k3554M308R040J0273k2595P301J2058K6513K2445
$$ y = [-6170, -3882, -6475, 4243, -8786, -17920, -4416, -13452, -6927, 10622, -6514, -50984, -84155, -79692, -77586, -63814, -74035, -61517, -58514, -50987, -45485, -45242, -12969, -4693, 11519, 9977, 21761, -11352, -37391, -36970, -21725, -27897, -47140, -35902, -29639, -14507, -10635, -36641, -21076, -19545, -17736, 682, -10646, -26005, -12044, -21299, -49460, -62737, -21406, 8587, 35919, 47867, 11481, -10601, -19079, 13980, 39205, 23879, -4521, 15475, 8914, 12488, 27804, 26269, 31735, 33914, 25666, 30447, 28244, 31899, 48519, 88628, 122762, 153691, 168255, 192979, 263930, 348868, 378452, 337389, 266365, 184868, 117078, 73809, 67603, 60545, 59849, 59923, 64650, 32232, -28993, -46262, -17100, -27772, -51326, -47018, -37978, -27705, -50300, -42999, -30941, -4428, 18017]
9179A8017J0099m032j2920j8295k3117r549K4020r22K7690M3668R482l4300m068
9166B5773K2027k47o344j9038j4572N680K5102J333n939K0347L588p918J0958
9153F0750L9841J5456l6256J2807J7156P028K4243M5300J6275k174K2049O164
9141B28639q59O116k9227m5932k9511k592k6346q665L979o615m615J7478R897
9128A11747K3572j0662L382L1129K5491J6066M6797L8514K6041P9920O5525N7696
9116E15218M6361P6206J24211J75847K63289L75255O62900J203033K122609L561244
9106I126173M458414J512972k798040l894427k945635j756111j030587o09355
9098B063404m03353l01855j93420j24963j01741q6667m1554Q889j7089o0776k6888
$$ y = [18017, 28116, 24084, 11164, -7131, -30248, -39797, -15777, -16699, 10991, 54659, 64141, 29841, 25773, 47800, 47553, 41209, 22171, 7599, 13279, 38381, 39714, 33775, 54122, 57710, 49792, 60750, 100591, 116047, 79791, 92598, 109754, 116782, 141025, 186325, 202600, 200426, 222475, 228639, 227780, 233896, 204669, 158737, 129226, 126634, 100288, 91623, 95602, 88987, 84372, 101850, 111747, 135319, 124657, 128039, 159168, 184659, 200725, 247522, 286036, 312077, 391997, 457522, 515218, 561579, 637785, 761996, 937843, 1201132, 1576387, 2239287, 3442320, 5564929, 9126173, 13584587, 15097559, 12299519, 8405092, 5459457, 3703346, 2672759, 2063404, 1660051, 1358196, 1164776, 1039813, 938072, 851405, 809851, 818740, 801651, 740875, 713987]
9087G13987J6209L6307K8955m7498p2657k7629L8958P1949J08723M2630l3670
9076H76264n4071p9098o8479n7083n1472o7243p1357n2882r718k9685p7056q508
9064B49612m844J5466R704n270O090M445L961N097J8335j335K6537L8814j3074
9051C53538j8329j5900p055n823j9581K0945M4364k0146j3524r499j7387J0246
9039C01849J1182N3423M6087R306L4231O2055O0330O9858O7259N8498P5033R808
9027H58919p0243m5542m1521m0547L783K4379r52j1860m787K976o092J4017N4171
9014G36701M6417N7627P5286M3246N7037J18195J62921K12995K61934L49094M02189
9003B523642L29460R0238k22026k81708k02528j45101j22613q1649j4058R992
$$ y = [713987, 730196, 766503, 795458, 747960, 675303, 647674, 686632, 758581, 867304, 909934, 876264, 822193, 743095, 674616, 617533, 566061, 498818, 427461, 374579, 364861, 335176, 258120, 249612, 244768, 260234, 269938, 264668, 270758, 275203, 279164, 284261, 302596, 301261, 327798, 366612, 353538, 335209, 319309, 312254, 306431, 286850, 307795, 352159, 332013, 318489, 308990, 291603, 301849, 313031, 366454, 412541, 421847, 456078, 518133, 578463, 648321, 715580, 774078, 849111, 858919, 788676, 743134, 701613, 661066, 664849, 689228, 688276, 676416, 671629, 674605, 668513, 682530, 736701, 783118, 840745, 916031, 959277, 1016314, 1134509, 1297430, 1510425, 1772359, 2121453, 2523642, 2853102, 2943340, 2721314, 2439606, 2237078, 2091977, 1969364, 1887715, 1873657, 1883649]
8993A883649M2819P0268P7460O1445J13121J50384J44605J31204J14743J20855
8983B910553J94933K34654L18172L45856M08502M05398L97252M69338O31061P48946
8973G064665Q79229J070414J313736J578154J862898K186711K589412L131473
8965B1676692L893163M826877N641983O783171Q446721R135957R684185J3850266
8957H3939015K3297260L9931531O6699523J05088670J39436747J11187352r295062
8950E60285036j09006519j27312284r7884669o4065209m1162255k7109160j8484296
8943G5260644j3130193r488717o933234n096534l792690l285942l566939l780100
8935B6186295l502096k872525k275310j828671j490056j247524j072741q97383
$$ y = [1883649, 1926468, 1996736, 2074196, 2135641, 2248762, 2399146, 2543751, 2674955, 2789698, 2910553, 3105486, 3340140, 3658312, 4004168, 4412670, 4818068, 5215320, 5684658, 6315719, 7064665, 7943894, 9014308, 10328044, 11906198, 13769096, 15955807, 18545219, 21676692, 25569855, 30396732, 36038715, 42821886, 51268607, 60404564, 70088749, 83939015, 107236275, 147167806, 213867329, 318955999, 458392746, 569580098, 560285036, 451278517, 323966233, 226081564, 162016355, 120854100, 93744940, 75260644, 62130451, 52641734, 45708500, 40611966, 36819276, 33533334, 29966395, 26186295, 22684199, 19811674, 17536364, 15707693, 14217637, 12970113, 11897372, 10999989]
8927A0999989q33575p94979p82744o55493n38131n12484n20467n07851m56841
8918E397424m26990l70344l02712k45638k10807k08554k10306j83254j70404j25001
8908B943414j55635k00589j63905j08972q5966p6245p5964o5897q8623r6098p8630
8897A746890n2770m5870n2653l1951k3984m3442k3617l3933l9448k5490r449o3177
8885A301106o5319n0898p0883m5120m4860k5888J1304L0754k9468o8842n8088
8874H83798k1967m0915k6811l5400j9142K3075K2576k3963q634N548k2284k7163
8862G08718q050j3557k2350L0299L5272o809k0974j6741k1335j6085k5997j5774
8850F06617l3447l979J1819J6531J1583k6592k6658k6758k1058M714k92l992j5901
$$ y = [10999989, 10166414, 9371435, 8588691, 7933198, 7395067, 6882583, 6362116, 5854265, 5397424, 4970434, 4600090, 4297378, 4051740, 3840933, 3632379, 3422073, 3238819, 3068415, 2943414, 2787779, 2587190, 2423285, 2314313, 2228347, 2152102, 2076138, 2010241, 1921618, 1825520, 1746890, 1694120, 1648250, 1595597, 1563646, 1539662, 1496220, 1472603, 1438670, 1399222, 1373732, 1364283, 1301106, 1235787, 1184889, 1114006, 1068886, 1024026, 998138, 1009442, 1040196, 1010728, 941886, 883798, 861831, 820916, 794105, 758705, 739563, 762638, 785214, 761251, 752617, 758165, 735881, 708718, 700668, 687111, 664761, 695060, 730332, 723523, 702549, 685808, 664473, 648388, 622391, 606617, 573170, 569191, 581010, 597541, 609124, 582532, 555874, 529116, 508058, 512772, 512480, 508488, 492587]
8837D92587k4502j199k0747L1421M671n1808k6682k5049l372K483n622l9420K5227
8824C57988M6939L0712O811o590M0562K2125j5766j8375k0700j7718k5910K1474
8812D21552K5789k991j6564o507m253k3302j2792j1856L249L7555J862k7997O937
8799C90682k1735K2095m492l9230k2494j1875k3622J0816l5665j4864L1635k186
8787B79065J2162m049q002j4854J0697r584J4154m024j9863q891k0046K6042K9135
8774B81942O073r924k1782j3542M277J0381k2820l6850k1000l9074q115k5249
8762A04317Q56r35k8075J839K1692J3937K0257j297P000K1589J4335L4011J5778
8749B25304k1617l4480k963J755j6113J863J2717p008N671J6323J7052l7956n368
$$ y = [492587, 468085, 466886, 446139, 477560, 482231, 430423, 403741, 378692, 375320, 377803, 372181, 332761, 357988, 404927, 435639, 442450, 435860, 476422, 498547, 482781, 464406, 443706, 425988, 400078, 421552, 447341, 444350, 427786, 421279, 417026, 393724, 380932, 369076, 372325, 409880, 411742, 383745, 390682, 368947, 391042, 386550, 347320, 324826, 312951, 289329, 300145, 264480, 249616, 281251, 279065, 291227, 287178, 279176, 264322, 275019, 265435, 279589, 275565, 255702, 246811, 226765, 252807, 281942, 288015, 278091, 256309, 242767, 247044, 257425, 234605, 197755, 176755, 137681, 129566, 104317, 105173, 104238, 76163, 78002, 99694, 113631, 133888, 132591, 139591, 161180, 175515, 209526, 225304, 203687, 169207, 166244, 167999, 151886, 153749, 166466, 159458, 165129, 181452, 198504, 160548, 155180]
8736A55180K2110n117m0438k676N8454J4181l2438Q000K7672l708Q34j5272L617
8723A90399J2992J2649j1804L194M0761q550o3132k5747J7294j1778J1274O277
8711A73829P371J0996r260j601J8622r914k8424Q889L4868m67j6128Q1j4549K271
8697A76584j7208k1838o57K905O150j3988k630O694K0988m236j5517j3705j6509
8684A07033L930K2595K5654j5025M982K3886o041k6961p979k3756j0098J5867
8672A14087K7441K0692k7600k7846J0217J3417J3647l16P906N931o70k3333k7606
8659A05967r613O253R506J2284J5063j647j0693K740j2168r811j1027r842J5123
8646A02135J396J5803M363m337O925J0070K1280M883l464Q115k1833p902M155
$$ y = [155180, 177290, 172173, 131735, 129059, 187513, 201694, 169256, 177256, 204928, 201220, 202054, 186782, 190399, 203391, 216040, 204236, 207430, 248191, 239641, 176509, 150762, 168056, 156278, 167552, 173829, 181200, 192196, 182936, 181335, 199957, 190043, 161619, 170508, 205376, 204909, 188781, 188862, 174313, 176584, 159376, 137538, 136881, 139786, 145936, 131948, 129318, 136012, 157000, 152764, 137247, 123542, 107033, 110963, 133558, 159212, 144187, 149169, 173055, 167014, 140053, 132074, 108318, 98220, 114087, 141528, 162220, 134620, 106774, 116991, 130408, 144055, 143739, 151645, 157576, 156906, 133573, 105967, 96354, 102607, 112113, 124397, 139460, 137813, 127120, 129860, 117692, 107881, 96854, 87012, 102135, 103531, 119334, 123697, 119360, 126285, 136355, 157635, 162518, 159054, 167169, 145336, 137434, 141589]
8633A41589J2452Q541J1338M438M505N6890J21640n188o6829o5725o3681m5855
8621A14115j7322n589k2565P705j204K068n556K3380j3828j735O531M384K5206
8608A15590M621k4769J7647K7044M554j9581J3192J4497j2803l2222J9824k4815
8596A02779M013L3074K9912J964o649K8621j8232m7492k0654J4867P021n70r667
8583A18987j2416p571L0296K8587L062k3664m1414j5836K818J1825J3379J0544
8571A18597J4649M737J1517j4418J2388J1134J2668J1572M0244M1176L455l164
8559B64555O8105O6598J10636J31407J37539J32068J60472J59118J73379J75879
8549A579756J09675N5192R098m6022r7388j64455k12731j91910j95505j37046
$$ y = [141589, 154041, 162582, 173920, 178358, 182863, 239753, 361393, 356205, 289376, 223651, 159970, 114115, 96793, 91204, 68639, 76344, 75140, 77208, 71652, 95032, 81204, 79469, 86000, 90384, 115590, 120211, 95442, 113089, 140133, 144687, 125106, 138298, 152795, 139992, 107770, 127594, 102779, 106792, 139866, 169778, 171742, 165093, 193714, 175482, 127990, 107336, 122203, 129224, 128654, 118987, 106571, 99000, 129296, 157883, 160945, 137281, 95867, 80031, 82849, 94674, 108053, 118597, 133246, 137983, 149500, 135082, 147470, 158604, 171272, 182844, 223088, 264264, 267719, 264555, 332660, 399258, 509894, 641301, 778840, 910908, 1071380, 1230498, 1403877, 1579756, 1689431, 1744623, 1753721, 1707699, 1610311, 1445856, 1233125, 1041215, 845710, 708664]
8539G08664j20296j08414l3113m2109m8975l5853m0024k0526l6834j1811j6551
8528A94158K0824O099k7223j0242r277q366Q249j3623l8958P433j9123l6183m764
8515F9004J236J7286p932J0560j3630k0394k3909l960M9381O741k5534Q75M653
8502F4377j7930M16K4632N950m0943j5885K6657J6841K2584q419k9878j1878j1290
8489B5234o994j0405M665M2717J8399J7378n52K124p69l201j2164P040j0367O126
8475G9231K2583j9697J9937k7449k9176m4324l886K3424K0415J5300K7425K4082
8463A07865j3966l2609l6064j9935O128L0109K6209M0376J7795j8235m6822j8870
8451D1981j2105J610J6181p162p528n928j9213K5423J6668J3123J7928k5065j0747
$$ y = [708664, 588368, 479954, 446841, 404732, 355757, 319904, 279880, 259354, 222520, 210709, 194158, 214982, 221081, 193858, 183616, 174339, 165973, 174222, 160599, 121641, 129074, 109951, 73768, 69004, 70240, 87526, 79594, 90154, 76524, 56130, 32221, 28261, 77642, 84383, 58849, 59724, 64377, 46447, 46863, 71495, 77445, 36502, 20617, 47274, 64115, 86699, 78280, 48402, 36524, 25234, 18240, 7835, 12500, 55217, 73616, 90994, 90442, 92566, 91797, 88596, 76432, 83472, 73105, 79231, 101814, 82117, 102054, 74605, 45429, 1105, -2781, 20643, 41058, 56358, 83783, 107865, 93899, 61290, 25226, 5291, 11419, 41528, 67737, 108113, 125908, 107673, 60851, 41981, 29876, 31486, 47667, 40505, 32977, 27049, 7836, 33259, 49927, 63050, 80978, 55913, 45166]
8438D5166J7873m737k3897R677L9889O633j0615k6192j9284M14n725r244K1613
8425D1571N278J8222L677J5908j8434j1147j7304N121j6892m107l874K2253L0901
8412G1173P543P8J2115l278o378k1042r314M127K788j3733L4886j7849r962j0255
8398D0899o932p679J1633l054J5286K1066j1974j4331l5305M786N063j5509J5845
8385A9794J2369q158q31N678k691p417N231j170J1399m747K1307J2658q086j1249
8371D4087K071k04j0314k3379k776N161N731r91L0311J1253p404q366j928r22
8357D2330k4417k1091j4213r590J0800J5473m759m791j3728J514J0821L0238J056
8344A9643q92m695O672L0503O083k0374n255M298J4201k4932l0316L4336L5375
$$ y = [45166, 63039, 58302, 34405, 44082, 83971, 90604, 79989, 53797, 34513, 34927, 29202, 19958, 41571, 46849, 65071, 68748, 84656, 66222, 55075, 37771, 42892, 26000, 21893, 18019, 40272, 71173, 78716, 78794, 90909, 87631, 81253, 60211, 50897, 55024, 57812, 44079, 78965, 61116, 51154, 40899, 33967, 26288, 37921, 34867, 50153, 71219, 59245, 44914, 9609, 14395, 19458, 3949, 19794, 32163, 24005, 23174, 28852, 26161, 18744, 23975, 22805, 34204, 29457, 50764, 63422, 55336, 44087, 46158, 45954, 35640, 12261, 9485, 14646, 20377, 19386, 49697, 60950, 53546, 45180, 43252, 42330, 17913, -3178, -17391, -26981, -16181, -708, -5467, -10258, -23986, -22472, -11651, 18587, 19643, 18751, 14056, 20728, 51231, 57314, 36940, 31685, 35983, 50184, 25252, -5064, 29272, 64647]
8331F4647O399k0324l1983j3213J7349J7456j6209k0794J8704j4385q612j5145
8319a6110J7412L259L3734J0021j2910j9280M68j5070l789J8491J1172j1102K37
8306A6533j3715k4963j9171N253L1344L8953L1628k1875l3542O292M725J2727
8294C4189M674J2314O194k0683O634j3742j4303N314l6010k8607K944N9210O057
8281B4185j0917P598L867j6795j7662l1143L8139L4009k3371j677M458r337k0402
8268a9048k6033N080K3201q497M087K3366j303J8743K1257m8183m3653K9920J5306
8255e757j0252J7276M847K417Q054R836P079N745k4673J481P054K1747P242k6315
8241B5781m1774J248J3990O214m823j7653q957L083P458M556L0299M1447n698
$$ y = [64647, 71046, 50722, 18739, 5526, 22875, 40331, 24122, 3328, 22032, 7647, -965, -16110, 1302, 4561, 38295, 48316, 35406, 16126, 16594, 1524, -2265, 16226, 27398, 16296, 16533, 2818, -22145, -41316, -36063, -4719, 34234, 65862, 43987, 10445, 16737, 21462, 34189, 38863, 51177, 57371, 36688, 43322, 29580, 15277, 20591, -15419, -44026, -41082, 18128, 24185, 13268, 20866, 24733, 7938, -9724, -40867, -2728, 31281, 7910, 6233, 10691, 1354, -19048, -45081, -40001, -16800, -25297, -21210, 2156, 853, 19596, 40853, -7330, -50983, -21063, -5757, -16009, 1267, 6114, 8531, 16585, 26421, 33500, 39245, 14572, 16053, 23107, 44854, 52096, 25781, -15993, -14745, -755, 5459, 636, -17017, -25974, -22891, -15433, -10877, 19422, 60869, 55171]
8228E5171k1822o381k4573N547M957n350R221M6025J3667l0529K372k1313m55
8215B6537M1638j0536q021j5738j1887j9916j3401L7907K0195N098j0014L007
8203D4869k3209j8485P693J5655m345J8075R608K7770m497j3051K396J4535J5233
8190I2247K3634l5170l7252l3811k750J6209P079j1282o601J6700J2487O550k5366
8177B2674m4843J4652K689j886K3624l1297j8038J1484R568J7400j0734j3247
8165a7954l369k0616j5091N7303L4516k5489l2584k2308K8936N3358n21m2270
8153f089j7044J0645o04N530Q368l75o390P013R495K1791K454m6541M03L7295
8139B5951P686n61m272r340O61j1885j7966L8808J0174l935Q201Q953j3819q944
$$ y = [55171, 33349, 26968, 2395, 7942, 12899, 7549, 16770, 62795, 76462, 45933, 48305, 26992, 26537, 68175, 57639, 49618, 33880, 21993, 2077, -11324, 26583, 46778, 51876, 41862, 44869, 21660, 3175, 10868, 26523, 22178, 40253, 49861, 77631, 73134, 60083, 62479, 77014, 92247, 115881, 80711, 43459, 9648, 6898, 23107, 30186, 18904, 12303, 29003, 41490, 48040, 22674, -22169, -7517, -4828, -6714, 16910, -14387, -32425, -20941, -11373, 6027, -4707, -17954, -21323, -41939, -57030, 273, 34789, 9300, -23284, -45592, -16656, 36702, 36181, -6089, -23133, -12488, -13092, -7562, 806, 431, -5959, 1054, 10549, 32340, 34794, -11747, -11344, 25951, 33637, 33076, 28804, 19464, 20125, 8240, -9726, 29082, 39256, 35321, 43522, 52475, 38656, 29712]
8125B9712j6885o869J9369K8279L0016l253m8175k6776J6638N657m330J7761j0012
8112C1132l02j4174R21J573L1733m217J1255N257Q706j1573R293J177j8638k3040
8098B9103k918K5733L9478O542l6691k1594k4199L399O414j2774k6310N681J4321
8085F185j1116P520K8710P587p478J3798P88J3895K168l7938q163r078j612j6511
8071a1245j3316L5469K3362J8588k0415k9911n213K1643j5506J8752J6108m407
8059C3909M593L053Q600J9881J4820R367p185l5412j576j2242k443q191k611p419
8045A7144n738K8120q454p955q246k4998r281K732L9220r664J0451k2895J4218
8032A4654J3435R488M600N288l53Q740k1932j7506Q004K0838L2870r378o161m379
$$ y = [29712, 12827, 5958, 25327, 53606, 83622, 80369, 32194, 5418, 22056, 27713, 23383, 41144, 31132, 30830, 16656, 17577, 19150, 50883, 46666, 57921, 63178, 71884, 60311, 69604, 70781, 52143, 29103, 26185, 51918, 91396, 97938, 61247, 39653, 15454, 18853, 25267, 12493, -13817, -8136, 6185, -4931, 2589, 31299, 38886, 31408, 45206, 45994, 59889, 62057, 24119, 15956, 6878, 5266, -11245, -24561, 10908, 34270, 52858, 32443, 2532, -2681, 18962, 3456, 22208, 38316, 33909, 38502, 41555, 50155, 70036, 84856, 94223, 87038, 51626, 50050, 37808, 35365, 27174, 24563, 17144, 11406, 39526, 31072, 23117, 14871, -10127, -19408, -16676, 22544, 12880, 23331, 436, 14654, 28089, 37577, 42177, 47465, 47112, 55852, 33920, 16414, 24418, 45256, 78126, 68748, 62587, 58208]
8018E8208k5926k3787O503n232k0045J6441L0756J6038N305q492j2080P606r46
8005D4349o222k4814K8590j3559m115R315k4309j077K2967l37k5905k7620o369
7992b9106L2427j2321L3440N267J061j1108j7671l115q468J8245M459J6113P133
7979C6356q740k390r044l404J7591o394k2757k5559M0600O78K5482k2135M20J2997
7965C3701J6529j3275J0873O265Q601J5711k0284k0003m683k8991J3031N224K4989
7952D7688J3182k8073k7211j0481J704k8729r04j522n000K7595K8947m066N703
7939A8833K1986j7013k2358K446m362J807K4516J4393M500l167O236r568J402
7926C9651N196k708j4645J857J6319J0205J2970k4842j7230K3057J0796L6641
$$ y = [58208, 32282, 8495, 14998, 9766, -10279, 6162, 36918, 52956, 58261, 49769, 37689, 45295, 44349, 38127, 13313, 41903, 28344, 24229, 33544, 9235, 8158, 31125, 30788, 4883, -22737, -29106, 3321, -9000, 24440, 29707, 30768, 19660, 1989, -1126, -9594, 8651, 13110, 29223, 36356, 27616, 25226, 16182, 12778, 30369, 23975, 1218, -24341, 16259, 16937, 42419, 20284, 20704, 33701, 50230, 36955, 47828, 54093, 62694, 78405, 58121, 38118, 33435, 4444, 17475, 22699, 47688, 60870, 32797, 5586, -4895, -3191, -31920, -32824, -34346, -39346, -11751, 17196, 13130, 18833, 40819, 23806, 1448, 3894, -468, 1339, 25855, 40248, 44748, 41581, 47817, 38249, 39651, 44847, 42139, 27494, 29351, 45670, 55875, 68845, 44003, 26773, 49830, 60626, 97267]
7914I7267j953R750J413n5965j5601P927J2902K7063K623Q807n3650l932J8797
7901E5448K2305J4360o652k8785l4286r203q284j270J3537K2842P384k0332j5907
7888A1157L3173k3547p437j6142J0712J0470N0004K423k3643k4719k0906K7351
7876B8896J6373j8476q321j4J2395n533k6758j6257K892K2761j7901J8864J5116
7863B4037P896j7699l4478J4196L5573p150K233K3213K0257r366j7754q51l452
7850C6655k0299k3211k0887J0812J788j3902k587n336n222L3383J7208j9164r236
7837a9998n735O606p651K1799j339j245K2538J5845L330j4820J504j0384j2757
7824b307K0855J6823j039n134L1360j7108k5880j0128J5436j1745j1747l745J734
$$ y = [97267, 95314, 105064, 106477, 50512, 34911, 42838, 55740, 82803, 85426, 94233, 40583, 36651, 55448, 77753, 92113, 85461, 56676, 22390, 13187, 4903, 3633, 17170, 40012, 47396, 27064, 11157, 44330, 20783, 13346, -2796, 7916, 18386, 68390, 70813, 47170, 22451, 1545, 28896, 45269, 26793, 18472, 18458, 30853, 25320, -1438, -17695, -14803, 7958, -9943, 8921, 24037, 31933, 14234, -20244, -6048, 29525, 22375, 24608, 47821, 68078, 58712, 40958, 40107, 36655, 16356, -6855, -27742, -16930, -15142, -29044, -31631, -36967, -42189, -8806, 8402, -10762, -19998, -25733, -19127, -26778, -4979, -6318, -7563, 14975, 30820, 34150, 19330, 20834, 10450, -2307, 18548, 35371, 34332, 29198, 60558, 43450, 17570, 7442, 22878, 11133, -614, -4359, -2625]
7811b625j3215k311j365J3551Q930J1709j1984Q48j5116J0111O20r619K7294K1016
7797C7844j998k1069j0535K356j696j7792M2760j0346j1787P701j6865l9722o472
7784d7621j7532P410K7311K2447J9609K6668J9735j0791p911J3637n967r203p987
7771B9805j5600j0979J4618J4945R327l5191k9093n700Q701k6042J2624J1325
7759b1260Q344k1474J351J5067M0168k6788n266J7489k0237j5554N103P936K568
7746a2553M681J6159K0900J2072l470o759j5255j723K3491j6342j0242k721L51
7733H589M5030j2733j5692k6195k2671L4589J3592j1252j3674q067q975K0760
7721C301J4906P244l648k0149N209o484J6877K5045J1856j3194l571J226q768
$$ y = [-2625, -15840, -18151, -19516, -5965, 2965, 14674, 2690, 3538, -11578, -1467, -847, -10466, 16828, 37844, 35846, 14777, 4242, 6598, 4902, -12890, 29870, 19524, 7737, 15438, -1427, -41149, -47621, -65153, -57743, -30432, -7985, 11624, 38292, 58027, 47236, 39325, 52962, 46995, 37792, 29805, 14205, 3226, 17844, 32789, 42116, 6925, -22168, -27868, -19167, -45209, -32585, -21260, -12916, -34390, -33039, -17972, 22196, -4592, -9858, 7631, -12606, -28160, -23057, -15121, -12553, -7872, 8287, 29187, 41259, 37789, 31030, 15775, 14052, 37543, 21201, 10959, 8238, 8589, 53619, 40886, 25194, -1001, -23672, 10917, 24509, 13257, -417, -8484, -17459, 3301, 18207, 25451, 21803, 1654, 6863, 379, 17256, 42301, 54157, 40963, 37392, 38618, 29850]
7708B9850J370r777L0907l4551k2159M272J8990O465J9463q072J7798J6545m256
7695F6845j9727j6099l3493p499j2372P609p584j8662k53J4849J7351q018j5213
7682c2266K7110k1121j7433R306R017K9498J9218L0683k090j4326n312K71j3244
7669A9311P13L2323R012j7017J7735J4769k8360k8821l660j4745n935J6773j0914
7656A184k0766Q198O298J8976J5704j7038J6368j2160l3145J5311J4760l0133
7644a6443m301j918J4658J6322m004K9801M5311m663l7806o830j0888Q088m3472
7631a6145K487K3634o639J0585j912l561j7752j8322J6735J7866M174R972R124
7618C0246j1168q769J3390l023k010k681j4948k9114J952K3316K1569p405k9540
$$ y = [29850, 31220, 21443, 52350, 17799, -4360, -88, 18902, 25367, 44830, 36758, 54556, 71101, 66845, 47118, 31019, -2474, -9973, -22345, -14736, -22320, -40982, -41235, -26386, -9035, -17053, -32266, -5156, -26277, -43710, -34404, -25387, 4111, 23329, 54012, 51922, 37596, 32284, 32555, 19311, 20024, 52347, 61359, 44342, 62077, 76846, 48486, 19665, 16005, 1260, -4675, 12098, 1184, -19582, -11384, -5086, 13890, 29594, 12556, 28924, 16764, -16381, -1070, 13690, -16443, -20744, -22662, -8004, 8318, 4314, 34115, 79426, 74763, 36957, 30127, 19239, 27327, -16145, -13658, 9976, 3337, 13922, 12010, 8449, -9303, -27625, -10890, 6976, 11150, 21122, 30246, 19078, 10309, 23699, 20676, 18666, 15985, 1037, -28077, -26125, -2809, 18760, 11355, -18185]
7605a8185N436J6694K5184J2242P101k0151j45l74k4418j2734J9976j9837k5018
7592c4229P389J5714m303j1030M31J6783M9766K440K786J4073Q965k1550l9410
7579G825k8033J2510J4740j1101m236r348L071K248j4889n550J3694J7297K5885
7566B4113J1586l4532l2276j2282K550L1381M530m01K942j4163O597j2710J5772
7553f893p308K4615m835j2320J7814p983k8881J4619L784K896r186K5208P575
7540A9105K384j0164r974j4678J9013K67l5223j0768J1678J0139m495j5223J8240
7527a9699Q245n533P3Q707j7173J699j875n915J7478k5168j9372K6569M4271m732
7513G575k2485K2717J9839N548J866J4984J7419n456l6054j3886j6642q02j0225
$$ y = [-18185, -12749, 3945, 29129, 41371, 48472, 28321, 28176, 27802, 3384, -9350, 10626, -9211, -34229, -26840, -11126, -15429, -26459, -26028, -9245, 40521, 42961, 45747, 59820, 68785, 47235, 7825, -20208, -7698, 7042, -4059, -8295, -17643, -14572, -12324, -27213, -32763, -19069, -1772, 24113, 35699, 1167, -31109, -43391, -40841, -9460, -4930, -5331, -2389, -16552, -9955, -22665, -6893, -14201, 10414, 5579, -6741, 11073, 3090, -25791, -11172, -7388, -4492, -13678, 11530, 19105, 21489, 11325, 1351, -13327, 5686, 5953, -29270, -40038, -28360, -18221, -22716, -37939, -19699, -11454, -16987, -16914, -8207, -25380, -23681, -25556, -31471, -13993, -39161, -58533, -31964, 12307, 7575, -14910, 7807, 27646, 33194, 35060, 50044, 67463, 62007, 25953, 12067, -4575, -5377, -15602]
7500a5602K1381m304J1515P870J6849q6l8242q900J9152J1643j4998O458r172
7487C564r778l9134J131m661J7848K9483L269L139J4860J3096K199l4923o604
7474f511o529k2417j277L1032K5726M368m819k3983K00K3078J615R684o314l3061
7460i208j3185N368p969L252j1176M250K6192J3845k5041k8922o227j649P362
7447d3108M049k4002l832L923K677P461L1104N0393P184j2708j6440R145l546
7434A2300j57k0502o46K5296J6885o846j9646K693J7409J1224k5359k7826n033
7421b0208K1216M949l4026O314J9178L1194M198m873l7683o876L2538m951j3017
7408b047j9768m63j802j5097K894L8965J866l371l960k3843k222j177M54J009
$$ y = [-15602, 5779, 1475, 12990, 20860, 37709, 37623, -619, -9519, 9633, 21276, 6278, 12736, 3564, -6214, -45348, -44217, -48878, -31030, -1547, 1722, 4861, 19721, 32817, 35016, 93, -6511, -13040, -35457, -36734, -5702, 20024, 24392, 19573, -4410, -4210, 18868, 20483, 30167, 23853, -9208, -22393, -17025, -24994, -21742, -32918, -28668, -2476, 11369, -13672, -42594, -48821, -50470, -43108, -39059, -63061, -66893, -62970, -60293, -52832, -21728, 28665, 35849, 23141, 6701, 15846, 12300, 12143, -8359, -9005, 16291, 33176, 26330, 6684, 9377, 26786, 38010, 12651, -15175, -20208, 1008, 5957, -28069, -21755, -2577, 28617, 32815, 27942, -9741, -16617, 15921, 10970, -2047, -21815, -22278, -24080, -39177, -36283, 2682, 4548, 1177, -2783, -26626, -28848, -30025, -29571, -28562]
7394b8562p69L5752K6844j1267J9244p250p802m2264r97L8192k1910j7189J6494
7381a484J9266L460k5063M630P222l710P166k803j851q901j2214K3133K056k5072
7367a4165k8041q26K3286N1199P593l6358q350l835J2249K3379j0942j3220J113
7354C082J1841k727K061Q618l7689k6734l725J4258J2338J1523k3576j6772M04
7341d7098j0288n387Q462q625M5612K995j4758L1784p456l1527J7675J8364m650
7328d897K783L304J7235k2985L100l586J4317K327k6135j6072K9414J7108J0128
7315B6041P832k938J5444k444m8751k3971L1655q72K5096P406j0415K487R563
7302C6133j7378j503K5772M788k6611N594l5754l1581j0103J8735K8833o192q483
$$ y = [-28562, -29331, 6421, 33265, 21998, 41242, 33992, 26190, -16074, -17071, 21121, -789, -17978, -1484, 17782, 21242, -3821, 809, 8031, 4321, 11487, 8684, 6833, -2068, -14282, 8851, 10907, -14165, -42206, -43032, -19746, 31453, 39046, 2688, -5662, -9497, 2752, 26131, 15189, 1969, 3082, 14923, 12196, 14257, 22875, -14814, -41548, -45273, -31015, -18677, -7154, -30730, -47502, -47098, -57386, -62773, -54311, -62936, -17324, -14329, -29087, 2697, -4759, -36286, -18611, -247, -4897, -2114, 1190, 18425, -4560, -1460, -5046, 9271, 11598, -14537, -30609, -1195, 15913, 26041, 33873, 30935, 46379, 43935, -4816, -28787, 2868, 1996, 27092, 34498, 24083, 26570, 36133, 18755, 17252, 43024, 47812, 21201, 26795, -8959, -40540, -50643, -31908, -3075, -9267, -17750]
7289a7750J9178p726J4786p282l0136M542O648j909P887K617P686K8670k725o707
7275A7779K1637k2932k561k038R119R476R295j3667r302j724K7552l2786k5243
7262a5395j3708J4763L701j9620o698K3566n709n566J773q622j1317n61M880J6349
7248b2164p739R346j8500K1236K6678K6435O639j6029j945j9744j4167q051O267
7235a1738L0864L350j2908K9955L505l6769j9502K7830J5958j5297k7343q481
7223b0576m693k12J2840L9649q259m5851J136N3081J0053j4310l9923K5053Q693
7210A6681k7057p089O319L3426J2015J5902M33q535m047r857k563k2313j0234
7197f919k7249j5373n15r963K7750J5996j1216O790R891K2549j421p40J0360J9941
$$ y = [-17750, 1428, -6298, 8488, 1206, -28930, -24388, -17740, -19649, -11762, -9145, -1459, 27211, 24486, 17779, 39416, 16484, 13923, 11885, 21004, 30480, 39775, 26108, 16806, 15082, 42634, 9848, -15395, -29103, -14340, -10639, -30259, -36957, -13391, -19100, -24666, -22893, -31515, -42832, -43393, -38513, -22164, -29903, -20557, -39057, -17821, 8857, 35292, 41931, 25902, 23957, 4213, -9954, -18005, -11738, 19126, 22476, 9568, 39523, 43028, 6259, -13243, 14587, 30545, 15248, -12095, -20576, -25269, -25481, -12641, 27008, 18749, -27102, -25966, 27115, 37168, 22858, -17065, 7988, 16681, -10376, -17465, -11146, 22280, 34295, 50197, 50630, 42095, 38048, 28191, 25628, 3315, -6919, -34168, -49541, -50056, -60019, -32269, -16273, -27489, -20699, -10808, 11741, 10320, 9580, 19940, 39881]
7183C9881j2008j7614j9293o336J8822K0019L056Q527J9864j4771k4193K510K3497
7170D1961k7481l3464J835Q140k26j2010P577K1142J4182L251j3918l875J5865
7157B2979p64J5326p673l8585M556K5933l436k1187K002L5105K1606k6876n687
7144B3299J9916M538n41m3850r443k928R384J7129J6775k9058l295p553j135j949
7130h711K5008K3903l633Q068q593l615k7750k386j809j3482l3651q000J1646
7117d3005L8200K7177M45k3778L223J2793K5289L0699j5042j4183o5075k4699
7105d7956K3003J4406J1505K9117j1508k0252o474O54M941j0879L3952M4642L657
7092F8808j7328j5662K763R791j4247m2654j6136k78o611k315m302j22j7989J1345
$$ y = [39881, 27873, 10259, -9034, -15370, 3452, 23471, 26527, 35054, 54918, 40147, 15954, 18464, 41961, 14480, -18984, -17149, -9009, -9235, -21245, -13668, 7474, 21656, 24907, 10989, 7114, 22979, 22215, 37541, 29868, -8717, -4161, 21772, 18336, -2851, -849, 34256, 55862, 28986, 23299, 43215, 47753, 47212, 3362, -6081, -9009, 375, 17504, 34279, 5221, 1926, -5627, -6762, -8711, 16297, 40200, 36567, 44635, 36042, 32427, 4677, 2291, 482, -13000, -46651, -54651, -43005, -4805, 22372, 22817, -961, 2262, 15055, 40344, 71043, 56001, 41818, -23257, -47956, -24953, -10547, 958, 30075, 18567, -1685, -8159, -7505, -2564, -13443, 20509, 65151, 68808, 51480, 35818, 38581, 48372, 34125, -8529, -24665, -24943, -31554, -33869, -38171, -38293, -56282, -44937]
7078d4937J9347N803K1192K9580L547M4208l1702m6402p133O804J896J044j7938
7065a4691J7064K5304j1098P713l0113j5840J1055M2448L4977J5634K9239j5710
7053I5982k8440k5162r516j6790k9220j35O62l6734J4943L4507J6327k4122m4265
7040e1963R247P343R117l868K429j6593j4391r948O179K6814P956O931K2143j0088
7026h692k5668j3770k4362M0228M9436K2394Q294j216l263k1023m3737r462k0538
7013e1379k8325M1185M7213J6315J243J3975k4037l138J1497P095q070k7450K099
7000a777K6141P157n659r622j4897k7954K5491K1631j3676k2904J4872P271q364
6987b290J9379K791k0875K1549L8394J3191j4730j7244j9996j0331n1729K0534
$$ y = [-44937, -25590, -19787, 1405, 30985, 34532, 78740, 47038, 636, -6497, 307, 2203, 3247, -14691, 2373, 27677, 16579, 24292, -5821, -21661, -10606, 31842, 66819, 82453, 111692, 95982, 67542, 42380, 32864, 16074, -13146, -13281, -12619, -49353, -34410, 97, 16424, -7698, -51963, -42716, -35373, -26256, -30124, -27695, -44288, -58679, -68627, -62448, -35634, -27678, -20747, 1396, -8692, -34360, -48130, -72492, -32264, 17172, 39566, 47860, 46644, 43381, 22358, -21379, -30841, -51379, -79704, -38519, 8694, 25009, 26252, 40227, 16190, 13052, 24549, 31644, 23574, -3876, -1777, 24364, 31521, 25862, 16240, 1343, -26611, -1120, 20511, 6835, -16069, -1197, 6074, -2290, 17089, 19880, -995, 20554, 58948, 72139, 57409, 40165, 20169, 9838, -41891, -21357]
6975b1357J4501k3612J6834M0351J4882r517L157j9229J5255j4486j1887j6532
6963a1640J6025J2952L008J105R162P254M06l3345k0200O779L2126J188O516k2414
6949H922j5002Q482P460J4544j354J2544L502J920m037k5731k6983j2964o500
6936c5197p872j2516N769J9011q088K5323K645J2874J2360K5202N608K0274j2952
6923E2441J9775j54l5418l6311m573J9117K0755j8762m5796k4787J7432l221M726
6910c4776J4100L3128M222k0889J296p051q721L8702K923j8240m0049j4826K1438
6897b8743J0185N681Q294j7769K023J3546K6308M147l5104k4680J9470j037J56
6884a7523o049L1471K8864j8241j0035q504l1859j8313O56J2027p216R280K4671
$$ y = [-21357, -6856, -30468, -13634, 26717, 41599, 32082, 35239, 16010, 31265, 16779, 4892, -11640, 4385, 17337, 20345, 21450, 30612, 37866, 38272, 4927, -15273, -8494, 23632, 24820, 31336, 8922, -6080, 2402, 9862, 24406, 23052, 35596, 39098, 41018, 36981, 11250, -15733, -28697, -35197, -43069, -55585, -49816, -30805, -38893, -13570, -10925, 1949, 14309, 39511, 45119, 65393, 52441, 72216, 72062, 36644, 333, -4240, 14877, 35632, 16870, -28926, -53713, -36281, -39502, -34776, -20676, 12452, 16674, -4215, -2919, -9970, -18691, 20011, 22934, 4694, -35355, -50181, -28743, -18558, -12877, -4583, -22352, -20329, -6783, 19525, 23672, -11432, -36112, -16642, -17679, -17523, -23572, 7899, 36763, 18522, 8487, -17, -31876, -50189, -49533, -37506, -44722, -35442, -10771]
6871a0771o246L764q01j695K1698M6800n626k9659k1840J4678o424O79j6589L99
6857a1633M1694P919j0742o890o42l1442r018R88J8493k1369J4962M1924J3441
6844D7685J3227n327l6595j9484K151k3176n428K7501M2711J7249o825m066k3751
6831B5872j9940j2936J6083k5965m51L1612J6242l7789j4318Q616j6642M759N716
6818a9141K704l695J3232J4905j2124n541N264J135J2466J2306K223l1777l1011
6805c9054q949P949Q481J1956k441K357L390L2290L1984J4811k6811j3967L074
6792B5070j0378j9605J0117N390o165j598j4367M927O228K8635L501L338j7278
6779A7815m1913k3059k0026K6515N049j3350L003L5254J5358O388J5717l0841
$$ y = [-10771, -17017, -13253, -14054, -15749, 5949, 52749, 47123, 17464, -4376, 10302, 3878, 4557, -12032, -11633, 30061, 37980, 27238, 20348, 19706, -11736, -20754, -19766, -1273, -22642, -7680, 34244, 47685, 60912, 55585, 18990, -494, 1657, -21519, -26947, 554, 43265, 60514, 53689, 49623, 25872, 5932, -7004, 9079, -16886, -17337, 14275, 30517, -7272, -21590, -12974, -29616, -24857, -19141, -16437, -20132, -6900, 8005, -4119, -9660, -4396, -3261, 9205, 21511, 23734, -8043, -39054, -48003, -40054, -31573, -19617, -22058, -19701, -16311, 15979, 47963, 62774, 35963, 21996, 25070, 14692, -4913, 5204, 10594, 4429, 2831, -11536, -6609, -381, 28254, 31755, 35093, 17815, -24098, -47157, -67183, -40668, -35619, -48969, -45966, -10712, 4646, 11034, 26751, -4090]
6767d090p846J7016K7567j1694j7017l334j3317J5377M38M940J2008M5K4235O129
6753E0457j407m973k3525k2762q133j0599j1215m318M2753P159j9621k3066l053
6740c2303o28j265K6961K7167n701l0931l1916p348n758N2474J9108J9333J8149
6727D7342p761k5200j3576q370J2088J0406p300K7937j3600k5114L646J9416p616
6714A2298l0843n245J7073l7801j0857L1917Q301o74l34R291R952Q00M880K5952
6700C4710J0816p586K378N730k3748j0854n316J7192p719k9822j0552k177L7096
6687A0148K5505j8489L866q560j8944r748K1781R676j2775n382J3215o486P335
6674A1142M2143J0245l1057o7749m5177l50o043K9459M3048k174j924r678l963
$$ y = [-4090, -11936, 5080, 32647, 20953, 3936, 602, -12715, 2662, 3100, 8040, 20048, 20093, 44328, 50457, 49050, 44077, 20552, -2210, -10343, -20942, -32157, -36475, 6278, 13437, -6184, -29250, -32303, -32931, -34196, -7235, 19932, 14231, -16700, -48616, -55964, -61722, -9248, 9860, 29193, 47342, 39581, 14381, 805, -7565, 4523, 14929, 7629, 35566, 21966, -3148, 498, 19914, 12298, -18545, -23790, -6717, -44518, -55375, -23458, -15157, -15831, -16165, -6874, 3078, 3878, 8758, 34710, 45526, 37940, 40318, 46048, 22300, 11446, 6130, 23322, 15603, -14219, -24771, -26948, 10148, 35653, 17164, 21030, 12470, -6474, -16222, 5559, 15235, 2460, -2922, 10293, 3807, 11142, 53285, 63530, 32473, -35276, -80453, -80803, -86846, -57387, -14339, -16513, -18437, -28115, -32078]
6661c2078L152K1855o821k6501O658N1339J8307n935j8101m3478j0140j3758J3341
6648d2160k0637M093J8564K3734o061j5073K2903L6602r806J5551N691k8610r916
6635e125N28J5296j2941P339J4756l940Q345j1945m958P971L765M223j5551J1257
6621A9020J6047k4196j3059M526N0891l4454j7706L5821p056k8163j5827J1885
6609b271J7773j5802k3061J969J7478j4051J9587J2653k4968M301n224n519L138
6596a3997M015k4634j607J5588L0056R873J9004p525j1337o67j0257j513Q253
6583A5252M7360L323k6397n6232o933j31o490M732L6269R415q722o969o493K2186
6569B0170k3767o900L14k815L595n484K5836J9074J1915Q918k700k549p487l343
$$ y = [-32078, -28926, -7071, -13892, -40393, -33735, 17604, 35911, 29976, 11875, -31603, -41743, -55501, -42160, -62797, -58704, -40140, -16406, -22467, -37540, -14637, 21965, 12159, 27710, 33401, 4791, -5125, -4597, 10699, -2242, 5097, 19853, 15913, 24258, 12313, 7355, 15326, 19091, 23314, 7763, 19020, 35067, 10871, -2188, 2338, 53229, 18775, 1069, 36890, 29834, 1671, -14156, -2271, 15502, -300, -23361, -21392, -3914, -17965, 1622, 14275, -10693, -6392, -11616, -17135, -13997, -9982, -34616, -36223, -20635, 9421, 19294, 38298, 30773, 19436, 18769, 8512, 6999, 15252, 62612, 65935, 39538, -16694, -23627, -23758, -30248, -25516, 10753, 20168, 11446, 4477, -2016, 20170, -3597, -10497, -10183, -12998, -9403, -14887, 10949, 30023, 41938, 50856, 48156, 45607, 38120, 34777]
6555C4777r855j0428m591j1728k4933j015L5232n056l8217K954q341K0104J8386
6542b711J8017j3719O892o598j5247p596J4605K5898J0962j4199k4741l3396K8654
6529a3179J6820J8781K4917j3564n4343J0008J7458J5163O714n843L205m3714
6517a7577r717J9987Q567K419J7326L274j0438k8554J3271J7159k4115q176l253
6504a9827l3845j0221K2353p6Q817L5410P013o310k3979K0553O193j5448j8917
6491b8284J6717O256m8835j4783L8839M660Q890P693J6123l814n601L442K3481
6478B4784K717N346j9836p011P204J4635j358J9622j3657j1376K2084l650n556
6465C3948j1402r789l4469k3743j8290O658L4700J5496q670J7124J7108J9619
$$ y = [34777, 24922, 14494, 9903, -1825, -26758, -27773, 7459, 2403, -35814, -32860, -41201, -21097, -2711, 15306, 1587, 8479, 1881, -13366, -20962, -6357, 19541, 30503, 16304, -8437, -41833, -13179, 3641, 22422, 47339, 33775, -20568, -10560, 6898, 22061, 28775, 22932, 26137, -17577, -27294, -7307, 1260, 3679, 21005, 24279, 13841, -14713, -1442, 15717, -8398, -16574, -19827, -53672, -63893, -41540, -41616, -32799, 2611, 9624, 3314, -20665, -112, 6081, -9367, -28284, -11567, -5311, -54146, -68929, -30090, -25430, -16540, -8847, 7276, 3462, -2139, 1303, 24784, 27501, 32847, 13011, 6000, 13204, 27839, 26481, 46103, 32446, 21070, 43154, 39504, 33948, 22546, 12757, -21712, -45455, -63745, -57087, -22387, -6891, -15561, 1563, 18671, 38290]
6453C8290K3983j5163k7840j8092o606k4661j6239J7717o499K1462L2210k239
6441A6323m4357j9164M28K9787m156j254k8956m322K2874J8876j032p376J3967
6428h362K94K1917Q75l476r162j07k089p312J468J0206j3103l9052J2846L7385
6414B328O155J1812K2343l281k3775J8816p483k1335r39K886Q0J1364k7837j5253
6400b4119L824j0074N163L1975L5499K7508N128k7667l5017m516n600r821m546
6387a2263l635K3704n562o151L0277j999k1953j0436q592J2670J0352N774j3758
6374a572j4178K2535J4902o671k7809k390L7180K4086l9216j4585l868N054j418
6361g950J6879J1069J0422J4222k9298j0796K9978K3666J940N069n93J2232N07
$$ y = [38290, 62273, 47110, 19270, 1178, -5428, -30089, -46328, -28611, -35110, -13648, 18562, 16323, -28034, -47198, -46770, -16983, -21139, -22393, -51349, -55671, -32797, -13921, -14953, -22329, -8362, -8068, 13849, 14724, 11248, 2086, 1979, -110, -7422, -5954, 4252, -8851, -47903, -35057, 2328, 8483, 20295, 42638, 39357, 15582, 34398, 26915, 5580, 4641, 7527, 7607, 18971, -8866, -24119, -20295, -30369, -25206, 6769, 42268, 69776, 74904, 47237, 12220, 7704, 2104, -7717, -12263, -15898, 7806, 2244, -3907, 26370, 24371, 2418, -8018, -16610, -3940, 6412, 12186, -1572, -15750, 6785, 21687, 15016, -12793, -15183, 21997, 46083, 6867, -7718, -11586, -6532, -7950, 8929, 19998, 30420, 44642, 15344, 4548, 34526, 58192, 60132, 65201, 64608, 76840, 77347]
6348G7347p388j6174j8984K9279K3771k6853l7530j7367k1858m817j5115q00J1522
6335b4967J764J3512J9708j0776P087Nj6591k9872J0906N983N730J0944M49j1383
6321a7501m286J4522j3447j5513K356J7111M3857L397p533K8143J0683j5902j5783
6308C0104k8990j0182j5182m919M525q343J215L924l509O136K5728k19J7874J8325
6294C6487P261O23o295o281n0677j2516J5318R408K7062R122p902k8085l6068
6281d2543Q859P213J5838J5056j3092j3167m9o314P587J5198K7823k7227K0756
6268A5938q65k2481j7104K650K1965J6071J935j1004k7143n5216J8218K2411J7916
6255a6709K4308l9243j902O40L85J7636K4343k5644m4738L6887j0399J3220J1633
$$ y = [77347, 69959, 53785, 34801, 64080, 87851, 60998, 23468, 6101, -15757, -20574, -35689, -36489, -24967, -23203, -9691, 10017, -759, 6328, 6333, -10258, -40130, -29224, -23241, -17511, -6567, -6118, -17501, -21787, -7265, -20712, -36225, -33869, -16758, 27099, 30496, 22963, 51106, 61789, 45887, 30104, 1114, -9068, -24250, -29169, -24644, -32987, -31772, -27848, -31357, -25221, 507, 288, 18162, 36487, 43748, 44371, 38076, 31795, -18882, -31398, -16080, -6672, 20390, 29512, 21610, -6475, -42543, -33684, -26471, -10633, 4423, -8669, -21836, -21885, -28199, -20612, -5414, 22409, -4818, 15938, 15073, -7408, -24512, -21862, 103, 16174, 18109, 7105, -20038, -75254, -57036, -34625, -16709, 7599, -31644, -33546, -32906, -32521, -14885, 9458, -16186, -60924, -24037, -34436, -21216, -9583]
6242i583k666J4128J0112l2280j1671j1668j0040k662K6005M3220J6683l1510
6230a932K9998L6534k5567k5469j8746j0275N356j2091P831J4741k253l759O568
6217I36j4551L257n881l5696l031O957J5533O914j0507l311l380k0761K0664L2979
6203i878K2801k013k3436p401L144K975L4791J4691l845j1264o925k0968j0918
6190a8246j3988M502J666J1456O767J972m872o1K8995j0979n0417p933K8952J5604
6176f582j9536Q490O775J8267j4691J266M0340j3450k0921m935k433J5522L693
6163A1805r383k223j4850K1808J4845r887k0611p746K389j344J6271K1397k0907
6150A564k2237l798J1831K7543m681P384J0470O929j0599j0409K3927j1966K731
$$ y = [-9583, -12249, 1879, 11991, -20289, -31960, -43628, -53668, -56330, -30325, 12895, 29578, -1932, 28066, 64600, 39033, 13564, -5182, -15457, -10101, -22192, -14361, 380, -1873, -5632, 936, -13615, -10358, -16239, -51935, -54966, -48009, -32476, -25562, -36069, -39380, -42760, -63521, -42857, -9878, 12923, 10910, -12526, -19927, -16783, -13808, 20983, 35674, 31829, 20565, 13640, -7328, -18246, -32234, -27732, -26066, -14610, -7843, -5871, -10743, -10804, 18191, 7212, -43205, -51138, -22186, -6582, -26118, -17628, -10853, 7414, -7277, -6011, 34329, 20879, -42, -4977, -7410, 8112, 11805, 2422, 199, -14651, 7157, 22002, 12115, -8496, -16242, -13853, -15197, 1074, 22471, 1564, -20673, -24471, -12640, 14903, 10222, 17606, 28076, 35005, 24406, 13997, 37924, 25958, 28689]
6137B8689L1202j3377l4875j0155j6879j7273J8960J6464M251k8985k7433L0283
6125a9128J9584o719j3081K8883j173j2484k4703o179K2145L4276k1433j7510
6113a7522J5053J3503j3132m4214J6796J3363k8107M4008J8697l7681l8411P793
6101d9854K8507j498R743M99m491Q384P042P157j594K0927M683l2707l7510j577
6087d2289L2064j616o900m55j3195K7757L6229j4973J1949q325j519J2891k1394
6074A0224L679M003J982P388r140J3856j574M696J0014l0268p733K8397J7972
6061E3496j9025l6135m657J330J8148r247K1793K3088m6440l1868K1468M771j0536
6048a3814o117J29J9880j3766j669j225n561P405K8695j1764m2692l2572J1054
$$ y = [28689, 59891, 46514, 11639, 1484, -15395, -32668, -13708, 2756, 7007, -21978, -49411, -19128, 456, -6263, -19344, 9539, 8366, -4118, -28821, -35000, -12855, 21421, -12, -17522, -2469, 11034, -2098, -46312, -29516, -16153, -44260, -252, 18445, -19236, -57647, -49854, -21347, -22845, -13102, -12603, -17094, -8710, -1668, 5489, 3895, 24822, 29505, -3202, -40712, -42289, -10225, -11841, -18741, -19196, -32391, -4634, 31595, 16622, 28571, 20246, 18727, 31618, 10224, 13903, 17906, 19888, 27276, 18136, 31992, 30418, 35114, 45128, 14860, 7127, 35524, 53496, 34471, -1664, -6321, -4991, 13157, 3910, 25703, 48791, 2351, -29517, -8049, -3278, -13814, -19931, -19802, 78, -13688, -15357, -16582, -22143, -14738, 13957, 2193, -40499, -73071, -62017]
6035f2017O446K8359K4907k6825j3535O620L9253J9412k0326n1801J1125K8687
6023i695L726r267j707J1028o486k6179Q275L6348M5106J2810O496p171j9822
6010D3462n298j833j1113k7376k0427J373J7704k2459m876J2278l452K2028j883
5997a872j3127K1225J223k575j8813j6335J0222K0893k0189L84L4946K495l0563
5984a2086R54n484Q653J2517O110O654j293l6729l1543j3280L1754J6762J8070
5971A059j277l7705k0782J6044k164J3126J0581J612k9891q197j4546K4001M6092
5958b047J9211j4248j4785j1674L518N385k44Q404K2K1220K299k1864k470N477
5944a796R31J2995l7127j8685k786j2734M286M3726K2917j6613J090L7391k0723
$$ y = [-62017, -55571, -27212, -2305, -29130, -42665, -36045, 3208, 22620, 2294, -49507, -38382, -9695, -5969, -15236, -16943, -5915, -12401, -38580, -30305, 6043, 51149, 63959, 70455, 63284, 43462, 38164, 36331, 25218, -2158, -22585, -21212, -3508, -25967, -30843, -18565, -22017, 11, -1872, -14999, 6226, 7449, 4874, -13939, -30274, -20052, 841, -19348, -18964, 15982, 18477, -12086, -11132, -16616, -7963, 4554, 10664, 17318, 16025, -20704, -52247, -65527, -33773, -17011, 1059, -218, -37923, -58705, -42661, -44825, -31699, -21118, -19506, -49397, -57594, -72140, -48139, -2047, 17164, 2916, -11869, -23543, -20025, -14640, -14884, -6480, -6458, 14762, 17061, -4803, -7273, -1796, -865, 12130, -24997, -43682, -46468, -59202, -54916, -11190, 11727, -4886, -3796, 33595, 12872]
5931A2872k8639l6K1154J659j9459J1721J7799J7125p204j0477q834J884J3208
5918B2773l3268J387J7329o554J307J6789p86l7322j1701j3058J7707K7482K4492
5905B6577L094k0294l1111Q080K1054j0927m923L3917O075k1046p198NJ2888r788
5891F403K3046L5880j8973j8286k7659k3153P483K7178m295k5920N17J774m969
5878b0974o960J8009j7296k5457K481K3057R163J0073J5497k1810k1824o579K051
5865d0569j329K1397J5108j601L514r35o820n4L699K4781k94n9579J0966Q949
5851b2767l398j1122L573J3907k4845N127J4487L7762O169J0021k990j9617o638
5838c31J0115K275j7244J0600m085M222n863m7476m2213j0992L8459K4950L7966
$$ y = [12872, -15767, -15803, 5351, 7010, -12449, -728, 17071, 34196, 26992, 16515, 7681, 9565, 22773, -10495, -9108, 8221, 1667, 2974, 19763, 18977, -18345, -30046, -43104, -25397, 2085, 26577, 29671, 9377, -21734, -13654, 7400, -3527, -8450, 25467, 31542, 10496, 3298, 3303, 16191, 6403, 29449, 65329, 46356, 28070, 411, -22742, -15259, 11919, 7624, -18296, -17779, -16005, -20974, -27934, -9925, -27221, -52678, -50197, -27140, -17977, -7904, 7593, -14217, -36041, -42620, -40569, -41898, -20501, -5393, -6994, -3480, -4415, -11235, -11289, -7590, 17191, 16897, -42682, -31716, -22767, -26165, -37287, -33714, -19807, -44652, -39525, -25038, 12724, 18893, 28914, 25924, 6307, -331, 9784, 12059, -5185, 5415, 1330, 5552, -311, -47787, -90000, -100992, -62533, -37583, 383]
5825C83K5942l1818K5227N187l4457J476k1625j5418K7950j4733j1447L7177M8250
5812D2094J8564j2466J767l1518j9946j4090j0014R081L962K246j4744P575N911
5799a1578K0904P991l40q206J0451R830j5166n278k2539J554J1451k68K0351K503
5785B1660j8278l0374J7820L478k5228j065K3457J9365K5310K2266J3780J1335
5773H3526n125k8871p722k853m858q989j3520k655l1999j0470J0692K0834J4192
5760A2182j335n945l5492j8117K3196J1383l192j625p308p371l017o622L7223
5747f040J242j7761J8933m189m2156J2677J2462K1728R230K468J7286k0622j4881
5734i623k1215K0838m140L006M819J3624n454j5686J2254J8195q382k9381J6874
$$ y = [383, 26325, -5493, 19734, 24921, -9536, -8060, -29685, -45103, -17153, -31886, -43333, -6156, 42094, 60658, 48192, 49959, 18441, -1505, -15595, -25609, -16528, -12566, -10320, -25064, -17489, -11578, 9326, 17317, 16977, 8771, 19222, 29052, 13886, 8608, -13931, -12377, -926, -1194, 19157, 21660, 3382, -26992, -9172, -5694, -30922, -31987, -8530, 10835, 36145, 58411, 72191, 83526, 78401, 49530, 41808, 38955, 34097, 25108, 11588, 8933, -23066, -33536, -22844, -2010, 12182, 10847, 4902, -30590, -48707, -25511, -14128, -17320, -18945, -26253, -33624, -36641, -43263, -6040, -4798, -22559, -3626, -7815, -49971, -37294, -24832, -3104, 6126, 8594, 25880, 5258, -9623, -30838, -10000, -14140, -11134, -6315, 7309, 1855, -13831, -1577, 16618, 8236, -21145, -4271]
5721d271J3577J747k34j949J6417k0302j5820O913J2939r121j9048J5316J2558
5708H722J510o380J1286n676l11k8717p889J7438K9546r827l5014l863L723j0725
5694c6177K4066K3342k8036k0745R714j164o36J6904n12k516J328O868p276K0083
5680E243K496j3045J1713J1939j2863j9758p715L122j1727k2619K3876O637M0664
5667A7963p191k2361j9915N804J7229R070n240j8445J2890M5225m197k2028K0176
5654B8980J1760m1474l1728J412j5686M086j282J5748P262n899O076k1247N180
5641c6812m041K8467J2890J3916K9457j0518j3534m533o473j40r803j1322N359
5628g087l752Q689J9123k267J8219L9328m1644m4747j2785K0728J5975k926r605
$$ y = [-4271, 9306, 11053, 10819, 8870, 25287, 4985, -10835, -3922, 9017, -104, -19152, -3836, 8722, 10232, 3852, 15138, 9462, 9151, -19566, -27455, -10017, 19529, 9702, -25312, -29175, -25452, -36177, -12111, 11231, -16805, -37550, -27836, -29000, -29636, -12732, -13244, -15760, -14432, -7564, -14840, 5243, 7739, -5306, 6407, 18346, 5483, -14275, -21990, -18868, -30595, -53214, -29338, -22701, 17963, 10772, -11589, -31504, -25700, -8471, 599, -4641, -23086, -10196, 35029, 30832, 8804, 28980, 40740, -734, -32462, -31050, -46736, -42650, -43932, -28184, -20922, -26821, -20745, -41992, -36812, -40853, -12386, 504, 14420, 43877, 33359, 19825, 15292, 8819, 8679, -1124, -12446, -7087, -10839, -2150, 16973, 14706, 32925, 72253, 30609, -14138, -26923, -6195, 9780, 6854, -2751]
5615b751J176K397J3931j0027j3415J2214p745Q771J048n581n233L1223K760n474
5601B3294k7388k5669j0879L2907N5163J0441j3205k3861j9021N888L1528J7231
5589E6429m0230m4383j8473L970J0569P446J4428j6909p57K9723o02m479k1624
5576b4892L872K6716J9708j6022k486K6474j4972l1511K1386K4515n965j4964
5564A1859j7418J93J1798J724J1616j1122j9083k2422l1840J0106L175L3622L935
5551a3857J6180R596k4339J1695L6226j6797j0015j1618O163m284o100Q693o666
5538e123M597K3658j7423j6284L728o622k96m830J1945j4204R797k2242r356Q995
5524c3660R197Q654L0851J4806k3034K075J4381P56m903J6079k1254J5261L457
$$ y = [-2751, -1575, 822, 14753, 4726, -8689, 3525, -4220, 4551, 5599, 18, -5215, 26008, 28768, 23294, -4094, -29763, -40642, -7735, 47428, 57869, 44664, 20803, 1782, 7670, 39198, 56429, 16199, -28184, -46657, -42687, -32118, -24672, -10244, -27153, -27910, 1813, 1211, -3268, -24892, -21020, 5696, 25404, 9382, 6896, 33370, 18398, -13113, 8273, 32788, 26823, 11859, -5559, -5366, 6432, 8156, 19772, 8650, -10433, -32855, -64695, -54589, -51414, -17792, -13857, 2323, 11919, -12420, -725, 35501, 18704, 8689, -2929, 3234, -1050, -7150, 1543, -5123, -526, 23132, 5709, -10575, -6847, -13469, -13765, -18595, -6650, -20854, -11057, -33299, -42655, -33660, -24463, -15809, 15042, 29848, 6814, 8889, 23270, 24026, 19123, 35202, 13948, 29209, 32666]
5511C2666j2741l5440K5833o730j506J5150R950N435k5390k516J3384j785j5072
5498A238P244J3890o807k4276n886K224k3563k0365k233L0233L7637O608q257
5485G687j1760k108k4241J2297J3028n351k5190K0229J9140j3553j884K5679j5163
5472a190l5636j1520j4602P069K9671m158J3604Q5j061Q407k18R590n301k5576
5458c0836p388L387N617K4558m568j8759k6160J5231J5982Q251N646j9136j5581
5445d3756j6137N558J1880J6703J2828Q123k4865J583K1540L1821J8369P814j9449
5432C2012R080j7452k5634O978J969j4706o800j803m493J4968K532k5041J0375
5419a8015K5265K1888Q016J1418j6056l7363k247K3615n40j7987K9892K1834m339
$$ y = [32666, 19925, -15515, 10318, 3588, 2082, 17232, 27182, 32617, 7227, 4711, 18095, 16310, 1238, 8482, 22372, 15565, -8711, -14597, -12373, -35936, -56301, -58534, -28301, 9336, 15944, 7687, -4073, -6181, -30422, -18125, -5097, -10448, -35638, -15409, 3731, -9822, -11706, 13973, -1190, -36826, -48346, -62948, -55879, -26208, -30366, -16762, -16677, -17738, -9331, -9549, 41, -5260, -30836, -38224, -34837, -29220, -4662, -9230, -27989, -54149, -38918, -22936, -14685, -9039, -28175, -43756, -59893, -54335, -42455, -25752, -12924, -4801, -29666, -28083, -6543, 25278, 43647, 51461, 32012, 41092, 23640, -1994, 4984, 6953, -7753, -14553, -16356, -20849, -5881, -3349, -28390, -18015, 7250, 29138, 37154, 48572, 32516, -4847, -7094, 16521, 15981, -2006, 27886, 49720, 45381]
5406D5381O23j9239j8907j6785k5008J4275l573K45J3929K1155k669o324k0794
5393a7691r803l453M2027R533k7030n450L61j1371n328j1047J6900N369L4903
5380A7920J7664j6737k0987K2607K5172N01l560m902k4436j8403o12m06P70K7434
5366B2025J5373j1719j6446J4398J627k1478j0535J8292j4553Q210l568K2779
5354B4405q356k4078L577l148P127k020j1434j0396J0171P35j9808j8048j2220
5341f3493L0522L8481Q765o257j8266J71j5456R569K2582L297q525r40J4159K6636
5327D1245J4275N816r898j2695j3385k6432m0050j3446L437K4279J3779J8662
5315E587K981j0570J754q248k1529l920K9Q132J1920Q998n075N357j4298r470
$$ y = [45381, 46004, 26765, 7858, -8927, -33935, -19660, -23233, -22988, -9059, 12096, 9427, 3103, -17691, -27494, -30947, 11080, 20613, -6417, -11867, -11506, -22877, -28205, -39252, -22352, -16983, 17920, 35584, 18847, -2140, 20467, 45639, 46140, 42580, 37678, 13242, -5161, -5773, -6179, -5409, 22025, 37398, 25679, 9233, 23631, 25258, 3780, -6755, 11537, -3016, 5194, 1626, 24405, 16049, -8029, -4452, -7600, -473, -2493, -13927, -24323, -14152, -13417, -33225, -51273, -63493, -32971, 5510, 14275, 8018, -10248, -10077, -25533, -15964, 6618, 9915, 1390, 450, 14609, 41245, 55520, 61336, 51438, 38743, 25358, -1074, -41124, -54570, -51133, -26854, -13075, 5587, 8568, -2002, -248, -8496, -30025, -33945, -33916, -25784, -13864, -4866, -9941, -4584, -18882, -28352]
5301b8352J5762k356j6002k842J1613K9406Q642K3621R500l3523m1202L7295K5539
5288C7101j7825k3207N782j4443M180J3385J1723q760k2161k1162k2014K3105
5276c4296L0033J4562j7117j3762J6573J133m757R706J6706l5293j226j217j903
5263b0858J2486K4073M563j8655n830k0944J0974J6233l727k2666n310J6099j0149
5250b3711j7540J266O031j2415j1716j3903O681K7016P596P502O360m212K9932
5237H887j571O193q5k9033j2404O762J0651j5309K2779M220K6941J9149j8881
5224B8299k7560J4687r864j4806j2734J1261p172j6794j8289o02K0347p920r61
5211d2108o403J3704L9760K1178n147k3664n1233p174M3899L0362q407k6171P656
$$ y = [-28352, -12590, -14946, -30948, -33790, -22177, 7229, 15871, 39492, 48992, 15469, -25733, 11562, 37101, 19276, -3931, 1851, -12592, -8412, 4973, 16696, 7936, -14225, -35387, -57401, -34296, -4263, 10299, -6818, -20580, -4007, -2874, -7631, 2075, 18781, -16512, -17738, -18955, -20858, -8372, 15701, 20264, 1609, -4221, -25165, -14191, 2042, -1685, -24351, -29661, -13562, -23711, -41251, -39985, -33954, -46369, -58085, -71988, -65307, -38291, -30695, -23193, -16833, -21045, 8887, 7316, 13509, 13424, -15609, -28013, -21251, -10600, -25909, -3130, 1090, 28031, 47180, 28299, 739, 15426, 5562, -9244, -21978, -10717, -17889, -34683, -52972, -53574, -33227, -41147, -42108, -48511, -34807, 4953, 26131, 20984, -2680, -53913, -61087, -17188, 13174, 4767, -21404, -13748]
5198a3748j7397m0486J1398K9712K1029M419o894P485j1163j5139R685P879L253
5185i967K1633p918j8838n927J5946J6129P119l8431j2326K8659K1799j1249p670
5172a041J5250j042l7111k041K9081j7506N178K5361j9854r124j4350j4690j0588
5159e2477J3840J9019J8898j1426P816J0365k0782O032L7357M6381j4899k1948
5147C8176k1083O534L724j0386k4448l7369P855N259K3215K8734P149j0863l710
5134A2787p667p407p557k739j7342k4643J0580l415J5714L3143m620j0750q818
5121b2734N7315K1318k6775l3103l1383K0731P1743j5210m2998j6580k2242J5840
5109b4078L4024Q942l5818k4356K396p431J8300J5468J4756K961J7948p492k388
$$ y = [-13748, -31145, -71631, -60233, -30521, -9492, -5073, -11967, -4482, -15645, -30784, -21099, -13220, -9967, 11666, 3748, -15090, -21017, -5071, 11058, 18177, -20254, -32580, -3921, 17878, 6629, -1041, 14209, 13167, -23944, -25985, 3096, -14410, -9232, 16129, -3725, -12849, -27199, -41889, -52477, -38637, -19618, -720, -12146, -4330, 6035, -14747, -8715, 28642, 75023, 60124, 38176, 17093, 23627, 27351, 16965, -7483, -44852, -36997, -31738, -8523, 20211, 27360, 16497, 12787, 5120, -2287, -9844, -12583, -29925, -54568, -43988, -47403, -31689, 1454, -3166, -13916, -22734, 34581, 55899, 29124, -3979, -35362, -14631, 57112, 41902, -1096, -17676, -39918, -24078, 9946, 18888, -16930, -41286, -38890, -46321, -28021, -12553, 2203, 5164, 23112, 15620, 13232]
5096A3232l327P146o562K8010N6654J7891l4532m0044j9437j1333K576M1646J6753
5083F8673q952j5815N014j482n1474j0073q046m246L665l736k9344K3184K3685
5070h947j992m346J5918K0615j1934k6572k8577j3394K0760N4505J8126k0126
5058A4036l9297k191K1391L1473J024j4138P451J6541J3690p089l5172j639J0593
5045A6673J2876j6704j4854q554P135J9735j2406k1086J0116O724J6576J4212
5033C0443J6772k1301m3399Q578K4148j5232j970j3677J4011J0039k2835j5390
5021b9813O501R331k2844p711K005j8399J733K206M3340K8335k9304K617L7003
5008B5000J7418j4576l0048J9006J9228J8915j9787k9013r969P608J0099n756
$$ y = [13232, 9905, 17051, 10489, 38499, 95153, 113044, 78512, 38468, 19031, 7698, 10274, 51920, 68673, 59721, 43906, 48920, 47438, -4036, -14109, -22155, -26401, -22736, -26472, -55816, -32632, -8947, -10939, -15285, 633, 21248, 9314, -17258, -45835, -59229, -38469, 16036, 34162, 14036, -25261, -27452, -6061, 25412, 26436, 12298, 19749, 36290, 49980, 42891, 7719, 6080, 16673, 29549, 12845, -2009, -10563, -3428, 16307, 3901, -17185, -7069, -345, 16231, 30443, 47215, 25914, -17485, -8907, 15241, 9, -1961, -15638, -1627, 8412, -14423, -29813, -23312, -13981, -36825, -44536, -42531, -60930, -59197, -56991, -13651, 14684, -14620, -12003, 25000, 42418, 27842, -2206, 16800, 36028, 54943, 35156, 6143, -3826, 3782, 13881, 8125]
4996H125o603K6599J9157J811q790k2246K810k4531q165J3200P03J1334K604k0598
4982d590N594O282n517Q127j8076o571J2194J5147j3471l4749J1607J8233q205
4969a3995J8589J5975O354P55k3340k7446M732j1872R954j337J9986P526k3780
4956a7899q061j608K1092J496K058l871o165n853L1656M184M669P977p709k6977
4942e011J0910J0927j6330K6115j8424k5514L2022j7293o451j4087J5007M0631
4930C2502j2249m1162l3594r494K5112K159L2748O417J4848l2548r728K9171K640
4917F822J4905r945q929k2555j2697O430J3588O161K5699L0970q103J640l1693
4904A2293l6971J4487j836J2327K167j4801j3575j4936j3073k7005r150J6784
$$ y = [8125, 1522, 28121, 47278, 49089, 40299, 18053, 20863, -3668, -11833, 1367, 2070, 13404, 16008, -4590, 1004, 7286, 1769, 9896, -8180, -14751, -2557, 12590, -881, -35630, -24023, -5790, -13995, 4594, 20569, 26923, 27678, 4338, -23108, -18376, -30248, -20294, -21631, -1645, 5881, -17899, -25960, -27568, -6476, -4980, -2922, -6793, -12958, -18811, 12845, 17029, 21698, 29675, 21966, -5011, 5899, 16826, 496, 26611, 8187, -17327, 14695, -2598, -9049, -23136, -8129, 32502, 20253, -20909, -54503, -63997, -38885, -36726, -3978, 2439, 17287, -15261, -24989, 4182, 6822, 21727, 11782, 2853, -19702, -32399, -25969, -12381, -6220, 19479, 50449, 42346, 43986, 12293, -24678, -10191, -12027, 300, 2467, -12334, -25909, -40845, -53918, -80923, -90073, -73289]
4892g3289J9126M595J0266K7560J5712R001K9605M32O77J9576o431k5298r986
4879B1546j1371j1536j0506j3582J4868M1825K7261m3189j9450j97J6874L1826
4867D4369j845O95m844k5550Q98J8000K425k2109l5498j8764K2413q360l3967
4854f2137K0880K4360J7980K1533o928j3854j5310k407p928N776J9278l542j2563
4841a4862L065J509l466K0706q484R045P764k0435O835O133l8830M417J2056L5898
4827B1351j4248K027J4865k5881l571O679r640K226K871M201J0462M820j5745
4814D17j8735L0163J0585l1729J6374P138J2307m337k4654j4527K8680k215m415
4801E052j5488P31L1905K6343j5664p725j4130k9520M816J0943J131j2127K297
$$ y = [-73289, -54163, -49568, -39302, -11742, 3970, 12971, 42576, 43008, 43685, 63261, 56830, 31532, 21546, 10175, -1361, -11867, -25449, -10581, 31244, 58505, 15316, -4134, -4331, 12543, 44369, 42524, 43219, 38375, 12825, 13723, 31723, 34148, 12039, -23459, -42223, -19810, -28170, -62137, -41257, -16897, 1083, 22616, 15688, 1834, -13476, -15883, -23811, -18035, 1243, -2299, -14862, -11797, -10288, -13754, 6952, -1532, 7513, 15277, -5158, 1677, 7810, -31020, -26603, -14547, 21351, 7103, 9130, 23995, -1886, -5457, 1222, -8418, -6192, -3321, 880, 11342, 16162, 417, -18318, 11845, 22430, -9299, 7075, 14213, 26520, 22183, -2471, -16998, 11682, 9467, 5052, -10436, -9705, 22200, 48543, 32879, 25154, 11024, -18496, -13680, -2737, -1606, -13733, -11436]
4788a1436L7913J557l735k1333j4841j9042m751K2118M522j6307j0376K7193q964
4775a7482K1339J9759j306k2437j1485J0632k1240k017j3683K1771M7793K0154
4763E1798j4794n0107k9132K7957J8083L755J4979j5798m4620K147j8344o479
4751f0555K1108J9655J5510J4294l642p645k2167m759M1747j820j3997k2231J2356
4738a2146o129J0663R508M304p536r940p942j0489J9016k421p613J2359J374l814
4724a0806q841Q397r59l4826r502K9617K2310j8943J4039K2445r477L3170K1223
4711E7847j3631m1412m077J2007m205k2162k1006r946K5415M3053p689k0120J0675
4698D749o871j601N881o288J3889K1997J1985q329j9992l0201q217j4272j0974
$$ y = [-11436, 26477, 28034, 24299, 2966, -11875, -30917, -35668, -13550, -9028, -25335, -35711, -8518, -17482, 3857, 23616, 22310, -127, -11612, -980, -22220, -24237, -37920, -16149, 31644, 51798, 37004, -13103, -42235, -14278, 3805, 7560, 22539, 6741, -37879, -35732, -54076, -60555, -39447, -19792, -4282, 10012, 6370, -1275, -23442, -28201, 13546, 11726, -2271, -24502, -12146, -18275, -7612, 1896, 6200, -1336, -11276, -19218, -29707, -10691, -13112, -20725, -8366, -6992, -10806, -19647, -11250, -12209, -47035, -56537, -26920, -4610, -23553, -9514, 12931, 3454, 36624, 57847, 44216, 2804, -1273, 10734, 6529, -15633, -36639, -46585, -21170, 21883, 14194, -5926, 4749, -2122, -3723, 2158, -4130, 9759, 31756, 43741, 35412, 15420, -14781, -22998, -37270, -48244]
4685d8244J6903P581L0835p852j6602K7200O205J9921K3979M619p855q497j6043
4672C2150o717K1021L738j2124k0345l9533k1519J8490J0274P600M691l4901m213
4659d1388M055p418L367K7954L982J4685K5556J8546j1201j6107j2556O188r479
4646F184l8786n312P127K0526O518L009L2062p625q149l773J1764o611p449k0379
4632a0894l050j287J8577J3882L599J432J4887j7628j9139q334l5233r022L0693
4619b1517K7421N875p693p187J0820L307j4714J4217j3294k3204J8336L1717J3343
4606C7427k8533K293k692J9891l0985k7795j0525K1350k56M615l580J3685N081
4593b4j277q274k9520J4405K5004J4514k0533k0580K2398l62k1763P57K6873j3656
$$ y = [-48244, -31341, -23760, 7075, -777, -17379, 9821, 16026, 35947, 59926, 64545, 56690, 48193, 32150, 25433, 46454, 50192, 38068, 17723, -21810, -43329, -24839, -14565, -6965, -2274, -37175, -41388, -37333, -44751, -41384, -13430, -9448, 5237, 30793, 49339, 38138, 22031, 9475, 15663, 6184, -32602, -37914, -30787, -10261, -3743, -734, 31328, 23703, 15554, 11781, 23545, 16934, 9485, -10894, -13944, -15231, 3346, 17228, 20827, 22259, 37146, 19518, 379, -7955, -43188, -52210, -21517, 5904, 11779, 4086, -3101, 7719, 11026, -3688, 10529, -2765, -25969, -7633, 24084, 37427, 8894, 11187, 8495, 28386, -2599, -30394, -40919, -19569, -19825, -15210, -18790, -5105, -24, -1301, -9575, -39095, -24690, 314, 14828, -5705, -26285, -3887, -4249, -26012, -25255, 1618, -12038]
4579a2038P083J6311j4604k3738j8554J6349Q298N455J815q750L1662J1441J3995
4566C4725j1763j1460M0786N281l3449k0524q102k516m834J5365M492L9467k0770
4553B6698l2812K4066J1709o606K4821j4562k8493L3846R733o241l250j077k7562
4540A0270m0397J136K9999J6249q065m6033J790L4863M5767R473j4322n5011l5046
4527d9327J715J3051R191L7157j3272k6414j6006o384k665K797K3743J877K9909
4514E372q39o564P690l308r343l8026J0352j4311J419r214J8868J8477R015n059
4500a5471K2808n886j5657r119m718J3431J4295p896L784J8652J6823J9918N537
4487E6501k0594l0642o795l616o812l0615o527L0441K3787j669J246J5568M60
$$ y = [-12038, -4955, 11356, -3248, -26986, -45540, -29191, -20893, -15438, -13623, -22373, 9289, 20730, 34725, 22962, 11502, 52288, 57569, 24120, 3596, -4506, -7022, -11856, 3509, 8001, 47468, 26698, -6114, 17952, 29661, 23055, 47876, 33314, 4821, 38667, 48400, 42159, 38909, 37832, 10270, -30127, -28991, 1008, 17257, 9192, -36841, -35051, -188, 45579, 55052, 40730, -14281, -49327, -47612, -34561, -25370, 11787, -1485, -27899, -43905, -50289, -52954, -50157, -26414, -24537, 5372, 4533, -2031, 5659, 2351, -6992, -45018, -34666, -48977, -47558, -56772, -37904, -19427, -10412, -15471, 7337, 1451, -14206, -23325, -28043, -14612, -317, -8213, -4429, 14223, 31046, 50964, 56501, 35907, 5265, -1530, -5146, -11958, -42573, -49100, -18659, 5128, 3459, 4705, 20273, 20733]
4474B0733m774K8141M844j7326j2913k1384R090J398N269J8309K0955J0080j6067
4461D6355k9576O546j1483k7021j2119J3330p170J0085K3297K0551L0158r06j4749
4448D7298k2939k2860j336P410o959q464J4929O826j0311n358Q931p229R694M5910
4434E5542n23q406M992j4134K213j9804l2961Q745K057k399j680J6241j1824o844
4420h785J6004K3058K061J2893K3519k1272o821R693J098j6631j3113Q76l3189
4407a0609l7324P769J5058K4236l013j7214M435p857j619J2086L961M60k265J0373
4393a523j3265M785q404n511J3144J6938j1272N312j6626M8071K2460l6201K789
4380B0697R771p262k07J2454j6865k5460j1084O871j2391o990J8391L7632p237
$$ y = [20733, 15959, 44100, 48944, 31618, 18705, -2679, 6411, 7809, 13078, 31387, 52342, 62422, 46355, 16779, 23325, 11842, -15179, -27298, -13968, -21138, -11053, 12244, 32795, 62953, 62047, 47298, 24359, 1499, 163, 7573, 614, -7850, 7079, 13905, 3594, -1764, 7167, -62, 9632, 55542, 55019, 46613, 51605, 37471, 39684, 19880, -13081, -4336, -2279, -4678, -6358, 9883, -1941, -8785, 7219, 30277, 32338, 45231, 68750, 47478, 40657, 50350, 51448, 34817, 21704, 22580, -10609, -47933, -40164, -25106, -870, -3883, -21097, -16662, -24519, -26138, -14052, -10091, -9631, -11896, -1523, -14788, -10003, -18407, -23918, -10774, 6164, -5108, 204, -16422, 31649, 54109, 17908, 20697, 30468, 23206, 22999, 35453, 18588, -6872, -17956, -11085, -23476, -30466, -12075, 25557, 18320]
4367A8320k3K2398o779k317J856j7655r652l9039j5450R680K5477K1008K7574
4354C5398k4547l7170J5014O789k328l562k8236P210J9563j4105K4698j0489j2207
4341b3972n133N393L2193L4645Q559j6392p222p043j0800M255k767l2407J4974
4328e717r210j0019J7278P68K8327p852K679O874k2178R253p794k229k016l7246
4314c9082j5532N622L829J6284j2315K534J0424j6216J1036L3797K9841p497l9096
4301a6371j6452L472K4172L1512J3828k8171m0302j931L0074k960j5817n224K8296
4288D126L5001J1591k5480N597P738k1741l6424M108K3546J082j4754J7188K795
4275A4373k1012J5796J9768j875k0039j1514j0629J0587K4879K1459K1390m343
$$ y = [18320, 18297, 40695, 33916, 31599, 33455, 15800, 6148, -32891, -48341, -38661, -13184, 7824, 35398, 10851, -26319, -11305, -4516, -6844, -10406, -38642, -31432, -11869, -25974, -1276, -11765, -23972, -29105, -23712, 8481, 43126, 51685, 35293, 28071, 21028, 10228, 14483, 11716, -20691, -5717, -14927, -24946, -7668, -6900, 21427, 13575, 16254, 23128, 950, 10203, 2409, 180, -1836, -39082, -54614, -48992, -45163, -28879, -41194, -38660, -28236, -44452, -33416, 381, 30222, 22725, -16371, -32823, -29351, -5179, 26333, 40161, 11990, -28312, -30243, -169, -3129, -18946, -24170, 4126, 39127, 50718, 25238, 30835, 38573, 16832, -19592, -15484, 8062, 9144, -5610, 11578, 14373, -6639, 9157, 28925, 27050, 7011, -4503, -15132, -4545, 20334, 41793, 63183, 58840]
4263E8840k8901l5179n424J2185J8712l023L395L954J5081K4440N421j8280k3970
4250B7251k1856k3372M110J0811l333j9444j2415m11J1665r465k6803j1927J1461
4237f3728K0805J317J1950K4445J451K3009L7717j8397L912J5396l2355j2650
4225A2872j4554q716J7009k1742r403J6450j380j1194J7494K3467K619j5246r871
4212b195K0649J1839k4021J2921m244k3805K101J2342L765o798l8263L2328K7571
4199B4190j2629O702l5224j3277J4995L4353M067q422j4796j3351K6426Q595J349
4186B2978o00r42n4384m4604K0147L2295K2553J246p98L012O718k2475J4380J1783
4172A1309k0463j6507q990j6649M631M3234J3281k0835j4043M685K0857J3219
$$ y = [58840, 29939, -5240, -10664, 1521, 20233, 17210, 20605, 24559, 39640, 64080, 69501, 51221, 27251, 5395, -17977, -13867, -3056, -6389, -25833, -38248, -38659, -26994, -36459, -63262, -75189, -63728, -42923, -41606, -29656, -5211, -3760, 19249, 56966, 38569, 42481, 57877, 25522, 12872, -1682, -10398, 6611, -15131, -24534, -8084, -9464, -20658, -3164, 20303, 22922, 7676, -2195, 18454, 30293, 6272, 19193, 14949, -8856, -6755, 5587, 9352, 2554, -35709, -3381, 24190, 11561, 18263, -16961, -30238, -15243, 19110, 23177, 14755, -41, -13392, 13034, 21629, 22978, 22378, 21436, -32948, -77552, -57405, -25110, -2557, -1311, -2109, 903, 7621, -14854, -474, 11309, -9154, -25661, -34651, -51300, -46669, -3435, 9846, -10989, -25032, -20347, 510, 13729]
4160A3729j1864l6411L745k0039J3801J0766J3014J8689r905l1917J2536Q905
4148a4951j737l774j1801O543m736p692M472J8978n637P67M414K500j884O405
4134h133J4802K2716L223j0282j3039M3335N0107j2166l7052n6079l1385k1334
4122e5287L485J3834K9553J5434k0854j6625L106r887k6461R075J4800K5835J4621
4109F29K256j8808J7210r93K0561K57k9275r471o514J6142K2509J674r609j1423
4095d855Q563J7658k4851J5094L1175M083l8461J473Q487R869L614j569j6830
4082A3450j6197Q132J3744k760L0q07J1856P985k0421J215j6694l236L708J9425
4068A9430j2418j6274K4727l051j8060l7240j9005K2303J8144L6761n748k7300
$$ y = [13729, 1865, -34546, -30801, -50840, -37039, -26273, -13259, 5430, -4475, -36392, -23856, -14951, -16688, -20462, -32263, -25720, -30456, -38148, -33676, -14698, -20335, -19568, -15154, -12654, -14538, -8133, 6669, 29385, 32608, 22326, 9287, 52622, 102729, 90563, 53511, -2568, -33953, -55287, -51802, -37968, -8415, 7019, -13835, -30460, -27354, -37241, -63702, -54627, -39827, -13992, 629, 2885, -15923, 1287, 294, 20855, 21112, -8163, -17634, -24148, -8006, 14503, 16177, 6568, -4855, 3708, 21366, -3485, 11609, 42784, 46867, 8406, 9879, 18366, 28235, 31849, 30280, 13450, -2747, 5385, 19129, 16369, 16399, 15592, 27448, 35433, 15012, 16227, -467, -3703, 5, 19430, 7012, -9262, 15465, 12414, -5646, -42886, -61891, -39588, -21444, 15317, 9569, -17731]
4056a7731J8130M639n123m972K242L561J5627N52K228j3886n402N278J8102K1047
4042D4292R358O477n896j5262J94k5640l0542N028j030J2844K2422k8977j1006
4029a7738m687J2600P546J1624L6673k9287l2403K527K6888K2315p933O435O557
4016D1117j3357Q109k3266k6796l885K1177O7p729N753j1915k7538O455q21K0657
4002a1972J239n604J9914m881o442j3279J0337Q788Q285K9349Q259l4624n8326
3989d8957l4003J8805J6600L935m206j3581r62J8415K0297m753n216K4219K0921
3976A1514n452p739j6181M262j0640j6149J4749M8060N144n6685M48L2903J3843
3963A8077k3603l3116j4588J5537O588J1000K4094r656j1947q113J290M597n860
$$ y = [-17731, 399, 5038, -85, -5057, -2815, 746, 16373, 16925, 19153, 5267, -135, 5143, 23245, 44292, 53650, 60127, 54231, 38969, 39163, 13523, -17019, -11991, -13021, -177, 22245, -6732, -17738, -22425, -9825, -2279, 9345, 46018, 16731, -15672, -13145, 13743, 36058, 28125, 34560, 41117, 27760, 35869, 12603, -14193, -18078, 3099, 3166, -4563, 1190, -10725, -38263, -31808, -32629, -11972, -10733, -16337, 3577, -1304, -7746, -21025, -10688, -1900, 6385, 35734, 43993, 9369, -48957, -82960, -64155, -47555, -43620, -47826, -61407, -62369, -43954, -23657, -28410, -33626, -9407, 11514, 6062, -1677, -17858, -13596, -24236, -40385, -25636, 22424, 27568, -29117, -28669, 4234, 18077, -5526, -38642, -53230, -37693, -31105, -20105, 3989, -5667, -17614, -25727, -24437, -19840, -25700]
3950b5700K3730j6757Q593L349j7447l6043K2277J094l0008K4201K9403J1094
3938b214j7117o32m457Q78l814O217K6633m292j9737j3677j6903K1617o370k228
3924c6096K9219J7237J98j1171K5985o986O371j9903j6440K4265q021k4674j4272
3911c4288Q125L2740J1769j4989k4759K488L2519n185j9396k7053n564J5371K1252
3898f970J7930j941j6390j6178j2114J0247K1831J7590J4823l8318k1282J641
3886b9131J2460k017k0409l775K7509L257J8339J2499p53k2942R238J6133P288
3873B7696q38j0898k3478j618J9578M2301P733j9007k6623k222m728n688k2723
3860b0515r291J2827J0186L8143k701M674j6069q638Q901r233p069l0451J261
$$ y = [-25700, -1970, -18727, -10134, -6785, -24232, -60275, -37998, -36904, -66912, -42711, -13308, -2214, -19331, -19963, -24420, -23542, -27356, -21139, 5494, 1202, -18535, -32212, -49115, -27498, -33868, -36096, -6877, 10360, 10558, -613, 25372, 18386, 24757, 4854, -11586, 12679, 4658, -20016, -34288, -26163, 6577, 18346, 3357, -21402, -18914, 13605, 8420, -10976, -38029, -43593, -28222, -6970, 10960, 9019, -7371, -23549, -35663, -25416, -3585, 14005, 28828, -9490, -30772, -29131, -16671, -18688, -39097, -42872, -15363, -12106, 6233, 18732, 17979, -4963, 4275, 20408, 27696, 26858, 15960, -7518, -9136, 10442, 52743, 60476, 41469, 14846, 12624, 7896, 2208, -20515, -29806, -16979, -6793, 31350, 28649, 33323, 17254, 8616, 17517, 8284, 1215, -29236, -27975]
3847b7975P696M272l561R030J5780l535l9823J1651K7527J9189J3604Q71O550
3834D1276q973k3710l695j5980k1628p199N41m564O611l206R570L85N450K9856
3820D734j5977k2198J739M0012J1434J7101k453k3261m0874j6308L226q485l491
3807e4801K4090J6091l527j3486k5813r9K2423N1829q758k4782r846J6981R707
3794IP276K8394P100L270j7840k2623J8453P539J494J4099l2189l8686j7705J0091
3780c1318L8888J8016k7249n956N642o380k846p070N356k4268k666j4069K9543
3767b4377K0966l234j8378J7054J9777J9893l2908o26L0005j3385m87L8236j876
3754E0660j8227l1054K2645j4487J3476K1575m0712l6433K1006j3452k4040L5864
$$ y = [-27975, -20279, -16007, -19568, -10538, 5242, 1707, -38116, -26465, 1062, 20251, 33855, 34726, 41276, 32303, 8593, 4898, -11082, -32710, -39909, -39368, -43932, -37321, -40527, -30957, -30572, -25122, 4734, -11243, -33441, -31702, 8310, 19744, 36845, 34392, 11131, -29743, -46051, -42825, -51310, -54801, -30711, -14620, -18147, -31633, -57446, -57545, -35122, 16707, 7949, -16833, -26679, -9698, 9, 7285, 35679, 42779, 46049, 28209, 5586, 24039, 31578, 33072, 47171, 14982, -23704, -41409, -31318, 7570, 25586, -1663, -7619, -1977, -8357, -11203, -18273, -12917, -37185, -39851, -53920, -24377, -3411, -6645, -25023, -7969, 11808, 31701, -1207, -1833, 28172, 14787, 14300, 52536, 50660, 32433, 1379, 24024, 9537, 23013, 44588, 3876, -32557, -11551, -25003, -49043, -13179]
3742a3179J4090J2812p459R584J1164j4755j0596j3064n305O092R038K1944K1243
3729D1609R831J183k3942l6686j2673J6928L0784j9206p625K959k3898K400L3464
3716A5128J5993p273r003o420j8740J203j1782M279o918K9442J4160j8274L873
3703E668K5591q367M54K2756J5750j9431j1928k1873j4153l27k574K200N312j221
3689b143p125K1530j2800j282K0267k234j4785j8023K6917L2838n0930j6540J1762
3676a2548P418J0703J9238m222l2715j3252K2226j3801j0421K734N914N67j4221
3663c2380J8528Q512o455o02J5223L562k4931K134p659J524J4206K5649J1503
3650B8814K2999l132l7992l1231m095K5399J1538K8605K1978Q025m171o206j3918
$$ y = [-13179, 911, 13723, 6264, 15848, 27012, 12257, 1661, -11403, -16708, -10616, -1578, 20366, 41609, 51440, 52623, 28681, -8005, -20678, -3750, 27034, 7828, 203, 3162, -20736, -18336, 15128, 31121, 23848, 14845, 8425, -10315, -9112, -20894, -16615, -23533, 5909, 20069, 1795, 5668, 31259, 22892, 23346, 46102, 61852, 42421, 30493, 8620, -5533, -5860, -8434, -6234, -922, -2143, -9268, 12262, -538, -1820, 18447, 16213, 1428, -16595, 10322, 43160, -7770, -24310, -12548, -5130, 5573, 24811, 20589, -12126, -25378, -3152, -16953, -27374, -24640, -18726, -18159, -32380, -13852, -5340, -11795, -12397, 2826, 6388, -18543, -16409, -24068, -22544, -8338, 17311, 28814, 51813, 48681, 10689, -20542, -24637, 762, 12300, 40905, 62883, 70908, 66737, 60531, 46613]
3637D6613k7036j2204K8927p143k2488j8429r304P751j2828m3796P073M0844L1447
3624I427J4875m722k090k166J0954k604k2479j3759M5487l0925k4867K2331L6626
3611C6088k910k8393J7221m6091j4427M0474O996j2017L770j929K4268J7270j0497
3598B9823k1211j1029K405p435M01J5329q056q87J1653n919j6545j3912J2425
3585a2958J3877j5851j6278L3831L382l4904k2715m80pL311N0382N3582j1602
3572D3570l3033k2588K1839K2902j1557P045J6773m3386K2243n872l4847J4695
3560b216J0645n88J012k508l593r245o386M964J0138K4645m930j0806J8231K1315
3546E0678J4718k8825m2779k2234j0672J7704P955k642K26L0101L6401J4075l4903
$$ y = [46613, 19577, 7373, 36300, 29157, 6669, -11760, -21064, -13313, -26141, -69937, -62864, -22020, 9427, 24302, 19580, 17490, 15324, 26278, 23674, 1195, -12564, 32923, 1998, -22869, -538, 36088, 33178, 4785, 22006, -24085, -38512, 1962, 8958, -3059, 711, -1218, 23050, 40320, 29823, 8612, -2417, -12, -7447, -7046, 8283, 227, -660, 10993, 5074, -11471, -25383, -12958, 919, -14932, -31210, 2621, 6003, -28901, -51616, -52096, -52103, -48792, 1590, 55172, 43570, 10537, -12051, 9788, 32690, 21133, 28178, 44951, 1565, 23808, 17936, -16911, -2216, 8429, 7841, 8853, 6345, 2752, -6493, -12879, -7915, 2223, 26868, 21938, 11132, 29363, 50678, 65396, 36571, -6208, -28442, -39114, -21410, -13455, -16097, -15871, 14230, 50631, 64706, 29803]
3533B9803j0571k3763l7098J3997K6969n482L637J7298o971L449m144j6992k8811
3520c8679R271O206K8482L059j6811j3987N468K5203M2451J9269l2844l7451k8803
3507b9166K4184K7694j3492k4078k2227J7910K8904k4367k5578L4187l352l4061
3495d3442m680J0402K9206J680J143K737m698L682J9277j3515l6502k0261J3752
3482d1219L028r471J9118r619m340k1604N763L068J0577N0447K4381N174k4729
3469A0574l2876L0071j5095N046J212n688M4292J8352j2096k8123j6241J1181
3457A0609j982p819M738N296j1176k6233j023R665R064L0405R871j5715j963J7677
3443C1414N340q624j2691p111L791K3386J6201P286j9265o432k9822l2179J3368
$$ y = [29803, 19232, -4531, -41629, -27632, -663, -6145, -2508, 14790, 7819, 11268, 7124, -9868, -38679, -29408, -23202, 5280, 8339, -8472, -22459, -16991, 8212, 50663, 69932, 37088, -363, -29166, -4982, 22712, 9220, -14858, -37085, -19175, 9729, -14638, -40216, -6029, -9381, -43442, -48122, -37720, -8514, -6834, -5691, -2954, -7652, -3970, 15307, 1792, -34710, -54971, -41219, -38191, -47662, -28544, -38163, -42503, -64107, -58344, -55276, -44699, 5748, 30129, 35303, 10574, -22302, 7769, -7326, -2280, -1068, -6756, 37536, 55888, 43792, 15669, -572, 10609, 8627, 808, 5546, 10842, -334, -26567, -27590, -17925, -8861, 21544, 31415, 15700, 13737, 31414, 36754, 28130, 15439, 8328, 12119, 35505, 51706, 58992, 39727, 33295, 3473, -28706, -15338]
3430a5338j6624j2790J4652J6005K5284r449m9217k1246J8182K8246L3896K0291
3418C1892n142k2551k481o680K7267J9422l2023j3150l91K3915J5078n635k5206
3405D315j5423j0746j7694J8447M0466q610K707K1700M348m0719j6246J6424j0069
3392a1100k8217l740K9622N8918K6156j2649k8423l5804P008J6408K8201K1300
3380F7680m9908l1142j058J3899m62J5050l09k1726l6872j3693P239r064Q227
3367e2139J7480n87j5892n299J3315J724J7785P971J8922J2522r734j963J446
3354E551k0574J5298k3280K3881p848j5633k0204k1382K0203K540j5144J5964
3342d0628k743K3930K5821O207k0244J3917j0225j7582L0880K2229k009k4801
$$ y = [-15338, -31962, -44752, -30100, -14095, 11189, 1740, -47477, -68723, -50541, -22295, 11601, 31892, 26750, 4199, 1718, -4962, 22305, 41727, 9704, -3446, -3837, 20078, 35156, 29521, 4315, -11108, -21854, -39548, -21101, 19365, 10755, 13462, 35162, 39510, -1209, -17455, -1031, -11100, -39317, -43057, -13435, 45483, 71639, 58990, 30567, -5237, 1771, 18179, 46380, 67680, 17772, -13370, -14428, -529, -991, 14059, 13750, -7976, -44848, -58541, -51302, -60366, -52139, -34659, -35246, -51138, -56437, -43122, -41398, -23613, -15642, 3280, 15802, 6068, 4105, 5551, -15023, 275, -23005, 876, -6972, -22605, -42809, -64191, -43988, -41448, -56592, -40628, -43371, -19441, 6380, 12587, -7657, 6260, -3965, -21547, 9333, 31562, 29553, 4752]
3330D752Q787j2165k7337L727L1430J1934Q563K323L687j9348m1035l2413k6369
3317h3464R448J7257N631K8221K0454N968k56J5252K3585L105K0368j5131j5989
3304C4449k5449k3893l009j1786M883Q259N2357r197l7169m2867k2627L6219J9375
3291b0455K932j1852J6671P236L12L3545j6287j8197o663k4512J3571K0087K0467
3278A6855L314l3934Q613Q771j1279j258l756r09q537K0303K0188J9190m650k0694
3264A2217l0431K3101K1752J9773K2716J8481j6476k7146J4061K070j1124l714
3252D5280L801l0589J1940K2906j466m509l2571l485R40p927M062j5524r319j8933
3238c5394m7771O366N1411Q298r568J8964r262K7501l875J4847K307j4691j8749
$$ y = [4752, 13539, 1374, -25963, -22236, 9194, 21128, 29691, 32014, 35701, 16353, -24682, -57095, -83464, -74016, -56759, -51128, -22907, -2453, 3515, 3259, 18511, 42096, 45201, 65569, 50438, 34449, 9000, -14893, -17902, -29688, -24805, -16546, 35811, 26614, -10555, -53422, -76049, -39830, -20455, -17523, -29375, -12704, -5468, -5156, 28389, 12102, -6095, -12758, -37270, -23699, -3612, 16855, 20169, -13765, -5152, 3619, -7660, -8918, -12674, -13583, -22120, -1817, 18371, 37561, 32911, 12217, -18214, 4887, 26639, 46412, 69128, 87609, 71133, 43987, 58048, 60118, 48994, 45280, 49081, 18492, 30432, 53338, 51872, 47363, 14792, 11307, 12247, 4320, 8382, -7142, -16461, -35394, -83165, -76799, -25388, -17090, -26658, -7694, -16956, 10545, 6670, 21517, 23824, 9133, -9616]
3225i616K1213j2952L691J4141K665k172j0621K032J2565K3647O19p206P198j3597
3211C1607j4225k9008M659K8744J7515J687j0955k7920K827P447o294j0419N707
3198A372k626p476j2040O694J8728N895k5891K29p600j9202N027J9619j942j6483
3184c5696L1050K4637j1672p862Q2M641l2831j3527M170O118l313K1873j7K0355
3170H008K0569j9564K126J5668n584j9866l2032k9228j0630K8505L3220k0109
3158b8917l4367J1289K3969L4794J5644j2973K0353O541L714k483r197j7160j1243
3145c6k5414P712J1403J0269j1470p313l2614L107K2386k0984K4723O199J5321
3132C289J5963J1964k8378q851K1251P299J7361J5211l7465j1340J7899l1637
$$ y = [-9616, 11597, -1355, 2336, 16477, 19142, 16970, 6349, 8381, 20946, 44593, 45212, 38006, 45204, 31607, 17382, -11626, -6967, 21777, 39292, 40979, 30024, 2104, 4931, 12378, 6084, -4335, 1372, -1254, -8730, -20770, -14076, 4652, 10547, -15344, -15115, -22715, -41917, -36890, -17271, -19213, -35696, -4646, 19991, 8319, 457, 539, 5180, -27651, -41178, -37008, -30890, -34203, -12330, -12347, 8008, 28577, 9013, 11139, 26807, 21223, 1357, -30675, -59903, -70533, -42028, -8808, -28917, -63284, -51995, -28026, 6768, 22412, 9439, 29792, 36333, 40047, 37564, 28367, 11207, -36, -25450, -17738, -6335, 3934, -7536, -14849, -47463, -44356, -21970, -42954, -18231, -12032, 3289, 19252, 31216, 2838, -6013, 15238, 22537, 39898, 55109, 17644, 6304, 24203, -7434]
3120g434j8477J1444K0609K6414j8084k0962K7167J8878p920m469k0211l189K1027
3107B4793N419j6555L89j7599k2878j890P271K0958K1173n520j5059L263m484
3094g19j4610k358J2091J1874n054j7748j5985J8136K6635j8536k713J9172j9111
3081h926k0889K552K4229j877j1629n613L6919L1380j1188j6662n532j6252j2801
3068a6289P566p832J0383r413m926j6586j8790J4952J5075K5506K8940J0517J4662
3055E3765R452j6955k7265j1455k6062n028L4715r112j171n168N591o563J4786
3042I530j0570o938L2985p860j0467j0549Q361K1762j2690k1359J8600m238k3394
3029a6827k877L092L2707J3756j3134j7690r404j6222j5357P130K0416K4927J2007
$$ y = [-7434, -25911, -14467, 6142, 32556, 14472, -6490, 20677, 39555, 31635, 27166, 6955, 3766, 24793, 30212, 13657, 14046, -3553, -26431, -28321, -21050, -92, 21081, 15561, 502, 3765, -719, -15329, -17687, -5596, 6278, 1224, -16524, -32509, -14373, 12262, -6274, -8987, 10185, -8926, -29815, -27263, -3034, -4911, -16540, -22153, 14766, 46146, 34958, 18296, 12764, -3488, -16289, -8723, -16555, -6172, -15585, -20511, -37097, -55887, -40935, -25860, -354, 28586, 39103, 53765, 63217, 46262, 18997, 7542, -18520, -23548, 11167, 2055, 884, -4284, 1307, -5256, 9530, -1040, -7978, 25007, 17147, 6680, -3869, 4492, 26254, 13564, -7795, 10805, 6567, -16827, -19704, -16612, 16095, 29851, 16717, -973, -10377, -26599, -41956, -34826, -14410, 10517, 22524]
3016B2524l1281k5061J2102K0745J4539p006J7592J3276k2503n0442P992K0685
3004f838K5212l2087j3715K0337j5245J6188O039p795o252k9543k415K4290L659
2991a8165m263j1409R687j8651K4159R137j1068J0004k34M1888J969J9249J0583
2978F2886j8801o591O636J4067j8807l1132M745K2966J6062M222j3022q147j1333
2965B3751p367j4447J4435P790q308M597q183N789j9332K166J0421L2659J3717
2952E7688J3237l0059m9420J0094l35l819J2267K8086J5408L948L241k5854k7781
2939F701q349N618n855j9045J1191L0158J8927L680j5285m1563J732K222o557
2926a6425k9045N709M566J2113j218p940L4226K0310j78J7225j646l4704j1405
$$ y = [22524, -8757, -33818, -21716, -971, 13568, 6562, 24154, 37430, 14927, -35515, -27523, -6838, 18374, -13713, -27428, -7091, -22336, -6148, -109, -7904, -14156, -43699, -46114, -21824, -18165, -22428, -33837, -24150, -42801, -18642, -9505, -20573, -10569, -10803, 31085, 33054, 52303, 62886, 44085, 37494, 44130, 58197, 39390, 8258, 13003, 35969, 52031, 56253, 43231, 35084, 23751, 16384, 1937, 16372, 24162, 15854, 20451, 12268, 18057, -1275, 891, 11312, 43971, 57688, 70925, 40866, -8554, 1540, 1205, -2614, 9653, 37739, 53147, 57095, 60336, 34482, 6701, -1648, 3970, -1885, -20930, -9739, 20419, 39346, 43026, 27741, -13822, -12090, -9868, -16425, -45470, -39761, -35195, -23082, -24300, -32240, 1986, 22296, 22118, 39343, 37697, 2993, -8412]
2913h412J024r878n375o557Q404K6838l34R311N726j7476l9808k6303J9066L2149
2899a1625n468o297R061L1584K4448J0715k5822k0550k1844O503J6133r437n644
2886h243J3200M2538j7277l4453O10k9610j1281J703O935J1817m470M872J5741
2873g918j552j9825q42P089J8449Q869j484L1482J8072n2136m2125K2055j5822
2860c5688K1447M448K1483p897j6142O313l524R313L698j9109K759j6864m3078
2847g2841Q350M9037J6013J3807J271l6961j9708J5828l7072j2632L3095M1649
2835a64n497J5877j0640k174P147k335J8486K3597j194K1638k815l548j6804k5622
2821A5952l7484N856R480O961K6080l182j2523J6661k4912j2K5334L3305j4130
$$ y = [-8412, -7388, -17266, -22641, -29198, -20794, 6044, 5710, 15021, 20747, 3271, -36537, -62840, -43774, -11625, -17093, -23390, -14329, 17255, 41703, 52418, 26596, 6046, -15798, -9295, 6838, -2599, -8243, 4957, 47495, 30218, -4235, -3625, -33235, -44516, -42813, -35878, -24061, -28531, -23659, -7918, -9470, -29295, -30137, -23048, -4599, 4270, 2786, 34268, 52340, 204, -41921, -19866, -35688, -14241, -9793, 11690, 3793, -12349, -6036, -9560, -247, 3451, -15658, -12899, -29763, -72841, -64491, -15454, 559, 14366, 15637, -21324, -41032, -25204, -62276, -74908, -41813, -164, -5661, 10216, -424, -2598, 4549, 2214, 20700, 44297, 43103, 64741, 61926, 58378, 41574, 15952, -21532, -15676, -6196, 765, 26845, 23663, 11140, 27801, 2889, 2877, 28211, 61516, 47386]
2808D7386n5467o522J092j4122k84P790K657Q160k622j5030J1983J8569k3261
2795a9671P211Q686m0858J3561P121l390k0383j442K0916O377J5418M953J6300
2782A4799j2289J8535p918k0646J7613Q992m126M5378K1554k4985j5017k748j3276
$$ y = [47386, -8081, -14603, -13511, -27633, -27917, -20127, -17470, -9310, -11932, -26962, -14979, 3590, -19671, -12460, -3774, -44632, -31071, -23950, -27340, -47723, -49165, -28249, -21872, -6454, -1501, 14799, 2510, 21045, 13127, -7519, 10094, 19086, 14960, 60338, 81892, 56907, 41890, 39142, 25866]
$$ [...]
##END NTUPLES=NMR SPECTRUM
##END=
