##TITLE=Analysis number 327638
Compound Code cc 34913
Project Code adrs
Chemist Name ugmt
##JCAMPDX= 6.0         $$ Bruker NMR JCAMP-DX V2.0
##DATA TYPE= NMR SPECTRUM
##DATA CLASS= NTUPLES
##ORIGIN= Bruker BioSpin GmbH
##OWNER= nmr
$$ XWIN-NMR		Version 3.5
$$ Thu Mar 29 08:49:22 2007 GMT Daylight Time (UT+1h)  MAYBRIDGE\nmr@NMR_250MHZ
##.OBSERVE FREQUENCY= 250.131544655141
##.OBSERVE NUCLEUS= ^1H
##.ACQUISITION MODE= SIMULTANEOUS (DQD)
##.ACQUISITION SCHEME= undefined
##.AVERAGES= 16
##.DIGITISER RES= 18
##SPECTROMETER/DATA SYSTEM= dpx250
##.PULSE SEQUENCE= zg30
##.SOLVENT NAME= CDCl3
##.SHIFT REFERENCE= (INTERNAL, CDCl3, 0, 16.522)
##AUDIT TRAIL= $$ (NUMBER, WHEN, WHO, WHERE, WHAT)
$$ ##TITLE= Audit trail, XWIN-NMR		Version 3.5
$$ ##JCAMPDX= 5.01
$$ ##ORIGIN= Bruker BioSpin GmbH
$$ ##OWNER= nmr
$$ C:\u/data/dgb/nmr/ADRS/2500/pdata/1/auditp.txt
$$ ##AUDIT TRAIL=  $$ (NUMBER, WHEN, WHO, WHERE, WHAT)
(   1,<2007-03-29 08:48:49.99 +100>,<MAYBRIDGE\nmr>,<NMR_250MHZ>,
      <created by zg, POWCHK disabled, PULCHK disabled
       configuration hash MD5:
       49 4B E0 1D 92 C2 6B 37 9F E6 65 BC 52 41 86 1D
       data hash MD5: 64K
       62 FD 66 54 70 88 6F 59 63 F6 0B 6C CA 2E 6C 8E>)
(   2,<2007-03-29 08:49:08.75 +100>,<MAYBRIDGE\nmr>,<NMR_250MHZ>,
      <Start of raw data processing
       ef LB = 0.3 FT_mod = 6 PKNL = 1 SI = 32K 
       data hash MD5: 32K
       60 92 53 73 0D 58 3D EB 1B C4 26 F0 99 05 6F 26>)
(   3,<2007-03-29 08:49:10.55 +100>,<MAYBRIDGE\nmr>,<NMR_250MHZ>,
      <apk 
       data hash MD5: 32K
       7C 63 9E 3A 07 C1 F9 4B 5E E5 F9 8E 71 47 7E 2B>)
(   4,<2007-03-29 08:49:11.32 +100>,<MAYBRIDGE\nmr>,<NMR_250MHZ>,
      <abs ABSG = 5 
       data hash MD5: 32K
       AB 75 58 11 72 A9 F9 84 60 41 8D D5 A6 C3 EC BA>)
$$ ##END=
$$ 
$$ hash MD5
$$ DB BB 3D FD 16 81 93 67 C2 00 3E 39 6B E0 87 B8
##$RELAX= 
##$RELAX= 
##$RELAX= 
##$RELAX= 
##$RELAX= 
##$RELAX= 
##$RELAX= 
$$ Bruker specific parameters
$$ --------------------------
##$DU= <C:\u>
##$EXPNO= 2500
##$NAME= <ADRS>
##$PROCNO= 1
##$TYPE= <nmr>
##$USER= <dgb>
##$AMP= (0..31)
100 100 100 100 100 100 100 100 100 100 100 100 100 100 100 100 100 100 
100 100 100 100 100 100 100 100 100 100 100 100 100 100 
##$AQSEQ= 0
##$AQ_mod= 3
##$AUNM= <au_zg>
##$AUTOPOS= <56 >
##$BF1= 250.13
##$BF2= 250.13
##$BF3= 250.13
##$BF4= 250.13
##$BF5= 500.13
##$BF6= 500.13
##$BF7= 500.13
##$BF8= 500.13
##$BYTORDA= 1
##$CFDGTYP= 0
##$CFRGTYP= 5
##$CHEMSTR= <none>
##$CNST= (0..31)
1 1 145 1 1 1 1 1 1 1 1 1 1 1 1 1 1 1 1 1 1 1 1 1 1 1 1 1 1 1 1 1 
##$CPDPRG= <>
##$CPDPRG1= <>
##$CPDPRG2= <>
##$CPDPRG3= <>
##$CPDPRG4= <mlev>
##$CPDPRG5= <mlev>
##$CPDPRG6= <mlev>
##$CPDPRG7= <mlev>
##$CPDPRG8= <mlev>
##$CPDPRGB= <>
##$CPDPRGT= <>
##$D= (0..31)
0 1 0 0 0 0 0 0 0 0.06 0 0 0 0 0 0 0.0002 0 0 0 0 0 0 0 0 0 0 0 0 0 0 
0 
##$DATE= 1175154528
##$DBL= (0..7)
120 120 120 120 120 120 120 120 
##$DBP= (0..7)
150 150 150 150 150 150 150 150 
##$DBP07= 0
##$DBPNAM0= <>
##$DBPNAM1= <>
##$DBPNAM2= <>
##$DBPNAM3= <>
$$ [...]
##$SUBNAM7= <"">
##$SUBNAM8= <"">
##$SUBNAM9= <"">
##$SW= 20.6930455092707
##$SWIBOX= (0..15)
0 0 3 0 0 0 0 0 0 0 0 0 0 0 0 0 
##$SW_h= 5175.983436853
##$TD= 65536
##$TD0= 1
##$TE= 683.16
##$TE2= 300
##$TE3= 300
##$TEG= 300
##$TL= (0..7)
0 120 120 120 120 120 120 120 
##$TP= (0..7)
150 150 150 150 150 150 150 150 
##$TP07= 0
##$TPNAME0= <>
##$TPNAME1= <>
##$TPNAME2= <>
##$TPNAME3= <>
##$TPNAME4= <>
##$TPNAME5= <>
##$TPNAME6= <>
##$TPNAME7= <>
##$TPOAL= (0..7)
0.5 0.5 0.5 0.5 0.5 0.5 0.5 0.5 
##$TPOFFS= (0..7)
0 0 0 0 0 0 0 0 
##$TUNHIN= 0
##$TUNHOUT= 0
##$TUNXOUT= 0
##$USERA1= <user>
##$USERA2= <user>
##$USERA3= <user>
##$USERA4= <user>
##$USERA5= <user>
##$V9= 5
##$VALIST= <valist>
##$VCLIST= <CCCCCCCCCCCCCCC>
##$VD= 0
##$VDLIST= <DDDDDDDDDDDDDDD>
##$VPLIST= <PPPPPPPPPPPPPPP>
##$VTLIST= <TTTTTTTTTTTTTTT>
##$WBST= 1024
##$WBSW= 4
##$XGAIN= (0..3)
0 0 0 0 
##$XL= 0
##$YL= 0
##$YMAX_a= 313648
##$YMIN_a= -403389
##$ZGOPTNS= <>
##$ZL1= 120
##$ZL2= 120
##$ZL3= 120
##$ZL4= 120
##$ABSF1= 16.522
##$ABSF2= -4.171173
##$ABSG= 5
##$ABSL= 3
##$ALPHA= 0
##$AQORDER= 0
##$ASSFAC= 0
##$ASSFACI= 0
##$ASSFACX= 0
##$ASSWID= 0
##$AUNMP= <proc_1d>
##$AZFE= 0.1
##$AZFW= 0.1
##$BCFW= 0
##$BC_mod= 0
##$BYTORDP= 0
##$COROFFS= 0
##$CY= 12.5
##$DATMOD= 1
##$DC= 0
##$DFILT= <>
##$DTYPP= 0
##$F1P= 14.0000005364418
##$F2P= -0.99999901652339
##$FCOR= 0.5
##$FTSIZE= 32768
##$FT_mod= 6
##$GAMMA= 0
##$GB= 0
##$INTBC= 1
##$INTSCL= 1
##$ISEN= 128
##$LB= 0.3
##$LEV0= 0
##$LPBIN= 0
##$MAXI= 10000
##$MC2= 0
##$MEAN= 0
##$ME_mod= 0
##$MI= 0
##$NCOEF= 0
##$NC_proc= -3
##$NLEV= 6
##$NOISF1= 0
##$NOISF2= 0
##$NSP= 0
##$NTH_PI= 0
##$NZP= 0
##$OFFSET= 16.522
##$PC= 1
##$PHC0= 234.3366
##$PHC1= 10.42631
##$PH_mod= 1
##$PKNL= yes
##$PPARMOD= 0
##$PSCAL= 4
##$PSIGN= 0
##$REVERSE= no
##$SF= 250.13
##$SI= 32768
##$SIGF1= 0
##$SIGF2= 0
##$SINO= 400
##$SIOLD= 32768
##$SREGLST= <1H.CDCl3>
##$SSB= 0
##$STSI= 32768
##$STSR= 0
##$SW_p= 5175.98343685301
##$SYMM= 0
##$S_DEV= 0
##$TDeff= 65536
##$TDoff= 0
##$TI= <Analysis number 999999
Compound Code 99
Book Reference 9
Project Code 9>
##$TILT= no
##$TM1= 0
##$TM2= 0
##$TOPLEV= 0
##$USERP1= <user>
##$USERP2= <user>
##$USERP3= <user>
##$USERP4= <user>
##$USERP5= <user>
##$WDW= 1
##$XDIM= 32768
##$YMAX_p= 332276002
##$YMIN_p= -257501
$$ End of Bruker specific parameters
$$ ---------------------------------
##NTUPLES= NMR SPECTRUM
##VAR_NAME=  FREQUENCY,     SPECTRUM/REAL,   SPECTRUM/IMAG
##SYMBOL=    X,             R,               I
##VAR_TYPE=  INDEPENDENT,   DEPENDENT,       DEPENDENT
##VAR_FORM=  AFFN,          ASDF,            ASDF
##VAR_DIM=   32768,         32768,           32768
##UNITS=     HZ,            ARBITRARY UNITS, ARBITRARY UNITS
##FACTOR=    0.157963299565203, 1,           1
##FIRST=     4132.6476996994, 0,             0
##LAST=      -1043.33573715361, 0,           0
##MIN=       -1043.33573715361, -257501,     0
##MAX=       4132.6476996994, 332276002,     0
$$ Real data points
##PAGE= N=1
##DATA TABLE= (X++(R..R)), XYDATA
$$ [...]
18621A55600J1465N70M698J181Q994M3927M1063j3941L166N222k7807m1764J5135
18608B07509L4928j6473K5150L4925K6289K3356J5321l2751q089l7268l3425K8384
18596B67856M2564k1504j3357M1914L5383L2430K609M0105O4897K1702L6455O6617
18584F17671N6808M2417N5813o381J5901M7159J13153J01413K6580P452R3025
18573A171011N6905J7635O298K9906Q9636J60474J49509Q4972N2371J34329K38050
18562B191096K24105K00574J58733K27759L15122L05833L94793N13651O86294
18553E217960Q02084P75382Q61116J075176J628764K512969L750979N671317R300295
18544C1596042J3995937J2367172M903019r05982m60070L424248L184740k531475
$$ plain form
18621 155600 167065 167635 172333 173514 182508 226435 267498 253557 256723 261945 234138 192374 207509
18608 207509 242437 225964 251114 286039 312328 335684 351005 318254 310165 272897 239472 267856
18596 267856 310420 288916 275559 317473 352856 385286 387895 428000 492897 514599 551054 617671
18584 617671 674479 716896 772709 766328 782229 829388 942541 1043954 1070534 1077986 1171011
18573 1171011 1227916 1245551 1251849 1281755 1371391 1531865 1681374 1766346 1818717 1953046 2191096
18562 2191096 2415201 2615775 2774508 3002267 3317389 3623222 4018015 4531666 5217960
18553 5217960 6020044 6795426 7656542 8731718 10360482 12873451 16624430 22295747 31596042
18544 31596042 45591979 57959151 62862170 61956188 61496118 64920366 68105106 65573631
18536F5573631p257884p459007l817484M598360R718738N297859j707297l399394
18528F1547522j81687K348728j972018q956432j2141276j2337381r478156n582944
18520A3246356l165993j954117j315187j036135p59000n91535m66380m26862l67098
18511C164049l16569k78812k06037j09563j08649k00964j91526j43631j38426
18502A469872j05617n5371l7121o6513m8551j17268j09579j9299l9317n8952m7343
18491G64941m8702r3265M2359M5706J9871j5514k5620m688q727o9790q3583p8298
18479D44690p0595l7560k5556m8716M2910J165j6654j4535j1743j7605n3480j1938
18467A80383k915m2525l8150O7029K2142k3717m0351l9039N891j0478j115j1716
$$ plain form
18536 65573631 58315747 50856740 47039256 51637616 61356354 66654213 64946916 61547522
18528 61547522 61365835 63714563 61742545 52786113 40644837 28307456 18829300 13246356
18520 13246356 10080363 8126246 6811059 5774924 5015924 4424389 3958009 3531147 3164049
18511 3164049 2847480 2568668 2362631 2253068 2144419 1943455 1751929 1608298 1469872
18502 1469872 1364255 1308884 1271763 1205250 1156699 1039431 929852 910553 871236 812284 764941
18491 764941 716239 622974 665333 711039 730910 715396 689776 685088 676361 606571 522988 444690
18479 444690 374095 336535 310979 262263 305173 306338 289684 275149 263406 245801 192321 180383
18467 180383 177468 134943 96793 163822 185964 162247 121896 82857 88748 78270 77155 65439
18455F5439k9752N681j0965P716J6726M202j4621M184j3149k5643R871K8634k0858
18442B7465j8729K0714K0409O0453j6643m7540o032J2948j1211L1717P270J3178
18430I3999L297j9304O646J3134q920R810j7363n1568J622O5639L8569q710j1471
18417A15380j320j7446j5965J6545j8187J3466K1082P802m6264k5907l7828J9595
18405C0953j1443K8093K0835K4107o413k0633K3371L0045n306k9056L6023J4150
18393A34726n1563L1310L9473m0916k4994l6840J762J0229J0481J1078p632l3364
18381D3750j9173K6011M5551J7322k0828o2328J0519M2286Q439M668k1510j3451
18369F1256M859j3626J988j8766M6562J3119m290k1634K9349R872J2327k7081
$$ plain form
18455 65439 35687 41368 30403 38119 54845 59047 44426 48610 35461 9818 19689 48323 27465
18442 27465 8736 29450 49859 110312 93669 46129 40097 53045 41834 73551 80821 93999
18430 93999 97296 77992 84638 97772 88852 98662 81299 29731 31353 96992 135561 126851 115380
18417 115380 114060 96614 80649 97194 79007 92473 113555 121357 75093 49186 11358 30953
18405 30953 19510 47603 68438 92545 86132 65499 88870 118915 113609 84553 120576 134726
18393 134726 83163 114473 153946 113030 88036 51196 52958 63187 73668 84746 77114 43750
18381 43750 24577 50588 96139 113461 92633 30305 40824 83110 91549 96217 74707 61256
18369 61256 66115 52489 54477 35711 82273 95392 91102 69468 98817 108689 121016 93935
18357I3935n3894p0891j4654N6246L3612J1104J1198k2659m9305L0692K1389k0628
18345B6145l2333K174J8326J4701n5532n415L6823L2847k2571j2358j5621j6620
18333b9434k0465p103L2171J3941L7326J0115N522K1523R595l7788l1364j8687
18321a4648M5901L378j5464m1362k3620M4949K1318l9337O905M2830J9210P006
18309E7066K4928j0979K0109m0476j3406l1386k1484R286M1696J0382J0688m6612
18297I812k1756L4188J848J2119J0041m5201k4253J4155J8393J2630L1991N5964
18285A09931O937q265k5592j4267j5300p223K8102O433J6561k051L38j4899k4534
18272E6171j5949k8587k7047q106J4561l296K1920j7278k9305r792M2914K9031
$$ plain form
18357 93935 40041 -30850 -45504 10742 44354 55458 66656 43997 -5308 25384 46773 26145
18345 26145 -6188 -4014 14312 29013 -26519 -31934 4889 37736 15165 2807 -12814 -29434
18333 -29434 -49899 -57002 -24831 -10890 26436 36551 42073 63596 73191 35403 4039 -14648
18321 -14648 31253 34631 19167 -22195 -45815 -866 20452 -18885 -11980 30850 50060 57066
18309 57066 81994 71015 91124 50648 37242 5856 -15628 -6342 35354 45736 56424 9812
18297 9812 -11944 22244 24092 36211 46252 1051 -23202 -9047 9346 21976 53967 109931
18285 109931 116868 108603 83011 68744 53444 46221 74323 80756 97317 95266 95604 80705 56171
18272 56171 40222 11635 -15412 -23518 -8957 -12253 9667 -7611 -36916 -46708 -3794 25237
18260B5237M8310J0071j3303k5224k1840n145Q927K1847J7817l0313m0858O051
18248A577O663j3552O027l9527j7679J9053L930R459L1287L2631L2138l038J407
18235G0376l7058m160O7693q790j09748j0415K3600o32K9129L53L7291J9150j796
18222G4993m0434m2216n8570j157K0916K9964O0544L0215L0822k3094l2632j3341
18210C6010k1074k9913J079l272J1170O4825O7675J9577l4636m9146j8739K4882
18198F8438l4523l2127j6177q710M5977M0573J5694K6630M6984q746o2347k5160
18186E6506K0436j0496l8905k3910L286J0063K6641J1542J2767k0746j0718O353
18174D2819J3227P167l589J9335M2350j1093K0747p333j415P985o8637k8666o340
$$ plain form
18260 25237 73547 83618 70315 45091 23251 18106 27033 48880 66697 36384 -4474 1577
18248 1577 8240 -5312 715 -38812 -56491 -37438 -33508 -24049 7238 39869 72007 68969 70376
18235 70376 33318 29158 96851 88061 -21687 -32102 -8502 -9134 19995 20348 57639 76789 74993
18222 74993 34559 -7657 -66227 -67384 -46468 -16504 44040 74255 105077 81983 49351 36010
18210 36010 14936 -14977 -13898 -17170 -6000 58825 126500 146077 111441 62295 43556 68438
18198 68438 33915 1788 -14389 -23099 22878 63451 79145 105775 152759 144013 81666 56506
18186 56506 76942 66446 27541 3631 6917 16980 43621 55163 67930 47184 36466 42819
18174 42819 56046 63213 59624 78959 121309 110216 130963 123630 122215 130200 61563 32897 26557
18161B6557K888L360K3240J6537J3137M1646P155m0422N5576M8429L2262R499
18149B39864L3372j9087o65l2414l0824K076O718N8951O3552K3461L687n738K8271
18136C71224M3423K4545k2846l8294Q8090Q2826O0920N2620N2696J05357J32967
18125I53528J69387J33786J79921K14189K12195L50025M25322N28774P38938J048975
18115D955040J520171K392977L960496O284536R896259J7418965K9501177J5006556
18107I0936177j1524956j5312784k2775370j7166909q829468m623397k751023
18100G952270j796859j255814r00350o76180m99762l71689k54813k21666j40804
18091A834333j68692j05720q0565r3275j24937j32525j46562j09044j43055j31194
$$ plain form
18161 26557 29445 32805 56045 72582 85719 127365 134520 94098 149674 198103 230365 239864
18149 239864 273236 254149 253484 221070 190246 192322 199040 257991 321543 345004 348691 342953 371224
18136 371224 414647 439192 416346 378052 466142 548968 609888 662508 715204 820561 953528
18125 953528 1122915 1256701 1436622 1650811 1863006 2213031 2638353 3167127 3906065 4955040
18115 4955040 6475211 8868188 12828684 19113220 29009479 46428444 75929621 90936177
18107 90936177 79411221 64098437 41323067 24156158 15326690 10703293 7952270
18100 7952270 6155411 4899597 3999247 3323067 2823305 2451616 2196803 1975137 1834333
18091 1834333 1665641 1559921 1479356 1386081 1261144 1128619 982057 873013 729958 598764
18081E98764j01313q5030o486l5301r299j7332o4905m2792J4916O4916L2711J9003
18069C67852R3595M1660o014j8407j8305n6164J7839n8014j11776q3114n4597
18058A14555j0549N7855M4189j4694k0577l5604k8085j9520j8938L0885L3039
18047A32556j0142r450K3354J8823k626k1210L122q090J3936j8577p4242J7043
18035F4497j3247o3339l1577l416j7728R728N6714J6140j2826j3034m3553L225
18023d8416M9425N7471j207l7549k6813K254L3943j3630l1594l3220Q914L7815
18011b607K1552m1449l1652K1621L8067K1647N7092k384k0316k6507J9939L2082
17999H7085j2436l9897j3208O181m8448m897M7501O379j1352j1525N1065L5371
$$ plain form
18081 598764 497451 412421 405935 370634 361335 344003 279098 236306 251222 316138 348849 367852
18069 367852 461447 503107 497093 478686 460381 404217 422056 364042 252266 169152 114555
18058 114555 104006 161861 206050 191356 170779 135175 107090 87570 68632 99517 132556
18047 132556 122414 112964 136318 155141 152515 131305 134427 126337 140273 121696 47454 64497
18035 64497 51250 -12089 -43666 -47082 -64810 -55082 1632 17772 4946 -8088 -51641 -48416
18023 -48416 1009 58480 57273 19724 -7089 -4835 29108 15478 -16116 -49336 -40422 -2607
18011 -2607 18945 -22504 -54156 -32535 5532 27179 84271 81887 61571 35064 55003 87085
17999 87085 74649 34752 21544 27725 -20723 -25620 21881 28260 16908 5383 56448 91819
17987I1819k74j7280k2517q65j9155m7026J8824K3845m0066j3150K3413L9217
17975C6785J0573l8811m0858k2133Q700K1111K645L4247M3606J5985k9971l6508
17963E371O721k3504j5755l842K4283K8377j9938j2934n838K6025j3440m9267
17951e3741K9983L4416J5704j057j4375K0068K7170j1556K3406j6773j3213m7175
17939g143Q69L6942L5142O93j5150j914J6125j6999p768k9060j2693L0705L7366
17926F7115l1361l5005L2585J8986K315j4603L0836r256l95j5929n4259P644K7474
17913B6147M523Q267N4359O479o0022j2238J3968l6527R133K3565L6655L9238
17901A13547J8668J0524o3355l2513K6690N1746J9659L5736O9063M7699L5116
$$ plain form
17987 91819 91545 74265 51748 50883 31728 -15298 3526 27371 -12695 -25845 -2432 36785
17975 36785 47358 8547 -32311 -54444 -45744 -24633 -21988 12259 55865 71850 41879 5371
17963 5371 12092 -11412 -27167 -31009 -6726 21651 1713 -11221 -17059 8966 -4474 -53741
17951 -53741 -23758 10658 26362 25305 10930 30998 58168 46612 70018 53245 40032 -7143
17939 -7143 -6274 30668 65810 66503 51353 49439 65564 48565 40797 11737 -956 29749 67115
17926 67115 35754 749 33334 52320 54635 40032 70868 61612 61217 45288 -8971 -1327 26147
17913 26147 30670 38937 93296 99775 39753 27515 41483 4956 14089 37654 74309 113547
17901 113547 132215 142739 79384 46871 73561 125307 144966 180702 249765 297464 332580
17890C32580m550M5423K9487J5488k3005m1186l8117L459Q388P348J4385L0491
17878C80191j8808j0008N2582L4471o6408p6463n4497r2387k6427m3567k850K1909
17866I7738J5805l4587j5223N813K4652m0001m2070j8272J3040K3140K3748N7091
17854A10874j4117N544j03j2220m3996m0348L1353O072k0652l0776l2426N3661
17842A2866J2322m7030n301n766O114K9792O771L3143k6817m9533K0401J3495
17830D57J7977K512k0190L5736J0725J2446r899l9040n109n284k68N008Q865O691
17816B0627Q136M822n301L0178l861o003j8294n9090J5279J0858l2483l9638k5513
17803a00283N4878P2281Q577q742j995j1765j9245K6224L4484j4047P212N4811
$$ plain form
17890 332580 328030 373453 402940 418428 395423 354237 316120 319579 327967 335315 349700 380191
17878 380191 361383 351375 403957 438428 372020 295557 241060 148673 122246 78679 75829 97738
17866 97738 113543 78956 63733 69546 94198 54197 12127 -6145 6895 30035 53783 110874
17854 110874 96757 102301 102198 89978 45982 5634 36987 43059 22407 -8369 -40795 12866
17842 12866 25188 -21842 -27143 -32909 -26795 2997 9768 42911 16094 -33439 -13038 457
17830 457 18434 20946 756 36492 47217 59663 49764 10724 5615 331 63 5071 13936 20627
17816 20627 28763 33585 28284 58462 54601 48598 30304 -28786 -13507 -2649 -35132 -74770 -100283
17803 -100283 -45405 26876 35453 26711 24716 12951 -6294 19930 54414 40367 47579 102390
17791A02390L5419l028k4882k558q599j6235k8539N807J9941L1638J1290R472
17779A32116k8653m3782j2272J211J2795k3811j5101M7237J018J1428l7987m7164
17767b965L1240L6296J6060K1466m6532j2794k3542p937k0734K4892J0661j1645
17755A4466m3299L1622K7944k5350j4995J0013J255M3791J6678l6332j5060j520
17743I213L0637M9054j3724k8258K421L3592J2037j9158j2171K321p896O422q294
17730E6196m4720p316K0491j3604j1926k041L4412J8459p257j620k5810l017p950
17717D297J9339J4073J744o050O900J0702j6484k2035K6753J3282Q213J5190P814
17704H3738j8666k7098M9053J4092k6355m905l3859k1691K6748N2567j0021j1719
$$ plain form
17791 102390 137809 134781 109899 107341 98742 82507 53968 59775 79716 111354 122644 132116
17779 132116 103463 59681 47409 48620 61415 37604 22503 69740 70758 82186 44199 -2965
17767 -2965 28275 64571 80631 102097 55565 42771 19229 11292 -9442 15450 26111 14466
17755 14466 -28833 2789 30733 5383 -9612 401 1656 45447 62125 25793 10733 9213
17743 9213 39850 88904 75180 46922 49343 82935 94972 75814 63643 65964 58068 64490 56196
17730 56196 11476 4160 24651 11047 -879 -2920 31492 49951 42694 41074 15264 12247 4297
17717 4297 23636 37709 39453 33403 40303 51005 34521 12486 39239 52521 60734 75924 83738
17704 83738 65072 37974 87027 101119 74764 69859 36000 14309 41057 93624 83603 71884
17692G1884p040j2508J3361j384K6609K2638J848L6861r554m3218k7130K1517
17680I3884L1054J4548R247l9485m0011L8688L1164J2227p2933N15J3530k814
17668H9614m8323j2798P711P232J4268j8297k1735L9495M2583N9308k710l7021
17656A19327k2862K5059M2554n531l3907m4513M995O408K6146K1143J02R841j0879
17643A37883J3000J1609m817l2757j8513n1498M24L4659L2017J0036J2156j2981
17631A31218N568K5536j2925l8074O173O73l4638K7556M175M8885K7212K1673
17619B13032J6571l5714k3706P112K0160q621M162k4431K756m5862l5556M3122
17607A33025j2948m322J7697L4403M3400m342J0201l276N840r035j1947J8529
$$ plain form
17692 71884 64844 52336 65697 64313 90922 113560 115408 152269 142715 99497 72367 93884
17680 93884 124938 139486 148733 109248 69237 107925 139089 151316 78383 78898 92428 89614
17668 89614 41291 28493 36204 43436 57704 39407 17672 57167 99750 159058 156348 119327
17656 119327 96465 121524 164078 158547 124640 80127 85122 91530 117676 138819 138921 148762 137883
17643 137883 150883 162492 157675 124918 106405 54907 55331 89990 122007 132043 144199 131218
17631 131218 136786 162322 149397 111323 117496 118169 83531 111087 115262 164147 191359 213032
17619 213032 229603 193889 170183 177295 197455 188834 192996 168565 171321 125459 89903 133025
17607 133025 120077 115755 133452 167855 211255 206913 217114 213838 219678 210643 198696 217225
17595B17225j1721j6423K0896R7352K0358j0970j4584l2900m2316J5591M6817
17584B89325J1090j2836J9970j406o741M6430M6631j6382J0843R144n435K3337
17572D13970M7812J2156K4009R9304O9130R0949R3795J00346L9175P6361O9778
17561A136785J07467O5189O2602L4695O3195J02386R4966Q8696Q2136J94236L16972
17550B349325L86121L78296L36067J63664J58399K65025K07129K42822J15150
17541D601998K36556M21765O73212J120956J821573K854966M440498P283969J1040745
17532C4496238J0508779P862606M855897l76912J740168Q4600j571060m179374
17524E3420942j0200749r884993q964871o369934l653912k023747j000660l36452
$$ plain form
17595 217225 205504 189081 209977 307329 327687 316717 302133 269233 226917 242508 289325
17584 289325 300415 287579 307549 306143 299402 345832 392463 376081 386924 396068 390633 413970
17572 413970 461782 473938 497947 597251 666381 757330 851125 951471 990646 1067007 1136785
17561 1136785 1244252 1309441 1372043 1406738 1469933 1572319 1667285 1755981 1838117 2032353 2349325
17550 2349325 2735446 3113742 3449809 3613473 3771872 4036897 4244026 4486848 4601998
17541 4601998 4838554 5260319 5933531 7054487 8876060 11731026 16171524 23455493 34496238
17532 34496238 45005017 52867623 57723520 57346608 59086776 59171376 57600316 53420942
17524 53420942 43220193 33335200 24370329 18000395 14346483 12322736 11322076 10985624
17516A0985624L63530J299442K484121M286340P365858J1483631J1055271Q168078
17508E7491895M925279j012202J056813o31900k451619m912976j1228303j0877458
17500C2359529r882148p195795m241313k533276j639739j166455q36884o24659
17492D239260n62027m65011m02452l07829k42058j53594j05554p0115j07293j18666
17482A704661j22860j04264n7533n3947r6030p7691n7238j19358n4875n3581n5302
17471H51982o4480j33757p4585o3971o1267j3081k0233n9760l4701j7555J3855
17460C22447P555k0345n2963o202K4597R335m8551k8574K7555j6357k7477j9698
17448A71322L4626L3487J6194k038P6549J17592J22570m2973k6921q7871m7895
$$ plain form
17516 10985624 11349154 12648596 15132717 19419057 26784915 38268546 49323817 57491895
17508 57491895 62417174 61404972 62461785 61829885 59378266 54465290 43236987 32359529
17500 32359529 22477381 15281586 11040273 8506997 6867258 5700803 4863919 4239260
17492 4239260 3677233 3212222 2809770 2501941 2259883 2106289 2000735 1930620 1823327 1704661
17482 1704661 1581801 1477537 1420004 1366057 1270027 1192336 1135098 1015740 960865 907284 851982
17471 851982 787502 653745 579160 515189 453922 440841 420608 360848 326147 308592 322447
17460 322447 330002 309657 256694 250492 275089 284424 235873 207299 234854 218497 191020 171322
17448 171322 205948 239435 255629 253591 330140 447732 570302 527329 500408 412537 364642
17437C64642p3899p3797k4006j4493n64J0548k7665j4200j8203K967j5197J6149
17425A32282Q38l1089k359k5641K1066N1370l2267l7038N332J6617M0144k4221
17413A15034j8119l397j1278n0558l8486P1291L8482J6871k7910k0157q420R774
17401G3127J6720K7502k216j5204k8092k7510J4282K9347J7835J7203l0225p1175
17389B1594j618K9200J9126L9161K0513k518N668J771k6780j3965J7409N071q239
17376A06393l226p173m1807m121J0432j2602O063L4008L4750L8592k22l8509p567
17363A15011J3629M9612M9737O9883J10240J32840Q2874J10265R8985o200o4224
17352G62652j42607j65328j18968j09627p5510l8453j2528r74k7684j5743k5609
$$ plain form
17437 364642 290743 216946 192940 178447 177883 188431 160766 146566 128363 131330 116133 132282
17425 132282 133120 102031 99672 74031 95097 146467 114200 77162 82494 99111 139255 115034
17413 115034 96915 93518 82240 31682 -6804 64487 102969 119840 91930 71773 63353 73127
17401 73127 89847 117349 115133 99929 71837 44327 58609 87956 105791 122994 92769 21594
17389 21594 19976 49176 68302 107463 127976 125458 131126 132897 106117 92152 109561 114632 106393
17376 106393 103167 95994 54187 50066 60498 47896 53959 87967 122717 161309 161087 122578 115011
17363 115011 128640 178252 227989 297872 408112 540952 623826 734091 833076 826876 762652
17352 762652 620045 454717 335749 226122 150612 112159 99631 98657 70973 55230 29621
17341B9621r036L675J6126k1893j2182K8633j1617J9837J0806r321m948K7551
17329F7252l0565l6994N946M6479L3832l2207J1080l5200k9898n505M1701L8338
17317G4259n450m3602k2736k1969K0600L3001l6499J9661J9782j0492p929j0546
17305H080l4700j0751l280J4466M6665J1358m5770m76J3313K4943K3385l2879
17293A4354j994J9036J5722m7881k5609m71K86O941O2614L4195J0260l80j9475
17280F7598k6533k1025M40J4297M7313m8752j9378R838N0054L723l6326j1511
17268B9738j2797j3094j2435J930J5569M707L1509J3746l6764k7466L1091L5916
17256F1650m684J4835J2907l1230j7978m3644K660P9616J1482o993k2863M0920
$$ plain form
17341 29621 20585 24260 40386 18493 6311 34944 23327 43164 53970 44649 39701 67252
17329 67252 36687 -307 5639 52118 85950 53743 64823 29623 -275 -5780 35921 74259
17317 74259 68809 25207 2471 -19498 1102 34103 -2396 17265 37047 26555 18626 8080
17305 8080 -26620 -37371 -40651 -26185 20480 31838 -13932 -14408 -1095 23848 47233 14354
17293 14354 12360 31396 47118 -763 -26372 -26843 -26557 -19616 42998 77193 87453 87073 67598
17280 67598 41065 20040 20480 34777 82090 33338 13960 23798 73852 77575 41249 29738
17268 29738 16941 3847 -8588 -6658 8911 13618 45127 58873 22109 -5357 25734 61650
17256 61650 56966 71801 84708 53478 35500 -8144 -5484 74132 85614 78621 55758 96678
17244I6678K4863m351J6641M2919L5128L7416K8989j5716K821J3107o6253n7603
17232A54639m3459j9995m7023j8627k4837j9133L9926K4318J4006l854m3749K7251
17220C9463M5940K7196k1323n9966l9181K1733M0573J3997o355p9089J7152K8747
17208B8887K5375M9047l0996k0325P184P007J650j3003j3214K1237K610J4039
17196G9498R710k0828j9606l0781M5595j0606l2359l7849K9886M5995L1806L4993
17184A25454l006j6428K1744K5021P284l5592M952m493k1683m3698K279M214K817
17171F8865O435j2691j4579M8236R277j3170R717m1845q2269l312L2334P350K3614
17158C7962J8344n479m5365K3746K7417K6555J240j8744k6896k2636M804l5593
$$ plain form
17244 96678 121541 117190 133831 176750 211878 249294 278283 262567 265388 278495 212242 154639
17232 154639 111180 91185 44162 25535 698 -18435 21491 45809 59815 55961 12212 39463
17220 39463 85403 112599 91276 31310 -7871 13862 54435 68432 62077 -17012 140 28887
17208 28887 54262 103309 72313 51988 59172 66179 67829 54826 41612 62849 65459 79498
17196 79498 89208 68380 48774 17993 63588 52982 20623 -17226 12660 58655 90461 125454
17184 125454 122448 106020 127764 152785 160069 124477 129429 124936 103253 59555 61834 66048 68865
17171 68865 75300 62609 48030 96266 105543 92373 102090 60245 -22024 -25336 6998 14348 37962
17158 37962 56306 50827 5462 29208 56625 83180 84420 65676 38780 16144 20948 -14645
17146a4645l337J1659l957K2233N4511j6135j0205L5945K546l8818k2107k6444
17134h754L1899q86L7921K8652K20k3566l0574j9520M0964J5831j4025r808j0367
17121C7987j3765J6437J6296K7470l0680j0480J5286K360J6666j2115J3616M1896
17109A20974R047k4480j9110o507m6870n254K5959j5743j9336L5781M8790R433
17097A12684j021L2061j9045J468O2764J6880l0289o3257l3151l3287m2045k6798
17085b3036k695L5259P8210N9276k4381j880L2223L6775j6645j3211j4548j5381
17073A29966l2408M9495J1116J7250m45l829k5210l4665k4160l0631n004K8828
17061H0303O9275K6150J0504P142n0422n2995n0316j8878M8144O6973O556J9324
$$ plain form
17146 -14645 -17982 -6323 -10280 11953 66464 50329 40124 76069 78615 39797 17690 -8754
17134 -8754 23145 22259 60180 88832 89052 65486 34912 15392 56356 72187 58162 48354 37987
17121 37987 24222 40659 56955 84425 53745 43265 58551 60911 77577 65462 79078 120974
17109 120974 130021 105541 86431 79924 33054 27800 53759 38016 18680 54461 103251 112684
17097 112684 111663 143724 124679 126147 188911 205791 175502 112245 79094 45807 3762 -23036
17085 -23036 -25731 9528 87738 147014 122633 120753 152976 189751 173106 159895 145347 129966
17073 129966 97558 147053 158169 175419 174974 171145 145935 111270 87110 56479 51475 80303
17061 80303 149578 175728 186232 193374 142952 89957 39641 20763 68907 135880 142436 161760
17049A61760L7851Q513k5756j0698m5548l3274Q213J3200J7859J4758K1196P2121
17037B40195N6528Q485J1161m7375j9298j354j4539N806L413M22l2351J1963j714
17024B21342q2033l4841L6286J8526J0662K3183J6729M0803j8684K7193K0375
17013B79541L4250M7947j0162k8724O460R844J4542L1573N8761M0249o371J6970
17001D94880N0047L0568M9975O3501P3384J17929k7390l0459J374M3230L9513
16990I06552L0615J14071J67365J33300J05712O5825j6131l2094O8254Q2788J27414
16979A753671K55978L64096N06454N47006N50139M66702O02148J002445J444704
16970G493343J574219K544342M109081O662283J1775131J7407751O341663o037395
$$ plain form
17049 161760 199611 208124 182368 171670 126122 92848 101061 114261 132120 146878 168074 240195
17037 240195 296723 305208 316369 268994 249696 248342 233803 239609 243022 243444 211093 223056 221342
17024 221342 139309 104468 140754 159280 169942 193125 209854 250657 231973 259166 279541
17013 279541 313791 361738 351576 322852 329312 339156 353698 385271 444032 484281 477910 494880
17001 494880 544927 575495 625470 688971 762355 880284 852894 822435 823809 867039 906552
16990 906552 937167 1051238 1218603 1351903 1457615 1523440 1507309 1475215 1543469 1626257 1753671
16979 1753671 2009649 2373745 2880199 3427205 3977344 4444046 5046194 6048639 7493343
16970 7493343 9067562 11611904 15720985 22383268 34158399 51566150 57907813 51870418
16962E1870418r189096j2264274q132251l655148q17672J550529M112627Q191507
16954C1666640J4619296J2819186l152568p719960j1299117j0211033n265309
16947B1457135j254058J620270M782265R909129J5232802N501120n997575q816250
16939D2434838j1620475p842208l698784j119986J050447L221043O823603J2853066
16931D2101544J1536602l601521q028771j1757086j1154108o532675l573582k070056
16923F920347j322387q95726n72552l44424l32745k57407j95771k62166j94589
16914B542580r8249q924J29675L10670M95187P02835P20768N20187J73846l00209
16904E188366o70982q83946q68236o61046m40463l32232k26833r9250q733j7011
$$ plain form
16962 51870418 42681322 30417048 22284797 18629649 17811977 19362506 23475133 31666640
16954 31666640 46285936 59105122 55952554 48232594 36933477 26722444 21457135
16947 21457135 20203077 21823347 26605612 36514741 51747543 57248663 51251088 42434838
16939 42434838 30814363 22972155 19273371 18153385 19203832 22424875 29248478 42101544
16931 42101544 53638146 50036625 42007854 30250768 19096660 12563985 8990403 6920347
16923 6920347 5597960 4702234 4129682 3785258 3452513 3195106 2999335 2737169 2542580
16914 2542580 2444331 2435407 2565082 2875752 3370939 4073774 4794542 5314729 5488575 5188366
16904 5188366 4517384 3633438 2765202 2104156 1663693 1331461 1104628 1005378 996645 979634
16894I79634q8609j24409r3949p3479m9241o3487j719l3353p8827k0142N042j1011
16882C46450l2112j6893j8998k1618j5019J8053N7133j53k7322j9534J9367m406
16870B84948j3519j7468L7563N4014J0683o703P033o113P433N6740K9996M6188
16858D90795J07839K01554J75359J70484J87359J26363K3489j03621j78014k13268
16848I88339k03149j58486r9880o2612l4889K3213L362j4602k9754p609n715L2302
16836D30520L1654J8804R962j0519J977j8914L4948m093J1114N5337K2895K0384
16824F04069J2781M718K4438N6889P9981R1402J25269R9168Q4081J52030J35796
16813A470622P5518O4597J10980J42260R8637j7208k6982m9627n4901q4110j8788
$$ plain form
16894 979634 891025 766616 672667 599188 549947 486460 484741 451388 372561 352419 357461 346450
16882 346450 314338 297445 278447 256829 241810 259863 316996 316843 289521 269987 289354 284948
16870 284948 271429 253961 291524 345538 356221 349518 356551 350438 357871 414611 444607 490795
16858 490795 598634 800188 975547 1146031 1333390 1459753 1483242 1379621 1201607 988339
16848 988339 785190 626704 526824 464212 429323 452536 455898 441296 411542 403933 398218 430520
16836 430520 462174 480978 490940 480421 482398 463484 498432 494339 505453 560790 583685 604069
16824 604069 616850 621568 646006 702895 782876 874278 999547 1098715 1182796 1334826 1470622
16813 1470622 1546140 1610737 1721717 1863977 1962614 1945406 1918424 1868797 1813896 1729786 1710998
16802A710998R9627J65278K75420L58981M98674N29445N07683M97952N10720O67294
16792E822072R37717J419075K080620L143386M910542P818079J2522022J8364841
16784E7018354K3719252K7645323K4502742J5820404K559273j1887015k2877946
16777A16500387k6448673k5597963k0134887j4026100r091225n564234l506120
16770A2131185k352155j611221j152639q66103o67943n02194l97118l76749m13375
16761C791688m06203l89834l46740k47757j91024j49968p1033m1081L2223P0199
16751B050470Q696l8320j14995k12253j63285j61938k46817k17891j02281o3574
16741G37812p3911j04669l3791m0218j4493l8545m6420k5637O039J3121m107j8690
$$ plain form
16802 1710998 1810625 1975903 2251323 2610304 3108978 3638423 4146106 4644058 5154778 5822072
16792 5822072 6759789 8178864 10259484 13402870 18313412 26131491 38653513 57018354
16784 57018354 80737606 108382929 132885671 148706075 151265348 139378333 116500387
16777 116500387 90051714 64453751 44318864 30292764 21201539 15637305 12131185
16770 12131185 9779030 8167809 7015170 6149067 5481124 4978930 4581812 4205063 3791688
16761 3791688 3385485 2995651 2648911 2401154 2210130 2060162 1989129 1948048 1980271 2050470
16751 2050470 2059166 2020846 1905851 1693598 1530313 1368375 1121558 903667 801386 737812
16741 737812 663901 559232 525441 485223 470730 432185 385765 360128 366167 379288 375181 356491
16729C56491M613J478j9166k0321O493m3773k5089m1994Q633R481K7343j6715
16717B47474m0292l9651M572N2232K9906n1900l2906J0850J2049J7790l73k842
16705B06909m1073K0887K3879R917j2316k0021k5737j4541N078m6365m4870J7910
16693G9657N7196M6945j7368n5826O232j8030k7329k2636p019K1641L8926m3315
16681E9074j986L3580M0137N425k3787m1654J8540n24O574K6757m0564m7518j9280
16668A4774l8579J198J7041K4493P304l84K836L322J4280K2064J0972k2062K324
16655E9583J5225k4633j2545m5414K3414J3573j0538O736n249j1905K1185j0526
16643A8906J5303R908J9334J8733n7705j5132K0258K7530M0426r977m7439N70
$$ plain form
16729 356491 361104 362582 343416 323095 329588 285815 260726 218732 227365 236846 264189 247474
16717 247474 207182 167531 172103 224335 254241 202341 169435 180285 192334 210124 209751 206909
16705 206909 165836 186723 210602 220519 208203 188182 162445 147904 152982 106617 61747 79657
16693 79657 136853 183798 166430 110604 116836 98806 71477 48841 41822 63463 102389 59074
16681 59074 57088 90668 130805 136230 112443 70789 89329 88805 95379 122136 81572 34054 14774
16668 14774 -23805 -22607 -5566 18927 26231 25847 28683 32005 46285 68349 79321 57259 59583
16655 59583 74808 50175 37630 -7784 15630 29203 18665 25401 20152 8247 29432 18906
16643 18906 34209 44117 63451 82184 24479 9347 29605 57135 97561 87584 40145 40715
16631D0715j6470o421j7626L224J7510K8129M663j6850P964K7664j6256k7415
16619B8831j3629j6254k8164m2970M0330K5774L6055L1680Q145l2755l1515k5559
16607b0031k7846M840J2704L7595J0091r746o592K0360K0061m0920k3386o586
16595b9456J4886N964O2820L7789r500j0007J4401k0172m2779q565J8144r930
16583B3595q54j4449j1044n425j3159M899J1086L9076R715o3156o4221j2630P788
16570h8779M0516N2134J413l8612R674J3882j734k8370L8562K7114J2233J318
16558C9351p272l1191m1363K6686n295J686j7334L8634L2285j2257p814K642J532
16545B0290M3119p221j8355Q086N3237n7091m5543J765L315p489p602l0657P798
$$ plain form
16631 40715 24245 17824 198 3422 20932 49061 53724 36874 44838 72502 56246 28831
16619 28831 15202 -1052 -29216 -72186 -31856 -6082 29973 61653 69798 37043 5528 -20031
16607 -20031 -47877 -43037 -30333 7262 17353 7607 1015 21375 41436 516 -22870 -29456
16595 -29456 -14570 -8606 54214 92003 82503 72496 86897 66725 23946 15381 33525 23595
16583 23595 22741 8292 -2752 -8177 -21336 -16437 -5351 33725 43440 -19716 -83937 -96567 -88779
16570 -88779 -48263 3871 5284 -33328 -23654 -9772 -11506 -39876 -1314 25800 38033 39351
16558 39351 32079 888 -40475 -13789 -19084 -17398 -34732 3902 36187 23930 16116 18758 20290
16545 20290 63409 56188 37833 45919 99156 42065 -3478 -1713 1602 -5887 -13489 -44146 -36348
16532c6348K074k4765J0121O9722P7661M399m6720k0220J8920j4016l9743k4505
16520b3420K6101K021K222K4119j2728M778L292J1369P88o58K4951L1319m9395
16507D4759l9262k0057l429K557L8692J9474p141k1483J2089l0523K1494J7900
16495C5070N361m301J74o880J1062m5711l0377P933N806J233J0041M4982m7515
16482a3122J5649P3027m617K27K1270j9195j5837k2418l4746j1682L7970p720
16470A8806k6453l1829k5627L4025J3832Q442K0957K218j0211J0660N95J0058
16458B5473k1629R158m5230N80J2733R104P863j7504o814l843l3228J9428M7129
16445C220K2028K9143j7701M3170K58k1391j4603m6218j9022k19L3227R61k5427
$$ plain form
16532 -36348 -34274 -59039 -48918 20804 98465 102864 56144 35924 54844 40828 1085 -23420
16520 -23420 2681 4702 6924 31043 18315 23093 26385 37754 38542 37884 62835 94154 44759
16507 44759 5497 -14560 -17989 -15432 23260 42734 35593 14110 26199 -4324 17170 35070
16495 35070 40431 36130 36304 29424 40486 -5225 -35602 -27669 -21863 -20630 -10589 34393 -13122
16482 -13122 2527 75554 70937 71164 92434 73239 57402 34984 238 -11444 26526 18806
16470 18806 -7647 -39476 -65103 -31078 -17246 -8804 12153 14371 4160 14820 15415 25473
16458 25473 3844 13002 -32228 -31648 -18915 -9811 -1948 -19452 -26266 -30109 -63337 -43909 3220
16445 3220 25248 54391 36690 79860 80118 58727 44124 -2094 -21116 -21335 11892 12853 -12574
16432a2574j8715N6734K2726j6520N987J7085j8792j7093R842L1013P897j769
16420F5821l6140R707J2607j4353k2562R313K5014O484m777j3256m3106m3261
16408d8509J5807L7505J0965M4804J03427l319J4115N9997M6976j9706m4378o3735
16396A53949p2609q832L8251N730J3610N3001M6728P1949j3319m9381o6200o5354
16384A07523j1593k950J0294J8696K2179N0218M7884L3557q279m0444q1560o4390
16372H1135J500l4523j9122N7011J16955O6605l961n790n7637n4982n3838l0477
16360F2876J4755l4692j8882L7402L0437k6953m5342M800L887q149j4517J3687
16348A9309k6668j0325K1018m2999p19M1478j1735l316K940k0350J8515O6952
$$ plain form
16432 -12574 -31289 25445 48171 31651 37638 54723 35931 18838 28680 59693 67590 65821
16420 65821 29681 39388 51995 37642 15080 24393 49407 55891 51114 37858 -5248 -48509
16408 -48509 -32702 4803 15768 60572 163999 160680 174795 234792 281768 262062 217684 153949
16396 153949 81340 72508 110759 116489 130099 183100 229828 301777 288458 239077 172877 107523
16384 107523 95930 92980 103274 121970 144149 194367 242251 275808 267529 227085 145525 81135
16372 81135 82635 48112 28990 86001 202956 269561 265600 259810 202173 147191 93353 62876
16360 62876 77631 42939 24057 61459 91896 64943 19601 24401 28288 20139 5622 19309
16348 19309 -7359 -17684 3334 -39665 -40384 1094 -10641 -13957 -11017 -31367 -12852 54100
16336E4100P079j6381J4654j4722L822l7705n4941M712J5938K8793N960P789j1914
16323G184K8099M8729m0432l830J5868J2394l5986m8389m4338K9100K7648J4487
16311A0534K7014k1736r913K5964j4651k4724N938M2669j3964m5411p7009r03
16299i6192K7183K4184K9740j3093J4036k1237n863N8290M4411J8689o8727n8456
16287d7035k143K5877J1679J2611l784k5032j1068j4521K6631J7729J0847j3571
16275a1780n8751k1685N0956K8344N1331L5915l8409j0089J997l774O621M571
16263C5247p045M797K4008k0975j6887k4549L872m3751p575M5789J1725J4530
16251A9186o892J6347L3102l0453n0482q81J4040j8059j4070L493J7403J6982
$$ plain form
16336 54100 61179 44798 59452 44730 48552 10847 -44094 -39382 -23444 5349 11309 19098 7184
16323 7184 35283 84012 43580 39750 55618 68012 32026 -16363 -60701 -31601 -3953 10534
16311 10534 37548 15812 5899 31863 17212 -7512 -1574 41095 27131 -18280 -95289 -96192
16299 -96192 -69009 -44825 -15085 -28178 -14142 -35379 -41242 17048 61459 80148 11421 -47035
16287 -47035 -49178 -23301 -11622 989 -2795 -27827 -38895 -53416 -26785 -9056 1791 -11780
16275 -11780 -70531 -92216 -41260 -12916 38415 74330 35921 25832 27829 24055 30676 35247
16263 35247 28202 32999 57007 36032 19145 -5404 -1532 -45283 -52858 -7069 4656 19186
16251 19186 12294 28641 61743 31290 -19192 -20073 -6033 -24092 -38162 -34669 -17266 -284
16239b84M0326J2105k853k4246k0765Q481k2123n8383l233O6097L4391r116m0381
16226a9984J2472J2054j2264j6924k0003J8595K7620n913l1377K3713J1598j067
16214a480O906j8636r44L5861J6145K4242l623L909M2109Q1918J01792R5200J74500
16201E57899J44512Q7008j786p8894j65235j66538j03400q9421m2794n9145l0593
16190E1613j2648k7219r096M177K3819j4035l3561M6464P979q635l5653k6892
16178c3687M4030L0900k0550m4169k2865K6525M3280P042P281L3115q678K6560
16166H8784k3435k2504k1008j5633q872J5572K6186j0825J2846K3077J7510p392
16154G4306J331J8084k8530n1689j0458k8670j4487J6597l002Q184l7862R755
$$ plain form
16239 -284 40042 52147 49294 25048 4283 12764 -9359 -67742 -70975 -4878 29513 20397 -19984
16226 -19984 -7512 4542 -7722 -24646 -44649 -26054 1566 -4347 -35724 -12011 -413 -1480
16214 -1480 5426 -13210 -14154 21707 37852 62094 58471 62380 104489 186407 288199 383399 557899
16201 557899 702411 789419 787633 708739 543504 376966 273566 184145 141351 82206 51613
16190 51613 38965 11746 2650 6827 30646 16611 -16950 29514 37493 28858 -6795 -33687
16178 -33687 10343 41243 20693 -23476 -46341 -19816 23464 30506 37787 70902 62224 88784
16166 88784 65349 42845 21837 6204 -2668 12904 39090 28265 41111 64188 81698 74306
16154 74306 75637 93721 65191 13502 3044 -25626 -40113 -23516 -26518 -18334 -56196 -46441
16142d6441q678k246J8052O412L461j1164r198K8119K3786j3630o138L8863l585
16129A7613n221j179J597K9536m251n4570k2357J3345N317K9104N0733m706m0000
16116A4961o0913l233j8382j9076k53O1122N824K0127L0196m0812p429K8849O629
16103A7610j1783r573J1138k4310j3570m330j4306O408L8489J1258O948k3744
16091i765l7478l4928J8575M0718M1936M68m4712j2300o2772R478k4054M3115
16079g1719L3863n467j2392J4635K3576L9371J1126j1544n866l857m8192k7847
16067f4313O237K2571N1834M301P16o0527k3521k4709N506N1259n36J8894M99
16054a1789j599m069j74j0154j9557k5019K2066M5911L6147K693L1312L732m95
$$ plain form
16142 -46441 -55119 -57365 -39313 -32901 -29440 -40604 -49802 -21683 2103 -11527 -17665 21198 17613
16129 17613 12392 11213 12810 42346 38095 -16475 -38832 -25487 -20170 8934 59667 54961 14961
16116 14961 -45952 -49185 -67567 -86643 -86896 -25774 -19950 177 30373 -10439 -17868 10981 17610
16103 17610 5827 -3746 7392 -16918 -30488 -34818 -49124 -42716 -4227 7031 13979 -9765
16091 -9765 -47243 -82171 -63596 -22878 19058 19526 -25186 -37486 -100258 -90780 -114834 -71719
16079 -71719 -37856 -43323 -55715 -41080 -17504 21867 32993 21449 15583 11726 -36466 -64313
16067 -64313 -58076 -35505 16329 20630 21346 -39181 -62702 -87411 -81905 -30646 -31182 -12288 -11789
16054 -11789 -13388 -17457 -17631 -27785 -47342 -72361 -50295 -4384 31763 34456 65768 69500 69005
16041F9005m6693j1922L0885O12l9037N85k3828k721J1299R085M0268K3915J3650
16028G5103J6096m655o634J098m7435k3468k0900L6068M7326L5490r260r153l3638
16015E6038M7483L5663O674R514K4826l044m8738k9067o824K7680K1097K363m7086
16002I6579k1791K2542r176j2403k6865J8966J5234l7422q286L2861Q842q64j6835
15989F1382P042l0342M1486m122p7780j7603k666p765j9323O9977j4532l9420
15977c3666P962M6340J9025r539L3540j535k2523k6371k0684J19j6912m2582J7989
15964d8837M8971n192j1073k194Q91N041j8304l3151N603J0649j0740N546L9183
15951a3607K0671K0653L7456k4063k9432n5j0842R498K2014O290k7232m885K292
$$ plain form
16041 69005 22312 10390 41275 41887 2850 3435 -20393 -23114 -11815 -2730 37538 61453 75103
16028 75103 91199 86544 79910 81008 33573 10105 -10795 25273 72599 108089 98829 89676 56038
16015 56038 103521 139184 145858 155372 180198 177154 128416 99349 92525 120205 141302 143665 96579
16002 96579 74788 97330 88154 75751 48886 67852 83086 45664 37378 70239 79081 78217 61382
15989 61382 68424 38082 79568 75446 -2334 -19937 -22603 -30368 -49691 20286 5754 -33666
15977 -33666 -25704 20636 39661 30122 63662 62127 39604 13233 -7451 -7332 -24244 -66826 -48837
15964 -48837 134 -5058 -16131 -18325 -17434 -12393 -30697 -63848 -58245 -47596 -58336 -52790 -13607
15951 -13607 7064 27717 65173 41110 11678 11623 781 10279 32293 38583 11351 6466 8758
15938H758K0532m2071l8736L4600O329L4249m9165L1232N2136m8138n0965n060
15926d6299J5836O9945J3347m4799o1578k3695K2875L2470j835L622k6569j6773
15914f3453M7378K278P233J2683L5288j039L8502J0251l3128P02l7891k7991l4355
15901d3542J5661k658k8419K0633K5527J776k1221K0680O324l121J7422k6982
15889a7920k9531j1646L6475L0728j9684K8807k854k6191J8023J8644k2813k8497
15877b6459K4496K0178k0744j0808N117J5036O837k8259L572p101j7216j3429
15865d8780J1193M1951k1704j2770J6241k059m383m2769K3150R964l0532K107
15853e8391K2471q795j7863J9455M4335m869o262m117l0203j4581M272J7427j0878
$$ plain form
15938 8758 29290 -12781 -51517 -16917 -10588 23661 -25504 5728 57864 9726 -41239 -46299
15926 -46299 -30463 39482 52829 8030 -53548 -77243 -54368 -21898 -23733 -20111 -46680 -63453
15914 -63453 -16075 -13797 -6564 6119 41407 40368 78870 89121 55993 56695 18804 -9187 -43542
15901 -43542 -27881 -30539 -58958 -38325 -12798 -11022 -32243 -11563 -5239 -8360 9062 -17920
15889 -17920 -47451 -59097 -22622 8106 -11578 17229 14375 -11816 6207 24851 2038 -26459
15877 -26459 -1963 18215 -2529 -13337 -8220 6816 13653 -14606 -11034 -18135 -35351 -48780
15865 -48780 -37587 4364 -17340 -30110 -13869 -15928 -20311 -63080 -39930 -29966 -60498 -58391
15853 -58391 -35920 -44715 -62578 -43123 1212 -3657 -9919 -14036 -44239 -58820 -54548 -37121 -47999
15840d7999l7596M1304M1048q048j7903L4317K4340l1580J0602J9885k7504l0936
15828c0070n315r268q077Q748j7314M0788J7795L0461K5674l5784k1359m363j7409
15815b5493k0889J1193K7576K8663L121j3517K9963j2002r732K592n249L2931
15803D9157K4425m4503l1463j5388J7953N4035J3421J0886j1308p1623l6041M838
15791c5611K8484k895L126L3548p178m3513j4339Q767K4142l3048l859K1005J4920
15778f451M839l0881o789q87j3674l1669J5086J9618P290j5640J2255J4775K7669
15765d459l0494l6186L8771k0979j7935l9192J6978N4738J5254l2045j4293J6029
15753e3813N506j7318j4957O321K8987L2259j8606l1287r494k1029R055L2164
$$ plain form
15840 -47999 -85595 -44291 -3243 -11291 -29194 5123 29463 -2117 8485 28370 866 -30070
15828 -30070 -35385 -44653 -52730 -43982 -61296 -20508 -2713 27748 53422 17638 -3721 -8084 -25493
15815 -25493 -46382 -35189 -7613 21050 24171 10654 40617 28615 18883 21475 16226 49157
15803 49157 73582 29079 -2384 -17772 181 54216 67637 78523 67215 -4408 -40449 -35611
15791 -35611 -7127 -10022 -6896 26652 19474 -24039 -38378 -29611 -5469 -38517 -42376 -21371 -6451
15778 -6451 -1612 -32493 -39282 -40169 -53843 -85512 -70426 -50808 -43518 -59158 -46903 -32128 -4459
15765 -4459 -34953 -71139 -32368 -53347 -71282 -110474 -93496 -38758 -23504 -55549 -69842 -53813
15753 -53813 -48307 -65625 -80582 -74261 -45274 -13015 -31621 -62908 -72402 -93431 -84376 -52212
15741e2212J6726J7511L8688l359p421j9437J6503k0415j9810K546l398j2418
15729d6496K918j6317k096O503J52k5649K0786P5332K5434l7959L0471j722j9644
15716A1713l4720J2150J8277j5834j891L4666j9758j0998J1941q80k1091j8920
15704c5345K359K116O7J1565l721l8113n379J9984j0127J9647J2019n4678M47
15691g9159r313k2460k7132J4169L0944k916L60L7800O6649L1308j389l6172k7327
15678b4638m7419J1478L1622K1212J6618k5725m3335K1769J0518l38j4406M1611
15666a033J0005r353M988J916j2023J6228J6503n9608l359L8091K7149R754j910
15653C7348k8142l746k3089j2496N498N273j0665Q161K3579K1183k9390m4159
$$ plain form
15741 -52212 -35486 -17975 20713 17354 9933 -9504 6999 -13416 -33226 -30680 -34078 -46496
15729 -46496 -43578 -59895 -61991 -55488 -55336 -80985 -60199 15133 40567 2608 33079 31357 11713
15716 11713 -23007 -10857 7420 -8414 -10305 24361 4603 -6395 5546 4666 -16425 -35345
15704 -35345 -32986 -30870 -30803 -19238 -22959 -61072 -66451 -46467 -56594 -36947 -24928 -79606 -79159
15691 -79159 -88472 -110932 -138064 -123895 -92951 -95867 -95507 -57707 8942 40250 38861 2689 -24638
15678 -24638 -72057 -60579 -28957 -7745 8873 -16852 -60187 -38418 -27900 -28238 -42644 -1033
15666 -1033 8972 -381 4607 6523 -5500 10728 27231 -32377 -35736 2355 29504 39258 37348
15653 37348 9206 5460 -17629 -30125 -24627 -19354 -30019 -21858 1721 22904 -6486 -50645
15641e0645n6L059k2873R415j195K1018K1771K5664N7919l3110m4444l9518o490
15628e9485j0684K1550Q813L1708j5310l2562K2541K2607l1513q550J1021j0304
15616e0168K2704m110J3090p343J3971K7090L1695L981j9235Q708j5318j6455
15604H610K1496j4886j5310j4552k1374K3397J8014L8365p067k7169p3606j5587
15592g9669K3234J8436o100l2013J7926k1871j4557N0170L2168k3918K8464J1184
15580C454n7295J47J7472L5646J3036q4K969J4202m2137k8286k3984l0731L0291
15567f5300N5864M5010O082P372M5728j0057J2436l0292l6847j7562J2476J6499
15555D1409k5626j3290J080K0998k324j1171r739m613j6099J6374j194j3108j0511
$$ plain form
15641 -50645 -50701 -47642 -70515 -61100 -62295 -41277 -19506 6158 64077 30967 -13477 -52995 -59485
15628 -59485 -70169 -48619 -39806 -8098 -23408 -55970 -33429 -10822 -42335 -50885 -39864 -50168
15616 -50168 -27464 -31574 -18484 -25827 -11856 15234 46929 50910 31675 40383 25065 8610
15604 8610 30106 15220 -90 -14642 -36016 -12619 5395 43760 36693 9524 -64082 -79669
15592 -79669 -56435 -37999 -44099 -76112 -58186 -80057 -94614 -44444 -12276 -36194 -7730 3454
15580 3454 -53841 -53694 -36222 -576 12460 12376 15345 29547 -12590 -40876 -64860 -95591 -65300
15567 -65300 -9436 35574 41656 49028 94756 84699 97135 66843 29996 12434 24910 41409
15555 41409 15783 2493 3573 24571 22247 11076 1337 -3276 -19375 -3001 -4195 -17303 -27814
15542b7814l0667j0318r356J3183K2673J8467J9784j7365j3964J7366j7420P412
15530b8019L0719N813k0128k1686K0952K6003M7659M8651n1424p5024j6828K8238
15518e074r911m299K4592M668J6012O895k9736K8704J6626k2300l3872J7592j2725
15505b828J9930j0159j545J348k9014n862J9828L2271j7902l1985L788l9044k2914
15492h4088J5444j9336K0261M5025K531l9034L5659J0812j7004P101M2201K6262
15480D5834m514J1379j5796N5046M0049j7890p2247m0403N766m470L7635j8761
15468B1628k1138O124J9535J4756K1810j2251j5934K0717K6093k8480r60K6347
15456G8247j5181k4742k1356m9717m0576o031J4487J2608O7907K8762p428j3962
$$ plain form
15542 -27814 -58481 -68799 -78155 -64972 -42299 -23832 -4048 -21413 -35377 -18011 -35431 -28019
15530 -28019 2700 8513 -11615 -33301 -12349 13654 61313 109964 58540 -16484 -33312 -5074
15518 -5074 -14985 -19284 5308 9976 25988 32883 3147 31851 48477 26177 -7695 9897 -2828
15505 -2828 17102 6943 5398 6746 -22268 -28130 -8302 23969 6067 -25918 -22130 -61174 -84088
15492 -84088 -68644 -87980 -67719 -22694 -20163 -59197 -23538 -12726 -29730 -22629 19572 45834
15480 45834 41320 52699 36903 91949 131998 114108 41861 1458 7224 2754 40389 21628
15468 21628 490 6614 26149 40905 62715 50464 34530 55247 81340 52860 51900 78247
15456 78247 63066 38324 16968 -32749 -73325 -79356 -64869 -52261 15646 44408 36980 23018
15444B3018k9865L241l0234K134J2813K5810N297N466J8008r879l9568o8564j4852
15431i7175J7991J2825J5757K5071M925k3407M722k0726o095K6770k735R831M601
15418b7645m1155M5085N6320M349m8207m5867l7943K3382P764m052J6085P060
15406d4824o151N9272J8376J9354K2995m0042n9062o814J6373K0610Q025K6700
15394C4812k8151m2622m373q035P431J3948M9777K2270k2406m457N435j5498j166
15381F965J5138j3943j2620J4053J1857o6631l0172M1561L1367p0401m1166K7621
15369h6371K5158K7326P0429K7322n3463J644O7j9451o0360J3442K3438n31J5091
15356a6259r171R955p906K3623Q402L2625q357j0998k2455k3613q534J9835K3937
$$ plain form
15444 23018 -6847 -3606 -33840 -31706 -18893 6917 12214 17680 35688 25809 -13759 -82323 -97175
15431 -97175 -79184 -66359 -50602 -25531 -20606 -44013 -39291 -60017 -66112 -39342 -42077 -32246 -27645
15418 -27645 -68800 -23715 32605 36954 -11253 -57120 -95063 -71681 -63917 -67969 -51884 -44824
15406 -44824 -50975 8297 26673 46027 69022 28980 -30082 -36896 -20523 87 8112 34812
15394 34812 6661 -35961 -40334 -48369 -40938 -26990 22787 45057 22651 18194 23629 8131 6965
15381 6965 22103 8160 -4460 9593 21450 -45181 -75353 -33792 -2425 -72826 -113992 -86371
15369 -86371 -61213 -33887 36542 63864 10401 12045 12112 -7339 -67699 -54257 -30819 -31350 -16259
15356 -16259 -25430 -15475 -23381 242 8644 41269 32912 21914 -541 -24154 -32688 -12853 11084
15343A1084k7038N747j1335p1523N907P1842P725k8691k3411o526J0707j9584
15331g5096K1875J9820L9795J3338J4774k2928J8952m984k3261J0129n490k7677
15319b0753j0669J3032j1200J7612K7358J297j1569j9212l1267N765k0502n5889
15307a15997M4196M7655l425L230l578q061j2073L768K9595J5776j3360R491K5704
15294B2921P249m4589k4200J7257j4630J3685N4170L1154m0440n3009k5720l9459
15282i5611N5158K6745L1822N3871q929l9223m5423k6689L8864M0221j2115R92
15270A9683R415j9414n8422J4651j1009R18J1831m1302L957K1123J8378K9398
15258g93R651R045p030q370j8977R619K1035K4165J1291J1726m4976m6065J2068
$$ plain form
15343 11084 -15954 -10207 -21542 -93065 -87158 -15316 -7591 -36282 -59693 -66219 -55512 -75096
15331 -75096 -53221 -33401 6394 19732 34506 11578 30530 25546 2285 12414 6924 -20753
15319 -20753 -31422 -18390 -29590 -11978 15380 16677 5108 -14104 -45371 -39606 -60108 -115997
15307 -115997 -71801 -24146 -27571 -24341 -27919 -35980 -48053 -44285 -14690 1086 -12274 -2783 22921
15294 22921 30170 -14419 -38619 -21362 -35992 -22307 31863 63017 22577 -30432 -56152 -95611
15282 -95611 -40453 -13708 18114 71985 63056 23833 -21590 -48279 -9415 30806 18691 19683
15270 19683 29098 9684 -48738 -34087 -45096 -44178 -32347 -73649 -69692 -48569 -30191 -793
15258 -793 8858 17903 10873 2503 -16474 -6855 14180 38345 49636 61362 16386 -29679 -17611
15245a7611L3165J748J0002l3754m0803q498L6470L8982p1j9514j8187j6459o511
15232d1041M5113M3761j6195j2613m301j6188o237q192j1203k6753k8427L8860
15220d3416J8026K2962K9309L237n032p605m0922m4800K4045M0026k0538N010
15208a9698K9530k0736m1826L2532R707K5148O498m565M617n5963k2797J911Q267
15195d7375Q277M2564J2311J7108l3105k8562k1060N562L7R484L0705M0338p7523
15182d1239P59N4120j1682j1870K3809R96J960M679J5147m9296m6080k2274K0578
15169f0393r257J6045K8785L2179K2779O213l0077n509L7716K7810m9291n1647
15157c4647K7257R121J1854L053m3946l3062K6627J5793Q198l4462o7137j133
$$ plain form
15245 -17611 15554 17302 27304 -6450 -47253 -55751 -19281 19701 19630 116 -18071 -34530 -41041
15232 -41041 4072 47833 31638 19025 14724 -1464 -7701 -15893 -27096 -53849 -82276 -43416
15220 -43416 -25390 -2428 26881 30118 25086 17481 -23441 -68241 -44196 -4170 -24708 -19698
15208 -19698 9832 -10904 -52730 -20198 -10491 14657 21155 16590 21207 -34756 -57553 -55642 -47375
15195 -47375 -39098 3466 15777 32885 -220 -28782 -49842 -44280 -44243 -34759 -4054 36284 -41239
15182 -41239 -40480 13640 1958 -9912 13897 14893 16853 21532 36679 -12617 -58697 -80971 -60393
15169 -60393 -69650 -53605 -24820 7359 30138 36351 6274 765 38481 66291 17000 -34647
15157 -34647 -7390 1731 13585 16638 -27308 -60370 -33743 -17950 -9752 -44214 -111351 -112484
15145a12484J9832L3021Q633L857l4245r157J0077K6161J9538n4491J654J8961
15133f8643L6691l1115l348o44K1286j93K2192M9133m267n90q383m2387K344j0666
15119c8590n677k4733J6615L8000J98l4212k3446L1402K3612L6183L15j6883m999
15106b215j7304j5515J2652J4951O945R321n913p744K6481q431r792j4759j1185
15093b2508J2865L4084J6763p813j4260k5094m208j2930r071L612r318K0723r985
15080b7140L6773j9983k1047p996k4127M423L8790M6305K8580o531j1438m3308
15068f699m3270k4545Q746j687L4422L5687N9558J4774l0486m3035m0634j9469
15056e6638J2530K5848L2483J6137o0987r817R632N134L4300q792j7099j167M3940
$$ plain form
15145 -112484 -92652 -59631 -50998 -47141 -81386 -90543 -80466 -54305 -34767 -89258 -87604 -68643
15133 -68643 -31952 -63067 -66415 -67059 -45773 -45966 -23774 25359 21092 20502 12119 -30268 -27924 -38590
15119 -38590 -44267 -69000 -52385 -14385 -14187 -48399 -71845 -40443 -16831 19352 19667 2784 -2215
15106 -2215 -19519 -35034 -22382 -7431 -486 8835 2922 -4822 21659 13228 3436 -11323 -22508
15093 -22508 -9643 24441 41204 33391 19131 -5963 -10171 -23101 -32172 -28560 -37878 -17155 -27140
15080 -27140 9633 -10350 -31397 -39393 -63520 -59097 -20307 25998 54578 48047 36609 -6699
15068 -6699 -49969 -74514 -65768 -67455 -33033 2654 62212 76986 46500 3465 -37169 -56638
15056 -56638 -44108 -18260 14223 30360 -30627 -40444 -30812 -25678 8622 -170 -17269 -18436 25504
15043B5504L9160j5770r045m1520j1492j8613J850N4580k9877k3958o03k6602
15031e6386j175M462K484M1678J7152j0310n1357J0040N6050L2959J868l7073
15019A0392p627n757p43K7828m4662j1833N0992l3088k6124k6108J6254k9528
15007h0004k124O09J6782M0440J4261j8985k0717J6471O1938L5639l1337J9291
14995E2264j4044m4694Q537K8700J2273j7346l2259j0066m1771k0868M0903K558
14983c5813m6p737k2196k0265L1610K4035K5472j7374k7965j5936K1820L0568
14971a3827k3436k0672J1829q535O4888R483n3186l4310M1224N6709n134l0199
14959e166M488n257q81K9036j4498l3660k7580J7337L9455K9860m5941l0608K9741
$$ plain form
15043 25504 64664 48894 39849 -1671 -13163 -31776 -29926 24654 -5223 -29181 -29784 -56386
15031 -56386 -57561 -53099 -50615 -8937 8215 -2095 -53452 -43412 12638 45597 47465 10392
15019 10392 2765 -2992 -3735 24093 -20569 -32402 18590 -14498 -40622 -66730 -50476 -80004
15007 -80004 -82128 -81519 -64737 -24297 -10036 -29021 -49738 -33267 28671 64310 32973 52264
14995 52264 38220 -6474 2063 30763 43036 25690 -6569 -16635 -58406 -79274 -38371 -35813
14983 -35813 -35859 -43596 -65792 -86057 -54447 -30412 -4940 -22314 -50279 -66215 -44395 -13827
14971 -13827 -37263 -57935 -46106 -54641 10247 19730 -33456 -67766 -26542 30167 25033 -5166
14959 -5166 -678 -5935 -6816 22220 7722 -25938 -53518 -36181 3274 33134 -12807 -43415 -13674
14946a3674Q204l3483J0505K7184J2453q120l0302L6622j1362k5169j5832J768
14934d1206K0455K4680J1355J1193l2304o4717l9439K8277O0896L8165J1478m846
14922B3987j2603L1817M2804l9815l7912J1098j5699j314R33J3589J0811j0126
14910A7570l0829j0456L8120j6598m9858k2361K6430P1586j721j1546k8781p138
14898b5582J6336p751J724j216l4450l9082K6342K0267K9302K2611K0098N068
14886C3667l4197n5966l721P0842M1028k877k9845k5532j503J0807K0892J4080
14874C7675m4206j4156q762J5372O831j3677J3210J8714K1427k267R368j9644
14862A9885m0526O008o13r737K2231J9981N233K9921j4155j6728r258l6590m0225
$$ plain form
14946 -13674 -5470 -38953 -28448 -1264 11189 3069 -27233 9389 -1973 -27142 -42974 -41206
14934 -41206 -20751 3929 15284 26477 -5827 -70544 -109983 -81706 -20810 17355 28833 23987
14922 23987 11384 43201 86005 46190 8278 19376 3677 2363 3296 16885 27696 17570
14910 17570 -13259 -23715 14405 -2193 -52051 -74412 -47982 23604 21883 10337 -18444 -25582
14898 -25582 -9246 -16997 -15273 -16489 -50939 -90021 -63679 -43412 -14110 8501 28599 33667
14886 33667 -530 -56496 -60217 10625 51653 48776 18931 -6601 -8104 2703 23595 37675
14874 37675 -6531 -20687 -29449 -14077 -7246 -20923 -7713 11001 32428 30161 39529 19885
14862 19885 -20641 -14633 -15246 -24983 -2752 17229 22462 52383 38228 21500 12242 -24348 -64573
14849f4573N684J0014K0225M5722P665j02J7670j323P324j9072l5715l654l407
14836a3542j4768K8878J3409r087J0389k0309l449j4987K0625M923L0392K5749
14824E8223o2081k1943O135K6622J9335j2018j1139J6201L7971j0011l4263L387
14812A6419l399k4594K1659r547k1446L3984k8089K2572M764l1191k7308O3300
14800A7124K1325j349J427r860l8977o4316k1016N060K4121J7364J7794K6125
14788e178L0344l2132J2844n877k444k8577l2501J2310L1270M1876J4278j7691
14776A8522l7605k4659j003j0960K0287K7524L5691j7174l5511k389j0517J6269
14764b1525j9682k5895K2436q148J9340J2117m3031L300R2497m199j6782l3068
$$ plain form
14849 -64573 -58889 -48875 -28650 17072 24737 24635 42305 40982 48306 29234 -6481 -10135 -13542
14836 -13542 -28310 568 13977 4890 15279 -5030 -8479 -23466 -2841 2082 32474 58223
14824 58223 -3858 -25801 -19666 6956 26291 14273 3134 19335 57306 47295 13032 16419
14812 16419 13020 -11574 10085 538 -20908 13076 -15013 7559 12323 -18868 -46176 17124
14800 17124 38449 37100 38527 28667 -10310 -74626 -95642 -90582 -66461 -49097 -31303 -5178
14788 -5178 25166 -6966 5878 1 -2443 -31020 -63521 -51211 -19941 21935 36213 18522
14776 18522 -19083 -43742 -44745 -55705 -35418 -7894 27797 10623 -24888 -27277 -37794 -21525
14764 -21525 -41207 -67102 -44666 -52814 -33474 -21357 -64388 -61088 31409 27210 10428 -22640
14752b2640J0544j288M681K0778k6618k4237L2382k313k9389k5785j5256N937
14740g3204K9872j1635L4895J6043R817k2829k0344J9k2073k3216p200N6768L0431
14727b656j9315m0752J129K046M1410K5987M483r556m4442J1330L1507j3881l6711
14714d9421O583j721J0816J5032k72J5840L934j0721j5805k2743J2412J2086J6094
14701g886j0174K6032o937j7991J3435N4252q021m6950J2180k0336k9739J8361
14689b3774J816l3370N2317K9969j9015N3054k331m8355K3180J7957o3188m4572
14677e6312N6518m870k0173o35j0036J2904M5629K5287j9335j6176r604l8491
14665c5294J1713J5166J5778l0676l2674J7047L6684L2101K4590j7791k2248j6278
$$ plain form
14752 -22640 -12096 -13384 -8703 12075 -14543 -38780 -6398 -8711 -38100 -63885 -79141 -73204
14740 -73204 -43332 -54967 -20072 -4029 5788 -17041 -37385 -37366 -59439 -82655 -89855 -33087 -2656
14727 -2656 -21971 -62723 -61594 -59548 -18138 7849 12332 2776 -41666 -30336 1171 -12710 -49421
14714 -49421 -42838 -44559 -33743 -18711 -18983 -3143 791 -9930 -25735 -48478 -36066 -23980 -7886
14701 -7886 -18060 7972 1035 -16956 -3521 50731 42710 -4240 7940 -12396 -42135 -23774
14689 -23774 -21958 -55328 -3011 26958 7943 60997 58666 10311 33491 51448 -11740 -56312
14677 -56312 206 -4664 -24837 -25472 -35508 -22604 23025 48312 28977 12801 3197 -35294
14665 -35294 -23581 -8415 7363 -23313 -55987 -38940 -2256 29845 54435 36644 14396 -1882
14653a882O817l4594J405n877K9193K7414J5700K9656q120j4502n0187o844O849
14640d972l2003J5349J2561n507M4614L4870k0126l910k8420K2222K3913j4861
14628D3730l9178k1901L5659L053K3669l9548o9283j8815o991N5531K8859m1945
14616d7160M681K7847R971L128k1124l6127J9386K0364L0541J8973j3796k720
14604A3964J8226J819m579l5280k4942J6056J0420l7833j1045M4j9059k2846J0274
14591h4781O053M6256j6230J2416O7175M135l3345J801J6126L2809K1589K6501
14579A00505j2775k1077L352m7542k2464p665J9698J830m05j2150j5024k3506
14567c7223n6467m189M6517L4691r394L1140j7242n6049M187L3440j0814K7515
$$ plain form
14653 -1882 4935 -29659 -28254 -34131 -4938 22476 38176 67832 59712 45210 -4977 -11821 -4972
14640 -4972 -36975 -21626 -9065 -14572 30042 64912 44786 40876 12456 34678 58591 43730
14628 43730 4552 -17349 18310 21363 45032 5484 -63799 -82614 -89605 -34074 -5215 -47160
14616 -47160 -42479 -14632 -4661 -1533 -22657 -58784 -39398 -19034 11507 30480 16684 13964
14604 13964 32190 34009 29430 -5850 -30792 -14736 -4316 -42149 -53194 -53150 -72209 -95055 -84781
14591 -84781 -78728 -32472 -48702 -36286 30889 35024 1679 3480 19606 52415 74004 100505
14579 100505 87730 66653 70005 22463 -1 -7666 12032 13862 13457 1307 -13717 -37223
14567 -37223 -93690 -97879 -51362 -16671 -26065 5075 -12167 -68216 -64029 -30589 -41403 -13888
14555a3888N8235M652k0293k9248K1178o595O00j915L645j3490J9754K6184k1804
14542B7015j7898O210k7021r120M686m994n4499Q067J0331N0092q2j1666j7781
14529c6660j8525m143K4325r691m9043j0694L9285K9116m0182P153L6700K0872
14517a1487j0047Kj2755L888L0722J0990J4477K447j2629O668r532l7684o507
14504c1447J3416K8274j6664l711l6445J5865M156K7240L365k5563r447J7342
14492a3619K2069j705j7143o646q224j77J2751P547k036L1683j4275K4140K0629
14479E4994j779l8228J282l883l9475m239k6147k0092p165J8089K7701J8871r34
14466b1005J0060K0220j5587k5505l2480j8671J9923K2176M5849L1086q709m3125
$$ plain form
14555 -13888 44347 48999 28706 -542 20636 14041 14641 12726 16371 2881 22635 48819 27015
14542 27015 9117 15327 -11694 -20814 -16128 -21122 -75621 -67554 -57223 -7131 -7213 -18879 -36660
14529 -36660 -55185 -59328 -35003 -44694 -93737 -104431 -65146 -36030 -76212 -69059 -32359 -11487
14517 -11487 -21534 -21532 -34287 -30399 323 11313 25790 28237 15608 22276 12744 -24940 -31447
14504 -31447 -18031 10243 -6421 -10132 -46577 -30712 -26556 684 4049 -21514 -30961 -13619
14492 -13619 8450 6745 -10398 -17044 -25268 -25445 -12694 -5147 -7183 24500 10225 34365 54994
14479 54994 53215 14987 16269 12386 -27089 -31328 -57475 -77567 -84732 -66643 -38942 -20071 -21005
14466 -21005 -10945 9275 -6312 -31817 -64297 -82968 -63045 -40869 4980 36066 27357 -15768
14454a5768R960N6000j948j5967K1911J000k0907J1233K6702J8978q2936m1204
14442c2946J3628j3198K678k5471R060O369l279P586n198j530j3022j987l6313
14429i3623N1608K1433j9383J0257k3024M3218L4653R425l4716J3609L477K8200
14417D5134k5576p291j8886k7343k8643M180J9452r683j5537K7340L1445n790
14405a1198J25M2709k9187j9196j6806p163L3640q301n3866r388K7580L8165l1593
14392d4479k3213N7190L7145j5763k0045q419L2434j760j5004m6300k0467O747
14380f1934L4401O2911j0799k5779p713J7093l2258L8519K7441k3676m2956j8027
14368d2777J7928q114J4667L5405p512l381J6572L1664O181K5188q550n0360k5270
$$ plain form
14454 -15768 -5808 50192 48244 32277 54188 55188 34281 45514 72216 91194 8258 -32946
14442 -32946 -19318 -32516 -29838 -55309 -46249 -39880 -43159 -35573 -40771 -42301 -55323 -57310 -93623
14429 -93623 -42015 -20582 -39965 -29708 -52732 -9514 25139 34564 -152 13457 16934 45134
14417 45134 19558 12267 -6619 -33962 -62605 -58425 -38973 -48656 -64193 -36853 -5408 -11198
14405 -11198 -11073 31636 2449 -16747 -33553 -40716 -7076 -15377 -69243 -78631 -51051 -12886 -44479
14392 -44479 -67692 -10502 26643 10880 -9165 -17584 14850 13090 -1914 -48214 -68681 -61934
14380 -61934 -27533 35378 24579 -1200 -8913 8180 -24078 14441 41882 18206 -24750 -42777
14368 -42777 -24849 -32963 -18296 17109 9597 6216 22788 54452 60633 85821 77271 26911 1641
14355A641J6116J2186K4335n8950l7763r91K3980K3K988K2012J8509J2374l6535
14342g5K0773m1855j0734J8819L0726o278k6478j3974J7152o166K4957K5395k4741
14329G521J1950N2887j7237m5708m8796L1346Q579k2223n319j5410K8150Q35J115
14316a2310j6749q437J6199k8731m769K9770m327p441J8148L5050J8221l19p65
14303C3540l0258j7202K9873Q701M520K6129M3278J228J1730p323m4588m0240
14291A9388j7347j1640M8782j0531j5131j6741J5261m686J5933k8121l2399K5393
14279a1839j3188l1569M0900M3597J8259n77k9054J1162O395j8981k7643j4120
14267b6658K8249M7642o351j4825K8389m0874k0714J7458K8360j2921L2058M164
$$ plain form
14355 1641 17757 29943 54278 -4672 -42435 -43426 -19446 -19423 -16435 5577 24086 36460 -75
14342 -75 20698 -21157 -31891 -13072 17654 11376 -15102 -29076 -11924 -18090 6867 32262 7521
14329 7521 19471 72358 55121 9413 -39383 -8037 542 -21681 -27000 -42410 -14260 -13425 -12310
14316 -12310 -29059 -37496 -21297 -50028 -54797 -25027 -29354 -36795 -18647 16403 34624 34305 33540
14303 33540 3282 -13920 15953 24654 29174 55303 98581 99809 111539 104216 59628 19388
14291 19388 2041 -9599 39183 28652 13521 -3220 12041 7355 23288 -4833 -37232 -11839
14279 -11839 -25027 -56596 -15696 27901 46160 45583 16529 27691 34086 15105 -12538 -26658
14267 -26658 1591 49233 42882 28057 56446 15572 -5142 12316 40676 27755 59813 63977
14255F3977j7606M247L512R220j770m305j4362n8058J5444L5975K082j3549P556
14242C2363R713L2005n497j4150j7551K5699o192k7356l0718n8220p680K6811
14230d0773N4782N8319l1401l0236R522K3335K7099J0021k7725l655m152M793
14218D9929K1504R614j0222O511M0920l2799k3835n48K5155N335P2588Q7506j020
14205B50638M0529p847M7901Q2783J17713J17034J53403K63611L85952N95537
14195B047254J005481J601053K234388J579205R20981k93098j774825j870880
14187E449559j782510j264939p22670m30783l11958j78958r6744j30635o3472
14178D66890o2654q4945P265m455k9194p7167m3506M4438l171l9649k7586j1936
$$ plain form
14255 63977 46371 50618 54130 63350 61580 57275 42913 -15145 299 36274 38356 24807 32363
14242 32363 42076 74081 68584 54434 36883 62582 56390 29034 -1684 -59904 -67584 -40773
14230 -40773 14009 72328 40927 10691 20213 43548 70647 80668 52943 49288 45136 49929
14218 49929 71433 81047 70825 77336 118256 85457 61622 61074 86229 91564 164152 251658 250638
14205 250638 291167 283320 331221 414004 531717 648751 802154 1065765 1451717 2047254
14195 2047254 3052735 4653788 6888176 8467381 9388362 9095264 7320439 5449559
14187 5449559 3667049 2402110 1679440 1248657 936699 757741 660997 530362 466890
14178 466890 404236 319291 326556 322101 292907 215740 172234 216672 213501 173852 146266 134330
14166A34330n306k0703L921j7720l2969j0553p033r954L443J1844j2983J3849
14154E0166l0868k4585o3L5330M8554L9056n235m9551j0872j1654j3523J4808
14142D1563J470m6887j833N5534N9496r689n3540Q24J1036J2266n6627l6931l9038
14129f2356J3237J7749K6191l8383J9872M4984k5907l5689k0717m556J792N8465
14117e318M7590Q228k6524L053m426m45j3767j8747J3743L1370K3412q734J0374
14104E9809l808J3911J0189k160K9518j6303m8090k3534k3506M2631M0142r073
14092F9726K8712j2677j6249J9207J6909L496m523m2520j1896n559J2438o998
14080E0066k9615n674K1491K4951j564j2043j4084j0626M0620r02M1999n438K778
$$ plain form
14166 134330 129024 108321 112242 94522 61553 51000 43967 34013 37456 49300 36317 50166
14154 50166 19298 -5287 -5350 29980 78534 117590 112355 62804 51932 40278 26755 41563
14142 41563 43033 -3854 -5687 49847 109343 99654 46114 46938 57974 70240 13613 -23318 -62356
14129 -62356 -49119 -31370 -5179 -43562 -23690 21294 -4613 -40302 -61019 -65575 -63783 -5318
14117 -5318 42272 50500 23976 27029 22603 22158 8391 -10356 3387 34757 58169 49435 59809
14104 59809 56001 69912 80101 77941 107459 91156 43066 19532 -3974 38657 78799 69726
14092 69726 98438 85761 69512 88719 105628 109124 104601 62081 50185 44626 57064 50066
14080 50066 20451 14777 36268 61219 59655 47612 33528 22902 63522 62620 104619 99181 101959
14067A01959j5526J1680L4289p492K7672N0813N5826O8224R8996J99690K87425
14056I13556M39923N11279L38591J59168j21963m11773m51416l62325k82916k04008
14046E28116j02728r6141o4453k7402j7154J1262k7295j7412k7886k9676k64L5165
14034A64132j9732j1374m0778o7782m3118J1851L149K0768o392o3170J0981N0498
14022I033L9425j5277l0670j2228J0693j705k9000k9708j1297P520k073M0711
14010b4576k3747J4059L2079K1559j0541j3569l040l6107L4272o32O4881o393
13998D8245m2225J5482m023P109k795p683j673K5768K521K2779o589l8179q499
13985A0238j562J5316j923L4077M3793J1634r4624m6515K0526j0939O6095N0945
$$ plain form
14067 101959 86433 98113 132402 124910 152582 203395 259221 327445 426441 626131 913556
14056 913556 1353479 1864758 2203349 2362517 2240554 1828781 1377365 1015040 732124 528116
14046 528116 425388 329247 264794 237392 220238 231500 204205 186793 158907 129231 128967 164132
14034 164132 144400 133026 92248 24466 -18652 -6801 -3652 17116 10724 -52446 -41465 9033
14022 9033 48458 33181 2511 -9717 976 -729 -29729 -59437 -70734 -63214 -65287 -24576
14010 -24576 -48323 -34264 -2185 19374 8833 -4736 -7776 -43883 -9611 -10243 54638 48245
13998 48245 6020 21502 17479 24588 21793 14110 12437 38205 40726 63505 56916 18737 10238
13985 10238 8676 23992 22069 56146 99939 111573 16949 -29566 -9040 -19979 46116 97061
13973I7061j0589j0133j9466j00226m7828M6955N6170M1633J3101n1463n2328
13962c7113j5480k9528j1632M3298L7486m0160m0869o686K4811M5465N925K3107
13950a376j8351Q251L0694J9218m280J027J522m359l171j5406J6901L017J6081
13937D9768J5936l188k8325K4177K263m611L7594L1756p2269m6987K0601M5797
13925G2512K4829M3882R4531M3057M232J3602m5967q7987o8768R524q078m0589
13913E4780L896K032q615m572j5391K50j7021k8013o36K9130k978j0949o5938
13900f4025n6068K9830P063Q214K9557N4375M1759k695j9181r804O5728J2274
13888I7027L3980N5669P0334L4731K0992q451o7281n0469M1286j0953n9753m3072
$$ plain form
13973 97061 86472 76339 56873 -43353 -91181 -44226 11944 53577 66678 15215 -37113
13962 -37113 -52593 -82121 -93753 -50455 -12969 -53129 -93998 -100684 -75873 -30408 -24483 -1376
13950 -1376 -19727 -11476 19218 38436 34156 35183 36705 32346 29175 13769 30670 33687 49768
13937 49768 65704 62516 34191 58368 60631 56020 93614 125370 53101 6114 26715 72512
13925 72512 97341 141223 235754 278811 283043 296645 250678 162691 93923 103447 95369 54780
13913 54780 58676 60708 52093 47521 32130 32380 15359 -12654 -13290 15840 12862 1913 -64025
13900 -64025 -120093 -90263 -83200 -74986 -45429 8946 50705 48010 28829 19025 84753 97027
13888 97027 131007 186676 257010 291741 312733 304282 237001 186532 227818 216865 157112 114040
13876A14040m5517Q073j1043K3456o262J7388l3557n2537o736N126J2251j612
13864B3070k8580j0003l5323k0768J5320M4678j4807k5634k0678M0282l430J9597
13852a6276K0271j2548P54K043L571J0099J1477k5149j1853k5514J9750k2110
13840d5485k5307l2431R514N6110k224k969L4265M2875L8620J9230J6756m6396
13828F2558n1735l325j6605j5540K0305k3278J5756n098K462k0866M618M940L0110
13815D302Q178J0059j9107k7493j8303L0809K0611Q985j4664K3869l2483l4993
13803d0230n920K1495K6119J7520M4857N851l5904j4172J6095L523l0187k8296
13791a9249j3662j5056M2209L2640L8478R094J9621p499l5036O891K0110K363
$$ plain form
13876 114040 68523 76596 65553 89009 82747 100135 66578 14041 7305 12431 24682 23070
13864 23070 -5510 -15513 -50836 -71604 -56284 -11606 -26413 -52047 -72725 -32443 -35873 -16276
13852 -16276 3995 -8553 -7799 -5756 -2185 7914 19391 -5758 -17611 -43125 -23375 -45485
13840 -45485 -70792 -103223 -93709 -37599 -39823 -42792 -8527 34348 72968 92198 108954 62558
13828 62558 10823 7498 -9107 -24647 -4342 -27620 -11864 -16962 -14500 -35366 -30748 -25808 4302
13815 4302 12480 22539 3432 -24061 -42364 -11555 9056 18041 3377 27246 -5237 -40230
13803 -40230 -46150 -24655 1464 18984 63841 69692 33788 19616 35711 39234 9047 -19249
13791 -19249 -32911 -47967 -5758 26882 65360 74454 94075 86576 51540 58431 78541 80904
13779H0904L5566P49j0968R800o0287l6300L1225K8804k5566m3616k1135k6616
13767c7440m7593L8345K6896j4526K0696L8725P379L0488l2614k8908K8458m9473
13755a9567n6361k2473M3839M0137K0900P801l8934n1647j2623J9988L5680L7362
13743D102N167j746M8161l3767k4154j1049J4736n583k2205Q104j8862j2429K3276
13730b6249J0297P728K4894J4365L929L3125P62M371m454n0849k3301J9896m719
13717I795m3552O700L6416L5204K0763j6103m7983j3275P878l6723K4584J6406
13705A10p544m6071m0675k0549J5644k3393K3033P927L7324M2289J9263J5857
13693B3215L0382K9577j6700m8609j5005J8640J5907K424j0552k9590k8040k52
$$ plain form
13779 80904 116470 117219 106251 116051 55764 19464 50689 79493 53927 10311 -10824 -37440
13767 -37440 -85033 -46688 -19792 -34318 -13622 25103 32482 62970 30356 1448 29906 -19567
13755 -19567 -75928 -98401 -54562 -14425 6475 14276 -24658 -76305 -88928 -68940 -33260 4102
13743 4102 9269 7523 55684 21917 -2237 -13286 1450 -4133 -26338 -18234 -37096 -49525 -26249
13730 -26249 -15952 -8224 16670 31035 34964 68089 68851 73222 68768 17919 -5382 14514 9795
13717 9795 -33757 -27057 9359 44563 65326 49223 1240 -12035 -4157 -40880 -16296 110
13705 110 -7434 -53505 -94180 -114729 -99085 -122478 -99445 -91518 -54194 -11905 7358 23215
13693 23215 53597 83174 66474 17865 2860 21500 37407 39831 29279 -311 -28351 -28603
13681b8603l2456j0794J0391N0859P2815j5074r2952r395O3018L5585k7178m061
13669A2155M6483r759m2871J3635R795r324n0205j8973L9902K5975J7758M068
13657C8639L321l1667k314K980p6228N621J9683M6429K0446J6901Q387m7995k0248
13644a6045K3839M0757O228l383l489J3137j6241j9589j034p643P417o746K5377
13631D2585k3017m3809K8106j0124K6705j7214P408L067m7493J6429J7647J706
13619A996L43J2623q690p16j4445j8616j9841j5661O48J1267L3329K6566k5350
13606a6547k0636j8952k4057M9570Q632r457P164j0172M3757L6380k823k15J1623
13593E4267K6802l3345n7559l7906k1530K9566M5924j2392K2735K8828J4851K2604
$$ plain form
13681 -28603 -61059 -71853 -61462 -10603 62212 47138 -45814 -55209 7809 43394 16216 12155
13669 12155 58638 48879 6008 19643 29438 20114 -30091 -49064 -9162 16813 34571 38639
13657 38639 41960 10293 7979 10959 -65269 -59648 -39965 6464 26910 43811 52198 4203 -16045
13644 -16045 7794 48551 54779 51396 47907 61044 44803 25214 24180 16537 23954 17208 42585
13631 42585 19568 -24241 3865 -6259 20446 3232 10640 13707 -33786 -17357 290 1996
13619 1996 2339 14962 6272 5556 -8889 -27505 -47346 -63007 -62359 -51092 -17763 8803 -16547
13606 -16547 -37183 -56135 -80192 -30622 -21990 -31447 -24283 -34455 9302 45682 42859 42644 54267
13593 54267 81069 47724 -9835 -47741 -69271 -39705 6219 -6173 16562 45390 60241 82845
13581H2845o1883J0729L2304p617l627l7812L807m160o489m138l7749m5876k2241
13568a01907M527L1133K2824k6015K067K7300M3882L1315l1100j4032L6657m8025
13556b1374j743P8980K0531m15k7209j7667k8068j9314P56k2420K4732J6198m8055
13543d5068k0969K4210M1547K3467K7433O3487m7174l2197J332k267k2638l4465
13531b3302J4736O915L874K4003L1004j065m7872k3620K3295K0912l2468k2243
13519b5831k3175M1278L8717k1641j7052n624L640J4134n6270p499M1961K104
13507a5258p465j7682L2384J4118q007L3171J71L3780o044l5189j9808k4499j3109
13494c3437J5944L8744K6537l1718m052J891J4712j152N17N2298P234l7712k7451
$$ plain form
13581 82845 20962 31691 63995 56378 52751 14939 18746 14586 8097 3959 -33790 -79666 -101907
13568 -101907 -97380 -66247 -43423 -69438 -67371 -40071 3811 35126 4026 -10006 26651 -21374
13556 -21374 -23117 55863 76394 75979 48770 31103 3035 -16279 -15523 -37943 -13211 2987 -45068
13543 -45068 -66037 -41827 -280 23187 50620 114107 66933 34736 36068 33801 11163 -23302
13531 -23302 -8566 -1651 2223 26226 57230 56165 8293 -15327 7968 28880 -3588 -25831
13519 -25831 -49006 -7728 30989 9348 -7704 -13328 -9688 4446 -51824 -59323 -17362 -15258
13507 -15258 -22723 -40405 -8021 6097 -1910 31261 31432 65212 59168 23979 4171 -20328 -33437
13494 -33437 -17493 21251 47788 16070 12018 13909 28621 27469 27986 80284 87518 49806 22355
13481B2355N04p556l0496NJ6153J3643N865K117L7030j4129k7485L1495M3988
13468I3489o8415m2008j4510J3221K3940m51n650j1943J0281r906o901r189J2004
13455a6038j6698k6114j6158m179K152O9356J7155l9652K8378q103j4713J8147
13443f467l1066J6003L0856K6552l7353l5042K0166p163j3674M1874N265R865
13431A9816N326j5651p452k9711J1154J7433L3049J0604k4032K0563j2416k6431
13419B252K8534J1158N441j5439l917q987j4763m0076j1643J0568n207o235o662
13406e4976N8600R411J1923L862k0093O159K0345J1998j398j2205J0393j0500
13394C3519r228J139O758L1482J180l7866q0244K694L5561K1626k3495R82j232
$$ plain form
13481 22355 22859 15303 -15193 -15188 965 14608 20473 22590 59620 45491 18006 49501 93489
13468 93489 25074 -16934 -31444 -18223 5717 5266 -384 -12327 -2046 -11952 -18853 -28042 -16038
13455 -16038 -32736 -58850 -75008 -79187 -77035 -7679 9476 -30176 -1798 -9901 -24614 -6467
13443 -6467 -37533 -21530 9326 35878 -1475 -36517 -16351 -23514 -37188 4686 9951 19816
13431 19816 25142 9491 2039 -27672 -16518 915 33964 44568 20536 41099 28683 2252
13419 2252 30786 41944 47385 31946 28029 19042 4279 -35797 -47440 -36872 -42079 -48314 -54976
13406 -54976 3624 13035 24958 28820 8727 14886 35231 47229 45831 33626 44019 33519
13394 33519 24291 25430 32188 63670 64850 26984 -53260 -50566 -15005 6621 -16874 -15892 -17124
13381a7124O465j2794J448P732O878Q481j6453m497m053k4495L4109J931n2899
13368f5271j2134J4190l988k3128j5244o827N7425M5403J2054p949J2528L7413
13356D4472k7546k4975O188M5539M18l1369L4013J7603k5191j547M298j9636l3700
13343a1433J0499M8327O3022P8235P9173M1397P5754J24657J82506L17990L63495
13332A373622K48799J67844o0531k91189l78701l40163k45105j48146o9712m9997
13322B06721j3039l9320o3047n4651J1871M2818J5728j4233k3282j9315l2117
13311A8134L5236J1235J9808j5243O467j0534l1501m806l5865L8126R199j0711
13299B9545K3679N7260k816m4197j460J9330j4954n5793k0158r475k1277L6645
$$ plain form
13381 -17124 -10659 -23453 -22005 -14273 -7395 1086 -15367 -19864 -23917 -48412 -14303 -12372 -65271
13368 -65271 -77405 -63215 -67203 -90331 -105575 -112402 -54977 -9574 2480 -5469 7059 44472
13356 44472 16926 -8049 -1861 43678 44096 12727 46740 64343 39152 37605 41903 22267 -11433
13343 -11433 -934 47393 110415 188650 267823 309220 384974 509631 692137 1010127 1373622
13332 1373622 1622421 1790265 1729734 1438545 1059844 719681 474576 326430 256718 206721
13322 206721 193682 154362 91315 36664 48535 91353 107081 92848 69566 50251 18134
13311 18134 53370 64605 84413 69170 75637 65103 33602 28796 -7069 31057 40256 29545
13299 29545 53224 110484 107668 63471 62011 81341 66387 10594 -9564 -19039 -40316 -3671
13287c671M1398P579O812K4932k063q952k4387n1081k0184J0743K8995M511j1812
13274B820j0948J676l722r003P48l49l7943L3726j2464l4906K7107K3486j1370
13261c1142o034K1449j0543J829j2234J8872L878L323p142j0634L2082O403j3136
13248c029K9912K3935L7944K6203m5928l4207j2739l945j1261K9669j8436l3229
13236a5111l5077J0614L6272J8609r399J5490J2323R828N602l2848J8926M4072
13224G9301j7356N920j6487k6375K2713l0795k4127K3239k2795O533L2726J822
13212C4319j6169q419m956K0367j4820k8269k3817j9489k3122O96N1696M5953
13200A3970J1232m1559M021k2302J8632M0204j1570j8324L5350K5234l2199o6287
$$ plain form
13287 -3671 37727 45306 52118 77050 74987 66035 41648 -9433 -29617 -18874 10121 14632 2820
13274 2820 -8128 -6452 -10174 -19177 -18429 -18778 -56721 -22995 -35459 -70365 -43258 -19772 -31142
13261 -31142 -37176 -15727 -26270 -24441 -36675 -17803 -13925 -10602 -17744 -28378 3704 10107 -3029
13248 -3029 26883 50818 88762 114965 69037 34830 22091 18146 6885 36554 18118 -15111
13236 -15111 -50188 -39574 -3302 15307 5908 21398 33721 43549 49151 16303 35229 79301
13224 79301 61945 67865 51378 25003 47716 16921 -7206 16033 -6762 -229 32497 34319
13212 34319 18150 9731 4775 25142 10322 -17947 -41764 -61253 -84375 -83679 -31983 13970
13200 13970 25202 -16357 -12336 -34638 -16006 24198 12628 -5696 29654 54888 22689 -43598
13188d3598j6575l303o899o284L2608J3545L710O3601K6699k5896k0199p790r797
13175a78L7311j080J990j8232k0212K1118k1533l6111l1311J9946O0099M7789
13163E9596N400P150N346q826j627n267R233J9202M7357N2596L9796N307L2144
13150B67407l5426l2979R596l3210m1373j8905m9297m0962K09k107j2027p856
13138C070r886k6173J1304J4594q615k6473j69k4134K4317K0616P367p324L5823
13125A4317K1573J1245j6721k8430K2836j2147l5279K8274M775M096J8074j423
13113C1190R835J081j2547j8923K8179K1119K8804m8383k2366K6583j2040J0203
13101D2735j4573n0909M5635P2676n5380k3777j5149K8185M0650J1824m799Q18
$$ plain form
13188 -43598 -60173 -63476 -70375 -76659 -44051 -30506 -26796 36805 63504 37608 17409 9619 -178
13175 -178 37133 36053 38043 19811 -401 20717 -816 -36927 -68238 -48292 11807 59596
13163 59596 64996 72146 77492 68666 67039 61772 71005 90207 137564 190160 229956 235263 267407
13150 267407 231981 199002 208598 175388 134015 115110 65813 24851 25060 22953 10926 3070
13138 3070 -6816 -32989 -21685 -7091 -15706 -42179 -42348 -66482 -42165 -21549 -14182 -21506 14317
13125 14317 35890 47135 30414 1984 24820 12673 -22606 5668 10443 14539 32613 31190
13113 31190 41025 42106 29559 10636 38815 59934 88738 40355 17989 44572 32532 42735
13101 42735 28162 -22747 22888 95564 40184 16407 1258 29443 70093 81917 77118 77936
13089G7936J8545k0810m2879L601L9328l531k8844l5389r660P115L0590q601n283
13076B2118L5852l380k9517K0473M778l6901l2260N479R033J1431j5809o427L4303
13063A9173N830o3140o9493K4490O9094O6400K2649l4787j3432M3610L3186j1182
13051I2398J982k7295k9235J229K5548J5936m488J2900J9967L258n4485m8379
13039I336j7887M939M5669K9115l5038m2179P846K0007j5005K2851Q7391J01300
13027B18345P2358L0566l0756m0519r203j8800l5731M29K9073K1048m2934l0244
13015A63632k7354k571J9397l850n4206p308L3691O948n6813l4924k101J0818
13003D5359j441K0715J4648m439J982R016J897n633P713K6235O171K3244j4497
$$ plain form
13089 77936 96481 75671 32792 36393 75721 72190 43346 7957 -1703 5412 36002 27401 22118
13076 22118 57970 54590 25073 45546 50324 13423 -18837 -13358 -4325 7106 -8703 -15130 19173
13063 19173 25003 -38137 -107630 -83140 -14046 52354 75003 40216 26784 70394 103580 92398
13051 92398 94380 67085 37850 39079 64627 80563 76075 88975 108942 112200 57715 9336
13039 9336 -8551 -3612 42057 71172 36134 -6045 1801 21808 6803 29654 117045 218345
13027 218345 290703 321269 290513 249994 240791 221991 186260 186689 215762 236810 193876 163632
13015 163632 136278 133707 153104 149254 95048 87740 121431 128379 71566 36642 34541 45359
13003 45359 43918 64633 79281 74842 76824 85840 87737 82104 89817 116052 122223 145467 130970
12990A30970J0014l043K3613M4805L8430l337N2703K7352o367j0921Q185J568
12978C13972j4256m7314K7128L7340n95j7098M8160P671o818k3581o327M277K5035
12965C47594O4451L7610J03328J95821J65961L5611J0901N478K3166Q8375m1308
12954A036988k8084p5508j22860m1989l6771Q213r74R351j0600M4486L5508K0333
12942H38093J5729Q8948M9749M7440Q7155J43931J06808P2123M1395Q8456O9894
12931A649721J37971J28576J15027R9571J19720J02613R5295J71911K23844K99292
12921C143541L55220M79032O43187P63600R93550J092548J085185J167928J139321
12912A0863112J324072J809067K586793L590890M865939O703607R708296J4544332
$$ plain form
12990 130970 140984 137941 161554 206359 244789 241452 294155 321507 315140 304219 312404 313972
12978 313972 299716 252402 279530 316870 316275 299177 347337 355008 348190 324609 318282 322559 347594
12965 347594 412045 449655 552983 748804 914765 950376 961277 966755 989921 1078296 1036988
12954 1036988 1008904 933396 810536 768547 731776 739989 739015 748366 737766 782252 817760 838093
12942 838093 853822 942770 992519 1039959 1127114 1271045 1377853 1449976 1491371 1579827 1649721
12931 1649721 1787692 1916268 2031295 2130866 2250586 2353199 2448494 2620405 2844249 3143541
12921 3143541 3498761 3977793 4620980 5384580 6378130 7470678 8555863 9723791 10863112
12912 10863112 12187184 13996251 16583044 20173934 25039873 31743480 41451776 55996108
12904E5996108K2408836L5334980N5938126P3990587N6060685L2546680k448126
12897C29827876n4004570o3628268o2132092m8777557l0135223j7887545j1190274
12890D2072347p461190n470384m218423l425756k886146k373332j842056j445945
12882A2949115j240563j060804j113328j100747r82583q44980p66142o28338n27807
12873D683823m80482m03209l32151l01777k94632k72018j74355j32956j55809
12864B136434j87037j27399j30958j13202p6156k7217k9090j16044n3441m8302
12854A227588l8049m6395m1731o1632q091k0972j1461k2523k3371j2485o1187
12843H79691l1037k1705R515J2688j0914n2091m4301k9783m3952n1326m4062o5449
$$ plain form
12904 55996108 78404944 113739924 169678050 243668637 299729322 332276002 329827876
12897 329827876 275823306 212195038 150062946 101285389 71150166 53262621 42072347
12890 42072347 34611157 29140773 24922350 21496594 18610448 16237116 14395060 12949115
12882 12949115 11708552 10647748 9534420 8433673 7451090 6606110 5839968 5211630 4683823
12873 4683823 4203341 3800132 3467981 3166204 2871572 2599554 2425199 2292243 2136434
12864 2136434 1949397 1821998 1691040 1577838 1501682 1474465 1445375 1329331 1275890 1227588
12854 1227588 1189539 1143144 1101413 1039781 1031690 1010718 999257 976734 953363 940878 879691
12843 879691 848654 826949 836464 849152 838238 786147 741846 712063 668111 616785 572723 507274
12831E07274j3927j7105J4143L2248K0042l1088J7480J5883n4550m8728k5954
12820D15718l8220p3817l9235J0424j2840j7373k2379J30K3482L9622M3837L2340
12808C61689r165j3456j0467L302k7183k1273K2899n1577m2785J0282K7242L0341
12796B79849M321q739R953p28j5330k4972j3883p51M851O838m9435l1762N036
12783A65248o269j6019L0166K2471J4009J5883N479j0943K39K414J1424M6203
12771B80305M0883j6587n7834L2307J2716l7047l0601o5685j8402K3936k6988
12760A37003K0732K3483k90k895m158l2019k1347L3179R649J1835R104P2J7968
12747B02316l3619k2666O4L9003q791k4294M297j3209J4427K342j2366O828Q796
$$ plain form
12831 507274 493347 476242 490385 522633 542675 511587 529067 544950 490400 441672 415718
12820 415718 377498 303681 264446 274870 262030 244657 222278 222408 245890 285512 329349 361689
12808 361689 352524 339068 328601 331903 304720 283447 306346 254769 211984 222266 249508 279849
12796 279849 284170 275431 285384 284656 269326 244354 230471 229720 234571 241409 191974 160212 165248
12783 165248 158979 142960 173126 195597 209606 225489 230968 220025 220264 222678 234102 280305
12771 280305 321188 304601 246767 279074 291790 254743 224142 158457 140055 163991 137003
12760 137003 157735 181218 180928 178033 173875 141856 120509 153688 163337 175172 184276 184348 202316
12747 202316 168697 146031 146095 185098 176307 152013 156310 143101 157528 159870 147504 154332 163128
12734A63128j7067k8491j1323l506m086K0609j2952K2390N951O129O950K0815
12722A68547R039M144j1192L0782K4621l1448k6730q964l6814l5038l7489j5006
12710C4452O1479N5781l0116k3998J719K50J3825M1571K0018k7243n2798k5749
12698F9191j9731k9056L5278M2379Q038k0108J640p854o516l5249P025j0705K0962
12685E5294M4642K2502j5635o1823j4478k81L2295j791J0119q032J379K225L2715
12672I9131q914M419J7365K6755j3474k6246m2606J38L9236j8840o4660k7716
12660a5412J9048J3758j3795K8729M7688l9866k8679k0978J8197K4102J4723L6512
12648H4027N0386k9386m6100o7141j5761L7103M3083l484k7353l4258k683k8860
$$ plain form
12734 163128 146061 117570 106247 102741 98655 119264 106312 128702 134653 140782 147732 168547
12722 168547 177586 181730 170538 201320 225941 194493 167763 158799 121985 86947 49458 34452
12710 34452 95931 151712 121596 97598 99317 99567 113392 154963 174981 147738 94940 69191
12698 69191 49460 20404 55682 98061 106099 85991 87631 79777 73261 38012 45037 34332 55294
12685 55294 99936 122438 106803 44980 30502 30221 62516 60725 70844 62812 64191 66416 99131
12672 99131 90217 94636 112001 138756 125282 99036 56430 56568 95804 76964 12304 -15412
12660 -15412 3636 17394 3599 32328 80016 40150 11471 -9507 8690 32792 47515 84027
12648 84027 134413 105027 58927 -8214 -23975 13128 56211 52727 25374 -8884 -11567 -40427
12636d0427p399J2743L7618J8862J2955R790k9060K1635j6328j9712l4972J754
12624c2541J8985L4417K8383n4536J8152J5581k2528M2820O121J2667j8943j8097
12612C0481O898n076J3798j8762j6227r630M013J3365p049J8573k774J6675L417
12599D7702K5164L2302K8347j0587n919p024l4099o313Q094j6217k1273j1881
12587B8296M226J1257k3336J0575N039J4730j1684J6418o982k1887J120J7975
12575D5747m7437k3863m338L541k0777m2935J67j3539Q147M5866N1491j0052K0195
12562A2213K7879J8216K9784J406o3059k700k1993K9622J3037J4589j8410K387
12550D2971L9908l736j0639L1560Q479l9570q780l782K5928j759K3438k5220m6927
$$ plain form
12636 -40427 -47826 -35083 2535 21397 34352 44142 15082 36717 20389 677 -34295 -32541
12624 -32541 -13556 20861 49244 -5292 12860 28441 5913 48733 54854 67521 48578 30481
12612 30481 37379 32303 46101 27339 11112 1482 5495 18860 11811 30384 27610 44285 47702
12599 47702 72866 105168 133515 122928 117009 109985 75886 69573 77667 61450 40177 28296
12587 28296 32522 43779 20443 31018 36057 50787 39103 55521 48539 26652 27772 45747
12575 45747 -1690 -25553 -29891 -26350 -47127 -90062 -89895 -103434 -95287 -49421 2070 -7982 12213
12562 12213 40092 58308 88092 89498 26439 23739 1746 31368 44405 58994 40584 42971
12550 42971 82879 79143 68504 100064 108543 68973 60193 56411 82339 80580 104018 78798 31871
12537C1871j1048m499m014J9474J8969M3752K4563j6227K1433m347O042j3892
12525A12077k2218k6860P360L299Q4490J60883J33158j9767p2574p1759n5284
12514B32805m9732m7975l7844L417K0035j7439j8639J1192M0892p585O097l2670
12502A02554M370J0208m1407k6236n187L483J2716o2814j800M0717K6295K0517
12490H3416j3791N764j3143k0998j6669l6146o035M6423j9041R300L8204j9595
12478C7689R907O222j2587K4887K2981j7693o613L8258K4581K53L0445O8554J32773
12465C59657K04019K63030L49008L28815J89087J00597j46940l03387l63176l10607
12455F70103k07994q3448p1443l9705k5541o3535o4904j6719p553p533n5r433
$$ plain form
12537 31871 20823 16324 12310 31784 50753 94505 119068 102841 124274 119927 125969 112077
12525 112077 89859 62999 70359 73658 158148 319031 452189 432422 359848 288089 232805
12514 232805 183073 135098 97254 100671 120706 103267 84628 95820 136712 129127 135224 102554
12502 102554 106924 117132 75725 49489 44302 47785 60501 -2313 -4113 36604 62899 83416
12490 83416 69625 75389 62246 41248 24579 -11567 -17602 28821 9780 19080 57284 37689
12478 37689 47596 53818 41231 66118 89099 71406 64793 103051 127632 127885 158330 226884 359657
12465 359657 563676 826706 1175714 1504529 1693616 1794213 1647273 1343886 980710 670103
12455 670103 462109 378661 307218 267513 241972 178437 113533 96814 89261 81728 81673 72240
12443G2240J8660k6168l1042M1464M0780J1400l8143m0776N172j9475k3981J7431
12431B7562j366J2082j3497M0897K5250J9420r87l2311j409k8543j2359K0995
12419E5734p564j5875j3610q585K662K9547K8684j030l7340o28J520K7460K1918
12406H2893p3222m0970J2848P0557M630L85K6155m5493n3889K076L3130N312L7604
12393F2016j9369m8279r105L39O538p481j1335K1953J7093L0788l193L3366j0376
12380F2955n8644J9308J6359J3443L0241k9507m9881k0513k6361L0478L6211j1647
12368A2442K6813M9536p275r684l7738J796Q287j6700J2481q247O99j5319j5292
12355A799l663L2913l4774o247l547j9071P72M6310K7039J0925l5113l9660Q887
$$ plain form
12443 72240 90900 64732 33690 75154 115934 127334 89191 48415 53587 34112 10131 27562
12431 27562 26196 38278 24781 65678 90928 110348 109361 77050 75641 47098 34739 55734
12419 55734 48170 32295 18685 10100 12762 42309 70993 69963 32623 31995 33515 60975 82893
12406 82893 9671 -31299 -18451 52106 56736 57121 83276 37783 -16106 -14030 19100 24412 62016
12393 62016 42647 -5632 -14737 -14398 -7860 -15341 -26676 -4723 12370 43158 39965 73331 62955
12380 62955 4311 23619 39978 53421 83662 54155 4274 -16239 -42600 -12122 24089 12442
12368 12442 39255 88791 81516 71832 34094 35890 44177 27477 39958 31711 32410 17091 1799
12355 1799 -1864 31049 -3725 -9972 -13519 -32590 -31818 14492 41531 52456 17343 -22317 -13430
12342a3430r744J2259l015k0105l2213J988l3851M3508M9853L2948q865o799j9249
12329f715J2407q59O721J9076l7005J05J1349J8504l1125p147K0973k8549J1788
12316a0477j0028J1112J5218m5927m146J5383P013J9053K4995K5489J2344k3635
12304C6394k3198N5N4941N664Q533J6094n3974j0691o837j0294L660j91K3623
12291D3779l2663m6188K0745K9577r459Q502k3804m0527K8144Q1070O113m9823
12279A5466m2175L5412l179J4413O3819J5351k4786j3760K2418k9480n9591J9242
12267A3150K1060J7809o189l3532k3831J5125L2960k2017K1262K689o1241o527
12255b9282K9792P032K5853K287j3308l6954K1078M6568K5221k3349j8602J544
$$ plain form
12342 -13430 -23174 -10915 -13930 -34035 -66248 -64260 -98111 -54603 -4750 28198 19333 12534 -6715
12329 -6715 5692 4833 11554 30630 -6375 -6270 5079 23583 -7542 -14689 6284 -22265 -10477
12316 -10477 -20505 -9393 5825 -40102 -44248 -28865 -21852 -2799 22196 47685 60029 36394
12304 36394 13196 13251 68192 73856 82389 98483 44509 33818 26981 16687 20347 20156 43779
12291 43779 11116 -35072 -14327 15250 5791 14293 -9511 -50038 -21894 59176 65289 15466
12279 15466 -26709 8703 5524 19937 83756 99107 74321 60561 82979 53499 -6092 13150
12267 13150 34210 52019 45830 12298 -11533 3592 36552 14535 35797 38486 -22755 -29282
12255 -29282 510 7542 33395 35682 22374 -14580 6498 53066 78287 54938 36336 37880
12243C7880r143j0473l6781k8528k371m257P1119l7620j9386M4807M0216j3100
12231C2363j0823P963j9606j0754j1893J460j488K7827K109l9276n2069K0906
12219e3281P1631j7683K923k053J1663k8867l5376K526K0601K8318l2887J5668
12207a6817K8472L7191k7355n392k8559o864N650r446k4013N633L080J2722j6206
12194d1904j2592K7340L4383j375P582J7211M3464n1977j6606L4038P719n6504
12182i221M649P2350l747j3232k4148l1213O321j4469L042J3260n9063j2222K0321
12169d7372N1936L7231J7195L71j5409J8673k5709k8348M546J3725j5994n2502
12157d1657j4770N2888N2109L710j4732J353K1951l8666k1701j2476J3778j5899
$$ plain form
12243 37880 28737 18264 -18517 -47045 -49416 -53673 17446 -20174 -39560 5247 45463 32363
12231 32363 21540 29503 9897 -857 -12750 -11290 -12778 15049 17158 -22118 -74187 -53281
12219 -53281 18350 667 3590 1537 13200 -15667 -51043 -48517 -27916 402 -32485 -16817
12207 -16817 11655 48846 21491 16099 -12460 -19324 -13674 -23120 -47133 -41500 -38420 -25698 -41904
12194 -41904 -54496 -27156 7227 5852 13434 30645 74109 22132 5526 39564 47283 -9221
12182 -9221 -4572 67778 64031 50799 26651 -4562 1759 -12710 -9668 3592 -55471 -67693 -47372
12169 -47372 4564 41795 58990 59361 43952 62625 36916 8568 13114 26839 10845 -41657
12157 -41657 -56427 -3539 48570 52280 37548 38901 60852 22186 485 -11991 1787 -14112
12145a4112p22J0760K769j4778N211n738R720R377o306k7459j6925K1061k4388
12132e1530k5600j6298K2082j7984k1043o2643K1947M8487M8616P2009O893R852
12120C4788n263R32j8362L223l5629K4000M8903j3861O751N596l5185K5037J3900
12107E4830n0175k4987K0308k3255n2190p517M2478M1547m846j6188O696N263
12095h036k676J724L379K2529P788j8644R867N366k8176o2758P205J2206J3221
12082c7005J1806O582J99K0368j839l6451K7592N6770P616J690n9267K175M2539
12069D2775J068q942k2903k4510J0771j6000p590J7922l0879R775p614J9325K3081
12056F279j4506l1132o232K3384M319J2719l2377k2619k1156L6073K1326J4517
$$ plain form
12145 -14112 -14834 -4074 -1305 -16083 -10872 -16610 -6890 2487 -3819 -31278 -48203 -27142 -51530
12132 -51530 -77130 -93428 -71346 -89330 -110373 -173016 -151069 -102582 -53966 18043 24936 34788
12120 34788 29525 30457 12095 15318 -20311 3689 52592 38731 45482 51078 15893 40930 54830
12107 54830 4655 -20332 -24 -23279 -75469 -82986 -40508 1039 -3807 -19995 -13299 -8036
12095 -8036 -10712 -8988 -5609 16920 24708 6064 15931 21297 -6879 -69637 -62432 -50226 -37005
12082 -37005 -25199 -18617 -18418 1950 111 -36340 -8748 48022 55638 57328 -1939 236 42775
12069 42775 43843 34901 11998 -12512 -1741 -17741 -25331 -7409 -38288 -28513 -36127 -16802 6279
12056 6279 -8227 -39359 -45591 -22207 -17888 -5169 -37546 -60165 -81321 -45248 -23922 -9405
12044i405K4124l3734k1716l1439J0703L4614j1215j7848k042Q238K482K0955
12032b6283J4672k6740j4263j2939J1439l467j1421j6028L1810M4996P877R895
12020I548M103l2535L1683J8969l2074j2666Q001K5088k8573j9474j8836O9784
12008B3018M8032O70l915l7465k7282j7490j8439j4250J7282M810J363P264L957
11995a2445K5952q543m1491n387L6015j9341k9664L2242J4908Q577P322j0426
11983b281j9687j9097m3091M5842L8731J6905J0584N379k4127k4841J807m2568
11971e6444m1889N2228Q9686j4366k9355N240o735j5834O677M5650n236k8530
11959A092k3047m6938k0895M8052L2833J0435k2134l1765k3881M4380M54k0742
$$ plain form
12044 -9405 14719 -19015 -40731 -72170 -61467 -26853 -38068 -55916 -57958 -49720 -47238 -26283
12032 -26283 -11611 -38351 -52614 -65553 -54114 -57581 -69002 -85030 -53220 -8224 -347 9548
12020 9548 13651 -18884 12799 31768 -306 -12972 -4971 20117 -8456 -27930 -46766 23018
12008 23018 71050 71720 67805 30340 3058 -14432 -32871 -47121 -29839 -25029 -23666 -16402 -12445
11995 -12445 13507 4964 -36527 -41914 -5899 -25240 -54904 -22662 -7754 823 8145 -2281
11983 -2281 -21968 -41065 -84156 -38314 417 17322 27906 33285 9158 -15683 -13876 -56444
11971 -56444 -98333 -46105 43581 29215 -140 5100 -1635 -17469 -10792 34858 29622 1092
11959 1092 -21955 -68893 -89788 -41736 -8903 1532 -20602 -52367 -76248 -31868 -31414 -52156
11947e2156N708K6319k7985K3285K8204J9673j9891m3399M656K4843L1482R275
11935C0014l0860j3524L3987J5643L6776k4371l5468k5232n6375l9628K4533N8346
11923b6159j248j6437K1099J1551M599K2069q011k4663J3998k4029k0134L714
11911d3651k9082J0370L966k9319M0802K0106j0441Q483j8024P95K1174N1320
11899B6499J2638l6576R574J9371j7917j6716j707J5548O044j844q006l9059K816
11886b9335M006J1927J0193J1684l3741K7683R038j0931j5805J649j0698J7464
11874f866j3227k5129J535l685J7652M2157j8403p375k7791j1242K9300K32l5743
11861e8585j38K5406K9443j0641k5336K8915K8140L438k6809L5381Q725k7158
$$ plain form
11947 -52156 -46448 -20129 -48114 -24829 3375 23048 3157 -40242 -35586 -10743 20739 30014
11935 30014 -846 -14370 19617 35260 72036 47665 12197 -13035 -69410 -109038 -84505 -26159
11923 -26159 -27407 -43844 -22745 -11194 -6595 15474 7463 -17200 -3202 -27231 -47365 -43651
11911 -43651 -72733 -62363 -58397 -87716 -46914 -26808 -37249 -28766 -46790 -45995 -24821 26499
11899 26499 39137 2561 12135 31506 13589 -3127 -4834 10714 16758 14914 6908 -32151 -29335
11886 -29335 -25329 -13402 -3209 8475 -25266 2417 11455 524 -15281 -13632 -24330 -6866
11874 -6866 -20093 -45222 -43687 -47372 -29720 12437 -5966 -13341 -41132 -52374 -23074 -22842 -58585
11861 -58585 -58723 -33317 -3874 -14515 -39851 -10936 17204 20642 -6167 29214 37939 10781
11849A0781l6123N006P920k3175J616N804L410L6539l6586j190j3253M3517L5861
11836D0127k8285o1127j1988j001n0840j3551Q6094N1134L5687k0081l9441o642
11824a9914q493M0780J7646j1382k7139L214o217j9107j6426L6753M3921Q628
11812D2264L1271J2928n2837m6181l866K9086j0329m2291J2091J3288k1042k5648
11800f1266J1846K4551P0500p202k7882K5577l3672j0892j0958r205L5283k3321
11788a6641l6182m0867j5595L0766N7401o870m291j0010L642K9360m0124R054
11776d0357M1358J6607l0568p7691Q504K4594L1753M0105l8089k9264K4049N8926
11764B9927K2290o1465k5068j688k3725M523K0355L7717Q936n2363k4781j0219
$$ plain form
11849 10781 -25342 -20336 -12416 -35591 -33975 -28171 -24761 11778 -24808 -25998 -39251 4266 40127
11836 40127 11842 -49285 -61273 -62274 -113114 -126665 -40571 10563 46250 26169 -13272 -19914
11824 -19914 -28407 12373 30019 18637 -8502 -5288 -11505 -30612 -47038 -10285 33636 42264
11812 42264 73535 86463 33626 -12555 -16421 12665 2336 -39955 -27864 -14576 -35618 -61266
11800 -61266 -49420 -24869 45631 38429 10547 36124 2452 -8440 -19398 -28603 6680 -16641
11788 -16641 -52823 -93690 -109285 -78519 -21118 -27988 -32279 -42289 -38647 -9287 -49411 -40357
11776 -40357 1001 17608 -12960 -90651 -82147 -57553 -25800 14305 -23784 -53048 -28999 29927
11764 29927 52217 -9248 -34316 -36004 -59729 -55206 -34851 2866 11802 -40561 -65342 -75561
11752g5561l0863K537L4981L4155J3007m0748L6642L0957K1740n329l0200m4104
11740e2786l2602K4460M6098N624J662K3650K3533j4870K125k9100k197J4694
11728A0291K2686J3450r519l3578j2235L7918J846p4732k9364l175l497K5214
11716e4695K544N942M8071j43k0399J2010k7746K4180l544k7897K2695j8547K378
11703c5151p870k6215N952j962M7411N3591o1264k4572L0904n100J7324N868n0587
11690e1671j7376l276P6124J1079j2738l144l3561k2562K0070J5978J4569j5860
11678b2368k2559n945M305K3461k6936l4168L4068k2735K734L8543K021K8434
11666a145K3439j7824k2430J8638K1952M9294P167n9344k2085j1453l0772J9726
$$ plain form
11752 -75561 -106424 -103887 -68906 -34751 -21744 -62492 -25850 5107 26847 21518 -8682 -52786
11740 -52786 -85388 -60928 -14830 -9206 -7544 16106 39639 24769 26894 -2206 -4403 10291
11728 10291 32977 46427 36908 3330 -8905 29013 30859 -43873 -73237 -76412 -79909 -54695
11716 -54695 -52151 -46209 1862 1719 -18680 -6670 -34416 -10236 -13780 -41677 -18982 -37529 -35151
11703 -35151 -43021 -69236 -63284 -65246 -17835 35756 -25508 -50080 -19176 -24276 -6952 -1084 -51671
11690 -51671 -69047 -72323 3801 14880 2142 -1002 -34563 -57125 -37055 -21077 -6508 -22368
11678 -22368 -44927 -50872 -46567 -23106 -50042 -84210 -50142 -72877 -70143 -31600 -29579 -1145
11666 -1145 22294 4470 -17960 678 22630 71924 79091 19747 -2338 -13791 -44563 -24837
11654b4837J3816Q478O506l4334J5657P763Q790J8736J940k9675l0027K6386J7396
11641F595j4039j9303j7917K9304L7964m694J0632j4313p795j6051J1446j5555
11629a3726M998N738J280l3102J1213P2386R9623J9564j28565n0999k9947L1547
11617i990J7993J6986k27k4902j0700k3252K5384k9146j5337P074N7005K4324
11605C5212k0704k9968j9681k1329l4174j1365N0052M0726J7159l6512J3761k3204
11593d0027L857N4599k3158l7934L601O6691k3588k8724m1324l662M0972L6125
11581G428k4933j4601j8263m6109L965O5747L1575Q500J2886L1216m804l1474
11569B1133m3231o183j5303P627J0240k8207J0443K575j2277J7411J707J8387
$$ plain form
11654 -24837 -11021 -2543 3963 -30371 -14714 -6951 1839 20575 22515 -7160 -37187 -10801 6595
11641 6595 -7444 -26747 -44664 -15360 22604 17910 28542 14229 6434 -9617 1829 -13726
11629 -13726 -8728 -2990 -1710 -34812 -23599 48787 148410 167974 39409 -11590 -41537 -9990
11617 -9990 8003 24989 24762 -140 -10840 -34092 -8708 -37854 -53191 -46117 10888 35212
11605 35212 14508 -15460 -35141 -56470 -90644 -102009 -51957 -11231 5928 -30584 -16823 -40027
11593 -40027 -36170 18429 -4729 -42663 -39062 27629 4041 -24683 -66007 -69669 -28697 7428
11581 7428 -17505 -32106 -50369 -96478 -92513 -26766 4809 13309 26195 57411 52607 21133
11569 21133 -22098 -28281 -43584 -35957 -25717 -53924 -43481 -40906 -53183 -35772 -34065 -15678
11557a5678j4737K7372k806k6180n813M4393K1580j4961J0147k6625j3107L7907
11545B1492l7094j7101J9235J0501L5690r839K749p556k2541n0439L1103O478
11533a7322P342o972J4505J8190k5311P352M2865r822j2935m4630k0075l929n809
11520e6551M5212J1473P688J7722j3139O945J0062J7271j2508o986l7415k9178
11508c9404L9866j2243J3528q061j5549l4274J7934J3745n805j0067J3149M5318
11496A8137k3744j5431J1972j5039k5082n027j4904J7320L2369K7141M372k8823
11484a6739l8100j3235L2967k2032n944p743k1178N1250M9046N0124m3385K246
11472A7277P808n147j3749l4102l7667M8313O5075k0903l6696n729o799j6849
$$ plain form
11557 -15678 -30415 -3043 -5849 -32029 -37842 6551 28131 13170 23317 -3308 -16415 21492
11545 21492 -15602 -32703 -13468 -2967 32723 22884 25633 18077 -4464 -54903 -23800 -17322
11533 -17322 -9980 -16952 -2447 15743 -9568 -2216 40649 30827 17892 -26738 -46813 -50742 -56551
11520 -56551 -11339 134 7822 25544 12405 19350 29412 46683 34175 27189 -10226 -39404
11508 -39404 462 -11781 1747 -6314 -21863 -56137 -38203 -24458 -30263 -40330 -27181 18137
11496 18137 -5607 -21038 -9066 -24105 -49187 -54214 -69118 -51798 -19429 7712 12084 -16739
11484 -16739 -54839 -68074 -35107 -57139 -63083 -70826 -92004 -40754 8292 58416 15031 17277
11472 17277 25085 19938 6189 -27913 -65580 -17267 47808 26905 -9791 -15520 -22319 -39168
11460c9168R054K3675l4958j1705j7125l1983o02l620Q791N2908L5352j523j1737
11447b2641k7852M4125M040k899P719l9165o316K9015M7378J4384m5018j6955
11435a4185o137j2333j3931j477j0949o097j85K6602R470l6385J9639Q426m562
11422d2104R384J7679n155q111j4759j5766n366O958O3854L2130l0018l5914L2578
11409E390N1520k4258l0477L8396K462L7187N0270K280m8161n5838m9104J530
11397a8803M7309o911k3815K2804K2422k6498j9738j3051k8398j8500j0659K2656
11385e1182L0376J9653l2263M3150K7401l3673o7767l8158L4528J7894j7734p588
11373g5363l5494l2812P3567N6600N3921K5231M205j77m6695j4107j1648L4980
$$ plain form
11460 -39168 -30114 -6439 -41397 -53102 -70227 -102210 -102812 -106432 -97641 -44733 -9381 -10904 -22641
11447 -22641 -50493 -6368 -2328 -5227 2492 -36673 -42989 -13974 33404 47788 2770 -14185
11435 -14185 -20322 -32655 -46586 -48063 -59012 -65109 -65294 -38692 -29222 -65607 -45968 -37542 -42104
11422 -42104 -32720 -15041 -20196 -28307 -43066 -58832 -64198 -57240 6614 38744 8726 -27188 5390
11409 5390 56910 32652 2175 40571 43033 80220 130490 132770 84609 28771 -20333 -18803
11397 -18803 28506 21595 -2220 20584 43006 16508 -3230 -16281 -44679 -63179 -73838 -51182
11385 -51182 -20806 -1153 -33416 9734 37135 3462 -64305 -102463 -67935 -50041 -67775 -75363
11373 -75363 -110857 -143669 -70102 -13502 40419 65650 69855 69678 22983 8876 -2772 32208
11361C2208j4774J0410j4364k6304q591L0141J8799o701N8263l4751n5505K4481
11349A3312j1672j4576k501j0526k4193o667k0083J4409j7957M8362N3352k2003
11337g43J0698n900k6178k8569k330J6337l2403l2050K4887J5518J434J5261j9814
11324f3852k1205J7288K3908N912J1203K1419K1560m5947k5841Q837j2107J5045
11312d3780K955L1034K1151n461k5158J2945k8739l4952K2057R777J6336J6419
11300e416L805K1994o316j4878q229j5303K2600k0507n3452K2998K5255M1055
11288A3606L7612M4509K7143N2263Q9473N6106r1242r6820n3591k4333k2444L1385
11276F3667k2569o3844m9004p343K5797r519o023J1358q111q679P114Q500n138
$$ plain form
11361 32208 17434 27844 13480 -12824 -21415 8726 27525 20824 79087 44336 -11169 13312
11349 13312 1640 -12936 -15437 -25963 -50156 -56823 -76906 -62497 -80454 -32092 21260 -743
11337 -743 9955 4055 -22123 -50692 -53022 -36685 -69088 -101138 -76251 -60733 -59299 -44038 -63852
11324 -63852 -85057 -67769 -43861 -37949 -26746 -5327 16233 -29714 -55555 -46718 -58825 -43780
11312 -43780 -40825 -9791 11360 5899 -19259 -6314 -35053 -70005 -47948 -38171 -21835 -5416
11300 -5416 -1611 20383 14067 -811 -9040 -24343 -1743 -22250 -75702 -52704 -27449 13606
11288 13606 51218 95727 122870 175133 264606 320712 229470 132650 79059 54726 32282 63667
11276 63667 41098 -22746 -71750 -79093 -53296 -62815 -68838 -57480 -65591 -74270 -67156 -58656 -63794
11263f3794r151j7630L0116N0808L2490m0119k0455o09n381k2503p1093L5887
11251a01434O7119K4434k1041m756K91Q096J2037N139J6353n604l5975M395J6587
11238a4359L945n679j196j4510l9600J5680J9356k2802j3983N5579J0314j9422
11226b6677j0228J2089K6469l0094r667j6960K8103O5955J0702Q092n670k4387
11214B7727j8159K1099K743p802L886k4915J8135J8641M1826p048l4618p3242
11202c1727K6729J3080q514r183o4052Q824N4618N379k0383R176K089m780Q562
11189a0182j8236J2622K7514k3868L639N428M2120o768k1695j7249l9455J8180
11177b7950M8402K8259r386L3696N4785N7598N4530k0082j0694L8264J3748k4885
$$ plain form
11263 -63794 -72945 -90575 -60459 -9651 22839 -17280 -37735 -38344 -43725 -66228 -137321 -101434
11251 -101434 -34315 -9881 -30922 -35678 -35387 -27291 -15254 -10115 6238 634 -35341 -30946 -14359
11238 -14359 -10414 -16093 -17289 -31799 -71399 -55719 -36363 -59165 -73148 -17569 -7255 -26677
11226 -26677 -36905 -24816 1653 -28441 -38108 -55068 -26965 38990 49692 57784 52114 27727
11214 27727 9568 30667 33410 25608 29494 4579 22714 41355 83181 76133 41515 -31727
11202 -31727 -4998 8082 -432 -9615 -73667 -64843 -10225 -4846 -25229 -16053 -13964 -18744 -10182
11189 -10182 -28418 -15796 11718 -12150 -8511 -3083 39037 32269 10574 -6675 -46130 -27950
11177 -27950 20452 48711 39325 73021 127806 185404 239934 219852 209158 247422 261170 236285
11165B36285o5450o0203n6949n7110P3M4075p301k3836j9084k812J846J4727L4835
11152C9096k1094j1570n403j0819k236K5093m2873r241Q564J9408L5424J2572
11140C6921M838J3741J0637L875m5192J0650k028n8815k3420K3874p624K3622
11128h921K1785o408Q020m0851j203K5145J054l9842K5460R241J5474k92j8312
11115i650r103j2692L2728o635l2627J2467M7209R923J2519J928j9434j791k9574
11102d732l3617K9834k1439Q884K8890k1318j3245N738J9226o475j5677J8543
11090e388K5328l1785j6847L7471k6645k2352j3762K6086J6384J3603K5453P739
11078C5285j8082J243j0070q555k4702k2276Q074j0279J983K0903K685m4755M8139
$$ plain form
11165 236285 170835 110632 53683 -3427 -3354 40721 33420 9584 -9500 -12312 -10466 4261 39096
11152 39096 18002 6432 1029 -9790 -12026 13067 -29806 -39047 -30483 -11075 24349 36921
11140 36921 41759 55500 66137 70012 24820 35470 33442 -25373 -48793 -24919 -32543 -8921
11128 -8921 12864 6456 14476 -26375 -27578 -2433 -1379 -41221 -15761 -6520 8954 8662 -9650
11115 -9650 -18753 -31445 1283 -5352 -37979 -25512 21697 31620 44139 46067 26633 24842 -4732
11102 -4732 -38349 -8515 -29954 -21070 7820 -13498 -26743 -21005 -1779 -8254 -23931 -5388
11090 -5388 19940 -11845 -28692 8779 -17866 -40218 -53980 -27894 -11510 2093 27546 35285
11078 35285 17203 18446 8376 -179 -24881 -47157 -39083 -49362 -47379 -26476 -23791 -68546 -20407
11065b0407L6413K8084m806k4141m548J085m3913J8768J0945k483J642k1705k2606
11052d7672J1657K4152M6350K2475m6000j2776L975K5308P801J2467J4333l8923
11040B3147l553k5787l1167J4361J5733M5680M7084n8773m4379j8987m0874K2044
11028e5471J4166M2273n373l2786l0348J9908K0944R172j4217j2184k6830J6629
11016e4117M4720k0669j3664J5751k7420Q469N8485m72j3795n0542K2051L395
11004b7808k212J6157K938j0565J4738K9992L236K5644m1344k5151l6185J2215
10992c8345O758M6594j436k0167l7129P228M2205k222K9698k3817k0680j7555
10980b8868J6477j3254l054j3235l1231J7275r280k5847M094O5526O672R692J9011
$$ plain form
11065 -20407 16006 44090 39284 15143 10595 11680 -32233 -13465 -2520 -5003 -3361 -25066 -47672
11052 -47672 -36015 -11863 34487 56962 10962 -1814 2161 27469 35270 47737 62070 23147
11040 23147 19594 -6193 -37360 -22999 -7266 38414 85498 26725 -17654 -36641 -77515 -55471
11028 -55471 -41305 968 -4405 -37191 -67539 -47631 -26687 -17515 -31732 -43916 -70746 -54117
11016 -54117 -9397 -30066 -43730 -27979 -55399 -46930 11555 11083 -2712 -53254 -31203 -27808
11004 -27808 -30020 -13863 -10925 -21490 -6752 23240 26476 52120 10776 -14375 -50560 -38345
10992 -38345 -31587 15007 13571 -6596 -43725 -36497 5708 3486 33184 9367 -11313 -28868
10980 -28868 -12391 -25645 -28699 -41934 -73165 -55890 -65170 -91017 -86923 -21397 -14725 -5033 13978
10967A3978p543m4153M099K0984j8105n779J3310o2942l986J7313L6195j2434
10955d9063j7812l592p762L8081M4741n350J6103K7106k1704n0852l7210L1439
10943c5875K3692J4052p451L185M620L823k046k5214n346J0180K6372Q144K772
10930B0908k3997K8527j5317j6048l0687k8765k8324J9683k2238m899J7233N0969
10918c2955K1463J0439N688k4042q446k7991L191N364K0465M7822L1354k9199
10906B3153k8643l0659o68k4461N5647R547k2659k345L6856L0722l0322J0737
10894B6905k4137p166L9054K1624q288o7869k2123J6143M3867J3543J4195j8985
10882B6763J5993k005m822N480m1490J2794j1140j571j5415N718K7232J4433m26
$$ plain form
10967 13978 6435 -37718 -33619 -12635 -30740 -36519 -23209 -86151 -90137 -72824 -36629 -49063
10955 -49063 -66875 -70467 -78229 -40148 4593 -757 15346 42452 20748 -30104 -67314 -35875
10943 -35875 -12183 1869 -5582 -2397 2223 6046 4000 -21214 -26560 -16380 9992 18136 20908
10930 20908 -3089 25438 10121 -5927 -36614 -65379 -93703 -74020 -96258 -101157 -83924 -32955
10918 -32955 -11492 -1053 4635 -19407 -27853 -55844 -52653 -47289 -26824 20998 52352 23153
10906 23153 -5490 -36149 -36817 -61278 -5631 3916 -18743 -21088 15768 46490 16168 26905
10894 26905 2768 -4398 34656 56280 47992 -19877 -42000 -25857 18010 31553 45748 26763
10882 26763 42756 40751 35929 41409 -81 12713 1573 2 -15413 -9695 17537 31970 31544
10869C1544j4490n59J2540q127j8365k2995K6829j192J4791m5401J5075k3376
10857c3726J5343M1560K1299K724m6603n8473L764L3357K8849J4487L9158l3240
10845B8499r334L863j8919r341o991k2180l8366O048K3093O2718o071j2894J076
10832A201l6826n0332M0678J7606l28k3514o022l2554j4630J2396P5026P211P082
10819c006k6695O219J3097k6033k4688J1043J6690O0860J7332o4058p0802O154
10807h3887K5484N4196l620j7589K3142K2081m0792J6044o665K345M0136n321
10795B5554m5256p7053J5393N2620j9485N2328j5685k5867k2603J519L3218P936
10783a7381L493K7472O004l6126j5225J696L1064J7291R08j765j1546J382j7234
$$ plain form
10869 31544 17054 16495 29035 20908 2543 -20452 6377 5185 19976 -25425 -10350 -33726
10857 -33726 -18383 23177 44476 47200 597 -57876 -54112 -20755 8094 22581 61739 28499
10845 28499 19165 23028 4109 -5232 -12223 -34403 -72769 -66721 -43628 19090 13019 125 1201
10832 1201 -35625 -85957 -45279 -27673 -28001 -51515 -57537 -90091 -104721 -92325 -17299 -10088 -3006
10819 -3006 -29701 -23482 -10385 -36418 -61106 -50063 -33373 27487 44819 -19239 -90041 -83887
10807 -83887 -58403 -4207 -7827 -25416 -2274 19807 -20985 -4941 -11606 -9261 30875 25554
10795 25554 -19702 -96755 -81362 -28742 -48227 4101 -11584 -37451 -60054 -58535 -25317 -17381
10783 -17381 -13888 13584 19588 -16538 -31763 -30067 997 18288 19196 17431 5885 7267 -9967
10770i967l490J5799k8908m1316J843L6339k6615M0829L2813j4189l499K2040
10758B1679p811k7801j5916r844K3412k098l3248j3391M8521J7621L482k2406
10746a7800J0800o490J7152L8859J6826j0310J4281R456K708K265l5798o5934
10734b3985l2877L9831L5999j1837m4437L298M3037J9733o299J2105J1923R062
10722E5553Q002l7406k3864q265j767l2345m443L378J0013K6720P958k1886l394
10709b1746r225l137K032M6242K0626o5122n7971J9254K7204J1480j1950K5144
10697a7169R222j1128J2105N3864m907m8278l5752j527M9284j1845m7785j731
10685e5647M7972l4283k3861K921R429K9284J6447j3718m617k53J9660R46J8418
$$ plain form
10770 -9967 -13457 2342 -26566 -67882 -66039 -29700 -56315 -15486 17327 3138 -361 21679
10758 21679 13868 -13933 -29849 -39693 -16281 -18379 -51627 -65018 -16497 1124 4606 -17800
10746 -17800 -7000 -13490 3662 42521 59347 49037 63318 72774 75482 77747 41949 -23985
10734 -23985 -56862 -17031 18968 7131 -37306 -34008 9029 28762 22463 34568 46491 55553
10722 55553 63555 26149 2285 -5980 -7747 -40092 -44535 -41157 -31144 -4424 3534 -18352 -21746
10709 -21746 -30971 -34108 -32076 14166 34792 -30330 -88301 -69047 -41843 -30363 -42313 -17169
10697 -17169 -7947 -19075 -6970 46894 41987 -6291 -42043 -43570 5714 -6131 -53916 -55647
10685 -55647 -7675 -41958 -65819 -62898 -53469 -24185 -7738 -21456 -26073 -26326 -6666 -5720 12698
10672A2698L6074k525N709k0510k5706k9514M327Q957j3536M131J0814j9751l5310
10659f4142K3573O9724K0168k7336o100m2757J7056j9077J178K2124L3148J1913
10647C9472O77R395l6035n5831k2514j0932J3862j2328l058L2342p808M2902j1893
10634b1749k2969m377L3265L7150J0326n4028N48R990q004j0037k6035m8535k843
10621a07298L4503P7685j6504J4747J1776k1901K2971l949m3714J1142J4411N7076
10609E0945j3555m8095k6672L9618K9848J1765K530n4804n6756m9550L7486K4133
10597e3107K8830J8060l9576j5460l988K4637L2792k2613l307Q844K1703J3322
10585A0137J4326j3194l2535k8631j325J7489K3397J5289o208L263j0445p3553
$$ plain form
10672 12698 48772 46247 51956 31446 5740 -23774 -19447 -10490 -24026 -19895 -9081 -28832 -64142
10659 -64142 -40569 29155 49323 21987 15887 -26870 -9814 -28891 -27713 -5589 27559 39472
10647 39472 40149 49544 13509 -42322 -64836 -75768 -61906 -74234 -77292 -44950 -52758 -9856 -21749
10634 -21749 -44718 -49095 -15830 21320 31646 -22382 -21834 -11844 -19848 -29885 -55920 -104455 -107298
10621 -107298 -72795 4890 -11614 3133 14909 -6992 15979 12030 -31684 -20542 -6131 50945
10609 50945 37390 -10705 -37377 2241 32089 43854 46384 -8420 -65176 -114726 -77240 -53107
10597 -53107 -24277 -6217 -45793 -61253 -65241 -40604 -7812 -30425 -33732 -24888 -3185 10137
10585 10137 24463 11269 -21266 -49897 -51222 -33733 -10336 4953 -1255 2008 -8437 -81990
10573h1990k6292k9007J1635L6981L8653J9131K3763j992R249K0331K9185L4189
10561H3836j5985k0359j082o900m5750O9199M2520q729m6151Q709l2189j4632
10549A2487m634N65l5214j8283K985k784K0684OK6072n37K7742l3599o910M4057
10535C2637O8388n726r058L546n4996l8798N1654m794J960l149k3208k4240j7692
10522b3476Q422N609k0251k9220q473k0146l113K2760R981L5880M4761L0196l8273
10509A4657j966J6480n3119k5042N1025R195l7078O482M846j6260j2012K9596
10497a3196J8121k014O420j5406j0553O273O060P395l5895P803K2097J6328L6212
10484D9645j685k1832m8377n551K3977M8500j0331n1091J6649L4459k1373j3571
$$ plain form
10573 -81990 -108282 -137289 -125654 -88673 -50020 -30889 -7126 -9118 131 20462 49647 83836
10561 83836 67851 47492 46410 39510 -6240 62959 105479 96750 50599 59308 27119 12487
10549 12487 7853 8418 -26796 -45079 -42094 -44878 -24194 -24188 1884 1347 29089 -4510 -11420 32637
10535 32637 101025 95299 86241 89787 34791 -4007 47647 42853 44813 41664 18456 -5784 -23476
10522 -23476 -15054 -9445 -29696 -58916 -67389 -87535 -90648 -67888 -57907 -22027 22734 52930 14657
10509 14657 12691 29171 -23948 -48990 2035 11230 -25848 -19366 -14520 -30780 -42792 -13196
10497 -13196 4925 2911 9331 -6075 -16628 -10355 -4295 3100 -32795 -24992 -2895 13433 49645
10484 49645 47960 26128 -22249 -27800 -3823 44677 34346 -16745 -96 34363 12990 -581
10472e81R210Q467j8810P227n53k6362K6073N938j7882M003J967K7564l7032k6238
10458c7009k1526J1957K9617L5708R873O990L2761k5457l0909j6565M4603K0676
10446F0719N38m2513j8350k893l9960l6655M2505j5175j0912K2086K8488K1276
10434I154J6552k3121m5257k1845k267R700L2888J6282j2812J8147M3042K2828
10422F3291j1611k7695k3406k9632M11J8015L2832l46j0567J0003R540M5142K268
10409G8245j0109m1086m9978J0382R481j7962l1345K6198K8990j9457J2728j2123
10397a6036M179j6072j8703M1530K8037J4613L3186j3000l4274k5025j5203j5471
10385c2239m1613k4204J8833K4658K1278K7528M725j7999l3219J1494K2581J6218
$$ plain form
10472 -581 8629 17096 -1714 5513 4960 -21402 4671 10609 -7273 -3270 -1303 26261 -10771 -37009
10458 -37009 -58535 -46578 -16961 18747 28620 35610 68371 42914 12005 -4560 40043 60719
10446 60719 61257 18744 394 -2499 -42459 -79114 -36609 -51784 -62696 -40610 -12122 9154
10434 9154 25706 2585 -42672 -64517 -66784 -57084 -24196 -7914 -20726 -2579 40463 63291
10422 63291 51680 23985 579 -29053 -28642 -10627 22205 21859 11292 21295 30835 75977 78245
10409 78245 68136 27050 -22928 -12546 -3065 -21027 -52372 -26174 2816 -16641 -3913 -16036
10397 -16036 -11857 -27929 -46632 -5102 22935 37548 70734 57734 23460 -1565 -16768 -32239
10385 -32239 -73852 -98056 -79223 -54565 -33287 -5759 -1034 -19033 -52252 -40758 -18177 -1959
10373a959M0781M585l924J3152m2832k6059j3591L5064J4189K9825n1994J0857
10361H094K984l8303p112M7365P562J9635J9322j2984n733m2279L4080q326L785
10348B8090l3167n2550j576P5129j1883j0179l1129J7333L9771L141L0931j5949
10336C7962J6763K3200m416l7707k0312k6436k0620K5612J8133L1663J4253K3511
10324H1606r862k8611l3571J3832J1297m3291P167L9938k7082J0631m348l5505
10312a7799K0936M3311J8305j3854n24K8528l4027l9137j0536K7845J239K3658
10300D7945j586k0128k1826j4054K7189J2994L0074L1049m4150k3401m2466j0929
10288b9289Q152k6261K1882K1946J4500K7629l4352n1230M353R323K8997J746
$$ plain form
10373 -1959 38822 43407 39483 52635 9803 -16256 -29847 5217 19406 49231 -2763 8094
10361 8094 11078 -27225 -34337 13028 20590 40225 59547 46563 40830 -1449 32631 24305 28090
10348 28090 -5077 -57627 -59203 15926 4043 -6136 -37265 -19932 19839 22980 53911 37962
10336 37962 54725 77925 73509 35802 15490 -10946 -31566 -5954 12179 43842 58095 81606
10324 81606 71744 43133 9562 23394 34691 -8600 -1433 38505 11423 22054 17706 -17799
10312 -17799 3137 46448 64753 50899 50375 78903 44876 5739 -4797 23048 24287 47945
10300 47945 46359 26231 4405 -9649 17540 30534 60608 91657 47507 24106 -18360 -29289
10288 -29289 -21137 -47398 -25516 -3570 10930 38559 4207 -47023 -42670 -33347 -4350 -2604
10276b604L592K3874l8102l2399K5669J3574j6026j2100Q032Q561M224P588J2051
10263E934K971J1240J4615k1575m7846J5288L4158L7430l3478n8169J3703j3053
10251c8782L962J3690N053k1761k7327l3515j5378k7411J4471P863k575q276M4085
10238h5901M2503J7744J1753m443J4331k435j0843m938N632R24k0838q851M9666
10225D304K8865J0246M644O757M1381K2604l2331o4582p919r664J3469k0442J2526
10212I858M3129j8640k3057j7694n6076J4305M2561Q502j4998J4009K1034k2177
10200G56L392L739m0215J6103p387J727J8909J1810o083l6773J4121P112K6495
10187A3706l538L882Q005R879l0882l4948j446J6211K697O792j879j8942M6999
$$ plain form
10276 -2604 988 24862 -13240 -45639 -19970 -6396 -22422 -34522 -26490 -17929 -13705 -6117 5934
10263 5934 8905 20145 34760 13185 -34661 -19373 14785 52215 18737 -39432 -25729 -38782
10251 -38782 -34820 -21130 -16077 -37838 -65165 -98680 -114058 -141469 -126998 -119135 -121710 -129986 -85901
10238 -85901 -43398 -25654 -13901 -18344 -4013 -6448 -17291 -22229 -16597 -15673 -36511 -45362 4304
10225 4304 33169 43415 48059 54816 96197 118801 86470 21888 13969 4305 17774 -2668 9858
10212 9858 52987 34347 11290 -6404 -62480 -48175 -5614 2888 -12110 1899 22933 756
10200 756 4148 7887 -32328 -16225 -23612 -21885 -2976 8834 2751 -34022 -19901 -12789 13706
10187 13706 10168 14050 22055 31934 1052 -33896 -35342 -19131 -16434 -9642 -11521 -30463 16536
10174A6536j4936j6772j5343L2771j7059j4331l0517k937M0382M7226K2037k2017
10162B5040n4920N794J2180j3167n649r272j9373K9306k5222o749J2188J1684
10150c8160J8719L209K75k2709K3431L1170L4282M4454j4945k5792j2821k4955
10138A6158N458K746k0959L3065k9122r392j3352q10j7574j4454p420J9448K4785
10125a1423j2195k2110n376K4739L3412P498M22m3876j7046m401o130J7416L594
10112c5476J5656J1706k1746J8211Q825J9763j7618o966l5297j5254j2725J1168
10100e9753J7096j8287J0965k998Q492k7625l5057P1314M6725J6197k0420m459
10088B190L602J2705R172k4999J0815J8109J7401K4908l1232q205J3307m666n500
$$ plain form
10174 16536 1600 -15172 -30515 2256 -14803 -29134 -59651 -62588 -22206 25020 47057 25040
10162 25040 -29880 -24086 -11906 -25073 -30722 -39994 -59367 -30061 -55283 -62032 -49844 -38160
10150 -38160 -19441 -16232 -15957 -38666 -15235 15935 50217 94671 79726 53934 41113 16158
10138 16158 21616 24362 3403 36468 7346 -2046 -15398 -16208 -33782 -48236 -55656 -36208 -11423
10125 -11423 -23618 -45728 -51104 -26365 7047 14545 14967 -28909 -45955 -50356 -56486 -39070 -35476
10112 -35476 -19820 -8114 -29860 -11649 -2824 16939 -679 -7645 -42942 -58196 -70921 -59753
10100 -59753 -42657 -60944 -49979 -52977 -44485 -72110 -107167 -35853 10872 27069 6649 2190
10088 2190 5792 18497 27669 2670 13485 31594 48995 73903 42671 34466 47773 43107 37607
10075C7607k2570j4104j4437J209K5891J7672J7382j3977m7591j533j3024j0199
10063c7674L2094R533K2702O885Q180J5381n9691j2437J5487L9696J2342n0682
10051A816m91m735J2630Q0031J39802J60929K00872L27660L24889q1359k03364
10040I58680l09934k73728j75680o9971m2085j0969k004Q965k4337l117J4848
10029G0668l7314m159L7790J40k969J547J5514J4298k6872o2548j6015l6599Q559
10016c7960K2679M032J172L6751k2548J3798k8443r979N0011k0519k2012L0959
10004A7941j4411l9302j354J3455J7943J0492j4111J1533J9604J1114m3992M5097
9992C4009J1281J4356l9756r171j6769k9529p278k2475K9919M6763K7575K9864
$$ plain form
10075 37607 15037 933 -13504 -12295 13596 31268 48650 34673 -12918 -14451 -27475 -37674
10063 -37674 -5580 3953 26655 33540 41720 57101 -2590 -15027 460 40156 52498 1816
10051 1816 1325 -3410 9220 89251 229053 389982 590854 918514 1243403 1162044 958680
10040 958680 648746 375018 199338 129367 87282 76313 74309 83274 58937 55820 70668
10029 70668 33354 29195 66985 67125 64156 65703 81217 95515 68643 6095 -9920 -46519 -37960
10016 -37960 -15281 -11249 -10077 26674 4126 17924 -10519 -20498 29513 8994 -13018 17941
10004 17941 3530 -35772 -37126 -23671 -5728 4764 -9347 2186 21790 32904 -11088 34009
9992 34009 45290 59646 19890 10719 -6050 -35579 -42857 -65332 -35413 11350 38925 68789
9980F8789k4858o6985M4626K2535L847l6662K4698L8110K2729m769n6101L057
9968C9016l6374l8257L2864k33k0312Q733J975m40O3348j7873j7214l3679p1565
9955i0011p002N3776L7108J5415K8389m377J539M1409J537m0064l5264k5385o658
9942b9588j9660j1424K8411K2723l78k55l8194J7679N4259K2547l3657l1565K4380
9929E278K4191K4700k0808O926r719O880k7662k2374k0510k4635L3148L5717J6541
9916B7673l047n4927j4380N417K3275J6324O691J5012l4354J6140m229n798K2949
9903A6746P863O294M5101K5412q1324o6004q625k7117l0939J6021q275k6816N7627
9890g4036P4172O6355J4321j5250n2504p9849O798M9341J1505P626L265p803k3605
$$ plain form
9980 68789 43931 -23054 21572 44107 47954 11292 35990 74100 96829 92060 35959 39016
9968 39016 2642 -35615 -2751 -2984 -23296 -14563 -12588 -13028 50320 32447 15233 -18446 -90011
9955 -90011 -97013 -43237 -6129 9286 37675 33298 34837 76246 77783 37719 2455 -22930 -29588
9942 -29588 -49248 -60672 -32261 -9538 -9916 -10171 -48365 -30686 23573 46120 12463 -19102 5278
9929 5278 29469 54169 33361 40287 30568 37448 9786 -12588 -33098 -57733 -24585 11132 27673
9916 27673 24626 -30301 -44681 -39264 -15989 335 7026 22038 -12316 3824 -405 -6203 16746
9903 16746 24609 30903 76004 101416 20092 -45912 -54537 -81654 -112593 -96572 -104847 -131663 -74036
9890 -74036 136 66491 80812 65562 13058 -66791 -59993 -10652 853 8479 11744 3941 -19664
9877a9664k5539j0133N910L0737L2131m629l4254j1411Q077J5190L426L2106n354
9864A6593m4947l702K7911J4965N2451L2048k3629m0669j0685k271K1929O959
9852D6953q087M6303K7321m6837k3750Q934M5729o83q549L9461Q1949J35895K48575
9839E93214K60494j2230j35165j59272j84894j43157q7898o0737m407m420j3527
9828D8001J553N837j6479j5752J4440L1070k89j775k958K2781L290m773j0749
9815G4197o3477o169M4450l501j8312j6377l5931K003m76L7318J8733j1945R601
9802C0114L2621M607n021l9287j286l787R966Q236K0416m3037k1949L508l319
9789h218j7386O929O210p831L4589J7267l375n4891n568K7689r727M8030N2446
$$ plain form
9877 -19664 -45203 -55336 -49426 -18689 13442 8813 -25441 -36852 -28775 -13585 -10159 21947 16593
9864 16593 -28354 -32056 -4145 10820 63271 95319 71690 31021 20336 18065 39994 46953
9852 46953 38866 85169 112490 65653 41903 50837 96566 95883 87334 126795 208744 344639 593214
9839 593214 853708 841478 706313 547041 362147 218990 131092 70355 65948 61528 48001
9828 48001 49554 55391 38912 23160 37600 68670 68381 66606 63648 86429 89719 84946 74197
9815 74197 10720 4551 49001 45500 27188 10811 -25120 -23117 -23593 13725 32458 20513 30114
9802 30114 62735 67342 62321 23034 21748 17961 27927 36163 56579 13542 -8407 -4899 -8218
9789 -8218 -25604 -18675 -12465 -20296 14293 31560 28185 -26706 -32274 -4585 -14312 33718 86164
9776H6164m8165k0101j2479K8388J4373K388j7406l4776l5604q332L2076q088
9764b1562L5229o25q790J390r68j9728Q272J8453p942j5120j5711K8753J1072
9751A2723K123J1389j1331q679j9880r721J1778L0769J6100M2822l464j1734l3175
9738B9720l6630k2797l971N062l226m555J889O3793L8977m869k6959j7551J345
9725B0228K7345J6175p140k8888k0642j161K685k471m749K1308N8863j3982R703
9712G7274j0800j4773m418K1825L2785n8170n4680j9686P703o0j954j4907K9296
9699a0565M3770k5751j1300R990k3077n5173k1677K914J6632M0885K6872J595
9687d885q648R066n713j7936K2198J792K4054P893m4488l0383O783J1020R17K8273
$$ plain form
9776 86164 37999 17898 5419 33807 48180 50568 33162 -1614 -37218 -45550 -13474 -21562
9764 -21562 13667 13042 4252 5642 4674 -15054 -6782 11671 3729 -11391 -27102 1651 12723
9751 12723 14846 26235 14904 6225 -13655 -23376 -11598 19171 35271 78093 74629 62895 29720
9738 29720 -6910 -29707 -33678 -28616 -31842 -36397 -34508 29285 68262 63393 36434 18883 20228
9725 20228 47573 63748 56608 27720 7078 5917 8602 6131 1382 22690 81553 67571 77274
9712 77274 66474 51701 47283 69108 101893 43723 -10957 -30643 -22940 -23000 -24954 -39861 -10565
9699 -10565 33205 7454 -3846 6144 -16933 -72106 -93783 -90869 -74237 -33352 -6480 -4885
9687 -4885 -13533 -4467 -10180 -28116 -5918 -4126 19928 27821 -16667 -47050 -40267 -29247 -28330 -57
9673e7M2733l0419k2461L4439O2597J799L556M0055l5901l5037m5765j5815M597
9660D321L3073M936l717m3150j422J1536J7926J2976L6952Q671k3848r743O460
9647E4971j6161n3994k2680L9416K2531q729j5947j6799J7010J1538J0072j1789
9635I439k5653j6724j2298L2137j09j137j3735R908O158L8376R966j8362m0308
9622b2342l2598M4424M5810q82j8418l1139L2102K7670M792L0454j2926l6460
9610C0487j0395k8060P708J4251p275r03J2985j313l906J9974m7844p0726K6504
9597e8513N0174M5152j6661j5104J709p855J617k2415k3529L6525k1883k0016
9585e0799K7603K5903L1362k9070j9142l202M615l285P3586r020j3571J6299L1598
$$ plain form
9673 -57 42676 12257 -10204 24235 86832 88631 92187 132242 96341 61304 15539 -276 4321
9660 4321 37394 42330 38613 -4537 -5959 5577 23503 36479 73431 82102 58254 48511 54971
9647 54971 38810 -15184 -37864 1552 24083 15354 -593 -17392 -382 11156 21228 9439
9635 9439 -16214 -32938 -45236 -13099 -13208 -14345 -28080 -18172 -12014 26362 36328 17966 -22342
9622 -22342 -54940 -10516 35294 34412 15994 -15145 16957 44627 49419 79873 66947 30487
9610 30487 20092 -7968 -260 13991 6716 5813 18798 17485 13579 33553 -14291 -85017 -58513
9597 -58513 -8339 36813 20152 5048 6757 -1098 519 -21896 -45425 -8900 -30783 -50799
9585 -50799 -23196 2707 34069 4999 -14143 -17345 -12730 -16015 57571 48551 34980 51279 82877
9572H2877j6769n1231j4951N239R953Q059J0866o187q813L8610K8672J2619L0337
9559A29281K7443k5523m2916n431k4719n0186j2606K8113K956j7098L006j4136
9547a816j5765M8680M1226O277q330q602J5061k2071j9183J0636k3585k8876j2037
9534a8385K1651L609J0584P589M9139j1638P131k3649j9789J0846K5772K4496
9522H7356r245m8012l8835J377p596M254J8958L2331M157J6810M8757m0838j0845
9509E8629m4761j5339R059N2827J2733R218J661k2537k3921k3434N741J3592l3715
9496b47n50l936m378m50J8560L0486l671J7108m5089j154k371Q82J3185K8894
9482D7269K8904Q12l8513j3160L1308m5918L872N6020Q254m0626k7108K1075L0993
$$ plain form
9572 82877 66108 14877 -74 5165 15118 23177 34043 27856 19043 57653 86325 98944 129281
9559 129281 156724 131201 88285 82854 58135 7949 -4657 23456 26412 9314 12320 -1816
9547 -1816 -17581 31099 72325 78602 70272 61670 76731 54660 35477 46113 22528 -6348 -18385
9534 -18385 3266 6875 17459 25048 74187 62549 69680 46031 26242 37088 62860 87356
9522 87356 78111 30099 -8736 -7359 -14955 -10701 8257 40588 44745 61555 110312 69474 58629
9509 58629 13868 -1471 7588 60415 73148 82366 84027 61490 37569 14135 19876 33468 -247
9496 -247 -797 -4733 -9111 -9561 8999 39485 35814 52922 7833 6679 4308 5190 18375 47269
9482 47269 76173 76985 38472 25312 56620 10702 14574 70594 78848 38222 11114 32189 63182
9469F3182L3371M8307J2378n0842q6593l9924K4916k3708l694M471L8903M1785
9457F2552L9716j3599q849m7422l2362j1974J2119r123J7696K0463J2014k2168
9445A9063K2167J7749L6829m0043J4533k2858J2688N624j1141L673m392j9470
9433C4422J2831K3880K3126o633Q916j2673P535n094Q364l9226N721K6376J4020
9420A01565m5296l3290k7363L2700K4661l467k617p929M3092K5251j0084j1170
9408H6053j5903L1076L232j065J3890j5847q28L5346K0141j3399L64j9475k506
9395A21079k4036j0503m9417l8850L8594M1847M65K8438J6023j629J4862L4313
9383A71186j859n3066M858j1454q823l570K8048o2525k9971J3513M1423q954j8153
$$ plain form
9469 63182 96553 144860 157238 106396 19803 -20121 4795 -18913 -22607 -18136 20767 62552
9457 62552 102268 88669 79820 32398 36 -11938 181 -8942 8754 29217 41231 19063
9445 19063 41230 58979 95808 55765 70298 47440 60128 65752 54611 58284 53892 34422
9433 34422 47253 71133 94259 87626 96542 83869 91404 86310 94674 55448 61169 87545 101565
9420 101565 56269 22979 -4384 28316 52977 49510 46893 38964 82056 107307 97223 86053
9408 86053 70150 101226 104458 103393 117283 101436 100608 135954 156095 142696 143060 123585 121079
9395 121079 97043 86540 37123 -1727 36867 78714 79179 107617 123640 122011 136873 171186
9383 171186 169327 116261 121119 109665 100842 97272 125320 62795 32824 46337 87760 78806 60653
9370F0653o765J8550O5671l4625j2276J2280J4697M0185Q445j7627k7395l7764
9358H4029q275L4078M6158r346j2691J5546j9021k6725j0918L2329K1782j6917
9346A30029j9265k0402L0808J0594J2291J3623J8068R05k3019J0897J785R05J804
9333A69023j0770m3178m414M9535k0365j9516J353N6173K3524N756L8322l4438
9321B11005j8329N1742J9939j5306J4010k6873m470p689l59P628J4999K8706N3028
9308C28031n3722l3942j9090J1338o107L087M152O5044M0524l5205j7739m4018
9296B42353j3799J2725j8517L6134L3873Q313J0237k0223k2619m1410J2786j0370
9284B29483N336K3253o599K236K1411N940L459l817j5503J0094M9310k5654J1843
$$ plain form
9370 60653 53888 72438 138109 103484 91208 103488 118185 158370 166815 149188 121793 84029
9358 84029 75754 109832 155990 146644 133953 149499 130478 103753 92835 125164 146946 130029
9346 130029 110764 90362 121170 131764 144055 157678 175746 176651 153632 164529 166314 167219 169023
9333 169023 158253 115075 110661 160196 139831 120315 121668 177841 201365 207121 245443 211005
9321 211005 192676 244418 264357 249051 263061 236188 231718 224029 223670 231298 246297 275003 328031
9308 328031 274309 240367 221277 232615 226508 229595 233747 298791 339315 304110 286371 242353
9296 242353 228554 241279 222762 258896 292769 301082 311319 291096 268477 227067 239853 229483
9284 229483 234819 258072 251473 253709 275120 281060 284519 280702 265199 275293 324603 298949 310792
9271C10792P562j4548O007l041k8617J9862K1312k5133k185K8693K8895j5497
9259C34102J2865l8300K0645M4086N0397P278k5002j5873j5124k5272m5821K7325
9247C31306M8290J4692J4277q429k158j275n0783J7051L0320J74J2403J9385K4195
9234D49448K7060L5491K806J4201l3775L991m1349j425O0231M052q643J6502j3983
9221E14607n162m3514M8098M4324K373L720J4878K1558J9309J961L5103k1320
9209F35935k878j4437k1010O7075J12217L6714o835l5062k0940q215K1088l4953
9197G28699K3793L8173k1825N1701O1254J9205j6437k3268L8371r687k0024o066
9185H63889K9690N1475N4044K6407j782j3658M487L2719M6908p417J2612N4875
$$ plain form
9271 310792 318354 303806 309813 306772 278155 298017 319329 294196 292011 320704 349599 334102
9259 334102 346967 308667 329312 373398 423795 431073 406071 390198 375074 349802 303981 331306
9247 331306 379596 394288 408565 400136 397978 396703 345920 362971 393291 393465 405868 425253 449448
9234 449448 476508 511999 514805 529006 495231 499222 457873 456448 516679 520731 512088 528590 514607
9221 514607 509445 465931 514029 558353 560726 564446 579324 600882 620191 622152 657255 635935
9209 635935 633057 618620 597610 664685 776902 813616 806781 771719 750779 742564 763652 728699
9197 728699 752492 790665 768840 820541 881795 901000 884563 861295 899666 889979 869955 863889
9185 863889 893579 945054 999098 1025505 1023723 1010065 1014552 1047271 1094179 1086762 1099374 1154249
9173A154249l2614J334K410j4713K4582P0296J8219L020j5787L2094N6278M7674
9161A347042M4268L7559L5846N341M1252N0333J8246J4693K8310Q1130O6657M0005
9149A810682L0010p552L4937P8187J3732r959M0719P5470J13956Q1810R2111R4615
9137B448718Q8056K8389P1253P0348Q5078N1989M0159R4084K9639O3144J24119
9126C194976J24168J27776O4953R8975J35203J07002J26855J33042J63188J57691
9116D433829J45769J61779J82749K04533J99751J93730K38108K05248K28566K37922
9106F431984K73873K65150L00058L65075L25104L90182M09656L60201M21288M98047
9096A0040618N03498N38289N84641O04219O69159P45044Q06655Q43449R13834
$$ plain form
9173 1154249 1121635 1122969 1125379 1110666 1135248 1205544 1223763 1226783 1210996 1243090 1299368 1347042
9161 1347042 1391310 1428869 1464715 1470056 1511308 1561641 1579887 1594580 1622890 1704020 1770677 1810682
9149 1810682 1840692 1833140 1868077 1946264 1959996 1950037 1990756 2066226 2180182 2261992 2354103 2448718
9137 2448718 2536774 2565163 2636416 2706764 2791842 2843831 2883990 2978074 3007713 3070857 3194976
9126 3194976 3319144 3446920 3511873 3610848 3746051 3853053 3979908 4112950 4276138 4433829
9116 4433829 4579598 4741377 4924126 5128659 5328410 5522140 5760248 5965496 6194062 6431984
9106 6431984 6705857 6971007 7271065 7636140 7961244 8351426 8761082 9121283 9542571 10040618
9096 10040618 10544116 11082405 11667046 12271265 12940424 13685468 14492123 15335572 16249406
9087A6249406R40788J012915J174520J251714J364898J459686J625622J797048
9079B6876597J878364K064272K213489K404475K542931K769273K937934L110387
9071D6797722L278127L393744L454893L456191L355267L210472K965449K578552
9063G2490417K053053J450620Q44614J33917n27518j238227j860142k296334k748118
9054F8302282l040251l211235l298354l303061l310046l237688l108109k902080
9046D2891458k706533k615029k439614k233036k038405j870709j749224j654887
9038B5584021j560240j428769j348865j253272j097870j018938r58983r17831
9030A5999253q80870p86616p25878o53420o02332n69339n38838m97490m59148
$$ plain form
9087 16249406 17190194 18203109 19377629 20629343 21994241 23453927 25079549 26876597
9079 26876597 28754961 30819233 33032722 35437197 37980128 40749401 43687335 46797722
9071 46797722 50075849 53469593 56924486 60380677 63735944 66946416 69911865 72490417
9063 72490417 74543470 75994090 76838704 76972621 76445103 75206876 73346734 71050400 68302282
9054 68302282 65262031 62050796 58752442 55449381 52139335 48901647 45793538 42891458
9046 42891458 40184925 37569896 35130282 32897246 30858841 28988132 27238908 25584021
9038 25584021 24023781 22595012 21246147 19992875 18895005 17876067 16917084 15999253
9030 15999253 15118383 14331767 13605889 12952469 12350137 11780798 11241960 10744470 10285322
9021A0285322m14363l84485l27875l12056l47252l70563l44796l10130k94399
9012G179403k64375l11461k71894k04814j70742k11203k08982j81598j93353j73198
9002D987783j49074j43003j23607q4364j19536j42442j10222j12997j56516j27343
8992C718679r7585q9845p6746r6498o6428n9116p7779r4340o9080p4940q5429
8981B830893j04546n1286j13939j00070o0861l2697k9375k2806n3716n4937l6509
8970B170151p5313m7871J2249r368m9856p6851l1944j5558n5956l5688p1423n7215
8958A655357n331j619n0922k920j4512k0567k9409l9493m2500m5882n417j1303
8946A385482J4247k4177m6893k9687K1543n705J2030o559j7732J2513o9632l4336
$$ plain form
9021 10285322 9870959 9486474 9158599 8846543 8499291 8128728 7783932 7473802 7179403
9012 7179403 6915028 6603567 6331673 6126859 5956117 5744914 5535932 5354334 5160981 4987783
9002 4987783 4838709 4695706 4572099 4487735 4368199 4225757 4115535 4002538 3846022 3718679
8992 3718679 3621094 3531249 3454503 3358005 3291577 3232461 3154682 3060342 2991262 2916322 2830893
8981 2830893 2726347 2675061 2561122 2461052 2400191 2367494 2338119 2315313 2261597 2206660 2170151
8970 2170151 2094838 2046967 2059216 2049848 1999992 1923141 1891197 1875639 1819683 1783995 1712572 1655357
8958 1655357 1650026 1648407 1597485 1594565 1580053 1559486 1530077 1490584 1448084 1402202 1396785 1385482
8946 1385482 1399729 1375552 1328659 1298972 1320515 1314810 1326840 1320281 1302549 1315062 1245430 1211094
8934A211094l092k2479l4857k6218j8267k4643J0302J0200o0529j1692L8763m9604
8922A018978m5869L0204j2661L6994m4361m8510k0259k5581r016J0087j8104l2705
8910H39197K4729k115m3537k140J8971l1062j2555K946K1219O07k3116k9322K473
8897G66295j4127l4676p023k8425n6233k3063L0476K298J112k0771K6893j3664
8885F29092r765k7105k759J2428K7864k3934Q409L5548K1663L886k6263l3341
8873F15723L0778L1992k1126n8628k3338K3535l5251m269j8617j439L0329j6084
8861E53605m4560N127L664o1413o105M251l1977j010J7889j2577j990k2264l864
8848C98776o443j7217J0189J6051j1159k3408K6490J4339J989J0467L259J858
$$ plain form
8934 1211094 1208002 1185523 1150666 1124448 1106181 1081538 1091840 1102040 1041511 1029819 1068582 1018978
8922 1018978 973109 1003313 990652 1027646 983285 934775 914516 888935 879919 890006 871902 839197
8910 839197 863926 861811 818274 816134 835105 804043 791488 794434 815653 816260 793144 763822 766295
8897 766295 752168 717492 710469 682044 625811 602748 633224 635522 636634 615863 642756 629092
8885 629092 619327 592222 589463 601891 629755 605821 614230 649778 671441 675327 649064 615723
8873 615723 646501 678493 657367 598739 575401 598936 563685 559416 540799 539360 569689 553605
8861 553605 509045 514172 517836 456423 450318 454569 422592 421582 439471 426894 424904 402640 398776
8848 398776 392333 375116 385305 401356 390197 366789 393279 407618 409607 420074 423333 425191
8836D25191M4520N850k8951p073j2300K3840L0055k8324n532m0056j4439K8999
8824D21780K3165K1456j0143o0777k0453l4144K583j1371J8384L83j3534j800
8812C35529m3198m860K9083n461P1792Q1497N496l9112n647N980J284k6582o8432
8799C37369j05017l9758L7201N1695p846m338k2264J3635J7564k7096L627m567
8787B50205L2738J5088R280P14M1142m930k4278M8975j8497j7818L9415L5244
8775D07278k5338k3667n739m746o2967k7131N81K6139L0425J0585k1944k2498
8763B80978l7686o0501J6733L427K3331L8080L8931N03k8017j3048k0512m9567
8751A92652M8703M5281J3394k3511j8792l6719J0062o806j2981R469L8830N3184
$$ plain form
8836 425191 469711 475561 446610 439537 427237 451077 481132 452808 447276 407220 392781 421780
8824 421780 444945 466401 456258 395481 375028 340884 343467 332096 350480 350863 337329 335529
8812 335529 292331 287471 316554 311093 382885 464382 469878 430766 425119 431099 432383 405801 337369
8799 337369 232352 192594 229795 281490 273644 269306 247042 260677 278241 251145 254772 250205
8787 250205 282943 298031 307311 308025 349167 344237 319959 368934 350437 332619 372034 407278
8775 407278 381940 358273 352534 347788 284821 257690 258271 284410 314835 325420 303476 280978
8763 280978 243292 182791 199524 202951 226282 264362 303293 303796 275779 262731 242219 192652
8751 192652 241355 286636 300030 276519 257727 221008 231070 224264 211283 220752 259582 312766
8739C12766J4228j0441j0072j6419n3306l7842J322k3581j4614K1240L604R902
8727A96787K4007J3112k504l1331L206J9822l5205l6220l3177L1585L6299O639
8715A93020k0951m0736k3424M5514N6784M1891J5945k1633j3373P794r3j214l1793
8702B07731L2655J1661M817L0899j2979k5625n5995n1294r553r317J6134J3737
8690A52871J7836K4589J4423k3339M125l943N1146l264m3741M892K1223j5765
8678B01053M607N592k1430m170K5617J2056l6464K9102M3650l6432m328q206j5997
8665A94650j2391J2778L666o4750K6970N5554l7820l3693R55l9467M1748M3982
8653A92182L6122L240j6144J5035j6094k4231m959l2548J0415J7483K1J0263J5347
$$ plain form
8739 312766 326994 316553 306481 290062 236756 198914 200236 176655 162041 183281 186885 196787
8727 196787 220794 233906 231402 200071 203277 223099 187894 151674 118497 150082 186381 193020
8715 193020 172069 131333 107909 153423 210207 252098 268043 246410 233037 240831 240738 239524 207731
8702 207731 240386 252047 256864 287763 274784 249159 193164 141870 132317 123000 139134 152871
8690 152871 170707 195296 209719 186380 190505 186562 237708 234444 190703 195595 216818 201053
8678 201053 205660 211252 189822 185652 211269 223325 186861 215963 259613 223181 218853 210647 194650
8665 194650 182259 195037 198703 133953 160923 216477 178657 144964 145919 106452 148200 192182
8653 192182 228304 231544 215400 230435 214341 190110 185151 152603 163018 180501 180522 190785 206132
8640B06132L0268Q131L964p23P94m1276m9567K629M5287O946k7127o8347k0720
8627I6391q1O1132L6416j2531K6091K0049k7154j0602j4725L1033K2838K2860
8615B51717R177j6401m4187J4871N304p799J743L5456L4336k9435m0133k028j6534
8602A96087J5148m131M6375K5069j6884j2873R607m7461j4715L0516J719l3617
8590A94840J5016L6956M6570J7577J5812J5949L1831r590j6485m5205k0650l7550
8578B45071l2717j2538l7912K8448J5975K833k34j7066r810J5269J1329j2090
8566A96558p160L3801J906k4829n8567M2653k5639k5198k5576J8463J1521N2931
8554A90864j4715m0605P648L3477j757l9228j0108L528J8016j849k9134K7189
$$ plain form
8640 206132 236400 244531 248495 247772 248566 207290 157723 160352 205639 212585 185458 117111 96391
8627 96391 96310 157442 193858 181327 207418 227467 200313 189711 174986 206019 228857 251717
8615 251717 260894 244493 200306 215177 220481 212682 214425 249881 284217 254782 214649 212621 196087
8602 196087 211235 207104 253479 278548 261664 248791 258398 210937 196222 226738 228457 194840
8590 194840 209856 246812 293382 310959 326771 342720 374551 364961 348476 303271 282621 245071
8578 245071 212354 199816 161904 190352 206327 209160 208926 191860 182050 197319 208648 196558
8566 196558 189398 223199 225105 200276 141709 184362 158723 133525 107949 126412 137933 190864
8554 190864 176149 135544 143192 176669 174912 135684 125576 129104 147120 145271 116137 143326
8542A43326J2135k5209j9290j1960K4150l2225n330l420j3365K0045N157M7207
8530A41221j355l2867j749O0650M5341l5518q9764k4454L3434J7758K0785N6653
8518A90135k2269j8385L2775j2901q2983M168L4392j551O5435K1265l4859m2451
8506A32771m2203J0689K7800j7142n423O94k3084j1646j5644O2025o345m7194
8494F5298M0976K2477R466l4816l4593p77K6548M7274k044k7012k8183P401K4144
8481A16159k4385l6633p99M5601M5884J2656n094j4176R75J1053l1775m1095l655
8468G4716J6770J1659l2755J1174K4987K9505J583J3858l0470j4418J539q121
8456A00027o296J2189J7191q575j5752K2717k8491m0165L865Q824Q535O128K0456
$$ plain form
8542 143326 155461 130252 110962 99002 123152 90927 85597 82177 68812 88857 94014 141221
8530 141221 139866 106999 105250 165900 211241 175723 85959 61505 94939 112697 133482 190135
8518 190135 167866 149481 182256 169355 86372 90540 124932 123381 188816 210081 175222 132771
8506 132771 90568 101257 129057 111915 106492 107186 84102 72456 56812 118837 112492 65298
8494 65298 106274 128751 138217 103401 68808 68031 94579 141853 139809 112797 84614 92015 116159
8481 116159 91774 55141 54342 99943 145827 158483 153389 139213 140188 151241 119466 78371 74716
8468 74716 91486 103145 70390 81564 106551 136056 137639 151497 121027 106609 108148 100027
8456 100027 93731 105920 123111 114536 98784 121501 93010 52845 56710 65534 74069 80197 100653
8443A00653M066k3444k632J2883K1603K7615M0389p516m7970j3246r990j7064
8431H5347j3582l5117R817J962P195N186O4245L3796o987n9246l3010l728O047
8418F1925N2984J0967k262j9207k1623J5291J465l3510l1132L3089K1914l1205
8406E8696n3620K6287L1928K9195k0636j2203k3076k5047j576J1058J3583L2180
8394F6769L8055j3627k9214K3553J3705l6795j6907L0751k273k7319j7256K6896
8382E6338j2495n963L1852K1264l5887k1918J288J6144j9439j8123O19K2785k6775
8369I690J5848K0851K1193p366l265j3148j3581J9009M174Q362J4529p320k2377
8356D6599M533O062l0144N045J1298j900r110M6029j9975m9788K7470R967L994
$$ plain form
8443 100653 104719 81275 78643 91526 113129 140744 181133 173617 125647 112401 102411 85347
8431 85347 71765 36648 46465 48427 55622 60808 125053 158849 151862 92616 59606 55878 61925
8418 61925 114909 125876 123614 104407 82784 98075 99540 66030 34898 67987 89901 58696
8406 58696 5076 31363 63291 92486 71850 59647 36571 11524 9948 21006 34589 66769
8394 66769 104824 91197 61983 85536 99241 62446 45539 76290 74017 46698 29442 56338
8382 56338 43843 37880 69732 90996 55109 33191 34479 50623 31184 13061 13680 36465 9690
8369 9690 25538 46389 67582 60216 56951 43803 30222 49231 53405 61767 76296 68976 46599
8356 46599 51132 57194 27050 32095 43393 41493 32383 78412 58437 8649 36119 46086 50080
8343E0080K4651j889k1833k2889L6652L9657J5152k2097j1657J5420K4759m8610
8331G7396K6461k3427L788r554L672N152j5600j8456K4737n559k4828l5414j6289
8318g921K461J1909K3902j4414K7808N8458P619k044l0242l6779M248k911L0318
8305G2412l3991l7538L710L2542p843K8166j6137o840k4170K7798Q903k0736L9410
8292F5686K4822L45J3248j086m4482J140O0187J1356o7198p4505j5749J8138K4447
8279A6349m978K5670L1390r362J066j3762k343L6533J1466L1166Q761k8072j4297
8266H9587N160K20k0710n000P092j0755l9989l5631k7864K5757l916k8851L6228
8253h672j4287O325K6032P0499m567m5496r77m8508J5297J203R04J213j7925k645
$$ plain form
8343 50080 74731 72842 51009 28120 64772 104429 119581 97484 85827 101247 126006 77396
8331 77396 103857 80430 84218 74664 78336 83488 67888 49432 74169 68610 43782 8368 -7921
8318 -7921 -5460 6449 30351 15937 43745 102203 109822 107778 77536 40757 45005 42094 72412
8305 72412 38421 883 4593 37135 29292 57458 41321 34481 10311 38109 47012 26276 65686
8292 65686 90508 90853 104101 103015 58533 59673 119860 131216 64018 -10487 -26236 -8098 16349
8279 16349 11371 37041 68431 59069 60135 46373 44030 80563 92029 123195 131956 103884 89587
8266 89587 94747 94967 74257 69257 76349 65594 25605 -10026 -37890 -12133 -16049 -44900 -8672
8253 -8672 -22959 -16634 9398 79897 75330 29834 28857 -19651 -4354 -3151 -2247 -1034 -18959 -21604
8239b1604R040K6839K0577K5844m0275k3818K9924j6995k0856M6233j3795k7421
8227f307L2311J8233Q665l7433k3523K9489N2388J4120m6190j5161j3544l340
8215I708n665M6460K019o451L4779K1919l5716Q588J153J7006K1449Q04r734j9193
8201H7126j2273l196k1505n882J0520n773n3698M1743J7401l231K0569J1004m2938
8188C9867O896K4093J993m557k6194K855l821r001M685n10M3535j4396J5834n063
8174G6216J7612K615k9983L8875j2601n7085l6565m379o135N0873M1756j6994
8162F4205j770k3458l162j7417j6985k457o9850K76K3091J3612K7647P2935j9094
8149D7573J1798L7411J6194O049j7718k6012k3651q477k5451L2317L6392L053
$$ plain form
8239 -21604 -12564 14275 34852 60696 20421 -3397 26527 9532 -11324 34909 21114 -6307
8227 -6307 26004 44237 52902 15469 -8054 21435 73823 87943 41753 26592 13048 9708
8215 9708 4043 50503 52522 46071 80850 102769 67053 75641 76794 93800 115249 116053 106319 87126
8201 87126 74853 71657 50152 44270 54790 49017 -4681 37062 54463 51232 71801 82805 39867
8188 39867 46763 70856 72849 68292 42098 44953 41132 32131 36816 36306 79841 65445 81279 76216
8174 76216 93828 96443 66460 105335 92734 35649 -916 -5295 -11430 39443 81199 64205
8162 64205 62435 38977 35815 18398 1413 -1044 -70894 -70618 -47527 -33915 -6268 66667 47573
8149 47573 59371 96782 112976 119025 101307 75295 51644 43167 17716 50033 86425 89478
8137H9478j512j5793k6733N235Q752j8224K3459J8216k949l1055J2817M2216M5533
8124A49440J5571p969o5953k7304m2387q431J2355j8654k1505M1379J9693k4150
8112B2085K4140M2843j8134k0498j0204L5986K0298R761j1645K4827M99m305k3618
8099I2035j9557L3117n1491q0452K1450K4288k9373J2666k8606N357N2119M1258
8087G2811k0579k4138l8610m7395K1080K9124K0637M5212K9768l6982l4914k7940
8075a1926k1928N6867M3833l31k4610N820Q09J605m4474J2220J8686j1913k844
8062B1814L1907M5732P13k4550k1945j0410j8565J0638K6688K4191k2064l7680
8050B6469j7962k0064K820M938J6262J5115M0119Q513j5063Q575p884L5154P761
$$ plain form
8137 89478 87966 72173 45440 50675 59427 41203 64662 82878 79929 48874 61691 103907 149440
8124 149440 165011 157042 91089 63785 21398 12967 25322 6668 -14837 26542 46235 22085
8112 22085 46225 89068 70934 50436 40232 76218 96516 106277 94632 119459 119958 115653 92035
8099 92035 72478 105595 54104 -26348 -4898 19390 -9983 2683 -25923 -20566 31553 72811
8087 72811 52232 28094 -10516 -57911 -36831 -7707 12930 58142 87910 50928 16014 -11926
8075 -11926 -33854 23013 66846 66515 41905 47725 48534 50139 5665 17885 36571 24658 21814
8062 21814 53721 99453 100166 75616 53671 43261 24696 35334 62022 86213 64149 26469
8050 26469 8507 -11557 -8737 -3799 12463 27578 67697 76210 61147 69722 61838 96992 104753
8037A04753J572k7425l0060j1441J7612L1661j9888k5255L5372k084k6648q526
8025C9643O60l503L7793n547l6543J1305K6259J1118l052K031R44n081j0592m3964
8011B1471n883K6433L759r864k5313L6569L7080r325j9977J5577J3077M2953K6183
7998A52740J1601J4746j0157k8019k0945k7953j7399n0055k8293O3585L5155k9644
7986F5362n935J2516J2474M6944K5240m0974o464L364M2872j1915j4917k0961
7974A07606J8912n8028J708J6868l5455m1261Q206K4550J6781j8985K1694N9056
7962A21652M0426j5871n3429J2881k687N429L4883L0214k2622m6705l6400K2942
7950I0713K9239l1925J8058K320k2053K3005N861k8723J0963k938J2651k3298
$$ plain form
8037 104753 106325 78900 48840 37399 55011 86672 66784 41529 76901 74817 48169 39643
8025 39643 40303 36800 74593 69046 32503 43808 70067 81185 78133 80164 81108 76027 65435 21471
8011 21471 15588 42021 45780 35916 10603 47172 84252 74927 54950 70527 83604 126557 152740
7998 152740 164341 179087 168930 140911 119966 92013 74614 24559 -3734 59851 95006 65362
7986 65362 59427 71943 84417 131361 156601 115627 109163 112527 155399 143484 128567 107606
7974 107606 126518 68490 70198 87066 51611 10350 18556 43106 59887 40902 62596 121652
7962 121652 162078 146207 92778 105659 102972 108401 143284 173498 150876 104171 67771 90713
7950 90713 119952 88027 106085 108405 86352 109357 115218 86495 97458 94520 107171 83873
7938H3873l1845l9891l788L6365k7646J8944J2562k06j88J2995n047N1499J6744
7925A24371l0865J513k222m2725k7467N1408q712k8260n843J7900K0562P307j119
7912G5848m969o364K4099m363M626L2486K617m5158o2326n4056L394k3224J5135
7899d2255L9503L0507N8036L1120j8965k1205k5859l012k7578k4633J0039o93
7887E005J750L8366l2151J3735O6889L8492k9310j6101j8295r297J7288k0395
7875E5976K0147j310l7374L533L2646j9580J993J2161j0316m6277N578L1219M4413
7862I2809j3828j9447l3096j7936p367j169j8320P105J0588J1734K6705N22k5332
7849A2968m0392j6476K6794k1699k284K3717N137K49L2809n0382l1130K4259M2816
$$ plain form
7938 83873 52028 12137 8349 44714 17068 36012 48574 48368 48180 61175 56128 107627 124371
7925 124371 93506 95019 92797 50072 22605 74013 65301 37041 31198 49098 69660 76967 75848
7912 75848 70879 64515 88614 84251 88877 121363 123980 78822 16496 -37560 -34166 -57390 -42255
7899 -42255 -2752 27755 85791 116911 97946 76741 50882 47870 20292 -4341 5698 5005
7887 5005 6755 45121 12970 26705 93594 132086 102776 86675 68380 59083 76371 55976
7875 55976 76123 74813 37439 40972 73618 54038 56031 68192 57876 11599 17177 48396 92809
7862 92809 78981 59534 26438 8502 1135 -34 -18354 -11249 -661 11073 37778 38300 12968
7849 12968 -27424 -43900 -17106 -38805 -41089 -17372 -12235 -11986 20823 -29559 -60689 -36430 6386
7836F386q476J4906M9284J2725j4049l8821m1555j1399L3244L5692j0500J1511
7824C8948k5174p869j0692j9648j7345K580J7948M2121j0490r64L076J996j2578
7811A909M553l9141L2998j9275o878J4840k3413R298N7302M764r263j2553n4232
7798c9091P949m000o686J4412L9570K9670P38Q593l9005k6552Q769j8506k909
7785b7048j2763P724K8458K4658K1076l4595j9817j6752L8567K2084J9200q136
7773D2656j3666J9241r676k3922o854J1358l1735j4835l6102k2930P9236J4564
7761G335k1879K7064L361j4379k884K2267j4082J9917r50L281J6990j3483m0339
7748g781K5330k7492k1088l255L383P210K6580L1153k2626m4160K5346L2323k1808
$$ plain form
7836 6386 -2090 12816 62100 74825 60776 21955 -19600 -30999 2245 37937 27437 38948
7824 38948 13774 5905 -4787 -24435 -41780 -39200 -21252 20869 10379 9415 12491 14487 1909
7811 1909 6462 -32679 319 -18956 -25834 -10994 -34407 -25109 32193 36957 27694 15141 -39091
7798 -39091 -31142 -35142 -41828 -27416 12154 41824 42562 51155 12150 -14402 -5633 -24139 -27048
7785 -27048 -39811 -32087 -3629 21029 42105 7510 -12307 -29059 9508 31592 50792 42656
7773 42656 28990 48231 38555 14633 7779 19137 -12598 -27433 -63535 -86465 -7229 7335
7761 7335 -14544 12520 15881 1502 -1382 20885 6803 26720 25770 29051 46041 32558 -7781
7748 -7781 17549 -9943 -31031 -34286 -30903 -23693 2887 34040 11414 -32746 -7400 24923 3115
7735C115L7318K2642m290o2681l8423j4575j4732j9955M1342O8423j8285P086
7723F985k4285m0367j3625q690N597j2670L7711O7111k3427r005j518l4024q912
7710e9119M5314k189K5947J2084j1751N877Q405k0299k1321L0647L0718j6677
7698B7636q425r930J762O708J7022j1043j3145N3222J5521m7408l8632o595k5819
7685c9126l525n2L3740J5228N6980m753K4257n4336m666j598m1760l6341j4847
7672g0799Q996M2733j8444J5248N752J8491p150n0832R488L1756l551k1155J0126
7659b9341L0216J7975K6858q625k3877j3641L3834m496o7214l535O7090M8842
7647G4086m7982r037P475R714J216K199j2134n118m9065q644Q504j3143O765k1251
$$ plain form
7735 3115 40433 63075 58785 -3896 -42319 -56894 -71626 -91581 -50239 18184 -101 6985
7723 6985 -17300 -57667 -71292 -79982 -74385 -87055 -49344 17767 -5660 -14665 -16183 -50207 -59119
7710 -59119 -13805 -15994 9953 22037 10286 16163 24568 4269 -17052 13595 44313 27636
7698 27636 19211 9281 11043 17751 34773 23730 10585 63807 79328 31920 -6712 -13307 -39126
7685 -39126 -42651 -42703 -8963 6265 63245 58492 82749 28413 23747 22149 -19611 -55952 -70799
7672 -70799 -61803 -19070 -37514 -22266 -16514 1977 -5173 -56005 -46517 -14761 -18312 -39467 -29341
7659 -29341 875 18850 45708 37083 13206 -435 33399 28903 -38311 -41846 25244 74086
7647 74086 26104 17067 24542 34256 35472 37671 25537 20419 -28646 -37290 -28786 -41929 -35164 -56415
7633e6415l0708L9798J7908L6541N2914K4200n2693K648L7018k8177l1233j2516
7621g15L435l5012O829j102K6702J4467k6499j3191K9489j1307l8726L775L4015
7608g840N5826L8729m189m112k6726q5385j2328L0187K2754l824k2675k2456j8448
7595f0487M2385J9064o2825J5085L4484k8195j4933q98j0137J6669m81K2291N3419
7582B5441L1654P519n4035m4289j2860r491j326K8955j2174j7124N9256J9411
7570B0937P330p582m2008l437N5816P0394m5190j7102n4704k6865K9376K8861
7558A5826j5297N529R162Q422K8767j505m1365J6891N2065j5883l2355q05n432
7545B4020l0836j6015K4762o81j0929P318K7434J848j8820K44P000o068M106J2745
$$ plain form
7633 -56415 -87123 -47325 -29417 7124 60038 84238 31545 34193 71211 43034 11801 -715
7621 -715 2720 -32292 -25463 -26565 137 14604 -11895 -25086 4403 -6904 -45630 -41855 -7840
7608 -7840 47986 86715 82526 78414 51688 -33697 -46025 -15838 6916 3092 -19583 -42039 -60487
7595 -60487 -18102 962 -61863 -46778 -12294 -40489 -55422 -56320 -66457 -49788 -50269 -27978 25441
7582 25441 57095 64614 10579 -33710 -46570 -56061 -57387 -28432 -40606 -57730 1526 20937
7570 20937 28267 20685 -21323 -24760 31056 101450 56260 39158 -15546 -42411 -13035 15826
7558 15826 529 6058 15220 23642 52409 50904 9539 26430 78495 62612 30257 29452 24020
7545 24020 -6816 -22831 1931 1250 -9679 -2361 25073 26921 8101 8345 15345 9277 13383 26128
7531B6128m9896n7623L4038J9911P8l440J2047O9500r126m1885j5085l1015l903
7518e0271J6670K2830L3811j9654q837L0139l6713l3329J4895m674l3077M1121
7506b7089K3605r177M964k9566K0686J7359O5967l0648l9737L9534L798l3967
7494E729o598j1508K2566q557j4715o176J0224M4094m933k7812r476K0795J8402
7481C2035k2182j2988j8339L797J834P3621J1171m9737l7078j0483Q343m660r136
7468c3802K6525K1811K5641n5457m0521m65N9099r764k4882k0349J6950K9977
7456e237L5214j6845j5922j2451k8026J6243J7843L1761J7842k7207P061L8167
7444E8443o9342k8777n475k3617J7950J2047K8562j7514k7211j0423p045K2421
$$ plain form
7531 26128 -23768 -81391 -47353 -27442 -27364 -30804 -18757 50743 41617 -268 -15353 -46368 -50271
7518 -50271 -33601 -10771 23040 3386 -5451 24688 -12025 -45354 -30459 -35133 -68210 -27089
7506 -27089 -3484 -12661 -7697 -37263 -16577 782 66749 36101 -3636 35898 39696 5729
7494 5729 -869 -12377 10189 1632 -13083 -19259 -9035 35059 30126 2314 -7162 13633 32035
7481 32035 9853 -3135 -21474 -17677 -15843 57778 68949 19212 -17866 -28349 -20006 -24666 -33802
7468 -33802 -7277 14534 40175 -15282 -55803 -56268 2831 -6933 -31815 -52164 -35214 -5237
7456 -5237 29977 13132 -2790 -15241 -43267 -27024 -9181 22580 40422 13215 20276 58443
7444 58443 -10899 -39676 -45151 -68768 -50818 -38771 -10209 -27723 -54934 -65357 -72402 -49981
7432d9981J6400J3656J8221M523l3597Q149N8896j8579k6436l2328k4368O792
7420e8652K0853j5527k2725n760L9772L6820j8553l2799k7154J3462O3380J0645
7408C762K4135J235j6039J4762j3552j3164J1456j0939K0036J4112m696L0052
7396F1160J511o4292l6960l8454P1599M3190k2223l1222k4412P887N460p809J6843
7383a7722q715j1689o775l3881j9475K6575K0390K5878j0837k579J4845O951o076
7370b3110l4482N774j2517l1700K5924K1594n839M21k948P909J9818n4818L8245
7357d5729O0590M3088m708m2813n6304P939k7818J5778j4363J6265k287L1101
7345a9261K7608K2828N125o2457p296K0220l732l4157l1592J4248L2578K7518
$$ plain form
7432 -49981 -33581 -19925 -1704 2819 -30778 -22629 36267 17688 -8748 -41076 -65444 -58652
7420 -58652 -37799 -53326 -76051 -81811 -42039 -5219 -23772 -56571 -83725 -70263 -6883 3762
7408 3762 27897 29132 13093 27855 14303 1139 12595 1656 21692 35804 31108 61160
7396 61160 62671 -1621 -38581 -77035 -5436 37754 15531 -15691 -40103 -32216 -26756 -34565 -17722
7383 -17722 -26437 -38126 -44901 -78782 -98257 -71682 -51292 -25414 -36251 -38830 -23985 -17034 -23110
7370 -23110 -57592 -51818 -64335 -96035 -70111 -48517 -54356 -53935 -56883 -48974 -29156 -83974 -45729
7357 -45729 14861 57949 53241 10428 -45876 -37937 -65755 -49977 -64340 -48075 -50362 -19261
7345 -19261 8347 31175 36300 -26157 -33453 -13233 -16965 -51122 -82714 -68466 -35888 -8370
7333h370l0952j8504K4511M6473J138J6788J696q583L4315j3391m7797j8750J8432
7320b994K8464n922K805J1347j5173p952q59L1842K9935k7114m9200j4627L2537
7307A3089J0544m6827k3026j1430j4927O1183M1521K1672m303M777R422J1196
7295G2891k2640o7636l3259O40O3660M4674J1720m4683n1045j2628J9511J6574
7283b221l0900R983M649Q361M623k383Q534n640Q526k206K8641k3286m0281j9320
7269e2920L6022J2441j8973k6714l8119L3041M5085J1228J6304L1360L2520o1972
7257A9303j23212L2751N3507L1436j3191M065k7140l5155K0481N4268J4914r723
7245B2304m5989l3197J6468J0946M6850L0102L362l7783n5657r478K4039J7116
$$ plain form
7333 -8370 -39322 -57826 -33315 13158 14296 31084 32780 24197 58512 45121 -2676 -21426 -2994
7320 -2994 25470 19548 22353 33700 18527 10575 9716 41558 71493 44379 -4821 -19448 13089
7307 13089 23633 -23194 -46220 -57650 -72577 -11394 30127 51799 47496 52273 61695 72891
7295 72891 50251 -17385 -50644 -50004 13656 58330 70050 25367 -25678 -38306 -18795 -2221
7283 -2221 -33121 -23138 -18489 -10128 -5505 -7888 646 -4994 3532 1326 29967 6681 -33600 -52920
7269 -52920 -16898 -4457 -23430 -50144 -88263 -55222 -10137 1091 17395 48755 81275 19303
7257 19303 -103909 -71158 -17651 13785 594 4659 -22481 -57636 -37155 17113 32027 22304
7245 22304 -23685 -56882 -40414 -29468 17382 47484 50846 13063 -42594 -52072 -28033 -10917
7233a0917K0702K7889L099o8774q773m561o97j1847J0128N357J9177J2201p917
7220a4933j4237M8496J6358M315J0687o275m9537j2668K4422J9903o763L4329
7208E4097k149l2599j6637k0237k3302J5974N886l6114j0350P6548L5038m2745
7196C410n6506k514n05l3665P512M9162N835p063O6869L0248q1018j7293L6523
7183I95j9386n4580R166L1502k5266q729M3729N4774m062j9610m2832K2590L0753
7170A9044K7957j1784l4002p270j57J165q236J4091j5533k0611M207K0898O269
7157c962k421J8219K7280m1063l7431L0928M2082L2166j0432l3617k9572j8878
7145b6701N6373P912k7383K9084j5942j6755J8425j7495j7033P026j9131k5023
$$ plain form
7233 -10917 9785 37674 40773 -28001 -36774 -41335 -42032 -53879 -43751 -38394 -19217 -7016 -14933
7220 -14933 -29170 19326 35684 39999 50686 44411 -5126 -17794 6628 26531 19768 54097
7208 54097 51948 19349 2712 -17525 -40827 -24853 -18967 -55081 -65431 11117 46155 3410
7196 3410 -53096 -55610 -56115 -89780 -82268 -33106 -27271 -34334 32535 62783 -18235 -35528 995
7183 995 -18391 -72971 -63805 -32303 -57569 -66298 -22569 32205 28143 8533 -34299 -11709 19044
7170 19044 47001 35217 1215 -6055 -6212 -5047 -13283 808 -14725 -35336 -31129 -10231 -3962
7157 -3962 -6383 11836 39116 -1947 -39378 -8450 33632 65798 55366 21749 -7823 -26701
7145 -26701 29672 37584 10201 39285 23343 6588 25013 7518 -9515 -2489 -21620 -46643
7133d6643J2610L2900q595J9072l388o1163K2640L2097r631K2124L4203l8800
7121G426j6265k275n896Q700k0854J7902k235j255k2024K1496j4981k7476N086
7108e2651K7761o751R45J77K0926J5098K946J1666N733K9271o645j7206k0598
7095A0672J9215K3004j7874q680L4839q295j5879k5844K5435r567M0589K8330
7083I5945j6923n2637J01J4722J3385P970m678m0238l0363l2048L552l4136L136
7070g2212L2420m133P424K5553j6201M123j653j7303J3903M4864J8595n7201K6743
7057D922M1706k406l5391j8768L5002L1583j1403J9292O696K152r141O037j1351
7044E8930j1611j4385k5814J7127p941k8928j5745J9840K7207R451M3940K4318
$$ plain form
7133 -46643 -34033 -1133 -9728 9344 5956 -55207 -32567 -470 -10101 12023 46226 7426
7121 7426 -8839 -11114 -17010 -8310 -29164 -11262 -13497 -14752 -36776 -15280 -30261 -57737 -52651
7108 -52651 -24890 -31641 -30696 -30519 -9593 5505 8451 20117 25850 55121 48476 31270 10672
7095 10672 29887 52891 35017 26337 61176 52881 37002 11158 36593 27026 67615 95945
7083 95945 79022 26385 26486 41208 54593 62563 57885 17647 -12716 -44764 -41212 -75348 -72212
7070 -72212 -39792 -43925 -36501 -10948 -27149 -23026 -24679 -41982 -28079 16785 35380 -21821 4922
7057 4922 46628 44222 8831 -9937 25065 56648 45245 64537 71233 73385 64244 70281 58930
7044 58930 47319 32934 7120 24247 16306 -12622 -28367 -8527 18680 28131 72071 96389
7032I6389p068j5671k2143j1356m500j7716j4164J216N6633m2104n6751Q240L3294
7019D299J8961P632m832j1192K2817J0745j8843m8183M88j0588O588k0566r336
7006e2010M5543J1757L975K335K752J8169J567l3098p604K4959J1849k733N028
$$ plain form
7032 96389 89321 73650 51507 40151 35651 17935 3771 4987 61620 19516 -37235 -28995 4299
7019 4299 23260 30892 26060 14868 37685 48430 29587 -18596 -18108 -28696 -22108 -42674 -52010
7006 -52010 -6467 5290 9265 11600 14352 32521 34088 990 -6614 18345 30194 27461 32489
$$ [...]
##END NTUPLES=NMR SPECTRUM
##END=
