##TITLE=Analysis number 327640
Compound Code cc 36001
Project Code adrs
Chemist Name ugmt
##JCAMPDX= 6.0         $$ Bruker NMR JCAMP-DX V2.0
##DATA TYPE= NMR SPECTRUM
##DATA CLASS= NTUPLES
##ORIGIN= Bruker BioSpin GmbH
##OWNER= nmr
$$ XWIN-NMR		Version 3.5
$$ Thu Mar 29 09:04:49 2007 GMT Daylight Time (UT+1h)  MAYBRIDGE\nmr@NMR_250MHZ
##.OBSERVE FREQUENCY= 250.131544655141
##.OBSERVE NUCLEUS= ^1H
##.ACQUISITION MODE= SIMULTANEOUS (DQD)
##.ACQUISITION SCHEME= undefined
##.AVERAGES= 16
##.DIGITISER RES= 18
##SPECTROMETER/DATA SYSTEM= dpx250
##.PULSE SEQUENCE= zg30
##.SOLVENT NAME= DMSO
##.SHIFT REFERENCE= (INTERNAL, DMSO, 0, 16.522)
##AUDIT TRAIL= $$ (NUMBER, WHEN, WHO, WHERE, WHAT)
$$ ##TITLE= Audit trail, XWIN-NMR		Version 3.5
$$ ##JCAMPDX= 5.01
$$ ##ORIGIN= Bruker BioSpin GmbH
$$ ##OWNER= nmr
$$ C:\u/data/dgb/nmr/ADRS/2520/pdata/1/auditp.txt
$$ ##AUDIT TRAIL=  $$ (NUMBER, WHEN, WHO, WHERE, WHAT)
(   1,<2007-03-29 09:04:25.49 +100>,<MAYBRIDGE\nmr>,<NMR_250MHZ>,
      <created by zg, POWCHK disabled, PULCHK disabled
       configuration hash MD5:
       49 4B E0 1D 92 C2 6B 37 9F E6 65 BC 52 41 86 1D
       data hash MD5: 64K
       4C 21 3F 9F 8F D0 B9 57 5A 8D AA C1 54 F4 13 EC>)
(   2,<2007-03-29 09:04:39.32 +100>,<MAYBRIDGE\nmr>,<NMR_250MHZ>,
      <Start of raw data processing
       ef LB = 0.3 FT_mod = 6 PKNL = 1 SI = 32K 
       data hash MD5: 32K
       1F F2 91 33 DD 24 8D 36 21 56 48 82 DE 7B 80 9A>)
(   3,<2007-03-29 09:04:41.04 +100>,<MAYBRIDGE\nmr>,<NMR_250MHZ>,
      <apk 
       data hash MD5: 32K
       E1 34 13 54 9F 16 9D DC 1E 77 F8 2B 78 9F 9A 28>)
(   4,<2007-03-29 09:04:41.77 +100>,<MAYBRIDGE\nmr>,<NMR_250MHZ>,
      <abs ABSG = 5 
       data hash MD5: 32K
       BF 43 EC C6 28 9E 07 39 31 97 21 A9 E1 D9 56 A8>)
$$ ##END=
$$ 
$$ hash MD5
$$ 37 6C 96 12 77 48 60 FD 79 2F 55 D8 CE 9D 20 A1
##$RELAX= 
##$RELAX= 
##$RELAX= 
##$RELAX= 
##$RELAX= 
##$RELAX= 
##$RELAX= 
$$ Bruker specific parameters
$$ --------------------------
##$DU= <C:\u>
##$EXPNO= 2520
##$NAME= <ADRS>
##$PROCNO= 1
##$TYPE= <nmr>
##$USER= <dgb>
##$AMP= (0..31)
100 100 100 100 100 100 100 100 100 100 100 100 100 100 100 100 100 100 
100 100 100 100 100 100 100 100 100 100 100 100 100 100 
##$AQSEQ= 0
##$AQ_mod= 3
##$AUNM= <au_zg>
##$AUTOPOS= <58 >
##$BF1= 250.13
##$BF2= 250.13
##$BF3= 250.13
##$BF4= 250.13
##$BF5= 500.13
##$BF6= 500.13
##$BF7= 500.13
##$BF8= 500.13
##$BYTORDA= 1
##$CFDGTYP= 0
##$CFRGTYP= 5
##$CHEMSTR= <none>
##$CNST= (0..31)
1 1 145 1 1 1 1 1 1 1 1 1 1 1 1 1 1 1 1 1 1 1 1 1 1 1 1 1 1 1 1 1 
##$CPDPRG= <>
##$CPDPRG1= <>
##$CPDPRG2= <>
##$CPDPRG3= <>
##$CPDPRG4= <mlev>
##$CPDPRG5= <mlev>
##$CPDPRG6= <mlev>
##$CPDPRG7= <mlev>
##$CPDPRG8= <mlev>
##$CPDPRGB= <>
##$CPDPRGT= <>
##$D= (0..31)
0 1 0 0 0 0 0 0 0 0.06 0 0 0 0 0 0 0.0002 0 0 0 0 0 0 0 0 0 0 0 0 0 0 
0 
##$DATE= 1175155463
##$DBL= (0..7)
120 120 120 120 120 120 120 120 
##$DBP= (0..7)
150 150 150 150 150 150 150 150 
##$DBP07= 0
##$DBPNAM0= <>
##$DBPNAM1= <>
##$DBPNAM2= <>
##$DBPNAM3= <>
$$ [...]
##$SUBNAM7= <"">
##$SUBNAM8= <"">
##$SUBNAM9= <"">
##$SW= 20.6930455092707
##$SWIBOX= (0..15)
0 0 3 0 0 0 0 0 0 0 0 0 0 0 0 0 
##$SW_h= 5175.983436853
##$TD= 65536
##$TD0= 1
##$TE= 683.16
##$TE2= 300
##$TE3= 300
##$TEG= 300
##$TL= (0..7)
0 120 120 120 120 120 120 120 
##$TP= (0..7)
150 150 150 150 150 150 150 150 
##$TP07= 0
##$TPNAME0= <>
##$TPNAME1= <>
##$TPNAME2= <>
##$TPNAME3= <>
##$TPNAME4= <>
##$TPNAME5= <>
##$TPNAME6= <>
##$TPNAME7= <>
##$TPOAL= (0..7)
0.5 0.5 0.5 0.5 0.5 0.5 0.5 0.5 
##$TPOFFS= (0..7)
0 0 0 0 0 0 0 0 
##$TUNHIN= 0
##$TUNHOUT= 0
##$TUNXOUT= 0
##$USERA1= <user>
##$USERA2= <user>
##$USERA3= <user>
##$USERA4= <user>
##$USERA5= <user>
##$V9= 5
##$VALIST= <valist>
##$VCLIST= <CCCCCCCCCCCCCCC>
##$VD= 0
##$VDLIST= <DDDDDDDDDDDDDDD>
##$VPLIST= <PPPPPPPPPPPPPPP>
##$VTLIST= <TTTTTTTTTTTTTTT>
##$WBST= 1024
##$WBSW= 4
##$XGAIN= (0..3)
0 0 0 0 
##$XL= 0
##$YL= 0
##$YMAX_a= 437089
##$YMIN_a= -359749
##$ZGOPTNS= <>
##$ZL1= 120
##$ZL2= 120
##$ZL3= 120
##$ZL4= 120
##$ABSF1= 16.522
##$ABSF2= -4.171173
##$ABSG= 5
##$ABSL= 3
##$ALPHA= 0
##$AQORDER= 0
##$ASSFAC= 0
##$ASSFACI= 0
##$ASSFACX= 0
##$ASSWID= 0
##$AUNMP= <proc_1d>
##$AZFE= 0.1
##$AZFW= 0.1
##$BCFW= 0
##$BC_mod= 0
##$BYTORDP= 0
##$COROFFS= 0
##$CY= 12.5
##$DATMOD= 1
##$DC= 0
##$DFILT= <>
##$DTYPP= 0
##$F1P= 14.0000005364418
##$F2P= -0.99999901652339
##$FCOR= 0.5
##$FTSIZE= 32768
##$FT_mod= 6
##$GAMMA= 0
##$GB= 0
##$INTBC= 1
##$INTSCL= 1
##$ISEN= 128
##$LB= 0.3
##$LEV0= 0
##$LPBIN= 0
##$MAXI= 10000
##$MC2= 0
##$MEAN= 0
##$ME_mod= 0
##$MI= 0
##$NCOEF= 0
##$NC_proc= -4
##$NLEV= 6
##$NOISF1= 0
##$NOISF2= 0
##$NSP= 0
##$NTH_PI= 0
##$NZP= 0
##$OFFSET= 16.522
##$PC= 1
##$PHC0= 221.2017
##$PHC1= 5.121543
##$PH_mod= 1
##$PKNL= yes
##$PPARMOD= 0
##$PSCAL= 4
##$PSIGN= 0
##$REVERSE= no
##$SF= 250.13
##$SI= 32768
##$SIGF1= 0
##$SIGF2= 0
##$SINO= 400
##$SIOLD= 32768
##$SREGLST= <1H.DMSO>
##$SSB= 0
##$STSI= 32768
##$STSR= 0
##$SW_p= 5175.98343685301
##$SYMM= 0
##$S_DEV= 0
##$TDeff= 65536
##$TDoff= 0
##$TI= <Analysis number 999999
Compound Code 99
Book Reference 9
Project Code 9>
##$TILT= no
##$TM1= 0
##$TM2= 0
##$TOPLEV= 0
##$USERP1= <user>
##$USERP2= <user>
##$USERP3= <user>
##$USERP4= <user>
##$USERP5= <user>
##$WDW= 1
##$XDIM= 32768
##$YMAX_p= 475907919
##$YMIN_p= -196042
$$ End of Bruker specific parameters
$$ ---------------------------------
##NTUPLES= NMR SPECTRUM
##VAR_NAME=  FREQUENCY,     SPECTRUM/REAL,   SPECTRUM/IMAG
##SYMBOL=    X,             R,               I
##VAR_TYPE=  INDEPENDENT,   DEPENDENT,       DEPENDENT
##VAR_FORM=  AFFN,          ASDF,            ASDF
##VAR_DIM=   32768,         32768,           32768
##UNITS=     HZ,            ARBITRARY UNITS, ARBITRARY UNITS
##FACTOR=    0.157963299565203, 1,           1
##FIRST=     4132.6476996994, 0,             0
##LAST=      -1043.33573715361, 0,           0
##MIN=       -1043.33573715361, -196042,     0
##MAX=       4132.6476996994, 475907919,     0
$$ Real data points
##PAGE= N=1
##DATA TABLE= (X++(R..R)), XYDATA
$$ [...]
$$ plain form
15726 -41096 -23615 -48082 -19345 18674 29440 12165 -27428 -98776 -100096 -113159 -110590 -79036
15714 -79036 -77355 -67866 -14042 73060 45910 -21087 -62700 -79989 -57796 16695 46840 22816
15702 22816 -11261 -32534 19094 85550 109424 100613 33210 16961 33132 73916 81557 79562
15690 79562 27701 -6471 -44375 -81714 -56418 -32486 5404 12819 -22451 -30651 -9836 -46346
15678 -46346 -34979 -16465 -5418 -49189 -83595 -14946 -25690 -69309 -68104 -55377 -16166 6462
15666 6462 14809 -10541 -44541 -38255 12773 40732 -757 -397 825 47031 103293 97030 104755
15653 104755 74551 -3908 -19968 -2339 -15792 -23282 -40393 -65788 -115720 -83919 -62782 -3445
15641 -3445 36219 5739 -7428 -45968 -30414 19088 13135 15327 -931 -24754 -62671 -48933
$$ packed form
15726d1096J7481k4467K8737L8019J0766j7275l9593p1348j320j3063K569L1554
15714g9036J681R489N3824Q7102k7150o6997m1613j7289K2193P4491L0145k4024
15702B2816l4077k1273N1628O6456K3874q811o7403j6249J6171M0784P641j995
15690G9562n1861l4172l7904l7339K5296K3932L7890P415l5270q200K0815l6510
15678d6346J1367J8514J1047m3771l4406O8649j0744m3619J205J2727L9211K2628
15666F462Q347k5350l4000O286N1028K7959m1489L60J222M6206N6262o263P725
15653A04755l0204p8459j6060J7629j3453p490j7111k5395m9932L1801K1137N9337
15641c445L9664l0480j3167l8540J5554M9502n953K192j6258k3823l7917J3738
$$ plain form
15629 -48933 -2832 -14801 -30716 -59189 -66917 -35277 -12146 -5985 13213 52880 51452 8627
15617 8627 28356 33921 41583 58533 38245 44831 25589 -37678 -14281 -12844 -24581 -27838 -25171
15604 -25171 6820 17706 -22164 -77718 -59952 -19361 -54651 -40713 -24568 -34911 3173 -43081
15592 -43081 -10446 14231 -2747 -29618 -57949 -34552 -14699 -29079 -89856 -83990 -50229 -60180
15580 -60180 -63640 -23001 -9943 -6513 -16642 30187 59855 64681 30261 -44101 -59184 -78256
15568 -78256 -40615 -26995 -37774 -26699 -57832 -39240 25752 45415 -21093 -24182 -4119 41535
15556 41535 19158 -3843 22232 24054 6196 -71308 -58042 -27780 -21686 -58124 -75002 -85763
15544 -85763 -129379 -136294 -52634 10655 32321 47038 75848 44858 -31714 -101307 -177376 -160742
$$ packed form
15629d8933M6101j1969j5915k8473p728L1640K3131O161J9198L9667j428m2825
15617H627J9729N565P662J6950k0288O586j9242o3267K3397J437j1737l257K667
15604b5171L1991J0886l9870n5554J7766M0591l5290J3938J6145j0343L8084m6254
15592d3081L2635K4677j6978k6871k8331K3397J9853j4380o0777N866L3761r951
15580f0180l460M0639J3058L430j0129M6829K9668M826l4420p4362j5083j9072
15568g8256L7641J3620j0779J1075l1133J8592O4992J9663o6508l089K0063M5654
15556D1535k2377k3001K6075J822j7858p7504J3266L0262O094l6438j6878j0761
15544h5763m3616o915Q3660O3289K1666J4717K8810l0990p6572o9593p6069J6634
$$ plain form
15532 -160742 -68210 30095 -11168 -17343 13042 4482 -26993 -25343 -57506 -23253 -25946 -42115
15520 -42115 -40454 -12280 -16373 37398 62728 29487 -27155 -20688 13311 10418 -23890 -18452 76
15507 76 35105 16153 7893 -8690 -48965 -58162 -94898 -45765 -25194 -70937 -74970 -32920 -21450
15494 -21450 -27818 -33915 -41611 3620 -21562 -100212 -44342 -23804 -50363 -20495 -35453 -48843
15482 -48843 -41320 16526 53556 37350 -13721 -32806 -41012 -45296 -29503 -17312 38122 47807
15470 47807 56223 16490 -11939 -51779 -896 15105 8808 83439 103499 59881 10512 -63578
15458 -63578 -38344 -68691 -99592 -77234 -74389 -108171 -135983 -114863 -77174 -7932 8233 -22231
15446 -22231 -9833 -9088 -23306 12566 58559 14134 -35938 -73426 -92359 -39343 -42938 -36779
$$ packed form
15532a60742R2532R8305m1263o175L0385q560l1475J650l2163L4253k693j6169
15520d2115J661K8174m093N3771K5330l3241n6642O467L3999k893l4308N438J8528
15507G6L5029j8952q260j6583m0275r197l6736M9133K0571m5743m033M2050J1470
15494b1450o368o097p696M5231k5182p8650N5870K0538k6559K9868j4958j3390
15482d8843P523N7846L7030j6206n1071j9085q206m284J5793J2191N5434R685
15470D7807Q416l9733k8429l9840N0883J6001o297P4631K0060m3618m9369p4090
15458f3578K5234l0347l0901K2358K845l3782k7812K1120L7689O9242J6165l0464
15446b2231J2398P45j4218L5872M5993m4425n0072l7488j8933N3016l595O159
$$ plain form
15434 -36779 -20996 -20590 21557 6092 -34835 -134638 -176625 -153814 -98083 -73775 -37616 -49574
15422 -49574 -44261 -32781 -31995 -3613 -19508 -70326 -38896 995 37299 47220 27395 -3890
15410 -3890 -8754 -33021 -88565 -42533 -1995 7291 22397 28635 20011 38872 44483 46478 45182
15397 45182 35650 9635 25793 -24224 -28195 -21362 8380 13091 7175 14252 38025 -3734 -27674
15384 -27674 26185 51312 45179 61368 20868 80039 97334 3902 -39711 -87059 -82374 -90570
15372 -90570 -57676 -23204 -44814 -38466 -12744 24117 -21071 -41772 35822 54267 -753 -30842
15360 -30842 49 9377 -41133 -1245 52093 -28243 -48390 -22696 -51712 -40614 -57745 -19974
15348 -19974 19335 7172 38340 68716 81967 80499 54549 -5931 -45375 -50301 -83775 -39875
$$ packed form
15434c6779J5783M06M2147j5465m0927r9803m1987K2811N5731K4308L6159j1958
15422d9574N313J1480P86K8382j5895n0818L1430L9891L6304R921j9825l1285
15410c890m864k4267n5544M6032M0538R286J5106O238q624J8861N611J995j296
15397D5182r532k6015J6158n0017l971O833K9742M711n916P077K3773m1759k3940
15384b7674N3859K5127o133J6189m0500N9171J7295r3432m3613m7348M685q196
15372i0570L2894L4472k1610O348K5722L6861m5188k0701P7594J8445n5020l0089
15360c0842L0891R328n0510L9888N3338q0336k0147K5694k9016J1098j7131L7771
15348a9974L9309j2163L1168L0376J3251j468k5950o0480l9444m926l3474M3900
$$ plain form
15336 -39875 39437 93600 133838 85855 25510 3870 -45651 -73819 -70 12134 -15203 -80407
15324 -80407 -63966 -23707 -37672 -60653 -98435 -121746 -84421 -3916 -18934 -59128 -13344 21400
15312 21400 68577 98933 108083 63707 25178 -70724 -61317 -2557 37702 -7701 -36419 -43812
15300 -43812 -43833 -11537 18285 35815 68011 36814 29823 811 -20115 -16148 -7959 1704 3949
15287 3949 -15969 -46873 -1631 40525 79768 62679 38716 14957 -33100 -19086 11251 41991
15275 41991 -3620 -13063 4698 11037 33258 36562 60390 38319 27298 11460 28769 68807
15263 68807 48063 85637 72425 13104 8426 -10052 -6198 -9671 -51278 -33724 -30562 -17700
15251 -17700 -1649 14012 -8745 -884 5974 8766 8579 -33563 -37256 31596 61504 10182 -20114
$$ packed form
15336c9875P9312N4163M0238m7983o0345k1640m9521k8168P3749J2204k7337o5204
15324h0407J6441M0259j3965k2981l7782k3311L7325Q0505j5018m0194M5784L4744
15312B1400M7177L0356R150m4376l8529r5902R407N8760M0259m5403k8718p393
15300d3812k1L2296K9822J7530L2196l1197o991k9012k0926L967Q189R663K245
15287C949j9918l0904M5242M2156L9243j7089k3963k3759m8057J4014L0337L0740
15275D1991m5611r443J7761O339K2221L304K3828k2071j1021j5838J7309M0038
15263F8807k0744L7574j3212n9321m678j8478L854l473m1607J7554L162J2862
15251a7700J6051J5661k2757P861O858K792j87m2142l693O8852K9908n1322l0296
$$ plain form
15238 -20114 -33714 -63164 -81705 -69574 -60521 -28145 26312 -2763 -51893 -98170 -52778 -35180
15226 -35180 -50708 -30048 -35244 -70208 -49491 74 27558 55203 70071 70357 58401 6181
15214 6181 -2082 -4383 -8136 -14416 25699 81724 102895 89583 14219 -60204 -8524 24703 33535
15201 33535 62003 14675 4977 -20993 -21676 24706 33034 62819 63148 9454 -26296 -69148 -58052
15188 -58052 -93142 -89218 -75369 -53999 -48505 -43061 -21229 -2139 -42508 -20190 -4361 20046
15176 20046 37021 27123 6701 -41297 -55762 -105007 -87313 -44202 1917 -32920 -67221 -2251
15164 -2251 -9194 -50903 -10335 -54681 -33210 -29739 -39566 -19486 40592 77151 121549 79876
15152 79876 32299 -2589 -44600 -58464 -55818 -8591 80165 75387 71541 5678 -17593 -37198
$$ packed form
15238b0114j3600k9450j8541J2131R053L2376N4457k9075m9130m6277M5392J7598
15226c5180j5528K0660n196l4964K0717M9565K7484K7645J4868K86j1956n2220
15214F181q263k301l753o280M0115N6025K1171j3312p5364p4423N1680L3227Q832
15201C3535K8468m7328r698k5970o83M6382Q328K9785L29n3694l5750m2852J1096
15188e8052l5090L924J3849K1370N494N444K1832J9090m0369K2318J5829K4407
15176B0046J6975r898k0422m7998j4465m9245J7694M3111M6119l4837l4301O4970
15164b251o943m1709M0568m4346K1471L471r827K0080O0078L6559M4398m1673
15152G9876m7577l4888m2011j3864K646M7227Q8756m778l846o5863k3271j9605
$$ plain form
15140 -37198 -26158 286 -30794 -36901 -10317 -722 -36308 -12703 5364 -43671 -36417 21592
15128 21592 63506 37229 17102 -2817 29650 43165 47514 2011 -34821 -61971 -86427 -112701
15116 -112701 -62521 -70398 -77644 -63803 -42769 -11761 20586 63537 68122 31074 -35329 -85504
15104 -85504 -57006 -63162 -15689 -26418 -45834 -59119 -37621 8473 60367 77439 32558 22832
15092 22832 12455 -7529 -4609 -13636 32202 83338 80619 52655 24724 42733 -5839 -40783
15080 -40783 8512 63377 2131 -22404 23020 11893 -179 -24703 -8829 -5076 -26057 -109914
15068 -109914 -105267 -51158 -21790 44231 18629 12883 29915 41661 84297 53870 52831 35487
15056 35487 -23534 -64100 -34135 -5058 -17081 -13330 2921 38444 54192 -2240 -17664 -9889
$$ packed form
15140c7198J1040K6444l1080o107K6584R595l5586K3605J8067m9035P254N8009
15128B1592M1914k6277k0127j9919L2467J3515M349m5503l6832k7150k4456k6274
15116a12701N0180p877p246J3841K1034L1008L2347M2951M585l7048o6403n0175
15104h5504K8498o156M7473j0729j9416j3285K1498M6094N1894J7072m4881r726
15092B2832j0377j9984K920r027M5838N1136k719k7964k7931J8009m8572l4944
15080d0783M9295N4865o1246k4535M5424j1127j2072k4524J5874L753k0981q3857
15068a09914M647N4109K9368O6021k5602n746J7032J1746M2636l0427j039j7344
15056C5487n9021m0566K9965K9077j2023L751J6251L5523J5748n6432j5424P775
$$ plain form
15044 -9889 36042 98912 85928 50716 106001 145316 93174 70344 54395 63866 58045 18117
15032 18117 -92540 -76733 -39867 -77891 -110322 -44282 21808 -12606 -69976 -60559 -35843 -39375
15020 -39375 -91463 -97286 -19688 -23106 -41308 -35148 13224 29881 5536 -25172 -42919 -20334
15008 -20334 -7343 5584 -12198 -25499 -1601 -20223 -31404 -143156 -111864 -41140 -15699
14997 -15699 -19876 -63454 -73782 -50377 -30880 17573 66781 85226 62553 53761 66205 50594
14985 50594 27601 6385 4715 -41244 -68238 -16888 -37388 -39546 66501 125070 187473 161226
14973 161226 94026 52057 33080 -26211 -11394 -40261 -48667 -54588 -14429 19807 -10783 -15654
14961 -15654 -19166 -67017 -32346 51388 135355 120368 64780 78565 72225 33891 -20109 -69701
$$ packed form
15044i889M5931O2870j2984l5212N5285L9315n2142k2830j5949R471n821l9928
15032A8117j10657J5807L6866l8024l2431O6040O6090l4414n7370R417K4716l532
15020c9375n2088n823P7598l418j8202O160M8372J6657k4345l0708j7747K2585
15008b0334J2991J2927j7782j3301K3898j8622j1181j11752L1292P0724K5441
14997a5699m177m3578j0328K3405J9497M8453M9208J8445k2673q792J2444j5611
14985E0594k2993k1216j670m5959k6994N1350k0500k158J06047N8569O2403k6247
14973A61226o7200m1969j8977n9291J4817k8867q406n921M0159L4236l0590m871
14961a5654l512m7851L4671Q3734Q3967j4987n5588J3785o340l8334n4000m9592
$$ plain form
14949 -69701 -95443 -81587 -41308 -38502 -30013 789 8600 18240 -8825 -35977 3826 36742
14937 36742 58279 50503 -12650 -11358 7597 -5851 -39884 -72872 -70559 -95964 -55257 -19622
14925 -19622 -5274 7941 3809 -55145 -33284 -9630 -7391 -5613 713 -969 51957 78005 95903
14912 95903 54287 -57224 -77101 -58114 -42403 2985 35907 42838 21780 -5098 -12997 21591
14900 21591 27091 13325 -42114 -63685 -75069 -81455 -57575 -31831 -2505 57 -27655 -73783
14888 -73783 -95719 -68371 -53011 -85661 -82708 -13015 70466 49795 52933 70547 25973 -32576
14876 -32576 -18091 10771 50297 41503 24300 28085 -21952 -99503 -86886 -46893 -30119 -24973
14864 -24973 -45415 -55414 -21811 -15555 -28015 -63676 -41883 -52262 -38969 22720 55369 28977
$$ packed form
14949f9701k5742J3856M0279K806Q489L0802P811R640k7065k7152L9803L2916
14937C6742K1537p776o3153J292J8955j3448l4033l2988K313k5405M0707L5635
14925a9622J4348J3215m132n8954K1861K3654K239J778O326j682N2926K6048J7898
14912I5903m1616j11511j9877J8987J5711M5388L2922O931k1058k6878p899L4588
14900B1591N500j3766n5439k1571j1384o386K3880K5744K9326K562k7712m6128
14888g3783k1936K7348J5360l2650K953O9693Q3481k0671L138J7614m4574n8549
14876c2576J4485K8862L9526q794j7203L785n0037p7551J2617L9993J6774N146
14864b4973k0442r999L3603O256j2460l5661K1793j0379J3293O1689L2649k6392
$$ plain form
14852 28977 6026 -2256 -35844 -30297 -3322 25702 84986 150013 163181 109088 92081 31193
14840 31193 -10304 -27836 49302 106764 134268 95747 87640 52039 21684 73740 46937 -20002
14828 -20002 -21825 48991 56226 5881 -26206 -6156 9045 48150 3403 5273 13924 1233
14816 1233 58650 116576 58152 -44604 -56997 -65952 -87869 -35170 -23403 -23738 12961 18864
14804 18864 36561 -8960 -62200 -42167 -28668 7802 -990 45513 19612 -30162 -51091 -69139
14792 -69139 -65701 -82716 -83937 -93976 -106448 -90141 -60905 1205 -12063 4547 27140 43044
14780 43044 71243 93214 102486 89928 89449 67720 55384 69610 60828 32583 25622 -36409 -14536
14767 -14536 -2157 -14815 -14079 -9532 69938 128274 72886 80260 119579 94842 30034 -22890
$$ packed form
14852B8977k2951q282l3588N547K6975K9024N9284O5027J3168n4093j7007o0888
14840C1193m1497j7532P7138N7462K7504l8521q107l5601l0355N2056k6803o6939
14828b0002j823P0816P235n0345l2087K0050J5201L9105m4747J870Q651j2691
14816A233N7417N7926n8424j02756j2393q955k1917N2699J1767l35L6699N903
14804A8864J7697m5521n3240K0033J3499L6470q792M6503k5901m9774k0929j8048
14792f9139L438j7015j221j0039j2472J6307K9236O2110j3268J6610K2593J5904
14780D3044K8199K1971R272j2558m79k1729j2336J4226q782k8245o961o2031K1873
14767a4536J2379j2658P36M547P9470N8336n5388P374L9319k4737o4808n2924
$$ plain form
14755 -22890 -10131 23600 25298 37516 27568 38978 73545 60663 39420 48387 92556 99351
14743 99351 35181 10460 47118 115847 97410 74052 -1633 -89252 -74107 -78568 -59426 -48853
14731 -48853 -29277 -2076 -3645 -21857 -48580 -35096 -5620 8114 -50515 -69547 -97608 -127628
14719 -127628 -130405 -101719 -122698 -80172 3037 30972 45590 54660 69065 44160 381 -20672
14707 -20672 -54480 -15581 -44756 -91736 -73070 9214 77499 65182 44944 41758 71280 91925
14695 91925 133152 149727 112617 56914 44259 56576 -4298 -33813 -30775 -71391 -95502 -65668
14683 -65668 -25852 -41267 10536 74437 84810 53936 24789 -21942 -410 -21518 -61881 -54532
14671 -54532 -60883 -86974 -50078 -5188 5731 -5934 2353 952 26619 21951 36852 66756
$$ packed form
14755b2890J2759L3731J698J2218r948J1410L4567j2882k1243Q967M4169O795
14743I9351o4170k4721L6658O8729j8437k3358p5685q7619J5145m461J9142J0573
14731d8853J9576K7201j569j8212k6723J3484K9476J3734n8629j9032k8061l0020
14719a27628k777K8686k0979M2526Q3209K7935J4618R070J4405k4905m3779k1053
14707b0672l3808L8899k9175m6980J8666Q2284O8285j2317k0238l186K9522K0645
14695I1925M1227J6575l7110n5703j2655J2317o0874k9515L038m0616k4111K9834
14683f5668L9816j5415N1803O3901J0373l0874k9147m6731K1532k1108m0363P349
14671e4532o351k6091L6896M4890J0919j1665Q287j401K5667m668J4901K9904
$$ plain form
14659 66756 36426 17572 22340 39160 45890 37653 30382 43023 29418 16977 -821 -17463
14647 -17463 -23559 -13788 2662 11596 -11251 18517 37463 40328 -16 18065 36558 -23538
14635 -23538 -34851 -37880 -18158 5415 15578 47295 28214 32064 -910 -48485 -39480 -40803
14623 -40803 -42143 -27610 -1492 -316 -46708 -27164 56651 87066 76425 60411 27923 14765
14611 14765 7922 10827 57017 67849 51149 21983 17823 14526 25872 14617 1755 56130
14599 56130 41994 84305 79832 27476 -35883 -74443 -36276 -310 61410 84224 103291 108659
14587 108659 122202 118765 95862 98094 24325 21251 63527 92139 52344 36832 20068 13008
14575 13008 31806 -15789 -43984 -49267 -23942 -3087 -32854 -55720 -70352 -35501 -36993 -66206
$$ packed form
14659F6756l0330j8854M768J6820O730q237p271J2641j3605j2441j7798j6642
14647a7463o096R771J6450Q934k2847K9768J8946K865m0344J8081J8493o0096
14635b3538j1313l029J9722K3573J0163L1717j9081L850l2974m7575R005j323
14623d0803j340J4533K6118J176m6392J9544Q3815L0415j0641j6014l2488j3158
14611A4765o843K905M6190J0832j6700k9166m160l297J1346j1255j2862N4375
14599E6130j4136M2311m473n2356o3359l8560L8167L5966O1720K2814J9067N368
14587A08659J3543l437k2903K232p3769l074M2276K8612l9795j5512j6764p060
14575A3008J8798m7595k8195n283K5325K0855k9767k2866j4632L4851j492k9213
$$ plain form
14563 -66206 -66450 -35866 -15177 -42442 14586 30502 13179 2351 -12699 -28190 -22492 2126
14551 2126 -19390 -21972 49966 48162 30765 23909 15011 22044 11151 379 14238 -6911 -31867
14538 -31867 -15135 24058 47879 22490 30563 39105 33571 29153 29579 3561 -15712 64764 137025
14525 137025 98619 25757 37737 60341 76375 55856 48371 50765 48935 43597 66335 41342
14513 41342 -8943 -54445 -41961 -48018 -38806 -64128 -118275 -71670 -19554 -37676 -39350 -8556
14501 -8556 18279 19313 31216 51525 -9424 -23230 7132 22724 48108 38677 20653 17212
14489 17212 104719 87075 67547 21151 37199 7152 11495 38582 32889 16153 40274 58032
14477 58032 38982 23366 8638 9993 10163 16964 50502 38552 18327 20365 25987 -22358 -23361
$$ packed form
14563f6206k44L0584K0689k7265N7028J5916j7323j0828j5050j5491N698K4618
14551B126k1516k582P1938j804j7397o856q898P033j0893j0772J3859k1149k4956
14538c1867J6732L9193K3821k5389Q073Q542n534m418M26k6018j9273Q0476P2261
14525A37025l8406p2862J1980K2604J6034k0519p485K394j830n338K2738k4993
14513D1342n0285m5502J2484o057R212k5322n4147M6605N2116j8122j674L0794
14501h556K6835J034J1903K0309o0949j3806L0362J5592K5384r431j8024l441
14489A7212Q7507j7644j9528m6396J6048l0047M343K7087n693j6736K4121J7758
14477E8032j9050j5616j4728J355J70O801L3538j1950k0225K038N622m8345j003
$$ plain form
14464 -23361 -50264 -46712 -54923 -6254 46801 18433 17955 45605 71547 81342 14496 -21324 -14838
14451 -14838 -33186 -6003 5687 -97 32741 18719 43231 19588 2646 -3411 36021 48437
14439 48437 9883 -11060 -13690 6210 8734 -9332 -11712 19134 17623 39147 28375 11191
14427 11191 -10956 6046 24754 16452 -14801 -572 -55738 -55800 -87194 -128760 -137004 -148935 -86167
14414 -86167 -31736 38646 68999 82602 13729 -10763 43206 57284 43305 82690 91705 71970
14402 71970 23245 23362 60455 79782 36617 14785 -4740 13681 29333 -14652 -23706 -54557
14390 -54557 -23739 -3273 18016 32496 15805 -11701 41605 4647 -19215 9271 -10014 -33925
14378 -33925 19813 23096 3715 -15724 -42844 -34191 -55403 -27623 -13195 34108 46077 41506
$$ packed form
14464b3361k6903L552q211M8669N3055k8368m78K7650K5942R795o6846l5820O486
14451a4838j8348K7183J1690n784L2838j4022K4512k3643j6942o057L9432J2416
14439D8437l8554k0943k630J9900K524j8066k380L0846j511K1524j0772j7184
14427A1191k2147J7002J8708q302l1253J4229n5166o2l1394m1566q244j1931O2768
14414h6167N4431P0382L0353J3603o8873k4492N3969J4078j3979L9385R015j9735
14402G1970m8725J17L7093J9327m3165k1832j9525J8421J5652m3985r054l0851
14390e4557L0818K0466K1289J4480j6691k7506N3306l6958k3862K8486j9285k3911
14378c3925N3738L283j9381j9439k7120Q653k1212K7780J4428M7303J1969m571
$$ plain form
14366 41506 62403 53755 79252 65499 51787 50586 29263 40900 54586 82394 46167 37983
14354 37983 64401 81548 28816 -26718 51301 52999 -7339 -42715 -32324 -3394 8232 52683
14342 52683 20095 28814 5329 2210 -12083 -1102 4164 -16985 -33250 -73364 -25255 16998
14330 16998 1603 -39279 -38735 -3698 17432 10022 13064 54108 120117 95424 63598 60657 46559
14317 46559 -15600 -23516 6226 1774 29703 54270 89053 114991 111221 87565 26894 -4747
14305 -4747 -3626 -41461 -50419 -47052 -43895 -15964 -31164 -42141 44213 96005 67280 15085 -10696
14292 -10696 -13719 42399 44163 33985 17207 -1082 17668 9954 4804 8732 -9310 22594 -7832
14279 -7832 -1063 -14480 -47227 -610 35444 60065 70136 75984 109497 77154 65430 61326
$$ packed form
14366D1506K0897q648K5497j3753j3712j201k1323J1637J3686K7808l6227q184
14354C7983K6418J7147n2732n5534P8019J698o0338l5376J0391K8930J1626M4451
14342E2683l2588Q719k3485l119j4293J0981N266k1149j6265m0114M8109M2253
14330A6998j5395m0882N44L5037K1130p410L042M1044O6009k4693l1826k941j4098
14317D6559o2159p916K9742m452K7929K4567L4783K5938l770k3656o0671l1641
14305d747J121l7835q958L367L157K7931j5200j0977Q6354N1792k8725n2195k5781
14292a0696l023N6118J764j0178j6778j8289J8750p714n150L928j8042L1904l0426
14279g832O769j3417l2747M6617L6054K4621J0071N848L3513l2343j1724m104
$$ plain form
14267 61326 46791 98622 139924 115914 85882 47267 63833 81373 117830 85101 37068 33359
14255 33359 25596 14005 102524 168691 116532 36675 9659 41052 59146 18735 28793 80597
14243 80597 75110 83929 70092 47391 48530 66976 29674 -17748 -5281 21651 9794 40807
14231 40807 41023 17728 37571 79899 100284 67524 61422 -3652 2014 28299 3715 22712
14219 22712 33918 15994 15064 38148 40412 57652 50706 31535 61117 22560 -4010 52663
14207 52663 54631 46912 49443 -4172 -47243 28268 42774 1383 -62467 -109341 -61464 25963
14195 25963 46660 34151 43659 73516 23183 -19342 -54860 -54477 -26245 830 40572 37972
14183 37972 46958 61734 120029 92754 56401 77622 80966 65970 15510 33717 62779 45931
$$ packed form
14267F1326j4535N1831M1302k4010l0032l8615J6566J7540L6457l2729m8033l709
14255C3359p763j1591Q8519O6167n2159p9857k7016L1393J8094m0411J0058N1804
14243H0597n487Q819j3837k2701J139J8446l7302m7422J2467K6932j1857L1013
14231D0807K16k3295J9843M2328K0385l2760o102o5074N666K6285k4584J8997
14219B2712J1206j7924r30K3084K264J7240o946j9171K9582l8557k6570N6673
14207E2663J968p719K531n3615m3071P5511J4506m1391o3850m6874M7877Q7427
14195B5963K0697j2509R508K9857n0333m2525l5518L83K8232K7075L9742k600
14183C7972Q986J4776N8295k7275l6353K1221L344j4996n0460J8207K9062j6848
$$ plain form
14171 45931 63004 69819 44445 -59285 -44828 1263 11112 21289 12893 97709 129551 112731
14159 112731 108200 97211 90032 83428 101978 67731 64713 88663 133108 137488 107000 139413
14147 139413 99931 68097 82032 35188 2665 21273 6412 5353 30345 22759 61015 81308
14135 81308 21395 -31638 -32295 -61977 -73115 -41881 -68793 -86292 21409 61597 63484 47857
14123 47857 38217 26223 -46940 -40187 -19995 1402 11840 35410 16274 13374 561 14911
14111 14911 46304 18505 41064 27668 -405 14123 49417 60541 50640 29266 5087 -795
14099 -795 -1818 17593 24857 40576 -142 -46207 22950 51599 33329 33996 37393 62710 99898
14086 99898 81525 59603 23504 53881 109315 93347 22953 -35276 -110484 -78700 -23905 23028
$$ packed form
14171D5931J7073O815k5374j03730J4457M6091R849J0177q396Q4816L1842j6820
14159A12731m531j0989p179o604J8550l4247l018K3950M4445M380l0488L2413
14147A39413l9482l1834J3935m6844l2523J8608j4861j059K4992p586L8256K0293
14135H1308n9913n3033o57k9682j1138L1234k6912j7499J07701M0188J887j5627
14123D7857r640j1994p3163O753K0192K1397J0438K3570j9136k900j2813J4350
14111A4911L1393k7799K2559j3396k8073J4528L5294J1124r901k1374k4179n882
14099g95j023J9411P264J5719m0718m6065O9157K8649j8270O67L397K5317L7188
14086I9898j8373k1922l6099L0377N5434j5968p0394n8229p5208L1784N4795M6933
$$ plain form
14074 23028 22188 38349 59008 61185 50433 52386 53604 63889 36515 -25548 -39364 -14481 5627
14061 5627 -307 15182 10257 15067 -12056 30942 74483 61682 70296 100817 83640 66292 47366
14048 47366 26816 43319 23573 -4238 62471 108518 76343 11358 38466 87097 100774 43272
14036 43272 3429 -13433 -19687 -69417 -50938 -31534 10686 78178 72539 108491 151295 134726
14024 134726 93460 76889 56115 21325 -38120 -48191 -6014 47242 61814 16766 22549 28054
14012 28054 -43668 -70200 -54984 -41308 15117 12079 -23457 -42408 -36495 2615 15984 11151
14000 11151 73407 75951 86049 89301 96692 87488 70126 59214 35831 -13965 -18058 20547 53524
13987 53524 79271 101651 84685 77394 95422 65267 13297 49568 95424 83058 108172 108518
$$ packed form
14074B3028q40J6161K0659K177j0752J953J218J0285k7374o2063j3816K4883K0108
14061E627n934J5489m925M810k7123M2998M3541j2801Q614L0521j7177j7348j8926
14048D7366k0550J6503j9746k7811O6709M6047l2175o4985K7108M8631J3677n7502
14036D3272l9843j6862o254m9730J8479J9404M2220O7492n639L5952M2804j6569
14024A34726m1266j6571k0774l4790n9445j0071M2177N3256J4572m5048N783N505
14012B8054p1722k6532J5216J3676N6425l038l5536j8951N913L9110J3369m833
14000A1151O2256K544J0098L252P391r204j7362j0912k3383m9796m093L8605L2977
13987E3524K5747K2380j6966p291J8028l0155n1970L6271M5856j2366K5114L46
$$ plain form
13975 108518 82556 106228 57446 54470 69012 141657 125328 80528 46784 45798 17550 -5712
13963 -5712 -26245 -1950 -22219 -47597 -12642 4585 73354 129376 98780 1896 35147 58001
13951 58001 78442 73768 35545 65562 75310 78699 68048 39391 55610 20977 1814 14382
13939 14382 61628 53357 13798 17611 65809 88461 95024 90083 63364 39390 14290 55
13927 55 35261 54850 52634 59078 109053 132700 101315 48791 24102 9229 -30801 -55143 5538
13914 5538 65756 56127 -4865 3311 47140 84260 69727 34696 49241 77329 102070 91802
13902 91802 12582 13005 49424 34247 29316 43496 49985 66019 53758 31048 59273 80929
13890 80929 92464 118413 99316 106075 63811 33633 5191 44101 30965 4285 5553 88671
$$ packed form
13975A08518k5962K3672m8782k976J4542P2645j6329m4800l3744r86k8248k3262
13963e712k0533K4295k0269k5378L4955J7227O8769N6022l0596r6884L3251K2854
13951E8001K0441m674l8223L0017R748L389j0651k8657J6219l4633j9163J2568
13939A4382M7246q271l9559L813M8198K2652O563m941k6719k3974k5100j4235
13927E5L5206J9589k216O444M9975K3647l1385n2524k4689j4873m0030k4342O0681
13914E538O0218r629o0992Q176M3829L7120j4533l5031J4545K8088K4741j0268
13902I1802p9220M23L6419j5177m931J4180O489J6034j2261k2710K8225K1656
13890H0929J1535K5949j9097O759m2264l0178k8442L8910j3136k6680J268Q3118
$$ plain form
13878 88671 139670 163818 165448 116091 43232 71189 133736 115810 113255 77124 51079 35619
13866 35619 51004 64337 101621 97932 37744 35572 42433 8335 8831 7145 -18994 -4463 88145
13853 88145 105855 116261 158438 200964 199623 198288 205782 168102 93188 55236 3241 26664
13841 26664 29882 60919 39484 -9558 8675 28633 47271 32541 -39589 -28310 6303 43320
13829 43320 79646 89764 49668 87790 123561 107713 29075 12151 54451 32162 35456 77213
13817 77213 50629 68330 110009 172169 155972 103599 126877 139561 128147 91969 37949 -9262
13805 -9262 28114 17999 -14072 43785 103516 113610 78592 56739 72351 79890 84315 83142
13793 83142 37796 -35949 -42611 34662 65781 75626 88305 63349 56611 60648 44104 34142 61907
$$ packed form
13878H8671N0999K4148J630m9357p2859K7957O2547j7926k555l6131k6045j5460
13866C5619J5385J3333L7284l689o0188k172O861l4098M96j686k6139J4531R2608
13853H8145J7710J0406M2177M2526j341j335P494l7680p4914l7952n1995K3423
13841B6664L218L1037k1435m9042J8233J9958J8638j4730p2130J1279L4613L7017
13829D3320L6326J0118m0096L8122L5771j5848p8638j6924M2300k2289L294M1757
13817G7213k6584J7701M1679O2160j6197n2373K3278J2684j1414l6178n4020m7211
13805i262L7376j0115l2071N7857N9731J0094l5018k1853J5612P539M425j173
13793H3142m5346p3745o662P7273L1119R845J2679k4956o738M037j6544r962K7765
$$ plain form
13780 61907 64456 46268 71024 85791 107836 153516 99806 98043 91872 54505 4705 -16019
13768 -16019 -34504 -8710 4229 42092 31930 4054 4763 12056 71702 83641 90472 122480
13756 122480 128544 124102 84912 105545 127004 95106 61581 109460 110391 73230 80784 49964
13744 49964 5843 -2364 29103 18728 32471 113467 94958 39580 61879 88830 104203 62412
13732 62412 65355 61761 95782 128160 67756 14630 -17800 27982 97227 151381 133800 84640
13720 84640 99660 107788 116354 104740 106349 96334 66795 33071 -11261 20998 21087 13471 62549
13707 62549 47268 78001 57208 80373 116232 135761 87219 44752 28374 41530 67353 60498
13695 60498 90524 101392 136863 128879 72409 112494 72744 -8661 -10323 19724 52175 62555
$$ packed form
13780F1907K549j8188K4756J4767K2045M5680n3710j763o171l7367m9800k0724
13768a6019j8485K5794J2939L7863j0162k7876P09P293N9646J1939O831L2008
13756A22480O064m442l9190K0633K1459l1898l3525M7879R31l7161P554l0820
13744D9964m4121q207L1467j0375J3743Q0996j8509n5378K2299K6951J5373m1791
13732F2412K943l594L4021L2378o0404n3126l2430M5782O9245N4154j7581m9160
13720H4640J5020Q128Q566j1614J609j0015k9539l3724m4332L2259Q9p616M9078
13707F2549j5281L0733k0793K3165L5859J9529m8542m2467j6378J3156K5823o855
13695F0498L0026J0868L5471p984n6470M0085l9750q1405j662L0047L2451J0380
$$ plain form
13683 62555 84318 112452 95672 -29892 -50593 -31453 -19240 843 71612 80396 102815 69498
13671 69498 74765 69184 69607 87937 75505 91784 118057 92999 76509 65587 102906 133091
13659 133091 144169 104689 121006 94847 95060 113529 129999 107236 140584 81519 87939 72741
13647 72741 31222 49054 57342 62600 61688 140754 177449 164142 100493 89458 143098 127665
13635 127665 102642 102213 142622 147353 183269 172320 110959 66759 33740 68587 93228 116427
13623 116427 84525 141547 109618 117244 98346 88702 119275 170594 195956 214943 189939 93066
13611 93066 61432 40204 93134 125707 100701 20389 -35862 8305 96937 98452 105634 102984
13599 102984 98723 61634 78539 44293 21729 29771 91935 88994 118340 225180 225512 137026
$$ packed form
13683F2555K1763K8134j6780j25564k0701J9140J2213K0083P0769Q784K2419l3317
13671F9498N267n581M23J8330j2432J6279K6273k5058j6490j0922L7319L0185
13659A33091J1078l9480J6317k6159K13J8469J6470k2763L3348n9065O420j5198
13647G2741m1519J7832Q288N258r12P9066L6695j3307o3649j1035N3640j5433
13635A27665k5023m29M0409M731L5916j0949o1361m4200l3019L4847K4641K3199
13623A16427l1902N7022l1929P626j8898r644L0573N1319K5362J8987k5004r6873
13611I3066l1634k1228N2930L2573k5006q0312n6251M4167Q8632J515P182k650
13599A02984m261l7089J6905l4246k2564Q042O2164k941K9346J06840L32q8486
$$ plain form
13587 137026 115818 91583 60648 52457 64901 72036 54571 43976 78477 89572 116166 62773
13575 62773 100910 111361 91830 63098 72629 74752 80070 85732 68204 74176 50922 -13868 6762
13562 6762 -14383 -29975 11121 65047 29095 12946 21295 19604 28749 10282 54258 79468
13550 79468 113970 169948 158955 137815 138507 120681 125685 156920 151783 121975 134706 160460
13538 160460 132459 108362 78148 75972 76754 112202 159580 184265 156715 104009 126522 129513
13526 129513 112254 141575 139973 166137 196913 128622 143677 131198 111730 112481 85053 54084
13514 54084 47887 49113 86915 92477 118267 158064 213898 177724 149141 165615 136839 151715
13502 151715 139865 143236 96151 27331 42916 58043 69523 88715 113201 207964 198441 162099
$$ packed form
13587A37026k1208k4235l0935q191J2444P135j7465j0595L4501J1095K6594n3393
13575F2773L8137J0451j9531k8732R531K123N318N662j7528N972k3254o4790K0630
13562F762k1145j5592M1096N3926l5952j6149Q349j691R145j8467M3976K5210
13550G9468L4502N5978j0993k1140O92j7826N004L1235n137k9808J2731K5754
13538A60460k8001k4097l0214k176P82L5448M7378K4685k7550n2706K2513K991
13526A29513j7259K9321j602K6164L0776o8291J5055j2479j9468P51k7428l0969
13514E4084o197J226L7802N562K5790L9797N5834l6174k8583J6474k8776J4876
13502A51715j1850L371m7085o8820J5585J5127J1480J9192K4486R4763r523l6342
$$ plain form
13490 162099 147839 144969 134040 79874 42132 91944 118951 83306 57196 79477 157747 164054
13478 164054 128147 100641 64227 37273 11711 41316 70184 83497 87362 158221 157500 157299
13466 157299 173167 117886 81702 56280 87568 99909 76569 96591 114331 101480 66678
13455 66678 21283 76252 71089 61795 93874 88572 78906 93522 -2433 -12805 36364 85499
13443 85499 149895 137646 160314 157871 177551 126290 97516 119642 141910 159026 102814 51633
13431 51633 3284 148 40559 75813 84401 76007 27534 77098 125634 184054 135304 111302
13419 111302 104606 113547 129086 131504 134834 120525 140204 148634 169750 168184 178369 200222 202725
13406 202725 197386 185725 144267 162050 209427 194376 171979 223380 198447 141842 153691 151374
$$ packed form
13490A62099j4260k870j0929n4166l7742M9812K7007l5645k6110K2281P8270O307
13478A64054l5907k7506l6414k6954k5562K9605K8868J3313L865P0859p21k01
13466A57299J5868n5281l6184k5422L1288J2341k3340K0022J7740j2851l4802
13455F6678m5395N4969n163r294L2079n302r666J4616r5955j0372M9169M9135
13443H5499O4396j2249K2668k443J9680n1261k8774K2126K2268J7116n6212n1181
13431E1633m8349l136M0411L5254Q588q394m8473M9564M8536N8420m8750k4002
13419A11302o696Q941J5539K418L330j4309J9679Q430K1116j566J0185K1853K503
13406B02725n339j1661m1458J7783M7377j5051k2397N1401k4933n6605J1849k317
$$ plain form
13394 151374 156565 120120 129594 143489 175299 134993 123491 129383 156688 186328 192181 148589
13382 148589 185768 197454 179899 176608 171168 151114 120255 75436 94203 89842 72204 111510
13370 111510 112881 123203 198185 179408 151421 152969 158363 109979 112243 119766 67885 97310
13358 97310 189029 211331 172504 169551 161731 178668 151032 135229 132628 125522 122690 151039 142657
13345 142657 152515 157712 127372 90989 91948 97767 75718 115965 230597 231676 136911 143374 159851
13332 159851 140240 137822 161734 165336 177667 167858 175444 155632 122869 82250 97111 55940
13320 55940 98995 117292 126610 86715 125886 194197 203309 154259 125335 107763 91384 153267
13308 153267 191244 206340 189419 192332 209625 191096 178855 178670 196800 225080 167698 151328
$$ packed form
13394A51374N191l6445R474J3895L1810m0306j1502N892K7305K9640N853m3592
13382A48589L7179J1686j7555l291n440k0054l0859m4819J8767m361j7638L9306
13370A11510J371J0322P4982j8777k7987J548N394m8384K264P523n1881K9425
13358I7310R1719K2302l8827k953p820J6937k7636j5803k601p106k832K8349q382
13345A42657R858N197l0340l6383R59N819k2049M0247J14632J079r4765O463J6477
13332A59851j9611k418K3912L602J2331r809P586j9812l2763m0619J4861m1171
13320E5940M3055J8297R318l9895L9171O8311R112m9050k8924j7572j6379O1883
13308A53267L7977J5096j6921K913J7293j8529j2241j85J8130K8280n7382j6370
$$ plain form
13296 151328 188399 211367 188800 198507 223299 232386 209976 170681 154915 157255 131478 97967
13284 97967 122630 123536 139448 125915 132933 108273 121467 176938 221852 239211 221732 219989
13272 219989 250532 246850 240072 200156 163383 94085 91132 115112 50260 31709 48496 132272
13260 132272 179831 185984 182378 205190 240640 202240 174195 210891 281763 274752 261226 222561
13248 222561 242043 248254 199126 225684 259523 252107 196096 173983 229042 241113 196200 177184
13236 177184 235531 218720 177827 174294 202255 182710 187435 192972 181860 169409 150267 114329
13224 114329 168231 217011 254111 232952 222241 223271 184190 173591 176545 158849 163024 188145
13212 188145 174747 163858 182306 195362 150389 232158 221935 141625 129881 134729 153603 170463
$$ packed form
13296A51328L7071K2968k2567R707K4792R087k2410l9295j5766K340k5777l3511
13284I7967K4663R06J5912j3533P018k4660J3194N5471M4914J7359j7479j743
13272B19989L0543l682o778l9916l6773o9298k953K3980o4852j8551J6787Q3776
13260A32272M7559O153l606K2812L5450l8400k8045L6696P0872p011j3526l8665
13248B22561J9482O211m9128K6558L3839p416n6011k2113N5059J2071m4913j9016
13236A77184N8347j6811m0893l533K7961j9545M725N537j1112j2451j9142l5938
13224A14329N3902M8780L7100k1159j0711J030l9081j0599K954j7696M175K5121
13212A88145j3398j0889J8448J3056m4973Q1769j0223q0310j1744M848J8874J6860
$$ plain form
13200 170463 131880 109108 96896 88316 87732 107207 203789 268202 263543 261209 219549 197521
13188 197521 219548 218933 202774 273413 284343 252833 197636 185516 179653 146097 112315 114801
13176 114801 131629 169410 234038 231590 196051 167712 145706 188781 193573 195718 215254 223145
13164 223145 172880 189964 187374 200921 263707 243931 205997 211521 220293 236193 239968 229470
13152 229470 167531 151168 181465 254800 238694 200409 259268 280947 253533 239537 232406 209048
13140 209048 217978 199693 189051 189309 229754 216883 196335 191039 197731 197710 197574 203751 195491 188267
13126 188267 140713 133736 118175 159167 138610 188287 160679 140736 139128 131230 156234 162379
13114 162379 121516 109113 142803 138735 98506 97201 157001 170776 172402 183979 213400 240585
$$ packed form
13200A70463l8583k2772j2212q580n84J9475R6582O4413m659k334m1660k2028
13188A97521K2027o15j6159P0639J0930l1510n5197j2120n863l3556l3782K486
13176A14801J6828L7781O4628k448l5539k8339k2006M3075M792K145J9536P891
13164B23145n0265J7084k590J3547O2786j9776l7934N524Q772J5900L775j0498
13152B29470o1939j6363L0297P3335j6106l8285N8859K1679k7414j3996p131k3358
13140B09048Q930j8285j0642K58M0445j2871k0548n296O692k1j36O177q260p224
13126A88267m7554o977j5561M0992k0557M9677k7608j9943j608p898K5004O145
13114A62379m0863j2403L3690m068m0229j305N9800J3775J626J1577K9421K7185
$$ plain form
13102 240585 200766 157992 152703 169492 209273 202415 168972 210309 229386 176161 141805 196816
13090 196816 214408 211882 217292 224401 261460 260807 224331 233854 250328 269444 239956 228311 267104
13077 267104 271106 209671 195451 174735 166447 141723 159747 200741 202262 229954 222216 191458
13065 191458 195739 212882 209396 171421 167590 154052 211852 236911 295471 302712 339843 349557
13053 349557 283825 247931 242703 241639 215649 196910 209184 153444 132750 150369 176401 229491
13041 229491 299894 330930 293572 303201 322493 319093 258382 243421 241385 217248 216328 208913 231077
13028 231077 243386 232646 191146 197989 224455 261711 263398 284375 292758 169517 96506 131846
13016 131846 154376 170296 259351 336502 362490 331028 329989 309579 295191 288280 333478 345937
$$ packed form
13102B40585l9819m2774n289J6789L9781o858l3443M1337J9077n3225l4356N5011
13090A96816J7592k526N410P109L7059o53l6476R523J6474J9116k9488j1645L8793
13077B67104M002o1435j4220k0716q288k4724J8024M0994J521K7692p738l0758
13065A91458M281J7143l486l7975l831j3538N7800K5059N8560P241L7131R714
13053C49557o5732l5894n228j064k5990j8739J2274n5740k0694J7619K6032N3090
13041B29491P0403L1036l7358R629J9292l400o0711j4961k036k4137r20p415K2164
13028B31077J2309j0740m1500O843K6466L7256J687K0977Q383j23241p3011L5340
13016A31846K2530J5920Q9055P7151K5988l1462j039k0410j4388o911M5198J2459
$$ plain form
13004 345937 295560 263306 273492 229219 217034 262793 264172 213021 188736 229505 268009 232248
12992 232248 258333 255303 276934 237426 166973 155314 175287 218867 231342 250457 247093 265842
12980 265842 288300 252469 206031 163602 191365 222597 265275 263719 253719 239351 240916 211253
12968 211253 245390 299197 292627 238520 233073 236058 251386 244236 253149 283004 279518 269518 283381
12955 283381 265321 246606 275535 328487 322395 336940 341480 344053 299567 257754 212447 216517
12943 216517 259468 281383 271654 268831 289250 274465 292165 287653 286739 261750 260865 278222 258261
12930 258261 218269 246542 260047 232066 285710 339547 335419 267497 205043 203971 218351 246514
12918 246514 269479 312011 366333 326757 258598 219144 252541 265313 277032 300277 351837
$$ packed form
13004C45937n0377l2254J0186m4273j2185M5759J379n1151k4285M0769L8504l5761
12992B32248K6085l030K1631l9508p0453j1659J9973M3580J2475J9115l364J8749
12980B65842K2458l5831m6438m2429K7763L1232M2678j556j0000j4368J565k9663
12968B11253L4137N3807o570n4107n447K985J5328p150Q913K9855l486j0000J3863
12955B83381j8060j8715K8929N2952o092J4545M540K573m4486m1813m5307M070
12943B16517M2951K1915r729k823K0419j4785J7700m512r14k4989q85J7357j9961
12930B58261l9992K8273J3505k7981N3644N3837m128o7922o2454j072J4380K8163
12918B46514K2965M2532N4322l9576o8159l9454L3397J2772J1719K3245N1560
$$ plain form
12907 351837 335845 323800 283771 275506 276624 277983 292368 336787 345492 284673 220575 214305
12895 214305 258168 258329 298169 256609 275316 296370 258914 268302 227613 215344 284018 259443
12883 259443 232437 230565 239566 218101 217693 241139 230997 213553 203676 194027 271620 258076 184984
12870 184984 234386 280047 278000 245132 212364 214579 220903 224146 258989 260274 303354 304608 289715
12857 289715 288687 305715 318872 286659 261907 210125 242508 246942 303704 331271 305161 296871
12845 296871 277581 238162 272343 317149 283109 307433 329450 309737 278989 245071 306703
12834 306703 322412 285309 288032 274898 243008 274606 306986 331098 350559 323529 257590 192333
12822 192333 207150 272807 316293 387614 385128 320557 324699 322743 277524 285103 252917 259913
$$ packed form
12907C51837j5992j2045m0029q265J118J359J4385M4419Q705o0819o4098o270
12895B14305M3863J61L9840m1560J8707K1054l7456R388m0689j2269O8674k4575
12883B59443k7006j872R001k1465m08K3446j0142j7444r877r649P7593j3544p3092
12870A84984M9402M5661k047l2868l2768K215O324L243L4843J285M3080J254j4893
12857B89715j028J7028J3157l2213k4752n1782L2383M434N6762K7567k6110q290
12845B96871j9290l9419L4181M4806l4040K4324K2017j9713l0748l3918O1632
12834C06703J5709l7103K723j3134l1890L1598L2380K4112J9461k7030o5939o5257
12822A92333J4817O5657M3486P1321k486o4571M142j956m5219P579l2186O996
$$ plain form
12810 259913 295982 355616 376063 371430 317764 282717 335626 360339 311456 298673 317460 357947
12798 357947 349614 322265 393864 428376 397890 359190 355516 370826 340684 374299 393626 402609
12786 402609 379908 373827 391758 415437 413807 410126 372070 368989 393554 389381 378544 341800
12774 341800 338561 327366 297676 355235 342768 308576 282642 280585 292642 322122 310532 298561
12762 298561 322369 322735 340843 302610 293644 292652 282323 330544 374224 385365 321524 216793
12750 216793 192600 187084 198786 248261 300903 323980 301178 343637 362637 345371 362093 351159
12738 351159 395845 394909 382731 395948 401151 360259 330141 324184 404094 446917 398599 365126
12726 365126 343200 335796 275520 271952 282215 329899 348935 360689 375687 346991 418804 430763
$$ packed form
12810B59913L6069N9634K0447m633n3666l5047N2909K4713m8883j2783J8787M0487
12798C57947q333k7349P1599L4512l0486l8700l674J5310l0142L3615J9327Q983
12786D02609k2701o081J7931K3679j630l681l8056l081K4565m173j0837l6744
12774C41800l239j1195k9690N7559j2467l4192k5934k057J2057K9480j1590j1971
12762B98561K3808L66J8108l8233q966r92j0329M8221M3680J1141o3841j04731
12750B16793k4193n516J1702M9475N2642K3077k2802M2459J9000j7266J6722j0934
12738C51159M4686r36j2178J3217N203m0892l0118n957P9910M2823m8318l3473
12726C65126k1926p404o0276l568J0263M7684J9036J1754J4998k8696P1813J1959
$$ plain form
12714 430763 407374 367529 334020 316302 278460 256446 273545 348924 351587 333017 326024 330070
12702 330070 316494 356920 452529 474368 422736 408863 407408 423873 434588 433650 398153 381100
12690 381100 405251 440723 398378 358564 355473 416709 450166 508136 496452 542447 564824 544500
12678 544500 553206 526955 448370 404911 365196 343530 423988 456252 457255 448635 449531 364710
12666 364710 368412 405347 385325 394205 413841 411269 423673 468181 516226 543549 487300 473444
12654 473444 470194 477203 456505 434609 422975 417760 395503 413073 404196 430615 502930 492899
12642 492899 459547 473965 460444 435679 418851 438807 480176 437816 379910 400037 483020
12631 483020 500900 443472 421972 488888 551446 514933 424055 427622 436984 455272 423843 397664
$$ packed form
12714D30763k3389l9845l3509j7718l7842k2014J7099P5379K663j8570o993M046
12702C30070j3576M0426R5609K1839n1632j3873j455J6465J0715r38l5497j7053
12690C81100K4151L5472m2345l9814l091O1236L3457N7970j1684M5995K2377k0324
12678E44500Q706k6251p8585m3459l9715k1666Q0458L2264J003q620Q96q4821
12666C64710L702L6935k0022Q880J9636k572J2404M4508M8045K7323n6249j3856
12654D73444l250P009k0698k1896j1634n215k2257J7570q877K6419P2315j0031
12642D92899l3352J4418j3521k4765j6828J9956M1369m2360n7906K0127Q2983
12631D83020J7880n7428k1500O6916O2558l6513r0878L567R362J8288l1429k6179
$$ plain form
12619 397664 438442 520661 557331 499236 460178 432521 436219 452632 523845 560977 512045 488680
12607 488680 483429 500233 484644 448157 451563 409855 392426 436262 520658 564346 518144 511330
12595 511330 565842 503484 461417 480145 447634 450972 518932 560060 533376 491258 480115 509253
12583 509253 522953 538425 534238 504357 516898 590367 598883 528215 500141 458518 446489 439910
12571 439910 495834 577303 609115 552280 506127 481608 539352 590397 632531 637700 606226 598700
12559 598700 608187 569412 536115 581550 618369 604263 571413 552441 570175 546823 539976 555918
12547 555918 613419 627296 601217 600097 568335 539640 554723 591794 616391 602888 578475 591600
12535 591600 588536 615584 633931 628911 624191 636540 544891 509655 497810 529519 547875 524827
$$ packed form
12619C97664M0778Q2219L6670n8095l9058k7657L698J6413P1213L7132m8932k3365
12607D88680n251J6804j5589l6487L406m1708j7429M3836Q4396M3688m6202o814
12595E11330N4512o2358m2067J8728l2511L338O7960M1128k6684m2118j1143K9138
12583E09253J3700J5472m187k9881J2541P3469Q516p0668k8074m1623j2029o579
12571D39910N5924Q1469L1812n6835m6153k4519N7744N1045M2134N169l1474p526
12559E98700R487l8775l3297M5435L6819j4106l2850j8972J7734k3352o847J5942
12547E55918N7501J3877k6079j120l1762k8695J5083L7071K4597j3503k4413J3125
12535E91600l064K7048J8347n020m720J2349r1649l5236j1845L1709J8356k3048
$$ plain form
12523 524827 449578 423752 419624 437573 502906 530647 523630 528745 541620 602572 657194 598921
12511 598921 601427 606369 644706 655113 669213 692787 708369 719647 721177 711819 714233 682986
12499 682986 655721 616669 582803 576899 608724 637362 661394 670429 628659 610194 636772 617717
12487 617717 660189 648820 627439 668610 649340 655425 654331 700696 703697 661782 666981 668304
12475 668304 615511 635459 700071 721044 718783 730520 720513 669372 699226 740469 743010 744166
12463 744166 763743 737316 702600 709713 682594 659547 666310 680575 703059 679968 673382 704126
12451 704126 782640 777641 742780 729522 691591 667405 699272 723333 744284 751668 764912 784480
12439 784480 765188 743483 712793 754453 778383 812605 856420 843439 773241 782177 812066 845816
$$ packed form
12523E24827p5249k5826m128J7949O5333K7741p017N115J2875O0952N4622n8273
12511E98921K506M942L8337J0407J4100K3574J5582J1278J530r358K414l1247
12499F82986k7265l9052l3866n904L1825K8638K4032R035m1770j8465K6578j9055
12487F17717M2472j1369k1381M1171j9270O085j094M6365L001m1915N199J323
12475F68304n2793J9948O4612K0973k261J1737j0007n1141K9854M1243K541J156
12463G44166J9577k6427l4716P113k7119k3047O763J4265K2484k3091o586L0744
12451G04126P8514m999l4861j3258l7931k4186L1867K4061K0951P384J3244J9568
12439G84480j9292k1705l0690M1660K3930L4222M3815j2981p0198Q936K9889L3750
$$ plain form
12427 845816 790173 727860 685223 693487 712901 739221 710946 722256 721336 709794 694508 692282
12415 692282 702346 690616 680324 689206 739871 791678 804949 806344 721212 725952 781420 801019
12403 801019 790000 811630 834400 799769 789446 818529 838669 858147 832017 831431 839223 844479
12391 844479 842598 862698 848057 794840 818719 813101 804169 839041 799180 777350 819424 836013
12379 836013 854956 805629 875667 959464 910376 879845 915489 916193 916516 942195 915322 910095
12367 910095 874490 896998 912366 866880 830187 900036 930363 892864 872246 865602 869674 804801
12355 804801 779360 807587 862314 899739 874893 894037 938413 976791 912012 880627 857071
12344 857071 853921 872844 845761 844601 880788 879456 880116 928028 965952 965927 979991 987116 968767
$$ packed form
12427H45816n5643o2313m2637Q264J9414K6320k8275J1310r20j1542j5286k226
12415F92282J0064j1730j0292Q882N0665N1807J3271J395q5132M740N5468J9599
12403H01019j1019K1630K2770l4631j0323K9083K0140J9478k6130n86P792N256
12391H44479j881K0100j4641n3217K3879n618q932L4872l9861k1830M2074J6589
12379H36013J8943m9327P0038Q3797m9088l0531L5644P04L23K5679k6873n227
12367I10095l5605K2508J5368m5486l6693O9849L0327l7499k0618o644M072o4873
12355H04801k5441K8227N4727L7425k4846J9144M4376L8378o4779l1385k3556
12344H57071l150J8923k7083j160L6187j332O60M7912L7924k5J4064P125j8349
$$ plain form
12331 968767 948867 942412 938217 969975 990797 992470 995343 920134 867909 836912 903252 934827
12319 934827 943973 945909 907307 887254 903332 885380 899920 933314 946710 928576 919685 836339
12307 836339 822875 833119 882068 948231 965328 985290 1044093 1049847 1030665 965513 946919 941775
12295 941775 896775 908009 986025 1000945 1003105 990743 1025375 1047901 1054315 1006068 938939 948930
12283 948930 988261 1044256 1047891 1052324 1064185 1099610 1116813 1094428 1091028 1085991 1080439 1121536
12271 1121536 1102639 1089152 1080050 1081006 1068690 1094261 1094246 1126564 1147369 1113310 1108348 1101213 1069996
12258 1069996 1093574 1099108 1103667 1111796 1115214 1115185 1090097 1078126 1158941 1221508 1230698 1201916 1145427
12245 1145427 1129129 1152918 1165586 1137969 1066637 1055480 1141763 1183753 1213366 1187323 1220890
$$ packed form
12331I68767j9900o455m195L1758K0822J673K873p5209n2225l0997O6340L1575
12319I34827R146J936l8602k0053J6078j7952J4540L3394J3396j8134q891q3346
12307H36339j3464J0244M8949O6163J7097J9962N8803N754j9182o5152j8594n144
12295I41775m5000J1234P8016J4920K160j2362L4632K2526O414m8247o7129R991
12283I48930L9331N5995L635M433J1861L5425J7203k2385l400n037n552M1097
12271A121536j8897j3487r102R56j2316K5571j5L2318K0805l4059m962p135l1217
12258A069996K3578N534M559Q129L418k9k5088j1971Q0815O2567R190k8782n6489
12245A145427j6298K3789J2668k7617p1332j1157Q6283M1990K9613k6043L3567
$$ plain form
12234 1220890 1222686 1179114 1170726 1161407 1137391 1158343 1214295 1219034 1213082 1253951 1243344 1216825
12222 1216825 1222120 1228764 1252485 1283964 1296112 1198395 1094096 1062196 1174211 1212986 1206660
12211 1206660 1223151 1227827 1246995 1226505 1205138 1230518 1239565 1243046 1235178 1296349 1341676 1277816
12199 1277816 1292480 1310558 1284436 1282874 1321477 1328356 1313194 1285426 1314048 1421328 1441386
12188 1441386 1374941 1263106 1257376 1283744 1276361 1306873 1315785 1315144 1334642 1340144 1294280 1342006
12176 1342006 1354685 1301880 1307741 1375051 1403243 1404052 1429112 1391921 1306458 1298615 1303978 1309740
12164 1309740 1300651 1325358 1324623 1377013 1371861 1362684 1382941 1394124 1493198 1514469 1437993 1429752
12152 1429752 1397665 1364509 1347017 1358629 1404184 1409813 1433116 1465297 1485131 1485874 1481544 1492022
$$ packed form
12234A220890J796m3572q388r319k4016K0952N5952M739n952M0869j0607k6519
12222A216825N295O644K3721L1479J2148r7717j04299l1900J12015L8775o326
12211A206660J6491M676J9168k0490k1367K5380R047L481p868O1171M5327o3860
12199A277816J4664J8078k6122j562L8603O879j5162k7768K8622J07280K0058
12188A441386o6445j11835n730K6368p383L0512Q912o41J9498N502m5864M7726
12176A342006J2679n2805N861O7310K8192Q09K5060l7191q5463p843N363N762
12164A309740r089K4707p35N2390n152r177K0257J1183R9074K1271p6476q241
12152A429752l2087l3156j7492J1612M5555N629K3303L2181J9834P43m330J0478
$$ plain form
12140 1492022 1438166 1460414 1428898 1369157 1391465 1423001 1413652 1389866 1421759 1459938 1543675
12129 1543675 1570351 1511140 1527963 1503956 1447609 1407978 1455307 1532282 1531695 1489793 1546778 1553395
12117 1553395 1493245 1455578 1474255 1480535 1531918 1527249 1551010 1540401 1561311 1570853 1590667 1563372
12105 1563372 1543088 1561784 1554721 1562014 1587325 1611752 1592091 1618189 1581516 1561387 1569474 1594767
12093 1594767 1587608 1586203 1588376 1605300 1626797 1638919 1608797 1572327 1579287 1632924 1644895 1663539
12081 1663539 1636518 1646628 1726426 1746577 1748678 1765549 1735989 1704966 1683657 1693850 1730747
12070 1730747 1688974 1676239 1643763 1600503 1645133 1669131 1639184 1637991 1692496 1732854 1725864 1735365
12058 1735365 1727276 1736377 1733262 1717823 1712441 1685113 1624042 1590744 1642848 1620416 1583233 1640766
$$ packed form
12140A492022n3856K2248l1516n9741K2308L1536r349k3786L1893L8179Q3737
12129A543675K6676n9211J6823k4007n6347l9631M7329P6975n87m1902N6985O617
12117A553395o0150l7667J8677O280N1383m669K3761j0609K0910R542J9814k7295
12105A563372k0284J8696p063P293K5311K4427j9661K6098l6673k0129Q087K5293
12093A594767p159j405K173J6924K1497J2122l0122l6470O960N3637J1971J8644
12081A663539k7021J0110P9798K0151K101J6871k9560l1023k1309J0193L6897
12070A730747m1773j2735l2476m3260M4630K3998k9947j193N4505M0358o990R501
12058A735365q089R101l115j5439n382k7328o1071l3298N2104k2432l7183N7533
$$ plain form
12046 1640766 1674599 1670801 1704329 1698651 1654998 1724015 1773114 1786746 1803089 1808581 1768283 1711335
12034 1711335 1649752 1641382 1615071 1614934 1668328 1722024 1734047 1697206 1669605 1686732 1692965 1684828
12022 1684828 1759359 1796587 1809643 1762217 1674483 1691721 1726896 1768062 1759243 1829168 1827371 1759643
12010 1759643 1730905 1746201 1805903 1799382 1794071 1806201 1862456 1915276 1954737 1916483 1862483 1854243
11998 1854243 1841073 1898684 1917260 1912839 1859238 1883939 1910300 1878794 1878425 1865140 1857126 1839355
11986 1839355 1835390 1857341 1925990 2017895 2037345 1985451 2019360 2062217 2061038 2087713 2109282 2123829
11974 2123829 2135575 2183496 2209615 2272715 2343807 2354636 2260755 2241142 2267828 2278004 2274443
11963 2274443 2274958 2258313 2262499 2248759 2273662 2253715 2272403 2215044 2148370 2131455 2150588 2145262
$$ packed form
12046A640766L3833l798L3528n678m3653O9017M9099J3632J6343N492m0298n6948
12034A711335o1583q370k6311j37N3394N3696J2023l6841k7601J7127O233q137
12022A684828P4531L7228J3056m7426q7734J7238L5175M1166q819O9925j797o7728
12010A759643k8738J5296N9702o521n311J2130N6255N2820L9461l8254n4000q240
11998A854243j3170N7611J8576m421n3601K4701K6361l1506l69j3285q014j7771
11986A839355l965K1951O8649R1905J9450n1894L3909M2857j179K6675K1569J4547
11974B123829J1746M7921K6119O3100P1092J0829r3881j9613K6686J0176l561
11963B274443N15j6645M186j3740K4903j9947J8688n7359o6674j6915J9133n326
$$ plain form
11951 2145262 2214414 2231001 2223347 2200882 2235194 2287855 2363087 2411600 2462520 2492111 2501859 2492019
11939 2492019 2521795 2591207 2568433 2556075 2544792 2498533 2513830 2516508 2506435 2449501 2336308
11928 2336308 2248201 2221200 2206963 2239951 2236246 2213807 2250843 2183122 2123755 2125405 2161409 2199277
11916 2199277 2223692 2174947 2205494 2239473 2338218 2380517 2381855 2393387 2388057 2381074 2389128 2361830
11904 2361830 2310027 2267113 2206739 2126749 2157493 2115814 2053708 2021373 2020949 2006687 1961085 1971895
11892 1971895 2001981 1979864 1962454 1965470 1945500 1912829 1891428 1869560 1881669 1865337 1861085 1854449
11880 1854449 1863260 1879740 1811443 1831062 1826541 1822862 1809047 1813766 1790128 1809432 1839884 1862847
11868 1862847 1823856 1827315 1898609 1946369 1931855 1941004 1984607 1971313 1895796 1841475 1838730 1845372
$$ packed form
11951B145262O9152J6587p654k2465L4312N2661P5232M8513N0920K9591R748r840
11939B492019K9776O9412k2774j2358j1283m6259J5297K678j0073n6934j13193
11928B336308q8107k7001j4237L2988l705k2439L7036o7721n9367J650L6004L7868
11916B199277K4415m8745L0547L3979R8745M2299J338J1532n330o983Q054k7298
11904B361830n1803m2914o0374p9990L0744m1679o2106l2335m24j4262m5602J0810
11892A971895L0086k2117j7410L016j9970l2671k1401k1868J2109j6332m252o636
11880A854449Q811J6480o8297J9619m521l679j3815M719k3638J9304L0452K2963
11868A862847l8991L459P1294M7760j4514R149M3603j3294p5517n4321k745O642
$$ plain form
11856 1845372 1787160 1819571 1850629 1818776 1815375 1804858 1828560 1833264 1845748 1833141 1737862 1655138
11844 1655138 1615363 1666158 1732697 1758405 1758133 1771837 1847752 1810322 1817422 1795101 1823372 1820990
11832 1820990 1853693 1827178 1787895 1754542 1761869 1793250 1737535 1710512 1757727 1743430 1702408
11821 1702408 1720708 1705384 1682512 1665572 1665283 1664294 1672367 1723659 1699401 1704630 1764325 1780204
11809 1780204 1753731 1731089 1727933 1739889 1778734 1804263 1775941 1742213 1693168 1684759 1716622 1751612
11797 1751612 1775952 1798450 1788958 1787094 1768721 1752361 1763746 1817011 1785947 1760648 1708725 1736811
11785 1736811 1762760 1775285 1726748 1742700 1793817 1797902 1779915 1777497 1738863 1744057 1778732 1768226
11773 1768226 1792218 1847196 1834744 1816310 1849000 1803008 1743382 1751031 1760947 1764293 1768867 1808731
$$ packed form
11856A845372n8212L2411L1058l1853l401j0517K3702M704J2484j2607r5279q2724
11844A655138l9775N0795O6539K5708k72J3704P5915l7430P100k2321K8271k382
11832A820990L2703k6515l9283l3353P327L1381n5715k7023M7215j4297m1022
11821A702408J8300j5324k2872j6940k89r89Q073N1292k4258N229N9695J5879
11809A780204k6473k2642l156J1956L8845K5529k8322l3728m9045q409L1863L4990
11797A751612K4340K2498r492j864j8373j6360J1385N3265l1064k5299n1923K8086
11785A736811K5949J2525m8537J5952N1117M085j7987k418l8634N194L4675j0506
11773A768226K3992N4978j2452j8434L2690m5992n9626P649R916L346M574L9864
$$ plain form
11761 1808731 1807065 1813688 1752428 1685620 1738689 1826656 1843860 1869346 1845622 1767352 1730107 1723388
11749 1723388 1773549 1802104 1781089 1756865 1761844 1740519 1705482 1705346 1706146 1706007 1715493 1706457 1694760
11736 1694760 1690002 1681365 1665475 1691921 1678772 1683970 1694625 1691245 1690925 1679709 1741373 1794616
11724 1794616 1806761 1803469 1754055 1737870 1696635 1662314 1628952 1648015 1635048 1640814 1631563 1649133
11712 1649133 1664622 1646169 1624496 1638746 1610049 1578822 1538930 1497718 1485770 1453294 1473245
11701 1473245 1525775 1559895 1565859 1573668 1570869 1563256 1550371 1554073 1555920 1612093 1632205 1598147
11689 1598147 1622198 1606315 1619305 1608708 1568784 1555080 1582334 1604809 1608076 1644927 1660830
11678 1660830 1618694 1613473 1663671 1672928 1613825 1606168 1622648 1614585 1623781 1636615 1643959 1662273
$$ packed form
11761A808731j666O623o1260o6808N3069Q7967J7204K5486k3724p8270l7245o719
11749A723388N0161K8555k1015k4224M979k1325l5037j36Q00j39R486r036j1697
11736A694760m758q637j5890K6446j3149N198J0655l380l20j1216O1664N3243
11724A794616J2145l292m9414j6185m1235l4321l3362J9063j2967N766r251J7570
11712A649133J5489j8453k1673J4250k8697l1227l9892m1212j1948l2476J9951
11701A473245N2530L4120N964P809k799p613j2885L702J847N6173K0112l4058
11689A598147K4051j5883J2990j0597l9924j3704K7254K2475L267L6851J5903
11678A660830m2136n221N0198R257n9103p657J6480q063R196J2834P344J8314
$$ plain form
11666 1662273 1722857 1750172 1766728 1752341 1765232 1741260 1724885 1743651 1711457 1750425 1825130
11655 1825130 1908056 1975581 2065334 2174217 2359836 2576362 2925232 3527009 4483185 5898236
11645 5898236 7794304 9819708 10952764 9826445 7415484 5437348 4220387 3470716
11637 3470716 3015476 2707593 2476462 2301024 2203813 2085131 2030791 2008060 2021201 2046856
11627 2046856 2018570 1973076 1926248 1894169 1903645 1943882 1946174 1943362 1916949 1930775 1920673 1931528
11615 1931528 1910482 1937193 1973808 1956042 1972930 1959708 1912071 1857389 1880071 1936253 2021619
11604 2021619 2049357 2044804 2071386 2123182 2133976 2199646 2268239 2249849 2252991 2242642 2250532 2277004
11592 2277004 2273608 2356624 2454887 2473760 2497386 2577839 2645302 2708206 2741523 2828006 2888954
$$ packed form
11666A662273O0584K7315J6556j4387J2891k3972j6375J8766l2194L8968P4705
11655A825130Q2926O7525Q9753J08883J85619K16526L48870O01777R56176J415051
11645E898236J896068K025404J133056j126319k410961j978136j216961p49671
11637C470716m55240l07883k31131j75438r7211j18682n4340k2731J3141K5655
11627B046856k8286m5494m6828l2079R476M0237K292k812k6413J3826j0102J0855
11615A931528k1046K6711L6615j7766J6888j3222m7637n4682K2682N6182Q5366
11604B021619K7738m553K6582N1796J0794O5670O8593j8390L142j0349P890K6472
11592B277004l396Q3016R8263J8873K3626Q0453O7463O2904L3317Q6483O0948
$$ plain form
11581 2888954 2882897 2929104 2939225 3031889 3139732 3181455 3291298 3373407 3472987 3548165 3583171
11570 3583171 3665414 3779514 3947717 4175319 4321470 4429212 4562202 4779066 5034821 5297213
11560 5297213 5548086 5789607 6133214 6568393 6988300 7434045 7967205 8567247 9216719
11551 9216719 9945299 10878464 11967624 13221000 14693294 16421994 18421472 20746450
11543 20746450 23547138 26900451 30966956 35841057 41636271 48422449 56133408 64585652
11535 64585652 73320423 81568878 88396609 92850736 94288785 92607310 88439845 82762202
11527 82762202 76514311 70353280 64721885 60013730 56321075 53519633 51621189 50517429
11519 50517429 50144444 50531202 51629949 53544431 56209667 59647562 63866277 68872993
$$ packed form
11581B888954o057M6207J0121R2664J07843M1723J09843Q2109R9580P5178L5006
11570C583171Q2243J14100J68203K27602J46151J07742J32990K16864K55755K62392
11560E297213K50873K41521L43607M35179M19907M45745N33160O00042O49472
11551I216719P28580R33165J089160J253376J472294J728700J999478K324978
11543B0746450K800688L353313M066505M874101N795214O786178P710959Q452244
11535F4585652Q734771Q248455O827731M454127J438049j681475m167465n677643
11527H2762202o247891o161031n631395m708155l692655k801442j898444j103760
11519E0517429l72985L86758J098747J914482K665236L437895M218715N006716
$$ plain form
11511 68872993 74726572 81396136 88844462 96896917 105391421 114001514 122356674 130026371
11503 130026371 136537715 141425457 144392544 145076042 143456274 139796855 134346606 127464173
11495 127464173 119686517 111489726 103192811 95147359 87630791 80790210 74731524 69481497
11487 69481497 64994187 61357111 58490704 56370877 55040518 54503666 54816716 56043393
11479 56043393 58193703 61421524 65933945 71808961 78896930 86990229 95505102 103534570
11471 103534570 109860913 113272955 112898588 108536639 100841551 91025191 80430429 69990649
11463 69990649 60458254 52135030 45037162 39049287 33997332 29762768 26229633 23229137
11455 23229137 20633241 18528440 16700619 15024683 13615140 12437892 11392759 10538886
$$ packed form
11511F8872993N853579O669564P448326Q052455Q494504Q610093Q355160P669697
11503A30026371O511344M887742K967087O83498j619768l659419n450249o882433
11495A27464173p777656q196791q296915q045452p516568o840581o058686n250027
11487F9481497m487310l637076k866407k119827j330359n36852L13050J226677
11479E6043393K150310L227821M512421N875016P087969Q093299Q514873Q029468
11471A03534570O326343L412042l74367m361949p695088r816360j0594762j0439780
11463F9990649r532395q323224p097868n987875n051955m234564l533135l000496
11455B3229137k595896k104801j827821j675936j409543j177248j045133q53873
$$ plain form
11447 10538886 9780387 9090187 8438296 7890108 7465535 7014816 6625237 6276015 5957340
11438 5957340 5674554 5449585 5201583 4962618 4775856 4604299 4378859 4158599 3985147
11429 3985147 3868160 3736073 3627749 3540545 3481574 3396715 3244804 3138689 3028948 2900885
11419 2900885 2883903 2858893 2821623 2755677 2720307 2695981 2593616 2488138 2478422 2470382 2455201
11408 2455201 2396622 2342075 2336388 2287679 2253080 2190559 2135080 2131132 2092381 2045152 1992784 2013002
11396 2013002 1999309 1953118 1916357 1898765 1873543 1888868 1910568 1895410 1889094 1870353 1795737
11385 1795737 1774071 1777694 1786868 1775836 1718113 1742813 1776488 1811379 1789311 1761870 1716747 1758967
11373 1758967 1727630 1708506 1677504 1672616 1687847 1671018 1659416 1597320 1498497 1487750 1449650
$$ packed form
11447A0538886p58499o90200o51891n48188m24573m50719l89579l49222l18675
11438E957340k82786k24969k48002k38965j86762j71557k25440k20260j73452
11429C985147j16987j32087j08324q7204n8971q4859j51911j06115j09741j28063
11419B900885j6982k5010l7270o5946l5370k4326j02365j05478r716q040j5181
11408B455201n8579n4547n687m8709l4599o2521n5479l948l8751m7229n2368K0218
11396B013002j3693m6191l6761j7592k5222J5325K1700j5158o316j8741p4616
11385A795737k1666L623R174j1032n7723K4700L3675L4891k2068k7441m5123M2220
11373A758967l1337j9124l1002m888J5231j6829j1602o2096r8823j0747l8100
$$ plain form
11362 1449650 1436874 1459754 1459865 1422050 1364041 1368013 1423523 1417696 1443230 1418784 1406434 1434476
11350 1434476 1368189 1351100 1349081 1319764 1306921 1327884 1348858 1371939 1333332 1315998 1344501
11339 1344501 1340914 1336909 1285262 1233121 1233075 1213267 1221061 1177890 1130663 1094926 1079149 1015358
11327 1015358 1003722 1015382 1027010 1010249 1028160 1088918 1090168 1048423 983709 949295 955961 949054
11315 949054 989008 1000509 1015842 1062029 1041946 1018094 958255 912343 879592 852352 825668
11304 825668 811058 811742 829982 875942 912746 929736 953174 920959 946407 941649 957201 933304
11292 933304 900592 910762 877297 889678 916429 893694 880708 849725 800092 777725 820236
11281 820236 846823 873633 865909 817348 850738 850697 844514 893165 898512 906822 866903 857275 846182
$$ packed form
11362A449650j2776K2880J11l7815n8009L972N5510n827K5534k4446j2350K8042
11350A434476o6287j7089k019k9317j2843K0963K0974K3081l8607j7334K8503
11339A344501l587m005n1647n2141m6j9808P794m3171m7227l5737j5777o3791
11327A015358j1636J1660J1628j6761J7911O0758J250m1745o4714l4414O666o907
11315I49054L9954J1501J5333M6187k0083k3852n9839m5912l2751k7240k6684
11304H25668j4610O84J8240M5960L6804J6990K3438l2215K5448m758J5552k3897
11292I33304l2712J0170l3465J2381K6751k2735j2986l0983m9633k2367M2511
11281H20236K6587K6810p724m8561L3390m1o183M8651N347Q310l9919r628j1093
$$ plain form
11268 846182 819364 807292 782605 726236 754171 796629 785110 791098 779018 753901 811722 878562
11256 878562 851184 813323 795707 809217 788023 775147 771233 771528 796384 804643 789601 785659
11244 785659 776361 767513 773597 761194 792487 779967 756368 696203 643565 665953 648601 648422
11232 648422 629392 700129 748287 714969 680541 682419 723777 724664 707329 729068 776641 707627
11220 707627 659405 657994 655496 608310 627244 620735 643476 697307 704330 748478 757604 740132
11208 740132 667311 626766 644226 653742 666266 631470 645113 664518 659005 642734 632956 680988
11196 680988 716665 656448 664338 630141 645530 704546 695098 707678 713494 736575 722024 747314
11184 747314 725234 686277 733868 790246 759229 715460 723370 753006 769666 745183 710027 698775
$$ packed form
11268H46182k6818j2072k4687n6369K7935M2458j1519N988j2080k5117N7821O6840
11256H78562k7378l7861j7616J3510k1194j2876l914K95K4856Q259j5042l942
11244G85659r298q848O084j2403L1293j2520k3599o0165n2638K2388j7352j79
11232F48422j9030P0737M8158l3318l4428J878M1358Q87j7335K1739M7573o9014
11220G07627m8222j411k498m7186J8934o509K2741N3831P023M4148R126j7472
11208G40132p2821m0545J7460R516J2524l4796J3643J9405n513j6271r778M8032
11196F80988L5677o0217P890l4197J5389N9016r448J2580N816K3081j4551K5290
11184G47314k2080l8957M7591N6378l1017m3769P910K9636J6660k4483l5156j1252
$$ plain form
11172 698775 672091 671713 642480 599926 594774 614168 634791 649330 624000 623272 663229 703338
11160 703338 757347 764066 791603 816515 768688 751477 755258 752724 768442 760980 719223 671339
11148 671339 656442 644711 637196 670812 766483 780796 704240 691302 730771 768594 774196 774894
11136 774894 748873 719987 778445 800305 841832 837080 740549 739043 773503 770836 677240 633642
11124 633642 677784 751788 852139 894828 876012 853118 896659 907894 872376 839394 889881
11113 889881 915312 948227 1000778 1030371 1021463 1023259 1027346 1033577 998449 987294 1021008 994111
11101 994111 1026649 1075451 1083159 1107035 1159908 1153925 1172791 1255176 1286018 1290798 1306764 1276609
11089 1276609 1245948 1285616 1302816 1323195 1309430 1290514 1333659 1300500 1256691 1203669 1217772
$$ packed form
11172F98775k6684l78k9233m2554n152J9394K0623J4539k5330p28L9957M0109
11160G03338N4009O719K7537K4912m7827j7211L781k534J5718p462m1757m7884
11148F71339j4897j1731p515L3616R5671J4313p6556j2938L9469L7823N602O98
11136G74894k6021k8886N8458K1860M1527m752r6531j506L4460k667r3596m3598
11124F33642M4142P4004J00351M2689j8816k2894M3541J1235l5518l2982N0487
11113H89881K5431L2915N2551K9593q908J796M087O231l5128j1155L3714k6897
11101I94111L2538M8802P708K3876N2873n983J8866Q2385L0842M780J5966l0155
11089A276609l0661L9668J7200K0379j3765j8916M3145l3159m3809n3022J4103
$$ plain form
11078 1217772 1287383 1353424 1308442 1275910 1257713 1271605 1257086 1267099 1326149 1324443 1320727 1367357
11066 1367357 1404634 1459118 1484237 1548600 1541538 1560052 1544387 1532672 1565990 1637080 1641876 1622747
11054 1622747 1628129 1576282 1517240 1488516 1490939 1484991 1461452 1384425 1389193 1382073 1369085 1339336
11042 1339336 1324977 1267380 1208488 1218885 1263136 1287523 1340973 1396722 1401941 1471912 1527058
11031 1527058 1580162 1547270 1541640 1532915 1527132 1528240 1527470 1536325 1591333 1640622 1661939 1585761 1513329
11018 1513329 1402963 1302695 1184325 1091474 1051062 1065383 1075724 1109579 1126623 1153316 1167210
11007 1167210 1109392 1067972 946419 921727 874564 847342 872467 886637 869474 902769 913564
10996 913564 824281 838395 857098 792940 744848 737333 714816 675865 697240 639824 663540 732604
$$ packed form
11078A217772O9611O6041m4982l2532j8197J3892j4519J0013N9050j706l716M6630
11066A367357L7277N4484K5119O4363p062J8514j5665j1715L3318P1090M796j9129
11054A622747N382n1847n9042k8724K423n948k3539p7027M768p120j2988k9749
11042A339336j4359n7597n8892J0397M4251K4387N3450N5749N219O9971N5146
11031A527058N3104l2892n630q725n783J108p70Q855N5008M9289K1317p6178p2432
11018A513329j10366j00268j18370r2851m0412J4321J0341L3855J7044K6693J3894
11007A167210n7818m1420j21553k4692m7163k7222K5125J4170j7163L3295J0795
10996I13564q9283J4114J8703o4158m8092p515k2517l8951K1375n7416K3716O9064
$$ plain form
10984 732604 712336 700951 717735 715739 709414 768082 785759 813028 797698 773959 742831 708506
10972 708506 686391 681041 717709 727189 706191 667396 655387 663639 690598 664679 704698 752066
10960 752066 783232 737399 705730 672320 679984 729289 729303 725909 728536 746020 746731 709972 745239
10947 745239 796729 802910 804900 833326 907901 918843 841707 815521 813071 859851 901556 904988
10935 904988 872253 847126 910490 924930 905025 922046 900003 887031 896369 899933 868668 870261
10923 870261 830598 877314 884251 880764 899550 921755 921371 898609 854465 811067 846754 895501
10911 895501 865996 828456 860094 882489 981646 1003000 945212 925505 911383 914931 974614 979228
10899 979228 920555 918625 957898 983146 1059120 1124266 1094923 991189 891863 916378 935642
$$ packed form
10984G32604k0268j1385J6784j996o325N8668J7677K7269j5330k3739l1128l4325
10972G08506k2115n350L6668R480k0998l8795j2009Q252K6959k5919M0019M7368
10960G52066L1166m5833l1669l3410P664M9305J4l394K627J7484P11l6759L5267
10947G45239N1490O181J990K8426P4575J0942p7136k6186k450M6780M1705L432
10935I04988l2735k5127O3364J4440j9905J7021k2043j2972R338L564l1265J593
10923H70261l9663M6716O937l487J8786K2205l84k2762m4144m3398L5687M8747
10911H95501k9505l7540L1638K2395R9157K1354n7788j9707j4122L548N9683M614
10899I79228n8673j930L9273K5248P5974O5146k9343j03734r9326K4515J9264
$$ plain form
10888 935642 966888 1019193 1054792 1001621 1044687 1081578 1122726 1166018 1200890 1147200 1128047
10877 1128047 1139909 1139365 1161479 1137383 1091790 1080250 1091933 1133537 1159239 1171143 1206315 1251575
10865 1251575 1266214 1229545 1185174 1189676 1241450 1328667 1366894 1319805 1289985 1277296 1286754 1309269
10853 1309269 1334006 1333155 1383293 1395866 1412961 1446954 1464225 1446959 1470755 1595689 1639689
10842 1639689 1617677 1579477 1541666 1600223 1630364 1602951 1638944 1666691 1676049 1667357 1650070 1672000
10830 1672000 1694256 1655534 1646530 1700703 1769612 1782042 1753634 1788858 1861780 1880536 1890857
10819 1890857 1894328 1969144 1987094 2019550 2044375 2075788 2101300 2130862 2177025 2209459 2219481
10808 2219481 2197604 2211519 2257472 2310070 2336124 2346989 2355192 2385667 2366331 2422628 2452181
$$ packed form
10888I35642L1246N2305L5599n3171M3066L6891M1148M3292L4872n3690j9153
10877A128047J1862n44K2114k4096m5593j1540J1683M1604K5702J1904L5172M5260
10865A251575J4639l6669m4371M502N1774Q7217L8227m7089k9820j2689R458K2515
10853A309269K4737q51N0138J2573J7095L3993J7271j7266K3796J24934M4000
10842A639689k2012l8200l7811N8557L0141k7413L5993K7747R358q692j7287K1930
10830A672000K2256l8722r004N4173O8909J2430k8408L5224P2922J8756J0321
10819A890857L471P4816J7950L2456K4825L1413K5512K9562M6163L2434J0022
10808B219481k1877J3915M5953N2598K6054J0865Q203L0475j9336N6297K9553
$$ plain form
10797 2452181 2519579 2568178 2612660 2650225 2712625 2744448 2768121 2779487 2782558 2826943 2877027
10786 2877027 2935826 2969654 2974767 3007580 3011258 3055304 3109911 3151589 3207268 3262647 3370507
10775 3370507 3461236 3541296 3618592 3654619 3687104 3762223 3836423 3888995 3965069 4022823 4158100
10764 4158100 4302023 4392554 4461379 4504902 4625611 4755154 4852719 4900426 5000612 5156890
10754 5156890 5320073 5478129 5612132 5728665 5902251 6069667 6181175 6338036 6505280
10745 6505280 6680347 6839467 7029305 7247690 7485667 7698758 7986268 8277337 8525003
10736 8525003 8816606 9113451 9456830 9776675 10097668 10473744 10927373 11339350 11745141
10727 11745141 12170857 12693389 13211968 13764785 14397957 15013309 15639530 16292268 17051832
$$ packed form
10797B452181O7398M8599M4482L7565O2400L1823K3673J1366L071M4385N0084
10786B877027N8799L3828N113L2813L678M4046N4607M1678N5679N5379J07860
10775C370507R0729Q0060P7296L6027L2485P5119P4200N2572P6074N7754J35277
10764D158100J43923R0531O8825M3523J20709J29543R7565M7707J00186J56278
10754E156890J63183J58056J34003J16533J73586J67416J11508J56861J67244
10745F505280J75067J59120J89838K18385K37977K13091K87510K91069K47666
10736H525003K91603K96845L43379L19845L20993L76076M53629M11977M05791
10727A1745141M25716N22532N18579N52817O33172O15352O26221O52738P59564
$$ plain form
10718 17051832 17832623 18610555 19532408 20513339 21579512 22767763 23953821 25306248 26707570
10709 26707570 28102676 29568143 31159979 32856480 34619074 36484478 38427192 40380218
10701 40380218 42406209 44396855 46362771 48382054 50336230 52220754 54010835 55604893
10693 55604893 57066170 58450843 59643037 60705314 61660458 62472658 63191951 63798530 64319027
10684 64319027 64789686 65262637 65735693 66284639 66787685 67283361 67824048 68401561 68926053
10675 68926053 69419371 69933263 70452884 70977581 71527268 72022943 72440885 72827052 73210137
10666 73210137 73527946 73776672 73966654 74112813 74140985 74068252 73896752 73658812 73278036 72842410
10656 72842410 72373046 71837644 71235840 70658443 70009332 69318582 68610553 67895464 67214675
$$ packed form
10718A7051832P80791P77932R21853R80931J066173J188251J186058J352427J401322
10709B6707570J395106J465467J591836J696501J762594J865404J942714J953026
10701D0380218K025991J990646J965916K019283J954176J884524J790081J594058
10693E5604893J461277J384673J192194J062277R55144Q12200P19293O06579N20497
10684F4319027M70659M72951M73056N48946N03046M95676N40687N77513N24492
10675F8926053M93318N13892N19621N24697N49687M95675M17942L86167L83085
10666G3210137L17809K48726J89982J46159K8172p2733j71500k37940l80776m35626
10656G2842410m69364n35402o01804n77397o49111o90750p08029p15089o80789
$$ plain form
10647 67214675 66495322 65668987 64888835 64201974 63472382 62821381 62244079 61685171 61216531
10638 61216531 60814903 60461384 59958418 59312015 58508436 57599383 56665515 55671446 54580305
10629 54580305 53390026 52096773 50815120 49545563 48317801 47194175 46263654 45505826
10621 45505826 45072474 45179125 45982895 47585721 50094610 53397080 56769898 58909576
10613 58909576 58619912 56124404 52784744 49995350 48455125 48700563 51073177 55732672
10605 55732672 62861084 71918842 80961252 86443036 85197316 78327159 70128050 63705537
10597 63705537 60281092 60106923 63409808 70339985 80726965 93231122 104581325 109571792
10589 109571792 104379880 91566848 77648732 66708971 59711970 56368682 56363189 59360858
$$ packed form
10647F7214675p19353q26335p80152o86861p29592o51001n77302n58908m68640
10638F1216531m01628l53519n02966o46403q03579r09053r33868r94069j091141
10629E4580305j190279j293253j281653j269557j227762j123626r30521p57828
10621D5505826m33352J06651Q03770J602826K508889L302470L372818K139678
10613E8909576k89664k495508l339660k789394j540225K45438K372614M659495
10605E5732672P128412R057758R042410N481784j245720o870157q199109o422513
10597F3705537l424445j74169L302885O930177J0386980J2504157J1350203M990467
10589A09571792n191912j2813032j3918116j0939761o997001l343288n493K997669
$$ plain form
10581 59360858 64934397 71713734 77214262 77932779 71883075 61319860 50730778 42584339
10573 42584339 37297805 34386092 33301476 33721159 35175792 36930885 37838052 36671315
10565 36671315 32927912 27641137 22489308 18278581 15080761 12813454 11163043 9899529
10557 9899529 8947319 8180272 7620556 7137263 6717780 6350054 6067818 5774894 5512381
10548 5512381 5305139 5081927 4886951 4704514 4534997 4380599 4305774 4206472 4088687 3940905
10538 3940905 3821129 3727858 3604085 3583921 3550532 3467666 3288197 3183139 3090654 2993384
10528 2993384 2955312 2928419 2910677 2891408 2876271 2895832 2900954 2910218 2896994 2891953 2874118 2822120
10516 2822120 2776387 2750376 2683065 2603236 2598498 2616462 2605177 2553701 2504693 2479879 2377806
$$ packed form
10581E9360858N573539O779337N500528P18517o049704j0563215j0589082q146439
10573D2584339n286534k911713j084616M19683J454633J755093R07167j166737
10565C6671315l743403n286775n151829m210727l197820k267307j650411j263514
10557I899529r52210p67047n59716m83293m19483l67726k82236k92924k62513
10548E512381k07242k23212j94976j82437j69517j54398p4825r9302j17785j47782
10538C940905j19776r3271j23773k0164l3389q2866j79469j05058r2485r7270
10528B993384l8072k6893j7742j9269j5137J9561N122R264j3224n041j7835n1998
10516B822120m5733k6011o7311p9829m738J7964j1285n1476m9008k4814j02073
$$ plain form
10505 2377806 2297200 2268902 2240068 2223346 2176933 2139694 2108677 2113506 2066896 2099965 2127023
10494 2127023 2043854 1964097 1981905 1997978 2031577 2008364 1951588 1938885 1913580 1872800 1809896
10483 1809896 1784149 1758889 1761131 1765602 1763828 1739039 1704524 1737423 1776165 1769547 1813859 1879489
10471 1879489 1923488 1911168 1856039 1777314 1677117 1650127 1569719 1510182 1535612 1553788 1557925
10460 1557925 1556722 1588570 1528709 1478206 1505258 1505940 1435111 1448224 1452245 1419734 1417217 1404981
10448 1404981 1333028 1280144 1283332 1319191 1334900 1354812 1333579 1292749 1292707 1249462 1160683 1090415
10436 1090415 1079000 1079913 1101174 1102484 1068969 1050567 1015349 1040395 1050429 1042634 1021032 980877
10424 980877 991595 992731 955332 975592 950375 945890 957868 956157 962947 940779 882886 853301
$$ packed form
10505B377806q0606k8298k8834j6722m6413l7239l1017M829m6610L3069K7058
10494B127023q3169p9757J7808J6073L3599k3213n6776j2703k5305m0780o2904
10483A809896k5747k5260K242M471j774k4789l4515L2899L8742o618M4312O5630
10471A879489M3999j2320n5129p8725j00197k6990q0408n9537K5430J8176M137
10460A557925j203L1848n9861n0503K7052O82p0829J3113M021l2511k517j2236
10448A404981p1953n2884L188L5859J5709J9912k1233m0830m2m3245q8779p0268
10436A090415j1415R13K1261J310l3515j8402l5218K5046J0034p795k1602m0155
10424I80877J0718J136l7399K0260k5217m485J1978j711O790k2168n7893k9585
$$ plain form
10412 853301 890522 984528 1026655 958980 919447 956235 963524 953731 931618 926785 952202 1002140
10400 1002140 966955 940076 927539 900131 916716 916526 913227 919222 938801 976685 984493 933671
10388 933671 862530 808804 815581 864647 884010 934786 925748 929400 878485 794656 790923 854275
10376 854275 838593 831040 797281 808384 863115 869432 834450 827150 885029 857214 837143 826744
10364 826744 804440 836978 881511 881276 824969 765186 805638 848204 847120 833581 817775 847266
10352 847266 854977 852793 826376 779893 780689 726732 632559 595648 632902 682983 818739 927549
10340 927549 1001704 981277 976676 944064 952630 979927 1009172 1040566 994511 986376 973004 992976
10328 992976 1007937 958619 962457 1003995 992180 985284 983606 978608 955994 929400 979112 979265 1002045
$$ packed form
10412H53301L7221R4006M2127o7675l9533L6788P289r793k2113m833K5417M9938
10400A002140l5185k6879j2537k7408J6585j90l299N995J9579L7884P808n0822
10388I33671p1141n3726O777M9066J9363N0776r038L652n0915q3829l733O3352
10376H54275j5682p553l3759J1103N4731O317l4982p300N7879k7815k0071j0399
10364H26744k2304L2538M4533k35n6307n9783M0452M2566j084j3539j5806K9491
10352H47266P711k184k6417m6483P96n3957r4173l6911L7254N0081J35756J08810
10340I27549P4155k0427m601l2612Q566K7297K9245L1394m6055q135j3372J9972
10328I92976J4961m9318L838M1538j1815o896j678m998k2614k6594M9712J53K2780
$$ plain form
10315 1002045 1013597 1015687 1054697 1074897 1063490 1077027 1148129 1161182 1167565 1169515 1211623 1230549
10303 1230549 1276980 1323499 1286758 1275205 1313574 1326433 1347927 1332580 1360705 1429513 1482026
10292 1482026 1472651 1475784 1481821 1530085 1559358 1584799 1599014 1653823 1764943 1881967 1994593
10281 1994593 2037677 2055776 2130433 2153939 2159342 2207784 2241388 2274190 2317636 2440333 2571379
10270 2571379 2659602 2764579 2880002 2964200 3066067 3183341 3311108 3408603 3483741 3580514
10260 3580514 3769355 3886803 3998710 4120321 4305524 4527283 4834396 5104783 5354220
10251 5354220 5666965 5999828 6383744 6836034 7365619 7969542 8629496 9355337 10202579
10242 10202579 11196982 12359380 13717205 15318590 17133956 19167749 21293233 23420157
$$ packed form
10315A002045J1552K090L9010K0200j1407J3537P1102J3053O383J950M2108J8926
10303A230549M6431M6519l6741j1553L8369J2859K1494j5347K8125O8808N2513
10292A482026r375L133O037M8264K9273K5441J4215N4809J11120J17024J12626
10281A994593M3084J8099P4657K3506N403M8442L3604L2802M3446J22697J31046
10270B571379Q8223J04977J15423Q4198J01867J17274J27767R7495P5138R6773
10260C580514J88841J17448J11907J21611J85203K21759L07113K70387K49437
10251E354220L12745L32863L83916M52290N29585O03923O59954P25841Q47242
10242A0202579R94403J162398J357825J601385J815366K033793K125484K126924
$$ plain form
10234 23420157 25610050 28012357 30901675 34573856 39325441 45665841 54089112 65290450
10226 65290450 80466384 101398057 130545481 171188017 226333961 296340598 374769391
10219 374769391 444173529 475907919 448372365 375626274 293407428 224127008 172228568
10212 172228568 134637656 107376831 87310948 72246164 60706882 51773728 44854859
10205 44854859 39431339 35143719 31752134 29019727 26581131 24325397 22148011 19910836
10197 19910836 17755620 15911601 14401269 13071953 11948969 11038297 10246068 9521090
10189 9521090 8856704 8286692 7773272 7278015 6842052 6487537 6193072 5884539 5585845
10180 5585845 5340673 5108234 4906488 4634003 4358182 4163013 3963330 3736904 3595348
$$ packed form
10234B3420157K189893K402307K889318L672181M751585O340400Q423271J1201338
10226F5290450J5175934K0931673K9147424M0642536N5145944P0006637P8428793
10219C74769391O9404138L1734390k7535554p2746091q2218846o9280420n1898440
10212A72228568l7590912k7260825k0065883j5064784j1539282q933154o918869
10205D4854859n423520m287620l391585k732407k438596k255734k177386k237175
10197A9910836k155216j844019j510332j329316j122984r10672p92229p24978
10189I521090o64386n70012n13420m95257m35963l54515k94465l08533k98694
10180E585845k45172k32439k01746k72485k75821j95169j99683k26426j41556
$$ plain form
10171 3595348 3481406 3378506 3294679 3230413 3158889 3114459 3027819 2923330 2817876 2704708
10161 2704708 2588351 2469048 2453524 2412457 2325161 2307363 2350028 2365728 2340488 2275142 2168684
10150 2168684 2044815 1910637 1815426 1803798 1789710 1766817 1751268 1767435 1711790 1734618 1723379
10139 1723379 1562871 1457411 1434398 1355915 1317555 1323683 1299541 1284845 1219054 1209809 1205906
10128 1205906 1171416 1151243 1124846 1081507 1090420 1070731 1029488 967784 906969 894148 883068
10117 883068 893355 908837 872693 867581 870165 859525 825612 823526 810783 777567 731643 800571
10105 800571 838419 832805 825709 837720 838390 804289 829571 852751 860155 857635 937956 1071024
10093 1071024 1180389 1320840 1339884 1248359 1183324 1101421 1016332 996402 936667 849039 749474
$$ packed form
10171C595348j13942j02900q3827o4266p1524m4430q6640j04489j05454j13168
10161B704708j16357j19303j5524m1067q7296j7798M2665J5700k5240o5346j06458
10150B168684j23869j34178r5211j1628j4088k2893j5549J6167n5645K2828j1239
10139A723379j60508j05460k3013p8483l8360O128k4142j4696o5791r245l903
10128A205906l4490k0173k6397m3339Q913j9689m1243o1704o0815j2821j1080
10117H83068J0287J5482l6144n112K584j0640l3913k086j2743l3216m5924O8928
10105H00571L7848n614p096J2011O70l4101K5282K3180P404k520Q0321J33068
10093A071024J09365J40451J9044r1525o5035q1903q5089j9930n9735q7628r9565
$$ plain form
10082 749474 743912 751225 744250 699628 665624 646323 696396 750219 740532 713802 677819 586899
10070 586899 557480 568062 564004 560618 504768 453997 474589 429797 439609 473348 488274 466641
10058 466641 436925 438321 459750 451573 470861 491799 505450 477325 399800 392419 409570 418704
10046 418704 372598 370656 395042 396256 413081 358545 362316 415301 429583 433591 432248 411577
10034 411577 439520 444827 465630 435710 359220 333174 324792 364254 408038 427747 496761 541261
10022 541261 517000 473191 479773 494320 454898 385887 356032 398172 369456 294051 266083 273480
10010 273480 281350 314036 353727 333433 270466 227826 219537 251399 306353 326934 315329 289045
9998 289045 278709 236727 249564 210647 225494 231252 227615 243344 249909 216604 228195 255541
$$ packed form
10082G49474n562P313o975m4622l4004j9301N0073N3823r687k6730l5983r0920
10070E86899k9419J0582m058l386n5850n0771K0592m4792R812L3739J4926k1633
10058D66641k9716J396K1429q177J9288K0938J3651k8125p7525p381J7151R134
10046D18704m6106j942K4386J214J6825n4536L771N2985J4282M008j343k0671
10034D11577K7943N307K0803k9920p6490k6046q382L9462M3784J9709O9014M4500
10022E41261k4261m3809O582J4547l9422o9011k9855M2140k8716p5405k7968P397
10010B73480P870L2686L9691k0294o2967m2640q289L1862N4954K0581j1605k6284
9998B89045j0336m1982J2837l8917J4847N758l637J5729O565l3305J1591K7346
$$ plain form
9986 255541 277910 293330 306037 283579 220956 176975 195948 193576 189517 256836 272549 214489
9974 214489 217892 254216 236968 266115 288709 284970 285832 333389 390572 392445 329540 325584 314602
9961 314602 293591 312236 266320 264781 280243 282589 276166 220401 217212 235412 223564 238355
9949 238355 230537 245870 258269 242009 253045 229251 263303 254352 174705 161322 188806 187638
9937 187638 222634 237396 267820 325866 368669 464162 605111 672035 544549 425268 350115
9926 350115 293043 269074 250766 240864 235582 263234 229873 167524 184922 185156 218574 225322 236233
9913 236233 201729 210915 300832 369497 411774 449388 453893 416398 397595 388381 409781 427349
9901 427349 407821 366095 338782 360674 378896 320345 307981 310698 285039 195577 178298 188128
$$ packed form
9986B55541K2369J5420J2707k2458o2623m3981J8973k372m059O7319J5713n8060
9974B14489L403L6324j7248K9147K2594l739Q62M7557N7183J873o2905l956j0982
9961C14602k1011J8645m5916j539J5462K346o423n5765l189J8200j1848J4791
9949B38355p818J5333J2399j6260J1036k3794L4052q951p9647j3383K7484j168
9937A87638L4996J4762L0424N8046M2803R5493J40949O6924j27486j19281p5153
9926C50115n7072k3969j8308r902n282K7652l3361o2349J7398K34L3418O748J0911
9913B36233l4504R186Q9917O8665M2277L7614M505l7495j8803r214K1400J7568
9901D27349j9528m1726k7313K1892J8222n8551j2364K717k5659q9462j7279R830
$$ plain form
9889 188128 210785 217266 194592 171173 184013 165715 113596 141069 229635 269215 248166 293444
9877 293444 275479 239253 211980 224120 177933 145337 135874 102124 87587 76367 71708 43516
9865 43516 74442 140214 178646 131206 106938 156064 166677 104534 112356 123776 127431 116623
9853 116623 132713 149842 166154 164100 210804 236721 216295 228667 222255 210480 152779 119238
9841 119238 113149 102868 84681 89896 134774 223221 227417 158516 138200 156378 149128 113305
9829 113305 110214 94745 122217 126783 79354 41963 73090 103945 157512 210966 209069 158759
9817 158759 122866 179334 200577 204341 249077 281977 262944 273084 253406 267762 320372 385149
9805 385149 439209 442439 541982 628022 744124 872476 1009496 1201671 1510608 1832797 2076233
$$ packed form
9889A88128K2657O481k2674k3419J2840j8298n2119K7473Q8566L9580k1049M5278
9877B93444j7965l6226k7273J2140m6187l2596r463l3750j4537j1220m659k8192
9865D3516L0926O5772L8432m7440k4268M9126J0613o2143P822J1420L655j0808
9853A16623J6090J7129J6312k054M6704K5917k0426J2372o412j1775n7701l3541
9841A19238o089j0281j8187N215M4878Q8447M196o8901k0316J8178p250l5823
9829A13305l091j5469K7472M566m7429l7391L1127L0855N3567N3454j897n0310
9817A58759l5893N6468K1243L764M4736L2900j9033J0140j9678J4356N2610O4777
9805C85149N4060L230R9543Q6040J16102J28352J37020J92175L08937L22189K43436
$$ plain form
9794 2076233 2142802 2060575 1862938 1540027 1249631 1081717 943811 776557 672770 560253
9784 560253 475464 445786 445938 406194 382073 362367 395014 387629 344225 275887 239762 232588
9772 232588 193303 158868 158622 143997 162458 202261 222930 176493 144813 160012 165942 170911
9760 170911 186412 153261 142226 185785 174444 135789 99903 124635 133173 121964 112561 98054
9748 98054 124245 143800 203604 179698 167699 183733 174505 126519 76928 77993 96998 85981
9736 85981 66504 17805 18448 56134 17892 12820 33394 14889 67592 62965 39055 50273 145746
9723 145746 150417 122133 97933 101453 120089 115555 82372 105208 128649 111128 131675 125934
9711 125934 114054 111828 87193 54749 60071 95512 130831 119857 101636 51675 22217 57440
$$ packed form
9794B076233O6569q2227j97637l22911k90396j67914j37906j67254j03787j12517
9784E60253q4789k9678J52l9744k4121j9706L2647p385m3404o8338l6125p174
9772B32588l9285l4435k46j4625J8461L9803K0669m6437l1680J5199N930M969
9760A70911J5501l3151j1035M3559j1341l8655l5886K4732Q538j1209r403j4507
9748I8054K6191J9555N9804k3906j1999J6034r228m7986m9591J065J9005j1017
9736H5981j9477m8699O43L7686l8242n072K0574j8505N2703m627k3910J1218R5473
9723A45746M671k8284k4200L520J8636m534l3183K2836K3441j7521K0547n741
9711A25934j1880k226k4635l2444N322L5441L5319j0974j8221m9961k9458L5223
$$ plain form
9699 57440 89000 97655 130303 118870 78588 104188 127236 116718 94448 112196 102078 99065
9687 99065 127107 167899 179151 158974 132586 123661 78605 84066 105496 72934 70157 114461
9675 114461 189839 157899 115355 51679 2065 62344 104736 126750 164855 162364 137521 102823
9663 102823 115314 148275 161917 185116 153563 94275 146276 174837 289959 418223 540664
9652 540664 770638 1181201 1680147 1831586 1304391 759567 455560 370610 328331 263269
9642 263269 273160 256048 174657 175632 113646 110991 97025 94944 144329 155811 149272 157634 192588
9629 192588 197238 151576 69011 22233 62895 141164 188397 179403 150620 175762 161404 108340
9617 108340 13995 8328 -6492 -1092 -14428 -25683 -2810 59161 87312 96866 117468 116359
$$ packed form
9699E7440L1560Q655L2648j1433m0282K5600K3048j0518k2270J7748j0118l013
9687I9065K8042M0792J1252k0177k6388q925m5056N461K1430l2562k777M4304
9675A14461P5378l1940m2544o3676m9614O0279M2392K2014L8105k491k4843l4698
9663A02823J2491L2961J3642K3199l1553n9288N2001K8561J15122J28264J22441
9652E40664K29974M10563M98946J51439n27195n44824l04007q4950m2279o5062
9642B63269R891j7112q1391R75o1986k655j3966k081M9385J1482o539Q362L4954
9629A92588M650m5662q2565m6778M0662P8269M7233q994k8783K5142j4358n3064
9617A08340r4345n667j4820N400j3336j1255K2873O1971K8151R554K0602j109
$$ plain form
9605 116359 62022 27106 41104 45085 30701 74546 145888 145151 45572 -3163 35555 99351
9593 99351 90318 48434 -3500 -2283 23438 63924 51836 38730 44246 49709 96920 95218 37056
9580 37056 66940 79827 36470 4709 20412 81908 120637 101736 36166 -38008 -42833 57203
9568 57203 106305 134972 148479 108372 125201 145297 172614 204756 137749 158283 151891 138059
9556 138059 101767 149004 124605 146759 144117 121945 86315 47014 46063 12438 19278 70983
9544 70983 75175 29552 40235 -5624 -6831 -11085 14634 70096 38261 12627 -12115 -9383 49087
9531 49087 52209 39024 32083 20262 20866 61702 59861 47273 84945 74009 48829 36290 11953
9518 11953 14816 4499 24284 46227 49140 38951 45309 27455 11009 -14048 -20268 -29447 12650
$$ packed form
9605A16359n4337l4916J3998L981j4384M3845P1342p37r9579m8735L8718O3796
9593I9351r033m1884n1934J217K5721M0486j2088j3106N516N463M7211j702n8162
9580C7056K9884J2887m3357l1761J5703O1496L8729j8901o5570p4174m825J00036
9568E7203M9102K8667J3507m0107J6829K0096K7317L2142o7007K0534o392j3832
9556A38059l6292M7237k4399K2154k642k2172l5630l9301r51l3625O840N1705
9544G0983M192m5623J0683m5859j207m254K5719N5462l1835k5634k4742K732N8470
9531D9087L122j3185o941j1821O04M0836j841j2588L7672j0936k5180j2539k4337
9518A1953K863j0317J9785K1943K913j0189O358j7854j6446k5057o220r179M2097
$$ plain form
9505 12650 75395 124409 65627 12495 37096 50858 88038 105028 43563 41601 24646 -3390
9493 -3390 6051 34139 77915 66474 67914 45011 17796 -43240 -50089 -19433 24134 48271 58912
9480 58912 69276 52739 -19916 -48786 -8120 19460 22839 4534 -28822 -11727 -13954 -34139
9468 -34139 -30900 22191 118338 166537 112750 60555 26111 30117 2734 34200 27603 23605 20826
9455 20826 -11462 -28946 -14671 37730 9109 22340 69843 82925 41186 2802 550 -14017
9443 -14017 15552 42006 22389 -16176 -5484 866 45859 64494 127745 107380 23632 49707
9431 49707 64482 21235 12846 60699 46896 95172 132682 187502 165033 65830 37642 73995
9419 73995 79467 80030 32174 11891 7151 -14761 21541 25882 40007 49807 20716 22933 44385
$$ packed form
9505A2650O2745M9014n8782n3132K4601J3762L7180J6990o1465j962j6955k8036
9493c390R441K8088M3776j1441J440k2903k7215o1036o849L0656M3567K4137J0641
9480E8912J0364j6537p2655k8870M0666K7580L379j8305l3356J7095k227k0185
9468c4139L239N3091R6147M8199n3787n2195l4444M006k7383L1466o597l998k779
9455B0826l2288j7484J4275N2401k8621J3231M7503J3082m1739l8384k252j4567
9443a4017K9569K6454j9617l8565J0692O350M4993J8635O3251k0365q3748K6075
9431D9707J4775m3247q389M7853j3803M8276L7510N4820k2469r9203k8188L6353
9419G3995N472N63m7856k0283m740k1912L6302M341J4125R800k9091K217K1452
$$ plain form
9406 44385 104071 149361 161024 97535 -9907 -31195 -4850 27770 28960 -5663 -20329 -22409
9394 -22409 -18516 -37330 12265 58618 60245 62437 92183 85439 51583 91904 81533 14742 -26387
9381 -26387 -23480 -6861 3414 -8826 -57179 -51841 -39056 -47238 115 25479 43056 81268
9369 81268 160628 186091 102459 63105 85990 36808 34420 32922 6330 -9437 -36626 37156
9357 37156 82330 82880 54744 29976 -4339 -14896 -10115 -19922 -36530 53734 73461 79342 96831
9344 96831 99029 85874 93766 99778 91956 95545 46700 33166 52962 44024 91842 178887 163966
9331 163966 124953 54490 -7641 12750 85778 114443 144777 134216 103882 60580 56616 74977
9319 74977 78313 43974 53613 83671 114896 109005 102554 106036 115255 109711 26284 22469 74765
$$ packed form
9406D4385N9686M5290J1663o3489j07442k1288K6345L2620J190l4623j4666k080
9394b2409L893j8814M9595M6353J627K192K9746o744l3856M0321j0371o6791m1129
9381b6387K907J6619J0275j2240m8353N338J2785q182M7353K5364J7577L8212
9369H1268P9360K5463q3632l9354K2885m9182k388j498k6592j5767k7189P3782
9357C7156M5174N50k8136k4768l4315j0557M781r807j6608R0264J9727N881J7489
9344I6831K198j3155P892O012p822L589m8845j3534J9796q938M7818Q7045j4921
9331A63966l9013p0463o2131K0391P3028K8665L0334j0561l0334m3302l964J8361
9319G4977L336l4339R639L0058L1225n891o451L482R219n544q3427l815N2296
$$ plain form
9306 74765 70800 36298 14409 38208 95125 74286 60856 82585 41573 11651 18860 24632
9294 24632 -1458 -19487 -6044 -41746 -72739 -2567 53851 54620 39960 74626 43570 98117
9282 98117 75371 23746 12817 3253 2476 42078 28069 57330 102648 108489 88979 89467 74297
9269 74297 97820 97628 85551 51762 67478 108230 126225 144676 80231 35401 22369 239
9257 239 29436 27873 34511 49338 46307 77011 144880 120500 63082 56707 42403 15539 33010
9244 33010 12554 -36821 -40949 739 60408 41046 21856 14689 28741 27571 -15517 -29199
9232 -29199 -17632 413 21930 33403 30102 71310 101499 110154 112133 119941 84242 64819 40001
9219 40001 20848 7548 26203 98857 117474 98993 74525 90174 48074 75810 118193 101646
$$ packed form
9306G4765l965l4502k1889K3799N6917k0839j3430K1729m1012k9922P209N772
9294B4632k6090j8029J3443l5702l0993P0172N6418P69j4660L4666l1056N4547
9282I8117k2746n1625j0929r564p77L9602j4009K9261M5318N841j9510M88j5170
9269G4297K3523j92j2077l3789J5716M0752J7995J8451o4445m4830j3032k2130
9257B39K9197j563O638J4827l031L0704O7869k4380n7418o375j4304k6864J7471
9244C3010k0456m9375m128M1688N9669j9362j9190p167J4052j170m3088j3682
9232b9199J1567J8045K1517J1473l301M1208L0189Q655J979P808l5699j9423k4818
9219D0001j9153j3300J8655P2654J8617j8481k4468J5649m2100K7736M2383j6547
$$ plain form
9207 101646 65840 52349 -19085 -34327 32369 80921 109062 72469 62085 28847 18007 -5321
9195 -5321 21404 44928 107443 62246 48440 99180 131889 84137 79171 57840 -8316 34101
9183 34101 68553 45106 25353 -19135 -25614 25644 16135 14182 16260 1359 38102 77258 81520
9170 81520 97742 156718 160166 82537 38346 52396 62282 25211 -32956 -81117 -86250 -33083
9158 -33083 -14824 450 9931 -60941 -80067 -9516 46012 67505 95640 55042 31268 58326
9146 58326 90820 127076 33766 33505 3448 -9729 34863 62734 72953 57559 97188 134258
9134 134258 147582 114735 113952 84227 28231 -1173 8633 55719 47304 25828 -3834 26354
9122 26354 10907 -1045 5054 51343 124859 106784 56371 13260 -44578 -71035 -80916 -78123
$$ packed form
9207A01646l5806j3491p1434j5242O6696M8552K8141l6593j0384l3238j0840k3328
9195e321K6725K3524O2515m5197j3806N0740L2709m7752m966k1331o6156M2417
9183C4101L4452k3447j9753m4488o479N1258r509j953K078j4901L6743L9156M262
9170H1520J6222N8976L448p7629m4191J4050R886l7071n8167m8161n133N3167
9158c3083J8259J5274R481p0872j9126P0551N5528K1493K8135m0598k3774K7058
9146E8326L2494L6256r3310k61l0057j3177M4592K7871J0219j5394L9629L7070
9134A34258J3324l2847p83k9725n5996k9404R806M7086q415k1476k9662L0188
9122B6354j5447j1952O099M6289P3516j8075n0413m3111n7838k6457r881K793
$$ plain form
9110 -78123 1800 55989 43744 17594 -13206 7103 57306 41096 54696 95389 42792 12514
9098 12514 5132 -9592 -12923 -27352 12914 55443 55585 76625 102411 68187 24530 50177 13197
9085 13197 -38976 -56783 -45677 -5087 26282 -1808 -24251 -4993 -47472 -38732 -36485 -13523
9073 -13523 55539 36042 12170 12721 39864 36739 68395 101546 98481 58681 49490 39785 56464
9060 56464 124151 130899 69411 77470 134045 168666 134295 87847 75196 95607 27624 5419
9048 5419 -1840 16785 22901 28957 74757 90925 93651 72478 47443 64294 55308 85042 62590
9035 62590 39732 29935 -3378 23445 64037 56056 69438 93641 96733 79066 38984 30086 51953
9022 51953 84027 94112 51816 25643 11205 68911 48241 -13899 -42635 -24619 1694 22443
$$ packed form
9110g8123P9923N4189j2245k6150l0800K0309N0203j6210J3600M0693n2597l0278
9098A2514p382j4724l331j4429M0266M2529J42K1040K5786l4224m3657K5647l6980
9085A3197n2173j7807J1106M0590L1369k8090k2443J9258m2479Q740K247K2962
9073a3523O9062j9497k3872N51K7143l125L1656L3151l065l9800r191r705J6679
9060E6464O7687O748o1488Q059N6575L4621l4371m6448j2651K0411o7983k2205
9048E419p259J8625O116O056M5800J6168K726k1173k5035J6851q986K9734k2452
9035F2590k2858r797l3313K6823M0592p981J3382K4203L092j7667m0082q898K1867
9022E1953L2074J0085m2296k6173j4438N7706k0670o2140k8736J8016K6313K0749
$$ plain form
9010 22443 5809 3971 18184 -15186 -25809 33064 40459 66384 52668 52172 44956 65912 77593
8997 77593 49688 36165 15576 60208 14790 -47655 3292 48487 24559 -729 9526 -31094
8985 -31094 -79536 -74578 -71282 -68323 -37065 -3746 36264 -2006 23862 76790 72713 25657 24743
8972 24743 10149 32840 66765 89754 93422 93813 70029 11139 -6738 4041 69593 24913
8960 24913 -4858 -9334 -32258 -65662 -66248 -23501 -7060 -6812 26921 36631 39665 17088 46747
8947 46747 77986 138746 106161 90425 24826 71848 112369 120059 142070 161162 148058 119255
8935 119255 132641 134915 54170 49464 47421 52921 28669 38157 4584 -4380 43048 66875 88839
8922 88839 67697 43548 21787 -18922 -33297 -60951 -69812 -38042 -44996 -24981 49777 68774
$$ packed form
9010B2443j6634j838J4213l3370j0623N8873P395K5925j3716m96p216K0956J1681
8997G7593k7905j3523k0589M4632m5418o2445N0947M5195k3928k5288J0255m0620
8985c1094m8442M958L296K959L1258L3319M0010l8270K5868N2928m077m7056r14
8972B4743j4594K2691L3925K2989L668L91k3784n8890j7877J0779O5552m4680
8960B4913k9771m476k2924l3404n86M2747J6441K48L3733R710L034k2577K9659
8947D6747L1239O0760l2585j5736o5599M7022M0521P690K2011J9092j3104k8803
8935A19255J3386K274q0745m706k043N500k4252R488l3573q964M7428K3827K1964
8922H8839k1142k4149k1761m0709j4375k7654q861L1770o954K0015P4758J8997
$$ plain form
8910 68774 33973 41561 89112 167643 159258 83433 75404 55501 38853 65502 89962 65202
8898 65202 20817 46364 114929 105677 73226 13429 22871 -4624 -31060 -12828 6108 27722
8886 27722 86414 103539 128275 109988 79593 7515 15326 68589 44725 16922 23773 10665
8874 10665 13561 25790 -37909 24991 31375 46715 68589 73718 63742 66367 75725 99791 77794
8861 77794 65215 24970 14481 -23985 -67353 -45986 -13004 40021 5749 -16941 -4815 -21572
8849 -21572 7205 102823 111188 65280 -15360 -14570 8682 55877 96186 83832 41498 63839
8837 63839 72533 56846 62363 71477 66554 15146 -3369 -11137 -28318 -65485 -42926 -7722 -19401
8824 -19401 -8129 -695 -37745 -36588 -12473 6925 15827 -36142 -64064 -54336 -33281 -48052 31200
$$ packed form
8910F8774l4801P588M7551P8531q385p5825q029j9903j6648K6649K4460k4760
8898F5202m4385K5547O8565r252l2451n9797R442k7495k6436J8232J8936K1614
8886B7722N8692J7125K4736j8287l0395p2078P811N3263k3864k7803O851j3108
8874A0665K896J2229o3699O2900O384J5340K1874N129r976K625R358K4066k1997
8861G7794j2579m0245j0489l8466m3368K1367L2982N3025l4272k2690J2126j6757
8849b1572K8777R5618Q365m5908q0640P90K3252M7195M0309j2354m2334K2341
8837F3839Q694j5687N517R114m923n1408j8515p768j7181l7167K2559L5204j1679
8824a9401J1272P434l7050J157K4115J9398Q902n1969k7922R728K1055j4771P9252
$$ plain form
8811 31200 80508 124093 105336 58842 45792 8369 32081 75285 69473 44146 22679 59822
8799 59822 11029 14534 -23466 -35068 -13060 -7161 51004 47375 19751 14680 23301 22626 63651
8786 63651 105257 93807 60895 44110 26544 44106 83348 69272 59587 77993 83996 103478
8774 103478 41948 12916 2700 -13464 -39135 -79482 -24398 73997 90085 78101 67475 65697
8762 65697 68448 34671 -20948 5014 3304 -1903 27668 28819 18407 24559 1408 -29364 -3192
8749 -3192 -13655 -4021 64173 60140 43745 111333 112627 94317 83062 83114 107835 78260 11450
8736 11450 -20519 -15921 -1788 -38015 -26741 -25677 -29630 -15238 38499 78237 71898 92125 103789
8723 103789 87097 108019 78115 1272 -33091 -44733 -37358 36549 47960 -14689 -1800 -1185
$$ packed form
8811C1200M9308M3585j8757m6494j3050l7423K3712M3204n812k5327k1467L7143
8799E9822m8793L505l8000j1602K2008N899N8165l629k7624n071Q621o75M1025
8786F3651M1606j1450l2912j6785j7566J7562L9242j4076r685J8406O003J9482
8774A03478o1530k9032j0216j6164k5671m0347N5084R8395J6088j1984j0626j778
8762F5697K751l3777n5619K5962j710n207K9571J151j0412O152k3151l0772K6172
8749c192j0463R634O8194m033j6395O7588J294j8310j1255N2K4721k9575o6810
8736A1450l1969M598J4133l6227J1274J064l953J4392N3737L9738o339K0227J1664
8723A03789j6692K0922k9904p6843l4363j1642P375P3907J1411o2649J2889O15
$$ plain form
8711 -1185 20690 9042 -37410 10737 92893 47608 7917 51485 69441 96564 87337 99181
8699 99181 75687 58801 49649 58020 87493 87634 54299 -10486 -30656 -52284 -17090 58429 63684
8686 63684 -25501 -65105 -43619 -5878 4837 46188 37449 37243 32097 3653 34257 87943 103192
8673 103192 59629 14321 50420 81529 36929 11882 -3500 3102 11806 -7855 26790 39622
8661 39622 37784 32878 -2622 -18428 -147 68533 85158 108444 114417 49402 10828 20313 -1451
8648 -1451 10718 33761 64222 59533 42264 -38341 -82269 15206 52067 10229 13084 57248
8636 57248 108891 85696 49706 70491 61550 39678 69231 89391 114190 133055 126017 67014
8624 67014 44586 99051 107939 48176 97339 97790 52131 66108 67183 125998 117029 144790 147083
$$ packed form
8711a185K1875j1648m6452M8147Q2156m5285l9691M3568J7956K7123r227J1844
8699I9181k3494j6886r152Q371K9473J41l3335o4785k0170k1628L5194P5519N255
8686F3684q9185l9604K1486L7741J0715M1351q739k06n146k8444L0604N3686J5249
8673A03192m3563m5308L6099L1109m4600k5047j5382O602Q704j9661L4645J2832
8661C9622j838m906l5500j5806J8281O8680J6625K3286N973o5015l8574R485k1764
8648a451J2169K3043L0461m689j7269q0605m3928R7475L6861m1838K855M4164
8636E7248N1643k3195l5990K0785q941k1872K9553K0160K4799J8865p038n9003
8624F7014k2428N4465Q888n9763M9163M51m5659J3977J075N8815q969K7761K293
$$ plain form
8611 147083 107415 102806 57306 37718 52100 57004 64539 92785 68289 69513 60001 54995 54420
8598 54420 51791 69888 81103 123692 152793 134260 127305 192926 175035 109244 94814 77217
8586 77217 107367 149245 163983 197209 260580 288963 298341 302681 307529 366817 366712 359362 360013
8573 360013 333692 286951 225190 188370 174272 181539 151786 143517 122578 78897 63395 105945
8561 105945 155002 122557 79841 92879 82944 87843 90788 68411 91748 83585 110602 115168 51902
8548 51902 31670 42346 62766 73917 93451 100561 44171 23757 60546 145204 114033 81686
8536 81686 43018 -13034 -17498 22493 -17078 -38331 -13971 -1100 -22118 17944 -4295 25127
8524 25127 77719 42071 10307 9840 46445 30408 9250 12699 31265 41390 19128 -7875
$$ packed form
8611A47083l9668m609m5500j9588J4382M904P535K8246k4496J224r512n006n75
8598E4420k629J8097J1215M2589K9101j8533o955O5621j7891o5791j4430j7597
8586G7217L0150M1878J4738L3226O3371K8383R378M340M848N9288j05p350O51
8573C60013k6321m6741o1761l6820j4098P267k9753q269k0939m3681j5502M2550
8561A05945M9057l2445m2716J3038r935M899K945k2377K3337q163K7017M566o3266
8548E1902k0232J0676K0420J1151J9534P110n6390k0414L6789Q4658l1171l2347
8536H1686l8668n6052m464L9991l9571k1253K4360J2871k1018M0062k2239K9422
8524B5127N2592l5648l1764m67L6605j6037k1158L449J8566J0125k2262k7003
$$ plain form
8512 -7875 42660 67297 40437 -8912 -8188 37461 26196 -29510 -35391 -56858 -85331 -70848 -71334
8499 -71334 -56723 -29456 -26336 -59564 -94021 -34587 15720 76997 67370 35153 12011 59292
8487 59292 43055 48591 81194 74595 66615 78232 72048 34238 25965 18388 909 -17438 46650
8474 46650 54655 47005 19783 -70984 -94897 -40639 29575 28719 43196 59465 82805 76168 65995
8461 65995 66795 56727 78726 76246 38323 18498 -28235 6536 46578 75205 66209 18392 22545
8448 22545 32626 49219 56015 65531 105351 102019 81383 88937 88869 99444 94795 45013 -3825
8435 -3825 -16600 9215 51770 87830 12123 -5658 66002 86460 99705 35062 -15423 1753
8423 1753 35770 34106 11493 18410 52958 91300 112570 87573 87036 109356 46747 44347 66445
$$ packed form
8512g875N0535K4637k6860m9349P24M5649j1265n5706n881k1467k8473J4483m86
8499g1334J4611K7267L120l3228l4457N9434N0307O1277r627l2217k3142M7281
8487E9292j6237N536L2603o599p980J1617o184l7810q273p577j7479j8347O4088
8474D6650Q005p650k7222r0767k3913N4258P0214q56J4477J6269K3340o637j0173
8461F5995Q00j0068K1999k480l7923j9825m6733L4771M0042K8627q996m7817M153
8448B2545J0081J6593O796R516L9820l332k0636P554o8J0575m649m9782m8838
8435c825j2775K5815M2555L6060p5707j7781P1660K0458J3245o4643n0485J7176
8423A753L4017j664k2613O917L4548L8342K1270k4997n37K2320o2609k400K2098
$$ plain form
8410 66445 96872 107844 99632 91946 38673 44223 33894 33846 80096 62505 -1370 33088 56217
8397 56217 32722 16126 22691 -17077 -37114 -66276 -29782 -64322 -19010 43808 36680 68477
8385 68477 82872 59486 -5233 -22699 67489 100930 45416 -5916 -9050 20577 62519 62029
8373 62029 47926 54106 20611 -32262 -65297 -48539 -19452 -40074 -38466 -38092 -24545 -63007 -65847
8360 -65847 -35873 41230 33848 11824 -496 -24275 -80997 -43641 -8900 8596 -26748 -23774
8348 -23774 -47574 -39517 -6063 -79676 -83876 -47190 -32453 -55126 -74929 -47072 -35704 -5434
8336 -5434 11098 56822 93496 45305 -26610 -25128 -3400 25979 -4256 -20318 10050 40703
8324 40703 50155 14586 10666 16393 45806 22879 12105 13687 32625 67051 104987 59567 -8233
$$ packed form
8410F6445L0427J0972q212p686n3273N550j0329m8M6250j7591o3875L4458K3129
8397E6217k3495j6596O565l9768k0037k9162L6494l4540M5312O2818p128L1797
8385F8477J4395k3386o4719j7466R0188L3441n5514n1332l134K9627M1942m90
8373F2029j4103O180l3495n2873l3035J6758K9087k0622J608L74J3547l8462k840
8360f5847K9974P7103p382k2024j2320k3779n6722L7356L4741J7496l5344K974
8348b3774k3800Q057L3454p3613m200L6686J4737k2673j9803K7857J1368L0270
8336e434J6532M5724L6674m8191p1915J482K1728K9379l0235j6062L0368L0653
8324D0703R452l5569l920N727K9413k2927j0774J582J8938L4426L7936m5420o7800
$$ plain form
8311 -8233 213 30049 28794 -1502 -5370 9083 885 -40339 4490 45881 43919 36647 39655
8298 39655 74887 65851 -9192 -6636 33641 -18742 -50078 -51495 -43350 -6828 37307 55437 69755
8285 69755 128266 130470 120105 103312 82770 80161 26732 5124 20890 17823 16484 1847 3544
8272 3544 49340 18312 -36895 -62496 -47409 -5389 12322 8201 12486 41215 33972 7668 7738
8259 7738 -32140 -43322 -20078 -40872 -87752 -112416 -136611 -110463 -82249 -30575 15634 43524
8247 43524 25187 -22516 -35313 -31913 -67750 -59129 -59124 -70277 -108930 -82366 -67698 6481 49819
8234 49819 16974 6639 85473 101991 38752 26611 10928 26801 14340 -51530 -59189 -39864
8222 -39864 8012 46068 33777 3341 -595 40288 6623 31437 28325 -24537 -31588 -3675
$$ packed form
8311h233Q446K9836j255l0296l868J4453q198m1224M4829M1391j962p272L008
8298C9655L5232r036p5043K556M0277n2383l1336j417Q145L6522M4135J8130J4318
8285F9755N8511K204j0365j6793k0542k609n3429k1608J5766l067j339j4637J697
8272C544M5796l1028n5207k5601J5087M2020J7711m121M285K8729p243k6304P0
8259G738l9878j1182K3244k0794m6880k4664k4195K6148K8214N1674M6209K7890
8247D3524j8337m7703j2797L400l5837Q621Nj1153l8653K6564J4668P4179M3338
8234D9819l2845j0335P8834J6518o3239j2141j5683J5873j2461o5870p659J9325
8222c9864M7876L8056j2291l0436l936M0883l3665K4814l112n2862p051K7913
$$ plain form
8210 -3675 -37054 -53785 -5104 -43374 -100426 -118626 -76361 -75828 -47453 -56749 -21522 -28662 -14640
8197 -14640 1861 16180 44834 58577 20981 18366 47954 100679 101936 22060 8275 24398
8185 24398 3133 27910 -2471 5998 44027 35994 47870 35550 31535 39126 50278 72972 106766
8172 106766 95151 55638 40084 24261 11571 34906 72090 95471 104300 90499 66636 60678
8160 60678 -10880 -32571 -10637 1176 -40773 9938 32058 12088 51015 74450 68776 51357
8148 51357 80077 88637 47906 8266 -35603 -65051 -98665 -36840 28312 29013 47602 11884
8136 11884 -12663 -4217 -46310 -46950 -21323 19552 11862 9356 15129 30830 30694 18634 -10635
8123 -10635 -16002 8257 -17355 -13529 -8923 5891 30826 36979 38841 43885 35850 29089 698
$$ packed form
8210c675l3379j6731M8681l8270n7052j8200M2265N33K8375r296L5227p140J4022
8197a4640J6501J4319K8654J3743l7596k615K9588N2725J257p9876j3785J6123
8185B4398k1265K4777l0381Q469L8029q033J1876j2320m015P591J1152K2694L3794
8172A06766j1615l9513j5554j5823j2690K3335L7184K3381Q829j3801k3863n958
8160F0678p1558k1691K1934J1813m1949N0711K2120j9970L8927K3435n674j7419
8148E1357K8720Q560m0731l9640m3869k9448l3614O1825O5152P01J8589l5718
8136A1884k4547Q446m2093o40K5627M0875p690k506N773J5701j36j2060k9269
8123a0635n367K4259k5612L826M606J4814K4935O153J862N044q035o761k8391
$$ plain form
8110 698 -47700 -77786 -73777 -12996 14283 21036 3699 34992 84288 52140 37000 50614 91902
8097 91902 38764 -9639 -19597 -24857 -83757 -61806 -9908 27403 37475 58091 21580 34220
8085 34220 97682 111548 82507 40440 8284 18409 -12410 -10353 -8454 -41415 -66846 -11302
8073 -11302 24469 23391 64302 34684 -2356 38931 50625 -897 -43695 -65133 -43627 -1487
8061 -1487 13125 -3709 -52405 -37357 -51252 -57057 8297 40336 92581 90864 44480 9798
8049 9798 -22600 -63677 -108999 -85829 -81225 -64842 -79609 -73469 -53949 -57028 4421 39716 28400
8036 28400 -11911 6701 57947 17151 27468 23912 -30855 -54420 42440 94621 73422 47219
8024 47219 -1974 -15296 -27550 4094 32267 81672 89524 108156 127749 88619 55287 85251
$$ packed form
8110F98m8398l0086M009O0781K7279O753j7337L1293M9296l2148j5140J3614M1288
8097I1902n3138m8403r958n260n8900K1951N1898L7311J0072K0616l6511J2640
8085C4220O3462J3866k9041m2067l2156J0125l0819K057J899l2961k5431N5544
8073a1302L5771j078M0911k9618l7040M1287J1694n1522m2798k1438K1506M2140
8061a487J4612j6834m8696J5048j3895n805O5354L2039N2245j717m6384l4682
8049I798l2398m1077m5322K3170M604J6383j4767O140J9520l079O1449L5295j1316
8036B8400m0311J8612N1246m0796J0317l556n4767k3565R6860N2181k1199k6203
8024D7219m9193j3322j2254L1644K8173M9405P852J8632J9593l9130l3332K9964
$$ plain form
8012 85251 85347 18041 55649 62054 46176 16116 30022 25428 31040 48004 7082 -13241 36889
7999 36889 76996 72800 115779 78826 65705 90244 65226 22991 28054 63170 76828 77759 46421
7986 46421 56292 67870 58372 79038 86325 84827 26319 53796 46502 64816 133104 151543 90092
7973 90092 -17437 -7252 32568 -10270 -18580 11891 80683 104866 91468 71045 115085 120707
7961 120707 115224 137561 110116 83923 76923 60922 61835 23390 -11805 -45768 -39269 17690 858
7948 858 -10759 -13006 -28667 -1775 4720 46585 38162 3888 59793 34637 12292 74260 46567
7935 46567 54577 92805 55428 55808 44252 7225 17911 55430 64021 91399 87564 122158 154454
7922 154454 89766 81209 67733 41453 836 -14765 1604 49554 32047 51177 38513 -49720
$$ packed form
8012H5251R6o7306L7608O405j5878l0060J3906m594N612J6964m0922k0323N0130
7999C6889M0107m196M2979l6953j3121K4539k5018m2235N063L5116J3658R31l1338
7986D6421R871J1578r498K0666P287j498n8508K7477p294J8314O8288J8439o1451
7973I0092j07529J0185L9820m2838q310L0471O8792K4183j3398k0423M4040N622
7961A20707n483K2337k7445k6193p000j6001R13l8445l5195l3963O499N6959j6832
7948H58j1617k247j5661K6892O495M1865q423l4274N5905k5156k2345O1968k7693
7935D6567Q010L8228l7377L80j1556l7027J0686L7519Q591K7378l835L4594L2296
7922A54454o4688q557j3476k6280m0617j5601J6369M7950j7507J9130j2664q8233
$$ plain form
7910 -49720 -93833 -76583 -63969 -17329 20206 57989 28006 3092 -30449 566 26585 43885
7898 43885 12419 16100 -5527 -72515 -123694 -75551 -22395 16710 53903 24777 4463 -7312
7886 -7312 36668 57680 39636 22448 38177 -19922 -75861 -92245 -41109 -26234 -49099 -12942
7874 -12942 14286 71584 88995 57523 16370 2 10977 5931 58301 95754 72419 72177
7862 72177 28406 53888 15844 32235 16958 55736 18244 -18510 -34727 14982 37225 103341
7850 103341 126896 118085 126358 146396 110258 62627 63937 42329 45149 6813 -64119 -90788
7838 -90788 -56707 20094 99505 120996 89798 89639 56520 52654 112105 102444 23237 10225 42242
7825 42242 58261 35539 3733 -30224 -26283 -51811 -80299 -90981 -83245 -71700 -31543 5752
$$ packed form
7910d9720m4113J7250J2614M6640L7535L7783k9983k4914l3541L1015K6019J7300
7898D3885l1466L681k1627o6988n1179M8143N3156L9105L7193k9126k0314j1775
7886g312M3980K1012j8044j7188J5729n8099n5939j6384N1136J4875k2865L6157
7874a2942K7228N7298J7411l1472m1153j6368J0975n046N2370L7453k3335k42
7862G2177m3771K5482l8044J6391j5277L8778l7492l6754j6217M9709K2243O6116
7850A03341K3555q811Q273K0038l6138m7631J310k1608K820l8336p0932k6669
7838i0788L4081P6801P9411K1491l1198j59l3119l866N9451r661p9207j3012L2017
7825D2242J6019k2722l1806l3957L941k5528k8488j0682P736J1545M0157L7295
$$ plain form
7813 5752 -3979 26824 54108 88322 35505 7689 20645 58385 134283 140548 107149 108978 105947
7800 105947 89624 87382 101419 37013 -25106 -18139 -44555 -16716 17339 17296 20851 -16124 -7312
7787 -7312 14687 3804 2648 -22631 -30555 -59838 -96890 -75187 -42395 -24550 -79186 -104188
7775 -104188 -33016 -9699 -26781 -54063 -17444 24707 12765 -5379 23410 33092 12884 17856
7763 17856 1717 -36142 -29784 26465 55185 11734 -22339 -1596 -23705 16354 -11997 -33714
7751 -33714 -655 29565 62468 58402 40942 20262 -6221 49023 101833 44539 -42321 -92278
7739 -92278 -87933 -102635 -97688 -19918 1753 25992 34043 -4599 -1249 37039 35144 -20821 -48289
7726 -48289 -46068 -25836 -26725 38244 -15390 -64600 -49387 -44595 -91565 -75760 -119216 -95402 -54457
$$ packed form
7813E752r731L0803K7284L4214n2817k7816J2956L7740P5898O265l3399J829l031
7800A05947j6323k242J4037o4406o2119O967k6416K7839L4055m3L555l6975Q812
7787g312K1999j0883j156k5279p924k9283l7052K1703L2792J7845n4636k5002
7775a04188P1172K3317j7082k7282L6619M2151j1942j8144K8789R682k0208M972
7763A7856j6139l7859O358N6249K8720m3451l4073K0743k2109M0059k8351k1717
7751c3714L3059L0220L2903m066j7460k0680k6483N5244N2810n7294q6860m9957
7739i2278M345j4702M947P7770K1671K4239Q051l8642L350L8288j895n5965k7468
7726d8289K221K0232q89O4969n3634m9210J5213M792m6970J5805m3456K3814M0945
$$ plain form
7713 -54457 -1531 22528 -275 -58887 -32597 -7781 -48551 -49952 -29748 -45825 -115690 -58710
7701 -58710 -46102 -47276 -21132 44191 60627 51503 37952 29378 16715 7965 34967 51333 72451
7688 72451 85439 22406 -5448 40749 71842 49412 20769 33153 70432 91265 61827 2103
7676 2103 11088 58690 105216 68565 52678 -25166 -62350 -54663 -23492 1422 33459 48412
7664 48412 9026 -32108 -67926 -64067 -67063 -30076 38285 38917 -31491 -46568 11089 48625 16460
7651 16460 57127 67378 44532 37656 19006 67800 45716 5372 -15696 -74103 -76216 -74598
7639 -74598 -36704 -23280 -20176 -2751 11240 -21575 -44136 -41715 -13658 -19502 22794 81048
7627 81048 45396 28077 -36079 -120920 -132691 -99920 -29683 -29562 -38419 -48954 -70618 -38480
$$ packed form
7713e4457N2926K4059k2803n8612K6290K4816m0770j401K0204j6077o9865N6980
7701e8710J2608j174K6144O5323J6436r124j3551q574j2663q750K7002J6366K1118
7688G2451J2988o3033k7854M6197L1093k2430k8643J2384L7279K0833k9438n9724
7676B103Q985M7602M6526l6651j5887p7844l7184P687L1171K4914L2037J4953
7664D8412l9386m1134l5818L859k996L6987O8361O32p0408j5077N7657L7536l2165
7651A6460M0667J0251k2846o876j8650M8794k2084m0344k1068n8407k113J618
7639g4598L7894J3424L104J7425J3991l2815k2561K421K8057n844M2296N8254
7627H1048l5652j7319o4156q4841j1771L2771P0237J21q857j0535k1664L2138
$$ plain form
7615 -38480 -44332 -90249 -66971 -53702 -25309 -65332 -46545 -13749 -19334 -74211 -55130 -24976
7603 -24976 -14348 -5935 -294 14738 68701 59702 57602 3458 -47456 -86799 -70424 -37591 -54470
7590 -54470 -115717 -116899 -89828 -66134 -71041 -44985 -11609 -34807 -48074 -58883 -93344 -101722
7578 -101722 -75106 -38493 -24671 -35385 -27919 4865 3188 9874 48796 63306 16672 -56650
7566 -56650 -35691 -69488 -40019 -17124 4635 10562 46892 9931 -31056 -47651 -11595 -15100
7554 -15100 -44105 -71993 -48281 -7915 -2933 -39338 -25354 -66990 -16149 -13826 -11517 -55000
7542 -55000 -39617 -37748 -27994 -12034 -75695 -81077 -45243 -98359 -113968 -59258 -23688 -27696 -44789
7529 -44789 -19402 12315 -10826 -25972 -18274 -8278 17912 17789 -6841 -52916 -63245 -53435 -55190
$$ packed form
7615c8480n852m5917K3278J3269K8393m0023J8787L2796n585n4877J9081L0154
7603b4976J0628Q413N641J5032N3963q999k100n4144n0914l9343J6375L2833j6879
7590e4470o1247j182K7071K3694m907K6056L3376k3198j3267j0809l4461q378
7578a01722K6616L6613J3822j0714P466L2784j677O686L8922J4510m6634p3322
7566e6650K0959l3797K9469K2895K1759N927L6330l6961m0987j6595L6056l505
7554a5100k9005k7888K3712M0366M982l6405J3984m1636N0841K323K309m3483
7542e5000J5383J869R754J5960o3661n382L5834n3116j5609N4710L5570m008j7093
7529d4789K5387L1717k3141j5146P698R996K6190j23k4630m6075j0329R810j755
$$ plain form
7516 -55190 -44822 -7053 37207 -14162 -36537 -46047 -23594 -55268 -72505 -65224 -25860 -38389
7504 -38389 6972 -17492 23496 63464 64724 58234 74857 13709 -21725 -62638 -94183 -47642
7492 -47642 -68861 -89822 -82999 -50657 -34341 -39852 -41348 -57357 -58841 -39179 -43431 -25181 14373
7479 14373 -2373 -16239 35202 27536 -4579 382 -5668 -26568 -16057 -3123 -78909 -92564
7467 -92564 -49423 34867 45890 54236 32314 -24302 -14990 -25877 17598 55223 33536 29
7455 29 10895 20280 22252 9479 -14412 8478 34468 17991 8711 41006 37104 21708 21132 48278
7441 48278 61050 78927 77319 77434 41891 25130 5359 -32417 -22546 14999 14661 62005 50049
7428 50049 69779 89823 66416 -19150 -45008 -44234 -29602 -42761 -20882 13958 21198 64418
$$ packed form
7516e5190J0368L7769M4260n1369k2375r510K2453l1674j7237P281L9364j2529
7504c8389M5361k4464M0988L9968J260o490J6623o1148l5434m0913l1545M6541
7492d7642k1219k0961O823L2342J6316n511j496j6009j484J9662m252J8250L9554
7479A4373j6746j3866N1441p666l2115M961o050k0900J0511J2934p5786j3655
7467i2564M3141Q4290J1023Q346k1922n6616R312j0887M3475L7625k1687l3507
7455B9J0866R385J972j2773k3891K2890K5990j6477r280L2295l902j5396n76K7146
7441D8278J2772J7877j608J15l5543j6761j9771l7776R871L7545l38M7344j1956
7428E0049J9730K0044k3407q5566k5858P74J4632j3159K1879L4840P240M3220
$$ plain form
7416 64418 33317 36151 34022 21486 -16915 -2669 -9654 17280 39350 46955 24474 46301 37093
7403 37093 15971 31755 56111 60392 52741 62529 64808 24672 -62372 -101892 -117054 -72544 -8269
7390 -8269 43029 47606 26970 7351 18119 7266 10778 19921 -2795 -32084 -43995 -64979 -71444
7377 -71444 14453 8771 -53068 -92338 -70017 -32240 1961 -30494 -86995 -79709 -30858 -72591
7365 -72591 -107015 -92001 -101221 -106453 -74040 -76699 -52785 -72726 -57590 16431 27182 5451
7353 5451 8287 -32484 3970 66502 28632 -15861 -52924 -92468 -119030 -84408 -88316 -116034
7341 -116034 -113480 -50328 -49781 -79104 -90204 -79111 -51257 -30431 -68719 -44289 -17936 -48515
7329 -48515 -90917 -89188 -91150 -68793 -46954 -10605 -13296 -22967 -58386 -113307 -147947 -147772 -120837
$$ packed form
7416F4418l1101K834k129j2536l8401J4246o985K6934K2070P605k2481K1827r208
7403C7093k1122J5784K4356M281p651R788K279m0136q7044l9520j5162M4510O4275
7390h269N1298M577k0636j9619J0768j0853L512R143k2716k9289j1911k0984o465
7377g1444Q5897n682o1839l9270K2321L7777L4201l2455n6501P286M8851m1733
7365g2591l4424J5014r220n232L2413k659K3914j9941J5136P4021J0751k1731
7353E451K836m0771L6454O2532l7870m4493l7063l9544k6562L4622l908k7718
7341a16034K554O3152N47k9323j1100J1093K7854K0826l8288K4430K6353l0579
7329d8515m2402J729j962K2357K1839L6349k691r671l5419n4921l4640J75K6935
$$ plain form
7316 -120837 -105971 -48610 -43480 -16594 39389 18101 31498 45612 29281 7796 13125 -19808
7304 -19808 -62605 -76695 -39275 -13494 26838 20075 -50908 -61443 -40487 8296 14068 -26209
7292 -26209 1840 43959 -14194 -30264 163 8867 -24939 -49876 -49265 -42236 -60193 -61003 -54414
7279 -54414 -33379 30544 54196 63262 75790 87190 73370 89746 41360 18559 28061 29267
7267 29267 -1260 -5193 -9412 -19938 -31308 -23646 -27276 -65576 -38655 -44622 -48989 -9704 -15050
7254 -15050 12784 11384 22984 57103 63579 79582 56774 47081 15806 -29859 -21708 507 20903
7241 20903 13507 11991 31150 42216 18777 14811 3852 -10095 51372 22458 -9217 -66377
7229 -66377 -55345 18524 12240 -29888 -43172 -19341 5032 -20647 -39127 -48621 26330 54532
$$ packed form
7316a20837J4866N7361N130K6886N5983k1288J3397J4114j6331k1485N329l2933
7304a9808m2797j4090L7420K5781M0332o763p0983j0535K0956M8783N772m0277
7292b6209K8049M2119n8153j6070L0427Q704l3806k4937O11P029j7957q10O589
7279e4414K1035O3923K3652R066J2528J1400j3820J6376m8386k2801R502J206
7267B9267l0527l933m219j0526j1370P662l630l8300K6921n967m367L9285n346
7254a5050K7834j400J1600L4119O476J6003k2808r693l1275m5665Q151K2215K0396
7241B0903p396j516J9159J1066k3439l966j0959j3947O1467k8914l1675n7160
7229f6377J1032P3869o284m2128j3284K3831K4373k5679j8480r494P4951K8202
$$ plain form
7217 54532 54409 47691 89 -73438 -67659 -39797 -37211 19485 52004 38357 52060 14377 -10854
7204 -10854 -38439 -20002 -37181 -39371 -987 20624 27678 -8827 -62015 -60506 -62402 -57377 -46826
7191 -46826 12169 60595 69663 106800 149980 123708 34584 -9875 14959 56312 34669 32252
7179 32252 -6178 -72962 -130587 -109972 -36206 -14486 42773 35257 14965 15846 43427 -26373
7167 -26373 -63544 -46720 -23195 -9269 -19873 -31037 34951 58131 46625 -11861 -41386 -6249
7155 -6249 -20668 -33680 8163 36736 -4918 -20887 -3780 4995 -7849 11822 -8606 -39908
7143 -39908 -13203 -12170 405 -63040 -115122 -69450 -5771 14634 16542 -1004 -12703 6939
7131 6939 12230 19834 -23018 -98629 -120166 -84461 -88663 -69971 -52232 -75793 -74169 -62354 -68891
$$ packed form
7217E4532j23o718m7602p3527N779K7862K586N6696L2519j3647J3703l7683k5231
7204a0854k7585J8437j7179k190L8384K1611P054l6505n3188J509j896N025J0551
7191d6826N8995M8426R068L7137M3180k6272q9124m4459K4834M1353k1643k417
7179C2252l8430o6784n7625K0615P3766K1720N7259p516k0292Q81K7581o9800
7167b6373l7171J6824K3525J3926j0604j1164O5988K3180j1506n8486k9525L5137
7155f249j4419j3012M1843K8573m1654j5969J7107Q775j2844J9671k0428l1302
7143c9908K6705J033J2575o3445n2082M5672O3679K0405J908j7546j1699J9642
7131F939N291P604m2852p5611k1537L5705m202J8692J7739k3561J624J1815o537
$$ plain form
7118 -68891 -67349 -28976 7255 -15490 -1120 2433 -19084 -32288 -63147 -129431 -168585 -114281
7106 -114281 -63110 -23157 6838 1086 -31867 -55744 -32143 -36646 -27542 10527 38240 71929
7094 71929 42668 3345 -19646 5218 -1693 -27078 -84240 4961 111070 113084 48351 18459
7082 18459 34847 73311 551 -107075 -116834 -88688 -67415 -101817 -139390 -55490 37023 66856
7070 66856 52133 17022 43850 27701 22536 20174 32570 76898 61840 37868 11493 1839
7058 1839 42968 34097 31450 33985 13000 9917 -58525 -114711 -103492 -91693 -97559 -112285 -100175
7045 -100175 -98301 -61670 13370 41017 41508 42273 9971 23965 18828 -14379 10677 -516 -19357
7032 -19357 -9098 60106 104589 85796 97152 91185 83413 34403 -23284 -18563 -36187 -51925
$$ packed form
7118f8891J542L8373L6231k2745J4370L553k1517j3204l0859o6284l9154N4304
7106a14281N1171L9953K9995n752l2953k3877K3601m503R104L8069K7713L3689
7094G1929k9261l9323k2991K4864o911k5385n7162Q9201J06109K014o4733k9892
7082A8459J6388L8464p2760j07626r759K8146K1273l4402l7573Q3900R2513K9833
7070F6856j4723l5111K6828j6149n165k362J2396M4328j5058k3972k6375r654
7058A839M1129q871k647K535k0985l083o8442n6186J1219J1799n866j4726J2110
7045a00175J874L6631P5040K7647M91P65l2302J3994n137l3207K5056j1193j8841
7032a9357J0259O9204M4483j8793J1356n967p772m9010n7687M721j7624j5738
$$ plain form
7020 -51925 -103668 -131255 -124121 -101055 -111056 -74647 -33519 -56772 -71710 -55284 -32072 19730
7008 19730 30889 37857 27605 872 37244 52956 47421 31631 32586 64882 75011 15038 24780
6995 24780 27574 -16184 -40926 -30245 -21113 -11471 8590 38787 20827 38785 53115 23587
6983 23587 -4893 -19551 -82354 -113186 -35784 -29245 -17959 5224 -20916 -18998 857 33874
6971 33874 57125 7903 -37557 -61899 -55341 -24322 -10995 -43044 -78421 -97123 -52936 -28989
6959 -28989 -1047 -1443 -15869 -37034 -11184 -11424 -2063 7275 -32835 -37303 -88364 -33734 33398
6946 33398 -24517 -86585 -91698 -46314 2593 27724 48635 68021 40909 20525 50474 42801
6934 42801 -35568 -112315 -56496 -57689 -44604 -5753 -8196 -18211 -62866 -20325 -11598 -30161
$$ packed form
7020e1925n1743k7587P134K3066j0001L6409M1128k3253j4938J6426K3212N1802
7008A9730J1159O968j0252k6733L6372J5712n535j5790R55L2296J0129n9973R742
6995B4780K794m3758k4742J0681R132R642K0061L0197j7960J7958J4330k9528
6983B3587k8480j4658o2803l0832P7402O539J1286K3183k6140J918J9855L3017
6971C3874K3251m9222m5460k4342O558L1019J3327l2049l5377j8702M4187K3947
6959b8989K7942l96j4426k1165K5850k40R361R338m0110m468n1061N4630O7132
6946C3398n7915o2068n113M5384M8907K5131K0911J9386k7112k0384K9949p673
6934D2801p8369p6747N5819j193J3085L8851k443j0015m4655M2541Q727j8563
$$ plain form
6922 -30161 -2253 -4598 -11866 -12737 -21282 17373 62440 74243 22632 2094 -3773 37498 16169
6909 16169 670 -50370 -80350 -70048 -65431 -66106 -70653 -32560 -19220 -41757 -13766 -21188 -24874
6896 -24874 -19154 -26632 -189 47758 50436 83777 49438 -2738 -1679 5876 -13405 -63751 -88453
6883 -88453 -66330 -38665 -16550 839 -21473 -21498 -6140 -18813 -15902 -48644 -85736 -54971 -42467
6870 -42467 -85152 -40991 -23966 -24809 -55890 -76553 -30750 -12421 1168 29125 8912 -11105
6858 -11105 -25222 -59505 -36753 -65596 -110661 -66382 -56169 -61712 -86110 -69711 -20885 -2981
6846 -2981 9609 85921 151813 124599 89586 11619 -50078 -57166 7264 21239 48353 60701
6834 60701 25685 14727 27757 -11311 -27533 9038 23273 48113 82131 111753 34744 -18555
$$ packed form
6922c0161K7908k345p268q71q545L8655M5067J1803n1611k0538n867M1271k1329
6909A6169j5499n1040k9980J0302M617o75m547L8093J3340k2537K7991p422l686
6896b4874N720p478K6443M7947K678L3341l4339n2176J059P555j9281n0346k4702
6883h8453K2123K7665K2115J7389k2312k5J5358j2673K911l2742l7092L0765J2504
6870d2467m2685M4161J7025q43l1081k0663M5803J8329J3589K7957k0213k0017
6858a1105j4117l4283K2752k8843m5065M4279J0213n543k4398J6399M8826J7904
6846b981J2590P6312O5892k7214l5013p7967o1697p088O4430J3975K7114J2348
6834F0701l5016j0958J3030l9068j6222L6571J4235K4840L4018K9622p7009n3299
$$ plain form
6822 -18555 -32306 21590 36877 45725 51517 8521 2608 19308 7843 -7890 -50420 -66333
6810 -66333 -43464 -9721 -14271 -45722 -51751 -30347 -4270 30780 11850 -29369 26044 28862
6798 28862 12187 21875 19283 9567 13240 34325 6867 -15154 33163 51540 -1589 -25035 36378
6785 36378 27686 -12790 -5208 25417 15178 -12021 25373 -25566 -94446 -75352 -50699 -43040
6773 -43040 11142 69503 108055 86660 23568 -10260 28610 24336 -48631 -130207 -114579 -71368
6761 -71368 -22404 36695 27664 -59426 -58183 -42507 -37013 20934 84808 56822 26247 57136
6749 57136 23640 5212 36676 20031 28520 31375 28087 25272 2555 -21856 -5410 23573 -6521
6736 -6521 -45891 -46068 -11567 212 -14630 2346 45594 81013 126513 74727 11391 1869 -901
$$ packed form
6822a8555j3751N3896J5287Q848N792m2996n913J6700j1465j5733m2530j5913
6810f6333K2869L3743m550l1451o029K1404K6077L5050j8930m1219N5413K818
6798B8862j6675R688k592r716L673K1085k7458k2021M8317J8377n3129k3446O1413
6785C6378q692m0476P582L0625j0239k7199L7394n0939o8880J9094K4653P659
6773d3040N4182N8361L8552k1395o3092l3828L8870m274p2967q1576J5628M3211
6761g1368M8964N9099r031q7090J243J5676N494N7947O3874k7986l0575L0889
6749E7136l3496j8428L1464j6645Q489K855l288k815k2717k4411J6446K8983l0094
6736f521l9370j77L4501J1779j4842J6976M3248L5419M5500n1786o3336r522k770
$$ plain form
6723 -901 -8851 -14211 -42326 -87065 -75492 -10985 24797 -2618 -646 18413 4741 3392 -9077
6710 -9077 -21521 -70289 -83128 -73624 -88149 -55216 18021 4492 -70341 -96226 -38509 -13830
6698 -13830 29862 37762 -4543 -35946 -61641 -58683 -36550 -24696 -42129 -44506 -53234 -103748 -74665
6685 -74665 -66971 -69478 -36621 3181 -45044 -139570 -144343 -112422 -64977 -27675 -62056 -80578
6673 -80578 -65556 -44649 22977 9293 -32099 -32623 36579 16973 -17400 -25309 -6839 -2910 9722
6660 9722 5808 10697 52986 71955 29929 -36046 -122971 -118293 -99067 -72082 -53488 -45252 -43950
6647 -43950 -63255 -35650 -5273 -7309 -44778 -25965 2552 -33250 -29968 -17962 -36299 -38211
6635 -38211 -37535 -10861 20120 90457 92271 117495 43235 -11421 -53460 -95063 -77493 -31448
$$ packed form
6723i01p950n360k8115m4739J1573O4507L5782k7415J972J9059j3672j349j2469
6710i077j2444m8768j2839R504j4525L2933P3237j3529p4833k5885N7717K4679
6698a3830M3692P900m2305l1403k5695K958K2133J1854j7433k377q728n0514K9083
6685g4665P694k507L2857L9802m8225r4526m773L1921M7445L7302l4381j8522
6673h0578J5022K0907O7626j3684m1392n24O9202j9606l4373p909J8470L929J2632
6660I722l914M889M2289J8969m2026o5975q6925M678J9226K6985J8594Q236J302
6647d3950j9305K7605L0377k036l7469J8813K8517l5802L282J2006j8337j912
6635c8211O76K6674L0981P0337J814K5224p4260n4656m2039m1603J7570M6045
$$ plain form
6623 -31448 -9967 -25810 -97461 -119351 -129135 -148988 -118407 -113412 -109001 -107075 -80272 -31933 20264
6610 20264 -3230 -28886 -37803 -46143 -100961 -70903 -3372 -31151 -35899 -93035 -126755 -88710
6598 -88710 -39049 45565 61243 86803 69512 14151 -6027 46428 13106 -25199 -25044 -22713
6586 -22713 -9038 20636 -5725 -33380 -58380 -11000 -22135 -81427 -39614 -3182 28828 8015
6574 8015 -12501 -29481 -52535 -66328 -27674 -16444 38319 36999 -2153 -49946 -103218 -105098
6562 -105098 -91965 -80701 -44146 -20391 -28128 -50056 -64853 -61738 -47330 -20462 -6682 9305
6550 9305 -22615 -4619 -62500 -116676 -91532 -60383 -4066 34619 33554 -24253 -63692 -43683
6538 -43683 25338 -46862 -95885 -89267 -47994 -55260 -37160 -32889 -29621 51731 65742 38992 20296
$$ packed form
6623c1448K1481j5843p1651k1890r784j9853L0581M995M411J926K6803M8339N2197
6610B0264k3494k5656q917q340n4818L0058O7531k7779m748n7136l3720L8045
6598h8710M9661Q4614J5678K5560j7291n5361k0178N2455l3322l8305J55K331
6586b2713J3675K9674k6361k7655k5000M7380j1135n9292M1813L6432L2010k0813
6574H015k0516j6980k3054j3793L8654J1230N4763j320l9152m7793n3272j880
6562a05098J3133J1264L6555K3755p737k1928j4797L115J4408K6868J3780J5987
6550I305l1920J7996n7881n4176K5144L1149N6317L8685j065n7807l9439K0009
6538d3683O9021p2200m9023O618M1273p266J8100M271L268Q1352J4011k6750j8696
$$ plain form
6525 20296 -10273 -42601 -53997 -35757 -2654 48261 45813 32569 -9573 -44156 -45556 -34246
6513 -34246 11508 22873 31328 -41857 -49365 -11104 43780 27835 -26925 -116261 -96798 -47124
6501 -47124 -27743 -62235 -64893 -73417 -41404 23780 42092 58723 48687 137 -3420 62669
6489 62669 86132 48242 44595 34028 -5824 -33453 -41349 -49899 -71402 -55075 -88006 -104706
6477 -104706 -72158 -7109 34081 45054 640 -6592 33210 48815 53723 17615 22996 7176
6465 7176 -52223 -79953 -79632 -38389 5809 5227 -37415 -12810 -4675 -8649 -37380 -85382 -45403
6452 -45403 -26100 -58700 -89618 -84481 -70024 -46955 -29578 -12820 -849 26174 56862 51335
6440 51335 44306 9309 7715 -10329 -59737 7523 57430 15004 -13040 -7031 27095 27117 -16142
$$ packed form
6525B0296l0569l2328j1396J8240L3103N0915k448j3244m2142l4583j400J1310
6513c4246M5754J1365Q455p3185p508L8261N4884j5945n4760q9336J9463M9674
6501d7124J9381l4492k658q524L2013O5184J8312J6631j0036m8550l557O6089
6489F2669K3463l7890l647j0567l9852k7629p896q550k1503J6327l2931j6700
6477a04706L2548O5049M1190J0973m4414p232L9802J5605M908l6108N381j5820
6465G176n9399k7730L21M1243M4198n82m2642K4605Q135l974k8731m8002L9979
6452d5403J9303l2600l0918N137J4457K3069J7377J6758J1971K7023L0688n527
6440E1335p029l4997j594j8044m9408O7260M9907m2426k8044O009L4126K2m3259
$$ plain form
6427 -16142 -691 -35990 -50815 -14445 -48754 -81915 -75211 -89798 -73880 -43268 -64144 -50140
6415 -50140 -44077 -62120 -16315 -36768 -50389 -89398 -45647 12024 51478 2245 -46602 -50007
6403 -50007 -33630 -18395 -16744 -34920 -911 2079 -62841 -31611 53246 -19434 -50422 -11680
6391 -11680 12467 -7908 -48314 -38316 -6289 -32748 -14707 41997 70752 69208 64504 9558
6379 9558 20270 8769 26820 10041 -28544 2824 5207 2452 -52087 -82954 -23902 4701
6367 4701 -35540 -91270 -55487 -16251 18337 14296 -20397 -21413 -34145 -36499 -37660 -52625 -28978
6354 -28978 -6559 -25100 -87419 -38015 -10926 -21964 149 21318 38336 55968 10370 -8703
6342 -8703 7804 -10699 -36545 -30276 -35368 -81972 -93518 -82064 -20801 46191 76848 46915
$$ packed form
6427a6142J5451l5299j4825L6370l4309l3161O704j4587J5918L0612k0876J4004
6415e0140O063j8043M5805k0453j3621l9009M3751N7671L9454m9233m8847l405
6403e0007J6377J5235J651j8176L4009K990o4920L1230Q4857p2680l0988L8742
6391a1680K4147k0375m0406R998L2027k6459J8041N6704K8755j544m704n4946
6379I558J0712j1501J8051j6779l8585L1368K383k755n4539l0867N9052K8603
6367D701m0241n5730L5783L9236L4588m041l4693j016j2732k354j161j4965K3647
6354b8978K2419j8541o2319M9404K7089j1038K2113K1169J7018J7632m5598j9073
6342h703J6507j8503k5846O269n092m6604j1546J1454O1263O6992L0657k9933
$$ plain form
6330 46915 39903 12556 -1268 929 -497 -13658 -78862 -88779 -38481 -59029 -27581 18809 61995
6317 61995 23959 2347 10594 -12829 -28500 -22548 -51289 -93638 -99463 -127535 -112929 -89857
6305 -89857 -56606 -74142 -51130 -32423 -65530 -32743 -10551 -30316 -31520 -68661 -58486 17832
6293 17832 82313 36977 48822 43900 -11414 -65700 -77487 -57076 -28656 -10015 -5141 -21944
6281 -21944 -23329 -56713 -33513 -39673 -43594 -38268 -47929 -33062 20260 36832 13773 27725 32764
6268 32764 35406 85215 81166 116352 104537 47793 22931 -7042 -36345 -57048 -46248 -20997
6256 -20997 -29614 -14035 -38962 -8976 19673 -15635 -11226 24348 -6241 23338 63702 46792
6244 46792 48799 29011 -25505 -52659 -28997 -1049 21780 16781 39078 -14001 -62697 -36229
$$ packed form
6330D6915p012k7347j3824K197j426j3161o5204r917N0298k0548L1448M6390M3186
6317F1995l8036k1612Q247k3423j5671N952k8741m2349n825k8072J4606K3072
6305h9857L3251j7536K3012J8707l3107L2787K2192j9765j204l7141J0175P6318
6293A7832O4481m5336J1845m922n5314n4286j1787K0411K8420J8641M874j6803
6281b1944j385l3384K3200o160l921N326r661J4867N3322J6572k3059J3952N039
6268C2764K642M9809m049L5186j1815n6744k4862k9973k9303k0703J0800K5251
6256b0997q617J5579k4927K9986K8649l5308M409L5574l0589K9579M0364j6910
6244D6792K007j9788n4516k7154K3662K7948K2829m999K2297n3079m8696K6468
$$ plain form
6232 -36229 -76092 -107084 -32827 13550 -29139 -37031 3432 -25842 -13163 -9961 -17486 -33760
6220 -33760 -33001 -3451 15036 27185 25352 1011 18491 17003 -22808 -55263 -40029 -409 -8310
6207 -8310 -20090 5734 14342 -5859 27226 35454 71954 47317 41682 -10072 -65736 -36940 -6131
6194 -6131 20729 18575 8959 -33408 -30340 35726 16898 49116 58120 24452 9389 31098 57261
6181 57261 41630 -8312 3504 -13298 -5351 -16835 -10761 -102 -7410 -51843 -38476 6335
6169 6335 14628 23754 8112 -332 -21043 -76745 -53509 -49597 16321 56603 35182 7965 3965
6156 3965 6178 10490 32141 35635 -19366 -81465 -137137 -99962 -59085 -48437 -14381 21383 8919
6143 8919 -30322 -54894 -5695 76813 124322 36076 5840 10454 -43560 -65614 -46681 -45323
$$ packed form
6232c6229l9863l0992P4257M6377m2689p892M0463k9274J2679L202p525j6274
6220c3760P59K9550J8487J2149j833k4341J7480j488l9811l2455J5234L9620p901
6207h310j1780K5824Q608k0201L3085Q228L6500k4637n635n1754n5664K8796L0809
6194f131K6860k154r616m2367L068O6066j8828L2218R004l3668j5063K1709K6163
6181E7261j5631m9942J1816j6802P947j1484O074J0659p308m4433J3367M4811
6169F335Q293R126j5642q444k0711n5702K3236L912O5918M0282k1421k7217m000
6156C965K213M312K1651L494n5001o2099n5672L7175M0877J0648L4056L5764j2464
6143H919l9241k4572M9199Q2508M7509q8246l0236M614n4014k2054J8933J358
$$ plain form
6131 -45323 -83659 -60332 -61260 -26230 22107 43982 -23587 -88239 -107722 -86944 -58072 -17013
6119 -17013 57200 33754 -40831 -16163 1497 -34462 -85753 -67806 -91743 -124155 -108055 -44877
6107 -44877 3700 7016 14307 54525 -10094 -39503 -39870 -99171 -54138 23461 13517 19266 3941
6094 3941 32066 1483 -63190 -25799 3417 21593 40160 81260 84661 -8880 -54761 -46622
6082 -46622 -48820 -23942 -40144 -10172 53560 11247 -25413 -53448 -29974 -25358 -10699 1985
6070 1985 6081 5079 -21049 -39592 -38967 -18299 -5418 23865 26050 19910 -7443 -61787 -35292
6057 -35292 -32244 -5113 7824 -49541 -164934 -117405 -37655 37282 26531 -56083 -93173 -105656
6045 -105656 -106750 -100138 -54544 -58578 -89297 -80495 -87239 -103431 -55328 -45169 -21830 17909 6245
$$ packed form
6131d5323l8336K3327r28L5030M8337K1875o7569o4652j9483K0778K8872M1059
6119a7013P4213k3446p4585K4668J7660l5959n1291J7947k3937l2412J6100O3178
6107d4877M8577L316P291M0218o4619k9409l67n9301M5033P7599r944N749j5325
6094C941K8125l0583o4673L7391K9216J8176J8567M1100L401r3541m5881Q139
6082d6622k198K4878j6202K9972O3732m2313l6660k8035K3474M616J4659J2684
6070A985M096j002k6128j8543O25K0668J2881K9283K185o140k7353n4344K6495
6057c5292L048K7131J2937n7365j15393M7529P9750P4937j0751q2614l7090j2483
6045a05656j094O612M5594m034l0719Q802o744j6192M8103J0159K3339L9739j1664
$$ plain form
6032 6245 34285 43564 18349 -11901 -47595 -114292 -97131 -53411 -16139 -12046 10606 23557
6020 23557 17143 7287 -19896 2355 -20616 21729 13279 17804 82300 72750 -16129 -7144 -10915
6007 -10915 -5611 28400 8002 35068 84403 112110 101164 64950 38061 66118 31268 3272
5995 3272 16612 41072 -42273 -35121 -10817 1854 -9417 -37248 12968 36315 20345 26316
5983 26316 37838 32783 51434 53548 38904 35305 47917 32455 10645 36051 55598 62654 -5812
5970 -5812 -98174 -106921 -107109 -127829 -116090 -76791 -11525 33652 89946 116339 109103 59409 58451
5957 58451 38844 -30429 -56855 21928 117730 148817 113233 79125 40027 12262 20104 36360
5945 36360 59391 56824 60315 39885 42690 23324 12689 70167 113937 100243 108528 108174 47714
$$ packed form
6032F245K8040R279k5215l0250l5694o6697J7161M3720L7272M093K2652J2951
6020B3557o414r856k7183K2251k2971M2345q450M525O4496r550q8879Q985l771
6007a0915N304L4011k0398K7066M9335K7707j0946l6214k6889K8057l4850k7996
5995C272J3340K4460q3345P152K4304J2671j1271k7831N0216K3347j5970N971
5983B6316J1522n055J8651K114j4644l599J2612j5462k1810K5406J9547P056o8466
5970e812r2362q747j88k0720J1739L9299O5266M5177N6294K6393p236m9694r58
5957E8451j9607o9273k6426P8783R5802L1087l5584l4108l9098k7765P842J6256
5945C6360K3031k567L491k0430K805j9366j0635N7478M3770j3694Q285l54o0460
$$ plain form
5932 47714 59641 59115 28847 27384 5389 -20363 -22004 -49956 -25982 -40623 -63948 -78743 -104847
5919 -104847 -119710 -101021 -77469 -45827 -25298 -97931 -84333 -79262 -108699 -77160 -30725 -21451
5907 -21451 -28695 -5450 -15165 9309 3855 -17351 -23761 -38798 -14865 586 99550 133314 33589
5894 33589 1532 -30379 -49928 -38200 -42570 11056 13015 34112 73094 85709 33580 -18268
5882 -18268 -3952 19515 51678 19385 -13742 4447 27229 -1260 -30349 -52503 -58046 -17482
5870 -17482 13174 2905 -8911 9226 30227 11155 36457 62121 37293 49355 68051 93361
5858 93361 53283 40014 76404 -89 -26366 -22102 974 55611 26218 44079 59020 58378
5846 58378 47394 19892 -34144 -58736 -90508 -130741 -147526 -124362 -70659 -39597 -63557 -60505
$$ packed form
5932D7714J1927n26l0268j463k1995k5752j641k7952K3974j4641k3325j4795k6104
5919a04847j4863J8689K3552L1642K0529p2633J3598N071k9437L1539M6435R274
5907b1451p244K3245r715K4474n454k1206o410j5037K3933J5451R8964L3764r9725
5894C3589l2057l1911j9549J1728m370N3626J959K1097L8982J2615n2129n1848
5882a8268J4316K3467L2163l2293l3127J8189K2782k8489k9089k2154n543M0564
5870a7482L0656j0269j1816J8137K1001j9072K5302K5664k4828J2062J8696K5310
5858I3361m0078j3269L6390p6493k6277M264K3076N4637k9393J7861J4941o42
5846E8378j0984k7502n4036k4592l1772m0233j6785K3164N3703L1062k3960L052
$$ plain form
5834 -60505 -19619 -41097 -31224 -27524 -12347 58547 25474 495 -1234 24738 37180 -52753
5822 -52753 -101829 -78616 -86145 -67998 -61999 -41063 -1737 21000 40990 36273 18764 -3747
5810 -3747 -27695 -4050 5824 12900 8466 -27463 -40660 -31707 -33213 -10340 -7675 -5785 -29463
5797 -29463 -72723 -105227 -65364 142 -32510 -50819 -82405 -57954 -24377 -37548 -8070 22389
5785 22389 -3821 -998 10589 54408 26316 10560 20047 22216 6595 20861 30979 -11047
5773 -11047 -38219 -41941 -27883 -23186 -40355 -57421 -82122 -72962 -45014 -53700 -124302 -105398 -50150
5760 -50150 -44250 28459 24893 -7932 -34893 -46842 -83470 -38369 -5094 -35624 -48226 -18971
5748 -18971 -24373 -75225 -70268 -28831 -22970 -16169 -12839 -35618 28280 46117 -31188 -60439 -58417
$$ packed form
5834f0505M0886k1478R873L700J5177P0894l3073k4979j729K5972J2442q9933
5822e2753m9076K3213p529J8147N999K0936L9326K2737J9990m717j7509k2511
5810c747k3948K3645R874P076m434l5929j3197Q953j506K2873K665J890k3678
5797b9463m3260l2504L9863O5506l2652j8309l1586K4451L3577j3171K9478L0459
5785B2389k6210K823J1587M3819k8092j5756R487K169j5621J4266J0118m2026
5773a1047k7172l722J4058M697j7169j7066k4701R160K7948q686p0602J8904N5248
5760e0150N900P2709l566l2825k6961j1949l6628M5101L3275l0530j2602K9255
5748a8971n402n0852M957M1437N861O801L330k2779O3898J7837p7305k9251K022
$$ plain form
5735 -58417 -65794 -90971 -98736 -82683 -67554 -21281 20674 5259 -15180 -13786 44390 42359 34719
5722 34719 53653 44176 41727 53258 18097 -20530 -19682 -20255 -15761 6509 15154 19667 47419 99467
5708 99467 39249 -11837 -7631 -35220 -24214 -33586 -64873 -49616 -63793 -39885 -5150 -22570
5696 -22570 -32911 -47902 -2782 35720 99875 53052 -27457 -24234 -19505 -45761 -92341 -101621
5684 -101621 -88486 -68364 -115615 -125170 -81341 -71021 -37186 -42018 -48223 -19902 -6288 16315
5672 16315 -17367 -27857 33961 59734 21850 -6351 1176 18797 68460 59333 -23560 -41417
5660 -41417 -18703 20524 -41347 -84217 -64131 -50239 -28768 -25066 503 3282 -8430 -37024
5648 -37024 -52360 -68992 -34784 -30821 -92818 -79370 -62115 -67281 -18879 -12744 -49838 -58246 -34323
$$ packed form
5735e8417p377k5177p765J6053J5129M6273M1955j5415k0439J394N8176k031p640
5722C4719J8934r477k449J1531l5161l8627Q48n73M494K2270Q645M513K7752N2048
5708I9467o0218n1086M206k7589J1006r372l1287J5257j4177K3908L4735j7420
5696b2570j0341j4991M5120L8502O4155m6823q0509L223M729k6256m6580r280
5684a01621J3135K0122m7251r555M3829J0320L3835m832o205K8321J3614K2603
5672A6315l3682j0490O1818K5773l7884k8201P527J7621M9663r127q2893j7857
5660d1417K2714L9227o1871m2870K0086J3892K1471L702K5569K779j1712k8594
5648c7024j5336j6632L4208L963o1997J3448J7255n166M8402O135l7094q408K3923
$$ plain form
5635 -34323 -7301 -23822 -32071 19022 10498 -10211 -32752 -36894 -73617 -56597 22405 88706
5623 88706 65781 6930 -48673 -37778 -4937 -11652 -5540 9072 28365 -11161 -29879 -43025
5611 -43025 15586 13151 -20543 -30066 5441 43696 40200 -36427 -29751 -49009 -35149 -13367 -55115
5598 -55115 -56663 -7630 5611 9085 -4659 38371 116275 95859 62794 52212 70453 53304
5586 53304 49456 70875 43549 20075 10594 -45059 -35249 -37405 -21901 -90488 -149414 -110912 -96094
5573 -96094 -54918 -99748 -72253 -31182 791 21757 35518 -15462 -53814 -18242 48781 52489
5561 52489 -10516 -92802 -135355 -142831 -91134 -38533 24581 1751 -33736 -41308 -80564 -95497
5549 -95497 -60820 -48620 -47005 -39142 20924 22272 -30843 -96439 -61449 -33021 38651 52082
$$ packed form
5635c4323K7022j6521q249N1093q524k0709k2541m142l6723J7020P9002O6301
5623H8706k2925n8851n5603J0895L2841o715O112J4612J9293l9526j8718j3146
5611d3025N8611k435l3694r523L5507L8255l496p6627O676j9258J3860K1782m1748
5598e5115j548M9033J3241L474j3744M3030P7904k0416l3065j0582J8241j7149
5586E3304l848K1419k7326k3474r481n5653R810k156J5504o8587n8926L8502J4818
5573i6094M1176m4830K7495M1071L1973K0966J3761n0980l8352L5572O7023L708
5561E2489o3005q2286m2553p476N1697N2601O3114k2830l5487p572l9256j4933
5549i5497L4677J2200J615P863O0066J348n3115o5596L4990K8428P1672J3431
$$ plain form
5537 52082 37388 8838 -18352 -53335 -81337 -97610 -66152 -49384 -60458 -54195 -38538 -16926
5525 -16926 -6455 -25592 -82924 -81808 -63992 -52043 -12028 21995 -9703 -61843 -61876 -78008 -93940
5512 -93940 -47318 -28056 -26097 -38032 -75531 -47708 -30558 -34504 -45251 -42551 -61466 -101258
5500 -101258 -85296 -65510 -76158 -49871 -47460 -79234 -75711 -48739 -28127 -26051 -8063 29582
5488 29582 23123 22181 -13365 -46956 -78509 -73272 -48215 -86368 -131861 -101350 -57241 16224 3077
5475 3077 -16518 -15894 -20658 -48619 -41116 -39626 -23998 -28072 -16630 -23995 -126928 -142544 -82787
5462 -82787 -74559 -63038 -46505 -42865 -42826 -95037 -103114 -65911 -13730 -2886 31507 33857 122449
5449 122449 98907 25381 12125 -5602 -73956 -74165 -111404 -85115 18921 35321 18302 -3796
$$ packed form
5537E2082j4694k8550k7190l4983k8002j6273L1458J6768j1074O263J5657K1612
5525a6926J0471j9137n7332J116J7816J1949M0015L4023l1698n2140l3j6132j5932
5512i3940M6622J9262J959j1935l7499K7823J7150l946j0747K700j8915l9792
5500a01258J5962J9786j0648K6287K411l1774L523K6972K0612K076J7988L7645
5488B9582o459r42l5546l3591l1553N237K5057l8153m5493L0511M4109P3465j3147
5475C077j9595O24m764k7961P503J490J5628m074J1442p365j02933j5616N9757
5462h2787Q228J1521J6533L640L9n2211q077L7203N2181J0844L4393K350Q8592
5449A22449k3542p3526j3256j7727o8354k09l7239K6289J04036J6400j7019k2098
$$ plain form
5437 -3796 -48931 -21567 34433 35160 -8170 15369 10325 -58337 -72294 -53527 -38007 -38400 -39867
5424 -39867 -19335 -16968 5329 27903 -18146 -51213 -17421 21091 48022 -2170 -39213 -38080
5412 -38080 -64716 -82876 -87971 -66918 -31158 -53778 18128 -1950 -41168 -53282 -49334 -59880
5400 -59880 -52308 -50023 -56953 -33631 30432 32327 51989 58779 82801 127674 80052 1448 5456
5387 5456 34939 37293 19602 5918 19243 30123 -12486 -60362 -93259 -108077 -54894 -10537
5375 -10537 37420 56734 38285 18551 -44048 -41518 -81416 -93115 -61586 -55733 -89398 -30935
5363 -30935 -17297 -3818 -5050 -64399 -93779 -70466 9392 79839 88783 24152 -20036 -73821
5351 -73821 -74661 -74722 -52606 -69623 -120739 -136484 -98023 -85673 -75496 -66494 -29978 -42813 -39208
$$ packed form
5437c796m5135K7364N6000P27m3330K3539n044o8662j3957J8767J5520l93j467
5424c9867K0532K367K2297K2574m6049l3067L3792L8512K6931n0192l7043J133
5412c8080k6636j8160n095K1053L5760k2620P1906k0078l9218j2114L948j0546
5400e9880P572K285o930K3322O4063J895J9662O790K4022M4873m7622p8604M008
5387E456K9483K354j7691j3684J3325J0880m2609m7876l2897j4818N3183M4357
5375a0537M7957J9314j8449j9734o2599K530l9898j1699L1529N853l3665N8463
5363c0935J3638J3479j232n9349k9380K3313P9858P0447Q944o4631m4188n3785
5351g3821q40o1K2116j7017n1116j5745L8461J2350J0177R002L6516j2835L605
$$ plain form
5338 -39208 -32145 167 -21098 -50670 -23795 -36058 -6098 52992 18496 26627 26315 -9155 -29325
5325 -29325 47143 71334 51666 85584 82424 35614 13814 -16649 -40174 -28798 -38181 -75914
5313 -75914 -52468 -66409 -66606 -46485 -76339 -48795 -15561 -47865 -25190 19331 12515 -48247
5301 -48247 -73241 -68232 -72000 -65494 -35204 -61821 -93821 -121587 -87759 -31043 27000 43381
5289 43381 45252 18839 27475 35007 20874 30592 -6988 -71838 -49740 -64748 -82047 -71278 -35056
5276 -35056 -36729 -32275 26831 9406 -52020 -72113 -104371 -104772 -63006 -46211 -62348 -19786 42778
5263 42778 2626 -66729 -34499 -50699 -80736 -67960 -45170 -41080 -60864 -23022 -24447 -47715
5251 -47715 -7433 -51047 -102104 -108503 -131683 -98954 -51352 -18292 -24479 -58021 -40513 -25157
$$ packed form
5338c9208P063L2312k1265k9572K6875j2263K9960N9090l4496Q131l12l5470k0170
5325b9325P6468K4191j9668L3918l160m6810k1800l0463k3525J1376r383l7733
5313g5914K3446j3941j97K0121k9854K7544L3234l2304K2675M4521o816o0762
5301d8247k4994N009l768O506L0290k6617l2000k7766L3828N6716N8043J6381
5289D3381J871k6413Q636P532j4133R718l7580o4850K2098j5008j7299J0769L6222
5276c5056j673M454N9106j7425o1426k0093l2258m01M1766J6795j6137M2562O2564
5263D2778m0152o9355L2230j6200l0037J2776K2790M090j9784L7842j425k3268
5251d7715M0282m3614n1057o399k3180L2729M7602L3060o187l3542J7508J5356
$$ plain form
5239 -25157 -8124 -14944 -47697 -39462 -84061 -87466 -57764 -23623 -23964 -7617 -2029 -9151 27408
5226 27408 69351 42742 31561 45993 36422 -25983 -41788 -47046 -55901 -65189 -64558 -96905 -134823
5213 -134823 -140229 -118018 -128270 -143887 -134034 -54085 -22933 35803 71371 64661 21736 3442
5201 3442 -12643 -327 32337 56447 44481 71493 74703 3407 -37554 -43512 -43939 -85007 -94771
5188 -94771 -82825 -38619 14896 26635 17623 578 8689 75897 73390 -7400 22221 -6892
5176 -6892 -26308 -15606 -47794 -53331 -9741 -317 8963 3516 7835 -16071 -70766 -92100 -61756
5163 -61756 -2438 38616 60962 74200 21674 -6595 42057 46336 19903 -33534 -63361 5955
5151 5955 39954 49016 8572 34748 55102 106951 118228 86982 24501 -1677 17048 29550
$$ packed form
5239b5157J7033o820l2753Q235m4599l405K9702L4141l41J6347N588p122L6559
5226B7408M1943k6609j1181J4432r571o2405j5805n258q855r288O31l2347l7918
5213a34823n406K2211j0252j5617R853P9949L1152N8736L5568o710m2925j8294
5201C442j6085J2316L2664K4110j1966K7012L210p1296m0961n958m27m1068r764
5188i4771J1946M4206N3515J1739r012j7045Q111O7208k507q0790K9621k9113
5176f892j9416J0702l2188n537M3590R424R280n447M319k3906n4695k1334L0344
5163f1756N9318M1054K2346J3238n2526k8269M8652M279k6433n3437k9827O9316
5151E955L3999R062m0444K6176K0354N1849J1277l1246o2481k6178J8725J2502
$$ plain form
5139 29550 31283 57785 12001 -16883 -10772 -10205 27465 64695 -4527 -75930 -49504 3891 55374
5126 55374 80541 94974 75598 38396 -27253 -18023 29956 -36001 -99066 -93778 -102934 -98607 -43742
5113 -43742 33013 17202 -25388 -47210 -88687 -91205 -40878 -70255 -20178 41861 16574 9936
5101 9936 16176 -37280 -90309 -67679 2891 8400 -675 -42295 -46288 -46476 -64640 -46327 -36051
5088 -36051 -48602 -95061 -112263 -66372 24619 6147 3209 49950 67180 26973 -3709 4628
5076 4628 41018 -2359 611 38137 38068 44459 41680 4259 20372 4035 4877 33604 10924 -20833
5062 -20833 -43354 -12389 -3456 15604 17675 30402 25591 48964 35547 40973 42397 14371 1959
5049 1959 20466 16525 16601 20548 54572 64618 83138 46479 -61941 -83968 -54617 -26575 -19431
$$ packed form
5139B9550J733K6502m5784k8884O111N67L7670L7230o9222p1403K6426N3395N1483
5126E5374K5167J4433j9376l7202o5649R230M7979o5957o3065N288r156M327N4865
5113d3742P6755j5811m2590k1822m1477k518N0327k9377N0077O2039k5287o638
5101I936O240n3456n3029K2630P0570N509r075m1620l993j88j8164J8313J0276
5088c6051j2551m6459j7202M5891R0991j8472k938M6741J7230m0207l0682Q337
5076D628L6390m3377K970L7526o9O391k779l7421J6113j6337Q42K8727k2680l1757
5062b0833k2521L0965Q933J9060K071J2727m811K3373j3417N426J424k8026j2412
5049A959J8507l941P6L947L4024J0046J8520l6659j08420k2027K9351K8042P144
$$ plain form
5036 -19431 -12658 1744 6005 26972 50337 3097 -43114 -67701 -14160 4559 -12288 -25614
5024 -25614 29901 56424 49117 -3625 -46338 -45759 -55890 -129384 -108011 -37965 -38121 -4011 -8446
5011 -8446 -22535 -32748 -783 6315 -33959 -72686 -46339 -42957 -44470 19647 52448 39603 -19525
4998 -19525 -36456 -60722 -77507 -18387 4597 1060 -56149 -75632 -102926 -146246 -83497 -29156
4986 -29156 -1084 -11018 -59466 -58151 -9935 35516 29986 33879 69047 126372 117842 71852 24826
4973 24826 -3126 40150 84545 81690 59034 45846 7499 30338 32187 32118 32965 13114 17055
4960 17055 22113 -10798 -28619 -30871 26389 28675 9406 38426 29840 17203 8955 28939 28915
4947 28915 -25700 8519 14822 3108 24118 -8146 -77829 -30562 1563 12197 -40826 -40076
$$ packed form
5036a9431O773J4402M261K0967K3365m7240m6211k4587N3541J8719j6847j3326
5024b5614N5515K6523p307n2742m2713N79j0131p3494K1373P0046j56L4110m435
5011h446j4089j0213L1965P098m0274l8727K6347L382j513O4117L2801j2845n9128
4998a9525j6931k4266j6785N9120K2984l537n7209j9483k7294m3320O2749N4341
4986b9156K8072r934m8448J315M8216M5451n530L893L5168N7325q530m5990m7026
4973B4826k7952M3276M4395k855k2656j3188l8347K2839J849o9Q47j9851L941
4960A7055N058l2911j7821k252N7260K286j9269K9020q586j2637q248J9984k4
4947B8915n4615L4219O303j1714K1010l2264o9683M7267L2125J0634n3023P50
$$ plain form
4935 -40076 -46794 -32548 -56329 -79106 -31159 -57870 -52966 -14201 4262 6830 -15126 -22207 -64026
4922 -64026 -24160 -33186 -61240 -88458 -66582 -88884 -105182 -100992 -109818 -101358 -32032 24642 45544
4909 45544 28545 79149 127193 75994 47602 71324 79569 27595 -25160 -49703 -33545 -4672
4897 -4672 19482 -52427 -89993 -97695 -84965 -1150 26449 25854 69182 76231 51479 39392 39580
4884 39580 66438 54637 54705 89632 112697 123388 18479 -76268 -61124 -25932 18835 15834
4872 15834 -17834 -59572 -42091 -18135 -21043 -7364 -7371 -7032 -22875 -75144 -36194 37580 30917
4859 30917 35064 -21209 -28494 13407 16936 1878 2320 67330 81930 59587 -8282 1530 -51553
4846 -51553 -46291 -33613 -8156 -2788 58540 85158 98265 64881 55017 6653 22185 44002
$$ packed form
4935d0076o718J4246k3781k2777M7947k6711M904L8765J8463K568k1956p081m1819
4922f4026L9866r026k8054k7218K1876k2302j6298M190q826Q460O9326N6674K0902
4909D5544j6999N0604M8044n1199k8392K3722Q245n1974n2755k4543J6158K8873
4897d672K4154p1909l7566p702J2730Q3815K7599n95M3328P049k4752j2087J88
4884C9580K6858j1801O8L4927K3065J0691j04909r4747J5144L5192M4767l001
4872A5834l3668m1738J7481K3956k908J3679pL39j5843n2269L8950P3774o663
4859C0917M147n6273p285M1901L529j5058M42O5010J4600k2343o7869R812n3083
4846e1553N262J2678K5457N368O1328K6618J3107l3384r864m8364J5532K1817
$$ plain form
4834 44002 46676 -256 -3010 62113 47847 -3412 -18754 -20855 -71501 -65675 -41997 8787 -51661
4821 -51661 -70716 -82259 -75114 -56929 -31428 -35889 -45334 -38782 -86723 -54481 -35347 -592 -10466
4808 -10466 -94189 -95894 -56312 -48571 17104 44573 -9659 -25931 -37526 -43157 -21407 -5437
4796 -5437 -10390 -4900 -7129 -46955 -73831 -43156 -45695 -92519 -85483 -28187 -35182 -71406 -86023
4783 -86023 -33763 14 18110 25973 33385 11518 -4173 33905 49398 12831 12085 22135 -17895
4770 -17895 -78206 -86798 -28169 17622 9289 -77211 -138390 -91892 -61110 -80179 -62107 -49487
4758 -49487 -54678 -58647 -76953 -140276 -117085 -80145 -68667 -41944 6465 29703 28323 -19896
4746 -19896 -14663 25499 22822 -4079 -7046 12409 -588 9509 18346 -4438 7998 -29365 -62274
$$ packed form
4834D4002K674m6932k754O5123j4266n1259j5342k101n0646N826K3678N0784o0448
4821e1661j9055j1543P145J8185K5501m461r445O552m7941L2242J9134L4755r874
4808a0466q3723j705L9582P741O5675K7469n4232j6272j1595n631K1750J5970
4796e437m953N490k229l9826k6876L0675k539m6824P036N7296o995l6224j4617
4783h6023N2260L3777J8096P863P412k1867j5691L8078J5493l6567p46J0050m0030
4770a7895o0311q592N8629M5791q333q6500o1179M6498L0782j9069J8072J2620
4758d9487n191l969j8306o3323K3191L6940J1478K6723M8409K3238j380m8219
4746a9896N233M0162k677k6901k967J9455j2997J0097Q837k2784J2436l7363l2909
$$ plain form
4733 -62274 -80306 -60933 -43924 -35148 14473 85629 39121 -69102 -102035 -66012 -34386 -89110
4721 -89110 -134839 -118127 -98067 -85750 -71174 -39079 1096 -62482 -98476 -79596 -30440 38157
4709 38157 13121 42584 86459 53032 5447 -45455 -73808 -43751 -31612 -28840 -4913 -43200
4697 -43200 -54637 -46379 -51790 -27595 8272 7996 -17036 -28998 -16415 -30566 -39031 -36105 -11331
4684 -11331 -1260 -22447 -36166 -53852 -6121 15306 4259 6411 18021 19302 31070 5847
4672 5847 -43188 -55274 3972 25735 -55754 -72343 -49169 -57030 -71437 -69296 -39922 -40549 12560
4659 12560 48946 26005 10216 20802 -1949 -25759 -63364 -29455 -32501 -27084 20050 31126
4647 31126 5391 28520 59274 13853 -12816 12239 36530 81170 75954 28436 51406 22551
$$ packed form
4733f2274j8032J9373J7009Q776M9621P1156m6508j08223l2933L6023L1626n4724
4721h9110m5729J6712K0060J2317J4576L2095M0175o3578l5994J8880M9156O8597
4709C8157k5036K9463M3875l3427m7585n0902k8353L0057J2139K772K3927l8287
4697d3200j1437Q258n411K4195L5867k76k5032j1962J2583j4151q465K926K4774
4684a1331J0071k1187j3719j7686M7731K1427j1047K152J1610J281J1768k5223
4672E847m9035j2086N9246K1763q1489j6589K3174p861j4407K141K9374o27N3109
4659A2560L6386k2941j5789J0586k2751k3810l7605L3909l046N417M7134J1076
4647C1126k5735K3129L0754m5421k6669K5055K4291M4640n216m7518K2970k8855
$$ plain form
4635 22551 -39048 -70897 -33890 13788 18889 -26811 -49243 -87218 -42474 -42864 -48359 -53670 -83288
4622 -83288 -90135 -73780 -5611 -12863 6915 -2997 28969 -31525 -73542 -54469 -10294 25176
4610 25176 -428 -59330 -58731 -88776 -81760 -66741 -90142 -124549 -82749 -49167 -34645 -61801
4598 -61801 -47908 20379 198 5691 32923 2642 -53275 -16503 -1193 5345 16311 28307
4586 28307 34643 5353 23012 435 -7352 -62313 -82111 -73492 -57914 -34224 -19068 3691
4574 3691 -39111 -63701 -42811 35553 77803 52832 42604 21403 221 -33993 -5329 -15083
4562 -15083 -25496 -50093 3056 60222 57584 8755 -75264 -67499 -15704 -20434 -40780 -37598 -46930
4549 -46930 -37504 -69605 -129052 -142956 -128945 -85683 -38966 -37598 -63187 -86728 -86132 -36206 14242
$$ packed form
4635B2551o1599l1849L7007M7678N101m5700k2432l7975M4744l90n495n311k9618
4622h3288o847J6355O8169p252J9778r912L1966o0494m2017J9073M4175L5470
4610B5176k5604n8902N99l0045P016J5019k3401l4407M1800L3582J4522k7156
4598f1801J3893O8287k0181N493K7232l0281n5917L6772J5310O538J0966J1996
4586B8307O336k9290J7659k2577p787n4961j9798Q619J5578K3690J5156K2759
4574C691m2802k4590K0890P8364M2250k4971j0228k1201k1182l4214K8664r754
4562a5083j0413k4597N3149N7166k638m8829q4019P765N1795m730k0346L182r332
4549d6930R426l2101n9447j3904J4011M3262M6717J368k5589k3541N96M9926N0448
$$ plain form
4536 14242 20886 32788 25259 43421 63110 35811 53684 63593 43352 -16371 12737 -49430
4524 -49430 -76050 -97936 -95279 -109474 -74115 -33079 -13950 -29053 -59576 -42468 -27844 -513
4512 -513 2924 25659 -24884 -39281 -40912 -30257 -14009 -36918 -46512 -44484 -38725 -4512 32830
4499 32830 12775 28 -51267 -65256 -59440 -93015 -131070 -105475 -25832 49012 9926 3183
4487 3183 42754 20129 7443 11774 29025 6188 13809 53969 75860 20645 8056 23077
4475 23077 -3494 -803 1746 -28376 -27237 -22342 -54139 -73692 -81373 -41259 6258 51114 23589
4462 23589 19245 44694 16275 31732 62412 36805 41469 67270 47244 15343 30943 21378
4450 21378 17891 -2444 -33366 -17566 -9703 46613 134963 175321 142260 44817 -7149 -5704
$$ packed form
4536A4242O644J1902p529J8162J9689k7299J7873R909k0241n9723K9108o2167
4524d9430k6620k1886K657j4195L5359M1036J9129j5103l0523J7108J4624K7331
4512e13L437K2735n0543j4397j631J0655J6248k2909r594K028N759L4213L7342
4499C2830k0055j2747n1295j3989N816l3575l8055K5595P9643P4844l9086o743
4487C183L9571k2625j2686M331J7251k2837P621M0160K1891n5215j2589J5021
4475B3077k6571K691K549l0122J139M895l1797j9553p681M0114M7517M4856k7525
4462B3589m344K5449k8419J5457L0680k5607M664K5801k0026l1901J5600r565
4450B1378l487k0335l0922J5800P863N6316Q8350M0358l3061r7443n1966J445
$$ plain form
4438 -5704 -3989 -52346 -74749 10936 83032 78868 57812 -39875 -73572 -95716 -117209 -72376
4426 -72376 -68529 -63864 -4554 54243 29469 -4641 -57035 -66681 -36311 -39692 -69961 -96492 14901
4413 14901 62954 42929 49109 21955 24116 25893 6648 -45228 -83600 -16832 35524 50135
4401 50135 2388 13967 3633 -1648 16913 40021 -913 -11537 -29510 -68309 -57057 40987
4389 40987 107475 62257 42309 63781 55940 42842 47394 27450 -38711 -36190 13454 -16077
4377 -16077 -51784 -67171 -81718 -64225 -79766 -112601 -92649 -55077 -45418 -66123 -56836 -3723
$$ packed form
4438e704J715m8357k2403Q5685P2096m164k1056r7687l3697k2144k1493M4833
4426g2376L847M665N9310N8797k4774l4110n2394r646L0370l381l0269k6531J11393
4413A4901M8053k0025O180k7154K161J777j9245n1876l8372O6768N2356J4611
4401E0135m7747J1579j0334n281J8561K3108m0934j0624j7973l8799J1252R8044
4389D0987O6488m5218j9948K1472p841j3098M552j9944o6161K521M9644k9531
4377a6077l5707j5387j4547J7493j5541l2835J9952L7572R659k0705R287N3113
$$ [...]
##END NTUPLES=NMR SPECTRUM
##END=
