##TITLE=Analysis number 327108
Compound Code cc 37113
Book Reference 508/70
Project Code adrs
Chemist Name antons
##JCAMPDX= 6.0         $$ Bruker NMR JCAMP-DX V2.0
##DATA TYPE= NMR SPECTRUM
##DATA CLASS= NTUPLES
##ORIGIN= Bruker BioSpin GmbH
##OWNER= nmr
$$ XWIN-NMR		Version 3.5
$$ Mon Mar 12 11:08:34 2007 GMT Standard Time (UT+0h)  MAYBRIDGE\nmr@NMR_250MHZ
##.OBSERVE FREQUENCY= 250.131544655141
##.OBSERVE NUCLEUS= ^1H
##.ACQUISITION MODE= SIMULTANEOUS (DQD)
##.ACQUISITION SCHEME= undefined
##.AVERAGES= 16
##.DIGITISER RES= 18
##SPECTROMETER/DATA SYSTEM= dpx250
##.PULSE SEQUENCE= zg30
##.SOLVENT NAME= CDCl3
##.SHIFT REFERENCE= (INTERNAL, CDCl3, 0, 16.522)
##AUDIT TRAIL= $$ (NUMBER, WHEN, WHO, WHERE, WHAT)
$$ ##TITLE= Audit trail, XWIN-NMR		Version 3.5
$$ ##JCAMPDX= 5.01
$$ ##ORIGIN= Bruker BioSpin GmbH
$$ ##OWNER= nmr
$$ C:\u/data/dgb/nmr/ADRS/630/pdata/1/auditp.txt
$$ ##AUDIT TRAIL=  $$ (NUMBER, WHEN, WHO, WHERE, WHAT)
(   1,<2007-03-12 11:08:15.00 +000>,<MAYBRIDGE\nmr>,<NMR_250MHZ>,
      <created by zg, POWCHK disabled, PULCHK disabled
       configuration hash MD5:
       49 4B E0 1D 92 C2 6B 37 9F E6 65 BC 52 41 86 1D
       data hash MD5: 64K
       74 69 56 15 9D 3E 6A 57 D6 F8 A9 9D F1 C1 26 65>)
(   2,<2007-03-12 11:08:25.85 +000>,<MAYBRIDGE\nmr>,<NMR_250MHZ>,
      <Start of raw data processing
       ef LB = 0.3 FT_mod = 6 PKNL = 1 SI = 32K 
       data hash MD5: 32K
       A2 2C C7 02 0B 4B 1D AF 8A FB AF 0B 0F 80 08 A1>)
(   3,<2007-03-12 11:08:27.57 +000>,<MAYBRIDGE\nmr>,<NMR_250MHZ>,
      <apk 
       data hash MD5: 32K
       DE 30 B4 77 DE 57 A6 34 6A 39 0E 5A 7C 0B 93 1A>)
(   4,<2007-03-12 11:08:28.28 +000>,<MAYBRIDGE\nmr>,<NMR_250MHZ>,
      <abs ABSG = 5 
       data hash MD5: 32K
       0C AC 30 0C FB E2 25 A5 4D F7 CC 29 5B 40 97 83>)
$$ ##END=
$$ 
$$ hash MD5
$$ B0 91 F0 92 B2 CB 79 24 85 DF 89 DB E0 C8 07 07
##$RELAX= 
##$RELAX= 
##$RELAX= 
##$RELAX= 
##$RELAX= 
##$RELAX= 
##$RELAX= 
$$ Bruker specific parameters
$$ --------------------------
##$DU= <C:\u>
##$EXPNO= 630
##$NAME= <ADRS>
##$PROCNO= 1
##$TYPE= <nmr>
##$USER= <dgb>
##$AMP= (0..31)
100 100 100 100 100 100 100 100 100 100 100 100 100 100 100 100 100 100 
100 100 100 100 100 100 100 100 100 100 100 100 100 100 
##$AQSEQ= 0
##$AQ_mod= 3
##$AUNM= <au_zg>
##$AUTOPOS= <3 >
##$BF1= 250.13
##$BF2= 250.13
##$BF3= 250.13
##$BF4= 250.13
##$BF5= 500.13
##$BF6= 500.13
##$BF7= 500.13
##$BF8= 500.13
##$BYTORDA= 1
##$CFDGTYP= 0
##$CFRGTYP= 5
##$CHEMSTR= <none>
##$CNST= (0..31)
1 1 145 1 1 1 1 1 1 1 1 1 1 1 1 1 1 1 1 1 1 1 1 1 1 1 1 1 1 1 1 1 
##$CPDPRG= <>
##$CPDPRG1= <>
##$CPDPRG2= <>
##$CPDPRG3= <>
##$CPDPRG4= <mlev>
##$CPDPRG5= <mlev>
##$CPDPRG6= <mlev>
##$CPDPRG7= <mlev>
##$CPDPRG8= <mlev>
##$CPDPRGB= <>
##$CPDPRGT= <>
##$D= (0..31)
0 1 0 0 0 0 0 0 0 0.06 0 0 0 0 0 0 0.0002 0 0 0 0 0 0 0 0 0 0 0 0 0 0 
0 
##$DATE= 1173697694
##$DBL= (0..7)
120 120 120 120 120 120 120 120 
##$DBP= (0..7)
150 150 150 150 150 150 150 150 
##$DBP07= 0
##$DBPNAM0= <>
##$DBPNAM1= <>
$$ [...]
##$SUBNAM7= <"">
##$SUBNAM8= <"">
##$SUBNAM9= <"">
##$SW= 20.6930455092707
##$SWIBOX= (0..15)
0 0 3 0 0 0 0 0 0 0 0 0 0 0 0 0 
##$SW_h= 5175.983436853
##$TD= 65536
##$TD0= 1
##$TE= 683.16
##$TE2= 300
##$TE3= 300
##$TEG= 300
##$TL= (0..7)
0 120 120 120 120 120 120 120 
##$TP= (0..7)
150 150 150 150 150 150 150 150 
##$TP07= 0
##$TPNAME0= <>
##$TPNAME1= <>
##$TPNAME2= <>
##$TPNAME3= <>
##$TPNAME4= <>
##$TPNAME5= <>
##$TPNAME6= <>
##$TPNAME7= <>
##$TPOAL= (0..7)
0.5 0.5 0.5 0.5 0.5 0.5 0.5 0.5 
##$TPOFFS= (0..7)
0 0 0 0 0 0 0 0 
##$TUNHIN= 0
##$TUNHOUT= 0
##$TUNXOUT= 0
##$USERA1= <user>
##$USERA2= <user>
##$USERA3= <user>
##$USERA4= <user>
##$USERA5= <user>
##$V9= 5
##$VALIST= <valist>
##$VCLIST= <CCCCCCCCCCCCCCC>
##$VD= 0
##$VDLIST= <DDDDDDDDDDDDDDD>
##$VPLIST= <PPPPPPPPPPPPPPP>
##$VTLIST= <TTTTTTTTTTTTTTT>
##$WBST= 1024
##$WBSW= 4
##$XGAIN= (0..3)
0 0 0 0 
##$XL= 0
##$YL= 0
##$YMAX_a= 343788
##$YMIN_a= -444684
##$ZGOPTNS= <>
##$ZL1= 120
##$ZL2= 120
##$ZL3= 120
##$ZL4= 120
##$ABSF1= 16.522
##$ABSF2= -4.171173
##$ABSG= 5
##$ABSL= 3
##$ALPHA= 0
##$AQORDER= 0
##$ASSFAC= 0
##$ASSFACI= 0
##$ASSFACX= 0
##$ASSWID= 0
##$AUNMP= <proc_1d>
##$AZFE= 0.1
##$AZFW= 0.1
##$BCFW= 0
##$BC_mod= 0
##$BYTORDP= 0
##$COROFFS= 0
##$CY= 12.5
##$DATMOD= 1
##$DC= 0
##$DFILT= <>
##$DTYPP= 0
##$F1P= 14.0000005364418
##$F2P= -0.99999901652339
##$FCOR= 0.5
##$FTSIZE= 32768
##$FT_mod= 6
##$GAMMA= 0
##$GB= 0
##$INTBC= 1
##$INTSCL= 1
##$ISEN= 128
##$LB= 0.3
##$LEV0= 0
##$LPBIN= 0
##$MAXI= 10000
##$MC2= 0
##$MEAN= 0
##$ME_mod= 0
##$MI= 0
##$NCOEF= 0
##$NC_proc= -3
##$NLEV= 6
##$NOISF1= 0
##$NOISF2= 0
##$NSP= 0
##$NTH_PI= 0
##$NZP= 0
##$OFFSET= 16.522
##$PC= 1
##$PHC0= 230.4563
##$PHC1= 4.344526
##$PH_mod= 1
##$PKNL= yes
##$PPARMOD= 0
##$PSCAL= 4
##$PSIGN= 0
##$REVERSE= no
##$SF= 250.13
##$SI= 32768
##$SIGF1= 0
##$SIGF2= 0
##$SINO= 400
##$SIOLD= 32768
##$SREGLST= <1H.CDCl3>
##$SSB= 0
##$STSI= 32768
##$STSR= 0
##$SW_p= 5175.98343685301
##$SYMM= 0
##$S_DEV= 0
##$TDeff= 65536
##$TDoff= 0
##$TI= <Analysis number 999999
Compound Code 99
Book Reference 9
Project Code 9>
##$TILT= no
##$TM1= 0
##$TM2= 0
##$TOPLEV= 0
##$USERP1= <user>
##$USERP2= <user>
##$USERP3= <user>
##$USERP4= <user>
##$USERP5= <user>
##$WDW= 1
##$XDIM= 32768
##$YMAX_p= 318664248
##$YMIN_p= -49890
$$ End of Bruker specific parameters
$$ ---------------------------------
##NTUPLES= NMR SPECTRUM
##VAR_NAME=  FREQUENCY,     SPECTRUM/REAL,   SPECTRUM/IMAG
##SYMBOL=    X,             R,               I
##VAR_TYPE=  INDEPENDENT,   DEPENDENT,       DEPENDENT
##VAR_FORM=  AFFN,          ASDF,            ASDF
##VAR_DIM=   32768,         32768,           32768
##UNITS=     HZ,            ARBITRARY UNITS, ARBITRARY UNITS
##FACTOR=    0.157963299565203, 1,           1
##FIRST=     4132.6476996994, 0,             0
##LAST=      -1043.33573715361, 0,           0
##MIN=       -1043.33573715361, -49890,      0
##MAX=       4132.6476996994, 318664248,     0
$$ Real data points
##PAGE= N=1
##DATA TABLE= (X++(R..R)), XYDATA
$$ [...]
17068B951847p8042l0609L2847R2594J62834K22058K72128L60782M82545O12341
17058E081325Q06807J199359J817110K447214K681274K564218K660552K693622
17050B1951481J652319j13705j175576j456773j532713j387225o48860N25051
17042A7813999J459474J807393K117029K434314J589440m46316k006956k606569
17034B2161808l008452l361713l357122k876725k178377j534290j041354p39353
17026D064422n54773m34873l60750l21214k65717k21686j78935j60536j32201
17017A433737r9938p9364o9764o3289n2865q3188q0887p1834p4036q0011p8074
17006F00487m6059k4280l6211j7369k1715k1626j3831j1773q508j771j6973q959
$$ plain form
17068 2951847 2873805 2843196 2876043 2968637 3131471 3353529 3625657 3986439 4468984 5081325
17058 5081325 5888132 7087491 8904601 11351815 14033089 16597307 19257859 21951481
17050 21951481 23603800 23490095 22314519 20857746 19325033 17937808 17288948 17813999
17042 17813999 19273473 21080866 23197895 25632209 27221649 26775333 24768377 22161808
17034 22161808 19153356 15791643 12434521 9557796 7379419 5845129 4803775 4064422
17026 4064422 3509649 3074776 2714026 2392812 2127095 1905409 1726474 1565938 1433737
17017 1433737 1333799 1254435 1184671 1121382 1068517 985329 904442 832608 758572 678561 600487
17006 600487 554428 530148 493937 476568 454853 433227 419396 407623 399115 397344 380371 371412
16994C71412k1594j4039m222l467M573n796p171K704O936P271j297j2251p466
16981C15593k529J5245m415j628P52K513n723j4066J97J3887K2613L1621Q732
16968C82792m333L609Q271J2493p897k1099j6700j3633l740N163R185q627r141
16955C36343L621J7407P266J4258L3664K4231J6363K0997K8526K7901L5654L2425
16943E98656O1098N9852Q4231J10290J26456J38979J43046J05717P2102M2816
16933A543243L0608J9749K8426N1737R3661J35227J94109K68105L54104M86670
16923C205639O87646R84019J452545K193188L347133M975337O884216Q586150
16915C2315873R229478Q097579N104682Q61073l351891o464120p765337p434793
$$ plain form
16994 371412 349818 335779 331557 328090 332663 326867 319696 322400 329336 336607 335310 323059 315593
16981 315593 313064 328309 323894 322266 323018 325531 319808 305742 305939 319826 342439 374060 382792
16968 382792 378459 382068 390339 402832 394935 373836 357136 343503 339763 344926 354111 345484 336343
16955 336343 339964 357371 364637 378895 412559 436790 453153 474150 502676 530577 566231 598656
16943 598656 659754 719606 803837 914127 1040583 1179562 1322608 1428325 1500427 1543243
16933 1543243 1573851 1593600 1622026 1673763 1767424 1902651 2096760 2364865 2718969 3205639
16923 3205639 3893285 4877304 6329849 8523037 11870170 16845507 23729723 32315873
16915 32315873 41545351 49642930 54747612 55608685 52256794 45792674 38027337 30592544
16907C0592544o115546m588189l309268k406348j845759j493668j230071j028683
16899H575012q71551p49049o80128n85444m74224l91349k89778j98150j21517
16890D213822p7551k9522j5728J8023M8006R5612J60727K77673M58923O91653
16880E841638J030653J505100K113762K819261L592401M320393M866773N164881
16872C1254862M979484M301950L267938K001245J099263P93862J253909K184934
16864E1137447K933939L032446K210279Q65974o38580k009243k980902l852707
16856E0698653m553194n166860n571340n628425n348350m756143l959033l111697
16848A2603611k376765j776407j316448j003714p64379n85177m66225l65119k86626
$$ plain form
16907 30592544 24476998 19888809 16579541 14173193 12327434 10833766 9603695 8575012
16899 8575012 7703461 6954412 6274284 5688840 5214616 4823267 4533489 4335339 4213822
16890 4213822 4136271 4106749 4091021 4109044 4157050 4252662 4413389 4691062 5149985 5841638
16880 5841638 6872291 8377391 10491153 13310414 16902815 21223208 26089981 31254862
16872 31254862 36234346 40536296 43804234 45805479 46904742 47698604 48952513 51137447
16864 51137447 54071386 57103832 59314111 60180085 59541505 57532262 54551360 50698653
16856 50698653 46145459 40978599 35407259 29778834 24430484 19674341 15715308 12603611
16848 12603611 10226846 8450439 7133991 6130277 5365898 4780721 4314496 3949377 3662751
16839C662751k47904k37744k14074j99573j86939j78228j43502j04617o0378P411
16829B097203Q9052K03537K88666L06954K60753J44125m8500k54290l80071m15267
16819B292162l91768l35863k58749j80301j21211q3856p0589m5041m4078m5411
16809G15295n4788m7857l2545l2802k1343j5131k1676m759o447k1184o304k8132
16797D22327j6784J396j7606k5542j4312j9367k5743j5087L179M198m779r11L941
16784B94910o180J946k1596n847J259K849O495k118J654k2119j6920K448k2122
16771B14659k4858j2437q61o257o972l270l740J7384l753j7477l672J3944k824
16758A59866m250P720O922n917p451l870n31L246k466p174j735q896q153q333
$$ plain form
16839 3662751 3414847 3177103 2963029 2763456 2576517 2398289 2254787 2150170 2089792 2097203
16829 2097203 2186255 2389792 2678458 2985412 3246165 3390290 3341790 3087500 2707429 2292162
16819 2292162 1900394 1564531 1305782 1125481 1004270 920414 849825 804784 760706 715295
16809 715295 660507 612650 580105 547303 525960 510829 489153 484394 477947 456763 450459 422327
16797 422327 405543 406939 389333 363791 349479 330112 304369 289282 292461 296659 291880 290969 294910
16784 294910 288730 290676 269080 263233 264492 267341 273836 271718 273372 251253 234333 236781 214659
16771 214659 189801 177364 176503 170246 163274 160004 156264 173648 169895 152418 148746 162690 159866
16758 159866 155616 163336 170258 164341 156890 153020 152489 155735 153269 146095 144360 135464 127311 118978
16744A18978M527K0534J3116O105K68J4443k379l004J697j8945l250Q790M347
16731A65227O659M595j1774j1045Q313J236q433j7820j0626P96K372K220M175
16718A35895k613j7551m336O560R733j9774j2049k1216l571j0642Q226M06J5184
16705H4252M242J022p803p751q477J932R380J1511l980O887P12J2239j5501l452
16691H5213K565K52K051R243p098q292r209l638Q35N561q06o878R540k741l339
16676G3259n29J1980J2733J4813n127j8483j4016k403K0609J893p135j0496p084
16663G0014j1199l214n456O833j359M269P257L886p845m532j855m115J0383j096
16649F1971p490j5326k526Q831J1841J0939q400j5775P880R581Q07K026j035o499
$$ plain form
16744 118978 123505 144039 157155 163260 163528 177971 175592 172588 174285 155340 152090 160880 165227
16731 165227 171886 176481 164707 153662 161975 163211 154778 136958 126332 127128 129500 131720 135895
16718 135895 133282 115731 111395 117955 127688 107914 95865 74649 71078 60436 68662 69068 84252
16705 84252 88494 89516 81713 73962 65485 67417 76797 88308 84328 91215 91927 104166 88665 85213
16691 85213 87778 88030 90081 99324 92226 83934 74725 71087 71922 77483 76677 69799 79339 76598 73259
16676 73259 72730 84710 97443 112256 107129 88646 74630 72227 92836 94729 87594 77098 70014
16663 70014 58815 55601 50145 56978 55619 59888 67145 71031 63186 58654 56799 52684 63067 61971
16649 61971 54481 39155 36629 45460 57301 68240 59840 44065 51945 61526 62333 64359 63324 56825
16635E6825n938M12j67J953J0601J3820p672q966q49k465k55L472J694j066N350
16620F6749r150M372o196J960l427j2968m216k939l307K2328K853j6679m540j518
16606C3322J1987Q563J7279j059m045q218R563K8513R164J5930Q715O615R599
16593A45928l623j8360j5517r566m611J5202J4039P469N392N71J2522J4136p043
16580A56539J503r514j3429k0700j6566k3210j4349j6530O618J2227M207j0309
16568E6487j4311J0804q09m901K460J1685o383q951m552m952o658p241Q940J339
16554C2957J0194M224p789j94J0689Q950O949J7648l500N170J0590K585l56K509
16540A00626M256r802j8584N141P907k193Q150J3541N760J996j2376k3899n142
$$ plain form
16635 56825 50887 51299 51132 53085 63686 77506 69834 60868 60019 57554 57299 60771 62465 61399 66749
16620 66749 57599 61971 55775 57735 54308 41340 37124 34185 30878 53206 56059 39380 34840 33322
16606 33322 45309 53872 71151 70092 66047 57829 67392 95905 105069 120999 129714 136329 145928
16593 145928 142305 123945 108428 98862 94251 109453 123492 130961 136353 136924 149446 163582 156539
16580 156539 158042 148528 135099 114399 97833 74623 60274 43744 50362 62589 66796 56487
16568 56487 42176 52980 52171 47270 49730 61415 55032 46081 41529 36577 29919 22678 31618 32957
16554 32957 43151 47375 39586 39392 50081 59031 65980 83628 80128 85298 95888 98473 98117 100626
16540 100626 104882 95080 76496 81637 89544 87351 95501 109042 114802 116798 104422 80523 75381
16527G5381j2369j3675m754Q6r134q227r084Q06n238m031J7713K2202o30j981
16513D7065j0338j0033Q379K489p182L032k785j477r622j8974O405J2135L623
16500B2717j550M552j1108k24J2548N383j724k814R705n063N015r159p389o000
16486A4889l070K2369M662m602O499q825j2761k1413m82J6806n889j2783j6590
16473b1190J0761K467J6619o150o714o318n228N830P572K104K710j456J809J8643
16459B1459L557o057r431j1955o740r078N992J2092O495L170K938R302m725L540
16445B0559j030J764p142M341L157J606J3307P360K313P309L873o676J4542j442
16431F3841Q917N65m401J5373L0113N0717K7714K1857L4026K1991P88j4963m5274
$$ plain form
16527 75381 63012 49337 44583 44669 35535 27308 18224 19030 13792 9761 27474 49676 49046 47065
16513 47065 36727 26694 35073 37562 30380 33412 30627 29150 19528 554 6959 19094 22717
16500 22717 21167 25719 14611 14387 26935 32318 30594 27780 37485 32422 37437 28278 20889 14889
16486 14889 11819 34188 38850 34248 40747 31922 19161 -2252 -2734 14072 8183 -4600 -21190
16473 -21190 -10429 -7962 8657 2507 -4207 -10525 -15753 -9923 -2351 -247 2463 1007 2816 21459
16459 21459 25016 18959 9528 -2427 -9167 -18245 -12253 -161 6334 9504 12442 21744 17019 20559
16445 20559 19529 21293 14151 18492 21649 23255 36562 43922 46235 53544 57417 50741 65283 63841
16431 63841 72758 73323 68922 84295 114408 165125 192839 214696 248722 270713 271501 256538 211264
16418B11264m2723l0997j3464j2260j3248k1726j5507n966J07m770j1903l96M3
16405C8454k142J7352q735N200J2753l234n077q406n32p119m843J0868K2673K0434
16391H7646J2040R500J8988K1107J6663K8421K5000J9877N655q658j9607q985
16379B07647J0277J4321K3319L3460L4993L3066L5815J0581k678k4870k9262n3462
16367B93207m7076m6439l8648l0034k8422l4181j1043l2J10J0059j1682n46j907
16354E3366j116Q579j697j84L960q538n085j872j0867r331J584n49Q583n277j1790
16339A9766r83J801o708j628j385M190J2400k91L491n567j85M974l527Q366J7884
16324E2598k423j2362k4589o802K183n26Q236o621m553l123R73K214J20m68N171
$$ plain form
16418 211264 168541 137544 124080 111820 98572 76846 61339 55373 55480 50710 38807 38411 38454
16405 38454 36312 53664 44929 50129 62882 59648 54571 46165 45633 38514 33671 44539 67212 87646
16391 87646 99686 109186 128174 149281 165944 194365 219365 239242 244897 236239 216632 207647
16379 207647 217924 232245 255564 289024 324017 357083 392898 403479 400801 375931 346669 293207
16367 293207 246131 199692 161044 131010 102588 68407 57364 57332 57442 67501 55819 55273 53366
16354 53366 52250 60829 59132 58948 62908 54370 49285 47413 36546 27215 28799 28250 36833 31556 19766
16339 19766 18783 20584 13876 12248 10863 15053 27453 27162 30653 25086 24901 29875 26348 34714 52598
16324 52598 50175 37813 13224 6422 8605 8079 16315 9694 5141 2018 2991 5205 5325 4857 10028
16309A0028l718k925M073J4831J2458n606p939K052k69j2042k40K962j1816p825
16295e976l405N451o970P538J5659K342j5444j0533k972J4192K6229m070q056
16282A3985n169Q27m064K528p69j1355j960N65P099Q855J1927N595j4380Q296
16268B1980l339q347M560l167m548N502P95N65M15q442p323m689j0613j109K909
16253a4851J1241K3774M620q249Q132Q917k6852q720r302J1871J3155K88J1224
16240B5248N985j4823q336J1276J3756N397j1189j4252j1263k276J5250J4962
16228B9735j827n376j1355r831q773N972J048J0642N090j3536q520q700M018O299
16214e114K550R229k698J233j836k5259k370J4939K451P594J0419q46L648l060
$$ plain form
16309 10028 6310 3385 7458 22289 34747 29141 21202 23254 22985 10943 10703 13665 1849 -5976
16295 -5976 -9381 -3930 -10900 -3362 12297 14639 -805 -11338 -14310 -118 26111 22041 13985
16282 13985 8816 9643 5579 8107 7338 -4017 -5977 -5412 1687 10542 22469 28064 13684 21980
16268 21980 18641 10294 14854 11687 7139 12641 13436 14001 14416 5974 -1349 -6038 -16651 -17760 -14851
16253 -14851 -3610 20164 24784 16535 24667 33584 6732 -1988 -11290 581 13736 14024 25248
16240 25248 31233 16410 8074 19350 33106 38503 27314 13062 1799 -477 14773 29735
16228 29735 27908 22532 11177 1346 -7427 -1455 -407 10235 15325 1789 -6731 -15431 -11413 -5114
16214 -5114 -2564 6665 3967 5200 3364 -21895 -24265 -9326 -6875 719 11138 10292 13940 10880
16200A0880q277N069J1579o239p494J0074O240K842K455o052n602R191k310m37
16186B1919p671j9070j6222J901J4358L70o095L592P284L018j3016K932M735n218
16172g183p608l358P959P540o832J208N743L271O208M937j0100o350P714K618
16158E767N924l794K260P11J945m951m259p406o782M371l41l504K076L541O82
16143c760n635j4389M638M294O43J7209L325k156J0421o251L285k769j504p560
16129b09m057K4042K989j5043K645R778j4657j1226N932Q460O266p790j4658j725
16115i253O000M652J835K55r786M585J6833J1772r808j178P615j6759p019L42
16101H6Q547N848j886J1126m39j1644j2649j1348R601p809J2512j1576j0945N22
$$ plain form
16200 10880 2603 7672 19251 13012 5518 15592 21832 24674 27129 21077 15475 24666 22356 21919
16186 21919 14248 -4822 -21044 -19143 -4785 -4415 -10510 -6918 366 3384 -9632 -6700 -1965 -7183
16172 -7183 -14791 -18149 -10190 -2650 -9482 -8274 -2531 740 6948 11885 1785 -4565 3149 5767
16158 5767 11691 7897 10157 10868 12813 7862 3603 -3803 -10585 -6214 -6555 -10059 -7983 -4442 -3760
16143 -3760 -9395 -23784 -19146 -14852 -14209 3000 6325 4169 14590 8339 11624 8855 7351 -209
16129 -209 -4266 19776 22765 7722 10367 20145 5488 -5738 194 8654 14920 7130 -7528 -9253
16115 -9253 -3253 1399 3234 3489 -6297 -1712 15121 26893 17085 15907 23522 6763 -256 86
16101 86 8633 14481 12595 23721 23282 11638 -1011 -12359 -2758 -10567 1945 -9631 -20576 -20054
16087b0054J3526n817j399P411P510P428K823K461R011L373j2862j3141k4761
16074b4491j627M810N476O538Q859M777o789Q343J2873P351J440k921Q8k2531
16060B196n262l75K033j2192P10J2283P60J035M864M783n905j5970m634R153J8311
16045A1790N957o90P350r591j0652O352N645J2619J2572o602k1281k4946R515
16032a962M917J5551R378j2291q190M503L51K304O142L176o725o720r063j0031
16018h660j152J99O108j3281r493J4634O857N192J1356O309q184q565J0012L635
16004A4967j1445m122l437o994K612Q243m92m667j963P479O198j540r709M800
15990g0R697K865n6j1540j373l580r296P374k685j4661J155l509N600r30J273
$$ plain form
16087 -20054 -6528 -12345 -13744 -6333 1177 8605 11428 13889 22900 26273 13411 270 -24491
16074 -24491 -26118 -21308 -15832 -9294 -435 4342 -2447 5896 18769 26120 27560 24639 24727 2196
16060 2196 -3066 -3441 -1408 -13600 -12890 -607 153 1188 6052 10835 4930 -11040 -15674 -6521 11790
16045 11790 17747 17057 24407 14816 4164 10516 16161 28780 41352 34750 13469 -11477 -1962
16032 -1962 2955 18506 27884 15593 7403 11906 12257 14561 20703 23879 17154 10434 1371 -8660
16018 -8660 -9812 -9613 -3505 -16786 -26279 -11645 -4788 404 11760 18069 9885 1320 11332 14967
16004 14967 3522 -600 -4037 -11031 -8419 -176 -668 -5335 -7298 181 6379 4839 -4870 -70
15990 -70 9627 12492 12436 896 -477 -4057 -13353 -5979 -8664 -23325 -22170 -25679 -20079 -21009 -19736
15975a9736O827r065J384J9404M560L168R400k728p652l159J2457L534q492k645
15961G257r767p834q257K0892J0071q815j7734k881K2998J5414j4050l823K162
15948E633j720L557L110j998j3750k116j065q36P61J3390J4361r013j7247j0101
15934a7034J7008P84l04R026q188j1913Q307O671n938j2073O656J8352P131M59
15920A8944k8422j7263J53J2257J1329K4690J485r755p320n94N235j097J421P736
15906A8799M67p571r18j7648k0631L417j617N524K2285l967l631P942R777l078
15892I150j2689j198n314R97L202J932M09l899M342Q365o875m127R961j1294p692
15877a4730J073J0517P598Q637j021k291q348j7l928j0645o490L487K607O613
$$ plain form
15975 -19736 -12909 -21974 -20590 -1186 3374 6542 15942 13214 5562 2403 14860 18394 9902 7257
15961 7257 -2510 -10344 -18601 2291 12362 3547 -14187 -17068 5930 21344 7294 3471 5633
15948 5633 3913 7470 10580 8582 -5168 -7284 -8349 -9185 -8424 4966 19327 10314 -6933 -17034
15934 -17034 -26 758 454 9480 1292 -10621 -2314 4357 -1581 -13654 -6998 11354 18485 18944
15920 18944 -9478 -26741 -26588 -14331 -3002 21688 23173 13418 6098 5504 10739 9642 11063 18799
15906 18799 19266 11695 10777 -6871 -27502 -24085 -25702 -20178 2107 -1860 -5491 2451 12228 9150
15892 9150 -3539 -4737 -10051 -9054 -5852 -3920 -3511 -7410 -3068 5297 -1578 -5705 4256 -7038 -14730
15877 -14730 -13657 -3140 4458 13095 12074 9783 1435 1418 -2510 -13155 -19645 -16158 -13551 -6938
15863f938j853L951j0611N4O863J4671N106n86l42Q00n965K219q128m716N969
15848D94P531j765k2496o155J292R77l696k527L992K0681R404M206P32l585o336
15833B749k238n354O868q679r755P256N428L923M515n293o666J0671N694j7845
15819h726m621N016n049R882J4675P151R767j220q272j0298j0403r901k22n812
15805a8033k012K171J2094K116m788N324J051j812P520q79l600n42n323o514K5
15790a3202K71O741n530q21N554M791Q798m962P339O268L431l644j1990J967Q231
15775A3242L897K1j795j7101j191Q451r62Q162R55j3001j6326n472K356k074K141
15760a8697l25p10K781O356k694L314J447P396p219j9762l695O190P023L724O569
$$ plain form
15863 -6938 -8791 -4840 -15451 -15397 -8534 6137 11243 10657 10315 11115 5150 7369 -759 -5475 494
15848 494 8025 6260 -16236 -22391 -21099 -20122 -23818 -26345 -22353 -1672 7732 11938 12670 9085 2749
15833 2749 511 -4843 2025 -6654 -16409 -9153 -3725 198 4713 -580 -7246 3425 9119 -8726
15819 -8726 -13347 -8331 -13380 -3498 11177 18328 28095 26875 18603 8305 -2098 -11999 -12221 -18033
15805 -18033 -20045 -17874 -5780 -3664 -8452 -3128 -2077 -3889 3631 2752 -848 -1390 -6713 -13227 -13202
15790 -13202 -12931 -6190 -11720 -12541 -6987 -2196 6602 1640 8979 15247 18678 15034 3044 5011 13242
15775 13242 17139 17160 15365 -1736 -2927 5524 4562 12724 13679 678 -15648 -21120 -18764 -20838 -18697
15760 -18697 -19022 -19732 -16951 -10595 -13289 -9975 -8528 -1132 -8351 -28113 -31808 -25618 -18595 -14871 -8302
15745h302P106r095k603J1151l659O294m891N129m749p608q536J6626L613j2941
15731a2465p134J5470J2852l131j7661M633J2388n279J776k609O626O167P810
15718A9443q749j0915J495j4030m466m683J5153J9201j927j3274q823J4503o462
15705c534j4679n126M209P868P948O024m451K542m67m427L895K575K964j2180
15691f839j2065l301Q881K0433N713r969Q063m067p764j2400L617J5417j549j3780
15677i610l626j3213R5O725m593M119R753O518L926J231R65O598l737o431L692
15662B412P668R367k531q862p870J33M348p518q439J0171J3473L351j0196K335
15648G842L08o022q279j4706p189J6689M204m947j0870j2483q945J2917N732k448
$$ plain form
15745 -8302 -1196 -10291 -12894 -1743 -5402 892 -3999 1130 -3619 -11227 -19763 -3137 476 -12465
15731 -12465 -19599 -4129 8723 5592 -12069 -7436 4952 -327 1449 -1160 5466 11633 19443
15718 19443 10694 -221 1274 -12756 -17222 -21905 -6752 12449 10522 -2752 -11575 2928 -3534
15705 -3534 -18213 -23339 -19130 -11262 -3314 2710 -1741 801 334 -4093 -198 2377 5341 -6839
15691 -6839 -18904 -22205 -13324 7109 12822 2853 10916 6849 -915 -13315 -9698 5719 4170 -9610
15677 -9610 -13236 -26449 -26354 -19629 -24222 -20103 -10350 -3832 94 1325 2290 8888 5151 -1280 2412
15662 2412 10080 19447 16916 8054 184 317 4665 -2853 -11292 -1121 12352 15703 5507 7842
15648 7842 8150 2128 -6151 -20857 -28046 -11357 -7153 -12100 -22970 -35453 -44398 -31481 -25749 -28197
15634b8197O595J0574n352k677J318M717k815j3609p63P236N154J1981J0795J3327
15620A8284q557m473n532j6010K518J0862n179P64J5297M542j401o675j3518m702
15606a3780P605r89J533k550L473o257J531o6m894O80O18j44r59J7432K797o230
15590b00j112N801o915o023p116K2904J4541M776q021j9469j7047M680J4775j2097
15576a0523M596J2958M899j2816j6712K488M518J1743n248n109Q975Q833M922
15563A3524J604p325n258o550L465J2625l424q659j9939j1131N782j792M634J5280
15549g164J642M765j70n6l537n547J812J000l027k147J0229K613q546J0752Q70
15534C489j2292k623J2170R218j1242j3184J6724O119K074N790j0272L250R685
$$ plain form
15634 -28197 -21602 -11028 -16380 -19057 -17739 -13022 -15837 -29446 -30209 -22973 -17819 -5838 4957 18284
15620 18284 9727 5254 -278 -16288 -13770 -2908 -8087 -7323 7974 12516 11115 4440 -9078 -13780
15606 -13780 -6175 -7164 -5631 -8181 -4708 -10965 -9434 -9500 -14394 -13714 -13096 -13240 -14199 3233 6030 -200
15590 -200 -1312 4489 -2426 -8449 -15565 7339 21880 26656 18635 -834 -17881 -13201 1574 -10523
15576 -10523 -5927 7031 11930 -886 -17598 -15110 -10592 1151 -4097 -9206 -231 8602 13524
15563 13524 15128 7803 2545 -4005 -540 12085 8661 2 -19937 -31068 -25286 -27078 -22444 -7164
15549 -7164 -5522 -757 -927 -983 -4520 -10067 -8255 -7255 -10282 -12429 -2200 413 -8133 2619 3489
15534 3489 -8803 -11426 744 9962 -1280 -14464 2260 8379 10453 16243 5971 9221 18906
15521A8906m008k2860l975K189K428P067o377r262K549l71j431k236j1971K143
15507b7209L488O687j2255p845N210P211J6547J8980R394J233r93j6881k3186
15494a9619l943n474j062k42K747J6914J9377J4760Q225j3144k5620m890O900
15481e071J2936P983j0580k234o520q172q293j0628m171N058P706Q129L292J85
15467a0380M455J055K57M508J472J043o804R55q29M255n277j5343j0302p336J7061
15452b1210L3969o188n524p485k842L324j233j3747j234l846q448l977Q119J6895
15438a3427j740m827M079M970m090N338m34j2717j014P065N001O14L257M043k671
15423f553j0107j440J950o294J4112J9305o680q16l634j414n841M767m977p019
$$ plain form
15521 18906 14898 -7962 -11937 -9748 -7320 -253 -6630 -15892 -13343 -13714 -15145 -17381 -29352 -27209
15507 -27209 -23721 -17034 -29289 -37134 -31924 -24713 -8166 10814 20208 21441 20448 3567 -19619
15494 -19619 -23562 -29036 -30098 -30340 -27593 -10679 8698 23458 31683 18539 -7081 -11971 -5071
15481 -5071 7865 15848 5268 3034 -3486 -11658 -19951 -30579 -34750 -29692 -21986 -13857 -10565 -10380
15467 -10380 -5925 -4870 -4613 -105 1367 2410 -4394 -3439 -4268 -13 -5290 -20633 -30935 -38271 -21210
15452 -21210 12759 6571 1047 -6438 -9280 -5956 -7189 -20936 -22170 -26016 -34464 -38441 -30322 -13427
15438 -13427 -15167 -19994 -15915 -10945 -15035 -9697 -10131 -22848 -23862 -16797 -11796 -11182 -7925 -3882 -6553
15423 -6553 -16660 -18100 -16150 -22444 -8332 10973 4293 3477 -157 -1571 -7412 -2645 -7622 -14641
15409a4641P917n29J080m225r829J0017K757o159R803J3259L827o567j1238K658
15395a870J1873K3244L930j2564m243m925j6099j6348r204P835J4189m40j0956
15382a5578p309p310L502K887N711K509M003N217n461o583K657n01N474J1060
15368B78R516j4753j590J7408L062j7308k2796k28J5097N145j658J016j2446j2061
15354c1318m688K0300Q508L748j859M73L540P85m233j788J7696J5338p309q292
15340A0901k722j7177j3907K199Q815K085M598J2951K458n977m996n989o051q276
15326b1088q283J0595K705K100J854J4553j128L045m432O99J1049J761l664j0566
15312h00r602J0375r540m515N631P007M159K499j8683j1642P860J8106O797j0859
$$ plain form
15409 -14641 -6724 -7253 -6173 -10398 -20227 -10210 -7453 -13612 -3809 9450 13277 6710 -4528 -1870
15395 -1870 10003 33247 37177 24613 20370 15445 -654 -17002 -26206 -18371 -4182 -4622 -15578
15382 -15578 -22887 -30197 -26695 -23808 -18097 -15588 -11585 -6368 -11829 -18412 -15755 -16256 -10782 278
15368 278 9794 -4959 -6549 10859 13921 -3387 -26183 -26411 -11314 -6169 -7827 -6811 -19257 -31318
15354 -31318 -36006 -15706 -7198 -3450 -5309 -4836 -1296 -511 -4744 -6532 11164 26502 19193 10901
15340 10901 8179 -8998 -22905 -20706 -11891 -9806 -5208 7743 10201 4224 -772 -6761 -12812 -21088
15326 -21088 -29371 -18776 -16071 -13971 -12117 2436 1308 4353 -79 620 11669 13430 9766 -800
15312 -800 -10402 -27 -9567 -14082 -8451 -1444 2715 5214 -13469 -25111 -17251 855 7652 -3207
15298c207M387p89n154L328Q124J4251J7240O980Q038r963k9807m578L977n492
15284G335j0585n229J6352K953j5330P524Q59j5815J272J2899m780k1073n241
15271b8859R671m77L082l987O21M799K289M111J841J3186r369K977N860q856j5722
15256a8833L707O451p030j552L7J090m847O602L960p599j2588p998l63J2944M754
15241b1265j877m255k475l508P304Q061J2344J6198m645l046p535K687J616N513
15227E117O635l323L873p116J977P209O761q776n477l646j0143q610j497k200
15213a9216J1913O354K747j782K861J300O203L799j3974r710j7320K626J5919
15200h280J857N785P316j663p945L06Q488J0393J8450j5011o141N83j2911K444
$$ plain form
15298 -3207 1180 391 -4763 -1435 6689 20940 38180 45160 53198 43235 13428 8850 12827 7335
15284 7335 -3250 -8479 7873 10826 -4504 3020 3879 -11936 -10664 2235 -2545 -23618 -28859
15271 -28859 -19188 -19665 -16583 -20570 -19949 -15150 -12861 -8750 -6909 6277 -3092 -115 5745 -3111 -18833
15256 -18833 -15126 -8675 -15705 -17257 -17220 -16130 -20977 -14375 -10415 -18014 -30602 -38600 -38963 -26019 -21265
15241 -21265 -23142 -27397 -29872 -33380 -26076 -18015 -5671 10527 5882 2836 -4699 -2012 -396 5117
15227 5117 11752 8429 12302 5186 7163 14372 21133 12357 6880 3234 -6909 -15519 -17016 -19216
15213 -19216 -7303 -949 1798 16 2877 4177 10380 14179 205 -9505 -26825 -24199 -8280
15200 -8280 -6423 -638 6678 5015 -2930 -2624 5864 16257 34707 19696 13555 14138 1227 3671
15186C671n179M43n211j0930N225k821p923J2334K5894M163n674j5761p451P881
15172a339J0959P174j5335j4394j8325O020J0081J8799R45j2495J8109Q115k859
15159A5455R753L882n193k0229q614L050m245o501k529j397j107L045k378j704
15145a8712J2320O756K336l322j0565J807j7338m667N630K74O042J6584l291n706
15131a1852M252K483O45J5645l037j3199k530M108N187L126o035p901o131N481
15117i758j363k505J6975O751m846N972k022J5m702p619p904m343P816j461l94
15102i388m584m835Q952J8014q816p203Q016J0244L740j4802K647O134J0516n610
15088A3025j3333n105R65k425O248M972J0449J1285N715o189j6013M467q400j2305
$$ plain form
15186 3671 -1508 -1065 -6276 -17206 -11981 -14802 -22725 -10391 15503 19666 13992 -1769 -9220 -1339
15172 -1339 9620 16794 1459 -12935 -31260 -25240 -15159 3640 4585 -7910 10199 18314 15455
15159 15455 25208 29090 23897 3668 -4946 -1896 -6141 -12642 -15171 -16568 -17675 -14630 -17008 -18712
15145 -18712 -6392 364 2700 -622 -11187 -9380 -26718 -31385 -25755 -25481 -19439 -2855 -6146 -11852
15131 -11852 -7600 -5117 -4472 11173 8136 -5063 -7593 -3485 1702 4828 -1207 -9108 -15239 -9758
15117 -9758 -11121 -13626 3349 10100 5254 11226 9204 9219 4517 -3102 -11006 -15349 -7533 -8994 -9388
15102 -9388 -13972 -18807 -9855 8159 -657 -7860 156 10400 14140 -662 1985 8119 18635 13025
15088 13025 -308 -5413 -4448 -6873 -625 4347 14796 26081 31796 25607 9594 14061 5661 -6644
15074f644K120O520P825M073m726J0077r461j2171M926l653o10N856J3779l095
15060A4816j5992j941L447O31r165j0255l762J0082J8555L103j6830j610r414
15047a8335k600J1062O252p127k113r212K538J670J328J3205M231l233r113N428
15033f019K127n703J992k793m415O805j3198J0519P729J086j113M993J5896q847
15019I059q225o505m454L022P727J565m687l433J4996Q368j3040l977O005j5400
15005h979L621J7183R081p046j1155j2114Q911J3189R149J850K510j8779j14N257
14991A2564m414j79j207j330L399N556r843j3928K811M884j0038o347O069j1211
14977b3214p31N831M038M360L105R374j0188O32k402k962p153m902Q727j7820
$$ plain form
15074 -6644 -4524 1996 9821 13894 9168 19245 9784 -2387 2539 -1114 -1724 4132 17911 14816
15060 14816 -1176 -3117 330 961 -8204 -18459 -22221 -12139 6416 9519 -7311 -8921 -18335
15047 -18335 -20935 -9873 -3621 -10748 -12861 -22073 -19535 -17865 -16537 -3332 899 -2334 -11447 -6019
15033 -6019 -3892 -9595 -7603 -10396 -14811 -8006 -21204 -10685 -2956 -1870 -2983 2010 17906 9059
15019 9059 834 -5671 -10125 -7103 624 2189 -2498 -5931 9065 17433 4393 416 6421 -8979
15005 -8979 -5358 11825 20906 13860 2705 -9409 -498 12691 21840 23690 26200 7421 7307 12564
14991 12564 8150 7971 6764 5434 8833 14389 4546 -9382 -6571 -1687 -11725 -18072 -12003 -23214
14977 -23214 -23945 -18114 -14076 -9716 -6611 2763 -7425 -6793 -9195 -12157 -19310 -24212 -15485 -33305
14963c3305J7921J8622J296r319n925q853j731J795n90R164J6457k692P429l617
14949F652l375q54L690P049j138p283J015n950n295m383j0979J414q054O35M714
14934b2142J1184N979L483k577n561L84o546J096j008J0336M939j4349K097J907
14920a0778R686j8011j3331J5030j401j0641K2441R947o798N57o276j9564p897
14907c7036K2864J8745L966n874j1790m333k613P149q69l241j676M661J0264J354
14893A571M04K079r609j0910r589n472O513J1814J3649J3446l449o097o647j441
14879c738N31L086P201l131q586J2540l233j1115R823L507K236n100m856j3293
14865a4128r655N045J5667J493r827k729K685K307j073m290j3052j471k439K03
$$ plain form
14963 -33305 -15384 3238 4534 -4785 -10710 -19563 -21294 -19499 -20089 -10925 5532 2840 10269 6652
14949 6652 3277 2423 6113 13162 12024 4741 5756 -194 -5489 -9872 -20851 -19437 -27491 -26856 -22142
14934 -22142 -10958 -4979 -1496 -4073 -9634 -9250 -15796 -14700 -15708 -5372 -433 -14782 -12685 -10778
14920 -10778 -1092 -19103 -32434 -17404 -18805 -29446 -7005 2942 -3856 -3299 -9575 -29139 -37036
14907 -37036 -14172 4573 8539 2665 -9125 -13458 -16071 -8922 -9791 -13032 -14708 -10047 217 1571
14893 1571 1975 4054 -5555 -16465 -26054 -31526 -25013 -13199 450 13896 10447 4350 -2297 -3738
14879 -3738 -3207 -121 7080 3949 -4637 7903 4670 -6445 3378 6885 9121 4021 -835 -14128
14865 -14128 -23783 -18738 -3071 -1578 -11405 -14134 -11449 -9142 -10215 -14505 -27557 -29028 -31467 -31264
14851c1264L387m091J2051J3766P942m494N686O454l569n824k084N67n462M761
14837b174R819j2754J790N934p238R28p501p849P530J2876p150m974l672Q349
14823f086J1710N703Q59r376p821q817J7507J7508j4077l085k581j2959O276J316
14809c923J0300R77m532o163O760j019l725M667l293p067n223J731k081P521J315
14794c755j0050O494R804m879k424R824o769q774L328l101p553j0851r231J757
14780c6180J8306R509j221K719j5175O079R275m824j089J8288Q018l261j0187
14767B57m174k487P661l58j543J1463R676l733k192k226J0305J2618j925n623
14753B7719j5501j4689J239J5557m88r396j5831l122Q457j425q966J3529Q595
$$ plain form
14851 -31264 -27877 -31968 -19917 -6151 1791 -2703 2983 9437 5868 44 -2040 -1473 -6935 -2174
14837 -2174 7645 -5109 -3319 2615 -4623 -3695 -11196 -19045 -11515 1361 -5789 -10763 -14435 -6086
14823 -6086 5624 11327 12186 2810 -5011 -13828 3679 21187 7110 4025 1444 -11515 -5239 -3923
14809 -3923 6377 7354 2822 -3341 3419 2400 -1325 3342 49 -7018 -12241 -10510 -12591 -5070 -3755
14794 -3755 -13805 -7311 2493 -2386 -4810 5014 -1755 -10529 -7201 -10302 -17855 -28706 -37937 -36180
14780 -36180 -17874 -8365 -9586 -6867 -22042 -15963 -6688 -11512 -12601 5687 13705 10444 257
14767 257 -3917 -6404 1257 899 -644 10819 20495 16762 14570 12344 22649 35267 33342 27719
14753 27719 12218 -2471 -1232 14325 13837 4441 -11390 -14512 -6055 -7480 -16446 -2917 5678
14740E678K677M609J0272K231J993O364n182p373j182l810q738j9311k980O473
14726h279J3102l288k4485J0426J0104Q541j8385r11j39k431J6608R452J1753
14713B2068O185j68r153r441K751J1133n259l560p520O641j3310r234J6896J016
14699I045j1147j486O367K791j6299m499J2811O562r524M332Q181K994J952j3578
14685a498j1220Q265Q100R957J1393K109j4333j0594k251L581L873o0Q708K472
14671A8502J396J93J877L24n326M192p214j200Q829J2027j542r323p080r486L658
14656I827l304n298k067K120l688K239J0237J4135O263r566p070j0087q138p48
14642e145P016q03J6682Q593N17K643j4961K889N468J4960M811o585n937j9404
$$ plain form
14740 5678 8355 12964 23236 25467 27460 33824 28642 21269 20087 16277 7539 -11772 -14752 -8279
14726 -8279 4823 1535 -22950 -12524 -2420 6121 -12264 -13175 -13314 -15745 863 10315 22068
14713 22068 28253 28085 18932 9491 12242 23375 18116 14556 7036 13677 367 -8867 8029 9045
14699 9045 -2102 -3588 2779 5570 -10729 -15228 -2417 4145 -5379 -1047 7134 10128 12080 -1498
14685 -1498 -12718 -4453 3647 13604 24997 27106 12773 2179 -72 3509 7382 7322 16030 18502
14671 18502 19898 20091 21968 22292 16966 21158 13944 12744 21573 33600 32058 22735 15655 6169 9827
14656 9827 6523 1225 -842 1278 -2410 -171 10066 24201 30464 20898 13828 3741 -4397 -5145
14642 -5145 1871 1068 17750 26343 26860 29503 14542 17431 22899 37859 42670 36085 30148 10744
14628A0744k5109Q203J1649Q969L614j2824J160n673N372n55O498L313o230J012
14614A0143O893n614k925P235r601O445O940j646n054r008l30Q794J2083j064
14600B3291k557j696k6082j1038j031o971J641J6483M716R611J2084P952j015
14587B5388j4780p892P930m665j0045r524P47p735J0183J1266O436l755J2583
14574A6137j1011n894N724L437p053Q691P999J837j3521m183j2845j971J9611
14561F958J2852P083m964n691k5440l851O650k340K333k711R395Q911l737L050
14547H498J2063r098J695J4L592j1125n086M499L538M736j1562K38J303n105M434
14532B634j40J4602K571L446n101p446p595R853P57L66j0923j1162K882K880J1591
$$ plain form
14628 10744 -14365 -6162 5487 14456 18070 5246 6406 733 6105 5550 12048 15361 9131 10143
14614 10143 17036 11422 8497 15732 6131 12576 19516 17870 12816 3808 3478 12272 24355 23291
14600 23291 20734 19038 -7044 -18082 -19113 -26084 -24443 -7960 -3244 6367 18451 26403 25388
14587 25388 10608 2716 10646 5981 -4064 -13588 -12841 -20576 -10393 873 7309 3554 16137
14574 16137 5126 -768 4956 8393 1340 10031 18030 19867 6346 2163 -10682 -12653 6958
14561 6958 19810 26893 21929 16238 -9202 -13053 -6403 -8743 -6410 -9121 274 9185 5448 8498
14547 8498 20561 11463 13158 13172 16764 5639 553 5052 8590 13326 1764 2002 3305 -1800 2634
14532 2634 2494 17096 19667 23113 18012 10566 2971 12824 13581 13947 3024 -8138 -5256 -2376 9215
14517I215M323k504j1325L945O57N853J773K268K422j192O306L314j1628m529
14503H898m286q093j0547J761J0293J542k2019j3560R409J5778N431J1371Q673
14490A4651L161j7221p603K024R442J1707J1632L43p805N195o244j0600q711k471
14476b500j254J1144m813j3697m140J816n922Q189J0691J1211J683j129l583L001
14462A0697q686j0097r746J798J1652M466l802m131J262p876O950K0953m071p810
14448A559m224Q615J0037o17J668k447O432l67k234j1010j8533m450k449J2764
14434e256M736n055Q8N8j341J0608J3399p411j4971m848R316Q158J1994o795n070
14419G610R540n467j5624J858M676k492p715Q428K0427K319j1028R620m019p674
$$ plain form
14517 9215 13538 11034 -291 3654 4311 10164 11937 14205 16627 15435 21741 25055 13427 8898
14503 8898 4612 -3481 -14028 -12267 -1974 -432 -22451 -36011 -26602 -10824 -5393 5978 14651
14490 14651 17812 591 -7012 -4988 4454 16161 27793 28136 20331 25526 19282 8682 -29 -2500
14476 -2500 -3754 7390 2577 -11120 -15260 -13444 -19366 -11177 -486 10725 12408 11279 7696 10697
14462 10697 2011 -8086 -17832 -16034 -4382 84 -3718 -7849 -6587 -14463 -7513 13440 9369 1559
14448 1559 -2665 5950 15987 15370 17038 14591 21023 20656 18422 7412 -11121 -15571 -18020 -5256
14434 -5256 -520 -5575 -5487 -5429 -6770 3838 17237 9826 -5145 -9993 -677 7481 19475 12680 7610
14419 7610 17150 11683 -3941 -2083 2593 101 -7614 814 21241 23560 12532 22152 18133 10459
14405A0459k727K5418J2079r992k2773j0219o919R739J9532N277o200K548K903
14392B9125j2156n283J3173L951j4873P584N123m758k829M58j1227j1518j3814
14379a7044P408P367K914K962J500N068J0334J203o938j1088j899l44l233r779
14365a1569j3808q935L878J9367J5979j6761l809N038J0173J4612m06q938n787
14352i66n191n722m299q60K1235N806L778J409j0390p694r972j4860M565Q543
14338a4618J9122N544o365J3947J0298j605p884j0349K663j162J2348j0049P06
14325A2596L342k105p697l965J254l370r808N27J2708P423n687j2156K695p762
14311a2005o413j976o408j325L95J297l101O122Q955O639R166J276P868m956Q32
$$ plain form
14405 10459 7732 33150 45229 35237 12464 2245 -4674 5065 24597 29874 23674 26222 29125
14392 29125 16969 11686 24859 28810 13937 21521 26644 21886 19057 19515 8288 -3230 -17044
14379 -17044 -9636 -2269 645 3607 5107 10175 20509 21712 14774 3686 1787 1443 -1790 -11569
14365 -11569 -25377 -34312 -30434 -11067 4912 -11849 -15658 -10620 -447 14165 13759 4821 -966
14352 -966 -6157 -11879 -16178 -17038 4197 10003 13781 15190 4800 -2894 -12866 -27726 -23161 -14618
14338 -14618 4504 10048 3683 17630 27928 26323 18439 8090 10753 9591 21939 11890 12596
14325 12596 15938 13833 6136 2171 3425 55 -9753 -9226 3482 10905 5218 -6938 -4243 -12005
14311 -12005 -18418 -20394 -26802 -28127 -27732 -26435 -29536 -23414 -14459 -7820 1346 2622 10490 5534 6366
14296F366J3319p100o846J1355l464j2749q633R199J3083j514j530j3689N02P562
14282E861j647l134J941M936n466q626J0710M707L691j0416k2994n55N829P670
14268g493M33l229p843J1839J8332o890r032L96l502J324K256N399m482k482J4337
14253I363P342Q26l553j7422R146Q891m589j5621j0594O029N347r260o120j5918
14239c6133r318O078J4154Q997J96L126M019P33k273p94q304k6065M255R859N617
14224b5853J3081J4453J304j0833n265M431L173N692L698N4K013N361j0584k1175
14210b0450j989N87j375j925N617J7453J6389m466Q36j7574l574J3373J3651j4585
14196A968m618M39K964J0595k009k528j9972Q65N217R405n508k488J715J530r96
$$ plain form
14296 6366 19685 12585 5739 17094 13630 881 -7752 1447 14530 13016 11486 -2203 -1701 5861
14282 5861 4214 1080 3021 7957 2491 -6135 4575 9282 12973 2557 -20437 -20992 -15163 -7493
14268 -7493 -7060 -10289 -18132 -6293 12039 5149 -3883 -3487 -6989 -5665 -3409 1990 -2492 -4974 9363
14253 9363 16705 17531 13978 -3444 5702 14593 10004 -5617 -16211 -10182 -4835 -14095 -20215 -36133
14239 -36133 -45451 -39373 -25219 -16222 -16026 -12900 -8881 -8148 -10421 -11215 -19519 -45584 -41329 -31470 -25853
14224 -25853 -12772 1681 2985 -7848 -13113 -8682 -5509 183 3881 3935 5948 11309 725 -20450
14210 -20450 -22439 -21852 -23227 -25152 -19535 -2082 14307 9841 10677 -6897 -10471 2902 16553 1968
14196 1968 -2650 -2211 753 11348 9339 6811 -13161 -12296 -7079 2326 -3182 -5670 -3955 -2425 -3421
14181c421j041n081M529m514j392r085j0426J3712J8253L903j7254j777L164k566
14167a2996K506K186j9468p35J5030m424j738J1467M433k462j2300r18J1558k474
14153a0335R45m647J2305l572r790k3150k268K2224J4040m578k335K999j2083
14140b0245k010J136J3566j405Q669K4560K852r094k724r399L277M067r887j587
14126A776M235o215m679j1695Q493J1355M38l559l424q497r443j494J4763R887
14112A941J6697K628o611j50l177j9632j2575r746n041j515J0309K0367P36m411
14098a0180j987o313J0373R017N881K083j191J4255N343L754p330j702j1186J615
14084A2432m8p983k781J0386P168m85m732j3635J1959J2936m345l512j0983K918
$$ plain form
14181 -3421 -4462 -9543 -5014 -9528 -10920 -20005 -30431 -16719 1534 5437 -11817 -13594 -10430 -12996
14167 -12996 -10490 -8304 -27772 -28507 -13477 -17901 -19639 -8172 -3739 -6201 -18501 -19419 -7861 -10335
14153 -10335 -9390 -14037 -1732 -5304 -15094 -38244 -40512 -18288 -4248 -8826 -11161 -8162 -20245
14140 -20245 -22255 -21119 -7553 -8958 -289 24271 27123 18029 15305 5906 9183 13250 3363 1776
14126 1776 6011 -204 -4883 -16578 -8085 3270 3708 149 -3275 -11772 -21215 -22709 -7946 1941
14112 1941 18638 21266 14655 14505 11328 -8304 -20879 -30625 -35666 -37181 -26872 -6505 -5769 -10180
14098 -10180 -12167 -18480 -8107 910 6791 8874 7683 21938 27281 31035 23705 22003 10817 12432
14084 12432 12384 4401 1620 12006 19174 18689 13957 322 12281 25217 20872 17360 6377 9295
14070I295K651k542j2927N163J3034R532j027o738l661j0481q192J108J1453J0881
14056A7549L957m62q57k712J1188j594J334j057N72m737p39M017N742n595O76
14041B7282Q98n547N865O29l227J0888q29n434j4430n259J7428J8790J2500L443
14027F2997J8650N145j6616j2136q60M687m811O13L386n776O417K1132J4605L279
14013A00712L0969K0315M851K2429J4892N772p651K0094J2790K7607J3247J4684
14001B80711K0872K5274K3495K8087K3510J2948M8488M2768M5277O9420R2064
13990G12914J21331J61150K15116K96526L91860M67438N32598N38234M97634M47968
13980D382769L54280K66933J78845J09977N0471j5142j5668l5963r6055j76662
$$ plain form
14070 9295 11946 9404 -3523 1640 14674 24206 23179 16441 12780 2299 -5893 -4785 6668 17549
14056 17549 21506 21044 20187 17475 28663 27069 28403 27346 27918 23181 22442 26459 32201 26606 27282
14041 27282 28180 22633 28498 29127 25900 36788 35959 30525 16095 10836 28264 47054 59554 62997
14027 62997 81647 86792 70176 58040 57180 61867 57056 57669 61055 55279 61696 82828 97433 100712
14013 100712 131681 151996 156847 179276 194168 199940 192289 212383 225173 252780 266027 280711
14001 280711 301583 326857 350352 378439 401949 414897 463385 506153 551430 620850 712914
13990 712914 834245 995395 1210511 1507037 1898897 2366335 2898933 3437167 3934801 4382769
13980 4382769 4737049 5003982 5182827 5292804 5343275 5328133 5312465 5276502 5180447 5003785
13970E003785k87667m00135n04868n50541n32385m86399m09836l31983k56273
13961A243698j83880j40806j12956q9648q2600o7474n0534m0160m7004l4090m3537
13950C51009k9794k6598l5129k4454j2522j7563q111j0740j3552r359n692j6597
13938A40898k247k155j7056j2304l124p853j06l481q031O765j824p446m978j1915
13924F5143m521p560j4655p668r99j4768L203J24N790J2971M176l625q692P86
13910B9705N783J7069p1N158O105j0947j0140j3734j7053J332p937K340J9746
13897B7356K1813J5291o325j6898j7054j5472p468j2335J1784J9791J3377N788
13885C9648j276j3948j4885r131j1113n332N762J1201J4583P389m380j168J7094
$$ plain form
13970 5003785 4716118 4315983 3811115 3260574 2728189 2241790 1831954 1499971 1243698
13961 1243698 1059818 919012 806056 716408 633808 566334 515800 475640 428636 394546 351009
13950 351009 321215 294617 259488 235034 222512 204949 196838 186098 172546 163187 157495 140898
13938 140898 138651 136496 119440 107136 104012 96159 96053 92572 84541 91306 89482 82036 77058 65143
13924 65143 60622 53062 38407 30739 29740 14972 18175 18299 24089 37060 41236 37611 28919 29705
13910 29705 35488 52557 52486 57644 63749 52802 42662 28928 11875 13207 5270 7610 27356
13897 27356 49169 64460 58135 41237 24183 8711 1243 -11092 692 20483 33860 39648
13885 39648 38372 24424 9539 408 -10705 -16037 -10275 926 15509 22898 18518 17350 34444
13872C4444l564j7621r057j4555L081J2460P054n238M600l413o697j8173o730
13859b3409Q190J1496J2700M332P347j305k1117j8020J0711j256j899O978j0049
13846a5301j534J5029P044M439j770k206R671J2174k5943j6166Q710N434K738
13833B319J5470J714j621M863N268J568q348J948j3144L585j2046k2657n324k041
13819b8446L338O241N946R959Q846J2910L5K871l368j0285j904j233j7828k603
13805a5521J3744M376q436J912M193J28M441M569N841Q813l236l199N678p379
13791A5924l692N375J2797J1279r406j1046k329n876n107J184L204J350J0610
13778B4267J0818k3559j2572P36o26J2685L562r535L952n483o082N225O617P734
$$ plain form
13872 34444 30880 13259 4202 -10353 -7272 5188 12242 7004 11604 8191 1494 -16679 -23409
13859 -23409 -15219 -3723 8977 13309 20656 19351 -1766 -19786 -9075 -10331 -12230 -5252 -15301
13846 -15301 -16835 -1806 5238 9677 7907 5701 15372 27546 1603 -14563 -5853 -419 2319
13833 2319 17789 19503 17882 22745 28013 29581 21233 23181 10037 13622 1576 -21081 -26405 -28446
13819 -28446 -25108 -18867 -12921 -2962 5884 18794 18829 21700 18332 8047 6143 4910 -12918 -15521
13805 -15521 -1777 2599 -5837 -3925 268 396 4837 9406 15247 24060 20824 17625 23303 15924
13791 15924 12232 17607 30404 41683 32277 21231 18902 13026 7919 9103 12307 13657 24267
13778 24267 35085 11526 -1046 -310 -936 11749 15311 5776 9728 4245 -1837 3388 10005 17739
13764A7739L496j768N569o515j5543j579j393M305L468O657J0249J63l413j8140
13750C295p458k54q958j2609K557J8573Q729j0044l409J8322p417j3149J456J0941
13736E75P045j977L878J0222k658j7167n572O377k595J3559R874o288L326O638
13722B5237L610o875j8380p234K273k3479r004O709J0051J1683k462N753J2476
13709A0358m382n54j8094j146R044J2130J6607K27Q271j1298k376O939o737q884
13695A0105R44J867P414K4005k5949r411O417O486j2783M771l727j1338M408J3537
13681A6746k827m179l337j4549O974K529K567L19j0796J784J4135M416q182q416
13667b816n247J2097R699N162q454m220m287Q635M590J3343k761j4119L38O222
$$ plain form
13764 17739 21235 19467 25036 18521 2978 1399 6 4311 7779 14436 24685 24848 21435 3295
13750 3295 -4163 -4417 -13375 -25984 -23427 -4854 3875 -6169 -9578 8744 1327 -11822 -10366 575
13736 575 7620 5643 9521 19743 17085 -82 -5654 723 -1872 11687 21561 15273 18599 25237
13722 25237 28847 21972 3592 -3642 -1369 -24848 -33852 -27143 -17092 -5409 -7871 -2118 10358
13709 10358 5976 5422 -12672 -13818 -4774 7356 23963 24190 32461 21163 18787 25726 18989 10105
13695 10105 11049 12916 20330 44335 18386 8975 15392 21878 9095 13866 10139 -1199 3209 16746
13681 16746 13919 9740 6403 -8146 -1172 1357 3924 4243 -6553 -4769 9366 13782 5600 -2816
13667 -2816 -8063 4034 13733 18895 10441 6221 1934 10569 15159 28502 25741 11622 11960 18182
13653A8182m02n38Q31j512j779L831j7103J643p255q533n545J4613N998N714q141
13638DM348k771j0093L290K923P646o439M28l627O837P455K661k238L042J4279
13623B7745j9977j4823m924n720M346l447J3414J8056j6515q947o356m98N269
13610a2377J1476O754k476M973N950o415o95m009K047P30m884M521p154N695q664
13595d528m830k855l119O070k188Q425R330J892k437J959Q10O334P71o068j0400
13580h34m425O0J0559N254J5054q320n064N991p86j0226J242j0833m00J4870R014
13565B1156j2454q327m807p186k989R826N411R174N428K742P028K3099Q879q502
13551D8478k838j9404p415P059P809K111o997j5652j289R347j821N170N956j7721
$$ plain form
13653 18182 17780 17242 18073 16561 14782 18613 1510 3153 -4102 -12635 -18180 -3567 2431 8145 4
13638 4 4352 1581 -8512 -5222 -2299 5347 -1092 -664 -4291 2546 10001 12662 10424 13466 27745
13623 27745 7768 -7055 -11979 -17699 -13353 -16800 -3386 14670 -1845 -10792 -17148 -17646 -12377
13610 -12377 -901 5853 3377 8350 14300 7885 7190 3181 5228 5958 1074 5595 -1559 4136 -4528
13595 -4528 -9358 -12213 -15332 -9262 -11450 -3025 6305 8197 5760 7719 8529 14863 15634 9566 -834
13580 -834 -5259 -5199 5360 10614 25668 17348 12284 18275 17489 7263 8505 -2328 -2728 12142 21156
13565 21156 8702 375 -4432 -11618 -14607 -4781 630 9804 15232 17974 25002 48101 56980 48478
13551 48478 45640 26236 18821 25880 33689 35800 28803 13151 11862 21209 19388 24558 30514 12793
13537A2793j4900j1420q102O557j004o979L841N554Q65o533J6332q72k967M239
13523b596p486n806P42l200O39L394J814J1299j182R143P027L443m326j0078M294
13508G121J4914j676j4241m765L178j1753j448L272J166K2408o058j7012l660
13495h554P237j3365j9629o01J0321K0332J9752J0548l800j3481N041k563p963
13482C275J1128J0755j281p228n537q871l987l260o570l423J3102L400p153K739
13468b911L877j1162m998j871J113K964R858J1159k4444j7907N898J1837K557
13455a4030j4015K813J1557n97N650R241l875J434l06m782l8l078J0487j466p627
13440h632m073K145n190o497J0349j128o580R27K42o927L110Q689J744K856R746
$$ plain form
13537 12793 -2107 -13527 -21629 -15072 -16076 -23055 -19214 -13660 -12795 -19328 -2996 -3868 -6835 -2596
13523 -2596 -10082 -15888 -15146 -18346 -17707 -14313 -12499 -1200 -2382 6761 13788 17231 12905 2827 7121
13508 7121 22035 20359 6118 1353 4531 -7222 -8670 -5398 -4232 18176 12118 -4894 -8554
13495 -8554 -1317 -14682 -34311 -34912 -24591 -4259 15493 26041 22241 8760 13801 11238 3275
13482 3275 14403 25158 23877 16649 11112 2241 -1746 -5006 -11576 -14999 -1897 1503 -5650 -2911
13468 -2911 966 -10196 -15194 -17065 -15952 -12988 -3130 8029 -16415 -34322 -28424 -16587 -14030
13455 -14030 -28045 -25232 -13675 -14272 -8622 619 -3256 -1822 -2128 -6910 -6948 -10026 461 -1005 -8632
13440 -8632 -12705 -10560 -15750 -22247 -11898 -13026 -19606 -18679 -18437 -25364 -22254 -13565 -11821 -8965 781
13425G81J671r881L317p687q257P423J0109P533m59l348N105J5368k4q060j1054
13410B537Q456N175m617p839j1932K132J1267N319m389N374J0195k88j977j757
13396A7656J3429j5499l959k561p609j035l194Q659J302L618k833P112Q214J280
13382B4580m435j829r035m193j172J1696q47j2148L243R408o087k944R734K000
13368A7971q407k2607j1410p655J5568J9820N953K557R772r174j4736j0764n794
13355a8906R147P706j795J6565n995l982N217p357m501Q960O2p176k31J6635J0631
13340B4980n256j5540j6008J97O182J7319J1385l372j4889j0238R41Q449n690
13327a540n908q577r195N474R339L622P365k521P548L853K512q462k543O277M86
$$ plain form
13425 781 2452 -7429 -4112 -11799 -20056 -12633 -2524 5009 4550 1202 6307 21675 21651 13591 2537
13410 2537 10993 16168 11551 3712 -8220 -6088 5179 10498 6109 11483 21678 21390 19413 17656
13396 17656 31085 15586 11627 9066 1457 422 -2772 5887 7189 10807 7974 15086 23300 24580
13382 24580 20145 18316 9281 5088 3916 15612 14765 2617 5860 15268 9181 6237 15971 17971
13368 17971 9564 -13043 -24453 -32108 -16540 3280 9233 11790 21562 12388 -2348 -13112 -18906
13355 -18906 -9759 -2053 -3848 12717 6722 2740 7957 600 -3901 5059 5121 -2055 -2286 14349 24980
13340 24980 19724 4184 -11824 -11627 -5445 11874 23259 19887 4998 -5240 -4299 4150 -1540
13327 -1540 -7448 -16025 -25220 -19746 -10407 -6785 580 -1941 5607 9460 11972 3510 967 7244 7730
13312G730R833M717j0860k884j4690j3789L290J1q214N918R152P731k692p750
13298a2497K094P222N349k07N767L328k0040l071N274m333p00K063r032J1719
13284g064Q189J008q118Q142Q862L608J048O576O664k879k827K0q353p181p657
13269C8J4578K294k120o911n121k1142n465J0258J3860Q654K097K42n071o534
13255c43J0988Q635r487r263n888K936J3409n09k0390r00M863J2800O860j1212
13241B499Q593K442j4336j3926o730M802k239J9266O506j113J0981j6964l560
13228c779O106R758K339j4361j466P83N52n307j3359q416M767J9021M373j5617
13214a4606m477K400K438L190J0918L268l243j513p766j5647q180q064J2780J1481
$$ plain form
13312 7730 17563 22280 11420 8536 -6154 -19943 -16653 -16642 -24856 -18938 -9786 -2055 -4747 -12497
13298 -12497 -10403 -3181 2168 1961 7728 11056 -8984 -12055 -6781 -11114 -11814 -9751 -18783 -7064
13284 -7064 1125 2133 -5985 2157 11019 14627 15675 22251 28915 26036 23209 23229 14876 7695 38
13269 38 14616 16910 14790 7879 2758 -18384 -23849 -13591 269 8923 11020 11262 6191 -343
13255 -343 10645 19280 9793 530 -5358 -2422 10987 10478 -9912 -10812 -5949 6851 13711 2499
13241 2499 11092 13534 -802 -14728 -21458 -16656 -18895 371 6877 5764 16745 -219 -3779
13228 -3779 2327 12085 14424 63 -1403 -620 -68 -5375 -18734 -27150 -22383 -3362 1011 -14606
13214 -14606 -19083 -16683 -14245 -11055 -137 3131 -112 -1625 -9391 -25038 -33218 -41282 -28502 -17021
13200a7021J4772P858j1777j1394M452J4799P661p153J384N939Q1k171n022J230
13186C638j767M641l497q311K045J0133K770L499O621m543j3191l996o659p596
13172a6213J3654k001o684m09N328l982n837J956Q338M041k577K174J5640M506
13158A7934L592P908P631q404q985r128J3302J072m348j9655k0379J4065J3823
13145H428J0322O2q733R956j1920r988K293M88j1768k680J2359Q741q371r842
13131a0653j3661J681J5464Q356n252P17J490j909n009k900J5675j276k57r150
13117f684O099m397O43L809j88k494l139k039J2402k288M360m942n060P736l624
13102A94q315j0184k419J5379R888m081J974J0927j1393o471p498o378j1151J4379
$$ plain form
13200 -17021 -2249 5609 -6168 -17562 -13110 1689 9350 2197 3581 9520 9601 7430 2408 3638
13186 3638 1871 6512 3015 -5296 -3251 6882 9652 13151 19772 15229 2038 -1958 -8617 -16213
13172 -16213 -2559 -4560 -11244 -11653 -6325 -10307 -16144 -14188 -5850 -1809 -4386 -2212 13428 17934
13158 17934 21526 29434 37065 28661 19676 10548 23850 24922 20574 919 -19460 -5395 8428
13145 8428 18750 18812 10079 20035 8115 -1873 420 908 -10860 -13540 -1181 7560 -811 -10653
13131 -10653 -24314 -22633 -7169 1187 -4065 -3348 -1858 -3767 -8776 -11676 3999 2723 2466 -6684
13117 -6684 -585 -4982 -4339 -530 -718 -3212 -6351 -8390 4012 1724 6084 1142 -3918 3818 194
13102 194 -8121 -18305 -20724 -5345 4543 462 2436 13363 1970 -4501 -11999 -18377 -29528 -15149
13088a5149Q549N981J6623P337n661m98k226l357P49L810k738j643n416O965k454
13073A0872M578P068J0399j0458k1117l813L474K677L06j0082m261L25K223J219
13059f590q675r64J7002M336J30m984P776m101o813J3677J5885j5404k1127K206
13045g646J4085J586k157K722Q025J3550L882j3128j2042o858R331P806O621l810
13031B1967k888P920m056m123j2283J0136J7956M182J183j6174p898K1298J0439
13018D7659j6954j6114j2342Q156R718R632M21l092k8796m075j917R538Q108J0786
13004B0728L327j2977l092j288j960J032J0311R05q417q40p965L565K876l816
12990B389j4919m266n61J2678R716K394j396P329J5883m892j714J5563K0356m295
$$ plain form
13088 -15149 -6600 -619 16004 23341 17680 17182 14956 11599 12348 16158 13420 11777 6361 13326 10872
13073 10872 15450 22518 32917 22459 1342 -2471 1003 3680 3986 -6096 -10357 -10032 -7809 -6590
13059 -6590 -15265 -16229 773 5109 5239 255 8031 3930 -2883 10794 26679 11275 -9852 -7646
13045 -7646 6439 8025 5868 8590 16615 30165 34047 20919 8877 2019 11350 19156 25777 21967
13031 21967 19079 26999 22943 18820 6537 16673 34629 38811 39994 23820 15922 37220 47659
13018 47659 30705 14591 2249 10405 20123 29755 30176 27084 -1712 -5787 -7704 1834 9942 20728
13004 20728 24055 11078 7986 6698 4738 5770 16081 16986 8569 7729 -236 3329 6205 2389
12990 2389 -12530 -16796 -17357 -4679 5037 7431 6035 13364 29247 24355 22641 38204 58560 54265
12976E4265j2690j4635p805P231J1204j2394r118Q045P334j4658m761q930o299
12963c211M998R690N364P769J0749J88l987P410M956Q68R110J3804L1916J2857
12949A12481K3607L5790N3080O8401Q3289R5092R8472P5894Q3201K8543j9548
12938G38302n4565o7126r5007j11169r6256o3232p0054m2340k2814j6320k7815
12927G1604j751M578K248P182o295l1518k5551n086J3816j4515m50N149L739Q229
12913C1379o006m564N05m455K986n447K316M411O5M83o40R818n407q005Q08k614
12897A5633n55R208k587m785J466n570K933M525r595j025j131O979m698j0325
12883D73l213L709J3782o364O089o130O948O744K178j2222j2839Q991P473O652
$$ plain form
12976 54265 41575 26940 19135 26366 37570 25176 16058 24103 31437 16779 12018 3088 -3211
12963 -3211 1787 11477 16841 24610 35359 35547 31560 38970 43926 44794 53904 67708 99624 112481
12949 112481 136088 171878 224958 293359 376648 471740 570212 646106 729307 757850 738302
12938 738302 683737 616611 521604 410435 314179 250947 180893 138553 115739 99419 71604
12927 71604 69853 74431 76679 83861 77566 46048 20497 15411 29227 14712 14262 19411 23150 31379
12913 31379 25373 20809 21314 16859 19845 14398 16714 21125 21190 21673 21033 30851 25444 17439 18247 15633
12897 15633 15078 24286 21699 16914 18380 12810 15743 20268 10673 9648 8517 15496 10798 473
12883 473 -2740 969 14751 8387 14476 8346 15294 22038 24216 11994 -845 8146 15619 22271
12869B2271J6248R563r326j5203j4522o885K613n203j060p743j878P680N160o174
12855d459J4109k17m987l21m785r399K955M020Q853K819j4296p47J2821R940j474
12840A4832j1544n12L393J5476J3846Q108r251o835j935K549j1405j0084J3867
12827B0505K313J0325j0493o249K954J2999J9284J7j4301p277m018q40O521L379
12813C5119p95q285O045P695n967l482m361M742j436l813o905p938K750j982r154
12798B233R886P123J0285Q762l044r596M265N537j042p498k8N774R344L497N19
12783D6017J262Q122l69k018j0190M309N653P797K3168K6885K7789K4552J5949
12770A78926n222j7954l1182j6366j2580j7906j2117p156j2257j7779l596M805
$$ plain form
12869 22271 38519 48082 38756 23553 9031 2146 4759 -444 -1504 -9247 -11125 -3445 1715 -4459
12855 -4459 9650 9433 4446 4125 -660 -10059 -7104 -3084 5769 8588 -5708 -6455 6366 16306 14832
12840 14832 3288 2776 6169 21645 35491 43599 34348 27513 25578 28127 16722 6638 20505
12827 20505 22818 33143 22650 16401 19355 32354 51638 51655 37354 30077 26059 25219 31740 35119
12813 35119 34324 26039 32084 39779 33812 30330 25969 30711 29275 25462 18557 10619 13369 11387 2233
12798 2233 12119 19242 29527 38289 35245 25649 29914 35451 34409 26911 26883 32657 42001 45498 46017
12783 46017 47279 55401 55032 53014 42824 47133 52786 60583 83751 110636 138425 162977 178926
12770 178926 173704 155750 124568 108202 95622 77716 65599 58443 46186 28407 24811 29616
12758B9616m001Q335P445p879o405R28J3042m35o300j0064o824R467K513r743
12744A9695J98o797O990P056m522p383j220L583m609q650Q587J6944J138m653
12730B6357k92m985J741J9988k026K450Q002L735N212r09J168q987m076J854n353
12715D3879j3057j3381L904j1857q854n635M70o637Q614J2178J3985j2949q128
12702B532J0446O241K972L772J036J5422J1008J9107j2347n796r055j746P5P647
12688E1314L210j1229j5246N18O838p733J8015P554J1848O479o736j717N864n902
12674F3077P974J7730J5012J1681Q102l515l113l544j1747n113J859j3593j092
12661H3718k2529j9704J8805L698q041l112R688M340l431M477L775K2213P812
$$ plain form
12758 29616 25615 33950 41395 33516 27111 28039 41081 40646 34346 24282 17458 26925 29438 19695
12744 19695 19893 13096 20086 27142 22620 15237 14017 17600 12991 4341 12928 29872 31010 26357
12730 26357 26065 21080 22821 42809 40783 43233 51235 54970 60182 59273 60441 51454 47378 49232 43879
12715 43879 30822 17441 21345 9488 634 -5001 -4531 -11168 -2554 9624 23609 10660 2532
12702 2532 12978 19219 22191 25963 26999 42421 53429 72536 60189 54393 45338 43592 43667 51314
12688 51314 54524 43295 28049 28567 35405 27672 45687 53241 65089 71568 64832 63115 68979 63077
12674 63077 71051 88781 103793 115474 123576 120061 116948 113404 101657 96544 98403 84810 83718
12661 83718 61189 41485 60290 63988 55947 52835 62523 66863 63432 67909 71684 93897 101709
12648A01709N504J3825L3956K3457J5297J7926J2889k945o834j662N19o334m107
12635B03200l609r427P188Q730K3227J6154J6590J0751j723J7978K3127k696r071
12622C00419q47J0239O4N982Q37o455j5016J2137M7263K2989J6547J1264J73J9467
12608D25063K2738K7037N1750O9521R0941J03661J11257J15116J35193J46243
12598A298520J57173J74325J69141J31967J20473Q4276p2378k08645k08887j51534
12588A494431r4207p9004j00697r7180q2945n6357k6053R777J3289L7590O4744
12577A083388L8707j2663j0250q466o888J9266J2836K1837L9018P3227O3847L7813
12565A351672p536m2145l2437o552N0618O3809P3151R9713J17018J38541J40412
$$ plain form
12648 101709 107213 121038 154994 178451 193748 211674 224563 221618 214784 213122 213641 207307 203200
12635 203200 199591 190164 197352 206082 229309 245463 262053 272804 271081 289059 312186 309490 300419
12622 300419 299572 309811 309875 315857 316694 310239 295223 307360 354623 377612 394159 405423 405596 425063
12608 425063 447801 474838 526588 596109 687050 790711 901968 1017084 1152277 1298520
12598 1298520 1455693 1630018 1799159 1931126 2051599 2135875 2063497 1854852 1645965 1494431
12588 1494431 1400224 1321220 1220523 1123343 1040398 984041 957988 967765 981054 1018644 1083388
12577 1083388 1122095 1109432 1099182 1090716 1083828 1103094 1115930 1137767 1176785 1250012 1313859 1351672
12565 1351672 1344136 1301991 1269554 1263002 1313620 1377429 1450580 1550293 1667311 1805852 1946264
12554A946264J59683K65695M25666M56582J84313j00292k01213j63226l3243L8842
12544B979071P5875R8083J09695J68429K63143L55026M91372O12716P17279P40396
12534F611085P50073P64051Q22651R55847J163377J533750K196890L313224N176746
12525B3287694Q206580J2549237J7140490J9468409J9058765J7888270J5544611
12518A33144056R000580o09007q446319j3150414j6733967j9140897j8792633
12511F5271399j5790886j1698224q047773n532436l991775k960783k253754j780632
12503A3215136j503994j342532j192872j056245r79458r02511p90802o80496n55783
12494D210443m42155l62170l03005k62389k15164j75280j61929j35999j30586
$$ plain form
12554 1946264 2105947 2371642 2797308 3253890 3438203 3337911 3136698 2973472 2940229 2979071
12544 2979071 3054946 3153029 3262724 3431153 3694296 4049322 4540694 5153410 5870689 6611085
12534 6611085 7361158 8125209 8947860 9903707 11067084 12600834 14797724 18110948 23287694
12525 23287694 31494274 44043511 61184001 80652410 99711175 117599445 133144056
12518 133144056 142144636 141535629 133089310 119938896 103204929 84064032 65271399
12511 65271399 49480513 37782289 29734516 24202080 20210305 17249522 14995768 13215136
12503 13215136 11711142 10368610 9175738 8119493 7140035 6237524 5446722 4766226 4210443
12494 4210443 3768288 3406118 3103113 2840724 2625560 2450280 2288351 2152352 2021766
12485B021766j23651j11848r4788j00194q7742q5885r0902q1788o7933l8260m6960
12474A091815n0081m6471k4885l1566l9923l0355k1338j8743l4861m1557m5924
12463G06111m0987l6554m0361k7592k7613k1911m0275k0532j5702j4793j951K071
12451D19911j4062n423Q941K116P34p940j4402o674J0341j3461k2155j3328p971
12438C36627J0510p945j1207J1210J1052J7431K0269J7388K2236K0207O650n364
12426D49064q506k4496l2535k4423l1220l8811j7318j2112k9181j6441l904l231
12414B06886k680J698M965O401L401k77j3764j1806j176J616K560L709Q558k014
12400B08077Q369J9853j939r423k0867r29l801O11Q579P918L9814J0873m493j1574
$$ plain form
12485 2021766 1898115 1786267 1691479 1591285 1503543 1417658 1326756 1244968 1177035 1138775 1091815
12474 1091815 1041734 995263 970378 938812 898889 868534 847196 828453 793592 752035 706111
12463 706111 665124 628570 588209 560617 533004 511093 470818 450286 434584 419791 417840 419911
12451 419911 405849 400426 409367 411483 412217 404277 389875 383201 393542 380081 357926 344598 336627
12438 336627 347137 339192 327985 339195 350247 367678 387947 405335 427571 447778 454428 449064
12426 449064 440558 416062 383527 359104 327884 289073 271755 259643 230462 214021 210117 206886
12414 206886 204206 205904 210869 217270 220671 220394 206630 194824 193648 195264 197824 201533 210091 208077
12400 208077 216446 236299 234360 224937 204070 203141 199340 199951 208530 216448 256262 267135 262642 251068
12386B51068j0994O230j7649j1564J0j255R829K741j027m257N453q85M787R938
12372B42425L5661M4816M3780J2006k4811l8007l5841q260r482o247o441k2381
12360B27218k8257l3628j8330n167O752J9976K050N624J4714K1903o44P457J1155
12347B30823J8332J5603K3140m388j958K0206J7054K4267L4020J7860j5363l2633
12335C46963l2806k9267j3424n574P454K1687K6104J438k0956m6927l6670k5317
12323A92705r706j6255k6865j1545n817n86p234p895L883O985J7996K4850L0826
12310A91342N1525O9158P9583M8618L0853R540l5623l9136n1466m7166k1499k8935
12298B56794l3318k9317k6013p508k0618k6849M184J1691j8132m177P580r64M668
$$ plain form
12386 251068 240074 246304 228655 217091 217101 215846 225675 228416 227389 223132 228585 227700 232487 242425
12372 242425 278086 322902 366682 378688 353877 315870 280029 271769 262287 256040 249599 227218
12360 227218 198961 165333 147003 141836 148588 168564 170614 176238 190952 212855 212211 219668 230823
12347 230823 249155 264758 287898 283510 281552 301758 318812 343079 377099 394959 379596 346963
12335 346963 314157 284890 271466 265892 273346 295033 321137 322575 301619 254692 218022 192705
12323 192705 182999 166744 139879 128334 122517 121931 114697 106802 110685 117670 135666 160516 191342
12310 191342 242867 312025 391608 440226 471079 480619 444996 405860 354394 307228 285729 256794
12298 256794 223476 194159 168146 160638 140020 113171 117355 129046 110914 106737 114317 113353 118021
12285A18021L365K4073J7595K2712K1009J6768J7886J2724R647m719K2372L1803
12273C13256K1135n536l6917m3411j4020J710j7882k5929O552J6870L1440J8121
12261B65389j6635l8324m2631k5380k856j190K851j2039j1068K193J6530j7298
12249A19542o211J4689J6838L4117K8873M3952N7692M0127K2746j4030l9061m3761
12237B75513m6290l9766q996j4247k4121l9919l428R921N232J0121P4q106o868
12224A09120m101J524J1153N646j1369q097j6678K09P808n2j4965K58M082j945
12210H2593n986k1188j6931l913J1083K0750J0648R179O408K930m117m341J65
12197H7280P662M804n702J4020Q609q705j0841l313M308p044l308p632j165J6333
$$ plain form
12285 118021 121386 145459 163054 185766 206775 223543 241429 254153 263800 259081 281453 313256
12273 313256 334391 328855 291938 248527 234507 236217 218335 192406 198958 215828 247268 265389
12261 265389 248754 210430 167799 142419 139563 138373 141224 129185 118117 120310 136840 119542
12249 119542 113331 128020 144858 178975 207848 251800 309492 349619 372365 358335 319274 275513
12237 275513 229223 189457 180461 166214 142093 102174 98746 108667 113899 124020 124094 115988 109120
12224 109120 105019 106543 117696 123342 111973 103876 87198 87407 95215 95163 80198 80456 84538 82593
12210 82593 76607 55419 38488 34575 45658 66408 77056 86235 92643 95573 91456 87115 87280
12197 87280 94942 99746 94044 108064 116673 107968 97127 93814 98122 91078 87770 80138 78973 95306
12183I5306r02j3619j2141j0301m193K1618J9974o902j1643R053k084j5583R762
12170G8345J5966J1878P583L325p673j1597Q87N700k720J6535J6567J3013O366
12157A54175P96n084k4229p489m585j0014J185J2600r495p289j2736L685m515
12144H7005n648J3676J8328P496J4231J9703J5911J1867J9581K232K08k0745j5855
12131A67990j565N540J8777P707K64o094k5142k1093J0034Q258m581j716K2203
12118A80582K4642j071j4896K340l762j0227Q078K85K4347k1592k8859R933J1936
12105A81736P840k51J0533K2738K6163K1790J4739J9184L7773M3865M4910Q0084
12093E11104J06105Q7381Q8494P8152L5909j3814m5376n7363j04275j13445r4918
$$ plain form
12183 95306 94404 80785 68644 58343 54150 75768 95742 88840 77197 86250 84166 68583 78345
12170 78345 94311 106189 113772 117097 109424 97827 98714 104414 101694 118229 134796 147809 154175
12157 154175 154971 149887 125658 118169 113584 103570 104755 117355 107860 100571 87835 91520 87005
12144 87005 81357 95033 113361 120857 135088 154791 170702 182569 202150 204382 204590 183845 167990
12131 167990 166425 171965 190742 198449 198713 192619 167477 146384 156418 164676 160095 158379 180582
12118 180582 205224 204153 189257 191597 187835 177608 185686 185971 210318 188726 159867 169800 181736
12105 181736 189576 189325 199858 222596 248759 270549 285288 304472 342245 386110 431020 511104
12093 511104 617209 704590 793084 871236 907145 893331 847955 790592 686317 572872 477954
12082D77954o1958n4254m0482l8352k8444J2286j584j6585j5458m316l749p374
12070B17684J7402K2287L259j3057J2518L2076L1847L3292K3253L9892N3362Q2800
12058E56615J26413J61966K21383K40556J92291J05659N1323M2329j511n3757
12048A643267j25634j92503j98698j64123j24318j04025n4644k7680l5419j5463
12038F00760j381L375J9575L6792N9694P9742J06283J57177K39549L69743M83148
12027B154457M92659L43883J53575L534p7544j02667j56076k34468k85342k94565
12017A997446k33777j76988p7255M1513J67549K68485K76024J14264j31760k92518
12007A952983l35589k76773j95610j29148p3774m8142k4967J6386M2950O3985
$$ plain form
12082 477954 415996 361742 321260 282908 254464 266750 265166 248581 233123 228807 225058 217684
12070 217684 235086 257373 260632 247575 260093 292169 324016 357308 380561 420453 473815 556615
12058 556615 683028 844994 1066377 1306933 1499224 1604883 1656206 1698535 1697024 1643267
12048 1643267 1517633 1325130 1126432 962309 837991 733966 679322 651642 616223 600760
12038 600760 599379 602754 622329 659121 718815 798557 904840 1062017 1301566 1671309 2154457
12027 2154457 2647116 2990999 3144574 3148108 3070564 2967897 2811821 2577353 2292011 1997446
12017 1997446 1763669 1586681 1509426 1550939 1718488 1986973 2262997 2377261 2245501 1952983
12007 1952983 1617394 1340621 1145011 1015863 942089 893947 868980 885366 928316 992301
11997I92301Q1290J33876K10548K96826M12087M93595M68269L21824J03047j47800
11987C365863l23445m39164m57788l75197k79910k23943j66906j12840o4098n2649
11977H69923k5316m864J1531M957J8060J7435n00k7976k1669o076J1694J3542
11965H60741P941P173K8249M8787N9548Q5567J18526J36755J76402K27851L31554
11954B089094N12474Q16728J262410J733292J737280Q02331m52149j180439j275561
11945F045460r95403o26458l13530o7199J90126M78558Q54607J383362K089435
11936I038958K636324K300491R38862l49970p11289k23578L72631J01840q64712
11927A3239557j534377j601060j269339q14628m01749J2267M73334J040370J939998
$$ plain form
11997 992301 1073591 1207467 1418015 1714841 2126928 2620523 3088792 3410616 3513663 3365863
11987 3365863 3042418 2603254 2145466 1770269 1490359 1266416 1099510 986670 922572 869923
11977 869923 844607 839743 851274 856231 874291 891726 891226 863250 841581 835505 847199 860741
11965 860741 868682 875855 904104 952891 1012439 1098006 1216532 1353287 1529689 1757540 2089094
11954 2089094 2601568 3418296 4680706 6413998 8151278 8953609 8501460 7321021 6045460
11945 6045460 5050057 4423599 4110069 4042870 4232996 4711554 5566161 6949523 9038958
11936 9038958 11675282 13975773 14914635 14564665 13853376 13629798 14002429 14104269 13239557
11927 13239557 11705180 10104120 8834781 8020153 7618404 7630671 8104005 9144375 11084373
11918A1084373L302382M749735M566530J509275j913625l226199k587234q77964
11910A6607273J077398K825636L584986K462875M24j909222k293182j433315K03471
11901B1126344K457020N319400P527044N679128k65960n061916o351063n009380
11893B5420617k654053l31927J871000M378047P525698J0452780J0554208O874379
11885F4090749L279889K618728L212279R74413m804563r768222j1252953r871700
11877C8478620p367249n021155l221221j970037j164112n84452K8117Q79071K047718
11868B2105300L663839N840814Q538549J1237740J1686885P664547J933425q43219
11860G1827880l04929k13063l611789p910408r688978q707663o410678m135903
$$ plain form
11918 11084373 14386755 19136490 23703020 25212295 23298670 20072471 17485237 16607273
11910 16607273 17684671 20510307 24095293 26558168 26558592 24649370 22356188 20922873 21126344
11901 21126344 23583364 28902764 36429808 42108936 41842976 36781060 30429997 25420617
11893 25420617 22766564 22434637 24305637 28683684 36209382 46662162 57216370 64090749
11885 64090749 67370638 69989366 73201645 74176058 69371495 59603273 48350320 38478620
11877 38478620 31111371 26090216 22868995 20898958 19734846 19150394 19178511 20057582 22105300
11868 22105300 25769139 31609953 40148502 51386242 63073127 70737674 72671099 71827880
11860 71827880 71522951 71309888 67698099 59787691 50098713 41391050 34980372 30844469
11852C0844469k199836j42379K548539N598212O710315L029792k742723n838366
11844C7808023n774272l951625j717159L40072J872398K185624O46288j837795
11836B9571554l450442l494132k294986l85534J927418L830408L409978M6295
11828B9160559l287636m443219l791951k433311j282867o52861l88369k33608
11820A2646737o0158L33177R09719J308327J008596K00113k12445Q0440O49774
11811A6864280O51798m21182j776952k473119k362847j789334j144673o02726
11803F945245j90081O7988J31721J73590M52130R82292J438557J197030J03978
11794A1302450r69735j390543j256260r15749o10893m08178k80262j97897j76644
$$ plain form
11852 30844469 28644633 28502254 31050793 36649005 43359320 46389112 43646389 37808023
11844 37808023 32033751 28082126 26364967 26705039 28577437 30763061 31409349 29571554
11836 29571554 26121112 22626980 20331994 19946460 21873878 25704286 29114264 29160559
11828 29160559 25872923 21429704 17637753 15204442 13921575 13268714 12880345 12646737
11820 12646737 12586579 12919756 13829475 15137802 16146398 16346511 16134066 16214506 16864280
11811 16864280 17516078 17094896 15317944 12844825 10481978 8692644 7547971 6945245
11803 6945245 6755164 6823152 6954873 7128463 7580593 8562885 10001442 11198472 11302450
11794 11302450 10332715 8942172 7685912 6770163 6159270 5751092 5470830 5272933 5096289
11785E096289l02985m91789n97990n57655m22433k97498j91435j27180q3761p9524
11775A944039r5800j14404j13534r3791q3370p2190m0461j1489J5749O8633J31708
11764A535090J91696J97269J32558M2675P968P507l3107j10159j85272k23994
11754A562231k22110j90545j39433j14051r3484p2047o2586l5777k4402k3101
11744E84695j4388j0175k2144k5147j9361j4944k4515L254J7927J64k9876k6818
11732D18672j4575j6880j1479n440J23O570j6958Q05N415n265n59J1397J2261
11719C84087J2062L892j4417K85q785N461j2609j4209j838r652m358n369L162
11706C37712n078k6097j7958j0300K475O778M047r84r011j4230k0675O057O465
$$ plain form
11785 5096289 4793304 4301515 3703525 3145870 2723437 2425939 2234504 2107324 2023563 1944039
11775 1944039 1848239 1733835 1620301 1526510 1443140 1370950 1330489 1319000 1334749 1403382 1535090
11764 1535090 1726786 1924055 2056613 2099288 2107256 2114763 2081656 1971497 1786225 1562231
11754 1562231 1340121 1149576 1010143 896092 802608 730561 667975 632198 607796 584695
11744 584695 570307 560132 537988 512841 493480 478536 454021 457275 475202 475366 445490 418672
11732 418672 404097 387217 375738 370298 370421 376991 360033 360838 366253 360988 360429 371826 384087
11719 384087 396149 400041 385624 385909 377124 382585 369976 355767 353929 344277 339919 334550 337712
11706 337712 332634 306537 288579 278279 280754 287532 291579 290595 281584 267354 246679 252736 259201
11693B59201j4652k190j690J0155p088q183J926j1182N66l378j1363P624K1083
11680B40829m902j449q834J768m767j0778k606J2806N32M779J2139J1922q186
11667B43253k1352j4389J875j4166r683L638J3099K650P4O66K2261K4931M915
11654B57772n993j5821j2495k2619k4906k856M822J246M466j3969n329K963Q80
11641A68161q816j73K340q311j1481J1418J5105J966R496J0680J2277P373K2746
11628B32781J0356j8805k2405l556j6869j5862j5807j2069o755J2503K1633J7126
11616A82271k82J0461Q926J2548K2617J3068P522J8115L6485N2814J04436J69477
11604F38458K65211L30675K95798J69283k4920k16628k96461k89991k19083j39613
$$ plain form
11693 259201 244549 242359 240669 250824 243736 235553 237479 226297 226863 223485 212122 219746 240829
11680 240829 235927 234478 225644 227412 222645 211867 209261 222067 222599 227378 239517 251439 243253
11667 243253 221901 207512 209387 195221 185538 189176 202275 204925 204999 205665 227926 252857 257772
11654 257772 251779 235958 223463 200844 175938 173082 177904 179150 183616 169647 164318 167281 168161
11641 168161 159345 159172 161512 153201 141720 153138 168243 170209 179705 190385 202662 210035 232781
11628 232781 243137 224332 201927 198371 181502 165640 149833 137764 131009 143512 165145 182271
11616 182271 181989 192450 201376 213924 236541 249609 257131 275246 311731 364545 468981 638458
11604 638458 903669 1234344 1530142 1699425 1674505 1457877 1161416 871425 652342 512729
11594E12729q7308o7192l5288m3955l2519Q92k244r358l4227j8728r120k4300
11582A49382p865r468l868n023J4418J8098j617m521j2752K010K488l2l979P929
11568A45200N441N528K9037K0497J6900K2126J1587m303K272J3924K3550M9316
11556C41075Q8096J37061K15548L06011L57533K62711Q7347j37693k91668l13003
11546A053018k57512j94197j29923o7613l7774k5831k4869r360l225j1975q609
11535B82130P415j556o958j0347l4106m8817j9643j4546l083j399J1812r955q858
11522A42089j0113k266k734j7131L875J2767p858K674K6043P571k995m387n64
11509A46971p801r001J2913J2466K493J3180k603K1629K8569M6017N5379L6495
$$ plain form
11594 512729 425421 358229 322941 278986 246467 247359 245115 235757 201530 182802 173682 149382
11582 149382 141517 132049 128181 123158 137576 155674 154057 149536 136784 138794 141282 141250 137271 145200
11568 145200 150641 156169 185206 205703 222603 244729 256316 252013 254285 268209 291759 341075
11556 341075 429171 566232 781780 1087791 1445324 1708035 1795382 1657689 1366021 1053018
11546 1053018 795506 601309 471386 403773 365999 340168 315299 305939 302714 290739 282130
11535 282130 289545 287989 281031 270684 236578 187761 168118 153572 150489 149090 160902 150947 142089
11522 142089 131976 129710 126976 109845 113720 126487 118629 121303 147346 154917 151922 147535 146971
11509 146971 139170 130169 143082 155548 158041 171221 168618 190247 218816 264833 320212 356707
11497C56707P902j0951l8947l5863l0343l2912j9589j3972n138J470Q02m55J2393
11484A91104n022p851J4999R769r36L32J9148L3789J5415O91k0983k5970k2121
11471B02364J466O398J9841K0188L4909M0403J0272m85p14k0213o864M320o555
11458C05330j5875k3295j8915k6078j7692m6q133j8081L640n133q989R319K901
11445A78953J4029l982p197n035K3003M0616M6787N4916P1618P3266P1053O8827
11433F26854M4176K4833J670l6486p2303p4583o5041n7206n9538m5283m2904k8325
11421B15864j1871l270j0473r501J4371J4175K855J3568L3865K9766K5265o496
11409C08118j4175j6972n910Q698M576K0011L4094M5989K2714J1675j7397k7644
$$ plain form
11497 356707 364609 353658 314711 278848 248505 215593 196004 182032 176894 178364 179166 178711 191104
11484 191104 186082 178231 193230 202999 202063 202395 221543 255332 270747 271438 250455 224485 202364
11471 202364 203830 210228 230069 250257 285166 325569 335841 335356 334642 314429 307565 311885 305330
11458 305330 289455 266160 247245 221167 203475 203429 195296 177215 180855 175722 166733 176052 178953
11445 178953 192982 189000 181803 176768 199771 240387 287174 342090 413708 486974 558027 626854
11433 626854 671030 695863 697533 661047 588744 514161 449120 391914 332376 287093 244189 215864
11421 215864 203993 200723 190250 180749 195120 209295 212150 225718 259583 289349 314614 308118
11409 308118 293943 276971 271061 279759 284335 304346 338440 384429 407143 418818 401421 373777
11397C73777k7778k7507k1036l83J779j4822k1741k3781k5741j970J2548J2504
11385B35849J4381K6374L9918L7483M6202M5819K0105k349k8279l9970l5828m7623
11373C12082m4769n54J4265K0660m331l2347m1941l3316k1729q560j3746l881
11361A41833j336m174R311O631K631J4791K0774M24j6753j1201n251q102L29N489
11347A55396q967j1799j5088p150r81m91M632J7496K3295K977j0009m600J3099
11334A57810Q752k844K3935L1245K0220K0950K0176r482j157l2370l8837m5766
11322A52632k4765k3033q296o658K2975J0487j0982j3060q358O417j209k668J6855
11309A10337J8444J7810K4100J8871L6055P2723J00197O6184K8513Q843k5897
$$ plain form
11397 373777 345999 318492 297456 297073 298852 284030 262289 238508 212767 210797 223345 235849
11385 235849 250230 276604 316522 354005 400207 446026 466131 463782 435503 395533 359705 312082
11373 312082 267313 266759 281024 301684 297353 265006 223065 189749 168020 159460 145714 141833
11361 141833 140497 136323 145634 152265 154896 169687 190461 190885 174132 162931 157680 149578 149907 155396
11347 155396 146429 134630 119542 112392 111411 110920 115552 133048 156343 159320 149311 144711 157810
11334 157810 166562 163718 187653 218898 239118 260068 280244 270762 269605 237235 198398 152632
11322 152632 127867 104834 96538 89880 112855 123342 112360 99300 90942 97359 96150 93482 110337
11309 110337 128781 146591 170691 189562 225617 298340 398537 464721 493234 502077 476180
11298D76180l1219j5627J7492L8900R5798J21176R2803L5880J7359l0903q5829
11287G32010q4605p2386o0697l4982l2202j8255j4842o405j244O255p650j4044
11275C90953L865J0917K879R465n492j0232J1345K2998J3306J8055J6035K0995
11263E05089L0277K7047J9341K9540L5034L4370N2505Q3134R0593J09220J20366
11252A136516J12135P2048K7114k1092n3512l4137J4242L8634R0993J15858J30314
11241A629113J32577J66221K27942K84227L52350M92046P51314J170050J816690
11232G022530K749506L597759L519375K206616J56106j986822l141252l187257
11224A0936561k593369j807931j190041p62844m65625k92640j85115j05502m9128
$$ plain form
11298 476180 444961 429334 446826 485726 581524 702700 795503 831383 848742 817839 732010
11287 732010 647405 575019 514322 479340 447138 428883 414041 407636 406392 412647 404997 390953
11275 390953 394818 405735 408614 418079 412587 402355 413700 436698 450004 468059 484094 505089
11263 505089 535366 562413 581754 611294 646328 680698 733203 816337 906930 1016150 1136516
11252 1136516 1248651 1320699 1347813 1326721 1273209 1239072 1253314 1291948 1382941 1498799 1629113
11241 1629113 1761690 1927911 2155853 2440080 2792430 3284476 4035790 5205840 7022530
11232 7022530 9772036 13369795 16889170 19095786 19251892 17265070 14123818 10936561
11224 10936561 8343192 6535261 5345220 4582376 4116751 3824111 3638996 3533494 3484366
11215C484366L1342O7975J04540J72560K80556M32835O92947J080275J700223
11206H047619K589267L548064L694870K569641P26140j438458k807625k953752
11198A3975766k325012j485749p64642k16769J68992M96430Q17283J147870J468575
11189A3282744J782649K040810K397334L032713M228493O457271J0286745J6954954
11181F0463713K8628967M6837714O4170778N9948358L4394776Q65514l8302610
11174B57007210n7562795n5280540m2353883k8108683j7804400j1455242p685381
11167C6756286n522983m203232l436913k966467k591919k313319j991697j631526
11159A2098230j269599r39796p02797n15083l78872l12988k32673j95482j47203
$$ plain form
11215 3484366 3515708 3583683 3688223 3860783 4141339 4574174 5267121 6347396 8047619
11206 8047619 10636886 14184950 17879820 20449461 21175601 19737143 16929518 13975766
11198 13975766 11650754 10165005 9400363 9183594 9352586 9849016 10666299 11814169 13282744
11189 13282744 15065393 17106203 19503537 22536250 26764743 33222014 43508759 60463713
11181 60463713 89092680 135930394 200101172 260049530 294444306 295309820 257007210
11174 257007210 199444415 144163875 101809992 73701309 55896909 44441667 36756286
11167 36756286 31233303 27030071 23593158 20626691 18034772 15721453 13729756 12098230
11159 12098230 10828631 9888835 9186038 8670955 8292083 7979095 7746422 7550940 7403737
11150G403737p6339J5749J18475K14790L15531M50717N99592P67046J014061J302365
11140A2125724J605568J920082K158373K449860L075278M206664O281591R822932
11132D3646072J5857696K6141944M2498355O2004003O8491874M7697342J2326962
11125C18664248k9748681n7508672o0154355m8720761l3534144k1552250j3889180
11118E3556205r204085o347892m534212l188888k040936p66301O78412J620275
11110B9772578J101628p02474k914511m308358m346319l609271k666177j890006
11102A0437090j361970j043543q57504p25860o02651n26594m53901l93271l48472
11093D123324l12845k84334k34662k02704j64222j08743q9072q5688r7844j16397
$$ plain form
11150 7403737 7327398 7343147 7461622 7676412 7991943 8442660 9042252 9809298 10823359 12125724
11140 12125724 13731292 15651374 17809747 20259607 23334885 27541549 33823140 43646072
11132 43646072 59503768 85645712 128144067 190148070 258639944 306337286 318664248
11125 318664248 288915567 231406895 171252540 122531779 88997635 67445385 53556205
11118 53556205 44352120 38004228 33470016 30281128 28240192 27473891 28152303 29772578
11110 29772578 30874206 30171732 27257221 22948863 18602544 14993273 12327096 10437090
11102 10437090 9075120 8031577 7174073 6448213 5845562 5318968 4865067 4471796 4123324
11093 4123324 3810479 3526145 3291483 3088779 2924557 2815814 2726742 2641054 2543210 2426813
11083B426813j13624j27413j17946j11194j06531j10959r2883q3243p6789p1446
11073A414785p7226q6913o6004k0891k4201k8697n4849n0707l4150k9926k5888
11062I15333k3343j5936n985p115j1838n33n851L898l1274m9524k2459J7119K7274
11049G89766L7522J8902j0694k0773m2681n7099l9795k9585k3589j6410p053k3742
11037E74769n697N26n920p848n029J718k0741l8822k9347l7979j4253j365j9430
11024C90582K199L374J4191R033p767j4475k2132j3059m006K522M834J2209J0654
11011C88159P599J726k238J2850J0840L012m992k6461k8116k7780p248N7648Q8233
10998D73232P7125K8371n666l2102l1774k4655m720l906l491J904j3900k4022
$$ plain form
11083 2426813 2313189 2185776 2067830 1956636 1850105 1739146 1646263 1563020 1486231 1414785
11073 1414785 1337559 1250646 1184642 1163751 1139550 1110853 1056004 1005297 971147 941221 915333
11062 915333 891990 876054 870069 862954 851116 850583 844732 848630 817356 767832 745373 762492 789766
11049 789766 827288 846190 835496 814723 772042 714943 675148 645563 621974 605564 598511 574769
11037 574769 569072 569598 563678 555830 550801 552519 531778 492956 463609 425630 411377 410012 390582
11024 390582 392781 396155 410346 419379 411612 397137 375005 361946 357940 360462 365296 377505 388159
11011 388159 395758 397484 395246 408096 418936 421948 416956 390495 362379 334599 327351 384999 473232
10998 473232 550357 578728 573062 540960 509186 484531 479811 475905 472414 474318 460418 436396
10986D36396k3360m865j0823j4080j0243l4519k2350k9104k8066j7913j1689j2283
10974B17101P096J2031n808J1721L339m288N756L047J256K401O849k647k895j386
10960B53573p962k994M920J1565q292k2018k0207L714J2398K710k407O4J619o111
10946B20572n806J259J649P516N391J3964P543P561m812k1110L178M590J1370
10933B52865p600j877l986k0163m0804m1834j0561m465p028m136K0432M197r15
10920A34125N95K898j2198r852L60J8987J3793J0001O678k665q045j5193O527
10907A46011r13J131q995n685K26R118N541j5503j3635j146n335j6477J3115l27
10893A07126j7518O762J2295r749j0258L430J2576J5540P14n733L236j557J342
$$ plain form
10986 436396 413036 408171 397348 383268 373025 338506 316156 287052 258986 241073 229384 217101
10974 217101 224197 236228 230420 242141 245480 241192 246948 249995 251251 253652 260501 257854 254959 253573
10960 253573 245611 242617 247537 259102 250810 228792 208585 212299 224697 227407 225000 225064 226683 220572
10946 220572 214766 216025 217674 225190 230581 244545 252088 259649 254837 233727 236905 241495 252865
10933 252865 245265 243388 239402 219239 178435 136601 126040 121575 114547 110411 130843 135040 134125
10920 134125 134720 137618 125420 115568 115928 134915 148708 158709 165387 162722 154677 139484 146011
10907 146011 145098 146229 137234 131549 131775 140893 146434 130931 117296 116150 110815 94338 107453 107126
10893 107126 89608 96370 108665 98916 88658 92088 104664 120204 120918 115185 118421 116864 118206
10880A18206M862l85j1042K626J5852J6408K036r794j0811j4142o999j8610j6374
10867G1833j0054j2810o481O712k855K0420K6246Q438j146j643l141K257L874
10854A01650J602p767j1987j0418N385O511J1357J2706n343j3615j6258m345J3988
10841H3466K5191P870l660n718R512k619L204j0903j151p224j2722k695M470Q436
10827I5457M390p938p032M363O702l321k3548j2248P734J585j2894M359R763P344
10813G4716o513l669j288K6785R867j0428P767J103j17l312l499n435o14K7556
10799A12919J6508J2074K2134P624L173j6726l8863j6297k597r296M136R943J034
10786A05766L811l796R688k1219q082J9995L1618J2318j7611J853O134L143J6066
$$ plain form
10880 118206 123068 122683 111641 114267 130119 146527 148563 138769 127958 113816 106817 88207 71833
10867 71833 61779 48969 42488 49200 46345 66765 93011 101449 100303 98660 95519 97776 101650
10854 101650 103252 95485 83498 73080 78465 84976 96333 109039 103696 90081 73823 69478 83466
10841 83466 108657 116527 112867 107149 116661 114042 117246 106343 105192 97968 85246 82551 87021 95457
10827 95457 99847 91909 84877 89240 95942 92621 69073 56825 64559 66144 53250 57609 67372 74716
10813 74716 68203 64534 63246 90031 99898 89470 97237 98340 98223 94911 91412 85977 85363 112919
10799 112919 129427 141501 163635 171259 174432 157706 118843 102546 99949 90653 94789 104732 105766
10786 105766 109577 105781 115469 94250 86168 106163 137781 150099 132488 134341 140475 143618 159684
10773A59684K1830J5343J574k261j3543k7699k4461j5643k223L358M469n619J28
10760A14937J2398J5073M000Q555K7667K9245K7661M6929N7509R5956J52854K38107
10748H30891L43732L19672J64178l1203k26122l12998k83204k04958j23962q4653
10738C91373n4657n3755m1752k4005j0535N676j8177r209k6409j9937l37o373
10726A31903k638l743o340M686J617m972K227p459qr202O414J1659Q390k565J2990
10711A42959J1492k418p31m772O392K4600K3062J7225M4719P6429J13774J68411
10699F21142K54328L45063L24192J83664k8845k21579l18246l04652k19485j57736
10689D77846r7898n3482l8720l0612k6605k2000j97J0960O202j309j4880j9906
$$ plain form
10773 159684 181514 196857 198431 196170 182627 154928 130467 114824 112601 115959 120428 114809 114937
10760 114937 127335 142408 146408 154963 182630 211875 239536 286465 343974 439930 592784 830891
10748 830891 1174623 1494295 1658473 1627270 1401148 1088150 804946 599988 476026 391373
10738 391373 336716 282961 241209 217204 206669 212345 194168 184959 158550 138613 138276 131903
10726 131903 129265 125522 119182 123868 125485 120513 122740 115281 115273 106071 112485 124144 132534 129969 142959
10711 142959 154451 152033 151302 146530 152922 177522 200584 217809 262528 338957 452731 621142
10699 621142 875470 1220533 1544725 1728389 1699544 1477965 1159719 855067 635582 477846
10689 477846 379948 326466 287746 257134 230529 208529 208332 219292 225494 224185 209305 189399
10677A89399j5690j8076k1369k959j1623k5836j4181j967j1175m709M751J2760
10665G9325n931J324P995m834q878j1002L677m270j916M207j0728M143P996r61
10651F0147M188K341J667q487M448J552l632m4k0781j2378J165M060k012o035
10637B6199Q387J1966M986p369m993M56l20l164j337j958j3893j9661N792J8120
10623B3211R655p92l204l572J4430P702p27n475K287M575k896O731J9104K383
10609G3412j0578j0476m357j6902n513J975L292J8097k292j6885J280l292M349
10596C2110L758J128k519J828j6988j5254q263J9539J75k717q629j551O824J0596
10582B0037R950K686o377R793m85J9630Q827j2081p898m071N210k055p337k974
$$ plain form
10677 189399 173709 155633 134264 131305 119682 93846 79665 77698 66523 61814 66565 79325
10665 79325 73394 74718 82713 77879 69001 57999 61676 57406 55490 59697 48969 53112 61108 60147
10651 60147 64335 66676 68343 59856 64304 65856 62224 62180 41399 29021 30186 34246 32234 26199
10637 26199 34586 46552 51538 44169 39176 39632 39312 36148 34811 32853 18960 -701 5091 23211
10623 23211 32866 32074 28870 25298 39728 47430 46703 41228 43515 48090 45194 51925 71029 73412
10609 73412 62834 52358 48001 31099 25586 27561 30853 48950 46658 29773 31053 27761 32110
10596 32110 35868 36996 34477 36305 19317 4063 -4200 15339 15514 12797 4168 2617 9441 20037
10582 20037 29987 32673 26296 36089 35604 55234 64061 51980 44082 40011 45221 43166 35829 32855
10568C2855l264p470K090o249p812J4303j231N782K759j2850k350L291O084M518
10554C0456K0678Q553q683r973n629M348o159L237r680n120J200J2191n219K804
10540C3004j7220n080J1135K762J5274M016R812R646p002j4428q92M771m235J4660
10526E6223O637j1500q190K583K2846m287j0333j3099N621J3111K4764J6692j0181
10513I0887o43Q858o694l693N614p603n444k590l525k668o77K16j2637o087O522
10498E9836K5170M919J6776L8987K3447j373j8461k3088j0112j2284k8429q106
10486F7282R780j5078o08N03l704J3675k918k3024j2033Q56J2501o875L361m427
10472C9291L82J278l102K469Q89l356r178M02j440P91q559J1694J3005N216l038
$$ plain form
10568 32855 29591 22121 24211 17962 10150 24453 23222 29004 31763 18913 16563 19854 25938 30456
10554 30456 51134 59687 51004 41031 35402 39750 33591 36828 27148 22028 23228 35419 30200 33004
10540 33004 15784 10704 21839 24601 39875 43891 53703 63349 56347 41919 41027 45798 41563 56223
10526 56223 62860 51360 43170 45753 68599 64312 53979 40880 46501 59612 84376 101068 90887
10513 90887 90244 99102 92408 88715 94329 86726 81282 78692 75167 72499 71822 72038 59401 53314 59836
10498 59836 85006 89925 106701 145688 169135 167762 149301 126213 116101 103817 75388 67282
10486 67282 77062 61984 61376 61879 58175 71850 68932 45908 33875 34731 47232 40357 43718 39291
10472 39291 39673 40951 37849 40318 41207 37851 28673 29075 27635 28426 19867 31561 44566 49782 46744
10457D6744p074L076R73r182j7764r391j442J6579O723j2088n835O759J1216O050
10443C5344Q888l656R67M197j3911j940Q774k476k009j648k625Q395R520J2286
10429F0106J439o714r102p76j4038j2477J3054J4992N614m416p282n368j2046
10416B2986J59R887P45L310L053j2390L504R921R34J0295o930q273N137Q001n455
10401D4884j6233j8384P166J3852M196n842p800J944P606L54P503J4159Q591n362
10387E6634j9340j3492p979j078k347o969Q95L525K949J6567L140j4354K803J4064
10373C5018M107Q39P532l699j1765j1499j6639J0544J9065j022P135p966m353
10360B7297m182m358J853Q818J0170P248P905L2203M2500N315j3552k5072q192
$$ plain form
10457 46744 39670 42746 43719 34537 16773 7382 5940 22519 29242 17154 11319 18078 29294 35344
10443 35344 44232 40576 41543 45740 31829 29889 38663 36187 34178 32530 29905 38300 47820 60106
10429 60106 61545 54831 45729 44953 30915 18438 31492 46484 52098 47682 40400 35032 22986
10416 22986 23145 33032 33777 37087 40140 27750 31254 41175 42109 52404 45474 37201 42338 50339 44884
10401 44884 28651 10267 17433 31285 35481 29639 21839 23783 31389 31743 39246 53405 61996 56634
10387 56634 37294 23802 15823 14745 12398 5429 6324 9849 12798 29365 32505 18151 20954 35018
10373 35018 39125 39964 47496 43797 32032 20533 3894 14438 33503 32481 39616 31650 27297
10360 27297 23115 18757 20610 29428 39598 46846 54751 86954 129454 134769 121217 96145 87953
10347H7953j1638L40o277j6220k785J141j4744p698O631K879N344J0827O072m674
10333E7151j0766k0186p8j955J6237o391j1539m094K939r89l643k112J2815q677
10319A8712j3784p058l723L865J0376J687o988N171q90r567J0547R623J4676R79
10305C3626j9383p101J3708M183J896L611J2245o360o617j0959M52J0826J5061
10292D5188l161o28o295k0170P32M609q050j102L989J9146N28o708m366k293j559
10277A9860J1551n779j4832j799N156o98M129j175J2748J7003L054j6492k2269
10264A0457j0202L682J5825J6805k135j0880j82j844O152J103Q686m481l954k986
10250B6046j298J0815p743k986O467P424P017J8741r659m878n222L173J5531J118
$$ plain form
10347 87953 76315 76655 70378 54158 51373 52514 37770 30072 36703 39582 44926 55753 61825 57151
10333 57151 46385 26199 26121 24166 40403 34012 22473 18379 21318 20329 16686 14574 27389 18712
10319 18712 4928 -2130 -5853 -1988 8388 10075 3087 8258 7368 -2199 8348 17971 32647 33626
10305 33626 14243 7142 20850 25033 26929 30540 42785 36425 29808 18849 19301 30127 45188
10292 45188 42027 41399 35104 14934 15666 20275 12225 11123 15112 34258 34786 28078 23712 21419 19860
10277 19860 31411 25632 10800 9001 14157 13459 17588 16413 29161 46164 49218 32726 10457
10264 10457 255 3937 19762 36567 34432 23552 23370 21526 27678 28781 37467 32986 29032 26046
10250 26046 24748 35563 27820 24834 31301 38725 45742 64483 54824 49946 44724 47897 63428 64546
10236F4546L272K2487P042J2482J2561O779K7103K7403J8334L2115N8719J04018
10224C96861J83102K06577J62423J29035J67965J99603J08774p3561j51556j26624
10214A202599j22647j78845k06033j80871j28782p1558o0954m0646j7659j7848
10204A76756k5669j3936j5387r515m419n858O570N148J0559J3028J7013P985l414
10191A58861k4306l1340j9726M29j8668l223Q415j3103j3885m744J1754Q600o102
10178E2962j8796j7923n372J1m894O336J4795J124j0417J7144N570j1873j7029
10165A1638k418k895Q507j709m533N203J2212r15k400M860M031N934R94o688N056
10150C6877M357J4037Q267K237N407j0080k3388o743k850O235k440j680N674j776
$$ plain form
10236 64546 67818 90305 97347 109829 122390 129169 156272 183675 202009 234124 292843 396861
10224 396861 579963 786540 948963 1077998 1245963 1445566 1554340 1480779 1329223 1202599
10214 1202599 1079952 901107 695074 514203 385421 313863 252909 212263 194604 176756
10204 176756 151087 137151 121764 112249 107830 101972 108542 113690 124249 137277 154290 162275 158861
10191 158861 134555 103215 83489 83918 65250 62027 70442 57339 43454 38710 50464 59064 52962
10178 52962 34166 16243 10871 10882 5988 12324 27119 28243 17826 34970 40540 28667 11638
10165 11638 9220 6325 14832 13123 8590 13793 26005 25090 22690 27550 31581 37515 38509 31821 36877
10150 36877 41234 55271 63538 65775 71182 61102 37714 30971 28121 34356 31916 30236 35910 34134
10136C4134q019l130Q680Q936j0548j1179j1681L71Q606k201p642q655o086O883
10122a531Q788m533p956K508J0616o248R737K224O106M830M085P081j0596j1374
10108A3737j0119j6678j0192M782J5222J8296J3385N972q278p202m243o309n532
10095B841J0935N332J0727j470N265o745p795k005j6171J023J0906J3052M107
10082C0002j8003p896j503N146P362m304M246J6086o488j534m591J6942P189k822
10068C9832j7577q514l178J700J2156J0801p84k505L451J2265J1251N810K9872
10055I4580K3380p299j8036j8631k2773q205N860j4774J469o705j1973J0974N090
10042C2957j17k020M895Q062j4940j2944n434j1500J2788J1937k931J2835O324
$$ plain form
10136 34134 26115 22985 31665 40601 30053 18874 7193 7564 16170 13969 6327 -2328 -8414 -1531
10122 -1531 7257 2724 -5232 -2724 7892 1644 11381 13605 19711 24541 28626 35707 25111 13737
10108 13737 3618 -13060 -23252 -18470 -3248 15048 28433 34405 26127 18925 14682 8373 2841
10095 2841 13776 19108 29835 28365 33630 26885 19090 17085 914 1937 12843 25895 30002
10082 30002 11999 4103 2600 7746 15108 10804 15050 31136 24648 23114 18523 35465 42654 39832
10068 39832 22255 13741 10563 12263 24419 35220 34436 31931 35382 47647 58898 64708 94580
10055 94580 117960 110661 92625 73994 51221 43016 48876 34102 35571 28866 16893 27867 32957
10042 32957 32840 30820 35715 43777 28837 15893 10459 -1041 11747 23684 20753 33588 39912
10029C9912j1508j0759J324j321P224Q351j064r250J3478J6841p652j3973l094
10016B8509P522k047j1638j31Q081p782j3984j1226K1983M071q253j2818K228
10003D515M099J415k308J6194J993l109J5522m748Q90K792j2052m355N572M02
9989B6822J096L118j073R85k456r249O429P879j6103r504K430P634J7866K708
9975C8582m390J786L113r799j3324L406j93J0363J332P167r201j9599j521J0694
9961A8416J2413P13q76M86n488M444j2659J018N513o715M097k262j3171j09J7089
9946B2909L43p595J074o813j396K879l062m268O163P098j1134m661P157O567Q300
9931B3561n785m87N441o311j5506m617J5274L380J0199N052r112k817N981Q07
$$ plain form
10029 39912 28404 17645 18969 17648 24872 33223 32159 22909 36387 53228 45576 31603 28509
10016 28509 36031 33984 22346 22215 30296 22514 8530 -2696 19287 23358 15105 2287 4515
10003 4515 8614 10029 7721 23915 25908 22799 38321 33573 34463 37255 25203 20848 26420 26822
9989 26822 27918 31036 29963 30948 28492 19243 25672 33551 17448 7944 10374 18008 35874 38582
9975 38582 34192 35978 39091 29292 15968 19374 19181 29544 30876 38043 28842 9243 7722 18416
9961 18416 30829 31542 30666 31152 25664 30108 17449 18467 23980 17265 21362 19100 5929 5820 22909
9946 22909 23252 15657 16731 9918 8522 11401 8339 4071 10234 17332 6198 1537 8694 15261 23561
9931 23561 17776 17289 22730 16419 913 -3704 11570 14950 25149 30201 21089 18272 24253 25060
9917B5060L044M88m419L252O160j3073l792L258r58p94J1499P92K783m482o793
9902B2025p114R886R862J5321j6825p163j5280q130P794J4647J0911j3423j4783
9889G728k47Q106K7R766J361J021p415o691M607Q012P458p373o583j2553n703
9874A521Q749L208J3265K640j0118j8244M616P386P319J039j3809M635J3590q195
9860A7602N347J0242Q6o355k703O338n861L195N070j1576k1022q507J2782R046
9846A3684J0266K88L807o494P034p681n552P428r980o13M999J60j352J7360R475
9831D2829r336k87j405J437n750j9543j1065L72j397J5640P422O974K75m090J06
9816B2182O769p158M020J828m687j4442j052Q864O444J1099N792j6596K028L262
$$ plain form
9917 25060 28104 28592 24173 27425 33585 20512 16720 19978 19020 18226 29725 30517 33300 28818 22025
9902 22025 14911 24797 34659 49980 33155 25992 10712 2582 10376 25023 35934 22511 7728
9889 7728 7481 15587 15614 25380 26741 27762 20347 13656 18263 26275 33733 26360 19777 7224 1521
9874 1521 10270 13478 26743 29383 19265 1021 5637 13023 20342 21381 7572 12207 25797 17602
9860 17602 22949 33191 33277 26922 24219 30557 24696 27891 32961 21385 363 -8144 4638 13684
9846 13684 23950 24238 28045 21551 28585 20904 15352 22780 12800 12187 17186 17346 15994 33354 42829
9831 42829 33493 33206 31801 33238 27488 7945 -3120 -2748 -4145 11495 18917 25891 26166 22076 22182
9816 22182 28951 21793 25813 27641 22954 8512 7460 16324 22768 33867 39659 23063 25091 28353
9802B8353L037L066o724O393J1687m714l050L234r775m665M761J013o275L876
9788C0217k360J390J4491J7676l734K763n474k2129j6272L40j882L853j930r001
9774G948N959J4107J284K029k289r255J6286R02j0965o332r495j2708l733O608
9760C46J8086L386p867k208k980l664J782M299J946P937J5484n992n221l326m819
9745A7189p589p622Q525J5077Q332J1042J03r270Q78q653j5373K838N846j200
9731B0123M400j1973j630P260r75J53J2098J0999L080O717K641n284j1403J148
9717C7354k428p168J6910L747j0218j0518p848O641J5960j2688k3477k817j020
9704B430J7540J2578N187q025J2711Q330k0109k7113K351J3564J0040P539j0345
$$ plain form
9802 28353 31390 34456 27732 34125 45812 41098 38048 41282 31507 26842 31603 32616 26341 30217
9788 30217 27857 29247 43738 61414 57680 60443 54969 32840 16568 16908 15026 18879 16949 7948
9774 7948 13907 28014 29298 31327 29038 19783 36069 36971 26006 19674 10179 -2529 -6262 346
9760 346 18432 21818 13951 11743 8763 5099 6881 11180 13126 21063 36547 30555 25334 22008 17189
9745 17189 9600 1978 10503 25580 33912 44954 45057 35787 36665 28012 12639 15477 21323 20123
9731 20123 24523 12550 10920 18180 17205 17358 29456 40455 43535 50252 52893 47609 36206 37354
9717 37354 34926 27758 44668 48415 38197 27679 19831 26472 42432 29744 6267 3450 2430
9704 2430 19970 32548 37735 29710 42421 50751 30642 3529 5880 19444 29484 37023 26678
9691B6678q346Q50m350j2757q940J1445K624P624O250M724n043M123J8052o269
9677C6665l951o44O881q10r59N630o413k77O583j0463K047j671J4274K4460k59
9662G1093j3192n270j976N291P771L331p207n510n701m915O423M754O772j20Q25
9647F2369J19O503j3808j9563P320K533K5279R549p230J288R289J0669P790O505
9633A08612O646j2817n271K762k1142j5975j1393M496P062P78n496r742j223M56
9619D7753J583P222R15J0024P35l158j580j021O31J5292J6911R407J1555M8795
9605A65064K9208J8691K2914J1553j132n132K6943L6870K8848N3775J51038K09580
9593G48220J39804J5142p1207r5039o8504o7203p2446q1360o3988l4598j9536
$$ plain form
9691 26678 18332 19182 14832 2075 -6865 4580 7204 14828 21078 25802 20759 24882 42934 36665
9677 36665 32714 32070 38951 38141 37182 42812 36399 36122 42705 32242 34289 32618 46892 71352 71093
9662 71093 57901 52631 50655 55946 63717 67048 59841 54331 48630 43715 50138 54892 61664 61544 62369
9647 62369 62488 68991 55183 35620 42940 45473 70752 80301 73071 74359 83648 94317 102107 108612
9633 108612 115258 102441 97170 99932 78790 62815 51422 55918 62980 63758 58262 48520 47297 47753
9619 47753 49336 56558 57473 67497 68232 65074 63494 62473 63104 78396 95307 104714 116269 165064
9605 165064 194272 212963 235877 247430 246298 241166 268109 304979 333827 387602 538640 748220
9593 748220 888024 903166 831959 736920 668416 601213 528767 447407 383419 348821 329285
9582C29285j3977O141N0612P9752Q2881P1758Q4061R1306R4827N5837j558l4412
9570H96513j6354k6293l5558m7074n2219p405r830j0065j0878k6891l4256j4268
9558F05422L5367P9130J24488J77220K92589M14852N19911L78039n3103l47942
9548B225973m58039l90961k69316j78986j29093r2342l8414L832K0775J7511j449
9537G09491j3994r475R316K3548N1151M3496N3676N3964L2513J029n1353o6496
9525H36866q2100q6302q8496j10941p9512n3243k5368J998K4765M2297N4528O6532
9513E01024O6459M5659P1015J13050J02436k0615j42934j50053j17898r1757p0509
9502C05877n0343q23N874j2947m751j3890l0110k9965j6888j2240r629j0420j3988
$$ plain form
9582 329285 315308 321449 372061 451813 534694 606452 690513 781819 876646 932483 930925 896513
9570 896513 880159 853866 818308 771234 719015 711610 701780 691715 680837 653946 619690 605422
9558 605422 640789 719919 844407 1021627 1314216 1729068 2248979 2627018 2573915 2225973
9548 2225973 1767934 1376973 1107657 928671 799578 707236 668822 672654 693429 710940 709491
9537 709491 695497 686022 695338 718886 770037 813533 867209 921173 953686 954715 903362 836866
9525 836866 754766 668464 579968 469027 389515 336272 310904 312902 337667 379964 434492 501024
9513 501024 567483 613142 684157 797207 899643 879028 736094 586041 468143 376386 305877
9502 305877 255534 254711 260585 247638 242887 228997 198887 168922 152034 139794 130165 119745 105757
9489A05757q670r039p337N819J4184l576j6421q32m951j1199p487M982j320J2230
9475G2140K2529k273j532J956o638N785P947O666k597J3685J0155J101o714r036
9461A13174n618M52J255j0706j8273j6361J531Q048J874J1634q850n4Q023L715
9447H9844j922K21j2557k418M10J874J1482j887q547n948J240j5342K51J6642
9433G3343r96K609q319l373J0086m941j5443L867m034j2294l964P601N1L36j546
9418D2983j0233J3244K5995J1927j0439J7474N200j0373Q174m28j4845n180o797
9405F6702o524r03J09Q123m387j0042J0525j466N45J3140j302j2352m552M203
9391F1819n838r075j0524j0021m089R394J7247L728L449O409L91j315j352p580
$$ plain form
9489 105757 97087 88048 80711 86530 100714 97138 80717 79885 74934 63735 56248 61230 59910 72140
9475 72140 94669 92396 90864 92820 86182 91967 99914 106580 103983 117668 127823 128924 122210 113174
9461 113174 107556 108008 109263 98557 80284 63923 65454 73502 75376 87010 78160 78106 86129 89844
9447 89844 87922 88143 75586 73168 73578 75452 86934 85047 76500 70552 71792 56450 56701 73343
9433 73343 72347 74956 66637 63264 73350 68409 52966 56833 52799 40505 36541 44142 44193 44529 42983
9418 42983 32750 45994 71989 83916 73477 90951 96151 85778 93952 93524 78679 73499 66702
9405 66702 60178 59275 59384 67507 63120 53078 63603 62137 62682 75822 74520 62168 57616 61819
9391 61819 55981 46906 36382 26361 22272 31666 48913 52641 56090 62499 62890 61575 60223 52643
9377E2643m222N496J496J69l481Q286R632Q005m415J1153j977q780k0621o897
9363D6487N318P465M898N872J0672M505n660K298O562n252J30n718n548O214J1008
9348H9251J85j8248j0580o214K682j390L315N112J122m140R003J1107l818j0493
9334F6894l479N481R65o641m81P58O326O727L31m11o059J6875K160j8377R531
9319H0600O389P23K341o971n9k458n518o162L232J0358J1669l880m232j2614Q16
9304G4234O364j0558O951J1985J590P342J393j2943l661P515o152j1139m062J0749
9290G9608J2265N359L448J6840J3599J0492k663L990N005m132j1299P16j5625
9277A17603j895r498J008L006j9429J8218J1511J5726j82J80N853j6432j9745
$$ plain form
9377 52643 48421 53917 55413 55582 52101 60387 70019 78024 73609 84762 82785 74005 53384 46487
9363 46487 51805 59270 64168 70040 80712 85217 79557 81855 88417 83165 83295 77577 72029 78243 89251
9348 89251 89436 71188 60608 54394 57076 55686 59001 64113 65235 61095 70098 81205 77387 66894
9334 66894 63415 68896 69861 63220 62739 63497 69823 76550 76881 76470 70411 87286 89446 71069 80600
9319 80600 86989 87712 90053 83082 83023 80565 75047 68885 72117 82475 94144 90264 86032 73418 74234
9304 74234 80598 70040 76991 88976 90566 97908 99301 86358 82697 90212 84060 72921 68859 79608
9290 79608 91873 97232 100680 117520 131119 141611 138948 142938 147943 143811 132512 133228 117603
9277 117603 115708 106210 107218 110224 90795 109013 120524 136250 136068 136248 142101 125669 105924
9264A05924K725P231r913K75k014J0656O804r752j768K0368O397R198J3291J0097
9250A69519L2272L465q282n825j7900k7046k0847j3866r107j616l031J1759R895
9237A19390J640j8095m207K776J7223J9166k43l267p437k007n471n738M399O671
9223A24800n091j0549q722J7P309M424R042j0503o170K1809J9967P750o907j936
9209A45240N768K424M281p280j9764j7405j679M581M635k237j0488O110l774j0329
9195A00083j266J8203J6535p328j1786O509N521O84J492m104Q957n294j2220l18
9181A15668K3442j269j3164L892N053J6877O035j0451M467J1606R105j5783j3122
9168A42356J6387M96j4254r976L750J4664o324K063j306O138k895q518J2622q631
$$ plain form
9264 105924 108649 115880 105967 106242 104228 114884 121688 111936 110168 130536 136933 146131 159422 169519
9250 169519 201791 205256 196974 191149 173249 146203 125356 111490 102383 100767 97736 109495 119390
9237 119390 121030 102935 98728 101504 118727 137893 137650 134383 126946 124939 119468 113730 118129 124800
9223 124800 119709 109160 100438 100455 107764 112188 121230 110727 104557 126366 146333 154083 147176 145240
9209 145240 151008 153432 157713 150433 130669 113264 111585 116166 120801 118564 108076 114186 110412 100083
9195 100083 98817 117020 133555 126227 114441 120950 126471 127155 128647 124543 133500 128206 115986 115668
9181 115668 139110 137841 124677 128569 133622 150499 156534 146083 150550 162156 171261 155478 142356
9168 142356 158743 159239 144985 135009 138759 153423 147099 149162 147856 153994 151099 142581 155203 146572
9154A46572j0061K991j284j822J94m896j684J5011J7493J4219j476J12k124p922
9140A65323o021N16k243P427J7465M128L656j4066j745J2922J095M325n936p083
9126A79763m518j570L330K80O645J5416Q122n195M233n255m463j0532j1964J2908
9112A87200M624o242J548M502J416J3612J6337J761p203M986j4574J1402J5319
9099B34688J7903N720j1007j1597o57R901N503o097j354J1653N624N512q42K967
9085B67917N33j842k084K650k376P83R058R803Q088J5809o807p123M798P854j6307
9070B90754j3181k263J4947l618j4585J0540k544q743K679J482N152M657N56J1532
9056B97365J5794K636J954l456O199j268L980n613Q01O251N145J023N570m310
$$ plain form
9154 146572 136511 139502 138218 136396 136590 131694 130010 145021 162514 176733 175257 175369 173245 165323
9140 165323 159302 159818 157575 165002 182467 186595 190251 176185 174440 187362 188457 192782 186846 179763
9126 179763 175245 173675 177005 177285 183930 199346 207468 202273 206506 201251 196788 186256 174292 187200
9112 187200 191824 185582 187130 191632 193048 206660 222997 224758 217555 222541 207967 219369 234688
9099 234688 252591 258311 247304 235707 235050 244951 250454 244357 243003 254656 260280 265792 264950 267917
9085 267917 268450 266608 264524 267174 264798 265581 274639 284442 292530 308339 301532 294409 299207 307061 290754
9070 290754 277573 275310 290257 286639 272054 282594 280050 271307 273986 275468 280620 285277 285833 297365
9056 297365 313159 315795 317749 314293 320492 319224 323204 317591 318392 324643 329788 330811 336381 332071
9042C32071m407R482k806J7355J3374r246O165M016R057q701j1061N876J8204
9029C79379K428o308R33J260R68M564J055r505J1304n680n366J2002k081K392
9015C87345R313O589J7989K2493R424j5138K217k816k984Q121O101K161J8240
9002D69055L113o180J434j927J2793J062J0349P824j916J2701J2325N848K576
8989E29057J0597N359J1576J5588m702J9015K130k15P343J3525j617M591J5230
8976F27477J6374Q429Q784P523j3412k312J2611K1998J1261Q690K5019K2711O49
8963G55802R870L673J398L439Q533J8787J7853K0613K0215J3824l910Q158J4687
8950H92942L0253K2961J9654K5534J5369Q790K653J2170K2520J5396O053K0166
$$ plain form
9042 332071 327664 337146 334340 351695 365069 355823 361988 366004 375061 366360 355299 361175 379379
9029 379379 381807 375499 376432 377692 378660 383224 384279 374774 386078 380398 375032 387034 384953 387345
9015 387345 396658 403247 421236 443729 453153 438015 440232 437416 434432 442553 448654 450815 469055
9002 469055 472168 465988 467422 465495 478288 479350 489699 497523 495607 508308 520633 526481 529057
8989 529057 539654 545013 556589 572177 567475 586490 588620 588405 595748 609273 607656 612247 627477
8976 627477 643851 652280 661064 668587 655175 652863 665474 687472 698733 707423 732442 755153 755802
8963 755802 765672 769345 770743 774182 782715 801502 819355 839968 860183 874007 870097 878255 892942
8950 892942 923195 946156 965810 991344 1006713 1015503 1018156 1030326 1052846 1068242 1074295 1094461
8938A094461K0128L2672K7907K4024K2004O735J0773K3440K0267J543J8003J9246
8926A321203L5064L0923K7228K6353L0820L5214L5506K2838L4361N2018M6049
8915A697577L5862M4327L7988M5567L6255N2094O7546P5182Q4173N7818P0325
8904B304714Q7852Q8793J12936J14570J20029J28724J57008J69852J81387K14089
8894C679954K70301L64443N56932Q96341J469462K336501L236495K842053M25987
8885A6078469j804962k614184k340368j636038j015903o13363l64832k14293j18067
8876E356459n1366O320K9182K8840M9944N3029P5283R6820J09163J26543J45003
8865F025220J50743J89077K05020K07588K24279K37935K46691K68991K94908L06170
$$ plain form
8938 1094461 1114589 1147261 1175168 1199192 1221196 1227931 1238704 1262144 1282411 1283954 1301957 1321203
8926 1321203 1356267 1387190 1414418 1440771 1471591 1506805 1542311 1565149 1599510 1651528 1697577
8915 1697577 1733439 1777766 1815754 1861321 1897576 1949670 2017216 2092398 2176571 2234389 2304714
8904 2304714 2392566 2481359 2594295 2708865 2828894 2957618 3114626 3284478 3465865 3679954
8894 3679954 3950255 4314698 4871630 5767971 7237433 9573934 12810429 15652482 16078469
8885 16078469 14273507 11659323 9318955 7682917 6667014 6053651 5688819 5474526 5356459
8876 5356459 5305093 5311413 5340595 5369435 5419379 5472408 5547691 5644511 5753674 5880217 6025220
8865 6025220 6175963 6365040 6570060 6777648 7001927 7239862 7486553 7755544 8050452 8356622
8855H356622L17033L22109L47767L77187M02398M25888M25857M55464M76938N05397
8845A2412660N33417N57308N65437N93895O41889O50201O62013O85478P13240
8836A8015538P30258P41216P42614P37032P38024P32237P21378O91130O49950
8827B4499377O05578N57791M96396M25006L30414K51966J61417N7555l4778j36985
8817B7213737k13575k96248l77404m56218n11953n72590o25975o66293o87322
8808B2806159p25809p19201p26130p33001p49953p19541o98177o88593o75875
8799A6369879o53181o16554o13440n91528n65676n40039n19860m92573m69753
8790A1307275m44483m27238m11499m08261l81886l36319l17885l18651l02904
$$ plain form
8855 8356622 8673655 8995764 9343531 9720718 10123116 10549004 10974861 11430325 11907263 12412660
8845 12412660 12946077 13503385 14068822 14662717 15304606 15954807 16616820 17302298 18015538
8836 18015538 18745796 19487012 20229626 20966658 21704682 22436919 23158297 23849427 24499377
8827 24499377 25104955 25662746 26159142 26584148 26914562 27166528 27327945 27385500 27350722 27213737
8817 27213737 27000162 26703914 26326510 25870292 25358339 24785749 24159774 23493481 22806159
8808 22806159 22080350 21361149 20635019 19902018 19152065 18432524 17734347 17045754 16369879
8799 16369879 15716698 15100144 14486704 13895176 13329500 12789461 12269601 11777028 11307275
8790 11307275 10862792 10435554 10024055 9615794 9233908 8897589 8579704 8261053 7958149
8781G958149l01849k90541k67816k39809k31581k42746k23488k00293k04355k08720
8771E546951j74502j65004j67908j52189j43219j38053j48468j47276j34220j29721
8761D046391j27893j00568j03948r7975q9424q3680r8887r3306p2678r2556j01107
8750B984369q3260n8165p1069p1738o4321o2847o1219n1617o5392n8962n6747
8739B279032n0483n2698n1803m9740m6492m6689m0076l4505l6668k7520l6820
8728A805538m3470n6215l5308k2667l2434k4177j7025l4926k7779k9565l8683
8717A443289k7806j7193j9705l1763k5675k5509k1752k088r101k7226k9182l1922
8705A174367k4765k2655k4495j9077p224j6516j152j0527k0811k7617o125k0841
$$ plain form
8781 7958149 7656300 7365759 7097943 6858134 6626553 6383807 6160319 5960026 5755671 5546951
8771 5546951 5372449 5207445 5039537 4887348 4744129 4606076 4457608 4310332 4176112 4046391
8761 4046391 3918498 3817930 3713982 3616007 3526583 3442903 3344016 3250710 3178032 3085476 2984369
8750 2984369 2901109 2842944 2771875 2700137 2635816 2572969 2511750 2460133 2394741 2335779 2279032
8739 2279032 2228549 2175851 2124048 2074308 2027816 1981127 1941051 1906546 1869878 1842358 1805538
8728 1805538 1762068 1705853 1670545 1647878 1615444 1591267 1574242 1539316 1511537 1481972 1443289
8717 1443289 1415483 1398290 1378585 1346822 1321147 1295638 1273886 1271798 1262697 1235471 1206289 1174367
8705 1174367 1149602 1126947 1102452 1083375 1076151 1059635 1058483 1047956 1027145 999528 993403 972562
8693I72562j1235m29k288k2008k0561r902k1516j3772j034o696j9090j9221K574
8680H27384p053j7709o979L372o660M988q875k3781j8872j2993j8457k7593j2422
8667F74350l94j1794K411J6948l761j3133l032K539j2908j1234j9569K019P077
8654F29519j1668j6985j6661q681j6768K141Q286r944n234P055J269j570j4328
8641E46431j0475j715K388n087j3608k3760j4932K202k673r973j5859l509L699
8628D53129l15j29k332j3003j0673l971K796M385P838p019j969k244q411m172
8614D13910j1970k390P94o729l324P988J1552M261l369j7925J4470J1603q318
8601D10553k3046j0451j246k3810j8043R006m284j4377Q18J0496J0768m607j0054
$$ plain form
8693 972562 961327 960898 958610 936602 916041 906139 884623 870851 869817 863121 844031 824810 827384
8680 827384 820331 802622 795643 799015 792355 797343 788468 764687 745815 732822 714365 686772 674350
8667 674350 673956 662162 664573 681521 677760 664627 661595 664134 651226 639992 620423 622442 629519
8654 629519 617851 600866 584205 575524 558756 560897 569183 559239 554005 561060 562329 560759 546431
8641 546431 535956 534241 536629 531542 517934 494174 479242 481444 478771 468798 452939 449430 453129
8628 453129 452814 452685 450353 437350 426677 422706 425502 429887 437725 430706 428737 426493 418082 413910
8614 413910 401940 399550 400344 393615 390291 398279 409831 414092 410723 392798 407268 418871 410553
8601 410553 387507 377056 375810 352000 333957 342963 338679 324302 325120 335616 346384 341777 331723
8588C31723J660j1319J904L789K977p489O91r327M772k3849k7281J7104l080o934
8574B75341q407N233J750R598J327k302k441j3956r915q513k717J894m921L963
8560B45934O684Q914L251L376M05J700j751P5N819o388m590M969O174j3405j2447
8545B48720J669K33p300j8484k2694J217n741r347Q262n158o159n8M800j3551
8531A76409q086R891O399L477k3027r469k051J8185O151J828j4641o510R613L932
8517A72101q170n30K167l626n628q044L025J3451J5612P030j9323j7700Q921q9
8503A59197M724O822k14l151J719L222m31M051o970j5984q816J7660j861P974
8489A67942K1698J6632J0135Q198p166j2912o341k112k2317m619k413m259p081
$$ plain form
8588 331723 333383 322064 323968 327757 330734 323245 323936 314609 319381 295532 268251 285355 282275 275341
8574 275341 266934 272167 273917 283515 284842 282540 280099 266143 256228 247715 244998 246892 241971 245934
8560 245934 252618 261532 264783 268159 268564 270264 268513 268588 274407 268019 263429 268398 274572 261167 248720
8545 248720 250389 250622 243322 224838 202144 203361 197620 188273 196535 191377 185218 185160 189960 176409
8531 176409 168323 178214 184613 188090 165063 155594 153543 171728 177879 179707 165066 158556 168169 172101
8517 172101 163931 163401 165568 161942 156314 148270 151295 164746 180358 187388 168065 150365 159286 159197
8503 159197 163921 170743 170529 167378 169097 172319 171888 175939 168969 152985 144169 161829 159968 167942
8489 167942 189640 206272 216407 224605 217439 204527 198186 196074 173757 169138 166725 162466 155385
8476A55385q191o96j1873M324Q769P292K198q482j8132L556J1767j55r328k283
8462A34151J582L553r49J4991k566L61k846p90p032j5548m775J643P256l843r390
8447A15798j1335o550O879K399P268J791j6220j0672J4840J3854Q929J820L304
8434A32105k0594k4887m588J2339k776K50k574j2474j738Q590j862J9715J7402
8421A18908J1449j924o338r816j003O13K265r417J0518J0497j6029j0436j351
8408I7936J451J620n096Q829N619j2638j0091n358r401O241J0178q857r643j86
8394G0604J347J8677K1j953m109J0760j197j2939R203J0982j246q595o766l788
8380H1001j0961j0265L918k089j51j0697K088J5257Q885K273j77r338o52P968
$$ plain form
8476 155385 147194 146498 134625 138949 147718 155010 157208 148726 130594 134150 145917 145762 136434 134151
8462 134151 135733 139286 138337 153328 150762 151123 148277 147487 140455 124907 120132 121775 129031 125188 115798
8447 115798 104463 97913 104792 107191 114459 116250 100030 89358 104198 118052 126981 128801 132105
8434 132105 111511 86624 82036 94375 91599 91849 89275 76801 75063 83653 81791 101506 118908
8421 118908 130357 128433 122095 112279 111276 111889 114154 104737 115255 125752 109723 99287 97936
8408 97936 99387 101007 95911 104740 110359 97721 87630 82272 72871 79112 89290 80433 70790 70604
8394 70604 71951 90628 90649 88696 84587 95347 94150 81211 90414 101396 100150 91555 84789 81001
8380 81001 70040 59775 63693 61604 61453 50756 52844 68101 76986 79259 79082 69744 69092 77060
8366G7060q112j9478k1290J0699J0975J2546Q059j2259j0484L413N595O429j27
8353F3026p820o973L700J815k692K47K0106J9955J277J877j7378n663N303Ok1818
8338E4968j269K603O952M998P744j0672j5209l738P701Q193j1042n714o468K656
8324D1703R378M79q094J3279Q751O279q377l721q865k515r308j0993K551J8841
8310D9388K1507l556l998R097q402M89k768l172k000L028O065K607Q209p200r933
8295E9361n965O014R411m847j3904J287m526q754J2376J0720j492R847m297p449
8281E7782k429o225K442J0753O227j440n595n675K232o679n407j3439J0837J3707
8267E7091L370j1158q154N60j152O449Q994L448j2458j5589M198P584J5310p654
$$ plain form
8366 77060 68948 49470 28180 38879 49854 62400 70459 58200 47716 51129 56724 63153 63026
8353 63026 55206 48233 51933 53748 51056 51303 71409 91364 92641 94518 77140 71477 76780 76786 54968
8338 54968 53699 56302 63254 68252 75996 65324 50115 46377 54078 62271 51229 45515 39047 41703
8324 41703 51081 51560 43466 56745 65496 71775 63398 59677 50812 48297 38989 27996 30547 49388
8310 49388 70895 67339 63341 72438 64036 64525 61757 58585 56585 59613 65678 68285 76494 69294 59361
8295 59361 53396 59410 68821 63974 50070 51357 46831 38077 50453 61173 59681 69528 65231 57782
8281 57782 55353 49128 51570 62323 68550 67110 61515 55840 58072 51393 45986 32547 43384 57091
8267 57091 60461 49303 41149 41709 40557 47006 56000 59448 46990 31401 35599 43183 58493 50839
8253E0839j2564P497P743j1123l436J138J97R012l810J1494R821r673j775l804
8239E1556o165O918N33j1080o351J909j7805J0285J2762O41N678N478o119l509
8225D4731jJ8206L684q227j3902p533j1455r87j092P37R918J719o227l687O050
8210C1934R679J613O6N737r104j5160Q202J2715m888L215K291K431q843J405r638
8195C1655k277N809m24j4624N889J3921J2930J0841j9364o533J3132n247J72k5714
8181B0166j3794L04n421n239Q047m33J2323J6840R015R280K020j6475j2373r131
8167A5129m636J1970N004O333j0864o243J3058N980L414J5202m820r14k340M107
8153E0380J853o104j1317j0537R341K59k271p822J3577J0583j4764l569Q194J0489
$$ plain form
8253 50839 38275 45772 53515 42392 38956 40094 40291 49303 45493 56987 66808 57135 55360 51556
8239 51556 45391 52309 52842 41762 35411 37320 19515 29800 42562 43203 48881 54359 48240 44731
8225 44731 44730 62936 66620 58393 44491 36958 25503 24516 23424 24161 34079 35798 29571 25884 31934
8210 31934 41613 43226 43292 49029 39925 24765 32967 45682 40794 44009 46300 48731 39888 41293 31655
8195 31655 29378 35187 34763 20139 26028 39949 52879 63720 44356 37823 50955 45708 45880 20166
8181 20166 6372 6676 1255 -3984 4063 3630 15953 32793 41808 51088 53108 36633 24260 15129
8167 15129 10493 22463 27467 33800 22936 16693 29751 35731 39145 54347 49527 48613 46273 50380
8153 50380 52233 46129 34812 24275 33616 33875 31604 23782 37359 47942 33178 29609 37803 48292
8139D8292j557N281J848n930l0L079J000n643j0475K852J872k085M635O11Q405
8124E2155J190m045r141l494L798L800p88p241P733k494j3232p583N972K592m608
8109B4614r57N197R930J231K968O763K704J039j1032N749q23j788j831O837Q469
8094E9070q791o128o154Q702J6335O180p792j8811j4715j4361O67O963k122j547
8080A7496j140J781k621O72j194j5M840M661M416J755J496J1508o156k76o737
8065C0486l851q00J7136j0222j2060J1106J7285J1980j2686k0213l760J5177Q880
8052D8458l613O033o663j8281L700J0087r613p986j92J2997k750r882K862N804
8038C0961K1727k819m831r053Q474p4r546Q18L627j1609j3197n369L0258J0339
$$ plain form
8139 48292 46735 52016 53864 47934 47904 50983 51983 46340 35865 38717 40589 38504 43139 43750 52155
8124 52155 53345 49300 40159 36665 40463 44263 43475 36234 43967 41473 28241 20658 26630 29222 24614
8109 24614 23657 28854 38784 40015 42983 49746 52450 53489 42457 48206 47383 45595 43764 50601 59070
8094 59070 50279 44151 37997 46699 63034 69214 61422 42611 27896 13535 14202 21165 19043 17496
8080 17496 16356 18137 15516 16188 14994 14979 19819 24480 28896 30651 32147 43655 37499 37223 30486
8065 30486 26635 25835 42971 32749 20689 31795 49080 61060 48374 28161 24401 39578 48458
8052 48458 44845 50878 44215 25934 29634 39721 30108 22122 21930 34927 32177 22295 25157 30961
8038 30961 52688 49869 45038 35985 44459 44385 34839 35657 39284 27675 14478 9109 39367 49706
8024D9706n70l912q941k0748r466O341J0264N365m946K689J089o849k972j47J5075
8009C1978L416k442r96L619j045l328J555j7072k354j1198M958P313K417J2173
7995B8994R7J2105M81p525l701q665k055k29o060j7282M644J7009L78O224J5579
7980C9994n783K809l433n967j882M591P75l327l465L144m805J2565m649p611q833
7965A4123m1J4147P372j1556j4924l625K013N310Q911J0427K481P60K330o929
7951C0799j7440N010J1691j089N797p73l864j178j623n748K311o168r734j281
7937F710L016r584J542j84j140O44K816J4492J0845j1049O490k152j793J0977
7923C1630k758j0090K684N942o607m386l376j0208L388J6105J2803j5q631L981
$$ plain form
8024 49706 49136 45224 36283 15535 6069 12410 22674 28039 23093 25782 26871 20022 17050 16903 31978
8009 31978 35394 32952 31956 35575 34530 31202 32757 15685 13331 2133 7091 14404 16821 28994
7995 28994 29091 41196 41677 34152 30451 21786 19731 19502 13442 -3840 804 17813 18191 24415 39994
7980 39994 34211 37020 33587 27620 25738 30329 31104 27777 24312 27456 22651 35216 30567 22956 14123
7965 14123 14082 28229 35601 24045 9121 5496 7509 12819 21730 32157 34638 35398 37728 30799
7951 30799 13359 18369 30060 28971 34768 33995 30131 28953 27330 21582 23893 17725 7991 6710
7937 6710 9726 142 1684 1500 360 1004 3820 18312 29157 18108 24598 22446 20653 31630
7923 31630 28872 18782 21466 27408 20801 16415 13039 2831 6219 22324 35127 35112 26481 30462
7909C0462l448n057n319l076R100n9O725P36Q60l720q275L382J184P044J3285
7894D3824k135j1639k00J0704j0828o334k85K045N557N076m862j2864k2447K291
7880b097J1900J3023J3823j0208L32l776n671J1189N795K153j896M640Q724j6925
7866C1006j2532p729J467L647R259j4398j3011J5318K299j0544r685p101M455
7853g549l712K523J7875J4054J0090m620k225j0419m310m377L696J158K313L566
7839A8063K294P610p477L859J0786m422j4713j1494q322M895q212n11M296J8184
7825A4836N984j922J4856k168j5968j9408Q503J1917k537m615r46R980j915j5542
7811A055O519J4773O54q202k477l755J89p382j4284J1542J1616J587J967r250
$$ plain form
7909 30462 27014 21957 16638 13562 22662 22603 29328 30064 30924 27204 18929 22311 23495 30539 43824
7894 43824 41689 30050 29850 40554 29726 23392 23107 25152 30709 35785 30923 18059 -4388 -2097
7880 -2097 9803 22826 36649 26441 26773 22997 17326 28515 34310 36463 34567 39207 47931 31006
7866 31006 18474 10745 12212 15859 25118 10720 -2291 13027 15326 4782 -4903 -12004 -7549
7853 -7549 -11261 -8738 9137 23191 33281 28661 26436 16017 11707 7330 11026 12184 14497 18063
7839 18063 20357 27967 20490 24349 35135 30713 16000 4506 -3816 1079 -7133 -7644 -3348 14836
7825 14836 20820 18898 33754 31586 15618 -3790 4713 16630 14093 9478 8532 18512 16597 1055
7811 1055 7574 22347 23001 14799 12322 8567 8756 1374 -12910 -1368 10248 11835 13802 4552
7797D552j191O658K2475K442k2366p630L811R742K45j2315j5981q878j1555J5277
7783a4714J1964l968K560k882Q969k356M43j750O371R581J2530L691l249o957
7769B0233j7299j6736J519J3219J1915l250k9128p052N710J9662J0385r523k655
7756c000m492j251L694J596j037N459J1429N924L187p176j3995N857m491o87O916
7741G933N957J0156K565J0883N916P816l630j7331j0206Q59j5971Q407k141p402
7727C811J1143P293k611o914j8380q456L971L796P596Q771j864o459p431L715
7713b019K755K616J405K260J172r560n658N281J3753P29j0317k365q424j3944
7699b2316J1308M062o761R400O261l275m737L346L08n403R71j7764j5932J2712
$$ plain form
7797 4552 3361 10019 32494 34936 12570 4940 8751 18493 18738 6423 -9558 -18436 -29991 -14714
7783 -14714 -2750 -6718 -4158 -7040 1929 -427 16 -1734 4637 14218 26748 30439 27190 20233
7769 20233 2934 -13802 -12283 936 12851 9601 -19527 -26579 -20869 -1207 9178 -345 -3000
7756 -3000 -7492 -8743 -5049 -3453 -4490 969 12398 18322 21509 14333 338 6195 1704 1017 7933
7741 7933 13890 24046 26611 37494 43410 51226 47596 30265 20059 20918 4947 13354 11213 3811
7727 3811 14954 22247 19636 12722 -5658 -14114 -10143 -6347 1249 10020 8156 1697 -5734 -2019
7713 -2019 736 3352 4757 7017 8189 -1371 -7029 -1748 12005 12734 2417 52 -8372 -22316
7699 -22316 -11008 -6946 -13707 -4307 1954 -1321 -6058 -2712 -2404 -7807 -6836 -24600 -40532 -27820
7685b7820J5036P449J0797j0956j4038q497n921J5611O616J1102J3593P349m525
7672A5796J425j3968k990Q835N023J0038r840j0970j654n224k493L170P667m009
7658H06L909j21P011J377O104j3243n434J9312K295q097p801Q809n960j2012M154
7643A109K49j8276Q781P660N519N763K19m177j07j2154k229J3306N684K661j628
7628A2380N905j1704k0817P545J1140L451j0633M613J298M300k799P529r395o826
7614d013n80L967P127l194j611k06P53P853P055P257N33K024j0381j9687J375
7599a728K890O014O296k012M612p647o479L681J0016R154J1652m110k0205j0588
7585A546o639o413Q83R292Q725J011L490K520l872q793l564m822j308R307J341
$$ plain form
7685 -27820 -12784 -5335 5462 -5494 -19532 -28029 -33950 -18339 -11723 -621 12972 20321 15796
7672 15796 17221 3253 263 9098 14121 24159 14319 3349 1695 -3529 -6022 -2852 4815 806
7658 806 4715 4594 11605 12982 19086 5843 409 19721 22016 13919 6118 14927 8967 -3045 1109
7643 1109 1358 -16918 -8137 -477 5042 10805 11024 6847 6740 -5414 -7643 5663 11347 14008 12380
7628 12380 18285 6581 -14236 -6691 4449 7900 -2733 1880 3178 7478 4679 12208 2813 -4013
7614 -4013 -4593 -626 6501 3307 1696 1490 2243 10096 17151 24408 24941 26965 16584 -3103 -1728
7599 -1728 1162 7176 13472 11460 16072 8425 1946 5627 15643 24797 36449 32339 12134 1546
7585 1546 -5093 -11506 -10623 -1331 7394 8405 11895 14415 10543 1750 -1814 -6636 -7944 1363 2704
7570B704o849J5826J807n831n5k896n111O643K752j8182N720j3082j759J2698
7556e615p59P377J485J344K753r825o910n216O56J1776J550Q730m821o154J1708
7541H079R891P800p807j365n855j5752M143N272o540j1201K251o165Q946J4911
7527F608K363q238K832j0053M221k494m360O246J506n701o398j745L457M216N522
7512b018J1279O120o339n245J267N231p63l663R362j2513q536O523l509J170J0892
7497I258J3097j407k545p04j259m256k269O054k026j0380L687o58k9090j7117
7483c9615J5090Q546K024J4890J2278J7713r630l2608j6873J9353J6408j9646
7471a2070o624J1890L563r92n267Q709p493L733J1913O303K188p367j6759R524
$$ plain form
7570 2704 -4145 11681 13488 7657 7602 4706 -405 6238 8990 -9192 -3472 -16554 -18313 -5615
7556 -5615 -6374 1003 2488 3832 6585 -3240 -10150 -15366 -14710 -2934 -1384 7346 2525 -3629 8079
7541 8079 17970 25770 17963 16598 10743 -5009 -866 4406 -2134 -13335 -11084 -17249 -8303 6608
7527 6608 8971 733 3565 -6488 -2267 -4761 -9121 -2875 -1369 -7070 -13468 -15213 -11756 -7540 -2018
7512 -2018 9261 15381 9042 3797 5064 10295 9532 5869 15231 2718 -5818 705 -2804 -1634 9258
7497 9258 22355 20948 18403 17699 16440 12184 9915 15969 13943 3563 7250 6592 -22498 -39615
7483 -39615 -24525 -15979 -13955 935 13213 30926 21296 -11312 -28185 -8832 7576 -12070
7471 -12070 -18694 -6804 -3241 -4233 -9500 -791 -8284 -4551 7362 13665 15853 8486 -8273 1251
7457A251J3204l695n329M02O146q12J439J4374K708k5042j3852K645M934l323
7443d950J0004J307o562q552N11R400J1034j209j4630M718Q271J0419O139p940
7429A7960r693K821k574p836j9198j204J3609L790j005j223K722N998m409j7925
7415a8167n57j2470M123J3408J2250n128J1043J0658m510j1715P356J7396j1947
7402A1740k1612O877O208o512m761J0156P41J0629J0279K444L410r022j0392r196
7388I89J92j1294m62J8725L721q743j0432n038K142L585Q143O252J0068q880o286
7373B682n804l61k592R623l274M093Q540j302J1040K876o244Q141o604Q35q736
7358A2913P42J041K1046j3478j3071O79N139O352M87j0475j4569K789K926J98
$$ plain form
7457 1251 14455 10760 5431 5833 11979 11167 12606 26980 29688 4646 -9206 -6561 -1627 -4950
7443 -4950 5054 6361 -201 -8753 -8242 1158 12192 10983 -3647 1071 9342 19761 25900 17960
7429 17960 8267 11088 8514 678 -18520 -19724 -6115 -2325 -3330 -4553 -1831 4167 -242 -18167
7415 -18167 -18724 -31194 -27071 -13663 -1413 -6541 4502 15160 10650 -1065 6291 23687 11740
7402 11740 -9872 -2995 3213 -3299 -8060 2096 2837 13466 23745 26189 29599 20577 10185 989
7388 989 1181 -10113 -10575 8150 11871 3128 -7304 -12342 -10200 -6615 1528 7780 17848 8968 2682
7373 2682 -3122 -3483 -6075 3548 274 4367 12907 11605 22645 25521 19277 27418 20814 21649 12913
7358 12913 13655 14696 35742 22264 9193 9872 15011 21363 21850 11375 -3194 -405 2521 2719
7344B719o433r161R42J2752N335Q473K476Q897j847L81j3705j3753n835j742J2731
7329B230n850n998P659k717N61p50J4056q991j9984L196J9919M863j107n720J442
7314B809L644M426J231n621P137O073q727R362N122M178o09j2604o961r593n876
7299f009N922n49P730q386q830q2K907N992n687P585P4l219Q111q494j1772k288
7283a6995N231N230J1739N59o908j4336P300J0543J72r747n053l954L771k68M970
7268g746j1760j120N322k336M528R630K3718R293j3959j7991Q736k460N96o668
7254b217n07j511r347o964K682N675J2957j1267Q43O080O135Q553O813l106K976
7239A7795o182j8236q508p636r620O974J3308L292p151J0981j595J2590j1785
$$ plain form
7344 2719 -3714 -12875 -11933 819 6154 14627 17103 26000 24153 24534 10829 -2924 -8759 -10501 2230
7329 2230 -3620 -9618 -1959 -4676 -4115 -4865 9191 200 -19784 -16588 3331 8194 7087 1367 2809
7314 2809 6453 10879 12110 6489 13626 19699 10972 20334 25456 29634 29025 16421 9460 -133 -6009
7299 -6009 -87 -636 7094 -1292 -10122 -10204 -7297 -1305 -6992 593 667 -2552 5559 -2935 -14707 -16995
7283 -16995 -11764 -6534 5205 5764 -1144 -15480 -8180 2363 2535 -7212 -12265 -16219 -12448 -12716 -7746
7268 -7746 -19506 -20626 -15304 -17640 -13112 -3482 20236 29529 15570 -2421 6315 3855 4451 -2217
7254 -2217 -2724 -4235 -13582 -20546 -17864 -12189 768 -10499 -9656 -3576 2559 11112 17925 14819 17795
7239 17795 11613 -6623 -15131 -22767 -32387 -25413 -12105 -8813 -15964 -4983 -6578 6012 -5773
7226e773p121J2554M669o206r297r072L657K0242J1982J741n474n655k963r831
7212f547J0866J418k205l862q34l022J539q29L246j292J663m827Q15j1550N750
7197i671p07R096K0953J254j4837r555p793k208K967M777M254j375j2165L722
7183a1288J1805Q339k305n710p058K838p122L706O256N013j759j769L424J349
7169E719J1551o608j7602r814k361l439Q011Q557R049k592n959m917k2940L004
7155c0341K2623J1001r780o300N885o485Q861M089N603r93o187o544J2737N671
7141I840N552o097k223o413R159m882M40N386l391j7746L31k087n260o156J124
7126b2423P906J3498K090r770m290n855J0098J223j0478L635R749j860p262l069
$$ plain form
7226 -5773 -12894 -340 4329 -1877 -11174 -20246 -16589 3653 15635 17376 11902 6247 3284 -6547
7212 -6547 4319 5737 3532 -330 -1164 -4186 -2647 -3476 -230 -1522 141 -4686 -3871 -15421 -9671
7197 -9671 -10378 -1282 19671 20925 6088 -3467 -11260 -13468 -10501 -5724 -1470 -2845 -15010 -11288
7183 -11288 517 8856 6551 841 -6217 -3379 -10501 -6795 -539 4474 2715 946 4370 5719
7169 5719 17270 10662 -6940 -16754 -19115 -22554 -14543 -5986 3063 471 -5488 -10405 -33345 -30341
7155 -30341 -7718 3283 -6497 -12797 -6912 -13397 -4536 -447 5156 4163 -2024 -8568 4169 9840
7141 9840 15392 9295 7072 659 9818 4936 5376 10762 7371 -10375 -10044 -12131 -17391 -23547 -22423
7126 -22423 -14517 -1019 1071 -8699 -12989 -18844 -8746 -7523 -18001 -14366 -4617 -6477 -13739 -16808
7112a6808P792M820L445J0525K444L764n739r810j5134N361J3634o735n516R095
7098A138p7j1115J499m626o724L056P952p160k1927N966K417J6160J7414p790
7084c817j1717J802l633J2202L527j227j1540j1779o286j71n404J3146J767j0426
7070c3556J158k409K4436J7741k762l489j753K304j177o204P003j4069r302N933
7056a6146k178l688J1569N224K928p609j1523J2262J3807J6458o105q468J2365
7043A8896J1528J140j4234j0824j4338M136R769J345m983p376J997j0875j3261
7030b7080R244J0233r557k987J900J775R533q74p642K318m468Q021J6107j986
7016D537L299m140j7278l977k090N319O248M506p717n747P367J1007J0024m192
$$ plain form
7112 -16808 -9016 -4196 -751 9774 12218 15982 10243 433 -14701 -9340 4294 -2441 -7957 1138
7098 1138 1061 -10054 -8555 -13181 -19905 -16849 -8897 -16057 -37984 -32018 -29601 -13441 3973 -3817
7084 -3817 -15534 -13732 -17365 -5163 -1636 -2863 -14403 -26182 -32468 -32639 -38043 -24897 -23130 -33556
7070 -33556 -32398 -34807 -10371 7370 4608 1119 -634 1670 493 -5711 1292 -12777 -22079 -16146
7056 -16146 -18324 -22012 -10443 -5219 -2291 -9900 -21423 -9161 4646 21104 14999 6531 18896
7043 18896 30424 31564 17330 6506 -7832 -3696 6073 7418 2435 -4941 -2944 -13819 -27080
7030 -27080 -17836 -7603 -17160 -20147 -18247 -16472 -6939 -7813 -15455 -13137 -17605 -9584 6523 4537
7016 4537 7836 3696 -13582 -17559 -19649 -14330 -8082 -3576 -11293 -17040 -9673 1334 11358 7166
7002G166k7692j0704J4386J6594l781j9471j0182O994J2229K773K104j4232M063
6989a9753J1175M179j1206m66l45P497J7300K516k469k66J862j5536j898pP038
6974c79M335l383N533O102l98j276j2170J3625L441j944j0606m428q370k233J3688
6959A537N873q208N313R00k6L927j559l582Q87n115j7307J2933J1263L468q878
6944A426p108J3380O764p504n290j4741J5888j20q532J308L381L327o809P179
6930B549R522o953Q14j057j024l186o8J111R366j805j639K0826m149p717j3704
6915B886m214n92J954m220l07K1491R894l318j2243o704P742Q688o071j1110j1824
6900g948k407O350l377N403o704O235R43p376j144R14k785p916K586K4503Q218
$$ plain form
7002 7166 -20526 -31230 -16844 -250 -4031 -23502 -33684 -26690 -14461 -11688 -9584 -23816 -19753
6989 -19753 -8578 -4399 -15605 -16071 -16416 -8919 8381 10897 8428 8162 10024 -5512 -7410 -7417 -379
6974 -379 3956 573 6106 12208 11810 10534 -1636 11989 15430 13486 2880 -1548 -9918 -12151 1537
6959 1537 7410 -798 4515 5415 5389 9316 7757 4175 5062 -53 -17360 -4427 6836 10304 1426
6944 1426 -5682 7698 14462 6958 1668 -13073 2815 2695 -5837 -4529 -1148 2179 -4630 2549
6930 2549 12071 5118 5932 4875 3851 665 597 1708 11074 9269 7630 28456 24307 16590 2886
6915 2886 -1328 -1920 34 -4186 -4493 16998 26892 23574 11331 4627 12369 21057 14986 3876 -7948
6900 -7948 -10355 -4005 -7382 -1979 -8683 -2448 -1505 -8881 -10025 -9111 -11896 -19812 -17226 7277 15495
6885A5495j0438n001P736Q279r443j9014j1280l144p711l040R813M397J2709J0364
6871b78K837m238n800j2268k320P566J179j011J2760K061k540J893q165m263j169
6856a3756J9538l166j1636j0019j763R276j757r291m773N147P315r72p611M264
6842a9204J1631M83j5224j3060O956J0641K302q619N874R125J1399J2916O040
6829B1260m796j2519J1398j158q033P163K034N35K21k122q968j0360p425J547
6815a1223K842J5027l870q015P752j640j5981J05P083K69M521q584J210j1627
6801b2131o989L509m201n825J1870O019J2615N390n144J848O703J9382P920l278
6787B7688j5599q497o576p136j0440J4038J6274M508n711L517n910j7997P16N502
$$ plain form
6885 15495 5057 56 7792 16071 6628 -12386 -23666 -26810 -34521 -37561 -27748 -23351 -10642 -278
6871 -278 2559 -1679 -7479 -19747 -22067 -14501 -13322 -14333 -1573 488 -2052 -159 -8324 -12587 -13756
6856 -13756 5782 2616 -9020 -19039 -20802 -11526 -13283 -22574 -27347 -22200 -14885 -15857 -23468 -19204
6842 -19204 -7573 -7090 -22314 -35374 -28418 -17777 -15475 -24094 -18220 -9095 2304 15220 21260
6829 21260 16464 3945 15343 14185 6152 13315 15349 15884 16105 13983 5015 -5345 -12770 -11223
6815 -11223 -8381 6646 2776 -5239 2513 873 -15108 -15003 -7920 -7651 -3130 -11714 -10504 -22131
6801 -22131 -29120 -25611 -29812 -35637 -23767 -17748 -5133 257 -4887 -3039 3664 23046 30966 27688
6787 27688 12089 3592 -2984 -10120 -20560 -6522 9752 14260 8549 12066 6156 -11841 -11125 -5623
6773e623L30N571P768J67K270k020j5642l691R458q44R15P4r653J0462J559r558
6757h457l471l540Q795J9519l954M529N775j6860k221M412p477N284M822l714
6743C442n785m950j3024n708K4293Q261P112j186j4078n647M023k499K368N152
6729A774n39O513j0049Q06M935Q195N385J663r495M594r760j1942q475R822N36
6714f037k0577j074J6022N948L836j575R57L608p680j0638j1388q090J9477J9065
6700A854R122k352r169P239Q772L886j292m505l819K855o951j018n980O568R564
6685A4774k915j0034r562n301q548P457Q480N634m785n328O68L506j1196o127
6671b3277L165N948J403k861N360j424j347m241p921N514J5030N850Q193j382
$$ plain form
6773 -5623 -5293 278 8046 8213 10483 8463 -7179 -10870 -1412 -2256 -1341 -1267 -10920 -458 1101 -8457
6757 -8457 -11928 -15468 -6673 12846 8892 13421 19196 2336 115 4527 -2950 2334 7156 3442
6743 3442 -2343 -7293 -20317 -26025 -1732 6529 13641 12455 -1623 -7270 -3247 -5746 -3378 1774
6729 1774 1235 7748 -2301 -1495 3440 11635 17020 18683 9188 13782 4022 -7920 -16395 -6573 -6037
6714 -6037 -26614 -27688 -11666 -5718 -1882 -3457 -2500 1108 -6572 -17210 -28598 -36688 -17211 1854
6700 1854 10976 8624 -545 6694 15466 19352 18060 13555 9736 12591 5640 4622 -1358 5210 14774
6685 14774 11859 1825 -7737 -13038 -21586 -14129 -5649 -15 -4800 -10128 -9460 -5954 -17150 -23277
6671 -23277 -20112 -14164 -12761 -15622 -10262 -11686 -13033 -17274 -25195 -19681 -4651 1199 9392 8010
6657H010l987k629Q609K285r568r906J327J6781m776j7649K818l398r843k438
6643b4364O267P928J064n616K0111j3945n262Q589o779k004J0706N623k246j1494
6629a1422m744o65J1503k181k6160Q818J8213K6702N893k1484j8497j0846O826
6616a8044J1557n593p585J0954J4054J139r255n69J4625K901l78j8792j4726Q681
6602a1031J1546J518L220J923j0635j420K0053L639r763l509j0207M968P163j2746
6588e281k860P942J3673j1561k2009k1068O619J5362J7344P02o645R466R466j837
6574I313l619j2846j1656K643M109j1589N217P958J4224M030k973o573n649k204
6560i615O622j952k385J4096k628p406n87K087k889n449j90r05J920j626j0180
$$ plain form
6657 8010 4023 1394 10003 12288 2720 -7186 -5859 10922 6146 -11503 -8685 -12083 -21926 -24364
6643 -24364 -18097 -10169 -9105 -14721 5390 -8555 -13817 -5228 -12007 -14011 -3305 2318 72 -11422
6629 -11422 -16166 -16831 -5328 -7509 -33669 -24851 -6638 20064 25957 4473 -14024 -24870 -18044
6616 -18044 -6487 -12080 -19665 -8711 5343 6482 -2773 -3342 11283 14184 13806 -4986 -19712 -11031
6602 -11031 515 2033 5253 7176 -3459 -4879 15174 18813 9050 5541 -4666 302 7465 -5281
6588 -5281 -8141 -199 13474 1913 -20096 -41164 -34545 -19183 -1839 -1137 -7782 1684 11150 9313
6574 9313 5694 -7152 -18808 -16165 -12056 -23645 -18428 -10470 3754 7784 4811 -1762 -7411 -9615
6560 -9615 -2993 -4945 -7330 6766 4138 -3268 -3855 -1768 -4657 -10106 -10296 -11201 -9281 -10907 -21087
6545b1087R033L406k54M318j8488q854N082K590J1307J1209J1621J2300J1706
6532C3889p471k4425n502L59M1M308K651j3260j18N720N898n063j310M275p37
6517g45j0466o505l450n695J778J0058M607o389J512N734J87J726j1570k27J5459
6502c986J1896J645l504J308O868m270j3693P564l911L632K976M424J220j28J639
6487A3680l291m777j393q961j0618R11J5689n266n135j533M830J1289L78j9001
6473a3198m456m204R545J3886P929K234j5239j1329P901P805J6487Q767k725p69
6459B2634k337k158j49J3338N192m687J144j1068j0652n512j7374o032N242M219
6445h200J9238Q382r724j2156j0001m610p682K351J2037N168l229J8883K3341
$$ plain form
6545 -21087 -12054 -8648 -8902 -4584 -23072 -31926 -26844 -24254 -12947 -1738 9883 22183 33889
6532 33889 26418 1993 -3509 -3150 -3109 1199 3850 -9410 -9528 -3808 2090 -2973 -4283 -8 -745
6517 -745 -11211 -17716 -21166 -26861 -25083 -15025 -10418 -16807 -15295 -9561 -9374 -7648 -19218 -19445 -3986
6502 -3986 7910 9555 6051 7359 14227 9957 -3736 3828 -83 3549 6525 10949 12169 12041 13680
6487 13680 10389 5612 4219 -4742 -15360 -14449 1240 -4026 -9161 -10694 -5864 5425 5803 -13198
6473 -13198 -17654 -21858 -12313 1573 9502 11736 -3503 -14832 -6931 874 17361 26128 23403 22634
6459 22634 20297 18139 17990 31328 36520 31833 32977 21909 11257 5745 -11629 -17661 -12419 -8200
6445 -8200 11038 19420 9696 -2460 -12461 -17071 -24753 -22402 -10365 -5197 -8426 10457 33798
6432C3798o065j7800p94J5865q215l455Q506K280N094N316K515m668j0015r206
6418A3156j3486k35p657J1k0596k673O592J1208L210j801J2281Q262j635L626
6404A0263J76J3188j004j3396j5755k791J1613P885m244m6o914l857p38J0788
6390E168J499o710M747N085k975n745j1943j7172J436K735J2628Q475j3037j0468
6376b6277N006P380N112P68p060r492O920J5064J2822q05j0765j2567j664K579
6362a2979N605j011P570L764q147o259m954K928o28Q523Q932O177o168j2165k258
6347a1070M207Q261k309O452K534J0373j5967k3494L285Q686L883P491j0638j0778
6333a9084J0152J301O581J6098L166p232n012m925K11k71j35J5984l80P660k308
$$ plain form
6432 33798 27733 9933 9139 25004 16789 13334 21840 24120 29214 34530 37045 32377 22362 13156
6418 13156 -330 -565 -8222 -8211 -28807 -31480 -24888 -13680 -10470 -12271 10 8272 6637 10263
6404 10263 10439 23627 22623 9227 -6528 -9319 2294 10179 5935 5889 -1025 -4882 -5620 5168
6390 5168 6667 -43 4704 9789 6814 1069 -10874 -28046 -26610 -23875 -11247 -2772 -15809 -26277
6376 -26277 -21271 -13891 -8779 -8011 -15071 -24563 -17643 -2579 10243 9438 -1327 -13894 -15558 -12979
6362 -12979 -7374 -8385 -815 2949 -5198 -11457 -16411 -13483 -14111 -5588 3344 9521 3353 -8812 -11070
6347 -11070 -6863 1398 -911 5541 8075 18448 2481 -21013 -17728 -9042 -5159 2332 -8306 -19084
6333 -19084 -8932 -7631 -1050 15048 18214 10982 5970 1045 1256 985 850 16834 16454 24114 21806
6318B1806j405q005j8333j0631J470l462P390p802l108M464J2457L485m249k014
6304g937L718M516m457n242J026p420m932K039R771Q581M893l630J6587R723n369
6289B1867q540o385j0067q04k980R39P027P317J5880m169j1353q995o176N747
6275f92p81j559J713n202q228n011Q116l169J3628J4554j4674j0268L109J1521
6261C057N790o488j6917J171J3065N989j1114l375j810m520L360J2254j45k861
6247b544o438q325l518J4763L808n564Q2k1073p049q6J6680J6934J5339K033j0117
6232D925m399l173N845k522k699j263j0688J302J263L00R154j117o005N406q64
6217d535L876K93J066Q707K520n305l600L302k21m459l572M398j615j213L291
$$ plain form
6318 21806 20401 12396 -5937 -16568 -15098 -18560 -11170 -18972 -22080 -17616 -5159 -1674 -5923 -7937
6304 -7937 -4219 297 -4160 -9402 -8376 -15796 -20728 -18689 -8918 -337 4556 926 17513 27236 21867
6289 21867 13327 6942 -3125 -3929 -6909 -5970 1057 8374 24254 20085 8732 -263 -6439 -692
6275 -692 -1473 -3032 -1319 -6521 -14749 -19760 -11644 -14813 -1185 13369 -1305 -11573 -8464 3057
6261 3057 8847 2359 -14558 -13387 -322 5667 -5447 -8822 -10632 -15152 -11792 462 317 -2544
6247 -2544 -8982 -17307 -20825 -6062 -2254 -7818 -7736 -28809 -35858 -35944 -19264 -2330 13009 15042 4925
6232 4925 526 -2647 3198 676 -2023 -3286 -13974 -12672 -11409 -11109 -1955 -3072 -9077 -3671 -4535
6217 -4535 -659 -366 700 9407 11927 6622 3022 6324 6103 1644 -1928 2470 855 -358 2933
6202B933j596q182l522n939l617J2446l160L224j2376L482M904O259R167k352
6188A671L126J710P025J418j8069j3119J89m605K346j697l842L272m868J1506
6174a3937J5991p96j012M280K865Q560k43J4263k745k0637n863j007K909K345
6160D973L387M32M968p381o240j4599J405k764J10L317r664K990M018P219J411
6145f418O486j3842p082J55j246M375Q844J3241L01l721j5170O777J2514O340
6131A1554j197k4191m462J0664M063J502l047j3526L358r30L109P859O570n003
6117c677j4008P626J5526Q649j1515q740N782L314L557l43j3546j0415K294P417
6103h079N066n841q148J320J4414P694m148r560j5995l320P27n751L534J0964
$$ plain form
6202 2933 1337 -6845 -10367 -16306 -19923 -7477 -10637 -7413 -19789 -16307 -11403 -5144 4023 1671
6188 1671 4797 6507 13532 14950 -3119 -16238 -16049 -20654 -18308 -20005 -23847 -20575 -25443 -13937
6174 -13937 2054 1258 246 4526 7391 15951 15708 29971 27226 6589 726 -281 2628 4973
6160 4973 8360 8792 13760 6379 139 -14460 -13055 -15819 -15709 -12392 -22056 -19066 -15048 -7829 -6418
6145 -6418 68 -13774 -20856 -20701 -21947 -17572 -8728 4513 4814 1093 -14077 -7300 5214 11554
6131 11554 10357 -13834 -18296 -7632 -3569 -2067 -5114 -18640 -15282 -16212 -13103 -5244 1326 -3677
6117 -3677 -17685 -10059 5467 14116 2601 -6139 -357 2957 6514 6171 -7375 -17790 -15496 -8079
6103 -8079 -3013 -8854 -17002 -15682 -1268 6426 2278 -7282 -23277 -26597 -25870 -31621 -28087 -17123
6089a7123J1682Q30M887O93P04q777m553R215M430M424j4226K650P986l809P5
6074i12K067K1080r47q848j100R88o016j2233P099P576m820j032K180p412q212
6059a0542n422M552o29J198J27j2210n10O662r024L800l274K272P503L237q974
6044b1234k502J933Q045n389j900o345R286N008R741j756m262Q419K036j599j1163
6029a1682m931m93J0346O553n434j077n54N983O47j2875L110n404J1669m943j0046
6014a9131J0049K900K094O207J1096p777j1627P758P357Q906j0920j2658m354
6001a0100O417k042L748J3746J4457P352q102j3060j0055J245n019M997J4585
5988A8169J0245r285j6108j2461j2293P455K3450q868o915J144L380P140Q203
$$ plain form
6089 -17123 -5441 -4611 276 969 1673 -7104 -11657 -2442 1988 6412 -7814 -5164 2822 -987 -912
6074 -912 1155 22235 21288 12440 11340 12328 6312 -5921 1178 8754 3934 2902 5082 -2330 -10542
6059 -10542 -15964 -11412 -12041 -10843 -10716 -22926 -23436 -16774 -25798 -21998 -25272 -23000 -15497 -12260 -21234
6044 -21234 -23736 -21803 -13758 -19147 -21047 -27392 -18106 -13098 -3357 -5113 -9375 -956 1080 -519 -11682
6029 -11682 -16613 -17106 -6760 -207 -5641 -6718 -7272 -1289 -642 -13517 -10407 -15811 -4142 -9085 -19131
6014 -19131 -9082 -6182 -4088 2119 13215 5438 -6189 1569 8926 17832 6912 -5746 -10100
6001 -10100 -3683 -5725 -1977 11769 26226 33578 25476 12416 2361 3606 -1413 3584 18169
5988 18169 28414 19129 3021 -9440 -21733 -14278 9172 304 -6611 -5467 -2087 5053 13256
5975A3256J996j502j4973j765J2831J1738j4503j2413n024k665P851N528o520
5962f165j2954J1891Q317l762k696J1158J4952q044r444J0080j216j0012o019
5949c914j119j1257Q175Q550n278M092P567o461m192J0131J522j767j2387j6094
5935b2432q66o695j7890P566N471J0143q92m660J491K845O155P048N393m50j2577
5920b0350R48J4170P045k323O07L363K291o316k655m1J0767r837m822P157R270
5905I274K895q906o583j7491n66J2577J710L901J1164N882l935J091J1271l744
5891A8540Q73j3296o391O727M915k2195j9242J1881J0912j465q271j1293K173
5878b6132J5260K2966P145o799p66k272r09q309l351J119P922L245r828j8728
$$ plain form
5975 13256 15252 13750 -1223 -2988 9843 21581 7078 -5335 -10359 -13024 -5173 355 -6165
5962 -6165 -19119 -7228 1089 -2673 -5369 5789 20741 12697 3253 13333 12117 2105 -3914
5949 -3914 -5033 -16290 -8115 435 -4843 -751 6816 355 -3837 6294 7816 6049 -6338 -22432
5935 -22432 -23298 -29993 -47883 -40317 -34846 -24703 -25595 -30255 -28764 -25919 -19764 -12716 -7323 -7773 -20350
5920 -20350 -19402 -5232 1813 -510 97 3460 5751 -565 -3220 -3261 7506 -2331 -7153 4 9274
5905 9274 12169 3263 -3320 -20811 -21377 -8800 -7090 -3189 7975 13857 9922 11013 22284 18540
5891 18540 19413 6117 -274 6453 11368 -10827 -30069 -18188 -7276 -8741 -17012 -28305 -26132
5878 -26132 -10872 12094 19239 12440 11674 9402 8493 184 -3167 -2048 5874 9119 -709 -19437
5864a9437L763J0148k613P151j628P732k382P34J795J494r009p599l327j375N555
5849h998L89N156Q365J1731n396J923O763q903n621p813J1455J0033P862K416
5835B9362k219j1364j9222m089J4978M307o675j2906l159N546k507J764K573p056
5821a0667kP662j518o422J039o150L977l325J017O896j1818m894k487J1921P703
5806g068R546m87j4058r474m545J2399J7924M804n595o948M786N035P73O89j0740
5791b959j3007l913O780q450O525O059l12j6281oJ7190M990k772J5488j2167j2846
5776a5681J705J7644J8797J419q724N66p168j7047k0004J3783J3509r702o057
5763a6960M934Q723n947J960R037q611J8416O238j2516j7983j1610L15n057j3797
$$ plain form
5864 -19437 -15674 -5526 -8139 -988 -2616 5116 2734 3468 5263 6757 -2252 -9851 -13178 -14553 -8998
5849 -8998 -8609 -3453 4912 16643 11247 13170 19933 11030 5409 -2404 9051 19084 26946 29362
5835 29362 27143 15779 -3443 -7532 7446 11753 5078 -7828 -10987 -5441 -7948 -6184 -3611 -10667
5821 -10667 -10669 -3007 -4525 -10947 -9908 -16058 -12081 -15406 -14389 -7493 -19311 -24205 -26692 -14771 -7068
5806 -7068 2478 1991 -12067 -21541 -26086 -13687 4237 9041 3446 -3502 1284 6319 7092 7781 -2959
5791 -2959 -15966 -19879 -13099 -21549 -15024 -8965 -9277 -25558 -25564 -8374 -3384 -6156 9332 -2835 -15681
5776 -15681 -13976 3668 22465 23884 15160 15726 8558 -8489 -28493 -14710 -1201 -10903 -16960
5763 -16960 -12026 -3303 -9250 -7290 1747 -6864 11552 17790 5274 -12709 -24319 -24004 -29061 -42858
5749d2858J4361J1411L302m721n309l55K456R889L819r737K203N833p537M313
5735a2930j0j5365k814K1191O261o234n416n644P085M473m083O627J2803l659
5721B285k359o812M470Q024p499j8199J1304J0646j1856n335Q457M391q304j6006
5707b6793P079K406j2703P067J4955R142j1084n219l723O563P899K392k7258M359
5693b4918J1394m794k222n351K0654R220q484o224N109n844J261M673N6q466p765
5678b1701P135N077J191j747k704J122J1947l887Q434j1990r11K1169m01l66k781
5663I587j76J5516o322q349m605n140J251L720j0519n857j6949p578K0029J2577
5649b815L084J189O807j0627n921J3895L362p970M80K525j854j2805r854K068
$$ plain form
5749 -42858 -28497 -17086 -13784 -18505 -23814 -24169 -21713 -11824 -8005 -17742 -15539 -9706 -17243 -12930
5735 -12930 -12940 -28305 -31119 -9928 -3667 -9901 -15317 -20961 -13876 -9403 -13486 -6859 5944 2285
5721 2285 -74 -6886 -2416 5608 -1891 -20090 -8786 1860 -9996 -15331 -6874 -2483 -10787 -26793
5707 -26793 -19714 -17308 -30011 -22944 -7989 1153 -9931 -15150 -18873 -12310 -4411 -2019 -29277 -24918
5693 -24918 -13524 -18318 -20540 -25891 -5237 3983 -4501 -10725 -5616 -11460 -10199 -5526 -5470 -13936 -21701
5678 -21701 -14566 -9489 -8298 -10045 -12749 -11627 320 -3567 4867 -7123 -8034 13135 12734 12368 9587
5663 9587 9411 24927 18605 10256 5651 511 1762 5482 -5037 -10894 -27843 -35421 -15392 -2815
5649 -2815 269 1458 8265 -2362 -8283 5612 8974 1004 1484 4009 2155 -10650 -20504 -18436
5635a8436M476q425j832J1123N406n673M697J1055Q81j4010j8973J7567Q77l712
5621a4979L260Q124N078J4115M33n470J991j1701J029M595o824J224R7J1115J0703
5606B2790n435n058j8598j3340K013Q669O257J6225q976n814J0007p023n953k62
5592d498j338m343p866o875n762J5273J7523o326j3674J608L246k573q249j169
5578b5023M842N188O055K646L758o80M228K262l990r5k617M336L680o728K541
5563D03r001O53O36j3321J0231R185o15r614L110M59p954o208R181L562L478P561
5547A746K985q305j4543J5530j272q096J1340N818r515n009J6043J948q56n814
5533B000j933P154j0048j6781k665P20m92l330M434J0184P902k437p766o375J1739
$$ plain form
5635 -18436 -13960 -22385 -24217 -13094 -7688 -13361 -8664 2391 3272 -10738 -29711 -12144 -11267 -14979
5621 -14979 -11719 -3595 1483 15598 16031 10561 12552 851 1880 6475 -349 875 972 12087 22790
5606 22790 17355 12297 -6301 -19641 -17628 -8959 -2702 13523 4547 -1267 8740 1717 -4236 -4498
5592 -4498 -5836 -10179 -18045 -24920 -30682 -15409 2114 -4212 -17886 -16278 -13032 -15605 -23854 -25023
5578 -25023 -20181 -14993 -8938 -6292 -2534 -3214 1014 3276 -714 -809 -3426 910 4590 -2138 403
5563 403 -8598 -7945 -7309 -20630 -10399 -1214 -1829 -11443 -8333 -7874 -15828 -22036 -12855 -9293 -5815 1746
5547 1746 4731 -3574 -18117 -2587 -3859 -11955 -615 5203 -4312 -9321 6722 8670 7814 2000
5533 2000 67 7221 -2827 -19608 -22273 -21553 -22045 -25375 -20941 -10757 -2855 -5292 -13058 -19433 -7694
5518g694M319J4994L858P561M586m115n649m140k1749l936J5949K09j0286J3104
5504G011l233j4887j1174j4543L335%Q938K1246j824q222N362J887k743M363J5479
5489A0995K386o137r778n211l750j3765J3140J5466O82K523j082j9653j5620O388
5475b3416K1194K0724o1k0182j1822J0905R057n150M874j4840Q950N548K846o272
5461B355j619j3799p034J3506K606k309l14R213J0867N425j4739j6019j163j074
5447a4098J43K512k412J926k104p43J2436K061J825l560o403N765k147P77M250
5432B28j3969j687P050j2175m957j407M870O649K451J1149o122Q965M455q549
5418c049N348L719p982L961j5096j2496k009J798q359K789j763J2688J4971O605
$$ plain form
5518 -7694 -3375 11619 15477 23038 27624 23509 17860 13720 -8029 -11965 3984 4193 -6093 7011
5504 7011 3778 -11109 -22283 -36826 -33491 -33491 -24553 -3307 -5131 -13353 -7991 -6104 -8847 -4484 10995
5489 10995 13381 7244 -2534 -7745 -11495 -25260 -12120 3346 4028 6551 5469 -14184 -29804 -23416
5475 -23416 -2222 18502 18441 -1741 -13563 -2658 6399 1249 6123 -8717 233 5781 8627 2355
5461 2355 736 -13063 -20097 -6591 -3985 -6294 -6608 2605 13472 18897 4158 -11861 -13024 -14098
5447 -14098 -13955 -11443 -13855 -11929 -14033 -14776 -2340 -279 1546 -2014 -8417 -2652 -4799 -4022 228
5432 228 -13741 -15428 -8378 -20553 -25510 -26917 -22047 -15398 -12947 -1798 -7920 1045 5500 -3049
5418 -3049 2299 6018 -1964 1997 -13099 -25595 -27604 -25806 -34165 -31376 -33139 -20451 -5480 1125
5404A125o645j0265J5311o461m736J0822K0501L943Q078J481r948o465J8030J2422
5390D7193m893r496n298l021M8j6965j2919K027R774R830p707j5997j676J3036
5376C936K1542M639j376q931J901m115r772q193m496j4424j817L181j214O922
5362a2217P174m511j0074K561K542L746j1280O332j2242p840K1281n50o75M714
5348a1039J972Q779p048k031j1434J2560J3488n193o783J6677m953L674M151m970
5334G850j7908j1267q796k331J1449R165l93j173o626n348N411J0427k128o664
5320a8332J1785J6169j1358q250M776J0681O602M644k200j6559q379p0N460O256
5306A225J1516L358j8066j2696j0880N063Q686J1443R651Q111O560q920k1531
$$ plain form
5404 1125 -5520 -15785 -474 -6935 -11671 -849 19652 23595 31673 33154 23206 16741 34771 47193
5390 47193 42300 32804 27506 24485 24533 7568 -5351 -3324 6450 16280 8573 -7424 -9100 3936
5376 3936 25478 30117 28741 19810 21711 17596 7824 -369 -4865 -19289 -21106 -17925 -19139 -12217
5362 -12217 -5043 -9554 -19628 -17067 -14525 -10779 -22059 -15727 -27969 -35809 -14528 -15078 -15753 -11039
5348 -11039 -9067 -288 -7336 -9367 -20801 -8241 5247 54 -6729 9948 4995 8669 12820 7850
5334 7850 -10058 -21325 -30121 -32452 -21003 -11838 -12231 -13404 -20030 -25378 -19967 -9540 -11668 -18332
5320 -18332 -6547 9622 -1736 -9986 -5210 5471 12073 16717 14517 -2042 -10421 -10491 -5031 1225
5306 1225 12741 16099 -1967 -14663 -25543 -20480 -11794 -351 9300 17411 23971 15051 -6480
5293f480j1364J0126N110o348m025N937J0687n77j0875o085M725p923r795l948
5279c0835j550J1696J203j125J2656j0450n805L704O86L839P145J339k533l532
5265a3562L391M531M189k962j3464j0866P269k927J0874J1812n830P079J1441
5252A0975p894j1493m448L491l852o558N995L301m302q724m68R942R132M527o848
5237g224j1022N114J2923n076M537M839j4251m876k982N234J2883q515P47P2K536
5222e061p75K03j165J2877J0833j0888j36K453p996j7210K007k252m665M77K5603
5207D305P75j540J2819j9429j4079r066M993J7024J3751l741J0330J2265r376
5194A9031r660m833l42L485n3l465o266k114p634M32j42k664K440L719Q028k311
$$ plain form
5293 -6480 -17844 -7718 -2608 -8956 -12981 -7044 3643 3066 -7809 -13894 -9169 -17092 -26887 -30835
5279 -30835 -32385 -20689 -19486 -20611 -7955 -18405 -24210 -20506 -19820 -15981 -8836 -7497 -10030 -13562
5265 -13562 -10171 -5640 -1451 -4413 -17877 -28743 -21474 -24401 -13527 -1715 -7545 -466 10975
5252 10975 3081 -8412 -12860 -9369 -13221 -19779 -13784 -10483 -14785 -23509 -23977 -14035 -4903 -376 -7224
5237 -7224 -18246 -13132 -209 -5285 -748 4091 -10160 -15036 -18018 -12784 99 -8416 -7669 -7597 -5061
5222 -5061 -5836 -5633 -6798 6079 16912 6024 5888 8341 345 -16865 -14858 -17110 -21775 -21298 4305
5207 4305 5080 3540 16359 -3070 -17149 -26215 -21222 -4198 9553 5812 16142 28407 19031
5194 19031 9371 4538 4196 7681 7628 4163 -2103 -4217 -11851 -11419 -11561 -14225 -11785 -8066 -38 -2349
5178b349p209l157O858m014q982n227N92l34J3062q2m570K571L630Q333J4483
5163A3605K369r138n886M88p044l516j996M925o277k019R839R705K649J503j3759
5148d552r764J6808m901q158K915k2986r176O742O643j3743n471N264r511J0433
5134c9457J3144J0781m29J147K553k346r0L87M306j799r596P687J474O057R667
5119C486o109j1065J6827P984j6680k291N178l111L01M035n935L511K503N804
5105D438l826k655O965M779Q27j1718n523k658m916l979P212R122l909K748k947
5090f040M223M362J33j98n934n255q327K083K788J3315n091L187J789m626O928
5075C337L78J527r134r864J1910N24o587m91l809l780J9451L546J907J9273M592
$$ plain form
5178 -2349 -9558 -12715 -5857 -9871 -18853 -24080 -23488 -23822 -10760 -10842 -15412 -12841 -9211 -878 13605
5163 13605 15974 6836 950 1438 -5606 -9122 -11118 -6193 -12470 -14489 -4650 5055 7704 9207 -4552
5148 -4552 -14316 2492 -2409 -10567 -7652 -30638 -39814 -33072 -26429 -40172 -45643 -40379 -49890 -39457
5134 -39457 -26313 -15532 -15961 -14814 -12261 -14607 -14697 -14310 -10004 -11803 -21399 -13712 -12238 -6181 3486
5119 3486 -2623 -13688 3139 11123 -5557 -7848 -2670 -5781 -5480 -1445 -7380 -3869 -1366 4438
5105 4438 612 -2043 4922 9701 10528 -1190 -6713 -9371 -14287 -18266 -11054 -1932 -5841 -3093 -6040
5090 -6040 -1817 2545 2678 2480 -3454 -8709 -17036 -14953 -12165 1150 -3941 -754 1035 -3591 3337
5075 3337 3715 5242 -3892 -13756 -1846 -1322 -7909 -8400 -12209 -15989 3462 7008 8915 28188 32780
5060C2780j3277l182J668l242j4910k06R236r859j2853P530q97L422p317q310
5046a9417J571m36m662j3578N084R227Q467m03P921P768m233r537p84J3828k338
5031a522m484r592n596O265J3451J6394j0411j043n129n389K518K348J4595R289
5017B1694j6029k2160N391n010n117N233M530j3054r735n383K082N611o477N859
5003c2565J9150O308O016J0372R981q719n513K899m597q832P459J290J784o29
4989D404J134k169j007k0464r717j789O190J0911K629j0004K152M048K051r920
4975b1551q772J0911J3333L185o747Q743J017J2180J196k8607r608k755J1226
4962a6249Q213L446N098Q497m425Q191l810m554l831r947L94J683r804l349O235
$$ plain form
5060 32780 19503 16321 17989 14747 -163 -369 8867 -992 -13845 -6315 -7212 -3790 -11107 -19417
5046 -19417 -17846 -18282 -22944 -36522 -31438 -22211 -13744 -14147 -6226 1542 -2691 -12228 -13012 816 -1522
5031 -1522 -6006 -15598 -21194 -14929 -1478 14916 4505 3462 -1667 -7056 -4538 -2190 12405 21694
5017 21694 5665 -16495 -11104 -16114 -21231 -15998 -11468 -24522 -34257 -39640 -37558 -31947 -38424 -32565
5003 -32565 -13415 -7107 -1091 9281 19262 10543 5030 7929 3332 -5500 1959 3249 5033 4404
4989 4404 5538 3369 2362 -18102 -27819 -29608 -23418 -12507 -9878 -19882 -17730 -13682 -11631 -21551
4975 -21551 -30323 -19412 -6079 -2894 -9641 -898 119 12299 13495 -15112 -24720 -27475 -16249
4962 -16249 -8036 -4590 508 9005 4580 12771 8961 4407 576 -9371 -8977 -7294 -17098 -20447 -14212
4947a4212l272O80m67r779j984J0334O38n642J5304J696R316o82j4879k254k778
4932a7981p564N868J5884M46j1489L734J5567j348o28j0944q708J1479J1631O981
4918A2928k1686q018N25O963K0628j0995l909j625J77K593n408n929m284J3184
4904d856J8181O52j1303j2926K734m750m129J0450J1726J1742M477o003q597j2944
4890e546q37J19L078j6561l494K0138J1296q739L169n504o080L19J0636Q356j6066
4875e716P24J8490q84J0564R306j2241N669j240k622N055m787k7127j0234l472
4861a8515J964o399m598O770Q817J0839R274J860r757n132k576M72K471J2907
4847H397l608J9282P739j5642k2546o313M229N750j8000o21K1573N025L71k587
$$ plain form
4947 -14212 -17484 -16804 -17271 -27050 -29034 -18700 -18062 -23704 -8400 -6704 2612 1930 -12949 -15203 -17981
4932 -17981 -25545 -19677 -3793 -3347 -14836 -11102 4465 3117 2489 -8455 -17163 -5684 5947 12928
4918 12928 -8758 -16776 -16251 -9288 11340 345 -3564 -5189 -5012 -2419 -7827 -13756 -18040 -4856
4904 -4856 13325 13977 2674 -10252 -7518 -12268 -16397 -5947 5779 17521 21998 15995 7398 -5546
4890 -5546 -6383 -6264 -3186 -19747 -23241 -3103 8193 -546 2623 -2881 -8961 -8642 1994 10350 -5716
4875 -5716 -4992 13498 12614 23178 32484 20243 25912 24672 22050 27105 22318 -4809 -15043 -18515
4861 -18515 -16551 -22950 -27548 -20778 -11961 -1122 8152 10012 255 -4877 -7453 -6981 -4510 8397
4847 8397 4789 24071 31810 16168 -6378 -12691 -8462 -2712 -20712 -21333 240 5265 5636 3049
4833C049k816n233l928p634M721J7695Q781L16J424J644r177J625n22k323o27
4818F995n331L826J3946q660m377m159L789l302Q042J851j2677M765J4529q542
4804A0695K420L885r606j5303Q433L16m716m101p84k57j0912n053N225j644J2425
4789h977J3683K867p173j1309Q781J1288j1073j193N422J546o384J7336L145j797
4775A6162j1208q553r676L44K024j526J565K2909J2955j2650Q42j805p569N031
4761H845J366P673P341o698K800k041p434p548j674j2727o978r88M831O808N97
4746e827L50J540j3865n643J2351k25P204J855L173k839J32P374J821j4519m048
$$ plain form
4833 3049 233 -5000 -8928 -16562 -11841 5854 14635 14951 16375 18019 8842 10467 9945 7622 6995
4818 6995 1664 5490 19436 10776 6399 2240 6029 2727 10769 12620 -57 4708 19237 10695
4804 10695 13115 17000 7394 -7909 524 840 -3876 -7977 -8761 -9018 -19930 -24983 -19758 -21402 -8977
4789 -8977 4706 7573 400 -10909 -2128 9160 -1913 -3106 2316 3862 -2522 14814 17959 16162
4775 16162 4954 -3599 -13275 -12931 -10907 -12433 -10868 12041 24996 12346 13188 11383 3814 8845
4761 8845 10211 17884 25225 18527 21327 19286 11852 4304 2630 -10097 -17075 -18063 -13232 -6424 -5827
4746 -5827 -5477 -3937 -17802 -23445 -11094 -11319 -4115 -2260 913 -1926 -1794 5580 7401 -7118 -11166
$$ [...]
##END NTUPLES=NMR SPECTRUM
##END=
