##TITLE=Analysis number 327087
Compound Code cc 37116
Book Reference 508/54
Project Code adrs
Chemist Name antons
##JCAMPDX= 6.0         $$ Bruker NMR JCAMP-DX V2.0
##DATA TYPE= NMR SPECTRUM
##DATA CLASS= NTUPLES
##ORIGIN= Bruker BioSpin GmbH
##OWNER= nmr
$$ XWIN-NMR		Version 3.5
$$ Fri Mar  9 09:19:56 2007 GMT Standard Time (UT+0h)  MAYBRIDGE\nmr@NMR_250MHZ
##.OBSERVE FREQUENCY= 250.131544655141
##.OBSERVE NUCLEUS= ^1H
##.ACQUISITION MODE= SIMULTANEOUS (DQD)
##.ACQUISITION SCHEME= undefined
##.AVERAGES= 16
##.DIGITISER RES= 18
##SPECTROMETER/DATA SYSTEM= dpx250
##.PULSE SEQUENCE= zg30
##.SOLVENT NAME= CDCl3
##.SHIFT REFERENCE= (INTERNAL, CDCl3, 0, 16.522)
##AUDIT TRAIL= $$ (NUMBER, WHEN, WHO, WHERE, WHAT)
$$ ##TITLE= Audit trail, XWIN-NMR		Version 3.5
$$ ##JCAMPDX= 5.01
$$ ##ORIGIN= Bruker BioSpin GmbH
$$ ##OWNER= nmr
$$ C:\u/data/dgb/nmr/ADRS/600/pdata/1/auditp.txt
$$ ##AUDIT TRAIL=  $$ (NUMBER, WHEN, WHO, WHERE, WHAT)
(   1,<2007-03-09 09:19:35.62 +000>,<MAYBRIDGE\nmr>,<NMR_250MHZ>,
      <created by zg, POWCHK disabled, PULCHK disabled
       configuration hash MD5:
       49 4B E0 1D 92 C2 6B 37 9F E6 65 BC 52 41 86 1D
       data hash MD5: 64K
       A1 C9 04 DE 8C 8F F7 01 B9 49 92 D8 17 84 AC C3>)
(   2,<2007-03-09 09:19:46.78 +000>,<MAYBRIDGE\nmr>,<NMR_250MHZ>,
      <Start of raw data processing
       ef LB = 0.3 FT_mod = 6 PKNL = 1 SI = 32K 
       data hash MD5: 32K
       2D 70 22 46 C8 1B 6D 8C 40 46 21 05 D2 DB 31 C6>)
(   3,<2007-03-09 09:19:48.56 +000>,<MAYBRIDGE\nmr>,<NMR_250MHZ>,
      <apk 
       data hash MD5: 32K
       3C C4 02 76 94 7E 9C 6E 22 0B 78 41 D0 36 EB 8B>)
(   4,<2007-03-09 09:19:49.32 +000>,<MAYBRIDGE\nmr>,<NMR_250MHZ>,
      <abs ABSG = 5 
       data hash MD5: 32K
       D0 74 3C 21 5F 7E 20 E8 98 9E 90 67 E2 8F AA 65>)
$$ ##END=
$$ 
$$ hash MD5
$$ 71 28 B1 0C A1 9E 4E BB 4C 3F AE 1B 81 31 41 5F
##$RELAX= 
##$RELAX= 
##$RELAX= 
##$RELAX= 
##$RELAX= 
##$RELAX= 
##$RELAX= 
$$ Bruker specific parameters
$$ --------------------------
##$DU= <C:\u>
##$EXPNO= 600
##$NAME= <ADRS>
##$PROCNO= 1
##$TYPE= <nmr>
##$USER= <dgb>
##$AMP= (0..31)
100 100 100 100 100 100 100 100 100 100 100 100 100 100 100 100 100 100 
100 100 100 100 100 100 100 100 100 100 100 100 100 100 
##$AQSEQ= 0
##$AQ_mod= 3
##$AUNM= <au_zg>
##$AUTOPOS= <33 >
##$BF1= 250.13
##$BF2= 250.13
##$BF3= 250.13
##$BF4= 250.13
##$BF5= 500.13
##$BF6= 500.13
##$BF7= 500.13
##$BF8= 500.13
##$BYTORDA= 1
##$CFDGTYP= 0
##$CFRGTYP= 5
##$CHEMSTR= <none>
##$CNST= (0..31)
1 1 145 1 1 1 1 1 1 1 1 1 1 1 1 1 1 1 1 1 1 1 1 1 1 1 1 1 1 1 1 1 
##$CPDPRG= <>
##$CPDPRG1= <>
##$CPDPRG2= <>
##$CPDPRG3= <>
##$CPDPRG4= <mlev>
##$CPDPRG5= <mlev>
##$CPDPRG6= <mlev>
##$CPDPRG7= <mlev>
##$CPDPRG8= <mlev>
##$CPDPRGB= <>
##$CPDPRGT= <>
##$D= (0..31)
0 1 0 0 0 0 0 0 0 0.06 0 0 0 0 0 0 0.0002 0 0 0 0 0 0 0 0 0 0 0 0 0 0 
0 
##$DATE= 1173431974
##$DBL= (0..7)
120 120 120 120 120 120 120 120 
##$DBP= (0..7)
150 150 150 150 150 150 150 150 
##$DBP07= 0
##$DBPNAM0= <>
##$DBPNAM1= <>
$$ [...]
##$SUBNAM7= <"">
##$SUBNAM8= <"">
##$SUBNAM9= <"">
##$SW= 20.6930455092707
##$SWIBOX= (0..15)
0 0 3 0 0 0 0 0 0 0 0 0 0 0 0 0 
##$SW_h= 5175.983436853
##$TD= 65536
##$TD0= 1
##$TE= 683.16
##$TE2= 300
##$TE3= 300
##$TEG= 300
##$TL= (0..7)
0 120 120 120 120 120 120 120 
##$TP= (0..7)
150 150 150 150 150 150 150 150 
##$TP07= 0
##$TPNAME0= <>
##$TPNAME1= <>
##$TPNAME2= <>
##$TPNAME3= <>
##$TPNAME4= <>
##$TPNAME5= <>
##$TPNAME6= <>
##$TPNAME7= <>
##$TPOAL= (0..7)
0.5 0.5 0.5 0.5 0.5 0.5 0.5 0.5 
##$TPOFFS= (0..7)
0 0 0 0 0 0 0 0 
##$TUNHIN= 0
##$TUNHOUT= 0
##$TUNXOUT= 0
##$USERA1= <user>
##$USERA2= <user>
##$USERA3= <user>
##$USERA4= <user>
##$USERA5= <user>
##$V9= 5
##$VALIST= <valist>
##$VCLIST= <CCCCCCCCCCCCCCC>
##$VD= 0
##$VDLIST= <DDDDDDDDDDDDDDD>
##$VPLIST= <PPPPPPPPPPPPPPP>
##$VTLIST= <TTTTTTTTTTTTTTT>
##$WBST= 1024
##$WBSW= 4
##$XGAIN= (0..3)
0 0 0 0 
##$XL= 0
##$YL= 0
##$YMAX_a= 268114
##$YMIN_a= -296663
##$ZGOPTNS= <>
##$ZL1= 120
##$ZL2= 120
##$ZL3= 120
##$ZL4= 120
##$ABSF1= 16.522
##$ABSF2= -4.171173
##$ABSG= 5
##$ABSL= 3
##$ALPHA= 0
##$AQORDER= 0
##$ASSFAC= 0
##$ASSFACI= 0
##$ASSFACX= 0
##$ASSWID= 0
##$AUNMP= <proc_1d>
##$AZFE= 0.1
##$AZFW= 0.1
##$BCFW= 0
##$BC_mod= 0
##$BYTORDP= 0
##$COROFFS= 0
##$CY= 12.5
##$DATMOD= 1
##$DC= 0
##$DFILT= <>
##$DTYPP= 0
##$F1P= 14.0000005364418
##$F2P= -0.99999901652339
##$FCOR= 0.5
##$FTSIZE= 32768
##$FT_mod= 6
##$GAMMA= 0
##$GB= 0
##$INTBC= 1
##$INTSCL= 1
##$ISEN= 128
##$LB= 0.3
##$LEV0= 0
##$LPBIN= 0
##$MAXI= 10000
##$MC2= 0
##$MEAN= 0
##$ME_mod= 0
##$MI= 0
##$NCOEF= 0
##$NC_proc= -4
##$NLEV= 6
##$NOISF1= 0
##$NOISF2= 0
##$NSP= 0
##$NTH_PI= 0
##$NZP= 0
##$OFFSET= 16.522
##$PC= 1
##$PHC0= 234.0149
##$PHC1= 8.626459
##$PH_mod= 1
##$PKNL= yes
##$PPARMOD= 0
##$PSCAL= 4
##$PSIGN= 0
##$REVERSE= no
##$SF= 250.13
##$SI= 32768
##$SIGF1= 0
##$SIGF2= 0
##$SINO= 400
##$SIOLD= 32768
##$SREGLST= <1H.CDCl3>
##$SSB= 0
##$STSI= 32768
##$STSR= 0
##$SW_p= 5175.98343685301
##$SYMM= 0
##$S_DEV= 0
##$TDeff= 65536
##$TDoff= 0
##$TI= <Analysis number 999999
Compound Code 99
Book Reference 9
Project Code 9>
##$TILT= no
##$TM1= 0
##$TM2= 0
##$TOPLEV= 0
##$USERP1= <user>
##$USERP2= <user>
##$USERP3= <user>
##$USERP4= <user>
##$USERP5= <user>
##$WDW= 1
##$XDIM= 32768
##$YMAX_p= 475158495
##$YMIN_p= -316689
$$ End of Bruker specific parameters
$$ ---------------------------------
##NTUPLES= NMR SPECTRUM
##VAR_NAME=  FREQUENCY,     SPECTRUM/REAL,   SPECTRUM/IMAG
##SYMBOL=    X,             R,               I
##VAR_TYPE=  INDEPENDENT,   DEPENDENT,       DEPENDENT
##VAR_FORM=  AFFN,          ASDF,            ASDF
##VAR_DIM=   32768,         32768,           32768
##UNITS=     HZ,            ARBITRARY UNITS, ARBITRARY UNITS
##FACTOR=    0.157963299565203, 1,           1
##FIRST=     4132.6476996994, 0,             0
##LAST=      -1043.33573715361, 0,           0
##MIN=       -1043.33573715361, -316689,     0
##MAX=       4132.6476996994, 475158495,     0
$$ Real data points
##PAGE= N=1
##DATA TABLE= (X++(R..R)), XYDATA
$$ [...]
$$ plain form
16637 -39940 -81079 49979 77207 85652 67337 109548 170227 188090 31767 -30410 -16547
16626 -16547 -52434 -56106 29711 49370 18130 33676 41217 113706 94334 48927 29972 107718
16614 107718 163319 114995 36272 43884 77250 111501 86143 -10514 7390 52503 89962 114225
16602 114225 46882 3811 -51703 -107852 -63146 -98839 -39707 43412 97399 203529 219949
16591 219949 267552 349218 428955 459326 385459 311863 207152 149557 160924 197212 211968
16580 211968 291456 493406 557408 464850 369172 289069 198454 102871 80357 54148 -5845
16569 -5845 59725 143265 88095 67638 -25074 -57969 -7246 91943 85893 -17783 50875 146530
16557 146530 127204 171096 146020 70870 78011 97012 79327 99832 59018 81231 82883 66770
$$ packed form
16637c9940m1139J31058K7228Q445j8315M2211O0679J7863j56323o2177J3863
16626a6547l5887l672Q5817J9659l1240J5546P541P2489j9372m5407j8955P7746
16614A07718N5601m8324p8723P612L3366L4251k5358r6657J7904M5113L7459K4263
16602A14225o7343m3071n5514n6149M4706l5693N9132Q3119N3987J06130J6420
16591B19949M7603Q1666P9737L0371p3867p3596j04711n7595J1367L6288J4756
16580B11968P9488K01950O4002r2558r5678q0103r0615r5583k2514k6209n9993
16569e845O5570Q3540n5170k0457r2712l2895N0723R9189o050j03676O8658R5655
16557A46530j9326M3892k5076p5150P141J9001j7685K0505m0814K2213J652j6113
$$ plain form
16545 66770 28671 47962 69014 84105 78059 -20809 -35442 43438 123349 100124 15099 37689
16533 37689 98695 82603 -20043 -111977 -63455 -36624 -79381 -83136 -14905 -4425 -27616 -86541
16521 -86541 -113164 -144114 -91198 -24270 1678 -20254 -95798 -77181 -58714 -52934 -16389 45385
16509 45385 82587 66131 -9997 -34388 16234 -3992 -8050 -29292 -7687 -27683 26877 41420
16497 41420 43965 44167 99821 59913 -25456 49342 124371 46813 -814 -39468 -77737 -55846
16485 -55846 -12868 9193 3770 -10084 -45683 -12336 -24718 -73232 -71019 -84706 -73655 -139744
16473 -139744 -119503 -50623 -143456 -140042 -51238 -15066 11635 3596 -46512 -94691 -40608 5829
16461 5829 15163 48214 31820 -16164 -13603 -63730 -12161 -3386 16439 80398 33370 -34511
$$ packed form
16545F6770l8099J9291K1052J5091o046r8868j4633P8880P9911k3225q5025K2590
16533C7689O1006j6092j02646r1934M8522K6831m2757l755O8231J0480k3191n8925
16521h6541k6623l0950N2916O6928K5948k1932p5544J8617J8467N780L6545O1774
16509D5385L7202j6456p6128k4391N0622k0226m058k1242K1605j9996N4560J4543
16497D1420K545K02N5654l9908q5369P4798P5029p7558m7627l8654l8269K1891
16485e5846M2978K2061n423j3854l5599L3347j2382m8514K213j3687J1051o6089
16473a39744K0241O8880r2833L414Q8804L6172K6701q039n0108m8179N4083M6437
16461E829R334L3051j6394m7984K561n0127N1569Q775J9825O3959m7028o7881
$$ plain form
16449 -34511 -33586 -31963 -76751 -112672 -127324 -75658 -83953 -87869 -135906 -54365 8853 -21038 -76183
16436 -76183 -40948 -96000 -137822 -105102 -56539 -11918 1166 53547 35648 17582 -4069 -88
16424 -88 61964 31653 -1087 -39685 -110872 -96138 -99638 -86606 -114873 -87625 -54864 -42684
16412 -42684 -24549 -135488 -187084 -140148 -123347 -110944 -132069 -129111 -26089 37795 90098
16401 90098 154714 121156 83569 7894 -30752 -127659 -154386 -220752 -220915 -116913 -58999 -83253
16389 -83253 -56566 -59102 7525 47293 24234 9231 -10262 -10235 -34390 -78245 -55718 71417
16377 71417 123615 57951 54972 -512 -91260 -77745 -84177 -88250 -61978 -35888 43284 32295
16365 32295 14448 45231 92292 1826 53161 -26204 -87001 -40341 -43784 -43857 -94671 -142514
$$ packed form
16449c4511R25J623m4788l5921j4652N1666q295l916m8037Q1541O3218k9891n5145
16436g6183L5235n5052m1822L2720M8563M4621J3084N2381j7899j8066k1651L981
16424h8O2052l0311l2740l8598p1187J4734l500J3032k8267K7248L2761J2180
16412d2684J8135j10939n1596M6936J6801J2403k1125K958J03022O3884N2303
16401I0098O4616l3558l7587p5675l8646r6907k6727o6366j63J04002N7914k4254
16389h3253K6687k536O6627L9768k3059j5003j9493K7k4155m3855K2527J27135
16377G1417N2198o5664k979n5484r0748J3515o432m073K6272K6090P9172j0989
16365C2295j7847L0783M7061r0466N1335p9365o0797M6660l443p3n0814m7843
$$ plain form
16353 -142514 -68335 -27324 -27157 -39182 -147504 -118620 -71632 -73180 -1640 -90343 -127427 -97311
16341 -97311 -101497 -99207 -76102 -39954 5945 8499 91742 102908 101034 84427 21985 6618
16329 6618 -34770 -78518 -150418 -125693 -145819 -137842 -110132 -37157 -47994 -49788 -34097 -21667
16317 -21667 2514 37867 28574 -95255 -182614 -252656 -162346 -39903 -40952 -26937 -49521 -41544
16305 -41544 -17212 13117 -60351 -124918 -135900 -120592 -98757 -54258 2302 -66239 -33664 82285
16293 82285 41850 36014 36384 23863 25884 -33429 -107335 -120289 -31636 -182 12590 29234
16281 29234 42706 70681 127031 140028 70313 104024 170246 140983 135303 171408 178908 129366
16269 129366 101889 141036 165111 180001 194442 244559 225274 222416 241981 236035 219242 175217
$$ packed form
16353a42514P4179M1011J67j2025j08322K8884M6988j548P1540q8703l7084L0116
16341i7311m186K290K3105L6148M5899K554Q3243J1166j874j6607o2442j5367
16329F618m1388m3748p1900K4725k0126P977K7710P2975j0837j794J5691J2430
16317b1667K4181L5353r293j23829q7359p0042R0310J22443j049J4015k2584P977
16305d1544K4332L0329p3468o4567j0982J5308K1835M4499N6560o8541L2575J15949
16293H2285m0435n836L70j2521K021n9313p3906j2954Q8653L1454J2772J6644
16281B9234J3472K7975N6350J2997o9715L3711O6222k9263n680L6105P500m9542
16269A29366k7477L9147K4075J4890J4441N0117j9285k858J9565n946j6793m4025
$$ plain form
16257 175217 131317 75145 87977 140634 30167 -7565 -19776 -45467 73630 39510 44195
16246 44195 137084 100074 15046 42354 31509 -14022 -32469 -59969 -49847 -47281 -64121 34623
16234 34623 14897 -48979 -112047 -79605 -47251 33502 -1588 -31391 -74162 602 107141
16223 107141 166994 117161 100393 180356 338604 381780 402106 369544 361396 312109 250526
16212 250526 123573 25680 50264 85526 152564 164635 95425 20291 26763 50377 64771
16201 64771 76440 85958 84280 81137 93850 56384 -41487 -107582 -104204 -131637 -128314 -31715 -11373
16188 -11373 -59910 -89376 -85128 -57444 11909 32651 -7823 -27425 36661 26580 41405 38129
16176 38129 -6890 16809 59645 91335 165206 173174 45634 -24727 -45069 -30350 -11005 102685
$$ packed form
16257A75217m3900n6172J2832N2657j10467l7732j2211k5691J19097l4120M685
16246D4195R2889l7010q5028K7308j0845m5531j8447k7500J0122K566j6840R8744
16234C4623j9726o3876o3068L2442L2354Q0753l5090k9803m2771P4764J06539
16223A07141N9853m9833j6768P9963J58248M3176K0326l2562q148m9287o1583
16212B50526j26953r7893K4584L5262O7038J2071o9210p5134O472K3614J4394
16201F4771J1669R518j678l143J2713l7466r7871o6095L378k7433L323R6599K0342
16188a1373m8537k9466M248K7684O9353K0742m0474j9602O4086j0081J4825l276
16176C8129m5019K3699M2836L1690P3871P968j27540p0361k0342J4719J9345J13690
$$ plain form
16164 102685 111746 109342 101216 87441 173233 146521 55899 -6794 -96445 -118484 -44028 -9217
16152 -9217 -47121 -57031 -55542 -46228 -53533 -1122 26099 77478 51645 -15448 -42612 -92757 -46496
16139 -46496 -32782 13873 62500 6185 -132041 -150215 -43690 37148 27577 460 -126105
16128 -126105 -204915 -128899 -30191 -33175 -76374 -49774 -68364 -83051 -116606 -114554 -163044 -105276
16116 -105276 -33604 -760 23200 53419 57579 12989 -56107 -43381 -85964 -147061 -136106 -77683
16104 -77683 -1791 24335 63163 90885 100950 75411 -26991 44204 119294 31011 95069
16093 95069 101807 22499 -105895 -217660 -187312 -154263 -39516 33481 68258 24302 12147
16082 12147 3505 -62613 -7869 -7904 -59881 -62654 -88941 -135275 -66909 24147 59765 -52700
$$ packed form
16164A02685R061k404q126j3775Q5792k6712r0622o2693q9651k2039P4456L4811
16152i217l7904r910J489R314p305N2411K7221N1379k5833o7093k7164n0145M6261
16139d6496J3714M6655M8627n6315j38226j8174J06525Q0838r571k7117j26565
16128a26105p8810P6016R8708k984m3199K6600j8590j4687l3555K052m8490N7768
16116a05276P1672L2844K3960L0219M160m4590o9096J2726m2583o1097J0955N8423
16104g7683P5892K6126L8828K7722J0065k5539j02402P1195P5090q8283O4058
16093I5069O738p9308j28394j11765L0348L3049J14747P2997L4777m3956j2155
16082A2147q642o6118N4744l5n1977k773k6287m6334O8366R1056L5618j12465
$$ plain form
16070 -52700 -6300 101020 154189 116513 65295 39326 13576 31154 6910 -1520 -91690 -71401
16058 -71401 -41357 -32892 17388 142977 86360 -30654 -110031 -86538 -55490 -109352 -101828 -70199
16046 -70199 -85720 -146253 -115574 -33206 -9287 34792 56876 37110 -60150 33822 126855 110982
16034 110982 167121 194909 169221 152061 101549 67086 9080 -5808 -48990 -67203 -18844
16023 -18844 -70079 -59874 -41079 -42386 -24381 36643 95136 26898 -52268 -17210 53263 36717
16011 36717 35546 -16709 -54600 -57033 10155 110930 42962 66623 -1913 -106897 -129530 -89024
15999 -89024 -79068 -51075 -44958 5602 -17703 10966 115 -7643 -16855 -3597 25387 85132
15987 85132 157852 178616 165647 77152 23699 26045 -7660 -61558 -6092 -17155 -42545 -7144
$$ packed form
16070e2700M6400J07320N3169l7676n1218k5969k5750J7578k4244q430r0170K0289
16058g1401L0044Q465N0280J25589n6617j17014p9377K3493L1048n3862P524L1629
16046g0199j5521o0533L0679Q2368K3919M4079K2084j9766r7260R3972R3033j5873
16034A10982N6139K7788k5688j7160n0512l4463n8006j4888m3182j8213M8359
16023a8844n1235J0205J8795j307J8005O1024N8493o8238p9166L5058P0473j6546
16011C6717j171n2255l7891k433O7188J00775o7968K3661o8536j04984k2633M0506
15999h9024R956K7993O117N0560k3305K8669j0851p758r212J3258K8984N9745
15987H5132P2720K0764j2969q8495n3453K346l3705n3898N5466j1063k5390L5401
$$ plain form
15975 -7144 47020 52482 63071 90550 83566 80715 106341 31074 52277 102940 117247 113563 168900
15962 168900 180197 42331 -19282 -139128 -79091 36860 75325 56995 74150 104605 82968
15951 82968 138646 92808 9879 -56595 -111736 -131475 -138431 -88315 -29402 -123945 -61531 -19077
15939 -19077 270 25069 44900 19782 9723 -63442 -107764 -88898 -45820 -102752 -156532 -135600
15927 -135600 -7469 212893 272042 245045 147372 87892 36705 17690 5266 -20991 -76652
15916 -76652 -29804 -68498 -80919 -19404 98072 54298 34209 70912 16262 -2274 82425
15905 82425 121706 111935 168487 195905 185411 85973 -90194 -115238 -49030 -11936 59464 33569
15893 33569 14669 -5080 -2066 21141 -52838 -86429 -54117 -31805 -22895 27581 18006 -34196
$$ packed form
15975g144N4164N462J0589K7479o984k851K5626p5267K1203N0663J4307l684N5337
15962A68900J1297j37866o1613j19846O0037J15951L8465j8330J7155L0455k1637
15951H2968N5678m5838q2929o6474n5141j9739o956N0116N8913r4543O2414M2454
15939a9077J9347K4799J9831k5118j0059p3165m4322J8866M3078n6932n3780K0932
15927a35600J28131K20362N9149k6997r7673n9480n1187j9015j2424k6257n5661
15916g6652M6848l8694j2421O1515J17476m3774k0089L6703n4650j8536Q4699
15905H2425L9281r771N6552K7418j0494r9438j76167k5044O6208L7094P1400k5895
15893C3569j8900j9749L014K3207p3979l3591L2312K2312Q910N0476r575n2202
$$ plain form
15881 -34196 -43239 -75130 -47240 -13091 -61849 -19364 -62446 -101976 -95531 -89816 -124074 -113454
15869 -113454 -184293 -240389 -244746 -162876 -115626 -42411 -21187 -104379 -101564 -93928 -30536 -15698
15857 -15698 6431 5966 -50475 -106602 -74051 -22229 -14078 29881 57603 77174 23634 -40426
15845 -40426 -59260 9377 56400 74852 16379 -82489 -135915 -149543 -139233 -103893 -24747 -1399
15833 -1399 67311 129148 112129 144912 99021 56079 23695 25946 -7867 -85874 -108720 -129649
15821 -129649 -79723 -69913 40766 47247 3507 14479 -53856 -55127 -65916 -76934 -47425 -29400
15809 -29400 -6202 -47574 -46617 -37713 -45190 -32175 -52121 -87106 -99095 -52552 -33346 44964
15797 44964 159542 244731 222138 44264 15202 8316 -97139 -172997 -190774 -131883 -82527
$$ packed form
15881c4196r043l1891K7890L4149m8758M2485m3082l9530O445N715l4258J0620
15869a13454p0839n6096m357Q1870M7250P3215K1224q3192K815P636O3392J4838
15857a5698K2129m65n6441n6127L2551N1822Q151M3959K7722J9571n3540o4060
15845d0426j8834O8637M7023J8452n8473r8868n3426j3628J0310L5340P9146K3348
15833a399O8710O1837j7019L2783m5891m2942l2384K251l3813p8007k2846k0929
15821a29649M9926R810J10679O481m3740J0972o8335j271j0789j1018K9509J8025
15809b9400K3198m1372R57Q904p477J3015j9946l4985j1989M6543J9206P8310
15797D4964J14578Q5189k2593j77874k9062o886j05455p5858j7777N8891M9356
$$ plain form
15786 -82527 -34209 -22883 10400 -126199 -168553 -247333 -186833 -1806 73366 49517 116481
15775 116481 153285 130909 61269 28110 -3048 3308 -37959 15290 17773 34019 -45962 -133912
15763 -133912 -116230 -58350 -95412 -126843 -67095 -2588 28271 27005 44145 47124 132297 110481
15751 110481 48208 -18725 42019 56701 64371 30454 -76665 -94505 -37157 24704 32745 54088
15739 54088 57105 -26832 -137759 -187653 -149320 -34568 16261 -62941 -104528 -63757 19530
15728 19530 10041 -33288 -76455 -138036 -111210 -87697 -78387 -80447 -87954 -59140 -17139 -111872
15716 -111872 -76804 -69846 -17323 6462 -62800 -113565 -114505 -54384 3155 -46459 -117945 -35930
15704 -35930 42564 44029 56937 76989 51793 52471 102239 94338 50110 30547 -106120 -53273
$$ packed form
15786h2527M8318J1326L3283j36599m2354p8780O0500J85027P5172k3849O6964
15775A16481L6804k2376o9640l3159l1158O356m1267N3249K483J6246p9981q7950
15763a33912J7682N7880l7062l1431N9748O4507L0859j266J7140K979Q5173k1816
15751A10481o2273o6933O0744J4682P670l3917j07119j7840N7348O1861Q041K1343
15739E4088L017q3937j10927m9894L8333J14752N0829p9202m1587M0771Q3287
15728A9530r489m3329m3167o1581K6826K3513R310k060p507K8814M2001r4733
15716a11872L5068O958N2523K3785o9262n0765r40O0121N7539m9614p1486Q2015
15704c5930P8494J465J2908K0052k5196O78M9768p901m4228j9563j36667N2847
$$ plain form
15692 -53273 13236 -24043 -34248 40209 11580 -35126 -299 16609 29958 -25090 -146063
15681 -146063 -158584 -66473 -11489 -30038 -37337 -34710 -46234 -45143 -103344 -142676 -158171 -96318
15669 -96318 -49124 -29649 -11206 -46635 -22531 85549 106208 59492 126148 116936 96799 80714
15657 80714 73157 47014 1855 -91535 -138652 -152179 -167209 -194726 -139293 638 122521
15646 122521 153472 166311 101989 42638 40257 58526 24362 -78462 -113842 -12229 55020
15635 55020 -29753 -80239 -40187 -41426 -36963 -161 9764 1247 34012 40030 28378 -12528 -15914
15622 -15914 -102947 -111586 -99998 -59697 -75304 -144991 -139325 -138633 -76075 10644 58016 -12360
15610 -12360 -96753 -41689 -47301 -65460 -66942 -100092 -128027 -195466 -172880 -97446 -21765 -39124
$$ packed form
15692e3273O6509l7279j0205P4457k8629m6706L4827J6908J3349n5048j20973
15681a46063j2521R2111N4984j8549p299K627j1524J091n8201l9332j5495O1853
15669i6318M7194J9475J8443l5429K4104J08080K0659m6716O6656r212k0137j6085
15657H0714p557k6143m5159r3390m7117j3527j5030k7517N5433J39931J21883
15646A22521L0951J2839o4322n9351k381J8269l4164j02824l5380J01613O7249
15635E5020q4773n0486M0052j239M463L6802R925q517L2765O018j1652m0906l386
15622a5914q7033q639J1588M0301j5607o9687N666O92O2558Q6719M7372p0376
15610a2360q4393N5064n612j8159j482l3150k7935o7439K2586P5434P5681j7359
$$ plain form
15598 -39124 -18228 -32611 17948 11221 17574 10972 -70079 -80127 -107926 -99467 3945 28897
15586 28897 -23473 -112507 -64611 -24775 -29524 -52018 -30137 90645 125823 92111 85663 41380
15574 41380 53531 94606 -1792 -89588 -38744 35902 94698 128864 83928 -11258 -137791
15563 -137791 -213054 -100787 -3270 -15690 -33312 -62843 94 3828 110047 108235 79768
15552 79768 12280 -2777 33462 33566 7186 -3563 66817 86810 107311 26226 13720 51376
15540 51376 19611 -32890 -51994 -18305 -31458 -5068 -63918 -13328 -11528 -18720 13969 -16154
15528 -16154 -57255 -159486 -143312 -102364 -76480 -66498 -97583 -70959 -28338 -45688 -45197 -77349
15516 -77349 -156997 -51339 17902 -48569 -141920 -178672 -119316 -27579 -54420 -64435 -52164
$$ packed form
15598c9124K0896j4383N0559o727O353o602q1051j0048k7799Q459J03412K4952
15586B8897n2370q9034M7896L9836m749k2494K1881J20782L5178l3712o448m4283
15574D1380J2151M1075r6398q7796N0844P4646N8796L4166m4936r5186j26533
15563a37791p5263J12267R7517j2420j7622k9531O2937L734J06219j812k8467
15552G9768o7488j5057L6239J04k6380j0749P0380J9993K0501q1085j2506L7656
15540E1376l1765n2501j9104L3689j3153K6390n8850N0590J800p192L2689l0123
15528a6154m1101j02231J6174M0948K5884R982l1085K6624M2621j7350M91l2152
15516g7349p9648J05658O9241o6471r3351l6752N9356R1737k6841j0015J2271
$$ plain form
15505 -52164 -62790 -68522 -40669 -17017 -33781 -45536 -16925 57368 54572 -33261 -23345 -42862
15493 -42862 -15808 45596 69744 56675 61455 -36018 -109432 -122571 -139197 -148997 -13532 28354
15481 28354 13419 -47960 -118598 -113726 -95035 -48963 -16855 23813 111974 102608 93151 121767
15469 121767 22568 -46442 -75290 -66895 66826 62236 54350 84598 91336 96792 97035 -29322
15457 -29322 -77621 -7013 51865 101069 96529 289 59599 46948 -13041 -66018 -16309 19282
15445 19282 8588 -64193 -96542 -70943 -96462 -57620 29400 33815 -98096 -151503 -79550 -181314
15433 -181314 -243713 -203621 -169576 -53441 11056 95799 69091 -253 -5137 -96268 -51040
15422 -51040 30440 62676 -58601 -78397 -36323 -18531 -67490 -94204 -42099 14076 21933 -4288
$$ packed form
15505e2164j0626n732K7853K3652j6764j1755K8611P4293k796q7833R916j9517
15493d2862K7054O1404K4148j3069M780r7473p3414j3139j6626r800J35465M1886
15481B8354j4935o1379p0638M872J8691M6072L2108M0668Q8161r366r457K8616
15469A21767r9199o9010k8848Q395J33721m590p886L0248O738N456K43j26357
15457b9322m8299P0608N8878M9204m540r6240N9310j2651n9989n2977M9709L5591
15445A9282j0694p2781l2349K5599k5519L8842Q7020M415j31911n3407P1953j01764
15433a81314o2399M0092L4045J16135O4497Q4743k6708o9344m884r1131M5228
15422e1040Q1480L2236j21277j9796M2074J7792m8959k6714N2105N6175P857k6221
$$ plain form
15410 -4288 26362 28233 41919 65534 43373 -49645 -38661 99182 146104 111615 33731 71395
15398 71395 4002 31392 46429 93560 168219 71743 -13347 -26952 -61942 -162554 -139157
15387 -139157 -19283 -13351 6143 69519 67083 11804 -16184 -34307 -68008 -23683 96645
15376 96645 142585 141908 63583 -9437 41004 66803 7117 -50294 -32280 38468 50803 11116
15364 11116 -2221 10370 -43580 -73276 -67428 -54534 51811 24055 988 20068 -13999 -12836
15352 -12836 15895 -9810 -10547 54148 60245 59196 92115 123488 82407 6888 -76379 -108872
15340 -108872 -53034 9658 19390 49124 42160 21853 77147 30316 -30208 -20547 7641 51484
15328 51484 11308 -5212 43339 5404 57746 33594 -89881 -113388 -79698 -64897 5887
$$ packed form
15410d288L0650J871J3686K3615k2161r3018J0984J37843M6922l4489p7884L7664
15398G1395o7393K7390J5037M7131P4659r6476q5090j3605l4990j00612K3397
15387a39157J19874N932J9494O3376k436n5279k7988j8123l3701M4325J20328
15376I6645M5940o77p8325p3020N0441K5799n9686n7411J8014P0748J2335l9687
15364A1116j3337J2591n3950k9696N848J2894J06345k7756k3067J9080l4067J163
15352a2836K8731k5705p37O4695O097j049L2919L1373m1081p5519q3267l2493
15340a08872N5838O2692R732K9734o964k0307N5294m6831o0524R661K8188M3843
15328E1484m0176j6520M8551l7935N2342k4152j23475k3507L3690J4801P0784
$$ plain form
15317 5887 111518 185524 122422 -41543 -147563 -22343 42027 -18485 -52386 -60163 -75168
15306 -75168 -62880 -97460 -27121 -49609 -44240 -5590 -26563 -104681 -167300 -206571 -187031 -123122
15294 -123122 -18930 44781 42729 97940 94600 79403 -14141 -70861 -17724 -44200 72365
15283 72365 123600 76677 37922 31770 -7812 55634 85000 37052 -8816 -99758 -181510 -223887
15271 -223887 -182679 -86598 -51939 -104348 -125501 -113462 -162028 -132204 -110645 -105017 -61091 18116
15259 18116 37634 53236 69299 63550 36894 -36766 -66200 -28200 -39492 -52955 -20967 20928
15247 20928 31526 -40955 -49163 22559 -53029 -64550 -38271 -71804 -88565 -63586 3536 -52512
15235 -52512 -67166 -50146 -57947 2032 70123 82355 58508 34735 -41160 -91175 -168196 -171250
$$ packed form
15317E887J05631P4006o3102j63965j06020J25220O4370o0512l3901p777j5005
15306g5168J2288l4580P0339k2488N369L8650k0973p8118o2619l9271J9540O3909
15294a23122J04192O3711k052N5211l340j5197r3544n6720N3137k6476J16565
15283G2365N1235m6923l8755o152l9582O3446K9366m7948m5868r0942q1752m2377
15271b23887M1208R6081L4659n2409k1153J2039m8566K9824K1559N628M3926P9207
15259A8116J9518J5602J6063n749k6656p3660k9434L8000j1292j3463L1988M1895
15247B0928J0598p2481q208P1722p5588j1521K6279l3533j6761K4979O7122n6048
15235e2512j4654J7020p801N9979O8091J2232k3847k3773p5895n0015p7021l054
$$ plain form
15223 -171250 -209361 -120697 -75981 -95345 -87885 2685 8902 33671 48877 27491 25655 -9170
15211 -9170 -86543 -92365 -159024 -152426 -110784 -11668 75778 74990 76182 53425 16344 -24434 -16016
15198 -16016 -38310 -77837 -103381 -79465 -160591 -126088 -61147 -87188 -63135 -85509 -134029 -165650
15186 -165650 -85156 -14975 -26636 -31533 36584 99107 133690 108379 179228 130317 35691 -83519
15174 -83519 -159589 -117169 -71082 -63845 10169 53992 65328 12670 -77708 -83026 -30844 -28046
15162 -28046 -47868 -71667 -51024 -57757 -120766 -22884 40233 1029 -18336 33940 62692 15004
15150 15004 45302 62180 119462 64920 19511 50677 13505 -21254 31732 39644 -9331 -37558
15138 -37558 45127 41623 108106 113210 74639 97203 182291 149538 49942 -57340 -31389 -10514
$$ packed form
15223a71250l8111Q8664M4716j9364P460R0570O217K4769J5206k1386j836l4825
15211i170p7373n822o6659O598M1642R9116Q7446p88J192k2757l7081m0778Q418
15198a6016k2294l9527k5544K3916q1126L4503O4941k6041K4053k2374m8520l1621
15186a65650Q0494P0181j1661m897O8117O2523L4583k5311P0849m8911r4626j19210
15174h3519p6070M2420M6087P237P4014M3823J1336n2658r0378n318N2182K798
15162b8046j9822k3799K0643o733o3009R7882O3117l9204j9365N2276K8752m7688
15150A5004L0298J6878N7282n4542m5409L1166l7172l4759N2986P912m8975k8227
15138c7558Q2685l504O6483N104l8571K2564Q5088l2753r9596j07282K5951K0875
$$ plain form
15126 -10514 65840 68716 95264 49132 42706 66643 -2158 -42187 -86951 -175549 -158269 -106815
15114 -106815 -72292 -71048 -56205 -6284 -30981 -42126 38341 65604 103092 148908 115627 53352
15102 53352 2358 3556 -5577 -93573 -44319 -39882 -57577 -2652 -4162 10393 45475 55768
15090 55768 51289 108926 149800 48326 -12280 4612 5005 45064 81474 22834 111027 140484
15078 140484 191899 148220 70950 99932 73268 15484 5816 -28341 57397 -8590 -88363 -37241
15066 -37241 4783 103240 118145 -20669 -79553 -80572 63416 90994 4470 -74938 -87133
15055 -87133 -78105 -56386 -62966 1157 -14279 35393 25624 -976 38773 -23365 -92192 -42842
15043 -42842 1118 18714 9611 -28257 -29547 -54059 -98341 -217645 -123911 -37134 -102934 -128546
$$ packed form
15126a0514P6354K876K6548m6132o426K3937o8801m0029m4764q8598J7280N1454
15114a06815L4523J244J4843M9921k4697j1145Q0467K7263L7488M5816l3281o2275
15102E3352n0994J198r133q7996M9254M437j7695N4925j510J4555L5082J0293
15090E5768m479N7637M0874j01474o0606J6892L93M0059L6410n8640Q8193K9457
15078A40484N1415m3679p7270K8982k6664n7784r668l4157Q5738o5987p9773N1122
15066c7241M2024R8457J4905j38814n8884j019J43988K7578q6524p9408j2195
15055h7133R028K1719o580O4123j5436M9672r769k6600L9749o2138o8827M9350
15043d2842M3960J7596r103l7868j290k4512m4282j19304R3734Q6777o5800k5612
$$ plain form
15031 -128546 -46822 28540 -15468 -61271 -48649 -18875 -96516 -154180 -103305 -60890 -21741
15020 -21741 57485 -386 -17934 -10693 67913 105351 139446 72539 -9275 30012 56644 -19610
15008 -19610 -107871 -117870 -56256 -8958 23100 67874 -15983 -35677 -58826 -37960 -24683 9033
14996 9033 31764 3866 -94531 -96912 -19235 90734 33890 -3914 -29981 -14932 -22563 -25792
14984 -25792 -32664 -10279 53651 41620 -46251 -59842 -10281 61636 19576 2749 34442 20609
14972 20609 100152 91828 53884 148472 143503 103351 133612 73016 11895 18623 3361 3655 27593
14959 27593 68040 107495 44669 13808 50232 102815 88946 -17316 -32390 -21353 -20014 -79731
14947 -79731 4272 69009 29360 -24038 -52178 -128012 -170879 -96998 32600 80086 5480
$$ packed form
15031a28546Q1724P5362m4008m5803J2622K9774p7641n7664N0875M2415L9149
15020b1741P9226n7871j7548P241P8606L7438L4095o6907q1814L9287K6632p6254
15008a9610q8261r999O1614M7298L2058M4774q3857j9694k3149K0866J3277L3716
14996I033K2731k7898r8397k381P7677J09969n6844l7804k6067J5049p631l229
14984b5792o872K2385O3930j2031q7871j3591M9561P1917m2060j6827L1693j3833
14972B0609P9543q324l7944R4588m969m0152L0261o0596o1121O728j5262K94K3938
14959B7593M0447L9455o2826l0861L6424N2583j3869j06262j5074J1037J339n9717
14947g9731Q4003O4737l9649n3398k8140p5834m2867P3881J29598M7486p4606
$$ plain form
14936 5480 -33146 -45387 -96662 -66790 -14231 -14887 -95945 -128282 -105039 -57253 -16798 -3753
14924 -3753 16480 79904 58977 -73489 -32896 6859 -23231 57897 139919 134389 57840 29182
14912 29182 88709 97890 85235 75546 71095 -49247 -40406 -70194 -96620 -101492 1047 28283
14900 28283 -39463 20838 -5664 -60399 -14625 7019 44925 88993 102831 192036 198146 122882
14888 122882 79011 62980 69519 8288 25102 1338 38200 153724 136843 130264 82477 106431
14876 106431 154593 150940 8343 38888 33076 16383 -11445 30994 -17044 -76134 -84700 -100793
14864 -100793 -114327 -130926 -50851 69350 179136 186833 129430 136829 141672 87370 50599 117767
14852 117767 149525 87799 -69513 -8002 45492 54339 26582 14517 15170 97414 88978 50698
$$ packed form
14936E480l8626j2241n1275K9872N2559o56q1058l2337K3243M7786M0455J3045
14924c753K0233O3424k0927j32466M0593L9755l0090Q1128Q2022n530p6549k8658
14912B9182N9527R181j2655r689m451j20342Q841k9788k6426m872J02539K7236
14900B8283o7746O0301k6502n4735M5774K1644L7906M4068J3838Q9205O110p5264
14888A22882m3871j6031O539o1231J6814k3764L6862J15524j6881o579m7787K3954
14876A06431M8162l653j42597L0545n812j6693k7828M2439m8038n9090q566j6093
14864a00793j3534j6599Q0075J20201J09786P697n7403P399M843n4302l6771O7168
14852A17767L1758o1726j57312O1511N3494Q847k7757j2065O53Q2244q436l8280
$$ plain form
14840 50698 87696 136552 180149 156274 140705 130980 100889 100077 126760 69794 -1365 6224
14828 6224 12943 11316 6251 17437 34273 20593 39377 37152 63223 85218 11362 -42242 -40217
14815 -40217 -51380 -72592 -19158 9967 54362 81350 73118 24500 -39080 -19844 -69 -67820
14803 -67820 -51025 -20885 -25098 46721 137760 87783 28116 25787 51863 68935 92330 73007
14791 73007 75921 43898 -113857 -203583 -142464 -103466 -104078 -101856 -112690 -84823 -79249 -97795
14779 -97795 -106274 -65416 23793 90428 72237 26841 -52296 -26038 27680 -30514 -28532 28585
14767 28585 69844 8098 -14572 -5499 -18403 -49116 3418 22266 73907 61428 89624 126586
14755 126586 88070 66627 85098 105557 99495 86262 88850 -34345 -81268 -61190 -98432 -143045
$$ packed form
14840E0698L6998M8856M3597k3875j5569r725l0091q12K6683n6966p1159P589
14828F224O719j627n065J1186J6836j3680J8784k225K6071K1995p3856n3604K025
14815d0217j1163k1212N3434K9125M4395K6988q232m8618o3580J9236J9775o7751
14803f7820J6795L0140m213P1819R1039m9977n9667k329K6076J7072K3395j9323
14791G3007K914l2023j57755q9726O1119L8998o12K222j0834K7867N574j8546
14779i7795q479M0858Q9209O6635j8191m5396p9137K6258N3718n8194J982N7117
14767B8585M1259o1746k2670R073j2904l0713N2534J8848N1641j2479K8196L6962
14755A26586l8516k1443J8471K0459o062j3233K588j23195m6923K0078l7242m4613
$$ plain form
14743 -143045 -43244 -81786 -79378 9783 78161 93239 142514 25961 -57880 -56711 -25882 17057
14731 17057 -44671 -144088 -143039 -104598 -15799 29287 31310 -11194 12556 63500 136978 97061
14719 97061 66605 25268 -42389 -76136 -65996 -71795 -18510 35969 88724 113079 159361 123638
14707 123638 10502 -72913 -25536 49993 14320 -2138 14207 30398 13708 64182 42732
14696 42732 31105 57176 125429 92906 30463 20620 43697 85860 145362 178242 46247 -95632
14684 -95632 -123928 -146261 -162601 -88439 -34896 -29816 -39439 -22259 65381 35693 -20814 -90961
14672 -90961 -98098 -114089 -82000 -60737 -112463 -96541 -121430 -141118 -132283 -49809 -17894 -31233
14660 -31233 -129601 -112274 -61865 24647 163530 148920 7922 -36540 18803 41560 36466
$$ packed form
14743a43045R9801l8542K408Q9161O8378J5078M9275j16553q3841J169L0829M2939
14731A7057o1728r9417J049L8441Q8799M5086K023m2504K3750N0944P3478l9917
14719I7061l0456m1337o7657l3747J0140n799N3285N4479N2755K4355M6282l5723
14707A23638j13136q3415M7377P5529l5673j6458J6345J6191j6690N0474k1450
14696D2732j1627K6071O8253l2523o2443r843K3077M2163N9502L2880j31995j41879
14684i5632k8296k2333j6340P4162N3543N080r623J7180Q7640k9688n6507p0147
14672i0961p137j5991L2089K1263n1726J5922k4889j9688Q835Q2474L1915j3339
14660c1233r8368J7327N0409Q6512J38883j4610j40998m4462N5343K2757n094
$$ plain form
14649 36466 22248 5164 53198 104878 133711 63483 -73540 -89285 -73377 -48941 48506
14638 48506 13355 2458 32028 -3342 -15204 52527 96185 -13514 -60756 12683 75186
14627 75186 74335 72887 90743 97429 109448 94537 23662 10046 -43398 -97925 -116163 -117455 -93464
14614 -93464 -4340 29531 76033 102350 50616 -24127 -2970 37448 66932 -26534 -87584 -26698
14602 -26698 87087 135422 102965 30676 44147 16396 25436 15912 17897 36052 102133 78748
14590 78748 -10524 -46013 -68098 -10253 -23191 -4575 73994 117928 104124 21263 -30227 -12943
14578 -12943 -18216 -100284 -70838 -42259 -23425 -32346 -59203 -104056 -110328 -78902 -17159 29896
14566 29896 21072 73313 62231 35213 67584 34992 915 -24272 -9812 68512 13064 51202
$$ packed form
14649C6466j4218j7084M8034N1680K8833p0228j37023j5745J5908K4436R7447
14638D8506l5151j0897K9570l5370j1862O7731M3658j09699m7242P3439O2503
14627G5186q51j448J7856O686J2019j4911p0875j3616n3444n4527j8238j292K3991
14614i3464Q9124L3871M6502K6317n1734p4743K1157M0418K9484r3466o1050O0886
14602b6698J13785M8335l2457p2289J3471k7751R040r524J985J8155O6081k3385
14590G8748q9272l5489k2085N7845j2938J8616P8569M3934j3804q2861n1490J7284
14578a2943n273q2068K9446K8579J8834q921k6857m4853o272L1426O1743M7055
14566B9896q824N2241j1082k7018L2371l2592l4077k5187J4460P8324n5448L8138
$$ plain form
14554 51202 41667 12856 11156 42823 68595 4997 -44605 -137355 -107634 -44378 -79478 -60311
14542 -60311 -1100 -9183 29306 30123 -55655 -78296 -24017 87774 75713 -9356 -26220 -63761
14530 -63761 -69551 -94171 -104434 -82703 -12906 8417 -21317 -67729 -100132 -112109 -125441 -167243
14518 -167243 -192097 -153036 -29444 -39821 -47738 -3335 -57279 -78510 -19572 -24017 -23960 2629
14506 2629 136918 188534 80297 -2648 -48499 -66083 -112517 -157956 -159753 -121825 -87905 -152807
14494 -152807 -138074 -182559 -174670 -142992 -57073 42574 76385 50103 4895 -12455 -43821 9514
14482 9514 18260 14557 -30742 -28920 17475 -4862 6396 86093 35003 -83618 -26319 19388
14470 19388 36105 162295 182954 55696 -18288 -23986 -32477 3950 42694 47771 -1675 -28412
$$ packed form
14554E1202r535k8811j700L1667K5772o3598m9602r2750K9721O3256l5100J9167
14542f0311N9211q083L8489Q17q5778k2641N4279J11791j2061q5069j6864l7541
14530f3761n790k4620j0263K1731O9797K1323k9734m6412l2403j1977j3332m1802
14518a67243k4854L9061J23592j0377p917M4403n3944k1231N8938m445N7K6589
14506B629J34289N1616j08237q2945m5851j7584m6434m5439j797L7928L3920o4902
14494a52807J4733m4485P889L1678Q5919R9647L3811k6282m5208j7350l1366N3335
14482I514Q746l703m5299J822M6395k2337J1258P9697n1090j18621N7299M5707
14470A9388J6717J26190K0659j27258p3984n698q491L6427L8744N077m9446k6737
$$ plain form
14458 -28412 -68575 -112441 -129743 -147131 -69304 -50073 -143641 -87128 -42551 -21556 -101616 -113566
14446 -113566 -14773 -42767 -18738 38864 32851 7132 5060 -3390 -20435 -21886 -51211 -27802
14434 -27802 9371 -43725 -59402 3072 -8457 -55471 37770 141442 201973 238792 197662
14423 197662 86321 11989 11449 -30440 -56040 -274 112785 142071 164304 141206 -5849
14412 -5849 -164662 -178836 -125871 77274 121672 113164 61198 -6039 -50161 11620 69076 70466
14400 70466 17646 -25529 -38864 -64333 5725 9635 21335 70372 116965 103730 81367 -7797
14388 -7797 -39472 -11702 -72368 -99747 -23594 55330 33840 53115 15668 57048 144129 144702
14376 144702 34372 20989 -93297 -193780 -157152 -34991 45153 103479 101592 72700 37486
$$ packed form
14458b8412m0163m3866j7302j7388P7827J9231r3568N6513M4577K0995q0060j1950
14446a13566R8793k7994K4029N7602o013k5719k072q450j7045j451k9325K3409
14434b7802L7173n3096j5677O2474j1529m7014R3241J03672O0531L6819m1130
14423A97662j11341p4332n40m1889k5600N5766J13059K9286K2233k3098j47055
14412e849j58813j4174N2965K03145M4398q508n1966o7237m4122O1781N7456J390
14400G0466n2820m3175j3335k5469P0058L910J1700M9037M6593j3235k2363q9164
14388g797l1675K7770o0666k7379P6153P8924k1490J9275l7447M1380Q7081N73
14376A44702j10330j3383j14286j00483L6628J22161Q0144N8326j887k8892l5214
$$ plain form
14365 37486 -61667 -73109 -49417 12441 8349 -57708 -91214 -67331 -72475 -102194 -26240 76794
14353 76794 107525 77109 44708 73233 71596 -40679 -72136 -79943 -211948 -171868 -77766 -8523
14341 -8523 28857 -38519 -150661 -116206 -97480 -36581 -14506 -2292 -8394 10241 -120790 -137854
14329 -137854 -113966 -93769 -105547 -77451 -13768 71662 -6393 -111173 -91685 -42961 66880
14318 66880 163421 97035 34523 5092 23920 -20094 -81658 -100341 -156054 -174534 -138106 -109061
14306 -109061 -40358 -11382 -94149 -53702 14842 -86068 -163055 -36844 -62252 -77273 -78895
14295 -78895 4809 73432 75973 32986 -12998 -45559 8133 73634 129207 52403 -31553 16133
14283 16133 103893 113642 140676 115851 131565 143614 146950 107213 54906 -48962 -68976 -81162
$$ packed form
14365C7486r9153j1442K3692O1858m092o6057l3506K3883n144k9719P5954J03034
14353G6794L0731l0416l2401K8525j637j12275l1457p807j32005M0080R4102O9243
14341h523L7380o7376j12142L4455J8726O0899K2075J2214o102J8635j31031j7064
14329a37854K3888K0197j1778K8096O3683Q5430p8055j04780J9488M8724J09841
14318F6880R6541o6386o2512k9431J8828m4014o1564j8683n5713j8480L6428K9045
14306a09061O8703K8976q2767M0447O8544j00910p6987J26211k5408j5021j622
14295g8895Q3704O8623K541m2987m5984l2561N3692O5501N5573p6804q3956M7686
14283A6133Q7760R749K7034k4825J5714J2049L336l9737n2307j03868k0014j2186
$$ plain form
14271 -81162 2880 -22200 -64580 -50306 5966 22643 95727 53044 3042 8873 -120103 -36539
14259 -36539 -35021 -24893 -23984 -67089 43657 -4102 -73783 25886 76875 61642 36341 53279
14247 53279 12654 -26970 19169 74137 28312 9859 -82411 -65615 -1225 -52235 -119175 -87646
14235 -87646 -29083 -44616 -93827 -70038 -66076 -136523 -135280 -107200 -75217 42365 68369 29728
14223 29728 16318 -96625 -8712 33437 21058 25710 55059 61786 66914 -35897 -60701 -31886
14211 -31886 -25171 -33074 -6193 -62086 -99118 -28075 36292 -51410 -51022 -68622 -100957 -128169
14199 -128169 -126534 -80685 -1034 57111 -36105 -28015 91151 104886 62817 72711 72812 34298
14187 34298 107150 57193 -1455 -76187 -123405 -113482 -34997 31047 27682 5707 30612 44876
$$ packed form
14271h1162Q4042k5080m2380J4274N6272J6677P3084m2683n0002N831j28976Q3564
14259c6539J518J0128R09m3105J10746m7759o9681R9669N0989j5233k5301J6938
14247E3279m0625l9624M6139N4968m5825j8453r2270J6796O4390n1010o6940L1529
14235h7646N8563j5533m9211K3789L962p0447J243K8080L1983J17582K6004l8641
14223B9728j3410j12943Q7913M2149j2379M652K9349O727N128j02811k4804K8815
14211c1886O715p903K6881n5893l7032P1043O4367q7702L88j7600l2335k7212
14199a28169J635M5849P9651N8145r3216Q090J19166J3735m2069R894J01l8514
14187C4298P2852m9957n8648p4732m7218R923P8485O6044l365k1975K4905J4264
$$ plain form
14175 44876 30671 30744 83800 83572 56074 138834 121303 118284 119054 31321 36403 27762 -25937 -72307
14161 -72307 -35901 37106 69276 48673 121413 107078 -5584 -44170 -40099 -3285 9316 15855
14149 15855 2718 24177 13422 25781 -7518 -89268 -115212 -59710 -118179 -176191 -122301 -122171
14137 -122171 -76550 -47426 -41125 -23755 -16135 -15696 -69316 -78256 -44842 9673 1316 -72683 -94640
14124 -94640 -86282 -31170 -12011 -54683 -798 50802 25779 33316 32055 36032 6933 -68357
14112 -68357 -85812 -40364 26194 -29705 -41652 -26415 78500 38018 -105813 -91140 453
14101 453 -12848 -112980 -148480 -104784 -45986 3212 11671 32923 -52842 -112254 -109837 -27769
14089 -27769 88108 119666 136183 45488 -17918 28976 94708 112576 18085 -74427 3269
$$ packed form
14175D4876j4205P3N3056k28k7498Q2760j7531l019P70q7733N082q641n3699m6370
14161g2307L6406P3007L2170k0603P2740j4335j12662l8586M071L6814J2601O539
14149A5855j3137K1459j0755J2359l3299q1750k5944N5502n8469n8012N3890J30
14137a22171M5621K9124O301J7370P620M39n3620q940L3414N4515q357p3999k1957
14124i4640Q358N5112J9159m2672N3885N1600k5023P537j261L977k9099p5290
14112f8357j7455M5448O6558n5899j1947J5237J04915m0482j43831J4673R1593
14101D53j3301j00132l5500M3696N8798M9198Q459K1252q5765n9412K417Q2068
14089b7769J15877L1558J6517r0695o3406M6894O5732J7868r4491r2512P7696
$$ plain form
14078 3269 46395 18739 -110814 -98781 -34382 -47006 30557 80838 16384 8080 22083 -19885
14066 -19885 37148 42609 165 -31822 54760 33214 -33365 -23364 33781 81614 113237 27732
14054 27732 13713 44296 50163 39511 19758 -125734 -203635 -84092 1466 9836 16340 69285
14042 69285 59565 -260 -23452 -35996 -76242 -36730 12804 81936 47094 -11510 -1518 -32511
14030 -32511 -458 16777 -9320 15616 -56009 -49056 -41821 -14181 23718 -37720 -385 102723
14018 102723 137315 79289 16199 35638 99227 101530 109071 113994 129571 137578 161421 136585
14006 136585 19958 -47706 -114240 -106717 -95579 -7628 51484 82050 120355 52057 -51190
13995 -51190 -55598 -7297 -3121 46208 -25015 -88990 -121449 -68948 81182 123337 94797 83079
$$ packed form
14078C269M3126k7656j29553J2033O4399j2624P7563N0281o4454q304J4003m1968
14066a9885N7033N461m2444l1987Q6582k1546o6579J0001N7145M7833L1623q5505
14054B7732j4019L0583N867j0652j9753j45492p7901J19543Q5558Q370O504N2945
14042F9285r720n9825k3192j2544m0246L9512M9534O9132l4842n8604R992l0993
14030c2511L2053J7235k6097K4936p1625O953P235K7640L7899o1438L7335J03108
14018A02723L4592n8026o3090J9439O3589K303P541M923J5577Q007K3843k4836
14006A36585j16627o7664o6534P523J1138Q7951N9112L0566L8305o8298j03247
13995e1190m408M8301M176M9329p1223o3975l2459N2501J50130M2155k8540j1718
$$ plain form
13983 83079 50145 -42954 -25291 16335 -28512 -23222 24575 46924 131507 119697 40158 -5202
13971 -5202 -16943 -21437 -46953 -21475 -12017 43569 115200 97027 73440 110165 102505 106403 132499
13958 132499 160195 161908 24495 -126346 -93885 -19462 24743 76610 5212 -86023 -73608
13947 -73608 -6826 27324 72326 39428 -40249 -85608 -118367 -131186 -111930 -75162 -96 -2994
13935 -2994 -27208 -8674 31737 15632 -5040 -24070 75999 137680 50395 -51481 -133653
13924 -133653 -186552 -198607 -215556 -193091 -146666 -153810 -122074 -147684 -60599 -11240 -8462 21707
13912 21707 5254 60529 154016 144147 184027 196764 135075 107961 51533 -27685 -39770 -52383
13900 -52383 -28610 -5165 -74992 -90694 41115 84451 46531 26554 67199 41855 18
$$ packed form
13983H3079l2934r3099J7663M1626m4847N290M7797K2349Q4583j1810p9539m5360
13971e202j1741m494k5516K5478R458N5586P1631j8173k3587L6725p660L898K6096
13958A32499K7696J713j37413j50841L2461P4423M4205N1867p1398r1235J2415
13947g3608O6782L4150M5002l2898p9677m5359l2759j2819J9256L6768P5066k898
13935b994k4214J8534M0411j6105k0672j9030J00069O1681q7285j01876q2172
13924a33653n2899j2055j6949K2465M6425p144L1736k5610Q7085M9359K778L0169
13912B1707j6453N5275R3487r869L9880J2737o1689k7114n6428p9218j2085j2613
13900e2383K3773K3445o9827j5702J31809M3336l7920j9977M0645k5344m1837
$$ plain form
13889 18 68023 67356 18803 82768 91468 54183 55264 2617 -58032 -76005 -64659 26405 59579
13876 59579 104421 96779 31786 49998 -17808 -111483 -10499 -26966 -10081 72804 83359 55872
13864 55872 -9321 -106000 -115628 -102354 -72405 -80060 -34794 69502 44029 -7403 11298 -25485
13852 -25485 -83041 -35769 -48486 -51514 -81596 -196302 -143207 -37773 17832 9027 7156 -24189
13840 -24189 27428 -21498 -108233 7527 74715 94654 64562 64198 89827 71914 30870 27671
13828 27671 -29985 -61648 -22275 -45684 -13567 -8769 76492 164077 109969 60439 -130 -14836
13816 -14836 -45547 -94545 -77726 -78368 -94372 -16157 -8811 -78666 -106920 -75229 -95737 -61578
13804 -61578 -82576 -79930 31955 106457 56564 -12116 -6325 -18393 -37491 62229 143307 142050
$$ packed form
13889A8O8005o67m8553O3965Q700l7285J081n2647o0649j7973J1346R1064L3174
13876E9579M4842p642o4993J8212o7806r3675J00984j6467J6885Q2885J0555k7487
13864E5872o5193r6679r628J3274K9949p655M5266J04296k5473n1432J8701l6783
13852b5485n7556M7272j2717l028l0082j14706N3095J05434N5605q805j871l1345
13840b4189N1617m8926q6735J15760O7188J9939l0092l64K5629j7913m1044l199
13828B7671n7656l1663L9373k3409L2117M798Q5261Q7585n4108m9530o0569j4706
13816a4836l0711m8998J6819o42j6004P8215P346o9855k8254L1691k0508L4159
13804f1578k0998K646J11885P4502m9893o8680N791j2068j9098R9720Q1078j257
$$ plain form
13792 142050 63774 28023 17336 99730 169092 89218 38000 -10618 67529 81301 85054 15125
13780 15125 -87568 -105393 -77103 -38163 40837 23555 17766 35217 118256 150740 151493 104472
13768 104472 81201 55327 24356 89422 53533 1808 -30087 -41323 -63412 -43593 -17483
13757 -17483 -58358 -187159 -121435 -55804 1527 42005 18021 51998 22628 -31931 -1478
13746 -1478 -4903 14993 38961 -13085 -25972 -29352 -18095 -33580 15738 -22873 -75171 -74596 90932
13733 90932 87259 5391 -32252 -10451 9855 37617 85532 95543 -4021 -74542 -38604 -83806
13721 -83806 -75828 -56450 -61098 3773 10070 12972 87259 23769 -80662 -135016 -56230 1298
13709 1298 34846 106326 165591 145716 54438 -21301 -88550 -50654 -6537 72886 49341 38741
$$ packed form
13792A42050p8276l5751j0687Q2394O9362p9874n1218m8618P8147J3772L753o9929
13780A5125j02693j7825K8290L8940P9000j7282n789J7451Q3039L2484P53m7021
13768A04472k3271k5874l0971O5066l5889n1725l1895j1236k2089J9819K6110
13757a7483m0875j28801O5724O5631N7331M0478k3984L3977k9370n4559L0453
13746a478l425J9896K3968n2046j2887l380J1257j5485M9318l8611n2298N75J65528
13733I0932l673q1868l7643K1801K0306K7762M7915J0011r9564p0521L5938m5202
13721h3806P978J9378m648O4871O297K902P4287o3490j04431n4354P8786N7528
13709A298L3548P1480N9265j9875r1278p5739o7249L7896M4117P9423k3545j0600
$$ plain form
13697 38741 -18736 -78647 -62156 -65114 -130523 -166923 -36533 -30724 8724 76073 64613 -38057
13685 -38057 -68187 -87572 -70286 -57191 -78137 -70489 -87301 -69752 -70833 -12253 -36795 -93603
13673 -93603 -79757 -63936 -49281 -36014 -12814 47507 47370 111690 65176 60400 54156 -38473
13661 -38473 -103990 -34195 -45581 -110339 -97130 -110375 -46362 -140573 -219117 -244128 -218414 -196211
13649 -196211 -176517 -186687 -151712 -163737 -185284 -82957 6436 44199 35684 71981 55305
13638 55305 39760 98772 126152 127285 118191 115977 102346 130315 120540 92114 19478 -54844
13626 -54844 -63162 13722 16666 16786 10705 2385 68391 67883 22628 -58103 -51681 10057 3331 -39555
13612 -39555 -72459 -67360 29511 47644 -21177 36303 32702 26010 -20317 -95586 -136382 -21770
$$ packed form
13697C8741n7477n9911J6491k958o5409l6400J30390N809L9448O7349j1460j02670
13685c8057l0130j9385J7286J3095k0946P648j6812J7549j081N8580k4542n6808
13673i3603J3846J5821J4655J3267K3200O0321j37O4320m6514m776o244r2629
13661c8473o5517O9795j1386o4758J3209j3245O4013r4211p8544k5011K5714K2203
13649a96211J9694j0170L4975j2025k1547J02327Q9393L7763q515L6297j6676
13638E5305j5545N9012K7380J133r094k214j3631K7969r775k8426p2636p4322
13626e4844q318P6884K944J20o081q320O6006n08m5255q0731O422O1738o726m2886
13612c9555l2904N099R6871J8133o8821N7480l601o692m6327p5269m0796J14612
$$ plain form
13600 -21770 45434 19281 -2988 -83276 -127733 -65974 -123725 -138559 -104103 -59627 -56785 60340
13588 60340 50141 85422 103315 145270 164463 174168 168952 188281 184330 90092 26853 -55682
13576 -55682 -85677 -100129 -138473 -75274 -103603 -102437 -87669 -121361 -112610 -87135 -64365 -163088
13564 -163088 -117429 -45836 -36280 -65125 -139803 -112737 -21967 -23377 -29085 8560 55806 -485
13552 -485 -18648 -11542 25955 21144 9306 5292 -30414 -17228 -26424 -26058 21312 43855 9549
13539 9549 -68137 31401 172698 141719 109970 104866 73608 10952 -26057 97560 113106 117623
13527 117623 119649 75079 -752 -50974 40091 8468 15031 17790 70766 77155 135043 167149
13515 167149 105874 31483 -29015 3197 37068 -5127 -64645 -31548 -9107 -19139 -85912
$$ packed form
13600b1770O7204k6153k2269q0288m4457O1759n7751j4834L4456M4476K842J17125
13588F0340j0199L5281J7893M1955J9193R705n216J9329l951r4238o3239q2535
13576e5682k9995j4452l8344O3199k8329J166J4768l3692Q751K5475K2770r8723
13564a63088M5659P1593R556k8845p4678K7066R0770j410n708L7645M7246n6291
13552d85j8163P106L7497m811j1838m014l5706J3186r196L66M7370K2543l4306
13539I549p7686R9538J41297l0979l1749n104l1258o2656l7009J23617J5546M517
13527A17623K026m4570p5831n0222R1065l1623O563K759N2976O389N7888L2106
13515A67149o1275p4391o0498L2212L3871m2195n9518L3097K2441j0032o6773
$$ plain form
13504 -85912 -71971 -62432 -61169 114574 148992 9164 10254 86076 88666 101891 128456 34902
13492 34902 -10911 -15956 -4779 -52892 -65776 47546 68082 86103 87117 57055 14970 89228
13480 89228 109406 165163 200161 182248 108757 128113 125667 123423 37359 -16187 -94170 -112603
13468 -112603 -42454 390 -5659 -71904 -118781 -213616 -176036 -20616 1312 17492 -27684
13457 -27684 -4780 340 -75351 -44419 48440 35076 70302 118644 62792 -12670 -43206 -62262
13445 -62262 -91364 -26077 -18081 9941 54091 13524 -22469 -47813 27436 15795 -36071 -30991
13433 -30991 -29749 -98755 -156752 -130702 -80574 -89595 -74032 12794 36606 21794 69778 -20387
13421 -20387 -70327 4833 1348 -45922 -27516 -40073 -52956 -34903 -63927 5448 -16164 -27376
$$ packed form
13504h5912J3941R539J263J75743L4418j39828J090P5822K590J3225K6565r3554
13492C4902m5813n045J1177m8113j2884J13322K0536J8021J014l0062m2085P4258
13480H9228K0178N5757L4998j7913p3491J9356k446k244q6064n3546p7983j8433
13468a12603P0149M2844o049o6245m6877r4835L7580J55420K1928J6180m5176
13457b7684K2904N120p5691L0932R2859j3364L5226M8342n5852p5462l0536j9056
13445f2262k9102O5287P996K8022M4150m0567l5993k5344P5249j1641n1866N080
13433c0991J242o9006n7997K6050N0128r021J5563Q6826K3812j4812M7984r0165
13421b0387m9940P5160l485m7270J8406j2557j2883J8053k9024O9375k1612j1212
$$ plain form
13409 -27376 28622 64612 44848 9609 -14926 -12186 17499 9711 42280 -19165 -89882 -112897
13397 -112897 -139625 -37793 -17271 -56879 -39350 -138061 -151938 -32800 79615 -26594 -100572
13386 -100572 -52336 -82093 -107014 -10920 39565 -46058 -91015 -69158 -49310 -78150 -50358
13375 -50358 118883 164352 69628 -77039 -96157 -109079 -149698 -31620 -8612 -53339 -17615
13364 -17615 6516 68945 137373 169026 124090 154390 143396 94781 127014 79459 87216 40441
13352 40441 -613 -10737 -51744 -92646 -30609 50364 93284 71103 86822 72200 30810 17592
13340 17592 -10044 -5297 80504 88222 67130 -28423 16037 54435 -51355 -58627 -39840 -22304
13328 -22304 -49552 -40543 -4202 73950 81421 22900 49494 17440 -53052 -128810 -161631 -176626
$$ packed form
13409b7376N5998L5990j9764l5239k4535K740K9685p788L2569o1445p0717k3015
13397a12897k6728J01832K0522l9608J7529r8711j3877J19138J12415j06209p3978
13386a00572M8236k9757k4921R6094N0485q5623m4957K1857J9848k8840K7792
13375e0358J69241M5469r4724j46667j9118j2922m0619J18078K3008m4727L5724
13364a7615K4131O2429O8428L1653m4936L0300j0994m8615L2233m7555P757m6775
13352D0441m1054j0124m1007m0902O2037Q0973M2920k2181J5719j4622m1390j3218
13340A7592k7636M747Q5801P718k1092r5553M4460L8398j05790p272J8787J7536
13328b2304k7248R009L6341P8152P471n8521K6594l2054p0492p5758l2821j4995
$$ plain form
13316 -176626 -219713 -162007 -55746 21296 59298 127158 -2848 -13679 -84933 -70611 -96650
13305 -96650 -176524 -186463 -159655 -91097 -71512 -122242 -122883 -93426 -82440 -33471 -47775 -115163
13293 -115163 -54667 -21125 -33450 34796 126885 93113 64285 55970 65532 34488 60446 98839
13281 98839 124084 93340 168551 151035 148351 155942 134607 85846 44047 13294 -49884 -15850
13269 -15850 -66740 -112967 -21232 43506 54916 9842 -24795 -37010 -29749 -5686 -27075 -22938
13257 -22938 45260 76318 46901 65334 103419 86942 52912 58861 47583 -32528 -83580 17030
13245 17030 83749 61955 7144 19680 7349 -20856 -56277 -28642 12175 -43507 -21491 -76769
13233 -76769 -59401 10675 25099 -56793 934 21212 31565 22676 -55395 -54164 11708 104032
$$ packed form
13316a76626m3087N7706J06261P7042L8002O7860j30006j0831p1254J4322k6039
13305i6650p9874r939K6808O8558J9585n0730o41K9457J0986M8969j4304o7388
13293a15163O0496L3542j2325O8246R2089l3772k8828q315R562l1044K5958L8393
13281I8839K5245l0744P5211j7516k684P591k1335m8761m1799l0753o3178L4034
13269a5850n0890m6227R1735O4738J1410m5074l4637j2215P261K4063k1389M137
13257b2938O8198L1058k9417J8433L8085j6477l4030N949j1278q0111n1052J00610
13245A7030O6719k1794n4811J2536j2331k8205l5421K7635M0817n5682K2016n5278
13233g6769J7368P0076J4424q1892N7727K0278J0353q889p8071J231O5872R2324
$$ plain form
13221 104032 127788 126369 78509 28626 62378 105421 61277 71608 111583 153145 37935
13210 37935 -29345 -68014 -56480 -25886 -15902 -55115 1765 26308 68561 28603 48641 51737
13198 51737 -21135 -38578 -81219 -55767 -47138 -94569 -125066 -172349 -159716 -85685 -552 74248
13186 74248 88774 80024 41430 -17737 5145 -85299 -161951 -91323 -63364 -49469 16248 -21116
13174 -21116 -41148 -51568 60746 128786 89885 -30293 64377 97058 64831 104058 93043
13163 93043 47362 -39345 -27388 -17629 -13455 -12620 -66927 -86610 -85259 -41736 -68285 -142963 -86303
13150 -86303 -59179 -102003 -85198 -57750 -56313 3309 34865 14172 21349 -7874 -13304 29037
13138 29037 95698 102380 65499 103726 140469 144801 95698 90002 128206 134771 88281 48943
$$ packed form
13221A04032K3756j419m7860m9883L3752M3043m4144J0331L9975M1562j15210
13210C7935o7280l8669J1534L0594R984l9213N6880K4543M2253l9958K0038L096
13198E1737p2872j7443m2641K5452Q629m7431l0497m7283J2633P4031Q5133P4800
13186G4248J4526q750l8594n9167K2882r0444p6652P0628K7959J3895O5717l7364
13174b1116k0032j0420J12314O8040l8901j20178R4670L2681l2227L9227j1015
13163I3043m5681q6707J1957R759M174Q35n4307j9683J351M3523k6549p4678N6660
13150h6303K7124m2824J6805K7448J437N9622L1556k0693P177k9223n430M2341
13138B9037O6661O682l6881L8227L6743M332m9103n696L8204O565m6490l9338
$$ plain form
13126 48943 24909 90776 156179 126463 13036 -21171 -7219 -2763 7667 30236 22582 -5270
13114 -5270 66921 10397 -114073 -28175 -19529 2108 -40396 -84803 -113472 -49471 -51265 50857
13102 50857 139198 92398 95852 156810 85652 115 11634 10320 41638 26748 81349 183826
13090 183826 204637 106350 -7461 -37482 -49586 -13937 -49756 -125961 -133223 -183633 -184638 -162629
13078 -162629 -78995 -111126 -122446 -80444 -24197 -109307 -127299 -138170 -59276 6618 24916
13067 24916 -1855 -33274 63651 38872 1953 47615 60806 53161 18658 -17685 21145 92553
13055 92553 84928 22396 -16421 8587 10938 53867 -11412 -79094 -110814 -75957 -34112 -24948
13043 -24948 47200 115842 164459 150450 66552 22381 -55608 -19017 46919 33574 5436 -2272
$$ packed form
13126D8943k4034O5867O5403k9716j13427l4207J3952M456J0430K2569p654k7852
13114e270P2191n6524j24470Q5898Q646K1637m2504m4407k8669O4001j794J02122
13102E0857Q8341m6800L454O0958p1158q5537J1519j314L1318j4890N4601J02477
13090A83826K0811r8287j13811l0021j2104L5649l5819p6205p262n0410j005K2009
13078a62629Q3634l2131j1320M2002N6247q5110j7992j0871P8894O5894J8298
13067B4916k6771l1419R6925k4779l6919M5662J3191p645l4503l6343L8830P1408
13055I2553p625o2532l8817K5008K351M2929o5279o7682l1720L4857M1845R164
13043b4948P2148O8642M8617j4009q3898m4171p7989L6591O5936j3345k8138p708
$$ plain form
13031 -2272 38159 36922 -18704 -68836 -52938 28179 45889 -72949 -19969 53990 30534 44612
13019 44612 62082 9916 -40193 -16601 -67983 -36418 3549 -51056 -70550 -45166 -1639 8017
13007 8017 -4554 -50265 -70324 -72725 -82989 5351 21125 26856 -8608 -17267 28675 56057
12995 56057 105932 206221 175404 214055 221373 199505 161864 56189 40129 35675 20120 37193
12983 37193 36168 64465 68674 83823 91506 113984 68774 65918 54871 6263 73103 171752
12971 171752 203540 137014 97401 70234 79767 -67980 -102871 -161978 -177556 -114449 -80068
12960 -80068 -18161 10092 2765 -56309 -101463 -79541 -24783 58305 104163 58018 -47903 -62470
12948 -62470 -103949 -178632 -123559 -19574 60227 126004 83901 12013 22785 45533 63791
$$ packed form
13031b272M0431j237n5626n0132J5898Q1117J7710j18838N2980P3959k3456J4078
13019D4612J7470n2166n0109K3592n1382L1565L9967n4605j9494K5384M3527R656
13007H017j2571m5711k0059k401j0264Q8340J5774N731l5464q659M5942K7382
12995E6057M9875J00289l0817L8651P318k1868l7641j05675j6060m454j5555J7073
12983C7193j025K8297M209J5149P683K2478m5210k856j1047m8608O6840R8649
12971A71752L1788o6526l9613k7167R533j47747l4891n9107j5578O3107L4381
12960h0068O1907K8253p327n9074m5154K1922N4758Q3088M5858m6145j05921j4567
12948f2470m1479p4683N5073J03985P9801O5777m2103p1888J0772K2748J8258
$$ plain form
12937 63791 36731 26226 58786 105713 -793 -43772 -111453 -172883 -159531 -85052 -77266 -76200
12925 -76200 -47563 -47155 42252 49911 -11432 58588 33407 -29886 33755 8934 -60095 -86740
12913 -86740 -41784 20238 25565 -12090 -27792 71766 36632 46120 72062 49226 61494 68191
12901 68191 60170 52090 118799 176190 125013 77563 67348 88171 74264 27640 1725 66124
12889 66124 86787 111574 93156 44275 10806 -14267 -1397 37954 105767 165898 162431 162853
12877 162853 108862 64706 34281 24560 98675 192539 96255 75972 66952 69085 91207 41366
12865 41366 -41335 -76868 -68606 -71398 -37976 -27753 2323 -21874 -28287 -29890 -63826 -42607
12853 -42607 -83584 -78214 -127354 -106398 -71541 -78578 -98837 -84335 -46787 4304 -40373 -15268
$$ packed form
12937F3791k7060j0505L2560M6927j06506m2979o7681o1430J3352P4479P786J066
12925g6200K8637M08Q9407P659o1343P0020k5181o3293O3641k4821o9029k6645
12913h6740M4956O2022N327l7655j5702R9558l5134R488K5942k2836J2268O697
12901F8191q021q080O6709N7391n1177m7450j0215K0823j3907m6624k5915O4399
12889F6124K0663K4787j8418m8881l3469k5073J2870L9351O7813O0131l467M22
12877A62853n3991m4156l0425r721P4115R3864r6284k0283r020K133K2122m9841
12865D1366q2701l5533Q262k792L3422J0223L0076k4197o413j603l3936K1219
12853d2607m0977N370m9140K0956L4857p037k0259J4502L7548N1091m4677K5105
$$ plain form
12841 -15268 -62493 -80521 -100882 -66349 -22090 -32109 -40335 24111 3950 53725 65581 -19433
12829 -19433 -30870 5986 83768 26728 15354 67455 115215 120134 33126 56073 45807 -49205
12817 -49205 -73281 -44863 -119403 -53409 -7384 -40577 -102457 -114925 -115696 -129470 -108830 -35656
12805 -35656 69643 148253 206077 183824 119451 10252 -36618 -1410 -23276 27902 74018
12794 74018 63134 -45537 -45185 45288 121219 155714 140303 56708 -51907 -73334 14147 43335
12782 43335 28013 33309 -50306 -110336 -76536 -11445 10354 11553 -13123 41818 55516 93040
12770 93040 93485 19078 -37900 -179586 -170132 1948 -55194 -122861 -44409 6813 -37089 65017
12758 65017 62695 -25602 47940 95293 156709 174013 177563 128285 102846 43854 28291 31780
$$ packed form
12841a5268m7225j8028k0361L4533M4259j0019q226O4446k0161M9775J1856q5014
12829a9433j1437L6856P7782n7040j1374N2101M7760M919q7008K2947j0266r5012
12817d9205k4076K8418p4540O5994M6025l3193o1880j2468p71j3774K0640P3174
12805c5656J05299P8610N7824k2253o4373j09199m6870L5208k1866N1178M6116
12794G4018j0884j08671L52R0473P5931L4495j5411q3595j08615k1427Q7481K9188
12782D3335j5322N296q3615o0030L3800O5091K1799J199k4676N4941J3698L7524
12770I3040M45p4407n6978j41686R454J72080n7142o7667P8452N1222m3902J02106
12758F5017k322q8297P3542M7353O1416J7304L550m9278k5439n8992j5563L489
$$ plain form
12746 31780 29297 5916 21670 47174 60518 -30812 -59201 -152815 -104163 21440 74068 59644
12734 59644 99749 161951 180402 113195 26647 -55821 -107412 -92206 -62168 -58897 -3444 30192
12722 30192 18352 27506 44913 46458 -21753 -11970 29931 -56634 -56547 -28105 -22637 -54418 -37454
12709 -37454 -92554 -129550 -108522 -107672 -111843 -71092 -38486 -33695 -84978 -54021 72028 161267
12697 161267 74382 10987 72999 114253 99379 87025 8241 -106881 -159414 -55326 9104
12686 9104 44747 71560 8831 25645 76710 -43990 -120283 -140328 -96210 -58997 -115441 -100560
12674 -100560 -16410 74228 74050 59362 -8037 -89775 -55855 6225 51396 65777 2447 10913
12662 10913 27146 44378 -17660 1648 -1187 73018 110184 98347 134865 151392 76981 77120
$$ packed form
12746C1780k483k3381J5754K5504J3344r1330k8389r3614M8652J25603N2628j4424
12734E9644M0105O2202J8451o7207q6548q2468n1591J5206L0038L271N5453L3636
12722C0192j1840R154J7407J545o8211R783M1901q6565Q7K8442N468l1781J6964
12709c7454n5100l6996K1028Q50m171M0751L2606M791n1283L0957J26049Q9239
12697A61267q6885o3395O2012M1254j4874j2354p8784j15122n2533J04088O4430
12686I104L5643K6813o2729J6814N1065j20700p6293k0045M4118L7213n6444J4881
12674a00560Q4150R0638j78j4688o7399q1738L3920O2080M5171J4381o3330Q466
12662A0913J6233J7232o2038J9308k835P4205L7166j1837L6518J6527p4411J39
$$ plain form
12650 77120 150404 114860 87255 46032 45498 95646 51380 -2105 -25198 -6369 5401 94672
12638 94672 -44352 -68255 -85313 -153679 -101068 -35882 -19380 -22071 10986 80895 141769 80801
12626 80801 107782 116866 126055 167110 148900 -10080 -54726 -9060 67454 116134 73410 -58646
12614 -58646 -164633 -180469 -118433 -5744 35618 -4665 -81489 -180043 -125620 14723 87684
12603 87684 88016 48013 106898 161833 112478 -36262 -16506 39281 118094 92575 -8740 -38290
12591 -38290 -11347 4559 31448 2544 2293 -40504 -72731 -29004 5764 -23801 -9048 15211
12579 15211 16140 2468 13642 14471 2884 -3776 18793 101765 181444 186160 114695 120700 192758
12566 192758 209511 204011 288901 319323 331410 356029 294084 259949 180351 174626 180810 147412
$$ packed form
12650G7120P3284l5544k7605m1223n34N0148m4266n3485k3093J8829J1770Q9271
12638I4672j39024k3903j7058o8366N2611O5186J6502k691L3057O9909O0874o0968
12626H0801K6981R084R189M1055j8210j58980m4646M5666P6514M8680m2724j32056
12614e8646j05987j5836O2036J12689M1362m0283p6824r8554N4423J40343P2961
12603H7684L32m0003N8885N4935m9355j48740J9756N5787P8813k5519j01315k9550
12591c8290K6943J5906K6889k8904k51m2797l2227M3727L4768k9565J4753K4259
12579A5211R29j3672J1174Q29j1587o660K2569Q2972P9679M716p1465O005P2058
12566A92758J6753n500Q4890L0422J2087K4619o1945l4135p9598n725O184l3398
$$ plain form
12554 147412 128111 165069 112248 91715 104206 74602 78164 24080 -16718 -9681 -37979 81489
12542 81489 170655 216131 286048 326692 340491 395107 372630 316680 301077 331537 285453 248705
12530 248705 180441 184245 161896 207934 264338 195415 111634 61770 -37420 -87728 -116094 -75110
12518 -75110 12742 38882 43527 50402 67760 34555 53892 160439 300138 374380 283907 255608
12506 255608 343693 388170 352392 380187 468770 434020 349829 207043 168084 190408 128344
12495 128344 146113 196829 201296 144458 159662 250195 255791 172646 126490 121885 -7182 -33851
12483 -33851 45272 8692 -33380 21784 121600 119893 -25820 -59702 -2398 -24346 25276 117156
12471 117156 179295 146070 52172 52350 65271 -40004 -46198 70107 163511 120252 93225 62913
$$ packed form
12554A47412j9301L6958n2821k0533J2491k9604L562n4084m0798P037k8298J19468
12542H1489Q9166M5476O9917M0644J3799N4616k2477n5950j5603L0460m6084l6748
12530B48705o8264L804k2349M6038N6404o8923q3781m9864r9190n0308k8366M0984
12518g5110Q7852K6140M645O875J7358l3205J9337J06547J39699P4242r0473k8299
12506B55608Q8085M4477l5778K7795Q8583l4750q4191j42786l8959K2324o2064
12495A28344J7769N0716M467n6838J5204R0533N596q3145m6156m605j29067k6669
12483c3851P9123l6580m2072N5164R9816j707j45713l3882N7304k1948M9622R1880
12471A17156O2139l3225r3898J78J2921j05275o194J16305R3404m3259k7027l0312
$$ plain form
12459 62913 7696 -37068 -69422 -33240 65223 102679 139809 90692 39278 -33878 -61954 -56833
12447 -56833 34681 128409 37075 -38738 -124806 -57442 -3728 -23664 -8570 -27047 -19844 -120936
12435 -120936 -141040 -55370 -68297 20690 75871 97950 42870 -17813 -7584 60286 83741
12424 83741 117843 90916 -68314 -144396 -72945 251 -22833 -36626 -23897 -13971 -26229 -78236
12412 -78236 50925 139556 108324 82366 96530 29923 32481 -4334 -66082 -105674 -122669 -37726
12400 -37726 22326 7205 25921 44254 32476 17382 43031 97262 128654 77652 5733 -109036
12388 -109036 -136460 -148461 -126317 -138173 -98962 9148 76681 22686 6552 22002 -6713
12377 -6713 -20047 84507 131576 67965 96736 115500 141379 160033 96803 36533 -24139 -2235
$$ packed form
12459F2913n5217m4764l2354L6182R8463L7456L7130m9117n1414p3156k8076N121
12447e6833R1514R3728r1334p5813q6068O7364N3714j9936J5094j8477P203j01092
12435a20936k0104Q5670j2927Q8987N5181K2079n5080o0683J0229O7870K3455
12424H3741L4102k6927j59230p6082P1451P3196k3084j3793J2729R926j2258n2007
12412g8236J29161Q8631l1232k5958J4164o6607K558l6815o1748l9592j6995Q4943
12400c7726O0052j5121J8716J8333j1778j5094K5649N4231L1392n1002p1919j14769
12388a09036k7424j2001K2144j1856L9211J08110O7533n3995j6134J5450k8715
12377f713j3334J04554M7069o3611K8771J8764K5879J8654o3230o0270o0672K1904
$$ plain form
12365 -2235 3345 14246 54042 72047 142916 204305 224512 206262 164817 112581 164810 148888
12353 148888 194783 245147 216466 88142 61622 55531 -41269 -123329 -79010 -27959 20225
12342 20225 116747 162615 107989 -40304 -67253 -4712 130493 136916 32344 89755 29517
12331 29517 -7687 12310 6556 36748 87722 100165 121707 84467 165032 187577 175788 175210
12319 175210 147681 180199 234184 287572 334288 338371 414200 357725 231735 219649 213443 201671
12307 201671 219977 282992 329523 438401 537420 589562 618389 658360 661526 737743 755626
12296 755626 801255 790683 862738 853152 718105 671815 610815 540761 439668 425247 430875
12285 430875 397130 346776 377555 386519 354820 342734 342653 328849 278584 220460 256588 235053
$$ packed form
12365b235N580J0901L9796J8005P0869O1389K0207j8250m1445n2236N2229j5922
12353A48888M5895N0364k8681j28324k6520o091r6800q2060M4319N1051M8184
12342B0225R6522M5868n4626j48293k6949O2541J35205O423j04572N7411o0238
12331B9517l7204J9997n754L0192N0974J2443K1542l7240Q0565K2545j1789n78
12319A75210k7529L2518N3985N3388M6716M083P5829n6475j25990j2086o206j1772
12307B01671J8306O3015M6531J08878R9019N2142K8827L9971L166P6217J7883
12296G55626M5629j0572P2055r586j35047m6290o1000p0054j01093j4421N628
12285D30875l3745n0354L0779Q964l1699j2086q1j3804n0265n8124L6128k1535
$$ plain form
12273 235053 218114 247334 250483 257580 288987 256190 317359 403980 366514 259688 333842 461270
12261 461270 475124 452016 457915 402031 343174 256970 256755 275410 278633 290616 316549 337974
12249 337974 384310 328130 315265 404247 493362 579669 659583 706832 732069 704134 631599
12238 631599 533375 429306 404267 421157 324279 319386 335677 280982 377310 462102 372787
12227 372787 385314 394866 385997 392200 423439 467825 436925 356571 381364 450096 423929 390710
12215 390710 375967 311003 305206 378277 393531 540602 584159 584718 611552 528226 518443 560688
12203 560688 632869 641273 598212 542989 506598 476516 515888 502956 562875 509119 432186 417439
12191 417439 479353 490396 516351 513995 508286 385081 260551 280457 370527 403625 470481
$$ packed form
12273B35053j6939K9220L149P097L1407l2797O1169Q6621l7466j06826P4154J27428
12261D61270J3854k3108N899n5884n8857q6204k15J8655L223J1983K5933K1425
12249C37974M6336n6180j2865Q8982Q9115Q6307P9914M7249K5237k7935p2535
12238F31599r8224j04069k5039J6890r6878m893J6291n4695R6328Q4792q9315
12227C72787J2527R552q869O203L1239M4386l0900q0354K4793O8732k6167l3219
12215C90710j4743o4964n797P3071J5254J47071M3557N59K6834q3326r783M2245
12203E60688P2181Q404m3061n5223l6391l0082L9372j2932N9919n3756p6933j4747
12191D17439O1914J1043K5955k356n709j23205j24530J9906R0070L3098O6856
$$ plain form
12180 470481 502651 554787 503388 414845 383832 415362 415956 424264 472725 540206 560639 500655
12168 500655 444255 495078 628089 671686 689072 744808 766509 792789 737764 652044 669446
12157 669446 715002 806505 912348 967321 1017994 1158507 1280518 1422789 1483921 1594873
12147 1594873 1832763 2004556 2176410 2539621 2908230 3350358 3998235 4818035 5844116
12138 5844116 7190421 9022605 11742388 15948137 22121601 30055667 38653259 45507538
12130 45507538 49447331 50464140 48571651 43573661 36283778 28509033 21873771 17052791
12122 17052791 13804200 11608627 10153590 9309979 8759457 8460045 8424072 8641743 9211533
12113 9211533 10078511 11302403 13256536 16253667 20775508 27572544 37350918 49215279
$$ packed form
12180D70481L2170N2136n1399q8543l1013L1530N94Q308M8461O7481K0433n9984
12168E00655n6400N0823J33011M3597J7386N5736K1701K6280n5025q5720J7402
12157F69446M5556R1503J05843N4973N0673J40513J22011J42271O1132J10952
12147A594873K37890J71793J71854L63211L68609M42128O47877Q19800J026081
12138E844116J346305J832184K719783M205749O173464P934066Q597592O854279
12130D5507538L939793J016809j892489m997990p289883p774745o635262m820980
12122A7052791l248591k195573j455037q43611n50522k99412l5973K17671N69790
12113I211533Q66978J223892J954133K997131M521841O797036R778374J1864361
$$ plain form
12105 49215279 60132244 67628895 72098204 75650748 78723007 79306453 75587807 67271076
12097 67271076 56217806 45560297 37632105 33214463 32428429 35323935 41507623 48542246
12089 48542246 52303242 49652797 41615690 32125163 24215498 18800602 15562536 13574105
12081 13574105 12415464 11732713 11567163 11923252 12821262 14135732 16086171 19222759 24116340
12072 24116340 31673124 42795889 56945589 71442899 81837626 84708073 79132460
12065 79132460 67141368 52611638 39235826 28885003 21768254 16839367 13459869
12058 13459869 11072836 9222365 7628298 6438141 5644558 4875545 4291974 3855217 3459034
12049 3459034 3168590 2951519 2745142 2475962 2205178 1948755 1840181 1700798 1573108
$$ packed form
12105D9215279J0916965P496651M469309L552544L072259N83446l718646q316731
12097F7271076j1053270j0657509p928192m417642p86034K895506O183688P034623
12089D8542246L760996k650445q037107r490527p909665n414896l238066j988431
12081A3574105j158641o82751j65550L56089Q98010J314470J950439L136588M893581
12072B4116340P556784J1122765J4149700J4497310J0394727K870447n575613
12065G9132460j1991092j4529730j3375812j0350823p116749m928887l379498
12058A3459869k387033j850471j594067j190157p93583p69013n83571m36757l96183
12049C459034k90444k17071k06377k69180k70784k56423j08574j39383j27690
$$ plain form
12040 1573108 1465476 1313167 1215794 1142967 1036202 1030706 1049208 1040267 1059893 1007346 957817
12029 957817 952323 919418 838317 827239 772601 676579 620319 709896 745454 666925 595268 537036
12017 537036 552558 638014 606251 530345 567740 627253 580549 606101 581243 553150 549537 492491
12005 492491 395636 364821 435765 482752 482400 471599 500063 450947 382071 371892 430913 420075
11993 420075 405724 442024 426779 403566 306347 228806 271331 274215 279240 245016 223111 291389
11981 291389 408231 366967 324036 232015 242341 248351 269604 381838 442217 385286 445085
11970 445085 517649 465412 410524 362864 364225 335532 332356 353874 507738 561152 596489 757500
11958 757500 837953 742268 623675 589978 493318 410640 336180 301304 364604 426737 416721
$$ packed form
12040A573108j07632j52309r7373p2827j06765n496J8502q941J9626n2547m9529
12029I57817n494l2905q1101j1078n4638r6022n6260Q9577L5558p8529p1657n8232
12017E37036J5522Q5456l1763p5906L7395N9513m6704K5552k4858k8093l613n7046
12005D92491r6855l0815P0944M6987l52j0801K8464m9116o8876j0179N9021j0838
11993D20075j4351L6300j5245k3213r7219p7541M2525K884N025l4224k1905O8278
11981B91389J16842m1264m2931r2021J0326O010K1253J12234O0379n6931N9799
11970D45085P2564n2237n4888m7660J361k8693l176K1518J53864N3414L5337J61011
11958G57500Q0453r5685j18593l3697r6660q2678p4460l4876O3300O2133j0016
$$ plain form
11947 416721 400987 452255 439510 361153 459605 597910 619380 609269 741231 846688 770678
11936 770678 701632 629806 496756 423522 417670 387288 261475 229591 233887 322911 282877
11925 282877 314824 321283 256851 245293 255569 257846 287416 310844 380211 415669 381098 360014
11913 360014 377464 399083 476870 512858 474214 381392 278203 269707 298415 268387 276341 243174
11901 243174 210547 211669 281371 343827 332544 368928 433474 454284 431882 471549 481240 419511
11889 419511 461241 469905 422337 474419 534068 519505 395923 350349 446160 373354 397565
11878 397565 501470 517250 474804 520002 619443 689923 700791 661959 576209 588754 636979
11867 636979 646994 640907 664789 766038 816692 801886 804989 779815 857314 1023438 1109429
$$ packed form
11947D16721j5734N1268j2745p8357R8452J38305K1470j0111J31962J05457p6010
11936G70678o9046p1826j33050p3234n852l0382j25813l1884M296Q9024m0034
11925B82877L1947O459o4432j1558J0276K277K9570K3428O9367L5458l4571k1084
11913C60014J7450K1619P7787L5988l8644r2822j03189q496K8708l0028P954l3167
11901B43174l2627J122O9702O2456j1283L6384O4546K0810k2402L9667R691o1729
11889D19511M1730Q664m7568N2082N9649j4563j23582m5574R5811p2806K4211
11878C97565J03905J5780m2446M5198R9441P0480J0868l8832q5750J2545M8225
11867F36979J0015o087K3882J01249N0654j4806L103k5174P7499J66124Q5991
$$ plain form
11856 1109429 1181710 1179490 1268927 1370961 1420203 1438707 1477908 1683267 1970828 2175815 2385738
11845 2385738 2679255 2954389 3279663 3750388 4370936 5063988 5911705 6941990 8450515
11836 8450515 10452066 13320074 17710308 24422336 34449705 48298586 64378442 78361302
11828 78361302 85791697 84239059 74210429 59520182 44935295 33445277 25535710
11821 25535710 20349096 16953089 14855200 13494619 12514713 11804863 11360156 11368082 12153435
11812 12153435 13799512 16614771 21478630 29179809 39305084 48769133 52602369 48868619
11804 48868619 41089584 34024263 30445098 30716906 34680917 42455581 53664252 65942966
11796 65942966 75732212 80373222 79961810 77070720 74243005 70796646 63782355 52604258
$$ packed form
11856A109429P2281k220Q9437J02034M9242J8504L9201K05359K87561K04987K09923
11845B385738K93517K75134L25274M70725O20548O93052Q47717J030285J508525
11836H450515K001551K868008M390234O712028J0027369J3848881J6079856J3982860
11828G8361302P430395j552638j0028630j4690247j4584887j1490018p909567
11821B5535710n186614l396007k097889j360581r79906p09850m44707P926P85353
11812A2153435J646077K815259M863859P701179J0125275R464049L833236l733750
11804D8868619p779035p065321l579165K71808L964011P774664J1208671J2278714
11796F5942966R789246M641010m11412k891090k827715l446359p014291j1178097
$$ plain form
11788 52604258 40342316 30289927 23166464 18454474 15329172 13140966 11571047 10466891
11780 10466891 9748420 9277665 9068964 8988965 9085489 9634446 10637588 12386149 15258219
11771 15258219 19720160 26249600 34638128 43037352 48910903 51532962 51395313 48092130
11763 48092130 41171424 32294246 23914640 17539685 13164421 10384426 8578042 7130893
11755 7130893 6066893 5179882 4404193 3800860 3369947 2985750 2643532 2349735 2121531
11746 2121531 1875758 1692607 1511822 1391212 1291416 1170934 967516 859705 857773 805214
11736 805214 781623 721883 635228 485382 421450 527384 635891 750225 815080 784400 764446
11725 764446 691708 613133 611900 548690 532180 521650 476141 337198 295109 322285 378279
$$ packed form
11788E2604258j2261942j0052389p123463m711990l125302k188206j569919j104156
11780A0466891p18471m70755k08701p9999R6524N48957J003142J748561K872070
11771A5258219M461941O529440Q388528Q399224N873551K622059j37649l303183
11763D8092130o920706q877178q379606o374955m375264k779995j806384j447149
11755G130893j064000q87011p75689o03333m30913l84197l42218k93797k28204
11746B121531k45773j83151j80785j20610r9796j20482k03418j07811j932n2559
11736H05214k3591n9740q6655j49846o3932J05934J08507J14334O4855l0680j9954
11725G64446p2738p8575j233o3210j6510j0530m5509j38943m2089K7176N5994
$$ plain form
11714 378279 480737 438402 395453 424562 305000 156926 218796 299947 350367 374007 410743
11703 410743 356344 284019 330553 405914 386632 387290 390431 463614 387372 425062 439469 485790
11691 485790 490130 433947 578402 841669 965946 1053997 1391895 1849390 2288881 2660816
11681 2660816 2878263 2789781 2425791 1907637 1436410 974601 737134 637006 541537 519487
11671 519487 594411 619075 494868 471648 519881 563422 547296 504184 435494 427460 484665
11660 484665 420309 351049 317522 322991 425586 414267 465191 460776 455735 536318 566020 622037
11648 622037 690347 690252 686855 763494 743861 599036 524582 435913 427025 489710 484215 315199
11636 315199 169133 143485 175039 111518 115529 175512 179473 171900 218986 266771 207181 164711
$$ packed form
11714C78279J02458m2335m2949K9109j19562j48074O1870Q1151N0420K3640L6736
11703D10743n4399p2325M6534P5361j9282O58L141P3183p6242L7690J4407M6321
11691D85790M340n6183J44455K63267J24277Q8051L37898M57495M39491L71935
11681B660816K17447q8482l63990n18154m71227m61809k37467j00128r5469k2050
11671E19487P4924K4664j24207k3220M8233M3541j6126m3112o8690q034N7205
11660D84665o4356o9260l3527N469J02595j1319N0924m415n041Q0583K9702N6017
11648F22037O8310r5l397P6639j9633j44825p4454q8669q888O2685n495j69016
11636C15199j46066k5648L1554o3521M011N9983L961p573M7086M7785n9590m2470
$$ plain form
11624 164711 236524 293632 280360 202186 237970 256571 242571 313131 292657 321085 347138
11613 347138 314947 257538 220406 178422 103409 75908 200950 201286 116127 57604 32844 113046
11601 113046 121481 206058 235229 225872 187619 168698 107265 66148 79447 68635 83061 74261
11589 74261 111124 75533 62920 53870 52363 106497 115434 125850 135793 187368 257644 214895
11577 214895 211563 233926 198786 200436 285675 288796 225569 202238 189738 217212 205989 273149
11565 273149 274604 250854 293537 381060 456136 476851 580539 925512 1247508 1691961 2239768
11554 2239768 2553540 2541938 2309269 1937611 1367236 866973 539192 394029 333347 352551
11544 352551 260932 148765 136028 123417 83478 49225 85326 53301 6788 18363 48089
$$ packed form
11624A64711P1813N7108j3272p8174L5784J8601j4000P0560k0474K8428K6053
11613C47138l2191n7409l7132m1984p5013k7501J25042L36q5159n8523k4760Q0202
11601A13046Q435Q4577K9171r357l8253j8921o1433m1117J3299j0812J4426q800
11589G4261L6863l5591j2613r050j507N4134Q937J0416R943N1575P0276m2749
11577B14895l332K2363l5140J650Q5239L121o3227k3331j2500K7474j1223O7160
11565B73149J455k3750M2683Q7523P5076K0715J03688L44973L21996M44453N47807
11554B239768L13772j1602k32669l71658n70375n00263l27781j45163o0682J9204
11544C52551r1619j12167j2737j2611l9939l4253L6101l2025m6513J1575K9726
$$ plain form
11533 48089 41959 101753 138969 114540 152206 164041 125972 79534 -5188 -74518 990 78574
11521 78574 92877 51898 29896 101481 113948 138262 196885 212670 138500 47616 179180
11510 179180 207064 164024 209439 298581 362098 356323 308903 263188 246813 237848 185149 28781
11498 28781 -15173 15222 -1766 14938 53607 96421 170831 178044 99561 63248 26038 -21335
11486 -21335 -30955 -2000 52143 74617 61251 110706 156145 167186 174052 128865 66442 78763
11474 78763 123416 51512 78187 69660 12786 5938 69119 141236 64870 41441 22586 97452
11462 97452 202231 222610 207549 122538 15780 -45962 -6984 -13405 -46827 -44617 -46903 26109
11450 26109 155711 196143 73479 10703 88388 95694 59455 14267 73446 186884 235296
$$ packed form
11533D8089o130N9794L7216k4429L7666J1835l8069m6438q4722o9330P5508P7584
11521G8574J4303m0979k2002P1585J2467K4314N8623J5785p4170r0884J31564
11510A79180K7884m3040M5415Q9142O3517n775m7420m5715j6375q965n2699j56368
11498B8781m3954L0395j6988J6704L8669M2814P4410P213p8483l6313l7210m7373
11486b1335r620K8955N4143K2474j3366M9455M5439J1041O866m5187o2423J2321
11474G8763M4653p1904K6675q527n6874o848O3181P2117p6366k3429j8855P4866
11462I7452J04779K0379j5061q5011j06758o1742L8978o421l3422K210k286P3012
11450B6109J29602M0432j22664o2776P7685P306l6239m5188N9179J13438M8412
$$ plain form
11439 235296 233169 223347 206082 287884 246566 190758 126550 87035 91882 79443 14113 -47493
11427 -47493 -141673 -94796 -84454 -39716 107781 184536 207434 208289 242553 177884 156652 100000
11415 100000 89121 65074 39220 -12189 -92958 -68602 -74605 -77704 -104434 -20857 55961 121652
11403 121652 132171 46458 56692 43947 197384 200942 198004 111994 172796 202331 182863 228878
11391 228878 302328 440982 492020 469371 450148 376548 285643 315471 427950 454737 499601
11380 499601 674633 797678 836519 802322 685113 611495 543834 404982 370287 436639 484167
11369 484167 533962 541433 610392 623165 657865 607053 533042 497868 504679 539961 555881 767340
11357 767340 888556 933433 893288 838808 729933 629892 587047 755021 842304 728716
$$ packed form
11439B35296k127r822j7265Q1802m1318n5808o4208l9515M847j2439o5330o1606
11427d7493r4180M6877J0342M4738J47497P6755K2898Q55L4264o4669k1232n6652
11415A00000j0879k4047k5854n1409q0769K4356o003l099k6730Q3577P6818O5691
11403A21652J0519q5713J0234j2745J53437L558k938q6010O0802K9535j9468M6015
11391B28878P3450J38654N1038k2649j9223p3600r0905K9828J12479K6787M4864
11380D99601J75032J23045L8841l4197j17209p3618o7661j38852l4695O6352M7528
11369D84167M9795P471O8959J2773L4700n0812p4011l5174O811L5282J5920K11459
11357G67340J21216M4877m0145n4480j08875j00041m2845J67974Q7283j13588
$$ plain form
11347 728716 629936 632169 557845 552738 629219 681511 771356 721259 614956 601339 519705 552307
11335 552307 588774 604772 631287 683320 717823 819848 904205 920551 1020770 1254412 1471696
11324 1471696 1605295 1796394 1970010 2089172 2169224 2216031 2369777 2399569 2333015 2332976 2279303
11313 2279303 2247702 2256387 2168606 1977673 1708608 1511901 1410306 1360143 1394482 1346584 1299621
11302 1299621 1298405 1259571 1274521 1329836 1368416 1442176 1398669 1369007 1457141 1573511 1647152
11291 1647152 1680733 1776848 1836034 1950568 2090231 2264435 2434718 2555121 2737033 3029539
11281 3029539 3318383 3592753 3890143 4298953 4725523 5139883 5578018 5970301 6456060
11272 6456060 7086535 7920488 9009559 10413741 12363917 14804360 17866634 21427201
$$ packed form
11347G28716r8780K233p4324n107P6481N2292Q9845n0097j06303j3617q1634L2602
11335E52307L6467J5998K6515N2033L4503J02025Q4357J6346J00219K33642K17284
11324A471696J33599J91099J73616J19162Q0052M6807J53746K9792o6554l9n3673
11313B279303l1601Q685q7781j90933k69065j96707j01595n0163L4339m7898m6963
11302A299621j216l8834J4950N5315L8580P3760m3507k9662Q8134J16370P3641
11291A647152L3581R6115N9186J14534J39663J74204J70283J20403J81912K92506
11281C029539K88844K74370K97390M08810M26570M14360M38135L92283M85759
11272F456060O30475Q33953J089071J404182J950176K440443L062274L560567
$$ plain form
11264 21427201 25509128 30486359 37251789 47564274 63753961 90626989 135607913
11257 135607913 206823320 302871745 400142843 463993374 475158495 428520507 340885333
11250 340885333 245113067 167784044 116335488 84350915 64378379 51454441 42588565
11243 42588565 35947810 30627748 26063341 21990331 18485378 15741641 13570296 11876063
11235 11876063 10639384 9501517 8393229 7489119 6807819 6289037 5736294 5356921 5098125
11226 5098125 4756660 4397119 4056398 3752399 3448086 3251828 3016918 2746467 2619163
11217 2619163 2588964 2544111 2486543 2514210 2498577 2362543 2210785 2106830 2014939 1973087 1963716
11206 1963716 1878705 1764309 1647687 1641826 1656838 1594312 1434622 1280092 1304645 1372026 1396850
$$ packed form
11264B1427201M081927M977231O765430J0312485J6189687K6873028M4980924
11257A35607913P1215407R6048425R7271098O3850531J1165121m6637988q7635174
11250C40885333r5772266p7329023n1448556l1984573j9972536j2923938q865876
11243D2588565o640755n320062m564407m073010l504953k743737k171345j694233
11235A1876063j236679j137867j108288r04110o81300n18782n52743l79373k58796
11226E098125l41465l59541l40721l03999l04313j96258k34910k70451j27304
11217B619163l0199m4853n7568K7667j5633j36034j51758j03955r1891m1852r371
11206A963716q5011j14396j16622n861J5012o2526j59690j54530K4553O7381K4824
$$ plain form
11195 1396850 1432107 1397764 1349239 1299547 1312931 1344689 1415836 1439468 1347058 1251059 1212577
11184 1212577 1312014 1396962 1411515 1445097 1430332 1342003 1315635 1300549 1325545 1347986 1413464
11173 1413464 1548789 1638339 1683175 1679114 1661014 1691319 1762803 1840273 1885996 1871071 1963548
11162 1963548 2124286 2309335 2417807 2584311 2663671 2759902 2945062 3175812 3446632 3719327
11152 3719327 4132823 4568254 5004087 5421940 5920599 6611000 7410217 8525106 10013759
11143 10013759 11898903 14103133 16790810 19790270 23050945 26774382 31650713 38740851
11135 38740851 49698855 67178121 95818922 143489386 218814730 319481189 414170788
11128 414170788 467296745 469433419 413819865 321270047 226144457 154211261 108529171
$$ packed form
11195A396850L5257l4343m8525m9692J3384L1758P1147K3632r2410r5999l8482
11184A212577R9437Q4948J4553L3582j4765q8329k6368j5086K4996K2441O5478
11173A413464J35325Q9550M4836m061j8100L0305P1484P7470M5723j4925R2477
11162A963548J60738J85049J08472J66504P9360R6231J85160K30750K70820K72695
11152C719327M13496M35431M35833M17853M98659O90401P99217J114889J488653
11143A0013759J885144K204230K687677K999460L260675L723437M876331P090138
11135C8740851J0958004J7479266K8640801M7670464P5325344J00666459R4689599
11128D14170788N3125957K136674n5613554r2549818r5125590p1933196m5682090
$$ plain form
11121 108529171 80032809 61723964 49627393 41271629 35231159 30525652 26453245
11114 26453245 22753224 19547363 16741527 14348208 12465506 10883053 9569131 8542350
11106 8542350 7725795 7062343 6497404 6004913 5487221 5086310 4764816 4406793 4001478
11097 4001478 3711999 3573940 3376167 3094512 2892043 2766712 2656851 2478420 2320678
11088 2320678 2187415 2153852 2147754 2032084 1936154 1840457 1769050 1635467 1526481 1468737 1453440
11077 1453440 1382337 1264875 1177408 1142489 1079064 1026732 1027296 1059073 986121 928246 843584
11066 843584 805840 792584 778828 748488 666963 608328 547303 505544 600955 640277 554306
11055 554306 477468 641448 746323 816122 674930 605627 682404 640887 615398 612342 643083
$$ packed form
11121A08529171k8496362j8308845j2096571q355764o040470m705507m072407
11114B6453245l700021l205861k805836k393319j882702j582453j313922j026781
11106H542350q16555o63452n64939m92491n17692m00911l21494l58023m05315
11097D001478k89479j38059j97773k81655k02469j25331j09861j78431j57742
11088B320678j33263l3563o098j15670r5930r5697p1407j33583j08986n7744j5297
11077A453440p1103j17462q7467l4919o3425n2332N64L1777p2952n7875q4662
11066H43584l7744j3256j3756l0340q1525n8635o1025m1759R5411L9322q5971
11055E54306p6838J63980J04875O9799j41192o9303P6777m1517k5489l056L0741
$$ plain form
11044 643083 659595 612379 583362 578935 522541 464276 379470 302398 329647 363462 370737 410343
11032 410343 414170 394654 376311 321949 244491 114550 62648 64055 131027 263489 337037
11021 337037 417535 419422 342522 295001 267992 271303 204841 276424 310918 249339 177907 110797
11009 110797 188229 221843 309016 443442 485473 558628 640580 701985 678551 786156 821275
10998 821275 710940 666134 646462 558021 611240 628033 557859 559967 523851 398088 281611
10987 281611 262465 291442 378517 391648 339248 334082 342969 271100 316398 381280 342710 392522
10975 392522 432280 380936 347550 337529 283553 271624 337095 375178 398320 345859 245866
10964 245866 214982 225958 297135 256171 216121 205516 219561 234733 279988 407781 402441
$$ packed form
11044F43083J6512m7216k9017m427n6394n8265q4806p7072K7249L3815P275L9606
11032D10343L827j9516j8343n4362p7458j29941n1902J407O6972J32462P3548
11021C37037Q0498J887p6900m7521k7009L311o6462P1583L4494o1579p1432o7110
11009A10797P7432L3614Q7173J34426M2031P3155Q1952O1405k3434J07605L5119
10998H21275j10335m4806j9672q8441N3219J6793p0174K108l6116j25763j16477
10987B81611j9146K8977Q7075J3131n2400n166Q887p1869M5298O4882l8570M9812
10975C92522L9758n1344l3386j0021n3976j1929O5471L8083K3142n2461r9993
10964B45866l0884J0976P1177m0964m0050j0605J4045J5172M5255J27793n340
$$ plain form
10953 402441 332472 288059 252747 198795 181403 160773 203196 222966 184573 155086 236230
10942 236230 375664 348213 287093 175115 21398 -12633 30421 11636 21548 61397 71733
10931 71733 108709 160294 201368 210141 201828 228671 281418 264579 265494 289618 339066 324379
10919 324379 266384 180110 199568 278673 250198 216698 241696 258437 259869 227224 166504 200833
10907 200833 245691 203749 50832 -3509 -26451 -57755 2698 133945 164045 133697 63411
10896 63411 78007 182063 197506 160806 118459 113051 104853 79569 117079 134403 134046 174723
10884 174723 76361 57147 127251 143754 113460 95225 84259 -33686 -31735 28349 39044
10873 39044 72064 62153 72818 190811 193180 253181 310566 328312 352925 281831 227549 222955
$$ packed form
10953D02441o9969m4413l5312n3952j7392k0630M2423J9770l8393k9487Q1144
10942B36230J39434k7451o1120j11978j53717l4031M3054j8785R912L9849J0336
10931G1733L6976N1585M1074Q773q313K6843N2747j6839R15K4124M9448j4687
10919C24379n7995q6274J9458P9105k8475l3500K4998J6741J432l2645o0720L4329
10907B00833M4858m1942j52917n4341k2942l1304O0453J31247L0100l0348p0286
10896F3411J4596J04056J5443l6700m2347n408q198k5284L7510J7324l57M0677
10884A74723r8362j9214P0104J6503l0294j8235j0966j17945J951O0084J0695
10873C9044L3020r911J0665J17993K369O0001N7385J7746K4613p1094n4282m594
$$ plain form
10861 222955 210251 213201 222094 161785 119284 114818 103387 94356 60432 112615 136627 119071
10849 119071 98526 49955 42818 23690 55939 89111 153362 178540 177418 145646 166574 143327
10837 143327 214519 180196 117204 85657 102709 48604 40706 134168 196389 263827 333267 443766
10825 443766 544327 663110 970757 1531591 2064188 2438997 2651124 2444402 1927052 1432631
10815 1432631 1116303 758277 579820 511615 434899 306818 210448 194112 196834 237225 194755
10804 194755 154184 255761 227068 179790 177177 206964 134772 83402 76638 65997 64368 44575
10792 44575 10115 -4575 12166 15834 43105 -4436 -1880 24063 37764 69619 246 -53027
10780 -53027 -16524 -115006 -89199 -73189 -68977 -8723 33531 94175 121927 121509 124646 126168 149661
$$ packed form
10861B22955j2704K950Q893o0309m2501m466j1431r031l3924N2183K4012j7556
10849A19071k0545m8571p137j9128L2249L3172O4251K5178j122l1772K0928k3247
10837A43327P1192l4323o2992l1547J7052n4105p898R3462O2221O7438O9440J10499
10825D43766J00561J18783L07647N60834N32597L74809K12127k06722n17350m94421
10815A432631l16328l58026j78457o8205p6716j28081r6370j6336K722M0391m2470
10804A94755m0571J01577k8693m7278k613K9787p2192n1370o764j0641j629j9793
10792D4575l4460j4690J6741L668K7271m7541K556K5943J3701L1855o9373n3273
10780e3027L6503r8482K5807J6010M212O0254M2254O0644K7752m18L137J522K3493
$$ plain form
10767 149661 142866 56552 64355 64796 95106 63160 28506 58293 74047 14041 41982 216731
10755 216731 233838 227204 270628 276146 125544 52796 33895 163295 199878 279895 354214
10744 354214 202860 99732 115153 134370 159541 188599 188041 215454 142178 168605 202461
10733 202461 291087 319996 182901 69991 35936 76235 105306 50731 64813 138850 190422
10722 190422 158630 128636 130262 194745 212086 288709 316491 274345 180596 200273 193802 125785
10710 125785 114737 124560 106204 134711 147190 154801 192747 226608 286409 389896 512460
10699 512460 877143 1469282 2038669 2412458 2543236 2429100 2112023 1693899 1150972 714329
10689 714329 544437 422953 310745 274241 220662 180040 132158 145450 101151 44827 37383
$$ packed form
10767A49661o795q6314P803M41L0310l1946l4654K9787J5754o0006K7941J74749
10755B16731J7107o634M3424N518j50602p2748j8901J29400L6583Q0017P4319
10744C54214j51354j03128J5421J9217K5171K9058n58K7413p3276K6427L3856
10733B02461Q8626K8909j37095j12910l4055M0299K9071n4575J4082P4037N1572
10722A90422l1792k9994J626O4483J7341P6623K7782m2146r3749J9677o471o8017
10710A25785j1048R823j8356K8507J2479P611L7946L3861N9801J03487J22564
10699E12460L64683N92139N69387L73789J30778j14136l17077m18124n42927m36643
10689G14329j69892j21484j12208l6504n3579m0622m7882J3292m4299n6324p444
$$ plain form
10678 37383 -9680 6184 -3589 -46839 -81864 -27720 4490 -9114 -11375 -10812 6737 14564 33893
10665 33893 48315 36418 14664 -20673 13878 171472 201905 157178 86443 71261 43370
10654 43370 -30365 -47529 -62169 73205 98981 62114 59985 74103 94967 139799 127146 113819
10642 113819 42836 -8784 -60583 -29276 -51218 -58942 -30086 104502 164342 152177 109013
10631 109013 154370 140830 99325 -9311 -52288 -90600 -20019 12045 46 -36783 73637
10620 73637 65771 12949 -55772 -97647 -62293 -81383 -43659 -35825 33258 88778 39752 -60927
10608 -60927 -86078 -47866 16601 151932 139349 102931 134151 117915 91857 137270 164887
10597 164887 109108 -30974 -51818 -24491 2808 11227 7385 -77531 -182431 -132050 -28181
$$ packed form
10678C7383m7063J5864r773m3250l5025N4144L2210j3604k261N63J7549P827J9329
10665C3893J4422j1897k1754l5337L4551J57594L0433m4727p0735j5182k7891
10654D3370p3735j7164j4640J35374K5776l6867k129J4118K0864M4832j2653j3327
10642A13819p0983n1620n1799L1307k1942p724K8856J34588N9840j2165m3164
10631A09013M5357j3540m1505j08636m2977l8312P0581L2064j1999l6829J10420
10620G3637p866n2822o8721m1875L5354j9090L7724P834O9083N5520m9026j00679
10608f0927k5151L8212O4467J35331j2583l6418L1220j6236k6058M5413K7617
10597A64887n5779j40082k0844K7327K7299Q419l842q4916j04900N0381J03869
$$ plain form
10586 -28181 34115 7600 18854 114705 104182 -11392 53200 77306 59516 68070 97997 81098
10574 81098 5443 -72538 -62155 51224 70381 99663 85020 71722 50673 42191 54622 76215
10562 76215 39435 109190 174533 126797 6049 -86196 -97143 -15952 105152 84471 6472
10551 6472 38658 44548 -5673 -14201 -55209 -102231 -35420 -6883 -18168 75204 198343 195386
10539 195386 194679 193401 225218 242216 191037 78227 -24074 -60564 -3337 67193 115280 162526
10527 162526 231406 135314 63775 12749 -16796 -39796 -80682 -41090 -12511 71828 95103
10516 95103 85513 110595 91155 13989 34482 -5942 -122046 -117013 -74349 -11045 41431 78027
10504 78027 140798 132133 106153 95119 163021 49940 8400 122879 138478 149875 130618
$$ packed form
10586b8181O2296k6515J1254R5851j0523j15574O4592K4106j7790Q554K9927j6899
10574H1098p5655p7981J0383J13379J9157K9282j4643j3298k1049q482J2431K1593
10562G6215l6780O9755O5343m7736j20748r2245j0947Q1191J21104k0681p7999
10551F472L2186N890n0221q528m1008m7022O6811K8537j1285R3372J23139k957
10539A95386p07j278L1817J6998n1179j12810j02301l6490N7227P0530M8087M7246
10527A62526O8880r6092p1539n1026k9545k3000m0886L9592K8579Q4339K3275
10516I5103r590K5082j9440p7166K0493m0424j16104N033M2664O3304N2476L6596
10504G8027O2771q665k5980j1034O7902j13081m1540J14479J5599J1397j9257
$$ plain form
10493 130618 28947 -56231 -52727 29021 -22041 45242 93959 94749 -3748 -62326 -55094 -37223
10481 -37223 47307 51594 -56471 -64178 15772 -37207 -55427 -36173 -42020 -7720 -13604 54347
10469 54347 95608 -19091 -60833 -46905 -1174 -45575 -86052 -74216 -54988 24814 30388 12901
10457 12901 61795 151353 104366 -4114 -14594 25037 16442 27058 58821 61045 173545 189401
10445 189401 241984 206841 158500 110254 -6046 48110 96585 113172 197181 177590 118452
10434 118452 64781 -51148 -79161 -96435 -64422 -2999 15492 15528 66533 140414 65281 13600
10422 13600 -5764 -36856 53731 108396 -45667 -48507 22314 75860 23708 -83745 -83631 -10988
10410 -10988 45078 39609 10109 56187 185277 208461 101186 32801 -37380 11432 94050
$$ packed form
10493A30618j01671q5178L504Q1748n1062O7283M8717P90r8497n8578P232J7871
10481c7223Q4530M287j08065p707P9950n2979j8220J9254n847L4300n884O7951
10469E4347M1261j14699m1742J3928M5731m4401m0477J1836J9228P9802N574j7487
10457A2901M8894Q9558m6987j08480j0480L9631q595J0616L1763K224J12500J5856
10445A89401N2583l5143m8341m8246j16300N4156M8475J6587Q4009j9591n9138
10434A18452n3671j15929k8013j7274L2013O1423J8491L6N1005P3881p5133n1681
10422A3600j9364l1092R0587N4665j54063k840P0821N3546n2152j07453J14P2643
10410a0988N6066n469k9500M6078J29090K3184j07275o8385p0181M8812Q2618
$$ plain form
10399 94050 42617 11618 -58260 -72666 -8809 18730 -65067 -26844 -87659 -69060 -1395 58581
10387 58581 24866 2686 -23683 -32265 -23269 -2291 10262 22798 88206 -42335 -103718 -54829
10375 -54829 -96436 -54143 8876 15788 -1509 -47213 -86497 -95183 -99927 19956 79500 32005
10363 32005 -35230 -125402 -66514 -43361 -77208 -59277 -17750 1642 7269 -30251 28389 81653
10351 81653 18401 64552 61090 72011 23138 44682 95268 106529 83690 89840 41670 56003
10339 56003 -31232 15936 2299 42660 96677 50804 14257 -52990 -96542 -79966 -35405 -73545
10327 -73545 -95826 -47835 29711 49624 75365 121521 39889 -44823 -114956 -129968 -109297 -50456
10315 -50456 -82508 -10140 120499 115467 81312 2974 -6521 12019 -5146 -37364 -55521 -53178
$$ packed form
10399I4050n1433l0999o9878j4406O3857K7539q3797L8223o0815J8599O7665N9976
10387E8581l3715k2180k6369q582Q996K0978J2553J2536O5408j30541o1383M8889
10375e4829m1607M2293O3019O912j7297m5704l9284q686m744J19883N9544m7495
10363C2005o7235r0172N8888K3153l3847J7931M1527J9392N627l7520N8640N3264
10351H1653o3252M6151l462J0921m8873K1544N0586J1261k2839O150m8170J4333
10339E6003q7235M7168j3637M0361N4017m5873l6547o7247m3552J6576M4561l8140
10327g3545k2281M7991P7546J9913K5741M6156q1632q4712p0133j5012K0671N8841
10315e0456l2052P2368J30639n032l4155p8338r495J8540j7165l2218j8157K343
$$ plain form
10303 -53178 32427 63411 20846 -59990 -54790 -19031 10959 5724 49872 -6843 -114178 -129201
10291 -129201 -152379 -59575 41247 8401 -41194 -25820 -50392 26582 76424 18671 -35743
10280 -35743 -14675 20719 -65795 -39933 2317 17597 -44 39178 604 -19804 57860 107315
10268 107315 154232 111967 19554 7816 6016 94247 100483 30165 74502 126435 148935 102839
10256 102839 24071 -1850 5809 9429 35593 -37760 -12643 49586 99270 14794 -44677 -55828
10244 -55828 -10170 -45269 -40241 -145211 -106389 -62884 102226 62911 5245 53272 49465 92061
10232 92061 92222 36718 44886 -18550 -1807 11189 24829 60761 114454 120676 120259 170323 232156
10219 232156 222746 164263 68299 27998 69462 31287 7352 39816 70265 106645 121852 6490
$$ packed form
10303e3178Q5605L0984m2565q0836N200L5759K9990n235M4148n6715j07335j5023
10291a29201k3178R2804J00822l2846m9595J5374k4572P6974M9842n7753n4414
10280c5743K1068L5394q6514K5862M2250J5280j7641L9222l8574k0408P7664M9455
10268A07315M6917m2265r2413j1738j800Q8231O236p0318M4337N1933K2500m6096
10256A02839p8768k5921P659L620K6164p3353K5117O2229M9684q4476n9471j1151
10244e5828M5658l5099N028j04970L8822M3505J65110l9315n7666M8027l807M2596
10232I2061J61n5504Q168o3436J6743J2996J3640L5932N3693O222m17N0064O1833
10219B32156r410n8483r5964m0301M1464l8175k3935L2464L0449L6380J5207j15362
$$ plain form
10207 6490 -94070 -115302 -54914 35092 -82436 -95515 -285 42551 -17620 -53295 -114008
10196 -114008 -133262 -100964 -72772 9043 12929 35787 67027 28998 -50678 -13143 -18777 -26019
10184 -26019 5621 4824 12803 12029 45218 93969 166246 226571 136160 -1984 52753 42969 -87789
10171 -87789 -91338 13230 3813 -54094 -85659 -64284 -28232 -41826 -56358 -63177 -8775 27307
10159 27307 -911 34469 72520 34313 103629 99216 33742 14967 -1362 -8025 65642 95829
10147 95829 54905 86100 47571 6840 32276 43937 -7382 44385 109691 130455 30015
10136 30015 -36793 -789 -47689 -181843 -229155 -217066 -166987 -102976 -51816 -31027 -10784
10125 -10784 16705 -8297 -9535 10026 56741 49309 112121 168307 58484 -64000 -74262 -53604
$$ packed form
10207F490j00560k1232O0388R0006j17528j3079R5230M2836o0171l5675o0713
10196a14008j9254L2298K8192Q1815L886K2858L1240l8029p9676L7535n634p242
10184b6019L1640p97P979p74L3189M8751P2277O0325r0411j38144N4737r784j30758
10171h7789l549J04568r417n7907l1565K1375L6052j3594j4532o819N4402L6082
10159B7307k8218L5380L8051l8207O9316m413o5474j8775j6329o663P3667L0187
10147I5829m0924L1195l8529m0731K5436J1661n1319N1767O5306K0764j00440
10136C0015o6808L6004m6900j34154m7312J2089N0079O4011N1160K0789K0243
10125a0784K7489k5002j238J9561M6715p432O2812N6186j09823j22484j0262K0658
$$ plain form
10113 -53604 -111484 -134989 -158784 -94009 -45684 -72288 -24215 60505 87751 61942 11727 -72356
10101 -72356 -115352 -58529 5771 7084 -15142 17894 32609 -20728 -26773 49417 28963 90015
10089 90015 203674 154045 104522 99893 41549 -35384 -57058 -46144 -5327 -17716 -48016 -77768
10077 -77768 -104945 -91192 -60642 -101243 -62283 29937 136158 55330 -1541 12138 -43413
10066 -43413 -21702 49451 159994 201756 226633 316480 437534 588541 790392 961248 1287831
10055 1287831 2118302 3582835 5705086 7129603 6355750 4545367 2752170 1689466
10047 1689466 1146627 896435 714575 530747 320615 127327 70488 15373 -37603 -12974
10037 -12974 83 22498 55165 74053 29920 60651 36315 88589 104897 91469 62445 91680
$$ packed form
10113e3604n7880k3505k3795O4775M8325k6604M8073Q4720K7246k5809n0215q4083
10101g2356m2996N6823O4300J313k2226L3036J4715n3337o045P6190k0454O1052
10089I0015J13659m9629m9523m629n8344p6933k1674J0914M0817j2389l0300k9752
10077g7768k7177J3753L0550m0601L8960R2220J06221q0828n6871J3679n5551
10066d3413K1711P1153J10543M1762K4877Q9847J21054J51007K01851J70856L26583
10055A287831Q30471J464533K122251J424517p73853j810383j793197j062704
10047A689466n42839k50192j81860j83828k10132j93288n6839n5115n2976K4629
10037a2974J3057K2415L2667J8888m4133L0731k4336N2274J6308j3428k9024K9235
$$ plain form
10025 91680 67248 11428 54635 70144 54054 -31659 -34234 -34229 -69943 -61133 -25007 9233 17473
10012 17473 -36357 -48463 -69879 -47012 -37877 -8347 70561 41460 39317 90592 65225 -18118
10000 -18118 -55272 -42365 -94205 -138562 -146618 -125649 -143733 -107516 -32155 -14381 -2526 -107678
9988 -107678 -43385 80099 113662 61545 24298 -96795 -188797 -144910 -111274 -56224 8445
9977 8445 -8484 -23372 -62071 -89051 -18969 -22093 -11663 6634 42446 -1719 -43510 -92288
9965 -92288 -121389 -87219 -67609 -54931 -46724 -25943 65194 44338 -56148 -110211 -41267 -25442
9953 -25442 -81068 -120857 -123423 -123807 -52070 -12558 -95792 -148835 -56752 45394 25013 -84392
9941 -84392 -202840 -190989 -142433 -92404 37490 107542 29990 -28674 38884 127908 85105
$$ packed form
10025I1680k4432n5820M3207J5509j6090q5713k575Nl5714Q810L6126L4240Q240
10012A7473n3830j2106k1416K2867R135K9530P8908k9101k143N1275k5367q3343
10000a8118l7154J2907n1840m4357q056K0969j8084L6217P5361J7774J1855j05152
9988a07678O4293J23484L3563n2117l7247j21093r2002M3887L3636N5050O4669
9977H445j6929j4888l8699k6980P0082l124J0430J8297L5812m4165m1791m8778
9965i2288k9101L4170J9610J2678Q207K0781R1137k0856j00486n4063O8944J5825
9953b5442n5626l9789k566l84P1737L9512q3234n3043R2083J02146k0381j09405
9941h4392j18448J1851M8556N0029J29894P0052p7552n8664O7558Q9024m2803
$$ plain form
9930 85105 -9864 -10145 47981 41402 -13021 -71058 -73913 -76069 44947 97884 88186 155776 95869
9917 95869 30117 51169 51946 41532 52552 5507 -44417 -81165 -111526 -20107 -14048 -11328 58158
9904 58158 84403 27826 14524 49609 45594 77711 73417 53616 43526 94011 170339 55880
9892 55880 23803 17622 49137 30483 -8817 -57268 -40011 -89024 -150750 -68473 -21129 1852
9880 1852 -27360 -93283 -91178 -94970 -47023 -64848 -102094 -20380 89730 14923 -39754 -98242
9868 -98242 -34963 82631 99482 57942 -23874 -95584 -156327 -98153 51188 146181 91254
9857 91254 -39414 -80950 -1386 30591 3074 26244 101673 -12878 -6558 30155 17159 -2951
9845 -2951 11291 -91230 -64780 -9118 -18239 -21622 3870 65426 93488 59532 -13902 -46697
$$ packed form
9930H5105r4969k81N8126o579n4423n8037k855k156J21016N2937r698O7590n9907
9917I5869o5752K1052P77j0414J1020m7045m9924l6748l0361R1419O059K720O9486
9904E8158K6245n6577j3302L5085m015L2117m294j9801j0090N0485P6328j14459
9892E5880l2077o181L1515j8654l9300m8451J7257m9013o1726Q2277M7344K2981
9880A852k9212o5923K105l792M7947j7825l7246Q1714J10110p4807n4677n8488
9868i8242O3279J17594J6851m1540q1816p1710o0743N8174J49341R4993n4927
9857I1254j30668m1536P9564L1977k7517K3170P5429j14551O320L6713j2996k0110
9845b951J4242j02521K6450N5662r121l383K5492O1556K8062l3956p3434l2795
$$ plain form
9833 -46697 -21188 -97042 -183659 -183314 -145588 -18128 60150 43966 75417 102374 90280 70026
9821 70026 30654 -16798 -45130 -76613 -19344 8440 -28117 -21379 -27951 16493 -36466 -183818
9809 -183818 -167465 -150740 -70916 -16238 -53383 -98237 -32953 55333 86501 29814 -777 32026
9797 32026 23140 -3195 -4266 -27272 -98428 -94459 28433 24966 -86950 -145730 -181582 -71938
9785 -71938 -4340 -3365 -2404 17381 -47858 -75298 -129811 -159405 -204152 -124133 -121778 -113968 -88495
9772 -88495 -75463 -59243 -80132 -56516 -70087 19415 47701 -12698 -56032 -58605 -23854 -10245
9760 -10245 -4201 38489 53357 99135 59726 -729 -20390 -47414 -98724 -154485 -132656 -171903
9748 -171903 -61083 27149 -34639 -49892 -29427 8725 9623 -38234 -60068 -784 55889 36913
$$ packed form
9833d6697K5509p5854q6617L45L7726J27460P8278j6184L1451K6957j2094k0254
9821G0026l9372m7452k8332l1483N7269K7784l6557O738o572M4444n2959j47352
9809a83818J6353J6725P9824N4678l7145m4854O5284Q8286L1168n6687l0591L2803
9797C2026q886k6335j071k3006p1156L969J22892l467j11916n8780l5852J09644
9785g1938O7598R75R61J9785o5239k7440n4513k9594m4747Q0019K355P810K5473
9772h8495J3032J6220k0889K3616j3571Q9502K8286o0399m3334k573L4751J3609
9760a0245O044M2690J4868M5778l9409o0455j9661k7024n1310n5761K1829l9247
9748a71903J10820Q8232o1788j5253K0465L8152Q98m7857k1834N9284N6673j8976
$$ plain form
9736 36913 43574 20980 -55835 -55020 -118423 -151219 -162972 -87173 -58854 -19874 21225 -26079
9724 -26079 -72257 -52275 -86500 -81393 2627 163720 202281 169099 61415 58887 40026 21302
9712 21302 -29593 -13059 132773 135627 112625 159539 116453 89534 81105 69968 31863 9141
9700 9141 -69768 -96782 -106618 -58935 -16456 -31512 -6926 40508 73332 142784 113633 32724
9688 32724 103499 154927 131785 147861 131849 96104 81152 79218 21447 -22384 12418 75684
9676 75684 146729 134718 57165 62319 98701 77144 61016 69420 80360 24296 81962 144912
9664 144912 173141 182942 90303 44445 63244 -12690 -35713 -50826 -23223 9536 9262 -95614
9652 -95614 -88870 -181486 -127430 -133017 -168442 -137433 -105537 -92642 15951 63181 -30477 -40237
$$ packed form
9736C6913O661k2594p6815Q15o3403l2796j1753P5799K8319L8980M1099m7304
9724b6079m6178J9982l4225N107Q4020J61093L8561l3182j07684k528j8861j8724
9712B1302n0895J6534J45832K854k3002M6914m3086k6919q429j1137l8105k2722
9700I141p8909k7014r836M7683M2479j5056K4586M7434L2824O9452k9151q0909
9688C2724P0775N1428k3142J6076j6012l5745j4952j934n7771m3831L4802O3266
9676G5684P1045j2011p7553N154L6382k1557j6128Q404J0940n6064N7666O2950
9664A44912K8229R801r2639m5858J8799p5934k3023j5113K7603L2759k74j04876
9652i5614O744r2616N4056n587l5425L1009L1896J2895J08593M7230r3658r760
$$ plain form
9640 -40237 -10076 -3826 135178 145327 192482 118768 87401 139807 51521 32896 -41350 6232
9628 6232 -3849 -52944 -83694 -33914 11171 13501 -57337 -61673 -78128 -35262 6191 -3990
9616 -3990 -26124 24184 11138 5163 -82638 -200782 -202595 -156455 -147355 -86314 -57752 -36220
9604 -36220 -15986 -63002 -82962 -36574 53388 119231 64715 14550 -24762 -74937 -71902 -98128
9592 -98128 -128114 -59356 -31406 24142 49858 -18900 -57935 -91098 -139378 -187897 -265683 -296187
9580 -296187 -224254 -118367 -43721 67557 168356 98406 -18863 -20167 -21835 -82931 -107581
9569 -107581 -61859 4561 64588 104191 106830 94540 15823 -76720 -73139 -138433 -113699 12544
9557 12544 21798 -82465 -126554 -71170 -24419 -41150 -67290 -30833 -55823 -100903 -51517 54699
$$ packed form
9640d0237L0161O250J39004J0149M7155p3714l1367N2406q8286j8625p4246M7582
9628F232j0081m9095l0750M9780M5085K330p0838m336j6455M2866M1453j0181
9616c990k2134N0308j3046n975q7801j18144j813M6140R100O1041K8562K1532
9604c6220K0234m7016j9960M6388Q9962O5843n4516n0165l9312n0175L035k6226
9592i8128k9986O8758K7950N5548K5716o8758l9035l3163m8280m8519p7786l0504
9580b96187P1933J05887P4646J11278J00799o9950j17269j304j668o1096k4650
9569a07581M5722O6420O0027L9603K639j2290p8717r2543L581o5294K4734J26243
9557A2544R254j04263m4089N5384M6751j6731k6140L6457k4990m5080M9386J06216
$$ plain form
9545 54699 144978 152749 151480 73906 94023 29937 -79605 -106630 -82306 3413 -36688 -118569
9533 -118569 -81293 -44646 -41242 38826 -22327 -79036 -2797 14498 -17556 -11438 -41925 -50085
9521 -50085 -141310 -97789 48832 125560 92029 39067 -6411 -15673 -22254 -13208 23310 -449
9509 -449 -23855 23010 156659 234317 187550 138014 91461 61774 58140 36793 14527 49587
9497 49587 104295 77644 67494 31543 60546 52446 91352 87831 89819 53646 -14672 28705
9485 28705 76338 121862 153527 100191 70490 24845 54118 64077 40607 7840 -18350 -43085
9473 -43085 8841 48702 -9348 -53726 2468 36109 5927 -728 -10066 68023 37354 -2427
9461 -2427 -47555 -12769 -27102 36022 13051 -72107 -62862 -72617 -69735 -97456 -106628 11277 85801
$$ packed form
9545E4699R0279P771j269p7574K0117o4086j09542k7025K4324Q5719m0101q1881
9533a18569L7276L6647L404Q0068o1153n6709P6239J7295l2054O118l0487q160
9521e0085r1225M3521J46621P6728l3531n2962m5478r262o581R046L6518k3759
9509d49k3406M6865J33649P7658m6767m9536m6553k9687l634k1347k2266L5060
9497D9587N4708k6651j0150l5951K9003q100L8906l521J988l6173o8318M3377
9485B8705M7633M5524L1665n3336k9701m5645K9273R959k3470l2767k6190k4735
9473d3085N1926L9861n8050m4378N6194L3641l0182o655r338P8089l0669l9781
9461b427m5128L4786j4333O3124k2971q5158R245r755K882k7721r172J17905P4524
$$ plain form
9448 85801 125085 55688 -6274 15480 55268 104178 111008 131734 196983 192951 146952 17529
9436 17529 -51799 -12944 22139 28012 -14599 -61660 47839 127894 1644 -73735 53191
9425 53191 94530 15178 77904 141127 40181 -68658 -32607 58538 131754 104173 -7406
9414 -7406 -10686 94315 96972 108913 87134 123825 61660 -16279 13964 14458 -38263 -38786 -69934
9401 -69934 -58463 3587 105696 117653 116524 85220 33904 59760 50756 127040 125862 139987
9389 139987 100111 118625 157601 117740 20119 -89750 -109374 -106606 -183358 -120625 -5744
9378 -5744 8322 -21918 -9251 121223 34182 11686 94695 81943 85072 31768 19325 27132
9366 27132 34364 -11819 -26095 24452 66934 120965 201583 163680 98656 90456 16247 -43260
$$ packed form
9448H5801L9284o9397o1962K1754L9788M8910O830K0726O5249m032m5999j29423
9436A7529o9328L8855L5083N873m2611m7061J09499Q0055j26250p5379J26926
9425E3191M1339p9352O2726O3223j00946j08839L6051R1145P3216k7581j11579
9414g406l280J05001K657J1941k1779L6691o2165p7939L0243M94n2721n23l1148
9401f9934J1471O2050J02109J1957j129l1304n1316K5856r004P6284j178J4125
9389A39987l9876J8514L8976l9861r7621j09869j9624K768p6752O2733J14881
9378e744J4066l0240J2667J30474q7041k2496Q3009j2752L129n3304j2443P807
9366B7132P232m6183j4276N0547M2482N4031Q0618l7903o5024q200p4209n9507
$$ plain form
9354 -43260 -82953 -37613 -53620 -70684 -20239 10211 32948 53528 35118 7272 28583 175935
9342 175935 238634 255799 188748 141163 159114 128743 48731 46189 48474 11321 77195 145085
9330 145085 102351 91163 22839 68362 63070 87767 132224 128969 65893 46905 98351 105174
9318 105174 150280 76639 17558 -45447 25787 77666 63896 4388 -132678 -155904 -82283
9307 -82283 -28253 -28927 9869 -43307 -60175 -103040 -97755 -59783 41636 57466 21943 72434
9295 72434 126107 189094 177377 131467 99753 34915 43516 41525 51448 97750 -11790 -48030
9283 -48030 -12097 -31503 -36180 3751 -46198 -123693 -127253 -56716 -43271 -38333 65066 69019
9271 69019 121088 128902 166158 123455 167307 119950 21691 3425 112054 181562 160243 37236
$$ packed form
9354d3260l9693M5340j6007j7064N0445L0450K2737K0580j8410k7846K1311J47352
9342A75935O2699J7165o7051m7585J7951l0371q0012k542K285l7153O5874O7890
9330A45085m2734j1188o8324M5523n292K4697M4457l255o3076j8988N1446O823
9318A05174M5106p3641n9081o3005P1234N1879j3770n9508j37066k3226P3621
9307h2283N4030o74L8796n3176j6868m2865N285L7972J01419J5830l5523N0491
9295G2434N3673O2987j1717m5910l1714o4838Q601j991R923M6302j09540l6240
9283d8030L5933j9406m677L9931m9949p7495l560P0537J3445M938J03399L953
9271F9019N2069P814L7256m2703M3852m7357r8259j8266J08629O9508k1319j23007
$$ plain form
9259 37236 -30694 61164 164923 237718 252817 101636 63162 63174 68209 115266 118703 129915
9247 129915 177215 123343 16219 6625 6230 49228 104053 127512 117355 10224 -14357 14678
9235 14678 28881 61578 86844 34430 -49084 -6698 75964 40757 57816 71960 93914 91980
9223 91980 77031 34532 66349 149424 126751 85949 106253 121130 130537 199699 237969 224788
9211 224788 276331 182597 129771 139583 234863 281448 295483 234525 201755 151790 103793 55910
9199 55910 76534 172541 217167 268833 273943 236240 147626 123065 113218 90649 152414 276935
9187 276935 324815 294672 258257 282806 306193 254851 253513 270842 208895 195425 270908 298920
9175 298920 316796 348792 315460 341556 312762 298415 379225 487551 442171 403464 454430
$$ packed form
9259C7236o7930R1858J03759P2795J5099j51181l8474J2N035M7057L437J1212
9247A29915M7300n3872j07124r594l95M2998N4825K3459j0157j07131k4581K9035
9235A4678J4203L2697K5266n2414q3514M2386Q2662l5207J7059J4144K1954j934
9223I1980j4949m2499L1817Q3075k2673m0802K0304J4877R407O9162L8270j3181
9211B24788N1543r3734n2826R812R5280M6585J4035o0958l2770m9965m7997m7883
9199E5910K0624R6007M4626N1666N110l7703q8614k4561r847k2569O1765J24521
9187B76935M7880l0143l6415K4549K3387n1342j338J7329o1947j3470P5483K8012
9175B98920J7876L1996l3332K6096k8794j4347Q0810J08326m5380l8707N0966
$$ plain form
9164 454430 468173 453084 454897 421973 396980 423280 505220 522330 502488 492110 532782 474229
9152 474229 410144 386816 415044 376871 422599 498686 538595 489336 613138 668398 604499
9141 604499 637912 751121 800912 735090 711186 820118 822270 830826 878991 917969 996932 1040719
9129 1040719 1060353 1116161 1153922 1150786 1239484 1331679 1412143 1504806 1597041 1621454 1663415 1723599
9117 1723599 1787291 1807215 1891608 1945540 1933189 1982987 2039613 2081591 2220066 2329966 2418503
9106 2418503 2548474 2651219 2694179 2794447 2925410 2997168 3012095 3088522 3182680 3270142 3433243
9095 3433243 3504488 3519717 3511293 3548891 3518625 3502056 3537498 3557717 3645895 3650027 3574059 3505031
9083 3505031 3473848 3466095 3458879 3301402 3170623 3075208 2975583 2914529 2964041 2812743 2634466
$$ packed form
9164D54430J3743j5089J813l2924k4993K6300Q1940J7110j9842j0378M0672n8553
9152D74229o4085k3328K8228l8173M5728P6087L9909m9259J23802N5260o3899
9141F04499L3413J13209M9791o5822k3904J08932K152Q556M8165L8978P8963M3787
9129A040719J9634N5808L7761l136Q8698R2195Q0464R2663R2235K4413M1961O0184
9117A723599O3692J9924Q4393N3932j2351M9798N6626M1978J38475J09900Q8537
9106B418503J29971J02745M2960J00268J30963P1758J4927P6427R4158Q7462J63101
9095C433243P1245J5229q424L7598l0266j6569L5442K0219Q8178M132p5968o9028
9083C505031l1183p753p216j57477j30779r5415r9625o1054M9512j51298j78277
$$ plain form
9072 2634466 2551353 2543739 2461742 2279318 2238198 2257373 2300803 2276493 2195581 2050196 1899685
9061 1899685 1826336 1781891 1672723 1600801 1547761 1527474 1453805 1455192 1434577 1391765 1387309 1381808
9049 1381808 1356351 1276765 1127401 1068114 1074103 1120736 1067979 1066515 1073586 1076684 982431 843655
9037 843655 844974 832598 756668 698265 646547 578491 583432 625973 683263 653319 553876 535239
9025 535239 539354 577402 583984 604488 606712 539048 521073 495238 447108 462578 522556 469593
9013 469593 513439 523310 538107 520443 585260 530821 433555 466890 469371 467948 483239 485300
9001 485300 462928 399939 357458 209426 217881 281961 239112 130435 137462 182849 261880 291446
8989 291446 300531 293393 183931 111854 137369 133305 128926 104576 123581 181464 136662 191199
$$ packed form
9072B634466q3113p614q1997j82424m1120J9175M3430k4310q0912j45385j50511
9061A899685p3349m4445j09168p1922n3040k0287p3669J387k0615m2812m456n501
9049A381808k5457p9586j49364n9287N989M6633n2757j464P071L098r4253j38776
9037H43655J319j2376p5930n8403n1718o8056M941M2541N7290k9944r9443j8637
9025E35239M115L8048O582K0504K224o7664j7975k5835m8130J5470N9978n2963
9013D69593M3846R871J4797j7664O4817n4439r7266L3335K481j423J5291K061
9001D85300k2372o2989m2481j48032Q455O4080m2849j08677P027M5387P9031K9566
8989B91446R085p138j09462p2077K5515m064m379k4350J9005N7883m4802N4537
$$ plain form
8977 191199 219268 248885 237724 247588 246143 144276 109154 149841 147953 171371 279029 216718
8965 216718 239496 219282 218618 208741 205023 216056 248023 237956 214769 129788 99250 121908
8953 121908 199994 286476 271350 231818 233573 143481 79871 89494 87969 152621 183355 180548
8941 180548 122853 90312 -14254 -77151 -96876 -53485 29722 159115 189373 109907 98925
8930 98925 169066 245571 241591 150848 147460 108186 6672 52045 67478 128657 117023 55604
8918 55604 117207 92396 77165 149321 232286 160579 188430 116647 49728 -5031 21727 45608
8906 45608 100145 181894 187099 66877 34182 111646 145513 77850 49443 78248 142500 235311
8894 235311 256312 187864 158399 161506 108787 136455 59833 5684 9828 15412 34672 87179
$$ packed form
8977A91199K8069K9617j1161R864j445j01867l5122M0687j888K3418J07658o2311
8965B16718K2778k0214o64r877l718J1033L1967j0067k3187q4981l0538K2658
8953A21908P8086Q6482j5126l9532J755r0092o3610R623j525O4652L0734k807
8941A80548n7695l2541j04566o2897j9725M3391Q3207J29393L0258p9466j0982
8930I8925P0141P6505l980r0743l388l9274j01514M5373J5433O1179j1634o1419
8918E5604O1603k4811j5231P2156Q2965p1707K7851p1783o6919n4759K6758K3881
8906D5608N4537Q1749N205j20222l2695P7464L3867o7663k8407K8805O4252R2811
8894B35311K1001o8448k9465L107n2719K7668p6622n4149M144N584J9260N2507
$$ plain form
8882 87179 117499 138393 131473 149432 102578 33552 47133 45779 68566 86649 30963 -18413
8870 -18413 -9035 112164 141218 155455 136573 164409 132511 36861 43002 68839 45816 51264
8858 51264 34400 18610 19448 33171 120494 125025 152104 171558 102408 84227 64086 73957 -3080
8845 -3080 -72212 -98290 -82144 -16278 30137 -28669 -92379 -109438 -128737 -177344 -198763 -123459
8833 -123459 -52371 20001 21578 6597 55783 83914 48420 -28073 37646 80848 102432 87308
8821 87308 70931 79472 94701 89351 45877 45033 12165 7486 125377 185903 122267 93183 29601
8808 29601 65552 141137 152832 157650 63726 53957 78888 32792 -36833 -41907 -40167 -30432 -59628
8795 -59628 -127921 -83981 -26887 23905 87197 106813 57283 26009 52988 40091 58289 101965
$$ packed form
8882H7179L0320K0894o920J7959m6854o9026J3581j354K2787J8083n5686m9376
8870a8413R378J21199K9054J4237j8882K7836l1898r5650O141K5837k3023N448
8858E1264j6864j5790Q38J3723Q7323M531K7079J9454o9150j8181k0141R871p7037
8845c080o9132k6078J6146O5866M6415n8806o3710j7059j9299m8607k1419P5304
8833a23459P1088P2372J577j4981M9186K8131l5494p6493O5719M3202K1584j5124
8821H7308j6377Q541J5229n350m3474q44l2868m679J17891O0526o3636k9084o3582
8808B9601L5951P5585J1695M818r3924r769K4931m6096o9625n074J740R735k9196
8795e9628o8293M3940N7094N0792O3292J9616m9530l1274K6979j2897J8198M3676
$$ plain form
8783 101965 108910 68554 -48719 -53301 -21120 -4112 15424 15212 41188 42494 23482 36843
8771 36843 74595 113954 70219 63541 25647 -24240 57283 128909 101947 107368 101225 78842
8759 78842 217 -8262 53003 98828 168684 46273 5820 62685 -1379 -47215 -108897 -133108
8747 -133108 -104561 -64833 -74449 -86773 -83551 -57241 -45125 5768 -21919 -33443 -84101 -88392
8735 -88392 -76673 24962 30205 88004 123371 120861 53240 25607 47068 32076 8269 55299
8723 55299 20630 -1424 -47131 18904 89047 8572 -9985 52005 113495 94627 161219 74084
8711 74084 85919 67418 21933 -15959 -35577 -72023 -141726 -215939 -204664 -97242 -70614 -86012
8699 -86012 41716 26244 -17716 6695 -12613 -2622 7475 145613 198118 186631 104071 29802
$$ packed form
8783A01965O945m0356j17273m582L2181J7008J9536k12K5976J306j9012J3361
8771C6843L7752L9359m3735o678l7894m9887Q1523P1626k6962N421o143k2383
8759G8842p8625q479O1265M5825O9856j22411m0453N6865o4064m5836o1682k4211
8747a33108K8547L9728r616j2324L222K6310J2116N0893k7687j1524n0658m291
8735h8392J1719J01635N243N7799L5367k510o7621k7633K1461j4992k3807M7030
8723E5299l4669k2054m5707O6035P0143q0475j8557O1990O1490j8868O6592q7135
8711G4084J1835j8501m5485l7892j9618l6446o9703p4213J1275J07422K6628j5398
8699h6012J27728j5472m3960K4411j9308R991J0097J38138N2505j1487q2560p4269
$$ plain form
8687 29802 73576 194924 181499 106651 -7645 -75079 16843 58850 129946 181732 177034 207527
8675 207527 285364 254778 132622 106605 118494 84442 70350 113514 207290 137982 136436 122671
8663 122671 192174 202524 93436 -5425 -71997 960 144401 61361 -5521 -47980 -105305
8652 -105305 -62845 9062 -64809 -24449 -61358 -158345 -150115 -20396 15107 36628 147961
8641 147961 86392 29498 -43684 -175081 -139248 -83496 -99050 -101572 -110366 -191868 -227150 -67819
8629 -67819 53637 82076 94105 114953 74375 -15929 -6083 73867 90673 132397 25961 -66478
8617 -66478 -45718 11060 123189 130513 113923 112936 62050 69180 21525 31001 40456 -13802 -6468
8604 -6468 39599 137785 86839 84791 48327 25383 33931 71849 124985 216471 267357 184255
$$ packed form
8687B9802M3774J21348j3425p4848j14296o7434R1922M2007P1096N1786m698L0493
8675B07527P7837l0586j22156k6017J1889l4052j4092M3164R3776o9308j546j3765
8663A22671O9503J0350j09088r8861o6572P2957J43441q3040o6882m2459n7325
8652a05305M2460P1907p3871M0360l6909r6987Q230J29719L5503K1521J11333
8641A47961o1569n6894p3182j31397L5833N5752j5554k522q794q1502l5282J59331
8629f7819J21456K8439J2029K0848m0578r0304R846P9950J6806M1724j06436r2439
8617f6478K0760N6778J12129P324j6590r87n0886P130m7655R476R455n4258P334
8604f468M6067R8186n0946k048l6464k2944Q548L7918N3136R1486N0886q3102
$$ plain form
8592 184255 102847 147320 197822 98770 20748 -13096 5568 33568 -7055 -94659 -55856 -105143
8580 -105143 -87682 -43531 41277 75636 35450 32636 -19976 24203 -12464 -80492 -77354 -57494
8568 -57494 -50250 -25145 -26964 23474 27069 19670 24921 73040 10762 -112 24444 84643 117662
8555 117662 123133 103022 13264 -11733 -61625 -125435 -52031 17122 -26021 8497 82746 86040
8543 86040 34269 59141 50289 54422 87075 59163 15250 -31959 -38659 583 -69198 -96507
8531 -96507 -59024 -61412 -24772 -29655 -14257 16438 -30572 -62595 -23669 66532 46387 -36887
8519 -36887 -100595 -173826 -247591 -148893 -39871 11224 131428 236926 288107 219360 131352
8508 131352 68527 34403 -38142 -91507 -94005 -82904 -18840 2024 46231 105116 69122 -66435
$$ packed form
8592A84255q1408M4473N0502r9052p8022l3844J8664K8000m0623q7604L8803m9287
8580a05143J7461M4151Q4808L4359m0186k814n2612M4179l6667o8028L138J9860
8568e7494P244K5105j819N0438L595p399N251M8119o2278j0874K4556O0199L3019
8555A17662N471k0111q9758k4997m9892o3810P3404O9153m3143L4518P4249L294
8543H6040n1771K4872q852M133L2653k7912m3913m7209o700L9242o9781k7309
8531i6507L7483k388L6640m883J5398L0695m7010l2023L8926R0201k0145q3274
8519c6887o3708p3231p3765R8698J09022N1095J20204J05498N1181o8747q8008
8508A31352o2825l4124p2545n3365k498J1101O4064K0864M4207N8885l5994j35557
$$ plain form
8496 -66435 -165674 -125682 7518 -133382 -187250 -125118 -95772 -109952 -111224 -110436 -83049 -25436
8484 -25436 -55869 -56304 -71164 -96207 -62120 32184 81379 -7612 -63820 42285 119999 104991
8472 104991 104021 20825 19490 9690 -28955 -70254 -80996 -91198 -70960 12164 52310 39838
8460 39838 -14282 -90803 -113830 -102480 -80690 -63236 -67264 -95869 -64466 -11717 -28013 -72594
8448 -72594 -77924 -78096 -52745 -3540 45565 55116 60090 14449 -387 27228 43536 99460 158504
8435 158504 151514 193090 158824 32395 -69673 -74360 -31707 -39819 5432 -4689 -48244 -13837
8423 -13837 -4078 -676 -36859 -77487 -86116 -136653 -138411 -86406 -5405 21984 8960 21242 74525
8410 74525 137979 88744 -4157 -32625 13287 1135 -44909 -116511 -134355 -117401 -128034 -176254
$$ packed form
8496f6435r9239L9992J33200j40900n3868O2132K9346j4180j272P88K7387N7613
8484b5436l0433m35j4860k5043L4087R4304M9195q8991n6208J06105P7714j5008
8472A04991r70q3196j335r800l8645m1299j0742j0202K0238Q3124M0146j2472
8460C9838n4120p6521k3027J1350K1790J7454m028k8605L1403N2749j6296m4581
8448g2594n330j72K5351M9205M9105R551M974m5641j4836K7615J6308N5924N9044
8435A58504o990M1576l4266j26429j02068m687M2653q112M5251j0121m3555L4407
8423a3837R759L402l6183m0628q629n0537j758N2005Q1001K7389j3024J2282N3283
8410G4525O3454m9235r2901k8468M5912j2152m6044p1602j7844J6954j0633m8220
$$ plain form
8398 -176254 -156187 -76457 -67823 -69239 2168 24623 -1444 -7520 5969 16753 52741 154926
8386 154926 141121 129395 17020 -40961 -44792 -30267 24251 28748 -15802 -101263 -79795 -2562
8374 -2562 57767 92070 103144 76519 -18222 -104082 -90744 -68936 -172846 -179160 -65418 -158267
8362 -158267 -226390 -225946 -87895 -42535 -54417 -50204 13454 -1272 18778 5803 -19059 -70139
8350 -70139 -109911 -99307 -60662 -18531 -5849 53654 28263 -5505 38858 37087 48526 112019
8338 112019 -23766 -75317 -36188 93518 106602 124477 161178 126252 23294 -40718 -7865
8327 -7865 -3947 -62115 -31496 11923 21200 -14751 -66917 -58746 -82679 -108095 -95938 -97609 -19837
8314 -19837 42960 -37641 -32707 -103996 -200375 -221445 -201070 -141017 -60446 -66242 -130808 -80428
$$ packed form
8398a76254K0067P9730Q634j416P1407K2455k6067o076J3489J0784L5988J02185
8386A54926j3805j1726j12375n7981l831J4525N4518M497m4550q5461K1468P7233
8374b562O0329L4303J1074k6625r4741q5860J3338K1808j03910o314J13742r2849
8362a58267o8123M44J38051M5360j1882M213O3658j4726K0050j2975k4862n1080
8350g0139l9772J0604L8645M2131J2682N9503k5391l3768M4363j771J1439O3493
8338A12019j35785n1551L9129J29706J3084J7875L6701l4926j02958o4012L2853
8327g865L918n8168L0619M3419R277l5951n2166Q171k3933k5416J2157j671P7772
8314a9837O2797q0601M934p1289r6379k1070K0375O0053Q0571n796o4566N0380
$$ plain form
8302 -80428 -27136 -9184 -14583 33285 137663 96849 66919 81437 91726 65243 -44727 -67715
8290 -67715 53084 92552 64303 57848 -5756 -79114 -7773 42915 21859 -69109 -109517 -114202
8278 -114202 -55498 -27487 -71355 -106392 -102608 -94975 -96311 -60832 -124523 -175364 -76917 -19014
8266 -19014 -86272 -51132 33589 70556 37395 -15868 -30073 -830 80579 75449 -24865 -52072
8254 -52072 -53726 -39915 -107991 -56451 82147 129325 60858 133918 144681 150880 164211 50220
8242 50220 -73690 -100814 -71225 -15634 1153 31914 -6902 -11385 5161 -58125 -72991 -82125
8230 -82125 -98872 -134862 -65357 -99387 -91098 -68808 -113122 -40069 39687 -13002 -45648 -54263
8218 -54263 -54498 -65658 5495 115854 166860 108355 77177 38760 94789 121059 44353 -1531
$$ packed form
8302h0428N3292J7952n399M7868J04378m0814k9930J4518J0289k6483j09970k2988
8290f7715J20799L9468k8249o455o3604p3358P1341N0688k1056r0968m0408m685
8278a14202N8704K8011m3868l5037L784P633j336L5479o3691n0841R8447N7903
8266a9014o7258L5140Q4721L6967l3161n3263j4205K9243Q1409n130j00314k7207
8254e2072j654J3811o8076N1540J38598M7178o8467P3060J0763O199J3331j13991
8242E0220j23910k7124K9589N5591J6787L0761l8816m483J6546o3286j4866r134
8230h2125j6747l5990O9505l4030Q289K2290m4314P3053P9756n2689l2646q615
8218e4263k35j1160P1153J10359N1006n8505l1178l8417N6029K6270p6706m5884
$$ plain form
8206 -1531 15523 49976 5728 -61703 -155691 -133252 -99043 -159612 -45753 6705 18178 -82189
8194 -82189 -134112 -119219 -100118 -117975 23779 22201 28476 19248 -14039 -42624 54021 68805
8182 68805 3799 -61248 -111367 -123841 -84820 -31101 -14831 55112 151635 120006 36443 29115
8170 29115 47832 696 52071 85811 152789 177257 104359 -19230 -152486 -194561 -191484 -154860
8158 -154860 -115578 -92480 -102288 -94593 -120103 -127765 -100466 -131399 -97682 -43315 -73751 -110001
8146 -110001 -157771 -110498 -24175 -57474 -84481 -24115 22665 76531 41882 21846 29021 113792
8134 113792 107381 105808 63897 65123 83000 94118 25011 23375 67878 56407 -15831 -44398
8122 -44398 -22964 12580 -2949 -10637 -33209 -68997 -12273 -5806 -8394 -9094 -50269 -99997 -74958
$$ packed form
8206a531J7054L4453m4248o7431r3988K2439L4209o0569J13859N2458J1473j00367
8194h2189n1923J4893J9101j7857J41754j578O275r228l3287k8585R6645J4784
8182F8805o5006o5047n0119j2474L9021N3719J6270O9943R6523l1629q3563p328
8170B9115J8717m7136N1375L3740O6978K4468p2898j23589j33256m2075L077L6624
8158a54860L9282K3098r808P695k5510p662K7299l0933L3717N4367l0436l6250
8146a10001m7770M7273Q6323l3299k7007O0366M6780N3866l4649k0036P175Q4771
8134A13792o411j573m1911J226J7877J1118o9107j636M4503j1471p2238k8567
8122d4398K1434L5544j5529p688k2572l5788N6724O467k588p00m1175m9728K5039
$$ plain form
8109 -74958 -94885 -78688 -53085 40020 44493 109854 178125 130728 -21459 7913 55195 43115
8097 43115 55613 29350 -44787 -96306 -119621 -79423 23793 107166 34047 13342 51978 -9321
8085 -9321 -11879 9155 48271 -35197 -85717 -50229 -57961 -48888 -51116 -1622 45287 2837 -9580
8072 -9580 -91036 -118309 -82731 -43108 -64876 -56279 -60323 -81987 -93445 -78323 -59218 689
8060 689 -34962 -49768 -44533 -1179 -43687 -59267 -46841 -75211 -34682 8238 -21014 -42270
8048 -42270 -115398 -164351 -173071 -110133 -16517 -55727 -64337 -34040 -99614 -77453 -14310 50554
8036 50554 69633 57673 -27636 -6083 57862 116653 117938 103834 121088 167607 70325 -27673
8024 -27673 -50392 21176 63590 10292 -23373 6548 26670 4205 -70842 -54209 7760 7397
$$ packed form
8109g4958j9927J6197K5603R3105M473O5361O8271m7397j52187K9372M7282j2080
8097D3115J2498k6263p4137n1519k3315M0198J03216Q3373p3119k0705L8636o1299
8085i321k558K1034L9116q3468n0520L5488p732R073k228M9494M6909m2450j2417
8072i580q1456k7273L5578L9623k1768Q597m044k1664j1458J5122J9105N9907
8060F89l5651j4806N235M3354m2508j5580J2426k8370M0529M2920k9252k1256
8048d2270p3128m8953q720O2938R3616l9210q610L0297o5574K2161O3143O4864
8036E0554J9079j1960q5309K1553O3945N8791J285j4104J7254M6519r7282r7998
8024b7673k2719P1568M2414n3298l3665K9921K0122k2465p5047J6633O1969l63
$$ plain form
8012 7397 14930 -39878 -83609 -37011 6193 -51439 -13726 93686 34447 -89648 28738 43711
8000 43711 -22606 -57306 -18376 -41566 -114228 -102730 -37582 12631 20882 -3529 -27727 -76271
7988 -76271 -80278 -64260 38972 78280 24918 10299 -4109 -47969 -45912 -55138 -84658 -109922
7976 -109922 -52453 35087 25623 8848 -72087 -109506 -115731 -44162 61122 114381 69970 28853
7964 28853 48204 38986 50774 93293 33565 -3152 52885 85644 77454 29 -38067 -68520
7952 -68520 -105747 -122000 -94288 -77648 -51933 -37785 -138938 -99487 -41781 -90265 -121105 -68223
7940 -68223 -89023 -118022 -108456 -54354 -55187 -95035 -64631 953 35471 19831 34989 43438 40084
7927 40084 30230 -49708 -87228 20804 141434 170673 105860 106501 41711 -33442 15066 16052
$$ packed form
8012G397P533n4808m3731M6598M3204n7632L7713J07412n9239j24095J18386J4973
8000D3711o6317l4700L8930k3190p2662J1498O5148N0213Q251k4411k4198m8544
7988g6271m007J6018J03232L9308n3362j4619j4408m3860K057r226k9520k5264
7976a09922N7469Q7540r464j6775q0935l7419o225P1569J05284N3259m4411m1117
7964B8853J9351r218J1788M2519n9728l6717N6037L2759q190p7425l8096l0453
7952f8520l7227j6253K7712J6640K5715J4148j01153L9451N7706m8484l0840N2882
7940f8223k0800k8999R566N4102q33l9848L0404O5584L4518j5640J5158Q449l354
7927D0084r854p9938l7520J08032J20630K9239o4813O41o4790p5153M8508R86
$$ plain form
7915 16052 26254 23981 81009 71120 30965 24246 27220 46638 -15533 12476 -48158 -44948 -49012
7902 -49012 3514 124930 68814 21461 32273 -53698 -82153 -28993 10044 9271 -40808 -82226
7890 -82226 -62038 -27778 -8788 -41010 -26067 -25568 -17593 -35703 -61987 -7687 30450 -51434
7878 -51434 -112880 -43934 47306 139044 116884 82061 34620 23330 43593 -1312 80014 157099
7866 157099 42584 -29147 -45991 -22829 19453 6664 9718 -19886 10013 60601 56486 -10050
7854 -10050 31885 78225 52575 55212 -24401 -42259 -40846 -36198 -6422 -29355 -54110 -60521 -120784
7841 -120784 -171616 -74591 -64691 -89525 -84575 -46245 -114754 -127177 -150300 -138527 -126570 -35286
7829 -35286 7458 6365 -91721 -79643 -4826 -50652 -69438 -62271 35177 -55246 -160327 -198401
$$ packed form
7915A6052J0202k273N7028r889m0155o719K974J9418o2171K8009o0634L210m064
7902d9012N2526J21416n6116m7353J0812q5971k8455N3160L9037p73n0079m1418
7890h2226K0188L4260J8990l2222J4943M99P975j8110k6284N4300L8137q1884
7878e1434o1446O8946R1240R1738k2160l4823m7441j1290K0263m4905Q1326P7085
7866A57099j14515p1731j6844K3162M2282j2789L054k9604K9899N0588m115o6536
7854a0050M1935M6340k5650K637p9613j7858J413M648K9776k2933k4755o411o0263
7841a20784n0832R7025R900k4834M950L8330o8509j2423k3123J1773J1957R1284
7829c5286M2744j093r8086J2078P4817m5826j8786P167R7448r0423j05081l8074
$$ plain form
7817 -198401 -150832 -78358 -44447 -96569 -119048 -35840 37696 47250 56154 -28270 -52672 -25713
7805 -25713 -9938 -16691 -75894 -136602 -80275 -39767 -7969 -16364 -47762 -59114 -10385 35531
7793 35531 -10324 -11776 -106623 -67253 6931 124388 126355 140330 54065 -14745 -58851 -139185
7781 -139185 -157705 -80408 -42295 -68251 -48841 -18675 86088 89515 -1016 -14511 -11723 -36680
7769 -36680 2225 11160 58866 28581 -46614 -91083 -132492 -80661 -62298 9026 29529 53549
7757 53549 7696 23184 53976 14478 63515 72040 -30418 -83288 -131051 -121461 -63156 -56690
7745 -56690 -33748 -22959 -40857 -132408 -87384 -106617 -54598 62317 82466 29185 39834 80480
7733 80480 63105 -44601 10375 47742 8395 -52327 -105589 -198953 -171407 -105911 -136199 -111252
$$ packed form
7817a98401M7569P2474L3911n2122k2479Q3208P3536R554Q904q4424k4402K6959
7805b5713J5775o753n9203o0708N6327M0508L1798q395l1398j1352M8729M5916
7793C5531m5855j452r4847L9370P4184J17457J967J3975q6265o8810m4106q0334
7781a39185j8520P7297L8113k5956J9410L0166J04763L427r0531j3495K788k4957
7769c6680L8905Q935M7706l0285p5195m4469m1409N1831J8363P1324K0503K4020
7757E3549m5853J5488L0792l9498M9037Q525j02458n2870m7763R590N8305O466
7745e6690K2942J0789j7898r1551M5024j9233N2019J16915K0149n3281J0649M0646
7733H0480j7375j07706N4976L7367l9347o0722n3262r3364K7546O5496l0288K4947
$$ plain form
7721 -111252 -98610 -11604 -22908 -28383 -70877 -17296 36257 -1478 -37728 -28864 -112526 -74018
7709 -74018 -13725 42939 17526 1062 13180 -2643 -74888 -43696 22532 -7565 -10516 63159
7697 63159 34782 -60948 -49771 -52484 -54854 -40264 -26231 -98407 -44118 -41231 -27703 -3272
7685 -3272 -30768 -108854 -75994 -39368 -105340 -147659 -127437 -99702 -101100 -87554 -62884 -76493
7673 -76493 -45583 -65993 -45186 23886 24951 -29453 -76418 -102833 -197665 -171377 -73164 -96172
7661 -96172 -133442 -145972 -15649 7011 -60151 -181242 -220015 -143034 -94730 -128476 -30374
7650 -30374 30231 46050 25422 14296 -51733 -120772 -79873 24490 119823 80966 16386 -58212
7638 -58212 -71362 3388 60625 63832 110111 53519 -20924 -13295 -106564 -84886 29173 4800
$$ packed form
7721a11252J2642Q7006j1304n475m2494N3581N3553l7735l6250Q864q3662L8508
7709g4018O0293N6664k5413j6464J2118j5823p2245L1192O6228l0097k951P3675
7697F3159k8377r5730J1177k713k370J4590J4033p2176N4289K887J3528K4431
7685c272k7496p8086L2860L6626o5972m2319K0222K7735j398J3546K4670j3609
7673g6493L0910k0410K0807O9072J065n4404m6965k6415r4832K6288R8213k3008
7661i6172l7270j2530J30323K2660o7162j21091l8773P6981M8304l3746R8102
7650c0374O0605J5819k0628j1126o6029o9039M0899J04363R5333l8857o4580p4598
7638e8212j3150P4750N7237L207M6279n6592p4443P629r3269K1678J14059k4373
$$ plain form
7626 4800 -82925 -249931 -246240 -249555 -252610 -142774 -102780 29036 15546 -92903 -94231 -46953
7614 -46953 40200 -36636 -29974 -16850 5885 17113 1461 -43314 -46628 -78543 -140347 -193646
7602 -193646 -145828 -138780 -102477 -48061 -16704 -15053 -24732 -75920 -19296 8258 -36099 -148413
7590 -148413 -131492 -33913 63249 -5012 45468 108502 79094 122874 154344 86715 75096 16089
7578 16089 -8996 4141 -3297 -51387 -42861 -129289 -113055 2846 35583 -60382 -219536 -177850
7566 -177850 -128315 -155426 -139144 -145430 -95937 -71872 -12826 -5870 9842 39209 -32908 -30351
7554 -30351 -70845 -19478 69797 50361 -51885 6402 -20298 -1156 -4269 23005 61375 64178
7542 64178 49961 -59536 -12622 8351 -37525 -83641 -31657 -43631 -28333 74652 110931
$$ packed form
7626D800q7725j67006L691l315l055J09836L9994J31816j3490j08449j328M7278
7614d6953Q7153p6836O662J3124K2735J1228j5652m4775l314l1915o1804n3299
7602a93646M7818P048L6303N4416L1357J651r679n1188N6624K7554m4357j12314
7590a48413J6921R7579R7162o8261N0480O3034k9408M3780L1470o7629j1619n9007
7578A6089k5085J3137p438m8090Q526q6428J6234J15901L2737r5965j59154M1686
7566a77850M9535k7111J6282o286M9493K4065N9046O956J5712K9367p2117K557
7554c0351m0494N1367Q9275j9436j02246N8287k6700J9142l113K7274L8370K803
7542F4178j4217j09497M6914K0973m5876m6116N1984j1974J5298J02985L6279
$$ plain form
7531 110931 59995 76856 58106 38210 -32866 14737 15771 101583 152528 105601 22649 -6228
7519 -6228 832 16459 38675 -19819 -87848 -130733 -143792 -45836 -51861 -91583 -96692 -37617 -29029
7506 -29029 -6233 -59891 -137983 -142021 -136382 -111717 -31443 -51490 -125046 -191944 -136393 -79505
7494 -79505 14754 91231 10561 -13944 56865 72605 51753 58759 29176 45343 8889 -10016
7482 -10016 -51869 14163 52971 45369 52403 -47480 -188069 -181377 -111391 -65560 24012 30447
7470 30447 15518 7136 20945 -22722 89094 114842 44531 -35208 -35105 15167 59279 16283
7458 16283 32229 36110 3710 44830 74203 55821 -33979 -87497 -52470 -71056 -188862 -205006
7446 -205006 -93169 72559 93070 53821 -45989 -74594 -81961 13727 41085 49104 97337 53971
$$ packed form
7531A10931n0936J6861j8750j9896p1076M7603J034Q5812N0945m6927q2952k8877
7519f228P060J5627K2216n8494o8029m2885j3059R7956o025l9722n109N9075Q588
7506b9029K2796n3658p8092m038N639K4665Q0274k0047p3556o6898N5551N6888
7494g9505R4259P6477q0670k4505P0809J5740k0852P006k9583J6167l6454j8905
7482a0016m1853O6032L8808p602P034r9883j40589O692O9986M5831Q9572O435
7470C0447j4929q382J3809m3667J11816K5748p0311p9739J03N0272M4112m2996
7458A6283J5946L881l2400M1120K9373j8382q9800n3518L5027j8586j17806j6144
7446b05006J11837J65728K0511l9249r9810k8605p367R5688K7358Q019M8233m3366
$$ plain form
7434 53971 735 -14302 -85986 -86052 -74261 -47715 -9736 3853 34027 31303 48997 48502 93183
7421 93183 46275 -103032 -164584 -93187 -29692 -50283 -7184 48666 23109 119649 173076 99945
7409 99945 549 -57696 -15603 -7342 -14462 58966 76241 64231 14909 19290 45220 65763
7397 65763 124820 133879 159304 57943 18600 -33508 -660 -68260 -30520 65640 84523 -29746
7385 -29746 -24724 -32143 -66137 -64488 -37604 -2371 -4002 12679 -2060 41733 92893 50465 -3531
7372 -3531 12461 109540 151332 155505 211211 191305 60566 -48516 -71666 -10441 46228 64114
7360 64114 -7633 -80594 -61622 -53955 -42594 25989 30970 6644 118346 74391 -33820 -68648
7348 -68648 -44304 40388 40361 -8690 -9454 -82247 -50637 -49034 -68915 -72244 29828 136265 108932
$$ packed form
7434E3971n3236j5037p1684o6J1791K6546L7979J3589L0174k724J7694m95M4681
7421I3183m6908j49307o1552P1397O3495k0591M3099N5850k5557R6540N3427p3131
7409I9945r9396n8245M2093Q261p120P3428J7275j2010m9322M381K5930K0543
7397F5763N9057R059K5425j01361l9343n2108L2848o7600L7740R6160J8883j14269
7385b9746N022p419l3994J649K6884L5233j631J6681j4739M3793N1160m2428n3996
7372c531J5992R7079M1792M173N5706j9906j30739j09082k3150O1225N6669J7886
7360F4114p1747p2961J8972P667J1361O8583M981k4326J11702m3955j08211l4828
7348f8648K4344Q4692k7m9051p64p2793L1610J603j9881l329J02072J06437k7333
$$ plain form
7335 108932 76365 66764 6946 -14022 -12998 -57545 -108722 -112659 -91723 -60144 -35931 -99052
7323 -99052 -136905 -154501 -67449 -22180 7163 -33098 -68309 -20284 48909 28447 -1361 2360
7311 2360 -31499 -47020 -59814 -19879 13139 14909 -17268 -71354 -45711 -67270 -63647 -86779
7299 -86779 -96456 -159323 -156254 -60133 -16155 35254 28792 -1358 28888 29757 7297 -24344 -39746
7286 -39746 -6022 74965 119958 64212 16636 -26960 -33508 20471 73894 73831 64455 24984 -27000
7273 -27000 -38235 -88063 -118385 -133598 -126690 -101026 69726 90071 7033 22771 37852 24614
7261 24614 -39800 -12466 -1186 22582 -1569 -30766 14021 118587 158254 176706 162354 103409
7249 103409 195366 245825 192304 95240 -66449 -97720 -86275 -86788 -14058 33372 -12298 -42521
$$ packed form
7335A08932l2567r601n9818k0968J024m4547n1177l937K0936L1579K4213o3121
7323i9052l7853j7596Q7052M5269K9343m0261l5211M8025O9193k0462k9808L721
7311B360l3859j5521j2794L9935L3018J770l2177n4086K5643k1559L623k3132
7299h6779r677o2867L069R6121M3978N1409o462l0150L0246Q69k2460l1641j5402
7286c9746L3724Q0987M4993n5746m7576m3596o548N3979N3423o3r376l9471n1984
7273b7000j1235m9828l0322j5213O908K5664J70752K0345q3038J5738J5081j3238
7261B4614o4414K7334J1280K3768k4151k9197M4787J04566L9667J8452j4352n8945
7249A03409R1957N0459n3521r7064j61689l1271J1445n13P2730M7430m5670l0223
$$ plain form
7237 -42521 -49426 2728 83801 25573 -76564 -142446 -65981 -17892 12844 28352 -52709 -141230
7225 -141230 -125214 -79210 -29631 8855 16835 -63809 -163113 -153062 -92462 -43181 29989 -29636
7213 -29636 4898 5811 -665 22405 2720 21517 48551 51256 16305 -68504 -147284 -72011 -23848
7200 -23848 -79679 -53343 -57845 -58106 -28781 -37022 13321 86310 98609 71196 18014 -59517 -52953
7187 -52953 -49333 -72566 11622 -14675 -28798 22727 -20835 -119641 -74435 37215 106126 97385
7175 97385 59334 38541 47897 105889 151719 91271 -2647 8651 23767 37420 -60671 -118613
7163 -118613 -25189 18820 -25138 -28319 34046 -26223 -25847 -81848 -36566 -55043 -24899 41357
7151 41357 90303 182179 90625 -60613 -101010 -60959 3574 25267 46504 -12721 -32092 -2492
$$ packed form
7237d2521o905N2154Q1073n8228j02137o5882P6465M8089L0736J5508q1061q8521
7225a41230J6016M6004M9579L8486P980q0644r9304J0051O0600M9281P3170n9625
7213b9636L4534R13o476K3070j9685J8797K7034K705l4951q4809p8780P5273M8163
7200b3848n5831K6336m502k61K9325q241N0343P2989J2299k7413n3182p7531O564
7187e2953L620k3233Q4188k6297j4123N1525m3562r8806M5206J11650O8911q741
7175I7385l8051k0793R356N7992M5830o0448r3918J1298J5116J3653r8091n7942
7163a18613R3424M4009m3958l181O2365o0269L76n6001M5282j8477L0144O6256
7151D1357M8946R1876r1554j51238m0397M0051O4533K1693K1237n9225j9371K9600
$$ plain form
7139 -2492 18684 -21575 -19152 -8244 -9984 -64053 -20820 -13172 -74792 -148459 -146017 -103796 -99253
7126 -99253 -119310 -122870 -79022 -69725 -45643 -23991 15815 41981 113627 106406 15335 -66027
7114 -66027 -125812 -128470 -155609 -162652 -56489 77340 -9444 -87357 -76452 -133682 -141555 -34845
7102 -34845 -47825 -83069 -128265 -93671 -114376 -80498 -107707 -80338 15797 93574 85200 52444
7090 52444 25403 44068 69922 48140 102179 124152 79911 27164 -26909 -58428 -60623 -63611
7078 -63611 -40529 -64004 -201189 -141615 -37486 48611 60551 35976 86881 79744 -12177 -63798
7066 -63798 -81544 -30976 -63344 -68908 -57837 35003 44357 44403 -46164 -58216 -15573 -1771 34725
7053 34725 16604 31542 -64 -84442 -46295 -2857 72379 78469 35930 -5585 54110 43932
$$ packed form
7139b492K1176m0259K423J0908j740n4069M3233P648o1620p3667K442M2221M543
7126i9253k0057l560M3848R297K4082K1652L9806K6166P1646p221r1071q1362
7114f6027n9785k658k7139p043J06163J33829q6784p7913J0905n7230p873J06710
7102c4845j2980l5244m5196L4594k0705L3878k7209K7369R6135P7777q374l2756
7090E2444k7041J8665K5854k1782N4039K1973m4241n2747n4073l1519k195k988
7078f3611K3082k3475j37185N9574J04129Q6097J1940k4575N0905p137r1921n1621
7066f3798j7746N0568l2368n564J1071R2840R354M6r0567j2052M2643J3802L6496
7053C4725j8121J4938l1606q4378L8147M3438P5236O090m2539m1515N9695j0178
$$ plain form
7041 43932 51259 -13682 -124966 -149783 -117090 -50585 -35370 9791 10336 -31908 -4375 -36838
7029 -36838 -64904 -119705 -79446 -102700 -76331 691 30513 10261 -31531 6250 78013 89958
7017 89958 54385 -4075 52865 79200 93319 -15214 -48557 -21775 8495 -5449 3049 -2268
7005 -2268 41314 -25167 -34430 29121 -2059 -38024 -55042 -60259 -13663 -126779 -136661 -68449
6993 -68449 -37778 28963 12210 -20768 -78246 -85416 -13242 -48870 -86587 -121794 -159895 -147714
6981 -147714 -122553 -122862 -70288 -32837 -40929 -82347 -86776 -44458 -58034 -49507 20949 16340 51972
6968 51972 -12736 -132325 -133139 -64479 -81527 -45123 29223 22097 26891 48311 -6415 -89793
6956 -89793 -38328 26886 110639 151339 62633 32816 -56621 -95087 -22667 -16921 18906 15596
$$ packed form
7041D3932P327o4941j11284k4817L2693O6505J5215M5161N45m2244K7533l2463
7029c6838k8066n4801M0259k3254K6369P7022K9822k0252m1792L7781P1763J1945
7017H9958l5573n8460N6940K6335J4119j08533l3343K6782L0270j3944Q498n317
7005b268M3582o6481r263O3551l1180l5965j7018n217M6596j13116r882O8212
6993f8449L0671O6741j6753l2978n7478p170P2174l5628l7717l5207l8101J2181
6981a47714K5161l09N2574L7451q092m1418m429M2318j3576Q527P0456m609L5632
6968E1972o4708j19589q14O8660j7048L6404P4346p126M794K1420n4726q3378
6956h9793N1465O5214Q3753M0700q8706k9817q9437l8466P2420N746L5827l310
$$ plain form
6944 15596 -23739 -17667 40820 4646 -40561 -63742 -31282 -11785 9068 -34918 67838 94456
6932 94456 22664 22142 122422 168319 141540 77526 51561 74745 70776 20898 72662 70418
6920 70418 -18903 -91438 -120528 -64386 35222 60673 97310 46982 -22247 -22181 -8152 -38154
6908 -38154 -66568 27416 3838 -170060 -145511 18209 66649 39815 -7573 -51729 -69605
6897 -69605 -62028 -62988 -24523 -27240 -68731 -43638 -53298 -41190 -41410 -97226 -115864 -19153 12016
6884 12016 -742 8518 -21944 -77488 -79204 -52286 -98662 -70057 -11217 -83613 -156204 -99579
6872 -99579 -40806 59621 71142 -31402 -81404 -52669 -45292 -42049 2046 4111 -7763 18700
6860 18700 44658 23184 18130 22538 59145 60557 159578 153012 105034 48929 -49467 -50838 28757
$$ packed form
6944A5596l9335O072N8487l6174m5207k3181L2460J9497K0853m3986J02756K6618
6932I4456p1792n22J00280M5897k6779o4014k5965K3184l969m9878N1764k244
6920G0418q9321p2535k9090N6142R9608K5451L6637n0328o9229O6J4029l0002
6908c8154k8414R3984k3578j73898K4549J63720M8440k6834m7388m4156j7876
6897f9605P577r60L8465k717m1491K5093r660J2108k20n5816j8638R6711L1169
6884A2016j2758R260l0462n5544j716K6918m6376K8605N8840p2396p2591N6625
6872i9579N8773J00427J1521j02544n0002K8735P377L243M4095K065j1874K6463
6860A8700K5958k1474n054M408L6607J412R9021o566m7978n6105r8396j371P9595
$$ plain form
6847 28757 171729 193461 181946 69584 -17582 6036 80142 85095 -40724 -62755 -59565 -76418
6835 -76418 -22167 19699 -101062 -157175 -149422 -88431 -54714 -40206 -45155 -7127 -67615 -51769
6823 -51769 -32217 -77837 -173372 -158971 -112951 -125696 -62684 11469 -30191 -142145 -174403 -189882
6811 -189882 -87362 -36888 -37147 -4610 5629 11412 -4195 6589 76680 32247 13788 53422
6799 53422 39833 74022 64620 -13217 -35158 -44789 -63166 -17425 12109 -10065 -26353 -44311
6787 -44311 -42954 8716 12369 -944 -27958 -8821 58439 10866 15817 28194 -19969 9389
6775 9389 33385 47216 22029 7671 33985 95336 49981 20258 70846 45919 77344 157987
6763 157987 131350 106972 58343 44862 35646 37141 -13187 -53869 -55521 81853 146221 97380
$$ packed form
6847B8757J42972K1732j1515j12362q7166K3618P4106M953j25819k2031L190j6853
6835g6418N4251M1866j20761n6113P753O0991L3717J4508m949L8028o0488J5846
6823e1769J9552m5620r5535J4401M6020j2745O3012P4153m1660j11954l2258j5479
6811a89882J02520N0474k59L2537J0239N783j5607J0784P0091m4433j8459L9634
6799E3422j3589L4189r402p7837k1941r631j8377M5741K9534k2174j6288j7958
6787d4311J357N1670L653j3313k7014J9137O7260m7573M951J2377m8163K9358
6775I389K3996J3831k5187j4358K6314O1351m5355k9723N0588k4927L1425Q0643
6763A57987k6637k4378m8629j3481r216J495n0328m0682j652J37374O4368m8841
$$ plain form
6751 97380 39317 -17605 -57118 -58820 -28543 -23386 33837 18764 28445 45904 19610 -37728
6739 -37728 -59997 -83388 -34069 5850 15290 -38656 -18951 -13062 -27090 -45456 -73128 -119543
6727 -119543 -160185 -148277 -116820 -64916 15774 61530 40388 45652 5566 14433 -36043 -37426
6715 -37426 -35525 18256 15285 -72440 -82596 -98651 -136424 -98094 -45869 26361 103518 127334
6703 127334 103394 67604 42756 74955 -22489 -22906 29792 28413 -81306 -88719 -40478 -65233
6691 -65233 -31551 -56082 -75890 53742 104422 38394 -54609 -36272 -52092 -22652 -21375 -72387
6679 -72387 -42389 24576 66550 -7401 -141202 -162052 -112548 -40868 28006 53512 64250 47495
6667 47495 137242 165717 109922 10409 -58673 -22294 72682 7560 -30448 -16364 -17179 -14391
$$ packed form
6751I7380n8063n6922l9513j702L0277N157N7223j5073R681J7459k6294n7338
6739c7728k2269k3391M9319L9919R440n3946J9705N889j4028j8366k7672m6415
6727a19543m0642J1908L1457N1904Q0690M5756k1142N264m0086Q867n0476j383
6715c7426J901N3781k971q7725j0156j6055l7773L8330N2225P2230P7157K3816
6703A27334k3940l5790k4848L2199r7444m17N2698j379j09719p413M8241k4755
6691f5233L3682k4531j9808J29632N0680o6028r3003J8337j5820K9440J277n1012
6679g2387K9998O6965M1974p3951j33801k0850M9504P1680O8874K5506J0738j6755
6667D7495Q9747K8475n5795r9513o9082L6379R4976o5122l8008J4084q15K788
$$ plain form
6655 -14391 18258 5673 35625 74728 -4958 -51772 28017 67486 56541 91304 -18197 -81169
6643 -81169 -102000 -114044 -24092 52609 91926 79328 51977 59347 50596 -14004 10720 -16039
6631 -16039 -9329 -59848 -90921 -86512 22819 -3749 -27040 -47217 -25071 -16241 -30185 -70305
6619 -70305 -117943 -232475 -232933 -96770 -39472 33721 -17582 44357 37704 49374 75651 -43010
6607 -43010 -65368 -11012 -2796 58915 73659 87353 41215 43828 -37843 -132008 -131294 -34141 -13421
6594 -13421 -38079 -22261 73531 126755 143003 71721 -52087 4052 48633 98267 19915 2551
6582 2551 57834 30441 -12351 -51849 -86811 -11842 58802 36647 125630 148751 -10982 -104825
6570 -104825 -72654 -54166 -20325 18333 116951 172017 115224 110890 68161 68257 62684 75454 137845
$$ packed form
6655a4391L2649j2585K9952L9103p9686m6814P9789L9469j0945L4763j09501o2972
6643h1169k0831j2044Q9952P6701L9317j2598k7351P370q751o4600K4724k6759
6631a6039O710n0519l1073M409J09331k6568k3291k0177K2146Q830j3944m0120
6619g0305m7638j14532m58J36163N7298P3193n1303O1939o653J1670K6277j18661
6607d3010k2358N4356Q216O1711J4744J3694m6138K613q1671r4165P14R7153K0720
6594a3421k4658J5818R5792N3224J6248p1282j23808N6139M4581M9634p8352j7364
6582B551N5283k7393m2792l9498l4962P4969P0644k2155Q8983K3121j59733r3843
6570a04825L2171J8488L3841L8658R8618N5066n6793m334m2729R6n573J2770O2391
$$ plain form
6557 137845 217958 271969 261827 226435 177398 113901 95552 55239 67858 84451 41614 -26877
6545 -26877 -58846 -86646 3389 33438 129642 207253 238570 138856 20661 144 -13496 -68382
6533 -68382 -74132 -80890 3386 12235 -14468 5718 15677 10473 -7626 -50710 -84029 -127091 -100071
6520 -100071 -53464 -4429 20407 -21948 12423 139340 75698 46796 31991 8812 45023
6509 45023 122323 99109 65888 52601 -8619 -10036 17291 65460 134990 81118 19688 63770
6497 63770 48013 19707 12392 -72546 -132978 -84697 -77556 -26144 27515 112103 32320 40707
6485 40707 81335 67597 71520 97728 127141 39773 -76874 -126626 -157850 -115396 62143 90642
6473 90642 51467 11622 1423 61155 149308 50953 -74034 -59058 3214 77102 55650 -54010
$$ packed form
6557A37845Q0113N4011j0142l5392m9037o3497j8349m0313J2619J6593m2837o8491
6545b6877l1969k7800R0035L0049R6204P7611L1317r9714j18195k0517j3640n4886
6533f8382n750o758Q4276Q849k6703K0186R959n204j8099m3084l3319m3062K7020
6520a00071M6607M9035K4836m2355L4371J26917o3642k8902j4805k3179L6211
6509D5023P7300k3214l3221j3287o1220j417K7327M8169O9530n3872o1430M4082
6497F3770j5757k8306p315q4938o0432M8281P141N1412N3659Q4588p9783Q387
6485D0707M0628j3738L923K6208K9413q7368j16647m9752l1224M2454J77539K8499
6473I0642l9175l9845j0199N9732Q8153r8355j24987J4976O2272P3888k1452j09660
$$ plain form
6461 -54010 -30931 -43355 -36615 -37379 -53652 -72453 -101677 -98043 -143010 -55364 -40610 -35670 1326
6448 1326 78690 77131 -53096 -21860 -9151 9634 36308 32115 136082 140717 13752 25094
6436 25094 54392 54717 96699 221266 213673 99276 -26547 -15547 -45103 -65466 -82654 -93652
6424 -93652 -132235 -43942 -2 -72635 -56383 -57105 -65089 -11259 -6703 -92199 -134004 -121420 -40849
6411 -40849 -19812 -57405 -61054 -52010 5578 43957 43300 -18070 -131730 -110398 -56733 -105867
6399 -105867 -89845 -95435 -138245 10864 73730 46689 35121 63457 -16701 -88477 -51353 -1162
6387 -1162 10623 10564 31686 43973 51889 60293 60301 66446 95377 79327 14680 -83636 -102895 -92438
6373 -92438 -111311 -113508 -36211 -36002 -12439 21023 8308 -9040 -80219 -130448 -122840 -47933 37265
$$ packed form
6461e4010K3079j2424O740p64j6273j8801k9224L634m4967Q7646J4754M940L6996
6448A326P7364j559j30227L1236J2709J8785K6674m193J03967M635j26965J1342
6436B5094K9298L25M1982J24567p593j14397j25823J1000k9556k0363j7188j0998
6424i3652l8583Q8293M3940p2633J6252p22p984N3830M556q5496m1805J2584Q0571
6411d0849K1037l7593l649R044N7588L8379o57o1370j13660K1332N3665m9134
6399a05867J6022n590m2810J49109O2866k7041j1568K8336q0158p1776L7124N0191
6387a162J1785n9K1122J2287P916Q404QO145K8931j6050o4647r8316j9259J0457
6373i2438j8873k197P7297K09K3563L3462j2715j7348p1179n0229P608P4907Q5198
$$ plain form
6360 37265 51509 -66656 -39144 -3290 -27593 -34968 -49952 -91550 -63171 -43908 -37657 -110299
6348 -110299 -44625 -2718 -859 47359 38297 36016 44627 63516 100120 112427 22393 -16077
6336 -16077 4230 -19242 -97648 -39979 -28808 23780 -26248 -24416 49769 41698 -33294 -62787
6324 -62787 -44811 -42273 19101 38955 -19890 -4987 22418 69379 105181 82384 113629 84874
6312 84874 27211 -3608 24760 41110 -40464 -88505 -100346 -46879 30741 27212 -17818 -45738
6300 -45738 -14500 -41413 -66592 -117088 -65563 -73515 -134791 -199450 -111787 -79434 -67950 15254
6288 15254 -10052 1184 -8147 3164 2248 -29943 -103209 -127542 -33397 -4404 -71236 -54572
6276 -54572 -93360 -137940 -132266 -138471 -156042 -132083 -85294 -35447 -24845 76633 142733 66564
$$ packed form
6360C7265J4244j18165K7512L5854k4303p375j4984m1598K8379J9263O251p2642
6348a10299O5674M1907J859M8218r062k281Q611J8889L6604J2307r0034l8470
6336a6077K0307k3472p8406N7669J1171N2588n0028J832P4185q071p4992k9493
6324f2787J7976K538O1374J9854n8845J4903K7405M6961L5802k2797L1245k8755
6312H4874n7663l0819K8368J6350q1574m8041j1841N3467P7620l529m5030k7920
6300d5738L1238k6913k5179n0496N1525p952o1276o4659Q7663L2353J1484Q3204
6288A5254k5306J1236r331J1311r16l2191p3266k4333R4145K8993o6832J6664
6276e4572l8788m4580N674o205j7571K3959M6789M9847J0602J01478O6100p6169
$$ plain form
6264 66564 18302 17495 -32428 -33978 -26716 -21087 -95480 -12431 14618 53756 26404 -18458 -56581
6251 -56581 -187630 -184520 -42781 -31088 1669 10778 40975 105125 98290 -9252 781 -9323
6239 -9323 -64888 -187174 -77200 29927 23796 -19190 -14743 -7072 23087 -14925 -116430 -181350
6227 -181350 -132227 -118950 -26851 -5333 -7106 -43715 -29491 -30049 -40299 -61471 -31690 28902
6215 28902 -61724 -81912 -54407 -129244 -34192 94326 96478 19738 -116793 -81774 5215 3583
6203 3583 -46552 -32614 18266 9192 -60468 61913 63624 -23281 -13065 54292 125228 70010
6191 70010 41881 119922 140274 108714 -7183 -31877 -51392 -86263 -16632 -2695 -135566
6180 -135566 -150355 -105789 -84705 -87435 -119714 -191168 -184824 -53380 54041 15455 27009 -32491
$$ packed form
6264F6564m8262q07m9923j550P262N629p4393Q3049K7049L9138k7352m4862l8123
6251e6581j31049L110J41739J1693L2757R109L0197O4150o835j07542J0033j0104
6239i323n5565j22286J09974J07127o131m2986M447P671L0159l8012j01505o4920
6227a81350M9123J3277R2099K1518j773l6609J4224n58j0250k1172K9781O0592
6215B8902r0626k0188K7505p4837R5052J28518K152p6740j36531L5019Q6989j632
6203C583n0135J3938N0880r074o9660J22381J711q6905J0216O7357P0936n5218
6191G0010k8129P8041K0352l1560j15897k4694j9515l4871O9631J3937j32871
6180a35566j4789M4566K1084k730l2279p1454O344J31444J07421l8586J1554n9500
$$ plain form
6168 -32491 -18722 -43639 -103805 -154707 -207432 -230414 -17818 125081 185915 205275 129947
6157 129947 40986 59212 88307 57800 4418 -50406 -73161 -81073 28221 75541 69079 114892
6145 114892 82282 92921 474 31752 36641 63624 70135 12404 -56850 -66289 -5071 29469
6133 29469 44376 -12189 -85020 -90483 -132207 -172213 -154853 -155900 -145349 -158959 -150665 -131236
6121 -131236 -76931 -12776 -6204 -37758 -98417 -113148 -60662 -46279 -61896 -47822 -108339 -147881
6109 -147881 -17531 14277 64723 102583 117327 101505 11921 12005 75539 119106 79193 1549
6097 1549 -7888 18438 -53640 -58957 -97944 -87912 -35793 -99892 -96397 -64318 51475 31280
6085 31280 51017 65553 28614 11112 -20597 -253 57707 106837 40589 3593 48217 56440
$$ packed form
6168c2491J3769k4917o0166n0902n2725k2982K12596J42899O0834J9360p5328
6157A29947q8961J8226K9095l0507n3382n4824k2755p912J09294M7320o462M5813
6145A14892l2610J0639r2447L1278M889K6983O511n7731o9254r439O1218L4540
6133B9469J4907n6565p2831n463m1724m0006J7360j047J0551j3610Q294J9429
6121a31236N4305O4155O572l1554o0659j4731N2486J4383j5617J4074o0517l9542
6109a47881J30350L1808N0446L7860J4744j5822q9584Q4O3534M3567l9913p7644
6097A549r437K6326p2078n317l8987J0032N2119o4099L495L2079J15793k0195
6085C1280J9737J4536l6939j7502l1709K0344N7960M9130o6248l6996M4624Q223
$$ plain form
6073 56440 20026 -47140 -78103 -31442 -44822 -143162 -54493 -62171 -70809 -68106 -57327 -50507 -65939
6060 -65939 -7929 35617 20210 -10966 -89069 -141472 -245114 -265521 -250679 -202625 -117311 9638
6048 9638 56060 -589 -87393 -38734 16978 65879 56657 -39483 -74218 -38470 -80799 -75372
6036 -75372 21613 39777 76088 73494 72489 56054 116820 87144 2148 -28071 81728 30088
6024 30088 40485 24157 31036 40737 -24082 -56695 -68572 -40956 -79447 -71309 -26001 7647
6012 7647 22902 -26501 -16396 44741 46505 -83208 -107723 -89468 -74087 -4867 75697 105029
6000 105029 83649 135028 157386 125065 182599 172034 109883 80157 91926 -35048 -68759
5989 -68759 -38697 34492 54989 73874 74114 108015 81649 42649 -33605 -23062 32622 116364
$$ packed form
6073E6440l6414o7166l0963M6661j3380r8340Q8669p678q638K703J0779O820j5432
6060f5939N8010M3546j5407l1176p8103n2403j03642k0407J4842M8054Q5314J26949
6048I638M6422n6649q6804M8659N5712M8901r222r6140l4735L5748m2329N427
6036g5372R6985J8164L6311k594j005j6435O0766k9676q4996l0219J09799n1640
6024C0088J0397j6328O879R701o4819l2613j1877K7616l8491Q138M5308L3648
6012G647J5255m9403J0105O1137J764j29713k4515J8255J5381O9220Q0564K9332
6000A05029k1380N1379K2358l2321N7534j0565o2151k9726J1769j26974l3711
5989f8759L0062P3189K0497J8885K40L3901k6366l9000p6254J0543N5684Q3742
$$ plain form
5977 116364 32256 41901 59386 112140 135624 54323 -98132 -126852 -87375 -69035 9011 -43598
5965 -43598 -94474 -79001 -110634 -75672 60379 141368 82700 62541 144171 121652 35056 -23789
5953 -23789 56200 13413 66902 77092 21245 -12655 -30082 11453 102454 137547 92014 -28724
5941 -28724 7618 -8964 -98310 -97034 23242 -19089 -79972 -49961 -27278 -2354 10034 16411
5929 16411 34549 77713 42736 64982 121271 129502 99811 147334 110053 24101 1746 17655
5917 17655 58367 13169 -25567 -63631 -106210 -139995 -46917 9347 35200 17379 -45302 974
5905 974 55751 -27586 -72049 -56925 -44756 -57080 45428 97065 11583 -47016 33552 -27002
5893 -27002 -74541 -2292 18803 -41100 -133558 -170455 -29374 -33453 -196515 -246170 -146547 -94250
$$ packed form
5977A16364q4108R645J7485N2754K3484q1301j52455k8720L9477J8340P8046n2609
5965d3598n0876J5473l1633L4962J36051Q0989n8668k0159Q1630k2519q6596n8845
5953b3789P9989m2787N3489J0190n5847l3900j7427M1535R1001L5093m5533j20738
5941b8724L6342j6582q9346J276J20276m2331o0883L0011K2683K4924J2388O377
5929A6411J8138M3164l4977K2246N6289Q231k9691M7523l7281q5952k2355J5909
5917A7655M0712m5198l8736l8064m2579l3785R3078N6264K5853j7821o2681M6276
5905I74N4777q3337m4463J5124J2169j2324J02508N1637q5482n8599Q0568o0554
5893b7002m7539P2249K1095n9903r2458l6897J41081m079j63062m9655R9623N2297
$$ plain form
5881 -94250 -71813 -159423 -204980 -119344 -3582 98393 129108 135481 114749 81934 12172 -27299
5869 -27299 -14285 -7122 57090 62389 11190 29878 22250 57346 107741 71170 74974 24016 10201
5856 10201 -33781 14115 -8017 -42152 -13884 25443 74226 -37391 -59052 21751 43862 32819
5844 32819 79118 96418 107028 129091 129351 110526 93322 95040 128137 118804 90670 53481 81430
5831 81430 69054 68201 26047 -6393 47358 38668 1005 -12309 -24448 -19610 -43436 -51694 -84255
5818 -84255 -143117 -117615 -40400 1247 -21738 61205 134520 111785 170821 164150 40609 -50254
5806 -50254 -58216 -133070 -165311 -190262 -193498 -155059 -135334 -186970 -177199 -153780 -144823 -56874 27286
5793 27286 52374 57805 82329 51342 38627 55673 55244 -65746 -174105 -173040 -44766 -51894
$$ packed form
5881i4250K2437q7610m5557Q5636J15762J01975L0715O373k0732l2815o9762l9471
5869b7299J3014P163O4212N299n1199J8688p628L5096N0395l6571L804n0958j3815
5856A0201m3982M7896k2132l4135K8268L9327M8783j11617k1661Q0803K2111j1043
5844C2819M6299J7300J0610K2063K60j8825j7204J718L3097r333k8134l7189K7949
5831H1430j2376q53m2154l2440N3751q690l7663j3314j2139M838k3826q258l2561
5818h4255n8862K5502P7215M1647k2985Q2943P3315k2735N9036o671j23541r0863
5806e0254p962p4854l2241k4951l236L8439J9725n1636R771K3419Q957Q7949Q4160
5793B7286K5088N431K4524l0987j2715J7046m29j20990j08359J065J28274p128
$$ plain form
5781 -51894 -56353 -66969 -23110 17862 66086 88555 115626 81160 13464 48142 -20258 -11502
5769 -11502 -25132 -83153 -96595 -58872 -91743 -96865 -138148 -118586 -111748 -104288 -95578 -21653 -20812
5756 -20812 -63265 -20063 -14427 4426 -12942 -98894 -114860 -87211 -56133 -14393 -20574 31515
5744 31515 100686 89744 81694 -19523 -70223 -60282 -40926 12605 18644 -39125 -129108 -141828
5732 -141828 -25507 -20267 43167 100117 142788 106565 74685 4385 73991 88220 -69518
5721 -69518 -118790 -66975 4501 66166 95137 89019 48837 9746 -51671 -49192 -107762 -236752
5709 -236752 -141095 -20254 36385 27998 28026 55320 101510 80869 -7607 16120 64047 -5451
5697 -5451 -106091 -58700 26319 -19753 -76661 -79873 -91910 -67161 -7380 -28945 -55505 -69117
$$ packed form
5781e1894m459j0616M3859M0972M8224K2469K7071l4466o7696L4678o8400Q756
5769a1502j3630n8021j3442L7723l2871n122m1283J9562O838P460Q710P3925Q41
5756b0812m2453M3202N636J8853j7368q5952j5966K7649L1078M1740o181N2089
5744C1515O9171j0942q050j01217n0700R941J9356N3531O039n7769q9983j2720
5732a41828J16321N240O3434N6950M2671l6223l1880p0300O9606J4229j57738
5721f9518m9272N1815P1476O1665K8971o118m0182l9091o1417K479n8570j28990
5709b36752R5657J20841N6639q387K8K7294M6190k0641q8476K3727M7927o9498
5697e451j00640M7391Q5019m6072n6908l212j2037K4749N9781k1565k6560j3612
$$ plain form
5685 -69117 -44863 56897 5682 17396 56447 118644 80335 -42238 -50002 -82300 -158314 -153090
5673 -153090 4680 56838 -1661 -83865 -76073 -98640 -80190 -72862 -83092 -49388 -25498 32988
5661 32988 82326 175414 152130 126973 40333 58298 59785 46332 9901 -29385 -96203 -167694
5649 -167694 -262242 -251300 -246682 -152139 -70737 -128426 -138973 -63446 57649 119240 -33587
5638 -33587 -154501 -76015 -101743 -93630 -155355 -157405 -108605 -101904 -146308 -135117 5327 56715
5626 56715 13574 -14389 -63168 -72763 -103887 -101172 17629 131078 141184 152811 152033 110939
5614 110939 21732 -67251 -37858 58948 109053 97234 59243 129359 90824 16244 -28144 -48210
5602 -48210 -83602 -29194 -39585 -52001 -23410 -20056 -9924 -71730 -164591 -218145 -233106 -253349
$$ packed form
5685f9117K4254J01760n1215J1714L9051O2197l8309j22573p764l2298p6014N224
5673a53090J57770N2158n8499q2204P792k2567J8450P328j0230L3704K3890N8486
5661C2988M9338R3088k3284k5157q6640J7965J487j3453l6431l9286o6818p1491
5649a67694r4548J0942M618R4543Q1402n7689j0547P5527J21095O1591j52827
5638c3587j20914P8486k5728Q113o1725k050M8800O701m4404J1191J40444N1388
5626E6715m3141k7963m8779r595l1124K715J18801J13449J0106J1627p78m1094
5614A10939q9207q8983K9393R6806N0105j1819l7991P0116l8535p4580m4388k0066
5602d8210l5392N4408j0391j2416K8591L354J0132o1806r2861n3554j4961k0243
$$ plain form
5590 -253349 -250453 -133959 -43117 -120845 -169448 -136064 -110129 -125446 -127010 -125243 -167556 -218901
5578 -218901 -158209 -109621 -86773 -85944 -73051 -7825 -60317 -48119 -19422 23708 73863 -2665
5566 -2665 -56898 -49746 -53389 -46581 -57844 22714 36236 -9375 -42921 43848 91142 58123 71006
5553 71006 107626 60112 -27609 -88523 -169709 -186345 -132743 -101995 -113654 -116401 -44517 -33447
5541 -33447 -14509 -4366 40840 70778 34349 -8348 -58367 -80765 -90898 -167984 -164545 -84367
5529 -84367 -86951 -56566 -6825 -35817 -64932 -115375 -165268 -114631 -148680 -99805 -99201 -138715
5517 -138715 -151313 -153955 -163520 -175360 -71583 7191 13070 22014 -19309 -41265 -13126 -84586
5505 -84586 -73004 -46314 4750 113318 144482 103998 122422 70339 67098 74625 22395 -2471
$$ packed form
5590b53349K896J16494R0842p7728m8603L3384K5935j5317j564J767m2313n1345
5578b18901O0692M8588K2848Q29J2893O5226n2492J2198K8697M3130N0155p6528
5566b665n4233P152l643O808j1263Q0558J3522m5611l3546Q6769M7294l3019J2883
5553G1006L6620m7514q7721o0914q1186j6636N3602L0748j1659k747P1884J1070
5541c3447J8938J0143M5206K9938l6429m2697n0019k2398j0133p7086L439Q0178
5529h4367k584L0385M9741k8992k9115n0443m9893N0637l4049M8875O04l9514
5517a38715j2598k642r565j1840J03777P8774N879Q944m1323k1956K8139p1460
5505h4586J1582K6690N1064J08568L1164m0484J8424n2083l241P527n2230k4866
$$ plain form
5493 -2471 101287 74518 84425 43795 19880 -3571 -93889 -112058 -62052 -33465 -129413 -151528
5481 -151528 -119930 -118705 -42495 27597 -5880 32390 77844 88250 21408 27051 -14604 -30566
5469 -30566 -64692 -94248 -68038 -136418 -293239 -216417 -153333 -97044 -8513 -47265 -47123 5452
5457 5452 -9287 14130 112 55739 86964 104709 79569 28352 36420 66699 128768 102401
5445 102401 82167 11981 -61847 -19090 -16201 -71017 -83495 -16690 -11352 -43671 -64110 7444
5433 7444 44569 -22674 -107834 -90229 -7418 -16039 -89462 -77727 24197 -10874 -44246 -42548
5421 -42548 -9517 -45917 -45232 -76468 -126813 -60180 -79350 -176647 -71144 -23194 -41935 -31041
$$ packed form
5493b471J03758k6769R907m0630k3915k3451r0318j8169N0006K8587r5948k2115
5481a51528L1598J225P6210P0092l3477L8270M5454J0406o6842N643m1655j5962
5469c0566l4126k9556K6210o8380j56821P6822O3084N6289Q8531l8752J42N2575
5457E452j4739K3417j4018N5627L1225J7745k5140n1217Q068L0279O2069k6367
5445A02401k0234p0186p3828M2757K889n4816j2478O6805N338l2319k0439P1554
5433G444L7125o7243q5160J7605Q2811q621p3423J1735J01924l5071l3372J698
5421d2548L3031l6400O85l1236n0345O6633j9170r7297J05503M7950j8741J0894
$$ [...]
##END NTUPLES=NMR SPECTRUM
##END=
