##TITLE=Analysis number 327378
Compound Code cc 39801
Project Code adrs
Chemist Name endeavour
##JCAMPDX= 6.0         $$ Bruker NMR JCAMP-DX V2.0
##DATA TYPE= NMR SPECTRUM
##DATA CLASS= NTUPLES
##ORIGIN= Bruker BioSpin GmbH
##OWNER= nmr
$$ XWIN-NMR		Version 3.5
$$ Fri Mar 23 11:11:08 2007 GMT Standard Time (UT+0h)  MAYBRIDGE\nmr@NMR_250MHZ
##.OBSERVE FREQUENCY= 250.131544655141
##.OBSERVE NUCLEUS= ^1H
##.ACQUISITION MODE= SIMULTANEOUS (DQD)
##.ACQUISITION SCHEME= undefined
##.AVERAGES= 16
##.DIGITISER RES= 18
##SPECTROMETER/DATA SYSTEM= dpx250
##.PULSE SEQUENCE= zg30
##.SOLVENT NAME= DMSO
##.SHIFT REFERENCE= (INTERNAL, DMSO, 0, 16.522)
##AUDIT TRAIL= $$ (NUMBER, WHEN, WHO, WHERE, WHAT)
$$ ##TITLE= Audit trail, XWIN-NMR		Version 3.5
$$ ##JCAMPDX= 5.01
$$ ##ORIGIN= Bruker BioSpin GmbH
$$ ##OWNER= nmr
$$ C:\u/data/dgb/nmr/ADRS/1770/pdata/1/auditp.txt
$$ ##AUDIT TRAIL=  $$ (NUMBER, WHEN, WHO, WHERE, WHAT)
(   1,<2007-03-23 11:10:44.86 +000>,<MAYBRIDGE\nmr>,<NMR_250MHZ>,
      <created by zg, POWCHK disabled, PULCHK disabled
       configuration hash MD5:
       49 4B E0 1D 92 C2 6B 37 9F E6 65 BC 52 41 86 1D
       data hash MD5: 64K
       6D 0F 5B 6A 5B 9A E3 67 52 DC 58 A6 9D 47 01 F6>)
(   2,<2007-03-23 11:10:58.91 +000>,<MAYBRIDGE\nmr>,<NMR_250MHZ>,
      <Start of raw data processing
       ef LB = 0.3 FT_mod = 6 PKNL = 1 SI = 32K 
       data hash MD5: 32K
       DD 22 90 E0 89 11 F8 B9 28 0C B6 3F 6F 57 10 8B>)
(   3,<2007-03-23 11:11:01.00 +000>,<MAYBRIDGE\nmr>,<NMR_250MHZ>,
      <apk 
       data hash MD5: 32K
       7C 09 98 42 D3 BB 96 4B 94 52 F2 43 76 10 84 EE>)
(   4,<2007-03-23 11:11:01.75 +000>,<MAYBRIDGE\nmr>,<NMR_250MHZ>,
      <abs ABSG = 5 
       data hash MD5: 32K
       7F B1 AC A4 1C D6 28 49 80 79 04 70 C6 1E 78 9A>)
$$ ##END=
$$ 
$$ hash MD5
$$ F3 97 55 AF 68 22 B4 12 C1 96 7F 46 1E 16 13 D7
##$RELAX= 
##$RELAX= 
##$RELAX= 
##$RELAX= 
##$RELAX= 
##$RELAX= 
##$RELAX= 
$$ Bruker specific parameters
$$ --------------------------
##$DU= <C:\u>
##$EXPNO= 1770
##$NAME= <ADRS>
##$PROCNO= 1
##$TYPE= <nmr>
##$USER= <dgb>
##$AMP= (0..31)
100 100 100 100 100 100 100 100 100 100 100 100 100 100 100 100 100 100 
100 100 100 100 100 100 100 100 100 100 100 100 100 100 
##$AQSEQ= 0
##$AQ_mod= 3
##$AUNM= <au_zg>
##$AUTOPOS= <23 >
##$BF1= 250.13
##$BF2= 250.13
##$BF3= 250.13
##$BF4= 250.13
##$BF5= 500.13
##$BF6= 500.13
##$BF7= 500.13
##$BF8= 500.13
##$BYTORDA= 1
##$CFDGTYP= 0
##$CFRGTYP= 5
##$CHEMSTR= <none>
##$CNST= (0..31)
1 1 145 1 1 1 1 1 1 1 1 1 1 1 1 1 1 1 1 1 1 1 1 1 1 1 1 1 1 1 1 1 
##$CPDPRG= <>
##$CPDPRG1= <>
##$CPDPRG2= <>
##$CPDPRG3= <>
##$CPDPRG4= <mlev>
##$CPDPRG5= <mlev>
##$CPDPRG6= <mlev>
##$CPDPRG7= <mlev>
##$CPDPRG8= <mlev>
##$CPDPRGB= <>
##$CPDPRGT= <>
##$D= (0..31)
0 1 0 0 0 0 0 0 0 0.06 0 0 0 0 0 0 0.0002 0 0 0 0 0 0 0 0 0 0 0 0 0 0 
0 
##$DATE= 1174648243
##$DBL= (0..7)
120 120 120 120 120 120 120 120 
##$DBP= (0..7)
150 150 150 150 150 150 150 150 
##$DBP07= 0
##$DBPNAM0= <>
##$DBPNAM1= <>
##$DBPNAM2= <>
$$ [...]
##$SUBNAM7= <"">
##$SUBNAM8= <"">
##$SUBNAM9= <"">
##$SW= 20.6930455092707
##$SWIBOX= (0..15)
0 0 3 0 0 0 0 0 0 0 0 0 0 0 0 0 
##$SW_h= 5175.983436853
##$TD= 65536
##$TD0= 1
##$TE= 683.16
##$TE2= 300
##$TE3= 300
##$TEG= 300
##$TL= (0..7)
0 120 120 120 120 120 120 120 
##$TP= (0..7)
150 150 150 150 150 150 150 150 
##$TP07= 0
##$TPNAME0= <>
##$TPNAME1= <>
##$TPNAME2= <>
##$TPNAME3= <>
##$TPNAME4= <>
##$TPNAME5= <>
##$TPNAME6= <>
##$TPNAME7= <>
##$TPOAL= (0..7)
0.5 0.5 0.5 0.5 0.5 0.5 0.5 0.5 
##$TPOFFS= (0..7)
0 0 0 0 0 0 0 0 
##$TUNHIN= 0
##$TUNHOUT= 0
##$TUNXOUT= 0
##$USERA1= <user>
##$USERA2= <user>
##$USERA3= <user>
##$USERA4= <user>
##$USERA5= <user>
##$V9= 5
##$VALIST= <valist>
##$VCLIST= <CCCCCCCCCCCCCCC>
##$VD= 0
##$VDLIST= <DDDDDDDDDDDDDDD>
##$VPLIST= <PPPPPPPPPPPPPPP>
##$VTLIST= <TTTTTTTTTTTTTTT>
##$WBST= 1024
##$WBSW= 4
##$XGAIN= (0..3)
0 0 0 0 
##$XL= 0
##$YL= 0
##$YMAX_a= 351234
##$YMIN_a= -404144
##$ZGOPTNS= <>
##$ZL1= 120
##$ZL2= 120
##$ZL3= 120
##$ZL4= 120
##$ABSF1= 16.522
##$ABSF2= -4.171173
##$ABSG= 5
##$ABSL= 3
##$ALPHA= 0
##$AQORDER= 0
##$ASSFAC= 0
##$ASSFACI= 0
##$ASSFACX= 0
##$ASSWID= 0
##$AUNMP= <proc_1d>
##$AZFE= 0.1
##$AZFW= 0.1
##$BCFW= 0
##$BC_mod= 0
##$BYTORDP= 0
##$COROFFS= 0
##$CY= 12.5
##$DATMOD= 1
##$DC= 0
##$DFILT= <>
##$DTYPP= 0
##$F1P= 14.0000005364418
##$F2P= -0.99999901652339
##$FCOR= 0.5
##$FTSIZE= 32768
##$FT_mod= 6
##$GAMMA= 0
##$GB= 0
##$INTBC= 1
##$INTSCL= 1
##$ISEN= 128
##$LB= 0.3
##$LEV0= 0
##$LPBIN= 0
##$MAXI= 10000
##$MC2= 0
##$MEAN= 0
##$ME_mod= 0
##$MI= 0
##$NCOEF= 0
##$NC_proc= -6
##$NLEV= 6
##$NOISF1= 0
##$NOISF2= 0
##$NSP= 0
##$NTH_PI= 0
##$NZP= 0
##$OFFSET= 16.522
##$PC= 1
##$PHC0= 198.9893
##$PHC1= 56.27406
##$PH_mod= 1
##$PKNL= yes
##$PPARMOD= 0
##$PSCAL= 4
##$PSIGN= 0
##$REVERSE= no
##$SF= 250.13
##$SI= 32768
##$SIGF1= 0
##$SIGF2= 0
##$SINO= 400
##$SIOLD= 32768
##$SREGLST= <1H.DMSO>
##$SSB= 0
##$STSI= 32768
##$STSR= 0
##$SW_p= 5175.98343685301
##$SYMM= 0
##$S_DEV= 0
##$TDeff= 65536
##$TDoff= 0
##$TI= <Analysis number 999999
Compound Code 99
Book Reference 9
Project Code 9>
##$TILT= no
##$TM1= 0
##$TM2= 0
##$TOPLEV= 0
##$USERP1= <user>
##$USERP2= <user>
##$USERP3= <user>
##$USERP4= <user>
##$USERP5= <user>
##$WDW= 1
##$XDIM= 32768
##$YMAX_p= 557618961
##$YMIN_p= -17451722
$$ End of Bruker specific parameters
$$ ---------------------------------
##NTUPLES= NMR SPECTRUM
##VAR_NAME=  FREQUENCY,     SPECTRUM/REAL,   SPECTRUM/IMAG
##SYMBOL=    X,             R,               I
##VAR_TYPE=  INDEPENDENT,   DEPENDENT,       DEPENDENT
##VAR_FORM=  AFFN,          ASDF,            ASDF
##VAR_DIM=   32768,         32768,           32768
##UNITS=     HZ,            ARBITRARY UNITS, ARBITRARY UNITS
##FACTOR=    0.157963299565203, 1,           1
##FIRST=     4132.6476996994, 0,             0
##LAST=      -1043.33573715361, 0,           0
##MIN=       -1043.33573715361, -17451722,   0
##MAX=       4132.6476996994, 557618961,     0
$$ Real data points
##PAGE= N=1
##DATA TABLE= (X++(R..R)), XYDATA
$$ [...]
$$ plain form
15555 -108983 -39137 8496 -57037 -129095 -195057 -309497 -389412 -494474 -454027 -465080 -242947
15544 -242947 84239 -90891 -325995 -317842 -239617 -370609 -255841 -209771 -186430 -150326 -276855
15533 -276855 -505825 -624192 -697178 -522365 -547683 -460663 -356573 -178474 -256700 -223951
15523 -223951 -247820 -255476 -177577 -22407 74399 84091 -138953 -169078 -118624 -200526 -371703
15512 -371703 -335077 -245040 -262412 -180616 2823 -103699 -168315 -286937 -374941 -409848 -448340
15501 -448340 -523199 -469541 -352515 -128538 -72626 -212754 -212311 -261620 -238872 -48522 141530
15490 141530 68025 -113341 -196827 -343811 -531305 -594667 -602912 -542557 -498721 -507935 -275481
15479 -275481 -387239 -522890 -536826 -544337 -490225 -246466 -93950 -161001 -269266 -221160 -233361
$$ packed form
15555a08983O9846M7633o5533p2058o5962j14440p9915j05062M0447j1053K22133
15544b42947L27186j75130k35104Q153P8225j30992J14768M6070K3341L6104j26529
15533b76855k28970j18367p2986J74813k5318Q7020J04090J78099p8226L2749
15523b23951k3869p656P7899J55170R6806R692k23044l0125N0454q1902j71177
15512c71703L6626R0037j7372Q1796J83439j06522o4616j18622q8004l4907l8492
15501d48340p4859N3658J17026K23977N5912j40128M43m9309K2748J90350J90052
15490A41530p3505j81366q3486j46984j87494o3362q245O0355M3836r214K32454
15479b75481j11758j35651j3936p511N4112K43759J52516o7051j08265M8106j2201
$$ plain form
15468 -233361 -229622 -378599 -560434 -480605 -648932 -643992 -545454 -532748 -159019 6471 51835
15457 51835 -132459 -204953 -411000 -578608 -552105 -421377 -423619 -506806 -632245 -601954 -573583
15446 -573583 -876920 -795864 -742312 -857863 -719918 -595633 -620929 -686411 -460574 -331357
15436 -331357 -349572 -318568 -424984 -406873 -269114 -258046 -244484 -261935 -221746 -331561 -389279
15425 -389279 -508274 -461627 -515725 -428308 -308321 -209505 -425662 -406326 -419762 -469062 -383498
15414 -383498 -427992 -538980 -292149 -351381 -335966 -311448 -335610 -265982 -318611 -383653 -513677
15403 -513677 -551595 -460456 -392827 -342481 -37398 187814 73813 -89558 -101090 -115998 -40753
15392 -40753 91956 129590 4508 33476 15975 48619 -109395 -97191 -51957 -124205 -148445
$$ packed form
15468b33361L739j48977j81835P9829j68327M940R8538J2706L73729J65490M5364
15457E1835j84294p2494k06047j67608K6503J30728k242q3187j25439L0291K8371
15446e73583l03337Q1056N3552j15551J37945J24285k5296o5482K25837J29217
15436c31357j8215L1004j06416J8111J37759J1068J3562j7451M0189j09815n7718
15425c89279j18995M6647n4098Q7417J19987R8816k16157J9336j3436m9300Q5564
15414c83498m4494j10988K46831n9232J5415K4518k4162O9628n2629o5042j30024
15403e13677l7918R1139O7629N0346L05083K25212j14001j63371j1532j4908P5245
15392d0753J32709L7634j25082K8968j7501L2644j58014J2204M5234p2248k4240
$$ plain form
15381 -148445 111613 74462 91924 102327 -166887 -346133 -202093 42910 29103 -69994
15371 -69994 -178247 -310358 -151282 -133332 -217290 -319901 -284385 -223528 -281201 -388152 -400922
15360 -400922 -499633 -505252 -569009 -503454 -339708 -164912 -82519 -135794 -161879 -101329 42337
15349 42337 -132069 -209013 -67686 -119798 -439895 -428491 -169317 -138614 -153331 -103550 -90520
15338 -90520 -112556 -269874 -517237 -511596 -400407 -500957 -314529 -233675 -238467 -257140 -377116
15327 -377116 -460488 -429772 -396852 -414712 -435506 -207849 -321588 -315923 -265104 -371340 -505711
15316 -505711 -683261 -766089 -573960 -519782 -472611 -221232 -91419 -20672 189821 339241
15306 339241 133915 -9128 -178497 -276138 -210173 -14264 106104 98036 54741 65025 -16756
$$ packed form
15381a48445K60058l7151J7462J0403k69214j79246J44040K45003j3807r9097
15371f9994j08253j32111J59076J7950q3958j02611L5516O0857n7673j06951j2770
15360d00922r8711n619o3757O5555J63746J74796Q2393n3275k6085O0550J43666
15349D2337j74406p6944J41327n2112l20097J1404K59174L0703j4717M9781J3030
15338i0520k2036j57318k47363N641J11189j00550J86428Q0854m792j8673j19976
15327c77116q3372L0716L2920j7860k0794K27657j13739N665N0819j06236j34371
15316e05711j77550q2828J92129N4178M7171K51379J29813P0747K10493J49420
15306C39241k05326j43043j69369r7641O5965J95909J20368q068m3295J0284q1781
$$ plain form
15295 -16756 -77804 -282771 -398154 -350709 -312033 -504882 -416264 -362478 -218846 -305383 -402455
15284 -402455 -451562 -565002 -474195 -506194 -641513 -643148 -536364 -655634 -612621 -513737 -451945
15273 -451945 -409417 -221594 -274400 -197452 -85021 -128820 -287176 -548107 -488925 -281369
15263 -281369 -151305 -341159 -534291 -515788 -404835 -301874 -171591 33697 -14228 -57362
15253 -57362 47193 -98925 -340715 -95554 -221164 -214070 -67170 47823 158589 159815
15243 159815 22089 126654 88169 65304 -53474 -327441 -276280 -375892 -569514 -437366
15233 -437366 -183831 -222557 -308936 -328624 -295620 -277733 -324188 -435167 -356868 -299397 -440597
15222 -440597 -228704 -244716 -351121 -86762 -255276 -410872 -405652 -306252 -332457 -494620
$$ packed form
15295a6756o1048k04967j15383M7445L8676j92849Q8618N3786J43632q6537r7072
15284d02455m9107j13440R0807l1999j35319j635J06784j19270M3013R8884O1792
15273d51945M2528J87823n2806P6948J12431m3799j58356k60931N9182K07556
15263b81369J30064j89854j93132J8503J10953J02961J30283K05288m7925m3134
15253e7362J04555j46118k41790K45161j25610P094J46900J14993J10766J226
15243A59815j37726J04565l8485k2865j18778k73967N1161r9612j93622J32148
15233d37366K53535l8726q6379j9688L3004J7887m6455j10979P8299N7471j41200
15222d40597K11893j6012j06405K64359j68514j55596N220R9400k6205j62163
$$ plain form
15212 -494620 -551383 -388007 -269734 -356181 -440275 -532002 -522917 -276657 -122929 -113464 -274526
15201 -274526 -243590 -281283 -297867 -167212 -148675 -24887 -65265 -176237 29869 -5089 -3897
15190 -3897 -199911 -235098 -282816 -238615 -212272 -228902 -305412 -284139 -190245 -124286 -133311 -212
15178 -212 43560 119406 73169 11198 -130867 -339842 -257106 13032 51046 -2577 87148
15167 87148 21653 -119921 -36396 51451 280035 329847 114119 -306411 -345804 -264637 -149538
15156 -149538 -176803 -325443 -268319 -179352 -49380 153774 146007 119936 -71738 -321126 -358620
15145 -358620 -219861 -8251 -264119 -306258 -624826 -774273 -519811 -427815 -208307 -113864
15135 -113864 -202676 -387907 -468428 -541662 -550559 -576243 -432606 -338501 -237768 -174585 -292524
$$ packed form
15212d94620n6763J63376J18273q6447q4094r1727R085K46260J53728R465j61062
15201b74526L0936l7693j6584J30655J8537J23788m0378j10972K06106l4958J192
15190c897j96014l5187m7718M4201K6343j6630p6510K1273R3894O5959r025J33099
15178b12M3772P5846m6237o1971j42065k08975Q2736K70138L8014n3623Q9725
15167H7148o5495j41574Q3525Q7847K28584M9812k15728m20530l9393Q1167J15099
15156a49538k7265j48640N7124Q8967J29972K03154p767k6071j91674k49388l7494
15145c58620J38759K11610k55868m2139l18568j49447K54462R1996K19508R4443
15135a13864q8812j85231q0521p3234q897k5684J43637R4105J00733O3183j17939
$$ plain form
15124 -292524 -371019 -498350 -554389 -635641 -668950 -794374 -638899 -495137 -599036 -509925
15114 -509925 -280869 -343788 -230162 -243523 -308545 -410659 -600289 -664182 -565266 -556861 -503871
15103 -503871 -413834 -460450 -519086 -549183 -477103 -432652 -281839 -286222 -411584 -449983 -605749
15092 -605749 -730933 -606567 -481211 -423231 -477468 -504951 -341337 -235260 -214902 -267203
15082 -267203 -293553 -319793 4756 229086 -20400 -159867 -518200 -805999 -482388 -490026
15072 -490026 -238893 -78128 -99562 -86637 -166465 -431109 -470159 -247425 -54853 -165343
15062 -165343 -334313 -322837 -232061 -228835 -200575 -326197 -341448 -230831 -191616 -251089 -529198
15051 -529198 -408366 -131188 -111167 -69590 79319 78214 163360 184618 15114 12447 -103304
$$ packed form
15124b92524p8495j27331n6039q1252l3309j25424J55475J43762j03899Q9111
15114e09925K29056o2919J13626j3361o5022j02114j89630o3893R8916Q405N2990
15103e03871R0037m6616n8636l0097P2080M4451J50813m383j25362l8399j55766
15092f05749j25184J24366J25356N7980n4237k7483J63614J06077K0358n2301
15082b67203k6350k6240L24549K24330k49486j39467l58333k87799L23611p638
15072d90026K51133J60765k1434J2925p9828k64644l9050K22734J92572j10490
15062a65343j68970J1476R0776L226K8260j25622j5251J10617L9215n9473k78109
15051e29198J20832K77178K0021M1577J48909j105Q5146K1258j69504k667j15751
$$ plain form
15040 -103304 -126172 49502 15603 36234 -93752 -416316 -441612 -332278 -154183 -155783 -401431
15029 -401431 -422268 -296665 -238778 -230302 -215569 -327975 -317855 -268923 -335479 -318234 -334029
15018 -334029 -196792 -154584 4206 52118 -41668 -226467 -245753 -156322 -370027 -561433
15008 -561433 -320563 -95006 -75070 -204811 -352095 -271553 -200067 -356024 -619268 -529525
14998 -529525 -323734 -250837 -241907 -576234 -512870 -212158 -122859 -165960 -320976 -475105 -627646
14987 -627646 -586917 -616068 -334533 -122725 -109576 -135157 -253835 -299723 -216631 -397468 -428457
14976 -428457 -423616 -598968 -561506 -329604 -414136 -225402 -118518 -255451 -343575 -323681 -364885
14965 -364885 -262531 -273693 -197619 -370636 -446539 -597053 -743710 -707019 -291861 -43297
$$ packed form
15040a03304k2868J75674l3899K0631j29986l22564k5296J09334J78095j600k45648
15029d01431k0837J25603N7887Q476J4733j12406J0120M8932o6556J7245j5795
15018c34029J37237M2208J58790M7912r3786j84799j9286Q9431k13705j91406
15008e61433K40870K25557J9936j29741j47284Q0542P1486j55957k63244Q9743
14998e29525K05791P2897Q930l34327O3364L00712Q9299m3101j55016j54129j52541
14987f27646M0729k9151K81535K11808J3149k5581j18678m5888Q3092j80837l0989
14976d28457M841j75352L7462K31902q4532J88734J06884j36933q8124J9894m1204
14965c64885J02354j1162P6074j73017p5903j50514j46657L6691M15158K48564
$$ plain form
14955 -43297 -647 42127 -241617 -471793 -278045 -160051 -217821 -283633 -352419 -332650 -178692
14944 -178692 -417700 -582526 -559595 -449238 -426661 -484238 -335695 -181986 -68353 -224408
14934 -224408 -257909 -293021 -282593 -182464 -325612 -340864 -315706 -405162 -505184 -579378 -499913
14923 -499913 -386045 -119529 -11281 -9822 -55339 -166907 -197147 -145785 -117676 -345571 -420921
14912 -420921 -397854 3319 77679 44289 27641 -135854 -252085 -404807 -542548 -522289
14902 -522289 -217438 -258381 -333998 -271832 -245272 -225322 -297894 -474986 -449179 -361984 -539850
14891 -539850 -656571 -641950 -428130 -404098 -504839 -472918 -359955 -431242 -334060 -134005
14881 -134005 -308075 -303913 -314210 -368335 -343208 -302361 -268464 -298097 -317989 -390764 -584378
$$ packed form
14955d3297M2650M2774k83744k30176J93748J17994n7770o5812o8786J9769J53958
14944a78692k39008j64826K2931J10357K2577n7577J48543J53709J13633j56055
14934b24408l3501l5112J0428J00129j43148j5252K5158q9456j00022p4194P9465
14923d99913J13868K66516J08248J459m5517j11568l0240N1362K8109k27895p5350
14912d20921K3067M01173P4360l3390j6648j63495j16231j52722j37741K0259
14902e22289L04851m0943p5617O2166K6560J9950p2572j77092K5807Q7195j77866
14891e39850j16721J4621K13820K4032j00741L1921J12963p1287R7182K00055
14881a34005j74070M162j0297n4125K5127M0847L3897k9633j9892p2775j93614
$$ plain form
14870 -584378 -505030 -575619 -840441 -862229 -755107 -647169 -531021 -438408 -386825 -475062 -454749
14859 -454749 -132495 67841 -191369 -528613 -341558 -164431 113660 186149 184478 144238
14849 144238 -23292 -51976 133207 254581 160463 71093 -70081 -274548 -444754 -498745
14839 -498745 -241794 -299216 -186710 -93192 -146368 -53477 -370623 -456417 -378791 -267786 -168543
14828 -168543 -229181 -463542 -455320 -478263 -415950 -217118 -10180 5597 -161783 -409150 -475817
14817 -475817 -122455 -266856 -359906 -460842 -591698 -540763 -520210 -502009 -603176 -444085
14807 -444085 -296610 -298879 -243412 -228635 -237231 -408668 -448591 -646826 -843568 -478836 -212845
14796 -212845 -216553 -131085 -126385 -339813 -308179 -199693 -61308 1329 -28632 -81091 -104311
$$ packed form
14870e84378P9348p0589k64822k1788J07122J07938J16148R2613N1583q8237K0313
14859d54749L22254K00336k59210l37244J87055J77127K78091P2489j671m0240
14849A44238j67530k8684J85183J21374r4118q9370j41174k04467j70206n3991
14839d98745K56951n7422J12506R3518n3176R2891l17146q5794P7626J11005R9243
14828a68543o0638k34361Q222k2943O2313J98832K06938J5777j67380k47367o6667
14817d75817L53362j44401r3050j00936j30856N0935K0553J8201j01167J59091
14807d44085J47475k269N5467J4777q596j71437l9923j98235j96742L64732K65991
14796b12845l708Q5468M700k13428L1634J08486J38385O2637k9961n2459k3220
$$ plain form
14785 -104311 -158394 -337134 -471115 -327092 -400349 -376738 -440553 -485352 -226548 -45100
14775 -45100 50884 146987 98667 169400 247963 303296 -99435 -494602 -415267 -144374 -236736
14764 -236736 -349525 -491013 -423147 -525157 -415320 -389436 -315345 -316400 -317428 -252650 -130906
14753 -130906 -189705 -407155 -455834 -264982 -254307 -351279 -479037 -382083 -402634 -305582 -231225
14742 -231225 -277046 -345595 -394667 -501781 -620712 -593881 -451235 -352532 -643452 -651886 -239381
14731 -239381 19391 -205516 -288484 -199778 -86013 -139161 -203674 -13731 -85488 -214480
14721 -214480 28365 142384 53571 -6923 -140677 -192895 -325767 -392927 -319587 -300902 -316383
14710 -316383 -329509 -296145 -392823 -497432 -624787 -702089 -598397 -586900 -468830 -292116
$$ packed form
14785a04311n4083j78740j33981J44023p3257K3611o3815m4799K58804J81448
14775d5100R5984R6103m8320P0733P8563N5333m02731l95167P9335K70893r2362
14764b36736j12789j41488O7866j02010J09837K5884P4091j055j028O4778J21744
14753a30906n8799k17450m8679J90852J0675r6972j27758R6954k0551R7052P4357
14742b31225m5821o8549m9072j07114j18931K6831J42646R8703k90920q434M12505
14731b39381K58772k24907q2968Q8706J13765n3148o4513J89943p1757j28992
14721b14480K42845J14019q8813o0494j33754n2218j32872o7160P3340J8685j5481
14710c16383j3126L3364r6678j04609j27355p7302J03692J1497J18070J76714
$$ plain form
14700 -292116 -242344 -435009 -460946 -495137 -624448 -632061 -453240 -272784 -368894 -544863 -517328
14689 -517328 -335124 -175185 -117077 -215364 -160799 -265393 -545290 -586622 -521965 -525198 -457245
14678 -457245 -641116 -602181 -475163 -336451 -208446 -279644 -347758 -168823 -297797 -292483
14668 -292483 -163092 -78553 -267302 -375729 -321555 -286042 -173578 -184492 -268773 -292758 -201708
14657 -201708 -16757 -62144 -276528 -339297 -351570 -536570 -343178 -277968 -256819 -213848 -44400
14646 -44400 96262 34639 -39418 -144485 -64288 51934 153810 260256 59131 -33877
14636 -33877 -73599 -263855 -309346 -371893 -445798 -336645 -184474 -162883 -274321 -376145 -429915
14625 -429915 -424993 -412335 -378961 -391352 -328700 -250394 -313674 -188599 -205513 -260723 -353252
$$ packed form
14700b92116M9772j92665k5937l4191j29311p613J78821J80456r6110j75969K7535
14689e17328J82204J59939N8108r8287N4565j04594k79897m1332O4657l233O7953
14678d57245j83871L8935J27018J38712J28005p1198o8114J78935j28974N314
14668b92483J29391Q4539j88749j08427N4174L5513J12464j0914q4281k3985R1050
14657b01708J84951m5387k14384o2769j2273j85000J93392O5210K1149M2971J69448
14646d4400J40662o1623p4057j05067Q0197J16222J01876J06446k01125r3008
14636c3877l9722j90256m5491o2547p3905J09153J52171K1591j11438j01824n3770
14625d29915M922J2658L3374j2391O2652P8306o3280J25075j6914n5210r2529
$$ plain form
14614 -353252 -371584 -419413 -543767 -404009 -408928 -427652 -367583 -379954 -262537 -286371 -600478
14603 -600478 -577731 -578524 -435724 -341253 -364116 -201935 -117628 -280429 -346890 -153559 59746
14592 59746 -94530 -233461 -170297 -259620 -431098 -524867 -490756 -321130 -295668 -477897 -321528
14581 -321528 -36796 97177 19727 -83268 -132332 -189669 -186798 -294825 -394939 -439626 -603673
14570 -603673 -714185 -631969 -413335 -532250 -459031 -163445 -97338 -89466 -220359 -484765
14560 -484765 -509678 -188883 -80764 -111092 -405056 -726630 -617026 -459068 -382652 -305250
14550 -305250 -192301 -235410 -278406 -332128 -222793 -87451 -76564 -194500 -357187 -330762
14540 -330762 -264215 -204703 -198086 -323562 -306610 -343754 -324424 -172610 -154161 -261739 -292655
$$ packed form
14614c53252j8332m7829j24354J39758m919j8724O0069j2371J17417k3834l14107
14603f00478K2747p93J42800R4471k2863J62181Q4307j62801o6461J93331K13305
14592E9746j54276j38931O3164q9323j71478r3769L4111J69626K5462j82229J56369
14581c21528K84732J33973p7450j02995m9064n7337K871j08027j00114m4687j64047
14570f03673j10512Q2216K18634j18915P3219K95586O6107P872j30893k64406
14560d84765k4913L20795J08119l0328k93964l21574J09604J57958P6416P7402
14550c05250J12949m3109m2996n3722J09335J35342J0887j17936j62687K6425
14540c30762O6547N9512O617j25476J6952l7144J9330J51814J8449j07578l0916
$$ plain form
14529 -292655 -454840 -348794 -339647 -246326 -84845 -50696 45817 -109313 -129737 -126760 -278379
14518 -278379 -431229 -467089 -510702 -534698 -442486 -570981 -506363 -445536 -308260 -412534 -588947
14507 -588947 -550430 -412473 -611948 -506166 -398896 -207133 -238159 -251650 -404205 -284884
14497 -284884 -222771 -511368 -471651 -111722 -225065 -390564 -233622 -209885 -93903 -152016
14487 -152016 -388937 -465367 -640391 -425280 -244823 -349211 -320333 -309989 -441013 -462256
14477 -462256 -527088 -523358 -556654 -574350 -536755 -390491 -382416 -462397 -277914 -158370 16267
14466 16267 186760 199725 31401 -245703 -182066 -219300 -324700 -186373 -240051 -282714 -283199
14455 -283199 -265625 -164257 -229492 -265814 -317861 -503172 -503098 -506428 -446026 -350033 -338711 -71867
$$ packed form
14529b92655j62185J06046R147R3321J61481L4149R6513j55130k0424K977j51619
14518b78379j52850l5860m3613k3996R2212j28495O4618O0827J37276j04274j76413
14507e88947L8517J37957j99475J05782J07270J91763l1026j3491j52555J19321
14497b84884O2113k88597L9717L59929j13343j65499J56942K3737J15982n8113
14487a52016k36921p6430j75024K15111J80457j04388K8878J0344j31024k1243
14477d62256o4832L730l3296j7696L7595J46264Q075p9981J84483J19544J74637
14466A6267J70493J2965j68324k77104O3637l7234j05400J38327n3678m2663m85
14455b83199J7574J01368o5235l6322n2047j85311P4l330O0402R5993J1322K66844
$$ plain form
14443 -71867 -76203 -199262 -279908 -213702 -156140 32899 -44543 -383146 -564032 -477574 -504040
14432 -504040 -471706 -497926 -597564 -487766 -303662 -109005 -113436 -240200 -237496 -177053 -142316
14421 -142316 -81534 -10110 -179113 -259124 -250505 -318016 -137797 -158449 -239593 -226009 -232409
14410 -232409 -138617 -139604 -59085 -1842 2996 -63677 -140990 -32590 -52998 -89060 58112 212146
14398 212146 -54572 -91139 -41487 -80807 13531 -84041 -93319 -82344 29505 -304180 -286385
14387 -286385 31675 6552 -65729 -270662 -315338 -237354 -80457 102689 122362 -57537
14377 -57537 -303679 -224926 -45638 -81654 -262643 -344886 -100250 22073 50467 166834
14367 166834 -12428 -338396 -218784 -120099 -123038 -294114 -207736 -281024 -481279 -379651
$$ packed form
14443g1867m336j23059q0646O6206N7562J89039p7442l38603j80886Q6458k6466
14432e04040L2334k6220r9638J09798J84104J94657m431j26764K704O0443L4737
14421a42316O0782P1424j69003q0011Q619o7511J80219k0652q1144J3584o400
14410b32409R3792r87Q0519N7243M838o6673p7313J08400k0408l6062J47172J54034
14398B12146k66718l6567M9652l9320R4338r7572r278J0975J11849l33685J7795
14387b86385L18060k5123p2281k04933m4676P7984J56897J83146J9673j79899
14377e7537k46142P8753J79288l6016j80989q2243K44636J22323K8394J16367
14367A66834j79262l25968J19612R8685k939j71076Q6378p3288k00255J01628
$$ plain form
14357 -379651 -153419 6385 -34406 -167996 -270665 -328502 -438376 -326736 -331682 -494492
14347 -494492 -299983 -106592 70030 72652 20581 40497 7240 -242059 -368942 -217078
14337 -217078 -109657 -212030 -197901 -318211 -551343 -548122 -301794 -199229 -297794 -289089 -211214
14326 -211214 -143537 -84510 -164655 -174500 -300463 -351137 -369424 -482286 -520885 -531098 -412154
14315 -412154 -408375 -353234 -224292 -372504 -343963 -407308 -435433 -140136 80823 -91230 -9182
14304 -9182 161853 140768 32188 -149725 -117438 -20179 25649 -93371 -241938 -206505 -159743
14293 -159743 -181980 -172661 -64463 55025 -70522 -125400 -75180 -315640 -299432 -200136 -159156
14282 -159156 -212212 -354192 -449945 -304285 -154241 28249 140762 158781 157915 203393 125053
$$ packed form
14357c79651K26232J59804m0791j33590j02669n7837j09874J11640m946j62810
14347d94492J94509J93391J76622K622n2071J9916l3257k49299j26883J51864
14337b17078J07421j02373J4129j20310k33132L221K46328J02565r8565Q705P7875
14326b11214O7677N9027q0145r845j25963n0674j8287j12862l8599j0213J18944
14315d12154L779N5141J28942j48212K8541o3345k8125K95297K20959j72053Q2048
14304i182J71035k1085j08580j81913L2287R7259M5828j19020j48567L5433M6762
14293a59743k2237R319J08198J19488j25547n4878N0220k40460J6208R9296M0980
14282a59156n3056j41980r5753J45660J50044J82490J12513J8019q66M5478p8340
$$ plain form
14271 125053 63422 17953 21345 157551 157398 -31488 -86111 -218643 -426675 -380920 -224531
14260 -224531 -109796 -57199 107824 79646 91861 -111052 -278297 -55666 101539 9096
14250 9096 -197650 -363563 -544284 -300237 -99746 -170993 -180713 57948 28420 -183289 -257517
14239 -257517 39535 129784 -29879 -110013 -261899 -167958 240085 378300 179450 -169111
14229 -169111 -253769 -252031 -219505 -228926 -297193 -354317 -269679 -215972 -68100 74336 9384
14218 9384 -126289 -7272 -111519 -212337 5762 15822 -156636 -186657 -211424 -261881 -205605
14207 -205605 -127915 -71076 -33343 -217660 -108837 -121016 -5214 -74507 -225634 -102159
14197 -102159 -238854 57248 26442 -29598 -17580 -90458 -127651 -32087 -221922 -349747 -390387
$$ packed form
14271A25053o1631m5469L392J36206j53j88886n4623j32532k08032M5755J56389
14260b24531J14735N2597J65023k8178J2215k02913j67245K22631J57205r2443
14250I096k06746j65913j80721K44047K00491p1247r720K38661k9528k11709p4228
14239b57517K97052R0249j59663q0134j51886R3941M08043J38215j98850l48561
14229a69111q4658J738L2526r421o8267n7124Q4638N3707J47872J42436o4952
14218I384j35673J19017j04247j00818K18099J0060j72458l0021k4767n0457N6276
14207b05605P7690N6839L7733j84317J08823j2179J15802o9293j51127J23475
14197a02159j36695K96102l0806n6040J2018p2878l7193R5564j89835j27825m0640
$$ plain form
14186 -390387 -422078 -412307 -308696 -254767 -221851 -259217 -384112 -418528 -250134 -240795 -194606
14175 -194606 -166734 -212995 -143938 -288407 -258292 -384489 -564493 -668354 -350771 -274586
14165 -274586 -198926 -228267 -296881 -134761 -200498 -474776 -641802 -451752 -106063 135542
14155 135542 -58097 -242115 -149509 -69751 -176453 -389929 -432334 -199986 -73256 119298
14145 119298 81634 52433 63903 167977 42203 46678 -25221 -148220 -134150 -11939 11878
14134 11878 21976 -83281 -238495 -412599 -579382 -566699 -437789 -122706 -89974 -198894
14124 -198894 -15904 -126809 133631 51423 -30526 -392238 -633890 -430206 -151554 -61725
14114 -61725 -105165 238939 405046 112345 -31716 -76806 -85984 13316 -16922 -12075 -194756
$$ packed form
14186c90387l1691R771J03611N3929L2916l7366j24895l4416J68394R339M6189
14175a94606K7872m6261O9057j44469L0115j26197j80004j03861L17583P6185
14165b74586P5660k9341o8614J62120o5737k74278j67026J90050L45689K41605
14155A35542j93639j84018R2606P9758j06702k13476m2405K32348J26730J92554
14145A19298l7664k9201J1470J04074j25774M475p1899j22999J4070J22211K3817
14134A1878J0098j05257j55214j74104j66783J2683J28910L15083L2732j08920
14124a98894J82990j10905K60440q2208q1949l61712k41652K03684K78652Q9829
14114f1725m3440L44104J66107k92701j44061m5090r178R9300l0238M847j82681
$$ plain form
14103 -194756 -146737 -128047 -348855 -233230 -115068 -187059 -189440 -201224 -206212 -71807 39170
14092 39170 98470 88886 37804 -63383 51866 1352 -213093 -207567 -262106 -346829 -185561
14081 -185561 -120096 -196360 -238401 -187417 -170750 -113849 68572 180191 127455 -30589 -78500
14070 -78500 -198718 -295919 -225266 -101399 -70636 -7914 -66311 -231371 -553000 -632751 -512802
14059 -512802 -502772 -416619 -309162 -64257 97163 103290 5058 -210441 -97768 -202213
14049 -202213 -459822 -457872 -323932 -161995 -44636 -156561 -345450 -361122 -188459 -157136
14039 -157136 -229626 -79937 54792 4996 -61342 186165 191740 -58729 -272741 -373873
14029 -373873 -268549 -212842 -32398 171438 124820 131695 -27733 -174325 -147025 -52926 -46437
$$ packed form
14103a94756M8019J8690k20808J15625J18162p1991k381j1784m988J34405J10977
14092C9170N9300r584n1082j01187J15249n0514k14445N526n4539q4723J61268
14081a85561O5465p6264m2041N0984J6667N6901J82421J11619n2736j58044m7911
14070g8500j20218r7201P0653J23867L0763O2722n8397j65060l21629p9751J19949
14059e12802J0030Q6153J07457K44905J61420O127r8232k15499J12673j04445
14049b02213k57609J950J33940J61937J17359j11925j88889j5672J72663L1323
14039a57136p2490J49689J34729m9796o6338K47507N575k50469k14012j01132
14029c73873J05324N5707J80444K03836m6618O875j59428j46592K7300R4099O489
$$ plain form
14018 -46437 -123483 -367239 -454413 -294481 -276268 -252871 -84282 -258102 -572485 -520038 -329660
14007 -329660 -234566 -237649 -339249 -225567 -158350 -125466 -223298 -152363 -133810 -61795 15749
13996 15749 140034 83992 127853 404189 365827 219612 -33446 -65360 2918 9138 169840
13985 169840 18842 136451 78552 84372 58551 -87786 -305589 -135091 -34529 -18807
13975 -18807 -170539 -164147 19468 237178 210429 190626 69448 279071 82749 -49210
13965 -49210 10111 -28693 -46223 -147925 -138928 -206811 -212723 -64912 6111 -250538 -400622
13954 -400622 -285048 -166062 -28419 -125286 -460835 -604576 -534123 -436308 -213113 -45415
13944 -45415 -168236 -216092 -252484 -250434 -80573 -44174 54610 112700 -28800 -20940 -83684
$$ packed form
14018d6437p7046k43756q7174J59932J8213K3397J68589j73820l14383N2447J90378
14007c29660R5094l083j01600J13682O7217L2884r7832P0935J8553P2015P7544
13996A5749J24285n6042M3861K76336l8362j46215k53058l1914O8278O220J60702
13985A69840j50998J17609n7899N820k5821j46337k17803J70498J00562J5722
13975a8807j51732O392J83615K17710k6749j9803j21178K09623j96322j31959
13965d9210N9321l8804j7530j01702Q997o7883n912J47811P1023k56649j50084
13954d00622J15574J18986J37643r6867l35549j43741P0453R7815K23195J67698
13944d5415j22821m7856l6392K050J69861L6399R8784N8090j41500P860o2744
$$ plain form
13933 -83684 64110 68293 58975 -207755 -348410 -204561 -138489 -56087 263908 427968 477283
13922 477283 496323 284090 -98339 -330931 -93384 285393 167089 22880 325539 648569
13912 648569 364744 -225778 -371833 -266798 -293778 -358910 -359792 -552081 -649270 -426971 -316752
13901 -316752 -332241 10538 -24365 47214 51362 14623 103018 136137 150294 196062 89039
13890 89039 47171 -6887 -243321 -308259 -182940 -251693 -275167 -87917 -97373 -38579 -307070
13879 -307070 -259553 -281199 -254369 -270102 -385592 -315383 -56533 104217 -5241 -81833 -231516
13868 -231516 -345022 -253884 -43223 -68630 91029 134834 166462 82807 191635 188733 157252
13857 157252 57344 118351 151272 139812 152517 208195 199099 91079 109340 148883 86243
$$ packed form
13933h3684J47794M183r318k66730j40655J43849O6072Q2402L19995J64060M9315
13922D77283J9040k12233l82429k32592K37547L78777j18304j44209L02659L23030
13912F48569k83825n90522j46055J05035k6980o5132q82j92289r7189K22299J10219
13901c16752j5489L42779l4903P1579M148l6739Q8395L3119J4157M5768j07023
13890H9039m1868n4058k36434o4938J25319o8753k3474J87250r456N8794k68491
13879c07070M7517k1646K6830j5733j15490P0209K58850J60750j09458p6592j49683
13868b31516j13506R1138K10661k5407J59659M3805L1628q3655J08828k902l1481
13857A57252r9908O1007L2921j1460J2705N5678r096j08020J8261L9543o2640
$$ plain form
13846 86243 139919 163095 73626 107859 133545 100376 28839 51277 -5045 -243921 -381437
13835 -381437 -258945 -161004 -57957 9441 -84414 -241874 -118294 -140136 -10361 87470
13825 87470 170645 118608 48736 3534 -167811 -71362 -220314 -246620 -66307 42197 151914
13814 151914 69724 -15247 -82710 158766 434033 540531 314172 58761 4627 260996
13804 260996 140950 158142 219416 73867 -50899 -70122 -133655 -217853 -383055 -217877
13794 -217877 56163 -47418 -251082 38575 308010 197928 82702 -148418 -250850 -294161
13784 -294161 -208354 -46291 -33226 53598 -1409 -51140 -46417 -122910 -225201 -358253 -350511
13773 -350511 -427928 -323314 -344893 -333732 -188438 -32583 162425 -20411 -154215 -69041
$$ packed form
13846H6243N3676K3176q9469L4233K5686l3169p1537K2438n6322k38876j37516
13835c81437J22492R7941J03047O7398r3855j57460J23580k1842J29775R7831
13825H7470Q3175n2037o9872m5202j71345R6449j48952k6306J80313J08504J09717
13814A51914q2190q4971o7463K41476K75267J06498k26359k55411n4134K56369
13804B60996j20046J7192O1274j45549j24766j9223o3533q4198j65202J65178
13794b17877K74040j03581k03664K89657K69435j10082j15226k31120j02432m3311
13784b94161Q5807J62063J3065Q6824n5007m9731M723p6493j02291j33052P742
13773c50511p7417J04614k1579J1161J45294J55855J95008j82836j33804Q5174
$$ plain form
13763 -69041 -121907 -84298 86394 238219 393683 353030 109708 -173371 -351354 -381773
13753 -381773 -323002 -293510 -286897 -186053 -204331 -298459 -362733 -329996 -276555 -133979 -9328
13742 -9328 -103668 -124464 -113971 105219 119150 207964 206525 138518 213120 168569 60807 182024
13730 182024 112001 -79860 -342495 -186708 -136594 -25393 92590 43787 -171162 -219021
13720 -219021 -137210 146302 324378 184567 47197 -20814 128406 242460 92040 19216
13710 19216 -79158 -5883 -56221 7006 38498 222035 297865 251073 199638 227379 67723
13699 67723 15221 78481 111128 188860 134201 29684 -31572 -131512 -203036 6459 63886
13688 63886 -191798 -217562 -192553 -307457 -429792 -346117 -325266 -273356 -118034 100566 84462
$$ packed form
13763f9041n2866L7609J70692J51825J55464m0653k43322k83079j77983l0419
13753c81773N8771K9492O613J00844j8278r4128o4274L2737N3441J42576J24651
13742i328r4340k0796J0493K19190J3931Q8814j439o8007P4602m4551j07762J21217
13730A82024p0023j91861k62635J55787N0114J11201J17983m8803k14949m7859
13720b19021Q1811K83512J78076j39811j37370o8011J49220J14054j50420p2824
13710A9216r8374P3275n0338O3227L1492J83537P5830m6792n1435K7741j59656
13699F7723n2502O3260L2647P7732n4659j04517o1256r9940p1524K09495N7427
13688F3886k55684k5764K5009j14904j22335Q3675K0851N1910J55322K18600j6104
$$ plain form
13677 84462 -27525 -168741 -175998 25616 133177 -48585 -94905 -96846 -168210 -241998 -9786
13666 -9786 -57763 119 153842 226741 147042 49603 188537 379190 312515 433493 462399
13655 462399 495619 453491 139998 274846 219439 86039 81119 75505 -34738 -95187 -96925
13644 -96925 -75363 177862 -38117 -271916 -88003 6475 50711 39214 84433 112755 58250
13633 58250 89214 -55589 -126814 5770 -94598 -125457 58310 -124090 -321030 -270454
13623 -270454 -165942 -100093 13965 31088 -114760 -93899 33453 39742 199267 132354 133694
13612 133694 245473 190838 94599 89666 191161 173377 132510 349228 316529 371752 338976
13601 338976 272638 197451 187586 186204 238498 -35618 -127904 -71015 -83810 -83458 16840 79093
$$ packed form
13677H4462j11987j41216p257K01614J07561j81762m6320j941p1364p3788K32212
13666i786m7977N7882J53723P2899p9699r7439J38934J90653o6675J20978K8906
13655D62399L3220m2128l13493J34848n5407j33400m920n614j10243o0449j738
13644i6925K1562K53225k15979k33799J83913R4478M4236j1497M5219K8322n4505
13633E8250L0964j44803p1225J32584j00368l0859J83767j82400j96940N0576
13623b70454J04512O5849J14058J7123j45848K0861J27352O289J59525o6913J340
13612A33694J11779n4635r6239m933J01495j7784m0867K16718l2699N5223l2776
13601C38976o6338p5187r865j382N2294k74116r2286N6889j2795L52J00298O2253
$$ plain form
13589 79093 275551 207708 -96574 -172682 -140856 57479 215161 332190 206174 281701
13579 281701 165100 -91088 -203157 -293804 -193807 -22373 154314 -68786 -229786 -268134
13569 -268134 -294429 -271047 -92503 131495 69156 -102244 -58230 62756 -66476 -79552
13559 -79552 -16903 47320 121955 60804 96866 203603 240410 202289 177058 308804 390422
13548 390422 403581 276060 191527 200829 125420 -79671 -168696 -261250 -183929 -15160 -58676
13537 -58676 -60692 -90250 -220207 -266695 -341663 -384226 -479229 -287707 -111176 -124282 -128366
13526 -128366 -205757 -145747 -216439 -174938 -92306 -8996 117670 -77682 -79949 77048 326159
13515 326159 231139 317069 247986 173889 -175398 -356585 -224380 -152492 -219807 -91239 334721
$$ packed form
13589G9093J96458o7843l04282p6108L1826J98335J57682J17029j26016P5527
13579B81701j16601k56188j12069r0647R9997J71434J76687k23100j61000l8348
13569b68134k6295K3382J78544K23998o2339j71400M4014J20986j29232j3076
13559g9552O2649O4223P4635o1151L6062J06737L6807l8121k5231J31746Q1618
13548C90422J3159j27521q4533R302p5409k05091q9025r2554P7321J68769m3516
13537e8676k016k9558j29957m6488p4968m2563r5003J91522J76531j3106m084
13526a28366p7391O0010p0692M1501Q2632Q3310J26666j95352k267J56997K49111
13515C26159r5020Q5930o9083p4097l49287j81187J32205P1888o7315J28568M25960
$$ plain form
13504 334721 549846 419068 16678 -186511 -39262 44632 62811 106156 257227 197226
13494 197226 77814 -46721 49250 -28392 -284487 -133258 186180 331230 483613 303057
13484 303057 311788 456504 239078 226830 106193 226522 254884 397856 322289 248234 624010
13473 624010 539460 167655 123690 134787 200196 391779 310332 44641 -89367 -239249
13463 -239249 -90986 41986 -68025 -86809 147707 318245 334024 255027 57158 -36031
13453 -36031 -66215 -40069 22734 211258 389949 420681 265782 302697 217597 -5387 -11255
13442 -11255 -93572 -135099 -241972 -69551 -149337 -80949 -96628 636 74610 72306 173062
13431 173062 177684 218938 103354 5196 -248680 -311603 -85223 177232 294119 409683
$$ packed form
13504C34721K15125j30778m02390k03189J47249Q3894J8179M3345J51071o0001
13494A97226j19412j24535R5971p7642k56095J51229L19438J45050J52383j80556
13484C03057Q731J44716k17426j2248j20637J20329K8362J42972p5567p4055L75776
13473F24010q4550l71805m3965J1097O5409J91583q1447k65691j34008j49882
13463b39249J48263J32972j10011j8784K34516J70538J5779p8997j97869r3189
13453c6031l0184K6146O2803J88524J78691L0732j54899L6915q5100k22984n868
13442a1255q2317m1527j06873J72421p9786O8388j5679R7264P3974k304J00756
13431A73062M622M1254j15584r8158k53876o2923K26380K62455J16887J15564
$$ plain form
13421 409683 416139 83678 75053 -69156 72694 23196 -44172 99227 144349 261286 396027
13410 396027 297988 131501 158166 212610 150776 196205 357659 311384 108473 -183139 54867
13399 54867 225468 184317 150588 -88544 27666 112752 25465 -34816 356350 516658 537021
13388 537021 559859 349938 180388 173817 300995 296208 126943 96474 187538 318553 355965
13377 355965 442868 499972 369553 272403 376902 436481 197662 109674 68997 230698 398993
13366 398993 328785 199296 271034 359384 428984 301239 9370 -46522 22163 -73958 83020
13355 83020 478855 633499 323885 107193 167062 280119 26699 -16540 107040 202195
13345 202195 -15077 -211445 -99810 143281 419568 459494 272740 233022 206510 508281
$$ packed form
13421D09683O456l32461q625j44209J41850m9498o7368J43399M5122J16937J34741
13410C96027r8039j66487K6665N4444o1834M5429J61454m6275k02911k91612K38006
13399E4867J70601m1151l3729k39132J16210Q5086q7287o0281L91166J60308K0363
13388E37021K2838k09921j69550o571J27178m787j69265l0469R1064J31015L7412
13377C55965Q6903N7104j30419r7150J04499N9579k38819q7988m0677J61701J68295
13366C98993p0208j29489P1738Q8350O9600j27745k91869n5892O8685r6121J56978
13355H3020L95835J54644l09614k16692N9869J13057k53420m3239J23580R5155
13345B02195k17272j96368J11635K43091K76287L9926j86754l9718k6512L01771
$$ plain form
13335 508281 951254 689789 175693 -215201 -465364 -212500 84694 139413 265505 223940
13325 223940 79659 70407 -39937 30260 -74352 -177179 -141799 -189311 -158587 -186288 96338
13314 96338 425246 416180 366702 247234 331209 387703 373877 213101 402488 536285 565772
13303 565772 232897 165661 155464 -13651 70280 214588 279190 132575 37975 -259534
13293 -259534 -174085 46648 108201 186600 297756 427351 440514 329354 179570 213869
13283 213869 97697 36549 281858 576944 482373 260720 220795 416232 439793 305627
13273 305627 318732 288253 216225 156908 196408 35563 6946 244775 318450 188044 118957
13262 118957 86849 157459 89608 219210 409284 412613 267295 296019 237226 24483 70306
$$ packed form
13335E08281M42973k61465n14096l90894k50163K52864K97194N4719J26092m1565
13325B23940j44281r252j10344P0197j04612j02827L5380m7512L0724k7701K82626
13314I6338L28908r066m9478j19468Q3975N6494j3826j60776J89387J33797K9487
13303E65772l32875o7236j0197j69115Q3931J44308O4602j46615r4600k97509
13293b59534Q5449K20733O1553P8399J11156J29595J3163j11160j49784L4299
13283B13869j16172o1148K45309K95086r4571k21653l9925J95437K3561j34166
13273C05627J3105l0479p2028n9317L9500j60845k8617K37829P3675j30406o9087
13262A18957l2108P0610o7851J29602J90074L329j45318K8724n8793k12743M5823
$$ plain form
13251 70306 21822 18676 -98120 202705 439577 584942 649044 513926 518358 465064 231547
13240 231547 394494 339002 87248 -45196 -120855 86028 91283 -25979 252676 403049
13230 403049 484680 523403 337831 187230 283214 378666 253369 329092 481026 260756
13220 260756 223978 275333 336973 447971 533643 436893 209727 96777 83815 6377 155237
13209 155237 282366 177125 136241 257801 469370 623968 493889 369409 496120 508010
13199 508010 222954 251380 356494 457039 541575 594989 510454 458122 551263 706661 516532
13188 516532 412155 518263 381569 245125 184287 244095 341256 431836 566176 447247
13178 447247 416117 499749 572812 482058 255901 301518 216018 239689 243232 303940 476761
$$ packed form
13251G0306m8484l146j16796L00825K36872J45365O4102j35118M432n3294k33517
13240B31547J62947n5492k51754j32444p5659K06883N255j17262K78655J50373
13230D03049Q1631L8723j85572j50601R5984R5452j25297P5723J51934k20270
13220B60756l6778N1355O1640J10998Q5672r6750k27166j12950j2962p7438J48860
13209A55237J27129j05241m0884J21560K11569J54598j30079j24480J26711J1890
13199E08010k85056K8426J05114J00545Q4536N3414q4535n2332R3141J55398j90129
13188E16532j04377J06108j36694j36444o0838N9808R7161R0580J34340j18929
13178D47247l1130Q3632P3063r0754k26157M5617q5500K3671L543O0708J72821
$$ plain form
13167 476761 390502 568900 663779 609766 459035 261914 301142 311957 256000 360479 419226
13156 419226 686346 595339 471133 362907 354926 616348 424810 475778 591150 430208
13146 430208 187999 177254 118999 15869 178390 152717 247480 241742 282010 146853 229178
13135 229178 187727 324067 378436 666834 852293 756586 460436 281949 283344 421545
13125 421545 373407 405721 394330 310350 202844 310753 371507 528465 624614 585997 475959
13114 475959 319602 302832 237425 214313 233992 236580 177775 181964 230824 75388 -2911
13103 -2911 179488 212665 248718 408848 617583 692373 638351 636685 565521 473752 509236
13092 509236 482043 341808 272143 418102 409246 515203 278917 234344 260387 351890 383062
$$ packed form
13167D76761q6259J78398R4879n4013j50731j97121L9228J0815n5957J04479N8747
13156D19226K67120r1007j24206j08226p981K61422j91538N0968J15372j60942
13146D30208k42209j0745n8255j03130J62521k5673R4763n738M0268j35157Q2325
13135B29178m1451J36340N4369K88398J85459r5707k96150j78487J395J38201
13125D21545m8138L2314j1391q3980j07506J07909O0754J56958R6149l8617j10038
13114D75959j56357j6770o5407k3112J9679K588n8805M189M8860j55436p8299
13103b911J82399L3177L6053J60130K08735P4790n4022j666p1164r1769L5484
13092E09236k7193j40235o9665J45959q856J05957k36286m4573K6043R1503L1172
$$ plain form
13081 383062 526711 669818 739987 720361 603386 617510 695204 783325 625549 378217
13071 378217 310659 366343 349697 362996 461312 600595 621531 571259 509603 491420 337805
13060 337805 323049 462262 399568 560849 656934 506166 354747 451360 544958 900102
13050 900102 907169 506043 364877 326395 223158 248222 437973 587183 517452 545914 465513
13039 465513 453795 556515 478796 498728 831836 841516 842312 815045 678573 355720 234791
13028 234791 303885 616923 825340 668543 537859 482233 665243 890436 858797 874893
13018 874893 683456 522561 749085 684688 494660 483222 573993 487469 347295 467936
13008 467936 642687 555518 264104 179851 20190 199239 375465 434262 547721 519481
$$ packed form
13081C83062J43649J43107P0169j9626j16975J4124P7694Q8121j57776k47332
13071C78217o7558N5684j6646J3299R8316J39283K0936n0272o1656j8183j53615
13060C37805j4756J39213o2694J61281R6085j50768j51419R6613R3598L55144
13050I00102P067m01126j41166l8482j03237K5064J89751J49210o9731K8462q0401
13039D65513j1718J02720p7719J9932L33108R680P96k7267j36472l22853j20929
13028B34791O9094L13038K08417j56797j30684n5626J83010K25193l1639J6096
13018H74893j91437j60895K26524o4397j90028j1438R0771q6524j40174J20641
13008D67936J74751q7169k91414q4253j59661J79049J76226N8797J13459k8240
$$ plain form
12998 519481 353503 350467 246573 297905 405656 196047 286818 540276 702886 817875
12988 817875 783853 685677 628413 754396 591964 535434 482722 550770 471284 359418 471125
12977 471125 749171 887003 881021 946297 856241 597034 546283 554640 438273 451843 613294
12966 613294 504590 493608 695646 653010 748076 795506 635572 621369 536959 676434 752921
12955 752921 660574 532018 545557 713385 707902 713599 815700 708355 636417 492152 434867
12944 434867 664384 763036 735359 856182 939025 857782 775074 658204 719753 723510 550312
12933 550312 666833 548639 636387 801443 858859 841476 814711 763847 889587 1002365
12923 1002365 1010359 997839 891953 721833 789978 729055 715975 721088 608166 538232 663897
$$ packed form
12998E19481j65978l036j03894N1332J07751k09609R0771K53458J62610J14989
12988H17875l4022r8176n7264J25983j62432n6530n2712O8048p9486j11866J11707
12977D71125K78046J37832n982O5276r0056k59207n0751Q357j16367J3570J61451
12966F13294j08704j0982K02038m2636R5066M7430j59934j4203q4410J39475P6487
12955G52921r2347j28556J3539J67828n483N697J02101j07345p1938j44265n7285
12944D34867K29517R8652k7677J20823Q2843q1243q2708j16870O1549L757j73198
12933E50312J16521j18194Q7748J65056N7416j7383k6765n0864J25740J12778
12923A002365P994j2520j05886j70120O8145o0923j3080N113j12922o9934J25665
$$ plain form
12912 663897 808313 822043 591063 556112 732537 781010 751150 774569 773697 627273 594719
12901 594719 353005 318093 264379 307131 454392 670544 846313 812693 576356 285265
12891 285265 446409 705972 687315 706720 558488 452876 380683 174408 171079 154313 182116
12880 182116 389337 630651 873236 785832 707454 796676 791283 726829 587975 570428 559964
12869 559964 690305 726800 832782 897351 987553 909880 894156 910469 772184 742872 830811
12858 830811 781040 637063 448887 359451 561122 728784 984134 978097 1133985 1241247
12848 1241247 1070858 837326 733125 837248 856547 756498 656437 635939 446708 457541
12838 457541 518459 381984 299203 361819 471674 764417 757427 603994 782490 672816
$$ packed form
12912F63897J44416J3730k30980l4951J76425M8473k9860K3419q72j46424l2554
12901E94719k41714l4912n3714M2752J47261K16152J75769l3620k36337k91091
12891B85265J61144K59563j8657J9405j48232j05612p2193k06275l329j6766K7803
12880A82116K07221K41314K42585q7404p8378Q9222n393o4454j38854j7547j0464
12869E59964J30341L6495J05982O4569R0202p7673j5724J6313j38285k9312Q7939
12858H30811m9771j43977j88176q9436K01671J67662K55350o037J55888J07262
12848A241247j70389k33532j04201J04123J9299j00049j00061k0498j89231J0833
12838D57541O0918j36475q2781O2616J09855K92743o990j53433J78496j09674
$$ plain form
12828 672816 659755 865345 1031903 924838 866265 809409 730799 504467 589967 758516
12818 758516 917488 953936 896743 741792 777191 791247 1081230 1165503 988960 815160
12808 815160 750536 855559 1045939 1013498 884159 684284 633384 659478 597686 730433
12798 730433 731984 824530 915509 971237 1064011 1214386 1136867 928905 796636 731146 867823
12787 867823 869582 900710 787388 636372 780524 831097 744336 728766 767250 814267 950556
12776 950556 1089049 1056422 947063 924221 665369 637070 782791 758099 533610 417798
12766 417798 458269 716211 776686 763034 798888 989254 1166333 1222453 1010067 777496
12756 777496 731134 800181 774264 792428 856101 640399 732129 810123 695833 520133 561936
$$ packed form
12828F72816j3061K05590J66558j07065n8573n6856p8610k26332Q5500J68549
12818G58516J58972L6448n7193j54951L5399J4056K89983Q4273j76543j73800
12808H15160o4624J05023J90380l2441j29339j99875n0900K6094o1792J32747
12798G30433J551R2546R0979N5728R2774J50375p7519k07962j32269o5490J36677
12787H67823J759L1128j13322j51016J44152N0573q6761j5570L8484M7017J36289
12776I50556J38493l2627j09359k2842k58852k8299J45721k4692k24489j15812
12766D17798M0471K57942O0475j3652L5854J90366J77079N6120k12386k32571
12756G77496m6362O9047k5917J8164O3673k15702R1730P7994j14290j75700M1803
$$ plain form
12745 561936 620406 715026 870256 767109 690704 614958 721565 817948 917969 1115187
12735 1115187 1199311 1100458 970233 985725 813861 1148149 1219446 1219974 1032163 1015439 891772
12724 891772 810622 628525 596215 602338 701172 812844 593804 684230 866871 848927 757368
12713 757368 634174 643038 665219 713755 708712 487452 684467 932823 983543 842600 800476
12702 800476 701549 733644 919225 1021599 995014 896122 824495 871344 1010519 1092897 1077379
12691 1077379 782191 598362 668480 803576 992161 1011092 976665 729548 597328 488656
12681 488656 622280 945423 1175860 1202742 1050540 964025 937501 1005849 1012848 945134 832875
12670 832875 709643 834963 1101956 1024629 1104198 1086349 1068073 1147151 946970 693871
$$ packed form
12745E61936N8470R4620J55230j03147p6405p5746J06607R6383J00021J97218
12735A115187Q4124r8853j30225J5492j71864L34288P1297N28j87811j6724j23667
12724H91772q1150j82097l2310O123R8834J11672k19040R0426J82641j7944r1559
12713G57368j23194Q864K2181M8536n043k21260J97015K48356N0720j40943m2124
12702H00476r8927L2095J85581J02374k6585r8892p1627M6849J39175Q2378j5518
12691A077379k95188j83829P0118J35096J88585J8931l4427k47117j32220j08672
12681D88656J33624L23143K30437K6882j52202q6515k6524O8348O999o7714j12259
12670H32875j23232J25320K66993p7327P9569j7849j8276P9078k00181k53099
$$ plain form
12660 693871 689719 798192 746714 778020 994994 991091 812898 931107 951949 928142 909197
12649 909197 1020475 1147333 1161051 961840 769057 893478 1077859 1063971 929367 860622
12639 860622 876114 988073 988839 963503 871036 878692 995401 907996 654861 620349 652200
12628 652200 900989 869016 897691 929983 882777 1074821 1104488 1039394 906849 750204 801016
12617 801016 892489 1044855 1111089 1163354 1231966 1163653 1261326 1184666 1000004 971382 1014769
12606 1014769 971869 899454 946545 947286 904249 869219 1117913 1021530 849886 903418 1065461
12595 1065461 1226307 1093824 1033459 964614 1109077 1253871 1184124 1271112 1276767 1279346 1422390
12584 1422390 1301297 1311210 1415410 1456411 1249631 1040288 974075 1084666 1003121 890875
$$ packed form
12660F93871m152J08473n1478L1306K16974l903j78193J18209K0842k3807j8945
12649I09197J11278J26858J3718j99211j92783J24421J84381j3888j34604o8745
12639H60622J5492J11959P66k5336r2467P656J16709q7405k53135l4512L1851
12628F52200K48789l1973K8675L2292m7206J92044K9667o5094j32545j56645N0812
12617H01016R1473J52366O6234N2265O8612o8313R7673p6660j84662k8622M3387
12606A014769m2900p2415M7091P41m3037l5030K48694r6383j71644N3532J62043
12595A065461J60846j32483o0365o8845J44463J44794o9747Q6988N655K579J43044
12584A422390j21093R913J04200M1001k06780k09343o6213J10591q1545j12246
$$ plain form
12574 890875 729672 1013114 906078 799824 816470 868450 998336 960059 890206 1011827
12564 1011827 1283378 1264366 1212030 1019431 914175 858244 792813 917203 1035916 972732
12554 972732 1101911 1000710 1084628 1163712 1201512 1132004 1282552 1302611 1114815 870535
12544 870535 819918 882499 845638 1027477 1154575 1188998 1241809 1251685 1105205 1121477 1261098
12533 1261098 1146324 1213299 1163788 1242313 1097215 915575 828470 802108 755085 785802 939813
12522 939813 1020167 1113541 1179249 1008582 828060 988600 1144382 1406421 1283952 1257413
12512 1257413 1150659 1074179 1058363 846839 566449 797122 908190 864627 785292 1142269
12502 1142269 1349959 1208157 1071178 1141614 1010978 1080770 1303181 1444709 1416970 1407861
$$ packed form
12574H90875j61203K83442j07036j06254J6646N1980J29886l8277o9853J21621
12564A011827K71551j9012n2336j92599j05256n5931o5431J24390J18713o3184
12554I72732J29179j01201Q3918P9084L7800o9508J50548K0059j87796k44280
12544H70535n0617O2581l6861J81839J27098L4423N2811R876j46480J6272J39621
12533A261098j14774O6975m9511P8525j45098j81640q7105k6362m7023L0717J54011
12522I39813Q0354R3374O5708j70667j80522J60540J55782K62039j22469k6539
12512A257413j06754p6480j5816k11524k80390K30673J11068m3563p9335L56977
12502A142269K07690j41802j36979P0436j30636O9792K22411J41528k7739r109
$$ plain form
12492 1407861 1295360 1318633 1250563 1119249 1170436 1057759 782868 530642 709147 866915
12482 866915 744684 724999 771766 935802 1135751 1457574 1478502 1329863 1262450 1321788
12472 1321788 1366360 1387188 1423487 1590406 1523102 1412217 1100810 948973 893141 882529
12462 882529 794598 852254 978796 1104129 1161060 1221889 1206273 1137297 1299251 1348529 1438251
12451 1438251 1239565 1080881 1004070 1288167 1404161 1509690 1433768 1287353 1333456 1128700
12441 1128700 1058377 1114924 1126720 837371 830655 1015343 1130913 1235531 1490205 1418729
12431 1418729 1292580 1339860 1279809 1161246 1028075 1024912 1053426 1205132 1320821 1310637
12421 1310637 1104206 1155452 979915 979018 1015261 1123917 1104571 1146506 1171466 1192044 1228663
$$ packed form
12492A407861j12501K3273o8070j31314N1187j12677k74891k52226J78505J57768
12482H66915j22231j9685M6767J64036J99949L21823K0928j48639o7413N9338
12472A321788M4572K0828L6299J66919o7304j10885l11407j51837n5832j0612
12462H82529q7931N7656J26542J25333N6931O0829j5616o8976J61954M9278Q9722
12451A438251j98686j58684p6811K84097J15994J05529p5922j46415M6103k04756
12441A128700p0323N6547J1796k89349o716J84688J15570J04618K54674p1476
12431A418729j26149M7280o0051j18563j33171l163K8514J51706J15689j0184
12421A310637k06431N1246j75537q97L6243J08656j9346M1935K4960K0578L6619
$$ plain form
12410 1228663 1245966 1162587 1175577 1244825 1166033 1240877 1405634 1613219 1564097 1541048 1865138
12399 1865138 1948185 1879198 1921003 1738660 1317729 1120840 1281516 1328120 1331787 1346729 1415278
12388 1415278 1199015 1045484 1105978 1273890 1368548 1634896 1647598 1723529 1572074 1407557
12378 1407557 1307051 1234956 1396494 1369374 1357260 1318864 1335830 1491449 1509111 1162577
12368 1162577 911434 958664 1125642 967562 1029591 1089488 1314241 1428980 1397813 1390972
12358 1390972 1437987 1357596 1291750 1442896 1415348 1267746 1251065 1222530 1071510 1032484 1313691
12347 1313691 1249597 1173519 1264491 1241118 1231390 1362599 1555821 1465772 1436494 1428806 1387101
12336 1387101 1481793 1615536 1691718 1748829 1658462 1727034 1808871 1714125 1606760 1533530 1508978
$$ packed form
12410A228663J7303q3379J2990O9248p8792P4844J64757K07585m9122k3049L24090
12399A865138Q3047o8987M1805j82343m20931j96889J60676M6604L667J4942O8549
12388A415278k16263j53531O0494J67912R4658K66348J2702P5931j51455j64517
12378A407557j00506p2095J61538k7120j2114l8396J6966J55619J7662l46534
12368A162577k51143M7230J66978j58080O2029N9897K24753J14739l1167o841
12358A390972M7015q0391o5846J51146k7548j47602j6681k8535j51020l9026K81207
12347A313691o4094p6078R0972k3373r728J31209J93222r0049k9278p688m1705
12336A387101R4692J33743P6182N7111r0367O8572Q1837r4746j07365p3230k4552
$$ plain form
12325 1508978 1520398 1308651 1007584 951720 1322909 1657171 1604258 1604013 1577226 1632515 1567310
12314 1567310 1489298 1551282 1671403 1531567 1427433 1516961 1512829 1659330 1398394 1381747
12304 1381747 1496879 1551183 1280267 1027286 1272502 1587453 1451698 1308659 1410033 1323409
12294 1323409 1374467 1538980 1423800 1308623 1251959 1297700 1183386 1028469 1048088 933104
12284 933104 1088876 1071122 1143581 1385306 1600420 1635778 1612492 1721652 1568009 1453775
12274 1453775 1327824 1408018 1427474 1561166 1508122 1248146 1158187 1258751 1207721 1282270
12264 1282270 1228897 1369885 1444289 1234132 1183612 1212427 1393195 1345592 1649146 1907240
12254 1907240 1797369 1644822 1588908 1633359 1729138 1662120 1480032 1411818 1403502 1543419 1770412
$$ packed form
12325A508978J1420k11747l01067n5864L71189L34262n2913k45k6787N5289o5205
12314A567310p8012O1984J20121j39836j04134Q9528m132J46501k60936j6647
12304A381747J15132N4304k70916k52981K45216L14951j35755j43039J01374q6624
12294A323409N1058J64513j15180j15177n6664M5741j14314j54917J9619j14984
12284I33104J55772j7754P2459K41725K15114L5358k3286J09160j53643j14234
12274A453775j25951Q0194J9456J33692n3044k59976q9959J00564n1030P4549
12264A282270n3373J40988P4404k10157n0520K8815J80768m7603L03554K58094
12254A907240j09871j52547n5914M4451R5779o7018j82088o8214q316J39917K26993
$$ plain form
12243 1770412 1705323 1414913 1447353 1300423 1296237 1301448 1374049 1429023 1621503 1477422 1203281
12232 1203281 1308609 1323816 1342800 1278392 1273047 1216595 1245309 1240238 1249438 1199030 1312873
12221 1312873 1318036 1305223 1390898 1338590 1295998 1426063 1402112 1429972 1289838 1060083 1197947
12210 1197947 1230640 1252366 1400179 1445146 1578827 1553971 1491596 1459299 1409665 1497411 1670619
12199 1670619 1646731 1510605 1497880 1206973 1146352 1228367 1263094 1452741 1729921 1902043
12189 1902043 1735307 1457727 1540028 1347432 1226583 1380767 1406209 1200561 1251391 1174540
12179 1174540 1178792 1206645 1342578 1355989 1548671 1710459 1571663 1580635 1457753 1422744 1411982
12168 1411982 1668293 1744880 1662800 1510678 1539904 1715385 1786902 1664556 1529701 1594657
$$ packed form
12243A770412o5089k90410L2440j46930m186N211P2601N4974J92480j44081k74141
12232A203281J05328J5207J8984o4408n345n6452K8714n071R200n0408J13843
12221A312873N163j2813Q5675n2308m2592J30065k3951K7860j40134k29755J37864
12210A197947L2693K1726J47813M4967J33681k4856o2375l2297m9634Q7746J73208
12199A670619k3888j36126j2725k90907o0621Q2015L4727J89647K77180J72122
12189A902043j66736k77580Q2301j92596j20849J54184K5442k05648N0830p6851
12179A174540M252K7853J35933J3411J92682J61788j38796Q972j22882l5009j0762
12168A411982K56311P6587q2080j52122K9226J75481P1517j22346j34855O4956
$$ plain form
12158 1594657 1825620 1813604 1565623 1517225 1423132 1565608 1639494 1590026 1639542 1435712
12148 1435712 1443192 1264509 1160251 1068570 1256484 1318061 1313770 1472905 1650750 1521813
12138 1521813 1356220 1303771 1432312 1322644 1482038 1450051 1370698 1361710 1351937 1105062 1142300
12127 1142300 1087696 1216640 1378365 1497025 1566783 1489042 1430103 1407533 1412021 1414116 1247158
12116 1247158 1263783 1121517 1024174 1188304 1440511 1496045 1239710 1122555 1199956 1359344
12106 1359344 1380148 1389170 1281843 1223915 1154856 1162620 1267659 1289000 1377719 1560887 1503864
12095 1503864 1607580 1696927 1640610 1462552 1456387 1436465 1449240 1455693 1449361 1564833 1534145
12084 1534145 1610995 1521217 1438845 1409944 1466981 1487756 1376253 1149065 1187093 1313982 1507555
$$ packed form
12158A594657K30963j2016k47981m8398r4093J42476P3886m9468M9516k03830
12148A435712P480j78683j04258r1681J87914O1577m291J59135J77845j28937
12138A521813j65593n2449J28541j09668J59394l1987p9353q988r773k46875L7238
12127A142300n4604J28944J61725J18660O9758p7741n8939k2570M488K095j66958
12116A247158J6625j42266r7343J64130K52207N5534k56335j17155P7401J59388
12106A359344K0804R022j07327n7928o9059P764J05039K1341Q8719J83168n7023
12095A503864J03716Q9347n6317j78058o165j9922J2775O453o332J15472l0688
12084A534145P6850q9778q2372k8901N7037K0775j11503k27188L8028J26889J93573
$$ plain form
12073 1507555 1598006 1619810 1428549 1313675 953341 1262913 1574044 1447101 1388246 1115227
12063 1115227 1098795 1102265 1188657 1428263 1567019 1697494 1608561 1505309 1469590 1360704
12053 1360704 1200062 1186802 1238815 1197210 1055539 989721 934995 1154429 1296518 1293950 1240396
12042 1240396 1328277 1307316 1372862 1390983 1542519 1803735 1800094 1572069 1571784 1570325 1262502
12031 1262502 1259509 1442971 1644264 1733723 1535192 1570088 1644117 1551961 1472960 1246673 1141903
12020 1141903 1400078 1437042 1556854 1667211 1862441 1710459 1591573 1691391 1811769 1748295
12010 1748295 1747314 1663768 1640561 1624244 1385189 1281177 1253154 1324411 1199318 1123163 1054304
11999 1054304 1167575 1111817 1043795 1360392 1426436 1390461 1373503 1353485 1412406 1757555 1785725
$$ packed form
12073A507555R0451K1804j91261j14874l60334L09572L11131j26943n8855k73019
12063A115227j6432L470Q6392K39606J38756J30475q8933j03252l5719j08886
12053A360704j60642j3260N2013m1605j41671o5818n4726K19434J42089k568n3554
12042A240396Q7881k0961O5546J8121J51536K61216l641k28025k85j459l07823
12031A262502k993J83462K01293Q9459j98531L4896P4029r2156p9001k26287j04770
12020A141903K58175L6964J19812J10357J95230j51982j18886R9818J20378o3474
12010A748295r81q3546k3207j6317k39055j04012k8023P1257j25093p6155o8859
11999A054304J13271n5758o8022L16597O6044l5975j6958k0018N8921L45149K8170
$$ plain form
11988 1785725 1706577 1651857 1638994 1622045 1547289 1343981 1441894 1545901 1546863 1322730 1336401
11977 1336401 1197995 1353111 1412735 1517786 1491375 1520145 1538193 1636449 1599175 1616974 1322820
11966 1322820 1079845 944250 866530 1034173 1224084 1191789 1246517 1224930 1274906 1562085
11956 1562085 1656845 1338056 1289684 1381700 1377181 1235468 1260948 1199360 1336164 1409054 1577387
11945 1577387 1765569 1630925 1558553 1341209 1331207 1461770 1379030 1291121 1338652 1420650
11935 1420650 1279972 1310983 1232020 1317035 1363429 1373554 1338089 1243203 1331147 1357545 1248570
11924 1248570 918034 908037 1166089 1305461 1295933 1226013 1253729 1262967 1323340 1233250 1227849
11913 1227849 1155302 1358907 1413695 1336168 1409896 1288771 1179638 1199580 1354365 1450697
$$ packed form
11988A785725p9148n4720j2863j6949p4756k03308R7913J04007R62k24133J3671
11977A336401j38406J55116N9624J05051k6411K8770J8048R8256l7274J7799k94154
11966A322820k42975j35595p7720J67643J89911l2295N4728k1587M9976K87179
11956A562085R4760l18789m8372R2016m519j41713K5480o1588J36804P2890J68333
11945A577387J88182j34644p2372k17344j0002J30563q2740q7909M7531Q1998
11935A420650j40678L1011p8963Q5015M6394J0125l5465r4886Q7944K6398j08975
11924A248570l30536r997K58052J39372r528o9920K7716R238O0373r0090n401
11913A227849p2547K03605N4788p7527P3728j21125j09133J9942J54785R6332
$$ plain form
11903 1450697 1476088 1108223 924899 999197 1005648 1036088 1130582 1113946 1099693 1226725 1195335
11892 1195335 1282495 1313475 1222985 1345169 1257582 1249345 1219229 1237236 1462883 1403230 1179477
11881 1179477 1080801 1048977 1092467 1060468 1053526 1390834 1572943 1436433 1502408 1473599 1506525
11870 1506525 1562920 1305985 1301436 1095006 917882 1170669 1231065 1272366 1335982 1335782 1347307
11859 1347307 1400958 1533932 1525939 1551362 1524719 1505227 1539540 1536099 1486192 1314052 1210205
11848 1210205 1159578 1346079 1277561 1192184 1184186 1192776 1114590 1083059 1064425 1072819 902067
11837 902067 774173 1092182 1074719 885075 791346 934238 905011 960786 1108740 1195439
11827 1195439 1254677 1190438 1238594 1182133 1138957 1112568 1039958 1120376 1370639 1303471 1203338
$$ packed form
11903A450697K5391l67865j83324P4298O451L0440R4494j6636j4253J27032l1390
11892A195335Q7160L0980r0490J22184q7587q237l0116J8007K25647n9653k23753
11881A179477r8676l1824M3490l1999o942L37308J82109j36510O5975k8809L2926
11870A506525N6395k56935m549k06430j77124K52787O0396M1301O3616k00J1525
11859A347307N3651J32974p993K5423k6643j9492L4313l441m9907j72140j03847
11848A210205n0627J86501o8518q5377p998Q590p8186l1531j8634Q394j70752
11837I02067j27894L18009j7463j89644r3729J42892k9227N5775J47954Q6699
11827A195439N9238o4239M8156n6461m3176k6389p2610Q0418K50263o7168j00133
$$ plain form
11816 1203338 1124427 1134485 1250126 1317452 1304608 1287120 1375765 1356846 1269314 1053819 875427
11805 875427 710163 865957 1015090 1155702 1352609 1472993 1593052 1484275 1328267 1320062
11795 1320062 989019 935829 874193 870296 832588 761900 734110 640883 592306 715680 879617
11784 879617 1074745 1140910 1322528 1412309 1232830 1103580 952328 1078176 1173812 1083404
11774 1083404 1092337 1065662 1110086 1115621 1068430 982009 954305 857606 989483 980935 832550
11763 832550 723636 959379 1011561 974500 901735 881261 923308 768402 814033 875228 793133
11752 793133 950507 1078934 1147967 1001909 878318 969773 1030921 914246 917146 747422
11742 747422 797583 859768 861481 957413 1171068 1195499 937716 749827 833942 984414 989518
$$ packed form
11816A203338p8911J0058J15641O7326j2844j7488Q8645j8919q7532k15495j78392
11805H75427j65264J55794J49133J40612J96907J20384J20059j08777j56008q205
11795A320062l31043n3190o1636l897l7708p0688k7790r3227m8577J23374J63937
11784H79617J95128O6165J81618Q9781j79479j29250j51252J25848R5636r0408
11774A083404Q933k6675M4424N535m7191q6421k7704r6699J31877q548j48385
11763H32550j08914K35743N2182l7061p2765k0474M2047j54906M5631O1195q2095
11752G93133J57374J28427O9033j46058j23591R1455O1148j16675K900j69724
11742G47422N0161O2185J713R5932K13655K4431k57783j87889Q4115J50472N104
$$ plain form
11731 989518 500620 409328 592831 650822 705712 775203 1075903 1282371 1039593 903204
11721 903204 902315 985271 987632 989349 1176445 1149293 820724 585811 632378 776402 632096
11710 632096 676587 646760 774419 794994 813726 930634 784414 823507 754860 743865 800611
11699 800611 815327 608617 688411 648892 527187 520192 594804 535533 456316 353633 523890
11688 523890 899172 1021352 1053242 899858 624308 625628 942824 762968 763629 804517 946600
11677 946600 1136278 1104790 910434 968411 1028355 946710 1073755 905471 787827 583062
11667 583062 540560 584828 789137 982587 762536 586887 765917 852530 650363 500926
11657 500926 671415 677540 562414 835187 894553 673111 590630 398631 304060 285222 352137
$$ packed form
11731I89518m88898r1292J83503N7991N4890O9491L00700K06468k42778j36389
11721I03204q89Q2956K361J717J87096k7152l28569k34913M6567J44024j44306
11710F32096M4491k9827J27659K0575J8732J16908j46220L9093o8647j0995N6746
11699H00611J4716k06710P9794l9519j21705o995P4612n9271p9217j02683J70257
11688E23890L75282J22180L1890j53384k75550J320L17196j79856O61M0888J42083
11677I46600J89678l1488j94356N7977N9944q1645J27045j68284j17644k04765
11667E83062m2502M4268K04309J93450k20051j75649J79030Q6613k02167j49437
11657E00926J70489O125j15126K72773N9366k21442q2481j91999r4571j8838O6915
$$ plain form
11646 352137 566039 692719 958866 963573 979183 887790 751232 859607 895690 863370 819568
11635 819568 538366 470787 516108 528291 634265 610196 524458 635863 694005 866810 1035171
11624 1035171 1029624 978080 635814 592782 591401 610641 721674 804194 990709 889106 552003
11613 552003 567101 666585 712425 759765 645915 592900 652113 719672 765917 777724 992860
11602 992860 1000593 789575 568994 525495 589689 619800 481307 330240 400523 416897 495855
11591 495855 433079 536023 890470 1098961 1032382 944254 777089 850260 915399 1001787 1004115
11580 1004115 787173 718790 825994 880886 853344 761938 659894 651119 403216 282152
11570 282152 395015 356180 498716 475835 430701 575995 526263 643329 822330 887166
$$ packed form
11646C52137K13902J26680K66147M707J5610r1393j36558J08375L6083l2320m3802
11635H19568k81202o7579M5321J2183J05974k4069q5738J11405N8142J72805J68361
11624A035171n547n1544l42266m3032j381J9240J11033Q2520J86515j01603l37103
11613E52003J5098R9484M5840M7340j13850n3015N9213O7559M6245J1807K15136
11602I92860P733k11018k20581m3499O4194L0111j38493j51067P0283J6374P8958
11591D95855o2776J02944L54447K08491o6579q8128j67165P3171O5139Q6388K328
11580A004115k16942o8383J07204N4892k7542r1406j02044q775k47903j21064
11570B82152J12863l8835J42536k2881m5134J45294m9732J17066J79001O4836
$$ plain form
11560 887166 814788 846480 791696 712040 507515 611188 616312 644793 674787 577602 581110
11549 581110 597524 477678 289598 327708 583437 682913 386701 258475 188228 234767
11539 234767 205101 390059 404015 354365 574003 773039 720041 445109 237385 146410
11529 146410 122459 118093 208227 215076 315678 237286 310676 293001 339033 242762 194816 122737
11517 122737 268369 381068 421473 469748 501458 578024 462895 473358 579690 512934 461899
11506 461899 425395 444698 433748 382029 209657 366932 332497 347845 294113 422950 524812
11495 524812 592896 425233 705270 791491 544020 328599 392658 341569 263840 303432 315072
11484 315072 234591 414417 463614 391703 311273 183089 245525 481333 653270 585118 357380
$$ packed form
11560H87166p2378L1692n4784p9656k04525J03673N124K8481K9994r7185L508
11549E81110J6414j19846j88080L8110K55729R9476k96212j28226p0247M6539
11539B34767k9666J84958J3956m9650K19638J99036n2998k74932k07724r0975
11529A46410k3951m366R0134O849J00602p8392P3390j7675M6032r6271m7946p2079
11517A22737J45632J12699M0405M8275L1710P6566j15129J0463J06332o6756n1035
11506D61899l6504J9303j0950n1719j72372J57275l4435J5348n3732J28837J01862
11495E24812O8084j67663K80037Q6221k47471k15421O4059n1089p7729L9592J1640
11484C15072q0481J79826M9197p1911q0430j28184O2436K35808J71937o8152k27738
$$ plain form
11473 357380 305072 378512 366371 308941 371660 403350 248378 146660 242867 192150 157310
11462 157310 254213 171195 169134 84684 25626 60800 76137 27789 65492 241229 255381
11451 255381 119090 291883 310716 307682 389114 510897 640266 418744 292586 302159 384243
11440 384243 403795 432448 393421 165113 80739 203335 130559 107568 203241 176801 282808
11429 282808 392769 477667 386991 275809 302276 181350 169517 111501 -34042 -81702 -107146
11418 -107146 -42437 -206411 -153600 48565 102550 -19035 -185512 -85870 -35149 -8325 -49249
11407 -49249 -150076 -361645 -335928 -382819 -247217 -40618 -156925 -240835 -376715 -222950
11397 -222950 -351448 -396646 -466152 -215020 -197911 -220570 -23617 149123 300320 241269
$$ packed form
11473C57380n2308P3440j2141n7430O2719L1690j54972j01718R6207n0717l4840
11462A57310R6903q3018k061q4450n9058L5174J5337m8348L7703J75737J4152
11451B55381j36291J72793J8833l034Q1432J21783J29369k21522j26158R573Q2084
11440C84243J9552K8653l9027k28308q4374J22596p2776k2991R5673k6440J06007
11429B82808J09961Q4898r0676j11182K6467j20926j1833n8016j45543m7660k5444
11418a07146O4709j63974N2811K02165N3985j21585j66477R9642N0721K6824m0924
11407d9249j00827k11569K5717m6891J35602K06599j16307q3910j35880J53765
11397b22950j28498m5198o9506K51132J7109k2659J96953J72740J51197n9051
$$ plain form
11387 241269 232453 164649 114174 34696 -6672 1419 -212310 -121102 104812 324174 99252
11376 99252 64340 -55970 -107169 -164001 -49570 -85445 -251526 -189816 133645 15791 -183005
11365 -183005 -126420 -127075 -183717 -205088 -330803 -492819 -825764 -505878 -145235 -336765 -447896
11354 -447896 -550694 -555763 -414611 -496359 -481672 -281252 -184371 -158690 -261844 -380661 -288072
11343 -288072 -121775 -43701 -26831 -126148 -320739 -508054 -480108 -325912 -237847 -309798 -394619
11332 -394619 -493799 -538520 -510340 -321367 -245748 -350434 -417936 -406638 -540283 -472674 -329828
11321 -329828 -514089 -416219 -440337 -407376 -205344 -70503 -279000 -332837 -485820 -484646 -280421
11310 -280421 -251695 -171076 1755 164124 -82945 -367787 -449938 -319224 -365488 -555746
$$ packed form
11387B41269q816o7804n0475p9478m1368Q091k13729R1208K25914K19362k24922
11376I9252l4912j20310n1199n6832J14431l5875j66081O1710L23461j17854j98796
11365a83005N6585o55n6642k1371j25715j62016l32945L19886L60643j91530j11131
11354d47896j02798n069J41152q1748J4687K00420R6881K5681j03154j18817R2589
11343b88072J66297P8074J6870r9317j94591j87315K7946J54196Q8065p1951q4821
11332c94619r9180m4721K8180J88973P5619j04686o7502J1298j33645O7609J42846
11321c29828j84261R7870k4118L2961K02032J34841k08497n3837j52983J174K04225
11310b80421K8726Q0619J72831J62369k47069k84842q2151J30714m6264j90258
$$ plain form
11300 -555746 -636805 -767121 -677206 -598678 -521495 -630314 -496286 -79628 -11734 -264506
11290 -264506 -532932 -542120 -731826 -747005 -638247 -592108 -636870 -808160 -638861 -529773
11280 -529773 -456256 -332661 -478018 -710029 -772245 -756465 -701628 -568310 -360425 -234998
11270 -234998 -286829 -416137 -601797 -700384 -727029 -785224 -787663 -588192 -476323 -536156 -370422
11259 -370422 -441251 -490939 -604458 -679198 -485226 -451512 -340956 -239004 -242806 -314548 -297828
11248 -297828 -402296 -524021 -661516 -729464 -650448 -499917 -533191 -507327 -525754 -790501
11238 -790501 -824315 -579144 -636629 -672274 -630415 -641550 -759107 -717974 -826027 -771680 -970806
11227 -970806 -1234618 -1354354 -1088608 -921908 -1057100 -1169857 -1134988 -1051669 -851050 -769453
$$ packed form
11300e55746q1059j30316Q9915P8528P7183j08819J34028M16658O7894k52772
11290b64506k68426r188j89706j5179J08758M6139m4762j71290J69299J09088
11280e29773P3517J23595j45357k32011o2216J5780N4837J33318K07885J25427
11270b34998n1831j29308j85660r8587k6645n8195k439J99471J11869n9833J65734
11259c70422p0829m9688j13519p4740J93972L3714J10556J01952l802p1742J6720
11248b97828j04468j21725j37495o7948P9016J50531l3274K5864j8427k64747
11238g90501l3814K45171n7485l5645M1859j1135j17557M1133j08053N4347j99126
11227i70806k63812j19736K65746J66700j35192j12757L4869Q3319K00619Q1597
$$ plain form
11217 -769453 -858452 -852092 -956228 -1159933 -1050347 -912551 -747404 -763078 -992028 -1021848
11207 -1021848 -1001083 -902384 -1032937 -1189269 -1081855 -880879 -725762 -759914 -843616 -817919
11197 -817919 -863943 -974399 -660329 -580682 -709510 -845054 -849356 -1015923 -1124219 -1073010
11187 -1073010 -1149703 -1067135 -1192899 -1355730 -1249356 -1195567 -1234722 -1350180 -1402230 -1345391
11177 -1345391 -1259724 -1163859 -1252676 -1172959 -1307634 -1227552 -1341578 -1448960 -1485679 -1424966 -1167540
11166 -1167540 -1107537 -1013559 -872683 -873822 -776547 -877244 -904070 -690708 -542978 -553647 -767842
11155 -767842 -884800 -969526 -1009717 -1088032 -1258721 -1380496 -1287412 -1380816 -1564248 -1336788
11145 -1336788 -1169235 -1273726 -1238668 -1416161 -1619471 -1558993 -1497333 -1382129 -1396788 -1404008
$$ packed form
11217g69453q8999O360j04136k03705J09586J37796J65147j5674k28950k9820
11207a021848K0765R8699j30553j56332J07414K00976J55117l4152q3702K5697
11197h17919m6024j10456L14070P9647j28828j35544m302j66567j08296N1209
11187a073010p6693Q2568j25764j62831J06374N3789l9155j15458n2050N6839
11177a345391Q5667R5865q8817P9717j34675Q0082j14026j07382l6719O0713K57426
11166a167540O0003R3978J40876j139R7275j00697k6826K13362J47730j0669k14195
11155g67842j16958q4726m0191p8315j70689j21775R3084r3404j83432K27460
11145a336788J67553j04491L5058j77493k03310O0478O1660J15204j4659p220
$$ plain form
11135 -1404008 -1477600 -1427040 -1428630 -1409996 -1229914 -1112353 -972867 -1059004 -1370468 -1483231
11125 -1483231 -1455289 -1534343 -1537851 -1367176 -1203924 -1296678 -1463912 -1568352 -1458506 -1398693
11115 -1398693 -1395048 -1277015 -1111001 -1053934 -1269025 -1428663 -1398113 -1492097 -1761056 -1799620
11105 -1799620 -1589473 -1532813 -1610307 -1441768 -1507548 -1632819 -1770648 -1777188 -1890344 -1815671
11095 -1815671 -1630592 -1685859 -1743899 -1714330 -1797880 -1821791 -1745634 -1662498 -1610350 -1705091 -2037844
11084 -2037844 -2021097 -1854377 -1801084 -1781339 -1673904 -1642363 -1719512 -1553257 -1483575 -1494582 -1646977
11073 -1646977 -1895609 -2060109 -2229637 -2089602 -1951603 -1999682 -2093125 -2195683 -2042842 -1886667
11063 -1886667 -1899206 -1957196 -1950093 -2168509 -2189374 -2123600 -2035737 -1948814 -2004544 -2021323 -2181288
$$ packed form
11135a404008p3592N0560j590J8634J80082J17561J39486q6137l11464j12763
11125a483231K7942p9054l508J70675J63252r2754j67234j04440J09846N9813
11115a398693L645J18033J66014N7067k15091j59638L0550r3984k68959l8564
11105a799620K10147N6660p7494J68539o5780j25271j37829o540j13156P4673
11095a815671J85079n5267n8040K9569q3550k3911P6157Q3136N2148r4741l32753
11084b037844J6747J66720N3293J9745J07435L1541p7149J66255O9682j1007j52395
11073a646977k48632j64500j69528J40035J37999m8079r3443j02558J52841J56175
11063a886667j2539n7990P103k18416k0865O5774Q7863Q6923n5730j6779j59965
$$ plain form
11052 -2181288 -2193263 -1876947 -1875460 -1881192 -1826113 -1748519 -1681101 -1483980 -1287906 -1212200 -1108983
11041 -1108983 -1216254 -1246056 -1388989 -1578133 -1466747 -1466089 -1265698 -728252 -307544 -41552
11031 -41552 -186443 -547401 -582976 -491551 -384172 -96188 43423 9142 272496 600867
11021 600867 958371 1397011 1259521 844701 458409 -154288 -351813 -195783 -196547 -365885
11011 -365885 -167294 -6777 249229 481116 98788 -141629 -215480 -470603 -769424 -1156983
11001 -1156983 -1186542 -1010450 -1097676 -1250121 -1272092 -1262032 -1326081 -1517635 -1749102 -1879266
10991 -1879266 -1914166 -1968816 -1965322 -1829490 -1714664 -1837537 -2073005 -2152019 -2069605 -2336909
10981 -2336909 -2550899 -2559110 -2532473 -2488265 -2188659 -2217249 -2287847 -2296366 -2162296 -2163610 -2189043
$$ packed form
11052b181288j1975L16316J487n732N5079P7594O7418J97121J96074P5706J03217
11041a108983j07271k9802j42933j89144J11386O58K00391N37446M20708K65992
11031d1552j44891l60958l5575R1425J07379K87984J39611l4281K63354L28371
11021F00867L57504M38640j37490m14820l86292o12697j97525J56030p64j69338
11011c65885J98591J60517K56006K31887l82328k40417p3851k55123k98821l87559
11001a156983k9559J76092q7226j52445k1971J0060o4049j91554k31467j30164
10991a879266l4900n4650L494J35832J14826j22873k35468p9014Q2414k67304
10981b336909k13990q211K6637M4208K99606k8590p0598q519J34070j314k5433
$$ plain form
10970 -2189043 -2471995 -2639359 -2775930 -2692055 -2485922 -2405155 -2562701 -2766539 -2863381 -2702022
10960 -2702022 -2480545 -2585651 -2565101 -2343996 -2373753 -2741172 -2911734 -2951707 -2996566 -2807459
10950 -2807459 -2779676 -2825865 -3023684 -3324279 -3387052 -3449087 -3388046 -2973172 -2596285 -2566866
10940 -2566866 -2594678 -2523106 -2712973 -2906877 -2893585 -2797452 -2874359 -3026467 -2975809 -2901222 -3116296
10929 -3116296 -3335559 -3111832 -2972386 -3012287 -3014934 -2993584 -3042680 -3093270 -3169028 -3217009 -3401725
10918 -3401725 -3201224 -3244097 -3199938 -3041644 -2884044 -2753123 -2930301 -3188645 -3282404 -3427234
10908 -3427234 -3546451 -3607745 -3436075 -3455868 -3602123 -3553039 -3432078 -3358262 -3507411 -3672830
10898 -3672830 -3530097 -3384926 -3585631 -3613314 -3468128 -3461836 -3421666 -3542344 -3666403 -3514528
$$ packed form
10970b189043k82952j67364j36571Q3875K06133Q0767j57546k03838r6842J61359
10960b702022K21477j05106K0550K21105k9757l67419j70562l9973m4859J89107
10950b807459K7783m6189j97819l00595o2773o2035O1041M14874L76887K9419
10940b566866k7812P1572j89867j93904J3292R6133p6907j52108N0658P4587k15074
10929c116296k19263K23727J39446l9901k647K1350m9096n0590p5758m7981j84716
10918c401725K00501m2873M4159J58294J57600J30921j77178k58344r3759j44830
10908c427234j19217o1294J71670j9793j46255M9084J20961P3816j49149j65419
10898c672830J42733J45171k00705k7683J45186O292M0170j20678j24059J51875
$$ plain form
10888 -3514528 -3464790 -3546226 -3552874 -3630874 -3581464 -3572051 -3435827 -3437015 -3679615 -3720195 -3677310
10877 -3677310 -3628005 -3684941 -4104577 -4211417 -4201347 -4040626 -3863323 -3689553 -3749741 -3865817
10867 -3865817 -3897418 -4013154 -4094857 -4022186 -3862718 -3678378 -3855304 -3923251 -3907361 -3789501
10857 -3789501 -3763239 -3827026 -4035562 -4011691 -3826969 -4015927 -3982224 -3892026 -3866439 -4051079
10847 -4051079 -4198186 -4171613 -4235544 -4355872 -4502761 -4442830 -4344478 -4381311 -4417284 -4400259 -4268524
10836 -4268524 -4163399 -4377305 -4538584 -4649725 -4673504 -4602054 -4454886 -4581852 -4592534 -4597884
10826 -4597884 -4592051 -4691380 -4815749 -4948144 -4990198 -5084208 -4996973 -4749370 -4736108 -4915402 -4921502
10815 -4921502 -4956600 -4995639 -5191161 -5164982 -5103246 -5059315 -5134552 -5270962 -5229687 -5143265 -5347020
$$ packed form
10888c514528M9738q1436o648p8000M9410R413J36224j188k42600m0580M2885
10877c677310M9305n6936m19636j06840J0070J60721J77303J73770o0188j16076
10867c865817l1601j15736q1703P2671J59468J84340j76926o7947J5890J17860
10857c789501K6262o3787k08536K3871J84722j88958L3703R0198K5587j84640
10847d051079j47107K6573o3931j20328j46889N9931R8352l6833l5973J7025J31735
10836d268524J05125k13906j61279j11141k3779P1450J47168j26966j0682n350
10826d597884N833r9329j24369j32395m2054r4010Q7235K47603J3262j79294o100
10815d921502l5098l9039j95522K6179O1736M3931p5237j36410M1275Q6422k03755
$$ plain form
10804 -5347020 -5534020 -5680810 -5894217 -5944903 -5875845 -5762069 -5730259 -5515454 -5393698 -5427626
10794 -5427626 -5610262 -5659434 -5547757 -5372736 -5427634 -5483733 -5575326 -5689154 -5848569 -5719606
10784 -5719606 -5714794 -5588075 -5573127 -5602336 -5404255 -5346854 -5395481 -5409615 -5029530 -4744400 -4477598
10773 -4477598 -4432543 -4202494 -3701730 -3536962 -3394796 -2924148 -2350891 -1680430 -713342 361253
10763 361253 1489846 2750268 4174545 5615397 7034103 8348915 9511560 10144891
10755 10144891 10540893 10203580 9558962 8567897 7402935 6330834 5298799 4372878 3613492
10746 3613492 3102719 2826818 3037063 3109794 3240822 2980662 2022333 527343 -658679
10737 -658679 -1640964 -2349804 -2899515 -3314937 -3648261 -3857816 -4209452 -4376877 -4591770 -5098515
$$ packed form
10804e347020j87000j46790k13407n0686O9058J13776L1810K14805J21756l3928
10794e427626j82636m9172J11677J75021n4898n6099r1593j13828j59415J28963
10784e719606M812J26719J4948k9209J98081N7401m8627j4134L80085K85130K66802
10773d477598M5055K30049N00764J64768J42166M70648N73257O70461R67088J074595
10763C61253J128593J260422J424277J440852J418706J314812J162645O33331
10755A0144891L96002l37313o44618r91065j164962j072101j032035r25921p59386
10746C613492n10773k75901K10245P2731J31028k60160r58329j494990j186022
10737f58679r82285p08840n49711m15422l33324k09555l51636j67425k14893n06745
$$ plain form
10727 -5098515 -5584127 -5889428 -5993770 -6138572 -6308231 -6405806 -6458238 -6469774 -6476500 -6689291
10717 -6689291 -7002810 -7019590 -7090828 -7283977 -7742148 -8014654 -8111094 -8242519 -8220331 -8362345
10707 -8362345 -8570995 -8843282 -9018261 -9303274 -9543936 -9572116 -9796642 -9761839 -9916316 -10113125
10697 -10113125 -9986781 -9861833 -10114098 -10298067 -10607479 -10680022 -10852235 -11174153 -11375058
10688 -11375058 -11517823 -11463566 -11669218 -11485643 -11538028 -11631041 -11762907 -11891280 -11918399 -12031395
10678 -12031395 -11926296 -11664861 -11715005 -11461280 -11075299 -10887320 -10691080 -10467575 -9749565
10669 -9749565 -9000809 -8417240 -7789086 -7275186 -7185457 -7176494 -7566852 -8176029 -8803467 -9658297
10659 -9658297 -10266045 -11025826 -11630508 -12180061 -12536458 -12448004 -12259665 -11463341 -10270693
$$ packed form
10727e098515m85612l05301j04342j44802j69659r7575n2432j1536o726k12791
10717f689291l13519j6780p1238j93149m58171k72506r6440j31425K2188j42014
10707h362345k08650k72287j74979k85013k40662k8180k24526L4803j54477j96809
10697a0113125J26344J24948k52265j83969l09412p2543j72213l21918k00905
10688a1375058j42765N4257k05652J83575n2385r3013j31866j28373k7119j12996
10678a2031395J05099K61435n0144K53725L85981J87979J96240K23505P18010
10669i749565P48756N83569O28154N13900Q9729Q963l90358o09177o27438q54830
10659i658297o07748p59781o04682n49553l56397Q8454J88339P96324J192648
$$ plain form
10650 -10270693 -8430191 -5779638 -2529889 678932 2692435 2154674 -526943 -3904249
10642 -3904249 -6894604 -9402897 -11315598 -12409778 -13384993 -14176246 -14337403 -14070094 -13769562
10633 -13769562 -13400447 -13033139 -12784830 -12973275 -13823190 -14989760 -16179164 -16919622 -17305205
10624 -17305205 -17451722 -16629135 -14640350 -10733131 -4476072 5503256 20333506 40754526
10616 40754526 66346065 94253578 117915453 130057574 128865541 120052978 110479955
10609 110479955 105614121 108976030 123393232 152019612 196799031 255923764 319327241
10602 319327241 367802866 381904526 360271141 321887104 286268395 263132053 256246845
10595 256246845 268214442 301472805 356917968 430205093 505508717 556159706 557618961
$$ packed form
10650a0270693J840502K650553L249749L208821K013503n37761k681617l377306
10642c904249k990355k508293j912701j094180r75215p91253j61157K67309L00532
10633a3769562L69115L67308K48309j88445q49915j166570j189404p40458l85583
10624a7305205j46517Q22587J988785L907219O257059R979328J4830250K0421020
10616D0754526K5591539K7907513K3661875J2142121j192033q812563r573023
10609A10479955m865834L361909J4417202K8626380M4779419N9124733O3403477
10602C19327241M8475625J4101660k1633385l8384037l5618709k3136342o885208
10595B56246845J1967597L3258363N5445163P3287125P5303624N0650989J459255
$$ plain form
10588 557618961 511147546 445047574 384984889 341124157 315931990 308990040 320420528
10581 320420528 348631048 388262290 427083641 445954308 430707377 386000821 331763905
10574 331763905 284423093 249380032 226699886 215351000 213672295 219760019 229911682
10567 229911682 237730551 236706928 222430313 197727540 170023227 144881530 124633947
10560 124633947 108625381 96023803 86271784 78453403 72031975 66708211 62470681 58748472
10552 58748472 55450438 52762560 50297948 47801273 45632924 43797337 42282399 40790635
10544 40790635 39476135 38491167 37806170 37063234 36280765 35251899 34116371 32964969 31805216
10535 31805216 30677207 29778790 28833036 28015927 27226970 26522488 26187215 25923705 25559212
$$ packed form
10588E57618961m6471415o6099972o0062685m3860732k5192167o941950J1430488
10581C20420528K8210520L9631242L8821351J8870667j5246931m4706556n4236916
10574C31763905m7340812l5043061k2680146j1348886j678705O087724J0151663
10567B29911682P818869j023623j4276615k4702773k7704313k5141697k0247583
10560A24633947j6008566j2601578r752019p818381o421428n323764m237530l722209
10552E8748472l298034k687878k464612k496675k168349j835587j514938j491764
10544D0790635j314500r84968o84997p42936p82469j028866j135528j151402j159753
10535C1805216j128009q98417r45754q17109p88957p04482l35273k63510l64493
$$ plain form
10526 25559212 24959900 24353818 23872107 23491024 23220026 22937223 22733837 22275056 21717679
10517 21717679 21297933 20915536 20606431 20566837 20249343 20049083 20301422 20686679 21517561
10508 21517561 22453245 22972607 22805916 22069993 21149317 20162712 19474260 18839605 18296487
10499 18296487 17999854 17483337 17029925 16909625 16652389 16227921 15929952 15715734 15477533
10490 15477533 15358885 14965828 14935915 14890199 14841960 14454490 14317072 14386282 14316557 13816708
10480 13816708 13482977 13363776 13184739 13080924 13001122 13089682 13022609 12708475 12676429 12364472
10470 12364472 12018134 12045429 12153171 12235552 12115280 11895896 11716518 11620094 11592379 11557741
10460 11557741 11682045 11643164 11568707 11452809 11180601 11081541 11199266 11078852 10837082 10722735
$$ packed form
10526B5559212n99312o06082m81711l81083k70998k82803k03386m58781n57377
10517B1717679m19746l82397l09105l9594l17494k00260K52339L85257Q30882
10508B1517561R35684N19362j66691p35923r20676r86605o88452o34655n43118
10499A8296487k96633n16517m53412j20300k57236m24468k97969k14218k38201
10490A5477533j18648l93057k9913m5716m8239l87470j37418O9210o9725m99849
10480A3816708l33731j19201j79037j03815p9802Q8560o7073l14134l2046l11957
10470A2364472l46338K7295J07742Q2381j20272k19384j79378r6424k7715l4638
10460A1557741J24304l8881p4457j15898k72208r9060J17725j20414k41770j14347
$$ plain form
10450 10722735 10705848 10486090 10425171 10262426 10233616 10081278 10055089 10071416 10095794 10140409
10440 10140409 9950997 9713795 9599024 9591032 9651875 9693810 9683102 9754728 9755272 9632484 9737065
10429 9737065 9746080 9471539 9236372 9027232 9036896 9007009 8870102 8956272 9006051 8858553 8766208
10418 8766208 8962893 8842582 8656729 8720489 8806709 8791245 8510942 8635442 8622357 8463615
10408 8463615 8671854 8671583 8369537 8155638 8204086 8287023 8212422 8094741 7854121 7853312 7826903
10397 7826903 7647357 7636054 7640085 7567432 7438048 7409285 7418461 7514191 7427558 7256169 7172515
10386 7172515 7253438 7440252 7322570 7169636 7220584 7203762 7114515 6951492 6810155 6686813
10376 6686813 6674134 6712631 6650375 6503524 6451553 6473969 6620638 6770343 6535012 6187272
$$ packed form
10450A0722735j6887k19758o0919j62745k8810j52338k6189J6327K4378M4615
10440A0140409j89412k37202j14771p992O0843M1935j0708P1626N44j22788J04581
10429I737065R015k74541k35167k09140R664k9887j36907Q6170M9779j47498r2345
10418H766208J96685j20311j85853O3760Q6220j5464k80303J24500j3085j58742
10408H463615K08239k71l02046k13899M8448Q2937p4601j17681k40620q09k6409
10397G826903j79546j1303M031p2653j29384k8763R176R5730q6633j71389q3654
10386G172515Q0923J86814j17682j52934N0948j6822q9247j63023j41337j23342
10376F686813j2679L8497o2256j46851n1971K2416J46669J49705k35331l47740
$$ plain form
10366 6187272 6166296 6166277 6049984 6098146 6281653 6310479 6259523 6040208 6001420 6138529 6296907
10355 6296907 6227170 6233254 6197323 6032605 6021318 5996824 5972359 6105970 6090393 6007093 5922563
10344 5922563 5799298 5839261 5849635 5852077 5783891 5694634 5659682 5630274 5629759 5686585 5759271 5702032
10332 5702032 5695686 5832764 6011537 5934099 5719853 5606812 5570882 5505538 5464717 5481952 5508229
10321 5508229 5637599 5646316 5539888 5483801 5263063 5063096 4987766 5112161 5311759 5161282
10311 5161282 5119260 5037156 5060722 5058823 5049399 4995454 5079538 5256975 5226127 5082199 5038815
10300 5038815 4997087 5053013 5092001 5128014 5050078 4925230 5086350 5169708 5064824 5112743 5088535
10289 5088535 4793674 4498799 4297543 4564231 4849786 4714128 4691252 4618662 4396335 4535862
$$ packed form
10366F187272k0976j9j16293M8162J83507K8826n0956k19315l8788J37109J58378
10355F296907o9737O084l5931j64718j1287k4494k4465J33611j5577q3300q4530
10344E922563j23265L9963J0374K442o8186q9257l4952k9408n15N6826P2686n7239
10332E702032o346J37078J78773p7438k14246j13041l5930o5344m0821J7235K6277
10321E508229J29370Q717j06428n6087k20738j99967p5330J24395J99598j50477
10311E161282m2022q2104K3566j899r424n3945Q4084J77437l0848j43928m3384
10300E038815m1728N5926L8988L6013p7936j24848J61120Q3358j04884M7919k4208
10289E088535k94861k94875k01256K66688K85555j35658k2876p2590k22327J39527
$$ plain form
10279 4535862 4761836 4766374 4718197 4463901 4429406 4334235 4259311 4278695 4362462 4308005 4486963
10268 4486963 4417290 4280668 4060517 4079565 4116144 4349349 4484824 4401852 4282943 4202007
10258 4202007 4112850 4237731 4380485 4308644 4339393 4307235 4279792 4203055 4109277 4135311 4231014
10247 4231014 4204265 4334603 4346753 4260826 4034745 3837450 3697399 3790749 3915967 3821406
10237 3821406 3886147 3942566 3917559 3971749 3949405 3883304 3751308 3639524 3639086 3509556 3527391
10226 3527391 3509538 3598596 3595444 3562611 3707171 3668410 3582800 3730066 3922451 4017838 4013010
10215 4013010 3876755 4047700 4009199 3920130 3814276 3887948 3769854 3603779 3486560 3631328
10205 3631328 3727434 3823281 3873887 3876284 3962527 4049160 3967238 3965136 3944980 3697889 3538701
$$ packed form
10279D535862K25974M538m8177k54296l4495r5171p4924J9384Q3767n4457J78958
10268D486963o9673j36622k20151J9048L6579K33205J35475q2972j18909q0936
10258D202007q9157J24881J42754p1841L0749l2158k7443p6737r3778K6034R5703
10247D231014k6749J30338J2150q5927k26081j97295j40051R3350J25218r4561
10237C821406O4741N6419k5007N4190k2344o6101j31996j11784m38j29530J7835
10226C527391j7853Q9058l152l2833J44560l8761q5610J47266J92385R5387m828
10215D013010j36255J70945l8501q9069j05854P3672j18094j66075j17219J44768
10205C631328R6106R5847N0606K397Q6243Q6633q1922k102k0156k47091j59188
$$ plain form
10194 3538701 3597792 3647345 3595950 3336594 3393703 3473344 3405559 3447197 3328576 3206253 3110006
10183 3110006 3166568 3267469 3549192 3612308 3752309 3774870 3724853 3659270 3671716 3911339
10173 3911339 4011037 3961637 3938571 3966307 4155934 4369942 4570432 4938209 5152672 5194696
10163 5194696 4990407 4907097 4852713 4645642 4482008 4401435 4808095 5464879 5881167 6303667
10153 6303667 6486869 6302463 5720397 5161055 4834248 4723639 4482882 4469501 4697226 4856775
10143 4856775 5389899 5862215 5949247 5578509 5168277 4857100 4487905 4320609 4236442 4188997
10133 4188997 4334113 4590804 4844179 4799880 4467674 4167147 3964637 3882714 3546351 3326817
10123 3326817 3512862 3585601 3551764 3622355 3622429 3324606 3470438 3434664 3331251 3328660 3561817
$$ packed form
10194C538701N9091M9553n1395k59356N7109P9641o7785M1638j18621j22323r6247
10183C110006N6562J00901K81723O3116J40001K2561n0017o5583J2446K39623
10173C911339R9698m9400k3066K7736J89627K14008K00490L67777K14463M2024
10163E194696k04289q3310n4384k07071j63634q0573M06660O56784M16288M22500
10153F303667J83202j84406n82066n59342l26807j10609k40757j3381K27725J59549
10143D856775N33124M72316Q7032l70738m10232l11177l69195j67296q4167m7445
10133D188997J45116K56691K53375m4299l32206l00527k02510q1923l36363k19534
10123C326817J86045P2739l3837P0591P4k97823J45832l5774j03413k591K33157
$$ plain form
10112 3561817 3695258 3695620 3585207 3580423 3535809 3324631 2967080 2923093 2770371 2803426 3178342
10101 3178342 3237391 3040094 3186074 3164002 3088079 3133103 3032590 3118739 3116815 3122061 2982002
10090 2982002 2971243 3025151 2998669 2894986 2738768 2768452 2798437 2666910 2532331 2288732
10080 2288732 2394327 2570596 2806489 2723114 2858351 3127050 3267550 3444252 3283497 2969241
10070 2969241 2842407 2931887 3055733 2838701 2857227 2830558 2828361 2822073 2975860 2963504 2856308
10059 2856308 2828949 2779836 2806089 2898933 2917157 2914062 3031115 2879894 2678351 2524955 2600203
10048 2600203 2651293 2668755 2571632 2377681 2380225 2325885 2407684 2610443 2705191 2571760 2662836
10037 2662836 2747167 2644733 2793036 2899248 2915539 2789331 2691980 2587348 2595709 2675235
$$ packed form
10112C561817J33441L62j10413m784m4614k11178l57551m3987j52722L3055L74916
10101C178342N9049j97297J45980k2072p5923M5024j00513Q6149j924N246j40059
10090B982002j0759N3908k6482j03683j56218K9684K9985j31527j34579k43599
10080B288732J05595J76269K35893q3375J35237K68699J40500J76702j60755l14256
10070B969241j26834Q9480J23846k17032J8526k6669k197o288J53787j2356j07196
10059B856308k7359m9113K6253R2844J8224l095J17053j51221k01543j53396P5248
10048B600203N1090J7462r7123j93951K544n4340Q1799K02759R4748j33431R1076
10037B662836Q4331j02434J48303J06212J6291j26208r7351j04632Q361P9526
$$ plain form
10027 2675235 2582720 2445100 2321590 2315573 2495554 2591200 2602375 2427042 2338594 2524029
10017 2524029 2578035 2436893 2643675 2771403 2844807 2858908 2790773 2763283 2377905 2342559
10007 2342559 2490339 2419999 2552967 2586311 2431223 2385887 2293128 2387949 2729629 2920988
9997 2920988 2615430 2212790 2085382 2155602 2159070 2254021 2384541 2129212 2199739 2461502
9987 2461502 2232086 2066055 1953135 1831926 1994404 2182943 2242440 2103496 2118871 2234835
9977 2234835 2137670 2088070 2168728 2165258 2052770 2020903 2018205 2065511 2333338 2391257 2408986
9966 2408986 2369770 2360777 2306790 2166574 2022676 2069367 2194234 2285657 2121048 1952805 1994309
9955 1994309 2127804 2170727 2116769 2032409 1996372 1949968 1815873 1783623 1810157 1786256 1845487
$$ packed form
10027B675235r2515j37620j23510o017J79981R5646J1175j75333q8448J85435
10017B524029N4006j41142K06782J27728P3404J4101o8135k7490l85378l5346
10007B342559J47780p0340J32968L3344j55088m5336r2759R4821L41680J91359
9997B920988l05558m02640j27408P0220L468R4951J30520k55329P0527K61763
9987B461502k29416j66031j12920j21209J62478J88539N9497j38944J5375J15964
9977B234835r7165m9600Q0658l470j12488l1867k698M7306K67827N7919J7729
9966B408986l9216q993n3987j40216j43898M6691J24867R1423j64609j68243M1504
9955A994309J33495M2923n3958q4360l6037m6404j34095l2250K6534k3901N9231
$$ plain form
9944 1845487 1964831 2126495 2290129 2350750 2183078 2083381 2004243 1845471 1929176 2028275
9934 2028275 1888348 1643420 1551412 1745049 1934862 1963828 2056987 1963522 2156151 2787255
9924 2787255 3046412 2374795 2114993 2149629 2071774 2155300 2593585 3282206 4189150 5163709
9914 5163709 6109966 5566911 4358319 3566201 3064993 2532824 2401577 2446932 2295894 2264114
9904 2264114 2304887 2277157 2155303 2133978 2107003 2114266 2208124 2186394 2051030 1998948 2164848
9893 2164848 2283694 2401528 2162484 1969972 1954811 1757649 1836375 1992138 2018541 2065207
9883 2065207 2014531 1808357 1750575 1895776 1936708 1904957 1726923 1779369 1942439 1959756 2176099
9872 2176099 2148600 2149785 2280638 2373305 2282911 2065603 2096432 2147119 2144076 2117175 2067520
$$ packed form
9944A845487J19344J61664J63634O0621j67672r9697p9138j58772Q3705R9099
9934B028275j39927k44928r2008J93637J89813K8966R3159r3465J92629O31104
9924B787255K59157o71617k59802L4636p7855Q3526M38285O88621R06944R74559
9914E163709R46257n43055j208592p92118n01208n32169j31247M5355j51038l1780
9904B264114M0773k7730j21854k1325k6975P263R3858k1730j35364n2082J65900
9893B164848J18846J17834k39044j92512j5161j97162P8726J55763K6403M6666
9883B065207n0676k06174n7782J45201M0932l1751j78034N2446J63070J7317K16343
9872B176099k7499J185J30853R2667r0394k17308L0829N0687l043k6901m9655
$$ plain form
9861 2067520 2092179 2045392 2002191 1855761 1883213 1993921 1917872 1943908 1781987 1714687 1641946
9850 1641946 1509118 1534384 1539584 1644425 1706776 1706521 1731416 1666705 1473516 1424646 1480063
9839 1480063 1601266 1593977 1416326 1442750 1584971 1650467 1582251 1615455 1663599 1594702 1624911
9828 1624911 1853812 2028385 2037262 1767937 1733453 1649150 1551330 1522374 1657262 1693105 1684850
9817 1684850 1858593 1948852 1972809 1982999 1772015 1571379 1672967 1670601 1532710 1593223 1723000
9806 1723000 1717806 1789066 1866004 1929154 1919393 1833030 1881877 1841962 1826147 1906204 1806882 1672329
9794 1672329 1424408 1446188 1757053 1784621 1589236 1426117 1411843 1389569 1378411 1466145 1494740
9783 1494740 1430804 1321750 1525831 1582875 1632625 1628944 1459313 1427723 1504485 1675020 1899070
$$ packed form
9861B067520K4659m6787m3201j46430K7452J10708p6049K6036j61921o7300p2741
9850A641946j32828K5266N200J04841O2351k55K4895o4711j93189m8870N5417
9839A480063J21203p289j77651K6424J42221O5496o8216L3204M8144o8897L0209
9828A624911K28901J74573Q877k69325l4484q4303r7820k8956J34888L5843q255
9817A684850J73743R0259K3957J0190k10984k00636J01588k366j37891O0513J29777
9806A723000n194P1260P6938O3150r761q6363M8847l9915j5815Q0057r9322j34553
9794A672329k47921K1780L10865K7568j95385j63119j4274k2274j1158Q7734K8595
9783A494740o3936j09054K04081N7044M9750l681j69631l1590P6762J70535K24050
$$ plain form
9772 1899070 2321165 2519060 2845640 2523228 2133901 1868834 1669999 1611328 1874433 1989574
9762 1989574 1915403 1617947 1472775 1539729 1699554 1727153 1632075 1613690 1652916 1769927 1797479
9751 1797479 1749270 1484674 1304633 1200074 1205476 1479645 1666738 1742881 1931839 2204767
9741 2204767 2087418 1653929 1547081 1733901 1997979 2024684 1625948 1362062 1391743 1349296
9731 1349296 1533924 1656429 1577151 1512229 1558312 1530915 1526131 1523591 1373039 1190836 1053848
9720 1053848 1217459 1294986 1482191 1612411 1483882 1312401 1309524 1242466 1054917 907480
9710 907480 948881 997950 1129289 1309582 1337350 1231052 1306324 1338526 1348654 1309764 1457531
9699 1457531 1689530 1735799 1565068 1418378 1601590 1404560 1256338 1293385 1195438 1199927
$$ packed form
9772A899070M22095J97895L26580l22412l89327k65067j98835n8671K63105J15141
9762A989574p4171k97456j45172O6954J59825K7599r5078j8385L9226J17011K7552
9751A797479m8209k64596j80041j04559N402K74169J87093P6143J88958K72928
9741B204767j17349m33489j06848J86820K64078K6705l98736k63886K9681m2447
9731A349296J84628J22505p9278o4922M6083k7397m784k540j50552j82203j36988
9720A053848J63611P7527J87205J30220j28529j71481k877o7058j87549j47437
9710I07480M1401M9069J31339J80293K7768j06298P5272L2202J0128l8890J47767
9699A457531K31999M6269j70731j46690J83212j97030j48222L7047r7947M489
$$ plain form
9689 1199927 1254920 1404322 1308633 1085963 1111784 1353558 1304218 1219103 1270054 1402040 1237185
9678 1237185 1156028 1157178 949165 923218 1058521 1242061 1323656 1212756 1279981 1361045 1421330
9667 1421330 1465473 1387087 1304089 1370365 1170508 1121692 1007452 1079929 1336020 1425770 1569996
9656 1569996 1733639 1665511 2220274 3167886 4071986 4558206 3977456 3253280 2708280 2265512
9646 2265512 2046398 1960479 1893355 1819516 1686984 1700552 1608017 1542158 1384243 1430024 1456521
9635 1456521 1494179 1482123 1428942 1469425 1610387 1423658 1383986 1506914 1704584 1604422
9625 1604422 1478842 1479939 1199146 1050792 1238970 1216750 1129184 1451825 1514976 1469888 1508925
9614 1508925 1581320 1508727 1373819 1531550 1543315 1357089 1397710 1306154 1295654 1246472 1179737
$$ packed form
9689A199927N4993J49402r5689k22670K5821K41774m9340q5115N0951J31986j64855
9678A237185q1157J150k08013k5947J35303J83540Q1595j10900O7225Q1064O0285
9667A421330M4143p8386q2998O6276j99857m8816j14240P2477K56091Q9750J44226
9656A569996J63643o8128N54763R47612R04100M86220n80750p24176n45000m42768
9646B265512k19114q5919o7124p3839j32532J3568r2535o5859j57915M5781K6497
9635A456521L7658j2056n3181M0483J40962j86729l9672J22928J97670j00162
9625A604422j25580J097k80793j48354J88178k2220q7566L22641O3151m5088L9037
9614A508925P2395p2593j34908J57731J1765j86226M0621r1556j0500m9182o6735
$$ plain form
9603 1179737 1011110 1214753 1498780 1378681 1263987 1188408 1154020 1072874 1077271 1205118
9593 1205118 1176200 1208000 1427190 1430022 1395962 1283887 1104551 966201 1040039 996085 825742
9582 825742 760025 1066491 1185074 1255087 1130412 1090921 1086589 1114382 1125918 1097140 1142961
9571 1142961 1110785 1144805 1000837 923310 871829 945785 1012424 1069022 1183208 1089148 1053801
9560 1053801 1045483 1047273 882687 850220 860095 1025537 1141683 1155418 1152937 1186872 1120426 1062392
9548 1062392 1153890 1078029 929872 947608 1052161 1174617 1397148 1362460 1156360 942263
9538 942263 1105273 992981 923817 990367 1020551 1078751 996114 1037331 1170749 1083069 1246499
9527 1246499 1148193 1088222 1140733 1081876 1031302 1023027 1050986 1067819 1071206 1184380 1192304 1059677
$$ packed form
9603A179737j68627K03643K84027j20099j14694p5579l4388q1146M397J27847
9593A205118k8918L1800K19190K832l4060j12075j79336j38350P3838m3954j70343
9582H25742o5717L06466J18583P0013j24675l9491m332K7793J1536k8778M5821
9571A142961l2176L4020j43968p7527n1481P3956O6639N6598J14186r4060l5347
9560A053801q318J790j64586l2467R875J65442J16146J3735k481L3935o6446n8034
9548A062392R1498p5861j48157J7736J04553J22456K22531l4688k06100k14097
9538I42263J63010j12292o9164O6550L0184N8200q2637M1217J33418q7680J63430
9527A246499r8306n9971N2511n8857n0574q275K7959J6833L387J13174P924j32627
$$ plain form
9515 1059677 1151266 1268166 1325385 1139326 719688 592048 776261 1123906 1274352 1174405
9505 1174405 921998 804202 941220 1088496 1139300 1312226 1149726 955483 1099474 1151298
9495 1151298 1197094 1334982 1443380 1357031 1273384 1357465 1254188 1080597 1004961 1140352
9485 1140352 1362183 1257707 1118258 982628 1168387 1115908 1152647 1104674 1042513 1174380
9475 1174380 1168910 1030019 955686 1030930 982539 1053701 1213056 1341029 1062718 1066821 1162630
9464 1162630 1300561 1242247 1120754 972486 907160 1042039 1281363 969832 859960 958764
9454 958764 946474 1039753 1020958 1075282 982475 782503 704675 409150 334650 847371 1170207
9443 1170207 1197076 1042966 895112 888605 903668 862291 708412 945903 922878 741197 546504
$$ packed form
9515A059677R1589J16900N7219j86059m19638j27640J84213L47645J50446r9947
9505A174405k52407j17796J37018J47276N0804J72926j62500j94243J43991N1824
9495A151298M5796J37888J08398q6349q3647Q4081j03277j73591p5636J35391
9485A140352K21831j04476j39449j35630J85759n2479L6739m7973o2161J31867
9475A174380n470j38891p4333P5244m8391P1162J59355J27973k78311M103R5809
9464A162630J37931n8314j21493j48268o5326J34879K39324l11531j09872R8804
9454I58764j2290R3279j8795N4324r2807j99972p7828k95525p4500N12721L22836
9443A170207K6869j54110j47854o507J5063m1377j53879K37491k3025j81681j94693
$$ plain form
9432 546504 580605 501394 872732 973137 931699 994193 1318230 1245409 812676 718633 732927
9421 732927 806050 842319 934233 900645 1129386 1367390 1388643 1764884 2184618 2717725 2738329
9410 2738329 2600118 2829862 3045463 2920987 2547030 2271760 1807467 1474690 1293685 1227002
9400 1227002 1148170 1326158 1251254 1183484 1451347 1412322 1227857 1214769 909530 743828
9390 743828 787816 826154 797253 807927 810708 983121 1188069 1218424 1047425 927476 1008518
9379 1008518 1087538 1034168 680454 866800 1135308 1074133 935875 900679 1000418 996733 1026805
9368 1026805 997103 793810 814440 845944 664205 724744 958939 872420 901055 815463 827614
9357 827614 986154 1023608 875112 876412 765472 754234 837490 953120 898154 696749 540818
$$ packed form
9432E46504L4101p9211L71338J00405m1438O2494L24037p2821m32733r4043J4294
9421G32927P3123L6269R1914l3588K28741K38004K1253L76241M19734N33107K0604
9410B738329j38211K29744K15601j24476l73957k75270m64293l32777j81005o6683
9400A227002p8832J77988p4904o7770K67863l9025j84465j3088l05239j65702
9390G43828M3988L8338k8901J0674K781J72413K04948L0355j70999j19949Q1042
9379A008518P9020n3370l53714J86346K68508o1175j38258l5196R9739l685L0072
9368A026805k9702k03293K0630L1504j81739O0539K34195q6519K8635q5592J2151
9357H27614J58540L7454j48496J300j10940j1238Q3256J15630n4966k01405j55931
$$ plain form
9346 540818 556618 661573 776760 786004 809968 954935 1141568 1044873 931942 974283 947036
9335 947036 734663 957707 1204996 1170173 1075040 934185 1003298 1092952 1105366 956722 897408
9324 897408 780150 906573 959609 816531 600432 397802 379781 772104 929348 850617
9314 850617 853908 1043013 1047295 1029362 1125040 1187512 1245092 1130822 1039277 943774 1091448
9303 1091448 1180855 1012667 982122 1025890 755876 976491 1126242 1206075 1228477 1071310
9293 1071310 763036 677676 844175 766529 735846 791784 952904 998986 744777 656262 675068
9282 675068 628322 596890 447603 229469 384657 750890 996525 982102 1046168 998584 921165
9271 921165 936642 957596 841609 887661 909028 894566 719316 625991 566767 648525 909883
$$ packed form
9346E40818J5800J04955J15187R244K3964J44967J86633r6695j12931M2341k7247
9335I47036k12373K23044K47289l4823r5133j40855O9113Q9654J2414j48644n9314
9324H97408j17258J26423N3036j43078k16099k02630j8021L92323J57244p8731
9314H50617L291J89105M282j7933R5678O2472N7580j14270r1545r5503J47674
9303A091448Q9407j68188l0545M3768k70014K20615J49751P9833K2402j57167
9293A071310l08274q5360J66499p7646l0683N5938J61120M6082k54209q8515J8806
9282F75068m6746l1432j49287k18134J55188L66233K45635j4423O4066m7584p7419
9271I21165J5477K0954j15987M6052K1367j4462j75250r3325n9224Q1758K61358
$$ plain form
9260 909883 873975 648335 852236 904757 778452 789188 943245 943531 926353 847530 811873
9249 811873 904494 1019031 920444 784040 764650 720041 890830 892887 986047 782389 554377
9238 554377 714889 696465 685411 715453 664098 564273 624965 570720 698371 793358 846407
9227 846407 728811 879777 810746 675830 795970 665045 696787 915879 1155491 992819
9217 992819 845870 696471 596170 580671 672968 624729 735900 736084 720989 607365 668168
9206 668168 953907 724791 672237 839885 564939 561312 592505 578727 502397 463289 534725
9195 534725 605807 650624 694721 761683 773810 487456 528509 576838 645701 668770 564581
9184 564581 629931 760454 649140 622552 506574 369068 286416 422212 528577 440255
$$ packed form
9260I09883l5908k25640K03901N2521j26305J0736J54057K86j7178p8823l5657
9249H11873R2621J14537r8587j36404j9390m4609J70789K057R3160k03658k28012
9238E54377J60512j8424j1054L0042n1355r9825O0692n4245J27651R4987N3049
9227H46407j17596J50966o9031j34916J20140j30925L1742K19092K39612j62672
9217I92819j46949j49399j00301j5499R2297m8239J11171J84j5095j13624O0803
9206F68168K85739k29116n2554J67648k74946l627L1193j3778p6330l9108P1436
9195E34725P1082M4817M4097O6962J2127k86354M1053M8329O8863K3069j04189
9184E64581O5350J30523j11314k6588j15978j37506q2652J35796J06365q8322
$$ plain form
9174 440255 275430 308105 469081 561248 569468 795221 939649 892574 857088 735859 608524
9163 608524 388561 471905 470050 471147 490587 605393 724977 741595 798477 606084 642561
9152 642561 483254 274073 366691 436472 356587 454668 550311 537294 564500 347499 433803
9141 433803 524489 609506 915690 993384 769558 681607 659546 906994 1192903 978413 722599
9130 722599 564894 658906 587757 518303 631193 702423 755401 1012563 826313 496186 503440
9119 503440 782680 925469 925887 1089017 1203865 1317662 1179374 892310 752238 867023
9109 867023 836001 877023 647509 601008 828380 906169 789769 616759 478667 586668
9099 586668 675950 545056 507692 443242 428850 630430 716682 693488 732681 800157 766507
$$ packed form
9174D40255j64825L2675J60976R2167Q220K25753J44428m7075l5486j21229j27335
9163F08524k19963Q3344j855J097J9440J14806J19584J6618N6882j92393L6477
9152F42561j59307k09181R2618O9781p9885R8081R5643j3017K7206k17001Q6304
9141D33803R0686Q5017L06184P7694k23826q7951k2061K47448K85909k14490k55814
9130G22599j57705R4012p1149o9454J12890P1230N2978K57162j86250l30127P254
9119E03440K79240J42789M18J63130J14848J13797j38288k87064j40072J14785
9109H67023l1022M1022k29514m6501K27372P7789j16400j73010j38092J08001
9099E86668Q9282j30894l7364o4450j4392K01580Q6252k3194L9193O7476l3650
$$ plain form
9088 766507 776360 753908 422490 367845 540186 520328 684314 755445 829211 806738 765317
9077 765317 534567 516315 663483 548034 489452 647745 784844 778786 640714 308644
9067 308644 376767 592938 518194 514992 571130 377167 577501 564627 442375 369101 463888
9056 463888 566958 532387 589867 883679 944309 903578 711287 573533 413454 490703 480577
9045 480577 426885 520368 697539 817498 463479 363810 415017 369779 382454 346931 292021
9034 292021 492910 679164 614102 430477 223494 321994 563655 745562 831184 947497
9024 947497 900170 660571 535648 537937 606481 499420 317894 608176 781973 853755 697568
9013 697568 523638 527071 510377 441545 500219 402009 408123 565302 603978 654026 675812 504027
$$ packed form
9088G66507R853k2452l31418n4645J72341j9858J63986P1131P3766k2473m1421
9077G65317k30750j8252J47168j15449n8582J58293J37099o058j38072l32070
9067C08644O8123K16171p4744l202N6138j93963K00334j2874j22252p3274R4787
9056D63888J03070l4571N7480K93812O0630m0731j92291j37754j60079P7249j0126
9045D80577n3692R3483J77171J19959l54019r9669N1207m5238J2675l5523n4910
9034B92021K00889J86254o5062j83625k06983R8500K41661J81907Q5622J16313
9024I47497m7327k39599j24923K289O8544j07061j81526K90282J73797P1782j56187
9013F97568j73930L433j6694o8832N8674r8210O114J57179L8676N0048K1786j71785
$$ plain form
9001 504027 530998 347415 209136 180885 366755 788994 859652 812432 703348 568973
8991 568973 657612 530248 527869 774207 691514 565947 565548 707655 754393 811115 840299
8980 840299 833874 696312 527177 442824 304956 388048 456174 467041 564196 581797 417721
8969 417721 412659 412840 538828 674023 657915 642462 605985 444146 436712 343476 273190 188047
8957 188047 339988 590753 631863 726148 705423 439029 372767 369083 370883 516544 551849
8946 551849 612451 531050 395210 550098 563166 401438 348243 478766 549448 674443 519076
8935 519076 373340 503951 590942 458478 129692 105123 278256 502390 466200 320145
8925 320145 106659 98595 197884 263793 369345 541774 574971 637442 736574 640407 580976
$$ packed form
9001E04027K6971j83583j38279k8251J85870M22239P0658m7220j09084j34375
8991E68973Q8639j27364k379K46338q2693j25567l99J42107M6738N6722K9184
8980H40299o425j37562j69135q4353j37868Q3092O8126J0867R7155J7601j64076
8969D17721n062J81J25988J35195j6108j5453l6477j61839p434r3236p0286q5143
8957A88047J51941K50765M1110R4285k0725k66394o6262l684J800J45661L5305
8946E51849O0602q1401j35840J54888J3068j61728n3195J30523P0682J24995j55367
8935E19076j45736J30611Q6991j32464l28786k4569J73133K24134l6190j46055
8925C20145k13486q064R9289O5909J05552J72429L3197O2471R9132r6167n9431
$$ plain form
8914 580976 338475 303380 321111 244649 248290 293158 308910 102966 -51174 113305 343951
8903 343951 335516 236500 166586 115217 249715 339135 233917 132177 340634 491354 438156
8892 438156 563384 480132 395680 370575 261176 420266 394245 349878 348446 168351 127480
8881 127480 118387 344025 278102 331032 463728 590521 680903 643809 564979 575500 449870
8870 449870 343006 376927 537132 530596 545166 241018 248447 432317 471244 423488 499958
8859 499958 451282 412960 473875 506861 438093 283293 78179 -47930 264449 499490 536701
8848 536701 525988 576016 592549 504105 424597 344324 302431 375088 438268 425476 305274
8837 305274 304268 372496 299718 258893 234705 270213 170312 34646 -13945 75270 190991
$$ packed form
8914E80976k42501l5095J7731p6462L641M4868J5752k05944j54140J64479K30646
8903C43951q435r9016o9914n1369J34498Q9420j05218j01740K08457J50720n3198
8892D38156J25228q3252q4452k5105j09399J59090k6021m4367j432j80095m0871
8881A27480r093K25638o5923N2930J32696J26793R0382l7094p8830J0521j25630
8870D49870j06864L3921J60205o536J4570l04148P429J83870L8927m7756P6470
8859D99958m8676l8322O0915L2986o8768j54800k05114j26109L12379K35041L7211
8848E36701j0713N0028J6533q8444p9508q0273m1893P2657O3180j2792j20202
8837C05274j006O8228p2778m0825k4188L5508r9901j35666m8591Q9215J15721
$$ plain form
8826 190991 416057 468602 248606 366694 448384 624057 574266 628311 681689 682583 604352
8815 604352 452597 280943 443022 268551 138919 227393 289279 494345 426879 370241
8805 370241 576551 494044 552063 609273 452183 304314 319146 159057 45768 283032
8795 283032 441243 456025 529081 534980 624485 410445 242820 332403 343964 412235 517493
8784 517493 482818 576306 561723 594139 628483 529582 458997 597276 636948 460681 386884
8773 386884 208434 328289 329520 266192 458233 537811 483365 504199 434805 417135 463552
8762 463552 396245 181853 276320 379815 530022 809302 926444 870031 892885 845428 459710
8751 459710 231861 553498 779521 705628 404757 276302 143550 126054 188703 206943
$$ packed form
8826A90991K25066N2545k19996J18088Q1690J75673m9791N4045N3378Q94p8231
8815F04352j51755j71654J62079j74471j29632Q8474O1886K05066o7466n6638
8805C70241K06310q2507N8019N7210j57090j47869J4832j60089j13289K37264
8795B83032J58211J4782P3056N899Q9505k14040j67625Q9583J1561O8271J05258
8784E17493l4675R3488j4583L2416L4344r8901p0585J38279L9672j76267p3797
8773C86884j78450J19855J231o3328J92041P9578n4446K0834o9394j7670M6417
8762D63552o7307k14392R4467J03495J50207K79280J17142n6413K2854m7457l85718
8751D59710k27849L21637K26023p3893l00871j28455j32752j7496O2649J8240
$$ plain form
8741 206943 346004 494050 443067 369109 176341 126447 137589 104953 152864 139129 12138
8730 12138 -46496 84514 90891 299176 328992 361988 315190 116942 225152 466577 779551
8719 779551 645239 486035 373035 137876 -18811 102429 297581 412847 460825 476376
8709 476376 465931 448702 574710 460357 472879 350698 326100 277930 161978 193527 354158
8698 354158 365110 398937 473514 718271 576616 530565 672173 637224 485979 193529 33216
8687 33216 20289 101473 195185 238086 327712 563793 545542 505014 452875 544099 633420 606881
8675 606881 333349 288166 302767 338287 583749 557410 444046 351018 403817 461949 494882
8664 494882 361834 243224 131762 -79216 17661 215666 467650 721107 601571 443505
$$ packed form
8741B06943J39061J48046n0983p3958j92768m9894J1142l2636M7911j3735j26991
8730A2138n8634J31010O377K08285K9816L2996m6798j98248J08210K41425L12974
8719G79551j34312j59204j13000k35159j56687J21240J95152J15266M7978J5551
8709D76376j0445j7229J26008j14353J2522j22181k4598m8170j15952L1549J60631
8698C54158J0952L3827P4577K44757j41655m6051J41608l4949j51245k92450j60313
8687C3216j2927Q1184R3712M2901Q9626K36081j8251m0528n2139R1224Q9321k6539
8675F06881k73532m5183J4601L5520K45462k6339j13364r3028N2799N8132L2933
8664D94882j33048j18610j11462k10978R6877J98005K51984K53457j19536j58066
$$ plain form
8654 443505 545497 350597 400373 395115 63042 252224 299889 413682 527010 551204 489395
8643 489395 557759 575142 496912 405683 323243 216869 125453 133595 238498 433075 368882
8632 368882 160146 110945 285303 478914 588979 587146 423475 366468 252034 308854 228390
8621 228390 165676 -833 -167424 -46662 213803 299055 449114 560426 491839 264490
8611 264490 391099 484417 388344 395739 524836 460323 383217 461016 476422 330654 224570
8600 224570 258161 189056 93906 72114 112299 141775 264803 280131 189643 196853 271642 361929
8588 361929 567370 656637 684670 543380 410412 381952 399828 598739 800749 513346
8578 513346 400746 376245 603212 593357 500760 257272 132594 344906 346080 160508 369848
$$ packed form
8654D43505J01992j94900M9776n258l32073J89182M7665J13793J13328K4194o1809
8643D89395O8364J7383p8230r1229q2440j06374r1416Q142J04903J94577o4193
8632C68882k08736m9201J74358J93611J10065j833j63671n7007j14434N6820q0464
8621B28390o2714j66509j66591J20762K60465Q5252J50059J11312o8587k27349
8611B64490J26609R3318r6073P395J29097o4513p7106P7799J5406j45768j06084
8600B24570L3591o9105r5150k1792M0185K9476J23028J5328r0488P210P4789R0287
8588C61929K05441Q9267K8033j41290j32968k8460J7876J98911K02010k87403
8578E13346j12600k4501K26967r855r2597k43488j24678K12312J174j85572K09340
$$ plain form
8567 369848 477452 436415 321448 329123 439805 577495 431206 224259 163112 248095 131736
8556 131736 4618 255591 445970 525790 500030 511015 636645 623739 645248 660425 530103
8545 530103 370644 325820 353950 478660 536925 705473 632768 510033 515111 417121 146386
8534 146386 6258 67189 205383 337028 369207 452989 351228 175620 99496 -5802
8524 -5802 57002 192673 223699 326231 196685 155094 103456 118828 106292 151737 334627
8513 334627 392448 264697 156023 68751 -234899 -418203 -302381 -215576 -7897 386238
8503 386238 589081 560987 593673 519857 228720 168497 221749 506244 515726 355093 368081
8492 368081 284719 189332 274325 247440 225213 82039 202793 334630 341887 433635 501802
$$ packed form
8567C69848J07604m1037j14967P675J10682J37690j46289k06947o1147Q4983j16359
8556A31736j27118K50973J90379P9820k5760J0985J25630j2906K1509J5177j30322
8545E30103j59459m4824K8130J24710N8265J68548p2705j22735N078r7990k70735
8534A46386j40128O0931J38194J31645L2179Q3782j01761j75608p6124j05298
8524e802O2804J35671L1026J02532j29546m1591n1638J5372j2536M5445J82890
8513C34627N7821j27751j08674q7272l03650j83304J15822Q6805K07679L94135
8503C86238K02843k8094L2686p3816k91137o0223N3252K84495R482j60633J2988
8492C68081q3362r5387Q4993k6885k2227j43174J20754J31837P257R1748O8167
$$ plain form
8481 501802 568004 561671 615180 854480 1097591 1080813 877597 578469 500741 421945 268407
8470 268407 222508 372667 408799 320465 216423 323162 560705 578282 456111 206968
8460 206968 122800 360281 240260 185610 325553 490789 522277 456683 360446 412692 507582
8449 507582 279530 215138 162153 236172 345815 178177 126422 192833 370480 441680 451264
8438 451264 387962 451233 420676 320653 339108 442265 672689 731230 789610 633373 538332
8427 538332 600076 456383 321741 375419 551501 549151 437074 144143 53471 441468 427199
8416 427199 194197 132845 191688 331992 158080 -7872 -43640 -163914 -252055 -19416
8406 -19416 207175 527203 659461 680619 593163 521905 561225 416097 155100 179433 313318
$$ packed form
8481E01802O6202o333N3509K39300K43111j6778k03216k99128p7728p8796j53538
8470B68407m5899J50159L6132q8334j04042J06739K37543J7577j22171k49143
8460B06968q4168K37481j20021n4650J39943J65236L1488o5594r6237N2246R4890
8449E07582k28052o4392n2985P4019J09643j67638n1755O6411J77647P1200R584
8438D51264o3302O3271l0557j00023J8455J03157K30424N8541N8380j56237r5041
8427E38332O1744j43693j34642N3678J76082k350j12077k92931r0672L87997j4269
8416D27199k33002o1352N8843J40304j73912j65952l5768j20274q8141K32639
8406a9416K26591L20028J32258K1158q7456p1258L9320j45128k60997K4333J33885
$$ plain form
8395 313318 340417 183553 113676 231913 107474 219138 332402 185991 307227 171975
8385 171975 147018 429886 575501 198297 125729 35308 172883 185395 182186 126653 137970
8374 137970 268949 158910 -9817 6777 12571 -50349 184104 419756 624203 523643
8364 523643 243341 142013 329062 320450 362658 235078 -44787 21087 140644 208103 158008
8353 158008 62567 377154 393872 383901 509683 446957 155343 78956 62639 120413 395173
8342 395173 435387 395184 159335 151780 363731 428220 417266 559433 444141 202945 381625
8331 381625 260498 54807 55146 200909 401616 355232 144247 -5588 122676 157199 203609
8320 203609 203186 75931 98646 176079 200647 -111536 -177512 78815 156225 115077 172444
$$ packed form
8395C13318K7099j56864o9877J18237j24439J11664J13264j46411J21236j35252
8385A71975k4957K82868J45615l77204p2568r0421J37575J2512l209n5533J1317
8374A37970J30979j10039j68727J6594N794o2920K34453K35652K04447j00560
8364E23643k80302j01328J87049q612M2208j27580k79865O5874J19557O7459n0095
8353A58008r5441L14587J6718r971J25782o2726k91614p6387j6317N7774K74760
8342C95173M0214m0203k35849p555K11951O4489j0954J42167j15292k41196J78680
8331C81625j21127k05691L39J45763K00707m6384k10985j49835J28264L4523M6410
8320B03609m23j27255K2715P7433K4568l12183o5976K56327P7410m1148N7367
$$ plain form
8309 172444 383419 377298 122333 11048 159437 198594 178055 214054 321406 218169 91195
8298 91195 22336 -45224 76306 327480 377527 126200 226835 220072 52664 51778 62413
8287 62413 107722 163575 308045 309909 213707 247816 246518 245427 159909 223241 133158 70925
8275 70925 242760 403387 569952 728649 614230 408953 338088 280429 167634 246335
8265 246335 81274 -69095 166791 358071 500767 329593 30992 97714 187058 407324
8255 407324 381986 259674 333396 429773 722704 496953 267012 261866 80630 16798 1989
8244 1989 1890 102127 171295 250341 311321 196161 195549 -11424 -25832 -1101 94643 260813
8232 260813 270733 254140 334470 436980 450946 268425 169716 149277 258065 275447 52656
$$ packed form
8309A72444K10975o121k54965j11285J48389L9157k0539L5999J07352j03237j26974
8298I1195o8859o7560J21530K51174N0047k51327J00635o763j67408q86J0635
8287F2413M5309N5853J44470J864r6202L4109j298j091q5518O3332r0083o2233
8275G0925J71835J60627J66565J58697j14419k05277p0865n7659j12795P8701
8265B46335j65061j50369K35886J91280J42696j71174k98601O6722Q9344K20266
8255D07324k5338j22312P3722R6377K92931k25751k29941n146j81236o3832j4809
8244A989r9J00237O9168P9046O0980j15160o12k06973j4408K4731R5744J66170
8232B60813R920j6593Q0330J02510J3966j82521r8709k0439J08788J7382k22791
$$ plain form
8221 52656 98427 307282 108742 111855 106040 143832 272471 158302 232705 261845 330100
8210 330100 402190 433850 587349 529488 287761 177058 3266 -27584 61786 414739 426518
8199 426518 206173 32502 26785 68887 327488 342357 156891 -132697 -47348 31680 86452
8188 86452 10562 39073 -10036 19993 120239 111167 39009 204894 495636 596416 402648
8177 402648 61212 -65620 -1891 4098 -119810 -124891 -58381 -60649 -106308 -190256 -229809 -17097
8165 -17097 148062 42058 50721 -100089 -201221 -187955 -38049 -26111 -36791 -53663 154718
8154 154718 158087 -42802 -41297 -3690 96341 275721 146724 -60282 -72785 37533 59602
8143 59602 -56506 -188902 -136783 21239 -45461 -84103 -156434 -175060 -164839 -185940 -159458
$$ packed form
8221E2656M5771K08855j98540L113n815L7792J28639j14169P4403K9140O8255
8210C30100P2090L1660J53499n7861k41727j10703j73792l0850Q9370L52953J1779
8199D26518k20345j73671n717M2102K58601J4869j85466k89588Q5349P9028N4772
8188H6452p5890K8511m9109L0029J00246r072p2158J65885K90742J00780j93768
8177D02648l41436j26832O3729N989j23908n081O6510k268m5659q3948l9553K12712
8165a7097J65159j06004Q663j50810j01132J3266J49906J1938j0680j6872K08381
8154A54718L369k00889J505L7607J00031J79380j28997k07006j2503J10318K2069
8143E9602j16108j32396N2119J58022o6700l8642p2331j8626J0221k1101K6482
$$ plain form
8132 -159458 -194406 -67611 193079 163598 196995 378995 271516 272069 246615 199227 126744
8121 126744 -21266 234578 363331 3334 73062 270269 355522 376619 290922 287417 503985
8110 503985 470557 549116 601636 255115 33481 128420 71101 41460 154194 202775 251081
8099 251081 79658 66419 138074 35898 -42190 44005 -40967 56812 -115615 -226181 233488
8088 233488 323945 236219 201553 61561 85506 287311 221552 146 30671 241432 299073
8077 299073 398415 445108 142883 58007 7723 -128068 -174028 -126830 -14848 68347 -106287
8066 -106287 -9770 179104 241705 251514 131487 227787 401178 297883 226489 323945 313010
8055 313010 258611 237553 83055 -87098 98791 242724 298868 309644 252265 416144 496175
$$ packed form
8132a59458l4948J26795K60690k9481L3397J82000j07479N53k5454m7388p2483
8121A26744j48010K55844J28753l59997O9728J97207Q5253K1097q5697l505K16568
8110E03985l3428P8559N2520l46521k21634R4939n7319k9641J12734M8581M8306
8099B51081j71423j3239P1655j02176p8088Q6195q4972R7779j72427j10566M59669
8088B33488R0457q7726l4666j39992K3945K01805o5759k21406L0525K10761N7641
8077B99073R9342M6693l02225q4876n0284j35791m5960M7198J11982Q3195j74634
8066a06287R6517J88874O2601R809j20027R6300J73391j03295p1394R7456j0935
8055C13010n4399k1058j54498j70153J85889J43933N6144J0776n7379J63879Q0031
$$ plain form
8044 496175 320786 405489 404882 241548 150598 178584 316699 233037 374212 420235 434331
8033 434331 369442 165919 -31319 -97848 -55193 86550 203168 141282 139580 150092 58678
8022 58678 -36066 22225 152064 187382 230630 119569 517075 615559 517399 424098 67378
8011 67378 -44197 -21227 -114666 -209122 -246578 -207026 220294 234276 287383 267409 441903
8000 441903 377640 230992 160312 172647 277301 225151 401364 661444 485526 96987
7990 96987 87902 174932 172312 322207 235540 68336 -50638 19914 -7193 -38116 131275
7979 131275 203622 101583 132294 255881 51651 -128367 -74963 -158826 -40340 167502
7969 167502 158182 152248 51770 55473 49069 64062 185343 329009 325867 447171 498210 313452
$$ packed form
8044D96175j75389Q4703o07j63334r0950K7986J38115q3662J41175M6023J4096
8033D34331o4889k03523j97238o6529M2655J41743J16618o1886j702J0512r1414
8022E8678r4744N8291J29839L5318M3248j11061L97506R8484r8160r3301l56720
8011F7378j11575K2970r3439r4456l7456L9552M27320J3982N3107j9974J74494
8000D41903o4263j46648p0680J2335J04654n2150J76213K60080j75918l88539
7990I6987r085Q7030k620J49895q6667j67204j18974P0552k7107l0923J69391
7979A31275P2347j02039L0711J23587k04230j80018N3404q3863J18486K07842
7969A67502r320n934j00478L703o404J4993J21281J43666l142J21304N1039j84758
$$ plain form
7957 313452 -62371 -186472 71304 314068 508419 212010 -46455 5224 197994 230656
7947 230656 12623 -859 74404 294586 336757 33234 75931 82448 -68071 18268 128474
7936 128474 -1078 -224291 -171559 -13045 92620 294529 328455 139897 60046 105569
7926 105569 115296 -8951 125923 288539 240286 282351 360796 363658 203904 94954 126240
7915 126240 177881 63517 22065 223273 302678 117243 21594 90602 203555 154020 90435
7904 90435 89035 -57756 -82875 128999 214051 125736 290547 244199 179104 359951 461493
7893 461493 378963 421095 387766 379543 194425 -149480 -392982 -351301 -199274 -203885 20707
7882 20707 207945 171680 -148576 -235574 5024 358157 281699 178921 153401 147900 124938
$$ packed form
7957C13452l75823j24101K57776K42764J94351k96409k58465N1679J92770L2662
7947B30656k18033j3482P5263K20182M2171l03523M2697O517j50519Q6339J10206
7936A28474j29552k23213N2732J58514J05665K01909L3926j88558p9851M5523
7926A05569R727j24247J34874J62616m8253M2065P8445K862j59754j08950L1286
7915A26240N1641j14364m1452K01208P9405j85435r5649O9008J12953m9535o3585
7904I0435j400j46791k5119K11874Q5052q8315J64811m6348o5095J80847J01542
7893D61493q2530M2132l3329q223j85118l43905k43502M1681J52027m611K24592
7882B0707J87238l6265l20256q6998K40598L53133p6458j02778k5520n501k2962
$$ plain form
7871 124938 -70957 -196446 -10782 49175 137742 213759 335531 505743 343478 97579
7861 97579 255376 54340 9676 203604 406602 284275 98828 -74391 -24399 55856
7851 55856 -75767 -134580 -120308 -100606 134471 281325 181233 230608 130233 3205 34977
7840 34977 47032 270762 310159 103301 -63872 -92649 -55453 73852 138567 76206 184424
7829 184424 87443 4020 27273 36449 44431 -54797 -159765 -164519 -55016 177636 250279 23665
7817 23665 -45559 70930 182264 -103149 -283594 -41451 377986 357346 38334 64275
7807 64275 56699 -142384 -157761 -166392 -204714 -93637 -78458 -71186 -113809 -222305 -24448 -26978
7795 -26978 -47854 10766 -22554 -28221 -49289 8154 -71947 -211467 -204513 -293615 -221953 -136976
$$ packed form
7871A24938j95895j25489J85664N9957Q8567P6017J21772J70212j62265k45899
7861I7579J57797k01036m4664J93928K02998j22327j85447j73219M9992Q0255
7851E5856j31623n8813J4272J9702K35077J46854j00092M9375j00375j27028L1772
7840C4977J2055K23730L9397k06858j67173k8777L7196J29305O4715o2361J08218
7829A84424r6981q3423K3253R176P982r9228j04968m754J09503K32652P2643k26614
7817B3665o9224J16489J11334k85413j80445K42143M19437k0640l19012K5941
7807F4275p576j99083j5377q631l8322J11077J5179P272m2623j08496J97857k530
7795b6978k0876N8620l3320n667k1068N7443q0101j39520O954q9102P1662Q4977
$$ plain form
7783 -136976 -79000 -279117 -152641 132102 149402 88706 128505 421331 423583 81689 -110228
7772 -110228 -327748 -378195 -367480 -336217 -308829 -287621 14647 -22195 -189317 -78728 43351
7761 43351 -106563 -222438 -94693 -9934 189474 367983 65688 -209078 -163250 -119920
7751 -119920 11379 -79326 32636 107026 122267 167002 183248 128026 106095 122596 -11177
7740 -11177 -108331 -66016 75647 217985 372114 211897 260668 415846 380303 313098 92486
7729 92486 49449 128396 86832 -118874 -76457 145735 330157 277286 -87949 -251491 -319873
7718 -319873 123702 325879 251519 776 -90924 -223119 -225223 39449 223405 239071 134162
7707 134162 251665 154691 258716 180678 38976 -275534 -404647 -402797 -310134 -277789 -119498
$$ packed form
7783a36976N7976k00117J26476K84743J7300o0696L9799K92826K252l41894j91917
7772a10228k17520n0447J0715L1263K7388K1208L02268l6842j67122J10589J22079
7761D3351j49914j15875J27745Q4759J99408J78509l02295k74766M5828M3330
7751a19920J31299r0705J11962P4390J5241M4735J6246n5222k1931J6501j33773
7740a1177r7154M2315J41663J42338J54129j60217M8771J55178l5543o7205k20612
7729I2486m3037P8947m1564k05706M2417K22192J84422n2871l65235j63542o8382
7718c19873M43575K02177p4360k50743r1700j32195k104K64672J83956J5666j04909
7707A34162J17503r6974J04025p8038j41702l14510j29113J850R2663L2345J58291
$$ plain form
7696 -119498 -159939 -167092 -192591 -43607 56319 -197306 -177120 -400840 -310110 -249688 -307
7685 -307 142418 -119718 -473548 -518629 -264598 -272300 -173446 -170686 -27624 64843 170308
7674 170308 119342 -38340 -121471 -83044 -156166 -77704 -161772 -100076 53154 -92925 -261489
7663 -261489 -180565 13420 82550 -94169 -226165 -25709 -43946 44279 105797 186029 59283
7652 59283 18591 -96880 -226062 -236016 -382170 -287278 -118565 -51712 -73685 -231351 -334289
7641 -334289 -430303 -397189 -364844 -370889 -118902 13373 67532 85598 -72415 29573 103396
7630 103396 -120585 -79594 110848 77413 22858 10381 12249 163964 -32544 -209751 -184558
7619 -184558 -80317 -101960 -13418 92571 120874 110291 15474 -125601 -157903 -209380 -137436
$$ packed form
7696a19498m0441p153k5499J48984R9926k53625K0186k23720R0730O0422K49381
7685c07J42725k62136l53830m5081K54031p702R8854K760J43062R2467J05465
7674A70308n0966j57682q3131L8427p3122P8462q4068O1696J53230j46079j68564
7663b61489Q0924J93985O9130j76719j31996K00456j8237Q8225O1518Q0232j26746
7652E9283m0692j15471j29182r954j46154R4892J68713O6853k1973j57666j02938
7641c34289r6014L3114L2345o045K51987J32275N4159J8066j58013J01988P3823
7630A03396k23981M0991J90442l3435n4555j2477J868J51715j96508j77207K5193
7619a84558J04241k1643Q8542J05989K8303j0583r4817j41075l2302n1477P1944
$$ plain form
7608 -137436 -105778 -79711 -1768 -139849 12069 32981 -20364 179410 279056 376155 197509
7597 197509 31807 113652 -50377 45865 46657 -183747 -168043 -66805 -135577 -242891 -224602
7586 -224602 -207394 -258575 -349809 -301229 -240646 48823 -75074 32697 -61268 36192 56824
7575 56824 118778 -193703 -210081 -225501 -311365 -261208 -188690 -154479 -136608 -76068 95335
7564 95335 -109310 -13393 -180446 -253371 79476 120724 -238789 -355774 -358673 -328259 -340080
7553 -340080 -378317 -480789 -386093 -406980 -439484 -352383 -359755 -217470 -39036 -159219 -370978
7542 -370978 -347151 -330185 -276474 -42237 74912 78593 -133914 -217131 -178588 -126364 59909
7531 59909 -64871 -261163 -388364 -277333 -344160 -272874 -91688 11613 25319 99538 376379
$$ packed form
7608a37436L1658K6067P7943j38081J51918K0912n3345J99774R9646R7099j78646
7597A97509j65702Q1845j64029R6242P92k30404J5704J01238o8772j07314J8289
7586b24602J7208n1181r1234M8580O0583K89469j23897J07771r3965R7460K0632
7575E6824O1954l12481j6378j5420q5864N0157P2518L4211J7871O0540J71403
7564I5335k04645R5917j67053p2925L32847M1248l59513j16985k899L0414j1821
7553c40080l8237j02472R4696k0887l2504Q7101p372J42285J78434j20183k11759
7542c70978K3827J6966N3711K34237J17149L681k12507q3217L8543N2224J86273
7531E9909j24780j96292j27201J11031o6827P1286J81186J03301J3706P4219K76841
$$ plain form
7520 376379 103523 11943 149553 29195 -51656 -99775 113725 160087 153350 230593 326917
7509 326917 435765 446788 295500 93162 239674 226569 -25025 -89286 -141697 -202979 -166381
7498 -166381 -134545 -209926 -277192 -151939 -152077 -164870 2375 74245 -143854 -120433 42267
7487 42267 32837 141158 107588 -152533 -304202 -337864 -420666 -376859 -310758 -391121 -367884
7476 -367884 -348092 -308237 -321274 -270018 -117194 -277253 -399530 -473041 -376459 -259158 -291580
7465 -291580 -227344 -266113 -382449 -264440 -7823 23198 108372 138671 94920 141681 -34583
7454 -34583 -171552 -103866 114849 -960 3057 -87228 -249075 -208594 -225739 -102514 -21367
7443 -21367 -94885 -346178 -230275 -243652 -175208 -60335 -60897 -53589 57169 203151 94041
$$ packed form
7520C76379k72856r1580J37610j20358q0851m8119K13500M6362o737P7243R6324
7509C26917J08848J1023j51288k02338J46512j3105k51594o4261n2411o1282L6598
7498a66381L1836p5381o7266J25253j38j2793J67245P1870k18099K3421J62700
7487D2267r430J08321l3570k60121j51669l3662q2802M3807O6101q0363K3237
7476c67884J9792L9855j3037N1256J52824j60059j22277p3511R6582J17301l2422
7465b91580O4236l8769j16336J18009K56617L1021Q5174L0299m3751M6761j76264
7454c4583j36969O7686K18715j15809M017r0285j61847M0481j7145J23225Q1147
7443b1367p3518k51293J15903j3377O8444J14873n62P308J10758J45982j09110
$$ plain form
7432 94041 194670 299605 329628 377249 526963 554562 450017 389547 441574 291336 -14725
7421 -14725 -111281 127393 137507 -880 -61759 -111983 -128285 -218842 -292001 -272307 -596
7410 -596 124225 123187 -146844 -240871 -147518 -252686 -227000 -321611 -440638 -165337 -132751
7399 -132751 -142811 -76899 -340961 -352631 -96638 74253 162240 79211 -177462 -234774 -276884
7388 -276884 -390112 -402788 -450214 -490551 -621007 -461530 -369500 -315160 -226695 -277226 -327120
7377 -327120 -367590 -197870 23964 128745 -67394 -35835 -21550 -21851 118160 -100998 -300167
7366 -300167 -254766 6426 194807 30119 -60914 -162435 -52694 133304 167837 89375
7356 89375 118846 124673 102753 107640 123369 140259 166037 232938 89690 -230608 -239716 11628
$$ packed form
7432I4041J00629J04935L0023M7621J49714K7599j04545o0470N2027j50238l06061
7421a4725r6556K38674J0114j38387o0879n0224j6302r0557p3159J9694K71711
7410e96J24821j038k70031r4027R3353j05168K5686r4611j19027K75301L2586
7399a32751j0060O5912k64062j1670K55993J70891Q7987q3029k56673n7312m2110
7388b76884j13228j2676m7426m0337j30456J59477R2030N4340Q8465n0531m9894
7377c27120m0470J69720K21834J04781j96139L1559J4285l01J40011k19158j99169
7366c00167M5401K61192J88381j64688r1033j01521J09741J85998L4533p8462
7356H9375K9471N827k1920M887J5729J6890K5778O6901j43248l20298r108K51344
$$ plain form
7344 11628 10097 -171513 -122962 -367040 -558955 -458686 -326226 -355466 -313829 -274791 -256173
7333 -256173 -194768 -112778 2451 -56346 -106542 -85558 -123949 -104276 -177983 -247782 -213814
7322 -213814 -263722 -242166 -274542 -318891 -352182 -156373 -200607 -334945 -434971 -199633 -318758
7311 -318758 -327210 -430414 -565534 -710811 -538626 -94256 125172 222824 25039 -177368
7301 -177368 -334339 -274643 -246330 -367158 -413565 -309573 -228073 -137711 -276070 -341208 -366792
7290 -366792 -145465 -15969 -243193 -326940 -247135 -251062 -403094 -226322 -160870 -237010 -236686
7279 -236686 -304803 -376946 -286247 -390785 -336380 -211122 -130144 -163188 -302964 -263270 -332228
7268 -332228 -430578 -567446 -462305 -335527 -254488 -221693 -121329 -79603 -9563 -14077 -122019
$$ packed form
7344A1628j531j81610M8551k44078j91915J00269J32460k9240M1637L9038J8618
7333b56173O1405Q1990J15229n8797n0196K0984l8391J9673p3707o9799L3968
7322b13814m9908K1556l2376m4349l3291J95809m4234j34338j00026K35338j19125
7311c18758q452j03204j35120j45277J72185M44370K19428R7652j97785k02407
7301a77368j56971N9696K8313j20828m6407J03992Q1500R0362j38359o5138k5584
7290c66792K21327J29496k27224q3747P9805l927j52032J76772O5452p6140L24
7279b36686o8117p2143R0699j04538N4405J25258Q0978l3044j39776L9694o8958
7268c32228r8350j36868J05141J26778Q1039L2795J00364M1726P0040m514j07942
$$ plain form
7257 -122019 -149637 -113133 -51073 -92783 -178770 -146056 -229759 18671 171822 257465 160932
7246 160932 338304 466551 263892 -62158 -174776 -65115 -103801 -159591 -98715 -189666
7236 -189666 -345427 -372869 -69532 -74578 -304468 -329675 -384168 -278901 -145272 -103550 -190466
7225 -190466 -9280 150299 129416 29431 12126 86947 11301 -109189 -199994 -146435 -39057
7214 -39057 -58635 1161 -47653 -59991 86464 312168 41698 -493990 -500364 -279837 -213077
7203 -213077 -416644 -501352 -635575 -667226 -652029 -583017 -264329 -127990 -223171 -191540 -291194
7192 -291194 -361590 -452685 -439174 -377882 -515970 -398675 -161334 -65269 58056 347892 154768
7181 154768 -179781 -224989 -186459 -156940 -166140 8725 54915 7914 162659 544033 480414
$$ packed form
7257a22019k7618L6504O2060m1710q5987L2714q3703K48430J53151Q5643r6533
7246A60932J77372J28247k02659l26050j12618J09661l8686n5790O0876r0951
7236a89666j55761k7442L03337n046k29890k5207n4493J05267J33629M1722q6916
7225a90466J81186J59579k0883r9985j7305P4821p5646j20490r0805N3559J07378
7214c9057j9578N9796m8814j2338J46455K25704k70470n35688o374K20527O6760
7203b13077k03567q4708j34223l1651J5197O9012L18688J36339r5181L1631r9654
7192b91194p0396r1095J3511O1292j38088J17295K37341R6065J23325K89836j93124
7181A54768l34549m5208L8530K9519r200J74865M6190m7001J54745L81374o3619
$$ plain form
7170 480414 265147 143547 -252885 -528272 -505593 -454598 -340053 -87064 40257 -21010
7160 -21010 -28326 166756 163393 -120414 -187603 -323805 -258207 -67129 64839 102642 -178901
7149 -178901 -497829 -298816 -30682 -77130 -128582 -49380 -92215 -353039 -347165 -190544 -205001
7138 -205001 -286116 -226379 -234706 -201243 -159764 -234821 -403543 -586903 -613941 -520922 -194128
7127 -194128 55572 -45805 39195 19303 -250431 -260336 -266773 -435556 -453205 -439438 -248441
7116 -248441 -249058 -248801 -109530 -26540 -90174 -246477 -177960 -305842 -230029 -133717 -217463 -270238
7104 -270238 -300286 -241010 -171606 -423010 -218261 148997 -15307 -54928 105468 123835 33549
7093 33549 -116152 -146606 -80061 5368 -166661 -319319 -527539 -401725 -170981 -95761 -339114
$$ packed form
7170D80414k15267j21600l96432k75387K2679N0995J14545K52989J27321o1267
7160b1010p316J95082l363k83807o7189j36202O5598J91078J31968L7803k81543
7149a78901l18928J99013K68134m6448n1452P9202m2835k60824N874J56621j4457
7138b05001q1115N9737q327L3463M1479p5057j68722j83360k7038R3019L26794
7127a94128K49700j01377Q5000j9892k69734r905o437j68783j7649J3767J90997
7116b48441o17K57J39271Q2990o3634j56303O8517j27882P5813R6312q3746n2775
7104b70238l0048N9276O9404k51404K04749L67258j64304l9621J60396J8367r0286
7093C3549j49701l0454O6545Q5429j72029j52658k08220J25814K30744P5220k43353
$$ plain form
7082 -339114 -424540 -295461 -355648 -287473 -105862 -57011 -210316 -489497 -375702 -199142
7072 -199142 -87931 9292 151575 67765 6665 -91820 -216146 -356774 -400630 -492197 -501595
7061 -501595 -300223 -144271 -90279 -21995 -103886 -174943 -325928 -407234 -388528 -369851 -261353
7050 -261353 -371886 -400738 -334117 -154530 61644 69548 -51684 -108974 20740 -135427 65184
7039 65184 169199 36183 7285 8868 -44926 -148603 61794 140351 116961 106791 163060
7028 163060 -21109 -33528 -20095 -413889 -620022 -517590 -385669 -507564 -207218 -107091
7018 -107091 -37887 -31847 1943 49101 -33680 -242714 -353018 -229047 -106685 96358 221985
7007 221985 172346 76078 -72706 -54000 99886 146824 52117 57788 56010 -92259 -170610
$$ packed form
7082c39114q5426J29079o0187O8175J81611M8851j53305k79181J13795J76560
7072a99142J11211R7223J42283q3810o1100r8485j24326j40628m3856r1567r398
7061e01595K01372J55952N3992O8284q1891p1057j50985q1306J8706J8677J08498
7050b61353j10533k8852O6621J79587K16174P904j21232n7290J29714j56167K00611
7039F5184J04015j33016k8898J583n3794j03677K10397P8557k3390j0170N6269
7028A63060j84169j2419J3433l93794k06133J02432J31921j21895L00346J00127
7018a07091O9204O040L3790M7158q2781k09034j10304J23971J22362K03043J25627
7007B21985m9639r6268j48784J8706J53886M6938r4707N671j778j48269p8351
$$ plain form
6996 -170610 -116223 -203560 -43317 -37168 -205170 -248906 -377404 -334092 -84954 -8082 -177748
6985 -177748 -188187 -176107 -290546 -485659 -467995 -245958 -268767 -181059 -239044 -146171 -106934
6974 -106934 -87569 -13329 157558 279837 218349 229895 153696 147393 156932 181253 262142 -27644
6962 -27644 -124561 -123775 -163396 -130765 240043 37373 -61886 -123864 -117773 -90055 -177256 -299261
6950 -299261 -389478 -119303 -70609 -110133 -62121 -154753 -97255 -198618 -119254 -127520 -79986
6939 -79986 14674 -171059 -397309 -322942 -358906 -431099 -227999 -125087 63172 -45647 -93565
6928 -93565 -175527 -154679 -103075 -26780 -14424 -145606 -169266 -208411 -241116 -127418 -153105
6917 -153105 -199528 -217439 -16960 -21967 -210817 -167518 11147 -83531 -115717 -104931 -82560
$$ packed form
6996a70610N4387q7337J60243O149j68002m3736j28498M3312K49138P6872j69666
6985a77748j0439J2080j14439j95113J7664K22037k2809Q7708n7985R2873L9237
6974a06934J9365P4240J70887J22279o1488J1546p6199o303R539K4321Q0889k89786
6962b7644r6917P86l9621L2631L70808k02670r9259o1978O091K7718q7201j22005
6950b99261r0217K70175M8694l9524M8012r2632N7498j01363P9364q266M7534
6939g9986R4660j85733k26250P4367l5964p2193K03100J02912J88259j08819m7918
6928i3565q1962K0848N1604P6295J2356j31182k3660l9145l2705J13698k5687
6917a53105m6423j7911K00479n007j88850M3299J78665r4678l2186J0786K2371
$$ plain form
6906 -82560 -50195 -157618 -306311 -306967 -382639 -449003 -303405 -250158 -373352 -308856 -41575
6895 -41575 -80852 -323461 -300186 -117491 -1629 86853 171180 48013 -258533 -263792 -368195
6884 -368195 -238210 -85398 2210 -25640 -308890 -380760 -136842 49840 -126019 -260759
6874 -260759 -263035 -409578 -497343 -362541 -198745 -110070 -192441 -332390 -290523 -236047 -366078
6863 -366078 -536626 -452800 -270240 -214408 -249339 -193533 -86977 20402 -117211 -196377 -280176
6852 -280176 -327245 -220708 -186030 -69013 -1630 259839 89850 -138973 -104481 -20350 -145436
6841 -145436 -288082 -218348 -27217 -159551 -297987 -479287 -468593 -376339 -322807 -333823 -260364
6830 -260364 -338083 -429126 -123890 45290 -17221 -180557 -227710 -139419 -157494 -352661 -434753
$$ packed form
6906h2560L2365j07423j48693o56p5672o6364J45598N3247j23194O4496K67281
6895d1575l9277k42609K3275J82695J15862Q8482Q4327j23167l06546n259j04403
6884c68195J29985J52812Q7608k7850k83250p1870K43918J86682j75859j34740
6874b60759k276j46543q7765J34802J63796Q8675q2371j39949M1867N4476j30031
6863c66078j70548Q3826J82560N5832l4931N5806J06556J07379j37613p9166q3799
6852b80176m7069J06537L4678J17017O7383K61469j69989k28823L4492Q4131j25086
6841a45436j42646O9734J91131j32334j38436j81300J0694R2254N3532j1016P3459
6830b60364p7719r1043L05236J69180o2511j63336m7153Q8291j8075j95167q2092
$$ plain form
6819 -434753 -264626 -129228 -35687 -187566 -317265 -330042 -143734 -14619 -57816 -36276
6809 -36276 -8157 -202237 -420954 -219982 -196725 -292019 -257999 -209935 -194220 -308150 -392104
6798 -392104 -300585 -330423 -637100 -688117 -587060 -202987 -307156 -266928 -311054 -324286 -379231
6787 -379231 -256258 -220326 -275732 -304685 -191756 -308320 -455371 -391169 -307198 -118824 -23125
6776 -23125 -127085 -294813 -62022 156412 -16410 75599 42686 -18883 15068 62867 226052
6765 226052 139928 58281 78465 -26599 -137654 -190522 -179641 -49513 36670 -188827 -375527
6754 -375527 -384805 -69760 -31327 -144318 -378213 -526825 -593113 -416515 -232186 -238436 -119327
6743 -119327 3426 -115855 -304205 -363707 -169257 -270533 -300283 -321087 -449138 -483673
$$ packed form
6819d34753J70127J35398R3541j51879j29699j2777J86308J29115m3197K1540
6809c6276K8119j94080k18717K00972K3257r5294L4020M8064J5715j13930q3954
6798c92104R1519k9838l06677n1017J01057L84073j04169M0228m4126j3232n4945
6787c79231J22973L5932n5406k8953J12929j16564j47051O4202Q3971J88374R5699
6776b3125j03960j67728K32791K18434j72822R2009l2913o1569L3951M7799J63185
6765B26052q6124q1647K0184j05064j11055n2868J0881J30128Q6183k25497j86700
6754c75527r278L15045L8433j12991k33895j48612o6288J76598J84329o250J19109
6743a19327J22753j19281j88350n9502J94450j01276k9750k0804j28051l4535
$$ plain form
6733 -483673 -275222 -150822 -164933 -217715 -81135 -35188 38090 179138 38165 -53103 -20696
6722 -20696 -60804 -414969 -421111 -372576 -259974 -94843 -104784 -76247 -185706 -123457 -79268
6711 -79268 40050 55046 -253130 -384684 -461012 -500673 -411040 -253102 -61661 -27299 -46356
6700 -46356 -244838 -232350 -141070 -148181 -116702 -169141 -291909 -344668 -333847 -308046 -111569
6689 -111569 -251481 -479607 -393598 -113139 -73554 168759 274465 -4290 -206741 -78033
6679 -78033 -83072 7191 115986 239594 147122 -251786 -292265 -128359 -8478 -228207 -328509
6668 -328509 -266889 -351211 -345233 -316882 -146861 -127270 -126247 77235 95410 -261390 -409795
6657 -409795 -462761 -368801 -380088 -276444 -244126 -379496 -215013 82956 87904 -63728 -234862
$$ packed form
6733d83673K08451J24400j4111n2782J36580M5947P3278J41048j40973r1268L2407
6722b0696m0108l54165o142M8535J12602J65131r941K8537j09459O2249M4189
6711g9268J19318J4996l08176j31554p6328l9661Q9633J57938J91441L4362j9057
6700d6356j98482J2488R1280p111L1479n2439j22768n2759J0821K5801J96477
6689a11569j39912k28126Q6009K80459L9585K42313J05706k78755k02451J28708
6679g8033n039R0263J08795J23608r2472l98908m0479J63906J19881k19729j00302
6668c28509O1620q4322N978K8351J70021J9591J023K03482J8175l56800j48405
6657d09795n2966R3960j1287J03644L2318j35370J64483K97969M948j51632j71134
$$ plain form
6646 -234862 -288474 -233717 -275901 -300048 -276566 -292898 -317813 -296726 -91599 -109547 -14051
6635 -14051 -160530 -217966 -113880 32096 270213 176311 -95113 -121956 -192320 -266435 -496320
6624 -496320 -589739 -639908 -546159 -404712 -324638 -261217 -290735 -317137 -355641 -396879 -466842
6613 -466842 -659833 -502251 -398058 -378909 -437693 -768947 -906571 -679616 -295572 -154066
6603 -154066 -324567 -515007 -616689 -426125 -288287 -202598 -105684 -82871 -193853 -120811
6593 -120811 6611 101575 -138742 -351198 -249338 -281396 -398802 -591636 -570211 -450306
6583 -450306 -606810 -656562 -596353 -559471 -411791 -200264 -272655 -114434 40527 -62519
6573 -62519 -338455 -358650 -190571 -78630 72176 343810 340840 227925 144241 -40100 -240727
$$ packed form
6646b34862n3612N4757m2184k4147K3482j6332k4915K1087K05127j7948R5496
6635a4051j46479n7436J04086J45976K38117r3902k71424k6843p0364p4115k29885
6624d96320r3419n0169R3749J41447Q0074O3421k9518k6402l8504m1238o9963
6613d66842j92991J57582J04193J9149n8784l31254j37624K26955L84044J41506
6603a54066j70501j90440j01682J90564J37838Q5689R6914K2813j10982P3042
6593a20811J27422R4964k40317k12456J01860l2058j17406j92834K1425J19905
6583d50306j56504m9752O0209L6882J47680K11527p2391J58221J54961j03046
6573f2519k75936k0195J68079J11941J50806K71634k970j12915q3684j84341k00627
$$ plain form
6562 -240727 -91755 54818 50167 -78711 -137672 -287130 -255204 -188428 -241564 -189899 -166430
6551 -166430 -80899 -398529 -401129 -295915 -214842 -173928 -118333 -196104 -388823 -109098 71643
6540 71643 39328 -94948 -362761 -252908 -286369 -292369 -163178 -451050 -562863 -677954 -711398
6529 -711398 -443090 -334209 -414905 -347401 -161869 -121711 -37835 -144621 -273219 -145746
6519 -145746 -56837 -119416 -64360 -105227 56457 160513 133445 -9620 -127192 -243101 -298417
6508 -298417 -395382 -284703 -281274 123271 368027 187298 99921 144351 -19138 -99614 -11041
6497 -11041 199792 302123 55297 -9814 119838 235780 220738 -61339 -121549 -9427
6487 -9427 -57168 -208183 -259889 -148638 -169576 -231699 -263831 -201464 -59304 -166494 -278036
$$ packed form
6562b40727J48972J46573m651j28878n8961j49458L1926O6776n3136N1665K3469
6551a66430Q5531l17630k600J05214Q1073M0914N5595p7771j92719K79725J80741
6540G1643l2315j34276k67813J09853l3461o000J29191k87872j11813j15091l3444
6529g11398K68308J08881q0696O7504J85532M0158Q3876j06786j28598J27473
6519a45746Q8909o2579N5056m0867J61684J04056k7068j43065j17572j15909n5316
6508b98417r6965J10679L429M04545K44756j80729q7377M4430j63489q0476Q8573
6497a1041K10833J02331k46826o5111J29652J15942j5042k82077o0210J12122
6487i427m7741j51015n1706J11251k0938o2123l2132O2367J42160j07190j11542
$$ plain form
6476 -278036 -242977 -257654 -328590 -226687 124311 156001 -34342 -138862 -258926 -258141 -100695
6465 -100695 101422 72635 71468 -32037 -226468 -325970 -291812 -173197 14620 -10800 -115188
6454 -115188 -21032 -65513 -85029 -350339 -433070 -473633 -542630 -484508 -328202 -104952 -111938
6443 -111938 -434478 -569248 -396736 -82739 -87383 -115525 4542 65506 36040 -20113 -308683
6432 -308683 -213251 -108571 -240210 -231698 -274967 12843 211814 -19914 -49949 -10608 -72839
6421 -72839 -112336 -238771 -66664 169546 205222 113497 -128395 -86294 -168604 -122252 56211
6410 56211 -39206 -124041 -153937 -447566 -491164 -682157 -632624 -323932 -86248 150825 103198
6399 103198 24974 -130768 -95844 -88395 -92619 -16275 53755 22728 -48891 -118818 -307640 -465453
$$ packed form
6476b78036L5059j4677p0936J01903L50998L1690j90343j04520j20064P85J57446
6465a00695K02117k8787j167j03505j94431r9502L4158J18615J87817k5420j04388
6454a15188R4156m4481j9516k65310q2731m0563o8997N8122J56306K23250o986
6443a11938l22540j34770J72512L13997m644k8142J20067O0964k9466n6153k88570
6432c08683R5432J04680j31639Q512m3269K87810J98971k31728l0035L9341o2231
6421g2839l9497j26435J72107K36210L5676r1725k41892M2101q2310M6352J78463
6410E6211r5417q4835k9896k93629m3598j90993M9533L08692K37684K37073m7627
6399A03198p8224j55742L4924P449m224P6344P0030l1027p1619o9927j88822j57813
$$ plain form
6387 -465453 -284705 -154327 -224223 -213780 -353010 -358898 -242127 -278340 -286497 -271560 -504945
6376 -504945 -649400 -387963 -322104 -402770 -359760 -130808 -75223 -123650 -411488 -456130 -240713
6365 -240713 -119748 -293770 -377023 -270679 -241856 -160372 -45355 -9815 -100119 -317471 -275332
6354 -275332 -261666 -138096 -51418 -165357 -87625 111744 112354 49752 -21969 -94055 -57556
6343 -57556 -239043 -337692 -249999 -291516 -188154 -148739 79260 -63241 -378544 -275802 -173541
6332 -173541 -12066 296310 285107 163481 -67590 -27197 -106967 -265592 -115878 62508
6322 62508 -54222 -191793 -251730 -168637 -148946 -286163 -427727 -457763 -285714 -182093 -198987
6311 -198987 -172118 -141108 -269574 -231479 -190400 -239231 -256316 -89251 -111636 -253880 -487152
$$ packed form
6387d65453J80748J30378o9896J0443j39230n888J16771l6213q157J4937k33385
6376e04945j44455K61437O5859q0666M3010K28952N5585m8427k87838m4642K15417
6365b40713J20965j74022q3253J06344K8823Q1484J15017L5540r0304k17352M2139
6354b75332J3666J23570Q6678j13939P7732J99369O10o2602p1721p2086L6499
6343e7556j81487r8649Q7693m1517J03362L9415K27999j42501l15303J02742J02261
6332a73541J61475L08376j1203j21626k31071M0393p9770j58625J49714J78386
6322F2508j16730j37571n9937Q3093J9691j37217j41564l0036J72049J03621j6894
6311a98987K6869L1010j28466L8095M1079m8831j7085J67065k2385j42244k33272
$$ plain form
6300 -487152 -660880 -383161 -301919 -296715 -422092 -237993 -91573 -241011 -381905 -501055
6290 -501055 -584232 -379398 -202429 -61500 -80047 -147933 -131230 75446 71946 93597 45236
6279 45236 -224583 -367555 -185242 27798 58596 -96462 -199160 -271791 -479875 -564629
6269 -564629 -558552 -491227 -417697 -316525 12540 15533 -218787 -296326 -185876 -71535 -150508
6258 -150508 38212 223591 217639 135427 -576 -131132 -123657 -68614 -41475 -11443 1665
6247 1665 18846 159004 165513 64728 -135591 -250331 -271137 -533555 -429923 -172280 -19576
6236 -19576 -8434 42187 -124785 -447680 -345920 -340360 -304338 -169321 -90532 -222220 -225429
6225 -225429 -115113 -138675 -257845 -278399 -159387 -163132 -146569 108067 180730 -48622 -265175
$$ packed form
6300d87152j73728K77719Q1242N204j25377J84099J46420j49438j40894j19150
6290e01055q3177K04834J76969J40929j8547o7886J6703K06676l500K1651m8361
6279D5236k69819j42972J82313K13040L0798j55058j02698p2631k08084q4754
6269e64629O077O7325P3530J01172L29065K993k34320p7539J10450J14341p8973
6258a50508J88720J85379n952q2212j36003j30556P475N5043K7139L0032J3108
6247A665J7181J40158O509j00785k00319j14740k0806k62418J03632K57643J52704
6236a9576J1142N0621j66972l22895J01760N560L6022J35017P8789j31688l209
6225b25429J10316k3562j19170k0554J19012l745J6563K54636P2663k29352k16553
$$ plain form
6214 -265175 -292109 -239215 -207442 -84938 -89489 -443997 -396274 -319521 -286187 -227574 -290666
6203 -290666 -136953 -127236 -258576 -235389 -243879 -51212 55441 -93043 -287009 -254451 -443279
6192 -443279 -560868 -475458 -523550 -536965 -479136 -501762 -268751 -279664 -414428 -480687 -251397
6181 -251397 -171277 -22314 -50802 110062 83913 283120 379178 150314 -218470 -397980
6171 -397980 -207997 -19146 -89220 -216613 -187355 -312158 -165810 -18636 33682 56776
6161 56776 129243 -38487 -259115 -146420 -182315 10091 112425 180925 66659 -46150
6151 -46150 -169170 -126777 -206313 -445756 -547788 -424415 -379246 -461027 -508362 -523619 -577958
6140 -577958 -469452 -180551 61109 57445 -162587 -159708 -97382 -3453 100608 43549 -49142
$$ packed form
6214b65175k6934N2894L1773J22504m551l54508M7723P6753L3334N8613o3092
6203b90666J53713R717j31340K3187q490J92667J06653j48484j93966L2558j88828
6192d43279j17589Q5410m8092j3415N7829k2626K33011j0913j34764o6259K29290
6181b51397Q0120J48963k8488J60864k6149J99207R6058k28864l68784j79510
6171c97980J89983J88851p0074j27393K9258j24803J46348J47174N2318K3094
6161E6776P2467j67730k20628J12695l5895J92406J02334O8500j14266j12809
6151d6150j23020M2393p9536k39443j02032J23373M5169q1781m7335j5257n4339
6140e77958J08506K88901K41660l664k20032K879O2326R3929J04061n7059r2691
$$ plain form
6129 -49142 91596 -23690 -7294 -339038 -402920 -263988 -287723 -281911 -422743 -475435 -503423
6118 -503423 -220781 -211946 -448691 -400031 -333367 -813103 -607342 -400989 -454642 -392284 -194017
6107 -194017 -306483 -512353 -518557 -574513 -480433 -382024 -232803 -129084 35545 232907 112592
6096 112592 -235916 -324435 -294546 -269597 -208442 -143027 -367756 -563807 -536069 -462250 -331191
6085 -331191 -105228 -79014 -133025 -255898 -323749 -468400 -133407 -62663 -14887 91099 -77504
6074 -77504 7955 9786 -47816 -59111 34989 -95241 -211128 -361007 -280080 -342025 -326036
6063 -326036 -306540 -196861 -203161 -98274 -158018 -309993 -367239 -303336 -444933 -484595 -353573
6052 -353573 -221955 -338736 -381382 -286685 -284834 -363618 -271894 -216139 -31364 27813 -53665
$$ packed form
6129d9142J40738j15286J6396l31744o3882J38932k3735N812j40832n2692k7988
6118e03423K82642Q835k36745M8660O6664m79736K05761K06353n3653O2358J98267
6107a94017j12466k05870o204n5956R4080R8409J49221J03719J64629J97362j20315
6096A12592l48508q8519K9889K4949O1155O5415k24729j96051K7738P3819J31059
6085c31191K25963K6214n4011j22873o7851j44651L34993P0744M7776J05986j68603
6074g7504Q5459J831n7602j1295R4100j30230j15887j49879Q0927o1945J5989
6063c26036J9496J09679o300J04887n9744j51975n7246O3903j41597l9662J31022
6052c53573J31618j16781m2646R4697J851p8784R1724N5755J84775N9177q1478
$$ plain form
6041 -53665 -158960 -369394 -360921 -189371 20737 -130983 -219304 -154606 -26713 57741 27564
6030 27564 -97149 -305007 -361904 -294622 -265443 -525514 -490689 -286830 -258963 -310724 -175669
6019 -175669 -402206 -555045 -419203 -379086 -305490 -307415 -222070 -166553 -228931 -358911 -374566
6008 -374566 -595835 -567809 -396662 -177053 -243790 -343325 -457114 -232553 -200141 -256487 -337513
5997 -337513 -243558 -237754 -412890 -384566 -263463 -341158 -147740 73837 -33338 -134389 -100891
5986 -100891 -41406 1535 -150069 -243408 -199769 -280051 -314404 -482035 -549499 -437948 -322834
5975 -322834 -364043 -381577 -194796 -206350 -175831 -75032 9256 37106 39609 -5484 18508
5964 18508 20621 -44354 -190332 -378482 -539119 -589469 -465328 -373045 -184150 -50481 138352
$$ packed form
6041e3665j05295k10434Q473J71550K10108j51720q8321O4698J27893Q4454l0177
6030B7564j24713k07858n6897O7282K9179k60071L4825K03859K7867n1761J35055
6019a75669k26537j52839J35842M0117P3596j925Q5345N5517o2378j29980j5655
6008c74566k21269K8026J71147K19609o6737r9535j13789K24561L2412n6346q1026
5997c37513R3955N804j75136K8324J21103p7695J93418K21577j07175j01051L3498
5986a00891N9485M2941j51604r3339M3639q0282l4353j67631o7464J11551J15114
5975c22834m1209j7534J86781j1554L0519J00799Q4288K7850K503m5093K3992
5964A8508K113o4975j45978j88150j60637n0350J24141R2283J88895J33669J88833
$$ plain form
5953 138352 249950 225464 7503 -180606 -152993 -294445 -405483 -389633 -359734 -287370 -260410
5942 -260410 -271271 -118169 20754 -172363 -350804 -330592 -418712 -171875 -177776 -209298 -94077
5931 -94077 -85134 -267708 -363952 -280790 -93536 -56263 -212219 -229132 -63256 -223060 -315132
5920 -315132 -400761 -314909 -208779 -91521 -79580 -108917 60680 7816 -242812 -366080 -309408
5909 -309408 -392402 -328669 -85952 -173669 -294069 -414858 -451200 -188365 93510 124261 67563
5898 67563 -229450 -642428 -703814 -363917 -246174 -318556 -169720 19787 -67889 -230799
5888 -230799 -447521 -595351 -408761 -371444 -418277 -297457 -254539 -358339 -562146 -541466
5878 -541466 -251732 -169386 -386839 -485261 -516163 -388546 -39741 -245667 -742382 -739293 -792225
$$ packed form
5953A38352J11598k4486k17961j88109K7613j41452j11038J5850K9899P2364K6960
5942b60410j0861J53102J38923j93117j78441K0212q8120K46837n901l1522J15221
5931i4077Q943j82574r6244Q3162J87254L7273j55956j6913J65876j59804r2072
5920c15132q5629Q5852J06130J17258J1941k9337J69597n2864k50628j23268N6672
5909c09408q2994O3733K42717q7717j20400j20789l6342K62835K81875L0751n6698
5898F7563k97013m12978o1386L39897J17743p2382J48836J89507q7676j62910
5888b30799k16722j47830J86590L7317m6833J20820M2918j03800k03807K0680
5878e41466K89734Q2346k17453r8422l0902J27617L48805k05926m96715L089n2932
$$ plain form
5867 -792225 -580503 -335133 -183209 -119524 -170681 -28704 17534 -164901 -261977 -119651
5857 -119651 -252898 -265750 -223205 -177616 -111352 -262041 -145990 -129811 -157107 -300710 -212059
5846 -212059 -106063 27684 90823 161172 142583 -137017 -65532 -96035 -240524 -207630 -268525
5835 -268525 -274900 -266060 -260834 -216453 -211908 -368940 -306921 -123668 -63544 -9602 -172880 -234322
5823 -234322 -110018 72193 294131 427760 87308 -257713 -291759 -68650 -122621 -41114
5813 -41114 -42272 -319534 -287141 -256258 -201876 -231058 -183387 -126250 -155617 -222652 -311688 -325787
5801 -325787 -408843 -351556 -309616 -155757 -128160 -235524 -178692 -202089 -138813 71648 -33911
5790 -33911 -170713 -359778 -278220 -164204 -163861 -186818 -126324 -68199 -50100 104507 -37321
$$ packed form
5867g92225K11722K45370J51924O3685n1157J41977M6238j82435r7076J42326
5857a19651j33247j2852M2545M5589O6264j50689J16051J6179k7296j43603Q8651
5846b12059J05996J33747O3139P0349j8589k79600P1485l0503j44489L2894o0895
5835b68525o375Q840N226M4381M545j57032O2019J83253O0124N3942j63278o1442
5823b34322J24304J82211K21938J33629l40452l45021l4046K23109n3971Q1507
5813d1114j158k77262L2393L0883N4382k9182M7671N7137k9367o7035q9036j4099
5801c25787q3056N7287M1940J53859K7597j07364N6832k3397O3276K10461j05559
5790c3911j36802j89065Q1558J14016L43k2957O0494N8125J8099J54607j41828
$$ plain form
5779 -37321 -179734 -49784 -63368 -223353 -487948 -442329 -449286 -375556 -76947 -373527 -528350
5768 -528350 -280787 -153135 -286502 -277358 -267364 -118274 -74017 -221352 -276188 -221850 -100241
5757 -100241 -82391 -67539 -69489 -84700 -27248 -105875 -131783 -49240 135272 198295 146741 56915
5745 56915 -124446 -357347 -179528 -62882 -5265 128849 77861 2274 3293 56980 -127911
5734 -127911 -129862 21713 89217 -124017 -205700 -246904 -364913 -409267 -377220 -160824 -9355
5723 -9355 77653 21540 14196 36358 -22906 901 -85070 -250145 -180099 -153654 -133858 -115752
5711 -115752 -36975 73101 145425 118233 230914 -5970 -125792 12186 84277 9733 -287
5700 -287 -141850 -298252 -275978 11528 -193254 -396961 -366059 -246572 -1769 85917 93593
$$ packed form
5779c7321j42413J29950j3584j59985k64595M5619o957P3730K98609k96580j54823
5768e28350K47563J27652j33367R144R994J49090M4257j47335n4836N4338J21609
5757a00241J7850J4852j950j5211N7452p8627k5908Q2543J84512O3023n1554q9826
5745E6915j81361k32901J77819J16646N7617J34114n0988p5587J019N3687j84891
5734a27911j951J51575O7504k13234q1683m1204j18009m4354L2047K16396J51469
5723i355Q7008n6113p344K2162n9264K3807q5971j65075P0046K6445J9796J8106
5711a15752P8777J10076P2324k7192J12681k36884j19822J37978P2091p4544j0020
5700b87j41563j56402K2274K87506k04782k03707L0902J19487K44803Q7686P676
$$ plain form
5689 93593 252644 154640 -219150 -320322 -288331 -222442 -238159 -221411 -226097 -145239 -201081
5678 -201081 -277849 -165927 -87354 -179126 -294366 -318278 -343066 -231249 -248430 -309396 -251472
5667 -251472 -76258 37900 39563 -59005 169466 222651 -106083 -328543 -198411 -21157
5657 -21157 -90063 -163702 -182702 -231493 -264773 -234779 -43210 185754 140629 -83531 -227426
5646 -227426 -326308 -378467 -334584 -388821 -311586 -75078 -107062 -88483 -61118 -121300 -377004
5635 -377004 -744553 -789857 -609571 -459763 -455470 -317006 -163458 30022 -31442 -337596
5625 -337596 -459732 -379595 -255208 -440294 -556761 -512188 -466049 -327398 -298003 -287969 -225561
5614 -225561 -204040 -470537 -423400 -256415 -254569 -384153 -350031 -357537 -429792 -517896 -542202
$$ packed form
5689I3593J59051r8004l73790j01172L1991O5889j5717J6748m686Q0858n5842
5678b01081p6768J11922P8573r1772j15240k3912k4788J11817j7181o0966N7924
5667b51472J75214J14158J663r8568K28471N3185l28734k22460J30132J77254
5657b1157o8906p3639j9000m8791l3280K9994J91569K28964m5125k24160j43895
5646b27426r8882n2159M3883n4237P7235K36508l1984J8579K7365o0182k55704
5635c77004l67549m5304J80286J49808M293J38464J53548J93480o1464l06154
5625c37596j22136Q0137J24387j85086j16467M4573M6139J38651K9395J0034O2408
5614b25561K1521k66497M7137J66985J846j29584L4122p506p2255q8104k4306
$$ plain form
5603 -542202 -472074 -454186 -178702 -160303 -155863 -76788 -40199 -24448 -256383 -439015 -473165
5592 -473165 -439617 -388350 -314795 -221603 -40805 52196 -68932 -10989 -111039 -253472 -357300
5581 -357300 -502637 -446319 -202819 -251515 -488435 -394300 -247839 -214703 -307085 -280191 -216393
5570 -216393 -112097 -208506 -261849 -77048 -223097 -207634 -20196 -66901 -11773 85513 50445
5559 50445 5163 -1459 -199917 83641 -17728 26532 59126 -124499 -397852 -545254 -583970
5548 -583970 -496663 -403929 -361519 -497366 -726567 -728811 -553018 -420878 -397627 -371611 -359218
5537 -359218 -278551 -319104 -9992 94893 214160 125772 147403 -67232 -166619 -212873 -385328
5526 -385328 -249433 -345663 -432468 -410028 -364937 -249626 -177239 -193762 -304740 -418999 -267318
$$ packed form
5603e42202P0128J7888K75484J8399M440P9075L6589J5751k31935j82632l4150
5592d73165L3548N1267P3555R3192J80798R3001j21128N7943j00050j42433j03828
5581c57300j45337N6318K43500m8696k36920R4135J46461L3136r2382K6894O3798
5570b16393J04296r6409n3343J84801j46049J5463J87438m6705N5128R7286l5068
5559E0445m5282o622j98458K83558j01369M4260L2594j83625k73353j47402l8716
5548e83970Q7307R2734M2410j35847k29201k244J75793J32140K3251K6016J2393
5537c59218Q0667m0553L09112J04885J19267q8388K1631k14635r9387m6254j72455
5526c85328J35895r6230q6805K2440M5091J15311P2387j6523j10978j14259J51681
$$ plain form
5515 -267318 -118625 -33156 -120822 -172104 -289795 -384978 -568830 -422647 -289777 -292959 -251136
5504 -251136 -355175 -469785 -474736 -288595 -201382 -413114 -440574 -278601 -73319 -125339 -104380
$$ packed form
5515b67318J48693Q5469q7666n1282j17691r5183j83852J46183J32870l182M1823
5504b51136j04039j14610m951J86141Q7213k11732k7460J61973K05282n2020K0959
$$ [...]
##END NTUPLES=NMR SPECTRUM
##END=
