##TITLE=Analysis number 326901
Compound Code cc 41406
Book Reference 467/132/2
Project Code adrs
Chemist Name benw
##JCAMPDX= 6.0         $$ Bruker NMR JCAMP-DX V2.0
##DATA TYPE= NMR SPECTRUM
##DATA CLASS= NTUPLES
##ORIGIN= Bruker BioSpin GmbH
##OWNER= nmr
$$ XWIN-NMR		Version 3.5
$$ Thu Mar  1 10:04:28 2007 GMT Standard Time (UT+0h)  MAYBRIDGE\nmr@NMR_250MHZ
##.OBSERVE FREQUENCY= 250.131544655141
##.OBSERVE NUCLEUS= ^1H
##.ACQUISITION MODE= SIMULTANEOUS (DQD)
##.ACQUISITION SCHEME= undefined
##.AVERAGES= 16
##.DIGITISER RES= 18
##SPECTROMETER/DATA SYSTEM= dpx250
##.PULSE SEQUENCE= zg30
##.SOLVENT NAME= CDCl3
##.SHIFT REFERENCE= (INTERNAL, CDCl3, 0, 16.522)
##AUDIT TRAIL= $$ (NUMBER, WHEN, WHO, WHERE, WHAT)
$$ ##TITLE= Audit trail, XWIN-NMR		Version 3.5
$$ ##JCAMPDX= 5.01
$$ ##ORIGIN= Bruker BioSpin GmbH
$$ ##OWNER= nmr
$$ C:\u/data/dgb/nmr/ADRS/20/pdata/1/auditp.txt
$$ ##AUDIT TRAIL=  $$ (NUMBER, WHEN, WHO, WHERE, WHAT)
(   1,<2007-03-01 10:03:59.99 +000>,<MAYBRIDGE\nmr>,<NMR_250MHZ>,
      <created by zg, POWCHK disabled, PULCHK disabled
       configuration hash MD5:
       49 4B E0 1D 92 C2 6B 37 9F E6 65 BC 52 41 86 1D
       data hash MD5: 64K
       D2 E2 6D 49 57 6C F4 3C EE 4D 51 0E 7D DE E3 B1>)
(   2,<2007-03-01 10:04:19.14 +000>,<MAYBRIDGE\nmr>,<NMR_250MHZ>,
      <Start of raw data processing
       ef LB = 0.3 FT_mod = 6 PKNL = 1 SI = 32K 
       data hash MD5: 32K
       DB 67 60 29 B6 5E 27 CD 04 EB 90 1C E4 99 54 5F>)
(   3,<2007-03-01 10:04:21.04 +000>,<MAYBRIDGE\nmr>,<NMR_250MHZ>,
      <apk 
       data hash MD5: 32K
       8B 69 BD 65 D7 28 8B D2 D2 00 B2 BA FB 46 97 06>)
(   4,<2007-03-01 10:04:21.88 +000>,<MAYBRIDGE\nmr>,<NMR_250MHZ>,
      <abs ABSG = 5 
       data hash MD5: 32K
       DE 34 8D 35 11 4F 41 CD 54 CD 61 08 D4 A0 C9 A6>)
$$ ##END=
$$ 
$$ hash MD5
$$ BA E3 BB CF 9A EA 2E D2 C4 8A 79 68 0B A1 1F C7
##$RELAX= 
##$RELAX= 
##$RELAX= 
##$RELAX= 
##$RELAX= 
##$RELAX= 
##$RELAX= 
$$ Bruker specific parameters
$$ --------------------------
##$DU= <C:\u>
##$EXPNO= 20
##$NAME= <ADRS>
##$PROCNO= 1
##$TYPE= <nmr>
##$USER= <dgb>
##$AMP= (0..31)
100 100 100 100 100 100 100 100 100 100 100 100 100 100 100 100 100 100 
100 100 100 100 100 100 100 100 100 100 100 100 100 100 
##$AQSEQ= 0
##$AQ_mod= 3
##$AUNM= <au_zg>
##$AUTOPOS= <54 >
##$BF1= 250.13
##$BF2= 250.13
##$BF3= 250.13
##$BF4= 250.13
##$BF5= 500.13
##$BF6= 500.13
##$BF7= 500.13
##$BF8= 500.13
##$BYTORDA= 1
##$CFDGTYP= 0
##$CFRGTYP= 5
##$CHEMSTR= <none>
##$CNST= (0..31)
1 1 145 1 1 1 1 1 1 1 1 1 1 1 1 1 1 1 1 1 1 1 1 1 1 1 1 1 1 1 1 1 
##$CPDPRG= <>
##$CPDPRG1= <>
##$CPDPRG2= <>
##$CPDPRG3= <>
##$CPDPRG4= <mlev>
##$CPDPRG5= <mlev>
##$CPDPRG6= <mlev>
##$CPDPRG7= <mlev>
##$CPDPRG8= <mlev>
##$CPDPRGB= <>
##$CPDPRGT= <>
##$D= (0..31)
0 1 0 0 0 0 0 0 0 0.06 0 0 0 0 0 0 0.0002 0 0 0 0 0 0 0 0 0 0 0 0 0 0 
0 
##$DATE= 1172743439
##$DBL= (0..7)
120 120 120 120 120 120 120 120 
##$DBP= (0..7)
150 150 150 150 150 150 150 150 
##$DBP07= 0
##$DBPNAM0= <>
##$DBPNAM1= <>
$$ [...]
##$SUBNAM6= <"">
##$SUBNAM7= <"">
##$SUBNAM8= <"">
##$SUBNAM9= <"">
##$SW= 20.6930455092707
##$SWIBOX= (0..15)
0 0 3 0 0 0 0 0 0 0 0 0 0 0 0 0 
##$SW_h= 5175.983436853
##$TD= 65536
##$TD0= 1
##$TE= 295.16
##$TE2= 300
##$TE3= 300
##$TEG= 300
##$TL= (0..7)
0 120 120 120 120 120 120 120 
##$TP= (0..7)
150 150 150 150 150 150 150 150 
##$TP07= 0
##$TPNAME0= <>
##$TPNAME1= <>
##$TPNAME2= <>
##$TPNAME3= <>
##$TPNAME4= <>
##$TPNAME5= <>
##$TPNAME6= <>
##$TPNAME7= <>
##$TPOAL= (0..7)
0.5 0.5 0.5 0.5 0.5 0.5 0.5 0.5 
##$TPOFFS= (0..7)
0 0 0 0 0 0 0 0 
##$TUNHIN= 0
##$TUNHOUT= 0
##$TUNXOUT= 0
##$USERA1= <user>
##$USERA2= <user>
##$USERA3= <user>
##$USERA4= <user>
##$USERA5= <user>
##$V9= 5
##$VALIST= <valist>
##$VCLIST= <CCCCCCCCCCCCCCC>
##$VD= 0
##$VDLIST= <DDDDDDDDDDDDDDD>
##$VPLIST= <PPPPPPPPPPPPPPP>
##$VTLIST= <TTTTTTTTTTTTTTT>
##$WBST= 1024
##$WBSW= 4
##$XGAIN= (0..3)
0 0 0 0 
##$XL= 0
##$YL= 0
##$YMAX_a= 418858
##$YMIN_a= -467346
##$ZGOPTNS= <>
##$ZL1= 120
##$ZL2= 120
##$ZL3= 120
##$ZL4= 120
##$ABSF1= 16.522
##$ABSF2= -4.171173
##$ABSG= 5
##$ABSL= 3
##$ALPHA= 0
##$AQORDER= 0
##$ASSFAC= 0
##$ASSFACI= 0
##$ASSFACX= 0
##$ASSWID= 0
##$AUNMP= <proc_1d>
##$AZFE= 0.1
##$AZFW= 0.1
##$BCFW= 0
##$BC_mod= 0
##$BYTORDP= 0
##$COROFFS= 0
##$CY= 12.5
##$DATMOD= 1
##$DC= 0
##$DFILT= <>
##$DTYPP= 0
##$F1P= 14.0000005364418
##$F2P= -0.99999901652339
##$FCOR= 0.5
##$FTSIZE= 32768
##$FT_mod= 6
##$GAMMA= 0
##$GB= 0
##$INTBC= 1
##$INTSCL= 1
##$ISEN= 128
##$LB= 0.3
##$LEV0= 0
##$LPBIN= 0
##$MAXI= 10000
##$MC2= 0
##$MEAN= 0
##$ME_mod= 0
##$MI= 0
##$NCOEF= 0
##$NC_proc= -3
##$NLEV= 6
##$NOISF1= 0
##$NOISF2= 0
##$NSP= 0
##$NTH_PI= 0
##$NZP= 0
##$OFFSET= 16.522
##$PC= 1
##$PHC0= 224.761
##$PHC1= 7.825819
##$PH_mod= 1
##$PKNL= yes
##$PPARMOD= 0
##$PSCAL= 4
##$PSIGN= 0
##$REVERSE= no
##$SF= 250.13
##$SI= 32768
##$SIGF1= 0
##$SIGF2= 0
##$SINO= 400
##$SIOLD= 32768
##$SREGLST= <1H.CDCl3>
##$SSB= 0
##$STSI= 32768
##$STSR= 0
##$SW_p= 5175.98343685301
##$SYMM= 0
##$S_DEV= 0
##$TDeff= 65536
##$TDoff= 0
##$TI= <Analysis number 999999
Compound Code 99
Book Reference 9
Project Code 9>
##$TILT= no
##$TM1= 0
##$TM2= 0
##$TOPLEV= 0
##$USERP1= <user>
##$USERP2= <user>
##$USERP3= <user>
##$USERP4= <user>
##$USERP5= <user>
##$WDW= 1
##$XDIM= 32768
##$YMAX_p= 419459588
##$YMIN_p= -61299
$$ End of Bruker specific parameters
$$ ---------------------------------
##NTUPLES= NMR SPECTRUM
##VAR_NAME=  FREQUENCY,     SPECTRUM/REAL,   SPECTRUM/IMAG
##SYMBOL=    X,             R,               I
##VAR_TYPE=  INDEPENDENT,   DEPENDENT,       DEPENDENT
##VAR_FORM=  AFFN,          ASDF,            ASDF
##VAR_DIM=   32768,         32768,           32768
##UNITS=     HZ,            ARBITRARY UNITS, ARBITRARY UNITS
##FACTOR=    0.157963299565203, 1,           1
##FIRST=     4132.6476996994, 0,             0
##LAST=      -1043.33573715361, 0,           0
##MIN=       -1043.33573715361, -61299,      0
##MAX=       4132.6476996994, 419459588,     0
$$ Real data points
##PAGE= N=1
##DATA TABLE= (X++(R..R)), XYDATA
$$ [...]
18634I3787R643j1175n091M669p71n820j95J2374J1941J5854M038J3677R477j604
18620A50804J169K7705L2535L9083J5382J2407Q874J8298K774j1739l2195m1395
18608B23702k7201p551k4426k4279j4533k0806j2385m756k859N353J9784m514
18596A05529j1438j9638j0052J1027K364p335J202p893l562n209J3399P379K163
18583G7936R216L117L860p711j662P686O625O327K31N100J2399P544N680J0853
18569A47201J2557J1095J2618K3911K2442J5920K2463K1748K5128N738Q00J1429
18557C33050K353l366j9712l2211k0019l0063k8550k6987j6204j15n094l797k808
18544A46477n043j606j2835l714n008p446j0276j2171j986J1106J0198J3287O762
$$ plain form
18634 93787 103430 92255 87164 91833 91062 85242 85047 97421 109362 125216 129254 142931 152408 150804
18620 150804 151973 179678 212213 251296 266678 279085 287959 306257 309031 297292 265097 223702
18608 223702 196501 188950 164524 140245 125712 104906 92521 87765 84906 90259 110043 105529
18596 105529 94091 74453 64401 75428 77792 70457 71659 63766 60204 54995 68394 75773 77936
18583 77936 87152 90269 94129 86418 84756 92442 99067 105394 105625 110725 123124 130668 136348 147201
18569 147201 159758 170853 183471 207382 229824 245744 268207 289955 315083 320821 321621 333050
18557 333050 335403 332037 312325 280114 260095 230032 201482 174495 158291 158176 153082 149285 146477
18544 146477 141434 139828 126993 123279 118271 110825 100549 88378 86392 97498 107696 120983 127745
18531A27745j4212r248j336l797j35N763j2524M325Q64K051J4637J4759j0928
18518A17964p171L252O131P710L044N026k759j3861P072k807r055Q688K2503r788
18504A35949o209L26p072m461J832m029M095q297j1807Q02j0980J84K246j1518
18490H1061K81R601j594J9240m394n962j695k584j719P721m71k576n579N199J0102
18475A06631j1308j1703R215L031l616m578L478K4673m987k2874l803m034N588
18462H5713m639m405J0406o761j1478M967P779P374R036K0781R336n120m074L418
18448A22333o568l175J1869K513n848l707J5273K0935N647m414K656j2424l007
18435A42083K5505J2117M19k86O984R840J0961Q011L446O464K0835L6453K5840
$$ plain form
18531 127745 113533 104285 102949 99152 99017 104780 92256 96581 97445 99496 114133 128892 117964
18518 117964 110793 114045 120176 127886 130930 135956 133197 119336 126408 123601 114546 123234 145737 135949
18504 135949 129740 130066 122994 118533 120365 116336 120431 112134 100327 101129 90149 90333 92579 81061
18490 81061 81342 90943 89349 108589 104195 98233 96538 93954 92235 99956 99485 96909 91330 96529 106631
18475 106631 95323 83620 92835 95866 92250 87672 91150 115823 110836 87962 84159 80125 85713
18462 85713 81074 76669 87075 80314 68836 73803 81582 88956 97992 118773 128109 122989 118915 122333
18448 122333 115765 112590 124459 126972 121124 117417 132690 153625 159272 154858 157514 145090 142083
18435 142083 167588 179705 180124 179838 186822 196662 207623 215634 219080 225544 246379 282832 308672
18422C08672M6237M5835K3458Q569q07k0868j7884j2780j8804l0986j3405p321
18410C09916J5427L975j799N564M738K9372L9471M1425L2435K8374K7790K2322
18398E59010P995k5429l6945m5444m6946k9141j8539j0457j7435p418q073j8520
18386C02658m21o218k26j9535n047O087J2598J8860l601n470N069N358j968j6256
18372B91888q212m683n673Q711j644L105J6713l266R58K915l680Q220P701J0878
18358C23931J1521O793r309r862P622O026j268o775J2022R740l03J76L666P422
18344C61402K947J95J634R879R422J011J1402J0513O970m756j9542m480J9253
18331D05850J5640L42L616O817N608J4916K1689O40K542M462K251R005n052M985
$$ plain form
18422 308672 354909 400744 424202 432771 431964 411096 393212 380432 361628 330642 317237 309916
18410 309916 325343 329318 327519 333083 337821 367193 406664 448089 480524 508898 536688 559010
18398 559010 567005 541576 504631 459187 412241 383100 364561 354104 336669 329251 321178 302658
18386 302658 302237 296019 295793 276258 271211 277298 289896 308756 305155 299685 304754 310112 308144 291888
18372 291888 283676 278993 273320 282031 280387 283492 300205 296939 297897 300812 297132 305352 313053 323931
18358 323931 335452 342245 332936 323074 330696 336722 335454 328679 340701 350441 350138 350314 353980 361402
18344 361402 364349 364544 366178 376057 385479 386490 397892 408405 415375 410619 391077 386597 405850
18331 405850 421490 421832 425448 432265 437873 452789 474478 475118 477660 482122 484373 493378 488326 493311
18317D93311J6013m673K581J6547K8524J7494K0762J5172J4494K0255Q894K6628
18305F76002L6467K8278L5170M6156N1529M7596O3950N9032M9788N6547O9673
18294A220188J02217J13831J16041J31499J71438K05281K55786L03232L63567
18285B983080M04608M54825N49165O38091P47837Q48222R46774J061384J190658
18276I824644J307693J362819J353573J358835J364210J451917J749586K349991
18268B2123268L314313M468985N373395O198895P438343Q385363P240809L340181
18260F7883552p56525k076928k042954l792947o403393o073358k706103P33840
18252D4765184L069976N031495O329282N384767J538532k683974m146222m132572
$$ plain form
18317 493311 509324 504651 507232 523779 552303 569797 590559 605731 620225 640480 649374 676002
18305 676002 712469 740747 775917 822073 873602 921198 985148 1044180 1093968 1150515 1220188
18294 1220188 1322405 1436236 1552277 1683776 1855214 2060495 2316281 2619513 2983080
18285 2983080 3387688 3842513 4391678 5029769 5777606 6625828 7572602 8633986 9824644
18276 9824644 11132337 12495156 13848729 15207564 16571774 18023691 19773277 22123268
18268 22123268 25437581 29906566 35279961 41478856 48917199 57302562 64543371 67883552
18260 67883552 67127027 65050099 63007145 59214198 52810805 46737447 44031344 44765184
18252 44765184 47835160 52866655 59195937 64580704 66119236 63435262 59289040 55156468
18244E5156468n959352r004200r576548p220327m514951k785369j863388j380731
18236A2851602j147505j016217r11971q85983q70179q20960p12161o23267n20247
18227E343112m26538l74382l45973l19566k95985k69727k34796k46293k44588
18218B585264k00433j84393j75813j21318r6288j07385p9653o7401p8610n7573
18208A416397m6938o7327n6068n0246o1369n5732n8166m9519m1302n3989k8710
18197H47031j3469j9541j6230j3837k6337l4066k4075k8791j2169j1087p520j8867
18185F21042k0997j4405j2239j0692m638R40J9376J388o109L209m576o489J004
18172E66814K1316L1615K7314J3299N745O033J7374J2791P927Q956K5921L9165
$$ plain form
18244 55156468 49197116 40192916 30616368 23396041 18881090 16095721 14232333 12851602
18236 12851602 11704097 10687880 9775909 8889926 8019747 7198787 6486626 5863359 5343112
18227 5343112 4916574 4542192 4196219 3876653 3580668 3310941 3076145 2829852 2585264
18218 2585264 2384831 2200438 2024625 1903307 1807019 1699634 1619981 1552580 1473970 1416397
18208 1416397 1369459 1302132 1246064 1195818 1134449 1078717 1020551 971032 929730 875741 847031
18197 847031 833562 814021 797791 783954 757617 723551 699476 670685 658516 647429 639909 621042
18185 621042 600045 585640 573401 562709 558071 559011 578387 579775 573666 576875 572299 565810 566814
18172 566814 588130 619745 647059 660358 666103 672136 689510 702301 710228 719184 745105 784270
18160G84270L9419N3159P1206R2006J05743J00802R6394O8661r39N10q730l1393
18148A371108k2258J1137N2574P6073R2843J31626J49400J37505J06486R0910
18138B197404R7642J10760J28231J47681K36989L37180M42316N24074O05267P11963
18128E539507Q16958R10014R89401J025447J050656J099573J202150J355822J552776
18119A5542304J805580K168393K542870K869470L507063M460658N131775M902302
18111D2930415L981401L228975L243520L422730J839379j478897n536856q467560
18103D3163107p513907n896264n504337m966046l692040k416848j586324j143850
18095A0443491r14524q02646p34386o46702n56368m90487m32375l84127l27096
$$ plain form
18160 784270 823689 876848 948054 1040060 1145803 1246605 1342999 1411660 1410721 1411231 1402501 1371108
18148 1371108 1348850 1359987 1412561 1488634 1581477 1713103 1862503 2000008 2106494 2197404
18138 2197404 2295046 2405806 2534037 2681718 2918707 3255887 3698203 4222277 4827544 5539507
18128 5539507 6356465 7266479 8255880 9281327 10331983 11431556 12633706 13989528 15542304
18119 15542304 17347884 19516277 22059147 24928617 28435680 32896338 38028113 42930415
18111 42930415 46911816 50140791 53384311 56807041 58646420 57167523 51630667 43163107
18103 43163107 35649200 29752936 24248599 19282553 15590513 13173665 11587341 10443491
18095 10443491 9528967 8726321 7991935 7345233 6788865 6298378 5866003 5481876 5154780
18086E154780k57429j81829j19168o7191j5490M9917J16579K24455L39074M28847
18076E672545N07157N97968P00927Q40490R43670R81172R90652R97931J057126
18067A3289638J173459J336344J647851K112177K720838L266469L795499M622835
18059C3965110N455864N457869L988011K034579J423085J830502J068770j760156
18051E3463634m760804n744847m862711m104985m747159n640124n201588l750415
18043A4651001k455407j618291j166867r17483p80183o92588o17237n64009n05914
18034E333022m70669m26306l74647l15107k93947k45837k17551k03894j85113
18025B599951j30160j06203r7583j29029j50292j44522j28958j36681j27256j22274
$$ plain form
18086 5154780 4897351 4715522 4596354 4529163 4513673 4563590 4680169 4904624 5243698 5672545
18076 5672545 6179702 6777670 7478597 8319087 9262757 10243929 11234581 12232512 13289638
18067 13289638 14463097 15799441 17447292 19559469 22280307 25546776 29342275 33965110
18059 33965110 39420974 44878843 48866854 50901433 52324518 54155020 55223790 53463634
18051 53463634 48702830 42957983 38095272 33990287 29243128 23603004 18401416 14651001
18043 14651001 12195594 10577303 9410436 8492953 7712770 7020182 6402945 5838936 5333022
18034 5333022 4862353 4436047 4061400 3746293 3452346 3206509 2988958 2785064 2599951
18025 2599951 2469791 2363588 2266005 2136976 1986684 1842162 1713204 1576523 1449267 1326993
18015A326993j18011r9120p9031o0235o2005n1748l3064l4868l8657m3461m2873
18004F63920l4992l6180k7799j3938l103r808j575p774j9972j2011j9770k7260
17992D49738p466q487k832o112j4892k0818R224K26n531j149R390J4992J7886
17979D34169L0391L1559Q070m238J4769K6393K4243J6143J1682J2039J1730n440
17967F11510k1421k2438k2809l6855l6294m7810m6320j2631K708m071J8841R275
17955C91685j6205k387P756l54k249R474Q048N81l795O647L773j0782q158N279
17941C89313R59j967O309j0602j1182n693k913j0268k397r204J3437n308j6904
17928C33580M778m094k777J2155l471j0453n389m684J1694n637l68L1189M48j5331
$$ plain form
18015 1326993 1208982 1109862 1030831 970596 908591 856843 823779 788911 750254 706793 663920
18004 663920 628928 592748 564949 551011 547908 538100 536525 528751 508779 496768 476998 449738
17992 449738 442272 433785 430953 424841 409949 389131 398355 398581 393050 391901 401291 416283 434169
17979 434169 464560 496119 504189 499951 514720 541113 565356 581499 593181 605220 616950 611510
17967 611510 590089 567651 544842 507987 471693 423883 377563 364932 367640 363569 382410 391685
17955 391685 375480 373093 380849 380495 378246 387720 395768 396349 392554 399201 402974 392192 384034 389313
17941 389313 390272 388305 394614 384012 372830 367137 364224 353956 351559 342355 355792 350484 333580
17928 333580 338358 334264 331487 343642 340171 329718 324329 319645 331339 325702 325334 356523 356971 341640
17914C41640j107K0104J6872R329J3796J3146R800J8188j0477K288J4853K0492
17902D68924K915p504K2670K3342J2421K4698K8609J5382K1212L9754K5536J6748
17890F94707K9850L0536J9522L3544M5587N6336O0951N4847N3735O9849Q7735
17879A237199Q9207R8072J43220J70922J93726K45802K75197L31200L94595M61382
17869C640522N05541N72162O38459P12029P91426Q73368R87475J078752J154566
17860A0954300J196481J182954J113862J117842J243138J627488K321467L348253
17852B4105785M563545N779317O824973P390106P085254N492581K660322p94058
17844F3107825m166792o579169p501066o917302n251118l369636j866925q53727
$$ plain form
17914 341640 340533 360637 377509 386838 400634 413780 423580 441768 431291 433579 448432 468924
17902 468924 471839 464335 487005 510347 522768 547466 576075 591457 612669 652423 677959 694707
17890 694707 724557 755093 774615 808159 853746 910082 971033 1025880 1079615 1149464 1237199
17879 1237199 1326406 1424478 1567698 1738620 1932346 2178148 2453345 2784545 3179140 3640522
17869 3640522 4146063 4718225 5356684 6068713 6860139 7733507 8720982 9799734 10954300
17860 10954300 12150781 13333735 14447597 15565439 16808577 18436065 20757532 24105785
17852 24105785 28669330 34448647 41273620 48663726 55748980 61241561 63901883 63107825
17844 63107825 58941033 52361864 44860798 37943496 32692378 29322742 27455817 26602090
17836B6602090j00803O66840J633885K821349M129912N348108O273722O584531
17828E3959634N833712L693210L97404l310676o621347q690818r143071q089820
17820B8028228o148136m191116k769062j904171j415919j145095r83308q86825
17812H584596p96627p09485o26196n39942m71350l95650l32293k80403k58977
17803D173673k55630k40037k25788k34963k48139k58924k41545k30914j99086
17794B038647j79706j49481j11289j03967r6756q2428o1088o0892n8542n1703
17784A082795l9976m0973k6830k6826k1137l6503m4296m5121l5908l0950j8223
17773G16052k2062k7946l3476k0612l080k920k3646k8703o813o87j5451l318j2146
$$ plain form
17836 26602090 26501287 27168127 28802012 31623361 35753273 41101381 47375103 53959634
17828 53959634 59793346 63486556 63883960 60573284 53951937 45261119 36118048 28028228
17820 28028228 21880092 17688976 14919914 13015743 11599824 10454729 9471421 8584596
17812 8584596 7787969 7078484 6452288 5912346 5440996 5045346 4713053 4432650 4173673
17803 4173673 3918043 3678006 3452218 3217255 2969116 2710192 2468647 2237733 2038647
17794 2038647 1858941 1709460 1598171 1494204 1397448 1315020 1253932 1193040 1134498 1082795
17784 1082795 1042819 1001846 975016 948190 927053 890550 846254 801133 765225 734275 716052
17773 716052 693990 666044 632568 611956 608876 605956 582310 553607 546794 546107 530656 527338 515192
17760E15192J951l592k326R854k081k183K3650K6462L7730N5525L1073L7507L1111
17747G59873J2337n658j020n046r53j4602j753L722N626K1375M7921N1628M4073
17734I17523K23j4198j3733k0896k1058k4965j8133j0573Q202K9129N2897N9622
17722I44040N8713P7398Q8842Q1068O9744Q1529J01464J30038J77323K59866L35048
17711B405073M03855M54066N32683N78096O27588O78697P31147P80391P72047
17702G963643P38779P25106O94232P76310J030069J532005K370579L357806M090931
17693B3279460M669452N418550N443494M278447J589744j781787l721954n361804
17685C3813602n922883m033314j315205Q67079K231204L095297L904279L982357
$$ plain form
17760 515192 517143 513551 511225 521079 518998 516815 540465 566927 604657 660182 691255 728762 759873
17747 759873 772210 766552 765532 760486 759533 744931 743178 746900 752526 773901 821822 873450 917523
17734 917523 917746 903548 889815 868919 847861 822896 804763 794190 802392 831521 884418 944040
17722 944040 1002753 1080151 1168993 1250061 1319805 1401334 1502798 1632836 1810159 2070025 2405073
17711 2405073 2808928 3262994 3795677 4373773 5001361 5680058 6411205 7191596 7963643
17702 7963643 8702422 9427528 10121760 10898070 11928139 13460144 15830723 19188529 23279460
17693 23279460 27948912 33367462 38810956 43089403 44679147 42897360 39175406 33813602
17685 33813602 27890719 23857405 22542200 23409279 25640483 28735780 32640059 36622416
17677C6622416K980860N52256k618713m389554n861162o595133n185834l204986
17669A2300150j917589j233419q49576o30741n26700m89775m33630l89439l25022
17660E504259k56999j90337j13747l4451L2512J23555K19066K98981L68171M38165
17650F389175M74715N13245M89960M83604M59059M61031N82546Q47653J319019
17641A2020007K013370K738553L239939L754753M226921L927816K671865J83177
17633C4776401k073707l337041m562849m251815k359803l46186J099435J926007
17625B0870442K598971L114472K883388J748657n61008k722788l847860n011924
17617A9072350m958608l497370k093284j279699q46860o19283m98185m50350m00844
$$ plain form
17677 36622416 39603276 40155532 37536819 33147265 27286103 20690970 15505136 12300150
17669 12300150 10382561 9149142 8299566 7668825 7142125 6652350 6218720 5829281 5504259
17660 5504259 5247260 5056923 4943176 4908725 4941237 5064792 5283858 5582839 5951010 6389175
17650 6389175 6863890 7377135 7867095 8350699 8809758 9270789 9853335 10700988 12020007
17641 12020007 14033377 16771930 20011869 23766622 27993543 31921359 34593224 34776401
17633 34776401 32702694 29365653 24802804 20550989 18191186 17845000 18944435 20870442
17625 20870442 23469413 26583885 29467273 31215930 30654922 27932134 24084274 19072350
17617 19072350 14113742 10616372 8523088 7243389 6396529 5777246 5279061 4828711 4427867
17608D427867l77448l37005k94147k77069k60360k54490k35244k08749j67775
17599B015580j44480j16669q7960p2699n5757m0631l9308m0976m8039o0314o3321
17588A245426p4963o1106o6409r0133r3226q4219n5386n4820o4762n9660l8618
17577E02124l9085k8044k2099k8967k4499k8578j7157j8574j2872K654j2657j6412
17565B55834p533k4312j6735j2764j7817o666j4481r694j4512j1635J1812K038
17553A33535K58J281q806L221p349r394P526J2888n466j2643Q28m244K22j166
17539A10691J9551L5262K7074R364j0957M785L3426J3292j3382k8835j3054q023
17527A79194k2119j1080j7430j2531m921k90k664R839J5592P579m092k272m624
$$ plain form
17608 4427867 4050419 3713414 3419267 3142198 2881838 2627348 2392104 2183355 2015580
17599 2015580 1871100 1754431 1666471 1593772 1538015 1497384 1458076 1417100 1369061 1308747 1245426
17588 1245426 1170463 1109357 1042948 952815 859589 775370 719984 665164 600402 540742 502124
17577 502124 463039 434995 412896 383929 359430 330852 313695 295121 282249 284903 272246 255834
17565 255834 248301 223989 207254 194490 176673 170007 155526 145832 131320 119685 131497 133535
17553 133535 133793 135074 126268 129489 122140 112746 120272 133160 127694 115051 115879 111635 111857 110691
17539 110691 130242 165504 192578 201942 190985 195770 229196 242488 229106 200271 187217 179194
17527 179194 157075 145995 128565 116034 111113 110823 108159 117998 133590 141169 137077 134805 130181
17514A30181j1625p586q714n007J3744j2016j9961m869P27j0338l660L76l174
17501E8078L45J3754j1071j9248r963J0480N876q788P839K3471J5811n842n625
17488G5117M799P284N665O771K1565K0047K1469J8573K0786J8126J7716K4038
17476B61956K4104J6997L895l335L425J2777Q691R633j071m233Q967k882K164
17463C41088j7037k1199k6134k2991k4422k2698k7046j5055q970j5802j7074j6466
17451A06194j6903j6176k0540P134M07Q305J9396J5142Q098j0726j814J4926k2255
17438I1188k9963j2634j2744j4710q886R592l753q183R933J7146m024l173K449
17425C2238J29m575l007M507O36l443R141J139j2865Q17J1254o46o795Q586L426
$$ plain form
17514 130181 118556 110970 102256 97249 110993 98977 79016 74147 74874 64536 60876 61252 58078
17501 58078 58423 72177 61106 41858 31895 42375 48251 39463 47302 70773 86584 80742 75117
17488 75117 79916 87200 92865 99636 121201 141248 162717 181290 202076 220202 237918 261956
17476 261956 286060 303057 306952 303617 307042 319819 328510 338143 337072 332839 341806 338924 341088
17463 341088 324051 302852 276718 253727 229305 206607 179561 164506 155536 139734 122660 106194
17451 106194 89291 73115 52575 59709 60116 68421 87817 102959 111057 100331 98517 113443 91188
17438 91188 61225 48591 35847 21137 12251 21843 18090 9907 19840 36986 32962 29789 32238
17425 32238 32367 27792 24785 29292 29928 26485 35626 36765 23900 24717 35971 35325 28530 37116 40542
17410D0542P451j979j2327p898j2307q171n48K4278m782O6M313o667q774n732
17396G465J1647K690j1267l182J3288J1750K348m969J404J480J7437L2391J4851
17383I7333o521L346J3638N099N194J0111K2083K7573J9819J9339K1706M0859
17371B79579M6412K6171n062k5020j6751j729n415l0014l6646j7081k5672j8543
17359A70229N842L420O378J350K0361J3101J9289K9144K2631J1007j8920k9090
17347B54742k144j430j4324l8482m1678l4367k2858j0996j3761o640N195n002
17335F8255j3396j5341N773J2092j653j4037j8755Q908N447j3671j830R991m477
17322B7306J407J3229J0518k878r09m011k1919p534J4832O412N276p714l683Q79
$$ plain form
17410 40542 47993 46014 33687 25789 13482 5311 4763 29041 24259 24325 28638 21971 13197 7465
17396 7465 19112 21802 10535 7353 20641 32391 34739 29770 31174 32654 50091 82482 97333
17383 97333 90812 94158 107796 112895 118089 128200 150283 177856 197675 217014 238720 279579
17371 279579 325991 352162 347100 322080 305329 303600 298185 268171 231525 214444 188772 170229
17359 170229 176071 179491 185869 187219 207580 220681 239970 269114 291745 302752 283832 254742
17347 254742 252598 251168 236844 198362 156684 122317 99459 88463 74702 68062 73257 68255
17335 68255 54859 39518 45291 57383 55730 41693 22938 31846 37293 23622 21792 31783 27306
17322 27306 28713 41942 52460 49582 48673 44662 22743 15209 30041 36453 41729 34015 30332 31211
17308C1211K579k281J3510P61q705k847l877p837k3790k845Q177m408Q303P618
17294A5569L439N91O876k578R507k824l502j285R069L114k321P205J0662J5234
17280F8756M46P026K690K292J4711K9842N192J4966J8058K6414L4569N0581K8024
17267C03567J9111N572j2624l1717l4045m0744k7656j8089p837p666n435k043
17255A40394R700J8303K5219K7143K6749L8181L0624K1402R012o268l0448m6850
17243B63161m7643m4607k6648j9384k9637j5858p332j4983j1216q611o219O493
17231C7516j667M770r561L59j2999m170L035j4017K938r94L135l729J077o172
17217d79R211O107n879j650j266k183J0009K169j3910L006j642J675p59p09l437
$$ plain form
17308 31211 33790 31509 45019 45780 37075 34228 30351 22514 -1276 -4121 4056 -352 7951 15569
17294 15569 19008 19599 26475 23897 33404 30580 27078 25793 34862 37976 35655 42860 53522 68756
17280 68756 69202 76228 78918 81210 95921 125763 130955 145921 163979 190393 224962 275543 303567
17267 303567 322678 328250 315626 283909 249864 209120 181464 163375 155538 147872 142437 140394
17255 140394 150094 168397 193616 220759 247508 285689 316313 337715 346727 340459 310011 263161
17243 263161 215518 170911 144263 124879 95242 79384 72052 57069 45853 37242 31023 37516
17231 37516 35849 40619 31058 31417 18418 14248 17283 3266 6204 5210 8345 4616 5693 -479
17217 -479 8732 14839 8960 7310 6044 3861 13870 16039 2129 5135 3493 5168 4409 3700 263
17202B63r226J0156J3556j491n176Q852Q731j2007J2153j482k594J1226Q700R551
17188E1212M26K412l134O494j0392n882J5469K4811K8227L4418L7558K8860J1348
17175B21827J681k0174j0452k1195k6826j1572P469k329J578R458K3144J4405
17163A87014P531k261l951j4669k3655l5453l0058j2139k982k2621j6512J0450
17151D0694L872j239j1452j2787j1032P332J6129j547j7699m365q395K241P215
17138H967L467J2927J2234j667n837R94J7386r662j0298J3492J6272K499M306
17125F5080L3830M0269L1553K4058J9093J7076k473l0149k4729j7738j7159j9003
17113A19708o04k371K3151L3890K0862J3626l931q563j4435k8327m1275k8224
$$ plain form
17202 263 -8963 1193 14749 13258 8082 16934 25665 13658 25811 24329 21735 32961 41661 51212
17188 51212 51638 54050 50916 57410 47018 41136 56605 81416 109643 144061 181619 210479 221827
17175 221827 223508 203334 192882 171687 144861 133289 140758 138429 140007 149465 172609 187014
17163 187014 194545 192284 188333 173664 150009 114556 84498 72359 69377 46756 30244 40694
17151 40694 44566 43327 31875 19088 8056 15388 31517 29970 12271 7906 -489 1752 8967
17138 8967 12434 25361 37595 35928 30091 31085 48471 38809 28511 42003 58275 60774 65080
17125 65080 98910 139179 170732 194790 213883 230959 228486 198337 173608 155870 138711 119708
17113 119708 119104 116733 139884 173774 194636 208262 204331 195768 181333 153006 111731 83507
17101H3507j7161l756q634L641j900m82k901j6903L926j0852k595J9132J4146
17088E9168j163l689j1304r469p973k71P193M031J866j5444j122Q555J498J8372
17074E0248L421j630l670j8611J306K0206J0091j1691j737J10q606q276j431L53
17060C0083k964K372P942N176J3802r302j2077j3000p252J0463M783J1342J301
17047D2669q284k129j526p707K534m548j0490j553N489j641Q129R465m548j160
17033B4700k924k7225j6312K6843R519l433M274r382j3258l78R579m567L300J0959
17019A1695O931k227k957j753R681m005o158M111J7620O783j521k494j34J5535
17005E1107Q090p19R80J751p776P669K31j6907n773p926J63N677J2924R200K302
$$ plain form
17101 83507 66346 62590 53956 57597 55697 55215 52314 35411 39337 28485 25890 45022 59168
17088 59168 58005 54316 43012 33543 25570 25299 32492 36523 38389 22945 21823 30378 31876 50248
17074 50248 53669 52039 48369 29758 31064 51270 61361 49670 47933 48043 39437 31161 29730 30083
17060 30083 27119 29491 37433 42609 56411 47109 35032 22032 14780 25243 30026 41368 42669
17047 42669 34385 32256 30730 23023 25557 21009 10519 8966 14455 12814 20943 30408 25860 24700
17033 24700 21776 -5449 -21761 5082 14601 11168 15442 6060 -7198 -7576 2003 -2564 736 11695
17019 11695 18626 16399 13442 11689 21370 17365 11207 15318 32938 39721 38200 35706 35572 51107
17005 51107 59197 58478 59458 61209 53433 61102 61333 44426 38653 30727 30890 36567 49491 58691 60993
16990F0993j6818m814K6206N000N34N35n668P16j8671j1462P443O660o332j276
16976D3046N404J4625J0397O888m756L818J3518l213L797O14r510M385L110K28
16962I2351J1154J1461n745m994j243K3468K5247J6598j0910R905k858m05P557
16949A71586K831q66K283M784k439j37J920J2519n501j2942j0831N047q897j003
16935A58354K932J0062K1549J1539j771j0747o192J150J5677J3478j645j10M071
16922B18347o698j93P088N996j9195m350q330m185R000J2831k49K889o027m173
16908B02751L81Q550q994n329J4577R016L420J0284J3871r600m925N095O090n741
16894B39446j3778J3255J8688Q480o401N58J3800J1447p417j576J7052R489J604
$$ plain form
16990 60993 44175 39361 65567 70567 71101 71636 65968 66684 48013 36551 43994 50654 44322 43046
16976 43046 48450 63075 73472 80360 75604 79422 92940 89727 93524 94138 84628 89013 92123 92351
16962 92351 103505 114966 109221 104227 102984 126452 151699 168297 157387 167292 164434 164029 171586
16949 171586 174417 173551 175834 180618 178179 178042 179962 192481 186980 174038 163207 168254 159357 158354
16935 158354 161286 171348 192897 204436 202665 191918 185726 186876 202553 216031 214386 214276 218347
16922 218347 211649 211456 218544 224540 205345 200995 192665 188480 197480 210311 210062 212951 206924 202751
16908 202751 203132 211682 202688 197359 211936 220952 224372 234656 248527 238927 234002 239097 245187 239446
16894 239446 225668 238923 257611 266091 259690 260248 274048 285495 278078 276502 293554 303043 304647
16881C04647R251J808j599J0538J6610J5069P370J2819O22J5552J5882l958P384
16868D11995L2037L3276M5760L6607L4170K1420K8356M0505M5118M7907L2091
16857H09242M8404O2047O4528O7804P1376J02098J42911J63587J93474K29140
16847A954611K79917L41923L95765M21133N14464O40782P25575P81338Q54383
16838F909891R56985J078793J167245J141118J040161R57425J001290J231179
16830A5484087J645351K267455L169107M115291M688675N059777N847561O589888
16822D8867192N885071K598186j599238k671119p36628O53459p64007m648386
16814D7584530p392203o572325m070241j890944l48452R32442K154456L138234
$$ plain form
16881 304647 313898 315706 314107 324645 341255 356324 363694 376513 377135 392687 408569 404611 411995
16868 411995 444032 477308 523068 559675 593845 615265 643621 684126 729244 777151 809242
16857 809242 857646 919693 984221 1052025 1123401 1225499 1368410 1531997 1725471 1954611
16847 1954611 2234528 2576451 2972216 3393349 3907813 4548595 5274170 6055508 6909891
16838 6909891 7866876 8945669 10112914 11254032 12294193 13251618 14252908 15484087
16830 15484087 17129438 19396893 22566000 26681291 31369966 36429743 42277304 48867192
16822 48867192 54752263 57350449 55751211 53080092 52343464 52996923 52232916 47584530
16814 47584530 40192327 33620002 29549761 27658817 27310365 28242807 30397263 33535497
16806C3535497L604686M025140M837197N204166L693738k01124l595081l392667
16798D7711552j359358q32715l181104o924149q307833o585137m233319k644462
16790A3643475j763730j232662r51192q13124p55233p44141o78382o14070n50922
16781E540019n26866m77776m13373l63818l18412k87791k58177k17369j98198
16772B478239j83403j66558j45537j38417j27293j32314j37510j37702r6492q9839
16762A123174r0854p6710o4611n0365m4782m3968l7938n6387m1072l1832k1000
16751E63655l2346l7929l9771j4090j7511k8090j8738p322j5460k9809j8685j3470
16739B90434j8394k951l283o004O932j1781j0600k0312k0441j5050j2255m114
$$ plain form
16806 33535497 37140183 41165323 46002520 51206686 54900424 54699300 51104219 47711552
16798 47711552 46352194 45519479 42338375 35414226 27106393 20521256 16287937 13643475
16790 13643475 11879745 10647083 9695891 8882767 8127534 7383393 6705011 6090941 5540019
16781 5540019 5013153 4535377 4122004 3758186 3439774 3151983 2893806 2676437 2478239
16772 2478239 2294836 2128278 1982741 1844324 1717031 1584717 1447207 1309505 1213013 1123174
16762 1123174 1032320 955610 890999 840634 795852 751884 713946 657559 616487 584655 563655
16751 563655 531309 493380 453609 439519 422008 393918 375180 367858 352398 322589 303904 290434
16739 290434 272040 269089 265806 259802 266734 254953 244353 224041 203600 188550 176295 172181
16727A72181j7968q985L196J824q338K598O360O32Q648p596j3149q567p478k910
16713A20448J5366K502l137m228r993q497k1688r77j0555j910J036j6124p69m353
16699E7121j399k821J1808j178k203j3521J0198j971J742P728j399L214M155q017
16685F3457j1271p856M61K140j2150j3047o025N155P535J2067m655k1836j0799
16672C176q479P534J3592J799L621J0542N509o272R158J976J320J1288j2398k6299
16658A6067J2870P756P92l852j3166O32J2110L175P100J0581j0350o479R65l770
16644C4431j2118O68L384Q317n881P370Q367n463K155L635k972j0423j6996j460
16630A3014O400R554l202J580o198p007M653N282J1013j3227q077p038J5280J5307
$$ plain form
16727 172181 154213 145228 148424 150248 141910 144508 150868 151500 160148 152552 139403 130836 123358 120448
16713 120448 135814 138316 135179 130951 120958 112461 90773 89796 79241 77331 78367 62243 61474 57121
16699 57121 55722 52901 64709 63531 61328 47807 58005 56034 57776 65504 64105 67319 71474 63457
16685 63457 52186 44330 44791 46931 34781 21734 15709 20864 28399 40466 35811 13975 3176
16672 3176 -5303 2231 15823 17622 21243 31785 37294 31022 40180 42156 43476 54764 42366 16067
16658 16067 28937 36693 37485 33633 20467 21099 33209 36384 43484 54065 43715 37236 38201 34431
16644 34431 22313 22981 26365 34682 28801 36171 44538 39075 41230 44865 41893 31470 14474 13014
16630 13014 19414 28968 25766 27346 21148 14141 18794 24076 35089 21862 13785 6747 22027 37334
16616C7334m862o825j0792k7p217j3094j591O408k537L44M732l222J4963n024
16602H590J0058O543J039J1723J3114p471j3769q510p471K348J702q098J739O000
16588A7537n931k894j0689p57m103j4350J312P750O610k708k518m564J81J3541
16574a583J6300L736N322o698j6849j2150R654M129r112r784j7321j787R551K2060
16560d532R041r382o094o538p3Q459K82R630o250J712O228l909P997O498j6553
16545c484m998k46o098N925q975p390R785K131p818K1108J8770k570j892m899
16531I349m212j16j260q102m317o657K873J8658r11r388j0130L335m851J7006
16517A277m676j0434Q65Q863Q425O684r592J6847j482r293R51j259j0685K815
$$ plain form
16616 37334 32472 25647 14855 14828 7611 -5483 -7074 -666 -3203 -2859 1873 -1349 13614 8590
16602 8590 18648 25191 26230 37953 51067 43596 29827 21317 13846 16194 17896 9798 11537 17537
16588 17537 11606 8712 -1977 -2734 -6837 -21187 -19875 -12125 -5515 -8223 -10741 -15305 -15124 -1583
16574 -1583 14717 18453 23775 17077 228 -11922 -2268 1861 -7251 -17035 -34356 -36143 -26592 -4532
16560 -4532 4509 -4873 -10967 -17505 -17578 -9119 -8837 793 -5457 -3745 2483 -1426 6571 13069 -3484
16545 -3484 -8482 -8728 -14826 -8901 -17876 -25266 -15481 -13350 -21168 -60 18710 16140 14248 9349
16531 9349 5137 5021 3761 -4341 -8658 -15315 -12442 6216 5305 -4083 -14213 -10878 -15729 1277
16517 1277 -3399 -13833 -12968 -4105 4320 11004 1412 18259 16777 7484 8435 7176 -3509 -694
16503f94P944L78o580K606q660n837k403j426K455O685P644J0760j379m211M072
16488A1354N120R969r13j8410k162j5419L364K016M37K673J420q968N560R191
16474E232M863m235j5452j972J543j2663J0108J4254j9023r296J4100Q194L132
16461a215K0702J4816K703j4443k399L614M542M38p407j5785j723j989q334P268
16447G88J0925L648n734l705k3146j346J2569m237o007J4986M176j5662m876M478
16433a3143M579K256o548n889J181Q520R869J0028P173q319l598N526j0703k922
16419a990o089n719J3296R357l67k081m726J821J664Q805q346j9636o919J1348
16405i582J569m614j3640j3579L381K903P819K582j1736J815J1663J6163O983
$$ plain form
16503 -694 7250 7628 1048 3654 -5006 -10843 -13246 -14672 -12217 -5532 2112 12872 11493 7282 11354
16488 11354 16474 26443 25530 7120 4958 -10461 -7097 -5081 -4644 -1971 -551 -9519 -3959 5232
16474 5232 10095 5860 -9592 -11564 -10021 -22684 -12576 1678 -17345 -26641 -12541 -4347 -1215
16461 -1215 19487 34303 37006 22563 20164 23778 28320 28758 21351 5566 3843 1854 -6480 788
16447 788 11713 15361 9627 5922 -17224 -18570 -6001 -10238 -16245 -1259 2917 -12745 -17621 -13143
16433 -13143 -8564 -6308 -12856 -18745 -17564 -9044 825 10853 18026 9707 6109 11635 932 -1990
16419 -1990 -8079 -13798 -502 8855 8488 6407 1681 3502 5166 13971 5625 -14011 -20930 -9582
16405 -9582 -8013 -12627 -26267 -39846 -36465 -33562 -25743 -23161 -34897 -33082 -21419 -5256 1727
16392A727N990n705j7243r964o909K17K343Q304Q585j1539j1238j715L099Q112
16378b5936J0881O959P49L316P578j1948L241O252o898M898K462n941o899j643
16364a2929O515j359l752J338K2041R367j9369k0991K291J1358o05q992o034K607
16350a8514j3583q60J0992K377j1935O443L2129K118m481q602j0929J049p4l43
16336a4213R622L946o096n096n709l344o721L248k62n201j602R570J86j0006J1417
16321b0261No507K795R763J1371K934j4196K889l6k442j495P013L513J81J11R61
16305c401J0630J3025r925r859j8264q708K939J2546J9709j0240j2305Q522O408
16292A077k198j0850M072M200K768J8261J3313j109p37l925l742l77K5783l820
$$ plain form
16392 1727 7717 2012 -15231 -25195 -32104 -31887 -29544 -21240 -12655 -24194 -35432 -37147 -34048 -25936
16378 -25936 -15055 -8096 -7347 -4031 3547 -8401 -5160 1092 -5806 -908 1554 -4387 -11286 -12929
16364 -12929 -6414 -7773 -11525 -10187 11854 21221 1852 -19139 -16848 -5490 -6095 -15087 -21121 -18514
16350 -18514 -32097 -32957 -21965 -19588 -31523 -25080 7049 9167 4686 -3916 -14845 -13796 -13870 -14213
16336 -14213 -4591 -645 -6741 -11837 -17546 -20890 -27611 -24363 -24625 -29826 -31428 -21858 -21672 -31678 -20261
16321 -20261 -20256 -26763 -23968 -14205 -2834 100 -14096 -11207 -11243 -13685 -15180 -8167 -4654 -4473 -4362 -3401
16305 -3401 7229 20254 10329 470 -17794 -26502 -23563 -11017 8692 -1548 -13853 -5331 1077
16292 1077 -1121 -11971 -7899 -3699 -931 17330 30643 29534 28797 24872 21130 20753 46536 42716
16278D2716l36J4976j731M334J2839J3750K3755L7614K4279K9187M3288M0841
16266B85512K1278j1529j7800k792n4j2947k6652m2363j9761j4050j9493j9246
16254A20103L294K690J6763K5139K8786J9291K9844K0392k557n245j7634O78r876
16241B31668j2357k6699k8256l0599l6745l7054q220k1304m657L284k17N75o665
16228B2754j1626k853P932Q496p869j1508o566n487m360K308L808M416J406N913
16214F764p157K91j667k04K963N683q48k991k0289l997J7315M048q854n423M450
16199i916j104J335N946P439p713p783l77j5961j2685J900O874J8846l05Q816
16185d688Q691K72k0561j623P827J553R960J2856M557o266r702j1147j914j677
$$ plain form
16278 42716 42380 57356 55625 59959 72798 86548 110303 147917 172196 201383 244671 285512
16266 285512 306790 295261 277461 274669 274615 261668 235016 192653 172892 158842 139349 120103
16254 120103 123397 126087 142850 167989 196775 216066 245910 266302 263745 258500 240866 241544 231668
16241 231668 219311 192612 164356 133757 97012 59958 51738 30434 25777 29061 28844 29419 22754
16228 22754 11128 8275 16207 24703 16834 5326 -1240 -6727 -11087 -8779 -4971 -555 851 6764
16214 6764 -393 -102 -1769 -1973 990 6673 5825 2834 -17455 -21452 -4137 -89 -8943 -14366 -9916
16199 -9916 -11020 -9685 -3739 3700 -4013 -11796 -12173 -28134 -40819 -38919 -32045 -13199 -13504 -4688
16185 -4688 4003 4275 -16286 -17909 -10082 -8529 1431 14287 18844 12578 2876 -8271 -10185 -11862
16171a1862J2913L9j0893r234R10j982j0515o260J1892R740P62p12j1812p40J707
16156b6047J1263O595R85j1384j0677q080M419M682J1684R769L716m397l426j2927
16142b3825j1738J0341M448M4J209J4973K347j337l420p951n248k899K276Q255
16128a2525k015j2947r36P722O186R373l264L236J2113o846j9644p016J252k229
16114b7540J0486J2954N032j1197J1750q007j655N225n317o557L320L029P688
16101g89l15j766j72k1253j2862P096L888o807O06j435K0988J4494j0261N220
16087c368M8j123K169n320j0689o61m27j218O986k330N209q748j0231m509n71
16072c4783Q666j3772p120J0399J4685l481p139J580L821k310n28K0512R617r641
$$ plain form
16171 -11862 1051 1090 -9803 -19037 -18127 -20109 -30624 -36884 -24992 -15252 -14490 -15202 -27014 -27754 -26047
16156 -26047 -14784 -8189 -7204 -18588 -29265 -37345 -32926 -28244 -16560 -6791 -3075 -7472 -10898 -23825
16142 -23825 -35563 -25222 -20774 -20730 -19521 -4548 -2201 -3538 -6958 -14909 -20157 -23056 -20780 -12525
16128 -12525 -14540 -27487 -28423 -20701 -14515 -5142 -8406 -5170 6943 97 -19547 -26563 -25311 -27540
16114 -27540 -17054 -4100 932 -10265 1485 -6522 -8177 -2952 -8269 -14826 -11506 -8477 -789
16101 -789 -1104 -2870 -3042 -24295 -37157 -30061 -26173 -32980 -32374 -33809 -12821 1673 -8588 -3368
16087 -3368 -3320 -4443 -2274 -7594 -18283 -18944 -19371 -20589 -13603 -15933 -10724 -19472 -29703 -34212 -34783
16072 -34783 -26117 -39889 -47009 -36610 -21925 -25406 -32545 -30965 -27144 -29454 -29982 -9470 147 -9494
16058i494j438Q025K044p008k991O537n574j5275j645J868O506P760Q454M010
16044A779K758k167L874L825n564l403O4j3893p41R931J0640J765m87o329J042
16029C094o427j4374K228L637L127M083o626P29O536j287q092j407j0700J3315
16015a2164P411N106p36q094n086N261j075o438m090j4692q29J0688Q060J9937
16001C259N836j5061P019L199q798p717J664M909N305N918k228j5182O03J646
15987i628q936q807p240N81J4127N544j1078K971L016n05j221J467L1541K1003
15973C2835K444j5427j2161n712J300n677m416r137K897l587p797N663J4274O093
15959A592j0565p084k765N815m309j0000O51R752O714l005n858M258J0803j132
$$ plain form
16058 -9494 -10932 -2907 -863 -7871 -10862 -4325 -9899 -25174 -26819 -24951 -18445 -10685 -2231 1779
16044 1779 4537 2370 6244 10069 4505 1102 1166 -12727 -13468 -3537 7103 8868 8381 2052 3094
16029 3094 -3333 -17707 -15479 -11842 -8715 -4632 -11258 -10529 -3993 -5280 -13372 -14779 -25479 -12164
16015 -12164 -4753 353 -383 -8477 -13563 -8302 -9377 -15815 -19905 -34597 -35426 -24738 -16678 3259
16001 3259 9095 -5966 1053 4252 -4546 -12263 -10599 -5690 -385 5533 3305 -11877 -11274 -9628
15987 -9628 -18564 -27371 -34611 -34030 -19903 -14359 -25437 -22466 -19450 -19955 -21176 -19709 11832 32835
15973 32835 35279 19852 7691 1979 3279 -2398 -6814 -15951 -13054 -16641 -24438 -18775 -4501 1592
15959 1592 -8973 -16057 -18822 -13007 -17316 -27316 -26665 -16913 -10199 -13204 -19062 -14804 -4001 -5133
15945e133q547Q090J1657j2456j3526J142m618P444O901R72k011L484N812J0911
15931A0122L459p285l922m029o600Q93k188J418o296l484J5910l465J0344L264
15917H141r725j1662k3794q022J5294Q868J154O459P908k197N701m135j436P361
15903h5l592N617M630q145n526j1469j2803M877Q082Q381Q270m839M212K449K32
15888B91j953r414Q016J5361o975j9862j03J404r945j4263j771J8396L672M136
15874a3010M06p123J0656j2314n43J197k654J0438o610n177M708J0462J2948j2888
15860i504n226R170n512M31J030K859m268j4829n030o77K79J1514p261J4901J1847
15845b76m141m263N48M626o77n520o137k509L43l848K923R070R607R84J1762r051
$$ plain form
15945 -5133 -13680 -5590 6067 -6389 -19915 -18773 -23391 -15947 -9046 -8074 -10085 -6601 -789 10122
15931 10122 13581 6296 2374 -1655 -8255 -7362 -9550 -8132 -14428 -17912 -2002 -5467 4877 8141
15917 8141 -1584 -13246 -37040 -45062 -29768 -20900 -19746 -13287 -5379 -7576 -1875 -6010 -7446 -85
15903 -85 -3677 1940 6570 -1575 -7101 -18570 -31373 -26496 -18414 -10033 -1763 -6602 -2390 59 291
15888 291 -1662 -11076 -3060 12301 5326 -14536 -14639 -13235 -23180 -37443 -39214 -20818 -17146 -13010
15874 -13010 -12604 -19727 -9071 -21385 -21928 -20731 -23385 -12947 -19557 -24734 -20026 -9564 3384 -9504
15860 -9504 -14730 -5560 -11072 -10641 -9611 -6752 -11020 -25849 -30879 -31556 -31277 -19763 -27024 -12123 -276
15845 -276 -4417 -8680 -8132 -3506 -4183 -9703 -15840 -18349 -18006 -21854 -18931 -9861 -254 730 12492 3441
15829C441j1000L781r578p293J0580O022q07K365p799q274K677n596P20K136N065
15814a3560J581o027P686N405j0143M745J4678R442j2955j2844o6M140P634O056
15800E772r554j946R661m398m346q267j4511Q869N176J073p176l70p723p928Q798
15785b6870J8074N266O806P788j849j0989j6786J963J773l340L584l569l910J0131
15771a1928P669m50k610L764m228J876K792n105l273M053J245j819j1740m456
15757b4210J0273O748m163j4017j8002K1500J8940p162j0824k1436J2677K6852
15745b824l5j2169k164P822L937k23k2433P068R098L035j492j573l846O118k631
15730a2312j0726L404O113O080J3278o37k0843O942P976j143R147j357J525q038
$$ plain form
15829 3441 -7559 -3778 -13356 -20649 -10069 -4047 -4854 -2489 -10288 -18562 -15885 -21481 -20761 -18625 -13560
15814 -13560 -11979 -18006 -10320 -4915 -15058 -10313 4365 13807 852 -11992 -12058 -7918 -284 5772
15800 5772 -3782 -5728 3933 -465 -4811 -13078 -27589 -18720 -13544 -12471 -19647 -20017 -27740 -35668 -26870
15785 -26870 -8796 -3530 3276 11064 9215 -1774 -18560 -16597 -14824 -18164 -14580 -18149 -22059 -11928
15771 -11928 -4259 -4709 -7319 -3555 -7783 -5907 -3115 -8220 -11493 -7440 -6195 -8014 -19754 -24210
15757 -24210 -13937 -7189 -11352 -25369 -43371 -21871 -2931 -10093 -20917 -42353 -29676 -2824
15745 -2824 -2859 -15028 -17192 -9370 -5433 -5656 -28089 -21021 -11923 -8888 -10380 -11953 -15799 -9681 -12312
15730 -12312 -23038 -19634 -13521 -7441 5837 5200 -15643 -8701 -725 -1868 7279 5922 7447 -591
15716e91j970J538j1044o780m457q215R931N798R175Q456p831m510K972j510j0718
15701a9756m344o727J4441J5550R768j1629j0002O567R135p392l455n544K820
15688a0568O058o999P807n697Q24j070m458p8Q744n636n758R801L351o099l098
15673a2876R96K299N4l093J0415M778n724J0438K038k409p938m491l074q70N252
15658d205K482o919j2643N973O193M865K054o742p269k157N989j550k850O078
15644a0701J2581M978k1232l077L505M549P161M020k2554m475L541P175N182p584
15630a6931N977J6610o850j6394O614O453L903L057p773j0897M468q34k667l75
15616a5639r836Q512Q669p211L567J029l627j5849P138M778m808L33J4733R586
$$ plain form
15716 -591 -2561 -1023 -12067 -18847 -23304 -31519 -21588 -15790 -6615 1841 -5990 -10500 -7528 -9038 -19756
15701 -19756 -24100 -30827 -16386 -836 8932 -2697 -12699 -6132 3003 -4389 -7844 -13388 -10568
15688 -10568 -4510 -11509 -3702 -9399 -8575 -9645 -14103 -14181 -5437 -11073 -16831 -7030 -3679 -9778 -12876
15673 -12876 -11880 -9581 -9527 -12620 -2205 2573 -3151 7287 9325 6916 -1022 -5513 -8587 -9457 -4205
15658 -4205 -1723 -8642 -21285 -15312 -9119 -4254 -2200 -8942 -16211 -18368 -12379 -13929 -16779 -10701
15644 -10701 1880 6858 -14374 -17451 -13946 -9397 -2236 1784 -20770 -25245 -21704 -14529 -9347 -16931
15630 -16931 -10954 5656 -1194 -17588 -10974 -4521 -618 2439 -5334 -16231 -11763 -12597 -15264 -15639
15616 -15639 -25475 -16963 -8294 -15505 -11938 -10909 -14536 -30385 -23247 -18469 -23277 -22944 -8211 1375
15602A375j839j0935j3550k737N90j0049J0202L567L989k327Q988k623k756k859
15588b0964J0338R67q758p884l19J2488K573K166L286J4895N034j691m413O849
15574A4567r100j7645o004J395k410N489J7912R303j6459j6328Q398L41j4906
15561b5447q91O492N366K2499k71k4153j4268Q057J0978L066J0878k016r373k688
15547a1771j045p235P84L028Q545k185l737N707L744J0720O31O103m119p156j1438
15532i424j0812L143J0983P233K178N835r455j3055P703R169r611o673m871P014
15518a0643O179q083R910M808o169n072j1866J3161O912j212k6115m399J6158
15505a6431J7796j380J763L641j0433j0483j8903n887M496J0943L047j888p565
$$ plain form
15602 1375 -464 -11399 -24949 -27686 -27096 -37145 -26943 -23376 -19387 -21714 -12726 -15349 -18105 -20964
15588 -20964 -10626 -9659 -18417 -26301 -26620 -14132 -11559 -9393 -6107 8788 13822 12131 7718 14567
15574 14567 5467 -12178 -18182 -16787 -19197 -13708 4204 13507 -2952 -19280 -10882 -10541 -25447
15561 -25447 -26338 -19846 -14480 8019 7748 -16405 -30673 -22616 -11638 -8572 2306 290 -9083 -11771
15547 -11771 -12816 -20051 -19267 -16239 -7694 -9879 -13616 -7909 -4165 6555 7186 13289 9170 2014 -9424
15532 -9424 -20236 -17093 -6110 1123 3301 9136 -319 -13374 -5671 3498 -6113 -12786 -17657 -10643
15518 -10643 -4464 -12547 -2637 2171 -3998 -9070 -20936 -7775 -863 -2075 -28190 -32589 -16431
15505 -16431 1365 -15 1748 5389 -5044 -15527 -34430 -40317 -35821 -24878 -21831 -23719 -31284
15492c1284n101J824J567J1249N449p842r347L502m277k609J0303N527m917j132
15478b7088N159P301o42O213p818m60J3970J4105l350j0451L092K906k118l643
15464b824j765n279J55q018P128j523j337m617K756J3079L328J3699j754K546
15450A5574k286l652P448K164j2534M897m335j1746p219K254M556N944m218j1684
15436a4837j094j0864p430J1957j331m965M214L848K247J0497K6005j750o408
15423A0089j3567r153j2339k044J5085N807p383k43N149M038k612P362K576O732
15409I497R344L82p698L625k929p934o270p003j844J5099m051k734m229m343M060
15394g028P623j1176k2479j2831O208N578O178K965K511n016M248N943p515o840
$$ plain form
15492 -31284 -36385 -34561 -32994 -21745 -16296 -24138 -33485 -29983 -34260 -36869 -26566 -21039 -25956 -27088
15478 -27088 -21929 -14628 -15270 -9057 -16875 -17335 -3365 10740 7390 -3061 31 2937 819 -2824
15464 -2824 -4589 -9868 -9713 -17731 -10603 -12126 -13463 -18080 -15324 -2245 1083 14782 13028 15574
15450 15574 13288 9636 17084 19248 6714 11611 7276 -4470 -11689 -9435 -4879 1065 -3153 -14837
15436 -14837 -15931 -26795 -34225 -22268 -23599 -28564 -24350 -20502 -18255 -7758 18247 16497 10089
15423 10089 -3478 -12631 -24970 -27014 -11929 -6122 -13505 -13748 -8599 -4561 -7173 189 2765 9497
15409 9497 18841 19223 11525 15150 12221 4287 -1983 -8986 -10830 4269 218 -2516 -6745 -11088 -7028
15394 -7028 595 -10581 -33060 -45891 -39683 -34105 -27927 -24962 -22451 -27467 -23219 -17276 -24791 -31631
15380c1631N698n16R28L209J2403n311J84L675M263j0971K427P90q271L831j153
15365b0445O04k9K302L573p551J8776Q415j8315j5547L33k996K7539N494K37O916
15350I306r28j0637Q693J1904j5788j4490L19m063l411J1386Q748p544p079J6784
15336C200L12J7q847j5771n349J381PK399R895O518K80q437q64P291n580J4522
15320I74R980r898M524P317J356n669k673P91K499j0755j2204j291J720K82O236
15305f811K795N40K478O592J62n199K196N195k1424r992L259J405J6396j301j800
15290e509K305m062j3654R00L133M155J0378M055O255Q55k737p941J092r014j094
15275a0883o797q015N560J0903P67O308J5141km296o253k843M14Q834j771o577
$$ plain form
15380 -31631 -25933 -26449 -25521 -22312 -9909 -15220 -15036 -11361 -7098 -18069 -15642 -14852 -23123 -19292 -20445
15365 -20445 -19841 -19870 -17568 -13995 -21546 -2770 5645 -12670 -28217 -27884 -30880 -3341 2153 2390 9306
15350 9306 8378 -2259 6434 18338 2550 -11940 -11621 -15684 -19095 -7709 1039 -6505 -13584 3200
15336 3200 3512 3529 -5318 -21089 -26438 -25057 -25050 -22651 -12756 -6238 -5958 -14395 -15259 -7968 -13548 974
15320 974 10954 1056 5580 12897 14253 8584 5911 6702 9201 -1554 -13758 -15049 -13329 -13047 -6811
15305 -6811 -4016 -3476 -998 5594 5756 557 2753 7948 -13476 -23468 -20209 -18804 -2408 -3709 -5509
15290 -5509 -3204 -7266 -20920 -20020 -16887 -12732 -2354 1701 7956 8811 6074 -1867 -775 -9789 -10883
15275 -10883 -17680 -25695 -20135 -9232 -8465 -2157 12984 12982 8686 2433 -410 4 8838 7067 490
15260D90Q591m20j7438j75q19K152j3794J0221J2222p7M84j0017m424m184O84
15245a6504p320N26N072P980O362J746J0061n476r212l378l453j598o296L537
15231a7953O740O016R715M862K889J14K042L355j503n401N031l694j5080j206
15217d073l347n713j5836P464J2459j213O481l008p698J847N297L970O655r591
15203f306K964J5817J5996M107r865j3337k741M568l253K224N24j0070n775Q433
15189C286j290q406k42J2102Q682k917o408j510p40j4936k94p862k371J6879J1564
15174E537q538o718Q986r253L02N093N671o908l613n49Q458L387j0574j1895k620
15159b3234r4m686K918K761L281N643m515j787J051k1875m130P576N490l62m655
$$ plain form
15260 490 9081 8661 -8777 -8952 -9771 -7619 -21413 -11192 1030 953 1437 -8580 -13004 -17188 -16504
15245 -16504 -23824 -23298 -18226 -10246 -3884 -2138 7923 2447 -6765 -10143 -13596 -15194 -21490 -17953
15231 -17953 -11213 -5197 4518 9380 12269 12383 14425 17780 16277 10876 15907 12213 -2867 -4073
15217 -4073 -7420 -13133 -28969 -21505 -9046 -10259 -3778 -6786 -14484 -12637 -7340 -3370 3285 -6306
15203 -6306 -3342 12475 28471 32578 22713 9376 6635 11203 7950 10174 10698 628 -5147 3286
15189 3286 1996 -6410 -6652 5450 14132 11215 4807 3297 2557 -12379 -12673 -20535 -22906 -6027 5537
15174 5537 -3001 -9719 -733 -9986 -9684 -4591 1080 -5828 -9441 -9990 -1532 1855 -8719 -20614 -23234
15159 -23234 -23328 -28014 -25096 -22335 -19054 -13411 -17926 -19713 -18662 -40537 -44667 -37091 -31601 -31963 -36618
15144c6618M156J9900J1214m778r014M081N402k568L286m225p988r864N428J4475
15130g113L700J107j9908l711L909r43j167k467J993J901m176J8062K848K62l088
15115h791J3596O994j2187J36K484R175k916j2490j6780R238L471Q901J1951J013
15101A3795j7601j4122J348R548p956K87l457J5202m55l558r386J951M795K890
15087f719N471J1017O680n748j3224n805k420J0350J6133o417j8802j4852O317
15074a8019k320k417J3656J3226k435L764Q253p883k839k811p56l470k444j6900
15060b3395Q073R903J522j6j94p863Q769J3507L903j71k183j9872j3189j5930
15046c7136M418J5011J1932R062Q950q859o050o254k127R772j79o045L323R225
$$ plain form
15144 -36618 -32462 -12562 -1348 -6126 -15140 -11059 -5657 -8225 -4939 -9164 -17152 -27016 -21588 -7113
15130 -7113 -3413 -2306 -22214 -25925 -22016 -22959 -24126 -26593 -24600 -22699 -26875 -8813 -5965 -5703 -8791
15115 -8791 4805 11799 -388 -252 2232 11407 8491 -3999 -20779 -11541 -8070 831 12782 13795
15101 13795 -3806 -17928 -16580 -7032 -14988 -14701 -18158 -2956 -3411 -6969 -16355 -14404 -9609 -6719
15087 -6719 -1248 9769 16449 10701 -2523 -8328 -10748 -398 15735 9318 -9484 -24336 -18019
15074 -18019 -20339 -22756 -9100 4126 1691 5455 13708 5825 2986 175 -581 -4051 -6495 -23395
15060 -23395 -15322 -5419 -3897 -3913 -4107 -11970 -3201 10306 14209 14038 11855 -8017 -21206 -37136
15046 -37136 -32718 -17707 -5775 3287 12237 3378 -2672 -8926 -11053 -1281 -1460 -7505 -4182 5043
15032E043q411J1323M87j7765j2175p85J3364n726j7076m952k273Q931R772O971
15018a3272O180j543P084O220J3919l462l560q29j0876L959k525l504m099j943
15004h251J822q098J1699K323k302N193m059o146j2228j820L422M21J3679Q639
14990D294Q029k2010j0135K148n72J319L021J2523k052j4102K833J7674R726K796
14976A5492j1995L573K037m330M567Q263j721J488o102N663j1846k1307j0833
14963b7051J166O055J5337J1614k00J25o926j5733l991J10r287J813j006P843
14949b0131M702m577J2023Q090j0775r051Q458K2404P523j205m610m954R522q482
14935H937j7618N21k993K879J6161l521l243k176j2559j561K829O474J1449j6158
$$ plain form
15032 5043 -3368 7955 8442 -9323 -21498 -22283 -8919 -14645 -31721 -36673 -38946 -30015 -20243 -13272
15018 -13272 -7092 -8635 -1551 4669 18588 15126 11566 10737 -139 3820 1295 -2209 -6308 -8251
15004 -8251 -6429 -14527 -2828 -505 -2807 2386 -1673 -7819 -20047 -21867 -18445 -18024 -4345 4294
14990 4294 12323 -9687 -19822 -17674 -18246 -16927 -13906 -1383 -3435 -17537 -14704 2970 12696 15492
14976 15492 3497 7070 9107 4777 9344 17607 15886 17374 11272 16935 5089 -16218 -27051
14963 -27051 -25885 -19830 -4493 7121 6921 7046 120 -15613 -19604 -19494 -28781 -26968 -27974 -20131
14949 -20131 -15429 -20006 -7983 107 -10668 -19719 -11261 11143 18666 17461 12851 7897 17419 8937
14935 8937 -8681 -8160 -11153 -8274 7887 4366 1123 -1053 -13612 -15173 -12344 -5870 5579 -10579
14921a0579m955j0717k4305j0743J7156K2176J0491K823k092k806l83M177J950
14908g807l462J207K193P664K253K707k492j434k002Q277J80N130j0792M57j1143
14893i064K35J5495J0911P195k681r814j2309j2377n990N855j94P495J1192M826
14879A0775j1983k127q346L615J4768j257o957k480N616O880Q696j4111n680j431
14865d022M390N161M869N230M332n054K928p726j2672M262J0102m44n469q309
14851b422L189L785k456k519j372m849K506Q71K994r38j788j0573k517k551j548
14836b0188P216j0897K946R388M258q568m836J0949K0040k440k1389r46j871k748
14822a9086L227L758q101j4300N957J3968L695J102r36N853L976k349J041l709
$$ plain form
14921 -10579 -15534 -26251 -50556 -61299 -44143 -21967 -11476 -8653 -10745 -13551 -13934 -9757 -7807
14908 -7807 -11269 -10062 -7869 -205 2048 4755 2263 829 -1173 7104 7284 12414 1622 2079 -9064
14893 -9064 -8829 6666 17577 24772 22091 12277 -32 -12409 -18399 -12544 -12738 -5243 5949 10775
14879 10775 -1208 -3335 -11681 -8066 6702 5445 -1512 -3992 1624 8504 17200 3089 -2591 -4022
14865 -4022 368 5529 10398 15628 19960 14906 17834 10108 -2564 1698 11800 11356 5887 -2422
14851 -2422 767 4552 2096 -423 -1795 -6644 -4138 -3267 -273 -1211 -2999 -13572 -16089 -18640 -20188
14836 -20188 -12972 -23869 -20923 -11535 -7277 -15845 -20681 -9732 10308 7868 -13521 -14467 -16338 -19086
14822 -19086 -15859 -12101 -20202 -34502 -28545 -14577 -10882 -9780 -10716 -4863 -887 -3236 -2195 -5904
14808e904L568o011j0066J796j0748M13J729J1332J3699K930j2009k531J8565
14795F763J903j7427j006O277M115N62K948O554q471M188J2763M543r925m393
14781I394j4148P618K732j0640m430p980L511J7078q253j1466N06J4341P54j225
14767b208N150R729r352p653j0601J2088P491r637q859Q5M011q89j1784j2488
14753c4917m303M062R721L768L529j1375j1674J2288J0065O158J1454k799L464
14740e59J2457K147p474P026o152q003p60Q771n608m303P098J6021N192P555m790
14725B8618q185o190J529O168j0415k995O68j1086L483J0744R013l987r953j2434
14711e022q574J5324O939m482m735J2327J7333j2134j3892R891j067k5860l940
$$ plain form
14808 -5904 -2336 -8347 -18413 -16617 -27365 -26952 -25223 -13891 -192 2738 -9271 -11802 6763
14795 6763 8666 -8761 -9767 -3490 625 1187 4135 10689 2218 6406 19169 23712 13787 9394
14781 9394 -4754 2864 5596 -5044 -9474 -17454 -13943 3135 -5118 -16584 -16078 -1737 -983 -2208
14767 -2208 2942 12671 3319 -4334 -14935 -2847 4644 -4993 -13852 -13767 -9756 -10645 -22429 -34917
14753 -34917 -39220 -35158 -25437 -21669 -18140 -29515 -41189 -28901 -18836 -12678 -1224 -4023 -559
14740 -559 11898 14045 6571 13597 7445 -558 -1318 7453 1845 -2458 4640 20661 25853 33408 28618
14725 28618 20433 14243 15772 21940 11525 8530 9198 -1888 1595 12339 21352 17365 7412 -5022
14711 -5022 -13596 1728 8667 4185 -550 11777 29110 16976 3084 12975 11908 -13952 -17892
14698a7892J1245P955L250j0421j8747n619o92J2169J9484L170l351R201p440
14685B312j4485k012L895M272M343o845j612l66K365L207O077Q059L47O221o878
14670H900j0334l618Q820L772m118m43O724k857k7230j5997P397J1520J0204P308
14656D8L215K492l72j40j4288m728O117l712J0470l583R225N705j2076j609j462
14641d698O439j5322l382J0975Q018J4672M936j5m432j1669l570O064J7864L979
14627B9859j6159j7308q790L250N10Q818k237l328Q226P112l493O652L735j059
14613A5788j3015n029J1276j929p813J812n477O51Q426o546q795n278n068j100
14599b2097J0053J9372l119j844J1718q37r351Q058m710r226n891o563m298k829
$$ plain form
14698 -17892 -6647 1308 4558 -5863 -24610 -30229 -30921 -18752 732 3902 551 9752 2312
14685 2312 -12173 -14185 -10290 -6018 -1675 -8520 -10132 -10498 -8133 -4926 1151 9210 9557 15778 8900
14670 8900 -1434 -5052 3768 7540 3422 2979 9703 6846 -20384 -36381 -28984 -17464 -7260 48
14656 48 3263 5755 5383 5243 -9045 -13773 -7656 -11368 -898 -4481 4744 10449 -1627 -3236 -4698
14641 -4698 1741 -13581 -16963 -5988 2030 16702 21638 21623 17191 5522 1952 8016 25880 29859
14627 29859 13700 -3608 -12398 -9148 -8638 180 -2057 -5385 2841 9953 6460 13112 16847 15788
14613 15788 2773 -2256 9020 7091 -722 1090 -4387 -3736 4690 -1856 -10651 -15929 -20997 -22097
14599 -22097 -12044 7328 4209 2365 14083 13246 3895 11953 7243 -1983 -7874 -14437 -18735 -21564
14585b1564P970Q282L862M611J3754p264k943L410j899k715j2196j0296r920L24
14571b6584R105Q329J939J599j1077P997J4347R427M13r206j9921k018J0827l212
14557h035L931j7j5476J8251J0164r390m999J455M643j2508j4186l669j941p753
14543c9530J0228K835j1154P697J6367J5412j724k338j9013n427J1622K878M594
14530g553J9782J2633m309K601m607j0147j0967j4325r340m592J6372Q350r52
14517g054O254R358m56k766o937p505q037j018n727j0307k175Q341L920J3600
14503a0509J2684Q94m317j281n014j0556O734L438p428L596J1588m043J158K318
14489g38L998n811K096Q725p105j278m049j895O508m08N60m471O297J039o171
$$ plain form
14585 -21564 -13594 -5312 -1450 3161 16915 9651 6708 10118 8219 5504 -6692 -16988 -26908 -26584
14571 -26584 -17479 -9150 -7211 -5612 -16689 -8692 5655 15082 15495 6289 -13632 -15650 -4823 -8035
14557 -8035 -4104 -4121 -19597 -1346 8818 -572 -5571 -4116 527 -11981 -26167 -29836 -31777 -39530
14543 -39530 -29302 -26467 -37621 -29924 -13557 1855 131 -2207 -21220 -26647 -15025 -12147 -7553
14530 -7553 12229 24862 20553 23154 18547 8400 -2567 -16892 -26232 -30824 -14452 -6102 -7054
14517 -7054 -800 8558 8102 5336 -1601 -9106 -17143 -18161 -23888 -34195 -36370 -28029 -24109 -10509
14503 -10509 2175 3069 -1248 -2529 -7543 -18099 -11365 -7927 -15355 -11759 -171 -4214 -3056 -738
14489 -738 3260 -2551 -455 8270 1165 -113 -4162 -6057 451 43 603 -3868 2429 3468 -2703
14474b703n853O564J3927P543k421j66j0798j3539m738O922Q840O762J221n574
14460E987j0654J154P747J0958m459q918q353j688J4012J3408P38q380j685n315
14446D552j8148Q774J1884K434K94j2375R345N02P4j999p705k054K013O532k718
14431A405j2210k412J597M634J1050K418R099j5212j1524R576Q766J766l931L514
14417H536j324l654l523k378j2071j2168l89K927Q070k481R180L271m463j587
14403a2054P981n265J711O959l574Q957J6799n627o710M324K505k6208l969k007
14389a6178N933J3327J128p470j1560r19k654N047J0758J0560J3992j121k2899
14376b056N594Q178l60L925j7022m184M47n730j057R107J4267Q831j7129j4096
$$ plain form
14474 -2703 -8556 -1992 11935 19478 17057 16891 6093 -7446 -12184 -5262 3578 10340 11561 5987
14460 5987 -4667 -3513 4234 15192 10733 1815 -6538 -8226 5786 19194 19932 11552 9867 4552
14446 4552 -13596 -4822 7062 9496 9790 -2585 6760 7262 7336 5337 -2368 -4422 -2409 4123 1405
14431 1405 -10805 -13217 -11620 -6986 4064 6482 15581 369 -11155 -1579 7187 8953 5022 8536
14417 8536 7212 3558 35 -2343 -14414 -26582 -26971 -24044 -15974 -18455 -9275 -6004 -10467 -12054
14403 -12054 -4073 -9338 -7627 -668 -4242 4715 21514 15887 9177 13501 16006 -10202 -14171 -16178
14389 -16178 -10245 3082 4210 -3260 -14820 -15739 -18393 -13346 -2588 7972 21964 20843 -2056
14376 -2056 3538 11716 11356 15281 -1741 -5925 -5478 -11208 -12265 -3158 11109 19940 2811 -11285
14362a1285k506L18N959j734K9J4708R325k263j7014J185j379L415o775m523J2650
14347A10k100n459o581L681M781R194Q520j6376K548L51p105L526K875l585L666
14332a954J095j970n192l312J0175k431j298l243K959J0577K2761L562k528O6
14318B9267j3475j3235p685j0717K779J1232m364J3718q68p838J1446M742p722
14305G280K2128R830j3103p5j2705p113r650j389r129P939P817k667o198O669
14291c66K0230J5022N6j3825q576p186j529J3704k067r143j0311j1122j4515p863
14277c7491J2714O247O447L170M558R556j1665j547j1055J33M550R368l163p77
14263h955O818J2534O51L925n717O15L705K861P720n089k0223M524J4426o719
$$ plain form
14362 -11285 -13791 -13473 -7514 -9248 -9219 5489 14814 12551 -4463 -3278 -4657 -1242 -8017 -12540 110
14347 110 -1990 -7449 -14030 -10349 -5568 3626 12146 -4230 -1682 -1331 -8436 -4910 -2035 -5620 -1954
14332 -1954 -859 -2829 -8021 -11333 -1158 -3589 -4887 -8130 -5171 5406 28167 31729 29201 29267
14318 29267 15792 2557 -5128 -15845 -13066 -1834 -6198 7520 6652 -1186 10260 15002 7280
14305 7280 29408 39238 26135 26060 13355 6242 -3408 -4797 -13926 -5987 1830 -837 -7035 -366
14291 -366 19864 34886 34942 21117 12541 5355 3826 17530 15463 6320 -3991 -15113 -29628 -37491
14277 -37491 -24777 -18530 -12083 -8913 -4355 5201 -6464 -8011 -19066 -18933 -14383 -5015 -8178 -8955
14263 -8955 -2137 10397 11048 14973 9256 9871 13576 16437 24157 19068 -1155 3369 17795 11076
14249A1076j3955J186L455n10q853j8957o114J3856q40J039J1942Q619o439j530
14235f025N552L306M984J114J735O555m185K771P835l382j2885J475k057j0038
14221c245j623Q906O878j415n290j4487R698O882j9553j4255k169P680L011j147
14207b0129m238q50L774k117J946R961j1411o195R323m81Q403J4021p0n660R647
14192E924M968n227k064j86J1163J3797j2648j7928J97O983n972J0950Q277q499
14178I735r616n771r957J0849O622J751J2413L505j0951j7703k830k217P775o774
14164a3169m064l860r833Q49J7630k421k508K5446R650j7846p849M051J5989l721
14150H344m038o577N86P199P579r92j1809p581J0342k10J1904j0613j5790n31
$$ plain form
14249 11076 -2879 -1693 1762 1252 -7601 -26558 -32672 -18816 -19656 -18617 -6675 1944 -4495 -6025
14235 -6025 -473 2833 7817 8931 10666 17221 13036 15807 23642 20260 7375 8850 6793 -3245
14221 -3245 -4868 4038 10916 9501 4211 -10276 -578 6304 -13249 -27504 -29673 -21993 -18982 -20129
14207 -20129 -24367 -25217 -21443 -23560 -21614 -11653 -23064 -29259 -19936 -20417 -12014 2007 1937 -3723 5924
14192 5924 10892 5665 3601 3415 14578 28375 15727 -2201 -2004 4979 -993 9957 18234 9735
14178 9735 119 -5652 -15609 -4760 1862 3613 16026 19531 8580 -9123 -11953 -14170 -6395 -13169
14164 -13169 -17233 -21093 -30926 -30077 -12447 -14868 -17376 8070 17720 -126 -7975 -3924 12065 8344
14150 8344 4306 -2271 -1685 5514 13093 12101 292 -7289 3053 2843 14747 4134 -11656 -12187
14136a2187R931L250M921j472M449K083k037j0714j0998J126j022M53N147O235
14122h35P404o68O599p802j6627L207J09p60M351Q379J1355Q391L715p73m84p30
14106B4831m961n895l221j4550m948J2764O23p758K452O710J2806Q81r210m704
14092E820j0388k417J1941Q33n956K092L137J368L7J1835J831j0878j6828j4527
14078b2100Q176J8688J117j626J6197P509j5248k5650M47P101k38L159n384q097
14064a5949N988O767J3808k636j740K4078o775j976K71j7907N485L924n087J4291
14050B2542n072q478l742p923K288j552J0144K0399M596J389p041m250O430n627
14036B4103q194P629q658p07J0371J763j1512j6870n419J0050O328o96j637n012
$$ plain form
14136 -12187 -2256 994 5915 4443 8892 10975 8938 -1776 -12774 -11648 -12670 -12217 -7070 -835
14122 -835 6569 5901 12500 4698 -11929 -8722 -8613 -9373 -5022 3357 14712 23103 26818 26045 25561 24831
14106 24831 19870 13975 10754 -3796 -8744 4020 4643 -3115 -663 6047 18853 19734 10524 5820
14092 5820 -4568 -6985 4956 5789 -167 1925 5062 6430 6467 18302 20133 9255 -7573 -22100
14078 -22100 -13924 4764 5881 4255 20452 27961 12713 -12937 -12490 -5389 -5627 -2468 -7852 -15949
14064 -15949 -9961 -3194 10614 7978 6238 30316 23541 21565 21836 3929 9414 13338 8251 22542
14050 22542 17470 8992 5250 -2673 -385 -1937 8207 28606 33202 34591 27550 23300 29730 24103
14036 24103 15909 23538 14880 14173 24544 26307 14795 -2075 -7494 2556 8884 8188 6551 1539
14022A539j5844M343R175L263j332m179K744K759j466K390p5o987n285M494O76
14007c785L677p807N602N704J3310p886n690L319J1664N444j268p994J526j645
13993A4171r356M206Q071Q584L521k154j4529k483j2319O36R029j642q293M362
13979A804P254k658j278J4171m680n581K060O327P3m691j07j2631M607k140k942
13964d12M615L97o68M09J754n386j166M33k994K067K1J3540J830k540Q67l540
13948I227j0407K984J3686J631q083L516j99j9983n872n983P974N328O840j099
13934d40K208q272l573j374k415K811M810K442Q64n961O909N210l741l227O176
13919B427O215j8995J960J2065O068J1049l214j626l893p613J7994J5300M737
$$ plain form
14022 1539 -14305 -9962 -787 2476 1144 -3035 -291 2468 1002 3392 3317 -3670 -8955 -4461 -3785
14007 -3785 -108 -7915 -2313 3391 16701 8815 3125 6444 18108 23552 22284 14290 15816 14171
13993 14171 4815 9021 17092 25676 29197 27043 12514 10031 -2288 -1652 7377 5735 -2558 1804
13979 1804 9058 6400 5122 19293 14613 9032 11092 17419 17492 12801 12694 63 4670 2530 -412
13964 -412 4203 4600 3932 4341 6095 709 -457 -24 -3018 -951 -930 12610 14440 11900 12767 9227
13948 9227 -1180 1804 15490 17121 9038 12554 12355 -7628 -13500 -19483 -11509 -6181 659 -440
13934 -440 1768 -6504 -10077 -11451 -13866 -11055 -6245 -3803 -2939 -8900 -1991 3219 -522 -3749 2427
13919 2427 8642 -10353 -8393 3672 9740 20789 17575 15949 12056 4443 22437 37737 42474
13906D2474j0813j3159K449k106l646j1433o897N746k839k018o639K735j1697
13893a7843p157K291R018L553J2369J3217P00J924m379j2604j6466J0507J698
13880c172m32R980J3352K984o133p647J011j848J3086j0578q323j0577Q013N629
13866E345m63K145M214k0736j3694l112L671Q312L793K0231J5067N756k855j0916
13852A6758p482o825o290L899O135q274J1089O1o074j2426j0442r6M191J1639
13838d137J398p892p603J6027R16r223J2914Q894l877p972M464o044j4645J642
13824a5138k785q909k46J7577j725R446q224m58R247J2323J3380M640j3103k1567
13810e542n421J2510J0676m125j298J549O965j922l870n747O097o153l735N28
$$ plain form
13906 42474 31661 18502 20951 18845 15199 3766 -3131 2615 -224 -2242 -8881 -6146 -17843
13893 -17843 -25000 -22709 -13691 -10138 2231 15448 16148 18072 13693 1089 -15377 -4870 -3172
13880 -3172 -3604 6376 19728 22712 16579 8932 9943 8095 21181 10603 2280 -8297 -284 5345
13866 5345 4882 7027 11241 -9495 -23189 -26301 -22630 -14318 -10525 9706 24773 30529 27674 16758
13852 16758 9276 2451 -3839 60 6195 -2079 9010 9071 2997 -9429 -19871 -19967 -15776 -4137
13838 -4137 -2739 -10631 -18234 -2207 -1291 -10514 2400 11294 7417 -555 3909 -2135 -16780 -15138
13824 -15138 -17923 -26832 -27078 -9501 -11226 -1780 -10004 -10462 -1215 11108 24488 29128 16025 -5542
13810 -5542 -10963 1547 12223 8098 6800 8349 15314 13392 9522 3775 9872 3719 -16 512
13796E12p611O710k656n341L866R748K962n79j781K374q322o086J1419K850j2766
13781d701j1294K687M674k167j2044m308J718M614J7955J2531J900L275J675O970
13767B3485j0533j8788K999M51j0561p483P494J215n678O96J5202J2116o819k688
13753A108k759o175j3005N818M51l420j402J1028M610J0091L443j7221j1167J2052
13739f548R530k615o497J1111q335n326O324K7280J0357k5087j1290N463L541
13726G908J6874P269J33j5742p81P820k30q065r910j4793o097J2762O407R359
13712A2914J0196J4193o809j0810m028Q875J104j0896l261K77p181q673K939J033
13698a27p026l50M761J5294O034j1822p110j0692j8034j2278R495K741O056N734
$$ plain form
13796 512 -7099 -389 -3045 -8386 -4520 5228 8190 7611 5830 8204 -118 -6204 5215 8065 -4701
13781 -4701 -15995 -13308 -8634 -10801 -22845 -27153 -25435 -20821 -2866 9665 11565 14840 16515 23485
13767 23485 12952 -5836 -2837 -2386 -12947 -20430 -12936 -11721 -17399 -16703 -1501 10615 3796 1108
13753 1108 -1651 -7826 -20831 -15013 -14562 -17982 -19384 -8356 -3746 6345 9788 -7433 -18600 -6548
13739 -6548 2982 367 -6130 4981 -3354 -8680 -2356 24924 35281 10194 -1096 4367 7908
13726 7908 24782 32051 32184 16442 15661 23481 23251 15186 5276 -9517 -15614 -2852 3555 12914
13712 12914 23110 37303 30494 19684 15656 24531 25635 14739 11478 11755 4574 -4099 -1160 -127
13698 -127 -7153 -7503 -2742 12552 18586 6764 -346 -11038 -29072 -41350 -31855 -29114 -23058 -17324
13684a7324K904N758N319n597M547o007R624K7426j396j5570l113M036P085q731
13670H961j869J32l623j1061M959K631O041J5379j1530j5498L384K981N885J0628
13656A7400O068j2705L075j6830l515j320M891J51N147J6040j1281m460J3679
13643A6340J9580l499j433m307j164M124r964l990N997N419j0525n51k993j944
13629A1090K008j5602P21J3795j1212Q781J7498J127p771p112l667q34O16K015
13615A1453n841l206l861l206n569N109N024R707R911O519L41l140l071L483J0873
13600C4526o284j2045p266K722L257J5391n01o552l83j1145q989J3430R179j4295
13586A1045K013J7080l589j5106M111n21k896n725O475R186o787j0650j0764J5514
$$ plain form
13684 -17324 -14420 -8662 -3343 -8940 -4393 -10400 -776 26650 25254 9684 6571 10607 17692 8961
13670 8961 7092 7224 3601 -7460 -2501 130 6171 21550 10020 -5478 -2094 887 6772 17400
13656 17400 23468 10763 13838 -2992 -6507 -7827 -2936 -2785 2362 18402 7121 2661 16340
13643 16340 35920 32421 30988 26681 25517 29641 19677 15687 21684 27103 16578 16027 13034 11090
13629 11090 13098 -2504 -1783 12012 800 9581 27079 28206 20435 13323 9656 8822 9438 11453
13615 11453 5612 2406 -1455 -4661 -10230 -5121 -97 9610 19521 26040 26381 23241 20170 23653 34526
13600 34526 28242 16197 8931 11653 14910 30301 29800 23248 22865 11720 2731 16161 25340 11045
13586 11045 13058 30138 26549 11443 15554 15033 12137 6412 12887 22073 15286 4636 -6128 9386
13572I386J1761K423j558p277Q53R85J0547l14L985M799N101m692o794q346N240
13557B6099P716N442j766N345l777N675J3980o348j4814j1779j116M5R261p467
13543B6496n132R412M00k730q07p299N403N443P945l127o960k2109p258o074J0349
13528C952P117k268p713J1105J7068P223j2981j2387M645k063K090O329l971j2021
13514F125L842J1865Q081J6191Q411p290j018m53M813O946l925j0400m43Q679
13500E1424o597k652J3772R542p53j2270j6913j3221l989j0177P818o25J0781
13487B6140j898K843P622l04p218q669q370m582J2231m842L120k682M248L130
13473B0769p102K219J1705q341k0394J5669K868p469m229O93O898n126o898P630
$$ plain form
13572 9386 21147 23570 22012 14735 15588 16573 27120 26806 30791 35590 40691 35999 29205 20859 26099
13557 26099 33815 39257 37491 42836 39059 44734 58714 52366 37552 25773 24657 24702 33963 26496
13543 26496 21364 30776 31176 28446 27639 20340 25743 31186 39131 36004 29044 6935 -323 -6397 3952
13528 3952 11069 8801 1088 12193 29261 36484 23503 11116 15761 13698 15788 22117 18146 6125
13514 6125 9967 21832 29913 46104 54515 47225 46207 45754 50567 57513 53588 43188 42745 51424
13500 51424 44827 42175 55947 65489 64736 52466 35553 22332 18343 8166 15984 15359 26140
13487 26140 24242 27085 34707 34403 27185 18516 10146 5564 17795 12953 16073 13391 17639 20769
13473 20769 13667 15886 27591 19250 -1144 14525 17393 9924 5695 6388 13286 8160 1262 8892
13459H892M094J3636R316O360j6252L506J5034K3276J177p968n615j1419m56m796
13445C8785l846N367r326j6411n826M889j6343j0599R092Q628j998R621p125j2928
13431h020J7864L799l043j0202M640J4665K662L480m171o464J0563j028q767n70
13417A5408O940R65m48P515n987n288n415J0356R62J6613J0747j7557N027p052
13403C2786j3470k518l436m194r4J1242o125j1167o078J8614J4553o622K459j389
13389B4561j0438k1605n97l175L382n123N048m459J6487J4530J979j1145n132
13376D313J22J2125J7674q824l792J0759J550L297O46L096N488n153k0027r580
13362A1694J280j752J0700J531j4125o730l42J090l422N931P944j3149r808J5843
$$ plain form
13459 8892 12986 26622 35938 42298 26046 29552 44586 67862 69039 61071 55456 44037 43581 38785
13445 38785 34939 40306 30980 14569 8743 13632 -2711 -13310 -4218 4410 2412 12033 4908 -8020
13431 -8020 9844 13643 10600 398 5038 19703 22365 25845 21674 15210 25773 24745 15978 15408
13417 15408 22348 23313 22865 30380 24393 19105 13690 24046 25008 41621 52368 34811 39838 32786
13403 32786 19316 16798 13362 9168 9074 20316 14191 3024 -3054 15560 30113 23491 25950 24561
13389 24561 14123 -7482 -8079 -11254 -7872 -12995 -7947 -12406 4081 18611 20590 9445 4313
13376 4313 4435 16560 34234 25410 21618 32377 33927 37224 37870 40966 46454 41301 21274 11694
13362 11694 12974 11222 21922 23453 9328 2598 2256 3346 -76 5855 13799 650 -9158 6685
13348F685J2033M042k877K763J3024j7031j320J488k911J536k125n69Q650J3515
13334C6903k137k732j113N093L53J3178j6028q934r807j0209j0904P046l07L669
13320D071J741P631O826n889j416L665k74L48m416J0849K672j0013J229J2280
13306B9304j1533p922O545L973J825l549k841J0623L761q608j0365M089R709M902
13292B9913J1635K301n317r876k533l34J3992N401n707o180P106p154k822j2648
13278A7777J078o713m746N091J16O704P646k648k895l92m761J364L152o995k073
13263A1705Q694l370M980m820j0775p748l73K0019P542j5903n08J670q971N35
13249B677J1975M090j0009j3459o645O653P072l672m087N054P941R644K821j1850
$$ plain form
13348 6685 18718 22760 19883 22646 35670 18639 17319 18807 15896 17432 15307 14738 23388 36903
13334 36903 34766 32034 30921 36014 36367 49545 33517 24583 14776 4567 -6337 709 402 4071
13320 4071 5812 13443 20269 14380 12964 16629 16355 16703 12287 23136 25808 15795 17024 29304
13306 29304 17771 9849 16394 20367 22192 18643 15802 26425 30186 21578 11213 15302 25011 29913
13292 29913 41548 43849 38532 28656 26123 25789 39781 45182 39475 33295 40401 33247 30425 17777
13278 17777 18855 12142 7396 12487 12603 19307 26953 24305 21410 21018 16257 17621 20773 13778 11705
13263 11705 20399 17029 22009 17189 6414 -1334 -1707 18312 25854 9951 9443 11113 2142 2677
13249 2677 14652 18742 8733 -4726 -11371 -4718 2354 -1318 -5405 -351 7590 17234 20055 8205
13235H205r193P710p591n613L1164J7013j7882k173K106k445M399L721L595M734
13221C7750j479n612j7559l693P229l360L58j0001K61j450L667O777J280l156
13207A1012J5696P422o655J34p388j3024J019Q537J684o336j2457j700l26Q903
13193F521R223J4344P238n450j0605O373j456K856J215n969l343m581K47P272
13179B3885J794N407k699o629p862l989k0712%K1399L064n084J944J4015O057
13165C0590m630J2162P769k813M689j4148K445K168j0910l376L716R44n91J4193
13151D2208P638j8945j0718P878M040k137Q46L552P98J1113R123j330j7925j5359
13137B0782j0496J2541P469K519Q112p908j1614j0724N65Q917p315m706M991R264
$$ plain form
13235 8205 -988 6722 -869 -6482 24682 41695 23813 21640 23746 21301 25700 29421 33016 37750
13221 37750 36271 30659 13100 9407 16636 13276 13634 3633 3894 2444 6111 12888 14168 11012
13207 11012 26708 34130 27475 27609 20221 7197 8216 16753 18437 12101 -356 -2056 -2382 6521
13193 6521 15744 30088 37326 31876 21271 27644 26188 29044 30259 24290 20947 16366 16613 23885
13179 23885 25679 31086 28387 21758 13896 9907 -10805 -10805 10594 13658 8574 10518 24533 30590
13165 30590 25960 38122 45891 43078 47767 33619 36064 38232 27322 23946 27662 28606 28015 42208
13151 42208 49846 30901 20183 28061 32101 29964 30810 34362 35160 46273 55396 54066 36141 20782
13137 20782 10286 22827 30296 32815 40927 33019 21405 10681 11246 20163 12848 8142 13133 22397
13123B2397r49N475P972l176k410j599M213P672N476M387p224o862J0437M630
13109E0439l569o291j3621j0574J5833K3027j1799j7659N261K5649p381P7k996
13096D6396j1011O410q167m835K3068J9876n986j469J5672L231j3675o873r400
13083E3237q941j405P601J0045K717o403M622l821m617o879N878J3220Q289O776
13069H0319O067j8251k1558j911K4562K7728K7863K1544K9476N4415M1623L5983
13057C07860M3808L7793M8255M6922K1708j204L070L4202N5029J18678J79936
13046H96057K33923K49997K63272K69132K40743R1049j74123l76353m49694l76759
13036H67244k29718j18364p7500m4177j9691j3743k6588l2159l3686k4296k3666
$$ plain form
13123 22397 21448 26923 34895 31719 29309 27710 31923 39595 45071 49458 42234 35372 45809 50439
13109 50439 46870 40579 26958 16384 32217 55244 43445 25786 31047 56696 49315 49392 46396
13096 46396 35385 41795 33628 28793 51861 71737 65751 64282 79954 83185 69510 62637 53237
13083 53237 44296 42891 50492 60537 63254 56851 61473 57652 53035 46156 52034 65254 73543 80319
13069 80319 86386 68135 46577 44666 69228 96956 124819 146363 175839 230254 271877 307860
13057 307860 351668 389461 437716 484638 506346 505142 508212 542414 597443 716121 896057
13046 896057 1129980 1379977 1643249 1912381 2153124 2244173 2070050 1693697 1244003 867244
13036 867244 637526 519162 441662 397485 377794 364051 337463 305304 271618 247322 223656
13025B23656l0276k7620j936L45j4939p580l748k364j2962o426p499j3145R743
13012A05249q691k0573M70Q467J0747J0463q871j2356J2510j2762j2088M930M465
12999H1960J918j725p073j8177L320M221Q168L167P13L385j9396p461j722k062
12985D9236j1313o047j3695r717Q77L36R81k725L336l738l301N688O02l008R937
12970A7449O68m16L129N897J6249K227j1847M856K03p268m939Q27J083j0418k549
12955A5151l163n730n987J5814J4392J2580J5993J584n822o751p660j3150r435
12942A7816j5285k114l898N680J8201j0017P754J613r611K791m31l954p387O613
12928G771n253n849Q083M684r663n682M120j6566j4463k5993k481Q594J7420J3605
$$ plain form
13025 223656 193380 165760 163824 164169 149230 141650 137902 135538 122576 116150 108651 95506 105249
13012 105249 96558 75985 76455 84922 95669 106132 97261 84905 97415 84653 72565 77495 81960
12999 81960 83878 82153 75080 56903 60223 64444 72612 75779 76492 79877 60481 53020 51298 49236
12985 49236 37923 31876 18181 8464 9341 9677 10658 7933 11269 7531 4230 9918 10520 7512 17449
12970 17449 18117 17701 20830 26727 42976 45203 33356 38212 38415 31147 26208 27035 28118 17700 15151
12955 15151 11988 6258 271 16085 30477 43057 59050 60634 54812 48061 40401 27251 17816
12942 17816 2531 417 -3481 2199 20400 10383 18137 19750 10139 12930 12499 8545 1158 7771
12928 7771 2518 -3331 4752 9436 -227 -5909 -1789 -18355 -32818 -58811 -61292 -52698 -35278 -21673
12914b1673M1213M1553L5327J3206Q012R760K0768K001p071k0962j2237j4823
12902I5074R159o100j1528j2481L0M25K423J0556J5493R795p596j110k50j8657
12888H5233j6800q005M766N877M127J3523J730M180J1642P984J1814J2670M108
12875A42849K332J7150K1087L999o63R040R115l422K2492J5525J509j4617k1080
12862B05316Q227K0214M0618L7736p146j9999m8228n6255k1326j3674J3974m608
12850A54849o011j5191j2467p982l056J5616J3450N253J4978o260j4772j0112
12838A28295l012p207j0659m824j3975k0881j8985N716N310J1560L329O183N419
12825H6269m745k61j5741j5520j969j2556r733q734N582n89K6427L6891J0685
$$ plain form
12914 -21673 19540 61093 96420 109626 117638 127398 148166 150167 143096 122134 109897 95074
12902 95074 104233 98133 86605 74124 74154 74579 77002 87558 103051 112846 105250 104140 103890 85233
12888 85233 68433 60428 65194 71071 75198 88721 90451 94631 106273 114257 126071 138741 142849
12875 142849 145181 162331 183418 187417 186754 195794 204909 201487 223979 239504 241013 226396 205316
12862 205316 213543 233757 274375 312111 304965 284966 236738 180483 159157 145483 159457 154849
12850 154849 148838 133647 121180 113198 110142 125758 139208 144461 159439 153179 138407 128295
12838 128295 125283 118076 107417 102593 88618 67737 48752 54468 59778 71338 74667 80850 86269
12825 86269 81524 81263 65522 50002 48033 35477 25744 17010 22592 22003 48430 85321 96006
12812I6006N714M091j5842k7501k4110j5222p995R589J5406L6853M3959L7093
12800A58041L0487J1344J8242j0505j3387m635M640J7531K0852L7392K9557L343
12788C02902k0852l2402m7990k8354j5879n953q873j1748J021p545j8689P066
12776A12704R063p187J658N976M909L272K15m114m68R19j1334J4560J4326J4983
12762A59482K5305M6063O5502Q5450P1268J8339K272J0146m77P061J2496O586
12750E09493K5988K9818P074J0028p765j3478J2357j1984j9922O194O151J3638
12738E67592J5432j617J468N683r686l5314k6611o420n606k440l3441k3769n016
12725D40255J44J8099k267J5365K3456K2959J0899Q307K8347J8026R603m581J0894
$$ plain form
12812 96006 101720 105811 89969 62468 38358 23136 15141 24730 40136 76989 120948 158041
12800 158041 188528 199872 218114 207609 194222 189587 194227 211758 232610 270002 299559 302902
12788 302902 282050 249648 201658 173304 157425 151472 142599 130851 131872 124327 105638 112704
12776 112704 121767 114580 116238 122214 127123 130395 130610 126496 126028 126947 115613 130173 144499 159482
12762 159482 184787 230850 296352 381802 453070 471409 473681 483827 483350 490411 502907 509493
12750 509493 535481 565299 572373 582401 574636 561158 573515 561531 541609 547803 553954 567592
12738 567592 583024 581407 582875 588558 578872 543558 516947 510527 504921 502481 469040 445271 440255
12725 440255 440399 458498 456231 471596 495052 518011 528910 537217 565564 583590 593193 588612 599506
12712E99506J533L857K3428J1082J6679K3861O899r852k571l870m159j0092j5791
12699F40510j6090j3490l076r550L214M328L092K9996J7360j1407J8345K4071
12687F87303J9263K1961J9631J2008J9586J9427K0503L1010L1471K4211J3584
12676I19958O873R393K7272K1570n491O082J490J7055K9704L0398K2303K2026
12664A108633L6221M3888M0987L0859M1497M6560N5223N4477O0945N9061P5922
12653A654273R7766J22912J28301J36711J69734J59048J68423J77865J72035J83787
12643C170855K13455K35240K82207L32190M01455N01173O06568P26134Q67285
12634G336562J068029J378434J848684K397662K926108L431144L964818M547751
$$ plain form
12712 599506 601039 604896 628324 639406 656085 679946 686845 676993 674422 670552 666393 656301 640510
12699 640510 624420 610930 607854 598304 601518 605846 608938 638934 656294 644887 663232 687303
12687 687303 706566 728527 748158 760166 779752 799179 819682 850692 882163 906374 919958
12676 919958 926831 936224 963496 985066 979575 985657 987147 1004202 1033906 1064304 1086607 1108633
12664 1108633 1144854 1188742 1229729 1260588 1302085 1348645 1403868 1458345 1519290 1578351 1654273
12653 1654273 1752039 1874951 2003252 2139963 2309697 2468745 2637168 2815033 2987068 3170855
12643 3170855 3384310 3619550 3901757 4233947 4635402 5136575 5743143 6469277 7336562
12634 7336562 8404591 9783025 11631709 14029371 16955479 20386623 24351441 28899192
12626B8899192N193706N830418O467899P196534Q049657Q640493Q426532P246194
12618H5950625N581173M307805M531178P275504J3547830K3801175L6011698M5092430
12610B26099418M9054608N0577827M9956298L8927811M843626m3801409q0067743
12603B95590436q4429762o2162045l7066254k0987248j2362936p877224n784163
12596F4920804n204701n375635n604034n490678n023735m416662l823902l244819
12588B6736638k752258k387898k114418j873463j673325j469764j277204j114316
12580A2073992r92338q84186q01764p17295o25874n38129m89808m65564m47248
12571F111786m14213l75358l44465l27861k82715k40995k37191k14063k01279
$$ plain form
12626 28899192 34092898 39923316 46391215 53587749 61637406 70277899 78704431 85950625
12618 85950625 91531798 95839603 100370781 107646285 121194115 144995290 181006988 226099418
12610 226099418 275154026 325731853 375688151 414615962 419459588 375658179 295590436
12603 295590436 211160674 148998629 111932375 90945127 78582191 70704967 64920804
12596 64920804 59716103 54340468 48736434 43245756 38222021 33805359 29981457 26736638
12588 26736638 23984380 21596482 19482064 17608601 15935276 14465512 13188308 12073992
12580 12073992 11081654 10197468 9395704 8678409 8052535 7514406 7024598 6559034 6111786
12571 6111786 5697573 5322215 4977750 4649889 4367174 4126179 3888988 3674925 3473646
12562C473646j86403j70536j59674j58572j65137j51853j37916j27112j22436
12553B094007j10979q8014q6968r6053q7726p5167q0607q8553o1873o6121p3997
12542A177949o5337n0795m8166m1042l6310l8756l2746j1223j5506k2995j3139
12531H01934k1142N603l73k2422p942J8110J0938J5940K6962K1609m634r220K220
12518H37583J2070O155J2018J365j2207j7278M77K2052O0951J15156J66053K03926
12506A408321K05644K05743J82802P6579r9708k33644l00920k64022j79348j13409
12496H88038o7064m3762k7616n4924n4111n3234n9409m9612m0384l5593l3848
12485C68481j2248p805k1736k8379m2331m4110k9657j7295k231j6087n236J7869
$$ plain form
12562 3473646 3287243 3116707 2957033 2798461 2633324 2481471 2343555 2216443 2094007
12553 2094007 1983028 1895014 1808046 1711993 1624267 1549100 1468493 1379940 1318067 1251946 1177949
12542 1177949 1112612 1061817 1013651 972609 936299 897543 864797 853574 838068 815073 801934
12531 801934 780792 786395 786022 763600 755658 773768 784706 800646 827608 849217 844583 835363 837583
12518 837583 849653 855808 867826 869191 856984 839706 840183 862235 923186 1038342 1204395 1408321
12506 1408321 1613965 1819708 2002510 2079089 1979381 1745737 1444817 1180795 1001447 888038
12496 888038 820974 777212 749596 694672 640561 587327 527918 478306 437922 402329 368481
12485 368481 356233 348428 326692 298313 255982 211872 182215 164920 162689 146602 141366 159235
12473A59235J5905J3550P295J929O078J2886j533j0730j1859k0381p584J1792
12461A76583P730l429l593J868j687J5985K8675K7866L6732N4371N6764M2243
12449D40108M016k5395l5353k1590o156j0705r994j466j101j5564m0357j6641
12437B59802o296j3864m926j3188p810j3174j0655j8984k7567k9042j9747k4475
12425G0074l0745j7328J074J4968L2204L4612J3046P578j1351l8803k0565p95
12413E3969L1101L7194M0966M0501L0838O782j9664k6155k2360j4559j5096r385
12401A34132J794K9158L0132K6766J6040j920m969j5675k8593l0668k4199q690
12389A23308j5750j8053P160J1970J2312l484k443K043l755N663o317j2240k5760
$$ plain form
12473 159235 175140 188690 195985 197914 203992 216878 215345 204615 192756 172375 164791 176583
12461 176583 184313 180884 177291 179159 177472 193457 222132 249998 286730 341101 397865 440108
12449 440108 444124 418729 383376 361786 355630 344925 334931 333465 332364 316800 276443 259802
12437 259802 253506 239642 234716 221528 213718 200544 189889 170905 143338 114296 94549 70074
12425 70074 39329 22001 23075 38043 70247 104859 117905 125483 114132 75329 54764 53969
12413 53969 85070 122264 163230 203731 234569 241351 221687 195532 173172 158613 143517 134132
12401 134132 135926 165084 195216 221982 238022 236102 231133 215458 186865 156197 131998 123308
12389 123308 107558 89505 96665 108635 120947 117463 115020 117063 113308 118971 112654 100414 74654
12376G4654j9895j0063J954O337J9208M976J9182j134n645k1973k1689r795j653
12363C4464k344o099J9755J3852J3683J1236J29K3393l212j0885l092k3359k3470
12350D4051q767r522k483O781O051J2218J9806J0794J1347O830o733R105n792
12337I3686k514l9J526j75n73P543L42J6506R987k0921j5936j0428j3840l49l070
12322F1745j8776j8816Q829J1436K785L167K0500K399j3710k8711p654R020R844
12309D2058k218k669m592n836m694J346J5072K2140K1814J7536L1320L0142J8802
12296A80221J5218j3698k0344j7815k9668j5373l637o658j1544N164Q867n671
12284H5062k7997q114J698L525J1029J6701M344o750j8784k414J5583L19l078
$$ plain form
12376 74654 54759 44696 46650 52987 72195 77171 96353 95219 89574 67601 45912 36117 34464
12363 34464 32120 26021 45776 59628 73311 84547 84676 108069 104857 93972 90880 67521 44051
12350 44051 35284 25762 23279 30060 36111 48329 68135 78929 90276 97106 90373 99478 93686
12337 93686 91172 91133 92659 92484 91911 99454 99796 116302 126289 105368 89432 79004 65164 64815 61745
12322 61745 42969 24153 32982 44418 47203 50370 70870 73269 59559 30848 23194 32214 42058
12309 42058 39840 37171 32579 26743 22049 23395 38467 60607 82421 99957 131277 161419 180221
12296 180221 195439 181741 161397 143582 113914 98541 94904 88246 76702 81866 90733 85062
12284 85062 57065 48951 50649 54174 65203 81904 86248 79498 60714 58300 73883 74202 71124
12271G1124n222q293O877M75L516n39r176o588L302K1019M733j3376k350O201
12257G1703p340j3934N192L71j3526o441j0839J2413J343J9455K665k364J4125
12244G2823Q170L544j977j2157j002L890m82j203p121o523n35l67l02N227K230
12229F4215k300p763k0860q007m538J019P123j3445j8872M00J6036q73k880Q119
12215A7374l558j901R32l017J880L334J1080J0642o893L172k375N007o664p216
12201B1797P758l289L474Q795J4293l180j1073K216J7087J5654J3888J1735J7894
12188A17049J5587J5600K7570K6771K0925K6914L7946L0658M4307M0750M4345
12177D48422M2324K4498K1414L4867O0397R8568J63746K15909K42917K60431K75553
$$ plain form
12271 71124 65902 57609 64486 64961 68477 67938 58762 52174 55476 76495 81228 67852 65502 71703
12257 71703 64363 50429 55621 55992 42466 36025 25186 37599 38942 58397 61062 58698 72823
12244 72823 80993 84537 82560 70403 69401 73291 72809 71606 64485 57962 57427 57060 56758 61985 64215
12229 64215 61915 54152 33292 25285 20747 21766 28889 15444 -3428 -3028 13008 12135 9255 17374
12215 17374 13816 11915 12847 9830 11710 15044 26124 36766 29873 33045 30670 35677 29013 21797
12201 21797 29555 26266 29740 38535 52828 49648 38575 40791 57878 73532 87420 99155 117049
12188 117049 132636 148236 175806 202577 223502 250416 288362 319020 363327 404077 448422
12177 448422 490746 515244 536658 571525 631922 730490 894236 1110145 1353062 1613493 1889046
12166A889046K34223J08568j22799l61322m71283l87780k34464j19307o8565n5770
12156D10547m7918l5417j7275k5863m053k1598l1841k8689k6399k0013j3104j5356
12144A23021k4755j8528r975j917k4314j8687j190k360J0883P426J4993p101k0063
12131B7433p271L289j5771J468M922J800o758n567P599Q169J0026k799J213o078
12117B1675R159r053o680N967R510n972K588o285O19O297j5l126j1391n679k87
12102G327Q68k826J2131j4663p553M907J589N315J7797R100j0008q370r257J0786
12088A7143J0155j1241j626P52J991m849N211N964j0624q629N368j0282K4437
12075B3770L864o352K752k294j0423o991k890K575Q451K747r100N294J024q880
$$ plain form
12166 1889046 2123269 2231837 2109038 1747716 1276433 888653 654189 534882 466317 410547
12156 410547 362629 327212 309937 284074 280021 258423 226582 197893 171494 151481 138377 123021
12144 123021 98266 79738 69763 67846 43532 24845 23655 21295 32178 39604 54597 47496 27433
12131 27433 20162 23451 7680 9148 14070 15870 9112 3545 11144 19313 29339 26540 27753 21675
12117 21675 30834 21781 15101 21068 30578 24606 27194 20909 21528 27825 27810 24684 13293 7614 7327
12102 7327 8195 5369 17500 2837 -4716 191 1780 7095 24892 33992 23984 15614 6357 17143
12088 17143 27298 16057 14431 15183 17174 12325 17536 23500 12876 4247 9615 -667 23770
12075 23770 27634 21282 24034 21740 11317 4326 1436 4011 12462 15209 6109 11403 12427 3547
12061C547j3431j911J248M160O782R187K747l894n338p567Q920P998o745l684
12047B019J3569O118n786k152k425p550j3954o196N518J3033L421l42P696J0949
12033B3918P824K911j0619J662j2984j8374j0157m141m792K0269P840O552J624
12020A1533j8938j2299J0804P606J517q28L351k966q930M872q74O024l099Q132
12006E905p581m083o210K530O554L076Q106O059K441n737q726j0987l341O664
11992e330J2576j876M420Q397n486j5966K339n027K432p27j562j59n257J3300
11978B074K714r02J1895m916j4469K199P220m942M936l735O394J1587m598L971
11964A9428J3442j0461j0228n451p974N543J210r01R280l968m982k077Q10L639
$$ plain form
12061 3547 -9884 -11795 -10547 -6387 395 9582 12329 8435 3097 -4470 4450 12448 5703 2019
12047 2019 15588 21706 15920 13768 11343 3793 -10161 -16357 -10839 2194 5615 5273 12969 23918
12033 23918 31742 34653 24034 25696 12712 -5662 -15819 -19960 -24752 -4483 3357 9909 11533
12020 11533 -7405 -19704 -8900 -1294 223 -605 2746 -220 -9150 -4278 -5152 872 -2227 5905
12006 5905 -1676 -5759 -11969 -9439 -2885 191 8297 14356 16797 11060 2334 -8653 -11994 -5330
11992 -5330 7246 5370 9790 18187 12701 -3265 -926 -5953 -3521 -4248 -5810 -5969 -11226 2074
11978 2074 4788 3886 15781 10865 -3604 -1405 5815 873 5809 2074 8468 20055 15457 19428
11964 19428 32870 22409 12181 6730 -1244 4299 5509 4608 13888 9920 4938 2861 3671 7310
11950G310N914N740J545K406o157l930m216j0814p530J5948Q729P363l524j1048
11936G736m087j493K369j711l40Q048k52j0330n350N447r75k415J1716m647j1545
11921g829l305L411M488k366k746L718L014l29N449P417O459P414r723p859m869
11906B344j0642M551J4397M017M342m700r049Q269j165j9858m10J3906k621o520
11892c139M99K278N321j824L033j2894K474n69n62O996j0947j337J7545R229k293
11877A3810J1444O331k859j2923j4622n54O110M357N865J999O80l696l282p06
11863A1954j223J045r353k372o641k376P530O631Q565K581j186o43P763P287j2242
11848A7320j2580M131j387P55j3014K693M955J817j6935j857R233M485M851J2079
$$ plain form
11950 7310 13224 18964 20509 22915 16758 12828 8612 -2202 -9732 6216 14945 22308 18784 7736
11936 7736 3649 2156 4525 2814 2474 10522 10270 -60 -5410 37 -938 -3353 8363 3716 -7829
11921 -7829 -11134 -7723 -3235 -5601 -8347 -4629 -1615 -1944 3505 10922 17381 24795 15072 7213 2344
11906 2344 -8298 -3747 10650 14667 19009 14309 5260 13529 12364 -7494 -7904 6002 3381 -3139
11892 -3139 -2640 -362 4959 3135 6168 -6726 -4252 -4821 -5383 1613 -9334 -10671 6874 16103 13810
11877 13810 25254 31585 28726 15803 1181 627 6737 11094 16959 18958 19638 15942 12660 11954
11863 11954 10731 11776 2423 51 -6590 -8966 -1436 5195 13760 16341 15155 14512 22275 29562 17320
11848 17320 4740 8871 7484 8239 -4775 -2082 2873 4690 -12245 -14102 -4869 -384 4467 16546
11834A6546n714O131J253j1176j2074K215j0134K639j118l85J4504L765J2119
11821A8571R11j5760l479o367p682J322J3276J0169m784K373k969j9123q138J6267
11807e413J1459j0154j116K546J7953l971j1060j1552K754j684o37r21L385O059
11793b352m386J360O929N559k0499r495k850M730J3918N351N102R678Q166q503
11779A2708j2045L114Q742N611o243K270J1321n546j4039o720q22K206J0568N924
11765A7049K960p340p941j29r060o171N981J0063k322j1601o900l338P50J4638
11751c361J0361N258O732j1554j1643P116K597j6139J224K5472j2870k1746p079
11738b5632J1423j006L334J3915Q527q906p639M946J7067j639k0716O501l183
$$ plain form
11834 16546 10832 16963 18216 7040 -5034 -2819 -12953 -10314 -11432 -11817 2687 6452 18571
11821 18571 19482 3722 243 -6124 -13806 -12484 792 10961 6177 8550 5581 -13542 -21680 -5413
11807 -5413 6046 -4108 -5224 -2678 15275 11304 244 -11308 -8554 -10238 -10875 -11796 -8411 -2352
11793 -2352 -6738 -5378 1551 7110 -13389 -22884 -25734 -21004 -7086 -1735 3367 13045 21211 12708
11779 12708 663 3777 12519 18130 11887 14157 25478 19932 5893 -827 -1649 557 11125 17049
11765 17049 20009 12669 4728 4599 -4461 -10632 -4651 5412 3090 -8511 -15411 -18749 -17999 -3361
11751 -3361 7000 12258 18990 7436 -4207 2909 5506 -10633 -9409 16063 3193 -18553 -25632
11738 -25632 -14209 -15215 -11881 2034 10561 1655 -5984 -1038 16029 14390 -6326 175 -3008
11725c008J858Q680J0431N825j083r165m965p105j7257j561J1447J4919r664J766
11711A118Q553l087m830R656P107q783j6148j293m25l26N576J1249K629j5118
11697d122j6412R238O169L802K804O408l527j159l660j462j1755K914M072j588
11683h278q054m69M827l100M671O024p8j013j540J3J27L776P018L745L673q223
11667C119N612J161R554K108j3023m361K130J106k331K61N425j1877p268K139
11653f245k437J980M097J4625p177m397j731M152o282L346k057N18M817N833j5013
11638e971p847O461K630J115P88m212l135J14o19j3748j0243j457J5528Q695j0507
11623b2408k590J0353j987L975J392J193j0489M069J2561O811n093M02R477J280
$$ plain form
11725 -3008 -1150 7530 17961 23786 22703 13538 8573 1468 -15789 -17350 -5903 9016 -648 1118
11711 1118 9671 6584 1754 11410 18517 9734 -6414 -7707 -8132 -8458 -2882 8367 10996 -4122
11697 -4122 -20534 -11296 -5127 -1325 1479 7887 4360 3201 -459 -1921 -13676 -10762 -6690 -8278
11683 -8278 -16332 -16801 -11974 -15074 -10403 -4379 -4457 -5470 -7010 -6997 -6870 -3094 3924 7669 11342 3119
11667 3119 8731 9892 19446 21554 8531 4170 6300 7406 5075 5336 10761 -1116 -8384 -6245
11653 -6245 -8682 -6702 -2605 12020 4843 446 -1285 2867 -3415 -69 -2126 -1608 3209 9042 -5971
11638 -5971 -13818 -7357 -4727 -3612 -2824 -7036 -10171 -10057 -10676 -24424 -34667 -36124 -20596 -11901 -22408
11623 -22408 -24998 -14645 -16632 -12657 -11265 -10072 -20561 -16492 -3931 2880 -2213 -1811 7666 8946
11609H946j1644n887K0396L773J0132L237j1183r824L773p80J1192J168j0347
11596A2952P81p646k70o130N767O108r26j561l968p467J0217J5843J0125j2439
11582B1386k0831q957L202J4444j5961q348j3102n679J0335O187O675r796M611
11569a5834J0157K414J0897p797N97l804M982J2622M008J254L231p304r964N957
11555A1416k588j1025j4233J2626K082J510l19j876r865k817J0337J7474J1652
11542B4374m517j6903o037N719K297J4598J812q763j9808j0231l970K009Q032
11529a1388k022q62R56P685O100P970K235q730n044j1804n218r654o338J488K2133
11514a2493j448J0070M591j028n196N431Q200J5085J037n577n651j3216q542N809
$$ plain form
11609 8946 -2698 -8585 11811 15584 25716 28953 17770 7946 11719 10939 22131 23299 12952
11596 12952 13733 6087 5817 -313 5454 11562 10636 9075 5107 -2360 7857 23700 33825 21386
11582 21386 555 -8402 -5200 9244 -6717 -15065 -28167 -33846 -23511 -17324 -10649 -20445 -15834
11569 -15834 -5677 -3263 7634 -163 434 -3370 1612 14234 18242 19496 22727 15423 5459 11416
11555 11416 8828 -2197 -16430 -3804 -1722 -212 -531 -2407 -12272 -15089 -4752 12722 24374
11542 24374 19857 2954 -3083 2636 4933 19531 21343 12580 -7228 -17459 -21429 -19420 -11388
11529 -11388 -13410 -14272 -13316 -5631 469 8439 10674 1944 -3100 -14904 -20122 -29776 -36114 -34626 -12493
11514 -12493 -13941 -3871 720 -308 -5504 -73 8127 23212 24249 18672 13021 -195 -8737 -2928
11500b928J4227j492O631J2341k0892p021R179k258J0200K563o53J1929R335k0403
11486B0758j0819p115o645J691k665j7694K864J1523K65j845J0799L994M750K281
11472A2142j768j1058J2025n922j0718J778R844m178j1012J0971N322o794j5179
11459a4547Q945J630N591m458q946j0084o087J1390J0146M083p819q531J1304
11446g383J6693O632J209j1339j3409j0825J0348M356J0554n732l841Q845m570
11433A538o48l782k666P5O28J3846J3461j1475j6332O352m964L381R187K131j2158
11418a426j8016j476M827R715K30p272q708j241P527l031N710L264J962J179l27
11403g083l253R313l460o749R98J3059L38M394k587N726l328r234n791l757K380
$$ plain form
11500 -2928 11299 9807 16438 28779 7887 866 10045 7787 17987 20550 19897 31826 41161 20758
11486 20758 9939 2824 -3821 -2130 -4795 -22489 -19625 -8102 -7837 -9682 1117 5111 9861 12142
11472 12142 10374 -684 11341 5419 -5299 -3521 6323 2145 -8867 2104 7426 632 -14547
11459 -14547 -5602 -3972 1619 -2839 -11785 -21869 -27956 -16566 -6420 -2337 -10156 -18687 -7383
11446 -7383 9310 15942 17151 5812 -7597 -18422 -8074 -3718 6836 1104 -2737 6108 1538
11433 1538 890 -2892 -5558 -5483 -4855 8991 22452 10977 -5355 997 -3967 -586 8601 10732 -1426
11418 -1426 -19442 -20918 -16091 -6376 -6146 -13418 -22126 -23367 -15840 -18871 -13161 -9897 -7935 -6756 -7083
11403 -7083 -10336 -1023 -4483 -11232 -10234 2825 3163 7557 4970 10696 7368 -1866 -7657 -11414 -9034
11388i034J3921p975j0611J5773J0407K79J590j0043K587J1540m063p607k701
11375D063r184j2106o06n470l690J904J5338L037n131M481R207n488p886n962
11361a7493l252J1151J658j982J348m988m703J1239O354O977n947j086l537n423
11347i684o207P028L4n67K879N720p400j1982P257J5371J154l042M099k046R072
11332A1686K479l828Q380r463p611Q50p725q119R138O340r811j1219j910Q64o359
11317b6308n953Q154J0872L551l732j924J6176J1333j771o675n152J8470J0010
11304B7051l586j0138o335l698O583J7012K0453P342N888q460j1227p537j299
11291C2049O882K1j6714k0260O784Q916J936K518j2552j2527Q103J1446j676M446
$$ plain form
11388 -9034 4887 -3088 -13699 2074 12481 12760 14350 4307 6894 18434 14371 6764 4063
11375 4063 -5121 -17227 -17833 -23303 -26993 -25089 -9751 -6714 -11845 -7364 1843 -3645 -11531 -17493
11361 -17493 -20745 -9594 -7936 -9918 -8570 -13558 -18261 -7022 -668 6309 362 -724 -4261 -9684
11347 -9684 -15891 -8863 -8829 -9396 -6517 -797 -8197 -20179 -12922 2449 3603 561 4660 2614 11686
11332 11686 14165 10337 18717 9254 1643 2493 -5232 -13351 -4213 2127 -7684 -18903 -20813 -19949 -26308
11317 -26308 -32261 -24107 -13235 -9684 -13416 -15340 836 12169 10398 3723 -1429 17041 27051
11304 27051 23465 13327 6992 3294 9877 26889 47342 54684 60572 52112 40885 33348 32049
11291 32049 38931 38952 22238 1978 8762 17678 19614 22132 9580 -2947 5156 16602 14926 19372
11277A9372R906q792J556L492m085k416J308N856j9548q020r914k442o44n96J7523
11262B556r39p198P746L605j0812o394q136q436O875l043l911R452M930O668J754
11247e283o5r714n910R416J3708J473j5681j2056J1827K342N497K424N459Q240
11233A1677q137J3681L236L326k129j1487J249j8561o630N258Q146r367Q634K075
11219I71J55j244J0821P844o886O605P910k444l289j7178J422M578M834Q413j2778
11204I734M568p723P330P064J1467K2333N684r362k148J3677q704j7439q264l280
11190B4937o13j664j3795P837K951n382p430l092n45K795n837N653q176j6629
11176a8990N562J000k366M039J2773O369l243n259j1585P483O9m867o447J7687
$$ plain form
11277 19372 29278 20486 22042 25534 21449 19033 20341 26197 6649 -1371 -11285 -13727 -14371 -14967 2556
11262 2556 1617 -5581 2165 5770 -5042 -11436 -19572 -28008 -21133 -24176 -28087 -18635 -13705 -7037 -5283
11247 -5283 -5348 -15062 -20972 -11556 2152 3625 -12056 -24112 -12285 -9943 -4446 -2022 3437 11677
11233 11677 3540 17221 20457 23783 21654 10167 11416 -7145 -13775 -8517 -371 -9738 -1104 971
11219 971 1126 -118 10703 18547 11661 18266 26176 23732 20443 3265 4687 9265 14099 22512 9734
11204 9734 14302 6579 13909 20973 32440 54773 60457 51095 48947 62624 53920 36481 28217 24937
11190 24937 24324 22660 8865 16702 19653 14271 6841 3749 3204 5999 162 5815 -2361 -18990
11176 -18990 -13428 -12428 -14794 -10755 2018 8387 5144 -115 -11700 -4217 -4148 -9015 -15462 2225
11162B225q60n362l108P0J644l584j239j1271r322M849L387L760O383O106J975
11147d347r089l230K170J5227O65r523p22j42R311J223m218J3554j986J404j819
11132H478j0656o241N136l206k473Q184J5171J489l85j0125p494L575m115j5274
11118a7936M641K0164J4975n254j3437l662j2576o306j127J6897P67p440l426
11105a3720q834Q918K4087M791j4672j1114Q255j4157m318J0029j747O208J9832
11092A3558O604o020j5195j3989O486m301j3067j376J0575O463j611M3O864j849
11078f815P161L330j3709r491J1107N686K365r784J386L707q371q446R778J331
11064a0765q771k64R429P811R618m39r982k420L042p722J099O886P490j5783J186
$$ plain form
11162 2225 1365 -3997 -7105 -7035 -5391 -8975 -10214 -21485 -30807 -25958 -22571 -18811 -12428 -6322 -4347
11147 -4347 -13436 -16666 -14496 731 1396 -8127 -8849 -8991 320 1543 -2675 10879 8893 10297 8478
11132 8478 -2178 -8419 -3283 -6489 -8962 -778 14393 15882 15497 5372 -2122 1453 -2662 -17936
11118 -17936 -13295 6869 21844 16590 3153 -509 -13085 -19391 -20518 -3621 -2854 -10294 -13720
11105 -13720 -22554 -13636 10451 15242 570 -10544 -2289 -16446 -20764 -10735 -12482 -6274 13558
11092 13558 20162 14142 -1053 -15042 -8556 -12857 -25924 -27300 -16725 -10262 -11873 -11830 -4966 -6815
11078 -6815 346 3676 -10033 -19524 -8417 -2731 -366 -10150 -8764 -5057 -13428 -21874 -12096 -10765
11064 -10765 -19536 -19800 -10371 -2560 7058 6619 -3363 -5783 -2741 -10463 -9364 -2478 5012 -10771 -9585
11049i585K891P62J671P476J6609M263K599p005k75r287m099j1514l932N483P457
11034C514p019m977n347O077R352M270O55m993j2099J146M735L271M508J2004
11020A5097J9391j0000k0181N813m813P273K083j9347J0870q47j1724R912R675
11007A3202J891l827j6105p911K381J1006J585j2401p620P924L108J4450O606
10994A4289n443j3852J3318j1272l249J7675k727k1181j4104N383J420J2924J5705
10981H886l909n92o039j1487J897o292J2955J1895n365l017p66j447M596K190
10967C505j218j7519k519m445L29M662J0200L174Q187k320j3246n557L965k116
10953a4918k160j0797J1773P582q625j398L438J487m176O277J2545J987o201j4295
$$ plain form
11049 -9585 -6694 -5932 -4261 3215 19824 24087 26686 19681 19406 10119 6020 -5494 -9426 -3943 3514
11034 3514 -3505 -8482 -13829 -7752 1600 5870 6525 1532 -10567 -9421 -4686 -1415 3093 15097
11020 15097 34488 24488 4307 10120 5307 12580 14663 -4684 6186 5339 -6385 3527 13202
11007 13202 15093 11266 -4839 -12750 -10369 637 2222 -10179 -17799 -9875 -6767 7683 14289
10994 14289 8846 -5006 8312 -2960 -6209 11466 8739 -12442 -26546 -21163 -19743 -6819 8886
10981 8886 4977 4385 -1654 -13141 -11244 -17536 -4581 7314 1949 -1068 -1834 -3281 1315 3505
10967 3505 2287 -15232 -17751 -22196 -21867 -17205 -7005 -3831 4356 2036 -11210 -16767 -12802 -14918
10953 -14918 -17078 -27875 -16102 -8520 -17145 -18543 -15105 -13618 -17794 -11517 1028 3015 -3186 -17481
10939a7481p453L211O612L47J4360J1710J515j3530m228J0863r54p220j3741O231
10925i758L28N870j5005j6403l101N785J2297K5420P071j402l528k9815j5916
10912c8157J8083K6919M048M540k537j2972q118J915N620l29o51M453j006r246
10898g438p910J6418M569n766j223M811q775N459K661n297n450K519J600m923
10884h745r478j066J1918J404o829l429Q924J0854l068j7080M812M390O56K52
10870f485o319l228J452l433N776Q355r09m305M951l754p781R567P408n121K0279
10855A6453P84k801j6966n962P552j691j7116J0766J6011K502j4980r453R0J760
10841a3051O528L404P281J4561M067j1594K458Q82p510k159n388j6147j0663J2806
$$ plain form
10939 -17481 -24934 -21723 -15111 -14764 -404 11306 12821 -709 -4937 5926 4972 -2248 -15989 -9758
10925 -9758 -9430 -3560 -18565 -34968 -38069 -32284 -19987 5433 12504 11102 7574 -22241 -38157
10912 -38157 -20074 6845 10893 15433 12896 -76 -8194 -6279 -659 -988 -1639 2814 1808 -7438
10898 -7438 -15348 1070 5639 -127 -1350 3461 -5314 145 2806 -2491 -7941 -5422 -3822 -8745
10884 -8745 -18223 -19289 -7371 -5967 -12796 -16225 -7301 3553 485 -16595 -11783 -7393 -6737 -6485
10870 -6485 -12804 -16032 -14580 -18013 -12237 -3882 -4791 -9096 -4145 -7899 -15680 -6113 1295 -3826 16453
10855 16453 17237 14436 -2530 -8492 -940 -2631 -19747 -8981 7030 9532 -5448 -14901 -14811 -13051
10841 -13051 -6523 -3119 4162 18723 22790 11196 13654 14536 7026 4867 -521 -16668 -27331 -14525
10827a4525K3590J6745j2135m702o4j0336o087k517L07K463p046k125K866J1347
10813b219l089J402O167O70j0975l38j501p2l402M962Q186O306L129j0241j2279
10798a3294L628L443P030K0k788m10L633m222Q96o253P797j0603j4756n922O202
10783b5599P874N294N16l260q253K180M858pK167j899M837M18l283Q304J577j1809
10767a6085K083K922M0Q440O089l988Q110O203J4065q779j7761J2430M027M310
10753B2106N373q175k633j0828p23M519O820m39L230K493l460q737o440J108m377
10738a63K078K779P420m353l69J1226l098k215j35m97q61n403j3564Q90J1051
10723D786L501J68p207o308l745j2198L849P601Q519O94j3837O50K783j2154k573
$$ plain form
10827 -14525 9065 25810 13675 8973 8909 -1427 -7514 -10031 -9724 -7261 -14307 -16432 -13566 -2219
10813 -2219 -5308 -3906 2261 2931 -8044 -8382 -9883 -9955 -13357 -8395 -209 6097 9226 -1015 -13294
10798 -13294 -9666 -6223 807 827 -1961 -2371 1262 -2960 -2064 -8317 -520 -11123 -25879 -31801 -25599
10783 -25599 -17725 -12431 -11915 -15175 -23428 -21248 -16390 -16397 -14230 -16129 -11292 -10874 -14157 -5853 -4276 -16085
10767 -16085 -14002 -11080 -11040 -2600 3489 -499 7611 13814 27879 19100 1339 13769 17796 22106
10753 22106 27479 19304 16671 5843 5120 9639 16459 16020 19250 21743 18283 9546 3106 4214 -163
10738 -163 1915 4694 12114 7761 7392 18618 15520 13305 13170 12673 11812 6409 -7155 -6265 4786
10723 4786 8287 8455 1248 -5060 -8805 -21003 -17154 -9553 -1034 -340 -14177 -13527 -10744 -22898 -25471
10708b5471J524l74J304J8198O994J0992R399j0935j5597Q495Q358l857N079L880
10694A7989J542n074j1005L064M416p01j2372j1473P676L59Q113M177j400L164
10680H475J8165R29j7415k1444n626K358J900L120q480l129L963K722M475N505
10666d482k720J4063J637j2216n942P384J1997r671r494K633o47O472j938k950
10652e874K019L405n790J764K842r544J193J3409K890j549M143K1033j599r805
10638A8537j1741J21L838M036j918l926l608K857m822k749Q136P237j4631o739
10624e372N009K050q842n39Q715p158P663R621n571n809O701r88M526o456p054
10609c504o056p532R841J4909k518j2924j0622r79M938N332J229K654L176o55
$$ plain form
10708 -25471 -23947 -24321 -23017 -4819 2175 13167 22566 11631 -3966 4529 12887 9030 14109 17989
10694 17989 19531 14457 3452 6516 10932 10231 -2141 -13614 -5938 -5579 2534 6711 5311 8475
10680 8475 26640 27569 10154 -11290 -16916 -14558 -12658 -9538 -18018 -21147 -17184 -14462 -9987 -4482
10666 -4482 -7202 6861 8498 -3718 -9660 -2276 9721 50 -9444 -6811 -7458 -986 -2924 -5874
10652 -5874 -3855 -450 -6240 -4476 -1634 -11178 -9985 3424 6314 4765 8908 29941 28342 18537
10638 18537 6796 6917 10755 14791 12873 8947 5339 8196 3374 625 8761 15998 1367 -5372
10624 -5372 -363 1687 -7155 -7694 1021 -6137 1526 11147 5576 -233 6468 5480 10006 3550 -3504
10609 -3504 -9560 -17092 -7251 7658 5140 -7784 -18406 -19385 -14447 -9115 -7886 -5232 -2056 -2711
10595b711J978J2451M256j2636k0208m220M224J1209L732M285J2096K099j1549
10582E006m614o986J733N454k584P634O510P98j3688n445q703P128J0564K728
10568E535o547o531m532J3021M161l787L783m073j334p110P383j278r13p063j1538
10553b0823K856M917Q699N738l55o951J0662j5820J0536J0161l024j7259j0281
10540b0944J0564J3638r459m465o159o81j1008L3896L405j6146k292p13J6243
10527E879P685k6239k678J793M472p481L228K304R918P634j3676k597J0250J3899
10513A4391J6089q818j0391p943J7358L562n700j3131R096P264J635r224K233
10500A6421q712p456O372j056O37l693J155M858J7632O10n382J008n22O531l84
$$ plain form
10595 -2711 -733 11718 15974 3338 -16870 -21090 -16866 -5657 -1925 2360 14456 16555 5006
10582 5006 392 -6594 -4861 593 -1991 5643 12153 12951 -737 -6182 -14885 -7757 2807 5535
10568 5535 -1012 -7543 -12075 946 5107 1320 5103 1030 -304 -7414 -31 -1309 -2222 -9285 -20823
10553 -20823 -17967 -13050 -4351 1387 1032 -5919 4743 -11077 -541 9620 6596 -10663 -20944
10540 -20944 -10380 3258 -6201 -10666 -16825 -17506 -28514 5382 8787 -7359 -9651 -10364 5879
10527 5879 13564 -12675 -15353 -13560 -9088 -16569 -13341 -11037 -1119 6515 -7161 -9758 492 14391
10513 14391 30480 21662 11271 3328 20686 24248 18548 5417 14513 21777 23412 14188 16421
10500 16421 7709 253 6625 5569 6206 2513 3668 8526 26158 26768 21386 22394 21872 28403 28019
10485B8019j6386j1733J0011n452j1252j0602K460J1636k378o666p719P894J7980
10472E812J7078K197r706l440J1464N180j2038j960n031o029K44j199k008J432
10458A996J1147l682j1108j969m496M948P121L680O111o149O594j476o815J1400
10444A7302P046j3509j2488J501J1716J6237P821k512r578o707K263m305j475
10431A3312j035l241q478n800J1062p767Q43J2269O598j876j072j2964j0281l574
10417a2004O509J3283K1030j6707k4565L374J0253k087r19m507m61j841J0031
10404A389j06j1505M283R988J3768j0395p890j549K786R358k053k1333k402R91
10390a4670M56K959J4039o848l397o454P770Q699k52N291L506M009K677N033O246
$$ plain form
10485 28019 11633 -100 9911 4459 -6793 -17395 -14935 -3299 -5677 -12343 -20062 -12168 5812
10472 5812 22890 25087 15381 11941 23405 28585 16547 14587 9556 3527 3771 2572 564 1996
10458 1996 13143 9461 -1647 -3616 -8112 -3164 3957 7637 13748 7599 14193 12717 5902 17302
10444 17302 24348 10839 -1649 -148 11568 27805 35626 33114 23536 16829 19092 14787 13312
10431 13312 12277 9036 558 -5242 5820 -1947 -1104 11165 17763 15887 14815 1851 -8430 -12004
10417 -12004 -5495 7788 28818 12111 -12454 -9080 1173 -914 -1833 -6340 -6801 -8642 1389
10404 1389 1283 -10222 -5939 4049 17817 7422 -468 -2017 769 10127 8074 -13259 -15661 -14670
10390 -14670 -14214 -11255 2784 -4064 -7461 -13915 -6145 2554 2302 7593 11099 15108 17785 22818 29064
10375B9064p617j457q730j4778k303J2219M034j4381j4070j596j174K485J4195
10362d109J1347M16m043j5111k45M964l847N664J3614O51K037k793n06J880n403
10347D516j4376P652P117r597j0087R787L842J5360N317L56k611j313K074k025
10333A6012n470r117k687M495m433M133J667L122p26q893O082J0450K777N844
10319B3256M746O854j1901o211j122L25P207l804l024J77L963J1841p684j3467
10305A1156j299N745n877j4332J445P943m259O684J637N726j23k186R619l794
10291A8085p346j1746J5959P473K207L019j4784m221r400r82J4191r214K596J7660
10277B3497R461P933Q470q835j1424K747J492L194J7236R700P474R575j992n294
$$ plain form
10375 29064 21447 19990 11260 -3518 -5821 6398 10432 -3949 -18019 -19615 -20789 -18304 -4109
10362 -4109 7238 7654 3611 -11500 -11745 -6781 -10628 -4964 8650 9301 11338 8545 8039 9919 4516
10347 4516 -9860 -2208 4909 -4688 -14775 -4988 -1146 14214 19531 19887 17276 15963 18037 16012
10333 16012 10542 1425 -1262 3233 -1200 2933 4600 7722 6996 -1897 4185 14635 17412 23256
10319 23256 28002 34856 22955 16744 15622 15947 23154 19350 16326 16503 20466 32307 24623 11156
10305 11156 9857 15602 9725 -4607 -3162 4781 522 7206 8843 14569 14446 12260 21879 18085
10291 18085 10739 -1007 14952 22425 24632 27651 12867 8646 -754 -1736 12455 3241 5837 23497
10277 23497 32958 40891 49361 40526 29102 31849 33341 36535 53771 63471 70945 80520 78528 73234
10263G3234q316J501K5931K8110J6186K2158J5961K4956K1338L0195J9452K9069
10251B99775L6355M0996M7748M2017P9092R6632J04419J21087J37927J10004N6488
10240A172540j3890p1662n4594j4948K2155J0929o5436j52240j90210j65460j01956
10229C75228n1685m6879m1758k2366j3280j2626k1525k0575j6263j9149j083o600
10217A01439j3491N047j604r864j2113J426n100q983k4908p021m551j2394J696
10204I579J0096J909K069J091J1013l953r122k928j1299Q082Q154K016J294o140
10190B1861L494m732j567l1K927J5546J8646q168k2687j3891o671r681R735N585
10176A0366L71N569M776m543l424n708k400m127r411R98P074K223m581q874K92
$$ plain form
10263 73234 64918 66419 92350 120460 136646 158804 174765 199721 221059 251254 270706 299775
10251 299775 336130 377126 424874 466891 545983 642615 747034 868121 1006048 1116052 1172540
10240 1172540 1158650 1086988 1032394 1017446 1039601 1050530 985094 832854 642644 477184 375228
10229 375228 323543 276664 234906 212540 199260 186634 165109 144534 128271 109122 108039 101439
10217 101439 87948 92995 91391 81527 69414 70840 65740 56757 31849 24828 20277 7883 9579
10204 9579 19675 21584 23653 24744 35757 31804 22682 19754 8455 16537 24691 26707 28001 21861
10190 21861 25355 20623 19056 19025 21952 37498 56144 47976 25289 11398 4727 -4954 4781 10366
10176 10366 10737 16306 21082 16539 13115 7407 5007 880 -8531 -7533 -459 1764 -2817 -11691 -11399
10161a1399N160P169K782m607J203p986p288R45j214P566J2674n118p174M168
10147c119J83J88n270k714J8000p8j1782k74J261N102l414m129j542j0409j1610
10132b9607O511J5858P304J1239k285M530Q18n559q30r451L016L660o43N452R398
10117A9411M840L97l540n543M123R971p635J174J3251O443M645j0719R14J3968
10103E1700J0367K610M246K866R434K4946K2564K9020L4341M4144M3739M0674
10091C20651N6425O0811P1607O5889O5864J01025Q7318O8169M5381L4734M1857
10080A019731Q1563J78099L49693N62706O62808N61871N90375P20580N85828l4123
10070E279131j219955j465207r26311m60887k49700j44772r8325m8561n0888m7598
$$ plain form
10161 -11399 -6239 930 3712 -895 308 -7678 -14966 -14021 -15235 -7669 5005 -113 -7287 -3119
10147 -3119 -2936 -2748 -8018 -10732 7268 7190 -4592 -4866 -3605 1497 -1917 -6046 -7588 -17997 -29607
10132 -29607 -23096 -7238 66 11305 9020 13550 14368 8809 7979 -1472 1544 5204 4561 10013 19411
10117 19411 24251 24648 21108 15565 19688 29659 22024 23198 36449 42892 47537 36818 37732 51700
10103 51700 62067 64677 68923 71789 81223 106169 128733 157753 192094 236238 279977 320651
10091 320651 377076 437887 509494 575383 641247 742272 829590 897759 943140 977874 1019731
10080 1019731 1101294 1279393 1629086 2191792 2854600 3416471 4006846 4727426 5313254 5279131
10070 5279131 4059176 2593969 1667658 1206771 957071 812299 713974 665413 614525 566927
10060E66927n2176n3678l7196l7477l1520m7130l3532j9603k7040j6810l1302
10049A79463l6823k3494n663j7018m046R83j1510J190o305k7357j0714K4070j3796
10036D8980k1509N760J7421k803m782J30m122O372n719m094J4554q439j2351l456
10022B5942J969L994L016r006j8766l460J861J6860l704J6457Q981j4328m471
10009B5345p41j3922k549K766o604j3691J366J5340P310J157l852K072J910o511
9995I396p49O411o21Q806o929j3171m686j1754o20j4002p42J8293Q023K142j0741
9980a0944J2554M124M597k0523k632N455o372L181Q948J4963J9021o461m892Q67
9966B1886o213j0956J596J7915N029p798j4596N5R433q435k611r031n701K401
$$ plain form
10060 566927 514751 461073 423877 386400 354880 307750 274218 254615 227575 210765 179463
10049 179463 142640 119146 113483 96465 92419 93402 81892 83082 76777 49420 38706 62776 48980
10036 48980 27471 33231 50652 47849 43067 43197 39075 45447 39728 35634 50188 41749 29398 25942
10022 25942 27911 31905 34921 25915 7149 3689 5550 22410 18706 35163 44144 29816 25345
10009 25345 24604 10682 8133 10899 4295 -9396 -8030 7310 14620 15777 11925 13997 15907 9396
9995 9396 8647 15058 14437 23243 16314 3143 -1543 -13297 -13917 -27919 -28661 -10368 -2345 -203 -10944
9980 -10944 1610 5734 10331 -10192 -12824 -7369 -13741 -10560 -1612 13351 32372 25911 21019 21886
9966 21886 15673 4717 6313 24228 29257 21459 6863 6918 16351 7916 5305 -3726 -9427 -7026
9952g026n594Q904J7187N965M584n963R09J0439n144n679l390M554q626n622l854
9937A644n336O033J0814O564n368j7494j862J0328O352K191J120r878j6934j2649
9923b4475J1529J9P074O826J033j687K998k353j1151o139l503J4199P005K306
9909C681R92q108q662R195k382j065N734J95J640N248P420K462j9721p282n190
9894a5843R36O177M755J138k432N782M907j2047r079k913J253J1899P041N37l767
9879a656M541o055J528r130K506L89L331k373m935K680J1035p858j2507j2274
9865c0778L423M048q15L468L391J3575l770k312P047j668j58O724l78j7097R153
9850f147L737m024j8815K320O97q219J3877J7649j0155j2016N804K330J0587J1243
$$ plain form
9952 -7026 -12620 -3716 13471 19436 24020 18057 18966 29405 24261 18582 15192 19746 11120 5498 1644
9937 1644 -3692 2341 13155 19719 14351 -3143 -5005 5323 11675 13866 14986 5108 -11826 -24475
9923 -24475 -12946 -12927 -5853 973 2006 319 3317 964 -10187 -16326 -19829 -5630 1375 3681
9909 3681 4673 -3435 -12097 -2902 -5284 -6349 -615 -420 1220 6468 13888 16350 -3371 -10653 -15843
9894 -15843 -14907 -8730 -3975 -2837 -5269 513 5420 -6627 -15706 -18619 -17366 -5467 1574 2111 -1656
9879 -1656 2885 -3170 -1642 -10772 -8266 -7877 -4546 -6919 -11854 -9174 1861 -5997 -18504 -30778
9865 -30778 -27355 -23307 -24122 -20654 -17263 -3688 -7458 -9770 -2723 -4391 -4549 2175 1797 -15300 -6147
9850 -6147 -2410 -6434 -25249 -22929 -22232 -30451 -16574 1075 -9080 -21096 -15292 -12962 -2375 8868
9836H868q16m289p933O756L662n820j2963l790k992o067n008o52J606N354N959
9821a8125J5823K785M270K756j175J130L140j1884q283l333M657R870j9542j1050
9807b8961M306J836R817M285Q480m602N062j3325q677O029j2277m897q941J5429
9793b6436J1819L46K223K374O538l05n090O503O611n391j3261k345J0708k289
9779g995n677k478m693j0254R36J0113J2012l299j6417J7255J4583P832l031J818
9765A0705Q252k795k0158N651O51j4953o805R280L165o942L644J3587k034p897
9751f649j796o378l71j0710Q417J3261J1015Q898j0453o624j453L669j633J670
9737H63j659J4059m836r790p772p085Q20p2o971m814K4575M567O600L195k254
$$ plain form
9836 8868 8052 3763 -4170 2586 6248 428 -12535 -16325 -19317 -25384 -30392 -31044 -29438 -24084 -18125
9821 -18125 -2302 483 4753 7509 6334 7464 10604 -1280 -9563 -12896 -8239 1631 -17911 -28961
9807 -28961 -24655 -22819 -13002 -8717 -237 -4839 223 -13102 -21779 -15750 -28027 -32924 -41865 -26436
9793 -26436 -14617 -14271 -12048 -9674 -3136 -3441 -8531 -2028 4583 -808 -14069 -16414 -5706 -7995
9779 -7995 -13672 -16150 -20843 -31097 -30161 -20048 -8036 -11335 -27752 -10497 4086 11918 8887 10705
9765 10705 18957 16162 -3996 1655 2306 -12647 -19452 -10172 -7007 -13949 -10305 3282 1248 -6649
9751 -6649 -8445 -14823 -15194 -25904 -17487 -4226 6789 15687 5234 -1390 -2843 826 -807 863
9737 863 -796 13263 8427 -1363 -9135 -16220 -15400 -15472 -22443 -27257 -2682 1885 8485 11680 9426
9722I426p280l227q529j136Q26q924j2632r606O487J6511R247J0110p34o975Q177
9707A741J654m39J6804K0166k63j8954j3994q588l950n776r115k058N305J1873
9693e594O475l682r67L016r123m149N909r5J225N445P732Q928m457M123n022Q933
9677A8697J864M011r811K944Q474M543O62j0827N187J3434N47j1842M457j393
9663C0947l253o265k921j443q842m590O165K255P062Q409J264L794P90j5160j9919
9648a707j9304l882O08P564K0087J2256r093J2555k0776p638j886n903o76J5034
9634b761J6605J0632K437p566q860j2477k667L454Q903K807j2106m329J227l356
9620h057J86R728N625j318p823r302L82J1496j0073Q7J2896j213m151l373N184
$$ plain form
9722 9426 2146 -1081 -9610 -10746 -9920 -18844 -31476 -41082 -34595 -18084 -8837 1273 539 -6436 1741
9707 1741 3395 2956 19760 39926 39663 20709 6715 -1873 -5823 -11599 -20714 -22772 -17467 -5594
9693 -5594 881 -2801 -3768 -752 -9875 -14024 -8115 -8210 -6985 -1540 6192 15120 10663 14786 9764 18697
9677 18697 20561 24572 14761 17705 26179 30722 31384 20557 25744 39178 39725 27883 32340 30947
9663 30947 27694 21429 18508 17065 8223 3633 9798 12053 19115 27524 28788 32582 33372 18212 -1707
9648 -1707 -21011 -24893 -24285 -16721 3366 15622 6529 19084 -1692 -9330 -11216 -17119 -17795 -2761
9634 -2761 13844 24476 26913 19347 10487 -1990 -4657 -1203 7700 10507 -1599 -5928 -4701 -8057
9620 -8057 -7871 1857 7482 6164 -1659 -10961 -10579 917 -9156 -9069 3827 2614 -1537 -4910 274
9605B74j3433J269J6945o802o932k687Q779L69J235j2325k705k538J2901P085
9591A435p537j2333l489N64j83q216P377K224K854J95r172q254J3967R562P141
9576c865j947J4R187P469N76k360j0012N095N402o467p236j0647l044Q767P273
9561a795n361L416P16l220r26j3638O616O596O489p985k0004k963R607N009P164
9546a0279M029p667M935J5390m185l622J0706o606n947o508p461P328J0631N16
9532A260r307Q924P368M457Q0J665l890j2340j5345j2276R743Q282K003q723R203
9517h896L699N556R143k680j5759j5072m12P037J1958p883k492J2131p262j1225
9503b2157o533Q343j8519m897K0365J9862L685j1822j0011m566o030l627p242
$$ plain form
9605 274 -13159 -11890 5055 -1747 -8679 -11366 -2587 -2218 -983 -13308 -16013 -18551 -5650 1435
9591 1435 -6102 -18435 -21924 -21360 -21543 -29759 -22382 -20158 -17304 -17109 -26281 -34535 -20568 -11006 -3865
9576 -3865 -5812 -5798 3389 10858 11434 9074 -938 4157 9559 3092 -4144 -14791 -17835 -9068 -1795
9561 -1795 -7156 -3740 -3024 -6244 -7170 -20808 -14192 -7596 -1107 -9092 -29096 -32059 -22452 -17443 -10279
9546 -10279 -6250 -13917 -8982 6408 2223 -1399 9307 2701 -3246 -9754 -17215 -9887 744 1260
9532 1260 -8047 877 8245 12702 12782 14447 10557 -1783 -17128 -29404 -19661 -11379 -9376 -18099 -8896
9517 -8896 -5197 359 9502 6822 -8937 -24009 -24421 -17384 -5426 -13309 -15801 -3670 -10932 -22157
9503 -22157 -28690 -20347 -38866 -43763 -23398 -3536 149 -11673 -21684 -26250 -32280 -35907 -43149
9490d3149O402O375J92N585N58l560j5460q88P539K1461J1418J873r366O131o345
9475a1234l666Q460J268J585O353p97J003K389p494q154J2691J2186j727n7q110
9460D696p119Q10K154N4N298k446j7996P132L197k963j3274M738K316l773k941
9445b0117j904Q950N206N537q306j6823o692O348P246O588J3388P190J1779P185
9431B5575m918p933k3626j5581j569q224P252J4177N349N417L647M938k660P739
9417I583o565k219J0849q351j8347n485J4676J4786J0768n07r848N029L343r159
9403H553j5907n773M069K0452r559l023O98j8043j1658L685J5059K230j252J2279
9389A810j329j4486L064m313n744J1443O024K208n838j9327m045N852J2994K04
$$ plain form
9490 -43149 -36747 -30372 -30180 -24595 -24037 -27597 -43057 -43945 -36406 -14945 -3527 -1654 -11020 -4889 -11234
9475 -11234 -14900 -6440 -5172 -3587 2766 1969 2972 5361 -2133 -10287 2404 14590 12863 12806 4696
9460 4696 -2423 -1613 541 595 5893 3447 -14549 -7417 -4220 -7183 -20457 -15719 -13403 -17176 -20117
9445 -20117 -22021 -13071 -7865 -2328 -10634 -27457 -34149 -27801 -20555 -13967 -579 6611 18390 25575
9431 25575 20657 12724 -10902 -26483 -28052 -36276 -29024 -14847 -9498 -4081 -434 4504 1844 9583
9417 9583 3018 799 11648 3297 -15050 -20535 -5859 8927 19695 19188 9340 14369 17712 8553
9403 8553 -7354 -13127 -9058 11394 1835 -1188 -490 -18533 -30191 -26506 -11447 -9217 -10469 1810
9389 1810 481 -14005 -10941 -15254 -20998 -9555 -3531 -1323 -7161 -26488 -30533 -24681 -11687 -11483
9375a1483K214J4758P054q139r919q159K797l688J2917J1240J2924j2415n979
9362D122K987j0355o676O00R223J637k035J367L735j8411l418p670q37m867K030
9347b8568J1220J4240m820l631J777O716O740k402N870N558o693p85r398M451
9333B75P405l432r389J4689J7102k790k2250K339O322j0697P601k344M729l614
9319E946j990P571P31j2522j726p32L844l49k0992J2159J1658j1082k888n460
9305a5832j509O924P890k779r327Q630N552J0956J324j2074K394q009k028N095
9291b793o063j7548j2770Q945J1810l856M246J4181N164n998P620M807O492J972
9277A6209K209k523K106j8481k961n521l912L020M670p482L313M542K200k441
$$ plain form
9375 -11483 -9269 5489 12543 4404 -5515 -13674 -10877 -14565 -1648 9592 22516 10101 4122
9362 4122 7109 -3246 -9922 -9322 -99 1538 -497 870 4605 -13806 -17224 -24894 -25731 -30598 -28568
9347 -28568 -17348 -3108 -7928 -11559 -9782 -3066 3674 1272 7142 12700 6007 5222 -4176 275
9333 275 7680 4248 -5141 9548 26650 23860 1610 3949 10271 -426 7175 4831 9560 5946
9319 5946 3956 11527 12258 -264 -1990 -2722 1122 773 -20219 -8060 3598 -7484 -10372 -15832
9305 -15832 -17341 -10417 -2527 -5306 -14633 -6003 -451 10505 11829 -245 2149 -5860 -7888 -2793
9291 -2793 -8856 -26404 -39174 -30229 -18419 -22275 -18029 -3848 1316 -4682 2938 7745 14237 16209
9277 16209 18418 15895 18001 -480 -3441 -8962 -12874 -9854 -5184 -12666 -9353 -4811 -2611 -5052
9263e052o642q599J3686K482o700J0865R672n347R658J5933J0535j467j6376j1894
9249A0754J413J6388K582n084j1156j6691r556J309j7467j325R630R706L579L46
9235e572j1917m747L014K3723O888O9j4736K803K190n960k559J4208J756M512
9221A3672o20K593L224Q355J0160O305R63m190l355r337j4459k592R321Q55p933
9206A2962j5387j0938o325M584J0637p370q082j669Q609M319L532m6n820P443
9192c551o323K59Q854P741n451M302R424J7133M729p415j6233N690O832k431M966
9177B8526j373k2326n504n114m811j1620j975J0976j902O635j500j355M664n159
9163a1838Q083R834m946L050l971J343J409q667p94J523P707N262n269j662o053
$$ plain form
9263 -5052 -11694 -20293 -6607 -4125 -10825 40 9712 4365 14023 29956 40491 39024 22648 10754
9249 10754 12167 28555 31137 26053 14897 -1794 -11350 -10041 -27508 -28833 -19203 -9497 -5918 -5572
9235 -5572 -17489 -22236 -19222 4501 11389 11458 -3278 -475 1715 -4245 -6804 7404 9160 13672
9221 13672 13052 15645 18869 27224 37384 43689 44652 40462 37107 27770 13311 10719 20040 20895 12962
9206 12962 -2425 -13363 -19688 -15104 -4467 -11837 -19919 -21588 -12979 -8660 -5128 -5174 -10994 -3551
9192 -3551 -9874 -9615 -761 6980 1529 5831 15255 32388 37117 29702 13469 19159 25991 23560 28526
9177 28526 27153 4827 -677 -5791 -10602 -22222 -24197 -13221 -15123 -8488 -9988 -11343 -6679 -11838
9163 -11838 -3755 6079 1133 4183 212 1555 2964 -5703 -6497 -4974 2733 7995 2726 1064 -4989
9148d989J903L353N381j067Q559M232L597N897l787p039p112K038L705J11J0802
9133B5584q747j160O031M99n62p293r900Q510J1191k239k937K982L38n975p960
9118H362q81Q912J2514n211r862M899J0063P843J3720n75J269j9660j4882o23
9104A5888J0803m520M563L067L352O466j608R594Q233O962Q164J8007Q152K0418
9090A17541K5869K7940N9593N3109M5793N1976O1209O4826O8740R1341Q7744O4135
9078H19816N5443L9323K1003O5136J36965K32734M02176N27924M98838M83970
9068C283328N86846N48954K31294n71796j175271r77973n75209l25635j87641
9059H36897j08559o3698n3387m5793m1909n0164m0450m0723n7798m9556k1476
$$ plain form
9148 -4989 -3086 267 5648 4581 13140 17372 20969 26866 23079 16040 8928 10966 14671 14782 25584
9133 25584 16837 15677 21708 22207 21645 14352 4452 12962 24153 21914 18977 21959 22297 16322 8362
9118 8362 7481 16393 28907 23696 13834 18733 28796 36639 50359 49784 51053 31393 16511 15888
9104 15888 26691 22171 26734 29801 33153 39619 38011 47605 55838 62800 70964 88971 97123 117541
9090 117541 143410 171350 230943 284052 329845 381821 443030 507856 576596 667937 755681 819816
9078 819816 875259 914582 935585 1000721 1137686 1370420 1772596 2300520 2799358 3283328
9068 3283328 3870174 4419128 4650422 4078626 2903355 1925382 1350173 1024538 836897
9059 836897 728338 664640 611253 565460 523551 473387 432937 392214 334416 284860 263384
9048B63384m797j0308l0384k8334l1372j9405m969j0473j1536j5028j1720N914
9036I0972J2664k400j3927M17j3154r966q626q341q196L878j598j0684J0455R499
9022E0993l292j1213l791R561J163j0034p118R328l914l919j54m45n114O11L512
9007B6174Q052P452j5851o329l0O417Q525O835j5969j4127n941M492O779n135
8993A1344r090R182R139K157j018n412k01M926J848p53j9246j4123k783M019J7610
8978G599L402q91P052R8o083J760m048r99K656n715m858J3014N689K548L189j841
8962B2572L243n511j6582J3909R736m202o559j0467j811M696P305M6q504r381
8948a510J1193M918k939o212Q982O671n209l544M200L549l549m352n212Q942M234
$$ plain form
9048 263384 258587 248279 217895 189561 158189 138784 133815 123342 111806 96778 85058 90972
9036 90972 103636 101236 87309 87726 74572 64606 55980 47639 39443 43321 41723 31039 41494 50993
9022 50993 47701 36488 32697 42258 43421 33387 26269 35597 31683 27764 27610 27165 22051 22662 26174
9007 26174 34226 41678 25827 19498 19468 25885 34410 41245 25276 11149 5208 9700 16479 11344
8993 11344 2254 11436 20575 22732 21714 16302 16101 21027 22875 22122 2876 -11247 -14030 -10011 7599
8978 7599 11001 10110 17162 17260 11177 12937 8889 7890 10546 4831 -27 12987 18676 21224 24413 22572
8962 22572 25815 20304 3722 17631 27367 23165 16606 6139 4328 9024 16329 16375 7871 -1510
8948 -1510 9683 14601 11662 5450 14432 21103 15894 12350 16550 20099 16550 12198 6986 15928 20162
8933B0162j1720J210j58j837K100j510k994p92J1732j806j6586j1003J3368J7970
8919A8136J438K687r663m112M31J5281J081J666J530o012p752q175P560j2436
8905A660j4348L277J4970N01j247Q416Q436j1674k0933q912K271O242L969M127
8891c245O205J7473R228k675M634l760n177j4883k861J5400J517j2168N481Q339
8877B3508K796K740R031m121q093o028J0301J3788J5699n455J699J404J4334J8124
8863H9727k6847j9929m3R257O499P890J1336o054q752j3739K020N929o871q323
8849D2100P733J5121J318k450l314M009m229Q05Q791p93j1710j6284n03J1904
8835E2498m07r769P233K231j0764j1681j0335J4369j1041M421K2008K7744J313
$$ plain form
8933 20162 8442 9652 9494 7657 9757 8247 5253 4461 16193 14387 -2199 -13202 166 18136
8919 18136 19574 22261 12598 8486 8917 24198 25279 26945 28475 22463 14711 6536 14096 1660
8905 1660 -12688 -9411 5559 6060 4813 13229 21665 9991 -10942 -19854 -17583 -11341 -7372 -3245
8891 -3245 2960 20433 29661 26986 31620 27860 22683 7800 4939 20339 21856 9688 15169 23508
8877 23508 26304 29044 38075 33954 25861 19833 30134 43922 59621 54166 55865 57269 71603 89727
8863 89727 62880 42951 42908 52165 58664 66554 77890 71836 63084 49345 51365 57294 50423 42100
8849 42100 49833 64954 66272 63822 60508 64517 60288 61093 69884 69091 57381 41097 40594 52498
8835 52498 52091 42322 49555 51786 41022 29341 19006 33375 22334 26755 48763 76507 77820
8822G7820J0066P156J0380M529j6361j3203M028M967J2026N905L847n725k2007
8809H3428k0332j1341J940K80j4425O531p652l419q463J3048K97j9143O19N998
8795B7366o607L658k639j0845j0718k795J7464M76P432j0426l702J060J2160M605
8781B6489N043Q708J0758r105l259J0507K7352P175r600j3604m127O406J526j778
8767F2491m460l282j1702j3259M403K90q995N036r840p640j43L937n56j6774K553
8752B059K625k620p066p684L006M238N395J4339l833J627N71L077M876n854j783
8737A2973J579n38p553P881J601k333J1266L11J737o236r027o239r530J990K662
8722E44P483N106J1598J6991N331o743J341j2322j1784n9J768r83J4768o258j6876
$$ plain form
8822 77820 87886 95042 105422 109951 93590 80387 84415 89382 101408 107313 111160 105435 83428
8809 83428 63096 51755 53695 53975 39550 46081 38429 35010 26547 39595 39892 20749 21368 27366
8795 27366 20759 24417 21778 10933 215 -2580 14884 15360 22792 12366 8664 9724 21884 26489
8781 26489 31532 40240 50998 41893 38634 49141 76493 83668 74068 60464 56337 62743 64269 62491
8767 62491 58031 54749 43047 29788 34191 34481 25486 30522 20682 13042 12899 16836 16280 -494 2059
8752 2059 4684 2064 -5002 -12686 -9680 -5442 -47 14292 10459 12086 12657 15734 20610 14756 12973
8737 12973 14552 14014 6461 14342 15943 13610 24876 25187 26924 20688 11661 5422 -4108 -2118 544
8722 544 8027 13133 24731 41722 47053 40310 41651 29329 17545 17486 19254 18271 33039 26781 9905
8707I905n184L859p506K197Q063m262N025Q126j102N180R656M226j668m580P426
8692C9361P127r608j9475j13m438j4377J375J1520J6742N463n326O733O605j6693
8678B4896N461M818j5033O661P473k674K087K156j5327j5632J6872N609m639Q835
8664C1563l354j8214O652O569K763K1884Q957Q970r354j0289o308J2174j66n099
8650D6748n744K449L03K969Q900J5500J5630p463J1568J759j5617k002j4026k219
8636E8755r150j9871j640l165l222l380J5067M623K464p033j4002q512n022L380
8622I292R363P975J8164p057j2185Q818K652j1566j3655N079O070M942r987o687
8608A1218M976O456r862j0306m204K2405O855q1j0824m16n30J242Q648n956j1013
$$ plain form
8707 9905 4721 8580 1074 3271 11334 7072 12097 20223 19121 24301 33957 38183 36515 31935 39361
8692 39361 46488 36880 17405 17292 12854 -1523 -148 11372 28114 33577 28251 34984 41589 24896
8678 24896 30357 35175 20142 26803 34276 31602 33689 35845 20518 4886 21758 27367 22728 31563
8664 31563 28209 9995 16647 23216 25979 47863 56820 65790 56436 46147 39839 52013 51847 46748
8650 46748 41004 43453 43756 46725 55625 71125 86755 79292 90860 92619 77002 75000 60974 58755
8636 58755 49605 29734 28094 24929 21707 18327 33394 38017 40481 33448 19446 10934 5912 9292
8622 9292 18655 26630 44794 37737 25552 34370 37022 25456 11801 16880 22950 27892 17905 11218
8608 11218 16194 22650 12788 2482 -1722 20683 27538 27457 16633 16217 15687 16929 25577 19621 8608
8593H608P19Q130l224k5729p327K3142J2358l709j588q192Q92N863n016j3665
8579h738Q37K312j252J465J8398o498o126J594j4420j093k18P30o052m791O900
8564a6952J3921R647p629L311O963o264n603m360K766K010J511R912R337j1461
8550G109j5399j1748R168J3378j438p383P266J95L842M935m919j622p4N66j4820
8535a0944k42P038m319l862j015p721N251J5958K370J705l135L84M35J1713M361
8520A7977j8486O752J4941L685j5421L95n078j5039N183K135j3012l307Q700P92
8506i783k235J6011J0758l415j2898K873o541K107J0080j73r703k988J5216P331
8492A6640o619l301j668q938j57O719q449n278Q741Q632Q461p808J290P308L45
$$ plain form
8593 8608 9327 17457 14233 -11496 -18823 4319 16677 12968 11380 3188 4080 9943 4927 -8738
8579 -8738 -7901 -5589 -6841 -5376 13022 6524 398 1992 -12428 -13521 -13739 -13009 -19061 -23852 -16952
8564 -16952 -3031 6616 -1013 2298 9261 2997 -2606 -6966 -4200 -2190 -679 9233 18570 7109
8550 7109 -8290 -20038 -10870 2508 1070 -6313 953 1148 4990 9925 5006 3384 3310 3876 -10944
8535 -10944 -11186 -4148 -8467 -12329 -13344 -21065 -15814 144 2514 4219 1084 1468 1903 13616 17977
8520 17977 -509 6243 21184 24869 9448 9843 4765 -10274 -5091 -2956 -15968 -19275 -10575 -9783
8506 -9783 -12018 3993 14751 11336 -1562 1311 -5230 -3123 6957 6784 -2919 -5907 9309 16640
8492 16640 10021 6720 5052 -3886 -4043 2676 -5773 -11051 -2310 6322 14783 6975 8265 15573 15918
8477A5918P24M007l048n358J2599O217k1805m124K460O635M876N27J1993j0511
8463B1110j0621m316L491M734O276j2207N010J745r477q983j5937Q211J1771J7341
8449A8148O4j1324o304k027J339O52O616Q117K759L824n376l381j4204k014j486
8434d597j462j259J035q560K086L759J0619j125J685M62j4015J601Q417j1242
8420a2596r868R218j994j821K11P726K7894K1417p261k0934j5897l519O097J89
8406a138m311m195j2527j6498J2728J8950Q149J2029O131n180p816m882J3325
8393A4765K3017n224k4928q216M700J0499p21k2430r074k288l169O153M312L940
8379h664R660n305o109l662j294q010q849J3277J358o022J036Q995J6750N442
$$ plain form
8477 15918 16642 20649 17601 12243 24842 31059 9254 5130 7590 14225 19101 19628 31621 21110
8463 21110 10489 6173 9664 14398 20674 8467 13477 15222 5745 -3238 -19175 -10964 807 18148
8449 18148 18212 6888 584 -1443 -104 548 7164 15281 18040 21864 16488 13107 -1097 -3111 -4597
8434 -4597 -6059 -7318 -6283 -14843 -12757 -8998 1621 496 2181 2643 -11372 -9771 -1354 -12596
8420 -12596 -22464 -13246 -15240 -17061 -16850 -9124 18770 40187 32926 11992 -3905 -7424 -1327 -1138
8406 -1138 -5449 -9644 -22171 -38669 -25941 -6991 1158 13187 19318 14138 6322 1440 14765
8393 14765 37782 32558 7630 -586 4114 14613 13892 -8538 -17612 -19900 -23069 -16916 -12604 -8664
8379 -8664 996 -4309 -10418 -14080 -15374 -23384 -32233 -18956 -17598 -23620 -22584 -13589 3161 8603
8365H603j69R248k347j9070q675L572J2244K066k59p627l586k167m01K610K335
8350c623O448q818m598p846J451J8848J5715M277n836j4570r425O56J476j777
8336g622K337J2315O824k277R93l673n42j0373k4428l227J1838J1715K247M195
8322C22k355o365J3334N888j4410j9775k732J5716K5189j736M15l0j4449k367
8308c355j3786o419O816k612J332Q93j2829K30O293J2200R43M945l450j1666K870
8293a7595q63J914p480k408m854l379R745Q624k461k108n071l051k306M844J752
8278b4697k27J6390J1061o149p643J3550J109j1736J473J1379P922K824p714j0775
8264c233J674J8114K1o155j522k303L504N200O326L302k23k686p721n404j4018
$$ plain form
8365 8603 8434 17682 15335 -3735 -12410 -8838 3406 5472 5213 -2414 -6000 -8167 -8568 -5958 -3623
8350 -3623 2825 -5993 -10591 -18437 -16986 1862 17577 21854 16018 1448 -7977 -7321 -5845 -7622
8336 -7622 -5285 7030 13854 11577 12570 8897 8355 -2018 -26446 -29673 -17835 -6120 -3873 322
8322 322 -2033 -8398 4936 10824 -3586 -23361 -26093 -10377 14812 13076 13491 13461 -988 -3355
8308 -3355 -17141 -23560 -16744 -19356 -18024 -17131 -29960 -29730 -23437 -11237 -10294 -5349 -8799 -20465 -17595
8293 -17595 -18458 -16544 -24024 -26432 -31286 -34665 -24920 -16296 -18757 -20865 -25936 -28987 -31293 -26449 -24697
8278 -24697 -24924 -8534 2527 -3622 -11265 2285 3394 -8342 -6869 4510 12432 15256 7542 -3233
8264 -3233 -1559 16555 16576 10421 8899 6596 10100 15300 21626 24928 24705 22019 14298 8894 -5124
8249e124r044O071J169N968K930m67r884K035M765o693j701J2419J2508n256K859
8234A2555L92j30M475l934N933L949p920l490m692j1835m352j410P518M985N655
8219G699k09K22J0715R404j8343j3933J3591J5283Q599j583o429j0861r199q837
8205c881P818j656O639R097J938k698P894n598m464J811J34J536p648r40k476
8190G506N616o050J340m412k3736J781r12Q3R265J9280P291m388j002J343j5618
8175b613j7865k70J7363O736L414P278O215q073r546k6815K717J3484N383K337
8161b55l674P68l840J4221K5092j2851k5915o416l961J1059J1817R301J138j4296
8147B188j1163N275O650m305o039p184J6163P378p931j379J7650N397n809p980
$$ plain form
8249 -5124 -14168 -8097 -6928 -960 1970 1503 -8381 -6346 -1581 -8274 -9975 2444 14952 9696 12555
8234 12555 12947 12817 17292 13358 19291 23240 15320 11830 7138 -4697 -9049 -10459 -2941 2044 7699
8219 7699 7490 7712 18427 27831 9488 -4445 9146 24429 33028 31445 25016 14155 4956 -3881
8205 -3881 3937 2281 8920 18017 19955 17257 25151 19553 15089 16900 17034 18570 10922 9982 7506
8190 7506 13122 7072 8412 4000 -19736 -17955 -18867 -18784 -9519 9761 17052 12664 11662 13005 -2613
8175 -2613 -20478 -20748 -3385 3351 6765 14043 20258 12185 2639 -24176 -21459 -7975 -2592 -255
8161 -255 -3929 -3161 -7001 7220 32312 19461 -6454 -12870 -16831 -5772 6045 15346 16484 2188
8147 2188 -8975 -3700 2950 -1355 -7394 -14578 1585 8963 1032 -347 17303 22700 16891 8911
8133H911O413R310p963l555l509j0367n425K2214M374k4690l50K713m402l308
8119i634M970R91Q868M285r547L660N184Q736r715j821n631j1814J255m624j4392
8104b9229k336R36J4574P704K214J7780J1952M7j407j7099q948N361O189J499
8090I237q906J113J3962J899j5027j848o106L901m747p406j933m057Q242L626
8076h050N33R386J3968j4374n38J4219l623j807P911J408m495r118j4094p01n769
8061a5144k924J1050J3379n193J0229J1737l816J7892N221o356L70m402m895j7924
8047I224q749n513J2127Q520R97J538m155L872l013j9722k002N341o32o593K687
8032f073J4850J4547K101j6877j3457Q044q338M327K6218m850j1998J0468K1909
$$ plain form
8133 8911 15324 24634 16671 13116 9607 -760 -6185 16029 20403 -4287 -4637 -1924 -6326 -9634
8119 -9634 -4664 -3673 5195 9480 -67 3593 8777 17513 7798 5977 346 -11468 -10213 -14837 -29229
8104 -29229 -31565 -30629 -16055 -8351 -6137 11643 23595 23642 22235 5136 -3812 1549 7738 9237
8090 9237 331 1444 15406 17305 2278 430 -5676 -1775 -6522 -13928 -15861 -19918 -11676 -8050
8076 -8050 -7517 1869 15837 1463 925 15144 11521 9714 17625 19033 14538 5420 -8674 -9375 -15144
8061 -15144 -18068 -7018 6361 1168 11397 23134 19318 37210 42431 36075 36445 32043 27148 9224
8047 9224 475 -5038 7089 15609 16606 18144 13989 17861 14848 -4874 -6876 -1535 -2167 -8760 -6073
8032 -6073 8777 23324 25425 8548 -4909 3135 -5203 -876 25342 20492 8494 18962 40871
8019D0871j3470r918o69J072o110j5P79P454l04R840Q73l443p250n990N351Q382
8003B7453q182p368K921J6322R780j647q531p824j848p621j094R640M023o906
7989A9118l884j369K65J022R78l480L419n772j4239j223J0402K413P120k348M265
7974A6687Q259L796o081O387k705J904n222j0650r203N233P395R046p806K88P49
7959A8077M323M96M504r355j2361l679N056J6952n07m879K751q231j0189r753
7945f795j153J2556L909L049J0247L799o886l57K197N549q100l921o809j2072
7931d787k730J734Q876O26l106N719j301n476n014J4625M673J035l579j741m6
7916I508o221r158L019j896r072R153k525j366J7392R07j0624N58K828L265N274
$$ plain form
8019 40871 27401 17483 16814 17886 11776 11761 12540 19994 19690 29530 30403 26960 19710 13720 19071 27453
8003 27453 19271 11903 14824 31146 40926 39279 30748 22924 21076 13455 12361 22001 26024 19118
7989 19118 15234 13865 14130 15152 16130 12650 16069 10297 -3942 -5165 5237 7650 14770 12422 16687
7974 16687 24946 28742 22661 29048 26343 28247 23025 12375 3172 8405 15800 24846 17040 17328 18077
7959 18077 22400 22896 27400 18045 5684 2005 7061 24013 23506 18627 21378 13147 2958 -6795
7945 -6795 -7948 4608 8517 11566 21813 25612 18726 18369 20566 26115 18015 14094 7285 -4787
7931 -4787 -7517 -5783 3093 3719 613 6332 5031 -445 -5459 9166 13839 14874 11295 9554 9508
7916 9508 3287 -5871 -2852 -4748 -13820 -4667 -7192 -8558 8834 9741 -883 -325 2503 5768 11042
7901A1042m469l882Nn963k784L051J9849j0175o833o477j1013M437J4180P823
7887H791K4975N04j5650k7028L572J5529P273q305k722j344l753N779n830l204
7873a413Q258j1587N79l718J0203L664Q126M731k540L921K906j535m432j8976
7859a813k0985M392Q520J8917J4878r170p449J1171j1434m118L897n202J431K027
7845E062j514r338p182l772m278L427j1175o34J946J733j986q081J8593J3190
7831d009j702Q077q012J3831m254L416m585l975j6126J0656L945J1077j89j2515
7817d365R10o888R40Q081l547o477O881o235L768L770r274p865m742J0342j0o386
7801b1097J0354L061o171K232l240n772k824J4814Q876n770n373J163j0791m847
$$ plain form
7901 11042 6573 2691 2696 -3267 -6051 -3000 16849 6674 -159 -6636 -17649 -13212 968 8791
7887 8791 33766 34270 18620 -8408 -4836 10693 17966 9661 6939 5595 1842 7621 1791 -1413
7873 -1413 6845 -4742 -4163 -7881 2322 5986 14112 18843 16303 20224 23130 21595 17163 -1813
7859 -1813 -22798 -18406 -9886 9031 23909 14739 7290 18461 7027 2909 6806 1604 3035 5062
7845 5062 3548 -5790 -12972 -16744 -21022 -17595 -28770 -29404 -27458 -25725 -27711 -35792 -17199 -4009
7831 -4009 -5711 2366 -5646 8185 3931 7347 2762 -1213 -17339 -6683 -2738 8339 8150 -4365
7817 -4365 -3455 -10343 -9403 -1322 -4869 -11346 -4465 -10700 -6932 -3162 -12436 -20301 -25043 -14701 -14711 -21097
7801 -21097 -10743 -7682 -13853 -11621 -14861 -20633 -23457 -8643 233 -5537 -10910 -9747 -20538 -25385
7787b5385J3541J400J169L225N059K630N215o533M10n610J2504R969j882r746
7773E966j9008l615Q527J851P61O270P678R204m168J2008J4522n585K41p177j0598
7758A6877m641Q15j342j2356q869r149L247K353R365R872j738j5412L144Q762
7744I28k782P919O00M418q135l592J1226L119r483q215o688k0413R539L235O556
7729a1768j1922o472J5505M189m323P556k729K057P027Q533K039K8k84K437O718
7714A8591l158o051j0473M042o545M895M634q84N635n257q080r384Q011M219j0011
7699i816M231L504k765J2487r479k0939n327j285K376J1627Q607p47L399j94K794
7684a527m592l923M732k317n41k545N583J3361P206o522k0343j688P597J6361
$$ plain form
7787 -25385 -11844 -10444 -9275 -6050 -991 1639 6854 321 731 -4879 7625 17594 15712 5966
7773 5966 -13042 -16657 -8130 -6279 -5518 752 8430 17634 13466 25474 39996 34411 34652 27475 16877
7758 16877 12236 13051 11709 -647 -9516 -18665 -15418 -13065 -3700 6172 4434 -10978 -7834 928
7744 928 -1854 6065 6665 11083 2948 -644 10582 13701 4218 -3997 -10685 -31098 -21559 -18324 -11768
7729 -11768 -23690 -30162 -14657 -10468 -14791 -7235 -9964 -7907 -880 7653 9692 9720 9436 11873 18591
7714 18591 15433 9382 -1091 2951 -3594 1301 5935 5051 10686 5429 -2651 -12035 -4024 195 -9816
7699 -9816 -5585 -2081 -4846 7641 -1838 -22777 -28104 -29389 -27013 -15386 -6779 -7526 -4127 -4321 -1527
7684 -1527 -6119 -10042 -5310 -7627 -8168 -10713 -5130 8231 15437 8915 -11428 -13116 -5519 10842
7670A0842P994J932n510l816q857q378m004K938K1198K0908m569m475r635j0158
7656F410l857p042o964j0241J1865p613l955N829Q219P601Q76m918o039j531L37
7641a1023O374j357m104k744L319j5826r162Q238M539j1615R716R158k993N350
7627a2130R913J388q788p460p14P209O053P854n766J273J1575l382M331m745j272
7612E339P013q058j4020j695J3341J8102r874r019R6n014q853n222M876Q70j1936
7597b4054L854N205R331N938p543o870L431r369k647M579k634J19N282l889O292
7582a2975K3401N237j818R250J2780j0210j8427j0146j1679q244J3654J3429L108
7569G360Q435Q94n221j6530p263P421P38R257M922j3100j6922L583J0913l022
$$ plain form
7670 10842 18836 20768 15258 11442 2585 -5793 -9797 -6859 14339 35247 30678 26203 16568 6410
7656 6410 2553 -4489 -11453 -21694 -9829 -17442 -21397 -15568 -7349 252 1128 -3790 -9829 -11360 -11023
7641 -11023 -4649 -6006 -10110 -12854 -9535 -25361 -34523 -26285 -21746 -33361 -23645 -14487 -17480 -12130
7627 -12130 -2217 -829 -9617 -17077 -17791 -10582 -4529 3325 -2441 -1168 10407 7025 11356 6611 5339
7612 5339 12352 4294 -9726 -11421 1920 20022 10148 1129 1225 -3789 -12642 -17864 -12988 -12118 -24054
7597 -24054 -20200 -14995 -5664 274 -7269 -14139 -10708 -20077 -22724 -18145 -20779 -20660 -15378 -19267 -12975
7582 -12975 10426 15663 13845 23095 35875 25665 7238 -2908 -14587 -22831 -9177 4252 7360
7569 7360 15795 16689 11468 -5062 -12325 -4904 -4166 5091 10013 -3087 -20009 -16426 -5513 -8535
7555h535L144r757p313K492M183O364Q534o93O065N502n18j1393p041K2398l990
7540I442j4063K085J0548L090j5620j4380j2611N372K0101P17K72n557J0425J4715
7526A4536n407j0268N646k16K431J473n802P49n510O467k104k670n358r863L032
7511a2864j017m891L262O838k400L739o411O09M538K971j0330o228N418j109O103
7496a1772N557n597o415N680O680K77J1657J263Q380m956L316m161j0200J0163
7482I872N948m92K802L008q85J325j3061K213k519r25j278o069k349j864j811
7467f085o00K027p714q510K388J1432q452K059L898J78O668K157l534m942O594
7452b436N769r751o843J257l39K665n341o624j834Q713J2398n315j6484l374O414
$$ plain form
7555 -8535 -5391 -15148 -22461 -19969 -15786 -9422 -888 -1581 4484 9986 9468 -1925 -8966 13432 9442
7540 9442 -4621 -2536 8012 11102 -4518 -18898 -31509 -26137 -6036 -5319 -5047 -10604 -179 14536
7526 14536 9129 -1139 4507 4291 6722 8195 2393 3142 -2368 4099 1995 -675 -6033 -15896 -12864
7511 -12864 -13881 -18772 -15510 -8672 -11072 -7333 -13744 -13135 -8597 -5626 -15956 -22184 -16766 -17875 -11772
7496 -11772 -6215 -11812 -18227 -12547 -5867 -5590 6067 7330 15710 10754 14070 9909 -291 9872
7482 9872 15820 15328 18130 21138 20253 21578 8517 10730 8211 7286 6008 -61 -2410 -4274 -6085
7467 -6085 -6685 -4658 -12372 -20882 -18494 -7062 -15514 -13455 -9557 -9379 -2711 -554 -4088 -9030 -2436
7452 -2436 3333 -6418 -13261 -12004 -12343 -9678 -15019 -21643 -23477 -14764 -2366 -7681 -24165 -27539 -21125
7437b1125O748M980l596j783P674K179j478o66r666N170J448Q179O859K807j0760
7422c030J320k14L033o405O391p450m864n538J0350J7157n52n372j1447n720J684
7407a0657R939j0144j3234N473P143N0M549K873q95O562q395L921k815m871Q98
7392i603O494J9083P63J509J0705P805J0169j2448k4442j5016r906l059N378N36
7378a2032K925J1056N44N22o226Q07J2356J7566M497j039l369j3861P43j204j4327
7363a042p858m896L446J5172m721j620Kp134j221N265J842n112P794Q637j3333
7348d779k318n835j3373L788R350o31N044m60j643j4278J5752J0988j4001o689
7334a9085L614J643N486l62o71n489k217M290O187o432m865P420J6344N490J623
$$ plain form
7437 -21125 -14377 -9397 -12993 -14776 -7102 -4923 -6401 -7067 -16733 -11563 -10115 -1936 4923 7730 -3030
7422 -3030 -1710 -1924 1109 -5296 1095 -6355 -11219 -16757 -6407 10750 10198 4826 -6621 -12341 -10657
7407 -10657 -718 -10862 -24096 -18623 -11480 -11430 -6881 -4008 -4903 1659 -6736 -2815 -5630 -10501 -9603
7392 -9603 -3109 15974 16737 18246 28951 36756 46925 34477 10035 -4981 -14887 -17946 -12568 -12032
7378 -12032 -9107 1949 2493 3015 -3211 -2404 9952 27518 32015 30976 27607 13746 14489 13285 -1042
7363 -1042 -8900 -13796 -10350 4822 101 -1519 -1517 -8651 -9872 -4607 -2765 -7877 -83 8554 -4779
7348 -4779 -7097 -12932 -26305 -22517 -13167 -13798 -8754 -9214 -10857 -25135 -9383 1605 -12396 -19085
7334 -19085 -15471 -13828 -8342 -8704 -9375 -14864 -17081 -12791 -6604 -13036 -17901 -10481 5863 11353 12976
7319A2976m59O64N813m702m136P69k8754p171N653O959K067R543n031l226o14
7304i649J2996m455j064j799K628O579j0707l486O03p881q078k592J0137k174
7290a8942L869k130n03K261Q817R742L451l870l724k030K033J0940N698q863n292
7275A457K28r734l951j3623n835J2380M911j1856o510k621J5440L462j45k436
7261a8833L87J1401P980N866J541m476q192r035K274o436k373M810M983J3865
7247C762M118q782j7987l862L708J2954J4238J2464J751j5143o657p46Q983m951
7233C850m667P16q382q464p004M437J0912K150L235O50m965p699l69J0667M688
7218b45j7169k2448O594J3413N309J6608J970N100j1934j6174k039J7744J1385
$$ plain form
7319 12976 12517 13181 18994 14292 10156 10925 -17829 -25000 -19347 -12388 -10321 -778 -5809 -9035 -9649
7304 -9649 3347 -1108 -2172 -3971 -1343 5236 -5471 -8957 -8354 -16235 -24313 -26905 -16768 -18942
7290 -18942 -15073 -17203 -17706 -15445 -6628 3114 6565 2695 -1029 -3059 -1026 9914 15612 6749 1457
7275 1457 1685 -8049 -12000 -25623 -31458 -19078 -14167 -26023 -32533 -35154 -19714 -16252 -16397 -18833
7261 -18833 -18446 -7045 935 6801 8342 3866 -4326 -13361 -11087 -17523 -19896 -15086 -10103 3762
7247 3762 7880 -902 -18889 -22751 -19043 -6089 8149 20613 22364 7221 564 -182 8801 3850
7233 3850 -817 -101 -8483 -16947 -23951 -19514 -8602 -6452 -3217 -2567 -7532 -15231 -15600 -4933 -245
7218 -245 -17414 -39862 -33268 -19855 -14546 2062 4032 9132 -2802 -18976 -21015 -3271 8114
7205H114O25M386K06k196J205L808k0680j0637L813J0732m016N601j75r717o253
7190a5184p501Q771N329J361r432j529O050L042J0175Q777m080j514o537j5262
7176a7534p631J1571Q861k941n193K538r271J2205L393k464l095L391J1379J2812
7162A8021N168O571M306j1659o805o682j0497p049L597j137J79J212M260p929
7148h444j0646M396J2878J2618k234L006L909j0575j4167m916r9M531o969j9907
7134c6619k552J5545R676L545R909J332j0573j1110P385M268L630J165J0230q151
7120b320j5230J1271J3599J0480L595q926j1808R32j592J784m374N415J3916J4897
7106C1639l308m883k613j4177j8317n672J718J1838k18j1951r126J1581K366K269
$$ plain form
7205 8114 8739 13125 13331 11135 12340 16148 -4532 -15169 -11356 -624 -4640 961 786 -8931 -15184
7190 -15184 -22685 -13914 -8585 -7224 -16656 -18185 -12135 -9093 1082 9859 5779 4265 -2272 -17534
7176 -17534 -25165 -13594 -4733 -7674 -12867 -10329 -19600 -7395 -4002 -6466 -9561 -6170 5209 18021
7162 18021 23189 29760 34066 22407 15602 8920 -1577 -8626 -5029 -6166 -5987 -4775 -515 -8444
7148 -8444 -19090 -14694 -1816 10802 8568 11574 15483 4908 -9259 -14175 -14274 -9743 -16712 -36619
7134 -36619 -39171 -23626 -13950 -10405 -496 836 -9737 -20847 -13462 -9194 -5564 -4399 5831 -2320
7120 -2320 -17550 -6279 7320 17800 21395 12469 661 1593 1 1785 -2589 2826 16742 31639
7106 31639 28331 23448 20835 6658 -11659 -17331 -15613 -3775 -3993 -15944 -25070 -13489 -11123 -8854
7092h854n55K646J0117k828j0463j612N874K377K2518p466j0918j53O331M077
7078A1091p806n921R001r597q009N470J2180k587J47J409J2294p846m855o730
7064a759J0599o159j0217J1165k250o762N463k859m720J2366J268q112j4408J3141
7050c244L359r545o873J9124J1823j906n812L040O983j114j0698k203o664n077
7036h807p365N27K308n005K407L009J0328j476j73J8120J875j1115m191j058j2214
7021a2830J495P185R384M272Q074m948p421k440l491m669K570P348J966j800j4703
7006a0008j2l296J661J0203P629p061K829P206m828j3915l074N152K609k19j460
6991f584R883j0375o093n741K430M423P436p194m764N084K902K601n374Q888n88
$$ plain form
7092 -8854 -9409 -6763 3354 526 -9937 -11549 -5675 -3298 19220 11754 836 683 7014 11091
7078 11091 3285 -2636 6365 -3232 -11241 -5771 6409 3822 3969 5378 17672 9826 4971 -1759
7064 -1759 8840 2681 -7536 3629 1379 -5383 80 -2779 -7499 4867 6135 -1977 -16385 -3244
7050 -3244 115 -9430 -16303 2821 14644 12738 6926 9966 16949 15835 5137 2934 -3730 -8807
7036 -8807 -16172 -15645 -13337 -18342 -15935 -12926 -2598 -4074 -4247 13873 15748 4633 442 -616 -12830
7021 -12830 -11335 -4150 5234 9506 17580 12632 5211 2771 -720 -5389 -2819 4529 6495 4695 -10008
7006 -10008 -10020 -13316 -11655 -1452 6177 -884 1945 9151 4323 -9592 -12666 -7514 -4905 -5124 -6584
6991 -6584 3299 -7076 -13169 -18910 -16480 -12057 -4621 -11815 -16579 -11495 -8593 -5992 -11366 -2478 -3066
6976c066R669j0309j2180P706J6540O337Q552l118k269O405o573k142P829K007
6962B5388j3092k3923n557O925J226J2019J0885M706R706J449Q370k0447j2395
6949E260P62j4910m8Q121M10l162J5360P147q437j3629l890J2815M69p731r934
6934a1397k19O54n86K055r73l58J0221O980L038r51o082Q680k287m160o698k24
6918b307N475K419j6214l042K390J4344l927p552P864J8084j1827k8035o70P481
6904a5517O286J5249N67o655R161J974M489M031j2104k735j2315j565J751j225
6890h608J0145k020j1637k394J4042J3468N046L520j488K919J480o367R94k893
6876A6207j2810m044j941j1386L395K655O572l847n892L430M614l126K619J345
$$ plain form
6976 -3066 6603 -3706 -15886 -8180 8360 14697 23249 20131 17862 24267 17694 15552 23381 25388
6962 25388 12296 -11627 -17184 -10259 -9033 2986 13871 18577 28283 29732 38102 17655 5260
6949 5260 6022 -8888 -8936 -815 -405 -3567 11793 18940 10503 -3126 -7016 5799 6268 -1463 -11397
6934 -11397 -11616 -10962 -11548 -9493 -10466 -10824 -603 6377 9415 8464 2382 11062 8775 4615 -2083 -2307
6918 -2307 3168 5587 -10627 -13669 -11279 3065 -862 -8414 -550 17534 5707 -22328 -22998 -15517
6904 -15517 -9231 6018 6585 -70 9091 11065 15554 19585 7481 4746 -7569 -9134 -7383 -8608
6890 -8608 1537 -483 -12120 -14514 -472 12996 18042 21562 20074 22993 24473 18106 19100 16207
6876 16207 3397 -647 -2588 -13974 -10579 -7924 -1352 -5199 -11091 -7661 -3047 -6173 -3554 -2209
6862b209K671O422p513k107M643R973j006o749r58R103j2146q975R172L574l831
6847F4j4409r073O251P204K375O146k470J0202O737n392k318o852n31N838l318
6832D54k865J279L228L838M119o64n766N952j805j2716O525j168L12o059J833
6817c503J4749P176Q63m803r624K277j243j0036m05N95q84O778J519M932r402
6802a011l278J1983J1370l596j2292m972Q433L891j686J2379O004K390l469N604
6788C1750N065O910o78m792J6345K678n724k2250j1107m741M733P608j4871r367
6774A559L807O319L338j0218k893N537j8929M315N621J3j0982l679l823n484J0331
6759a5168k788n023P474Q3P400J8004m849j5329r162O972J0136K350K35r375j4838
$$ plain form
6862 -2209 462 6884 -629 -2736 1907 11880 10874 4125 3167 12270 124 -8851 321 3895 64
6847 64 -14345 -23418 -17167 -9963 -7588 -1442 -3912 6290 13027 7635 5317 -1535 -2066 3772 454
6832 454 -2411 -1132 2096 5934 10053 9389 3623 9575 7770 -4946 1579 411 723 -5336 -3503
6817 -3503 11246 18422 19285 14482 4858 7135 5892 -4144 -4549 -3954 -4838 1940 3459 8391 -1011
6802 -1011 -4289 7694 19064 15468 3176 -1796 6637 10528 8842 21221 27225 29615 26146 31750
6788 31750 36815 43725 43047 38255 54600 57278 51554 29304 18197 13456 18189 25797 10926 1559
6774 1559 5366 11685 15023 4805 1912 7449 -11480 -7165 -1544 -1531 -12513 -16192 -20015 -25499 -15168
6759 -15168 -17956 -22979 -15505 -15422 -8022 9982 5133 -10196 -19358 -12386 -2250 100 335 -9040 -23878
6744b3878P85J3354p78n866J1035L704R113J3055J139n295j5334o327r788n29
6730a5610J0853m099j1097m798O034J1041j5681R523R581j149n706J212j651j2514
6716b4061j3009k359J1877L1351K4369r003k4650o522P944J0032m717N437L427
6703A0116J283q88K36J0206O80k2483j0119P180K299K50j6669k655J5416m65j7396
6688b3009K100J0067M632L438M084N987n033O440L208k9609p711P481P936j497
6674a1486P013J6268R338l883l535p895j0728J512j014N44l309l883J4371O138
6660I451K58n386L718j406o451j2614O82O970m258m149J2762j672p758j220K994
6645h079j243r353j394j4704N131J0950n077K442N571J681R281n237P44k473j1427
$$ plain form
6744 -23878 -23093 -9739 -10517 -16383 -5348 -1644 7469 20524 21663 16368 1034 -5293 -15081 -15610
6730 -15610 -4757 -8856 -19953 -24751 -18717 -7676 -23357 -13834 -4253 -5402 -11108 -9896 -11547 -24061
6716 -24061 -37070 -39429 -27552 3799 28168 19165 -5485 -12007 -4063 5969 1252 6689 10116
6703 10116 11399 10511 10747 20953 21633 -850 -10969 -3789 -1490 -1240 -17909 -20564 -5148 -5613 -23009
6688 -23009 -20909 -10842 -6210 -2772 1312 7299 2266 8706 11914 -17695 -25406 -17925 -9989 -11486
6674 -11486 -4473 11795 21133 17250 13715 5820 -4908 -3396 -4410 -3866 -7175 -11058 3313 9451
6660 9451 9709 4323 8041 6635 184 -12430 -11748 -4778 -9036 -13185 -423 -2095 -9853 -11073 -8079
6645 -8079 -9322 -18675 -20069 -34773 -29642 -18692 -23769 -21327 -15756 -14075 -4794 -10031 -9287 -11760 -23187
6630b3187k651P371j240o422J9500J1905j63O981o475M224M679k221q023j3677
6616i399L057M332K54q290N044K2137j2583k0643j50k948N593J2942J958o943
6602e639J1380l625m430j0506R175L340J2947j010L284p067o735j4449k713O718
6588i330l34j0214L79J1771J0979o862O300q005k2487j0846J3283O129J3972J0357
6574E092O260p296o683M949p190K123J0295q540j1790M279K026j0684k518J461
6560a8216o80J2221r079J018l606O616N449o154k086J5038N904J475K945j4671
6546c826m821J1556K685Q38Q60n483o399p689j6058m519J0604J1103K066j832
6532a0915j501M914L76J0894Q09q364J0377K331j992L240R263m776K415N945l315
$$ plain form
6630 -23187 -25838 -18467 -19707 -26129 -6629 5276 5113 12094 5619 9843 14522 12301 4278 -9399
6616 -9399 -6342 -2010 -1756 -10046 -5002 17135 4552 -16091 -16241 -19189 -13596 -654 1304 -5639
6602 -5639 5741 2116 -2314 -12820 -3645 -305 12642 11632 14916 7849 1114 -13335 -16048 -9330
6588 -9330 -9664 -19878 -19499 -7728 3251 -3611 2689 -5316 -27803 -38649 -25366 -19237 -5265 5092
6574 5092 11352 4056 -2627 2322 -4868 -2745 7550 -990 -12780 -8501 -6475 -17159 -19677 -18216
6560 -18216 -18896 -6675 -15754 -14736 -18342 -11726 -6277 -12431 -14517 521 6425 7900 10845 -3826
6546 -3826 -8647 2909 5594 6432 7292 1809 -4590 -12279 -28337 -32856 -22252 -11149 -9083 -10915
6532 -10915 -12416 -7502 -7126 3768 4577 -3787 6590 8921 6929 10169 19432 14656 17071 23016 19701
6517A9701l570l856j7292p21M264K436r357N719O514n162j0723j1333L801r24
6503b0503j7273O039J7557J4830O905J110j3184K874M27J0799l501L854K727M798
6489A7459Q188m441r942o091j328j159j893o118M532O313K544o302p851K176J4690
6474A0777P95l212k066j5233k042M847O785j0448n293J0006P358j7568q941J8965
6460e270J2443L97o110l583N854m980m189J0235J19M325K603j2907n645N453Q729
6445G474J824R133p123j0231K529o634k353k748q087J3605J2527k473n605M865
6431F703n409p892l436M008m884J1576J0901K190N82p111k880J5247N349n671
6417A9273M190n956j8450r405J003Q139J796J3456L814p079j5361M115l854j7870
$$ plain form
6517 19701 16131 12275 -5017 -5738 -1474 962 -8395 -2676 3838 -1324 -12047 -23380 -19579 -20503
6503 -20503 -37776 -31737 -14180 650 7555 8665 -4519 -1645 -1218 9581 6080 9934 12661 17459
6489 17459 25647 21206 11264 5173 3845 2686 793 -5325 -793 5520 8064 1762 -6089 -3913 10777
6474 10777 11572 8360 6294 -8939 -10981 -6134 651 -9797 -15090 -5084 2274 -15294 -24235 -5270
6460 -5270 7173 7570 1460 -2123 3731 -1249 -5438 4797 4916 9241 11844 -1063 -6708 -1255 7474
6445 7474 9298 18431 11308 1077 3606 -3028 -5381 -8129 -16216 -2611 9916 7443 1838 6703
6431 6703 1294 -6598 -10034 -6026 -10910 666 11567 13757 14339 7228 4348 19595 24944 19273
6417 19273 23463 17507 -943 -10348 -9345 -1206 590 14046 17860 10781 -4580 -465 -4319 -22189
6403b2189k827J1773M918O934Q701j933j1301j0759k867N403J645j800J0841P570
6389D109M845N406p617q181Q27L295J1373o074r216j3706j3329N377N865n62P45
6374a6843J9624K193k974J1715L508l761O666p252n800j5283j437l078N521J1553
6360D352m675K111R927K622M376q521n878l825r133q78J2834P7m214k856L223
6345d58J329K842M303N142K72P593r44j3441j815L196p995n252l693q555n234
6330b2710q005J1566J3828j30k723M703J496q646m011J2516K429j3276j4048L132
6316b3879o83m684L932p744J0904k781j0861m604K1479J2042O83J5969K761p313
6302E221L54j984j4371M534J740j5804K300J2627N511j5769O5Q932J0294J242
$$ plain form
6403 -22189 -25016 -13243 -8325 -1391 7310 5377 -5924 -16683 -19550 -14147 -12502 -14302 -3461 4109
6389 4109 8954 14360 6743 -1438 -611 2684 14057 7983 -1233 -14939 -28268 -22891 -17026 -17588 -16843
6374 -16843 2781 4974 2000 13715 17223 13462 20128 12876 7076 -8207 -9644 -12722 -7201 4352
6360 4352 -323 1788 11715 14337 18713 10192 4314 489 -8644 -9522 3312 3389 -825 -3681 -458
6345 -458 871 3713 8016 13158 13430 21023 20079 6638 4823 8019 24 -5228 -8921 -17476 -22710
6330 -22710 -30715 -19149 -5321 -5451 -8174 -3471 -1975 -10621 -14632 -2116 313 -12963 -27011 -23879
6316 -23879 -24562 -29246 -25314 -33058 -22154 -24935 -35796 -40400 -18921 -6879 -6196 9773 12534 5221
6302 5221 5575 3591 -10780 -6246 -4506 -20310 -18010 -5383 128 -15641 -15576 -6644 3650 4892
6288D892q820J4653J6296M555k3021j0619O586J913P083L00j2596Q28q64j2650
6274a1464K043M38L994K855P248l950o499J0105K925N334J2027O582O165n27j5647
6259B1629j0278K777M1p066Q852Q798k0111q987L463J2760r641j920k01j4629
6245a4513j453k169L481l275r1M86J0524j666j720R176l41l417k349N450J0425
6230H548p276J36j3823J792q35q123l161P686J2236K735k0265k124J2121J2876
6216B523j029N9J989J0630J1615o796j1807j6504Q635J783J0432j5658q903O253
6202f778R621P199L319k931L902J1418m629j3010j8799p557J4295L965o676n416
6188a2077J0309p526K436M294m182N944n146L935J698J1740l495K654l172J0820
$$ plain form
6288 4892 -3928 10725 27021 31576 8555 -2064 4522 6435 13518 13818 1222 2050 1186 -11464
6274 -11464 -9421 -8983 -4989 -2134 5114 1164 -5335 4770 7695 13029 25056 31638 37803 37276 21629
6259 21629 11351 14128 14169 7103 15955 24753 4642 -4345 -882 11878 2237 317 116 -14513
6245 -14513 -15966 -18135 -14654 -17929 -18020 -17534 -7010 -8676 -10396 -1220 -1561 -4978 -7327 -1877 8548
6230 8548 1272 1408 -12415 -10623 -11458 -19581 -22742 -15056 -2820 -85 -20350 -22474 -10353 2523
6216 2523 1494 1553 3542 14172 25787 18991 7184 -9320 -685 1098 11530 -4128 -13031 -6778
6202 -6778 2843 10042 13361 10430 14332 25750 21121 8111 -10688 -18245 -3950 15 -6661 -12077
6188 -12077 -1768 -9294 -6858 -2564 -6746 -802 -5948 -2013 -315 11425 7930 10584 7412 18232
6174A8232p580j0972o17J0484q592R063N981j160p199Q633r86j6707m903P321
6160I98Q446r64p268M202L104j0082o225J123k548j1545n830J754M747M36k576
6145b2228p427O667R363J4456J806q692j619L618j7521l709O600P531q714J2161
6131g708J3866n721j4254j0441n532M537J6144J8609j5263o840J479J1440K437
6118B753m243Q216p677j0677q657q544J6570J5660j12l461P154n767r690j1996
6104b0471k380L962Q121k793k841q44L006o02r08P059k719p696J1748K579k1130
6089b5909J761J7465N563J547L003j432j1793n042L466k529M640P347r878r522
6075b1313P321L380m918J7805J2724n764J129k616m35n298J9823k596k2295j4992
$$ plain form
6174 18232 10652 -320 -937 9547 955 10018 15999 14839 7640 16273 15287 -1420 -6323 998
6160 998 9444 8480 1212 5414 8518 -1564 -7789 -6666 -9214 -20759 -26589 -24835 -20088 -19652 -22228
6145 -22228 -29655 -22988 -13625 831 2637 -6055 -7674 -4056 -21577 -25286 -18686 -11155 -19869 -7708
6131 -7708 6158 437 -13817 -24258 -29790 -25253 -9109 9500 -5763 -12603 -11124 316 2753
6118 2753 -1490 6726 -951 -11628 -20285 -28829 -12259 3401 3289 -172 6982 1215 -8475 -20471
6104 -20471 -22851 -18889 -10768 -13561 -16402 -17246 -14240 -14842 -15750 -8691 -11410 -19106 -7358 -4779 -25909
6089 -25909 -24148 -6683 -1120 427 3430 1998 -9795 -14837 -11371 -13900 -9260 -1913 -11791 -21313
6075 -21313 -13992 -10612 -15530 2275 14999 9235 10364 7748 7313 2015 21838 19242 -3053 -18045
$$ [...]
##END NTUPLES=NMR SPECTRUM
##END=
