##TITLE=Analysis number 326409
Compound Code cc 48316
Book Reference 470/160
Project Code adrs
Chemist Name mikem
##JCAMPDX= 6.0         $$ Bruker NMR JCAMP-DX V2.0
##DATA TYPE= NMR SPECTRUM
##DATA CLASS= NTUPLES
##ORIGIN= Bruker BioSpin GmbH
##OWNER= nmr
$$ XWIN-NMR		Version 3.5
$$ Tue Feb  6 12:20:51 2007 GMT Standard Time (UT+0h)  MAYBRIDGE\nmr@NMR_250MHZ
##.OBSERVE FREQUENCY= 250.131544655141
##.OBSERVE NUCLEUS= ^1H
##.ACQUISITION MODE= SIMULTANEOUS (DQD)
##.ACQUISITION SCHEME= undefined
##.AVERAGES= 16
##.DIGITISER RES= 18
##SPECTROMETER/DATA SYSTEM= dpx250
##.PULSE SEQUENCE= zg30
##.SOLVENT NAME= CDCl3
##.SHIFT REFERENCE= (INTERNAL, CDCl3, 0, 16.522)
##AUDIT TRAIL= $$ (NUMBER, WHEN, WHO, WHERE, WHAT)
$$ ##TITLE= Audit trail, XWIN-NMR		Version 3.5
$$ ##JCAMPDX= 5.01
$$ ##ORIGIN= Bruker BioSpin GmbH
$$ ##OWNER= nmr
$$ C:\u/data/dgb/nmr/ADRS/390/pdata/1/auditp.txt
$$ ##AUDIT TRAIL=  $$ (NUMBER, WHEN, WHO, WHERE, WHAT)
(   1,<2007-02-06 12:20:25.35 +000>,<MAYBRIDGE\nmr>,<NMR_250MHZ>,
      <created by zg, POWCHK disabled, PULCHK disabled
       configuration hash MD5:
       49 4B E0 1D 92 C2 6B 37 9F E6 65 BC 52 41 86 1D
       data hash MD5: 64K
       71 87 E3 F8 F6 10 DC 39 37 8D 5A A9 20 4C B5 E8>)
(   2,<2007-02-06 12:20:36.77 +000>,<MAYBRIDGE\nmr>,<NMR_250MHZ>,
      <Start of raw data processing
       ef LB = 0.3 FT_mod = 6 PKNL = 1 SI = 32K 
       data hash MD5: 32K
       70 C8 94 46 E6 06 C6 70 9B 50 EF 95 2D 07 36 64>)
(   3,<2007-02-06 12:20:38.49 +000>,<MAYBRIDGE\nmr>,<NMR_250MHZ>,
      <apk 
       data hash MD5: 32K
       65 AC 42 25 9D 6E A2 68 CF 76 B1 7C 36 76 0C E2>)
(   4,<2007-02-06 12:20:39.24 +000>,<MAYBRIDGE\nmr>,<NMR_250MHZ>,
      <abs ABSG = 5 
       data hash MD5: 32K
       CB 8C CE 2C 4D 11 B1 A2 30 52 6D CE A8 F6 4D 45>)
$$ ##END=
$$ 
$$ hash MD5
$$ 98 0E D7 05 BF B8 BC 81 D3 7A B1 EE 1B BB D3 3E
##$RELAX= 
##$RELAX= 
##$RELAX= 
##$RELAX= 
##$RELAX= 
##$RELAX= 
##$RELAX= 
$$ Bruker specific parameters
$$ --------------------------
##$DU= <C:\u>
##$EXPNO= 390
##$NAME= <ADRS>
##$PROCNO= 1
##$TYPE= <nmr>
##$USER= <dgb>
##$AMP= (0..31)
100 100 100 100 100 100 100 100 100 100 100 100 100 100 100 100 100 100 
100 100 100 100 100 100 100 100 100 100 100 100 100 100 
##$AQSEQ= 0
##$AQ_mod= 3
##$AUNM= <au_zg>
##$AUTOPOS= <31 >
##$BF1= 250.13
##$BF2= 250.13
##$BF3= 250.13
##$BF4= 250.13
##$BF5= 500.13
##$BF6= 500.13
##$BF7= 500.13
##$BF8= 500.13
##$BYTORDA= 1
##$CFDGTYP= 0
##$CFRGTYP= 5
##$CHEMSTR= <none>
##$CNST= (0..31)
1 1 145 1 1 1 1 1 1 1 1 1 1 1 1 1 1 1 1 1 1 1 1 1 1 1 1 1 1 1 1 1 
##$CPDPRG= <>
##$CPDPRG1= <>
##$CPDPRG2= <>
##$CPDPRG3= <>
##$CPDPRG4= <mlev>
##$CPDPRG5= <mlev>
##$CPDPRG6= <mlev>
##$CPDPRG7= <mlev>
##$CPDPRG8= <mlev>
##$CPDPRGB= <>
##$CPDPRGT= <>
##$D= (0..31)
0 1 0 0 0 0 0 0 0 0.06 0 0 0 0 0 0 0.0002 0 0 0 0 0 0 0 0 0 0 0 0 0 0 
0 
##$DATE= 1170764424
##$DBL= (0..7)
120 120 120 120 120 120 120 120 
##$DBP= (0..7)
150 150 150 150 150 150 150 150 
##$DBP07= 0
##$DBPNAM0= <>
##$DBPNAM1= <>
$$ [...]
##$SUBNAM7= <"">
##$SUBNAM8= <"">
##$SUBNAM9= <"">
##$SW= 20.6930455092707
##$SWIBOX= (0..15)
0 0 3 0 0 0 0 0 0 0 0 0 0 0 0 0 
##$SW_h= 5175.983436853
##$TD= 65536
##$TD0= 1
##$TE= 294.16
##$TE2= 300
##$TE3= 300
##$TEG= 300
##$TL= (0..7)
0 120 120 120 120 120 120 120 
##$TP= (0..7)
150 150 150 150 150 150 150 150 
##$TP07= 0
##$TPNAME0= <>
##$TPNAME1= <>
##$TPNAME2= <>
##$TPNAME3= <>
##$TPNAME4= <>
##$TPNAME5= <>
##$TPNAME6= <>
##$TPNAME7= <>
##$TPOAL= (0..7)
0.5 0.5 0.5 0.5 0.5 0.5 0.5 0.5 
##$TPOFFS= (0..7)
0 0 0 0 0 0 0 0 
##$TUNHIN= 0
##$TUNHOUT= 0
##$TUNXOUT= 0
##$USERA1= <user>
##$USERA2= <user>
##$USERA3= <user>
##$USERA4= <user>
##$USERA5= <user>
##$V9= 5
##$VALIST= <valist>
##$VCLIST= <CCCCCCCCCCCCCCC>
##$VD= 0
##$VDLIST= <DDDDDDDDDDDDDDD>
##$VPLIST= <PPPPPPPPPPPPPPP>
##$VTLIST= <TTTTTTTTTTTTTTT>
##$WBST= 1024
##$WBSW= 4
##$XGAIN= (0..3)
0 0 0 0 
##$XL= 0
##$YL= 0
##$YMAX_a= 595699
##$YMIN_a= -617326
##$ZGOPTNS= <>
##$ZL1= 120
##$ZL2= 120
##$ZL3= 120
##$ZL4= 120
##$ABSF1= 16.522
##$ABSF2= -4.171173
##$ABSG= 5
##$ABSL= 3
##$ALPHA= 0
##$AQORDER= 0
##$ASSFAC= 0
##$ASSFACI= 0
##$ASSFACX= 0
##$ASSWID= 0
##$AUNMP= <proc_1d>
##$AZFE= 0.1
##$AZFW= 0.1
##$BCFW= 0
##$BC_mod= 0
##$BYTORDP= 0
##$COROFFS= 0
##$CY= 12.5
##$DATMOD= 1
##$DC= 0
##$DFILT= <>
##$DTYPP= 0
##$F1P= 14.0000005364418
##$F2P= -0.99999901652339
##$FCOR= 0.5
##$FTSIZE= 32768
##$FT_mod= 6
##$GAMMA= 0
##$GB= 0
##$INTBC= 1
##$INTSCL= 1
##$ISEN= 128
##$LB= 0.3
##$LEV0= 0
##$LPBIN= 0
##$MAXI= 10000
##$MC2= 0
##$MEAN= 0
##$ME_mod= 0
##$MI= 0
##$NCOEF= 0
##$NC_proc= -1
##$NLEV= 6
##$NOISF1= 0
##$NOISF2= 0
##$NSP= 0
##$NTH_PI= 0
##$NZP= 0
##$OFFSET= 16.522
##$PC= 1
##$PHC0= 226.1164
##$PHC1= 8.678555
##$PH_mod= 1
##$PKNL= yes
##$PPARMOD= 0
##$PSCAL= 4
##$PSIGN= 0
##$REVERSE= no
##$SF= 250.13
##$SI= 32768
##$SIGF1= 0
##$SIGF2= 0
##$SINO= 400
##$SIOLD= 32768
##$SREGLST= <1H.CDCl3>
##$SSB= 0
##$STSI= 32768
##$STSR= 0
##$SW_p= 5175.98343685301
##$SYMM= 0
##$S_DEV= 0
##$TDeff= 65536
##$TDoff= 0
##$TI= <Analysis number 999999
Compound Code 99
Book Reference 9
Project Code 9>
##$TILT= no
##$TM1= 0
##$TM2= 0
##$TOPLEV= 0
##$USERP1= <user>
##$USERP2= <user>
##$USERP3= <user>
##$USERP4= <user>
##$USERP5= <user>
##$WDW= 1
##$XDIM= 32768
##$YMAX_p= 363810159
##$YMIN_p= -22108
$$ End of Bruker specific parameters
$$ ---------------------------------
##NTUPLES= NMR SPECTRUM
##VAR_NAME=  FREQUENCY,     SPECTRUM/REAL,   SPECTRUM/IMAG
##SYMBOL=    X,             R,               I
##VAR_TYPE=  INDEPENDENT,   DEPENDENT,       DEPENDENT
##VAR_FORM=  AFFN,          ASDF,            ASDF
##VAR_DIM=   32768,         32768,           32768
##UNITS=     HZ,            ARBITRARY UNITS, ARBITRARY UNITS
##FACTOR=    0.157963299565203, 1,           1
##FIRST=     4132.6476996994, 0,             0
##LAST=      -1043.33573715361, 0,           0
##MIN=       -1043.33573715361, -22108,      0
##MAX=       4132.6476996994, 363810159,     0
$$ Real data points
##PAGE= N=1
##DATA TABLE= (X++(R..R)), XYDATA
$$ [...]
##PAGE= N=2
##DATA TABLE= (X++(I..I)), XYDATA
18329d041040O7345O5821O3479O3811O2749O4270N9460N4937N2694N6215N5046
18318c375213N8536N1461N0324N3076N0022M7081M2605L7649L4085L0429K9663
18307b890282L0297L0349L3693M3356M7540M1151M0120M4191M4083L8136L2903
18296b464463L2073K7789K3605K2120K7181L3204L7019M3400M6705M1135L9631
18285b090601K7267P583j4033k2398k3501j7506K382J7321K7916L8114M5167N0025
18273a952264M2501L2637K5342J1733n049k1734l4363l1424j6552l807J5415K8316
18261a909249K8494L0045K9792K5854K5808K5288J8892J9790K0937J9636K2048
18250a642665K2836J9636K4168K2025J5248J5528J7811J6787J6792J4207J3954
$$ y = [-4041040, -3973695, -3907874, -3844395, -3780584, -3717835, -3653565, -3594105, -3539168, -3486474, -3430259, -3375213, -3316677, -3265216, -3214892, -3161816, -3111794, -3064713, -3022108, -2984459, -2950374, -2919945, -2890282, -2859985, -2829636, -2795943, -2752587, -2705047, -2663896, -2623776, -2579585, -2535502, -2497366, -2464463, -2432390, -2404601, -2380996, -2358876, -2331695, -2298491, -2261472, -2218072, -2171367, -2130232, -2090601, -2063334, -2055751, -2069784, -2092182, -2115683, -2133189, -2130807, -2113486, -2085570, -2047456, -2002289, -1952264, -1909763, -1877126, -1851784, -1840051, -1845100, -1866834, -1901197, -1932621, -1949173, -1952980, -1937565, -1909249, -1880755, -1850710, -1820918, -1795064, -1769256, -1743968, -1725076, -1705286, -1684349, -1664713, -1642665, -1619829, -1600193, -1576025, -1554000, -1538752, -1523224, -1505413, -1488626, -1471834, -1457627, -1443673]
18239a443673J5922J9086J5270J4984J3939J5069J4593J5287J3216J3576J7143
18228a275588J6167J5048J5006J6132J4941R239P710Q455Q026P750Q476J2681
18216a135957J4874J3578J4196J6059J4150J3318J1588J0661J0624L633M813P011
18204a001452O011L741R982J4365J6444J3926J5758J6857J6315R168R007R433
18192h60445R498R845J0206P102Q203J0343J3159J2022J1050J0655J9499J9584
18180g19279J7586J6083J2971J1158P632k885p582p637J572R490J4971J6375J8019
18167f11526J6315J1254J6292J8460J6040J9256P280k334n359l662J962J1268
18155e04754J5440J5399J7278J7322J6985J4767J2153J4909J8084K0679K0143
$$ y = [-1443673, -1427751, -1408665, -1393395, -1378411, -1364472, -1349403, -1334810, -1319523, -1306307, -1292731, -1275588, -1259421, -1244373, -1229367, -1213235, -1198294, -1189055, -1181345, -1172890, -1164864, -1157114, -1148638, -1135957, -1121083, -1107505, -1093309, -1077250, -1063100, -1049782, -1038194, -1027533, -1016909, -1013276, -1008463, -1001452, -995441, -991700, -981718, -967353, -950909, -936983, -921225, -904368, -888053, -878885, -869878, -860445, -850947, -841102, -830896, -823794, -815591, -805248, -792089, -780067, -769017, -758362, -738863, -719279, -701693, -685610, -672639, -661481, -653849, -656734, -664316, -671953, -670381, -660891, -645920, -629545, -611526, -595211, -583957, -567665, -549205, -533165, -513909, -506629, -508963, -514322, -517984, -516022, -504754, -489314, -473915, -456637, -439315, -422330, -407563, -395410, -380501, -362417, -341738, -321595]
18144c21595J9155J5565J6139K0804K3658K1435K2665K6987K3237K8016K6574
18133g7360K3682K9659L0882L7475M0301M1684M6150N3471N9921O3134O6297P0809
18121D86105Q3752R6791J19346J40438J64807J95550K41355L01680L84393N02204
18111B716421O48032O89566M9101k196472m655816k710959J58186Q01909O89832
18102c810200N15008L80248K94320K34091J86311J53901J21156J00926Q6584Q0489
18092a657166P4976O4143N7080N3179M7276M7109L9839M1165M0670L4390L2488
18081a124851L0509L0427L0005K6591K0037J8302K1455J6496J7809J6542J3727
18070h82951J5357J5668J3926J6082J6902J3454J3198J2581J1861J0274J0872
$$ y = [-321595, -302440, -286875, -270736, -249932, -226274, -204839, -182174, -155187, -131950, -103934, -77360, -53678, -24019, 6863, 44338, 84639, 126323, 172473, 225944, 285865, 348999, 415296, 486105, 569857, 666648, 785994, 926432, 1091239, 1286789, 1528144, 1829824, 2214217, 2716421, 3364453, 4054019, 4103120, 1906648, -2749168, -5460127, -5301941, -4500032, -3810200, -3295192, -2914944, -2620624, -2386533, -2200222, -2046321, -1925165, -1824239, -1737655, -1657166, -1582190, -1518047, -1460967, -1407788, -1360512, -1313403, -1273564, -1232399, -1191729, -1157339, -1124851, -1094342, -1063915, -1033910, -1007319, -987282, -968980, -947525, -931029, -913220, -896678, -882951, -867594, -851926, -838000, -821918, -805016, -791562, -778364, -765783, -753922, -743648, -732776]
18059g32776Q630Q286R095R920Q103P212P644J1265J2559J0936P364N522P419
18046f18821R603P767M003R249O053L677Q562N772J0161P525N551K997J444R327
18032e27130J1279Q368M155P457P829O344M666N180J0491Q140N985M399L607k815
18018d42045J949Q515R307N012L971M145O250L414M287N027R059Q710K638J243
18004c68518M550L756M968Q100P328O104P213K426m139j596l237j650p82K589
17990c32888O895N608K207Q647R959O112N093L416J139m737l134n586j191N742
17976b92718P255L778L213M986L821J975K658N810N915P793O284N170N141L694
17962b25225L177P815O729O090P174N515Q144J0594R406J2152R377J4863J6499
$$ y = [-732776, -724146, -715860, -706765, -696845, -688742, -681530, -673886, -662621, -650062, -639126, -631762, -626240, -618821, -609218, -601451, -597448, -588199, -582146, -578469, -569907, -564135, -553974, -546449, -540898, -537901, -536457, -527130, -515851, -507483, -503328, -495871, -488042, -481698, -477032, -471852, -461361, -453221, -447236, -442837, -439230, -442045, -440096, -431581, -422274, -417262, -413291, -409146, -402896, -399482, -395195, -390168, -381109, -372399, -369761, -368518, -363968, -360212, -355244, -347144, -339816, -333712, -326499, -324073, -328212, -329808, -333045, -334695, -335477, -332888, -325993, -320385, -318178, -309531, -299572, -293460, -288367, -284951, -283812, -288549, -291683, -297269, -298460, -292718, -285463, -281685, -278472, -273486, -269665, -267690, -265032, -259222, -253307, -245514, -239230, -234060, -228919, -225225, -222048, -214233, -207504, -201414, -194240, -188725, -180581, -169987, -160581, -148429, -139052, -124189, -107690]
17949a07690J5218j2079p0168r1750l5917L564J7240K0452J6509J2314R691M055
17937b18561P004O056L124O282J3599L326N937N361P582K729J797N117J336l787
17923a53098L641O640N651K494J657N295K763O774L005P00N43M949L583k949j507
17908a09859O040O050N745K963k708L843K114J261M422M017J947N511N808L093
17894e9753K041N213L041K023j162P26L789L538J145N29L098J531P496L776L390
17879a9579M35J522P33L681K848K156K707N226L620L478L748L909J312L17K215
17864A8328Q31K445J585P932J104K149L545J055L353J930J132M751J577j54L182
17849E4745J917K623L282M89L425L663M722K648L983K962L711Q44M802L192M89
$$ y = [-107690, -92472, -104551, -174719, -266469, -302386, -298822, -281582, -261130, -244621, -232307, -222616, -218561, -211557, -205501, -202377, -196095, -182496, -179170, -173233, -167872, -160290, -157561, -155764, -150647, -149311, -153098, -149457, -142817, -137166, -134672, -133015, -127720, -124957, -118183, -115178, -114478, -113935, -108986, -105403, -108352, -109859, -103819, -97769, -92024, -89061, -91769, -87926, -85812, -84551, -80129, -76112, -74165, -68654, -62846, -59753, -57712, -52499, -49458, -47435, -48597, -47871, -44082, -40544, -39399, -38870, -35772, -34241, -26745, -22969, -19579, -19144, -17622, -16889, -13208, -10360, -8204, -5497, -271, 3349, 6827, 10575, 14484, 15796, 16113, 18328, 19159, 21604, 23189, 31121, 32225, 34374, 37919, 38974, 42327, 44257, 45389, 50140, 51717, 51563, 54745, 56662, 59285, 62567, 63056, 66481, 70144, 74866, 77514, 81497, 84459, 88170, 89014, 93816, 97008, 97497]
17834I7497J695Q75M331K735J166L550N611N569N277P129Q161N493M830O190R99
17819A61108R95Q788O956N159R694N006N251O087J0662J7774K0245K4206J9890
17806C01821J6683O395r530l3205o0573o2090n3510l4867r384Q443K1498K9556
17794A21237L0444K9199K7255K3603R218r185l1365n4433o3330n6168m0161j4223
17782b7909N705J7892J7537J7722J2760J0226J4306J2494J1595R087P337Q218
17770A16970Q445P387K163N751L788M184O929M370k9O496R146O746L318M648K093
17755A92405M961P713R765J1426P371M823J2680J5347J4770J5595K0835J4012
17743C31703j0318n8871r0922o2886j1552J7672K1590J6475J1712R479J2060J2562
$$ y = [97497, 99192, 100067, 104398, 107133, 108299, 111849, 117460, 123029, 128306, 135435, 143596, 149089, 153919, 160109, 161108, 162103, 170891, 177847, 183006, 192700, 197706, 202957, 209044, 219706, 237480, 257725, 281931, 301821, 318504, 324899, 315369, 282164, 221591, 159501, 105991, 71124, 61740, 70183, 91681, 121237, 151681, 180880, 208135, 231738, 240956, 231771, 200406, 145973, 82643, 26475, -13686, -27909, -22204, -4312, 13225, 30947, 43707, 53933, 68239, 80733, 92328, 101415, 108752, 116970, 125415, 132802, 134965, 140716, 144504, 148688, 155617, 159987, 159958, 166454, 175600, 182346, 185664, 190312, 192405, 197366, 205079, 214844, 226270, 233641, 238464, 251144, 266491, 281261, 296856, 317691, 331703, 321385, 262514, 171592, 108706, 97154, 114826, 136416, 152891, 164603, 174082, 186142, 198704]
17731A98704J0407J0876R285Q154R607O371O162Q222R619Q328R410J1293J1517
17718C17955J0368J3253J6686J7442K0758K0499J8908L886m0474r2349j06842
17707B00090o2453j0058K1646K8392K6190K3579K4660K2919K4767K6997K0344
17696C47073M265l0308q3144j07124o9545j6172J7318K2185K1488J9767J4196
17685A39999J3822J3532J2726J2194Q794O799K941L226P150Q086O130L509Q39
17672B39747N052N643M839N200L936Q004M729O15k08K581M184N770K071J151K651
17657B95965o92N434M973N064J208Q58M476M716K043L426J059J831O225O945K040
17642C45571j983O03M50K880L441O715M303M568K100J998L333P46n42j78J782
$$ y = [198704, 209111, 219987, 229272, 237426, 247033, 253404, 259566, 267788, 277407, 285735, 295145, 306438, 317955, 328323, 341576, 358262, 375704, 396462, 416961, 435869, 439755, 399281, 306932, 200090, 137637, 127579, 149225, 177617, 203807, 227386, 252046, 274965, 299732, 326729, 347073, 351338, 321030, 237886, 130762, 61217, 45045, 62363, 84548, 106036, 125803, 139999, 153821, 167353, 180079, 192273, 201067, 207866, 210807, 214033, 221183, 229269, 235399, 238908, 239747, 244799, 250442, 255281, 260481, 264417, 272421, 277150, 277765, 277557, 280138, 284322, 290092, 292163, 293314, 295965, 295273, 300707, 305680, 310744, 311952, 312810, 317286, 322002, 324045, 327471, 328530, 330361, 336586, 343531, 345571, 343588, 344191, 344641, 347521, 350962, 357677, 361980, 366548, 368648, 370646, 373979, 374725, 374183, 374005, 375787]
17627C75787L284K184M444P426M825k137m80K780R55Q2N78L62K663L997N564O862
17611D19176L401J429K316K992L300J279k560N66K143N886P486N819J169N959
17597D60361Q091j667K953L81k322J153m77J182L366M780L102N97M8K551N370
17582D89469O356N717j488o84O29J459J380M974J795m98K712J057k054M613O254
17567E21691M73j042L040L723L467P018N940K021J212q15L779K294N35K15J38
17552E53689J868L218J781R44O699Q59M751N980L842M455J291J124J075K015J003
17537E94594K926K822P26K710M217P123M296j714L96o82O056M817P12J943J303
17522F32245N886M283K458L447L324J914L927M332L639M792L02l20L243K937K193
$$ y = [375787, 379071, 381255, 385699, 393125, 397950, 395813, 395333, 398113, 399068, 399150, 399728, 400090, 402753, 406750, 412314, 419176, 422577, 424006, 426322, 429314, 432614, 433893, 431333, 431899, 434042, 439928, 447414, 453233, 454402, 460361, 468452, 466785, 469738, 470119, 467797, 468950, 468473, 469655, 473021, 477801, 480903, 481500, 481548, 484099, 489469, 495825, 501542, 500054, 499370, 499999, 501458, 502838, 507812, 509607, 509109, 511821, 512878, 510824, 515437, 521691, 522164, 521122, 524162, 527885, 531352, 538370, 544310, 546331, 547543, 546728, 550507, 552801, 553336, 553551, 553689, 555557, 558775, 560556, 561500, 568199, 569058, 573809, 579789, 583631, 588086, 589377, 590501, 591576, 593591, 594594, 597520, 600342, 601068, 603778, 607995, 615118, 619414, 617700, 618096, 617414, 623470, 628287, 628999, 630942, 632245, 638131, 642414, 644872, 648319, 651643, 653557, 657484, 661816, 665455, 670247, 670549, 670229, 673472, 676409, 678602]
17507F78602K949M783M063L979J827M015L503J029J83K842M183L657M296M579
17493G24490O202J361n43K15M949M210L521r60M528K240M351L516J905N19L944
17478G64448K222L350N432K171J602J838N994L636O524P875J792k694N770R590
17464H19550M717M511K5K669N629M135K638R91J303o7P529P901O852K281M623
17449H75287O274M519M368Q785Q314N883O191N169j21j5328j9454k856L643P233
17435H97907R522Q807P896N304M770O189J978K233L095O821M710K359L259M487
17421I69337L172L880P298N338M455P381O707M307P125O439O855Q121Q091O064
17407A054570K070L75M49J070P049P423P513J0886O304L96N180J1435J1008P338
$$ y = [678602, 681551, 686334, 690397, 694376, 696203, 700218, 703721, 704750, 704933, 707775, 711958, 715615, 719911, 724490, 730692, 732053, 731510, 731725, 736674, 740884, 744405, 743445, 747973, 750213, 754564, 758080, 759985, 760504, 764448, 766670, 770020, 775452, 777623, 779225, 781063, 787057, 790693, 797217, 805092, 806884, 804190, 809960, 819550, 824267, 828778, 828803, 831472, 837101, 841236, 843874, 844865, 846168, 846101, 853630, 861531, 868383, 870664, 875287, 881561, 886080, 890448, 899233, 907547, 913430, 919621, 924790, 924669, 909341, 889887, 887031, 890674, 897907, 907429, 916236, 924132, 929436, 934206, 940395, 942373, 944606, 947701, 954522, 959232, 961591, 964850, 969337, 972509, 976389, 983687, 989025, 993480, 1000861, 1007568, 1011875, 1019000, 1025439, 1032294, 1040415, 1048506, 1054570, 1056640, 1057015, 1057464, 1058534, 1065583, 1073006, 1080519, 1091405, 1097709, 1098105, 1103285, 1114720, 1125728, 1133066]
17393A133066L294O545L995J421k156M27J434K096M119K459P44l769N722R081
17379A168478J3900J0245J0929R425M954N380J667l307R79R22N411M229l79N030
17365A237863R332R994R713R946O166M974J0416J0208R961J4282J2871J4874J2313
17352A372913M174p805k3938k4993l744Q001J3457J2440Q434O754R957Q224J3573
17339A397447J5215R740M909J1729J9593J1682R000J0016J0465J0972Q276M009
17327A523053M081O772N748R129J0518J3784J7187J8154J6879J2085J1060J3818
17315A662268R891J1423J2604R869R067J4252J9332K3852K1472K5813K8943K5316
17303A874102K3084J6045Q28k7820n8586o4556l4361k185J8648K8941L1563L2452
$$ y = [1133066, 1136360, 1142905, 1146900, 1148321, 1146165, 1146592, 1148026, 1150122, 1154241, 1156700, 1157444, 1153675, 1159397, 1168478, 1182378, 1192623, 1203552, 1212977, 1217931, 1223311, 1224978, 1221671, 1222650, 1223572, 1228983, 1233212, 1232833, 1237863, 1247195, 1257189, 1266902, 1276848, 1283014, 1287988, 1298404, 1308612, 1318573, 1332855, 1345726, 1360600, 1372913, 1377087, 1369282, 1345344, 1320351, 1316607, 1324608, 1338065, 1350505, 1358939, 1365693, 1375650, 1383874, 1397447, 1412662, 1422402, 1427311, 1439040, 1458633, 1470315, 1479315, 1489331, 1499796, 1510768, 1519044, 1523053, 1527134, 1533906, 1539654, 1548783, 1559301, 1573085, 1590272, 1608426, 1625305, 1637390, 1648450, 1662268, 1672159, 1683582, 1696186, 1706055, 1715122, 1729374, 1748706, 1772558, 1794030, 1819843, 1848786, 1874102, 1897186, 1913231, 1914059, 1886239, 1827653, 1763097, 1728736, 1726551, 1745199, 1774140, 1805703, 1838155]
17291A838155L1486L0845K9263K7045J7153o689l9012o1493m6986j2415J2060
17280A819412K5979K8843K5521K2583K3001K2056J6764J7739K0355J9264K3963
17269B065480K3584K3579K7061K0893J5320J6064J5428J5225J4627J5525J5607
17258B268393J8425K3724K4110K2903K3881J7295J9883K0150J9066K1243K0766
17247B499839K1370K0658K1963J8688K1037K8638K9792K7342K2784K1919K4384
17236B758414K5854K4518K6305K9555L1129L3309L1679K7443K4628K9744L2554
17225C075132L4105L3213L6646L2874L5495L7324L8891M3437M0718L8049L5694
17214C481578L9644L9242M3632M3726M4379M4229M6336N0628N4269M9472N1437
$$ y = [1838155, 1869641, 1900486, 1929749, 1956794, 1973947, 1967258, 1928246, 1866753, 1819767, 1807352, 1819412, 1845391, 1874234, 1899755, 1922338, 1945339, 1967395, 1984159, 2001898, 2022253, 2041517, 2065480, 2089064, 2112643, 2139704, 2160597, 2175917, 2191981, 2207409, 2222634, 2237261, 2252786, 2268393, 2286818, 2310542, 2334652, 2357555, 2381436, 2398731, 2418614, 2438764, 2457830, 2479073, 2499839, 2521209, 2541867, 2563830, 2582518, 2603555, 2632193, 2661985, 2689327, 2712111, 2734030, 2758414, 2784268, 2808786, 2835091, 2864646, 2895775, 2929084, 2960763, 2988206, 3012834, 3042578, 3075132, 3109237, 3142450, 3179096, 3211970, 3247465, 3284789, 3323680, 3367117, 3407835, 3445884, 3481578, 3521222, 3560464, 3604096, 3647822, 3692201, 3736430, 3782766, 3833394, 3887663, 3937135, 3988572]
17203C988572N1961N4705N7148N8103N7585N8919O1656O8273P1602P2393P1665
17192D672582P9755P6200P6854P4716P8121Q4366Q6065R0660R0603R7326J03506
17181E610754J09716J18118J20224J23292J29992J29982J29685J30112J41126
17172F743001J49409J56729J70950J78311J87275K01752K15448K33929K48491
17163H485295K59168K71513K82768K87178K77718K54235K40783K68656L47809
17154A0975123M20139M67492M92353N38242O30506P18396P85723Q37172Q88903
17145A6754049R49994J065884J257766J492406J781548K156993K597332L059143
17137C1115115L464532L512920K212646k408357j1264173j9442729j8183859q361536
$$ y = [3988572, 4040533, 4095238, 4152386, 4210489, 4268074, 4326993, 4388649, 4456922, 4528524, 4600917, 4672582, 4752337, 4828537, 4905391, 4980107, 5058228, 5142594, 5228659, 5319319, 5409922, 5507248, 5610754, 5720470, 5838588, 5958812, 6082104, 6212096, 6342078, 6471763, 6601875, 6743001, 6892410, 7049139, 7220089, 7398400, 7585675, 7787427, 8002875, 8236804, 8485295, 8744463, 9015976, 9298744, 9585922, 9863640, 10117875, 10358658, 10627314, 10975123, 11395262, 11862754, 12355107, 12893349, 13523855, 14242251, 15027974, 15865146, 16754049, 17704043, 18769927, 20027693, 21520099, 23301647, 25458640, 28055972, 31115115, 34579647, 38092567, 40305213, 37896856, 26632683, 7189954, -10993905, -19355441]
17129a9355441K40838L842687M633645M568026M377252M276764M318427M412249
17121A1314447M242592K872591j547911j0130826j8633700j8360775r150983n35441
17113c9930006L066546L675045L370486K888551K428486K029207J707835J438266
17105a9325584J185092R69657Q32201P43926O73358O27393N99737N44419N00140
17096a2649661M90304M84281M68696M36668L97740L56529K92163K27627K02270
17087i293383K18881K40102K39610K30690K20549K09825J96409J86374J82386
17078g368557J74635J66528J66968J57778J48996J39435J25514J16858J12495
17069f059350J06458J03586J02332J01730J03050R9370R6897R1695Q9762Q3713
$$ y = [-19355441, -19114603, -15271916, -10638271, -6070245, -1692993, 2583771, 6902198, 11314447, 15557039, 18429630, 16881719, 6750893, -11882807, -30243582, -39394565, -39930006, -36863460, -33188415, -29817929, -26929378, -24500892, -22471685, -20763850, -19325584, -18140492, -17170835, -16338634, -15594708, -14921350, -14293957, -13694220, -13149801, -12649661, -12159357, -11675076, -11206380, -10769712, -10371972, -10015443, -9723280, -9495653, -9293383, -9074502, -8834400, -8594790, -8364100, -8143551, -7933726, -7737317, -7550943, -7368557, -7193922, -7027394, -6860426, -6702648, -6553652, -6414217, -6288703, -6171845, -6059350, -5952892, -5849306, -5746974, -5645244, -5542194, -5442824, -5345927, -5254232, -5164470, -5080757]
17059e080757P9120P7649P6195P3576O9583O7100O5295O2485O2769O2345N9197
17048d325443N4974N5880N5629N3230N3255N1379N0849N2261N1638N0026M2292
17037c754030M4487M4948M1970L8435L7308L7779L8772L7695L5348L4539L6107
17026c326642L7049L2766L3731L2371L2867L0643L2416K9874K6193L3406K9213
17015b976113K8678K9399L1546L0199K5252K3970K3347J7685J3991J7251K3471
17004b711324J6385J7001K5970K7842K3099K3342K5685K1683K3876K0895J7636
16993b467910J5088J4458J1953R991J0989J7120K0719K1366K2601K0464J4860
16982b288301J4448J4063J0755J4346J5841J6085J9124J8092J8482J5011J9959
$$ y = [-5080757, -5001637, -4923988, -4847793, -4774217, -4704634, -4637534, -4572239, -4509754, -4446985, -4384640, -4325443, -4270469, -4214589, -4158960, -4105730, -4052475, -4001096, -3950247, -3897986, -3846348, -3796322, -3754030, -3709543, -3664595, -3622625, -3584190, -3546882, -3509103, -3470331, -3432636, -3397288, -3362749, -3326642, -3289593, -3256827, -3223096, -3190725, -3157858, -3127215, -3094799, -3064925, -3038732, -3005326, -2976113, -2947435, -2918036, -2886490, -2856291, -2831039, -2807069, -2783722, -2766037, -2752046, -2734795, -2711324, -2694939, -2677938, -2651968, -2624126, -2601027, -2577685, -2552000, -2530317, -2506441, -2485546, -2467910, -2452822, -2438364, -2426411, -2416420, -2405431, -2388311, -2367592, -2346226, -2323625, -2303161, -2288301, -2273853, -2259790, -2249035, -2234689, -2218848, -2202763, -2183639, -2165547, -2147065, -2132054, -2112095]
16971b112095J7031J4543J5084J6920J4313J0936J2097J1096J0826J0619J4619
16960a964011J6027J1643J3299J5022R648J0338R755J0911J2890J7768J3525J0197
16948a812988J1896J0645R818J2045P733M654Q625O183Q679R453R472J3254J3780
16935a686751P372J0939Q823P844O584N789L596N894K824M436Q931J0057J2376
16922a591286J5175J2699Q636P687J0595R347Q558P166n67k187K858O818O023
16909a498478J0068R054Q016J0008R238J0412J1630N766K946L181R651R886Q706
16896a389916J1908Q879P360M407J736N084P967J1144M526J229N731J0250R873
16883a299822L902L024L840N488M210N831M296O702Q818Q419K030M600K459O476
$$ y = [-2112095, -2095064, -2080521, -2065437, -2048517, -2034204, -2023268, -2011171, -2000075, -1989249, -1978630, -1964011, -1947984, -1936341, -1923042, -1908020, -1898372, -1888034, -1878279, -1867368, -1854478, -1836710, -1823185, -1812988, -1801092, -1790447, -1780629, -1768584, -1760851, -1756197, -1747572, -1741389, -1732710, -1723257, -1713785, -1700531, -1686751, -1679379, -1668440, -1659617, -1651773, -1645189, -1639400, -1635804, -1629910, -1627086, -1622650, -1613719, -1603662, -1591286, -1576111, -1563412, -1554776, -1547089, -1536494, -1527147, -1518589, -1511423, -1511990, -1514177, -1511319, -1504501, -1498478, -1488410, -1479356, -1471340, -1461332, -1452094, -1441682, -1430052, -1424286, -1421340, -1418159, -1408508, -1398622, -1389916, -1378008, -1369129, -1361769, -1357362, -1355626, -1350542, -1342575, -1331431, -1326905, -1325676, -1319945, -1309695, -1299822, -1295920, -1292896, -1289056, -1283568, -1279358, -1273527, -1269231, -1262529, -1253711, -1245292, -1243262, -1238662, -1236203, -1229727]
16869a229727J2422Q527M241J714K27N90K450N118N164O834P890O251N159L185
16855a159955K653O275M907L323N391N322N864O986J858L01O221O928L976O129
16841a093821N289K617K47M361O683M298L838K237J573K075L194N065L491M867
16827a043986N741M825N673K757N753N479L877Q36K472J082M994N892K654M446
16813i87505O872Q065L641K545M384M477O251R197R996M374L414L935K647k639
16799i20346j3252j1266l911J728O293Q253J0998O048N552N169O600L503N357
16786h89274K994o138j2390r235K073Q109J174K43L109N377Q330K318K663K634
16772h78013L979Q481M377M047J164o80K617N473L342M07M340L569K081L82L709
$$ y = [-1229727, -1217305, -1208778, -1204537, -1202823, -1202596, -1202006, -1199556, -1194438, -1189274, -1182440, -1174550, -1168299, -1163140, -1159955, -1157302, -1151027, -1146120, -1142797, -1137406, -1132084, -1126220, -1119234, -1117376, -1117075, -1110854, -1103926, -1099950, -1093821, -1088532, -1085915, -1085668, -1081307, -1074624, -1070326, -1066488, -1064251, -1062678, -1060603, -1057409, -1052344, -1048853, -1043986, -1038245, -1033420, -1027747, -1024990, -1019237, -1013758, -1009881, -1009045, -1006573, -1005491, -1000497, -994605, -991951, -987505, -980633, -972568, -968927, -966382, -961998, -957521, -951270, -942073, -932077, -927703, -924289, -920354, -917707, -920346, -933598, -944864, -948775, -947047, -940754, -932501, -921503, -915455, -909903, -904734, -898134, -894631, -889274, -886280, -892418, -904808, -914043, -911970, -903861, -902687, -902444, -899335, -893958, -885628, -883310, -880647, -878013, -874034, -865553, -861176, -857129, -855965, -856645, -854028, -848555, -845213, -844806, -840466, -836897, -834816, -834434, -830725]
16757h30725O412P185K992J742K968kJ549L692J232J569J634L437O299M718M101
16742g81197k138J036O207M386L215O639J558L977K080q94R21K372k664j2L838
16727g50676M87L293M424K822K359L424L152N808K434N00k075O44J276K752M013
16712g15363L371K565N335K928n41k71L744L219P29L311K634R14K145M686O78
16697f79916J036L323K423j337J177L097L950K096K987K027M27k10J230K839J591
16682f53260J157K541J606P91r74J392J831J493K491M630O141P409J013L657N53
16667f17529K037K385l14r50J311k62M816J921J68M601N426N330O107L729L441
16652e77783J457k030l971j639j159j965J972M054P957K826L250L712K274Q80
$$ y = [-830725, -824313, -817128, -814136, -812394, -809426, -809428, -807879, -804187, -802955, -801386, -799752, -796315, -790016, -785298, -781197, -783335, -782299, -776092, -771706, -768491, -761852, -760294, -756317, -754237, -755131, -754210, -751838, -754502, -754514, -750676, -750189, -746896, -742472, -739650, -737291, -733867, -730715, -724907, -722473, -721973, -724048, -723404, -722128, -719376, -715363, -711992, -709427, -704092, -701164, -701705, -701976, -698232, -695013, -694284, -690973, -688339, -687425, -685280, -680594, -679916, -678880, -675557, -673134, -674471, -673294, -670197, -666247, -664151, -661164, -659137, -658710, -658920, -657690, -654851, -653260, -652103, -649562, -647956, -647165, -648139, -646747, -644916, -643423, -640932, -636302, -630161, -622752, -621739, -618082, -617529, -615492, -613107, -613421, -614371, -613060, -613322, -608506, -606585, -606417, -601816, -596390, -591060, -584953, -581224, -577783, -576326, -578356, -582327, -583966, -585125, -587090, -585118, -581064, -573107, -570281, -567031, -563319, -561045, -560165]
16638e60165J17J022L125j84o20m46kQ07J393R87L958L527J805M98k248J305L946
16621e41175K816L619J550K035P85J860K888J167K654j982K363L968J084L478
16607e12890L548k21p51M095L412j846J425J815K693Q1j42N554N447J054j633
16592d88359k75M399M292L522J831L750K544J703L791K149M128M073n68K821L263
16577d46936J037J736R36N360M017J031L024O291N824P389N830O972K618K756
16563c92115M318L657L003O050Q409J1274J5126J4951K0031J8420J7328J5178
16551b54370P045k7210q1138j05045p6706k6750J0816K6301K7104K3014K1942
16540d54997K4340K4023K7216K0440N117k5163p8262j07361p6948k3636Q730K1116
$$ y = [-560165, -560048, -559026, -555901, -556085, -556705, -557151, -557153, -556346, -554953, -553966, -550008, -546481, -544676, -544178, -546426, -545121, -541175, -538359, -534740, -533190, -531155, -530370, -528510, -525622, -524455, -521801, -523783, -521420, -517452, -516368, -512890, -509342, -509563, -510314, -506219, -502807, -504653, -503228, -501413, -498720, -498639, -498781, -493227, -487780, -486726, -488359, -488634, -484235, -479943, -476421, -474590, -470840, -468296, -466593, -462802, -460653, -456525, -452452, -453020, -450199, -446936, -445899, -444163, -443227, -437867, -433850, -432819, -429795, -423504, -417680, -410291, -404461, -397489, -394871, -392115, -387797, -384140, -381137, -375087, -366678, -355404, -340278, -325327, -305296, -286876, -269548, -254370, -247325, -274535, -355673, -460718, -537424, -564174, -553358, -527057, -499953, -476939, -454997, -430657, -406634, -379418, -358978, -353861, -379024, -457286, -564647, -641595, -665231, -656501, -635385]
16528f35385J8806J8752J4297J3494J0007J4111J2053L080L07M542P143N337M767
16515e08689L038K671K372L327M612N175P753K838K118N037J246K019N994M794
16501d55695j496j377K727J734L405K77K014M726K645J124J938m62J858M732M39
16486d31411Q64P2K580K664L427L172j279K1N09L072J180l54l152J786J45K864
16470d13840L839J309J420K235M080K389k21L68J548K414P77j90J121K712L705
16455c86334J354k040n49L449M488j448l624M489L334Q8j422L660K875j238J394
16440c71524L325o27o50k95J682J009l54K577O275o2k007K755j693m856p24N021
16424c60148P141J72P02J044j06k497M074M97K752K867j32L30K035M376K482j472
$$ y = [-635385, -616579, -597827, -583530, -570036, -560029, -545918, -533865, -530785, -530478, -525936, -518793, -513456, -508689, -505651, -502980, -500608, -497281, -492669, -487494, -479741, -476903, -474785, -469748, -468502, -466483, -460489, -455695, -457191, -458568, -455841, -454107, -450702, -450425, -448411, -443685, -441040, -439916, -437978, -438440, -436582, -431850, -431411, -430547, -430475, -427895, -425231, -421804, -418632, -419911, -419890, -419381, -416309, -415129, -415483, -418635, -416849, -416704, -413840, -410001, -408692, -407272, -405037, -400957, -398568, -398789, -398421, -396873, -394459, -393682, -393872, -392751, -390039, -386334, -384980, -387020, -387569, -384120, -379632, -381080, -384704, -380215, -376881, -376793, -378215, -374555, -371680, -372918, -371524, -368199, -368826, -369476, -369771, -368089, -367080, -367434, -364857, -358582, -358644, -360651, -357896, -359589, -364445, -365169, -360148, -353007, -352835, -352133, -351089, -351195, -353692, -349618, -349121, -346369, -343502, -343634, -343304, -341269, -336893, -334411, -335883]
16408c35883p43J747L00k431K492K058J892K657q72o02j428L116L061l358j649
16393c29643K632qp7K395L723K696J304J959q61J195K683k572j280j054O12K086
16377c14210m97L696M579P00l020m08J396M65J710K135k403l7j076O32L470L648
16361b99220k016J476L627J821j61l474k182J658K136n60k707K520M681J34J786
16346b90481N43j92l87K851K111L909K03k282J708L049q76K060j01j496K739Q20
16330b75822P90R40J243J035J092K080R86o85J832J57q93q76K347J944r78j238
16314b66046R11J549K798o31O05N359m65q52J706j334o20J147p43K4J442P54J038
16297b53358M3J445N3M451N09l619P91J297K511j010j987k07J878l50O749J680
$$ y = [-335883, -336626, -334879, -334579, -337010, -334518, -332460, -330568, -327911, -328783, -329385, -330813, -327697, -324636, -327994, -329643, -327011, -327019, -327096, -324701, -320978, -318282, -316978, -315019, -315880, -314685, -312002, -314574, -315854, -316908, -316296, -314210, -314707, -311011, -306432, -305732, -308752, -309160, -307764, -307299, -305589, -303454, -305857, -305894, -306970, -306338, -302868, -299220, -301236, -299760, -296133, -294312, -294473, -297947, -300129, -298471, -296335, -296895, -299602, -297082, -292401, -292267, -290481, -289938, -290130, -290517, -287666, -285555, -281646, -281443, -283725, -282017, -278968, -279844, -277784, -277885, -279381, -276642, -275822, -275032, -274092, -272849, -271814, -270722, -268642, -267656, -268341, -266509, -266352, -267245, -268121, -265774, -263830, -264808, -266046, -265135, -263586, -260788, -261419, -260814, -255455, -255920, -256772, -255066, -256400, -257020, -255873, -256616, -256592, -255150, -254396, -253358, -253315, -251870, -251817, -247366, -246857, -250476, -249685, -248388, -245877, -246887, -248874, -249081, -247203, -247553, -240804, -239124]
16281b39124l187p46k03L259J147j444j391j094L729K916j812J187J111J513L332
16266b30807m79j534j177j954K262N076L970J967k639j2l81P27M244K002k012
16251b20747J1O51j714k386P15L500J824L865J373o38J260L373j10l564k821L932
16235b11476J446k66q52L097J479P30l004j425L295L082K471n28j782j372k333
16220b07438j38o84l4O73M378L572J343k606j47J941M145L85N76J601k081N30
16204a93984J981j108o14J535K840N9j42Q20P8J64j94J366J784n46n26J864r33
16187a85556l08J794k96j839L74M602K015k006j75K948r14l801J538N825m41n299
16171a81539L5J597P267K44l200J237L297j3j061k106L289P32k39K95L12j662
$$ y = [-239124, -242311, -243057, -243260, -240001, -238854, -240298, -241689, -242783, -239054, -236138, -237950, -236763, -235652, -234139, -230807, -231286, -232820, -233997, -235951, -233689, -228613, -224643, -222676, -225315, -225327, -225708, -224981, -220737, -218735, -220747, -220736, -220085, -221799, -224185, -223470, -219970, -218146, -214281, -212908, -213546, -212286, -208913, -209023, -212587, -215408, -211476, -210030, -210296, -211148, -208051, -206572, -205842, -208846, -210271, -206976, -203894, -201423, -201951, -203733, -205105, -207438, -207576, -208260, -208294, -207621, -203243, -199671, -198328, -200934, -201081, -199140, -194995, -194610, -194034, -192433, -194514, -193984, -192003, -193111, -193725, -192190, -189350, -189291, -189433, -188613, -188535, -188371, -188565, -187199, -185415, -185961, -186487, -184623, -185556, -185864, -184070, -184366, -186205, -185831, -181229, -179214, -181220, -181395, -178447, -179361, -183162, -181624, -175799, -176240, -181539, -181504, -179907, -172640, -172396, -175596, -174359, -171062, -171075, -172136, -174242, -170953, -170221, -170460, -170165, -169853, -171515]
16155a71515J066K359l403L18N37K025J444r10K983J463J673L169j25K470Q59
16140a55587j209J414l456l52O191N1k897M16J581N63j116j2K082K136j50j255
16124a51600J33P3J273K523rJ318l64K203l76r5l7J770J662J257K773L43o4k823
16106a40040K24J554N11L4J891n30q68j637j747J70n04J301J314K507j86m90J536
16089a34960J962L173J155Q78k195k540J06P40J547K23J573L609n98k588q79L106
16073a25688L22m53j70M273K984n88k19j491K187j02K42l560k262J918J178j236
16057a22665p44J801J022K942j524P83M592J699l844k57L496L809L867P93P80
16042a03450k892m071j511J381N085M94l525n404j10M038J998J699J161L271q39
$$ y = [-171515, -170449, -168090, -171493, -171175, -170638, -168613, -167169, -168079, -165096, -163633, -161960, -158791, -158916, -156446, -155587, -156796, -155382, -158838, -159190, -152999, -152948, -155845, -155429, -153848, -153285, -154401, -154413, -152331, -150195, -150345, -151600, -151467, -151394, -150121, -147598, -147607, -146289, -146653, -144450, -144826, -144921, -144958, -143188, -141526, -140269, -137496, -137153, -137217, -140040, -139816, -138262, -137751, -137717, -135826, -136356, -137224, -138861, -140608, -140438, -140942, -139641, -138327, -135820, -136006, -136496, -134960, -132998, -129825, -128670, -127792, -129987, -132527, -132421, -131681, -130134, -129911, -128338, -124729, -125327, -127915, -128794, -125688, -125366, -125819, -125989, -121716, -118732, -119320, -119539, -121030, -118843, -118945, -118703, -122263, -124525, -122607, -121429, -122665, -123409, -121608, -120586, -117644, -119168, -118385, -113793, -112094, -115938, -116195, -112699, -108890, -105023, -104230, -103450, -106342, -110413, -111924, -110543, -105458, -104964, -108489, -113893, -114003, -109965, -107967, -106268, -105107, -101836, -102675]
16027a02675P82K814K725j481k885L21K789o57j890m72L067K715L376J692Q10
16012h8969l626j961k51J999K188p76R65L477m01r40J337j648m893r13K383J446
15996i0583R78M553M951J729l087k572j131L155K617l156j547r21j23K027k000
15981h5110K16R15m99J600J259o6R89J584L165J689j996J217k31J311m22j353
15965g5732r66J527J992J284J521K855l2J444j610k567k843P12l37j078J553K507
15949f9770j140j305n76o19L298k7J676K461N99j132J725J752K513J99l87j300
15933f2033m95N38K794R43k559J037n01R5m8J649K30P6J827P00l37j207j670Q85
15915e8076o84K090Q49j349J560P306L145K451P33k468l532k617j002J886K078
$$ y = [-102675, -101893, -99079, -96354, -97835, -100720, -100399, -97610, -98267, -100157, -100629, -97562, -94847, -91471, -89779, -88969, -92595, -94556, -94807, -92808, -90620, -91396, -90431, -86954, -87355, -88295, -86958, -88606, -93499, -94412, -92029, -90583, -89605, -85052, -80101, -78372, -81459, -84031, -85162, -82007, -79390, -82546, -84093, -85014, -85137, -83110, -85110, -84894, -83979, -84478, -82878, -81619, -81685, -80696, -79112, -75947, -74258, -76254, -75037, -75268, -73957, -74379, -75732, -76698, -75171, -73179, -71895, -70374, -67519, -67551, -66107, -67717, -70284, -73127, -72415, -72752, -73830, -72277, -69770, -70910, -72215, -72791, -73410, -70112, -70139, -68463, -66002, -65403, -66535, -64810, -63058, -60545, -60346, -60733, -62033, -62528, -61990, -59196, -58253, -60812, -59775, -60276, -60181, -60229, -58580, -58350, -58274, -56447, -55747, -56084, -57291, -58961, -58076, -58760, -56670, -55821, -57170, -55610, -48304, -45159, -42708, -41975, -44443, -47975, -50592, -51594, -49708, -47630]
15900d7630k767k439J010M489L580L397L653j963k228j228n907j047K015K674
15886d4391J033J336r76j676K366j055J501N124M255k861n134K62N607K502q3
15871c2190Q45L23K194L038R09n562m297O06j540K273q40K120p95l86L394m29
15855c0337K333K081N12q3j265k188n851j275O12K797K416K402J481K329K653
15840b1383J83j079n3N725l72l445P92M141J834j369rj989k154j135k386K98J70
15823b2231k58J682K906L481L381K400N91j959k407l119K344R17l68j94m41K113
15807a1162j10j196P92l59O21J19K648J386J332K02K790Q82L351j243j982K418
15791D89K403k134o724J191J817j841J117J160q38q71K688q87m80L586L17j146
$$ y = [-47630, -50397, -52836, -51826, -47337, -43757, -40360, -36707, -38670, -40898, -42126, -48033, -49080, -47065, -44391, -43358, -42022, -42998, -44674, -42308, -43363, -41862, -36738, -32483, -35344, -40478, -40216, -34609, -32107, -32190, -31345, -31022, -28828, -25790, -24881, -30443, -34740, -34134, -35674, -33401, -34241, -32121, -32916, -33302, -29908, -30337, -28004, -25923, -25411, -25494, -26759, -28947, -34798, -36073, -35461, -32664, -30248, -27846, -26365, -24036, -21383, -21200, -22279, -22332, -16607, -16979, -20424, -19632, -15491, -13657, -15026, -15035, -17024, -19178, -20313, -22699, -22401, -22231, -22489, -20807, -17901, -14420, -11039, -8639, -8048, -10007, -12414, -15533, -13189, -12272, -12640, -12834, -13275, -11162, -11272, -12468, -11676, -12035, -11414, -11295, -8647, -7261, -5929, -5727, -2937, -2055, 1296, 53, -1929, 489, 2892, 758, -5966, -4775, -2958, -4799, -3682, -2522, -3360, -4231, -1543, -2430, -2910, 676, 993, -153]
15775a53Q26k61j744J279k54K98K167k51J161k98N04o73r94L27N97k196J726Q65
15757B926j94O03J370n72O24K535Q22m42p88j222J567R49J438R15j097j548O57
15740H543N095J806J349k910l026m23P01r53k613J12L783J245o18J074q9J783
15724A4859K513K618l65k1J321J444j049j679l572J358J371K315J311j26Q02L110
15708B6210K3N91m04j649M24L531L224n87j052n8n00l062j943J351p77k825L755
15691B6252K744K90j685j373J501K93o39q60j856K960J356K538M298M893J13j870
15675C8955J655J8k030k263N68k693k418J473K848P53J049j747j693K874J466
15660C8815k226J92J758P12L23R72j17n33Q40L061J972p05j95K44J918J51P88
$$ y = [-153, 673, 412, -1332, -53, -307, -9, 2158, 1907, 3068, 2770, 3274, 2601, 1607, 1934, 2531, 335, 2061, 2926, 2732, 3335, 4705, 4133, 4757, 7292, 8114, 7672, 6884, 5662, 7229, 8178, 9616, 10531, 9434, 7886, 8543, 13638, 15444, 16793, 13883, 10857, 10434, 11135, 10182, 7569, 7681, 11464, 12709, 12091, 13165, 13076, 14859, 17372, 19990, 19625, 19604, 20925, 22369, 21320, 19641, 16069, 17427, 18798, 21113, 22424, 22298, 23100, 26210, 26233, 26824, 26420, 24771, 25195, 28726, 31950, 31363, 30311, 30253, 29753, 26691, 24748, 26099, 25322, 22497, 26252, 28996, 29286, 27601, 26228, 27729, 28022, 27383, 26523, 24667, 27627, 28983, 31521, 35819, 40712, 40825, 38955, 40610, 40628, 38598, 36335, 36903, 34210, 31792, 33265, 36113, 36866, 37915, 36168, 34475, 37349, 38815, 36589, 36781, 38539, 39251, 39574, 40546, 40429, 39896, 40736, 43797, 45769, 45064, 44869, 45113, 47031, 47182, 47970]
15643D7970q95k779l52K672R45l21j581J367k099j389j016L256P92q2q72J957
15627D7573n66l21K249L74K818J376P8N39K327n67j267j942Q95J475n94j434J09
15610E3122J469j112j983L25J343K797k64J550K355j227j683j722j507M434R03
15595E8800R52J71N698j745k603l768k080l801m9K076L176K422P89K503r50k344
15579E9247J609M706K260j543l100j036M274M015j318j05N68K436o49l298M93
15564F8559K993O10k176N8M51J554N24l174q67K35k061r26J59K825j573r01L138
15547F9428J465K155K556J183J380j306j460o69L92L146Q76k707j535R68r08k74
15531G4690J138P54j94j511L02J061O84J797o68J354M183K157q91p47N27j454
$$ y = [47970, 47075, 44296, 43944, 46616, 47561, 47240, 45659, 47026, 44927, 43538, 42522, 45778, 46570, 46488, 45616, 47573, 47007, 46686, 48935, 49309, 52127, 53503, 53581, 54120, 56447, 55880, 54613, 52671, 53566, 55041, 54447, 53013, 53122, 54591, 53479, 51496, 51821, 53164, 55961, 55697, 57247, 59602, 58375, 56692, 54970, 53463, 57897, 58800, 59752, 59923, 65621, 63876, 61273, 57505, 55425, 51624, 51575, 53651, 56827, 59249, 60038, 62541, 61591, 59247, 60856, 65562, 67822, 66279, 63179, 62143, 66417, 70432, 69114, 69009, 69577, 72013, 71364, 68066, 68559, 71552, 72162, 69986, 70044, 70495, 72049, 72573, 69399, 68532, 68767, 66706, 65780, 65939, 68764, 67191, 66290, 69428, 70893, 73048, 75604, 76787, 78167, 76861, 75401, 74732, 75124, 78270, 79146, 76439, 74904, 75872, 74964, 74690, 75828, 76582, 76388, 74877, 75179, 76240, 76924, 78721, 78053, 79407, 83590, 85747, 84856, 84109, 84636, 83182]
15515H3182l486k397J12l011J116K430L120M492R35K78j590j181N2R64m57J417
15499H5976o11o95J538J190L006J644K385K069j925l959n491J293J970J906k525
15484H7771K155N48J318K22n99K660L313j314j908J956j690M35K835j572M13L96
15468I6939p92K270K162m736j372j51K303J738r42J832L869l335k208n03l453
15453I3621O66N15K005r9J369J037L66K870J959j593j432m18K20J650j704J941
15437A02973P85o8p74J944J983j716J148K71J227J433l14j958J783k839J309J380
15421A08567q6n21L604J170j322j197j165J048K990M079J316m273Q54K581j663
15406A15982q53k62J073m98K768J146j192l312L175N898q35l548k313J808n4o77
$$ y = [83182, 79696, 77299, 77411, 74400, 75516, 77946, 81066, 85558, 86493, 86771, 85181, 84000, 84052, 85016, 84559, 85976, 85365, 84670, 86208, 87398, 90404, 92048, 94433, 96502, 94577, 90618, 85127, 86420, 88390, 90296, 87771, 89926, 90474, 91792, 92014, 91415, 94075, 97388, 96074, 94166, 96122, 94432, 94867, 97702, 96130, 96543, 96939, 96147, 98417, 100579, 95843, 94471, 94320, 96623, 98361, 97419, 99251, 103120, 99785, 97577, 97074, 93621, 94287, 94802, 96807, 96708, 98077, 99114, 99480, 102350, 104309, 102716, 101284, 100866, 101086, 102736, 101032, 102973, 103758, 103690, 102916, 104860, 106843, 105127, 106275, 106546, 107773, 109206, 108892, 106934, 108717, 105878, 107187, 108567, 108481, 107960, 111564, 112734, 111412, 110215, 109050, 110098, 113088, 117167, 118483, 114210, 115064, 117645, 115982, 115129, 114867, 115940, 115442, 118210, 119356, 118164, 114852, 118027, 123925, 123090, 119542, 117229, 119037, 118983, 118306]
15390A18306J769L266K890J73o39R5j224K188o69k379P15q91K886j312N90j544
15374A24220m8L56L871J347k161R85l238k294K100K469K258k138n19J601L680
15359A32489L561J498n674l517R20L395L030J590j274l928r66N69K537k67K087
15344A36050K438l345j969K32N65L519M076L36o94j818k569J268J476K230n56
15329A41239j337m76Km40L628J949o192J841L969J271m86o54j460J743O87k01
15313A45083J959n71J395J819J005Q67j679n48Q51j412P9o09k104j21L232L787
15297A53033M946j157m137O46K627K548j006k980K095q69j681J901J108L925K375
15282A63374m32j123l792j631k29j07k12l3M393L876k480j845J885J16j135j800
$$ y = [118306, 120075, 123341, 126231, 126404, 125765, 125860, 124636, 126824, 126155, 123776, 124491, 123600, 126486, 125174, 125764, 124220, 124172, 124528, 128399, 129746, 127585, 128570, 125332, 123038, 125138, 127607, 129865, 127727, 127208, 128809, 132489, 136050, 137548, 131874, 128357, 129277, 132672, 135702, 137292, 136018, 132090, 131124, 131693, 134230, 133963, 136050, 138488, 135143, 133174, 133406, 133971, 137490, 141566, 141902, 141208, 139390, 136821, 138089, 139565, 141795, 141239, 139902, 139426, 139428, 138988, 142616, 144565, 138373, 140214, 144183, 145454, 144968, 144314, 142854, 144597, 145284, 145083, 147042, 146471, 147866, 149685, 150690, 151557, 149878, 149330, 150181, 148769, 148848, 148239, 146135, 146014, 149246, 153033, 157979, 156822, 152685, 153331, 155958, 158506, 157500, 154520, 156615, 155746, 154065, 155966, 157074, 160999, 163374, 162942, 161819, 158027, 156396, 156167, 156060, 155848, 155815, 160208, 164084, 161604, 159759, 161644, 161760, 160625, 158825]
15266A58825M246L170O16J925J452p02j797K370o43l736k178J165K282K392j490
15251A67897Q57J090j475k031l25L688K433j655k591J766M647N08l687m112K725
15236A69735l54q40J087J113J369N16q19K142q23j034O50R86j94k8N98J860J435
15219A77399K033Q43M1P90P41l593M320m39p51k481j030M053r05P67J164k581
15203A80371J841q47l512K034j52p89q70J5L084J618m97j075k25m36m087J245
15187A77718L571M845J703l535k473L407K665L33j401K069r33k959J904L338j2
15172A90240q09l965l506l00P69L542O62j799j294k084k890L791K072J434K395
15157A88258O42l895J372K088j269p33L468j142k699j572P24N86J92L678L725
$$ y = [158825, 163071, 166241, 166857, 168782, 170234, 169532, 167735, 170105, 169462, 165726, 163548, 164713, 166995, 169387, 167897, 168754, 169844, 168369, 166338, 166013, 169701, 172134, 170479, 167888, 169654, 174301, 174809, 171122, 167010, 169735, 169381, 168541, 169628, 170741, 172110, 172626, 171807, 173949, 173126, 172092, 172742, 173728, 173534, 173506, 174104, 175964, 177399, 179432, 180275, 180316, 181106, 181847, 178254, 182574, 182135, 181384, 178903, 177873, 181926, 181021, 181788, 182952, 180371, 182212, 181365, 177853, 179887, 179735, 178946, 178076, 178091, 181175, 182793, 182296, 181221, 180996, 180560, 176473, 177718, 181289, 186134, 187837, 184302, 181829, 185236, 187901, 188234, 186833, 188902, 187969, 185010, 186914, 190252, 190240, 189431, 185466, 181960, 181660, 182429, 185971, 186633, 184834, 183540, 181456, 178566, 182357, 184429, 185863, 188258, 188900, 185005, 186377, 188465, 187196, 186463, 189931, 188789, 186090, 184518, 185242, 185828, 186020, 189698, 193423]
15142A93423j764k132l43K451N02O22j036k124k808j17N172J261j49O47J191j398
15126A93398l950j566J677L468J135L940J795l099l945j757K231p40J71K302N35
15111A95595J439J358q73l020j763J698k23K06j032j921K046N036J406J103N67
15096B01622j837j089k05L638K514j899o80k172k536J735L104m31o560K635N326
15081B03165R38q44l256j662L080J965J98N2K095k67l73j73K840J963J172j973
15065B08920k154P52J990J457k111j979k465m30M562P25J34R39J101j375K474
15050B12540J485j22j934j865k954L522M916L33q44j625J604k57k399k58K448
15035B14590n02P57K796m56j897J87J425J073K323L790J74j910j443k198m78K784
$$ y = [193423, 191659, 189527, 189184, 191635, 192137, 192759, 191723, 189599, 186791, 186674, 191846, 193107, 192958, 193605, 194796, 193398, 189448, 187882, 189559, 193027, 194162, 198102, 199897, 196798, 192853, 191096, 193327, 192587, 192758, 195060, 195595, 197034, 198392, 197519, 194499, 192736, 194434, 194211, 194417, 193385, 191464, 193510, 198546, 199952, 201055, 201622, 199785, 198696, 198491, 202129, 204643, 202744, 202064, 199892, 197356, 199091, 202195, 201764, 195204, 197839, 203165, 204103, 203259, 200003, 198341, 201421, 203386, 203584, 203636, 205731, 205464, 205091, 204918, 207758, 209721, 210893, 208920, 206766, 207518, 209508, 210965, 208854, 206875, 204410, 203980, 208542, 209267, 209401, 210340, 211441, 210066, 212540, 214025, 213903, 211969, 210104, 207150, 210672, 215588, 215921, 215077, 213452, 215056, 214799, 212400, 212142, 214590, 214088, 214845, 217641, 217185, 215288, 215475, 216900, 217973, 220296, 224086, 224260, 222350, 220907, 218709, 218231, 221015]
15019B21015K43k602J031K344N154q74k339j544K783K672m83k895J14J887q80
15004B25626k686l63M191K617l94Q79L14j103R35n80L15j514l040R96L854j223
14988B28824j18L116J047M61o27L137J760K792j869r44J232N69J688Q84n32m747
14972B36673n77k329l034J847K848M15p66j44K68j4L521J842K429k515j973J525
14956B40016K285P90k815N14J663L12O64L17Q50m380m06J014J574J104l29N39
14940B43712J953K223k014p09L83J871L15l737J6L414L255q60J969m44K433L671
14924B57451l197k018O34L844J171k138J062q61J669P01r08O9k844k120L169J953
14908B57637K826J368L07O78N5o19N31K294k956n01L018m148k68L318K064l273
$$ y = [221015, 221258, 218656, 219687, 222031, 227185, 226311, 223972, 222428, 225211, 227883, 227400, 224505, 224619, 226506, 225626, 222940, 222577, 226768, 229385, 228991, 229870, 230184, 229081, 230016, 229436, 229751, 228237, 225197, 226193, 230047, 228824, 228706, 231822, 232869, 233330, 232703, 235840, 237600, 240392, 238523, 237579, 238811, 239380, 241068, 241952, 241420, 236673, 236096, 233767, 230733, 232580, 235428, 235843, 235077, 234933, 235201, 235187, 238708, 240550, 242979, 240464, 238491, 240016, 242301, 243091, 240276, 240790, 242453, 242765, 243429, 243746, 244596, 240216, 239810, 240824, 242398, 243502, 243173, 243712, 245665, 247888, 245874, 245165, 245548, 247419, 247734, 243997, 244013, 247427, 250682, 249822, 251791, 251347, 253780, 257451, 254254, 252236, 252870, 256714, 257885, 255747, 256809, 255948, 257617, 258318, 257410, 257479, 254635, 252515, 255684, 257637, 260463, 261831, 262138, 262816, 262871, 262252, 262783, 265077, 262121, 261620, 264638, 260490, 260222, 263540, 265604, 262331]
14892B62331k148L721P935M15l512k732P57k859J014K887p81O02r50j113l170
14877B62397L740P636K415P84J188L36n82j744m60K20l83P5J94k736j325k120
14861B69635L97m47r50J34K22K729K916M017K044n74j968J451m00L741K596j83
14845B85360J070J169J276j055L5P18n05k460J741K330k111j159q4k9l93j380
14829B84523M210L250R1k91P68n18j419J69J786J503j155Q93L727q7m211j246
14813B91993L903J335k272j08L62p00K25J058R15n10J96m64K207M966K135l210
14797C02031j38J174q23k040j128K944o5l068K910K441N96O8j080n33j251n01
14781C01537m66m88n7K68L117K651M410N55K071l039k543R4m10K410N728M07K023
$$ y = [262331, 260183, 263904, 271839, 272254, 268742, 266010, 266767, 263908, 264922, 267809, 267028, 267630, 266680, 265567, 262397, 266137, 273773, 276188, 276972, 278160, 278496, 277914, 276170, 275710, 275930, 275547, 275622, 275816, 273080, 271755, 269635, 270032, 269585, 268635, 268769, 268991, 271720, 274636, 278653, 280697, 280123, 278155, 279606, 279206, 282947, 285543, 285360, 286430, 287599, 288875, 287820, 287855, 288573, 288068, 285608, 287349, 289679, 287568, 286409, 286325, 286296, 285903, 284523, 288733, 291983, 292074, 291783, 292551, 292033, 290614, 290783, 292569, 294072, 292917, 293810, 297537, 297450, 293239, 291993, 295896, 297231, 294959, 294851, 295213, 294513, 294738, 295796, 296711, 296201, 296397, 295933, 298140, 303106, 305241, 302031, 301893, 303067, 302244, 300204, 299076, 302020, 301955, 298887, 301797, 304238, 304834, 304902, 303822, 303289, 302038, 301537, 301071, 300583, 300526, 300794, 303911, 306562, 310972, 311527, 313598, 310559, 308016, 308110, 307700, 310110, 315838, 316245, 318268]
14764C18268n78k744L58k052Q76M570L196j773p42L30m68o60J974j010K96J922
14748C21763J859K307J80m50k610P21r61r45l324p96J006L439J048j439J592o27
14732C22763Q33K764K944j013N92L35m22K626o71K756J464n92j293m648k016o13
14716C25809Q24J790K400P60J556j534n4R3J180K590p5j03k142K465M421P72j815
14699C38937k469j553k030k434K017K731L061J690l099nl21J390K818J85J091
14684C42009J613Q61K606j202j352K674K237J844j447l033J99J115J406P01R11
14669C51142p68J767o47k782j843J09J874K000J066L253J730K477j403J796o86
14654C59085j707K01l91J546M501k35n124K2K283k73j219M614J957k286K405O70
$$ y = [318268, 317690, 314946, 315304, 313252, 314128, 318698, 321894, 320121, 319379, 319709, 319241, 318581, 320555, 319545, 319841, 321763, 323622, 325929, 326109, 325659, 323049, 323770, 322809, 321864, 318540, 317744, 318750, 322189, 323237, 321798, 323390, 322763, 323596, 326360, 329304, 328291, 328883, 329218, 328796, 331422, 330751, 333507, 334971, 334379, 333086, 328438, 326422, 325809, 326633, 328423, 330823, 331583, 333139, 331605, 331551, 331644, 332824, 335414, 335339, 335236, 333094, 335559, 339980, 340752, 338937, 336468, 334915, 332885, 330451, 332468, 335199, 338260, 339950, 336851, 336846, 336525, 337915, 340733, 340918, 342009, 343622, 344483, 347089, 345887, 344535, 347209, 349446, 351290, 349843, 346810, 347009, 348124, 349530, 350231, 351142, 350374, 352141, 351494, 348712, 346869, 346978, 348852, 350852, 351918, 355171, 356901, 359378, 357975, 359771, 359085, 357378, 357579, 357188, 358734, 363235, 363000, 357876, 357898, 360181, 359908, 358689, 363303, 365260, 362974, 365379, 366049]
14638C66049j043J042J817k627m516L674J844m9O76J514L017L120o70m480K9j136
14622C68261m57K575L262O90k059o00K287j79J01J884o37m87k005J333J804P65
14606C76538N79L24J485M53J233m64k077j108K69k040K937K160k45M886L976l207
14590C85699l393J542J217j29j531j309L270Q0J591J859L420R80j053J317m65
14575C93095J419q7k970j972r83q48K123L879n30J033M570P87l76J171j387k337
14559C96587K6K302n14r60j830LO45L18j43K131L912j417j454K70L907K957n12
14542D06228j56Q76M053K63k479K030J150N15r19k920K224O72O41j763K235J374
14526D14024J224K58n74O00J493J569j539K76L472K314k782j82L108J871J485
$$ y = [366049, 365006, 366048, 367865, 365238, 360722, 364396, 366240, 366191, 366867, 368381, 371398, 374518, 373848, 369368, 369397, 368261, 367804, 370379, 373641, 374331, 372272, 371672, 373959, 373780, 373881, 375765, 375128, 374641, 372636, 373969, 375773, 376538, 377117, 377441, 378926, 379379, 380612, 380148, 378071, 376963, 377232, 375192, 378129, 380289, 380044, 384930, 388906, 385699, 382306, 383848, 385065, 384936, 383405, 382096, 385366, 385446, 387037, 388896, 392316, 393296, 392243, 393560, 393095, 394514, 394427, 391457, 389485, 388502, 387654, 389777, 393656, 393126, 394159, 398729, 399516, 399140, 400311, 398924, 396587, 396613, 398915, 398401, 397441, 395611, 395614, 396259, 396577, 396434, 398565, 402477, 401060, 399606, 399876, 403783, 406740, 406228, 406072, 406948, 411001, 411264, 408785, 410815, 411965, 412480, 411561, 408641, 410865, 411537, 412178, 410415, 412650, 414024, 415248, 415506, 414932, 415532, 417025, 418594, 417055, 417331, 420803, 423117, 420335, 420153, 423261, 425132, 426617]
14511D26617l76q26o27K356L139P9k385K811j102l265o59M95L46K234k091R14
14495D27660N81k143J962J624j217R86j759j555q21K03K740M047L22J243l4K290
14479D36129l08L065j839j186J808L630j397q55j188k743J181J010%P72L610K456
14463D44145O75k482j481J684M059N6j803j257K342J308k920l84L808J56J47R85
14447D49038O1J821M8J18K398M053o25j8R79P79j992k192j251J780K080J770J048
14430D59895J339o02j952k069K002p5J69M058K760j512k553K73J129L525m70j151
14414D64766P21N086K827l037K26j524J654K963K262P51l237Q38J610K127l290
14399D74743n120K084L739n2M54K369K147O14j111J295p03R81M368k249k284j819
$$ y = [426617, 426241, 425415, 424788, 427144, 430283, 430362, 427977, 430788, 429686, 426421, 425762, 426257, 426603, 428837, 426746, 427660, 428241, 426098, 428060, 429684, 428467, 429453, 427694, 426139, 425318, 425521, 428261, 432308, 432630, 433873, 433839, 436129, 435821, 438886, 437047, 435861, 437669, 441299, 439902, 439047, 437859, 435116, 436297, 437307, 437307, 438079, 441689, 444145, 444820, 442338, 440857, 442541, 446600, 446656, 444853, 443596, 445938, 447246, 444326, 443942, 447750, 447906, 448053, 449038, 449099, 450920, 450968, 451086, 453484, 457537, 456912, 456894, 457873, 458652, 456660, 454468, 453217, 454997, 457077, 458847, 459895, 461234, 460632, 458680, 456611, 458613, 458538, 458707, 462765, 465525, 464013, 461460, 461733, 462862, 466387, 465917, 464766, 465487, 470573, 473400, 470363, 470589, 469065, 470719, 473682, 475944, 476695, 473458, 474296, 475906, 478033, 474743, 469623, 471707, 475446, 475394, 475848, 478217, 480364, 480978, 479867, 481162, 480459, 481440, 485808, 483559, 481275, 479456]
14383D79456L700K424P67L583M947k944m445o88q86j518K920lJ266K74k575l400
14367D82878K378N181L903Q50q23k731l418L053J922k906K426M496K721J174k821
14352D98283J764K943J586J535j561L559J686k512o68j050m56M537N482M36n9
14337E15505j483K089M4K830K12k865P4j475K127J153k032k208j384p83K914J949
14321E16667j546J005L974K382J433J20K657k092k493M53L578L272k375k043j64
14306E24828J114l117j998K942L534L670J198j652J930O62J549J529q14j611J694
14291E35458K545m60J716J528j04N32m43m241L12K278J536J292k53K105L189J650
14275E48640J028j308j598n43o35K505K099M02K81J370J298j092R83J988L366
$$ y = [479456, 483156, 485580, 486347, 489930, 494877, 491933, 487488, 486800, 485914, 484396, 487316, 487313, 488579, 488853, 486278, 482878, 485256, 490437, 494340, 495190, 494367, 491636, 488218, 491271, 493193, 490287, 492713, 497209, 499930, 501104, 498283, 500047, 502990, 504576, 506111, 504550, 508109, 509795, 507283, 506615, 505565, 505109, 509646, 515128, 515564, 515505, 514022, 516111, 516155, 518985, 519197, 516332, 516406, 514931, 517058, 518211, 516179, 513971, 512587, 511804, 514718, 516667, 515121, 516126, 520100, 522482, 523915, 524035, 526692, 524600, 522107, 522560, 526138, 529410, 527035, 524992, 524828, 525942, 522825, 520827, 523769, 527303, 530973, 532171, 530519, 532449, 533111, 534660, 536189, 535375, 533764, 535458, 538003, 537543, 539259, 540787, 540683, 541215, 540772, 536531, 536843, 539121, 540657, 541949, 541696, 543801, 546990, 548640, 549668, 548360, 546762, 546219, 545584, 548089, 550188, 550590, 550871, 552241, 553539, 552447, 553430, 555418, 558784]
14260E58784p6k10k87J70M363j069k584m30K018P56j094L085J656j747J564j262
14244E63637o08P07J09N06J272o1J058M45P35M330J953o4J294L971l30J3k96k320
14226E76351J904q43Q20K097K23J552q69j976l005M811K536j473l511j722N834
14211E82729P2r2K679L579J485M70r02j417j828K136M371M183O29l80p91j151
14195E95772k87K619M631K02P44J177K82K116j051K546j181J874M949k511m324
14180F07558J615O35j740j882j208K725J641K321J912L299L175l46R32J388j409
14165F20616l368o70l63L09k003L232M877L381l43m032n5L873J329j287r9k898
14149F22499j592j782K963M375J449R39O42p73L549M881J669l476J346k97L269
$$ y = [558784, 558708, 558498, 558211, 558381, 562744, 561675, 559091, 558661, 560679, 561435, 560341, 563426, 565082, 563335, 564899, 563637, 563029, 563736, 563845, 564351, 565623, 565562, 566620, 567065, 567800, 572130, 574083, 574019, 575313, 579284, 578954, 578967, 578671, 576351, 578255, 577412, 578232, 580329, 580552, 582104, 581235, 579259, 576254, 581065, 583601, 582128, 578617, 576895, 582729, 582801, 582709, 585388, 588967, 590452, 590922, 590020, 588603, 586775, 588911, 593282, 597465, 598094, 597714, 596923, 595772, 595485, 598104, 602735, 602937, 603681, 604858, 605140, 607256, 606205, 608751, 607570, 609444, 614393, 611882, 607558, 609173, 609808, 608068, 606186, 604978, 607703, 609344, 611665, 613577, 616876, 620051, 619705, 620637, 622025, 620616, 617248, 616578, 616215, 616524, 614521, 617753, 622630, 626011, 625668, 621636, 621581, 625454, 626783, 625496, 625397, 622499, 620907, 619125, 622088, 626463, 627912, 628851, 629493, 628720, 632269, 637150, 638819, 635343, 636689, 636392, 639661]
14134F39661J070J630M378n1j43J055J389j442K372r5l129R46R74o3J497j339
14118F48710R90J695j197K931n02K798K576K029J489r02p69J892J598J09l2R37
14102F64352k457k393L916K152J114R8m549K607L204j219K676M281J48J238K867
14087F78035Q65J032L613j1K140q24P09k388j210j609K548K722l82p52k762j95
14071F81531K908J931l86L78J352L743J810l073K016L627m259K795Q98NP20P33
14055F96729k404J824L950M15J059K415m12L536O1K344p47l349j340L161O76L732
14039G11650J804m6q99K281L510p03l088M09L121N381K545j246r89q70J115o24
14023G23351j070J004K76J022K123J927j073K16J917J674J425J538j407N098M068
$$ y = [639661, 640731, 642361, 646739, 646688, 646545, 647600, 648989, 647547, 649919, 649824, 646695, 647641, 648615, 648552, 650049, 648710, 649700, 651395, 650198, 653129, 652627, 655425, 658001, 660030, 661519, 660617, 659848, 661740, 663338, 663447, 663415, 664352, 661895, 659502, 663418, 665570, 666684, 666782, 662233, 664840, 668044, 666825, 669501, 673782, 673930, 675168, 678035, 678900, 679932, 683545, 683534, 685674, 684850, 685559, 683171, 681961, 680352, 682900, 685622, 685240, 684488, 681726, 681531, 684439, 686370, 685984, 686362, 687714, 691457, 693267, 690194, 692210, 695837, 691578, 694373, 695271, 695276, 695996, 696729, 694325, 696149, 700099, 700514, 701573, 703988, 703576, 707112, 707173, 709517, 708770, 705421, 704081, 707242, 707918, 711650, 713454, 713408, 712509, 714790, 718300, 717597, 714509, 714918, 718039, 723420, 725965, 724719, 723730, 722860, 723975, 723351, 722281, 723285, 723561, 724583, 726706, 728633, 727560, 727776, 729693, 731367, 732792, 734330, 732923, 738021, 742089]
14008G42089M12q60M017k553k484K469n39q4L860J441K839L704o62k690J164J024
13992G53147j361J837M328K836k00M515M944J190m748l392p71P32K52K232L409
13977G68950j112k203n71L764N869P16p9m64J39j995K910L876j938l9K726N79
13961G81128K997K333J760j173k960J609J134J756k045R21J646O74k877J465J484
13946G89852K208J338M790j405l718L53K563L321L161O455N119J044J619R14L211
13931H20825J391k898k087O41J365J528M71L49J485M28M008k272l475p24J95K302
13915H23532N133L734o29j623j756M15N077P29P07j545N3L831j420N56N141K026
13899H43961O57P60m4O305K467L273q68m09J297J580K118J018j113l264K054N036
$$ y = [742089, 742501, 741641, 745658, 743105, 740621, 743090, 742551, 742467, 746327, 747768, 750607, 754311, 753649, 750959, 752123, 753147, 751786, 753623, 757951, 760787, 760587, 765102, 770046, 771236, 766488, 763096, 762325, 763057, 763309, 765541, 768950, 767838, 765635, 765064, 768828, 774697, 775413, 775334, 774870, 775009, 773014, 775924, 779800, 777862, 777823, 780549, 781128, 784125, 786458, 788218, 787045, 784085, 785694, 786828, 788584, 786539, 787460, 789106, 789780, 786903, 788368, 789852, 792060, 793398, 798188, 796783, 793065, 793418, 795981, 799302, 802463, 808918, 814037, 815081, 816700, 817614, 820825, 822216, 819318, 817231, 817872, 819237, 820765, 821236, 821585, 823070, 823498, 827506, 825234, 821759, 821035, 821230, 823532, 828665, 832399, 831770, 830147, 828391, 828806, 833883, 834612, 835319, 833774, 833827, 837658, 836238, 836794, 841935, 843961, 844618, 845378, 845334, 851639, 854106, 857379, 856511, 856102, 857399, 858979, 861097, 862115, 861002, 857738, 859792, 864828]
13883H64828L48k205K343L831K670l987L482M627J688J651K881J120j326n94k249
13868H79108j281L760K615L095J411j95j356J177j434O18L726K418M673J35J195
13853H99665K640l149L178R16K042J982M069K527L93j874p18k074M525K342K638
13838I19102J445J520p96J411M085L78J003P34k86J754J318K249L208M905M430
13823I46460J818j280P64L161M168Q371K756J805N019O226O544L106L533M14q847
13808I84018k7264l1703j3714O88M021O436K912J00J9J446N364O582O226p45P25
13793I45111M099K464K480M5L50J790p87L090K716J027K811J245J851J440K873
13778I72605J837L273J82J833N681K801K351K431l0k280L490R82J320K933K242
$$ y = [864828, 865176, 862971, 865314, 869145, 871815, 867828, 871310, 875937, 877625, 879276, 882157, 883277, 881951, 881357, 879108, 877827, 881587, 884202, 887297, 888708, 888513, 887157, 888334, 886900, 887518, 891244, 893662, 898335, 898470, 899665, 902305, 899156, 902334, 903250, 905292, 907274, 911343, 913870, 914263, 912389, 911671, 909597, 914122, 916464, 919102, 920547, 922067, 921271, 922682, 926767, 927145, 928148, 928882, 928596, 930350, 931668, 933917, 937125, 942030, 946460, 948278, 946998, 947762, 950923, 955091, 963462, 966218, 968023, 973042, 979268, 985812, 988918, 992451, 992865, 984018, 956754, 925051, 911337, 912025, 916046, 922482, 925394, 925494, 925513, 926959, 932323, 938905, 945131, 944386, 945111, 949210, 951674, 954154, 954199, 954549, 956339, 955552, 958642, 961358, 962385, 965196, 966441, 968292, 969732, 972605, 974442, 977715, 977897, 979730, 985411, 988212, 990563, 992994, 992964, 990684, 994174, 995156, 996476, 999409, 1001651]
13763A001651K43J715n59J909L844L222n43P02L696K102J457K754k298q50k222
13748A016823P35M227K947M804L646j229L4K903J207P12l05M9L328K708Q66K196
13732A045651L294J750M584J355J768N42L14j070M499K664N850M021L36o91M22
13717A075289J080J991K412j414p88j825k58k417Q68K307R87M795J736R12N578
13702A091253m43K641M509J399L4o7M801J442j791K128J523J688K676K585j69
13687A114209K342K578R24K287K531M63M921L140K82j862L679L911k293n38L226
13672A139800N728J953K788M182Q85N41k893J378L15j558L071J980L261J493M71
13657A163395J092N289L889K855L060J276M302J354K074K140K221K806J348J529
$$ y = [1001651, 1001894, 1003609, 1003050, 1004959, 1008803, 1012025, 1011482, 1012184, 1015880, 1017982, 1019439, 1022193, 1019895, 1019045, 1016823, 1017558, 1021785, 1024732, 1029536, 1033182, 1031953, 1031987, 1034890, 1036097, 1036809, 1036504, 1036553, 1039881, 1042589, 1043455, 1045651, 1048945, 1050695, 1055279, 1056634, 1058402, 1058944, 1059258, 1058188, 1062687, 1065351, 1071201, 1075222, 1075558, 1074867, 1075289, 1076369, 1078360, 1080772, 1079358, 1078570, 1076745, 1076487, 1074070, 1074938, 1077245, 1078232, 1083027, 1084763, 1085675, 1091253, 1090810, 1093451, 1097960, 1099359, 1099393, 1099326, 1104127, 1105569, 1103778, 1105906, 1107429, 1109117, 1111793, 1114378, 1114209, 1116551, 1119129, 1120053, 1122340, 1124871, 1125334, 1130255, 1133395, 1133677, 1131815, 1135494, 1139405, 1137112, 1136574, 1139800, 1145528, 1147481, 1150269, 1154451, 1155336, 1155877, 1152984, 1154362, 1154677, 1153119, 1156190, 1158170, 1161431, 1162924, 1163395, 1164487, 1169776, 1173665, 1176520, 1179580, 1180856, 1185158, 1186512, 1188586, 1190726, 1192947, 1195753, 1197101, 1198630]
13643A198630J181o29J440K960N425J424K53l83O73J211j763j277L668P377K06
13628A220396K777P5L53N066L262j440K477M070K805K527M461R8n361P33O402
13613A248701P657L733N691L444M158K194l18P14p95P26J53q64J371K038K097
13598A280700O963K949J094O51R16O24K855P622L319L78L936K237J724K204M57
13583A318629k458j986N356O366M535J190J636K542M809K249k40R46K657J696
13569A347927K091K138M60J036O719L584L12K55M025J118K816L670O41L940L746
13554A384478K116j97K747O566K454K080L323L689p79l018K975O674L706o13J422
13539A417623O241N224K801L001J820L237P546L206L081J031L07J605P55J905
$$ y = [1198630, 1199811, 1199182, 1200622, 1203582, 1209007, 1210431, 1210684, 1210301, 1210974, 1212185, 1210422, 1209145, 1212813, 1220190, 1220396, 1223173, 1223248, 1223601, 1228667, 1231929, 1230489, 1232966, 1237036, 1239841, 1242368, 1246829, 1246927, 1241566, 1242299, 1248701, 1256358, 1260091, 1265782, 1269226, 1273384, 1275578, 1275260, 1275974, 1275179, 1275905, 1276058, 1275194, 1276565, 1278603, 1280700, 1287663, 1290612, 1291706, 1292357, 1293273, 1293897, 1296752, 1304374, 1307693, 1308071, 1312007, 1314244, 1315968, 1318172, 1318629, 1316171, 1314185, 1319541, 1325907, 1330442, 1331632, 1333268, 1335810, 1340619, 1342868, 1342628, 1343574, 1346231, 1347927, 1350018, 1352156, 1352616, 1353652, 1360371, 1363955, 1364267, 1364522, 1368547, 1369665, 1372481, 1376151, 1376792, 1380732, 1384478, 1386594, 1386397, 1389144, 1395710, 1398164, 1400244, 1403567, 1407256, 1406477, 1403459, 1406434, 1413108, 1416814, 1416201, 1417623, 1423864, 1429088, 1431889, 1434890, 1436710, 1439947, 1447493, 1450699, 1453780, 1454811, 1455118, 1456723, 1457478, 1459383]
13525A459383R64O316k24r4L519L209M132L996L276M921N040L002K634K363K173
13510A504610j672O18K731J104M736M819K435K521J810K681J504J101J734N787
13496A536519M706K056J647M05N69L408N382J654L638L604K300O003O819M765
13482A583475J088q68M981J920K420K780J690M291K641J331O224N299K417K347
13468A622036N402N024J339N899M321J791N064k123k974Q17J851O451Q653O096
13454A669647K477M737L142J824M05R15O57O32O480P027M858M481K984P245K696
13439A720207K460P504M063M533N590M531J627M447M227N095N609K877L543N764
13425A782077N929J491J794M944M266N178N978N662R14N82J361J047K306M593
$$ y = [1459383, 1460347, 1466663, 1466439, 1466345, 1469864, 1473073, 1477205, 1481201, 1484477, 1489398, 1494438, 1497440, 1500074, 1502437, 1504610, 1502938, 1503556, 1506287, 1507391, 1512127, 1516946, 1519381, 1521902, 1523712, 1526393, 1527897, 1528998, 1530732, 1536519, 1541225, 1543281, 1544928, 1545333, 1545902, 1549310, 1554692, 1556346, 1559984, 1563588, 1565888, 1571891, 1578710, 1583475, 1584563, 1583695, 1588676, 1590596, 1593016, 1595796, 1597486, 1601777, 1604418, 1605749, 1611973, 1617272, 1619689, 1622036, 1627438, 1632462, 1633801, 1639700, 1644021, 1645812, 1650876, 1648753, 1645779, 1646596, 1648447, 1654898, 1663551, 1669647, 1672124, 1676861, 1680003, 1681827, 1682232, 1683147, 1683804, 1684436, 1690916, 1697943, 1702801, 1707282, 1710266, 1717511, 1720207, 1722667, 1730171, 1734234, 1738767, 1744357, 1748888, 1750515, 1754962, 1759189, 1764284, 1769893, 1772770, 1776313, 1782077, 1788006, 1789497, 1791291, 1796235, 1800501, 1805679, 1811657, 1817319, 1818233, 1818815, 1820176, 1821223, 1823529, 1828122]
13411A828122Q545P673P18K221K041J0210R221K817K178M375J881M81M656O934
13397A892073O343O284Q236R748R072O126M017L169J701L681J297J452P867R262
13383A970328O395N980O753K604J673P787O093L821L419M313N733J1221P117O705
13369B049942O535N892Q115N870Q438O119N423R753J3695J8725K5447J7336P375
13356B188665O853P555O175R625J1441J0960Q854O483J1769K1035K2819K3290
13344B335524K6141K6085K0360J3986J3480R468J1794K1340L0430L5455L9580
13333B583643M4033M9322N7677O7761Q8156J16060J42031J41042M5529k36571
13323C098683n72658o61407n78585k86652M6100J62222J54441J19426R4277P0722
$$ y = [1828122, 1836667, 1844340, 1845058, 1847279, 1849320, 1859530, 1868751, 1871568, 1873746, 1878121, 1880002, 1880483, 1885139, 1892073, 1898416, 1904700, 1912936, 1922684, 1931756, 1937882, 1941899, 1945068, 1946769, 1950450, 1951747, 1953199, 1961066, 1970328, 1976723, 1982703, 1989456, 1992060, 1993733, 2001520, 2007613, 2011434, 2014853, 2019166, 2024899, 2036120, 2043237, 2049942, 2056477, 2062369, 2070484, 2076354, 2084792, 2090911, 2096334, 2106087, 2119782, 2138507, 2163954, 2181290, 2188665, 2195518, 2203073, 2209248, 2218873, 2230314, 2241274, 2250128, 2256611, 2268380, 2289415, 2312234, 2335524, 2361665, 2387750, 2408110, 2422096, 2435576, 2445044, 2456838, 2478178, 2508608, 2544063, 2583643, 2627676, 2676998, 2734675, 2802436, 2890592, 3006652, 3148683, 3289725, 3335254, 3098683, 2526025, 1864618, 1286033, 999381, 1045481, 1207703, 1362144, 1481570, 1575847, 1646569]
13313A646569O1772N6545M7330M4617L7831K9750K6110K2363K0658K3030K1338
13302B037913K0982K0549J5335J9160J7742J8269J9283J7163J6240J3534J6721
13291B232891K0384J5423R840J1681J1492J2494J7851J5361J4725J8400K0313
13280B400855K3344K5131K6603L3464L5082M0454M4987N1535M8219p052j41827
13269B580795k90015k35549m6178M6906N9979N3770M2246L4442K6128K3959K0815
13258B317298J9071J5708J2562J4038J5946J5232J8295J6789J1396J3790J0669
13247B480794J2370J7113J6273Q705L357L134J0275J1870P128Q403R727P748O825
13234B603722J0325Q887J3588J4575J2342J2582J2208J1633J4014J4995J0640
$$ y = [1646569, 1708341, 1764886, 1812216, 1856833, 1894664, 1924414, 1950524, 1972887, 1993545, 2016575, 2037913, 2058895, 2079444, 2094779, 2113939, 2131681, 2149950, 2169233, 2186396, 2202636, 2216170, 2232891, 2253275, 2268698, 2278538, 2290219, 2301711, 2314205, 2332056, 2347417, 2362142, 2380542, 2400855, 2424199, 2449330, 2475933, 2509397, 2544479, 2584933, 2629920, 2681455, 2729674, 2722622, 2580795, 2290780, 2055231, 2009053, 2055959, 2115938, 2169708, 2211954, 2246396, 2272524, 2296483, 2317298, 2336369, 2352077, 2364639, 2378677, 2394623, 2409855, 2428150, 2444939, 2456335, 2470125, 2480794, 2493164, 2510277, 2526550, 2535255, 2538612, 2541746, 2552021, 2563891, 2571019, 2579422, 2589149, 2596897, 2603722, 2614047, 2622934, 2636522, 2651097, 2663439, 2676021, 2688229, 2699862, 2713876, 2728871, 2739511]
13223B739511J1422J2033J1114R145N462Q196R470J2092J5291J4927J5873J2045
13211B876581R910J4361J5623J0765R470P870R370R630J1967J5534J6259J4453
13199C021793J4824J3746J7032K1001J6529K2605J6600J8119K0277J5290J3406
13188C211222K4346K7711K5528j2307q3611j23348n9129J5918L9104M0352L7831
13177C143617K9929K5447K5009K5214K4562K2198K2774K0621K1169J7153K2917
13166C400610K9175K8284L2305L5051L3709L8218M5993N4077N9310P2355N9704
13155C888791k1188k08239l33004j38063L5635P3834P0078N4099M6297M0076L5469
13144C543785L2206L5066K7877K7140K4785J5806K1467K8775J8371P023p296k3570
$$ y = [2739511, 2750933, 2762966, 2774080, 2783225, 2788687, 2796883, 2806353, 2818445, 2833736, 2848663, 2864536, 2876581, 2886491, 2900852, 2916475, 2927240, 2936710, 2944580, 2953950, 2963580, 2975547, 2991081, 3007340, 3021793, 3036617, 3050363, 3067395, 3088396, 3104925, 3127530, 3144130, 3162249, 3182526, 3197816, 3211222, 3235568, 3263279, 3288807, 3276500, 3192889, 3069541, 3010412, 3026330, 3065434, 3105786, 3143617, 3173546, 3198993, 3224002, 3249216, 3273778, 3295976, 3318750, 3339371, 3360540, 3377693, 3400610, 3429785, 3458069, 3490374, 3525425, 3559134, 3597352, 3643345, 3697422, 3756732, 3829087, 3888791, 3867603, 3659364, 3326360, 3188297, 3223932, 3297766, 3367844, 3421943, 3468240, 3508316, 3543785, 3575991, 3611057, 3638934, 3666074, 3690859, 3706665, 3728132, 3756907, 3775278, 3782301, 3775005, 3751435]
13132C751435o912j3959l9422l1244q666R049M3267M8425M0150L3241L1152K9457
13120C885973K4205K3793K1817K0947J8810J5054J2198R618Q164J7947K4978K4638
13108D108142K1938J9047J7167J0115J4479K3251L1713L3504L7841L4413K7771
13097D379381K7642K9189K3841J9694J7138K1732J8113Q855R387Q284M213J0483
13085D577952K0357L0633M7117N3663M8953M2141M2578L7213K9327K0764J6836
13074D967534J2652J3738J4404J5572K2539M0232N2621N3807N3877M7224M1293
13063E335493L4889K8477K5832J1177j648Q866K6194L8994M2111M1808M5896M1794
13051E679883L7693L4675L9507L8312M0143M4885M1619L6853L6550L4391L5825
$$ y = [3751435, 3744523, 3730564, 3691142, 3659898, 3651232, 3660281, 3703548, 3751973, 3792123, 3825364, 3856516, 3885973, 3910178, 3933971, 3955788, 3976735, 3995545, 4010599, 4022797, 4032415, 4040579, 4058526, 4083504, 4108142, 4130080, 4149127, 4166294, 4176409, 4190888, 4214139, 4245852, 4279356, 4317197, 4351610, 4379381, 4407023, 4436212, 4460053, 4479747, 4496885, 4518617, 4536730, 4545585, 4554972, 4563256, 4567469, 4577952, 4598309, 4628942, 4676059, 4729722, 4778675, 4820816, 4863394, 4900607, 4929934, 4950698, 4967534, 4980186, 4993924, 5008328, 5023900, 5046439, 5086671, 5139292, 5193099, 5246976, 5294200, 5335493, 5370382, 5398859, 5424691, 5435868, 5434220, 5443086, 5469280, 5508274, 5550385, 5592193, 5638089, 5679883, 5717576, 5752251, 5791758, 5830070, 5870213, 5915098, 5956717, 5993570, 6030120, 6064511, 6100336]
13040F100336L9493L9216M1753L5192K9071L6540M1028M4040N4379O8591P6746
13029F606385P5500P0167O4698O0023N4145N3999N8640O5485P5029Q6087R4626
13018G364784J04617J14613J32463J50019J45820N9742j54217l31437l09768l31322
13008F945314k14248K2500J27652J47237J39040J43209J33084J18528J07189R5533
12998G765038Q8831Q2900Q1543Q1402Q5466Q7172Q8784Q5934Q5269R5718R9504
12987H727561R6323R9431R5057R0789R2050Q8499R2102R4393R6642R9270R8313
12976I770430J06684J11420J10688J13930J25635J25196J21589J27986J36832
12967A0850390J42507J43640J43778J42946J40074J42529J40232J45230J51719
$$ y = [6100336, 6139829, 6179045, 6220798, 6255990, 6285061, 6321601, 6362629, 6406669, 6461048, 6529639, 6606385, 6681885, 6752052, 6816750, 6876773, 6930918, 6984917, 7043557, 7109042, 7184071, 7270158, 7364784, 7469401, 7584014, 7716477, 7866496, 8012316, 8072058, 7917841, 7586404, 7276636, 6945314, 6731066, 6753566, 6881218, 7028455, 7167495, 7310704, 7443788, 7562316, 7669505, 7765038, 7853869, 7936769, 8018312, 8099714, 8185180, 8272352, 8361136, 8447070, 8532339, 8628057, 8727561, 8823884, 8923315, 9018372, 9109161, 9201211, 9289710, 9381812, 9476205, 9572847, 9672117, 9770430, 9877114, 9988534, 10099222, 10213152, 10338787, 10463983, 10585572, 10713558, 10850390, 10992897, 11136537, 11280315, 11423261, 11563335, 11705864, 11846096, 11991326, 12143045]
12958A2143045J51373J49721J58681J69022J74533J76336J81876J70756J56625
12949A3631968J53294J55250J71746J94603K16757K42404K59485K84585K95172
12940A5605264K98181K98226K95745K91053K89732K96063L08085L17899L28682
12931A8328930L47588L62601L78069M00290M23852M48428M65030M80788M93457
12922B2129033N00064N11569N24117N48853N98413O52801P00882P50601Q01947
12913B7718280Q59353R17675R74465J025069J068449J092796J128829J187350
12905C5972266J281142J402933J531152J684304J855094K042569K274893K556088
12897E0600441K863151L188935L530535L942609M473256N199456O089938P112618
$$ y = [12143045, 12294418, 12444139, 12602820, 12771842, 12946375, 13122711, 13304587, 13475343, 13631968, 13785262, 13940512, 14112258, 14306861, 14523618, 14766022, 15025507, 15310092, 15605264, 15903445, 16201671, 16497416, 16788469, 17078201, 17374264, 17682349, 18000248, 18328930, 18676518, 19039119, 19417188, 19817478, 20241330, 20689758, 21154788, 21635576, 22129033, 22629097, 23140666, 23664783, 24213636, 24812049, 25464850, 26165732, 26916333, 27718280, 28577633, 29495308, 30469773, 31494842, 32563291, 33656087, 34784916, 35972266, 37253408, 38656341, 40187493, 41871797, 43726891, 45769460, 48044353, 50600441, 53463592, 56652527, 60183062, 64125671, 68598927, 73798383, 79888321, 87000939]
12889H7000939Q232102R415225J1022722J3447712J6814468K1028893K3783872
12882A90745933J7232156j2828778o6827166j03667919j02337511q8439660m0977828
12875b07100773Q677028K4667822K3313378J8583062J4299106J1104087R022180
12868i7434110P693553O842302O092123N341181M663914M094638L577433L162503
12860e5966463K844149K580252K373801K200613K024814J856352J726659J605922
12852c8753901J504395J426661J326845J210719J093851R84253Q92052Q27051
12844b9488074P83588P45883P24732O97625O78762O67205O54822O38789O06168
12835b3290500N65536N20842M81602M53988M34029M26249M16497M08211M01065
$$ y = [87000939, 95233041, 104648266, 115670988, 129118700, 145933168, 166962061, 190745933, 207978089, 195149311, 128322145, 24654226, -77683285, -166122945, -207100773, -198423745, -173755923, -150442545, -131859483, -117560377, -106456290, -97434110, -89740557, -82898255, -76806132, -71464951, -66801037, -62706399, -59128966, -55966463, -53122314, -50542062, -48168261, -45967648, -43942834, -42086482, -40359823, -38753901, -37249506, -35822845, -34496000, -33285281, -32191430, -31207177, -30315125, -29488074, -28704486, -27958603, -27233871, -26536246, -25857484, -25190279, -24535457, -23896668, -23290500, -22724964, -22204122, -21722520, -21268532, -20834503, -20408254, -19991757, -19583546, -19182481]
12826a9182481L84178L72192L64709L49840L33599L23282L10113K82520K61252
12817a6200796K45805K35510K37488K40156K44392K51955K51124K49916K49332
12808a3995118K43606K36146K40721K49529K65099K81725K82660K42709J14207
12799a1838716j09547k93897l11024j82806L4417J96287K50940K45322K23197
12790a1785827J89171J32016O2326K5354K2487M5215J20725J59923J54309J46723
12780a0727578J38560J29029J18684J18110J23102J25832J25095J19360J07945
12771i621861R2828P7880P3023P1616Q3073Q2962R1078R7809R4413Q8667R1269
12760h677243R6807R3750R0445Q3067O4389M3395M0758L9284J5830r372o1166
$$ y = [-19182481, -18798303, -18426111, -18061402, -17711562, -17377963, -17054681, -16744568, -16462048, -16200796, -15954991, -15719481, -15481993, -15241837, -14997445, -14745490, -14494366, -14244450, -13995118, -13751512, -13515366, -13274645, -13025116, -12760017, -12478292, -12195632, -11952923, -11838716, -11948263, -12242160, -12553184, -12735990, -12701573, -12505286, -12254346, -12009024, -11785827, -11596656, -11464640, -11402314, -11376960, -11354473, -11309258, -11188533, -11028610, -10874301, -10727578, -10589018, -10459989, -10341305, -10223195, -10100093, -9974261, -9849166, -9729806, -9621861, -9529033, -9451153, -9378130, -9306514, -9223441, -9140479, -9049401, -8951592, -8857179, -8768512, -8677243, -8580436, -8486686, -8396241, -8313174, -8248785, -8205390, -8164632, -8125348, -8109518, -8118890, -8180056]
12749h180056k6156O3552R1224Q9222Q7028P8272O7554O3547O0969N9498O1724
12738g483622O1316O2016O0289N9433O4302O6632O3321N5067M5933L4206K6641
12727f884466L0452K9998L3653M4854N1165N1978N7900N6382N0830M3493M1797
12716f391964M3187M5118M6619M4019L8672L7239L5886L6181L4974L8954L6734
12705e954381L4890L1748K9126L2262L2925L6194M8708M7254L0285J6289J4074
12694e600626J6067J8137K0827J5103J0090O028J4957K8113L5315M2069M5544
12683e348376M6411M1998L4493L1021K3545J9124J5940K827j517M840J1719K2261
12671e095714L3428L9305L9730M4289M1359K9383K6216K1001J9287J4008J9571
$$ y = [-8180056, -8206212, -8142660, -8051436, -7962214, -7875186, -7796914, -7729360, -7665813, -7604844, -7545346, -7483622, -7422306, -7360290, -7300001, -7240568, -7176266, -7109634, -7046313, -6991246, -6945313, -6911107, -6884466, -6854014, -6824016, -6790363, -6745509, -6694344, -6642366, -6584466, -6528084, -6477254, -6433761, -6391964, -6348777, -6303659, -6257040, -6213021, -6174349, -6137110, -6101224, -6065043, -6030069, -5991115, -5954381, -5919491, -5887743, -5858617, -5826355, -5793430, -5757236, -5708528, -5661274, -5630989, -5614700, -5600626, -5584559, -5566422, -5545595, -5530492, -5520402, -5514374, -5499417, -5471304, -5435989, -5393920, -5348376, -5301965, -5259967, -5225474, -5194453, -5170908, -5151784, -5135844, -5133017, -5134534, -5129694, -5117975, -5095714, -5062286, -5022981, -4983251, -4938962, -4897603, -4868220, -4842004, -4821003, -4801716, -4787708, -4768137]
12660d768137K1591J9536J8198J2241J0987J2793J9030K4343K6133K6666K3731
12649d552888J5991J5041K0343K2192K5465L0461L4402K8753K3712K6992J9809
12638d289727J9108J8282J7038J8353J4408K0013K0069J4005J5543J1909L480
12627d117519N358O588N737R409R962J2044J4801J5897J9226K2016K1678J7059
12615c957744J3872J7058K0243K3318K0462J1451J4931J6471J9102J8900J7742
12604c764194Q523k56K493J0142J3147J0687J2659J5438J1794O963O670R170J3305
12591c643459J4374J2921J4840J4357Q280J1099J1267J1729J4491J1598Q347L905
12579c506251K272O491J0500J0906J5739J9422J9279J7313J5475J3942J6508J8341
$$ y = [-4768137, -4746546, -4727010, -4708812, -4696571, -4685584, -4672791, -4653761, -4629418, -4603285, -4576619, -4552888, -4536897, -4521856, -4501513, -4479321, -4453856, -4423395, -4388993, -4360240, -4336528, -4309536, -4289727, -4270619, -4252337, -4235299, -4216946, -4202538, -4182525, -4162456, -4148451, -4132908, -4120999, -4117519, -4112161, -4105573, -4099836, -4090427, -4080465, -4068421, -4053620, -4037723, -4018497, -3996481, -3974803, -3957744, -3943872, -3926814, -3906571, -3883253, -3862791, -3851340, -3836409, -3819938, -3800836, -3781936, -3764194, -3755671, -3755927, -3753434, -3743292, -3730145, -3719458, -3706799, -3691361, -3679567, -3672604, -3665934, -3656764, -3643459, -3629085, -3616164, -3601324, -3586967, -3578687, -3567588, -3556321, -3544592, -3530101, -3518503, -3510156, -3506251, -3503979, -3497488, -3486988, -3476082, -3460343, -3440921, -3421642, -3404329, -3388854, -3374912, -3358404, -3340063]
12567c340063J8766J7030J1915P616P121P638R702P884Q651N491Q288J0177J0788
12554c208996J2490J1401R829Q248Q747Q792Q136P455J2767P497M264Q511Q695
12541c092164J0347R896J0700R730P155R244J0643J0346O958O849M938J0877J1944
12528b972537Q136R331N600R275R560J0693Q751J1320J0593J2035R355J0219J0045
12515b847624N657O495O854P718O989Q930P946R357Q029P112N068M379Q075J6854
12501b738161J4424J0493O968M669R242J2397J1252O565P587N849K676P656N595
12488b632788M300Q462J1495J2009J0675Q351N068R099J2196R884O089P300N299
12475b522561P518J1233O832Q910J3465Q695P555R556P557Q395J0263R095R205
$$ y = [-3340063, -3321297, -3304267, -3292352, -3284736, -3277615, -3269977, -3260275, -3252391, -3243740, -3238249, -3229961, -3219784, -3208996, -3196506, -3185105, -3175276, -3167028, -3158281, -3149489, -3141353, -3133898, -3121131, -3113634, -3109370, -3100859, -3092164, -3081817, -3071921, -3061221, -3051491, -3044336, -3035092, -3024449, -3014103, -3007145, -3000296, -2995358, -2984481, -2972537, -2964401, -2955070, -2949470, -2940195, -2930635, -2919942, -2911191, -2899871, -2889278, -2877243, -2867888, -2857669, -2847624, -2841967, -2835472, -2828618, -2820900, -2813911, -2804981, -2797035, -2787678, -2779649, -2772537, -2767469, -2763090, -2755015, -2738161, -2723737, -2713244, -2706276, -2701607, -2692365, -2679968, -2668716, -2662151, -2654564, -2648715, -2646039, -2638383, -2632788, -2628488, -2620026, -2608531, -2596522, -2585847, -2577496, -2572428, -2563329, -2551133, -2541249, -2535160, -2527860, -2522561, -2515043, -2503810, -2496978, -2488068, -2474603, -2465908, -2458353, -2448797, -2441240, -2432845, -2422582, -2413487, -2404282]
12462b404282Q266J4756J4339R698R540J2686J4887J3628J3825J2155K0488K3336
12450b236678J5421J5894J6120J5745J8692J8780K3170K8185K8398L5981M0874
12439a979418M6720N1158N8403O7982P7088R7613J26234J50885J12708q1327m34729
12428a706683o55789o36755m55865r5388J26993J60460J35651J07902Q2205P6167
12418b861102P1147O2485N0960M3851K5850J7107J4764J3929J7773J9923J5874
12407b507439J6470J5752J9428J3736J3191J9243K0084J2853M895J629N1K57K846
12394b367004J0323J0007O447P413J0897O978M175P174M772J1548J1901R846R912
12381b255611R676Q607P031O278N063O39K496P572L243N661Q287Q656N746L945
$$ y = [-2404282, -2396016, -2381260, -2366921, -2357223, -2347683, -2334997, -2320110, -2306482, -2292657, -2280502, -2260014, -2236678, -2221257, -2205363, -2189243, -2173498, -2154806, -2136026, -2112856, -2084671, -2056273, -2020292, -1979418, -1932698, -1881540, -1823137, -1755155, -1678067, -1580454, -1454220, -1303335, -1190627, -1271954, -1706683, -2362472, -2999227, -3455092, -3550480, -3423487, -3263027, -3127376, -3019474, -2937269, -2861102, -2789955, -2727470, -2676510, -2632659, -2606809, -2589702, -2574938, -2561009, -2543236, -2523313, -2507439, -2490969, -2475217, -2455789, -2442053, -2428862, -2409619, -2389535, -2376682, -2371787, -2370158, -2370107, -2369850, -2367004, -2356681, -2346674, -2340227, -2332814, -2321917, -2314939, -2310764, -2303590, -2298818, -2287270, -2275369, -2265523, -2255611, -2245935, -2237328, -2230297, -2224019, -2218956, -2218317, -2215821, -2208249, -2205006, -2199345, -2191058, -2182402, -2176656, -2172711]
12367b172711N238O526M782K693M576N783K104N537N055N763M305M99O455L711
12353b109684P380M315k979q67J33J386N183P805Q673Q500Q554N582L935N583
12339b046501N652K89M756O137O355M403L221M709N023M247M913P297K113J929
12325a985457N374M261N997O555K832L71M598M600K253N338K065L334N575J106
12311a931198J692M783L893K758L271J182P2K684p7j255K441P342O843L013P360
12296a885196N704m15J062M589O588N599L622k58N43L429J781R62K385M871L521
12281a841213R74M924N083K366J755K586J880L908M890M164O829P54O64K604L505
12266a794327J124O85K977M245M105N124L661J830N810O649N247K514L120K464
$$ y = [-2172711, -2167473, -2160947, -2156165, -2153472, -2148896, -2143113, -2141009, -2135472, -2130417, -2124654, -2120349, -2119850, -2113395, -2109684, -2102304, -2097989, -2100968, -2101835, -2101702, -2100316, -2095133, -2087328, -2078655, -2070155, -2061601, -2056019, -2052084, -2046501, -2040849, -2040560, -2035804, -2029667, -2023312, -2018909, -2015688, -2010979, -2005956, -2001709, -1996796, -1989499, -1987386, -1985457, -1980083, -1975822, -1969825, -1963270, -1960438, -1960067, -1955469, -1950869, -1948616, -1943278, -1941213, -1937879, -1932304, -1931198, -1929506, -1924723, -1920830, -1918072, -1914801, -1913619, -1913547, -1910863, -1910940, -1912195, -1909754, -1902412, -1895569, -1892556, -1885196, -1879492, -1879907, -1878845, -1874256, -1867668, -1862069, -1858447, -1858705, -1858162, -1854733, -1852952, -1851990, -1849605, -1844734, -1841213, -1840239, -1835315, -1830232, -1827866, -1826111, -1823525, -1821645, -1817737, -1812847, -1808683, -1801854, -1801100, -1800436, -1797832, -1794327, -1793203, -1792518, -1789541, -1785296, -1781191, -1776067, -1772406, -1770576, -1764766, -1758117, -1752870, -1750356, -1747236, -1744772]
12252a744772M095M156N437O873J594O37L101L619N519N317M262L331N115N054
12238a686662L460M517N365N536P606N636K171O576Q464K945k501j0755k3325
12225a670967k6539j8389n677N674P668N509N060Q921O021O643M442m28N468L592
12211a663002M075K740N90N304L783J592M391O866M405J911K67L152n59R19K986
12196a620580M851M973J019L612M275K182J129J537M371K814K836K576P08K490
12182a581207J482J730J463M371N826L970K209j144K115L758J593L326L049K760
12168a544699J221N364L955k692J462M855K330M56L242K908K947J312j200J745
12154a516794N240L338N406N342P36K625N419N708L427K068Q13Q55N210N984N635
$$ y = [-1744772, -1740677, -1736521, -1731084, -1724211, -1722617, -1721980, -1718879, -1715260, -1709741, -1704424, -1700162, -1696831, -1691716, -1686662, -1683202, -1678685, -1673320, -1667784, -1660178, -1654542, -1652371, -1645795, -1637331, -1634386, -1636887, -1647642, -1670967, -1697506, -1715895, -1721572, -1715898, -1708230, -1702721, -1697661, -1688740, -1682719, -1676076, -1671634, -1672062, -1666594, -1663002, -1658927, -1656187, -1655597, -1650293, -1646510, -1644918, -1640527, -1633661, -1629256, -1627345, -1627078, -1623926, -1624485, -1623566, -1620580, -1615729, -1610756, -1609737, -1606125, -1601850, -1599668, -1598539, -1597002, -1592631, -1589817, -1586981, -1584405, -1583697, -1581207, -1579725, -1577995, -1576532, -1572161, -1566335, -1562365, -1560156, -1561300, -1559185, -1555427, -1553834, -1550508, -1547459, -1544699, -1543478, -1538114, -1534159, -1536851, -1535389, -1530534, -1528204, -1527748, -1524506, -1521598, -1518651, -1517339, -1518539, -1516794, -1511554, -1508216, -1502810, -1497468, -1496732, -1494107, -1488688, -1482980, -1479553, -1477485, -1476672, -1475817, -1470607, -1464623, -1458988]
12139a458988L988P260J1679P732R657R138m943k3856m0259l6435j4050K261J2891
12126a513925P715P919O601O534K599J906L996N464K304L683J05n223M063P491
12112a458768L014K568n18M476L642J691K409L324M59K348L600n86J605K613K184
12097a425939J556L955o7J590M312N562K246J318n42L063M815J90N74K712J683
12082a392972q32m871K516M178L816K919J608J862K126M069J240M49K483R00k251
12067a372760P20K476O048K729j049K896L447j142k250l76M46N114N989J847L039
12052a342826j177K087L034J601L051L415L346P38K473k751p35k49m81M97P7K904
12036a324996J003N117M880N84R70K965M876N287n68k558K380L124J825l127K427
$$ y = [-1458988, -1455000, -1447740, -1436061, -1428329, -1418672, -1409534, -1414477, -1438333, -1478592, -1515027, -1529077, -1526816, -1513925, -1506210, -1498291, -1491690, -1485156, -1482557, -1480651, -1476655, -1471191, -1468887, -1465204, -1465099, -1470322, -1466259, -1458768, -1455754, -1453186, -1453704, -1449228, -1445586, -1443895, -1441486, -1438162, -1437703, -1435355, -1431755, -1432341, -1430736, -1428123, -1425939, -1424383, -1420428, -1420495, -1418905, -1414593, -1409031, -1406785, -1405467, -1406009, -1402946, -1398131, -1397941, -1397367, -1394655, -1392972, -1393804, -1398675, -1396159, -1391981, -1388165, -1385246, -1383638, -1381776, -1379650, -1375581, -1374341, -1373892, -1371409, -1370509, -1372760, -1372040, -1369564, -1363516, -1360787, -1361836, -1358940, -1355493, -1356635, -1358885, -1359261, -1358815, -1353701, -1347712, -1345865, -1342826, -1344003, -1341916, -1338882, -1337281, -1334230, -1330815, -1327469, -1326731, -1324258, -1327009, -1327744, -1327993, -1328474, -1327977, -1327900, -1324996, -1323993, -1318876, -1313996, -1313412, -1312442, -1309477, -1304601, -1299314, -1299882, -1302440, -1300060, -1296936, -1295111, -1298238, -1295811]
12021a295811P376M869J047r29Q31M439k373k31k024k591j276K900L340M68k18
12006a280183l428J035M507J614J38N565K595K155P84k47R92J166L243K893K428
11991a254743P365L080J12l97M461r25l93Q40l3q62L315K437q39K828M740J668
11975a227346L440O014M090K267j743n05l008N94L328R40n91m6j319k306n133
11960a221324P97k68J989N095J919k24L353M918K522M60M048J724j364j50O74
11945a195831J977K665K971l398n416K326N502K075j276K6n568k794M326L495
11931a188920M224M340J160J370l099J181N869L938j169m38K18k590N49L516J357
11916a168494K526K831K404O98m30J955J250J663L572M860J469K155J945J093
$$ y = [-1295811, -1288435, -1283566, -1282519, -1283448, -1282617, -1278178, -1280551, -1280782, -1282806, -1285397, -1286673, -1283773, -1280433, -1279965, -1280183, -1283611, -1282576, -1278069, -1276455, -1276317, -1270752, -1268157, -1266002, -1265218, -1265465, -1264473, -1263307, -1260064, -1257171, -1254743, -1247378, -1244298, -1244186, -1244583, -1240122, -1241047, -1241440, -1240600, -1240633, -1241495, -1238180, -1235743, -1236582, -1233754, -1229014, -1227346, -1223906, -1217892, -1213802, -1211535, -1213278, -1213783, -1216791, -1216197, -1212869, -1211929, -1212520, -1212566, -1213885, -1216191, -1221324, -1220527, -1220795, -1218806, -1213711, -1211792, -1212016, -1208663, -1203745, -1201223, -1200763, -1196715, -1194991, -1196355, -1196505, -1195831, -1193854, -1191189, -1188218, -1191616, -1197032, -1194706, -1189204, -1187129, -1188405, -1188379, -1193947, -1196741, -1192415, -1188920, -1184696, -1180356, -1179196, -1177826, -1180925, -1179744, -1173875, -1169937, -1171106, -1171544, -1171326, -1173916, -1173367, -1169851, -1168494, -1165968, -1163137, -1160733, -1160035, -1160465, -1158510, -1157260, -1155597, -1152025, -1147165, -1145696, -1143541, -1141596, -1140503]
11902a140503l014j174L432K372j106N03J719J91M98j243K71K85j105m46K171
11887a137149J409K692R30k824R23j790K423R49o43J488J232L344L566M212K777
11872a116461L925L055j166j605J089j28k897K206M217m94L20K929J679R8J653
11857a101580J644j097N77K057j038K46L659p91K332L245K552L055J158n05q67
11842a085353L050K495K795K23J76k94P01N398K785j999l227P41K863j584J762
11827a069468L108J747J059j010M60J281L52j012q12J810L892Q45j511M36L604
11812a055219M395N308L355j072o36o76M41r68K932L03j038L001L163j460Q4L94
11796a037693K291j135J2l44j632J192L757L166O51L96J593R70M341J606k977
$$ y = [-1140503, -1143517, -1144691, -1141259, -1138887, -1139993, -1139490, -1137771, -1137580, -1137082, -1138325, -1138054, -1137769, -1138874, -1139320, -1137149, -1135740, -1133048, -1132118, -1134942, -1134019, -1135809, -1133386, -1132437, -1133080, -1131592, -1130360, -1127016, -1123450, -1119238, -1116461, -1112536, -1109481, -1110647, -1112252, -1111163, -1111291, -1114188, -1111982, -1107765, -1108259, -1107939, -1105010, -1103331, -1103233, -1101580, -1099936, -1101033, -1100456, -1098399, -1099437, -1099191, -1095532, -1096323, -1093991, -1090746, -1088194, -1085139, -1083981, -1084486, -1085353, -1082303, -1079808, -1077013, -1076790, -1076614, -1076908, -1076207, -1070809, -1068024, -1070023, -1073250, -1072509, -1069646, -1071230, -1069468, -1066360, -1064613, -1063554, -1064564, -1064104, -1062823, -1062471, -1063483, -1064295, -1062485, -1058593, -1057748, -1059259, -1058823, -1055219, -1050824, -1045516, -1042161, -1043233, -1043869, -1044545, -1044104, -1045072, -1042140, -1041837, -1042875, -1039874, -1036711, -1038171, -1038087, -1037693, -1035402, -1036537, -1036525, -1036869, -1038501, -1037309, -1033552, -1030386, -1029735, -1029339, -1027746, -1026776, -1022435, -1020829, -1023806]
11781a023806j15M29J17O10M045M597J012Q86K609L440k740j500L403K473p74
11766a005314q12J542J865j661j571l747k149M451L423J744m8J122J152R10K146
11751i96947l29K043K713J393j02N33J456K793J632n85k424J94o39N187P23J61
11735i82198L320M588J368k715L99M771j780j021J256L080k468m67M75Q6L036
11720i68270M4J61j400j049M562K849N004L835J542J397j545l809N81L331Q534
11705i44233M256K692j655l573j408n30L518M664L176p03n239o840m38j900l652
11690i51865j033J156J074M448K671p93R8J533K344K891M198J520j271K935K362
11675i27732O36K34P47j802J170K724k73k798R18j356O57R2L909K859J652q62
$$ y = [-1023806, -1023921, -1023492, -1023375, -1022765, -1018720, -1014123, -1013111, -1012225, -1009616, -1006176, -1008916, -1010416, -1007013, -1004540, -1005314, -1006126, -1004584, -1002719, -1004380, -1005951, -1009698, -1011847, -1007396, -1003973, -1002229, -1002277, -1001155, -1000003, -999093, -996947, -997276, -995233, -992520, -991127, -991229, -990696, -989240, -986447, -984815, -985400, -987824, -987630, -988269, -983082, -982359, -982198, -978878, -974290, -972922, -975637, -975238, -970467, -972247, -973268, -972012, -968932, -971400, -971867, -971392, -971306, -968270, -968226, -968065, -969465, -970514, -965952, -963103, -958099, -954264, -952722, -951325, -952870, -956679, -956098, -952767, -944233, -939977, -937285, -938940, -942513, -943921, -944451, -940933, -936269, -933093, -933796, -939035, -945875, -946313, -948213, -951865, -952898, -951742, -950668, -946220, -943549, -944342, -944244, -942711, -940367, -937476, -933278, -931758, -933029, -930094, -927732, -927096, -926862, -926115, -927917, -926747, -924023, -924296, -927094, -926176, -927532, -926875, -926783, -922874, -920015, -918363, -919225]
11659i19225k303Q21K072k278J857N483k06k354K639K217L834J031N0K722M941
11644h98699J536m013j015O80J293K332O37L28j060j917k445J228K603J935m493
11629i01070Q80L507K019q25J772M133L6R55K270K656J460J096j008K075n15j272
11613h81831q5M902J479N38m36j33J414l75j224K629K466L72j971j845k771K616
11597h74255M238J406M40j669q96K137M864k0K464K383O06N48L23K528J854J693
11581h51356k02j035J431L428L73M300J755j680k579l374O77L523K799L63r48
11566h42525l943k77L931J907K878J206N51k967j483j915L455J553k049l063j003
11551h43744J7K433J922j727M79J672l1M029L058M25K009L707J632k049L813K055
$$ y = [-919225, -921528, -920707, -918635, -920913, -919056, -913573, -913779, -916133, -913494, -911277, -907443, -906412, -906362, -903640, -898699, -897163, -901176, -902191, -901511, -900218, -897886, -897249, -896921, -897981, -899898, -902343, -901115, -898512, -896577, -901070, -900190, -896683, -894664, -895489, -893717, -889584, -889548, -888593, -886323, -883667, -882207, -881111, -882119, -880044, -880559, -881831, -881916, -877014, -875535, -874997, -875433, -875566, -874152, -874527, -875751, -873122, -870656, -870284, -872255, -874100, -876871, -874255, -870017, -868611, -868171, -869840, -870736, -868599, -863735, -863755, -861291, -858908, -858302, -857754, -857431, -854903, -853049, -851356, -851558, -852593, -851162, -847734, -847361, -843061, -841306, -842986, -845565, -848939, -848262, -844739, -841940, -841577, -842525, -846468, -846745, -842814, -840907, -838029, -836823, -836272, -839239, -840722, -842637, -839182, -837629, -839678, -842741, -843744, -843727, -841294, -839372, -841099, -840620, -838948, -838979, -834950, -831892, -831467, -829458, -825751, -824119, -826168, -822355, -820300]
11535h20300j099J530O96K597K434j163j806j54M03K445J436l142k059O45M331
11520h13206N544K937j280k764J289n02J868j378j18M979j538n73j69m43j599
11505h06953J365K742J613J590k723J54M783J428J47L18K352L807J42o180Q18
11490g94597J840O147K797M57L850J065q05J899p44j155l332Q36L961L851k949
11475g76879J1k50K814M174L047j219j035m22J024o74n25m214k165J625K093L235
11459g69360R10j184J661J299J103k434N49j224J006O07Q82L859O653P66j826
11444g56733m161J902J522M245K654k94j284K292j769Q12K966K147j990M49K566
11429g44676j61K620J857M689J919K117r16m312j529L282K813P49o83J430K331
$$ y = [-820300, -821399, -819869, -819173, -816576, -814142, -815305, -817111, -817265, -816862, -814417, -812981, -816123, -818182, -817537, -813206, -807662, -804725, -806005, -808769, -807480, -807982, -806114, -807492, -807610, -802631, -804169, -804742, -804911, -805354, -806953, -805588, -802846, -801233, -799643, -802366, -802212, -797429, -796001, -795854, -795536, -793184, -789377, -789235, -795415, -794597, -792757, -786610, -783813, -783356, -779506, -778441, -779246, -777347, -778091, -779246, -782578, -781742, -777781, -773930, -776879, -776868, -777118, -774304, -770130, -767083, -768302, -769337, -769759, -768735, -769409, -769934, -774148, -776313, -774688, -772595, -769360, -768450, -769634, -767973, -766674, -765571, -768005, -767456, -768680, -767674, -767067, -766185, -762326, -755673, -754907, -756733, -760894, -758992, -757470, -753225, -750571, -750865, -752149, -749857, -751626, -750814, -747848, -745701, -747691, -747242, -744676, -744837, -742217, -740360, -735671, -733752, -731635, -732551, -736863, -738392, -735110, -732297, -731548, -732231, -730801, -728470]
11414g28470J766J0l225J628J984j80k425k387K086J986L745N396j523K024j235
11399g18820k80K755K463P87K00M275q9k760K426J875K420N043K086p94M25K297
11383f95691k264J466L065J02Q04R48J255J315J862R28l107M348J190j335J645
11368f83469J835m43Q51j548M690K453K4q36J697K826Q93J791L512J405K312N79
11352f61428J190K779M092L336K80p07J122J853M585K442k788J698K480K991K963
11337f33112L087K179J296k849m55L050J627L164K847L621J671R29J723L499M562
11322f03161J762J972L593P102L645m14N012Q924K92k06N128M292k7j415O181
11307e57320N960M601L865M592L533P313P444L797Q155O384M732P173M670L52
$$ y = [-728470, -726704, -726694, -729919, -728291, -726307, -726487, -728912, -731299, -729213, -727227, -723482, -718086, -719609, -717585, -718820, -719100, -716345, -713882, -713095, -712895, -708620, -708709, -711469, -709043, -707168, -704748, -699705, -697619, -698413, -697988, -695691, -697955, -696489, -693424, -693322, -692518, -691570, -690315, -689000, -687138, -686210, -689317, -684969, -683779, -685114, -683469, -681634, -682077, -681226, -682774, -678084, -675631, -675607, -676443, -674746, -671920, -671027, -669236, -665724, -664319, -662007, -661428, -660238, -657459, -653367, -650031, -649751, -650458, -649336, -647483, -642898, -640456, -643244, -641546, -639066, -636075, -633112, -630025, -627846, -626550, -629399, -629854, -626804, -625177, -622013, -619166, -615545, -613874, -612945, -611222, -607723, -603161, -601399, -599427, -595834, -588732, -585087, -585501, -580489, -571565, -571273, -571479, -566351, -562059, -562086, -563501, -557320, -551360, -546759, -542894, -538302, -534769, -527456, -520012, -516215, -508060, -501676, -496944, -489771, -485101, -484749]
11293d84749J426P285J2511J0862P008P004J1824J5889J1965J2087J4563J9550
11281c52775K0226K1136K3398K9944K7347L3061L7611L9992M3777O0307P1194
11270E5218Q5189J10340J36112J68902J81976J07064j43100m93191o11781n32067
11260i35338n74509n14323j66923J15434J87861J72724J34511J02372P9021O3255
11250a335915N4895M7638L3153L1628K8331K4673K3665K5729K2466J8135K0229
11239a005373K1477J7408J4943J1164J1187J3160J3061Q259O310J0178J0236O513
11227h61477N582M075O767R335P806N650K686O334O404M337J129K500N279P027
11213g86566O856L400J681L987N268R099Q365J954L750N259N597K641M57j618
$$ y = [-484749, -483323, -476038, -463527, -452665, -445657, -438653, -426829, -410940, -398975, -386888, -372325, -352775, -332549, -311413, -288015, -258071, -230724, -197663, -160052, -120060, -76283, -15976, 55218, 140407, 250747, 386859, 555761, 737737, 844801, 701701, 208510, -403271, -935338, -1509847, -2024170, -2191093, -2075659, -1887798, -1715074, -1580563, -1478191, -1399170, -1335915, -1281020, -1233382, -1200229, -1168601, -1140270, -1115597, -1091932, -1066203, -1043737, -1025602, -1005373, -983896, -966488, -951545, -940381, -929194, -916034, -902973, -894714, -888404, -878226, -867990, -861477, -855895, -851820, -845053, -835718, -827912, -822262, -819576, -813242, -806838, -802501, -801372, -798872, -793593, -786566, -779710, -776310, -774629, -770642, -765374, -756275, -747910, -745956, -742206, -736947, -731350, -728709, -728252, -729870]
11199g29870o64M80J495N155M392J047K961Q64J572O446L314K366M905M532P221
11184f83784M056N992M604K328N609Q120L313R41L391M896L828r0K247K957O888
11169f24704R352K511J655L603N770L982J807N747P030Q312M774Q429P496O964
11155e47272Q731R690R212Q860Q023N099N918R146J0794J3865J8900J6783J9237
11142d03014K0059K3122K6740K6118K7235L1741L7435M1649N1487N8021O6346
11131F939Q5241J11328J35129J66556J56443K0329k94048n64203m28580j76265
11121g81131k79881n45165m49176p2703J47624J77086J44554J05621Q2549P0149
11111a400473N8369M4504L7875L4524L6389L1424K6568K4760K2376J4765J2797
$$ y = [-729870, -730534, -730054, -728559, -723404, -719012, -717965, -715004, -714140, -712568, -706122, -702808, -700442, -695537, -691005, -683784, -679728, -673736, -669132, -666804, -661195, -653075, -649762, -648821, -645430, -640534, -636706, -636796, -634549, -631592, -624704, -615352, -612841, -611186, -607583, -601813, -597831, -596024, -590277, -583247, -574935, -570161, -561732, -554236, -547272, -538541, -528851, -519639, -510779, -502756, -497657, -491739, -482593, -471799, -457934, -439034, -422251, -403014, -382955, -359833, -333093, -306975, -279740, -247999, -210564, -168915, -117428, -59407, 6939, 92180, 203508, 338637, 505193, 661636, 681965, 387917, -176286, -604866, -781131, -1061012, -1606177, -2055353, -2128056, -1980432, -1803346, -1658792, -1553171, -1470622, -1400473, -1342104, -1297600, -1259725, -1225201, -1188812, -1157388, -1130820, -1106060, -1083684, -1068919, -1056122]
11100a056122J5666J9841J9146J4094Q808O502Q115J4670J0811Q904P902O649
11088i15014P191P779Q409M665N275O654O667L941n90M446P701J316J049M998
11074h45513M271K991L056M707M045K863M889M284J987M055J267J199M60J794
11060h03645O348K801k617j025K124K499J696M0J244L628J072P43m38K368O299
11045g76863P497L064J028J679j904j582L392K318L244M905n60N15r3K207J245
11030g49908M41M25O59L720K492J128L806M08N28J380k02P78n60L633K889K146
11014g26237M686L663K030k214L86M62J668R84j194P27K914K45M68J513J462q46
10998g09283q14M25L535L189O396L140J073J771j89j513J331j085L533N078L810
$$ y = [-1056122, -1040456, -1020615, -1001469, -987375, -978567, -972065, -963950, -949280, -938469, -929565, -921663, -915014, -907823, -900044, -891635, -886970, -881695, -875041, -868374, -864433, -865023, -860577, -852876, -851560, -850511, -845513, -841242, -838251, -835195, -830488, -826443, -823580, -818691, -814407, -812420, -808365, -807098, -805899, -805439, -803645, -797297, -794496, -797113, -798138, -796014, -793515, -791819, -791779, -790535, -786907, -785835, -785092, -785530, -783162, -776863, -769366, -766302, -765274, -763595, -765499, -767081, -763689, -761371, -758127, -753222, -753782, -753267, -753360, -751153, -749908, -749467, -749042, -748383, -744663, -742171, -741043, -737237, -736829, -736301, -734921, -735123, -734345, -734905, -731272, -728383, -726237, -721551, -717888, -715858, -718072, -717686, -717224, -715556, -714572, -715766, -715039, -712125, -711880, -711412, -709899, -708437, -709283, -710097, -709672, -706137, -702948, -696552, -693412, -692339, -690568, -690757, -692270, -690939, -692024, -688491, -683413, -679603]
10983f79603J628J43L487K536p588l616l611n184l646j055j842k239m494o19L438
10968g02265M010L221J991J371o96J887K700J632L871J875L127L951J336p05K920
10953f69774L325J65K576K672P63M395O658M702M721l515m559o074q169j1501
10939f73615j5708j5295j2448m471K414O65L991Q58L342N226M753M820P24k437
10925f97181M180K849K591L873K733L615j248j975p70k571J360K687K965K786
10911f74106M343L131J238k98K354j105l487n207p326q838m269n87K695K127o69
10896f90004l01K976M862r10J425M66K692L229j027L911r57j164N934M633l682
10881f67917l370K041K585R99K610J949k590N03L187M238q49q08J20J308K043
$$ y = [-679603, -677975, -677832, -674345, -671809, -679397, -683013, -686624, -691808, -695454, -696509, -698351, -700590, -705084, -705703, -702265, -698255, -695034, -693043, -691672, -692368, -690481, -687781, -686149, -682278, -680403, -677276, -673325, -671989, -672694, -669774, -666449, -666284, -663708, -661036, -660273, -655878, -649220, -644518, -639797, -643312, -647871, -653945, -662114, -673615, -689323, -704618, -717066, -721537, -719123, -718458, -714467, -713609, -710267, -705041, -700288, -695468, -694744, -697181, -693001, -690152, -687561, -683688, -680955, -677340, -678588, -680563, -681333, -683904, -682544, -679857, -676892, -674106, -669763, -666632, -665394, -665692, -663338, -664443, -667930, -673137, -680463, -689301, -693570, -694157, -691462, -689335, -690004, -690305, -687329, -682467, -683377, -681952, -681486, -678794, -675565, -676592, -672681, -673638, -674802, -668868, -664235, -667917, -671287, -669246, -666661, -665662, -663052, -661103, -663693, -663190, -660003, -655765, -656614, -657422, -657302, -655994, -653951]
10866f53951J657j218J874j607j002L572J308l982k54J177M151K020J264j698
10852f46689k14Q06J437l2K94k5J521k60j916J972L53o50L319K260j735k570j569
10835f43698J181M886J267K035J331K030K619Q46J95L145k157k024q10j034k407
10820f32595k323m545l121p53L830M017J561K278K017k448O88J029P17N12J629
10805f27507K453j938J770J454k33K10j190OL350K788k316k85O59O07K95J267
10789f18610q1j29N13j194J753J638J378J96n5k39K0j476k623K41M247l7j348
10772f15806n04k124J747K471M63p0o53r91j30J291K051K321K42Q54K99J026k81
10755f07794m08L76J315r26l7K971K35L067J937l618l44J937L22R5j69l6L331
$$ y = [-653951, -652294, -653512, -651638, -653245, -654247, -650675, -649367, -653349, -653603, -652426, -648275, -646255, -644991, -646689, -646903, -646097, -644660, -644692, -644398, -644423, -642902, -643162, -645078, -643106, -642753, -643403, -640084, -637824, -639559, -642129, -643698, -642517, -637631, -636364, -634329, -632998, -630968, -628349, -627503, -627308, -624163, -626320, -628344, -629154, -630188, -632595, -634918, -639463, -642584, -643337, -639507, -635490, -633929, -631651, -629634, -632082, -631394, -630365, -629648, -629136, -627507, -625054, -626992, -625222, -623768, -624001, -623791, -624981, -624975, -621625, -618837, -621153, -621438, -620779, -620172, -619877, -618610, -618691, -618820, -618307, -619501, -617748, -616110, -614732, -614536, -614591, -614830, -614810, -616286, -618909, -618668, -614421, -614458, -615806, -616310, -618434, -616687, -614216, -613753, -613823, -614476, -615467, -615597, -614306, -612255, -609934, -609692, -608838, -608539, -607513, -607794, -608202, -607826, -606511, -607437, -607474, -604503, -604268, -601201, -599264, -602882, -603226, -601289, -600967, -600872, -601041, -601077, -597746]
10738e97746j326J299j261l683J720L931j557R26J107K111l750n0n19J53M472
10723e94173K823N032K885k51k281l929m482k718j559K582K496M39k280k27L313
10708e92330J326J404K062J487l983l053P82J419K049k299N63M621O407o38L23
10693e79860o36m89m51j95Q54J974n17J585J363o85J873N57M54k028l295l261
10677e82757k132k600K430L401J033K11L00l72K119J181M36p02j427o8R90j527
10661e79484r1O43J806L233K483l24M427o13n603m998J675K783J206M997j93n420
10645e73473L7P44L792J888p3j534j797p34J059j069J929J623r40n63J184o89
10629e68616j370m314J756J850J115L843m52l79m863l172J06L716P50R78K279
$$ y = [-597746, -599072, -597773, -599034, -602717, -600997, -597066, -598623, -597697, -596590, -594479, -598229, -598279, -598798, -598645, -594173, -591350, -586318, -583433, -583684, -585965, -589894, -594376, -597094, -598653, -596071, -593575, -593136, -595416, -595643, -592330, -591004, -589600, -587538, -586051, -590034, -593087, -592305, -590886, -588837, -591136, -590573, -585952, -579545, -580183, -579860, -580496, -580985, -581436, -581631, -580777, -578803, -579320, -577735, -576372, -577057, -575184, -574627, -574173, -576201, -579496, -582757, -584889, -587489, -585059, -581658, -580625, -580414, -580114, -580486, -578367, -577186, -576750, -577452, -578879, -578947, -577957, -579484, -579575, -578932, -577126, -573893, -571410, -571734, -567307, -567920, -573523, -578521, -576846, -574063, -572857, -567860, -568053, -573473, -573436, -572692, -568900, -567012, -567085, -568619, -570416, -571150, -570091, -571160, -569231, -567608, -568548, -569111, -567927, -568616, -569986, -574300, -572544, -570694, -569579, -565736, -566188, -566567, -571430, -574602, -574496, -570780, -570030, -569052, -566773]
10614e66773J175L15J2K795l381K793L42K229K411j437m12k75J730L110K967p09
10598e53108j396j236k64j804l83k71K397K884L93j468o02J936k386p72M83J375
10582e54222K260k485m884J191K927K617K027K141M98k974k676n94j033L29O2
10567e54816J194M53M719M545J338l659k71R89l149j078J328r98L59J287M227
10552e43532K965q61L10k598k583j189J289p96K29J845L436J372j278P81N52L82
10536e39676j51N52j376m63Q60K734L387l114n435j92J191J234l346J854o32j565
10520e44138n42M231M7j85J757K695O25m71j20J773J674N62p84k043J82K7k56
10503e34966M287p04m247j732K02K791j710k80K896J571J011K86j873L89J475
$$ y = [-566773, -565598, -565283, -565271, -562476, -565857, -563064, -562722, -560493, -558082, -559519, -559931, -560206, -558476, -555366, -552399, -553108, -554504, -555740, -556004, -557808, -558191, -558462, -556065, -553181, -552788, -554256, -554858, -552922, -555308, -556080, -555597, -554222, -551962, -554447, -559331, -558140, -555213, -552596, -550569, -548428, -547930, -550904, -553580, -554174, -555207, -554878, -554816, -553622, -553169, -548450, -543905, -542567, -546226, -546497, -545508, -548657, -549735, -548407, -549405, -549046, -547759, -543532, -540567, -541428, -541118, -543716, -546299, -547488, -546199, -546995, -546766, -544921, -541485, -540113, -541391, -540610, -540058, -539676, -539827, -539275, -540651, -541114, -540254, -537520, -534133, -537247, -542682, -542874, -541683, -540449, -543795, -541941, -542573, -544138, -544680, -540449, -540402, -540587, -538830, -536135, -535510, -535981, -536101, -534328, -532654, -532092, -532876, -534919, -534737, -534710, -534966, -530679, -531383, -535630, -537362, -537160, -534369, -536079, -536359, -533463, -531892, -530881, -530595, -532468, -532079, -530604]
10488e30604j572l095j297L409N153K553k64k354m86K33J606j017j2L503J679
10473e22565Q52k93J506l99k425J962L57K749J527k313o2m614j357P65Q44K931
10457e20535K135j568j11K48J525K104J391j209p89l74m467j519J344K530K670
10442e16625L785O94k366j637l806j642K592J174j94j470J862K628J183Q05j624
10427e14641k967j466J501n37R28M554J042O83N06k27M04P33o46l092M57J495
10411e11273J493J762J74l057l167J912j106J50J464k023K001K630J125j348P91
10396e08472p05P9l84j349j367j06o75L222j462J772L907p15k439J120J545k19
10380e06248J611J054K338o58K481K056N06K778r0l531j86j097J646j917j784
$$ y = [-530604, -532176, -535271, -536568, -533159, -528006, -525453, -525717, -528071, -528557, -528324, -526718, -527735, -527747, -524244, -522565, -521713, -522006, -520500, -520899, -523324, -521362, -521005, -518256, -516729, -519042, -519104, -523718, -525075, -524310, -523466, -520535, -518400, -519968, -520079, -519831, -518306, -516202, -514811, -516020, -516809, -517183, -521650, -523169, -521825, -519295, -516625, -512840, -512146, -514512, -516149, -519955, -521597, -519005, -517831, -518025, -519495, -517633, -515005, -513822, -513017, -514641, -517608, -519074, -517573, -518110, -517182, -512628, -511586, -510903, -510397, -510624, -510220, -509487, -510133, -513225, -512768, -511273, -509780, -508018, -507844, -510901, -514068, -512156, -513262, -513112, -511648, -513671, -511670, -509040, -507915, -509263, -508472, -509177, -509098, -509482, -510831, -512198, -512304, -512979, -509757, -511219, -509447, -505540, -506255, -508694, -507574, -506029, -506248, -504637, -503583, -501245, -501903, -499422, -497366, -496860, -494082, -494172, -497703, -497889, -498986, -497340, -499257, -501041]
10365e01041j033K719L924m071j742Q84J146R03l3K334k70l770j916M40R38J533
10349d99055J51l714Q80J801K965K588L056P67o66j647j486o93M44L035n59l59
10333d92492k6J015p12l39K52l068P23L848J076j57j9j248l203J460J580J808
10317d89502J216K352N38J075J05k889n031J410J181j000J678p05o11j350j2k215
10301d93760o66O042P555j68k503N8J562L19k292k087m045j368K06J932K065M43
10285d86707q08k677N84L36M564L636P73j005J074L85q81k026M182J116k589O37
10269d79406K338J560J483P93m21J336j426j715J677l054k067j086R87L140q62
10254d76723j176k52j584l410n86j30J188N06J746J261r98M234L361k783j58K145
$$ y = [-501041, -502074, -499355, -495431, -499502, -501244, -500360, -499214, -498311, -498344, -496010, -496280, -500050, -501966, -501526, -500588, -499055, -498904, -502618, -501738, -499937, -496972, -494384, -491328, -490561, -491227, -492874, -494360, -495053, -494609, -491574, -492133, -492492, -492518, -491503, -492215, -492554, -492302, -495370, -494647, -490799, -489723, -489880, -489899, -491147, -494350, -492890, -491310, -489502, -488286, -485934, -485396, -484321, -484216, -487105, -492136, -490726, -489545, -490545, -488867, -489572, -490183, -491533, -491545, -493760, -494426, -488384, -480829, -480997, -483500, -483442, -481880, -481561, -483853, -485940, -489985, -491353, -491147, -489215, -487150, -486707, -487515, -490192, -489608, -489272, -484708, -481072, -480299, -481304, -480230, -479845, -480726, -482752, -478570, -477454, -480043, -479406, -477068, -475508, -474025, -473232, -473653, -472317, -473743, -475458, -473781, -476835, -478902, -479988, -479001, -475861, -476723, -477899, -478151, -479735, -483145, -483731, -483861, -482673, -482167, -480421, -479160, -480158, -475924, -472563, -475346, -475504, -473359]
10238d73359J255n068J029K444M380l031l300K445K683K515q25l438n84R39m59
10223d72374j117J875K803J383j998j380J171k55j065J857r52O53o1J81O96L53
10207d68230j026M86j677L055R86l884Q30j40K013J25R66k668o84Q6R10K68j93
10190d68777K734K782k091O65m511l237M324L852J494j027J94J661J400k450j311
10175d64298P71MJ046O84K82O37J485k219j557k09k420k188k33m948K791L202
10159d67170M93L58J900k72J047j059N66Q1p90j370j269N451M043J767J444K865
10143d51915L45j610j116j357j015M51R30K23J966q41l573k626M274J086j908
10128d56686k393K656K270j373K6K371K508O49l696k44K030l169j752Q91J33K193
$$ y = [-473359, -472104, -477172, -476143, -473699, -469319, -472350, -475650, -473205, -470522, -468007, -468832, -472270, -472854, -471915, -472374, -473491, -471616, -468813, -467430, -469428, -470808, -469637, -469892, -470957, -469100, -470052, -469399, -469460, -469279, -468583, -468230, -469256, -468770, -470447, -467392, -466406, -470290, -469460, -469600, -467587, -467462, -466496, -469164, -469848, -469762, -468852, -468584, -468777, -466043, -463261, -465352, -464687, -469198, -472435, -468111, -464259, -462765, -463792, -463598, -461937, -460537, -462987, -464298, -463527, -463523, -462477, -461793, -461511, -460874, -459389, -461608, -463165, -463374, -465794, -467982, -468215, -473163, -470372, -467170, -466677, -466319, -464419, -464691, -463644, -464703, -464137, -464056, -464846, -466216, -467485, -462034, -457991, -456224, -454780, -451915, -451570, -453180, -454296, -455653, -456668, -456217, -455287, -455064, -453098, -453939, -457512, -460138, -455864, -454778, -456686, -459079, -456423, -454153, -455526, -455500, -453129, -450621, -449972, -453668, -453912, -451882, -455051, -456803, -455912, -455779, -453586]
10112d53586O849J037j905n473k189j806k51J976M205jo37n62l426M27L149K141
10096d50052J385n21k830q99M404J338K22m63M89K002O75R73P18N58j092M67k402
10079d45028r67o47J224R0P62L035p52M33K126j358K326j303k453o47Q22L018
10063d39319o90J465K392j073Q85R8k639m20k058l607K852J421P51J061J948J334
10047d35599J175j657r70O96k4J622j753j306j118k7J478l19m04J49L546K353
10031d32158m1J33K77J923L658j14j438j438k205J952N221P43j401o17K169j422
10015d24758Q74J76k541k868K20M698J856m504J428j103O10O84P0K157M537j116
9999d19580j255p36N01J382k070j640J003j054J228M195J174j676j596L767J142
$$ y = [-453586, -446737, -445700, -447605, -453078, -455267, -457073, -457324, -455348, -451143, -451144, -451781, -452343, -455769, -455342, -452193, -450052, -448667, -449188, -452018, -452917, -448513, -447175, -446953, -447416, -446927, -444925, -444250, -443277, -442559, -442001, -443093, -442626, -445028, -445995, -446642, -445418, -445328, -444566, -441531, -442283, -441850, -439724, -441082, -438756, -440059, -442512, -443159, -442337, -439319, -440009, -438544, -436152, -437225, -436340, -436242, -438881, -439301, -441359, -444966, -442114, -440693, -439942, -438881, -436933, -435599, -434424, -436081, -437051, -436355, -436379, -434757, -436510, -437816, -438934, -438961, -437483, -437802, -438206, -438057, -434511, -432158, -432199, -432066, -431789, -429866, -426208, -426322, -427760, -429198, -431403, -429451, -424230, -423487, -424888, -425505, -423336, -424758, -423884, -423708, -426249, -429117, -428897, -424199, -422343, -426847, -425419, -426522, -425912, -425228, -425158, -423001, -418464, -419580, -420835, -421571, -421070, -419688, -421758, -423398, -422395, -423449, -422221, -418026, -416852, -418528, -420124, -416357, -415215]
9984d15215M80l128O26J295M77l194J036J34Q35l05K599k348m125J642Q50k80
9968d18621j229P71O05k123J570K225M81L31r54K342N35K836L766k314m384j218
9952d15381k159K358N003K27j879l090O152K169k067K082j797k741j248o50O20
9937d12401J018L396o76J745lQ39o46P90O621L065j793K038n86j432j212M85Q82
9920c97870P78l009N99K780l074n81K435k150p36K653J195l032K717L767J049
9905c92479k657l329L570L957j11L81j909q48J432j969J911K618K63M15q38Q60
9889c88733J024J649l8R34J350o01J044N94k599J782j368k15o50J998l48N2M395
9872c79730M01j895K475j364k99O666p78J751J467J308J417J508R9k365n093O56
$$ y = [-415215, -414735, -417863, -417237, -415942, -415465, -418659, -417623, -417489, -416654, -416959, -414360, -416708, -420833, -419191, -418341, -418621, -419850, -419079, -418474, -420597, -419027, -416802, -416321, -415990, -416944, -414602, -414067, -411231, -407465, -409779, -414163, -415381, -417540, -415182, -410179, -409952, -411831, -414921, -408769, -406600, -408667, -406585, -408382, -411123, -412371, -413021, -412401, -411383, -407987, -408663, -406918, -406921, -406082, -406728, -405938, -399317, -396252, -398045, -396007, -396593, -398025, -399237, -398752, -397870, -397092, -400101, -399502, -396722, -399796, -400377, -397942, -400092, -400828, -398175, -396980, -400012, -397295, -393528, -392479, -395136, -398465, -394895, -390938, -391049, -390668, -392577, -393425, -391993, -393962, -392051, -389433, -389170, -388755, -389593, -388733, -387709, -386060, -386098, -385164, -383814, -384415, -383371, -382777, -385376, -383594, -384962, -385177, -385827, -383829, -384177, -384125, -379730, -379329, -381224, -378749, -380113, -380412, -373746, -374524, -372773, -371306, -369998, -368581, -367073, -366974, -369339, -374432, -373776]
9856c73776k020k620j616L863K451N47K874N089O627O84l018j814m62M126L002
9841c56063k375J044L221R96m82N43L574O54K998J219K728J691j728m027j034
9826c47041K259L215K968J91K653J634j345K898J291L083K194o2K041L94j770
9811c25397o08M778N794K520J665N775M554P57j202P70O134O313J455L482J911
9796b81299L669M596K487K493N420N693N567L018M344P661J0667J0094M269Q000
9782b03321J4184J2481J1129Q667J0622J4959J9523J8003K0223K5752L0102L7333
9770A9657M5517M9443N5717O9888P1654N4977j929j14561k29413k69665k65883
9759e14598k56826k28780j32769j3522N1791O9591O6053N2901M7334L7910L1479
$$ y = [-373776, -375796, -378416, -380032, -376169, -373718, -373171, -370297, -365208, -358581, -357897, -360915, -362729, -363191, -359065, -356063, -358438, -357394, -354173, -353177, -353659, -353116, -349542, -348888, -345890, -344671, -341943, -340252, -341980, -346007, -347041, -344782, -341567, -338599, -338408, -335755, -334121, -335466, -332568, -331277, -328194, -326000, -326062, -324021, -323627, -325397, -326005, -321227, -315433, -312913, -311248, -305473, -300919, -300162, -301364, -300594, -294460, -288147, -286692, -283210, -281299, -277630, -273034, -270547, -268054, -262634, -256941, -251374, -248356, -244012, -236351, -225684, -215590, -211321, -203321, -189137, -176656, -165527, -156860, -146238, -131279, -111756, -93753, -73530, -47778, -17676, 19657, 65174, 114617, 170334, 240222, 311876, 366853, 364924, 250363, 20950, -248715, -514598, -771424, -1000204, -1132973, -1146495, -1094704, -1025113, -959060, -906159, -858825, -820915, -789436]
9748g89436L0779K8242K3335K3151J7446J0478J1433J0328P267J0247J0946J0641
9736e95143R291Q728N279K519O750J0727O315K833Q99L998J0021O119M109L095
9722e14460O100K773K165R26N806M061K974K948L114J433j669l979J314L274K058
9707d81162P937L723j100l37J080j067n09K424N668M116R73j863p07L10K568K286
9691d55660j572M04K14J07L210J665m54JJ604J775l32L025M689K367J398o37k994
9674d41190J74R27M70q39L053L700K63J421p91J710j154m31J153j693p30L823
9658d30134J771L350j989j102r51K52J278K57r66q41l17k051P81k21J436m400
9642d33847J829K912j931N40l08R16p3q13j084J531J094J017o38m019L132K324
$$ y = [-789436, -758657, -730415, -707080, -683929, -666483, -656005, -644572, -634244, -626977, -616730, -605784, -595143, -585852, -577124, -571845, -569326, -562576, -551849, -545534, -542701, -541802, -537804, -527783, -521664, -517555, -514460, -508360, -505587, -503422, -502496, -496690, -492629, -489655, -486707, -483593, -482160, -483829, -487808, -486494, -483220, -481162, -473225, -469502, -470602, -470939, -469859, -470926, -471435, -469011, -463343, -459227, -458254, -460117, -460824, -460514, -457946, -455660, -457232, -456828, -456614, -456507, -453297, -451632, -452086, -452085, -450481, -448706, -449038, -446013, -441324, -438957, -437559, -438196, -441190, -441016, -440089, -439619, -440458, -437405, -433705, -433442, -432021, -432812, -431102, -432256, -432687, -431534, -433227, -433957, -430134, -428363, -425013, -427002, -428104, -429055, -428803, -427525, -427268, -428234, -429075, -429392, -431443, -430662, -430883, -429447, -433847, -432018, -429106, -431037, -430497, -430805, -429889, -429962, -430775, -431859, -430328, -429234, -428217, -428855, -432874, -429742, -427418]
9626d27418R6m525j944Q46P52k803k709Q57L398L022J318M15J210m847k847k362
9610d37541o18L48J013q96j643j064K677J335j655K046l310j27J119J272N17q30
9594d37357k869k327k411l193k78J954k981n190J175M890K198J815J053N19J516
9579d41486P6k078l980Q86o80j055L973K086P41j175K261L08o167l935jO60J089
9562d48477j565J722J298k165J452R87m2K949P68k64l110l51M76m44q77k80K44
9545d47679n88J316l30J200q90j823K795N80m249j614j258N604j089k357J669
9530d48713K950J996m277k614J243R48L688J915j260j487r17j158J358o8J135
9515d45261J487L371K407k460l302m11J695L161K975K890m14k202k436k280p1
$$ y = [-427418, -427322, -431847, -433791, -432945, -432193, -434996, -437705, -436848, -433450, -430428, -429110, -428695, -427485, -432332, -435179, -437541, -438159, -437811, -436798, -437694, -439337, -440401, -437724, -436389, -438044, -435998, -439308, -439435, -438316, -437044, -436527, -437357, -440226, -442553, -444964, -448157, -448435, -446481, -449462, -454652, -453477, -448587, -446389, -444574, -443521, -443002, -441486, -441410, -443488, -447468, -446582, -447262, -448317, -444344, -442258, -441517, -442692, -440431, -440123, -446290, -450225, -450226, -449566, -448477, -450042, -448320, -447022, -449187, -447735, -446748, -446790, -443841, -443073, -443337, -446447, -446798, -446322, -446766, -447643, -447923, -447679, -448267, -446951, -447281, -446081, -446971, -448794, -445999, -445419, -449668, -451282, -452540, -446936, -448025, -450382, -448713, -445763, -443767, -448044, -450658, -449415, -448467, -444779, -442864, -444124, -445611, -446528, -447686, -446328, -446396, -445261, -443774, -440403, -437996, -440456, -443758, -444169, -442474, -439313, -436338, -433448, -433862, -436064, -438500, -440780, -440851]
9500d40851l828j046N62l54M522K696P09j616j384J305m54K218k0l80j81K025
9484d36077J612j958P34J383k51J129L916M97m219k32L120P39j110l93j784M22
9468d32472J770N783J811j960o520k271K696K516N3K363J995p72m916j31K832
9453d27223J317k008j90J775J929K022l963l917j321k362L808N225J149L02l099
9438d26556J480J030m866o160q38P398O283Q58k771j449L51J882K530L118O198
9423d11512k122j332q82m456O36L35o33O8K932J128l240l293L11J103k698J905
9407d21750R38j019L994L065J307K205j512j634o71K86R55j40J845n65j534k14
9391d14444m443m222K674O32J057k00j15N129m45m439n93M083K980K307Q26j41
$$ y = [-440851, -444679, -445725, -445163, -445517, -440995, -438299, -437590, -439206, -440590, -439285, -439739, -437521, -437541, -437921, -438102, -436077, -434465, -436423, -435689, -434306, -434557, -433428, -429512, -429015, -433234, -433466, -430346, -429607, -430717, -431110, -432894, -432472, -430702, -424919, -423108, -425068, -431588, -433859, -431163, -428647, -428594, -426231, -424236, -425008, -429924, -430055, -427223, -425906, -427914, -428104, -426329, -424400, -422378, -426341, -430258, -431579, -433941, -430133, -424908, -423759, -423457, -426556, -425076, -424046, -428912, -435072, -435910, -428512, -422229, -421371, -424142, -425591, -425240, -423358, -420828, -417710, -411512, -413634, -414966, -415848, -420304, -419668, -419333, -419966, -419898, -416966, -415838, -419078, -422371, -422060, -420957, -423655, -421750, -420812, -421831, -417837, -414772, -413465, -411260, -412772, -414406, -415077, -414791, -413836, -413976, -412131, -412696, -414230, -414444, -418887, -423109, -420435, -419803, -418746, -418946, -419061, -413932, -414377, -418816, -419409, -415326, -412346, -410039, -409213, -409354]
9375d09354j451J088J715K862J705l370N23J09O6m47N4K396K563J525j224k416
9359d03656m95j330J839l08m59p26L094J002m564n256q72L037m41l08K31L726
9343d05486L80K837L458L07j024l148j327p05N79k483J1K180L653R76k327k637
9327d04756q33n03N755K789k226j025k679L140N66k102m660N66J071L285K137
9312c99475J932n56j547k77k967O38O38L63J52J230q57k015N89K827J10n227j345
9295d05787M920N13L596M238q60k962L95Q63l166J051l41j185J971j84r1j42q90
9278c98061P44j175O6J966J406k149j913N92M397N15j157J002K552J622M90n40
9262c89643k669L000L177j78L58K225K068k430n910n75j24J728M806N36l41l58
$$ y = [-409354, -410805, -409717, -408002, -405140, -403435, -406805, -406282, -406173, -406107, -406554, -406500, -404104, -401541, -400016, -401240, -403656, -404151, -405481, -403642, -403950, -404409, -405135, -402041, -401039, -405603, -410859, -411731, -408694, -409135, -409443, -409212, -405486, -405106, -402269, -398811, -398504, -399528, -402676, -404003, -404708, -404129, -406612, -406601, -404421, -400768, -399792, -402119, -404756, -405589, -406092, -400337, -397548, -399774, -400799, -403478, -400338, -399772, -401874, -406534, -405968, -404897, -401612, -399475, -397543, -398099, -399646, -399923, -402890, -402252, -401614, -401251, -401099, -399869, -400726, -402741, -402152, -399325, -399215, -404442, -405787, -400867, -400354, -396758, -392520, -393380, -396342, -395947, -395084, -398250, -397199, -397540, -398725, -396754, -396938, -397029, -397171, -398061, -397317, -398492, -398426, -396460, -395054, -397203, -399116, -398524, -394127, -393612, -394769, -393767, -391215, -389593, -389103, -389643, -392312, -389312, -386135, -386313, -385955, -383730, -381662, -384092, -390002, -390577, -390701, -388973, -384167, -383631, -383972, -384330]
9246c84330k408n40K080K266K471m249j50q4k765J37j578M253R50k518j080l15
9230c87860j726R17j101J792o39m71K642J850J889J014k551l039j326K881K392
9215c83336j253J016K311J631K088P52l50q97j075k782K93j857o33j406j85m67
9199c86150J572J707L792K7k875j358j366K077J306j629p48p29J505J421l238
9184c84686N98L437j89M11Q7N96L732L09J794J669j496k923l784K509L572K349
9168c72015j639k808j2j226k601K872k761l73J329J246O21J011K032J871K18L68
9152c71867L066l78j620r38j917l648l92N68L607J331j995p55L745M23j628N40
9136c71858k349k318J411k55k047L54j291J752J073m05K347J268j160J026J472
$$ y = [-384330, -386738, -387278, -385198, -382932, -380461, -384710, -384860, -384944, -387709, -387572, -389150, -384897, -383947, -386465, -387545, -387860, -389586, -388669, -389770, -387978, -388617, -389088, -386446, -384596, -382707, -381693, -384244, -387283, -388609, -385728, -383336, -384589, -383573, -381262, -379631, -377543, -376791, -377141, -378038, -379113, -381895, -381602, -383459, -384092, -385498, -385683, -386150, -384578, -382871, -379079, -379052, -381927, -383285, -384651, -382574, -381268, -382897, -383645, -384374, -382869, -381448, -384686, -384088, -380651, -380840, -380429, -380342, -379746, -376014, -375705, -373911, -372242, -373738, -376661, -380445, -377936, -374364, -372015, -373654, -376462, -376474, -377700, -380301, -377429, -380190, -380563, -379234, -377988, -377367, -376356, -374324, -372453, -372235, -371867, -368801, -369179, -370799, -371737, -373654, -377302, -377694, -377126, -373519, -372188, -374183, -374938, -371193, -370770, -372398, -371858, -374207, -376525, -375114, -375369, -377416, -377062, -378353, -376601, -375528, -375933, -373586, -372318, -373478, -372452, -370980]
9121c70980K178p22n602l678K017k47L85K106J8L118K323Q71k099j131L074M81
9105c67888k192j661k201j988J135K47K431r92N03j213M405K685J352L646J282
9090c60449j581m082l895k286J830K246k837J681J277J941K808p16l816r43j807
9075c70629n20R35K390n18N59J452K588K860m245k965K546M118K783j324l020
9060c62990Q75M101l11K07m83k851r54l19K320K136R89j81l706k443j926J375
9044c64161L8p53J558J867j933J084N3K22J44M93j850k07J582k44R6L588J276
9027c57147n647k488j927p86j38M421O58k110K520K200k104J906J472P10j057
9012c59517j557j329K175K287l2j923k862n01M45m91Q36N731K615J100j726J880
$$ y = [-370980, -368802, -369524, -375126, -378804, -376787, -377034, -376649, -374543, -374525, -371407, -369084, -368213, -370312, -371443, -368369, -367888, -370080, -371741, -373942, -375930, -374795, -374548, -372117, -373109, -372606, -373819, -369414, -366729, -365377, -361731, -360449, -362030, -366112, -370007, -372293, -370463, -368217, -371054, -369373, -368096, -366155, -363347, -364063, -367879, -368822, -370629, -371149, -370214, -367824, -368342, -367783, -366331, -363743, -360883, -365128, -368093, -365547, -361429, -358646, -359970, -362990, -362115, -358014, -358325, -358118, -358601, -361452, -362406, -362725, -360405, -358269, -357280, -357461, -361167, -363610, -365536, -364161, -364123, -364876, -363318, -361451, -363384, -362300, -362247, -362025, -361881, -361388, -363238, -363445, -361863, -362107, -362011, -358423, -357147, -362794, -365282, -367209, -367995, -368133, -363712, -363054, -365164, -362644, -360444, -362548, -360642, -359170, -358460, -359517, -361074, -362403, -360228, -357941, -357973, -359896, -362758, -363259, -362814, -363305, -362469, -356738, -354123, -353023, -354749, -352869]
8996c52869Q98K4p4m96l839r73n27J061J678J93P0J547K645P87k918j653n62j184
8978c56192k047K00J265J474k162J995N05p83K921N84R47r97l485K132K7j00L81
8961c53335k307j396K57n60L527m94M38L458q59n23P60L513o14k543o86k842k662
8944c56868P87J346J772P69R66J90M30o317k557J181j557l729K275M297k54n85
8928c57854L819K670J66p20L662j774R55J17R18j435m34k772m21J867K367L105
8912c45764J055m376m985j360k194J938K391L771J792k59j977m58k96l70J412
8897c49680j010k784M164L134j189p38J276K644p55L641j843n031k366L555K990
8882c43992K32Q15l30k450R49j006p176q13N467L423K439J676O35J530Nl231K93
$$ y = [-352869, -351971, -351947, -352021, -352517, -356356, -357329, -357856, -356795, -355117, -354924, -354854, -353307, -350662, -349875, -352793, -354446, -355008, -356192, -358239, -358039, -356774, -355300, -357462, -355467, -354962, -355745, -352824, -352240, -351293, -352290, -355775, -353643, -353616, -353716, -353335, -355642, -357038, -356781, -357341, -353814, -354308, -353870, -350412, -351271, -351794, -351034, -347521, -348135, -350678, -351364, -354206, -356868, -356081, -354735, -352963, -352194, -351228, -351038, -350608, -356925, -359482, -358301, -359858, -363587, -361312, -357015, -357269, -357854, -354035, -351365, -351199, -351919, -348257, -350031, -349076, -348959, -348041, -349476, -349910, -352682, -353103, -351236, -348869, -345764, -344709, -349085, -354070, -355430, -357624, -355686, -353295, -349524, -347732, -347991, -349968, -350426, -350722, -351092, -349680, -350690, -353474, -349310, -346176, -347365, -348103, -346827, -344183, -344938, -341297, -343140, -348171, -350537, -346982, -343992, -343760, -342945, -343275, -345725, -344776, -345782, -352958, -353771, -348304, -344881, -342442, -340766, -340131, -338601, -338596, -341827, -341534]
8865c41534R60K178P29l20J858o27k357K29M08l138k624j870N627K013q19o00
8849c39887P23l21O6j814l099j406K481L602P29j232J740K815l018J278j136k264
8833c40743j646m83k062O21K91K907N049L34j742L635N177k467o119l080J870
8818c38458K136J260j58k711N93o90J203j332K14k974n856l062M253K672L24M233
8802c38353J419j005J445L638M45m23r05j393Q88M12j515l919k97K847J991j066
8786c35791k917O21L603M876j809p14k355m06n934L62L023K041J126r04k428k832
8770c40438j542J343M253J143n19n29K902J067N74l579k837n55L692M095k633
8755c33563m555j05L963L340p8J121J421j420l387k263O36K290k442nj185L043
$$ y = [-341534, -340574, -338396, -337667, -337987, -336129, -336756, -339113, -338884, -338476, -341614, -344238, -346108, -340481, -338468, -339287, -339887, -339164, -339485, -339419, -341233, -344332, -345738, -343257, -339655, -338926, -340158, -338418, -335603, -338621, -337343, -338479, -340743, -342389, -342872, -344934, -344313, -344022, -341115, -336066, -335732, -337474, -333839, -328662, -331129, -337248, -340328, -338458, -336322, -335062, -335220, -337931, -337338, -338028, -336825, -338157, -337943, -340917, -346773, -349835, -345582, -342910, -342586, -338353, -336934, -337939, -336494, -332856, -332411, -332834, -333739, -335132, -334244, -333832, -335347, -339266, -339563, -336716, -334725, -335791, -338708, -338087, -334484, -329608, -331417, -332131, -334486, -334892, -340826, -340464, -337441, -335400, -334274, -335178, -337606, -340438, -341980, -340637, -336384, -335241, -335760, -336289, -333387, -332320, -331746, -335325, -338162, -338717, -335025, -330930, -333563, -338118, -338223, -334260, -330920, -330998, -329877, -328456, -329876, -333263, -335526, -334890, -332600, -335042, -335047, -336232, -333189]
8739c33189J069K911J573J614J511O83M137k4k370l84j264l01K429j85k751j413
8723c25954K578J080n568k466K121K048P01K56m121k6J550R67M89J121l292j28
8707c28644Q00N38K018R0l125r73J46K544K878J929L325m75j812j111L78J336
8691c20158j11m680j117k43L65j427L555J858r59M761L539M538j123l483k49l412
8675c18346j040M229K73n74l506m259J796j680q24Q81j807j356K498K446j91J969
8659c19491l682M1L470K771K646Q91O23j7k918l833r07N311J104j500O62K820
8643c12009K332J880m057o287p26K495O347N750J590J064K710j869o426n935J84
8628c12957J771L521l849o216j331M03M46N301N869o50k257M61K885J701L627
$$ y = [-333189, -332120, -329209, -327636, -326022, -324511, -323828, -319691, -319715, -322085, -322469, -323733, -324034, -321605, -321790, -324541, -325954, -323376, -322296, -327864, -330330, -328209, -326161, -325460, -325204, -329325, -329351, -327801, -326834, -326345, -325224, -328516, -328644, -327844, -327306, -325288, -325198, -328323, -329296, -329150, -326606, -323728, -321799, -318474, -318949, -320761, -321872, -321494, -320158, -320269, -324949, -326066, -326309, -325944, -327371, -323816, -321958, -322917, -318156, -314617, -310079, -311202, -314685, -314934, -318346, -319386, -315157, -314884, -315458, -318964, -323223, -321427, -323107, -323931, -323050, -324857, -326213, -323715, -321269, -321460, -319491, -323173, -323132, -319662, -316891, -314245, -313354, -312731, -312748, -315666, -319499, -320406, -315095, -313991, -315491, -314829, -312009, -309677, -307797, -311854, -318141, -318867, -316372, -310025, -304275, -302685, -301621, -298911, -300780, -307206, -313141, -312957, -311186, -307665, -311514, -317730, -319061, -318658, -318212, -312911, -307042, -307692, -309949, -309488, -306603, -304902, -301275]
8613c01275k05l282j922j666j187m70J637P32M440M620j064j302Q50N60k5r73
8597c00532M54j77j894R04O486K905K500q49Q99J330l167k031J43L119L937K770
8581b83203M062J528M577M859K598k98Q75M583P627k41J206M824Q143J0718J3271
8566b14871J1486J2380Q821m477l5171q5337j00839m5595L103J2671J9336J8454
8554d00039J2457O899Q161N319K573K214M058M372M200K527N62q53K949K724J088
8539c40789L598O438K232L302K819K149L256P823J1888L460r647k9909m5501k4133
8525d03014P83J0429P223O476M116M926L804K689M540L708K611j136q2K757K746
8510c47424o72n26J482R60J981M03j287O06K620m23j243K826K48J579k211L193
$$ y = [-301275, -301480, -304762, -306684, -308350, -309537, -310007, -308370, -307638, -303198, -298578, -299642, -300944, -300094, -299534, -299559, -300532, -300078, -300255, -302149, -301245, -294759, -291854, -289354, -290203, -289304, -287974, -291141, -293172, -293029, -289910, -285973, -283203, -279141, -277613, -273036, -268177, -265579, -265877, -265002, -260419, -252792, -253033, -251827, -247003, -238860, -228142, -214871, -203385, -191005, -182184, -186661, -221832, -307169, -408008, -453603, -450500, -437829, -418493, -400039, -387582, -380683, -372522, -367203, -364630, -362416, -358358, -353986, -349786, -347259, -346697, -347550, -344601, -341877, -340789, -337191, -330753, -328521, -325219, -322400, -320251, -316995, -309172, -297284, -293824, -303471, -333380, -378881, -403014, -402231, -391802, -384579, -378103, -373987, -369061, -365257, -362568, -358028, -354320, -351709, -352845, -352927, -350170, -347424, -348096, -348622, -347140, -346180, -344199, -343796, -345083, -344477, -341857, -342280, -343523, -340697, -340449, -338870, -341081, -337888]
8494c37888L741J413L581J286k675J839l05o98j425M776K139j238j137o01P79
8479c26413L362Q02j651P37K036j30R67J197K493j085n92m7l01K193L34l16K516
8462c13898J234L243J267J700K79N79n83K598K032M322J453l24K062K229K475
8447b89332Q122N709L582L692P870R685K896p258k1403l7069l6214k2647q142
8434c80509J352N490L401M014O095O627O703O030J981J120J837L953L406R91K558
8419c24951Q81J266M489Q38J08J688L23m97K339L849J181J553Q069L741M008P313
8403b83802N761O351L178J589j4089l5304m5005l0328o530J740M575N881J999
8390c83984M059R676K493K601L040L414N366K766K79K113P44j487j441J449L997
$$ y = [-337888, -334147, -332734, -329153, -327867, -330542, -328703, -329008, -329706, -331131, -326355, -324216, -325454, -326591, -327192, -326413, -323051, -322249, -323900, -323163, -321127, -321257, -320290, -319093, -316600, -317685, -318277, -318324, -318625, -316432, -316098, -316414, -313898, -312664, -309421, -308154, -306454, -306175, -305596, -306179, -303581, -301549, -297227, -295774, -296098, -294036, -291807, -289332, -281210, -275501, -271919, -268227, -260357, -250672, -247776, -255034, -276437, -313506, -349720, -372367, -380509, -379157, -373667, -370266, -366252, -360157, -353530, -346827, -340797, -338816, -337696, -335859, -331906, -328500, -327509, -324951, -324070, -322804, -318315, -317477, -317369, -315681, -315358, -315855, -313516, -309667, -308486, -306933, -298864, -295123, -291115, -283802, -278041, -271690, -268512, -266923, -281012, -316316, -361321, -391649, -398179, -396439, -391864, -385983, -383984, -379925, -370249, -367756, -365155, -362115, -358701, -353335, -350569, -350290, -348177, -347433, -348920, -350361, -348912, -344915]
8375c44915K868j880K457J603j101j948J083M006J277k80J54o67p39j079K375
8360c36786O844p93m053r27J437J840l701k173J430N747j047l20K431m46Nm571
8344c35083r24K288K291L395K265J34n536K63o77l21K218K203j123j208m27J417
8328c28825K434J185N36J192o93q30l23P19L178K866j109j569j983j321N90k244
8312c26197J990L150j740J338L794J441j293j760K762l11k538J673m28on06n012
8296c23643K64K691J160P7J602K885J5l219l468P76J014J311j404r1q3k878k610
8279c25601m18L743J513j543L077j253k56J794J473K22m0j621J406K610k95j078
8263c16267M51k36J16j15l106R24J202j277K263K383J049j37J670j615K39l178
$$ y = [-344915, -342047, -343927, -341470, -339867, -340968, -342916, -341833, -337827, -336550, -336830, -336676, -337343, -338082, -339161, -336786, -329942, -330735, -334788, -335715, -334278, -332438, -336139, -338312, -336882, -331135, -332182, -332502, -330071, -330517, -330512, -335083, -336007, -333719, -331428, -328033, -325768, -325634, -331170, -330907, -331584, -331905, -329687, -327484, -328607, -329815, -330242, -328825, -326391, -325206, -324670, -323478, -324171, -325001, -325324, -324605, -321427, -318561, -319670, -321239, -323222, -324543, -323953, -326197, -324207, -321057, -322797, -321459, -317665, -316224, -317517, -319277, -316515, -316826, -319364, -317691, -318119, -318125, -318631, -323643, -323379, -320688, -319528, -319451, -317849, -314964, -314949, -318168, -321636, -320860, -319846, -318535, -319939, -320030, -320113, -322991, -325601, -326019, -322276, -320763, -322306, -319229, -320482, -320738, -318944, -317471, -317249, -317289, -318910, -317504, -314894, -315189, -316267, -315816, -316052, -315936, -316051, -319157, -318233, -317031, -318308, -316045, -313662, -312613, -312750, -311080, -312695, -312456, -315634]
8247c15634k134p84J182L250L391q32P09k3j220J637n83m190j177L03J934K893
8231c11278R07k475j518K819J761p38k873j712M55j514j01K813J110R32j495J574
8215c11333K796K939K67l086k670m024r27M393O880L78l88N786l761n059j187
8200c08996k301L05J982k460P9j892K6O52J507j37Q68q0m91J310K577o79k161
8183c09891n26J146R6L646k37L33k264k379l241P20K572J438L162p37q78L115
8167c03925J918n139k435R99l085p31L422M234K037j633k475k445M37L106K64
8152c05451n07n97j630j60J485K311N550P57k569j002p74K13o32j535n47q72o9
8135c06029L673J842O19J652M19m006P58K092k065k092Q29J52n648m561L014K985
$$ y = [-315634, -317768, -318552, -317370, -314120, -310729, -311561, -310852, -310875, -312095, -310458, -311041, -315231, -316408, -316105, -314171, -311278, -310371, -312846, -314364, -311545, -309784, -310522, -313395, -315107, -314652, -316166, -316267, -313454, -312344, -311412, -312907, -311333, -308537, -305598, -305331, -308417, -311087, -315111, -316038, -311645, -304765, -304387, -304775, -298989, -302750, -307809, -308996, -311297, -310992, -309010, -311470, -311391, -313283, -313257, -312605, -311098, -311235, -310367, -310447, -310938, -309628, -307051, -307730, -309891, -310417, -309271, -309175, -305529, -305766, -305433, -307697, -310076, -313317, -312597, -310025, -308587, -305425, -306162, -307040, -303925, -302007, -307146, -309581, -308582, -311667, -312398, -308976, -304742, -302705, -304338, -306813, -309258, -308821, -305715, -305451, -305958, -306555, -308185, -308345, -306860, -304549, -298999, -298242, -300811, -301813, -302587, -302374, -303006, -304541, -305088, -305960, -306029, -302356, -300514, -299895, -298243, -297824, -301830, -301072, -298980, -301045, -303137, -302308, -302156, -307804, -312365, -309351, -306366]
8119c06366Q86J731J919J555Q57j735J269J97m951j775L027Q49J713n0j803o49
8103c03326K028J08m198k259m41O70K999P797L429n273j921J364K898P41k079
8088b97463j87J023l22n4K590J738m111m353m44n63J820q8O36J725J815J343J051
8071b93844O41l65K697K295p28m9M64j705j677K659r82n311l273L772j499k751
8055b99656m41K171J176Q42m237k702K855L996J391N23J469K082r73K293r50N2
8039b90109o78J255L568j718l268o131m942J495K566K472K488j305l465r07P15
8024b97964K741J960L469j532k701k21L191J669o37P7P15j3k34J559p97m89L186
8007b86021l050J010j485o43J206J3k013M46j450K099p24L352Q92J644K927p96
$$ y = [-306366, -305480, -303749, -301830, -300275, -299418, -301153, -299884, -299687, -304638, -306413, -303386, -302537, -300824, -300874, -302677, -303326, -301298, -301190, -305388, -307647, -308088, -307418, -304419, -296622, -293193, -298466, -300387, -299023, -296125, -295384, -297463, -297650, -296627, -296949, -297003, -294413, -292675, -296786, -301139, -301583, -302146, -300326, -300414, -299778, -298053, -296238, -294895, -293844, -293203, -293568, -290871, -288576, -289304, -289353, -288889, -290594, -292271, -289612, -290594, -295905, -299178, -295406, -296905, -299656, -300097, -297926, -296750, -295908, -300145, -302847, -299992, -295996, -294605, -294082, -292613, -290531, -291504, -289211, -290161, -290109, -290787, -289532, -285964, -287682, -290950, -297081, -302023, -300528, -297962, -295490, -293002, -294307, -297772, -298679, -297964, -295223, -293263, -289794, -291326, -294027, -294248, -291057, -289388, -290025, -289948, -289233, -289246, -289480, -287921, -288718, -289207, -286021, -289071, -288061, -289546, -290189, -288983, -288970, -290983, -290537, -291987, -289888, -290612, -287260, -286368, -284724, -281797, -282593]
7991b82593j104n588j476J730J413J598o58k771P26m55j497m347n01J599j289
7976b95213J606J877j250J253k36r74O42k664L7L809O142j304l2L475J432L87
7960b81013Q67J871j190Q10k026K433M735k570r832r530n136o83M39K073L132
7945b95620K183K898N32K636N08k784o557q510l126J643K380L086J537r64k462
7930c02620L372J831M238l22J966j129j816R45k894K107M253Q86L456J792k396
7915b86331k69k490j329l475Q15O41M211l860j977k219k135l729J284P849J199
7900b91815R3n12J78j43o497j223j192j297J078J695K87K839M48m02p7P89K44
7883b95507r94j720o01Oj117j234K791K493M420J829k807P20k246r68L55p13K507
$$ y = [-282593, -283697, -289285, -290761, -289031, -287618, -286020, -286678, -289449, -288723, -289178, -290675, -295022, -295523, -293924, -295213, -293607, -291730, -292980, -291727, -291963, -292937, -292295, -294959, -294922, -291113, -284971, -286275, -286307, -282832, -281400, -281013, -280146, -278275, -279465, -278655, -280681, -278248, -273513, -276083, -285915, -295445, -300581, -301264, -300825, -298752, -295620, -293437, -290539, -290007, -287371, -286863, -289647, -296204, -304714, -307840, -306197, -303817, -300731, -299194, -300158, -302620, -299248, -297417, -293179, -293501, -291535, -292664, -294480, -293535, -296429, -294322, -290069, -289183, -285727, -283935, -286331, -286600, -289090, -290419, -293894, -293079, -292438, -288227, -292087, -294064, -296283, -298418, -302147, -300863, -293014, -291815, -291722, -292234, -292056, -292199, -298696, -299919, -301111, -302408, -301330, -299635, -299348, -296509, -296061, -296463, -296540, -295751, -295507, -296501, -298221, -298822, -298816, -299933, -301167, -298376, -295883, -291463, -289634, -292441, -291721, -293967, -294935, -294580, -295293, -292786]
7866b92786j133j10j274J692O5L43K161RN84j731O81o12k782m992L330J852Q21
7849b93882p07K507l17l428j304o87K231k526p29K405J466L084m89q85J776M64
7833b91021j80q60Q83J000o94j814R82M46l299O92J621K449K690K004q24k96m849
7816b91070k559m03K116M850J71n20n616M27L503p0j402K96P99L03k48o86j071
7799b91180J660k257n5J114N91J71j269j672R39K339O06j458K095L739l75J95
7783b84817L88m60K884J358j33j269o34j815L428j751m174l501r71L789j16M51
7767b87343q40l46L21j840l87R63N351M704j195k938O03J781o93O6n80K104j468
7750b81737J315j82n428l703J914K323k435Q32K577k045j84L783j570j683p15
$$ y = [-292786, -293919, -294029, -295303, -293611, -293546, -293203, -291042, -291033, -290449, -292180, -291499, -292111, -294893, -299885, -296555, -294703, -293882, -294589, -292082, -292399, -295827, -297131, -297818, -295587, -298113, -298842, -296437, -294971, -291887, -292376, -293261, -291485, -291021, -291201, -292061, -291178, -290178, -290872, -292686, -291704, -291258, -294557, -293865, -292244, -289795, -287105, -285101, -285925, -286221, -291070, -293629, -294032, -291916, -287066, -286895, -287415, -293031, -292604, -289101, -289171, -290573, -290277, -289478, -289175, -289423, -290109, -291180, -289520, -291777, -291832, -290718, -290127, -289956, -291225, -292897, -291958, -289619, -289013, -290471, -288376, -284637, -285012, -284817, -284429, -284889, -282005, -280647, -280780, -282049, -282683, -284498, -281070, -282821, -286995, -290496, -291467, -287678, -287794, -287343, -288183, -288529, -288208, -290048, -290435, -289472, -284121, -279417, -280612, -283550, -282947, -281166, -281859, -281793, -282373, -280269, -281737, -280422, -280604, -286032, -289735, -287821, -285498, -287933, -287101, -284524, -286569, -286753, -282970, -284540, -286223, -286938]
7735b86938l957K167j523J93L499M631J619m52P62r63r98k211J906j846K694Q73
7719b80544J54K23J11J023k375J258K184N834L57j679r86k63k974j247j311J385
7703b78850l689k842J89j108o60J070J640J136R81K806l938l962k77J285J347
7688b84872r65K56J993J225Q87n59k581K319M958J753j648J526l132n13l607l863
7672b86823J449K403l26k32P58q56j475J031J135J392N40N93J268J335QJ045k249
7655b79004k671j536J00K56K518J171n51J325J769j922M346M07m037m68L036K45
7639b75016k277R75j575j742j945j009L083j3r93J501K399K431k417q54k176J414
7623b78214K943J845M97M08j171Q76j719M33N75m53k821k831j518K546M26j987
$$ y = [-286938, -290895, -288728, -290251, -290058, -286559, -281928, -280309, -280761, -279999, -280962, -281960, -284171, -282265, -284111, -281417, -280544, -280390, -280167, -280056, -279033, -281408, -280150, -277966, -272132, -271775, -273454, -274440, -274703, -277677, -278924, -280235, -278850, -282539, -285381, -285192, -286300, -286960, -285890, -284250, -283114, -282133, -279327, -283265, -287227, -287504, -286219, -284872, -285837, -285581, -283588, -282363, -281476, -282035, -284616, -282297, -277339, -275586, -277234, -275708, -278840, -279353, -282960, -286823, -285374, -282971, -283297, -283529, -282771, -283627, -285102, -284071, -282936, -281544, -281004, -280411, -279143, -277808, -277800, -276755, -279004, -281675, -283211, -283111, -282855, -280337, -279166, -279717, -278392, -276623, -278545, -274199, -273792, -277829, -278297, -275261, -275016, -277293, -276318, -277893, -279635, -281580, -282589, -279506, -279519, -280512, -279011, -276612, -274181, -276598, -277452, -279628, -278214, -275271, -273426, -272929, -272521, -273692, -272816, -274535, -274102, -273527, -273980, -276801, -279632, -281150, -278604, -278178, -280165]
7607b80165K663Q13J310L427r93k184PR2J399k88J86N38j057o95L036J0l466r29
7589b76296O13k920N73K302K474r59j23n66p66q67m56k518L892M233k838r59k148
7572b77329J820N404J470J725J500k168k070K127k274J139j645l270m297K386
7558b75482M490L113J7k559j319l315M306K066r15l317K301M651o218m244P8L369
7542b72978K218J291j8q78l173n63K284J900q43M50R08l320l321O827L63m86Q00
7525b68539j77l940O29K509p43N85J116m49k412l206L90M423o78j378q76J188
7509b71558L180j179j918o60r24O73r67J763M29l617p23K604J007L786J495j644
7493b68253l414k723l56K429J967P00K77k39J684j145q66j180J552m165J09K813
$$ y = [-280165, -277502, -276689, -275379, -271952, -272945, -275129, -275122, -275030, -273631, -273919, -273733, -273195, -274252, -274947, -271911, -271901, -275367, -276296, -275683, -278603, -278030, -275728, -273254, -274213, -274336, -274902, -275668, -276535, -276991, -279509, -275617, -271384, -274222, -275181, -277329, -275509, -270105, -268635, -266910, -265410, -267578, -269648, -267521, -269795, -268656, -270301, -273571, -277868, -275482, -270992, -267879, -267862, -270421, -271740, -275055, -270749, -268683, -269598, -272915, -270614, -265963, -272181, -276425, -276347, -272978, -270760, -269469, -269487, -270365, -273538, -274101, -271817, -269917, -270760, -270310, -269402, -272722, -276043, -269216, -268853, -269339, -268539, -268716, -272656, -272027, -269518, -270261, -269676, -268560, -269009, -271421, -274627, -274237, -269814, -270492, -271870, -272746, -271558, -268378, -269557, -271475, -272135, -273059, -272386, -273353, -271590, -271161, -274778, -275501, -272897, -271890, -268104, -266609, -268253, -271667, -274390, -274746, -272317, -270350, -269650, -269373, -269612, -267928, -269073, -269939, -271119, -269567, -273732, -273623, -270810]
7477b70810L805L472K038j658m596k670J102k256R74P29m694J531N903J865m625
7462b69890K490J740p88k773L79j88J149L236o48o75K270K043k235n573l84P88
7446b69059J364r85O22j591k080J907J030j797K278K062J416j280n03K828o42
7431b64430k623m056P93K624K046K140K571L010k145R83j598k407K085J655o98
7416b60050o69k480k297l302Q30j65J85j219j61N264J416p75J454k33l371K04
7400b65369K732J55j251p08l151j198K519K181P52k633j884M14L955j291M94L915
7384b60368N07m115n423k662K74O566M492M131L91j211q04j589m870M87j918L416
7368b62696j686M81K181m830l840l293J571L944L603Q89K89p83J382k86K480M339
$$ y = [-270810, -267005, -263533, -261495, -263153, -267749, -270419, -269317, -271573, -270599, -269870, -274564, -273033, -267130, -265265, -269890, -267400, -265660, -266448, -269221, -268842, -269030, -267881, -264645, -265293, -265968, -263698, -261655, -263890, -269463, -269847, -269059, -267695, -268680, -268058, -269649, -271729, -269822, -268792, -270589, -268311, -266249, -264833, -266113, -266616, -263788, -264430, -267053, -271109, -270316, -267692, -265646, -263506, -260935, -257925, -260070, -259087, -260685, -263092, -261007, -259352, -260050, -260719, -263199, -265496, -268798, -267968, -268133, -267948, -269167, -269328, -264064, -262648, -263423, -261969, -262202, -265573, -265369, -262637, -262482, -263733, -264441, -267592, -268790, -266271, -264090, -263338, -265971, -267855, -267441, -263486, -264777, -264283, -260368, -259861, -263976, -269399, -272061, -271787, -265221, -260729, -256598, -256207, -257418, -258222, -259811, -264681, -264194, -266112, -262696, -264382, -263901, -261720, -266550, -270390, -273683, -272112, -268168, -264565, -263676, -263387, -264170, -262788, -263074, -260594, -256255]
7352b56255p43k570J24j190j222k873j562o8k524L224N402l83K22l48q49j651
7336b63266j259P51N65j267j456r51N45K545L056K690k146N89l606j807j161K32
7320b65946J288L989P95J7l52J434j060J310J047M74J267p09j72J09j199l463
7304b61171L116k653m196L715J986j474l797j461k91K034J708J685Q13J197K500
7289b56289L88J37l368l753J222n09O9K170p10k373N01L660J746j9l379m812K249
7272b63070K398M175n26j50L396j932k282m177j461q31j62K183L387J844k512
7257b59720l116J89L310J866L590J344%k047o486k785J531J375M980j175k97K166
7241b55275J321q64j761j499L64P14q81J237k430N37J145l03L329J200n737M75
$$ y = [-256255, -256998, -259568, -259444, -260634, -261856, -264729, -266291, -266359, -268883, -265659, -260257, -260640, -260418, -260766, -261615, -263266, -264525, -263774, -263209, -264476, -265932, -266883, -266338, -263793, -260737, -258047, -260193, -259604, -263210, -265017, -266178, -265946, -264658, -260669, -259874, -259857, -260209, -258775, -259835, -258525, -257478, -257004, -255737, -256446, -256618, -256509, -257708, -261171, -258055, -260708, -264904, -261189, -259203, -260677, -264474, -265935, -266226, -264192, -262484, -260799, -259986, -258789, -256289, -255901, -255764, -259132, -262885, -261663, -262172, -262103, -259933, -260643, -263016, -262515, -258855, -257109, -257128, -260507, -265319, -263070, -260672, -256497, -257023, -257173, -253777, -255709, -257991, -262168, -263629, -264460, -264622, -262439, -259052, -257208, -259720, -262836, -262647, -259337, -257471, -253881, -252537, -252537, -254584, -261070, -263855, -262324, -260949, -255969, -257144, -257441, -255275, -253954, -254818, -256579, -258078, -257714, -257000, -257881, -256644, -259074, -258537, -257392, -257695, -254366, -253166, -258903, -258428]
7225b58428L333M78J593k126k995J162O62o81R67R48J184Q09K78K523M99J018
7209b48776m021n432J137o01j634J268j213k772P72K332K008j567j812j00K616
7194b57795K993k172l06r43n54K136l46j617L48K732J593j533q34M289K011q16
7178b50814J13n43K537k687j089M45k756Q64k226j907o91J16J696J646j041p93
7162b57130Q22p98j577J79p85J787j754J414jK142J070J937Q52O23J315K72r46
7145b50578l054k26j348k087k092L0N078O124K440k913l179j308m88n87L98k15
7129b54005J876L002J017n879k883L431K593j22j661k682j384q47M69j54m67j274
7113b58970K462M243j71m40K51p90L93n47Q45J568o55n85L257K480k405j475o00
$$ y = [-258428, -255095, -254617, -253024, -255150, -258145, -256983, -256321, -257002, -256035, -255087, -253903, -253094, -252816, -250293, -249794, -248776, -252797, -258229, -257092, -257693, -259327, -258059, -259272, -262044, -261272, -258940, -256932, -258499, -260311, -260411, -257795, -254802, -256974, -257280, -258223, -258777, -256641, -256987, -258604, -258256, -255524, -253931, -255464, -256298, -252009, -249998, -250814, -250701, -251244, -248707, -251394, -252483, -252038, -254794, -253930, -256156, -258063, -258754, -258638, -256942, -255296, -256337, -257130, -256308, -257106, -258683, -258504, -259289, -257502, -259256, -257842, -257843, -255701, -254631, -252694, -251842, -251219, -249904, -249632, -250578, -253632, -253858, -255206, -257293, -259385, -259355, -254277, -248153, -245713, -248626, -251805, -253113, -253601, -254188, -253790, -254005, -252129, -249127, -248110, -253989, -256872, -253441, -250848, -250970, -252631, -255313, -256697, -257544, -257075, -257229, -257696, -258970, -256508, -252265, -252436, -252876, -252625, -253415, -253022, -253569, -252724, -251156, -251811, -252396, -249139, -246659, -249064, -250539, -251139]
7096b51139k662O88L170L875l889l803l91J383M810k695n418j147J791J822K509
7081b51096l55j314o333k152J718M448J233O25J611K402J814R11k516n57j421
7066b50982Q73o30P15O62J198K985l990j505q25O30K772K885L66j38k617n701
7050b53302l136Q45k266r91K553J906l67J226J557n34J214O67O10M71K189J066
7034b46292j795M03j814j928L042L805J524L71o16k064N86p2j388j665m803M037
7018b48669M002J7k54j399k412K480L104N40m225l42j368m638M435J672p39P29
$$ y = [-251139, -253801, -253113, -249943, -246068, -249957, -253760, -254151, -252768, -247958, -250653, -256071, -257218, -255427, -253605, -251096, -251451, -252765, -259098, -261250, -259532, -255084, -253851, -253226, -251615, -249213, -247399, -246488, -249004, -249561, -250982, -250109, -250739, -250024, -249362, -248164, -245179, -249169, -250674, -251499, -250869, -248097, -245212, -244846, -244984, -247601, -253302, -256438, -255593, -257859, -258850, -256297, -254391, -254758, -253532, -251975, -252509, -251295, -250628, -250018, -249547, -247358, -246292, -248087, -247684, -249498, -251426, -248384, -244579, -243055, -242684, -243300, -245364, -244778, -244850, -246238, -247903, -252706, -248669, -244667, -244650, -244904, -246303, -248715, -246235, -243131, -242591, -246816, -247158, -248526, -253164, -248729, -247057, -247796, -247067]
$$ [...]
##END NTUPLES=NMR SPECTRUM
##END=
