##TITLE=Analysis number 326611
Compound Code cc 52226
Book Reference 467/120
Project Code adrs
Chemist Name benw
##JCAMPDX= 6.0         $$ Bruker NMR JCAMP-DX V2.0
##DATA TYPE= NMR SPECTRUM
##DATA CLASS= NTUPLES
##ORIGIN= Bruker BioSpin GmbH
##OWNER= nmr
$$ XWIN-NMR		Version 3.5
$$ Thu Feb 15 11:23:23 2007 GMT Standard Time (UT+0h)  MAYBRIDGE\nmr@NMR_250MHZ
##.OBSERVE FREQUENCY= 250.131544655141
##.OBSERVE NUCLEUS= ^1H
##.ACQUISITION MODE= SIMULTANEOUS (DQD)
##.ACQUISITION SCHEME= undefined
##.AVERAGES= 16
##.DIGITISER RES= 18
##SPECTROMETER/DATA SYSTEM= dpx250
##.PULSE SEQUENCE= zg30
##.SOLVENT NAME= CDCl3
##.SHIFT REFERENCE= (INTERNAL, CDCl3, 0, 16.4484)
##AUDIT TRAIL= $$ (NUMBER, WHEN, WHO, WHERE, WHAT)
$$ ##TITLE= Audit trail, XWIN-NMR		Version 3.5
$$ ##JCAMPDX= 5.01
$$ ##ORIGIN= Bruker BioSpin GmbH
$$ ##OWNER= nmr
$$ C:\u/data/dgb/nmr/ADRS/970/pdata/1/auditp.txt
$$ ##AUDIT TRAIL=  $$ (NUMBER, WHEN, WHO, WHERE, WHAT)
(   1,<2007-02-15 11:23:03.86 +000>,<MAYBRIDGE\nmr>,<NMR_250MHZ>,
      <created by zg, POWCHK disabled, PULCHK disabled
       configuration hash MD5:
       49 4B E0 1D 92 C2 6B 37 9F E6 65 BC 52 41 86 1D
       data hash MD5: 64K
       1F FD 25 1D AD A5 9B 6C E1 21 65 7C 57 FA 01 7A>)
(   2,<2007-02-15 11:23:15.57 +000>,<MAYBRIDGE\nmr>,<NMR_250MHZ>,
      <Start of raw data processing
       ef LB = 0.3 FT_mod = 6 PKNL = 1 SI = 32K 
       data hash MD5: 32K
       66 E5 FC 8A 39 DC 15 E6 01 CE 43 20 A0 12 2C E1>)
(   3,<2007-02-15 11:23:17.16 +000>,<MAYBRIDGE\nmr>,<NMR_250MHZ>,
      <apk 
       data hash MD5: 32K
       A9 2B 32 69 BF 96 79 3A CE 09 07 BE A9 A8 50 8E>)
(   4,<2007-02-15 11:23:17.86 +000>,<MAYBRIDGE\nmr>,<NMR_250MHZ>,
      <abs ABSG = 5 
       data hash MD5: 32K
       9C FD 2A BF FB EC 85 94 16 48 5C 4A CC 95 74 B7>)
$$ ##END=
$$ 
$$ hash MD5
$$ E9 DA 59 DA 07 C0 D9 AE CB 35 54 75 F9 9A 21 39
##$RELAX= 
##$RELAX= 
##$RELAX= 
##$RELAX= 
##$RELAX= 
##$RELAX= 
##$RELAX= 
$$ Bruker specific parameters
$$ --------------------------
##$DU= <C:\u>
##$EXPNO= 970
##$NAME= <ADRS>
##$PROCNO= 1
##$TYPE= <nmr>
##$USER= <dgb>
##$AMP= (0..31)
100 100 100 100 100 100 100 100 100 100 100 100 100 100 100 100 100 100 
100 100 100 100 100 100 100 100 100 100 100 100 100 100 
##$AQSEQ= 0
##$AQ_mod= 3
##$AUNM= <au_zg>
##$AUTOPOS= <38 >
##$BF1= 250.13
##$BF2= 250.13
##$BF3= 250.13
##$BF4= 250.13
##$BF5= 500.13
##$BF6= 500.13
##$BF7= 500.13
##$BF8= 500.13
##$BYTORDA= 1
##$CFDGTYP= 0
##$CFRGTYP= 5
##$CHEMSTR= <none>
##$CNST= (0..31)
1 1 145 1 1 1 1 1 1 1 1 1 1 1 1 1 1 1 1 1 1 1 1 1 1 1 1 1 1 1 1 1 
##$CPDPRG= <>
##$CPDPRG1= <>
##$CPDPRG2= <>
##$CPDPRG3= <>
##$CPDPRG4= <mlev>
##$CPDPRG5= <mlev>
##$CPDPRG6= <mlev>
##$CPDPRG7= <mlev>
##$CPDPRG8= <mlev>
##$CPDPRGB= <>
##$CPDPRGT= <>
##$D= (0..31)
0 1 0 0 0 0 0 0 0 0.06 0 0 0 0 0 0 0.0002 0 0 0 0 0 0 0 0 0 0 0 0 0 0 
0 
##$DATE= 1171538582
##$DBL= (0..7)
120 120 120 120 120 120 120 120 
##$DBP= (0..7)
150 150 150 150 150 150 150 150 
##$DBP07= 0
##$DBPNAM0= <>
##$DBPNAM1= <>
$$ [...]
##$SUBNAM7= <"">
##$SUBNAM8= <"">
##$SUBNAM9= <"">
##$SW= 20.6930455092707
##$SWIBOX= (0..15)
0 0 3 0 0 0 0 0 0 0 0 0 0 0 0 0 
##$SW_h= 5175.983436853
##$TD= 65536
##$TD0= 1
##$TE= 295.16
##$TE2= 300
##$TE3= 300
##$TEG= 300
##$TL= (0..7)
0 120 120 120 120 120 120 120 
##$TP= (0..7)
150 150 150 150 150 150 150 150 
##$TP07= 0
##$TPNAME0= <>
##$TPNAME1= <>
##$TPNAME2= <>
##$TPNAME3= <>
##$TPNAME4= <>
##$TPNAME5= <>
##$TPNAME6= <>
##$TPNAME7= <>
##$TPOAL= (0..7)
0.5 0.5 0.5 0.5 0.5 0.5 0.5 0.5 
##$TPOFFS= (0..7)
0 0 0 0 0 0 0 0 
##$TUNHIN= 0
##$TUNHOUT= 0
##$TUNXOUT= 0
##$USERA1= <user>
##$USERA2= <user>
##$USERA3= <user>
##$USERA4= <user>
##$USERA5= <user>
##$V9= 5
##$VALIST= <valist>
##$VCLIST= <CCCCCCCCCCCCCCC>
##$VD= 0
##$VDLIST= <DDDDDDDDDDDDDDD>
##$VPLIST= <PPPPPPPPPPPPPPP>
##$VTLIST= <TTTTTTTTTTTTTTT>
##$WBST= 1024
##$WBSW= 4
##$XGAIN= (0..3)
0 0 0 0 
##$XL= 0
##$YL= 0
##$YMAX_a= 186070
##$YMIN_a= -316128
##$ZGOPTNS= <>
##$ZL1= 120
##$ZL2= 120
##$ZL3= 120
##$ZL4= 120
##$ABSF1= 16.44841
##$ABSF2= -4.244762
##$ABSG= 5
##$ABSL= 3
##$ALPHA= 0
##$AQORDER= 0
##$ASSFAC= 0
##$ASSFACI= 0
##$ASSFACX= 0
##$ASSWID= 0
##$AUNMP= <proc_1d>
##$AZFE= 0.1
##$AZFW= 0.1
##$BCFW= 0
##$BC_mod= 0
##$BYTORDP= 0
##$COROFFS= 0
##$CY= 12.5
##$DATMOD= 1
##$DC= 0
##$DFILT= <>
##$DTYPP= 0
##$F1P= 14.0000005364418
##$F2P= -0.99999901652339
##$FCOR= 0.5
##$FTSIZE= 32768
##$FT_mod= 6
##$GAMMA= 0
##$GB= 0
##$INTBC= 1
##$INTSCL= 1
##$ISEN= 128
##$LB= 0.3
##$LEV0= 0
##$LPBIN= 0
##$MAXI= 10000
##$MC2= 0
##$MEAN= 0
##$ME_mod= 0
##$MI= 0
##$NCOEF= 0
##$NC_proc= -5
##$NLEV= 6
##$NOISF1= 0
##$NOISF2= 0
##$NSP= 0
##$NTH_PI= 0
##$NZP= 0
##$OFFSET= 16.44841
##$PC= 1
##$PHC0= 230.7708
##$PHC1= 1.201309
##$PH_mod= 1
##$PKNL= yes
##$PPARMOD= 0
##$PSCAL= 4
##$PSIGN= 0
##$REVERSE= no
##$SF= 250.13001840498
##$SI= 32768
##$SIGF1= 0
##$SIGF2= 0
##$SINO= 400
##$SIOLD= 32768
##$SREGLST= <1H.CDCl3>
##$SSB= 0
##$STSI= 32768
##$STSR= 0
##$SW_p= 5175.98343685301
##$SYMM= 0
##$S_DEV= 0
##$TDeff= 65536
##$TDoff= 0
##$TI= <Analysis number 999999
Compound Code 99
Book Reference 9
Project Code 9>
##$TILT= no
##$TM1= 0
##$TM2= 0
##$TOPLEV= 0
##$USERP1= <user>
##$USERP2= <user>
##$USERP3= <user>
##$USERP4= <user>
##$USERP5= <user>
##$WDW= 1
##$XDIM= 32768
##$YMAX_p= 351095665
##$YMIN_p= -476003
$$ End of Bruker specific parameters
$$ ---------------------------------
##NTUPLES= NMR SPECTRUM
##VAR_NAME=  FREQUENCY,     SPECTRUM/REAL,   SPECTRUM/IMAG
##SYMBOL=    X,             R,               I
##VAR_TYPE=  INDEPENDENT,   DEPENDENT,       DEPENDENT
##VAR_FORM=  AFFN,          ASDF,            ASDF
##VAR_DIM=   32768,         32768,           32768
##UNITS=     HZ,            ARBITRARY UNITS, ARBITRARY UNITS
##FACTOR=    0.157963299565203, 1,           1
##FIRST=     4114.24110458202, 0,            0
##LAST=      -1061.74233227099, 0,           0
##MIN=       -1061.74233227099, -476003,     0
##MAX=       4114.24110458202, 351095665,    0
$$ Real data points
##PAGE= N=1
##DATA TABLE= (X++(R..R)), XYDATA
$$ [...]
27567 -60056 12415 149147 30863 -59433 3261 108687 28138 -120688 -110365 -34023 21274
27556 21274 100059 230925 115528 185085 236078 258935 252471 138852 115720 43413 42380
27545 42380 190123 245889 106682 53988 143066 228402 117904 52367 13711 -58219 -86802
27534 -86802 -113383 -146563 -112545 -43961 -72818 4213 -79294 -196339 -167431 -99482 12183
27523 12183 66832 45006 76256 -49124 77277 43251 -73640 -170633 -218797 -234707 -91931
27512 -91931 -33343 -134196 -225812 20803 169926 101911 41983 115559 116844 128095 46764
27501 46764 13568 102088 159404 34417 -74950 -134332 2756 104740 130628 119452 116010
27490 116010 142559 112471 31261 -63795 -135871 -321033 -346527 -250557 -21868 13076 -112548
27479 -112548 -96614 41110 349 -38352 74879 172595 138541 82050 77814 215421 210603
27468 210603 2631 -52845 -14555 -29253 -83685 -132969 -74966 -29481 196154 169831 114350
27457 114350 132419 99744 -569 6451 199503 116525 66562 90887 18085 -23871 -33540
27446 -33540 -83458 -17569 158701 160569 109286 69218 33621 114026 -3577 -153455 -281816
27435 -281816 -251326 -149958 6941 173743 146810 59903 -50445 -76076 125521 119066 10966
27424 10966 152591 190838 103640 71927 188184 166761 17382 -59609 -19773 109236 154567
27413 154567 241335 200279 72132 -33019 10968 86925 124302 216 -48294 -65720 -100085
27402 -100085 92442 92043 40315 165882 262033 273863 306592 319578 131517 117687 188961
27391 188961 119118 26381 -8909 -2580 -20671 -40438 -79581 -173085 -75832 -234 43639 96563
27379 96563 198619 167962 60034 -70057 -195984 -117913 1645 18846 -38669 19327 121426
27368 121426 309 -58164 -165684 -156589 -188541 -175966 -152446 -44026 -4450 67920 75724
27357 75724 114597 64284 96098 124208 136909 43105 -99991 -24544 66590 78780 111060
27346 111060 136031 106068 114685 -39785 -92555 -102103 -126523 -168171 80933 159211 173811
27335 173811 134855 -66351 -44416 23473 8735 -5 10173 190578 279195 221640 20314
27324 20314 -113008 -235624 -296365 -207387 -124992 -15815 -71721 46865 207683 102580
27314 102580 125158 195207 230784 181487 33625 92228 148188 183369 109117 27960 -2749
27303 -2749 -17216 -44141 -97374 -73511 -37803 6183 27980 -50675 24731 163087 151596 127082
27291 127082 149675 239677 321449 359010 226135 146911 100913 81641 113193 162292 -5992
27280 -5992 -140216 -45838 85053 21987 -124355 -157834 -277348 -296306 -214147 -193571 -1138
27269 -1138 24331 -11480 -55134 -166296 -142678 -81017 -74637 -166706 -109516 -73710 -75969 -108069
27257 -108069 -125758 -142232 -12477 -11486 57579 69821 172079 147328 106641 130808 84126
27246 84126 71982 43697 72175 88418 152791 121008 135560 146987 100982 96979 228013 192430
27234 192430 77744 117387 83602 141108 55318 106870 246192 211926 120423 134484 15181
27223 15181 -17186 99386 239371 210803 169171 174286 65761 40946 64121 40850 -29413
27212 -29413 -120840 -182043 -61212 11530 -55337 -193278 -224892 -175295 -149374 -33702 34841
27201 34841 -22074 -138667 -272060 -288087 -120961 -43253 -86446 -170428 -73169 120513 182963
27190 182963 283672 177181 -131777 -98886 -16181 -98068 -111985 -95314 -37014 139037 179720
27179 179720 140270 57692 49565 100892 10913 -17781 -29357 -57995 -11839 31621 69373 137370
27167 137370 83270 -89021 -27720 -113924 -268302 -200741 -45074 107907 108143 36550 59178
27156 59178 136400 83169 -14784 -21866 -79879 -5706 -14970 -24773 -41468 -133132 -50885 -29005
27144 -29005 -31253 -45912 -18383 85272 210285 225188 204586 206012 242243 177041 130656 94475
27132 94475 46852 59539 16452 36249 95297 -7565 -104764 -162177 -85437 -115862 -54230
27121 -54230 -5635 -56955 -17005 -34162 -83890 -79385 -121130 -166569 -63938 -53666 26645 119862
27109 119862 216345 223689 236427 115613 -12298 -4484 26781 34148 -62456 -106728 -45017 -143338
27097 -143338 -282188 -209389 -76278 -19762 -77054 -56448 47384 97101 107006 156110 95132
27086 95132 74484 78273 37021 -66337 -126971 -234649 -181507 -106187 -70526 -8864 56134
27075 56134 25957 -95877 -203691 -283552 -197955 -128269 -80645 -148330 -113710 -159316 -116155
27064 -116155 -18552 190423 291765 124516 -110630 -170490 -205429 -141713 -25653 -73239
27054 -73239 -86985 -64646 -1414 48888 134360 223078 214526 100689 65453 -18882 -74047 -117352
27042 -117352 -54405 -32982 163509 73658 -119232 -92181 36679 51183 -13167 501 148578
27031 148578 159847 -14824 -93187 -47456 -72279 -136484 -181243 -264860 -169291 -32461 53975
27020 53975 49655 17649 -4860 -71374 -176243 -186175 -97802 31045 -38721 -23155 13883 -5022
27008 -5022 42508 570 39744 12622 92472 185805 162708 114039 97267 87180 -3696 -38413
26996 -38413 -66215 -105782 -110113 -27595 136325 323992 371538 274353 115190 -4147 34332
26985 34332 -41498 -111554 -38026 68178 102466 95175 -99181 -181573 -174992 -191643 -60616
26974 -60616 -87229 -72803 -1712 -4411 -40108 -5562 115987 129251 176872 181898 157472 23329
26962 23329 -11078 69877 135869 92216 208679 168389 169123 154401 84693 13664 -124763 -77408
26950 -77408 -50427 -51002 -135329 -79348 -59882 73063 104348 43244 120279 84757 120178 70554
26938 70554 146749 191401 86964 18162 43433 95578 -59276 -110316 22782 44244 152671
26927 152671 169508 70981 77705 23960 -60995 -74563 -42773 -18051 34155 115873 203266 160481
26915 160481 59714 -33899 -44588 10108 67398 113386 83284 -20191 26269 -61420 32037
26904 32037 122168 98205 101903 97306 146515 149021 -6932 90120 159894 264692 238030 288860
26892 288860 282103 262216 287859 395205 369540 371415 212840 17691 -153601 -52936 111800
26881 111800 2359 -90302 -86523 -57089 21110 98761 112658 75937 -36747 -1325 6895
26870 6895 6801 -64533 -123893 1894 -48545 -3451 150041 -9694 -176604 -264835 -299864 -180988
26858 -180988 -32803 170891 205923 58865 -158816 -95343 88830 221540 193735 57179
26848 57179 113548 234529 380533 229675 87821 176324 237964 175071 173166 192548 32700
26837 32700 -71517 -31457 124830 156906 88475 -16207 18361 129372 82911 -24620 -168812
26826 -168812 -172506 -170174 -96648 13337 4754 -72815 -43991 47779 98972 162002 173275 -6849
26814 -6849 -82532 -92574 -52989 79935 145184 188756 131268 89582 12625 48404 87217 164427
26802 164427 207601 247716 112215 -143197 -256312 -217374 -155703 -171577 -129987 -66000 63942
26791 63942 141972 23092 -103322 -138597 -217781 -268542 -231164 -128336 15332 46964 79572
26780 79572 26744 -28010 28409 -1072 -36841 -121619 -199039 -207353 -178945 -318491 -412059 -294218
26768 -294218 -190464 -46573 -18263 -73527 -194291 -200279 20351 97754 6836 -16960 60066
26757 60066 76302 -9044 28961 209265 319687 167341 61847 -72345 -200314 -30087
26747 -30087 -39271 -84774 59076 152835 56302 -16929 27536 98300 198706 165547 98167
26736 98167 82622 46154 15064 48305 -2271 -14898 -27101 -12960 106765 133030 148422
26725 148422 147221 137551 130797 19025 54022 155504 188257 98780 35051 73509 64497 175432
26713 175432 165880 115014 30462 55352 85517 126177 49972 -76390 -177321 -99403 -103877
26702 -103877 8570 22675 -47713 -154422 -202223 -152252 -87500 -139816 -179954 -206458 -127774
26691 -127774 -178695 -159758 -100319 -91401 -32633 -3691 -80286 -91813 -132975 65519 52392
26680 52392 -54614 -72760 -29244 -43721 70211 -54533 -60377 52581 178870 232264 222750
26669 222750 82508 751 121525 83295 19530 23981 -21084 -5851 -20494 16632 85279
26658 85279 -14454 4805 36281 24242 58239 -6332 -14646 -4090 13222 20482 15747 -74244
26646 -74244 -116970 -134771 -76032 -73167 -537 63568 62298 103080 72428 -23100 -136882 -144644
26634 -144644 -48890 -60091 23047 101697 164458 187064 45730 3563 -33173 -46913 154095
26623 154095 35378 73458 97958 158925 127420 120058 173385 75947 23028 7993 -40451
26612 -40451 -29438 -104874 -122019 -81575 -228699 -179586 -92763 -5010 -66541 106815 153130
26601 153130 134739 209643 248226 68954 13850 28898 61659 109887 88010 -11659 -14730
26590 -14730 14252 122655 161728 100208 203092 151713 101883 71633 11862 -42119 -256935
26579 -256935 -475689 -451445 -269392 -198013 -79531 89161 76330 112693 91233 62019 53311
26568 53311 39005 86494 115170 100527 86252 -70032 5697 44047 25736 -103309 -165793
26557 -165793 -25729 103700 51983 -40836 -55566 -61362 87010 151154 155987 142924 33938
26546 33938 -116419 -273613 -230220 -159823 -198060 -206242 -254206 -174522 -95537 5128 116229
26535 116229 -207 -151034 -170019 -174175 -145745 -93973 -70365 54219 117931 153344 104216
26524 104216 -16387 -214128 -269046 -194827 -189804 -140098 -167033 -130716 -34469 -6612 -69929
26513 -69929 21690 83317 154916 212347 318920 299503 67859 -60035 -28735 38194 -95020
26502 -95020 -114320 -61566 18325 78678 102981 157782 202703 214829 63379 -64626 -97588
26491 -97588 -101534 -167728 -76139 -82888 -206375 -224984 -240177 -151359 -71800 -41782 -23094 -83897
26479 -83897 -119286 -165372 -231888 -337456 -377616 -398525 -380974 -326139 -172693 -140321 -19592
26468 -19592 30083 92715 3130 138910 30383 -70873 13805 172229 228650 251397 275467
26457 275467 266990 133876 -45175 79388 76459 31391 78061 85378 155012 184853 162383
26446 162383 198383 166578 49775 -79645 46455 220279 154971 28350 60851 139525
26436 139525 180730 310841 339827 238033 138720 128486 184426 187032 241794 310823 282164
26425 282164 151151 152639 141257 197691 211906 111006 -5927 -123806 -24186 131493 102441
26414 102441 -76669 -194545 -107037 -87407 -60801 -67254 -136719 -155686 -241570 -291879 -88734
26403 -88734 70186 215197 131525 -57801 -121182 -149265 -232929 -239611 -226622 -110818 99371
26392 99371 223327 92939 157299 219581 189539 139202 -5079 -34116 -30851 -4922 24052
26381 24052 -1844 -27901 87132 133730 104780 148329 210466 80949 15382 -104472 -171941
26370 -171941 -128124 4110 85128 140507 162362 267569 188546 265480 342123 329084 194526
26359 194526 28680 -57816 2299 26929 -152411 -266219 -210001 -24318 -75154 -98107 5130
26348 5130 57579 16466 -64389 -104751 -42504 -89021 23554 69598 -9261 -65512 -90151 -90818
26336 -90818 -27122 -22168 -22944 39457 110190 131453 4536 -5378 2901 57699 24015 86051
26324 86051 100459 139203 181483 137344 65483 49021 173949 316267 318120 234142 284604
26313 284604 213235 94339 37191 137358 214223 147300 32433 -48089 -108440 44302 35639
26302 35639 -95595 -125798 -158055 -76806 16088 -23344 57948 150759 142830 162097 121056 43761
26290 43761 -2198 -38811 -55054 -10215 125467 197619 45494 -105765 -49566 29456 61851
26279 61851 73993 -20519 -101447 155402 205491 115000 16965 -46262 5936 -120718 -130662
26268 -130662 -27042 40524 -24283 -31532 -70186 -58833 -41808 -8200 -143964 -263091 -248288
26257 -248288 -141888 26040 122079 115401 174690 184222 125486 122725 170060 179714 134018 58031
26245 58031 -156279 -227129 -194542 -79187 -9172 11215 -30891 -96135 -130243 -36115 -26536
26234 -26536 -103717 -287934 -252000 -158892 -86699 42521 122996 26237 -121823 -23364 138076
26223 138076 150723 89520 104240 77383 70736 95496 84362 87525 217529 141998 8865
26212 8865 17502 84032 85530 25819 92931 193000 265240 282238 143098 99873 10797 9659
26200 9659 -106205 -185459 -169407 436 129620 95113 74276 -4765 84575 184290 242484
26189 242484 137246 62862 11826 -7819 81152 101680 -5288 47702 95520 232510 230638
26178 230638 119543 -63334 -64150 -38454 -51840 -37453 21297 -51708 1929 70485 143166
26167 143166 -1183 -96783 -78842 -166556 -188779 -141831 -78304 90070 86303 59408 48581
26156 48581 43603 44664 98612 71135 -29005 130706 268565 233214 326825 168595 8996
26145 8996 -35515 11646 43540 -151499 -92973 5082 -32071 10817 137173 95588 -46721
26134 -46721 -193188 -232630 -306680 -114183 -51527 -164077 -108895 -74129 -50743 -124359 -89135
26123 -89135 -25057 122255 205046 75604 -16764 25229 74850 100686 60627 16448 53936
26112 53936 235623 190170 89550 110990 144519 78447 24419 -112768 -184287 -43588 73362
26101 73362 122522 10892 2257 15231 11040 -38620 -23929 -6085 34270 8339 237095 165539
26089 165539 169023 134308 83178 -22950 -73970 -60692 78728 80488 -41734 -89872 -49712
26078 -49712 -43948 -188442 -60864 -45916 -16784 3244 121435 70640 58142 3065 -51595
26067 -51595 -2335 240240 347442 218437 67976 -477 -10109 174248 163189 1035 -13527
26056 -13527 -4780 36916 63569 16711 10193 165718 249872 205579 37211 -27914 -112054 39036
26044 39036 104715 -85690 -151853 -89385 -49582 -68046 -110473 -101578 43190 134614 163430
26033 163430 68393 -14422 95416 89270 44234 -3889 62934 173147 139816 145541 167814
26022 167814 121386 167208 194399 45438 -110616 -67815 9072 128439 -25877 -176104
26012 -176104 -142447 -60391 -8392 14314 -92898 -220213 -138380 -30608 73165 103619 93538
26001 93538 94995 66898 98362 -90271 -293428 -235238 -26356 187245 266493 256148 216800
25990 216800 245617 23738 -61565 -58619 -28044 52886 89694 46573 -25310 -176599 -175638 -89603
25978 -89603 -82107 -95212 -66422 -72053 49287 118340 25779 40178 2041 67530 205612 174961
25966 174961 71261 -3031 17844 99202 32497 -121217 -160046 -184821 -122043 -103699 -50043
25955 -50043 11902 803 39488 -33698 4636 24124 87433 219303 185742 120148 196703
25944 196703 147119 165777 147886 19615 -28040 -12978 149727 170454 188718 104029 84964
25933 84964 -20213 -61325 62302 37555 -45675 -65431 -74041 -53453 52606 61234 -11026
25922 -11026 -56000 10964 78807 165962 155639 201197 222767 129941 11313 68258 133660
25911 133660 144308 166001 223778 297811 301239 247672 146883 6967 -186087 -306106 -285375
25900 -285375 -205436 -103004 29399 -30752 -111063 -76879 2347 -46331 39456 118236 52811
25889 52811 -72802 -134459 -154260 -179189 -105866 -65711 -144557 -105334 -50186 7328 -138239
25878 -138239 -205458 -41185 -15806 -58617 19258 63362 45210 28449 -2066 -58013 5426
25867 5426 2936 37924 54577 -8127 -147602 -171583 -173023 -128171 45460 -68224 -180363
25856 -180363 -150282 -103162 -87080 -37315 -47195 60995 3974 -115262 -79552 -107381 -178517
25845 -178517 -204495 -136774 42592 99864 116670 139863 201767 149691 34848 -26843 -11583
25834 -11583 44318 202427 124904 -29919 25392 105593 136165 30745 12575 4912 8515
25823 8515 67784 79966 80914 121050 50847 161219 117858 24275 7128 15047 94319 25052
25811 25052 83490 287674 286184 227681 320292 273401 65973 -76283 -54919 79223 159100
25800 159100 205466 222442 101576 -95447 -131317 -207859 -136559 -110838 -181454 -88485 -1293
25789 -1293 -26198 -167903 -171339 -53326 119722 151192 203961 173703 127045 56544 -101633
25778 -101633 -110792 -2042 39199 -141017 -96510 -120091 -34258 34168 87493 62331 -53642
25767 -53642 -148197 -171445 -78547 97286 53327 201161 109243 83516 71506 -16222 74710
25756 74710 165690 156508 4381 -38712 -57824 -22451 2572 -62758 -70172 -1515 110723 -16197
25744 -16197 -148133 -63369 -57826 -74196 -17281 143438 236496 248925 173304 187014 192098 210387
25732 210387 152568 -19587 -80599 -10490 82331 51727 99350 129877 80389 85124 112018
25721 112018 95840 212044 217662 105646 51176 -50354 -12777 190636 197379 133093 94908
25710 94908 34676 -64349 -95343 -60166 -56121 -68127 -68283 -35689 38996 13351 -69173 -118515
25698 -118515 -39306 -69904 -142495 -215946 -209321 -72667 -33727 -64612 -58009 119292 65913
25687 65913 98 -65258 -68025 15469 -24540 -64890 -121503 9846 70567 120650 146937 181233
25675 181233 139662 -30345 -14915 142183 175235 249721 378160 368893 249990 150642 162449
25664 162449 130661 115217 48221 73939 69336 -5169 -64003 -70466 -4413 88324 -6236 -29716
25652 -29716 -768 79194 193301 333279 358061 185433 136788 257028 164608 21641 -14778
25641 -14778 -42447 -11444 20192 34910 8551 -10208 -19765 -72597 -56319 -10696 13714 -164793
25629 -164793 -142897 -68497 9020 2298 -14612 -56956 -22148 -63067 -188736 -205556 -65269
25618 -65269 63753 16992 11449 4732 74250 13987 -35132 -52485 47978 55107 80406 -13496
25606 -13496 -128511 -10199 -24263 27775 11236 -111225 -36695 159110 89384 139098 71350
25595 71350 -42196 -18364 3869 72484 -37310 -63337 -7757 84418 97242 20615 -197591
25584 -197591 -267124 -333781 -145202 48286 68877 52842 54042 3250 -34546 67076 165089
25573 165089 138190 46841 -9489 -55280 42138 46730 -30698 108935 170513 71572 74821 95169
25561 95169 61433 12732 -118477 -81991 4687 -86390 -122917 -86493 77265 260298 206396
25550 206396 127359 19913 45325 3930 29065 -8740 -21686 -14463 -64588 -4112 31922
25539 31922 -62578 68594 143267 179515 131370 -35516 -71910 97309 171108 101933 -89383
25528 -89383 -170941 -109660 -133437 -181622 -158887 -60238 80313 -8200 5695 8886 -109243
25517 -109243 -172047 -216327 -111879 19563 152536 93297 87562 -35134 -110426 15357 76167
25506 76167 1720 -3193 69547 88850 92610 121563 83082 76919 8768 3540 55582 84200
25494 84200 168722 158773 66584 49944 49244 11924 -48822 -32713 -70876 -173771 -118173 2625
25482 2625 117659 176528 210909 159814 171013 139572 107166 134838 60991 -1827 55967 14959
25470 14959 -9282 -45095 -134487 -148052 -200345 -226322 -142706 -40088 -11800 -137110 -260181
25459 -260181 -246018 -174024 -152776 33030 171558 110878 -24560 -203425 -321690 -277554
25449 -277554 -88472 -35123 -90941 -146167 -124378 -103003 -189332 -125649 62474 239172 125911
25438 125911 -15572 -76501 -258163 -119718 -37079 85877 140337 -74934 -167887 -167122 -190367
25427 -190367 -205911 -170559 -114495 -29911 85887 82093 160877 91556 6649 98349 92055 -29322
25415 -29322 -24883 16641 89962 124002 122321 56201 106356 164364 252296 281804 216329 121120
25403 121120 136272 110487 -45266 -315449 -205686 -14231 38745 19647 35161 80924 57733
25392 57733 103581 120105 -134090 -223108 -158240 -139265 -181292 -191358 -134481 -152601 -34280
25381 -34280 11181 -24825 64318 96679 104791 34793 -16816 54764 -47668 30213 89859 4132
25369 4132 18360 -24907 -66516 13993 135096 96297 -2844 -15065 39342 2466 9877 76368
25357 76368 92409 15436 5597 44472 34509 131500 116569 109338 188610 123672 -77269 -55297
25345 -55297 -106853 -245228 -276995 -273066 -177778 -95659 60792 70552 34194 -26854 -46942 -47954
25333 -47954 -76149 -100959 -67720 -117779 -100999 -170893 -71323 -27339 -44110 69222 114321
25322 114321 108785 28242 -21780 -96930 -85640 -110919 -63892 -85071 -44837 94698 33900
25311 33900 93107 44081 -29115 -40097 -77453 -171487 -91188 85280 75199 62801 58549 21932
25299 21932 -51463 -33868 -31002 -151526 -156659 -250638 -266187 -111334 -2517 -39446 -74217
25288 -74217 6454 -76674 -37769 12856 -41674 -205760 -251257 -184503 -127262 -98951 -157826
25277 -157826 -58187 68980 92920 51152 16612 33718 46778 9572 -2513 42631 63722
25266 63722 -53526 -19987 -73569 -47416 87635 21570 -45357 25616 -40549 -44367 -86673
25255 -86673 -95140 -92732 -120144 -63948 -69520 -38311 -59422 -157627 -154388 -94391 85859 207910
25243 207910 168372 16365 85629 219548 263270 192585 194958 137938 127988 157983 190559
25232 190559 126524 119424 137203 117619 86024 92553 198722 181499 78889 69752 -1438 -50269
25220 -50269 -175366 -173327 -117826 -32255 -94383 -80195 -13422 73679 173428 117869 52698 144374
25208 144374 31356 -52835 -68296 -27441 116947 -3337 -22979 -18711 -72531 -22825 147583
25197 147583 239670 159259 207512 241692 119489 120822 207190 161911 85805 105457 144572
25186 144572 133764 144844 95415 8394 25747 4385 -29707 31772 -392 -4645 68586 159488
25174 159488 181583 84068 38409 178203 198360 176628 149825 149322 106701 -24170 69683
25163 69683 158326 16973 -47176 31144 39339 -55928 27200 48639 -59592 -267886 -224146
25152 -224146 -80894 -2414 34772 -21969 -76894 -76401 -132015 -132389 -31997 159859 104398 40939
25140 40939 85592 -43196 -185461 -222975 -203490 -120532 -200678 -190851 -178602 -155370 -200185
25129 -200185 -265480 -212028 -57501 -14753 -27296 1412 -21377 -30258 28542 146876 146491 54854
25117 54854 129061 153526 119529 96172 8958 -35502 15423 441 -68075 -53060 -29795 -16617
25105 -16617 -94511 -259207 -241540 10420 32678 -25382 -19903 49151 69884 47677 -55884
25094 -55884 -7834 30783 97943 66167 78669 97185 32699 58120 48837 68484 -3441 9053
25082 9053 78312 3122 -54374 6659 -62240 -188602 -212131 134215 208846 96201 25545
25071 25545 -26331 62016 141582 117588 48502 31990 69196 86248 144056 143953 240217 199609
25059 199609 202307 70310 -39304 138620 134352 -1575 -79707 -119365 -118374 -16218 -29491
25048 -29491 86394 143759 91122 100625 14442 -76647 -196386 -156188 61035 50314 33094
25037 33094 51256 114065 120499 262022 237603 47340 5577 68518 73122 105659 47384 -54728
25025 -54728 -89435 -123247 -74570 -72072 -113859 -146856 -202069 -111409 -153752 -112219 3445 139676
25013 139676 147329 25436 -27659 -30423 -148320 -218702 -138261 -80820 -83221 -43807 23822 -130827
25001 -130827 -63273 -129740 -122437 -110947 31203 73336 156890 7026 -122889 -110826 -22755
24990 -22755 -150797 -178862 -116996 -142981 -35125 -16755 -25523 37339 10996 9460 10196 -802
24978 -802 10580 71713 122439 163433 223368 313233 292304 165427 119449 128245 33760 15261
24966 15261 81763 221860 238393 244050 80424 -78736 -121708 -218975 -212580 -125573 92344
24955 92344 192489 202017 137365 208874 264596 133778 78183 235933 303074 149313 13173
24944 13173 -63548 -209740 -189693 -25880 -59262 -71153 8589 54926 43735 18895 16790
24933 16790 115434 175397 193611 123680 32064 18303 24646 94369 161298 218535 193456 171227
24921 171227 88870 101842 -739 -74622 -37665 -49989 -36569 -38630 140899 143381 61210
24910 61210 149388 104359 25589 85628 -60956 -147345 -158742 -98787 40439 37149 -48683
24899 -48683 -99638 -129081 -10728 118975 38877 68077 88800 -73804 -114663 -77547 103704
24888 103704 127006 47356 86188 120359 143385 76037 67634 49611 35636 72279 -34399
24877 -34399 -105769 -82616 14797 58672 42702 8468 -126868 -99457 -148630 -284504 -352911
24866 -352911 -217253 -150510 -106933 -86236 -113490 -86250 -26784 32726 88987 64295 46626
24855 46626 194865 392814 283036 94127 -37339 -79617 -216523 -274874 -219006 -212713 -56862
24844 -56862 82852 118490 -12961 -8600 54130 36556 -7749 -2590 28016 45669 -90807
24833 -90807 -155189 -82303 -124342 -233475 -136960 -3797 60802 110218 81742 94780 41108
24822 41108 -70658 -137652 -99799 -34349 97065 54563 -82422 -44153 39992 -368 -25164
24811 -25164 78920 206589 336527 288027 207758 254079 99098 -35841 28801 165383
24801 165383 243673 227528 138320 138548 124301 129039 19936 -64011 -8611 108742 20325 -36636
24789 -36636 -7718 39146 60013 129400 166415 161294 137288 -31271 -133285 -175321 -246817
24778 -246817 -214429 -147726 -174086 -199496 -140469 -182706 -126555 -50098 -10798 7861 65807
24767 65807 180242 127095 -816 24284 126014 117726 -29625 16532 43159 24385 10831
24756 10831 91067 45602 -37243 -22617 -24293 86753 45072 40118 80496 104226 106779 32770
24744 32770 39814 61406 -6094 35176 44952 -74218 -188155 -133068 37018 180838 242244
24733 242244 143490 22517 62744 215165 135872 79300 115657 148547 -9982 -92312 3347
24722 3347 58077 -55934 -156354 -66333 68778 97376 109494 105399 100682 133622 -61096
24711 -61096 -108471 95934 236128 210500 175636 255518 296815 124683 68569 119844 226377
24700 226377 280335 235084 169769 74874 57765 68064 -113157 -61372 27438 6830 -106976
24689 -106976 -177058 -179770 -148052 -133447 -105063 15842 85294 96721 25322 -89189 16842
24678 16842 247501 173011 92434 -4704 -4297 -26401 33918 110615 127734 180379 129615 114424
24666 114424 101157 -105025 -268648 -194762 -146663 -47780 -73846 -42222 32760 -17567 -53069
24655 -53069 65130 75398 146763 246101 334804 408891 458730 551143 568180 338595 56409
24644 56409 18679 102923 85928 201629 211247 136949 51542 82105 -74922 -174015 -61408
24633 -61408 -9088 131512 156361 59279 -22503 -36171 -48540 93079 105572 136079 181983
24622 181983 130990 41305 82164 191135 177030 102368 66896 83819 167314 75310 -31462
24611 -31462 -2251 -97578 -48294 95116 183062 37995 6176 81774 83816 36470 37687 15595
24599 15595 -129015 -171950 -59497 -85283 -20401 143257 179843 208276 59144 54401 115871
24588 115871 14120 -14755 -6842 36651 161071 181106 193606 184583 116799 108631 160344 20611
24576 20611 -25433 -151561 -298159 -316739 -176770 -62958 -36608 -1519 15712 64861 12149
24565 12149 -15998 38986 -40762 -22575 50395 52676 106790 139470 84262 42609 83174 21432
24553 21432 -96351 -30398 -63316 -176503 -277015 -262886 -148059 -130617 -144806 -179910 -163707
24542 -163707 -152931 5451 93354 129500 99386 131321 155427 12422 -67596 876 114
24531 114 -4858 61878 67590 49795 -66105 -112389 -79599 -82795 -75453 -116275 -136799 -41176 -96763
24518 -96763 -221981 -115666 96422 145930 207332 189414 86443 62141 -45295 -119530 -218381
24507 -218381 -152814 35338 -14490 -11457 -46698 14385 212482 189881 115390 -31750 -113612
24496 -113612 -70023 -44391 39196 149204 116640 239737 305418 305446 297980 325542 279740 103858
24484 103858 -115544 -14078 138698 74891 92126 132848 206433 91454 -36209 -29275 40011
24473 40011 -23750 -12745 75379 87422 71165 -4182 -72930 -59266 -29774 -45165 32951 164056
24461 164056 105711 65392 204851 255020 196801 37382 -25105 -131665 -144196 -106118 -147456
24450 -147456 -172777 -145347 35605 161840 32631 72052 72155 43156 150217 253008 197283
24439 197283 52450 -25868 -24557 -47577 -273225 -248634 -143473 60021 176937 78500 -38069
24428 -38069 -59282 -22557 -101061 -89999 -142486 -118591 -130696 -213273 -129513 112184 63862
24417 63862 -161 -55526 -46845 -47035 -74872 -27860 20485 79293 188209 184886 106420 -57893
24405 -57893 -99351 -116527 -112105 -193112 -206355 -142050 -164433 -198726 -155415 -138794 -152436 -135219
24393 -135219 -66065 -111763 27274 76744 133924 128765 75751 -26823 17796 61875 140119
24382 140119 46115 -166382 -245424 -92156 -76287 -60648 -95153 5773 -19420 -36900 -484
24371 -484 -114410 -105220 -42825 -81768 -141964 -41062 -38876 3285 10804 37249 136737 51609
24359 51609 3191 -81042 -75645 -33138 -200283 -170016 -161921 -137401 -23031 -3723 -48154 26578
24347 26578 28243 7550 -65308 -24243 -56132 32526 53646 3181 -69124 -45393 -33995 38580
24335 38580 243589 283335 92618 530 -85928 -179492 -137904 -200827 -141903 -6767 58542
24324 58542 93228 122032 78241 19036 -43865 -42244 76016 95701 111970 34930 -53610 67053
24312 67053 180849 274359 361703 376093 266786 33818 -132818 -249759 -311742 -244607 -209869
24301 -209869 -145798 -80621 -22521 -79341 -110373 -203366 -208911 -174195 -90302 -132090 -260399
24290 -260399 -252294 -124110 21685 8819 52705 155681 121325 31784 -11749 -62168 142800
24279 142800 37705 -25193 161718 197838 114067 -27606 197 -75089 -79088 68953 42291
24268 42291 75447 100112 38212 -59514 -133665 -125710 -19171 97020 207682 108510 159032
24257 159032 60001 -116646 6569 29801 -36990 -58323 -94335 -96414 -3803 127604 169341
24246 169341 86841 35951 33742 48925 48613 1211 65121 126426 -42887 -251632 -208168 -50472
24234 -50472 34348 -30280 15973 -17403 -5022 -62094 -34691 130219 174638 219103 164473
24223 164473 62052 42858 124238 137628 198903 219047 244862 298818 195600 -2218 -105178
24212 -105178 3784 226962 118883 8143 -24536 -74418 6235 -68264 57508 123772
24202 123772 94917 171719 108155 67349 81926 129521 191145 57955 41297 72543 167709
24191 167709 88769 69045 137840 86666 -20151 68522 -26537 -90154 -31664 -24099 -37945
24180 -37945 -191523 -237392 -262210 -197492 -171508 -126668 -161249 -113470 -112741 -172498 -110571 -28051
24168 -28051 -34399 -38876 5489 105809 126662 118378 141562 183031 69727 -36916 -102127 -57478
24156 -57478 -143838 -122282 -94579 -209831 -136854 46495 205874 196445 212742 357133 335041
24145 335041 136024 -1963 87391 190979 22830 -35271 -109244 -102985 -196507 -293219 -328644
24134 -328644 -139975 -49602 19211 -90273 -227856 -69630 47300 62765 76227 40132
24124 40132 7104 33486 -35530 -55706 -159571 -268465 -178686 -182985 -54136 224185 228108
24113 228108 251915 83199 -13629 -74359 -182883 -193339 27919 156814 89317 88821 149551
24102 149551 187152 245017 198407 159252 -8701 -14275 -36805 -58907 66109 73745 79511 -110899
24090 -110899 -176903 29135 20957 -130663 -92487 -29284 -126225 -81588 15259 41805 -34338
24079 -34338 -111635 -24777 75247 50045 -17815 -41338 5780 57986 50178 7994 34058 107486
24067 107486 100179 63124 92433 134446 187284 186806 51058 18591 38110 21401 52631 42094
24055 42094 61929 -60392 -35888 -79780 -193587 -170355 -66021 -11744 -3193 30904 17816
24044 17816 -31224 -36460 -108962 -177998 -95157 56360 41473 -46685 -30744 -99246 -187455 -181198
24032 -181198 -216604 -180313 -117107 -185624 -269205 -223755 -110366 -63690 -80232 39091 53299
24021 53299 22030 57397 7954 -49247 -105754 -167168 -238119 -171620 -100433 129278 237092
24010 237092 322697 213810 116065 -3758 -133481 -120107 -62129 -79089 -118508 -89425 58691
23999 58691 216368 240802 96979 53058 71250 113947 8983 13076 -8044 -82663 -123938
23988 -123938 -97103 -36646 3119 -15478 -39209 76119 194963 153619 64733 -70482 -108047
23977 -108047 -49931 138297 190660 253713 214680 91032 -34843 -75146 -89687 -74528 -14887
23966 -14887 101378 133304 226141 267489 193907 259748 70312 -90044 -118509 -274881 -283706
23955 -283706 -241936 -162472 -222741 -220754 -158302 -27881 137502 126681 142453 27295 -114164
23944 -114164 -214693 -203180 -263485 -150083 -88441 -156084 -191863 -167640 -117286 -111517 -114879
23933 -114879 34295 1114 -42809 33150 -42807 -113473 -97307 -115620 -166315 -102583 -59192
23922 -59192 30466 8922 -70787 -257261 -395199 -378098 -217922 -10560 156497 99082 179089
23911 179089 148899 988 29067 38141 33624 82727 147003 125573 68421 109442 135853 122075
23899 122075 -34184 -89752 -283242 -288452 -266973 -236945 -135422 27271 303839 334176 303263
23888 303263 254224 98338 -164439 -192357 -51672 109732 145878 65709 -18117 -85509 2161
23877 2161 148043 155135 113653 186828 157650 162322 126654 76149 -41994 -83430 -114969 -27136
23865 -27136 159894 147201 9870 -96864 -196861 -208389 -147574 13651 75438 42924 -8747
23854 -8747 -45313 -60084 23617 8841 -68885 -151135 -106202 38428 99548 35113 23176 26728
23842 26728 -124868 -187270 -176779 -190548 -205668 -122264 53995 163068 72574 -2935 27793
23831 27793 -123708 -227559 -159825 -118506 -32940 73227 -21323 -215765 -261923 -18558 162247
23820 162247 49857 -22035 -30985 -77319 3197 52807 -32232 -82542 -68353 60555 56197
23809 56197 107782 169134 77978 54340 -28876 30972 55647 57734 95759 242080 135368
23798 135368 36492 11945 -96085 -44036 -28304 35245 131381 -65405 19387 41050 -17156
23787 -17156 -27723 -20639 -48487 -30894 117688 260055 234154 115817 97361 20262 57051
23776 57051 3867 -160118 -136407 -180832 -234681 -143757 -31470 92585 53125 45441 77023
23765 77023 46698 17052 109755 30677 -115509 -180973 -177219 7800 70368 135573 131036 41586
23753 41586 -50414 70932 228055 100677 71284 116861 68636 -57663 -139217 -129128 -51995
23742 -51995 -154076 -228596 -246716 -145881 -110796 -147761 -64978 -46880 -54789 -114058 35201
23731 35201 9584 -143594 -100621 -75437 -86467 -143410 -76393 2733 93364 58596 39013
23720 39013 140202 213269 81760 -49681 -95349 -97935 -75844 -126678 -216280 -238482 -288674
23709 -288674 -158690 -108830 87504 199993 130867 78731 22797 -143993 -141520 22158 -20376
23698 -20376 -188217 -171676 -117977 25456 199322 184094 106900 60954 -44529 -89974 -61595
23687 -61595 36978 178168 132914 121556 172127 234172 199978 98157 55002 -18040 -56365
23676 -56365 6107 -32642 -102928 -62603 48473 50662 207678 191991 118920 73911 -60632
23665 -60632 -48530 102665 189295 89409 -32750 -74592 15934 -3694 -163107 -63629 44533
23654 44533 -110712 -26844 97586 159800 103694 90228 129031 131255 180326 288832 247751
23643 247751 193145 118927 117850 38955 59424 36782 -1552 38468 8560 -135034 -2060
23632 -2060 198994 227503 -18446 -181184 -39423 13485 19423 93519 46401 97692 114035
23621 114035 76836 136611 249645 194701 160039 134897 226996 148324 -4755 -41677 9735
23610 9735 40715 62291 18365 52284 98518 7592 -89993 -151813 -41564 45803 91031 78973
23598 78973 16055 -11675 13067 -4615 -72934 -107987 -192241 -240823 -154792 -64008 52400
23587 52400 110188 195431 150317 8821 -11502 3811 130808 80155 64497 107395 110169
23576 110169 -21893 -204803 -162855 -94826 -42985 89346 81346 38040 -21128 9232 105113
23565 105113 102057 39050 -91043 -36677 63001 82047 -83126 -267275 -224203 -178527 -157982
23554 -157982 -162440 -47402 54898 77259 41134 -2630 -49190 118437 163276 124622 50586
23543 50586 207535 273285 220484 176166 65928 28826 -59719 -81554 76549 87756 -23616
23532 -23616 24647 -74224 -81691 -59608 -51149 -57868 16584 22383 -49329 -91766 -55620 -15429
23520 -15429 -31974 -34269 72668 31200 -28681 13211 -21648 36577 -25112 -11532 44040 97816
23508 97816 38071 89402 48345 68311 -45970 -188660 -210371 -144876 -160892 -152130 -174410
23497 -174410 -89488 -79900 -92843 -96429 -104283 -140312 19490 83889 -120539 -141771 -47265 104373
23485 104373 130254 135655 76411 166178 100445 -56088 111838 139562 99664 56477 -14792
23474 -14792 3546 2136 -68668 -178092 -150423 53568 -27022 -37645 5035 75799 29756
23463 29756 -57065 -39029 54949 62113 -41453 -16177 -7985 -18654 61947 134576 166099 111612
23451 111612 117945 209094 296404 294989 209097 154835 281207 324951 227673 197614 157784 106351
23439 106351 62253 169578 218365 151183 141701 219845 124632 20567 41501 -86240 -180945
23428 -180945 -234007 -175857 -248239 -164627 -99653 -116095 -47551 49327 102604 107046 25744 -50209
23416 -50209 70271 165262 156288 118731 125249 162228 109789 -20815 -200518 -199532 -93653 -36301
23404 -36301 24405 164318 184331 49815 8782 -142226 -101430 240322 251080 -1350 -88428
23393 -88428 -182562 -104886 -55901 142872 23813 -38901 80635 84469 12754 -36720 -30193
23382 -30193 -19913 65417 79056 -16487 24707 46381 100347 144383 -57271 -198932 -141743
23371 -141743 -79143 -39219 -7799 50099 36853 11260 -34437 142941 196005 278666 265082
23360 265082 183626 -59094 -157043 -191456 -173830 -185594 -144339 -20962 39999 109100 100407
23349 100407 -1670 128823 75327 112977 103256 29871 -104989 -247885 -244460 -149400 -101687
23338 -101687 -269355 -256365 -237678 -208798 -129310 -102997 -197104 -251107 -112873 -113696 -179679
23327 -179679 -223672 -108379 -164519 -143456 -124124 -205026 -234765 -181575 -179654 -196783 -77564
23316 -77564 -88142 -107770 -117665 76374 119016 28778 -51965 -39805 16270 -32544 -89106 41525
23304 41525 -59673 -110808 -93261 -55623 -13562 32569 51690 -25590 87357 152307 56570
23293 56570 -43974 -59528 -48667 -33790 113420 63174 11408 -218 -23732 -100851 -111797
23282 -111797 10389 50557 1777 -2912 83133 54464 16580 -65047 26313 10780 47629
23271 47629 115718 129220 185017 106854 -68056 -209660 -232658 -78098 9323 14977 96166
23260 96166 37418 95514 36270 -64279 14609 29739 27170 -47373 -57331 -36652 -43555 41716
23248 41716 -35875 32403 41393 55505 92919 23030 79853 -14252 -42458 35499 59075 -93690
23236 -93690 -290638 -261488 -177093 -153015 -208646 -94325 6081 -1033 74515 207444 79612
23225 79612 -86798 -102079 -110723 47647 213214 317161 203399 -15356 -153646 -131461
23215 -131461 5843 101974 57780 126908 254630 136836 76297 73166 176872 235325 103047
23204 103047 83892 199147 44899 28952 13453 52378 109183 54593 100342 80363 -132084
23193 -132084 -201569 -188808 -196060 -162893 24586 54747 68203 166657 170718 127565 95235 62273
23181 62273 13754 7312 -142880 -173060 -200801 -269548 -282058 -128954 -42678 28842 13437
23170 13437 -70407 -191057 -194723 -71745 88991 231600 183633 31834 -223111 -231316 -310851
23159 -310851 -320880 -175546 -101700 -91700 -146272 -272518 -295578 -195487 -115467 -48413 -45959
23148 -45959 99629 300908 212038 -3059 22512 166497 143874 138942 -69851 -144479 -70873
23137 -70873 17425 20910 10971 16467 113515 258521 63194 -134986 -206987 -247015 -316443 -391108
23125 -391108 -325852 -193142 -135775 -259548 -310344 -202199 -93145 -35941 -20699 28664 31335
23114 31335 7466 -8888 -82345 -155710 -121599 -22483 80995 123395 101612 -37824 -58983
23103 -58983 -2946 33572 -5187 -64998 -96794 -211000 -168357 -70147 -52225 -146456 -70587
23092 -70587 -148467 -223832 -79815 -28616 4801 93466 157374 233830 209042 131511 -19414
23081 -19414 -161640 -151503 26409 158462 39865 2730 188246 181432 21489 -44048 -106444
23070 -106444 -207289 -322750 -379289 -372878 -368613 -186002 -98536 -117328 -87208 -128990 -65570
23059 -65570 3199 61696 124683 181931 92618 -35474 -29397 127819 82689 101847 -13626
23048 -13626 -21480 61613 111227 -77180 -80189 -118404 -117247 -108328 -7398 -43947 21594 69693
23036 69693 27575 -200789 -291116 -206316 -245641 -163064 -262641 -333955 -327817 -205608 -107592
23025 -107592 -71081 -16395 -149361 -220404 -213979 -150114 -98938 -112010 -227080 -203463 -116301
23014 -116301 -111622 -222351 -250824 -158376 -51249 -88865 -210935 -189361 -145398 34785 164719
23003 164719 197046 -3317 -223280 -253604 -89409 61861 157035 143595 51153 103665 140732
22992 140732 19782 -114001 -167668 -50151 -44224 -126069 -159104 -166001 -90634 -79497 -115801
22981 -115801 -17388 59295 26762 -53033 -113754 -80005 23702 72044 22690 -76259 -119012
22970 -119012 98924 108724 10557 -50901 -42456 85512 189862 116140 22485 -92854 -151965
22959 -151965 -34166 -35289 -75970 8807 61485 -45600 -49145 -137910 -222821 -122355 -156178
22948 -156178 -228383 -243460 -156199 -54507 3285 80272 90055 67995 51946 93931 26051
22937 26051 24351 37638 26341 177998 256404 102417 13233 -101704 -213547 -164878 -113795
22926 -113795 -52278 5541 -107068 -69877 -66116 -33998 69737 141579 16661 -39466 16212
22915 16212 -13845 50135 26396 -75696 -55707 -84647 -77759 -50677 -67403 -124910 -31605 58735
22903 58735 35233 75525 22602 -80350 -99639 -57813 -39656 -95062 -165756 -78549 -30197
22892 -30197 -17725 -70959 -202879 -143109 -99486 -132152 -211352 -233072 -176948 -58521 81424
22881 81424 91131 67729 73213 67241 161050 109697 65184 -2604 -81016 19006 36597 -57371
22869 -57371 -114112 -30493 -36039 -160910 -278531 -172382 -21502 -94108 -162688 -102681 -44975
22858 -44975 67639 176672 269616 144962 107229 137685 149172 122213 -4948 -135325 -143286
22847 -143286 -79171 55252 -50824 -246794 -184189 -29972 -47727 -55171 9542 -93452 -271207
22836 -271207 -298462 -276952 -256837 -183149 37197 102899 99536 104941 -38776 -148702 -188645
22825 -188645 -124761 -119657 -45161 26980 -85070 -111514 -131118 -117140 -70286 -122800 -35723
22814 -35723 51120 75977 -7345 -168329 -159169 -184132 -185378 -101051 69061 254570 196881
22803 196881 -18805 -87608 -82626 -52545 59468 134817 158947 104807 42312 55038 126772
22792 126772 101463 125580 26686 -131249 -281770 -363836 -314947 -295906 -204240 -145312 -186896
22781 -186896 -162258 -234749 -347765 -215651 -118039 -16303 -12541 -22856 -84015 -102531 59595
22770 59595 59875 -182343 -167888 -30032 -87119 -108992 -114579 -142903 -130468 -185699 -161565 -127557
22758 -127557 -156501 -63664 6961 -128689 -141349 -113211 -150327 -110381 -93787 65842 -8274
22747 -8274 -142239 -113388 -57336 42466 95499 25463 -77156 -111430 -81468 -189428 -117052
22736 -117052 -92909 -129514 -113639 -14178 -24556 -40384 7265 -39618 -15571 -59909 -106671
22725 -106671 -23087 -45745 -116936 -115320 -134307 -143424 -188750 -102034 -13176 108379 97401 31773
22713 31773 -11599 43114 102630 62738 -71642 -78076 -21438 -20805 -37902 -27422 -18350 -124415
22701 -124415 -306306 -264105 -195958 -132954 -72492 -273612 -254386 -206480 -149712 -183888 -159522
22690 -159522 -98708 101939 255840 259033 123321 110407 92776 84193 29222 -50770 29878
22679 29878 119966 9834 -178253 -167634 -57348 37912 3883 -108983 -136841 -147209 -170620
22668 -170620 -192686 -128568 32219 23439 -103010 -87025 -4423 -25031 -90483 -107987 -114932
22657 -114932 -131568 -170078 -173740 -34117 -118319 -146090 -163054 -288494 -294478 -69723 34691
22646 34691 69977 71560 204661 336326 342093 151000 69694 1332 -7080 -24677 18832 176575
22634 176575 142123 -36238 -62186 -88709 -137806 -82063 -33504 -106907 -175197 -63234 8774
22623 8774 -85882 -147124 -146979 -69324 -34610 -53887 -90097 -191431 -92604 43277 136837 95288
22611 95288 -54159 -50726 120102 51660 12323 130579 108708 156705 122467 54811 -51113
22600 -51113 9595 68087 174849 29181 50302 132630 62763 -117341 -231396 -252641 -28205
22589 -28205 207989 176171 160716 85078 -9097 18259 58148 169662 80388 98973 21752
22578 21752 -58893 -162066 -221273 -168878 -134396 -26855 -98223 -104036 -103718 -113784 -120250 -94178
22566 -94178 -116759 -119483 -68374 -55894 -32930 88397 87854 78750 163830 238417 118105 89303
22554 89303 82283 23481 58266 168555 168310 135226 -38187 -196337 -116232 -39939 -15086 -40536
22542 -40536 -51690 -101117 -135772 -187915 -300336 -232001 -129073 -37978 -119338 -119030 -46837 44574
22530 44574 109721 64888 -54771 -2453 -23053 -133605 -216263 -113499 -32534 -7161 68454
22519 68454 181181 122499 56052 72798 7648 42108 70653 35911 -71220 -32323 -29910
22508 -29910 -114082 -183537 -270584 -152560 -138732 -152536 -87766 -30196 21193 -16131 -121298
22497 -121298 -146251 -84212 -7860 -69449 -179356 -256038 -192542 -123777 -87614 -21901 30040
22486 30040 -48428 -26283 -113297 -218020 -300855 -347535 -293314 -243409 -355966 -250906 -119292
22475 -119292 -194752 -205470 -203243 -303759 -223637 -154428 -76178 -316 60273 59177 30579 -80829
22463 -80829 -30944 -1640 6881 71737 -13206 -61521 -175151 -150432 -158091 -47449 -201603
22452 -201603 -281043 -103513 44754 113067 127453 66799 77190 82423 101733 93873 35340
22441 35340 -27548 -37766 2872 61141 25704 62674 79301 90419 103793 67471 -148509
22430 -148509 -128960 -140673 -52219 151992 263114 279077 256641 198966 84285 4476 -97452
22419 -97452 -56215 -149009 -95613 36824 -25203 -113588 -87087 -100795 -104342 -80993 -34896 -173387
22407 -173387 -46920 56993 161888 208716 148795 102603 88176 78507 -52656 -104170 -126312
22396 -126312 -60861 -12358 22202 -35341 -74968 -1402 -21822 -19064 -125453 -113338 -82854
22385 -82854 -25739 8935 -106150 -138808 57611 264497 278971 127603 -29255 -89007 -30496
22374 -30496 46945 123727 40369 -82042 -164431 -160024 -28587 -88961 -244255 -122177 4414
22363 4414 60980 37404 -43999 -171835 -157801 -8910 -54477 -82448 -28524 42841 -37406
22352 -37406 -101500 -147102 -116076 -37611 4875 115322 31416 118067 251097 201749 162913
22341 162913 82252 -561 -12555 -9247 -84411 -172633 -92493 50623 19166 -127511 -40834
22330 -40834 119928 210765 -56486 -122781 -60750 -21849 11960 120753 248408 166066 35420
22319 35420 -39240 -113689 -149695 -79944 9555 -127127 -164254 -84546 2642 -59841 -133188
22308 -133188 -86003 -97349 -76035 -73933 -59849 6747 109570 85959 -38098 -62736 -110389
22297 -110389 -68898 43371 77281 -42559 9392 -27543 -53244 -6945 -63307 -73704 -13422
22286 -13422 59748 91255 85642 57063 -41835 53829 55463 60045 33077 -30164 -56124 -58510
22274 -58510 -70299 -38362 -15674 -85869 -111502 -210122 -274523 -305482 -255098 -135026 10004
22263 10004 46292 11015 190396 198258 188474 77710 52430 165291 216998 139313 3297
22252 3297 -118357 -143532 -134789 -41675 67486 -38906 -136938 -107140 -115961 -120948 -130491 -76514
22240 -76514 -31169 -3624 -17287 -138684 -105238 -60614 -58743 -78140 -10897 79426 165831 131707
22228 131707 181355 207196 -46695 -115206 -142979 -127293 -277313 -209167 -107237 -54653 -162313
22217 -162313 -306866 -280333 -223720 -135306 -42758 -5796 -48125 -31550 37962 20652 59249
22206 59249 77132 -126310 -196847 -152036 -192418 -178471 -33112 128956 122425 -65919 -105682
22195 -105682 166664 246977 95481 99344 54741 -60462 -66621 44430 91218 -5887 -113360
22184 -113360 -135658 -114691 -208525 -169057 -15910 54220 -31769 -94464 -74008 -17511 5638
22173 5638 -151581 -198789 -155020 -64585 -39753 -106135 -314358 -369256 -298791 -213151 -168566
22162 -168566 -36844 -117894 -186939 -134031 -94716 16445 142547 136222 43881 39241 49603
22151 49603 -104042 -169699 -205332 -92022 -33010 -7260 57236 27155 53380 73102 -36641
22140 -36641 -80110 -248135 -362660 -294235 -229288 -214423 -68100 89592 151270 16740 6032
22129 6032 86446 148385 81267 96964 5386 -39591 -65817 9416 77021 133184 147906 134445
22117 134445 69525 62865 79868 -37267 -51679 -4724 9904 -102143 15890 91890 5351
22106 5351 37544 122324 199090 143992 43417 -57063 -102818 -117480 -56541 -79147 -25158
22095 -25158 -97883 -71708 41367 79808 -26024 -55 -82800 -130658 -227209 -260477 -205199
22084 -205199 -164645 -213639 -115111 -109596 -65958 32292 33113 131999 293835 201204 180343 133066
22072 133066 6282 -49810 -13093 93811 224549 297946 126115 18489 20860 -15637 22152
22061 22152 -7871 11953 125077 120033 146543 136380 111907 -89741 -290513 -60597 -48561
22050 -48561 -160241 -193429 -203272 -132707 -146243 -52953 22744 37391 58388 48731 138370 63004
22038 63004 56511 -78514 -206060 -220395 -84479 4488 29568 63135 33744 -9563 37828
22027 37828 3921 4984 27104 34099 -36704 -17545 14237 -68879 -73475 -105673 -203929 -108896
22015 -108896 -129938 -375812 -333751 -263602 -189026 -112726 -89226 -65955 17179 44829 49630
22004 49630 11912 -48463 -76897 -45852 -11465 30623 73081 33539 41074 74496 28037 43787
21992 43787 -17580 -51647 -22682 -93952 -269431 -435944 -349582 -216639 -263939 -133746 -18939
21981 -18939 72813 75428 5785 -7113 -9152 -73391 -107672 -143273 -199546 -167280 -68061 71007
21969 71007 88892 89632 122155 69526 -5411 -85638 -15312 71378 -51870 -115508 -94038 11430
21957 11430 155972 70353 65998 122375 98855 170165 131886 48618 9865 -57217 -11851 34000
21945 34000 7639 -136906 -62840 37077 12587 -17613 -87797 2241 80725 167438 210723
21934 210723 55392 -53773 -57971 -55024 22026 117832 75965 -2404 12346 -1862 27706
21923 27706 65942 -30029 -78158 -52805 -94812 -252265 -180544 -200407 -229321 -39470 -17157
21912 -17157 -147018 -273329 -364367 -247959 -138087 -61834 -101538 -157656 -248096 -178964 -199596
21901 -199596 -23867 8498 24790 52394 8408 -24478 104154 178808 129375 -34569 -53054
21890 -53054 -90968 -20211 40191 14176 45546 -113024 -32559 -2170 -93266 -27253 -73031
21879 -73031 -8723 18299 22748 40482 -43335 -105282 -88271 -177719 -167460 -192233 -141318 30198
21867 30198 6050 -21424 28706 -88752 -173275 -106846 55726 71282 23809 -62008 -173452
21856 -173452 -67634 -20802 76953 82153 40576 -31635 -86643 -115194 -66550 -7952 21703
21845 21703 -69085 -135039 -147637 -125824 -104599 87563 35479 -138823 -108455 6104 -42609
21834 -42609 -119259 -61481 -50395 14311 -20034 -16061 -6016 49018 76229 77366 8620 -87718
21822 -87718 -126036 24154 70244 46722 -5480 -76474 -172534 -170094 -162397 -235173 -226918 -53331
21810 -53331 42070 20523 -134834 -98252 -12300 -57923 -97826 -331 -23057 -107949 -74662
21799 -74662 -1215 31606 -6168 -15890 62068 -96901 -154586 -59020 -56845 26762 98942 111453
21787 111453 69522 81712 48578 -49043 -41734 -78471 -176184 -242079 -160847 -39593 -5906
21776 -5906 -39268 -151904 -180193 -160174 -63642 -196905 -146137 -110008 -225996 -261846 -346786
21765 -346786 -306835 -251049 -255406 -68062 3172 95917 44067 -12555 -5150 -52903 51377
21754 51377 201571 143008 166389 243893 95865 -106869 -303609 -308927 -367946 -335868 -330046
21743 -330046 -252334 -197683 -185224 -156079 -109929 33077 160985 7752 3068 31409 3126
21732 3126 42804 -5605 -58103 79866 111875 140809 104594 -1615 29153 53092 18400
21721 18400 -11916 -29636 -78935 11836 65275 44795 67196 167520 95357 -179742 -185788
21710 -185788 -253494 -160700 -10992 53955 70612 36424 65613 114961 36633 -17052 -71647
21699 -71647 -120723 -155062 -103346 -85267 -108521 134637 325045 312399 136346 79043 -9414
21688 -9414 -147154 -267122 -141867 64249 166229 84894 61269 6147 -29573 -101483 -126236
21677 -126236 -150416 -191416 -149851 -37894 -49300 -81294 -107142 -238318 -158759 -31644 149958
21666 149958 146922 30176 -135428 -67158 44702 89786 79563 -128223 -210576 -241610 -185283
21655 -185283 -43291 63034 134002 76613 32777 -56375 -73870 -81131 -74110 -138781 -71801
21644 -71801 80759 112392 19063 106242 198416 116204 -79874 -72812 -61072 -84000 -99758
21633 -99758 -148036 -97379 -12697 47078 -6757 79060 -3095 47502 49881 65240 197303 169407
21621 169407 130868 131837 9739 -60480 -196009 -170557 -163224 -168933 -232888 -247621 -224206 -238289
21609 -238289 -192928 -82929 90142 34020 -171487 -270097 -174091 -155715 -147753 -126499 -121245
21598 -121245 -180471 -89262 -29442 -165290 -157628 -79677 -87516 -23118 86005 70824 -26168
21587 -26168 50287 93704 55182 -191538 -216750 -155099 -23818 -11564 -123917 -202285 -164588
21576 -164588 -72621 -71655 -14837 11307 9372 -101797 -108304 -48800 10202 30861 -93830 -124096
21564 -124096 -117441 -77510 -92399 -75398 -106300 -148238 -167218 -251098 -241564 -103151 -25230 10631
21552 10631 -119692 -73503 4551 -47998 -77303 -159598 -54515 -33577 30207 51836 -32439
21541 -32439 -31388 17528 40569 -150139 -333603 -340996 -38681 172427 244870 256043 -391
21530 -391 -141850 -90497 -55099 -110612 -174522 -76651 31410 118189 59650 -25937 -106733 -201618
21518 -201618 -256986 -160962 -102682 -121490 -67679 7383 -15939 -112085 -207102 -177505 -132456
21507 -132456 -218362 -163962 -109139 5832 -77196 -131988 -86086 -36995 -41836 -62834 -121600
21496 -121600 -180697 -48359 66912 26253 -23039 -41717 -35367 -13956 -128103 -119215 -128462
21485 -128462 -115252 -228304 -352760 -355087 -226678 -48353 78553 150072 88779 72215 -10992
21474 -10992 -177174 -241156 -201636 -51858 -126226 -199641 -178458 -183167 -226725 -150923 -216615
21463 -216615 -261849 -160387 -4574 21569 -59953 -52122 1029 31736 -21759 -62192 -38998
21452 -38998 -80927 -110208 -85382 -55979 -26251 63497 87837 -62398 -63134 -69523 -85058 -158551
21440 -158551 -232759 -131539 -122572 -108008 -92126 8975 40024 68874 -22041 -2776 43021
21429 43021 -17369 -26228 -107707 -134560 -31410 20474 43866 70999 117210 127078 69341 -13545
21417 -13545 -10504 -53975 -92382 -136152 -49826 -58192 -125312 -251592 -186718 -96862 -121789 -85006
21405 -85006 -102701 -193129 -240465 -234627 -85351 -155642 -227111 -223029 -213723 -145620 -82762 18965
21393 18965 -44506 -26611 -80862 -193697 -197115 -84303 -141186 -316485 -209891 -122377 -43033
21382 -43033 -91795 -253984 -285984 -256083 -278327 -221244 -168552 -113409 -144253 -205672 -78274
21371 -78274 -12497 -10001 -19833 -155548 -347933 -391675 -302889 -128233 -44154 -63437 -88821
21360 -88821 14817 137722 108300 494 -127148 -136551 -192416 -264536 -199935 -182104 -45874
21349 -45874 -48569 -140474 -153524 -132593 -203090 -136107 -209676 -227517 -107086 36581 83748
21338 83748 46221 -134162 -83483 109117 160103 65942 -16129 -115133 -163022 -194347 -89067
21327 -89067 14109 42287 169140 132825 70252 -14104 -71849 -67724 32034 47547 55876 33030
21315 33030 -93082 -144646 -109515 -63681 -15707 -83039 -84658 -173170 -177419 -184870 -260901 -317836
21303 -317836 -197835 -237011 -158632 -89903 -74503 -60532 -42120 -131961 -68887 77152 61557
21292 61557 -1263 13526 75977 162725 98838 -6258 -42024 3624 9122 -29017 -125508 -227988
21280 -227988 -303722 -304822 -205785 -70396 -35395 -522 -96123 -76875 -170668 -197555 -176379
21269 -176379 -246 18892 11576 41804 -37905 -128905 -6492 86700 45021 60127 170388
21258 170388 107821 54050 -19312 -183071 -152825 -86021 21107 59051 26160 86229 85309
21247 85309 -99708 -163884 -225299 -224400 -212593 -188064 -115031 -57041 12544 -76080 -35235 -79284
21235 -79284 -193508 -222389 -98563 -43140 -125952 -65570 -39177 -216503 -307761 -246496 -249046
21224 -249046 -182333 -16679 20952 -2610 -77460 -75958 -113020 -34852 53198 -24820 -180421
21213 -180421 -252036 -271673 -346599 -192803 -8387 109683 38732 -170184 -218553 -408220
21203 -408220 -446126 -301860 -134635 -1145 -70236 -95409 -135158 -53505 -37409 -8784 -105904
21192 -105904 -136791 -160722 -235703 -168034 -29284 50135 37187 -94256 -126841 -143270 -60033
21181 -60033 -92841 -169772 -109638 -84652 7519 72381 -59596 -53046 -46497 -79201 -54767 76556
21169 76556 181942 208964 147764 140568 144427 99312 20048 10637 50457 73785 -31454 -86768
21157 -86768 7280 93654 161875 38847 97495 127401 57658 66764 -33960 -58737 20119
21146 20119 47263 97476 120355 101477 42404 -4391 -173674 -212547 -171580 -110790 60931
21135 60931 40190 -134909 -165489 -191583 -146219 -217328 -79336 121775 115712 11962 92519
21124 92519 198372 -973 -101603 -48538 88298 27049 75639 148170 1704 -1754 52253
21113 52253 88032 -76504 -225524 -181648 -122560 -156347 -269953 -306808 -245045 -234863 -334969
21102 -334969 -322342 -160266 -99915 -163238 -58600 -48017 -1881 101628 146804 68804 55760
21091 55760 73792 132025 112491 -158626 -267819 -224083 -167709 -78680 -97569 -106162 -124569
21080 -124569 -155592 -95113 83211 139094 93585 185102 246081 392838 341570 284175 207369
21069 207369 210211 155736 -20566 -181189 -168294 -6060 76347 -31674 -42903 5392 -85784
21058 -85784 -147102 -155770 -174989 -139115 -92289 -80797 -87493 -74017 32986 -15884 -166184 -304758
21046 -304758 -255381 -177116 -175051 -228744 -266389 -385691 -326711 -340270 -272445 -245976 -233171
21035 -233171 -74879 -89728 -245411 -263150 -226103 -134655 -80391 53218 105702 95908 -6309
21024 -6309 -47624 -129109 -123248 -24014 -120154 -128265 -113103 -122063 -56598 -159437 -170363 -169460 -205989
21011 -205989 -184038 -181782 -264503 -263146 -123219 -17760 -127306 -133298 1005 30557 -55600
21000 -55600 -54075 -82983 -95048 -172393 -170269 60266 11615 -199712 -156639 140213 152308
20989 152308 -22587 -163227 -115232 -183775 -150444 -87445 -156708 -136521 -9468 39934 59384
20978 59384 35343 -122691 -25734 77432 120647 75199 -39643 -106619 -10630 52646 72432
20967 72432 -9469 -43419 -11809 100429 52272 16692 7627 29352 94256 85821 31381 -3653
20955 -3653 -18530 61306 67973 64737 -121392 -135658 -54089 -42377 -12699 -101489 -133210 15765
20943 15765 111451 200427 199461 -20545 -307711 -295111 -243802 -226313 -148755 88803 66335
20932 66335 104102 89985 24267 -40178 3095 -22585 21484 52681 -150 -129571 -181079
20921 -181079 -94423 -40315 -2712 18859 -9171 -185881 -186993 -127163 -115888 -113422 -41644 -81285
20909 -81285 38187 81924 85009 146009 280054 195089 213259 223774 127006 -84573 -186977
20898 -186977 -146081 -210392 -149288 -79381 28331 65896 7864 -71242 -117238 -98000 -75588
20887 -75588 -108489 85456 322894 349817 248235 101107 123238 98233 -42386 31016 124553
20876 124553 222261 160981 157745 64782 -63206 -188021 -244566 -293015 -268415 -216159 -8128
20865 -8128 84283 117501 157754 109775 -33303 -54092 65625 28074 95530 33417 -98819
20854 -98819 -57360 8628 15568 -102361 -75449 -137554 -164150 -1509 161457 189456 79597
20843 79597 -56296 -28179 -76935 -48601 32181 21429 30750 -110563 -301563 -206753 -127280
20832 -127280 -81264 -13959 14112 -21866 -148191 -244485 -116050 -85620 -199206 -61345 -92385
20821 -92385 -194851 -118543 -87210 -20601 -61552 -76266 -83998 -115093 -68787 -76748 -98048 -282740
20809 -282740 -367141 -329906 -168021 27090 32464 -134034 -86351 46877 -7243 -163358 -197298
20798 -197298 -213842 -172928 -33835 727 -209532 -312121 -288590 -205531 -121212 -177037 -296422
20787 -296422 -349916 -238337 -115702 -30601 -102265 -150682 -210000 -240378 -271741 -200221 -81097
20776 -81097 -110240 -198991 -153987 -79155 -67994 -12252 -185610 -207829 -101120 -195737 -285603
20765 -285603 -266465 -266602 -101472 53121 4393 -77127 -143114 -109946 -143453 -77631 2191
20754 2191 23215 66463 172577 171466 181799 266096 198780 129304 157712 108207 39080 -18320
20742 -18320 -72979 -57660 -17918 -41159 -85173 -154275 -23773 30134 102304 57088 71598
20731 71598 215523 85828 -80011 -145202 1704 -14702 -97646 -145124 -120449 -112660 -193337
20720 -193337 -204425 -116916 -8753 99489 12943 -8419 118150 202631 213262 139164 84036
20709 84036 53429 -29926 -46191 -57957 -56400 -84130 -83521 51374 194774 187738 192942 143459
20697 143459 167467 126477 -10072 -51300 -129653 -186107 -196323 -147358 -204908 -203972 -117462 -87560
20685 -87560 -312950 -236183 -6666 -6381 76875 88524 -147500 -168845 -42047 -8954 467
20674 467 -67590 -70309 -29269 -76720 -138900 -130747 -49490 93606 142884 -32860 -152426 -150621
20662 -150621 -140371 -110853 -111748 -173381 -238552 -69176 -22743 -123431 -216008 -216760 -172274 -221390
20650 -221390 -218579 -216691 -327499 -171108 -113324 -109704 -122909 -49937 -63531 -143768 -229182 -307695
20638 -307695 -195438 -180877 -173607 -149674 -283192 -261510 -203654 -237941 -137369 -153917 -278610
20627 -278610 -319028 -292433 -200599 -93437 -133720 -154785 -47964 23671 16022 -55430 -145739
20616 -145739 -20548 30080 61558 2369 58232 42955 -72821 -59484 -136532 -175609 -74856
20605 -74856 37022 32854 -56542 -57435 177187 135600 -140599 -285595 -228724 -63292 -86240
20594 -86240 -47097 87442 147059 222927 277115 243297 198377 143487 122867 88663 149053
20583 149053 215687 221998 67686 -6130 22727 -51326 -19521 103727 122827 34793 50200
20572 50200 134505 81591 123084 68318 -77321 -165518 -254960 -129619 8253 34663 72638
20561 72638 153887 74987 -94959 -192335 -232614 -172110 -65453 -152260 -186182 -18143 11424
20550 11424 -64134 -52797 -67789 -61152 -53278 2685 61825 130889 -88023 -142977 13960 18454
20538 18454 -113699 -287876 -190868 46315 41319 -34926 126149 229078 289454 215211 94810
20527 94810 31574 -31015 -101037 -55278 55287 19901 -183832 -269349 -202450 -274422 -331265
20516 -331265 -287821 -109315 -110043 -155928 -227522 -410435 -395971 -174598 -112704 -241172 -316358
20505 -316358 -232827 -164122 -201969 -88278 1561 10144 -83816 -234378 -256422 -129894 -140279
20494 -140279 -133990 -131317 -68944 -93237 -134604 -154175 -168890 -220402 -271576 -332489 -369429 -237411
20482 -237411 -191590 -203344 -179133 -190738 -237981 -399336 -348906 -268527 -191923 -99588 -177324
20471 -177324 -263947 -273536 -233716 -152285 37220 130798 67940 86797 113858 1134 -31418
20460 -31418 -123126 -71031 -89912 -75557 80886 -57502 -123643 10912 22544 17089 207741
20449 207741 268140 44283 -124857 -36879 -38653 -45791 -36654 -64089 -150797 -137899 -88575 -98191
20437 -98191 -16706 89904 52280 24483 173809 97640 139596 134051 -844 41164 -10922
20426 -10922 2040 29611 14598 8652 25678 -71614 -111194 -199247 -133115 -171178 -137620 -163287
20414 -163287 -122215 12686 36528 17977 -33798 -83164 -24426 106766 116555 54536 -115907
20403 -115907 -59015 108559 26221 -28147 77666 8078 15497 29147 8062 33160 165225
20392 165225 179421 101435 -54548 -58486 -35297 122837 85932 119067 153116 61425 24804
20381 24804 29604 97464 57691 74270 -40519 -94329 -59877 -4323 60718 164636 136955
20370 136955 15958 -81153 37821 87613 82236 78745 119284 200911 221596 175518 112350
20359 112350 4494 -4670 86650 222353 262614 197247 267848 345159 353418 310679 239681
20348 239681 166047 17261 -143050 -106213 -33055 -76902 113138 129093 66469 79199 10512
20337 10512 -30607 47479 104731 181720 95440 44993 67230 278246 273299 343600 414138 377026
20325 377026 328326 270045 188709 95710 -70014 -45166 68545 44473 -88683 -43365 -115688
20314 -115688 -144225 -60944 101302 18708 3139 -96218 -27438 71221 199847 332420 322026
20303 322026 266048 245851 117816 -5820 -26253 22702 167272 183435 140816 28765 40525
20292 40525 164415 73703 117881 222417 216074 250260 270369 233431 114129 41207 98753
20281 98753 175278 306525 347570 244500 40396 37953 139138 141258 181329 257587 128860
20270 128860 62407 105187 122868 149529 -14528 -166451 22735 146698 81250 25635 109090
20259 109090 202080 164330 114617 96111 116123 64651 -60454 -150422 -106126 14640 117630
20248 117630 204974 186027 240683 231128 109292 9057 132016 290425 328391 322354 268199
20237 268199 -7192 -61345 -35627 103306 48112 90293 22249 -92649 -131750 -11775 145969
20226 145969 286455 158027 -13881 -49043 20382 -3105 13139 53865 85409 121 -103341
20215 -103341 -142620 -332504 -180683 -124043 -69153 -57533 32213 60493 170565 166929 147206
20204 147206 140740 25647 -167825 -250914 -326987 -178612 -75913 -215785 -223766 -133964 24042
20193 24042 28139 13199 69981 91183 231254 282683 149857 -10344 -90799 -147779 -140611
20182 -140611 -97028 -122414 -303141 -283495 -169037 -162639 -70988 -39657 -135684 -79360 -51219
20171 -51219 -56429 -70284 5861 -44733 -112583 -194330 -85889 114084 245267 149651 43826
20160 43826 33937 -56614 -250620 -206339 -288013 -281241 -159715 -85783 -254430 -253371 -204625 -41797
20148 -41797 42499 17633 -115130 -299585 -219211 -71370 -64231 2678 27020 65086 -1846
20137 -1846 -97693 -144911 -159638 -150335 -266797 -336424 -164962 3526 -37739 -104348 -87485
20126 -87485 21042 101398 171393 131090 -22089 -120937 -214747 -230203 -300696 -194665 -58991
20115 -58991 -127711 -301553 -206582 -97369 -138834 -149770 -35037 -60648 -75962 -4537 50057
20104 50057 -21116 -164731 -306535 -255058 -162247 -43291 3293 -123190 -178409 -61164 87954
20093 87954 28380 -73252 -81090 -86216 13549 -5470 -124709 -171217 -118341 -57088 5955 52593
20081 52593 -38854 -14046 34747 104209 24566 13742 -165516 -117889 -152217 -183482 -131663
20070 -131663 -21878 62405 38682 -10273 -17649 -153063 -198226 -197716 -98240 -139328 -139225 -107668
20058 -107668 -108050 6653 38086 11899 21623 -81448 -94606 -28730 -12002 5611 -87752 -94668
20046 -94668 -20174 -48973 -37502 -37474 -44715 10313 14903 -12284 -62655 -143752 -279141 -196391
20034 -196391 -146598 -166377 -226552 -221596 -231544 -275646 -342474 -412452 -342114 -214295 -162836 -131877
20022 -131877 -176037 -123506 -60027 -95840 -229949 -314458 -348508 -443506 -347579 -228647 -260187
20011 -260187 -260340 -166876 -131032 -128387 -113716 -104831 -33012 52013 -40839 -16640 57060 60930
19999 60930 63766 62467 50312 34726 45236 -134437 -128247 -25289 -107263 -286027 -265614 -221738
19987 -221738 -189855 -99195 52288 82749 -72252 -241976 -307176 -213385 -110451 -185944 -89427
19976 -89427 14343 -69490 -138560 -194355 -161131 -78622 -76601 -96880 -116150 -55023 -36785 -132678
19964 -132678 -151340 -64632 -4744 -1310 -5023 2096 -97772 -157802 15325 81778 47082 -52689
19952 -52689 -117515 -233095 -285047 -267946 -362813 -370659 -215164 -35076 -42802 -54609 -56031 -1438
19940 -1438 -27434 -129247 -160908 -78971 -45013 -153695 -221262 -234431 -194975 -244621 -81707
19929 -81707 -105827 -235270 -89011 28831 -42948 -50249 -38514 -76703 -57454 -130224 -62827
19918 -62827 -100398 -108904 -50277 52586 23415 150348 192844 131536 168772 156462 164430 273207
19906 273207 418452 334029 220178 360438 505771 409660 326271 367387 411947 325324 376960
19895 376960 411872 425765 397473 329770 133555 -13295 -77160 -33363 16770 139613 128641
19884 128641 69252 -28590 20103 2744 -51 102639 97990 132215 136987 70365 89421 45935
19872 45935 -36559 -37906 56108 204305 343837 312015 224024 175039 164059 86120 67345
19861 67345 143223 186729 178518 184609 172590 202028 279645 293901 327846 268825 243780 137877
19849 137877 51309 93442 132784 252940 389141 370040 269604 170913 206925 293380 116999
19838 116999 68711 45649 61818 34878 -47312 -103121 -9708 88432 79368 24848 -35060 -60951
19826 -60951 -34567 25175 -85519 -121824 4930 30668 18168 20632 -32144 -80392 -133354
19815 -133354 -81211 39639 14591 3478 26126 -113215 -182227 -4578 86954 144400 143753
19804 143753 60334 -18398 -24600 -101749 -113892 -45681 39445 142437 89638 -14201 19109
19793 19109 -39412 -159092 -135637 -90290 -162833 -316505 -365568 -286084 -295255 -401567 -449168
19782 -449168 -338401 -238216 -259335 -258143 -223835 -115928 64448 77012 -97503 -236551
19772 -236551 -298970 -216398 -87201 -50617 -52524 -109682 -146974 -142255 -178671 -183833 -190008 -182383
19760 -182383 -191565 -214854 -243992 -300508 -194810 -125264 -170888 -252548 -281129 -273462 -219043 -176934
19748 -176934 -44237 -63151 -30121 -71538 -23368 9435 49799 20431 -125962 -112627 -128843
19737 -128843 -86210 -53191 -85876 -66399 -63755 -97485 -22383 -712 28644 31109 66313 204623
19725 204623 186994 120830 -30862 -102361 -235622 -210441 -135049 -130562 -24985 -70977 -140271
19714 -140271 -316219 -276547 -115197 -202844 -296253 -224708 -202383 -139042 -126178 -117762 -85603
19703 -85603 -8277 -60929 -224648 -371080 -221763 -121631 42055 -21051 -51191 91503
19693 91503 83199 -39016 -140257 -92738 16102 -46689 -146958 -198032 -154449 -156882 -305802
19682 -305802 -302017 -219191 -106405 -176728 -247387 -243542 -214352 -239154 -281462 -245957 -118117
19671 -118117 -69530 -142357 -97716 -205758 -216978 -72595 -76361 -71088 -64514 -98913 -201989
19660 -201989 -134289 7637 62411 -42298 -97562 -58167 -100145 -88403 -1165 54897 -5188
19649 -5188 -24700 158989 379147 274384 108386 -15551 24816 77519 128734 224687 62519
19638 62519 -161830 -302738 -155042 -60173 -167644 -172637 -166864 -162526 -159531 41868 131923
19627 131923 14464 -142415 -90864 -95731 -131492 -211601 -202532 -217181 -189605 -170467 -239248
19616 -239248 -238418 -196300 -184113 -272677 -215802 -249431 -230943 -13865 58270 133773 148505 68565
19604 68565 68683 25614 3372 -25299 -36001 17345 109963 229311 237760 180599 129744 201574
19592 201574 90381 -108580 -230069 -251970 -277112 -235958 -145869 -45461 -152088 -199621
19582 -199621 -135099 -179346 -183058 -64786 -81554 -79969 15227 -32694 -68379 -127053 -5181
19571 -5181 31822 85031 12393 33849 46959 23240 131569 37264 -1259 -241399 -286016
19560 -286016 -186062 -235079 -104778 44408 -73939 -150527 -249613 -94282 152575 75694
19550 75694 15991 -10613 -19950 -18669 -45544 -130042 -65784 -66950 -178255 -155224 5520 -28394
19538 -28394 -24390 81133 163518 184573 195206 131853 -26319 -11837 78392 139789 137847 -26394
19526 -26394 6159 90140 87713 -12774 -60604 23679 115505 298515 344967 204701 98998
19515 98998 55635 5498 54801 52619 -10486 -236166 -190684 -110463 -130053 67040 215002
19504 215002 185490 124503 64355 15656 -117891 27183 33485 -71239 -148877 -75715 -19095
19493 -19095 5040 -14295 -55655 -134141 -113189 -143000 -310854 -355524 -286925 -224108 -188347
19482 -188347 -105924 -42361 -44799 -45093 19306 -16111 25677 -108340 -121179 -116227 -30855 -97356
19470 -97356 -170256 -196892 -122368 -1088 25905 -6787 -50296 -33243 -4723 71054 18940
19459 18940 -69977 11307 100277 93711 100967 169156 116023 70231 62475 104902 32673 -42076
19447 -42076 -34563 -29903 -65066 94969 186120 178292 118465 147090 192053 140916 166109 220333
19435 220333 185798 105566 71484 96449 263999 218602 80321 92334 144426 199841 256476
19424 256476 442739 573577 624006 564119 545027 704709 889936 1094797 1291294 1094167
19414 1094167 956279 991913 1249358 1495572 1737208 1983680 2361235 2883514 3248249 3333964
19404 3333964 3409423 3578154 3766792 4190224 4980912 6175558 7834157 10373598 14412806
19395 14412806 20639033 30296628 45424221 67716642 91503682 100605569 87724432
19388 87724432 65166740 46269557 35181498 30476889 30223183 34440619 44052089 60798563
19380 60798563 84405428 104662611 105957962 89255092 68580474 53014010 43141449
19373 43141449 35913367 29279907 23142357 17965347 14080433 11283028 9729824 8900317
19365 8900317 8341996 7962626 7520011 7120151 6752552 6524674 6488975 6698329 7345079 8440037
19355 8440037 9893697 11526592 12851125 13565686 13966713 13946947 13420898 12867209 12941250
19346 12941250 14090140 16634103 21147292 28547352 40680047 59913904 86770178 110612687
19338 110612687 112787979 93303130 69857473 54290911 47663894 46715389 48868610 53359768
19330 53359768 62283979 77731897 96228872 104860171 93204332 68689332 45609041
19323 45609041 30178469 21057506 15511382 11931423 9468860 7915114 6897320 6269281
19315 6269281 5748629 5563196 5394739 5106714 4765704 4501100 3901710 3219010 2732911
19306 2732911 2458938 2384028 2398095 2488264 2536701 2460994 2286733 2023160 2027201 1914789 1643574
19295 1643574 1442922 1298317 1150428 1096390 1032273 961065 850148 799061 728118 617987
19285 617987 677125 855805 866245 771394 799035 737319 678670 620292 524077 480730 454790
19274 454790 539291 517499 498206 514002 424137 372402 523753 620230 634651 577512 455136
19263 455136 458974 443639 325440 319728 348283 446436 515506 510941 416616 359138 213332 114427
19251 114427 173212 359244 237626 227970 371200 453154 366931 353503 374823 428572 400418
19240 400418 399991 290137 319350 350393 354464 261195 -1250 -44493 -40131 5444 -61573 -51623
19228 -51623 98285 214478 229988 168965 252735 227056 37603 -37100 80971 91990 127435
19217 127435 96377 14584 3692 75545 84327 17366 213827 470939 445742 279688 267322
19206 267322 150941 122458 227209 234029 212909 268448 139208 25828 88905 87732 65297
19195 65297 4719 121838 132716 137237 126530 266251 227186 146971 125744 84492 96128
19184 96128 61893 32301 96257 96031 164970 211292 198285 179862 91446 59261 161366 398726
19172 398726 577961 517154 358366 318305 297640 245703 303239 303044 179942 312778 411688
19161 411688 316187 266089 291254 208641 188509 172025 101460 -47712 -44735 -48090 -39747 -24570
19149 -24570 62430 103014 -63346 2339 49026 -34309 -13635 46286 115576 88251 -6209
19138 -6209 3100 1396 -132825 -116052 -78572 92038 175687 156327 71284 88110 147023 206024
19126 206024 315100 286469 255926 246683 315319 271105 325895 264786 263397 187604 165089 285539
19114 285539 232965 249938 370709 416537 216248 78889 -83519 -68518 19557 157138
19104 157138 159454 244654 282128 198082 146335 160195 209041 152491 160745 30415 46134 -8907
19092 -8907 -104095 -110648 -1307 144308 68985 -116785 -164975 -146936 -12843 111659 -6571
19081 -6571 -16244 11750 28218 28462 8578 60486 248954 280679 174512 56596 60809 107844
19069 107844 29178 290689 479176 452854 410647 410697 369551 314742 197461 210530 190622
19058 190622 2253 -59058 6536 53272 -2305 -66416 -100164 -141443 -78871 -99607 24359
19047 24359 138236 166141 80681 66241 101160 62456 -19471 -51073 -111127 -148290 -52138
19036 -52138 -828 21729 -23566 61899 169301 82100 26921 160301 224478 127199 -6060
19025 -6060 -151826 -225583 -170735 -24750 -117062 -258127 -350300 -158804 -10321 -111562 -157017
19014 -157017 -106118 -87423 -140138 -79372 -30428 71696 605 -223367 -197767 -197088 -253121
19003 -253121 -167273 22984 34962 -5627 45079 -36999 -22596 -18613 -1766 101867 64482
18992 64482 -20961 103865 142919 6435 -110495 4548 52437 71904 73632 96221 153885
18981 153885 118571 78551 63897 -8280 -67261 31767 59222 127152 109392 99017 239312
18970 239312 265423 268425 258920 296457 324551 214339 170019 177266 239649 233746 259280 73644
18958 73644 17807 73024 66066 47933 103808 170628 165146 184212 216076 353234 364880 309984
18946 309984 194619 208288 199996 293251 291576 236198 162902 94470 85008 60154 164671 162369
18934 162369 43167 191897 202573 278658 251775 202581 260125 312716 389043 312584 390327
18923 390327 435070 527786 557432 538233 384757 321361 204798 195881 279790 269277 220068
18912 220068 277276 239140 164384 97821 68630 198917 236345 278878 239853 39503 78254
18901 78254 56460 -100732 -61946 -61240 28626 -25858 6079 -84144 -108010 9075 67240 157809
18889 157809 247210 223264 202614 252453 355596 490623 397591 268617 277747 263024 371568
18878 371568 322842 137743 205642 253781 221061 254546 464221 544604 534564 480096 494106
18867 494106 386911 401272 415150 466356 534648 538387 577555 856970 1049679 1097541 805341
18856 805341 496495 357705 325338 329010 336154 390708 381368 246026 130992 90812 61174
18845 61174 97153 96674 71868 38903 82559 -7180 -139093 -106451 3562 39653 33247 107544
18833 107544 178119 232908 77522 -106178 -178114 -103921 -20420 220462 229082 223319 410037
18822 410037 517783 501668 579622 707417 717975 531088 411460 464966 398216 428112 475518
18811 475518 486268 534533 643355 597717 367296 341303 388358 283925 148033 9836
18801 9836 24002 -40439 -14133 74403 84359 70712 -4178 99961 166052 195795 240180 171957
18789 171957 56199 -88008 -296933 -385342 -226496 -141859 -39757 -83133 -242597 -104622
18779 -104622 94572 191600 200001 301976 317688 282203 212694 194750 300776 290807 493741
18768 493741 863743 1424754 1742961 1610531 1031688 592340 304840 32395 -33946 -87764
18758 -87764 -158789 -193312 -123248 1 80321 165063 205269 143463 84702 110668 31193
18747 31193 -9046 9630 16583 38388 43716 34979 -40884 27076 45796 74505 -92052 -39763
18735 -39763 147341 214348 130792 104231 75478 5651 -26109 -149536 -300974 -192225 -56215
18724 -56215 -22626 -59021 -12743 -92967 -32422 26938 -72583 -16069 77999 116947 125943 31894
18712 31894 -92262 -144658 55187 240841 246114 91857 209991 262396 231344 117449 178816
18701 178816 280220 336001 387850 476734 500742 610625 735286 637834 496963 452010 637065
18690 637065 713447 784106 863571 1010062 1014668 1014170 1108374 1267767 1425561 1726826 2155710
18679 2155710 2547680 3055464 3965891 5137140 6947946 9636188 13899987 20206008 29774082
18670 29774082 41751467 49746140 47186233 37106635 26826273 20132335 16728108 15896811
18662 15896811 17141127 20487062 26843552 36636555 47284933 50906735 43656927 31571718
18654 31571718 21395089 14872007 11091890 8747620 7190354 6155817 5318332 4698967
18646 4698967 4291227 4049229 3951859 4064478 4182883 4182595 4096105 4038096 4049744 3947161 4037331
18635 4037331 4368607 4862277 5328048 5801239 6541459 7852624 9494070 11978580 15509422
18626 15509422 20893760 29318672 41787494 56542362 65773466 63541263 55265220 50094053
18618 50094053 52521200 62080593 73238234 77168903 72614988 67609877 67891062 70646143
18610 70646143 67888791 58848128 49752774 45856822 48198944 54986754 60635473 58141091
18602 58141091 47781306 35749343 26492555 20333875 16039838 12960053 10836212 9186261
18594 9186261 8030994 7233233 6530608 5892838 5440229 5151524 5144522 5059037 5152069 5094296
18584 5094296 4889777 4897534 4997342 5160660 5425014 5848785 6605450 7515625 8825998 10780316
18574 10780316 13882436 18605807 25981687 37253073 52437450 65006839 64781813 52657482
18566 52657482 38312650 27923029 22576515 20922552 21869242 25387884 32384707 43523074
18558 43523074 56767880 63624156 57065249 42512224 28907559 19508424 13850247 10386585
18550 10386585 8103944 6577621 5519177 4746654 4234195 3965965 3684886 3384064 3129107
18541 3129107 2943697 2918980 2726865 2382194 2139184 1987379 1815752 1702100 1621705 1585359
18531 1585359 1692771 1811376 1783137 1650791 1332837 1082670 929146 889654 925653 925056
18521 925056 889327 838911 846778 890479 1003015 1002845 726458 678528 738205 671426 591207 461221
18509 461221 415034 327898 362576 500715 659628 630487 478761 299410 376192 471876 314205
18498 314205 207018 213701 253536 356585 341859 316679 261016 236008 276184 268039 231264
18487 231264 342156 476632 549207 532860 430759 341495 190089 167418 206115 249374 232531
18476 232531 51689 21421 36114 51787 191686 319043 348144 388594 170103 -86901
18466 -86901 -163885 -206752 -113250 27981 -16221 -123573 -89333 4171 63011 303286 498756
18455 498756 377185 247438 232105 64624 -26929 135282 63964 94145 177713 164287 32419
18444 32419 -59848 12009 82556 117573 124780 87366 24685 -52059 1195 -17165 13017 71619
18432 71619 78775 187726 173056 -3717 -31654 71119 207342 106647 34151 47376 -118252
18421 -118252 -104970 83969 104765 96610 -13690 -33318 134572 121716 177196 179255 228690
18410 228690 226706 192785 155598 136425 51355 12307 35536 160202 188504 243669 250324 216272
18398 216272 258690 129124 145667 137314 214181 217272 167537 66447 153450 174938 37452
18387 37452 89168 331372 460700 500005 440040 375446 334975 411399 422405 563104 715613
18376 715613 656979 565680 579478 546605 452001 383238 472600 540546 563178 443125 434856
18365 434856 482998 492138 404928 407945 585502 627150 624945 666403 565703 512832 594684 507784
18353 507784 314382 231899 458990 620093 678896 697179 650217 598459 413380 261024
18343 261024 353078 423717 380900 473473 589450 595096 439505 339174 426857 590955 697786
18332 697786 648042 740247 876146 998680 1039782 1151617 1232357 1332228 1430399 1549821 1583470
18321 1583470 1526539 1475474 1472892 1459716 1293026 1086812 970587 996949 1016020 956587 772166
18310 772166 571853 445047 392653 367461 328110 363653 513849 488052 448271 494352 473379
18299 473379 571519 545617 619018 574942 429155 387548 431894 322396 214088 12926 -7989
18288 -7989 60981 394780 611914 762388 599755 468716 543041 677669 656833 641919 659663
18277 659663 603133 675703 729689 801340 835280 875560 936492 949983 923893 843371 889401
18266 889401 901157 948301 888258 827758 846150 799207 833305 893186 789682 716778 633966
18255 633966 622975 431557 441101 453259 353096 208354 151154 143376 175842 272426 250980
18244 250980 213702 82942 22287 4549 45881 95370 249336 291030 383060 368130 407356
18233 407356 226845 58897 46618 44265 105379 33773 -101136 13419 213974 417897
18223 417897 358426 315598 374777 369690 231751 117035 40534 49538 51082 140834 120036 128633
18211 128633 230265 94065 34268 9657 -34884 110465 121626 123131 111814 113286 205782
18200 205782 193484 183958 200829 210232 129819 49535 -56551 -94960 -44316 -19777 -41703 82662
18188 82662 -89461 -251610 -257535 -95544 -85209 -59346 -81078 -164652 -133733 21677 161899
18177 161899 211941 191962 175208 150191 123735 215049 326120 338970 243155 79993 -2035
18166 -2035 -43103 -83508 21686 214498 372662 496115 490715 275637 189544 193156 317948
18155 317948 346558 473825 404094 479572 541348 608090 697394 785338 696838 470849 360060
18144 360060 306206 360125 377677 347962 444972 620334 586222 633867 583018 564562 792085
18133 792085 1064037 1125419 1212605 1359254 1469384 1604393 1733360 1823000 2030388 2441981
18123 2441981 2884802 3642746 4562691 5587699 6999266 8939456 11542342 15216935 20480127
18114 20480127 28331165 41171932 63304998 101249846 166710983 268050015 351095665
18107 351095665 322696138 220920322 128266982 73655376 46252444 31819870 23235315
18100 23235315 17613253 14003090 11799747 10185751 8733656 7813258 7077649 6379504
18092 6379504 5853961 5352999 4867327 4389162 3851734 3422460 3117778 2796704 2398394
18083 2398394 2340749 2196220 1929636 1860573 1922798 1818831 1808985 1698423 1740346 1621498
18073 1621498 1484021 1420017 1263014 1143681 1081252 903507 880893 1059581 1146497 1154742
18063 1154742 1212445 1147811 1116040 1161923 1231269 1239606 1106333 1026197 781567 585211 575617
18052 575617 662386 808285 736737 632088 834993 818664 816748 850184 671033 472402 404842
18041 404842 427445 455996 385483 382554 395189 534158 581055 356327 221831 278784 316184
18030 316184 331703 466404 509855 476545 440302 437479 417014 368911 363055 316550 288918 502369
18018 502369 662200 706725 581895 423922 391760 432760 454551 408621 294954 304964 300986
18007 300986 315411 392026 453703 483322 323677 209634 206209 234696 213432 185930 238767
17996 238767 310898 343670 343044 432799 513814 587115 492654 437991 454215 434778 487407 555028
17984 555028 530292 491005 395857 309578 286389 254123 225107 144364 237403 364837 277724
17973 277724 215805 104924 -82159 -192831 -10178 51422 -63339 -23007 198369 333560
17963 333560 392862 275451 251649 187970 62065 96925 149791 26083 69997 77569 77561 125486
17951 125486 114315 211759 138821 254127 365329 490533 561454 363545 187942 200400
17941 200400 264778 330275 408196 545971 453782 231434 143417 66728 28220 30500 54036
17930 54036 174466 161535 92179 98223 223507 253113 261612 189275 227789 249764 274174 439398
17918 439398 425597 347857 196730 237411 256385 315404 349641 274776 263221 417177 485184
17907 485184 514762 575403 507655 324041 254294 326835 511691 719960 794686 938974 875416
17896 875416 801340 831839 757040 664479 761958 870556 1046105 983158 920401 988352 1119437
17885 1119437 1355446 1453200 1398224 1382447 1388511 1568844 1886825 2012653 2053798 2099034 2070778
17874 2070778 2113236 2203902 2361152 2647562 3171095 3804361 4637921 5951977 7867105
17865 7867105 10479082 14521318 20457396 29508215 42030197 54200305 58697612 55008168
17857 55008168 50724796 52182437 61215152 74547031 80936948 71502242 53019664 35933986
17849 35933986 24873007 18367082 14523909 12065432 10412650 9286079 8501385 8101936
17841 8101936 7874946 7878513 8018355 8195845 8455233 8960113 9443767 10173129 10956604 11801008
17831 11801008 12874680 14505612 16984989 20959940 26562999 35088968 47753197 63867039
17823 63867039 79155339 89045263 95399284 101881390 109074258 118391936 132663709 148895375
17815 148895375 162966895 176814548 187227189 183544755 169349689 161021363 165839776
17808 165839776 173513910 169092025 148830916 119001124 91390058 72641961 61468637
17801 61468637 51865702 41558534 32295680 25520866 20994350 17965892 15871893 14267059
17793 14267059 13238260 12396901 11619739 11104879 10727420 10488548 10276777 10178522 10330822
17784 10330822 10497176 10728375 10753084 10674429 10607932 10726575 11310305 12355002 13965055
17775 13965055 16448114 20174875 25818339 34241926 45375738 57614871 68081923 76616397
17767 76616397 86108103 97869580 113348402 137320751 171419628 205360865 220247935
17760 220247935 207177107 171841203 128169210 90672387 64731558 47787197 36131760
17753 36131760 27674800 21732596 17619195 14748632 12741462 11411747 10288373 9477945
17745 9477945 8874815 8240343 7642911 7057667 6509362 6147520 5914696 5629302 5315388
17736 5315388 4995339 4612538 4185141 3945159 3812948 3514842 3097906 2898180 2734971
17727 2734971 2524007 2358986 2195371 1883416 1785048 1803332 1833394 1759481 1666442 1583962
17717 1583962 1580410 1471618 1462729 1591009 1680920 1658787 1711445 1636278 1482883 1361551 1299242
17706 1299242 1228455 1251672 1217301 1201388 1264467 1162601 1188893 1316821 1325947 1233214 1165347
17695 1165347 1139253 1081583 1089707 1164161 1258945 1294368 1246471 1124310 986580 1085808 1206434
17684 1206434 1029845 968109 1026242 1022980 1093493 1094807 1031404 1006251 858275 727707 599756
17673 599756 571353 674494 611609 545393 432283 367383 358228 466382 570451 686504 743127
17662 743127 680939 787896 841127 680126 579664 401509 288989 312369 130089 45272
17652 45272 35622 63466 153312 259187 306635 254906 330410 324463 276847 293726 341169 368552
17640 368552 364147 435588 643497 738494 788324 697008 588293 538320 623583 573353 566249
17629 566249 433128 379164 312276 250633 368024 386900 383754 430595 567810 486808 367475
17618 367475 402748 288447 322979 344480 273237 274143 209993 192905 258750 193101 134545 302824
17606 302824 361544 382871 220965 232468 244008 291068 342419 347715 410907 418066 392386 370962
17594 370962 457032 450016 404128 162011 255032 308510 235672 358304 431731 427820 304180
17583 304180 304741 333121 271448 244330 230046 209622 329655 465075 345616 239242 221792
17572 221792 262336 257395 266548 287807 172741 103577 202955 228112 193155 70376 116097
17561 116097 154471 284029 317802 200736 179092 138026 197937 264819 326308 300639 164639
17550 164639 103581 186842 143955 186425 196507 291004 313496 377755 439239 459957 383069
17539 383069 324393 282346 275413 318305 354825 307224 372712 308165 180806 221568 163009
17528 163009 178056 313150 300774 177368 148109 224032 254066 280982 229052 107866 9941
17517 9941 -115933 -55888 -47678 -57673 52663 187274 247272 220503 107933 46433 119270
17506 119270 176905 252138 404443 468105 307294 190069 87369 10745 126468 127849 82162
17495 82162 30530 -53228 -110861 -100274 -117922 -101880 -96884 -1811 -33940 -109362 -114568 -106395
17483 -106395 -154379 -97100 -49143 -3113 86587 53547 59739 76005 93826 144677 160475 83004
17471 83004 171579 223784 179224 66228 50129 12991 70299 59884 -14940 69246 269807
17460 269807 174827 105206 73403 18465 114834 161314 11808 3741 147435 160722 200382
17449 200382 242544 263296 312919 512423 742150 1022124 1524844 1988029 1805725 1305135
17439 1305135 870670 456876 219947 234353 322565 410631 307302 250622 269004 287015
17429 287015 255597 194139 245307 260564 225049 197426 301470 245829 166146 165466 2014
17418 2014 -13839 88161 154718 162809 19536 44857 169137 267812 206978 73880 -49410
17407 -49410 -120361 39505 181690 175280 190307 267525 293543 283871 171337 129006 42405
17396 42405 -106936 -180531 -29734 -69686 -112782 -105393 -17135 -13350 -672 27963 93441 215425
17384 215425 184574 200367 100092 133931 33160 -18401 -29247 -116023 -45814 -7965 34308
17373 34308 459 -12354 -58955 -118780 -23253 14895 -49342 23268 89266 27351 67838 197903
17361 197903 241645 106441 51271 32564 71209 72297 -24554 -20873 -91355 -218572 -256845
17350 -256845 -173984 -58683 -247067 -205974 21027 110242 63793 190087 201525 194092 248508
17339 248508 334485 380663 529771 721950 562352 413287 503910 541769 328926 167234
17329 167234 188727 155934 118497 137632 49931 -45217 4170 86913 193782 142871 70414
17318 70414 52810 178347 405262 400826 496874 489429 437786 529519 547563 528276 524832 487200
17306 487200 338592 368482 321300 285447 154431 116125 291589 218722 195906 148780 139710
17295 139710 117216 64250 137012 147248 166949 254798 324795 374695 424842 591835 657258
17284 657258 703633 610109 651708 674939 686171 509557 490927 516580 506469 613311 442498
17273 442498 291087 97644 116347 60944 68183 146727 235992 309915 232901 287929 335552
17262 335552 306944 463709 425325 447121 490664 396515 395632 404781 425095 426576 596375 646067
17250 646067 481116 377981 384353 380850 437095 419651 452607 419877 378592 244493 249337
17239 249337 319104 381346 305461 226166 284708 333688 340669 294526 202487 34917 22847
17228 22847 52803 97812 -37586 -172659 -177019 -96910 -17557 31790 27507 90475 224034
17217 224034 205526 43899 -115664 -164623 -105590 107602 224520 143370 68228 28485 88925
17206 88925 172068 98195 43247 -50256 -42758 -8943 11071 -394 -61261 -53817 -57750 -90279
17194 -90279 -74217 -65830 -8669 -20223 -48510 -25018 -23418 96722 149472 173247 69382 -13469
17182 -13469 -79206 -2924 69514 207704 199546 177493 213846 104299 21574 -12122 -5587 100722
17170 100722 120600 67711 17298 34394 24833 8755 29797 142731 43693 82341 143021
17159 143021 105084 -38660 -176261 -147403 -142765 -201849 -277170 -222099 -140760 -71879 -120622
17148 -120622 -95747 36271 31234 127792 68121 -49428 -54440 -120599 -140555 -223760 -290848
17137 -290848 -346000 -358872 -352798 -220011 -186445 -61365 -127988 -197701 -84281 -54991 -119614
17126 -119614 -104010 -186763 -225071 -96713 -80539 -945 90390 179525 216122 217698 7689
17115 7689 9746 -92686 10681 63518 166986 164728 241037 264549 70524 4071 -63021
17104 -63021 -179718 -111360 -166453 -162926 -96910 -448 39339 46008 -60292 -245383 -180704
17093 -180704 -101463 16234 81048 94013 170632 200403 43661 -4247 -71910 -48152 -131262
17082 -131262 -230693 -218706 -138978 -88995 7193 -77544 -80250 -150094 -81151 85275 237478
17071 237478 213009 106732 27508 16161 37601 -81593 -97826 -28972 7358 32325 79679
17060 79679 104921 64876 -45612 -74352 -72445 67178 49104 -82799 -203790 -130821 86840
17049 86840 69731 25368 14433 -73442 -49752 -101509 -107816 -21565 167541 102380 -71157
17038 -71157 -77434 19112 22113 -7373 -120991 -180873 -224526 -79663 -44769 -85570 -60688 59243
17026 59243 158444 151455 98920 51757 70805 107865 152740 236957 323399 237196 95838 52220
17014 52220 24780 11692 -15209 37269 25616 -29489 82360 -24160 -148047 -37904 23911
17003 23911 -3013 -55034 -29876 123790 254062 269056 337895 319415 304454 177924 108723
16992 108723 40208 81120 146677 62096 28380 -9762 28712 -7422 31007 110873 158384
16981 158384 392 -142115 -188339 -51150 139377 185112 188808 47899 38226 1615 77128
16970 77128 1912 -206420 -271663 -282581 -112165 -91750 -93069 -77989 48979 206204 193202
16959 193202 226455 217405 170647 77874 137551 57071 36425 -12962 -4840 -16166 -86798 -129452
16947 -129452 19333 163838 143358 48509 -41903 -4508 -46080 -31196 111476 79846 -17691
16936 -17691 -104837 -148205 -113153 -143879 -97101 -20928 -63677 -66722 -24572 -20232 -83491 -86509
16924 -86509 2280 71284 60938 -35511 -8038 -38505 -17990 -11958 32488 -184047 -200096 -38076
16912 -38076 -128111 -41116 -2494 -96522 -162102 -127590 75151 109389 99341 84891 88678 -86422
16900 -86422 -228536 -239175 -182837 -248065 -325710 -251715 -139776 42456 25521 -84007 25006
16889 25006 85356 133151 159422 94036 49473 40855 4188 -181959 -228260 -228295 -213814 -226944
16877 -226944 -177602 -144063 -151020 -296127 -304615 -292601 -132433 -78618 -200147 -208243 -185167
16866 -185167 -99321 -39778 -177452 -192759 38703 83738 -86999 -118214 45227 40983 -111257
16855 -111257 -53360 100508 176743 159399 13754 29088 64342 81331 22857 -142556 -223499
16844 -223499 -226836 -207565 -187639 -138875 -36071 -34426 -36370 24672 -39417 -238870 -182336 -76918
16832 -76918 14631 86250 74293 51567 -19090 -122044 17443 234911 87848 -86617 -146439
16821 -146439 -155866 -181608 -187699 -276038 -281260 -317958 -163828 -21549 23225 -1861 -31407 -55731
16809 -55731 -160735 -155616 -224825 -220442 -244172 -175691 -223217 -240111 -208889 -227339 -187923 13876
16797 13876 -55585 -104286 -56500 -110819 -85810 -113550 -78851 -105459 -238085 -147957 9141
16786 9141 -31933 -155768 -156261 -111931 8694 4704 -54710 -37183 108584 202062 217278 225606
16774 225606 92019 146245 -19152 -153905 -185631 -166072 -19001 -86680 -127617 -180135 -141940
16763 -141940 -12590 -66491 -161622 -183586 -227005 -157080 -2846 27604 -128619 -55693 -57560
16752 -57560 -27054 -15664 -44275 28589 199762 176936 159766 100973 1788 -112441 -62115
16741 -62115 13637 -23989 -50743 -38046 -360 -87633 -117663 -73396 15834 129808 40745
16730 40745 -58650 -112401 -138228 -265695 -218828 -67986 3727 -30738 -148577 -94288 -8536
16719 -8536 68208 106399 24336 50517 171869 67243 -14920 -37967 -106902 -71878 44152
16708 44152 50638 -74009 -107036 -75127 26857 79097 180340 195820 73644 90263 159247
16697 159247 160659 229731 274683 234643 167429 132525 69186 1567 -7056 -32509 16937 56548
16685 56548 -8523 -71631 -132654 -152638 -143469 -22736 95911 59763 -45783 -87747 2453
16674 2453 -52758 -5515 64252 80388 63470 12685 -111004 -135015 -76345 -46855 -32229 15141
16662 15141 54820 -7524 76262 124380 -35732 -97867 -87053 25923 160145 102890 58935
16651 58935 42878 19465 -29501 -4806 4244 -94151 -71431 -59667 -48885 191254 322368
16640 322368 286653 217454 190048 199839 127844 235042 130447 35598 -6593 74628 45816
16629 45816 9044 -18180 65874 69243 13917 -60363 -124068 -217387 -243956 -172102 -109612 13429
16617 13429 -13895 58914 24388 -66232 -89015 -17394 74866 -771 66046 95234 -7105
16606 -7105 -2980 30441 -92333 -130011 -36355 46292 91695 8709 -31651 -173600 -220802 -57005
16594 -57005 19266 -26841 70226 173660 134632 30787 5212 75733 148364 -48781 -67194
16583 -67194 -70863 -34804 -63147 -158527 -218708 -214544 -268725 -237867 -117482 -78755 -25963 -25446
16571 -25446 -37238 136429 91098 -3153 -26065 -123367 -180522 -292921 -206716 -43160 -3017
16560 -3017 88559 100209 30142 -48255 8166 15447 22318 46072 82745 18364 -44558 -105687
16548 -105687 -98976 -169083 -107425 -24205 90306 76508 -137906 -314678 -162067 -41263 13903
16537 13903 -9561 -75556 -145743 -75530 10817 55161 111352 96905 87388 20277 3335 3183
16525 3183 -84171 7170 34930 108180 85722 -21877 -43019 21041 22511 71207 10892 12433
16513 12433 33464 -12266 -74592 -32783 9989 -95397 -228883 -325383 -187510 -52597 85598
16502 85598 64203 12643 -69562 -201707 -152759 -180860 -143016 -5036 61749 -49453 -71485
16491 -71485 -37149 -212860 -265566 -297907 -238833 -120432 742 -10464 -96199 -116715 -16056
16480 -16056 -5623 55657 -43021 -45147 32148 -48271 79770 156651 30277 -205077 -322638
16469 -322638 -244775 -127460 -26576 80818 187437 185299 148138 131760 134555 160185 146843
16458 146843 61549 74643 22927 -74928 -200563 -70804 -87128 -73091 143737 153474 36469
16447 36469 82823 -22457 -21874 175880 252073 74028 -13681 -112040 -113381 -133000 -140806 -124679
16435 -124679 -171824 -255308 -207025 -205193 -81990 13144 67598 42177 41704 62932 5679 52548
16423 52548 54824 97872 51181 -105715 -88458 -83500 -83447 -43518 10373 -146129 -271355 -310513
16411 -310513 -262675 -258849 -229517 -165053 -7200 28998 81874 -30135 -72062 -17662 15600
16400 15600 57958 117186 3034 -36692 7746 50473 29381 11247 101340 161913 134921
16389 134921 71681 -85773 -210770 -300810 -180199 -21422 64988 84759 -3064 -105945
16379 -105945 -211089 -159649 -132369 -69855 -64718 -114935 -152082 -99992 -163695 -169838 -115350 -71096
16367 -71096 -167060 -87827 -55542 -135442 -94260 -125473 -102524 -204443 -240782 -109153 -98657
16356 -98657 -62219 83565 231906 216805 201012 147899 37669 93375 82552 -6657 80647
16345 80647 82697 105769 -65855 -80652 -101365 -153979 -151109 -26325 103503 94358 82820 216958
16333 216958 152911 41559 -57194 -7895 92283 -10601 -73890 -106281 -95973 -166175 -253894
16322 -253894 -223068 -88897 -39136 152876 138698 19404 -154141 -155899 12751 47725 -153583
16311 -153583 -348477 -382961 -337763 -204199 -112684 -68890 68916 38441 124387 124357 20017
16300 20017 115463 22984 -124207 -196304 49153 145266 93352 18810 29794 32982 -21005
16289 -21005 -51042 -172859 -383510 -450664 -279021 -198564 -163966 -39544 87301 82380 -108083
16278 -108083 -221008 -147230 -44719 66461 21527 33845 20235 -27867 -98250 -67670 54896
16267 54896 76400 102238 118731 33222 -23918 -110386 -222413 -293411 -326548 -241448 -19342
16256 -19342 -141930 -143000 -114421 -167780 -130930 -4968 -11905 -87046 76099 195149 101507
16245 101507 -5699 -112956 -170174 -75077 135183 217581 94803 -123483 -126696 -46652 -34054
16234 -34054 -47100 -38356 -6138 -56426 132437 90387 -46701 -61208 -145690 -118936 89657
16223 89657 168754 -90028 -263259 -359289 -301782 -68223 17184 -32339 -119255 -155676 -218229
16212 -218229 -338 -38058 -161292 -205702 -57649 78981 119615 144539 -27723 -80584
16202 -80584 -54126 36255 -38510 -135734 -62809 -2900 -27982 29052 78661 83293 33679 7791
16190 7791 -26315 -144134 -191170 -188029 -96075 14919 8750 -72126 -51652 39253 138016 89135
16178 89135 125906 32992 -22224 -49442 28286 176136 79992 118365 130148 140101 178512 92765
16166 92765 -125890 -180267 -173523 -109545 8128 72780 -32978 -98311 49232 132869 290315
16155 290315 397723 324912 34047 -89438 77488 15803 -25282 -99503 -92157 -52398 27087
16144 27087 -71521 -80442 -141691 -186882 -269334 -201003 -129138 -11508 89325 127528 41821
16133 41821 54918 10898 92316 -4576 -164508 -148186 -66699 -80967 -159815 -149589 -41266
16122 -41266 5380 -67767 -58648 -987 42779 183316 261045 176540 -15142 -38599 -38099 35349
16110 35349 119509 -144073 -300629 -189624 -27061 -41481 5853 -48250 -189495 -239486 -188700
16099 -188700 -133087 -24181 -40373 -142695 -74362 -93544 -140667 -181889 -200679 -234762 -151775
16088 -151775 -48408 -66686 -52249 -50200 -77429 -45934 58899 50952 -27083 -142278 -130568
16077 -130568 -98211 -96291 -77856 38740 3564 -53787 1922 -47807 -144737 -34425 -63968
16066 -63968 -119748 -150900 -192292 -90491 3280 -2112 -4117 -5341 12317 -5371 3235 151062
16054 151062 167986 193088 265505 182331 127848 93742 66732 -46800 -89894 -39567 65653
16043 65653 80976 66668 19342 2429 52796 103779 188613 154146 -123367 -276601 -179312
16032 -179312 -94772 -60737 -33486 -39266 -34364 9267 13527 -8805 -101648 -237175 -367470 -365738
16020 -365738 -295674 -444034 -407748 -261857 -45097 140104 178979 158327 159472 133811 58703
16009 58703 32425 16275 67819 5037 -71494 -158347 -84716 82912 121566 174044 174149 2842
15997 2842 10606 174169 131298 95982 201347 161405 172234 71444 24050 -73517 -25997
15986 -25997 136574 183771 107213 99121 140825 109295 177407 209456 243886 219603 30877
15975 30877 -54106 -161477 -166172 2022 32463 50069 112516 18575 -128828 -154361 -24089
15964 -24089 32917 -25939 123018 195969 206621 92547 -43727 -127269 -116604 -4987 131948
15953 131948 63603 15138 14047 11569 26099 -51343 31434 62947 -88947 -32209 78627
15942 78627 -103941 -289664 -186901 -141300 -12492 51245 -40437 7176 1928 67127 119381
15931 119381 136459 158596 39495 6292 5230 37341 68893 20250 39325 138786 145540 19543
15919 19543 -170623 -207196 -276066 -260286 -214161 -170260 -78117 16276 12777 -37428 -124064 -70356
15907 -70356 -71103 -134145 -202329 -86685 -113363 -170782 -82033 -58707 -34322 81088 67734 -692
15895 -692 -52764 -14446 -12277 -79358 -130624 -214049 -319341 -251934 -77397 -54547 85542 109106
15883 109106 31916 54977 28845 -22365 59994 144430 40667 -14949 58954 122128 23789
15872 23789 116356 177094 65156 34299 81684 191943 223955 104792 29704 30425 21343 -87599
15860 -87599 -70271 -114228 -128665 -94082 -97186 -108525 -20356 8816 8393 -59849 -283458 -331625
15848 -331625 -202182 -178628 -251227 -269717 -192587 -173751 -258229 -200083 -219303 -217932 -149682
15837 -149682 -160604 -72550 -90228 -122193 -39756 182523 310135 187142 104624 17432 -89214
15826 -89214 -102692 -191196 -101962 -96380 -108849 -41698 18580 -31008 -38950 -92219 -25171 225
15814 225 14925 144435 49804 71853 213345 257774 180542 145211 56496 9049 6655 -100273
15802 -100273 9315 218 -36723 -28074 -17215 -176782 -43484 88848 -58702 -171057 -148009
15791 -148009 -10717 -94134 -155362 -169182 -120288 -101774 -118438 -149127 -49328 -11884 -63770
15780 -63770 -97292 -172594 -160569 -57230 107861 176099 169394 173247 102643 44764 -80801
15769 -80801 -128730 -113522 -291487 -193104 -240873 -265720 -111926 53329 -7637 -48138 -49932
15758 -49932 -24804 -5741 -80295 22099 93850 146248 19042 -101369 -246940 -288765 -257396
15747 -257396 -110788 -77125 67852 209666 111793 128436 88403 -2279 48450 41434 -145901
15736 -145901 -171919 -87273 22768 24602 41898 161276 127543 -42383 41879 78528 -5669
15725 -5669 -108372 -81569 54979 16117 23888 -15444 -165204 -149876 -40132 -76568 -22611
15714 -22611 33853 121196 -37403 -88002 11750 93256 -33122 -221598 -238490 -119851 -43997
15703 -43997 -155591 -191082 4158 191574 160083 29447 -11643 -22983 -44374 13126 -118979
15692 -118979 -259089 -143832 -200860 -173189 -240033 -243820 -106261 52832 80755 -51873 -130542
15681 -130542 -117271 -47888 -31462 8198 143287 176184 -7239 53384 45805 -75519 -121745
15670 -121745 -74773 -63959 26645 71690 75075 143306 202404 141366 160821 102235 63524 30888
15658 30888 -116104 -121068 -141853 -34189 9555 -127895 -202716 -171378 -132275 -122612 88645
15647 88645 66731 157363 158359 -9834 -113988 -26206 93177 193668 129785 10833 32596
15636 32596 64952 30988 -1715 24190 -119487 -174835 -161858 -211099 -295450 -312840 -167387
15625 -167387 -175544 -102040 -75327 -33917 -128584 -225061 -129232 -171547 -232081 -309615 -337723 -264008
15613 -264008 -225458 -265616 -198719 -230018 -156123 -81975 -74086 -1591 107096 124151 118237 38622
15601 38622 18665 33026 -5680 -40345 -41321 -66974 -48608 -57877 -86076 -240098 -245921 -164858
15589 -164858 -11139 113871 185322 68552 -110334 83839 108417 140033 -12777 -130632
15579 -130632 -142337 -142587 -230482 -176274 -277182 -276449 -167843 -176365 -216034 -286526 -247672 -121394
15567 -121394 -101319 -73920 -150766 -121212 -6366 -147416 -310629 -391212 -302593 -203343 -97338
15556 -97338 -25073 27983 24143 -56770 -109134 6528 41261 -104616 -145924 -109375 -38374
15545 -38374 -11206 -60301 70750 37455 43413 -30552 -77863 -118009 -73039 -16558 -14523 -38158
15533 -38158 -15250 -58868 -135919 3716 90992 58102 176626 184588 69406 22290 42957
15522 42957 -29765 -168222 -77734 -23246 -61411 -62694 -99968 81315 39158 21600 -47209
15511 -47209 -23656 -8124 -19685 80264 -14454 -29263 51361 -27404 -22177 -46190 -123440 -35379
15499 -35379 -91896 -200423 -86157 87827 10209 -9415 34433 82685 249519 208945 18143
15488 18143 -200020 -204837 -78550 -32028 83064 209684 222294 180889 13195 13394 30053
15477 30053 69792 107623 83464 72687 -42043 -90406 -176933 -108350 -47166 77244 138242
15466 138242 64405 -116757 -268940 -75359 -33388 -88118 -120182 -73190 -99513 -68277 -40621
15455 -40621 -43495 -95730 -139794 -93941 38506 51693 -19325 -91474 -178738 -227464 -190729 -154028
15443 -154028 -122796 -9631 86628 20493 -1244 15214 43718 65535 164948 255640 213268
15432 213268 54887 87293 181349 216324 313035 347052 258427 198705 170650 -74371 2721
15421 2721 84893 130428 45804 -80304 44360 93027 103364 -45105 -144366 -259891 -398877
15410 -398877 -230449 -183254 -163388 -88040 83464 18398 -155938 20930 179607 141287
15400 141287 -29312 17520 126416 161970 264385 213813 17991 -74440 -113031 -177961 -190308
15389 -190308 -163118 -21201 33610 -10553 -36913 9826 -88273 -247745 -300937 -121383 80281
15378 80281 116134 13285 19160 93437 -12653 -34574 39920 34109 -46943 80045 141914
15367 141914 147619 97869 41258 39837 35677 39151 113206 224608 185302 155972 -23406 -235421
15355 -235421 -187088 -35013 34932 -44919 -30911 68530 110175 111132 108113 230088 184706 152518
15343 152518 182765 70186 22766 61890 28927 -9839 82646 178334 103223 84894 116479
15332 116479 148914 202751 205629 128271 126713 76036 -124013 -53989 -24952 -106202 -16869 -28077
15320 -28077 -131872 -172335 -183634 -143443 -162077 -239060 -91100 29817 19124 -68027 -119997
15309 -119997 -65156 -7275 2503 -69648 -42774 -144960 -229998 -290975 -315235 -270073 -307556
15298 -307556 -295668 -227351 20641 93291 -32481 -201016 -224386 -1534 172608 249028
15288 249028 187156 14060 106658 179062 139476 22999 899 -6589 1195 22498 153783
15277 153783 255019 253395 214121 212247 105607 -72256 -144762 -171727 -160109 -79981 -47484
15266 -47484 -63328 46900 8878 -210937 -243355 -203301 -116996 -123846 -13990 113395 16971
15255 16971 8106 -40182 -58409 -49605 41363 198694 251961 110307 -9813 -37553 -23817
15244 -23817 -34750 -150496 -116708 -252964 -259697 -193616 -163517 -269435 -299372 -155331 -123103
15233 -123103 -239075 -246160 -201516 -33811 -41669 -37484 2019 -37235 -96153 -59969 -80711 -144552
15221 -144552 -248777 -160651 -233573 -151505 2548 51260 -82468 -178918 -85334 19155 67669
15210 67669 45144 170206 69539 -36451 -124349 36792 182731 56670 -30353 3824
15200 3824 17334 26188 55207 110673 126922 12690 -107623 -81308 -32208 -34039 -11986 58778
15188 58778 -20055 -142604 -58262 -38758 -79753 -93946 -144567 -211623 -139356 -143929 -31199
15177 -31199 29068 -137430 -191600 -180808 -205784 -102746 -41815 -41468 -3584 -24326 -52988 -86360
15165 -86360 -10055 111374 67421 55316 -48512 -111326 -182892 -160972 -117644 -14372 -34017
15154 -34017 -20115 121593 138172 25277 -31718 -42338 -68206 -44315 56285 75083 12240
15143 12240 -77054 -200362 -267691 -286530 -258316 -140947 110158 18440 -3634 -61081 -80077
15132 -80077 -133811 -142847 -172014 -232051 -190571 -212364 -186544 -52696 -48542 -9046 -50220 -131049
15120 -131049 -114602 -28285 30090 -43923 -191969 -144784 -53201 61359 176756 23034 -149287
15109 -149287 -49392 -42386 -89463 -15789 -4035 85315 37331 40362 2831 -140932 -141487 36939
15097 36939 -54034 -110727 17478 -52075 -107902 -157695 -97170 -34809 -41320 63865 106702
15086 106702 219542 299733 293959 154920 36760 67369 21196 -49519 -54621 -26089 -50245
15075 -50245 -180305 -67638 65880 98762 41180 66150 30980 -64822 -166448 -101638 -74984
15064 -74984 -114056 -195001 45440 216948 218432 112116 188474 115170 -30303 -59961 -39899
15053 -39899 13981 62171 -84021 -314958 -267864 -63348 -12245 802 107847 104231 -15702
15042 -15702 -143197 -244471 -416153 -256771 -146097 -195439 -176422 -79035 -113782 -97993 -49426
15031 -49426 -48423 -116774 -144394 -97132 -105077 -119435 -88956 -189467 -141447 -67374 -137621 -84237
15019 -84237 -40083 -155902 -124561 -76468 7051 -24277 -34483 -71762 -58736 -11182 -16213 57308
15007 57308 100502 310522 643327 1045818 1268580 1191178 840453 471792 159082 14068
14997 14068 -54823 -26206 -37894 112428 52039 -56882 -17906 -8282 -102742 -72414 -89327
14986 -89327 -100436 -30150 109663 93897 34694 -2379 37090 94616 81403 94610 21334
14975 21334 -136884 -130429 -113100 -107392 -14351 139611 148387 223414 149737 92156 23846 -135509
14963 -135509 -177240 -72800 35364 156454 203729 273456 284682 89969 -21182 140572
14953 140572 287969 247296 174149 230349 161235 -53749 -297954 -257161 -267004 -314374 -142739
14942 -142739 -22002 -20128 -82287 -27647 -104146 -197996 -108579 -70926 -101050 -48800 -134541
14931 -134541 -66996 -25896 -26786 -103008 -87269 -89465 -80877 -52353 -5648 48948 84592 33299
14919 33299 20613 101514 189408 72508 15743 -16866 -101657 -139299 -28839 24098 -90280
14908 -90280 -5544 10925 -80779 30214 37268 71419 80998 114614 38945 -41932 -3077 -137637
14896 -137637 -128838 27488 68577 76474 8344 -66538 -25157 49553 38011 84995 113420 56147
14884 56147 -9345 14800 19479 -62376 -22372 -89949 -188123 -111433 -153945 -144224 -172851 -85160
14872 -85160 -22999 57664 50356 28227 35121 56556 74309 -27452 -140678 -120147 -37139 -42005
14860 -42005 -76445 -267296 -257999 -141456 -187130 -105934 -59398 -58018 7893 56582 44073 106193
14848 106193 98539 137839 134622 57019 -37577 -205925 -182177 -208824 -131588 -123580 -216742 -161925
14836 -161925 -175696 -234346 -208664 -97073 -64486 -17208 30971 60387 34077 26260 -117073
14825 -117073 -89563 83826 16165 -39749 -42664 -148841 -57431 162278 200666 186588 -8205
14814 -8205 -131837 23990 127124 105817 60808 99269 59469 -60284 -2546 223807 226213
14803 226213 204745 147864 -17031 -11456 -115992 -217014 -126007 -14076 8769 -81196 -64934
14792 -64934 -38498 -19740 24523 69739 1132 -48536 -171196 -102055 -85672 -127361 -109934
14781 -109934 -12529 17211 86023 200238 162984 212050 221738 135349 62279 133838 1165
14770 1165 -63013 94361 52829 55011 149805 83931 -17199 -294575 -397473 -248850 -175654
14759 -175654 -37642 134109 85768 -13123 -111997 -249937 -351284 -192195 -3605 -29859
14749 -29859 -27915 21391 144157 38268 -60435 -124905 -147723 28614 60338 5621 -42525
14738 -42525 -76561 -142756 -28849 228693 362411 317781 135480 36758 35401 20159 -37396
14727 -37396 -76980 -45031 -31818 24811 21075 -42660 28126 7683 61401 51695 -103689 -6002
14715 -6002 33764 63929 61304 -3781 117806 247778 268718 262113 242005 142962 4547 -44040
14703 -44040 -129316 -92761 86263 56342 -24758 -99744 -107410 -175234 -164423 -110860 -64104 38115
14691 38115 -19802 -72353 -9110 -2134 35365 168650 67709 55694 -39758 -136687 -208370
14680 -208370 -167410 -107255 18980 54723 -17755 61889 257326 109304 -60438 -104922 -143950
14669 -143950 -257233 -203545 59836 87465 -43149 9760 137716 125692 220527 172107 99823
14658 99823 10070 -85081 40591 80895 82311 143314 235414 348878 368813 250922 90811
14647 90811 35851 -6300 131461 253653 242567 222821 109290 56223 -36276 -146395 -222414
14636 -222414 -197406 -14122 102682 77874 104448 200088 222141 157959 76571 -833 -94264
14625 -94264 -21504 -27428 -16564 -31260 -20303 109405 -69697 -177459 -46609 134442 147838
14614 147838 93925 29080 43432 -43961 -17888 35263 99090 118859 46245 -2179 -21380
14603 -21380 84142 83957 56608 27753 233747 328914 244197 69266 -61156 -11134 -50424
14592 -50424 -61044 22399 25393 -76018 -69226 84386 -43051 -73293 -40144 -74014 -56939
14581 -56939 -7650 38097 -67038 -106006 -133041 -40163 32605 -53726 39452 38587 -124547 -196785
14569 -196785 -156008 -24643 139894 100374 49966 -68017 -73789 -45522 -119710 -164622 -85207
14558 -85207 25110 45544 92214 50518 -9674 15592 33364 129509 27231 -34671 214443
14547 214443 248121 22103 64719 151001 250290 151305 192108 414345 420476 284894 348058
14536 348058 392714 269621 279295 308136 410250 335405 244269 264226 358395 444727 351658
14525 351658 327915 421938 359084 286440 366244 311913 257667 185704 61762 -63346 37448
14514 37448 101224 162114 149204 4186 16839 -20661 20981 -30263 31744 65024 196565
14503 196565 217695 283191 256909 240913 246332 283072 137078 71722 -23811 -233151 -127279
14492 -127279 -65413 -32417 53278 166291 223911 238704 195308 63936 27127 182073 96209
14481 96209 -24793 -6928 3722 -39316 -41855 -20122 -51503 -187154 -183502 -139781 -201575 -253926
14469 -253926 -199875 44243 112875 104612 95146 66570 15187 -43584 -11722 -36565 -122128 -210574
14457 -210574 -232597 -205647 -96357 105192 91740 19699 29597 10416 99408 41723 118182
14446 118182 139836 67317 -250925 -315088 -212400 -82964 48588 153310 154739 69043 42238
14435 42238 12949 62707 33975 -91970 -39502 -103362 -149764 -82824 -131294 -127016 -79305 7248
14423 7248 65420 84732 -19207 -45008 -91415 -50701 -56165 -179055 -160905 31959 -20916
14412 -20916 -38702 -732 64275 82186 -51455 -23520 -70290 -85323 56433 192064 94339
14401 94339 -13193 8089 -28792 -274670 -299672 -132889 -92735 -118487 -102805 -77062 -64362
14390 -64362 -153317 -107768 -48144 25039 42191 -3612 17166 -77168 -62978 38776 -219
14379 -219 35265 -72288 -89073 -59606 751 -16336 -104036 -107172 -194944 -160939 -97804 -46926
14367 -46926 -142449 -183594 -103195 -161324 -52905 -96513 -179822 -115052 -90266 -150112 -95960
14356 -95960 12916 68699 -1514 -66789 -165048 -181627 -54574 96930 -31208 -70474 -35108
14345 -35108 61679 8195 -132694 -135779 -123756 -55900 22539 79857 154837 212117 185567 122091
14333 122091 5404 -58115 -102367 -252488 -230015 -104311 -86098 -168357 -130615 -135466 -149094
14322 -149094 -89983 -93719 -78901 -3696 16433 20065 164943 248446 290884 110379 128249
14311 128249 112386 74978 115052 49367 -103943 -142985 -143083 -135527 -51394 81361 -15084 -72796
14299 -72796 -35363 -158589 -141225 509 102247 49250 -34248 14900 -33034 28704 63931
14288 63931 -68203 -83313 -69418 -30072 59093 61492 41078 -12719 7167 149671 229608
14277 229608 158617 -21028 -116664 -1229 104365 115572 94221 -1159 47477 71049 62101
14266 62101 -25648 58033 231466 202698 121817 228630 249429 69267 91587 89195 161329
14255 161329 383423 495331 433548 265890 129813 43604 -33869 -13974 15987 42561 139226
14244 139226 137701 29990 -33121 -151273 -128513 -29924 -93291 -21768 -69299 -90761 -123419
14233 -123419 33525 238967 155562 126004 137231 105653 167122 175709 177610 217675 250590
14222 250590 378997 379066 387151 339168 278154 274150 252722 302287 277821 280775 327419 373203
14210 373203 201932 140167 96874 182649 198766 190947 99603 80721 160234 230111 277211
14199 277211 284905 225907 232330 257866 284312 314474 351231 387042 366980 415740 331692 248118
14187 248118 284525 284806 134357 121560 245092 401877 422031 284679 244147 377751 343302
14176 343302 241542 305048 267287 245045 283023 313052 375649 335891 479576 501001 528953
14165 528953 453211 372607 607380 740519 797525 765202 623600 546243 442197 436478 462109
14154 462109 526195 583647 633902 697226 798228 919290 1016066 1135689 1326233 1468170
14144 1468170 1735783 2052222 2613213 3123543 3865980 4985380 6164257 7427413 8918956
14135 8918956 10274862 11558476 12752212 13580698 13829538 13687252 13222155 12460379 11578858
14126 11578858 10337425 9151825 8337980 7718351 7338295 7154570 7306533 7840650 8708916
14117 8708916 9984128 11687549 13759655 16102740 18812438 21759083 24639180 26924150
14109 26924150 28333843 28967983 28649122 27446647 25639808 23411193 21073496 18871872
14101 18871872 17107528 15985748 15553816 15701150 16683138 18447108 20960064 24150134
14093 24150134 27824938 31606396 35262203 38406601 40826058 42227651 42321145 41202628
14085 41202628 39127936 36347327 33094614 29688975 26368906 23561628 21490909 20405201
14077 20405201 20028286 20522030 22033823 24550242 28049129 32495154 37433369 42895667
14069 42895667 48442795 53277026 56633584 58205055 57694447 55383633 51528369 46415362
14061 46415362 40710126 35209634 30404630 26294058 23181475 21305213 20330837 20372761
14053 20372761 21208831 22771506 25202016 28206681 31582893 35023540 38296487 41138413
14045 41138413 42981448 43580951 43009118 41247906 38359269 34739310 30816967 27028087
14037 27028087 23588252 20593705 18465794 17005196 16319317 16376623 17072198 18491370 20546539
14028 20546539 23078569 25565967 27850007 29755070 30756833 30863403 29857693 27952487
14020 27952487 25515602 22612464 19432620 16481376 13920588 11865583 10388084 9195952
14012 9195952 8267007 7941830 7966428 8246831 8792841 9467762 10334355 11501439 12666294
14003 12666294 13594358 14318159 14743518 14704402 14281246 13443099 12189860 10761654 9263791
13994 9263791 7745482 6389868 5271911 4395482 3604170 3002518 2585634 2159631 1852940
13985 1852940 1628165 1734620 1710107 1412558 1274047 1263758 1172138 1273528 1079373 947590
13975 947590 961649 930266 931623 932215 848303 809340 681621 594457 618836 622370 645265 584869
13963 584869 477202 399924 490763 628273 519167 376948 359312 334395 363815 388868 443290
13952 443290 526588 490639 418021 436617 443527 294831 323177 325541 294741 268716 239436 197222
13940 197222 217982 183791 174751 174446 199097 220754 245637 306778 230749 204207 299183 210394
13928 210394 246104 335248 169951 173326 289272 361127 424682 350779 174802 215444 279450
13917 279450 302427 242512 167540 109032 42218 86736 198303 251154 117672 107278 85514
13906 85514 138850 167480 171044 133402 120379 36296 68605 288540 383973 295174 257888 246247
13894 246247 165591 40588 -3988 119952 274269 212538 197099 179050 151482 84655 127097
13883 127097 99353 7462 15257 48846 184978 346366 343124 374083 372642 352565 314832 168749
13871 168749 212894 231791 149207 128236 230200 284772 309005 171703 156280 241666 240930
13860 240930 295137 279517 268825 283244 90256 -62336 60614 153499 135432 146592 301616
13849 301616 369619 372066 355831 193294 91799 83451 127340 304018 359377 239322 112622
13838 112622 108662 163590 285178 261364 198533 247221 319719 325291 202207 3207 -83871
13827 -83871 80139 52746 73842 101024 54022 -94240 -125374 -66090 55919 120563 170674
13816 170674 168457 189058 198679 98975 56662 205270 345867 245862 199372 219467 116545
13805 116545 -34576 -123113 -197421 -57251 -59892 -53723 -18147 -27332 87185 143810 10560
13794 10560 24765 196513 94305 -85315 -183921 -73179 -33715 -90903 -93115 -66814 15272
13783 15272 -48887 -5116 37367 50469 93012 231425 142713 7663 20887 27793 70725
13772 70725 40026 147789 232696 146474 117512 91749 156336 259665 180115 136419 136187 1918
13760 1918 -54021 -108353 -90467 -124362 16530 127306 114389 43443 -13955 -49309 18957
13749 18957 -109220 -173419 -108901 -37574 -11312 -138702 -165033 -114810 -47706 -59743 -169623
13738 -169623 -204716 -315756 -318903 -224088 -120756 -69902 139754 230003 46919 18575 -71951
13727 -71951 -81546 20225 218627 307668 175505 -22984 -66439 -127278 -309329 -221165 -214730
13716 -214730 -249058 -146970 -95103 72335 191724 290053 315972 282106 269633 200275 58711
13705 58711 81481 60617 26435 -50112 -116474 -132080 -17256 52571 -51794 48811 74101
13694 74101 66588 168360 132379 116762 153542 45368 142633 172996 74062 49061 24431
13683 24431 61595 161331 154937 76682 38442 -48694 85202 71309 -46652 -112753 -109916 -15129
13671 -15129 -2878 -78984 -100320 66927 160838 164442 8240 48335 27869 -16046 -270
13660 -270 181983 113679 98818 -10435 -38817 -10129 33291 59358 83421 33715 72268 157592
13648 157592 258157 279885 206433 212212 207175 222388 209448 218047 321029 259985 220212 146633
13636 146633 245580 163027 162298 236605 355363 339632 280732 306352 234461 181058 52141
13625 52141 109758 72638 188824 160616 99807 230678 253277 172616 138083 116606 180751
13614 180751 213555 126773 -108105 -59809 85430 6571 39816 227739 282121 252779 208687
13603 208687 162095 346732 396212 432420 404283 365271 231313 287977 315700 293241 226404
13592 226404 145241 58340 -13658 55254 202050 277366 274957 237953 259507 317303 375904
13581 375904 336772 294662 154507 -5516 -20194 104629 199536 302703 309293 259867 311044
13570 311044 266547 179949 109030 150715 221806 115914 148821 184653 75588 22576 118532
13559 118532 134017 26452 314 136204 91062 82412 175236 133988 113447 64736 33148
13548 33148 35593 -30334 -54418 -80113 -62451 -159030 -87925 19609 8010 111675 173209
13537 173209 79472 20550 111950 175676 81925 -38974 -61607 -82245 -215083 -296006 -221435
13526 -221435 -194480 -106213 -153100 -348497 -282751 -242279 -176151 82430 180266 145509 124426
13515 124426 223205 199129 212136 124781 -86821 -147972 77244 56464 18489 26221 -106032
13504 -106032 -98329 -16099 -88866 -127940 -17577 19871 68173 -29255 4085 4133 27435 34663
13492 34663 58341 195556 229716 85149 64384 -34302 -4063 13287 -84519 61165 286332
13481 286332 221481 81612 2657 -35643 11011 151467 92561 73077 119214 161000 108444
13470 108444 53206 139002 30059 47124 -10541 -15535 21181 -13551 -20403 7995 11195 128848
13458 128848 119507 194718 246693 287374 154157 106174 125787 166555 102295 29040 94054
13447 94054 75777 131016 80490 173523 257991 220882 181079 303768 354639 247335 203790
13436 203790 218735 207609 240984 242237 264316 231363 152426 238589 192167 62703 -5291
13425 -5291 6761 -22788 -13640 84528 44023 57687 131082 236178 208748 312757 312966 260104
13413 260104 314025 322475 329284 313603 262184 246715 109797 155294 207736 193297 256995 246257
13401 246257 120141 38964 61696 251832 349576 253568 130871 90860 104147 176017 277770
13390 277770 359408 311553 138830 67317 282411 372720 170930 73615 103751 86741 74166
13379 74166 91383 29629 80058 158002 353230 450397 391392 407816 400828 440482 528695 420851
13367 420851 422940 335560 312728 312356 450484 488745 519497 541180 465127 361552 401132 442813
13355 442813 345832 235756 245270 321380 237378 249995 228705 224999 407281 557617 589146
13344 589146 544172 548082 581435 553592 577602 483250 495795 537472 300465 263378 445414
13333 445414 438666 325677 189203 181917 126878 152845 147639 169725 64982 -6798 159055
13322 159055 296515 271834 177561 230760 448882 576222 549149 660311 668500 612256 541395
13311 541395 490336 315000 204641 178677 214291 137770 135266 179943 231954 213524 146492
13300 146492 236879 304649 317920 305542 303254 183159 175582 106131 28132 72571 137995 171451
13288 171451 114261 -23465 -358 52217 94905 255464 341228 413872 243231 200179 85438
13277 85438 -7691 73684 103579 173240 263217 286509 268534 216157 252590 197184 115780 106185
13265 106185 66457 75216 93042 -31268 51151 282845 357031 357078 226085 107556 123702
13254 123702 158018 213055 219892 198220 299146 345170 275904 134797 121310 102355 156800
13243 156800 106347 62222 78418 246630 325418 306600 324879 215302 84292 221936 362934
13232 362934 294633 129088 -83525 -237135 -140452 -14783 27504 129318 -34794 -51155
13222 -51155 163932 195523 96015 -31934 7846 10614 -122399 -100331 -27724 45398 139267
13211 139267 24721 -73098 -67200 40507 190723 139520 134029 77347 47990 121066 88062
13200 88062 65279 -20317 24550 67039 115569 90171 -41157 54806 109947 60228 94784
13189 94784 53111 122763 92455 172409 17252 48029 132537 128541 71725 161513 238695 151815
13177 151815 125132 172315 144944 172904 199795 167678 20500 -2309 24269 122309 146053
13166 146053 119774 118775 127791 114723 121777 -8021 24224 60280 146502 225478 181674 52107
13154 52107 -14630 -168176 -207853 23199 160881 261457 289868 257421 166055 176151 208054
13143 208054 323745 284851 315728 289674 245308 313924 354134 367038 287961 174798 91680
13132 91680 147276 261277 256076 220555 252740 127967 41087 -45000 -914 12942 27442
13121 27442 172397 212529 123381 96437 -4426 -5953 73723 34348 -16907 41031 118551
13110 118551 126501 225695 328434 400005 423069 277866 298234 314676 232981 156909 122061
13099 122061 177807 405517 512648 391012 340375 396791 405053 445129 428925 279281 224720
13088 224720 298736 332169 255674 269164 295920 230775 191334 86072 106601 166694 176360
13077 176360 62293 192250 328350 453886 381895 363248 347380 314421 290928 361084 459338
13066 459338 391405 309088 303653 213754 239842 346795 427070 363347 376997 491783 488547
13055 488547 419086 461287 445256 313946 265889 394619 612724 585579 588353 451890 456036
13044 456036 575546 613014 454754 529050 683978 689147 759389 698281 670812 606617 574225
13033 574225 517866 498158 639447 673561 622668 677389 698070 651354 548424 517789 680699
13022 680699 752815 715094 811295 916977 1047530 1087241 1067297 1246475 1391729 1484222 1467851
13011 1467851 1470539 1580690 1655080 1689771 1784661 1848101 2034756 2232148 2361144 2529666
13001 2529666 2714759 3082154 3564935 4000967 4665552 5358285 6096912 7000335 8241446
12992 8241446 9804567 11671065 14058239 17162522 21213556 26048599 31704971 37591570
12984 37591570 43072522 47459905 49924821 50305568 48460571 44917687 40341355 35285411
12976 35285411 30089046 25276175 21618979 19068783 17354652 16564385 16697327 17628568
12968 17628568 19294979 21850361 25589102 30340894 35960049 42027055 47595238 52221523
12960 52221523 55434630 56596561 55107754 51519841 46364326 40408778 34350093 28657041
12952 28657041 23724868 19828164 17078833 15444566 14568174 14240167 14458318 15274870 16533644
12943 16533644 18561123 21239807 24665387 29030879 34125071 39588037 44815096 49351145
12935 49351145 52734317 54624836 54619423 52698651 49218413 44736887 39875451 34893695
12927 34893695 30251531 26599673 24182057 22973858 22958050 24156102 26431407 29950608
12919 29950608 34650786 40915693 48497726 57168445 66789243 76928971 86957178 95804825
12911 95804825 102419706 105980529 106146676 102930984 96472962 87861324 78101116 67869736
12903 67869736 58169035 49506059 41987304 35933781 31490547 28380254 26692010 26420471
12895 26420471 27454043 29880605 33858223 39188122 45244043 51608791 57971292 63523558
12887 63523558 67555979 69428208 68751684 65865429 61112855 55091752 48244327 41350912
12879 41350912 35276940 30011701 25778560 22818729 20631493 19220935 18702804 18823587
12871 18823587 19848725 21829904 24740183 28993855 34563698 41174382 48531664 56104495
12863 56104495 63063747 68606790 71872319 72109431 69330280 64234286 57621171 50168586
12855 50168586 42817739 36389820 31082555 27161045 24561431 23072581 22544524 23051811
12847 23051811 24617907 27556498 31841685 37279188 43820294 50642071 57129309 62885965
12839 62885965 66938589 68332124 66834212 62555577 56181085 48825104 40928035 33413130
12831 33413130 27113786 22067911 18066716 14886102 12401906 10618416 9074664 7938449
12823 7938449 7068391 6294486 5779858 5324343 4780368 4609912 4355411 3873850 3501305
12814 3501305 3260107 2816639 2532943 2368058 2342429 2211724 2002905 1879861 1868701 1707753
12804 1707753 1527304 1378196 1322344 1327775 1331300 1295576 1360412 1525157 1528804 1557014 1505807
12793 1505807 1418148 1350740 1365253 1269641 1268125 1236755 1254826 1178019 1105106 1095429 1028333 930250
12781 930250 819935 765024 726517 652291 634493 718228 686427 667084 676011 647149 580860
12770 580860 608645 515085 503019 710595 785938 742576 743608 648149 560803 668196 599039
12759 599039 596549 618947 618318 561537 651620 594116 609317 642532 612398 552690 606467 554571
12747 554571 683128 765549 718569 790742 742190 664104 620001 595243 575633 400965 317034
12736 317034 443989 456637 439731 494676 379572 408615 386050 369858 315192 267956 251366
12725 251366 219078 322108 425487 348102 381522 326219 413341 477870 452868 338005 286117
12714 286117 426008 361736 303652 384283 412267 498651 530252 383202 310006 283570 297945
12703 297945 288578 199903 226789 200626 122726 95871 16046 9684 83998 152205 205406 331187
12691 331187 444215 248566 93330 158848 143956 173517 214029 331103 235113 159654 271217
12680 271217 313964 347979 426792 339289 359540 451376 494005 349800 184219 258019 198482
12669 198482 319325 520423 487631 427669 367179 377560 366614 346478 236112 194337 208150
12658 208150 113444 158066 158455 220610 257346 150282 -14702 40501 58594 57334 88548 130945
12646 130945 264981 262464 170415 143643 313939 386336 405969 370452 440167 403617 420320
12635 420320 350013 195224 189213 198995 185700 185780 215531 103084 86539 176196 155655 1672
12623 1672 -100021 -80316 127068 232734 174024 202629 104496 37315 111785 212942 223563
12612 223563 197952 32713 45437 138308 100152 86741 148939 -1842 49901 148037 116630
12601 116630 78345 98886 8510 12886 4643 54439 18924 81652 154667 312425 358646 223159
12589 223159 271518 316582 236086 222578 275822 305137 202787 -11260 -56012 45478 -18356
12578 -18356 -11774 68448 192496 126933 75548 184580 305129 350178 463160 398967 308070
12567 308070 355407 261792 160156 224074 320975 346071 239381 160695 151108 80614 186119
12556 186119 290994 362135 344484 225993 165723 147299 133811 19173 55989 148185 227226
12545 227226 280765 220978 297896 331740 406516 365527 345368 487529 603681 498369 332074
12534 332074 220283 288638 274888 171423 159162 158635 104279 284913 318848 359544 554539
12523 554539 620704 548783 425788 463185 482920 541659 485543 472543 442088 302659 308384
12512 308384 339417 320428 161074 115147 204984 268444 282296 323719 215931 302287 438657
12501 438657 578631 585764 482733 661132 670537 536896 648520 583449 485872 527681 567419
12490 567419 480292 535714 630584 553287 497327 385366 264870 345179 604470 704981 653321
12479 653321 525642 531412 589477 658976 704387 878720 701749 619167 570708 566787 584665
12468 584665 586429 511182 622518 642978 701677 726357 803200 766857 792763 712984 661240
12457 661240 662730 792041 876432 983556 1224427 1403843 1419626 1439415 1496046 1485145 1534821
12446 1534821 1650834 1595962 1561709 1555399 1481274 1386567 1346040 1468598 1613530 1813431 1951837
12435 1951837 2286621 2574273 2732771 2908094 3084098 3427417 3929442 4422621 4923337
12426 4923337 5488022 6074635 6821380 7989042 9216823 10784456 12916129 15572064 19007584
12417 19007584 23466992 28975741 35677265 43480270 51920136 60059783 66364523 69468215
12409 69468215 68610139 64030629 56589417 47948519 39812023 33039360 27896453 24322601
12401 24322601 21703208 19975454 19099329 19032557 19659227 21189890 23582380 26977773 31499572
12392 31499572 37212660 44051478 51739204 59924121 67658174 73896860 77153608 76823404
12384 76823404 72607082 65547658 57087164 48492122 41181551 36024431 33025698 32093275
12376 32093275 32905800 35610154 39921874 45553074 52325026 59608265 66685165 72348145
12368 72348145 75252950 74931079 71324110 64959014 56964400 48444111 40678631 34083032
12360 34083032 28951397 25354333 22919966 21631138 21301037 22004951 23651229 26181593
12352 26181593 29792438 34732251 40840392 48284124 56616284 65037606 72965447 79920765
12344 79920765 85348134 88717417 89971309 89293578 87523155 84949570 81631935 77510897
12336 77510897 72273148 66076773 59319594 52199067 45204504 38790128 33053194 28302750
12328 28302750 24677582 22053521 20095472 18960794 18586983 18935407 19881172 21689643
12320 21689643 24428985 28188254 33164662 39133339 45382593 51251023 55662480 57922897
12312 57922897 57536458 54767591 50106687 44468065 38703852 33665887 29547867 26497641
12304 26497641 24642778 24105284 25154137 27962999 32287695 38100522 45149459 52253211
12296 52253211 58376572 61879772 62318769 59616881 54425596 47894406 40892271 34376911
12288 34376911 28941895 24435872 20834698 18311768 16525155 15313545 14864892 15020899
12280 15020899 15940450 17563011 19808583 23155578 27509078 33238840 40114187 47254232
12272 47254232 53416146 57175547 57632687 54491676 48833521 42025196 34886311 28337950
12264 28337950 22815867 18492714 15217898 12758657 10717267 9075045 7606465 6538806
12256 6538806 5603145 4990181 4453994 4198986 3856787 3479866 3276328 3015322 2712579
12247 2712579 2513690 2225396 2008761 1971421 2017562 1942266 1700682 1534954 1351630 1402384
12237 1402384 1379993 1265749 1245367 1104381 1029279 992584 948901 952839 896058 762352 625508
12226 625508 595583 564654 635367 734584 636042 586276 662525 758993 627058 527117 504652
12215 504652 500876 566593 600726 505628 538940 554880 493366 457798 451389 396335 613936 633550
12203 633550 540047 356633 294302 324940 227932 226105 270697 351816 338138 247234 240124 240066
12191 240066 360065 322643 352849 433418 509208 579627 581810 483026 352284 349091 302175
12180 302175 116862 -40956 11093 133444 132920 169919 13790 42713 221768 277791 342038
12169 342038 355546 299792 243911 277265 75462 -48693 -42037 105848 181861 216450 129149
12158 129149 91529 52852 6503 43544 90430 101971 28647 67063 44799 -8599 -36113
12147 -36113 154816 279760 302196 131631 13633 -70789 -114293 79779 276521 252255
12137 252255 147888 173278 92731 65892 112161 121392 206361 311786 303118 390427 295341
12126 295341 158849 138893 225434 158176 196539 209412 265417 235036 139883 214378 151334
12115 151334 58536 -7580 44097 153320 203696 222639 229767 207222 304359 312927 340487 433454
12103 433454 287766 183674 181465 254972 247017 234054 205400 151827 12179 -183255 -174839
12092 -174839 -100387 -40475 -42936 -28118 -143720 -131925 -71396 125492 238680 148055 101171
12081 101171 114154 104797 -12059 10259 146957 262318 138265 -104960 -176360 -300908
12071 -300908 -155374 -69170 -53976 -32068 50978 -34786 -32292 -108825 -127216 -38118 84662
12060 84662 163619 305770 296490 153160 154270 221519 256166 366424 383504 116591 16987
12049 16987 41352 119014 120337 -6049 -114764 -24342 126199 102635 -1423 112825 258117
12038 258117 197436 77919 37620 34287 -124292 -109290 4436 85644 185088 146301 19087
12027 19087 -2683 -79927 -110670 -51349 -24535 59164 32254 5809 27001 67408 65762 -66656
12015 -66656 -81403 -205019 -140029 -16589 -31001 -201268 -136251 19291 -31360 -64522 53467
12004 53467 35566 54056 112898 153675 102824 43204 106646 72078 -59904 30967 112155
11993 112155 161046 127898 251851 303223 112294 -36236 39637 54428 4825 5284 60653
11982 60653 48781 -77143 -87501 -160336 -143381 -95969 -201474 -268638 -285321 -221324 -72125
11971 -72125 -11849 -40507 72924 -14221 -36540 64160 30853 103104 20729 78348 21119
11960 21119 72335 224713 296036 273785 336755 255933 268280 366558 377422 364029 252381
11949 252381 328601 244301 247776 217404 144548 195441 64229 -55292 -19584 -41193 3085
11938 3085 147579 216446 265447 311366 441679 482244 531579 471604 399960 228575 119393
11927 119393 190909 222900 127874 26945 180679 296329 390026 394819 373357 463932 501735
11916 501735 490936 500174 420522 363386 349406 176617 153221 150861 176398 212521 266200 270474
11904 270474 147075 53106 112627 127962 131078 129450 74419 222613 339865 314208 347902
11893 347902 420392 447508 426337 481524 556860 446569 467289 505663 488032 398479 410802
11882 410802 448438 332129 240278 288237 329154 264255 235948 229991 160618 87844 121238
11871 121238 24156 -8271 57641 198116 296226 203110 206244 204282 139957 85880 141132 328055
11859 328055 447157 294174 268381 213445 275958 260048 180129 142426 199921 210456 3732
11848 3732 -147152 -168025 -80413 -55115 -16830 190776 404423 414356 371065 271197 250033
11837 250033 384767 452810 401550 233520 251700 180518 128188 145503 58135 -149430 -145717
11826 -145717 -134859 -109886 -60919 20466 110469 251605 230989 78500 53682 33127 43815
11815 43815 132142 285869 330402 277317 179698 119395 78090 -60629 -57649 62149 4701
11804 4701 -51678 -160231 -114278 12608 -36312 -174590 -188176 -105147 -99202 -230151 -140895
11793 -140895 -9547 26343 -36273 -62638 -141812 -126013 -149479 -160292 -21390 9639 77120
11782 77120 198849 216784 242282 222841 199959 156895 224164 149166 -60722 -91782 -101822
11771 -101822 -74360 -19946 -79703 -42135 -210781 -193144 -128507 -72773 -151532 -143318 -271045
11760 -271045 -321191 -276922 -38540 23416 165521 60990 -99716 -71494 -63477 -46 16008
11749 16008 50025 67753 29192 -3495 50356 49489 -15532 -104533 -238883 -297745 -142179 -101327
11737 -101327 -25292 -87297 27770 204106 233203 180835 187367 50127 -28497 64879 -66643
11726 -66643 -168921 -130787 -31905 -15001 -125858 -87730 15716 11487 74028 2821 957
11715 957 -10630 -94125 -92830 -202339 -213088 -21635 83321 67620 -19977 33722 39802 -69927
11703 -69927 -87544 -36444 133033 180800 301297 249642 223191 118901 40017 -52458 -32184
11692 -32184 13500 -98261 -57526 119843 99725 -213936 -251414 -25116 113175 96903 52844
11681 52844 1381 -68960 8493 -37876 -8530 180312 204489 143779 136736 -50785 -174204
11670 -174204 -161480 -174155 -202192 -197043 -215726 -130093 -189660 -194983 -77476 18103 42255 -63364
11658 -63364 16870 68332 3559 6988 -22030 -49113 -39417 25468 -26898 -156890 -227300 -128001
11646 -128001 -100776 -47887 2015 20207 11878 39633 83183 -1052 32718 -37999 1698 18776
11634 18776 -74242 -91013 -107171 -29236 -43447 8832 12593 -94571 -87007 -68862 -59202 -37648
11622 -37648 97173 104758 129594 139700 98157 -139315 -50727 -106366 -188903 -44920 77845
11611 77845 52600 -50335 -143895 -94216 -5003 63746 129107 244035 331275 264402 159550
11600 159550 208686 208436 78950 77252 345502 610498 810940 968020 916220 899784 781956
11589 781956 563942 466930 356879 238678 181029 138328 148711 204931 260309 183509 130045
11578 130045 -30229 -45916 32462 -74406 -130725 664 77635 64441 112492 123842 79203
11567 79203 69746 -6215 46313 134514 145532 325399 440365 424015 257330 55121 95231
11556 95231 191956 43490 -202971 -231436 -151487 -102196 -126543 -83936 -6812 -67682 -149953
11545 -149953 4044 23040 -127825 -56266 34569 184504 134185 -26647 -121467 -113466 -27100
11534 -27100 -70034 -86111 -105293 -25949 20833 -16635 -26879 103504 233622 215650 128209
11523 128209 -26710 -104175 -33649 -142902 -98782 -20240 -17127 -1349 9306 -30054 -42576
11512 -42576 -34989 56830 141632 146356 90085 -33816 -56094 2945 -91105 -69482 -58397 -117218
11500 -117218 -110436 -84221 -74230 4031 25484 72174 72907 34979 -36517 14614 -16189 26616
11488 26616 10616 126409 -37196 -204715 -175373 -98260 -1114 68894 125799 118867 171908
11477 171908 85245 -37910 -90665 -76887 77915 144007 109338 -39432 -101789 -203491 -178093
11466 -178093 -115917 -67149 -169560 -181343 -279327 -287964 -345440 -275858 -143076 -149213 -247262
11455 -247262 -403854 -281542 -28414 50703 4268 48922 163618 160486 147991 229142 140311
11444 140311 -1846 27852 173525 243975 192147 205306 261488 330556 485633 641226 788121
11433 788121 929697 928269 781694 631796 412582 258544 225433 217314 118149 43575 99907
11422 99907 33919 -22930 -62496 -108997 -206309 -165415 6834 44517 -45991 -80538 -97585
11411 -97585 -52302 -165533 -204307 -212685 -256497 -263379 -328596 -406533 -379323 -285376 -110674 -31329
11399 -31329 25101 94715 112848 -1320 -135538 -116174 -11662 -69039 -165842 -174406 -164750
11388 -164750 -211219 -50387 11162 -1485 -55432 -107418 -20406 -28240 73400 128863 98352
11377 98352 -4003 -28814 -172601 -301359 -253271 -121541 -57116 -3932 -78797 -149339 -199918
11366 -199918 -242683 -109071 -66012 -182834 -233611 -268112 -169271 -67731 -116578 -221565 -282554
11355 -282554 -215487 -144054 -63321 78526 133794 67943 -15983 -1515 6881 99160 51660
11344 51660 51287 22312 -18535 -1550 -39192 -154457 13811 116947 40420 -26831 -33623 80435
11332 80435 84303 49792 111737 128654 107269 -73216 -111278 -68937 -131927 -181404 -210805 -233876
11320 -233876 -112512 71302 98556 38662 58280 -15864 80994 44139 14784 -27278 -11311
11309 -11311 2202 19304 66208 -54644 23986 93735 -17040 -81099 -89437 -145502 -190549
11298 -190549 -240661 -235969 -311002 -339298 -184720 -107000 -112258 -83751 -177828 -209282 -50880
11287 -50880 31505 -25595 -87794 -97242 -210558 -127525 -55762 43943 43196 7816 -18221 -48512
11275 -48512 116856 243349 337720 333734 275579 118443 -85422 -71676 -60891 -89942 -185475
11264 -185475 -214100 -340894 -364987 -304468 -204696 26295 172666 223846 218913 210070 214474
11253 214474 30349 -119285 -208256 -215734 -112009 -140484 -85355 55797 97514 90557 -36512
11242 -36512 -84662 67088 42739 -211257 -199076 -88786 -8081 74373 95513 -29326 -76850
11231 -76850 -64282 12583 51705 -109010 -63726 -24701 65088 55603 9184 -94025 -229185
11220 -229185 -146790 32583 35797 -67948 -129560 -164896 -171518 -273179 -246785 -252032 -221624
11209 -221624 -218144 -237164 -190081 -151437 -78301 -101691 -74080 -161554 -80490 -87883 -158739 -374940
11197 -374940 -377984 -165136 -143619 -10703 160616 231098 210090 115956 97695 40096 -77306
11186 -77306 -133958 -143587 -138089 84673 95741 140337 248704 273190 256308 221166 250537 58611
11174 58611 -82254 -90025 83986 174721 96322 -66545 -186321 -113337 -62032 -167330 -143132
11163 -143132 -10784 -61427 -106440 -136978 -172654 -159688 -156392 -92847 -31793 -186291 -216486
11152 -216486 -148317 -84998 -79980 -4552 60534 52365 49531 60935 19395 -12520 -26254 54069
11140 54069 59366 63270 72042 5999 -2560 -93783 -149105 -141597 -161026 -291177 -226818 -180653
11128 -180653 -113390 -82404 -39897 9886 89576 -15991 -100394 -100310 -32381 -12058 -51706 13269
11116 13269 26050 114992 33550 2814 79324 75767 80101 -69087 -104764 -236821 -206733 -163603
11104 -163603 -7074 -58695 2156 72049 6424 37439 107064 -55108 -113829 -83231 -83256 120641
11092 120641 298694 101612 -94809 -140992 -93845 -79357 -20998 -152 651 -58305 -109567
11081 -109567 -119037 -89480 -107479 32643 20995 -22110 143593 163592 23513 17565 -77636
11070 -77636 -120889 6234 -58437 -84371 14430 24058 -61527 -123094 -132855 -323728 -345178 -225007
11058 -225007 -77849 -123597 -161181 -56575 -151147 -292902 -167400 -24856 70545 -56158
11048 -56158 -88580 -92983 -32817 22952 56527 180773 210525 200587 176273 96246 119982 99833
11036 99833 135845 4130 -84760 -88373 -83785 -87418 -157724 -48123 -67732 -132123 -63986 -116116
11024 -116116 -107792 -31609 -74371 -249665 -184164 -97492 -18673 -15059 -123202 -132804 -105300 -191863
11012 -191863 -203818 -162491 -173325 -107664 93409 287146 304223 138382 89739 115404 92630
11001 92630 50829 33129 -38808 -174908 -207338 -145479 -91057 -84784 -71249 -4389 127237
10990 127237 271639 217348 245195 330128 291627 150651 61594 -35967 -31226 48564 -23240
10979 -23240 126568 136196 35100 -10832 99290 97636 73230 68460 -96478 -87864 -9549 10669
10967 10669 -73312 -33683 9755 62794 24951 26995 -80868 -120140 -61567 -21500 19568 31563
10955 31563 148275 151074 154629 137905 130967 193718 201277 39169 -74022 -17856 -25754 -78282
10943 -78282 -214875 -345939 -318173 -244177 -82532 -71957 -196555 -99722 -53027 -87467 -109114
10932 -109114 -32061 -79107 -150578 -169281 -91054 832 13774 649 -62015 4629 51403
10921 51403 19582 68723 26290 -99517 -101440 -53166 146521 63512 -97924 -175735 -63911
10910 -63911 8299 87018 -7184 -170634 -55699 42387 -67655 -264188 -299281 -193691 -70660
10899 -70660 -161870 -140662 -91473 -197755 -229353 -160642 -76044 -27141 -95340 -118981 -62259
10888 -62259 3096 120764 40166 23780 55240 -24473 -48810 -103671 -8986 -5981 -193734
10877 -193734 -137849 -56016 30586 -13217 -21457 27529 -46251 36238 -34710 59423 60515 32798
10865 32798 -80085 -138607 -9305 2016 -199753 -241505 -321068 -279005 -205751 -108474 -122643
10854 -122643 -153233 -180483 -274655 -382231 -366480 -168296 -106207 -74380 -115283 -173442 -140128
10843 -140128 -72580 -31021 -77541 -164679 -261134 -161895 -15741 40664 67565 47196 63271
10832 63271 26927 -203145 -257724 -122957 60148 150015 43561 -87456 -159030 -212913 -236051
10821 -236051 -105623 -88130 27637 238853 254354 237424 75091 5376 21549 11282 -26197
10810 -26197 43038 106380 86882 122937 130869 93287 30930 92266 64322 -6873 138357 146888
10798 146888 150170 234046 187737 131961 -37001 -140534 -156233 -20074 23345 -38101 -36294
10787 -36294 -283671 -374653 -163807 -65679 -59514 -92811 -148406 -57407 -107077 -204785 -197835 -160402
10775 -160402 -37027 97860 161628 94737 96799 132968 18339 -2592 -20182 -30381 -105312
10764 -105312 -197234 -174156 -110367 -88483 -99441 -79257 21809 166422 147127 55216 -93430
10753 -93430 42169 142480 35158 32020 -98109 -103062 1182 -10326 -81972 -78990 -136072
10742 -136072 -99483 33341 71298 -49282 -58240 -106916 -162831 -67008 -47772 8073 9608
10731 9608 -104107 -146812 -163581 -188852 -290637 -277284 -273055 -223757 -240251 -196769 -11521
10720 -11521 120310 117055 22205 79983 -94488 -267398 -130256 -37749 27480 83703 137605
10709 137605 -15897 -174385 -298933 -209083 -101569 -109621 -32315 138850 137463 120699 216517
10698 216517 308592 343089 257908 85096 -81792 -184654 -264983 -226270 -108567 -47171 -89914
10687 -89914 -135963 8370 128079 197464 210982 111011 -46931 34365 79536 51589 179305
10676 179305 120529 1998 43474 19869 -51782 -23033 1675 85162 40199 139483 214638
10665 214638 268947 257636 178438 169516 243305 211564 102196 -54076 -1964 79192 -17206
10654 -17206 -230325 -167157 28906 104227 124684 48656 -116305 -183198 -153554 -98765 -90966
10643 -90966 -42687 -77177 -83442 -89505 28641 143184 -5490 -17958 25862 152747 203502
10632 203502 95587 8207 -40092 -28198 -42563 -33796 24918 48317 -48203 -57376 -118062 -70539
10620 -70539 31141 -50104 -102905 -119403 -5096 2906 -48535 -25630 18201 61242 67360 85409
10608 85409 16502 -75691 -155971 -201997 -155856 -109631 -91482 -40157 -46398 -70222 -49874 -93445
10596 -93445 -235882 -262584 -197876 -212992 -180511 -117462 -157234 -135899 -146699 -94882 -82074
10585 -82074 -47950 -105037 -9797 179107 245284 110860 -29820 21039 -15781 -103547 -83617
10574 -83617 -86467 -110529 -203861 -173638 -90261 -156723 -128188 -87360 -140993 -107322 -88907 -8551
10562 -8551 37750 -86175 -146683 -35727 -957 -70879 78632 132737 70358 46151 135862
10551 135862 233957 297983 172452 182333 222288 138331 193500 60677 -112366 -129820 -132959
10540 -132959 -79851 -7484 40893 156306 156801 12529 105003 -9815 -31906 -36359 -53396
10529 -53396 -86855 -139395 -41501 162194 260812 193448 8155 -179530 -121330 -47481 -101240
10518 -101240 -144943 -125065 75674 -33960 -254750 -299751 -249764 -195173 -119669 -39632 -3528
10507 -3528 -90518 -210601 -48992 -35804 -117180 -121346 77391 -1343 -15850 101829 202551
10496 202551 182867 131326 144453 141755 122851 186024 127881 -10475 -154790 -140810 -19991
10485 -19991 173343 148360 3382 51577 164073 30549 -103478 -46662 38629 66907 33404
10474 33404 32823 194349 289360 187480 196048 316792 375251 320087 171226 61365 -6530
10463 -6530 -51112 -63225 8241 249548 288156 208134 105318 122765 8604 -67274 -77609
10452 -77609 -4113 -25256 149086 323589 301849 224868 94584 -22389 93555 269783
10442 269783 360582 252745 254629 213488 125629 170431 116847 179186 293734 315768 264417
10431 264417 251582 189935 35089 -103844 -34505 86018 281834 375924 294995 185586
10421 185586 201758 231576 174333 184531 354912 326667 309572 201562 146184 10323 -100191
10410 -100191 -54949 71986 106331 46794 84893 93885 -30786 -83405 -39747 -211745 -422328
10399 -422328 -460894 -311619 -231464 27218 138971 101485 57537 89619 102577 -40972 -62412
10388 -62412 -126252 -149929 -81016 -66242 -141109 -164637 -148957 -20968 -41842 50563 275814
10377 275814 246767 123550 -62452 -55952 55511 -24372 -23230 40692 19428 114834 219462
10366 219462 325925 168782 20904 -81747 -33837 -16748 -54498 -175748 -198636 -239418
10356 -239418 -95969 54162 185887 121365 147000 158149 3079 26169 161774 153345 159622
10345 159622 274822 401445 354269 368504 310821 182582 216886 242678 333762 487582 471125
10334 471125 298199 182602 198310 34983 33706 174406 233180 308351 507709 580048 564436
10323 564436 378555 416497 338589 372261 480482 387596 363581 432568 459431 317013 233639
10312 233639 310499 323294 275947 290707 387081 285212 212281 197667 92726 121523 88440
10301 88440 103428 233463 357011 364839 197514 155880 214764 161651 110721 146137 430318
10290 430318 593834 526099 514079 460145 312719 234512 223990 386977 532581 527778 470498
10279 470498 390272 401987 391354 345236 427411 356209 299358 336298 362224 365079 347648 281855
10267 281855 201995 183667 179746 272468 341673 293241 203973 223974 274221 363842 339038 254052
10255 254052 189998 120708 123263 -5164 132103 246347 213824 244038 256168 272868 191928
10244 191928 240606 260457 227883 159940 196559 285987 292617 365523 533525 504507 438749
10233 438749 398050 345202 370504 463753 518189 469222 385585 409374 320012 176821 212309
10222 212309 175515 212606 289629 295380 278987 375933 381817 304821 228737 142386 205687 291926
10210 291926 208738 93392 47467 103824 218671 388378 398325 361785 323021 299241 252992
10199 252992 368206 406091 358042 250456 186459 341399 399517 462259 484135 459324 346441
10188 346441 343623 405179 291517 206803 244791 324282 228500 205312 240548 328675 289529
10177 289529 157700 312403 394653 407925 516140 483167 400365 305525 271741 313286 440167
10166 440167 573386 488034 361916 291556 326608 401419 459427 362638 355728 311830 173742
10155 173742 263772 256307 229825 291340 330708 347670 297649 332586 319433 221108 83433
10144 83433 87703 205035 263259 285913 241511 201061 302188 379751 333224 184908 211154
10133 211154 213776 150325 132044 109265 149843 249970 284301 250892 303228 215280 282345
10122 282345 367401 340333 328486 374950 233043 223545 221922 109861 142431 139869 79702 79829
10110 79829 165519 329258 420089 353760 378575 372161 387753 401200 375622 252430 148893
10099 148893 298351 412500 529779 609111 638654 752951 714909 609506 532546 537813 549475
10088 549475 610360 624878 500391 479227 445153 564499 578297 409811 292477 343189 417157
10077 417157 383662 498688 521851 499512 662011 782673 880538 851761 787905 807976 793955
10066 793955 673611 539796 511741 544950 486632 463124 466495 534569 629868 744208 829831
10055 829831 825398 799711 907241 829588 766739 805604 808963 776364 825377 912033 943781 852638
10043 852638 756165 708734 605568 579821 591633 677407 766590 642452 635000 602459 563015
10032 563015 607059 582795 708384 884313 943453 960516 1016471 982739 950687 1037155 1070887
10021 1070887 1006947 770547 694371 838356 789100 726970 864509 884767 783609 817877
10011 817877 780310 781576 727496 501012 468188 672598 737871 789595 758799 733260 905100
10000 905100 792967 607428 605868 532503 616327 695323 660862 744007 687114 770138 816259
9989 816259 604977 550547 733159 889188 888780 866922 818701 896852 1030086 1039914 960806
9978 960806 879702 785340 781317 791771 859898 956817 1045065 1051487 1026412 1021750 1235059 1282856
9966 1282856 1323571 1507717 1586115 1548512 1704757 1933887 1885156 1889030 1927325 2079374 2403676
9955 2403676 2726822 3124184 3392687 3762109 4361477 5237102 6323365 7676608 9284737
9946 9284737 11118010 12970236 14647046 16026819 17015882 17868886 18369609 18686649 19014921
9937 19014921 18609920 17667772 16028215 14273311 12598658 11288516 10533713 10271905 10593102
9928 10593102 11063386 12067987 13686357 15835827 18471793 21593334 24951379 28402884
9920 28402884 31224388 33057569 34251174 35104758 35743545 36102964 35930597 34915816 32524852
9911 32524852 29160457 25355922 21819295 18671046 16238394 14778666 14130568 14236355
9903 14236355 15051797 16429283 18446002 21224118 24409271 27647442 30324070 32177648
9895 32177648 33554074 34417401 34933517 35426475 35888149 35691704 34420804 31848029 28322570
9886 28322570 24330001 20711558 17884311 15853533 14789488 14494038 14829696 15780640 17522869
9877 17522869 19930539 22805610 25833908 28636616 30905297 32329513 33441460 34548185
9869 34548185 35855306 37264786 38641890 39505889 39427684 38751461 37881571 37332232 37480947
9860 37480947 38410146 39889880 41266498 42118371 42488780 42937257 43425583 43999885 44948616
9851 44948616 45824912 46155101 45559246 43984875 41857225 39755604 38233068 37592047 37522299
9842 37522299 38039629 39002924 40597292 43272752 46979034 51612253 56534516 61116175
9834 61116175 64731072 66760614 67251257 66308975 64877621 63444751 62122211 60245414
9826 60245414 57071466 52533507 46988784 41248518 36088593 31993729 29304630 27886766
9818 27886766 27852186 29436877 32634227 37269162 43288280 50270767 57234455 62988023
9810 62988023 66635201 68106670 67898625 67081122 66037042 64633449 62662764 59826549
9802 59826549 55607356 49990866 43917349 38177942 33244498 29697760 27699288 26915929
9794 26915929 27314435 29062433 32325907 36973541 42907564 49497927 55653486 60509034
9786 60509034 63733409 65260526 65581386 65137545 64159217 62618562 60066780 56212831 50833160
9777 50833160 44528987 38182660 32547996 27955269 24545846 22107720 20414521 19484550
9769 19484550 19548773 20479290 22198728 24449213 27280390 30196559 32473488 33492549 33703777
9760 33703777 33369660 32617556 31713812 30500896 28558669 25940947 22823651 19529370 16413364
9751 16413364 13723034 11537466 9748688 8197065 6866000 5779218 4961109 4409321
9743 4409321 3997609 3610018 3369567 3263090 2975819 2752490 2711020 2614637 2494165 2446321
9733 2446321 2459529 2283819 2126492 1988159 1880917 1787210 1624986 1604765 1664258 1781379
9723 1781379 1779402 1707083 1759910 1782729 1798320 1826271 1790217 1681686 1648291 1712238 1779413
9712 1779413 1748677 1757371 1877698 2052982 2229343 2383708 2530010 2778076 3036428 3238838
9702 3238838 3655590 3997696 4340348 4681190 5094233 5755879 6641738 7703393 8966523
9693 8966523 10567532 12444165 14732578 17594245 21264061 25461202 29676764 33261998
9685 33261998 35735864 36918330 36814248 36044953 35001226 33331162 30688191 27336017
9677 27336017 23882689 20893506 18684408 17196804 16395439 16272772 16943185 18083425 19831506
9668 19831506 22288698 25376921 28897547 32466636 35648643 38199821 39682586 40292290
9660 40292290 40147002 39647956 39283369 38591217 36902154 34409436 31810244 29667919 28703511
9651 28703511 29240086 31122693 34513606 39030405 44564526 50842862 57322071 63040254
9643 63040254 67485246 70473756 71880144 71802993 70287522 66937001 61470560 54820221
9635 54820221 47851829 41528560 36406741 32687516 30480157 29868731 30601538 32696025
9627 32696025 36020083 40399415 45737067 51459285 56958716 61700984 65335026 67902075
9619 67902075 69717793 70604689 70329558 68793116 65665646 60800698 54695623 48092995
9611 48092995 41829719 36996838 33691213 32215954 32600910 34428663 37264293 40875547
9603 40875547 44744939 48265575 51310992 53660500 55243454 55703702 54832943 52502493
9595 52502493 49120012 45168134 40720007 36308551 32324496 28951939 26349586 24482558
9587 24482558 23742179 23997813 25560648 28086013 31203260 34950950 38592454 42054342
9579 42054342 45097322 47598156 49886312 51432718 52086950 51257860 49107947 45662171
9571 45662171 41325894 36545567 31967808 28113278 25256096 23126299 22086797 22317106
9563 22317106 23724216 26068617 29258469 32807139 36218168 38642133 39666337 39646349
9555 39646349 38928245 37654109 36045233 34292108 32114726 29582277 26514843 23274637
9547 23274637 20364429 18194263 16536655 15578447 15443469 16009475 17465205 19557841 22374917
9538 22374917 25938760 29672032 33098153 35586899 36901257 37132509 36495583 35167517
9530 35167517 33244471 30601680 27430216 24033057 20755622 18087804 16095161 14687532
9522 14687532 13940329 13922347 14619265 15926119 17658204 19129052 20167295 20506966 20472615
9513 20472615 20460797 20434806 20022524 19036557 17652190 15918166 14039185 12168093 10599882
9504 10599882 9306252 8533415 8037300 7817557 8034361 8498635 9289648 10671706 12458066
9495 12458066 14399557 16103044 17371260 17988993 18188360 18192898 17856258 17128589 15610187
9486 15610187 13634619 11563323 9548861 7873965 6474376 5285390 4431386 3817289
9478 3817289 3149708 2610706 2340706 2257634 2135765 1868403 1715634 1598843 1482472 1337519
9468 1337519 1384412 1268921 1240351 1201479 1011925 913769 798692 662588 794492 927457
9458 927457 910248 882566 795498 688539 747802 921049 758976 639856 725206 695796 554161
9447 554161 680380 783707 858072 870298 719171 567656 554550 623120 652979 545613 497484
9436 497484 481194 505689 482944 428315 469230 531290 381511 481027 560894 555630 544587 678152
9424 678152 773302 741372 648145 682784 640055 647814 699422 677842 493128 460284 362807 428326
9412 428326 382087 389487 434123 304558 433058 486337 531344 340247 147878 223841 312199
9401 312199 488701 486901 505016 490330 533927 491279 560492 606862 610643 430760 337238 239848
9389 239848 237255 366165 412349 310173 337413 404532 511278 573449 547558 568224 544011
9378 544011 534689 569852 631541 674967 592862 539374 549023 469092 252253 135668 295067
9367 295067 332568 394111 407376 357505 231504 190277 191013 289961 337508 430934 416090 277929
9355 277929 192331 292639 389289 372717 299566 343895 450396 274464 147140 164577 360948
9344 360948 474731 485139 345751 133381 97744 184893 94520 25062 -38455 28942 -17279
9333 -17279 10050 -8885 39666 5887 26529 132117 138562 22143 158366 311521 236403
9322 236403 16161 55104 227140 333072 281713 406651 408147 257774 139170 114895 72220
9311 72220 317238 309023 248938 319372 250659 155420 181874 360032 378637 407459 313610 289438
9299 289438 340686 293510 219849 185946 339529 364985 364801 332231 411308 432434 367951 372385
9287 372385 379950 409157 308807 314692 298182 417736 428759 450796 461335 573400 624931
9276 624931 475483 386549 446037 585896 532083 575689 694528 723477 675449 566585 565367
9265 565367 549999 548008 594442 452410 361069 339320 322759 416122 467780 531833 549699 670882
9253 670882 844108 874197 688969 519555 381064 392178 578429 713815 758377 759769 770571
9242 770571 891744 838006 736220 766609 892885 788792 632562 626402 732792 821708 751623
9231 751623 780896 746084 813356 829277 731593 743166 786243 891654 1013125 1076824 1145195
9220 1145195 1162415 1050108 888411 780201 825415 870075 894901 1018948 1062605 1045206 1053913
9209 1053913 1120590 1071187 1055551 1063696 1091420 1120676 1128295 1117426 1250818 1303948 1251240 1284915
9197 1284915 1171476 1144222 1146969 1260921 1222394 1273678 1356553 1531022 1603435 1554374 1568303
9186 1568303 1676537 1725298 1598120 1579296 1609343 1674154 1736763 1750370 1662240 1629663 1642817
9175 1642817 1658413 1775461 1911351 1868264 1948970 2218732 2476609 2466107 2426987 2541118
9165 2541118 2685889 2664264 2663671 2766251 2806537 2856206 2884475 2936679 3063927 2949971 3045124
9154 3045124 3151975 3220857 3212553 3265984 3482079 3743693 3792563 3974651 4216531 4281650 4318090
9143 4318090 4309775 4666941 5028021 5126852 5128401 5175014 5300671 5627134 5919982 6089844 6182597
9132 6182597 6318587 6539955 6671761 6822154 7166907 7521094 7856631 8140810 8568073 8829341
9122 8829341 9071383 9328413 9578738 9814684 10054223 10381335 10469442 10458686 10733609 10919939
9112 10919939 10914831 10908204 10895649 10871961 10894095 10925977 10855046 10829497 10874165 10824585 10677374
9101 10677374 10537217 10192152 9884974 9621090 9406012 9151627 8806784 8493963 8206210
9092 8206210 8058497 7689764 7446992 7336202 7285457 7050645 6762999 6386089 6114935 6053717
9082 6053717 5825109 5550042 5301241 5221041 5057422 4904547 4805408 4684874 4368348 4116411
9072 4116411 3924373 3809328 3777766 3667513 3563954 3277679 3148052 2987927 2838567 2768972
9062 2768972 2695475 2581610 2703818 2697734 2634454 2450638 2359901 2311671 2152518 2115748 2079148
9051 2079148 1922772 1900705 1884323 1845925 1796065 1822407 1765851 1616723 1595689 1639650 1637993
9040 1637993 1519799 1482226 1411534 1421076 1322250 1346860 1218588 1142082 1218129 1181476 1071433
9029 1071433 1032915 960418 869024 961191 1044351 1092910 1059432 959538 889416 755658 662792
9018 662792 625837 682762 769729 843902 942126 978382 873849 791884 758553 639157 472746
9007 472746 490031 477446 564317 568006 625274 781926 783290 743105 627712 662252 706620 724542
8995 724542 665787 625812 632678 698244 614207 527023 568370 546673 523500 644182 511816
$$ [...]
##END NTUPLES=NMR SPECTRUM
##END=
